##TITLE=Analysis number 315638
Compound Code mo 01211
Project Code adrs
Chemist Name stores
##JCAMPDX= 6.0         $$ Bruker NMR JCAMP-DX V2.0
##DATA TYPE= NMR SPECTRUM
##DATA CLASS= NTUPLES
##ORIGIN= Bruker BioSpin GmbH
##OWNER= NMR
$$ XWIN-NMR		Version 3.5
$$ Fri Nov 25 10:43:09 2005 GMT Standard Time (UT+0h)  MAYBRIDGE\NMR@NMR_250MHZ
##.OBSERVE FREQUENCY= 250.131544655141
##.OBSERVE NUCLEUS= ^1H
##.ACQUISITION MODE= SIMULTANEOUS (DQD)
##.ACQUISITION SCHEME= undefined
##.AVERAGES= 16
##.DIGITISER RES= 18
##SPECTROMETER/DATA SYSTEM= dpx250
##.PULSE SEQUENCE= zg30
##.SOLVENT NAME= DMSO
##.SHIFT REFERENCE= (INTERNAL, DMSO, 0, 16.522)
##AUDIT TRAIL= $$ (NUMBER, WHEN, WHO, WHERE, WHAT)
$$ ##TITLE= Audit trail, XWIN-NMR		Version 3.5
$$ ##JCAMPDX= 5.01
$$ ##ORIGIN= Bruker BioSpin GmbH
$$ ##OWNER= NMR
$$ C:\u/data/dgb/nmr/ADRS/13080/pdata/1/auditp.txt
$$ ##AUDIT TRAIL=  $$ (NUMBER, WHEN, WHO, WHERE, WHAT)
(   1,<2005-11-25 10:42:17.45 +000>,<MAYBRIDGE\NMR>,<NMR_250MHZ>,
      <created by zg, POWCHK disabled, PULCHK disabled
       configuration hash MD5:
       62 19 C7 07 E1 42 D1 B7 37 6C 3D D0 77 39 F9 E6
       data hash MD5: 64K
       8D 97 B3 6C 2E 58 49 BF C9 40 3D C4 56 00 7C 35>)
(   2,<2005-11-25 10:42:38.31 +000>,<MAYBRIDGE\NMR>,<NMR_250MHZ>,
      <Start of raw data processing
       ef LB = 0.3 FT_mod = 6 PKNL = 1 SI = 32K 
       data hash MD5: 32K
       25 86 87 CE 92 67 07 7B 9E 96 7F 1F CC D4 2F F0>)
(   3,<2005-11-25 10:42:41.95 +000>,<MAYBRIDGE\NMR>,<NMR_250MHZ>,
      <apk 
       data hash MD5: 32K
       93 15 F4 33 6B 69 82 45 DD 6F C7 5E 33 D6 17 D2>)
(   4,<2005-11-25 10:42:43.46 +000>,<MAYBRIDGE\NMR>,<NMR_250MHZ>,
      <abs ABSG = 5 
       data hash MD5: 32K
       6A 2B 12 0C A5 FB AA 81 F5 AF B8 C8 2C 02 5E C4>)
$$ ##END=
$$ 
$$ hash MD5
$$ CF 82 A1 B5 93 35 25 B1 04 6E 04 EF 04 4A A7 5F
##$RELAX= 
##$RELAX= 
##$RELAX= 
##$RELAX= 
##$RELAX= 
##$RELAX= 
##$RELAX= 
$$ Bruker specific parameters
$$ --------------------------
##$DU= <C:\u>
##$EXPNO= 13080
##$NAME= <ADRS>
##$PROCNO= 1
##$TYPE= <nmr>
##$USER= <dgb>
##$AMP= (0..31)
100 100 100 100 100 100 100 100 100 100 100 100 100 100 100 100 100 100 
100 100 100 100 100 100 100 100 100 100 100 100 100 100 
##$AQSEQ= 0
##$AQ_mod= 3
##$AUNM= <au_zg>
##$AUTOPOS= <5 >
##$BF1= 250.13
##$BF2= 250.13
##$BF3= 250.13
##$BF4= 250.13
##$BF5= 500.13
##$BF6= 500.13
##$BF7= 500.13
##$BF8= 500.13
##$BYTORDA= 1
##$CFDGTYP= 0
##$CFRGTYP= 5
##$CHEMSTR= <none>
##$CNST= (0..31)
1 1 145 1 1 1 1 1 1 1 1 1 1 1 1 1 1 1 1 1 1 1 1 1 1 1 1 1 1 1 1 1 
##$CPDPRG= <>
##$CPDPRG1= <>
##$CPDPRG2= <>
##$CPDPRG3= <>
##$CPDPRG4= <mlev>
##$CPDPRG5= <mlev>
##$CPDPRG6= <mlev>
##$CPDPRG7= <mlev>
##$CPDPRG8= <mlev>
##$CPDPRGB= <>
##$CPDPRGT= <>
##$D= (0..31)
0 1 0 0 0 0 0 0 0 0.06 0 0 0 0 0 0 0.0002 0 0 0 0 0 0 0 0 0 0 0 0 0 0 
0 
##$DATE= 1132915335
##$DBL= (0..7)
120 120 120 120 120 120 120 120 
##$DBP= (0..7)
150 150 150 150 150 150 150 150 
##$DBP07= 0
##$DBPNAM0= <>
##$DBPNAM1= <>
##$DBPNAM2= <>
$$ [...]
##$SUBNAM6= <"">
##$SUBNAM7= <"">
##$SUBNAM8= <"">
##$SUBNAM9= <"">
##$SW= 20.6930455092707
##$SWIBOX= (0..15)
0 0 3 0 0 0 0 0 0 0 0 0 0 0 0 0 
##$SW_h= 5175.983436853
##$TD= 65536
##$TD0= 1
##$TE= 294.16
##$TE2= 300
##$TE3= 300
##$TEG= 300
##$TL= (0..7)
0 120 120 120 120 120 120 120 
##$TP= (0..7)
150 150 150 150 150 150 150 150 
##$TP07= 0
##$TPNAME0= <>
##$TPNAME1= <>
##$TPNAME2= <>
##$TPNAME3= <>
##$TPNAME4= <>
##$TPNAME5= <>
##$TPNAME6= <>
##$TPNAME7= <>
##$TPOAL= (0..7)
0.5 0.5 0.5 0.5 0.5 0.5 0.5 0.5 
##$TPOFFS= (0..7)
0 0 0 0 0 0 0 0 
##$TUNHIN= 0
##$TUNHOUT= 0
##$TUNXOUT= 0
##$USERA1= <user>
##$USERA2= <user>
##$USERA3= <user>
##$USERA4= <user>
##$USERA5= <user>
##$V9= 5
##$VALIST= <valist>
##$VCLIST= <CCCCCCCCCCCCCCC>
##$VD= 0
##$VDLIST= <DDDDDDDDDDDDDDD>
##$VPLIST= <PPPPPPPPPPPPPPP>
##$VTLIST= <TTTTTTTTTTTTTTT>
##$WBST= 1024
##$WBSW= 4
##$XGAIN= (0..3)
0 0 0 0 
##$XL= 0
##$YL= 0
##$YMAX_a= 312108
##$YMIN_a= -435472
##$ZGOPTNS= <>
##$ZL1= 120
##$ZL2= 120
##$ZL3= 120
##$ZL4= 120
##$ABSF1= 16.522
##$ABSF2= -4.171173
##$ABSG= 5
##$ABSL= 3
##$ALPHA= 0
##$AQORDER= 0
##$ASSFAC= 0
##$ASSFACI= 0
##$ASSFACX= 0
##$ASSWID= 0
##$AUNMP= <proc_1d>
##$AZFE= 0.1
##$AZFW= 0.1
##$BCFW= 0
##$BC_mod= 0
##$BYTORDP= 0
##$COROFFS= 0
##$CY= 12.5
##$DATMOD= 1
##$DC= 0
##$DFILT= <>
##$DTYPP= 0
##$F1P= 14.0000005364418
##$F2P= -0.99999901652339
##$FCOR= 0.5
##$FTSIZE= 32768
##$FT_mod= 6
##$GAMMA= 0
##$GB= 0
##$INTBC= 1
##$INTSCL= 1
##$ISEN= 128
##$LB= 0.3
##$LEV0= 0
##$LPBIN= 0
##$MAXI= 10000
##$MC2= 0
##$MEAN= 0
##$ME_mod= 0
##$MI= 0
##$NCOEF= 0
##$NC_proc= -4
##$NLEV= 6
##$NOISF1= 0
##$NOISF2= 0
##$NSP= 0
##$NTH_PI= 0
##$NZP= 0
##$OFFSET= 16.522
##$PC= 1
##$PHC0= 75.25515
##$PHC1= 12.9417
##$PH_mod= 1
##$PKNL= yes
##$PPARMOD= 0
##$PSCAL= 4
##$PSIGN= 0
##$REVERSE= no
##$SF= 250.13
##$SI= 32768
##$SIGF1= 0
##$SIGF2= 0
##$SINO= 400
##$SIOLD= 32768
##$SREGLST= <1H.DMSO>
##$SSB= 0
##$STSI= 32768
##$STSR= 0
##$SW_p= 5175.98343685301
##$SYMM= 0
##$S_DEV= 0
##$TDeff= 65536
##$TDoff= 0
##$TI= <Analysis number 999999
Compound Code 99
Book Reference 9
Project Code 9>
##$TILT= no
##$TM1= 0
##$TM2= 0
##$TOPLEV= 0
##$USERP1= <user>
##$USERP2= <user>
##$USERP3= <user>
##$USERP4= <user>
##$USERP5= <user>
##$WDW= 1
##$XDIM= 32768
##$YMAX_p= 309117589
##$YMIN_p= -436374
$$ End of Bruker specific parameters
$$ ---------------------------------
##NTUPLES= NMR SPECTRUM
##VAR_NAME=  FREQUENCY,     SPECTRUM/REAL,   SPECTRUM/IMAG
##SYMBOL=    X,             R,               I
##VAR_TYPE=  INDEPENDENT,   DEPENDENT,       DEPENDENT
##VAR_FORM=  AFFN,          ASDF,            ASDF
##VAR_DIM=   32768,         32768,           32768
##UNITS=     HZ,            ARBITRARY UNITS, ARBITRARY UNITS
##FACTOR=    0.157963299565203, 1,           1
##FIRST=     4132.6476996994, 0,             0
##LAST=      -1043.33573715361, 0,           0
##MIN=       -1043.33573715361, -436374,     0
##MAX=       4132.6476996994, 309117589,     0
$$ Real data points
##PAGE= N=1
##DATA TABLE= (X++(R..R)), XYDATA
$$ [...]
24366b6809m5857Q582R069P0896l3012Q7800N9875q1420q7362L2473O0757n8683
24354c691o6235J7147K8523L4968k659q8905j08857k4145O9927M2092M2L3288
24342f8505Q6351L5032Q6360K3654j13638r8966K505O0356J7820p167q585m6080
24330c0863l4381J9685M436K5195K2384m387O4174J3251n7498m0913L9747O0571
24318H1401j22977l499N6231k7944p3163p7269P0093R4679o3902m2992J5347o678
24306a00673P5827N9459j4488p1631j1222M9835K0591k5403L4610j8030Q645n5164
24294d7644o3549J12683J5085p7105M0825L673o8126N6978N7349q7655O8133k7497
24282a6850k3698m848k4552q321K0473M7335q1418k5166j0756P8982q860J3324
$$ y = [-26809, -72666, -64084, -55015, 15881, -17131, 70669, 130544, 49124, -38238, -5765, 54992, -3691, -69926, -52779, -24256, 10712, 8053, -80852, -189709, -213854, -143927, -101835, -101793, -68505, 17846, 52878, 139238, 162892, 49254, -49712, -47207, 13149, 30969, 23802, 15217, -30863, -65244, -45559, -41123, -15928, 6456, 2069, 66243, 79494, 21996, -18917, 20830, 81401, -41576, -45075, 11156, -16788, -89951, -167220, -97127, -2448, -66350, -109342, -93995, -100673, -24846, 34613, 20125, -51506, -62728, -12893, 7698, -17705, 16905, -1125, 7520, -47644, -111193, 1490, 16575, -60530, -19705, -16032, -84158, -27180, 30169, -57486, 10647, -16850, -40548, -45396, -69948, -78269, -57796, -10461, -91879, -117045, -127801, -48819, -57679, -44355]
24270d4355k2682o0319n3962P9599Q7662l4508n3368O3052J1613K1682M9988M2474
24258H6876j11921m8416m839K239M5525J8721j7548n4669r2957J39917Q9295j0876
24246D1347j40092J0013P6515j21771J22162Q7062K0805k0124R1657M3516o4363
24235A46727n9143j53227K8960l6157P3730N0052j6008j06523r3455L9472L8374
24224h7198J3908J4770j9623M8777n041m3164n3556J00151L8374P504k9482k9706
24212d4286J22101m7486q8824J7231P2973l3188j5463O6026p862n9444k8566l1746
24200g8534l8389q9605O2256Q625J0707J13858O1625M3480L8501n7316N6088k0569
24188A10727k5865K14884o1567j11206k6062M1970J03232q9265q5261K4758o372
$$ y = [-44355, -67037, -127356, -181318, -101719, -14057, -48565, -101933, -38881, -27268, -5586, 44402, 86876, -25045, -73461, -78300, -76061, -30536, -11815, -29363, -84032, -176989, -37072, 52223, 41347, -98745, -88732, -12217, -133988, -11826, 75236, 96041, 75917, 167574, 211090, 146727, 87584, -65643, -36683, -72840, 890, 50942, 34934, -71589, -165044, -125572, -87198, -73290, -58520, -78143, -29366, -34407, -77571, -131127, -30976, 7398, 14902, -14580, -44286, 77815, 30329, -58495, -41264, 31709, -1479, -16942, 49084, 41222, -18222, -46788, -78534, -116923, -206528, -144272, -135647, -124940, -11082, 50543, 94023, 132524, 75208, 131296, 110727, 84862, 299746, 238179, 126973, 100911, 142881, 246113, 156848, 71587, 96345, 89973]
24177H9973k4069m666n521p2786O9814q9272r9148p848O893K7907N0566n6731
24165a14888q213J09050J14092P1397k5907q5796j41129M4603N9729P5464R6447
24154A94849L666q248M1364r9569j24546n7466j7185N832O5979O4877Q0931L7002
24142A87486K7629p5827j00278l288J2637j0923n7921J3960J7133J7570j0861
24131A7317j1712l6302N213l0155N2722J7153p8501N1569O4381j33485r0902m8497
24119b21199O5983K4924P0023m6928l7918O5156J8464K8794L8942q5057k7479
24108a06295P1243K262L9294O903P3873R7947K6434r1743p6397r0803m4272J6067
24096g5487M8634L6425j9790n6007p4547q2178J17600K1315M6549J14128k917
$$ y = [89973, 65904, 61238, 55717, -17069, 52745, -36527, -135675, -143523, -136630, -108723, -58157, -114888, -123101, -14051, 100041, 171438, 145531, 59735, -81394, -36791, 22938, 98402, 194849, 198515, 190267, 231631, 132062, 7516, -49950, -67135, -61303, 4676, 69553, 150484, 187486, 215115, 139288, 39010, 35722, 48359, 37436, -20485, -6525, 10608, 28178, 17317, 5605, -30697, -25484, -55639, -2917, 14236, -64265, -12696, 51685, -81800, -172702, -221199, -155216, -130292, -60269, -107197, -145115, -79959, -61495, -32701, 6241, -78816, -106295, -35052, -32790, 6504, 13407, 87280, 185227, 211661, 119918, 43521, -47282, -91554, -75487, -26853, 9572, -10218, -66225, -140772, -222950, -105350, -84035, -37486, 76642, 73725]
24085G3725j04615k3511l722l392P5935O7185L864j8006N5339O1442r6623P406
24073I5027k4751p6424j04605J7164J522L2990K2449k6471n9230Q2237P6223n8951
24061b2820m6358L3159L9605R4649J11956j16662m0331n772Q3926J5049k2145
24050A24256r9951p8427O7087l7249J0025J5085j6140j04374m9925R2740N0491
24039b6382R858J1486N1685k1057j05652j0291M3563M566o9450K9227q861Q1560
24027i748P8995L161q7604R826k4161n12R8712o9213j65757j62644M7755J39900
24015a41290M4233m8751j7768R9693J33321O2044k1396L0237K6491j12303j5435
24004C9076l5721n5942m9216k3848J02878J07420j4911K470k4894r7063M1450
$$ y = [73725, -30890, -54401, -58123, -61515, 14420, 81605, 85469, 67463, 122802, 184244, 87621, 95027, 70276, -6148, -110753, -93589, -92067, -59077, -36628, -63099, -122329, -40092, 36131, -22820, -69178, -36019, 3586, 98235, 210191, 93529, 53198, 47426, 131352, 146401, 124256, 24305, -54122, 12965, -24284, -14259, 826, -15314, -119688, -169613, -76873, -26382, -16524, -5038, 46647, 25590, -80062, -90353, -46790, -42224, -111674, -82447, -91308, -9748, 69247, 72408, -15196, -5370, -29531, -30043, 68669, -544, -166301, -328945, -281190, -141290, -97057, -145808, -163576, -63883, 69438, 131482, 110086, 140323, 166814, 54511, 39076, 3355, -52587, -101803, -125651, -22773, 84647, 69736, 72206, 47312, -49751, -8301]
23993h301M9083j07655q7699P2415N1506l1358J3790q6014k729O0113N5678J0182
23981a0989o552m285k2097p405j3784O5994m6265j4185R848J7100l3332L413j9433
23968h1972P3669L8450k6869p5031K398K6430K7773Q9014K9167o3446l8984j5852
23956a5253L1481J0693K2348l251m605J8070L7933l0409Q8346n8860r6932M4105
23944D3666n4024r7625l1953N3206J45186N7158n7469r000N2748o3571p3960j7481
23932e3119k7370O4134M4805n5015k7911n0690L7114K7355q035L4009K0381k3004
23920a7346m7092R944O3980P0910n4437o7673K6445L6550o025j8629k0876o8830
23908i3079j7029M4201K7178N5189L1242j7105p1506N6678P3238N8320j337l0284
$$ y = [-8301, 40782, -66873, -154572, -82157, -30651, -62009, -48219, -134233, -136962, -76849, -21171, -10989, -17541, -21826, -43923, -51328, -65112, 882, -45383, -59568, -49720, -32620, -65952, -62539, -81972, -8303, 30147, 3278, -71753, -69355, -42925, -15152, 73862, 103029, 39583, 599, -15253, 16228, 26921, 49269, 46018, 41413, 59483, 97416, 67007, 155353, 96493, -439, 43666, -10358, -107983, -139936, -86730, 58456, 115614, 58145, 49145, 101893, 38322, -35638, -53119, -80489, -16355, 28450, -26565, -54476, -105166, -68052, -40697, -48732, -14723, 5658, -17346, -64438, -54494, 9486, 80396, 25959, -41714, -15269, 21281, 15256, -3373, -24249, -93079, -110108, -65907, -38729, 16460, 47702, 30597, -40909, 15769, 89007, 147327, 145990, 115706]
23896A15706r0002q3028N8711L1067o2279q8944k017m6967K8881M7141P249p1565
23884a56047K9274R1258Q2600j637n6550n5724Q5932K5982R1935m696p9081l0999
23872B2247l4483n0015O0351K4946K1536Q4147n9420p9410J1315n9170O074J02535
23860E0653Q1021m345p6228j01483l8187p8376o1963P0285j0774l7680k4838r0257
23848c22172M4472O8928q546m4194M4093J36202L4813N8213P5353k8995O5175
23837A23342P0844o4777p9677p3438O800L8431m7366j2128m0610k0662m3641L0766
23825a12116R637O8144q5815l8166k3202Q9946N3685P2391N6962M6365m7288j9120
23813G1423j713J3021M9242r842o5535o1896K9746Jo567p1177l9014M8182N5269
$$ y = [115706, 25704, -57324, 1387, 32454, -29825, -118769, -120786, -167753, -138872, -91731, -84482, -156047, -126773, -35515, 47085, 45448, -11102, -66826, 19106, 45088, 137023, 132327, 53246, 22247, -12236, -62251, -1900, 23046, 44582, 128729, 69309, -10101, 1214, -57956, -51882, 50653, 131674, 127329, 51101, -50382, -88569, -166945, -228908, -158623, -169397, -207077, -231915, -322172, -277700, -208772, -217318, -261512, -217419, -81217, -46404, 11809, 87162, 58167, 123342, 194186, 129409, 49732, -23706, -16906, 21525, -25841, -37969, -78579, -99241, -142882, -112116, -102479, -34335, -120150, -158316, -181518, -91572, -37887, 34504, 91466, 137831, 90543, 71423, 69710, 82731, 131973, 122131, 56596, -5300, 24446, 24447, 17880, -53297, -92311, -44129, 11140]
23800A1140o3676l7741q403m7532L143R0371L8104L4543J1604j9511l2219k5019
23788d5196R5314M7319K1803O9557m7424o8155J5567q743j31109k9122R0600K0311
23776C0722o1790m4521J9134n149o7646N3878K8026P0882O1556p4939m0537N597
23764b4787p4194j8285N5561j0084j0678J17960K0483q9675l850K1462K1323Q741
23752A3977N159l4824l2757j3558l5616K3552N1836o1681R8898k5094p1644L0801
23740e0951N0894M0875l3327m3p3160L1505O9056L7184p6373M4770R3654q3825
23728E0259L2010Q4544P6599j76027j61675R322Q600R425k3585l0683k8394K6931
23716a22674q145L5819O5137r053N2940m110p7306k280P4611L5422j63852o8860
$$ y = [11140, -52536, -90277, -98680, -146212, -143069, -52698, -14594, 19949, 31553, 12042, -20177, -45196, 50118, 97437, 119240, 188797, 141373, 73218, 88785, 80042, -51067, -80189, 10411, 30722, -31068, -75589, -56455, -61604, -129250, -75372, -47346, 23536, 85092, 10153, -30384, -24787, -98981, -117266, -61705, -71789, -82467, 35493, 55976, -33699, -37549, -16087, 5236, 13977, 19136, -15688, -48445, -62003, -97619, -74067, -22231, -83912, 14986, -10108, -81752, -50951, -57, 40818, 7491, 7448, -65712, -34207, 34849, 72033, -4340, 40430, 134084, 50259, 82269, 166813, 243412, 67385, -94290, -84968, -76368, -66943, -90528, -121211, -149605, -122674, -130819, -95000, -29863, -38916, 14024, 9914, -67392, -69672, 4939, 40361, -123491, -192351]
23704a92351R3384M865N5646k411J16311o2900m1952L5805L5958L7298j33207
23693e3554r863Q6807O6833K6509k384o5530n2311j9918o4955j31192L0032M8457
23681a41069J2146L0502L4529N9392M398q3233K3651j0204N0682L1416n6001m8152
23669i1943o0620J69245P9273k2915N0179L7930l6054j26093o1830o0489J00862
23658b2455L1276Q6965j8518n6929L7277N2719m1441j16568m5266m1063L030O8807
23646f2166O82j21940k551Q0862m7312r9992J7844O3753q126j0558M0162M7961
23634a01381n9613l8225J8737J4118r786j0739L6092k9550R9431K6625r187l8694
23622a02172k0795M6697N4540R1447N5535p8883j01894q6451p8182L2489J03246
$$ y = [-192351, -98967, -94102, -38456, -40867, 75444, 12544, -29408, 6397, 42355, 79653, -53554, -63417, 23390, 90223, 116732, 114348, 48818, -3493, -23411, -88366, -219558, -189526, -141069, -128923, -98421, -63892, -4500, -102, -83335, -59684, -69888, -19206, 12210, -43791, -91943, -152563, 16682, 95955, 73040, 123219, 161149, 125095, -998, -62828, -123317, -22455, 8821, 95786, 77268, 20339, 57616, 110335, 68894, -47674, -92940, -134003, -130973, -62166, -61484, -183424, -185975, -105113, -152425, -252417, -234573, -170820, -178946, -189504, -149342, -101381, -160994, -199219, -180482, -166364, -176150, -186889, -150797, -180347, -80916, -54291, -63478, -102172, -122967, -76270, -21730, 69717, 125252, 46369, -55525, -141976, -220158, -187669, -84423]
23611h4423k4845p0982K7038J07567Q2745k4842m7853M883o3050l9591Q1986J05822
23599E4455K0014k2697q0863r5725m3986P9772J90409Q4590k1157q4693l3404
23588D6715K64L0613O7038r9497r8427k1198j4800l7307J9161M6647l3570Q5535
23576h826N7707l7559R955l4374J1522l4992n5985o787J16189J02255M810r451
23564A14464p5392r3604K1452O0503p0959Q2732M6391p0592j33363R505J24523
23553A5660P3617j14524o488P2120N8893O998n7644q4721K5657j2216j3818K0451
23541a6015K888L2244o4022o1054P9635J13730q084j20972L7578k2396j17966
23530a44434K3776j2441k8984L5600O0885l0480o0769j1148o789N4134O1772m6899
$$ y = [-84423, -109268, -180250, -153212, -45645, 37100, 12258, -35595, -30712, -93762, -133353, -51367, 54455, 74469, 51772, -29091, -124816, -168802, -89030, 101379, 185969, 164812, 80119, 46715, 46979, 77592, 144630, 45133, -53294, -74492, -89292, -126599, -107438, -60791, -94361, -8826, 48881, 11322, 21277, -13097, -1575, -36567, -92552, -99339, 16850, 119105, 123915, 114464, 39072, -54532, -33080, 27423, -43536, 39196, 85587, 14995, -118368, -108863, 15660, 89277, -25247, -31735, 40385, 99278, 106276, 48632, -36089, -10432, -22648, -36466, -16015, -13127, 19117, -44905, -105959, -26324, 87406, 79322, -41650, -4072, -26468, -144434, -120658, -133099, -162083, -126483, -65598, -96078, -156847, -167995, -174784, -120650, -58878, -105777]
23518a05777j0901J7111j2299L6718K6815N2098J01917j9398K8837p6970j6688
23507B1463P0986N1125o8704p1247n2630j5113J9674R2293J4221J6589Q054m7681
23495C9030q7062j4673K4592k2064j5846M2376m2641P3756P1093n8911q3132m3671
23483a17153K013L3261l6757k1718J3793K0455N8816m8185l4632K2160J157J9833
23471h6957Q5994q0619n0684O734l6726N1566O7996O2411o2453N257J324l9091
23459g5248L1398Q5917J09047n6152o0953O3044l7265r8839o7814J1940P5742
23448a9183o7155n8574n6300p0319N7458J18432P3618l4973o6539m4402J6942
23437a50995L2250N1920m8909r0876p4818Q2377J37069n18K8490R4768r636n4760
$$ y = [-105777, -116678, -99567, -111866, -75148, -48333, 3765, 105682, 86284, 115121, 38151, 21463, 92449, 143574, 74870, 3623, -49007, -64120, -44446, 47847, 62068, 78657, 86711, 39030, -48032, -62705, -38113, -60177, -76023, -33647, -76288, -2532, 68561, 9650, -73482, -117153, -115140, -81879, -118636, -140354, -126561, -106106, -47290, -95475, -130107, -107947, -106790, -86957, -963, -81582, -132266, -125532, -162258, -110692, -42696, 19715, -42738, -37481, -36157, -75248, -43850, 42067, 151114, 94962, 34009, 97053, 59788, -39051, -106865, -94925, -19183, -86338, -144912, -201212, -271531, -214073, -95641, -22023, -56996, -123535, -167937, -150995, -118745, -66825, -115734, -206610, -281428, -199051, -61982, -62500, -34010, 60758, 51122, -3638]
23425c638q4123j6742k35K2977L2846r250n002o3076m977R3898L2591n5851R401
23412e1181O4875k3184k3301L5243O971r519l3989N708p5216q831J02810M7974
23400C8360p104l8643O3194k0665j21368N930O6245j4604K4934M3133l1858l7544
23388b9990n5929q7230L5477O3616M6193o2291O7760R6108L5259k2018l5595M3750
23376I5110l3144q9073j18375J0314J78856m1917n7852l6070J8991k5754M9467
23365d9447O7078o5677K4277J11674N8059n4203l4957l3006m7643p9244J214q6503
23353a88378J4228P803N9367R0013N3535j9731r8253K800k5329M9980M6974n5256
23341f2247l6050m5035j4308R152K9442P31L7463n2850l0893J30349M8543k9186
$$ y = [-3638, -87761, -104503, -104738, -81761, -48915, -58165, -63167, -126243, -131220, -37322, -4731, -60582, -51181, 13694, -9490, -32791, 2452, 9423, -96, -34085, -28377, -103593, -112424, -9614, 38360, 31256, -7387, 55807, 35142, -86226, -80296, -14051, -28655, -3721, 39412, 7554, -29990, -85919, -173149, -137672, -74056, -27863, -90154, -22394, 73714, 108973, 86955, 51360, 95110, 61966, -27107, -145482, -135168, 43688, 1771, -56081, -92151, -73160, -98914, -49447, 17631, -48046, -23769, 87905, 145964, 91761, 56804, 23798, -23845, -103089, -101875, -188378, -174150, -166347, -106980, -16967, 36568, 16837, -81416, -78616, -103945, -53965, -6991, -62247, -98297, -143332, -157640, -148488, -119046, -118315, -80852, -133702, -164595, -34246, 14297, -14889]
23329a4889N1966m2372m832J8540l4699m2246p4579j07180K2301Q8519P9183Q7122
23317B6834j9960p3311m548n4787J2191Q9115J06094M9560j285n8849k9883K0290
23305F1461Q950k3419q8420K6880q119m2913L6343j0443k2046N6371K1727l0837
23293a4465j8827p0176n2034l2434M8622p29J12948R5257l3443m0389O0893L8664
23281I3887n963K3901M892r8179j22189J9738J21804P0152M3913n0783j8219q7416
23269d462m9148J3421M9377k9361l479L1449p8986J6188J2333P1895P3713K6349
23257A29289o2917J7219j1222o2707O6283j6528l4350j5935N4048m8415k633K2612
23245C4744r0673L465n1120K7523L6079n3053q8665Q4215J36847J2634K373o2706
$$ y = [-14889, 37077, -5295, -10127, 8413, -26286, -68532, -143111, -250291, -227990, -139471, -60288, 26834, 6874, -66437, -70985, -125772, -113581, -24466, 81628, 131188, 129903, 71054, 41171, 61461, 70411, 46992, -41428, -14548, -22667, -65580, -29237, -39680, -61726, -5355, 16372, -14465, -33292, -103468, -155502, -187936, -139314, -140043, -27095, 68162, 34719, -5670, 55223, 93887, 87924, 111825, 116717, 18538, -103651, -83913, 37891, 108043, 151956, 101173, 82954, -4462, -53610, -40189, 9188, -20173, -23652, 7797, -71189, -55001, -42668, 29227, 102940, 129289, 66372, 83591, 72369, 9662, 75945, 59417, 25067, 9132, 63180, 14765, 12132, 34744, -55929, -52464, -103584, -76061, -39982, -93035, -181700, -97485, 39362, 51996, 54369, -8337]
23233h337M5417j9270q3980N3553j08133K272Q7464R4270j0019j9207n0014q1314
23221i7298j4063L2148R9665l766K8813L6181m6506L4866o9473R128M5239q9450
23209c4516l2787J00768L4345n4061j29409q8903k7409N2349J466L1442J6090
23198a30625P6676j7582k8731m2572r938m9861n967K282J610J11788P4367J2445
23186f108L3266j14158m9919J0967j4606k7455M3656J48361J0101o6345p2604
23175a04844k4777J0137M8014J6690J12080L2140j00952j04431m7869K6813J0986
23164a26013N2594R5228j03323k6741j3426K090N8928M6465M611J2718j3112K6923
23152A6942L0992J3610n113P6668l537j59464l9324M1501Q1810L0471j02222n131
$$ y = [-8337, 37080, 17810, -66170, -12617, -120750, -118478, -31014, 63256, 53237, 34030, -15984, -97298, -111361, -79213, 20452, 16686, 45499, 81680, 35174, 70040, 567, 9695, 54934, -34516, -67303, 33465, 67810, 13749, -115660, -204563, -231972, -179623, -178157, -146715, -130625, -53949, -71531, -100262, -142834, -152772, -202633, -208600, -206318, -204708, -92920, -18553, -6108, 27158, -87000, -136919, -125952, -140558, -168013, -124357, 24004, 34105, -32240, -104844, -129621, -119484, -71470, -54780, 57300, 89440, -11512, -115943, -163812, -136999, -126013, -73419, 21809, -81514, -108255, -121681, -119591, -60663, -14198, -9587, 3131, -9981, 16942, 47934, 61544, 56431, 133099, 129562, -29902, -69226, -27725, 54085, 84556, -17666, -22797]
23140b2797P5515J3880o3563L0099j9305K4274N2687l2662J506J4994M7942o5854
23128E6716O6895L567K2570l3115r6325q9833p292k0008n4157J30666M7739o3506
23116c6083n6960K0200J3966O2556M859p106q3714r2922R9782O8360p6047L5702
23104d7407N8226L2284o0548o3347N5030Q2009m387r8989O0795l2464l4042k2083
23092g4923Q7395J54135J7032j14314j40990N769J05763N4156K5758j02333n9439
23081d1991K0139n4926o337m7195O4631o8943r7428O1436J09547O6168P5498j11381
23069c0782m3353M3024j74850j5181J48707J25726o4578n1755M511K2771J05225
23058F9465k2276l1886o4903r4153L5163o6640l4971l4946P6344M8344K8456K2971
$$ y = [-22797, 52718, 66598, 3035, 33134, 13829, 38103, 90790, 58128, 59634, 74628, 122570, 56716, 123611, 127178, 149748, 116633, 20308, -69525, -76817, -96825, -150982, -20316, 27423, -36083, -93043, -72843, -58877, 3679, 8538, 1432, -82282, -175204, -75422, -7062, -83109, -47407, 10819, 43103, -17445, -80792, -25762, 56247, 51860, -47129, 13666, -18798, -52840, -74923, 12472, 166607, 183639, 69325, -71665, -65896, 39867, 94023, 119781, 17448, -41991, -21852, -76778, -83115, -130310, -65679, -134622, -232050, -170614, -61067, 5101, 80599, -30782, -74135, -31111, -205961, -221142, -72435, 53291, -11287, -63042, -58531, -35760, 69465, 47189, 15303, -49600, -143753, -108590, -175230, -210201, -245147, -168803, -120459, -92003, -69032]
23046f9032R9549p9334k4527n9758N3101L9174l0869Q8339J7k7604O6529q6149
23034c0564n0526P6792P1438m8874m1388K9928k4193p007l3522k4536L6820J01359
23022E5727o5509P848j1191n0952N4949L7240J4850L4759p3569o2046J311o3846
23010a20429L4095J6117N3977K288K8973N4399P9584l4154j59607j9397O2273
22999a881l1948M5180J756L1363p7446j4924k4235M902J15997N4252O2573m7732
22987A17857j00569j3418j6585J6044o1340m1141m6459P5569o035o0121j0936
22976a47134M8405L5903k9155O7003m872m9928R47M37j4965N2219L349m459j06919
22963a49169K3351N3626m9432j5455O4781j518P6108M5760M484k3431j27406n4794
$$ y = [-69032, 30517, -48817, -73344, -133102, -80001, -40827, -71696, 16643, 16660, -10944, 55585, -30564, -81090, -4298, 67140, 18266, -23122, 6806, -17387, -24394, -57916, -82452, -45632, 55727, -9782, -1934, -13125, -64077, -9128, 28112, 42962, 77721, 4152, -57894, -56583, -120429, -86334, -70217, -16240, -13952, 15021, 69420, 149004, 114850, -44757, -64154, -1881, -33829, 11351, 13107, 44470, -32976, -47900, -72135, -67233, 48764, 103016, 165589, 117857, 17288, 3870, -12715, 3329, -58011, -99152, -145611, -70042, -76077, -136198, -147134, -98729, -62826, -91981, -24978, -29850, -79778, -78831, -78394, -93359, -41140, -37791, -42250, -149169, -125818, -72192, -121624, -137079, -72298, -73816, 2292, 48052, 52536, 29105, -98301, -153095]
22951a53095l6898Q3251R9590L0879p4292q9609L5667Q2830m8324J8522O8348
22940A6869m6177o2155p0102M4003J06078R8915n1537J486l2772J01347M6432
22929A52387j07657o2441k7797k3083n3266N8590O9476j4345k6278m2046j7723
22918i4183K2600O3906L3710p0017J8294M6236m7522k0714m3585L4206K6608J6829
22906a3632M7985M5769o0437j61110n3968J77021O2459l6623R971J4437j4915
22895A6957l1742k3748j9904r19J5006r753K0838m0956J2927k042n1652N8934
22883e6054J26930r659k3224O4611L4144k6310l4468M9018J3803l4121n1823m4020
22871H827l4828n0412K535P1091P3805j30565j00766o0451P924J39095J39094
$$ y = [-153095, -189993, -106742, -7152, 23727, -50565, -140174, -104507, -21677, -70001, -51479, 16869, -29308, -91463, -161565, -117562, -11484, 87431, 35894, 37380, 4608, 105955, 152387, 44730, -17711, -45508, -68591, -121857, -63267, 6209, -8136, -34414, -76460, -94183, -71583, -7677, 26033, -43984, -25690, 20546, -26976, -47690, -91275, -57069, -30461, -13632, 34353, 80122, 19685, -141425, -195393, -18372, 44087, 7464, 17435, 31872, 16957, -14785, -38533, -58437, -59356, -44350, -54103, -33265, -74221, -61294, -63336, -114988, -56054, 70876, 61217, 37993, 102604, 136748, 110438, 75970, 124988, 138791, 104670, 52847, 8827, -26001, -76413, -73878, -2787, 71018, -59547, -160313, -220764, -212840, -73745, 65349]
22860F5349k8955n3103l8495J464n367L3204j7990m5557m9344O9446L0525J6059
22848b2764J8131J00902L140L3974k9128j20998L9963O4344o2801o1075L6879
22837E67n9614q786l2505N5247N6300Q4967q4687l5664J25653K6439l4967k2787
22825G0163k0731r9153j250O5188J7327o698r0678l7244L6006k6823k4710J1181
22813a07422o133J5304Q6575n3571L728P9629L6442K4755k6166p8911L0882N0058
22801E5170L9427m2436J0405J5929k0032p6894P4014o317J6145l3123J6726K824
22789E1838K336j08713j43563J3683O381o7052k9465j8232K4876J26493J0421
22778a30997l6101l519J00092m1275j42006p9773Q0435O9630K3038P4572O7543
$$ y = [65349, 36394, -16709, -55204, -53740, -59107, -25903, -43893, -89450, -138794, -69348, -38823, -22764, -4633, 96269, 99409, 133383, 104255, -16743, 23220, 87564, 24763, -36312, 567, -59047, -67833, -100338, -45091, 11209, 96176, 11489, -24175, 101478, 127917, 92950, 70163, 49432, -49721, -50971, 14217, 31544, 24846, -65832, -103076, -67070, -93893, -118603, -107422, -113555, -98251, -11676, -65247, -61519, 18110, 54552, 79307, 53141, -25770, 5112, 55170, 94597, 52161, 62566, 78495, 58463, -18431, 55583, 49266, 65411, 32288, 49014, 51838, 54174, -54539, -198102, -184419, -178038, -245090, -274555, -292787, -267911, -141418, -130997, -167098, -170617, -70525, -111800, -253806, -333579, -253144, -183514, -160476, -85904, -18361]
22767a8361n158l4376q3002N6293J9661O5333L8619j02079j3768P3660M8277M938
22755E0037r6434m3289k2027J2833r2938j01816J23913R7453l1424o5796q9071
22744b58559j7679R8113K2395J6795N3981k0820m3411K2891P8938Q6017J5962
22733E4623l3436R0663K276r0509o6863L8442P2321J7038l7675j18463m9696J2845
22721a08434K9015M8829Q0007O8198K4803n3061k8166R8150j258l7803j396L8269
22709A57153m1008m6565p5919O84m4804L3995N2652Q6499j8706q3190l7342q4905
22697a01456O9913p3567L0851N258N8695n9154r5752P722R1158L233J20138K8627
22685H5666m2306L5585k0169p2646j3750j7555o7470M4288j5902M075m1184P0746
$$ y = [-18361, -23519, -57895, -140897, -84604, -64943, 390, 39009, -63070, -76838, -3178, 45099, 50037, -46397, -89686, -111713, -98880, -191818, -293634, -169721, -72268, -103692, -169488, -258559, -276238, -178125, -155730, -138935, -84954, -105774, -149185, -126294, -47356, 38661, 54623, 21187, 111850, 114126, 23617, -43246, -4804, 67517, 84555, 46880, -71583, -121279, -108434, -79419, -30590, 49417, 117615, 142418, 89357, 61191, 159341, 158083, 120280, 118884, 157153, 116145, 69580, -6339, -5655, -50459, -16464, 36188, 122687, 103981, 20791, -16551, -101456, -31543, -105110, -74259, -69001, -10306, -69460, -165212, -157490, -66332, -63099, 57039, 85666, 43360, 78945, 58776, -13870, -27620, -45175, -112645, -68357, -84259, -80184, -121368, -50622]
22673e0622O8550o035p244r945L6607K5859J4520j6369n1287o4180j1973J3330
22661e8789j8583J3713q9898p6619L951j4281P6544N3879J9636j01563q0740L4123
22649b38627l1654J37070J00437j9598q1567r64n4225P7201N0586l089k9495k1148
22637a15073L6689n1786j4064K4537L2555k5610K8711N6234Q630M8812M9711j0805
22625F8541j0669m8407J3374j11118O792Q5418j04492o3290M99M9980l2N4938
22613e8466O7426N1943r871r8968m5123K1616K3858q7724m7189L5915J19856k2580
22601d9307R395L5046L2102Q143j02580j13333l9275L6284O6677j5343K6246J9043
22589h6902M889r012O1767k1063N690K0236L1515m2162P36J0961n8655j08601
$$ y = [-50622, 17928, 11893, 4649, -5296, 31311, 57170, 71690, 55321, 4034, -60146, -72119, -58789, -77372, -63659, -153557, -230176, -226225, -240506, -163962, -110083, -90447, -192010, -272750, -238627, -270281, -133211, -32774, -52372, -133939, -134903, -189128, -111927, -61341, -64430, -93925, -115073, -78384, -130170, -144234, -119697, -87142, -112752, -84041, -27807, -19177, 29635, 79346, 68541, 57872, 9465, 22839, -88279, -81487, 3931, -100561, -163851, -163352, -113372, -113404, -58466, 8960, 60903, 51032, -47936, -93059, -71443, -47585, -135309, -182498, -146583, -26727, -49307, -39912, -4866, 27236, 35379, -67201, -180534, -219809, -183525, -116848, -132191, -105945, -86902, -82013, -91025, -29258, -50321, -44631, -24395, 7120, -35042, -34306, -23345, -82000, -190601]
22577a90601Q2985K6521q1268N9017J9458o2192M7132J8544M0629k9055Q972R5338
22565C5480R8739N7656q1894q4325m5573M2027J2678p4965m3492O37L9456n9855
22553a03431l4089k119N2917o7139j662j7960O5215J04662K1647K5527m9285M2734
22541C7017l4084l7548J8405l5665n8391N8680q4708M3293L2484R9605M9878K8196
22529A17162k8085m1733J4169j9635k3200M641j38981L0692j649k8970M525M2775
22517f8289M5653P5643P4661j09639l5817J021l7939o2534j2018K8138L964K9830
22505f7326L5577j7958j449o473N1802n7263r5043k8769m2442l6068O6692Q6260
22493a12460N9570J3544l0908o2558n926M3622K6249N7529Q7265j2080l3467L232
$$ y = [-190601, -107616, -81095, -162363, -103346, -83888, -146080, -98948, -80404, -39775, -68830, -59858, 35480, 134219, 191875, 109981, 25656, -19917, 22110, 34788, -40177, -83669, -83032, -43576, -103431, -137520, -139639, -86722, -153861, -155523, -173483, -108268, -3606, 18041, 43568, -5717, 37017, 2933, -34615, -16210, -51875, -110266, -51586, -136294, -93001, -60517, 39088, 88966, 117162, 89077, 47344, 61513, 41878, 18678, 23319, -115662, -84970, -86619, -115589, -111064, -68289, -22636, 53007, 127668, 18029, -17788, -16767, -54706, -117240, -129258, -101120, -97156, -67326, -31749, -49707, -51156, -57629, -5827, -63090, -158133, -186902, -229344, -265412, -198720, -112460, -52890, -39346, -70254, -132812, -138738, -95116, -68867, -11338, 75927, 63847, 30380, 33612]
22481C3612L399l2604Q0298K4776n1918k7384j44723j18843o9392N6338J10278
22470a36163O9581j33378j32616L6914J46429l5185P1084N9353L532m7465o1956
22459a59870j5701J6178M8490L1634L5804K9420k6368n959J42443R4184p2603
22448A17652J1462k1985k2936m0001K1082R019p7955m9452J1123M8428L4117O8270
22436A08824j24452j48262m5189j4073P3923M6378m4084P0545J8352n706K9458
22425c4286R501O1317J3796K3417m0933r6837p4321l5511k2365O6815J11934k9653
22413d7126l3954N381N6967J1690K7747o3103l4560M8661O4930L0100o2759p7657
22401g3683n5999k7642J33059M6951J480J2459l5188K928M1211m2686R017m7636
$$ y = [33612, 37011, 4407, 84705, 109481, 57563, 30179, -114544, -233387, -302779, -246441, -136163, -66582, -199960, -332576, -295662, -149233, -184418, -113334, -53981, -50449, -97914, -159870, -175571, -159393, -110903, -79269, -43465, -14045, -40413, -46372, 96071, 190255, 117652, 129114, 107129, 84193, 44192, 65274, 74293, -3662, -53114, -41991, 6437, 40554, 108824, -15628, -163890, -209079, -223152, -149229, -102851, -146935, -76390, -58038, -63744, -34286, -24785, 36532, 50328, 73745, 32812, -64025, -138346, -173857, -196222, -129407, -17473, -47126, -81080, -75699, -18732, -7042, 20705, -42398, -76958, -28297, 36633, 66733, 3974, -73683, -129682, -157324, -24265, 22686, 24166, 36625, 1437, 4365, 45576, 2890, 11907, -35729]
22389c5729n2894Q0876j5730j274n4528j5082j053J3731P8997m464k2045p9552
22377a08747P1641J27340j07690l1475O6205O1896o67l5617k2537L6642j2783
22366D4208l6764o5566K5664Q9494P9472q0150l6329k4175J7035Q0559M3760j08664
22354B8544j07996M0584P6077k1573j11945o7508P4611J8387M654l5675L8706
22343f3134l9203l1848O5543N1275O444j02816K0006O412M4562J05209j0253L4885
22331H7082J7638k7640J6550J4009r097j19125o415M2983k816P742m923Q1467
22319I7455m3885m098J31715N8198p6806m5091m5206p4564m7371l1121j7301N7342
22307d0733J46057p819r2547j0754r7161L487M2011l0633L8322N048J0827j7590
$$ y = [-35729, -88623, -7747, -23477, -24751, -79279, -94361, -95414, -81683, -2686, -7150, -29195, -108747, -37106, 90234, -17456, -48931, 17274, 79170, 78503, 42886, 20349, 56991, 44208, 7444, -58122, -32458, 57036, 136508, 56358, 20029, -4146, 12889, 93448, 137208, 28544, -79452, -38868, 37209, 15636, -96309, -163817, -89206, -70819, -66165, -101840, -63134, -102337, -134185, -68642, -17367, -10923, -113739, -93733, -87321, -42759, 62450, 52197, 87082, 104720, 77080, 93630, 107639, 98542, -20583, -26998, 15985, 13169, 20911, 15988, 97455, 53570, 49472, 181187, 239385, 162579, 117488, 72282, -2282, -49653, -80774, -98075, -40733, 105324, 97505, 4958, -5796, -102957, -99470, -57459, -88092, -49770, -44722, -33895, -51485]
22295e1485L1077O9392q1940j28449K3291L1802P3322j9559o7887J4217l6653
22284a42872L2614R4083P7898N7991K6028q1835o0533j4361p9168J9020M5644
22273b5491k391n8675m2714K2407R9814l1529j2507n1258P1176m6621J29075K4059
22261G5345p7884l9682k2237Q0147J23587m1448p6171J5098L1109k2223J2897
22250E8538l2455n1463k2814J68949O2405j93417m7896m3617J3310N2228O9174
22239C2942O1572o4263n9269R5430P7009j00376n2879M7104q002K7029J08995
22228A65292o4443j01473n9044O5985P0514k9538j59837K1532K06923M8027p5753
22217H8185l0059m4815q5801K2935L9110K7493k3376j37213j9486M3588J2313
$$ y = [-51485, -20408, 48984, -32956, -161405, -138114, -106312, -32990, -52549, -120436, -106219, -142872, -110258, -16175, 61723, 119714, 145742, 63907, 3374, -10987, -90155, -71135, -25491, -27882, -86557, -129271, -106864, -7050, -38579, -51086, -102344, -31168, -77789, 51286, 75345, -2539, -42221, -64458, 15689, 139276, 97828, 21657, 36755, 67864, 45641, 58538, 26083, -25380, -48194, 120755, 183160, -10257, -58153, -101770, -88460, -36232, 32942, 94514, 30251, -29018, 66412, 143421, 43045, -9834, 37270, 29268, 56297, 165292, 100849, -624, -59668, 6317, 76831, 47293, -112544, -91012, 115911, 163938, 88185, 58126, 13311, -72490, -49555, -10445, 17048, -6328, -143541, -163027, -119439, -107126]
22206a07126j05250O0181J33583P5957m7438j15557J07408K2041j07747j0271
22196i4219L2925N3797J3479m9463n450K3893o2270O660Q8258l863p9894n9641
22184a35788J17556Q021p5813K3862o6447l1241M3562J597Q1611k3088J18885
22173F2717K6168n1355L6043k7950J5602J8773j03385j058m8806m5921Q1159O2809
22161B4796J00417j7976P0692o1717J5173J9093l0965j8253J4366l8133j14923
22150c7430q4483P0558O0921J0751m0023L8330K3356K6040m5639L3935m1513j07691
22138i2888J9132r051j11657l0066j6323P8895P7172K9713N72m9556m5873l1676
22126a81606L4344N8227K3911Q1518L0735j1238k6742p2049k1395J3110j7917
$$ y = [-107126, -212376, -152195, -18612, 57345, 9907, -105650, 1758, 23799, -83948, -94219, -61294, -7497, 5982, -43481, -48931, -25038, -87308, -80648, 7610, 3747, -76147, -135788, -18232, -10211, -86024, -62162, -128609, -159850, -116288, -114691, -33080, -56168, 62717, 88885, 37530, 73573, 45623, 61225, 79998, -23387, -24445, -73251, -119172, -38013, 24796, 125213, 107237, 177929, 116212, 131385, 150478, 119513, 101260, 115626, 77493, -37430, -121913, -51355, 9566, 20317, -19706, 18624, 41980, 68020, 22381, 56316, 14803, -92888, -73756, -82807, -194464, -224530, -240853, -161958, -84786, -55073, -54501, -104057, -149930, -181606, -147262, -89035, -65124, 16394, 47129, 35891, 9149, -62900, -84295, -71185, -89102]
22115h9102K6473o6031K1528L482J7218j0358n3191q123K6316K1051R8580r551
22103b1708R598L6889J839n2915m8469P0492Q4553j2570l0008j4742K2886p6024
22091c0179n8720K7958O5867L7057O9207M1185J3218k1291j24029n8990m4780
22080h3497R6186N9679l0240m0216q307R2526K5259L8837n3633n5804m6964N794
22068c80l2974m8691n3972J23326Q7071M1369r0798j7752N3282p1250q8011R983
22056h8797L7916K3264J53890J62394r7365q6754j64811K5946k2036K3919m6961
22045g9395l069K9835j4198p2703Q4120M3656j35693J1628k161L0116j2078J348
22033a18594M4657M1007O1427l1358j20097q5190J26339R4318N638j47241m3014
$$ y = [-89102, -62629, -128660, -107132, -103650, -86432, -96790, -149981, -158104, -131788, -110737, -12157, -21708, -12110, 24779, 26618, -26297, -74766, -4274, 80279, 67709, 37701, 22959, 45845, -30179, -88899, -60941, 4926, 41983, 111190, 152375, 165593, 144302, 20273, -38717, -83497, 12689, 72368, 42128, 1912, -6395, 86131, 111390, 150227, 96594, 40790, -6174, -380, -33354, -82045, -136017, -12691, 74380, 115749, 24951, 7199, 60481, -10769, -98780, -88797, -50881, -27617, 126273, 288667, 191302, 104548, -60263, -34317, -56353, -32434, -79395, -82464, -52629, -66827, -139530, -55410, -11754, -147447, -135819, -137980, -107864, -119942, -118594, -73937, -32930, 28497, -2861, -122958, -208148, -81809, 12509, 18147, -129094, -172108]
22022a72108R916r498L8704Q1240O785o2098L3846L2449L4077r0447j1444K3526
22010h5052J116M919L8890Q2743Q1298N6399J46747M691j26382j39144m6596J01502
21998A21131L6062K8737M9466j01246q3644o1029p7894n29M8826N003j798k5326
21986f2241L0824J3352M113l9058k3362K7833k8687n8503K1667O4951R3546n3000
21974h565J09015q959j05889r8541p9739j8923J5476O5057J26441j6765o9030
21963i0422j9170o142J44336R7080l6876q1193O4148J6437l577L2900j553o0975
21951E4993n4609J18701n6790o2200J09846O1052k2635J8668m9005r4208m4219
21940b0406k9592n2429j35678m7353Q9692Q8656J48384J5451L0698n8514j19537
$$ y = [-172108, -162192, -171690, -132986, -51746, -44961, -107059, -73213, -40764, -6687, -97134, -108578, -85052, -83936, -79017, -40127, 42616, 123914, 180313, 327060, 331751, 205369, 66225, 19629, 121131, 157193, 185930, 235396, 134150, 50506, -10523, -88417, -88946, -40120, -35117, -36915, -62241, -31417, -18065, -13952, -53010, -76372, -48539, -77226, -135729, -114062, -49111, 44435, -8565, 100450, 91491, -14398, -112939, -192678, -211601, -196125, -131068, -4627, -21392, -90422, -109592, -115734, 28602, 125682, 88806, 7613, 71761, 88198, 84621, 117521, 115968, 54993, 384, 119085, 62295, 95, 109941, 170993, 148358, 167026, 118021, 23813, -20406, -49998, -102427, -238105, -285458, -195766, -107110, 41274, 56725, 87423, 28909, -90628]
21929i0628l6521N9491J00873J00829j08344r9865n7603J3357O406O9396O2986
21918B0377m6725n0268M3733N293p314Q4650o6677m4586m466J5516O9383o945
21906A1971O0677J9323J5686k8715m705p4613K7536L0821P6286J27715K0155j6613
21894B65524j66925p7996L7128l3214R653k8128l9565l7976O830J4906N2070L5065
21882C7372j0315n8166j7927J7424o821o1602K454O7723J05529N4293n3912M0531
21870A16583o4189K9633m371J5611k1295m44p5279j9148M512r5399L9049M2925
21858c1812k975K0232k0229J2836m9489O1776Q1036j8392P5480j16389k9179R0254
21846G3149j44012j72277Q3038N4142k3922l5200p622l1201q9195l148R6176O1852
$$ y = [-90628, -127149, -67658, 33215, 134044, 25700, -74165, -131768, -118411, -112005, -42609, 20377, -26348, -76616, -32883, -27590, -34904, 49746, -16931, -61517, -65983, -50467, 18916, 11971, 72648, 91971, 107657, 78942, 74237, -376, 27160, 57981, 134267, 261982, 282137, 265524, 98599, 20603, 57731, 24517, 34170, 6042, -33523, -71499, -64669, -49763, 2307, 37372, 27057, -31109, -49036, -31612, -38433, -100035, -97581, -29858, 75671, 129964, 76052, 116583, 52394, 82027, 77656, 93267, 71972, 71528, -3751, -22899, -18387, -113786, -74737, -31812, -34787, -14555, -34784, -21948, -71437, -9661, 71375, 52983, 128463, 12074, -17105, 73149, -70863, -243140, -160102, -105960, -129882, -165082, -172704, -203905, -293100, -296248, -200072, -138220]
21834a38220k650R1627J7511k9775k7070M4204o4573M1120J23231l5254m5474
21823b5323m7317J0242M2039O7702P1690j33986j56387r350J0686R5325n6812
21812a31491L5760J13816P8655o0306l7022j1474r7720k9911o3084L9205J73109
21801I537N305K4660l0695r4320o4445M557j408P7525R7984R7988r3057k7449
21789F182N1516O0290j02293j89640Q7827N8873m4541J60137O7492O493j0499
21778A51837j23385o8349J8324J91616j6194k8984j02939J063j9954j04456K3365
21767g8056R8908r292L2076l8795l4648j7543L5037J0875j9435j65068l1512N8116
21755a59337O7078K362J5165L752n3135j6197J17637n2165p1747P5057J33861
$$ y = [-138220, -140870, -49243, -31732, -61507, -88577, -44373, -108946, -67826, 55405, 20151, -25323, -72640, -62398, -20359, 47343, 119033, -14953, -171340, -180690, -170004, -74679, -131491, -95731, 18085, 96740, 36434, -588, -12062, -109782, -139693, -202777, -163572, 9537, 14842, 39502, 8807, -85513, -149958, -145401, -146809, -69284, 28700, 126688, 33631, 6182, 57698, 117988, 15695, -173945, -86118, -27245, -71786, 88351, 155843, 162336, 151837, 28452, -39897, -21573, 170043, 153849, 124865, 21926, 22989, 3035, -101421, -78056, 20852, 11560, 43636, 4841, -29807, -47350, -12313, -1438, -20873, -185941, -217453, -159337, -92259, -89897, -74732, -70980, -124115, -140312, -22675, -74840, -146587, -71530, 62331]
21744F2331J41574l5936j22785n386q3191o2381J5201j4294R604J13829P8157
21733I6723n0343l3061o1139L4066L0908p6549j4031o0876l0344J3698N70L6937
21721a13441J30124l4473k8821P797P1099Q7658o3936M6717P2583j16475J3867
21710G2699K3068n4605n8577M177J05052l5291j81440j16087M155J51437M4465
21699d0947l6375j06962m1221O0587J99168k9342j97034M8933J44528Q4566j190
21688H4711j22840m80M1500K1585k2307l6448j3204J7704J17004k8731o6019K6984
21676A9459m8678o3681M9350J04310k696j11462j624K5561n3516L0173J5154n307
21664d2957m9953n1049l0614K0868K5075l4885j664J39890P0770j07861p9324
$$ y = [62331, 203905, 167969, 45184, 39798, -43393, -105774, -90573, -104867, -95263, 18566, 96723, 46380, 13319, -47820, -13754, 17154, -59395, -73426, -134302, -164646, -150948, -150378, -113441, 16683, -17790, -46611, -38814, 32285, 119943, 56007, 102724, 175307, 58832, 72699, 95767, 41162, -17415, -13238, 91814, 56523, -124917, -241004, -236849, -85412, -40947, -77322, -184284, -225505, -164918, 34250, 4908, -192126, -143193, 1335, 85901, 84711, -38129, -38609, 2891, 24476, 2169, -34279, -47483, -29779, 87225, 58494, -7525, 19459, -29219, -92900, -43550, 60760, 58064, -53398, -55022, -29461, -82977, -52804, -37650, -42957, -92910, -143959, -174573, -153705, -128630, -163515, -165179, -25289, 45481, -62380, -141704]
21653a41704M8856K3539O2358j3443m2822J16481L1793p8777p542J9874q4718
21642f6105p0821k4392J02167J24459M2961j42225j16722M981j7480P3448J50387
21631F0658N0728j53295j08821m4512l3349Q890Q8093R0983l8840n7152L1120
21620a05497N4050J05291J2082R0785M1851n4233n2370j11318P7510l9468j14331
21609i5648M5009N0392K7990k7029j13004o958L9731j0324j4928K2396K3959P63
21597e7651R6295M2412k7545J3366K5058R4003L6388r4006j25662o701k4190L4701
21585F468M6554J0107J9837n8148j8903M3513P1619l2855r3498p5379n4027J557
21573a33155O499N9667J26522Q144j02501l5662j2249p1445P5974j0277m4919
$$ y = [-141704, -92848, -69309, -6951, -20394, -63216, 53265, 85058, 6281, -1261, 18613, -66105, -136926, -161318, -59151, 65308, 108269, -33956, -150678, -145697, -163177, -89729, 60658, 111386, -41909, -150730, -195242, -228591, -219701, -131608, -40625, -79465, -136617, -105497, -51447, 53844, 65926, 156711, 198562, 144329, 91959, -19359, 58151, 18683, -95648, -50639, -247, 27743, 714, -112290, -119248, -79517, -89841, -104769, -82373, -58414, -57651, 38644, 81056, 53511, 66877, 91935, 185938, 222326, 128320, 2658, -4043, -28233, 6468, 53022, 63129, 82966, 24818, 5915, 49428, 121047, 88192, -5306, -80685, -134712, -133155, -126656, -66989, 59533, 67677, -34824, -70486, -82735, -154180, -78206, -88483, -133402]
21562a33402O5699J1263R3815N7587o1119J16446N2577q9797j18744j03516j5675
21551a24866L0234L0100k2016j32255L6980M6203L5549K0111K3752o4147j9201
21540a39556m4569k2641P4665J8227P3632O7083K5824m6676o9238j9516j8282
21529a01047K8769n6180j6064m8879p4810J2681J89875N7516K1164N3015M1481
21518A07521n6358o4044n5882q4097m6094J5497R6130M503J916P9616J14025l6746
21506G5987k3113j5392l1193O4065J7533j8319m1522P1579N571R22q9358l1520
21494a4760p6106l8075L0532R2419J15994n3323O25k9775Q2968O9479L8197l080
21482B15095K5586M3646m4053n5049o1884o7636J1681r4739J0236O3884J8654
$$ y = [-133402, -67703, -56440, 37375, 94962, 33843, 150289, 202866, 113069, -5675, -109191, -124866, -94632, -64532, -86548, -218803, -181823, -135620, -100071, -79960, -56208, -120355, -139556, -184125, -206766, -132101, -113874, -40242, 26841, 52665, 5989, -63249, -82765, -101047, -72278, -128458, -144522, -193401, -268211, -255530, -65655, -8139, 13025, 66040, 107521, 51163, -12881, -68763, -152860, -198954, -183457, -87327, -82824, -80908, -1292, 112733, 75987, 52874, 37482, 6289, 70354, 87887, 69568, 28046, 99625, 105196, 106118, 16760, -14760, -90866, -128941, -98409, -5990, 110004, 56681, 57306, 27531, 110499, 179978, 218175, 215095, 240681, 284327, 240274, 185225, 123341, 55705, 67386, -27353, -17117, 46767, 65421]
21471F5421J3476N3418r1792j10123M9872L7011l9008o7333o6190J5326J37344
21460b578K1977M5961O7404Q459l0817o7898r5602K226m3929p361M0949M6085
21448a5124K4205J3252k7564K4757M730l335m3776q2896m1142K7636q421j04882
21436b32560k3552j9715N518J82501J45159j539r5632q1880M000P368P7471P6027
21424D3166N0700j1230m2279M4179Q9800m3482J4083J5191j04962k0690Q2266
21413A16742o0436j020n2438n603l721J25765j731k9541J6319N1026N5934K9590
21401B40886q1294j403m677k3681r8677K6905R0519p0190k3646j1859K0693m5106
21389A8470l4243n0559k4218L6748J9591O9291m8065r3600m1161L3600O7450l156
$$ y = [65421, 78897, 132315, 40523, -69600, -19728, 17283, -21725, -89058, -155248, -139922, -2578, 19399, 65360, 132764, 141223, 110406, 42508, -53094, -50868, -94797, -102158, -61209, -15124, 9081, 22333, -5231, 19526, 24256, 20921, -22855, -105751, -146893, -119257, -127678, -232560, -256112, -275827, -270309, -87808, 57351, 55812, -39820, -121700, -117700, -110332, -32861, 43166, 93866, 82636, 40357, 84536, 174336, 130854, 144937, 160128, 55166, 34476, 116742, 56306, 55286, 2848, -2755, -6476, 119289, 117558, 88017, 104336, 155362, 211296, 240886, 159592, 158189, 153512, 129831, 31154, 58059, 148578, 78388, 54742, 42883, 63576, 18470, -15773, -66332, -90550, -53802, -34211, 35080, -12985, -106585, -147746, -114146, -46696, -49852]
21377d9852m5466l9996Q31M0697J02184J69508m926k0488j82226j14435j00658
21366b44827j1849J18593Q6427j7369l9807Q1854N6051m8403Q387n5997R677L2683
21354b4580R8637K0321L270P242j17173n2247j2816N7328n9706j6710L9412M1716
21342a5306O0721l1534K17J08481L0391k0433j9377J2885q8747r8321j8851p279
21330h7153P8700J80002r4580r0687k7493m236j8187N7234k6981J23542j7115
21319G3046p4748o4530K9731J7607l6271K0726j5887J4860l0046O8038M3613m4155
21307A984j9854r6543j6201Q525j8145N5701J5826n0165J9282Q6413J7708n5265
21295e0734J1393L7924M9060L0476p2508O2772R0259k063k4453l7010q2539K1792
$$ y = [-49852, -95318, -135314, -134483, -93786, 8398, 177906, 172980, 152492, -29734, -144169, -244827, -256676, -138083, -51656, -69025, -108832, -26978, 29073, -19330, -10943, -66940, -57263, -24580, 74057, 94378, 97648, 104890, -12283, -64530, -77346, -20018, -79724, -96434, -57022, -15306, 45415, 13881, 14098, 122579, 152970, 132537, 113160, 126045, 37298, -61023, -79874, -87153, -8453, 171549, 76969, -13718, -41211, -45447, -63634, -6400, -33381, 90161, 73046, -1702, -66232, -36501, -18894, -55165, -34439, -50326, -35466, -65512, 2526, 46139, 1984, -17870, -114413, -130614, -122089, -140234, -84533, -68707, -118872, -99590, -13177, 4531, -50734, -39341, -1417, 47643, 78119, 5611, 68383, 158642, 156579, 132126, 95116, 12577, 34369]
21283C4369L595L9818J21442K5257q2749l2450l3633k1314m2517r3216K1672k191
21271f1917p9333P0060P7650m1981k5549O4747M3468p597L8206Q1368o6706j76432
21259h4016q846L8678K7652M8140o800K3270o5624k8269K2265N8502m5928r947
21247c0923N554N8541p603k0964l3932L0731M8951L8987J7221K3296K3326N2406
21235B05591Q5832J25462O4648J44734K74917K06714R4658o0679R8452K41579
21225A481908J9631k13628k76393j62040o8496k0820q6204r3038Q7875J37308
21215H06103K22793J97649P489j6076M7496R067l007r1487j41055q2761j46681
21204H09530j63326j27971p4073n0220o5314j02044q0745j46099P336j03882k6478
$$ y = [34369, 37964, 77782, 199224, 224481, 141732, 109282, 75649, 54335, 11818, -81398, -59726, -61917, -141250, -71190, 6460, -35521, -61070, 3677, 47145, 39548, 77754, 159122, 92416, -84016, -92862, -54184, -26532, 21608, 14808, 38078, -27546, -55815, -33550, 24952, -20976, -30923, -25369, 33172, 25569, 4605, -29327, 1404, 50355, 89342, 106563, 129859, 153185, 205591, 291423, 416885, 481533, 626267, 901184, 1107898, 1202556, 1141877, 1240329, 1481908, 1501539, 1287911, 1011518, 849478, 780982, 760162, 673958, 580920, 668795, 806103, 1028896, 1226545, 1234034, 1217958, 1265454, 1274521, 1271514, 1180027, 1038972, 956211, 809530, 646204, 518233, 444160, 393940, 328626, 226582, 145837, -262, 7074, -96808, -123286]
21193a23286L5309M8762R4145O9764P4156p8327M1322n1897p9972m0140r099L1973
21181A2710Q6675J6017l5641J7413k6376r4894J7959O7791r310o698j06600k6851
21169h7805O083L0001l0703O9728M8028L6008O813j2097j3035j0165m1610n0154
21157d8908j6898N730j5659J5251J5006q153K5475L8093P7349P1070r4854j41816
21145g8314M2778j2720M1346J01855J8915K0045j617q764Q2823l5442k6510M770
21133A49165Q748n566j562j5216n3812L4038J04665R598j39561l3465M2352K2463
21121A21847j0032m6128K6587q950N212k7409m0358j3901l5161k0566L2275P9140
21109F2556O6939N9008r2768j08968M4942l5083j02374P805p610q5901n600J25220
$$ y = [-123286, -87977, -39215, 54930, 124694, 198850, 120523, 161845, 109948, 29976, -10164, -19263, 12710, 99385, 115402, 79761, 97174, 70798, -24096, -6137, 61654, 52344, 45646, -60954, -87805, -81722, -51721, -82424, -12696, 35332, 71340, 78153, 66056, 53021, 42856, 1246, -48908, -65806, -60076, -75735, -60484, -45478, -53631, -28156, 9937, 87286, 158356, 63502, -78314, -35536, -48256, -6910, 94945, 113860, 133905, 132288, 123524, 206347, 170905, 144395, 149165, 157913, 152347, 150785, 135569, 81757, 115795, 220460, 230058, 90497, 57032, 99384, 121847, 111815, 65687, 92274, 83324, 88536, 61127, 20769, 6868, -28293, -48859, -16584, 62556, 129495, 188503, 95735, -13233, 31709, -3374, -105748, -97943, -105553, -191454, -197054, -71834]
21097g1834P5010N1071K3063m3395L137M7392j66781p1437M9689Q5944R5676l3589
21085D3946o5761m0178L8906J2612K6090M2119Q2587k4220r9232q215J5037j8694
21073D997J0238J0446r8830L075O3329N4194L7208p2832J8083l7271n1578M3139
21061a5802N8330M2899O2359N0946k0316n3770j23289L6264P8242M0594o1543
21050I4914n5208J07961j1989j71009j5576J543L1879o13K4573J20488J6733n3227
21038I0469J3214K7128o094k1661n5646l6831J7905Q3903L7242q4674q0317K2955
21026G593M8372n5998n004O4113L3565P4046k2785k1115o1583j9968j6080L021
21014B8177L6599R581K5398L7191o6841q9904K6802L1316k7527l1375Q0884O7973
$$ y = [-71834, 3176, 54247, 77310, 33915, 37052, 84444, -82337, -153774, -104085, -18141, 77535, 43946, -21815, -61993, -23087, -10475, 15615, 57734, 140321, 116101, 16869, 8654, 23691, 4997, 15235, 25681, -73149, -70074, -6745, 47449, 84657, 11825, 29908, -7363, -58941, -15802, 42528, 85427, 147786, 198732, 178416, 124646, 1357, 37621, 115863, 156457, 94914, 39706, 147667, 135678, -35331, -50907, -49364, -17485, -18098, 6475, 126963, 143696, 90469, 103683, 130811, 124717, 103056, 47410, 10579, 28484, 112387, 149629, 64955, -15362, 7593, 55965, -33, -5037, 59076, 92641, 166687, 143902, 122787, 61204, 41236, 25156, 28177, 64776, 74357, 99755, 136946, 70105, -19799, 7003, 38319, 10792, -20583, 60301, 128274]
21002A28274j27535k8792O910n7609j695K7512r2753M0074J0268J1669O6054L9815
20990B2192Q130J3400O7283L0810j4122j33072q7737M026M9761l0710j03976n645
20978a79660M2770q7047o815R4428O0615O0942O031M1243M4422j5608n9579j8206
20966a6464o1969l2334J79977R9248N8487k7801j7308K3878j56638j17627k1259
20955h9810P534J13372P4884M70M4244r4540j04908K1631J1514J4722M1785P4245
20943A15143M3081j994K0677n2302j20776o7836o0459N3870O5759M6825L9120
20932H1108M7863N2146m6036j7159J0650k8512k3274j0680j46047O7621J22752
20921A10432O4290m2513o9501j4352o5675n2861k4927J10174M6387P779L9561
$$ y = [128274, 739, -28053, -21143, -78752, -80447, -52935, -145688, -105614, -95346, -83677, -17623, 22192, 30322, 43722, 111005, 141815, 127693, -5379, -93116, -89090, -39329, -70039, -174015, -179660, -136890, -223937, -230752, -136324, -75709, -14767, -8736, 32507, 76929, 61321, 1742, -16464, -78433, -110767, 69210, 168458, 226945, 199144, 181836, 205714, 49076, -68551, -89810, -82276, 31096, 105980, 106450, 150694, 56154, -48754, -27123, -15609, -887, 40898, 115143, 158224, 156230, 176907, 124605, 3829, -64007, -124466, -70596, -4837, 41988, 81108, 128971, 181117, 135081, 117922, 128572, 100060, 76786, 66106, -79941, -12320, 110432, 174722, 132209, 62708, 48356, -17319, -70180, -95107, 15067, 61454, 69233, 108794]
20910A08794J2302N4525l0490N8874o7362K2528m0968O1719j0643r2582O424K8266
20898A11387m2662j9406O2658M8551q0980n9134r384N1129N1404m4663j34669
20887f5769k3R2814M5960o4519Q0340P3884o4525M6965J40132R9802r1912m8933
20875B44216L4027K7355l0716p5408k1729J07009M5836P7459m8511j03183p2174
20864A84181K6357l1484J3738N3446R171n7302R16m0092p2627l0644O2887N2391
20852A70938L742N8627k9448q6565q2207k9259K0955K2702R6105m6738J89n9609
20840C9432N4360J09005N3891l9915p781o0562l6283J00764R8761K0416M5282
20829C77370n6000j10099n0485j2527J8340M0626j0710j2418r8430K3333k5726
$$ y = [108794, 121096, 175621, 145131, 204005, 136643, 159171, 118203, 179922, 169279, 76697, 83121, 111387, 68725, 49319, 111977, 160528, 79548, 20414, 11030, 62159, 113563, 68900, -65769, -65792, 27022, 72982, 8463, 88803, 162687, 98162, 145127, 285259, 385061, 293149, 244216, 278243, 305598, 274882, 199474, 177745, 284754, 330590, 408049, 359538, 256355, 184181, 210538, 179054, 192792, 246238, 255409, 198107, 199023, 158931, 86304, 55660, 118547, 170938, 174680, 233307, 203859, 117294, 35087, 5828, 26783, 49485, 145590, 98852, 99041, 39432, 93792, 202797, 256688, 216773, 208992, 148430, 112147, 212911, 311672, 332088, 377370, 321370, 211271, 160786, 148259, 166599, 207225, 196515, 184097, 85667, 109000, 83274]
20818H3274P52O2318Q3278j513J2209q3082m8363q1517j2155o656o3372K8914
20806b5913Q6610K5928J8089K493o9015N508K4081o0140j11491P8423J57170l9646
20794I2097q6231J67283J41272k9566j35963l145J13109L8818l4968k1642j3001
20783B28063K6518j8897J47751j266L6631Q6508N1751J18384M8071k8045K8914
20772G24383j4141m8674m5982K8058K3755P6068P916k0711j47539k0830r2281
20761D70022L8152j300n193R5145k8199p4286k9365R0353k1996j00416k0696l4851
20749C77370k4365j45541p7826j0376k3374j3146j8573P7975k1374r2984R8564
20738A26350J9913P609R6960l4118N6631K7941j17650r2768J8584J00114k4409
$$ y = [83274, 84026, 146344, 229622, 228109, 240318, 157236, 108873, 27356, 15201, 8545, -54827, -25913, 60697, 86625, 104714, 107207, 38192, 43700, 67781, 7641, -103850, -25427, 131743, 92097, 5866, 173149, 314421, 284855, 148892, 145747, 258856, 297674, 262706, 241064, 228063, 254581, 235684, 383435, 382169, 418800, 505308, 557059, 675443, 723514, 695469, 724383, 710242, 661568, 615586, 643644, 667399, 743467, 751383, 730672, 583133, 562303, 470022, 508174, 506874, 501681, 596826, 568627, 494341, 464976, 555329, 533333, 432917, 412221, 377370, 353005, 207464, 129638, 119262, 95888, 82742, 64169, 142144, 120770, 27786, 126350, 146263, 153872, 250832, 216714, 273345, 301286, 183636, 90868, 109452, 209566, 185157]
20727A85157M8754J5947R0955k4680J11327Q2042K1594k0637m4812m5142N9550
20716D80055L4122L2487K3142K0720m1674L1069j4952r1923k7324N5978K8875
20705E30575J20148O0358l8731l3244J03360J16652M5596Q0456M2973M8032J24151
20694A200326J18925N7661N7714O0399m725O8393R4706J99561K88666K82972J02189
20683B526787Q7526K77464L33146J29392m0508o3694k7228j88268n1997N2853
20673C035473J98526J15843K38080L81519K70921J44892J43474K97811M06781
20664E233320K38119J61422M64840O39113P12907O74320M73478N09850P41192
20655I848561J004646R28196J010590J248090J623463K324344L395255M714330
$$ y = [185157, 233911, 249858, 340813, 316133, 427460, 509502, 531096, 510459, 465647, 420505, 480055, 514177, 546664, 569806, 590526, 548852, 579921, 564969, 473046, 445722, 501700, 530575, 650723, 711081, 672350, 639106, 742466, 859118, 904714, 985170, 1028143, 1076175, 1200326, 1319251, 1376912, 1434626, 1495025, 1490300, 1558693, 1653399, 1852960, 2141626, 2424598, 2526787, 2614313, 2891777, 3224923, 3354315, 3313807, 3250113, 3222885, 3034617, 2982620, 3035473, 3233999, 3349842, 3587922, 3969441, 4240362, 4385254, 4528728, 4826539, 5233320, 5471439, 5632861, 6097701, 6736814, 7449721, 8124041, 8597519, 9107369, 9848561, 10853207, 11781403, 12791993, 14040083, 15663546, 17987890, 21383145, 26097475]
20647B6097475O649027R702352J5254312K4925467M0389955N4477139L1997947
20640B09493674l701014M097527K4465782K8852667j3776304m4971885l1694528
20633A72765919k2807239k4431867j8739886o286138P361301K4311055M6864939
20626A79038084N3364635M996819j4345320P598649K3452629P818276l7538587
20619B24385185m4338529l0618532k8359973l0062022k3919305j6029034j0433233
20612D0624557p207120n158842l916874k890352k289017j832158j418346j274121
20604A4637727j130860q80296q04014q79451r85695p01918m57745n87328o78928
20595G531492n47773l45189l23860l88000n29718m11128k86648l15706k34417
$$ y = [26097475, 32746502, 42448854, 57703166, 82628633, 123018588, 177495727, 209493674, 205792660, 209890187, 234355969, 263208636, 249432332, 204460447, 172765919, 149958680, 125526813, 106786927, 100500789, 107862090, 132173145, 179038084, 232402719, 237399538, 223054218, 230652867, 254105496, 261923772, 224385185, 180046656, 149428124, 121068151, 91006129, 67086824, 51057790, 40624557, 33417437, 28258595, 24341721, 21451369, 19162352, 17330194, 15911848, 14637727, 13506867, 12626571, 11822557, 10943106, 9957411, 9255493, 8797748, 8210420, 7531492, 6983719, 6638530, 6314670, 5926670, 5396952, 4985824, 4699176, 4383470, 4149053]
20586D149053k76596j71949L0550J87819K41973j01400l50251k90966j09708l5079
20576C273446l67393l98054k58783j67903j23083k04680j64325p2619r7869k44201
20566A174536k44606j45287L1264N7279m9059j10732k2111r0612N7303M0667j00624
20555E98018m1322m8743j0313O3484j0019J6739M122m7603n0467m4083O445N2004
20543D88262p9821j58009N8365K1967J4364L3958k891j32501O5713M5525n3236
20532C01696K4751p0135j6991N7712k9877p6441O7589M0881k3369J8904k420O6365
20520C58665Q1384N3197k6342P5856R7010o4539o3204o979K797k6826n0657n7212
20508C73150n2832j2234K5240l2115L0416O603J9488k8338K5322J41327o7697
$$ y = [4149053, 3872457, 3700508, 3731058, 3918877, 4160850, 4059450, 3709199, 3418233, 3308525, 3273446, 2906053, 2507999, 2249216, 2081313, 1958230, 1753550, 1589225, 1516606, 1418737, 1174536, 929930, 784643, 815907, 873186, 824127, 713395, 691284, 600672, 657975, 698642, 598018, 556696, 507953, 497640, 561124, 551105, 567844, 571966, 524363, 473896, 429813, 436258, 488262, 408441, 250432, 308797, 330764, 345128, 379086, 376195, 243694, 309407, 354932, 301696, 326447, 256312, 239321, 297033, 267156, 190715, 258304, 299185, 275816, 294720, 292300, 358665, 440049, 493246, 466904, 542760, 639770, 575231, 512027, 505048, 507845, 481019, 430362, 373150, 320318, 308084, 333324, 301209, 331625, 338228, 357716, 329378, 354700, 496027, 428330]
20497D28330q9902M2630q6498j37952k3906L0469j13857j81551o0165o3029O0214
20486a95217K9280N6164o9512o7625P7546J72087R4962k7099k0396k6377M9999
20475G3812p1947N0244O2707j03377j8368M5417R634k5264N57J0417P2625N7284
20463A63741O3667J38598J8641K3002r3148j38802n6785J4350j00354j470J2931
20452D4371M4471k3443K1940M011M058O0574o961L3321M2078j2653p8652j4904
20440A18211K4587l4608j0792m4132n6446N0936q6706K1554l9103k7177J6040
20429f7636K4773k0716n6587K8269N4668p5705J7541Q7922N2730j7771k1438J03021
20417A09071j9989k0796L6548n721n1724O6279J123q5682L5227P0932r0520J20847
$$ y = [428330, 338428, 381058, 294560, 156608, 132702, 163171, 49314, -132237, -192402, -255431, -195217, -165937, -109773, -179285, -246910, -169364, 2723, 97685, 70586, 50190, 23813, 73812, 1865, 52109, 114816, 11439, -6929, 38488, 48122, 22858, 23415, 33832, 106457, 163741, 227408, 366006, 384647, 407649, 314501, 175699, 118914, 133264, 32910, 31440, 44371, 88842, 65399, 87339, 91350, 95408, 155982, 149021, 182342, 224420, 211767, 133115, 118211, 142798, 108190, 97398, 53266, -3180, 47756, -38950, -17396, -56499, -83676, -67636, -42863, -63579, -120166, -91897, -37229, -112934, -95393, -7471, 45259, 27488, 6050, 109071, 89082, 68286, 104834, 99113, 47389, 113668, 114791, 29109, 64336, 135268, 44748, 165595]
20405A65595O8858l5180j15869o1057J3077l894J72028K4717p3924o1931k04K4019
20393A16235l8204j6743J8889J3282L2158j4388J16701N0843k6961j17652n0644
20382H3516J03959J10467N344m5071q4462j48740K3726J5243l8685o26K5876O7036
20370A17583R1936k0992l273Q6194o4770j20327O137k1755r8876M5854P3932J3257
20358A04900p8787j41292l0927J0616K7093N0039Q7416R8186n7555J366P68J9830
20346I1653M8662J5287j20126o7839K8320j2n8612N5598J7133o0390Q5433Q5773
20334A20880j14139l6960J0234M2531J6276r662n9090J7830R7178q509Q0940L1220
20322A88729j43226j16903k4795J11881L0811P109l9768m4228N0206K7424O6017
$$ y = [165595, 234453, 199273, 83404, 22347, 35424, 31530, 203558, 228275, 154351, 92420, 92216, 116235, 78031, 61288, 80177, 93459, 125617, 111229, 227930, 278773, 251812, 134160, 83516, 187475, 297942, 303286, 258215, 173753, 25013, 48739, 63982, 25297, 24671, 50547, 117583, 209519, 188527, 185254, 271448, 206678, 86351, 92488, 70733, -28143, 17711, 91643, 104900, 26113, -115179, -146106, -135490, -108397, -58358, 29058, 127244, 69689, 71055, 71823, 91653, 140315, 155602, 35476, -32363, -4043, -4055, -62667, -7069, 10064, -50326, 35107, 120880, 6741, -30219, -19985, 22546, 38822, 29160, -29930, -12100, 85078, 76569, 157509, 188729, 45503, -71400, -96195, 15686, 46497, 53606, 13838, -30390, 19816, 47240, 113257]
20311A13257Q020k3156j3059l8087l0761l9812j09944l287L9604J4313K956n1869
20299a31825j6170R618K4050N3902P4717m6851j80947M7807J32683K545j18754
20288a49225p5397O5401Q328N7915m4223M3701k9724j4537O2164J4599J15218
20277E4220k8788j180K7229M0081Q450M454k5741O3957L0022r93l6659r0337K9217
20264G3932M7823n8928j45767k8613J2741R0491N6635M5101O1654j8764q4576
20253E1729n7271j3330l9082P0983L9218P6393N2327n5596j43521p6687J1218
20242h3619L7835O0127L8644p6264k6971O5759j7127j15658m0573O6972P3215
20231a7660K3286m7011K8413j785j3442m1075Q826n94n355p7608K7702J6330L6958
$$ y = [113257, 121277, 98121, 85062, 46975, 16214, -23598, -133542, -136829, -97225, -82912, -79956, -131825, -147995, -138377, -114327, -60425, 14292, -32559, -213506, -165699, -33016, -30471, -149225, -224622, -159221, -150893, -92978, -137201, -93500, -123224, -137761, -75597, -60998, 54220, 25432, 24252, 51481, 91562, 100012, 104466, 78725, 142682, 172704, 171711, 135052, 44715, 73932, 121755, 62827, -82940, -111553, -98812, -8321, 48314, 93415, 155069, 136305, 51729, -5542, -18872, -57954, 13029, 52247, 128640, 180967, 125371, -18150, -94837, -83619, -45784, 14343, 52987, -23277, -50248, 15511, -1616, -117274, -157847, -90875, -17660, 5626, -41385, -12972, -14757, -28199, -69274, -60448, -61042, -66397, -144005, -116303, -99973, -63015]
20218f3015J03171p398q764m3932J2020K8843n6640p8663o6231J654O4061N5108
20206e9786q4370k8277R9166M0990R654N7253n3950j00514K192N6445O5319r1319
20194h7197Q538j467n5084J27570O1512l4686k4448O4328K9487J9119N9208j00315
20182F6565r9826L8704m4919j0815R1279M0730r72n083K970r4308p8891L3878
20170f0688M9653R1818r691p098j2228q1559M3545p5246r0931J5975P6192N026
20158e5232l3537k4756L0l7847j4000N2576K196Q1173O5713r771m972o4213n3015
20145i5655L4702M9225O5408N5584P668k4234q126k6728k9874l3371k3941L2970
20133C628j132K5209q0273R149L1164k6911Q5633O1490l6254Q48l3249q1114O0393
$$ y = [-63015, 40156, 32758, 23994, -19938, -7918, 20925, -35715, -114378, -180609, -178955, -114894, -59786, -144156, -172433, -73267, -32277, -22623, 34630, -19320, -119834, -117642, -61197, 4122, -87197, -78659, -80126, -135210, -7640, 53872, 19186, -5262, 59066, 88553, 107672, 166880, 66565, -33261, 5443, -39476, -50291, 40988, 81718, 80746, 75663, 78633, -15675, -94566, -60688, -11035, 80783, 71092, 63994, 51766, -29793, 13752, -61494, -152425, -136450, -60258, -55232, -88769, -113525, -113495, -151342, -165342, -112766, -110570, -29397, 36316, 26545, 21573, -42640, -95655, -60953, -11728, 53680, 109264, 116932, 92698, 84572, 57844, 27970, -5401, -29342, 3628, 2496, 27705, -52568, -43419, -12255, -39166, 46467, 107957, 71703, 72551, 39302, -41812, 18581]
20120A8581J84780M9677R7463J59587J89153K44297J67318q5953j82879k47465
20110E94559k49598k9051K9765k5310m9942N1863l0032k4015P2367Q5744K21666
20099F48016K20338o0710j16523r6891k00290l2216m3479m6060m8324p9767m7941
20088I6153m8384J3035N5018N0270Q1155Q0529j43362L1867j8134m7912J15888
20077B66123Q080q7410m0942p3115N1496o9083k587k1583q5454P1191P9251J50999
20065B46966J33688J55406J69032J85551J37812j21091j31080q9413j82593n5259
20055D49019O7671j7461o5488O4845J11762Q3287J99938L36558M90024K41143
20045A961298m5575j43795K9734R2799j68937k86412j98626k26562j49892l0200
$$ y = [18581, 203361, 253038, 350501, 510088, 699241, 943538, 1110856, 1024903, 842024, 594559, 344961, 315910, 345675, 320365, 270423, 322286, 292254, 268239, 340606, 426350, 648016, 868354, 807644, 691121, 594230, 393940, 361724, 318245, 272185, 223861, 144094, 96153, 47769, 60804, 115822, 166092, 247247, 327776, 184414, 216281, 198147, 150235, 266123, 274203, 186793, 145851, 72736, 124232, 55149, 52562, 30979, -54475, 16716, 95967, 246966, 380654, 536060, 705092, 890643, 1028455, 907364, 776284, 686871, 504278, 449019, 516690, 499229, 433741, 498586, 610348, 693635, 893573, 1230131, 1720155, 1961298, 1915723, 1771928, 1801662, 1894461, 1725524, 1439112, 1240486, 1013924, 864032, 833832]
20035H33832k4632m9051J20039N6601K24093K98928K2549o9378K1874M4888j51178
20024A328565k00362j80393j07800j46990j01345j41864p0233J9677o8159k5426
20014C05670L696j11295m2011o295K672j2128n5114J6009j3394m0383J32151K0785
20002B00363q387n648o4578j9090K5171p8533n6404K4810j3555n4948J7801j5643
19990d8641k0263K2982P0401j5051k2301j7493j4334M0677N0616K6269Q348q7142
19978e932P5220J6595q2563m7614o7934j5952N4656M7555L4757N5976L6281p7611
19966B3434j4590j7322o9906n5612j0037k6441m1909J8803j2431Q1491P1484K7102
19954b5934K1503L9051k1247p7240m0799o9M5780P0064m6541n0364L7726R1131
$$ y = [833832, 809200, 760149, 880188, 936789, 1160882, 1459810, 1482359, 1412981, 1434855, 1479743, 1328565, 1128203, 947810, 840010, 693020, 591675, 449811, 379578, 399255, 331096, 305670, 309366, 198071, 156060, 149765, 152437, 140309, 85195, 101204, 87810, 47427, 179578, 200363, 191976, 186328, 121750, 102660, 127831, 49298, -7106, 17704, 4149, -50799, -32998, -48641, -68904, -45922, 24479, 9428, -12873, -30366, -44700, -4023, 46593, 72862, 81210, -5932, 69288, 85883, 3320, -44294, -112228, -128180, -73524, -25969, 8788, 64764, 101045, 23434, 8844, -8478, -78384, -133996, -144033, -170474, -212383, -193580, -206011, -124520, -53036, -25934, -4431, 34620, 13373, -63867, -104666, -104735, -58955, 11109, -35432, -85796, -48070, 43061]
19942D3061m450P2305k8208j83790p540m4769l0846l41J22171O1824j6881K7756
19930A0292R5172K9924l8629j63865j33792K0649J20690J31645N337J6129n904
19919H7648n3199n443J1603n7795n4376j0211P5890q260q3732k2750N9949J13156
19907E2480R7958R133j5512k4350J03318n754j41465l4195L5432K3883N2845m512
19895A49261K4553L5744l6563m165k2069j09528l0106l3709R396K5414L9628M0137
19883H7993M3335j2047j4233Q0632q0663p6034k3914l2557N9478J7268j4007p7424
19871d2173j02944p259J30329M3648l4845j9580r9085K2852N5618k079j7024l716
19859g6258J0991R6768J51504j15592l1369Q0583l2518m4680m2020o2964P8170
$$ y = [43061, 38611, 110916, 82708, -101082, -108622, -153391, -184237, -184578, -62407, -583, -17464, 10292, 105464, 135388, 96759, -67106, -200898, -180249, -59559, 72086, 77423, 93552, 87648, 34449, 29006, 40609, -17186, -71562, -81773, -5883, -14143, -97875, -120625, -60676, 52480, 150438, 159571, 144059, 119709, 223027, 217273, 75808, 41613, 77045, 100928, 153773, 149261, 173814, 209558, 172995, 168830, 146761, 37233, 7127, -26582, -17186, 8228, 47856, 87993, 131328, 119281, 105048, 185680, 105017, 28983, 5069, -27488, 31990, 49258, 35251, -42173, -145117, -152376, -22047, 21601, -13244, -32824, -131909, -109057, -53439, -55518, -72542, -76258, -65267, 31501, 183005, 67413, 36044, 116627, 84109, 39429, -2591, -65555, 12615]
19848A2615J23772j23879J4608J02137J14254L1598j03900j81611j22907J06787
19838b6526K0763K7374Q2926O2270M607m2570n941k6962M6427K2369m671m0636
19826A19430k0874n070l4424j6231l4781J8721n566J8002K5722k5495Q1465l5530
19814H5369j1032n6161j6754Q8837O9744L8129j26233p0156K2328N4560K2506
19803A01137j0913k8471q349J00546Q6039J5014j7560j54393o4971Q0169M9265
19792A47513J12314L0451j19003p6486q6636k3938m373O1465R411J419J39750
19781A91887J64423O3466j6534q4780j35094m5117l9014O7043K0693N6406m2530
19770B00849R329J4748j3581j26791l3843R2388K208M7970K2154K111N7762N3249
$$ y = [12615, 136387, 12508, 27116, 129253, 243507, 275105, 171205, -10406, -133313, -26526, -5763, 21611, 104537, 166807, 171414, 128844, 122903, 95941, 142368, 164737, 160066, 119430, 98556, 93486, 59062, 42831, 8050, 26771, 21205, 39207, 64929, 39434, 120899, 85369, 74337, 18176, 1422, 90259, 160003, 198132, 71899, 1743, 24071, 78631, 101137, 90224, 61753, 53404, 153950, 239989, 255003, 237443, 83050, 18079, 98248, 147513, 259827, 290278, 171275, 94789, 8153, -15785, -20158, 41307, 50718, 52137, 191887, 356310, 419776, 403242, 318462, 183368, 138251, 99237, 166280, 186973, 243379, 200849, 210178, 224926, 211345, 84554, 50711, 143099, 145307, 193277, 215431, 217542, 275304, 328553]
19758C28553L1152m7353r5347n1830L8729L1459n795r7233l5467j6121j9249n5892
19746E606N3256m1000r6065m3806n094j1906n8107P8972J11063N1258J0133K5389
19734G9699L6232l6610K896j33056o2428J49174N8890r027o3994K2558J3552O7395
19722A25281P8714O510J57728J77850J00208P0728j18459j12738q3476n4073Q8083
19711D36356J15579M7430j37589j34458J1076L7008j09142m6020P909J8780p7852
19700A69077j5750j4884p6007J2169Q6583L4703j64257r3689M9247M8321k6763
19689H750o0375p5220L9069J63526j6405R024J1907J04758O0882j1365k2992p6974
19677A34585m4443M3617R6977m658k0483O0483K1508J88062J51444L6729M7263
$$ y = [328553, 359705, 312352, 217005, 165175, 203904, 235363, 229568, 132335, 96868, 80747, 61498, 5606, 58862, 17862, -78203, -122009, -127103, -139009, -197116, -118144, -7081, 44177, 54310, 79699, 115931, 79321, 82217, -50839, -113267, 35907, 94797, 85770, 21776, 44334, 57886, 125281, 203995, 210505, 368233, 546083, 646291, 717019, 598560, 485822, 402346, 348273, 436356, 551935, 599365, 461776, 327318, 338394, 375402, 266260, 220240, 228149, 246929, 169077, 153327, 138443, 62436, 74605, 161188, 195891, 31634, -62055, -12808, 35513, 8750, -51625, -126845, -87776, 75750, 59345, 68369, 80276, 185034, 245916, 234551, 211559, 134585, 90142, 133759, 230736, 226078, 205595, 266078, 287586, 475648, 627092, 663821, 711084]
19666G11084k8944j43679q2221N2421N6064R9544J4296P5709O0740j24672q5747
19655F04595n0527l151n3758L164l025Q8187J81548P4857J02540J9909o2715l4497
19643H67127M063k3235o7523o1975q8353o7057r0017j06947N107J22642R5828
19632E89660M1687O5788m8288p4778J3090Q8124J25155R0657j3669R1850J00713
19621A069989J94457P6190J51195L70897K20355o6734j16485M4286l3801j98947
19611A711402l0607J21359Q2295J98318J54986J38860L52645K91290N53757O61202
19601D235507M00325K10643J90000K07148L38252N91418Q29895P02213P84538
19592H489939J204217J644739K304473L438558N239346P912895J2602148K2029481
$$ y = [711084, 682140, 538461, 456240, 508661, 564725, 664269, 678565, 754274, 815014, 690342, 604595, 554068, 550917, 497159, 500323, 497298, 585485, 767033, 841890, 944430, 964339, 901624, 867127, 871190, 847955, 780432, 718457, 630104, 563047, 473030, 366083, 371190, 493832, 589660, 631347, 697135, 648847, 574069, 587159, 675283, 800438, 891095, 877426, 969276, 1069989, 1264446, 1340636, 1491831, 1862728, 2083083, 2016349, 1899864, 1944150, 1910349, 1711402, 1680795, 1802154, 1884449, 2082767, 2237753, 2376613, 2729258, 3020548, 3574305, 4235507, 4635832, 4846475, 5036475, 5243623, 5581875, 6173293, 7003188, 7705401, 8489939, 9694156, 11338895, 13643368, 17081926, 22321272, 30234167, 42836315, 64865796]
19584F4865796L9561320N9599029K6412550l1317074k6051339j7792652k4475825
19577I0801805k4854698j6630843r152157m170603n34568K921117P296773J3889406
19569E9566232K5668126M5110879N0618964m884662l2489317k1089269k0417434
19562A02083519k6558698k2403770j4644710q851697n703643l762503k502205
19555A7656293j611776j289975j094856n31481K4021N40336P59762M06079k52431
19546A4605972n23926l13516p2049L81763P24745O34959Q30904J465208K249344
19537A9983404L581108N525930Q276213J2627918K0741079L6233755O1163495
19530A68132902N8331483j6714991l8065566k3282241k5253026l1574242k4585880
$$ y = [64865796, 104427116, 164026145, 190438695, 159121621, 133070282, 115277630, 90801805, 65947107, 49316264, 40164107, 35993504, 35458936, 38380053, 45676826, 59566232, 85234358, 130345237, 180964201, 176079539, 143590222, 122500953, 102083519, 75524821, 53121051, 38476341, 29624644, 23921001, 20158498, 17656293, 16044517, 14754542, 13659686, 13128205, 13152226, 13692562, 14452324, 14858403, 14605972, 14082046, 13768530, 13696481, 14078244, 14802989, 15437948, 16268852, 17734060, 19983404, 23564512, 29090442, 37366655, 49994573, 70735652, 106969407, 168132902, 226464385, 209749394, 171683828, 148401587, 123148561, 91574319, 66988439]
19523F6988439j4547702p352425k728174J426607N968438J2616601K3569998M3707326
19515A29649108O7226424L0071656l8566957l2510368k2414557l0287307l1083528
19508G2084471k1746702j3316899q197094n319206l769974k488558j861381j791846
19500A3592811j418951j087074r45041n55139l52323o26613q50041p44326o89756
19491F323547o59961n01964m62132m38626m00402j56168k51504j85596o0827J00711
19481C307078K16099o569m07679k28861j49473k70357l52886k72195j91145k18310
19471A425702j96437N4829m8007q3402m3878q8540n3863J73J242K2581m1964k2421
19459I26015q618R305O4810l939n4216o4222n8947n1467r8309j14256j0345P1691
$$ y = [66988439, 52440737, 45088312, 42360138, 43786745, 49755183, 62371784, 85941782, 129649108, 196875532, 226947188, 188380231, 155869863, 133455306, 103167999, 72084471, 50337769, 37020870, 28823776, 23504570, 19734596, 17246038, 15384657, 13592811, 12173860, 11086786, 10141745, 9586606, 9234283, 8607670, 7757629, 7013303, 6323547, 5663586, 5161622, 4699490, 4260864, 3860462, 3704294, 3452790, 3267194, 3206367, 3307078, 3523177, 3516608, 3108929, 2880068, 2730595, 2460238, 2107352, 1835157, 1644012, 1425702, 1229265, 1284094, 1236087, 1152685, 1108807, 1020267, 966404, 966577, 967819, 990400, 948436, 926015, 917397, 926702, 991512, 987573, 933357, 869135, 810188, 758721, 660412, 546156, 535811, 607502]
19447F07502r168k6981O2520l5367N3448R169M3561j8250p1863q5506p9995L389
19435D52459K4157L0566j5683o9310l0488o7312r3215j809O1271r544j07746L009
19423A76355l4717J5490J17446R2788K4256Q989N5431Q1485M195m8310p7605q2668
19411C33135O6377N5344J05859Q5708q4334o8535o8733K7943m7283j35537q3950
19400A85994N0168J6428j9369p9462N120P272K0287J24394l1348N6202O3100N064
19388D03850m9133q1507p0963m2202m2385k1620n7591j01351O3393k1146n7966
19377g8621j451p2080o0657N4177k3313l3951J23704J20860O6831M1919J72191
19366C09609l255j19815n5307J5644j22028O648l8770o5263O5584N5653J23686
$$ y = [607502, 598334, 571353, 633873, 598506, 651954, 661123, 704684, 686434, 614571, 529065, 449070, 452459, 476616, 507182, 491499, 422189, 391701, 324389, 231174, 229365, 290636, 281092, 173346, 176355, 141638, 157128, 274574, 367362, 391618, 400607, 456038, 537523, 541718, 493408, 415803, 333135, 399512, 454856, 560715, 646423, 562089, 493554, 424821, 452764, 405481, 269944, 185994, 236162, 252590, 233221, 153759, 158879, 166151, 186438, 310832, 279484, 335686, 398786, 403850, 354717, 273210, 202247, 160045, 117660, 96040, 38449, -62902, 491, -20655, -78621, -80072, -152152, -212809, -158632, -181945, -215896, -92192, 28668, 95499, 137418, 309609, 306354, 186539, 131232, 146876, 24848, 31496, -7274, -72537, -6953, 48700, 172386]
19355A72386J47904j3824p0362j9139q0896Q3369M4112Q223j9809j28701j7242
19344A06021K8480k501j9464n7099p4563j17063N104J21375J1437J7944O4018
19333H3689M8322M1586o839O8515l1839m3209K152o6820j12128p1630o434L7054
19321e7581o1234r5945N853J08477O5511M6073r464L7154L4711q772k9960K4181
19309E9004k344L7158k8012J1037R2661M5630m4490n4614l9844Q6468n6574n1662
19297E4418Q999J6165J06460P8622p2447j12637n3782q913j3607O4749q2884M7820
19285C2963J70492j0519j04764n2097L3360R2390k7186L7046j6912o1771J5605
19274A08607J33262m1154n2305n5946j2900R8991R7853j35746k8182r0874q454
$$ y = [172386, 320290, 306466, 236104, 216965, 136069, 219438, 263550, 271773, 251964, 123263, 106021, 134501, 132000, 112536, 55437, -19126, -136189, -131085, -9710, 1727, 19671, 83689, 132011, 173597, 166758, 235273, 203434, 160225, 162377, 95557, -16571, -88201, -94635, -57581, -118815, -214760, -208907, -100430, -34919, 11154, 1690, 38844, 73555, 64783, 34823, 59004, 56660, 93818, 65806, 76843, 169504, 215134, 170644, 116030, 76186, 162654, 106080, 54418, 63417, 79582, 186042, 264664, 192217, 79580, 25798, 16885, 3278, 68027, -14857, 32963, 203455, 192936, 88172, 36075, 69435, 161825, 134639, 171685, 154773, 93002, 108607, 241869, 200715, 148410, 92464, 79564, 178555, 276408, 140662, 112480, 21606, 13152]
19263A3152M3892K4992J7905K1699p601p02k0081O1992Q146J1146K5285p0720
19251A29105j02170L9415m381O220K648m712J2956J3340j18785k5151P1817N2247
19239G2549R1254J00255p8976q7057o0958N4369M4692l026m0632j8815K9087j0423
19227I2319k123m1694N5257J19024m8725k3545l4984q7289j09567k3401K8090
19216g6638N3057m0778J02640N0233P399l9204J8496N363r8408L1623j4962J30276
19204A29097j7046J25128J2486K4684l7969L9169q9161r6977L9613J72982L4195
19193C36201j23840m5089J2014m3022n7539r5776Q0022J01367K5941k5762j06221
19182E8296l7289L5094R3619L0753j16080m9886m0951O2938n9950j05178K614
$$ y = [13152, 57044, 82036, 99941, 121640, 114039, 113337, 93256, 155248, 163394, 174540, 199825, 129105, 26935, 66350, 61969, 68189, 70837, 66125, 79081, 92421, -26364, -51515, 20302, 72549, 163803, 264058, 185082, 98025, 37067, 91436, 136128, 133102, 92470, 73655, 102742, 92319, 90196, 48502, 103759, 222783, 174058, 150513, 115529, 28240, -81327, -104728, -76638, -23581, -64359, 38281, 88514, 95913, 56709, 75205, 80568, -17840, 13783, -1179, 129097, 112051, 237179, 249665, 274349, 236380, 275549, 186388, 89411, 129024, 302006, 336201, 212361, 167272, 179286, 136264, 78725, -17051, 62971, 164338, 190279, 164517, 58296, 21007, 56101, 149720, 180473, 64393, 14507, -26444, 36494, -23456, -128634, -126020]
19171a26020R8736L9243N7925m3792j48031k5599N2894J17809o4647m0392L7816
19160d4058M4681J9699N2810p303P6122J27101M4534l1396n8998N0110K9226Q249
19148C10777K4458Q1255l4290l7928M4431L9131L02J1856M419n0259o9087J8338
19136C43403Q3573O655M1293Q3397o0639j47900j35854l231j00580n1539K6043
19125H4621Q072J169O389j74816j22177J3079O7933J23584L2813J8293J0135k693
19113F6402p5893k6513n8827j39975M589J14221J9532r434J44839Q8380K2604
19102A49925R9678R6869N3906J0183P0528j2595r1393o0670M9287m4288p5984
19091B45446k4374j3300K7175p6240m2933J17040Q2822J34759O090K1865J97185
$$ y = [-126020, -27284, 11959, 69884, 26092, -121939, -147538, -94644, 23165, -41482, -81874, -44058, 623, 20322, 73132, 65829, 141951, 269052, 313586, 282190, 223192, 273302, 302528, 310777, 335235, 416490, 382200, 344272, 388703, 427834, 428136, 439992, 444411, 394152, 325065, 343403, 426976, 433631, 474924, 558321, 497682, 349782, 213928, 210697, 110117, 58578, 84621, 92693, 93862, 100251, -74565, -196742, -183663, -115730, 7854, 40667, 58960, 69095, 66402, -9491, -36004, -94831, -234806, -230217, -115996, -96464, -105898, 38941, 127321, 149925, 249603, 346472, 400378, 410561, 481089, 468494, 377101, 316431, 365718, 321430, 245446, 221072, 207772, 234947, 158707, 115774, 232814, 315636, 450395, 456485, 478350, 675535]
19080F75535J0501l5681l9947o0740q5691q0542j41478o6154m9592P5225K896
19069B04332m3045J59712J09955l9142Q243J23823J02891q2327j8248m289R1045
19058F12950J74132Q5827N2075n4571k6205j6500O9238J03990O156r1249l8689
19047H77154R7143J13444J15117K1411J26369P3690Q937k0195J8780M3695Q7258
19036A562803J51325R4935Q6649n043K03220L04719L02936J96040K52465L46962
19026C497011L86665O30535N11855L46147N08247Q27524Q75794N73636N02528
19017H659942Q27737J227953J512282J874344K595056L731863N233197P672654
19009C3335028J1922902J9313098L2700098N5988272P6700535K9253436j7908213
$$ y = [675535, 686036, 650355, 610408, 549668, 463977, 383435, 241957, 175803, 126211, 201436, 204332, 161287, 320999, 430954, 391812, 400055, 523878, 626769, 544442, 526194, 521905, 612950, 787082, 872909, 924984, 870413, 844208, 827708, 896946, 1000936, 1007092, 915843, 877154, 974297, 1087741, 1202858, 1224269, 1350638, 1424328, 1433265, 1413070, 1431850, 1475545, 1562803, 1714128, 1809063, 1895712, 1890669, 2093889, 2398608, 2701544, 2897584, 3150049, 3497011, 3883676, 4514211, 5026066, 5372213, 5880460, 6707984, 7583778, 8157414, 8659942, 9487679, 10715632, 12227914, 14102258, 16697314, 20429177, 25662374, 33335028, 45257930, 64571028, 97271126, 153259398, 229959933, 259213369, 241305156]
19002B41305156M384524L1593175L1834734l1502090o0424254l9573069l2763517
18995A44854659l7309801l1238882k0400054j2223607p407719m915234l853923
18988B7505439l289825k621164k047561j543060j355533j149425q73159p98444
18980A3827268q79091j235169j062137p25318o95858m63369k73830l369K5636
18971H514763j40397j8268K48852M67710L20907J44914M38586P49774R01296J111254
18961A2739391J594365K291670L471904N423238Q017031J2600986K1410286L7419532
18953A04968403O1140600N1399699j0100372q548791J8523219L3916054K035725
18946B53334537n2174065m1525641k7183148l0483761k9894997k0950576j2978443
$$ y = [241305156, 245689680, 277282855, 309117589, 277615499, 217191245, 177618176, 144854659, 107544858, 76305976, 55905922, 43682315, 36274596, 31359362, 27505439, 24215614, 21594450, 19546889, 18003829, 16648296, 15498871, 14625712, 13827268, 12948177, 11713008, 10650871, 9925553, 9229695, 8766326, 8492496, 8489127, 8514763, 8374366, 8356098, 8604950, 9072660, 9393567, 9538481, 9977067, 10726841, 11628137, 12739391, 14333756, 16625426, 20097330, 25520568, 33537599, 46138585, 67548871, 104968403, 166109003, 217508702, 207408330, 198859539, 217382758, 251298812, 253334537, 201160472, 159634831, 132451683, 101967922, 72072925, 51122349, 38143906]
18939C8143906q069730n312255l855291k871621k173893j660111j197023j021546
18931A1982436j140514r76328p11305m84403n03431r31642p79353n68375n26093
18922E360992m33009m42355l07263k02451l69791k42761l27374k59796j18820
18913B657372j46749j64431k11639j67947n1398r2961j22690q2589j09625j02242
18903A405101j15646q644P36O4537L7577m2661j08087j56404j8319l7299j32482
18892H88409l3289L9658K3590K7036k6808l3794m6150P0982n7947n8316k3189
18881G70182N7489M9596Q0388k3983J453q5457J6762K8213r8215j55125j997r0995
18869E48311q5772K6128O314o7918l9515j28220j17041L959R259Q397N883m515
$$ y = [38143906, 30074176, 24761921, 20906630, 18035009, 15861116, 14201005, 13003982, 11982436, 10841922, 9865594, 9154289, 8669886, 8166455, 7234813, 6455460, 5887085, 5360992, 4927983, 4485628, 4178365, 3975914, 3606123, 3363362, 3035988, 2776192, 2657372, 2510623, 2346192, 2134553, 1966606, 1915208, 1822247, 1699557, 1616968, 1507343, 1405101, 1289455, 1280811, 1281547, 1346084, 1383661, 1341000, 1232913, 1076509, 1058190, 1020891, 888409, 855120, 894778, 918368, 945404, 918596, 884802, 838652, 909634, 851687, 793371, 770182, 827671, 877267, 957655, 933672, 935125, 849668, 866430, 894643, 796428, 641303, 639306, 548311, 462539, 488667, 494981, 427063, 387548, 259328, 142287, 146246, 155505, 163902, 169785, 165270]
18857A65270P3388M1247L6061L4446n5052l8113m6620j28408J2309k3715O392
18846G7205O2352L2462k765Q204N3733J29321q884O488l6310o1724N8789N9208
18834C78079O9311K7791M9913l6966J5243N6726J9651R5685k0322j10414o6739
18823D77958M2050K8642n6328l2455j82919j24192M1028l4940k07662o7843O2714
18812e3947L629J07502j55097j15108m2216L4090M151o9860Q6980K7448l4533
18801b06961J14603L2596N903L899M6231Q9463J09283l5364l8146Q2735J74821
18790C79063o0765j12056J8088R3327J56972K7272o0953j19591j58984P6720N1787
18779B90880j3975j7577m2044r4483p2632L731M3793p9194m4147M8649J5178L6224
$$ y = [165270, 238658, 279905, 315966, 350412, 295360, 257247, 210627, 82219, 94528, 70813, 77205, 139557, 172019, 169254, 177458, 231191, 360512, 351628, 358116, 321806, 260082, 318871, 378079, 447390, 475181, 525094, 488128, 503371, 560097, 579748, 675433, 655111, 544697, 477958, 520008, 548650, 492322, 459867, 276948, 152756, 193784, 158844, -48818, -116661, -53947, -50318, 57184, -97913, -213021, -255237, -221147, -216996, -286856, -199876, -172428, -206961, -92358, -59762, -53859, -49960, -3729, 85734, 195017, 159653, 121507, 204242, 379063, 318298, 206242, 224330, 317657, 474629, 501901, 440948, 321357, 162373, 239093, 290880, 276905, 259328, 217284, 122801, 50169, 53900, 97693, 18499, -25648, 23001, 38179, 74403]
18767G4403R21K7376L3684j1775k2516J383o1994N9580Q2395l4988j04785n4260
18755a0576O0564n5880j36057K5325O7684L0256n6075K0225Q6551l2647P4157
18744G3527L4935K4826Q808j9833o518O8119Q581M4515M2975j5625n5148O0300
18732B69462J04448m2678o8666j9977n374k643k5349r994k4587j3724L1929j7592
18720A75255m3252j960P6729k7688o4252n0708j5533L2908O1952j5109p3025J1893
18708F7210M092J7011j8310Q3710J3083j2315o4763p0843o581l8749J88650L3242
18696A95437p8301j10427O0599P7789l9710n4194j32060q6441p6721L8539N9176
18685a46314J35994K0499K5352J5990n5016m1201J14694j1710M4229L9690j54023
$$ y = [74403, 75324, 102700, 136384, 124609, 102093, 103476, 41482, 101062, 183457, 148469, 43684, -10576, 49988, -5892, -141949, -116624, -48940, -18684, -74759, -54534, 32017, -630, 73527, 108462, 133288, 142096, 122263, 115745, 183864, 192445, 236960, 279935, 264310, 209162, 269462, 373910, 331232, 262566, 242589, 237215, 234572, 209223, 199229, 174642, 160918, 192847, 175255, 132003, 130043, 206772, 179084, 114832, 64124, 48591, 81499, 143451, 128342, 55317, 67210, 71302, 88313, 70003, 153713, 166796, 154481, 89718, 18875, 12294, -26455, 162195, 195437, 117136, 6709, 67308, 145097, 105387, 51193, -80867, -167308, -244029, -205490, -146314, -10320, 10179, 35531, 51521, -3495, -44696, 69998, 58288, 102517, 142207, -11816]
18674a1816l9723M2190m0766l2056j9966n878J9064J5696n0148L7536K2621M8485
18662a4761J4510N147q7268R8381o106O4202R1838m0841n226l1133p7134J185
18650A2794j188O8965l5031j7355j9229n6526k6166L6162K2476O1522j2364K1664
18638E5724N0724n0004j48426p3417N7139P0905O6073J43963J6676n6562j08198
18627B4597j7672n5332J043K676M4478J15679l2527l4320K3414m4970R945Q8579
18615A25590P7360L4933R41j08518j74874o2984O7003N9490J2397l2668J19165
18604A17835Q1952k0955K2415N3467o4775k9893q6584K2008J2085k7672L2538
18593A12421l9034j37506N0445J17499n197j08180r6753l6136j1185k8443N5576
$$ y = [-11816, -51539, -9349, -50115, -82171, -102137, -108015, -88951, -73255, -123403, -85867, -63246, -14761, -251, 4896, -82372, 16009, 9903, 74105, 165943, 125102, 119876, 88743, 11609, 12794, 11606, 80571, 45540, 28185, 8956, -47570, -73736, -37574, -15098, 46424, 34060, 55724, 106448, 56444, -91982, -165399, -108260, -37355, 28718, 172681, 189357, 132795, 24597, 6925, -48407, -47364, -44688, -210, 115469, 82942, 48622, 72036, 27066, 37011, 125590, 202950, 237883, 238824, 130306, -44568, -107552, -40549, 18941, 31338, -1330, 117835, 199787, 178832, 201247, 254714, 189939, 160046, 73462, 95470, 107555, 79883, 112421, 73387, -64119, -13674, 103825, 98628, -9552, -106305, -142441, -153626, -182069, -126493]
18582a26493J11267j3559o2528r1392J12219O8882o0212J1022l8555N2305L7286
18571B42k9151L2069j2051q3723j489k2529N9858K7442k8397R8493Q6161L0015
18559A56940P4019P5557Q8520n4448q5274j81112L174R744q3303j2655M6347J2975
18547E0484K4669m132m2898P3564M1313o402o5680m32p6257M971L3959l0027q5890
18534h2758l1070Q4549J12623L1854o3213p9390k2032l8772n8694k3656L7129
18523a33430O0797k0720o8205M6194O1682Q7186l1973r1931o0976J03209N2309
18512D142m0815k5900K3604q629j4755q5317J5514J09135K0091L3856Q3726K8069
18500A42721j25199n5023L7029Q1533L0311r008M7512o6785O0271L3393l9325
$$ y = [-126493, -15226, -28785, -91313, -182705, -70486, -1604, -61816, -50794, -89349, -37044, 242, -28909, 3160, -8891, -92614, -94103, -116632, -56774, -29332, -57729, 40764, 126925, 156940, 230959, 306516, 395036, 340588, 255314, 74202, 77376, 87120, 3817, -8838, 37509, 50484, 75153, 71021, 28123, 101687, 143000, 136598, 70918, 70486, -5771, -800, 33159, 3132, -82758, -113828, -29279, 83344, 115198, 51985, -27405, -49437, -88209, -146903, -170559, -133430, -72633, -93353, -161558, -115364, -53682, 33504, 1531, -90400, -151376, -48167, 4142, -36673, -62573, -38969, -47598, -62353, -147670, -132156, -23021, -2930, 30926, 114652, 142721, 17522, -37501, -472, 81061, 111372, 102364, 149876, 83091, 143362, 176755, 137430]
18489A37430N6962L4262K8437j6835r4760p8242o5843j6982L6651q3989o457J46566
18477G7200N1901r4867p6002l2352m4430P4908J60750N8808o2070q9842q2739
18466e8735N4348l1624o0450L1531R3137R366O0357j7995K6273N9414P7508L8123
18454B81253j22121j31796L0185J27145K59318K59091K11801J28453J4513M0413
18444A098255R4412J75259R0031j02237l18649p1554j43024j76382j04275k05089
18434C36747j05393j04626j33286k6044L0833N2493k3064j01336N6551J20972
18424A03847O8159k7669k9841j7641m393N2722j4620K8328k5125o6708m3491O1573
18412H5141P5700j0228K240j19686r7098n7777K8816R8279L9768l606o206n0924
$$ y = [137430, 194392, 228654, 257091, 240256, 145496, 67254, 1411, -15571, 21080, -62909, -69366, 77200, 129101, 34234, -41768, -74120, -118550, -43642, 117108, 175916, 113846, 24004, -58735, -4387, -36011, -96461, -64930, 28207, 37573, 97930, 79935, 106208, 165622, 243130, 281253, 159132, 27336, 57521, 184666, 443984, 703075, 914876, 1043329, 1057842, 1098255, 1192667, 1367926, 1457957, 1355720, 1037071, 965517, 822493, 646111, 541836, 336747, 231354, 126728, -6558, -32602, -1769, 50724, 27660, -73676, -17125, 103847, 172006, 144337, 114496, 96855, 92462, 145184, 130564, 158892, 133767, 67059, 23568, 85141, 160841, 150613, 152853, 33167, -63931, -121708, -92892, 5387, 45155, 41549, 35343, -15581]
18400a5581R4957J08056J30810J63004K07215K24364J28913q4981K4427J55541
18390A136725J38125o0381k23102k29215j92146j07155p0217q2247j13209j6523
18380A80655p5920m3427q0471N4542M8352j8289K8714O0547P0634o5628r1481
18369F8228n1643M4589O3409P4483O6442r8307r7977k7354m6788r4654O023J87602
18357I4053P4809p0207l1625r8000N951N6773R9876J26006k3413j24091p3848
18346C6284j06682J5809J27043k8227o2869o6868O662K6829o323L4151j9858m292
18334d8341K3593O229J44440J6004J8394j988L2188p4620o6406o989k2652N463
18322B5315O0169k0447L0622Q9079m3019Q5467p716j00597N3347j18332l1232
$$ y = [-15581, 79376, 187432, 318242, 481246, 688461, 912825, 1041738, 956757, 981184, 1136725, 1274850, 1214469, 991367, 762152, 570006, 462851, 392634, 310387, 197178, 180655, 104735, 61308, -19163, 35379, 83731, 65442, 94156, 154703, 225337, 159709, 68228, 16585, 61174, 124583, 199066, 265508, 167201, 69224, 41870, -4918, -99572, -93549, 94053, 168862, 98655, 67030, -30970, -25019, 31754, 131630, 257636, 234223, 110132, 36284, -70398, -54589, 72454, 44227, -18642, -85510, -78848, -52019, -58342, -24191, -44049, -48341, -24748, -18519, 125921, 141925, 160319, 158331, 190519, 115899, 49493, 42504, 19852, 25315, 85484, 65037, 95659, 184738, 141719, 227186, 219470, 118873, 172220, 53888, 22656]
18311B2656Q1782J3684O9466N8490j1331N528J8986J5481m0204O4918M5243R7415
18299D42114M6559l0659n9717N4016N8962o9297j2729j4512j46852k4081J220
18288B45024o3881p1983J8134O8427o8313p8409J0908M5326L170Q9051o7993l4764
18276I4697k6382q168L1232k4018l7700L5483m3063O4487m0358J4901L2208k6754
18264F6565L8942J2665r020p844J2026M0416n9327K2245k9066r2279n1475n1557
18252a07709N3158L8856M0227R1328q5074m1827L3039K0539O3483j5999p6097
18241A3924j4396m8787l3899K6723k8284j18006M2133P4947M3462N1223j7991
18230h951n6433L4951P3875O0367l919l8592J8433L4161k5897n5837j1718j5183
$$ y = [22656, 104438, 118122, 187588, 246078, 234747, 240275, 259261, 274742, 234538, 299456, 344699, 442114, 488673, 458014, 398297, 452313, 511275, 441978, 429249, 414737, 267885, 243804, 245024, 181143, 109160, 127294, 195721, 127408, 48999, 59907, 105233, 108403, 197454, 129461, 94697, 68315, 60147, 91379, 67361, 29661, 65144, 22081, 86568, 46210, 61111, 93319, 66565, 105507, 118172, 109152, 101308, 113334, 153750, 94423, 116668, 87602, -4677, -56152, -107709, -54551, -15695, 24532, 115860, 30786, -11041, 21998, 42537, 106020, 90021, 13924, -472, -49259, -83158, -56435, -84719, -202725, -160592, -85645, -42183, 9040, -8951, -65384, -30433, 43442, 103809, 99890, 61298, 79731, 113892, 87995, 32158, 20440, 5257]
18218E257M5007q0893m0951l5443K0090M4141N6962J9477K9712N0723j2820L0811
18206A32073o3001q9122n9353L4129O0541R159L7454l8447p3458L5913m4748l2151
18194i1011j560r673P383l5293J5197j1942M9677n295q9096q3040J23363Q9913
18182d1377R4606L2738R858q191k5297K7391l2270m7146K5263J13098q0622r4978
18170b6927m3443M8156O6167m9300o213p0649j03564j6788m1969O5484J59519
18159a9527j2967j730M00L6894J6046l2410j7971m8347o3774M0081J6978L0176
18147e6151N8020p3759j533o4689l940N0013O0920k9279K5617N8604j939O2019
18135H3903j6203r6761L2215P7939l1709K7075M4204q0220j00668m6034R2288
$$ y = [5257, 50264, -30629, -71580, -107023, -86933, -42792, 14170, 33647, 63359, 114082, 101262, 132073, 69072, -20050, -79403, -45274, 15267, 24426, 61880, 23433, -50025, -14112, -58860, -91011, -92571, -102244, -94861, -130154, -114957, -126899, -77222, -82517, -171613, -254653, -131290, -41377, 53229, 85967, 95825, 87634, 62337, 89728, 57458, 10312, 35575, 148673, 68051, -26927, -70370, -22214, 43953, -5347, -11560, -82209, -185773, -202561, -244530, -179046, -19527, -32494, -34224, -33824, 3070, 19116, -13294, -31265, -79612, -143386, -103305, -86327, -56151, 1869, -71890, -73423, -138112, -142052, -92039, -31119, -60398, -34781, 23823, 21884, 83903, 67700, -29061, 3154, 81093, 49384, 76459, 120663, 40443, -60225, -106259, -13971]
18124a3971J73944m3563j57562N2737K8209k1805N4646j12619m8460j938j0232
18113a00614q6576K3238M6108j46756Q3635J25764L2909K3224J0134q382K0589
18102B3273j8247m782n130k5728m3331O7479o2566k9537j4988M4727m1621J7099
18090i3352J22504o786n3116n9717q150p1208m4737J16708J36601p3263R3605
18079E9089R2279q308K6093N2411r4346j18289O3992r6921r0256l498o4189n9935
18067b41878n9530M9160L9754m7019L5927R608j4858J01910N1055j5722J5070
18056g6523k7410o7637Q0635J05858L7961j4374l4094l3616R714k7628J7394m9230
18044g8950N0021M7848J2896P917k8552L066p1130p3122j22991Q9899J90390P8760
$$ y = [-13971, 159973, 116410, -41152, 11585, 39794, 17989, 72635, -39984, -88444, -90382, -100614, -187190, -163952, -117844, -264600, -180965, -55201, -22292, 932, 11066, 2684, 23273, 5026, 244, -4886, -30614, -73945, -6466, -69032, -98569, -113557, -68830, -110451, -93352, 29152, 22366, -30750, -90467, -98617, -169825, -214562, -97854, 38747, -34516, 59089, 151368, 143060, 169153, 221564, 127218, 8929, 72921, -24000, -114256, -117754, -181943, -241878, -301408, -252248, -212494, -259513, -223586, -213978, -228836, -126926, -75871, -91593, -76523, -103933, -171570, -90935, 14923, 52884, 38510, 4416, -29200, -19486, -47114, -29720, -78950, -28929, 18919, 31815, 39732, 11180, 14246, -56884, -130006, -252997, -163098, 27292, 106052]
18032A06052J5112k0938k1647m0495j06466k6602O3488l8834Q4920J11030M0591
18021A66211q390q0882j1729p4808O0556o4815n0723J7804J9866l9409L2440J7197
18009a6682q8794n3792J40090N9859J1977o3628k5892k9624N0934R38l3191k362
17997e0167N9718l7587p7436R295N1480P6593N1448P9241P7562j2909j02905l890
17985A20443K0880p5229n8101r263O496J31309L7748l1126l007n1323o8940O0107
17973G9994J18268J12705k9256n722N0618K5430K4273n6n284N9664j0518p8209
17961C41907l0068q3391l3292o8297j05223J9595N8666o2429j2261L8425K9647
17950I3279R454L2382q8985o3101J12463k9162L9435l7157r6038o7918M275j9093
$$ y = [106052, 121164, 100226, 78579, 38084, -68382, -94984, -31496, -70330, 14590, 125620, 166211, 157821, 76939, 65210, -9598, 50958, -13857, -64580, -46776, -26910, -66319, -33879, -16682, -105476, -159268, -19178, 40681, 52658, -10970, -36862, -66486, -15552, -14614, -47805, -50167, 9551, -28036, -105472, -96177, -44697, 31896, 83344, 162585, 240147, 227238, 124333, 120443, 141323, 66094, 7993, -1270, 5226, 136535, 174283, 143157, 140150, 88827, 19887, 79994, 198262, 310967, 281711, 275989, 326607, 352037, 376310, 376254, 370970, 430634, 420116, 341907, 311839, 228448, 195156, 126859, 21636, 41231, 99897, 37468, 25207, 63632, 93279, 102733, 135115, 46130, -16971, 95492, 66330, 105765, 68608, -27430, -95348, -91073, -110166]
17938a10166L1207Q4070J02449J9179j8128k4077L6735k6885k9314M8144p8703
17927C4511N475P821K5723R13q7399M766J20633l5924m8430l5269N2741r088k3301
17914A3172k1671p2993j2022J6238Q1012q5025q2673R5408M4511P8645k870K0514
17902G2246q4607r6661j6715J1945N215k3712q7659N3289K7612J40667O5154m763
17890F2011l3776p8925L006L814K9532M4355L1219o3131p4164k2082m1854k3303
17878a63298P3152K2765o3892L9952J0389J6889p058M4596N9594l7597j15562
17867a20070j7124L3227R5564M4060j19370j21301M411L2891K5456Q2561O0353
17856F58k4139n8138k9583N1839k2922o1228K0449P0494K7349j27020j07402J36813
$$ y = [-110166, -78959, 5111, 107560, 126739, 108611, 84534, 121269, 94384, 65070, 113214, 34511, 39986, 47807, 73530, 74443, -12956, -8190, 112443, 76519, 28089, -7180, 45561, 36473, 13172, -8499, -81492, -93514, -77276, 3736, -81289, -163962, -68554, -24043, 54602, 51732, 72246, -12361, -109022, -125737, -113792, -108577, -132289, -219948, -166659, -139047, 1620, 66774, 62011, 28235, -50690, -47684, -43870, -14338, 30017, 61236, -1895, -76059, -98141, -139995, -163298, -90146, -67381, -131273, -91321, -80932, -64043, -71101, -26505, 33089, -4508, -120070, -137194, -103967, -8403, 35657, -83713, -205014, -200603, -167712, -142256, -59695, 658, -23481, -81619, -111202, -59363, -82285, -143513, -123064, -52570, -25221, -152241, -259643, -122830]
17844a22830J42986k9022o9385J2762j808M4775J4248N8265J42822j8910j65852
17833H051j28720Q1888L3985m6611p34k894O9982M2332r8379m1328K7103N1626
17821c699l3144n0562l3196K2470j6755O5292J00681L6527p1525m8301L738k6156
17809e4630r1j6111P67O6389k2059J7677M1284k8550p0416n6201K4010O7236J3363
17796a7332L9297M281p9623n3285q5839R7225J30196K1766j3571l4168M2699M7322
17784I8968o5717m4115M263r6478p929J9267N3200k480r4756l8298N6253J7708
17772a00114K4337P9192M7309M1564o7504j9489m236N7479O5635J5014L8288o3641
17760A13834q4088K0355l3972k4702O0402J0498r9989k228l3598m7432j8240O3796
$$ y = [-122830, 20156, -8866, -78251, -65489, -67297, -22522, -8274, 49991, 192813, 173903, 8051, -120669, -38781, -4796, -51407, -52141, -55035, 14947, 57279, -41100, -82428, -55325, -3699, -36843, -87405, -120601, -98131, -114886, -49594, 51087, 87614, 16089, -32212, -28474, -54630, -54721, -70832, -70065, -3676, -25735, -8058, 33226, 4676, -65740, -121941, -97931, -30695, -17332, 21965, 26246, -53377, -106662, -192501, -95276, 34920, 56686, 43115, 8947, 51646, 98968, 33251, -10864, -6601, -103079, -111008, -91741, -38541, -41021, -135777, -174075, -117822, -100114, -75777, 3415, 50724, 92288, 24784, 5295, 1059, 58538, 124173, 139187, 177475, 113834, 29746, 50101, 16129, -8573, 51829, 62327, -37662, -39890, -73488, -120920, -139160, -75364]
17748g5364O3288j7485P1134R1815p6775n9264J365K7411j7997N9484K8819o0982
17736C5449J795l0163p4896q329L1886K4237n4921k283J8007K8504L1360J2019
17724A2665n7994j4212O0601K6601l0437J5755o7754L017j862N0761R1352J04517
17712A93010J838j20769j74882p9133Q5484J24695k5576j15123M4425N9429J5721
17701I119j7698l8687k1364p2313J9975J16134K6900J36041L7202j12342O4157
17690A47124P4571k0059r1426m0748P0779k6880j18667j26633j0867N5887P8607
17679h312n203N7613r115Q827l13q2711k9245J24351k6776J5708J1088Q1939J1856
17666A49707J5088o6200j9536j5344j3429o3654Q390P2716J26290M3412r6215
$$ y = [-75364, -12076, -29561, 41573, 133388, 56613, -2651, -1286, 26125, 8128, 67612, 96431, 35449, 37244, 7081, -67815, -76144, -44258, -20021, -74942, -77225, -59218, -30714, 646, 12665, -45329, -59541, 1060, 27661, -2776, 12979, -54775, -51758, -53620, -2859, 88493, 193010, 194848, 74079, -100803, -179936, -94452, 30243, 4667, -110456, -66031, -6602, 9119, -8579, -47266, -68630, -140943, -120968, -4834, 22066, 158107, 195309, 82967, 147124, 221695, 201636, 110210, 69462, 140241, 113361, -5306, -131939, -142806, -86919, -8312, -13515, 44098, 34983, 43810, 43497, -39214, -68459, 55892, 29116, 44824, 55912, 137851, 149707, 164795, 98595, 79059, 63715, 50286, -13368, -4978, 67738, 194028, 237440, 141225]
17655A41225R5407P6187j14395J0398N6232m8279j7976J10059M6792L569N3158
17644D12377R7572N519j28807j0581K6614p0992O37n6942j4467J0560l5547j11760
17632A24183P9509K5237m8673j9548n499J1861M5646J8536j2490q3737J4154j5068
17620A34111q3396j2446R0691J0381n9289P5495j7883m3504p7984r0422P3708
17609e38O6240K230K9632m4544j0066p9813k5410o3058k5158Q412P8010J07754
17597D3691J30278Q2061o7399j00672l5241q5385o9713J27785O0071l006n9813
17586B2657j6045n833r2138l7253j4954L4759n692L1405N8145K6182k1555L157
17574a7165J8210K7117m5402n3835Q9438j1894o5085P443n3711j5619Q0483R8554
$$ y = [141225, 236632, 312819, 198424, 208822, 265054, 216775, 198799, 308858, 355650, 359219, 412377, 509949, 515468, 386661, 376080, 402694, 331702, 332339, 275397, 260930, 271490, 235943, 124183, 203692, 228929, 180256, 160708, 155209, 167070, 212716, 231252, 218762, 135025, 149179, 134111, 50715, 38269, 128960, 139341, 80052, 155547, 137664, 94160, 16176, -74246, -538, 65702, 67932, 97564, 53020, 42954, -36859, -62269, -125327, -150485, -142073, -64063, 43691, 173969, 256030, 188631, 87959, 52718, -32667, -102380, 25405, 85476, 82470, 22657, 6612, 779, -91359, -128612, -143566, -108807, -114499, -83094, -24949, 1233, -20322, -17165, 1045, 28162, -17240, -71075, 18363, 6469, -58616, -51173, -104884, -120503, -40020, 58534]
17562E8534m0680j05684k5233o988k9722m5003k2566J1957J15286M8435M0836
17551h28L9039l3294o679p0562J4705L4255R5468Q9856k8509j03561j69371j6722
17539a56203O415K9816m653L0405J9255J7311K0892O735r5795N7189K09141j4983
17527A25525r2917m7309j3701P254K9820j7276j7941n4002q134M9536Q1170m3259
17515a234o7139K3328q6420j0658J34706j3699j01728o7175O91M5156J33267K95
17503a0610q7161j04069j1485J30996J59351j11661j7073K2306J8791J268l4904
17492d4251L3610l6005K4750Q6M090k9572j3650n4695L6579Q3508J4487m6896
17480b7959k050Q3616J45056l647n1283j7233k2556j22016l7819k324j08222J3152
$$ y = [58534, 17854, -87830, -113063, -120051, -149773, -194776, -217342, -205385, -90099, -41664, -828, 38211, 4917, -1762, -72324, -57619, -23364, 72104, 161960, 133451, 29890, -139481, -156203, -149788, -119972, -124625, -94220, -74965, -57654, -36762, -30027, -125822, -68633, 140508, 125525, 32608, -14701, -28402, -21148, 8672, -8604, -26545, -80547, -88681, -39145, 42025, -1234, -68373, -45045, -131465, -142123, -7417, -21116, -122844, -190019, -189328, -144172, -10905, -10610, -97771, -201840, -213325, -82329, 77022, -34639, -51712, -29406, -10615, -9347, -44251, -10641, -46646, -21896, -21810, -17720, -47292, -60942, -115637, -79058, 4450, 18937, -27959, -30009, 53607, 198663, 195016, 143733, 126500, 103944, -18072, -55891, -58215, -166437, -153285]
17468a53285P4453L6875j2242j45605J07065J17625J65103j00200l5965R4948
17458A48772O2615j5739o5500m5540j15534j7570l1532O8259M82k1588k753L167
17446c2461m4068n5426J4120K5413L4586J3629n7040l0945l3075L1857J7605K8067
17434h7738n6816n8818J23049J90871M8938K0611l752j21298j19039k7943O2478
17423b9457J6309n3178P7565J09159p1327j20307m5122K812J19868L8315l2459
17412A2178k8754l5118o2023k1539k3536j4123K8921J02519K5795L2803O4394
17401H1517N240o2981m1770m4524J03440m6282P0976l1963M4202j6523l8544j6785
17389F003O2635l0377k3553o5780K3591J0524q5286q2060P2360R0006N0012P89
$$ y = [-153285, -78832, -41957, -54199, -199804, -92739, 24886, 189989, 89789, 53824, 148772, 211387, 195648, 130148, 84608, -30926, -48496, -80028, -11769, -11287, -32875, -35628, -32461, -76529, -131955, -117835, -92422, -57836, -44207, -101247, -132192, -165267, -133410, -115805, -87738, -144554, -203372, -80323, 110548, 159486, 180097, 176345, 55047, -63992, -91935, -29457, -13148, -66326, 11239, 120398, 49071, -71236, -116358, -113546, 6322, 44637, 12178, -16576, -51694, -113717, -135256, -158792, -172915, -143994, -41475, -15680, 17123, 81517, 86757, 23776, -17994, -62518, 40922, -5360, 65616, 33653, 77855, 61332, 22788, 6003, 68638, 38261, 14708, -51072, -27481, -16957, -102243, -184303, -111943, -21937, 28075, 28864]
17377B8864n6793m6706j8601m993o3728j41490J9218N9439J51051Q1420k2795
17366a5114l9760K7566Q3919K6523j44241n1468M3578J03969O492m2504q206m4192
17354e3438J3688l7472M6874J27713j7246M5509n7332k1904n9113o0723p3934
17343a47378n9451K5669R0322J40273q3348j11647P38M1728j01638j3855O9507
17332a49080K03459J4685p4994j68567k9522J05785J366n7164N9912O2623L5236
17321C739j06113j1173o7139K7204m303O0025L7960M980k944R607q812K2023j746
17308c6692p2287o1154J8898K974R0795R4690M2015O85n5137k5795M8307Q1187
17296A28486m8525m9295j8163K4731n8909k3663k8767N5983R562L0925J1728m4054
$$ y = [28864, -27929, -74635, -93236, -98229, -161957, -303447, -284229, -224790, -73739, 7681, -15114, -54874, -27308, 56611, 83134, -61107, -112575, -68997, 34972, 41464, -1040, -9246, -53438, -39750, -77222, -30348, 97365, 80119, 125628, 68296, 46392, -12721, -73444, -147378, -206829, -181160, -90838, 49435, -33913, -145560, -144822, -103094, -204732, -218587, -149080, 54379, 69064, -5930, -174497, -204019, -98234, -96868, -154032, -94120, -31497, 3739, -102374, -113547, -180686, -153482, -157785, -97760, -59800, -54820, -57764, -48157, -56969, -34946, -36692, -108979, -170133, -151235, -148261, -57466, 37224, 79239, 79924, 24787, -1008, 47299, 128486, 79961, 30666, 12503, 37234, -21675, -45338, -74105, -18122, -8560, 22365, 34093, -9961]
17284i961n8690r4818j4379J36417J4415l7589n6719j9242O5021Q5283p5597q4419
17272a50278K6396J2101l236k2131j7272J2400R2228m1868j06373J8194k7338
17261b07177K8228J53665j7166p2203P0613N1338j240P7372k5472n4770N3411
17250E6599p736l7299q145J02326k8228q9851N4440m624m2228M2996j10413K6996
17238d5167N79p62M2814J5415l4294j32778l7641J6841j5898k7866Q6602R4192
17226c7963j5303J01369J1944j7485L3838O4600q6484j25230J6846J06381M0931
17215I3444J5767m6205n786p5103k8051M3229j2330J4480R9351r1764j44997q772
17203a46737J11843M7743n2766n4349j6417J9263l1839m1929R9055P9297O997
$$ y = [-9961, -68651, -163469, -177848, -41431, -27016, -64605, -121324, -140566, -75545, 9738, -65859, -150278, -123882, -111781, -115017, -137148, -154420, -142020, -49792, -91660, -198033, -179839, -207177, -178949, -25284, -42450, -114653, -44040, 7298, 6058, 83430, 57958, 3188, 56599, 48863, 11564, 3419, 105745, 77517, -12334, 42106, 37482, -4746, 38250, -72163, -45167, -44588, -45350, -2536, 12879, -21415, -154193, -191834, -174993, -190891, -218757, -132155, -37963, -53266, 48103, 60047, 42562, 76400, 141000, 54516, -70714, -53868, 52513, 93444, 109211, 63006, 57220, -17883, -45934, -2705, -15035, -555, 98796, 7032, -137965, -146737, -34894, 12849, -39917, -94266, -110683, -91420, -123259, -165188, -66133, 13164, 20161]
17192B0161J0501N2537M8933O3705o1999q0685J9369J837n9871n9803R040J7477
17180a8798o6545k0121r703m0510L160J44903n7242l7394J9918J1779o885N1304
17168b6134O0083J6766j8419q1781o9533K5685L1917K0112N1977J0091K5366R462
17156E5592k509K2092M4923p0557j0975m072j6976m850R0018j5550m6588j16366
17144g5818j13877j2744J15503M4256N0799M6023J4970j4810o6795j2738M436
17133b0795J493J232j1761k942J14749J28836r5765r8697j00042l9751P105R7434
17121a8904L9607J6849q7665l1819o1767m0912J1197K2931J15114Q999p4269M1552
17109e9087M2815R7440K9684k7393N8915l1667j43530n4433P5736Q0295l1820
$$ y = [20161, 30662, 83199, 132132, 195837, 133838, 53153, 72522, 74359, 14488, -45315, -36275, -18798, -85343, -105464, -115167, -155677, -152517, -7614, -64856, -102250, -82332, -70553, -77438, -26134, 33949, 50715, 32296, -49485, -119018, -93333, -61416, -41304, 10673, 20764, 46130, 55592, 53083, 75175, 120098, 49541, 38566, 34494, 17518, 12668, 102686, 87136, 40548, -75818, -189695, -202439, -86936, -42680, 8119, 54142, 69112, 54302, -12493, -25231, -20795, -19302, -18070, -29831, -32773, 81976, 210812, 115047, 16350, -83692, -123443, -116338, -18904, 20703, 37552, -50113, -81932, -143699, -184611, -173414, -150483, -35369, -26370, -100639, -59087, -16272, 81168, 110852, 83459, 142374, 110707, -32823, -87256, -11520, 68775, 36955]
17098C6955j17316L3824l6846Q2753L0068p2693K6029J37782q7448k990k6460
17087C658J6280P9359Q779N323n2551o504L4650m7746p4468L6193K970m1387m1799
17074g7243o9954m9453o3283P296R5392J25234J1306K6254O5925m4985j40735
17063a14246l4820k6230J38342Q4130n6350J3767j3117n8683q2001j50393l7525
17052c37126R6565J21123M7844n1377l893M875J06948j6315J6162J7791j5132
17041a2535N9004k6792j54348p1129K5135J9587M8291J03873J1221q4837O2599
17030a9931J25764p138Q848J5763r6491o3792m7992r2027o1278P4232j7784P1180
17018a10646J30367j2214J22574J7006o7037r2678j08314k2554j06037J5995O7904
$$ y = [36955, -80361, -46537, -83383, -630, 29438, -43255, -17226, 120556, 33108, 30118, 3658, 19938, 99297, 108076, 113399, 60848, 54344, 88994, 41248, -33220, 2973, 5943, -35444, -77243, -147197, -196650, -259933, -252637, -157245, -32011, -20705, 5549, 71474, 26489, -114246, -149066, -175296, -36954, 47176, -9174, 4593, -8524, -67207, -149208, -299601, -337126, -240561, -119438, -71594, -122971, -126864, -121989, -15041, -31356, -15194, 2597, -12535, 46469, 19677, -134671, -205800, -180665, -161078, -112787, -8914, 2307, -82530, -19931, 105833, 98695, 107543, 123306, 26815, -36977, -84969, -176996, -238274, -164042, -181826, -110646, 19721, 7507, 130081, 147087, 80050, -12628, -120942, -143496, -249533, -233538, -165634]
17007a65634O7954L6053K1008k552L889N5188P525k2882j03159j41187M1961r784
16995b11620K1731M4395R1556P9159m6179n9654j3459J8455R4052k2719n4815
16984e9098P3560M7622o1924j09132L5147L5977m1313n6299K4846m1466J2679
16973a39401n4425J0005K4362o518J0781J20551N6568m7162p1624l1105j0445
16962a38413P0783Q22j4596m9433J4480P1848p384k6817p828M0494o702l7083
16950h9829P7497n1335M4211L1313K7410O4282k5160o7221Q093m6971q9234l8978
16938a55922J3994J1330N2196L9700K9499k3852n5704K1213M6750o2870o2296
16927a45962L8375J49801J14741q6189o2827k6627L8858R4052m8697Q840J7803
$$ y = [-165634, -97680, -61627, -40619, -43171, -39282, 15906, 23431, 549, -102610, -243797, -201836, -211620, -189889, -145494, -53938, 25221, -20958, -80612, -94071, -75616, 18436, -4283, -59098, 14462, 62084, 160, -108972, -73825, -37848, -79161, -135460, -110614, -152080, -139401, -193826, -183821, -159459, -165977, -155196, -34645, 21923, -25239, -96863, -127968, -138413, -67630, -66808, -81404, -130837, -116357, -44509, -51893, -78710, -86538, -46044, -52746, -89829, -12332, -63667, -19456, 11857, 39267, 103549, 78389, 11168, 19261, -27710, -116944, -155922, -141928, -130598, -78402, -38702, -9203, -33055, -88759, -67546, -20796, -83666, -145962, -107587, 42214, 156955, 70766, 7939, -18688, 20170, 114222, 65525, 74365, 92168]
16916I2168l3110k0953O5811n134L53k8886j1187j5807K2355Q0400j10242l8257
16904b489o0869j2491l1278q5459L6437R5480l114Q8904m0809k5151l2935M3322
16892c0452o976J141L8697j4444K6504K6053j01129o4201n1855L9154J9177N8353
16880e9978L7531j0738j50107l0316R2809M7189p685N6436M0249l1333J0723l0566
16868c5786Q4908L4216q809P1812n4705k7557N5631l7570r353O6033j01608r922
16856B7290P2657K0981J1164n2380j25291k5656J40240K0340M0958q2786o2552
16845a5035m2500L1044j7182n2192p9211m176P8119M6704m8335l3079P9639n656
16833f1860m1810j40062k3031M2538M2708J03188j3793J9671j5672O1220P6331
$$ y = [92168, 59058, 38105, 103916, 98782, 99135, 70249, 59062, 43255, 65610, 146010, 35768, -2489, -63358, -75849, -107127, -192586, -156149, -60669, -63783, 25121, -15688, -40839, -73774, -30452, -37428, -36287, 2410, -12034, 14470, 40523, -60606, -124807, -176662, -137508, -118331, -59978, -22447, -33185, -183292, -213608, -120799, -73610, -81295, -24859, 15390, -15943, -5220, -35786, 49122, 83338, 74529, 146341, 91636, 64079, 119710, 82140, 72787, 138820, 37212, 27290, 99947, 120928, 132092, 79712, -45579, -71235, 69005, 89345, 130303, 47517, -15035, -57535, -26491, -43673, -95865, -175076, -179252, -101133, -54429, -102764, -135843, -56204, -61860, -103670, -243732, -266763, -224225, -181517, -78329, -92122, -72451, -88123, -26903, 49428]
16822D9428p073j184n7460L8187K255J4352p4055o8567k5388r555O4874J22207
16810D8021p532k2847o7700j18308K7480Q1240k6607q0957j8680J11847m6204
16799a20247m4398R1742j8413J8160q37o4955k9935M4545j6398n3348K0011j05
16787a74178R557J5153K8233j1304M483L5298M4567O4346J4123Q8028J4834q3931
16775D9209o5341N8743P321m9954p3193l8413k5614j21630o6483O8114K01110
16764e6131P4895j26448j04665n3747O2847O377L2633J20867j22398n7935J0898
16753b12807K847L8854Q0920j579m9731m7127k1212k9408N4577M93j1185P5084
16741a20274J5865k2306n5226J8576o36O829j1779l5329Q8232O6590J5625n7709
$$ y = [49428, 42355, 41171, -16289, 21898, 24153, 38505, -35550, -104117, -129505, -139060, -74186, 48021, 40489, 17642, -50058, -168366, -140886, -59646, -86253, -167210, -185890, -74043, -120247, -164645, -72903, -91316, -73156, -73993, -138948, -168883, -124338, -140736, -194084, -174073, -174178, -164621, -149468, -121235, -132539, -128056, -92758, -48191, 16155, 30278, 118306, 133140, 49209, -16132, 42611, 49932, -22, -73215, -111628, -137242, -258872, -325355, -257241, -56131, 18764, -107684, -212349, -266096, -203249, -196872, -164239, -43372, -165770, -223705, -212807, -209960, -171106, -90186, -91765, -141496, -188623, -209835, -239243, -184666, -184173, -195358, -120274, -104409, -126715, -181941, -163365, -164001, -157172, -168951, -204280, -116048, -49458, -33833, -91542]
16729i1542o7277L9383j5856p7839M9026L6955P4136Q9483q3513m5664R2047L2005
16717C1344j028L9022n4193M638J4902r647N773l4725p208j3683j5221n2408j7102
16704a09536O1688Q8433J5569l2489m129M9398M8259K9542r4373k1492O2765N3813
16692A47448L5587r2200j24534j1076J4393n6990Q261Q1563M8565p3921m7182
16681g0086j7513N7879M4095m5220j9238n4437k0023J4640K8799k5682K2431J22127
16669C7772p7288j04091k7738M5747M7350n910j341q090p1665M7224L8702n0567
16657a29895r0716J30856J64994K8772N2685J09665l4481j89528j0991k0825n1941
16646d1405L5135L0638K2340l4665P5821j863K040K2125q2143j6469L1150j9393
$$ y = [-91542, -158819, -119436, -135292, -213131, -164105, -127150, -53014, 36469, -47044, -92708, -661, 31344, 30316, 69338, 15145, 19783, 34685, 25038, 30811, -3914, -11122, -24805, -40026, -92434, -109536, -47848, 40585, 56154, 23665, 19536, 68934, 117193, 146735, 52362, 30870, 93635, 147448, 183035, 90835, -33699, -44775, -30382, -87372, -79111, 2452, 51017, -22904, -70086, -87599, -29720, 14375, -30845, -50083, -104520, -124543, -109903, -81104, -106786, -84355, 37772, -39516, -143607, -171345, -125598, -78248, -84158, -85499, -93589, -165254, -118030, -79328, -129895, -220611, -89755, 75239, 104011, 156696, 266361, 231880, 42352, 31361, 10536, -41405, -6270, 24368, 46708, 12043, 87864, 86001, 88041, 110166, 28023, 11554, 42704, 23311]
16634B3311j876n4389J2014N5285j00267r3898Q526j2143O3161R9559N1227J4377
16622F4887j9116n5256J4807L8538m4384l3398k674k5032j9692j4476Q7603K8273
16610B0080M8379l7847o2273J7904P0880J4773p7883p1612l8202q960J15978K4387
16598A5604O754L216m1496j00686q153L4895P3666R3202N019m6332n4406O34m0216
16585e8299n2795N476K2096O5610M5867l6088M9267N8137j10466M2733P199O987
16573D5724J28435k1164j71764p4729m0327K3482j6695k7009k8117l9117M9759
16562a71522j187l9735j4176Q6786J46752M4728l4751n8333r4836Q468m6203R1395
16550h2614J75022Q1285M0321m0003m3040q3076O5027J1158j8354L4678m7618
$$ y = [23311, 21435, -32954, -20940, 34345, -65922, -159820, -151294, -163437, -100276, -717, 50510, 64887, 45771, -9485, 5322, 43860, -524, -33922, -36596, -61628, -81320, -95796, -8193, 20080, 68459, 30612, -31661, -13757, 57123, 71896, -5987, -77599, -115801, -124761, -8783, 15604, 22358, 25574, -15922, -116608, -124761, -89866, -16200, 77002, 82021, 35689, -18717, -18083, -58299, -111094, -105618, -83522, -17912, 27955, -8133, 41134, 99271, -11195, 31538, 38737, 45724, 174159, 152995, -18769, -93498, -133825, -110343, -127038, -154047, -182164, -221281, -171522, -172709, -212444, -226620, -139834, 6918, 51646, 16895, -41438, -136274, -127806, -174009, -82614, 92408, 173693, 214014, 174011, 130971, 47895, 112922, 124080, 105726, 140404, 92786]
16539I2786q8162K846J4721N8280l8889j7587m4083k7186k1936O6565J4375k8336
16527a6606l2108r3958P660J2972L149N2685K4383K1493M474M7522j4913K4175
16515D0928j8238j6366n1714j74595K602K0745N5607K3832Q1893M8146k5727p1973
16503h4860O9020J105j01735n5617n2743L0753J7948n724k8198M3028N2673n369
16491a19719k3563M7846P2321M8558o9693j8450k758n2236J4487N7704Q6164l0771
16479I890n6187k9446L0147N4927P074n1149j3120l441K0253j0574l0798K0169
16467e2255K1017j03337p495M5866N380j7968P4822M3259K5626N5937k9156j05540
16455d3844j3553j6241o7280Q0884M8778l5419o440j5470k2773Q0005J7393k7562
$$ y = [92786, 4624, 7470, 22191, 80471, 41582, 23995, -20088, -47274, -69210, -2645, 11730, -16606, -48714, -142672, -135012, -122040, -118891, -66206, -41823, -20330, -15856, 31666, 16753, 40928, 22690, 6324, -45390, -219985, -217383, -196638, -141031, -117199, -35306, 12840, -12887, -84860, -15840, -14735, -116470, -172087, -224830, -194077, -176129, -181853, -210051, -167023, -114350, -119719, -143282, -95436, -23115, 25443, -44250, -62700, -65458, -117694, -103207, -45503, 40661, 9890, -46297, -75743, -45596, 9331, 16405, -34744, -47864, -51305, -31052, -41626, -72424, -52255, -31238, -134575, -142070, -96204, -90824, -108792, -33970, 9289, 34915, 90852, 61696, -43844, -57397, -73638, -140918, -60034, -11256, -46675, -53115, -68585, -91358, -11353, 6040, -21522]
16443b1522L5436L3939N5825j07395k1597l4411q521r1526K6837P242J14789O1976
16431E1072q6159p8047o91k3877n268J611L7622J2321L1835Q0m1586q7306K569
16418a85824O0307N0175l4148l2285P4267N6993l8239L3552O2023L3523K4054
16407A04398j9915m7698o5030o7881L2985O7322k6003j3679n2182p1317J7288
16396a41712L0881P104P9700J0313L9977m0338q4802q6673R3303N0569k7801j7908
16384h7387N0819N4428J211j2790J4586j29475j22888P3730Q4782Q0679O9516
16373G7211j8820Q1616k4011o2367m4740j7173m969K8570j899K4362L5600j57411
16361h4031P3994Q9425M7954r737p7187j08886j8824O7125j07036J8445M3985
$$ y = [-21522, 13914, 47853, 103678, -3717, -25314, -59725, -68246, -159772, -132935, -125693, -10904, 51072, -35087, -113134, -113825, -137702, -142970, -141359, -103737, -91416, -59581, -59501, -101087, -188393, -185824, -125517, -75342, -109490, -141775, -67508, -10515, -48754, -15202, 46821, 80344, 104398, 84483, 36785, -28245, -96126, -63141, 4181, -21822, -35501, -87683, -159000, -141712, -110831, -103727, -24027, -13714, 26263, -14075, -98877, -185550, -92247, -41678, -69479, -87387, -36568, 17860, 19071, 6281, 20867, -108608, -231496, -157766, -72984, 7695, 77211, 58391, 140007, 115996, 53629, 8889, -8284, -13253, 15317, 13418, 37780, 73380, -84031, -10037, 79388, 127342, 117605, 40418, -68468, -87292, -20167, -127203, -108758, -64773]
16350f4773O3880j2181M7012o8110m0750J2035n4529j1238M1564j2580N5401J2893
16338c1376J8914p1864j68414P0318J14919J32355m5658o2623Q4784K3667k5369
16327C9653p4127k6293M8748J862p9620o3269P360Q4179o9813n6884P9484R8869
16315i851K4480j7862p1923r5948k3257O5668K0103J5460K809J5834L668J09896
16303C9077J6607o7465k1437K5190p1297l5856M6678J14962N5605k5557l0998
16292D5509L4431j952J0019l8857p6672J6062n2570M9175Q041o628n4423j8438
16280h6303J31058p2029o0630L8390L1375l7442j7459p455m9083j3064M2228N4203
16268d6211P03m1478j5874q385K0442J8241l9416P1569M6040L3089n4311l5520
$$ y = [-64773, -893, -13074, 33938, -34172, -74922, -62887, -117416, -128654, -87090, -99670, -44269, -31376, -12462, -84326, -252740, -182422, -67503, 64852, 19194, -43429, 41355, 65022, 39653, -34474, -60767, -12019, -10157, -89777, -153046, -145686, -61507, -131320, -188204, -108720, -9851, 14629, -3233, -75156, -171104, -194361, -128693, -108590, -93130, -90321, -74487, -70819, 39077, 55684, -11781, -33218, -8028, -79325, -115181, -68503, 46459, 102064, 76507, 45509, 79940, 77988, 88007, 49150, -27522, -11460, -64030, -14855, -6814, -13442, -67865, -86303, 44755, -27274, -87904, -49514, -18139, -55581, -73040, -80495, -129578, -142642, -100414, -46211, -45508, -86986, -102860, -111245, -90803, -72562, -111978, -40409, 5631, 38720, -15591, -51111]
16256e1111P3629L081p4852m5514O377r581P7001J21927j7281j29591J3917j2691
16244d4689K5200j9954m4042L9448N0928p7210n3298Q2693m3832l9317J3291K2767
16232h8015P8142M0290j9778l7349l7581j6187J2491J00431K8984j75399K0070
16221i3901M1159k5234J6406m3022j05205n0285P3339L9497P2679p1549N0107
16210i6009J04798p8750q6426L0922j9817j1011n4899j6731J1467M8732Q3338
16199h4386l3268L3123K1067k8163J7241P163L1381M3355o2392j5993R1836K8427
16187D9391q1421n3417L4649R2038P8007o0149q3876r8853O2161M2465R7827J2010
16175I0832k3646p23j4387r4698J6612j7798P7394Q4568j4654l3672n516K8800
$$ y = [-51111, 22518, 25599, -49253, -94767, -88390, -97971, -20970, 100957, 83676, -45915, -31998, -44689, -19489, -39443, -83485, -44037, 6891, -70319, -123617, -40924, -84756, -124073, -110782, -88015, -9873, 30417, 10639, -26710, -64291, -80478, -67987, 32444, 61428, -113971, -93901, -52742, -77976, -61570, -104592, -209797, -260082, -186743, -147246, -74567, -146116, -96009, 8789, -69961, -156387, -125465, -145282, -156293, -211192, -227923, -216456, -167724, -84386, -117654, -84531, -63464, -91627, -74386, -67223, -35842, 7513, -54879, -70872, 20964, 49391, -32030, -85447, -50798, 41240, 119247, 59098, -24778, -123631, -61470, -19005, 78822, 90832, 67186, 66463, 52076, -42622, -26010, -43808, 33586, 118154, 103500, 69828, 64312, 93112]
16163I3112p3110n6789p5115l2248J59901Q7880j04644o7420j0617M2719k7109
16152f3440p418K8387N4129l5172j61858o4162N061J07796K8861l5571o4513K393
16140b05507J42715Q8010j255m7597J31115Q775q7413m1603l2034M192L9046m4691
16128d6247j9428M8298R6678K0447j19114q6953j13342k8711L6887L8310P6109
16117i7066R0473N1803m4205k1221l7330n9484p1615k3664O3503M7251J5338M9438
16105c6779L9454M4890k6208J0291j4122q7295R1985M8434m4175k0870m4963K5774
16093a3584q616O3264J8518r6981N7853r5604j16407N4953O2690k5270r297N2036
16081e6445M6761o8358J4930K9408j8310k7655m9087L6979Q7661q113j9146p9293
$$ y = [93112, 20002, -36787, -111902, -144150, 15751, 103631, -1013, -68433, -79050, -36331, -63440, -70858, -42471, 11658, -23514, -185372, -249534, -244473, -136677, -107816, -143387, -207900, -205507, -62792, 25218, 23963, -23634, 107481, 116256, 28843, -12760, -44794, -40602, -1556, -46247, -65675, -17377, 79301, 99748, -19366, -106319, -219661, -248372, -211485, -173175, -97066, -6593, 45210, 1005, -20216, -57546, -117030, -188645, -212309, -148806, -101555, -86217, -36779, 2675, 47565, 21357, 31648, 17526, -69769, 22216, 70650, 26475, 5605, -39358, -13584, -22200, 41064, 59582, -37399, 20454, -75150, -191557, -136604, -73914, -99184, -108481, -56445, -9684, -78042, -63112, -33704, -52014, -79669, -128756, -91777, -4116, -12229, -31375, -110668]
16069a10668J7296L0177L6196L593K3621n0771l9261M8485J12469o7454l5701
16058c2018P6331L9048q242j09313q6811o3541K5971O3369R4606M8017K2479l2217
16046C7679r235n3088j14608R316J17992N6855m7974m4397l413Q754L5771n950
16034a2298k1371M2321r721q6583l4025K3384l4576O1950R013k6727O6536N6163
16022C4066N5855j04741o0320k2863J7687J8932k1855o3857J08834M3136m3517
16011c8643n8313P9142Q7046J3725q8750j29011o711R9156k1717J22843N268j6650
15999D7385k2973K6641N3714P3169l4476r2857o1809l6244O0442l3981K8101r893
15987b781P845K981m2524J06886K3264m9375K5028k4313j1408q8692l6360R3529
$$ y = [-110668, -93372, -63195, -26999, -23406, 215, -50556, -89817, -41332, 71137, 3683, -32018, 44313, 83361, 75119, -34194, -121005, -184546, -158575, -95206, -600, 47417, 69896, 37679, 28444, -24644, -139252, -129936, -11944, 44911, -3063, -47460, -50873, -42119, -6348, -12298, -33669, 8652, -1069, -87652, -121677, -98293, -132869, -70919, -61906, -88633, -22097, 34066, 89921, -14820, -75140, -98003, -80316, -61384, -83239, -147096, -38262, 4874, -38643, -96956, -17814, 69232, 82957, -5793, -134804, -141515, -42359, -64076, 58767, 64035, 47385, 24412, 51053, 104767, 177936, 143460, 50603, -11206, -47450, 12992, -20989, 7112, -2781, 5064, 8045, -34479, 72407, 95671, 46296, 71324, 47011, 35603, -53089, -89449, 4080]
15975D080P2786p3038j25391M28J3407L2385o162K55o2739m4570k0777P8499O0712
15962g0125j3131L0112k7584j32122L9619M3288n061M2595j1668o2734O7255j1697
15950a11253P3538R8044j07198j06464L9849O8759J3606n4394m3574l4112L6789
15939a26410J08940P8564n7574L9176J0611j07829k1692p3855K1436K5242j9959
15928a23350L2078N1932J5423l8662n9257O5084O558o872L8777m0095j49088r967
15916b17439M1191Q977k5224J7129M1992J18774l4446K3482N7572J28513N7664
15905B18185o3998p8718k8763o185m7872N429K4468n4792l9562L8319N7892k1375
15893C028q4854p532o7777Q9110J42040J0415j27476j20571n9669q062J38520
$$ y = [4080, 76866, 3828, -121563, -121135, -107728, -75343, -81505, -81250, -143989, -188559, -209336, -130837, -70125, -83256, -53144, -80728, -212850, -173231, -129943, -135004, -92409, -104077, -166811, -99556, -111253, -37715, 60329, -46869, -153333, -113484, -44725, -31119, -85513, -129087, -163199, -126410, -17470, 61094, 3520, 42696, 53307, -54522, -76214, -150069, -128633, -103391, -123350, -91272, -39340, -23917, -62579, -121836, -56752, -50194, -57066, -18289, -58384, -207472, -217439, -176248, -167271, -192495, -175366, -133374, -14600, -49046, -25564, 32008, 160521, 218185, 154187, 75469, 46706, 40521, -7351, -1922, 22546, -32246, -71808, -33489, 24403, 3028, -81826, -89358, -157135, -68025, 74015, 84430, -43046, -163617, -223286, -231348, -92828]
15882i2828N2512R246N0026k5725j19353P5674M1461N1265j6077l7726j02898
15871a14423q9755Q0048M5226l6058m4415L3854K1948K8826j04339J8304M9286
15860a11498Q8449N9280L7608j0724j1328o553K5284J32687p6332q8818j10854
15849g2799Q298L8003n5937o2823K7153L5397K6405k79k0717P893l8547K5113
15837h2840R169L028k0306Q5067Q6057n0845J29689k5884j53654r0842O6209N682
15825c9470J5139q2248p3283Q9276J03636R1084p1042j45544M4552L1825m985
15814d1060L1306j04701m2323L4942P1167P6284N2942J8269j33700m1954O8579
15803a0249r849o7909q3702K8933N3037n1841l073n7908l2379J5369L7686J5689
$$ y = [-92828, -40316, -31070, 18956, -6769, -126122, -50448, -8987, 42278, 26201, -11525, -114423, -204178, -124130, -78904, -114962, -159377, -125523, -103575, -74749, -179088, -160784, -111498, -23049, 36231, 73839, 63115, 51787, 45234, 70518, 203205, 126873, 38055, -72799, -64501, -26498, -82435, -145258, -118105, -82708, -56303, -56582, -77299, -69406, -107953, -82840, -73671, -70643, -90949, -5882, 80175, 29330, 159019, 133135, -20519, -111361, -45152, -39470, -24331, -106579, -179862, -90586, 13050, 104134, 33092, -112452, -67900, -36075, -41060, -9754, -114455, -156778, -121836, -50669, 25615, 78557, 96826, -36874, -78828, -10249, -20098, -88007, -171709, -142776, -89739, -141580, -144653, -202561, -234940, -219571, -181885, -166196]
15791a66196R450L8856K7618L9278j5432K4193Q2755J06983J8235j55567q1647
15780g1474R9988J54430m6887l3273k268j5889l9559J3421O3743o1124j6756J6959
15768F1311o0193L3293j9451r0179l5723J23484j3438L4309K7167L1475n0629
15757D1426l6663M7564P7549k4586n1364p2658P6473K5838q0389J4899K4250j2728
15745B9611j8894M3777l6687J04908L1145o6260p8720M1375O0891L55L1121p7091
15733F5531m7851j7533m412K0180L2828J3998j0324l5396k3311K2497J4644r9858
15721f9007k092L7661j3622o4974K1387L3930J3341M3496m1317K6491L2602k0599
15709b703j6792R1269o4259L856N6297K7481l2221l14k9912j38028j4867M7272
$$ y = [-166196, -156746, -117890, -90272, -50994, -66426, -42233, 40522, 147505, 165740, 10173, -71474, 28514, 182944, 136057, 102784, 100516, 84627, 45068, 58489, 122232, 61108, 44352, 61311, 1118, 34411, 14960, -75219, -110942, 12542, -896, 33413, 60580, 92055, 41426, 4763, 52327, 129876, 105290, 53926, -18732, 57741, 83579, 3190, 18089, 42339, 29611, 10717, 54494, 17807, 122715, 153860, 87600, 8880, 50255, 111146, 111501, 142622, 65531, 17680, 147, -4265, 15915, 48743, 62741, 52417, 17021, -6290, 16207, 30851, -69007, -71099, -33438, -47060, -112034, -90647, -56717, -43376, 120, -41197, -14706, 17896, -2703, -19495, 71774, 7515, 11371, 67668, 95149, 62928, 62614, 32702, -105326, -120193, -72921]
15697g2921N9139L9743r4573o1881N1298M9498K6612K1757k6160o4733o3154p870
15685a43245m8354K2086J59975O4184m9671j8591l2199J1027M9657J3407j8702
15674I574l3676j7563m3755o426P4495N2602n3758m6243M0291J661q763k4615
15662e6176Q0623O4639N8721l2661m6303J1059q1342n0107K9857m9238p9402N8528
15650i1802P6061K923R5641J0063m8481M4293M7992l4893j10871q1J1566K9360
15638C1771M8376L7440k0725K488k9408Q151r5423J0736o6645r3837m6503l5512
15626b49091N2182J66852j2743p6250P2893O4576J012N7652k9348O037m9886m1329
15614c7443n3527l248p767J0407j5857Q4487N7028L2071n0695O8391J8249j68941
$$ y = [-72921, -13782, 25961, -68612, -130493, -79195, -29697, -3085, 18672, -7488, -72221, -135375, -143245, -191599, -169513, -9538, 54646, 4975, -13616, -45815, -34788, 14869, 28276, 9574, -24102, -41665, -85420, -91846, -17351, 35251, -18507, -64750, -24459, -22798, -31561, -56176, 24447, 89086, 147807, 115146, 68843, 79902, -1440, -51547, -21690, -70928, -150330, -91802, -15741, -12818, 82823, 92886, 44405, 88698, 136690, 101797, -9074, -9155, 2411, 31771, 80147, 117587, 96862, 99350, 69942, 78093, -17330, -6594, -73239, -167076, -213579, -249091, -196909, -30057, -42800, -119050, -46157, 18419, 19431, 77083, 47735, 53772, 3886, -37443, -90970, -94218, -101985, -91578, -107435, -22948, 34080, 66151, 15456, 83847, 102096, -66845]
15602f6845m9975Q6861J1659k8378r689m3429l7545l3006N4280J15371j6849q7321
15590a04866r7303n267J04513M3060m1399M231Q7671p348K8777N6563o3211j3921
15578h500j539J2184K083O2126o0404j45752o5438K1498K6783J54143R3688n2698
15566C8174n6594O2141l6288n8682L3189N7620l1544r502q9706j115L8295r4747
15554a48759m6074J61705J6012n5698p948L9099l0515R291q854o453q1358l2697
15542a92249K6745J52599J06236l473j2076q5266k0580r7565J3415J03373J2880
15531D039k7081O2504J8095o3270L5144L5008J8532M9201n0997j20644j465M2020
15519A086r6035l9876J46797J42993j03310n2564Q3569j8550o5736L2238r5533
$$ y = [-66845, -116820, -29959, -18300, -46678, -56367, -99796, -137341, -170347, -116067, -696, -17545, -104866, -202169, -207436, -102923, -59863, -101262, -97031, -9360, -16708, 12069, 68632, 5421, -8500, -10039, 2145, 4228, 66354, 5950, -139802, -205240, -183742, -156959, -2816, 90872, 38174, -18420, 43721, 7433, -51249, -18060, 39560, 8016, -1486, -91192, -92307, -54012, -148759, -194833, -33128, -17116, -72814, -80762, -41663, -72178, -62887, -71741, -78194, -159552, -192249, -165504, -12905, 93331, 89858, 77782, -7484, -28064, -125629, -112214, -8841, 4039, -23042, 39462, 57557, -5713, 29431, 64439, 82971, 132172, 81175, -39469, -40934, 1086, -94949, -134825, 11972, 154965, 51655, -909, 82660, 64110, -1626, 30612, -64921]
15508f4921J8679M9528p4813q9896q9863J25397Q2303J50628J8414M812o4490
15497F5778o4256m4639K8887M1680K2483O6783J8360q6540j01828q3721J5300
15486a21713K4998q9092o168P5763O2456R915j2298m4395M2195L9918j4822j4267
15474d7510k2206k3999N5348K608L4645j3988m3686m4718J2674O1222K6344O7129
15462F3863k3981j32358R852P8056k4038j35853j5000J9066O3208J297J3396J12146
15450B9654J42093K9150j5303k8388m4210n4731P5275l2998l7460J770m6322q3315
15438f4785q2181j1773Q3923Q2778n024m9848J5761j9040K6586J9065n4006o6165
15426a24709J4537r5434j4773Q403J52465R2074m7627o648J48149N6157L321j1080
$$ y = [-64921, -46242, 3286, -71527, -161423, -251286, -125889, -43586, 107042, 125456, 130268, 65778, 1522, -43117, -14230, 27450, 49933, 116716, 135076, 48536, -53292, -137013, -121713, -96715, -185807, -191975, -116212, -53756, -43841, -56139, -100534, -58339, -18421, -33243, -47510, -69716, -93715, -38367, -35759, -1114, -15102, -58788, -103506, -90832, -29610, -3266, 63863, 39882, -92476, -82624, -4568, -28606, -164459, -179459, -160393, -97185, -95888, -82492, 29654, 171747, 200897, 185594, 157206, 112996, 58265, 133540, 100542, 63082, 64852, 18530, -64785, -146966, -158739, -74816, 7962, 2938, -46910, -31149, -50189, -23603, -4538, -58544, -124709, -110172, -205606, -220379, -211976, -59511, 32563, -15064, -21712, 126437, 182594, 185915, 174835]
15414A74835q8618n0732q1352l1927N7769K0749J6772K1009J27928N758q3279
15403H8912J2431o5112q771N0002k0180q7328K4432N2395l4288m2908O5531L9156
15391G4272m8599j17878j1318P776M4217R4547R2742q6639j25422n1183j5543
15380a43028J6499N3037K2543J3656n3153O9422O3885J1386j3776o9082m3472
15369g2083k9240o1686K9543N5132J42806m101L9955n2045l5389n1703k0889Q4516
15357B4816k0159j14672m3977M1563R7329J0035r6158q1495J0673J7365R4782
15346e9898K8886m6200j03529Q8798N7648K9283n4659k7997P9548L4852j43519
15335a16787p0330R0670R0296k1783j8060j55378j08591P0217J38859R594K5548
$$ y = [174835, 86217, 35485, -45867, -77794, -20025, 724, 17496, 38505, 166433, 172191, 88912, 101343, 36231, 27460, 77462, 57282, -30046, -5614, 46781, 12493, -30415, 35116, 74272, 25673, -92205, -103523, -95747, -51530, 43017, 135759, 49120, -76302, -127485, -143028, -126529, -73492, -50949, -37293, -90446, -21024, 42861, 54247, 40471, -28611, -72083, -101323, -163009, -133466, -78334, 64472, 60371, 100326, 48281, 12892, -38811, -59700, 24816, 4657, -110015, -153992, -112429, -15100, -5065, -101223, -182718, -172045, -154680, -59898, -31012, -77212, -180741, -91943, -34295, -5012, -59671, -87668, -8120, 26732, -116787, -187117, -96447, -6151, -27934, -45994, -201372, -309963, -239746, -100887, -91293, -65745]
15324f5745M1210O2846k3857k7044m017p1991l9273J38423L0243q6554q9160j0433
15312a45352P3787J10342R8159J6710o8609m6501N117K0176r0210j28956K5448
15301a29889L6565Q334k025M3425R929n0883P4499M9415J6633k8341p4205j10717
15289a57260n7426M2018l580J8097P0764N870K4263M4201J8830J4158l9205l2280
15277e1550j3834M0857M0684p6655l2202l880P6800P820m646K1597L8955m4404
15265d58O3750Q0735k8614k4234k256K1531l2708K9533n0448m6579l5519j3113
15253c8380J2486O5506J5023O631n7757j11176K667M4716J25037K5639p1479j8625
15241B88Q7411O6774L9208l7113r4803K1646k8560j8905K057O3721O390L8630
$$ y = [-65745, -24535, 38311, 14454, -12590, -16607, -88598, -127871, 10552, 40795, -45759, -134919, -145352, -71565, 38777, 136936, 153646, 85037, 38536, 43653, 63829, -26381, -155337, -129889, -93324, -84990, -87015, -43590, -33661, -84544, -10045, 39370, 56003, 27662, -46543, -157260, -214686, -172668, -176248, -158151, -87387, -81517, -57254, -13053, 5777, 19935, -19270, -51550, -65384, -24527, 16157, -60498, -92700, -96580, -19780, -11960, -16606, 4991, 43946, -458, 63292, 144027, 115413, 91179, 88923, 110454, 77746, 107279, 56831, 10252, -25267, -38380, -25894, 39612, 54635, 61266, 3509, -107667, -105000, -60284, 64753, 90392, 18913, 288, 87699, 154473, 193681, 156568, 61765, 83411, 54851, 35946, 38003, 101724, 108114, 146744]
15229A46744k1385p4474j5947J26397J3130m2369j53160M0520O7350K6505p4602
15218C8709j33041p4730m2507N2611Q6056m2087J01083R2500L3851j9631o6762
15207B6052P5070j296q8391M9567L218j12333k7744R6230J35393J340j43067j37007
15195a22968J8833M1301J7684N3937l6543j00444l932J05879N8347l3132J4729
15184A3691L627J4691J097j08343L6740Q955j5401M2284r633O4205L269k2430
15172C2752j17160n1949J07476P2307O2061q075o1420p7221p731N5184K0778K0866
15160D7868o4782l6107m1136p0167j6909J3954P2202j1044q0336j0116J22969
15149g3604L1980M447o4929Q519J70967O3120j12393l2937L1057L714j624J2302
$$ y = [146744, 125359, 50885, 34938, 161335, 174465, 132096, -21064, 19456, 86806, 113311, 38709, -94332, -169062, -211569, -158958, -72902, -114989, -13906, 78594, 112445, 92814, 26052, 101122, 99826, 11435, 61002, 64220, -48113, -75857, 20373, 155766, 157106, 14039, -122968, -104135, -62834, -45150, 8787, -27756, -128200, -132132, -26253, 32094, -1038, 13691, 17318, 32009, 33106, -75237, -38497, -29542, -44943, -2659, -12292, 51913, 55182, 32752, -84408, -136357, -28881, 43426, 105487, 97412, 35992, -41229, -48960, 6224, 27002, 47868, -16914, -53021, -94157, -164324, -181233, -167279, -95077, -106121, -186457, -196573, -73604, -41624, -37177, -102106, -93587, 77380, 140500, 28107, -4830, 26227, 29941, 28317, 40619]
15137D0619m4138N3848M6783l992j8323o9586l2580J8491o5270R2694M4926l5059
15125B8413q2864n4049o7068J6452J61012N7873j24048J5598M6118M186Q7770
15114H9393l4818j16733j1384l6014k4661o97Q7490L6977l0555j1948J44917r2442
15102d75M8915J1260l3321j641p9605n665M0335J3638L5022m2237J2195n1525
15090e3104M9109K712o2859n6615O4154L7066k6898j7936j19494L2465N2688r435
15078a08147k2853m948J5972R853M9637J52709r7452j08440n9786J60490R7040
15067H4075j1151k520l0759P508P9411r965j30041R3827l7305r5263J8862O2900
15055B9579l767O8763j0200j39568n9778L198q2907J34815M3668L2330P90q0470
$$ y = [40619, -3519, 50329, 97112, 93120, 74797, 5211, -27369, -8878, -74148, 18546, 63472, 28413, -54451, -108500, -175568, -159116, 1896, 59769, -64279, -48681, -2563, 1623, 89393, 54575, -62158, -73542, -109556, -134217, -134914, -47424, -10447, -41002, -52950, 91967, -475, 48440, 59700, 26379, 24738, -54867, -60532, -20197, -6559, 28463, -13774, -1579, -53104, -3995, -1283, -64142, -120757, -56603, -19537, -46435, -64371, -183865, -151400, -98712, -108147, -131000, -135948, -119976, -110123, -60486, 92223, -5229, -113669, -173455, -12965, 84075, 72924, 70404, 39645, 47153, 126564, 116599, -13442, 80385, 43080, -52183, -33321, 29579, 25812, 94575, 84375, -55193, -114971, -111773, -194680, -59865, -16197, 16133, 16923, -63547]
15043f3547l9543L2731M527q6115K8938J16487L9460J1967M8068l4705o3473J0515
15031E310j3512K6623l2284Q266L9684n5173J0592P3891k8314o5269Q1854j3891
15019C7777N2625o4164J4032m3965l8171p949k4955j897k6602p8814m065N9172
15007a26976R4848M1018k6598L2079M9407n5415P2113N0800l2191L857m2419M7192
14995A07715J8640J953J8376K726N78p958j2628q4137l5032O4443K3355k1868
14983G6163p8540L2586M7079J13995j4819J9325o1206j40571K2202q8063l6778
14972a08627l9250J25137j154M2042N5518j1296p2532J7753j0063P3232q0468
14961i708l6481J19566M0549r855J2022J4674j11092n8140J2625K4334p3050k8656
$$ y = [-63547, -103090, -70359, -65832, -151947, -123009, -6522, 32938, 44905, 92973, 58268, -5205, 5310, -8202, 18421, -13863, -5597, 34087, -21086, -10494, 63397, 35083, -30186, 51668, 37777, 90402, 26238, 40270, -3695, -41866, -49815, -74770, -76667, -103269, -182083, -186148, -126976, -32128, 8890, -17708, 14371, 63778, 8363, 80476, 131276, 99085, 102942, 60523, 107715, 126355, 128308, 146684, 149410, 149988, 142030, 129402, 45265, 10233, 74676, 98031, 76163, -2377, 30209, 77288, 191283, 176464, 195789, 134583, -5988, 16214, -71849, -108627, -147877, -22740, -23894, 18148, 73666, 62370, -10162, 7591, -2472, 70760, -9708, -46189, 73377, 113926, 104071, 116093, 130767, 19675, -38465, -25840, -1506, -74556, -103212]
14949a03212n0534n1939R5739P7901p0688M7844O7645j51974p1909N1403K1444
14938a38280J9656J18380j1765O7149p9436p9724N8679l6936M7717M1434k6181
14927a9307M4436k7881r4777j3266Q8393J55198k1088j2593O264J271l6196j45077
14915g4623q3264J31614J5148j2827K70k7041p0348J03015Q1133P0354n259j17080
14903A1092p6273j06670K8093R3052J8799n4851l2125J7240k7151L2737O6680
14892b9377Q3833J08824O5374j4487L2732m043j30476o0531o2205l9030P833k7056
14880f8609J7936N5143Q8513J7460j60157n4294n8059k3195L0738Q2500O8273
14869c751k9144M5750L3735R3959R0340j10840j2748J41811K8935j20022p1937
$$ y = [-103212, -153746, -205685, -109946, -32045, -102733, -54889, 12756, -139218, -211127, -159724, -138280, -118624, -244, -12009, 55140, -24296, -104020, -45341, -82277, -34560, 6874, -19307, 25129, -2752, -97529, -110795, -22402, 132796, 111708, 99115, 105379, 106650, 70454, -74623, -157887, -26273, -11125, -23952, -23682, -50723, -121071, -18056, 63077, 133431, 128172, 11092, -65181, -171851, -143758, -50706, -31907, -86758, -118883, -101643, -128794, -96057, -29377, 54456, 163280, 228654, 214167, 246899, 242856, 112380, 51849, -10356, -49386, -41553, -68609, -50673, 4470, 92983, 110443, -49714, -104008, -162067, -185262, -154524, -72024, -3751, -32895, 12855, 46590, 140549, 230889, 120049, 107301, 249112, 278047, 158025, 86088]
14858H6088p4173o2746M8032m1724j22962L3887J39633J12445m3573M203m89j44033
14846f5412j9773L8332l9284m1484M003k9789N5325K5181J0562O0867o0787o8229
14834a30488O5378N1346O469J16388Q594o8839n6173J4397k1368k8052M1759p4867
14822g5456r7262M4580J30029M6149J11051m8819j10499k8069J00568j5366J5781
14811G2687J8384Q155L2536l400n9024N2772Q1812l4686o7754n5963l5500O7087
14799G7106J7274J901K623K4440k5803K8657j1912k3469o6233j03968p4198O171
14787a47411O6291L2695J9516j7571q8374j08691J53453K8890k7039l2545J08013
14776a2773P3552j687m464o545n8705k6193R8188Q367K0831K0980q788K5996n5442
$$ y = [86088, 11915, -50831, -2799, -44523, -167485, -133598, 6035, 118480, 74907, 79110, 78621, -65412, -85185, -46853, -86137, -127621, -123618, -153407, -98082, -72901, -62339, -1472, -62259, -130488, -65110, -13764, -7295, 109093, 117687, 48848, -7325, 7072, -14296, -42348, -589, -75456, -172718, -128138, 1891, 48040, 159091, 110272, -227, -28296, 72272, 56906, 72687, 91071, 99226, 131762, 128362, 69338, 122110, 203922, 169236, 101482, 45519, 10019, 77106, 94380, 96281, 98904, 123344, 97541, 126198, 114286, 90817, 24584, -79384, -153582, -147411, -81120, -48425, -28909, -46480, -134854, -243545, -90092, -61202, -88241, -120786, -12773, 60779, 59092, 54628, 48083, -10622, -36815, 61373, 69740, 90571, 111551, 102763, 128759, 73317]
14763G3317r5943k6678n2223P1428J6291m2137L675k3183K0463P5928k2550r0547
14751i2159k1046m973K1729N3436K4353J2690L8336o9461l4278Q0869J06470O2648
14739A78614M0172J4483m6231j30780n381O0008Q7196j0781j61119m9538M7909
14728B4552J8305O179k7991O0978J1406M8949O3064j09615j29791k3858R540M0758
14716g524j0478k3618l9656k8231M4151Q62L0101m3785J6776J28458L5088J3716
14704A15860j3092r1130p043j13870k3097K2334K918K5519O6757k9124m4473K1631
14692f6810N3294J4073J24155J14948l1645o3629N279q1848K1832J07567L2331
14681B29547j00096q4472k8520r53Q5k0412j15232p3391N6838n9423l7679J01573
$$ y = [73317, -22626, -49304, -101527, -30099, -13808, -55945, -52270, -75453, -54990, 20938, -1612, -92159, -113205, -118178, -96449, -43013, -18660, -5970, 32366, -37095, -71373, 9496, 115966, 178614, 218786, 233269, 187038, 56258, 50877, 110885, 198081, 187300, 26181, -23357, 24552, 42857, 49036, 21045, 82023, 93429, 142378, 205442, 95827, -33964, -57822, -48282, -7524, -18002, -41620, -81276, -109507, -65356, -64494, -34393, -78178, -61402, 67056, 102144, 115860, 102768, 11638, 4595, -109275, -132372, -110038, -107120, -81601, -14844, -43968, -88441, -66810, -13516, 557, 124712, 239660, 208015, 144386, 149665, 67817, 89649, 197216, 229547, 129451, 44979, 16459, 15506, 15591, -4821, -120053, -193444, -136606, -196029, -233708, -132135]
14669a32135k464R2984K3257j10007K2383n0550O7759M1287m843M1820j2064k0488
14657d3061M873N247P6270p108l0560L0771j25523j40234M066R1923P7667J7407
14645c8262r790p5677R4420J13940K8599r1187q2982J39842J6105l5915m5786
14634A3307q0039p4942R0452N1210Q3012l5535J1778n415n3905n661k624J2087
14622C725K4988K8784q0448j53431P17N9875j0903M9876M2555r29n3355P877M6721
14609c3948N3697o803J37072Q0977j64118m6941N3496N0391k2080j15937J3822
14598c72M8214l5597N4729j0155o3630j16643L082P7231J598M7662o7230m296
14586f5407o2233J3247R6987l787P0286l5104j9194j9427J6316M9406r654l4626
$$ y = [-132135, -134599, -41615, -18358, -128365, -105982, -156532, -88773, -47486, -52329, -10509, -22573, -43061, -38188, -32941, 43329, 36221, 5661, 36432, -89091, -229325, -225259, -133336, -55669, -38262, -48052, -123729, -29309, 84631, 113230, 22043, -60939, 78903, 95008, 59093, 13307, -66732, -141674, -51222, -12, 83000, 47465, 59243, 53828, -77, -5738, -8362, 3725, 28713, 57497, -22951, -176382, -175665, -115790, -126693, -76817, -34262, -35191, -88546, -80669, -33948, 19749, 12946, 150018, 230995, 66877, 19936, 73432, 123823, 101743, -14194, -372, 47842, 12245, 66974, 56819, -6811, -123454, -120372, -43141, -41543, 6119, -61111, -65407, -127640, -114393, -17406, -21193, 49093, 13989, -5205, -24632, -8316, 41090, 31436, -3190]
14574c190O0107k1275j0044l2941l5918L3135O6636p7913l6190j53360m4147L9335
14562b15765J4781P0459O1008p1862L2846K7292L0057J14996m9341J1890P9122
14551A05483o1433M818M4312L1239n4648j09318M9863l2783O3442l9930j14383
14540a13338k4527N4426j3227P4034L7167n5499l8328O0121O4549N7552n0478
14529E2452j5995q0147l8366J8197K1142P509M5173L1958j9792R2921J13586p2943
14517A55695j37241r2343N105k991N4103O6527N5306k8792q5391N2610k2096n4917
14505c4425j5852Q5191M8529N5923P238m7058j29883r7720J269m6014N9831R7951
14493a5020o4099l8746N4105P0267J29479r6496p7750l4051k0508K5781P7714
$$ y = [-3190, 56917, 35642, 25598, -7343, -43261, -10126, 56510, -21403, -57593, -210953, -255100, -215765, -200984, -130525, -69517, -141379, -108533, -81241, -51184, 63812, 14471, 26361, 105483, 44050, 48868, 93180, 124419, 69771, -39547, 10316, -22467, 40975, 1045, -113338, -137865, -83439, -96666, -22632, 14535, -40964, -79292, -19171, 45378, 102930, 52452, 36457, -43690, -82056, -63859, -42717, -35208, 9965, 41923, 22131, 115052, 228638, 155695, 18454, -73889, -68784, -71775, -17672, 48855, 104161, 75369, -10022, 42588, 20492, -34425, -50277, 34914, 83443, 139366, 146604, 99546, -30337, -128057, -126788, -172802, -112971, -15020, -79119, -117865, -63760, 6507, 135986, 39490, -38260, -72311, -92819, -67038, 10676]
14482A0676k7779j5033j6147J14854P8806q3654n3907K5078r1646l3443R673L0994
14470e1528K5852J78917Q6581K9078r2535j93156j26832N8440J6999j08405R215
14459a67374N6742L3604P0070J2899j08977n688M5380M3934N9865O1184O0006
14448A61645J11389J9122j65950l5743k5634k2129L0467p655J20996k7403k2528
14437A36577k4483L718L7658j7869Q0835Q924p3352k8564k6896j01538k9L1627
14425B6608k2512m9343o135Q2738l8828q8877l4055J9973p9550N9417Q6896J14006
14413G0338J9139j8428l0143k4672q1015J1914n0317l823K7298j0344m6931O683
14401a30301l771R6672O3749j7139l0371l4837m9538L144L0109n860N791l7251
$$ y = [10676, -17103, -32136, -48283, 66571, 145377, 61723, 7816, 32894, -58752, -92195, -82522, -51528, -25676, 153241, 239822, 268900, 176365, -16791, -143623, -85183, -68184, -176589, -167374, -110632, -77028, -6958, 5941, -103036, -108724, -63344, -19410, 40455, 101639, 161645, 273034, 292156, 126206, 90463, 64829, 42700, 73167, 65512, 186508, 159105, 136577, 112094, 115812, 153470, 135601, 216436, 225360, 152008, 123444, 96548, -4990, -5019, 26608, 4096, -45247, -51382, 31356, -7472, -96349, -130404, -110431, -189981, -130564, -43668, 70338, 89477, 71049, 40906, 16234, -64781, -52867, -103184, -107007, -79709, -90053, -136984, -130301, -134072, -37400, 26349, 9210, -21161, -55998, -105536, -102392, -72283, -78143, -72352, -109603]
14389a09603k0281J4702L2995P9384J7954k3855J09367O9337J00419J7608j42372
14378A45655j22758Q0322j4001k5172l1770j21577N2593J63392J0086p872m2710
14367H6188j14162L0115K5566l9414r302O0109n8835q9206J9949J04004M5988
14356F1000r3091J575L4111l2614o2750J0998R165N3883N0199q2115r5028J08477
14344c6190O7304J5674K2082J8503n1320p5725N495J6616L436K6190Q710P7971
14332I8746M0379r7331N1467J10356m068K8031j40543q4596l1654J00019L9847
14321A10653J30l0402m0230k4258K2606N5439J1189l6332n3422j14770l5117N2437
14309h2077J19892M7284n3911j8100M9549j649q7978P1452O5346q802j44696o5785
$$ y = [-109603, -129884, -115182, -82187, -2803, 15151, -8704, 100663, 170000, 270419, 288027, 145655, 22897, 103219, 89218, 64046, 32276, -89301, -36708, 126684, 136770, 128898, 86188, -27974, 2141, 27707, -11707, -21009, 39100, -19735, -108941, -88992, 15012, 61000, -32091, -30516, 3595, -29019, -91769, -80771, -71606, -17723, 32476, -49639, -144667, -36190, 31114, 46788, 68870, 87373, 36053, -39672, -34177, -17561, -14125, 12065, 20775, 98746, 139125, 41794, 93261, 203617, 199549, 227580, 87037, 2441, -29213, 70806, 110653, 110783, 80381, 40151, 15893, 38499, 93938, 105127, 68795, 15373, -99397, -134514, -82077, 37815, 85099, 31188, 13088, 62637, 60988, -26990, 44462, 109808, 101006, -43690, -109475]
14297a09475P1776O6360O3837j4279p4945j58972J1417Q1064o4753j060P5673
14286e3357L7672p8071k2182J3669J00621j0187r0233M4892K4214J1359N7214
14275C5611P0727K8653j40091q6575k5523N4284L8948l8209J4517O5951o1560
14264d3267J2728O8162K7448r3489L6760n2788p2021O1983L1902K1678J9190O9928
14252H8214l3202j985l6828J954k3154n8853j846Q1496M4156k072k7702k3847
14240F331L7303k1131o5545j9428k0922K4084j9939N5678J27410M537j32947j01100
14228a25669j927J05376l6019o7897L7783M822k1962J19500P597L2053M5726j1692
14216H7691n0604j3081o56l8059j7901N9812K2018p2818k1687J06441L0315j8040
$$ y = [-109475, -37699, 28661, 92498, 78219, 3274, -155698, -144281, -63217, -127970, -129030, -53357, -15685, -93756, -115938, -102269, -1648, -11835, -102068, -57176, -32962, -21603, 35611, 106338, 134991, -5100, -91675, -117198, -62914, -23966, -62175, -47658, 18293, -43267, -30539, 37623, 65071, -28418, 8342, -44446, -116467, -54484, -22582, -904, 18286, 88214, 55012, 53027, 16199, 18153, -5001, -63854, -65700, 15796, 59952, 57880, 30178, 6331, 43634, 22503, -43042, -62470, -83392, -59308, -79247, -23569, 103841, 108378, -24569, -125669, -127596, -22220, -58239, -126136, -88353, -83531, -105493, 14007, 21604, 53657, 99383, 87691, 37087, 24006, 23350, -14709, -32610, 27202, 49220, -23598, -45285, 61156, 91471, 73431]
14204G3431q4589l9283M4817P5113q865N7434j1348k7519q383K829n200j06386
14192c7949j099l8963M043l8270p3552q3412J9854L3012O4657J06202Q0257R114
14180D3894o3686K4596k4925l1558j670Q751L7129O4147k3568L1535Q947m3066
14168C0526m973j7687o6321r1078l815k1792L9692P2931K08500M6050r0228j54546
14156e2741N6879M0123N3731k2041o1806M2231K8991J03125n6323n7723J9887
14145I4333n8567r2792k531N0077N6516K2365m6201p9626j4773J28192J52820
14134B09813n326l6389L9730J1216r8255q1101j01667l9982O8003N8463m8037
14123b3532M3183O8060L4722p9132m9583J2722M1809M778m3516j02630j53192
$$ y = [73431, -11158, -50441, -5624, 69489, 60624, 118058, 106710, 79191, 70808, 73637, 68437, -37949, -39048, -78011, -73968, -112238, -185790, -269202, -249348, -216336, -151679, -45477, 34780, 43894, -19792, 4804, -20121, -51679, -53349, -44598, -7469, 56678, 33110, 64645, 73592, 30526, 25553, 7866, -58455, -149533, -153348, -175140, -135448, -62517, 145983, 192033, 101805, -52741, 4138, 44261, 97992, 75951, 14145, 56376, 85367, 188492, 132169, 74446, 94333, 35766, -57026, -59557, -9480, 47036, 69401, 23200, -56426, -71199, 56993, 209813, 204487, 168098, 207828, 219044, 120789, 39688, -61979, -101961, -33958, 24505, -23532, 19651, 87711, 122433, 43301, -6282, 6440, 48249, 53027, 9511, -93119, -246311]
14112b46311j5147J57232O8621P5120L8706j71720n7970K9281L5454O4634L585
14101a8515L6143K1956n1976o4264l2694Q4940K9344N397O2252L1842J3436J5684
14089A33545L2223M1592K0822k0800N3278k715k3965j44046m6697j5471m2564
14078a4798n8490j998N5469j3941l6184K6613j6492k8206O8255P9720k793k8578
14066B8577l5242K3949j2689K4732M5260K0899l7043L4218k0043L7938O6552j21929
14054E5179j4989J8547M4433k0925p1748L7833J5335n1733K4805o82P5300q4380
14042B6975l3291k8003l3494l1386R5100K2016K0108J1630j27806m5533K8248
14031i5436k662R7157K7246P2943J5095N014r1966K5680J4487Q341L4331o2401
$$ y = [-246311, -261458, -104226, -35605, 39515, 78221, -93499, -151469, -122188, -86734, -22100, -18515, 17628, 39584, -12392, -76656, -109350, -24410, 4934, 10331, 72583, 104425, 117861, 133545, 165768, 207360, 228182, 207382, 260660, 257945, 233980, 89934, 43237, 27766, -14798, -73288, -75286, -19817, -33758, -69942, -43329, -59821, -88027, -19772, 59948, 57155, 28577, -6665, 17284, 4595, 29327, 74587, 95486, 58443, 92661, 72618, 110556, 177108, 55179, 40190, 58737, 103170, 82245, 10497, 48330, 63665, 11932, 36737, 36055, 111355, 26975, -6316, -34319, -67813, -99199, -4099, 17917, 38025, 49655, -78151, -123684, -95436, -98098, -941, 26305, 99248, 114343, 119357, 27391, 53071, 67558, 75899, 110230, 47829]
14019D7829l2746M4110k8427m1315K9213K77k1332o6031M7330l335q2755k5550
14007a32732k100J20926N4604L9652J947P157k4628j16441o3630J4405k5180J7413
13995a08607N3239k1233m4359L1020J5557R3841R2500j44090p6801O3741J81765
13984A36573J2743l4557k1447j23352l5830k924N0393j4966P7455L3293m5868
13973C1513k2843O2445p8505o4105L106L6941K5170L1210Q1371r0634p7921j2413
13961g4665J0975P8774J6842k4181M9971p8708p5516J39755J00777k1056l8773
13950H4195J5876p2209K4865J9489L6155L8960q2737k3209q4413l9888j3036k4047
13938a19999J3149Q4570N4211j0545K4039O920K216O5862J6726M778n0366J0225
$$ y = [47829, 15083, 59193, 30766, -10549, 18664, 18941, -2391, -68422, -21092, -24427, -107182, -132732, -134832, -13906, 40698, 80350, 82297, 89454, 64826, -51615, -115245, -100840, -126020, -108607, -55368, -76601, -120960, -89940, -74383, 19458, 111958, -32132, -108933, -45192, 136573, 149316, 114759, 93312, -30040, -65870, -68794, -18401, -33367, 44088, 77381, 31513, 8670, 71115, -7390, -71495, -68389, -31448, -6278, 24932, 106303, 15669, -62252, -74665, -63690, 15084, 31926, 7745, 57716, -20992, -96508, 43247, 144024, 122968, 84195, 100071, 27862, 52727, 72216, 108371, 147331, 64594, 41385, -43028, -82916, -95952, -119999, -106850, -22280, 31931, 21386, 45425, 52345, 54561, 120423, 137149, 141927, 91561, 101786]
13926A01786K7891r6670M2263m153l9515m1245J04705P1570N710L159j7285r770
13914A48446n6808l4236Q6649Q7999K7377J7893n9087j58488M6764n789j07320
13903f600K4634N4944o8354J5938J07692q9151l3329k8197l002P0373P4135k0033
13891I9050k9210j6191q3844o7376K2651K9551j42889q0441K2483J0165N2811
13880a83240N6421L3959Q7005L8778n1903k8694K0742L1302j2129J5200l6714
13869b9273j05733J8959k2824J3427M0212R0635J59014l4212p6430J81920k7887
13858B07808j43045n2404K5673P8214j1678l2839j079j17477l2106P745O9111
13847b077M6102P9876Q476q8082o8115J4253m2958m8549j0060J44415P7401K7461
$$ y = [101786, 129677, 33007, 75270, 71117, 31602, -9643, 95062, 166632, 172342, 175501, 158216, 148446, 91638, 57402, 144051, 232050, 259427, 277320, 218233, 59745, 106509, 100720, -6600, 18034, 72978, 4624, 20562, 128254, 39103, 5774, -22423, -25425, 44948, 119083, 99050, 69840, 53649, -30195, -97571, -74920, -45369, -188258, -268699, -246216, -236051, -183240, -126819, -92860, -5855, 32923, -18980, -47674, -26932, 4370, -7759, 7441, -29273, -135006, -116047, -138871, -125444, -85232, 5403, 164417, 130205, 53775, 235695, 207808, 64763, 12359, 38032, 116246, 104568, 71729, 70650, -46827, -78933, -71188, -2077, 44025, 123901, 132377, 44295, -23820, -9567, -52525, -101074, -111134, 33281, 110682, 138143]
13835A38143o2413N0894k6921N6234m3157j38593p3728r5617R6215Q1449k626
13824b0120j12892M4468k0177R9936l5368P8604j6927n0452J00648K01618o7241
13813B02097q3770j9033n5740k6640k2854l0941L0933o2264p1612O8140O1765
13802i919M1455o990p1314L0648j1409r6401Q2487N1714J772j80747K4107J35270
13790i327q7881m540P6830J187p2605m0552j1170q571L4430M1272Q0267J42168
13778A41508N8289p7355k9037j1682p4968k4755K0604j5820j8350j194K2960o5465
13766g5265r8824J01037R4328j4475J09376M1271m165n1839q375j33200r683n760
13754e5574M5696J9164n7797N2984n633M3860o0642p7562m2292P5123R9674n7261
$$ y = [138143, 75730, 126624, 99703, 155937, 112780, -25813, -99541, -195158, -98943, -17494, -20120, -133012, -88544, -108721, -8785, -44153, 34451, 17524, -32928, 67720, 269338, 202097, 118327, 99294, 43554, 16914, -5940, -36881, -5948, -68212, -139824, -71684, -9919, 31536, 24546, -46768, -16120, -27529, -123930, -41443, 10271, 12043, -168704, -144597, -9327, -97208, -101748, -24918, -23731, -96336, -136888, -148058, -156629, -122199, -80927, -660, 141508, 199797, 122442, 93405, 81723, 6755, -18000, 2604, -13216, -31566, -32760, -9800, -75265, -174089, -73052, 21276, 6801, 116177, 157448, 153283, 101444, 93069, -40131, -49814, -55574, -9878, 9286, -48511, 4473, -1160, 42700, -17942, -95504, -137796, -62673, 37001, -20260]
13742b0260l1249M6525R7423l8468k2645j6796n3955M7968J77022R3811o4392
13731B14984n7596o8534l8589l7311R668j11713L0969L3009q9765N6885J80479
13720A22486p352r6245j1781L7365L0376L6046Q260q8949k0714N8843L084L5558
13708A06977j00976l5810Q7576m311j09202m291k5440P8552P4491N3374R0337
13697B11277k4569r8419K8570M9363J30613M3771k2225q5023k08068k7876R6531
13686I3945l8385j17126K7755R6754J33507M801n5180l9127K9797j598J0470p8242
13674F7371l3049N9841N073k0792j30641l1238J4585L4445L8556R1301K1530m2561
13662G4421n0676J5435j1218L2490j4477J4994K1154l1831q8964k9749O8678J50997
$$ y = [-20260, -51509, -4984, 92439, 53971, 31326, 14530, -39425, 8543, 185565, 279376, 214984, 157388, 88854, 50265, 12954, 22622, -89091, -58122, -25113, -114878, -57993, 122486, 115134, 18889, 7108, 44473, 74849, 110895, 119155, 30206, 9492, 68335, 71419, 106977, 6001, -29809, 57767, 53456, -55746, -60037, -85477, -6925, 67566, 120940, 211277, 186708, 88289, 116859, 166222, 296835, 340606, 318381, 233358, 25290, -2586, 93945, 55560, -61566, -33811, 62943, 196450, 201251, 146071, 106944, 136741, 135143, 145613, 67371, 34322, 94163, 99236, 78444, -52197, -83435, -68850, -34405, 4151, 95452, 116982, 74421, 23745, 39180, 27962, 60452, 45975, 60969, 82123, 50292, -38672, -68421, 257, 151254]
13650A51254J2375K7470o6586j00017J7079L3475J2299O4151J232n2514R425J03544
13638B13187M975p0207k6751l306O7482p6228q3258k6778P919O3282O2809N1850
13626A84976k8825Q707J9384m2732m6551Q953P8187o143L4600K3291j23500j98711
13614h8364q1054L5549J36083J01109R408k9154j24333l2059Q110q001J32065
13603E9359P9524n6836p5433N8672J9865l9919k502J4863o8610l0359L0452L6807
13591B5883j8415Q1751K9777n5314m2795N4346J8258N9467P8693j8083m9537r5023
13579F9008n5178n6226m9635P8863M6209k6941J8667n8167j42407O0487N0586
13568f4734l8980L6224K8718M0256n0387l9347P4318N3841L2044J02914k6835
$$ y = [151254, 163629, 191099, 124513, 24496, 41575, 75050, 87349, 151500, 152732, 100218, 109643, 213187, 218162, 147955, 121204, 117898, 185380, 109152, 25894, -884, 7035, 70317, 133126, 184976, 156151, 164858, 184242, 141510, 94959, 103912, 182099, 175956, 210556, 233847, 110347, -88364, -169418, -133869, 2214, 103323, 112731, 83577, -40756, -72815, -64705, -72706, 59359, 138883, 82047, 6614, 65286, 85151, 45232, 42730, 57593, -11017, -41376, -10924, 25883, 7468, 89219, 118996, 63682, 20887, 75233, 93491, 152958, 231651, 213568, 164031, 69008, 13830, -42396, -92031, -13168, 33041, 6100, 24767, -33400, -175807, -115320, -64734, -103714, -67490, -38772, 1484, -48903, -88250, -13932, 39909, 71953, 174867, 148032]
13557A48032o4813k3675L2077m1919o1329J4462r505O2873n778n014o624j0255
13545B8532q0146p8205P8018J40514J10114j1066o0657o0570l7838q4083m0082
13534i5469L6368K2694J08659m9987o2976L8930L5181J33827m8945r0796q4645
13523e7159n1143N6949P0378R833l1461n4232j4105L0364O6323q5996m2921L8074
13511f5096M764j8181L1114J2523N7775n6401j22914p6862J10443J05245j3782
13500c1372l7533J22095L4456j3443k6176O0942M2832j11670j16368L5885M9189
13489H837P641n144m3271L4316N0467q7579k2674m4951P3539P8454N5669m0266
13477F5038j03751P3411J69448O6643j13530p1612K6778k9816M0317O8616O998
$$ y = [148032, 83219, 59544, 91621, 49702, -11627, 2835, -6670, 56203, 50425, 45411, 38787, 28532, -51614, -129819, -51801, 88713, 198827, 187761, 127104, 66534, 28696, -55387, -95469, -59101, -36407, 72252, 22265, -40711, -1781, 33400, 167227, 118282, 27486, -57159, -108302, -51353, 19025, 28858, -2603, -56835, -70940, -40576, 25747, -60249, -103170, -65096, -60332, -78513, -47399, -34876, 22899, -33502, -156416, -233278, -122835, -17590, -31372, -68905, 53190, 87646, 74203, 48027, 108969, 151801, 40131, -76237, -40352, 8837, 16478, 11334, -31937, 2379, 52846, -34733, -57407, -102358, -28819, 49635, 105304, 65038, -38713, 34698, 204146, 270789, 157259, 85647, 112425, 82609, 122926, 191542, 198540]
13466A98540n0725l5879L0238o9964O7130J8203k774r538K1388j01892m1617K0736
13454D3846j0724j62265m2416J62420P6736J2582K7476q6493o9028l2811O888
13443g3789N4297Q09l4639J02438N7600r7121m4404k5484q0043M2844J14891k2393
13431d994m3915M6562l2706j4015J02072N9223L8289R9439P795n7566m0012L4019
13419A94191l1419p7237q4254K4750K8060j204J15899P927L1630o2055L5261J4517
13407A96066j25110N4195J19098l9414N7116n255q5958r2353j6822n0303m5660
13396c4400K626K5975J1419j22068Q8822L6300Q83J00039M9669m0826N185p0163
$$ y = [198540, 147815, 111936, 142174, 72210, 139340, 157543, 154769, 145231, 166619, 64727, 23110, 43846, 33122, -129143, -171559, -9139, 67597, 80179, 107655, 21162, -47866, -80677, -73789, -19492, -18683, -53322, 49116, 106716, 9595, -34809, -60293, -140336, -97492, 17399, -4994, -48909, -2347, -35053, -49068, 53004, 112227, 150516, 249955, 257750, 200184, 160172, 194191, 162772, 85535, 1281, 26031, 54091, 52887, 168786, 176713, 208343, 146288, 181549, 196066, 70956, 125151, 244249, 204835, 261951, 256696, 170738, 78385, 61563, 11260, -34400, -31774, -5799, 5620, -116448, -27626, 8674, 9557, 109596, 159265, 118439, 123624, 53461]
$$ [...]
##END NTUPLES=NMR SPECTRUM
##END=
