##TITLE=Analysis number 318698
Compound Code mo 07137
Project Code adrs
Chemist Name komarov
##JCAMPDX= 6.0         $$ Bruker NMR JCAMP-DX V2.0
##DATA TYPE= NMR SPECTRUM
##DATA CLASS= NTUPLES
##ORIGIN= Bruker BioSpin GmbH
##OWNER= nmr
$$ XWIN-NMR		Version 3.5
$$ Mon Apr 10 15:18:53 2006 GMT Daylight Time (UT+1h)  MAYBRIDGE\nmr@NMR_250MHZ
##.OBSERVE FREQUENCY= 250.131544655141
##.OBSERVE NUCLEUS= ^1H
##.ACQUISITION MODE= SIMULTANEOUS (DQD)
##.ACQUISITION SCHEME= undefined
##.AVERAGES= 16
##.DIGITISER RES= 18
##SPECTROMETER/DATA SYSTEM= dpx250
##.PULSE SEQUENCE= zg30
##.SOLVENT NAME= DMSO
##.SHIFT REFERENCE= (INTERNAL, DMSO, 0, 16.522)
##AUDIT TRAIL= $$ (NUMBER, WHEN, WHO, WHERE, WHAT)
$$ ##TITLE= Audit trail, XWIN-NMR		Version 3.5
$$ ##JCAMPDX= 5.01
$$ ##ORIGIN= Bruker BioSpin GmbH
$$ ##OWNER= nmr
$$ C:\u/data/dgb/nmr/ADRS/2430/pdata/1/auditp.txt
$$ ##AUDIT TRAIL=  $$ (NUMBER, WHEN, WHO, WHERE, WHAT)
(   1,<2006-04-10 15:18:30.83 +100>,<MAYBRIDGE\nmr>,<NMR_250MHZ>,
      <created by zg, POWCHK disabled, PULCHK disabled
       configuration hash MD5:
       84 BC 41 DB A1 6E 1D 46 DA 25 12 A5 C1 ED C5 3A
       data hash MD5: 64K
       BE 09 EE DD B3 01 5D DE 42 AF E5 0F A7 EC C9 50>)
(   2,<2006-04-10 15:18:43.28 +100>,<MAYBRIDGE\nmr>,<NMR_250MHZ>,
      <Start of raw data processing
       ef LB = 0.3 FT_mod = 6 PKNL = 1 SI = 32K 
       data hash MD5: 32K
       10 D1 44 85 9E BA C4 DE AC 93 85 58 6E 83 FE B6>)
(   3,<2006-04-10 15:18:45.04 +100>,<MAYBRIDGE\nmr>,<NMR_250MHZ>,
      <apk 
       data hash MD5: 32K
       E8 24 B4 AA 1F 94 CB 17 C4 F2 00 5C 4B D5 4A D9>)
(   4,<2006-04-10 15:18:46.14 +100>,<MAYBRIDGE\nmr>,<NMR_250MHZ>,
      <abs ABSG = 5 
       data hash MD5: 32K
       6B 4B 07 F0 F3 FE 13 B2 29 E1 40 E6 44 BB 9E 0B>)
$$ ##END=
$$ 
$$ hash MD5
$$ 03 77 14 06 FA 08 70 17 27 34 3D 03 AA 99 F3 F5
##$RELAX= 
##$RELAX= 
##$RELAX= 
##$RELAX= 
##$RELAX= 
##$RELAX= 
##$RELAX= 
$$ Bruker specific parameters
$$ --------------------------
##$DU= <C:\u>
##$EXPNO= 2430
##$NAME= <ADRS>
##$PROCNO= 1
##$TYPE= <nmr>
##$USER= <dgb>
##$AMP= (0..31)
100 100 100 100 100 100 100 100 100 100 100 100 100 100 100 100 100 100 
100 100 100 100 100 100 100 100 100 100 100 100 100 100 
##$AQSEQ= 0
##$AQ_mod= 3
##$AUNM= <au_zg>
##$AUTOPOS= <55 >
##$BF1= 250.13
##$BF2= 250.13
##$BF3= 250.13
##$BF4= 250.13
##$BF5= 500.13
##$BF6= 500.13
##$BF7= 500.13
##$BF8= 500.13
##$BYTORDA= 1
##$CFDGTYP= 0
##$CFRGTYP= 5
##$CHEMSTR= <none>
##$CNST= (0..31)
1 1 145 1 1 1 1 1 1 1 1 1 1 1 1 1 1 1 1 1 1 1 1 1 1 1 1 1 1 1 1 1 
##$CPDPRG= <>
##$CPDPRG1= <>
##$CPDPRG2= <>
##$CPDPRG3= <>
##$CPDPRG4= <mlev>
##$CPDPRG5= <mlev>
##$CPDPRG6= <mlev>
##$CPDPRG7= <mlev>
##$CPDPRG8= <mlev>
##$CPDPRGB= <>
##$CPDPRGT= <>
##$D= (0..31)
0 1 0 0 0 0 0 0 0 0.06 0 0 0 0 0 0 0.0002 0 0 0 0 0 0 0 0 0 0 0 0 0 0 
0 
##$DATE= 1144678709
##$DBL= (0..7)
120 120 120 120 120 120 120 120 
##$DBP= (0..7)
150 150 150 150 150 150 150 150 
##$DBP07= 0
##$DBPNAM0= <>
##$DBPNAM1= <>
##$DBPNAM2= <>
$$ [...]
##$SUBNAM6= <"">
##$SUBNAM7= <"">
##$SUBNAM8= <"">
##$SUBNAM9= <"">
##$SW= 20.6930455092707
##$SWIBOX= (0..15)
0 0 3 0 0 0 0 0 0 0 0 0 0 0 0 0 
##$SW_h= 5175.983436853
##$TD= 65536
##$TD0= 1
##$TE= 295.16
##$TE2= 300
##$TE3= 300
##$TEG= 300
##$TL= (0..7)
0 120 120 120 120 120 120 120 
##$TP= (0..7)
150 150 150 150 150 150 150 150 
##$TP07= 0
##$TPNAME0= <>
##$TPNAME1= <>
##$TPNAME2= <>
##$TPNAME3= <>
##$TPNAME4= <>
##$TPNAME5= <>
##$TPNAME6= <>
##$TPNAME7= <>
##$TPOAL= (0..7)
0.5 0.5 0.5 0.5 0.5 0.5 0.5 0.5 
##$TPOFFS= (0..7)
0 0 0 0 0 0 0 0 
##$TUNHIN= 0
##$TUNHOUT= 0
##$TUNXOUT= 0
##$USERA1= <user>
##$USERA2= <user>
##$USERA3= <user>
##$USERA4= <user>
##$USERA5= <user>
##$V9= 5
##$VALIST= <valist>
##$VCLIST= <CCCCCCCCCCCCCCC>
##$VD= 0
##$VDLIST= <DDDDDDDDDDDDDDD>
##$VPLIST= <PPPPPPPPPPPPPPP>
##$VTLIST= <TTTTTTTTTTTTTTT>
##$WBST= 1024
##$WBSW= 4
##$XGAIN= (0..3)
0 0 0 0 
##$XL= 0
##$YL= 0
##$YMAX_a= 275400
##$YMIN_a= -308703
##$ZGOPTNS= <>
##$ZL1= 120
##$ZL2= 120
##$ZL3= 120
##$ZL4= 120
##$ABSF1= 16.522
##$ABSF2= -4.171173
##$ABSG= 5
##$ABSL= 3
##$ALPHA= 0
##$AQORDER= 0
##$ASSFAC= 0
##$ASSFACI= 0
##$ASSFACX= 0
##$ASSWID= 0
##$AUNMP= <proc_1d>
##$AZFE= 0.1
##$AZFW= 0.1
##$BCFW= 0
##$BC_mod= 0
##$BYTORDP= 0
##$COROFFS= 0
##$CY= 12.5
##$DATMOD= 1
##$DC= 0
##$DFILT= <>
##$DTYPP= 0
##$F1P= 14.0000005364418
##$F2P= -0.99999901652339
##$FCOR= 0.5
##$FTSIZE= 32768
##$FT_mod= 6
##$GAMMA= 0
##$GB= 0
##$INTBC= 1
##$INTSCL= 1
##$ISEN= 128
##$LB= 0.3
##$LEV0= 0
##$LPBIN= 0
##$MAXI= 10000
##$MC2= 0
##$MEAN= 0
##$ME_mod= 0
##$MI= 0
##$NCOEF= 0
##$NC_proc= -4
##$NLEV= 6
##$NOISF1= 0
##$NOISF2= 0
##$NSP= 0
##$NTH_PI= 0
##$NZP= 0
##$OFFSET= 16.522
##$PC= 1
##$PHC0= 165.3029
##$PHC1= 6.21455
##$PH_mod= 1
##$PKNL= yes
##$PPARMOD= 0
##$PSCAL= 4
##$PSIGN= 0
##$REVERSE= no
##$SF= 250.13
##$SI= 32768
##$SIGF1= 0
##$SIGF2= 0
##$SINO= 400
##$SIOLD= 32768
##$SREGLST= <1H.DMSO>
##$SSB= 0
##$STSI= 32768
##$STSR= 0
##$SW_p= 5175.98343685301
##$SYMM= 0
##$S_DEV= 0
##$TDeff= 65536
##$TDoff= 0
##$TI= <Analysis number 999999
Compound Code 99
Book Reference 9
Project Code 9>
##$TILT= no
##$TM1= 0
##$TM2= 0
##$TOPLEV= 0
##$USERP1= <user>
##$USERP2= <user>
##$USERP3= <user>
##$USERP4= <user>
##$USERP5= <user>
##$WDW= 1
##$XDIM= 32768
##$YMAX_p= 315180474
##$YMIN_p= -523530
$$ End of Bruker specific parameters
$$ ---------------------------------
##NTUPLES= NMR SPECTRUM
##VAR_NAME=  FREQUENCY,     SPECTRUM/REAL,   SPECTRUM/IMAG
##SYMBOL=    X,             R,               I
##VAR_TYPE=  INDEPENDENT,   DEPENDENT,       DEPENDENT
##VAR_FORM=  AFFN,          ASDF,            ASDF
##VAR_DIM=   32768,         32768,           32768
##UNITS=     HZ,            ARBITRARY UNITS, ARBITRARY UNITS
##FACTOR=    0.157963299565203, 1,           1
##FIRST=     4132.6476996994, 0,             0
##LAST=      -1043.33573715361, 0,           0
##MIN=       -1043.33573715361, -523530,     0
##MAX=       4132.6476996994, 315180474,     0
$$ Real data points
##PAGE= N=1
##DATA TABLE= (X++(R..R)), XYDATA
$$ [...]
24736A2860149M72454N62043P31436P94884O91581P89002P86944P51275Q62611
$$ 12860149 13332603 13894646 14626082 15420966 16112547 16901549 17688493 18439768 19302379
24727A9302379Q69429Q99461R14627R84767J068116J059407J087086J104017R84853
$$ 19302379 20171808 21071269 21985896 22970663 24038779 25098186 26185272 27289289 28274142
24718B8274142R94192J030464R61357Q03433Q60634R89458P70446O83283M74464
$$ 28274142 29268334 30298798 31260155 32063588 32924222 33913680 34684126 35367409 35841873
24709C5841873K63941J83407K20983J35596M9007j27458k01447k82586m81626
$$ 35841873 36105814 36289221 36510204 36645800 36694807 36567349 36365902 36083316 35601690
24700C5601690l80523m62523o73556q01751q75151o67754o27700p63461n99409
$$ 35601690 35221167 34758644 34085088 33283337 32408186 31740432 31112732 30349271 29749862
24691B9749862o22651o65955p86520o63175n51125p10070p86429o58466m88679
$$ 29749862 29127211 28461256 27674736 27011561 26460436 25750366 24963937 24305471 23816792
24682B3816792o70767p37681n79476o02679m85204k97327l91057n72209m24369
$$ 23816792 23146025 22408344 21828868 21226189 20740985 20443658 20052601 19480392 19056023
24673A9056023m72866m22982l27663l58578m79713m19200l24419j75517k90212
$$ 19056023 18583157 18160175 17832512 17473934 16994221 16575021 16250602 16075085 15784873
24664A5784873l35967q6430k14827m75878k83278l15761k14329k09403j88346
$$ 15784873 15448906 15362476 15147649 14671771 14388493 14072732 13858403 13649000 13460654
24655A3460654k20497j71406p7348r8023j74722j16424j78650j09837j88392m72878
$$ 13460654 13240157 13068751 12991403 12893380 12718658 12602234 12423584 12313747 12125355 11652477
24645A1652477j71888k0904L2780r0260j71240j12873q1874j83069q5090q3369
$$ 11652477 11480589 11459685 11492465 11402205 11230965 11118092 11036218 10853149 10768059 10684690
24635A0684690J7462j1003j5213K1387k0317j50749j44504M8883o6568j81915
$$ 10684690 10702152 10691149 10675936 10697323 10677006 10526257 10381753 10430636 10364068 10182153
24625A0182153j90115q4223R0243J1411m7442o6473j52152P6712J69917P0787
$$ 10182153 9992038 9907815 9998058 10009469 9962027 9895554 9743402 9820114 9990031 10060818
24615A0060818J0910K200p8441n1202L8907J73177J63489J14916M7729p5028m1439
$$ 10060818 10071728 10073928 9995487 9944285 9983192 10156369 10319858 10434774 10482503 10407475 10366036
24604A0366036Q7238q0907j24198J31925J86894M5977J12206R0534J61373J88815
$$ 10366036 10453274 10372367 10248169 10380094 10566988 10612965 10725171 10815705 10977078 11165893
24594A1165893J55121K41394J69009R15O1498Q9096J38113J99411K79215K23779
$$ 11165893 11321014 11562408 11731417 11732332 11793830 11882926 12021039 12220450 12499665 12723444
24584A2723444J50857J18238J84873J31805K79282L21400K60978K95705K35830
$$ 12723444 12874301 12992539 13177412 13309217 13588499 13909899 14170877 14466582 14702412
24575A4702412K15944M46201M53356K85550M10628L97409L42787L06497L99250
$$ 14702412 14918356 15364557 15817913 16103463 16514091 16911500 17254287 17560784 17960034
24566A7960034M17689O29738M28567N26591N62743L70566L64637N46209O37062
$$ 17960034 18377723 19007461 19436028 19962619 20525362 20895928 21260565 21806774 22443836
24557B2443836P02303O42354N27369O17645O41601O75047N17331N90200O34857
$$ 22443836 23146139 23788493 24315862 24933507 25575108 26250155 26767486 27357686 27992543
24548B7992543O59069N31432N50737N05953M12824M45442L45982K21815L68116
$$ 27992543 28651612 29183044 29733781 30239734 30652558 31098000 31443982 31665797 32033913
24539C2033913L11829J66942J14214j60570k61199k03375j82981j39144k22643
$$ 32033913 32345742 32512684 32626898 32466328 32205129 32001754 31818773 31679629 31456986
24530C1456986l53675n03948m43473l57337l50676n30962o95561o29307p43330
$$ 31456986 31103311 30599363 30155890 29798553 29447877 28916915 28221354 27592047 26848717
24521B6848717o30946n15114o43053o29049p40911o99880n70192m67627n36189
$$ 26848717 26217771 25702657 25059604 24430555 23689644 22989764 22419572 21951945 21415756
24512B1415756o70796o42780p19030m43939m18855n04790n71128n70736n12643
$$ 21415756 20744960 20102180 19383150 18939211 18520356 18015566 17444438 16873702 16361059
24503A6361059m12509l46055l56626m34482l09762k16185l76664m94973l41037
$$ 16361059 15948550 15602495 15245869 14811387 14501625 14285440 13908776 13413803 13072766
24494A3072766l03620j60259k70592k81250l53804l68799k85670l97892k67411
$$ 13072766 12769146 12608887 12338295 12057045 11703241 11334442 11048772 10650880 10383469
24485A0383469j27021j30704j49419k20495k17592k86910k30786k63628j95101
$$ 10383469 10256448 10125744 9976325 9755830 9538238 9251328 9020542 8756914 8561813
24476H561813j09511j81018j42198j31911k52786j24073j40280r5150j61066o4335
$$ 8561813 8452302 8271284 8129086 7997175 7744389 7620316 7480036 7384886 7223820 7159485
24466G159485K6976j23931k49307j18834k36053q3577o738j21289k57826J1407
$$ 7159485 7186461 7062530 6813223 6694389 6458336 6374759 6368021 6246732 5988906 6000313
24456F000313j11839q1473L4556p134j43332k62706k08228r5910P2907O423j78728
$$ 6000313 5888474 5807001 5841557 5834423 5691091 5428385 5220157 5124247 5197154 5203577 5024849
24445E024849j52120q1823j54992j3314M5651n3391j50522j16882J8790q4629
$$ 5024849 4872729 4790906 4635914 4622600 4668251 4614860 4464338 4347456 4366246 4281617
24435D281617j45024j22782m7291J43085j04120j25014j02573j55010j3951J2776
$$ 4281617 4136593 4013811 3966520 4109605 4005485 3880471 3777898 3622888 3608937 3621713
24425C621713r975p4952p8040K7336J1726j3382j2294k3017m0883m9589j48602
$$ 3621713 3611738 3536786 3458746 3486082 3497808 3484426 3472132 3449115 3408232 3358643 3210041
24414C210041p6388j27144j72609l3497J7195l1431J43651j11848j9194P1587
$$ 3210041 3133653 3006509 2833900 2800403 2817598 2786167 2929818 2817970 2798776 2870363
24404B870363J62617n0690M576k01425j32415m0740n2892r574K4238k22050j32873
$$ 2870363 3032980 2982290 2986866 2785441 2653026 2612286 2559394 2549820 2574058 2352008 2219135
24393B219135P3808P1112K1233j26881j44429P6681J6039r7866j25749l3840o8635
$$ 2219135 2292943 2364055 2385288 2258407 2113978 2190659 2206698 2108832 1983083 1949243 1880608
24382A880608K3549j6924j9232j7312k1277J7080J07990m248j18509J15910J163
$$ 1880608 1904157 1887233 1868001 1850689 1829412 1846492 1954482 1950234 1831725 1947635 1948798
24371A948798N3707Q295n1781K8149j30260j94541n1847P3564N3857J023K402
$$ 1948798 2002505 2010800 1959019 1987168 1856908 1662367 1610520 1684084 1737941 1738964 1741366
24360A741366j3781j58367j13940R074J83323j33188k08659Q8943N7688q8953
$$ 1741366 1727585 1569218 1455278 1464352 1647675 1514487 1305828 1394771 1452459 1363506
24350A363506j25728M5527j1249l6496j5526L6101N763m7717n3274N1090j9419
$$ 1363506 1237778 1283305 1272056 1235560 1220034 1256135 1261898 1214181 1160907 1211997 1192578
24339A192578q7963j00759k9315P8060J14189J77644P3870o4047n4707n08j77774
$$ 1192578 1104615 1003856 974541 1052601 1166790 1344434 1418304 1354257 1299550 1299042 1121268
24328A121268r4523m2393j5183R1963l2766j03025l0692J2952j6755l1051P9812
$$ 1121268 1026745 984352 969169 1061132 1028366 925341 894649 907601 890846 859795 939607
24317I39607n4606k02456K7030J9208l7746J28481o4228r1615n3206O9193J15769
$$ 939607 885001 682545 709575 728783 691037 819518 755290 663675 610469 679662 795431
24306G95431m8051o1715K0873o0311p2687J09237J47699J0844j03974n8152m8988
$$ 795431 747380 685665 706538 646227 573540 682777 830476 841320 737346 679194 630206
24295F30206N6006L2279n0570l0643j66475K039J11051J60224J38846M8674j15164
$$ 630206 686212 718491 667921 637278 470803 472842 583893 744117 882963 931637 816473
24284H16473j47691p1103O1191M5077j7108K9439k7115k2139q5175j12878O2371
$$ 816473 668782 597679 658870 703947 686839 716278 689163 667024 581849 468971 531342
24273E31342J0665k5158N7917Q9161o5435k42026j04065J9988J64365Q4248J10500
$$ 531342 542007 516849 574766 663927 598492 356466 252401 272389 436754 521002 631502
24262F31502M5585j21648j53295j14593N8467J22928J40739R2617j3900j3567
$$ 631502 677087 555439 402144 287551 346018 468946 609685 702302 688402 674835
24252F74835m9016l6654j39005q4524R9681K04063K3101q9455o7229N4579p168
$$ 674835 625819 589165 450160 365636 465317 669380 692481 603026 535797 590376 583208
24241E83208j13585r6547j75365J46097K25666n6394k3822o491P5792L4102l8358
$$ 583208 469623 373076 197711 343808 569474 513080 489258 482767 558559 592661 554303
24230E54303J28454q725k29646p0061o976m546j4411o2986m6214k7757r0252l6855
$$ 554303 682757 674032 444386 374325 367349 362803 348392 285406 239192 211435 121183 84328
24218H4328J39275m1412p4673r074P1458K19007J12120l6466j40428r884r3004
$$ 84328 223603 182191 107518 98444 169902 388909 501029 464563 324135 314251 221247
24207B21247k0677O1040k68896j01938Q6681O0296J36638M9350K1384n5015j34565
$$ 221247 200570 261610 -7286 -109224 -22543 37753 174391 223741 245125 190110 55545
24196E5545M2580R6886P3131O2798M9640k9388j52610j3658n1016M1828J07894
$$ 55545 98125 195011 268142 330940 380580 351192 198582 184924 133908 175736 283630
24185B83630K2706l6684r2389K5582j24991L5315J03072m5088J588O9811J7908
$$ 283630 306336 269652 177263 202845 77854 113169 216241 171153 172741 242552 260460
24174B60460J8427J8233J4705k12612k9703J93526Q0800K715o1033j50156j22030
$$ 260460 278887 297120 311825 99213 69510 263036 343836 346551 285518 135362 13332
24163A3332q1236o6299J33287J18172j0285l5437n7141L2239J35417M3312l4571
$$ 13332 -67904 -134203 -916 117256 106971 71534 14393 46632 182049 225361 190790
24152A90790k1325J00162l780l8117j24137j16081M8974r799O6595l9370M7885
$$ 190790 169465 269627 265847 227730 103593 -12488 36486 26687 93282 53912 101797
24141A01797M9789n5644n2915n0380O1075J16953n3778j3039J20439K7677j16088
$$ 101797 151586 95942 43027 -7353 53722 170675 116897 103858 224297 251974 135886
24130A35886J0572j5939j5568J28302j37873o4590J01222J17107j6042r7146J17682
$$ 135886 146458 130519 114951 243253 105380 40790 142012 259119 243077 145931 263613
24119B63613O1057n0362j38072N3233J65257o7649o9809p6438O8200M2012K3816
$$ 263613 324670 274308 136236 189469 354726 287077 217268 140830 209030 251042 274858
24108B74858n0426k0780l7452j6189j22109L8344n3761l9029J46864N1901Q6183
$$ 274858 224432 203652 166200 150011 27902 66246 12485 -26544 120320 172221 258404
24097B58404N7362J0716r8722j90073P2782J33496L6440J11464l2194k06371j4425
$$ 258404 315766 326482 227760 37687 110469 243965 280405 391869 359675 153304 138879
24086A38879q4259j02776N5371K9740R4601j83614j4585o529J64214R1793j8870
$$ 138879 54620 -48156 7215 36955 131556 -52058 -66643 -73172 91042 182835 163965
24075A63965q6589n9878o1499R2821J23744q9230j12380J0980Q3191L4548q8413
$$ 163965 77376 17498 -44001 48820 172564 83334 -29046 -18066 65125 99673 11260
24064A1260M6373k7137q7096N8406J13881j55508Q0912P0786m480J41022Q2019
$$ 11260 57633 30496 -56600 1806 115687 -39821 41091 111877 107397 248419 330438
24053C30438m8757m3524k820o2037j09828j5544r2807p3798J16565J13080l6523
$$ 330438 281681 238157 235337 173300 63472 47928 -44879 -118677 -2112 110968 74445
24042G4445P681M0124M8513j01902l2768J19295O6288p2813j24620m5416N8211
$$ 74445 82126 122250 170763 68861 36093 155388 221676 148863 24243 -21173 37038
24031C7038R9486L7160r0084j91691j70028R5003K51353J30385J06166J24800
$$ 37038 136524 173684 83600 -108091 -278119 -183116 68237 198622 304788 429588
24021D29588j6267j32500j21118p1286R1700L5477O7016r5298j73782j44478K9964
$$ 429588 413321 280821 159703 88417 180117 215594 282610 187312 13530 -130948 -100984
24010a00984R0702m273k7953L6776J22603J30884o873N7611k5795k21823p5761
$$ -100984 -10282 -14555 -42508 -5732 116871 247755 240882 298493 272698 50875 -24886
23999b4886K5241M7206Q6250J5267K1983k14270k04703J413Q6129K31463O903
$$ -24886 355 47561 133811 149078 171061 -43209 -247912 -246499 -160370 71093 77996
23988G7996N3416J01738K5544j42429k9698M4579J55336r2524j03031j0822L7390
$$ 77996 131412 233150 258694 116265 86567 131146 286482 193958 90927 80105 117495
23977A17495q2968Q2393L2302p3495j1827o8844r3P76J06807K684R7919R5092
$$ 117495 34527 116920 149222 75727 63900 -4944 -5037 -4261 102546 105230 203149 298241
23965B98241o4415j41542l5505j10782j03855R6329J8519J33643R1883j9866l1793
$$ 298241 233826 92284 56779 -54003 -157858 -61529 -43010 90633 182516 162650 130857
23954A30857q8026R628L8699j18506r6820R8116J31239p1383J05309J37762j77254
$$ 130857 42831 52459 91158 -27348 -124168 -26052 105187 33804 139113 276875 99621
23943I9621r6747J21009O0856K6116J11687k4185j64164N1950Q9235M7365r0322
$$ 99621 2874 123883 184739 210855 322542 298357 134193 186143 275378 322743 232421
23932B32421j17648j87184l831N2194R5753j05233o839O5675j1458J5522N2006
$$ 232421 114773 -72411 -76242 -24048 71705 -33528 -40367 25308 13850 29372 81378
23921H1378J00899p8694k7751N7477J7517p0927J2347O3097l3117j9500k7164
$$ 81378 182277 103583 75832 133309 150826 79899 92246 155343 122226 102726 75562
23910G5562n8157J45770L1566N044K6432N0224N4371q1307j50415p3457n3608
$$ 75562 17405 163175 194741 199785 226217 276441 330812 249505 99090 25633 -27975
23899b7975O7563P3315K7920k28303K1356K3740j0305r4535O0594O5040M3629
$$ -27975 39588 112903 140823 -87480 -66124 -42384 -52689 -147224 -86630 -21590 22039
23888B2039O2476Q3502r8399L7758J64370j26637j37467P8114J3142K13958J20815
$$ 22039 84515 168017 69618 107376 271746 145109 7642 85756 98898 312856 433671
23877D33671L5133q7086j83603k8065m1086Q750j0923o5523k6017O2563L63j7240
$$ 433671 468804 381718 198115 170050 128964 137714 126791 61268 35251 97814 98177 80937
23865H0937L7088J01226P0590J45334j28697j84575J17035q6347j41767J9227
$$ 80937 118025 219251 289841 435175 306478 121903 238938 152591 10824 30051
23855C0051K7053J31709l5214l8814p3420k7831K6327K1966j87358l3792J37274
$$ 30051 57104 188813 153599 114785 41365 13534 39861 61827 -125531 -159323 -22049
23844b2049L1724n9859j10140J60018K45072J10864n8817K5565k4501j35027L2376
$$ -22049 9675 -50184 -160324 -306 244766 355630 296813 322378 297877 162850 195226
23833A95226J2278L3767m2967m7644n3931k4778P1087q408R7608K581r548K296
$$ 195226 207504 241271 198304 150660 96729 71951 143038 134630 232238 234819 225271 227567
23821B27567L4398j36193j02320o3963L6158O2515N3280p0167l9723j16687M5913
$$ 227567 261965 125772 23452 -40511 -4353 58162 111442 41275 1552 -115135 -69222
23810f9222J42531n1288r2569J3817m5586J4583J40856M5099l4227p0075l520
$$ -69222 73309 22021 -70548 -56731 -102317 -87734 53122 98221 63994 -6081 -9601
23799i601O7966j1601q3927O3682P9660j14874p5911n487j67538M4591K15883
$$ -9601 58365 46764 -37163 26519 106179 -8695 -84606 -90093 -257631 -213040 2843
23788B843R5807q037q9954k5110j7304n3910Q9746K6223M8243p9315k1216J26826
$$ 2843 98650 90613 659 -24451 -41755 -95665 -5919 20304 68547 -10768 -31984 94842
23776I4842M137j08046j12663M2249J84809J21648L5649k75743j39059Q9706p3282
$$ 94842 98979 -9067 -121730 -79481 105328 226976 262625 -13118 -152177 -62471 -135753
23765a35753r3576o3368O4706J91329J06433L1183o7928J45091R8223L714j18669
$$ -135753 -229329 -292697 -227991 -36662 69771 100954 33026 178117 276340 280054 161385
23754A61385N3709k2452q6533k6789J7320K4003O3927L3470m6648n5715j34629
$$ 161385 215094 192642 106109 79320 96640 120643 184570 218040 171392 115677 -18952
23743a8952n8010n3692n5646O2195j02535k5877J74617O7528j43993o4460P9019
$$ -18952 -76962 -130654 -186300 -124105 -226640 -252517 -77900 -10372 -154365 -218825 -139806
23732a39806P1652k1633j58343k0120k2426j1583M2422J99617J55840j14607p6715
$$ -139806 -68154 -89787 -248130 -268250 -290676 -302259 -259837 -60220 95620 -18987 -95702
23721i5702j8715R0768j223k2947K756L3711o2592R8652J83880o8155J149o1486
$$ -95702 -114417 -23649 -24872 -47819 -45063 -11352 -73944 24708 208588 140433 141582 80096
23709H0096k5543k4838k4581k1790k5933Q075m7535l3668O6712J8058j13813R7966
$$ 80096 54553 29715 5134 -16656 -42589 -34514 -82049 -115717 -49005 -30947 -144760 -46794
23697d6794J54524L2143o1995j10483q3799o6898j41736K0897K555J61594J28075
$$ -46794 107730 139873 77878 -32605 -116404 -183302 -325038 -304141 -301586 -139992 -11917
23686a1917N6328K4706O2304Q9996j48006j24198K9147n8415M7836J45919J13835
$$ -11917 44411 69117 131421 221417 73411 -50787 -21640 -80055 -32219 113700 227535
23675B27535n6021l0262j18210j82741l3985k2178M1009N0872J82554K60081l7612
$$ 227535 171514 141252 23042 -159699 -193684 -215862 -174853 -123981 58573 318654 281042
23664B81042j23069j23744n6935J7515O9611o2242k7363j08061O9810o803j0039
$$ 281042 157973 34229 -22706 -5191 64420 2178 -25185 -133246 -63436 -70239 -80278
23653h0278R0182J00423R5053Q794j60800k3589J21933J3514j49707j39474L2432
$$ -80278 9904 110327 205380 214174 53374 29785 151718 165232 15525 -123949 -91517
23642i1517j9874j2342Q3442J7795L6840j05944K1592N9899j3891q019k0226J3618
$$ -91517 -111391 -123733 -40291 -22496 14344 -91600 -70008 -10109 -24000 -32019 -52245 -38627
23630c8627J22118p200j38383j02755j1534N9974l8738j19461P9248J22696O237
$$ -38627 83491 76291 -62092 -164847 -176381 -116407 -155145 -274606 -195358 -72662 -66425
23619f6425l1867J20134P3156l3806r7697j61772J05514J34842O2322m9090m823
$$ -66425 -98292 21842 94998 61192 -36505 -198277 -92763 42079 104401 55311 50488
23608E0488J5696o7609N6510J10521J15812j30639j07774N5518J00796j5185Q510
$$ 50488 66184 -1425 55085 165606 281418 150779 43005 98523 199319 184134 192644
23597A92644j01444k02100J82094R6603j21454j63022Q7848L462J40095L7531
$$ 192644 91200 -110900 71194 167797 46343 -116679 -28831 -25369 114726 152257
23587A52257j921R0641L9568O4339L9622M833l7954p4266J9379j05567M405l0370
$$ 152257 150336 240977 280545 344884 384506 389339 351385 277119 296498 190931 195336 164966
23575A64966k39437j65200n8698J46597J72392R0629o7238J8033o1681P205L0007
$$ 164966 -74471 -239671 -298369 -151772 20620 111249 44011 62044 363 7568 37575
23564C7575O5860q851J34509O215j70307N0744J9935J66237o5349j25794j35797
$$ 37575 103435 94584 229093 235308 65001 115745 135680 301917 236568 110774 -25023
23553b5023n5130P8434L0949n917o2551l7909Q5107O0316m8470p8044o5732J9637
$$ -25023 -80153 -1719 29230 23313 -39238 -77147 7960 68276 19806 -58238 -123970 -104333
23541a04333m3540j30689O5792J55183k9560O6798P2515j4447m5669K0606K6035
$$ -104333 -147873 -278562 -212770 -57587 -87147 -20349 52166 37719 -7950 12656 38691
23530C8691J302p4087l4288O8371J27349k5487m6171L9085n6481P309m4885k5386
$$ 38691 39993 -34094 -68382 -11 127338 101851 55680 94765 38284 45593 708 -24678
23518b4678L1529R7477N0625J61J4678j65441j13328Q8258N6393j1863J7820j05378
$$ -24678 6851 104328 154953 155114 169792 4351 -108977 -20719 35674 23811 41631 -63747
23506f3747j55181K0684K1638k1683n4877K7264J86799j18864j19697L3702O1140
$$ -63747 -218928 -198244 -176606 -198289 -253166 -225902 -39103 -157967 -277664 -243962 -182822
23495a82822R1100O9845J1744n5806j02326j305P3833J3729O7807l6097j30639
$$ -182822 -91722 -21877 -10133 -65939 -168265 -169570 -95737 -82008 -14201 -50298 -180937
23484a80937P9581J14282N0029q3748k4131O7493k674N1579N6895j6716p4171
$$ -180937 -101356 12926 62955 -20793 -44924 22569 19895 71474 128369 111653 37482
23473C7482j56167l8280O2064O9452J4650N8541k3018K0208L6326o2198p9520
$$ 37482 -118685 -156965 -94901 -25449 -10799 47742 24724 44932 81258 19060 -60460
23462f0460j02489j43617m0507J6798J76738J1150l7679J14721M2707J44996J29138
$$ -60460 -162949 -306566 -347073 -330275 -153537 -142387 -180066 -65345 -22638 122358 251496
23451B51496M0707j66427j60969j39799j797J73710M1305j18913j37680q36J49216
$$ 251496 292203 125776 -35193 -174992 -176789 -3079 38226 -80687 -218367 -219203 -69987
23440f9987J9857N4186L6257M992k2356j14048K5899L6648p89k4348J80022N5825
$$ -69987 -50130 4056 40313 45305 22949 -91099 -65200 -28552 -29341 -53689 126333 182158
23428A82158k7016J04725o696j3044O3405j41405p1401p0856N9288O596r4122
$$ 182158 155142 259867 253171 240127 303532 162127 90726 19870 79158 85754 -8368
23417h368p5510j17534q662O1661Q8596o3372j39368Q226J0414L8224N2338P2852
$$ -8368 -83878 -201412 -210074 -148413 -59817 -123189 -262557 -254331 -243917 -205693 -153355 -80503
23405h0503n8553n591P8395K5602L9316j48931j08754J47261l778P088m4654k6026
$$ -80503 -139056 -144647 -66252 -40650 -1334 -150265 -259019 -111758 -115536 -108448 -153102 -179128
23393a79128J65657l3917q2080q5131M9787J11762p2953Q2606J08289m5555P5137
$$ -179128 -13471 -47388 -129468 -214599 -164812 -53050 -126003 -43397 64892 19337 94474
23382I4474L1359p5244k3831j17608n0412R8890p6995J8067K5670P1353J1029
$$ 94474 125833 50589 26758 -90850 -141262 -42372 -119367 -101300 -75630 -4277 6752
23371F752l4077P6702K3949j11159l924L061K683p5865K9095K4472N7595J67245
$$ 6752 -27325 49377 73326 -37833 -41757 -38696 -36013 -111878 -82783 -58311 -716 166529
23359A66529P9675k4412r4672o6407q460l301q4235j35317j57444l6851Q6789
$$ 166529 246204 221792 127120 60713 52253 48952 -35283 -170600 -328044 -364895 -278106
23348b78106J27777P368m4779M3009J38986j8122n5476R6165N385q1716Q2635
$$ -278106 -150329 -142961 -187740 -144731 -5745 -23867 -79343 16822 22207 -59509 23126
23337B3126K1971R5553L8639J4304n762m1344J52307j22983j67583p6547j32082
$$ 23126 45097 140650 179289 193593 187831 146487 298794 175811 8228 -68319 -200401
23326b00401N283O7956J60097k2313k8550M8834j45692q8152L259l4613P5239
$$ -200401 -195118 -127162 32935 10622 -17928 30906 -114786 -202938 -199679 -234292 -159053
23315a59053P6493p2156J108J52657p3759n5797N7509p0815j68426K13182K47252
$$ -159053 -82560 -154716 -153608 -951 -74710 -130507 -72998 -143813 -312239 -99057 148195
23304A48195R802l714J9461q8694j00417p7614j45348j07424J71336R3349M1088
$$ 148195 157997 154283 173744 85050 -15367 -92981 -238329 -345753 -174417 -81068 -39980
23293c9980K1472n2344q6015N9962R3516J6708M8366m992j2967j17789L1584k3739
$$ -39980 -18508 -70852 -156867 -96905 -3389 13319 61685 56693 43726 -74063 -42479 -66218
23281f6218O0426J30645J21410R478j22405m9616j5835Q1270m3674p7002j7944
$$ -66218 -5792 124853 246263 255741 133336 83720 67885 149155 105481 28479 10535
23270A0535n1828J81178P0019o4273m8684J2787j26102o596q7595R953J07079
$$ 10535 -41293 139885 209904 145631 96947 109734 -16368 -22964 -110559 -100606 6473
23259F473K30410J6345j01886M2471o3585k5102Q4132N6251J39570n5668j56215
$$ 6473 236883 253228 151342 193813 130228 105126 189258 245509 385079 329411 173196
23248A73196P80n3221l8718l0483n0578O192K9500k6303o0002M8277M1113l0755
$$ 173196 173976 120755 82037 51554 976 7168 36668 10365 -49637 -1360 39753 8998
23236H998L5881l217J1368J6465j07257o70p2975k9181K4015O9821j0726L2194
$$ 8998 44879 41662 53030 69495 -37762 -38432 -111407 -140588 -116573 -46752 -57478 -25284
23224b5284l9520p5671m007j1180l9983n3171r828K1110P0523J48010o7663J10560
$$ -25284 -64804 -140475 -144482 -155662 -195645 -248816 -258644 -237534 -167011 -19001 -86664 23896
23212B3896o0226J4271o7493J9362J5761J49686M3461m4709l852m9174n6579J608
$$ 23896 -36330 -22059 -89552 -70190 -54429 95257 138718 94009 90157 40983 -15596 -13988
23200a3988O5896P8419M1811o6473n6053N3535j27057R1009J31742o3010p8042
$$ -13988 51908 130327 172138 105665 49612 103147 -23910 67099 198841 135831 57789
23189E7789k9436l8973J04790J04355m84O9782j38770m2481l0832q7921j21747
$$ 57789 28353 -10620 94170 198525 198041 267823 129053 86572 55740 -32181 -153928
23178a53928R1389J83527J93867q2303j21543O2168q8833j74306j4368L2429P7775
$$ -153928 -62539 120988 314855 232552 111009 173177 84344 -89962 -104330 -71901 5874
23167E874J37506n7110j4762J57055K4336k8935j46287o3225q0330P8561R3854
$$ 5874 143380 86270 71508 228563 252899 223964 77677 14452 -65878 12683 106537
23156A06537p345L194r1203l8383q6620M9537J31550K6833L1895j17330j23446
$$ 106537 99192 102386 11183 -27200 -113820 -64283 67267 94100 125995 8665 -114781
23145a14781P8241N2866j3447l8999R786Q5091m2912j8485o0461j7557j16609
$$ -114781 -36540 16326 2879 -36120 -26334 58757 15845 -2640 -63101 -80658 -197267
23134a97267J653k3404j13968K1620J69515J17607M2038N1627n584p8995o4546
$$ -197267 -195614 -219018 -332986 -311366 -141851 -24244 17794 69421 63837 -15158 -79704
23123g9704P442R9898P1258l3276j4609m6338n834P5225N1456q580j13624k5802
$$ -79704 -72262 27636 98894 65618 51009 4671 -1163 74062 125518 116938 3314 -22488
23111b2488p0137o4750K3877L0680o909O6185J17612J4052j22605o9038k1515
$$ -22488 -92625 -157375 -133498 -102818 -109727 -43542 74070 88122 -34483 -103521 -125036
23100a25036Q2081K5349J3230Q2887P3018J41559j23872q4947J07410Q054n3411
$$ -125036 -42955 -17606 -4376 78511 151529 293088 169216 84269 191679 199733 146322
23089A46322j91797R431L6839J43162l5001j45530o0247K6954o3660o6567J34298
$$ 146322 -45475 -36044 795 143957 108956 -36574 -96821 -69867 -133527 -200094 -65796
23078f5796O4925L4827L3687p9359k0231r642j15284L1944K41756K8497j13280
$$ -65796 -871 33956 67643 -11716 -31947 -41589 -156873 -124929 116827 145324 32044
23067C2044J7694O643N6970o454j2517k9254j57989j07517O9608J22640N9455
$$ 32044 49738 56381 113351 106897 94380 65126 -92863 -200380 -130772 -8132 51323
23056E1323j2425J49096J8685p8462n0957j15571L9075Q6656m7161M4377j5266
$$ 51323 38898 187994 206679 128217 77260 -38311 764 87420 40259 84636 69370
23045F9370k93305k9575J18572L9731L6049J57998J08101j75411j02895O117K34478
$$ 69370 -223935 -253510 -134938 -95207 -59158 98840 206941 31530 -71365 -65248 169230
23034A69230J23615m0736k4691n2378k2541k5667j20504N0566J0491L8053j7j12841
$$ 169230 292845 252109 227418 175040 152499 126832 6328 56894 67385 105438 105421 -7420
23022g420j36551j03345P9209R0889Q6707j28212p1139k0326N8945J71845J6553
$$ -7420 -143971 -247316 -168107 -77218 9489 -118723 -189862 -210188 -151243 20602 37155
23011C7155j274N7351N9390o0795L4685L6729j6560q9000o6353r5139j44111l008
$$ 37155 35881 93232 152622 91827 126512 163241 146681 57681 -8672 -103811 -247922 -250930
22999b50930k569p1869J308m5526N8136N8839J35077q2488l850Q1355j8888o8357
$$ -250930 -253499 -325368 -324060 -369586 -311450 -252611 -117534 -200022 -203872 -122517 -141405 -209762
22987b09762j46375O6752K25393J97899N8450p7542R304j30493l6081J7625N7391
$$ -209762 -356137 -289385 -63992 133907 192357 114815 124119 -6374 -42455 -24830 32561
22976C2561J28651N3818o9470m080K6704r7938l9751j1049J1017n3761J4789k6330
$$ 32561 161212 215030 145560 141480 168184 70246 30495 19446 30463 -23298 -8509 -34839
22964c4839k5904N6409r9090l7668l6899L0163Q491J48908N0883Q2859k742J05276
$$ -34839 -60743 -4334 -103424 -141092 -177991 -147828 -139337 9571 60454 143313 140571 245847
22952B45847O2315O9161n7822j40919o1396j11266o1690J5078l1389J12489m699
$$ 245847 308162 377323 319501 178582 117186 5920 -55770 -40692 -72081 40408 35709
22941C5709n6557j7519n547q8239q0638J19725J9387q5797K8454J4396j08343
$$ 35709 -20848 -38367 -43914 -132153 -212791 -93066 -73679 -159476 -131022 -116626 -224969
22930b24969j0637J35900L473q1317N2247j09112k4274P4462J12066Q2353j23324
$$ -224969 -235606 -99706 -96233 -177550 -125303 -234415 -258689 -184227 -72161 10192 -113132
22919a13132K8076n4009M368R4367J0065l6033N4988M2897M8271P684m697o1458
$$ -113132 -85056 -139065 -134697 -40330 -30265 -66298 -11310 31587 79858 87542 82845 21387
22907B1387J55348O8167n8328o5434j60652m4868j812J17676m0783j929Q3680
$$ 21387 176735 244902 186574 121140 -39512 -84380 -86192 31484 -9299 -11228 72452
22896G2452O1681j05883j4033l1959j8544J4209N7946N1823K1971l2222K1943
$$ 72452 134133 28250 14217 -17742 -36286 -22077 35869 87692 109663 77441 99384
22885I9384K1048J3287J5227j00312J4856k3141o0046J9164n9951K7802M7191
$$ 99384 120432 133719 148946 48634 63490 40349 -19697 -533 -60484 -32682 14509
22874A4509j52592L074N6061O0050J70199K0323m6080J1066m7600n9256j8964
$$ 14509 -138083 -135009 -78948 -18898 151301 171624 125544 136610 89010 29754 10790
22863A0790p3336L0627j3712L4025N9303N9229k02343l6362N0415o846K8129n603
$$ 10790 -62546 -31919 -45631 -11606 47697 106926 -95417 -131779 -81364 -88210 -60081 -65684
22851f5684Q4237M5193j86366p3594P7147O345P5810R2334J5220K2605Q210j41093
$$ -65684 18553 63746 -122620 -196214 -119067 -112722 -36912 55422 70642 93247 101457 -39636
22839c9636o0783M4186R842l591q9584n4709K9532p5877P1678R2846l470m5610
$$ -39636 -100419 -56233 -46391 -49982 -139566 -194275 -164743 -240620 -168942 -76096 -79566 -125176
22827a25176j10437m3261R837J34353O0621k5032P5930O6571o9506L0160J8835
$$ -125176 -235613 -278874 -269037 -134684 -74063 -99095 -23165 43406 -26100 4060 22895
22816B2895p8642k109n1118k3734Q2986P5423p5955n7349M3759J46478J89072
$$ 22895 -55747 -57856 -108974 -132708 -49722 25701 -50254 -107603 -63844 82634 271706
22805B71706r8166o0290k5097p2605J01677J08512k9862n4902J855q6751j52530
$$ 271706 173540 113250 88153 15548 117225 225737 195875 140973 142828 56077 -96453
22794i6453m9277K3428j38920n7626J60497M6353L27m0015l9588J13736o1553
$$ -96453 -145730 -122302 -261222 -318848 -158351 -111998 -111671 -151686 -191274 -77538 -139091
22783a39091N8432r3588q0156L5465R3357L8670J28268R6040p9243p4146j44379
$$ -139091 -80659 -174247 -254403 -218938 -125581 -86911 41357 137397 58154 -15992 -160371
22772a60371l8975R6451j511O2666q436o9363j40636R7630Q1301r7990R1127J28629
$$ -160371 -199346 -102895 -104406 -41740 -50176 -119539 -260175 -162545 -81244 -179234 -88107 40522
22760D0522K2406n9067J08595J8363M5253j10781o5236l6588J22883n674l4920
$$ 40522 62928 3861 112456 130819 176072 65291 55 -36533 86350 80676 45756
22749D5756j6314n5367n7129R3372N8755n6103l4177j1520p1335R1830l4274N8656
$$ 45756 29442 -25925 -83054 10318 69073 12970 -21207 -32727 -104062 -12232 -46506 12150
22737A2150m7967L5704K703j5106Q8225L681l9118M5105j2264M4688J58236o2267
$$ 12150 -35817 -113 2590 -12516 75709 79390 40272 85377 73113 117801 276037 213770
22725B13770k2723L8924O8331J9900J4081q4167j2645P7585j43881k19730p2448
$$ 213770 191047 229971 298302 318202 332283 248116 235471 313056 169175 -50555 -123003
22714a23003J15059M755j1447L3079o1489q6814L9995R503j6049Q2382j0735M8333
$$ -123003 -7944 -3189 -14636 18443 -43046 -129860 -89865 -80362 -96411 -14029 -24764 23569
22702B3569q2390L7953J2930K4765O2452Q6217k9839m2442j20503J5147P3222
$$ 23569 -58821 -20868 -7938 16827 79279 165496 135657 93215 -27288 -12141 61081
22691F1081m8185N4075K2899k8475O1404j14847r7516m7498j9729K5193P8677
$$ 61081 12896 66971 89870 61395 122799 7952 -89564 -137062 -156791 -131598 -52921
22680e2921M3460J6549P8525M4367j73650m211k078J61146o3483N8267L1448k359
$$ -52921 -9461 7088 85613 129980 -43670 -47881 -49959 111187 47704 105971 137419 135060
22668A35060l7446J2655O8979o9381r625k0413n637m4049K5714n0056o7537R2001
$$ 135060 97614 110269 179248 109867 100242 79829 74192 30143 55857 5801 -61736 30265
22656C0265p561j88110p3895j399M862J5982O2768l0147O851J07851R3350P949
$$ 30265 22704 -165406 -239301 -240700 -235838 -219856 -157088 -187235 -180384 -72533 20817 28766
22644B8766j56507J0937J4858q5710N5625N9265p4957j31176n7595J21350J75348
$$ 28766 -127741 -116804 -101946 -187656 -132031 -72766 -147723 -278899 -336494 -215144 -39796
22633c9796r5772p9674M9638K21706P490j85562l2259J5941P4376J31629j7616
$$ -39796 -135568 -215242 -165604 56102 63592 -121970 -154229 -138288 -63912 67717 50101
22622E0101j64440M0961J13143N4858L5088j053j39702k8824o33J15872N7132
$$ 50101 -114339 -73378 39765 94623 129711 128658 -11044 -39868 -40501 75371 132503
22611A32503j20286j0257J89512l0965j1374L5900n2174K9144n7925j80063j26346
$$ 132503 12217 1960 191472 160507 149133 185033 132859 162003 104078 -75985 -202331
22600b02331J65401J63886J7659M2473j21428m040l7589J0218J9429q002n4607
$$ -202331 -36930 126956 144615 187088 65660 61620 24031 34249 53678 45676 -8931
22589h931J48071L744j20949n5826R176O8550o9310O6550N307p2981N6590K7342
$$ -8931 139140 142884 21935 -33891 -24715 43835 -25475 41075 46382 -26599 29991 57333
22577E7333p3247l9931p7256j04850m894P7479P0359J58579j2272j55165j3325
$$ 57333 -15914 -55845 -133101 -237951 -242845 -165366 -95007 63572 51300 -103865 -117190
22566a17190Q5172Q165M6719P768m3765j50303j35183R4393J35174J35503K1725
$$ -117190 -32018 -23853 22866 30634 -13131 -163434 -298617 -204224 -69050 66453 88178
22555H8178l7843m5997r2556j1443J54603R0637r5551q1751n7643k7156Q1995
$$ 88178 50335 4338 -88218 -99661 54942 145579 50028 -31723 -89366 -116522 -34527
22544c4527Q6444n2330n3735L9547r2814k0129R0813q3613p2202j5711J46989
$$ -34527 51917 -413 -54148 -14601 -107415 -127544 -36731 -120344 -192546 -208257 -61268
22533f1268j6607o7550l0646Q8991r8708J0888J02172J43779m5004M8918J00295
$$ -61268 -77875 -145425 -176071 -87080 -185788 -174900 -72728 71051 26047 74965 175260
22522A75260p8593L0552j5059j61595j27073K06857K05708o9931l34081l4390
$$ 175260 96667 127219 112160 -49435 -176508 30349 236057 166126 -167955 -202345
22512b02345Q2797P8778n9232N6564n1085j6008j574o3134J4649L7186J8181j20675
$$ -202345 -119548 -40770 -100002 -43438 -94523 -110531 -112105 -175239 -160590 -123404 -105223 -225898
22500b25898l2851p4375K34188J44825r4015j42166k5107J43782J34520k4092
$$ -225898 -258749 -333124 -98936 45889 -48126 -190292 -215399 -71617 62903 38811
22490C8811l1109K8425N7492O9009o0647j22808j24181N4803J90361j1066J02644
$$ 38811 7702 36127 93619 162628 101981 -20827 -145008 -90205 100156 89090 191734
22479A91734k113j62851r8228k5577P9957m2175m1711L5782J08443J43901N6525
$$ 191734 189621 26770 -71458 -97035 -17078 -59253 -100964 -65182 43261 187162 243687
22468B43687j17953m4780P7846K1364l0714j02980o2120j03246j15008m0294l4177
$$ 243687 125734 80954 158800 180164 149450 46470 -15650 -118896 -233904 -274198 -308375
22457c08375J52837J08053L0908r9742q8628O9791J18292j7666j29558j01286
$$ -308375 -155538 -47485 -16577 -116319 -204947 -135156 -16864 -34530 -164088 -265374
22447b65374l267J12708M2912J23195k6947O94p2215j43170q6293N3324O8890
$$ -265374 -268641 -155933 -113021 10174 -16773 -16079 -88294 -231464 -317757 -264433 -195543
22436a95543P9821L0005q2774o2152J61469J12103k0933P805l7195O3097k4799
$$ -195543 -115722 -85717 -168491 -230643 -69174 42929 21996 29801 -7394 55703 30904
22425C0904q7708k910P848K6285m785j0995R3227Q3814q0497q4752o9853r0628
$$ 30904 -56804 -59714 -51866 -25581 -30366 -41361 51866 135680 55183 -29569 -99422 -190050
22413a90050Q4534K06247O8864m781Q543o9698l36m6602P5623J00253j45004r5059
$$ -190050 -105516 100731 169595 164814 173357 103659 103323 56721 132344 232597 87593 -7466
22401g466j6079J5234N8724j02734M8138J4754n9937j4840P7555n889P7820K15136
$$ -7466 -23545 -8311 50413 -52321 -4183 10571 -49366 -64206 13349 7460 85280 300416
22389C00416j09291j46840p2495m3407o4310J01866J19394O1813j36438k20158
$$ 300416 191125 44285 -28210 -71617 -135927 -34061 85333 147146 10708 -209450
22379b09450K2776m2026k8271p740j9097J52869J56390m7816j19818q9277N3984
$$ -209450 -186674 -228700 -256971 -264711 -283808 -130939 25451 -22365 -142183 -231460 -177476
22368a77476J22672K18275m2746j32081J44718K8465J9536l3840j70712n256M7183
$$ -177476 -54804 163471 120725 -11356 133362 161827 181363 147523 -23189 -28445 18738
22357A8738k1080p943K2656K1362r4103k4285j19868n7036L849O1004q8385P659
$$ 18738 -2342 -10285 12371 33733 -60370 -84655 -204523 -261559 -257710 -196706 -285091 -277432
22345b77432R6187P7779J15399j71M4183o786j1507p6757j0499n82o9926P8762
$$ -277432 -181245 -103466 11933 11762 55945 49159 37652 -39105 -49604 -50186 -120112 -41350
22333d1350k1433j9727J15608M8519m3744n1766o9080J98740R4034l3097m7967
$$ -41350 -62783 -82510 33098 81617 37873 -13893 -82973 115767 209801 176704 128737
22322A28737o0257k06523o13O8560L8663j15820n1668J48610K17979j93317p1877
$$ 128737 68480 -138043 -138656 -70096 -31433 -147253 -198921 -50311 167668 -25649 -97526
22311i7526M1556j39136L7036Q3480k7219R3718L8670L4650r405j1229L5663p661
$$ -97526 -55970 -195106 -158070 -74590 -101809 -8091 30579 65229 55824 44595 80258 72597
22299G2597j24345l4756N0356k8044j7491k2075L0716N6081K7348k5439j48766
$$ 72597 -51748 -86504 -36148 -64192 -81683 -103758 -73042 -16961 10387 -15052 -163818
22288a63818m9695J44373J75525O5625n4030m8419Q9658o7030q779J6817p3595
$$ -163818 -213513 -69140 106385 172010 117980 69561 159219 92189 83410 100227 26632
22277B6632o3958M240k9875j21520p6549m729J03863M6448r7122j5531M6544J12891
$$ 26632 -37326 -33086 -62961 -184481 -261030 -265759 -161896 -115448 -212570 -228101 -181557 -68666
22265f8666M5190L7146l8576o3970M7771K3573P3235n3218o2553P314j6643j01564
$$ -68666 -23476 13670 -24906 -88876 -41105 -17532 55703 2485 -60068 -52754 -69397 -170961
22253a70961n4690M610k8812J01359R8737J24133M4983O3217l5057j82535J01573
$$ -170961 -225651 -221041 -249853 -148494 -49757 74376 119359 182576 147519 -35016 66557
22242F6557p7579J5210o6745j13390l9556J09098R6277k2706O0557O3007l4577
$$ 66557 -11022 4188 -62557 -175947 -215503 -106405 -10128 -32834 27723 90730 56153
22231E6153O1567n6924o5202j3354Q5706J31160j33285k8227M9394o0459p1314
$$ 56153 117720 60796 -4406 -17760 67946 199106 65821 37594 86988 26529 -44785
22220d4785j3711n5294J10518N2788o5238J19142J33814k29355j44196n1856Q8179
$$ -44785 -58496 -113790 -3272 49516 -15722 103420 237234 7879 -136317 -188173 -99994
22209i9994M0742Q6863J76365m0722K6882l9851j92391j51706M0362o8674N9315
$$ -99994 -59252 27611 203976 163254 190136 150285 -42106 -193812 -153450 -222124 -162809
22198a62809K29567j8184j70654m0191M0997K0186j7125M9462p5698L6384K8384
$$ -162809 66758 48574 -122080 -162271 -121274 -101088 -118213 -68751 -144449 -108065 -79681
22187g9681J87644P2745j74798o5264M2463l0604P0092L210M3820O581j33230
$$ -79681 107963 180708 5910 -59354 -16891 -47495 22597 25807 69627 76208 -57022
22176e7022m7371L527K947k461L9835O7056J20077o1307J3174j13727o3237L4992
$$ -57022 -104393 -100866 -97919 -100380 -60545 6511 126588 65281 78455 -35272 -98509 -63517
22164f3517P3173o4013j20169L2428R7435j31657N1859N3366K6056N088j28844
$$ -63517 9656 -54357 -174526 -142098 -44663 -176320 -124461 -71095 -45039 -39951 -168795
22153a68795J7172J15184J57367L9698r1076j3800Q5423j58010j36094m7379k7921
$$ -168795 -151623 -36439 120928 160626 69550 55750 141173 -16837 -152931 -200310 -228231
22142b28231N7947N1846K645j1684O6338L899j906L3688Q397q4299m0128p1257
$$ -228231 -170284 -118438 -115793 -127477 -61139 -57240 -59146 -25458 -17061 -101360 -141488 -212745
22130b12745p3563J7137O4600J65613K01941j8316j43560j15954k3874J06581
$$ -212745 -286308 -269171 -204571 -38958 162983 144667 1107 -114847 -138721 -32140
22120c2140Q9760J417o0488r0854M9711J06220N0829k073q0216q3979j23347R5310
$$ -32140 57620 59037 -1451 -92305 -42594 63626 114455 112382 32166 -51813 -175160 -79850
22108g9850P5701n9327J3378n085p1146M3233l9813m9747J04024m0747o6981J33868
$$ -79850 -4149 -63476 -50098 -55183 -126329 -83096 -122909 -172656 -68632 -109379 -176360 -42492
22096d2492L3901J18983P651j7452p055k1039p2602m0620n7846j06806J4169J84386
$$ -42492 -8591 110392 118043 100591 93536 72497 -105 -40725 -98571 -205377 -191208 -6822
22084f822O0263j07393J16356L8857O1859O409j82308j63020j71798J14618J83914
$$ -6822 53441 -53952 62404 101261 163120 169529 -12779 -175799 -347597 -232979 -49065
22073d9065o546K4358J8526N0349k6175q5150o0772P2295p322j42360M2447R7296
$$ -49065 -55611 -31253 -12727 37622 11447 -73703 -134475 -62180 -69502 -211862 -169415 -72119
22061g2119M6179J06899R8829q5781o2312n5534R9053J63859k3719n6833j02477
$$ -72119 -25940 80959 179788 94007 31695 -23839 75214 239073 215354 158521 56044
22050E6044j35621m3523J21029P3251j04790m7245J3805K8282L2291N7200p0872
$$ 56044 -79577 -123100 -2071 71180 -33610 -80855 -67050 -38768 -6477 50723 -20149
22039b0149P8089Q4010j75445p6969l0170R3468k1273J10051J59361j27420n3931
$$ -20149 57940 141950 -33495 -110464 -140634 -47166 -68439 41612 200973 73553 19622
22028A9622J59020k1940o4224o6098m5093q7170j11850J65508J32672R204k9832
$$ 19622 178642 156702 92478 26380 -18713 -105883 -217733 -52225 80447 89651 59819
22017E9819m5446L9172l9470P8895l0996q9374N6764M2130J8416m6199L2395K8157
$$ 59819 14373 53545 14075 92970 61974 -27400 29364 71494 89910 43711 76106 104263
22005A04263M1844O4085K7637P8675k4644m6080M7551j4358j5734j55795j2070
$$ 104263 146107 210192 237829 316504 291860 245780 293331 278973 263239 107444 95374
21994I5374r1389j06350j0380j2298o0597j006m0961l2800L9548J67307J42203
$$ 95374 3985 -102365 -112745 -125043 -185640 -186646 -227607 -260407 -220859 -53552 88651
21983H8651P9452j08421j55018O8835K4037j22630j61405M0704J33707m39j8509
$$ 88651 168103 59682 -95336 -26501 -2464 -125094 -286499 -245795 -112088 -112527 -131036
21972a31036o3987J96143O9537j08698J41531j1137r7162n4702N021j2072O4268
$$ -131036 -195023 1120 70657 -38041 103490 92353 -4809 -59511 -54490 -66562 -2294
21961b294M0100J44255O6911l3269j03370j28394n0891K2530O3037L9127j51609
$$ -2294 37806 182061 248972 215703 112333 -16061 -66952 -44422 18615 57742 -93867
21950i3867J80982l7736q8038j45987l9125K6693J03153J44548J19084r5761j40074
$$ -93867 87115 49379 -38659 -184646 -223771 -197078 -93925 50623 169707 73946 -66128
21939f6128p1488j42523J20290O4560J02615J2540p6259N7496M9461l8346K0164
$$ -66128 -137616 -280139 -159849 -95289 7326 19866 -56393 1103 50564 12218 32382
21928C2382o2776L2527M8392r0069m614J14364K1687j12262j3834L7290O992o3211
$$ 32382 -30394 2133 50525 -39544 -44158 70206 91893 -20369 -34203 3087 10079 -53132
21916e3132p1811p3706J03112J23750j13786p9631J00554K24422l7019k00184
$$ -53132 -124943 -198649 -95537 28213 -85573 -165204 -64650 159772 122753 -77431
21906g7431j22947j86898Q4632O3329o8877M8764l5663L8258R4981J42934J00895
$$ -77431 -200378 -387276 -302644 -239315 -308192 -259428 -295091 -256833 -161852 -18918 81977
21895H1977O1040q6198j745J22623l2328j11166r6749R2792p5106O6792k01940
$$ 81977 143017 56819 55074 177697 145369 34203 -62546 30246 -44860 21932 -180008
21884a80008l9060R7407J39440L690k640q7397l4798j02176P8018J04035N5908
$$ -180008 -219068 -121661 17779 21469 18829 -68568 -103366 -205542 -127524 -23489 32419
21873C2419l5525J03521k6402j8030p0901j11116j39013q8141Q0759J57231O6380
$$ 32419 -3106 100415 74013 55983 -14918 -126034 -265047 -353188 -272429 -115198 -48818
21862d8818K2607o5289P2508J32809j21783j70492n8404L827Q6678o585l9723
$$ -48818 -26211 -91500 -18992 113817 -7966 -178458 -236862 -233035 -146357 -152942 -192665
21851a92665l9676P6258P7192N565k1464r8589L6738K4611R3144r6123J26993
$$ -192665 -232341 -156083 -78891 -73326 -94790 -193379 -156641 -132030 -38886 -135009 -8016
21840h016J48803o8324j33200l6160P6432L1466O596J25188j33547m2308P7539
$$ -8016 140787 72463 -60737 -96897 -20465 11001 17597 142785 9238 -33070 44469
21829D4469J19343j78828j22580J01676r408k189J66568l9205j23607q8641p7150
$$ 44469 163812 -15016 -137596 -35920 -45328 -47517 119051 79846 -43761 -132402 -209552
21818b09552J94173K8366o2501l4714R765L9310n3569R3377M2982j39653o6068
$$ -209552 -15379 12987 -49514 -84228 -74463 -35153 -88722 4655 47637 -92016 -158084
21807a58084J8118n1297n9262K8625K5899k3939J25486J25883L7273q7601j76590
$$ -158084 -139966 -191263 -250525 -221900 -196001 -219940 -94454 31429 68702 -18899 -195489
21796a95489L4016J18835l8132l9815K22222l557o3889r5756L8998k6930j24106
$$ -195489 -161473 -42638 -80770 -120585 101637 98080 34191 -61565 -22567 -49497 -173603
21785a73603l3220K7126O8553Q1216J06019J6325j1467J5313j714l7206j71511
$$ -173603 -206823 -179697 -111144 -29928 76091 92416 80949 96262 94548 57342 -114169
21774a14169j34574k3475O1900L7992j39151M1537K18156J4642q1386O9797L7041
$$ -114169 -248743 -272218 -210318 -172326 -311477 -269940 -51784 -37142 -118528 -48731 -11690
21763a1690r1959n5294k409k0230J35690J19968p6378n0801j08543M8536J09240
$$ -11690 -103649 -158943 -161352 -181582 -45892 74076 -2302 -53103 -161646 -113110 -3870
21752c870j7209p4910J291P9970l6973p3488m926M1219J37524n5572r72J52191
$$ -3870 -21079 -95989 -94698 -14728 -51701 -125189 -130115 -88896 48628 -6944 -7916 144275
21740A44275o9260r6832J23874O0043k5139j11005n181L9591n1338M1685q7499
$$ 144275 75015 -21817 102057 162100 136961 25956 20775 60366 9028 50713 -36786
21729c6786L2453m8607n6677j83722M9963K32938Q3925l1085j050q1182J27943
$$ -36786 -4333 -52940 -109617 -293339 -243376 -10438 73487 42402 41352 -39830 88113
21718H8113J22628j44047j81584K7089J76883J7405M8220q4405j48311o1177N8835
$$ 88113 210741 66694 -114890 -87801 89082 106487 154707 70302 -78009 -139186 -80351
21707h0351J13288P7247p8033m6111J3893m2438q0244P9542R2588k9204j97048
$$ -80351 32937 110184 32151 -13960 -67 -42505 -122749 -43207 49381 20177 -176871
21696a76871Q7745J16756M8590j9573J2720n5772j15041j79105K2263N9043M111
$$ -176871 -89126 27630 76220 56647 69367 13595 -101446 -280551 -258288 -199245 -195134
21685a95134O6599J25593l0343j08237k2910P3420J77729J33526n1641j21954
$$ -195134 -128535 -2942 -33285 -141522 -164432 -91012 86717 220243 168602 46648
21675D6648P655n5456O3766j0680j31692K446M0478O0810n9186j16096q5581J06425
$$ 46648 54303 -1153 62613 51933 -79759 -77313 -36835 23975 -35211 -151307 -236888 -130463
21663a30463J48887J342o1860k4315l8365o6553R0688J04407J02122Q3950j98338
$$ -130463 18424 19766 -42094 -66409 -104774 -171327 -80639 23768 125890 209840 11502
21652A1502p5083J08904Q8861j2854O1105N681q2680r0695L8529n470j35003n4857
$$ 11502 -63581 45323 134184 121330 182435 188116 105436 14741 53270 47800 -87203 -142060
21640a42060Q5951J30209M6515J71596j99494j48237j1214J13416m3754l9988
$$ -142060 -56109 74100 120615 292211 92717 -55520 -66734 46682 2928 -37060
21630c7060j25102M8330J56230O4467L8435n8808j29374j3331R7305O5234l0368
$$ -37060 -162162 -113832 42398 106865 145300 86492 -42882 -56213 41092 106326 75958
21619G5958O7258R1755L6469r0342j71446q3110O6525j26808j42571M7528J8234
$$ 75958 143216 234971 271440 181098 9652 -73458 -6933 -133741 -276312 -228784 -210550
21608b10550L7456J23159J67755R0317j36938j55282j15839l6942J64129M0634
$$ -210550 -173094 -49935 117820 208137 71199 -84083 -199922 -236864 -72735 -32101
21598c2101m2882o4522L322l4532n8855J0276Q7965J31730n7205L6093P019K4222
$$ -32101 -74983 -139505 -136183 -170715 -229570 -219294 -131329 401 -56804 -20711 -13692 10530
21586A0530p506k2117O240n18P765p264k7136q1645p2241j7808m4738r2874Q0666
$$ 10530 3024 -19093 -12853 -13371 -5606 -12870 -40006 -121651 -193892 -211700 -256438 -349312 -268646
21573b68646R9932p7133j23188k2310J2700L9483P9103P8096P3852J17681O656
$$ -268646 -168714 -245847 -369035 -391345 -378645 -339162 -260059 -181963 -108111 9570 16226
21562A6226L855R409k3943n6693q5563j31902L299J43539J50506L5521q9682r8684
$$ 16226 20081 29490 5547 -51146 -136709 -268611 -265312 -121773 28733 64254 -25428 -124112
21550a24112n0451p2619j08082M02J28112R5100J18780M9104K8068j2515n399
$$ -124112 -174563 -247182 -355264 -354862 -226750 -131650 -12870 36234 64302 51787 46388
21539D6388M032L0557J7181N4554K0255r4135j13302r1610o5429J10655O0323
$$ 46388 50420 80977 98158 152712 172967 78832 -34470 -126080 -191509 -80854 -20531
21528b0531J8863m8185J6122J37117N2176J4429n9340n9457r75J5950Q4064j3597
$$ -20531 -1668 -49853 -33731 103386 155562 169991 110651 51194 50219 66169 150233 136636
21516A36636l4321P3196q1805p1129o0924k888n107P1791p9919n903M7597m1929
$$ 136636 102315 175511 93706 22577 -38347 -41235 -46342 25449 -54470 -60373 -12776 -54705
21504e4705n2777r4304R8637J94159l1175j38875M6093J3646M3036n6729p1606
$$ -54705 -107482 -201786 -103149 91010 59835 -79040 -32947 -19301 23735 -32994 -104600
21493a04600J4461K0515j2627q01O1361L8229O3893R7459m9979j35813l7307Q1392
$$ -104600 -90139 -69624 -82251 -83052 -21691 16538 80431 177890 127911 -7902 -45209 36183
21481C6183m1811j71135L7430j7364P1932L6021N9450j36190r7270J76144R9463
$$ 36183 -5628 -176763 -139333 -156697 -84765 -48744 10706 -125484 -222754 -46610 52853
21470E2853k2347k18214j02147J16035J77447M0863R00l4464M2793O5379M1182
$$ 52853 30506 -187708 -289855 -173820 3627 44490 45390 10926 53719 119098 160280
21459A60280l7150j25391O2425q793j73189j03123L4526J03955J44654N8847J9918
$$ 160280 123130 -2261 60164 51371 -121818 -224941 -190415 -86460 58194 117041 136959
21448A36959k1090r4143j41446l5565J58857j10286O9321J66216o526m635k5099
$$ 136959 115869 21726 -119720 -155285 3572 -106714 -37393 128823 122297 117662 92563
21437I2563M7690L497k8193L326j38749k5870J33086J2498o5601m5824R1437P5718
$$ 92563 140253 143750 115557 118883 -19866 -45736 87350 99848 34247 -11577 79860 155578
21425A55578m2114p3124l4429q2623j2751J7085l7537P477j0312N4088Q3595l6325
$$ 155578 113464 40340 5911 -76712 -89463 -72378 -109915 -102438 -112750 -58662 24933 -11392
21413a1392p498J01511K7604j27679o4371N265M1942n6962k7011M534L4728M4856
$$ -11392 -18890 82621 110225 -17454 -81825 -76560 -34618 -91580 -118591 -114057 -79329 -34473
21401c4473q04j5296k14M6917N4158L5970P8850j9848r2622k5964R6589j41195
$$ -34473 -35277 -50573 -50787 -3870 50288 86258 165108 145260 52638 26674 123263 -17932
21389a7932j64241m8570L2982j5794P5996J49550K5090R839j0526M288j50166
$$ -17932 -182173 -230743 -197761 -213555 -137559 11991 37081 46920 36394 40682 -109484
21378a09484l15J89451K712k41814k56474L8132Q5737K3378J27362J6196O1761
$$ -109484 -109799 79652 82364 -159450 -415924 -377792 -292055 -268677 -141315 -125119 -63358
21367f3358J9348J61987p030p6297j69486l4399m2242R6277N1534l235P599J51161
$$ -63358 -44010 117977 110947 34650 -134836 -169235 -211477 -115200 -63666 -66901 -59302 91859
21355I1859n7553j25962Q896m6560P363M0377N0857n6876k0039N5319l406o1688
$$ 91859 34306 -91656 -82760 -129320 -121957 -81580 -30723 -87599 -107638 -52319 -55725 -117413
21343a17413r4333q593J8000J73420n6693m9946J64693L6069j9076k4155k0689
$$ -117413 -211746 -220339 -202339 -28919 -85612 -135558 29135 65204 46128 21973 1284
21332A284J8128N7973J06355m6163j43547r2214o127J44244m6882o4260k5526
$$ 1284 19412 77385 183740 137577 -5970 -98184 -104311 39933 -6949 -71209 -96735
21321i6735K8142l5804k5816J95223N1808l8162n4535r1027N8823k4762k9148
$$ -96735 -68593 -104397 -130213 65010 116818 78656 24121 -66906 -8083 -32845 -61993
21310f1993N3477K3493Q7333n8650O610K3444j0712L56j14941P7363Q0361j11994
$$ -61993 -8516 14977 102310 43660 50270 73714 63002 63358 -51583 25780 106141 -5853
21298e853j30824J9011M2657K34745l61r3093k16319L6800J36714J01390l2568
$$ -5853 -136677 -117666 -75009 159736 159375 66282 -150037 -113237 23477 124867 92299
21287I2299j16904k039L5598o1910j21863K3964J41478J27504o2715j37844q6145
$$ 92299 -24605 -26644 8954 -52956 -174819 -150855 -9377 118127 55412 -82432 -168577
21276a68577J82K3072K00753R9334q3852k2686L8664J7084p3899J14476j99747
$$ -168577 -168395 -145323 55430 154764 70912 48226 86890 103974 30075 144551 -55196
21265e5196l8074M2368J8010j12018j645n948R7542j9372p9753p3824r9615J22082
$$ -55196 -93270 -50902 -32892 -144910 -146555 -152503 -54961 -74333 -154086 -227910 -327525 -205443
21253b05443K19549J77257J62220o2636k09654p3155j4399K6727m4637m548J01464
$$ -205443 14106 191363 353583 290947 81293 8138 -6261 20466 -24171 -28719 72745
21242G2745j5071q1262k6476r7980J52607J03469j08260P5224P9388M64j8783
$$ 72745 57674 -23588 -50064 -148044 4563 108032 -228 74996 154384 154848 136065
21231A36065j33584n5600o2788Q5206J38518n8827l5966m7662q1078r8434o2970
$$ 136065 2481 -53119 -115907 -30701 107817 48990 13024 -34638 -115716 -214150 -277120
21220b77120j1309J40004j9102L2227P4390J96967K0309l1069k00552p3949O7333
$$ -277120 -288429 -148425 -167527 -135300 -60910 136057 156366 125297 -75255 -149204 -81871
21209h1871o8837q588j7135l3397l3453M3603k6203j08297J83632k2154M8399
$$ -81871 -150708 -159296 -176431 -209828 -243281 -199678 -225881 -334178 -150546 -172700 -124301
21198a24301R8094L4214J06733j23806r0413L5804J0129L0560j42790p8638n4856
$$ -124301 -26207 8007 114740 -9066 -99479 -63675 -53546 -22986 -165776 -244414 -299270
21187b99270R8636J43096J42293l4823O5520Q6866K6183r735J8432j50635k41397
$$ -299270 -200634 -57538 84755 49932 115452 202318 228501 218766 237198 86563 -154834
21176a54834j15744M514K01654M3434j03251l5057o1715J66760K04803M6968j57027
$$ -154834 -270578 -266064 -64410 -20976 -124227 -159284 -220999 -54239 150564 197532 40505
21165D0505j10429N725J10321j06387o8785o0630m0917Q7528J45186R6200N5236
$$ 40505 -69924 -64199 46122 -60265 -129050 -189680 -230597 -143069 2117 98317 153553
21154A53553j62283j54628K58l8679m9102Q6137L1006O5161J02889Q7313q5122
$$ 153553 -8730 -163358 -163100 -201779 -250881 -164744 -133738 -68577 34312 121625 36503
21143C6503k515m7214j25701p6168l7340l749K2218l7333j02386N7895J8928O7421
$$ 36503 33988 -13226 -138927 -215095 -252435 -256184 -233966 -271299 -373685 -315790 -296862 -229441
21131b29441J15435Q3671j30611q226J5473M2750R3981k7327q9820l5420J70334
$$ -229441 -114006 -30335 -160946 -169172 -153699 -110949 -16968 -44295 -134115 -169535 799
21120G99J26909l3062r4607o2815q6877j5338L4652J91593j4371J45013K4327
$$ 799 127708 94646 39 -62776 -149653 -164991 -130339 61254 46883 191896 216223
21109B16223r4176j00224j4785R545R322j04807N3253m4358K901k4014k352J410
$$ 216223 122047 21823 7038 16583 25905 -78902 -25649 -70007 -67106 -91120 -93472 -92062
21097i2062P6774l4142l2810p3717o9629R760Q2435N1931J5146J1029n1758J21263
$$ -92062 -15288 -49430 -82240 -155957 -225586 -215826 -133391 -81460 -66314 -55285 -107043 14220
21085A4220J09475o8250k2283p8811L7371Q5702p2067l5027N8870q8393k5192
$$ 14220 123695 55445 33162 -45649 -8278 77424 5357 -29670 29200 -59193 -84385
21074h4385p9180o1863J4019J61892J80841r6664m5248N5639j8870P960Q5394
$$ -84385 -163565 -225428 -211409 -49517 131324 34660 -10588 45051 26181 34141 119535
21063A19535J1533R528j1144l3894r0897Q2087k0364q3977j22644N3202R7714
$$ 119535 131068 140596 129452 95558 4661 86748 66384 -17593 -140237 -87035 10679
21052A0679m198L5080n3121k2304j14232L4804M9996J55857Q896j62507O5960
$$ 10679 6481 41561 -11560 -33864 -148096 -113292 -63296 92561 101457 -61050 4910
21041D910n339j44734j18086N4487K91504J5646q2260j34512m267P6273p4792
$$ 4910 -429 -145163 -263249 -208762 82742 98388 16128 -118384 -122651 -46378 -121170
21030a21170o4924n9957j76164j795J73174J33639L6421J10318J31539L0392m9096
$$ -121170 -186094 -246051 -422215 -424010 -250836 -117197 -80776 29542 161081 191473 142377
21019A42377j37699j35205J11767N2163J1282j2397k7278m7081J43599Q8734N4008
$$ 142377 4678 -130527 -18760 33403 44685 32288 5010 -42071 101528 190262 244270
21008B44270j73333j42417p1882r1026J01J00684J511K1792j8060Q1194n967j51352
$$ 244270 70937 -71480 -143362 -234388 -234287 -133603 -132092 -110300 -128360 -47166 -53133 -204485
20996b04485m7017L2339k1376j8166O6177J8954Q2471P7266j5853J64475O9748
$$ -204485 -251502 -219163 -240539 -258705 -192528 -173574 -91103 -13837 -29690 134785 204533
20985B04533n3040j5132n3301k3295L1745l0999J3314L3282j4115q3665O3881
$$ 204533 151493 136361 83060 59765 91510 60511 73825 107107 92992 9327 73208
20974G3208L5741J5236n2134p2342j3793q6602m5796M8675J4405j4058N2583l6438
$$ 73208 108949 124185 72051 -291 -14084 -100686 -146482 -97807 -83402 -97460 -44877 -81315
20962h1315P9230N8574m4268q7177Q2016j69910r6203N1945J33599J28001l6360
$$ -81315 -2085 56489 12221 -74956 7060 -162850 -259053 -207108 -73509 54492 18132
20951A8132j22561M2888n7889j17982j2218L2133N092M1262L9075M247O651l9536
$$ 18132 -104429 -61541 -119430 -237412 -249630 -217497 -212405 -171143 -132068 -127821 -121170 -160706
20939a60706Q8434L0041J03303J24524o2760L5263R3563j65755k9100j9789j00555
$$ -160706 -72272 -42231 61072 185596 122836 158099 251662 85907 56807 37018 -63537
20928f3537L7369q3331n0416J23897R5869Q9309j23591M3763L3918o5302r7266
$$ -63537 -26168 -109499 -159915 -36018 59851 149160 25569 69332 103250 37948 -59318
20917e9318j20073M6657K5180K6375K9025L0154O0724R4686k7334N956j18191
$$ -59318 -179391 -132734 -107554 -81179 -52154 -22000 38724 133410 106076 112032 -6159
20906f159J00476j7842n4039m5672q4080j00595R1616j8408l1773N6741l1585
$$ -6159 94317 76475 22436 -23236 -107316 -207911 -116295 -134703 -166476 -109735 -141320
20895a41320j06821R1536J22307O7739j02382p3694j38134q290K7874l9367J15978
$$ -141320 -248141 -156605 -34298 33441 -68941 -142635 -280769 -289059 -261185 -300552 -184574
20884a84574J43602J56726J25033o3948j33030r878J12412l6128M1393P5944p3068
$$ -184574 -40972 115754 240787 176839 43809 33931 146343 110215 151608 227552 154484
20873A54484n5025q9937J7410j12199J0142n1412k8246P2832k4195R11J3621R6402
$$ 154484 99459 9522 26932 -85267 -75125 -126537 -154783 -81951 -106146 -105235 -91614 4788
20861D788P6391j90057L1007N1328l9930O1850N1405m9165J9299Q9907m7307o9129
$$ 4788 81179 -108878 -77871 -26543 -66473 -4623 46782 -2383 16916 106823 59516 -9613
20849i613n1106J12509M170J41374k4056j42021J16115L2899j25472j31448L5264
$$ -9613 -60719 51790 55960 197334 173278 31257 147372 180271 54799 -76649 -41385
20838d1385m1039q378o9072l8362J04608N316J2166J32832Q1481J9448m0492J51066
$$ -41385 -82424 -90802 -159874 -198236 -93628 -88312 -76146 56686 138167 157615 117123 268189
20826B68189N3834j08433q7608J6586l2192n8953O3801J14221q9642j68582j88961
$$ 268189 322023 213590 125982 142568 110376 51423 115224 229445 139803 -28779 -217740
20815b17740n6484J48346L644q4268N4178k8508j6055J15344J46132o0666j8522
$$ -217740 -274224 -125878 -122234 -206502 -152324 -180832 -196887 -81543 64589 3923 -14599
20804a4599q7625j11384j9159m1130O7228O4314N8494o2998M811J03996M8275
$$ -14599 -102224 -213608 -232767 -273897 -206669 -142355 -83861 -146859 -142048 -38052 10223
20793A0223n729j35816N6929k3513q2389J1428J62808j03933m6732R1114O4762
$$ 10223 4494 -131322 -74393 -97906 -180295 -168867 -6059 -109992 -156724 -65610 -848
20782h48K6327j12520R9484K894o517J3152J23219k172l8783j02310K6964k4486
$$ -848 25479 -87041 12443 15337 8820 21972 145191 143019 104236 1926 28890 4404
20770D404Q5846P195K9493j9216m1352O5618J34341m0744j80780r3877M9764j02108
$$ 4404 90250 97445 126938 107722 66370 131988 266329 225585 44805 -49072 692 -101416
20758a01416n2859O2248Q7373m2587q9471j40193j9153J00853P6331M7953l3184
$$ -101416 -154275 -92027 -4654 -47241 -136712 -276905 -296058 -195205 -118874 -70921 -104105
20747a04105j6924J17738j9593j31934n3609n1454m8822j21147J5115K00936o177
$$ -104105 -121029 -3291 -22884 -154818 -208427 -259881 -308703 -429850 -414735 -213799 -219976
20736b19976j10177o9568P4060J02002J11620r4645K8273O6445o7577L5905p860
$$ -219976 -330153 -399721 -325661 -223659 -112039 -206684 -178411 -111966 -179543 -143638 -151498
20725a51498Q8065N1826M4085j5330J3591j14031j0238p3063m8819M4903K8095
$$ -151498 -63433 -11607 32478 17148 30739 -83292 -93530 -166593 -215412 -170509 -142414
20714a42414k2658J53135J8523q6739K0957m0228J0091J4060O0923q97n5142m5232
$$ -142414 -165072 -11937 6586 -80153 -59196 -99424 -89333 -75273 -14350 -15247 -70389 -115621
20702a15621M3243O1224L8722R6109m3476j26796N8768J04769K1750r6155o3231
$$ -115621 -72378 -11154 27568 123677 80201 -46595 12173 116942 138692 42537 -20694
20691b0694j51237K5207L4202l908k758o695M9233N1675J41996J13052o6591J00299
$$ -20694 -171931 -146724 -112522 -116430 -119188 -125883 -76650 -24975 117021 230073 163482 263781
20679B63781R12j01873j06611j11805M9582O7190m663n6684j3002j69133j57183
$$ 263781 264693 162820 56209 -55596 -6014 61176 56513 -171 -13173 -182306 -339489
20668c39489P0067J25680M3744k1465o3359o2272J29000Q7435J44544O0176o0351
$$ -339489 -269422 -143742 -99998 -121463 -184822 -247094 -118094 -30659 113885 174061 113710
20657A13710p0297J21494J47902M3174j28970k10518M481n1024l198M2366o956
$$ 113710 43413 164907 312809 355983 227013 16495 20976 -30048 -33246 9120 2164
20646B164Q8871j24257N953N2562l4396j65265k30237L3804K29125J28103q2078
$$ 2164 91035 -33222 -27269 25293 -9103 -174368 -404605 -370801 -141676 -13573 -95651
20635i5651P028O1449k2855l7982r0450r6341J09680J45427K4645l5384l7794
$$ -95651 -88623 -27174 -50029 -88011 -178461 -274802 -165122 -19695 4950 -30434 -68228
20624f8228q0712o3207n3125J5874J00850R6420N4430j01799L6515q658K9137
$$ -68228 -148940 -212147 -265272 -249398 -148548 -52128 2302 -99497 -62982 -71640 -42503
20613d2503j03638n788m924J05987P2537j47250J5849O1573R0445r0096J5408
$$ -42503 -146141 -151929 -156853 -50866 21671 -125579 -109730 -48157 42288 -47808 -32400
20602c2400q8621j00223R3424j0575n3598J05250J57035N0046n9572j31242q5963
$$ -32400 -121021 -221244 -127820 -138395 -191993 -86743 70292 120338 60766 -70476 -156439
20591a56439Q7492j9193O0263j4723J576m438p3648n6756R6647o2870L5414L8817
$$ -156439 -68947 -88140 -27877 -42600 -41024 -45462 -119110 -175866 -79219 -142089 -106675 -67858
20579f7858j75519j7562J2607Q3688p2872J7915J5474Q8222l2033o3942L4922
$$ -67858 -243377 -260939 -248332 -164644 -237516 -219601 -204127 -115905 -147938 -211880 -176958
20568a76958K27607J05980n5644O696Q9836j4937r8371N8952Q9535N3366j10283
$$ -176958 50649 156629 100985 107681 197517 182580 84209 143161 232696 286062 175779
20557A75779j29007Q607j055m1406j06864M5381J16301o221j8632k6884n895M8481
$$ 175779 46772 55379 54324 12918 -93946 -48565 67736 61515 42883 15999 10104 58585
20545E8585J15088K1489j4723R585l6041k1484n578P7959J53190j23812j31788
$$ 58585 173673 195162 180439 190024 153983 132499 126921 204880 358070 234258 102470
20534A02470n1719J4132j09777j3973M1693k4312J6332Q5135q5756K6271R92K537
$$ 102470 50751 64883 -44894 -58867 -17174 -41486 -25154 59981 -25775 496 1488 4025
20522D025Q174r4419k7342O3748J00736M325r1360o2393J5680m9615L0243O4877
$$ 4025 12199 -82220 -109562 -45814 54922 59247 -32113 -94506 -78826 -128441 -98198 -33321
20510c3321k8327Q9510Q1377J9398n4224O2483j7055j37015J00915l4042o1565
$$ -33321 -61648 27862 109239 128637 74413 136896 119841 -17174 83741 49699 -11866
20499a1866O4232O5759K8823j50513j8002N16q421L0011M9041J56580N8830p3704
$$ -11866 52366 118125 146948 -3565 -21567 -21051 -29472 539 49580 206160 264990 191286
20487A91286o4424j02338j63891p5943M4171J05694J00894j5505k8594k2248m1428
$$ 191286 126862 24524 -139367 -215310 -171139 -65445 35449 19944 -8650 -30898 -72326
20476g2326J74551j1489k3703k8038m4927Q287P3408M7150m6995J0631J07690
$$ -72326 102225 90736 67033 38995 -5932 2355 75763 122913 75918 86549 194239
20465A94239q3516k02159J6540K16648j1173m4733q2125K3371P0525j63950j2585
$$ 194239 110723 -91436 -74896 141752 130579 85846 3721 27092 97617 -66333 -78918
20454g8918R8404q0080l8880j23031m2686L3666K40828J16957K72R64r3271r2301
$$ -78918 19486 -60594 -99474 -222505 -265191 -231525 9303 126260 126532 127496 34225 -58076
20442e8076J1593J91990K8047m1312q3877j73820J4606Q2784P4691m502j06063
$$ -58076 -46483 145507 173554 132242 48365 -125455 -110849 -28065 46626 42124 -63939
20431f3939J1104k4979q9043O7599J46390M2306o0728l4460j36481O4354j8306
$$ -63939 -52835 -77814 -166857 -99258 47132 89438 28710 -5750 -142231 -77877 -96183
20420i6183M6868l2462k0525j8023k4632J08285J59880q550q3700J8102J04673
$$ -96183 -49315 -81777 -102302 -120325 -144957 -36672 123208 114658 30958 49060 153733
20409A53733J17242j35121k01464j07956R584O6546O7615J07720J41293k03683
$$ 153733 270975 135854 -65610 -173566 -163982 -97436 -29821 77899 219192 15509
20399A5509k3881M0462n7297K6889R8974J05420j62644j41010j83640p2474J22878
$$ 15509 -8372 32090 -25207 1682 100656 206076 43432 -97578 -281218 -353692 -230814
20388b30814K04928J95914J00606j42982j68763L3938j6118j10027N2770J89864
$$ -230814 -25886 170028 270634 127652 -41111 -7173 -23291 -133318 -80548 109316
20378A09316P236j90168p3106O0741L6459J63413k57531j67908p3655J34341K24202
$$ 109316 116552 -73616 -146722 -85981 -49522 113891 -143640 -311548 -385203 -250862 -26660
20367b6660N8834L8264L2042j43743K0442L2443j4678N4648K7120r7964m0773
$$ -26660 32174 70438 102480 -41263 -20821 11622 -3056 51592 78712 -19252 -60025
20356f0025q3048m6104J59306P6621r5110J06218J38661l2275r6720q4811M2702
$$ -60025 -143073 -189177 -29871 46750 -48360 57858 196519 164244 67524 -17287 25415
20345B5415M1575q8942J2365K7143o8944r6077J58453N0470K3160L075J0854m8937
$$ 25415 66990 -21952 -9587 17556 -51388 -147465 10988 61458 84618 87693 98547 49610
20333D9610L5774J25102j21528k07185J1874N511J9984m9118m6741J04690j1479
$$ 49610 85384 210486 88958 -118227 -106353 -100842 -80858 -129976 -176717 -72027 -83506
20322h3506m2827l9967j79378l4389N0660O6040L9054J36418J3053R4945l2091
$$ -83506 -126333 -166300 -345678 -380067 -329407 -263367 -224313 -87895 -74842 20103 -11988
20311a1988q754L805j23129n3960K5359R1797R6409o7032L4237j15957P9167J32806
$$ -11988 -20742 -16937 -140066 -194026 -168667 -76870 19539 -47493 -13256 -129213 -50046 82760
20299H2760J0834j1937O1370k1133Q4267P8324j04053p7743l7049L7470M1988
$$ 82760 93594 81657 143027 121894 206161 284485 180432 102689 65640 103110 145098
20288A45098r2981j7711o7960m9577L5195O6383O3507J06520k3115n3407q5561
$$ 145098 52117 34406 -33554 -83131 -47936 18447 81954 188474 165359 111952 26391
20277B6391J3551J05970q2106M1165J08312o8357p1592j54009N4413J03288j28122
$$ 26391 39942 145912 63806 104971 213283 144926 73334 -80675 -26262 77026 -51096
20266e1096j09517m7726K39451K14180m2088k08386l2546j0274j0792Q9456J10390
$$ -51096 -160613 -208339 31112 245292 203204 -5182 -37728 -48002 -58794 30662 141052
20255A41052q3255j09753j30116J43798J62548j7853j22248n1750r9573r7362
$$ 141052 57797 -51956 -182072 -38274 124274 106421 -15827 -67577 -167150 -264512
20245b64512J6217Q2800K8805J04915N1655m6277J9963M0375q4380K3967J66143
$$ -264512 -248295 -165495 -136690 -31775 19880 -26397 -6434 33941 -50439 -26472 139671
20234A39671M5761o3931j19633p507m4685r423R4865l724j74378r4508O3833N1994
$$ 139671 185432 121501 1868 -5639 -50324 -59747 35118 31394 -142984 -237492 -173659 -121665
20222a21665J52796p5836l2491J63689J4244n8045J1313J9986L4650J2049N1073
$$ -121665 31131 -44705 -77196 86493 100737 42692 54005 73991 108641 120690 171763
20211A71763n748o7081j11883k4952L0140l750Q4382M3128p7681j32290m0815
$$ 171763 166015 98934 -12949 -37901 -7761 -11511 72871 115999 38318 -93972 -134787
20200a34787K0138P0902O4027j13986Q4990J01899m2806L1783J1051j08701m6569
$$ -134787 -114649 -43747 20280 -93706 -8716 93183 50377 82160 93211 -15490 -62059
20189f2059n9658q3647l3243N9487J19706n7378L6554J01109L8690R9971j1150
$$ -62059 -121717 -205364 -238607 -179120 -59414 -116792 -80238 20871 59561 159532 148382
20178A48382p2050j07353j17692j7315N5701J55331J90652P5540p3320q3400r0782
$$ 148382 76332 -31021 -148713 -166028 -110327 45004 235656 311196 237876 154476 63694
20167F3694n993j16809j57901n9579J01657N8311o0090o9550K7313J78356J36206
$$ 63694 57701 -59108 -217009 -276588 -174931 -116620 -176710 -246260 -218947 -40591 95615
20156I5615k3087r9187Q5403J37013M4200j41418q0838P3259O5556J1554l1180
$$ 95615 72528 -26659 58744 195757 239957 98539 17701 90960 156516 168070 136890
20145A36890j17372J04493l5571o9308l8598q0670J22526J78694q2698o7296p9131
$$ 136890 19518 124011 88440 19132 -19466 -100136 22390 201084 118386 51090 -28041
20134b8041O2900m6177n6841M5716J19790r3589q9276O0812P347o3430o3019M6990
$$ -28041 34859 -11318 -68159 -22443 97347 3758 -85518 -24706 -17359 -80789 -143808 -96818
20122i6818R8363J19465J39652O5009j11733p7426k2483L835n7834j1614n3080
$$ -96818 1545 121010 260662 325671 213938 136512 114029 117864 60030 48416 -4664
20111d664j42023J56243J51329q7511R6227k7035j54068o460Q4798j6036j27347
$$ -4664 -146687 9556 160885 73374 169601 142566 -11502 -17962 66836 50800 -76547
20100g6547L216J8116P4741Q3890L120l0471J0600r5745r4683p996l8345R113
$$ -76547 -73331 -55215 19526 103416 106536 76065 86665 -9080 -103763 -111759 -150104 -140991
20088a40991O7375O7789p8448p24J07920o7994k9294K8182R4591m1529j0709L8013
$$ -140991 -73616 -5827 -84275 -84999 22921 -45073 -74367 -46185 48406 6877 -3832 34181
20076C4181j7426l0114j08740o7440J2775J32140K5298J15802k5792r3263j15131
$$ 34181 16755 -13359 -122099 -189539 -176764 -44624 -19326 96476 70684 -22579 -137710
20065a37710P2473J98222Q400m8627o067J12027O4858j02469j45183j36556P5296
$$ -137710 -65237 132985 141385 92758 86691 198718 263576 161107 15924 -120632 -45336
20054d5336N4263K6550L3752J5104J09174q6862J3326O2279J8560N7460J9622
$$ -45336 8927 35477 69229 84333 193507 106645 119971 182250 200810 258270 277892
20043B77892L0699j14008j07600K2084m3358j48715j6832J92105J94717n5222
$$ 277892 308591 194583 86983 109067 65709 -83006 -99838 92267 286984 231762
20033B31762n8521M2400j08888k024p720j17417p4647J9952k4781k3313k0096
$$ 231762 173241 215641 106753 104729 97009 -20408 -95055 -75103 -99884 -123197 -143293
20022a43293M0426L2412N8894l9968l4921P9744P8329J52713K03k48656r7276
$$ -143293 -102867 -70455 -11561 -51529 -86450 -6706 71623 224336 224539 -24117 -121393
20011a21393Q8787Q0324P8603O5477j1102j3064j12060O055j68383P791J08801
$$ -121393 -32606 47718 126321 191798 180696 167632 55572 61627 -106756 -98965 9836
20000I836K4555K268R6763o5568j43244p766M2248P7947N864o3494l6579m499
$$ 9836 34391 36659 133422 67854 -75390 -83156 -40908 37039 42903 -20591 -57170 -61669
19988f1669l6232j1060P0031M2886j4672O6368N0024o4661j14901N3190p273r0372
$$ -61669 -97901 -108961 -38930 3956 -10716 55652 105676 41015 -73886 -20696 -27969 -118341
19976a18341m975n9100J20223J64025Q460n7508j8357R3780O3561K9412o2686
$$ -118341 -123316 -182416 -62193 101832 110292 52784 34427 128207 191768 221180 158494
19965A58494j00699r9880m1336J56388N1884j45703N7843p8008j12293P875J60157
$$ 158494 57795 -42085 -83421 72967 124851 -20852 36991 -41017 -153310 -145435 14722
19954A4722L7885p8978j09120j8754J749J09533J06980j9946j69650M6072L9538
$$ 14722 52607 -26371 -135491 -154245 -152496 -42963 64017 44071 -125579 -79507 -39969
19943c9969Q4442J370r9492j7876J34444j189Q6307k5993n2386M0541J160l7473
$$ -39969 44473 45843 -53649 -71525 62919 61730 148037 122044 69658 110199 111359 73886
19931G3886K1712Q2463q682P8265k2925n2352m5269j12478P403j5850j03996k0691
$$ 73886 95598 178061 169379 247644 224719 172367 127098 14620 22023 6173 -97823 -118514
19919a18514j8364M4144O0999R0914O2730p854j18046N5894p359p0132l6958j0911
$$ -118514 -136878 -92734 -31735 59179 121909 114055 -3991 51903 44544 -25588 -62546 -73457
19907g3457K1743P5520n2110K9623J29782r723j60794j11650K6611P4168J2163
$$ -73457 -51714 23806 -28304 1319 131101 121378 -39416 -151066 -124455 -50287 -38124
19896c8124J0346J26461Q2377L4781M8223q6902m7340N5819k1196k1393R9531
$$ -38124 -27778 98683 181060 215841 264064 177162 129822 185641 164445 143052 242583
19885B42583l5341R8510J31l325q4387N8262k05331j14090j4846Q8261k5963m0879
$$ 242583 207242 305752 305883 302558 218171 276433 71102 -42988 -57834 30427 4464 -36415
19873c6415P4314P347k647j11087q9245P9255N2874J39930J32766m615j75475
$$ -36415 37899 45246 42599 -68488 -157733 -78478 -25604 114326 247092 242477 67002
19862F7002j34513O5889k489k8616r4447r6365Q2001J25667J1502j47645j976
$$ 67002 -67511 -1622 -4111 -32727 -127174 -223539 -141538 -15871 -4369 -152014 -153990
19851a53990J82832O2675o9984l7408j14488q2996n5292J55295K38553J14202
$$ -153990 28842 91517 21533 -15875 -130363 -213359 -268651 -113356 125197 239399
19841B39399l8363j40751o2741k8705o7803O7815Q7390J71028j4524j87648j15971
$$ 239399 201036 60285 -2456 -31161 -98964 -31149 56241 227269 212745 25097 -90874
19830i0874O3507m4137p8929M649O9099n3199q2018R7592M7051J5398Q5822M9097
$$ -90874 -27367 -71504 -150433 -145784 -76685 -129884 -211902 -114310 -67259 -51861 33961 83058
19818H3058L4126n5396K9701J07230j40482j41231j0938K32398K1905l7687p3873
$$ 83058 117184 61788 91489 198719 58237 -82994 -93932 138466 160371 122684 48811
19807D8811j01818p4706P864L5599o1546m5569O6975O7991O1132l2356q6100M6420
$$ 48811 -53007 -127713 -119849 -84250 -145796 -191365 -124390 -56399 4733 -27623 -113723 -67303
19795f7303R0259l3742o3544k4657J08061J94754J46213j61740j4400M684j73565
$$ -67303 22956 -10786 -74330 -98987 9074 203828 350041 188301 173901 178585 5020
19784E020L0156Q4780J30126J4938p7127n3168j29423r8458J09540J95511J06439
$$ 5020 35176 119956 250082 265020 187893 134725 5302 -93156 16384 211895 318334
19773C18334j9872j9638n673k9404j76446L9774K147M3668J01323J4631j10284
$$ 318334 298462 278824 273151 243747 67301 107075 109222 152890 254213 268844 158560
19762A58560j3530m4063K0712P202L6983J7747J1794M5236N0783o3727O2644N1769
$$ 158560 145030 100967 121679 128881 165864 183611 195405 240641 291424 227697 290341 342110
19750C42110o3059o8772k8733j1695p6778j06385J7569M8119N3146P4972m1161
$$ 342110 279051 210279 181546 169851 93073 -13312 4257 52376 105522 180494 139333
19739A39333p3295J3160J49232o2966M2183m7494j6409J4593k7458r0543q7509
$$ 139333 66038 79198 228430 165464 207647 160153 143744 158337 130879 40336 -47173
19728d7173J15115k667j27746K2558j576L4575m9543k7860k1598N3910M5966M9282
$$ -47173 67942 65275 -62471 -39913 -41489 -6914 -56457 -84317 -105915 -52005 -6039 43243
19716D3243J1645j22296n0947J40112j910P0740L4879k1047Q579Q118p5478o8614
$$ 43243 54888 -67408 -118355 21757 19847 90587 125466 104419 112998 121116 45638 -22976
19704b2976n0824J0359N1531N3399J01340J69429K50r0129L1660Q3180O1049j62104
$$ -22976 -73800 -63441 -11910 41489 142829 312258 312508 222379 254039 337219 398268 236164
19692B36164j32984o0836O4043K04781J71914l9159l8626k70881j28898l7510
$$ 236164 103180 42344 106387 311168 483082 443923 405297 134416 5518 -31992
19682c1992J27300J31503p4787M6228M6658L6294o4905j00622O1282l8971J180
$$ -31992 95308 226811 152024 198252 244910 281204 216299 115677 176959 137988 139168
19671A39168J39307O8535q8488j23014K6428o950o3148q2986J05072Q9616j7905
$$ 139168 278475 347010 258522 135508 161936 154986 91838 8852 113924 203540 185635
19660A85635j08871M1807Q0155J08391n9002j22124j26506j49469O90J61378J55475
$$ 185635 76764 118571 198726 307117 248115 125991 -515 -149984 -149294 12084 167559
19649A67559J07556J3496l2807k7651o9699j40017q4217R6623J99406M3529L9220
$$ 167559 275115 288611 255804 228153 158454 18437 -65780 30843 230249 273778 312998
19638C12998l6578o5217j46856r085P0961k733N7751J83922p7581j53232j35866
$$ 312998 276420 211203 64347 55262 126223 123490 181241 365163 287582 134350 -1516
19627a516o9045O9117K1017j5116N3663r8172Q3876O1315M8965P3161j08831j26409
$$ -1516 -70561 -1444 19573 4457 58120 -40052 43824 105139 154104 227265 118434 -7975
19615g975R3769J02266m638p4822k9605l4070N873J20284J6613j16498L4581J7352
$$ -7975 85794 188060 183422 108600 78995 44925 50798 171082 187695 71197 105778 123130
19603A23130R0648k3704j7885J46438k2225l4524N983p2572Q4847R3026L7149
$$ 123130 213778 190074 172189 318627 296402 261878 267861 195289 280136 373162 410311
19592D10311j06483m3426l9668K22005R581n9648j06600M9706K06901Q2400J2348
$$ 410311 303828 260402 220734 442739 452320 392672 286072 335778 542679 625079 637427
19581F37427m2184J23764J48179j13863j3976M6461J02969N8617K6171J03880
$$ 637427 595243 719007 867186 753323 739347 785808 888777 947394 973565 1077445
19571A077445K40059N9457R6168P8743O9416P1623R0915J8475j26058K6764k00912
$$ 1077445 1317504 1376961 1473129 1551872 1621288 1692911 1783826 1802301 1676243 1703007 1502095
19560A502095N4870M2364j06965N3617o5544k20354j20865n1491q8428k03244
$$ 1502095 1556965 1599329 1492364 1545981 1480437 1260083 1139218 1087727 999299 796055
19550G96055j5784J08461p4784p241P8183P0148J7554q5961k0215R5975j9215
$$ 796055 780271 888732 813948 806707 884890 955038 972592 886631 866416 962391 943176
19539I43176n4950r0422m2281J55971N4317j0553L0589R5106j9652j13052q6124
$$ 943176 888226 797804 755523 911494 965811 955258 985847 1080953 1061301 948249 862125
19528H62125K15450K09831N5441K5993O4728K1967j90165j60172P0358Q5338j4240
$$ 862125 1077575 1287406 1342847 1368840 1433568 1455535 1265370 1105198 1175556 1260894 1246654
19517A246654q4819m3907P8919O8463L7225J63928m016j11405J5052R9964J58397
$$ 1246654 1161835 1117928 1196847 1265310 1302535 1466463 1462447 1351042 1366094 1466058 1624455
19506A624455l4516k6008O8851J82251J13957L1617J05282Q3722J0013L8359Q278
$$ 1624455 1589939 1563931 1632782 1815033 1928990 1960607 2065889 2149611 2159624 2197983 2206261
19495B206261l0379k7160J57230O9629M559O6101J6203L2004J05802K05949J58041
$$ 2206261 2175882 2148722 2305952 2375581 2380140 2446241 2462444 2494448 2600250 2806199 2964240
19484B964240J22196K00315R5522J52534J98777J09139J92103K22781K66675L13697
$$ 2964240 3086436 3286751 3382273 3534807 3733584 3842723 4034826 4257607 4524282 4837979
19474D837979K66331J87887K69947L72698M57008L28275K40976N50049O80194
$$ 4837979 5104310 5292197 5562144 5934842 6391850 6720125 6961101 7511150 8191344
19465H191344P74920R05146J043939J251134J212260J401015J548166J884878
$$ 8191344 8966264 9871410 10915349 12166483 13378743 14779758 16327924 18212802
19457A8212802K200144K601005K840227L156458L760864M517719N630532P014252
$$ 18212802 20412946 23013951 25854178 29010636 32771500 37289219 42919751 49934003
19449D9934003Q916989J1687722J5924570K1526049K8443805L4975837L8022080
$$ 49934003 58850992 70538714 86463284 107989333 136433138 171408975 209431055
19442B09431055L5831153L0392562K4545715J4979989l811600k7140721m2033220
$$ 209431055 245262208 275654770 300200485 315180474 311368874 284228153 242194933
19435B42194933m3128775l6406181k8177891k1172453j5866367j2183751r741135
$$ 242194933 199066158 162659977 134482086 113309633 97443266 85259515 75518380
19428G5518380p871850o261477n302761m499673l768469l233900k830723k448917
$$ 75518380 67646530 61385053 56082292 51582619 47814150 44580250 41749527 39300610
19420C9300610k260411j927788j628603j472733j516645j321154j176706j091544
$$ 39300610 37040199 35112411 33483808 32011075 30494430 29173276 27996570 26905026
19412B6905026j137701r23496p99069q80727p29898q50064q11791p46068q15746
$$ 26905026 25767325 24843829 24044760 23164033 22434135 21584071 20772280 20026212 19210466
19403A9210466o98328m99431m65940o03265m12637n71391m23279n16716m36666
$$ 19210466 18512138 18012707 17546767 16943502 16530865 15959474 15536195 15019479 14582813
19394A4582813l79929m10953m03851k90744m02729l26658k16347l15564l46933
$$ 14582813 14202884 13791931 13388080 13097336 12694607 12367949 12151602 11836038 11489105
19385A1489105l25407j39696j95928k48789j82631k44345k98038k78753k42912
$$ 11489105 11163698 11024002 10828074 10579285 10396654 10152309 9854271 9575518 9332606
19376I332606j88148K0871j26742k24316k27258k84885j73211p2444P4274j59487
$$ 9332606 9144458 9165329 9038587 8814271 8587013 8302128 8128917 8056473 8130747 7971260
19366G971260k11644k08263l9444M8215N1967j23980j97435j15492r9173k62179
$$ 7971260 7759616 7551353 7511909 7560124 7612091 7488111 7290676 7175184 7076011 6813832
19356F813832k32716r902l8096n4632o8502j59406p2885j8961j78063j59046j81629
$$ 6813832 6581116 6571214 6533118 6478486 6409984 6250578 6177693 6158732 5980669 5821623 5639994
19345E639994p569L6230j50870l24291l10448j63691j52038P1571j6818k37960
$$ 5639994 5632425 5668655 5517785 5193494 4883046 4719355 4567317 4638888 4622070 4384110
19335D384110r1366L5713k1860p570m7092Q3866R0389K6284k17184o9417p7436
$$ 4384110 4292744 4328457 4306597 4299027 4251935 4335801 4426190 4452474 4235290 4165873 4088437
19324D088437l7886P2500M2752j48601n3846J20116J07648K634q9819K6133J80424
$$ 4088437 4050551 4123051 4165803 4017202 3963356 4083472 4191120 4193754 4103935 4130068 4310492
19313D310492l5288j57569q343J27100o913n4564k32217k77821k81090k57395
$$ 4310492 4275204 4117635 4109292 4236392 4229479 4174915 3942698 3664877 3383787 3126392
19303C126392q1291j0477P690r8797j48893j3044L2159j40337j41727j32478p6982
$$ 3126392 3045101 3034624 3042314 2943517 2794624 2781580 2813739 2673402 2531675 2399197 2322215
19292B322215P4655j9782o4575n8380o8809r0514M6101J15884L9780k5374o2216
$$ 2322215 2396870 2377088 2312513 2254133 2185324 2094810 2140911 2256795 2296575 2271201 2208985
19281B208985m182L1165j56712j20367j39560L6251n8013p3864J50361Q8822O6042
$$ 2208985 2204803 2235968 2079256 1958889 1819329 1855580 1797567 1723703 1874064 1962886 2028928
19270B028928j12764o8860j81499j90045j2003N1554J09882N4101J10142j33616
$$ 2028928 1916164 1847304 1665805 1475760 1463757 1515311 1625193 1679294 1789436 1655820
19260A655820j77728r0313j08570r661l4838J76895M7401m2048j5759K1893j46862
$$ 1655820 1478092 1387779 1279209 1269548 1234710 1411605 1459006 1416958 1401199 1423092 1276230
19249A276230k7943K6563j2863J7948R2589k8008p8349j12120m9571J06168N5253
$$ 1276230 1248287 1274850 1261987 1279935 1372524 1344516 1266167 1154047 1104476 1210644 1265897
19238A265897K0037j13123o8499o6790o6554N9017l8132J3491N4614l0564j04695
$$ 1265897 1285934 1172811 1104312 1037522 970968 1029985 991853 1005344 1059958 1029394 924699
19227I24699O722P4780J18945P5259j56505j56022n0023m9142L0884J12078l9891
$$ 924699 931421 1006201 1125146 1200405 1043900 887878 837855 788713 819597 931675 891784
19216H91784J7252Q8636m2718j25465l3732r5237o5932j22651J08633J11491M1767
$$ 891784 909036 997672 954954 829489 795757 700520 634588 511937 620570 732061 773828
19205G73828L7211j20563n0181J43359p5463o9992J5582J083M780Q3938k153k33297
$$ 773828 811039 690476 640295 783654 708191 638199 653781 654864 659644 743582 741429 508132
19193E08132r9690K36188K760J9393J9983j75323m2089N5557Q3049k0708q0702
$$ 508132 408442 644630 647390 666783 686766 511443 469354 524911 607960 587252 506550
19182E06550n3020j13029n6723O800l4426Q8388J9091N3419Q1298L470j00134
$$ 506550 453530 340501 283778 290578 256152 344540 363631 417050 498348 501818 401684
19171D01684j06211Q6191M5636J6727j3730M1330k7467j14845P598j09877j13129
$$ 401684 295473 381664 427300 444027 430297 471627 444160 329315 336913 227036 113907
19160A13907P4807P9178J09866K1048J65634M9055N8659k17j44847j0465j31057
$$ 113907 188714 267892 377758 398806 564440 613495 672154 671937 527090 516625 385568
19149C85568r698j67993L963J76675k6049p4051N5359K0978j11845L1909k2488
$$ 385568 375870 207877 211840 388515 362466 288415 343774 364752 252907 284816 262328
19138B62328J73863q277j31904n1098l2401J8005j15910j5432j1229J23172M5580
$$ 262328 436191 427914 296010 244912 212511 230516 114606 99174 87945 211117 256697
19127B56697J252O4385J04374j11616j15373k07412J06878K35945l1843O9640
$$ 256697 257949 322334 426708 315092 199719 -7693 99185 335130 303287 372927
19117C72927O2810O8833l9671q7714O4120o1816j92560M4J91126J7099o0876j80005
$$ 372927 435737 504570 464899 377185 441305 379489 186929 186973 378099 395198 334322 154317
19105A54317o4126k7304J98699J55413l2881j26006r643Q9098M5567j64671j69933
$$ 154317 90191 62887 261586 416999 384118 258112 248469 337567 383134 218463 48530
19094D8530l7188L8230p995N9335J1879L2062J27164o6271p5808P9851L3599j36959
$$ 48530 11342 49572 41577 100912 112791 144853 272017 205746 129938 209789 243388 106429
19082A06429J25286J68211n3663O5044j53041j75860R3652K8089Q0001O6066r0822
$$ 106429 231715 399926 346263 411307 258266 82406 176058 204147 284148 350214 259392
19071B59392j2239Q563O8032o0980j09329l4813J6328J34122P9722o694n8420
$$ 259392 247153 255716 323748 262768 153439 118626 134954 269076 348798 342104 283684
19060B83684j1243r6398m1614j69757p5997R7497P5597r877Q6877p5103r7256
$$ 283684 272441 176043 134429 -35328 -111325 -13828 61769 51892 138769 63666 -33590
19049c3590K2970N5399J16715Q2797n701l2039l6780r5381K2369J00138N5145
$$ -33590 -10620 44779 161494 244291 238590 206551 169771 74390 96759 196897 252042
19038B52042J4445j26981n9442J7668j08052P0796K2087K0225O6739j2882j12691
$$ 252042 266487 139506 80064 97732 -10320 60476 82563 102788 169527 156645 43954
19027D3954K8171L0584K21050j3445j29920L8664P9700j03302M9186K09711l3954
$$ 43954 72125 102709 323759 310314 180394 219058 298758 195456 244642 454353 420399
19016D20399k8136r8643k2438q9595M3422K19188q7516J2045Q4282O935j40321
$$ 420399 392263 293620 271182 181587 225009 444197 356681 368726 453008 459943 319622
19005C19622n1802M0909j5863j36072Q7693Q5548j52354R7165J74328O7201j20363
$$ 319622 267820 308729 292866 156794 244487 330035 177681 274846 449174 516375 396012
18994C96012Q3762R7980p8624O452L7159j0676k8283J56086J77760Q1357J48461
$$ 396012 479774 577754 499130 505582 542741 532065 503782 659868 837628 918985 1067446
18983A067446l6757j66773J17540L461r1159n5952p1621L4317P0285P0040p6381
$$ 1067446 1030689 863916 981456 984917 893758 837806 766185 800502 870787 940827 864446
18972H64446Q729l3642q8338n0351J569j92779j01809Q1116J17508R739j68619
$$ 864446 873175 839533 751195 700844 702413 509634 407825 488941 606449 616188 447569
18961D47569j52614L4214J17304K01539N4858j13674j53478l1657J36655k5525
$$ 447569 294955 329169 446473 648012 702870 589196 435718 404061 540716 515191
18951E15191r0673P5490N8743j0448J8893q4269M4431P8875o2223n7337L2773
$$ 515191 424518 500008 558751 548303 567196 482927 527358 606233 544010 486673 519446
18940E19446M1773J13611L0739j25511n6695n0083R0452P0860M214K03421p71
$$ 519446 561219 674830 705569 580058 523363 473280 563732 634592 638806 842227 841456
18929H41456n5441k9754J02473N8969Q8531p2259J7179K7875m6518j42418R2850
$$ 841456 786015 756261 858734 917703 1006234 933975 951154 979029 932511 790093 882943
18918H82943N1953k333m3270r0374Q6799J37123J06558L2614M1528J2980m3272
$$ 882943 934896 932563 889293 798919 885718 1022841 1129399 1162013 1203541 1216521 1173249
18907A173249N2803K78408J32048K00737o594p3557k5874Q2948P4160P6061K30293
$$ 1173249 1226052 1504460 1636508 1837245 1830651 1757094 1731220 1814168 1888328 1964389 2194682
18896B194682K75390J86370J26334K64072K48773R0435K84686L23117Q4436J24121
$$ 2194682 2470072 2656442 2782776 3046848 3295621 3386056 3670742 3993859 4078295 4202416
18886D202416K91148L18150J7603O2170K29184K13332K99292M44424N41753N83070
$$ 4202416 4493564 4811714 4829317 4891487 5120671 5334003 5633295 6077719 6619472 7202542
18876G202542Q32010P81743R41153J263166J206195J370711J720433K221389K701179
$$ 7202542 8034552 8816295 9757448 11020614 12226809 13597520 15317953 17539342 20240521
18867B0240521L555039M378055N588116P504503R922582J3004913J6026120J8253420
$$ 20240521 23795560 28173615 33761731 41266234 51188816 64193729 80219849 98473269
18859I8473269J7919484J5526536J2793644R202913J351702j0823022k0274629
$$ 98473269 116392753 131919289 144712933 153915846 155267548 144444526 124169897
18852A24169897k2339439j9117293j4847421j1117493q422736o289474m718817
$$ 124169897 101830458 82713165 67865744 56748251 48325515 42036041 37317224
18845C7317224l983334l075720k386535k095614j867883j464873j269663j180425
$$ 37317224 33333890 30258170 27871635 25776021 23908138 22443265 21173602 19993177
18837A9993177j147040q49444p44284o86109o57990o15221n75030n32256n89826
$$ 19993177 18846137 17996693 17252409 16566300 15908310 15293089 14718059 14185803 13595977
18828A3595977l46139k93935l35803k65983l49615l18894n28243m88571j63151
$$ 13595977 13249838 12955903 12620100 12354117 12004502 11685608 11157365 10668794 10505643
18819A0505643l36707m99242m45630m22258l32700k56384l94487k90321k62636
$$ 10505643 10168936 9669694 9224064 8801806 8469106 8212722 7818235 7527914 7265278
18810G265278l96068j33593n6447k45713k46705k49970j11012q5517q7178k5771
$$ 7265278 6869210 6735617 6679170 6433457 6186752 5936782 5825770 5740253 5653075 5627304
18800E627304L3612l655k61103k43988k06621j00587M7454J1174k76931j54830
$$ 5627304 5660916 5657261 5396158 5152170 4945549 4844962 4892416 4903590 4626659 4471829
18790D471829J3407N3182q4594j93334j92428j44225j30003K900p5302m5442q2907
$$ 4471829 4485236 4538418 4453824 4260490 4068062 3923837 3793834 3796734 3721432 3675990 3593083
18779C593083q9735N0088J12809j8346Q9425P4672k07848k28291o8024n3916Q2266
$$ 3593083 3503348 3553436 3666245 3647899 3737324 3811996 3604148 3375857 3307833 3253917 3336183
18768C336183R7745j16212j55024k03939n6093L4907m4411k13643m8373O2311
$$ 3336183 3433928 3317716 3162692 2958753 2902660 2937567 2893156 2679513 2631140 2693451
18758B693451k00020j57351n6472k076m1113o7589R5318J2432j66919p0938q3084
$$ 2693451 2493431 2336080 2279608 2277532 2236419 2168830 2264148 2276580 2109661 2038723 1955639
18747A955639l7233Q2650o0896Q6676J59220N4472K6386n9862o2626O1341L2587
$$ 1955639 1918406 2001056 1940160 2026836 2186056 2240528 2266914 2207052 2144426 2205767 2238354
18736B238354J9622p9074j46066j2933L7139O7603R1303J878N2183k67052q9780
$$ 2238354 2257976 2178902 2032836 2019903 2057042 2124645 2215948 2217826 2270009 2002957 1913177
18725A913177k6196k8808j75787Q328P1032l7325j95846l9512p7474j02198K3806
$$ 1913177 1886981 1858173 1682386 1690714 1761746 1724421 1528575 1489063 1411589 1309391 1333197
18714A333197O7727j36184l4847J988j6548j24233m0417m622L1136m1883r1557
$$ 1333197 1400924 1264740 1229893 1231881 1215333 1091100 1050683 1046061 1077197 1035314 943757
18703I43757K6054J40415j3110j67823m1634J07721N8901n3037j0308K3842R6271
$$ 943757 969811 1110226 1097116 929293 887659 995380 1054281 1001244 990936 1014778 1111049
18692A111049M9237j18033m8434l5934J1726J15370j0207K552M6988k2737O8678
$$ 1111049 1160286 1042253 993819 957885 969611 1084981 1074774 1077326 1124314 1101577 1170255
18681A170255o2058j07394K1878j21069m7961o8428l3023n9899l4008J82491J67211
$$ 1170255 1108197 1000803 1022681 901612 853651 785223 752200 692301 658293 840784 1007995
18670A007995j8736K4013j74860k3893k9945j17511j18411K8762N32Q9072J5584
$$ 1007995 989259 1013272 838412 814519 784574 667063 548652 577414 577946 667018 682602
18659F82602J21912J32356p6260N4744l4911j23721o0235K4347J04501j06592
$$ 682602 804514 936870 860610 915354 880443 756722 696487 720834 825335 718743
18649G18743j34842j0308n9857M8672l9569q1875r0070M0595n0819J3228j02149
$$ 718743 583901 573593 513736 562408 522839 440964 350894 391489 340670 353898 251749
18638B51749J0392j34691m6944J8600J2166M3137O9471K8770L854Q2974k7204
$$ 251749 262141 127450 80506 99106 111272 154409 223880 252650 256504 339478 312274
18627C12274l7617k0543o1004J02225J8891M635n1994J40073Q1036j05818q0252
$$ 312274 274657 254114 193110 295335 314226 318861 266867 406940 487976 382158 301906
18616C01906j31016N314J12806K24956Q2313j10866q7541P1153N9913o0561j30938
$$ 301906 170890 176204 289010 513966 596279 485413 397872 469025 528938 468377 337439
18605C37439n5420l444j37376K32K68921o3181k48311Q0091J75378k9927q826
$$ 337439 282019 278575 141199 141431 410352 347171 98860 178951 354329 324402 315576
18594C15576P231m6944k2672l8537J5409q3300o5822O7077L0156j4305M6524M7051
$$ 315576 322807 275863 253191 214654 230063 146763 80941 148018 178174 163869 210393 257444
18582B57444R0431q1938r9349k3965n930L8379O3817n2923j19787j6483J51692
$$ 257444 347875 265937 166588 142623 136693 175072 238889 185966 66179 49696 201388
18571B01388J46895J8941m3854N0038m4398j59240j983K1612P7544j45114q5069
$$ 201388 348283 367224 323370 373408 329010 169770 167787 189399 266943 121829 36760
18560C6760j2372n3451K3742M9633N7015R0250J6116K2109l0053k09310l3438
$$ 36760 24388 -29063 -5321 44312 101327 191577 207693 229802 199749 -9561 -42999
18549d2999K6360j5684L5178K9399J31958M9972r7380K4231p7594o6102K550n5096
$$ -42999 -16639 -32323 2855 32254 164212 214184 116804 141035 63441 -2661 -111 -55207
18537e5207M4530N3040P1891O6699o0724r3801K5725N6559k2137l5467K285j10381
$$ -55207 -10677 42363 114254 180953 120229 26428 52153 108712 86575 51108 53393 -56988
18525e6988P3073P3586o5761p7169p4393O5880K57014R9018j25285k10806j22824
$$ -56988 16085 89671 23910 -53259 -127652 -61772 195242 294260 168975 -41831 -164655
18514a64655Q6279J09451J10343n1098o7430j5587M3977J362n0767J259N1150
$$ -164655 -78376 31075 141418 90320 22890 7303 51280 52642 1875 3134 54284
18503E4284J15063j6291r0912k11181j20285j34677J80761J49635K4675l7672
$$ 54284 169347 153056 62144 -149037 -269322 -403999 -223238 -73603 -48928 -86600
18493h6600M708L8552Q9444R8472J3778j19275J04480J32290p8462J9680r9884
$$ -86600 -81892 -43340 46104 144576 158354 39079 143559 275849 197387 217067 117183
18482A17183o6637l8365p4209K1688L8587P7707N1174m321O7841j02550M0133
$$ 117183 50546 12181 -62028 -40340 -1753 75954 127128 122807 190648 88098 128231
18471A28231J21128j02029j52703j12904J80127P8695J9661j3481K6780q7194
$$ 128231 249359 147330 -5373 -118277 61850 140545 160206 146725 173505 86311
18461H6311l1034l0548n3863J03547p5888K1295Q6911M1186j58894j18820J9359
$$ 86311 55277 24729 -29134 74413 -1475 19820 106731 147917 -10977 -129797 -110438
18450a10438l9861Q3889J18619J3703n5767M1930R727L0344k1502P2137j04907
$$ -110438 -150299 -66410 52209 65912 10145 52075 61802 92146 70644 142781 37874
18439C7874J14371J36550m4846K9594l528j52944r8178j26896r3544K00096J16009
$$ 37874 152245 288795 243949 273543 270015 117071 18893 -108003 -201547 -1451 114558
18428A14558o7724k3894q3231N8580Q2438n9124j66642m4240L3567J64211N943
$$ 114558 46834 22940 -60291 -1711 80727 21603 -145039 -189279 -155712 8499 14442
18417A4442p5688J2324P8832N3880J49695q1343q7053j7412j0568n2126K0184
$$ 14442 -61246 -48922 29910 83790 233485 152142 65089 47677 37109 -15017 5167
18406E167k2894r3410L6084q846j8543p8822M881N7030N2504k6757K5746l7573
$$ 5167 -17727 -111137 -75053 -83899 -102442 -181264 -176383 -119353 -66849 -93606 -67860 -105433
18394a05433N8096K4237P9518p755l4424l0063P5879J00032j68928j02060P2834
$$ -105433 -47337 -23100 56418 48663 14239 -15824 60055 160087 -8841 -110901 -38067
18383c8067K4135O7720j25006l257L9511l0458M978l308L4523N4944L4119l0784
$$ -38067 -13932 53788 -71218 -74475 -34964 -65422 -60444 -63752 -29229 25715 59834 29050
18371B9050L295q7411j20046J0025m987k0232J55905J07610L7195J313o7308p994
$$ 29050 32345 -55066 -175112 -165087 -170074 -190306 -34401 73209 110404 111717 44409 36415
18359C6415N2693l7326O7333m0193k10068p4854J63830L7247P8361O1284M379
$$ 36415 89108 51782 119115 78922 -131146 -206000 -42170 -4923 73438 134722 139101
18348A39101j06812L6612M3251J645K914j18359m9335L5272p9081J41417M0603
$$ 139101 32289 68901 112152 113797 116711 -1648 -50983 -15711 -94792 46625 87228
18337H7228n2659J33521O7908j35525K994o0617r5063J10221J82656m0685j22005
$$ 87228 34569 168090 235998 100473 103467 42850 -52213 58008 240664 199979 77974
18326G7974K1864L4158k1148p227o7485j41422n3985K9436J95981J13762k0357
$$ 77974 99838 133996 112848 105621 38136 -103286 -157271 -127835 68146 181908 161551
18315A61551L4351N1053r5815j66560P7952k6206n5995M5991j7133R5193K2219
$$ 161551 195902 246955 151140 -15420 62532 36326 -19669 26322 9189 104382 126601
18304A26601j45974j5570P7131J1381M182L5690l96j2799m8826P8545J03788o1635
$$ 126601 -19373 -34943 42188 53569 57751 93441 93045 80246 31420 109965 213753 152118
18292A52118r7154j6284q2684R1107J53111J55365J41943r6569o10M2313J22908
$$ 152118 54964 38680 -44004 47103 200214 355579 497522 400953 400343 442656 565564
18281E65564J3843q2307p9847J44895N2437l7272k82559j70552J45063J61299
$$ 565564 579407 497100 417253 562148 614585 577313 294754 124202 269265 430564
18271D30564K7252j23476j15829n0674r9581j6536L1408J14911J25848m5693K2089
$$ 430564 457816 334340 218511 167837 68256 51720 83128 198039 323887 278194 300283
18260C00283Q1011l4808j4930j49573j11795n4353L6080Q791p3842j11677P6366
$$ 300283 381294 346486 331556 181983 70188 15835 51915 60706 -13136 -124813 -48447
18249d8447J08673R3764j5696j17541m0458J09840N5794j68136j50697J20029
$$ -48447 60226 153990 138294 20753 -19705 90135 145929 -22207 -172904 -52875
18239e2875J58371J43973j00049n2800o2618j62522p6636R9363N2909P8536J51073
$$ -52875 105496 249469 149420 96620 34002 -128520 -205156 -105793 -52884 25652 176725
18228A76725J5924j44929m5940p0285l1593K905J032j29221R003N4475N1820M7241
$$ 176725 192649 47720 1780 -68505 -100098 -97193 -96161 -225382 -216379 -161904 -110084 -62843
18216f2843L6617J6424J04686q9646n4190Q2826J19523j4353j18947j11117p524
$$ -62843 -26226 -9802 94884 5238 -48952 33874 153397 139044 20097 -91020 -98544
18205i8544O5908j22835J2638J33550J0288j42505R8887K26058J9660l5481j33696
$$ -98544 -32636 -155471 -142833 -9283 1005 -141500 -42613 183445 203105 167624 33928
18194C3928m9843j86758j25248n4239J0424K12696J76416L3023K08k1947q7073
$$ 33928 -15915 -202673 -327921 -382160 -371736 -159040 17376 50399 50607 28660 -58413
18183e8413M9234p4047l5109J784n3000O3330N9570R18Q4943K1380o9169j73044
$$ -58413 -9179 -83226 -118335 -116551 -169551 -106221 -46651 -45733 39210 60590 -8579 -181623
18171a81623J13068q1695p91J57042J34592P6710o0546o4212l8854m7665P3328
$$ -181623 -68555 -150250 -151041 6001 140593 217303 156757 92545 53691 6026 79354
18160G9354k5403J7435q3177r6254r0079N3658J18416J2275P0155N0507r0367
$$ 79354 53951 71386 -11791 -108045 -198124 -144466 -26050 -13775 56380 106887 16520
18149A6520j1814J07890k2309J6638Q0117Q116r4422M8197N0158r903L7894J7275
$$ 16520 4706 112596 90287 106925 187042 195158 100736 148933 199091 189188 227082 244357
18137B44357j1550n0919p7723K5934p9849l4323P732N0225p6070k3327n8558N7294
$$ 244357 232807 181888 104165 130099 50250 15927 23659 73884 -2186 -25513 -84071 -26777
18125b6777J18072J55863k6434j76088M295O9098K6928q8570o2257j5822N4315
$$ -26777 91295 247158 220724 44636 48931 118029 144957 56387 -5870 -21692 32623
18114C2623L7997j9617j01640m1106L8151j44711o4135R8447J37054Q7805R7061
$$ 32623 70620 51003 -50637 -91743 -53592 -198303 -262438 -163991 -26937 60868 157929
18103A57929k5207O561k0868l7456j17904j78888o1649Q8294J67528J13689Q9702
$$ 157929 132722 139283 118415 80959 -36945 -215833 -277482 -189188 -21660 92029 181731
18092A81731p4890r7968N8516O3497j9550k66447m5445J15149N7427n2090j37492
$$ 181731 106841 8873 67389 130886 111336 -155111 -200556 -85407 -27980 -80070 -217562
18081b17562k4248R1495q370J2127K7788J21864p2881o8395J06250n824Q8229
$$ -217562 -241810 -150315 -158685 -146558 -118770 3094 -69787 -138182 -31932 -37756 50473
18070E0473L7391j02059J7623l3362p9068O0492R5936N0647k33275j08335k3820
$$ 50473 87864 -14195 3428 -29934 -109002 -48510 47426 98073 -135202 -243537 -267357
18059b67357J43705Q1112J52233q0285k7376p3820K8104l3386N9408J44924k5249
$$ -267357 -123652 -42540 109693 29408 2032 -71788 -43684 -77070 -17662 127262 102013
18048A02013j7683q1463j84467k2797J50962O5248N035n3846m0983q3449L3226
$$ 102013 84330 2867 -181600 -204397 -53435 11813 16848 -36998 -77981 -161430 -128204
18037a28204J38265O5777K3661m9118j14949j72743q7534J78128J30964k9286
$$ -128204 10061 75838 99499 50381 -64568 -237311 -324845 -146717 -15753 -45039
18027d5039M9025M3309J24862n7255j89880R898j5872j9007j25232r893J7286
$$ -45039 3986 47295 172157 114902 -74978 -65080 -80952 -99959 -225191 -235084 -217798
18016b17798o7383m8198j52705k0701J40285J27423J53120J07162m1153m4598
$$ -217798 -285181 -333379 -486084 -506785 -366500 -239077 -85957 21205 -19948 -64546
18006f4546J1265K1555M7729J60058J1002o4548p1960j6914r7129O9552J65296
$$ -64546 -53281 -31726 16003 176061 187063 122515 50555 33641 -63488 6064 171360
17995A71360j5346j83444K7470R0918o0635M1670m4256j14225o2379o099Q5961
$$ 171360 156014 -27430 40 90958 30323 71993 27737 -86488 -148867 -154966 -69005
17984f9005K9197j22524n1990J73812J27247J10753J03922o4801m2576N7102J50953
$$ -69005 -39808 -162332 -214322 -40510 86737 197490 301412 236611 194035 251137 402090
17973D02090q3556j5822j62185j51307j64435K7479l8246J41885J36631l5440
$$ 402090 318534 302712 140527 -10780 -175215 -147736 -185982 -44097 92534 57094
17963E7094j54819j07888L6303n3841O3362p7096j35306P341J09781M0323M3629
$$ 57094 -97725 -205613 -169310 -223151 -159789 -236885 -372191 -364850 -255069 -214746 -171117
17952a71117O6692M2347M1094P0207L8813j2226r1390m0406j50907j6815J32551
$$ -171117 -104425 -62078 -20984 49223 88036 75810 -15580 -55986 -206893 -223708 -91157
17941i1157J26410m4081q2456J23423J9965l2017r2719m3244J83509J65735m8951
$$ -91157 35253 -8828 -91284 32139 52104 20087 -72632 -115876 67633 233368 184417
17930A84417l7130k32485j66797L8626R193j062J52683N8088m1214o8151L8755
$$ 184417 147287 -85198 -251995 -213369 -204176 -205238 -52555 5533 -35681 -103832 -65077
17919f5077k635N5305O1646M8585k8110p3552p8981p4046l5375N1551P7831j57392
$$ -65077 -67712 -12407 49239 97824 69714 -3838 -82819 -156865 -192240 -140689 -62858 -220250
17907b20250L2858J47892R2869L5313L171M427n7802O2430O8160j62851k35464
$$ -220250 -187392 -39500 53369 88682 91853 96280 38478 100908 169068 6217 -229247
17896b29247N6845J17225N1696L6J5444r2248J0778M9822J18705n9491n2518j7360
$$ -229247 -172402 -55177 -3481 -3445 11999 -80249 -69471 -19649 99056 39565 -12953 -30313
17884c0313n3469q1783n0250L3986J05789J46676J7816j58755m202K42197o7437
$$ -30313 -83782 -165565 -215815 -181829 -76040 70636 88452 -70303 -74505 167692 100255
17873A00255o3305K623m2803j06276r4721j02796N7369R014J62015K09272j2857
$$ 100255 36950 39573 -3230 -109506 -204227 -307023 -249654 -240640 -78625 130647 117790
17862A17790J988p5936k05365j7061J01559n3426Q6936J09491l308k00408o2854
$$ 117790 119778 43842 -161523 -178584 -77025 -130451 -43515 65976 62668 -137740 -200594
17851b00594J0939j37466j96409J63428J66632J11331J33291J69076J21571j41781
$$ -200594 -189655 -327121 -523530 -360102 -193470 -82139 51152 220228 341799 200018
17841B00018j80689m0713J41366J46974o0430N3907n0349j30195j9017L7016K21
$$ 200018 19329 -21384 119982 266956 206526 260433 210084 79889 60872 97888 98109
17830I8109j5710p7403J53301Q2155j22202r5007R303J24815J08180l196L5200
$$ 98109 82399 4996 158297 240452 118250 23243 32546 157361 265541 262345 297545
17819B97545k2825m9090j4593k4162q8770p6000m7914J03831K9732k9717l2066
$$ 297545 274720 225630 211037 186875 98105 22105 -25809 78022 107754 78037 45971
17808D5971j20755j20463L6461m8013R5444M5366P7031M2324J60063p0848j07677
$$ 45971 -74784 -195247 -158786 -206799 -111355 -65989 11042 53366 213429 142581 34904
17797C4904j5622L8641p8912n8476Q1199Q7121J2067J27580m0135j33652p5787
$$ 34904 19282 57923 -20989 -79465 1734 88855 100922 228502 188367 54715 -21072
17786b1072o4493L5316L4096J89540J10361j07957L6743K7146q3082j22623O3523
$$ -21072 -85565 -50249 -16153 173387 283748 175791 212534 239680 156598 33975 97498
17775I7498N6915q5020q8992m1636j0772j02927K9603J27836j15740l4971j4283
$$ 97498 154413 69393 -19599 -61235 -72007 -174934 -145331 -17495 -133235 -168206 -182489
17764a82489R6032n3577J57028J45698o6400o0452k0944l8395R0652L7642j36966
$$ -182489 -86457 -140034 16994 162692 96292 35840 14896 -23499 67153 104795 -32171
17753c2171P6958M7936o8498j14471Q388J9361m622M9317q5017j00093q0346M7642
$$ -32171 44787 92723 24225 -90246 -81858 -62497 -67119 -17802 -102819 -202912 -283258 -235616
17741b35616J19506J22288M756o7094p9932l5540n3273J06674K09152J65678j78380
$$ -235616 -116110 6178 10934 -56160 -136092 -171632 -224905 -118231 90921 256599 78219
17730G8219r000M6764p1809j45958k2567O1541N6435K18276J97688o3247j62537
$$ 78219 69219 115983 44174 -101784 -124351 -62810 -6375 211901 409589 346342 183805
17719A83805J01872Q2417r05r6737j74733p9651J38818m653p4128j09177k9064
$$ 183805 285677 368094 367189 270452 95719 16068 154886 150233 76105 -33072 -62136
17708f2136K0745K9286J66614p1537l4521J6426q2727k0311L6400o16Q1076P3937
$$ -62136 -41391 -12105 154509 82972 48451 64877 -17850 -38161 -1761 -2377 78699 152636
17696A52636r0878j65218J01141q15p930Q4974L9621R7147j30984J5583j9807
$$ 152636 61758 -103460 -2319 -3134 -11064 73910 113531 210678 79694 95277 75470
17685G5470j05364R21M0853j1058N9777M0314Q8593J35012N6811p0841p4843j63846
$$ 75470 -29894 -28973 11880 822 60599 100913 189506 324518 381329 310488 235645 71799
17673G1799j47449k6910O3402L7406M8142j24446j46805O0029R7097M9795N5898
$$ 71799 -75650 -102560 -39158 -1752 46390 -78056 -224861 -164832 -67735 -17940 37958
17662C7958k0932J4033J2203j4619J13180p2492J20217P3271j42561j42826J528
$$ 37958 17026 31059 43262 28643 141823 69331 189548 262819 120258 -22568 -21040
17651b1040j50542j03073j0224J9677J4333N2405K4172K156L2769k3522J4731
$$ -21040 -171582 -274655 -284879 -265202 -250869 -198464 -174292 -172136 -139367 -162889 -148158
17640a48158J30782P8507j10578k3471m3019J00599L9616j00384p8211P3210J65240
$$ -148158 -17376 61131 -49447 -72918 -115937 -15338 24278 -76106 -154317 -81107 84133
17629H4133R6029q56o1905j4907m0002m9717M9348k5671r0712m3236m4171j00022
$$ 84133 180162 179306 117401 102494 62492 12775 62123 36452 -54260 -97496 -141667 -241689
17617b41689M4512Q5367Q5546m307r8395K1918j5989K7039p1759P4859O6274K8297
$$ -241689 -197177 -111810 -26264 -30571 -128966 -107048 -123037 -95998 -167757 -92898 -26624 1673
17605A673n1662N0223n0340K2354O3621j29183k57623P0398K14175J2484m7125
$$ 1673 -49989 234 -50106 -27752 35869 -93314 -350937 -280539 -66364 -53880 -101005
17594a01005O4557j28053l7342J45784Q1377m5799P2348M7959j02784k3067j7220
$$ -101005 -36448 -164501 -201843 -56059 25318 -20481 51867 99826 -2958 -26025 -43245
17583d3245J9087k8377r8148O059p7937M2293R9256N1884o7498j29488n9430M5161
$$ -43245 -24158 -52535 -150683 -144624 -222561 -180268 -81012 -29128 -96626 -226114 -285544 -240383
17571b40383r969k375k202J25707R9075m2422J13251J6676K8228q0455M2580r4
$$ -240383 -250352 -252727 -254929 -129222 -30147 -72569 40682 57358 85586 5131 47711 47617
17559D7617l8986r0072k8724m4396r4433p7529J44482J95787P4872J0887j67821
$$ 47617 8631 -81441 -110165 -154561 -248994 -326523 -182041 13746 88618 99505 -68316
17548f8316r5158J28752J62484L8501K66k9919J7494L2845j63046n9245q7891
$$ -68316 -163474 -34722 127762 166263 166529 136610 154104 186949 23903 -35342 -123233
17537a23233o7975Q2705R5651N4841R3756j06201q0809j12258n2626J00602L7113
$$ -123233 -191208 -108503 -12852 41989 135745 29544 -51265 -163523 -216149 -115547 -78434
17526g8434J7186J94845N5620j02378j946o0041q4263j1186Q076k208K2797J17658
$$ -78434 -61248 133597 189217 86839 84893 24852 -59411 -70597 -62521 -64729 -41932 75726
17514G5726n9347M8600O9397m6024j9520m1412L7709K5991l3059q6087j06704
$$ 75726 16379 64979 134376 88352 68832 27420 65129 91120 58061 -28026 -134730
17503a34730j13130k4479M8002J93930J06202j23190J4702J45380R8497J05694
$$ -134730 -247860 -272339 -224337 -30407 75795 -47395 -32693 112687 211184 316878
17493C16878j09050k53890l8209J73477q576K4036J41153p9228j73052k3701P3781
$$ 316878 207828 -46062 -84271 89206 80630 104666 245819 166591 -6461 -30162 43619
17482D3619k4271Q7154J14253q4517J04992J60678J31675p6061j63182j67784
$$ 43619 19348 106502 220755 136238 241230 401908 533583 457522 294340 126556
17472A26556o9880q6602k7136J4332M6149r0947p9532l3165Q8953J01272M2968
$$ 126556 56676 -29926 -57062 -42730 3419 -87528 -167060 -200225 -111272 -10000 32968
17461C2968J09048J96018j23290q4777l1038L3434l6180p941J72326j85170j76071
$$ 32968 142016 338034 214744 129967 98929 132363 96183 88242 260568 75398 -100673
17450a00673n601J12065J45278j31627n123o3121q6007p0080k0054Q5281j7076
$$ -100673 -106274 5791 151069 19442 14319 -48802 -134809 -204889 -224943 -139662 -156738
17439a56738J08182Q5783o2570j1214J11516J2408K8985o7616Q0405J60773j02039
$$ -156738 -48556 37227 -25343 -36557 74959 87367 116352 48736 129141 289914 187875
17428A87875j72221Q934N548k0822k6160r0523o791r091L1068K40j28414P1945
$$ 187875 15654 24588 30136 9314 -16846 -107369 -114160 -123251 -92183 -91943 -220357 -148412
17416a48412J36948R5033j48393m3046L4462j9146J55150J85441P9681p3532n7919
$$ -148412 -11464 83569 -64824 -107870 -73408 -92554 62596 248037 327718 254186 196267
17405A96267j03497j0525k0026r9404j1993L8208L7065J1915l3640j0341p4105
$$ 196267 92770 82245 62219 -37185 -49178 -10970 26095 38010 4370 -5971 -80076
17394h0076R8884J24398j0690p4559r7233N4511M7943K0066Q2301l0507j59621
$$ -80076 18808 143206 132516 57957 -39276 15235 63178 83244 165545 135038 -24583
17383b4583p5654L2304J18748P6363j39840l5674J089L3429k6492m9132J3264
$$ -24583 -100237 -67933 50815 127178 -12662 -48336 -47247 -13818 -40310 -89442 -76178
17372g6178R2474k5641n3183r3785m1165J14389N7088O7197j5321L4066p6726
$$ -76178 16296 -9345 -62528 -156313 -197478 -83089 -26001 41196 25875 59941 -16785
17361a6785M0209k358l3920k3617j15894k796m9762J5886J24681O3008J9652L7108
$$ -16785 23424 21066 -12854 -36471 -152365 -155161 -204923 -189037 -64356 -1348 18304 55412
17349E5412M5721P0289l2472j7587M6072K29878M318k04045j39437r8691O7569
$$ 55412 101133 171422 138950 121363 167435 397313 401631 197586 58149 -40542 27027
17338B7027R8808J0543l0322K6405j3260L7434K6853R601l6265q7373l3975k1714
$$ 27027 125835 136378 106056 132461 119201 156635 183488 193089 156824 69451 35476 13762
17326A3762N5777K2250l7710n2970l411j8899J59258K007m4157R987p7595j54303
$$ 13762 69539 91789 54079 1109 -2302 -21201 138057 140064 95907 105894 28299 -126004
17314a26004j44415q2775J87126J9523l3203N5757p5079Q2325j12770m3056O5139
$$ -126004 -270419 -353194 -166068 -146545 -179748 -123991 -199070 -116745 -229515 -272571 -207432
17303b07432P7542L7998J88569R883q6707q2714k03213j2796J55875j02194j4698
$$ -207432 -129890 -91892 96677 106560 19853 -62861 -266074 -278870 -122995 -225189 -239887
17292b39887J0618J29785J30922K9513l7870q5941n6733l9218J26573O3113n7288
$$ -239887 -229269 -99484 31438 60951 23081 -62860 -119593 -158811 -32238 30875 -26413
17281b6413j00004N2563J7343r7449o8919J3993O0106L8337J1572J09430J1458
$$ -26413 -126417 -73854 -56511 -153960 -222879 -208886 -148780 -110443 -98871 10559 22017
17270B2017r3869j00407k8555K4323P4138N7854K32867k7369o8705M3733q7321
$$ 22017 -71852 -172259 -200814 -176491 -102353 -44499 188368 160999 92294 136027 48706
17259D8706l3720O3077L669o7776l6554k3675j299L074k1560q5576o0583M3826
$$ 48706 14986 78063 81732 13956 -22598 -46273 -47572 -44498 -66058 -151634 -212217 -168391
17247a68391J9746J32551J11254j29911L7234K4367j9000K1343n2257n3290N8885
$$ -168391 -148645 -16094 95160 -34751 2483 26850 7850 29193 -23064 -76354 -17469
17236a7469M502n015r842q6821J8368P3547J72860L9497R1476p7251n0258k4551
$$ -17469 -12967 -17982 -27824 -114645 -96277 -22730 150130 189627 281103 203852 153594 129043
17224A29043P2016L1509K7904q909j62160J4445r1439j80013j4594R7822J20527
$$ 129043 201059 232568 260472 251563 89403 103848 12409 -167604 -182198 -84376 36151
17213C6151K1542M615p9771N0846M8596l3689m9182K0276j306j09084m6767P5087
$$ 36151 57693 62308 -17463 33383 81979 48290 -892 19384 18078 -91006 -137773 -62686
17201f2686J13673j4643n0772M8985J33576O709P9248k5151n8890q6172o5609
$$ -62686 50987 36344 -14428 34557 168133 174842 254090 228939 170049 83877 18268
17190A8268N193j13557p9023o0129l5047k5785J20857J6192j14048Q9754q6130
$$ 18268 23461 -90096 -169119 -229248 -264295 -290080 -169223 -153031 -267079 -177325 -263455
17179b63455q2137O8193R2527k3029J04223K19814L9751k10457j13190J6903j0773
$$ -263455 -345592 -277399 -184872 -207901 -103678 116136 155887 -54570 -167760 -150857 -161630
17168a61630m1981J00899Q141M6122K09942l1523n3537o0751l0663J65838P1036
$$ -161630 -203611 -102712 -94571 -48449 161493 129970 76433 15682 -14981 150857 221893
17157B21893j31508j05297r4107O8883O6104O1765n0485j40773K3696P373J37660
$$ 221893 90385 -14912 -109019 -40136 25968 87733 37248 -103525 -79829 -72456 65204
17146F5204j4925k5763J39931N2464j48189m0763m3965l1244l3888n1554L5302
$$ 65204 50279 24516 164447 216911 68722 27959 -16006 -47250 -81138 -132692 -97390
17135i7390O5427p711J8315l4684j32218L3448q9385j09596J8822K19276r8824
$$ -97390 -31963 -39674 -21359 -56043 -188261 -154813 -244198 -353794 -334972 -115696 -214520
17124b14520j50766j09168J73561J65821J34548m8377p4144K7089q2968Q5329
$$ -214520 -365286 -474454 -300893 -135072 -524 -48901 -123045 -95956 -178924 -93595
17114i3595N1586P4963j73646o5196J21895O2440j09138j01296M2703M8575n2038
$$ -93595 -42009 32954 -140692 -205888 -83993 -21553 -130691 -231987 -189284 -140709 -192747
17103a92747Q2595J80038l755o4988J4599J32376L3160j36368l0213Q0604k855
$$ -192747 -110152 69886 66131 1143 15742 148118 181278 44910 14697 95301 92446
17092I2446L7853j84436o3425j6571R6241j6698n8107J50905r6146j79692N495
$$ 92446 130299 -54137 -117562 -134133 -37892 -54590 -112697 38208 -57938 -237630 -232135
17081b32135K21102J47822r9247L2034r023L5186j4673j36410q6056N0740q76
$$ -232135 -11033 136789 37542 69576 60553 95739 81066 -55344 -141400 -90660 -91536
17070i1536m1870L4864Q3143N0844O2636k9007o9117K9084J32439n2752J9612
$$ -91536 -133406 -98542 -15399 35445 98081 69074 -43 29041 161480 108728 128340
17059A28340Q3961k9774r9753j4016j12095j32570R6310P7600r755M6704R4829
$$ 128340 212301 182527 82774 68758 -43337 -175907 -79597 -1997 -11752 34952 129781
17048A29781P677P1962j21422j30773q2543o6938P7749M9872n0051Q4218N4324
$$ 129781 137458 209420 87998 -42775 -125318 -192256 -114507 -64635 -114686 -30468 23856
17037B3856N5484k3711q0533o2215P0475j14596K8458m2626p0799J02478J01464
$$ 23856 79340 55629 -24904 -87119 -16644 -131240 -102782 -145408 -216207 -113729 -12265
17026a2265J84745J24678j74092j14025P2139L1086P0512j10770r7730l2294j17517
$$ -12265 172480 297158 123066 9041 81180 112266 182778 72008 -25722 -58016 -175533
17015a75533l0624R2178J75534K4141m9517O1166M5072n2150j31156r8091R5453
$$ -175533 -206157 -113979 61555 85696 36179 97345 142417 90267 -40889 -138980 -43527
17004d3527J17430N787k5888j44173j31371J438J80979K8890n2657J37449L0346
$$ -43527 73903 79690 53802 -90371 -221742 -220304 -39325 -10435 -63092 74357 104703
16993A04703r209j45313p2332j9658j3972L160L0335p8271o696n0587O1118R4252
$$ 104703 95494 -49819 -122151 -141809 -155781 -152621 -122286 -200557 -207253 -257840 -196722 -102470
16981a02470O6619j9094m9403L9913Q24j00054J3176Q0727N3876k5117O5881O1568
$$ -102470 -35851 -54945 -104348 -64435 -63611 -163665 -150489 -69762 -15886 -41003 24878 86446
16969H6446M7338q075j33113q489J0087o8217p9869l2001P9585O7980J21190M6864
$$ 86446 133784 125709 -7404 -15893 -5806 -74023 -153892 -185893 -106308 -38328 82862 129726
16957A29726M1602k57548q0785J33181O8718r9573r5751p4896J93049o5564j1961
$$ 129726 171328 -86220 -167005 -33824 34894 -64679 -160430 -235326 -42277 -107841 -119802
16946a19802j1723O5136M5056r2508J6949J07054K339M589O722q1587K7679K0994
$$ -119802 -131525 -66389 -21333 -113841 -96892 10162 12501 17090 23812 -57775 -30096 -9102
16934i102Q015j83496k3148L0132L7227o1935J01571O3490p023l3404Q4280J35961
$$ -9102 -1087 -184583 -207731 -177599 -140372 -202307 -100736 -37246 -44269 -77673 6607 142568
16922A42568Q3267l5361j26470J08517J69392j17496j26394m3896p0989M3973
$$ 142568 225835 190474 64004 172521 341913 224417 98023 54127 -16862 27111
16912B7111Q2002j47467m8238o901o8490J33970N7346q9691j1205m3059k1657
$$ 27111 109113 -38354 -86592 -93493 -161983 -28013 29333 -60358 -71563 -114622 -136279
16901a36279J0498M720M2344q65J3069k8176P64J56106M3508o7288R9296J19793
$$ -136279 -125781 -121061 -78717 -79582 -66513 -94689 -93925 62181 105689 38401 137697 257490
16889B57490j21444k69790k4743J35571K1157k8819N4865J89761M9805j47220
$$ 257490 136046 -133744 -158487 -22916 -1759 -30578 24287 214048 263853 116633
16879A16633j9019m0507o4699M5941m5773l0251M3877O4918k5868Q8338L5830
$$ 116633 97614 57107 -7592 38349 -7424 -37675 6202 71120 45252 133590 169420
16868A69420J1096R4497K3584o8117n8979J2592q338j76558j1437J22939j68929
$$ 169420 180516 275013 298597 230480 171501 184093 175755 -803 -12240 110699 -58230
16857e8230K2648K0094n3309p3711K6160J23710J51358K1781n7990P7388j01609
$$ -58230 -35582 -15488 -68797 -142508 -116348 7362 158720 180501 122511 199899 98290
16846I8290l3860j33191j25654Q2970j0968o4741n1835P4627J04611N1057k6608
$$ 98290 64430 -68761 -194415 -111445 -122413 -187154 -238989 -164362 -59751 -8694 -35302
16835c5302m0873J8915N1703j54959J6434M3988L6540P2477k8971l6150q0108
$$ -35302 -76175 -57260 -5557 -160516 -144082 -100094 -63554 8923 -20048 -56198 -136306
16824a36306o1070N5826o616K0798J46041P7224l4611M6242J8478j95430k4866
$$ -136306 -197376 -141550 -148166 -127368 18673 95897 61286 107528 126006 -69424 -94290
16813i4290n0191L2332L6173L8622l8602j19645l6462l5514m250m8425N2093R3569
$$ -94290 -144481 -112149 -75976 -37354 -75956 -195601 -232063 -267577 -271827 -320252 -268159 -174590
16801a74590J25872k7465l4958P7533R5492J8376M5660o2904n5872O4899j375
$$ -174590 -48718 -76183 -111141 -33608 61884 80260 125920 63016 7144 72043 70668
16790G0668n8154L3452j61413j64482j4697O9612J83075J67221q5824j65990j55793
$$ 70668 12514 45966 -115447 -279929 -294626 -225014 -41939 125282 39458 -126532 -282325
16779b82325m8557K0581J91763K07970O6170j31037j32033N8777P0270k2731K1226
$$ -282325 -330882 -310301 -118538 89432 155602 24565 -107468 -48691 21579 -1152 20074
16768B0074M5078M4159j02917l0813K5781O0759P9732j65882k7104m354L3020
$$ 20074 65152 109311 6394 -24419 1362 62121 141853 -24029 -51133 -55487 -22467
16757b2467R8162j1678m4060j5768j8904m259j73731o5124K62697J35299n809
$$ -22467 75695 64017 19957 4189 -14715 -18974 -192705 -257829 4868 140167 134358
16746A34358j72413p5528P2784J86952N9058J1191q8900r0213m6152l6885P6289
$$ 134358 -38055 -113583 -40799 146153 205211 216402 127502 37289 -8863 -45748 30541
16735C0541O2677P7054l8990j17801m5401L2137K613k16267P1792J01534O8226
$$ 30541 93218 170272 131282 13481 -31920 217 2830 -213437 -141645 -40111 28115
16724B8115q1973K27034n170n3655m8653n5319O6202L1073r7098n7542l8564p544
$$ 28115 -53858 173176 168006 114351 65698 10379 76581 107654 10556 -46986 -85550 -93094
16712i3094K66763J05173j86907j09310j8542j5900j9647j28564q9329O5473J22182
$$ -93094 173669 278842 91935 -17375 -35917 -51817 -71464 -200028 -289357 -223884 -101702
16701a01702n1939L5520K2846Q0224J6412j09866L4448l3886m5429J2682q4091
$$ -101702 -153641 -118121 -95275 -15051 1361 -108505 -74057 -107943 -153372 -140690 -224781
16690b24781J63497P9036j3407P2332R4921N8685O502j3539k26037m3556J09781
$$ -224781 -61284 17752 4345 76677 171598 230283 236785 223246 -2791 -46347 63434
16679F3434M7775k6284j57554m2444K2216J34356K21205m255j45840m0132L1977
$$ 63434 111209 84925 -72629 -115073 -92857 41499 262704 258449 112609 72477 104454
16668A04454P4685J6356j27421K3683j13485m2955L9172J06843n2046q0587j4078
$$ 104454 179139 195495 68074 91757 -21728 -64683 -25511 81332 29286 -51301 -65379
16657f5379P1052M0212r2607p7022j8713K7892J10066Q684j63582m2324p5065
$$ -65379 5673 45885 -46722 -123744 -142457 -114565 -4499 4185 -159397 -201721 -276786
16646b76786l0479M2212J88231L3561j33027N6514L5869K9595p5893k30841m828
$$ -276786 -307265 -265053 -76822 -43261 -176288 -119774 -83905 -54310 -130203 -361044 -365872
16635c65872J46809J19546O9135j78795l656M2131P9786n9802L0341m5676o8129
$$ -365872 -219063 -99517 -30382 -209177 -212833 -170702 -90916 -150718 -120377 -166053 -234182
16624b34182N8553L2881m948n3732j5924n5984J42164J43724Q5245P7003q310
$$ -234182 -175629 -142748 -147696 -201428 -217352 -273336 -131172 12552 97797 174800 166490
16613A66490j03125M4356N1500R8052n9919j49204J2360j3483p3303L9024q0976
$$ 166490 63365 107721 159221 257273 197354 48150 60510 47027 -26276 12748 -68228
16602f8228J8238j42933n1123R2764N1238M3640q5426K3410R9683j4707J35478
$$ -68228 -49990 -192923 -244046 -151282 -100044 -56404 -141830 -118420 -18737 -33444 102034
16591A02034O1636o6025j84682l7279O5388Q3290K1058J7121O7530k2772O258
$$ 102034 163670 97645 -87037 -124316 -58928 24362 45420 62541 130071 107299 113557
16580A13557k7600j2365j10935J2549J28863N5217m4952o3699L2057j38171r0532
$$ 113557 85957 73592 -37343 -24794 104069 159286 114334 50635 82692 -55479 -146011
16569a46011K8689P3533J56414P5881n4165q6905M9227J01393L9369p9786o3755
$$ -146011 -117322 -43789 112625 188506 134341 47436 96663 198056 237425 157639 93884
16558I3884n2355j76625p6691m3480r6485m8178O1327J09129J22007J34409O2077
$$ 93884 41529 -135096 -211787 -255267 -351752 -399930 -338603 -229474 -107467 26942 89019
16547H9019j2423m2377J3644M0384n358r1528o4132O2143l7845K0581N0669p3511
$$ 89019 76596 34219 47863 88247 82889 -8639 -72771 -10628 -48473 -27892 22777 -50734
16535e0734k8344n3780l8455j57155j8097J62213R1098J28926P600j43925j9066
$$ -50734 -79078 -132858 -171313 -328468 -346565 -184352 -93254 35672 43272 -100653 -119719
16524a19719J37558K2615j10494p2214j19336R3691N8391l6954j4819k1316r1236
$$ -119719 17839 40454 -70040 -142254 -261590 -167899 -109508 -146462 -161281 -182597 -273833
16513b73833n0340J94121K932o7383Q5298j6302k8683n9827J03831J71695j03574
$$ -273833 -324173 -130052 -127120 -194503 -109205 -125507 -154190 -214017 -110186 61509 -42065
16502d2065q0821r9757R484R6886Q8049l714j0953J11125K7602m2172L9149J52872
$$ -42065 -122886 -222643 -213159 -116273 -28224 -31938 -42891 68234 95836 53664 92813 245685
16490B45685m7020q1041L3002j66189j96364J54795J29502k9533q2509l5199J12107
$$ 245685 198665 117624 150626 -15563 -211927 -57132 72370 42837 -39672 -74871 37236
16479C7236J4461o3327q7574M5777J44973J24538J2395m9330k05250j17581N0644
$$ 37236 51697 -11630 -99204 -53427 91546 216084 228479 179149 -26101 -143682 -93038
16468i3038j39607q3171R6658J49976j4544N1903J08270p7857n6660k8334N0561
$$ -93038 -232645 -315816 -219158 -69182 -83726 -31823 76447 -1410 -58070 -86404 -35843
16457c5843P0023j20158p0099R2629J72467J07522q6513n0056K5050J24837l7910
$$ -35843 34180 -85978 -156077 -63448 109019 216541 130028 79972 105022 229859 191949
16446A91949j78476j06785p3634j0037J45727o3877L0121O139j21041l377Q8252
$$ 191949 13473 -93312 -166946 -176983 -31256 -95133 -65012 -58873 -179914 -183291 -95039
16435i5039n448Q6499J04540j3976K7290p0438q5086j1998N904J7125N9618j23308
$$ -95039 -100487 -13988 90552 76576 103866 33428 -51658 -63656 -57752 -40627 18991 -104317
16423a04317j9528J36248R3955q3268N901k7023j0114J93248N7593k10718j70874
$$ -104317 -123845 12403 106358 23090 28991 1968 -8146 185102 242695 31977 -138897
16412a38897n170K3748j12193l3306J44718L9772L2074o0068J7624o3508J6116
$$ -138897 -144067 -120319 -232512 -265818 -121100 -81328 -49254 -109322 -91698 -155206 -139090
16401a39090o3498O095J36636J43297j43088r1975Q0916n4932l2285O5518J48833
$$ -139090 -202588 -196493 -59857 83440 -59648 -151623 -70707 -125639 -157924 -92406 56427
16390E6427M8895k1413L1789j5123m3936M451k21904j59573j922L3902J33042
$$ 56427 105322 83909 115698 100575 56639 61090 -160814 -320387 -322309 -288407 -155365
16379a55365R2492k1963o3129j20619J06248K06621J3905O5562p2445j09285l2706
$$ -155365 -62873 -84836 -147965 -268584 -162336 44285 58190 123752 51307 -57978 -90684
16368i0684Q5654J26947K9633l1805n9821j11653r915J61585l9929j96556P6531
$$ -90684 -5030 121917 151550 119745 59924 -51729 -61644 99941 60012 -136544 -60013
16357f0013K6787L6521o2149j94535k2688k4077Q0923K8457M1444P5594k7517
$$ -60013 -33226 3295 -58854 -253389 -276077 -300154 -219231 -190774 -149330 -73736 -101253
16346a01253j45813P4641O4705J7297p6597n0571J05102P2948K3176K0061k4487
$$ -101253 -247066 -172425 -107720 -90423 -167020 -217591 -112489 -39541 -16365 3696 -20791
16335b0791O070K1215m8795N6879Q2922R697k0912j94358k48378O0922P8573J17926
$$ -20791 -14721 6494 -42301 14578 97500 107197 86285 -108073 -356451 -295529 -216956 -99030
16323i9030P8868J50917L3306P7363M3333j16514k29855l9088L5903J19747J0711
$$ -99030 -20162 130755 164061 241424 284757 168243 -61612 -100700 -64797 54950 65661
16312F5661J0555Q9266M0545p144K0606l0460n7357n5224p4362J33961J39519
$$ 65661 76216 165482 206027 198883 219489 189029 131672 76448 2086 136047 275566
16301B75566j60153J9918K11874L7149k47080j60133q808K1472q4910o9915o851
$$ 275566 115413 135331 347205 384354 137274 -22859 -31667 -10195 -95105 -165020 -171871
16290a71871r202j66812P9009J31111J37656n3427m5967N6080k7856k6080j01846
$$ -171871 -181073 -347885 -268876 -137765 -109 -53536 -99503 -43423 -71279 -97359 -199205
16279a99205J9766K3383k9966k6665O6588j13130M7967R4491J25810M9666k4089
$$ -199205 -179439 -156056 -186022 -212687 -146099 -259229 -211262 -116771 9039 58705 34616
16268C4616j09161p0165L3404P7401k9601m5942J9256l2474k7691J7004q0167
$$ 34616 -74545 -144710 -111306 -33905 -63506 -109448 -90192 -122666 -150357 -133353 -213520
16257b13520J6303n0588N7082l1881o237Q1756p9832q2090J74483R2723N5117
$$ -213520 -197217 -247805 -190723 -222604 -228841 -147085 -226917 -309007 -134524 -41801 13316
16246A3316j6592m7787k4327P7042J03259J22233n3040M3837R2117m133k19752
$$ 13316 -3276 -51063 -75390 1652 104911 227144 174104 217941 310058 305925 86173
16235H6173j54118r0922Q7670J12579L0657p029m2415M2961J0858k5247l5260
$$ 86173 -67945 -158867 -71197 41382 72039 65010 22595 65556 76414 51167 15907
16224A5907l02k8332k8075M4695q8977K8918R7854m0520j32453j03413m9307M0059
$$ 15907 15605 -12727 -40802 3893 -85084 -56166 41688 1168 -131285 -234698 -284005 -243946
16212b43946l2520J50370L8127n0110p389R6568J41201j15465q5765P7934P5356
$$ -243946 -276466 -126096 -87969 -138079 -145468 -48900 92301 -23164 -108929 -30995 44361
16201D4361j3791r9915K5990n8505k0249l5136K1844K82750J40225p7113k5917
$$ 44361 30570 -69345 -43355 -101860 -122109 -157245 -135401 147349 287574 210461 184544
16190A84544p3186q6688l1433J6910O0879r3184L4830J13648O9533j06951j8183
$$ 184544 111358 24670 -6763 10147 71026 -22158 12672 126320 195853 88902 70719
16179G0719j46642j21857J48878N6532r4069K4017R6303r5239k2365Q991q4142
$$ 70719 -75923 -197780 -48902 7630 -86439 -62422 33881 -61358 -83723 -74732 -158874
16168a58874o5643N7395Q6979p5P4900J32756l5547j09615r3568m2106L1156J27100
$$ -158874 -224517 -167122 -80143 -80218 -5318 127438 91891 -17724 -111292 -153398 -122242 4858
16156D858J13599m2535r7637j51971J13051M4548l3920k8781p1603O8171Q2239
$$ 4858 118457 75922 -21715 -173686 -60635 -16087 -50007 -78788 -150391 -82220 19
16145A9M1861M2026m9132K3263n33K1584j7330k4815L9040m0134o1204n4381J46605
$$ 19 41880 83906 34774 58037 57504 79088 61758 36943 75983 35849 -25355 -79736 66869
16132F6869q0707j38294J08491R387M3605L7984O2362j76929q4253J65394O2340
$$ 66869 -13838 -152132 -43641 -34254 9351 47335 109697 -67232 -151485 13909 76249
16121G6249P3090J36053P4740j38938j46975m5643n4020Q2997m336N4830J13237
$$ 76249 149339 285392 360132 221194 74219 28576 -25444 57553 53217 108047 221284
16110B21284O9478j22360m9611K3642q496M9216r2417j06191K4359n1191p3471
$$ 221284 290762 168402 118791 142433 133937 183153 90736 -15455 8904 -42287 -115758
16099a15758J9672N1280K6380q7305k5104N0070J4910J4801J00920J29727P188
$$ -115758 -96086 -44806 -18426 -105731 -130835 -80765 -65855 -51054 49866 179593 186781
16088A86781j2448j23676P2422p391r6677j30903J36316P914m2337p1997m0714
$$ 186781 174333 50657 123079 115688 19011 -111892 24424 32338 -9999 -81996 -122710
16077a22710m3165M3989R5714Q9565j55639q6264J05008p740k3289m5065L8593
$$ -122710 -165875 -121886 -26172 63393 -92246 -178510 -73502 -81242 -104531 -149596 -111003
16066a11003Q0344M8370k6939Q4921p5486P0598J45153O2869k4610j14686q0429
$$ -111003 -30659 17711 -9228 75693 207 70805 215958 278827 254217 139531 59102
16055E9102r095l6274j237n8214p0423J0998n5418k0731J08354K614L1673J1961
$$ 59102 50007 13733 12496 -45718 -116141 -105143 -160561 -181292 -72938 -70324 -38651 -26690
16043b6690j48739j04027J8255J17840J46528P7194j15086j22412O873J22955
$$ -26690 -175429 -279456 -261201 -143361 3167 80361 -34725 -157137 -150264 -27309
16033b7309J34818p3282o3842k03783r3845J64143N0539J34623o236P6310K3817
$$ -27309 107509 34227 -29615 -233398 -327243 -163100 -112561 22062 15826 92136 115953
16022A15953N7707P6161j25979j49851k8952l7010k2956J5460K07141L4237p3854
$$ 115953 173660 249821 123842 -26009 -54961 -91971 -114927 -99467 107674 141911 68057
16011F8057j15602P7250k8332m7760k1339q0898j4976L8686p891p6613k5078J33559
$$ 68057 -47545 29705 1373 -46387 -67726 -148624 -163600 -124914 -132805 -209418 -234496 -100937
15999a00937J5946n208Q9884M0826j25881j32020J61240J76787l6862o8499o8086
$$ -100937 -84991 -90199 -315 40511 -85370 -217390 -56150 120637 83775 15276 -52810
15988e2810J1058Q1728q293q1977j11005R2157P8259q9417m4684P7372k0394q3809
$$ -52810 -41752 39976 31683 -50294 -161299 -69142 9117 -80300 -124984 -47612 -68006 -151815
15976a51815m7297J0502k570O6889J74282j0993o3492o8399j59747J8032N6298
$$ -151815 -199112 -188610 -191180 -124291 49991 38998 -24494 -92893 -252640 -234608 -178310
15965a78310k4999o813L6012Q0430Q1868j9711j61240N7120M0770k25921l1570
$$ -178310 -203309 -210122 -174110 -93680 -11812 -31523 -192763 -135643 -94873 -320794 -352364
15954c52364O6813J37332M2987J36403J2607j30908K7175N370j28041p3751L610
$$ -352364 -285551 -148219 -105232 31171 43778 -87130 -59955 -54585 -182626 -256377 -252767
15943b52767J19791J4934o7846K9691K03629O5755j26278L2993N2232M8199J57191
$$ -252767 -132976 -118042 -185888 -156197 47432 113187 -13091 19902 72134 120333 277524
15932B77524j79559j16892O4101L7513j06762p744J36716p9425L2856j4766j50716
$$ 277524 97965 -18927 45174 82687 -24075 -31819 104897 25472 58328 43562 -107154
15921a07154m8638q5026j26648K3969q5049Q7817O9744Q7295q444j0448j08369
$$ -107154 -155792 -240818 -367466 -343497 -428546 -340729 -270985 -183690 -192134 -202582 -310951
15910c10951R9013m4991O3709O0093L5736P4238m1125l7381R7189L1266j00817
$$ -310951 -211938 -256929 -193220 -133127 -97391 -23153 -64278 -101659 -4470 26796 -74021
15899g4021k8572k88L3382k3742r2878M304Q8968Q2730L1921j6989l195p5226
$$ -74021 -102593 -102881 -69499 -93241 -186119 -181815 -92847 -10117 21804 4815 1620 -73606
15887g3606o6660l2252N9651J70999N5861q5073n3006j5582J3639K8177J13698
$$ -73606 -140266 -172518 -112867 58132 113993 28920 -24086 -39668 -26029 2148 115846
15876A15846L3758k4319j36368M1402K9704O8129R5351L3338j47046k01256j65466
$$ 115846 149604 125285 -11083 30319 60023 128152 223503 256841 109795 -91461 -256927
15865b56927R1555K42792N2737j24549q8132p3409K6229J21002J33110L4213m2114
$$ -256927 -165372 77420 130157 5608 -82524 -155933 -129704 -8702 124408 158621 116507
15854A16507j18271p042K7239q7437r7568P1179K06131Q6902K4033m6720j03065
$$ 116507 -1764 -8806 18433 -69004 -166572 -95393 110738 197640 221673 174953 71888
15843G1888j8006l1117p069L7642j7000j18245J70760J71088r3861j22043j40285
$$ 71888 53882 22765 15696 53338 36338 -81907 88853 259941 166080 44037 -96248
15832i6248M9551P0020k7088O5644J6877r266O6056m2207j11652O6025J24382
$$ -96248 -46697 23323 -3765 61879 78756 69490 135546 93339 -18313 47712 172094
15821A72094J59679O54k51105j10770j1208k0133J2581Q4097p5255n6287l436
$$ 172094 331773 332427 81322 -29448 -40656 -60789 -48208 35889 -39366 -95653 -99089
15810i9089K0639Q5891n1606j8535r1629N6438k03739l5639J14756J05882l4420
$$ -99089 -78450 7441 -44165 -62700 -154329 -97891 -301630 -337269 -222513 -116631 -151051
15799a51051K0631O36k8183l6263Q3343N1954o1592J1000Q5158l5926N9162K7540
$$ -151051 -130420 -129784 -157967 -194230 -110887 -58933 -120525 -109525 -24367 -60293 -1131 26409
15787B6409N0668L9197j25549j13551K1146M4777o4112L0389J33382J321k5243
$$ 26409 77077 116274 -9275 -122826 -101680 -56903 -121015 -90626 42756 44077 18834
15776A8834O6653j01628n4895K6871m5061M6585J2484R2652n9615n0833m2225
$$ 18834 85487 -16141 -71036 -44165 -89226 -42641 -30157 62495 2880 -47953 -90178
15765i0178m5541q1222J31776Q8068O0576P3651j36785j42856k4858P7869J19272
$$ -90178 -135719 -216941 -85165 2903 63479 137130 345 -142511 -167369 -89500 29772
15754B9772O3545J8118j23760o298N9850q4048p9008r9804q420Q0351R9213k0077
$$ 29772 93317 111435 -12325 -18623 41227 -42821 -121829 -221633 -230053 -149702 -50489 -70566
15742g0566J6357p3545n2998J3778R3508Q3476J80322J32631n0739j29836o3190
$$ -70566 -54209 -127754 -180752 -166974 -73466 10010 190332 322963 272224 142388 79198
15731G9198r2099L0173L4202p9333m3701j9165J1855j1725o9265q369J41656K6215
$$ 79198 -12901 17272 51474 -27859 -71560 -90725 -78870 -90595 -159860 -168229 -26573 -358
15719c58j277k7565j33788j9125N8697N4961o144L7941k978m9335n7780M4063
$$ -358 -1635 -29200 -162988 -182113 -123416 -68455 -74599 -36658 -39636 -88971 -146751 -102688
15707a02688R3722m2950q3872K8572J13517J94600j63044P1660J97311o8975m9158
$$ -102688 -8966 -51916 -135788 -107216 6301 200901 37857 109517 306828 237853 188695
15696A88695r8812q9567j29385J14382k7927M5280l1530j9182N4767K3717K0130
$$ 188695 89883 316 -129069 -14687 -42614 2666 -28864 -48046 6721 30438 50568
15685E0568j0438j50660q9762O2526M6271K7831J5723K5567j592n7782n1755k799
$$ 50568 40130 -110530 -200292 -137766 -91495 -63664 -47941 -22374 -23966 -81748 -133503 -136302
15673a36302j51074o8249Q3904J12589P8316O5983J4832P5464K21893J83572m5519
$$ -136302 -287376 -355625 -271721 -159132 -80816 -14833 -1 75463 297356 480928 435409
15662D35409j59086k11688m2924M1984L94n1500k8194L3795O38R8305M858j5613
$$ 435409 276323 64635 21711 63695 64089 12589 -15605 18190 18828 117133 121991 106378
15650A06378k3416Q3486O2288o8922M109j17623p8927R2809N8496L3893j6257
$$ 106378 82962 166448 228736 159814 163923 46300 -32627 60182 118678 152571 136314
15639A36314j34390j08718n6445O1284R4663J04927L3348P7374k6846r6566k1231
$$ 136314 1924 -106794 -163239 -101955 -7292 97635 130983 208357 181511 84945 63714
15628F3714l4893r089o105l2155l2618m1845j42146J07689J82809O8988n8130
$$ 63714 28821 19732 13627 -18528 -51146 -92991 -235137 -127448 55361 124349 66219
15617F6219q354J6206o677J23672j67326r1212M4599j10276r0670j354K01836
$$ 66219 57865 74071 67394 191066 23740 -67472 -22873 -133149 -223819 -225173 -23337
15606b3337m1050l3636J1181p8346n4918Q5278M976j01944j10839N3000J67298
$$ -23337 -64387 -98023 -86842 -165188 -220106 -134828 -129852 -231796 -342635 -289635 -122337
15595a22337K54900p922j9506k8196N8732q8267p8732k0598Q4820j09682L3581
$$ -122337 132563 124641 105135 76939 135671 47404 -31328 -51926 32894 -76788 -43207
15584d3207K47133o748O1059r4146j47326k4918N8662p2280l392j5359p0407O5226
$$ -43207 203926 197178 258237 164091 16765 -8153 50509 -21771 -25163 -40522 -110929 -45703
15572d5703L5333j02525m4033J0596L7592R4719q7646k2304N4824K4440J47468
$$ -45703 -10370 -112895 -156928 -146332 -108740 -14021 -101667 -123971 -69147 -44707 102761
15561A02761l2789j37948n2111k2778k5637m8988p7798j04065p6266J71238J78314
$$ 102761 69972 -67976 -120087 -142865 -168502 -217490 -295288 -399353 -475619 -304381 -126067
15550a26067O1017n39K7211P7343P7420n0418k02491K6972J84587L234O1616j8182
$$ -126067 -65050 -65589 -38378 38965 116385 65967 -136524 -109552 75035 78269 139885 121703
15538A21703k3511j15800j02187L5602J6979n7973M6462K4584J5541j7102r1779
$$ 121703 98192 -17608 -119795 -84193 -67214 -125187 -78725 -54141 -38600 -55702 -147481
15527a47481q8908O8417J165K7713O1509K113o3690m9973J25685k9407K5905J02300
$$ -147481 -236389 -167972 -166807 -139094 -77585 -75472 -139162 -189135 -63450 -92857 -66952 35348
15515C5348J2956J24046l7546j17574j41992L2374q5K3485J20373j8763j11776
$$ 35348 48304 172350 134804 17230 -124762 -92388 -92473 -68988 51385 32622 -79154
15504g9154j29562J93133m370j75521L1183N8503l3619L336j5870k32484n851
$$ -79154 -208716 -15583 -19953 -195474 -164291 -105788 -139407 -136071 -151941 -384425 -390276
15493c90276K32432J37116Q6204r0851r6006j57186j2494M1713J13573o5386M2987
$$ -390276 -157844 -20728 65476 -25375 -121381 -278567 -291061 -249348 -135775 -201161 -158174
15482a58174R2402J38917Q4571L6044r3380n9827l1242l2499J0963l2593k356
$$ -158174 -65772 73145 157716 193760 100380 40553 9311 -23188 -12225 -44818 -47174
15471d7174K3076K7897M1026r1673o9548p6214J07233M9579p445R6681P0394j41186
$$ -47174 -24098 3799 44825 -46848 -116396 -192610 -85377 -35798 -43243 53438 123832 -17354
15459a7354l0857r6656k9006O244N0359K576j0424P613M1021K9160J5114l3151
$$ -17354 -48211 -144867 -173873 -167629 -117270 -114694 -125118 -117505 -76484 -47324 -32210 -65361
15447f5361j19418l1591L1865J18434O6219r2303j30505J11683J08053m5336o4621
$$ -65361 -184779 -216370 -184505 -66071 148 -92155 -222660 -110977 -2924 -48260 -112881
15436a12881r3159L4453O7854m3721n7027j1210J19807N5087m6822p143l8377
$$ -112881 -206040 -171587 -103733 -147454 -204481 -215691 -95884 -40797 -87619 -94762 -133139
15425a33139q260K6948J07960k4219n9943R9378K15329P8845j18526j24251r5197
$$ -133139 -141399 -114451 -6491 -30710 -90653 8725 224054 302899 184373 60122 -35075
15414c5075J6228L246K456J7062j29497r2390N2909n4978J01918P6031l2794q9584
$$ -35075 -18847 -15601 -13145 3917 -125580 -217970 -165061 -220039 -118121 -42090 -74884 -164468
15402a64468q9297K9139J52503J36199n8105j34581j08083Q4602O8593J25790
$$ -164468 -253765 -224626 -72123 64076 5971 -128610 -236693 -152091 -83498 42292
15392D2292L2159q8354J29290J02546p79l1528Q426j48912r1397r8927R2255K42122
$$ 42292 74451 -13903 115387 217933 217154 185626 194052 45140 -46257 -145184 -52929 189193
15380A89193n0500j70978j17271m5225O9977L3324k0175Q865j2438J11327N7959
$$ 189193 138693 -32285 -149556 -194781 -124804 -91480 -111655 -102790 -115228 -3901 54058
15369E4058J4962K6757J3982m9435q9806L9343p410K9439L9385q293N7242J03460
$$ 54058 69020 95777 109759 60324 -29482 9861 2451 31890 71275 62982 120224 223684
15357B23684K1894R301n8828j15117j52677n220J03871k8293r9630L6633o5321
$$ 223684 245578 254879 196051 80934 -71743 -76963 26908 -1385 -101015 -64382 -129703
15346a29703j04557K4448K0702N0063J29334m2331R5413m7675j7474L3904K3682
$$ -129703 -234260 -209812 -189110 -139047 -9713 -52044 43369 -4306 -21780 12124 35806
15335C5806p1106p0144q7645j6100N8947N354r06O0210J50220m5836M2094o6084
$$ 35806 -35300 -105444 -193089 -209189 -150242 -144888 -145794 -85584 64636 18800 60894 -5190
15323e190j43056J6398J01964p3753N0763L203o2923P6262J09755k6220R6721
$$ -5190 -148246 -131848 -29884 -103637 -52874 -49671 -112594 -36332 73423 47203 143924
15312A43924j9930j11842J6990m0746j0113M5235l5035L6992r1760l8921R5222
$$ 143924 123994 12152 29142 -11604 -21717 23518 -11517 25475 -66285 -105206 -9984
15301i984R5908j43816n9662J10907P8951k587R0854p9455o9288K2757q510n7572
$$ -9984 85924 -57892 -117554 -6647 72304 69717 160571 81116 11828 34585 26075 -31497
15289c1497j17460N4834J41841j52124j02427O1464O1323J7294J01118K4107o1752
$$ -31497 -148957 -94123 47718 -104406 -206833 -145369 -84046 -66752 34366 58473 -3279
15278c279k9513j00078M1727J7119q64R156J17209M1354P711J0950j1819j14851
$$ -3279 -32792 -132870 -91143 -74024 -74888 -65732 51477 92831 100542 111492 99673 -15178
15266a5178M1380K2550k9771m336K09519M0819q6430j32457M241O4198L2489n1398
$$ -15178 26202 48752 18981 14645 224164 264983 178553 46096 50337 114535 147024 95626
15254I5626L705o4568L4926k3826p5495j02992j1874M3307P787j0091K10136l2177
$$ 95626 99331 34763 69689 45863 -29632 -132624 -144498 -101191 -93404 -103495 106641 74464
15242G4464j18690r1453l148J01473K1203o457j3150O0764n5131Q4099J13494
$$ 74464 -44226 -135679 -138827 -37354 -16151 -22608 -35758 25006 -30125 53974 167468
15231A67468K7719j97748J3711p51j49542r8026J52438J34969J13096J8944n1539
$$ 167468 195187 -2561 11150 10399 -139143 -237169 -84731 50238 163334 182278 130739
15220A30739l1628L0505j23063J1037Q071r1540O1716J88105j07008j06386n1437
$$ 130739 99111 129616 6553 17590 25661 -65879 -4163 183942 76934 -29452 -80889
15209h0889P779K96663O5324p7967P7758M2339n4532n5203j4595o0017p6778q1338
$$ -80889 -73110 223553 288877 210910 288668 331007 276475 221272 206677 146660 69882 -11456
15197a1456k0394k7165O5645N6454k4776Q7315Q7779j54164r8248M8052J77370
$$ -11456 -31850 -59015 6630 63084 38308 125623 213402 59238 -39010 9042 186412
15186A86412k973n6330l192r5526j19285o9765k86n2517N3520n55j08629P7848
$$ 186412 183439 127109 123917 28391 -90894 -160659 -160945 -213462 -159942 -160497 -269126 -191278
15174a91278Q235L5080p4054L2002J92070k6020n4843l5747N3942P9429K831J5705
$$ -191278 -183043 -147963 -222017 -190015 2055 -23965 -78808 -114555 -60613 18816 21647 37352
15162C7352r2048l6003J35102M4655n0445P853J30323P6328j23381M823j0632
$$ 37352 -54696 -90699 44403 89058 38613 46466 176789 253117 129736 134559 123927
15151A23927N257J03175N5057m6467q6290q7758q0999n2322P8883L078L9403j44348
$$ 123927 129184 232359 287416 240949 154659 66901 -14098 -66420 12463 15541 54944 -89404
15139h9404m943Q1175J05176N5090r1361q0887j03886Q565J01751O7940r839l6120
$$ -89404 -94347 -13172 92004 147094 55733 -25154 -129040 -120475 -18724 49216 39377 3257
15127C257j92270l7306L3720K1965j3067N1011J30059m8561j03273Q8960N3114
$$ 3257 -189013 -226319 -192599 -170634 -183701 -132690 -2631 -51192 -154465 -65505 -12391
15116a2391M9363L4402p6092K1438J05500j12815l9590j23215K2992J5154O8424
$$ -12391 36972 71374 -4718 16720 122220 9405 -30185 -153400 -130408 -115254 -46830
15105d6830J05218J2694n6012J37752o6876k01114L6341k8487L0131j3178l7993
$$ -46830 58388 71082 15070 152822 85946 -115168 -78827 -107314 -77183 -90361 -128354
15094a28354O7163J21708J4590r6284m2857n2828J09189J4291Q038l9901n4175
$$ -128354 -61191 60517 75107 -21177 -64034 -116862 -7673 6618 14656 -25245 -79420
15083g9420J26818J11297q856j25000m3559J22580n6400j17013k7230l7540K51714
$$ -79420 47398 158695 149839 24839 -18720 103860 47460 -69553 -96783 -134323 117391
15072A17391p5421j021L6200O2577M534N9123J17297m96j37269m4003k1701Q1086
$$ 117391 41970 40949 77149 139726 144260 203383 320680 320184 182915 138912 117211 198297
15060A98297K9538j2057n8074j09772q1834p9319o6167j37030m1474K1754J49359
$$ 198297 227835 215778 157704 47932 -33902 -113221 -179388 -316418 -357892 -336138 -186779
15049a86779R8675M0670J6477r2693n2250J29600P7709n2488m3514p9929L6255
$$ -186779 -88104 -47434 -30957 -123650 -175900 -46300 31409 -21079 -64593 -144522 -108267
15038a08267J04544j8393p9960k2122Q2059J64399O2576o8135p4600l0388n4587
$$ -108267 -3723 -22116 -102076 -124198 -42139 122260 184836 116701 42101 11713 -42874
15027d2874J8506n8879K9797N7046K2931J04503k2411m8834m2943k1638j8090
$$ -42874 -24368 -83247 -53450 3596 26527 131030 108619 59785 16842 -4796 -22886
15016b2886k1166l9277J53687P0425p1340j18418l1732j1307o3875J9456J05400
$$ -22886 -44052 -83329 70358 140783 69443 -48975 -80707 -92014 -155889 -136433 -31033
15005c1033J09902K4936m8984k7629k21216J11703J84614p7714j56270o5748Q3257
$$ -31033 78869 103805 54821 27192 -194024 -82321 102293 24579 -131691 -197439 -114182
14994a14182J30730m9353J7121N0594J35278m3332q3747j87367Q923J22033N546
$$ -114182 16548 -32805 -15684 34910 170188 126856 43109 -144258 -135335 -13302 -7756
14983g756m3904j87961n5556N0510J57357K81474k63r2473N1990J43649m4739
$$ -7756 -51660 -239621 -295177 -244667 -87310 194164 193901 101428 153418 297067 252328
14972B52328k22105j05911l453P0167p7821L2984K0374J59178O4564j7204p5312
$$ 252328 30223 -75688 -79141 -8974 -86795 -53811 -33437 125741 190305 173101 97789
14961I7789P4679Q983J8949m40n0211q4583P9641O7336M7594j28370j1947o4443
$$ 97789 172468 181451 200400 199960 149749 65166 144807 212143 259737 131367 119420 54977
14949E4977r9537p6823j6580K2445m231N6696q1513J58083L7632M9663N8738o9046
$$ 54977 -44560 -121383 -137963 -115518 -119749 -63053 -144566 13517 51149 100812 159550 90504
14937I0504j29216m2832o8543K5676l3833J25740J76331p1534m322j2535j41366
$$ 90504 -38712 -81544 -150087 -124411 -158244 -32504 143827 72293 67971 55436 -85930
14926h5930J5706N833p7806O459j8712J35647J41596J2903l7252m8684K3675j42581
$$ -85930 -70224 -64391 -142197 -135738 -154450 -18803 122793 135696 98444 49760 73435 -69146
14914f9146k461m9121l6926l4642M0197J44674j3969p4125p9183j38092M7150
$$ -69146 -71607 -120728 -157654 -192296 -152099 -7425 -21394 -95519 -174702 -312794 -265644
14903b65644J87359M6257P6374Q2660r095M4079l3364j53578l756n0307j4330
$$ -265644 -78285 -32028 44346 127006 117911 161990 128626 -24952 -28708 -79015 -93345
14892i3345K8551k4210J33363j2908k2839j31015R8768p9609j08329Q46n5423
$$ -93345 -64794 -89004 44359 31451 8612 -122403 -23635 -103244 -211573 -210727 -266150
14881b66150N0499K3043M9547K9100m1619P987J79779J17538r350R6284r4010
$$ -266150 -215651 -192608 -143061 -113961 -155580 -147593 32186 149724 140374 236658 142648
14870A42648j97249n4691p7067O8328Q0596Q8617o1986M3179j2130L0255k04064
$$ 142648 -54601 -109292 -186359 -118031 -37435 51182 -10804 32375 20245 50500 -153564
14859a53564k8066P7921N4831J0417M0294J4009m6269k0667o032K9757J41189
$$ -153564 -181630 -103709 -48878 -38461 1833 15842 -30427 -51094 -57126 -27369 113820
14848A13820M2960o723j66041m0474l3577L3378L3656K5177O0857P7196m2494
$$ 113820 156780 150057 -15984 -56458 -90035 -56657 -23001 2176 63033 140229 97735
14837I7735m7186O3810o3048l6262J30325m7811j6569m6263k4819J36333N8968
$$ 97735 50549 114359 51311 15049 145374 97563 80994 34731 9912 146245 205213
14826B05213m426j3951p7663n9484J8568k782M4142j34408j94188M1179K09896
$$ 205213 200787 186836 109173 49689 68257 65475 109617 -24791 -218979 -177800 32096
14815C2096P0187k3023j1132j1846o3421l8307q2007m878P7702P1697j8959J2828
$$ 32096 102283 79260 68128 56282 -7139 -45446 -127453 -132331 -54629 17068 -1891 10937
14803A0937M2163k8359n4205j40273k3130j2894L3611J10276N1443q2958Q6615
$$ 10937 53100 24741 -29464 -169737 -192867 -205761 -172150 -61874 -10431 -93389 -6774
14792f774L2810n9192P457J09521j0453Q5783L6261J0260r8768O5356L3879j48785
$$ -6774 26036 -33156 -25699 83822 73369 159152 195413 205673 106905 172261 206140 57355
14780E7355l4258J2121k314j58475n4824m1403l2078P5633J24525L0417m7414
$$ 57355 23097 35218 32904 -125571 -180395 -221798 -253876 -178243 -53718 -23301 -70715
14769g0715O5784O3305j03977l312P777j2743K9192j6465r42j6250r798P931J07322
$$ -70715 -4931 58374 -45603 -48915 -41138 -53881 -24689 -41154 -42096 -58346 -68144 -60213 47109
14756D7109J22971j26328r2651j35539n6366J07781L4589J10508J35744j68478
$$ 47109 170080 43752 -48899 -184438 -240804 -133023 -98434 12074 147818 -20660
14746b0660p7493k8367L8991L2005j38632j9072L7074L3321Q1943N9725J0535
$$ -20660 -98153 -126520 -87529 -55524 -194156 -213228 -176154 -142833 -60890 -1165 9370
14735I370n7350K7902j10693K915J52950P4080o9527r0305j01672J11870k9181
$$ 9370 -47980 -20078 -130771 -127856 25094 99174 29647 -60658 -162330 -50460 -79641
14724g9641q3448Q4593J61051J23019k6113n6530p4713O892R468r2930l4436p8649
$$ -79641 -163089 -78496 82555 205574 179461 122931 48218 55110 64578 -28352 -62788 -141437
14712a41437q0615J50676J72549j1034j27494r6095J1623R8588P1250M1839o8077
$$ -141437 -222052 -71376 101173 90139 -37355 -133450 -121827 -23239 48011 89850 21773
14701B1773j93801O8275L0795o51j632k3519j68420j15445N5888l7766J62533
$$ 21773 -172028 -103753 -72958 -73609 -75241 -98760 -267180 -382625 -326737 -364503 -201970
14690b01970K4058P6413l0714j01867m203L3786O4852K53018K1564K5404R6824
$$ -201970 -177912 -101499 -132213 -234080 -238283 -204497 -139645 113373 134937 160341 257165
14679B57165l9424j88317j65999K5140N8549O527l3622r6917M015q7193J0519
$$ 257165 217741 29424 -136575 -111435 -52886 -46359 -79981 -176898 -172883 -260076 -249557
14668b49557K36254j3341M0808N9760p5940j40811n6405M8478J39483L4156M1045
$$ -249557 -13303 -26644 14164 73924 -2016 -142827 -199232 -150754 -11271 22885 63930
14657F3930N3287q9502K4094M489q7236N3374N012o9137o919j408J3595L8915
$$ 63930 117217 27715 51809 56298 -30938 22436 27448 -41689 -48608 -50016 -36421 2494
14645B494L0431n5121j03894j35312M5527J5590r2591J35740J85367K8883J06761
$$ 2494 32925 -22196 -126090 -261402 -215875 -200285 -292876 -157136 28231 57114 163875
14634A63875R4583o2580j28230l1430r0781N3904K20177L7992o3824j48648p027
$$ 163875 258458 195878 67648 36218 -54563 -659 219518 257510 193686 45038 38011
14623C8011r830j22637k4271J68171N3542J2130J799k4821j8381k3678R6850J31463
$$ 38011 28181 -94456 -118727 49444 102986 115116 116915 92094 73713 50035 146885 278348
14611B78348p0021j21210j60115q6462K2355J19386O2922J35037L6091o9137L7154
$$ 278348 208327 87117 -72998 -159460 -137105 -17719 45203 180240 216331 147194 184348
14600A84348j8815q7584p8071j44430M2047K34139J30697j14959j27577N8234
$$ 184348 165533 77949 -122 -144552 -102505 131634 262331 147372 19795 78029
14590G8029l2220K2657K3399n0280J19079n2023P689m7535k26685p8650J07201
$$ 78029 45809 68466 91865 41585 160664 108641 116330 68795 -157890 -236540 -129339
14579a29339J35668R6813N1581k0639O3389r1082m8192j22386p521j6707j1189
$$ -129339 6329 103142 154723 134084 197473 106391 58199 -64187 -71708 -88415 -99604
14568i9604J16264N3646j18447j66495o8035J93324J38110l7516R0871P4267l1498
$$ -99604 16660 70306 -48141 -214636 -282671 -89347 48763 11247 102118 176385 144887
14557A44887M4740l9058q8907j76788o344K1480M8724Q3565J4823p3698O061J3221
$$ 144887 189627 150569 61662 -115126 -121470 -99990 -51266 32299 47122 -26576 -20515 -7294
14545g294M8209L9352J01539k3454p0173L6042J0719R7051N1342j41391p4271
$$ -7294 40915 80267 181806 158352 88179 124221 134940 231991 283333 141942 67671
14534F7671P272j2261q8363J04368Q0594O5498j880J56907q8814o9883K7324m9584
$$ 67671 74943 62682 -25681 78687 159281 224779 222899 379806 290992 221109 248433 198849
14522A98849K5135l7630j06476J5651M0639J13154k586j28496l8263J5381M0045
$$ 198849 223984 186354 79878 95529 136168 249322 246736 118240 79977 95358 135403
14511A35403M4332K3304J1737K0579m0870r8870k4894j17158o2399K1425J13797
$$ 135403 179735 203039 214776 235355 194485 95615 70721 -46437 -108836 -87411 26386
14500B6386M8857K3257j21961j36023n3078J20630K14837l7377r2896Q6609J3079
$$ 26386 75243 98500 -23461 -159484 -212562 -91932 122905 85528 -7368 79241 92320
14489I2320j15547K7532Q3639j718M6868k1456J0753L6594p2214m6821Q5916n4686
$$ 92320 -23227 4305 87944 86226 133094 111638 122391 158985 86771 39950 125866 71180
14477G1180l8460J42130J58395M3269l4390j12897M0226k9078R5795j10836N4442
$$ 71180 32720 174850 333245 376514 342124 229227 269453 240375 336170 225334 279776
14466B79776j12322j28225o3403J80679J06799J1524j07819k2983J07372L3476
$$ 279776 167454 39229 -24174 156505 263304 274828 167009 144026 251398 284874
14456B84874k25470j33039m1870M4747Q5136j4684k1116j2712k8364N0417k5684
$$ 284874 59404 -73635 -115505 -70758 14378 -306 -21422 -34134 -62498 -12081 -37765
14445c7765n9918Q0152K47707o3460j59381j58900j79202q862J18045m4454J5616
$$ -37765 -97683 -17531 230176 166716 7335 -151565 -330767 -339629 -221584 -266038 -250422
14434b50422O1127m4379j20378L1323R2440K13979J27411L2554j65489j78233
$$ -250422 -189295 -233674 -354052 -322729 -230289 -16310 111101 143655 -21834 -200067
14424b00067j01110J42228J31402J00001L7791o0979J03130J46955m9286q6429
$$ -200067 -301177 -158949 -27547 72454 110245 49266 152396 299351 250065 163636
14414A63636m7006M3808R092j07293J6264K018q6842l2143q706J27912M7730J8271
$$ 163636 116630 160438 169530 62237 78501 80519 -6323 -38466 -47172 80740 128470 146741
14402A46741N0422l7745j22586j29447l1356M1171J1729N7652J41156m4826p1827
$$ 146741 197163 159418 36832 -92615 -123971 -82800 -71071 -13419 127737 82911 11084
14391A1084p8103O0316J08064r5400q0222j20894m1165J32088k9328j1517p1223
$$ 11084 -67019 -6703 101361 5961 -74261 -195155 -236320 -104232 -133560 -145077 -216300
14380b16300J68163O6741r2169j42872R8650N2598J5453P9211J23974m6958l9355
$$ -216300 -48137 18604 -73565 -216437 -117787 -65189 -49736 29475 153449 106491 67136
14369F7136M1320R8313P0572j25564j24898m9590J19008j44978r8511J28659N1597
$$ 67136 108456 206769 277341 151777 26879 -22711 96297 -48681 -147192 -18533 33064
14358C3064J7369j5978k0031j704p6000J45973J26181J59957j6752k74757j05939
$$ 33064 50433 34455 14424 12720 -63280 82693 208874 368831 352079 77322 -28617
14347b8617J65929n7079k48605j29915K872J17717J91624J20748K8420O9582j10132
$$ -28617 137312 80233 -168372 -298287 -295415 -177698 13926 134674 163094 232676 122544
14336A22544r0216p5914k0336K3961j50377l0341n9381K09481l7081l5647p1541
$$ 122544 32328 -43586 -63922 -39961 -190338 -220679 -280060 -70579 -107660 -143307 -214848
14325b14848j91981l9359K3501K43834N1801R1408n6401n3626J12627j37J28775
$$ -214848 -406829 -446188 -422687 -178853 -127052 -35644 -92045 -145671 -33044 -33181 95594
14314I5594M767n3754L3803O4990k7372r9105M5254l937j32108R4071P1962j12029
$$ 95594 100361 46607 80410 145400 118028 18923 64177 60240 -71868 22203 94165 -17864
14302a7864j35460J03903N8615k9295M5844j7196j38214R1520J18673j79699j36237
$$ -17864 -153324 -49421 9194 -20101 25743 8547 -129667 -38147 80526 -99173 -235410
14291b35410O2951J23540L8993o0746K7379N9365j2481j7899P2146O8131m6562
$$ -235410 -172459 -48919 -9926 -70672 -43293 16072 3591 -14308 57838 125969 79407
14280G9407m0860l2042l4609O067k7204r0094q5885P3600P5463L048p0556j2213
$$ 79407 38547 6505 -28104 -22037 -49241 -139335 -225220 -151620 -76157 -73109 -143665 -155878
14268a55878K1366R9588O6127q5298l3476j87375r8829J76012J85912R401p7016
$$ -155878 -134512 -34924 31203 -54095 -87571 -274946 -373775 -197763 -11851 -2450 -79466
14257g9466J13345J1935J2536J09321K8075j81977K7263j8421K8598R1258R1571
$$ -79466 33879 45814 58350 167671 195746 13769 41032 22611 51209 142467 234038
14246B34038n2129j40858P2079o0818l427J79446R7577k709p7888m0129k63208
$$ 234038 181909 41051 113130 52312 48885 228331 325908 323199 245311 205182 -58026
14235e8026j03521Q9692J6582J26394m0328o2569P2136P9296r730j3328J6214
$$ -58026 -161547 -71855 -55273 71121 30793 -31776 40360 119656 109926 96598 112812
14224A12812L1053m5705j32626K6794j7052j07189M3859P4152K7886r7754J7219
$$ 112812 143865 98160 -34466 -7672 -24724 -131913 -88054 -13902 13984 -83770 -66551
14213f6551M3051N3865l7533K4936N2067L4058j66872j27050L2571O3009J09831
$$ -66551 -23500 30365 -7168 17768 69835 103893 -62979 -190029 -157458 -94449 15382
14202A5382r1595m2673J9120m8420J10112J79451N6361k6203r5445J5957M0621
$$ 15382 -76213 -118886 -99766 -148186 -38074 141377 197738 171535 76090 92047 132668
14191A32668p7769j79685j62360J05431r4967M5643K27435m5045r1777K1963Q6898
$$ 132668 54899 -124786 -287146 -181715 -276682 -231039 -3604 -48649 -140426 -118463 -31565
14180c1565P9289R5980K5601k03256k00047J9841J50678Q1848p5138k2983M6672
$$ -31565 47724 143704 169305 -33951 -233998 -214157 -63479 18369 -56769 -79752 -33080
14169c3080R589Q8382J16290J7532m6295j24529o4954j64868O2J94450K6935m1465
$$ -33080 -23491 64891 181181 198713 152418 27889 -37065 -201933 -201871 -7421 19514 -21951
14157b1951M3816J45543P1041m8212n9712l2444Q3868m4559L2183p1925k8668
$$ -21951 21865 167408 238449 190237 130525 98081 181949 137390 169573 97648 68980
14146F8980j19717p486O8788O4244J64186O5060j47594l3988m1763j1256l0621
$$ 68980 -50737 -58223 10565 74809 238995 304055 156461 122473 80710 69454 38833
14135C8833k171m9435N5102N1541K00471l0473j75374j62869r2528J0236Q7292
$$ 38833 36662 -12773 42329 93870 294341 263868 88494 -74375 -166903 -156667 -69375
14124f9375K8232m6275L033o1590O9503P3845k38261m1542K10237J01436N8156
$$ -69375 -41143 -87418 -84385 -145975 -76472 -2627 -240888 -282430 -72193 29243 87399
$$ [...]
##END NTUPLES=NMR SPECTRUM
##END=
