##TITLE=Analysis number 318705
Compound Code mo 07170
Project Code adrs
Chemist Name fudan
##JCAMPDX= 6.0         $$ Bruker NMR JCAMP-DX V2.0
##DATA TYPE= NMR SPECTRUM
##DATA CLASS= NTUPLES
##ORIGIN= Bruker BioSpin GmbH
##OWNER= nmr
$$ XWIN-NMR		Version 3.5
$$ Mon Apr 10 16:11:31 2006 GMT Daylight Time (UT+1h)  MAYBRIDGE\nmr@NMR_250MHZ
##.OBSERVE FREQUENCY= 250.131544655141
##.OBSERVE NUCLEUS= ^1H
##.ACQUISITION MODE= SIMULTANEOUS (DQD)
##.ACQUISITION SCHEME= undefined
##.AVERAGES= 16
##.DIGITISER RES= 18
##SPECTROMETER/DATA SYSTEM= dpx250
##.PULSE SEQUENCE= zg30
##.SOLVENT NAME= DMSO
##.SHIFT REFERENCE= (INTERNAL, DMSO, 0, 16.522)
##AUDIT TRAIL= $$ (NUMBER, WHEN, WHO, WHERE, WHAT)
$$ ##TITLE= Audit trail, XWIN-NMR		Version 3.5
$$ ##JCAMPDX= 5.01
$$ ##ORIGIN= Bruker BioSpin GmbH
$$ ##OWNER= nmr
$$ C:\u/data/dgb/nmr/ADRS/2500/pdata/1/auditp.txt
$$ ##AUDIT TRAIL=  $$ (NUMBER, WHEN, WHO, WHERE, WHAT)
(   1,<2006-04-10 16:11:08.22 +100>,<MAYBRIDGE\nmr>,<NMR_250MHZ>,
      <created by zg, POWCHK disabled, PULCHK disabled
       configuration hash MD5:
       84 BC 41 DB A1 6E 1D 46 DA 25 12 A5 C1 ED C5 3A
       data hash MD5: 64K
       AA D4 2C 69 F4 A0 DF 8F 88 05 A5 E9 99 BA D5 30>)
(   2,<2006-04-10 16:11:22.19 +100>,<MAYBRIDGE\nmr>,<NMR_250MHZ>,
      <Start of raw data processing
       ef LB = 0.3 FT_mod = 6 PKNL = 1 SI = 32K 
       data hash MD5: 32K
       42 7D 8F 70 C5 3E D9 04 77 D9 B6 E5 23 B1 A5 95>)
(   3,<2006-04-10 16:11:23.79 +100>,<MAYBRIDGE\nmr>,<NMR_250MHZ>,
      <apk 
       data hash MD5: 32K
       F9 B3 A7 C4 1B 75 ED DF E4 B7 CF 8F 09 77 79 9A>)
(   4,<2006-04-10 16:11:24.54 +100>,<MAYBRIDGE\nmr>,<NMR_250MHZ>,
      <abs ABSG = 5 
       data hash MD5: 32K
       E9 EA DE B4 F2 39 1B EE 4E 9B 48 A5 8E 9E B5 06>)
$$ ##END=
$$ 
$$ hash MD5
$$ 5F 1C 52 6F CA B3 C1 A3 55 71 0A 20 07 8B E3 F8
##$RELAX= 
##$RELAX= 
##$RELAX= 
##$RELAX= 
##$RELAX= 
##$RELAX= 
##$RELAX= 
$$ Bruker specific parameters
$$ --------------------------
##$DU= <C:\u>
##$EXPNO= 2500
##$NAME= <ADRS>
##$PROCNO= 1
##$TYPE= <nmr>
##$USER= <dgb>
##$AMP= (0..31)
100 100 100 100 100 100 100 100 100 100 100 100 100 100 100 100 100 100 
100 100 100 100 100 100 100 100 100 100 100 100 100 100 
##$AQSEQ= 0
##$AQ_mod= 3
##$AUNM= <au_zg>
##$AUTOPOS= <2 >
##$BF1= 250.13
##$BF2= 250.13
##$BF3= 250.13
##$BF4= 250.13
##$BF5= 500.13
##$BF6= 500.13
##$BF7= 500.13
##$BF8= 500.13
##$BYTORDA= 1
##$CFDGTYP= 0
##$CFRGTYP= 5
##$CHEMSTR= <none>
##$CNST= (0..31)
1 1 145 1 1 1 1 1 1 1 1 1 1 1 1 1 1 1 1 1 1 1 1 1 1 1 1 1 1 1 1 1 
##$CPDPRG= <>
##$CPDPRG1= <>
##$CPDPRG2= <>
##$CPDPRG3= <>
##$CPDPRG4= <mlev>
##$CPDPRG5= <mlev>
##$CPDPRG6= <mlev>
##$CPDPRG7= <mlev>
##$CPDPRG8= <mlev>
##$CPDPRGB= <>
##$CPDPRGT= <>
##$D= (0..31)
0 1 0 0 0 0 0 0 0 0.06 0 0 0 0 0 0 0.0002 0 0 0 0 0 0 0 0 0 0 0 0 0 0 
0 
##$DATE= 1144681865
##$DBL= (0..7)
120 120 120 120 120 120 120 120 
##$DBP= (0..7)
150 150 150 150 150 150 150 150 
##$DBP07= 0
##$DBPNAM0= <>
##$DBPNAM1= <>
##$DBPNAM2= <>
##$DBPNAM3= <>
$$ [...]
##$SUBNAM7= <"">
##$SUBNAM8= <"">
##$SUBNAM9= <"">
##$SW= 20.6930455092707
##$SWIBOX= (0..15)
0 0 3 0 0 0 0 0 0 0 0 0 0 0 0 0 
##$SW_h= 5175.983436853
##$TD= 65536
##$TD0= 1
##$TE= 295.16
##$TE2= 300
##$TE3= 300
##$TEG= 300
##$TL= (0..7)
0 120 120 120 120 120 120 120 
##$TP= (0..7)
150 150 150 150 150 150 150 150 
##$TP07= 0
##$TPNAME0= <>
##$TPNAME1= <>
##$TPNAME2= <>
##$TPNAME3= <>
##$TPNAME4= <>
##$TPNAME5= <>
##$TPNAME6= <>
##$TPNAME7= <>
##$TPOAL= (0..7)
0.5 0.5 0.5 0.5 0.5 0.5 0.5 0.5 
##$TPOFFS= (0..7)
0 0 0 0 0 0 0 0 
##$TUNHIN= 0
##$TUNHOUT= 0
##$TUNXOUT= 0
##$USERA1= <user>
##$USERA2= <user>
##$USERA3= <user>
##$USERA4= <user>
##$USERA5= <user>
##$V9= 5
##$VALIST= <valist>
##$VCLIST= <CCCCCCCCCCCCCCC>
##$VD= 0
##$VDLIST= <DDDDDDDDDDDDDDD>
##$VPLIST= <PPPPPPPPPPPPPPP>
##$VTLIST= <TTTTTTTTTTTTTTT>
##$WBST= 1024
##$WBSW= 4
##$XGAIN= (0..3)
0 0 0 0 
##$XL= 0
##$YL= 0
##$YMAX_a= 403194
##$YMIN_a= -354109
##$ZGOPTNS= <>
##$ZL1= 120
##$ZL2= 120
##$ZL3= 120
##$ZL4= 120
##$ABSF1= 16.522
##$ABSF2= -4.171173
##$ABSG= 5
##$ABSL= 3
##$ALPHA= 0
##$AQORDER= 0
##$ASSFAC= 0
##$ASSFACI= 0
##$ASSFACX= 0
##$ASSWID= 0
##$AUNMP= <proc_1d>
##$AZFE= 0.1
##$AZFW= 0.1
##$BCFW= 0
##$BC_mod= 0
##$BYTORDP= 0
##$COROFFS= 0
##$CY= 12.5
##$DATMOD= 1
##$DC= 0
##$DFILT= <>
##$DTYPP= 0
##$F1P= 14.0000005364418
##$F2P= -0.99999901652339
##$FCOR= 0.5
##$FTSIZE= 32768
##$FT_mod= 6
##$GAMMA= 0
##$GB= 0
##$INTBC= 1
##$INTSCL= 1
##$ISEN= 128
##$LB= 0.3
##$LEV0= 0
##$LPBIN= 0
##$MAXI= 10000
##$MC2= 0
##$MEAN= 0
##$ME_mod= 0
##$MI= 0
##$NCOEF= 0
##$NC_proc= -4
##$NLEV= 6
##$NOISF1= 0
##$NOISF2= 0
##$NSP= 0
##$NTH_PI= 0
##$NZP= 0
##$OFFSET= 16.522
##$PC= 1
##$PHC0= 163.3767
##$PHC1= 7.761014
##$PH_mod= 1
##$PKNL= yes
##$PPARMOD= 0
##$PSCAL= 4
##$PSIGN= 0
##$REVERSE= no
##$SF= 250.13
##$SI= 32768
##$SIGF1= 0
##$SIGF2= 0
##$SINO= 400
##$SIOLD= 32768
##$SREGLST= <1H.DMSO>
##$SSB= 0
##$STSI= 32768
##$STSR= 0
##$SW_p= 5175.98343685301
##$SYMM= 0
##$S_DEV= 0
##$TDeff= 65536
##$TDoff= 0
##$TI= <Analysis number 999999
Compound Code 99
Book Reference 9
Project Code 9>
##$TILT= no
##$TM1= 0
##$TM2= 0
##$TOPLEV= 0
##$USERP1= <user>
##$USERP2= <user>
##$USERP3= <user>
##$USERP4= <user>
##$USERP5= <user>
##$WDW= 1
##$XDIM= 32768
##$YMAX_p= 432859753
##$YMIN_p= -738311
$$ End of Bruker specific parameters
$$ ---------------------------------
##NTUPLES= NMR SPECTRUM
##VAR_NAME=  FREQUENCY,     SPECTRUM/REAL,   SPECTRUM/IMAG
##SYMBOL=    X,             R,               I
##VAR_TYPE=  INDEPENDENT,   DEPENDENT,       DEPENDENT
##VAR_FORM=  AFFN,          ASDF,            ASDF
##VAR_DIM=   32768,         32768,           32768
##UNITS=     HZ,            ARBITRARY UNITS, ARBITRARY UNITS
##FACTOR=    0.157963299565203, 1,           1
##FIRST=     4132.6476996994, 0,             0
##LAST=      -1043.33573715361, 0,           0
##MIN=       -1043.33573715361, -738311,     0
##MAX=       4132.6476996994, 432859753,     0
$$ Real data points
##PAGE= N=1
##DATA TABLE= (X++(R..R)), XYDATA
$$ [...]
22462F623J06764l8523j40324J9249J06790K7100L7929N5425j11365j28712N7501
22451a543P6634m5097l5365j9571O6691l4826p6636l1584N3634M3860n8945K4584
22439c8164J11941J9357l2600k5406m621j040k9108M7922m1769q6635j5433K2872
22427g2684j69Q2625J03720m6845l8433k577k5427o1477j6719J1130M4858o7038
22415h9036l3887N2308N2808L0146K4947n0033l1135l8580M0888j3642k3673j9152
22403i8041R1427L8153J7735m6525K1730l4157o4303k0220l7519M855J29941K0739
22391B3815m5166R343M8181J7495m2525r5962Q1750L8358k8223m2970q0174m0983
22379a57061J40427M5787j2166m6011k5624k5028j12088L4520N6075j228J49986
$$ plain form
22462 6623 113387 74864 -65460 -46211 60579 87679 125608 181033 69668 -59044 -1543
22451 -1543 75091 29994 -5371 -24942 41749 6923 -69713 -101297 -47663 -3803 -62748 -38164
22439 -38164 73777 93134 60534 35128 30507 29467 359 48281 6512 -80123 -95556 -72684
22427 -72684 -72853 9772 113492 66647 28214 25637 210 -61267 -77986 -66856 -21998 -89036
22415 -89036 -122923 -70615 -17807 12339 37286 -12747 -43882 -82462 -41574 -55216 -78889 -98041
22403 -98041 -6614 31539 49274 2749 24479 -9678 -73981 -94201 -131720 -126865 3076 23815
22391 23815 -21351 -12008 36173 53668 11143 -84819 -3069 35289 7066 -35904 -116078 -157061
22379 -157061 -16634 29153 16987 -29024 -54648 -79676 -191764 -157244 -101169 -102397 47589
22368D7589Q501o5179k4007K1464L0793j9981M8086K9564l7229k2805K6812L996
22356D7604P685n4742n4166k2320O9398L7051K6467l8762j07824m7409J5405K8424
22344i3189L46J3722J26168P6285M7950o1848p7443N417O2008K7888Q1o6629l4484
22331B6272J6967K7311j09178J3140O5321l377n1825l7111m1262m8159M0289Q4248
22319a7364p5588l505j1158N160J1457L4142k9683J0913Q3563N3467M3026j1847
22307I2583o040L7052L0605l837n7101m6827l9796l3548j01023L9873j395J0051
22295g9403k4743Q494l542J3570N1092R524m3825O006K6365k9458j5487K8722
22283e2685j4824J8646m92O360K6942K557m169K4907m5096j6504N0998M194Q861
$$ plain form
22368 47589 56090 -9089 -33096 -11632 19161 -820 47266 76830 39601 16796 43608 47604
22356 47604 55289 547 -53619 -75939 -6541 30510 56977 18215 -89609 -137018 -121613 -93189
22344 -93189 -92843 -79121 47047 123332 171282 109434 31991 37408 99416 127304 127385 60756 26272
22331 26272 43239 70550 -38628 -25488 39833 36456 -15369 -52480 -93742 -141901 -101612 -17364
22319 -17364 -92952 -96457 -107615 -102455 -90998 -56856 -86539 -75626 7937 61404 104430 92583
22307 92583 86543 123595 154200 150363 93262 46435 6639 -26909 -127932 -88059 -89454 -79403
22295 -79403 -104146 -95652 -99194 -85624 -34532 -25008 -68833 -62827 -36462 -65920 -81407 -52685
22283 -52685 -67509 -48863 -49355 -42995 -16053 -13496 -17665 7242 -37854 -54358 -3360 834 9695
22270I695P7054Q0134k8180r1598J8801o712l798J1503m1287K7396J5653O0840
22258A29501J29069K5292n2109p8794p9676j4181j0484j15397j13446R3311J05531
22247A8617Q2977j0329j28675j0661P4074k6419q9328l6769n065j0208n3751N2082
22235a43455K9202M1355J22870L3697M1470j1580p5968j18009m1969L3491N3347
22224c5549R161J1673M8012M1438p9238j98923q374N8085j8573R268M6085K7156
22212h9779O8127j7394O4654N2965o4162m4514J1067M2042p804j733r10O6722
22200G9281m7481M8573N2404m7988p7615m8345J2218o7358m3133q1605J9630r534
22188b10953j3910O4127Q1159P1309K9178L3279q5615m2838o7587j9489J3368
$$ plain form
22270 9695 86749 166883 138703 47105 65906 59194 55396 66899 25612 53008 68661 129501
22258 129501 258570 283862 231753 152959 73283 59102 48618 -66779 -180225 -86914 18617
22247 18617 101594 91265 -37410 -48071 26003 -416 -89744 -126513 -131578 -141786 -195537 -143455
22235 -143455 -114253 -72898 49972 83669 125139 113559 37591 -80418 -122387 -88896 -35549
22224 -35549 -26388 -14715 33297 74735 -4503 -203426 -211800 -153715 -172288 -163020 -116935 -89779
22212 -89779 -21652 -39046 25608 78573 14411 -30103 -19036 23006 15202 13469 12559 79281
22200 79281 31800 80373 132777 84789 7174 -41171 -28953 -96311 -139444 -221049 -201419 -210953
22188 -210953 -224863 -160736 -79577 -8268 20910 54189 -31426 -74264 -141851 -161340 -147972
22177a47972m6390N5852J06989r225L8109l3030k5481J3689K9723n8029N7272
22166a8493J18490j9151k8144l7464j5041J0652Q9656n157o2714o0948K7933J6510
22154A6129j9311J0326O8153k2424l6851m9610n8119r4388o1149R1260L5507P9777
22142d0700O2187l2132q4241n3677L2j758K0293L7267l1392l0271L6121R5917
22130b2354Q0618k2274J719J1825n8128n0785k4686M4682j02556r158M1501O20
22118a08976Q6180J09n5229N2543K6333n3206J4582p8391R0289M0160r9609j7522
22106a02737n5307L1238L8219N3903L9488J9838n6533j02315R6P0950P1464r0907
22094h2603j6863M2668O2912Q3974q2783k8304J0661M1883L3160J2043o5744j0449
$$ plain form
22177 -147972 -194362 -138510 -31521 -40746 -2637 -35667 -61148 -47459 -17736 -75765 -18493
22166 -18493 99997 80846 52702 15238 197 10849 100505 95348 32634 -28314 -381 16129
22154 16129 -3182 7144 75297 52873 16022 -33588 -91707 -186095 -247244 -155984 -120477 -40700
22142 -40700 21487 -10645 -94886 -148563 -148531 -150289 -129996 -92729 -124121 -154392 -118271 -22354
22130 -22354 58264 35990 37709 49534 -8594 -59379 -84065 -39383 -141939 -151097 -109596 -108976
22118 -108976 -22796 -22687 -77916 -25373 960 -52246 -37664 -116055 -25766 14394 -85215 -102737
22106 -102737 -158044 -126806 -88587 -34684 4804 24642 -31891 -134206 -134110 -63160 8304 -82603
22094 -82603 -99466 -56798 6114 90088 7305 -20999 -10338 31545 64705 76748 11004 555
22082E55J8243Q7881m8099j07079l8762J5691L9668K9506k9746J9576N264p4479
22070h1781n1580j1541J04937O592m5839L5092M2075L1708j0165q4664m7587N1176
22058f1577N8022J2286M4542M123m7861k3984r065K7312M3807r21K290N8510n0378
22045E7106J9345K8558J2247J0116l0454o90N726n2265m6659k3310J3024m582
22033a1838j4278j03943q2973l786J27800J5157O4103N0688K7607K8070L9261
22022A35868N8620k4342m8089o4925n0357k5844M4655L9488L5806m6829m8469
22011E582J13675J04190m6456k0773l3283N4310j3366o2212j00143j3816l1004
22000d3296o5401k0380R6021L8562j17115j3458N7359N152L6559O8409O627J3734
$$ plain form
22082 555 18798 106679 58580 -48499 -87261 -71570 -31902 -2396 -32142 -12566 -7302 -81781
22070 -81781 -133361 -144902 -39965 -33373 -79212 -44120 -2045 29663 19498 -65166 -112753 -61577
22058 -61577 -3555 8731 53273 57396 9535 -14449 -23514 3798 47605 46684 48974 107484 57106
22045 57106 76451 105009 117256 127372 96918 96228 101954 49689 3030 -20280 -7256 -11838
22033 -11838 -26116 -130059 -213032 -216818 -89018 -73861 -9758 40930 68537 96607 135868
22022 135868 194488 170146 122057 57132 6775 -19069 25586 65074 100880 54051 5582
22011 5582 119257 223447 176991 156218 122935 177245 163879 101667 1524 -12292 -43296
22000 -43296 -108697 -129077 -33056 5506 -111609 -125067 -67708 -62556 -25997 42412 49039 62773
21988F2773k1346o1592N0695L8036k7253q0716k0540L3247r3399l4611o929J75406
21976A3771Q9470K1940l0709q5224m4490o4682J1778k8476k3829K1464j056N913
21964a14130L3013J894o4704J0706L7624N8290Q4086J5891k7477J3812L3930n1163
21952C1772k7031n4439M5768L6535m5512K1970J01880l2454m6425L0191J6371
21941G8626p240j0735N8090m2984q4024K8579Q36o5326j06206M1484J52559P451
21929E1110k0602L8939O0676p863o4831K7415j6178n346m4603l9782k3676J1523
21917c3218k046O2486j5386r5303L9543N3926L3571J1466r3620j2606M7269J7707
21905A3789l367p1989n4467J04294O3930q3658m3717L5704k6997K578L8050M4571
$$ plain form
21988 62773 41427 -20165 30530 68566 41313 -39403 -59943 -26696 -120095 -154706 -161635 13771
21976 13771 103241 125181 94472 9248 -35242 -99924 -88146 -116622 -140451 -118987 -120043 -114130
21964 -114130 -81117 -79223 -143927 -133221 -95597 -37307 46779 62670 35193 49005 82935 31772
21952 31772 4741 -49698 -3930 32605 -12907 9063 110943 78489 32064 62255 78626
21941 78626 71386 60651 118741 75757 -8267 20312 21148 -44178 -150384 -108900 43659 51110
21929 51110 30508 69447 130123 122260 57429 84844 68666 63320 18717 -21065 -44741 -33218
21917 -33218 -35264 27222 11836 -83467 -43924 10002 43573 55039 -38581 -51187 -3918 13789
21905 13789 10422 -61567 -116034 -11740 52190 -31468 -75185 -39481 -66478 -63900 -25850 18721
21893A8721k2238n2276k6093p4481l1225J7763n3887M293r797L4628P6321N1029
21881f7242K6547q739n2936m170L8249J0501L7780j3582R5721P5459m5085q7997
21869D506l5773J8299l1544n422L3124K1185k8613M1448R94J1973N4016J5809
21857A00002l3129K0510l2287n7320L7569J9502L5727j07267j13535J9887J862
21846a08479K3415J16526m717m1939l3488R628K5243K0348K5670k8102k2117O182
21834a1830L7871N2662J4361N6636l779m5007r0281r0460O588j0575j23607j08186
21822c15607R5783N4020O7394K0969L3964O6869K8833K6223k2667o3487l764K3825
21810A2355m667p5370o2343J5376K5610N459K3723M1516l1357l5346J1339N6348
$$ plain form
21893 18721 -3517 -55793 -81886 -156367 -187592 -169829 -223716 -219423 -229220 -194592 -118271 -67242
21881 -67242 -40695 -49434 -102370 -106540 -68291 -57790 -20010 -33592 62129 137588 92503 4506
21869 4506 -31267 -12968 -44512 -49934 -16810 4375 -24238 17210 18204 30177 84193 100002
21857 100002 66873 87383 55096 -2224 35345 54847 90574 -16693 -130228 -110341 -108479
21846 -108479 -85064 31462 26745 -15194 -48682 -39054 -13811 6537 32207 4105 -18012 -11830
21834 -11830 26041 78703 93064 149700 145921 100914 10633 -79827 -73239 -83814 -207421 -315607
21822 -315607 -219824 -165804 -98410 -77441 -43477 23392 52225 78448 55781 -7706 -11470 12355
21810 12355 7688 -67682 -130025 -114649 -89039 -83580 -59857 -18341 -49698 -85044 -73705 -17357
21798a7357R118n078k2402N2247l867l0454P7039m6635l5126J2603k6784p185
21786d3881K6378l4041j138J17648K3475o5745l596P712k8843o7073l0900k8284
21774a28288k5509m7558P3424J24393L1902K2134p1005J9461K1003q6433l2916
21763i9392K8910N9504L85l1079j1364n8422p3652K6335L6535J03905N0286J3751
21751D5702n3251j8834P4659L7327m7630l2124l7712K4004k030l2075m2715r598
21739i4277L7673O0531K4261l368j060p8882J118o363o5920o0327L0982J17938
21727c7694L0007M6718k8941n9318l3024L9158m9100J4574J25820j2176L3054
21716F9078O3949N171j7401q1888J0218P7273L311j27628K329o5176o9356j9872
$$ plain form
21798 -17357 -8239 -13317 -35719 16528 12661 -17793 59246 12611 -22515 -9912 -36696 -43881
21786 -43881 -17503 -51544 -52682 64966 88441 22696 19100 26812 -2031 -69104 -100004 -128288
21774 -128288 -153797 -201355 -127931 -3538 28364 50498 -20507 -1046 19957 -66476 -99392
21763 -99392 -70482 -10978 -10593 -41672 -53036 -111458 -185110 -158775 -122240 -18335 31951 45702
21751 45702 -7549 -26383 48276 85603 37973 5849 -31863 -7859 -9889 -41964 -84679 -94277
21739 -94277 -56604 3927 28188 24820 23760 -55122 -54004 -60367 -126287 -186614 -155632 -37694
21727 -37694 -7687 39031 10090 -49228 -82252 -43094 -92194 -77620 48200 36024 69078
21716 69078 133027 138198 120797 38909 49127 126400 129711 2083 4412 -60764 -130120 -149992
21704a49992O5781J13619L3318Q980k8847J5814n9667J7661k4497q7818k594N7884
21692d0358K0929j9021k1680M5721L9313j7349j7630J4692m965j7853k1399m083
21680d3683k4548M5421R6268K205r8110k2803n7180m3657K4776m4970r0810J21461
21668a35630K4250O369Q0522N0538m9911K6188r0235l6172L5605N7038r2131l9647
21656a63216Q1144k8523l0246M6370L1147M6998M1702L0617l4480n9306k6865
21645f4658Q9810M2852l8415P7710R6181O8106j6609l0822k5482r487k9000j12141
21633D8045m5470qP4206P207q4463n4713J8810N8709q954K2664M8050l3938l1175
21620A8970l5314m3268j9926K069O7978J5734K5427l7231J7949m2879n569R4647
$$ plain form
21704 -149992 -84211 29408 62726 71706 42859 58673 -994 16667 -7830 -95648 -98242 -40358
21692 -40358 -19429 -38450 -60130 -14409 24904 7555 -10075 4617 -348 -18201 -39600 -43683
21680 -43683 -68231 -22810 73458 75663 -22447 -45250 -102430 -146087 -121311 -166281 -257091 -135630
21668 -135630 -111380 -105011 -24489 26049 -23862 2326 -87909 -124081 -88476 -31438 -123569 -163216
21656 -163216 -82072 -110595 -140841 -94471 -63324 -16326 25376 55993 21513 -37793 -64658
21645 -64658 25152 68004 29589 107299 203480 271586 254977 224155 198673 189186 160186 48045
21633 48045 2575 2567 76773 83980 -483 -55196 -36386 22323 13369 36033 84083 50145 18970
21620 18970 -16344 -59612 -79538 -77469 -9491 6243 31670 -5561 12388 -30491 -36060 58587
21608E8587K1414l0805n1130j12194K9358l7342l2339k944M8578O4022L4234K770
21596g791o3747l931R7390Q3679O9457r0621j01931o1330m3841k8524K9005M1062
21584h1123J08512m5387j0114o1964o9O0657N7342o7022J7310K7908J3245j2493
21572F802k9049p7850l4959R611K9603k4960J353k5237P950r931n6120P288P5759
21559a19740L3476j6749L6767R5909k4254n7921p2626k070J1760m295K2712M2866
21547e4165K7840J7343j08837l343j8324P0056N8607p0283j3660J356O6625P2136
21535D5351J7791m5848k2072K0489O4817M587q1622j06096j1342R392L3884K7435
21523d3234M2303k1338O589O0844Q2935K7498l8608j11686q5340R0860N2664o0370
$$ plain form
21608 58587 80001 49196 -1934 -114128 -84770 -122112 -154451 -157395 -108817 -44795 -10561 -7791
21596 -7791 -71538 -75469 21921 105600 175057 84436 -17495 -78825 -122666 -151190 -122185 -81123
21584 -81123 27389 -17998 -28112 -90076 -90145 -29488 27854 -39168 -21858 6050 19295 6802
21572 6802 -22247 -100097 -135056 -125445 -95842 -120802 -119449 -144686 -136736 -146667 -202787 -195499 -119740
21559 -119740 -86264 -103013 -66246 29663 5409 -52512 -125138 -127208 -115448 -119743 -97031 -54165
21547 -54165 -26325 -8982 -117819 -121162 -139486 -69430 -10823 -81106 -94766 -93410 -26785 45351
21535 45351 63142 17294 -4778 15711 80528 85115 3493 -102603 -113945 -104553 -70669 -43234
21523 -43234 -931 -22269 -15680 45164 128099 155597 116989 5303 -80037 10823 63487 3117
21511C117r549k1217m329o7155l05M6534j5852k0762J4902O7791j8116o638N0199
21498A8620N6725j5524k1141K5836m5248r0581M695O8218M8780j9854N1946J3283
21486I5755p4040l5287m1207m7189Q31J02805n8136k5874J26773J0253j04297
21475d9613l0033M0069L9373L1939K1257j9279l960R092k0253l0891k7360p7506
21463a17165P3087P1447N8816J1869l9335r4008j21505l9321k192l3504O0877
21452a70934O1334O1014j0652k8219j0842k142N6405Q7683R5689n2127r624P9692
21440A57277l6165o3041j33311o9659j3669m9372J4477Q3040J08200J4260k0784
21429h747Q6966L8375m0853r1785m3325R8825m5400o4949j0819N1122O5708R7254
$$ plain form
21511 3117 -6432 -27649 -31978 -99133 -99438 -52904 -68756 -89518 -74616 -6825 -24941 -31579 18620
21498 18620 75345 59821 38680 64516 19268 -71313 -66618 1600 50380 30526 82472 95755
21486 95755 21715 -13572 -54779 -101968 -101137 1668 -56468 -82342 44431 54684 -49613
21475 -49613 -79646 -39577 -204 31735 52992 33713 29753 38845 18592 -12299 -39659 -117165
21463 -117165 -44078 27369 86185 98054 58719 -35289 -156794 -196115 -198307 -231811 -170934
21452 -170934 -109600 -48586 -59238 -87457 -98299 -100441 -44036 43647 139336 87209 77585 157277
21440 157277 121112 58071 -75240 -144899 -158568 -207940 -193463 -110423 -2223 12037 -8747
21429 -8747 78219 116594 75741 -16044 -59369 39456 -5944 -70893 -81712 -30590 35118 132372
21417A32372J1564k6242m5294J8547l7328J9239o0687j7609Q144L0554q912k8925
21405d577k65M400N8341J3264m7303L212k9094j1779m674N078K1437k5587m9872
21392f7419j7343M1774J1314m9846L3083J17168P0042o3422p4737l3122O1310
21381B8802N2434Q9623K7003j15901j23026o3710j207P9420J4142l12Q5270m5057
21369B7481m0874N572M2112N2417l1199L9910L2309M0825p5110j45312J2484L4934
21357d451J03595o0682j37163J3706j9691L7062m781j0962P4342M9444M1868M154
21345H6441o3111K9996J824j427o9672j4961q13m8184K5256k9705n447L4409M6771
21332h623J3196o9134j8553O1123J2744N1014L2731j10105n2902m0974L1566M8337
$$ plain form
21417 132372 143936 117694 72400 90947 53619 72858 12171 -5438 2706 33260 24348 -4577
21405 -4577 -4842 -442 57899 71163 23860 27072 -2022 -13801 -18475 -13397 8040 -17547 -67419
21392 -67419 -84762 -42988 -31674 -81520 -48437 68731 138773 75351 614 -32508 28802
21381 28802 81236 170859 197862 81961 -41065 -104775 -105982 -26562 -12420 -12732 72538 27481
21369 27481 -13393 -7821 34291 86708 55509 95419 127728 168553 93443 -51869 -39385 -4451
21357 -4451 99144 38462 -98701 -84995 -104686 -67624 -72405 -83367 -9025 40419 82287 86441
21345 86441 23330 53326 55150 53723 -15949 -30910 -31723 -79907 -54651 -84356 -89803 -55394 -8623
21332 -8623 4573 -64561 -83114 -21991 -9247 41767 74498 -35607 -88509 -129483 -97917 -49580
21320d9580L578o4575r0957q8050J2300J49628O4315Q1826k7442k064M3166L5628
21308F7773K7671j2046N487J6453o5599l9300j6475j25596k8355P2868L5230j6078
21296g7967N8668l4840k4823l6207O383P2599J34465Q293m1883l3021J0663n2742
21284a0412N4986P2855q3817j01032j1430k5810L1155L0462O521p388l8763m2205
21272a24878J7410K7028L6600j3008K5879j3931O7320k2330L774l9427L6270J1238
21260A1945J12524K3548j16525j03114n7169J19204j8022o6602n0745K3756M969
21249a16231m1720O1604K116O033m5073m393M1943J6813j03624q184J5469M0359
21237a34888P8383N6265N928L0463m145m7450j7416R5151k1858j27879o277J0845
$$ plain form
21320 -49580 -46002 -110577 -201534 -289584 -277284 -127656 -63341 18485 -8957 -11021 32145 67773
21308 67773 95444 83398 88885 105338 39739 439 -16036 -141632 -169987 -97119 -61889 -77967
21296 -77967 -19299 -54139 -78962 -115169 -108786 -36187 98278 106571 64688 31667 42330 -10412
21284 -10412 44574 117429 33612 -67420 -78850 -104660 -73505 -43043 -36522 -43910 -82673 -124878
21272 -124878 -107468 -80440 -43840 -56848 -30969 -44900 22420 90 3864 -35563 707 11945
21260 11945 124469 148017 31492 -71622 -128791 -9587 -27609 -94211 -144956 -121200 -116231
21249 -116231 -157951 -96347 -94231 -88198 -133271 -137664 -95721 -78908 -182532 -190716 -175247 -134888
21237 -134888 -56505 -240 5688 36151 32006 -15444 -32860 62291 40433 -87446 -93723 -82878
21225h2878j639j7578L1547K0588j3083Q432p1408L0591O4633J13565L7264J3452
21213A33486q12j6748K8818q8748l1441N3296K3759J5132O1772L85j02687j05079
21201b8867m2463R760j1178j1855J348M4087M4610J0580R5864o6770m2132N0134
21189E3118P0321p387n2550l4191M1777l175J662n8898j16333N4172M4168q0232
21177h7548k1237o8870R1830O2189l3095M5360P1778m6186k6776l0437J494l5070
21165g6568k4218n303l5323M1057r66M4309M4507r0543q709J11771n702M5562
21153C9874k3450n7044J6199k5876l8523K8515m4376p0266o2026M8135J12624
21142g6214Q410r3090n4503l6996J44129K9063j8528J5603m9937k395M8606O0695
$$ plain form
21225 -82878 -84517 -102095 -70548 -49960 -63043 -54611 -126019 -95428 -30795 82770 120034 133486
21213 133486 132674 115926 144744 55996 24555 77851 101610 116742 178514 178899 76212 -28867
21201 -28867 -71330 -61570 -72748 -84603 -83255 -39168 5442 16022 111886 45116 2984 53118
21189 53118 123439 116052 63502 29311 71088 67913 69575 10677 -105656 -51484 -7316 -87548
21177 -87548 -108785 -177655 -85825 -23636 -56731 -11371 60407 14221 -12555 -42992 -41498 -76568
21165 -76568 -100786 -106089 -141412 -100355 -101321 -57012 -12505 -103048 -111757 14 -5688 39874
21153 39874 16424 -40620 -24421 -50297 -88820 -60305 -104681 -174947 -236973 -188838 -76214
21142 -76214 -67804 -160894 -215397 -252393 -108264 -79201 -97729 -82126 -132063 -134458 -85852 -25157
21130b5157k72p0067k2693R6129l5903O4608L57j5805M2506N825m8390j4174L8666
21117A5630O4472K5934K002o9532O14j6767l5577m1781M1154l1251Q3311J2575
21105E0784L1251p7196o0769M999o5626K8948L1033o3524J4349j9166n4949N6498
21093a23368M26L7438J13378J2477j2716j1415M9794K8134J3488l3304L0230p0094
21081C4468j15736l6432L4492N3139M0332L3707M0706o9135l8255j9113n873o293
21069e3993M2016Q8423K6434N668J0781n5991o8589n8553M4897L4361l4564n3249
21057g2359K1268k272J0439K5206M274n6147l2398l1014K9098R3569R4926r095
21045G5495n2504o1581Q849l9279j3636L6923J35704O5259j05744j7202m4464
$$ plain form
21130 -25157 -25429 -95496 -118189 -22060 -57963 6645 7002 -8803 33703 39528 -8862 -23036 15630
21117 15630 80102 106036 108038 38506 39120 22353 -13224 -55005 -13851 -45102 38209 50784
21105 50784 82035 4839 -55930 -50931 -116557 -87609 -56576 -120100 -105751 -124917 -179866 -123368
21093 -123368 -122942 -85504 27874 40351 27635 16220 66014 94148 107636 74332 104562 34468
21081 34468 -81268 -117700 -83208 -30069 10263 43970 84676 15541 -22714 -41827 -47700 -53993
21069 -53993 -11977 76446 102880 108548 119329 63338 -5251 -63804 -18907 15454 -19110 -72359
21057 -72359 -51091 -53363 -42924 -17718 -13444 -69591 -101989 -133003 -103905 -10336 84590 75495
21045 75495 22991 -38590 -29741 -69020 -82656 -45733 89971 155230 49486 32284 -12180
21034a2180j0123P4307k0766P8540l9436p0148k0554N6887q5823n0367k0961L8300
21022h2324O7316J4928L9086K0995K6452n2113K1808j7123o5778k2050P3281N8047
21010H2525k2948j38774j21244K4859N1631Q0964N6599n5465k9406q440L51J5305
20998f4043N4209M2765N332l4045o8335K2683J0516n008J895O0304L7007j7962
20986D5318K8744M5924k0751j00705o5652o8081l7400N1635P3399K183l642J4520
20974c4508Q2583L4623o6829l9853j4524j03534k3032L9417R7625P4943n0791
20963c880j21177M2994Q4090J897J2289O4302n7318k2915J0742l962L335O3787
20951G4184k709j59618q7057q6484J0903R313R9649J74631J05507k1695q4530
$$ plain form
21034 -12180 -22303 52004 31238 109778 70342 194 -20360 36527 -49296 -99663 -120624 -82324
21022 -82324 -15008 -80 39006 60001 86453 34340 56148 39025 -26753 -48803 24478 82525
21010 82525 59577 -79197 -200441 -175582 -123951 -42987 13612 -41853 -71259 -79699 -79348 -64043
20998 -64043 -9834 32931 38263 4218 -64117 -41434 -30918 -35926 -34031 26273 63280 45318
20986 45318 74062 119986 99235 -1470 -67122 -135203 -172603 -120968 -47569 -45386 -49028 -34508
20974 -34508 48075 82698 15869 -23984 -38508 -142042 -165074 -125657 -28032 46911 -3880
20963 -3880 -125057 -82063 2027 3924 16213 80515 23197 282 11024 7062 10397 74184
20951 74184 71475 -88143 -175200 -261684 -250781 -241468 -141819 32812 138319 116624 32094
20940C2094j05689j8172N8227r254n9993j1393J2982N7383J5892Q154N5412k6230
20928I413l4762r5598m7220J01403P231K5141m823J6515k4191m8942m2148M0643
20916i7338O8318k9350k6555k6169K4382Q8160j5951r0681j02503R0570N0192
20905f6925N2583j4422r4477n9750j7392P5811O7396l8645j6581M8702O1493O7785
20893F5578K7228k250o389N428m2091m2850O8245K7260o8265J3693j9624j5296
20881A0667P2392m9445p6470J0428K8320J6296m6545n0315O9028J33988J6268
20870A34612j35175j18271j9551m973K4571P0025Q7827M4687k6329r7525r3711
20859a33813N3906L7904q1097J354K2077N9164J14262o1765J4549j5521m2136
$$ plain form
20940 32094 -73595 -91767 -33540 -42794 -102787 -114180 -101198 -43815 -27923 -19769 35643 9413
20928 9413 -25349 -120947 -168167 -66764 -59533 -34392 -39215 -22700 -46891 -95833 -137981 -97338
20916 -97338 -29020 -58370 -84925 -111094 -86712 1448 -14503 -105184 -207687 -117117 -66925
20905 -66925 -14342 -28764 -123241 -182991 -200383 -124572 -57176 -95821 -112402 -63700 -2207 65578
20893 65578 92806 90556 84167 89595 47504 4654 72899 100159 31894 45587 25963 10667
20881 10667 83059 33614 -42856 -32428 -4108 12188 -34357 -84672 -15644 118344 134612
20870 134612 -563 -118834 -138385 -143358 -118787 -48762 39065 83752 57423 -40102 -133813
20859 -133813 -79907 -42003 -123100 -121746 -99669 -40505 73757 11992 26541 11020 -31116
20848c1116L4298J7353p1759J8663M4652k0082l9594O0022M3805j5563n484O154
20836D1349K9287n2620j7586O1050J430j4596k3025o2351K0378m6633j35481j2705
20824b11503N2480N3226k2811q2972N5492J01968Q7427K2241q987l1947l14P1788
20812H6088M9035r0739j14732n3134K5773n4650p8098j0733l1390M3252J36844
20801i2484J44047J4123k4004J3095k7725q2843k6591M556N5284K2812J8628K0598
20789C9496m9705J7112o1951M7230L8539L506k6612K6492M7206p7798K8909n5047
20777b2623q3543J1897J63430R7882n7367k2909n9168m3106j08992k6415R389
20766a41525J7845N4607P916j2701K9568P2597O9170m5246l1729k902n9294M399
$$ plain form
20848 -31116 3182 20535 -51224 -32561 12091 -7991 -47585 12437 56242 40679 35195 41349
20836 41349 70636 18016 430 61480 62910 48314 25289 -37062 -16684 -63317 -198798 -211503
20824 -211503 -159023 -105797 -128608 -211580 -156088 -54120 33307 55548 46561 14614 14300 86088
20812 86088 135123 44384 -70348 -123482 -97709 -152359 -230457 -241190 -272580 -229328 -92484
20801 -92484 51563 65686 41682 54777 27052 -55791 -82382 -77826 -22542 270 18898 39496
20789 39496 -10209 6903 -55048 -7818 30721 34227 7615 34107 81313 3515 32424 -22623
20777 -22623 -106166 -94269 69161 167043 109676 86767 27599 -15507 -124499 -150914 -141525
20766 -141525 -123680 -69073 -61157 -73858 -44290 28307 97477 52231 20502 17600 -41694 -37295
20754c7295q933O5132Q7706l28m5970n0031L1890j2586k8593q0714J0325K503
20742f6894J1799q3512o1391k4983K9286O9561N7817K6351L842J4092Q382L6948
20730B1298O2431j474j17436o2618J5301r026N1945K5626O2727M1734K5289q0537
20718C5260l9827K0213l5702m9965n7610m3864j4477M2886P7282L4113O5811k8805
20706E315K3768j1774m9730o3461k8701K085J3798l2872M0905R2528q498n5093
20694g1730j4101j752J0038K0897j0449l8571J3281N549M5327N0527M5825N6538
20682A11379j1266N979q901K3292l5847p3230m0086j0220L1674M4795p509o4469
20670c4409l9278M62j1896m6061P160J2168M4808L5410J0509Q0713j0659j31943
$$ plain form
20754 -37295 -46228 18904 106610 106282 60312 10281 42171 29585 992 -79722 -69397 -66894
20742 -66894 -55095 -138607 -199998 -224981 -195695 -126134 -68317 -41966 -38124 -24032 -15650 21298
20730 21298 83729 82255 -35181 -97799 -82498 -91524 -39579 -13953 48774 90508 115797 35260
20718 35260 -4567 15646 -20056 -70021 -127631 -171495 -185972 -143086 -65804 -31691 34120 5315
20706 5315 29083 17309 -32421 -95882 -124583 -122498 -108700 -141572 -100667 -8139 -16637 -71730
20694 -71730 -85831 -87583 -77545 -56648 -67097 -105668 -92387 -86838 -41511 9016 54841 111379
20682 111379 100113 106092 97191 120483 84636 11406 -28680 -38900 -7226 37569 30060 -34409
20670 -34409 -73687 -73225 -85121 -131182 -124022 -111854 -67046 -31636 -21127 59586 48927 -83016
20658h3016j9071K9509K5728n772L9822L4891N9729N7463l2264j4910M265m3096
20646E3278j3333j7414p5256R9430m2008m7400M6648M9131l4172n6759J3370P5432
20634E0947N0413O0420q3384n6451M5246o0235p091k63K7119n7973j71346j9763
20622b22361M3189R1744Q9941M693K9731p7491o3190R6674M9865k746K2652m7704
20610A4997r8911j9350M8666o338j289l80O4739L6107m4811q0337l4618P1988
20598d9537L0644k7877q4398m075N7443N4308o270N5711p9262n7567M8393Q9787
20586B7300J06179N5r4914O211m4850m6910l8495l177M1971Q165M5510j00631
20574i3586q9482L6534M9266l2772j3654N6885j1298J15011N2898l9971p9130
$$ plain form
20658 -83016 -102087 -72578 -46850 -52622 -12800 22091 81820 139283 107019 92109 96374 53278
20646 53278 39945 22531 -52725 46705 4697 -42703 3945 53076 18904 -37855 -24485 50947
20634 50947 101360 161780 78396 21945 67191 6956 -135 -398 26721 -31252 -202598 -222361
20622 -222361 -179172 -87428 2513 7206 36937 -40554 -103744 -7070 42795 40049 62701 14997
20610 14997 -83914 -103264 -54598 -60936 -62225 -62605 2134 38241 -6570 -86907 -121525 -49537
20598 -49537 -18893 -46770 -131168 -135243 -77800 -23492 -29762 25949 -53313 -110880 -62487 27300
20586 27300 133479 133534 38620 44831 -19 -46929 -85424 -88601 -46630 -38465 7045 -93586
20574 -93586 -183068 -146534 -97268 -130040 -143694 -86809 -98107 16904 69802 29831 -49299
20563d9299N1191p1815r1970Q6992J47148o7426p4213O766J0061K0257K3411L9031
20551C0134Q946j1887q2608k763p516o6968L4989N1766Q1016j8960j7289o0677
20539f1817l749l9214O2184R2855N3458p4831n5743m0535N1742K0031L3186j8779
20527A8788r5371o411N5075J4178o7234n4241q744K2944M0858P9706m0873m1140
20515h2465K3001O9076Q2368K3082n0876n2292q368n4546N1827N3083K3339l865
20503G3364M5340J3503M2215j0897k3030j23627J9279Q2019L7433O5765o4759
20492A56605J6150l0669l5259j0049J4014r8145r1300k1449M8902l3571M3661
20481d1110j3915P9636O277m3496l6070k4784M0528O4387K1674q3777L3753K1795
$$ plain form
20563 -49299 1892 -69923 -161893 -74901 72247 4821 -69392 -62626 -52565 -32308 -8897 30134
20551 30134 39080 27193 -55415 -58178 -65694 -132662 -97673 -45907 35109 16149 -1140 -61817
20539 -61817 -65566 -104780 -42596 50259 103717 28886 -26857 -67392 -15650 4381 37567 18788
20527 18788 -76583 -82994 -27919 -13741 -80975 -135216 -143960 -121016 -80158 -452 -41325 -82465
20515 -82465 -59464 9612 91980 115062 64186 11894 3526 -51020 807 53890 77229 73364
20503 73364 118704 132207 174422 163525 140495 16868 36147 118166 155599 221364 156605
20492 156605 172755 142086 106827 96778 110792 12647 -78653 -100102 -51200 -84771 -41110
20481 -41110 -55025 24611 30888 -12608 -48678 -73462 -32934 31453 53127 -30650 3103 24898
20469B4898m1580L7523j9081L2761r8289o9315L4012K8423J8109m2504M9137K1964
20457b3942j8214O017k9618Q638P2412N809J3998L7790j31241m5901k9441J0459
20445a23234R5166O4178P7958J2686k1349j40469q3572P5565K8057L8201m7599
20434b4412j12828r2907O5962P2344J36934n5046q9829P2454M3384k8817o783
20423a9544j4686n287j0642l8497k5835l0993N0808M6752p3685M758L0511O336
20411h0004O4332K0076q122j716q1683j28745R3805R8416N9892n10q2673N7265
20399A0333N9199O617j0263j0145l7364M4182L6711l5525q0950r5817k3715O785
20387a29952M7625Q771N2222M796K6586J9246Q3728L820j8502j04356k3739L6699
$$ plain form
20469 24898 -16682 20841 1760 34521 -63768 -133083 -99071 -70648 -52539 -95043 -45906 -23942
20457 -23942 -42156 -36139 -65757 -57119 15293 21102 35100 72890 -58351 -104252 -133693 -123234
20445 -123234 -28068 36110 114068 126754 105405 -35064 -118636 -43071 -15014 23187 -24412
20434 -24412 -137240 -230147 -164185 -91841 45093 -9953 -99782 -27328 16056 -12761 -19544
20423 -19544 -34230 -39517 -50159 -88656 -114491 -145484 -94676 -47924 -121609 -116851 -86340 -80004
20411 -80004 -15672 4404 -3718 -5434 -87117 -215862 -122057 -23641 36251 35741 -46932 10333
20399 10333 69532 76149 65886 55741 18377 62559 99270 63745 -17205 -113022 -136737 -129952
20387 -129952 -82327 -73556 -21334 -16538 10048 29294 113022 116842 98340 -6016 -29755 6944
20375F944M4130N641j9581J9176k0237L7878K1498r5858l5035N2564l7510N347
20363a5043J13295L297N5449o4146j16451m9309L1245K7085p7063n6080J03020
20352d4701N6810m912M4286Q4108K9115J5906o3375j18411O8507O3356K6896j46831
20340A0754k4243k5397K1511N6244O0644p2912m530N7867J06068O167o2437j10383
20328A9353p3529m536k6177n8257j2254P0308Q3081P8097o6725n566L0171J6777
20316E0743n8662M0803l2101M6204J56287N8639p3035j25368p0026K9864k3354
20305fO2733L5280q9119j8944Q285K6107J3963O4962J29461P7483K2277J2482
20293C44964J48910K23728J66009J45478J06692K74283K31397K36549P271o5069
$$ plain form
20375 6944 51074 56715 37134 56310 36073 73951 95449 -409 -35444 17120 -20390 -15043
20363 -15043 98252 101549 156998 92852 -23599 -72908 -41663 -14578 -91641 -147721 -44701
20352 -44701 12109 7197 51483 135591 164706 180612 117237 -1174 67333 130689 157585 10754
20340 10754 -13489 -38886 -17375 38869 99513 26601 22071 79938 186006 192173 129736 19353
20328 19353 -54176 -58712 -84889 -143146 -155400 -85092 -2011 76086 9361 3795 33966 50743
20316 50743 -7919 32884 783 46987 203274 261913 188878 63510 -6516 23348 -6
20305 -6 62727 98007 8888 -10056 -1771 24336 38299 103261 232722 310205 332482 344964
20293 344964 493874 717602 883611 1029089 1135781 1410064 1641461 1878010 1885281 1820212
20283A820212j07281j855r2640j38018k21352k50280j60902j02323r8013p4372
20273E73176q2487j5668j9778l0589k5325L3789j12640j12453k5859N3677P2003
20262C07846M384l9925n1631q7491O7614N8620l775j4859O0813P3968m1564j05476
20250B28524n7867L9072o7718m0143N9743n4224M5430J1374m498q9310j4031P5709
20238A32061J2274l4853j1123L8014o2169J9414M5522q1537o013Q809J17256M1579
20226B19234j4120L7585Q1748M2257j39352j00264p3219l5474l0735K2665J23279
20215A33604J08828l7559p6650p3743m7766J7642m1328J5455P642n1797J2754
20204c2918P0034P2260M9776O8119K9393m7944l5963j533O674j29753q0729O342
$$ plain form
20283 1820212 1712931 1711076 1618436 1480418 1259066 1008786 847884 745561 647548 573176
20273 573176 490689 475021 455243 424654 399329 433118 320478 208025 182166 235843 307846
20262 307846 312230 272305 220674 133183 200797 259417 255642 240783 301596 375564 334000 228524
20250 228524 170657 209729 142011 101868 161611 107387 152817 164191 159693 70383 56352 132061
20238 132061 144335 109482 98359 136373 74204 93618 139140 57603 51590 60399 177655 219234
20226 219234 205114 242699 324447 366704 227352 127088 53869 18395 -12340 10325 133604
20215 133604 242432 204873 128223 54480 6714 24356 -16972 -1517 6125 -45672 -32918
20204 -32918 37116 109376 159152 227271 256664 208720 172757 171224 177898 48145 -32584 -26242
20192b6242K123L6397P0409K3772r7765P4373O9590o0991m6475m0148k9834j5378
20180d0169N0582J2466M8074L2169l9012p152P9650l1171J28353L2778r2621p1524
20168A02423l5197l6146O4861L0988j22271k5758M3211L0259j11346j877O2882
20157B029o2803J6504J01025J507J7091o3031o11N9411m3573n1631J6764L6713
20145B9395J5656M0886j0335M6350p4005q4202N8788O695P935m3082p3042M2840
20133c6121J40907J32771q2609j33190K4083m0810Q573M7512O3602p7899j02251
20122e5432m9460M984P970K0952O5790k0421k5965n1269J4553P5743J17964M4203
20110A49612p1622Q287j0145p3300n8346K0951l2505n4810J5030K2169N4227P1024
$$ plain form
20192 -26242 -24119 12278 82687 106459 8694 83067 152657 91666 45191 5043 -24791 -40169
20180 -40169 10413 22879 70953 103122 64110 56958 136608 105437 233790 266568 173947 102423
20168 102423 67226 31080 95941 126929 4658 -21100 22111 52370 -58976 -60853 2029
20157 2029 -60774 -44270 56755 58262 75353 12322 11711 71122 27549 -24082 -7318 29395
20145 29395 45051 85937 75602 121952 47947 -36255 22533 29228 37163 -5919 -78961 -36121
20133 -36121 104786 237557 154948 21758 45841 5031 13604 61116 124718 46819 -55432
20122 -55432 -104892 -99908 -91938 -70986 -5196 -25617 -51582 -102851 -88298 -12555 105409 149612
20110 149612 77990 86277 76132 2832 -55514 -34563 -67068 -121878 -106848 -84679 -30452 40572
20098D0572N729n5677K5443N8528m7712J9884P233L0930m2447Q8030j7081n6449
20086E6983m2743P3910m6106j41786j6474Q9102J9492K2963N3026J3369o6429
20075A5307p267K8848L4670O708n0141o364j5207M0904J5799N6284j5241n3125
20063E1175j10054k4498J02530N8784j6230m951k4752N0657m6220L4989N7673
20052A29103m7988r0577p6273L1455M2614O1835M4332j0364j09550M0435P3947
20041H8969j03011j9713R876M2907J7001L4812L6848q7200j12085M6296J59832
20030A14532J03344o1738m5669o1770J0342k5443l5377m956L5505J02386K6158
20019A57314J1946n2064q8323m6676N3414J9785m2344l5873p64J08980j09709
$$ plain form
20098 40572 46301 -9376 16067 74595 26883 46767 54000 84930 42483 130513 113432 56983
20086 56983 14240 88150 42044 -99742 -116216 -27114 -7622 15341 68367 81736 15307
20075 15307 8040 36888 71558 78266 28125 21761 6554 47458 63257 119541 104300 51175
20063 51175 -58879 -83377 19153 77937 61707 56756 32004 82661 36441 71430 129103
20052 129103 81115 -9462 -85735 -54280 -11666 50169 94501 84137 -25413 15022 88969
20041 88969 -14042 -33755 -23879 19028 36029 70841 107689 20489 -91596 -45300 114532
20030 114532 217876 156138 110469 48699 59041 33598 -1779 -6735 28770 131156 157314
20019 157314 169260 117196 28873 -17803 35611 55396 13052 -22821 -23585 85395 -24314
20008b4314n9523O9199M7251Q7138L6288o3674J7279P0333M0572r7162m4838l3022
19996D5527p8494j0938P9778J15722P5431n7244j16572n827K7770j2052N0140
19985A13241r0159p5704J22014k5786o0386n7482Q488L0026m1765Q8504K9719
19974D0710j9955J2668k6360K7792k4476N229O3139m8805m6679P0573J01518O6621
19962B21975p1076J9655j6495J8399L3494r8201j56240P681P6752j9539M6453
19951F2858J6995L3322P5132l4114l3756N4960j0176q8650l8803L940l8976J0380
19939A3112r314J4235N3032J8383j3413N7686n2149q1334r8067j36835M8931P7685
19927a08048K9294K1985L1099Q9874j4013K1784j6924j0237j5174K2774L5229
$$ plain form
20008 -24314 -83837 -14638 32613 119751 156039 92365 109644 179977 220549 123387 78549 45527
19996 45527 -32967 -43905 35873 151595 227026 169782 53210 47383 75153 63101 113241
19985 113241 23082 -52622 69392 43606 -16780 -74262 -65774 -35748 -77513 10991 40710
19974 40710 20755 33423 7063 34855 10379 15608 78747 29942 -16737 53836 155354 221975
19962 221975 150899 170554 154059 172458 205952 107751 -48489 -40808 35944 16405 62858
19951 62858 79853 113175 188307 154193 120437 175397 165221 76571 37768 41708 2732 13112
19939 13112 3798 18033 71065 89448 76035 133721 81572 238 -97829 -234664 -185733 -108048
19927 -108048 -78754 -56769 -25670 64204 50191 71975 55051 44814 29640 52414 87643
19916H7643J3296q3547n5549P8010N0692J17001k3804p7818j00558k6934k4044
19905d5612p5939L256Q3602J08668O4332K5741o7143K4853r403K862j9432n6526
19893C9259J26228P7844k3809k4835j17796k3538l0362l4469O0649J31662M9049
19882B29882n6894p4153k7111L6634q10N3547J9815k9537p8637k8943M1547o0121
19870B5219n9635Q590P3360O7510J7409j09020J0943P2136J3718k6738p9028N5165
19858F9629J2225k5341m7646K2838L7605J4216m1370r1047m0105j9715K0957R985
19846g7769K6201N1415p5687J8191Q3155Q9008q313o8397K0564R36J2969p0825
19834A448j37236r1964M4796M3512k2731j58540j20005o4671M974m7236P0362
$$ plain form
19916 87643 100939 17392 -38157 39853 90545 207546 183742 105924 5366 -21568 -45612
19905 -45612 -121551 -118295 -34693 73975 138307 164048 96905 121758 112355 115217 95785 39259
19893 39259 165487 243331 219522 194687 76891 53353 22991 -11478 49171 180833 229882
19882 229882 172988 98835 71724 108358 107548 161095 180910 151373 72736 43793 85340 25219
19870 25219 -34416 -25826 47534 115044 132453 23433 34376 106512 120230 93492 14464 69629
19858 69629 81854 56513 8867 31705 69310 83526 42156 -48891 -88996 -108711 -87754 -77769
19846 -77769 -51568 -153 -75840 -57649 25506 114514 106201 37804 58368 59304 72273 1448
19834 1448 -135788 -227752 -182956 -139444 -162175 -320715 -440720 -505391 -500417 -547653 -477291
19823d77291K8971M6703L6576O0783J36198J30662N2271M9285J28059J69556J32469
19812D94242K2749p0942l9223K4735K0053o2097l432k4698l7794P988P639m7560
19800B91660Q2704J39337j6945j06994m569N605j2821R1958M7384l4257j23259
19789C59803n9379J026l9225J1863N2893P0759N1170J8733L6157k9470L9293p5856
19777D37767l437k0099O2835Q9635K9684P5242O2259m095N1083Q6776J47360J24562
19765A139572j835J25215P8948K514J18494O5501L1686J31098O8744J02532J28427
19754A990896P5564r779O164P3748q7659K7832J20208j01950o3040Q5897O3585
19743B181466p3241j27045p2923p2919o1814K3728J04000O2446j4971K8616j37049
$$ plain form
19823 -477291 -448320 -401617 -365041 -304258 -168060 -37398 14873 64158 192217 361773 494242
19812 494242 516991 446049 406826 431561 451614 389517 386085 361387 323593 331581 339220 291660
19800 291660 374364 513701 496756 389762 385193 390798 377977 469935 517319 483062 359803
19789 359803 300424 301450 262225 274088 326981 397740 448910 467643 503800 474330 513623 437767
19777 437767 434330 414231 477066 566701 596385 671627 733886 729791 780874 867650 1015010 1139572
19765 1139572 1137737 1262952 1341900 1344414 1462908 1528409 1560095 1691193 1759937 1862469 1990896
19754 1990896 2066460 2056681 2062845 2136593 2048934 2076766 2196974 2095024 2031984 2117881 2181466
19743 2181466 2108225 1981180 1908257 1835338 1773524 1797252 1901252 1963698 1948727 1977343 1840294
19732A840294R568J13772M2026m6203q6229o5277R409K9060M549p602j4013p9261
19720A750093K7883m5168J4007Q9967k0071j2851K868O3061o968O7151L357l391
19708A929938J09895N2722R723j1358q7154K0382O7952M0197j2921k1070R3079
19697B191385P5965K6378Q9474L8523Q7027J27618Q2039J9920J29963Q0088J56366
19686C104746K27603L85105L48660K88172K64347K99899K31828J02519J06229
19677E359108Q0380M7497J05106M0865k8325J3635k9175j4893O5704J36688K00735
19666E977325K51915J67753J76585K59467K32896K81706M05558N12993O27285
19657H893483P10800Q42167J029717J104734J078655J271255J269139J116008
$$ plain form
19732 1840294 1849862 1963634 2005660 1959457 1873228 1807951 1817360 1846420 1850969 1843367 1829354 1750093
19720 1750093 1777976 1732808 1746815 1836782 1816711 1803860 1806728 1869789 1862821 1929972 1933329 1929938
19708 1929938 2039833 2092555 2102278 2090920 2003766 2024148 2092100 2132297 2119376 2098306 2191385
19697 2191385 2267350 2293728 2383202 2421725 2508752 2636370 2718409 2738329 2868292 2948380 3104746
19686 3104746 3332349 3717454 4066114 4354286 4618633 4918532 5150360 5252879 5359108
19677 5359108 5439488 5486985 5592091 5632956 5604631 5618266 5589091 5574198 5639902 5776590 5977325
19666 5977325 6229240 6396993 6573578 6833045 7065941 7347647 7753205 8266198 8893483
19657 8893483 9604283 10446450 11476167 12580901 13659556 14930811 16199950 17315958
19649A7315958J206213J544521J904936K153306K515687L006517L746267M928338
19641C8321743O514551Q615370J1759523J6169930K2394912L0562124L8539507
19634A72877660M2335479M1996210M1511353L7385450K0858379R13177q621670
19627C49256038q675609r060727k2118381m1946682m9211826m3110888l2960755
19620A42171170k3946915j7391300j2706882r429354p154915n502171m190209
19613F1849424l397201k852741k346920k019551j873446j820062j625755j703510
19605D4210238j764985j653953j584787j649438j623950j569683j489482j212334
19597C1661626j011340j031956j074966q95687p66195p46265p38049o43289n70299
$$ plain form
19649 17315958 18522171 20066692 21971628 24124934 26640621 29647138 33393405 38321743
19641 38321743 44836294 53451664 65211187 81381117 103776029 134338153 172877660
19634 172877660 215213139 257209349 298720702 336106152 356964531 357877708 349256038
19627 349256038 340580429 331519702 309401321 267454639 218242813 175131925 142171170
19620 142171170 118224255 100832955 88126073 78696719 71541804 66039633 61849424
19613 61849424 58452223 55599482 53252562 51233011 49359565 47539503 45913748 44210238
19605 44210238 42445253 40791300 39206513 37557075 35933125 34363442 32873960 31661626
19597 31661626 30650286 29618330 28543364 27647677 26881482 26135217 25397168 24753879 24183580
19588B4183580n44167l79442m10022m46464l53791k28677k53152l22420m45334
19579B0800111n78917n28089m01748n15630m83714o04585n97203o23270n24255
19570A5942700n35595n01390l32101l35568l20849l29114l47311l17229l64455
19561A2559088k62180k22927k13985l10691l71552k84461k44076k75740l02932
19552A0070544k72814j40360j45333j88965k43465l00223k11459r3476j44249
19543H330200j38101j44468j45886j82409j63091r3996l0435p9016j23248j64877
19533G064673j15069j54260p0303r646j34499j32592j54002j30230j56544k09444
19523E798084l1669k4476M2606j7487j04526m5050r3711j14721r5470N8558o137
$$ plain form
19588 24183580 23639413 23259971 22849949 22403485 22049694 21821017 21567865 21245445 20800111
19579 20800111 20221194 19693105 19291357 18775727 18292013 17687428 17090225 16466955 15942700
19570 15942700 15407105 14905715 14573614 14238046 13917197 13588083 13240772 12923543 12559088
19561 12559088 12296908 12073981 11859996 11549305 11177753 10893292 10649216 10373476 10070544
19552 10070544 9797730 9657370 9512037 9323072 9079607 8779384 8567925 8474449 8330200
19543 8330200 8192099 8047631 7901745 7719336 7556245 7462249 7431814 7352798 7229550 7064673
19533 7064673 6949604 6795344 6725041 6715395 6580896 6448304 6294302 6164072 6007528 5798084
19523 5798084 5766415 5741939 5784545 5767058 5662532 5617482 5523771 5409050 5313580 5372138 5366001
19512E366001p4749r8668N3817P2423k2669j52921q7384P3150j2860r3324p5839
19501D946977m3287k3588q5500q6652n7453r6669o5541j07022q755m1485j90701
19490D140324j69146j17421r158q0490r8395o6277n1113n5481M1994O8678N300
19479C608815o0808j36856r1116l7977k7200j1056l7653r2748n2400j32275j31282
19468B797444l4025p799m4328o8596j30890j45463n2673n6742k2909O325l1851
19457B208493m4836m6910n0113m6208p5893l5733o6344m5109j02732k2761j3685
19446A658169J7760j6089N4207J148L108P3270J63516J14708q6176J5212K4936
19435B023769J24111K8040o0910l1146j25338m7879o6819p9720j4753p194k4710
$$ plain form
19512 5366001 5291252 5192584 5246401 5318824 5296155 5143234 5055850 5129000 5116140 5022816 4946977
19501 4946977 4903690 4880102 4794602 4707950 4650497 4553828 4488287 4381265 4372510 4331025 4140324
19490 4140324 3971178 3853757 3844599 3764109 3665714 3599437 3548324 3492843 3534837 3603515 3608815
19479 3608815 3548007 3411151 3320035 3282058 3254858 3243802 3206149 3113401 3061001 2928726 2797444
19468 2797444 2763419 2755620 2711292 2642696 2511806 2366343 2313670 2256928 2234019 2240344 2208493
19457 2208493 2163657 2116747 2066634 2020426 1944533 1908800 1842456 1797347 1694615 1671854 1658169
19446 1658169 1675929 1659840 1714047 1715195 1718303 1791573 1955089 2069797 1983621 1998833 2023769
19435 2023769 2147880 2175920 2115010 2083864 1958526 1910647 1843828 1764108 1749355 1742161 1717451
19424A717451o7835r118j71893r5478N5026j69m4875k7588K3639K9394O6859N9517
19412A534930o1869r3078j22862m5911L6449Q1790m0324j2608j8457o6822k310
19401A188928k1209l1680q318R18n4529m7263r1514M6860N4736m6851k7843j4004
19389I48231J745J6491n9808m1460P3061K0332o7632j5381l4621J4358q6716l4245
19377G34355p7773r8311N8457J09494N6192L2204o5622n9799o5591J2326j06Q2971
19365G18797P2708J26085K2899j18731j85228p5864Q8952O3960l0535K7390m7159
19354F63274q2512m0009J7981K0552J1816K7123R717n2584R4747N2741n0485k6092
19342F46269p5322j37892m5572O9930N0634P2329m9712j27592r1761l5535M5801
$$ plain form
19424 1717451 1649616 1640498 1468605 1373127 1428153 1427984 1383109 1355521 1379160 1408554 1475413 1534930
19412 1534930 1473061 1379983 1257121 1211210 1247659 1329449 1289125 1276517 1258060 1191238 1188928
19401 1188928 1167719 1136039 1127721 1128639 1074110 1026847 935333 982193 1036929 990078 962235 948231
19389 948231 949976 966467 906659 865199 938260 958592 890960 875579 840958 855316 768600 734355
19377 734355 656582 558271 616728 726222 782414 814618 748996 689197 623606 635932 635826 718797
19365 718797 791505 917590 940489 821758 636530 560666 649618 713578 683043 710433 663274
19354 663274 580762 540753 558734 579286 591102 618225 627942 575358 670105 722846 672361 646269
19342 646269 570947 433055 387483 457413 508047 580376 530664 403072 311311 275776 321577
19331C21577n1033j095j9127J5589O6905K0993k3440o361O4659M4506m6847l5189
19319C51137J7662j19783J8734O7255o913k9149J2776R6330k3147q9377M3904
19308C39429P742n1320q6518Q429j6133n7714j8266L6696P44K2461O359N4518
19296B46427J7157j4056J9609N4968l1343l031J1480P3904m6851m2706l8069l3909
19284B13580l3768k3358j1438j6420L2584Q0627j7341j874Q0850o3438o0528N5565
19272B35041k0372j9464J2557j6507k4127J3238M8208n5846j9740K5890J2016
19261A90894L1486r374j4388K0491n7453O2168Q0596q5517l8272M0550k0442L149
19249B03888N76j3535m4210q567L8745M7131J4938j137k6715l7712J414O033O5980
$$ plain form
19331 321577 270544 269449 250322 265911 332816 353809 330369 324008 388667 433173 386326 351137
19319 351137 368799 249016 267750 335005 328092 298943 311719 408049 384902 295525 339429
19308 339429 347171 295851 209333 217762 201629 143915 125649 162345 163089 185550 191909 246427
19296 246427 263584 249528 269137 324105 292762 289731 301211 375115 328264 285558 247489 213580
19284 213580 179812 156454 145016 128596 161180 241807 224466 222592 303442 240004 179476 235041
19272 235041 214669 195205 207762 191255 167128 180366 228574 172728 152988 178878 190894
19261 190894 222380 213006 198618 219109 161656 223824 304420 218903 180631 221181 200739 203888
19249 203888 204464 190929 146719 138152 176897 224028 238966 237829 211114 173402 174816 180849 246829
19236B46829j25338j07912J0359L5842p2814r9400Q8781o5528m278O8513P4641
19225D9695L1753K1871l3309m6789L3261K5072j6975p3471L5080K1186l874o2954
19213a9454l949R3836N3876K669n587j69521n7852Q4801Q6043M3253m3327J354
19201F6142Q2456J7192o6551O0107p027r6015K8706M735m8779o2772q9585M7414
19189f3977R0081m0685k8081k7878Q3124K2851R5407n7132q04J12514k9327j03647
19177E2446n6445Q3512K8673J5153K73N3568j6549j28098p641J1234J9452R013
19165F4591j682N0796k1663Q388n5533p8557k331O5415m55n8756o5685o6658p8075
19152b40205N4352J31883J23713R4654N6996q4883m4728p5928L3451L8387R7147
$$ plain form
19236 246829 121491 13579 23938 59780 -13034 -112434 -23653 -89181 -93459 -24946 49695
19225 49695 81448 103319 70010 23221 56482 81554 64579 -8892 26188 47374 43500 -19454
19213 -19454 -23403 70433 124309 126978 121391 -48130 -105982 -21181 64862 108115 64788 66142
19201 66142 148598 165790 99239 159346 152319 56304 85010 89745 40966 -21806 -111391 -63977
19189 -63977 26104 -14581 -42662 -70540 12584 35435 130842 73710 72906 185420 156093 52446
19177 52446 -3999 79513 108186 123339 123612 177180 160631 32533 24892 36126 55578 64591
19165 64591 62909 113705 92042 100430 44897 -33660 -35991 29424 28969 -29787 -95472 -162130 -240205
19152 -240205 -185853 -53970 69743 164397 221393 136510 91782 15854 49305 87692 184839
19141A84839L6606r4395P471N9307n386j7378n1443l577q6985r5422M0659R4114
19129F8410j9658K1976N774p4996q1074l4629k518L8765p481j9056m6087N261
19117a45313N6248J8585Q5624n4264J4017M2496L9735J5111m4637k4233k4065
19106b0696J5926M1386k444l1643m5218l5265k201j6382N1169J27588J5021p7950
19094A9291j143L603K7789P265M0180m7432m6848o6897M2457j2121P500l4956
19082f1312j0293j2834p939L982O1226N3231n7683o0419k4563O9624R0817n4215
19070a0378Q668q4223k9868L1874P6374M2897j14251k6243j1524O6220K2164j1296
19058c9586l174k2810k4687M3965L1295K4208M4267R3205J23884j9012m5997j00724
$$ plain form
19141 184839 221445 127050 134521 193828 188442 171064 119621 116044 29059 -66363 -25704 68410
19129 68410 48752 70728 76502 1506 -79568 -114197 -116715 -77950 -85431 -104487 -150574 -145313
19117 -145313 -89065 -70480 15144 -39120 -25103 17393 57128 72239 27602 3369 -20696
19106 -20696 -4770 36616 34172 2529 -42689 -77954 -80155 -96537 -45368 82220 97241 19291
19094 19291 18148 21751 49540 56805 96985 49553 2705 -64192 -21735 -33856 -26356 -61312
19082 -61312 -71605 -84439 -92378 -88396 -27170 26061 -31622 -92041 -116604 -46980 43837 -10378
19070 -10378 -1710 -85933 -115801 -83927 -7553 35344 -78907 -105150 -116674 -50454 -28290 -39586
19058 -39586 -42760 -65570 -90257 -46292 -14997 9211 53478 146683 270567 251555 205558 104834
19046A04834o2508o5391J8572k6069n8357R0943J6370N8288K0836J6712K1692
19035A35922J9598l5851j1223o943m0933n2033J24j0050O6902m6212p4089O379
19023d8409M3321M4836o1124j6480N378M6573Q863Q111M7795k6567j3299r5182
19011e6184j4955L8256M8263J8110l1893P2047M6590j8145j6014R498L0818p5744
18999E0647j03011N5476O9989o6897J277m9501N8153N2381m7423M1021K4067r9418
18987a3239l5199J3429R2887M4692p628l0512N7901k2914l200Q1260P7023M6315
18975C00815J02160J01319K5568N755J55170K32641K15732K33331K87780K08561
18965A868832R1280n7315l1387o2921r3438j73154k18531k45144j48939j39852
$$ plain form
19046 104834 42326 -23065 -4493 -30562 -88919 2024 18394 76682 97518 114230 135922
19035 135922 155520 119669 108446 101503 60570 8537 8661 -1389 65513 19301 -54788 -48409
19023 -48409 -5088 39748 -21376 -37856 -32478 14095 22958 31069 78864 52297 38998 -56184
19011 -56184 -71139 -32883 15380 33490 1597 73644 120234 102089 86075 95573 126391 50647
18999 50647 -52364 3112 73101 6204 7481 -42020 16133 68514 21091 62112 86179 -13239
18987 -13239 -48438 -35009 57878 102570 94942 64430 122331 99417 96217 177477 254500 300815
18975 300815 402975 504294 529862 535617 690787 923428 1139160 1372491 1660271 1868832
18965 1868832 1960112 1902797 1871410 1808489 1715051 1541897 1323366 1078222 929283 789431
18955G89431j78359r6680r7071j01265j888m1216j10148q3210n314J122N3367
18944A28769j4259M6885O7899K0515o37Q737O648j0119l3255O0540N4613m2319
18932B94017k5270j3601J7746k4399j0031n709o1646p1515m1409P541O6577M4504
18920A76805p3675n4933J9979N9433O3006l5109n9218r501p6298R421j5296Q448
18908A3062j8342j1448O7530N7004K1326j5773P3456k9867K3709k0190q231n1979
18896A00257k4663o3163j6713J7632M6167L9234k7338O8360o0066K4815j2783
18885I1739n1420n571l2042O5531m0797p5662L8826O9787J4474k1976N7182O3198
18873A73269K3239j5883o1854r6341n5504Q636J02014k2198l7443o9021J7004
$$ plain form
18955 789431 611072 514392 417321 316056 314168 272952 162804 79594 74280 75402 128769
18944 128769 114510 161395 229294 249809 249172 257909 264557 254438 221183 281723 336336 294017
18932 294017 268747 255146 272892 248493 238462 232753 171107 99592 58183 65724 132301 176805
18920 176805 103130 48197 68176 127609 190615 155506 96288 86787 10489 19910 4614 13062
18908 13062 -5280 -16728 50802 107806 129132 113359 186815 156948 180657 160467 152236 100257
18896 100257 75594 12431 -4282 13350 59517 98751 71413 139773 79707 104522 91739
18885 91739 40319 34748 2706 68237 27440 -48222 -9396 60391 74865 52889 110071 173269
18873 173269 196508 180625 118771 22430 -33074 -24438 77576 55378 17935 -51086 -34082
18862c4082K3183j6362J6591J0543M565Q5519N0866o7488j09800o3543R5805Q3383
18850G9180m7131N3802K2413m4914o106n2510p4877k0410r239r389j1260N3874
18838f6567R4108M2969p9304k0223p7389o0135J57091j2374m7278J5553K6518
18827b7031n0014K7660Q8131K3264l4872k2114l4811l2667m0054l9588n0024j3253
18815b05373J592O5359R0012K0435k2352j5101M6920K3222n0308m3573n2129Q1231
18803f0065N1635m1277M912K3121O2820l2238r797N238k5510j2003O2954O0316
18791I0106p1222m4348o1407j7507l8415P9696L3493p4008J020P3931M4491j7850
18779b020n3541q860L488j2895J1062k5211m9547N9956j135l5955j1570P6673
$$ plain form
18862 -34082 -10899 -27261 -10670 -127 4438 89957 140823 73335 -36465 -100008 -4203 79180
18850 79180 32049 85851 108264 63350 57244 4734 -70143 -90553 -99792 -109181 -120441 -66567
18838 -66567 27541 70510 -8794 -29017 -106406 -166541 -9450 -21824 -69102 -53549 -27031
18827 -27031 -77045 -49385 38746 62010 27138 5024 -29787 -62454 -102508 -142096 -192120 -205373
18815 -205373 -203781 -138422 -48410 -27975 -50327 -65428 -18508 4714 -45594 -89167 -141296 -60065
18803 -60065 -8430 -49707 -44795 -21674 41146 8908 -889 4349 -21161 -33164 29790 90106
18791 90106 18884 -25464 -86871 -104378 -142793 -63097 -29604 -103612 -102592 -28661 15830 -2020
18779 -2020 -55561 -64421 -60933 -73828 -62766 -87977 -137524 -77568 -78703 -114658 -126228 -49555
18767d9555J1111j2578Q57M4770m9463J308k5789k3758k6826j9104j5367j9974
18755a84368J00547N8998L7214l1142M358J02605J9185p7417k5134m844l8790
18744c8788P718L457k0416j1223m5647j7332M2439J5632j0828O69M0560k2843
18732e6602J3503p8917l0606J8360N1771K8189N0271m6870O576O6196L9274q407
18720E2738q9911n215L5156R353n3343o2962mJ14720L9029Q729o1048R219K8598
18707B5059m4855r8890r760N4621K5004o2299N0100Q0119r086m6274R536j40601
18695a67326l2674J1234K5888M6012J7817M7210N3406M5940n2725l5422q396j7204
18683f6240M4258M400m1410n6939M5154J17890n0511r0917l191J24235L866l2474
$$ plain form
18767 -49555 -38444 -51022 -50165 -5395 -54858 -53550 -79339 -103097 -129923 -149027 -164394 -184368
18755 -184368 -83821 -24823 12391 -18751 -14393 88212 107397 29980 4846 2 -38788
18744 -38788 -31070 -27613 -48029 -59252 -104899 -122231 -79792 -64160 -74988 -74319 -33759 -56602
18732 -56602 -43099 -122016 -152622 -134262 -82491 -54302 -4031 -50901 -44325 21871 61145 52738
18720 52738 -37173 -42388 -7232 2121 -51222 -114184 -114188 532 39561 48290 -12758 -3539 25059
18707 25059 -19796 -118686 -128446 -73825 -48821 -111120 -61020 19099 10013 -36261 -26725 -167326
18695 -167326 -200000 -188766 -162878 -116866 -99049 -51839 1567 47507 -5218 -40640 -49036 -66240
18683 -66240 -21982 -17582 -58992 -115931 -70777 47113 -3398 -94315 -97506 26729 30595 -1879
18671a879L3317j535k1747K7160n7591m7187L9504m1602M3217k0934r950L4179
18659b5048j5013l2029l9309l4412M8269K6414n957n6530R5954J8838j02664K5041
18647i6446Q7104q41O3247R0923l6388j07520L072m1024l0467Q1787K8118m3275
18635a710K1781m6522r047j7642O3426o34K6925N2077N7064o9536r1900q2633
18623i8351O0343J56896O1225j15212L880l4224J7686O068l9633l6711M5347J3222
18611D0536l6048o844j4019O1691Q7931j13913q9449k6484R128L3918j5688l3702
18599a02943N0459J00291J5908j3483n1951n5158p8588j2070M2281r6232R4032
18588a07454K1175K55l4592K6738L0571J7412K6837m0776o757K6379J9211M0333
$$ plain form
18671 -1879 31438 29903 8156 35316 -22275 -69462 -29958 -71560 -28343 -49277 -59227 -25048
18659 -25048 -40061 -72090 -111399 -145811 -97542 -71128 -77085 -133615 -37661 -18823 -121487 -96446
18647 -96446 -9342 -10183 53064 143987 107599 79 3151 -37873 -68340 13447 41565 -1710
18635 -1710 20071 -26451 -35498 -53140 10286 9652 36577 88654 145718 76182 -15718 -98351
18623 -98351 -38008 118888 180113 64901 68781 34557 52243 58311 18678 -18033 27314 40536
18611 40536 4488 -2356 -16375 45316 133247 19334 -70115 -96599 -87471 -53553 -69241 -102943
18599 -102943 -52484 47807 63715 50232 -1719 -56877 -135465 -147535 -105254 -201486 -107454
18588 -107454 -86279 -86024 -120616 -93878 -63307 -45895 -19058 -59834 -66591 -40212 -21001 19332
18576A9332N8995N8996o6419j39204K33L0178M875M7838N450l4618m895j7177
18564c6416K6010N1251L8L056k3441l2925p606j9964j414k8621m9145m7862k5736
18551a92775J9203P5530J9690o6541o1325J10548P3743N5953J7629m268o4142
18540a6755j05867k6635O0890Q2596q1332k5734K2938j5753O7915R0389M7304
18529I9956l7792l3403l0183J5168j6673m9678K6063m0346j9484j2264M7411M8180
18517c045M6149j988n0323o8157J6227O7957l0886o8723j6449J00888Q768q7691
18505h7273o9413k2026L7706M620m5085N0980m1806j9192K397J4737Q8957L2168
18493e3230N6982l5845n3694J29038M9391N4101r4435l2145k9916K4442J6843
$$ plain form
18576 19332 78327 137323 70904 -68300 -68067 -37889 -33014 14824 20274 -14344 -19239 -36416
18564 -36416 -10406 40845 40883 43939 20498 -12427 -20033 -39997 -41411 -70032 -119177 -167039 -192775
18551 -192775 -173572 -98042 -78352 -144893 -206218 -95670 -21927 34026 51655 47387 -16755
18540 -16755 -122622 -149257 -88367 -5771 -87103 -112837 -89899 -105652 -37737 52652 99956
18529 99956 62164 28761 -1422 13746 -2927 -52605 -26542 -66888 -86372 -98636 -51225 -3045
18517 -3045 43104 41116 -9207 -77364 -61137 6820 -24066 -92789 -109238 -8350 418 -87273
18505 -87273 -156686 -178712 -141006 -136386 -181471 -130491 -172297 -191489 -189092 -174355 -85398 -53230
18493 -53230 3752 -32093 -85787 43251 92642 146743 52308 20163 -9753 14689 31532
18482C1532L757r7481L5613M6291L8464J2328k2039K989M8217K0404m8275L4480
18470A06280N4478n159k6781j37716m2153J8197N2754N25l6169l07L984M0851
18458B8784M184o37k2543l088N838r0569J1925J2591J18532J18912o03n3173n1676
18445G8477p3976N161L8751j4485k2882O260J12699j2840k1438M6329p9685j21374
18433e9003q9380k249O3620m115M4807R9244j40856q4320Q7898J07848p1319l4876
18421h2701M5348N7250L7291L7884P4076r2790P378J3224r3194Q662j3820P7477
18409G6085J0333j7016k033m6081j00532r8569k1882J549K994j32j084J7298P9390
18396i9680O5010j3732l4509Q7467L6072j0490l9745J9679P079l2424m510m7522
$$ plain form
18482 31532 35289 -62192 -26579 19712 58176 70504 48465 51454 99671 120075 71800 106280
18470 106280 160758 155599 128818 -8898 -51051 -32854 19900 20425 -15744 -16051 -12067 28784
18458 28784 32968 32331 9788 6700 12538 -78031 -66106 -53515 65017 183929 183326 130153 78477
18445 78477 4501 9662 48413 33928 11046 17306 130005 117165 95727 142056 62371 -59003
18433 -59003 -148383 -150632 -87012 -91127 -46320 52924 -87932 -172252 -84354 23494 -47825 -82701
18421 -82701 -37353 19897 57188 95072 169148 76358 83736 96960 3766 12428 -1392 76085
18409 76085 86418 69402 67369 21288 -79244 -177813 -199695 -198146 -195152 -195284 -196368 -179070 -99680
18396 -99680 -34670 -48402 -82911 4556 40628 30138 -9607 10072 17151 -15273 -19783 -67305
18384f7305O8720N4975l4677j05971m6638J3664K3515m547q1468J96346L7538
18373E4152j2689J7799k3229k6967m0059o379o834J1887j24742l5348P6003L7699
18361g8707j3930o1438L3625j4295M915o9476O256N1025R5223O3864K0194m324
18349C2932N2445l5045m7396n6641J7614K1220l0224l267P7189j1416L5181L3212
18337H5804k8436r6428l4966l0123j6980N2855K4568K6729P4459Q963l6348L6169
18325F6266n5146j36666l0931J4766K2153j3507j0123M263L5424J22592L9858
18314E8949J2779l5240p1912k3293Q251J6510Q4427o1438o9780O0814p034l7372
18302f4339o2306M8168K0549N371N2000j688o191P5971Q07l8282J5294j6890n682
$$ plain form
18384 -67305 1415 56390 21713 -84258 -130896 -117232 -93717 -98264 -179732 16614 54152
18373 54152 41463 59262 36033 9066 -30993 -37372 -44206 -32319 -157061 -192409 -116406 -78707
18361 -78707 -92637 -154075 -120450 -134745 -129830 -199306 -193050 -142025 -46802 17062 37256 32932
18349 32932 85377 50332 2936 -53705 -36091 -14871 -45095 -48362 28827 17411 52592 85804
18337 85804 57368 -39060 -74026 -104149 -121129 -68274 -43706 -16977 57482 66445 30097 66266
18325 66266 11120 -125546 -156477 -141711 -119558 -133065 -143188 -138925 -103501 19091 58949
18314 58949 71728 36488 -35424 -58717 -50466 -33956 50471 -10967 -80747 -19933 -26967 -64339
18302 -64339 -126645 -78477 -57928 -52557 -557 -2245 -8436 67535 68342 30060 45354 28464 22782
18289B2782M771K0904Q4201J8019p7747j18176O7315l159m8096o1145o0003K3911
18277a26423N2838r4451j3178J04130O9786k1560o1261p3547L0698N3984q4671
18266a63655L58Q3902J42255n3794j5214P0147k0389j2580m394l9085K2679l9652
18254b9422j07873o3748K4241M1474O620k0083O0808J58569k7458q5464M4646
18243B310O2071o7875q9989K2992K2044N4059O4403l8511l2186j0615O1071j4366
18231C5408J4480n3379k857N8486P0931O0527l0919r9696o0392O2397m3929n7570
18219d6513q6299O0278O6630j4918q3813n5136N573O6878K6491o0249q921l6683
18207a66682R6010Q0087K2978k5021r952M4994M1999r1275j47307n966R5682R709
$$ plain form
18289 22782 27553 48457 132658 150677 72930 -45246 22069 18910 -29186 -90331 -150334 -126423
18277 -126423 -73585 -168036 -181214 -77084 -7298 -28858 -90119 -163666 -132968 -78984 -163655
18266 -163655 -163297 -79395 62860 9066 -6148 63999 43610 31030 26636 -12449 10230 -29422
18254 -29422 -137295 -201043 -176802 -135328 -128708 -148791 -87983 70586 43128 -42336 2310
18243 2310 64381 -3494 -93483 -70491 -48447 5612 70015 31504 -682 -11297 49774 35408
18231 35408 49888 -3491 -6348 52138 123069 183596 152677 52981 -7411 54986 11057 -46513
18219 -46513 -132812 -72534 -5904 -20822 -104635 -159771 -154198 -87320 -60829 -121078 -129999 -166682
18207 -166682 -70672 9415 32393 7372 -2580 42414 84413 -6862 -154169 -160135 -64453 -54744
18195e4744k0152K4137N1734m9562k2937J58739K4580o0283k6794J6502j7755
18184B3465j4631M8022K8900j1839m9128k471o2669r6654R4441M7195m0729M4146
18172H048k7002L327j4860j6241M0370Q2962K5333k8119J7604k2592k9084O0361
18160A00107l2287N111J8923m1846L7546m4134l9798O2133R9217K7548l1671o8920
18148I1929r7052L1407n862l5297q8998J6693N0536N8203K912j79871M5738P2635
18136c7027Q6028j5080L9538M1426p7815l3685k398J287P007P6183k6694o0980
18124b210m5206N2515O2829N4251k10k1905j21117m9890L5740O9203J0068J681
18112D5749j7190p0633N810j9356p9118J56R7163J23330K7733q0113r4259j4261
$$ plain form
18195 -54744 -74896 -50759 975 -48587 -71524 87215 111795 51512 24718 41220 23465
18184 23465 8834 56856 85756 73917 24789 22318 -40351 -137005 -42564 4631 -36098 8048
18172 8048 -18954 -15627 -30487 -46728 -6358 76604 101937 73818 91422 68830 39746 100107
18160 100107 67820 72931 91854 50008 87554 43420 3622 65755 164972 192520 160849 91929
18148 91929 -5123 26284 20422 -14875 -103873 -87180 -36644 21559 24471 -155400 -109662 -37027
18136 -37027 49001 33921 73459 114885 37070 3385 987 2274 9281 85464 58770 -2210
18124 -2210 -47416 5099 67928 122179 121969 100064 -21053 -70943 -35203 34000 44068 45749
18112 45749 28559 -42074 -36264 -55620 -134738 -134582 -37419 85911 113644 33531 -60728 -74989
18100g4989Q522M2944K0314J3251Q774p2156p1546P096K9468l3397L7840P3227
18088a0652j05328o7626k4785M368j9916K2068K6192M2748P0976L7882n6460o0823
18076a41356J7577O5006M7350L0545q3481n9916n855M0755M0550J3325N0357L6026
18064E0883l1431r3491k1102p5071j9255M9061J17696j3828K8647J15579K6309
18053A33997n3882m6335r5153L3277N0046M3688o0793n8475M1351J7560j284j7748
18041a3751j17754r2116m4370M2915j9067J13116M1010k0048j9191l7475N5365
18030a11366O6381Q3848l4575l7014K1699L039J5230K9451k9223m98l1839K8341
18018C474l2098k422J9993l9292o6212j2449N1857M3581m4871n1298M3477K8967
$$ plain form
18100 -74989 -66467 -23523 -3209 10042 18816 -53340 -124886 -117790 -88322 -121719 -83879 -10652
18088 -10652 -115980 -183606 -208391 -204023 -223939 -201871 -175679 -132931 -61955 -24073 -80533 -141356
18076 -141356 -123779 -58773 -11423 19122 -64359 -124275 -130130 -89375 -48825 -35500 14857 50883
18064 50883 19452 -74039 -95141 -170212 -189467 -140406 -22710 -36538 -7891 107688 133997
18053 133997 80115 33780 -61373 -28096 21950 65638 4845 -53630 -12279 5281 3997 -13751
18041 -13751 -131505 -223621 -267991 -225076 -244143 -131027 -90017 -110065 -129256 -166731 -111366
18030 -111366 -44985 38863 4288 -32726 -11027 -7988 7242 36693 7470 6972 -24867 3474
18018 3474 -28624 -31046 -11053 -50345 -116557 -129006 -77149 -33568 -78439 -129737 -86260 -57293
18006e7293L1505m4522n8105Q8935R649l0568m9107K5886p647O8653K934R104
17994a0576J5889M2392m9090n5888O7093k560n5282k8000J0651J2351M1519l7923
17982d9424r286M5791l780n4598L4744O0106J2678j7117k6876L3470J5745l2101
17970I352K1909m1012Q8M1668K8802m1541K5516r821P9426k8804r6687k0824M5512
17957A3584l8050K4801M0336O2380J1338L614K9241K9436p5868p605l1984q5261
17945b4038M0774N9844p4969o3074n6481J4692P2604J3394N5065o7148r4053j4031
17933a37421K5957J10737J01627l009k3512R8L0570K1942o2929j7322L3044k3811
17921E5971k0758R3657L5636l8898P185n2059j1569k7697l6773m49j1515l5566
$$ plain form
18006 -57293 -25788 -70310 -128415 -39480 -29831 -60399 -109506 -83620 -91267 -22614 -19680 -10576
17994 -10576 5313 47705 -1385 -57273 9820 7260 -48022 -76022 -65371 -53020 -11501 -49424
17982 -49424 -58710 -12919 -16699 -71297 -36553 23553 36231 19114 -7762 25708 41453 9352
17970 9352 31261 -9751 -9663 32005 60807 19266 44782 34961 114387 85583 -11104 -31928 13584
17957 13584 -24466 335 40671 103051 114389 118003 147244 176680 100812 93207 61223 -24038
17945 -24038 16736 76580 1611 -61463 -117944 -103252 -30648 -17254 37811 -29337 -123390 -137421
17933 -137421 -111464 -727 100900 97891 74379 74477 105047 126989 64060 46738 79782 55971
17921 55971 35213 128870 164506 125608 132793 80734 69165 41468 4695 4246 -7269 -42835
17909d2835K6764l3497j16768p727K3838O7478N0148Q250J3348N4571o129k6215
17897A1226j9205L4578J8518l4207J1514j4311p237l0669k9702L6940N5847P8679
17885A11971K970n8055O747l94k3252j217K8889q5748j50717N9543J10474k5400
17873b4189n8638j8404O2660m866j0691N3097J680Q290M7636p083N21o2459q8909
17860a01355K8960j9434M9198N0692j7744k2343N5019k0697j6253N024N5835O5494
17848A12396n733M385J2607J1959k9658q2329q7609J6859K9432M267O1442M0354
17836H8372r2762o8690N9413N036M8170o3687j17414j9505R0808Q2794L3217n9292
17824a3540n8639m1160l8089K9004M0640O3743k1076p9814j5096Q3255L6371J161
$$ plain form
17909 -42835 -16071 -49568 -166336 -174063 -150225 -82747 -32599 -24349 -11001 43570 37441 11226
17897 11226 -7979 26599 45117 10910 22424 8113 876 -29793 -59495 -22555 33292 111971
17885 111971 114941 56886 63633 63239 39987 38770 67659 -18089 -168806 -109263 1211 -24189
17873 -24189 -82827 -101231 -38571 -43437 -54128 -1031 649 8939 56575 49492 50013 -12446 -101355
17860 -101355 -72395 -91829 -42631 8061 -9683 -32026 22993 2296 -13957 -8933 46902 112396
17848 112396 106663 111048 123655 135614 105956 23627 -63982 -47123 -17691 -13424 48018 88372
17836 88372 -4390 -73080 -13667 -8631 39539 -24148 -141562 -161067 -70259 12535 45752 -13540
17824 -13540 -72179 -113339 -151428 -122424 -81784 -18041 -39117 -118931 -134027 -50772 -14401 -13240
17812a3240J2830J1075J0698k0085J9796M1729J9958l4538j00374o3286J2013
17801a03424R7411J9987r496l2043O3751Q1319l427p7045k2157j1537o6516J6224
17789d6953J7612p8743l4283J3549L8081m5805m1667J30333R6954L4372o9597
17778A3853l9393O6351q817k6948L4299O1964p8722o6768j4791K4012K2050J3336
17766D26j7778j01432K3466l8933k7107N7315R2842M2941L8785L6700K783J8190
17754A28198q2905p5239p026J0973o179J1139l2520j593j793L0319k2344o7573
17742a16543J04707j8062o9602m2174p706K0898Q9021l4293R652J07825m0090
17731C633q6413k5884N315L6223M8210l1909L625J4461n4283k2123O379J04425
$$ plain form
17812 -13240 -410 10665 21363 1278 21074 62803 82761 48223 -52151 -115437 -103424
17801 -103424 -6013 13974 4478 -27565 36186 117505 114078 37033 14876 3339 -63177 -46953
17789 -46953 -29341 -108084 -142367 -128818 -90737 -136542 -178209 -47876 49078 83450 13853
17778 13853 -25540 40811 31994 5046 39345 101309 22587 -44181 -58972 -34960 -12910 426
17766 426 -17352 -118784 -95318 -134251 -161358 -104043 -11201 31740 70525 107225 110008 128198
17754 128198 45293 -29946 -36972 -25999 -32178 -21039 -53559 -55152 -56945 -26626 -48970 -116543
17742 -116543 -11836 -29898 -99500 -141674 -149380 -128482 -39461 -73754 -64102 43723 3633
17731 3633 -82780 -108664 -103349 -67126 -18916 -50825 -47200 -32739 -87022 -109145 -102766 1659
17719A659L3409j8413P085K8789J3894k3669n0953o6928o3284J10659P1291q5272
17707d1733q4827k4504M0855M5342l1252K8761L5721n8906K9016K2101J6389K7873
17695D836n4768N441M0229N3163N4136K7425J9567J3719q2715n8996n7648K921
17683c2690r9260J6271P3728j214l5491p283M0791p6123N5667K6677J0781K4423
17671c723P3696k8873q5147o1337L4587M8412J5397O6981M1325L4131m1059j2303
17659H2087O2771K831j62590n9973Q4735k3281n0140L3836N0170O5130L3615k2617
17647I6574R245N1812L141j23264Q105K6476o1038n2340Q3945n4215k7873l6530
17635g5962m9754P4281M3741N8797n0543o3984O1065j2764L4331k3119n7885l7619
$$ plain form
17719 1659 35068 16655 23740 52529 66423 42754 -8199 -75127 -138411 -27752 43539 -41733
17707 -41733 -126560 -151064 -110209 -64867 -96119 -67358 -31637 -90543 -61527 -39426 -23037 4836
17695 4836 -49932 -44491 -4262 48901 103037 130462 150029 163748 81033 22037 -35611 -32690
17683 -32690 -131950 -115679 -41951 -43165 -78656 -85939 -45148 -121271 -65604 -38927 -28146 -3723
17671 -3723 69973 41100 -44047 -105384 -70797 -22385 -6988 59993 101318 135449 94390 82087
17659 82087 144858 147689 -14901 -74874 9861 -13420 -63560 -29724 20446 85576 119191 96574
17647 96574 105819 157631 160772 37508 45613 72089 11051 -41289 42656 -11559 -39432 -75962
17635 -75962 -125716 -51435 -7694 51103 560 -63424 -2359 -15123 19208 -3911 -61796 -99415
17623i9415L7523M4710M6782J11748K0558N9282o0863q3716m693J0006n6456L3233
17611E8699M1802O7726j7580n8571k6787r58L7183K4061n0520l3416N732L5061
17599H2432K1169p3221R0437k8927K9068K9385j3171o7757J4409P1811k0493Q034
17587A43176L7527K2537J2281n6293n557K5844j4152n6032j17602p4152k6869
17576a09292K8160M2868L2211M0459M282L3326j09826q4326j0852N2211J03697
17565B2918P451J1062j5928L354J2397k0062m1390K8037Q0504j6931j39644r9151
17553a67383K4986J06727l338k7229o768L90K7999l4096m7751N4768P9282N0953
17541E8540m430N3236K496r954j64176n0569O2127J21281Q845O9979N5691q8866
$$ plain form
17623 -99415 -61892 -17182 29600 141348 161906 221188 160325 76609 71916 81922 25466 58699
17611 58699 100501 168227 150647 92076 65289 64331 101514 125575 75055 41639 47371 82432
17599 82432 103601 30380 120817 91890 120958 150343 137172 69415 83824 155635 135142 143176
17587 143176 180703 203240 215521 159228 153671 179515 165363 109331 -8271 -82423 -109292
17576 -109292 -81132 -38264 -6053 34406 38688 72014 -37812 -122138 -132990 -80779 22918
17565 22918 30369 41431 25503 28857 41254 21192 -20198 7839 88343 71412 -68232 -167383
17553 -167383 -142397 -35670 -39008 -66237 -73005 -72615 -44616 -78712 -126463 -71695 7587 58540
17541 58540 54110 107346 109842 99888 -64288 -114857 -52730 68551 77396 147375 203066 114200
17529A14200m5347j23186n0726M4157L9872J00313M2593n1435M926J7528P057
17518I9952J2406J25607R8397j00607K6287R9927J11410J50146K93330L26938
17508A243793L03131K63266L45553K21872q6354j92233r2541J28607O0999l01835
17498A894258m70249l52501l28997k57981j06670r0112n8184K943O9389p2687
17488B29209o7621M5480N6521m1701l5991O408Q6417M211n1154l8106Q780j1859
17476A90594j7480K3568O8237k1614l8910J5586j06747k0086P2611m9082J2770
17465A29447J7016K2908r7106j8529L0157o5755K3032k918j3634Q3178M1670k9298
17453A20168l8535N6305K8193M8888J533q5815P811L1876j22172k5026j1281k4552
$$ plain form
17529 114200 68853 -54333 -105059 -60902 -21030 79283 121876 70441 75367 92895 99952
17518 99952 112358 237965 336362 235755 262042 361969 473379 623525 916855 1243793
17508 1243793 1546924 1810190 2155743 2377615 2291261 2099028 2006487 2135094 2196093 1894258
17498 1894258 1424009 1071508 742511 484530 377860 287748 229564 232507 301896 229209
17488 229209 161588 207068 263589 221888 185897 192305 278722 282933 231779 193673 202453 190594
17476 190594 173114 196682 264919 243305 204395 219981 113234 93148 165759 116677 129447
17465 129447 146463 169371 72265 53736 83893 18138 41170 38252 24618 107796 149466 120168
17453 120168 81633 137938 166131 215019 216552 130737 138548 170424 48252 23226 11945 -12607
17441a2607P7247l1516j21744J4479P9228P2693N812p6531m4206m634J9285Q5049
17429F2555K7356q4674l7656k9554K2515m7785q4460L995J26892P7295l3184m903
17417a608N385M3174L0981M1292K4819M3120k2587L8986M1400r5050o7916K6315
17405A08311p0614j3230K4910j3769p4621r8285l3734J41244R9923K2095L6964
17394A29194O228q0606p2226O3588k1084O6971R1189n3452n6621L1964l4716l2657
17382C7772p778k9555N4828J4373p8782l9346K4287n489O111o0602l6615J26089
17370E293M0327K5374P7169P5395m3365o1537n3597j6890L6522J1249k0084k9038
17358D6818n8856k7026j3451R688P5250k5889p4579j341O9240j2815m310O8731
$$ plain form
17441 -12607 64640 33124 -88620 -74141 5087 77780 83592 7061 -37145 -41779 -22494 62555
17429 62555 89911 5237 -32419 -61973 -39458 -87243 -171703 -167708 -40816 36479 3295 -1608
17417 -1608 3777 46951 77932 119224 144043 187163 164576 203562 244962 149912 81996 108311
17405 108311 37697 24467 49377 35608 -39013 -137298 -171032 -29788 70135 92230 129194
17394 129194 135422 54816 -17410 46178 25094 92065 183254 129802 73181 105145 70429 37772
17382 37772 29994 439 55267 69640 -9142 -48488 -24201 -29690 -23579 -84181 -120796 5293
17370 5293 45620 70994 148163 223558 180193 118656 65059 48169 84691 95940 75856 46818
17358 46818 -12038 -39064 -52515 -42827 32423 6534 -68045 -69386 -146 -12961 -17271 51460
17346E1460K4616K4531L5043l5954O764n9647j07534o8775J5069M6384L6627l8252
17334f9668o5027L7334Q1214R4882l8239m9351j32642n8675R5918J26568P8570
17323A00884K0443N9916k9623m2371o8153k7093j7833J4719J9360q8534o7967
17312a26252J40400N9617j4836l9639m1835j886M8488J6617o4222k362m3081M2265
17300b6726K4580M9812J7327L9271j0983o8256r301J4602N526j5156J1249J1237
17288D3182L8587P5952o9451k0118j6467q7273Q1914J34640m7509j19474l0158
17277a6175K605N3801J1603n4227l5285O2889l8494l7329O313l3075n250k7025
17265a09649m0509J3522J04808o632l0944J1136J56281O2125j28320j18230O0271
$$ plain form
17346 51460 76076 100607 135650 99696 106460 46813 -60721 -129496 -114427 -68043 -31416 -69668
17334 -69668 -134695 -97361 -16147 78735 40496 -8855 -141497 -200172 -104254 22314 100884
17323 100884 121327 181243 151620 109249 41096 14003 -3830 10889 30249 -58285 -126252
17312 -126252 14148 73765 58929 19290 -22545 -24431 24057 40674 -23548 -25910 -68991 -26726
17300 -26726 -2146 47666 64993 104264 93281 25025 15724 30326 35852 20696 31945 43182
17288 43182 81769 157721 88270 68152 51685 -35588 46326 180966 133457 13983 -16175
17277 -16175 -13570 40231 51834 -2393 -37678 25211 -13283 -50612 -44299 -77374 -82624 -109649
17265 -109649 -150158 -136636 -31828 -38460 -69404 -58268 98013 160138 31818 -86412 -26141
17254b6141O9784k1821j8470k5510R9129J9076Q228n610n7893p6318K0802l0119
17242d4863m6293L5993l9687N5911M1367K0205p4547l3165K0951q2126P919K9322
17230a09013Q1976N1774J32172L9153l4662j01689n6293p1938j7987K6022P7461
17219A6976r5579K314J06698J8874J35477Q4958n8189L2462J8278r6891p8028
17208H7350k5946N2658Q2034n7487l4467K6079m2740L7433l2783r7053M339N6627
17196E6044R6400N4561n3881m9351K7603j3912j05546r8115K6554m068O9437L0154
17184C5880k480q1388p9125L5048M3783m803p5389n6404o6883J5752J8387L2882
17172a84740J09467L4890q5499j8391K1941q031J7652J7070P3l5710j24933N4335
$$ plain form
17254 -26141 43643 21822 3352 -22158 76971 96047 104275 98665 40772 -35546 -14744 -44863
17242 -44863 -91156 -55163 -94850 -38939 2428 22633 -51914 -85079 -64128 -146254 -138335 -109013
17230 -109013 -27037 24737 156909 196062 161400 59711 3418 -68520 -86507 -60485 16976
17219 16976 -78603 -76289 30409 49283 184760 269718 211529 243991 262269 165378 87350
17208 87350 61404 114062 196096 138609 104142 130221 87481 124914 92131 -4922 -583 56044
17196 56044 152444 207005 153124 103773 131376 117464 11918 -86197 -59643 -63711 5726 35880
17184 35880 33400 -47988 -127113 -92065 -48282 -53085 -128474 -184878 -251761 -236009 -217622 -184740
17172 -184740 -75273 -40383 -125882 -144273 -122332 -130363 -112711 -95641 -95568 -131278 -256211 -201876
17160b01876Q6901L4623N1581q6707j16458m2608j9843j825m6576j3929j45638
17149e02355j16636j6973K3032j4872j10507J4166R3526K07691J38490O6866Q9968
17138a27604K08324J86040J53236N6050m8961o2719p6101q5443k6540J04908M9871
17127C31061l7817n9593k913L0086N128N6093m21l5254L1821k5702n6193k5397
17115B10899m6264m9523L9193O1678M7493P31j10773m2235M1843K0103j1665l8292
17103A23188j10317m721K8841O1650O5835K392M2396J05871K6431K9190P3054
17092D43810O9487O4189J12945N7131J4667J18848J08329O6379Q262L4090J13509
17081A211646Q1109J55880R5260K0485J44501L2430P4689J60946k7154R6534k4300
$$ plain form
17160 -201876 -114975 -80352 -28771 -115478 -231936 -274544 -294387 -296212 -342788 -356717 -502355
17149 -502355 -618991 -635964 -612932 -627804 -738311 -724145 -630619 -422928 -284438 -217572 -127604
17138 -127604 80720 266760 419996 476046 427085 364366 288265 202822 176282 281190 331061
17127 331061 293244 233651 230738 260824 265952 322045 321624 286370 318191 292489 236296 210899
17115 210899 164635 115112 154305 215983 263476 264207 153434 111199 153042 173145 161480 123188
17103 123188 12871 8150 36991 98641 164476 166868 209264 315135 341566 370756 443810
17092 443810 513297 577486 690431 747562 762229 881077 989406 1055785 1064047 1098137 1211646
17081 1211646 1292755 1448635 1543895 1564380 1708881 1741311 1816000 1976946 1949792 2046326 2022026
17070B022026j48303K7574k8346r2669j52229r0627K1731R7932N8461p1845m7649
17059A596056p7799j6690L6034m3313k792j102q1745N1333o2492j44543l9889
17048A213058n415M6040m709k2718J8552J9364M8386K3559p848l0074q8536n0160
17036A159499J00391J36540N2204l7442J4990j5542j01032R186P601O6716j6564
17025A376547k3615M8244n37J9480L3261p223O5044L8265q467J9751K791l7451
17013A526090l7459O9870J14681M4498O1412K7837o8296n3934M7708k4020K9231
17002A737618O2045R4927J18335J1038j8222M2270J45867R8558J1335k2088Q4555
16991B366238J43580J30391J92682J99051J44299K22420K46774J66303J70716
$$ plain form
17070 2022026 1873723 1901297 1872951 1780282 1628053 1537426 1559157 1657089 1715550 1643705 1596056
17059 1596056 1518257 1501567 1537601 1494288 1491496 1490394 1408649 1459982 1397490 1252947 1213058
17048 1213058 1207643 1253683 1248974 1226256 1244808 1264172 1312558 1336117 1328269 1298195 1209659 1159499
17036 1159499 1259890 1396430 1448634 1411192 1426182 1410640 1309608 1318794 1326395 1393111 1376547
17025 1376547 1352932 1401176 1400639 1420119 1453380 1446157 1511201 1549466 1540999 1560750 1563541 1526090
17013 1526090 1488631 1558501 1673182 1717680 1779092 1806929 1738633 1684699 1732407 1708387 1737618
17002 1737618 1799663 1894590 2012925 2023963 2005741 2048011 2193878 2292436 2303771 2281683 2366238
16991 2366238 2509818 2640209 2832891 3031942 3176241 3398661 3645435 3811738 3982454
16982C982454J44392K26195M05482M18282L74217L85219L93638M85726O73890
16973G489495O40702P15689Q90272J026716J389927J642190J959513K330955K972975
16964B1058434M075001N479923P608547J0980992J6604815K7035198M4674755
16957A37517665O0413198N3826026M7518720P0099918O3484226j0113752l1212746
16950C91533255k3018756O268200J6664461o0017389r3077182o7744681m2639148
16943A27968760k5907358j6156418j1172229q104259o039012m494415l164688
16936E2930381k659057k504645k330585j954504j606621j496089j308955j285914
16928C7784011j396469j321366j131891j121073j151722j153287j135060j031045
$$ plain form
16982 3982454 4126846 4353041 4758523 5176805 5551022 5936241 6329879 6815605 7489495
16973 7489495 8130197 8845886 9736158 10762874 12152801 13794991 15754504 18085459 21058434
16964 21058434 25133435 30613358 38221905 49202897 65807712 92842910 137517665
16957 137517665 197930863 251756889 299275609 369375527 432859753 422746001 391533255
16950 391533255 368514499 374782699 391447160 331429771 238352589 170607908 127968760
16943 127968760 102061402 85904984 74732755 66628496 60589484 56095069 52930381
16936 52930381 50271324 47766679 45436094 43481590 41874969 40378880 39069925 37784011
16928 37784011 36387542 35066176 33934285 32813212 31661490 30508203 29373143 28342098
16920B8342098q15434q14882q69263q90244q10187q47084p87215p60486o78363
16911B1068940n39395m97990m99848l99670m51000m13758m02684l91640m09049
16902A7063906m84156m55960l28134l60375l93540l11476l43522k97334k32836
16893A3856573j91646k40287k74878k38439k46616k86729l56186k58817k23357
16884A1539618k60121k75768k74411l51344k17991k07161k96213j68368j47215
16875I341026j60026k50029k03949k24963k42124j20376j41132k21648j13023
16866G663756m7232j73366j37383n1326o6030j16401j44962j92644j80715n3874
16856F499823o3864j10504j16219r1334r7423j26016j61075r5429j14928j03078
$$ plain form
16920 28342098 27526664 26711782 25842519 24952275 24142088 23295004 22507789 21747303 21068940
16911 21068940 20529545 20031555 19531707 19132037 18681037 18267279 17864595 17472955 17063906
16902 17063906 16579750 16123790 15795656 15435281 15041741 14730265 14386743 14089409 13856573
16893 13856573 13664927 13424640 13149762 12911323 12664707 12377978 12021792 11762975 11539618
16884 11539618 11279497 11003729 10729318 10377974 10159983 9952822 9656609 9488241 9341026
16875 9341026 9181000 8930971 8727022 8502059 8259935 8139559 7998427 7776779 7663756
16866 7663756 7616524 7443158 7305775 7254449 7188419 7072018 6927056 6734412 6553697 6499823
16856 6499823 6435959 6325455 6209236 6117902 6020479 5894463 5733388 5637959 5523031 5419953
16846E419953o6153j88748j32144q0759K0572R603K0556k7255j01397q556J0895
16835D876567L0884l2231j2236O6515k0436M467J2355N523m0490J1412p3657q6414
16823D742259j33044n9703k9194m2565j39140l1964l7078j08096j44169j06650
16813C910656j37096j03593N2745r6252j51289R180r2058p8942k8818k9003M3009
16802C298539m2212r536n4374q0417n0872l4040j07640p3244j29106n0895o2582
16791B603621j25696L1838M8134m3233p9647j03226l3196q1087o0125l1537m7523
16780B078323J3521q5849l8039r2173j02435p4785J7444k8608n9599J1829j15276
16769A524353q4892m3761P323J7713K2819R1078K19544K20958J16384p5034M7761
$$ plain form
16846 5419953 5353800 5165052 5032908 4952149 4972721 4982324 5002880 4975625 4874228 4865672 4876567
16835 4876567 4907451 4875220 4862984 4929499 4909063 4913530 4925885 4931408 4890918 4902330 4828673 4742259
16823 4742259 4609215 4549512 4520318 4477753 4338613 4306649 4269571 4161475 4017306 3910656
16813 3910656 3773560 3669967 3722712 3626460 3475171 3484351 3392293 3313351 3284533 3255530 3298539
16802 3298539 3256327 3246791 3192417 3112000 3061128 3027088 2919448 2846204 2717098 2666203 2603621
16791 2603621 2477925 2509763 2557897 2514664 2435017 2331791 2298595 2217508 2157383 2125846 2078323
16780 2078323 2091844 2005995 1967956 1875783 1773348 1698563 1716007 1687399 1627800 1639629 1524353
16769 1524353 1439461 1395700 1403023 1420736 1443555 1534633 1754177 1975135 2091519 2016485 2064246
16758B064246J77397J83250K8206j29257j74624j34186j38518l1682n3744j25729
16748A665359j17155k1109M501l7583m1416q8664l2535N773j4835K953N1046K7811
16736A404146Q0332l1665p9336j04990j058L8744n8682j4377L5954K9874j12125
16725A186817n2636m2652m591j825k1996j870K6211J971o853O671j58432m8139
16713H82676p756K516J9141L7017L5904K635j60307j33809R5008Q5964J9307N8582
16701I36878j7586q1056j11329k3279J11708O3300p4682q3195O7709N1145k6748
16690H12865q2125j29529k9488L4388m2654k0773o5747O4234R4106r027K5427
16679F51677o700r668n1679k2461J1237j795j2815n4701M845N3130o5361q8883
$$ plain form
16758 2064246 2241643 2424893 2453099 2323842 2149218 2015032 1876514 1844832 1791088 1665359
16748 1665359 1548204 1527095 1531596 1494013 1452597 1363933 1331398 1337171 1322336 1325289 1376335 1404146
16736 1404146 1484478 1452813 1373477 1268487 1267429 1306173 1247491 1233114 1269068 1298942 1186817
16725 1186817 1134181 1091529 1086938 1085113 1063117 1061247 1087458 1089429 1082576 1089247 930815 882676
16713 882676 874920 877436 896577 933594 969498 972133 811826 678017 773025 858989 878296 936878
16701 936878 919292 838236 726907 703628 815336 878636 803954 720759 788468 839613 812865
16690 812865 730740 601211 571723 606111 563457 542684 476937 541171 635277 626250 651677
16679 651677 644977 635309 583630 561169 572406 570611 557796 503095 507940 561070 495709 406826
16667D06826N964M0752L7734p2661k4058M0158J4630l0173p82Q552n3981m0339
16655C32622P4169k8449J576L5775l7832m5490q9604p4530J51310J26932l6534
16644D09945n3618n4525M1523N5507R9910K8030l5868o6277k7334k1156j139Q2541
16632D57539Q4012j6866l9135o8184l8118Q3941r9137j11561m4632J9022K7403
16621B54284P4446K5295J6055j6080l8442p559r2937n3733k1973M0313J02250
16610B81919J8725K0012M9042m7240j0652N1196l7967n5800P735k8466l8265R9730
16598C09969K7692p4683k1363j8676n0113m4694L609K4985m8983r9266N0045Q1459
16586A39981q1690l3457M4355L7643j8372Q3064L0193n2771r6623j4469J04056
$$ plain form
16667 406826 412790 453542 491276 418615 394557 434715 449345 419172 418390 426942 372961 332622
16655 332622 406791 378342 379918 415693 377861 332371 242767 168237 319547 446479 409945
16644 409945 356327 301802 343325 398832 498742 526772 490904 424627 397293 376137 374998 457539
16632 457539 541551 524685 485550 417366 379248 463189 364052 252491 207859 226881 254284
16621 254284 328730 354025 370080 354000 315558 307999 215062 161329 139356 179669 281919
16610 281919 300644 320656 369698 322458 311806 363002 325035 269235 276970 248504 210239 309969
16598 309969 337661 262978 241615 222939 172826 128132 131741 156726 107743 8477 58522 139981
16586 139981 58291 24834 69189 106832 88460 171524 201717 148946 52323 37854 141910
16575A41910L1827k8048k7191k0036K2106O1982q718M4878K3694m3760J1759n5148
16563A55255m6478j2189j58l2018Q942L7137R0927j211o3518j51953o2079K5858
16551e1485O9147J08843R1464K1361j30606j61331k6817l0352N1951R7535P3025
16540A12735r193o1893R8216P1959N1715r2632l5805n286L473n5288k2294K5862
16528H1569K9210k6972K4793P2841o0408j7944N0899K4266q8641m2537O812j1191
16516D2697J8684Q860n2330J0905n8820j673O8299P0035N6703n587r3098p330
16504E7345l2551l3301L0680P7229Q974j17198k8945Q5343J1501q4006r3951J22356
16492C476Q6641k5391r1131O1236N0133Q6361J3882k4054l4391l2214J7006j7022
$$ plain form
16575 141910 173737 145689 118498 98462 120568 182550 173832 218710 242404 198644 210403 155255
16563 155255 108777 96588 96430 64412 73354 110491 201418 200207 136689 -15264 -77343 -51485
16551 -51485 17662 126505 217969 239330 108724 -52607 -79424 -109776 -57825 39710 112735
16540 112735 103542 41649 139865 211824 263539 170907 135102 129816 133289 78001 55707 81569
16528 81569 110779 83807 108600 181441 121033 103089 153988 178254 89613 47076 53888 42697
16516 42697 61381 70241 17911 28816 -30004 -31677 36622 106657 163360 157773 64675 57345
16504 57345 24794 -8507 22173 99402 108376 -8822 -37767 47576 59077 -24929 -118880 3476
16492 3476 90117 64726 -26405 34831 84964 171325 185207 161153 126762 94548 111554 94532
16480I4532o0351m222Q2033n892m9014O179N7823l9456N3845N8565l9276r6161
16468E8605O9439o9320j2866R2604R470m3139n787l5824K7146l7594J5540l3912
16456C4362m146k0403j18072o6577J8291N0548k6743J12744N3266O3303K2653
16445A19226j8132m6557l5284j714j9015r169N0132J5973k9672l5257j7746L0678
16433C463N4519L7641l98n656l7040N6010J0405k9332N5778n2201q1456m31N8056
16420F9358L0186n7164L871J9146K6830q8309k5841J3540M7423l1670N5637M8798
16408A11805k1568l8523K6164j0350P972R5129J14304J86444J69329K79688K46672
16397A167066K07146L81574M47304K95246q0567k70881n3124R5078p6637l93912
$$ plain form
16480 94532 34181 29959 111992 106100 57086 63265 121088 81632 135477 194042 154766 58605
16468 58605 128044 58724 45858 138462 147932 104793 99006 63182 90328 52734 68274 34362
16456 34362 30216 9813 -108259 -174836 -156545 -105997 -132740 -19996 33270 96573 119226
16445 119226 101094 54537 19253 17539 -1476 -10645 39487 55460 25788 -9469 -27215 3463
16433 3463 57982 95623 95225 89569 52529 108539 118944 89612 145390 93189 11733 11302 69358
16420 69358 99544 42380 46251 65397 92227 3918 -21923 -8383 39040 7370 63007 111805
16408 111805 90237 51714 77878 67528 75500 170629 284933 471377 640706 920394 1167066
16397 1167066 1374212 1755786 2203090 2498336 2417769 2146888 2093764 2188842 2112205 1718293
16387A718293m70396l00127j96680j02375j21022r8441m8222M7746q786r2219
16377C27771J1096M057m378J8646j8080q3282m9301k7984m2913j9813J9735j0212
16365A25342q3019J0779J2764q0907M2621O1343N6848M1486o1337n5380K4265
16354I4805M7102L5834l0930k8924M8955p2316j1420N1970l9554o1816M9620l4954
16342D8372k1132Q618j694o1431J3533j561N6413K6618m2839O190O1628R1238
16330A83953k2073o2652j19440m89Q0080O440j02729J2658j533J3649P7650k7127
16318C8387j1412k6804p6824R8187K8006j2744p1202j0079l2528k6472M0249q968
16306g2204R850M5795O0077M4248k5371K964k2095J9724R3358o20l724p8315m870
$$ plain form
16387 1718293 1247897 947770 751090 648715 527693 429252 381030 428776 419990 327771
16377 327771 338867 342924 338546 357192 339112 255830 206529 178545 135632 115819 135554 125342
16365 125342 42323 53102 65866 -15041 27580 88923 145771 187257 125920 70540 94805
16354 94805 141907 177741 146811 117887 166842 94526 83106 135076 95522 33706 83326 48372
16342 48372 27240 35858 34164 -27267 -13734 -15295 41118 67736 24897 31087 92715 183953
16330 183953 161880 99228 -20212 -20701 59379 65819 -36910 -24252 -25785 -12136 65514 38387
16318 38387 26975 171 -76653 21534 49540 36796 -34406 -44485 -77013 -103485 -63236 -72204
16306 -72204 -62354 -16559 43518 87766 62395 65359 43264 62988 156346 155726 152002 73687 68817
16293F8817n4238j14417k4605L3468O3144k4766k7750J8700Q22j0312n601j6629
16281i3367R327q590m311l2777J7587L6327J24404K9202l3099o1027l0525j8389
16269f5238o316m868j4646R748J0360k2818N5462m3109K09O5724L7296j1866k8362
16256a8424p7426r7270O4080J00158O2692j0345o5689q8031m2132L3223N5245
16245h3919N1929m8275l3949L9096J17454J8790o7978K029k3172l4756N6343R2146
16233H5738l5389o4557P4410m428r746n867m710m5889j6918n5804J2258J6059
16221e4843k5650K9776J6499Q03m9817j4662N9841n9532k873k7248O3027J2143
16209e2536l5699J0172K8163O790n15N8331N4868K2068k008n2613N5534m7240
$$ plain form
16293 68817 14579 -99838 -124443 -90975 -27831 -52597 -80347 -61647 -60825 -71137 -76738 -93367
16281 -93367 -84040 -92630 -96941 -129718 -112131 -75804 48600 77802 44703 -16324 -46849 -65238
16269 -65238 -71554 -76422 -91068 -81320 -70960 -93778 -38316 -81425 -81216 -15492 21804 9938 -18424
16256 -18424 -95850 -193120 -129040 -28882 33810 23465 -42224 -130255 -172387 -139164 -83919
16245 -83919 -31990 -80265 -114214 -75118 42336 61126 -6852 -4823 -27995 -62751 -6408 85738
16233 85738 50349 -14208 60202 55774 46028 40161 35451 -10438 -27356 -83160 -70902 -54843
16221 -54843 -80493 -50717 -34218 -33415 -83232 -97894 -38053 -97585 -100458 -127706 -64679 -52536
16209 -52536 -88235 -78063 -49900 -43110 -43625 14706 69574 91642 89634 37021 92555 45315
16197D5315o2367o778j6617k6663n8563O425M0356O2968R4372m5580K6511K5356
16185H4735m2047n8055J4909J0301L0206M3142n3751k8042n2378J3697M3781J5358
16173B1856l725o4528n8924J444J8533M1332P472M1527L7629L651o327r005Q1334
16160A12269M1579L417j17335l9219l9637n734j2341n7411K252M5667N4858L9876
16148B8241L4572N029j4582j2902j21001K476K2435o0295k2844L0925Q681J2271
16136h6994N7338J0543L8536M5529k9770o1123k1070M048n2133n43Q4937r4562
16124a05264n6982J09153N8943K7521m5290j6859M100M3860K6310j7826Q712k5031
16112A1347p4759L1069O4165J30249o7431j10095n2991M0006J8548n4360m997
$$ plain form
16197 45315 -17052 -23830 -40447 -67110 -125673 -119248 -78892 -15924 78448 32868 59379 84735
16185 84735 42688 -15367 -458 9843 40049 83191 29440 1398 -50980 -37283 6498 21856
16173 21856 18131 -46397 -105321 -103877 -85344 -44012 -36540 4987 42616 46267 39940 30935 112269
16160 112269 153848 157265 39930 711 -38926 -44660 -57001 -114412 -112160 -66493 -11635 28241
16148 28241 62813 67842 53260 40358 -80643 -78167 -55732 -116027 -138871 -107946 -99265 -86994
16136 -86994 -29656 -19113 19423 64952 35182 -25941 -47011 -42963 -95096 -95639 -10702 -105264
16124 -105264 -162246 -53093 5850 33371 -11919 -28778 -24678 19182 45492 27666 36378 11347
16112 11347 -63412 -32343 31822 162071 94640 -15455 -68446 -28440 -9892 -64252 -69249
16101f9249O0480r974J4612k7076M3198L2103n867J1743Q401O6893j23764L6420
16089C7920l5637r8180L4223N875q872P0551k080k9817K3388K9733j8633M664
16077A3135k7327j8387q2089R0604P5312j9642L4288K0285j33438q8734O5010
16066g0983Q3890K4685M1127J7092j0499l0517k5177M493P885j8378m8543Q142
16054a6783J08463J30009j0440j05839j29872n5351M8645L1292K4357k5753l2419
16043c3691K1638P221J05015j2559R613N312k5854n3369j7671k8094L9273K2467
16031C9301N678J136L83K8122q678p3292J3117M9783K8221p4328o093m9867J0949
16018c5568N034n5355M1099N7284R589K9071K5062k0704l3505J4004o2347Q2322
$$ plain form
16101 -69249 -8769 -18743 -4131 -31207 11991 44094 38227 49970 58371 125264 1500 37920
16089 37920 2283 -95897 -61674 -55799 -64671 5880 3800 -26017 -2629 27104 8471 13135
16077 13135 -14192 -32579 -114668 -24064 51248 31606 65894 86179 -47259 -135993 -70983
16066 -70983 12907 37592 78719 95811 85312 54795 29618 34111 41996 23618 -24925 -16783
16054 -16783 91680 221689 211249 105410 -24462 -79813 -31168 124 24481 -1272 -33691
16043 -33691 -12053 -4832 100183 87624 97237 102549 76695 23326 5655 -22439 16834 39301
16031 39301 44979 46115 46498 74620 65942 -7350 5767 55550 83771 9443 3350 -46517 -35568
16018 -35568 -30534 -85889 -44790 12494 22083 51154 76216 55512 22007 36011 -26336 55986
16006E5986m951m4100p3057o7566M1467M0502J5206M4430R2029Q2487R529l9252
15994A52710l6259j15533p6180j9164N5984P2154k1366j31909l6340k2925N3720
15983a25108M5733l5329N9263l7015K5604J70624P0636m1598l4846k0871p178
15972F9915m4283O7132j2494l5211l2663m9629L6298o2931N3636L8830o3565j35222
15960a70187N045R4904N6293K5894Q8022n3966p4218m5845j3802r759Q52L8956
15948e7811K990O1428j538P128L0387L3624p1088j7847K8605M999j1572m6093
15936c6788j7867J16246L0208q934J2475o7189K0925K222M962J3592P4209N5049
15924A99110M1086n6485q9196o5036n7952R7750M0530j07275j64636K2611J00995
$$ plain form
16006 55986 51035 6935 -66122 -133688 -92221 -51719 -36513 7917 99946 182433 191962 152710
15994 152710 116451 918 -75262 -94426 -38442 33712 12346 -119563 -155903 -178828 -125108
15983 -125108 -79375 -114704 -55441 -92456 -66852 103772 174408 132810 97964 77093 69915
15972 69915 25632 92764 80270 45059 12396 -37233 -935 -63866 -10230 28600 -34965 -170187
15960 -170187 -165142 -70238 -13945 11949 99971 46005 -28213 -74058 -87860 -97619 -96767 -57811
15948 -57811 -54821 6607 5069 12197 42584 76208 5120 -12727 15878 20877 9305 -36788
15936 -36788 -54655 61591 91799 82865 95340 28151 49076 51298 56260 69852 144061 199110
15924 199110 240196 183711 94515 29479 -28473 69277 109807 2532 -162104 -139493 -38498
15913c8498L1098J479R244L0686K3062m6814k9435k427m1767o7074M0774N4160
15901c5512J8751K1886J908K8067M6075j195j07446j13048k2672P1226L668m7470
15889a35762O555J10843J4684j5824P5253K066o4167m3917m1244M5106p228m2231
15877i5866l8594m8097N02P7025Q7084K5819j8322r6143l2483M9463K0732J8252
15865e0628M405K085M5895J1355Q147J1942r8375J3600L7173P1215M5179L539
15853A05532j37409p6908M7592Q3796J0368q8602j04081n2754O5523K9241J9301
15842i8401K0309K4768p82P4425L7227N9839l6262K2635m7639o2081K6179P1380
15830I1597l4577N1321P5613k6503r7007j19373p9883J212J03214N0626L9926
$$ plain form
15913 -38498 -7400 -5921 3323 34009 57071 10257 -19178 -21605 -63372 -130446 -89672 -35512
15901 -35512 -16761 5125 7033 35100 81175 79980 -27466 -140514 -163186 -91960 -88292 -135762
15889 -135762 -129207 -18364 -3680 -19504 55749 57815 -6352 -50269 -91513 -46407 -53635 -95866
15877 -95866 -134460 -182557 -182055 -105030 -17946 7873 -10449 -106592 -139075 -89612 -68880 -50628
15865 -50628 -46223 -44138 1757 13112 21259 33201 -65174 -51574 -14401 56814 101993 105532
15853 105532 -31877 -108785 -61193 22603 32971 -55631 -159712 -212466 -146943 -117702 -98401
15842 -98401 -78092 -53324 -54106 20319 57546 117385 81123 103758 56119 -5962 20217 91597
15830 91597 57020 108341 183954 157451 60444 -58929 -138812 -137600 -34386 16240 56166
15819E6166l8206k4541k3256L0113p2740l6274L1703M3424k2993k6834J7793m0550
15807a06195J2733L389k7868Q1720N2672r3880j7521N8010L8248k9945j6393Q8825
15795D3795P6826Q467j64855n4342J37478k5188j49486j2310K7855Q855M3708
15784e9197j7585J1504J08541j4186o8507o9116j8645n9710Q759L0918l1816k9975
15772b09015J6570J29610N8175Q5507j6671p8269l3915n8701M6304L6068L4754
15761A0417k511n6775o824J6829P4319j652n4605n7736N7089O4124r080k7712
15749E883q661k8559L0617m8166J3488k337N3325k6623o1350l1220J16629n288
15737G738J6102n2210j15585l2020R1722J09824J2363n9945m959K5211J1003K30
$$ plain form
15819 56166 17960 -6581 -29837 276 -72464 -108738 -77035 -33611 -56604 -83438 -65645 -106195
15807 -106195 -93462 -90073 -117941 -36221 16451 -77429 -94950 -36940 1308 -28637 -45030 43795
15795 43795 120621 129088 -35767 -90109 47369 22181 -127305 -139615 -111760 -102905 -59197
15784 -59197 -76782 -65278 43263 29077 -39430 -108546 -127191 -186901 -178142 -147224 -179040 -209015
15772 -209015 -192445 -62835 -4660 80847 64176 -14093 -48008 -106709 -60405 -24337 10417
15761 10417 7906 -48869 -55693 -38864 35455 33803 -20802 -78538 -21449 42675 33595 5883
15749 5883 -2778 -31337 -720 -48886 -35398 -37735 15590 -11033 -72383 -103603 13026 7738
15737 7738 23840 -28370 -143955 -175975 -84253 25571 37934 -22011 -26970 -1759 9244 9474
15725I474m4685j4266K6550k4045k9950J4141K4561j6555O127L1849m8109l748
15713f8656J1822M436J9887k4134K9361K1944n165l2515R7895J8550m8714p0858
15701d6147p3630J9853j4212j8315N6670r691O9555N7943R212L817j3828o450
15689C4777K3715J876p0782j4109j2816R976K8022M4246K6374n3809n6944M6753
15677G279K7502l4029o307q6148l3027N531k965P668o5219J9241N546k2886j04140
15664b81954K4579O8668M1788R655o0796p2426k3151Q0640m516K8600Q9043J5094
15652h4776m5250K8615M6248k3589m1164N8646q26l4513k807Q8832l5045O1514
15640A5885R4176N1086J9342n9792j16790n0768J31677J8664j4644k4144L5569
$$ plain form
15725 9474 -35211 -49477 -22927 -46972 -76922 -62781 -38220 -54775 -48648 -16799 -64908 -68656
15713 -68656 -56834 -52398 -32511 -56645 -27284 -5340 -10505 -43020 54875 73425 24711 -46147
15701 -46147 -119777 -99924 -114136 -132451 -75781 -85472 -15917 42026 51238 55055 41227 34777
15689 34777 58492 60368 -10414 -24523 -37339 -27363 659 44905 71279 17470 -39474 7279
15677 7279 34781 752 -5555 -91703 -124730 -119199 -122164 -114496 -179715 -160474 -154928 -177814 -281954
15664 -281954 -257375 -188707 -146919 -137264 -198060 -270486 -293637 -212997 -217513 -188913 -99870 -84776
15652 -84776 -130026 -101411 -55163 -78752 -119916 -61270 -62096 -96609 -99416 -10584 -45629 15885
15640 15885 110061 161147 180489 120697 3907 -46861 84816 103480 88836 64692 100261
15629A00261l9216j5566m4445N4865o5263j04746j3681J5926m4733M099j804O057
15617a48246K9292L1763m2901O6357L2078j11276M0793R9782K485M665R1032J7746
15605A13570q1948m6623Q9077q257o3926j6877n5200M8092n398p8843k2812N3021
15593g6124K6849o7061L8121P7201Q6487J8178p8375o3110j001O2632L1030N696
15581F0523J923P689l6143r0449m2704l090P5321j6758K3029K7100n2888K593
15569d3854N069K1379q9967r1007P1689M7474L8737p0723l0563O7626J6208K677
15557e5255J0583r947k3575L7451P2929M3168j49905j41683N3509R6756K6367
15546c9602N149M8178J1805p1516K6965R5222m0818q8228K2429p11n0373K0015
$$ plain form
15629 100261 61045 45479 1034 55899 -9364 -114110 -127791 -111865 -156598 -152499 -154303 -148246
15617 -148246 -118954 -87191 -130092 -63735 -31657 -142933 -102140 -2358 127 4792 95824 113570
15605 113570 31622 -15001 74076 65819 1893 -14984 -70184 -22092 -27490 -106333 -129145 -76124
15593 -76124 -49275 -116336 -78215 -1014 85473 103651 25276 -37834 -38835 23797 54827 60523
15581 60523 62446 70135 33992 -56457 -99161 -102251 -26930 -43688 -20659 6441 -46447 -43854
15569 -43854 -38785 -17406 -107373 -198380 -126691 -79217 -40480 -111203 -141766 -74140 -57932 -55255
15557 -55255 -44672 -54619 -78194 -40743 32186 75354 -74551 -216234 -162725 -65969 -39602
15546 -39602 -34453 13725 25530 -45986 -19021 76201 35383 -52845 -30416 -31127 -81500 -61485
15534f1485O1830K2839M1009J8843p0275r4303l9746P4556J14560K5613m7263
15523D6178n5669m3512K7465N12n8236J3522O7022M1421M514p2400l9004o9675
15511a37862j6935K2309R3740j859K1204L514o2308k6776L8351M2922l8346J3201
15499d8845j4168O2951L6402p815k6177L4343m8896r189J3798P2901K8939p7142
15487A7102L3657p8600m3632K155K9479J5978N6000P0029n2819l6607r403k811
15475E28P4005L6577n3761n2956m9132j2358n1880N9550m505j2580o344J7220
15463e5636L4300k5340k3326O7395k2745l3148P8880K7621K1296k082o0760N8035
15451F4490l0169j2389k6713P4195l3559p3518l9012J4153M392j7896R729k2894
$$ plain form
15534 -61485 345 23184 64193 83036 12761 -81542 -121288 -46732 67828 93441 46178
15523 46178 -9491 -53003 -25538 -25026 -83262 -69740 -2718 38703 43217 -29183 -68187 -137862
15511 -137862 -154797 -132488 -38748 -40607 -19403 -15889 -78197 -104973 -66622 -23700 -62046 -48845
15499 -48845 -63013 -62 36340 28525 2348 36691 -12205 -21394 -7596 65305 94244 17102
15487 17102 50759 -27841 -71473 -69318 -39839 -23861 32139 102168 49349 12742 3339 528
15475 528 74533 111110 57349 4393 -44739 -57097 -108977 -49427 -53932 -66512 -72856 -55636
15463 -55636 -21336 -46676 -70002 -2607 -25352 -58500 20380 48001 69297 67215 6455 64490
15451 64490 34321 21932 -4781 69414 35855 -37663 -76675 -62522 -58130 -76026 -66297 -89191
15439h9191m2729L0737M2137m0270N034Q8210K871o1459j49418R4159K5584j5411
15427a09746O6931j0380K1468o426K1058n2464o1813L6986j0653N60K3503L108
15415g7868l9525j4846l1914q20M821k3305N3964K4524L6523M3765M4661N0644
15403G0624M5892k6172r6156L7696M1682J1121n6038j16792l0141P9952N1277
15392A2945m2956K5995O305k2254L0218j4150P407o6554O923O2704m1588J8688
15380a6317N4918k622L4263j9856j9640r2836J7155P9253k6857m403N3113o0815
15368d644o8138N0601M4708n2535m2941j393M9516j7874l684m673M960R0182m3128
15355I57p8094q2197n1896P2912N0671P2279K4841k1509N3263K0698k1849L6314
$$ plain form
15439 -89191 -131920 -101183 -59046 -99316 -94282 -6072 -3201 -64660 -214078 -119919 -94335 -109746
15427 -109746 -42815 -53195 -31727 -38153 -17095 -69559 -131372 -94386 -105039 -104479 -80976 -77868
15415 -77868 -117393 -132239 -164153 -164973 -160152 -183457 -129493 -104969 -68446 -24681 19980 70624
15403 70624 116516 90344 -5812 31884 73566 84687 28649 -88143 -118284 -38332 12945
15392 12945 -30011 -4016 2289 -19965 10253 -3897 3510 -63044 -56121 6583 -35005 -16317
15380 -16317 38601 35979 70242 50386 30746 -62090 -44935 34318 7461 3058 56171 -4644
15368 -4644 -72782 -22181 22527 -30008 -72949 -74342 -24826 -42700 -46384 -51057 -46097 44085 957
15355 957 -77137 -159334 -211230 -138318 -87647 -15368 9473 -12036 41227 61925 40076 76390
15343G6390j1590n8662l7400J1415l4622J4061J04611o8832R806l0893Q056M5557
15331B7897o7073J308R3705r752j16182m2234l3854O1115L3339l8076L5866N9796
15319E855K8805k5043m718K1180j5607L5462J9332m6075r0222l3576K9758P7569
15307B720K4745j11526n6042J08863k2400K4744N0924o1601r4124m3103P5429
15296a01371O1432K6834l4576l2887K0910O4208K2484m90j8395n6767l1319m9872
15284a29809J03583k4197j3285l9323N8932k864q422r0450p6129m8769K9718J0908
15272b30107k1907R238M2168K8587k6289O3171j1895K5631L7113P3417L9509m7801
15260a9165l1023m475M3659q77K6232j8631m4233M1834m008K6011K0026K96K3468
$$ plain form
15343 76390 64800 6138 -31262 -19847 -54469 -40408 64203 -4629 5177 -25716 -17660 27897
15331 27897 -39176 -37868 55837 46085 -70097 -112331 -146185 -85070 -51731 -89807 -53941 5855
15319 5855 34660 9617 4899 26079 10472 45934 65266 19191 -71031 -104607 -74849 2720
15307 2720 27465 -84061 -140103 -31240 -53640 -28896 22028 -39573 -133697 -176800 -101371
15296 -101371 -39939 -13105 -47681 -80568 -59658 4550 27034 26544 8149 -48618 -79937 -129809
15284 -129809 -26226 -50423 -63708 -103031 -44099 -46963 -55385 -145835 -221964 -270733 -241015 -230107
15272 -230107 -252014 -242776 -200608 -172021 -198310 -135139 -147034 -121403 -84290 -10873 28636 -19165
15260 -19165 -50188 -54663 -11004 -11881 14351 -4280 -48513 -6679 -10687 15324 35350 35646 59114
15247E9114N8925o3622l3823K210m3849k1163K4588j6991K4999K8045j2513Q8559
15235I4479j8062j5183k5098l5479N7339L6438k6451N8787K4121j02930p5098
15224b7137O8288R5162m7774q5856k1865K6621J01609j05125j28611j966L2510
15213i4144L0000q948j2234k8669M7580J00361N3560K1590p8947q2218j09149
15202a61218m4094J4991O0158Q9778Q3866M4017l535L3245j6949n0375p6741L0826
15190C969N8775k3270j5319k3030o0472M3393l89j6001k1820n7510K4964J01951
15178A5241J10151M1761k5515p5298P35k8016k3711J1391K6471N2189q8806j3702
15166B891m9242K0573m5309o1855j1713N0729L581k6533Q5055N733l8100K5357
$$ plain form
15247 59114 118039 54417 20594 22804 -21045 -42208 -17620 -34611 -9612 18433 5920 94479
15235 94479 76417 61234 36136 657 57996 94434 67983 126770 150891 47961 -27137
15224 -27137 41151 136313 88539 2683 -19182 7439 109048 3923 -124688 -126654 -94144
15213 -94144 -64144 -73092 -85326 -113995 -66415 33946 87506 109096 30149 -52069 -161218
15202 -161218 -205312 -190321 -130163 -40385 43481 87498 83963 117208 100259 49884 -26857 3969
15190 3969 62744 39474 24155 1125 -59347 -15954 -16343 -32344 -54164 -111674 -86710 15241
15178 15241 125392 167153 141638 66340 67075 39059 15348 26739 53210 105399 16593 2891
15166 2891 -46351 -25778 -71087 -132942 -144655 -93926 -90345 -116878 -31823 -26090 -64190 -38833
15154c8833L2316L5274r9283k4630M7777J9660Q579n1322n7840Q5045R6762J10026
15142A63531L563n7196m6963m4490l9902L2654r785K546j2960o684K272L6084
15130B2670L3506Q6563K1729P2373k2726j05778l0053k0222p5437n101J02582
15119H0106J1934r3724j39064l8825R7301M2928N0969N2401J6017J1604r474q0128
15107B045J27708L1157p2511L8432M8263p1637j01439J2067o0310l9196J8253
15096f7168k3820J8012L0230r749J3067j0060k0866o314J2533l0105o5623k3192
15084a83055M3971O9301P6471m2168j5277O7066M0172M297l4260q5476O228j5607
15072f8337P05l3877P9793Q0027n9190m9305J2642N2567Q7567l7177r7618r0957
$$ plain form
15154 -38833 -6517 28757 -70526 -95156 -47379 -27719 -19140 -70462 -128302 -43257 53505 163531
15142 163531 167094 109898 62935 18445 -21457 11197 1412 3958 -9002 -15686 -13414 22670
15130 22670 56176 142739 164468 236841 214115 108337 78284 58062 -17375 -22476 80106
15119 80106 92040 -1684 -140748 -179573 -82272 -39344 11625 64026 80043 91647 82173 2045
15107 2045 129753 160910 88399 126831 175094 103457 2018 14085 -46225 -85421 -67168
15096 -67168 -90988 -72976 -42746 -52495 -39428 -49488 -70354 -76668 -64135 -94240 -159863 -183055
15084 -183055 -139084 -69783 6688 -35480 -50757 16309 56481 60778 26518 -58958 -52730 -68337
15072 -68337 -67632 -101509 -21716 58311 -879 -50184 -37542 15025 102592 65415 -32203 -123160
15060a23160j407k1674L1394k880L3675P2558J5920l9350m482l0521k6996J5195
15048h1728l3445j2109O1489M8797M7748q176k1950M1339r603K6677o785N973
15036E8227n0924r8565n3402K9130P5783M4353q192j4439n2433J2287m4809J05500
15024B516P6005N8621p0122o2813k0721K0595J0418m1584p1629l279K1398j3535
15012i4130N8584m5882M0123l39L5882M9014N180j0655n0982L9454q724M1822
15000E9347l9455r5141k3909l1815m8246P3548M02k7792R4877J03959o952p8318
14988a9495j07325P515N5132m7379m0900q079J4892M9481k5379P1323J8795N990
14976b5429O3902k1793n231K5720K7954K7062N9536J7255J8568p8125m6305p0717
$$ plain form
15060 -123160 -124567 -146241 -114847 -117727 -84052 -11494 4426 -34924 -39406 -69927 -96923 -81728
15048 -81728 -115173 -127282 -65793 -16996 30752 22576 626 41965 32362 59039 52254 58227
15036 58227 7303 -91262 -144664 -115534 -39751 4602 -3590 -18029 -70462 -58175 -102984 2516
15024 2516 78521 137142 67020 4207 -16514 4081 14499 -27085 -98714 -101993 -80595 -94130
15012 -94130 -35546 -81428 -41305 -41644 -5762 43252 48432 37777 -13205 26249 17525 59347
15000 59347 19892 -75249 -99158 -130973 -179219 -105671 -105269 -133061 -38184 65775 58823 -19495
14988 -19495 -126820 -119305 -64173 -111552 -152452 -160531 -145639 -96158 -121537 -50214 -31419 -25429
14976 -25429 38473 16680 11449 37169 65123 92185 151721 168976 187544 109419 63114 -7603
14964g603L2756k364o8391p9623N2371N5044q1873K572O4132k2457o783l5363
14952i7582K8673j8060k5817O6708O7099N1579j10252m964m340j407O4704J09558
14940A25899P0106j09435j58155J1930P4216O7047M0286l2530r4283j15068n1112
14929a71099O9261l2874K4696L3701M4321N0627j8005o1294J8027n6971q4190
14918a83800O275O1972j8680P6000O0144L6391l0825k4746m1428J3702N698K2727
14906a6570O0934J20399k5984n3040j51302P678P2o5619l337N6287Q0491j3272
14894c263L042K4088J1034N0758k843p4579j1533k1690N382J1583J821J6431R2979
14881A03210N5647m8909j906n4939k9942J9807m6627n7138j4029j9914l1697n3142
$$ plain form
14964 -7603 25153 22789 -45602 -125225 -72854 -17810 -99683 -97111 -32979 -55436 -62219 -97582
14952 -97582 -68909 -86969 -112786 -46078 21021 72600 -37652 -42616 -46956 -48363 16341 125899
14940 125899 196005 86570 -71585 -59655 14561 81608 121894 89364 -4919 -119987 -171099
14929 -171099 -101838 -134712 -110016 -76315 -31994 18633 628 -60666 -42639 -99610 -183800
14918 -183800 -177525 -115553 -134233 -58233 1911 38302 7477 -17269 -58697 -44995 -39297 -16570
14906 -16570 44364 164763 138779 85739 -65563 -57885 -57813 -123432 -126769 -70482 10009 -3263
14894 -3263 -221 23867 34901 85659 82816 8237 -3296 -24986 -19604 -8021 -6200 10231 103210
14881 103210 158857 109948 108042 53103 23161 42968 -3659 -60797 -74826 -94740 -126437 -179579
14869a79579O6825J1253J0213J11486O6659k5588n8173l1995M7095L9290o0014
14858b528k9509N2297O4410p54p6046L5831n0698k6902l5129L3372L388N2477
14846B0209L4117J3144L952N2866j2101p2889o6777M7513n1653N824J269q575
14834c3101J3293n1689k6705K8873J2973n0923M0257K3114k5635k4787N4126K4189
14822a6015K9605R60o3046J465O1711m1135m5536N032n919n4882j1161k8778p614
14809a75313K9926N8249L8572K6074L3926o354J848O0394m5057o2846n3873m3864
14797a38318l9544k4856J0399n914O7950J06388l0082O3870J6652J4057j5247
14786B5355N49j789P712p5150l1430K5493l6533J6429J4636l582Q242K6679L0841
$$ plain form
14869 -179579 -112754 -101501 -91288 20198 86857 61269 3096 -28899 18196 57486 -2528
14858 -2528 -32037 20260 84670 83916 7870 43701 -6997 -33899 -69028 -35656 -32268 20209
14846 20209 54326 67470 71422 124288 112187 39298 -27479 20034 -31619 -25795 -24526 -33101
14834 -33101 -19808 -71497 -98202 -69329 -56356 -107279 -67022 -43908 -69543 -94330 -40204 -16015
14822 -16015 13590 14550 -48496 -47031 14680 -26455 -71991 -66959 -72878 -127760 -138921 -167699 -175313
14809 -175313 -145387 -87138 -48566 -22492 11434 5080 6928 67322 22265 -40581 -94454 -138318
14797 -138318 -177862 -202718 -192319 -198233 -130283 -23895 -53977 9893 26545 40602 25355
14786 25355 25904 24115 31827 -43323 -74753 -49260 -85793 -69364 -54728 -58310 -50068 -23389 7452
14773G452j494k3698M1462m9774J0379k1563j2661N7724J18152J2905n1401j61324
14761g3841l821R7329M5373j19360K92Q8635p1021j5953o1189L4194k7361J6503
14749i0220J01567L6456j7929L00p3234m8233N3227m8376J2281Q7725N5473Q5177
14737A54214m5117r6374n6518K8352L2478J2161k2490n0295o4961J4882J5681
14726g7987J708L0060l4236J5502J04840M688N9580m3517j09440R066L8733o74
14714a677l542O5863K0061m1286j5120k8480j8027L4526p4325J2670P9682k4976
14702E369p1803m5921K5188J17230P2335o9045j7710p4041M0645M0790m8123r389
14690c4475K6084n4467j4214O5557m1376m4355j1198n7082L5571J1971L5387M5279
$$ plain form
14773 7452 5958 -17740 23722 -26052 -15673 -37236 -49897 7827 125979 138884 87483 -73841
14761 -73841 -77662 19667 65040 -54320 -54028 34607 -36414 -52367 -113556 -79362 -106723 -90220
14749 -90220 11347 47803 29874 30174 -43060 -91293 -38066 -86442 -74161 13564 69037 154214
14737 154214 109097 12723 -43795 -15443 17035 29196 6706 -43589 -108550 -93668 -77987
14726 -77987 -76279 -46219 -80455 -64953 39887 44575 104155 60638 -48802 -39736 -1003 -1677
14714 -1677 -5219 60644 80705 39419 24299 -4181 -22208 12318 -62007 -49337 30345 5369
14702 5369 -66434 -112355 -87167 30063 102398 33353 15643 -58398 -17753 23037 -25086 -34475
14690 -34475 -8391 -62858 -77072 -11515 -52891 -97246 -108444 -165526 -129955 -117984 -82597 -37318
14678c7318P3090O2136o451r7437O4509j5266p5075O56J10760J4244q7063O805
14666A3590J18706O3464o7685K8838n3715l9864j3264k8535m5847J6802j0445
14655a7955P603K8660L4109r8423M4937L7463m8934L3178n1129Q877o6666N4427
14643c3853L2580l2018l9042J6088L3636j4419n0088P2721m4528J967M2613n985
14631b0328q888M0606J7738m3029j3871K3268n7510l1364K7943L4889L9582M2563
14619E1599J8027m1367p222o1329r927l0460r3963Q062K056N0306O0041R9897
14607D5720j6582l8321j5707m4372J204J33387L3414l5546J4168l065n5608J7547
14595C6239j2439J9597j5671m2813m6740M2246l1830p2967N6950J0569o8853l0353
$$ plain form
14678 -37318 35772 97908 91457 -5980 58529 43263 -31812 -31156 79604 93848 6785 13590
14666 13590 132296 195760 128075 156913 103198 63334 50070 21535 -24312 -7510 -17955
14655 -17955 -10352 18308 52417 -46006 -1069 36394 -12540 20638 -30491 -21614 -88280 -33853
14643 -33853 -1273 -33291 -72333 -56245 -22609 -37028 -87116 -14395 -58923 -56956 -14343 -20328
14631 -20328 -29216 11390 29128 -13901 -27772 -4504 -62014 -93378 -65435 -30546 9036 51599
14619 51599 69626 28259 21037 -40292 -50219 -80679 -174642 -166580 -164524 -114218 -54177 45720
14607 45720 29138 -9183 -24890 -69262 -68058 65329 98743 63197 77365 74300 18692 36239
14595 36239 23800 43397 27726 -15087 -61827 -19581 -51411 -124378 -67428 -56859 -125712 -156065
14583a56065K3112J995J0880M0235P4835R9424p8223k0782P5835o7112j2832l9821
14571d8519q1744K6490J10386L0008l5884l8455r4142K2374j4019k8231J2160
14560a39576M0103L8879m4557O655P4048j3112n0100L2931O7558J1649j2114J50142
14548A62506J5902j43902p8043O020K1432P8177L8640j5689j09486J4667J3637
14537C861M6101l669l837J5461J7587r5485l5112O2148L1059j3281N3682k3776
14525E4739L293l2281P788r539k3224l2177n8709K3203k7852M3719Q0325M3880
14513G3165o5831p1318l11J3521l4789N3664k1752K7362N6772L6469J0884l535
14501G4301m3728o8607j146M5060n3499n967M4972p7838l903M4463K162O9544
$$ plain form
14583 -156065 -132953 -130958 -120078 -79843 -5008 94416 16193 -4589 71246 4134 -8698 -48519
14571 -48519 -130263 -103773 6613 36621 737 -37718 -131860 -109486 -123505 -151736 -139576
14560 -139576 -99473 -60594 -105151 -98496 -24448 -37560 -87660 -54729 12829 24478 12364 162506
14548 162506 178408 34506 -43537 -37517 -16085 62092 100732 85043 -24443 -9776 3861
14537 3861 49962 46293 42456 57917 75504 -19981 -55093 7055 38114 24833 78515 54739
14525 54739 58032 25751 33539 24000 776 -31401 -90110 -66907 -94759 -51040 29285 73165
14513 73165 7334 -63984 -64295 -50774 -85563 -31899 -53651 -26289 30483 66952 77836 74301
14501 74301 30573 -38034 -39180 5880 -47619 -53586 -8614 -86452 -90355 -45892 -43730 25814
14489B5814m8640j19581m892J443K3051l8720M2715L7209o6054M0116M6267P4327
14477A3055L2080M1900q5102l4200J4166L1303K3800j5694o2205K39L3364k4108
14465c1402p7644K213Q946N0590N9201k3561k3190J8885M5453J0197L8172j10871
14453c3011q835L0952O0235r875J1369l4888m4050L6580q1304J9934k8222n6085
14441a37200k0822L1684j9255O043L0203J0756j7794R9317N4567K8632L4745N463
14429A06339M7302K0393m9186j54144k6714N0063L5893j0803m0105j06764M7231
14418h0495O0209n358k0973Q6684J33669K1117l1194j48995p8261k3423K6789
14407f0231M821p2399r86J701N6293L6329r384p86n1387q5919L4319M9317N542
$$ plain form
14489 25814 -22826 -142407 -147299 -145856 -122805 -161525 -118810 -81601 -147655 -107539 -61272 13055
14477 13055 45135 87035 1933 -32267 -18101 13202 37002 21308 -40897 -40658 -7294 -31402
14465 -31402 -109046 -106833 -97887 -47297 11904 -11657 -34847 -15962 29491 39688 77860 -33011
14453 -33011 -41846 -10894 49341 39466 50835 15947 -28103 8477 -72827 -52893 -81115 -137200
14441 -137200 -158022 -126338 -145593 -139550 -109347 -98591 -116385 -17068 37499 66131 100876 106339
14429 106339 153641 174034 124848 -29296 -56010 -5947 29946 19143 -20962 -127726 -80495
14418 -80495 -20286 -25644 -46617 40067 173736 194853 163659 14664 -63597 -87020 -60231
14407 -60231 -55410 -127809 -128795 -127094 -70801 -34472 -43856 -44642 -96029 -181948 -147629 -98312 -92770
14394i2770J14692N5822m3877m2546j3555J3596M771m4068K5858J8190L164L2799
14382C2076J05066K4918j13058j44633M634L9402J1305J6176M0681j4861p72k8846
14370b7912l2264Q5119N4445q007P4220k227m6518k6686j7218R124m0575r244
14358A2257n7098p3563K5562R6311J21276Q981k1423j8782j1247p369J8152m4958
14346D8099P1662Q5492k1711j20569q6228Q837O4596J0495K1572o2931o4672n1821
14334i7179q610K1990J03290J21664j7319o8940l7177L756r1973j20003j31443
14323c21944N4059J05150P9787L1575K2040K7020o0879j09962j2289l8060K4004
14312a99499J11564L8047j0276k1387l2653p973K8069O1332O6874l2997n0884
$$ plain form
14394 -92770 21922 77744 33867 -8679 -22234 -8638 -3867 -47935 -22077 -3887 -723 32076
14382 32076 137142 162060 49002 -95631 -90997 -51595 -40290 -24114 16567 1706 934 -27912
14370 -27912 -60176 24943 79388 71381 145601 143374 96856 70170 52952 62076 21501 12257
14358 12257 -44841 -118404 -92842 3469 124745 133726 112303 93521 82274 74905 93057 48099
14346 48099 119761 205253 183542 62973 -23255 -14418 50178 60673 82245 19314 -45358 -97179
14334 -97179 -105789 -83799 19491 141155 123836 54896 17719 21475 -70498 -190501 -321944
14323 -321944 -267885 -162735 -82948 -51373 -29333 -2313 -63192 -173154 -185443 -223503 -199499
14312 -199499 -87935 -49888 -60164 -81551 -114204 -122177 -94108 -32776 34098 1101 -49783
14301d9783j3633J10115N8422j14866j3868L8636P1051k1109m2755M8692m8594
14290B2308O4236L3595m5652j05207P177P628n0234l1507O1383J98323N6017m7187
14278A70880m9238k6889K3555N0505k4529k1193l0943R093J03078J5339p5041
14267A44617m9437q9011Q0435M6010m1480o1525j08065J2211Q9809K9725n6440
14256c151o337K8691L07p1975l6463J1354M7029J8161K9331k3062j16057L2127
14244i0045L6268P0026J2297j02111m7011K2089O7814M9019q8487k5791q147l1477
14232a35556j0158J02052N0378l5740l8473P8179J5130l61j8877L2657k6345j7961
14220e075Q43n3787m416j9691l0934L7928K0869n8483r690N5073Q5745M7676L3401
$$ plain form
14301 -49783 -63416 46699 105121 -9745 -23613 15023 86074 64965 22210 70902 22308
14290 22308 86544 120139 74487 -30720 -23543 -15915 -66149 -97656 -36273 162050 218067 170880
14278 170880 121642 94753 118308 168813 144284 123091 92148 101241 204319 219658 144617
14267 144617 95180 6169 86604 132614 91134 29609 -78456 -66245 23564 53289 -3151
14256 -3151 -9488 19203 19510 -52465 -88928 -77574 -30545 -12384 16947 -6115 -122172 -90045
14244 -90045 -53777 16249 28546 -73565 -120576 -98487 -30673 18346 -70141 -95932 -104079 -135556
14232 -135556 -145714 -43662 6716 -29024 -67497 10682 25812 25451 6574 39231 12886 -5075
14220 -5075 -4232 -58019 -62435 -82126 -113060 -75132 -54263 -112746 -122436 -67363 18382 66058 99459
14207I9459K1071n1632p2508q7844J1558K5753K0564j2877Q7370J1031j05883
14196e3938j22796o3156K235M0883O1828O9970j2110j8377K4089P7560j7832o4839
14184g6483j9891N6178L3932o4383k4363l9678L891j6129N9524N2587N3851J3930
14172C2966j9532k7963j24241r4J20258O2477l7532K219k7274k7221j5143l6020
14160i7100M7148L5386l1780j0117R1656M7055n8050m2869o2369k9409m4941n7493
14148b12883K5541N9939Q2589J21379M8065q6013l7866P2862N1620M6380k7297
14137A44316K5219j8277p5841l6649N590k9876J506N2113K6361p5383n1034Q9803
14125E7848Q1662m6866o4948j5120n6998o1102k5209M8926N1916m3730l3989j8403
$$ plain form
14207 99459 120530 68898 -3610 -91454 -79896 -54143 -33579 -46456 40914 51945 -53938
14196 -53938 -176734 -239890 -237655 -196772 -134944 -64974 -77084 -95461 -71372 6188 -11644 -76483
14184 -76483 -96374 -40196 -6264 -70647 -95010 -134688 -130797 -146926 -87402 -34815 19036 32966
14172 32966 13434 -14529 -138770 -138864 -18606 43871 6339 8558 -18716 -45937 -61080 -97100
14160 -97100 -49952 -14566 -46346 -56463 35193 82248 24198 -18671 -81040 -110449 -155390 -212883
14148 -212883 -187342 -127403 -44814 76565 124630 38617 751 73613 125233 171613 144316
14137 144316 169535 151258 75417 38768 44358 14482 15988 68101 94462 19079 -31955 57848
14125 57848 139510 92644 27696 12576 -44422 -105524 -130733 -81807 -29891 -73621 -107610 -126013
14113a26013K9905J23176q297m3612j0852l9429k593L3969L0179M363n4067J6768
14101d6503P9714L1547q2923r0518j3576L8055O0578m1825k3966j5445N8411L8698
14089g753N0319n9144n394L9625M4605n4841p7329n6207M6617K8302m746M0434
14077a5512j8767k0912n0908O2967O8543r266K4917J3599N721J4029o9490j1884
14065f963m41O188n2106l0398L9091j5721k8672r937L1188M9835m2336n082K3747
14052d1607L317j0563L4429K7544m5299p7323R918l3362L399m0022j9697J20242
14040f9024Q2094p1953p9199K8712R1564M2327K1547m2779j43286m2071N3698
14029a28370K1740K5669K8197P476K0786L114O7593L5442k0906j8945q539m4395
$$ plain form
14113 -126013 -96108 27068 18771 -24841 -35693 -75122 -77715 -43746 -13567 -9204 -63271 -46503
14101 -46503 33211 64758 -18165 -108683 -122259 -84204 -23626 -65451 -89417 -104862 -46451 -7753
14089 -7753 42566 -16578 -21972 17653 62258 7417 -69912 -126119 -79502 -51200 -55946 -15512
14077 -15512 -34279 -55191 -106099 -43132 25411 16145 41062 54661 60382 74411 4921 -6963
14065 -6963 -7404 -1216 -53322 -83720 -44629 -60350 -89022 -98959 -67771 -17936 -60272 -65354 -41607
14052 -41607 -38290 -48853 -14424 13120 -32179 -109502 -99584 -132946 -129547 -169569 -189266 -69024
14040 -69024 13070 -58883 -138082 -109370 -17806 24521 46068 3289 -139997 -182068 -128370
14029 -128370 -106630 -80961 -52764 -45288 -24502 -21388 46205 81647 60741 41796 33257 -11138
14017a1138J5679p472M7509n218j7079L757J4033q7k1584o6740K4706j5677K9065
14004a0246q424o4184k3429q963K1323N6929M1659k066J9542o2314j2404m4796
13992i7373N6536M1698L8349p2569j8822N1115M667n8060m101j8169O3786Q3646
13980G0703k3588m5353p6261K374j0114l433M2548n2763k6460K513M36M0850n721
13967h4269r5725j8854Q3406n1748l9948J32921Q6091M7904k6315J2063K3558
13956F9084o400n2850l9122l8377Q2876J8837l9180N239K6627l1719o9181l9167
13944a13333Q1917R2301k2817J5339n238m5884j0700r288L2327j2896j01483O1941
13932c7814K2372m4242L4445M1909q3195M4151K3437K2435k8980L178j01j9120
$$ plain form
14017 -11138 4541 -2931 44578 39360 22281 26038 40071 39984 18400 -48340 -23634 -39311 -10246
14004 -10246 -18670 -82854 -106283 -115246 -93923 -36994 4665 2599 22141 -40173 -52577 -97373
13992 -97373 -40837 861 39210 -33359 -52181 -1066 3601 -54459 -58560 -76729 -12943 70703
13980 70703 47115 1762 -74499 -72125 -82239 -85672 -43124 -95887 -122347 -119834 -119398 -78548 -84269
13967 -84269 -179994 -198848 -115442 -167190 -207138 -74217 11874 59778 33463 45526 69084
13956 69084 62684 9834 -29288 -67665 15211 34048 -5132 107 26734 -4985 -74166 -113333
13944 -113333 -31416 60885 38068 53407 48169 2285 -8415 -17703 14624 1728 -99755 -37814
13932 -37814 -15442 -59684 -25239 16670 -66525 -22374 1063 23498 -5482 -2304 -2405 -21525
13920b1525K6927p3592l6032M6617L9202M7875K6023j8696k2757P475j2542P630
13908A6605O1826K4010q9644r818p4437P7336R631L5892M489J02631k0478p3128
13896F4915M9421J999j27121K9407k0326p2465J0320k974p866N3698R3939Q7172
13884A60119l1442l3461j6481j8948m0096p1976k4785L22J10774M6852k6710p5250
13872b1082J2082N9619k5047j4185J3318m2028Q8185o3241j7182O096L1883o9253
13860d0835j24523m3721L4310m3097Q495P0758p0N8956Q4251L055q8704L5942
13848d5183J58335j3191O6089J11002l7804r3250p4955n1529L3852j7819k6338
13837I209J3387O6349k5407j42803k7779M2463j7910M911M2106m4354o152P1032
$$ plain form
13920 -21525 5402 -68190 -104222 -57605 -18403 29472 55495 36799 14042 21517 8975 16605
13908 16605 78431 102441 12797 2979 -71458 5878 15509 51401 55890 158521 138043 64915
13896 64915 114336 116335 -10786 18621 -1705 -74170 -63850 -66824 -74690 -20992 72947 160119
13884 160119 128677 95216 78735 59787 19691 -52285 -77070 -76748 34026 80878 54168 -21082
13872 -21082 -9000 50619 25572 11387 24705 -17323 70862 7621 -9561 -3465 28418 -40835
13860 -40835 -165358 -209079 -174769 -217866 -209371 -138613 -138683 -79727 4524 7579 -81125 -45183
13848 -45183 113152 99961 166050 277052 239248 145998 71043 19514 53366 35547 9209
13837 9209 22596 88945 63538 -79265 -107044 -64581 -82491 -77580 -35474 -79828 -85980 -14948
13825a4948m5654l8749r357l2348K0555J29997L8484j0052j7331k0221M8288N3605
13813A02269p7741n803n5494L305L58P576O672l1817L0322K7125r377L3916j1386
13800A9925M4460n9351K402P8808j0107k9225R54l3056P145J2659m1508o3422
13788g0316J169K0138N1624Q3656o0383r0075l891k7564m1138J0434P9097L6985
13776a0264J3762J679j0187m7378j2451N8201j7992l0665P4136K7241j777M0825
13764H5130o0847n241m4835j00996M2795j6274o2987L4923Q1837J5358L8432J9194
13752B6489k7883p3955J7130L2339j4982l0302k5755J05872Q1792q0863m4945
13741c5063J3229J9376l853K9013q330k0291q3145N4435P3985j56866p3959o690
$$ plain form
13825 -14948 -60602 -99351 -108708 -141056 -120501 9496 47980 37928 20597 376 48664 102269
13813 102269 24528 18725 -36769 -33464 -33106 -25530 -18858 -50675 -20353 6772 -2605 31311 19925
13800 19925 64385 5034 7436 86244 76137 46912 47866 14810 21955 34614 -6894 -70316
13788 -70316 -69147 -49009 2615 86271 25888 -64187 -68078 -95642 -136780 -126346 -47249 -10264
13776 -10264 3498 5177 -5010 -52388 -64839 -6638 -24630 -55295 18841 46082 44305 85130
13764 85130 24283 19042 -25793 -126789 -83994 -100268 -163255 -128332 -46495 -31137 7295 26489
13752 26489 -1394 -75349 -58219 -25880 -40862 -71164 -96919 8953 90745 9882 -35063
13741 -35063 -21834 -2458 -6311 22702 14372 -5919 -89064 -34629 39356 -117510 -191469 -198159
13729a98159k2931N299L9331N2044J4039K1889l1970J4247R325O1703K4225q1327
13717i2285j3769L6924m2517j5024R7928P612l8308O9718M3913p0265l1392P172
13705d0293L1668m0933K47M315l4239l5856O227J29302m0596p974K0069m1305
13693d9368n9923j5764N2495O2458M6298j5787J9343J3200M4735N8628m1371M7581
13681A62525j19393l8370K9812l0242K1094J8798O5245J7913n4096l1973m6465
13670e152R3406Q2411o4133j03363k9267J6078p1855J33617R1425j8344N87j17
13658A25293m8669K3757l9395k4157M2495P84o0761R236M810R1234J20715p8445
13646A66897o6686m0270L6548n5251o2510n4430l2090M1437O5329Q056J2562m4143
$$ plain form
13729 -198159 -221090 -215791 -176460 -124416 -110377 -88488 -120458 -106211 -96886 -35183 -10958 -92285
13717 -92285 -106054 -69130 -111647 -126671 -28743 -21131 -59439 10279 54192 -16073 -47465 -40293
13705 -40293 -8625 -49558 -49311 -44996 -79235 -115091 -108864 20438 -20158 -28132 -8063 -49368
13693 -49368 -109291 -125055 -72560 -10102 36196 20409 39752 52952 97687 156315 114944 162525
13681 162525 43132 4762 34574 4332 25426 44224 109469 127382 73286 41313 -5152
13670 -5152 88254 170665 106532 3169 -26098 -10020 -81875 51742 143167 124823 125410 125293
13658 125293 76624 100381 60986 36829 79324 80108 19347 28583 33393 124627 245342 166897
13646 166897 100211 59941 96489 41238 -21272 -75702 -107792 -66355 -1026 7030 19592 -24551
13634b4551j1864k1974J9994J16480J38753J2659r9454j22845K6505l305m2736
13623a2338J6758M7669o090j4654o5324L0996Q3156O1685K0804J7949O2996R4913
13611C38520j0802p7554p8423J6790J0630J4961P8888K6L1943l3999k7136m7251
13599B16593M4294q225q877n0639j7130n4882P8579L7621j5936L4208n032m2605
13587B07969J6427N4875j37n9349M6867O0946j1492j4977o0438p2016r987K8614
13575A87302L5391m136O291Q7250L1663o2652O3786o6024j06493M4205k4294J295
13563A93584O6571K6017P5615k1351l1791p0909m3314l2261n3981K7719L7387
13552A73286J14275M5396n8073l3660J9340J7170N0275Q2383K5269j4648p5035
$$ plain form
13634 -24551 -36415 -58389 -38395 78085 216838 229497 130043 7198 33703 30398 -12338
13623 -12338 4420 52089 45999 31345 -33979 -2983 80173 141858 162662 180611 243607 338520
13611 338520 327718 250164 171741 188531 199161 214122 293010 293036 324979 290980 263844 216593
13599 216593 260887 252662 243785 193146 176016 121134 199713 237334 221398 255606 250574 207969
13587 207969 224396 279271 279134 219785 266652 327598 316106 301129 240691 168675 158688 187302
13575 187302 222693 218557 224848 312098 343761 281109 344895 278871 172378 216583 192289 193584
13563 193584 260155 286172 361787 340436 308645 237736 194422 162161 108180 135899 173286
13552 173286 287561 332957 274884 241224 260564 277734 328009 410392 435661 421013 345978
13541C45978J6199L359l6706m4428m0742P3179J1257K3611P648j6132l3816M6816
13529C56223M1920Q1328j02531j00063M7575M0428n7643j4171O5786M9090r9233
13518C08709n8850P9615R2699n9935n842o6883L3074m9263j1702L3678J0388M9924
13506C55612L9422l1425k6829K6846n5247L8041K946k2446J6362J2348J1196M274
13494C71100K0232J9954P420o3329j5321L3844j1260l7087n8894N8119J9288L9044
13482C83110n5394q4674J7043m4222L2381l7902M7767L6363k8572k8459o9838
13471A67603m325J45134O172q2614K2537K820L7133k1137j7452N646m2191K9287
13459B48613J3645l5497O145k601O774n8888q1248R426R5660l3233j4376m8738
$$ plain form
13541 345978 362177 365536 328830 284402 243660 316839 328096 351707 359355 343223 309407 356223
13529 356223 398143 479471 376940 276877 324452 364880 307237 293066 358852 407942 308709
13518 308709 249859 329474 422173 362238 356396 289513 322587 273324 261622 295300 305688 355612
13506 355612 395034 363609 336780 363626 308379 346420 349366 326920 343282 355630 366826 371100
13494 371100 391332 411286 418706 355377 340056 373900 362640 325553 266659 324778 344066 383110
13482 383110 327716 243042 260085 215863 248244 210342 258109 294472 265900 237441 167603
13471 167603 163278 308412 314584 231970 254507 257327 294460 273323 255871 261517 219326 248613
13459 248613 262258 226761 232906 230305 237079 178191 96943 106369 202029 168796 154420 105682
13447A05682M2P1825R3873m398m5536q8753M1607J4887l4215j03498L7970M6609
13435A36095j2019L5719L8964l2627M9838N3282m1198m7966j7339m537k8345M0050
13423A69917R714l7168o4788M0602L900m9974o5093l1511R1424N4829J4286m3783
13411I2355m386K4797L6099m5952k9108K0963N6005m7030J2371l3054n465J3514
13399I1109L4926n2428r3151j79j9909j5952O9455q7336q0344O5823L7989k1158
13387g1155K0810r803M3347O6165Q2937L7487l4407J2047L6195k0822n0435p2417
13375C9949r3026q976P4193J06484N7854r7883j08638k3039L6101k6739J1134
13364c2586l1753N6194M6465l513o753J2344K5541k7675K3493R1340l3128j35324
$$ plain form
13447 105682 105724 177549 271422 267024 221488 132735 174342 189229 155014 51516 89486 136095
13435 136095 124076 159795 198759 166132 215970 269252 228054 180088 162749 158212 129867 169917
13423 169917 179631 142463 77675 118277 122177 72203 7110 -24401 67023 121852 136138 92355
13411 92355 87969 112766 148865 102913 73805 94768 150773 103743 116114 83060 77595 91109
13399 91109 126035 73607 -19544 -19723 -39632 -55584 13871 -73465 -153809 -87986 -49997 -71155
13387 -71155 -50345 -60148 -16801 49364 132301 169788 135381 147428 183623 162801 112366 39949
13375 39949 -53077 -62053 12140 118624 176478 78595 -30043 -53082 -16981 -43720 -32586
13364 -32586 -64339 -8145 38320 34807 28054 40398 65939 38264 61757 153097 119969 -15355
13352a5355L3104J08089K1143k1140k8721n0163m2730N5606M1038k3989j04390
13341b7508l9586J0656N5707J00203L097M4165j00116l7839N566J5788Q93l8772
13329g746J7934q26l2800K7935O3513n5652p5574k7358j0007J29636K8600m5839
13317A1816l4329n3525k22J3006p8607l3319P0085J42870O7206l9524l9989k88
13305B5180l4702k0345n6484N9341k2707l6321L6747n1965L3674R6061m7417K9645
13293A0707P7189J5684p9969k4486K1604N55M3851K086J6845R827J0502P1617
13281A76012o307m2560L441j6673K1954R1118J3130r2609j36506n9501l5141M1839
13269d1803P9854N9108P6279j460l3703p7667l5373j895L6023J0142l63k9581
$$ plain form
13352 -15355 17749 125838 146981 125841 97120 46957 4227 59833 100871 76882 -27508
13341 -27508 -67094 -56438 -731 99472 102569 146734 46618 8779 14345 30133 31026 -7746
13329 -7746 10188 9362 -23438 4497 68010 12358 -63216 -90574 -100581 29055 57655 11816
13317 11816 -22513 -76038 -76260 -63254 -141861 -175180 -105095 37775 104981 65457 25468 25180
13305 25180 -9522 -29867 -86351 -27010 -49717 -86038 -49291 -101256 -67582 28479 -18938 10707
13293 10707 87896 103580 23611 -875 20729 21284 65135 67221 84066 93893 104395 176012
13281 176012 169705 127145 130586 113913 135867 226985 240115 147506 11000 -48501 -83642 -41803
13269 -41803 38051 97159 173438 171978 138275 60608 25235 23340 59363 69505 69142 39561
13257C9561m7257p1L1085N9483L302K2112k0812r1832j9358J8036K8512k1460
13245A301m5447n7018P1425J32551K3656j7255j05973r8523l5793j0692J19579
13234b2189O2582o1839K1026Q2902J6611N8771O8050N5483Q581j21968r6716j5254
13222E6040m3827n3548J0805k6061m7800M9353j0870K5556R4262m7206m1139L7438
13210C003J5163j8285L4756M8554l2989m6036k8861l4135M981P5280Q798K554
13198C2783l9415J4288J4667l5797J5776O6083k4477l253m856o0727L0866L7874
13186D3812k8864K0180K0500K2422K0276q8030j13861k1697Q2086N3329J22819
13175A32972o7697q6962r2685o9361O1500O3101M7218l8077K3858N1460L3468
$$ plain form
13257 39561 -7696 -7767 23318 82801 86103 108215 87403 -4429 -23787 -5751 22761 1301
13245 1301 -44146 -101164 -29739 102812 126468 109213 3240 -95283 -131076 -141768 -22189
13234 -22189 40393 -21446 -420 82482 99093 157864 225914 281397 289978 168010 71294 56040
13222 56040 12213 -41335 -30530 -56591 -104391 -55038 -65908 -40352 53910 6704 -34435 3003
13210 3003 18166 -119 34637 83191 50202 4166 -24695 -58830 -53849 21431 30229 32783
13198 32783 -6632 7656 22323 -13474 2302 68385 43908 40655 35799 -24928 5938 43812
13186 43812 14948 35128 55628 78050 98326 10296 -103565 -125262 -43176 10153 132972
13175 132972 65275 -21687 -114372 -183733 -122233 -59132 -11914 -49991 -26133 25327 58795
13164E8795j4743L7235N2989p4320q8606J1675J7837L6990j5962L4354L8229q124
13152H6349j10289k8818N5844L7494n313L886P39l2759n5823M5938j8564k4420
13140d5736L5642N3096M3818p5275n4975M5204Q0012m9258n9728O9608M0671j01598
13128a8519m9905Q9515R4009J3422r2544j35154j9821Q0615R008k8045j7612J14617
13116C9586M3867l3258k5785k261N876P158n8275o062n2598l5407L0191L7807
13104d9161O518J9865J6668O1311N3733M695k343m850j4959l3505l9248p8431
13092e9707p303N2484q941L9839O4224r356j1657r368j3475p2556Q6297O7494
13080A17975r4220l8773k6634J7395N6943M0252j9581o5203n7334o5921L0395
$$ plain form
13164 58795 44052 81287 134276 59956 -28650 -16975 862 37852 21890 56244 94473 86349
13152 86349 -23940 -52758 3086 40580 35267 39153 39892 7133 -48690 -2752 -21316 -45736
13140 -45736 -10094 43002 86820 11545 -43430 1774 81786 32528 -27200 42408 83079 -18519
13128 -18519 -68424 21091 115100 128522 35978 -99176 -118997 -38382 -29374 -57419 -75031 39586
13116 39586 83453 50195 24410 22149 28025 35183 -23092 -29154 -81752 -117159 -86968 -49161
13104 -49161 -42643 -22778 -6110 55201 108934 113629 111286 106436 91477 57972 18724 -59707
13092 -59707 -67010 -14526 -23467 16372 80596 71240 59583 50215 36740 -35816 50481 117975
13080 117975 23755 -15018 -41652 -24257 32686 72938 53357 -11846 -69180 -135101 -104706
13069a04706N0246k836k746k0828J8111N6828m909k1888k4005j1j318j1167J30650
13056F1421K8872k7238p9906O9502K0395J5041J6673k3695o6364m8985J3125k9378
13044e0537M059P745m720M1474Q3831k1805o3748J1340J43176K6458o3420o2507
13032E1346j13107n6329M0863L5360J0631m884Q5573J0462j7037k5088k3215L1067
13020B5642M9411r6880k9481O064K4382o165N1849L9279l6192l6227N1138k0077
13008B2743l9544J2880Q4585P2k1840N608k5430p9087j0295j1236L4404o295K9648
12995c787R7343K420l1241N8197j01684n6644J6119O1177J4883j8905l3793M587
12983H672L7147J0016j7214k5240m5557j9408k5874j0891M5925J927K3141M0602
$$ plain form
13069 -104706 -54460 -57296 -60042 -80870 -62759 -5931 -10840 -32728 -56733 -56744 -58062 -69229 61421
13056 61421 90293 63055 -16851 52651 73046 88087 104760 81065 14701 -34284 -21159 -50537
13044 -50537 -46478 -38733 -43453 -1979 81852 60047 -3701 7639 150815 177273 113853 51346
13032 51346 -61761 -118090 -77227 -41867 -31236 -36120 49453 59915 42878 17790 -5425 25642
13020 25642 75053 -21827 -51308 -45244 -20862 -27027 24822 64101 27909 -8318 42820 22743
13008 22743 -16801 -3921 80664 80736 58896 64504 39074 -40013 -50308 -61544 -27140 -33435 -3787
12995 -3787 93556 95976 64735 122932 21248 -35396 -19277 41900 56783 37878 4085 8672
12983 8672 45819 55835 38621 13381 -32176 -51584 -77458 -88349 -42424 -40497 -17356 23246
12971B3246M6427L5748k4099K9417L3008P7358P0835N978m6391r6878M8725j5157
12959A88217j05816j5744Q451R6988j1948q2886o6298j1033j256N7975k1319j8035
12947A7296K8604K4245k3198r3216J2613K1617K5058J23675J0079o6226q1222
12936f75j7496j4554K7411N8220K4180Q0601j6934n3811m9233k458L6473j5548
12924E6176n6079k3652N1707P1930k1400j05102j25363L345L7698K0543k4537
12913a14734k6089l3486N7235P9524M1191K7121K7774K5686k0784p6127p5938
12902h8627l4727M2134M6348L3971j5075P882M402k4768J5361J25209P5013n2120
12890A35003p7888r946N5092L4821k2260J0835l6549K2151M3459j40382m1431
$$ plain form
12971 23246 69673 105421 81322 110739 143747 221105 291940 297918 251527 154649 203374 188217
12959 188217 82401 66657 75108 172096 160148 77262 10964 -69 -1325 56650 35331 17296
12947 17296 45900 70145 46947 -46269 -33656 -12039 13019 136694 146773 80547 -675
12936 -675 -18171 -32725 -5314 52906 77086 157687 140753 86942 37709 35251 71724 56176
12924 56176 97 -23555 28152 100082 78682 -26420 -151783 -148438 -110740 -90197 -114734
12913 -114734 -140823 -174309 -117074 -37550 3641 30762 58536 84222 63438 -12689 -88627
12902 -88627 -123354 -81220 -34872 -901 -15976 -8094 -3692 -28460 -13099 112110 187123 135003
12890 135003 57115 47169 102261 137082 114822 125657 89108 111259 154718 14336 -27095
12879b7095M2124N3885N129j5864m6283P020l5225O8494k1462l7235M691J0425
12867H604L3351K5488N3969l9037n9698n0678L5553M6890o9549o1663M0100r328
12855d5998j960K5091M8742l2193m8070k8395L3139L4823j0329o041J5044o2638
12843g8785j211R7667R550R1743O0890j08694r6608l3437Q5341O182K0085J0014
12831F2737K7451J8196o3314j01279O6550L880l2189m6746J1864O4784r841J9804
12819B1897l3237p935l0464j00111l5172O6123P660J4704N8225m5992q2393k1011
12807a87706N9167Q2573Q6198N58l5470Q720n0795P363Q2691L8733J4570L8587
12795A45189J4037m3037p0115K769M358k9116m7790K0521j4461k8027K0892K6884
$$ plain form
12879 -27095 15029 68914 74043 58179 11896 18916 -16309 52185 30723 -6512 -1821 8604
12867 8604 41955 67443 121412 82375 22677 -28001 7552 54442 -15107 -76770 -36670 -45998
12855 -45998 -47958 -22867 25875 -6318 -54388 -82783 -49644 -14821 -25150 -31191 -16147 -78785
12843 -78785 -79996 17671 27221 118964 179854 71160 -25448 -58885 26456 32638 52723 62737
12831 62737 90188 108384 45070 -56209 10341 14221 -17968 -64714 -52850 11934 2093 21897
12819 21897 -11340 -19275 -49739 -149850 -185022 -118899 -111239 -96535 -38310 -84302 -166695 -187706
12807 -187706 -128539 -45966 40232 40790 5320 14040 -36755 -29392 53299 92032 106602 145189
12795 145189 159226 116189 46074 48843 53201 24085 -23705 -3184 -17645 -45672 -24780 2104
12783B104k9063K334O0814j5022p6156r468J09408P8665k0329m0153N3315J1077
12771A27526r2273o0557J1382P0575M5243l86m6656l8407o028K6974M0596j8093
12759E9896Q3745K9055p7216j15654q9890L0776Q9868Q7856L6399Q3540l1018
12748A87357q5559l1503l2113l3505L87p281K4546O6950N8253J6762P5213m3916
12736A95591q4368L1538K5241k4376l5200P1744K0830R0167M5640M8930n402J0194
12724C90529Q3018K68870L18622L65797L26713M10595N88642N28804L00526J62340
12714C744456l48610o40922o45099m96205l08596k44778k11771r6899r9813l6490
12704F15273m5479n716j0036m6576l4491n7865k7376M5627O1563K9203N95o6577
$$ plain form
12783 2104 -26959 -24625 36189 21167 -54989 -64457 44951 123616 103287 63134 116449 127526
12771 127526 35253 -25304 -13922 56653 101896 101510 54854 16447 10419 37393 77989 59896
12759 59896 143641 172696 95480 -20174 -110064 -79288 10580 98436 134835 218375 187357
12748 187357 101798 70295 38182 4677 5064 -2217 22329 89279 147532 164294 239507 195591
12736 195591 111223 142761 168002 143626 108426 180170 201000 291167 336807 385737 380335 390529
12724 390529 473547 742417 1061039 1426836 1753549 2164144 2752786 3281590 3582116 3744456
12714 3744456 3395846 2754924 2109825 1613620 1305024 1060246 848475 751576 651763 615273
12704 615273 569794 564078 554042 507466 472975 415110 387734 433361 494924 524127 524722 458145
12692D58145n867L9739k7061J2756n6994l878J4691r5735o8811o5531m2236k2564
12680A36654m869L8687M3676O8892Q1993k9691j42085j05557l7909M8684L7628
12669A36103p8754l2924j8711k6104M3276N1383M049l1413J320K159Q99k2629
12657B8654K4577K8385J9792P8756L3692p3994q2557m4349M3372K7424l6430K2962
12645G0284M2817L531p4863j75602m546R1532M2995J2205J21400M3398J5907j6471
12633A72587k9866p0072M7375K726O9984J1009k0379k865k1861n2436N256j4353
12621I7105o1258N1903O853K0345k7635p5648l1590J6338N0345J12189R046n6350
12609A11643r7626M0652L4688R403j4272K4207j18904m9912O2435N0099O3657
$$ plain form
12692 458145 452278 492017 464956 477712 420718 416840 431531 335796 266985 201454 159218 136654
12680 136654 131785 170472 214148 283040 365033 335342 193257 87700 49791 98475 136103
12669 136103 57349 24425 5714 -20390 22886 74269 78318 46905 48225 50384 51283 28654
12657 28654 53231 81616 101408 180164 213856 139862 57305 12956 56328 83752 47322 70284
12645 70284 113101 116632 41769 -133833 -138379 -46847 -3852 8353 129753 173151 189058 172587
12633 172587 142721 72649 120024 122750 192734 203743 183364 180499 158638 106202 111458 97105
12621 97105 35847 87750 94603 114948 87313 11665 -19925 -3587 46758 158947 167993 111643
12609 111643 14017 54669 89357 98760 84488 108695 -10209 -60121 2314 52413 116070
12598A16070n16j2811k1944q2896J3824P6944J4014k4503K0784k6272q028M3520
12586A08186Q713m7523p3307j01909N3501O2326Q429o481l3545l7281K5882J531
12574c1478J14543Q3230m5255m1525o9153q4516J573M2714L9455K0405K0674M1004
12562I1671l5260j347k0326R078J0064J3349j0741m2814j28809O8502O7214j4577
12550F004n2331j9002N8837N3372L217N874j2007o2250l3547K0258J11948p4320
12538F053N1450O8669M1258n4524o0390k9447l9332l8904k2953R0078M2739L9331
12526I4028M3517k2552J6699J6883p754k4851k5265K09J069k6517L6683K2842
12514A24991P46M823j7274p8597o139M8332o0729m057P7831k4555n2027N017O686
$$ plain form
12598 116070 115554 102743 80799 -2097 11727 88671 102685 78182 98966 72694 64666 108186
12586 108186 116899 69376 -3931 -105840 -52339 9987 18416 11935 -21610 -58891 -33009 -31478
12574 -31478 83065 166295 121040 79515 10362 -74154 -72581 -29867 9588 29993 50667 91671
12562 91671 56411 55064 34738 43816 53880 67229 56488 13674 -115135 -46633 20581 6004
12550 6004 -46327 -65329 -6492 46880 50097 55971 43964 -18286 -51833 -31575 80373 6053
12538 6053 57503 126172 167430 112906 52516 23069 -16263 -55167 -78120 11958 54697 94028
12526 94028 137545 114993 131692 148575 140821 115970 90705 90914 91983 65466 102149 124991
12514 124991 125737 130560 113286 34689 28550 76882 16153 12096 89927 65372 13345 18362 25048
12501B5048P397k2646n143k8355j6286m4306K6404L5069J9524K6758K0874R4415
12489A38753l1541r6532l1494J339N1258j0913K003K7005l1708j3430P0331l697
12477G1374j8035J0246K5160L766n1559M7858r5224j1241P4403j1566j3815j3526
12465A7841Q7834J3842l759K3085o8219j17140K2010O0511R2019K8016k2337K6986
12453A60689l6091j02852q5181L3869Q9042M9538j3846p8685l1449m0859j1820
12442f7645Q9637l3406J3209J08205R866m999K8803n1826K7958k2906m0655m2636
12430A3605m4147O471J8943n819J6420K2834j1418N2099L5149O5425p0730n5987
12418D2845l4137O3906M7199o5625n5961j6622K4192K1412r009N9478K6508q7104
$$ plain form
12501 25048 32445 9799 4656 -23699 -39985 -84291 -57887 -22818 -3294 23464 44338 138753
12489 138753 107212 10680 -20814 -19475 31783 20870 22873 49878 18170 4740 75071 71374
12477 71374 53339 63585 88745 92511 40952 88810 -6414 -17655 56748 45182 31367 17841
12465 17841 105675 119517 115758 138843 70624 -46516 -24506 36005 128024 156040 133703 160689
12453 160689 124598 21746 -63435 -29566 59476 109014 95168 16483 -14966 -55825 -67645
12442 -67645 21992 -11414 1795 110000 119866 114867 143670 91844 119802 96896 56241 13605
12430 13605 -30542 -24071 -5128 -10947 5473 28307 16889 68988 104137 169562 98832 42845
12418 42845 8708 72614 119813 54188 -1773 -18395 5797 27209 18200 77678 104186 17082
12406A7082n1852L8301k3829J4658N9835j1652K5915J9548k3843J286L7762K9978
12394A33189k7123p3174j978O2807N214L0019k6105M9883p126k1698l4563L0061
12382A19406m8175o2318R9239J6560J4809k1953r150r7497m2793O7897o228L4314
12370F4111N101N1592M0354o4044m7099N9891Q4496k9257p1418m0472r3680K6018
12358a4407P5171O2269q5341o0377N8017O8400l772l5395L0076o9911K94K8953
12346E3977N2165Q7063M1510n6098k8887N1061p1888l8558J7663j2361K6518M4191
12334A66356m2285n0411p0357k3588P4738J22609q3821L5876L3713j4003j342
12323A47485m7207n0603n8437j0003M8956m8044l7571m5516L0794O0232P0198
$$ plain form
12406 17082 -34770 3531 -20298 -5640 54195 42543 68458 88006 64163 65449 103211 133189
12394 133189 106066 32892 30914 93721 98935 128954 102849 152732 145606 123908 89345 119406
12382 119406 71231 8913 108152 124712 139521 117568 108418 10921 -31872 36025 29797 64111
12370 64111 69212 120804 161158 97114 50015 109906 194402 165145 93727 53255 -40425 -14407
12358 -14407 60764 123033 37692 -22685 35332 103732 99960 64565 94641 24730 25024 53977
12346 53977 106142 193205 234715 178617 149730 200791 128903 90345 108008 95647 122165 166356
12334 166356 124071 73660 3303 -20285 54453 177062 93241 129117 162830 148827 147485
12323 147485 100278 49675 -8762 -18765 30191 -17853 -55424 -100940 -70146 -9914 60284
12312F0284J49699q5595l6094K313J29166M5533J600o6139n2109r385l0429J5310
12300A24154K1781m051m3657N7458J1902Q8927M1353k1394r7811j41966m6376
12289i680K4709J07354J1710l596j8616j00501m225K3742M2917M1820P61M1309
12277A57704K871O85J9173j5829L2074k3157l6616n5225M3631O8803M5574K131
12265B41819o4004k5491m1507K6858K649q50p0217K1668N0771k614O1823Q5262
12253B86167p37n2499n284P336L1819k4112r8600p181J24302J5950r7885L1767
12241B11043q532K4994j880M429K1029m1365L3987l8865q7164O247Q2048J2062
12229B18033n2196j12099J8244L2130L1087N0170o5845q7073J3829L2273J04772
$$ plain form
12312 60284 209983 124388 88294 90607 219773 265306 266906 200767 148658 139273 108844 124154
12300 124154 145935 141884 98227 155685 167587 256514 297867 276473 178662 36696 -9680
12289 -9680 15029 122383 134093 130497 111881 11380 7155 30897 73814 115634 116395 157704
12277 157704 160575 161260 180433 164604 196678 173521 136905 81680 125311 194114 239688 241819
12265 241819 177815 152324 110817 137675 140324 139474 69257 90925 141696 139082 200905 286167
12253 286167 285430 232931 227647 234983 266802 242690 144090 136909 261211 277161 179276 211043
12241 211043 202511 227505 225625 230054 251083 209718 243705 204840 117676 123923 205971 218033
12229 218033 165837 53738 71982 104112 135199 185369 119524 32451 46280 78553 183325
12218A83325R6503k2538l3498j09833k8171j884P4013R0048L3420j9380l3293
12207B28712M13K7154N1804m6469P969j11975m9835J7301j0278J4686M2473L7201
12195B09156l4277L333M3471n583J1048M8008J3612m8915o1163O9300N8326N9519
12183C65835k1764n2084M1910J6890N8889j2394k5131N0254j7666K4652K4200
12172D53591m4727j170k7528N752p5698L188J28494J09162k6433q1761o1929l8500
12160C42441n6550K3655Q7128J13147L377O920P9692m178K2606O1896j7179q0907
12148E82048J3095K0261L0502p0715M496J7833R0782J65045N0026L3866J0326
12137I47565j9351K2138J06248j5020j1975N9683j6430n3329K3172k3609m4192
$$ plain form
12218 183325 279828 257290 223792 113959 85788 83904 157917 247965 281385 262005 228712
12207 228712 229125 256279 308083 261614 269583 157608 107773 125074 114796 129482 171955 209156
12195 209156 174879 178212 221683 216100 227148 275156 288768 239853 178690 247990 306316 365835
12183 365835 344071 291987 333897 350787 409676 397282 372151 422405 404739 429391 453591
12172 453591 408864 407694 380166 385918 310220 313408 441902 551064 524631 442870 380941 342441
12160 342441 285891 309546 396674 509821 513198 520118 599810 595632 618238 680134 662955 582048
12148 582048 595143 615404 645906 575191 579687 597520 688302 853347 903373 937239 947565
12137 947565 928214 950352 1056600 1041580 1029605 1089288 1072858 1019529 1042701 1019092 974900
12126I74900j33689o1785o6321l3385O9466J9806N9316M448J2414K0048M1471
12115I06689l1760p857P2485j659P6617l4402o023l2992J2630j4032N1661j7834
12103I73523J76787J97804K08343P9459J29138J61349K47078K04081J22213K11946
12093B711721J19539J30487N9692R299j7599p7070j69158j66219j57733k33030
12083B209929k31300r3407m0819q8224l7791m1669J5279j4634m1788j1186J8129
12072A642519q5234M3353Q3676m7902m8740L1072l3274J6389M1248O0285Q9098
12061A792490Q1478J9130J2865P0330J65931J22757J08125J91383J86372J83755
12051B934616K22240K24547J95083Q9193L6013Q0901q6185j38884k20982k29424
$$ plain form
12126 974900 841211 779426 713105 679720 749186 768992 828308 832756 845170 865218 906689
12115 906689 874929 867072 939557 937898 1014515 980113 974090 941098 953728 939696 991357 973523
12103 973523 1150310 1348114 1556457 1635916 1765054 1926403 2173481 2377562 2499775 2711721
12093 2711721 2831260 2961747 3021439 3030738 3013139 2936069 2766911 2600692 2442959 2209929
12083 2209929 1978629 1885222 1844403 1756179 1718388 1676719 1691998 1677364 1635576 1624390 1642519
12072 1642519 1557285 1600638 1684314 1636412 1587672 1618744 1585470 1601859 1643107 1703392 1792490
12061 1792490 1873968 1893098 1905963 1976293 2142224 2264981 2373106 2564489 2750861 2934616
12051 2934616 3156856 3381403 3576486 3665679 3701692 3782593 3696408 3557524 3336542 3107118
12041C107118j21329q6380j29265j24938j20938m7548q3943p0590J2433j905L8815
12030B371530L4385L8637q967p6125k6878L5076o064N1578O9822J00598k2495
12019B561097n7394L144m9978P5459P5227L7444O3312L9803J06704J8999P3653
12008B947470J52262J85288J10994Q7341N7671L8623O288k7963j998n319n2763
11997C497894m8684Q9016R2618p7770n0390L3530N8697O8667M9439L9140M6360
11986C798517J49266N9231N3899O3311J18992J83557N8494M4241P0758M8639J28812
11975D777717J04278P8808N3081O0027O1753J42320J88745J71395J66898J28181
11965E933203J64756J36262P7999J26379J27436J71661J25385J90174K67059K42203
$$ plain form
12041 3107118 2985789 2899409 2770144 2645206 2524268 2476720 2392777 2322187 2334620 2332715 2371530
12030 2371530 2405915 2444552 2435585 2359460 2332582 2367658 2361594 2413172 2482994 2583592 2561097
12019 2561097 2503703 2506847 2456869 2532328 2607555 2644999 2708311 2748114 2854818 2873817 2947470
12008 2947470 3099732 3285020 3396014 3483355 3541026 3579649 3585937 3557974 3555976 3550657 3497894
11997 3497894 3449210 3538226 3630844 3553074 3502684 3536214 3594911 3663578 3713017 3752157 3798517
11986 3798517 3947783 4007014 4060913 4124224 4243216 4426773 4485267 4529508 4600266 4648905 4777717
11975 4777717 4881995 4960803 5013884 5073911 5135664 5277984 5466729 5638124 5805022 5933203
11965 5933203 6097959 6234221 6312220 6438599 6566035 6737696 6863081 7053255 7320314 7562517
11955G562517J66434J61325J44204K00949J81355K37162K31457J98405K75583
11946I359391J74802K20807K33377K91686K58216J57958J73684J83445K42953
11937A1296319K76309K24504J65758J04973J54209L17431K26611N2757J39065
11928A2957936K30956J35152J44074J07000J16787O0490J8373M290J866M9878
11918A3826802Q4274k3151m81j10971j93709n2682j00420q6421j38463j10453
11908A3094325o6198j27904j06028j86300j57791j62888k59850k00802j60313
11899A1666251j61702k21873j68317j32068j02748k06699k21589j78031k41141
11890A0032083k81864j45086p5297j60881k58305j93196k53746k11872j72808
$$ plain form
11955 7562517 7728951 7890276 8034480 8235429 8416784 8653946 8885403 9083808 9359391
11946 9359391 9534193 9755000 9988377 10280063 10538279 10696237 10869921 11053366 11296319
11937 11296319 11572628 11797132 11962890 12067863 12222072 12539503 12766114 12818871 12957936
11928 12957936 13188892 13324044 13468118 13575118 13691905 13752395 13770768 13775058 13776924 13826802
11918 13826802 13911076 13887925 13887444 13776473 13582764 13530082 13429662 13343241 13204778 13094325
11908 13094325 13028127 12900223 12794195 12607895 12450104 12287216 12027366 11826564 11666251
11899 11666251 11504549 11282676 11114359 10982291 10879543 10672844 10451255 10273224 10032083
11890 10032083 9750219 9605133 9529836 9368955 9110650 8917454 8663708 8451836 8279028
11881H279028j12988j17683q4383p8955j94886j77967l01381j43593m2790o5401
11871F959001j18251j08120j16231j06904j58041j84655j22680j20681j26926
11862E796512j22867r5557q7508Q311p9932j84994r6542q4406r8655j11472o9806
11851D773084j07399j03991J2876K4018j01915j20089o9268q3873l912r6445j42880
11840C980206k6942j09297l6451m144P076p7256j55387K5631l9256o6912o6986
11829C430282k03200l3218J5339k1139o1340m0639k1585j0238j07186j90225k0384
11818B736467L5653p3724n2000L6484p4498O537j2625q2988j891j2612j6586J5272
11806B503489j28225r4272K2706k1919k1159q5688r3482n4051j9291k4224Q9652
$$ plain form
11881 8279028 8166040 8048357 7963974 7885019 7690133 7512166 7210785 7067192 7024402 6959001
11871 6959001 6840750 6732630 6616399 6509495 6351454 6166799 6044119 5923438 5796512
11862 5796512 5673645 5578088 5490580 5498891 5418959 5233965 5137423 5053017 4954362 4842890 4773084
11851 4773084 4665685 4561694 4574570 4598588 4496673 4376584 4307316 4223443 4219531 4123086 3980206
11840 3980206 3953264 3843967 3807516 3803372 3810448 3733192 3577805 3603436 3564180 3497268 3430282
11829 3430282 3227082 3193864 3209203 3188064 3126724 3086085 3064500 3054262 2947076 2756851 2736467
11818 2736467 2772120 2698396 2646396 2682880 2608382 2614919 2602294 2519306 2517415 2504803 2488217 2503489
11806 2503489 2375264 2280992 2303698 2281779 2260620 2174932 2081450 2027399 2008108 1983884 2073536
11795B073536j830J5981k3504O013k1720n060p5284q0299L0685K6807k6148m5529
11783A873648R387p8330o2817L5785K359q242M2797m5748j16480m3543m999k4886
11771A578931J5792L4469m3629k5975p1656n7148o7113K7721k5592k6068M9586
11760A389318l8434q5080R82K352J0122j3140K3799J9459N1411n9087q2865k4104
11748A194733m1588M233J9808m5836L960L9714K2235q5929o5309l4063N3687O5924
11736A131569p88m529k368M4251q2803r2945J2381o46n840Q4237l2312n6502q2776
11723I10929j1204r124Q099L3868L6663l8598M169o6818o8903r512L5089j0408
11711H14250k5017k5690M3283L7982m7084m3416Q469n9345J178K0964j02294N16
$$ plain form
11795 2073536 2071706 2087687 2064183 2070196 2048476 2043416 1968132 1887833 1918518 1945325 1919177 1873648
11783 1873648 1883035 1804705 1741888 1777673 1780032 1771790 1814587 1768839 1652359 1608816 1603817 1578931
11771 1578931 1594723 1629192 1585563 1559588 1487932 1430784 1363671 1391392 1365800 1339732 1389318
11760 1389318 1350884 1265804 1266786 1269138 1279260 1266120 1289919 1309378 1360789 1301702 1218837 1194733
11748 1194733 1153145 1157378 1177186 1131350 1135310 1175024 1197259 1111330 1046021 1011958 1065645 1131569
11736 1131569 1130781 1126252 1123884 1168135 1085332 992387 1004768 1004122 998282 1082519 1050207 993705 910929
11723 910929 899725 890601 898700 932568 969231 930633 934802 867984 799081 789569 824658 814250
11711 814250 789233 763543 806826 844808 797724 754308 762777 703432 704610 725574 623280 623796
11699F23796J32387J4357n1301K0944o734N2946L6565j23183j7176p8987l7318
11688E66296Q3465J4241K4089o1186r0688m7144p3608R5240J07400M6586M462
11677F69153j3845j4608k6818l9696m1094J7501p3915K0872N7864m2100m2801
11666D70513p1387o4059M9375P8032n741q8119K3535N9737N895j26109M045M0022
11654C75739l7998L6490K1050O0923k6171L2303N5678M7454n9390m5268N1211
11643E12021N2265o6276m1898l7991J0597k1901l8989p9794Q143j4537m1763M0590
11631B80467J1249J9638O0093O2479J9426K1199k7063K2150J1603L6294j09879
11620D07656m8798j01j179k2161L3628M0943P211k2100L8865J2621p8585p5070
$$ plain form
11699 623796 756183 770540 719239 740183 733449 786395 822960 699777 682601 603614 566296
11688 566296 649761 664002 688091 626905 536217 489073 415465 510705 618105 664691 669153
11677 669153 655308 640700 613882 574186 533092 550593 476678 497550 555414 513314 470513
11666 470513 399126 335067 384442 462474 456733 368614 392149 451886 457781 331672 335717 375739
11654 375739 337741 374231 395281 456204 430033 462336 518014 565468 506078 460810 512021
11643 512021 564286 498010 456112 418121 428718 406817 367828 288034 296177 281640 239877 280467
11631 280467 291716 311354 371447 433926 453352 474551 447488 469638 481241 517535 407656
11620 407656 358858 358757 357578 335417 369045 409988 417199 395099 433964 446585 368000 292930
11608B92930j7657l6496L1551l5035J7144O1960P135J2816j0316l3238M9547P1617
11596D11958M7748l525K6947J7109p0392k9796N1447r339J88L5071p1902j5035
11584C90479j4225n6538O2629L3236K9663j4905K6048j34659n1555R1139O0691
11573D22003o3650j00484j9155N89L2213m557O7608O04q1845r6636j0693J11795
11561B57792k0172m3435r6506p3060J05309J47164j0188J962M5985m8932j7943
11550B47976l7053M253n441j196P4432K8429j45517l3173N8574N2367J730q7577
11538A57804r5125j4403M2139P2816P0428M4842p8607r31R207P189O3925o5047
11526B14237r785K9963N9467k400o8509n904M2046K3698J8181l9318p165k2691
$$ plain form
11608 292930 275273 238777 270328 235293 252437 314397 321532 334348 324032 290794 340341 411958
11596 411958 459706 456181 483128 500237 429845 400049 451496 442157 442345 477416 405514 390479
11584 390479 376254 319716 382345 415581 445244 430339 456387 321728 270173 361312 422003
11573 422003 358353 257869 238714 239303 271516 266959 334567 335171 253326 156690 145997 257792
11561 257792 237620 194185 97679 24619 129928 277092 266904 268866 314851 265919 247976
11550 247976 210923 215176 209735 208539 282971 311400 165883 132710 191284 243651 245381 157804
11538 157804 62679 48276 90415 163231 233659 278501 199894 198963 208170 215359 279284 214237
11526 214237 204452 234415 293882 291482 222973 217069 259115 282813 300994 261676 254511 231820
11514B31820o0479M0018l0322o0625P6529K9212L9514L6353n4492m3980n561n9171
11502A38816l7428j9262J6915O5805n446l8416p3695j0011Q7298J7559K1789M9791
11490B13715M1106k7705j9130K501K1108j4235J01655n5453j20242r0N2982L6692
11478B32904k5965P168m3949p7647J1398k0042N7284K2163K5302j6269q3176q2966
11466F205j007M3078r996J2602R1851N1676o239j3771n9601l0168K48o6519l4842
11453a6483K4755L0381q679q00O061L1774P348N6409l1818Q591k2719J6770P8496
11440A80086m1643l9809J5789j4580L7314l1770J2758n4912l5474J058n7708P7600
11428D8709P1761k9115m175K1986m9026m3649L562L518L3688J10168n7354j2612
$$ plain form
11514 231820 171341 211359 181037 120412 196941 226153 265667 302020 247528 203548 197987 138816
11502 138816 101388 82126 99041 164846 159400 120984 47289 37278 124576 142135 163924 213715
11490 213715 254821 227116 207986 210487 231595 217360 319015 263562 143320 143230 196212 232904
11478 232904 206939 214107 170158 92511 103909 83867 141151 163314 188616 172347 89171 6205
11466 6205 5198 48276 38280 50882 142733 194409 188170 174399 114798 84630 84878 18359 -16483
11453 -16483 8272 38653 29974 29174 35235 67009 74357 130766 98948 107539 84820 101590 180086
11440 180086 138443 98634 114423 99843 137157 105387 118145 63233 27759 28817 -28891 48709
11428 48709 120470 91355 87180 109166 60140 16491 20053 23571 57259 167427 110073 97461
11416I7461o1278m0699J5925J7154j830o6543l4978J15500Q6183l4281n2891j3687
11404B6036Q2664K0464K2422n3110m1660n7730M5700J7393j2320L7Q267k8384
$$ plain form
11416 97461 36183 -4516 11409 28563 26733 -39810 -74788 40712 126895 92614 39723 26036
11404 26036 108700 129164 151586 98476 56816 -914 44786 62179 49859 49896 58163 29779
$$ [...]
##END NTUPLES=NMR SPECTRUM
##END=
