##TITLE=Analysis number 319588
Compound Code mo 07293
Project Code adrs
Chemist Name fudan
##JCAMPDX= 6.0         $$ Bruker NMR JCAMP-DX V2.0
##DATA TYPE= NMR SPECTRUM
##DATA CLASS= NTUPLES
##ORIGIN= Bruker BioSpin GmbH
##OWNER= nmr
$$ XWIN-NMR		Version 3.5
$$ Fri May 19 13:15:54 2006 GMT Daylight Time (UT+1h)  MAYBRIDGE\nmr@NMR_250MHZ
##.OBSERVE FREQUENCY= 250.131544655141
##.OBSERVE NUCLEUS= ^1H
##.ACQUISITION MODE= SIMULTANEOUS (DQD)
##.ACQUISITION SCHEME= undefined
##.AVERAGES= 16
##.DIGITISER RES= 18
##SPECTROMETER/DATA SYSTEM= dpx250
##.PULSE SEQUENCE= zg30
##.SOLVENT NAME= DMSO
##.SHIFT REFERENCE= (INTERNAL, DMSO, 0, 16.522)
##AUDIT TRAIL= $$ (NUMBER, WHEN, WHO, WHERE, WHAT)
$$ ##TITLE= Audit trail, XWIN-NMR		Version 3.5
$$ ##JCAMPDX= 5.01
$$ ##ORIGIN= Bruker BioSpin GmbH
$$ ##OWNER= nmr
$$ C:\u/data/dgb/nmr/ADRS/4770/pdata/1/auditp.txt
$$ ##AUDIT TRAIL=  $$ (NUMBER, WHEN, WHO, WHERE, WHAT)
(   1,<2006-05-19 13:15:32.81 +100>,<MAYBRIDGE\nmr>,<NMR_250MHZ>,
      <created by zg, POWCHK disabled, PULCHK disabled
       configuration hash MD5:
       84 BC 41 DB A1 6E 1D 46 DA 25 12 A5 C1 ED C5 3A
       data hash MD5: 64K
       EB A9 BB E1 C7 C1 F6 7A 67 5A C3 4B 27 25 00 90>)
(   2,<2006-05-19 13:15:44.81 +100>,<MAYBRIDGE\nmr>,<NMR_250MHZ>,
      <Start of raw data processing
       ef LB = 0.3 FT_mod = 6 PKNL = 1 SI = 32K 
       data hash MD5: 32K
       89 01 48 7E E6 46 97 C3 D4 91 7B 0C 2F 76 EA A7>)
(   3,<2006-05-19 13:15:46.41 +100>,<MAYBRIDGE\nmr>,<NMR_250MHZ>,
      <apk 
       data hash MD5: 32K
       38 A4 5A BA 85 F4 79 5A E8 E3 27 DD E6 DE DF DF>)
(   4,<2006-05-19 13:15:47.22 +100>,<MAYBRIDGE\nmr>,<NMR_250MHZ>,
      <abs ABSG = 5 
       data hash MD5: 32K
       F9 69 F4 52 FE 71 15 D5 CE 15 D8 A9 BB F0 8B FE>)
$$ ##END=
$$ 
$$ hash MD5
$$ 87 3F 3D 71 00 3D 89 1A 61 80 BA 29 5E 75 13 01
##$RELAX= 
##$RELAX= 
##$RELAX= 
##$RELAX= 
##$RELAX= 
##$RELAX= 
##$RELAX= 
$$ Bruker specific parameters
$$ --------------------------
##$DU= <C:\u>
##$EXPNO= 4770
##$NAME= <ADRS>
##$PROCNO= 1
##$TYPE= <nmr>
##$USER= <dgb>
##$AMP= (0..31)
100 100 100 100 100 100 100 100 100 100 100 100 100 100 100 100 100 100 
100 100 100 100 100 100 100 100 100 100 100 100 100 100 
##$AQSEQ= 0
##$AQ_mod= 3
##$AUNM= <au_zg>
##$AUTOPOS= <31 >
##$BF1= 250.13
##$BF2= 250.13
##$BF3= 250.13
##$BF4= 250.13
##$BF5= 500.13
##$BF6= 500.13
##$BF7= 500.13
##$BF8= 500.13
##$BYTORDA= 1
##$CFDGTYP= 0
##$CFRGTYP= 5
##$CHEMSTR= <none>
##$CNST= (0..31)
1 1 145 1 1 1 1 1 1 1 1 1 1 1 1 1 1 1 1 1 1 1 1 1 1 1 1 1 1 1 1 1 
##$CPDPRG= <>
##$CPDPRG1= <>
##$CPDPRG2= <>
##$CPDPRG3= <>
##$CPDPRG4= <mlev>
##$CPDPRG5= <mlev>
##$CPDPRG6= <mlev>
##$CPDPRG7= <mlev>
##$CPDPRG8= <mlev>
##$CPDPRGB= <>
##$CPDPRGT= <>
##$D= (0..31)
0 1 0 0 0 0 0 0 0 0.06 0 0 0 0 0 0 0.0002 0 0 0 0 0 0 0 0 0 0 0 0 0 0 
0 
##$DATE= 1148040931
##$DBL= (0..7)
120 120 120 120 120 120 120 120 
##$DBP= (0..7)
150 150 150 150 150 150 150 150 
##$DBP07= 0
##$DBPNAM0= <>
##$DBPNAM1= <>
##$DBPNAM2= <>
##$DBPNAM3= <>
$$ [...]
##$SUBNAM7= <"">
##$SUBNAM8= <"">
##$SUBNAM9= <"">
##$SW= 20.6930455092707
##$SWIBOX= (0..15)
0 0 3 0 0 0 0 0 0 0 0 0 0 0 0 0 
##$SW_h= 5175.983436853
##$TD= 65536
##$TD0= 1
##$TE= 295.16
##$TE2= 300
##$TE3= 300
##$TEG= 300
##$TL= (0..7)
0 120 120 120 120 120 120 120 
##$TP= (0..7)
150 150 150 150 150 150 150 150 
##$TP07= 0
##$TPNAME0= <>
##$TPNAME1= <>
##$TPNAME2= <>
##$TPNAME3= <>
##$TPNAME4= <>
##$TPNAME5= <>
##$TPNAME6= <>
##$TPNAME7= <>
##$TPOAL= (0..7)
0.5 0.5 0.5 0.5 0.5 0.5 0.5 0.5 
##$TPOFFS= (0..7)
0 0 0 0 0 0 0 0 
##$TUNHIN= 0
##$TUNHOUT= 0
##$TUNXOUT= 0
##$USERA1= <user>
##$USERA2= <user>
##$USERA3= <user>
##$USERA4= <user>
##$USERA5= <user>
##$V9= 5
##$VALIST= <valist>
##$VCLIST= <CCCCCCCCCCCCCCC>
##$VD= 0
##$VDLIST= <DDDDDDDDDDDDDDD>
##$VPLIST= <PPPPPPPPPPPPPPP>
##$VTLIST= <TTTTTTTTTTTTTTT>
##$WBST= 1024
##$WBSW= 4
##$XGAIN= (0..3)
0 0 0 0 
##$XL= 0
##$YL= 0
##$YMAX_a= 265959
##$YMIN_a= -414339
##$ZGOPTNS= <>
##$ZL1= 120
##$ZL2= 120
##$ZL3= 120
##$ZL4= 120
##$ABSF1= 16.522
##$ABSF2= -4.171173
##$ABSG= 5
##$ABSL= 3
##$ALPHA= 0
##$AQORDER= 0
##$ASSFAC= 0
##$ASSFACI= 0
##$ASSFACX= 0
##$ASSWID= 0
##$AUNMP= <proc_1d>
##$AZFE= 0.1
##$AZFW= 0.1
##$BCFW= 0
##$BC_mod= 0
##$BYTORDP= 0
##$COROFFS= 0
##$CY= 12.5
##$DATMOD= 1
##$DC= 0
##$DFILT= <>
##$DTYPP= 0
##$F1P= 14.0000005364418
##$F2P= -0.99999901652339
##$FCOR= 0.5
##$FTSIZE= 32768
##$FT_mod= 6
##$GAMMA= 0
##$GB= 0
##$INTBC= 1
##$INTSCL= 1
##$ISEN= 128
##$LB= 0.3
##$LEV0= 0
##$LPBIN= 0
##$MAXI= 10000
##$MC2= 0
##$MEAN= 0
##$ME_mod= 0
##$MI= 0
##$NCOEF= 0
##$NC_proc= -4
##$NLEV= 6
##$NOISF1= 0
##$NOISF2= 0
##$NSP= 0
##$NTH_PI= 0
##$NZP= 0
##$OFFSET= 16.522
##$PC= 1
##$PHC0= 162.5708
##$PHC1= 8.469985
##$PH_mod= 1
##$PKNL= yes
##$PPARMOD= 0
##$PSCAL= 4
##$PSIGN= 0
##$REVERSE= no
##$SF= 250.13
##$SI= 32768
##$SIGF1= 0
##$SIGF2= 0
##$SINO= 400
##$SIOLD= 32768
##$SREGLST= <1H.DMSO>
##$SSB= 0
##$STSI= 32768
##$STSR= 0
##$SW_p= 5175.98343685301
##$SYMM= 0
##$S_DEV= 0
##$TDeff= 65536
##$TDoff= 0
##$TI= <Analysis number 999999
Compound Code 99
Book Reference 9
Project Code 9>
##$TILT= no
##$TM1= 0
##$TM2= 0
##$TOPLEV= 0
##$USERP1= <user>
##$USERP2= <user>
##$USERP3= <user>
##$USERP4= <user>
##$USERP5= <user>
##$WDW= 1
##$XDIM= 32768
##$YMAX_p= 300834034
##$YMIN_p= -703662
$$ End of Bruker specific parameters
$$ ---------------------------------
##NTUPLES= NMR SPECTRUM
##VAR_NAME=  FREQUENCY,     SPECTRUM/REAL,   SPECTRUM/IMAG
##SYMBOL=    X,             R,               I
##VAR_TYPE=  INDEPENDENT,   DEPENDENT,       DEPENDENT
##VAR_FORM=  AFFN,          ASDF,            ASDF
##VAR_DIM=   32768,         32768,           32768
##UNITS=     HZ,            ARBITRARY UNITS, ARBITRARY UNITS
##FACTOR=    0.157963299565203, 1,           1
##FIRST=     4132.6476996994, 0,             0
##LAST=      -1043.33573715361, 0,           0
##MIN=       -1043.33573715361, -703662,     0
##MAX=       4132.6476996994, 300834034,     0
$$ Real data points
##PAGE= N=1
##DATA TABLE= (X++(R..R)), XYDATA
$$ [...]
17187f2887K5184j38685J11964k3408j17297O0532L50M6033J35370k8254N4422
17176F3324J27702K9620j24186N6310J00888J63359j49669j09796R3869J89603
17166D41024J12478k2676Q5604k4298n5467l4126n9044m8540j11338l5074j3525
17155B35018j13300J991q45Q0873j4307r6512R4976O5960L9506J136k0400j08417
17143A65679j68016k7333M9592J7090p6482J8200J84503j04979j59574j06742
17133b08062l5369K5549P68J45532j49923l9324l2435n1616J14739J19846K18354
17122A08059K2534j52317l6872j2540j62486J66674K91998m8789p4184q0962l6103
17111a4988N6782K0697J0976L2332J75499j07150j70930j11613j43652l9223j1147
$$ y = [-62887, -37703, -176388, -64424, -87832, -205129, -144597, -144247, -98214, 37156, 8902, 63324, 191026, 220646, 96460, 152770, 253658, 417017, 267348, 157552, 251421, 441024, 553502, 530826, 616430, 592132, 536665, 502539, 443495, 394955, 283617, 248543, 235018, 121718, 123709, 122864, 203737, 189430, 92918, 187894, 253854, 293360, 294496, 274096, 165679, -2337, -29670, 19922, 37012, -39470, -21270, 163233, 58254, -101320, -208062, -243431, -217882, -217114, -71582, -221505, -260829, -293264, -344880, -230141, -110295, 108059, 130593, -21724, -58596, -71136, -233622, -66948, 225050, 176261, 102077, 21115, -14988, 41794, 62491, 73467, 105799, 281298, 174148, 3218, -108395, -252047, -291270, -302417]
17100c02417J471k0952R3736J86155J23848L970p1225r4849L2416K3732q577N3371
17088B0679m3628o7621j9544K5190j3482M6318m0118K3530L292Q3986m6117j2885
17076d0400O5668j3829P9059l7546L3979j032j46511n6455q3253O691l8007o8959
17064c00595P9710J29456r852m6919l5643M8530L368M4884m6080L9737J27462
17053C4058J12599M542k04505n2337J4623K818L9960R5721k7279n0595K6918J46858
17041A43381L394J10939N3673m5647j28511p282p749r5266o6758j21310m379o6834
17029b32349R3470K5401J6052O7881J05777J81244r1181j77071K3071N1827N6093
17018A20215L7433j78205N8236O9401j55521q8478Q7342R8496K08135K16193j94023
$$ y = [-302417, -300946, -321898, -228162, -42007, 81841, 85811, 14586, -80263, -47847, -24115, -32692, 20679, -22949, -90570, -110114, -84924, -98406, -52088, -92206, -68676, -65384, 18602, -27515, -40400, 25268, 11439, 90498, 52952, 86931, 85899, -60612, -117067, -200320, -193629, -231636, -300595, -220885, -91429, -101281, -148200, -183843, -135313, -131945, -87061, -133141, -93404, 34058, 146657, 151199, -53306, -105643, -91020, -88202, -48242, 47479, 20200, -30395, -3477, 143381, 146775, 257714, 311387, 265740, 137229, 129947, 122198, 26932, -39826, -161136, -165515, -232349, -138879, -113478, -97426, -29545, 76232, 257476, 166295, -10776, 12295, 64122, 120215, 157648, -20557, 37679, 107080, -48441, -136919, -49577, 48919, 257054, 473247, 279224]
17007B79224o4655o7290p3399J2071O0101n6160p1111k0825q9094q3584M8915
16996a25807L0268R1357j12242k286q228L9950J31473j2899k818q1539p8564R8811
16984c2524m960q6769K8447K0672l8909Q9867j06073p4940K00889j1672k10277
16973b26249Q4287K8038p9518o2620M2369O9199j49501L1551J48277J37477J06103
16962A29413P2562l581n0143R0333m3918j16756L8255m1027J20391j45763k1195
16951B8571J20423j08226j34O7979N4048r8622q3115O5361j29421k19955o1109
16940c64200Q5729J94692N455N9393Q8449n1233J6059Q6166j21586k31263R5182
16929a37157M6547j08617K3126K52337L878J35313j72633O2277K67735L951j121
$$ y = [279224, 214569, 147279, 73880, 85951, 146052, 89892, 18781, -2044, -91138, -174722, -125807, -95539, -4182, -116424, -118710, -126938, -86988, 44485, 31586, 28768, -52771, -131335, -32524, -37484, -124253, -95806, -75134, -114043, -24176, -130249, -205189, -4300, -15972, -226249, -141962, -113924, -193442, -256062, -213693, -144494, -293995, -262444, -114167, 23310, 129413, 201975, 198394, 148251, 238584, 194666, 77910, 116165, 75138, 195529, 49766, 28571, 148994, 40768, 40634, 108613, 162661, 64039, -19076, 46285, -83136, -303091, -364200, -278471, -83779, -78324, -18931, 69518, 18285, 34344, 120510, -1076, -232339, -137157, -90610, -199227, -176101, 76236, 80114, 215427, 42794, 105071, 372806, 376757, 375636]
16918C75636K4048q8309k03120j65431P4366J11066j9818O53n719J906j32505
16907b7227n1487J72177M4025j48934k24983J60559J65243n7985l4409o5182o6346
16896a34549J4799O8744J91347L13544M8010p8672k63451k19344J32059L2575
16886A05062k7646k2207J15118j73708r7009N5301J55358M3460r1059K8773j656
16875H9787j20665j24740J17682J94654q9023k87066m6817R3837Q4133J88017
16865I9799m5685K1236M3615J11340J09718J08423p7975k1319n7559K3050l8018
16854B76625j35562j48498K6823j247N7705K4579J29667R5364P3150K53286j4007
16843F37885k97508j76450j32773j69174p0872r4686J31186J27362J11061n7390
$$ y = [375636, 399684, 311375, 108255, -57176, 17190, 128256, 108438, 109091, 103372, 105278, -27227, -78714, 93463, 137488, -11446, -236429, -75870, 89373, 31388, -3021, -68203, -134549, -119750, -51006, 140341, 453885, 501895, 423223, 159772, -59572, 72487, 105062, 77416, 55209, 170327, -3381, -100390, -45089, 110269, 153729, 62670, 91443, 89787, -30878, -155618, -37936, 156718, 67695, -219371, -266188, -172351, -88218, 99799, 54114, 75350, 118965, 230305, 340023, 448446, 370471, 349152, 291593, 314643, 276625, 141063, -7435, 19388, 18141, 75846, 100425, 230092, 325456, 398606, 651892, 637885, 340377, 163927, 31154, -138020, -208892, -303578, -172392, -45030, 66031, 8641]
16833H641J08041K2978q8478m0563l6750J42521R64k32597j54779K69840J15829
16822A15647K85q0163o8144j20686K915J60136K46291O4380q5435j02979r9883
16811C2364K2044m6801j74735K5563J93506j13169j25432o745P8880N9888j6453
16800g1090J64966j2185j64764O7760J25227q9734p2783j13857r9994q1094J68962
16789a78586J17065j20518J15501Q8230J20942j34899m0165l1503j74265O029
16779b32169Q9801n6066J377j421O1318K23463R664r405j13494N0198J54591l9648
16767A38209n3754j41877j26764m5171L3680M7056l4736R0704R2306J08282M6678
16756A54613r6340K3063Q597q2586p8971J29796M6851J8758R3062n922l6357M0242
$$ y = [8641, 116682, 139660, 51182, 10619, -26131, 116390, 117354, -115243, -270022, -182, 115647, 115932, 35769, -32375, -153061, -150146, 9990, 256281, 320661, 235226, 132247, 32364, 54408, 7607, -167128, -141565, 51941, -61228, -186660, -193405, -114525, -54637, -71090, 93876, 81691, -83073, -15313, 109914, 20180, -52603, -166460, -266454, -347548, -178586, -61521, -182039, -66538, 21692, 142634, 7735, -32430, -63933, -238198, -232169, -142368, -198434, -197057, -198478, -137160, 86303, 95967, 86562, -26932, 23266, 177857, 138209, 84455, -57422, -184186, -229357, -195677, -148621, -183357, -92653, -347, 107935, 154613, 58273, 81336, 89933, 7347, -71624, 58172, 105023, 123781, 216843, 210921, 174564, 214806]
16744B14806l5313j58019j34841j68060p6631j33630O722K84004J80551M9140
16734B8729k5417J5523J28614j8786r3037j11693M0290n4242R339L1155Q5083
16723C5558O6376k1498n1152N4177o2032m6089j01934j5742R053L2422P046J39295
16711D5480L29695m1057j28554j82502O52J46248O2572j49705l15665r363K64487
16700B2288j4320q351o5394Q8106j15680j21242m9532N7163P0994n0500K8209
16689a58259m8949q1816P6854O050J50550J342k15736O6412N8630j77105J82842
16678a39185J43300P7647q2288j36581j13192j44436J85707J31464q991q9747
16668a76302J11132r361j17517L3025J4164J300P2441N7221J14166M4380m7353
$$ y = [214806, 179493, 21474, -113367, -281427, -358058, -491688, -484966, -200962, -20411, 28729, 3312, 18835, 147449, 128663, 35626, -76067, -35777, -90019, -80680, -49525, 35558, 101934, 80436, 29284, 83461, 21429, -24660, -126594, -142336, -133283, -100861, -93815, 45480, 375175, 334118, 205564, 23062, 23714, 169962, 232534, 82829, -232836, -242199, 22288, 7968, -383, -65777, 22329, -93351, -214593, -264125, -206962, -135968, -186468, -158259, -207208, -289024, -212170, -206120, -55570, -54228, -269964, -203552, -144922, -322027, -139185, 4115, 81762, -526, -137107, -250299, -394735, -209028, -77564, -86555, -176302, -65170, -74531, -192048, -159023, -144859, -143559, -71118, -13897, 100269, 144649, 97296]
16657I7296n860j56911K5141J52910o449K0454l3483j01744m7194m4448k6706
16646a26994K19416O2694m4114K374n5919j00143Q6778r33k10607N2043L3589
16635h1816M1435N7661Q3563O415o7523J62330J3625O0950l06346j10362J28937
16624a1131J87336q8858r1441j36533o8095Q9959K63787P0218J25340j04414m5760
16613A90408j4952n719k906L3728J43161j61949j05783l3069J4052k5340N4255
16602H5886p107j24952m4563N3423J70752O8399m0867N7127l7134o6894L370L3976
16590A51416o9679j29720O5672j6470m0429n6235j04443k57191P128K52368J43787
16579e3796O7366L7098j73431K6014p3479O1137J86563O2097l7999K2661o5434
$$ y = [97296, 91436, -65475, -40334, 112576, 106127, 126581, 93098, -8646, -55840, -100288, -126994, 92422, 155116, 111002, 113376, 57457, -42686, 44092, 43159, -167448, -115405, -81816, -40381, 17280, 100843, 107258, 39735, 202065, 215690, 276640, -29706, -140068, -11131, 176205, 87347, -4094, -140627, -208722, -118763, 145024, 215242, 340582, 236168, 190408, 175456, 169737, 166831, 200559, 343720, 181771, 75988, 42919, 56971, 31631, 85886, 78779, -46173, -90736, -37313, 133439, 201838, 160971, 218098, 180964, 114070, 117440, 151416, 81737, -47983, 17689, 1219, -39210, -95445, -199888, -457079, -449951, -197583, -53796, 13570, 50668, -122763, -96749, -170228, -109091, 77472, 139569, 101570, 124231, 58797]
16568E8797k22764M0945R4740o3133j08516n842Q847J00441P3000j1759J1844
16557b3400J1805K4852L1461m7366k34495k6082J18538J50418J46263O5504o6558
16546A50940k7837q4110l3827J2438k8347M9508J25505j32257p1834Q8256J05120
16535A53555j7073o9710n5241r8619J12774k1467l4222n5055q1018q4641k46472
16524d97189o5697P7400R8427P9049O0850J29105L5131o7790j47886L1410P7332
16513a89858J56512j00600j31603N5555R8903J89886K1693J102k917m7107J27769
16502A79335N8244k02315l4710N6216j58312J79105J65807n1546j47620j66347
16492a22143q2606L1809L562M1204R7186m7002M3457K39826K15200p3855j62609
$$ y = [58797, -163967, -123022, -28282, -91415, -199931, -205773, -196926, -96485, -23485, -35244, -23400, -11595, 13257, 44718, -2648, -237143, -263225, -144687, 5731, 151994, 217498, 150940, 123103, 38993, 5166, 17604, -10743, 38765, 164270, 32013, -39821, 48435, 153555, 136482, 66772, 11531, -87088, 25686, 4219, -30003, -85058, -166076, -250717, -497189, -562886, -485486, -387059, -308010, -247160, -118055, -82924, -150714, -298600, -267190, -189858, -33346, -133946, -265549, -209994, -111091, 78795, 100488, 101590, 98673, 51566, 179335, 237579, 35264, 554, 56770, -101542, 77563, 243370, 191824, 44204, -122143, -204749, -172940, -169378, -128174, -30988, -77990, -34533, 205293, 420493, 346638, 184029]
16481A84029p157n0262k8668o5441n3295j13329l5671K00533n0444j07694J724
16470a25675K2154j49601J29929N9933J06198N0411K1597p5752q0984N753O940
16459b9097k4811o0544j35390m2663J75241J2276P1708J11623o4462Q2902j49135
16448e2352j3789j54962j42109R5093j5335J93114J11741m712q9589k3991j8556
16437a15447j32892Q4466j064M3923j17834L6946n3305L1461k1076L4320k0581
16426b31083R2882J61849j896L6856k0219o8088j3297N5895K83144J35636q0993
16415C50686j32160p6630j10922k41028J32953J86259J25921k5841j18357j09790
16405a8909m1267j9948k49549j512J50886J07389O9477K13701j99187k10300J7329
$$ y = [184029, 176872, 126610, 97942, 32501, -20794, -134123, -169794, 30739, -19705, -127399, -125675, -103521, -253122, -123193, -63260, 42938, 93349, 114946, 39194, -41790, -36037, -29097, -53908, -114452, -249842, -292505, -117264, -104988, -33280, 78343, 13881, 96783, -52352, -66141, -221103, -363212, -268119, -283454, -90340, 21401, 16689, -72900, -96891, -115447, -248339, -163873, -164937, -121014, -238848, -201902, -255207, -223746, -244822, -210502, -231083, -138201, 23648, 21752, 58608, 38389, -29699, -42996, 12899, 296043, 431679, 350686, 218526, 141896, 30974, -210054, -77101, 109158, 235079, 209238, 90881, -18909, -60176, -80124, -329673, -331185, -180299, -72910, -3433, 210268, 11081, -199219, -181890]
16394a81890Q8983N6971r632q4028j13513j12456j19676l8147J88319M9710q862
16383b84221k265Q6688P1434O991k0871R4526j06735N0227J84137o3153O8715
16372H5473J13404r6093j62974j23406K165R335j0367l1594R6401O9204J82712
16361A34260j2204q385l1078j00627Q3480K64324l8709r2006n9182j91264r8531
16350a49922K6434K1363q660k267j67186k5210m5672j1088J40034J48521L841
16339f9812l483P9109j07837o5937l9008P671N519K2026J75444L2066n7733o1444
16327h3419J66782j2281j5980L0524j58850R6519J26702m3229l8702M236J9749
16316I2051o965k58918k02499r9700R8564k8345J08829J37535K46672q651j75803
$$ y = [-181890, -92907, -35936, -45568, -129596, -243109, -355565, -475241, -513388, -325069, -275359, -284221, -286486, -199798, -128364, -121373, -142244, -47718, -154453, -104226, 79911, 16758, 85473, 198877, 102784, -60190, -183596, -181431, -172096, -182463, -214057, -117656, -48452, 134260, 122056, 113671, 82593, -18034, 65446, 329770, 291061, 199055, 139873, -51391, -149922, -123488, -102125, -110785, -113052, -280238, -305448, -351120, -362208, -222174, -73653, -69812, -73295, 5814, -102023, -167960, -206968, -199297, -193778, -171752, 3692, 35758, -21975, -83419, 83363, 71082, 55102, 85626, -73224, 23295, 149997, 106768, 68066, 72302, 92051, 85086, -173832, -376331, -476031, -377467, -405812, -296983, -159448, 87224, 78573, -97230]
16305i7230p0432n4021J26947j38432J67123K71477j58439j10271M2946j32827
16295a53159o4449J04709j16770j44201J37865J10362k30340K5712J5808j4520
16285c28983K27534J59275j12261K0493J26856O7484m3358j14715r6748l2388
16275a26811J76962m8776L3305O2980j46068j29874j1667p7295p9857J93983J44350
16264h768j43682l444L2368j71688j5431J5665P3147J79112M6561j82487k5215
16253b03862R3590J31611M5013P2783k0986l0438j70253j15780J41787N3628j8445
16242b1352J1648K0180j71367J06070J73260j6902q8589k5237o1514o6549O1328
16231g9024j6083j08494J904Q1964R2635j207n1559j86161J82025J54767l513
$$ y = [-97230, -167662, -221683, -94736, -233168, -66045, 205432, 46993, -63278, -20332, -153159, -217608, -112899, -229669, -373870, -236005, -125643, -355983, -330271, -314463, -328983, -101449, 57826, -54435, -33942, 92914, 160398, 117040, 2325, -94423, -126811, 50151, 1375, 34680, 97660, -48408, -178282, -189949, -267244, -347101, -153118, -8768, -152450, -155894, -123526, -295214, -310645, -294980, -221833, -42721, 3840, -178647, -203862, -110272, 21339, 66352, 139135, 118149, 87711, -82542, -198322, -56535, -2907, -21352, -9704, 10476, -160891, -54821, 118439, 101537, 12948, -12289, -73803, -140352, -79024, -95107, -203601, -201697, -119733, -27098, -28305, -79864, -266025, -84000, 70767, 67254]
16220F7254j76644j40225j6249J03420L6902o1426N4897q445J07156j6270q3596
16209a33226j8485j8246N9029L29778O7591j7755r174j09622O9633L235k12809
16198I949j86736k8384J05511J8704R4593J0885M2897N4010J29369P4939r6147
16187B29590k79939k34797Q5423m460j04900N7398K6549o7356O5844J48426P1554
16176f668j10213j17021M2396j48909M0101K06680K3246n3061R6478n1179M7975
16165c0175j3836Q7443k5672J89029j39683j67873j01480J16654Q8418j65M6030
16154D8690p6935m8711J92422j51177n2598J40096N7533P9102q5690N5769R4032
16143B52533r8546M5405j63713j05723Q0107m641N3380O1226q470p7809K1289
$$ y = [67254, -109390, -249615, -265864, -162444, -125542, -186968, -132071, -140516, -33360, -49630, -133226, -151711, -169957, -110928, 218850, 286441, 268686, 259512, 149890, 219523, 222758, 9949, -176787, -205171, -99660, -80956, 13637, 24522, 67419, 121429, 250798, 325737, 229590, -50349, -285146, -199723, -204183, -309083, -251685, -225136, -292492, -226648, -78222, -6668, -116881, -233902, -191506, -340415, -300314, -93634, -70388, -123449, -26971, -78150, -30175, -44011, 43432, 17760, 206789, 67106, -100767, -202247, -85593, 2825, 2660, 48690, -28245, -76956, 115466, -35711, -88309, 51787, 109320, 188422, 102732, 158501, 252533, 153987, 199392, 35679, -70044, 10063, 5422, 58802, 120028, 111558, 33749, 55038]
16132E5038P1588K04163R1087r7128j71075p7291J00221o5476k31522j14203J00153
16121a34445l5600J11441j53996l4696M7388K3082K13816Q3597p0006J3730q4497
16110b0186q2821p6467r2603L9811J14502J41558k13987p8871M7920k0007J27762
16099a13389N6769j7423N6323K39889N62k15045j48360J41698O5261j20844j91684
16088b46243K3882R2179J54044K6955J1095L2800R8363p9961r8408N6299K2325
16077I3330j4202o3401j36857k6552j7025j12398J67565K2430j52941J12759J43679
16066A6387k8004m9013J05096k2850m7792n4818K41226m728j69685j48J24503
16055A10174J20697m7063l8508p325J2024j02958N1600n7900J66966r9165j83368
$$ y = [55038, 126626, 330789, 421876, 324748, 153673, 76382, 176603, 111127, -120395, -234598, -134445, -170045, -58604, -212600, -247296, -199908, -176826, 36990, 120587, 50581, 64311, -20186, -103007, -179474, -272077, -232266, -117764, 23794, -190193, -269064, -221144, -241151, -113389, -56620, -74043, -17720, 222169, 222731, 7686, -140674, 1024, 66285, -54559, -246243, -222361, -130182, 23862, 50817, 61912, 94712, 193075, 113114, 14706, 71005, 93330, 79128, 15727, -121130, -147682, -164707, -277105, -109540, -87110, -240051, -127292, 16387, -11617, -60630, 44466, 21616, -26176, -80994, 160232, 155504, -14181, -14329, 110174, 230871, 183808, 145300, 137975, 149999, 47041, 98641, 40741, 207707, 108542, -74826]
16044g4826K8120k01980J10334K44237Q9719l6188k59244j48481O4034K03245
16034A8970R8112j2127k24560K2629o3050n2675N4091k5813L5254l7437P1904
16023a14702J2821j0603J01001J13585j14475m3527o2669J30761N7500J9247m6709
16012D2230j00967m5508O2704R2422m0971k08000P052J22784o1124j05140o0169
16001b94687Q6407J33662R9248J23909n7452o4892N1612J24818m5980k26022O6677
15990b700J35823J56018K2060o9755r9463k00185j61534L4238L266L029K61481
15979H2278R1829j42755m4577k5063M50j16961J8776P4748k6373J05325J13981
15968A31658K6204r0407J50065j42811j54170n3417J7926N19J2128k8992j6747
$$ y = [-74826, -46706, -248686, -138352, 105885, 195604, 159416, -99828, -248309, -184275, 18970, 117082, 104955, -119605, -96976, -160026, -212701, -158610, -184423, -149169, -186606, -114702, -101881, -112484, -11483, 102102, -12373, -55900, -118569, 12192, 69692, 88939, 42230, -58737, -104245, -41541, 50881, 9910, -198090, -191038, -68254, -129378, -234518, -294687, -208280, -74618, 24630, 148539, 91087, 26195, 77807, 202625, 156645, -69377, -2700, 133123, 289141, 311201, 241446, 141983, -58202, -219736, -185498, -182232, -179203, 82278, 174107, 31352, -13225, -38288, -37838, -154799, -136023, -61275, -87648, 17677, 131658, 157862, 67455, 217520, 74709, -79461, -132878, -114952, -114433, -102305, -131297, -148044]
15957a48044N4563Q5279J52114q7011r1000L4849M3026m85J74286q8192M5516
15946A74901Q2747j87807j45366q0188k1182n2119J57742N2623J291M6310J0164
15935C9116n0328R7146J58483m2658M58k24241n8143k8935K9852J19154Q867K3269
15923G2040p5869N2899j24825J7708J58661Q55P5580o2771j38072m0950P6006
15912A1262R0549O1417j2573o7503k03646J06406N0713j38515p3596J53346R3518
15901G1378r096j27563j69034m3218J3090R4999o9367J07721L9246J23643K5918
15890E7717P6582p7649n9330R0645j3260P782j5455m4288j33345K4872J01048
15879A5319J38495j49345j54647R6986O4497J04005l2638R409M390j99221j29755
$$ y = [-148044, -93481, -8202, 143912, 56901, -34099, 750, 43776, 43291, 217577, 129385, 174901, 257648, 69841, -75525, -155713, -176895, -229014, -71272, -18649, -17358, 28952, 39116, -11212, 85934, 244417, 201759, 202217, -22024, -80167, -109102, -79250, 39904, 48771, 72040, -3829, 49070, -75755, -58047, 100614, 101469, 177049, 114278, -23794, -64744, 11262, 101811, 163228, 150655, 83152, -120494, -14088, 36625, -101890, -175486, -22140, 71378, 62282, -65281, -234315, -277533, -264443, -169444, -238811, -131090, -91844, 31799, 57717, 134299, 56650, -2680, 87965, 74705, 82487, 67032, 22744, -110601, -85729, 15319, 153814, 4469, -150178, -53192, 11305, 115310, 82672, 92081, 96471, -102750, -232505]
15868b32505R6788j27597j55166l4296J74799J35192o2987P3012k4087n1486J77936
15857c0397M1303p3018J28773J00475j50614k17148J39357J82993j02157q1053
15847f1486P4491r3544J90275Q869k4363j16452j09116q4611O1876M2822O2107
15836d9132r6319R5410P5962O4849j21033j55329J33607K02868o2057O5622r2249
15825F2199q4484J2592J37145J1792L5875p5599j64514l7061J88872j01147j22687
15814a37017P8026O8811j38498o7288n2618J43997R9243k1524k6096j00194M3323
15803a09835n6183J7575J04641M776j05654J34880k5927n0765m578j3296q5731
15792a90097Q7402Q4331k7877j78718P1432K21365O2353q0836j37297J18601P8536
$$ y = [-232505, -135717, -263314, -418480, -452776, -277977, -142785, -205772, -132760, -156847, -208333, -30397, 10906, -62112, 66661, 167136, 16522, -200626, -61269, 121724, 19567, -61486, 13005, -80539, 109736, 118605, 94242, -22210, -131326, -215937, -154061, -111239, -49132, -145451, -50041, 25921, 90770, -30263, -185592, -51985, 150883, 88826, 154448, 62199, -22285, -9693, 127452, 139244, 175119, 99520, -64994, -102055, 86817, -14330, -137017, -58991, 9820, -128678, -195966, -248584, -104587, -5344, -26868, -52964, -153158, -109835, -166018, -148443, -43802, -39026, -144680, -9800, -35727, -86492, -91070, -104366, -190097, -102695, -18364, -46241, -224959, -153527, 67838, 130191, 49355, -87942, 30659, 109195]
15781A09195o9500j26230j84200N9012N8993m6470k8734j65685M4768K47206m0702
15770a42347k9336K54611J78684j73262j51388M7450J7272L6774Q1217R0490n6416
15759A53749j66917j12039J97700o1449R1930j12120k00560J70420L0805P077
15749a404J05594j2700m202j47528r6754P2699J80047M6643k549k4969j63076
15738d8199L3109J33593j0671l12799p5048J28045P3875O2665m02J2046j5813
15727a9599L6795M930p4024j5812L2519J38687J03089N3672k1937j22532j00386
15716A5402R3462m821J755j15011k0232J13676J07420r0573K8089j72946j3624
15705e7403O297l4522m6657M7294J81856j49349m1916O4353n4330O1890j4445
$$ y = [109195, 39695, -86535, -270735, -211723, -152730, -199200, -227934, -393619, -348851, -101645, -142347, -171683, 82928, 261612, 88350, -63038, -15588, 1684, 38458, 119675, 210165, 153749, -13168, -125207, 72493, 11044, 102974, -9146, -209706, -39286, -8481, -1404, 104190, 91490, 87288, -60240, -156994, -84295, 95752, 142395, 139846, 114877, -48199, -15090, 118503, 107832, -204967, -280015, -151970, -78095, -15430, -15832, -3786, -19599, 17196, 22126, -51898, -67710, -35191, 103496, 206585, 260257, 238320, 115788, 15402, 108864, 104043, 105798, -9213, -29445, 84231, 191651, 101078, 129167, -43779, -57403, -51106, -85628, -132285, -84991, 96865, -52484, -94400, -30047, -84377, -22487, -36932]
15694c6932j37250m9633L8965M6181N5285J98369J19848r0984r3753m1992o6958
15683e8854k1514O847P487K4904J23216k6271k01968J0215j2803O9705j4950l1015
15671a25001J30283r4411P1764O2325L6536Q1748j20303j09642m8785N5163K20314
15660A59991Q7139Q993n1854r1358j6602j20738L5966l003q5148j07876J5313
15649a69177N1285o0197N668L2392j08577l8340Q0251J83610q5847m0130N3311
15638i5751j19870R386J0768N804L427P4710Q9708K9501J22617L3729q351M6456
15626B02134p1060Q4618R2381k2884r7319k18065o2415k3320K3026j74137J53783
15615a13258J33261K5290m4780n9603Q3841Q6152m9385j20449l8187j00933j33390
$$ y = [-36932, -174182, -223815, -184850, -138669, -83384, 114985, 234833, 143849, 50096, 8104, -58854, -80368, -73521, -66034, -41130, 82086, 55815, -146153, -135938, -148741, -79036, -93986, -125001, 5282, -89129, -17365, 44960, 81496, 163244, 42941, -66701, -115486, -60323, 159991, 247130, 256123, 204269, 112911, 96309, -24429, 11537, 8534, -76614, -184490, -169177, -117892, -178089, -172421, -140029, -248606, -286946, -206695, -23085, -108932, -149062, -95751, -215621, -206235, -195467, -189663, -186236, -111526, -21818, 7683, 130300, 164029, 155678, 202134, 131074, 215692, 308073, 285189, 187870, -30195, -92610, -115930, -92904, -267041, -113258, 20003, 45293, 513, -59090, 24751, 110903, 61518, -58931, -97118, -198051, -331441]
15604c31441L2182j13556j5581k160K23356K57673K17480o6538l3633N4883n0167
15593A72498j60446q5128m0223j12215p2190Q4623m0227K48853K20260j01438
15583A14367j72347j19426Q3617P885m0M4823l0419m1599n1990N9039J51059j8091
15571B6878k18134L5722m6235P3505K0717J6783J08660J01623q4137k44184q6128
15560b94930J69142L35451J49328J14883p2215j32996j6806m3143k25225j42537
15550a59048p6767r6712J28991J59908N4926L4379j00965N3694L2525j29414J66
15539i8317k8383L3950L5162L0548J03754j21739m9960J02976m2820q4108M3541
15528g5396l0572R4641j98897j38855J78631J85257J67308K7725j03227J0961
$$ y = [-331441, -299259, -412815, -428396, -430556, -207200, 50473, 267953, 201415, 167782, 222665, 172498, 12052, -73076, -113299, -225514, -297704, -213081, -253308, -4455, 215805, 114367, -57980, -177406, -93789, -85904, -85944, -41121, -71540, -113139, -165129, -106090, 44969, 26878, -191256, -155534, -201769, -128264, -107547, -90764, 17896, 119519, 35382, -208802, -294930, -125788, 209663, 358991, 473874, 401659, 268663, 251857, 208714, -16511, -159048, -235815, -332527, -203536, -43628, 11298, 45677, -55288, -1594, 30931, -98483, -98317, -126700, -92750, -57588, -27040, 76714, -45025, -94985, 7991, -34829, -118937, -75396, -105968, -11327, -210224, -349079, -170448, 14809, 182117, 209842, 106615, 117576]
15518A17576j23295o5328J43897r2943n0931J70781P528J3200n4621q5116r155
15507b8407j5780J9235L7599k4026m5240p8710J46259Q9854J57963J49133J08677
15496E16557j95896j76506j61074J21446O6270J87418J21042j39088j07691j56539
15486G5939O1812l3188L1593p3519M4159L6198j954J31256P3856j13423j13701
15475A19028L0480l5239M1787l980n435o1034P2006Q1494j15015m5777L9670q7371
15463C0614p4052K1716l0050n7881J8042J26630J4420k28619r7875J20560O1041
15452i5454K0433K0910O9870L6178J7740l5010r7269J1929J84186J24822O2796
15441C21131R0483o4809j01481k0361k3949l2516N0897M701q9753R2694l8495
$$ y = [117576, -5719, -71047, 72850, -20093, -71024, 99757, 107285, 120485, 65864, -19252, -28407, -44187, -24952, 12647, -11379, -56619, -135329, 10930, 100784, 258747, 407880, 516557, 320661, 144155, -16919, 104527, 170797, 358215, 479257, 340169, 232478, 75939, 137751, 104563, 136156, 62637, 106796, 142994, 141040, 272296, 346152, 232729, 119028, 149508, 114269, 156056, 152076, 146641, 85607, 157613, 239107, 124092, 78315, 117985, 30614, -43438, -21722, -51772, -109653, -91611, 35019, 49439, -179180, -277055, -156495, -95454, -75021, -54111, 15759, 51937, 69677, 34667, -62602, -50673, 133513, 258335, 321131, 411614, 346805, 245324, 224963, 201014, 168498, 219395, 224096, 134343, 227037, 188542]
15430A88542k44206r7685J22468P6439j41020P2278J55339j31771K2213J8178
15420D0775k8523r8257p0306J8041J62294n5346j17770j38852M8657q6441K62860
15409f2868L01294l9494k71886o7665J60099M6223N459L5349j90030j55577J45577
15398i3519J22786m2645k48451j73102J82979J40031N319J64658r5846n2866o755
15387i7411Q5311N8829o544j56238N9554l0889M869J8151k7933J63175M2814j179
15375A12509K6885j31202j50913j21007M8089R8710J58964j23671k3996P1834
15365c3798J33273J18178k49331j48893k8214K1246J25601r9531L4324J75192
15355D8047J23206J73585Q8229o9474P9098j01332k31334j74455r2918J03953
$$ y = [188542, -55664, -153349, -30881, 45558, -95462, -23184, 132155, 384, 22597, 40775, 12252, -86005, -156311, -138270, 24024, -31322, -149092, -287944, -239287, -325728, -62868, 238426, 198932, -72954, -140619, 19480, 65703, 71162, 106511, -83519, -239096, -93519, 29267, -13378, -261829, -434931, -251952, -111921, -106602, 58056, -37790, -90656, -97411, -12100, 46729, 40185, -116053, -56499, -87388, -82519, -64368, -92301, 70874, 113688, 112509, 139394, 8192, -142721, -263728, -215639, -116929, 42035, -81636, -105632, -33798, 99475, 217653, -31678, -180571, -208785, -187539, -61938, -161469, -127145, 48047, 171253, 344838, 433067, 363593, 442691, 341359, 110025, -64430, -157348, -53395]
15345e3395j047N0296n0840O9277J37388p2717l2413j17594j16582J06523P9766
15334a338L2015j41396j22815P1904J40527M568j7563l2176n6610K8599j5604
15323a09889J63149q6138J2920R7861N814Q4049M3810K3917Q347p2749r4307J2461
15311H9245Q0790j12240k44990J59639J91598j28629k8930m2909R7840K721n7132
15300G003k2357m8277r4268L8861O2879R8351k1759k02874l1716O6988J43755
15289c414r0964N127M7576k4185j54735o3404J57671L73105J0659p1078j6459
15278A69899J18084M9168r8553m6707J4308r1600N0282j20418j85900p0146O1987
15267a49596J77060Q1486j42845j53656o4282P8481R4863p9466P4181j10304Q2481
$$ y = [-53395, -54442, -4146, -54986, 14291, 151679, 78962, 46549, -71045, -187627, -81104, -1338, 30677, -110719, -233534, -161630, -21103, -16535, -34098, -66274, -122884, -94285, -109889, 53260, -32878, -19958, 77903, 83717, 167766, 211576, 235493, 243840, 171091, 76784, 89245, 170035, 57795, -187195, -27556, 164042, 35413, 6483, -36426, 61414, 64135, 7003, -15354, -63631, -157899, -119038, -56159, 42192, 20433, -182441, -214157, -147169, -3414, -94378, -89251, -41675, -65860, -220595, -283999, -126328, 246777, 257436, 186358, 169899, 287983, 337151, 238598, 191891, 206199, 114599, 164881, 44463, -141437, -211583, -149596, 27464, 108950, -33895, -187551, -251833, -173352, -78489, -157955, -83774, -194078, -111597]
15256a11597R4034K8797n9941k8863j28621k5623l9036J00368J02104q249n9968
15245a36595O173j8066N5248k7636j1436j77714R9429o424O6544O9502p4317j12212
15233b67504m7393J4372o7113K0087O6220K75785P2709N1806l1723r9137K8964
15222A7073j50391j59903l5656J17326N9432O8293m8304M968M0721J50627N7565
15211A21751j65853K7171N9853Q2409k4751l0330m1204l9056k3657K25703N0609
15200B42645m0994k48267k52054J23332J62473P328j1624P2622M168m4348R7930
15189A13211J26016j62905L7906J06034k3626j82312k54422O5244J88795K07511
15179B21452R5366L7562n3295j56996j45665N55k34024O8302K39641J41432N3266
$$ y = [-111597, -17563, 11234, -48707, -77570, -206191, -231814, -270850, -170482, -68378, -76627, -136595, -130422, -148488, -93240, -120876, -132312, -310026, -210597, -217021, -150477, -80975, -155292, -267504, -314897, -300525, -367638, -347551, -281331, -5546, 67163, 118969, 87246, -11891, 17073, -133318, -293221, -328877, -211551, -152119, -83826, -132130, -127162, -86441, 64186, 121751, -44102, -16931, 42922, 125331, 100580, 70250, 29046, -10010, -33667, 192036, 242645, 201651, -46616, -298670, -175338, -12865, -5537, -17161, 55461, 59629, 15281, 113211, 239227, 76322, 114228, 220262, 196636, 14324, -240098, -174854, 13941, 221452, 316818, 354380, 301085, 144089, -1576, -1021, -235045, -166743, 72898, 214330, 267596]
15168B67596j5532k59945l01o4681o0026P6448L1346N4735O4825j8149m2230k0966
15156A3120J4065l3357P9435J23262m5348j55981J3947j39869Q465K4897O7917
15145b9447p3249m4485K3100J68598L622p4901o3075m0274R0854J75788N035J04936
15133B46502J16176j17613j36161j10548Q3202P8192o2372k13314k186n1601R6248
15122g3475j07773r3777R0575J71299R9111k8328l6499R7001k4103j20336q5285
15111a11590N2453J6580m9123m3174N4608l0504J78141l1134J34438Q3480M1726
15100B95901k22464j8297J58406M0660p9495j50998n4549j29911M9273J11366
15090a08M349o7209Q4908m4466R0119r9591p1548L8303K48748n6778j28666J38565
$$ y = [267596, 252064, -7881, -8182, -72863, -132889, -56441, -25095, 29640, 94465, 76316, 34086, 13120, 27185, -6172, 73263, 196525, 151177, -4804, 9143, -130726, -122261, -97364, -29447, -102696, -147181, -124081, 44517, 48139, -26762, -89837, -130111, -39257, 136531, 141566, 246502, 362678, 245065, 108904, -1644, 81558, 159750, 97378, -115936, -118122, -169723, -73475, -181248, -275025, -184450, -13151, 85960, 57632, 21133, 118134, 94031, -26305, -111590, -59137, -42557, -91680, -134854, -80246, -110750, 67391, 36257, 170695, 254175, 295901, 73437, 55140, 213546, 254206, 174711, 23713, -30836, -160747, -111474, -108, 4241, -62968, 21940, -22526, 67593, -31998, -103546, -65243, 183505, 126727, -1939, 136626]
15078A36626j33761r0169M8767p794Q66J11664N8790p4142k20061O308O4339p0992
15066a69559J33409J99684m3065p2916M3938L68690O3564k47936j43259O8401
15056B00951J0782q9755j09273P9549R2099n8084P0884K2112O3757j91936k2382
15045F8704j1444p879j6587l3205j26365K5567L3341J0952L2834J22350N7531
15034A55799k08767O4157P592l1512J12082M3075n9379p0348j70318j31942p3542
15023c63103m0098K80337K55979n3191j51801n8370J77959K63666k2708j32988
15013A55682n6880J8876N7012j7976p6020j03454M9887M3623K13289P3723J35685
15002D93447m6321j52648j64604k22306p9565P3651J03831o405M1032R8360q8727
$$ y = [136626, 2865, -87304, -38537, -46331, -45465, 66199, 124989, 50847, -169214, -162906, -98567, -169559, -36150, 163534, 120469, 47553, 91491, 460181, 523745, 275809, 132550, 200951, 211733, 121978, 12705, 92254, 184353, 126269, 197153, 219265, 283022, 91086, 68704, 57260, 49381, 32794, -411, -126776, -101209, -67868, -56916, -24082, 98268, 155799, -52968, 11189, 18781, -12731, 99351, 142426, 83047, 12699, -157619, -289561, -363103, -403201, -122864, 133115, 79924, -71877, -130247, 47712, 311378, 288670, 155682, 98802, 117678, 174690, 156714, 80694, -22760, 27127, 70750, 284039, 357762, 493447, 447126, 294478, 129874, -92432, -171997, -98346, 5485, -920, 40112, 138472, 49745]
14991D9745j22520J55819l4225n3182N9518K10322L242Q9339J41906k15656j73985
14980A10323N5664q4025n8031q7362n8064j02295r2733n5246n1738J30641J26861
14969a66005n7721K2522P5551l1828L2491J42494q1360l8766J16101O7111l6223
14958D4367j89250j03474k8259j8195J29953m8734L9568J56439p6377j37351O3386
14947a67927R7888j26423r324O4156J44421J68260m8662m5162l7693J5149q7013
14936c2330J647R7908L8475k6816k30944m3803N4981R3558j12200j45354r1284
14925c96162P9926J99138L1804o5356n564j7983O3686J26964J84993j15801j56832
14914g1187o3566m8429Q509l3397K3386N7174K1393j47006J26798J23626j38772
$$ y = [49745, -72775, 83044, 48819, -4363, 55155, 265477, 268719, 358058, 499964, 284308, 110323, 165987, 81962, 23931, -63431, -121495, -223790, -316523, -371769, -423507, -292866, -166005, -223726, -201204, -125653, -157481, -124990, 17504, -63856, -102622, 13479, 80590, 44367, -144883, -248357, -276616, -294811, -164858, -213592, -174024, -17585, -93962, -231313, -167927, -70039, -196462, -205786, -141630, 2791, 171051, 122389, 77227, 39534, 54683, -32330, -30683, 67225, 105700, 78884, -152060, -195863, -140882, -47324, -159524, -304878, -396162, -316236, -117098, -85294, -150650, -156214, -174197, -110511, 16453, 201446, 85645, -71187, -134753, -183182, -174673, -208070, -184684, -127510, -106117, -253123, -126325, -2699, -141471]
14903a41471m5261R6398O9406k7705J85769J22501r4282j7220J9165o9485J3290
14892A11105j38617j46169k03239J11850L8056R8240K4832P103R3660J67372j17799
14881D6394l2317n384M7743J89227q5556j25983j92775M6734P3021r6637l4583
14870a70116Q0210J89929r1643J18826M8511J15441p2068j35793J4507L5563k7865
14859A05502K5961J25086p2338j92282k16623q4580J43544J15253j030q4701l4951
14848a71159L2568r536P1949Q352r1736n8764J12763J7361q1792K2976J42834
14837d184J83338Q7869j18534o6170L4409J15446q5068o9246k9397O4641L3638
14826A46742N9744Q287j18198l4125J3969q2883k18517j7332J08131l6848R330
$$ y = [-141471, -186732, -90334, -20928, -48633, 137136, 259637, 165355, 148135, 167300, 97815, 111105, -27512, -173681, -376920, -265070, -227014, -128774, -103942, -96839, -3179, 164193, 46394, 14077, 8693, 56436, 245663, 160107, 34124, -158651, -111917, -38896, -135533, -170116, -89906, 100023, 8380, 127206, 175717, 291158, 219090, 83297, 97804, 133367, 105502, 131463, 256549, 184211, -8071, -224694, -309274, -165730, -50477, -51507, -136208, -171159, -138591, -148127, -76178, -67826, -159562, -218326, -105563, -88202, -169994, -147018, -4184, 179154, 267023, 148489, 82319, 116728, 232174, 147106, 77860, 48463, 113104, 146742, 206486, 214773, 96575, 62450, 76419, -6464, -224981, -242313, -134182, -171030, -161700]
14815a61700J373o925J57315K2125R0642P2470J5611k09109J40452K5372J08083
14804B55709M1338O414Q8732k50371j30965J46813p4722q0521Q7475K27M551J3296
14792A07976p8748j14102L9468P4803j83642j32464J10551J48034J14902O1055
14782A47833n5596k20322j15710J01440J80053O2395o0364j09820k5375k7446
14772a22912J065q937j50734J11866N2593O0615P89l4230k17537J733J75362Q7738
14760d2589j00832p68L72m2296R9286J14831Q6909P1395j23783R4929p9248k07283
14748a29077m7880O8508J08350j35662j26635J09695R931q2792O1234K18164J45785
14737A99621q0755M1847k0308o4427p9287l1377j07356J84736j3711L3348Q8865
$$ y = [-161700, -160327, -167252, -9937, 12188, 102830, 175300, 190911, -18198, 122254, 147626, 255709, 297047, 303461, 392193, 141822, 10857, 157670, 82948, 2427, 89902, 90129, 94680, 107976, 29228, -84874, -45406, 29397, -154245, -286709, -176158, -28124, 86778, 147833, 92237, -128085, -243795, -142355, 37698, 100093, 39729, -70091, -95466, -122912, -121847, -130784, -281518, -169652, -117059, -56444, -55655, -89885, -307422, -305689, -130327, -42589, -143421, -144189, -143817, -186113, -86827, 28004, 114913, 186308, 62525, 157454, 78206, -129077, -176957, -108449, -99, -135761, -262396, -152701, -142770, -225562, -164328, 53836, 199621, 118866, 160713, 140405, 75978, -3309, -34686, -142042, 42694, 28983, 62331, 151196]
14726A51196j7642n4195k7512j49334o1200k00105m8112J30831O5782p2224o8967
14715c51482J95654K59383N6527K9917j01138j4523N693n0442j15555n2132j05355
14704b43453M7820m0516n302M2468n4123m78j9596K54413J14583R856J84663j35110
14692A55225k28047q5235K4285J59353J37915j08710n9502J21985j02665r7582
14682h2978n2769J4850L44853J59741Q0954j1791j72237k65822o3089Q7748K6173
14671F5633O5786O3054Q7959j17817j42096L4060J5581J7357M243r8388P3496
14660F8868l6617J13888J05937j77096q3401J60735k089k62021l1188M2547M9110
14649e1327m7426j40369j27989O9268M9832k7311J34956O5968J0644p3888J37977
$$ y = [151196, 133554, 79359, 51847, -97487, -158687, -358792, -406904, -276073, -210291, -282515, -351482, -155828, 103555, 160082, 189999, 88861, 74338, 80031, 29589, -85966, -138098, -243453, -195633, -236149, -241451, -198983, -253106, -253584, -273180, -18767, 95816, 105672, 290335, 155225, -72822, -158057, -133772, 25581, 163496, 54786, -4716, 117269, 14604, -82978, -135747, -120897, 223956, 383697, 464651, 452860, 280623, 14801, -48288, 39460, 65633, 131419, 194473, 282432, 164615, 22519, 56579, 72160, 89517, 93760, -4628, 68868, 32251, 146139, 252076, 74980, -8421, 152314, 150225, -111796, -142984, -100437, -51327, -98753, -239122, -367111, -297843, -248011, -275322, -140366, -74398, -63754, -137642, 335]
14638C35O3999r0019j02L8583N2957P6721p8897j04850J6448N7536K693l7096
14626a692N3287J04475J05633r9994r7204r8442o2576M2372J24219j20639l15119
14615c65680Q3774k5466j12030O2214K46222J68816L3066k2680j63658p034J7582
14604h4874J28867L2064j69131j08390N3710J4550J14000K3084m9446q4912k99410
14593d29888J09494K38242P9513K2501M9296o1255j25179Q562l1214N8589J76359
14582I5020q3893j42814l6425m9171l8355J04835R9651l5781r7118J28025K02478
14571A46452J05097r5040l13669J4899J50067m3874n5689J55063p5214j33738
14561a45646o9249M7415J40978j04151N236o5188M9964m5664N3768R4245L0473
$$ y = [335, 64334, -25685, -25787, 12796, 65753, 142474, 63577, -41273, -24825, 32711, 35404, -1692, 51595, 156070, 261703, 161709, 64505, -33937, -96513, -54141, 70078, -50561, -365680, -281906, -307372, -419402, -357188, -110966, 57850, 90916, 68236, -95422, -102456, -84874, 43993, 76057, -93074, -201464, -147754, -133204, -19204, 3880, -45566, -130478, -429888, -320394, -82152, -2639, 19862, 69158, 7903, -117276, -108714, -139928, -81339, 95020, 11127, -131687, -168112, -217283, -255638, -150803, -51152, -86933, -184051, -56026, 146452, 251549, 156509, -157160, -142261, 7806, -36068, -91757, 63306, -11908, -145646, -214895, -167480, -26502, -130653, -125417, -190605, -140641, -186305, -132537, -38292, -7819]
14550g819M8002M5807k66739j36802J60033o1423j6485O9757N7888m7509k04254
14539c59544M9122o1454R1366p9679K5421J9874J30170J66975P7907Q6455J4091
14528A60704j2093j74709j58139J06058M9878p7133Q8273J40364J50286j34795
14518A38694j39885p2501J9466l1226l9861O7219R3509P6469N569m4372p381m8342
14506A7358k6816l2067J281q8191j19845n4314J1340J30039K78436J69929L15
14495B87465j0863j70610j33718J41733K28872p126j26367M2820n3072j72769
14485B6365j38006k2821q0584N4538N4403p7355j07076L0525k5227o4661J36834
14474b13065J87545K0338j29884j7992Q3756r436j9641J56453p6318j02627L5156
$$ y = [-7819, 40183, 85990, -180749, -317551, -157518, -218941, -235426, -165669, -107781, -155290, -359544, -310422, -371876, -280510, -360189, -334768, -314894, -184724, -17749, 60158, 146613, 160704, 148611, -26098, -184237, -78179, -28301, -105434, -17161, 123203, 273489, 138694, -1191, -73692, -54226, -85452, -125313, -58094, 35415, 111884, 117453, 73081, 65700, 17358, -9458, -41525, -40244, -128435, -248280, -302594, -291254, -161215, 117221, 287150, 287465, 276602, 105992, -27726, 114007, 342879, 335753, 209386, 252206, 199134, 26365, -111641, -134462, -215046, -160508, -106105, -183460, -290536, -260011, -285238, -349899, -213065, -25520, -5182, -135066, -153058, -69302, -78738, -98379, 58074, -18244, -120871, -85715]
14463h5715k02652n1257l4494J0328m5073J28367J44141l4796P6954J04244J94570
14452B04617j11481j68641J95342j33058j10659L867m8999J8460J58031J00615
14442A08094k1269j30001N2781K10944j85042j74926l2530k9853L9304r098J11518
14431f0078J47740o6854p4308o7387R5559Q535m1367j86985l635O6003m742k11475
14419c98994j00851J17129j0487n613J4376J67332K30121L7070L9997j92499p0941
14408a73360n8600j8663N7518K19062L07441J07700k20585k32765j04873k3375
14398a40500L0829J03103j47859m3901J69832n3267k2740J1300j40931L4942K4522
14387a74670m887l8076K20987o5308J6211J73876q4751k883L0705r4896j08931
$$ y = [-85715, -288367, -339624, -374118, -363790, -408863, -280496, -136355, -171151, -94197, 10047, 204617, 93136, -75505, 119837, -13221, -123880, -120013, -169012, -150552, 7479, 108094, 86825, -43176, 9605, 220549, 35507, -139419, -171949, -201802, -162498, -171596, -60078, 87662, 20808, -53500, -120887, -25328, -16793, -58160, -245145, -248780, -182777, -187519, -398994, -499845, -382716, -393203, -398816, -384440, -217108, 13013, 50083, 90080, -102419, -173360, -231960, -250623, -193105, 25957, 333398, 441098, 220513, -12252, -117125, -140500, -109671, -6568, -154427, -198328, -28496, -81763, -104503, -93203, -234134, -199192, -174670, -179557, -217633, 3354, -61954, -45743, 128133, 43382, 40499, 71204, -23692, -132623]
14376a32623R3202J96437j19192r435L7177N623k03272L8305R7194M267j21772
14365a14089R2351O8542K0802l7675R613J805j09877j20925j11342q6551p4494
14354d61840K23092J02070q6695K6750j3816m333P6542K2893m7215J60381L0413
14343B8242j17595j4178R9978K52134P6815n2428j6577N808q0726j29939J54406
14332B05940o0679k9351L2188M6684K84847J22638k30025r5368J11679O7571l1296
14321D24828k44566L9668j1819l0017Q4583l3896M9660q7881q5389j21685q1767
14310i8281K3935K5747l4973m2818Q489m0559q089P5080J01675J45573j04594
14299E1185j55445k5233l2133r1768o3686J44320L36488p2750n5938j90146N6369
$$ y = [-132623, -39421, 157016, 37824, 28389, 65566, 71189, -132083, -93778, 3416, 7683, -114089, -21738, 46804, 67606, 29931, 39544, 41349, -68528, -189453, -300795, -387346, -461840, -238748, -136678, -223373, -196623, -210439, -214772, -138230, -115337, -162552, -2171, 28242, -89353, -103531, -3553, 248581, 325396, 272968, 256391, 262199, 181473, 51534, 205940, 145261, 115910, 148098, 194782, 479629, 602267, 372242, 276874, 388553, 456124, 424828, 180262, 219930, 208111, 178094, 262677, 228781, 278441, 190560, 105171, -16514, -98281, -74346, -48599, -83572, -126390, -117901, -158460, -166549, -91469, 10206, 155779, 51185, -104260, -129493, -161626, -253394, -317080, -172760, 163728, 90978, 35040, -155106, -98737]
14288i8737l2974J5893m4068J08659j58127j10191R4817K09424j5673N6359J89285
14277B14667M2285j16088j9179j01964R029q803r3383j3006Q6764O7823j92320
14266a24175j58834K9615J69867J02602m8954j77784l3063O7964J08602o7604
14256a31764R7500j48841l0697L8024k0075K3217L1015J25620J22382o0805m198
14245D1378j60550Q0867K64067l8291k48788j45549p1214J3497m2680l0314Q6711
14234b50866k947n8609P1365J79795q1037k61486m6712m2254K23051R6035O8148
14223a05517m5445j45010Q7245R320L6045K2939j2216J26959J42387q2873k13491
14212a79657l0299J9821j97627J21307Q9179O9933J44345O9615j25557q5493M1753
$$ y = [-98737, -131711, -115818, -159886, -51227, -209354, -319545, -224728, -15304, -30977, 25382, 214667, 256952, 140864, 121685, 19721, 28750, 19947, -73436, -86442, 322, 68145, -124175, -283009, -253394, -83527, 19075, -29879, -207663, -240726, -172762, -64160, -131764, -34264, -183105, -213802, -175778, -195853, -172636, -141621, -16001, 106381, 45576, 41378, -119172, -38305, 225762, 187471, -61317, -206866, -278080, -264583, -307263, -337577, -250866, -253813, -312422, -241057, -61262, -142299, -403785, -450497, -492751, -269700, -173665, -105517, -150962, -295972, -208727, -199407, -163362, -140423, -152639, -25680, 116707, 33834, -179657, -209956, -190135, -387762, -266455, -177276, -107343, 37002, 106617, -18940, -104433, -62680]
14201f2680m6862J9408N0882O1221J0207J52790r5797k3229k2862n4609j40224
14190a51755j43156p4664P7060m4545J28536K26013R6558k5213k50423k45832
14180d07421J37043J95572J41278j01795j1176J50468N7305k620q9427r4062J68552
14169A43717J96322m0118n9897m9311p5508j03666o5418P1932M2476o7224k42226
14158b48921L7976L03847J2938k10341q8875L3270K17784K538r6430l5475M3355
14147b8334k5019J15198J4696j35176j79313Q8713J41310M0122l9862J4745R4206
14136A01286R9794j43270k4231j5878n017J23865J1906j17706p0596o2026j0850
14125a12723Q8950J52177J669n850j28700o3286l5878J80849j1485j94809j624
$$ y = [-62680, -109542, -90134, -39252, 21969, 32176, 184966, 89169, 65940, 43078, -11531, -151755, -294911, -369575, -292515, -337060, -208524, 17489, 114047, 88834, -161589, -407421, -270378, -74806, 66472, -35323, -46499, 103969, 161274, 158654, 69227, -24835, 143717, 340039, 299921, 240024, 190713, 115205, 11539, -53879, 18053, 60529, -6695, -248921, -210945, 92902, 105840, -104501, -193376, -160106, 57678, 60216, -36214, -71689, -28334, -53353, 61845, 76541, -58635, -237948, -149235, -7925, 32197, -7665, 7080, 101286, 201080, 57810, 33579, 17701, 12684, 136549, 148455, 30749, -39847, -101873, -112723, -23773, 128404, 130073, 124223, -4477, -67763, -103641, 77208, 65723, -129086, -130710]
14114a30710J6310K33663J81773j33804q2838P5880j17114j25132K6046R5161
14104C9235k7078O6590j216R7909j53365R677J10279j29670j58646K15784J11180
14093A80679J10975L5854l4976j92768o9423M882O248L2744m9487q7514J7348
14082d5438J23524J95471N7791j46610k7062q5995J09479R8901L0630j87497j93399
14071g0205K2087p568j65385n9282N4180J54491P7154j3139J2238p995n3325m9477
14059a06226r0805n2334K89931k1398r5278r7247R6309K6604p2270p5789o5852
14048b64355N2136l9013R9092P5306O6725O2340l9217j29580J27905j3003r5569
14037i7233O1565N3761J29583Q097q6094j11882M6763R6377K6445p6673m3038
$$ y = [-130710, -114400, 119263, 301036, 167232, 84394, 160274, 43160, -81972, -55926, 39235, 12157, 78747, 77531, 175440, 22075, 31752, 142031, 12361, -146285, 69499, 180679, 291654, 327508, 292532, 99764, 30341, 35223, 41471, 74215, 24728, -62786, -45438, 78086, 273557, 331348, 184738, 157676, 71681, 181160, 280061, 310691, 123194, -70205, -48118, -55686, -221071, -280353, -226173, -71682, 5472, -7667, 4571, -3424, -56749, -106226, -197031, -249365, 40566, 19168, -76110, -173357, -77048, -50444, -122714, -198503, -264355, -212219, -251232, -152140, -76834, -10109, 52231, 13014, -116566, 11339, -1664, -97233, -35668, 18093, 147676, 155773, 69679, -42203, 4560, 100937, 127382, 50709, 7671]
14026G671P7700J22213q1729K7356j02077j56930j48541J18937J84279O1067j8457
14015I1489N8508J28516r9388j91413j00994p9364J76757J60016J16291o0837
14005A99581L1591j55051j4750l0251r8800J83941R0226O2748j01444K6217o6973
13994A27035N0760O7759l3277o7087j1055n3381j45789N3986m6457J23841l2359
13983C3976m8926j18188l0305P0597M9621O8661O0508Q5176n4850L1807j10286
13972C7791O8595q4112K84K1348o9590J211o7427j5415J22077k8337j6596K8790
13960a381J17597O5180q0479J6663R5063M0166O9424j17846j07697n375m7024
13949D4291J02988N4009j57037k9435m9116R3790J5324R5524k23025j10776l7762
$$ y = [7671, 85371, 207584, 125855, 153211, 51134, -105796, -254337, -135400, 48879, 109946, 91489, 149997, 278513, 179125, -12288, -113282, -192646, -15889, 144127, 260418, 199581, 231172, 76121, 61371, 31120, -67680, 116261, 206487, 269235, 167791, 194008, 127035, 177795, 245554, 212277, 145190, 134135, 80754, -65035, -11049, -57506, 66335, 33976, -14950, -133138, -163443, -92846, -43225, 25436, 85944, 171120, 116270, 148077, 37791, 106386, 22274, 22558, 43906, -25684, -24473, -91900, -107315, 14762, -13575, -30171, -1381, 116216, 181396, 100917, 117580, 212643, 252809, 322233, 204387, 96690, 91315, 44291, 147279, 201288, 44251, 14816, -34300, 59490, 74814, 170338, -52687, -163463, -201225]
13938b01225J12045J13953J21467J11694J84554q7494j51228K4432R967J12067
13928C50232j68960j43327j86272l0199J21813K27652K1659r0191N5987K2853
13918A81247r4957Q1516K8201k42353k67410J5599M9450O7962k5494J090J66055
13907c9094K3517k3588p7046K341J28191P7495m1160K9121J0158j08472j09416
13896a27953m0897J30478k5443p6488Q3321Q3930J08381j98977j35460K3560N6647
13885a18901L7597j68492M4950P3074j59847M7133K18934l4385k4669m4784q049
13874a37439J12602j25659r8297J4663J56868J69640K9060L6192J3440j18188
13864E2882k12167K4232J70193m9461r6847o6863J8222p411P5310j51866l7937
$$ y = [-201225, -89180, 24773, 146240, 257934, 442488, 354994, 203766, 228198, 238165, 350232, 181272, 37945, -148327, -178526, -56713, 170939, 192598, 102407, 158394, 181247, 86290, 167806, 196007, -46346, -313756, -298157, -248707, -180745, -206239, -205149, -39094, -15577, -39165, -116211, -113870, 14321, 91816, 50656, 79777, 89935, -18537, -127953, -168850, -38372, -63815, -140303, -56982, 26948, 135329, -63648, -199108, -175548, -118901, -81304, -249796, -204846, -131772, -291619, -244486, -25552, -59937, -84606, -129390, -137439, -24837, -150496, -248793, -234130, -77262, 92378, 121438, 157630, 171070, 52882, -159285, -135053, 35140, -14321, -111168, -178031, -159809, -167220, -91910, -243776, -281713]
13853b81713k2996J49581J85833J39255j9605r9396j43451j02679j21968J3631
13843c03508P7327n4771m0409K47161N7002j7182r4147l8956n6227K14354J76130
13832A66774p2380K865o7267l9031j75105m7284l8554O8937o833o0129P3094P1771
13820a23142p5965J6427J5520o5876J72309K48571r451j11273j06921J2933M3770
13809A6902q4955j30094M9217P3007O1290J65021p3429j27286j6635j14971j07003
13798b88936N943J07849K19700O6245R3813J09871n0575j23201j68019j29399
13788a56709r6645J7453p1049J8035O4689J66857K5539q874p1977Q3376J41122
13777A11817Q8654k4773j27931m6691J82418j38053n1035O7945Q7867p3710n1639
$$ y = [-281713, -304709, -155128, 30705, 169960, 150355, 50959, -92492, -195171, -317139, -303508, -226181, -280952, -321361, -74200, -17198, -34380, -128527, -167483, -223710, -9356, 166774, 94394, 97259, 29992, -9039, -184144, -231428, -269982, -201045, -207878, -268007, -194913, -123142, -199107, -182680, -167160, -233036, -60727, 187844, 178393, 67120, -39801, -26868, 16902, -68053, -198147, -148930, -75923, -14633, 150388, 76959, -50327, -66962, -181933, -288936, -282993, -175144, 44556, 110801, 204614, 314485, 263910, 140709, -27310, -156709, -253354, -235901, -306950, -288915, -224226, -57369, -31830, -40704, -112681, -29305, 111817, 200471, 175698, 47767, 1076, 183494, 45441, -5594, 62351, 150218, 76508, 24869]
13766B4869J34111K2091r4692j22164j6511M1950q787n2832R7486K8907q0715
13755b6287j257J21816M2O7995N3864o3420j24118j02133J5269l8748n4330j56922
13743c08229k6262J75947J07527k0590j70668r3539M4105p3306L9669J69709Q6834
13732f8803j02430J6662J45432K76209j56319j58429l8003l0082J68600p7943
13722b5106n5844L8138j14562L0810O3963M9620l6646k3000r881J27450o2639
13711a7697K2782J15935p8942j03313K3980N7818m2500j57765J48043k401P4464
13700D0404J0767R9482J08339J4146j04706j9539n4442j3072n8725l3642M1188
13689C0200J1858n3901Q946K9170m8351K7819m7194k6697r136K2102q463l5510
$$ y = [24869, 158980, 181071, 86379, -35785, -52296, -10346, -19133, -71965, 25521, 54428, -26287, -27544, 94272, 94314, 162309, 216173, 152753, 28635, -73498, -58229, -96977, -151307, -308229, -334491, -158544, -51017, -71607, -242275, -335814, -291709, -365015, -325346, -155637, -68803, -171233, -154571, -9139, 267070, 110751, -47678, -85681, -115763, 52837, -25106, -80950, -42812, -157374, -126564, -62601, -12981, -49627, -72627, -82508, 44942, -17697, 5085, 121020, 42078, -61235, -37255, 20563, -21937, -179702, -31659, -34060, 40404, 51171, 150653, 258992, 273138, 168432, 148893, 94451, 81379, 22654, -10988, 30200, 42058, -11843, -2897, 26273, -22078, 5741, -41453, -68150, -77286, -55184, -63647, -99157]
13677i9157M7286J05820J07610k2514l11756l3953M1773j5788q0305O6213j22800
13666c17571j05646J72310J51306P5931n8318N7553m2681K62894J37120j890j12021
13655B18987j6628R0170k19761k58079q5944J67671J7664K9802q4355k7918j9208
13644a87599K36044K15618K2151n0469l711j26501j47366m119L1375P2352J3198
13633G0973p7810K6693P7581J08630m6630l14540R388L57546q5910m1249k6342
13622E8330N1856j366J21498j8240k778M9511k08070j21873Q8011l4651j15114
13611a32886Q664K5641J81675J63232P9769l8292j35364k54450j50505J37793
13601a14723J4301o2453Q0792J02254L8843P2474L7866k58204k09520J38457M838
$$ y = [-99157, -51871, 53949, 161559, 139045, -172711, -206664, -164891, -180679, -260984, -194771, -317571, -423217, -250907, -99601, -23670, -81988, -24435, -67116, 195778, 332898, 331008, 218987, 202359, 292529, 72768, -185311, -271255, -103584, -85920, -56118, -140473, -168391, -187599, 48445, 264063, 286214, 235745, 232034, 105533, -41833, -45952, -14577, 57775, 70973, -6837, 19856, 97437, 206067, 159437, -155103, -145715, 211831, 125921, 84672, 58330, 110186, 108820, 230318, 212078, 209300, 258811, 50741, -71132, 16879, -17772, -132886, -124222, -98581, 83094, 246326, 326095, 287803, 152439, -102011, -252516, -114723, -100422, -162875, -82083, 20171, 59014, 131488, 169354, -88850, -298370, -159913, -155075]
13590a55075j88478Q446J03004P1866j03421K3592P9187n0623M3587N6156j3699
13579a25458j17245K15987J37144r075j29551j46878j187K5218M4090n9659j05575
13568b72189N020L3329L9364K54977J25692q7345j10757J643p9516J2424M4812
13557c2546k9419M6641J37162K909n1060j3257J03283L2589J09322k64627j76691
13546a35694N4541K00611K0339k36614j73860N6960M5725J30004P4019M2481j07071
13535b8559L6248J33769q450J14039R2842l14203j98652J50400K01437o3534j9711
13524I5626j07227n2692l3028k9428k8031L6810Q7631p5619p5323p1771N735J15512
13512a31805J60452p2773o3764k83045k00483K72193Q2822n0312J52678k0179
$$ y = [-155075, -343553, -335107, -232103, -160237, -263658, -240066, -160879, -211502, -167915, -111759, -125458, -242703, -26716, 110428, 101353, -28198, -175076, -176263, -151045, -106955, -166614, -272189, -267169, -233840, -194476, 60501, 186193, 98848, -11909, -10266, -89782, -77358, -32546, -61965, -15324, 121838, 124747, 73687, 60430, 163713, 196302, 305624, 40997, -135694, -81153, 119458, 139797, -96817, -270677, -213717, -167992, -37988, 36031, 78512, -28559, 7689, 141458, 133008, 247047, 339889, 25686, -172966, -22566, 178871, 115337, 95626, -11601, -64293, -97321, -126749, -154780, -117970, -30339, -105958, -181281, -253052, -247317, -131805, 28647, -44126, -107890, -390935, -591418, -319225, -236403, -286715, -134037, -154216]
13502a54216p2455K8488m1373Q0448K01959J1708Q5753J13223l7565P6170j27284
13491A64856k20913j19665O3051k3178J04163J80490L350j44812M400J54654j45988
13480B0408p1941Q4583K01726k3180J2005j27535k2877P3581P5499M6604j3314
13469B55559k47567o9507j04822o379L7946J5227p0920J20175m6727k09800J26821
13458a99994J3176J2001j19210K24764L4490P7121K36868J07647j7424j53248
13448B16191k06818j32420M1765k3175Q8707o2748l3767M8164J6100J49836R3400
13437A95235m8653o3404N9801p0399j38279j30517J72545P8483k9613j18511j75906
13426b69218j6431K48430J03118j7731o4290O3556J57324n9811j10622j33186
$$ y = [-154216, -226671, -198183, -239556, -159108, 42851, 54559, 140312, 253535, 215970, 292140, 164856, -56057, -175722, -112671, -135849, -31686, 148804, 152154, 7342, 11742, 166396, 20408, -51533, 33050, 234776, 211596, 223601, 96066, 73189, 146770, 222269, 268873, 255559, 7992, -61515, -166337, -172716, -134770, -119543, -190463, -70288, -117015, -326815, -199994, -186818, -174817, -294027, -69263, -34773, 42348, 279216, 386863, 369439, 216191, 9373, -123047, -81282, -104457, -15750, -78498, -112265, -64101, -48001, 101835, 195235, 146582, 83178, 142979, 72580, -65699, -196216, -23671, 54812, 25199, -93312, -269218, -285649, -37219, 65899, 48168, -16122, 47434, 204758, 144947, 34325, -98861]
13416i8861l8366n4845Q9051p9817k8820K14272o4426o874L5808r9019k9155j01367
13404b62419R826m335O3173M837j30394J23731K24816J83135M0401j89343j24976
13393f1548o1768j8654L0700l9246N6941o0025j1574Q5391L6984m5440j30111
13382b18350P3287P8954k8870j34412K088J26334J33257j41937j12519l8073K4615
13371b35626Q6034k3391O546j09950j11765j4209m984J21015J00001j07K4582
13360a61854K2297M2215J19736J69461p6708o7833k7565j9619j04289K5522m1342
13349a19979K6082P0553Q0714J11921L4431M0150q6260j46719j16594R6120m7007
13338e6588n9308j05397j46692M2524J25222P6299m1840m3722O5254R6239N5387
$$ y = [-98861, -137227, -192072, -103021, -182838, -211658, 2614, -61812, -68686, -32878, -131897, -161052, -262419, -252593, -256928, -193755, -188918, -319312, -195581, 29235, 212370, 252771, 63428, -61548, -123316, -141970, -111270, -150516, -93575, -153600, -165174, -79783, -42799, -88239, -218350, -145063, -66109, -94979, -229391, -227303, -100969, 32288, -109649, -222168, -260241, -235626, -149592, -172983, -166437, -276387, -388152, -402361, -407345, -286330, -186329, -186436, -161854, -139557, -97342, 22394, 191855, 115147, 47314, 19749, 130, -104159, -78637, -119979, -93897, -23344, 57370, 169291, 203722, 243872, 157612, 10893, -105701, -9581, -56588, -115896, -221293, -367985, -325461, -200239, -123940, -165780, -209502, -144248, -48009, 7378]
13327G378O1695K27365p3353j07367n0585m4107j54349J32179J0757P2044M9000
13316A30657K7432j72316O1925K0267O590k05007O4634J39173l7374O5098l3885
13305F7194Q1009P3338n5322q3170j88056j18097J75679K16968M7020J93196k3009
13294C86750j43140m3206k48020m2089J0801J01198J256j32755j13423j45491
13284c68119r334J68901o745K1278K1624K41689J83103N3614j35194k11091O4393
13273B4119K26037P9402k76717o2853j9874P6623J09722P1107j35130j83562L0210
13262f0916j08574P703m7895j2591j9850j6376J86974R9405Q1429j34601j36548
13251a61840P3577J65969J07021P1841j71547k4287m4666J34651M7782l4153k28632
$$ y = [7378, 69073, 296438, 223085, 115718, 65133, 21026, -133323, -1144, 9613, 81657, 130657, 158089, -14227, 47698, 67965, 74555, -130452, -65818, 73355, 35981, 101079, 67194, 148203, 221541, 166219, 83049, -105007, -223104, -47425, 169543, 216563, 409759, 386750, 243610, 200404, -47616, -89705, -78904, 22294, 23550, -109205, -222628, -368119, -377453, -208552, -215297, -194019, -172395, 69294, 252397, 306011, 170817, -40274, 24119, 250156, 329558, 52841, -10012, -29886, 46737, 156459, 227566, 92436, -91126, -60916, -169490, -161787, -209682, -222273, -242123, -258499, -71525, 27880, 109309, -25292, -161840, -88263, 77706, 184727, 256568, 85021, 60734, 16068, 150719, 198501, 164348, -64284]
13240f4284J48882J62652j33662j7221q0043k5695j34710n5858J63920J61017
13230A24998J4954j38110L6148J29827K5760j05404j00916L2269k7765j79306
13220a87545j55610q3383J15047j9988p9184K26601J67399j6764O8702J10673
13210A45948j68532L0629p1764j66709J59990K68868N9996k98319j0867o7242
13200a18002q1466M0685k8248J10196O7378K7211N2865n0918J10616M7261k5677
13189A51901m16r4307l6214p3841k85033K3622K73026J87654o4202q6950m4374
13178d9134k8566r944K33936J54066r0038k05316q9957m7425p0303j88080Q3335
13167c07426J01866J5543j0123M6992J7470R7896R3198P9723J26355J00085m8545
$$ y = [-64284, 84598, 247250, 113588, 96367, 16324, -9371, -144081, -199939, -36019, 124998, 139952, 1842, 37990, 167817, 193577, 88173, -12743, 19526, -8239, -187545, -343155, -426538, -311491, -331479, -410663, -184062, -16663, -33427, 35275, 145948, -22584, 8045, -63719, -230428, -70438, 198430, 258426, -39893, -50760, -118002, -199468, -158783, -187031, -76835, -9457, 17754, 70619, 19701, 130317, 177578, 151901, 151485, 57178, 20964, -52877, -337910, -314288, -41262, 146392, 82190, -4760, -49134, -77700, -87644, 146292, 300358, 210320, 5004, -84953, -132378, -202681, -390761, -307426, -205560, -190017, -200140, -153148, -135678, -37782, 55416, 135139, 261494, 361579, 313034]
13156C13034j01770J53522k36070k09405J32603J68237n9658j31509K5462o371
13146D8075k73184k27181K14632J92064J75075j9679o8865r4912j04960J24311
13136c4624J71128p0308N3531L288j00019n4707j15310k13270J15952J91516M2289
13125a0534k9548j0088N8898J30719J15561J8886o5547j14864j55893q1550J38284
13114e676J26473J5315q1608p6206K3332L3738r039j9583K30350n2659l8944m4471
13102A01022L4939j39429j74920J00764N6788J22838l4850j03637j37055L5578
13092a37962L1607P5024J4899o5402J65962j50281k88203p2263J24884j4049L0484
13081b85300J80221N8864l0347j1697j0644q6302R4493L61234J78286l32965k29042
$$ y = [313034, 211264, 364786, 128716, -80689, 51914, 220151, 160493, 28984, 54446, 48075, -225109, -452290, -237658, -45594, 129481, 109802, 40937, -53975, -158935, -34624, 136504, 66196, 119727, 123015, 22996, -31711, -147021, -360291, -244339, -52823, -10534, -40082, -50170, 8728, 139447, 255008, 273894, 208347, 93483, -62410, -143960, -5676, 120797, 136112, 54504, -21702, 1630, 35368, 26329, 6746, 237096, 184437, 145493, 101022, 135961, -3468, -178388, -77624, -20836, 102002, 67152, -36485, -173540, -137962, -106355, -31331, -16432, -81834, 84128, -66153, -354356, -426619, -301735, -315784, -285300, -105079, -46215, -76562, -88259, -98903, -185205, -90712, 270522, 448808, 115843, -113199]
13070a13199J20286O4659p2453r8299O0599K02826o2252j5222n135j08277k39267
13059b65734k328J36961Q9898J08951l2115q0644J32832j411o2193j64172k9681
13048a69636J18636k8382p9682J28008P0978n6543J9541k0218r5010j49829P0148
13037a91989K63716J2629r5688J32446Q3984n1571M1676K8966j14442o9850q168
13026C1709R3928P0622L431J3777j46751J4380n8309o5797R3373M6813q5095l2833
13014b0752J48553o6867q4766L8908P5502p6730k3214R2352j57153k4434k3886
13003a22487L876o4721J01691N1404L6035r3494O3787k05293L3199M8178r4081
12992b41906l9324J32648J82932J6778o7364O6548J66942K6845j22975k46255
$$ y = [-113199, 7087, 71746, -707, -99006, -38407, 164419, 102167, 86945, 81810, -26467, -265734, -268062, -131101, -41203, 67748, 35633, -45011, 87821, 86410, 24217, -139955, -169636, -51000, -79382, -159064, -31056, 39922, -16621, 2920, -17298, -112308, -262137, -191989, 71727, 84356, -11332, 121114, 205098, 153527, 195203, 224169, 109727, 39877, 31709, 125637, 196259, 199690, 213467, 66716, 81096, 22787, -43010, 50363, 97176, 12081, -20752, 127801, 60934, -23832, 15076, 90578, 13848, -9366, 82986, -74167, -98601, -122487, -118611, -183332, -81641, -30237, 5798, -87696, -23909, -229202, -196003, -147825, -241906, -281230, -148582, 34350, 51128, -16236, 50312, 217254, 244099, 121124, -125131]
12982a25131M4950o881j10994j5127p4274o883K66581J68265K5329r8948j04163
12971c7276k9755K00652o5149k76958j38982Q6910J78072J11606J0598r9347j77317
12960b36946N9578m4198k06325Q8559J22055J05466m0193n8952J21947J95898
12950A06889p8045o2760j18222o4096J7330p1002j72413r010J77621J43729q4404
12939b14383j01522J7281K00952Q1397j66050j55205n0564J31130K72133M7454
12929F2623j96036L5762J65207j6425j4971o5826P0599J48158o8431j79594j02787
12918a61721J23980l363q3908Q5641J42803J27338m4433n8699q3106k0653J6189
12907D0068k00815J26274K05230O5238l04663P9501J692J59509N450L2804M2522
$$ y = [-125131, -80181, -87062, -198056, -213183, -287457, -294340, -27759, 140506, 165835, 66887, -37276, -67031, 133621, 68472, -208486, -347468, -260558, -82486, 29120, 39718, -59629, -236946, -177368, -221566, -427891, -339332, -217277, -111811, -152004, -210956, -89009, 106889, 28844, -33916, -152138, -216234, -198904, -269906, -442319, -451329, -273708, -129979, -214383, -315905, -298624, -97672, -16275, -182325, -337530, -388094, -256964, 15169, 62623, -133413, -97651, 67556, 51131, 36160, -29666, 40933, 189091, 120660, -58934, -161721, -37741, -41104, -125012, -39371, 103432, 230770, 186337, 127638, 44532, 23879, 40068, -160747, -34473, 170757, 235995, -68668, 10833, 12525, 172034, 177484, 210288, 252810]
12896B52810J2458Q3257r0741k18272K32355j1342Q231p0281K3836p9918R4904
12885B37297r3706j65431Q821N9302k7010j86608l3952P2395J11049j64974J5006
12874a67811J27687j7945j15319J00894J29527Q3606q9072r6391k7787m1490P7953
12863c6148Q3748P6365j63122j51266k7359O7558K2137j7324j08662o0284M7154
12852b67203Q8469O9864j0611n4228p2235o934j7463m2017R5747J40533o7591
12841a43669j64877k0839R2105r907K4971N3517l522J03363L0812j0454J71732
12830A23232M2918k38270o693P997m730Q3130k5241M0514L4414j04154P4452Q4378
12818A11947m3784j82262j09999K70551J52462j2122n4688Q3785J31755k9935
$$ y = [252810, 265268, 348525, 257784, 39512, 271867, 260525, 268756, 198475, 222311, 142393, 237297, 143591, -21840, -13019, 46283, 19273, -167335, -201287, -128892, -17843, -182817, -167811, -40124, -58069, -173388, -72494, 57033, 140639, 51567, -44824, -72611, -114101, -36148, 47600, 123965, -39157, -190423, -217782, -150224, -128087, -145411, -254073, -314357, -267203, -178734, -108870, -119481, -173709, -245944, -252878, -270341, -312358, -216611, -76078, -143669, -308546, -329385, -237280, -247187, -222216, -168699, -172221, -68858, -38046, -48500, 123232, 166150, -72120, -78813, -70816, -75546, 7584, -17657, 22857, 57271, -46883, 27569, 111947, 68163, -114099, -224098, 46453, 198915, 186793, 132105, 215890, 347645, 317710]
12808C17710o9885k01345p0924L0584J6078m1359J1441p247J52102L16808R9870
12797E53833k09334j20479p8144m8447r1816o0774K30255J27721k32070k80Q2579
12786A53044n6719l4634j26352r9579J93178J33936m2136k0718L4162N6918k27528
12775c6428o467R5013J7581r6167Q948L3229k2533N8117N0530J28742J8057n4305
12763A94317j12571N4307n8325k6470O6554j0423J17529r4820j45536j32478J96272
12752D8356N057L9861p7526j40539j4851J1162k2596K9461K1031J5436p5033l7224
12740a97405j02286L1426J76101m5854p3507N9136O1703j01005k19662M1036P7258
12729b93059o0765L7014J78291j67366R3045P8113N5308M3639N0668j25875k3159
$$ y = [317710, 247825, 46480, -24444, 6140, 22218, -19141, -7700, -14947, 137155, 453963, 553833, 344499, 224020, 145876, 97429, 5613, -55161, 175094, 302815, 70745, 70465, 153044, 96325, 61691, -64661, -164240, 28938, 162874, 120738, 100020, 134182, 191100, -36428, -42895, 52118, 69699, -26468, -17520, 15709, -6824, 51293, 101823, 230565, 248622, 194317, 81746, 136053, 77728, 51258, 117812, 107389, 224918, 130098, -15438, -147916, 48356, 53413, 93274, 15748, -124791, -139642, -128480, -151076, -121615, -100584, -85148, -160181, -197405, -299691, -268265, -92164, -138018, -211525, -152389, -90686, -191691, -411353, -370317, -293059, -353824, -316810, -138519, -305885, -212840, -134727, -79419, -35780, 14888, -110987, -134146]
12718a34146n0373N6879Q0485J5246N816J6300J51265P6977r4572K03137K2228
12707C49242j35985r250L0669n094J0888j15321l4968k785j11470k6167J16171
12696F5930m645K5880j53406N0247J65134L2373P893k8185j87900r7914j17027
12685b41620L1813m8161R4325J35717Q5853J4441k11132n8031J28413Q5065K73440
12674B90123R6049j61195q9117N9008l9710j07980n2525r3521K5276Q4898k7753
12663a6447o4339m9404J01027j44270l2763R5636j8637Q7441Q2130O0862j19186
12652a7950k08245L2984Q2836J41592p2983K7507J06755M2501L0229j79104J42052
12641A28174L15580k23655j90102P369j01466l02J9625p0108J347k8531K3751
$$ y = [-134146, -184519, -127640, -47155, -31909, -26093, -9793, 141472, 218449, 123877, 327014, 349242, 213257, 204007, 234676, 229582, 240470, 125149, 90181, 87396, -24074, -50241, 65930, 61285, 87165, -66241, -15994, 149140, 181513, 189406, 161221, -26679, -124593, -241620, -209807, -257968, -163643, -27926, 57927, 72368, -138764, -196795, -68382, 16683, 290123, 386172, 224977, 135860, 194868, 155158, 47178, -5347, -98868, -73592, 11306, -16447, -80786, -130190, -29163, -173433, -206196, -110560, -129197, -41756, 40374, 101236, -17950, -226195, -193211, -110375, 31217, -41766, -14259, 92496, 134997, 165226, -13878, 128174, 443754, 220099, 29997, 37366, -64100, -64402, -44777, -114885, -113538, -142069, -118318]
12630a18318p789o5876J6374J54805O080J41387K02615p8850l62354j86405P0282
12619b28049j2455n1165J8094o1791J11980L23096n153O8388j04257j8554J05867
12608A46001j4900j89303j35460N9391K1154Q0588J48236L2310n0057j61118j46084
12597b09242Q9630K7495K3967K18801Q1012R6322j17719j49735O075j19123j55522
12586b08039q0296J43340K45192k0678J9278J20188j4023j4576o8445m3520M4307
12575A22728N7673j24346j88269p4192j04350K21J57565K88554K12733j55937
12565A92380M1536k9944o9902k7786O8116o4125r0170j13964P5260J06626p7543
12554A0484R2666j8399N4993m7318j98002o0707j36877J52846P3978p9002Q9182
$$ y = [-118318, -126107, -191983, -175609, -20804, -14724, 126663, 329278, 250428, -111926, -298331, -228049, -240504, -291669, -273575, -335366, -223386, 99710, 94557, 162945, 58688, 40134, 146001, 131101, -58202, -193662, -134271, -113117, -32529, 115707, 148017, 97960, -63158, -209242, -119612, -92117, -68150, 150651, 231663, 327985, 210266, 60531, 66606, -52517, -208039, -288335, -144995, 100197, 79519, 98797, 218985, 204962, 190386, 121941, 78421, 122728, 180401, 56055, -132214, -206406, -310756, -310535, -152970, 135584, 348317, 192380, 233916, 203972, 134070, 106284, 174400, 110275, 20105, -93859, -18599, 88027, 10484, 103150, 84751, 139744, 92426, -105576, -166283, -303160, -150314, -76336, -155338, -66156]
12543f6156J08294j04844o2598j4719M4140P6610O8147L2897M8051o9753n7985
12532B084j22231q9111j7500p3955J92006J69479j24615j1426o2361J32198r7301
12521a02733j02055J84062J60636j00568k43167J18021P8847n4003j7527M9314
12511b9173p0119j67544p9908p0858N869o3094L9653K67300J68019J51699k7510
12500A24334p1829l4785J1475j47257J16466J73865j7317k01029O0321J52768
12490A67012L4817J9590j460k4301R8153N3488J8874k72080k38374P2330J80462
12479A08511j00148m3962o7024R5928j08063r7894J60982m4379J66399J05075
12469A75425l4446q0657j33176l9126K7198m2133L8653M7628j46452j4647R8108
$$ y = [-66156, 42138, -62706, -125304, -140023, -95883, -19273, 48874, 81771, 129822, 60069, 2084, -120147, -209258, -226758, -300713, -108707, 60772, -63843, -75269, -137630, -5432, -102733, -204788, -20726, 139910, 39342, -203825, -85804, -6957, -60960, -78487, -29173, -99292, -266836, -346744, -417602, -411733, -474827, -435174, -167874, 145, 151844, 124334, 52505, 17720, 29195, -118062, -1596, 172269, 154952, -46077, 14244, 167012, 201829, 221419, 219959, 195658, 293811, 347299, 366173, 94093, -144281, -71951, 108511, 8363, -35599, -102623, -6695, -114758, -212652, -51670, -96049, 70350, 175425, 140979, 60322, -72854, -111980, -84782, -126915, -88262, -40634, -187086, -201733, -103625]
12458a03625J11909p4896j26097k5883J12694J4266p4419M1957J67333Q8738J98962
12447C30939j15018j42436j26362P6586M2660Q9126l189j09508q2833M3768j82942
12436a79209j83259n1415j4360J68370K10225Q0063J0902m6475j09093R9816J91298
12425A76863J35178r7132r9757l1546J710Q8476J48473j08863j69586K1329m872
12414F0273j04406n2276J2347K16954n2639J99514P5138k69215j65053J96295
12404A16932J47468j29964j89530j17224k824o8755K7128J42762J51864R6306
12394A74163J12546N3702r8136j43362k12447j18915L2904J01074Q0708Q9995
12384G2232J19100m6046j53350o3975k3234N7085K0819j18754r2547r8655J50976
$$ y = [-103625, 8284, -66612, -192709, -218592, -105898, -91632, -166051, -124094, 43239, 131977, 330939, 215921, 73485, -52877, 23709, 66369, 155495, 152306, 42798, -40035, 3733, -179209, -362468, -413883, -428243, -259873, -49648, 30415, 41317, -5158, -114251, -14435, 176863, 312041, 214909, 115152, 83606, 85316, 173792, 322265, 213402, 43816, 65145, 60273, -44133, -96409, -84062, 132892, 80253, 279767, 354905, 85690, -79363, 116932, 264400, 134436, -55094, -172318, -175142, -243897, -216769, -74007, 77857, 174163, 286709, 340411, 242275, 98913, -113534, -232449, -199545, -98471, -17763, 72232, 191332, 145286, -8064, -72039, -95273, -38188, -17369, -136123, -228670, -327325, -176349]
12373a76349R5559L2590O5684j58748k08425Q8069K46129N3475k17111J00989
12363g8138J73207P2861j01159j37584J1464Q4925j600J94795j13026j18731N8500
12352D5514m1587m5352J54684L8271j39090p9978o3131j1212J15473j8347o6681
12341a11436J4057J6928J84769p6964J8631J39458r3178j15316r5003L0507O6228
12330b1319N577l6584J21041J72669N2418j79433k09830p3283J22659J5537n9293
12319h9841L7720J13689J1336j91459k37630Q8805P2779J52403L01207j56904
12309A02105k2755r9230J01062J04210J3539j06125j66476L806J35137m8164m2859
12298b5750J82020K23245j22576j7285Q0038l8448m5254k39449j38693R5475o2535
$$ y = [-176349, -80790, -48200, 17484, -141264, -349689, -261620, -15491, 37984, -179127, -78138, 95069, 167930, 66771, -70813, -59349, 25576, 23976, 218771, 105745, -12986, 45514, 3927, -41425, 113259, 151530, 12440, -67538, -130669, -141881, -26408, -44755, -111436, -97379, -80451, 104318, 27354, 45985, 185443, 92265, -23051, -118054, -87547, -21319, -15742, -52326, 68715, 241384, 293802, 114369, -95461, -168744, -46085, -30548, -89841, -52121, 61568, 72904, -118555, -356185, -267380, -194601, -42198, 259009, 102105, 79350, -19880, 81182, 185392, 198931, 92806, -73670, -69864, 65273, 17109, -25750, 156270, 379515, 256939, 239654, 319692, 281244, 235990, -3459, -142152, -46677, -109212]
12287a09212p5811k09123K3960O1188O790P3831R5329m183j41206L9615L1638
12276b07184n1568R2146R8148n795p1258j16079N0138J53853J21570j35799r3657
12265a65485K4512q7965q0972J03592O5771J35968n7022j27747k3839K3097p6298
12254b66388j19266P6635P6454Q048j47611o92J77710L37509J26525j75410K1547
12243A15061K2733o2368k09653j24607M4771O3653n6522M9395k10827O2582N3403
12232b52379j30428J2396J40649k9236M428n1629r912q133J15370J4405J02721
12221i1748q2700n6047N7913m0194j0319J37566L6216r3855m1017K9464l4697
12210a89418N8792K0744K0538N4747K110J06943Q1584r8870m8139k1464j72016
$$ y = [-109212, -185023, -394146, -370186, -308998, -302208, -228377, -133048, -137231, -278437, -238822, -207184, -258752, -166606, -68458, -74253, -145511, -261590, -211452, -57599, 63971, -71828, -165485, -140973, -228938, -309910, -206318, -140547, -4579, -61601, -189348, -213187, -190090, -266388, -385654, -309019, -232565, -224517, -372128, -372820, -195110, 142399, 268924, 93514, 115061, 137794, 75426, -134227, -258834, -214063, -150410, -206932, -157537, -368364, -305782, -252379, -382807, -370411, -229762, -258998, -254570, -306199, -316111, -324244, -208874, -194469, -91748, -174448, -230495, -172582, -212776, -223095, -85529, -49313, -143168, -184185, -154721, -189418, -130626, -109882, -89344, -34597, -32487, 74456, 156040, 57170, 9031, -12433, -184449]
12199a84449J37277J46580p9561k3048l3284M6175M8911R5826J6742Q5671j04215
12188A52625k45478o0289J3021r4153N4364K08290k3633o3738N5103L14171P288
12177C17571k6676o3595K5904N2185m7536p2832L2695o3352r4223p3877J56817
12166A43081J1159n2815n98l9667q9361r9839J271k0223M0818R6285J03308m7481
12154D5938L5204k7592m5598k7157M182J52498L423L1361N3273m3284r1771j11094
12142b0617l5161P6710J23997r1375J43201N0152J1201P9576j9633k0512o9440
12131B28099Q6764N4576q0046k08368j85331j095K0068Q8360o0717R2051J8304
12120E2665l8972j18386J17573J05598Q2959J7820J04692k1052j22056j9516j15735
$$ y = [-184449, -47172, 99408, 19847, -3201, -36485, 9690, 58601, 154427, 171169, 256840, 152625, -92853, -153142, -140121, -234274, -179910, 28380, 4747, -58991, -3888, 310283, 317571, 290895, 227300, 253204, 305389, 257853, 185021, 217716, 154364, 60141, -13736, 143081, 154240, 101425, 100827, 61160, -28201, -128040, -126769, -146992, -106174, -9889, 93419, 45938, 81142, 53550, 7952, -19205, -15023, 137475, 140898, 172259, 225532, 182248, 90477, -20617, -55778, 20932, 144929, 53554, 196755, 246907, 258108, 337684, 318051, 297539, 228099, 314863, 369439, 289393, 81025, -104306, -105401, -85333, 3027, -57690, 34361, 52665, 13693, -104693, 12880, 118478, 201437, 219257, 323949, 302897, 180841, 161325, 45590]
12109D5590M0238l1828P3744J69131N7447r0554p3317j21291K5929l9824p2097
12098a6832r0110J03636J6877p9774m2498Q6398J34527j6982J27788J26288j27306
12087B22012Q8304J99040O4195j61443j35676p6213j31527r6067M0680j2873N820
12076F252O7067J6285J86477N312p9566l1594L9027m7057l7325l6983l8056N6030
12064A05869o7009J01799Q1307r0400P3720J38086j22807J9226J89492n3726n5146
12053C20411o4890j94926K47072q6047q5168L0267N2658Q7890J0818n7898O5397
12042C25584N3652Q7255O2880J47294n2033j08015m3467J2014m1829k33353n5203
12031A54779o2551K0526Q8758O6350n252O1248J98920k926r8519O4936m0749l1890
$$ y = [45590, 85828, 54000, 127744, 296875, 354322, 263768, 190451, 69160, 95089, 55265, -16832, -106942, -3306, 13571, -66203, -108701, -22303, 112224, 95242, 223030, 349318, 222012, 310316, 509356, 573551, 412108, 276432, 200219, 68692, -27375, 13305, 432, 6252, 73319, 89604, 276081, 281393, 201827, 170233, 209260, 162203, 124878, 87895, 49839, 105869, 38860, 140659, 221966, 131566, 205286, 343372, 220565, 239791, 429283, 375557, 320411, 255521, 60595, 307667, 221620, 136452, 166719, 219377, 307267, 318085, 260187, 325584, 379236, 466491, 529371, 676665, 624632, 516617, 473150, 485164, 443335, 209982, 154779, 92228, 112754, 201512, 267862, 262610, 323858, 522778, 519852, 421333, 486269, 445520, 413630]
12019D13630J69091J91359k0562p0888p8271Q6294N6195q6560j07826q4465J64460
12008F32457J07639K8580q430q4846K2561q5470j1399n0732J35982L2343j94902
11997E23783j73560K22956K01568J73505K3721p5701k5852K0789l3519J12140
11987I69830J26257l3883j42297j05815P8965J44065l9747J32207L4613k1776
11977A142419K15631P2782p4307L3305J8361Q9367L1491l8397j33877l1888J50086
11966A474973J32807J18209J5737O876M9494J20256K14940K0675o8674L11932
11956B397225K27415J9812J5564J73579K11456K48429L15715J23187J58996P2839
11946C964217K0320L43112N51642M13409K47797M22780N10398O79815P28838R36899
$$ y = [413630, 582721, 774080, 753518, 682630, 604359, 690653, 746848, 660288, 552462, 467997, 632457, 740096, 768676, 760246, 675400, 697961, 612491, 601092, 550360, 686342, 718685, 523783, 350223, 573179, 774747, 948252, 971973, 896272, 870420, 891209, 857690, 969830, 1096087, 1062204, 919907, 814092, 893057, 1037122, 997375, 1129582, 1164195, 1142419, 1358050, 1430832, 1356525, 1389830, 1408191, 1497558, 1529049, 1490652, 1356775, 1324887, 1474973, 1607780, 1725989, 1741726, 1748602, 1798096, 1918352, 2133292, 2153967, 2085293, 2397225, 2624640, 2644452, 2660016, 2833595, 3045051, 3293480, 3609195, 3732382, 3891378, 3964217, 3984537, 4327649, 4879291, 5292700, 5540497, 5963277, 6473675, 7153490, 7882328, 8819227]
11936H819227O19436N87644R19753J352779J744663J618806J844205K164398K578259
11927B2249170L296286M127994N111356O366024Q576282J0831445J4488335J9560149
11919I4607041K6044425L3168445L8470418L8255572L1799875K3311122J4240611
11912B99897509R36525j7563441l3914757m0249084l7231379l0069282k3013040
11905A18793051j7557571j3362463j0377597q286469o629076n539708m593087
11898E2447080l689038k950120k448667k283579k124483k005789k006520j840586
11890C3098298j663594j545362j150468j071475j292337j293224j210864q84158
11882B2986816q08750q08751p39520o67557p94890n79778o28545p05183o65603
$$ y = [8819227, 9438663, 10026307, 10946060, 12298839, 14043502, 15662308, 17506513, 19670911, 22249170, 25545456, 29673450, 34784806, 41150830, 49727112, 60558557, 75046892, 94607041, 120651466, 153819911, 192290329, 230545901, 262345776, 285656898, 299897509, 300834034, 283270593, 249355836, 209106752, 171875373, 141806091, 118793051, 101235480, 87873017, 77495420, 69208951, 62579875, 57040167, 52447080, 48758042, 45807922, 43359255, 41075676, 38951193, 36945404, 34938884, 33098298, 31434704, 29889342, 28738874, 27667399, 26375062, 25081838, 23870974, 22986816, 22178066, 21369315, 20629795, 19962238, 19167348, 18587570, 17959025, 17253842, 16588239]
11873A6588239n82583o81908n12999k84547k45585k89537m39144l01499n33779
11864A2716658o66477k85381j41021k99857l05229j66854j10127l12831n23198
11855I905683l49325l53067j61130j84179l09376l01943j16543k03434k66221
11846G660465k83552j8046n4699j96376j85814j3926j20713k21074k75296l75804
11836E915165r1028j50108j22591j20003O1465j9713j67991k43346k01717k06300
11826D653833q148m0223k08849j49437p0767J48608k9000l78536l1870m4761n2302
11815C788548k6490j58020j79336p7549k2683j09331o2650j02543L5406m0734
11805C044618r3310j84369k39199j78043p2050l4753J4557N7433J3410o0682o2552
$$ y = [16588239, 16005656, 15323748, 14810749, 14526202, 14280617, 13991080, 13551936, 13250437, 12716658, 12050181, 11764800, 11623779, 11323922, 11018693, 10851839, 10741712, 10428881, 9905683, 9556358, 9203291, 9042161, 8857982, 8548606, 8246663, 8130120, 7926686, 7660465, 7376913, 7358867, 7304168, 7107792, 6921978, 6908052, 6787339, 6566265, 6290969, 5915165, 5824137, 5674029, 5551438, 5431435, 5492900, 5473187, 5305196, 5061850, 4860133, 4653833, 4645685, 4605462, 4396613, 4247176, 4176409, 4325017, 4296017, 3917481, 3885611, 3840850, 3788548, 3762058, 3604038, 3424702, 3347153, 3324470, 3215139, 3152489, 3049946, 3085352, 3044618, 2951308, 2766939, 2527740, 2349697, 2277647, 2242894, 2257451, 2314884, 2328294, 2267612, 2205060]
11794B205060j47686j1698J03597q4399Q300J84330j27031j21994j231K3445j7315
11783B013378j50449o2244Q534J2554k7127n0976J08206J57244j38497j00349
11773A770274N7393r523j38047k00058j80484Q9417m8312k7468P7221N6276M6946
11762A493635k8009j5620j9929q7762J6909Q829j7256p6766j66501R46P5875N7326
11750A241677J03495L1763j55842M7394m21j53363j09697J40061j1941p633j46906
11739I78587o7319j00741o7802o6605o4491J16062N2639K08058N2166J34278j94849
11728I79983k33478q6026p7599j06975J0112j51344J39460J32938O7782j92490
11718D82363r6754M9721L9268j7279Q5621P1587n6468k5382j96900Q3764Q7750
$$ y = [2205060, 2057374, 2045676, 2149273, 2064874, 2073174, 2257504, 2130473, 2008479, 2007248, 2030693, 2013378, 1862929, 1800685, 1809219, 1821773, 1794646, 1743670, 1851876, 2009120, 1870623, 1770274, 1827667, 1818144, 1680097, 1480039, 1299555, 1388972, 1340660, 1313192, 1390413, 1446689, 1493635, 1465626, 1450006, 1430077, 1342315, 1359224, 1368053, 1350797, 1274031, 1107530, 1108476, 1184351, 1241677, 1345172, 1376935, 1221093, 1268487, 1268066, 1114703, 1005006, 1145067, 1133126, 1125493, 978587, 911268, 810527, 742725, 676120, 611629, 727691, 780330, 988388, 1040554, 1174832, 979983, 746505, 660479, 582880, 475905, 486017, 334673, 474133, 607071, 674853, 482363, 385609, 435330, 474598, 457319, 542940, 614527, 558059, 532677, 335777, 419541, 507291]
11707E07291K1772j50302j08997l4280m0320n8920R6820J19727r6604L8250L2249
11696C26686K01087N9638o5626n2325J39193J01137n7452k60094j30123j0773
11686B51348R2498J23565P5977j15968j90356N231M2206k4288j6103m3018p8949
11675A22143m4448J39963R6923k4160j90656j99188j07452J40489K13244R4585
11665B41443J61793l6334p6062K5824J8291n724R7685K1187K1941j54691j15045
11654B00308J02978l277j62356J7557L8688l4881p4751j1187K2326N1346p1126
11643G5625j0529j272J04786m6621k48185M9881R5689J13826p5558j84810j20606
11632b47774K03635P2168J13052Q3016J9246p0606P794j04654L5060O8031j10541
$$ y = [507291, 529063, 378761, 269764, 235484, 195164, 136244, 233064, 352791, 256187, 294437, 326686, 527773, 587411, 521785, 469460, 608653, 709790, 652338, 392244, 262121, 251348, 343846, 467411, 543388, 427420, 237064, 242295, 284501, 260213, 244110, 201092, 122143, 77695, 217658, 314581, 290421, 99765, -99423, -206875, -66386, 146858, 241443, 403236, 366902, 290840, 316664, 334955, 329231, 426916, 448103, 470044, 315353, 200308, 303286, 300009, 137653, 155210, 193898, 159017, 84266, 73079, 95405, 146751, 75625, 65096, 63824, 168610, 121989, -126196, -76315, 19374, 133200, 57642, -127168, -247774, -44139, 28029, 141081, 224097, 243343, 172737, 180531, 75877, 110937, 178968, 68427]
11621F8427O707j93491j23877K38730L7376P764J68839k1953N564L7444M4057
11610B75587l564m5087K05797j06597J11708P4339l179Q48j44981K6354O3273
11599D54498N2490O4294J2545j17450j55493k5326o8246n0460p1376k09642l3171
11588a47337j3320L23478J40854m0794p7512j95307p0336O4048o649K18601o4126
11577A31600j6709L3337q4406L3300o922N9842Q7656J64747O1584r178j32630
11566C22221J439L2333k59146j00542o8215j1087P7710m5283M9555j19264m5165
11555a65444J78749P3256m4401l2290P0020Q9009Q740k564p6463j1571M2332p3107
11543E6266k17697j13417Q4665K60703J03136m7477j21347l6262J6564M5237m6326
$$ y = [68427, 75134, -118357, -242234, -3504, 33872, 41636, 210475, 188522, 194086, 231530, 275587, 272023, 226936, 432733, 326136, 437844, 512183, 509004, 509852, 364871, 391225, 454498, 506988, 571282, 583827, 466377, 310884, 285558, 217312, 166852, 95476, -114166, -147337, -160657, 162821, 303675, 262881, 185369, -9938, -80274, -16226, -22875, 195726, 131600, 114891, 148228, 63822, 97122, 90200, 150042, 237698, 402445, 464029, 454851, 322221, 323660, 355993, 96847, -3695, -71910, -82997, -5287, -50570, -1015, -120279, -165444, 13305, 86561, 42160, 9870, 79890, 168899, 177639, 175075, 98612, 87041, 129373, 56266, -161431, -274848, -190183, 70520, 173656, 126179, 4832, -31430, -14866, 30371, -15955]
11532a5955m391j61158M8152R033K8823M3352k7597J54485Q0335j80874r2845
11521a18640R7949N1262O3186n3773n606k1538j06173k7718J35849j14931R6608
11510c525J19233p7705j6914Q2275k8863j4258R6621m740N2461k07347j57579
11499a60341K0470L1425J00691R6920j38705P0762k3858l4303j78801n2896K03880
11488f4756J35693L8603j40851j4029m878K8096l9314j90764J6369Q0824O3267
11477i1740J13392j5455n1399r0910Q8585j15261m5156N0673P0574n6474j13948
11466b57119j3609l4407J22079R3698J73178M5858l5381q6454n861o5619p2819
11455a36456K25277o261r1164l5509P1959j03119m6655R0154r5914J19427M4441
$$ y = [-15955, -20346, -181504, -133352, -124319, -95496, -52144, -79741, 74744, 155079, -25795, -118640, -20691, 30571, 93757, 39984, 34378, 12840, -93333, -121051, 14798, -100133, -3525, 115708, 38003, 21089, 103364, 74501, 60243, 156864, 152124, 204585, -2762, -160341, -139871, -108446, -7755, 89165, -49540, 21222, -2636, -36939, -215740, -268636, -64756, 70937, 109540, -31311, -45340, -50218, -22122, -61436, -252200, -235831, -155007, -91740, 21652, 6197, -45202, -136112, -47527, -162788, -207944, -157271, -86697, -143171, -257119, -270728, -305135, -183056, -89358, 83820, 129678, 94297, 7843, 1982, -63637, -136456, 88821, 82560, -8604, -44113, 27846, -75273, -121928, -31774, -127688, -8261, 36180]
11444C6180R3238j4881j03499m9140o9510j06950Q7549R4229Q1388J55440K9378
11433B33422m9202K57399J01660j56114l47645j35432m259J4707R5294J6709J04903
11422A31442j29184j26062J7800r4880P5802o8699j24714j96187l1429m7879J85203
11411d08787K69897J72505j26223j01110K5392o2990K5133K38289J49859j32007
11401D9958j22854j5307J9387J1815j6995Q0581j4694j01678j2439L027N5515
11390f3684L320R4875n1389m6019j20121n1851J12081o9342k50919M5292O5610
11379c32147J64058Q1831j55797J26806n0572K4398J02428l1976n5343O3959L8275
11368b4080J72692L8122j22177r3523n0938j9389l501J91230l9204j8954m8118
$$ y = [36180, 129418, 114537, 11038, -38102, -107612, -214562, -127013, -32784, 48604, 204044, 233422, 184220, 441619, 543279, 387165, 39520, -95912, -100171, -85464, 9830, 26539, 131442, 2258, -123804, -106004, -200884, -125082, -193781, -318495, -514682, -546111, -593990, -408787, -138890, 33615, -92608, -193718, -168326, -231316, -206183, 32106, 181965, 49958, -72896, -88203, -68816, -57001, -73996, 6585, -8109, -109787, -122226, -119199, -63684, -60364, 34511, -16878, -62897, -183018, -234869, -122788, -192130, -443049, -397757, -332147, -168089, -86258, -242055, -115249, -165821, -141423, -38995, -70971, -126314, -62355, -24080, 148612, 186734, 64557, -28966, -79904, -99293, -102794, 88436, 49232, 30278, -17840]
11357a7840j13323J09141K0657r4238R6437J3229J269P9765P9586l1593J1037
11346A54127o2233o4442Q4740k9096J36761n9522k20133N5278J2684J24528k9601
11335A03091o0322n4906l7754K3272j1683n472J16059j3202Q337M0894J18031
11324B26345j314M3330l11454j81882L8731P2641O7194K15542n2238n0323J64691
11313B31263J1166o8280J23798Q5374k10483J03072p8118j34558k63466N9966
11303a40266M3793j45249j20987k4818K41090J19940J4038n8139J43243M8820
11293A21465l1887j26108q9740M2863r0259m5913J14657N3829n3986M7441j2876
11282g0514R1445k374J1663K8673L6127J7908L6295j05614k27472r8717M1851
$$ y = [-17840, -131163, -22022, -1365, -95603, 834, 14063, 15332, 95097, 174683, 143090, 154127, 91894, 27452, 112192, 83096, 219857, 160335, -59798, -4520, 8164, 132692, 103091, 42769, -12137, -49891, -26619, -38302, -43774, 72285, 59083, 67420, 108314, 226345, 225031, 268361, -43093, -224975, -186244, -113603, -46409, 169133, 116895, 66572, 231263, 242429, 174149, 297947, 383321, 172838, 275910, 197792, 63234, -200232, -140266, -96473, -241722, -362709, -387527, -146437, -26497, -12459, -70598, 72645, 121465, 89578, -36530, -126270, -83407, -173666, -219579, -104922, -51093, -105079, -57638, -70514, 20931, 18557, 30220, 58893, 95020, 112928, 149223, 43609, -183863, -282580, -240729]
11271b40729Q9552N0369J76497P2037k2570p1107q2900J14477P9521J48682J33161
11260D46990j00774m4531o8523q5341R4320o705q852o4163k10141p7425L6054
11249h9091m3184O9724J27940N2066K08301j38655j27260J47618J16436r7627
11239B26268j08276j14496M3399P2080l3722r489Q8171O6550k33125p4715R3154
11228A5799L1267j11355j1729J13550O012l3225r4969l8653p5420j49596J0440
11217c37879J72791K52441K2794j63006r3290j02867P5831R3960j24804J17717
11207h6312K60082J4510q4688k4513j54475M8383J94265p1963m0040p2541J07799
11196I0507P7158q6449o8768J02392Q1140m7776o4542j25981q2745J25427p3180
$$ y = [-240729, -151177, -100808, 75689, 147726, 125156, 54049, -28851, 85626, 165147, 313829, 446990, 346216, 301685, 233162, 147821, 242141, 235436, 226584, 162421, -47720, -125145, -89091, -132275, -62551, 65389, 117455, 325756, 187101, 59841, 207459, 323895, 226268, 117992, 3496, 46895, 118975, 85253, 75764, 163935, 230485, -2640, -77355, 15799, 47066, -64289, -76018, 37532, 43544, 10319, -84650, -123303, -198723, -348319, -337879, -165088, 87353, 110147, -52859, -146149, -249016, -173185, -79225, -204029, -86312, 173770, 188280, 103592, 79079, -75396, -27013, 167252, 95289, 55249, -17292, 90507, 167665, 81216, 12448, 114840, 195980, 148204, 83662, -42319, -125064, 363, -72817]
11185g2817r5261J01567J18121J43104L6151J6512k49125q7026J69069P3780p6617
11174G7458k5706O1835p3474p4846j97772k4480J80970K31923m2590r5558J49336
11163A67096J52617q0914j24835n078Q2056o5295j30189J37934M1680n6919j32609
11152a4456J56402R4410k9621j54046j86035n6721R9139Q2480R2974J25684K025
11141B12235k44735j57365M7521o2241j14665m8931K321K50961K07516N4758l2411
11130A14964j9493J0879J85593o3439j05207l3454q2293j77719l8304L8924K81369
11119A11820J33870j58711j30119L5722J3099j10136j08125j08312Q2494K2349
11109b16049J09870J16726P3265P9773K505O1758j0000K9570j04906j65363j10817
$$ y = [-72817, -168078, -66511, 51610, 194714, 230865, 247377, -1748, -88774, 80295, 154075, 77458, 51752, 113587, 40113, -34733, -232505, -256985, -76015, 155908, 113318, 17760, 167096, 319713, 238799, 113964, 108886, 190942, 125647, -4542, 133392, 175072, 118153, -14456, 141946, 236356, 206735, 52689, -133346, -190067, -90928, -8448, 84526, 210210, 212235, -32500, -189865, -142344, -204585, -319250, -368181, -365860, -114899, 92617, 147375, 114964, 95471, 106350, 291943, 228504, 123297, 89843, 7550, -170169, -208473, -169549, 111820, 245690, 86979, -43140, -7418, 5681, -104455, -212580, -320892, -238398, -216049, -106179, 10547, 83812, 163585, 166090, 227848, 217848, 247418, 142512, -22851, -133668]
11098a33668p9369O1469K5634J2763J89846N4165r1105q0888m2127l3439N2056
11087f4663R1043p9893K3803O3847K6284j07132N2403R5800Q6959N143Q0071r3513
11075A80152j2336q193k08281j14206n011P0485J91355k070M6439J1007K5229
11064A74570L1348o78j93828j12399j1127Q9568L69303j5881k88581L3431P7988
11053A53714n1435R7748l0306K3486R3538j4230L4123p3780J35369J18624j4443
11042D72408M9956N7828O843j54740K2423R0013K37948N6000J15269J4745N0999
11031A019692q4533K4914m9684j24576J30120N3373J31619K08565R4138n9817
11021A343811r7977j2667L9236j14393k64852p5825J23571M3700n6614k0094J34224
$$ y = [-133668, -213037, -151568, -125934, -113171, 76675, 130840, 39735, -41153, -83280, -116719, -64663, 26380, -53513, -29710, 34137, 60421, -46711, 5692, 101492, 188451, 193594, 273665, 180152, 167816, 159623, -48658, -162864, -167875, -97390, 93965, 91895, 138334, 149341, 174570, 205918, 205240, 11412, -100987, -112114, -22546, 346757, 330876, 42295, 75726, 153714, 102279, 200027, 169721, 193207, 286745, 272515, 306638, 232858, 368227, 486851, 472408, 522364, 580192, 587035, 432295, 454718, 544731, 782679, 838679, 953948, 968693, 1019692, 935159, 960073, 910389, 785813, 915933, 969306, 1100925, 1309490, 1403628, 1343811, 1245834, 1233167, 1272403, 1158010, 893158, 817333, 940904, 984604, 927990, 907896, 1042120]
11010A042120K11982J06446L7093n8288l11044k24184k08957m7013N7788j24543
11000D81400o6991j51106M8983J63717N7186l7452j70761r3038J52411j46205
10990B38144j98736L1430J24422j36117J483M4600p1519k9652J17635O2390N3620
10979B37700n8201n5019j34016q6154M1195R809K0858J4411K6408k318o6473j03619
10967a55419r0734j72145o388L17451K10513Q092q9166q4628J83561J60271J0732
10956B92140q455l7468m598j14975P0142K2880n1892O1514j17537L450J6290j18373
10944A3118J4458J2775l7045N7651J95234q8791j48361K1758N702L1534n971L5854
10932A07916N3199p3729k1045L9950J39045k20816J05702K26532O9706j65212
$$ y = [1042120, 1254102, 1360548, 1397641, 1339353, 1028309, 804125, 595168, 548155, 605943, 481400, 414409, 263303, 312286, 476003, 533189, 495737, 324976, 231938, 384349, 238144, 39408, 70838, 195260, 59143, 60626, 105226, 33707, 4055, 121690, 184080, 237700, 179499, 124480, -9536, -95690, -54495, -44686, -23828, -9417, 16991, 14673, -51800, -155419, -246153, -418298, -424686, -107235, 103278, 111370, 22204, -62424, 121137, 281408, 292140, 283685, 246217, 241619, 126644, 196786, 219666, 167774, 229288, 111751, 115201, 131491, 13118, 27576, 40351, 3306, 60957, 256191, 167400, 19039, 40797, 46499, 78033, 72062, 107916, 161115, 87386, 66341, 106291, 245336, 24520, 130222, 356754, 426460, 261248]
10922B61248q7559p3585j03844m8252j4129J2671j2k9736n9907l1804R3681J16635
10910C5407j00112k2321j644j93682K0015O3939j61739Q6070K77393j02208j83805
10899b82687Q1836j1132J25436j88253p6063R9368p3787m6623M4411K2680R0940
10888b13874J1397N8864m0002k1492K2432J0325J2830N1015O6431M8891j41875
10877a35058l9274K15392k28466O601N2546J25736L437O8448j12261l5429J26737
10866D8409J14564j07466P6620j7571n0837l2368P5471J40732r2492p7351j45113
10855f7402P2681O5468L4308L793M2367K6936l6899m9232Q9421J17515K04315
10844E03271L3605k05029k43276j17521M5477R8544Q0604O125q1680j04114J52021
$$ y = [261248, 173689, 100104, -3740, -51992, -66121, -53450, -53462, -83198, -143105, -174909, -81228, 35407, -64705, -87026, -88670, -282352, -262337, -198398, -360137, -274067, 3326, -98882, -282687, -200851, -211983, -86547, -274800, -350863, -251495, -325282, -371905, -327494, -304814, -213874, -202477, -143613, -183615, -205107, -182675, -172350, -159520, -108505, -42074, 6817, -135058, -174332, 41060, -187406, -180805, -128259, -2523, 914, 69362, -42899, -78328, 48409, 162973, 55507, 132127, 114556, 63719, 31351, 106822, 247554, 155062, 77711, -67402, 5279, 70747, 105055, 108848, 151215, 178151, 141252, 92020, 181441, 298956, 503271, 536876, 331847, 88571, -28950, 16527, 115071, 195675, 201800, 120120, 16006, 168027]
10833A68027n6505m7388J39015l4371M763K7595r8309N8786j75556n0791K1034
10822d3700j06303j92912N1342O8062J45007K3735j3011Q5835o177R8626J11407
10811B21911J6292l7931R8872r1873M2388M7728j31111l9437j35957k03009k0111
10800b32238N4492O4723K2871O3582J26061Q883k9819l3532M1457O0667n2966
10789I4181j16291k8771L5870O4942k061M269J117j29386j49530j25934j75898
10778e27492J55353J56193R7204j5110R7303N0215R4349R9943J8316K17971L2224
10767D76469k19905q0772Q0078k71317k51835J20514K21279Q6705p3299q1305
10757F612J51355j10177j80375J2780J50499j8944R0697R400l7040N113r8755
$$ y = [168027, 111522, 64134, 203149, 168778, 173541, 201136, 102827, 161613, -13943, -64734, -43700, -150003, -342915, -291573, -223511, -78504, -54769, -67780, 18055, 11878, 110504, 221911, 238203, 200272, 299144, 207271, 249659, 297387, 166276, 126839, -9118, -212127, -232238, -177746, -113023, -90152, -26570, 99491, 108374, 78555, 45023, 86480, 147147, 94181, -22110, -50881, -15011, 49931, 47870, 52139, 53256, -76130, -225660, -351594, -527492, -372139, -215946, -118742, -133852, -36549, 13666, 108015, 207958, 226274, 444245, 476469, 256564, 175792, 255870, -15447, -267282, -146768, 74511, 161216, 87917, 6612, 157967, 47790, -132585, -119805, 30694, 11750, 102447, 111847, 74807, 79920, -18835]
10746a8835J12422J38503j8478j48415L8790J24338N9027o6838P6514j75409O309
10735A27928J40274j49135K1576Q5605N3985o7310o1084L4272l7259J08550r1240
10724A66162J72504K07741M7775P993K5914j14696p2564p2637m0781j01164m7765
10713A78482o8229P6036J35021R220j34272R6922P7666J06722j97174j83261j22824
10702b5691O9838J46811L2244p3849J6847J46256P3304Q0252K5650o7289J28296
10691E52669p825j07748j386j36813N5864O1087L1195j12570l2219m5368O7814
10680C24700L4036o9491q1229r7778m1674N3516J94838K0116K4405R9652n5513
10669D05578L3271j17630J44867K66431j7637p1772j42771p2828r9901N4739P8510
$$ y = [-18835, 93587, 232090, 213612, 65197, 103987, 228325, 287352, 220514, 297028, 121619, 127928, 268202, 119067, 140643, 226248, 280233, 212923, 151839, 186111, 148852, 257402, 166162, 338666, 546407, 594182, 602175, 628089, 513393, 440829, 368192, 327411, 226247, 178482, 110253, 186289, 321310, 330530, 196258, 293180, 370846, 477568, 280394, 97133, -25691, 44147, 190958, 223202, 149353, 166200, 312456, 385760, 466012, 491662, 424373, 552669, 544844, 437096, 435710, 298897, 354761, 415848, 447043, 334473, 302254, 256886, 324700, 358736, 289245, 208016, 110238, 68564, 122080, 316918, 337034, 361439, 461091, 405578, 438849, 321219, 466086, 732517, 714880, 643108, 500337, 427509, 327608, 382347, 460857]
10658D60857J04909K52502L36510J83409M2600J1289J30575Q3026k73111j98850
10648A133716K34042K42780l83k33150j55673k1982J54062L05536K78049K5802
10638A962799n7008J30894L50014M17447M18484M71104N63946M64652M69057L38081
10628E529470K97295O11002O88231J161835J683675K490183L336188M043679N677691
10619B5519249P282700Q151255P946788P183941O445716N252107L159091N94887
10611G1535734p39727K16437L338597P687794J2050447J4926692J4560163J2494834
10603A36070971J0519849P713292J690200n793041q930932o295343k9408P417419
10595A42363007J4459610J8200288J6900196J3235771R691894M609844n014663
$$ y = [460857, 565766, 818268, 1154778, 1338187, 1380787, 1392076, 1522651, 1605677, 1332566, 1133716, 1367758, 1610538, 1610155, 1377005, 1221332, 1199350, 1353412, 1658948, 1936997, 1962799, 1905791, 2036685, 2386699, 2804146, 3222630, 3693734, 4257680, 4722332, 5191389, 5529470, 5826765, 6437767, 7125998, 8287833, 9971508, 12461691, 15797879, 19841558, 25519249, 32801949, 40953204, 48899992, 56083933, 62529649, 67781756, 70940847, 71535734, 70796007, 71012444, 74351041, 82038835, 94089282, 109015974, 123576137, 136070971, 146590820, 154304112, 155994312, 150201271, 141270339, 134974996, 134945588, 142363007, 156822617, 175022905, 191923101, 205158872, 214850766, 219460610, 214445947]
10588B14445947j5733732k0532648j7224141r821946k147105L838630O922830
10581A59747835O332713M240495K235214j699064q406316j5139400j7526121j4620869
10573A15164487r621170m931061j608745K8591K10014n77000k136516m095099
10565I2433501o742279q911959r446859q538612o926988n193321l972261l152816
10557C9548406k474031k198504j850774j403036j512483j457307j132334r43531
10549B6576406r30761r91355q94423p90009o52161q05249o01141q10913p79450
10540A9320944p26447m55772m34686m19791k66221m68585o56665o20650n77596
10531A4694531m33442j33592j93501l19019m36265k38020k62298m80748m95065
$$ y = [214445947, 198712215, 178179567, 160955426, 151133480, 148986375, 152825005, 159747835, 166080548, 170321043, 172556257, 170857193, 162450877, 147311477, 129785356, 115164487, 105543317, 100612256, 99003511, 99032102, 99242116, 98665116, 96528600, 92433501, 85691222, 76779263, 67332404, 58793792, 51866804, 46673483, 42701222, 39548406, 37074375, 34875871, 33025097, 31622061, 30109578, 28652271, 27519937, 26576406, 25645645, 24654290, 23759867, 22969858, 22317697, 21512448, 20911307, 20100394, 19320944, 18594497, 18138725, 17704039, 17284248, 17018027, 16549442, 15892777, 15272127, 14694531, 14261089, 14127497, 13933996, 13614977, 13178712, 12940692, 12678394, 12197646, 11702581]
10522A1702581l05636l44758j81429j15472k12324m98371m69750k01432k02485
10513I170924k40642q9115l64098n38512j02645N8393l6606j44728l93167l39384
10503F980420k23244j38750k8886p0737j06192k10002k37714j38875j38235M3656
10493E731441M7596j31499j37120k5053k47407j53426k15672j83988J3318j43714
10483D554476j72444N5916r3144l56745j88254j6518Q5667J09369q1883m1967
10473C854473j97141k61445J32502r8149q7388M7254N6641k48921k02012j51454
10463B844360M2586p9046k2338n6705Q9079n2544k54159l6927j05724J28378J03681
10452B600641j3696l5332j19472j71408p2387o6882j21934m9855n2960k2126P0494
$$ y = [11702581, 11396945, 11052187, 10870758, 10755286, 10542962, 10044591, 9574841, 9373409, 9170924, 8930282, 8841167, 8477069, 7938557, 7835912, 7894305, 7857699, 7712971, 7319804, 6980420, 6757176, 6618426, 6589540, 6518803, 6412611, 6202609, 5964895, 5826020, 5687785, 5731441, 5779037, 5647538, 5510418, 5485365, 5237958, 5084532, 4868860, 4684872, 4698190, 4554476, 4382032, 4437948, 4344804, 3988059, 3799805, 3783287, 3868954, 3978323, 3896440, 3854473, 3657332, 3395887, 3528389, 3430240, 3342852, 3390106, 3446747, 3197826, 2995814, 2844360, 2886946, 2807900, 2785562, 2728857, 2817936, 2765392, 2511233, 2474306, 2368582, 2496960, 2600641, 2586945, 2551613, 2432141, 2260733, 2188346, 2121464, 1999530, 1949675, 1896715, 1874589, 1945083]
10441A945083M9244j36215j45412j0360O0835J13618j53845J1481n6816n9012
10431A618601j40007j2465J42483k3446L9410P5044j44171j66828j65967P162
10421A229816l6638N7059j57923j64972j09325p5899N580J00023P2164J80561
10411A100446K5200o4900j50301K8284k5741o8278j02979m4727M1826J42381l05
10400H80906j31478J4600o6017j0604K7873N0433j42433j07534O2314j8048k01748
10389C58264M591J03417K10034N8978j32588q7340p182k00074L5924r9866O6706
10378C10864J09949l1087M0744J89156J49761q9921p8738J1214l8922j00446j05448
10367C67126k7553n6294J12943N6189k01183j31416J31240K08068p3858j67154
$$ y = [1945083, 1994327, 1858112, 1712700, 1702340, 1763175, 1876793, 1722948, 1734429, 1677613, 1618601, 1478594, 1466129, 1608612, 1585166, 1624576, 1699620, 1555449, 1388621, 1222654, 1229816, 1193178, 1250237, 1092314, 927342, 818017, 742118, 747698, 847721, 919885, 1100446, 1125646, 1060746, 910445, 938729, 912988, 844710, 741731, 697004, 738830, 881211, 880906, 749428, 764028, 698011, 687407, 715280, 765713, 623280, 515746, 578060, 560012, 358264, 362855, 466272, 676306, 735284, 602696, 515356, 508174, 308100, 344024, 244158, 310864, 420813, 389726, 430470, 619626, 769387, 679466, 600728, 611942, 573020, 472574, 367126, 339573, 283279, 396222, 452411, 251228, 119812, 251052, 459120, 385262, 218108]
10357B18108O4507Q9201k0674R35k6074O5679j14499Q7889k8739O5871m4868j0894
10345C46442J35925R4426j63160j14141K8255r1046j08108n0966K1367P6214K12027
10334C87235j38137j4112J20788N7854o2867O7791L1486o1200m2126m0477j12464
10323A93771p2235j4573K2843K34993k8055L7785o9202j09791o8212M5574K07249
10312C80147O689j04827j63403M7961L5552j7836J16859O6343p0743J03818J41591
10301E42151M3520Q2505j1108j47992j659j00994o3960J90599J18005O5379j35673
10290E80773k86902O0848J0034J24478J02747R5032J47321p577j56262K9836K18782
10279I19110J99007K37331K24668M56168N57583O04394N55354N68011M64704L57057
$$ y = [218108, 282615, 371816, 351142, 352077, 326003, 391682, 277183, 365072, 336333, 402204, 357336, 346442, 482367, 576793, 413633, 299492, 327747, 236701, 128593, 77627, 98994, 175208, 387235, 249098, 234986, 355774, 413628, 350761, 418552, 450038, 388838, 346712, 306235, 193771, 121536, 106963, 129806, 364799, 336744, 374529, 305327, 195536, 127324, 172898, 380147, 386836, 282009, 118606, 166567, 202119, 184283, 301142, 367485, 296742, 400560, 542151, 585671, 668176, 657068, 509076, 507417, 406423, 342463, 533062, 651067, 716446, 580773, 293871, 354719, 364753, 489231, 591978, 687010, 834331, 826754, 670492, 700328, 919110, 1118117, 1355448, 1580116, 2036284, 2593867, 3198261, 3753615, 4321626, 4786330, 5143387]
10269E143387J88790N238k89951n38531m88967l56325m64743m90105k86416k00884
10259B221493l42499l65962l94261J3905O668j23440O4280o5468j72030j8930
10249H23756R0240p6065J7558M2901o9446j40104j77331q8797o0257j5281K14625
10238E61799J06446l1618M3819R4384q73Q104j40851k61782K7273J81598O4957
10227F53256o1949n0102J15931j75330Q584K0488q4927k51927K8826R236R7564
10216C09650J05826j4098L3846N2562j6328O886k7653l1158J2227J6168j45180
10205C02748k1678m544j14964K3181J77144j21698j07174j6350q281O5700Q3598
10194B57682J2259r41N0480P2505M9098l120j58340j73292j15914J63955J89025
$$ y = [5143387, 5332177, 5337415, 5047464, 4508933, 4019966, 3663641, 3198898, 2708793, 2422377, 2221493, 1878994, 1513032, 1118771, 1132676, 1139344, 1015904, 1080184, 1014716, 842686, 823756, 913996, 837931, 855489, 898390, 828944, 688840, 511509, 422712, 362455, 347174, 561799, 668245, 636627, 680446, 774830, 773957, 782061, 641210, 379428, 406701, 588299, 653256, 591307, 541205, 657136, 481806, 490390, 510878, 425951, 174024, 202850, 212086, 309650, 415476, 401378, 435224, 487786, 471458, 478344, 450691, 419533, 431760, 447928, 302748, 281070, 276526, 161562, 184743, 361887, 240189, 133015, 116665, 108384, 174084, 257682, 269941, 269000, 319480, 391985, 441083, 437963, 279623, 106331, -9583, 154372, 343397]
10183C43397J08609M751K9214o5797p0065K46285M6944J02085l1820R6226P049
10172H16878n2490J12986m9238M6079K42513L3354M2695j23753l8981J82322J46467
10161A358832j1727k41117K8920R4506m6085p5562R1587N2552p4593j33813k685
10150A040815P7813l4779k4226j5680j38487r8563N9238R4080r6879j08404J7134
10139G72062L075k1190M5378j54551J3204q6530J28269J6333q1800r5761q4307
10128D54182J16023R6122J1032j04493Q051m8104j00418j26972q822p2091k0048
10117B04462R823J32107P9836Q8291j05493m9278j50698j28260m7189J3113L2052
10106G8766K2562P618J42752p7729o3892j06220L9796j17199r0915k2245N4133
$$ y = [343397, 452006, 456757, 485971, 420174, 350109, 596394, 643338, 745423, 713603, 809829, 816878, 764388, 877374, 828136, 874215, 1116728, 1150082, 1192777, 1069024, 1030043, 1212365, 1358832, 1347105, 1105988, 1134908, 1229414, 1183329, 1107767, 1199354, 1251906, 1177313, 1043500, 1040815, 1118628, 1083849, 1059623, 1043943, 905456, 806893, 866131, 960211, 863332, 754928, 772062, 775137, 753947, 799325, 644774, 657978, 571448, 699717, 716050, 634250, 538489, 454182, 570205, 666327, 677359, 572866, 580917, 532813, 432395, 305423, 296601, 224510, 204462, 214285, 346392, 426228, 514519, 409026, 359748, 209050, 80790, 33601, 46714, 78766, 101328, 108946, 251698, 173969, 110077, 3857, 43653, -73546, -164461, -186706, -132573]
10095a32573J18577R4005J00358j05565p7593j5470j66114k22810J7382K75552
10085a14251J95894K02300N4458J60268k10927l29545K9367K4755n96p219m8279
10074d3775J40180K52249p4856Q9946j34728k16617l7453J45405p9150J61454
10064B02655P8978j64483r0436J40976l5452M0528R8239N2693K5901q7570j31315
10053A30714n2454p0643j5972j1826J06011n3345K0570j87845j11530O7649P2094
10042a06577q2935Q7389j2949k3139J25905M5884J4829q5566O1841J25912K03523
10031C54117M427j05558p0652j21568m0286l5850J73162n3003o8095L2457j9875
10020D9276o7792l6025J23236J04297K1346l4094o2350o3420J88462J69265p7060
$$ y = [-132573, -13996, 80009, 180367, 74802, -2791, -18261, -184375, -407185, -389803, -114251, 81643, 283943, 338401, 498669, 287742, -41803, -12436, 12319, 11723, 4504, -43775, 96405, 348654, 273798, 363744, 229016, 12399, -25054, 120351, 41201, 202655, 281633, 117150, 26714, 167690, 132238, 172766, 271005, 323698, 349599, 262029, 130714, 78260, 7617, -8355, -20181, 85830, 32485, 53055, -134790, -246320, -178671, -106577, -189512, -102123, -115072, -138211, -12306, 33578, 48407, -37159, 24682, 150594, 354117, 358544, 252986, 182334, 60766, 20480, -15370, 157792, 104789, 36694, 69151, 49276, -18516, -54541, 68695, 172992, 194338, 160244, 97894, 34474, 222936, 392201, 315141]
10009C15141j6466n3964j84766k32020N6400R3708M0469N0902M7394J30142P1037
9998C17977O8376n9665j41759m1177j74472j48186l4697J32021j80620K4101K40267
9987B166j6429p7610r7885q0899J0720N3403n5204J04232J19116l703O6195M0308
9975F4410r092J62597P7726q1424p8138j93023Q1907n1257j41388P5096J21369
9964B8783N9624n0798p6648P2828j67788m1508J80219k3277k6801P9143P1685
9953A05462M8263l2781j75524P6409L19966O7324k03904q5922l6439j7893J03470
9942A68431O8420L9572m2301r6235q2781l202J5416L8227N0384J60452j63407
9931A52976R3316N2408k33988r3423N7929k6093N1329l5470L6740p5266j90575
$$ y = [315141, 298675, 244711, 59945, -172075, -115675, -21967, 18502, 69404, 116798, 246940, 317977, 386353, 326688, 184929, 143752, -30720, -178906, -213603, -81582, -262202, -238101, 2166, -14263, -91873, -189758, -270657, -259937, -206534, -261738, -157506, -38390, -42093, 24102, 64410, 55318, 217915, 295641, 214217, 136079, -56944, 24963, -26294, -167682, -92586, 28783, 88407, 37609, -39039, 33789, -133999, -175507, 4712, -18565, -45366, 33777, 105462, 153725, 120944, -54580, 21829, 341795, 409119, 205215, 119293, 82854, 64961, 168431, 236851, 276423, 234122, 137887, 55106, 51904, 67320, 105547, 155931, 316383, 152976, 246292, 298700, 64712, -28711, 29218, 3125, 54454, 18984, 55724, -19542, -210117]
9920b10117P9238R364J23598J6665r8991m5786N4477j37986N8320K16031J83290
9909B48103m4042j26180n4932j15415O3480K1052o4895j3596p7156J4587J40097
9898h897K2716K7887k4984K26N1601k8665M7510n0762P3816o8701K7298K05762
9886B74807j4559L093j06418p5224L2837r4555o236O2033j9472L8936J12779j68118
9874C9903j75456J63137J69427j36197J26118R599q5041L9859j9993o7212k10940
9863a46796j22819J77360J591Q1129N9108P2781M7672j9392J2479j36676l60764
9852c34327K60691J59009N8369j42843R6110Q1148k09650J13941J74529J81641
9842D38618M061n6999k7610K0539r3026l4437l5565j19261p8021o8201K11169
$$ y = [-210117, -130879, -121515, 2083, 18748, -80243, -126029, -71552, -209538, -151218, 64813, 248103, 204061, 77881, 22949, -92466, -28986, -7934, -72829, -86425, -163581, -148994, -8897, 13819, 41706, 16722, 16948, 68549, 39884, 87394, 36632, 110448, 41747, 69045, 274807, 260248, 263341, 156923, 81699, 114536, 19981, 13745, 75778, 56306, 95242, 208021, 39903, -135553, 27584, 197011, 60814, 186932, 196531, 111490, 151349, 131356, 64144, -146796, -269615, -92255, -90664, -9535, 49573, 122354, 170026, 150634, 163113, 26437, -334327, -73636, 85373, 143742, 899, 97009, 178157, -31493, 82448, 256977, 438618, 442679, 385680, 358070, 378609, 285583, 251146, 215581, 96320, 18299, -49902, 161267]
9831A61267J41883p1590L6499M7090k18038n9552P3605Q6292J2265J6126k8966
9820A96881P0969N2396K8339O2437j13710k32966j21620l8223O19N5554N8297
9809A8973j5906L7620j46609j73535J2333Q5066K59752n725j84030j19340K20148
9798a1253K51118K3935j69465j55600L594P9304j68598l0217J5716J54070O9756
9787F2360Q6575l9315q5926j76058J95376J01826o5847k4650p0809K7538K7384
9776C8454k6385j41479k0196J1333k1954P9375J54991J62102j49935L2373R4686
9765B13365k23175r3877O3263K5860n9350K5160j90K5779L9J14284o4553j8598
9753H007J47244J0577k11432m585M6102l6490o3713K7021J50355r7779m9670M8470
$$ y = [161267, 303150, 231560, 268059, 315149, 97111, 37559, 111164, 197456, 209721, 225847, 196881, 267850, 320246, 348585, 411022, 297312, 64346, -57274, -95497, -94878, -39324, 18973, 3067, 40687, -105922, -279457, -267124, -182058, 77694, 71969, -112061, -231401, -11253, 239865, 263800, 94335, -61265, -57671, 21633, -146965, -177182, -161466, -7396, 62360, 148935, 109620, 23694, -152364, 43012, 144838, 78991, 54341, -16468, 11070, 38454, 12069, -129410, -149606, -138273, -160227, -80852, 74139, 236241, 86306, 118679, 213365, -9810, -103687, -40424, -14564, -73914, -48754, -48944, -23165, -23126, 91158, 26605, 8007, 155251, 165828, -45604, -50189, -4087, -40577, -104290, -77269, 73086, -24693, -74363, -25893]
9741b5893L1705j3707O9197Q0726j10113j27097R0587O744J46741J8752q8454
9730G9188K793p5677m6101J19146o6912k4882L6540J82812O4312j13901j78158
9719b0840O5125j34909j56351P6226J52863R4614k1162M2275M5412N1419m7984
9708A46688Q3213J6668o2076k03060j10366J22959k8031p6262J0890l7839O9435
9697f7781L5982j05664Q926r394J46210n1453r3952k8274K05513J4276k4890m0483
9685a0984n087j5437N2311K1356j6978j10380j00489J64424L2920m832k8725J5200
9673f701j02312k01034J25937J06080j50581n4342J67951R8858q1046N0774K43184
9662A96768k8043j83868l1043L989j09040J1298K860K24237L37596J15704k06293
$$ y = [-25893, 5812, -7895, 61302, 142028, 31915, -95182, -4595, 2149, 148890, 167642, 79188, 81981, 6304, -39797, 79349, 12437, -12445, 24095, 206907, 271219, 157318, -20840, 44285, -90624, -246975, -170749, -17886, 76728, 55566, 97841, 143253, 194672, 146688, 229901, 246569, 184493, -18567, -128933, -5974, -34005, -110267, -99377, -137216, -67781, -31799, -137463, -128537, -137931, 8279, -43174, -137126, -165400, 40113, 54389, 29499, -10984, -16071, -31508, 20803, 42159, 25181, -85199, -185688, -21264, 11656, 6824, -21901, -6701, -109013, -310047, -184110, -78030, -228611, -282953, -115002, -16144, -97190, -46416, 196768, 168725, -15143, -46186, -42197, -151237, -139939, -137079, 87158, 424754, 540458, 334165]
9651C34165L52642K45791j93324k95519k03978k80731j27150Q7296R5226J13487
9641A27905M3069r4057L9238J60327r0477j83886k6039O3733J99258K09144j58286
9630B89929j10463J06898N6008m8961r0118J00172N9601j08348j08465K3233J84136
9619C53622J07265j37952k24273j16545r5893J1629N9362O4224j4794M5305K4125
9608G6075O1742j51299n796J01043M3256J12762k945o1341j25593O8023P9160
9597A95087j36023J7361J45492Q5414n0326j61536k56418J1411k5779O6209J22820
9586A3712j25784l4693J10690J08293k0639p240K74421o1845j24638j54913N435
9575a7201j56310l0732l6138r6626P9909R7004K47906J29413l46547l5419M1786
$$ y = [334165, 686807, 932598, 739274, 443755, 239777, -40954, -168104, -80808, 14418, 127905, 170974, 76917, 116155, 276482, 186005, 2119, -23920, 39813, 239071, 448215, 289929, 179466, 286364, 342372, 293411, 203293, 303465, 363066, 254718, 146253, 169486, 353622, 460887, 322935, 98662, -17883, -113776, -102147, -42785, 21439, 6645, 51950, 76075, 137817, -13482, -19278, 81765, 125021, 237783, 234838, 173497, 47904, 115927, 195087, 59064, 76425, 221917, 307331, 257005, 95469, -160949, -149538, -175317, -109108, 13712, -112072, -146765, -36075, 72218, 51579, 44339, 318760, 256915, 132277, -22636, -17201, -173511, -204243, -240381, -337007, -257098, -160094, 87812, 217225, -129322, -164741, -122955]
9564a22955P2100m3228q4692m3063J78860P6079l0819p5307j16265j35493J14400
9553b10383P6148m8235m2074J30234K17363L2059P2030j30909j56013j22898m3418
9542b26096K4035M8852J80336K9920j12773L9786M2486J07373l2508q8778k851
9531I782J46861j32807m9279r9984j31626J19704K12177L827M5581J72448J52527
9520D49211o9611j02113o2886j2996j8837k1250K4983j15013q0796p8095q0884
9509a68287P0491K8713J11280l6087J03404J46746j0781k15927j65055n2796j9644
9498b07943l8387j2335J39507k2158K79785q1058j23706q8307K8381J35112J03228
9487A12119j13174r8899J34190p8534p589M9760m2869o0979k49777l3433N0254
$$ y = [-122955, -50855, -94083, -178775, -221838, -42978, 33101, 2282, -73025, -189290, -324783, -210383, -134235, -182470, -224544, -94310, 123053, 155112, 227142, 96233, -59780, -182678, -226096, -202061, -153209, 27127, 57047, -55726, -15940, 26546, 133919, 101411, 12633, 9782, 156643, 23836, -25443, -125427, -257053, -137349, 74828, 78655, 124236, 296684, 449211, 379600, 277487, 214601, 201605, 182768, 161518, 186501, 71488, -9308, -87403, -168287, -97796, -69083, 42197, 6110, 109514, 256260, 245479, 29552, -135503, -188299, -207943, -246330, -258665, -119158, -141316, 138469, 57411, -66295, -154602, -126221, 8891, 112119, -1055, -99954, 34236, -44298, -51887, -2127, -44996, -105975, -355752, -389185, -338931]
9476c38931Q593L4473P1880Q9058L586P0092N7060L5321j08572n9564K316o4495
9464a99183o3320j1447J05305k1434K49029Q6398j03944l2522L1575j00543J660
9453e8426n022p8173q3075m8375j09680R7928J82066J35801J2968p9113R2718
9442E9617J19419k4558j65587J845K4601J254J01106J8719k0403J4557J50873
9431B81443j23470j09178j34503Q2098m9313q750O3291R0398J3076P0379k7455
9420A48016k0733l6937j04654r0599J03613o5140J03966L08379k17981o3591J8078
9409H2417k3656L4324O6890J29439j50601q8366m8013J13322K4988l5716j74191
9398f9163l941K28544J516m8340K3245O4179J10076j8701j4473r4572j59753j30069
$$ y = [-338931, -330338, -295865, -223985, -134927, -131341, -61249, -4189, 31132, -77440, -137004, -134688, -199183, -262503, -273950, -168645, -190079, 58950, 145348, 41404, 8882, 40457, -60086, -58426, -63448, -141621, -224696, -273071, -382751, -284823, -102757, 33044, 46012, -33101, 59617, 179036, 154478, -11109, -9264, 15337, 16591, 117697, 136416, 116013, 130570, 281443, 157973, 48795, -85708, -3610, -52923, -61673, 1618, 92016, 105092, 175471, 148016, 127283, 90346, -14308, -104907, -1294, -66434, 37532, 345911, 127930, 64339, 82417, 58761, 93085, 159975, 289414, 138813, 50447, 2434, 115756, 140744, 105028, -69163, -73104, 155440, 156956, 108616, 131861, 196040, 306116, 287415, 272942, 178370, 18617, -111452]
9386a11452J82096J16644j54317o1040P6569M3580O236j5987O4853j44008J30284
9375A33458Q5368l1770m8679j20931N6594Q208J74369J80769j06144j82748j03693
9364D4801j41653P0029J63664j31845o9453K0605n5387N6943P738j38873N7316
9353a16115K795n6911J35245N042j15093k18778o3538J88698M1439J32070J80942
9342A15796J21935m5365j3036K1064J05535M0476o1075m7682k455j19495p3639
9331D2059j56387J57330J77026N2570M6943j05768j40071j66639n8356J07833
9321d3460J39555l9021j1017P3705k10391L3594J39124J4619R7992L8706j19075
9310A14331L1678j3579m3848m088O1644j20537P8941j10104k02798j0073J52776
$$ y = [-111452, 70644, 187288, 32971, -28069, 48500, 92080, 98316, 82329, 147182, 3174, 133458, 218826, 187056, 138377, 17446, 74040, 82248, 256617, 437386, 331242, 148494, 44801, -96852, -26823, 136841, 4996, -64457, -43852, -99239, -42296, -34558, -173431, -116115, -113320, -170231, -34986, -29944, -145037, -363815, -427353, -238655, -197216, -65146, 115796, 237731, 192366, 179330, 200394, 305929, 346405, 285330, 237648, 235193, 115698, 42059, -114328, 43002, 220028, 272598, 319541, 213773, 73702, -92937, -151293, -43460, 96095, 57074, 46057, 119762, -90629, -57035, 82089, 96708, 194700, 233406, 114331, 146009, 132430, 88582, 84494, 146138, 25601, 104542, -5562, -208360, -218433, -65657]
9299f5657J720j0894q4647P565J07873J00270P3994M4329j2953O5084M203n9757
9287A71130n4260q2434j13573j05156O8262j08743k01545m998n7629J52428J78663
9276a57855J60353M1449m2933j73720p6257R4080Q8671L5791j7126n3291J02796
9265A958j33158j31222J00427P1503j00996J06080l824l3733K6735P3151j34487
9254a57566N6189J2163p2939o2691J55885P0231k1626R2186Q2802n5113n4637
9243D4884q3280N878q5398n3798k3141N9668J33805N8987M0745j36146p2916K53615
9231A42903J30105k7384j12856p7582K7396K2625m7247L4834j3021M286m1476
9220D2583j09608J15449J94338J12984m4015j1699j46420O14J02125j38632k38816
$$ y = [-65657, -63937, -74831, -159478, -151913, -44040, 56230, 130224, 174553, 161600, 226684, 230887, 171130, 116870, 34436, -79137, -184293, -116031, -224774, -426319, -431317, -488946, -336518, -157855, 2498, 43947, 1014, -172706, -248963, -154883, -66212, -30421, -47547, -100838, 1958, -131200, -262422, -161995, -90492, -191488, -85408, -89232, -122965, -96230, -23079, -157566, -101377, -89214, -162153, -224844, -68959, 1272, -20354, 71832, 154634, 99521, 44884, -38396, -32518, -117916, -171714, -194855, -135187, -1382, 57605, 98350, -37796, -110712, 142903, 273008, 245624, 132768, 55186, 82582, 105207, 57960, 92794, 79773, 84059, 42583, -67025, 48424, 242762, 355746, 311731, 300032, 153612, 154226, 256351, 117719, -121097]
9209a21097k07217n7302J54731P4063K0657K91192K56098L9169j34894o3390j32079
9198A19931j0959l0632n4634J23169J74368j4099j57369j10680Q788l6160p6269
9187f4546m1148J16713Q7620O9804J73170j18191j43051j1104l3908K64072R8036
9176C97467j93816n0747j68566p9956N8483L7286j26016l2498o9790j42204L5156
9165c35201J36089R5536O4271R7257J036j57374j6406J01673n0674k0345J80149
9154I6011J23393O305o9675p1711o8157r0619l8286n2611N6179J36766J43212
9143A70807n3652N1105R8051J11724k0945j6893q6202j14930L2887J1132J49142
9132C32226p1776l9873r0997j37414J34387J97965j60133j53615k9717Q9912j072
$$ y = [-121097, -328314, -385616, -230885, -156822, -136165, 155027, 411125, 450294, 315400, 252010, 119931, 108972, 78340, 23706, 146875, 321243, 307144, 149775, 39095, 47883, 11723, -64546, -105694, 11019, 98639, 168443, 341613, 223422, 80371, 69267, 35359, 299431, 397467, 203651, 152904, -15662, -95618, -37135, 151, -125865, -158363, -228153, -370357, -335201, -199112, -103576, -39305, 57952, 58988, -98386, -114792, -13119, -63793, -84138, 96011, 219404, 225709, 156034, 84323, 16166, -74453, -112739, -165350, -109171, 27595, 170807, 117155, 168260, 266311, 378035, 357090, 340197, 253995, 139065, 171952, 183084, 332226, 260450, 220577, 129580, -7834, 126553, 324518, 164385, 10770, -18947, 70965, 69893]
9121F9893p3210k4808P9954j31679j68609J52322J77566Q2305K8798L5495l6740
9110A91287j6357j48415N9282O5845j9966J13881K4290j74523k54141K9204P7722
9099e1891M0119n3803q9393K8345q812l8523J3725k2206M3087J25989R4065p4902
9087E800k15851r833K20966M2963K6763N2359j29430J354K84672J64121L4934
9076D78818J08214q8684o1214J9059N1844q3167k53943l1203j55130l5252N8424
9065G766K2007j42504P7720J76886R4207J7522n5218M4032J80417n546j77701
9054B39588j25997l1687p3628q3918N9548J56693m2075j70607N28J08888K3903
9043F1236K2027r8283r6255L7872P3715Q350P84l441J11208n6039q8506o9890
$$ y = [69893, -3317, -28125, 51829, -79850, -248459, -96137, 81429, 163734, 192532, 228027, 191287, 174930, 26515, 85797, 151642, 131676, 245557, 269847, 95324, -158817, -129613, -51891, -11772, -65575, -154968, -126623, -135435, -173958, -160233, -182439, -139352, -13363, 80702, 5800, -210051, -219884, 1082, 44045, 70808, 123167, -6263, -4909, 279763, 443884, 478818, 587032, 498348, 437134, 456193, 508037, 424870, 170927, 139724, -15406, -50658, 7766, 29773, -112731, -35011, 141875, 236082, 253604, 198386, 242418, 422835, 417289, 239588, 113591, 81904, 8276, -75642, -16094, 140599, 98524, -72083, -71555, 37333, 61236, 83263, -15020, -111275, -73403, 312, 8662, 9446, 6005, 117213, 61174, -27332, -97222]
9031i7222J2679j79460l4558J02895l8124J47736Q5769j27135M5191J96677O3821
9020A78269k00310j27690l9484J22176Q6542n93m4649r6142o3209n4648O1613
9009a78125J65407p1433j95199k8154K71206K63222O8528j30003k57978l68453
8999d60982M854J00045j4986K43471K11426K7609J0815p7848o2731k7868K4313
8988b1882R9449Q7339m098J40132j22579j57605N0108O6706j14537n1412J61093
8977A32714j82878j05484L6969J8203p2475J10873O1357L928K53115Q9156j10809
8966B34669k26863N4114j25896J05202q204K8186l4179J8768j7290n8420r699
8955c9612J72899j5975p1410j05050j31871K08216J92350N5098M6427q4420j17023
$$ y = [-97222, -84543, -264003, -298561, -195666, -233790, -86054, -285, -127420, -82229, 114448, 178269, -22041, -149731, -189215, -67039, 19503, 18910, -25739, -121881, -185090, -239738, -178125, -12718, -84151, -279350, -307504, -36298, 226924, 295452, 165449, -92529, -460982, -456128, -356083, -371069, -127598, 83828, 111437, 122252, 44404, -18327, -46195, -21882, 77567, 164906, 160808, 300940, 178361, 20756, 70864, 137570, 23033, -28379, 132714, -50164, -155648, -118679, -100476, -172951, -62078, -721, 3207, 256322, 345478, 234669, 7806, 61920, -63976, 41226, 33022, 61208, 27029, 45797, 28507, -29913, -39612, 133287, 117312, 45902, -59148, -191019, 17197, 209547, 264645, 311072, 226652, 109629]
8944A09629K138J2518L103l2886q6467j2097J36715j1494j09958J4029P7224k9941
8932G2513J33064N2883l7208K08062j22812j04080K1401q86j37078J14492J257
8921B01608k0224o3264r3822R4968J16975J37725j35533j82223j14519l19684
8911c77993j0531J21920O1588J22654l1674J0095j09109p4843J28901K75092J02461
8900B18561j28265j09808Q8831J4462o5411j96795P6692K38566L295q5647l9309
8889A5172M0034j37171M0017O7994j39625j34728j11743J69522n1359J10064N5750
8878g6073J65581k5590m1824m2304O5563J96655q2276L3496m1253j59272M043
8867c254P7652P1256n5933j84062n2780J8359m601p8425K64502J73288Q4671j46824
$$ y = [109629, 111767, 124285, 127388, 94502, 8035, -4062, 132653, 121159, 11201, 25230, 102454, 72513, 205577, 258460, 221252, 429314, 306502, 202422, 223823, 222937, 85859, 200351, 201608, 181384, 118120, 24298, 119266, 236241, 373966, 238433, 56210, -58309, -377993, -388524, -266604, -205016, -82362, -114036, -103941, -213050, -287893, -158992, 116100, 218561, 90296, -19512, 69319, 83781, 18370, -178425, -101733, 136833, 140128, 54481, 15172, 55206, -81965, -41948, 26046, -113579, -248307, -360050, -190528, -241887, -131823, -76073, 89508, 63918, 22094, -20210, 45353, 242008, 159732, 193228, 151975, -7297, -3254, 74398, 145654, 89721, -94341, -147121, -128762, -133363, -211788, 52714, 226002, 310673, 163849]
8855A63849k8713j15346p8497n5237o1819Q088K1535K8206m9022J40433Q7230
8844F0707J50388L3347j39028j16794n5508j1461K4210r2002p3435K5111L3025
8833a61440N6884J10469K21879j651k66870m0030J95991J26231j62392o2722M3053
8822E9402j42974q8006J20612Q8439Q7066M4128l7877j27180N8196N6830m6414
8811G2222j13576o8958L00401R0830j81662j24608m63j55709Q9637o6964Q483
8800a50367M3193l659j07780o5071J66820K05230O6803k5690j74302j07436J82926
8789C0667K18553l4710J58408j17063j10076M3494J74548n306j04097o2567l6748
8778A55103J09266j40724q1097P0769J11654j30443K8979k6565m7307o3769j33656
$$ y = [163849, 135136, 19790, -58707, -113944, -175763, -167675, -146140, -117934, -166956, -26523, 60707, 211095, 244442, 105414, -11380, -66888, -78349, -54139, -146141, -219576, -194465, -161440, -104556, 5913, 227792, 226141, -40729, -80759, 115232, 241463, 79071, 16349, 59402, -83572, -171578, -50966, 37473, 124539, 168667, 130790, 3610, 61806, 118636, 72222, -41354, -110312, 190089, 280919, 99257, -25351, -25814, -181523, -91886, -158850, -150367, -107174, -110833, -218613, -283684, -116864, 88366, 155169, 129479, -44823, -152259, 30667, 249220, 214510, 372918, 255855, 145779, 189273, 363821, 358515, 254418, 191851, 155103, 264369, 123645, 42548, 113317, 224971, 94528, 123507, 96942, 49635, -14134, -147790]
8767a47790Q5811J06270o9195o1205j60808p6663J19752J20661o157n6966J05412
8756d0878J06251J7038j5903j70246r2863L0636j16539J74936J44663N8181q2250
8745A3026N6153P5002q3770j42356O4592k411k06766n8065M017N7651J35966J8849
8733f8112k1896J28926K30408J08912l05483j19840l1782O7883j8037J17301j9839
8722F8441j95187L9284L9991q0781O6481K4966J54561Q4625k0062j44386k02514
8711a64581L3782J28892R6796k3458q1063j17696Q6743m3984p1288J11273j14286
8700a58870j21093R2483J0001L9478K86677J39121J6170j35105j57073k4967J21280
8689A08102J02311j8612r8563J6279m0162L2118N3264J49314L1572m3145j30462
$$ y = [-147790, -61979, 44291, -24904, -86109, -246917, -323580, -203828, -83167, -89324, -146290, -40878, 65373, 82411, 66508, -103738, -196601, -165965, -282504, -107568, 37095, 95276, 13026, 69179, 144181, 60411, -81945, -17353, -19764, -226530, -284595, -280578, -222927, -86961, -68112, -90008, 38918, 269326, 378238, 72755, -47085, -78867, -10984, -29021, 88280, 68441, -126746, -87462, -47471, -128252, -61771, -36805, 117756, 202381, 182319, 37933, -164581, -130799, -1907, 94889, 71431, -9632, -127328, -40585, -84569, -155857, -44584, -158870, -279963, -187480, -177479, -138001, 148676, 287797, 303967, 168862, 11789, -13178, 108102, 210413, 191801, 93238, 109517, 69355, 101473, 154737, 304051, 335623, 292478, 162016]
8678A62016j69354j04391j6490k2922k5787J00174J10092m6770J2625j7727j6917
8667c5451K6687L2312l183K09665J97616j2347k80275k34687M1723o3015j65368
8656b86323M6007Q2113n5251j16529J4820J91414J12395r0697n4656P3847K0189
8645f2671O9458R7555q5929q18o4234J0317J80307l6092j40692N6954l7897J6979
8633C237Q1300j9501J4841J68448j54405j49309m0204L4650Q1235l723P8046N5014
8621A49629M2088N7132j30937O3490n5772p6481k547N4361J69657j55489m8377
8610F6754o135M8441p7337O6363M3107J11887N0621r8525m8888K2996l1393j10245
8598C7646j07068M1107j8307p4059L06J99395K2734j23121L7285J35431J11886
$$ y = [162016, -7338, -111729, -128219, -151141, -176928, -76754, 33338, -13432, -807, -18534, -35451, -8764, 23548, 20365, 230030, 427646, 415299, 135024, -99663, -57940, -120955, -286323, -240316, -158203, -213454, -329983, -315163, -123749, -11354, -102051, -156707, -82860, -62671, 6787, 104342, 18413, 17595, -46639, -36322, 143985, 107893, -32799, 24155, -13742, 3237, 84537, 65036, 79877, 248325, 93920, -55389, -95593, -60943, 20292, 16569, 94615, 149629, 191717, 248849, 117912, 181402, 125630, 49149, 46602, 100963, 270620, 115131, 66754, 60619, 109060, 31723, 98086, 141193, 253080, 303701, 205176, 156288, 179284, 147891, 37646, -69422, -28315, -46622, -120681, -120375, 79020, 101754, -21367, 15918, 151349, 263235]
8587B63235j70364K4270Q0579Q5845j4746o28J681n3788r3863K77280K1082j28320
8575B92263Q557J02227j52723o9986k2349J36974L5165K8272J31436K2220q4636
8564D27420J63465k1551k42041k20067j66332J6888K83606R4286j84570j92331
8554d1227J95591p8945j25306J83387J63100l07674j56662K438M6692O298l3950
8543a46258J37787Q7329m0936m1489N6230J44788M2679j15459L8615K08976n0064
8532C22198j01525P5592N8710p4307j23420M5049M8742k08149q8731l0543K3024
8521e3360M7354j10733j08085P207l9291K6137n3953J01004J18300J54857Q9446
8510A78883J3633j51809M8164M1197O870j15746j26873l306K5805o4259j3062
$$ y = [263235, 92871, 117141, 197720, 283565, 268819, 268191, 269872, 216084, 122221, 399501, 420583, 292263, 300820, 403047, 250324, 180338, 157989, 294963, 330128, 358400, 489836, 512056, 427420, 590885, 569334, 327293, 107226, -59106, -42218, 241388, 335674, 151104, -41227, 154364, 75419, -49887, 133500, 296600, -11074, -167736, -165298, -118606, -112308, -146258, -8471, 78858, 37922, -3567, 52663, 197451, 240130, 124671, 163286, 372262, 322198, 220673, 296265, 354975, 280668, 157248, 202297, 251039, 42890, -45841, -76384, -53360, -6006, -116739, -224824, -217617, -256908, -230771, -284724, -183720, -65420, 89437, 178883, 192516, 40707, 88871, 130068, 136938, 21192, -105681, -108987, -83182, -147441, -160503]
8499a60503J63948m5305n4217R006K1713p746O4424n6445M8581j60253m275J58449
8487b2623k1448P8976k373k75518o4279R1505N3607J1242Q0163k3544J5634J84583
8475A05925L1436J2119j3132j07551R627j16708O786J13426J08919Q7245j9315
8464B18777R8534j3261k0639J09870j74197n8131j09083l4111L1174o3824N2705
8453C7814J62600J44347l3392k40936j65676J04048J35628J95332r5083L5224
8443B79906N4757J98348q6163j88508k5590L1910r6592m7834J7812K7142J971
8432A67159Q1966n1280M9088J23296j144j5364j73770j07520J2225M5201l5626
8421I4231O254J65390Q9886j5618q6284j65482p289r5019l1358L27736Q8318o9040
$$ y = [-160503, 3445, -41860, -96077, -87071, -65358, -73104, -8680, -65125, -16544, -176797, -181072, -22623, -44071, 34905, 32532, -242986, -307265, -215760, -162153, -150911, -70748, -94292, -78658, 105925, 137361, 149480, 136348, 28797, 38424, -78284, -71498, 41928, 150847, 238092, 218777, 317311, 304050, 283411, 393281, 219084, 160953, 51870, 17759, 48933, -14891, 37814, 200414, 344761, 311369, 70433, -95243, 8805, 144433, 339765, 244682, 279906, 334663, 533011, 446848, 258340, 232750, 264660, 168068, 120234, 138046, 165188, 167159, 249125, 197845, 246933, 370229, 369085, 353721, 179951, 72431, 84656, 129857, 94231, 100485, 265875, 355761, 340143, 253859, 88377, 81088, -13931, -45289, 282447, 370765, 301725]
8409C01725p9718o6004K9070q3046q5614k24395J55441J14362p9512J11747n5291
8398C8765j87928J48904R0744p9633M2125J57855J0436O0282j29590J16418P7904
8387C46282j91422o5085l9931j01680K2208O9943j8147l274j8265J2935K0447
8376C4011J32881l4366j20527r0019k7156J31194j08736o8747l2930J13491R9967
8365B9063j56102Q4216j29264Q3012j1749K149n8483m8871J8827J45272j34026
8354a75956q7562O4004J98791N6388K8953j4450j51196j15030J50505K21813P0350
8343B46610n9960j80275o1169J62306Q8267m7882k14593j42418J56559J29941
8333G7386K12136o0781J3094N5234M434j74134k01100l239k2558l1496J38655
$$ y = [301725, 222007, 156003, 185073, 102027, 16413, -207982, -52541, 61821, -17691, 94056, 38765, -149163, -259, 90485, 10852, 52977, 210832, 221268, 281550, 151960, 268378, 346282, 154860, 89775, 49844, -51836, -29628, 40315, 22168, 18894, 629, 13564, 34011, 166892, 132526, 11999, -78020, -105176, 26018, -82718, -151465, -184395, -70904, 29063, -127039, -42823, -172087, -89075, -100824, -98675, -157158, -206029, -187202, -41930, -175956, -263518, -199514, -723, 55665, 84618, 70168, -81028, -196058, -45553, 176260, 246610, 186650, 6375, -54794, 107512, 195779, 147897, -66696, -209114, -52555, 77386, 289522, 228741, 241835, 297069, 301503, 127369, -73731, -76970, -99528, -131024, 7631]
8322G631J4135O0764J09614k24207k0323K9702m3255O4899O8797M5148j60910
8311d8005r4722N7669J18095o5770m5619r6001J47065J88203L8784j46497M0891
8300I4093p3923j07380L27l0998L4498j73560p3274R5227J25721o4955N3409M8144
8288g2671j7089P1225K4086r9659j27121J19574L9444l207j35268J57249J67007
8277A23570o4004k6588k0245o2152j2460N9524o9494j08578N2238Q2875j22615
8266a67929j23339K10621J34844K08771n7093r9830Q8575j79058o0702K26220
8256A81080L0548l6502k6652N8425M379j30648r9148j39842J00161M3196K14827
8245A99824O0436j71174p417P0175Q5345M6891P8077m8093o4123o9608p3410m3910
$$ y = [7631, 21766, 82530, 192144, -32063, -52386, -22684, -65939, -1040, 67757, 112905, -48005, -142727, -85058, 33037, -32733, -78352, -174353, -27288, 160915, 199699, 53202, 94093, 20170, -87210, -86883, -117881, -83383, -256943, -330217, -234990, -109269, -174224, -120815, -72671, -89760, -18535, 5551, -94108, -221229, -101655, -62211, -65418, -200686, -43437, 123570, 59566, 32978, 12733, -49419, -61879, -2355, -71849, -180427, -128189, -45314, -167929, -291268, -80647, 54197, 262968, 205875, 106045, 194620, 15562, -45140, 181080, 211628, 175126, 148474, 206899, 211278, 80630, -18518, -158360, -58199, -15003, 199824, 260260, 89086, 81669, 151844, 237189, 284080, 362157, 314064, 249941, 180333, 106923, 63013]
8233F3013L1086Q9400j57396l2960O45j4530K6404Q1913j7472j07102J6192J25733
8221A04926r3854j19959m2197J07793q4863q163J08774J38298j63171O1874J16617
8210A26075k5580j10413j93322J05082J55769K9575K308P7302j74191j04013p3145
8199a84553j595n3504J55792J97784R4890O2947k20451q1777L6642j04614N029
8188i3410J00051m0502q5502J25327J40370K3397q6648k04134m0058o6385O2028
8177a65466J76301L2332k0968n2030j180J09743o0756j66357k4816P6130Q8504
8166h563J66579j13797n7404J9415J36125J09317N1628j59563j93805J4187K2847
8155a3034J66553j19004o5524J6590j1251l0134K1841k5913k9992k1540k3324
$$ y = [63013, 94099, 183499, 26103, -6857, -6212, -20742, 5662, 87575, 70103, -36999, -20807, 104926, 11072, -108887, -151084, -43291, -128154, -136317, -27543, 110755, -52416, 9458, 126075, 100495, -9918, -203240, -98158, 57611, 87186, 89494, 166796, -7395, -111408, -184553, -186148, -239652, -83860, 113924, 208814, 271761, 51310, -30467, 6175, -98439, -93410, 6641, -33861, -119363, 5964, 146334, 169731, 83083, -121051, -161109, -227494, -165466, 10835, 43167, 22199, -29831, -31011, 78732, 17976, -148381, -173197, -97067, -8563, 158016, 44219, -13185, 6230, 142355, 251672, 303300, 143737, -50068, -35881, -13034, 153519, 34515, -31009, -14419, -25670, -55804, -33963, -59876, -89868, -111408, -134732]
8144a34732P7943M9277J06623k1755Q5772M7595m9852o9910j25007m6075L043
8133g7078O2792k7181j53650J64983J01438j62914M7630J27161r2230q4433L6978
8122e6504N9907N7188m1700N6147N5777Q1914Q454k515j51878r1410Q0653J8380
8110G4413J14743o0924j36046j16823J53277J51379m840k23759j87941K3646O3620
8099a49255P6672N3667M2230j62876l8185J07080J50463j11580k69458R7770J92134
8088a1338L2467N4340j72877k06831n8358j7659j8840N7649K01630J68122K13102
8077B41407q305j2896k5609J1379N6731j30069q733k20911n4646Q594J8598k1697
8065a46157J294J14236o7250J24534P9471M0808k04402j71417K4857J72983m2133
$$ y = [-134732, -56789, -7512, 99111, 77356, 163128, 210723, 160871, 90961, -34046, -80121, -77078, -14286, -41467, -195117, -30134, 71304, -91610, -43980, 83181, -9049, -93482, -56504, 3403, 60591, 18891, 75038, 130815, 212729, 221183, 218668, 66790, -24620, 56033, 74413, 189156, 128232, -7814, -124637, 28640, 180019, 175179, -48580, -236521, -212875, -149255, -72583, -18916, 23314, -139562, -177747, -70667, 79796, -31784, -301242, -203472, -11338, 21129, 75469, -97408, -304239, -362597, -380256, -399096, -341447, -139817, 28305, 241407, 233102, 220206, 194597, 205976, 262707, 132638, 123905, -97006, -151652, -143058, -124460, -146157, -144863, -30627, -97877, 26657, 106128, 146936, -57466, -228883, -204026, -31043, -73176]
8054g3176N9732K11600m8498m4708n5225j8593o027R5882N505j66319j43603Q3093
8042a00337J60152J63631J39754N8754j9716j89667m4365L667n4038j02644J09043
8031A24234N8863j9069r7303J25685J33604r4014j31023q9889J09736Q882O1747
8020A91453q6891p0658j25713J40318J56049o5516r7080k70669M1265J24141k51980
8009c15281j60137L520Q9068J80823K78935L5673n9431j2115j11153J16461N3648
7998A00011j17567j47533j8752J155J13317J63551k788k47233o5848n1758J45683
7987a27762K8068J39069l3972j41170l9242j914R5647J39712K21270J01042k12010
7976A68738j35919r0513J16638J49730Q2043Q123N3472L3138k21770k33609J4605
$$ y = [-73176, -13444, 198156, 149658, 104950, 49725, 31132, 25105, 120987, 126492, -39827, -183430, -100337, 59815, 223446, 363200, 421954, 402238, 212571, 168206, 171873, 117835, 15191, 124234, 183097, 164028, 66725, 192410, 326014, 232000, 100977, 11088, 120824, 129706, 191453, 104562, 33904, -91809, 48509, 204558, 139042, 41962, -228707, -187442, -63301, -315281, -475418, -471898, -382830, -202007, 76928, 112601, 53170, 41055, -70098, 46363, 100011, -17556, -165089, -183841, -182686, -69369, 94182, 91394, -155839, -221687, -273445, -127762, -99694, 39375, 5403, -135767, -175009, -176923, -81276, 58436, 279706, 380748, 168738, 32819, -57694, 58944, 208674, 290717, 298840, 352312, 385450, 163680, -69929, -55324]
7965e5324O3068L1708L7191k09009M83N8221K9089k8482k6944J15056j70581P8720
7953g6804l591K13879K00698j43156k23191J2341k26549M0481Q232n1968j5501
7942b65129J46777J67737N8566O0290R2925j00056r393p5246j75241k793j100
7931a02663k5056r6005J0722J71007N1761q5780O8581L2174J92j17557r5361j08186
7919b96171J64909J36050L4788m1289p4413k735m7789K6363J08012m8524j49119
7908a89918j73541Q215K68178J81262P865m6160j13451j20890j26487l5820J36228
7897b04519J06635M2846K42154k7859j35980N586M6305k1783O5453O7810K7078
7886B13726p9149k2195Q2467l9581m6217k8013j11608M315J480Q1497o2431r7795
$$ y = [-55324, 7744, 39452, 76643, -132366, -131883, -73662, -44573, -73055, -99999, 15057, -155524, -76804, -80395, 133484, 334182, 191026, -32165, -19824, -246373, -205892, -197660, -249628, -265129, -118352, 49385, 107951, 168241, 261166, 161110, 151717, 76471, -98770, -101563, -102663, -127719, -223724, -213002, -41995, 9766, -76014, -7433, 24741, 24933, -92624, -187985, -296171, -131262, 4788, 39576, -1713, -76126, -78861, -126650, -100287, 7725, -40799, -189918, -363459, -355244, -87066, 94196, 102061, 55901, -57550, -178440, -304927, -340747, -204519, -97884, -55038, 187116, 159257, 23277, 28863, 75168, 53385, 118838, 186648, 213726, 134577, 112382, 194849, 155268, 109051, 81038, -30570, -26255, -24775, 56722, -5709, -103504]
7874a03504R9768r655K9356j05987p7897K0757j5121J87292j02154p8757N2853
7863a03049L8010K14550J68851L3989k53277j40476j62698j45616J01048J30096
7853a18572j41846J54009J08375P4732m0132J85297n114m3552j01913o0916K4496
7842C4864J68384p587l8449j21370j49198Q8779J13464O9390j21878j2000J24465
7831A48864j11547j1098o8978J05080O8773n5737j94061K3720N1017P6040j1708
7820B0365k2840j6320O2552K26242o3709j09053l3472o7421m9985K44621K1585
7809B12565n775m9604j63417N3045r6076k8279R1833M4332Q5157k41815k43597
7798c41631J29182P3610J01866j34233q9902K05035J18184j01746P5550q6147
$$ y = [-103504, -3736, -13391, 15965, -90022, -167919, -147162, -162283, 25009, -77145, -155902, -103049, -65039, 149511, 318362, 352351, 99074, -41402, -204100, -349716, -248668, -118572, -260418, -106409, 1966, 76698, 36566, 221863, 216749, 173197, 71284, 10368, 34864, 203248, 195661, 157212, 35842, -113356, -24577, 88887, 158277, 36399, 24399, 148864, 37317, 26219, -42759, 62321, 131094, 75357, -118704, -94984, -43967, 32073, 20365, -2475, -18795, 43757, 269999, 206290, 97237, 63765, -3656, -53641, 190980, 212565, 206790, 157186, -6231, 46814, -49262, -77541, 14292, 58624, 143781, -98034, -341631, -212449, -138839, -36973, -171206, -261108, -56073, 62111, -39635, 35915, -50232]
7788e0232j18994l3803Q7738J4699P9831J69924l1370j83247L1491J11841j28527
7777e0649m5878N7197K0659r4268p4353N3300N3461j80022N1880J28291L19530
7766B39148r3987l08839m8005P8832K33465j21044n113N7702j25756l3627J58710
7755C1486L1802n9491j74533m3491K02085J1458J9020j08116K4747Q5077p5740
7744e5696J1272k9237j0822K2034K6963J23427l1164r3259J1549j34078p9580
7733b38591L3092J54225Q2262j17837o1272m3155K6375J2881K41257J33067o0481
7722A61823N9963O5882J3984K1195j20464l8578j1803m5265K9057k5346k8668
7711H1780r973l0697J90428N5962j92279k8581l1310p9375M5205l9668m474m2275
$$ y = [-50232, -169226, -203029, -115291, -100592, -20761, 149163, 117793, -65454, -33963, 77878, -50649, -96527, -39330, -18671, -112939, -187292, -133992, -80531, -260553, -208673, -80382, 239148, 145161, -163678, -211683, -132851, 100614, -20430, -25543, 32159, -93597, -127224, 31486, 63288, 3797, -170736, -214227, -12142, -684, 18336, -89780, -65033, 20044, -55696, -44424, -73661, -84483, -62449, -35486, 87941, 56777, -36482, -24933, -159011, -238591, -205499, -51274, 30988, -86849, -148121, -191276, -164901, -152020, 89237, 222304, 161823, 221786, 287668, 301652, 322847, 202383, 163805, 152002, 106737, 135794, 110448, 81780, 71807, 41110, 231538, 287500, 95221, 66640, 35330, -44045, 1160, -38508, -42982, -85257]
7699h5257J10261j4513n3718J97150J34M965j3113p748R598j6232l5303R2029
7687A88253k52696l12723n0518J17915J52301p6408L8523m9332J71128K58761
7677A85204J08185q1452n3781p6810q0382M174K8345O9804j13595p0054k8312
7666a08674R5180Q8522M5053q7114k0369N4473q7662j93981O3939K3517q9692
7655b16808m0390L4483N6632J07789O8704r6295n8973N7733k497R5752K4256n0014
7643a9628l1533j69572P9795K34441J28253j85050j22982R6339J57663N707j17479
7632E5954j2032o7508j74156k1675P9419J46629n1523m7849q3480j68711R5937
7621b48995J17901J46697R1178L7941j29502r9166p5824P3001j2292q9683j69966
$$ y = [-85257, 25004, 10491, -43227, 153923, 154057, 159022, 145909, 138161, 147759, 131527, 96224, 188253, -64443, -377166, -427684, -309769, -157468, -233876, -195353, -244685, -73557, 185204, 293389, 211937, 158156, 81346, 964, 5138, 33483, 103287, -10308, -80362, -108674, -13494, 75028, 120081, 32967, 12598, 67071, -20591, -214572, -150633, -127116, -216808, -257198, -222715, -166083, -58294, 10410, -85885, -144858, -87125, -89622, 6130, 30386, -19628, -51161, -220733, -140938, 93503, 221756, 36706, -86276, 10063, 167726, 173433, 55954, 43922, -23586, -197742, -219417, -139998, 6631, -44892, -92741, -176221, -344932, -248995, -131094, 15603, 106781, 144722, 15220, -83946, -159770, -86769, -99061, -188744, -358710]
7610c58710J39231J60885L2465K3026L29444K1340j38557Q590R6994j72192l7032
7599A05484R8904n8552j17884R7954K7453j5615k30648J6592P6319P1599K6213
7588I7819K05066K6157r4133q4444o9991q0134J27514J37764P9737k12280j77134
7577d4059j30323J11119K13189J45231q6448r7553N2509p6069j47742r253Q7673
7566A8274p1159j78826P2318J69818O077k4300r3629J7631p3820P6382O2510k8977
7554d7701K2132J3188j69557k0941k5965j79606K3302N8931j66035J08682M55226
7543G1656J37513j52208O5601R3088l8580l45978L5546K47057K21068J0512r7649
7532B47626k11629j27000J86181M2033k12735j33J01558l0769o9019o9292l316
$$ y = [-358710, -219479, -58594, -26129, -3103, 326341, 347681, 209124, 217714, 314708, 142516, 105484, 204388, 145836, 27952, 125906, 153359, 137744, -92904, -76312, 7, 71606, 97819, 302885, 329042, 234909, 150465, 80474, 340, 127854, 265618, 345355, 133075, -44059, -174382, -63263, 149926, 295157, 208709, 111156, 163665, 87596, -60146, -69399, 18274, -52885, -231711, -159393, 10425, 16502, -7798, -101427, -83796, -157616, -81234, -18724, -47701, -25569, -12381, -181938, -202879, -228844, -408450, -385148, -326217, -492252, -383570, 71656, 209169, 56961, 122562, 215650, 177070, -168908, -133362, 113695, 334763, 345275, 247626, 35997, -91003, 95178, 137211, -75524, -75657, 25901, -4868, -73887, -143179, -146495]
7521a46495N6486P6854J74484J19910j86385j68528r7099J12784J13326q9088
7511c3751j61146R8781p7558j284Q7138J82015l5389K7783j51258j42807J12577
7500i4899J78020J15267p1190p4586J7934l0417N7519n3175k37425P2515K504
7489a17933o3675L8471O7139l3298p4365k9073J32512N4988M5813K8123q9119
7478d0417o3860J66980j065j9877k7773k0559P2675m6040L3034j01922j14394
7467a63218P5184J07426N0035R128M2278J7569j82093k16586n8194J65486M0513
7456a12472K31040M1445j56081L1600q3556O7848J34911Q9502k011j20976k8591
7445I2659l3483J71085N3272K2369j58814k19797J03865P8542p940q998R5056
$$ y = [-146495, -90009, -13155, 161329, 281239, 94854, -73674, -170773, -57989, 55337, -33751, -194897, -96116, -173674, -174958, -87820, 94195, 58806, 86589, -64669, -207476, -94899, 83121, 198388, 127198, 52612, 70546, 40129, 97648, 44473, -192952, -120437, -117933, -181608, -143137, -75998, -109296, -183661, -212734, -80222, -25234, 20579, 48702, -40417, -104277, 62703, 61638, 41761, 13988, -6571, 66104, 20064, 53098, -48824, -163218, -88034, 19392, 69427, 78555, 120833, 138402, -43691, -260277, -318471, -152985, -112472, 118568, 160013, 3932, 35532, -48024, 19824, 154735, 244237, 242226, 121250, 92659, 59176, 230261, 283533, 305902, 147088, -72709, 31156, 109698, 101758, 92760, 187816]
7434A87816J50905n0212j54960L4549j5365o3203k43526l5229J31060J16025r8721
7423d0861k2186Q3573K53902N3519j27638L866o1661P3887R4731Q6052j02772
7412B94412k54727j69310p9111J16762p590K2405K17999J44251K1738l1590q6961
7401A88278O4089l9113j34186n7553r8139M6698O7657l9144q5891k45228L2627
7390b99905J52477J73977K858p2656J51221O9506K7046j63746M0031L3229q7541
7379B6497L0398P1475M383K8150j50276o1569m4674O5846q7721M6492J24588K0034
7367G3623J0246j7416p5129o023J1650L4951N4661P4066l6597Q9702k0654J04970
7355B98050j18940j39357N5315j42764j9651P5620l3297n2020m3915Q4965p5424
$$ y = [187816, 338721, 288509, 133549, 168098, 152733, 89530, -153996, -189225, -58165, 57860, -40861, -63047, 20526, 274428, 327947, 200309, 204175, 142514, 216401, 311132, 397184, 294412, 39685, -129625, -208736, -91974, -99564, -77159, 140840, 285091, 306829, 275239, 188278, 252367, 213254, 79068, 21515, -76624, -29926, 37731, -1413, -87304, -332532, -299905, -147428, 26549, 29407, -43249, 107972, 177478, 204524, 40778, 80809, 114038, 26497, 56895, 128370, 132753, 160903, 10627, -50942, -95616, -29770, -117491, -70999, 53589, 73623, 83869, 66453, -8676, -14699, -3049, 31902, 86563, 160629, 124032, 213734, 193080, 298050, 179110, 39753, 95068, -47696, -67347, 8273, -25024, -77044, -120959, -35994, -111418]
7344a11418Q8642J67128M5622j91935j12505L2945j73146j24133K29392K19630
7334G0222K4625j5592j1353r6191j8682M8883L7984j64160l0774J88903J68656
7323B02521j68263O0328p4488j95627J29011O4950l089J25021P5732o4669r592
7312A41835j40486L6031J65000K6304m588r8238j94450K7629j8314o6923j7259
7301a43459M7107l8593J6300Q9119l3619N2508J8030J01048o4785l8158J0823
7290A6321n1715P4119L1745N825j2505Q9664J3614M1773q9642k06230l8742R5729
7278c0044L7431K23034m9835l44718j28404J74102j4958p292J26231J24582j0399
7267I9730L170p9663J4483m6494p0522J59504p3019k5018L9782j57503L035O4097
$$ y = [-111418, -22776, 144352, 189974, -1961, -114466, -81521, -254667, -378800, -149408, 70222, 94847, 79255, 67902, -28289, -46971, 1912, 39896, -124264, -155038, 33865, 202521, 34258, 94586, 20098, -175529, -46518, 18432, 15343, 140364, 216096, 151427, 141835, 1349, 37380, 202380, 228684, 224096, 125858, -68592, -40963, -59277, -126200, -143459, -96352, -134945, -118645, -29526, -63145, -10637, 7393, 108441, 43656, 5498, 16321, -35394, 38725, 70470, 76295, 63790, 153454, 167068, 208841, 119199, -87031, -125773, -30044, 7387, 230421, 180586, -164132, -292536, -118434, -133392, -140684, -14453, 110129, 99730, 102900, 23237, 37720, -8774, -79296, 80208, 7189, -17829, 21953, -135550, -132515, -68418]
7255f8418R9291q135N4617J09520K1376K5511l4949k02529j13523J22723l0527
7244b5043m763j9380j39089M418K2003j3946J08610N0191n240l3843R7352Q946
7232E0216j22157q9625p9361O2798M00l9099M9818M2968J11184J94460j01885
7221G9717j53626O7536p7095M8769l2867R73n4354p6995j54235j09566k3546l0705
7209e15994n0068J08669K28740M7774M6344L2204n336p9090p4754J98599J36715
7198G3803q6008j01815L367O7486J54050N0165N9108l3175k9122L1287l11297
7187a22151l29684o5976n2293L211L26697J6848m8515J23366L43518J01222r7317
7176A98926n6876O0241J85848m5171l2642k6276j01617k09912m1312k0146L0811
$$ y = [-68418, 30873, 22738, 77355, 186875, 208251, 233762, 198813, -3716, -117239, 5484, -25043, -29806, -49186, -188275, -183857, -161854, -175800, -67190, -16999, -22239, -56082, 41270, 50216, -71941, -161566, -240927, -178129, -177729, -216828, -167010, -124042, -12858, 181602, 79717, -73909, -6373, -83468, -34699, -67566, -66593, -120947, -197942, -352177, -461743, -485289, -515994, -566062, -457393, -228653, -180879, -134535, -102331, -107667, -186757, -261511, -62912, 73803, -12205, -114020, -110653, -43167, 110883, 161048, 220156, 186981, 157859, 189146, -122151, -451835, -517811, -570104, -566893, -240196, -223348, -271863, -148497, 195021, 296243, 198926, 142050, 202291, 388139, 342968, 310326, 284050, 182433, -27479, -68791, -88937, -58126]
7165e8126R31q9417k7642N4211n2376M8383J9373j24866m334k9799J512J3484
7153b48666K41763J87624O1547J19550L5296l4074j16872j36571o8744p4664N1441
7142A7630n0914k01412j17115K38539J47419k4370k7656o521n7625k616m0992
7131a25633L6899K0820l8056N2270R7217K26078J11641q8304r5353k16742m7356
7120f6519J69483O785j72194j32161N7605M8490q8771K0907J69808J57859k2303
7109A48989j02009o8317n9572P9774J25766n9645j60869P6473q2401o0637k3915
7098a86363J6376J00990J39650J5499q1417J21898J4786j29712j70060m2167j9977
7087b20497J3891m7159Q1591M4596K3902Q3178p4119p7906j48210J18733P910
$$ y = [-58126, -57195, -146612, -174254, -120043, -172419, -124036, -104663, -229529, -233863, -263662, -262150, -248666, -6903, 180721, 242268, 361818, 397114, 363040, 246168, 109597, 40853, -33811, 17630, -33284, -234696, -351811, -113272, 34147, 9777, -17879, -24400, -82025, -84641, -125633, -88734, -67914, -105970, -53700, 43517, 269595, 381236, 292932, 197579, -19163, -66519, 102964, 109749, -62445, -194606, -137001, -88511, -177282, -156375, 13433, 171292, 148989, 46980, -21337, -80909, -1135, 124631, 64986, -95883, -19410, -101811, -162448, -186363, -169987, -68997, 70653, 86152, 4735, 126633, 141419, 11707, -158353, -200520, -220497, -206606, -253765, -172174, -127578, -103676, -20498, -94617, -172523, -320733, -202000, -194090]
7076a94090O6176J13136p789L2973J1541m499j49648Q13j82524m6915J01039K54836
7064d951N7294p9169L0790m6857l8382n378l6911m2133J42432M3974m4365O4302
7052D0646K32342J8654l8858q5313j99042k97974j43125K04525J36222p3845M8189
7041a57579Q5376R5012J2285q1250N2411N4196n7004j37561K5326Q6918j4833
7030c6703m3779J17728J35352J5156j42267j04284k9239j12806R968J05372M179
7019h1323K07302O39n459O166j98566p2006l8877Q8656J07097j41442l0068M2327
7007a15554R0188K12317O979k9844o3064j2394j70715J33196k56419m9590J75119
6996g9781q3732L6579K08140J94170q4499k28941K7174J72637j78523J18517K9418
$$ y = [-194090, -127914, -14778, -22567, 10406, 21947, 17448, -132200, -131387, -313911, -360826, -259787, -4951, 52343, -26826, 3964, -42893, -81275, -86653, -123564, -165697, -23265, 20709, -23656, 40646, 272988, 291642, 252784, 167471, -31571, -329545, -472670, -268145, -131923, -205768, -157579, -72203, 22809, 35094, -46156, 6255, 60451, 3447, -134114, -108788, -21870, -36703, -80482, 37246, 172598, 187754, 45487, -58797, -88036, -200842, -190874, -85502, -81323, 125979, 126618, 121159, 127325, -71241, -143247, -182124, -93468, 13629, -127813, -157881, -115554, -25366, 186951, 193930, 164086, 101022, 88628, -82087, 51109, -205310, -254900, -79781, -163513, -126934, 81206, 275376, 190877, -38064, -10890, 161747, -16776, 101741, 131159]
6985A31159j27855l9690L6194j70006k5954O7137O0765J33862Q7787q4813j13248
6974d4662N5274N5082K8523r9648j1049K15872K240j63819o1954R0647L9356j08250
6962b388O528K6188J69743J38433l8140j24711k9586j5162n8558J7307n4638Q4453
6950A19469K9485j418j3839j84056m2854o0806J31110J24595J21360j8659k96411
6939i2024Q3220l8894r3258P8126J1743j77838O687R4931j8738p4075j74187p135
6927d01442K46150K81230J21260M1412q5977p5572l8849j5167j13397n5412k10456
6916c06220j35968Q4457K6698J42093O4688o6498J19759J4966j21134j27189P8768
6905b25580J07507J62222k098j32029N7564O7901k884l7742o6460p4333j5500
$$ y = [131159, 3304, -36386, -192, -170198, -196152, -129015, -68250, 65612, 153399, 68586, -44662, 10612, 65694, 94217, -5431, -16480, 199392, 201632, 37813, -24141, 66506, 105862, -2388, 4140, 30328, 200071, 338504, 300364, 175653, 146067, 130905, 72347, 89654, 35016, 119469, 148954, 147536, 133697, -50359, -93213, -154019, -22909, 101686, 223046, 204387, -92024, -8804, -47698, -140956, -62830, -51087, -228925, -222238, -127307, -146045, -220120, -394307, -401442, -155292, 125938, 247198, 288610, 202633, 127061, 88212, 73045, -40352, -95764, -306220, -442188, -357731, -331033, -188940, -124252, -190750, -70991, -56025, -177159, -304348, -225580, -118073, 44149, 42051, -89978, -32414, 35487, 32603, -5139, -71599, -145932, -161432]
6894a61432J37182J64034m0704q9348j70038L3306J04383J25002J0531j3028j07356
6883g468L511r8459O6613K0624L6099K15395j1118j41364r9518j19568J01197
6872c4056J86852O2690j02463j21109J31903L9652Q1613J24376j52777j29713
6862H6968k1677o3109j18050J41926J72818o6933j61195K4474l8667O0457K9695
6851D6707j45038K8509M3906Q9126J01247J69738q9870j54716N3713R1017j05827
6840A28512J3188r5819m6581M4298k6619J9244M9175N944J64010J28106k3323
6829C60135j05579J46458P6229j72430j66488j50200N001P0925n148j21278O993
6818e5382p7631K0324j0608j41095k1119K26838J48089q7443L6029K9551J87000
$$ y = [-161432, -24250, 139784, 99080, 9732, -160306, -127000, -22617, 102385, 112916, 99888, -7468, -3957, -102416, -35803, -15179, 20920, 236315, 225197, 83833, -15685, -135253, -34056, 152796, 215486, 113023, -8086, 123817, 163469, 245082, 369458, 216681, 86968, 65291, 2182, -115868, 26058, 198876, 131943, -29252, -4778, -43445, 17012, 46707, -98331, -69822, -25916, 63210, 164457, 334195, 244325, 89609, 143322, 234339, 128512, 141700, 45881, -700, 43598, 16979, 36223, 85398, 91342, 255352, 383458, 360135, 254556, 401014, 477243, 304813, 138325, -11875, -6874, 64051, 58903, -62375, -55382, -133013, -112689, -123297, -264392, -285511, -58673, 89416, 1973, 38002, 67553, 254553]
6807B54553m9071j34469m4656o2077j15391P3584M3649N16l0734P5058J02214
6796A13176J92445l01j27614J02523p9966j05128J11082K02335Q1371l77946k08127
6785i6150j56453m4332J14638P9125j0814j38741J8040J61830J57880n6362K9739
6774E8400m2265L0263J81785K5687p4150p0664J75707J47990O422p2082L9294
6763D06387j21769q4108q633Q5164j17573q0690m9167O822Q412J29172N308n2082
6751A27243J9465p6607m3013j25444M613J16927N9366J55098M2374r1819M8989
6740B37192l6575J13966N2332j17039k71291j08714Q6882R5553L9849o8656J1721
6729C5220j39193j62847k5225J64992L16328P6937m1095k34531j25072n1262m9533
$$ y = [254553, 205482, 71013, 26357, -35720, -151111, -77527, -33878, -33362, -64096, 10962, 113176, 305621, 305320, 177706, 280229, 200263, 95135, 206217, 408552, 489923, 111977, -96150, -252603, -296935, -182297, -103172, -113986, -252727, -234687, -72857, 85023, 28661, 58400, 16135, 46398, 228183, 253870, 179720, 109056, 284763, 432753, 439175, 367093, 406387, 284618, 200510, 191877, 277041, 159468, 78778, 29611, 36433, 44845, 174017, 179325, 127243, 146708, 70101, 27088, -98356, -93743, 23184, 82550, 237648, 280022, 188203, 237192, 200617, 314583, 366915, 249876, -21415, -130129, -43247, 52306, 92155, 23499, 35220, -103973, -266820, -292045, -127053, 189275, 266212, 225117, -9414, -134486, -185748, -235281]
6718b35281J11372J60994k9743p9910j7183p2328J18232J86868j06141j31628
6708i4748m390N6821J59858j02953j21240k0747P8206O7887J851K6080L5778N3572
6696A35975N0168M3282q5384j49365M698J63966J4909m805m0502j1959p12J61129
6684B81400j4553j51919J03847O5835K9256q7915j10709K9579r6239n8935J55464
6673A45111M2864n1410j46264J3817J5755j0382j8646m3228R4134p4751n3214
6662h6214j06628K8192n1714n7540P1451J93518m8721k31249L1249J77049J68601
6651H7994j1820O6600m3530k41995j12594J41675K03967L5333m8330j19121j07003
6640a48824r3602N8060J03832n8663n9003q968n3186q275K553J16298J54084Q4506
$$ y = [-235281, -123909, 37085, 7342, -72568, -89751, -162079, -43847, 143021, 36880, -94748, -99138, -42317, 117541, 14588, -106652, -127399, -49193, 18694, 20545, 46625, 82403, 135975, 186143, 229425, 144041, -5324, -626, 163340, 178249, 173444, 132942, 120983, 120271, 281400, 266847, 114928, 218775, 284610, 313866, 225951, 115242, 144821, 48582, -10353, 145111, 187975, 136565, -9699, 4118, 19873, 9491, -9155, -52383, 41751, -33000, -86214, -192842, -164650, -216364, -273904, -202453, -8935, -57656, -288905, -257656, -80607, 87994, 76174, 142774, 99244, -142751, -255345, -113670, 90297, 125630, 77300, -41821, -148824, -242426, -184366, -80534, -139197, -198200, -207168, -260354, -268629, -266076, -149778, 4306, 88812]
$$ [...]
##END NTUPLES=NMR SPECTRUM
##END=
