##TITLE=Analysis number 317257
Compound Code mo 07352
Project Code adrs
Chemist Name fudan
##JCAMPDX= 6.0         $$ Bruker NMR JCAMP-DX V2.0
##DATA TYPE= NMR SPECTRUM
##DATA CLASS= NTUPLES
##ORIGIN= Bruker BioSpin GmbH
##OWNER= nmr
$$ XWIN-NMR		Version 3.5
$$ Tue Feb 14 09:27:39 2006 GMT Standard Time (UT+0h)  MAYBRIDGE\nmr@NMR_250MHZ
##.OBSERVE FREQUENCY= 250.131544655141
##.OBSERVE NUCLEUS= ^1H
##.ACQUISITION MODE= SIMULTANEOUS (DQD)
##.ACQUISITION SCHEME= undefined
##.AVERAGES= 16
##.DIGITISER RES= 18
##SPECTROMETER/DATA SYSTEM= dpx250
##.PULSE SEQUENCE= zg30
##.SOLVENT NAME= DMSO
##.SHIFT REFERENCE= (INTERNAL, DMSO, 0, 16.522)
##AUDIT TRAIL= $$ (NUMBER, WHEN, WHO, WHERE, WHAT)
$$ ##TITLE= Audit trail, XWIN-NMR		Version 3.5
$$ ##JCAMPDX= 5.01
$$ ##ORIGIN= Bruker BioSpin GmbH
$$ ##OWNER= nmr
$$ C:\u/data/dgb/nmr/ADRS/15970/pdata/1/auditp.txt
$$ ##AUDIT TRAIL=  $$ (NUMBER, WHEN, WHO, WHERE, WHAT)
(   1,<2006-02-14 09:27:15.10 +000>,<MAYBRIDGE\nmr>,<NMR_250MHZ>,
      <created by zg, POWCHK disabled, PULCHK disabled
       configuration hash MD5:
       84 BC 41 DB A1 6E 1D 46 DA 25 12 A5 C1 ED C5 3A
       data hash MD5: 64K
       26 B7 B4 7C 2B 0D D8 4A 41 1C D8 24 D8 98 88 5F>)
(   2,<2006-02-14 09:27:28.60 +000>,<MAYBRIDGE\nmr>,<NMR_250MHZ>,
      <Start of raw data processing
       ef LB = 0.3 FT_mod = 6 PKNL = 1 SI = 32K 
       data hash MD5: 32K
       A1 03 7B 4C 06 A7 04 C0 DD 84 87 57 95 4F 89 71>)
(   3,<2006-02-14 09:27:30.50 +000>,<MAYBRIDGE\nmr>,<NMR_250MHZ>,
      <apk 
       data hash MD5: 32K
       7F 6D A2 B3 74 29 5B EC 1B A8 95 E4 09 6B 55 F3>)
(   4,<2006-02-14 09:27:31.39 +000>,<MAYBRIDGE\nmr>,<NMR_250MHZ>,
      <abs ABSG = 5 
       data hash MD5: 32K
       B1 CF ED FF 92 23 F3 36 41 15 AD 90 7D 26 11 B8>)
$$ ##END=
$$ 
$$ hash MD5
$$ 1A 76 BF FC 59 40 B2 6D 6A C1 A4 AA BE D9 6F C3
##$RELAX= 
##$RELAX= 
##$RELAX= 
##$RELAX= 
##$RELAX= 
##$RELAX= 
##$RELAX= 
$$ Bruker specific parameters
$$ --------------------------
##$DU= <C:\u>
##$EXPNO= 15970
##$NAME= <ADRS>
##$PROCNO= 1
##$TYPE= <nmr>
##$USER= <dgb>
##$AMP= (0..31)
100 100 100 100 100 100 100 100 100 100 100 100 100 100 100 100 100 100 
100 100 100 100 100 100 100 100 100 100 100 100 100 100 
##$AQSEQ= 0
##$AQ_mod= 3
##$AUNM= <au_zg>
##$AUTOPOS= <8 >
##$BF1= 250.13
##$BF2= 250.13
##$BF3= 250.13
##$BF4= 250.13
##$BF5= 500.13
##$BF6= 500.13
##$BF7= 500.13
##$BF8= 500.13
##$BYTORDA= 1
##$CFDGTYP= 0
##$CFRGTYP= 5
##$CHEMSTR= <none>
##$CNST= (0..31)
1 1 145 1 1 1 1 1 1 1 1 1 1 1 1 1 1 1 1 1 1 1 1 1 1 1 1 1 1 1 1 1 
##$CPDPRG= <>
##$CPDPRG1= <>
##$CPDPRG2= <>
##$CPDPRG3= <>
##$CPDPRG4= <mlev>
##$CPDPRG5= <mlev>
##$CPDPRG6= <mlev>
##$CPDPRG7= <mlev>
##$CPDPRG8= <mlev>
##$CPDPRGB= <>
##$CPDPRGT= <>
##$D= (0..31)
0 1 0 0 0 0 0 0 0 0.06 0 0 0 0 0 0 0.0002 0 0 0 0 0 0 0 0 0 0 0 0 0 0 
0 
##$DATE= 1139909233
##$DBL= (0..7)
120 120 120 120 120 120 120 120 
##$DBP= (0..7)
150 150 150 150 150 150 150 150 
##$DBP07= 0
##$DBPNAM0= <>
##$DBPNAM1= <>
##$DBPNAM2= <>
##$DBPNAM3= <>
$$ [...]
##$SUBNAM7= <"">
##$SUBNAM8= <"">
##$SUBNAM9= <"">
##$SW= 20.6930455092707
##$SWIBOX= (0..15)
0 0 3 0 0 0 0 0 0 0 0 0 0 0 0 0 
##$SW_h= 5175.983436853
##$TD= 65536
##$TD0= 1
##$TE= 294.16
##$TE2= 300
##$TE3= 300
##$TEG= 300
##$TL= (0..7)
0 120 120 120 120 120 120 120 
##$TP= (0..7)
150 150 150 150 150 150 150 150 
##$TP07= 0
##$TPNAME0= <>
##$TPNAME1= <>
##$TPNAME2= <>
##$TPNAME3= <>
##$TPNAME4= <>
##$TPNAME5= <>
##$TPNAME6= <>
##$TPNAME7= <>
##$TPOAL= (0..7)
0.5 0.5 0.5 0.5 0.5 0.5 0.5 0.5 
##$TPOFFS= (0..7)
0 0 0 0 0 0 0 0 
##$TUNHIN= 0
##$TUNHOUT= 0
##$TUNXOUT= 0
##$USERA1= <user>
##$USERA2= <user>
##$USERA3= <user>
##$USERA4= <user>
##$USERA5= <user>
##$V9= 5
##$VALIST= <valist>
##$VCLIST= <CCCCCCCCCCCCCCC>
##$VD= 0
##$VDLIST= <DDDDDDDDDDDDDDD>
##$VPLIST= <PPPPPPPPPPPPPPP>
##$VTLIST= <TTTTTTTTTTTTTTT>
##$WBST= 1024
##$WBSW= 4
##$XGAIN= (0..3)
0 0 0 0 
##$XL= 0
##$YL= 0
##$YMAX_a= 484393
##$YMIN_a= -427266
##$ZGOPTNS= <>
##$ZL1= 120
##$ZL2= 120
##$ZL3= 120
##$ZL4= 120
##$ABSF1= 16.522
##$ABSF2= -4.171173
##$ABSG= 5
##$ABSL= 3
##$ALPHA= 0
##$AQORDER= 0
##$ASSFAC= 0
##$ASSFACI= 0
##$ASSFACX= 0
##$ASSWID= 0
##$AUNMP= <proc_1d>
##$AZFE= 0.1
##$AZFW= 0.1
##$BCFW= 0
##$BC_mod= 0
##$BYTORDP= 0
##$COROFFS= 0
##$CY= 12.5
##$DATMOD= 1
##$DC= 0
##$DFILT= <>
##$DTYPP= 0
##$F1P= 14.0000005364418
##$F2P= -0.99999901652339
##$FCOR= 0.5
##$FTSIZE= 32768
##$FT_mod= 6
##$GAMMA= 0
##$GB= 0
##$INTBC= 1
##$INTSCL= 1
##$ISEN= 128
##$LB= 0.3
##$LEV0= 0
##$LPBIN= 0
##$MAXI= 10000
##$MC2= 0
##$MEAN= 0
##$ME_mod= 0
##$MI= 0
##$NCOEF= 0
##$NC_proc= -3
##$NLEV= 6
##$NOISF1= 0
##$NOISF2= 0
##$NSP= 0
##$NTH_PI= 0
##$NZP= 0
##$OFFSET= 16.522
##$PC= 1
##$PHC0= 88.53264
##$PHC1= 5.783753
##$PH_mod= 1
##$PKNL= yes
##$PPARMOD= 0
##$PSCAL= 4
##$PSIGN= 0
##$REVERSE= no
##$SF= 250.13
##$SI= 32768
##$SIGF1= 0
##$SIGF2= 0
##$SINO= 400
##$SIOLD= 32768
##$SREGLST= <1H.DMSO>
##$SSB= 0
##$STSI= 32768
##$STSR= 0
##$SW_p= 5175.98343685301
##$SYMM= 0
##$S_DEV= 0
##$TDeff= 65536
##$TDoff= 0
##$TI= <Analysis number 999999
Compound Code 99
Book Reference 9
Project Code 9>
##$TILT= no
##$TM1= 0
##$TM2= 0
##$TOPLEV= 0
##$USERP1= <user>
##$USERP2= <user>
##$USERP3= <user>
##$USERP4= <user>
##$USERP5= <user>
##$WDW= 1
##$XDIM= 32768
##$YMAX_p= 365607993
##$YMIN_p= -218582
$$ End of Bruker specific parameters
$$ ---------------------------------
##NTUPLES= NMR SPECTRUM
##VAR_NAME=  FREQUENCY,     SPECTRUM/REAL,   SPECTRUM/IMAG
##SYMBOL=    X,             R,               I
##VAR_TYPE=  INDEPENDENT,   DEPENDENT,       DEPENDENT
##VAR_FORM=  AFFN,          ASDF,            ASDF
##VAR_DIM=   32768,         32768,           32768
##UNITS=     HZ,            ARBITRARY UNITS, ARBITRARY UNITS
##FACTOR=    0.157963299565203, 1,           1
##FIRST=     4132.6476996994, 0,             0
##LAST=      -1043.33573715361, 0,           0
##MIN=       -1043.33573715361, -218582,     0
##MAX=       4132.6476996994, 365607993,     0
$$ Real data points
##PAGE= N=1
##DATA TABLE= (X++(R..R)), XYDATA
$$ [...]
$$ plain form
18676 1172219 1258867 1373654 1509535 1650310 1826739 2110045 2463526 2981029 3658878 4586716
18666 4586716 5900176 7797817 10469383 14121429 18643525 23287108 27142522 29996506
18658 29996506 31570382 31201816 28838839 25259473 21226181 17217401 13568556 10568973
18650 10568973 8327966 6735779 5584462 4759805 4143731 3683931 3314921 3007350 2737391
18641 2737391 2553694 2482524 2461888 2474049 2507809 2553317 2578107 2619323 2642271 2593782 2500894
18630 2500894 2420434 2393236 2416841 2457912 2553666 2722268 2958340 3251458 3630040 4172342
18620 4172342 4920092 6006126 7505609 9645805 12751015 17221812 23378639 30873393
18612 30873393 38378841 44613278 49190255 51579414 50686148 46560243 40549765 33883804
$$ packed form
18676A172219Q6648J14787J35881J40775J76429K83306L53481N17503O77849R27838
18666D586716J313460J897641K671566L652046M522096M643583L855414K853984
18658B9996506J573876l68566k362977l579366m033292m008780l648845k999583
18650A0568973k241007j592187j151317q24657o16074m59800l69010l07571k69959
18641B737391j83697p1170k0636J2161L3760M5508K4790M1216K2948m8489r2888
18630B500894q0460k7198K3605M1071R5754J68602K36072K93118L78582N42302
18620D172342P47750J086034J499483K140196L105210M470797O156827P494754
18612C0873393P505448O234437M576977K389159q93266m125905o010478o665961
$$ plain form
18604 33883804 27253649 21286425 16466967 12862496 10239024 8366198 6998227 5940872
18596 5940872 5132211 4529966 4051751 3659114 3369406 3138716 2977220 2855223 2775504 2744292
18586 2744292 2718916 2670146 2598145 2508390 2400822 2252626 2108869 1977646 1881148 1859101
18576 1859101 1888818 1957070 2048884 2180392 2346790 2628316 3073301 3673884 4544652 5834701
18566 5834701 7759546 10439320 13678201 16804146 19347555 21180703 22107824 21522365
18558 21522365 19546160 16879610 13979061 11152305 8698098 6760281 5272970 4188109
18550 4188109 3416522 2858905 2453965 2143256 1903247 1725411 1584374 1481465 1371209
18541 1371209 1290294 1210935 1134838 1109956 1078714 1042283 995810 943551 860410 793634 734636
$$ packed form
18604C3883804o630155n967224m819458l604471k623472j872826j367971j057355
18596E940872q08661o02245m78215l92637k89708k30690j61496j21997p9719l1212
18586B744292k5376m8770p2001q9755j07568j48196j43757j31223r6498k2047
18576A859101K9717O8252R1814J31508J66398K81526M44985O00583Q70768J290049
18566E834701J924845K679774L238881L125945K543409J833148R27121n85459
18558B1522365j976205k666550k900549k826756k454207j937817j487311j084861
18550D188109p71587n57617m04940l10709k40009j77836j41037j02909j10256
18541A371209q0915p9359p6097k4882l1242l6431m6473n2259q3141o6776n8998
$$ plain form
18530 734636 670722 609658 614145 615705 593082 548902 532375 489480 456455 419793 402608 375517
18518 375517 349000 332010 339201 354728 353364 361423 376709 387216 390096 405661 417816 385526
18506 385526 364344 359503 379811 397258 408717 404827 373139 368471 367652 358473 360897 367619 354856
18493 354856 357440 342274 311560 296469 310320 306311 309575 301279 310573 296624 294478 306660 304327
18480 304327 289844 265948 230426 212713 209741 199246 159223 134714 115586 111611 129705 153982
18468 153982 171009 167003 169529 180372 157800 136327 161931 181527 209960 238851 226677 211211
18456 211211 239384 224223 196631 173662 151037 153446 184286 215135 177150 149691 138530 137348
18444 137348 129026 122545 144683 166978 186414 168898 172184 173439 172873 193837 190714 172967 148509
$$ packed form
18530G34636o3914o1064M487J560k2623m4180j6527m2895l3025l6662j7185k7091
18518C75517k6517j6990P191J5527j364Q059J5286J0507K880J5565J2155l2290
18506C85526k1182m841K0308J7447J1459l890l1688m668q19r179K424O722j2763
18493C54856K584j5166l0714j5091J3851m009L264q296R294j3949k146J2182k333
18480C04327j4483k3896l5522j7713k972j0495m0023k4509j9128l975J8094K4277
18468A53982J7027m006K526J0843k2572k1473K5604J9596K8433K8891j2174j5466
18456B11211K8173j5161k7592k2969k2625K409L0840L0849l7985k7459j1161j182
18444A37348q322o481K2138K2295J9436j7516L286J255n66K0964l123j7747k4458
$$ plain form
18431 148509 169897 164695 160941 130496 84006 58857 61732 88063 76106 72781 58133 63931
18419 63931 41031 36431 8323 21276 61996 85651 64505 54473 79048 62534 57902 43942
18407 43942 44555 47065 44738 51530 67919 92971 110252 93084 93880 98671 96426 64774 56631 46559
18393 46559 48352 65525 51968 59044 75703 75757 86183 68311 55356 53451 57768 50975 51342 59353
18379 59353 42361 23804 19797 9104 41806 55302 48518 47929 51186 27270 2072 1605 29345
18366 29345 49736 47057 50924 36060 30352 38297 27999 31565 50812 54967 56364 57536 57175 40978
18352 40978 53034 73970 43908 25556 34020 48259 47468 41024 35325 38156 37720 35180 22009
18339 22009 22765 12270 23442 23265 17920 34972 27692 49994 63972 72438 61245 59620 78177
$$ packed form
18431A48509K1388n202l754l0445m6490k5149K875K6331j1957l325j4648N798
18419F3931k2900m600k8108J2953M0720K3655k1146j0032K4575j6514m632j3960
18407D3942O13K510k327O792J6389K5052J7281j7168P96M791k245l1652q143j0072
18393D6559J793J7173j3557P076J6659N4J0426j7872j2955j905M317o793L67Q011
18379E9353j6992j8557m007j0693L2702J3496o784n89L257k3916k5198m67K7740
18366B9345K0391k679L867j4864n708P945j0298L566J9247M155J397J172l61j6197
18352D0978J2056K0936l0062j8352Q464J4239p91o444n699K831m36k540j3171
18339B2009P56j0495J1172j77n345J7052p280K2302J3978Q466j1193j625J8557
$$ plain form
18326 78177 87898 71608 76240 31615 13320 -1780 -11763 -11662 11953 12449 39739 60407 38453
18313 38453 -878 9198 45346 41323 25156 42377 61495 60478 38952 47829 82355 106253
18301 106253 114171 91474 54372 56401 55499 52601 19458 12558 19642 17919 31166 27814 9713
18288 9713 6318 -1478 16422 19009 -1702 28124 69967 67617 70951 85260 78268 37804 26682
18275 26682 34771 27454 4255 14814 21026 35563 68470 76533 77634 47623 32310 34152 42428
18262 42428 41416 43005 57616 52150 71876 98500 84518 83029 90978 93794 73699 36804 23471
18249 23471 22793 -4510 -2044 -6212 24823 37063 43634 50795 49358 73313 87913 24417 -2125
18236 -2125 -6711 14027 16429 25115 21497 29088 38745 39162 34103 37908 23762 14485 19800 10687
$$ packed form
18326G8177R721j6290M632m4625j8295j5100r983J01K3615M96K7290K0668k1954
18313C8453l9331J0076L6148m023j6167J7221J9118j017k1526Q877L4526K3898
18301A06253P918k2697l7102K029r02k898l3143o900P084j723J3247l352j8101
18288I713l395p796J7900K587k0711K9826M1843k350L334J4309o992m0464j1122
18275B6682Q089p317k3199J0559O212J4537L2907Q063J101l0011j5313J842Q276
18262D2428j012J589J4611n466J9726K6624j3982j489P949K816k0095l6895j3333
18249B3471o78k7303K466m168L1035J2240O571P161j437K3955J4600o3496k6542
18236b125m586K0738K402Q686l618P591R657M17n059L805j4146r277N315r113
$$ plain form
18222 10687 14064 24326 50047 31780 41258 47371 66763 79791 30054 -4432 9758 35910
18210 35910 32994 12886 16807 30830 40710 62360 49226 28925 51140 46221 32163 24616 42669
18197 42669 62019 74738 64822 10922 -11010 -2879 36254 47083 38770 17498 37032 57123
18185 57123 58118 36453 25890 50199 68526 83546 95499 73892 19852 11654 52046 74887
18173 74887 45822 14272 -14221 743 32133 35338 -5268 -12236 -9548 -25530 -9236 -26030
18161 -26030 -42880 -63396 -43378 730 4678 -1623 -2634 1984 12033 447 22925 49382
18149 49382 64491 79296 64823 83462 78142 76722 76838 84411 115697 133281 126721 129211 120794
18136 120794 77750 47609 42657 62213 82840 98157 106012 86181 64068 16422 -12371 -12909
$$ packed form
18222A0687L377J0262K5721j8267R478O113J9392J3028m9737l4486J4190K6152
18210C5910k916k0108L921J4023R880K1650j3134k0301K2215m919j4058p547J8053
18197D2669J9350J2719r916n3900k1932Q131L9133J0829q313k1272J9534K0091
18185E7123R95k1665j0563K4309J8327J5020J1953k1607n4040q198M0392K2841
18173G4887k9065l1550k8493J4964L1390L205m0606o968K688j5982J6294j6794
18161b6030j6850k0516K0018M4108L948o301j011M618J0049j1586K2478K6457
18149D9382J5109J4805j4473J8639n320j420J16P573L1286J7584o560K490q417
18136A20794m3044l0141m952J9556K0627J5317P855j9831k2113m7646k8793n38
$$ plain form
18124 -12909 516 -579 22825 35333 40508 40857 38143 31205 20334 32680 59882 96866 102447
18111 102447 79048 56062 28388 10599 23646 16606 2647 -2865 22762 66655 99210 123086
18099 123086 113549 111818 106968 96691 118313 168054 209897 255273 268107 248014 222897 229778
18087 229778 218112 180498 156102 131205 112570 96578 51228 25078 30882 18518 14877 31917
18075 31917 37978 27041 24452 45555 61156 50231 64267 61568 45407 45638 -4566 -13140 5497
18062 5497 8399 27576 24547 25620 27291 20796 26858 -12787 -15771 25154 10259 27113 28022 23300
18048 23300 47672 86311 86927 88534 86672 67972 84232 106433 112417 113974 121780 112090 82595
18035 82595 32135 8924 -10632 32096 65008 53321 51393 41059 32763 43269 46937 43593
$$ packed form
18124a2909J3425j095K3404J2508N175L49k714o938j0871J2346K7202L6984N581
18111A02447k3399k2986k7674j7789J3047p040j3959n512K5627M3893L2555K3876
18099A23086r537j731m850j0277K1622M9741M1843M5376J2834k0093k5117O881
18087B29778j1666l7614k4396k4897j8635j5992m5350k6150N804j2364l641J7040
18075C1917O061j0937k589K1103J5601j0925J4036k699j6161K31n0204q574J8637
18062E497K902J9177l029J073J671o495O062l9645k984M0925j4895J6854R09m722
18048B3300K4372L8639O16J607j862j8700J6260K2201N984J557P806r690k9495
18035H2595n0460k3211j9556M2728L2912j1687j928j0334q296J0506L668l344
$$ plain form
18023 43593 81438 109433 79822 64005 66186 60452 53875 54396 54245 49309 62401 58455 50861 42183
18009 42183 53794 47401 49961 29240 4396 20227 37184 59720 67432 42004 31586 4963
17997 4963 9268 3499 15104 6423 -9730 -11933 -1880 -9867 -4251 12985 22578 49033 45652
17984 45652 25167 -6522 -9242 48380 93698 69973 17650 -16906 -34474 -5905 8984 -3660
17972 -3660 -29209 -11485 -7750 -1827 -26532 -40591 -35341 16602 42350 47678 47374 46281 47413
17959 47413 72771 88324 54877 32203 33735 28277 29591 18938 43151 54850 22554 -12370
17947 -12370 -46156 -55104 -48201 -40938 -25947 -3263 5784 5941 5755 24518 17928 17284 -11029 -28307
17933 -28307 -20595 -11316 -7089 13765 37785 13886 7830 13461 19187 8087 2784 19552 10127
$$ packed form
18023D3593L7845K7995k9611j5817K181n734o577N21j51m936J3092l946p594q678
18009D2183J1611o393K560k0721k4844J5831J6957K2536P712k5428j0418k6623
17997D963M305n769J1605q681j6153k203J0053p987N616J7236R593K6455l381
17984D5652k0485l1689k720N7622M5318k3725n2323l4556j7568K8569J4889j2644
17972c660k5549J7724L735N923k4705j4059N250N1943K5748N328l04j093J132
17959D7413K5358J5553l3447k2674J532n458J314j0653K4213J1699l2296l4924
17947a2370l3786q948O903P263J4991K2684R047J57j86J8763o590o44k8313j7278
17933b8307P712R279M227K0854K4020k3899o056N631N726j1100n303J6768r425
$$ plain form
17920 10127 13194 35324 36666 32072 61128 81856 57980 41295 23947 20329 -10113 5245
17908 5245 12594 7206 3642 -4827 -13027 -6520 5262 23981 18820 -3935 15683 27569 14180
17895 14180 40956 22079 -17535 -24040 -32586 -8600 34804 45996 22397 17500 15046 -33837
17883 -33837 -54048 -62555 -45476 -13538 -5704 -22551 -26373 -19850 21584 -1427 -57585 -64508 -45870
17870 -45870 -11147 28954 38076 42276 13851 34103 50666 38926 6425 -158 6459 31879
17858 31879 21617 -14550 14826 16688 11953 1078 -919 3244 13633 27575 13237 -28799
17846 -28799 -31674 -40019 -39433 -46937 -54876 -25835 21821 38333 -2958 -1707 2941 6736 13707 31429
17832 31429 14182 -10625 -13817 -8109 -21146 1215 16793 19983 31926 15515 28797 32217
$$ packed form
17920A0127L067K2130J342m594K9056K0728k3876j6685j7348l618l0442J5358
17908E245P349n388l564q469q200O507J1782J8719n161k2755J9618J1886j3389
17895A4180K6776j8877l9614o505q546K3986M3404J1192k3599m897k454m8883
17883c3837k0211q507J7079L1938P834j6847l822O523M1434k3011n6158o923J8638
17870d5870L4723M0101R122M200k8425K0252J6563j1740l2501o583O617K5420
17858C1879j0262l6167K9376J862m735j0875j997M163J0389J3942j4338m2036
17846b8799k875q345N86p504p939K9041M7656J6512m1291J251M648L795O971J7722
17832C1429j7247k4807l192N708j3037K2361J5578L190J1943j6411J3282L420
$$ plain form
17820 32217 47700 35244 14565 7418 8832 4695 -4938 2040 22864 16500 1437 -20890 -42217
17807 -42217 -21839 -20447 -26954 -20781 -33858 -41614 -15180 -12944 -61989 -47096 -35793 -42757 -23312
17794 -23312 -432 -6182 -1010 19316 12175 -22930 -49268 -68628 -35640 -8135 1837 11193 -9048
17781 -9048 -9492 -13141 -19706 -7490 12751 -9975 -25747 -18092 -26046 -20193 -33319 -49146 -59852
17768 -59852 -54196 -73875 -59333 -36046 -426 175 -35911 -44181 -9268 28999 50835 18208
17756 18208 6172 9041 21629 31638 18232 -241 18765 14080 28585 39336 -3483 -15393
17744 -15393 -9994 9373 47201 43145 43917 39574 -10166 -5887 -1035 13618 40823 29644 3007
17731 3007 -33305 -49578 -19994 4837 13290 37717 21669 -5309 -23852 -57342 -19546 33055
$$ packed form
17820C2217J5483j2456k0679p147J414m137r633O978K0824o364j5063k2327k1327
17807d2217K0378J392o507O173j3077p756K6434K236m9045J4893J1303o964J9445
17794b3312K2880n750N172K0326p141l5105k6338j9360L2988K7505R972R356k0241
17781i048m44l649o565J2216K0241k2726j5772P655p954N853j3126j5827j0706
17768e9852N656j9679J4542K3287L5620O01l6086q270L4913L8267K1836l2627
17756A8208j2036K869J2588J0009j3406j8473J9006m685J4505J0751m2819j1910
17744a5393N399J9367L7828m056P72m343m9740M279M852J4653K7205j1179k6637
17731C007l6312j6273K9584K4831Q453K4427j6048k6978j8543l3490L7796N2601
$$ plain form
17719 33055 22630 14500 22969 77134 71995 33462 -22986 -55339 -61436 -25943 -25377 -41443 -17420
17706 -17420 -5353 -13132 -42726 -60795 -76129 -80178 -32422 11780 17186 1036 11424 -2292
17694 -2292 -1801 22578 31063 32089 18239 -3911 19903 37914 -1844 5117 10488 24647 32443
17681 32443 19740 2327 -5625 -2391 1727 -55069 -74557 -51845 -40668 -6052 14233 21125
17669 21125 1138 -32711 -48429 -43554 -22280 -5459 8409 20073 12472 -6295 -34922 -25572
17657 -25572 -20857 9203 37172 22965 7636 16773 7240 16825 5382 6193 506 -19989 -14899
17644 -14899 -6297 -12637 -30726 -56904 -42956 -9235 26088 50595 34571 16854 12960 34753
17632 34753 11925 11652 11180 -949 5896 25125 46330 50145 42203 19808 40947 49850 42004
$$ packed form
17719C3055j0425q130Q469N4165n139l8533n6448l2353o097L5493N66j6066K4023
17706a7420J2067p779k9594j8069j5334m049M7756M4202N406j6150J0388j3716
17694b292M91K4379Q485J026j3850k2150K3814J8011l9758O961N371J4159P796
17681C2443j2703j7413p952L234M118n6796j9488K2712J1177L4616K0285O892
17669B1125j9987l3849j5718M875K1274J6821J3868J1664p601j8767k8627R350
17657b5572M715L0060K7969j4207j5329R137r533R585j1443Q11n687k0495N090
17644a4899Q602o340j8089k6178J3948L3721L5323K4507j6024j7717l894K1793
17632C4753k2828k73m72j2129O845J9229K1205L815p942k2395K1139Q903p846
$$ plain form
17619 42004 34877 17407 17938 5766 -4072 -12846 29149 40803 17889 26474 37975 40213 48067
17606 48067 15363 12953 10604 5162 -22749 -21449 -28704 -22054 -27847 -38580 -3957 25412 23134
17593 23134 9278 -45016 -37156 -2196 -1836 -26033 -40440 -31055 -33158 -25680 -33337 -21061 -23073
17580 -23073 -24038 -16251 -29660 -59780 -51052 -30943 -5769 17150 25692 -19493 -53285 -44661 -31550
17567 -31550 15489 30922 6064 7379 6086 22230 -7656 -34662 -46553 -42416 -2368 7330
17555 7330 1472 20038 17744 10827 8071 999 -2846 -13371 15431 19967 -1127 19714 37580
17542 37580 -2628 -17478 -16522 926 -2883 -11068 -19228 3354 37396 34647 39569 32397 2121
17529 2121 11045 14796 2415 -10613 -383 -3931 3505 47323 48812 37794 37439 37282 23948 12247
$$ packed form
17619D2004p127j7470N31j2172r838q774M1995J1654k2914Q585J1501K238P854
17606D8067l2704k410k349n442k7911J300p255O650n793j0733L4623K9369k278
17593B3134j3856n4294P860L4960L60k4197j4407R385k103P478p657J2276k012
17580b3073r65P787j3409l0120Q728K0109K5174K2919Q542m5185l3792Q624J3111
17567c1550M7039J5433k4858J315j293J6144k9886k7006j1891M137M0048R698
17555G330n858J8566k294o917k756p072l845j0525K8802M536k1094K0841J7866
17542C7580m0208j4850R56J7448l809q185q160K2582L4042k749M922p172l0276
17529B121Q924L751j2381j3028J0230l548P436M3818J489j1018l55j57j3334j1701
$$ plain form
17515 12247 20738 34771 29013 29461 12125 -8477 -12803 30366 21212 14821 45573 41699 20232
17502 20232 17926 -12691 -39033 -65783 -66599 -40604 -40298 -52294 -20141 10152 452 -20753 -14051
17489 -14051 -6488 -18539 -25959 -3044 -3717 1652 6601 45847 21170 17472 39988 23534 9694
17476 9694 -15964 231 -20006 -22471 8240 23145 12984 -2661 -32934 -54269 -15953 32322
17464 32322 57301 69529 27072 5751 -12312 -24019 -10843 10666 41076 26184 -3143 -9461
17452 -9461 1151 22378 -193 -24619 -47227 -32254 -40686 -57101 -34469 -2518 17012 10125
17440 10125 7969 15847 -3284 16487 8327 12262 17769 22757 32468 7805 -3606 4744 19147
17427 19147 27724 41326 38728 33545 -7151 -41654 -15922 -8709 -8349 -22992 -26078 1073 25173
$$ packed form
17515A2247Q491J4033n758M48j7336k0602m326M3169r154o391L0752l874k1467
17502B0232k306l0617k6342k6750q16K5995L06j1996L2153L0293r700k1205O702
17489a4051P563j2051p420K2915o73N369M949L9246k4677l698K2516j6454j3840
17476I694k5658J6195k0237k465L0711J4905j0161j5645l0273k1335L8316M8275
17464C2322K4979J2228m2457k1321j8063j1707J3176K1509L0410j4892k9327o318
17452i461J0612K1227k2571k4426k2608J4973q432j6415K2632L1951J9530o887
17440A0125k156P878j9131J9771q160L935N507M988R711k4663j1411Q350J4403
17427A9147Q577J3602k598n183m0696l4503K5732P213L60j4643l086K7151K4100
$$ plain form
17414 25173 31786 14957 -5370 -13176 -30023 -28104 -29069 -5993 -12256 -15170 11406 23975 23761
17401 23761 18426 16977 -5647 -28661 -12211 24330 26214 44368 58746 33311 -9520 -33866
17389 -33866 -42670 -26999 -11670 349 -86 4312 33734 44989 12055 -1393 -3106 6864 16591
17376 16591 -9302 -21237 -10784 -20249 -50509 -47679 -20696 21277 39884 14985 23251 22075
17364 22075 40683 57880 47337 45058 18830 12538 19734 2523 4682 588 -5694 8442 -3865
17351 -3865 -8304 1244 -3445 -884 22061 827 -6851 12802 29487 40080 66789 50969 62114
17338 62114 53215 1759 -13704 -6651 4299 34251 42069 17139 -9731 -19837 4122 22419
17326 22419 22052 30331 -13744 -46745 -37799 -24514 9671 52240 48242 21240 -9226 -14514 -12962
$$ packed form
17414B5173O613j6829k0327p806j6847J919r65K3076o263k914K6576J2569k14
17401B3761n335j449k2624k3014J6450L6541J884J8154J4378k5435m2831k4346
17389c3866q804J5671J5329J2019m35M398K9422J1255l2934j3448j713R970R727
17376A6591k5893j1935J0453r465l0260K830K6983M1973J8607k4899Q266j176
17364B2075J8608J7197j0543k279k6228o292P196j7211K159m094o282J4136j2307
17351c865m439R548m689K561K2945k1234p678J9653J6685J0593K6709j5820J1145
17338F2114q899n1456j5463P053J0950K9952P818k4930k6870j0106K3959J8297
17326B2419l67Q279m4075l3001Q946J3285L4185M2569l998k7002l0466n288J552
$$ plain form
17313 -12962 -32914 -20824 -33493 -41399 -7432 24733 3638 -40836 -57925 -37596 -22897 -5422
17301 -5422 -11383 -27506 -18543 -3127 -1556 -10960 -18061 -8894 -21489 -17863 3138 -3363 4218 28226
17287 28226 20386 25030 32720 28211 19644 13544 22782 -120 11258 3264 -26526 -35995 -36963 3077
17273 3077 8494 -9279 -15563 -2612 -12105 8096 -9322 -38246 -33564 -9886 -4244 -8341 -10876
17260 -10876 -6931 -13687 2923 8398 -15209 -14928 -592 8636 31853 32222 18998 52007 96140
17247 96140 56759 42452 2701 6337 17431 27102 30014 26796 24736 -1588 13270 35553 51510
17234 51510 37489 32058 27418 5966 27850 21214 33600 35828 13589 7472 25071 12280 3767
17221 3767 5440 18752 15007 2789 -9566 12841 24184 -2883 -16410 -20046 -26479 9583 33223
$$ packed form
17313a2962j9952J2090j2669p906L3967L2165k1095m4474j7089K0329J4699J7475
17301e422n961j6123Q963J5416J571r404p101R167j2595L626K1001o501P581K4008
17287B8226p840M644P690m509q567o100R238k2902J1378p994k9790r469r68M0040
17273C077N417j7773o284J2951r493K0201j7418k8924M682K3678N642m097k535
17260a0876L945o756J6610N475k3607K81J4336R228K3217L69j3224L3009M4133
17247I6140l9381j4307l9751L636J1094R671K912l218k060k6324J4858K2283J5957
17234E1510j4021n431m640k1452K1884o636J2386K228k2239o117J7599j2791q513
17221C767J673J3312l745j2218j2355K2407J1343k7067j3527l636o433L6062K3640
$$ plain form
17208 33223 69340 50022 21705 6232 25522 54563 20920 8203 34368 22617 15338 -14849
17196 -14849 -27668 -22085 -22490 -6218 -32580 -30051 -34933 -41534 -19881 -1417 -3589 -20256 -21530
17183 -21530 -14481 -5432 -2705 7784 -7645 1307 -6906 -14610 -14125 -39550 -24686 9725 54025
17170 54025 40351 -17281 -19858 -5931 -4572 -38429 -42536 -28435 -25680 -10295 -17964 -14354 -1391
17157 -1391 8081 16569 4722 40881 53824 26265 -19179 6481 28155 26613 24718 42204 29934
17144 29934 -15986 -37414 -58382 -52151 -39766 -15084 22613 25518 38163 4102 -29276 -36821
17132 -36821 -51704 -50032 -25133 22073 26956 11114 -7974 4244 3947 13908 -28773 -25701 -8228
17119 -8228 22535 23586 6689 -35399 -9314 16619 12572 15289 -14097 -35712 -19939 4253
$$ packed form
17208C3223L6117j9318k8317j5473J9290K9041l3643j2717K6165j1751p279l0187
17196a4849j2819N583m05J6272k6362K529m882o601K1653J8464k172j6667j274
17183b1530P049R049K727J0489j5429Q952q213p704M85k5425J4864L4411M4300
17170E4025j3674n7632k577J3927J359l3857m107J4101K755J5385p669L610J2963
17157a391R472Q488j1847L6159J2943k7559m5444K5660K1674j542j895J7486j2270
17144B9934m5920k1428k0968O231J2385K4682L7697K905J2645l4061l3378p545
17132c6821j4883J672K4899M7206M883j5842j9088J2218k97R961m2681L072J7473
17119h228L0763J051j6897m2088K6085K5933m047K717k9386k1615J5773K4192
$$ plain form
17107 4253 27386 19355 9865 4680 9064 3714 -3536 17882 16536 20939 15417 36935 44433 21087
17093 21087 -1304 -16700 -47349 -25722 1850 26396 54112 40408 19943 19154 43019 27635
17081 27635 1319 25289 35125 35203 19939 -3941 -27523 -35732 -20577 -17188 -17893 18406 52404
17068 52404 56904 63339 81577 57678 4715 -50948 -46336 -34370 -40079 -42690 -39489 -21796 10007
17055 10007 15152 26677 16006 9183 -5609 -2313 3465 22482 41393 45483 -4149 -36647 -14547
17042 -14547 -21783 -30953 -15555 16410 13674 8136 6609 -5941 9507 -2970 -27956 -29224 -15574
17029 -15574 9831 -11207 -29628 -35811 -18931 9264 -7907 -4400 -11161 -30967 -26180 15587
17017 15587 21895 24159 15878 29822 5388 -15858 -31823 -39455 -17102 -1176 10630 3595 1703
$$ packed form
17107D253K3133q031r490n185M384n350p250K1418j346M403n522K1518P498k3346
17093B1087k2391j5396l0649K1627K7572K4546K7716j3704k0465p89K3865j5384
17081B7635k6316K3970R836P8j5264k3880k3582q209J5155L389p05L6299L3998
17068E2404M500O435J8238k3899n2963n5663M612J1966n709k611L201J7693L1803
17055A0007N145J1525j0671o823j4792L296N778J9017J8911M090m9632l2498K2100
17042a4547p236r170J5398L1965k736n538j527j2550J5448j2477k4986j268J3650
17029a5574K5405k1038j8421o183J6880K8195j7171L507o761j9806M787M1767
17017A5587O308K264q281J3944k4434k1246j5965p632K2353J5926J1806p035j892
$$ plain form
17004 1703 -17483 -38123 199 17966 -26110 -40199 -20985 -16680 -12561 -17493 242 663 22119
16991 22119 29020 31053 16555 -1896 22161 30571 1510 -21277 6070 15995 3705 -561 15575
16978 15575 21354 21214 9825 -7905 -32852 -9445 11391 1565 -8992 -11755 9124 7380 5330
16965 5330 -2943 -9322 -17078 -5007 -13244 -7097 -6304 -17415 -35460 -8987 -27169 -87959 -72056
16952 -72056 -40221 -30106 -19653 -16136 -34410 -36231 -27859 -14110 -9442 -24316 -37414 -42835 -38377
16939 -38377 -13172 -27594 -22084 -17395 -21850 -30169 17753 28764 -8363 -7025 24707 34451 28078
16926 28078 24331 33711 22799 -1914 -30790 -34424 -18722 -6070 -7040 -2870 20660 30881 32921
16913 32921 8983 -29470 -34510 -29013 -39154 -79506 -81683 -38528 28372 8630 -31495 -49425
$$ packed form
17004A703j9186k0640L8322J7767m4076j4089J9214M305M119m932J7735M21K1456
16991B2119O901K033j4498j8451K4057Q410k9061k2787K7347R925j2290m266J6136
16978A5575N779j40j1389j7730k4947K3407K0836r826j0557k763K0879j744k050
16965E330q273o379p756J2071q237O147P93j1111j8045K6473j8182o0790J5903
16952g2056L1835J0115J0453L517j8274j821Q372J3749M668j4874j3098n421M458
16939c8377K5205j4422N510M689m455q319M7922J1011l7127J338L1732R744o373
16926B8078l747R380j0912k4713k8876l634J5702J2652r70M170K3530J0221K040
16913C2921k3938l8453n040N497j0141m0352k177M3155O6900j9742m0125j7930
$$ plain form
16901 -49425 -13213 17332 -105 -36336 -22450 -3802 -8820 3782 28705 24629 38046 33983
16889 33983 38674 29480 19929 9730 -29939 -36873 -32244 -16554 3159 20490 28076 32111 67084
16876 67084 63644 51218 10075 -14697 -13783 4284 17382 18398 5380 22288 12294 -5489 12624
16863 12624 238 -13531 -14889 -38489 -37680 -63839 -56707 -42296 -37163 -39352 -47913 -36353 2720
16850 2720 11907 7725 21348 13891 -2295 1000 25598 9470 -27285 -23562 4714 47071 32274
16837 32274 -6884 -39612 -38347 -13927 18071 -6436 -33049 -53939 -66695 -66812 -31640 -15361
16825 -15361 -11990 -10068 -38601 -66289 -55880 -20673 40379 40905 6177 12397 -128 -15016 -13168
16812 -13168 21923 5708 -22752 -52907 -39082 -27804 7437 24566 -7913 -27539 -18467 -358
$$ packed form
16901d9425L6212L0545j7437l6231J3886J8648n018J2602K4923m076J3417m063
16889C3983M691r194r551j0199l9669o934M629J5690J9713J7331P586M035L4973
16876F7084l440j2426m1143k4772R14J8067J3098J016j3018J6908r994j7783J8113
16863A2624j2386j3769j358k3600Q09k6159P132J4411N133k189q561J1560L9073
16850B720R187m182J3623p457j6186L295K4598j6128l6755L723K8276M2357j4797
16837C2274l9158l2728J265K4420L1998k4507k6613k0890j2756j17L5172J6279
16825a5361L371J922k8533k7688J0409L5207O1052N26l4728O220j2525j4888J848
16812a3168L5091j6215k8460l0155J3825J1278L5241J7129l2479j9626R072J8109
$$ plain form
16800 -358 -16511 -31270 -34873 -31576 -62269 -34082 -38723 -41525 -4021 22204 5247 2630 -2865
16787 -2865 -7450 -25233 -16736 -37617 -55822 -19622 23820 37704 15739 19229 22040 -35615 -27608
16774 -27608 -10774 -16059 -12310 1435 -3635 5796 8721 24282 43265 35553 -12935 -19683 -12975
16761 -12975 -6595 -29804 -68202 -69163 -38150 -39736 -47101 -56936 -29693 -25862 -37002 -33267 -17777
16748 -17777 36664 30808 27170 30793 39720 31828 23584 10687 10117 20125 -12128 -29822 -21325
16735 -21325 -9989 27297 67081 58304 37954 28251 3421 -6528 -20645 2764 8584 8081 12833
16722 12833 -10989 -4694 -12631 -25612 -18676 -17191 25325 23237 -11666 -54068 -47715 -37327 -37702
16709 -37702 -22118 -29461 -59145 -66964 -63801 -39767 -726 8042 8397 8438 2685 -18509 -43098 -39693
$$ packed form
16800c58j6153j4759l603L297l0693K8187m641k802L7504K6225j6957k617n495
16787b865m585j7783Q497k0881j8205L6200M3442J3884k1965L490K811n7655Q007
16774b7608J6834n285L749J3745n070R431K925J5561J8983p712m8488o748O708
16761a2975O380k3209l8398r61L1013j586p365r835K7243L831j1140L735J5490
16748a7777N4441n856l638L623Q927p892q244j2897n70J0008l2253j7694Q497
16735b1325J1336L7286L9784q777k0350r703k4830r949j4117K3409N820n03M752
16722A2833k3822O295p937j2981O936J485M2516k088l4903m2402O353J0388l75
16709c7702J5584p343k9684p819L163K4034L9041Q768L55M1n753k1194k4589L405
$$ plain form
16695 -39693 -42419 -51404 -22826 6866 -5658 -15695 -11841 -13371 -39296 -22229 -19617 -31534 -35647
16682 -35647 -60857 -66600 -20655 -35918 -39273 11679 37542 31771 3039 10855 21992 11709
16670 11709 -9570 35182 33242 23884 10754 19698 5557 -22065 -17812 13374 20571 899 28300
16657 28300 18580 35740 67488 62013 33453 56785 54554 20087 -10784 -14765 -26811 -3541
16645 -3541 12740 22512 33260 2978 -29 10725 21855 44121 61218 52491 35830 8247
16633 8247 -36233 -76767 -69694 -34517 -40607 -40489 -26835 -13686 -19922 -35813 -44650 -26284 -18822
16620 -18822 -10394 -17363 -35800 -29487 1551 5848 9054 -22021 -33069 6103 25554 12698 20524
16607 20524 32525 18998 2361 27513 31916 -12807 1152 9116 15556 39581 9973 -203
$$ packed form
16695c9693k726q985K8578K9692j2524j0037L854j530k5925J7067K612j1917m113
16682c5647k5210n743M5945j5263l355N0952K5863n771k8732P816J1137j0283
16670A1709k1279M4752j940r358j3130Q944j4141k7622M253L1186P197j9672K7401
16657B8300r720J7160L1748n475k8560K3332k231l4467l0871l981j2046K3270
16645c541J6281R772J0748l0282l007J0754J1130K2266J7097q727j6661k7583
16633H247m4480m0534P073L5177o090J18J3654J3149o236j5891q837J8366P462
16620a8822Q428o969j8437O313L1038M297L206l1075j1048L9172J9451j2856P826
16607B0524J2001j3527j6637K5152M403m4723J3959P964O440K4025k9608j0176
$$ plain form
16595 -203 -401 -14988 -16751 2271 -13258 -9276 -21308 -28102 -26233 -22013 -20355 -40706 -68674 -80762
16581 -80762 -89522 -88632 -65869 -20770 8958 438 -4711 -31690 -29609 -3470 19462 6805 4019
16568 4019 20084 17015 42593 19528 277 -13536 -23988 -1220 3951 -5537 -18477 -869
16556 -869 42880 61111 27724 -8749 -11593 8436 -4758 -12546 -11952 -8915 -25353 -29886 -10120
16543 -10120 -20404 8276 29852 3100 -1271 23503 8001 1304 28254 35581 52041 37472
16531 37472 -3595 -23643 -10716 706 12515 27272 3073 -16332 -1947 13387 12639 -13405
16519 -13405 -1744 18754 5676 -23866 -10551 10257 1719 -24726 -17772 -13757 -43479 -57573
16507 -57573 -58479 -66751 -65673 -13709 30945 34643 13580 10079 -29331 -28307 -18915 -625 -13401
$$ packed form
16595b03j98j4587j763J9022j5529L982j2032o794J869M220J658k0351k7968j2088
16581h0762q760Q90K2763M5099K9728q520n149k6979K081K6139K2932j2657k786
16568D019J6065l069K5578k3065j9251j3813j0452K2768N171r488j2940J7608
16556h69M3749J8231l3387l6473k844K0029j3194p788N94L037j6438m533J9766
16543a0120j0284K8680K1576k6752m371K4774j5502o697K6950P327J6460j4569
16531C7472m1067k0048J2927J1422J1809J4757k4199j9405J4385J5334p48k6044
16519a3405J1661K0498j3078k9542J3315K0808q538k6445O954M015k9722j4094
16507e7573r06q272J078N1964M4654L698k1063l501l9410J024R392J8290j2776
$$ plain form
16494 -13401 -11170 31082 30058 -1248 -12776 17379 28483 42698 49444 40649 -4733 -6193 48128
16481 48128 40898 25833 9962 -25859 -4226 -7332 -32880 -51370 -46950 -20827 15933 32884
16469 32884 46630 53940 40454 57570 49674 13173 -1488 1762 3459 27602 46827 44715 27500
16456 27500 28230 18578 8177 454 -29820 -28301 -10271 3286 10866 2650 7751 4176 -34279
16443 -34279 -28070 11871 37038 66815 62737 54040 19188 4263 -1191 -22225 36255 56888
16431 56888 75180 68265 32390 29027 37384 19750 -2627 -19114 15557 32560 40328 28223
16419 28223 -73 3198 -7772 -37124 -44221 -19257 20257 32077 -35641 -39266 -25082 -14186
16407 -14186 -10158 4744 1996 -11392 -25750 -25955 -16401 -14013 -10974 16386 46779 74391 53468
$$ packed form
16494a3401K231M2252j024l1306j1528L0155J1104J4215O746q795m5382j460N4321
16481D8128p230j5065j5871l5821K1633l106k5548j8490M420K6123L6760J6951
16469C2884J3746P310j3486J7116p896l6501j4661L250J697K4143J9225k112j7215
16456B7500P30r652j0401p723l0274J519J8030J3557P580q216N101l575l8455
16443c4279O209L9941K5167K9777m078q697l4852j4925n454k1034N8480K0633
16431E6888J8292o915l5875l363Q357j7634k2377j6487L4671J7003P768j2105
16419B8223k8296L271j0970k9352p097K4964L9514J1820o7718l625J4184J0896
16407a4186M028J4902k748j3388j4358k05R554K388L039K7360L0393K7612k0923
$$ plain form
16394 53468 14222 3631 18874 25929 22477 24765 10051 1794 -15961 -65945 -84670 -53409
16382 -53409 -60533 -64916 -20658 11224 -20823 -27610 8545 35027 48556 25807 4756 14760
16370 14760 6407 871 8793 -22241 -34176 -43788 -49553 -36394 -18253 16279 35184 25868 19214
16357 19214 38415 27197 -9788 -1620 5411 -25119 -30071 -10854 -18159 -407 -3806 -3991 -18494
16344 -18494 20564 53677 71055 50682 22525 46629 60197 79195 94546 78520 46717 40806
16332 40806 54447 44622 19064 8816 26570 16423 -4310 -6371 -3791 16376 15765 -21753 -54826
16319 -54826 -45661 -50309 -49763 -46497 -19259 31347 58641 56471 44130 18273 4330 11584 -30832
16306 -30832 -35049 -61478 -94831 -72301 -55298 -58219 -64717 -40092 -40353 -27693 -18660 -22672 -8037
$$ packed form
16394E3468l9246j0591J5243P055l452K288j4714q257j7755m9984j8725L1261
16382e3409p124m383M4258L1882l2047o787L6155K6482J3529k2749k1051J0004
16370A4760q353n536P922l1034j1935r612n765J3159J8141L4532J8905r316o654
16357A9214J9201j1218l6985Q168P031l0530m952J9217p305J7752l399j85j4503
16344a8494L9058L3113J7378k0373k8157K4104J3568J8998J5351j6026l1803n911
16332D0806J3641r825k5558j0248J7754j0147k0733k061K580K0167o11l7518l3073
16319e4826R165m648N46L266K7238N0606K7294k170j2341k5857j3943P254m2416
16306c0832m217k6429l3353K2530J7003k921o498K4625k61J2660R033m012J4635
$$ plain form
16293 -8037 -16212 -37667 -26951 11341 20298 8851 11642 30371 22361 9624 23123 21882 24697
16280 24697 4356 2458 -1543 -1929 -6607 -41577 -50853 -37504 -45170 -58069 -34639 -11538 -9180
16267 -9180 -327 -4469 -23998 -103 32637 55583 18627 -20592 -17999 -13943 8518 10162 28086
16254 28086 18350 14098 20728 5293 -22534 -26824 5854 10863 11728 -27004 -47961 -6992 19568
16241 19568 4931 -21986 -9164 -13999 -1189 30905 30207 31944 12769 22006 19159 8876 4106
16228 4106 3701 21759 21375 15543 -11348 -45330 -58992 -65651 -58917 -31697 -36305 -44112 -35935 -25173
16214 -25173 -3306 15074 -3014 -14952 -10621 -25134 -6409 1177 15989 25163 -4665 -19362
16202 -19362 -25609 -37566 -4224 7365 5926 -19432 -32597 -7059 6879 -5744 -13600 -22106
$$ packed form
16293h037q175k1455J0716L8292Q957j1447K791J8729q010j2737J3499j241K815
16280B4697k0341j898m001l86m678l4970r276J3349p666j2899K3430K3101K358
16267i180Q853m142j9529K3895L2740K2946l6956l9219K593M056K2461J644J7924
16254B8086r736m252O630j5435k7827m290L2678N009Q65l8732k0957M0969K6560
16241A9568j4637k6917J2822m835J2810L2094o98J737j9175R237k847j0283m770
16228D106m05J8058l84n832k6891l3982j3662o659O734K7220m608p807Q177J0762
16214b5173K1867J8380j8088j1938M331j4513J8725P586J4812R174k9828j4697
16202a9362o247j1957L3342J1589j439k5358j3165K5538J3938j2623p856q506
$$ plain form
16190 -22106 10632 28292 39351 23290 22302 39084 12231 13209 -3064 -14145 -43130 -33122
16178 -33122 -23393 -40736 -48250 -59513 -33458 -29585 -48217 -60482 -36292 -47328 -50338 -28776
16166 -28776 -33112 -22516 -16072 2530 -7 741 -2811 -2903 -7251 26032 33057 1348 -14825 -27812
16152 -27812 1275 17363 477 3530 -4823 -30021 -51165 -50158 -63132 -47223 -86 -4964
16140 -4964 -8445 -10119 -4878 -18368 -29549 1617 26485 33472 -2358 -14634 -24363 -49775 -34812
16127 -34812 -9302 13699 35058 11788 11908 26043 19124 21940 30800 19007 31645 2376 -26532
16114 -26532 -3081 16088 378 -19247 -20356 -8627 24434 63581 30457 6604 -1123 -17760
16102 -17760 -24216 -29636 -35201 9170 30944 -5836 -4392 15743 1065 -13888 14935 38928
$$ packed form
16190b2106L2738J7660J1059j6061r88J6782k6853R78j6273j1081k8985J0008
16178c3122R729j7343p514j1263K6055L873j8632j2265K4190j1036l010K1562
16166b8776m336J0596O444J8602k537P48l552r2m348L3283P025l1709j6173j2987
16152b7812K9087J6088j6886L053q353k5198k1144J007j2974J5909M7137m878
16140d964l481j674N241j3490j1181L1166K4868O987l5830j2276r729k5412J4963
16127c4812K5510K3001K1359k3270J20J4135o919K816Q860j1793J2638k9269k8908
16114b6532K3451J9169j5710j9625j109J1729L3061L9147l3124k3853p727j6637
16102a7760o456n420n565M4371K1774l6780J444K0135j4678j4953K8823K3993
$$ plain form
16090 38928 27998 14304 16223 11321 32317 45222 47343 52121 45109 36879 29656 5888 -25756
16077 -25756 -37869 -33575 -31771 -20145 -31742 -42237 -43860 -37570 -36611 -25250 -8599 -28062 -26316
16064 -26316 -28754 -17199 -13222 -26031 -61147 -64192 -71554 -70276 -64241 -32988 -20678 -15718 2241
16051 2241 12046 2508 -18821 -12200 5880 -4938 -7544 -7741 -23825 -44507 -58715 -72846 -60546
16038 -60546 -58486 -77056 -66849 -58110 -53222 -62497 -68692 -44402 -28986 -20901 -47673 -27012 -1859
16025 -1859 941 4020 -11200 -21172 -19833 6983 -5622 -7738 7129 26673 13933 24235 6681
16012 6681 -15990 -14199 5750 33297 17183 22281 38136 44117 20764 -8672 -26919 -26838 -41885
15999 -41885 -6720 28088 28859 15893 -10527 -9114 -3376 -805 13596 22715 36684 40300 49823
$$ packed form
16090C8928j0930j3694J919m902K0996J2905K121M778p012q230p223k3768l1644
16077b5756j2113M294J804J1626j1597j0495j623O290R59J1361J6651j9463J746
16064b6316k438J1555L977j2809l5116l045p362J278O035L1253J2310M960J7959
16051B241R805r538k1329O621J8080j0818k606j97j6084k0682j4208j4131J2300
16038f0546K060j8570J0207Q739M888r275o195K4290J5416Q085k6772K0661K5153
16025a859K800L079j5220r972J339K6816j2605k116J4867J9544j2740J0302j7554
16012F681k2671J791J9949K7547j6114N098J5855N981k3353k9436j8247Q1j5047
15999d1885L5165L4808P71j2966k6420J413N738K571J4401R119J3969L616R523
$$ plain form
15986 49823 19293 -17948 -22510 -9618 -15333 -34042 -67727 -58833 -58525 -43828 -49241 -43723 -26966
15973 -26966 -30301 -21264 -2201 -1599 -20104 -6848 -17869 -26100 4346 11974 -1625 -873 27273
15960 27273 26854 12202 3363 24459 26785 51851 82876 60729 46445 15476 1991 -10547
15948 -10547 -15355 -2155 1811 -5592 11636 37123 51848 58327 32451 4425 -15452 -46995
15936 -46995 -35170 516 -11374 5923 -27528 -30483 -19398 -16718 -1894 -206 -31914 -6045
15924 -6045 11195 -12334 -17370 -2358 21607 -9288 -29404 -33281 -19404 -10926 -44368 -49235 -50299
15911 -50299 -52875 -58127 -52078 -16428 -19500 -43236 -70207 -57210 -22002 -2369 -20643 -31723
15899 -31723 -20464 -24811 -32206 -7402 21610 11351 8837 10676 13836 34040 41226 23625 6803
$$ packed form
15986D9823l0530l7241m562J2892n715j8709l3685Q894L08J4697n413N518J6757
15973b6966l335R037J9063O02j8505J3256j1021q231L0446P628j3599P52K8146
15960B7273m19j4652q839K1096K326K5066L1025k2147j4284l0969j3485j2538
15948a0547m808J3200L966p403J7228K5487J4725O479k5876k8026j9877l1543
15936d6995J1825L5686j1890J7297l3451k955J1085K680J4824J688l1708K5869
15924f045J7240k3529n036J5012K3965l0895k0116l877J3877Q478l3442m867j064
15911e0299k576n252O049L5650l072k3736k6971J2997L5208J9633j8274j1080
15899c1723J1259m347p395K4804K9012j0259k514J839L160K0204P186j7601j6822
$$ plain form
15886 6803 -9565 -5594 -12701 -17696 4005 5452 -13624 -34583 -4184 7417 -14807 -32728 -20637
15873 -20637 -27098 -39499 -30450 -21466 -19555 -15770 -9409 -19179 -14729 -6077 -16960 -3753 12819
15860 12819 -19857 -41804 -40995 -56048 -61478 -34456 -52485 -64613 -33631 -18596 -1750 14565
15848 14565 14467 -17356 -59595 -79780 -58828 -9926 8456 11632 -5069 -14950 -28371 -24863 -10696
15835 -10696 -16526 -33119 -28803 -16512 11528 -1024 -14843 -6753 10731 47808 50300 17202
15823 17202 -12080 -10424 -5101 -18407 -24350 -6047 -4782 -23445 -36066 -35920 -32337 -37306 -25053
15810 -25053 33381 14083 -18598 -13685 -22052 -34711 3126 62658 57765 22250 -2216 8788
15798 8788 6249 2750 -14643 -4417 14390 30591 23785 -5485 8109 10592 -999 3 -2942
$$ packed form
15886F803j6368L971p107m995K1701J447j9076k0959L0399J1601k2224j7921J2091
15873b0637o461j2401R049Q984J911L785O361r770M450Q652j0883J3207J6572
15860A2819l2676k1947Q09j5053n430K7022j8029j2128L0982J5035J6846J6315
15848A4565r8l1823m2239k0185K0952M8902J8382L176j6701r881j3421L508J4167
15835a0696n830j6593M316J2291K8040j2552j3819Q090J7484L7077K492l3098
15823A7202k9282J656N323j3306n943J8303J265j8663j2621J46L583m969J2253
15810b5053N8434j9298l2681M913q367j2659L7837N9532m893l5515k4466J1004
15798H788k539l499j7393J0226J8807J6201o806k9270J3594K483j1591J002k945
$$ plain form
15785 -2942 -35 20775 26813 30741 33594 415 -9245 -7074 -52660 -22154 -261 22418 15971
15772 15971 -2666 -13302 -8731 976 -39 26002 14029 17100 -9617 -35677 -57057 -49930 -16280
15759 -16280 11428 6947 -5788 -38411 -22593 -4167 25906 30562 38206 4728 -42700 -33451
15747 -33451 -5016 1797 3610 -8870 -18011 -1216 -15036 -68895 -62441 -35811 662 21905
15735 21905 28743 16968 -7838 -26749 -16965 -22903 -7421 11936 501 20639 20308 -2731 -13943
15722 -13943 -61725 -59930 -39751 -32355 -35358 -3888 31604 47253 34689 7697 -4334 -22369
15710 -22369 -21369 -35847 -50101 -37472 856 -6846 -14946 -16092 -13586 14048 6499 -2949 -34616
15697 -34616 -77276 -59175 -29288 -29046 -34912 -26469 -45741 -53704 -5173 32362 17239 -34141 -56688
$$ packed form
15785b942K907K0810O038L928K853l3179r660K171m5586L0506K1893K2679o447
15772A5971j8637j0636M571R707j015K6041j1973L071k6717k6060k1380P127L3650
15759a6280K7708m481j2735l2623J5818J8426L0073M656P644l3478m7428R249
15747c3451K8435O813J813j2480r141J6795j3820n3859O454K6630L6473K1243
15735B1905O838j1775k4806j8911R784n938J5482J9357j1435K0138l31k3039j1212
15722a3943m7782J795K0179P396l003L1470L5492J5649j2564k6992j2031j8035
15710b2369J000j4478j4254J2629L8328p702q100j146K506K7634p549r448l1667
15697c4616m2660J8101K9887K42n866Q443j9272p963M8531L7535j5123n1380k2547
$$ plain form
15684 -56688 -48119 -34288 -27371 -53370 -63831 -49415 2381 19345 11443 -5143 -24526 -17740
15672 -17740 -36545 -59626 -52794 -13754 34132 26010 15998 2071 -2113 9360 9382 26098 23281
15659 23281 -14782 -14615 -18892 -29141 -12311 3305 5373 61510 63999 43306 -4706 -33631 -8681
15646 -8681 -12571 -507 19838 -6834 -29920 -5008 9907 1004 5674 -1885 24454 15806 -2959
15633 -2959 14857 30838 10894 -11327 -4566 25369 33486 49872 23112 22328 29452 27824 28601
15620 28601 26568 3648 -18050 -20305 -20890 -27651 -26848 -50541 -73780 -34987 -13701 -31439 -68134
15607 -68134 -91036 -79337 -54298 -32043 -13682 -20243 -32445 -13630 3236 -3278 -17377 -41797
15595 -41797 -42658 -9747 -27696 -26500 -27557 -21371 -15505 -769 -31317 -79810 -82772 -74787 -50364
$$ packed form
15684e6688Q569J3831O917k5999j0461J4416N1796J6964p902j6586j9383O786
15672a7740j8805k3081O832L9040M7886q122j0012j3927m184J1473K2J6716k817
15659B3281l8063J67m277j0249J6830J5616K068N6137K489k0693m8012k8925K4950
15646h681l890J2064K0345k6672k3086K4912J4915q903M670p559K6339q648j8765
15633b959J7816J5981j9944k2221O761K9935Q117J6386k6760p84P124j628P77
15620B8601k033k2920k1698k255n85o761Q03k3693k3239L8793K1286j7738l6695
15607f8134k2902J1699K5039K2255J8361o561j2202J8815J6866o514j4099k4420
15595d1797q61L2911j7949J196j057O186N866J4736l0548m8493k962P985K4423
$$ plain form
15582 -50364 -45073 -47056 -20768 -21511 -36417 -42419 -6743 28193 39148 36456 8236 6673 22173
15569 22173 -6182 -26396 -22444 -27051 5532 32418 20538 14409 4354 -30945 -28620 -29293 -57104
15556 -57104 -88594 -85719 -78872 -56930 -57173 -37713 -12978 -19936 -25772 -22502 -6714 -1899 -32955
15543 -32955 -48004 -3882 26998 -10657 -22007 -19908 -41356 -63079 -42991 -20022 -24754 -25579
15531 -25579 -30822 -31114 -37836 -44765 -64625 -54840 -29604 -20628 -16402 -38178 -77454 -54222 -48779
15518 -48779 -34437 -1556 8397 8005 11790 18421 2149 -3117 -7 2278 6505 6806 -18117 -26183
15504 -26183 -28160 -18134 -1035 -24181 -23200 -13298 -29379 -52020 -61782 -33326 -15167 14628 10741
15491 10741 13890 -4449 33 9580 10673 1155 20634 28505 11240 -18039 -5978 2167 -25182
$$ packed form
15582e0364N291j983K6288p43j4906o002L5676L4936J0955k692k8220j563J5500
15569B2173k8355k0214L952m607L2583K6886j1880o129j0055l5299K325o73k7811
15556e7104l1490K875O847K1942k43J9460K4735o958n836L270J5788M815l1056
15543c2955j5049M4122L0880l7655j1350K099k1448k1723K0088K2969m732q25
15531b5579n243k92o722o929j9860R785K5236Q976M226k1776l9276K3232N443
15518d8779J4342L2881R953l92L785O631j6272n266L110K285M227L01k4923q066
15504b6183j977J0026J7099k3146R81R902j6081k2641r762K8456J8159K9795l887
15491A0741L149j8339M482R547J093r518J9479P871j7265k9279J2061Q145k7349
$$ plain form
15478 -25182 -18592 454 -18608 -1478 21981 16017 12010 15466 -11985 -10414 -10232 3737 7771
15465 7771 36396 25130 16994 24070 18892 11982 26801 14554 -7863 -20360 9483 8723 -22710
15452 -22710 -31495 -23694 -39838 -45010 -40787 -29667 -26673 -36361 -37573 -21846 -37888 -60749 -40117
15439 -40117 6740 32467 35617 27613 27653 21585 5234 -24906 -59387 -63508 -54036 -18750 -16306
15426 -16306 1182 -8619 -31010 -22988 -23199 -36726 -54168 -58182 -45442 -31071 -43139 -77517 -54685
15413 -54685 -43204 -40079 -47133 -54867 3858 33555 23605 13252 5731 -2554 -14650 -7788 -3663
15400 -3663 1544 -11832 -6317 -7414 -12531 -1119 39607 14888 -12286 -37249 -39347 18743 35786
15387 35786 -10371 -19680 -31586 -28184 -21020 2481 8073 -1291 11757 -17274 -33431 -50232 -42005
$$ packed form
15478b5182O590J9046j9062J7130K3459n964m007L456k7451J571J82J3969M034
15465G771K8625j1266q136P076n178o910J4819j2247k2417j2497K9843p60l1433
15452b2710q785P801j6144n172M223J1120K994r688j212J5727j6042k2861K0632
15439d0117M6857K5727L150q004M0o068j6351l0140l4481m121R472L5286K444
15426a6306J7488r801k2391Q022k11j3527j7442m014J2740J4371j2068l4378K2832
15413e4685J1481L125p054p734N8725K9697r950j0353p521q285j2096O862M125
15400c663N207j3376N515j097n117J1412M0726k4719k7174k4963k098N8090J7043
15387C5786m6157r309j1906L402P164K3501N592r364J3048k9031j6157j6801Q227
$$ plain form
15374 -42005 -35609 -35884 -12575 5280 15417 4707 -8515 -362 -677 -8982 26415 43016 3334
15361 3334 26895 19977 -17157 9296 23098 35214 43921 62669 46131 44209 16855 -9563
15349 -9563 -23343 535 34039 38731 22406 40122 42871 20403 -15041 -17746 -36488 -35908 -17338
15336 -17338 -24501 -32374 -37325 -54446 -42463 -3625 -12697 -7653 -26717 -8042 9573 28753 31430
15323 31430 25931 -4756 -7177 824 8318 34634 28128 14431 8684 -1008 -13036 -10054 8273
15310 8273 -961 1929 -2290 -14704 -25000 -29561 -50850 -60160 -4232 25330 14952 -28419 -30739
15297 -30739 -18030 -31194 -21110 -19069 -45569 -68872 -46534 -29750 -27626 -28645 -42968 -58230
15285 -58230 -43147 -12012 17256 21400 17581 18099 -12265 -22326 2347 -6617 30067 20622 3575
$$ packed form
15374d2005O396k75K3309J7855J0137j0710j3222Q153l15q305L5397J6601l9682
15361C334K3561o918l7134K6453J3802J2116Q707J8748j6538j922k7354k6418
15349i563j3780K3878L3504M692j6325J7716K749k2468l5444k705j8742N80J8570
15336a7338p163p873m951j7121J1983L8838r072N044j9064J8675J7615J9180K677
15323C1430n499l0687k421Q001P494K6316o506j3697n747r692j2028K982J8327
15310H273r234K890m219j2414j0296m561k1289r310N5928K9562j0378m3371k320
15297c0739J2709j3164J0084K041k6500k3303K2338J6784K124j019j4323j5262
15285e8230J5083L1135K9268M144l819N18l0364j0061K4673q964L6684r445j7047
$$ plain form
15272 3575 1202 -10473 -21107 -25033 -19621 -44994 -55538 -73182 -74577 -45696 7658 -13482 -50430
15259 -50430 -57973 -10116 7415 -3520 -6557 -39973 -51255 -34326 3850 11673 34604 18745
15247 18745 -2217 3189 14757 24452 16518 -1014 -13320 -2663 835 -4341 23597 34342 16715
15234 16715 12429 -6857 -16633 -27919 -25450 -31406 -53931 4529 31258 21319 -13486 -32584 -56098
15221 -56098 -69329 -27658 22162 23727 7345 8667 32419 20577 13839 8943 21762 7525
15209 7525 -7843 -2653 294 42709 29624 8782 -22786 -24880 -46577 -39500 -37842 -34267 -45760
15196 -45760 -44279 -25780 19543 27884 41359 45793 39518 36470 31911 4756 -13050 -32864 -52873
15183 -52873 -66441 -37950 -22332 -8083 -21093 -27314 -161 18940 -5546 -45032 -36624 -48140
$$ packed form
15272C575k373j1675j0634l926N412k5373j0544j7644j395K8881N3354k1140l6948
15259e0430p543M7857J7531j0935l037l3416j1282J6929L8176P823K2931j5859
15247A8745k0962N406J1568R695p934j7532j2306J0657L498n176K7938J0745j7627
15234A6715m286j9286r776j1286K469n956k2525N8460K6729r939l4805j9098k3514
15221e6098j3231M1671M9820J565j6382J322K3752j1842o738m896J2819j4237
15209G525j5368N190K947M2415j3085k0842l1568k094k1697P077J658L575j1493
15196d5760J481J8499M5323Q341J3475M434o275l048m559k7155j7806j9814k0009
15183e2873j3568K8491J5618J4249j3010o221K7153J9101k4486l9486Q408j1516
$$ plain form
15171 -48140 -38596 -16717 -15127 -17902 -12315 5056 939 15986 10533 830 -17820 -17058 4990
15158 4990 -2404 -4749 -4486 -18790 -3154 -1876 -34095 -33169 -37771 -65064 -62899 -46714 -33507 -5359
15144 -5359 -12337 -30634 -40929 -39668 -18080 -40915 -59206 -49033 -35593 -28497 -18159 19676
15132 19676 23525 47223 60742 24041 -7925 -19596 -20052 -29475 -18274 -30191 -18302 -27618 -27900
15119 -27900 11197 21689 17262 26410 -12043 -36479 -6086 -6014 -42063 -56563 -41143 -60704 -44352
15106 -44352 -13771 10563 -8506 -68597 -60689 -37657 -41420 -33616 -28519 -29025 -22933 -24299 -18360
15093 -18360 -17509 -20183 -56663 -55087 -35909 -10081 -4198 -1753 -3755 2006 5999 -1250 19912 21712
15079 21712 21023 17306 29011 -6564 -33774 -53627 -38420 -9395 21014 37772 73261 63923
$$ packed form
15171d8140R544K1879J590k775N587J7371m117J5047n453r703j8650P62K2048
15158D990p394k345K63j4304J5636J278l2219R26m602k7293K165J6185J3207K8148
15144e359o978j8297j0295J261K1588k2835j8291J0173J3440P096J0338L7835
15132A9676L849K3698J3519l6701l1966j1671m56r423J1201j1917J1889r316k82
15119b7900L9097J0492m427R148l8453k4436L0393P2l6049j4500J5420j9561J6352
15106d4352L0581K4334j9069o0091P908K3032l763P804N097n06O092j366N939
15093a8360Q51k674l6480J576J9178K5828N883K445k002N761L993p249K1162J800
15079B1712o89l717J1705l5575k7210j9853J5207K9025L0409J6758L5489r338
$$ plain form
15067 63923 36612 -6223 16657 11925 26650 25904 2609 -8183 -26777 -38411 -71920 -62605
15055 -62605 -71995 -63844 -33620 -39242 -58367 -31122 -10538 -36449 -50741 -43249 -50328 -29532 -21789
15042 -21789 -58762 -68616 -51158 -37494 -47638 -40319 -39599 -55761 -57410 -44760 4851 22558 34662
15029 34662 18807 -15205 -39418 -41743 -48409 -48822 -9480 -15035 -31151 -30085 -15227 -35028 -31717
15016 -31717 -13727 -18516 -25788 -14026 4642 -25343 -20579 10433 4396 -22428 -31381 -23566 15238
15003 15238 4500 -10384 -816 169 8273 19575 -3792 2825 11718 12609 19829 18643 25600 6296
14989 6296 -40185 -44650 -33576 -13793 27409 47271 43657 44915 1806 -12244 -3011 -4140 -8059
14976 -8059 13154 -18626 -34009 -42516 -30243 -38675 -39506 -16707 -32856 -44767 -46478 -51734 -38434
$$ packed form
15067F3923k7311m2835K2880m732J4725p46k3295j0792j8594j1634l3509R315
15055f2605r390Q151L0224n622j9125K7245K0584k5911j4292P492p079K0796P743
15042b1789l6973r854J7458J3664j0144P319P20j6162j649J2650M9611J7707J2104
15029C4662j5855l4012k4213k325o666m13L9342n555j6116J066J4858j9801L311
15016c1717J7990m789p272J1762J8668k9985M764L1012o037k6824q953P815L8804
15003A5238j0738j4884R568R85Q104J1302k3367O617Q893Q91P220j186O957j9304
14989F296m6481m465J1074J9783M1202J9862l614J258m3109j4050R233j129l919
14976h059K1213l1780j5383q507J2273q432q31K2799j6149j1911j711n256J3300
$$ plain form
14963 -38434 -52496 -35735 -12444 13340 9121 7234 -39006 -68301 -36862 -3622 -9632 -28788
14951 -28788 -28240 -26343 -3810 -28721 -59176 -47568 -31548 -31775 -40718 -19343 -3692 24080 27638
14938 27638 20590 -7606 -13906 -30507 -34985 -28736 -20521 -8937 -33599 -12674 -5794 6930 7015
14925 7015 -1620 -24634 -20306 -6650 -20383 -44117 -30174 -45365 -20158 -18888 -3682 1232 -9393
14912 -9393 -12083 -10927 -7219 3441 12723 768 -11366 -8031 13599 -26389 -62036 -55703 -51971
14899 -51971 -44930 -42934 -38850 -51937 -57387 -40760 -36728 -4111 6628 7973 4473 37970 29314
14886 29314 -19581 -39076 -52944 -72451 -50983 -17772 5378 -3216 -13293 -5665 21823 37722
14874 37722 38378 9408 -3570 -24492 -44131 -51481 -50427 -49639 -55381 -61039 -25927 -16571 -1296
$$ packed form
14963c8434j4062J6761K3291K5784m219j887m6240k9295L1439L3240o010j9156
14951b8788N48J897K2533k4911l0455J1608J6020k27q943K1375J5651K7772L558
14938B7638p048k8196o300j6601m478O249Q215J1584k4662K0925O880J2724Q5
14925G015q635k3014M328J3656j3733k3734J3943j5191K5207J270J5206M914j0625
14912i393k690J156L708J0660R282j1955j2134L335K1630l9988l5647O333L732
14899e1971P041J996M084j3087n450J6627M032L2617J0739J345l500L3497q656
14886B9314m8895j9495j3868j9507K1468L3211K3150q594j0077P628K7488J5899
14874C7722O56k8970j2978k0922j9639p350J054P88n742n658L5112R356J5275
$$ plain form
14861 -1296 23521 4788 8157 -21006 -62066 -65847 -72608 -45492 -48485 -56550 -38262 -49345 -30712
14848 -30712 -35083 -15890 -22717 -34788 -28904 -9133 -18491 -4313 -23527 -30003 -30933 -25934 -35396
14835 -35396 -5014 -9677 -2844 -23273 -14127 12919 -10494 -52890 -84042 -86043 -65423 -41764
14823 -41764 10068 11290 1314 -2679 -16309 11330 40383 24542 16490 -2791 20513 61759
14811 61759 79009 75369 52436 16484 5510 735 15421 30128 6529 -27495 -46035 -42806
14799 -42806 -46064 -37624 -4246 5367 721 -23338 -23439 -10195 -14751 -31640 -63806 -78570 -60284
14786 -60284 -74030 -50318 -21991 -26483 -15938 1846 -7780 -37107 -59647 -41348 -23085 -38035
14774 -38035 316 10822 6850 -16804 -25900 -19025 -31778 -20412 -34442 -45410 -40399 -798
$$ packed form
14861a296K4817j8733L369k9163m1060l781o761K7116k993q065J8288j1083J8633
14848c0712m371J9193o827j2071N884J9771r358J4178j9214o476r30M999r462
14835c5396L0382m663O833k0429R146K7046k3413m2396l1152k001K0620K3659
14823d1764N1832J222r976l993j3630K7639K9053j5841q052j9281K3304M1246
14811F1759J7250l640k2933l5952j0974m775J4686J4707k3599l4024j8540L229
14799d2806l258Q440L3378R613m646k4059j01J3244m556j6889l2166j4764J8286
14786f0284j3746K3712K8327m492J0545J7784r626k9327k2540J8299J8263j4950
14774c8035L8351J0506l972k3654r096O875j2753J1366j4030j0968N011L9601
$$ plain form
14762 -798 8879 11 -3301 -25818 -49214 -48921 -40983 -19193 -1072 1427 -14195 -14850 11722 -165
14748 -165 -13606 7080 22578 -4335 -58490 -44467 -7419 1509 20068 14964 -826 -3651 8809
14735 8809 1267 -39459 -49335 -50016 -60408 -65402 -42883 -32210 -22030 -44995 -46564 -53959 -43602
14722 -43602 -4716 2483 -229 -7191 -9426 -30137 2925 -8035 -17533 -44885 -77100 -61866 -14939
14709 -14939 13201 10402 38717 33432 10364 17161 18259 -24219 -3159 22229 -4511 -14289 -8226
14696 -8226 5269 14418 -22396 -52793 -55705 -39081 -23032 -697 6448 12388 10516 3523 29245
14683 29245 38781 14605 35436 49536 35358 45282 37475 12024 -18461 -30587 -13431 -19548
14671 -19548 -45781 -17883 2636 -25503 -36799 -49542 -48549 -44013 -17980 -8846 15216 10956 5865
$$ packed form
14762g98R677q868l312k2517k3396K93P938K1790J8121K499j5622o55K6572j1887
14748a65j3441K0686J5498k6913n4155J4023L7048Q928J8559n104j5790k825J2460
14735H809p542m0726r876o81j0392m994K2519J0673J0180k2965j569p395J0357
14722d3602L8886P199k712o962k235k0711L3062j0960r498k7352l2215J5234M6927
14709a4939K8140k799K8315n285k3068O797J098m2478K1060K5388k6740r778O063
14696h226J3495R149l6814l0397k912J6624J6049K2335P145N940j872o993K5722
14683B9245R536k4176K0831J4100j4178R924p807k5451l0485j2126J7156o117
14671a9548k6233K7898K0519k8139j1296j2743R93M536K6033R134K4062m260n091
$$ plain form
14658 5865 -10485 -17373 -12263 7564 -36042 -49706 -39522 -18606 -45424 -43294 -23201 -9817
14646 -9817 -29986 -12685 -8225 9474 26450 7144 -22614 -3597 18837 -7644 -34348 -8358
14634 -8358 3157 -26597 -27107 572 17736 -13744 -33727 -26405 10241 31012 -7083 -16891 -27039
14621 -27039 -18390 -11286 -16240 -37072 -21403 -3479 22520 25207 24868 28593 37994 60024 22098
14608 22098 1678 4801 -16378 -20933 -15840 -11413 -14331 -29783 -41834 -53121 -38458 -25473 -29480
14595 -29480 -27066 -39019 -45659 -21499 -3335 -9731 -18629 -25886 -49915 -43001 -17695 -15073 23324
14582 23324 28220 2332 -2622 7820 -16469 -7129 1629 -9972 -28027 -14126 8148 2953 -3500
14569 -3500 -16038 -21636 -16356 -6796 -17533 -27816 -33132 -34668 -17568 -24365 -14336 -1000 -4154
$$ packed form
14658E865j6350o888N110J9827m3606j3664J0184K0916k6818K130K0093J3384
14646i817k0169J7301M460J7699J6976j9306k9758J9017K2434k6481k6704K5990
14634h358J1515k9754n10K7679J7164l1480j9983P322L6646K0771l8095r808j0148
14621b7039Q649P104m954k0832J5669J7924K5999K687l39L725R401K2030l7926
14608B2098k0420L123k1179m555N093M427k918j5452j2051j1287J4663J2985m007
14595b9480K414j1953o640K4160J8164o396q898p257k4029O914K5306K622L8397
14582B3324M896k5888m954J0442k4289R340Q758j1601j8055J3901K2274n195o453
14569c500j2538n598N280R560j0737j0283n316j536J7100o797J0029J3336l154
$$ plain form
14556 -4154 -25258 -14607 12759 -7417 -16454 10996 18487 28747 19830 3972 -9602 -4509 -17218
14543 -17218 -9193 -12981 -4926 -13143 -3455 -19890 -48785 -41273 -23291 -39732 -25685 -3580 -1019
14530 -1019 -1708 24117 16555 -5974 14440 18820 -42212 -72543 -59301 -29832 585 -23255 -37106
14517 -37106 -20345 20159 21484 19090 16830 11723 -16724 -12610 -8094 -15839 -8389 8158 66252
14504 66252 81873 65255 59291 54764 34180 21697 15486 -4040 -18630 -33399 -38826 685
14492 685 8271 9318 4739 -3165 -25096 -17435 -16788 -25124 -6671 -23457 -52099 -53677 -63119 -55204
14478 -55204 -13232 5403 -9463 -26760 -6849 20386 35035 25402 23284 32052 25722 17509 -7014
14465 -7014 -39497 -16164 -2860 -38564 -54215 -46481 -40683 -43049 -46797 -22724 -43120 -50320 -11430
$$ packed form
14556d154k1104J0651K7366k0176r037K7450P491J0260q917j5858j3574N093j2709
14543a7218Q025l788Q055q217R688j6435k8895P512J7982j6441J4047K2105K561
14530a019o89K5825p562k2529K0414M380o1032l0331J3242K9469L0417k3840j3851
14517c7106J6761M0504J325k394k260n107k8447M114M516p745P450J6547N8094
14504F6252J5621j6618n964m527k0584j2483o211j9526j4590j4769n427L9511
14492F85P586J047m579p904k1931P661O47q336J8453j6786k8642j578r442P915
14478e5204M1972J8635j4866j7297J9911K7235J4649r633k118Q768o330q213k4523
14465g014l2483K3333J3304l5704j5651P734N798k366l748K4073k0396p200L8890
$$ plain form
14452 -11430 27016 13774 25108 45908 27449 12317 24252 2180 4379 -16046 -4955 17007
14440 17007 9426 -14009 12454 10817 -18379 -41980 -84355 -89033 -62535 -33894 -22724 -36518
14428 -36518 -18290 4006 3963 -17966 -27344 -45781 -49236 -26516 -20984 -9000 -21401 -33283 -14020
14415 -14020 -24658 -16366 -23505 -33339 -22797 -16943 12855 8615 -20026 8798 32771 266 -37800
14402 -37800 -16429 -25374 -54645 -60886 -41320 -32543 -44296 -41686 -11421 776 1849 1171 -23854
14389 -23854 -43279 -28905 -13966 -36939 -50648 -55825 -32642 -14714 8969 28571 54541 52341
14377 52341 28705 10777 -5003 -9845 -3977 -11892 -60916 -71452 -36326 -3600 2898 17661
14365 17661 27810 16172 6835 37480 22442 -6493 20731 41952 67752 28913 -5677 -5393
$$ packed form
14452a1430L8446j3242J1334K0800j8459j5132J1935k2072K199k0425J1091K1962
14440A7007p581k3435K6463j637k9196k3601m2375m678K6498K8641J1170j3794
14428c6518J8228K2296m3k1929r378j8437l455K2720N532J1984j2401j1882J9263
14415a4020j0638Q292p139r834J0542N854K9798m240k8641K8824K3973l2505l8066
14402c7800K1371q945k9271o241J9566Q777j1753K610L0265J2197J073o78k5025
14389b3854j9425J4374J4939k2973j3709n177K3183J7928K3683J9602K5970k200
14377E2341k3636j7928j5780m842N868p915m9024j0536L5126L2726O498J4763
14365A7661J0149j1638r337L0645j5038k8935K7224K1221K5800l8839l4590K84
$$ plain form
14353 -5393 7935 26365 32647 11002 -11052 -18071 -14005 -3327 23905 29451 -7957 -44068 -39333
14340 -39333 -23403 -46138 -56227 -39387 -66671 -71477 -32224 -7709 13457 9217 33985 31772
14328 31772 -49 -13821 -2134 11150 -12384 -2396 -11498 -28659 -15442 10177 -5551 -5939
14316 -5939 19076 31177 50673 18214 -4112 -6519 -4708 -17698 -3931 3307 -12162 -40456
14304 -40456 -27914 24681 49593 57155 74670 49800 11471 15944 27104 2017 -29666 -67446
14292 -67446 -64189 -71641 -78188 -29713 -8965 -4516 14205 25128 7027 27089 20561 20745 -5204
14279 -5204 -6307 20370 36197 12562 -11310 8421 13725 30900 24871 3405 -32376 -49519
14267 -49519 -60236 -49580 -32607 -8286 -8039 -22473 -8376 7335 13247 -11161 -788 14466
$$ packed form
14353e393J3328J8430O282k1645k2054p019M066J0678K7232N546l7408l6111M735
14340c9333J5930k2735j0089J6840k7284m806L9253K4515K1166m240K4768k213
14328C1772l1821j3772J1687J3284k3534R988r102j7161J3217K5619j5728l88
14316e939K5015J2101J9496l2459k2326k407J811j2990J3767P238j5469k8294
14304d0456J2542N2595K4912P562J7515k4870l8329M473J1160k5087l1683l7780
14292f7446L257p452o547M8475K0748M449J8721J0923j8101K0062o528J84k5949
14279e204j103K6677J5827k3635k3872J9731N304J7175o029k1466l5781j7143
14267d9519j0717J0656J6973K4321K47j4434J4097J5711N912k4408J0373J5254
$$ plain form
14255 14466 11373 29384 31544 17071 -28258 -42730 -46351 -59183 -50761 -22498 -22071 -16549 -19520
14242 -19520 -29818 -31526 -51197 -52200 -55818 -61445 -68388 -70624 -65791 -59792 -41717 -11502 13275
14229 13275 -4154 13178 15730 -12484 -13840 -5140 1008 -1763 -18108 -12339 -21272 -24066 -19863
14216 -19863 744 -3686 -25603 -29589 -9488 -24046 -24725 -27485 -31279 -21811 -22162 -30446 -6528 -335
14202 -335 5598 10456 13690 15839 14436 11169 -36423 -26722 3321 -4312 -28966 -6597 20724 3881
14188 3881 -27158 -6684 -6661 -34086 -39035 -31936 -44083 -37426 -18890 -12972 -37724 -69857 -64275
14175 -64275 -51892 -57615 -36911 -13248 32150 43624 14323 4059 -21319 -19718 -4098 -8302
14163 -8302 -16041 -1217 -2375 -2935 -21810 -11690 5184 2057 -8165 -32671 -45297 -25518 -35419
$$ packed form
14255A4466l093J8011K160j4473m5329j4472l621j2832Q422K8263M27N522k971
14242a9520j0298j708j9671j003l618n627o943k236M833N999J8075L0215K4777
14229A3275j7429J7332K552k8214j356Q700O148k771j6345N769q933k794M203
14216a9863K0607m430k1917l986K0101j4558o79k760l794R468l51q284K3918O193
14202c35N933M858L234K149j403l267m7592R701L0043p633k4654K2369K7321j6843
14188C881l1039K0474K3k7425m949P099j2147O657J8536N918k4752l2133N582
14175f4275J2383n723K0704K3663M5398J1474k9301j0264k5378J601J5620m204
14163h302p739J4824j158n60j8875J0120J6874l127j0222k4506j2626J9779r901
$$ plain form
14150 -35419 -33513 -36972 -46705 -33403 -20870 -28577 -20522 -27190 -23838 -20777 4006 1580 -5903 6786
14136 6786 24380 34350 20263 17548 19220 -1493 -45118 -31779 -39630 -48563 -30296 -30428 -23869
14123 -23869 14268 34513 34750 26450 23991 28352 -3873 -3229 10291 23539 23212 -1652 -37884
14110 -37884 -37059 -9782 -28284 -5482 1778 -8186 -6867 -49621 -42285 -16922 -21435 -36633 -50264
14097 -50264 -62528 -54090 -54822 -36054 -3034 -34340 -34962 -8316 -7510 -27616 -52814 -50880 -30572
14084 -30572 -35998 -19286 -648 -24039 -69382 -74526 -57488 -21709 -4790 -20228 -43162 -25419
14072 -25419 7331 28199 27495 30594 42909 24889 26255 25247 9463 20309 31421 49322 33531
14059 33531 19915 10938 -16714 -7635 26899 7243 23268 30761 14376 -5021 -7438 -11546 -15866
$$ packed form
14150c5419J906l459r733J3302J2533p707Q055o668L352L061K4783k426p483J2689
14136F786J7594R970j4087k715J672k0713m3625J3339p851q933J8267j32O559
14123b3869L8137K0245K37q300k459M361l2225O44J3520J3248l27k4864l6232
14110c7884Q25K7277j8502K2802P260r964J319m2754P336K5363m513j5198j3631
14097e0264j2264Q438p32J8768L3020l1306o22K6646Q06k0106k5198J934K0308
14084c0572n426J6712J8638k3391m5343n144J7038L5779J6919j5438k2934J7743
14072b5419L2750K0868p04L099J2315j8020J366j008j5784J0846J1112J7901j5791
14059C3531j3616q977k7652R079L4534j9656J6025P493j6385j9397k417m108m320
$$ plain form
14046 -15866 -24138 -20445 -16584 -17367 -32225 -17703 -13439 -2590 13515 21166 17710 28301 17881
14033 17881 -8692 6202 28586 16444 8318 -9594 -8513 -22531 -800 30217 10813 -32582
14021 -32582 -27296 -8116 -18794 25470 28587 16820 18221 21650 17427 11831 24382 23810 -631
14008 -631 -11932 -4689 28906 29807 49142 39691 40531 31194 13044 -24424 -16676 11070 3892 -14661
13994 -14661 -14643 -22757 -24303 -11203 -26677 -38543 -24164 -3515 -14415 -30316 -20341 -50658 -29360
13981 -29360 12337 16572 3372 -17581 -21614 -42340 -66626 -34079 -9933 5956 6555 26809
13969 26809 32129 16695 7762 13491 24491 3827 -13404 -6679 -14393 7163 43701 36716 30700
13956 30700 17134 13973 16312 43182 70405 70129 45417 11881 -14760 -29190 -14179 -3749
$$ packed form
14046a5866q272L693L861p83j4858J4522M264J0849J6105P651l456J0591j0420
14033A7881k6573J4894K2384j2142q126j7912J081j4018K1731L1017j9404m3395
14021c2582N286J9180j0678M4264L117j1767J401L429m223n596J2551n72k4441
14008f31j1301P243L3595R01J9335r451Q40r337j8150l7468P748K7746p178j8553
13994a4661J8q114j546J3100j5474j1866J4379K0649j0900j5901R975l0317K1298
13981b9360M1697M235j3200k0953m033k0726k4286L2547K4146J5889N99K0254
13969B6809N320j5434q933N729J1000k0664j7231O725p714K1556L6538o985o016
13956C0700j3566l161K339K6870K7223k76k4712l3536k6641j4430J5011J0430
$$ plain form
13944 -3749 15662 29712 37522 32791 22206 20121 8012 -2048 -5152 -34490 -32042 13079 2778
13931 2778 1035 -20469 -18599 -4989 -4749 -12086 -28738 -17204 13660 -1399 -10149 3561 -8319
13918 -8319 -3868 4092 -20190 14140 37234 54395 74693 61008 32458 51456 49456 37651
13906 37651 35198 -5817 -4305 17595 36560 57353 52388 44237 32741 9530 -5552 -8889 15542
13893 15542 26237 38052 61184 31460 42394 37435 32315 9364 1618 21291 11535 28664
13881 28664 30463 22545 35804 24438 2149 9877 8379 -224 -16612 11470 6180 -11854 -5663
13868 -5663 7452 18895 -5539 -42950 -34325 -19680 -18303 -34572 6112 61201 72485 59980
13856 59980 21939 -4885 -10993 -26247 -29787 -43142 -52517 -46047 -47360 -34699 -19837 -9333 -7498
$$ packed form
13944c749J9411J4050P810m731j0585k085j2109j0060l104k9338K448M5121j0301
13931B778j743k1504J870J3610K40p337j6652J1534L0864j5059q750J3710j1880
13918h319M451P960k4282L4330K3094J7161K0298j3685k8550J8998k000j1805
13906C7651k453m1015J512K1900J8965K0793m965q151j1496k3211j5082l337K4431
13893A5542J0695J1815K3132k9724J0934m959n120k2951p746J9673r756J7129
13881B8664J799p918J3259j1366k2289P728j498q603j6388K8082n290j8034O191
13868e663J3115J1443k4434l7411Q625J4645J377j6269M0684N5089J1284j2505
13856E9980l8041k6824o108j5254l540j3355r375O470j313J2661J4862J0504J835
$$ plain form
13843 -7498 -17758 14119 36641 53002 39485 35399 60690 46289 24975 19590 44574 36430
13831 36430 10109 -31674 -39495 -2329 39278 67824 47587 14204 11030 7562 -7279 -44928
13819 -44928 -46487 1939 -6907 -11649 -13887 6303 3235 -1598 22531 -32332 -46995 -31289 -40793
13806 -40793 -22753 -27127 -34450 -9600 -35728 -27753 -20068 -16643 19286 22676 36873 33622 41497
13793 41497 56854 26132 -18631 -19682 -24431 -70783 -69709 -43990 -13109 -15412 -131 -15240
13781 -15240 -46398 -44564 -30386 -36166 -63411 -36748 -15053 -5665 -24252 -10930 -23126 -19997
13769 -19997 11095 11589 35572 -2833 -11261 7302 10060 22687 18721 5340 25533 53702 49348
13756 49348 26383 7795 367 -7484 -3210 14187 -14252 -25091 11723 14107 14956 -6672 14897
$$ packed form
13843g498j0260L1877K2522J6361j3517m086K5291j4401k1314n385K4984q144
13831C6430k6321m1783p821L7166M1607K8546k0237l3383l174l468j4841l7649
13819d4928j559M8426q846m742k238K0190l068m833K4129n4863j4663J5706r504
13806d0793J8040m374p323K4850k6128P975P685L425L5929L390J4197l251P875
13793D1497J5357l0722m4763j051m749m6352J074K5719L0881k303J5281j5109
13781a5240l1158J834J4178n780k7245K6663K1695R388j8587J3322j2196L129
13769a9997L1092M94K3983l8405q428J8563K758J2627l966j3381K0193K8169m354
13756D9348k2965j8588p428p851M274J7397k8439j0839L6814K384Q49k1628K1569
$$ plain form
13743 14897 27096 364 -27944 -17628 -43932 -38229 -33989 -43677 -23215 -4475 -12218 -21285 -24630
13730 -24630 -16417 -27412 -38248 -40484 -23833 -19001 -32888 -26831 6803 51726 36773 4924
13718 4924 -3899 -31418 -32226 -9129 2085 -4723 -1264 -31914 -31724 -6670 -1844 3636 -27247 -20428
13704 -20428 5858 42406 25309 -4890 -248 402 -2593 29233 37727 23728 4609 1032 -4998
13691 -4998 -5198 -13588 -11694 -6735 -36018 -73780 -65353 -52364 -27655 -297 9871 12355 8575
13678 8575 11177 4782 -28406 -50037 -42105 -29288 -10138 11151 22519 32159 35142 42853 36019
13665 36019 32697 47433 26139 -3381 7586 13541 27987 27309 12968 47381 52306 50611 30369
13652 30369 2075 -7083 6422 8617 1869 17924 33405 17416 23349 -12265 -1243 14503
$$ packed form
13743A4897J2199k6732k8308J0316k6304N703M240r688K0462J8740p743r067l345
13730b4630Q213j0995j0836k236J6651M832j3887O057L3634M4923j4953l1849
13718D924q823k7519q08K3097J1214o808L459l0650J90K5054M826N480l0883O819
13704b0428K6286L6548j7097l0199M642O50k995L1826Q494j3999j9119l577o030
13691d998k00q390J894M959k9283l7762Q427J2989K4709K7358J0168K484l780
13678H575K602o395l3188k1631P932J2817J9150K1289J1368R640K983P711o834
13665C6019l322J4736k1294k9520J0967N955J4446o78j4341L4413M925j695k0242
13652C0369k8294r158J3505K195o748J6055J5481j5989N933l5614J1022J5746
$$ plain form
13640 14503 -4616 -16288 -13504 -8232 9632 13782 -4937 -14035 3581 25088 23153 49859 59029
13627 59029 27262 36068 13255 4526 12919 33867 54183 33550 41577 49779 50959 41395 37755
13614 37755 41858 17894 -3789 8123 31347 24909 15733 35300 44222 63809 55307 -1305 -15572
13601 -15572 17798 40504 41721 39535 54222 68323 35483 18812 17783 30147 42664 41713 19085
13588 19085 -16581 -4980 19913 62510 86176 71603 53709 76081 74526 62971 33352 63242
13576 63242 76684 57119 75077 99322 117264 126326 107630 136924 190418 234526 278599 309311
13564 309311 325751 358070 398551 413725 460061 501715 504119 514714 500446 486864 458532 446896
13552 446896 441838 405662 326061 283575 278550 274202 255209 204536 184904 179630 152662 139577
$$ packed form
13640A4503j9119j1672K784N272J7864M150j8719r098J7616K1507j935K6706R170
13627E9029l1767Q806k2813q729Q393K0948K0316k0633Q027Q202J180r564l640
13614C7755M103k3964k1683J1912K3224o438r176J9567Q922J9587q502n6612j4267
13601a5572L3370K2706J217k186J4687J4101l2840j6671j029J2364J2517r51k2628
13588A9085l5666J1601K4893M2597K3666j4573j7894K2372j555j1555k9619K9890
13576F3242J3442j9565J7958K4245J7942R062j8696K9294N3494M4108M4073L0712
13564C09311J6440L2319M0481J5174M6336M1654K404J0595j4268j3582k8332j1636
13552D46896n058l6176p9601m2486n025m348j8993n0673j9632n274k6968j3085
$$ plain form
13540 139577 108875 108663 115785 115287 106559 94155 73183 47257 45446 42782 42875 35935 44884 62961
13526 62961 54173 57168 78102 90176 75870 54897 41747 36194 28398 13718 16132 37943 54467
13513 54467 46157 32101 37655 39645 39101 29999 41179 40054 46826 42444 34539 33003 38219 50409
13499 50409 39940 41742 33092 42518 58235 54836 24589 33606 45275 45361 12056 14887 54140
13486 54140 45311 30047 58984 52513 33601 21543 39471 25819 -3225 -6836 -10248 24182
13474 24182 50161 13674 28940 19220 -8524 -4485 39071 52705 34235 4688 24783 51194
13462 51194 90820 68834 59028 35522 22462 46966 82194 52911 46219 61160 51624 18393
13450 18393 13212 18680 41952 33583 46341 71796 62467 62666 65275 49569 58752 55357 56305 57633
$$ packed form
13540A39577l0702k12P122m98q728j2404k0972k5926j811k664R3o940Q949J8077
13526F2961q788K995K0934J2074j4306k0973j3150n553p796j4680K414K1811J6524
13513E4467q310j4056N554J990n44r102J1180j125O772m382p905j536N216J2190
13499E0409j0469J802q650R426J5717l399l0247R017J1669Q6l3305K831L9253
13486E4140q829j5264K8937o471j8912j2058J7928j3652k9044l611l412L4430
13474B4182K5979l6487J5266r720k7744M039M3556J3634j8470k9547K0095K6411
13462E1194L9626k1986r806k3506j3060K4504L5228k9283o692J4941r536l3231
13450A8393n181N468K3272q369J2758K5455r329J99K609j5706R183l395R48J328
$$ plain form
13436 57633 55245 72324 83889 48417 26769 22931 21631 25686 36289 51939 72406 69620 62726
13423 62726 72909 86592 92499 115066 109530 105620 90953 86934 74251 65518 60828 77762 80503
13410 80503 72667 77172 84715 91424 70002 74267 57583 51188 82416 100714 78773 49505 69981
13397 69981 60807 61914 54566 73845 71498 73376 67670 88433 108595 98277 72838 65385 98369
13384 98369 86087 62993 66032 80480 59866 85315 116343 104128 109509 113227 114071 100351 77202
13371 77202 89378 90539 69240 86024 110706 98606 135869 171934 167100 163838 145237 151608
13359 151608 163259 143667 109837 98246 100816 109259 114345 91242 98245 126705 138741 142129
13347 142129 114146 125224 154623 124594 90121 88353 109516 102052 68207 42568 53321 58723
$$ packed form
13436E7633k388J7079J1565l5472k1648l838j300M055J0603J5650K0467k786o894
13423F2726J0183J3683N907K2567n536l910j4667m019j2683q733m690J6934K741
13410H0503p836M505P543O709k1422M265j6684o395L1228J8298k1941k9268K0476
13397F9981r174J107p348J9279k347J878n706K0763K0162j0318k5439p453L2984
13384I8369j2282k3094L039J4448k0614K5449L1028j2215N381L718Q44j3720k3149
13371G7202J2176J161k1299J6784K4682j2100L7263L6065m834l262j8601O371
13359A51608J1651j9592l3830j1591K570Q443N086k3103P003K8460J2036L388
13347A42129k7983J1078K9399l0029l4473j768K1163p464l3845k5639J0753N402
$$ plain form
13335 58723 72608 98423 118786 68105 53179 64208 58060 57275 65617 72261 73848 106043 97284
13322 97284 69265 49884 67647 94146 115678 116027 107626 86573 120002 104411 91543 90857 83325
13309 83325 66208 85920 104375 101700 91778 102085 129940 138601 147221 165322 139956 129432
13297 129432 141027 157982 139795 140300 136125 111966 110453 140665 152260 159142 146854 165316
13285 165316 165359 138573 117683 112928 134056 142315 167530 137059 111128 107897 132856 159567 191396
13272 191396 175760 140331 137502 130949 157013 162226 160685 165917 158726 167249 161809 156441 139487
13259 139487 130209 130064 138302 160241 174619 172903 155446 201664 226336 265627 285130 286747 286233
13246 286233 267976 263487 232849 238180 234907 217420 216318 213108 211163 213132 228811 223915 240414
$$ packed form
13335E8723J3885K5815K0363n0681j4926J1029o148p85Q342O644J587L2195q759
13322I7284k8019j9381J7763K6499K1532L49q401k1053L3429j5591j2868o86p532
13309H3325j7117J9712J8455k675r922J0307K7855Q661Q620J8101k5366j0524
13297A29432J1595J6955j8187N05m175k4159j513L0212J1595O882j2288J8462
13285A65316M3k6786k0890m755K1128Q259K5215l0471k5931l231K4959K6711L1829
13272A91396j5636l5429k829o553K6064N213j541N232p191Q523n440n368j6954
13259A39487r278j45Q238K1939J4378j716j7457M6218K4672L9291J9503J617n14
13246B86233j8257m489l0638N331l273j7487j102l210j945J969J5679m896J6499
$$ plain form
13233 240414 248187 231867 280890 336422 369601 409121 463323 478419 528936 563910 618505 699315
13221 699315 802761 966820 1167547 1471819 1840791 2159094 2231859 2124779 1966918 1699786
13211 1699786 1452516 1280028 1130762 998143 907512 853234 785423 767937 726082 722687 736700
13200 736700 718860 717311 715545 701204 701032 694406 692807 710799 747463 758996 784649 793428 818225
13187 818225 850261 887489 913659 952308 952268 942899 939293 931837 941987 966122 999735 1011408 1028352
13174 1028352 1085279 1157982 1182482 1200158 1254506 1293814 1320019 1363768 1421568 1466988 1506021
13163 1506021 1541017 1588326 1641571 1665899 1736600 1824839 1892764 1983629 2081991 2219151 2329968
13152 2329968 2423615 2514823 2623775 2752081 2915592 3110579 3264724 3436818 3634224 3849507
$$ packed form
13233B40414P773j6320M9023N5532L3179L9520N4202J5096N0517L4974N4595Q0810
13221F99315J03446J64059K00727L04272L68972L18303P2765j07080j57861k67132
13211A699786k47270j72488j49266j32619r0631n4278o7811j7486m1855l395J4013
13200G36700j7840j549j766j4341j72o626j599J7992L6664J1533K5653Q779K4797
13187H18225L2036L7228K6170L8649m0r369l606p456J0150K4135L3613J1673J6944
13174A028352N6927P2703K4500J7676N4348L9308K6205M3749N7800M5420L9033
13163A506021L4996M7309N3245K4328P0701Q8239O7925R0865R8362J37160J10817
13152B329968R3647R1208J08952J28306J63511J94987J54145J72094J97406K15283
$$ plain form
13142 3849507 4069188 4320144 4570104 4883503 5245506 5622504 6048731 6534869 7061749
13133 7061749 7686446 8395103 9160696 10056385 11068160 12184495 13440642 14889716 16570046
13124 16570046 18461283 20596973 23101484 26076830 29587155 33763280 38748040 44640728
13116 44640728 51513513 59335785 67982473 77183119 86456506 95261836 102948538 108896625
13108 108896625 112617919 113779500 112279111 108340462 102306117 94767504 86323571 77553282
13100 77553282 68937181 60839054 53500868 47066888 41519025 36778923 32745677 29305224
13092 29305224 26404719 23897642 21683175 19727113 17989691 16457034 15106678 13875755
13084 13875755 12749098 11748145 10863871 10069009 9379411 8711305 8112593 7600374 7124678
$$ packed form
13142C849507K19681K50956K49960L13399L62003L76998M26227M86138N26880
13133G061749O24697P08657P65593Q95689J011775J116335J256147J449074J680330
13124A6570046J891237K135690K504511K975346L510325M176125M984760N892688
13116D4640728O872785P822272Q646688R200646R273387Q805330P686702N948087
13108A08896625L721294J161581j500389l938649o034345p538613q443933q770289
13100G7553282q616101q098127p338186o433980n547863m740102m033246l440453
13092B9305224k900505k507077k214467j956062j737422j532657j350356j230923
13084A3875755j126657j000953q84274p94862o89598o68106n98712n12219m75696
$$ plain form
13075 7124678 6707087 6319879 5956864 5588813 5292382 5025425 4765616 4512669 4281098
13066 4281098 4080584 3889249 3699886 3531127 3375855 3231394 3093060 2968821 2816134
13057 2816134 2696371 2572757 2465764 2386490 2299821 2230838 2161248 2030649 1953945 1926252
13047 1926252 1851326 1760329 1675273 1632862 1568649 1525755 1456114 1402464 1370355 1348122 1314773
13036 1314773 1277388 1244323 1198490 1172156 1160044 1091510 1051635 1061447 996568 986184 964459
13025 964459 947975 915848 870528 843363 839813 845779 862029 855575 845958 826749 804620 813523
13013 813523 798816 780681 786922 785900 789223 779462 754495 709114 649084 658994 699931 700410 709981
13000 709981 690199 706130 707626 711528 714876 671119 660588 653249 647305 631618 635631 672952 676027
$$ packed form
13075G124678m17591l87208l63015l68051k96431k66957k59809k52947k31571
13066D281098k00514j91335j89363j68759j55272j44461j38334j24239j52687
13057B816134j19763j23614j06993p9274q6669o8983o9590j30599p6704k7693
13047A926252p4926r0997q5056m2411o4213m2894o9641n3650l2109k2233l3349
13036A314773l7385l3065m5833k6334j2112o8534l9875R812o4879j0384k1725
13025I64459j6484l2127m5320k7165l550N966J6250o454r617j9209k2129Q903
13013H13523j4707j8135O241j022L323r761k4967m5381o0030R910M0937M79R571
13000G09981j9782J5931J496L902L348m3757j0531p339n944j5687M013L7321L075
$$ plain form
12987 676027 660900 668691 689302 696109 696268 691948 699439 681358 676306 672704 663123 629378 590780
12974 590780 562767 560406 560667 527723 506115 515889 494073 452280 408983 407128 419204 450662
12962 450662 464895 429829 410989 414932 426182 449217 453374 422122 408229 432967 408958 370081
12950 370081 349097 369340 383921 385698 425980 403202 397048 399381 398132 394846 382770 391413 403641
12937 403641 392306 380863 324939 296607 281175 254706 249411 243403 275314 305736 315507 307483
12925 307483 255927 264696 299114 285696 268830 261820 239437 188511 174209 168793 176801 198302
12913 198302 221901 235259 219281 196054 187537 143676 77489 49669 35467 47110 41338 36940
12901 36940 58604 95709 130538 185259 213742 235959 252764 258297 252682 265534 257908 245335
$$ packed form
12987F76027j5127P791K0611O807J59m320P491j8081n052l602r581l3745l8598
12974E90780k8013k361K61l2944k1608R774k1816m1793m3297j855J2076L1458
12962D50662J4233l5066j8840L943J1250K3035M157l1252j3893K4738k4009l8877
12950C70081k0984K0243J4581J777M0282k2778o154K333j249l286j2076Q643J2228
12937D03641j1335j1443n5924k8332j5432k6469n295o008L1911L0422R771q024
12925C07483n1556Q769L4418j3418j6866p010k2383n0926j4302n416Q008K1501
12913A98302K3599J3358j5978k3227q517m3861o6187k7820j4202J1643n772m398
12901C6940K1664L7105L4829N4721K8483K2217J6805N533n615J2852p626j2573
$$ plain form
12889 245335 253611 239970 194459 131139 54667 -36667 -107793 -194157 -218582 -196899 -190243 -164578
12877 -164578 -104630 -43276 38595 79595 94746 58478 76060 83920 90955 99145 98588 128816
12865 128816 185138 249902 269617 240902 245110 235076 242617 266781 289707 287833 281348 327172
12853 327172 356079 347272 343391 348775 316106 322578 335673 333830 336304 341789 349557 370784 400214
12840 400214 394876 390588 417906 445606 431332 429449 418246 453322 485570 504177 508837 482170
12828 482170 482867 500676 507263 508004 530693 542395 527957 560251 591942 607879 609364 629217 641442
12815 641442 655339 698816 724623 710632 725576 759376 818188 863121 871170 895073 933287 979166
12803 979166 995478 1075313 1158217 1194334 1247071 1329264 1402731 1453557 1476011 1523746 1597004
$$ packed form
12889B45335Q276j3641m5511o3320p6472r1334p1126q6364k4425K1683O656K5665
12877a64578N9948O1354Q1871M1000J5151l6268J7582P860P035Q190n57L0228
12865A28816N6322O4764J9715k8715M208j0034P541K4164K2926j874o485M5824
12853C27172K8907q807l881N384l2669O472J3095j843K474N485P768K1227K9430
12840D00214n338m288K7318K7700j4274j883j1203L5076L2248J8607M660k6667
12828D82170O97J7809O587P41K2689J1702j4438L2294L1691J5937J485J9853J2225
12815F41442J3897M3477K5807j3991J4944L3800N8812M4933Q049K3903L8214M5879
12803I79166J6312P9835Q2904L6117N2737Q2193P3467N0826K2454M7735P3258
$$ plain form
12792 1597004 1648198 1720383 1829308 1926889 2043125 2244723 2446959 2673189 2972397 3342702
12782 3342702 3676004 3967240 4165180 4391885 4660822 4977315 5329117 5756549 6284648
12773 6284648 6937879 7734953 8622595 9686288 10955486 12497941 14440901 16865249 19707652
12764 19707652 22901654 26763884 31720743 38302472 47414492 60400858 79417909 108069082
12756 108069082 151714358 215796574 295859939 355566745 365607993 344220942 305513163
12749 305513163 252686438 195250229 146149278 110123913 85063562 67694884 55441671
12742 55441671 46596211 39991760 34713849 30305480 26564412 23400119 20671851 18326266
12734 18326266 16328440 14688241 13321543 12166508 11176982 10313908 9597645 8934264 8304051
$$ packed form
12792A597004N1194P2185J08925R7581J16236K01598K02236K26230K99208L70305
12782C342702L33302K91236J97940K26705K68937L16493L51802M27432N28099
12773F284648O53231P97074Q87642J063693J269198J542455J942960K424348K842403
12764A9707652L194002L862230M956859O581729R112020J2986366J9017051K8651173
12756A08069082M3645276O4082216Q0063365N9706806J0041248k1387051l8707779
12749C05513163n2826725n7436209m9100951l6025365k5060351j7368678j2253213
12742E5441671q845460o604451n277911m408369l741068l164293k728268k345585
12734A8326266j997826j640199j366698j155035r89526q63074p16263o63381o30213
$$ plain form
12725 8304051 7739895 7220248 6770980 6381535 5972299 5608630 5318628 5053869 4777633
12716 4777633 4529317 4307677 4095763 3899045 3702605 3522026 3314857 3119688 2969210
12707 2969210 2831487 2707551 2564585 2449500 2369339 2285613 2202538 2131092 2050522 1951052
12697 1951052 1854563 1789556 1680920 1588388 1510469 1457215 1400355 1334009 1289235 1247243 1177873
12686 1177873 1117710 1099681 1104027 1099020 1068501 1033362 1005738 960474 905258 867317 846560 835880
12674 835880 848024 885120 888279 864064 811779 762380 732694 719548 730075 776502 822485 832598
12662 832598 825633 858058 889072 902989 925272 965056 984352 990516 978193 971820 972547 1004049
12650 1004049 1002272 987326 967294 956941 956730 911959 875152 823365 786981 775893 739720 728953
$$ packed form
12725H304051n64156n19647m49268l89445m09236l63669k90002k64759k76236
12716D777633k48316k21640k11914j96718j96440j80579k07169j95169j50478
12707B969210j37723j23936j42966j15085q0161q3726q3075p1446q0570r9470
12697A951052r6489o5007j08636r2532p7919n3254n6860o6346m4774m1992o9370
12686A177873o0163j8029M346n007l0519l5139k7624m5264n5216l7941k0757j0680
12674H35880J2144L7096L159k4215n2285m9399k9686j3146J0527M6427M5983J0113
12662H32598o965L2425L1014J3917K2283L9784J9296O164j2323o373P27L1502
12650A004049j777j4946k0032j0353k11m4771l6807n1787l6384j1088l6173j0767
$$ plain form
12638 728953 711409 717399 722731 692491 662072 635053 628304 656402 680366 699331 736277 825466
12626 825466 925146 957399 977893 972751 933291 855930 790470 790282 742251 646370 537801 475637
12614 475637 441843 415675 419455 398304 372903 389515 373184 364958 373121 411665 432622 459346
12602 459346 478585 470068 428067 418936 411457 414574 421014 401240 367284 336449 333136 343945 341515
12589 341515 326513 341931 353749 328878 323457 280800 242925 229924 251098 274992 278453 243275
12577 243275 237174 220406 214492 207488 206569 230916 235553 216113 147373 131109 138970 144632 165193
12564 165193 199023 259398 260343 264896 237855 196581 193933 241311 272931 276372 240890 205514
12552 205514 214593 218456 206668 167659 167224 180125 203307 190502 206612 206601 215439 215275 224498 229793
$$ packed form
12638G28953j7544N990N332l0240l0419k7019o749K8098K3964J8965L6946Q9189
12626H25466R9680L2253K0494n142l9460p7361o5460j88m8031r5881j08569o2164
12614D75637l3794k6168L780k1151k5401J6612j6331q226Q163L8544K0957K6724
12602D59346J9239q517m2001r131p479L117O440j9774l3956l0835l313J0809k430
12589C41515j5002J5418J1818k4871n421m2657l7875j3001K1174K3894L461l5178
12577B43275o101j6768n914p004r19K4347M637j9440o8740j6264P861N662K0561
12564A65193L3830O0375R45M553k7041m1274k648M7378L1620L441l5482l5376
12552B05514R079L863j1788l9009m35J2901K3182j2805J6110j1Q838j64R223N295
$$ plain form
12538 229793 243843 239310 209252 182283 158496 168767 189789 206778 193819 193270 187429 153360
12526 153360 116051 102860 125736 142192 121344 131045 125312 97468 96516 110984 128096 118798
12514 118798 89539 113453 139341 104896 120974 144743 142212 132316 106297 78329 71795 81336
12502 81336 97347 110301 124708 136392 119790 145145 143565 119066 89026 86321 105459 113711
12490 113711 99629 93658 104428 115487 150720 169881 130689 78244 64386 93084 121057 126741
12478 126741 114710 133366 119356 105436 106544 156297 163415 138369 127337 123036 97552 93304
12466 93304 112143 113120 113530 109913 92603 91962 72237 62609 54949 59509 88000 96483 75535 80235
12452 80235 82344 118003 116560 103982 84316 81847 74106 62597 81406 94303 113667 125229
$$ packed form
12538B29793J4050m533l0058k6969k3787J0271K1022J6989j2959n49n841l4069
12526A53360l7309j3191K2876J6456k0848R701n733k7844r52J4468J7112r298
12514A18798k9259K3914K5888l4445J6078K3769k531r896k6019k7968o534R541
12502H1336J6011J2954J4407J1684j6602K5355j580k4499l0040k705J9138Q252
12490A13711j4082n971J0770J1059L5233J9161l9192n2445j3858K8698K7973N684
12478A26741j2031J8656j4010j3920J108M9753P118k5046j1032m301k5484m248
12466I3304J8839R77M10l617j7310o41j9725r628p660M560K8491Q483k0948M700
12452H0235K109L5659j443j2578j9666k469p741j1509J8809J2897J9364J1562
$$ plain form
12440 125229 139692 141553 150480 136619 129164 130955 115561 105228 106028 98802 84357 96175 77317
12427 77317 35132 27069 39394 21902 13560 19998 46205 59755 70058 65098 48982 34055
12415 34055 37959 47139 53241 32610 57464 65555 69071 84290 77891 63396 78137 98514 101976
12402 101976 101953 98594 83258 67150 71896 79602 117919 117879 99585 81950 80358 80521 80665 68048
12388 68048 64209 83809 93036 104133 84291 71970 68247 65640 53709 40170 4096 30748
12376 30748 90487 101540 121135 91753 64105 45767 41049 78151 89796 83279 53399 56976
12364 56976 64319 79531 70317 48676 31897 33006 36305 26461 38072 40204 42781 54450 67025
12351 67025 28765 51120 72157 58898 51898 45484 26305 13568 -3876 23810 34685 46213
$$ packed form
12440A25229J4463J861Q927j3861p455J791j5394j0333Q00p226j4445J1818j8858
12427G7317m2185q063J2325j7492q342O438K6207J3550J0303m960j6116j4927
12415C4055L904R180O102k0631K4854Q091L516J5219o399j4495J4741K0377L462
12402A01976k3l359j5336j6108M746P706L8317m0j8294j7635j592J63J44j2617
12388F8048l839J9600R227J1097j9842j2321l723k607j1931j3539l6074K6652
12376C0748N9739J1053J9595k9382k7648j8338m718L7102J1645o517k9880L577
12364E6976P343J5212r214k1641j6779J109L299r844J1611K132K577J1669J2575
12351F7025l8260K2355K1037j3259p000o414j9179j2737j7444K7686J0875J1528
$$ plain form
12339 46213 62426 64546 68229 93499 89137 76034 54856 67430 84257 71866 78984 96756
12327 96756 97974 72020 49329 50757 44102 49505 45535 68798 79592 86630 65121 81759 110366
12314 110366 121042 107113 88606 66010 71078 94165 108349 129530 128620 135344 115119 153925
12302 153925 157386 146966 118201 122236 138210 141721 150736 179602 224984 222341 217973 235006 275066
12289 275066 294746 373937 470141 621922 837517 1104991 1434149 1742111 1834173 1797648
12279 1797648 1676881 1447125 1181553 920439 718556 569727 448777 362270 294621 284764
12269 284764 264969 233278 214962 201218 203848 184130 168221 169477 167548 143688 137202 118027
12257 118027 109052 127060 126805 109808 99515 92208 108028 115360 80213 65426 84241 68849
$$ packed form
12339D6213J6213K120L683K5270m362j3103k1178J2574J6827j2391P118J7772
12327I6756J218k5954k2691J428o655N403l970K3263J0794P038k1509J6638K8607
12314A10366J0676j3929j8507k2596N068K3087J4184K1181r10O724k0225L8806
12302A53925L461j0420k8765M035J5974L511R015K8866M5382k643m368J7033M0060
12289B75066J9680P9191R6204J51781K15595K67474L29158L07962R2062l6525
12279A797648j20767k29756k65572k61114k01883j48829j20950q6507o7649r857
12269B84764j9795l1691j8316j3744K630j9718j5909J256j929k3860o486j9175
12257A18027q975J8008k55j6997j0293p307J5820P332l5147j4787J8815j5392
$$ plain form
12245 68849 57355 55145 58621 70755 69908 80751 88312 71880 62817 71740 55909 47149 60389
12232 60389 80773 52172 40382 44276 42628 70714 74537 50725 15995 16223 11302 41314 92317
12219 92317 97644 101835 117919 94549 69795 60647 42534 27098 46720 70905 74696 53012
12207 53012 29414 32761 27971 7908 -103 -3908 -8737 812 25518 58235 98400 124611 118645
12194 118645 101049 101647 87443 61169 62097 41016 25834 7740 12375 36939 42269 54394 35911
12181 35911 27140 21331 1923 5564 21560 18366 10869 58775 44705 47663 55681 51004 45345
12168 45345 52704 59466 60952 49188 54786 43492 7652 2765 18890 19445 39638 43657 47674
12155 47674 33781 42201 52339 77960 87394 92636 76582 63852 37270 32537 47966 52007 84393
$$ packed form
12245F8849j1494k210L476J2134q47J0843P561j6432r063Q923j5831q760J3240
12232F0389K0384k8601j1790L894j648K8086L823k3812l4730K28m921L0012N1003
12219I2317N327M191J6084k3370k4754r148j8113j5436J9622K4185L791k1684
12207E3012k3598L347m790k0063q011l805m829R549K4706L2717M0165K6211n966
12194A18645j7596N98j4204k6274R28k1081j5182j8094M635K4564N330J2125j8483
12181C5911q771n809j9408L641J5996l194p497M7906j4070K958Q018m677n659
12168D5345P359O762J486j1764N598j1294l5840m887J6125N55K0193M019M017
12155D7674j3893Q420J0138K5621R434N242j6054j2730k6582m733J5429M041L2386
$$ plain form
12142 84393 81371 60193 62793 52218 29275 11233 -610 10203 32144 74057 49475 8472
12130 8472 15989 26509 31388 49835 57937 50259 35897 54096 75286 70488 78282 73423 64609
12117 64609 46486 12459 38952 71503 89130 85589 55324 35040 40063 54620 26223 22076
12105 22076 36008 45976 33786 17250 23889 28245 8318 -20463 3505 1403 -8235 9858 18737
12092 18737 16473 29946 47826 66946 44423 43178 56934 36233 51669 35768 24451 36787
12080 36787 41965 59686 16198 -41774 -47415 -16817 22095 19402 -23477 -35880 -35551 -35255 -27485
12067 -27485 -19144 13433 23391 7735 19435 35542 30100 6347 6176 20740 23432 10990 -11119
12054 -11119 -18476 23513 35065 31418 2629 -12923 -42445 -10485 53179 81307 82579 56194
$$ packed form
12142H4393l022k1178K600j0575k2943j8042j1843J0813K1941M1913k4582m1003
12130H472P517J0520M879J8447Q102p678j4362J8199K1190m798P794m859q814
12117F4609j8123l4027K6493L2551J7627l541l0265k0284N023J4557k8397m147
12105B2076J3932R968j2190j6536O639M356j9927k8781K3968k102r638J8093Q879
12092A8737k264J3473J7880J9120k2523j245J3756k0701J5436j5901j1317J2336
12080C6787N178J7721m3488n7972n641L0598L8912k693m2879j2403L29K96P770
12067b7485Q341L2577R958j5656J1700J6107n442k3753j71J4564K692j2442k2109
12054a1119p357M1989J1552l647k8789j5552k9522L1960O3664K8128J272k6385
$$ plain form
12042 56194 30396 29144 27344 63388 103471 94246 117729 121812 116987 115606 84235 56420 55271
12029 55271 84208 137136 160522 190629 175767 144352 132062 117132 102141 117723 138664 166602
12017 166602 179296 147910 134032 124348 123172 149856 170745 167095 180977 187431 178279 148985
12005 148985 159036 171174 176446 174667 174980 186077 190498 182939 192881 193180 198250 189127 242417 292058
11991 292058 307273 324192 357322 369344 367953 344081 355286 412054 429568 426454 443557 473244
11979 473244 515375 538539 571869 601240 643586 671997 690336 735625 815535 885870 921151
11968 921151 1000313 1124218 1207289 1299009 1430833 1602783 1752957 1957377 2229294 2544113
11958 2544113 2900195 3284052 3780041 4380936 5150289 6167309 7485715 9229911 11562001
$$ packed form
12042E6194k5798j252j800L6044M0083r225K3483M083m825j381l1371k7815j149
12029E5271K8937N2928K3386L0107j4862l1415j2290j4930j4991J5582K0941K7938
12017A66602J2694l1386j3878r684j176K6684K0889l650J3882O454r152k9294
12005A48985J0051J2138N272j779L13J1097M421p559R942K99N070r123N3290M9641
11991B92058J5215J6919L3130J2022j391k3872J1205N6768J7514l114J7103K9687
11979D73244M2131K3164L3330K9371M2346K8411J8339M5289P9910P0335L5281
11968I21151P9162J23905Q3071R1720J31824J71950J50174K04420K71917L14819
11958B544113L56082L83857M95989O00895P69353J017020J318406J744196K332090
$$ plain form
11949 11562001 14696372 18874474 24281097 30628422 36727213 40680624 41436448 39297308
11941 39297308 35108268 29864042 24518442 19752125 15899910 12905935 10650324 8909197
11933 8909197 7513559 6436514 5603799 4896586 4311763 3820206 3430082 3113063 2838021
11924 2838021 2588579 2332979 2125656 1939092 1783733 1676093 1561896 1447305 1359015 1270955
11914 1270955 1175632 1089258 1041058 1000481 949316 878939 816387 770051 756342 736036 683239
11903 683239 670143 641793 608225 589332 580260 552212 538352 534865 525656 506155 480277 460965
11891 460965 441718 408752 339709 312606 307591 293242 290076 278930 246171 216015 220044 232559
11879 232559 236941 209750 205673 236138 244593 226111 230954 225020 193258 196592 191855 197141 179500
$$ packed form
11949A1562001L134371M178102N406623O347325O098791L953411P55824k139140
11941C9297308m189040n244226n345600m766317l852215k993975k255611j741127
11933H909197j395638j077045q32715p07213n84823m91557l90124l17019k75042
11924B838021k49442k55600k07323j86564j55359j07640j14197j14591q8290q8060
11914A270955r5323q6374m8200m0577n1165p0377o2552m6336j3709k0306n2797
11903F83239j3096k8350l3568j8893r072k8048j3860l487r209j9501k5878j9312
11891D60965j9247l2966o9043k7103n015j4349l166j1146l2759l0156M029J2515
11879B32559M382k7191m077L0465Q455j8482M843n934l1762L334m737N286j7641
$$ plain form
11866 179500 152982 171539 163966 130916 125769 136718 138419 138955 150093 169535 149904 150135 167719
11853 167719 139764 128484 128173 108165 122819 141295 124851 122809 135228 136662 115351 104725
11841 104725 92006 123377 131791 119089 93955 81177 78105 74875 102308 88104 71233 72264
11829 72264 101438 112060 94661 105362 111025 104875 121631 124323 106411 91123 104968 100221
11817 100221 87810 92805 87848 83080 124988 140252 127266 129321 113295 114920 119546 97464 66455
11804 66455 64813 86762 119830 139281 124729 142706 114343 89378 82717 87350 96808 91907 95080
11791 95080 93631 103642 104863 81611 75532 78928 98807 74126 61178 65986 78822 84973 95206
11778 95206 84253 64902 46028 56684 62888 87330 49845 37723 30867 29049 21625 18691 -4025
$$ packed form
11866A79500k6518J8557p573l3050n147J0949J701N36J1138J9442j9631K31J7584
11853A67719k7955j1280l11k0008J4654J8476j6444k042J2419J434k1311j0626
11841A04725j2719L1371Q414j2702k5134j2778l072l230K7433j4204j6871J031
11829G2264K9174J0622j7399J0701N663o150J6756K692j7912j5288J3845m747
11817A00221j2411M995m957m768M1908J5264j2986K055j6026J625M626k2082l1009
11804F6455j642K1949L3068J9451j4552J7977k8363k4965o661M633R458m901L173
11791I5080j449J0011J221k3252o079L396J9879k4681j2948M808J2836O151J0233
11778I5206j0953j9351j8874J0656O204K4442l7485j2122o856j818p424k934k2716
$$ plain form
11765 -4025 -10140 23115 4465 1006 29748 18750 47478 55475 32262 35919 27755 3478 8664
11752 8664 4344 -11196 -3241 12232 772 1598 -11467 -13022 4860 14284 20195 20630 48805 66315
11738 66315 82051 75690 76099 54439 36724 52836 94529 83649 41204 35345 47843 24874
11726 24874 19367 32653 35918 39173 24344 13081 14024 23582 36458 51166 64987 31072 28665
11713 28665 19151 15782 42250 33838 66442 81823 74990 92503 70362 43044 19548 23312 14348
11700 14348 20122 40482 21605 37374 12308 -3221 -8248 -3886 20418 35449 35033 1595 -15502
11687 -15502 2042 3579 -248 -20912 2120 15633 39047 23929 9146 8176 31096 39927 14832
11674 14832 -6323 3584 20690 21056 21348 7875 4192 11097 46397 45388 31010 40045 50185
$$ packed form
11765d025o115L3255j8650l459K8742j0998K8728P997k3213L657q164k4277N186
11752H664m320j5540P955J5473j1460Q26j3065j555J7882R424N911M35K8175J7510
11738F6315J5736o361M09k1660j7715J6112M1693j0880m2445n859J2498k2969
11726B4874n507J3286L265L255j4829j1263R43R558J2876J4708J3821l3915k407
11713B8665r514l369K6468q412L2604J5381o833J7513k2141k7318k3496L764q964
11700A4348N774K0360j8877J5769k5066j5529n027M362K4304J5031m16l3438j7097
11687a5502J7544J537l827k0664K3032J3513K3414j5118j4783r70K2920Q831k5095
11674A4832k1155R907J7106L66K92j3473l683O905L5300j009j4378R035J0140
$$ plain form
11661 50185 47743 79913 83858 60242 73247 86131 90234 100169 110678 129904 161857 179646
11649 179646 201826 201116 213718 225999 259004 331369 381417 438290 489937 563433 617910 632085
11637 632085 617539 609324 619246 593449 601662 600819 584131 577303 542534 503107 507502 494432 483375
11624 483375 478652 449975 458249 479648 482214 465166 445660 466236 508131 549101 567499 611165
11612 611165 637242 653258 653853 650719 616512 576759 551084 546621 492137 444363 398649 341419
11600 341419 321703 293016 243241 207756 155626 136071 140037 145224 121777 83691 80774 107078
11588 107078 114428 83307 39595 61452 83466 78983 35675 25297 46950 35885 8200 18046
11576 18046 33106 47129 41650 20856 11860 14113 13339 12535 6135 10304 -504 10710 9674 11052
$$ packed form
11661E0185k442L2170L945k3616J3005J2884M103R935J0509J9226L1953J7789
11649A79646K2180p10J2602J2281L3005P2365N0048N6873N1647P3496N4477J4175
11637F32085j4546q215R922k5797Q213q43j6688o828l4769l9427M395j3070j1057
11624D83375m723k8677Q274K1399K566j7048j9506K0576M1895M0970J8398M3666
11612F11165K6077J6016N95l134l4207l9753k5675m463n4484m7774m5714n7230
11600C41419j9716k8687m9775l5485n2130j9555L966N187k3447l8086k917K6304
11588A07078P350l1121m3712K1857K2014m483m3308j0378K1653j1065k7685R846
11576A8046J5060J4023n479k0794q996K253p74q04o400M169j0808J1214j036J378
$$ plain form
11562 11052 16707 30789 48090 41001 28989 25091 19157 18155 24553 14309 -25173 -30209 -11487
11549 -11487 16178 24132 7527 5174 19927 18979 10483 31222 42810 25238 25889 34675 14132
11536 14132 3851 -6697 11318 18059 15807 32948 36419 50193 42770 22996 21690 45666 52357
11523 52357 45021 43998 22960 -1303 2699 19466 12291 9805 23210 40886 50166 39023 48149
11510 48149 47179 54669 48567 28068 -4273 -21491 -3514 8816 34379 20675 33756 31145 29663
11497 29663 15958 16110 35798 60969 45264 28287 28512 37345 6961 -891 -14449 -13442 -25060
11484 -25060 -23038 -8526 -3609 -19884 -30105 -31464 -12376 238 -25382 -36253 8956 30208
11472 30208 27730 19995 38125 44859 64831 58961 34622 43998 45183 45460 59394 76034 80070
$$ packed form
11562A1052N655J4082J7301p089j2012l898n934j002O398j0244l9482n036J8722
11549a1487K7665P954j6605k353J4753r48q496K0739J1588j7572O51Q786k0543
11536A4132j0281j0548J8015O741k252J7141L471J3774p423j9774j306K3976O691
11523E2357p336j023k1038k4263M002J6767p175k486J3405J7676R280j1143R126
11510D8149r70P490o102k0499l2341j7218J7977J2330K5563j3704J3081k611j482
11497B9663j3705J52J9688K5171j5705j6977K25Q833l0384p852j3558J007j1618
11484b5060K022J4512M917j6275j0221j359J9088J2614k5620j0871M5209K1252
11472C0208k478p735J8130O734J9972n870k4339R376J185K77J3934J6640M036
$$ plain form
11459 80070 52154 24039 37887 47839 16982 5135 -32530 -22230 -25 -17832 -34412 -26425
11447 -26425 -8535 11406 -16431 -19088 -4386 133 6114 14579 18757 24173 38472 48664 34141
11434 34141 26889 11858 -5061 -4040 3394 9453 -34610 -37943 -15046 -29063 -13085 -10939 -18139
11421 -18139 -43257 -37226 -6132 36596 -4124 -18580 4943 29653 30931 29572 43459 54406
11409 54406 35298 12784 25791 61236 43568 15594 22805 38215 29182 -420 -20218 -29179
11397 -29179 -21929 -24178 -1991 -1702 -37771 -66198 -79737 -24690 9139 30829 37896 38298 17685
11384 17685 -4076 3907 4499 1708 15462 17023 -2056 3539 -9005 -3118 -13905 -19035 -3505
11371 -3505 9936 10679 5210 5410 -11830 -9919 -18883 -30786 -9702 -11770 -27219 7355 15401 12844
$$ packed form
11459H0070k7916k8115J3848R952l0857j1847l7665J0300K2205j7807j6580P987
11447b6425J7890J9941k7837k657J4702M519N981Q465M178N416J4299J0192j4523
11434C4141p252j5031j6919J021P434O059m4063l333K2897j4017J5978K146p200
11421a8139k5118O031L1094M2728m0720j4456K3523K4710J278j359J3887J0947
11409E4406j9108k2514J3007L5445j7668k7974P211J5410r033k9602j9798q961
11397b9179P250k249K2187K89l6069k8427j3539N5047L3829K1690P067M02k0613
11384A7685k1761P983N92k791J3754J561j9079N595j2544N887j0787n130J5530
11371c505J3441P43n469K00j7240J911q964j1903K1084k068j5449L4574Q046k557
$$ plain form
11357 12844 3435 9292 2220 -13786 -23077 -8162 -30282 -60391 -40659 -36637 -12035 20919 42894
11344 42894 43848 40812 29122 37917 23636 16529 12545 13369 4120 6045 8079 31721 37713 52614
11330 52614 49706 57390 71031 26234 17267 40665 40942 23108 9955 28703 57360 56758 49646
11317 49646 43033 47995 47108 33168 23826 15134 26824 49944 58096 38076 1710 17067 55261
11304 55261 86855 71286 55794 35523 3137 -12290 -14896 -6584 -7983 676 -6449 -12109 -20142
11291 -20142 -18340 7567 -15389 -4273 9313 -514 13035 41540 25847 -2850 -2223 5516 14803
11278 14803 18114 12780 2116 -25200 -51406 -40769 -26227 -11639 2788 -3009 -19005 -24630
11266 -24630 -36538 4145 30149 32616 45141 41967 13610 -17577 8779 8525 22321 38352
$$ packed form
11357A2844r409N857p072j6006r291J4915k2120l0109J9732M022K4602L2954K1975
11344D2894R54l036j1690Q795j4281p107l984Q24r249J925K034K3642N992J4901
11330E2614k908P684J3641m4797q967K3398K77j7834j3153J8748K8657o02p112
11317D9646o613M962q87j3940r342q692J1690K3120Q152k0020l6366J5357L8194
11304E5261L1594j5569j5492k0271l2386j5427k606Q312j399Q659p125n660q033
11291b0142J802K5907k2956J1116J3586r827J3549K8505j5693k8697O27P739R287
11278A4803L311n334j0664k7316k6206J0637J4542J4588J4427n797j5996n625
11266b4630j1908M0683K6004K467J2525l174k8357l1187K6356k54J3796J6031
$$ plain form
11254 38352 13845 -6002 -14549 -34308 -39069 -1909 -14840 -17713 -13068 29585 39630 -19115
11242 -19115 -56500 -45869 -31038 -24745 7425 32667 36794 32500 46587 69097 57816 56848 44863
11229 44863 40712 35039 53241 50321 24891 -16239 -27121 -7788 1498 3024 9732 -7031 -41557
11216 -41557 -41644 -13850 -6103 -29442 -31925 -41028 -51229 -41729 -18776 -41262 -35649 -2230 19683
11203 19683 -4718 -10431 27853 60738 50120 21778 -20224 -16680 13115 19301 19628 25729 9143
11190 9143 6265 9747 23925 36302 29717 18079 229 -32241 -59575 -50555 -17329 18966 18894
11177 18894 47092 65382 41461 5398 -1791 14779 17158 2684 -10523 1831 40812 52602
11165 52602 13102 -6447 -9314 -16414 10240 25369 42465 31468 32548 31499 22709 40712 31197
$$ packed form
11254C8352k4507j9847q547j9759m761L7160j2931k873M645M2653J0045n8745
11242a9115l7385J0631J4831O293L2170K5242M127m294J4087K2510j1281r68j1985
11229D4863m151n673J8202k920k5430m1130j0882J9333R286J526O708j6763l4526
11216d1557q7K7794P747k3339k483r103j0201R500K2953k2486N613L3419K1913
11203A9683k4401n713L8284L2885j0618k8342m2002L544K9795O186L27O101j6586
11190I143k878L482J4178J2377o585j1638j7850l2470k7334R020L3226L6295p2
11177A8894K8198J8290k3921l6063p189J6570K379j4474j3207J2354L8981J1790
11165E2602l9500j9549k867p100K6654J5129J7096j0997J080j049q790J8003r515
$$ plain form
11152 31197 18102 14474 1253 -17332 -13923 -13533 17289 18070 12675 -7845 -32927 -29052 -13310
11139 -13310 -2347 -7603 -35310 -18882 -23098 -33082 -31831 -34963 -43667 -32112 -51847 -41284 276
11126 276 -8762 -33895 -41400 -25911 -20061 -28058 -8594 14104 9455 32367 59045 55104 57708
11113 57708 47857 18610 24024 54441 65633 58205 28615 -12319 -44144 -51387 -37412 -3035
11101 -3035 34739 38571 35568 45714 30333 14381 21286 51355 53614 53254 45992 16958 4297
11088 4297 3671 -10883 -24167 -35968 -21923 -8787 25969 50089 46198 9262 -2859 11636
11076 11636 34335 40258 32376 -12956 -33129 -26188 -14118 -16084 -22015 -48263 -69282 -31298 -21740
11063 -21740 -23843 -16677 -2904 -10156 -11511 -929 -6666 20008 42056 35642 21764 22763 18577
$$ packed form
11152C1197j3095l628j3221j8585L409L90L0822P81n395k0520k5082L875J5742
11139a3310J0963n256k7707J6428m216r984J251l132q704J1555j9735J0563M1560
11126B76r038k5133p505J5489N850p997J9464K2698m649K2912K6678l941K604
11113E7708r851k9247N414L0417J1192p428k9590m0934l1825p243J3975L4377
11101c035L7774L832l003J0146j5381j5952O905L0069K259l60p262k9034j2661
11088D297o26j4554j3284j1801J4045J3136L4756K4120l891l6936j2121J4495
11076A1636K2699N923p882m5332k0173O941J2070j966n931k6248k1019L7984R558
11063b1740k103P166J3773p252j355J0582n737K6674K2048o414j3878R99m186
$$ plain form
11050 18577 12362 -3018 29165 36574 17999 36065 42553 40880 64722 92472 67312 65994 64494
11037 64494 61495 88379 119549 151375 117756 81413 82684 78704 91664 94713 145739 173381
11025 173381 170376 181335 192215 193548 166721 175504 164407 133471 123388 157748 195125 247194
11013 247194 298356 310070 292137 249479 209538 183743 151808 149083 130040 147397 163950 160322
11001 160322 176626 182169 173025 180077 136114 102013 95949 105187 101363 108948 120297 118759 95876
10988 95876 88840 78580 42985 39299 25642 30183 43759 46891 66216 84572 59057 56927 70708
10975 70708 65021 62381 54318 41400 15170 -2043 -22540 16187 28183 32650 29865 32738 28331
10962 28331 23847 13967 25494 4019 -7317 18937 9949 8769 34361 31968 39801 14740 -2053
$$ packed form
11050A8577o215j5380L2183P409j8575J8066O488j673K3842K7750k5160j318j500
11037F4494k999K6884L1170L1826l3619l6343J271l980J2960L049N1026K7642
11025A73381l005J0959J0880J333k6827Q783j1097l0936j0083L4360L7377N2069
11013B47194N1162J1714j7933m2658l9941k5795l1935k725j9043J7357J6553l628
11001A60322J6304N543r144P052m3963l4101o064R238l824P585J1349j538k2883
10988I5876p036j0260l5595l686j3657M541J3576L132J9325J8356k5515k130J3781
10975G0708n687k640q063j2918k6230j7213k0497L8727J1996M467k785K873m407
10962B8331m484r880J1527k1475j1336K6254q988j180K5592k393P833k5061j6793
$$ plain form
10949 -2053 16014 37467 18799 2396 -12090 -27921 -38831 -25571 -4110 7713 -3839 -7338
10937 -7338 -24748 -32208 -26908 -45 21020 27089 29556 49022 62249 50959 21011 13269 28848
10924 28848 13240 -9520 -3522 -5445 -21262 -22647 -11046 8646 5289 8966 -24205 -77224 -80017
10911 -80017 -48899 -52326 -29500 -24547 -12611 14012 26662 22604 -18404 -10109 -27778 -27374 -9422
10898 -9422 -7649 -22742 -25986 -1260 -5978 -20851 -29138 -35016 -11811 -12439 -5075 10171 39523
10885 39523 63805 61550 45059 65223 57614 14741 -26074 -32197 945 7276 10874 28794 65278
10872 65278 47550 55206 58272 55238 42170 43534 43763 40515 27060 -89 5640 52135 93948
10859 93948 86261 49312 54992 36837 7058 -10469 -16189 -12037 -10818 -480 -1639 278 -11696
$$ packed form
10949b053J8067K1453j8668j6403j4486j5831j0910J3260K1461J1823j1552l499
10937g338j7410p460N300K6863K1065O069K467J9466J3227j1290k9948p742J5579
10924B8848j5608k2760N998j923j5817j385J1601J9692l357L677l3171n3019k793
10911h0017L1118l427K2826M953J1936K6623J2650m058m1008Q295j7669M04J7952
10898i422J773j5093l244K4726m718j4873q287n878K3205o28P364J5246K9352
10885C9523K4282k255j6491K0164p609m2873m0815o123L3142O331L598J7920L6484
10872F5278j7728P656L066l034j3068J364K29l248j3455k7149N729M6495M1813
10859I3948p687l6949N680j8155k9779j7527n720M152J219J0338j159J917j1974
$$ plain form
10846 -11696 1991 24916 28026 25123 36418 49919 53474 64541 54486 12916 6192 39226
10834 39226 83575 77436 51169 35050 25442 42688 35489 40020 31229 14663 35256 12186 -21041
10821 -21041 -30780 12866 7126 -11329 9353 24234 10628 33482 33309 10819 -22496 -15985 5500
10808 5500 -28276 -59870 -31319 -10696 -17634 4030 38824 46552 37430 31383 24888 10663 -938
10795 -938 -186 2051 -15367 -93 24457 12569 -7875 -20680 -36746 -21257 -8181 -3376 -1621
10782 -1621 16968 27546 21214 27078 44982 34944 42627 58326 52239 74583 81469 50430 38777
10769 38777 10064 -34022 -45032 -41158 -43758 -26050 -5847 -2391 21956 38556 47432 26990
10757 26990 12441 8793 9489 24609 28684 9783 16744 -6261 -20234 -3643 15836 43303 35888
$$ packed form
10846a1696J3687K2925L110k903J1295J3501L555J1067j0055m1570o724L3034
10834C9226M4349o139k6267j6119r608J7246p199M531q791j6566K0593k3070l3227
10821b1041r739M3646n740j8455K0682J4881j3606K2854j73k2490l3315O511K1485
10808E500l3776l1594K8551K0623o938K1664L4794P728r122o047o495j4225j1601
10795i38P52K237j7418J5274K4550j1888k0444j2805j6066J5489J3076M805J755
10782a621J8589J0578o332N864J7904j0038P683J5699o087K2344O886l1039j1653
10769C8777k8713m4086j1010L874k600J7708K0203L456K4347J6600Q876k0442
10757B6990j4549l648O96J5120M075j8901O961k3005j3973J6591J9479K7467p415
$$ plain form
10744 35888 15668 -18288 -18650 -2838 14449 8043 5685 8703 5563 7349 14923 15120 -3580 5802
10730 5802 8178 5657 34814 37485 -3080 -49729 -58866 -96221 -74586 -57503 -63912 -84907 -85401
10717 -85401 -76346 -89435 -101937 -79600 -87540 -116293 -121744 -129118 -114434 -107686 -92027 -116299 -99152
10704 -99152 -19506 4641 -15575 -26857 -55663 -58279 -60535 -60427 -55984 -42193 -14292 -1508 -23433
10691 -23433 -39693 -52966 -41110 -22716 4664 -12722 -27071 -26000 -20260 2334 7424 21213
10679 21213 24008 36675 38330 44590 51112 42909 34579 54601 81902 89936 77340 82382 86717
10666 86717 104768 114915 89012 63587 78629 93697 67566 22254 41757 101921 135650 161909
10654 161909 151530 99296 65163 74841 122787 95668 116553 160387 193010 254918 291525 306857
$$ packed form
10744C5888k0220l3956l62J5812J7287o406k358L018l140J786P574J97j8700R382
10730E802K376k521K9157K671m0565m6649r137l7355K1635J7083o409k0995m94
10717h5401R055j3089j2502K2337p940k8753n451p374J4684O748J5659k4272J7147
10704i9152P9646K4147k0216j1282k8806k616k256J08M443J3791K7901J2784k1925
10691b3433j6260j3273J1856J8394K7380j7386j4349J071N740K2594N090J3789
10679B1213K795J2667J655O260O522q203q330K0022K7301Q034j2596N042M335
10666H6717J8051J0147k5903k5425J5042J5068k6131m5312J9503O0164L3729K6259
10654A61909j0379n2234l4133R678M7946k7119K0885M3834L2623O1908L6607J5332
$$ plain form
10642 306857 356111 439547 460269 434551 422606 403422 393896 385094 382643 387663 387238 384044 404361
10629 404361 450367 510779 572333 648229 733479 860533 1005201 1106912 1184917 1296863 1439862
10618 1439862 1618615 1822616 2065496 2429472 2912171 3587774 4482984 5674099 7236668
10609 7236668 9167679 11408786 13621442 15391986 16458286 16855204 16810658 16651275 16697009
10600 16697009 17241729 18613966 21029257 24556591 28911894 33101667 35921653 36846424
10592 36846424 36240824 34676722 32808051 31311142 30853502 31874273 34641333 39059011
10584 39059011 44449063 49167063 51515679 51046063 48410993 44413809 39976976 36015300
10576 36015300 33247766 32056207 32438785 34196455 36606656 38429739 38653298 37032530
$$ packed form
10642C06857M9254Q3436K0722k5718j1945j9184r526q802k451N020m25l194K0317
10629D04361M6006O0412O1554P5896Q5250J27054J44668J01711P8005J11946J42999
10618A439862J78753K04001K42880L63976M82699O75603Q95210J191115J562569
10609G236668J931011K241107K212656J770544J066300L96918m4546j59383M5734
10600A6697009N44720J372237K415291L527334M355303M189773K819986R24771
10592C6846424o05600j564102j868671j496909m57640J020771K767060M417678
10584C9059011N390052M718000K348616m69616k635070l997184m436833l961676
10576C6015300k767534j191559L82578J757670K410201J823083K23559j620768
$$ plain form
10568 37032530 34038632 30313308 26525832 23221982 20794770 19312566 18647656 18638801 18917478
10559 18917478 18941963 18358089 17047531 15200508 13049994 10910495 9003607 7411778
10551 7411778 6149239 5200991 4441118 3822232 3387389 3024568 2719500 2487465 2269039
10542 2269039 2031948 1852278 1684708 1551233 1462204 1367387 1290934 1212147 1153350 1078285
10532 1078285 1008977 942168 878620 800791 769158 738952 692101 647380 614064 583550 580814
10521 580814 560259 516232 470344 460630 435495 411010 384939 385917 396202 390048 363785 348062
10509 348062 357854 349665 298147 258118 256612 246526 260452 258468 250349 245037 262962 264369 228872
10496 228872 215988 177007 159371 183370 183306 172688 181992 181937 181178 146162 148737 152516 124973 157495
$$ packed form
10568C7032530k993898l725324l787476l303850k427212j482204o64910q855K78677
10559A8917478K4485n83874j310558j847023k150514k139499j906888j591829
10551G411778j262539r48248p59873o18886m34843l62821l05068k32035k18426
10542B269039k37091j79670j67570j33475q9029r4817p6453p8787n8797p5065
10532A078285o9308o6809o3548p7829l1633l0206m6851m4721l3316l0514k736
10521E80814k0555m4027m5888r714k5135k4485k6071R78J0285o154k6263j5723
10509C48062R792q189n1518m0029j506j0086J3926j984q119n312J7925J407l5497
10496B28872j2884l8981j7636K3999o4j0618R304n5p59l5016K575L779k7543L2522
$$ plain form
10482 157495 158525 117295 113034 130397 155790 160964 172225 170931 169835 187688 180683 164025 149120
10469 149120 167445 203563 209500 202427 197515 202442 209625 192271 159814 146044 143713 153610 174414
10456 174414 205297 195606 187022 198947 208341 188234 184721 197879 195738 195101 150422 140872 162376
10443 162376 172376 175689 174063 170531 168205 152073 127100 160675 191726 173905 141265 127949
10431 127949 116901 111675 132401 148248 149893 114997 95784 81115 68594 93153 131853 131921
10419 131921 120378 120198 107323 110067 81207 59210 56004 53316 69239 89937 101605 101944 80608
10406 80608 78505 105109 120381 80246 66776 68435 44168 34742 58282 46120 27474 29906
10394 29906 37707 27216 53126 62432 44086 52258 62827 67564 74539 89665 85957 74971 71357
$$ packed form
10482A57495J030m1230m261J7363K5393N174J1261j294j096J7853p005j6658j4905
10469A49120J8325L6118N937p073m912M927P183j7354l2457j3770k331R897K0804
10456A74414L0883r691q584J1925R394k0107l513J3158k141o37m4679r550K1504
10443A62376J0000L313j626l532k326j6132k4973L3575L1051j7821l2640j3316
10431A27949j1048n226K0726J5847J645l4896j9213j4669j2521K4559L8700O8
10419A31921j1543j80j2875K744k8860k1997l206k688J5923K0698J1668L39k1336
10406H0608k103K6604J5272m0135j3470J659k4267r426K3540j2162j8646K432
10394B9906P801j0491K5910R306j8346Q172J0569M737O975J5126l708j0986l614
$$ plain form
10381 71357 87533 82473 86248 79490 79945 70652 57637 61369 69585 81681 58445 49107 55330 43988
10367 43988 69820 79588 63339 46302 54794 27650 27320 62556 70506 83366 76238 46542 31655
10354 31655 23837 16472 18341 27534 7472 -5045 -6205 3033 17091 32396 79174 88484 69587
10341 69587 59680 57189 52880 71409 48728 32376 31356 48296 54838 62321 55605 25364 20093
10328 20093 -11444 6948 1415 8953 19639 38333 23956 38377 65157 65664 72150 91682 63779
10315 63779 50142 71263 51998 43441 61980 87292 103238 63159 43327 29635 25713 32255
10303 32255 44549 33094 30930 23873 36234 44401 50572 80125 85301 47064 15216 -6823 -8173
10290 -8173 1150 31866 26536 31111 48980 90288 83194 51270 37695 6136 -2198 21466 32688
$$ packed form
10381G1357J6176n060L775o758M55r293j3015L732Q216J2096k3236r338O223j1342
10367D3988K5832R768j6249j7037Q492k7144l30L5236P950J2860p128k9696j4887
10354C1655p818p365J869R193k0062j2517j160R238J4058J5305M6778R310j8897
10341F9587r907k491m309J8529k2681j6352j020J6940O542P483o716l0241n271
10328B0093l1537J8392n533P538J0686J8694j4377J4421K6780N07O486J9532k7903
10315F3779j3637K1121j9265q557J8539K5312J5946m0079j9832j3692l922O542
10303C2255J2294j1455k164p057J2361Q167O171K9553N176l8237l1848k2039j350
10290h173R323L0716n330M575J7869M1308p094l1924j3575l1559q334K3664J1222
$$ plain form
10277 32688 29581 43553 51233 37958 28929 27566 11984 25103 43680 34087 32994 39745 59971
10264 59971 64696 70856 64045 38758 9059 -9684 -16432 -8039 11647 47006 36116 2611 -10543
10251 -10543 64 28429 43109 63722 33712 17001 16014 29572 38675 23376 16352 42183
10239 42183 57740 48599 37565 28033 9640 -16432 -9897 6016 18153 1135 -29263 -38846
10227 -38846 -44023 -28165 -6779 -7254 20325 43515 51262 31278 -13023 -11714 11631 29767 29568
10214 29568 46762 35904 8713 -9411 10080 9218 29730 37762 30302 28476 -4019 4008 20479
10201 20479 36546 51474 40344 31069 -5725 -14626 5267 35133 30451 38208 44599 25161 3404
10188 3404 -26970 -61395 -42901 -16146 26824 19056 3267 14452 28694 52221 46583 19035
$$ packed form
10277C2688l107J3972P680j3275r029j363j5582J3119J8577r593j093O751K0226
10264E9971M725O160o811k5287k9699j8743o748Q393J9686L5359j0890l3505j3154
10251a0543J0607K8365J4680K0613l0010j6711r87J3558R103j5299p024K5831
10239D2183J5557r141j1034r532j8393k6072O535J5913J2137j7018l0398r583
10227c8846n177J5858K1386m75K7579K3190P747j9984m4301J309K3345J8136j99
10214B9568J7194j0858k7191j8124J9491q62K0512Q032p460j826l2495Q027J6471
10201B0479J6067J4928j1130r275l6794q901J9893K9866m682P757O391j9438k1757
10188C404l0374l4425J8494K6755M2970p768j5789J1185J4242K3527n638k7548
$$ plain form
10176 19035 29715 60164 57815 48911 60512 67291 89392 114538 98064 99708 94811 64057 76668
10163 76668 90913 87761 111789 155829 170821 200351 197096 162364 162464 187658 206975 172874
10151 172874 163535 190887 205062 256402 287351 299655 282448 277940 258522 277041 264362 237100
10139 237100 224890 216644 208718 219623 235856 242907 250566 243624 218147 202655 191186 166628
10127 166628 150868 146890 160078 151854 136090 109313 56837 77595 95874 72142 59661 59948
10115 59948 63167 48006 47647 41085 17037 17355 26873 25180 28560 23689 10470 -28878 -18829 8299
10101 8299 22787 23925 36338 372 -24718 20912 33403 36997 54657 48405 -3004 -38510
10089 -38510 -33759 -40351 -39985 -47963 -26289 -21251 -14607 6798 29418 21019 25508 42846 20575
$$ packed form
10176A9035J0680L0449k349q904J1601O779K2101K5146j6474J644m897l0754J2611
10163G6668J4245l152K4028M4040J4992K9530l255l4732J00K5194J9317l4101
10151A72874r339K7352J4175N1340L0949J2304j7207m508j9418J8519j2679k7262
10139B37100j2210q246p926J0905J6233P051P659o942k5477j5492j1469k4558
10127A66628j5760l978J3188q224j5764k6777n2476K0758J8279k3732j2481K87
10115E9948L219j5161l59o562k4048L18R518j693L380m871j3219l9348J0049K7128
10101H299J4488J138J2413l5966k5090M5630J2491L594J7660o252n1409l5506
10089c8510M751o592L66p978K1674N038O644K1405K2620q399M489J7338k2271
$$ plain form
10076 20575 22248 53735 65882 63667 56567 46808 50364 32061 4969 -10724 22087 49306 34365
10063 34365 35458 39411 23280 -3902 -27438 -22832 11932 28134 33659 11033 -18613 -26790 -8022
10050 -8022 12328 9418 25205 30797 45343 46356 66303 63986 42122 43697 25633 -6840 3766
10037 3766 13587 41374 25220 -5985 -20000 -39327 -29199 22984 36971 15342 -17574 -35913
10025 -35913 -42602 -32505 -17722 -18940 -14794 15197 34941 4890 -19713 -1937 6716 2340 -1884
10012 -1884 -15148 -5561 -9301 7279 3252 2831 6935 11137 11784 1255 6283 -4042 1350 7316
9998 7316 13024 -10041 -36318 -22905 -21401 -46996 -45078 -55418 -32355 22687 43897 26893 -23
9985 -23 -8301 29349 41325 48807 49968 67213 46860 16197 -24071 -16419 -2456 36850 39562
$$ packed form
10076B0575J673L1487J2147k215p100r759L556j8303k7092j5693L2811K7219j4941
10063C4365J093L953j6131k7182k3536M606L4764J6202N525k2626k9646q177J8768
10050h022K0350k910J5787N592J4546J013J9947k317k1864J575j8064l2473J0606
10037C766R821K7787j6154l1205j4015j9327J0128N2183J3987k1629l2916j8339
10025c5913o689J0097J4783j218M146K9991J9744l0051k4603J7776Q653m376m224
10012a884j3264R587l740J6580m027m21M104M202O47j0529N028j0325N392N966
9998G316N708k3065k6277J3413J504k5595J918j0340K3063N5042K1210j7004k6916
9985b3q278L7650J1976P482J161J7245k0353l0663m0268P652J3963L9306K712
$$ plain form
9972 39562 15391 17061 23480 39465 72073 76152 65618 29644 15308 27842 30207 9388 26468
9959 26468 46857 55241 50176 19422 10124 8425 -2237 15613 22730 18929 9783 -817 -14904
9946 -14904 19540 37639 14465 -12023 -12319 -26287 -18937 -34168 -18366 12444 7141 -7309 -18783
9933 -18783 -20330 -40338 -52451 -29978 -8095 -2877 8845 6526 -14734 -9763 11724 6671 17936
9920 17936 47901 52658 54327 41488 36686 30259 24611 28191 17405 8521 -16513 -54223 -40046
9907 -40046 -23846 5846 -4756 -9955 -499 1713 -11141 9960 44483 59307 37904 -2498
9895 -2498 -6990 11001 22856 20533 -25757 -55449 -27242 6470 15020 34914 23186 29318 63129
9882 63129 70421 38185 12041 21734 18834 24879 14159 1448 22388 20761 -22268 -60734 -34842
$$ packed form
9972C9562k4171J670O419J5985L2608M079j0534l5974j4336J2534K365k0819J7080
9959B6468K0389Q384n065l0754r298j699j0662J7850P117l801r146j0600j4087
9946a4904L4444J8099k3174k6488k96j3968P350j5231J5802L0810n303j4450j1474
9933a8783j547k0008j2113K2473K1883N218J1722k319k1260M971K1487n053J1265
9920A7936K9965M757J669j2839m802o427n648L580j0786q884k5034l7710J4177
9907d0046J6200K9692j0602n199R456K212j2854K1101L4523J4824k1403m0402
9895b498m492J7991J1855k323m6290k9692K8207L3712Q550J9894j1728O132L3811
9882F3129P292l2236k6144R693k900O045j0720j2711K0940j627m3029l8466K5892
$$ plain form
9869 -34842 14439 38336 33266 27313 675 -10548 19459 25710 -2781 -13946 -8201 -19062 -7777
9856 -7777 -11524 -22881 -27923 -32935 -13977 18149 53782 66134 50763 4944 -1794 -22751 -15800
9843 -15800 -11075 -26200 -5761 21459 27943 33951 15385 9410 18173 22583 26766 14681 1444
9830 1444 9452 10423 18836 13088 29247 28775 1260 -10326 -6366 -9003 -3909 35344 55354 73346
9816 73346 72554 53942 47693 42252 20711 -12965 -26626 1228 5867 3073 4232 19355 25743
9803 25743 20780 15517 31531 8214 15726 13881 -16759 -20574 -26514 -33586 1820 34578 38393
9790 38393 30701 36674 31050 23367 22535 25140 17760 22164 26362 -1113 3771 516 -10083 3820
9776 3820 22881 28324 45292 53174 69624 65377 60084 76159 54492 56083 66241 38586 10301
$$ packed form
9869c4842M9281K3897n070n953k6638j1223L0007O251k8491j1165N745j0861J1285
9856g777l747j1357n042n012J8958L2126L5633J2352j5371m5819o738k0957O951
9843a5800M725j5125K0439K7220O484O008j8566n975Q763M410M183j2085j3237
9830A444Q008R71Q413n748J6159m72k7515j1586L960k637N094L9253K0010J7992
9816G3346p92j8612o249n441k1541l3676j3661K7854M639k794J159J5123O388
9803B5743m963n263J6014k3317P512j845l0640l815n940p072L5406L2758L815
9790C8393p692N973n624p683q32K605p380M404M198k7475M884l255j0599J3903
9776C820J9061N443J6968P882J6450m247n293J6075k1667J591J0158k7655k8285
$$ plain form
9763 10301 7162 26916 31787 31777 21321 7368 -14175 -26634 -31631 -35916 -37914 -29050 -25757 -46155
9749 -46155 -23520 10273 30239 29065 19458 16243 10911 9472 56998 43615 14401 4385 6874
9736 6874 -1064 15735 27426 37081 26075 27855 17555 14961 11579 10146 32004 29656 16294
9723 16294 9574 22879 38468 25103 28798 51762 25818 8051 19678 19049 -788 -17559 7814
9710 7814 24462 37640 38792 35150 20078 11222 -8860 1264 24480 35677 25707 42020 21777
9697 21777 12201 8963 11329 -10939 -13537 6636 30718 24364 19134 34533 30252 6821 6562 17784
9683 17784 29964 3640 -6361 16056 16296 31737 30464 16075 3517 45657 75280 45632
9671 45632 4387 -31887 -22752 11384 4979 -17650 -56418 -71438 -44996 -15696 -9509 3690
$$ packed form
9763A0301l139J9754M871j0j0456j3953k1543j2459m997m285j998Q864L293k0398
9749d6155K2635L3793J9966j174r607l215n332j439M7526j3383k9214j0016K489
9736F874p938J6799J1691R655j1006J780j0300k594l382j433K1858k348j3362
9723A6294o720J3305J5589j3365L695K2964k5944j7767J1627o29j9837j6771K5373
9710G814J6648J3178J152l642j5072q856k0082J0124K3216J1197r970J6313k0243
9697B1777r576l238K366k2268k598K0173K4082o354n230J5399m281k3431k59J1222
9683A7784J2180k6324j0001K2417K40J5441j273j4389j2558M2140K9623k9648
9671D5632m1245l6274R135L4136o405k2629l8768j5020K6442K9300O187J3199
$$ plain form
9659 3690 16215 42472 50290 42976 15185 14175 34394 39296 4179 -37360 -29041 -13323 -22475
9646 -22475 -13517 5802 13707 14767 4228 23454 42099 38994 -6524 -8370 -2575 9744 3015
9633 3015 9183 2204 4431 7373 10193 -4566 1774 5052 24445 -2883 -24330 -21757 -6118 22633
9619 22633 9655 -1283 12591 5948 10238 9907 -4884 -1826 -13074 -816 20220 60800 68038
9606 68038 40834 22336 2399 -14259 -25883 -3848 5875 30742 15456 -8724 -884 -25692
9594 -25692 -47109 -21423 -19443 -30778 -16571 -28277 -1230 12217 24259 28323 35131 51022
9582 51022 44605 39052 11391 13622 39064 31011 34049 14338 -33048 -25653 19250 44368 36011
9569 36011 2297 -22185 -26601 7166 19838 21248 31467 37483 1123 6517 29207 7540 -2359
$$ packed form
9659C690J2525K6257P818p314k7791j010K0219M902l5117m1539Q319J5718r152
9646b2475Q958J9319P905J060j0539J9226J8645l105m5518j846N795J2319o729
9633C015O168o979K227K942K820j4759O340L278J9393k7328k1447K573J5639K8751
9619B2633j2978j0938J3874o643M290l31j4791L058j1248J2258K1036M0580P238
9606F8038k7204j8498j9937j6658j1624K2035R723K4867j5286k4180P840k4808
9594b5692k1417K5686J980j1335J4207j1706K7047J3447J2042M064O808J5891
9582E1022o417n553k7661K231K5442q053L038j9711m7386P395M4903K5118q357
9569C6011l3714k4482m416L3767J2672J410J0219O016l6360N394K2690k1667r899
$$ plain form
9556 -2359 8413 9629 -7458 -18142 4968 39246 43928 23962 1615 -11478 3275 25216
9544 25216 1651 20293 17513 -22340 -44755 -37940 -37490 -28733 -12022 -16545 434 -1562 4716
9531 4716 -9241 -28331 -18333 -29835 -46382 -24162 -2674 10930 36271 18787 2526 3628
9519 3628 1500 -10241 1290 -1904 -30604 -52629 -54616 -14929 -3983 -32035 -53817 -27355 -1830
9506 -1830 4391 -40089 -51379 -18812 -11953 -15403 -13337 -36302 -10857 19733 9156 748 -2241
9493 -2241 6241 2402 9257 45055 38499 -3925 -36190 -17701 -21850 -20585 -20519 -9948 7174 -4465
9479 -4465 17139 25216 -508 -15486 -550 11207 11771 29715 14304 11916 2236 -26390 -33983
9466 -33983 -73077 -47045 -5074 29388 8499 -17456 -49535 -15857 21411 31044 49072 8757
$$ packed form
9556b359J0772J216j7087j0684K3110L4278M682j9966k2347j3093J4753K1941
9544B5216k3565J8642k780l9853k2415O815M50Q757J6711m523J6979j996O278
9531D716j3957j9090R998j1502j6547K2220K1488J3604K5341j7484j6261J102
9519C628k128j1741J1531l194k8700k2025j987L9687J0946k8052k1782K6462K5525
9506a830O221m4480j1290L2567O859l450K066k2965K5445L0590j0577q408k989
9493b241Q482l839O855L5798o556m2424l2265J8489m149J265O6J0571J7122j1639
9479d465K1604Q077k5724j4978J4936J1757N64J7944j5411k388r680k8626p593
9466c3983l9094K6032M1971L4462k0889k5955l2079L3678L7268R633J8028m0315
$$ plain form
9454 8757 -11424 -14397 -38195 -54093 -20735 -7954 8708 17653 -26483 -42008 -7706 -667 8840
9441 8840 34691 30723 23201 -4273 -8187 3781 15003 6714 -5321 -23657 -40304 -55938 -33770
9428 -33770 -19046 -4484 10340 -469 -25805 -40212 -31074 -42714 -11533 -8013 -14433 -38122
9416 -38122 -58267 -22112 -6341 -13865 -27999 -40689 -36882 -34542 -40922 -23534 -25017 -9925 -201
9403 -201 -43857 -58169 -40398 -55588 -47333 -21901 -7293 -22793 -19817 -29780 -55307 -59452 -39222
9390 -39222 -60179 -70419 -63950 -52758 -43212 -49766 -52222 -25189 -14116 -14209 -12513 -19438 -16628 41
9376 41 7196 -5445 -28762 -27236 4115 1468 14001 49233 54059 37740 26179 -5979 -42697
9363 -42697 -31165 -4337 3962 5100 -11543 -27104 -28149 -15682 13225 6211 -29108 -6814 -15903
$$ packed form
9454H757k0181k973k3798j5898L3358J2781J6662Q945m4136j5525L4302P039R507
9441H840K5851l968p522k7474l914J1968J1222q289j2035j8336j6647j5634K2168
9428c3770J4724J4562J4824j0809k5336j4407R138j1640L1181L520o420k3689
9416c8122k0145L6155J5771p524j4134j2690L807K340o380J7388j483J5092R724
9403b01m3656j4312J7771j5190Q255K5432J4608j5500K976r963k5527m145K0230
9390c9222k0957j0240O469J1192R546o554k456K7033J1073r3J696o925K810J6669
9376D1P155j2641k3317J526L1351k647J2533L5232M826j6319j1561l2158l6718
9363d2697J1532K6828Q299J138j6643j5561j045J2467K8907p014l5319K2294r089
$$ plain form
9350 -15903 5362 19895 26482 40505 25273 -3945 -12949 -19517 2597 12684 -23356 -43951
9338 -43951 -40017 -11065 11898 6192 -41409 -70831 -54469 -41801 -51331 -41502 -29239 -13627 -30412
9325 -30412 -19405 1932 -6144 -2353 21850 22399 21121 29605 25287 -1638 -13987 14105 41637
9312 41637 29182 -15321 -24043 -31251 -38241 -26837 -21852 -11305 -12535 -7231 1750 5547 10974 15485
9298 15485 -2376 11937 6420 -5148 -10714 -1341 -7252 -21703 -16632 -5478 -17403 -30406 -22528
9285 -22528 7670 19609 21813 11065 -3284 -915 -843 -5403 -22537 -47130 -30701 -4505 -10519
9272 -10519 -9938 12382 8560 -20339 -43353 -35089 -25472 -13510 -21104 -12694 -36805 -47591 -30723
9259 -30723 -11413 4628 1623 -9051 3519 -14550 -31645 -27805 -19015 -24283 -23381 1140 -23417
$$ packed form
9350a5903K1265J4533O587J4023j5232k9218r004o568K2114J0087l6040k0595
9338d3951L934K8952K2963n706m7601k9422J6362J2668r530R829J2263J5612j6785
9325c0412J1007K1337q076L791K4203N49j278Q484m318k6925j2349K8092K7532
9312D1637j2455m4503q722p208o990J1404M985J0547j230N304Q981L797N427M511
9298A5485j7861J4313n517j1568n566R373n911j4451N071J1154j1925j3003P878
9285b2528L0198J1939K204j0748j4349K369P2m560j7134k4593J6429K6196o014
9272a0519N81K2320l822k8899k3014Q264R617J1962p594Q410k4111j0786J6868
9259c0723J9310J6041l005j0674J2570j8069j7095L840Q790n268R02K4521k4557
$$ plain form
9246 -23417 -39635 -11472 -12386 -39108 -31267 -23597 -3578 3558 -23306 6584 54762 43543 13166
9233 13166 -16944 -47675 -77601 -72797 -36243 -15225 -13090 -5435 -10230 3802 1356 -18217 -8504
9220 -8504 3675 6219 3553 10994 665 -29637 -14232 706 -18611 -27872 8970 39363 3575
9207 3575 14774 8399 -17679 -34798 -42888 -45283 -71175 -68015 -48053 -22547 -21074 -9176 6185
9194 6185 -1010 -27259 -42237 -46847 -26246 -7174 -6656 -8085 6069 12816 10237 -18116 7023
9181 7023 23856 22245 8602 -11125 19023 20968 7151 16311 14930 -3840 -15001 -36625 -17589
9168 -17589 -18119 -4669 -15928 9666 25137 18224 -11214 -38117 -53339 -43768 -11819 -2860 -24125
9155 -24125 -44299 -64539 -58616 -16556 21913 23492 506 -15051 -4068 -16364 -12732 16557
$$ packed form
9246b3417j6218K8163r14k6722P841P670K0019P136k6864K9890M8178j1219l0377
9233A3166l0110l0731k9926M804L6554K1018K135P655m795J4032k446j9573R713
9220h504J2179K544k666P441j0329l0302J5405J4938j9317r261L6842L0393l5788
9207C575J1199o375k6078j7119q090k395k5892L160J9962K5506J473J1898J5361
9194F185p195k6249j4978m610K0601J9072N18j429J4154O747k579k8353K5139
9181G023J6833j611j3643j9727L0148J945j3817R160j381j8770j1161k1624J9036
9168a7589n30J3450j1259K5594J5471o913k9438k6903j5222R571L1949Q959k1265
9155b4125k0174k0240N923M2060L8469J579k2986j5557J0983j2296L632K9289
$$ plain form
9143 16557 16047 2515 -11851 -26850 -3977 -2787 33944 54868 17254 -7339 -9426 -26127 -35728
9130 -35728 -36017 -11506 8037 89 14478 31048 35797 17596 28315 43721 51712 68700 70321
9117 70321 35530 31724 41903 38373 39918 46027 63774 79007 58442 45651 48149 73620 101972
9104 101972 87296 65756 36762 6658 395 -8478 -17098 13138 15392 -10311 -19533 -17524 -21433
9091 -21433 -12925 -10082 17941 24326 21614 8526 10816 23807 1966 18206 24577 -4907 -32934
9078 -32934 -34368 -38367 -25154 110 3526 1030 -26000 -16736 11597 -1315 9320 12833 16066
9065 16066 11420 25701 3133 -16183 -42878 -58636 -48026 -28003 -7190 -3323 31002 40751
9053 40751 29464 5744 23907 37757 39232 25907 16312 32790 20677 29037 70271 53625
$$ packed form
9143A6557n10j3532j4366j4999K2873J190L6731K0924l7614k4593k087j6701r601
9130c5728k89K4511J9543p948J4389J6570M749j8201J0719J5406P991J6988J621
9117G0321l4791l806J0179l530J545O109J7747J5233k0565j2791K498K5471K8352
9104A01972j4676k1540k8994l0104o263q873q620L0236K254k5703r222K009l909
9091b1433Q508K843K8023O385k712j3088K290J2991k1841J6240O371k9484k8027
9078c2934j434l999J3213K5264L416k496k7030R264K8333j2912J0635L513L233
9065A6066m646J4281k2568j9316k6695j5758J0610K0023K0813L867L4325R749
9053D0751j1287k3720J8163J3850J475j3325r595J6478j2113Q360M1234j6646
$$ plain form
9041 53625 34455 41281 33359 20033 -35853 -79859 -86220 -45942 -7682 -14239 -33212 -47159 -95562
9028 -95562 -96558 -51416 -42476 -34267 -25180 -938 13676 11722 -7593 1256 -17770 -2727 -13959
9015 -13959 -23937 -18038 -10079 -6775 -18640 -55137 -46523 -29405 -3376 5102 -18507 -9564 -14411
9002 -14411 -22765 -4598 -17641 -26316 -29669 -14293 -11381 -2384 19527 20972 -5472 -14515 -8014
8989 -8014 -15556 -29051 -31954 -19736 -15004 -14105 -2581 -2678 -16789 6776 14329 -1982 -11086 -18128
8975 -18128 -44733 -38165 5703 3546 -9005 6085 -951 -10905 -5937 -2837 -11354 -20700 -33145
8962 -33145 -50034 -26875 -18581 -56297 -40209 -44458 -43422 -16985 -42282 -60851 -49402 -31393
8950 -31393 -31685 -13509 13963 20123 6574 -6613 -20136 -12665 20359 17797 -8474 -3160 4082
$$ packed form
9041E3625j9170O826p922j3326n5886m4006o361M0278L8260o557j8973j3947m8403
9028i5562r96M5142Q940Q209R087K4242J4614j954j9315Q849j9026J5043j1232
9015a3959r978N899P959L304j1865l6497Q614J7118K6029Q478k3609Q943m847
9002a4411q354J8167j3043q675l353J5376K912Q997K1911J445k6444r043O501
8989h014p542j3495k903J2218M732Q99J1524r7j4111K3565P553j6311r104p042
8975a8128k6605O568M3868k157j2551J5090p036r954M968L100q517r346j2445
8962c3145j6889K3159Q294l7716J6088m249J036K6437k5297j8569J1449J8009
8950c1393k92J8176K7472O160j3549j3187j3523P471L3024k562k6271N314P242
$$ plain form
8937 4082 4676 -6970 -7985 14761 53150 56882 14232 -6879 -2675 -10785 21621 32080 35674
8924 35674 30048 10193 7908 -1134 -17670 20562 29985 17558 6388 15436 33370 49787 30823
8911 30823 1551 -2611 -21847 -47634 -47797 -29442 -46962 -38959 -29469 -5339 13783 -4172 12716
8898 12716 29568 10949 2581 -5017 -22315 -30265 -23367 9647 34929 25402 15011 -4915 -21452
8885 -21452 4356 4348 36213 42959 7588 -23108 -14667 -20491 -21615 -6660 4141 19801 16020 -7382
8871 -7382 -12137 -3144 28759 5585 6273 12264 25573 24630 8224 18719 13904 22472 29507 46862
8857 46862 41090 29309 6412 -9003 29305 23308 18482 -1578 -25102 -25263 -21570 3911 21553
8844 21553 14064 -9790 -1146 -10625 -21122 -35330 -43732 -15004 4833 -19212 -506 12333 3413
$$ packed form
8937D082N94j1646j015K2746L8389L732m2650k1111M204q110L2406J0459L594
8924C5674n626j9855k285r042j6536L8232R423j2427j1170R048J7934J6417j8964
8911C0823k9272m162j9236k5787j63J8355j7520Q003R490K4130J9122j7955J6888
8898A2716J6852j8619q368p598j7298p950O898L3014K5282r527j0391j9926j6537
8885b1452K5808qL1865O746l5371l0696Q441n824j124J4955J0801J5660l781k3402
8871g382m755Q993L1903k3174O88N991J3309r43j6406J0495m815Q568P035J7355
8857D6862n772j1781k2897j5415L8308n997m826k0060k3524j61L693K5481J7642
8844B1553p489k3854Q644r479j0497j4208q402K8728J9837k4045J8706J2839q920
$$ plain form
8831 3413 -3718 -35324 -28225 -14287 -8687 15806 -7462 -17445 134 -4268 -26047 61 23277
8818 23277 22277 74 282 26348 38234 29220 3415 5947 -18440 -11332 -8094 -40074 -7822
8805 -7822 -25004 -63517 -50504 -6343 35986 41162 -8444 -33210 -12364 3198 13617 7083
8793 7083 6350 11223 -8286 -21351 -37210 -54585 -62782 -32836 -19637 -1504 8291 9047 -1787
8780 -1787 -23162 -654 2555 -11121 -17964 -36067 -27377 -19760 -17133 -9509 2581 12625 18080
8767 18080 8707 -16092 -21524 -538 -11029 -17041 -42183 -44075 -53649 -60217 -24470 -51120 -77200
8754 -77200 -57747 -39885 -35968 -12409 -35390 -53027 -34091 -25962 -23167 -30643 -25260 9404 22981
8741 22981 13206 7916 -25928 -28424 331 4375 -12545 -14370 -17412 -7603 21535 27351 40358
$$ packed form
8831C413p131l1606P099J3938N600K4493k3268r983J7579m402k1779K6108K3216
8818B3277j000k2203K08K6066J1886r014k5805K532k4387P108L238l1980L2252
8805g822j7182l8513J3013M4161M2329N176m9606k4766K0846J5562J0419o534
8793G083p33M873j9509j3065j5859j7375q197K9946J3199J8133R795P56j0834
8780a787k1375K2508L209j3676o843j8103Q690P617K627P624J2090J0044N455
8767A8080r373k4799n432K0986j0491o012k5142j892r574o568L5747k6650k6080
8754g7200J9453J7862L917K3559k2981j7637J8936Q129K795p476N383L4664J3577
8741B2981r775n290l3844k496K8755M044j6920j825l042R809K9138N816J3007
$$ plain form
8728 40358 47683 49535 8797 -17981 -44092 -55663 -16334 860 -16471 -20228 -13020 -19119 -28883
8715 -28883 -26736 717 -5511 -23297 -23368 -19935 5364 7383 28846 34416 13744 -4907 -13791 -23401
8701 -23401 -3204 25900 26944 -15448 -21299 -30943 -59852 -76268 -56304 -13084 20435 47606
8689 47606 2947 -28700 -24646 -15979 -10119 -10324 8609 6216 11049 -11647 -12001 -16094 -12876 -26142
8675 -26142 -44909 -34756 -38572 -33197 -9281 23150 11792 -3147 -10042 -4762 552 -7931 13018
8662 13018 27043 16981 12347 -18607 -10905 -22594 -43323 -45214 -17128 -2862 -3647 -3003 12582
8649 12582 16189 23038 14334 -3241 34754 12948 -4920 -11533 -22732 -39263 -26033 -25355 -16518
8636 -16518 15227 13158 -8899 13254 17600 3713 17688 18185 34692 33258 -2498 -25368 -19489
$$ packed form
8728D0358P325J852m0738k6778k6111j1571L9329J7194j7331l757P208o099r764
8715b8883K147K7453o228j7786p1L433K5299K019K1463N570k0672j8651q884r610
8701b3401K0197K9104J044m2392n851r644k8909j6416J9964M3220L3519K7171
8689D7606m4659l1647M054Q667N860k05J8933k393M833k2696l54m093L218j3266
8675b6142j8767J0153l816N375K3916L2431j1358j4939o895N280N314q483K0949
8662A3018J4025j0062m634l0954P702j1689k0729j891K8086J4266p85O44J5585
8649A2582L607O849q704j7575L7995k1806j7868o613j1199j6531J3230O78Q837
8636a6518L1745k069k2057K2153M346j3887J3975M97J6507j434l5756k2870N879
$$ plain form
8623 -19489 15411 20114 341 -22653 -23624 -22742 -36538 -17707 -38291 -31767 8550 30869 42589
8610 42589 21304 18203 5705 -18176 -4635 6651 13590 32141 33479 2061 -7343 6043 -1053
8597 -1053 3550 17829 38020 57150 48609 22114 1815 -10259 -11457 44714 41615 11193 6404
8584 6404 -6728 18273 21834 -3186 -8650 -3663 -4092 -16908 -30061 -8190 6340 17528 27095
8571 27095 12417 28816 37939 58054 42513 8676 4897 29041 41741 44121 33283 -2927
8559 -2927 -22686 -18698 -20693 -12997 12557 9698 -20254 -26998 -31467 -39459 5261 29588 26925 2751
8545 2751 -33362 -12344 -5249 -28840 -45659 -47807 -38179 6787 30606 54995 46620 28615 38978
8532 38978 47584 28641 21499 27346 33250 23865 9562 -12290 -1574 10161 28658 16019 26212
$$ packed form
8623a9489L4900M703j9773k2994r71Q82j3796J8831k0584O524M0317K2319J1720
8610D2589k1285l101j2498k3881J3541J1286O939J8551J338l1418r404J3386p096
8597a053M603J4279K0191J9130q541k6495k0299j2074j198N6171l099l0422m789
8584F404j3132K5001L561k5020n464M987m29j2816j3153K1871J4530J1188R567
8571B7095j4678J6399R123K0115j5541l3837l779K4144J2700K380j0838l6210
8559b927j9759L988j995P696K5554k859k9952o744m469p992M4720K4327k663k4174
8545B751l6113K1018P095k3591j6819k148R628M4966K3819K4389q375j8005J0363
8532C8978Q606j8943p142N847N904r385j4303k1852J0716J1735J8497j2639J0193
$$ plain form
8519 26212 8256 -27068 -12638 21138 19537 11590 14394 9559 8306 28964 35780 43167 59835
8506 59835 60248 54611 35335 48976 59925 51506 13034 9401 4336 -1331 23104 9017 -1725
8493 -1725 -13710 -31630 -9666 25932 -791 -34173 -31099 -28475 -29930 -105 9712 18535 11830
8480 11830 10129 14161 -8966 -39419 -25037 -3207 -32180 -35020 -20273 -5854 -14442 9434 27237
8467 27237 19609 -6852 -32554 -30056 -19 9319 -8095 -16692 -9793 -34406 -49014 -26543 14156
8454 14156 14770 -17860 -28135 5795 28224 21825 7609 115 15562 25394 12880 15101 41324
8441 41324 30605 43440 24868 3254 9096 41656 39283 5179 9366 33143 2816 -11926
8429 -11926 23866 49258 47699 53104 61310 56590 25574 8763 7907 13393 2480 -28727 -18496
$$ packed form
8519B6212j7956l5324J4430L3776j601p947K804m835j253K0658O816P387J6668
8506E9835M13n637j9276J3641J0949q419l8472l633n065n667K4435j4087j0742
8493a725j1985j7920K1964L5598k6723l3382L074K624j455K9825R817Q823o705
8480A1830j701M032k3127l0453J4382K1830k8973k840J4747J4419q588K3876J7803
8467B7237p628k6461k5702K498L0037R338j7414q597O899k4613j4608K2471M0699
8454A4156O14l2630j0275L3930K2429o399j4216p494J5447R832j2514K221K6223
8441D1324j0719J2835j8572k1614N842L2560k373l4104M187K3777l0327j4742
8429a1926L5792K5392j559N405Q206m720l1016j6811q56N486j0913l1207J0231
$$ plain form
8416 -18496 -3463 2945 23849 43823 18099 -5773 -13876 -37214 -22547 -5026 2252 -3105 -17771
8403 -17771 -23954 -16040 -16705 -11196 4620 -5580 -21133 -24087 -13773 19750 21812 14956 -6971
8390 -6971 -7020 7763 33573 66854 70176 91192 79596 60373 72157 93588 100352 69819 45764
8377 45764 32079 32010 50925 23383 2938 -29487 -18372 4363 -14172 -14430 -5665 29211 41275
8364 41275 60107 60828 54328 35313 11868 14237 38654 34258 26379 14467 9033 -7568 -9693
8351 -9693 -29322 -28283 -30020 -4488 5828 10787 -21996 -29964 -9125 13817 44803 76534 105465
8338 105465 121704 113236 109043 87920 62691 18701 -36465 -23433 10191 14620 22577 13123 11778
8325 11778 26020 28036 24022 11934 19946 14876 14132 11146 17567 32956 32186 29931 22922 -14313
$$ packed form
8416a8496J5033O408K0904J9974k5724k3872q103k3338J4667J7521P278n357j4666
8403a7771o183P914o65N509J5816j0200j5553k954J0314L3523K062o856k1927
8390f971m9J4783K5810L3281L322K1016j1596j9223J1784K1431O764l0533k4055
8377D5764j3685o9J8915k7542k0445l2425J1115K2735j8535k58Q765L4876J2064
8364D1275J8832P21o500j9015k3445K369K4417m396p879j1912n434j6601k125
8351i693j9629J039j737K5532J0316M959l2783p968K0839K2942L0986L1731K8931
8338A05465J6239q468m193k1123k5229m3990n5166J3032L3624M429P957r454j345
8325A1778J4242K016m014j2088Q012n070p44k986O421J5389p70k255p009l7235
$$ plain form
8311 -14313 -27256 -11548 -2297 9003 21493 -8385 -16411 -30096 -42534 -15697 7713 40791
8299 40791 63943 33931 24348 77906 97332 91144 61669 50948 69611 68051 63314 23628 7817
8286 7817 7726 18184 36547 25368 -724 -40467 -57920 -46648 -21866 2428 -29484 -49693 -41605
8273 -41605 -39445 -43939 -24017 -18457 -10978 -12442 -19733 -16710 -6042 -33072 -32044 -14129 1459
8260 1459 -1809 -13349 -33928 -13313 9774 30176 27465 -13951 -21644 -9047 9141 13408 -62
8247 -62 -9111 24981 48237 30782 38965 52721 29382 -26787 -23131 -14253 885 6113 -4624
8234 -4624 -6922 919 -2034 -27075 -31150 -39938 -42099 -17016 42202 18007 -8981 14436 35411
8221 35411 25015 -4187 -20254 -16954 -12459 -349 -18493 -26372 -40807 -35798 -3255 4589 7755
$$ packed form
8311a4313j2943J5708R251J1300J2490k9878q026j3685j2438K6837K3410L3078
8299D0791K3152l0012r583N3558J9426o188k9475j0721J8663j560m737l9686j5811
8286G817r1J0458J8363j1179k6092l9743j7453J1272K4782K4294l1912k0209Q088
8273d1605K160m494J9922N560P479j464p291L023J0668k7030J028J7915J5588
8260A459l268j1540k0579K0615K3087K0402k711m1416p693J2597J8188M267j3470
8247f2r049L4092K3256j7455Q183J3756k3339n6169L656Q878J5138N228j0737
8234d624k298P841k953k5041m075q788k161K5083N9218k4195k6988K3417K0975
8221C5411j0396k9202j6067L300M495J2110j8144p879j4435N009L2543P844L166
$$ plain form
8208 7755 2307 -3897 17248 -905 -21557 -25278 -16732 -36396 -73351 -79956 -63636 -17727 -15635
8195 -15635 -27879 -34894 14192 48754 52564 44543 44402 28188 29061 35307 9438 13825 8446 -16091
8181 -16091 -11097 -22917 -172 11670 -30441 -47070 -47476 -36877 -6651 29243 9734 -20359
8169 -20359 -7265 3942 -12103 -32286 -35295 -20311 2367 47 4743 -16726 -15649 -39701 -60754
8156 -60754 -45717 -28139 -36511 -34499 -39905 -47861 -26304 -31024 -42243 -27828 4782 8860 3191
8143 3191 -7326 -13674 -15105 8215 30885 40302 36041 26467 -16877 -31041 -30581 -19491 -11754 -12218
8129 -12218 2278 26483 9104 -6799 -13429 -12604 -2631 10010 11701 3946 23641 -3489 -12995
8116 -12995 -27354 -20135 10326 28204 2425 -17691 5578 8079 8697 10057 1625 -16856 -7652
$$ packed form
8208G755n448o204K1145j8153k0652l721Q546j9664l6955o605J6320M5909K092
8195a5635j2244p015M9086L4562L810q021j41j6214Q73O246k5869M387n379k4537
8181a6091M994j1820K2745J1842m2111j6629m06J0599L0226L5894j9509l0093
8169b0359J3094J1207j6045k0183l009J4984K2678k320M696k1469J077k4052k1053
8156f0754J5037J7578q372K012n406p956K1557m720j1219J4415L2610M078n669
8143C191j0517o348j431K3320K2670R417m261r574m3344j4164M60J1090P737m64
8129a2218J4496K4205j7379j5903o630Q25R973J2641J691p755J9695k7130r506
8116a2995j4359P219L0461J7878k5779k0116K3269K501O18J360q432j8481R204
$$ plain form
8103 -7652 1490 -5626 -23820 -50133 -50281 -31429 -39242 -4130 27815 45358 54413 54002 31535 11560
8089 11560 28182 26333 24190 22817 33174 46868 43131 32286 32786 43200 29766 21327 12028
8076 12028 -14877 7746 32518 9607 12907 13868 36218 33311 7493 -30873 -11486 965 3356
8063 3356 20541 26222 -2800 -55499 -68655 -30528 -25652 -47194 -57775 -64459 -27678 -14175 -7120
8050 -7120 -1802 -7705 18377 490 -20248 -18348 3212 -37700 -56687 -23939 8961 13460 -14083
8037 -14083 -30737 -35581 -34875 -50574 -43783 -19475 -2389 -6740 -12606 -12267 -13935 -5256 23086 24895
8023 24895 -65 27321 56647 -1309 -2521 -171 3448 5016 5286 7344 25059 34198 41533 83895
8009 83895 93014 59844 33108 43297 42501 33936 45515 24455 986 14252 48349 54873 52502
$$ packed form
8103g652R142p116j8194k6313j48J8852p813L5112L1945J7543R055m11k2467j9975
8089A1560J6622j849k143j373J0357J3694l737j0845N00J0414j3434q439r299
8076A2028k6905K2623K4772k2911L300R61K2350k907k5818l8366J9387J2451K391
8063C356J7185N681k9022n2699j3156L8127M876k1542j0581o684L6781J3503P055
8050g120N318n903K6082j7887k0738J900K1560m0912j8987L2748L2900M499k7543
8037a4083j6654m844P06j5699O791K4308J7086m351n866L39j668Q679K8342J809
8023B4895k4960K7386K9326n7956j212K350L619J568K70K058J7715R139P335M2362
8009H3895R119l3170k6736J0189p96q565J1579k1060k3469J3266L4097O524k371
$$ plain form
7996 52502 34349 32393 21137 32275 39460 29238 30704 29099 4589 -3203 68 -1515 -16317
7983 -16317 -24165 1110 4776 -1740 -3498 -3404 6867 21098 28247 9367 1264 -11090 6936 8527
7969 8527 -3309 25487 34535 28820 32879 34886 14387 13965 7267 -21718 -32555 -11707 13880
7956 13880 3325 -27400 -9730 22408 17023 -3603 -3724 -16365 -39816 -14579 25747 33416 26463
7943 26463 1780 -32838 -42084 -23358 -14504 -42883 -32973 206 13192 43686 58977 26606
7931 26606 3830 -13910 5208 27075 7247 -29910 -39561 12376 27295 2751 -13642 -20694
7919 -20694 -8020 6210 19418 -1779 -10597 -17628 433 15977 -4296 -2165 12101 -18866
7907 -18866 -47994 -25834 3774 -32026 -42678 -35216 -18350 -7301 16805 -1405 6386 24700
$$ packed form
7996E2502j8153j956j1256J1138P185j0222J466j605k4510p792L271j583j4802
7983a6317p848K5275L666o516j758R4J0271J4231P149j8880q103j2354J8026J591
7969H527j1836K8796R048n715M059K007k0499m22o698k8985j0837K0848K5587
7956A3880j0555l0725J7670L2138n385k0626j21j2641k3451K5237M0326P669o953
7943B6463k4683l4618r246J8726Q854k8379R910L3179J2986L0494J5291l2371
7931B6606k2776j7740J9118K1867j9828l7157r651N1937J4919k4544j6393p052
7919b0694J2674J4230J3208k1197q818p031J8061J5544k0273K131J4266l0967
7907a8866k9128K2160K9608l5800j0652P462J6866J1049K4106j8210P791J8314
$$ plain form
7895 24700 9669 -10880 -9800 -2817 9008 26418 32349 37447 15377 9792 -7851 -42148 -16033
7882 -16033 19712 32077 23228 -15610 -18760 5128 17812 15425 8737 -12780 -10753 27512 57877
7869 57877 24588 -2871 5018 -26850 -52887 -35426 26146 23547 -2591 -20107 -46395 -75776
7857 -75776 -76667 -65220 -27320 -2330 -15656 -25076 -12812 8890 -1158 4463 7234 -872 -2801
7844 -2801 9166 21188 13904 -5288 -18194 -22865 -29859 -25729 -21137 22055 57654 25417 -2147
7831 -2147 -4458 7284 19362 -10605 -46601 -54648 -34656 -18030 -9354 7592 7444 16844 -6580
7818 -6580 -10440 -32010 -50773 -44044 -44865 -29916 -23245 -17005 -28852 -49377 -31990 -43354 -50463
7805 -50463 -60083 -33237 -9233 2341 3370 -665 9312 19188 10806 -11529 -60553 -87472 -72377
$$ packed form
7895B4700j5031k0549J080O983J1825J7410N931N098k2070n585j7643l4297K6115
7882a6033L5745J2365q849l8838l150K3888J2684k387o688k1517K027L8265L0365
7869E7877l3289k7459P889l1868k6037J7461O1572k599k6138j7516k6288k9381
7857g5776q91J1447L7900K4990j3326r420J2264K1702j0048N621K771q106j929
7844b801J1967J2022p284j9192j2906m671o994M130M592M3192L5599l2237k7564
7831b147k311J1742J2078k9967l5996q047J9992J6626Q676J6946j48R400k3424
7818f580l860k1570j8763O729q21J4949O671O240j1847k0525J7387j1364p109
7805e0463r620K6846K4004J1574J029m035R977R876q382k2335m9024k6919J5095
$$ plain form
7792 -72377 -63580 -35571 -32460 -15703 -16193 10582 15221 11823 30940 -1867 -48186 -59641 -60448
7779 -60448 -44828 -21657 3243 11799 11516 15548 -5791 -33184 -45455 -31254 -13844 706 24925
7766 24925 1704 -15467 -14325 -1238 24365 39253 20736 595 -1924 7773 16089 12917 -6168
7753 -6168 -16663 -9934 -463 10168 7213 -15471 -9332 21210 41510 40542 43381 26215 18441 2124
7739 2124 -22896 -16406 7084 25209 14581 12631 36316 5060 -14740 7048 25099 21113 18172
7726 18172 8385 -46809 -32671 -4202 4108 -5491 11 8024 20641 12722 13701 -7892 -21848
7713 -21848 -34028 -30185 -27712 -17751 17822 4076 6498 5300 13985 -1061 3541 -3525 -26917
7700 -26917 -12200 2623 2415 28641 10898 -13542 -1522 -10462 -19113 -23067 -17456 -9334 -3067
$$ packed form
7792g2377Q797K8009L111J6757m90K6775M639l398J9117l2807m6319j1455q07
7779f0448J5620K3171K4900Q556k83M032k1339k7393j2271J4201J7410J4550K4219
7766B4925k3221j7171J142J3087K5603J4888j8517k0141k519R697Q316l172j9085
7753f168j0495O729R471J0631k955k2684O139L0542K0300r68K839j7166p774j6317
7739B124k5020O490K3490J8125j0628j950K3685l1256j9800K1788J8051l986k941
7726A8172r787n5194J4138K8469Q310r599N502Q013J2617p919R79k1593j3956
7713b1848j2180L843K473R961L5573j3746K422j198Q685j5046M602p066k3392
7700b6917J4717J4823k08K6226j7743k4440J2020q940q651l954N611Q122O267
$$ plain form
7687 -3067 -3675 -19036 -16084 -24374 1023 15705 -193 -3912 9021 11652 17372 42127 40385 38041
7673 38041 12411 -5202 9131 -4211 -4232 9827 -6166 -9678 -37135 -29204 -22936 7292 -20515
7660 -20515 3584 39746 42600 15771 10284 9741 4062 -12115 -19677 -30383 -64319 -49261 -41903
7647 -41903 -30236 -6641 26005 31233 -792 2000 5030 3759 19121 3692 1204 6344 19480
7634 19480 -199 -20620 -22548 -406 25128 -3672 -19116 -8929 17417 29554 2304 -20952
7622 -20952 -17409 -19204 9858 17271 2902 -18514 -14639 13233 12498 -677 -23826 -13824 -10382
7609 -10382 -19298 -5591 -24528 -23708 -7993 7601 -706 3350 15596 8637 15459 19345 32346
7596 32346 19560 6790 -16948 -23222 -53778 -78205 -38887 -3347 -11538 -19238 -8297 19768
$$ packed form
7687c067o08j5361K952q290K5397J4682j5898l719J2933K631N720K4755j742k344
7673C8041k5630j7613J4333j3342k1J4059j5993l512k7457P931O268L0228k7807
7660b0515K4099L6162K854k6829n487n43n679j6177p562j0706l3936J5058P358
7647d1903J1667K3595L2646N228l2025K792L030j271J5362j5429k488N140J3136
7634A9480j9679k0421j928K2142K5534k8800j5444J0187K6346J2137k7250k3256
7622b0952L543j795K9062P413j4369k1416L875K7872p35j3175k3149J0002L442
7609a0382q916J3707j8937Q20J5715J5594q307M056J2246o959O822L886J3001
7596C2346j2786j2770k3738o274l0556k4427L9318L5540q191p700J0941K8065
$$ plain form
7584 19768 3349 1140 6082 473 10544 11863 8439 -43245 -32334 -26993 -15382 3615 -9879
7571 -9879 -29694 -25877 -3552 -3531 12446 29048 21214 6027 15102 16871 10740 19721 13617 16487
7557 16487 20467 20935 -11564 -31110 -19008 4021 15693 20538 -5381 17343 14897 17337 -5220
7544 -5220 6669 -11637 -25750 4583 31917 20614 3615 22319 25916 26959 24123 20849 16340
7531 16340 23906 28307 55571 48540 31150 -6492 -26422 -29078 -9877 -4977 -17588 -41305 -5617
7518 -5617 22989 15925 10682 -9425 -10051 2985 -25472 -3961 17025 -10314 -37729 -32042 -44246
7505 -44246 -53705 -40454 -8108 -12962 -26243 -18059 -6500 3751 5487 21056 38897 31408 13750
7492 13750 -13850 -758 20730 34978 26297 30724 6046 -17527 -50822 -59301 -24792 -51764
$$ packed form
7584A9768j6419k209M942n609J0071J319l424n1684J0911N341J1611J8997j3494
7571i879j9815L817K2325K1J5977J6602p834j5187R075J769o131Q981o104K870
7557A6487L980M68l2499j9546J2102K3029J1672M845k5919K2724k446K440k2557
7544e220J1889j8306j4113L0333K7334j1303j6999J8704L597J043k836l274m509
7531A6340P566M401K7264p031j7390l7642j9930k656J9201M900j2611k3717L5688
7518e617K8606p064n243k0107o26J3036k8457K1511K0986k7339k7415N687j2204
7505d4246r459J3251L2346m854j3281Q184J1559J0251J736J5569J7841p489j7658
7492A3750k7600J3092K1488J4248q681M427k4678k3573l3295q479L4509k6972
$$ plain form
7480 -51764 -81939 -71430 -43516 -53049 -38256 -28688 -30360 -27562 -36073 -83745 -46540 24150 32893
7467 32893 7301 2170 5460 1570 -12905 -8962 10963 4014 4333 -14216 -2220 11933 17848
7454 17848 17672 25018 3468 19200 38135 17370 -11865 -7195 25168 23882 507 11916 9826
7441 9826 7523 8800 10851 12050 27477 37393 8274 -4506 -2951 -13406 3674 -6788 8455
7428 8455 -7274 -26779 -34832 -16478 -2491 4851 17912 24056 19225 -3481 8610 22415 18411
7415 18411 -12316 -30209 -39741 -46339 -12077 8330 -6200 -16685 587 31213 9327 -5406
7403 -5406 -3398 -349 -9491 -24042 1212 6909 18244 26877 -4012 -17980 -11156 -13698 11351
7390 11351 13225 -7801 -6376 -17342 -21548 -20133 -20714 -7883 6720 24017 32668 43986 17558
$$ packed form
7480e1764l0175J0509K7914r533J4793R568j672K798q511m7672L7205P0690Q743
7467C2893k5592n131L290l890j4475L943J9925o949L19j8549J1996J4153N915
7454A7848j76P346k1550J5732J8935k0765k9235M670L2363j286k3375J1409k090
7441I826k303J277K051J199J5427R916k9119j2780J555j0455J7080j0462J5243
7428H455j5729j9505q053J8354J3987P342J3061O144m831k2706J2091J3805m004
7415A8411l0727j7893r532o598L4262K0407j4530j0485J7272L0626k1886j4733
7403e406K008L049r142j4551K5254N697J1335Q633l0889j3968O824k542K5049
7390A1351J874k1026J425j0966m206J415n81J2831J4603J7297Q651J1318k6428
$$ plain form
7377 17558 -14755 -802 11233 6086 5979 -8509 -36117 -44045 -15245 -4839 -16781 -28936 -59403
7364 -59403 -63422 -49774 -9931 22882 36382 21611 -11880 -25059 -10912 18283 42334 54396
7352 54396 45609 31723 -6311 -18230 6892 13672 22658 21083 26594 8688 9400 11457 26227
7339 26227 63181 40723 -7869 -8247 12036 10581 22594 23038 35332 19140 7933 -8464 -35445
7326 -35445 -45972 -66969 -56913 -17722 -21905 -13044 -8028 -19492 -16658 -23595 19638 23755 4306
7313 4306 12913 29679 57983 37136 42090 43996 37432 6127 -9107 -75 -14230 -17083 -23177
7300 -23177 -31904 -38807 -39947 -17894 -22113 -50749 -41931 -37924 -34703 -5389 8652 7194 -9225
7287 -9225 -2723 -8599 -35103 -72744 -75057 -39082 -15932 -6027 7308 -3590 -9729 -8499 -11900
$$ packed form
7377A7558l2313J3953J2035n147j07j4488k7608p928K8800J0406j1942j2155l0467
7364e9403m019J3648L9843L2813J3500j4771l3491j3179J4147K9195K4051J2062
7352E4396q787j3886l8034j1919K5122O780Q986j575N511j7906P12K057J4770
7339B6227L6954k2458m8592l78K0283j455J2013M44J2294j6192j1207j6397k6981
7326c5445j0527k0997J0056L9191m183Q861N016j1464K834o937M3233M117j9449
7313D306Q607J6766K8304k0847M954J906o564l1305j5234R032j4155k853o094
7300b3177q727o903j140K2053m219k8636Q818M007L221K9314J4041j458j6419
7287i225O502n876k6504l7641k313L5975K3150R905J3335j0898o139J230l401
$$ plain form
7274 -11900 3338 -2987 3831 11199 -8994 -9161 -807 6903 -5747 -441 296 8526 14995 -17649
7260 -17649 -32138 -40724 -48044 -21594 -16885 -47238 -47185 -23631 -30216 -36795 -30117 -13995 8772 -10076
7246 -10076 -31887 -17713 -6229 -20924 -50915 -29147 -21179 9383 15202 -7061 -32453 -15404
7234 -15404 -25189 -38168 -55176 -29370 -30549 -38846 -23310 1529 6364 19070 15304 -10785 -62751
7221 -62751 -72683 -76217 -57198 -67948 -68846 -42115 -36001 -7601 12721 22662 11062 6377 31859
7208 31859 35799 24896 22494 31952 20260 -6371 -4481 -10136 -26329 -31845 -39102 -29428 -36090 -38193
7194 -38193 -20932 -329 16224 37250 44089 33464 26106 -6623 -17289 -10760 -14055 -25777 -42169
7181 -42169 -53916 -59365 -46594 -43943 -14430 16802 68285 87750 63628 30617 8976 17465
$$ packed form
7274a1900J5238o325O818P368k0193j67Q354P710j2650N306P37Q230O469l2644
7260a7649j4489q586p320K6450M709l0353N3K3554o585o579O678J6122K2767j8848
7246a0076k1811J4174J1484j4695k9991K1768P968L0562N819k2263k5392J7049
7234a5404r785j2979j7008K5806j179q297J5536K4839M835J2706l766k6089n1966
7221f2751r932l534J9019j0750q98K6731O114K8400K0322R941j1600m685K5482
7208C1859L940j0903k402R458j1692k6631J890n655j6193n516p257R674o662k103
7194c8193J7261K0603J6553K1026O839j0625p358l2729j0666O529l295j1722j6392
7181d2169j1747n449J2771K651K9513L1232N1483J9465k4122l3011k1641Q489
$$ plain form
7169 17465 38621 25210 29039 -20048 -30468 -16534 -2830 8759 -14051 -29207 1759 45052
7157 45052 37848 40470 17267 -25582 -4750 6628 2430 3580 -21915 -34772 -39407 -32061 -12429
7144 -12429 13993 12088 -6034 -4901 -28249 -35795 20009 13464 -12291 14396 38118 25656 4656
7131 4656 -20701 -44008 -34858 -38599 -29601 -23727 -9370 -6860 -26649 -9092 -3706 -49709 -79952
7118 -79952 -64524 -49043 -4218 35467 31337 6574 -12411 -41861 -52365 -46758 -18635 8075
7106 8075 29236 39470 15632 -11949 -49471 -49257 -21485 -24300 -20164 -15184 -23726 -8460 104
7093 104 3422 2811 -30807 -27418 -2731 16944 -4339 720 3197 4777 21167 9577 -28344 -29884
7079 -29884 -20873 -21694 -11775 -16108 -16843 -9393 -14733 -15123 -5970 12363 24856 28785 24232 13484 16345
$$ packed form
7169A7465K1156j3411L829m9087j0420J3934J3704J1589k2810j5156L0966M3293
7157D5052p204K622k3203m2849K0832J1378m198J150k5495j2857m635P346J9632
7144a2429K6422j905j8122J133k3348p546N5804o545k5755K6687K3722j2462k1000
7131D656k5357k3307R150l741Q998N874J4357K510j9789J7557N386m6003l0243
7118g9952J5428J5481M4825L9685m130k4763j8985k9450j0504N607K8123K6710
7106H075K1161J0234k3838k7581l7522K14K7772k815M136M980q542J5266Q564
7093A04L318o11l3618L389K4687J9675k1283N059K477J580J6390j1590l7921j540
7079b9884R011q21R919m333p35P450n340l90R153J8333J2493L929m553j0748K861
$$ plain form
7064 16345 40705 40045 37725 51888 49618 13272 -15688 -28514 -10319 12269 -12990 -33909 -19507
7051 -19507 -2744 6830 -6840 1009 -3234 -283 6310 -2898 -7530 -21365 -24795 -29182 -7648 16844
7037 16844 31496 25172 41316 44704 10979 -22893 -55999 -46352 -12455 -15456 -21860 -4159 -668
7024 -668 -18930 -9781 13766 1642 -2376 -10564 7819 6910 -6833 -4311 4765 36976 56553 15420
7010 15420 -16203 -29509 -24593 -31248 -24497 -30026 -42567 -10804 -15094 -19300 -17114 -4347 -8786
6997 -8786 -47534 -80919 -77913 -97662 -113105 -97158 -92588 -72570 -42644 -19805 9604 -3 -5549
6984 -5549 2602 1232 5726 983 -25689 -33416 20245 23501 8068 -10581 9577 30122 12228
6971 12228 -11783 -29705 -24219 6761 3026 6037 -12070 -10369 11655 9718 35601 69195 78199
$$ packed form
7064A6345K4360o60k320J4163k270l6346k8960j2826J8195K2588k5259k0919J4402
7051a9507J6763R574j3670P849m243K951O593r208m632j3835l430m387K1534K4492
7037A6844J4652o324J6144L388l3725l3872l3106R647L3897l001o404J7701L491
7024f68j8262R149K3547j2124m018q188J8383r09j3743K522R076L2211J9577m1133
7010A5420l1623j3306M916o655O751n529j2541L1763m290m206K186J2767m439
6997h786l8748l3385L006j9749j5443J5947M570K0018K9926K2839K9409r607n546
6984e549Q151j370M494m743k6672p727N3661L256j5433j8649K0158K0545j7894
6971A2228k4011j7922N486L0980l735L011j8107J701K2024j937K5883L3594R004
$$ plain form
6958 78199 41430 19580 28158 45230 52938 27151 23563 46561 70816 37388 3049 -2835 -11498
6945 -11498 -20544 -19443 17397 34466 29340 -8698 -37739 -30908 -45348 -42318 -49370 -40357 -28894
6932 -28894 -10156 1066 -47146 -45631 -7049 -1183 -17448 -3707 -9717 -13187 27156 28153 36049
6919 36049 21902 25350 10936 -14599 -14168 4925 -9909 -23151 -25830 -17950 16366 10817 -7799
6906 -7799 2544 -3542 -20901 -13653 -43102 -42995 -36371 -8050 21524 35962 46780 37402 7715
6893 7715 -23247 -7915 6875 -12483 -487 21976 9943 -14984 7146 5497 947 -9456
6881 -9456 14467 -8485 -39196 -38481 -20722 -37095 -53092 -47827 -49704 -45783 -28500 -29925 -33454
6868 -33454 -42068 -45686 -22720 -2727 -12041 -19754 5784 16017 26770 39629 18190 4875 -932
$$ packed form
6958G8199l6769k1850Q578J7072P708k5787l588K2998K4255l3428l4339n884q663
6945a1498r046J101L6840J7069n126l8038k9041O831j4440L030p052R013J1463
6932b8894J8738J1222m8212J515L8582N866j6265J3741o010l470M0343R97P896
6919C6049j4147L448j4414k5535M31J9093j4834j3242k679P880L4316n549j8616
6906g799J0343o086j7359P248k9449J07O624K8321K9574J4438J0818r378k9687
6893G715l0962J5332J4790j9358J1996K2463j2033k4927K2130j649m550j0403
6881i456K3923k2952l0711P15J7759j6373j5997N265j877L921J7283j425l529
6868c3454q614l618K2966J9993r314p713K5538J0233J0753J2859k1439j3315n807
$$ plain form
6855 -932 -4346 -41569 -44309 13503 48686 30826 21122 23437 23788 27301 21513 -7593 -17390 22150
6841 22150 55291 15562 20198 17772 -18715 -21060 -44586 -70726 -57297 -58400 -25015 -13185 -22446
6828 -22446 -17879 -28874 -34977 -48709 -72134 -54213 -34268 -32659 -16296 -17039 -17794 918 506 -16591
6814 -16591 -39436 -5024 14293 12066 8069 15179 -5966 -56024 -70299 -41747 -34115 -34331 -31309
6801 -31309 -36390 -35131 -8364 -13200 -16054 24963 39600 26832 28929 36169 38458 28541 347
6788 347 8954 7425 5403 25279 53841 63664 40808 3220 -13837 -20374 15110 12548 -14720
6775 -14720 -1158 -344 -7202 1319 11333 1683 5188 -24059 -46727 -26815 11018 33904 24929
6762 24929 5446 -13318 -9702 -53233 -65479 -44968 -38249 -34807 566 -15642 -46299 -40891 -4463
$$ packed form
6855i32l414l7223k740N7812L5183j7860r704K315L51L513n788k9106r797L9540
6841B2150L3141l9729M636k426l6487k345k3526k6140J3429j103L3385J1830r261
6828b2446M567j0995o103j3732k3425J7921J9945J609J6363p43p55J8712m12j7097
6814a6591k2845L4412J9317k227l997P110k1145n0058j4275K8552P632k16L022
6801c1309n081J259K6767m836k854M1017J4637j2768K097P240K289r917k8194
6788C47Q607j529k022J9876K8562R823k2856l7588j7057o537L5484k562k7268
6775a4720J3562Q14o858Q521J0014r650L505k9247k2668J9912L7833K2886q975
6762B4929j9483j8764L616m3531j2246K0511O719L442L5373j6208l0657N408L6428
$$ plain form
6749 -4463 14079 24532 21658 23997 24568 -19566 -10915 36349 39868 24325 15204 14373 -27570 -41284
6735 -41284 -26510 -15610 -6797 -4922 -21624 -54879 -52225 -64187 -25852 8199 4753 -21871 -50099
6722 -50099 -38433 -9884 26414 -1764 -35292 -61006 -64332 -45508 -65900 -71922 -80851 -64249
6710 -64249 -73565 -58329 -14616 -13021 -5660 -30496 -72876 -48953 -22699 -11418 -56246 -71880
$$ packed form
6749d463J8542J0453k874K339N71m4134Q651M7264L519j5543r121q31m1943j3714
6735d1284J4774J0900Q813J875j6702l3255K654j1962L8335L4051l446k6624k8228
6722e0099J1666K8549L6298k8178l3528k5714l326J8824k0392o022q929J6602
6710f4249r316J5236M3713J595P361k4836m2380K3923K6254J1281m4828j5634
$$ [...]
##END NTUPLES=NMR SPECTRUM
##END=
