##TITLE=Analysis number 316872
Compound Code mo 07475
Book Reference 461/24
Project Code adrs
Chemist Name toml
##JCAMPDX= 6.0         $$ Bruker NMR JCAMP-DX V2.0
##DATA TYPE= NMR SPECTRUM
##DATA CLASS= NTUPLES
##ORIGIN= Bruker BioSpin GmbH
##OWNER= nmr
$$ XWIN-NMR		Version 3.5
$$ Tue Jan 31 09:13:15 2006 GMT Standard Time (UT+0h)  MAYBRIDGE\nmr@NMR_250MHZ
##.OBSERVE FREQUENCY= 250.131544655141
##.OBSERVE NUCLEUS= ^1H
##.ACQUISITION MODE= SIMULTANEOUS (DQD)
##.ACQUISITION SCHEME= undefined
##.AVERAGES= 16
##.DIGITISER RES= 18
##SPECTROMETER/DATA SYSTEM= dpx250
##.PULSE SEQUENCE= zg30
##.SOLVENT NAME= DMSO
##.SHIFT REFERENCE= (INTERNAL, DMSO, 0, 16.522)
##AUDIT TRAIL= $$ (NUMBER, WHEN, WHO, WHERE, WHAT)
$$ ##TITLE= Audit trail, XWIN-NMR		Version 3.5
$$ ##JCAMPDX= 5.01
$$ ##ORIGIN= Bruker BioSpin GmbH
$$ ##OWNER= nmr
$$ C:\u/data/dgb/nmr/ADRS/15390/pdata/1/auditp.txt
$$ ##AUDIT TRAIL=  $$ (NUMBER, WHEN, WHO, WHERE, WHAT)
(   1,<2006-01-31 09:12:41.57 +000>,<MAYBRIDGE\nmr>,<NMR_250MHZ>,
      <created by zg, POWCHK disabled, PULCHK disabled
       configuration hash MD5:
       62 19 C7 07 E1 42 D1 B7 37 6C 3D D0 77 39 F9 E6
       data hash MD5: 64K
       BC 6A D2 2E B4 4F C9 D2 B5 62 70 22 2A FC A0 AA>)
(   2,<2006-01-31 09:13:01.00 +000>,<MAYBRIDGE\nmr>,<NMR_250MHZ>,
      <Start of raw data processing
       ef LB = 0.3 FT_mod = 6 PKNL = 1 SI = 32K 
       data hash MD5: 32K
       6A C4 CC 27 60 9C AD 38 F0 54 C2 E7 04 80 08 23>)
(   3,<2006-01-31 09:13:03.66 +000>,<MAYBRIDGE\nmr>,<NMR_250MHZ>,
      <apk 
       data hash MD5: 32K
       46 47 6F 72 7B 09 5A 4B 51 CF CA C8 6F 39 B7 6E>)
(   4,<2006-01-31 09:13:04.41 +000>,<MAYBRIDGE\nmr>,<NMR_250MHZ>,
      <abs ABSG = 5 
       data hash MD5: 32K
       86 5C 4A BF 80 99 D9 77 F8 62 B3 08 36 36 0F 85>)
$$ ##END=
$$ 
$$ hash MD5
$$ CF 34 BF BF B9 CC 57 F5 72 B4 91 F5 D1 82 19 16
##$RELAX= 
##$RELAX= 
##$RELAX= 
##$RELAX= 
##$RELAX= 
##$RELAX= 
##$RELAX= 
$$ Bruker specific parameters
$$ --------------------------
##$DU= <C:\u>
##$EXPNO= 15390
##$NAME= <ADRS>
##$PROCNO= 1
##$TYPE= <nmr>
##$USER= <dgb>
##$AMP= (0..31)
100 100 100 100 100 100 100 100 100 100 100 100 100 100 100 100 100 100 
100 100 100 100 100 100 100 100 100 100 100 100 100 100 
##$AQSEQ= 0
##$AQ_mod= 3
##$AUNM= <au_zg>
##$AUTOPOS= <5 >
##$BF1= 250.13
##$BF2= 250.13
##$BF3= 250.13
##$BF4= 250.13
##$BF5= 500.13
##$BF6= 500.13
##$BF7= 500.13
##$BF8= 500.13
##$BYTORDA= 1
##$CFDGTYP= 0
##$CFRGTYP= 5
##$CHEMSTR= <none>
##$CNST= (0..31)
1 1 145 1 1 1 1 1 1 1 1 1 1 1 1 1 1 1 1 1 1 1 1 1 1 1 1 1 1 1 1 1 
##$CPDPRG= <>
##$CPDPRG1= <>
##$CPDPRG2= <>
##$CPDPRG3= <>
##$CPDPRG4= <mlev>
##$CPDPRG5= <mlev>
##$CPDPRG6= <mlev>
##$CPDPRG7= <mlev>
##$CPDPRG8= <mlev>
##$CPDPRGB= <>
##$CPDPRGT= <>
##$D= (0..31)
0 1 0 0 0 0 0 0 0 0.06 0 0 0 0 0 0 0.0002 0 0 0 0 0 0 0 0 0 0 0 0 0 0 
0 
##$DATE= 1138698752
##$DBL= (0..7)
120 120 120 120 120 120 120 120 
##$DBP= (0..7)
150 150 150 150 150 150 150 150 
##$DBP07= 0
##$DBPNAM0= <>
##$DBPNAM1= <>
$$ [...]
##$SUBNAM7= <"">
##$SUBNAM8= <"">
##$SUBNAM9= <"">
##$SW= 20.6930455092707
##$SWIBOX= (0..15)
0 0 3 0 0 0 0 0 0 0 0 0 0 0 0 0 
##$SW_h= 5175.983436853
##$TD= 65536
##$TD0= 1
##$TE= 293.16
##$TE2= 300
##$TE3= 300
##$TEG= 300
##$TL= (0..7)
0 120 120 120 120 120 120 120 
##$TP= (0..7)
150 150 150 150 150 150 150 150 
##$TP07= 0
##$TPNAME0= <>
##$TPNAME1= <>
##$TPNAME2= <>
##$TPNAME3= <>
##$TPNAME4= <>
##$TPNAME5= <>
##$TPNAME6= <>
##$TPNAME7= <>
##$TPOAL= (0..7)
0.5 0.5 0.5 0.5 0.5 0.5 0.5 0.5 
##$TPOFFS= (0..7)
0 0 0 0 0 0 0 0 
##$TUNHIN= 0
##$TUNHOUT= 0
##$TUNXOUT= 0
##$USERA1= <user>
##$USERA2= <user>
##$USERA3= <user>
##$USERA4= <user>
##$USERA5= <user>
##$V9= 5
##$VALIST= <valist>
##$VCLIST= <CCCCCCCCCCCCCCC>
##$VD= 0
##$VDLIST= <DDDDDDDDDDDDDDD>
##$VPLIST= <PPPPPPPPPPPPPPP>
##$VTLIST= <TTTTTTTTTTTTTTT>
##$WBST= 1024
##$WBSW= 4
##$XGAIN= (0..3)
0 0 0 0 
##$XL= 0
##$YL= 0
##$YMAX_a= 269914
##$YMIN_a= -499597
##$ZGOPTNS= <>
##$ZL1= 120
##$ZL2= 120
##$ZL3= 120
##$ZL4= 120
##$ABSF1= 16.522
##$ABSF2= -4.171173
##$ABSG= 5
##$ABSL= 3
##$ALPHA= 0
##$AQORDER= 0
##$ASSFAC= 0
##$ASSFACI= 0
##$ASSFACX= 0
##$ASSWID= 0
##$AUNMP= <proc_1d>
##$AZFE= 0.1
##$AZFW= 0.1
##$BCFW= 0
##$BC_mod= 0
##$BYTORDP= 0
##$COROFFS= 0
##$CY= 12.5
##$DATMOD= 1
##$DC= 0
##$DFILT= <>
##$DTYPP= 0
##$F1P= 14.0000005364418
##$F2P= -0.99999901652339
##$FCOR= 0.5
##$FTSIZE= 32768
##$FT_mod= 6
##$GAMMA= 0
##$GB= 0
##$INTBC= 1
##$INTSCL= 1
##$ISEN= 128
##$LB= 0.3
##$LEV0= 0
##$LPBIN= 0
##$MAXI= 10000
##$MC2= 0
##$MEAN= 0
##$ME_mod= 0
##$MI= 0
##$NCOEF= 0
##$NC_proc= -2
##$NLEV= 6
##$NOISF1= 0
##$NOISF2= 0
##$NSP= 0
##$NTH_PI= 0
##$NZP= 0
##$OFFSET= 16.522
##$PC= 1
##$PHC0= 208.0107
##$PHC1= 74.8091
##$PH_mod= 1
##$PKNL= yes
##$PPARMOD= 0
##$PSCAL= 4
##$PSIGN= 0
##$REVERSE= no
##$SF= 250.13
##$SI= 32768
##$SIGF1= 0
##$SIGF2= 0
##$SINO= 400
##$SIOLD= 32768
##$SREGLST= <1H.DMSO>
##$SSB= 0
##$STSI= 32768
##$STSR= 0
##$SW_p= 5175.98343685301
##$SYMM= 0
##$S_DEV= 0
##$TDeff= 65536
##$TDoff= 0
##$TI= <Analysis number 999999
Compound Code 99
Book Reference 9
Project Code 9>
##$TILT= no
##$TM1= 0
##$TM2= 0
##$TOPLEV= 0
##$USERP1= <user>
##$USERP2= <user>
##$USERP3= <user>
##$USERP4= <user>
##$USERP5= <user>
##$WDW= 1
##$XDIM= 32768
##$YMAX_p= 335940946
##$YMIN_p= -1601588
$$ End of Bruker specific parameters
$$ ---------------------------------
##NTUPLES= NMR SPECTRUM
##VAR_NAME=  FREQUENCY,     SPECTRUM/REAL,   SPECTRUM/IMAG
##SYMBOL=    X,             R,               I
##VAR_TYPE=  INDEPENDENT,   DEPENDENT,       DEPENDENT
##VAR_FORM=  AFFN,          ASDF,            ASDF
##VAR_DIM=   32768,         32768,           32768
##UNITS=     HZ,            ARBITRARY UNITS, ARBITRARY UNITS
##FACTOR=    0.157963299565203, 1,           1
##FIRST=     4132.6476996994, 0,             0
##LAST=      -1043.33573715361, 0,           0
##MIN=       -1043.33573715361, -1601588,    0
##MAX=       4132.6476996994, 335940946,     0
$$ Real data points
##PAGE= N=1
##DATA TABLE= (X++(R..R)), XYDATA
$$ [...]
##PAGE= N=2
##DATA TABLE= (X++(I..I)), XYDATA
26072A86213q887O047R814J378O728k366N04j4148r585j218l374j1087J4371J7486
26058A91876p022l546l434j402Q559K2014p178j8349K986L218J321J100r093j5089
26044A65961m983L516J2154J0189N198L796Q163p885j283M49j555q612j21m807
26030A80180M555L939q68p46n864q40j540J0374M096r596j4816l379q49J4885
26016A79531K338k224O976k599K771O53j3444j057O818k03L374J3238O456M277
26002B06905J662m813o560k646P486L159J574j2590k674j216k81K965K294K594
25988A97859R397m985M711l198j8604K51p402K892J3074L572q245j0764p559n64
25974A70435J2741K701P924K970j9430p487Q880j0728P695J1556q438n732N126
$$ plain form
26072 186213 177326 183373 193187 194565 201293 198927 199431 185283 175698 174480 171106 160019 174390 191876
26058 191876 184854 181308 177874 176472 185031 207045 199867 181518 184504 187722 189043 190143 181050 165961
26044 165961 160978 164494 176648 186837 192035 195831 203994 196109 194826 195275 193720 185108 184987 180180
26030 180180 184735 188674 187806 187060 181196 180356 178816 189190 193286 183690 168874 165495 164646 179531
26016 179531 181869 179645 186621 184022 186793 187446 174002 172945 179763 179560 182934 196172 202628 206905
26002 206905 208567 203754 197194 194548 202034 205193 206767 194177 191503 190287 190006 192971 195265 197859
25988 197859 207256 202271 206982 203784 185180 185431 178029 180921 193995 197567 189322 178558 170999 170435
25974 170435 183176 185877 193801 196771 177341 169854 178734 168006 175701 187257 178819 173087 178213
25961A78213R474J512m295R02O902N521R298J0981j045n310J2211q204m233l005
25947B08922L707j2606j3874K98J8404l703K398Q927J2331l099k0458j553R231
25934B08925K815P79j5068j5384m624k776o998J37p529O245m834Q646K5348J9731
25920B15413k098j4721m88N139j142m152j926L714k293O197J857m049Q270j3433
25906A96288n651R133O65j196J375J0551J0299j9038m997j528m522L070K2259
25893B16708Q554n397j5897n74J6546L147l532j0152l992j289M742M604m145M959
25879B14282L796m88j4311l236P842L441n658O5J3462Q433j691k6220j2979K90
25865A87028J0588L80r168J709K948J9520q244m641M589J2177j0665j8407J0939
$$ plain form
25961 178213 187687 189199 184904 185806 192708 198229 207527 218508 217463 212153 224364 216160 211927 208922
25947 208922 212629 200023 186149 186447 204851 201148 203546 212473 224804 221705 201247 199694 208925
25934 208925 211740 212519 197451 182067 177443 174667 167669 167806 160277 166522 161688 170334 195682 215413
25920 215413 213315 198594 198106 203245 202103 197951 196025 199739 197446 203643 205500 201451 209721 196288
25906 196288 190637 199770 200435 199239 200614 211165 221464 202426 197429 195901 191379 194449 216708
25893 216708 225262 219865 203968 203394 219940 223087 219555 209403 205411 204122 208864 213468 209323 214282
25879 214282 218078 217590 203279 200043 207885 211326 205668 205733 219195 227628 225937 199717 186738 187028
25865 187028 197616 197996 188828 190537 193485 213005 204761 200120 204709 216886 206221 187814 198753
25852A98753K0649Q07o180j304J4072J224p748k609j136R82R62j411k98o531j8840
25837A91392M140J0172R99k808J6234J1987j1031j4205p556J8488M974l171p218
25824B12397j200k275r803p770O972P954N16J5424R452j2975j0248n99l496M473
25810B08822k0M739n129o980P880q792j0883J0544O218K932j4931M845P831j5937
25796A91139M751P68M469R621M788j34P619l446j1318j5829m763R349K3107L069
25782B23190j7401m607L835j1157j3794P343J1233J5167K762j5893j3115K1561
25770B09124O649J0499n628N56q744j1019M445J0612M667k952K581q978k2569
25757A89243j4385J4032J3179n423p701j0733k30J9285R115q840L070J4844K341
$$ plain form
25852 198753 219402 220209 214029 212725 226797 228021 220273 217664 216528 217510 218472 217061 216763 210232 191392
25837 191392 195532 205704 206703 203895 220129 232116 221085 206880 199324 217812 222786 219615 212397
25824 212397 211197 208922 199119 191349 198321 206275 206791 222215 231667 218692 208444 207845 204349 208822
25810 208822 208802 213541 208412 201432 209312 200520 189637 200181 206399 209331 194400 199245 207076 191139
25796 191139 195890 196658 201127 210748 215536 215402 223021 219575 208257 192428 187665 197014 220121 223190
25782 223190 205789 201182 205017 193860 180066 187409 198642 213809 216571 200678 187563 209124
25770 209124 215773 226272 220644 221200 212456 201437 205882 216494 221161 218209 220790 211812 189243
25757 189243 174858 188890 202069 196646 188945 178212 177982 197267 206382 197542 200612 215456 217797
25744B17797q102N893J0876k501m11p334j3438N348N460o599m597l007P918P083
25730B14386n228J574L706m182J0156R08j6467m369p795J348R806K1201q4j8826
25716B06134j6243K781R934o639N502N535q944R689J7540M375j1569l458n094
25703B09543p928r08l483m147p996O130J2263k488l526j1045M824M38J7378N953
25689B15008J3229O444j4345N253j446m805k565J8153K2221j111j9522r396j0683
25676B16435j5892l884J0J3568j2807j0632L860K997m881j487J0920J0965j887
25663B07285k630L17J793O998j0294j5969J0738J1305R081o130m572N997n13R368
25649B22774k498N827m480M235j0203j716N058L389j852R665j480j1279n047N618
$$ plain form
25744 217797 209695 215588 226464 223963 223552 216218 202780 208128 213588 206989 202392 199385 207303 214386
25730 214386 209158 210732 214438 210256 220412 221320 204853 200484 192689 194037 203843 225044 224960 206134
25716 206134 189891 192672 202606 195967 201469 207004 198060 207749 225289 229664 218095 214637 209543
25703 209543 201615 200707 197224 193077 185081 191211 203474 200986 197460 186415 191239 191677 209055 215008
25689 215008 228237 234681 220336 225589 224143 219338 216773 234926 257147 256036 236514 227118 216435
25676 216435 200543 196659 196669 210237 197430 186798 190658 193655 188774 187287 198207 209172 207285
25663 207285 204655 204972 206765 213763 203469 187500 198238 209543 218624 212494 207922 213919 213406 222774
25649 222774 220276 226103 221623 225858 215655 213939 218997 222386 220534 230199 228719 217440 212393 218011
25635B18011j0332N240L442O130P695l359J010K646J370q095l921n136m008n770
25621B04923P66J1281J020O541O838j5494j1096m078Q532k209Q310J884r408o379
25607B01431K4405N626r317j0759k834J6295K101o296K844N294j1494o477J0527
25594B21346R533P328j762K099J738k757J012j0490k144r216O453j112l514Q088
25580B26602M489K27p629Q521j1143j6366O696K697N867J130n041O172J0875o936
25566B26161r740o280q18L076k633J9424P294k413r21p475j0967o145J2493O145
25552B27201J4134J2532q472j1211l509M307J27p68j733L21n079q413j0376q70
25538B08191R163M18M361q209j166J4473L846K574K161n182O755J1768J3809k175
$$ plain form
25635 218011 207679 212919 216361 222491 230186 226827 227837 230483 231853 223758 219837 214701 210693 204923
25621 204923 205689 216970 217990 224531 231369 215875 204779 200701 209233 207024 215334 217218 207810 201431
25607 201431 225836 231462 222145 211386 208552 224847 226948 220652 223496 228790 217296 210819 221346
25594 221346 230879 238207 236445 238544 240282 237525 238537 228047 225903 216687 223140 222028 218514 226602
25580 226602 231091 231318 223689 232210 221067 204701 211397 214094 219961 221091 216050 222222 233097 226161
25566 226161 216421 210141 209323 212399 209766 229190 236484 234071 233150 225675 214708 208563 221056 227201
25552 227201 241335 253867 245395 234184 230675 234982 235109 234341 232608 232929 227850 219437 209061 208191
25538 208191 217354 217772 222133 213924 212758 227231 231077 233651 235812 230630 237385 249153 262962 260787
25524B60787j4962J253o486q862O606p062n047O658k6m12j1238p589J551r098
25510B06073j422J0796L70Q941J3434J967N790J750k3055J730O787q857R68n110
25496B20162O628R521r233o812n768N216J0523j25L89L138k408l605L056k1547
25482B09135p087K449N966l331N260m185R494l502J12l999J6695L245O451J0574
25468B47277N279J34R600p406j0513R098m079n544L653m209r124j2105M213L084
25454B29358m768L057J9924J054J83p715n818K206m42l960j053J0555O273j4077
25440B34777j3123n344j0788M722J0691J2996N457P793r149j9051Q197l61n58
25427B26259K2241J331j1366j7256O48O524p629n384J1859P218M549L745j0023
$$ plain form
25524 260787 245825 247078 240592 231730 238336 231274 226227 232885 232859 232447 221209 213620 215171 206073
25510 206073 204651 215447 215817 224758 238192 240159 245949 247699 224644 226374 233161 224304 225272 220162
25496 220162 226790 236311 227078 220266 214498 219714 230237 230112 230501 233639 231231 227626 230682 209135
25482 209135 202048 204497 210463 207132 212392 208207 217701 214199 214311 210312 227007 230252 236703 247277
25468 247277 252556 252690 262290 254884 244371 253469 249390 243846 247499 243290 234166 222061 226274 229358
25454 229358 224590 227647 247571 248625 248808 241093 235275 237481 237039 233079 232026 242581 248854 234777
25440 234777 221654 216310 205522 210244 220935 233931 239388 247181 238032 218981 227178 226817 226259
25427 226259 248500 249831 238465 221209 221857 228381 220752 215368 227227 234445 238994 242739 232716
25414B32716m359Q432Q302p280l159n597L986J104n577m084k047j1594o860Q30
25400B04813O143K4735N246n466k193j0565p177J0732J1542P609Q303j0903j5461
25387B27358J2275J0644N11M828q957p11q85j0080m362K109P623l296J346N009
25373B43412O024n472o155j152Q709r458j0627j346K06J5529m159r542l112J100
25359B23957j246J6577M855m376J4412Q878o940j5513p638R552q221L44J527k1151
25345B15017P861J1841L620J2046k231q29n959p208J774l27j7885j2602L141J4961
25331B23220J1246N349j639r332R645J4589j1397k203Q551oM443j752o491L131
25317B47354P503p978j878k43P641P14N532P592M511n713p934m1p36K005R82N90
$$ plain form
25414 232716 228357 236789 245091 237811 234652 229055 233041 234145 228568 224484 222437 210843 203983 204813
25400 204813 210956 235691 240937 235471 233278 222713 215536 226268 237810 245419 253722 242819 227358
25387 227358 239633 250277 250788 255616 246659 245948 245063 234983 230621 232730 240353 237057 238403 243412
25373 243412 249436 243964 237809 236657 245366 235908 225281 223935 224141 239670 235511 225969 222857 223957
25359 223957 222711 239288 244143 239767 254179 263057 256117 240604 232966 242518 234297 234641 236168 215017
25345 215017 222878 234719 238339 250385 248154 247325 241366 234158 235932 235605 217720 205118 208259 223220
25331 223220 234466 239815 238176 228844 238489 253078 241681 239478 248029 248023 252466 250714 244223 247354
25317 247354 254857 246879 245001 244758 252399 253113 258645 266237 270748 265035 257101 257060 256324 258329 259311 259901
25301B59901J9288N66r685l07k0436j7652n302M695P763M113P958K251q179j405
25287B43569J5522J538n95K713j1778L964K79j4060NO447J832j6407p535J2875
25273B38369J1715j90j046j2787j3774L227N809o784P796P070r214m508R004J3525
25259B48212J7501J0637l197j9762j8369P644J2979N339O244Q781p285j04r144
25246B59476l795L994j8462o876O177P598K292n921j1919K588R949J8035K948
25233B66084j4085m44j247R55m848n799L699J801q855r801n224M877J824k796
25219B26141q30R981O108R436L898K301r509o074P002J2435R170j0626n274K506
25205B56665j5460j2603J6471J5502j078q755O989J7547k339k189Q513L465j3943
$$ plain form
25301 259901 279189 279755 270070 269763 249327 231675 226373 231068 238831 242944 250902 253153 244974 243569
25287 243569 259091 260629 260034 262747 250969 254933 255212 241152 241157 247604 249436 233029 225494 238369
25273 238369 250084 249894 248848 236061 222287 225514 231323 224539 232335 239405 230191 225683 234687 248212
25259 248212 265713 276350 273153 253391 235022 242666 255645 260984 267228 276009 268724 268620 259476
25246 259476 255681 259675 241213 234337 240514 248112 250404 244483 232564 235152 245101 263136 266084
25233 266084 251999 251555 250308 251263 246415 240616 244315 246116 237261 227460 222236 227113 228937 226141
25219 226141 225311 235292 241400 250836 254734 257035 247526 241452 248454 260889 270059 259433 254159 256665
25205 256665 241205 228602 245073 260575 259497 250742 257731 275278 272939 270750 279263 282728 268785
25192B68785j7369J720J387J0373O764o665Q637j3220r255O499O494q955R268
25179B64463j73n241j2382P140L662n159r642K66R632l971k108M436k699J1173
25165B59397J0861l905k03j1422k0774J92Q077r32O593N59M736L572O687n49m068
25150B58821k01M231J2529j329j5095J260L305L224M867j684O061M457M383j5118
25136B69711j0386o35K799N437R4J692L492o004p743Q544M106J787N947p157j3514
25121B58170m049j7945N556J9008P094L098j0048J1179Q985k900L237K321K328
25108B86034M170j3342j5673j063r225J740J0365O957j335m356o314j2779n625
25095B39554K5J4316J4217O911m230K530L48m248l052J2099n733j1367j6158R787
$$ plain form
25192 268785 251416 253136 254523 264896 271660 264995 273632 260412 251157 257656 264150 255195 264463
25179 264463 264290 259049 246667 253807 257469 252310 242668 242934 252566 248595 246487 250923 248224 259397
25165 259397 270258 266353 266150 254728 233954 234146 242223 241291 247884 248443 253179 256751 263438 262889 258821
25150 258821 258620 262851 275380 274051 258956 260216 263521 266745 271612 269928 275989 280446 284829 269711
25136 269711 259325 258690 261489 266926 267020 268712 272204 266200 258457 267001 271107 272894 278841 271684 258170
25121 258170 254121 236176 241732 260740 267834 270932 260884 272063 281048 278148 281385 283706 286034
25108 286034 290204 276862 261189 260126 250901 252641 263006 269963 268628 264272 257958 245179 239554
25095 239554 239579 253895 268112 275023 270793 273323 273671 269423 266371 278470 272737 261370 245212 254999
25081B54999O185j646j657o963J614O912O435P189J5857j1849j2735m130K243
25068B62454n915j1078r59o25q36J1307R847K413M406N414m746k1259m587J3639
25054B59475J3610k817o587N514J760m300m88J614J946P179K572j264n78j075
25040B76561k400l849k140O462J5755m94j2315K908N745l915J2325j0426J200
25027B85417J3096k510j1435p730j5076J739O20Q775L47j1351o606M203N109J0884
25013B75482J1132Q923N856l539P730K27r503k4310r346j0183J447P741K980J710
24999B66347m823P260J0780m147Q405J4721m947j0631p134j4728l368J2038J612
24986B71385N754n236R022N556n871K645j988R50j1270m419O475k993n074p221
$$ plain form
25081 254999 261184 259538 257881 250918 252532 259444 265879 273068 288925 277076 264341 260211 262454
25068 262454 256539 245461 244502 243877 243041 254348 264195 266608 271014 276428 271682 250423 245836 259475
25054 259475 273085 270268 263681 269195 270955 266655 266167 267781 269727 276906 279478 278214 277636 276561
25040 276561 274161 270312 268172 274634 290389 289895 277580 280488 286233 282318 294643 284217 285417
25027 285417 298513 296003 284568 276838 261762 263501 264121 272896 273243 261892 255286 259489 264598 275482
25013 275482 286614 295537 301393 297854 305584 305811 296308 271998 262652 252469 253916 261657 264637 266347
24999 266347 261524 268784 279564 275417 283822 298543 293596 282965 275831 261103 257735 269773 271385
24986 271385 277139 271903 280925 286481 280610 283255 281267 282217 270947 266528 273003 270010 264936 257715
24972B57715L758N630l382j348J5908M223q840P737N983p320j6462l932O195J9568
24958B85433Q299m686L93J287o34o852O77q197L670J9075n395j1343j4536n745
24944B61446Q431j0006O464r56l96O634N373J0096p025o124K969J4486N549j4198
24930B82743j0820M939N188J0203j6688q343k249J334q928j3929O993J5612p454
24917B58601L053M225J3766J8756J2451j907j1584L334o071j2866q307R80O687
24904B81118l698n160p044o737K9573K5709K982o973j3885j9542n043n253J655
24891B67702J3717R617l200O655Q11N109j1525O796j5784j3251N131J8618J0011
24878C00407P14O810j1818n845j569J963J5917J7201n359P034l861M83O31q151
$$ plain form
24972 257715 261473 267103 263721 262373 278281 282504 273664 281401 287384 280064 263602 259670 265865 285433
24958 285433 293732 289046 289439 290726 290092 283240 283917 275720 279390 298465 293070 281727 267191 261446
24944 261446 269877 259871 266335 265379 264983 271617 276990 287086 280061 273937 276906 291392 296941 282743
24930 282743 271923 276862 282050 292253 275565 267222 264973 266307 257379 243450 250443 266055 258601
24917 258601 261654 265879 279645 298401 310852 308945 297361 300695 294624 281758 273451 274431 281118
24904 281118 277420 272260 265216 258479 288052 313761 316743 309770 295885 276343 271300 266047 267702
24891 267702 281419 291036 287836 294491 295302 300411 288886 295682 279898 266647 271778 290396 300407
24878 300407 301121 307931 296113 290268 288699 290662 306579 323780 318421 325455 321594 322077 322708 314557
24864C14557k0170j5338N005M912J22R331J0095k770q724K059N327l113m086p874
24850B89333p864j4892p411N615J7845R138J4070J0958j3831p923J0596l967j1113
24837B90554j8613R713Q567p055l821L250L099r355j710k244J3025J2873n241
24824B93042N534Q595k819p010k519O27J2575j853p138j0656r462J141J0600J1842
24810C02499R916m741j5492J8272J9550q586j3120l675M916P070j7321j0681J0664
24797B99271J1549J709k483j1768M215J7232J4593j1751k188q463l273J1656j0960
24784C09339K932O520q554o042M18j3169K481M78L560m699j6652N424J0589k475
24770B90150J1755k734j2866k897J6466J4148j850n28N54R98N239k791M730K833
$$ plain form
24864 314557 294387 279049 284054 288966 289088 298419 308514 305744 297020 299079 304406 301293 297207 289333
24850 289333 281469 266577 259166 264781 282626 291764 305834 316792 302961 295038 305634 301667 290554
24837 290554 271941 281654 290221 283166 279345 282595 285694 276339 274629 272385 285410 298283 293042
24824 293042 298576 307171 304352 297342 294823 295450 308025 306172 299034 288378 278916 280057 290657 302499
24810 302499 312415 307674 292182 310454 330004 321418 308298 304623 309539 316609 299288 288607 299271
24797 299271 310820 312529 310046 298278 302493 319725 334318 322567 320379 311916 308643 320299 309339
24784 309339 312271 318791 310237 304195 304613 291444 293925 294403 297963 293264 276612 282036 292625 290150
24770 290150 301905 299171 286305 283408 299874 314022 312172 311644 312198 313196 318435 315644 320374 323207
24756C23207M686k6m269l731p31J4910l102j708p508j6039k487O019M823j2054
24742C01990j2538O947J673R487q094K218m689N68P279N340j6408n457J0100J198
24728B99614m88j998l560P991l94M60K018j414j1536k319l159m89K830Q26O179
24713B94561Q81N100J4795o305K255K361j2721r322j3736L259L1004O630j1540
24700C07222j8117M122L626J1058m475J3151k268j0244M234m126o436J3161N765
24687C16673L49J3097J1473o37l080m337m653P870l722o068N458Q036R682p231
24673C42910k5725j6310J2196J2879r90K603m717j2303j3081L61l525m500J684
24660B91482Q206J3299K728j8539M502J4560J3120J6059p95k0593j3564p100J4
$$ plain form
24756 323207 327893 327867 323598 319867 319136 334046 330944 329236 321728 305689 303202 309221 314044 301990
24742 301990 289452 296399 298072 307559 299465 301683 296994 297562 304841 310181 293773 288316 298416 299614
24728 299614 299126 297128 293568 301559 301165 301625 303643 302229 290693 288374 285215 284726 287556 288382 294561
24713 294561 295442 300542 315337 309032 311287 313648 300927 291605 277869 281128 312132 318762 307222
24700 307222 289105 293227 296853 307911 303436 316587 314319 304075 308309 304183 297747 310908 316673
24687 316673 317022 330119 341592 340955 337875 333538 328885 336755 333033 326965 332423 340459 350141 342910
24673 342910 317185 300875 313071 325950 324960 327563 322846 310543 297462 297823 294298 289798 291482
24660 291482 299688 312987 315715 297176 301678 316238 329358 345417 344622 324029 310465 303365 303379
24647C03379p087p217J8590n306J856O103K406K077l892N402K216k968k923l624
24633C09012j41N499n95R897J0418O140j244l877L604K854r499n808j1011O579
24619C21828P871L429j2794r693J1744q352j738K232l075K985M618l777R304Q915
24605C33497j3358n127J0210j584q447N323J1031q261O224j58J110l301l074M140
24591C28225j185l817J2810M199q387p433L177o982r488J443M772n45l402Q214
24577C21601Q163r94M138l307O94j0904q460o297j100J2505P075k346O359J7209
24563C44336L201q970j5706J52O13N011K481o98M034n347J7804J7840O41m14m538
24548C60440q420n55q445j4083J187J2849J676r910j1772q250n352J5059P956
$$ plain form
24647 303379 296292 289075 307665 302359 304215 310318 312724 314801 310909 316311 318527 315559 312636 309012
24633 309012 308871 314370 313775 323672 334090 340230 338986 335109 338713 341567 332068 326260 315249 321828
24619 321828 329699 333128 320334 310641 322385 314033 312295 314527 311452 314437 319055 315278 324582 333497
24605 333497 320139 315012 325222 323638 315191 320514 331545 323284 329508 329350 330460 327159 324085 328225
24591 328225 327040 323223 336033 340232 331845 324412 327589 320607 311119 312562 317334 316789 313387 321601
24577 321601 329764 328770 332908 329601 330295 319391 310931 304634 303534 316039 323114 320768 327127 344336
24563 344336 347537 338567 322861 323013 323626 328637 331118 330420 334454 329107 346911 364751 365392 364978 360440
24548 360440 352020 351465 343020 328937 330124 342973 344649 334739 322967 314717 309365 324424 332380
24535C32380o147R12O388Q119l382J0441j9171m013N022J2841l323m826L649q951
24521C29939j6970j1713P688J5942J3186L829Q842j6709j943L188J8j0038m999
24508C20260r759o694J3159Q017K360O148K415l524o824j657M594J0781j7640
24495C21636q116P571N403p158O842J3569M442l248M803j64l333k0114n361J0435
24481C27207O799Q38j3390J4143J0276M532q918o439j314q830P848J2006J016
24468C45774K02L672r459q546j0455j37K2210L953k2209m498R222J9823O731j565
24454C54718J870J053j2804o17p013m441J601p970o82K4717J1016K862j0298j5984
24440C38028j2195l406R377J6158j2182o052J0851k747q450j6031P889K1615J9955
$$ plain form
24535 332380 326233 327145 333533 341652 338270 348711 329540 325527 330549 343390 340067 335241 338890 329939
24521 329939 312969 301256 308944 324886 338072 341901 350743 334034 332091 335279 335297 325259 320260
24508 320260 310501 303807 316966 324983 327343 333491 335906 332382 325558 323901 328495 339276 321636
24495 321636 313520 321091 326494 319336 326178 339747 344189 340941 345744 345580 342247 322133 316772 327207
24481 327207 334006 334844 321454 335597 345873 350405 341487 335048 333734 324904 332752 344758 345774
24468 345774 345976 349648 340189 331643 321188 321051 343261 347214 325005 320507 329729 349552 356283 354718
24454 354718 356588 357641 344837 344220 337207 332766 334367 326397 325715 350432 361448 364310 354012 338028
24440 338028 325833 322427 331804 347962 335780 329728 340579 337832 329382 313351 321240 342855 362810
24427C62810O74q079j5139p943n386K169k427L93Q599J4225J2768o744q451J504
24413C48973p833j1893j1538J297J7376P123M136q013N540K3206Q394o325j4011
24400C56432K147j194K503o653j8956k5224J0469K8196l407j1825N397l654J8908
24387C53139J0553P784j355j3251k089K20m368o046J4276m909L2O691M652p766
24373C57563j049O080j2963l429p154j3676j2945J1486R498O251P08j267N109
24360C44212O388J1008R527j354N742r189l69Q063P058j0837j7053Q0L694P727
24346C64697Q666L390m343q99J819n108r82j4071k0436P362L85N89j785Q59M750
24331C44893J4736R055J2790k311P881l014n598j4064l360K581p724j2911J1878
$$ plain form
24427 362810 363484 355405 340266 332323 326937 329106 326679 327072 335671 349896 362664 355920 347469 348973
24413 348973 341140 329247 317709 319006 336382 343505 347641 339628 345168 368374 376768 370443 356432
24400 356432 358579 357385 359888 353235 334279 309055 319524 347720 344313 332488 337885 334231 353139
24387 353139 363692 371476 370121 356870 354781 355001 350633 344587 358863 353954 353986 360677 365329 357563
24373 357563 356514 362594 349631 346202 339048 325372 312427 323913 333411 339662 340370 339103 344212
24360 344212 350600 361608 371135 369781 375523 366334 365965 374028 381086 370249 353196 353276 356970 364697
24346 364697 373363 376753 372410 371511 373330 368222 367240 353169 332733 340095 340480 341069 339284 340143 344893
24331 344893 359629 368684 381474 379163 387044 384030 378432 364368 361008 363589 355865 342954 354832
24318C54832M681p233Q331q181j3142m63M601Q018K14R598J5776j385j0140j3680
24304C51827n474K124M579m201J853J239j795l610J486j193o49O864l025o935
24290C43090l006m250R516J3041q332q780o931L735K719J027R604P054L291k720
24276C59058k095O808j2300L365P94j1190m248J3402m769K490J1015k498M352
24263C64184l852M327l54L598N765O545k315p943j8279r519m956k373J3406J2581
24249C60815j2075K919O338K584r58j43j9646j3101J3195J5516J591o06J528P68
24235C58725L858j161p433J3706O5j5564Q522J3413M047J1551m076j4178o696
24222C64779J5988j398k429j0192p344m71L493j1652j554J655l9K856J8598M944
$$ plain form
24318 354832 359513 352280 360611 352430 339288 338825 343426 351444 351658 361256 377032 375647 365507 351827
24304 351827 346353 348477 353056 348855 350708 351947 350152 346542 348028 346835 346186 353050 350025 343090
24290 343090 340084 335834 345350 358391 350059 341279 334348 338083 340802 341829 351433 358487 361778 359058
24276 359058 356963 363771 351471 354836 355630 344440 340192 353594 348825 351315 362330 359832 364184
24263 364184 360332 364659 364305 367903 373668 380213 377898 369955 351676 342157 337201 334828 348234 360815
24249 360815 348740 351659 357997 360581 359623 359480 339834 326733 339928 355444 357035 356429 357957 358725
24235 358725 362583 361422 353989 367695 367760 352196 360718 374131 378178 389729 385653 371475 364779
24222 364779 380767 379369 376940 366748 359404 358933 362426 350774 349220 350875 350836 353692 372290 377234
24208C77234k960m267k620L640j2071o421k860m708J1753Q295K512n956J5257
24195C76828N080o351L941p449k920O661m315p361J1245O933m260j443k160n172
24181C69257J3271m03N3o826N106l059p369l505L514m267j1653M901L164l647
24167C58537P936L231k320L961N891Q3n033J63Q344L6m35j2814O865J2782p831
24152C79396o106R488M868m80j3751r146o90J0633j141J802j32q077J9880R320
24138C95864j445j07j236L8m275L807M021M793k205o999J661k519j0759O131J2387
24123C99157K246j282j1124p699Q761j1652q137p974M941L221m496K056k753N38
24109C65803j1196o133J7741K1035j527j5110L635r45L133P953j0684r796M420
$$ plain form
24208 377234 374274 370007 367387 371027 358956 352535 349675 344967 356720 365015 367527 361571 376828
24195 376828 381908 375557 379498 372049 369129 375790 371475 364114 375359 382292 378032 376589 374429 369257
24181 369257 382528 382125 382178 375352 380458 377399 370030 366525 370039 365772 354119 359020 362184 358537
24167 358537 366473 369704 367384 371345 377236 377319 372286 372449 380793 380829 380394 367580 374445 387227 379396
24152 379396 373290 382778 387646 387166 373415 364269 363579 374212 373071 374873 374741 366664 386544 395864
24138 395864 394419 394312 393076 393114 388839 392646 396667 401460 399255 392256 393917 391398 380639 386770 399157
24123 399157 401403 400121 388997 381298 390059 378407 370270 362296 367237 370458 365962 368018 365265 365803
24109 365803 354607 348474 366215 387250 385723 370613 374248 373303 376436 384389 373705 363909 368329
24096C68329l28N117O836L668q015p258J6846L02m621Q303N780p878j7525q552
24082C61004L815J6546O524J1422j619l772J4412j1066r43L774p253J4329k962
24069D04211m653N906J716j027j9899P316Q977j509r109j0805R187R390l426m307
24055C91968L920j173k276J4841o417j1358J3336o540k853J2856J532j1156m482
24042C92198o602l13N542P126J125J0820L290k374m325k380j602J914O19n660
24028C99378j6028q592P858Q222j1283M800J8565O855O780m070N021r329j703
24015D06474Q560j0597n766J493j125K114K28k508K490K953L429J1434K38j704
24001D17713m474j1070J136j1753J3861O019j2158L845N321k28q008j0900p924
$$ plain form
24096 368329 368001 373118 379954 383622 375607 368349 385195 385497 380876 389179 394959 387081 369556 361004
24082 361004 364819 381365 387889 399311 397692 393920 408332 397266 396323 400097 392844 407173 404211
24069 404211 399558 405464 407180 406153 386254 393570 402547 401038 391929 381124 390311 399701 396275 391968
24055 391968 395888 394715 392439 407280 400863 389505 402841 396301 393448 406304 407836 396680 392198
24042 392198 385596 385283 390825 397951 399076 409896 413186 410812 406487 404107 402505 404419 405038 399378
24028 399378 383350 374758 382616 390838 379555 384355 402920 409775 416555 412485 417506 408177 406474
24015 406474 415034 404437 398671 400164 399039 401153 401381 398873 401363 404316 407745 419179 419417 417713
24001 417713 413239 402169 403305 391552 405413 411432 399274 403119 408440 408212 400204 389304 381380
23988C81380R478K1719l662j4441m0n248m753Q138K695k64K94j847n389k922J1051
23973C96189R319L747m818J2263M267k394j869k198j1164r133M251K5967J0691
23960D35118m71r474k688j40L477q886j774o203l66j259n806j5644J758m07L412
23945C90647J0134O584O26k750q820j5337m30J7733K417k037q649L705J7056J1950
23931D22829J912j0355O56m74l606j3388n985j716M435J0600l86O587m116N724
23917D12717N43R17M065J599j2527j501j1283r967O865J2199Q410o086J1482j659
23903D15774r337j3691Q635R862J2494J4213p706j3056o039N839J3682K744l195
23890D30219N492j6371J440l820n681p712J1167O403p426m434O192J5397L958
$$ plain form
23988 381380 390858 412577 408915 394474 394434 389186 384433 392571 395266 395002 395296 393449 388060 385138 396189
23973 396189 405508 409255 404437 416700 420967 418573 416704 414506 403342 394209 398460 424427 435118
23960 435118 434647 425173 422485 422345 425822 416936 415162 408959 408593 407334 401528 385884 387642 387235 390647
23945 390647 400781 407365 407991 405241 396421 381084 380654 398387 400804 398767 390118 393823 410879 422829
23931 422829 424741 414386 415042 414568 410962 397574 391589 389873 394308 404908 404522 411109 406993 412717
23917 412717 413260 414177 418242 419841 407314 405813 394530 384563 391428 403627 412037 405951 417433 415774
23903 415774 406437 392746 401381 411243 423737 437950 430244 417188 411149 416988 430670 433414 430219
23890 430219 435711 419340 420780 416960 411279 403567 414734 421137 413711 409277 415469 430866 434824
23877D34824l722j7658j0240J3528M943j1101q357M259l069m504M188R715n577
23864D07229j5978p325R652O983J2004P081L330M537J2752n333p363o491Q520
23851D29598m68j0461j657p01P246l461q198J041J4962k497j5049j9018n88O136
23837C96885J045p73J534P811Q075J4961M317q499m312j951m039n268L261J0578
23823D23625k078N144K579N812j3878q149M629N672r287j3515Q278K7429n18j1182
23809D24561m728m220J2760J3073o673k2862j0913N178J1765l13p665J6370K4236
23796D50569j64r779J1360Q037q263j6728K627J926j61k809m439Q893J02l600
23782D37571R782J6039N214L898l0Q01j0370k0471j1623L02l984o354m199j988
$$ plain form
23877 434824 431102 413444 403204 416732 421675 410574 402217 406476 403407 398903 403091 412806 407229
23864 407229 391251 383926 393578 400561 412565 419646 422976 427513 440265 434932 427569 421078 429598
23851 429598 429130 418669 417012 416311 423557 420096 411898 412939 427901 425404 410355 391337 390749 396885
23837 396885 397930 397157 398691 406502 414577 429538 433855 425356 421044 419093 415054 409786 413047 423625
23823 423625 421547 426691 429270 435082 421204 413055 417684 423356 414069 400554 408832 436261 435743 424561
23809 424561 419833 415613 428373 441446 434773 411911 400998 406176 417941 417628 409963 426333 450569
23796 450569 450405 440626 451986 460023 451760 435032 437659 439585 439424 436615 432176 441069 441171 437571
23782 437571 447353 463392 468606 472504 472474 473275 462905 442434 430811 431113 427129 420775 416576 414588
23768D14588J1169J5612M292l894l2K37j6130K21j965m808n504O548j822L440
23754D21952P493K667M379m133J3021L046j0153o958P770Q122p346j371k121l473
23740D32895o486m15n305j114Q82j8344J2518M347o642R351Q282j624p927p016
23726D13402N588J2965N525O745K1900j522k0696n237K316j830j7460Q568J0195
23713D40459R129j4058j1945J2955R027M711o359M058L073m08j4788L062N451
23700D44367M238n397O673k449L654k826L75l506j0785r449J1173P679l457m038
23686D36252O012J4031L787m475l138p645l022m17R656j183J880p093q809J750
23672D37586O225R199Q078q591J917P061q283m356J545J624r941J4566N988n34
$$ plain form
23768 414588 425757 441369 445661 441767 441735 441972 425842 426063 424098 419290 413786 420334 418512 421952
23754 421952 429445 432112 436491 432358 445379 448425 438272 431314 439084 447206 439860 438489 436368 432895
23740 432895 426409 425994 420689 419575 420457 402113 414631 418978 412336 421687 429969 428345 420418 413402
23726 413402 418990 431955 437480 444225 466125 464603 443907 438670 440986 439156 421696 430264 440459
23713 440459 449588 435530 423585 436540 445567 450278 443919 447977 451050 450642 435854 438916 444367
23700 444367 448605 443208 449881 447432 451086 448260 448635 445129 434344 424895 436068 443747 440290 436252
23686 436252 442264 456295 460082 455607 452469 444824 441802 441385 451041 449858 451738 444645 435836 437586
23672 437586 443811 453010 461088 452497 454414 461475 453192 448836 450381 452005 442064 456630 462618 462084
23658D62084q878j0998m398P04j55L06L021L713j505K707K455J7953N529k97j2031
23643D60210r108K615q848O703J673l208n702j724P252P885M543j2702R51K791
23629D53331j5323q82J1123Q904J182N980n883Q567L208r960Q514j743j5001M260
23615D56277J7266J206q369q450k075J086m385o367O734J2527p755j274J6924
23602D73345k74N050r260r217L330J1078P678L226n495o718n941j6844l798M700
23588D50860M721J4606L781j1128J6587K325l451l660k063j0446k465O301k252
23575D63716Q512l350j164J591m529J7496M140n156n091n011l561J938m815k163
23561D62553j116l51N794J2137j4458R08m546N403J1160q928j4884P906O122p293
$$ plain form
23658 462084 453206 442208 437810 438514 438359 438665 441686 445399 443894 446601 449056 467009 472538 472241 460210
23643 460210 451102 453717 444869 451572 453245 450037 444335 442611 449863 457748 462291 449589 450540 453331
23629 453331 438008 437126 448249 457153 458335 464315 458432 466999 470207 460247 468761 467018 452017 456277
23615 456277 473543 474749 466380 457930 455855 456941 452556 446189 452923 465450 457695 456421 473345
23602 473345 473071 478121 468861 459644 462974 474052 481730 484956 479461 472743 466802 449958 446160 450860
23588 450860 455581 470187 473968 462840 479427 481752 478301 474641 472578 462132 459667 465968 463716
23575 463716 472228 468878 467714 469305 464776 482272 486412 481256 476165 471154 467593 469531 464716 462553
23561 462553 461437 461086 466880 479017 464559 465467 460921 466324 477484 468556 453672 461578 467700 460407
23547D60407M612K315M854r871r039m825Q178L722J6972j4089r270j3080p993
23534D32893R044p297j3185J0855Q276M402J6749P809k206l440R196L066m815
23521D71347o147j1850J6549J6528P538j1009q093j3963l878R592J1944M197k07
23508D82548J011J158j4195j2764j714p862J2979L179L864m257P033p133q83L697
23494D66661J4569m728l700j368r539l649l27N225Q150j1910p876J5978j27J2381
23480D79740q91o832P452R987o106N650P017J245K185j2001p238o689K29l533
23466D70215J4691l718l863P100m806r955j7178n787M191M972K5431P963j1453
23453D77803j5383P367O440Q124J0113m293O69j5459j0737Q554o74j0323n29J3371
$$ plain form
23547 460407 465019 467334 472188 462317 453278 448453 456631 460353 477325 463236 453966 440886 432893
23534 432893 441937 434640 421455 432310 440586 444988 461737 469546 467340 463900 473096 476162 471347
23521 471347 465200 453350 469899 486427 493965 482956 474863 460900 457022 466614 478558 482755 482548
23508 482548 483559 484717 470522 457758 456044 448182 461161 464340 468204 463947 470980 463847 462964 466661
23494 466661 481230 476502 472802 471434 461895 458246 457919 463144 471294 459384 451508 467486 467359 479740
23480 479740 478849 472017 479469 489456 483350 489000 496017 497262 499447 487446 480208 473519 473748 470215
23466 470215 484906 481188 477325 484425 479619 469664 452486 446699 450890 455862 481293 489256 477803
23453 477803 462420 469787 476227 484351 494464 490171 490840 475381 464644 473198 472524 462201 461672 475043
23439D75043Q059n64j5446P38J0380R267q345k806J545n98P655j0860Q733J1727
23425D94528m983M771m524k864J1728l665J610q423p916J5848r028p591N580K136
23411D87207N573o650K674j3222N379J5224N948L176l902j4079J353L497o737
23398D85441j2981k191M813K220j1909M596L169J1666P179o863K100l974l716
23385D79550N461K751K562J598r229k0756k489J1687J1595o768K273n34p429J267
23371D71539M681J968K077K1934J2286k641j9149n84L587J0365N271j1130j0155
23358D90049N17R678O237j2605p203K34Q572J3875N057j0057j05N546k7r755p203
23343D92810j454R866P962m429k977o915n986l539Q285k690K491k054k299K561
$$ plain form
23439 475043 483102 482538 467092 467830 478210 487477 479132 476326 477871 477273 484928 474068 482801 494528
23425 494528 489545 494316 489792 486928 498656 494991 496601 488178 480262 496110 487082 479491 485071 487207
23411 487207 492780 486130 488804 475582 480961 496185 502133 505309 501407 487328 488681 492178 485441
23398 485441 472460 470269 475082 477302 465393 469989 473158 484824 492003 485140 487240 483266 479550
23385 479550 485011 487762 490324 491922 482693 461937 459448 471135 482730 475962 478235 477701 470272 471539
23371 471539 476220 478188 480265 502199 514485 511844 492695 492111 495698 506063 511334 500204 490049
23358 490049 490566 500244 506481 493876 486673 486907 495479 509354 514411 504354 504249 509795 509768 500013 492810
23343 492810 491356 501222 509184 504755 501778 494863 488877 485338 493623 490933 493424 491370 489071 491632
23329D91632M91q225o86M978J0552j140j122K237L423K505N461j6891q881N416
23315D89750K1901O234r071j4261r604R807O312O86J4396M628o170M25l49j920
23301E12764j1400j2799J1514O940Q221r14o702M699l810J04r158M274J1605n384
23287E09954j0008j205j0883j731J2558M847o457n76P570M342R585J640k738J506
23273E18404j547N191n774j4268p767m53K944P759K14j71m71J563m555J6113J1428
23258E28610n105K324j0015m770J0543R173j591j1453p660n521j222o731J3232
23245E09814k540q258N546J6002J0590p369R574J0419K249r777l226l300q81O416
23231E35259q93r356N728j0227J713l850k548K488l364l862L909R787J9416L202
$$ plain form
23329 491632 492123 483898 483212 488190 498742 497602 496480 498717 502140 504645 510106 493215 484334 489750
23315 489750 511651 517885 508814 494553 484949 494756 501068 501754 516150 520778 514608 515033 514684 512764
23301 512764 501364 488565 500079 507019 515240 514326 507624 512323 508513 508617 499459 503733 515338 509954
23287 509954 499946 498741 487858 486127 498685 503532 497075 496499 504069 508411 517996 519636 516898 518404
23273 518404 516857 522048 516274 502006 494239 493786 496730 504489 504703 504532 504061 505624 501069 517182 528610
23258 528610 523505 525829 515814 511044 521587 530760 529169 517716 510056 504535 503313 496582 509814
23245 509814 507274 499016 504562 520564 531154 523785 533359 543778 546027 536250 533024 529724 528843 535259
23231 535259 534366 525010 530738 520511 522224 518374 515826 518314 514950 511088 514997 524784 544200 547402
23217E47402j0828r24P602p156j3713L732q833l82N391p595Q505K264o670k792
23203E16003Q337k688p712j352O689J578L756j1221o14K2748O068p084n991J2063
23189E40580j608q040l631J152J920j2433q479k291J5118p36m342J4323J4646
23176E46179j2204p569M267J704l00j357K347m22P268L488p3j5745M975J2555
23162E45113R056Q152k716q935j6118l151N327k3Q70p336r738O662M171p613J87
23147E23908n034P055J5819j433m772k586k485o608r512K345j746M822J6540O890
23133E43203J3482l761n69J1361p967k8181p335P327n657J1723L637L116Q264
23120E48643j0082M081J1545q943k3377Q075J7939j0574j2491p784J8524O432
$$ plain form
23217 547402 536574 535650 543252 536096 522383 526115 517282 516900 522291 514696 523201 525465 518795 516003
23203 516003 524340 521652 513940 512588 519277 520855 524611 513390 512776 535524 541592 534508 528517 540580
23189 540580 538972 530932 527301 528453 530373 517940 509461 507170 522288 521552 517210 531533 546179
23176 546179 533975 526406 530673 532377 532077 530720 533067 532645 539913 543401 543328 527583 532558 545113
23162 545113 554169 562321 559605 550670 534552 531401 536728 536705 537575 530239 520501 527163 531334 523721 523908
23147 523908 518874 525929 541748 540315 535543 532957 530472 523864 514352 516697 514951 519773 536313 543203
23133 543203 556685 552924 552355 563716 555749 527568 520233 527560 521903 533626 537263 540379 548643
23120 548643 538561 542642 554187 545244 521867 529942 547881 537307 524816 517032 535556 541988
23108E41988Q621M462O78P986J850r275j5439O89N689j152m810K802J0448k112
23094E52425j2029r199q562j6738K872J7056k502J1505J5245N221J3611L018o645
23081E65278j5399J851K925P630j3439j547m101j265l701k580O702J7261K824
23068E62439o370k177j14p855k089N235P365k30j6565n409O593l98q373j011n757
23053E25284o331Q396j860O883R966J7559J8517m456j1575n900o091j8346P764
23040E39810p036O811L707Q666R649m781P876J2804N188j4345j8671j346J1750
23027E60082j93l915j0315l844J0642O456l747M964o937P592L266Q107J823j6187
23013E57794n586j82J4709P504n907l076R89R410J531k165j1097j1023N373K886
$$ plain form
23108 541988 550609 555071 555749 563735 565585 556310 540871 541560 547249 546097 541287 544089 554537 552425
23094 552425 540396 531197 522635 505897 508769 525825 523323 534828 550073 555294 568905 571923 565278
23081 565278 549879 551730 554655 562285 548846 547299 543198 541933 538232 535652 542354 559615 562439
23068 562439 556069 553892 553778 545923 543834 549069 556434 556204 539639 534230 540823 540425 532052 531041 525284
23053 525284 518953 527349 525489 532372 542338 559897 578414 573958 562383 556483 550392 532046 539810
23040 539810 532774 539585 543292 551958 561607 556826 564702 577506 582694 568349 549678 548332 560082
23027 560082 559889 555974 545659 541815 552457 558913 555166 560130 553193 560785 564051 572158 573981 557794
23013 557794 552208 552026 566735 574239 568332 565256 566245 575655 577186 575021 563924 552901 558274 561160
22999E61160K739L326J1266m112q43O958j8185m565P238p440o643L952J0709K0203
22985E85763N199j4923j1400P013J2054J880m974q939m459J866J217k901R20o802
22971E61514M118N474J2192M211j1172j6070q461p872O657L868J2620K9618K251
22958E98948j9072j1813J3686K1399P339j5808j0527j0018j393M875j749P03M552
22945E81122o970J374l794k057J9791J8068j4864j2089m401k099J649o440q75
22932E68415J4043L83N665q861r409j620M847l790M53P687J857M9K095J4079L468
22917E99361p103k234R843Q331q603k174O747k528j1294K478n234J5677M406j4426
22903E93247J206k734J33M021R218J1306j699j3260p949q968j202J4169m635N740
$$ plain form
22999 561160 563899 567225 578491 574379 573536 580494 562309 557744 564982 557542 550899 554851 565560 585763
22985 585763 590962 576039 564639 571652 583706 585586 580612 571673 567214 569080 570297 567396 568316 561514
22971 561514 565632 571106 583298 587509 576337 560267 551806 543934 550591 554459 567079 596697 598948
22958 598948 579876 568063 581749 603148 610487 594679 584152 574134 572741 577616 575867 576570 581122
22945 581122 574152 575526 571732 569675 589466 607534 592670 580581 576180 574081 575730 569290 568415
22932 568415 582458 582841 588506 579645 570236 568616 573463 569673 570126 577813 579670 579719 581814 595893 599361
22917 599361 592258 590024 599867 608198 599595 597421 604168 601640 590346 592824 587590 603267 607673 593247
22903 593247 594453 591719 591852 595873 605091 616397 614698 601438 593489 584521 583319 597488 592853 598593
22889E98593J0503K885j1023k604m797n353J3589P832n681n083o75k216n800J808
22875E91978j4630p6J430o895J869j0142M180J1914O201J2077J086p226K97J0824
22861F02887k753k021l481j1882j992P183J9833Q811m721k1270k1523O406L422
22848E78899J0051K4757J3087j0342K688m395j4274J8437K139k2668q084j2417
22836E77878L827J2717m519J930J4094M766M994j596l272K017K095M63k934O25
22822F13085m571K277p309O959N377l027J0064J4249j544k0045j0619m367Q589
22809F09118O696q928m017q548Q48J3750O412m090j5402N631O191P181l747p820
22795F03275k360J8923n422J0603J0372m351j1761r562m415N478m227J4046l819
$$ plain form
22889 598593 609096 611981 600958 598354 593557 588204 601793 609625 603944 598861 598186 595970 590170 591978
22875 591978 577348 577272 578702 571807 573676 563534 567714 579628 585829 597906 598992 591766 592063 602887
22861 602887 600134 598113 594632 582750 580758 587941 607774 616585 611864 590594 569071 575477 578899
22848 578899 588950 613707 626794 616452 619140 614745 600471 618908 621047 598379 590295 577878
22836 577878 581705 594422 589903 591833 605927 610693 615687 614091 610819 612836 614931 615394 612460 613085
22822 613085 608514 610791 603482 610441 615818 612791 622855 637104 635560 615515 604896 600529 609118
22809 609118 615814 606886 602869 594321 595169 608919 615331 611241 595839 601470 607661 614842 611095 603275
22795 603275 600915 619838 614416 625019 635391 631040 619279 609717 605302 610780 606553 620599 616780
22782F16780p186q593K59L655K541Q492N405O140j1791r756L631j0062q123J9616
22768F11008K4249J1767r173J887P937j986r266j1898j1584J0105J3954M574O581
22755F48155k363j5182l585k805P514J4513r435j0520j120M5O431J2790j830N211
22741F47819M665M803j2464l152k140n636j091Q215j129n317r544l053n69N709
22727F27116K364Q309J6267k770j6363p360N26N575o487K427N456J0548j242K669
22713F47035n724k012o879J934p509k699J4542O45P663J4529k293O36r553j3052
22699F37263q562r458j4706Q728J6627n12J842J367J195k747L98j343o934J3178
22685F36336J5819j4214m264P54P508P280p584M153R26K923Q158o608L8l697M533
$$ plain form
22782 616780 609594 601001 601260 604915 607456 615948 621353 627493 615702 605946 609577 599515 591392 611008
22768 611008 635257 647024 637851 639738 647675 645689 636423 624525 612941 623046 637000 641574 648155
22755 648155 645792 630610 627025 624220 631734 646247 636812 626292 625172 625217 631648 644438 642608 647819
22741 647819 652484 657287 644823 641671 639531 633895 632804 641019 639890 634573 625029 621976 621407 627116
22727 627116 629480 637789 654056 651286 634923 627563 628089 633664 627177 629604 635060 645608 644366 647035
22713 647035 641311 639299 632420 634354 626845 624146 638688 639333 646996 661525 659232 659868 650315 637263
22699 637263 628701 619243 604537 613265 629892 629380 631222 632589 633784 631037 631435 630092 623158 636336
22685 636336 652155 637941 633677 634431 641939 649219 641635 645788 646714 649637 657795 651187 651225 647528 652061
22670F52061o849o080r919m5J9154l353p467N959k394o578J4141J1792p322J136
22656F54236j2750o542J257n031J0131J5022R262N086p417k72K6386M669k3764
22643F70273q424l998k0872n475O239K540O853j995k590K787J0833N061P712J2501
22629F81445p11J026k154j2475k356L987K113k31p709n276K597k193j773J167
22615F57457J0888l739j6395p09J2574J422J0078l855o481Q089k511M35R7k92
22601F67058Q325o32p482r650m471N858q19m814J2796J1910P442N828j2567l348
22587F75434R556J744M119R876J42j1897l869q941n024J4861P062k245o115n267
22573F79436Q7p16O494j714L960j0161l531K1527R643j2559n681p285j010O057
$$ plain form
22670 652061 645212 639132 629213 629168 648322 644969 637502 643461 641067 634489 648630 660422 653100 654236
22656 654236 641486 634944 636201 631170 641301 656323 665585 670671 663254 662982 689368 694037 670273
22643 670273 661849 657851 636979 631504 637743 640283 647136 645141 642551 645338 656171 661232 668944 681445
22629 681445 680734 681760 679606 667131 664775 668762 670875 670644 662935 657659 660256 658063 656290 657457
22615 657457 668345 664606 648211 647502 660076 661498 671576 667721 661240 669329 666818 667253 667350 667058
22601 667058 675383 674751 667269 657619 653148 659006 658187 653373 666169 678079 685521 691349 678782 675434
22587 675434 684990 686734 690853 700729 700871 688974 685105 676164 671140 686001 693063 690818 684703 679436
22573 679436 679523 678807 685301 683587 687547 677386 673855 695382 705025 692466 686785 679500 678490 684547
22559F84547Mm631p72L207o255j374J3073M962k896o101R367J42j285l309J856
22544F90535M336j908k814j0452L465J4313P601J99p337k0012p288M342N820J1789
22530F92589L930l210p932j0684k383K783K8655l273m513o847j0163P315R790
22517F96057j3566m367L621N591R350m594J0462n36r414j525N385l661J0558K296
22503G05657M883J5470m931k6407j6162J2786J5842o17q700l339r969K508O706
22490F93727M893N41P99M869l674O259R923j0804r395J4108K0856M085o065j5049
22476G15073q179Q54O616l513J1733L929l246k550O668R797o531m258k698o788
22462G16907k037l581o37o918o199l15J3347J3299l197k3728n562R874J432P169
$$ plain form
22559 684547 684551 679920 679148 682355 676100 674726 687799 692761 689865 683764 693131 693273 691988 688679 690535
22544 690535 694871 692963 690149 679697 683162 697475 705076 705275 697938 677926 670638 674980 680800 692589
22530 692589 696519 693309 685377 674693 672310 675093 703748 700475 695962 689115 678952 686267 696057
22517 696057 682491 678124 681745 687336 696686 692092 702554 702018 692604 691079 696464 692803 703361 705657
22503 705657 710540 726010 721079 694672 678510 691296 707138 706521 697821 694482 684513 687021 693727
22490 693727 698620 699161 699960 704829 701155 707414 717337 706533 697138 711246 732102 736187 730122 715073
22476 715073 706894 707748 714364 710851 722584 726513 723267 720717 727385 737182 730651 726393 723695 716907
22462 716907 714870 711289 710652 703734 697535 697220 710567 723866 720669 696941 691379 701253 702685 709854
22448G09854k603r307J3265J2637m758P398N736l233m879k946N549J5063O918
22435G48694j478N740m767j4474j378r461q605O685L27N114p906N37N666Q71P602
22420G33167R980P938o448k3513j3765O552P936m417j0486L414K1229K514l033
22407G31068j430Q488k488L265J167m548q761J71p145R461J0946L244r287J496
22393G35647L774k420J4799K9290j6050k1998p550M488J9714m273j8365L26J1482
22380G48864j1367j9n062m790p154O413J5145J0386j7168p852J0979n53N79Q180
22366G46581N693K889J4637n24j1510L76Q952l760j1710J807R524q147j5577k1
22352G39210J1167O141M911l983J3430L676j3849j8821n467p84q54J1932O483
$$ plain form
22448 709854 707251 697944 711209 723846 719088 726486 732222 728989 724110 721164 726713 741776 748694
22435 748694 747216 752956 748189 733715 732337 722876 714271 720956 721283 726397 718491 719028 724694 725565 733167
22420 733167 743147 751085 744637 721124 707359 713911 721847 717430 706944 710358 731587 734101 731068
22407 731068 729638 738126 735638 738903 740070 735522 726761 726932 719787 729248 740194 743438 734151 735647
22393 735647 739421 737001 751800 781090 765040 743042 735492 739980 759694 755421 737056 737382 748864
22380 748864 737497 737478 732416 727626 720472 726885 742030 752416 735248 727396 738375 737822 738401 746581
22366 746581 752274 755163 769800 769276 757766 758142 767094 763334 751624 753431 762955 754808 739231 739210
22352 739210 750377 756518 761429 757446 770876 774552 760703 741882 736415 735631 734777 746709 753192
22339G53192j554K799n979N508M519o281l999M944P617l427k233J771r806J426
22325G48497K179j824k240P43q709k060O707J3907r38j0678L0J846J8671R841
22311G75972r372o084j3959M822J6345L119Q509o034k910J274Q82M176O904r75
22297G82669Q131P963j1711j0112O418M042k8562q981R792Q174K419o069p432
22284G56741K950Q969J1654N999j482j3215j2697J6515J0255j3305N137J038M890
22271G83449n80k500J071j1666j825J7404P781j417J1984N687q482k453k874l460
22257G92119J1977M539j6378m566l18o231O536P540K81M779p088Q27J7001o055
22243H04963r721M817j779j0969L227J6601Q271Q200k703j4203j1890q787j080
$$ plain form
22339 753192 751638 754437 748458 753966 758485 752204 748205 753149 760766 757339 755106 756877 747071 748497
22325 748497 750676 748852 746612 747355 738646 736586 743293 757200 756262 745584 745614 747460 766131 775972
22311 775972 766600 760516 746557 751379 767724 770843 779352 773318 770408 771682 772564 776740 783644 782669
22297 782669 790800 798763 787052 776940 783358 787400 758838 749857 759649 767823 770242 764173 756741
22284 756741 759691 768660 780314 786313 784831 771616 758919 775434 785689 772384 777521 778559 783449
22271 783449 782869 780369 781440 769774 767949 785353 793134 791717 803701 809388 800906 798453 795579 792119
22257 792119 804096 808635 792257 787691 787373 781142 787678 795218 795499 800278 793190 794017 811018 804963
22243 804963 795242 800059 798280 787311 790538 807139 815410 823610 820907 806704 794814 786027 784947
22230G84947J6218J375K093J3694J1611j91j2652r934K893m1m69K096n238M758
22216H11160j3432N217J4807o275j144L603j1074p01J1749l887N546m158O694
22203H18105r534n575P760l47Q8q260j8828O27K436j256j993J5141R542N983N354
22188H19243p768K146n032K398j689k754k192K2422j092j605J1261q796N449R497
22174H41488M22j3939j3141L905O728n270j2520o216O193R857P940J2767m193
22161H34021q625Q024N80L492n856k4741j0936J6191J3745J0242K074n556J6205
22148H48860j3189j4976k940r149r001J9263Q377l871j879m207M768Q308P998
22135H38362K635o786K127O992R239j1089M796r270N150J4083N525J102O404q937
$$ plain form
22230 784947 801165 802540 804633 818327 829938 829747 817095 807161 810054 810013 809544 811640 806402 811160
22216 811160 797728 802945 817752 811477 810333 813936 802862 802161 813910 810023 815569 811411 818105
22203 818105 808571 802996 810756 810409 810497 802237 783409 784036 786472 785216 783223 798364 807906 813889 819243
22188 819243 811475 813621 808589 810987 809298 806544 804352 826774 825682 824077 835338 826542 831991 841488
22174 841488 841910 827971 814830 818735 825463 820193 807673 801457 807650 817507 825447 838214 834021
22161 834021 825396 833420 834000 837492 831636 806895 795959 812150 825895 836137 838211 832655 848860
22148 848860 835671 820695 817755 808606 799605 818868 827245 823374 821495 817288 822056 830364 838362
22135 838362 840997 834211 836338 843330 852569 841480 846276 837006 842156 856239 861764 862866 869270 860333
22121H60333o232j1391N496K1645p000k1313O500J686j0154M17J1868Q654p205
22108H53304m383j3555N399J207N978K2438J1735j7964p616l352J73M120J506
22095H58990J968q42N454j0230K14q586O563R758j0388k807J538o675K844n66
22081H47235j690K255O881K858j1095j502k21J665J6510P610K245k831q60J2235
22067H81295J6507n410j2047j160N771k645P05m984k618P706p314k4534l248R599
22053H57623P478O94k579P215K781O417J289l359P312J1164M340j0291P823L169
22039I01076q427k977J6341o662r564M603J5109o045p891n970L420J5951M135
22026I13099n753k195j3228k3960O232J3690J4828O398l617K672K519J0654J6501
$$ plain form
22121 860333 854101 842710 848206 869851 862851 841538 848038 849724 839570 839987 851855 860509 853304
22108 853304 848921 835366 840765 841972 847950 870388 882123 864159 856543 853191 853364 857484 858990
22095 858990 860958 860116 865570 855340 855554 846968 853531 863289 852901 850094 851632 844957 847801 847235
22081 847235 845545 847800 854681 857539 846444 844942 844721 846386 862896 870506 872751 869920 869060 881295
22067 881295 897802 892392 880345 879185 884956 882311 883016 878032 875414 883120 875806 851272 848024 857623
22053 857623 865101 865795 863216 870431 873212 879629 880918 877559 884871 896035 900375 890084 897907 901076
22039 901076 892649 889672 906013 899351 889787 894390 909499 903454 895563 889593 893013 908964 913099
22026 913099 907346 905151 891923 867963 874195 887885 902713 909111 905494 908166 910685 921339 937840
22013I37840j6320j4724k781n445k440J1983o638q770q758O944J4479L254N228
22000I13852j3398m832J5948J8727m795j2058L099J0493M805l122P80j610j1593
21987I16296L646P314O66m184L149m927n602O962K761m38o334n171k664m805m980
21972I01689O470J971j53N332m581O241L330j2723r963o569J5615M675k385P755
21958I16704R427q399j6883j0197p106R415J7744R798J1436Q195j1594q601L026
21945I22965N690N970J2191P899m959N057j0760r71R055J901J2583N644m098k065
21931I66102j0121j2970J00j680O313J5297J5148q807j1656j445k09j349L421
21918I58144M45P274l85p562k473P432l885P8p5q107N698L950o099L637M083O502
$$ plain form
22013 937840 921520 906796 904015 898570 896130 908113 901475 892705 883947 890891 905370 908624 913852
22000 913852 900454 895622 911570 930297 925502 913444 916543 927036 931841 928719 929499 927889 916296
21987 916296 919942 927256 927922 923738 926887 921960 916358 923320 926081 925643 919309 914138 911474 906669 901689
21972 901689 908159 910130 909977 915309 910728 916969 920299 907576 897613 891044 906659 911334 908949 916704
21958 916704 926131 917732 900849 890652 883546 892961 910705 920503 931939 940134 928540 919939 922965
21945 922965 928655 934625 946816 954715 949756 954813 944053 943082 952137 954038 966621 972265 968167 966102
21931 966102 955981 943011 943111 941431 947744 963041 978189 969382 957726 956281 956072 954723 958144
21918 958144 958589 965863 965478 957916 955443 962875 958990 959068 958993 950886 956584 960534 954435 958072 962155 968657
21902I68657J1058J7667L906j3020j3426J0186J622j7468m278J998M36j2348j2565
21889I42425Q350J2499K181Q590K0830P946j1603j0868j2929P220J8178O65p56
21876I92728o422o271L315K826k467P411k755m533K256m272K936J7217j527l664
21862I96778Q570J2069K3072r68j9944j2892j0410L972M195N152r55k136m550
21849A001953N956L12m189r367j251M974K774J586o300k0905k835M383L41m141
21835I73291j030J2712j4486q991R113J0449K163M635j1636J351O678J811r541
21822I76519J3287j867K737O105l243J853J885r238P324J5988J85n851J341K598
21808A009623P886j4255m164m794L303J4852j308p305m837P13p255L788O443P483
$$ plain form
21902 968657 979715 997382 1001288 988268 974842 985028 986650 969182 964904 966902 967338 954990 942425
21889 942425 950775 963274 965455 974045 994875 1002821 991218 980350 967421 974641 992819 993484 992728
21876 992728 986306 980035 983350 986176 983709 991120 988365 983832 986088 981816 984752 1001969 1000442 996778
21862 996778 1005348 1017417 1040489 1039521 1019577 1006685 996275 1000247 1004442 1009594 1008639 1006503 1001953
21849 1001953 1007909 1008221 1004032 994665 993414 998388 1001162 1002748 996448 975543 972708 977091 977432 973291
21835 973291 972261 984973 970487 961496 970609 981058 983221 987856 976220 977571 984249 986060 976519
21822 976519 989806 987939 990676 996781 993538 995391 997276 988038 995362 1011350 1011535 1005684 1007025 1009623
21808 1009623 1017509 1003254 999090 994296 997599 1012451 1011143 1003838 999001 999714 992459 996247 1002690 1010173
21794A010173n325J1799L22K84m830L341M537J6037N894j6511k2420K839J3502
21781A019642J5385P187L741M985j421r217q426J278J745M402K074j1227J913
21768A032061n403L19l285K311m732m107M484j83L25L6J3859L110J6882P831O35
21753A064143m024J604l641J0953n245j5577n374J4270J7658O13j3260j3777P017
21740A055360J191n809M715M741O90M652j0180k3955J7491J6202j179n317l900
21727A054702n546o75O667P98J0433J0424J2776n040p382j0200P82k79J447L176
21713A072083k828k780M752J316O843J2650l064r016q035n456J5045J5240L125
21700A099875O242j0430q716k174J0814R83j7128o71L724J2302Q212r6N46k1675
$$ plain form
21794 1010173 1004848 1016647 1016969 1017253 1012423 1015764 1020301 1036338 1042232 1025721 1003301 1006140 1019642
21781 1019642 1035027 1042214 1045955 1050940 1049519 1040302 1031876 1033154 1034899 1039301 1041375 1030148 1032061
21768 1032061 1026658 1026977 1023692 1026003 1021271 1017164 1021648 1021465 1021790 1021826 1035685 1038795 1055677 1063508 1064143
21753 1064143 1060119 1061723 1058082 1069035 1063790 1048213 1042839 1057109 1074767 1075380 1062120 1048343 1055360
21740 1055360 1056551 1050742 1055457 1060198 1060888 1065540 1055360 1031405 1048896 1065098 1063919 1058602 1054702
21727 1054702 1049156 1048481 1055148 1055946 1066379 1076803 1089579 1084539 1077157 1066957 1067739 1067460 1068907 1072083
21713 1072083 1069255 1066475 1071227 1072543 1079386 1092036 1088972 1079956 1071921 1066465 1081510 1096750 1099875
21700 1099875 1106117 1095687 1086971 1084797 1095611 1096594 1079466 1078795 1082519 1094821 1103033 1102937 1103483 1081808
21686A081808j0672J2130J0660o08J4378Q657N040n559J0629k574j1599q028r635
21673A094627m488J7934L201n749j0154L87Q759M148N50J5380n770L76M63j942
21659A117722K050J2853k409K928J0669L698j3914M204K602P07J3719N730p999
21646A152560P817L342m255k721J805K888o784l789K217q330j2904l735P341M653
21632A140105K406N24p731n620K545m354N525J689P909J3694J8025M671J113l10
21618A180191j6306n8m206L969l94n139L764M286P556K2j0639p909j1050N020
21604A149107j657o01n293n300K798Q468J2707M843K090O026M130Q28O88P245
21590A186079m461j0106o083k014J325n486J1250L689J0919k92j1071j484L773
$$ plain form
21686 1081808 1071136 1083266 1093926 1093318 1107696 1116353 1121393 1115834 1126463 1123889 1112290 1104262 1094627
21673 1094627 1090139 1108073 1111274 1105525 1095371 1095758 1104517 1108665 1109215 1124595 1118825 1119201 1119664 1117722
21659 1117722 1119772 1132625 1130216 1133144 1143813 1147511 1133597 1137801 1140403 1141110 1154829 1160559 1152560
21646 1152560 1160377 1163719 1159464 1156743 1158548 1161436 1154652 1150863 1153080 1144750 1131846 1128111 1135452 1140105
21632 1140105 1142511 1143035 1135304 1129684 1132229 1127875 1133400 1135089 1142998 1156692 1174717 1179388 1180501 1180191
21618 1180191 1163885 1163827 1159621 1163590 1163196 1158057 1161821 1166107 1173663 1173685 1163046 1155137 1144087 1149107
21604 1149107 1147450 1146849 1141556 1136256 1139054 1147522 1160229 1165072 1167162 1173188 1177318 1178146 1178834 1186079
21590 1186079 1181618 1171512 1165429 1163415 1164740 1159254 1170504 1174193 1185112 1184820 1173749 1172265 1176038
21577A176038O860J5094R470k276P84K223J2892J3251m872R66l234n139K520J890
21563A226467o332m366K542j4069p575p659N876J6712J5361L452n894p301M399
21550A221613j048k81Q140K285K906J3134P805r357j3250J091o265N182m768J412
21536A228599O303L087o452J0524O476j410M234K18j0017O871K508q551m413j092
21522A236885m346O279Q073Q998K8815J7063Q279m703k5236j9739L052J0369Q64
21509A274653j1040m117L328N852J6966L283r911n952J2253m019j8151r418j0112
21496A243615q61K5113Q736O589J1788J1172j1523k5472Q828L483n795Q652j3076
21483A271249K909K0180P742r395m455Q576J6235Q477J977K323q601K178M268
$$ plain form
21577 1176038 1182898 1197992 1207462 1205186 1205970 1208193 1221085 1234336 1229464 1230430 1227196 1222057 1224577 1226467
21563 1226467 1220135 1215769 1218311 1204242 1196667 1189008 1194884 1211596 1226957 1230409 1224515 1217214 1221613
21550 1221613 1220565 1220284 1228424 1230709 1233615 1246749 1254554 1245197 1231947 1233038 1226773 1231955 1227187 1228599
21536 1228599 1234902 1237989 1231537 1242061 1248537 1247127 1251361 1251579 1241562 1248433 1250941 1242390 1237977 1236885
21522 1236885 1232539 1238818 1246891 1255889 1284704 1301767 1310046 1305343 1280107 1260368 1263420 1273789 1274653
21509 1274653 1263613 1259496 1262824 1268676 1285642 1288925 1279014 1273062 1285315 1281296 1263145 1253727 1243615
21496 1243615 1242754 1267867 1276603 1283192 1294980 1306152 1294629 1269157 1277985 1281468 1275673 1284325 1271249
21483 1271249 1274158 1294338 1302080 1292685 1288230 1296806 1313041 1321518 1323495 1325818 1317217 1319395 1323663
21470A323663q304j6646j9292M307M824J4642O918j1421M285J8239L441j0762
21458A313894j8m99k341M606O154L249k673j255j776M134M924P74O970N305j0764
21443A330684l796n672p284J125J980M309Q306L510R970L700Q951N578N665n137
21429A361889j7097l810J9173J7778q301O35J12m124q875J782J0679Q265O874
21416A384980n475M193m728n788l098m208J0468J2760J815L373P695o219j5412
21403A380356R89p948N581M957o766l739J6613k50r11N168O11J6981J1493j045
21389A422090q826m065J1670K189m881p086q510R776J0874N1L685N949q783j6799
21375A407334P770P718M862J6595P667j5026k309r66M482J1261j9884k476J7673
$$ plain form
21470 1323663 1315359 1298713 1279421 1283728 1288552 1303194 1310112 1298691 1302976 1321215 1324656 1313894
21458 1313894 1313876 1313377 1311036 1315642 1321796 1325045 1322372 1321117 1319341 1323475 1328399 1329173 1336143 1341448 1330684
21443 1330684 1326888 1321216 1313932 1315057 1317037 1321346 1329652 1333162 1343132 1346832 1355783 1361361 1367026 1361889
21429 1361889 1344792 1340982 1360155 1377933 1369632 1370267 1370379 1366255 1357380 1359162 1369841 1378106 1384980
21416 1384980 1379505 1383698 1378970 1373182 1370084 1365876 1376344 1389104 1390919 1394292 1401987 1395768 1380356
21403 1380356 1381345 1373397 1378978 1383935 1377169 1373430 1390043 1389793 1388882 1394050 1394661 1411642 1423135 1422090
21389 1422090 1413264 1409199 1420869 1423058 1418177 1411091 1402581 1412357 1423231 1423282 1426967 1432916 1424133 1407334
21375 1407334 1415104 1422822 1427684 1444279 1451946 1436920 1434611 1433645 1438127 1449388 1429504 1427028 1444701
21362A444701J3773m477p169J381N783j323l484J328O628J251j001m375n186k424
21348A445406O386J0685P959p411n346o522k228M768J4344J0793O195m041J723
21335A482711L551N233M809M009Q072m597j1066m285r29o277K116O574M541r30
21321A493532J2887K458j7671k6K280L419Q004J3917L076K90J2592L325j521l228
21307A533334n14q495n959R349J6510p438j4411j4493K845N652Q178J208M385
21294A530151J1178J3310N050Q563N984r618j0965M123J0681r791j5428L513Q141
21281A554892P181N663J585J3115l85k891R289N144j0583O523M722j684m235j0120
21267A578216O504M841l456l992J596J5753R087P893Q8K826O019O890J090L170
$$ plain form
21362 1444701 1458474 1453997 1446828 1448209 1453992 1452669 1449185 1450513 1457141 1458392 1457391 1453016 1447830 1445406
21348 1445406 1451792 1462477 1470436 1463025 1457679 1451157 1448929 1453697 1468041 1478834 1485029 1480988 1482711
21335 1482711 1486262 1491495 1496304 1500313 1508385 1503788 1492722 1488437 1487508 1481231 1483347 1489921 1494462 1493532
21321 1493532 1506419 1508877 1491206 1491180 1493460 1496879 1504883 1518800 1521876 1522166 1534758 1538083 1536562 1533334
21307 1533334 1532820 1524325 1518366 1527715 1544225 1536787 1522376 1507883 1510728 1516380 1524558 1525766 1530151
21294 1530151 1541329 1554639 1559689 1568252 1574236 1564618 1553653 1557776 1568457 1558666 1543238 1546751 1554892
21281 1554892 1562073 1567736 1569321 1582436 1582051 1579160 1588449 1593593 1583010 1589533 1594255 1592571 1588336 1578216
21267 1578216 1584720 1589561 1586105 1582113 1583709 1599462 1608549 1616442 1616530 1619356 1625375 1632265 1633355 1636525
21253A636525j0027p974m31K805P432M330N365l839M701J953R996L725p28Q24
21239A654657j9597q908J5462J7442K703P544o373l879J5600j0422j9816L545
21227A647958J3016P699M986J344j071M460J1161K6524O382k7178j6797k65P34
21214A678953K334J6001J0531L56L323K35m868m923n796J2126R156n179j3072
21201A699177O33M079P385Q649J1109J8965k383o053m053n527M18L996L60L2347
21187A769102J8287k454P913R14k4327j2756L750K0754j772j536m17R271r83P340
21173A793086M310p519o736M125J835K03J2662K579J4927R545N625K672j631n301
21159A830382p113O449L724r932k329Q301J5046J9100J1965q925m247j224k034
$$ plain form
21253 1636525 1626498 1618524 1618093 1620898 1628330 1632660 1638025 1634186 1638887 1640840 1650836 1654561 1653833 1654657
21239 1654657 1635060 1626152 1641614 1659056 1661759 1669303 1662930 1659051 1674651 1664229 1644413 1647958
21227 1647958 1660974 1668673 1673659 1675003 1673932 1678392 1689553 1716077 1722459 1695281 1678484 1678219 1678953
21214 1678953 1681287 1697288 1707819 1708175 1711498 1711733 1706865 1701942 1696146 1708272 1717428 1712249 1699177
21201 1699177 1699810 1703889 1711274 1719923 1731032 1749997 1747614 1741561 1737508 1731981 1732399 1736395 1736755 1769102
21187 1769102 1787389 1784935 1792848 1793762 1769435 1756679 1760429 1781183 1779411 1777875 1777458 1786729 1785746 1793086
21173 1793086 1797396 1789877 1783141 1787266 1789101 1789304 1801966 1804545 1819472 1829017 1834642 1837314 1835683 1830382
21159 1830382 1823269 1829718 1833442 1823510 1821181 1829482 1844528 1863628 1875593 1866668 1862421 1861197 1859163
21146A859163m112J2893K8445N996k699n541o814Q1J170L88M052J0286J861k983
21132A902186J5020J3337K778K918J911o79J5915Q592l767R783P384J1853j242
21119A985989j5377j7187j5901Q296J6073J6004K9733O360n250k852N985J930
21107B013803J0432M116l724J3264M353j0497p328L568K2544K8902J8673n987
21095B092119j1140J111J9869J7733J2314J2802L848K3027Q692K338J1916J6254
21083B210883J6941J6135J5453K2866K8930K7554J4451K1078K5171o847k3201
21072B369414m7619n5414o9586q4476n8632n7880l3041M899J3152K4083N0293
21061B055193M1935J4726L81k0357m6850n4627n0734p0750o6985n2502l4850M834
$$ plain form
21146 1859163 1855051 1867944 1896389 1902385 1899686 1894145 1887331 1887412 1888582 1888970 1893022 1903308 1905169 1902186
21132 1902186 1917206 1930543 1933321 1936239 1938150 1937471 1953386 1961978 1958211 1967994 1975378 1987231 1985989
21119 1985989 1970612 1953425 1937524 1945820 1961893 1977897 2007630 2013990 2008740 2005888 2011873 2013803
21107 2013803 2024235 2028351 2024627 2037891 2042244 2031747 2024419 2027987 2050531 2079433 2098106 2092119
21095 2092119 2080979 2082090 2101959 2119692 2132006 2144808 2148656 2171683 2180375 2182713 2194629 2210883
21083 2210883 2227824 2243959 2259412 2282278 2311208 2338762 2353213 2374291 2399462 2392615 2369414
21072 2369414 2321795 2266381 2196795 2112319 2053687 1995807 1962766 1967665 1980817 2004900 2055193
21061 2055193 2097128 2111854 2112235 2091878 2045028 1990401 1939667 1868917 1801932 1749430 1714580 1719414
21049A719414Q697j6J1617L0216L0430K5506J9475K1663J5632j300J2889K3810
21037A918033J5972J2609J2327J0072m88K655K6453K7580J457L375P91l14L080
21024B033602J2443K1356J0599K0573P158Q718l320J0063K0778Q974Q473M886
21012B164303J419N13J471k240k5989j7852j3077r625p446J2552L722J1141K1062
20999B139954J9021K7334J2966J6714J139k5652n135k0196l9443j9006L737J8104
20987B129537J7990J1972n092k013P024J6784J6339J2975J9830J1814M556J621
20975B243337J878J7149J5773q984r583J600O598O573q582K712J1756Q260K2906
20962B311393J5194j6278r737J3489K3343N404Q65J786J9772J3645P260O900R925
$$ plain form
21049 1719414 1728111 1728095 1739712 1769928 1800358 1825864 1845339 1867002 1882634 1881334 1894223 1918033
21037 1918033 1934005 1946614 1958941 1969013 1968525 1971180 1997633 2025213 2026670 2030045 2030836 2030522 2033602
21024 2033602 2046045 2067401 2078000 2098573 2105731 2114449 2111129 2121192 2141970 2150944 2159417 2164303
21012 2164303 2165722 2166235 2167706 2165466 2139477 2121625 2108548 2098923 2091477 2104029 2107751 2118892 2139954
20999 2139954 2158975 2186309 2199275 2215989 2217128 2191476 2186341 2166145 2126702 2107696 2111433 2129537
20987 2129537 2147527 2159499 2154407 2152394 2159418 2176202 2192541 2205516 2225346 2237160 2241716 2243337
20975 2243337 2245215 2262364 2278137 2269153 2259570 2261170 2267768 2274341 2265759 2268471 2280227 2288487 2311393
20962 2311393 2326587 2310309 2300572 2314061 2337404 2342808 2343673 2345459 2365231 2378876 2386136 2393036 2402961
20949B402961J238j221q756p258l753L361Q762J0106J3310P836R011M644l066
20936B437175J9312J4140k004P714J8959N371j1830P417j54n853j252J9416J1971
20923B520382K744J3634J1772k0783r516J2878K0643J6031P195Q075M779Q625
20911B596459j81J0615k637J997L333J3017K5484K0558M875m305p56l166J4591
20898B679884L164N029q35o123Q586l998J5323J5386J2144j368J9901Q538l316
20885B752315L629R505K624M328Q576J3893l612K713J3601K267K013M864J9582
20872B836298J3867J770M324J5242J3585L758j6308j5028n629J3642J1305M251
20860B881077K4310K4040O862K899L13K1555J6594J8163R676k464Q640Q028M036
$$ plain form
20949 2402961 2404199 2402978 2394222 2386964 2383211 2386572 2395334 2405440 2418750 2426586 2435597 2440241 2437175
20936 2437175 2456487 2470627 2468623 2476337 2495296 2500667 2488837 2496254 2496100 2490247 2488995 2508411 2520382
20923 2520382 2523126 2536760 2548532 2527749 2518233 2531111 2551754 2567785 2574980 2583055 2587834 2596459
20911 2596459 2596278 2606893 2604256 2606253 2609586 2622603 2648087 2668645 2673520 2669215 2668459 2665293 2679884
20898 2679884 2683048 2688077 2687242 2681119 2689705 2685707 2701030 2716416 2728560 2727192 2747093 2755631 2752315
20885 2752315 2755944 2765449 2768073 2772401 2780977 2794870 2791258 2793971 2807572 2809839 2811852 2816716 2836298
20872 2836298 2850165 2851935 2856259 2871501 2885086 2888844 2872536 2857508 2851879 2865521 2876826 2881077
20860 2881077 2905387 2929427 2936289 2939188 2939501 2961056 2977650 2995813 3005489 3003025 3011665 3019693 3023729
20847C023729J0773P034L062N145M757Q132M942J8109R891J1876o3R607J2526
20834C129520o077P683J2046Q039J5354K2702J135j3259M918K110J7697R108J5782
20821C226758O541J912J0434J0804l031M914J0606J6758K0271J4933J1810J4260
20809C346970n59R630J6051J8939N675P765J7420K7657K2504J7844j057L684J959
20796C494482K1099J7925O082n113J2874L7317O3539P6674Q0419L2011Q451j0916
20784C834844j8717l6017n1271m1442l9445k8764j939j2696M926J8732K0449L2495
20772C681155L0188K0083K3766q248r071j5360k8629k3328p935J5976K5896L657
20760C708150R870K1603K6811J9710K7912J7140K6112K3095N561K0612J7442J9004
$$ plain form
20847 3023729 3034502 3041536 3044598 3049743 3054500 3062632 3067574 3085683 3095574 3107450 3107387 3116994 3129520
20834 3129520 3123443 3131126 3143172 3151211 3166565 3189267 3190402 3177143 3182061 3184171 3201868 3210976 3226758
20821 3226758 3233299 3235211 3245645 3256449 3253418 3258332 3268938 3285696 3305967 3320900 3332710 3346970
20809 3346970 3346411 3356041 3372092 3391031 3396706 3404471 3421891 3449548 3472052 3489896 3488839 3492523 3494482
20796 3494482 3515581 3533506 3539588 3534475 3547349 3584666 3648205 3724879 3805298 3837309 3845760 3834844
20784 3834844 3816127 3780110 3728839 3687397 3647952 3619188 3617249 3604553 3609479 3628211 3648660 3681155
20772 3681155 3711343 3731426 3755192 3746944 3737873 3722513 3693884 3670556 3662621 3678597 3704493 3708150
20760 3708150 3718020 3739623 3766434 3786144 3814056 3831196 3857308 3880403 3885964 3906576 3924018 3943022
20748C943022J7855J4110K1209R752J8804N473R451J3720L0654L3042K2063R423
20736D148578J488K4068K8170J1326J5948Q833J2250J0840j8500o052r518j9895
20724D207536j0572J3125O601J4866J5548J5361J7334K1868M2167M1437K9191
20713D414462L1927K3856K5358K3884J4248N816K0608K3591L5977K9852K9664
20702D679243J675J507J1268r54K7985L6512M9109M2288K9458J7071J0424J8143
20690D923729J3316K2895J9471K5373L8699L1776K8705L915J1130l879K4986L0012
20678E170128K5928J3849K4345J3969J8542M6537P7757M9351J4449J5753M0153
20667E510761L8490K4847Q590K204K4652L4947L4264L4151L0373M1736L4493L2560
$$ plain form
20748 3943022 3960877 3974987 3996196 4005948 4024752 4030225 4039676 4053396 4084050 4117092 4139155 4148578
20736 4148578 4150066 4174134 4202304 4213630 4229578 4238411 4250661 4261501 4243001 4236949 4227431 4207536
20724 4207536 4196964 4210089 4216690 4231556 4247104 4262465 4279799 4301667 4343834 4385271 4414462
20713 4414462 4446389 4470245 4495603 4519487 4533735 4539551 4560159 4583750 4619727 4649579 4679243
20702 4679243 4680918 4682425 4693693 4692739 4720724 4757236 4806345 4848633 4878091 4895162 4905586 4923729
20690 4923729 4937045 4959940 4979411 5004784 5043483 5075259 5103964 5107879 5119009 5115130 5140116 5170128
20678 5170128 5196056 5209905 5234250 5248219 5266761 5313298 5391055 5440406 5454855 5470608 5510761
20667 5510761 5549251 5574098 5582688 5584892 5609544 5644491 5678755 5712906 5743279 5785015 5819508 5852068
20655E852068M7859N9754L3926K1043L3287L6867L0854L3645L8015L5434K2167
20644F244919J7849L8329M6947K8016M7204O0297O2358O0153N3187L9258M5968
20633F744485N6848P0536Q6293J06569R2536N9916K6725L4052K9661K6220O0111
20622G393952P4831P7935P8782R5576R9446J13020J24838J29436J36048J59266
20612H483130J32165k0276l30008m36573l27312j48747O7735J87360K00704J70860
20602G979038Q4176K4254M5854J34337K49134L03783J45406k69964n71321n05369
20592G619328l40643m9904J50059K08239J95897J41059Q0557J09971J27164J30278
20582H372005J34545J31768J26729J19886J29852J34009J24870J27771J14835
$$ plain form
20655 5852068 5899927 5959681 5993607 6014650 6047937 6084804 6115658 6149303 6187318 6222752 6244919
20644 6244919 6262768 6301097 6348044 6376060 6423264 6483561 6545919 6606072 6659259 6698517 6744485
20633 6744485 6801333 6871869 6958162 7064731 7157267 7217183 7243908 7277960 7307621 7333841 7393952
20622 7393952 7468783 7546718 7625500 7721076 7820522 7933542 8058380 8187816 8323864 8483130
20612 8483130 8615295 8595019 8265011 7828438 7501126 7352379 7420114 7607474 7808178 7979038
20602 7979038 8063214 8087468 8133322 8267659 8516793 8820576 8965982 8696018 8124697 7619328
20592 7619328 7278685 7228781 7378840 7587079 7782976 7924035 8004592 8114563 8241727 8372005
20582 8372005 8506550 8638318 8765047 8884933 9014785 9148794 9273664 9401435 9516270
20573I516270J09783J19607J20968J22345J06865J21459J29867J22590J19867
20564A0589621J38785J41328J39995J34092J35877J48026J44393J53755J64457
20555A1890329J63447J63620J71758J79631J82436J80733J86072J90862J89610
20546A3498498J73206J70452J98305K29098K44151K33477K31952K30356K17786
20537A5427281K27388K64418K85747K75056L02737L14776L49476L48362L59687
20528A8154928L49260L74965L84251L53843L30104L64677L98635M40214M75887
20519B1626764M58395L69349L55862M24950M98286O58765P75377Q48918Q80423
20510B6897089Q35244Q42786R07345R53790J026606R65397O99578M30862L87521
$$ plain form
20573 9516270 9626053 9745660 9866628 9988973 10095838 10217297 10347164 10469754 10589621
20564 10589621 10728406 10869734 11009729 11143821 11279698 11427724 11572117 11725872 11890329
20555 11890329 12053776 12217396 12389154 12568785 12751221 12931954 13118026 13308888 13498498
20546 13498498 13671704 13842156 14040461 14269559 14513710 14747187 14979139 15209495 15427281
20537 15427281 15654669 15919087 16204834 16479890 16782627 17097403 17446879 17795241 18154928
20528 18154928 18504188 18879153 19263404 19617247 19947351 20312028 20710663 21150877 21626764
20519 21626764 22085159 22454508 22810370 23235320 23733606 24392371 25167748 26016666 26897089
20510 26897089 27732333 28575119 29482464 30436254 31462860 32428257 33127835 33558697 33946218
20501C3946218N29285P64133J147086J425143J786106K123830K428723K750343
20493D6900867K958132K868144K727876L133667L461675M049500N051808O116101
20485G7267770P506595R307893J1543713J4350216J7883015K2070506K4140953
20478A84070661J0959870m3363458j05532659r8655554q1836589m7001018K056461
20471a79302286K0366638K0261962J6644611J3494056J1093878R158552P656252
20464h0626337O559938N575195M475091L428748L016352K743485K674465K784552
20456d9368511K662173K435662K184901J983309J860619J767797J636991J524841
20448c3312218J337497Q23479L70975L08573L25244N49112P86686Q86426Q97952
$$ plain form
20501 33946218 34475503 35239636 36386722 37811865 39597971 41721801 44150524 46900867
20493 46900867 49858999 52727143 55455019 58588686 62050361 66099861 71151669 77267770
20485 77267770 84774365 94082258 105625971 119976187 137859202 159929708 184070661
20478 184070661 195030531 151667073 46134414 -52521140 -134357729 -181358747 -179302286
20471 -179302286 -158935648 -138673686 -122029075 -108535019 -97441141 -88282589 -80626337
20464 -80626337 -74066399 -68491204 -64016113 -60587365 -57571013 -54827528 -52153063 -49368511
20456 -49368511 -46706338 -44270676 -42085775 -40102466 -38241847 -36474050 -34837059 -33312218
20448 -33312218 -31974721 -31151242 -30780267 -30471694 -30146450 -29597338 -28810652 -27924226 -27026274
20439b7026274Q75727P93097P12105O47105O04195N81397N46127L98296K49004
20430b1619221K02356K23821K96223M13080M62811M56455M50447M65306M26701
20421a8222021L89549L66266L36227L42740L36118L44481L51527L04276K07850
20412a5242987J82315J66078J81401K14249K46374K61210K60655K64646K59733
20403a3206326K47914K32281K24780K04290J41490M9289L4042O6422Q3726J25525
20393a1796567J72487J82425J71613J68446J59969J51647J46162J47283J40104
20384a0356431J35561J35867J38117J23367J13683J10195J19778J19958R4109
20375i265796Q4908J00085J07111J01085R3702R5587Q7551J13868J20353R9306
$$ plain form
20439 -27026274 -26150547 -25357450 -24645345 -23998240 -23394045 -22812648 -22266521 -21868225 -21619221
20430 -21619221 -21416865 -21193044 -20896821 -20483741 -20020930 -19564475 -19114028 -18648722 -18222021
20421 -18222021 -17832472 -17466206 -17129979 -16787239 -16451121 -16106640 -15755113 -15450837 -15242987
20412 -15242987 -15060672 -14894594 -14713193 -14498944 -14252570 -13991360 -13730705 -13466059 -13206326
20403 -13206326 -12958412 -12726131 -12501351 -12297061 -12155571 -12106282 -12072240 -12005818 -11922092 -11796567
20393 -11796567 -11624080 -11441655 -11270042 -11101596 -10941627 -10789980 -10643818 -10496535 -10356431
20384 -10356431 -10220870 -10085003 -9946886 -9823519 -9709836 -9599641 -9479863 -9359905 -9265796
20375 -9265796 -9180888 -9080803 -8973692 -8872607 -8778905 -8683318 -8595767 -8481899 -8361546 -8262240
20365h262240Q8993Q3174N4835O2963N4677Q1411R0502P1267O4099O3739L8878
20354g507702m575l1221M3180J53255J81174J80174J27729O3215L1877N4685P4723
20343f633486O9614R9821Q0789J1323r9381p8091n2564k1053M7832P7306R1194
20332f406696R3207Q9216Q5646Q8971R2959J14806J20507M6822r2718j12627r4045
20321e973952j08689k2314L8026N5103P1319P6101O0299N6265N8866N1920L7114
20310e599942L5391M0493M0809M4759N2915M5404N1296M4061N4777L0488L4398
20299e125151M1342L2436K8533K3160K3894K9181K5777L2826L0370M4193M1162
20288d772277L8192L9382N2651L1962K5892K4017K7853L0765J6516J0163J1368
$$ plain form
20365 -8262240 -8173247 -8090073 -8035238 -7972275 -7917598 -7836187 -7745685 -7674418 -7610319 -7546580 -7507702
20354 -7507702 -7512277 -7543498 -7500318 -7347063 -7165889 -6985715 -6857986 -6794771 -6762894 -6708209 -6633486
20343 -6633486 -6563872 -6464051 -6383262 -6371939 -6471320 -6549411 -6601975 -6623028 -6575196 -6497890 -6406696
20332 -6406696 -6313489 -6224273 -6138627 -6049656 -5956697 -5841891 -5721384 -5674562 -5767280 -5879907 -5973952
20321 -5973952 -6082641 -6104955 -6066929 -6011826 -5940507 -5864406 -5804107 -5747842 -5688976 -5637056 -5599942
20310 -5599942 -5564551 -5524058 -5483249 -5438490 -5385575 -5340171 -5288875 -5244814 -5190037 -5159549 -5125151
20299 -5125151 -5083809 -5051373 -5022840 -4999680 -4975786 -4946605 -4920828 -4888002 -4857632 -4813439 -4772277
20288 -4772277 -4734085 -4694703 -4642052 -4610090 -4584198 -4560181 -4532328 -4501563 -4485047 -4474884 -4463516
20277d463516K4148L2591K9464K6438K4024L9617L8950K7133L6504L5684K8800
20266d120163K9850K9142J6577K1273J5046K8197Q733K5659L2608K6895R821J464
20254c874898L583K0300K6829K8003L4825L1047L0262J7693L0909K7647J0035
20243c613765K0906K9914M1337L9009K6405J0952K8231M9049M0569J4737J7525
20232c295131J6675N945k6861k4891l0200o3102m5294j3440J4816L9426L7839
20221c384218L0816K9982M1297K7751L6038J9298j3684l1197m7002o1854j7944
20210c370717m250J5615K9565L8167M0178K8887L5727L1469K6995K4759K6854
20199c076751M9308L4612K7240L3471M7587M8964N1245L4612J7779m0589m9196
$$ plain form
20277 -4463516 -4439368 -4406777 -4377313 -4350875 -4326851 -4287234 -4248284 -4221151 -4184647 -4148963 -4120163
20266 -4120163 -4090313 -4061171 -4044594 -4023321 -4008275 -3980078 -3971345 -3945686 -3913078 -3886183 -3876362 -3874898
20254 -3874898 -3871315 -3851015 -3824186 -3796183 -3761358 -3730311 -3700049 -3682356 -3651447 -3623800 -3613765
20243 -3613765 -3592859 -3562945 -3521608 -3482599 -3456194 -3445242 -3417011 -3367962 -3327393 -3312656 -3295131
20232 -3295131 -3278456 -3272511 -3299372 -3324263 -3354463 -3417565 -3462859 -3476299 -3461483 -3422057 -3384218
20221 -3384218 -3353402 -3323420 -3282123 -3254372 -3218334 -3199036 -3212720 -3243917 -3290919 -3352773 -3370717
20210 -3370717 -3374967 -3359352 -3329787 -3291620 -3251442 -3222555 -3186828 -3155359 -3128364 -3103605 -3076751
20199 -3076751 -3027443 -2992831 -2965591 -2932120 -2884533 -2835569 -2784324 -2749712 -2731933 -2772522 -2821718
20188b821718r0757j09032m6716k7852o092M2230M9109M3974M0930M0876N6992
20177b828056M5591K4114j2003j8106m2160q5196k8250N681J3859M3671O7059
20166b813796Q0772O7210J7959q858l6056m3795k5526K339J1023R353J5101J9983
20154b704291K5320K2940j4009p75J8183L5220J3805J6085K1696L721o04O21R952
20141b552136J0941p541M836R946K4106J6932J6666J7514K701K394J3947J3109
20129b426585K1553k953R766L811J4526J0670P636M662J5745M015r590K446J7780
20116b326518J7576J7010Q918J0909K2942K3085N521N325J755L171K584P532J7989
20103b182201N011P109K0410K0036K673J271J8000J2970l827M956R377J1963J2282
$$ plain form
20188 -2821718 -2912475 -3021507 -3068223 -3096075 -3102167 -3059937 -3010828 -2966854 -2925924 -2885048 -2828056
20177 -2828056 -2782465 -2758351 -2770354 -2788460 -2830620 -2915816 -2944066 -2938385 -2924526 -2880855 -2813796
20166 -2813796 -2733024 -2665814 -2647855 -2656713 -2692769 -2736564 -2762090 -2759751 -2748728 -2739375 -2724274 -2704291
20154 -2704291 -2678971 -2656031 -2670040 -2670815 -2652632 -2617412 -2603607 -2587522 -2565826 -2562105 -2562709 -2562088 -2552136
20141 -2552136 -2541195 -2548736 -2543900 -2533954 -2509848 -2492916 -2476250 -2458736 -2456035 -2453641 -2439694 -2426585
20129 -2426585 -2405032 -2407985 -2398219 -2394408 -2379882 -2369212 -2361576 -2356914 -2341169 -2337154 -2346744 -2344298 -2326518
20116 -2326518 -2308942 -2291932 -2283014 -2272105 -2249163 -2226078 -2220557 -2215232 -2213477 -2210306 -2207722 -2200190 -2182201
20103 -2182201 -2177190 -2170081 -2149671 -2129635 -2126962 -2125691 -2107691 -2094721 -2098548 -2093592 -2084215 -2072252 -2059970
20090b059970J0577O68R918K9251J2073m777P519K4241J6057j0566O460J0504
20078a948045J579M421j694M551J3142k300K0151J6096R045J3439J7195L279L707
20065a845434Q61m87m524Q505J0706M871J6192p17K581o215M145J1259J8864J9592
20051a759801L121J0172J7642J1325M406j463n459J3711J1625R715J6444J9479
20039a649083J887j4702J2384J7578K2725k751r850N687K5612J8035K0925J5034
20027a536519Q055J2601K4715J9614P243Q847K550J3154K0265J0491K0825K6497
20015a361662L4781K8305K3223J4508J1274N008O432j1727k9948k2111l6378q9117
20003a427412j15930j05819j20738j08373o1531k5698j1372O262J2039n927M469
$$ plain form
20090 -2059970 -2049393 -2048725 -2038807 -2009556 -1997483 -2002260 -1994741 -1970500 -1954443 -1965009 -1958549 -1948045
20078 -1948045 -1946466 -1942045 -1943739 -1939188 -1926046 -1928346 -1908195 -1892099 -1883054 -1869615 -1852420 -1849141 -1845434
20065 -1845434 -1844573 -1845060 -1849584 -1841079 -1830373 -1825502 -1809310 -1810027 -1807446 -1813661 -1809516 -1798257 -1779393 -1759801
20051 -1759801 -1756680 -1746508 -1728866 -1717541 -1713135 -1714598 -1720057 -1706346 -1694721 -1685006 -1668562 -1649083
20039 -1649083 -1647196 -1661898 -1649514 -1631936 -1609211 -1611962 -1621812 -1616125 -1590513 -1572478 -1551553 -1536519
20027 -1536519 -1528464 -1515863 -1491148 -1471534 -1464291 -1455444 -1452894 -1439740 -1419475 -1408984 -1388159 -1361662
20015 -1361662 -1326881 -1298576 -1275353 -1260845 -1249571 -1244563 -1238131 -1249858 -1279806 -1301917 -1338295 -1427412
20003 -1427412 -1543342 -1649161 -1769899 -1878272 -1939803 -1965501 -1976873 -1970611 -1958572 -1964499 -1960030
19992a960030K4193L7889K1280J4780J6405K2477J9409K7464K4017J0009R850
19981a732257R193J7726N193m539J3852J4698K7253R626J7883P065L176J4020
19969a597111Q647K1132R717r350K451P246Q301J1662J2906P064N674K6225J2197
19956a473239Q660J7950M568J890j1069n180Q649K427N829J2192M612j4927j988
19943a439626K1194K1335J3951J193J627Q735J0459o220K25m331M276J4748J5971
19930a336463J4845J7166K4911R078l909J008R184J1174n077J1309J4010m447
19918a237211K287Q857J2204M733J6075J6365J9759N528l848M214J2249M309J9071
19905a115408Q327K0086J8323J6756L3094K9643K0753K8382K7531J7398J8199
$$ plain form
19992 -1960030 -1935837 -1897948 -1876668 -1861888 -1845483 -1823006 -1803597 -1776133 -1752116 -1742107 -1732257
19981 -1732257 -1723064 -1705338 -1700145 -1704684 -1690832 -1676134 -1648881 -1639255 -1621372 -1614307 -1611131 -1597111
19969 -1597111 -1588464 -1567332 -1557615 -1566965 -1564514 -1557268 -1548967 -1537305 -1524399 -1517335 -1511661 -1485436 -1473239
19956 -1473239 -1464579 -1446629 -1442061 -1440171 -1451240 -1456420 -1447771 -1445344 -1439515 -1427323 -1422711 -1437638 -1439626
19943 -1439626 -1418432 -1397097 -1383146 -1381953 -1380326 -1371591 -1361132 -1367352 -1367127 -1371458 -1367182 -1352434 -1336463
19930 -1336463 -1321618 -1304452 -1279541 -1270463 -1274372 -1273364 -1264180 -1253006 -1258083 -1246774 -1232764 -1237211
19918 -1237211 -1234924 -1226067 -1213863 -1209130 -1193055 -1176690 -1156931 -1151403 -1155251 -1151037 -1138788 -1134479 -1115408
19905 -1115408 -1107081 -1086995 -1068672 -1051916 -1018822 -989179 -968426 -940044 -912513 -895115 -876916
19894h76916Q358j0802r963l2931o6118p7846p8774o4098l6325P807J3716J9120
19882a204772L2160L6972K5019K0944o152l0628o6304r6539j28023j06673o8559
19871a592555m8073l2614J482K6674J8843K4923L2254J9376J5026K0209J3853
19860a500602J3182K2299K4182J1361K6296L1504J9416O625J1447Q78l805K0304
19848a316913J2363q51J6639P060j958J8956J1076M117O715J3244m205p238k184
19835a243179l495J5841J4055J6287J5339L605q858J4970J992q518o135R693J0224
19822a168179J46M949R981Q05q035L27J901p29O951J5589J9776m330m791o332
19808a131971K466P042R293K1578K0733j313j0202J1137P52p768N23j449o406
$$ plain form
19894 -876916 -868558 -879360 -889323 -922254 -988372 -1066218 -1144992 -1209090 -1245415 -1237608 -1223892 -1204772
19882 -1204772 -1172612 -1135640 -1110621 -1089677 -1095829 -1126457 -1192761 -1289300 -1417323 -1523996 -1592555
19871 -1592555 -1640628 -1673242 -1671760 -1645086 -1626243 -1601320 -1569066 -1549690 -1534664 -1514455 -1500602
19860 -1500602 -1487420 -1465121 -1440939 -1429578 -1403282 -1371778 -1352362 -1345737 -1334290 -1333412 -1337217 -1316913
19848 -1316913 -1304550 -1305401 -1288762 -1281702 -1283660 -1264704 -1253628 -1249511 -1242796 -1229552 -1233757 -1240995 -1243179
19835 -1243179 -1246674 -1230833 -1216778 -1200491 -1185152 -1181547 -1190405 -1175435 -1173443 -1181961 -1188096 -1178403 -1168179
19822 -1168179 -1168033 -1163084 -1153103 -1152298 -1160333 -1160006 -1158105 -1158834 -1151883 -1136294 -1116518 -1120848 -1125639 -1131971
19808 -1131971 -1129505 -1122463 -1113170 -1091592 -1070859 -1072172 -1082374 -1071237 -1070485 -1078253 -1077730 -1079179 -1085585
19795a085585J4058K967K321Q971j334N338K062n568K122Q733L694R125J2001
19782a021095N179j596j715q077Q628J2832L758k951j0563J581M770J0639L750
19769i94860J710J0670R086L759R921J4919r252j7392P504J3125J1009R815L373
19756i26613J2276n988p531n458o18m542Q102O876N436l353l384m437R73J2724
19742i15537r02p665L570J5856P414p583l341P753O246N065r847j4546J0012Q221
19728h95284J1569P252k703L741L762Q377J040o114L380J5564r504k855O735J4261
19714h40779R496J3241m847n426j6703k451M957k37L042J2114j401J0640J5738
19701h02616Q81j0185m419Q606N687p143N124R381M461j255p865q591N612J4461
$$ plain form
19795 -1085585 -1071527 -1068560 -1066239 -1057268 -1058602 -1053264 -1051202 -1056770 -1054648 -1045915 -1042221 -1033096 -1021095
19782 -1021095 -1015916 -1017512 -1019227 -1027304 -1018676 -1005844 -1002086 -1005037 -1015600 -1014019 -1009249 -998610 -994860
19769 -994860 -993150 -982480 -973394 -969635 -959714 -944795 -954047 -971439 -963935 -950810 -939801 -929986 -926613
19756 -926613 -914337 -920325 -927856 -933314 -933932 -938474 -930372 -923496 -918060 -921413 -924797 -929234 -928261 -915537
19742 -915537 -916439 -924104 -920534 -904678 -897264 -904847 -908188 -900435 -894189 -889124 -898971 -913517 -903505 -895284
19728 -895284 -883715 -876463 -879166 -875425 -871663 -863286 -862246 -868360 -864980 -849416 -858920 -861775 -855040 -840779
19714 -840779 -831283 -818042 -822889 -828315 -845018 -847469 -842512 -842749 -839707 -827593 -828994 -818354 -802616
19701 -802616 -801735 -811920 -816339 -807733 -802046 -809189 -804065 -794684 -790223 -791478 -799343 -807934 -802322 -787861
19687g87861N655J1485j17J527N21m222J231L383j0774j3415O277J6090J2976
19674g57244l243K050l892J3451Q348k996L574m314n527l72R248J206J1007M614
19660g24090J88Q623M847L963j397j0353q564j1815o048J1929Q936n783n329J7008
19646g17885J4276J1461N529J0096L515R756L118j668L465Q674n637j5210j518
19633f72028L89J782J2442K561k744P35k112K712M775K923J5932J749J221J657
19619f28006P076j6050j993q36N805k127k6373O557K930M994K591p896J01J442
19605f51785J2134q85O839J0572J0967J90K062J3940J814j883n510m810n178J3794
19591e97739r808j1497Q369m162P096J4750Q329K419M880j2318p215L715O78J2600
$$ plain form
19687 -787861 -782206 -770721 -770838 -769311 -768790 -773012 -771781 -768398 -779172 -792587 -786310 -770220 -757244
19674 -757244 -760487 -758437 -762329 -748878 -740530 -743526 -739952 -744266 -749793 -750165 -740917 -739711 -728704 -724090
19660 -724090 -723902 -715279 -710432 -706469 -707866 -718219 -726783 -738598 -744646 -732717 -723781 -729564 -734893 -717885
19646 -717885 -703609 -692148 -686619 -676523 -673008 -663252 -660134 -661802 -658337 -649663 -655300 -670510 -672028
19633 -672028 -671639 -669857 -657415 -654854 -657598 -656863 -658975 -656263 -651488 -648565 -632633 -630884 -629663 -628006
19619 -628006 -620930 -636980 -638973 -639809 -634004 -636131 -662504 -655947 -653017 -648023 -645432 -653328 -653227 -651785
19605 -651785 -639651 -640536 -633697 -623125 -612158 -611968 -609906 -595966 -594152 -596035 -601545 -606355 -611533 -597739
19591 -597739 -607547 -619044 -610675 -614837 -607741 -592991 -584662 -582243 -577363 -589681 -596896 -593181 -592503 -579903
19577e79903K0892K1541N16j2576p655k282k452K672l397L377n989O17L756o318
19563e67201j2789N036J0894K4627L605M569m893j0578k047R869P550j885K155
19550e31088Q892L88N224L562j0994l93M361n034P311k512K340P22m41J0675P985
19535d99002j46K473O574J2457J1625j2363j3327k821M927k944L065P641j21q834
19521d90796q438o60L862K1653N412j5055r534j64L567O240J951k632k938M674
19507d82858L12M097J0430J0527L008p747L465m830j379O566J3985J7539q557
19494d35442N742J3725l01r208n993Q792k841k648L0039K641r798l690r392j9406
19480d37780o599n708k181m349k449O520K2352Q925n592m197Q053J3997M11o530
$$ plain form
19577 -579903 -559011 -537470 -536954 -549530 -557185 -559467 -561919 -559247 -562644 -559267 -565256 -564639 -560883 -567201
19563 -567201 -579990 -574954 -564060 -539433 -535828 -531259 -536152 -546730 -548777 -538908 -531358 -533243 -531088
19550 -531088 -522196 -521808 -516584 -513022 -524016 -524409 -520048 -525082 -517771 -520283 -517943 -517221 -517662 -506987 -499002
19535 -499002 -499148 -496675 -490101 -477644 -466019 -478382 -491709 -494530 -489603 -492547 -489482 -481841 -481962 -490796
19521 -490796 -499234 -499894 -496032 -474379 -468967 -484022 -493556 -493720 -490153 -483913 -481962 -484594 -487532 -482858
19507 -482858 -482546 -478449 -468019 -457492 -454484 -462231 -458766 -463596 -464975 -458409 -444424 -426885 -435442
19494 -435442 -429700 -415975 -416276 -425484 -431477 -422685 -425526 -428174 -398135 -395494 -405292 -408982 -418374 -437780
19480 -437780 -444379 -450087 -452268 -456617 -459066 -452546 -430194 -421269 -426861 -431058 -423005 -409008 -408597 -415127
19466d15127P336p2L725M335R928q331j5124R603J4678l131r190j307P683j592
19452c96586k024N809J7555O643j2835J023N507j1125o393J1969R144K457J857
19439c66999J0136n333q498Q105k343N690k101j7107n332J5863J4332l925o315
19426c63827k404J0964M777l497m033p56R069p900q251J2220J8437K421k678J137
19412c34321l78J0907j869j324L016j829J0947q362j1045j5064j403K945J1808
19399c35972J2623J5350R026M31j2914K467k752M788L188o428K406J289o624o80
19385c13802K508L921R368N796j78O86n919o32O172O963n904n294j184J6736K277
19370b78486j0565k675R585J2021K815K645K5282o611j1905j2239Q852O191J410
$$ plain form
19466 -415127 -407791 -407863 -404138 -399803 -389875 -398206 -413330 -403727 -389049 -392180 -401370 -402677 -394994 -396586
19452 -396586 -398610 -392801 -375246 -368603 -381438 -380415 -374908 -386033 -392426 -380457 -371313 -368856 -366999
19439 -366999 -356863 -362196 -370694 -362589 -364932 -359242 -361343 -378450 -383782 -367919 -353587 -357512 -363827
19426 -363827 -366231 -355267 -350490 -353987 -358020 -358776 -349707 -357607 -365858 -353638 -335201 -332780 -335458 -334321
19412 -334321 -334699 -323792 -325661 -326985 -323969 -325798 -314851 -323213 -334258 -349322 -350725 -347780 -335972
19399 -335972 -323349 -307999 -298973 -298542 -311456 -308989 -311741 -306953 -303765 -310193 -307787 -306498 -313122 -313802
19385 -313802 -311294 -307373 -298005 -292209 -292387 -291701 -297620 -298252 -292080 -285117 -291021 -296315 -297499 -280763 -278486
19370 -278486 -289051 -291726 -282141 -270120 -267305 -264660 -239378 -245989 -257894 -270133 -261281 -255090 -253680
19357b53680l108l073m958O698P797p623O244M702p839j139J485n941L770O255
19343b50410m443J0611n86r218q933j062r489j2124K424K5070J2841m111J1244
19330b38186O104P22M246O909M130j635M663j494j2791l770J7670J2512n950P161
19316a99709J3041J2456J572L874q680l786j8094L23p192j1531N947J1456J3118
19303a87205J878o805K292j5295M039K576Q088j435l460R34N161O462Q170Q651
19289a65949P389J534j5890j1795M796L737J3313M793n682R730N850K434R23L386
19275a41431Q710q108Q671J4154Q94r341j659M25J9375P087p316n696J887M929
19261a07419O907k445j6568l287M199P574N774L598Q303J1723k60k362P764m341
$$ plain form
19357 -253680 -256788 -259861 -264819 -258121 -250324 -257947 -251703 -247001 -254840 -255979 -254494 -260435 -256665 -250410
19343 -250410 -254853 -244242 -244828 -254046 -262979 -264041 -273530 -285654 -283230 -258160 -245319 -249430 -238186
19330 -238186 -232082 -231360 -227114 -220205 -216075 -217710 -213047 -214541 -227332 -231102 -213432 -200920 -206870 -199709
19316 -199709 -186668 -174212 -172640 -168766 -177446 -181232 -199326 -199003 -206195 -217726 -211779 -200323 -187205
19303 -187205 -185327 -192132 -189840 -205135 -201096 -198520 -190432 -191867 -195327 -194393 -189232 -182770 -174600 -165949
19289 -165949 -158560 -157026 -172916 -184711 -179915 -176178 -162865 -158072 -163754 -154024 -148174 -145740 -144817 -141431
19275 -141431 -132721 -140829 -132158 -118004 -117110 -126451 -128110 -127685 -108310 -101223 -108539 -114235 -112348 -107419
19261 -107419 -100512 -102957 -119525 -122812 -118613 -111039 -105265 -101667 -93364 -81641 -81901 -84263 -76499 -80840
19247h0840j2623K163R658K239J278L979J7652P644l982q23n105o57q994J2279
19233e6132M001j808P762J2139J9501j251j5308o667M902J4936J9016P388m93
19220G986P549Q228o660J1129J3204J3470K0645J3829N755R021J383J1274J5716
19207A32529q413M107m435o305k6666k1748l1990l5013m1060l6553l5616l3056
19195a44219l1149l6419l8023k5537k5593p715l981R783O329l917J1207K7295
19183b61939L2106O975m445P027L1354K0013r269j4711M3K0615L803l539q302
19170a80269K18J0605P328N234J2363J0800q829J611J1976M016R323J2457J0985
19157i2182n921o425O448m597J5095J5380m081O071M424n2j155P110j707P764
$$ plain form
19247 -80840 -93463 -91300 -81642 -79403 -78125 -74146 -56494 -48850 -52832 -53655 -58760 -59417 -68411 -56132
19233 -56132 -52131 -53939 -46177 -34038 -14537 -15788 -31096 -37763 -32861 -17925 1091 8479 7986
19220 7986 15535 23763 17103 28232 41436 54906 75551 89380 95135 104156 105539 116813 132529
19207 132529 124116 128223 123788 117483 90817 69069 37079 2066 -38994 -75547 -111163 -144219
19195 -144219 -175368 -211787 -249810 -275347 -300940 -308655 -312636 -302853 -296524 -300441 -289234 -261939
19183 -261939 -229833 -222858 -227303 -220276 -188922 -168909 -178178 -192889 -192846 -172231 -168428 -171967 -180269
19170 -180269 -180051 -169446 -162118 -156884 -144521 -133721 -142550 -140939 -128963 -124947 -115624 -103167 -92182
19157 -92182 -98103 -104528 -98080 -102677 -87582 -72202 -76283 -70212 -65788 -65840 -66995 -59885 -61592 -53828
19143e3828n028N139l648j927p465Q841J4114P172m032j0211L050o016L820j0101
19129f0120m010J0231P386p743M816J0647J1312L591J2830J928l532L16R680J8230
19115A5562O054J828j8477j6439J1419L033j0300l20L165J038P537Q47O611L838
19101A5396p59J735P461j5444j1159J7487l58n661O846j245L230J1034J5151j2157
19087C1557m099J5945l193p304n353l057N074N252P462m534J2068N424J651O329
19073F3222M20M390m779j4163O81Q967k039R520j81O440M33N810j386m860P388
19058G9863O666l626J446R567J2033K823J324m898l131J633Q250J0297O025J2198
19044A40470J473j7040J1964P018j909j96j436J2256O904N002j333n832j772J061
$$ plain form
19143 -53828 -58856 -53717 -57365 -59292 -66757 -57916 -43802 -36630 -40662 -50873 -47823 -53839 -50019 -60120
19129 -60120 -64130 -53899 -46513 -54256 -49440 -38793 -27481 -23890 -11060 -9132 -12664 -12348 -2668 15562
19115 15562 21616 23444 4967 -11472 -53 2980 -7320 -7640 -4475 -3437 4100 4947 11558 15396
19101 15396 14637 16372 23833 8389 -2770 14717 14359 8698 15544 14299 17529 28563 43714 31557
19087 31557 27458 43403 40210 32906 27553 24496 29570 34822 42284 37750 49818 55242 56893 63222
19073 63222 63642 68032 63253 49090 49771 58738 56699 66219 66038 72478 72911 78721 77335 72475 79863
19058 79863 86529 82903 84349 93916 105949 108772 110096 105198 102067 103700 111950 122247 128272 140470
19044 140470 141943 124903 136867 143885 141976 141780 140344 152600 159504 164506 163173 157341 155569 156630
19030A56630N560J0142O10N752J578P095J0019r744R821J9877q624r011Q843J2399
19016B20947J8395o507j2449r057K062N781N218J2652J4048Q57J3761K23N962
19003B71893J204N076J3767J4942L040Q153j375R575L0585J1950n189M866Q801
18990C77288Q552R499J1641R617P674K4280N195j360J3454J4648J4365R784J6241
18977E20878J8757J4461K4293J1830K7640L1375L5478L1068M0111N0759N4858
18966H61508N9356O0915O0132Q7121R9724R3464R8794Q4699K4786q2992k32745
18955A214762l82552m80958n04986m36106k93788j54694o0198K2112P7171Q6558
18945i12679Q0047O9082M6379M7388M8693M5985M6871L4255K0378J2698L5014
$$ plain form
19030 156630 162190 172332 172942 178694 180272 187367 197386 187642 197463 217340 208716 199705 208548 220947
19016 220947 239342 232835 220386 211329 213391 219172 224390 237042 251090 251947 265708 265931 271893
19003 271893 273097 278173 291940 306882 309922 318075 316700 326275 356860 368810 363621 368487 377288
18990 377288 385840 395339 406980 416597 424271 448551 453746 452386 465840 480488 494853 504637 520878
18977 520878 539635 554096 578389 590219 617859 649234 684712 715780 755891 806650 861508
18966 861508 920864 981779 1041911 1129032 1228756 1322220 1421014 1505713 1530499 1447507 1214762
18955 1214762 832210 351252 -153734 -589840 -883628 -1038322 -1098520 -1076408 -999237 -912679
18945 -912679 -832632 -763550 -717171 -669783 -621090 -575105 -528234 -493979 -473601 -460903 -425889
18934d25889L5428K5305R735J5462J9972K3876J0354K4278J9376J5483J8072K075
18922b06473k753K3832K3163K5407J3893K591Q622J5568J8650O670K1297K4091
18910b5442J2496j0787r387l0140l8771n2258l9507j7457J15N654L3246K2298
18898a49940r139L500K6714L1746J5196J116J2757K7052J8701J6191J2410Q887
18886A5191R409N607J3542K0459J0084j711j8380l0217l6624k8293l3152l8950
18874a13035k2311p103L647P001Q755J5378J5211L616N941J7753N196n850J1369
18861e4432J3531J9507P40Q705R157q158q134J4363J9335L118k4313q814R238
18848f157J2009J083m568O230P753j866q002J5889J2796M575R790J2089p375j76
$$ plain form
18934 -425889 -390461 -365156 -355421 -339959 -319987 -296111 -285757 -261479 -242103 -226620 -208548 -206473
18922 -206473 -209226 -185394 -162231 -136824 -122931 -120340 -111718 -96150 -77500 -70830 -49533 -25442
18910 -25442 -12946 -23733 -33120 -63260 -102031 -154289 -193796 -211253 -211138 -205484 -172238 -149940
18898 -149940 -159079 -155579 -128865 -97119 -81923 -80807 -68050 -40998 -22297 -6106 6304 15191
18886 15191 24600 30207 43749 64208 74292 72581 54201 23984 -12640 -40933 -74085 -113035
18874 -113035 -135346 -142449 -138802 -131801 -123046 -107668 -92457 -88841 -82900 -65147 -59951 -65801 -54432
18861 -54432 -40901 -21394 -20654 -11949 -2792 -10950 -19084 -4721 14614 17732 -6581 -15395 -6157
18848 -6157 5852 6935 2367 8597 16350 14484 6482 22371 35167 39742 49532 61621 54246 54070
18834E4070N968j846O153J149P646l993r583l5J4007j1837q322q334n657J923
18820D1309J4392L109k527m08L339J8002J0540Q191o44r987j830Q334q4r10j3270
18805G7556k456J8676K3914N903j0211J441R98o87J0659J566k341P2m967q345
18791A11778L845R976o145l821J3979K210k063J730O380K0854p021Q86k0392P896
18777A40092J2072M369J0301K937j4740p96J3703N286k843R191m254p618J200
18764A68900j2412l199R030K687M920M49M164k346J007R438P15q385N410J6320
18750A96698o217O460J0676l473j3978L777j3907k081P702N935L750k870K235
18737A94707j447O340n66N639m687j9162k305P138R866P274R822M68L611J5772
$$ plain form
18834 54070 60038 58192 64345 65494 73140 69147 59564 59529 73536 61699 53377 45043 39386 41309
18820 41309 55701 58810 56283 55875 59214 77216 87756 95947 95303 85316 83486 91820 91736 90826 77556
18805 77556 75100 93776 117690 123593 113382 114823 115821 115134 125793 127359 125018 125090 120123 111778
18791 111778 115623 125599 119454 115633 129612 131822 129759 131489 137869 158723 151702 152588 132196 140092
18777 140092 152164 156533 166834 169771 155031 154235 167938 173224 170381 179572 175318 167700 168900
18764 168900 156488 153289 162319 165006 169926 170375 174539 172193 173200 182638 183353 174968 180378 196698
18750 196698 190481 196941 207617 204144 190166 193943 180036 177955 185657 191592 195342 192472 194707
18737 194707 193260 199600 199034 204673 199986 180824 178519 185657 195523 202797 212619 213087 216698 232470
18723B32470l955j3891L592J2046j591L294L635J0581k429J462o292q662j601
18710B28659P2P941P920r604r603R101R53L22m264o41Q626J3586O443K683J1733
18695B73927m367n547k093l861J921j253l196O936L855Q363j1790j0772P521Q440
18681B68084l094m323m097N798N666K691R876M609J1094j0020n606J064M271p53
18667B85260l289n515j206N968J8431K907p874j604L409Q742P753J1200j029J99
18653C23352Q049M360l638R069J003j0938o946N857K106K225k417j2425K770J1443
18639C33870N288k683R903J1143p325j0780j174R862o021p403r997O465L45l22
18625C31171M170m094K079J1952J9430K217M71O384R73k909k747l691l010O82
$$ plain form
18723 232470 228515 214624 218216 230262 228671 231965 235600 246181 243752 245214 238922 230260 228659
18710 228659 228731 236672 244592 234988 225385 234486 235439 235761 231497 230856 239482 253068 259511 262194 273927
18695 273927 269560 264013 261920 258059 259980 258727 255531 262467 266322 274685 262895 252123 259644 268084
18681 268084 264990 260667 256570 262368 268034 270725 280601 285210 296304 286284 280678 281742 286013 285260
18667 285260 281971 276456 275250 281218 299649 302556 294682 293078 296487 305229 312982 324182 323153 323352
18653 323352 331401 335761 332123 341192 342195 331257 324311 330168 332274 334499 332082 319657 322427 333870
18639 333870 339158 336475 346378 357521 350196 339416 338242 348104 342083 334680 324683 331148 331493 331171
18625 331171 335341 331247 333326 345278 364708 366925 367396 373780 374753 371844 369097 365406 362396 363078
18611C63078L366M66J893o177l419K792K215R49p669k677Q522j1999L344l862
18597C50822k122R308J1092R921J5083k866n905J2147J1174K513M227J626l991
18584D13029j1918r633J465m656L945K328m004N953O538M066O744o17m369m374
18570D04497k835l560N880L040J006N90J695m240m128J3596k681Q18O254r370
18556D10562N002O071N820m195R793N227j1p539o202K98m129J4598J6559k223
18542D49631m695K200n552K005j4386R782K2074j4176N676O782n794K766N103
18529D61416R209j1621Q244R493M66m080j3694N96P918K634m199J021J779M058
18515D73240l78l15j933M035M955m610L881J2216k026L980L118K644R547q731
$$ plain form
18611 363078 366444 366910 368803 362626 359207 361999 364214 365163 357494 354817 363339 351340 354684 350822
18597 350822 348700 358008 369100 379021 394104 391238 385333 397480 408654 411167 415394 417020 413029
18584 413029 401111 391478 392943 388287 392232 394560 390556 396509 403047 407113 413857 413240 408871 404497
18570 404497 401662 398102 403982 407022 408028 408618 410313 406073 401945 415541 412860 413678 419932 410562
18556 410562 415564 421635 427455 423260 433053 438280 438269 430730 424528 424826 420697 435295 451854 449631
18542 449631 444936 447136 441584 443589 429203 438985 461059 446883 452559 459341 453547 456313 461416
18529 461416 470625 459004 467248 476741 477207 473127 459433 460029 467947 470581 466382 467403 469182 473240
18515 473240 472862 472547 470614 474649 479604 474994 478875 491091 489065 493045 496163 498807 508354 499623
18501D99623J847J3647Q339o146J0449j93J052k49o281J014j316K425J4410j460
18487E37161L734N995J3797m608q916k688O205j2155q633K062R840J3732J3790
18474E69316J3618O252q204L993k922j0574m971R825m880M8J4664J0173r479q885
18460E77974M873K6436J8975M611p561o852O245Q005K3545J1694j1339j2630J2769
18447F56745J5741k565r845N868n719r275j880K563L518J2858r46l026n896j1877
18433F46264p103M505J5835M705J1959R301p498p919M547O178J2r540j0941P76
18419F61081l474P119n822j6176L196p00q142l286k199o116o000j7668j2817o342
18405E82654m049Q08p085o288j7822j3870m385j057j4291r509m493k4696k5663
$$ plain form
18501 499623 501470 515117 523456 517310 527759 527566 528618 528369 522088 523102 521786 524211 538621 537161
18487 537161 540895 546890 560687 556079 547163 544475 550680 538525 529892 531954 541794 555526 569316
18474 569316 582934 589186 580982 584975 582053 571479 566508 576333 571453 571501 586165 596338 586859 577974
18460 577974 582847 609283 628258 632869 625308 618456 624701 632706 656251 667945 656606 643976 656745
18447 656745 672486 669921 660076 665944 660225 650950 649070 651633 655151 668009 667063 664037 658141 646264
18433 646264 639161 643666 659501 664206 676165 685466 677968 670049 674596 680774 680786 671246 660305 661081
18419 661081 657607 664726 658904 642728 645924 645224 637082 633796 631597 625481 619481 601813 588996 582654
18405 582654 578605 579413 572328 566040 548218 534348 529963 528906 514615 505106 500613 475917 450254
18392D50254j6209q404l977q869k79n709j7001o290O101K088o976k0096p825K907
18378C59715j015J764r852p893O185J686m385j1595j8245j489L769q358N276o392
18364C09171j339M286J6426Q492L507J5157j7948k4805n440K0779O137J1792j225
18351C44990n552j1939j799J1210J8566O051n149m332j1308p596N270J790Q728
18338C48930q294j624R816l867j1421r727P699J8147J6287M62J9400J6636p810
18325C94634j121L535j511J8393q8k4486j933M441J692J7347r405j6730N485M070
18311C94323J2781j148p731Q47L716K747J1116L14N327r528r664o727J2337J0396
18297D19106N894j048j227J2284J0017o577J697O042p668J996R833K742j700l680
$$ plain form
18392 450254 434045 425641 421664 412795 412516 406807 389806 383516 389617 391705 384729 364633 356808 359715
18378 359715 358700 360464 350612 342719 348904 350590 346205 334610 316365 314876 318645 310287 315563 309171
18364 309171 307832 312118 328544 337036 340543 355700 337752 312947 307507 328286 334423 346215 344990
18351 344990 339438 327499 325700 336910 355476 361527 356378 352046 340738 333142 338412 340202 348930
18338 348930 340636 339012 348828 344961 333540 323813 331512 349659 365946 366408 385808 402444 394634
18325 394634 393513 397048 395537 413930 413842 389356 387423 391864 393556 410903 401498 384768 390253 394323
18311 394323 407104 405956 398225 399072 402788 405535 416651 416965 422292 412764 403100 396373 408710 419106
18297 419106 425000 423952 422725 435009 445026 438449 440146 446188 438520 440516 450349 453091 451391 447711
18283D47711r92P378J0422K431j213R09K243j4619L692P840J006M926j1988j0407
18269D49339P296J0179J0287K310l449n373J3083J961p937J2905P378o441j2047
18256D79491O48J1943o426K131j604R158J2148m45l613P171L154j0700r933n467
18242D87656M315l044k620M788J2363P696n182k205l121N089O421J582P233P475
18228E28446N063l857k143l93J944R854n735j1872M133L154O033m163R577J3963
18214E54004O692o893j0305J4898R778n83n798o738Q357M39N322l909p911M463
18200E61816p502l700J2445K799r864o031L835N498M993O645P391l626q939l10
18186E65450Q465R355j2292j0658l509n437l347J0143J6188Q21M925J1710o308
$$ plain form
18283 447711 446719 454097 464519 466950 465737 466646 468889 454270 457962 465802 466808 471734 459746 449339
18269 449339 456635 466814 477101 479411 475962 470589 483672 485633 477696 490601 497979 491538 479491
18256 479491 480139 492082 485656 487787 486183 495341 507489 507044 503431 510602 513756 503056 493123 487656
18242 487656 491971 488927 486307 491095 503458 511154 505972 503767 500646 505735 512156 513738 520971 528446
18228 528446 533509 529652 527509 527116 529060 538914 533179 521307 525440 528594 534627 530464 540041 554004
18214 554004 560696 553803 543498 558396 568174 567591 561793 555055 563412 563851 569173 565264 557353 561816
18200 561816 554314 550614 563059 565858 555994 549963 553798 559296 564289 570934 578325 574699 565760 565450
18186 565450 573915 583270 570978 560320 556811 551374 548027 558170 574358 575179 580104 591814 585506
18173E85506j920N79J8879R407K118m681K706l349L620J1891O718k784j3587l73
18159F14730P580J4995O161R515q181j2031q056Q75J1752N191N93l888l474J769
18145F37531m131J3785M569k562K625k960n774r615Q756J7656J8088M514L527
18132F86009J0033J822k734j1938p765n062J628K2036J3082j991Q26p530o287
18119F92129m248P946n72p715J0575J5601K546o939O952K995j4380q347Q575p242
18105F97876K535Q397j1483L423J142K770J407m908L37P488L578j0933j9325k349
18091F79955Q848j1348k979k2150j9012m857k4212j7689q752j4024j5187r991
18079E38602j3627k0917o492m970k2259j3019k2398k2083j0674j5146m524j3351
$$ plain form
18173 585506 583586 584165 603044 612451 614569 609888 612594 609245 612865 624756 631474 628690 615103 614730
18159 614730 622310 637305 643466 652981 644800 632769 624713 625588 637340 642531 643124 639236 635762 637531
18145 637531 633400 647185 651754 649192 651817 648857 643083 633468 642224 659880 677968 682482 686009
18132 686009 696042 697864 695130 683192 675427 670365 671993 694029 707111 705120 705946 698416 692129
18119 692129 687881 695827 695255 687540 698115 713716 716262 709323 716275 719270 704890 696543 705118 697876
18105 697876 700411 708808 697325 700748 701890 704660 706067 701159 701496 708984 712562 701629 682304 679955
18091 679955 688803 677455 674476 652326 633314 628457 604245 586556 577804 563780 548593 538602
18079 538602 524975 504058 497566 492596 470337 457318 434920 412837 402163 387017 382493 369142
18067C69142o600k1805O19l441j0387n362r692q375M72r894j7406j465k000j3116
18053B60690j7915o347n414k432J0723N057j3267k673K7225n695p811R62J3682
18040B56785R508j974r299k551K045M868M284o901j2644j5249J716R726R723J0891
18026B60928j4320r72O181Q681O944K861L87O27J695n387N388m025p607m90P770
18011B68661J5427m338J237o634J1097o66j1594j59j549J2684J022k1149r84J5116
17997B78171R720n953N667K811N169P863q396J812N224p151p09m938m463P771
17983B92598m540j5844l754K3586P323l1m580n862K1353J1324l550l635k484m936
17969C06968O296R804K444j718j1050J545j8133j0992R466J0984O014j394J046
$$ plain form
18067 369142 362542 340737 341356 337915 327528 322166 312474 304099 304571 294677 277271 275806 273806 260690
18053 260690 242775 236428 231014 228582 239305 244362 231095 228422 255647 249952 242141 243103 256785
18040 256785 266293 264319 255020 252469 254514 259382 263666 256765 244121 228872 230588 240314 250037 260928
18026 260928 246608 245636 251817 260498 267442 270303 270690 271317 273012 267625 273013 268988 261381 260891 268661
18011 268661 284088 279750 280987 274353 285450 284784 273190 273031 271482 284166 285188 264039 263055 278171
17997 278171 287891 281938 287605 290416 295585 303448 295052 296864 302088 294937 294228 289290 284827 292598
17983 292598 288058 272214 268460 292046 299369 299338 294758 288896 310249 321573 318023 314388 311904 306968
17969 306968 313264 323068 325512 323794 312744 314289 296156 285164 294630 305614 311628 310234 311280
17956C11280J7727L6n465k508K021j8126n408R376j3159L628k00K617N200j050
17942C05969j5133L258m380R38K8992P025l0495k0401k990m43m914K0445J6067
17929C03938M872p292p190Q04q715j230P827p571K602J692K835L798L520O589
17915C06479j271r098m5R934p486j2793j2775r249J4035J5784k174l657J9348
17902C07032J192j1844J861J0110M427p61r487j5518K036L90j3750n089M591K828
17888B78018Q055K3463m633j1830K741K2441j2164m664Q31J8868R500k9153r905
17875B91568O004r305J081J7291L587O30l883j841M491J8844Q343k4223n765j1453
17861B95369n8n444l287q744j2742m690j6349p004j1476j6575l959L61j1220r143
$$ plain form
17956 311280 329007 329043 323578 321070 323091 304965 299557 308933 295774 299402 299202 301819 307019 305969
17942 305969 290836 294094 289714 290652 319644 326669 296174 275773 272783 272340 267426 287871 303938
17929 303938 308810 301518 294328 295132 286417 285187 293014 285443 288045 289737 292572 296370 299890 306479
17915 306479 305208 296110 296065 305999 298513 285720 272945 263696 277731 293515 291341 287684 307032
17902 307032 308224 296380 298241 308351 312778 312017 302530 287012 289048 289438 275688 270599 275190 278018
17888 278018 286073 309536 304903 293073 295814 318255 306091 301427 302258 321126 330626 301473 291568
17875 291568 297572 288267 289348 306639 310226 310856 306973 305132 309623 328467 336810 312587 306822 295369
17861 295369 295311 289867 286580 277836 265094 260404 244055 237051 225575 209000 205041 205402 194182 185039
17847A85039q408l2210j2767q895p885q823j0183j1969n096n89r769j1558l378
17834E3509n709K494r910m185M178N081o4k166q779j3634j0500K780M111j1628
17820E578q257N579N499Q44q483L242k567J4443J4222k75p579q895o686M609O066
17805A7340p726J7658J8023R243J250o61L861N255k766j4950m983J8028P550j5611
17791E1511O424m245o656J1060O307l079M621O929j7234j3379P605L238K805j230
17777E4677j0710m254j1055J168R124P144Q994J25q504Q527O104J2597J8902J2085
17763A04924L3850M2361L203r1041q4925j32334k20821j32383q7307o7065r194
17752f40732J8088O050J6623J9147J0568Q755R423J0454j3699j2990l313n630
$$ plain form
17847 185039 176631 144421 131654 122759 114874 106051 95868 83899 78803 78214 68445 56887 53509
17834 53509 47800 50294 40384 36199 40377 45458 45394 43228 34449 20815 10315 13095 17206 5578
17820 5578 -2679 2900 8399 9243 760 4002 1435 15878 30100 29825 22246 13351 6665 11274 17340
17805 17340 9614 27272 45295 54538 55788 55127 58988 64243 61477 46527 41544 59572 67122 51511
17791 51511 57935 53690 47034 58094 64401 61322 65943 72872 55638 42259 49864 53102 55907 54677
17777 54677 43967 39713 28658 29826 38950 46094 55088 55213 46709 55236 61340 73937 92839 104924
17763 104924 138774 181135 184338 93297 8372 -123962 -344783 -477166 -564473 -631538 -640732
17752 -640732 -622644 -616594 -599971 -580824 -570256 -561501 -552078 -541624 -555323 -568313 -571626 -577256
17740e77256o669O694l251j578K564j139q242J507q3j4507o033p215j2274o253
17726f33735j5382o000n906Q929M843l270j8592P494K0991N841j4388n825K316
17713f52684R463M961k384m325r813j4839o110L800k753k0909p498J425J5810
17700f85856K0765q115l64n038k445J080p755q204M004Q270j696K770m958j2317
17686f99859M349L952p840o93n99J780P776Q907m276J854L566j2827j1796n771
17672g11477L469J754o766j326j386k975o627k838K874J2694K972J580N29m176
17658g11699O305j37j0548l364q07l381P466N924k386o970j749k055j5167j3521
17644g52089J661J2857P265j4405j0848j940N718M551J9776j2321j6861n869l070
$$ plain form
17740 -577256 -583925 -577231 -580482 -582060 -579496 -580635 -588877 -587370 -587453 -601960 -607993 -615208 -627482 -633735
17726 -633735 -649117 -655117 -661023 -652094 -647251 -650521 -669113 -661619 -640628 -634787 -649175 -655000 -652684
17713 -652684 -643221 -638260 -640644 -644969 -654782 -669621 -675731 -671931 -674684 -695593 -703091 -701666 -685856
17700 -685856 -665091 -673206 -673570 -678608 -681053 -679973 -687728 -695932 -691928 -683658 -685354 -682584 -687542 -699859
17686 -699859 -695510 -691558 -699398 -700091 -700690 -698910 -691134 -682227 -686503 -684649 -681083 -693910 -705706 -711477
17672 -711477 -708008 -706254 -713020 -714346 -715732 -718707 -725334 -728172 -725298 -712604 -709632 -708052 -707523 -711699
17658 -711699 -705394 -705531 -716079 -719443 -720250 -723631 -716165 -710241 -712627 -719597 -721346 -723401 -738568 -752089
17644 -752089 -750428 -737571 -730306 -744711 -755559 -757499 -751781 -747230 -727454 -739775 -756636 -762505 -765575
17631g65575L565r709m926l092P957o380o936J6509M361l35p849K006m877j438
17617g76719q061j768n866k681J725l256J11j0842J2444j586j5594j4500l754
17604h30347J0050N252o289p927j0232J722j081J4472M245m264l283J140r212
17591h35754j2228K364J3029n777k0859k306K062K487n232p090m880P615M141
17578h62428K09j2335K097k856n686M10k008M79J787j863J547j675K31L476L256
17563h75359o361j5259p602J0079l346k7020r034M484M050n47Q690O449j220j5965
17549i27961j1557N940p61j3528M453J66m281P18N780M048r380r793n888O269
17535i55775o097o359m411j514j503J2592m803j6314o782j533J4411j0848j1172
$$ plain form
17631 -765575 -762010 -771719 -776645 -779737 -771780 -778160 -785096 -768587 -764226 -764561 -772410 -770404 -775281 -776719
17617 -776719 -784780 -786548 -792414 -795095 -793370 -796626 -796515 -807357 -794913 -796499 -812093 -826593 -830347
17604 -830347 -820297 -815045 -821334 -829261 -839493 -837771 -838852 -824380 -820135 -824399 -827682 -826542 -835754
17591 -835754 -847982 -845618 -832589 -838366 -859225 -861531 -859469 -856982 -862214 -869304 -874184 -866569 -862428
17578 -862428 -862219 -874554 -872457 -875313 -880999 -880589 -882597 -882118 -880331 -882194 -880647 -882322 -882091 -878615 -875359
17563 -875359 -881720 -896979 -904581 -894502 -897848 -924868 -933902 -929418 -925368 -925915 -917225 -910776 -911996 -927961
17549 -927961 -939518 -933578 -934339 -947867 -943414 -943248 -947529 -946811 -941031 -936983 -946363 -956156 -962044 -955775
17535 -955775 -961872 -968231 -972642 -974156 -975659 -963067 -967870 -984184 -990966 -992499 -978088 -988936 -1000108
17522a000108m071L534J116Q031J290q268N961Q712K181K884p502r570M991K277
17508i88542o73m634j2851j9021m608k74j2935q152L98K0385R007j4406L433J1627
17494a021246j334M097J091Q53K691l491l656k1757j3822o900J4599M268J1409
17481a033198L36n214r914j190O132j2608n0m244l33n228m586J8409K953J000
17467a047735j0092p619K862j6181j1811J502L596K204l801r374j2374J205O06
17454a107012K602K529j6616L964M478l713O690l670j002J2122l070q120p753
17441a118571J0588R748J2310P375n247p561j0197O613J0656j3266j0394r570
17429a117516p911N445q314J6734n226j7571n99o506J406J010K8R404N149j3853
$$ plain form
17522 -1000108 -1004179 -1000645 -999529 -991498 -990208 -998476 -992515 -983803 -981622 -978738 -986240 -995810 -990819 -988542
17508 -988542 -989215 -993849 -1006700 -1025721 -1030329 -1030603 -1043538 -1051690 -1051292 -1030907 -1021900 -1036306 -1032873 -1021246
17494 -1021246 -1022580 -1018483 -1017392 -1016539 -1013848 -1017339 -1020995 -1042752 -1056574 -1063474 -1048875 -1044607 -1033198
17481 -1033198 -1032862 -1038076 -1047990 -1049180 -1043048 -1055656 -1055706 -1059950 -1060283 -1065511 -1070097 -1051688 -1048735 -1047735
17467 -1047735 -1057827 -1065446 -1062584 -1078765 -1090576 -1089074 -1085478 -1083274 -1087075 -1096449 -1108823 -1107618 -1107012
17454 -1107012 -1104410 -1101881 -1118497 -1114533 -1110055 -1113768 -1107078 -1110748 -1111750 -1099628 -1102698 -1110818 -1118571
17441 -1118571 -1107983 -1098235 -1085925 -1078550 -1083797 -1091358 -1101555 -1094942 -1084286 -1097552 -1107946 -1117516
17429 -1117516 -1125427 -1119982 -1128296 -1111562 -1116788 -1134359 -1134958 -1141464 -1140058 -1139048 -1139020 -1129616 -1124467 -1138320
17415a138320j2679k062J2306J4843l65l231j8262j078Q956k786J297n719r325
17402a156425j859L61J64m795k078K11J075n291j205J0204O699n502j085K226
17388a157300R547j0358K936M150k117j138m582l609M615Q781j94N124L792L04
17374a140049L707j396r079J17J825n896l97J344j7470n400q75j1116P858j004
17360a177831j5l985M523O776j031J859N85R353J2644j1988n555j5217q447N560
17346a182769R781l882p782q051N737M926l437m110o511j4186j837J6013q5L574
17332a192619Q48n907P563J8045J0166j5427m995p079p186q388J5280r786j1263
17319a210748P111J8923n971j3982k0924j0610M628P642J4222q10L769p103M959
$$ plain form
17415 -1138320 -1150999 -1153061 -1140755 -1125912 -1126277 -1129508 -1147770 -1148848 -1139892 -1142678 -1141381 -1147100 -1156425
17402 -1156425 -1158284 -1157923 -1157759 -1162554 -1164632 -1164421 -1163346 -1168637 -1169842 -1159638 -1152939 -1158441 -1159526 -1157300
17388 -1157300 -1147753 -1158111 -1155175 -1151025 -1153142 -1154280 -1158862 -1162471 -1157856 -1149075 -1149269 -1144145 -1140353 -1140049
17374 -1140049 -1136342 -1137738 -1146817 -1146700 -1144875 -1150771 -1151168 -1149824 -1167294 -1172694 -1173569 -1184685 -1176827 -1177831
17360 -1177831 -1177846 -1181831 -1177308 -1170532 -1171563 -1169704 -1169119 -1159766 -1147122 -1159110 -1164665 -1179882 -1188329 -1182769
17346 -1182769 -1172988 -1176870 -1184652 -1192703 -1186966 -1182040 -1185477 -1189587 -1196098 -1210284 -1212121 -1196108 -1196193 -1192619
17332 -1192619 -1191771 -1197678 -1190115 -1172070 -1161904 -1177331 -1182326 -1189405 -1196591 -1204979 -1189699 -1199485 -1210748
17319 -1210748 -1203637 -1184714 -1190685 -1204667 -1225591 -1236201 -1231573 -1223931 -1209709 -1210519 -1206750 -1213853 -1208894
17306a208894Q360O904P085J855N745p412q337j1854r322J3006J0975M726k607
17293a189770Q303j531j5932K734j573p2j6263l573O058n58l760J28J861J3519
17279a200429m650p371M003o016L772J1323l939k928J8063j837j598O613R35q953
17265a193012j7162j0115J9973K2005j9127j2775O614k813K595K73M031M615J3929
17252a180969J0036j2322n821n074k295L272l361K596Q891l913j2708q092K1093
17239a188667Q925q567L937J114r178q111N338K0564m928j3611o494k947Q364
17226a194261k049R013P606m217P553N661J0156j0834j9713R096J3950p082J837
17213a173284Q504R232J392j6852q431p025Q03j6288m756l889N365J3604J1086
$$ plain form
17306 -1208894 -1200534 -1193630 -1186545 -1184690 -1178945 -1186357 -1194694 -1206548 -1215870 -1202864 -1191889 -1187163 -1189770
17293 -1189770 -1181467 -1182998 -1198930 -1196196 -1197769 -1197841 -1214104 -1217677 -1211619 -1212177 -1215937 -1215809 -1213948 -1200429
17279 -1200429 -1205079 -1212450 -1208447 -1214463 -1210691 -1199368 -1203307 -1206235 -1188172 -1190009 -1191607 -1184994 -1184059 -1193012
17265 -1193012 -1210174 -1220289 -1200316 -1178311 -1197438 -1210213 -1203599 -1206412 -1203817 -1203544 -1199513 -1194898 -1180969
17252 -1180969 -1170933 -1183255 -1189076 -1194150 -1196445 -1193173 -1196534 -1193938 -1185047 -1188960 -1201668 -1209760 -1188667
17239 -1188667 -1179742 -1188309 -1184372 -1183258 -1192436 -1200547 -1195209 -1174645 -1179573 -1193184 -1199678 -1202625 -1194261
17226 -1194261 -1196310 -1187297 -1179691 -1183908 -1176355 -1170694 -1160538 -1171372 -1191085 -1181989 -1168039 -1175121 -1173284
17213 -1173284 -1164780 -1155548 -1154156 -1171008 -1179439 -1186464 -1185661 -1201949 -1206705 -1210594 -1205229 -1191625 -1180539
17200a180539J3756K1035L735o496r879j3604J3136K110r327Q736m935j2373Q010
17187a166635J0907Q762j579o046L273J2552n271o697O409J4835p10j2283q715
17174a151198K793o367l685R869Q494R926L197K138K0885j767N920K0420p214
17161a086589k765n56Q443r47n935J7692K9359Q361N370J9601K3101K6158K1360
17148i37347L8638N6694O9477P2999O2337n3419j16251j13442k66786k41992j04366
17137a533458q9357k1741M2176N2619N0887M6800K2680Q184J0508R759J4947J1437
17125a374559J738J5115P35o918L324J7015K1603J2062o970l222J6388N472J098
17112a297119k557N837l905q066O581M305N596J7762J6020L811p823J4985P784
$$ plain form
17200 -1180539 -1166783 -1145748 -1142013 -1148509 -1158388 -1171992 -1158856 -1156746 -1166073 -1157337 -1162272 -1174645 -1166635
17187 -1166635 -1155728 -1146966 -1148545 -1154591 -1151318 -1138766 -1144037 -1150734 -1144325 -1129490 -1130200 -1142483 -1151198
17174 -1151198 -1148405 -1154772 -1158457 -1148588 -1140094 -1130168 -1126971 -1124833 -1103948 -1105715 -1099795 -1079375 -1086589
17161 -1086589 -1089354 -1089910 -1081467 -1082414 -1088349 -1070657 -1041298 -1032937 -1027567 -1007966 -984865 -958707 -937347
17148 -937347 -898709 -842015 -772538 -699539 -637202 -690621 -806872 -920314 -1187100 -1429092 -1533458
17137 -1533458 -1622815 -1644556 -1602380 -1549761 -1498874 -1452074 -1429394 -1421210 -1410702 -1400943 -1385996 -1374559
17125 -1374559 -1372821 -1357706 -1356971 -1363889 -1360565 -1343550 -1321947 -1309885 -1316855 -1320077 -1303689 -1298217 -1297119
17112 -1297119 -1299676 -1293839 -1297744 -1305810 -1299229 -1294924 -1289328 -1271566 -1255546 -1251735 -1259558 -1244573 -1236789
17099a236789j507k735Q499K630j5717l510J2885J3411q048J985K082l54J7793
17086a209375N477p831j6139l724j7073n0J0016O472J9779J0964P527M423k610
17073a192144M481p685j5934l067n257n01Q316P549J9150L465q240m714p217J6027
17059a185771k479j20j4954l367R860r21l242n370R788J4012J095P687o969k0183
17045a200934p71k5411j0316R598J4744N639p898l889N547L775K107J1341P374
17032a189094M197J8168J3569J067j3568q969N994m304o575K512Q823j0971L303
17019a175848N194K426Q344k559q11j1821j2220j0130J4048K0373P996k184K390
17006a154802o222M668R170O132m872r194j691o712m189q365K1814m10q991L365
$$ plain form
17099 -1236789 -1238296 -1241031 -1232532 -1229902 -1245619 -1249129 -1236244 -1222833 -1230881 -1228896 -1226814 -1227168 -1209375
17086 -1209375 -1203898 -1211729 -1227868 -1231592 -1248665 -1248715 -1238699 -1232227 -1212448 -1201484 -1193957 -1189534 -1192144
17073 -1192144 -1187663 -1195348 -1211282 -1214349 -1219606 -1220107 -1211791 -1204242 -1185092 -1181627 -1189867 -1194581 -1201798 -1185771
17059 -1185771 -1188250 -1188370 -1203324 -1206691 -1196831 -1197752 -1200994 -1206364 -1196576 -1182564 -1181469 -1173782 -1180751 -1200934
17045 -1200934 -1201705 -1227116 -1237432 -1227834 -1213090 -1207451 -1215349 -1219238 -1213691 -1209916 -1207809 -1196468 -1189094
17032 -1189094 -1184897 -1166729 -1153160 -1152093 -1165661 -1174630 -1168636 -1172940 -1179515 -1177003 -1168180 -1179151 -1175848
17019 -1175848 -1170654 -1168228 -1159884 -1162443 -1163254 -1175075 -1187295 -1197425 -1183377 -1163004 -1155008 -1157192 -1154802
17006 -1154802 -1161024 -1156356 -1147186 -1141054 -1145926 -1155120 -1156811 -1163523 -1167712 -1176077 -1154263 -1154673 -1163664 -1160299
16992a160299R171J0488o101m190K326n513k130r286K521Q05O103l531m618L651
16978a160603j698N125k135J0918J5864Q064j711k864j1065j6454Q495J3112J1122
16965a123830j421o620J1578O698j0973j0529n779l267J1154J1082K659L869o893
16952a122272J404p65M230Q905n017J448r759o630l863j682J750j306L720M380
16938a125457J1005Q986m337N27j1526q204O314O398P906l786j187Q395m157j2498
16924a121621J1236J379l413n378l303P356j881j528o18j622J398J0305m549N02
16910a111737O499J949K517J5258Q774j2293j0533r81K801J39K944O726M723K068
16896a081146j114n403r919o032k481l603j0600r118J3064J1372K191O520k2140
$$ plain form
16992 -1160299 -1151128 -1140640 -1146741 -1150931 -1148605 -1154118 -1156248 -1165534 -1163013 -1162208 -1156105 -1159636 -1164254 -1160603
16978 -1160603 -1162301 -1157176 -1159311 -1148393 -1132529 -1124465 -1126176 -1129040 -1140105 -1156559 -1148064 -1134952 -1123830
16965 -1123830 -1125251 -1131871 -1120293 -1113595 -1124568 -1135097 -1140876 -1144143 -1132989 -1121907 -1119248 -1115379 -1122272
16952 -1122272 -1120868 -1121633 -1117403 -1108498 -1113515 -1112067 -1121826 -1128456 -1132319 -1134001 -1132251 -1133557 -1129837 -1125457
16938 -1125457 -1114452 -1105466 -1109803 -1109276 -1120802 -1129006 -1122692 -1116294 -1108388 -1112174 -1113361 -1104966 -1109123 -1121621
16924 -1121621 -1110385 -1109006 -1112419 -1117797 -1121100 -1113744 -1115625 -1117153 -1117771 -1119393 -1117995 -1107690 -1112239 -1111737
16910 -1111737 -1105238 -1103289 -1100772 -1085514 -1076740 -1089033 -1099566 -1100547 -1097746 -1097607 -1094663 -1087937 -1083214 -1081146
16896 -1081146 -1082260 -1087663 -1097582 -1103614 -1106095 -1109698 -1120298 -1129416 -1116352 -1104980 -1102789 -1096269 -1118409
16883a118409j43L797J2857L46J362P925K1743Q667K193j2359q335m826j4405
16870a099587o740k236J466L2995J7311k787O160O883j4545p295L12P291q191
16857a068963j1264J1629m060M784m980P722R574j6927m712l919P959K645P527
16844a062985l391J0518P282k797o911P337O169n952j2958l496P357J3794J0862
16831a035171m782j2728N297O358o316q831k838J5377j623N96K770L647j3645
16818a051889l911M144k053k432L827p17j4095p74L249R969N438j282M107n603
16804a052022J085j171n990L325N114n457J1266L284p945M906P054r200N322J3777
16790a026652J042r585j437L440J1040q06k290p013J429l577J1441P140l29L50
$$ plain form
16883 -1118409 -1118552 -1114755 -1101898 -1101552 -1100190 -1092265 -1070522 -1061855 -1059662 -1072021 -1080356 -1085182 -1099587
16870 -1099587 -1106327 -1108563 -1107097 -1074102 -1056791 -1059578 -1053418 -1046535 -1061080 -1068375 -1068063 -1060772 -1068963
16857 -1068963 -1080227 -1068598 -1072658 -1067874 -1072854 -1065132 -1055558 -1072485 -1077197 -1081116 -1073157 -1070512 -1062985
16844 -1062985 -1066376 -1055858 -1048576 -1051373 -1058284 -1050947 -1044778 -1050730 -1063688 -1067184 -1059827 -1046033 -1035171
16831 -1035171 -1039953 -1052681 -1047384 -1041026 -1047342 -1056173 -1059011 -1043634 -1045257 -1044661 -1041891 -1038244 -1051889
16818 -1051889 -1055800 -1051656 -1053709 -1056141 -1052314 -1053031 -1067126 -1067900 -1064651 -1054682 -1049244 -1050526 -1046419 -1052022
16804 -1052022 -1050937 -1052108 -1058098 -1054773 -1049659 -1055116 -1043850 -1040566 -1048511 -1043605 -1036551 -1045751 -1040429 -1026652
16790 -1026652 -1025610 -1035195 -1036632 -1033192 -1022152 -1022958 -1025248 -1032261 -1030832 -1034409 -1022968 -1015828 -1016157 -1015807
16776a015807k474q97J808L214k171o379J154J0932J2869k194n566M441r687M802
16762a005955m324p506J4524j161P178m198r56Q416J828o119r650J4743O34l173
16748i95719R812P16o208r834N953o795N309N365L012J1984j3141q596P717Q651
16734i81774O439Q010j0756k124j5413j568J5981J502r074p279P43K014L259M523
16720i85517N900J574j1819J366o203l841K124K3415Q607M274J076n766l392l253
16706i71455K995J1540j0259p063l914q131q895N928P318j578n703J1333J4366
16693i63518L033l458j4629N966J2283O821o07q59j7015j965K781j6147N199J6814
16679i65301L976R19J7432J2353J274O200q887k2509j2020P128P457L365p17k562
$$ plain form
16776 -1015807 -1018281 -1019178 -1017370 -1014156 -1016327 -1022706 -1021552 -1010620 -997751 -999945 -1005511 -1001070 -1010757 -1005955
16762 -1005955 -1010279 -1017785 -1003261 -1004422 -997244 -1001442 -1002398 -993982 -992154 -998273 -1007923 -993180 -992546 -995719
16748 -995719 -985907 -985191 -991399 -1001233 -995280 -1002075 -996766 -991401 -988389 -976405 -989546 -998142 -990425 -981774
16734 -981774 -975335 -967325 -978081 -980205 -995618 -997186 -981205 -979703 -988777 -996056 -995313 -993299 -990040 -985517
16720 -985517 -979617 -978043 -989862 -988496 -994699 -998540 -996416 -973001 -964394 -960120 -959044 -964810 -968202 -971455
16706 -971455 -968460 -956920 -967179 -974242 -978156 -986287 -995182 -989254 -981936 -983514 -989217 -977884 -963518
16693 -963518 -960485 -963943 -978572 -972606 -960323 -953502 -954109 -954968 -971983 -973948 -971167 -987314 -982115 -965301
16679 -965301 -961325 -960406 -942974 -930621 -929347 -923147 -932034 -954543 -966563 -959435 -951978 -948613 -949330 -951892
16665i51892o718j2023j1827j177m30j191J7063P77K354J130m10J0553N129J1526
16651i37136Q321j1492M942N818N323j3059p608j692l831k15m650J715R491r247
16637i53320M572R438o496r724J2742K544L7J6338j0902q994K478N352l662R366
16623i30231L278j991k221l603O608j1732M473J5458L765j1875k0598J0925J5064
16610i22680j917K106J696O457J2972J92r062o855l284J5328L936j217q61j3477
16596i16666O244o175M993J2701j923Q488k147o556q978J714R720P030N548q672
16582h94679k0726l327j244P210J2374l879j5274o138J2857O028M964j857J0579
16569h93112q493j2J020p106M281m946J5932o716j0595p853M174P948Q058j9568
$$ plain form
16665 -951892 -958610 -970633 -982460 -983637 -984067 -985258 -968195 -967418 -965064 -963934 -964344 -953791 -948662 -937136
16651 -937136 -928815 -940307 -935365 -929547 -924224 -937283 -944891 -946583 -950414 -950629 -955279 -953564 -944073 -953320
16637 -953320 -948748 -939310 -945806 -955530 -942788 -940244 -940207 -923869 -934771 -943765 -941287 -935935 -939597 -930231
16623 -930231 -926953 -928944 -931165 -934768 -928160 -939892 -935419 -919961 -916196 -928071 -948669 -937744 -922680
16610 -922680 -924597 -922491 -920795 -914338 -901366 -901174 -910236 -917091 -920375 -905047 -901111 -902328 -903189 -916666
16596 -916666 -910422 -916597 -911604 -898903 -900826 -892338 -894485 -901041 -910019 -908305 -898585 -891555 -886007 -894679
16582 -894679 -915405 -918732 -919976 -912766 -900392 -904271 -919545 -925683 -912826 -906798 -901834 -903691 -893112
16569 -893112 -901605 -901617 -900597 -907703 -903422 -908368 -892436 -899152 -909747 -917600 -913426 -905478 -897420 -916988
16555i16988P670K5917m354j2466R142J3784K750r672n499M325L799K919M474
16542h74199K16n346K38j7986j1245L033Q234J7440J164K13J417J221k204J0651
16528h67153q070r971j4965j897J2032P325k27p642O035J6998j6146j1492L519
16515h91654J38K436J0408J984o434n958J107K1836M862m361P666j2953j0646
16502h81569k775J082J5573J3791p704M33P287m305Q958j131j4666n200Q150K622
16488h59454q597N106R256l456k511n108K703J4913O363o581M452J370P11l522
16474h44355k020P419J202j431p348j6896Q641P718N762J328m770P041J1327J215
16460h25167j766k264j3461O65Oq458O781r572N753l669L223J4924J007k121K284
$$ plain form
16555 -916988 -909318 -883401 -887755 -900221 -891079 -877295 -874545 -884217 -889716 -885391 -881592 -878673 -874199
16542 -874199 -873983 -879329 -879091 -897077 -908322 -905289 -897055 -879615 -878451 -878238 -876821 -875600 -877804 -867153
16528 -867153 -875223 -885194 -900159 -902056 -890024 -882699 -882926 -890568 -884533 -867535 -883681 -895173 -891654
16515 -891654 -891516 -889080 -878672 -876688 -883122 -889080 -887973 -866137 -861275 -865636 -857970 -870923 -881569
16502 -881569 -884344 -883262 -867689 -853898 -861602 -861169 -853882 -858187 -849229 -850360 -865026 -870226 -862076 -859454
16488 -859454 -868051 -862945 -853689 -857145 -859656 -864764 -862061 -847148 -840785 -847366 -842914 -841544 -840833 -844355
16474 -844355 -846375 -838956 -837754 -839185 -846533 -863429 -854788 -847070 -841308 -839980 -844750 -837709 -826382 -825167
16460 -825167 -826933 -829197 -842658 -841993 -841987 -850445 -843664 -853236 -847483 -851152 -847929 -833005 -831998 -834119 -831835
16445h31835R133K0917m723j3422q491n978O501n316L893q855l146l048J562k715
16431h45523L794o16K643M598M785j997j6196o683k281Q511J2655l323Q108K323
16417h29202Q682j0125O388J8225m387m980m239K182N943M738j0840j6042q284
16404h41941Q064J8745J6088N767K518l422j0186o23P48o36K081q006o014N209
16390h11608J3293L832n91k741o821N261L065j0978R224P162r70L67k650l541
16376g97696K284J4078J5331j2135k2102K211R089j67M642P637K642j3028k030
16363g89244P603M401k941j0226j2131L992n770r832J0060K47O084J2097Q113
16350g77547O591j520k6256m209J2689K078J116m984K70J4809P010J09k658R920
$$ plain form
16445 -831835 -822702 -801785 -806508 -819930 -828421 -834399 -827898 -833214 -829321 -838176 -841322 -844370 -842808 -845523
16431 -845523 -841729 -842345 -839702 -835104 -830319 -832316 -848512 -855195 -857476 -848965 -836310 -839633 -831525 -829202
16417 -829202 -820520 -830645 -824257 -806032 -810419 -815399 -819638 -817456 -811513 -806775 -817615 -833657 -841941
16404 -841941 -833877 -815132 -799044 -793277 -790759 -794181 -804367 -804990 -804242 -804878 -802797 -810803 -816817 -811608
16390 -811608 -798315 -794483 -795074 -797815 -804636 -799375 -796310 -807288 -798064 -790902 -791872 -791505 -794155 -797696
16376 -797696 -795412 -781334 -766003 -778138 -800240 -798029 -788940 -789107 -784465 -776828 -774186 -787214 -789244
16363 -789244 -781641 -777240 -780181 -790407 -802538 -798546 -804316 -814148 -804088 -803841 -797757 -785660 -777547
16350 -777547 -770956 -772476 -798732 -802941 -790252 -788174 -787058 -792042 -791772 -776963 -769953 -769844 -772502 -762582
16336g62582j4764l454j480m91J1244P922j1429j1671L48J888J0272J0214N145
16323g58838q960j9200N768J7121l518p011P574N411j5190n296J089J289J3196
16310g66565m306k988J0883L868n856n437K167j1544j645Q753O483J6896J399
16297g47892j6094O72J7990O096k0794p563p218J0003m924q332M31j8079R56J7164
16283g77584r62k33R531Q916k63M730q018O143P083j2219K854O14L946J3989O250
16268g35223k191r082o788M959J2429N598j8469k346P568N606L461O022l983l133
16254g35572N78j1801j468J9122N35q995j6341O157l005o055l807Q590O054R191
16240g36817J3423J2297j1917j5595m704o842N652j018j0356Q938J36j0718L415
$$ plain form
16336 -762582 -777346 -780800 -782280 -782771 -771527 -763605 -775034 -786705 -786357 -784469 -774197 -763983 -758838
16323 -758838 -767798 -786998 -781230 -764109 -767627 -774638 -767064 -761653 -776843 -782139 -781050 -779761 -766565
16310 -766565 -770871 -773859 -762976 -759108 -764964 -770401 -768234 -779778 -781423 -772670 -766187 -749291 -747892
16297 -747892 -763986 -763314 -745324 -739228 -760022 -767585 -774803 -764800 -769724 -778056 -777625 -795704 -794748 -777584
16283 -777584 -778546 -778779 -769248 -760332 -760595 -755865 -763883 -757740 -750657 -762876 -760022 -759408 -755462 -741473 -735223
16268 -735223 -737414 -746496 -753284 -748325 -735896 -730298 -748767 -751113 -743545 -737939 -734478 -728456 -732439 -735572
16254 -735572 -734994 -746795 -748263 -729141 -728606 -737601 -753942 -747785 -750790 -756845 -760652 -752062 -746008 -736817
16240 -736817 -723394 -711097 -723014 -738609 -743313 -750155 -744503 -745521 -755877 -746939 -746803 -757521 -754106
16227g54106K222k497L555L072J8957J2677J598r450m697j357j267K506q281L554
16213g33514J6848LL414n219n500L97J0654L1p010j5989o126P244o773p92K6473
16198g15859J0255r129k700j3406j1206l796J4996O006q358K114N138K430L633
16185g19882Q097P233N983j026j1159r983o527n841q995O045N330M081J362m859
16171g30141k485L655J4381J2540R581N71r744l711J377R399m533l172m19q754
16157g11455J5551J2384q063j860k511j0155J449L738o263J2952j505p568K879
16144g00427K64P640K706n163J939M647m392j0874O989R042Q733L780r35N756
16130f70295J0267l477j5592p490m701j2664m143J4050J5744n209p171q673m993
$$ plain form
16227 -754106 -751884 -754381 -750826 -747754 -728797 -716120 -714522 -723972 -728669 -730026 -731293 -728787 -737068 -733514
16213 -733514 -716666 -716663 -713249 -718468 -723968 -723571 -712917 -712886 -719896 -735885 -742011 -734767 -741540 -742332 -715859
16198 -715859 -705604 -714733 -717433 -730839 -742045 -745841 -730845 -724839 -733197 -731083 -725945 -723515 -719882
16185 -719882 -711785 -704552 -698569 -699595 -710754 -720737 -727264 -733105 -742100 -736055 -730725 -726644 -725282 -730141
16171 -730141 -732626 -728971 -714590 -702050 -692469 -691898 -701642 -705353 -703976 -694577 -699110 -702282 -702701 -711455
16157 -711455 -695904 -683520 -691583 -693443 -695954 -706109 -704660 -700922 -707185 -694233 -695738 -703306 -700427
16144 -700427 -700163 -692523 -689817 -694980 -693041 -688394 -692786 -703660 -696671 -687629 -678896 -675116 -676051 -670295
16130 -670295 -660028 -663505 -679097 -686587 -691288 -703952 -708095 -694045 -678301 -683510 -690681 -699354 -704347
16117g04347J1303J2299P9N144P087l241j1712K77K340L064J2358L162o311n510
16103f74008j6606k259J5526K692m29l378j0368J5572N847k3242n676J5549J323
16090f79457o486j177o23l753K839N581N120P570J328j2068M180N277m284k018
16076f77971L528J5240p592o741O57j1745o743K823q324l595J6220J032j240L67
16062f84084R631Q935m350p654j505k535J816j232Q102J1340j192j2592M187J3990
16048f57143P053j920n030O482L928k087k3592o55J3890K1707O678j2542j2618
16035f55849m308L918p154o518m517Q144k095j5717Q395K3675J9522j3030j1297
16022f56831r575m97R461o738q453M90J2392J0826M861q175M669k079j236K4991
$$ plain form
16117 -704347 -693044 -680745 -680666 -675522 -668435 -671676 -683388 -683111 -680771 -677707 -665349 -662187 -668498 -674008
16103 -674008 -690614 -692873 -677347 -674655 -675084 -678462 -688830 -673258 -667411 -690653 -696329 -680780 -679457
16090 -679457 -685943 -687120 -687743 -691496 -688657 -683076 -677956 -670386 -669058 -681126 -676946 -671669 -675953 -677971
16076 -677971 -674443 -659203 -666795 -673536 -672879 -684624 -691367 -688544 -696868 -700463 -684243 -683211 -684451 -684084
16062 -684084 -674453 -665518 -669868 -677522 -679027 -681562 -679746 -680978 -672876 -661536 -662728 -675320 -671133 -657143
16048 -657143 -650090 -652010 -657040 -650558 -646630 -648717 -672309 -672964 -659074 -637367 -630689 -643231 -655849
16035 -655849 -660157 -656239 -663393 -669911 -674428 -666284 -668379 -684096 -675701 -652026 -632504 -645534 -656831
16022 -656831 -666406 -666903 -657442 -664180 -672633 -672143 -659751 -648925 -644064 -652239 -647570 -649649 -650885 -625894
16008f25894j525j8628n189n980N679J201N139l751p602J436J02o366J980O679
15994f52719J1527Q415K451K265Q938o600j3461l73J3380o253j454j262R648J789
15980f23709N63P819j1459q481n950K157j867k991L633M946l438k368N003J023
15966f35119n601R080J2834j1482P680m755k1888n292K099R447J2690q791p136
15953f46234k071J9261K534k941j0831O206j3151P589N115o433R779O292j0777
15940f35662j3064J3570Q484J935n13P472J980O19r079m336J0075M584J012m436
15926f17359J971m667m823j454l952k038J090O470N102J2613J1139j330l781L257
15912e97762r409m800P657k565J057P830p575L193P960N06k278k500o90N344J633
$$ plain form
16008 -625894 -627419 -646047 -651236 -657216 -651537 -650336 -645197 -648948 -656550 -655114 -655012 -661378 -659398 -652719
15994 -652719 -641192 -632777 -630326 -628061 -619123 -625723 -639184 -639557 -626177 -632430 -633884 -635146 -625498 -623709
15980 -623709 -623146 -615327 -626786 -635267 -641217 -639060 -640927 -643918 -640285 -635339 -638777 -641145 -636142 -635119
15966 -635119 -640720 -631640 -618806 -630288 -622608 -627363 -649251 -654543 -652444 -642997 -630307 -639098 -646234
15953 -646234 -648305 -629044 -626510 -629451 -640282 -634076 -647227 -639638 -634523 -640956 -631177 -624885 -635662
15940 -635662 -648726 -635156 -626672 -624737 -625250 -617778 -615798 -615179 -624258 -628594 -618519 -613935 -612923 -617359
15926 -617359 -615388 -620055 -624878 -626332 -630284 -632322 -631232 -624762 -619660 -607047 -595908 -597238 -601019 -597762
15912 -597762 -607171 -611971 -604314 -606879 -605822 -597992 -605567 -602374 -594414 -593908 -596186 -598686 -599376 -594032 -592399
15897e92399p798m867j0246N230J3120M827n385J697J0240m531k2893j0473P4
15884f23404J1471J1769M893K562o698l000M635J1317j1020O166l81j8013r173
15871f18876J0120J7152M461n626R441P743O424k695k0802j3618J110P575P699
15858e89892K701j341j0307J3956J008o913r85q709l090M645M171M95q812j1273
15844f14346N49L845Q44J2637o49n182n77p382O25N021R455J8118K72p644J8768
15829e65646M317p916M78Q434M950o918j6311j2946q03M729J3307J621Q027Q456
15815e56221R877j1323m069n910q980l393J0206J229L24l604o735M908R332p023
15801e71382j2827K217J1344P472m959j1916q132L126P724p708p685J800P579
$$ plain form
15897 -592399 -600197 -605064 -615310 -610080 -596960 -592133 -597518 -595821 -585581 -590112 -613005 -623478 -623404
15884 -623404 -611933 -600164 -595271 -592709 -599407 -602407 -597772 -586455 -597475 -591309 -591690 -609703 -618876
15871 -618876 -608756 -591604 -587143 -592769 -583328 -575585 -569161 -571856 -592658 -606276 -605166 -597591 -589892
15858 -589892 -587191 -588532 -598839 -584883 -583875 -590788 -591773 -600482 -603572 -598927 -594756 -594261 -603073 -614346
15844 -614346 -613797 -609952 -609108 -596471 -597120 -602302 -602879 -610261 -609636 -604615 -595160 -577042 -576770 -584414 -565646
15829 -565646 -561329 -569245 -568767 -560333 -555383 -562301 -578612 -591558 -592361 -587632 -574325 -572704 -564677 -556221
15815 -556221 -546344 -557667 -561736 -567646 -576626 -580019 -569813 -568584 -568260 -571864 -578599 -573691 -564359 -571382
15801 -571382 -584209 -581992 -570648 -563176 -568135 -580051 -588183 -585057 -577333 -585041 -592726 -590926 -583347
15788e83347M626R387J4110J961o630j3344l744K177k968R076K0100n77j6999
15775e66172K54j0784j135m115M861P424l142M607p348o026L678N290J6507j325
15761e57426J245L390J100l495l081l754L909K6242m035o970o109o483J758k87
15747e53996j551O743K1489P466q278r217m392K346Q261m117j0961l883O210J103
15733e42777o529o186o631k048j284O099N437o021o059L511N052j254j0133O671
15719e62152q589l144J8123N079m890k970j663j841j3588l542l297J5677J5371
15706e51426Q431r652Q78R629o939n980j1696o942J2342J4163p215J1825O172
15693e36410p811k943n679r344J345N348k840k763M704M92O990j0093l498K1177
$$ plain form
15788 -583347 -578721 -569334 -555224 -553263 -559893 -573237 -576981 -574804 -577772 -568696 -548596 -549173 -566172
15775 -566172 -565918 -576702 -577837 -581952 -577091 -569667 -572809 -568202 -575550 -581576 -577898 -572608 -556101 -557426
15761 -557426 -556181 -552791 -551691 -555186 -558267 -562021 -558112 -531870 -535905 -542875 -548984 -555467 -553709 -553996
15747 -553996 -555547 -548804 -527315 -519849 -528127 -537344 -541736 -539390 -531129 -535246 -546207 -550090 -543880 -542777
15733 -542777 -549306 -555492 -562123 -564171 -565455 -559356 -553919 -559940 -565999 -562488 -557436 -558690 -568823 -562152
15719 -562152 -570741 -573885 -555762 -550683 -555573 -558543 -560206 -562047 -575635 -579177 -582474 -566797 -551426
15706 -551426 -542995 -552647 -551769 -542140 -549079 -555059 -566755 -573697 -561355 -547192 -554407 -542582 -536410
15693 -536410 -544221 -547164 -552843 -562187 -560842 -555494 -558334 -561097 -556393 -555901 -548911 -559004 -562502 -541325
15679e41325J8625k272L563M518m558l571M009K830j88j0489m160O255j830K464
15665e26129k802j6891n846K725K836L249R061J1947L858l871m129P498N51R65
15651e16978L52j7437P440n537J63J6847L971j0364j1067N474N232n807k465K117
15637e28059q184o197K135P39j752K469J1796J2550n581q5P363j265j1381m075
15623e29527q39M175J2522L284m15j5374r645K1555k80k4239p58P197q403L250
15609e37497n20J220J731M258J3330L851J555Q482k0656j3644L405N63J2046l651
15595e25527n893J181M165j800j819J4646O085o828J599m00N648J3929n107R08
15581d99213K617O720l063N99K967p872j4484j0455P5n969q500m274K347M524
$$ plain form
15679 -541325 -522700 -524972 -521409 -516891 -521449 -525020 -521011 -518181 -518369 -528858 -533018 -526763 -528593 -526129
15665 -526129 -528931 -545822 -551668 -548943 -546107 -542858 -533797 -521850 -517992 -521863 -525992 -518494 -517943 -516978
15651 -516978 -516626 -534063 -526623 -532160 -531997 -515150 -511179 -521543 -532610 -527136 -521904 -527711 -530176 -528059
15637 -528059 -536243 -542440 -540305 -539566 -541318 -538849 -527053 -514503 -520084 -520169 -512806 -514071 -525452 -529527
15623 -529527 -530366 -526191 -513669 -510385 -510800 -526174 -535819 -514264 -514544 -538783 -539541 -532344 -540747 -537497
15609 -537497 -538017 -536797 -535066 -530808 -517478 -513627 -512072 -503590 -524246 -537890 -534485 -533922 -521876 -525527
15595 -525527 -531420 -530239 -526074 -527874 -529693 -515047 -508962 -515790 -514191 -514591 -508943 -495014 -500121 -499213
15581 -499213 -496596 -489876 -492939 -492340 -489373 -497245 -511729 -522184 -522109 -528078 -536578 -540852 -538505 -533981
15567e33981J5898R972P38l903L753p575p604l897o707m779K221j841M501J0003
15553e23201N673R127n423r111m723M120P74l486K44J0991J0814j6091j2924j379
15539e34595M117K8082J7519m597n828j0103K294R087J5435m835M945n95K017
15526d77057j985p112r758j048J4178O742q673k1040q351k488J0481O196P090
15513d92825r189J5376K249K973m091o43R220k433j3095J5050P348q770J3970
15500d64860Q986j3716K921L518J75j7646j4803j0692k290K1085N565J0884j1571
15487d82444k923j63l281M914N40l617J1986j448K208k512j1078J6904R684J0050
15473d51180r579j4226L146l740j2702q07J3716m325k737j3656j434J2507M838
$$ plain form
15567 -533981 -518083 -508111 -507373 -511276 -507523 -515098 -522702 -526599 -533306 -538085 -535864 -537705 -533204 -523201
15553 -523201 -517528 -508401 -513824 -522935 -527658 -523538 -522764 -526250 -526006 -515015 -504201 -520292 -533216 -534595
15539 -534595 -530478 -502396 -484877 -489474 -495302 -505405 -503111 -494024 -478589 -483424 -478479 -479074 -477057
15526 -477057 -479042 -486154 -495912 -496960 -482782 -476040 -484713 -505753 -514104 -516592 -506111 -499915 -492825
15513 -492825 -502014 -486638 -484389 -481416 -485507 -486150 -476930 -479363 -492458 -477408 -470060 -478830 -464860
15500 -464860 -455874 -469590 -466669 -463151 -462976 -480622 -495425 -506117 -508407 -487322 -481757 -470873 -482444
15487 -482444 -485367 -485530 -488811 -483897 -483357 -486974 -474988 -476436 -474228 -476740 -487818 -470914 -461230 -451180
15473 -451180 -460759 -474985 -471839 -475579 -488281 -489088 -475372 -479697 -482434 -496090 -497524 -485017 -480179
15460d80179j4134Q804J3162j260J0675L334Q817j973K757R494j7568j6126M261
15447d69936K857J739J1518L501j4048o664O304J5358N536q228k0061r959p106
15434d89189O631P969Q481J75k556j720j1784Q883R4o27K76k899M369l593J098
15419d74392p59l735m827l645L795p09K527O260r7P894Q19k1421J0008p714p780
15404d93776J798L481R644P184p466j1662J641O064O346N736P987P910J787L802
15390d49524m515o74L09j1673J699N886k621j2474n924j0168J3352J7777J665
15377d56885q656o394k606J0977P562o66N495J1387j501k50j5976o422J812N534
15363d56589J3247k097p216k597J2215j1417l503K705J0837J309m713n661J1577
$$ plain form
15460 -480179 -494313 -485509 -472347 -473607 -462932 -459598 -450781 -452754 -449997 -440503 -458071 -474197 -469936
15447 -469936 -467079 -465340 -453822 -450321 -464369 -471033 -464729 -449371 -443835 -452063 -472124 -482083 -489189
15434 -489189 -482558 -474589 -466108 -465933 -468489 -470209 -481993 -473110 -473016 -473643 -473367 -476266 -471897 -475490 -474392
15419 -474392 -475151 -478886 -483713 -487358 -483563 -484272 -481745 -475485 -475582 -467688 -466869 -488290 -478282 -485996 -493776
15404 -493776 -491978 -488497 -478853 -471669 -479135 -490797 -489156 -483092 -476746 -471010 -463023 -455113 -453326 -449524
15390 -449524 -454039 -454713 -454404 -466077 -464378 -458492 -461113 -473587 -479511 -489679 -476327 -458550 -456885
15377 -456885 -465541 -471935 -474541 -463564 -456002 -456668 -451173 -439786 -441287 -441537 -457513 -463935 -462123 -456589
15363 -456589 -443342 -445439 -452655 -455252 -443037 -454454 -457957 -455252 -444415 -443106 -447819 -453480 -441903
15350d41903K119r851j0740r714J1006p470j8781K140J6363l658N9Q292n968j0191
15336d78297N005K4928L500l035k136n104m552P80q996o190J0072N437J648l620
15322d60560P465R171J0773j485r52J3302Q001J2560j8764k2961j1559o786l874
15309d65669n08K1747K4578L881j6471l703Q981p609j2242m988j6083K746J6413
15296d48927l033o649o32J037k776n75J2062R145K04J069J85p237J073R025K581
15281d33448k172j1301r979K671J4465J5752N729r660j2406m415J0805J542o550
15268d38967p276J764m470J0590l554J0209J9036L99q144l178J257m258Q15J7829
15254d07948K927m311J243l659n826L902k371j6751j2167N834J5761k247j4016
$$ plain form
15350 -441903 -439784 -449635 -460375 -470089 -459083 -466553 -485334 -483194 -466831 -470489 -470430 -462138 -468106 -478297
15336 -478297 -473292 -448364 -444864 -447899 -450035 -455139 -459691 -458911 -467907 -474097 -464025 -458588 -456940 -460560
15322 -460560 -453095 -443924 -433151 -434636 -435588 -422286 -414285 -401725 -420489 -443450 -455009 -461795 -465669
15309 -465669 -466177 -444430 -419852 -415971 -432442 -436145 -427164 -434773 -447015 -452003 -468086 -465340 -448927
15296 -448927 -451960 -458609 -459241 -458204 -460980 -461555 -449493 -440348 -440144 -439075 -438890 -446127 -445054 -436029 -433448
15281 -433448 -435620 -446921 -456900 -454229 -439764 -424012 -418283 -427943 -440349 -444764 -433959 -432417 -438967
15268 -438967 -446243 -444479 -448949 -438359 -441913 -431704 -412668 -412269 -420413 -423591 -422334 -426592 -425777 -407948
15254 -407948 -405021 -409332 -408089 -411748 -417574 -413672 -416043 -432794 -444961 -439127 -423366 -425613 -439629
15241d39629j1554J390M77J4692M796R211M563M66q105k044J99J2643M192j2387
15227d21090j3081K431J8820R002k597j0859p85N645j298P296K203m995j0462
15214d19770j1923J0873J2362k645M046n143r784j3490n640J1809P603j547R828
15201d13421r57k656J2457r541j3570m20M100J957n794L373N610J0254m13m434
15187d13455K467P605j2183k060l666j9908n20k048P604J1959J3542O92J994J0255
15173c97722M215O407J2646j7006j3431l028K863N839J943J1781j8355j6060P958
15160d11950P837j115Q918n32L733p986k1528J2566J0067N412l947N929J2407
15147c80189L60n993j3605J7m414k402O235J2174j0073j786k332j1757J2877Q253
$$ plain form
15241 -439629 -451183 -449793 -449316 -434624 -429828 -420617 -416054 -415588 -423693 -425737 -425538 -412895 -408703 -421090
15227 -421090 -434171 -431740 -412920 -403918 -406515 -417374 -418159 -412514 -413812 -406516 -404313 -409308 -419770
15214 -419770 -431693 -420820 -408458 -411103 -407057 -412200 -421984 -435474 -441114 -429305 -421702 -423249 -413421
15201 -413421 -414378 -417034 -404577 -414118 -427688 -428108 -424008 -422051 -427845 -424472 -418862 -408608 -409021 -413455
15187 -413455 -410988 -403383 -415566 -417626 -421292 -441200 -441720 -443768 -436164 -424205 -410663 -409971 -407977 -397722
15173 -397722 -393507 -387100 -374454 -391460 -404891 -407919 -405056 -399217 -397274 -385493 -403848 -419908 -411950
15160 -411950 -404113 -405228 -396310 -396842 -393109 -401095 -422623 -410057 -399990 -394578 -398525 -392596 -380189
15147 -380189 -379829 -385822 -399427 -399410 -403824 -406226 -399991 -387817 -397890 -399676 -402008 -413765 -400888 -392635
15133c92635N347n080l867Q28L99L444m400P220l541n741n111n003N422K818N014
15118c94886J946p737L29R375k921k75R0o42K800o869j0231j541m837R359J0892
15103c95148J098n524M438j374j384O359M659M583N092j8944l397N286Q954j310
15089c86612l19K887j2708l140j114j406k128J4992m501J933J4060j0623k994
15076c91673L066K905j1740j1575j774N591k203J0049P463p521R188J1936J6698
15063c59590m853m676Q439o765j1653j2003J0650M779n818J3826k101J810J034
15050c66921l779r917m066q38o676j2167J3308M383l089l543M286J0328L949O265
15036c68477R740p314j0966k009J5620j2922p623J2738R313o578q873j757O091
$$ plain form
15133 -392635 -387288 -392368 -396235 -395407 -395008 -391564 -395964 -388744 -392285 -398026 -403137 -408140 -402718 -399900 -394886
15118 -394886 -392940 -400677 -400348 -390973 -393894 -394169 -394079 -394721 -391921 -398790 -409021 -410562 -415399 -406040 -395148
15103 -395148 -394050 -399574 -395136 -396510 -397894 -391535 -386876 -382293 -377201 -396145 -399542 -394256 -385302 -386612
15089 -386612 -386931 -384044 -396752 -399892 -401006 -402412 -404540 -389548 -394049 -392116 -378056 -388679 -391673
15076 -391673 -388607 -385702 -397442 -409017 -410791 -405200 -407403 -397354 -389891 -397412 -388224 -376288 -359590
15063 -359590 -364443 -369119 -360680 -367445 -379098 -391101 -380451 -375672 -381490 -367664 -369765 -367955 -366921
15050 -366921 -370700 -380617 -384683 -385521 -392197 -404364 -391056 -386673 -389762 -393305 -389019 -378691 -374742 -368477
15036 -368477 -358737 -366051 -377017 -379026 -363406 -376328 -383951 -371213 -361900 -368478 -377351 -379108 -373017
15023c73017n795o483j98N285j748P687J7409P213J557J137q123Q19n009j8492
15009c77758l290J1028j0287L081J9197Q711o000J700n201j2918R218m793l313
14996c70625k880j2832J061J3668Q244R260l027r44j0054j4595p298J0983O944
14983c72095O105r057J628o10k607J1736k592J0129K540p038n136N900j240q03
14969c63140J36N695q92n393n659J0245R847j0968j8606n180N190j336l717j4067
14955c97845O273O197J1289L890K781M890K208j87R03L966K317l905p220J1576
14941c52867K1464p378j9058M223k257j5036J4203J5518L624k044j1757J8001
$$ plain form
15023 -373017 -378812 -385295 -385493 -380208 -381956 -374269 -356860 -349647 -348090 -346953 -355076 -354257 -359266 -377758
15009 -377758 -381048 -370020 -380307 -377226 -358029 -349318 -355318 -353618 -358819 -371737 -362519 -367312 -370625
14996 -370625 -373505 -386337 -385276 -371608 -363364 -354104 -357131 -358075 -368129 -382724 -390022 -379039 -372095
14983 -372095 -365990 -375047 -373419 -374029 -376636 -364900 -367492 -357363 -354823 -361861 -366997 -361097 -362337 -363140
14969 -363140 -363004 -357309 -358201 -363594 -369253 -359008 -349161 -360129 -378735 -383915 -378725 -380061 -383778 -397845
14955 -397845 -391572 -385375 -374086 -370196 -367415 -362525 -360317 -360504 -359601 -355635 -353318 -357223 -364443 -352867
14941 -352867 -331403 -338781 -357839 -353616 -355873 -370909 -356706 -341188 -337564 -339608 -351365 -333364
$$ [...]
##END NTUPLES=NMR SPECTRUM
##END=
