##TITLE=Analysis number 315413
Compound Code mo 07494
Project Code adrs
Chemist Name fudan
##JCAMPDX= 6.0         $$ Bruker NMR JCAMP-DX V2.0
##DATA TYPE= NMR SPECTRUM
##DATA CLASS= NTUPLES
##ORIGIN= Bruker BioSpin GmbH
##OWNER= NMR
$$ XWIN-NMR		Version 3.5
$$ Fri Nov 18 15:12:12 2005 GMT Standard Time (UT+0h)  MAYBRIDGE\NMR@NMR_250MHZ
##.OBSERVE FREQUENCY= 250.131544655141
##.OBSERVE NUCLEUS= ^1H
##.ACQUISITION MODE= SIMULTANEOUS (DQD)
##.ACQUISITION SCHEME= undefined
##.AVERAGES= 16
##.DIGITISER RES= 18
##SPECTROMETER/DATA SYSTEM= dpx250
##.PULSE SEQUENCE= zg30
##.SOLVENT NAME= CDCl3
##.SHIFT REFERENCE= (INTERNAL, CDCl3, 0, 16.4763)
##AUDIT TRAIL= $$ (NUMBER, WHEN, WHO, WHERE, WHAT)
$$ ##TITLE= Audit trail, XWIN-NMR		Version 3.5
$$ ##JCAMPDX= 5.01
$$ ##ORIGIN= Bruker BioSpin GmbH
$$ ##OWNER= NMR
$$ C:\u/data/dgb/nmr/ADRS/12680/pdata/1/auditp.txt
$$ ##AUDIT TRAIL=  $$ (NUMBER, WHEN, WHO, WHERE, WHAT)
(   1,<2005-11-18 15:11:44.68 +000>,<MAYBRIDGE\NMR>,<NMR_250MHZ>,
      <created by zg, POWCHK disabled, PULCHK disabled
       configuration hash MD5:
       62 19 C7 07 E1 42 D1 B7 37 6C 3D D0 77 39 F9 E6
       data hash MD5: 64K
       A6 2E 13 63 03 73 97 BB 1A 8F 17 78 5C 26 F8 29>)
(   2,<2005-11-18 15:12:03.34 +000>,<MAYBRIDGE\NMR>,<NMR_250MHZ>,
      <Start of raw data processing
       ef LB = 0.3 FT_mod = 6 PKNL = 1 SI = 32K 
       data hash MD5: 32K
       D4 01 EF D4 75 07 A6 5A 4C 09 16 01 84 78 94 7B>)
(   3,<2005-11-18 15:12:05.64 +000>,<MAYBRIDGE\NMR>,<NMR_250MHZ>,
      <apk 
       data hash MD5: 32K
       07 12 42 24 EC 37 EC 21 8A 70 4D A2 89 B2 44 55>)
(   4,<2005-11-18 15:12:06.43 +000>,<MAYBRIDGE\NMR>,<NMR_250MHZ>,
      <abs ABSG = 5 
       data hash MD5: 32K
       D4 69 07 70 65 02 0E 22 89 6B 6D 4B B5 A7 AB 37>)
$$ ##END=
$$ 
$$ hash MD5
$$ 7B 9D 4A F6 E7 03 95 B0 D7 D8 F8 E7 7E B6 5C 34
##$RELAX= 
##$RELAX= 
##$RELAX= 
##$RELAX= 
##$RELAX= 
##$RELAX= 
##$RELAX= 
$$ Bruker specific parameters
$$ --------------------------
##$DU= <C:\u>
##$EXPNO= 12680
##$NAME= <ADRS>
##$PROCNO= 1
##$TYPE= <nmr>
##$USER= <dgb>
##$AMP= (0..31)
100 100 100 100 100 100 100 100 100 100 100 100 100 100 100 100 100 100 
100 100 100 100 100 100 100 100 100 100 100 100 100 100 
##$AQSEQ= 0
##$AQ_mod= 3
##$AUNM= <au_zg>
##$AUTOPOS= <30 >
##$BF1= 250.13
##$BF2= 250.13
##$BF3= 250.13
##$BF4= 250.13
##$BF5= 500.13
##$BF6= 500.13
##$BF7= 500.13
##$BF8= 500.13
##$BYTORDA= 1
##$CFDGTYP= 0
##$CFRGTYP= 5
##$CHEMSTR= <none>
##$CNST= (0..31)
1 1 145 1 1 1 1 1 1 1 1 1 1 1 1 1 1 1 1 1 1 1 1 1 1 1 1 1 1 1 1 1 
##$CPDPRG= <>
##$CPDPRG1= <>
##$CPDPRG2= <>
##$CPDPRG3= <>
##$CPDPRG4= <mlev>
##$CPDPRG5= <mlev>
##$CPDPRG6= <mlev>
##$CPDPRG7= <mlev>
##$CPDPRG8= <mlev>
##$CPDPRGB= <>
##$CPDPRGT= <>
##$D= (0..31)
0 1 0 0 0 0 0 0 0 0.06 0 0 0 0 0 0 0.0002 0 0 0 0 0 0 0 0 0 0 0 0 0 0 
0 
##$DATE= 1132326703
##$DBL= (0..7)
120 120 120 120 120 120 120 120 
##$DBP= (0..7)
150 150 150 150 150 150 150 150 
##$DBP07= 0
##$DBPNAM0= <>
##$DBPNAM1= <>
##$DBPNAM2= <>
$$ [...]
##$SUBNAM7= <"">
##$SUBNAM8= <"">
##$SUBNAM9= <"">
##$SW= 20.6930455092707
##$SWIBOX= (0..15)
0 0 3 0 0 0 0 0 0 0 0 0 0 0 0 0 
##$SW_h= 5175.983436853
##$TD= 65536
##$TD0= 1
##$TE= 295.16
##$TE2= 300
##$TE3= 300
##$TEG= 300
##$TL= (0..7)
0 120 120 120 120 120 120 120 
##$TP= (0..7)
150 150 150 150 150 150 150 150 
##$TP07= 0
##$TPNAME0= <>
##$TPNAME1= <>
##$TPNAME2= <>
##$TPNAME3= <>
##$TPNAME4= <>
##$TPNAME5= <>
##$TPNAME6= <>
##$TPNAME7= <>
##$TPOAL= (0..7)
0.5 0.5 0.5 0.5 0.5 0.5 0.5 0.5 
##$TPOFFS= (0..7)
0 0 0 0 0 0 0 0 
##$TUNHIN= 0
##$TUNHOUT= 0
##$TUNXOUT= 0
##$USERA1= <user>
##$USERA2= <user>
##$USERA3= <user>
##$USERA4= <user>
##$USERA5= <user>
##$V9= 5
##$VALIST= <valist>
##$VCLIST= <CCCCCCCCCCCCCCC>
##$VD= 0
##$VDLIST= <DDDDDDDDDDDDDDD>
##$VPLIST= <PPPPPPPPPPPPPPP>
##$VTLIST= <TTTTTTTTTTTTTTT>
##$WBST= 1024
##$WBSW= 4
##$XGAIN= (0..3)
0 0 0 0 
##$XL= 0
##$YL= 0
##$YMAX_a= 489609
##$YMIN_a= -475526
##$ZGOPTNS= <>
##$ZL1= 120
##$ZL2= 120
##$ZL3= 120
##$ZL4= 120
##$ABSF1= 16.47634
##$ABSF2= -4.216833
##$ABSG= 5
##$ABSL= 3
##$ALPHA= 0
##$AQORDER= 0
##$ASSFAC= 0
##$ASSFACI= 0
##$ASSFACX= 0
##$ASSWID= 0
##$AUNMP= <proc_1d>
##$AZFE= 0.1
##$AZFW= 0.1
##$BCFW= 0
##$BC_mod= 0
##$BYTORDP= 0
##$COROFFS= 0
##$CY= 12.5
##$DATMOD= 1
##$DC= 0
##$DFILT= <>
##$DTYPP= 0
##$F1P= 14.0000005364418
##$F2P= -0.99999901652339
##$FCOR= 0.5
##$FTSIZE= 32768
##$FT_mod= 6
##$GAMMA= 0
##$GB= 0
##$INTBC= 1
##$INTSCL= 1
##$ISEN= 128
##$LB= 0.3
##$LEV0= 0
##$LPBIN= 0
##$MAXI= 10000
##$MC2= 0
##$MEAN= 0
##$ME_mod= 0
##$MI= 0
##$NCOEF= 0
##$NC_proc= -3
##$NLEV= 6
##$NOISF1= 0
##$NOISF2= 0
##$NSP= 0
##$NTH_PI= 0
##$NZP= 0
##$OFFSET= 16.47634
##$PC= 1
##$PHC0= -74.59016
##$PHC1= 6.161607
##$PH_mod= 1
##$PKNL= yes
##$PPARMOD= 0
##$PSCAL= 4
##$PSIGN= 0
##$REVERSE= no
##$SF= 250.130011419328
##$SI= 32768
##$SIGF1= 0
##$SIGF2= 0
##$SINO= 400
##$SIOLD= 32768
##$SREGLST= <1H.CDCl3>
##$SSB= 0
##$STSI= 32768
##$STSR= 0
##$SW_p= 5175.98343685301
##$SYMM= 0
##$S_DEV= 0
##$TDeff= 65536
##$TDoff= 0
##$TI= <Analysis number 999999
Compound Code 99
Book Reference 9
Project Code 9>
##$TILT= no
##$TM1= 0
##$TM2= 0
##$TOPLEV= 0
##$USERP1= <user>
##$USERP2= <user>
##$USERP3= <user>
##$USERP4= <user>
##$USERP5= <user>
##$WDW= 1
##$XDIM= 32768
##$YMAX_p= 305549657
##$YMIN_p= -197884
$$ End of Bruker specific parameters
$$ ---------------------------------
##NTUPLES= NMR SPECTRUM
##VAR_NAME=  FREQUENCY,     SPECTRUM/REAL,   SPECTRUM/IMAG
##SYMBOL=    X,             R,               I
##VAR_TYPE=  INDEPENDENT,   DEPENDENT,       DEPENDENT
##VAR_FORM=  AFFN,          ASDF,            ASDF
##VAR_DIM=   32768,         32768,           32768
##UNITS=     HZ,            ARBITRARY UNITS, ARBITRARY UNITS
##FACTOR=    0.157963299565203, 1,           1
##FIRST=     4121.22694731544, 0,            0
##LAST=      -1054.75648953757, 0,           0
##MIN=       -1054.75648953757, -197884,     0
##MAX=       4121.22694731544, 305549657,    0
$$ Real data points
##PAGE= N=1
##DATA TABLE= (X++(R..R)), XYDATA
$$ [...]
15429A5232j94J576L025J26k365L96L393K158K723k700l644j519k750M838M533
$$ 15232 15038 16614 19639 19765 17400 17796 21189 23347 26070 23370 19726 18207 15457 20295 24828
15414B4828l933l178k992N227O005N12j93m102l594O05K324K746o70k441R52R88
$$ 24828 20895 17717 14725 19952 25957 26469 26276 22174 18580 19185 21509 24255 23585 21144 22096 23084
15398B3084J431L676j621k251Q34J478K126j010k589k666q07j309k999J808J48
$$ 23084 24515 28191 26570 24319 25153 26631 28757 27747 25158 22492 21685 20376 17377 19185 19333
15383A9333L087M649j923R54J572l334l303k99j618j780K329P275K748k458M016
$$ 19333 22420 27069 25146 26100 27672 24338 21035 20736 19118 17338 19667 26942 29690 27232 31248
15368C1248K917k070n066m909J483M871J755j667l189l520J71J255M039k146j837
$$ 31248 34165 32095 27029 22120 23603 28474 30229 28562 25373 21853 22024 23279 27318 25172 23335
15353B3335L527m27j93l849q86L576K409J052j76j223j955J118J437j125J572
$$ 23335 26862 26435 26242 22393 21507 25083 27492 28544 28368 27145 25190 26308 27745 26620 28192
15338B8192K831K59k234K193L397O35Q7j876l606m622k22L687N671J089R6K01
$$ 28192 31023 31282 29048 31241 34638 35273 35360 33484 29878 25256 25034 28721 34392 35481 35577 35778
15322C5778k652q79j525k108j264J133L098j752m870J31M745L158J856J269j125
$$ 35778 33126 32247 30722 28614 27350 28483 31581 29829 24959 25090 29835 32993 34849 36118 34993
15307C4993O91M44l262k304L10K58N363K808q42l389o960k114L895N296L970M390
$$ 34993 35684 36128 32866 30562 30872 31130 36493 39301 38459 35070 28110 25996 29891 35187 39157 43547
15291D3547k874r37p28j932j408L806p57j361K439K35k047N35J284N91r0N17L876
$$ 43547 40673 39736 39008 37076 35668 39474 38717 37356 39795 40030 37983 38518 39802 40393 40303 40820 44696
15274D4696L56K702r65K08k025L57M260j632k289K002J531m33K92j887j370l717
$$ 44696 45052 47754 46789 46997 44972 45329 49589 47957 45668 47670 49201 48768 49060 47173 45803 42086
15258D2086k269J629q8J378J937M436n02m031K788L169n35K224j977l110j541
$$ 42086 39817 41446 41358 42736 44673 49109 48607 44576 47364 50533 49998 52222 50245 47135 45594
15243D5594K765L781r25k052k420j959j795N16K814N014o77R53K744M14m626o220
$$ 45594 48359 52140 51215 49163 46743 44784 42989 43505 46319 51333 50656 51609 54353 54767 50141 43921
15227D3921j637M207M523K214K352PJ809K350m52M5j296J002J712k834j55K651
$$ 43921 42284 46491 51014 53228 55580 55587 57396 59746 59294 59339 58043 59045 60757 57923 57768 60419
15211F0419L26K916J247J146J948k750O72R01o57M3P67k31K254l044k849j541
$$ 60419 60745 63661 64908 66054 68002 65252 65924 66825 66168 66211 66978 66747 69001 65957 63108 61567
15195F1567L226J506J345m8M33K241M10n33P0O282M943K890R04j033n52L683k561
$$ 61567 64793 66299 67644 67596 68029 70270 70680 70147 70217 76499 81442 84332 85236 84203 83651 87334 84773
15178H4773m268j40K080R87K143O83J22K21K191R51l063q9Q34J940K426n72k474
$$ 84773 80505 80365 82445 83432 85575 86258 86380 86601 88792 89743 86680 86591 87425 89365 91791 91219 88745
15161H8745J090J107K396j009m58L106J766j011j858J875N268O050M067l289N72
$$ 88745 89835 90942 93338 92329 91871 94977 96743 95732 93874 95749 101017 107067 111134 107845 108417
15146A08417L890K122K553J395K400J906J682M118L01k153m514L77Q25N204j325
$$ 108417 112307 114429 116982 118377 120777 122683 124365 128483 128784 126631 122117 122494 123319 128523 127198
15131A27198o349k272L460O58K53M69j415o71p27k309K732K310J611K852J205
$$ 127198 120849 118577 122037 122695 122948 123417 122002 121331 120604 118295 121027 123337 124948 127800 129005
15116A29005K312R82o3j534n97J152K746L593L338L263J652K009j956K615J753
$$ 129005 131317 132299 132236 130702 130105 131257 134003 137596 140934 144197 145849 147858 145902 148517 150270
15101A50270P27M495K778Q10j652o06N767Q44n549l875L781M229j105n45N789
$$ 150270 150997 155492 158270 159080 157428 156822 162589 163433 157884 154009 157790 162019 160914 160369 166158
15086A66158M099l549N49n283o35N208K52J368O480l48J46K947L672K618L176
$$ 166158 170257 166708 167257 161974 161339 166547 166799 168167 174647 174299 174445 177392 181064 183682 186858
15071A86858J708k89J470k690K382L409J502L500K689M108L745o34K824K187L317
$$ 186858 188566 188277 189747 187057 189439 192848 194350 197850 200539 204647 208392 207758 210582 212769 216086
15056B16086J170K830Q47J707L411L982K204J843o97L241P335O256j499L16N537
$$ 216086 217256 220086 220933 222640 226051 230033 232237 234080 233383 236624 243959 250215 248716 249032 254569
15041B54569K606M365M021M498L089K62M367J620N047O813N609J101K676O69l74
$$ 254569 257175 261540 265561 270059 273148 273410 277777 279397 284444 291257 296866 297967 300643 301312 300938
15026C00938L117O264L857K872N420J899N181O063M826Q131Q447L011K973K735
$$ 300938 304055 310319 314176 317048 322468 324367 329548 335611 340437 348568 357015 360026 362999 365734
15012C65734M796L158O444O424O941O736K109j485L727J1004N204p96N288R208
$$ 365734 370530 373688 380132 386556 393497 400233 402342 400857 404584 415588 420792 419996 425284 434492
14998D34492Q546N395J482P092Q754L692Q633R271M688J0601P477K547P574Q290
$$ 434492 443038 448433 449915 457007 465761 469453 478086 487357 492045 502646 510123 512670 520244 528534
14984E28534J2623J0026O641J2206J2515Q180R360P477M558J0303J3477J3576
$$ 528534 541157 551183 557824 570030 582545 590725 600085 607562 612120 622423 635900 649476
14972F49476J2763J0860J0716J1293J4125J2746J1180J1015J4011J4106J3926
$$ 649476 662239 673099 683815 695108 709233 721979 733159 744174 758185 772291 786217
14961G86217J3071J7908J3185J7021J5869J7654K0500J9481K1597K0590J8033
$$ 786217 799288 817196 830381 847402 863271 880925 901425 920906 942503 963093 981126
14950I81126K1460K3986K0321K3470K4774K5136K1981K9148L0490L4343L4347
$$ 981126 1002586 1026572 1046893 1070363 1095137 1120273 1142254 1171402 1201892 1236235 1270582
14939A270582L4034L4550L2054L3428L4023L8012M0312L9904M3517M8017M9204
$$ 1270582 1304616 1339166 1371220 1404648 1438671 1476683 1516995 1556899 1600416 1648433 1697637
14928A697637M9337N2274N3520N5982N4636N7935O3212O4575O2606O9344P0344
$$ 1697637 1746974 1799248 1852768 1908750 1963386 2021321 2084533 2149108 2211714 2281058 2351402
14917B351402P5642P9646P8394Q4157Q9592Q9813Q9506Q9177R4995R2248J00052
$$ 2351402 2427044 2506690 2585084 2669241 2758833 2848646 2938152 3027329 3122324 3214572 3314624
14906C314624R8498R8626R6916J02461J07933J09766J04962J00036J01002J06959
$$ 3314624 3413122 3511748 3608664 3711125 3819058 3928824 4033786 4133822 4234824 4341783
14896D341783R9680R5469R4096R3807Q9462Q9429Q5770Q4081P9077P5334P3740
$$ 4341783 4441463 4536932 4631028 4724835 4814297 4903726 4989496 5073577 5152654 5227988 5301728
14885E301728P4272P0472O5191O6660O6618P3875O9993O5593O8631P3447P6561
$$ 5301728 5376000 5446472 5511663 5578323 5644941 5718816 5788809 5854402 5923033 5996480 6073041
14874F073041Q1717Q1799Q6810Q4240Q5040R2032R4330R7068R8582R8066J02648
$$ 6073041 6154758 6236557 6323367 6407607 6492647 6584679 6679009 6776077 6874659 6972725 7075373
14863G075373J00203R7937R7396R4369Q7437Q3587Q3496P2972O6518N4405M5021
$$ 7075373 7175576 7273513 7370909 7465278 7552715 7636302 7719798 7792770 7859288 7913693 7958714
14852G958714L4623L0394K1515J0145o30j4160k2779k7622l7999m6442m8832n7165
$$ 7958714 7993337 8023731 8045246 8055391 8054761 8040601 8017822 7990200 7952201 7905759 7856927 7799762
14840G799762o5665o5895o6481p1450p1137o7967p2218p4019o9088o2964o2776
$$ 7799762 7734097 7668202 7601721 7530271 7459134 7391167 7318949 7244930 7175842 7112878 7050102
14829G050102o1915o5829n9046n1364n3372n6314n2628m8385n0843n3834n1443
$$ 7050102 6988187 6922358 6863312 6811948 6758576 6702262 6649634 6601249 6550406 6496572 6445129
14818F445129n4384n5667n7560n5484o0869o1727o1374p1710p5651q0658q4917
$$ 6445129 6390745 6335078 6277518 6222034 6161165 6099438 6038064 5966354 5890703 5810045 5725128
14807E725128q5992r1009r6160r3050r9225j00865r7368j04990j08395j08833
$$ 5725128 5639136 5548127 5451967 5358917 5259692 5158827 5061459 4956469 4848074 4739241
14797D739241j05112j11565j14078j06541j04766j01537j00051j00645r8075j00612
$$ 4739241 4634129 4522564 4408486 4301945 4197179 4095642 3995591 3894946 3796871 3696259
14787C696259r4560r1946r1593q7035q5082q1500p9623q3194p7421p0696p2222
$$ 3696259 3601699 3509753 3418160 3331125 3246043 3164543 3084920 3001726 2924305 2853609 2781387
14776B781387o8892o8067o3288o2794o2531o2692o0986n4092n2075n1615n1013
$$ 2781387 2712495 2644428 2581140 2518346 2455815 2393123 2332137 2278045 2225970 2174355 2123342
14765B123342n2039n0991m8261m2345l8937m5534m2201l7149l6410l5693l9375
$$ 2123342 2071303 2020312 1972051 1929706 1890769 1845235 1803034 1765885 1729475 1693782 1654407
14754A654407l5631l3103l6482l3201k6979k7671l2252k7985k9695k8938k7265
$$ 1654407 1618776 1585673 1549191 1515990 1489011 1461340 1429088 1401103 1371408 1342470 1315205
14743A315205k6432k5396k2603k5652k6427k2760k1557j9744k0688j7154j7779
$$ 1315205 1288773 1263377 1240774 1215122 1188695 1165935 1144378 1124634 1103946 1086792 1069013
14732A069013k0875k0929k0078k3452j8042j8366j7172j3700j4846j7300j2781
$$ 1069013 1048138 1027209 1007131 983679 965637 947271 930099 916399 901553 884253 871472
14721H71472j5027k0661j5043p039o725qR132K513k2158k2063k1543k5857j9737
$$ 871472 856445 835784 820741 813702 806977 806969 816101 818614 796456 774393 752850 726993 707256
14708G07256k0491j4313j1802r910j4248j4407j0481j3950o435l858n714j1425
$$ 707256 686765 672452 660650 650740 636492 622085 611604 597654 591219 587361 581647 570222
14696E70222r948o722q040r842r512q570r480j0211n831o944o903p220q255l472
$$ 570222 560274 553552 545512 535670 526158 517588 508108 497897 492066 485122 478219 470999 462744 459272
14682D59272m050r464p717r441q412q056o891q587m932j697p400n333m441k115
$$ 459272 455222 445758 438041 428600 420188 412132 405241 396654 391722 390025 382625 377292 372851 370736
14668C70736m624o535r182n815j041k314o864m234l248p8J104m747l567n10o149
$$ 370736 366112 359577 350395 344580 343539 341225 334361 330127 326879 326801 327905 323158 319591 319081 312932
14653C12932p182l853l092l807m199j724l402l115m156k196n924n816j305J287
$$ 312932 305750 301897 298805 294998 290799 289075 285673 282558 278402 276206 270282 264466 263161 264448
14639B64448l69o202M51k395k479j616k548o224o466l14j314k629l330j782K209
$$ 264448 264079 257877 258328 255933 253454 251838 249290 243066 236600 236286 234972 232343 229013 227231 229440
14624B29440J114k231r097p67k867m996m005J285J848M153J273K132J046p44N45
$$ 229440 230554 228323 219226 218459 215592 210596 206591 207876 209724 213877 215150 217282 218328 217584 218129
14609B18129n645k054l873J735J495P25J052L794R23r12o335n739j33o06Q59L0
$$ 218129 212484 210430 206557 208292 209787 210512 211564 215358 216281 215369 209034 203295 203162 202556 203415 203445
14593B03445O85K383n03l67q08j560j097l825k165k09M44K79K714l05Q00J923
$$ 203445 204130 206513 206010 205643 204835 203275 202178 198353 196188 195979 196423 196702 199416 199111 199911 201834
14577B01834O879L392m11N51j934j722m408K954R327K841N017J639J280J256J284
$$ 201834 208713 212105 211694 212245 210311 208589 204181 207135 216462 219303 224320 225959 227239 228495 229779
14562B29779L90k053K949M436L776m047P56M186o937o503l031O81n52j107k82
$$ 229779 230169 228116 231065 235501 239277 235230 235986 240172 233235 226732 223701 224382 223830 222723 222441
14547B22441n81j664j443K278p80k817j966m072J446M530L906M26L458K678K308
$$ 222441 221860 220196 218753 221031 220251 217434 215468 211396 212842 217372 221278 221704 225162 227840 230148
14532B30148m03K580j337K199N892K358l78J161j133j017N115K978K160j311m265
$$ 230148 229745 232325 230988 233187 239079 241437 241059 242220 241087 240070 245185 248163 250323 249012 244747
14517B44747R69j311j857J463J24o580o653q19m244j515j462j229k360j791l178
$$ 244747 245716 244405 242548 244011 244135 237555 230902 230083 225839 224324 222862 221633 219273 217482 214304
14502B14304l876k117j714m382j789Q05o13o034l339L274K908j371l868o742j021
$$ 214304 210428 208311 206597 202215 200426 201231 200618 194584 191245 194519 197427 196056 192188 185446 184425
14487A84425P01l49L047k647r43k44m795q17k392k838O86M42J607K918O26j895
$$ 184425 185126 184777 187824 185177 184234 183990 179195 178378 175986 173148 173834 174276 175883 178801 179427 177532
14471A77532k072m260m497r91k569l856l926k790k556k049J598k380k781m168
$$ 177532 175460 171200 166703 165712 163143 159287 155361 152571 150015 147966 149564 147184 144403 140235
14457A40235n71J809q31n93J315j994l445n99j854o950m538J227l17o04M27j881
$$ 140235 139664 141473 140642 140049 141364 139370 135925 135326 133472 126522 121984 123211 122894 122290 122717 120836
14441A20836r2L463l002l171j117j340l823k747j743J50j932k193J578J713J350
$$ 120836 120744 124207 121205 118034 116917 115577 111754 109007 107264 107414 105482 103289 104867 106580 107930
14426A07930k328p582l450j329K389M8K404K26n11j374j028L00R54j111J115o83
$$ 107930 105602 98020 94570 93241 95630 95678 98082 98308 97797 96423 95395 95695 96649 95538 96653 95970
14410I5970r18j256j169j615l211k956Q39k305l028L295J04k18j055N02K92k498
$$ 95970 95052 93796 92627 91012 87801 84845 85684 83379 80351 83646 83750 83532 82477 82979 83271 80773
14394H0773j476L380J615k006j828k362r14M34o00m37M53P55N2K296j032q35m071
$$ 80773 79297 82677 84292 82286 80458 78096 77182 77616 77016 76579 77032 77787 77839 80135 79103 78268 74197
14377G4197l806k81o98J383j319K128j932r88o4j497j521K777J192k376k664k728
$$ 74197 70391 70110 69412 70795 69476 71604 69672 68684 68620 67123 65602 68379 69571 67195 64531 61803
14361F1803K916j126q13J091P00j560j493m491m179K711R66k688N41L093j5p53
$$ 61803 64719 63593 62780 63871 64571 63011 61518 57027 52848 55559 56525 53837 54378 57471 57456 56703
14345E6703R82R55L535j259m022n573m454K91O62j751J14J765L35N12q90m46j110
$$ 56703 57685 58640 62175 60916 56894 51321 46867 47158 47820 46069 46183 47948 48283 48795 47905 47459 46349
14328D6349L828J404l994j429m95m213L145N68l922R62K740M388J193l614k004
$$ 46349 50177 51581 47587 46158 45663 41450 44595 45163 41241 42203 44943 49331 50524 46910 44906
14313D4906P68J675l067n545K357L129q37m184Q30K205m1m130J068M573K617P19
$$ 44906 45674 47349 44282 38737 41094 44223 43386 39202 40032 42237 42196 38066 39134 43707 46324 47043
14297D7043l713j877j533R65J584R88j58j84K0l834o41J295K39l183R45Q40M24
$$ 47043 43330 41453 39920 40885 42469 43457 43299 43115 43135 39301 38660 39955 40194 37011 37956 38796 39220
14280C9220J780K468o65N530R294K665p468n095N542Q360J910R86j146l101q92
$$ 39220 41000 43468 42803 48333 57627 60292 52824 47729 53271 61631 63541 64527 63381 60280 59388
14265E9388O047J492q25L79J200j831l837m252m833m635n627j834K106N1ol705
$$ 59388 65435 66927 66102 66481 67681 65850 62013 57761 52928 48293 42666 40832 42938 42989 42983 39278
14249C9278l606k05j486m27J007m275J287J027J784j201M00q28j639o270k383
$$ 39278 35672 35467 33981 33554 34561 30286 31573 32600 34384 33183 33583 32755 31116 24846 22463
14234B2463M359J711K794j143k047n17q91o17M244K306L267n017j644J543K339
$$ 22463 26822 28533 31327 30184 28137 27620 26729 26112 30356 32662 35929 30912 29268 30811 33150
14219C3150m27k623o064l98M75K248L066K297k294j962O37o77j539J523J90M90
$$ 33150 32723 30100 24036 23638 24113 26361 29427 31724 29430 27468 28105 27428 25889 27412 27602 28092
14203B8092j572R22L108j154l310k12J99j56O12K430M330J009j911j897J016J010
$$ 28092 26520 27442 30550 29396 26086 25874 26073 25917 26529 28959 33289 34298 32387 30490 31506 32516
14187C2516L159r43k244l637l036m794N48L319J306m256j579k323M958K206n42
$$ 32516 35675 34732 32488 28851 25815 21021 21569 24888 26194 21938 20359 18036 22994 25200 24658
14172B4658K85k26J120l554j122J491o16J159k612K318J084k735r50k213J931
$$ 24658 24943 24717 25837 22283 21161 22652 22036 23195 20583 22901 23985 21250 20300 18087 20018
14157B0018J877k803M74k095J228R41K14K533N170l98k983L214p87m419q0R73
$$ 20018 21895 19092 19566 17471 18699 19640 19854 22387 27557 27159 24176 27390 26603 22184 22104 23077
14141B3077k713k48K58L84L454k546J33J16L088J662k516N65L946R92l071k01
$$ 23077 20364 20116 20374 20758 24212 21666 21799 21915 25003 26665 24149 24714 28660 29652 26581 26380
14125B6380M127J086m495m963l89k644M16N331M227l489J659N95k813n858j31
$$ 26380 30507 31593 27098 22135 21746 19102 19518 24849 29076 25587 27246 27841 25028 19170 19039
14110A9039J930K344M366k011L122J163K080k146m673k161p33N989o66j960k730
$$ 19039 20969 23313 27679 25668 28790 29953 32033 29887 25214 23053 22320 28309 27643 25683 22953
14095B2953L98K643K27J295L632k26j100k265L028j660l4O0k05M54N0j13l381
$$ 22953 23351 25994 26221 27516 31148 30922 29822 27557 30585 28925 28891 28951 28746 29200 29250 29137 25756
14078B5756J818M016k93k292k968P60J004k139K04M425N279K268j478J413L59
$$ 25756 27574 31590 31297 29005 26037 26797 27801 25662 25866 30291 35570 37838 36360 37773 38132
14063C8132k81p52j612o7K422O953J498M521N192n5j115l340l498j44l945l602
$$ 38132 37851 37099 35487 35420 37842 44795 46293 50814 56006 55951 54836 51496 47998 47854 43909 40307
14047D0307k551q98K551l95l396j256K442M539k415K44K564n49m759k717J308
$$ 40307 37756 36858 39409 39014 35618 34362 36804 41343 38928 39172 41736 41187 36428 33711 35019
14032C5019K907k622J784N023j7l181M656O083m04N914P146M814N527M480M950
$$ 35019 37926 35304 37088 42111 42094 38913 43569 49652 49248 55162 62308 67122 72649 77129 82079
14017H2079L935j135j02L72N2j489j22n293p206m507k681n743J962n1l54n88l562
$$ 82079 86014 84879 84777 85149 85201 83712 83590 78297 71091 66584 63903 58160 60122 60071 59717 59129 55567
14000E5567n111R57K249L498J575K886L111J95l197k86J48J081L635J402L799
$$ 55567 50456 51413 53662 57160 58735 61621 64732 64927 61730 61444 61592 62673 66308 67710 71509
13985G1509M238L887L692O152N748N020J964K308p6L781L021q94o695o226n288
$$ 71509 75747 79634 83326 89478 95226 100246 102210 104518 104442 108223 111244 110350 103655 97429 92141
13970I2141m309J488K512l309l17R16P55j655k60N216M337J382k03J312L493K684
$$ 92141 87832 89320 91832 88523 88206 89122 89877 88222 87962 93178 97515 98897 98694 100006 103499 106183
13954A06183Q655R743O101M342N564Q600N166N840N259J0925R621J0244J1827
$$ 106183 114838 124581 130682 135024 140588 149188 154354 160194 165453 176378 185999 196243 208070
13941B08070Q068N120M75j348jj503j071j985K111q260k778r54n354l497n179
$$ 208070 216138 221258 221733 220385 220384 218881 217810 215825 217936 209676 206898 205944 200590 197093 191914
13926A91914m635n225j229P48m302p158m458j57r94J30L205N74L331N172O389
$$ 191914 187279 182054 180825 181573 177271 170113 165655 165498 164504 164634 167839 168413 171744 176916 183305
13911A83305K667k043K535O197P378M701M568N530L810J509L565L094k64l127
$$ 183305 185972 183929 186464 192661 200039 204740 209308 214838 218648 220157 223722 226816 226552 223425
13897B23425m229m744p489o867j955r25m868l716j958q411m814l514p113n300
$$ 223425 219196 214452 206963 200096 198141 197216 192348 188632 186674 178263 173449 169935 162822 157522
13883A57522k422k35k16j085K4J4o742L28j47k884m181m585l996K749K564L879
$$ 157522 155100 154865 154649 153564 153588 153602 146860 147188 147041 144157 139976 135391 131395 134144 136708 140587
13867A40587J465J606o878n258r272p592l917j566K86J0320J3999Q551L158p778
$$ 140587 142052 143658 136780 131522 122250 114658 110741 109175 109461 119781 133780 142331 145489 137711
13853A37711j5658p734j37J670J2732J0700N558Q53r258j0635m830q292k633K377
$$ 137711 122053 114319 114182 115852 128584 139284 144842 145695 136437 125802 120972 112680 110047 112424
13839A12424Q311R966K270J487p68n729r909n245k046R99K86K346K154k379m498
$$ 112424 120735 130701 132971 134458 133690 127961 118052 112807 110761 111760 112046 114392 116546 114167 109669
13824A09669R59L22k505l214J601K067j00R49k803l855L91k656l076p75J49M64
$$ 109669 110628 110950 108445 105231 106832 108899 108799 109748 106945 103090 103481 100825 97749 96974 97123 97587
13808I7587J13K647l52K441O66q63J562k106o99k452j014o54J56L689J031k238
$$ 97587 97700 100347 99995 102436 103102 102239 103801 101695 100996 98544 97530 96876 97032 100721 101752 99514
13792I9514j243N65j437j136R59L052j467l872l772n25j947L234L349L224J492
$$ 99514 98271 98836 97399 96263 97222 100274 98807 94935 91163 90638 88691 91925 95274 98498 99990
13777I9990k432J595J869m213n87K675p27L062J271J243J09j453K701K763P52
$$ 99990 97558 99153 101022 96809 96222 98897 98170 101232 102503 103746 103855 102402 105103 107866 108618
13762A08618k088n82J715J614L244K922L977j03N64M319J1J327K760k65k019j236
$$ 108618 106530 105948 107663 109277 112521 115443 119420 119317 119881 124200 124211 125538 128298 128033 126014 124778
13746A24778j067n420k88L689K966M61O83K660M618P18O58r11O46R215J915m95
$$ 124778 123711 118291 118003 121692 124658 125119 125802 128462 133080 133798 134456 133545 134191 143406 145321 144826
13730A44826M219L905K906O27K602L834K764N078L515J448L248K5p26n61J035
$$ 144826 149045 152950 155856 156483 159085 162919 165683 170761 174276 175724 178972 178997 178271 177710 178745
13715A78745N26m552K149K709j451J171p65L331K479l247j670K091L268O002N321
$$ 178745 179271 174719 176868 179577 178126 179297 178532 181863 184342 181095 179425 181516 184784 190786 196107
13700A96107R867O832L078L698P125J033K004M647K925J244K262K323J222j159
$$ 196107 205974 212806 215884 219582 226707 227740 229744 234391 237316 238560 240822 243145 244367 243208
13686B43208M86r11N997K886q96k531p64L95N755N054o42j203J694M868J87J26
$$ 243208 243694 242783 248780 251666 250770 248239 247475 247870 253625 258679 258037 256834 258528 263396 263583 263709
13670B63709P870O653P493M887M416M217R639P347M487J0345R845J2716N883L946
$$ 263709 271579 278232 285725 290612 295028 299245 308884 316231 320718 331063 340908 353624 359507 363453
13656C63453R789R486Q965L709M457J0170P982N213P568Q079M850N386P073N620
$$ 363453 373242 382728 391693 395402 399859 410029 418011 423224 430792 438871 443721 449107 456180 461800
13642D61800O080J0751Q730M130P127Q738Q734O885M014P774J0402J0063L611
$$ 461800 467880 478631 487361 491491 498618 507356 516090 522975 526989 534763 545165 555228 558839
13629E58839M628L679O599N049N423M379J469N039O501N72L751M330K787L994
$$ 558839 563467 567146 573745 578794 584217 588596 590065 595104 601605 602177 605928 610258 613045 617039
13615F17039M867M250M064l63J024M392N792P059O863J0554J0698N721Q685J1584
$$ 617039 621906 626156 630220 629857 630881 635273 641065 648124 654987 665541 676239 681960 690645 702229
13601G02229J3556N666J0453J3304P944P844J2147J3594J6934J5139J5429J4564
$$ 702229 715785 721451 731904 745208 753152 760996 773143 786737 803671 818810 834239 848803
13589H48803R380R249J5122J6569J8433J7804J4225J7627J6911J6322J2319J7265
$$ 848803 858183 867432 882554 899123 917556 935360 949585 967212 984123 1000445 1012764 1030029
13577A030029J8932J3179J3986J9095K1571J9247J8453K1084K5810K6315K6169
$$ 1030029 1048961 1062140 1076126 1095221 1116792 1136039 1154492 1175576 1201386 1227701 1253870
13566A253870K5539K3783L0725L5474L1956L6766L7802M2488M2087M5974M4648
$$ 1253870 1279409 1303192 1333917 1369391 1401347 1438113 1475915 1518403 1560490 1606464 1651112
13555A651112M4498M8577N2457N9449N9405O9077P5742P9958Q3262Q5962R4314
$$ 1651112 1695610 1744187 1796644 1856093 1915498 1984575 2060317 2140275 2223537 2309499 2403813
13544B403813J05702J10435J14324J23786J33629J47947J61329J70764J86627
$$ 2403813 2509515 2619950 2734274 2858060 2991689 3139636 3300965 3471729 3658356
13535C658356K03833K30738K49291K65302K93971L20878L50105L89148M25918
$$ 3658356 3862189 4092927 4342218 4607520 4901491 5222369 5572474 5961622 6387540
13526F387540M75991N28714N76671O39660P03576P68321Q46098R25258J009631
$$ 6387540 6863531 7392245 7968916 8608576 9312152 10080473 10926571 11851829 12861460
13517A2861460J097098J176577J259924J329879J381763J411428J410015J373489
$$ 12861460 13958558 15135135 16395059 17724938 19106701 20518129 21928144 23301633
13509B3301633J297367J188747J032074Q38309O24573L90751J42882j00522l20945
$$ 23301633 24599000 25787747 26819821 27658130 28282703 28673454 28816336 28715814 28394869
13500B8394869n20098o84986q21260r16535r66533r77505r66639r27406q67186
$$ 28394869 27874771 27189785 26368525 25451990 24485457 23507952 22541313 21613907 20746721
13491B0746721p87256o92967n98475n01750m02546k99010j88160q5069K0625J26214
$$ 20746721 19959465 19266498 18668023 18166273 17763727 17464717 17276557 17191488 17212113 17338327
13481A7338327K39991L56224M65606N73162O80382P80683Q66215R43207R95326
$$ 17338327 17578318 17934542 18400148 18973310 19653692 20434375 21300590 22243797 23239123
13472B3239123J016910J010784R63341Q76880P49395N89102L98579J88229m2299
$$ 23239123 24256033 25266817 26230158 27107038 27856433 28445535 28844114 29032343 28990044
13463B8990044k65869m83126o76287q50207r88300j091221j158869j192284j195418
$$ 28990044 28724175 28241049 27564762 26714555 25726255 24635034 23476165 22283881 21088463
13454B1088463j181064j145241j094871j034877r73587r10982q45189p79768p26789
$$ 21088463 19907399 18762158 17667287 16632410 15658823 14747841 13902652 13122884 12396095
13445A2396095o75237o26049n76109n29497m92882m54646m22503l91623l68854
$$ 12396095 11720858 11094809 10518700 9989203 9496321 9041675 8619172 8227549 7858695
13436G858695l44728l15233k99437k76465k59135k43686k26349k11847k01886
$$ 7858695 7513967 7198734 6899297 6622832 6363697 6120011 5893662 5681815 5479929
13427E479929j89358j73548j62073j54479j50575j36788j25129j21410j17490
$$ 5479929 5290571 5117023 4954950 4800471 4649896 4513108 4387979 4266569 4149079
13418D149079j10708j03827j04116r4363r0594q7763q5177q1982p9442p5811p3711
$$ 4149079 4038371 3934544 3830428 3736065 3645471 3557708 3472531 3390549 3311107 3235296 3161585
13407C161585p0559o8625o9449o5133o5599o2415n9900n8289n3287n3382n6104
$$ 3161585 3091026 3022401 2952952 2887819 2822220 2759805 2699905 2641616 2588329 2534947 2478843
13396B478843n0444n3729n2250m7943m4512m1091m3232m1092l8323l8307m0410
$$ 2478843 2428399 2374670 2322420 2274477 2229965 2188874 2145642 2104550 2066227 2027920 1987510
13385A987510l5972l4665l3991l1030k8720k2387k5579k7964k9038k6630k5138
$$ 1987510 1951538 1916873 1882882 1851852 1823132 1800745 1775166 1747202 1718164 1691534 1666396
13374A666396k0479j8767j8847k3065k2369k0303j7159j4928j2762j2203j1816
$$ 1666396 1645917 1627150 1608303 1585238 1562869 1542566 1525407 1510479 1497717 1485514 1473698
13363A473698j0321p542n111p801n820p37J17q47l2J330j397o122j4488j0041
$$ 1473698 1463377 1455835 1450724 1442923 1437103 1436366 1436483 1435636 1435604 1436934 1435537 1429415 1414927 1404886
13349A404886j0115j4547k0278k7557l2473k5966l4759l5368l7072l3374l7120
$$ 1404886 1394771 1380224 1359946 1332389 1299916 1273950 1239191 1203823 1166751 1133377 1096257
13338A096257l1164k5996k4941k3413j8893k4359k2656j3956j4995j2896j2814
$$ 1096257 1065093 1039097 1014156 990743 971850 947491 924835 910879 895884 882988 870174
13327H70174j0416j0150m510q38m61n79K923N959R407J2454J2120J2854J0036
$$ 870174 859758 849608 845098 844260 843799 843220 846143 852102 861509 873963 886083 898937 908973
13314I08973J2859R873L804p78m607q483j5439j6808j5753k1566k8973k8194l1694
$$ 908973 921832 931705 935509 934731 930124 921641 906202 889394 873641 852075 823102 794908 763214
13301G63214l1188k8463k9048k8253k5004k3072j8471j8386k0421k2130j6648
$$ 763214 732026 703563 674515 646262 621258 598186 579715 561329 540908 518778 502130
13290E02130k1695j7620j2044j4055j4234j3356j0198j0387j0471p696o001r571
$$ 502130 480435 462815 450771 436716 422482 409126 398928 388541 378070 370374 364373 354802
13278C54802p574k996J13K088q95J193k311l967l807p269k996k470l867k900p590
$$ 354802 347228 344232 344345 346433 345538 346731 344420 340453 336646 329377 326381 323911 320044 317144 309554
13263C09554j698j861o328r418q078o420r167q287n47M91n885p060p618q793n763
$$ 309554 307856 305995 299667 290249 282171 275751 266584 258297 257750 258241 252356 245296 237678 228885 223122
13248B23122k359l233n647k005k246l324l397k273l790m049n391m039j177n417
$$ 223122 220763 217530 211883 209878 207632 204308 200911 198638 194848 190799 185408 181369 180192 174775
13234A74775o979l69J79l128l236l685m425j363n096k759k580j263l530l050l489
$$ 174775 167796 167427 167606 164478 161242 157557 153132 151769 146673 143914 141334 140071 136541 133491 130002
13219A30002k697J06q2J598p70Q46k419j510j919l688l283J00J263q83m088k001
$$ 130002 127305 127411 127329 128927 128157 129003 126584 125074 123155 119467 116184 116284 117547 116664 112576 110575
13203A10575k0j943j241M222L308j082j620p330m608K108M123j650l639n325j156
$$ 110575 110555 108612 107371 111593 114901 113819 112199 104869 100261 102369 106492 104842 101203 95878 94722
13188I4722k661j281j070Q52m87n529l618L528L612k289j417l295k728k382l931
$$ 94722 92061 90780 89710 90562 90075 84546 80928 84456 88068 85779 84362 81067 78339 75957 72026
13173G2026k559P61K694N172P50j725Q8J041m39l952K222M687j134j616j153m694
$$ 72026 69467 70228 72922 78094 78844 77119 77207 78248 77809 73857 76079 80766 79632 78016 76863 72169
13157G2169m817k153j573J872L053K457k395j886J354L117J004n050q01k460Q45
$$ 72169 67352 65199 63626 65498 68551 71008 68613 66727 68081 71198 72202 67152 66351 63891 64736
13142F4736J672m081k036P99J630j015r79l794L21M150k43K534M328N926J0019
$$ 64736 66408 62327 60291 61090 62720 61705 60726 56932 57253 61403 61160 63694 68022 73948 83967
13127H3967P672O299J0323Q701J5090K1510K8386M2639O7389O9106M5645j632
$$ 83967 91639 97938 108261 116962 132052 153562 181948 224587 291976 361082 406727 405095
13115D05095l9446n4148n8988n2712m0799k6241j1654k983l263n081j301m555
$$ 405095 365649 311501 252513 199801 159002 132761 121107 118124 114861 109780 108479 103924
13103A03924k957k861j663J757m089n210o800o304o015k039J337L303K461O473
$$ 103924 100967 98106 96443 98200 94111 88901 82101 75797 69782 67743 69080 72383 74844 81317
13089H1317Q049J2112J1385P556R873J4754J4188J9504K0719K3362K8565M0561
$$ 81317 89366 101478 112863 120419 130292 145046 159234 178738 199457 222819 251384 291945
13077B91945N7492Q4090J28004J92271K31004J83796N5522p5073j45651j68142
$$ 291945 349437 433527 561531 753802 984806 1168602 1224124 1149051 1003400 835258
13067H35258j58162j33384r7336o2804l9782k9663k5933j8716j3045j3571j2418
$$ 835258 677096 543712 446376 383572 343790 314127 288194 269478 256433 242862 230444
13056B30444r744n803p875r241q966r761o476l182l626l358j299m37J085L399
$$ 230444 220700 214897 207022 197781 188815 179054 172578 169396 165770 162412 161113 160676 161761 165160
13042A65160L596P510J384K759J4500J8671J6594K3985K9560L7830M9448P6355
$$ 165160 168756 176266 177650 180409 194909 213580 230174 254159 283719 321549 370997 447352
13030D47352J19690J79708K28921K04918R1255n1728j41138j76238j80354j54461
$$ 447352 567042 746750 975671 1180589 1271844 1220116 1078978 902740 722386 567925
13020E67925j13697p8094n0592l5118k4984k4004j7871j5172j4882j3919j2875
$$ 567925 454228 376134 325542 290424 265440 241436 223565 208393 193511 179592 166717
13009A66717j3400j3304j5614p904o265n107n132n877k158o243k653j935O8k050
$$ 166717 153317 140013 124399 116495 110230 105123 99991 94114 91956 85713 83060 81125 81193 79143
12995G9143k46L79l296j03P988O991L704O901J1965K3002L6706N4898O9861O8569
$$ 79143 78897 79276 75980 75877 83865 90856 94560 101461 113426 136428 173134 228032 297893 366462
12981C66462M1779r690m3853n8724o0800n5235m2610l1083k0054r163m962o691
$$ 366462 408241 398551 354698 295974 235174 179939 137329 106246 86192 77029 72067 65376
12969F5376m861q107m120m187m949l376l229k394p50L362Q75k226k954k059j625
$$ 65376 60515 52408 48288 44101 39152 35776 32547 30153 29403 32765 33640 31414 28460 26401 24776
12954B4776j547R8O365j048q62k433j720K886J066l761p590j615k759n93J571
$$ 24776 23229 23327 29692 28644 27782 25349 23629 26515 27581 23820 16230 14615 11856 11263 12834
12939A2834M209QL209J746j861k23K417l156l616k107O04M993j237m707n499n13
$$ 12834 17043 17051 20260 22006 20145 19922 22339 19183 15567 13460 14064 19057 17820 13113 7614 7101
12923G101Q79P02J323M326j081L571J374j253l931j937J459J461K022k520j286
$$ 7101 7980 8682 10005 14331 13250 16821 18195 16942 13011 11074 12533 13994 16016 13496 12210
12908A2210J98J52K886l22o96p73j507J264k146K69J193M176j131j466n938j313
$$ 12210 12408 12560 15446 15124 14428 13655 12148 13412 11266 11535 12728 16904 15773 14307 8369 7056
12892G056L844k426K483j426n300J80o75L593O03l123J176j854m145J398O516
$$ 7056 10900 8474 10957 9531 4231 4411 3736 7329 7932 4809 5985 4131 -14 1384 7900
12877G900J179K436K473o48j370m704J227K487k680l467k717J886j728j619K487
$$ 7900 9079 11515 13988 13340 11970 7266 8493 10980 8300 4833 2116 4002 2274 655 3142
12862C142K475J323K185j526m142j077J479J751K207k106K922l22m202p542k852
$$ 3142 5617 6940 9125 7599 3457 2380 3859 5610 7817 5711 8633 8311 4109 -3433 -6285
12847f285M119K124J806o93L340k167k191L361j536j233j695P12N782j268j353
$$ -6285 -2166 -42 1764 1071 4411 2244 53 3414 1878 645 -1050 -338 5444 4176 2823
12832B823N465j044N61J984q62j611N50k496l823j98p17m80m816M84J102K907
$$ 2823 8288 7244 7805 9789 8927 7316 7866 5370 1547 1349 632 152 -4664 -4180 -3078 -171
12816a71Q07K158j143k238j90L23M759J901J224R81N90K586j406j897p300j348
$$ -171 636 2794 1651 -587 -777 -454 4305 6206 7430 8411 9001 11587 10181 8284 984 -364
12800c64j083j136J571K829p46k739p55j807k136K890J722j054L294N535j317
$$ -364 -1447 -2583 -1012 1817 1071 -1668 -2423 -4230 -6366 -3476 -1754 -2808 486 6021 4704
12785D704l858j184J769L147j276j895m02j397K65R20m38k700j289L020N95l212
$$ 4704 846 -338 1431 4578 3302 1407 1005 -392 -127 793 355 -2345 -3634 -614 -19 -3231
12769c231J243p04j903R43K829J599J629K423L745N484J577j682p753o266j708
$$ -3231 -1988 -2692 -4595 -3652 -823 776 2405 4828 8573 14057 15634 13952 6199 -67 -1775
12754a775l542l465k53M81l96Q84j478M034K531j492j218K832N72l68j127k030
$$ -1775 -5317 -8782 -9035 -8554 -8950 -8066 -9544 -5510 -2979 -4471 -5689 -2857 -2285 -2653 -3780 -5810
12738e810K619k96J949j034j599o9K380K316O48n80L68Q20j503q79q29K611Q29
$$ -5810 -3191 -3487 -1538 -2572 -4171 -4240 -1860 456 1104 524 892 1712 209 -670 -1499 1112 1941
12721A941k011k139m07L452M317j326k39R09N78J596Ll368m14M525q36M589R83
$$ 1941 -70 -2209 -2616 836 5153 3827 3588 4497 5075 6671 6674 3306 2892 7417 6581 11170 12153
12704A2153k112R55j841k584j746n832k217J544l99l29J140O36j564k583J219
$$ 12153 10041 10996 9155 6571 4825 -1007 -3224 -1680 -2079 -2408 -1268 -632 -2196 -4779 -3560
12689c560o08j29J253K07k548J923J683N78j397j30j192J703m24O20O16J681k307
$$ -3560 -4168 -4297 -3044 -2837 -5385 -3462 -1779 -1201 -2598 -2728 -3920 -2217 -2641 -2021 -1405 276 -2031
12672b031n047j821j059L892M290O2l97k87k336P27K639J435p80j290j25k352
$$ -2031 -7078 -8899 -9958 -6066 -1776 -1714 -2111 -2398 -4734 -4007 -1368 67 -713 -2003 -2128 -4480
12656d480k402J62L380J186p2k020k545J791L419L033l475k847J966k07N49Q99
$$ -4480 -6882 -6720 -3340 -2154 -2226 -4246 -6791 -5000 -1581 1452 -2023 -4870 -2904 -3111 -2562 -1663
12640a663J631j083j324J660m60J233k675j679J99O078j09q28k220j293K176J520
$$ -1663 -32 -1115 -2439 -779 -1239 -6 -2681 -4360 -4161 1917 1808 980 -1240 -2533 -357 1163
12624A163J756k722J573j044j684M912L769k96l400k394O1j177K988J422j234
$$ 1163 2919 197 1770 726 -958 3954 7723 7427 4027 1633 1694 517 3505 4927 3693
12609C693n529J9M174p4j36O10l37k459Q80J495l022m420K465K405K004J312o59
$$ 3693 -1836 -1817 2357 2283 2147 2757 2420 -39 841 2336 -686 -5106 -2641 -236 1768 3080 2421
12592B421p97O00l453m126k492M174j999l359J506M132L22j6j090j672j4p67N26
$$ 2421 1624 2224 -1229 -5355 -7847 -3673 -5672 -9031 -7525 -3393 -3071 -3087 -4177 -5849 -5863 -6630 -6104
12575f104K215k159k703j552n60j77N020J447L921L468j688N72J41r83O72k195
$$ -6104 -3889 -6048 -8751 -10303 -10863 -11040 -6020 -4573 -652 2816 1128 1700 1841 858 1530 -665
12559f65j553K270N872J313o156m992J465K582j130q48J239P63l042l178J995
$$ -665 -2218 52 5924 7237 1081 -3911 -2446 136 -994 -1842 -603 160 -2882 -6060 -4065
12544d065l90J107l282n718j46M865N843J160o958k287K73J864m22j151j578L099
$$ -4065 -4455 -3348 -6630 -12348 -12494 -7629 -1786 -626 -7584 -9871 -9598 -7734 -8156 -9307 -10885 -7786
12528g786K909k05k206J951J184j556l98O81K601L608j467l51j76k092L17J314
$$ -7786 -4877 -5082 -7288 -5337 -4153 -5709 -6107 -5426 -2825 783 -684 -1035 -1211 -3303 -2986 -1672
12512a672J71M50M17j846j209JK478K519K656J249p45l055j318L591K832j650
$$ -1672 -1501 -1051 -634 -2480 -3689 -3688 -1210 1309 3965 5214 4469 1414 96 3687 6519 4869
12496D869m490k656r32j070J874j412l936r90J370R39R68j830L648j552k182J774
$$ 4869 379 -2277 -3209 -4279 -2405 -3817 -7753 -8743 -7373 -6434 -5466 -7296 -3648 -5200 -7382 -5608
12480e608j322J299L777L896r94k655o95K994j631l023J809m12O12K466N127L091
$$ -5608 -6930 -5631 -1854 2042 1048 -1607 -2302 692 -939 -3962 -2153 -2565 -1953 513 5640 8731
12464H731n085n319q52N007J212j522j713M444j39m339p80j003J772Q26k615Q54
$$ 8731 3646 -1673 -2525 2482 3694 2172 459 4903 4764 425 -355 -1358 414 1240 -1375 -521
12448e21N655J080k326m868R01M085O907K668j264J498k993l386j506J512j980
$$ -521 5134 6214 3888 -980 -79 4006 10913 13581 12317 13815 10822 7436 5930 7442 5462
12433E462J988J283l420j788M83k879m849M99K296N322P739M310o392o680l58
$$ 5462 7450 8733 5313 3525 4008 1129 -3720 -3221 -925 4397 12136 16446 10054 3374 3016
12418C016k175m803N54Q403N381J182l861k837j017J831K829k513k411J179k734
$$ 3016 841 -3962 -3408 4995 10376 11558 7697 4860 3843 5674 8503 5990 3579 4758 2024
12403B024k50P01J393j766R78M18J436j469m284k262M51K728l167k159K40L863
$$ 2024 1774 2475 3868 2102 3080 3498 4934 3465 -819 -3081 -2630 98 -3069 -5228 -4988 -1125
12387a125J050o68L736J092n1k513l97j583R94rK590R47k207K73n00j475J147
$$ -1125 -75 -743 2993 4085 4034 1521 1124 -459 535 526 3116 4063 1856 2129 1629 154 1301
12370A301K572J411j649k840p98O07j526k972J314j479L364o82l821O25J778K86
$$ 1301 3873 5284 3635 795 -3 604 -922 -3894 -2580 -4059 -695 -1377 -5198 -4573 -2795 -2509
12354b509K801k803m234j326k304k058N227K558K793L770M720L585K480Q11M79
$$ -2509 292 -2511 -6745 -8071 -10375 -12433 -7206 -4648 -1855 1915 6635 10220 12700 13511 13990
12339A3990j571l006K90N779L36k818m600k779p93J727M407M031k209K528M809
$$ 13990 12419 9413 9703 15482 15818 13000 8400 5621 4828 6555 10962 14993 12784 15312 20121
12324B0121M613M068O094J1364O274J3607J3620K3678K6398K3389Q171o519j1669
$$ 20121 24734 28802 34896 46260 52534 66141 79761 103439 129837 153226 161397 154878 143209
12311A43209k0703k0130k0278j6332j4743j4151q246m644l916p267J322l497m101
$$ 143209 122506 102376 82098 65766 51023 36872 28626 23982 20066 12799 14121 10624 6523
12298F523K66n941n106N25q6m02K442j167K459M194j529j96J904m698k537j33
$$ 6523 6789 848 -4258 -3733 -3819 -4221 -1779 -2946 -487 3707 2178 1982 3886 -812 -3349 -3482
12282c482l719K656K377r73J125p59k957J900M100J02r23l042n734k489O09kL051
$$ -3482 -7201 -4545 -2168 -3141 -2016 -2775 -5732 -3832 268 370 -553 -3595 -9329 -11818 -11209 -11211 -8160
12265h160K649j894l158M6j722L769K601o55j368K814N033M100M008k437n905
$$ -8160 -5511 -7405 -10563 -10517 -12239 -8470 -5869 -6524 -7892 -5078 -45 4055 8063 5626 -279
12250b79J47n00j231k453j909q91J39Q96L367J393N08l210l935K978M16j060j024
$$ -279 -132 -632 -1863 -4316 -6225 -7116 -6977 -6081 -2714 -1321 -813 -4023 -7958 -4980 -4564 -5624 -6648
12233f648k34j402l216N70k807n9K895J703K241J136L363k13o99l007o24k43k812
$$ -6648 -6882 -8284 -11500 -10930 -13737 -13796 -10901 -9198 -6957 -5821 -2458 -2671 -3370 -6377 -7001 -7244 -10056
12216a0056j929M57K864K965l57k21j116l114J365R0q69l273J387L178j869L0
$$ -10056 -11985 -11528 -8664 -5699 -6056 -6277 -7393 -10507 -9142 -9052 -9921 -13194 -11807 -8629 -10498 -10468
12200a0468K878j175J739L894m28l273J727j136K179p05j828o30k374J81M4O47
$$ -10468 -7590 -8765 -7026 -3132 -3560 -6833 -5106 -6242 -4063 -4768 -6596 -7226 -9600 -9419 -9375 -8728
12184h728O93o12j301j578J532M367P75m85O667L65l891J956J658j164M90m21
$$ -8728 -8035 -8647 -9948 -11526 -9994 -5627 -4852 -5337 1330 1695 -2196 -240 1418 254 744 323
12168C23J761J59k97l864L29L071K33L19m23l211n00o87k60m9K374J434n11n967
$$ 323 2084 2243 1946 -1918 -1589 1482 1715 2034 1611 -1600 -2100 -2787 -3047 -3096 -722 712 201 -5766
12150e766K404M84n18J540O073M131k069n388j899J737K10j568P68k95k605j321
$$ -5766 -3362 -2878 -3396 -1856 4217 8348 6279 891 -1008 729 939 -629 139 -156 -2761 -4082
12134d082N96r45j506K374M680L779j397l585J502N89j309k600k555r90J687L303
$$ -4082 -3486 -4431 -5937 -3563 1117 4896 3499 -86 1416 2005 696 -1904 -4459 -5449 -3762 -459
12118d59J077O50J80l121L09K408m51L481J063n786l823J917K372p83j550o95
$$ -459 618 1268 1448 -1673 -1364 1044 593 4074 5137 -649 -4472 -2555 -183 -966 -2516 -3211
12102c211J505J427r71k834q54K970o43o66J610O320l58n530k847l76K051J867
$$ -3211 -1706 -279 -1250 -4084 -4938 -1968 -2611 -3277 -1667 4653 4295 -1235 -4082 -4458 -2407 -540
12086e40m81j670L310L950n708j772j224P64J078N39j893J295K829n21p365m286
$$ -540 -1021 -2691 619 4569 -1139 -2911 -4135 -3371 -2293 -1754 -3647 -2352 477 -44 -7409 -11695
12070a1695J031L457M455J60j518M322L798n76M24k7j309j804K943J21k732l835
$$ -11695 -10664 -7207 -2752 -2592 -4110 212 4010 3434 3858 3831 2522 718 3661 3782 1050 -2785
12054b785JK364M807k21l029j710k27r04k059k93J569K207o40J132N3l934k007
$$ -2785 -2784 -420 4387 4166 1137 -573 -800 -1704 -3763 -4056 -2487 -280 -920 212 265 -3669 -5676
12037e676K713L14q13P97q44j028N4K1L686L770J456j999l792j57m16k797K331
$$ -5676 -2963 -2649 -3462 -2665 -3509 -4537 -4483 -4462 -776 2994 4450 2451 -1341 -1498 -1914 -4711 -2380
12020b380n94N096K260n3o39n26o82r60K349j931J514q21J81Q42L297M53l518
$$ -2380 -2974 2122 4382 4329 3690 3164 2482 1522 3871 1940 3454 2633 2814 3656 6953 7406 3888
12003C888k732j221r80J485j036k93K573L732j069p39k863r76J37m67J43j520
$$ 3888 1156 -65 -1045 440 -596 -889 1684 5416 4347 3608 745 -231 -94 -561 -418 -1938
11987a938Q07l743m655L520L460L586j21j312o76j289k400J056O48o08k553J61
$$ -1938 -1131 -4874 -9529 -6009 -2549 1037 916 -396 -1072 -2361 -4761 -3705 -3057 -3665 -6218 -6057
11971f057L262J8k118J407J687j019L03k476J086m631k836L654O08J28L134j439
$$ -6057 -2795 -2777 -4895 -3488 -1801 -2820 -2517 -4993 -3907 -8538 -11374 -7720 -7112 -6984 -3850 -5289
11955e289n111l190Q26M172K047m20P22k368j93J557l037l710j592L113l74L005
$$ -5289 -10400 -13590 -12764 -8592 -6545 -6965 -6243 -8611 -8804 -7247 -10284 -13994 -15586 -12473 -12847 -9842
11939i842K002J576K98j081m97R66j8K652j532N5j669l494j64K91Q57o72L6N44
$$ -9842 -7840 -6264 -5966 -7047 -7544 -6578 -6596 -3944 -5476 -5421 -7090 -10584 -10748 -10457 -9600 -10272 -10236 -9692
11921i692j342m08M068L50k040N100K556J368Q76m721m287j309j599n72r76K666
$$ -9692 -11034 -11442 -7374 -7024 -9064 -3964 -1408 -40 836 -3885 -8172 -9481 -11080 -11652 -12628 -9962
11905i962P77K74M444J25l218K422k226J870K01L347L428M05l210m573k708j929
$$ -9962 -9185 -8911 -4467 -4342 -7560 -5138 -7364 -5494 -5293 -1946 1482 1887 -1323 -5896 -8604 -10533
11889a0533R67K996Q02J420o96k798o50J123K051L57k780L345r6l428J005K875
$$ -10533 -9566 -6570 -5768 -4348 -5044 -7842 -8492 -7369 -5318 -4961 -7741 -4396 -4492 -7920 -6915 -4040
11873d040M487J080l005j925o96j38j464N91J00K959k671m464J394K072J621J2
$$ -4040 447 1527 -1478 -3403 -4099 -4237 -5701 -5110 -5010 -2051 -4722 -9186 -7792 -5720 -4099 -4087
11857d087J30K707K780l897k620m603J878m71n916l192L474j833O476M057J109
$$ -4087 -3957 -1250 1530 -2367 -4987 -9590 -7712 -8183 -14099 -17291 -13817 -15650 -9174 -5117 -4008
11842d008j280m100J429r06k838J288K759j63K249K9K046J448m678M498K795m764
$$ -4008 -5288 -9388 -7959 -8865 -11703 -10415 -7656 -7819 -5570 -5541 -3495 -2047 -6725 -2227 568 -4196
11826d196l901K159k126j040p04K784l66o26J602j219m13l090j069j742K441M167
$$ -4196 -8097 -5938 -8064 -9104 -9808 -7024 -7390 -8016 -6414 -7633 -8046 -11136 -12205 -13947 -11506 -7339
11810g339K038j421k485J64K558J201l930l186k576K074K222J569J308n89K77
$$ -7339 -5301 -6722 -9207 -9043 -6485 -5284 -9214 -12400 -14976 -12902 -10680 -9111 -7803 -8392 -8115
11795h115j939n92l065J200K848R11k112o843R28L161J147M555K464l13J655Q92
$$ -8115 -10054 -10646 -13711 -12511 -9663 -8752 -10864 -17707 -16779 -13618 -12471 -7916 -5452 -5765 -4110 -3218
11779c218m517j764L538K141m215J606J312m012P43O66j222j168J693M582N178
$$ -3218 -7735 -9499 -5961 -3820 -8035 -6429 -5117 -9129 -8386 -7720 -8942 -10110 -8417 -3835 1343
11764A343j966l91j022l280k642m003j231J065j012j572P0R40M512j23k992j537
$$ 1343 -623 -1014 -2036 -5316 -7958 -11961 -13192 -12127 -13139 -14711 -14641 -13701 -9189 -9312 -12304 -13841
11748a3841j591M00P88LQ15m89l497j207M291L859J578M54j60k069r3J646j246
$$ -13841 -15432 -15032 -14244 -14241 -13426 -13915 -17412 -18619 -14328 -10469 -8891 -8437 -8597 -10666 -10759 -9113 -10359
11731a0359k570J173J96m61M73J819r84j884n78n89L387j916J649K178j830J649
$$ -10359 -12929 -11756 -11560 -12021 -11548 -9729 -10713 -12597 -13175 -13764 -10377 -12293 -10644 -8466 -10296 -8647
11715h647K206n645L147j171K29j281N5K185p60j738K157j831L844K958k891j625
$$ -8647 -6441 -12086 -8939 -10110 -9881 -11162 -11107 -8922 -9682 -11420 -9263 -11094 -7250 -4292 -7183 -8808
11699h808O34j038J149P26K228k777K81M48K059k551l555r98J172J208k236l702
$$ -8808 -8174 -9212 -8063 -7337 -5109 -7886 -7605 -7157 -5098 -7649 -11204 -12202 -11030 -9822 -12058 -15760
11683a5760J053J073J035L60P96R43o07J566L221j161J060Q80J30k509k706n37
$$ -15760 -14707 -13634 -12599 -12239 -11443 -10500 -11107 -9541 -6320 -7481 -6421 -5541 -5411 -7920 -10626 -11163
11667a1163J634J483M722J437n672j673l94j456n06J366L588K793l674j981K597
$$ -11163 -9529 -8046 -3324 -1887 -7559 -9232 -9626 -11082 -11588 -10222 -6634 -3841 -7515 -9496 -6899
11652f899k523k332J044j56J339J494n45O37l175P19K237J228K570n437l800M81
$$ -6899 -9422 -11754 -10710 -10866 -9527 -8033 -8578 -7941 -11116 -10397 -8160 -6932 -4362 -9799 -13599 -13118
11636a3118K428n21M38M296M9l826m28m456L172K314m72k499k072j733Q12P37
$$ -13118 -10690 -11211 -10773 -6477 -6428 -10254 -10682 -15138 -11966 -9652 -10124 -12623 -14695 -16428 -15616 -14879
11620a4879K232j761l895J193O9L244M046j628K089L344L610k470o370k248K094
$$ -14879 -12647 -14408 -18303 -17110 -17041 -13797 -9751 -11379 -9290 -5946 -2336 -4806 -11176 -13424 -11330
11605a1330J531K051J658j809P37j846j077N300M168j774n563o62l31P92o08k542
$$ -11330 -9799 -7748 -6090 -7899 -7162 -9008 -10085 -4785 -617 -2391 -7954 -8616 -8947 -8155 -8763 -11305
11589a1305K416M870K697k154k724L038J728Q5o2j307l403j842m53%m695R27R87
$$ -11305 -8889 -4019 -1322 -3476 -6200 -3162 -1434 -1349 -1411 -2718 -6121 -7963 -8416 -8416 -13111 -12184 -11197
11572a1197L93o20K166K750j737J660O47R57M234l293k271r61L040l122m755k94
$$ -11197 -10804 -11424 -9258 -6508 -8245 -6585 -5938 -4981 -747 -4040 -6311 -7272 -4232 -7354 -12109 -12403
11556a2403N510J679j193k147j783L753j101K335K057k195K004j606l112L466
$$ -12403 -6893 -5214 -6407 -8554 -10337 -6584 -7685 -5350 -3293 -5488 -3484 -5090 -8202 -4736
11542d736r27k263m17M698K404l390n825k221O08r40M67J047K86M65l36K302j626
$$ -4736 -5663 -7926 -8343 -3645 -1241 -4631 -10456 -12677 -12069 -13009 -12542 -11495 -11209 -10744 -11080 -8778 -10404
11525a0404k804M452J05j004o21j212k057q8k480n79K079l18J688L611L06K742
$$ -10404 -13208 -8756 -8651 -9655 -10276 -11488 -13545 -13633 -16113 -16692 -14613 -14931 -13243 -9632 -9326 -6584
11509f584K188n128k83p6L995Q93L7J063l854j452k062Q8M310n062J280K742j582
$$ -6584 -4396 -9524 -9807 -9883 -5888 -4995 -4958 -3895 -7749 -9201 -11263 -11175 -6865 -11927 -10647 -7905 -9487
11492i487O91J302R26N47k857K763M62j157j478K686j152j574j957j111J892K126
$$ -9487 -8796 -7494 -6568 -6021 -8878 -6115 -5653 -6810 -8288 -5602 -6754 -8328 -10285 -11396 -9504 -7378
11476g378o69L793k745J747J929k674l686l758K151J968J5M28j92j570k813m163
$$ -7378 -8047 -4254 -6999 -5252 -3323 -5997 -9683 -13441 -11290 -9322 -9307 -8879 -9071 -10641 -13454 -17617
11460a7617M648L328M548l328k421M85J875j280J306J04l429j10J435K962J177
$$ -17617 -12969 -9641 -5093 -8421 -10842 -10357 -8482 -9762 -8456 -8352 -11781 -11891 -10456 -7494 -6317
11445f317L22k027k684L512j3k505J155M819j542j38j604k178R91J684J30J073
$$ -6317 -5995 -8022 -10706 -7194 -7207 -9712 -8557 -3738 -5280 -5418 -7022 -9200 -8209 -6525 -6395 -5322
11429e322m11l39P05R25j405j649K757O60j389l497L996K847r16m017K110M025
$$ -5322 -5733 -6072 -5367 -4442 -5847 -7496 -4739 -4079 -5468 -8965 -4969 -2122 -3038 -7055 -4945 -920
11413i20M242N45j262j49r79K265j139k12r64k567M68j948N04Q04j4l223m46k850
$$ -920 3322 3867 2605 2456 1477 3742 2603 2391 1427 -1140 -672 -2620 -2116 -1312 -1326 -4549 -4995 -7845
11395g845K19LJ585k582l191K274K115m07k43R08r98j263N75K462j484l038J326
$$ -7845 -7626 -7623 -6038 -8620 -11811 -9537 -7422 -7829 -8072 -7164 -8162 -9425 -8850 -6388 -7872 -10910 -9584
11378i584K683O81J065L450J273k174k117j445m052l445k159K001K251L122M438
$$ -9584 -6901 -6220 -5155 -1705 -432 -2606 -4723 -6168 -10220 -13665 -15824 -13823 -11572 -8450 -4012
11363d012j569j973k31n25k823J313M029j607m308l133j758L408L001L433L047
$$ -4012 -5581 -7554 -7785 -8310 -11133 -9820 -5791 -7398 -11706 -14839 -16597 -13189 -10188 -6755 -3708
11348c708k045k819M87K620L521l330k10j147N68M565K018q85m68j676q15M66
$$ -3708 -5753 -8572 -8085 -5465 -1944 -5274 -5484 -6631 -6063 -1498 520 -365 -833 -2509 -3324 -2858
11332b858l172P86J774j628O06l064j567L564K113o38k008k03r1o37k35q53o7
$$ -2858 -6030 -5244 -3470 -5098 -4492 -7556 -9123 -5559 -3446 -4084 -6092 -6295 -6386 -7023 -7258 -8111 -8178
11315h178M13j319q56J465K477p189j00J231J26M395O258J582j464o49r7n679
$$ -8178 -7765 -9084 -9940 -8475 -5998 -13187 -13287 -12056 -11930 -7535 -1277 305 -1159 -1808 -1905 -7584
11299g584k666M406N136k875k960K345L197L58o956n779M5K501N021Q54m128l355
$$ -7584 -10250 -5844 -708 -3583 -6543 -4198 -1001 -643 -7599 -13378 -13333 -10832 -5811 -4957 -9085 -12440
11283a2440K145L788P00j737K340L068l085n287L17N183K490j084k059k431L56
$$ -12440 -10295 -6507 -5807 -7544 -5204 -2136 -5221 -10508 -10191 -5008 -2518 -3602 -5661 -8092 -7736
11268g736N35P59l698L286r95j58J248k833L501L245m743j149l47q11J641J350
$$ -7736 -7201 -6442 -10140 -6854 -7849 -8007 -6759 -9592 -6091 -2846 -7589 -8738 -9085 -9896 -8255 -6905
11252f905or80Q10L477r6j216j467l97J401Q023P09m079k058K25k355m29K03k690
$$ -6905 -6911 -7891 -7081 -3604 -3700 -4916 -6383 -6780 -5379 2644 3353 -726 -2784 -2559 -4914 -5343 -5140 -7830
11234g830m340J285K595J928j149p93j082L965N681N26o539k648j027k426J483
$$ -7830 -12170 -10885 -8290 -6362 -7511 -8304 -9386 -5421 260 786 -5753 -8401 -9428 -11854 -10371
11219a0371L814k565l470J056M586M166j708J76m96K277Q64n281m53L026K508
$$ -10371 -6557 -9122 -12592 -11536 -6950 -2784 -4492 -4316 -4812 -2535 -1671 -6952 -7405 -4379 -1871
11204a871l106k929j323J79K613k021n93o32k293L126J496k096k814J560K313
$$ -1871 -4977 -7906 -9229 -9050 -6437 -8458 -9051 -9683 -11976 -8850 -7354 -9450 -12264 -10704 -8391
11189h391J474K5O4o80K203R49k410k437n1R56M130q2K736l636O37N06m77j12
$$ -8391 -6917 -6892 -6828 -7508 -5305 -4356 -6766 -9203 -9254 -8298 -4168 -4250 -1514 -5150 -4513 -4007 -4484 -4596
11171d596p19R44J488O99k990m80j171k90m59n43K468p74k518k265L32k512J077
$$ -4596 -5315 -4371 -2883 -2184 -5174 -5654 -6825 -7115 -7574 -8117 -5649 -6423 -8941 -11206 -10874 -13386 -12309
11154a2309J572P99N059J62l975m68K910m883j895J452J19o50L859O017k243l805
$$ -12309 -10737 -9938 -4879 -4717 -8692 -9160 -6250 -11133 -13028 -11576 -11457 -12107 -8248 -2231 -4474 -8279
11138h279J691j557k544O36L25K451k121L83K387J317j34j986J029L876J386r37
$$ -8279 -6588 -8145 -10689 -10053 -9728 -7277 -9398 -9015 -6628 -5311 -5445 -7431 -6402 -2526 -1140 -2077
11122b077j302R8j235j407q15N037K599m77p92R08n125k605M542L082j544l815
$$ -2077 -3379 -3281 -4516 -5923 -6738 -1701 898 421 -371 537 -4588 -7193 -2651 431 -1113 -4928
11106d928l89J521J569M185L026K25l102j732j911p38k116k657J163K965l150
$$ -4928 -5317 -3796 -2227 1958 4984 5209 2107 375 -1536 -2274 -4390 -7047 -5884 -2919 -6069
11091f069N45N292o45o47K74K409N612p72o279k717J401k002q54R07Q01K91k705
$$ -6069 -5524 -232 -877 -1524 -1250 1159 6771 5999 -280 -2997 -1596 -3598 -4452 -3545 -2744 -2453 -5158
11074e158p87j086j191K823J066l47k674j269J671L184J515m076k415Q90N14L514
$$ -5158 -5945 -7031 -8222 -5399 -4333 -4680 -7354 -8623 -6952 -3768 -2253 -6329 -8744 -7854 -7340 -3826
11058c826R40m56l109j956J845L211L158j248m733l549M84o3k840J06J785J344
$$ -3826 -2886 -3342 -6451 -8407 -6562 -3351 -193 -1441 -6174 -9723 -9239 -9302 -12142 -12036 -10251 -8907
11042h907N89J108k09j010J048J435k393J994M425J509m947j340k682j343m88
$$ -8907 -8318 -7210 -7419 -8429 -7381 -5946 -8339 -6345 -1920 -411 -5358 -6698 -9380 -10723 -11211
11027a1211M737K767j57O10n4l02j983J843J843J270q97M06j08o40r05j27M741
$$ -11211 -6474 -3707 -3864 -3254 -3308 -3610 -5593 -3750 -1907 -637 -1534 -1128 -1236 -1876 -2781 -2908 1833
11010A833J609o65l158k712k428J02O1k10j27M05k27l29k08p81N845M554n760
$$ 1833 3442 2777 -381 -3093 -5521 -5419 -5358 -5568 -5695 -5290 -5517 -5846 -6054 -6835 -990 3564 -2196
10993b196m350j436J453n41M88O05j186k64k990k610K644q11p8K197K48J89M886
$$ -2196 -6546 -7982 -6529 -7070 -6582 -5977 -7163 -7427 -10417 -13027 -10383 -11194 -11272 -9075 -8827 -8638 -3752
10976c752K776l793k000k048P36M011L04K599J264j748P50j582j378m732J79n72
$$ -3752 -976 -4769 -6769 -8817 -8081 -4070 -3766 -1167 97 -1651 -901 -2483 -3861 -8593 -8414 -8986
10960h986K490M494j113J230Q40k445p013m541N40L508L163J353j972J051K129
$$ -8986 -6496 -2002 -3115 -1885 -1045 -3490 -10503 -15044 -14504 -10996 -7833 -6480 -8452 -7401 -5272
10945e272j092j809o54K572K03J289J710l884J068L998K303j91q97l898j615j395
$$ -5272 -6364 -8173 -8827 -6255 -6052 -4763 -3053 -6937 -5869 -1871 432 241 -656 -4554 -6169 -7564
10929g564l22j763L880K728k716l091M624M82M351j18J162q43m313J333j712n505
$$ -7564 -7886 -9649 -5769 -3041 -5757 -8848 -4224 -3742 609 491 1653 810 -3503 -2170 -3882 -9387
10913i387L88j202K220L109J37m455j309M924l55j652K955J988j222J537N08o100
$$ -9387 -8999 -10201 -7981 -4872 -4735 -9190 -10499 -5575 -5930 -7582 -4627 -2639 -3861 -2324 -1816 -7916
10897g916q03K010L063n00J850k23n771m086K887M463n34l308j515o33j25J255
$$ -7916 -8719 -6709 -3646 -4146 -2296 -2519 -8290 -12376 -9489 -5026 -5560 -8868 -10383 -11016 -11141 -9886
10881i886k62j416L109M121O58k021J763l235Lk417k892k52L264j726j869L323
$$ -9886 -10148 -11564 -8455 -4334 -3676 -5697 -3934 -7169 -7166 -9583 -12475 -12727 -9463 -11189 -13058 -9735
10865i735Q01o42J773J048n02L032N830j894j624l593j979J97j400j697M23P87
$$ -9735 -8934 -9576 -7803 -6755 -7257 -4225 1605 -289 -1913 -5506 -7485 -7288 -8688 -10385 -9962 -9175
10849i175K577O577K574m574k977n56k81K360M872o30j933r02K306K727m267K282
$$ -9175 -6598 -21 2553 -2021 -4998 -5554 -5835 -3475 1397 767 -1166 -2068 238 2965 -1302 980
10833I80m314n57J658m126K723M556N1K401J17Q5j062j457k63m455j192P28L845
$$ 980 -3334 -3891 -2233 -6359 -3636 920 971 3372 3489 3574 2512 1055 792 -3663 -4855 -4127 -282
10816b82K869j281N81n049m075J40p18l142P45M54L483l7j187K539J625k379n59
$$ -282 2587 1306 1887 -3162 -7237 -7097 -7815 -10957 -10212 -9758 -6275 -6312 -7499 -4960 -3335 -5714 -6273
10799f273J653J711n00k567j060J161k410m983K768L141k080J124J215k51K834
$$ -6273 -4620 -2909 -3409 -5976 -7036 -5875 -8285 -13268 -10500 -7359 -9439 -8315 -7100 -7351 -4517
10784d517J908k242j186K771J778P76K588K25l454n659j972q62j621r15R58N44
$$ -4517 -2609 -4851 -6037 -3266 -1488 -712 1876 2101 -1353 -7012 -8984 -9846 -11467 -12382 -11424 -10880
10768a0880J812J625K946J051j761J111l75j300l051N334k796j615L40j22J209
$$ -10880 -9068 -7443 -4497 -3446 -5207 -4096 -4471 -5771 -8822 -3488 -6284 -7899 -7559 -7681 -6472
10753f472N295M048l010l592K073q46k412J914m048j369l52N71P74K245K373M62
$$ -6472 -1177 2871 -139 -3731 -1658 -2504 -4916 -3002 -7050 -8419 -8771 -8200 -7426 -5181 -2808 -2346
10737b346Q35J123j601k228J889M36J011K243j267J238k254j404R23j464Q30k740
$$ -2346 -1511 -388 -1989 -4217 -2328 -1892 -881 1362 95 1333 -921 -2325 -1402 -2866 -2036 -4776
10721d776n06K694J866P56l99j404k420j241L248L032l272J183J090j017J233
$$ -4776 -5282 -2588 -722 34 -365 -1769 -4189 -5430 -2182 850 -2422 -1239 -149 -1166 67
10706F7O5P81J34k755j001k300k66K005n12J528J619J379J404q17R4k00p097M640
$$ 67 132 913 1047 -1708 -2709 -5009 -5275 -3270 -3782 -2254 -635 744 2148 1331 1425 1225 -5872 -1232
10688a232K002M402L196M93m28j256o53Q86O88K340O54j251k895j237p87J697
$$ -1232 770 5172 8368 8861 8433 7177 6524 7410 8098 10438 11092 9841 6946 5709 4922 6619
10672F619J112J566j034l177l197j981K950L228k233J371L710j051k146K07J658
$$ 6619 7731 9297 8263 5086 1889 -92 2858 6086 3853 5224 8934 7883 5737 5944 7602
10657G602j162l033J162k932k14M464M368k207k945J879m977n452j952J47O759
$$ 7602 6440 3407 4569 1637 1423 5887 10255 8048 5103 6982 2005 -3447 -5399 -5252 1507
10642A507M539j799j270K427P70J920k359n238j128J362M724L195P92p75K008
$$ 1507 6046 4247 2977 5404 6174 8094 5735 497 -631 731 5455 8650 9442 8667 10675
10627A0675K156j764l071K647K173m83j427L959K876m215k187m64J014M32j808
$$ 10675 12831 11067 7996 10643 12816 12333 10906 14865 17741 13526 11339 10875 11889 12321 10513
10612A0513J308O01n50L421J975n897j357J79j896J041o18p58K830j593L96K403
$$ 10513 11821 12422 11872 15293 17268 11371 10014 10193 8297 9338 8720 7962 10792 9199 9595 11998
10596A1998P254o18o812n60L722m14l17n64k007k358j39o89L10J466K936J412
$$ 11998 19252 18634 11822 11262 14984 14570 14253 13689 11682 9324 9185 8496 8806 10272 13208 14620
10580A4620l189L01O284K909l499m223k939N82K867k278k873k502r76K812J796
$$ 14620 11431 11732 18016 20925 17426 13203 10264 10846 13713 11435 8562 6060 5084 7896 9692
10565I692K427l992l586J454N00m90j798L18o28J973O53k632J064L073j791l071
$$ 9692 12119 8127 4541 5995 6495 6005 4207 4525 3897 5870 6523 3891 4955 8028 6237 3166
10549C166M080p00L18J381k886K00J564O88q34k601q96R75K105P53J099p68m405
$$ 3166 7246 6546 6864 8245 5359 5559 7123 7811 6977 4376 3480 4455 6560 7313 8412 7644 3239
10532C239j646J616j742J84k298k29p3K46J264k35L241l539k443l321M209L832
$$ 3239 1593 3209 1467 1651 -647 -876 -949 -703 561 326 3567 28 -2415 -5736 -1527 2305
10516B305J13k86m98j204L574K1p56P04n825l247j480m15K177K736M319J606L0
$$ 2305 2418 2132 1634 430 4004 4025 3269 3973 -1852 -5099 -6579 -6994 -4817 -2081 2238 3844 3874
10499C874j45m078j069K278K55K7j511j240o30J037j561L673K133j574j716L912
$$ 3874 3729 -349 -1418 860 1115 1142 -369 -1609 -2239 -1202 -2763 910 3043 1469 -247 3665
10483C665L243j788m541q29L408R69j799k42J013J510J899j307k530j487N32k10
$$ 3665 6908 5120 579 -250 3158 4127 2328 2086 3099 4609 6508 5201 2671 1184 1716 1506
10467A506m00M030j343k467R90J296p38j753J204j28j657K022O77r54k272L042
$$ 1506 1106 5136 3793 1326 2316 3612 2874 1121 2325 2197 540 2562 3239 2285 13 3055
10451C055L393J71M02M42J359K157n442j047j645l0K56o01k80L772p48k306j50
$$ 3055 6448 6619 7021 7463 8822 10979 5537 4490 2845 2815 3071 2470 2190 5962 5214 2908 2758
10434B758J258J071J352j238L335J193J773p40n91q64k937N28J403m836n635k407
$$ 2758 4016 5087 6439 5201 8536 9729 11502 10762 10171 9307 6370 6898 8301 3465 -2170 -4577
10418d577L658L022J944K674k046R74m16N706M44n600j756l437j796L538J265
$$ -4577 -919 2103 4047 6721 4675 5649 5233 10939 11383 5783 4027 590 -1206 2332 3597
10403C597j144J697l031r49k939J466P314L040p345n34L951K761k876n173j027
$$ 3597 2453 4150 1119 170 -2769 -1303 6011 9051 1706 1172 5123 7884 5008 -165 -1192
10388a192m53O204L457j030k737j930K423j939K59P15J079P564L415n103m283
$$ -1192 -1645 4559 8016 6986 4249 2319 4742 2803 3062 3777 4856 12420 15835 10732 6449
10373F449J904K574N75l706K763J951l84m027m682l04oL484L082m708k930k988
$$ 6449 8353 10927 11502 7796 10559 12510 12126 8099 3417 3113 3107 6591 9673 4965 2035 -953
10357i53n227M854L423k162K729L160L59l419l542k231k348K682M245J752K046
$$ -953 -6180 -1326 2097 -65 2664 5824 6183 2764 -778 -3009 -5357 -2675 1570 3322 5368
10342E368K013m224N38Q20K506O20l722j008K184J339P55L531n102n135l99q85
$$ 5368 7381 3157 3695 4515 7021 7641 3919 2911 5095 6434 7189 10720 5618 483 84 -801
10326h01M601L997l98m081R41J281J423l566n547o87O37j561K988Q9J334K665
$$ -801 3800 7797 7399 3318 4259 5540 6963 3397 -2150 -2837 -2200 -3761 -773 -684 650 3315
10310C315J200q81N1j479j1L863l614K034K336k181J351l85m68n96m032l568L61
$$ 3315 4515 3634 3685 2206 2195 6058 2444 4478 6814 4633 5984 5599 5131 4535 503 -3065 -2704
10293b704M14k33k72L994K462j93k750J868L302j699K712k44J491p50j149J06
$$ -2704 -2290 -2523 -2795 1199 3661 3468 718 2586 5888 4189 6901 6657 8148 7398 6249 6355
10277F355J27k751j420J147J369k302k332j50M728J980l371K200J004P61N06j408
$$ 6355 6482 3731 2311 3458 4827 2525 193 43 4771 6751 3380 5580 6584 7345 7851 6443
10261F443k748J656L382K027R27N518J640k298j988j160M41P230O154J473o84
$$ 6443 3695 5351 8733 10760 11687 17205 18845 16547 14559 13399 13840 21070 27224 28697 28013
10246B8013l377J31q85L817P736L565N602M843M820P010Q271Q201J0304J4886
$$ 28013 24636 24767 23882 27699 35435 39000 44602 49445 54265 61275 69546 77747 88051 102937
10232A02937J9944K6628L5226M4545N3237N9868O8195O7576N6676M1189K9951
$$ 102937 122881 149509 184735 229280 282517 342385 410580 478156 534832 576021 605972
10221F05972J6746l160k2671m2462o0040o3818n5301o2353o0017m8617l8409l3791
$$ 605972 622718 619558 596887 554425 494385 430567 375266 312913 252896 204279 165870 132079
10209A32079k1489j6859j1707q359p064p124j0177k787k456m280q6N80m262n279
$$ 132079 110590 93731 82024 73665 66601 59477 49300 46513 44057 39777 39691 40271 36009 30730
10195C0730k975J153k851k089l89k426r17j44n09k288K97M476k103K224K47J2
$$ 30730 27755 28908 26057 23968 23579 21153 20236 20092 19583 17295 17592 22068 19965 22189 22436 22448
10179B2448l12P15N284J234j117k645K957N742L358J017k680k734Q68k854o776
$$ 22448 22136 22851 28135 29369 28252 25607 28564 34306 37664 38681 36001 33267 34135 31281 24505
10164B4505m544n417n512O46M584L573K559j850o15j069j319j186l191L71K285
$$ 24505 19961 14544 9032 9678 14262 17835 20394 18544 17929 16860 15541 14355 11164 11535 13820
10149A3820O93m53n556j100j371K098K528K009N453K172k21j066j133k958j911
$$ 13820 14513 14060 8504 7404 6033 8131 10659 12668 18121 20293 20072 19006 17873 14915 13004
10134A3004m388K701m6J882N630J95l266k178k421K72K764J699k70j952k234J891
$$ 13004 8616 11317 11271 13153 18783 18978 15712 13534 11113 11385 14149 15848 15578 13626 11392 13283
10118A3283J571M54j702j266l784l326R85j11J933P646K144o374q62N06K125K35
$$ 13283 14854 15308 13606 12340 8556 5230 6215 6104 8037 15683 17827 11453 10591 11097 13222 13457
10102A3457j644J713K692j165k372m024l746K6J961p43J597K038J541m48k095
$$ 13457 11813 13526 16218 15053 12681 8657 4911 4937 6898 6155 7752 9790 11331 10883 8788
10087H788k725n24M561L317L613P65j847j644k568L974J50K591J17j077j863L215
$$ 8788 6063 5539 10100 13417 17030 17795 15948 14304 11736 15710 15860 18451 18568 17491 15628 18843
10071A8843j205j936r15J280K282k4j477K078j079l655j715N218M995j474R6j390
$$ 18843 17638 15702 14787 16067 18349 18325 16848 18926 17847 14192 12477 17695 22690 21216 21312 19922
10055A9922j565m481j498j993K138L01l427n879j87K817N175L464J441j939K766
$$ 19922 18357 13876 12378 10385 12523 12824 9397 3518 3331 6148 11323 14787 16228 14289 17055
10040A7055l51j430l103j570J587L575L305K394K258N30M98L75k778j269p63k192
$$ 17055 16704 15274 12171 10601 12188 15763 19068 21462 23720 24250 24748 25123 22345 21076 20313 18121
10024A8121m74M164kj200K027J56k388J157K515k988M65K281j975J527k173j071
$$ 18121 17647 21811 21809 20609 22636 22792 20404 21561 24076 21088 21553 23834 21859 23386 21213 20142
10008B0142j865j813J059j926K497L75J2k743j288R18P42K689r2L017N112L278
$$ 20142 18277 16464 17523 15597 18094 18469 18481 15738 14450 15368 16110 18799 18707 21724 26836 30114
9992C0114L88k237k241J99p4N217L889O54j4R98j683j737L065m128k700j574M762
$$ 30114 30502 28265 26024 26223 26149 31366 35255 35909 35895 36893 35210 33473 36538 32410 29710 28136 32898
9975C2898P443R939R496R660K4525M7495O5697J7308l7421k7623k4549l3227k6807
$$ 32898 40341 50280 59776 69436 93961 141456 207153 224461 187040 159417 134868 101641 74834
9962G4834j7189o473m326n399o628l462M529M349L210L266L269J46l025M57l051
$$ 74834 57645 51172 46846 41447 34819 31357 35886 40235 43445 46711 49980 50126 47101 47558 44507
9947D4507m221m690l56n11l482L98K738j601J55J620j87j580M420J979L103j891
$$ 44507 40286 35596 35240 34729 31247 31645 34383 32782 32937 34557 34370 32790 37210 39189 42292 40401
9931D0401k656L972r23l675j236R51K676J060o56k778K128m62J829J141rq10K021
$$ 40401 37745 41717 40794 37119 35883 36834 39510 40570 39914 37136 39264 38802 40631 41772 41763 40953 42974
9914D2974j174L19L154k820M384K490J092k020l464J091J602Q78J849Q97K565
$$ 42974 41800 42119 45273 42453 46837 49327 50419 48399 44935 46026 47628 48506 50355 51252 53817
9899E3817N31j09L470L744M886k492k013K594j829J058N413N429j223Q51q74K402
$$ 53817 54348 54239 57709 61453 66339 63847 61834 64428 62599 63657 69070 74499 73276 74127 73253 75655
9883G5655K514l627k420J99r35r64L2J175M347l12k253O069P986L341J465J853
$$ 75655 78169 74542 72122 72321 71386 70422 70454 71629 75976 75664 73411 79480 87466 90807 92272 94125
9867I4125L100k5P57N214K846J477N681R006O690O307L745k68j141J89j833k386
$$ 94125 97225 97200 97957 103171 106017 107494 113175 122181 128871 135178 138923 138655 137514 137703 135870 133484
9851A33484K31M84M198L829M025K848L337K820L259L633P591Q907O016N686N192
$$ 133484 133715 134199 138397 142226 146251 149099 152436 155256 158515 162148 169739 178646 184662 190348 195540
9836A95540N385M451N325M336K934J3768J2391R180K860J641J1074J2789O719
$$ 195540 200925 205376 210701 215037 217971 231739 244130 253310 256170 257811 268885 281674 288393
9823B88393R296R480N016M137M987R135R557P487L857K035L096O205R529Q449
$$ 288393 297689 307169 312185 316322 321309 330444 340001 347488 351345 353380 356476 362681 372210 380659
9809C80659M397J415o84K172L039O757J844q06m00K519l664o049l917j871k452
$$ 380659 385056 386471 385787 387959 390998 397755 399599 398793 398393 400912 397248 391199 387282 385411 382959
9794C82959m001r0J229l923p031l360L144M720O341N048J574j940J273J974L73
$$ 382959 378958 378868 380097 376174 369143 365783 368927 373647 379988 385036 386610 384670 385943 387917 388290
9779C88290Q400J1877J0022J4425J9664L2828M8140O3321R1689J33620K01927
$$ 388290 396690 408567 418589 433014 452678 485506 533646 596967 688656 822276 1024203
9768A024203L31642N85077R77718J224510Q44334l0946o23361p91876q19055p54427
$$ 1024203 1355845 1940922 2918640 4143150 4987484 4956538 4333177 3541301 2722246 1967819
9758A967819n71279l68251k32545j48843j00968o9736m9667l9635l9505l0490
$$ 1967819 1396540 1028289 795744 646901 545933 476197 426530 386895 347390 316900
9748C16900k1103k1327j7826j1299r501m007k909j0585j0103r154j2689j6196
$$ 316900 295797 274470 256644 245345 235844 231837 228928 218343 208240 199086 186397 170201
9736A70201j0208p988k963o600p438p042j119k771l999m086p736l27l658l99o8
$$ 170201 159993 152005 149042 142442 135004 127962 126843 124072 120073 115987 108251 107924 104266 103867 103799
9721A03799l353o019k518n494k47L117N46j330po310o149j553j449P74m096l328
$$ 103799 100446 94427 91909 86415 86168 89285 89831 88501 88494 82184 76035 74482 73033 73807 69711 66383
9705F6383R63p5j811k383l259l022q71o50J224n29J908k805k317m200L128l540
$$ 66383 67346 67271 65460 63077 59818 56796 55925 55275 56499 55970 57878 55073 52756 48556 51684 48144
9689D8144j591l126O99L469k010l47J609q92j361L570J121J688k371m881n9Q94
$$ 48144 46553 43427 44126 47595 45585 45238 46847 45955 44594 48164 49285 50973 48602 43721 43662 44556
9673D4556J442K095k128J647L549j41j140l774k340j084l537l342k402Q40j10
$$ 44556 45998 48093 45965 47612 51161 51020 49880 46106 43766 42682 39145 35803 33401 34241 34131
9658C4131j122J166M73K373N070M023p03k502R28n73k39L12k826k373k270J898
$$ 34131 33009 34175 34648 37021 42091 46114 45411 42909 43837 43264 43025 43337 40511 38138 35868 37766
9642C7766K405k529k594k510l44k783l44L413R49r7M476K944J051J855J347k788
$$ 37766 40171 37642 35048 32538 32194 29411 29067 32480 33429 33332 37808 40752 41803 43658 45005 42217
9626D2217l023K084M522M181M022k592p342j782n10j5k748l189J028K474K187
$$ 42217 39194 41278 45800 49981 54003 51411 44069 42287 41777 41762 39014 35825 36853 39327 41514
9611D1514N482p9n296l766l868m163l496k344N785R722L545k107j664k805j739
$$ 41514 46996 46917 41621 37855 33987 29824 26328 23984 29769 39491 43036 40929 39265 36460 34721
9596C4721k497o81o2q10L025J285Q372M411J52k655q14l449k190k819p22j552
$$ 34721 32224 31543 31481 30671 33696 34981 43353 47764 47916 45261 44447 40998 38808 35989 35267 33715
9580C3715M18K183M67m94j901l692j566L988N923J810J407L653J356K26l944k845
$$ 33715 34133 36316 36783 36289 34388 30696 29130 33118 39041 40851 42258 45911 47267 47493 43549 40704
9564D0704l146K862j067m751Q84L506M243k209k876k369J886J633J405j800k802
$$ 40704 37558 40420 39353 34602 35486 38992 43235 41026 38150 35781 37667 39300 40705 38905 36103
9549C6103Q45L66j589N75J227L846K281L35m345K85K143L639L89l912k954k974
$$ 36103 36948 37314 35725 36300 37527 41373 43654 43989 39644 39929 42072 45711 46100 42188 39234 36260
9533C6260n67J728j569N27J648K136J316k491J075K443k050o213J177N65j142
$$ 36260 35693 37421 35852 36379 38027 40163 41479 38988 40063 42506 40456 34243 35420 35985 34843
9518C4843l91n48K567N491k344l622m86M675J988J03J407j812k191J678N688K060
$$ 34843 34452 33904 36471 41962 39618 35996 35510 40185 42173 42276 43683 41871 39680 41358 47046 49106
9502D9106l504l810J873M760M267K407j033J368K64l153n85M8j976p32j04P70
$$ 49106 45602 41792 43665 48425 52692 55099 54066 55434 55698 52545 51960 52008 50032 49300 49196 49966
9486D9966k327m816K383j861J119K888K218J221j708k204j012L800M361l635l13
$$ 49966 47639 42823 45206 43345 44464 47352 49570 50791 49083 46879 45867 49667 54028 50393 50080
9471E0080o51M060L382j976m326p98m0L922M4M24M161L485M859N793Q78K791P61
$$ 50080 49429 53489 56871 54895 50569 49771 49731 53653 53697 54121 58282 61767 66626 72419 73297 76088 76849
9454G6849k399L85o863k869P1m488k777l653j07n10q87J078o02r90J863j745J692
$$ 76849 74450 74835 67972 65103 65174 60686 57909 54256 54149 53639 52752 53830 53228 52238 54101 52356 54048
9437E4048L676J235j482J712L740R37j570k410Q57J094j422K012K804j63j561
$$ 54048 57724 58959 57477 59189 62929 63866 62296 59886 60743 61837 60415 62427 65231 65068 63507
9422F3507Q48R60P92r12l005q13L095K881M539j640k688m697j214j12J7O62J142
$$ 63507 64355 65315 66107 65195 62190 61377 64472 67353 71892 70252 67564 62867 61653 61541 61558 62220 63362
9405F3362k05L214M590J639K004l072k727l895j69Q90j361j417n60j397j762M2
$$ 63362 63157 66371 70961 72600 74604 71532 68805 64910 64741 65631 64270 62853 62293 60896 59134 59176
9389E9176K741k837K847K014M176L787N55j112n451K03M209O422P86q01j988j095
$$ 59176 61917 59080 61927 63941 68117 71904 72459 71347 65896 66099 70308 76730 77516 76715 74727 73632
9373G3632N33J24m43k01L852J636M956J53K484N08L336N575K388j59k272J833
$$ 73632 74165 74289 73846 73645 77497 79133 84089 84242 86726 87234 90570 96145 98533 98374 96102 97935
9357I7935j84p55P958J0935M233K707j676o206n126j33m927p40l111j883j097
$$ 97935 97751 96996 104954 115889 120122 122829 121153 114947 109821 109688 104761 104021 100910 99027 97930
9342I7930k260K551L954K607J569K598j07K607M689J762N64k39K841J555M302
$$ 97930 95670 98221 102175 104782 106351 108949 108842 111449 116138 117900 118464 118225 121066 122621 126923
9327A26923J693K89L984O480M676K128n83R95j694k74k542m308j645k398k615
$$ 126923 128616 128905 132889 139369 144045 146173 145590 146585 144891 144617 142075 137767 136122 133724 131109
9312A31109j664j866k815l680l669l29l389k836O085M786K275M23j057j813J770
$$ 131109 129445 127579 124764 121084 117415 117086 113697 110861 116946 121732 124007 124430 123373 121560 123330
9297A23330M113K075K728N175Q88m485M753j036K070K248N944O162K031K887M832
$$ 123330 127443 129518 132246 137421 138309 133824 138577 137541 139611 141859 147803 153965 155996 158883 163715
9282A63715N012P480J1136M105P160R090J0097J6512J6589J9511K1853K2323K4837
$$ 163715 168727 176207 187343 191448 198608 207698 217795 234307 250896 270407 292260 314583 339420
9269C39420K6490K9099L5514L8784M3956M3898N0492N9411O4380O7389P6517Q2542
$$ 339420 365910 395009 430523 469307 513263 557161 607653 667064 731444 798833 875350 957892
9257I57892Q8948Q7950R1104R2396Q0878P3298O5288N0543L1855J4226m48k2235
$$ 957892 1046840 1134790 1225894 1318290 1399168 1472466 1537754 1588297 1620152 1634378 1633930 1611695
9245A611695l8982n1155o5862p5526p9080q3614p8275p2932p3728o8705n9904
$$ 1611695 1572713 1521558 1455696 1380170 1301090 1217476 1139201 1066269 992541 923836 863932
9234H63932n3630n7446m9110m0586l7856l4121l1852l0972k3611k3723k0592k2313
$$ 863932 810302 752856 703746 663160 625304 591183 559331 528359 504748 481025 460433 438120
9222D38120k0130j6377j3838j4970j7942j2017o863j0600j0069j3391j3049j4368
$$ 438120 417990 401613 387775 372805 354863 342846 335983 325383 315314 301923 288874 274506
9210B74506j3074p171r972j1049o509n019o047q053n722j534o437k607K343o87
$$ 274506 261432 254261 244289 233240 226731 221712 215665 207612 201890 200356 193919 191312 193655 192968
9196A92968k50Q07o185j482K900k001n73m015k614k884J90k406J659L016q4J038
$$ 192968 192718 193525 187340 185858 188758 186757 186184 182169 179555 176671 176861 174455 176114 179130 179046 180084
9180A80084N161K230J511m95L65n97k343m791m742J443N18n521P01J144o59o541
$$ 180084 185245 187475 188986 188491 188856 188259 185916 181125 176383 177826 178344 172823 173524 174668 174009 167468
9164A67468m798q17o721p701k342l455k847k526J725M056O153R199J2905J6358
$$ 167468 162670 161853 155132 147431 145089 141634 138787 136261 137986 142042 148195 157394 170299 186657
9150A86657P392L129O990Q947M352K293J393n20P96j186j831J241J70j971K991
$$ 186657 194049 197178 204168 213115 217467 219760 221153 220633 221429 220243 218412 219653 219823 217852 220843
9135B20843J55J487P667O158P039L570L09N146O779L082J732m24N44Q403R043
$$ 220843 220998 222485 230152 236310 243349 246919 247228 252374 259153 262235 263967 263543 264087 272490 281533
9120B81533O685M989Q034N457O549Q694J4167J6604J0238J1171J1586J6481J4671
$$ 281533 288218 293207 301241 306698 313247 321941 336108 352712 362950 374121 385707 402188 416859
9107D16859J3389J1525J1627J1228O249O046L051J756n086o107j0099r386j2501
$$ 416859 430248 441773 453400 464628 470877 476923 479974 481730 476644 470537 460438 451052 438551
9094D38551j2416j6707j5097r481n421q460n004l994n279k060j732l549j888j417
$$ 438551 426135 409428 394331 384850 379429 370969 365965 361971 356692 354632 352900 349351 347463 346046
9080C46046j662j379l59k207k802L082K330K747O088L105L70P488R299N350M758
$$ 346046 344384 343005 342646 340439 337637 340719 343049 345796 351884 354989 355359 362847 372146 377496 382254
9065C82254L751N361Q865R544J1249J2012J5813J2700Q260J2172J6283K1177K5961
$$ 382254 386005 391366 400231 409775 421024 433036 448849 461549 469809 481981 498264 519441 545402
9052E45402L2843L1987L7790M2695M9841N7705O3371P1732P7749P5923P4327O1553
$$ 545402 578245 610232 648022 690717 740558 798263 861634 933366 1011115 1087038 1161365 1222918
9040A222918M7837M3356K7539J1095K186p585j6428j9804k5972l1881k6950j8377
$$ 1222918 1270755 1314111 1341650 1352745 1354931 1347346 1330918 1311114 1285142 1253261 1226311 1207934
9028A207934k2452j8727j8184j4341j5299j1300j2820o852m614m671j620K33R25
$$ 1207934 1185482 1166755 1148571 1134230 1118931 1107631 1094811 1087959 1083345 1078674 1077054 1077287 1078212
9015A078212K830N448J675K275J460M368R486R795Q256J422N308N857L973O638
$$ 1078212 1081042 1086490 1088165 1090440 1091900 1096268 1105754 1115549 1123805 1125227 1130535 1136392 1140365 1147003
9001A147003J1958J0394R666J2868J4727J5642J8384K1200J9955K5547K7941L0162
$$ 1147003 1158961 1169355 1179021 1191889 1206616 1222258 1240642 1261842 1281797 1307344 1335285 1365447
8989A365447L1087L4108L8412M4589M9749O1350O1743O7367P1156P0039P1458
$$ 1365447 1396534 1430642 1469054 1513643 1563392 1624742 1686485 1753852 1825008 1895047 1966505
8978A966505O8831N5734M7147M1359K7212K2423J9505J7847J5430P608K07j893
$$ 1966505 2035336 2091070 2138217 2179576 2206788 2229211 2248716 2266563 2281993 2289601 2289808 2287915
8966B287915j683j59M178J1776J5159J9284K0890K5787L1030L8899M5498M5204
$$ 2287915 2286232 2286073 2290251 2302027 2317186 2336470 2357360 2383147 2414177 2453076 2498574 2543778
8954B543778N0698N8014O3546P0297P3720P8958Q3349R0854R9208J12754J16668
$$ 2543778 2594476 2652490 2716036 2786333 2860053 2939011 3022360 3113214 3212422 3325176 3441844
8943C441844J14774J14963J20670J27977J35907J50036J81595K13474K52820K62352
$$ 3441844 3556618 3671581 3792251 3920228 4056135 4206171 4387766 4601240 4854060 5116412
8933E116412K06464J46024J35752J35211J42581J64877K01042K36117K70295L09703
$$ 5116412 5322876 5468900 5604652 5739863 5882444 6047321 6248363 6484480 6754775 7064478
8923G064478L42607L76159M07857M14319L52227K43610J62558J25656J08133R8900
$$ 7064478 7407085 7783244 8191101 8605420 8957647 9201257 9363815 9489471 9597604 9696504
8913I696504R9273J01600J03740J02441J00952J08250J27077J43822J54571J78933
$$ 9696504 9795777 9897377 10001117 10103558 10204510 10312760 10439837 10583659 10738230 10917163
8903A0917163K10207K33808K66894K92787L19203L39206L56019L77877M09722
$$ 10917163 11127370 11361178 11628072 11920859 12240062 12579268 12935287 13313164 13722886
8894A3722886M46445M89267N40527N99212O58241P17999P90836Q74470R60508
$$ 13722886 14169331 14658598 15199125 15798337 16456578 17174577 17965413 18839883 19800391
8885A9800391J054441J161747J283349J424560J584993J759495J956016K186673
$$ 19800391 20854832 22016579 23299928 24724488 26309481 28068976 30024992 32211665
8877C2211665K446230K755116L116970L467560L712306L960139M387664M940951
$$ 32211665 34657895 37413011 40529981 43997541 47709847 51669986 56057650 60998601
8869F0998601N597053O404784P241775P856759Q519816R555453J0749886J2064803
$$ 60998601 66595654 73000438 80242213 88098972 96618788 106174241 116924127 128988930
8861A28988930J3566269J5175784J6779314J8244901J9381542J9956180J9676714
$$ 128988930 142555199 157730983 174510297 192755198 212136740 232092920 251769634
8854B51769634J8262677J5565461J1643973O795933J511979l668855q313374j2110686
$$ 251769634 270032311 285597772 297241745 304037678 305549657 301880802 293567428 281456742
8846B81456742j4891880j6620154j7445633j7528234j6987813j6001632j4781568
$$ 281456742 266564862 249944708 232499075 214970841 197983028 181981396 167199828
8839A67199828j3482329j2202892j1011571r937823q980400q130469p367957o681403
$$ 167199828 153717499 141514607 130503036 120565213 111584813 103454344 96086387 89404984
8831H9404984o058142n495156m995819m545621m129052l744772l387282l044426
$$ 89404984 83346842 77851686 72855867 68310246 64181194 60436422 57049140 54004714
8823E4004714k699411k320163j846470j165216l02049j37979j629798k565135
$$ 54004714 51305303 48985140 47138670 45973454 45671405 45533426 43903628 41338493
8815D1338493k480619k542461k539253k199473j825952j557005j375288j233797
$$ 41338493 38857874 36315413 33776160 31576687 29750735 28193730 26818442 25584645
8807B5584645j124768j037193r58361q93761q47090p95659p53898p11350o69772
$$ 25584645 24459877 23422684 22464323 21570562 20723472 19927813 19173915 18462565 17792793
8798A7792793o30642o00402n66145n31757n07624m84301m64235m49559m29563
$$ 17792793 17162151 16561749 15995604 15463847 14956223 14471922 14007687 13558128 13128565
8789A3128565m11010l96229l80829l65949l54385l40850l26714l11376k99450
$$ 13128565 12717555 12321326 11940497 11574548 11220163 10879313 10552599 10241223 9941773
8780I941773k84473k68425k60198k49571k53388k49600k37072k34252k29908k24643
$$ 9941773 9657300 9388875 9128677 8879106 8625718 8376118 8139046 7904794 7674886 7450243
8770G450243k12339j99799j95180j88274j81728j72439j69506j57407j55450j49038
$$ 7450243 7237904 7038105 6842925 6654651 6472923 6300484 6130978 5973571 5818121 5669083
8760E669083j43889j35354j34329j30971j27047j23739j18425j14148j12669j12647
$$ 5669083 5525194 5389840 5255511 5124540 4997493 4873754 4755329 4641181 4528512 4415865
8750D415865j03853r9428j00536j02952j00968r9004r4128r6147r3697q9986q8026
$$ 4415865 4312012 4212584 4112048 4009096 3908128 3809124 3714996 3618849 3525152 3435166 3347140
8739C347140q6299q7200q6687q8656q6521q7302q5138q3910q4510q2856q0663
$$ 3347140 3260841 3173641 3086954 2998298 2911777 2824475 2739337 2655427 2570917 2488061 2407398
8728B407398p6827o9032o6796o1528n2735n1075m9794l8675l2938l3171l5801
$$ 2407398 2330571 2261539 2194743 2133215 2080480 2029405 1979611 1940936 1907998 1874827 1839026
8717A839026l2662l0703k6323k8704l3616l1074k7319l0113l7167l4195l3896
$$ 1839026 1806364 1775661 1749338 1720634 1687018 1655944 1628625 1598512 1561345 1527150 1493254
8706A493254l0416k7357l3488l0818l0786k8877l1050l1491l0774k6011k7306
$$ 1493254 1462838 1435481 1401993 1371175 1340389 1311512 1280462 1248971 1218197 1192186 1164880
8695A164880l2557l3513l4666l7267l1228l5695l3713k8070k4934k5757k5920
$$ 1164880 1132323 1098810 1064144 1026877 995649 959954 926241 898171 873237 847480 821560
8684H21560k0458k6949l0905l2090k9002l2488l5270l4269l6110l9859m3716m6257
$$ 821560 801102 774153 743248 711158 682156 649668 614398 580129 544019 504160 460444 414187
8672D14187m5098m2286l9029m7092m7211m2921l9743l1021k1608j3793k059J3902
$$ 414187 369089 326803 287774 240682 193471 150550 110807 79786 58178 44385 42326 56228
8660E6228K6296L7030M2062N0561N3358N0483M8249M0803L8661L2277K8191J8852
$$ 56228 82524 119554 161616 212177 265535 316018 364267 405070 443731 476008 504199 523051
8648E23051J4973J5930Q653O772N904M636M448L980P21k756N43k349j092L237
$$ 523051 538024 553954 562607 569379 575283 579919 584367 588347 589068 586312 586855 584506 583414 586651
8634E86651K142O93j731j084j360j582l024k101J532j883p26K166m59m556j476
$$ 586651 588793 589486 587755 586671 585311 583729 580705 578604 580136 578253 577527 579693 579234 574678 573202
8619E73202k451n317o542q771n045r13m472o013n180l484n334q811m745k738m47
$$ 573202 570751 565434 558892 550121 545076 544163 539691 533678 528498 525014 519680 510869 506124 503386 502939
8604E02939k571m244m297m25k017k622k242o047l556j795m153j528K625m94K509
$$ 502939 500368 496124 491827 491402 489385 486763 484521 478474 474918 473123 468970 467442 470067 469573 472082
8589D72082L647K830K104J836L548N057M587K720O409K601L733Q989J2649J6745
$$ 472082 475729 478559 480663 482499 486047 491104 495691 498411 504820 507421 511154 520143 532792 549537
8575E49537K4114L4486N3184Q9814J53554K60319L62446K22786r0306j83129j86327
$$ 549537 573651 608137 661321 751135 904689 1165008 1527454 1750240 1659934 1476805 1290478
8564A290478k12655j95987j34817q5415m7255k6046j6515l709K545M147P565P044
$$ 1290478 1077823 881836 747019 661604 614349 588303 571788 568079 570624 574771 582336 589380
8552E89380P56N951J6823K6175M0060O3001J02890J47516J02421k2901l0312k0772
$$ 589380 590136 596087 612910 639085 679145 742146 845036 992552 1094973 1072072 1041760 1020988
8540A020988k6549j1093K0002M5325O4340P4403P8283N5918J7373j6737k4648
$$ 1020988 994439 983346 1003348 1048673 1113013 1187416 1265699 1321617 1338990 1322253 1297605
8529A297605j7010N538O3564J77138L89664O54764N22410j39494l82382l54441
$$ 1297605 1280595 1286133 1349697 1526835 1916499 2571263 3093673 2954179 2571797 2217356
8519B217356m24848m13023k89557j82599j15998p4484m9191k9918j9681j1357
$$ 2217356 1792508 1379485 1089928 907329 791331 716847 667656 637738 618057 606700
8509F06700r667j4615k0239k6532k7447j9619j7336j3048p564n181m937m202m125
$$ 606700 597033 582418 562179 535647 508200 488581 471245 458197 450633 445452 440515 436313 432188
8496D32188j413k381l089n949m929L044O406Q393K927O491J6288K1350K9786M3244
$$ 432188 430775 428394 425305 419356 414427 417471 423877 432270 435197 441688 457976 479326 509112 552356
8482E52356O2340J08318J91267L06941L14538L9630j58146j61051j82290j88271
$$ 552356 614696 723014 914281 1221222 1535760 1575390 1417244 1256193 1073903 885632
8472H85632j38127p8088l7024j4170K182Q675K0156L3304M1814M5299M9012N1667
$$ 885632 747505 669417 632393 618223 620405 629080 649236 682540 724354 769653 818665 870332
8460H70332O5424O9571O4522N8562O1746O6623P4713P0665P6380P2568O7637N7401
$$ 870332 935756 1005327 1069849 1128411 1190157 1256780 1331493 1402158 1478538 1551106 1618743 1676144
8448A676144M4271K5262L778r884k4656m5715n8993o6333p4484q0234p9430p8156
$$ 1676144 1720415 1745677 1749455 1739571 1714915 1669200 1610207 1543874 1469390 1389156 1309726 1231570
8436A231570p6121o8879n9392n6782n4417n5588n8504n0161m7005m5542l6097
$$ 1231570 1155449 1086570 1027178 970396 915979 860391 801887 751726 704721 659179 623082
8425F23082k9783k5718k6657k1049k3046j9888j7030j4544j4497j3354n958n658
$$ 623082 593299 567581 540924 519875 496829 476941 459911 445367 430870 417516 411558 405900
8413D05900j1294j4149j0307j1953j3443j2398j0045q962j2454j2384n133q717
$$ 405900 394606 380457 370150 358197 344754 332356 322311 313349 300895 288511 283378 274661
8401B74661n612n082n668r360r401l299n002m347j511m819j0406p311r874r824
$$ 274661 269049 263967 258299 248939 239538 236239 231237 226890 225379 220560 210154 202843 192969 183145
8387A83145n097n215l407m069n858o466p195r083m294k944k412J514k57K713m565
$$ 183145 178048 172833 169426 165357 159499 153033 145838 136755 132461 129517 127105 128619 128362 131075 126510
8372A26510k132Q30r0k218j010L261j772j624j988k543J866J601J392J536m76
$$ 126510 124378 125208 125118 122900 121890 125151 123379 121755 119767 117224 119090 120691 122083 123619 123143
8357A23143m384l684k590l309m010l878K855L80j480P06j24l903k841j244M081
$$ 123143 118759 115075 112485 109176 105166 101288 104143 104523 103043 103749 103625 99722 96881 95637 99718
8342I9718M593J509K887N305Q084N730m036k165r32k299j454n061m783l726j767
$$ 99718 104311 105820 108707 114012 122096 127826 123790 121625 120693 118394 116940 111879 107096 103370 101603
8327A01603r44l666j698M489M38o464k696K155j857j367J108L246m76R05k354
$$ 101603 100659 96993 95295 99784 100222 93758 91062 93217 91360 89993 91101 94347 93871 94776 92422
8312I2422p79k203n037L23J990p206l43j103l57M088k935n994j569J829J580m76
$$ 92422 91643 89440 84403 84726 86716 79510 79167 78064 77707 81795 78860 72866 71297 73126 74706 74230
8296G4230n95J826L931j197N55L716j075n819k035K177L239J028n595R50J827
$$ 74230 73635 75461 79392 78195 78750 82466 81391 75572 73537 75714 78953 79981 74386 75336 77163
8281G7163j085k259J676K840r92m148m364K63K896J128l4l92j359J148J075N52
$$ 77163 76078 73819 75495 78335 77343 73195 68831 69094 71990 73118 73084 72692 71333 72481 73556 74108
8265G4108N83j830K125j090l679O32l3J46m308l888k046l311Q15N058k138J36
$$ 74108 74691 72861 74986 73896 70217 70849 70816 70962 66654 62766 60720 57409 58224 63282 61144 61280
8249F1280j133J370j511m309J208J89J934K790L259k778k26J297j849l500J54
$$ 61280 60147 61517 60006 55697 56905 57094 59028 61818 65077 62299 62073 63370 61521 58021 58175
8234E8175M355N9m486k466j736j97K295J524Q01K330j696J483M244l664O03K589
$$ 58175 62530 62589 58103 55637 53901 53704 55999 57523 58324 60654 58958 60441 64685 61021 61624 64213
8218F4213o41n436k103j25M70L7L17l59j810k310M107k399k280n442m210K957
$$ 64213 63572 58136 56033 55908 56378 56415 56732 56373 54563 52253 56360 53961 51681 46239 42029 44986
8202D4986M623L135j652k148j73k471o99L253j12j30N164n917n077R53L277L068
$$ 44986 49609 52744 51092 48944 48771 46300 45601 48854 48742 48612 53776 47859 42782 43735 47012 50080
8186E0080j67k53l090j736J805k049j865L67J767J954K74l248q93J472N006J918
$$ 50080 49913 49660 46570 44834 46639 44590 42725 43092 44859 46813 47087 43839 42946 44418 49424 51342
8170E1342m17R79R87J605R23L102k551m083k377p24n28n83k813j888j185J385
$$ 51342 50925 51904 52891 54496 55419 58521 55970 51887 49510 48786 48258 47675 44862 42974 41789 43174
8154D3174K026m382l214N14L031L442J200K155o27j904j948j708l486Q48K60j481
$$ 43174 45200 40818 37604 38118 41149 44591 45791 47946 47319 45415 43467 41759 38273 39121 39381 37900
8138C7900J837K973m096k337j790j555P61M208J873o54k560j193r75K24J812L724
$$ 37900 39737 42710 38614 36277 34487 32932 33693 37901 39774 39120 36560 35367 34392 34616 36428 40152
8122D0152q7k901J415O023J330j854o764j270L015p29J177J965K415j88l283l355
$$ 40152 40065 37164 38579 44602 45932 44078 37314 36044 39059 38330 39507 41472 43887 43699 40416 37061
8106C7061j600K319J730l060M65K545l023p0L420M00J288J854j165l124l473R71
$$ 37061 35461 37780 39510 36450 36915 39460 36437 36367 39787 40187 41475 43329 42164 39040 35567 36538
8090C6538q59m294j405p42r80O615J093p18J344k138l013J353j374L588K266j572
$$ 36538 35679 31385 29980 29238 28258 34873 35966 35248 36592 34454 31441 32794 31420 35008 37274 35702
8074C5702K115j88n325K727l14k616j596K168J325J726P9J948K390j890m443P72
$$ 35702 37817 37629 32304 35031 34717 32101 30505 32673 33998 35724 35803 37751 40141 38251 33808 34580
8058C4580O76O11k473q57L240O23j701K363O16M73L982J121j117l220M05m972
$$ 34580 35256 35867 33394 32537 35777 36400 34699 37062 37678 38151 42133 43254 42137 38917 39322 34350
8042C4350o56L894l83p30j480J925K305j876P84K939j795j646l99q70m41K419
$$ 34350 33694 37588 37205 36475 34995 36920 39225 37349 38133 41072 39277 37631 37232 36362 35921 38340
8026C8340M2l98q36J711k306l060J56K546N032J110j388K86q4j520K257m07l940
$$ 38340 38382 37984 37148 38859 36553 33493 33649 36195 41227 42337 40949 41235 41151 39631 41888 41481 37541
8009C7541k664K6L221P32J224L704l484M08L37N79J005k696j279j549J812L156
$$ 37541 34877 34903 38124 38856 40080 43784 40300 40708 41045 41624 42629 39933 38654 37105 38917 42073
7993D2073K098K040M787J954J373l989n7k92l34K289l36P48j504K341K569K405
$$ 42073 44171 46211 50998 52952 54325 50336 50279 49987 49653 51942 51606 52354 50850 53191 55760 58165
7977E8165j07L856J307p39J372j646m276j588j091R53j233J213K954J357n125
$$ 58165 58058 61914 63221 62482 63854 62208 57932 56344 55253 56206 54973 56186 59140 60497 55372
7962E5372J750N251k71O3M394j69J01J261k682k546k734L835k258m16M198L714
$$ 55372 57122 62373 62102 62165 66559 66390 66491 67752 65070 62524 59790 63625 61367 60951 65149 68863
7946F8863R82L35j267p90m99M046M716Q238N032L797M277O087P765M267k434j820
$$ 68863 69845 70180 68913 68123 67624 71670 76386 84624 89656 93453 97730 103817 111582 115849 113415 111595
7930A11595o646q300o096r264p303l029o06k930K755l95l553m399j365J418O68
$$ 111595 104949 96649 90553 81289 73986 70957 70351 67421 70176 69781 66228 61829 60464 61882 62550
7915F2550K269j028J228j858n58J012J631K189j468O27n05j72Q36M555j599p319
$$ 62550 64819 63791 65019 63161 62603 63615 65246 67435 65967 66594 66089 65917 66753 71308 69709 62390
7899F2390k41N816L491J445O48O1J745N823K348p81K626q67n414m109m117m875
$$ 62390 62149 67965 71456 72901 73549 73610 75355 81178 83526 82745 85371 84504 79090 74981 70864 65989
7883F5989J69m31m483m271m675j943n793k599o97k72k223K827J603o48n46Q04
$$ 65989 66158 65727 61244 56973 52298 50355 44562 41963 41266 40994 38771 41598 43201 42553 42007 42811
7867D2811K730R60j300l694K770L778k668l437k552Q53J765j817K664l037j487
$$ 42811 45541 46501 45201 41507 44277 48055 45387 41950 39398 40251 42016 40199 42863 39826 38339
7852C8339K850K372O27j167l822k298P48J100J277M11j204k108k776l066K753
$$ 38339 41189 43561 44188 43021 39199 36901 37649 38749 40026 40437 39233 37125 34349 31283 34036
7837C4036l365n200M04J170J194N813j029Q63k067j497k078l144j89M02N28p60
$$ 34036 30671 25471 25875 27045 28239 34052 33023 33886 31819 30322 28244 25100 24911 25313 25841 25081
7821B5081j70J855j898j231M144K025K229j704n461r62k451l021L913K285k792
$$ 25081 24911 26766 24868 23637 27781 29806 32035 30331 24870 23908 21457 18436 22349 24634 21842
7806B1842l507K072J288K518k23j855m036l622N18L236J48j513n576K232J214
$$ 21842 18335 20407 21695 24213 23990 22135 18099 14477 14995 18231 18379 16866 11290 13522 14736
7791A4736J205K92n02P7k421q67k710n179J636J098N986K514l757k33o73J776
$$ 14736 15941 16233 15731 15808 13387 12520 9810 4631 6267 7365 13351 15865 12108 11875 11202 12978
7775A2978L607k421m17j140K543n88k786J699K792l862J382P60L270k912k766
$$ 12978 16585 14164 13747 12607 15150 14562 11776 13475 16267 12405 13787 14547 17817 14905 12139
7760A2139R4j724j752k046J14K091L0n88K191K768k992k082K549K664j212J365
$$ 12139 12233 10509 8757 6711 6825 8916 8946 8358 10549 13317 10325 8243 10792 13456 12244 13609
7744A3609J559q98L0j96j496k047L672J520p33N68k466m749k711J73J442l130
$$ 13609 15168 14270 14300 14104 12608 10561 14233 15753 15020 15588 13122 8373 5662 5835 7277 4147
7728D147K001K629J294r34j423M35K641k46L494j204k945n02L588j392M02J150
$$ 4147 6148 8777 10071 9137 7714 8149 10790 10544 14038 12834 9889 9387 12975 11583 11985 13135
7712A3135m775o35L389J162J604L717o01J11l216m313J189M24M561K009j0k625
$$ 13135 8360 7725 11114 12276 13880 17597 16996 17107 13891 9578 10767 11191 15752 17761 17751 15126
7696A5126J650P04J222l748l962J444m8J858o00m537j163j106K694l95j211j933
$$ 15126 16776 17480 18702 14954 10992 12436 12388 14246 13646 9109 7946 6840 9534 9139 7928 5995
7680E995k209M819N495J583Q41l549l235K63M97L659j960l533j063K244J0r77
$$ 5995 3786 8605 14100 15683 16524 12975 9740 10003 10500 14159 12199 8666 7603 9847 9857 8880
7664H880L32J60k430O72L760O416j75k012m228n690j089L427J657j907k109j714
$$ 8880 9212 9372 6942 7614 11374 17790 17615 15603 11375 5685 4596 8023 9680 7773 5664 3950
7648C950k26J141j708o41L569J258P99l46J050L02M124J553l390k582l50j18L249
$$ 3950 3724 4865 3157 2516 6085 7343 8142 7796 8846 9148 13272 14825 11435 8853 8503 8385 11634
7631A1634o44j93k871l271j666K3J284J139L672j165j352J19r68J49k135K191
$$ 11634 10990 10797 7926 4655 2989 3012 4296 5435 9107 7942 6590 6709 5741 5890 3755 5946
7615E946J338J858J585k598n382l34L943L178K886j9j351q4Q27K121k603j348
$$ 5946 7284 9142 10727 8129 2747 2413 6356 9534 12420 12401 11050 10966 11793 13914 11311 9963
7599I963k714k689l156j780J522J388L46L360j832q09J169P67j877K494j167Q46
$$ 9963 7249 4560 1404 -376 1146 2534 2880 6240 4408 3599 4768 5535 3658 6152 4985 5831
7583E831O23J186N03m754k953k534n90J068R91K316K10n320J259K891K787j048
$$ 5831 6454 7640 8143 3389 436 -2098 -2688 -1620 -629 1687 1897 -3423 -2164 727 3514 2466
7567B466J923K411O60P55L015Q13n283n18r47j853Q88Q84K85M246l197m454K672
$$ 2466 4389 6800 7460 8215 11230 12043 6760 6242 5295 3442 4330 5214 5499 9745 6548 2094 4766
7550D766j00J814J368k783L84J275j124k175K192J745n14j163J637l83J486J529
$$ 4766 4666 6480 7848 5065 5449 6724 5600 3425 5617 7362 6848 5685 7322 6939 8425 9954
7534I954r42j88L469r81J466q24r6j015l479k600m267N76K157m98q52K62J141
$$ 9954 9012 8824 12293 11312 12778 11954 11858 10843 7364 4764 497 1073 3230 2732 1880 2142 3283
7517C283L93L83K447J586l242L9J747k06k040j477Q80J365N63J94q694j368L215
$$ 3283 3676 4059 6506 8092 4850 4889 6636 6430 4390 2913 3793 5158 5721 5915 -2779 -4147 -932
7500i32J920J569J921J359l190l915J393N195L82Q56P68O28k431k224K066K975
$$ -932 988 2557 4478 5837 2647 -1268 125 5320 5702 6558 7326 7954 5523 3299 5365 8340
7484H340K81r9M856j661l786o48N82j84R47K58l499J584m90l255Q66J305n792
$$ 8340 8621 8522 13378 11717 7931 7283 7865 7681 8628 8886 5387 6971 6481 3226 4092 5397 -395
7467c95L27N838K294L93R35j236k098j968J097j140L035K211j292j250K264k1
$$ -395 -68 5770 8064 8457 9392 8156 6058 4090 5187 4047 7082 9293 8001 6751 9015 8994
7451H994j283k187J50j291j71m42J182K900q26J291j87q95k727k323k64M417K957
$$ 8994 7711 5524 5674 4383 4212 3770 4952 7852 7026 8317 8130 7235 4508 2185 1921 6338 9295
7434I295J5m18p15l295l287k298p82J140K01R98j603M95L656K391n63j377k741
$$ 9295 9310 8892 8177 4882 1595 -703 -1485 -345 -144 854 -749 -254 3402 5793 5230 3853 1112
7417A112r39J381M248J48k795J002k561J467m459j352J821J444L029J89k060J48
$$ 1112 173 1554 5802 5950 3155 4157 1596 3063 -1396 -2748 -927 517 3546 3735 1675 1823
7401A823l45k564J290M73l339K553k60k285J117J099K868M215J020k867k924j835
$$ 1823 1478 -1086 204 677 -2662 -109 -369 -2654 -1537 -438 2430 6645 7665 4798 1874 39
7385C9K368k143j664M505l58K307J583j269l09o85l330P40K357K664k255J610
$$ 39 2407 264 -1400 3105 2747 5054 6637 5368 5059 4374 1044 1784 4141 6805 4550 6160
7369F160K199m22j92j403p209M66J559J176K370r61J347k09R52n40m529k344M636
$$ 6160 8359 7937 7745 6342 -867 -401 1158 2334 4704 3743 5090 4881 5833 5293 764 -1580 3056
7352C056P96K228j443m931j868k13J482n06K545J22J539L855m91k19r35j51k456
$$ 3056 3852 6080 4637 -294 -2162 -2375 -893 -1399 1146 1268 2807 6662 6171 5952 5017 4866 2410
7335B410k872L117M157K582k091j487q38K615m59l854j746K14k492k536o24P55
$$ 2410 -462 2655 6812 9394 7303 5816 4978 7593 7134 3280 1534 1748 -744 -3280 -3904 -3149
7319c149K394O129K251l821k369p90L382o30k625p87J780L31M20O38q93l391l062
$$ -3149 -755 5374 7625 3804 1435 645 4027 3397 772 -15 1765 2096 2516 3154 2261 -1130 -4192
7302d192J691j105O49J632J415N20K218M402l914j87k166K675J097K37J287k48
$$ -4192 -2501 -3606 -2957 -1325 90 610 2828 7230 3316 3129 963 3638 4735 4972 6259 6011
7286F011J007k697R01R29l8p86J080m662r933k205K216M246L116J542n03K639
$$ 6011 7018 4321 5222 6151 6113 5327 6407 1745 -8188 -10393 -8177 -3931 -815 727 224 2863
7270B863j359K37J085J314k629l396N27p86j375j97j925n81k370L053N250K886
$$ 2863 1504 1741 2826 4140 1511 -1885 -1358 -2144 -3519 -3716 -5641 -6222 -8592 -5539 -289 2597
7254B597J573K562L118l899k868m928j430J812O0J657J166J602J16j918j029j492
$$ 2597 4170 6732 9850 5951 3083 -1845 -3275 -1463 -1403 254 1420 3022 3138 1220 191 -1301
7238a301j081k606n6N071L624j165M33k101l346J496K653M47m103L68j199P75
$$ -1301 -2382 -4988 -5044 27 3651 2486 2919 818 -2528 -1032 1621 2068 -2035 -1667 -2866 -2091
7222b091M827K870m544j767k427J554l87K650k62M93l27p25J994K644j481j074
$$ -2091 2736 5606 1062 -705 -3132 -1578 -1965 685 423 916 589 -136 1858 4502 3021 1947
7206A947J404K391K402k614l208o31j075j429l6j000k96R80J488K50N848J278
$$ 1947 3351 5742 8144 5530 2322 1691 616 -813 -849 -1849 -2145 -1165 323 573 6421 7699
7190G699m739K332K643N51l725k414j517P48J148k006q3J025N93p93j571o47L883
$$ 7699 2960 5292 7935 8486 4761 2347 830 1578 2726 720 637 1662 2255 1462 -109 -756 3127
7173C127J523K450j902m089O69K279K931J110k202m07j432k757j69J300K850K244
$$ 3127 4650 7100 5198 1109 1778 4057 6988 8098 5896 5489 4057 1300 1131 2431 5281 7525
7157G525k416j757R67J62k63j613K010q45k601J317p38l229J328L094K364L14
$$ 7525 5109 3352 4319 4481 4218 2605 4615 3770 1169 2486 1748 -1481 -153 2941 5305 5619
7141E619k564K777J620k88J586l865l212k39m05J435L48m396K680K715k137j483
$$ 5619 3055 5832 7452 7164 8750 4885 1673 1434 1029 2464 2812 -1584 1096 3811 1674 191
7125A91M358L053k135j798J120l467j544j754J673K754R41l121m118j211M352
$$ 191 4549 7602 5467 3669 4789 1322 -222 -1976 -303 2451 3392 271 -3847 -5058 -706
7110g06K519L97j896l076J99L16J891k486m067k630j829L007N131K783M91L615
$$ -706 1813 2210 314 -2762 -2563 -2247 -356 -2842 -6909 -9539 -11368 -8361 -3230 -447 44 3659
7094C659q35m80J522j487k610q25j03r30M98K834J260l724k356j47L189L367l25
$$ 3659 2824 2344 3866 2379 -231 -1056 -1159 -2089 -1591 1243 2503 -1221 -3577 -3724 -535 2832 2507
7077B507K355j502m750N73Q64J881M189K35l891k690J503K864L274O63o015m427
$$ 2507 4862 3360 -1390 -817 47 1928 6117 6352 2461 -229 1274 4138 7412 8075 2060 -2367
7061b367L592M329J93J078j94j435j033j585l167K101M19n088J253Q071j416j093
$$ -2367 1225 5554 5747 6825 6631 5196 4163 2578 -589 1512 1931 -3157 -1904 6167 4751 3658
7045C658k260l055L69J651k271m418M890J290J846L930J595j438K747J826Q4l538
$$ 3658 1398 -1657 -1288 363 -1908 -6326 -1436 -146 1700 5630 7225 5787 8534 10360 10444 6906
7029F906l733O31j059p10k456J681r87j690P92k226K064j85J688M95m31N48k55
$$ 6906 3173 3804 2745 2035 -421 1260 273 -1417 -625 -2851 -787 -972 716 1211 780 1328 1073
7012A073j717k01L511Rk593o24k083L61M324j69J698P95k664j083o380J011J153
$$ 1073 -644 -845 2666 2675 82 -542 -2625 -2264 2060 1891 3589 4384 1720 637 -5743 -4732 -3579
6995c579L28N466J813J067m94m190K581J178n236m236l644R36K327j872p780J356
$$ -3579 -3251 2215 4028 5095 4601 411 2992 4170 -1066 -5302 -8946 -8010 -5683 -7555 -15335 -13979
6979a3979M590l3L306K204j416M44K912M92R41Q90j086q35j81M033n43j439k801
$$ -13979 -9389 -9422 -6116 -3912 -5328 -4884 -1972 -1480 -539 351 -735 -1570 -1751 2282 1739 300 -2501
6962b501k687J761M826O569J110j346r30l67J55j540m938j076K687L027j661J777
$$ -2501 -5188 -3427 1399 7968 9078 7732 6802 6435 6590 5050 112 -964 1723 4750 3089 4866
6946D866R80l144p45p27q04P70K013K64m04J59j010N22J45N2J685K398K009O06
$$ 4866 5846 2702 1957 1230 426 1196 3209 3473 3069 3228 2218 2740 2885 2937 4622 7020 9029 9635
6928I635K1R05j401j758j067l692k942k163K393R04l267k340P425J7j867J770
$$ 9635 9656 10561 9160 7402 6335 2643 -299 -2462 -69 835 -2432 -4772 2653 2670 803 2573
6912B573J892q754j830K323J219n22j180L469M443K464K171K658k241l367l899
$$ 2573 4465 -4289 -6119 -3796 -2577 -3099 -4279 -810 3633 6097 8268 10926 8685 5318 1419
6897A419J290m89l805j831O13K201J666n96L726M10l826n060j336L937J080j756
$$ 1419 2709 2220 -1585 -3416 -2803 -602 1064 468 4194 4604 778 -4282 -5618 -1681 -601 -2357
6881b357j130J928j820k63J202K599K961L069l217l832L00J721M47k525n23K302
$$ -2357 -3487 -1559 -3379 -3642 -2440 159 3120 6189 2972 -860 -560 1161 1608 -917 -1440 862
6865H62K480K80k50k632k956Q20K471j034J39J347m19j706k34j101L539J193l428
$$ 862 3342 3622 3372 740 -2216 -1396 1075 41 180 1527 1108 -598 -832 -1933 1606 2799 -629
6848f29k194M62j032J495P98K58M06L901M020J688J941k53j572p59k836q00L587
$$ -629 -2823 -2361 -3393 -1898 -1100 -842 -436 3465 7485 9173 11114 10861 9289 8530 5694 4894 8481
6831H481J890l504l140J897j512k449J629K709j717P67l137j305n93l72p50n74
$$ 8481 10371 6867 3727 5624 4112 1663 3292 6001 4284 5051 1914 609 16 -356 -1106 -1680
6815a680J092j088j402k25L6l31l397p32j347K339O17M27K144j505K600L797K482
$$ -1680 -588 -1676 -3078 -3303 -3267 -3598 -6995 -7727 -9074 -6735 -6118 -5691 -3547 -5052 -2452 1345 3827
6798C827r1M843Q43k519j893j49J24j135l27p38n41m45n192j12L761J67Q41J81
$$ 3827 3736 8579 9422 6903 5010 4861 4985 3850 3523 2785 2244 1799 -3393 -3505 256 423 1264 1445
6780A445K69j830J881N685L39l6p84m210k551l23J121M561j802k227n60N01J865
$$ 1445 1714 -116 1765 7450 7789 7753 6969 2759 208 -115 1006 5567 3765 1538 978 1479 3344
6763C344j819r41p9N30K653m263m434k031K97K921P65P84L101K080K67k109k018
$$ 3344 1525 584 505 1035 3688 -575 -5009 -7040 -6743 -3822 -3057 -2273 828 2908 3175 1066 -952
6746i52M540M937o08J022K406Q49l96l083j710n607l309k05K514j198O04K004
$$ -952 3588 8525 7917 8939 11345 12194 11798 8715 7005 1398 -1911 -2116 398 -800 -196 1808
6730A808K948K428n427j362K248K623J168O500j190j877j743j435K450O49n105
$$ 1808 4756 7184 1757 395 2643 5266 6434 12934 11744 9867 8124 6689 9139 9788 4683
6715D683j196K136J604m92j219j619j287M492j130K717M672O177K212O115N973
$$ 4683 3487 5623 7227 6735 5516 3897 2610 7102 5972 8689 13361 19538 21750 27865 33838
6700C3838M360J15j707l529M75o43L238K78M691L039M731O106J0434J2800J8771
$$ 33838 38198 38313 36606 33077 33552 32909 36147 36425 41116 44155 48886 54992 65426 78226 96997
6685I6997K1317K8189M2488O4187R6550J45780K11763J92148R604j19369j29496
$$ 96997 118314 146503 188991 253178 349728 495508 707271 899419 909023 789654 660158
6674F60158j36529j37153j10384p0170m6056l0658k4258j9880j1873o613j726
$$ 660158 523629 386476 276092 205922 159866 129208 104950 85070 73197 66584 64858
6663F4858n270q257r245m475r44j32J646N212L503k225l147p530n042m908n264
$$ 64858 59588 51331 42086 37611 36667 36535 38181 43393 46896 44671 41524 33994 28952 24044 18780
6648A8780j028M007k875l22l19j441k07l297j924p50J348K06K330l338j503J365
$$ 18780 17752 21759 18884 18562 18243 16802 16595 13298 11374 10624 11972 12178 14508 11170 9667 11032
6632A1032L173K068k585r117l456M33L204J765J345p42o6R84l348m102j740k523
$$ 11032 14205 16273 13688 4571 1115 1548 4752 6517 7862 7120 7054 8038 4690 588 -1152 -3675
6616c675K984M335L776p37J063K2j352j578j740O35L380qk786r89M06L70L951
$$ -3675 -691 3644 7420 6683 7746 7768 6416 4838 3098 3733 7113 7105 4319 3330 3736 4106 8057
6599H057q57l845m113L742L442m63l291o59k020L021j925k962j27K528Q71j953
$$ 8057 7200 3355 -758 2984 6426 5963 2672 2013 -7 3014 1089 -1873 -2000 528 1399 -554
6583e54m2M122m020l950M999L388M96k29J580j377o399j409M086L097j313m064
$$ -554 -596 3526 -494 -4444 555 3943 4439 4210 5790 4413 -1986 -3395 691 3788 2475 -1589
6567a589j261K910j710O40j364L428J196J010q37k319l383m53O37J316J675k754
$$ -1589 -2850 60 -1650 -1010 -2374 1054 2250 3260 2423 104 -3279 -3732 -3095 -1779 -104 -2858
6551b858n195K394Q13K273j000P85k99J680M555k62j978j444J73K027n311N66
$$ -2858 -8053 -5659 -4846 -2573 -3573 -2788 -3087 -1407 3148 2886 908 -536 -363 1664 -3647 -3081
6535c081J043j880j752k347j404J35M729j039j270K328L362K249K440M05j328
$$ -3081 -2038 -3918 -5670 -8017 -9421 -9286 -4557 -5596 -6866 -4538 -1176 1073 3513 3918 2590
6520B590q91l76k013K375Q9k518l210j373N377j31k877j443J761K670L5m86R73
$$ 2590 1699 1323 -690 1685 1774 -744 -3954 -5327 50 -81 -2958 -4401 -2640 30 65 -421 552
6503E52j745j079k09J772k362k375J842P54R07J784l528l990j828N104J755k10
$$ 552 -1193 -2272 -2481 -709 -3071 -5446 -3604 -2850 -1943 -159 -3687 -7677 -9505 -4401 -2646 -2856
6487b856M50j370k03M497o98j270M104J407Q32j693q67k600p48k042K319O531
$$ -2856 -2406 -3776 -3979 518 -180 -1450 2654 4061 4893 3200 2333 -267 -1015 -3057 -738 5793
6471E793K473k368j437l793m368J10J449K165J117j930J724L17J161q37l398J857
$$ 5793 8266 5898 4461 668 -3700 -3590 -2141 24 1141 -789 935 1252 2413 1576 -1822 35
6455C5L84N48J696l7j163M02n83K293R31m605k327J502k404k78O829J862m964
$$ 35 419 967 2663 2626 1463 1865 1282 3575 4506 -99 -2426 -924 -3328 -3606 3223 5085 121
6438A21l505K097n53M315o05k08l498q55k67j01k036N826N660m20q89k843l163
$$ 121 -3384 -1287 -1840 2475 1870 1662 -1836 -2691 -2958 -3059 -5095 731 6391 5971 5082 2239 -924
6421i24j848k45L680l906j19N66k52p93J893J649J494j185O84P91m922n72J696
$$ -924 -2772 -3017 663 -3243 -3362 -2796 -3048 -3841 -1948 -299 1195 10 694 1485 -3437 -4009 -2313
6404b313K715n82n191J097R01K578K591L52m478o21k197K743J78Q01L649L367
$$ -2313 402 -180 -5371 -4274 -3373 -795 1796 2148 -2330 -2951 -5148 -2405 -2227 -1426 2223 5590
6388E590J585N61Q50k209J41r35p914m188n42K09K761K977L502l151O66J687j397
$$ 5590 7175 7736 8586 6377 6518 5583 -2331 -6519 -7061 -6852 -4091 -1114 2388 -763 -97 1590 193
6371A93K350j19J27l47n701j562l25J452k25k88Q89J249p61J008K492k095j367
$$ 193 2543 2424 2551 2204 -3497 -5059 -5384 -3932 -4157 -4445 -3556 -2307 -3068 -2060 432 -1663 -3030
6354c030k447n68M039L354l717l483j37K61o0L842L96m91J61p85K413L666j505
$$ -3030 -5477 -6045 -2006 1348 -2369 -5852 -5989 -5728 -5788 -1946 -1550 -2041 -1880 -2665 -252 3414 1909
6337A909k268l55L786N72n75J761k670M8k330K195J003l766J589j269j849K298
$$ 1909 -359 -714 3072 3644 3069 4830 2160 2208 -122 2073 3076 -690 899 -370 -2219 79
6321G9J585m300j55J421K543N1L003j316n457q39O66k470Q8L100L387j705N68
$$ 79 1664 -2636 -2791 -1370 1173 1224 4227 2911 -2546 -3385 -2719 -5189 -5101 -2001 1386 -319 249
6304B49L591J198J44j712k25r01m19K567L08m991M742K371N26k672l211P34J938
$$ 249 3840 5038 5182 3470 3245 2344 1925 4492 4800 -191 4551 6922 7448 4776 1565 2299 4237
6287D237P88j046n058m255Q04M955J716K65j08P38L8j951j94J649R91n18L54J42
$$ 4237 5025 3979 -1079 -5334 -4530 425 2141 2406 2298 3036 3074 1123 929 2578 3569 3051 3405 3547
6269C547j411l486j844P66J441q07j384L202K076m272j18K60j682j123K225m33
$$ 3547 2136 -1350 -3194 -2428 -987 -1794 -3178 24 2100 -2172 -2290 -2030 -3712 -4835 -2610 -3043
6253c043k813j049j20R80N08J716K377j920J83L593k989k567K546m49j049K062
$$ -3043 -5856 -6905 -7025 -6045 -5537 -3821 -1444 -3364 -3181 412 -2577 -5144 -2598 -3047 -4096 -2034
6237b034J17k519M74j037J252j018j821L013L23r69q41J940k704J503M777o766
$$ -2034 -1917 -4436 -3962 -4999 -3747 -4765 -6586 -3573 -3250 -4219 -5060 -3120 -5824 -4321 456 -6310
6221f310l070J428M88K405M517L190L059j006n228k172P71Q65K03k883K93K161
$$ -6310 -9380 -7952 -7464 -5059 -542 2648 5707 4701 -527 -2699 -1928 -1063 -860 -3743 -3450 -1289
6205a289p82j488k147m42p9M500P06m897k505K512K396M880L396o21l10j599j587
$$ -1289 -2071 -3559 -5706 -6148 -6227 -1727 -1021 -5918 -8423 -5911 -3515 1365 4761 4140 3830 2231 644
6188F44M17k190k158Q60J732r88k233j692K249J345k139O23L252j37J32Q16n5
$$ 644 1061 -1129 -3287 -2427 -695 -1683 -3916 -5608 -3359 -2014 -4153 -3530 -278 -415 -283 533 478
6171D78j476J03j880p69r86l17L33M54L99k778L677K656j457O93M222l25l984
$$ 478 -998 -895 -2775 -3544 -4530 -4847 -4514 -4060 -3661 -6439 -2762 -106 -1563 -870 3352 3027 -957
6154i57j839k442k3L311J497K567m071l377K13J459K195J151P51j497l731r35
$$ -957 -2796 -5238 -5261 -1950 -453 2114 -1957 -5334 -5121 -3662 -1467 -316 435 -1062 -4793 -5728
6138e728Q08K067K120m750L30N157p63j353M34J092K258l349j040L96n68r16j016
$$ -5728 -4920 -2853 -733 -5483 -5153 4 -759 -2112 -1678 -586 1672 -1677 -2717 -2321 -2889 -3805 -4821
6121d821J939N52O18k63J105j588k011J806q10j49J133J656J149k252m500L684
$$ -4821 -2882 -2330 -1712 -1975 -870 -2458 -4469 -2663 -3473 -3622 -2489 -833 316 -1936 -6436 -2752
6105b752j65M863R32m806k91j296l75J928L251p10j15n82J014L579L78k869o15
$$ -2752 -2917 1946 2878 -1928 -2219 -3515 -3890 -1962 1289 579 464 -118 896 4475 4853 1984 1369
6088A369m557j022K037N80J775J126M0k93Q02l24j83M87j770L777l065l588L398
$$ 1369 -3188 -4210 -2173 -1593 182 1308 1348 1055 1857 1533 1350 1837 67 3844 779 -2809 589
6071E89J627L05l999n3L394k049j044l280N55k863J183K341K240Q57m297M66J105
$$ 589 2216 2521 -1478 -1531 1863 -186 -1230 -4510 -3955 -6818 -5635 -3294 -1054 -197 -4494 -4028 -2923
6054b923J062R45k26p48J21k221j789j008L313J847j163K068J849J356K334r12
$$ -2923 -1861 -916 -1142 -1890 -1769 -3990 -5779 -6787 -3474 -1627 -2790 -722 1127 2483 4817 3905
6038C905l559m360l271r11M741j39j390K847O85m787j72k80j534M668M149N58
$$ 3905 346 -4014 -7285 -8196 -3455 -3594 -4984 -2137 -1452 -6239 -6411 -6691 -8225 -3557 592 1150
6022A150L107j826k677Q40k192n06M913k41L042o53K92O62m81N732r15o635n309
$$ 1150 4257 2431 -246 594 -1598 -2104 2809 2568 5610 4957 5249 5911 5430 11162 10247 3612 -1697
6005a697m956N51k64k01L099M069K196j57j301K904J273n091k794N6k057k321
$$ -1697 -6653 -6102 -6366 -6567 -3468 601 2797 2640 1339 4243 5516 425 -2369 -2313 -4370 -6691
5989f691J259M574N202J323K13l271m09M493k370k055n89k803k029K787N79j323
$$ -6691 -5432 -858 4344 5667 5880 2609 2200 6693 4323 2268 1679 -1124 -3153 -366 213 -1110
5973a110N57Q36q68j890L12j540K99J325k135j354n24J477J717P26l470N06L188
$$ -1110 -553 283 -585 -2475 -2163 -3703 -3404 -2079 -4214 -5568 -6092 -4615 -2898 -2172 -5642 -5136 -1948
5956a948J502o43k885r73r51J399M036O35j008k245L750L89L14K550P97j336J530
$$ -1948 -446 -1089 -3974 -4947 -5898 -4499 -463 172 -836 -3081 669 1058 1372 3922 4719 3383 4913
5939D913k503k051J716j636j58k680R49p71k728J734J232j771j142J186K920L40
$$ 4913 2410 359 2075 439 281 -2399 -1450 -2221 -4949 -3215 -1983 -3754 -4896 -3710 -790 -450
5923d50K561r7R19J241Q58l648l31j77j528m82K807N06j800n993l458L575M082
$$ -450 2111 2014 2933 4174 5032 1384 1053 876 -652 -1134 1673 2179 379 -5614 -9072 -5497 -1415
5906a415L486p09j256k612L849p4l254K006K580j212j745J239k38j345m478n484
$$ -1415 2071 1362 106 -2506 1343 1269 -1985 21 2601 1389 -356 883 645 -700 -5178 -10662
5890a0662j025K380N688K812j784J389m109J704M788R49k082k102j070L17O204
$$ -10662 -11687 -9307 -3619 -807 -2591 -1202 -5311 -3607 1181 2130 48 -2054 -3124 -2807 3397
5875C397N68q92L80J255J99K288J6k391j398l891p35M297m240j573R97N15j590
$$ 3397 3965 3073 3453 4708 4907 7195 7211 4820 3422 -469 -1204 3093 -1147 -2720 -1723 -1208 -2798
5858b798p11k184K450O340L038N479j167o173n578M87J941N96O66j031j480K141
$$ -2798 -3509 -5693 -3243 3097 6135 11614 10447 4274 -1304 -817 1124 1720 2386 1355 -125 2016
5842B016J151m224M48k263j584L007K508M86k270j252Q31O01M99J957j853J156
$$ 2016 3167 -1057 -609 -2872 -4456 -1449 1059 1545 -725 -1977 -1146 -545 -46 1911 58 1214
5826A214N25k382k423J869J706J657K83j679J08J93m03l806j44L198M573j55l087
$$ 1214 1739 -643 -3066 -1197 509 2166 2449 770 878 1071 668 -3138 -3282 -84 4489 4334 1247
5809A247r6l563l313L415O345J142k642K486L605j723l579j875n004Q25L402O471
$$ 1247 1151 -2412 -5725 -2310 4035 5177 2535 5021 8626 6903 3324 1449 -3555 -2730 672 7143
5793G143p45j811J25k254j178l458j348K560P70K633K647J952q21k278n135r4
$$ 7143 6398 4587 4712 2458 1280 -2178 -3526 -966 -196 2437 5084 7036 6215 3937 -1198 -1292
5777a292K956k20J917k78k635j727k711K162J536k020K68k635J117L422J315j114
$$ -1292 1664 1444 3361 3083 448 -1279 -3990 -1828 -292 -2312 -2044 -4679 -3562 -140 1175 61
5761F1N50n53J013p49j29l161l092N95K08m227K968J696K982J992J637J952j071
$$ 61 611 58 1071 322 193 -2968 -6060 -5465 -5257 -9484 -6516 -4820 -1838 154 1791 3743 2672
5744B672k372k738j794O84k419K165K673o55M64m0l381K590K19n364k009m21K891
$$ 2672 300 -2438 -4232 -3548 -5967 -3802 -1129 -1784 -1320 -1360 -4741 -2151 -1932 -7296 -9305 -9726 -6835
5727f835J37J069P27M556L355K79n01p70p53O90q10q50J026K42j506k140K392
$$ -6835 -6698 -5629 -4902 -346 3009 3288 2787 2017 1264 1954 1144 294 1320 1562 56 -2084 308
5710C08k193K4J291k114j597J958J184r19l13J931L225L65j617m089o27L193R5
$$ 308 -1885 -1861 -570 -2684 -4281 -2323 -1139 -2058 -2371 -440 2785 3150 1533 -2556 -3183 10 105
5693A05o206m51J895J936l11L04M871L299j193n02l008j993J63J067L002N541
$$ 105 -6101 -6552 -4657 -2721 -3032 -2728 2143 5442 4249 3747 739 -1254 -1091 -24 2978 8519
5677H519n81m178k153j314M731K605l2k676j744J423m95m311J945j138k754R62
$$ 8519 7938 3760 1607 293 5024 7629 7597 4921 3177 4600 4105 -206 1739 601 -2153 -1191
5661a191Q41J068j71O93L92j320J010N66k230k393J741J446k640k550P43p0J403
$$ -1191 -350 718 547 1240 1632 312 1322 1888 -342 -2735 -994 452 -2188 -4738 -3995 -4065 -2662
5644b662J59J71M91M01m264m37M661l81m56M645p13k153M28m76M624P479q02p050
$$ -2662 -2503 -2332 -1841 -1440 -5704 -6141 -1480 -1861 -2317 2328 1615 -538 -110 -586 4038 11517 10715 3665
5626C665o432J670K116N98m1l036l707p97P0K95O72O90K1r44L361L48L138J984
$$ 3665 -2767 -1097 1019 1617 1576 -1460 -5167 -5964 -5894 -5599 -4927 -4237 -4216 -5160 -1799 -1451 1687 3671
5608C671J550j757K031j276J892j677j734J262J677k22o53n65k139k612M806J718
$$ 3671 5221 3464 5495 4219 6111 4434 2700 3962 5639 5417 4764 4199 2060 -552 4254 5972
5592E972l226l584m769J023K009J822J382L24k757o12R52R51N169p86l543J631
$$ 5972 2746 -838 -5607 -4584 -2575 -753 629 953 -1804 -2416 -1464 -513 4656 3870 327 1958
5576A958l120O47K495k422m580k089K115K368K260l29l522n07K264J90j34J218
$$ 1958 -1162 -515 1980 -442 -5022 -7111 -4996 -2628 -368 -697 -4219 -4726 -2462 -2272 -2406 -1188
5560a188N69l99j048k19J399J76J360J332q13J764J49k61n28M12J178JK67l623
$$ -1188 -619 -1018 -2066 -2285 -886 -710 650 1982 1169 2933 3082 2821 2293 2705 3883 3884 4151 528
5542E28j602j003R78n9L673Q53q43k481Q75J759j595k081k546K777M247K593k787
$$ 528 -1074 -2077 -1099 -1158 2515 3368 2525 44 919 2678 1083 -998 -3544 -767 3480 6073 3286
5525C286k799k642j11J699J894K111j05K18j155r35M32j124P70k772k279J238
$$ 3286 487 -2155 -2266 -567 1327 3438 3333 3551 2396 1461 1893 769 1539 -1233 -3512 -2274
5509b274N33L122M559k826k754O81J35K519M23l742j023j171n31l506K292P391
$$ -2274 -1741 1381 5940 3114 360 1041 1176 3695 4118 376 -647 -1818 -2349 -5855 -3563 3828
5493C828M437j426J423K761j513n180k924J705K442l033k13l204n34J151N911
$$ 3828 8265 6839 8262 11023 9510 4330 1406 3111 5553 2520 2307 -897 -1431 -280 5631
5478E631l71o987j609K348j161K406M73k885R27N207m09l03m841J8J288j786N424
$$ 5631 5260 -1727 -3336 -988 -2149 257 730 -2155 -1228 3979 3570 3267 -1574 -1556 -268 -2054 3370
5461C370k929m48L19k456M39p76j511j561j432O15K579K163R97K860J880J124
$$ 3370 441 -7 312 -2144 -1705 -2481 -3992 -5553 -6985 -6370 -3791 -1628 -631 2229 4109 5233
5445E233l701N44J443J194l742J46l08j508O72J916o0l594K894N51L46j87j509
$$ 5233 1532 2076 3519 4713 971 1117 809 -699 -27 1889 1829 -1765 1129 1680 2026 1839 330
5428C30k740j909O45k04K185j734j340J570L01k03o54j324J089K55j850P774j594
$$ 330 -2410 -4319 -3674 -3878 -1693 -3427 -4767 -3197 -2896 -3099 -3753 -5077 -3988 -3733 -5583 2191 597
5411E97M72k601m514j875l33o7N76K810L432r77M20p57j50k135K365J832n4k2
$$ 597 1069 -1532 -6046 -7921 -8254 -8321 -7745 -4935 -1503 -2480 -2060 -2817 -2967 -5102 -2737 -905 -959 -981
5393i81k268J108J921K593j873J412J086k403k359J309k934p67K965M685j394
$$ -981 -3249 -2141 -220 2373 500 1912 2998 595 -1764 -455 -3389 -4156 -1191 3494 2100
5378B100j039J780n47l596k708j783k26K691J251J19K311M11q79j223j124L47
$$ 2100 1061 2841 2294 -1302 -4010 -5793 -6019 -3328 -2077 -1958 353 764 -115 -1338 -2462 -2115
5362b115l005K07K083K032L732p91J589j751k293R57l975l500K111K283k68K2
$$ -2115 -5120 -4913 -2830 -798 2934 2143 3732 1981 -312 645 -3330 -6830 -4719 -2436 -2704 -2682
5346b682J068J79k548K827M119N68m189l90K500J46n096j992p83k187L475K94
$$ -2682 -1614 -1435 -3983 -1156 2963 3531 -658 -1048 1452 1598 -3498 -5490 -6273 -8460 -4985 -4691
5330d691J060K380O34j180J295j58n299K734J327n48M628Q66K839k31m651l450
$$ -4691 -3631 -1251 -617 -1797 -502 -660 -5959 -3225 -1898 -2446 2182 3048 5887 5656 1005 -2445
5314b445M58p5k478j738J288J958O566K751J544J021l557n022j598j063J905J484
$$ -2445 -1987 -2062 -4540 -6278 -4990 -3032 3534 6285 7829 8850 5293 271 -1327 -2390 -485 999
5298I99j861m802m390r81N462L100k688p47M188j14K338J760j576J395N297k691
$$ 999 -862 -5664 -10054 -11035 -5573 -2473 -5161 -5908 -1720 -1834 504 2264 688 2083 7380 4689
5282D689m234k134l018L65M293M125J240r84o59L911o54k611p18k09J128k10k996
$$ 4689 455 -1679 -4697 -4332 -39 4086 5326 4342 3683 7594 6940 4329 3611 3402 4530 4320 1324
5265A324m812L86j987J731L276K070k080k613J076K028K123K1J709j979n133j362
$$ 1324 -3488 -3102 -5089 -3358 -82 1988 -92 -2705 -1629 399 2522 2543 4252 2273 -2860 -4222
5249d222J130k49o52N376L116l510m89l67p84N4O04K693J253l244N07k507K586
$$ -4222 -3092 -3341 -3993 1383 4499 989 500 133 -651 -597 7 2700 3953 709 1216 -1291 1295
5232A295K038l875L27n923k087L158J276L888M736R51j995m703l737k349J643
$$ 1295 3333 -542 -215 -6138 -8225 -5067 -3791 97 4833 5784 3789 -914 -4651 -7000 -5357
5217e357K912K517l8l17k322J774K663J621k454n244n19J440m22M952P56p03j177
$$ -5357 -2445 72 34 -283 -2605 -831 1832 3453 999 -4245 -4764 -3324 -3746 1206 1962 1259 82
5200H2j450q01K854J788J209Q07r97k195k148m182k586Q49R35k913l737j824N987
$$ 82 -1368 -2169 685 2473 3682 4489 3492 1297 -851 -5033 -7619 -6770 -5835 -8748 -12485 -14309 -8322
5183h322l09j94M807J817N34K315J681j90n58k186j20R70L63j889j371J755q79
$$ -8322 -8631 -8825 -4018 -2201 -1667 648 2329 2139 1581 -605 -725 245 608 -1281 -2652 -897 -1776
5166a776m43Q59J675R22K188n119p925j412M436K920J973k324K566M406M91l019
$$ -1776 -2219 -1360 315 1237 3425 -1694 -9619 -11031 -6595 -3675 -1702 -4026 -1460 2946 3437 418
5150D18m072J262L645K432n850k972J283J471K712R76j381l985l956O15K168J586
$$ 418 -3654 -2392 1253 3685 -2165 -5137 -3854 -2383 329 1305 -76 -4061 -8017 -7402 -5234 -3648
5134c648J908K963k297j65K630J98j572j253J324j228P17l096j214K114K654J645
$$ -3648 -1740 1223 -1074 -1239 1391 1589 17 -1236 88 -1140 -423 -3519 -4733 -2619 35 1680
5118A680J093K529N39l860j272J474K80J288k107j320p03R21l143j591j077P32
$$ 1680 2773 5302 5841 1981 709 2183 2463 3751 1644 324 -379 542 -2601 -4192 -5269 -4537
5102d537j548L025j210J965J302p40j99j502J809L832n08l918m849p75J948J060
$$ -4537 -6085 -3060 -4270 -2305 -1003 -1743 -1942 -3444 -1635 2197 1689 -2229 -7078 -7853 -5905 -4845
5086d845K60K382r03k270M745O865L983k019J91j481k949n59l037L922K20Q01
$$ -4845 -4585 -2203 -3106 -5376 -631 6234 10217 8198 8389 6908 3959 3400 363 4285 4505 5306
5070E306n36M97j331k697J975j088r68k536j212J971O01j831q00J374l21K022
$$ 5306 4770 5267 3936 1239 3214 2126 1158 -1378 -2590 -619 -18 -1849 -2649 -1275 -1596 426
5054D26j25j722l17L002Q28R54J192J097k329l123J639j194l311k167L019J818
$$ 426 301 -1421 -1738 1264 2092 3046 4238 5335 3006 -117 1522 328 -2983 -5150 -2131 -313
5038c13j056N09j450k410L045K372k464J833K48k685k686j392J682R12r90m29
$$ -313 -1369 -860 -2310 -4720 -1675 697 -1767 66 314 -2371 -5057 -6449 -4767 -3855 -4845 -5274
5022e274K812J651j06M360L109J01j405k236j879j529k539K740J994l979k973
$$ -5274 -2462 -811 -917 3443 6552 6653 5248 3012 1133 -396 -2935 -195 1799 -2180 -5153
5007e153J143p00Q82l667J365k575K023L249k762J336K708J518J545j666M941
$$ -5153 -4010 -4710 -3828 -7495 -6130 -8705 -6682 -3433 -6195 -4859 -2151 -633 912 -754 4187
4992D187K296J519j774n555n820q1M671L460J350K347j295M87j203k552l019m79
$$ 4187 6483 8002 6228 673 -5147 -5228 -557 2903 4253 6600 5305 5792 4589 2037 -982 -1461
4976a461P4L182J308K509K912n09l446m032l367o93J571J804L89j3q95R92L136
$$ -1461 -1387 1795 3103 5612 8524 8015 4569 537 -2830 -3523 -1952 -148 241 228 -667 325 3461
4959C461l41j176j105k312k399l47k516l28j639M099M484J06J497J690J263k926
$$ 3461 3120 1944 839 -1473 -3872 -4219 -6735 -7063 -8702 -4603 -119 -13 1484 3174 4437 1511
4943A511j133l38K232O11J667o011K279l460j322m002l171J081L081L691q85N53
$$ 1511 378 40 2272 2883 4550 -1461 818 -2642 -3964 -7966 -11137 -10056 -6975 -3284 -4169 -3616
4927c616m59k232J322j50P38r03j184M322K857k465l398K283K476J659oJ18J38
$$ -3616 -4075 -6307 -4985 -5135 -4397 -5300 -6484 -2162 695 -1770 -5168 -2885 -409 1250 1244 1362 1500
4910A500l681P69l6l240j294K398L905j9L58k97j460J214N564K725j668J822j351
$$ 1500 -2181 -1412 -1448 -4688 -5982 -3584 321 302 660 363 -1097 117 5681 8406 6738 8560 7209
4893G209m29k700k092J152L599J408m923l158l175j780J558P73j637J877k529
$$ 7209 6780 4080 1988 3140 6739 8147 3224 66 -3109 -4889 -3331 -2558 -4195 -2318 -4847
4878d847M93L532J741m066j151k032l19j20m29r46J190J990K299N58j624K215
$$ -4847 -4354 -822 919 -3147 -4298 -6330 -6649 -6769 -7198 -8144 -6954 -4964 -2665 -2107 -3731 -1516
4862a516N27l928q11K934n37K141J044L260p91j418j348J437J122j342K922P23
$$ -1516 -989 -4917 -5728 -2794 -3331 -1190 -146 3114 2323 905 -443 994 2116 774 3696 4419
4846D419K100k89k335j488L67M26l941l798k024K410J63K010j294l097m445N97
$$ 4419 6519 6230 3895 2407 2774 3200 -741 -4539 -6563 -4153 -3990 -1980 -3274 -6371 -10816 -10219
4830a0219J374L474O70m590J846R61O58K498o54Q12M478J210m073m436K500m8
$$ -10219 -8845 -5371 -4701 -9291 -7445 -6484 -5826 -3328 -3982 -3170 1308 2518 -1555 -5991 -3491 -3539
4814c539K319J089k955r79R22J065l169j38K868L10j213L236L201J309o31m376
$$ -3539 -1220 -131 -3086 -4065 -3143 -2078 -5247 -5385 -2517 -2207 -3420 -184 3017 4326 3695 -681
4798f81k546K972K892l83k089j121K091k127j154K750K341p05j674P9J904j045
$$ -681 -3227 -255 2637 2254 165 -956 1135 -992 -2146 604 2945 2240 566 645 2549 1504
4782A504o1M73k739m219J339J515N95J451q70J926m063l202J795J779M35Q41K314
$$ 1504 1443 1916 -823 -5042 -3703 -2188 -1593 -142 -1012 914 -3149 -6351 -4556 -2777 -2342 -1501 813
4765H13J816k578J512o84m747o41j433L267K188K120L359J417n134j937j661K834
$$ 813 2629 51 1563 879 -3868 -4509 -5942 -2675 -487 1633 4992 6409 1275 -662 -2323 511
4749E11Q08K235N8l665j91L611J639j417j897K064k127j583K324K665k925J70
$$ 511 1319 3554 3612 -53 -244 3367 5006 3589 1692 3756 1629 46 2370 5035 2110 2280
4733B280k513k322j083M287K566l383k097K460q39l23J056j074J93l5k419j116
$$ 2280 -233 -2555 -3638 649 3215 -168 -2265 195 -644 -967 89 -985 -792 -827 -3246 -4362
4717d362k706k95M240j471j165k50K346J6k646J607K298J875J175q27J388L093
$$ -4362 -7068 -7363 -3123 -4594 -5759 -6009 -3663 -3647 -6293 -4686 -2388 -513 662 -165 1223 4316
4701D316j370k316M67j956L505L045n81l836l525k087M69O18J467J343l620l062
$$ 4316 2946 630 1097 -859 2646 5691 5110 1274 -2251 -4338 -3869 -3251 -1784 -441 -4061 -7123
4685g123J014Q67M68K052L277k86Q08K870R2j37j21o71l848r22J138l670l629
$$ -7123 -6109 -5242 -4774 -2722 555 269 1077 3947 4039 3902 3781 3110 -738 -1660 -522 -4192 -7821
4668g821J53J429j654K326p03j058J296M935N237j234m67n306k66L575k492J626
$$ -7821 -7668 -6239 -7893 -5567 -6270 -7328 -6032 -1097 4140 2906 2439 -2867 -3133 442 -2050 -424
4652d24J993O96J885j654m51J886R56j49n53k95j370p7L359k507l676L079K75
$$ -424 1569 2265 4150 2496 2045 3931 4887 4738 4185 3890 2520 2443 5802 3295 -381 2698 2973
4635B973l230j79k246j586k689R44R21l30p70k144j523L028M934L822l215j874
$$ 2973 -257 -436 -2682 -4268 -6957 -6013 -5092 -5422 -6192 -8336 -9859 -6831 -1897 1925 -1290 -3164
4619c164N707R31p03J133P8r41m821j908m047l675J156L678L61L238O411L877
$$ -3164 2543 3474 2771 3904 3982 3041 -1780 -3688 -7735 -11410 -10254 -6576 -6215 -2977 3434 7311
4603G311K922j775J253J381M40J35j356P76m401n459j488N56q671l086N656K391
$$ 7311 10233 8458 9711 11092 11532 11667 10311 11087 6686 1227 -261 295 -8376 -11462 -5806 -3415
4587c415J249M114n53m4M547M465K99j457k580m147p348j143J396K374J694l798
$$ -3415 -2166 1948 1395 1351 5898 10363 10662 9205 6625 2478 -4870 -6013 -4617 -2243 -549 -4347
4571d347j678J215p70n7k111j153K751N703M395J43k585J84k243k192m066p60
$$ -4347 -6025 -4810 -5580 -5637 -7748 -8901 -6150 -447 3948 4091 1506 1690 -553 -2745 -6811 -7571
4555g571P729L469o91J140J664p6k565p19K894J026o9j975j875k310k422P71j151
$$ -7571 158 3627 2936 4076 5740 5664 3099 2380 5274 6300 6231 4256 2381 71 -2351 -1580 -2731
4538b731O53p39j457l493J438K101L577m121J106N043J230L103o58m278l499J313
$$ -2731 -2078 -2817 -4274 -7767 -6329 -4228 -651 -4772 -3666 1377 2607 5710 5052 774 -2725 -1412
4522a412K925L116k673J849O97N52k051l251j872o68K737j094m467j778K027J582
$$ -1412 1513 4629 1956 3805 4502 5054 3003 -248 -2120 -2788 -51 -1145 -5612 -7390 -5363 -3781
4506c781K759K583k123R35M903J89k856j535L079m024J80J665N3K530J620o53
$$ -3781 -1022 1561 -562 373 5276 5465 2609 1074 4153 129 309 1974 2027 4557 6177 5524
4490E524J454j208l754m888J132K85N287J621J402n96k587r4j682k466j301m67
$$ 5524 6978 5770 2016 -2872 -1740 -1455 3832 5453 6855 6259 3672 3578 1896 -570 -1871 -2338
4474b338K722L810K25j771l424j059J560n0J746J311J191J898R24O48m382j228
$$ -2338 384 4194 4419 2648 -776 -1835 -275 -325 1421 2732 3923 5821 6745 7393 3011 1783
4458A783n3rK305k464l94j316j906n62j846l87j082j837R15K635o67j641j000
$$ 1783 1730 1721 4026 1562 1168 -148 -2054 -2616 -4462 -4849 -5931 -7768 -6853 -4218 -4885 -6526 -7526
4441g526K843L180J054M56K095L334J146k879J250l878r27J402q42l328j551K677
$$ -7526 -4683 -1503 -449 7 2102 5436 6582 3703 4953 1075 148 1550 708 -2620 -4171 -1494
4425a494K853l1l850m61J932J123R93L263j155k909n85K523J866l284L05m997
$$ -1494 1359 1328 -2522 -2983 -1051 72 1065 4328 3173 264 -321 2202 4068 784 1089 -3908
4409c908m143m40K180J123K57K902O38J95l234j219K370j819k579L140q82l250
$$ -3908 -8051 -8491 -6311 -5188 -4931 -2029 -1391 -1196 -4430 -5649 -3279 -5098 -7677 -4537 -5419 -8669
4393h669K005P247N476L847K19j31k474k054n17L227k708j610j682l444k680j321
$$ -8669 -6664 583 6059 9906 10125 9994 7520 5466 4949 8176 5468 3858 2176 -1268 -3948 -5269
4377e269j368J084K820K625j238J282K714O45j088l101L693J923k565Q77J288
$$ -5269 -6637 -5553 -2733 -108 -1346 -64 2650 3295 2207 -894 2799 4722 2157 3034 4322
4362D322L189Q95j821k824k383K129L827N49l878m408O61j311r93Q82M524J90
$$ 4322 7511 8406 6585 3761 1378 3507 7334 7883 4005 -403 258 -1053 -2046 -1164 3360 3550
4346C550m183k394k409L72M42M903Q028L411m614l540K70j497J931K611p6m447
$$ 3550 -633 -3027 -5436 -5064 -4622 281 8309 11720 7106 3566 3836 2339 4270 6881 6805 2358
4330B358l128j119K468K391M9k918k683k398l14K362K97J972K108j865J876K095
$$ 2358 -770 -1889 579 2970 3019 101 -2582 -4980 -5294 -2932 -2635 -663 1445 -420 1456 3551
4314C551r80n087J141k49k179j87L29M11J295J42j065L68n65r29L90N49n10j976
$$ 3551 2571 -2516 -1375 -1624 -3803 -3990 -3661 -3250 -1955 -1813 -2878 -2510 -3075 -4004 -3614 -3065 -3575 -5551
4296e551r41N84K479j77k313M828L188J866j816P64J006l485M309O74k949j004
$$ -5551 -6492 -5908 -3429 -3606 -5919 -1091 2097 3963 2147 2911 3917 432 4741 5415 2466 1462
4280A462j332j420J280N04J330L087O25j791J313o38j825j875J312Q66j865k4
$$ 1462 130 -1290 -10 494 1824 4911 5536 3745 5058 4420 2595 720 2032 2898 1033 1009
4264A009j227l912J68L28l865L254K059l02Q95l76k23j018K233k828j463Q49K235
$$ 1009 -218 -4130 -3962 -3634 -7499 -4245 -2186 -2488 -1593 -1969 -2192 -3210 -977 -3805 -5268 -4419 -2184
4247b184l389J97L121J582P39M653L030n049l643n50M715O247j396M78K49j857
$$ -2184 -5573 -5376 -2255 -673 66 4719 7749 2700 -943 -1493 3222 9469 8073 8551 8800 6943
4231F943J89l491p199N08K280k253l117j064p92J320R97j967J178k016K853K349
$$ 6943 7132 3641 -3558 -3050 -770 -3023 -6140 -7204 -7996 -6676 -5679 -7646 -6468 -8484 -5631 -3282
4215c282j361l604K06M134K505J325J046j445K552M3k33K209m187j656N896J44
$$ -3282 -4643 -8247 -8041 -3907 -1402 -77 969 -476 2076 2119 1886 4095 -92 -1748 4148 4292
4199D292J831Lo00k679k656J258K657J002l578j076k936l290J232J498J252K143
$$ 4292 6123 6126 5526 2847 191 1449 4106 5108 1530 454 -2482 -5772 -4540 -3042 -1790 353
4183C53j878n885j497K651n55K50j662K635J69q24K368K580n35m574m027J820
$$ 353 -1525 -7410 -8907 -6256 -6811 -6561 -8223 -5588 -5419 -6243 -3875 -1295 -1830 -6404 -10431 -8611
4167h611M412M804m187j163r3K507J314l535k916K086M461M168N08l105n0j401
$$ -8611 -4199 605 -3582 -4745 -4838 -2331 -1017 -4552 -7468 -5382 -921 3247 3755 650 600 -801
4151h01L83j584j656m44k86p66L83K046N083J122l2K1n22j490O8m18K336K120
$$ -801 -418 -2002 -3658 -4102 -4388 -5154 -4771 -2725 2358 3480 3448 3469 2947 1457 1525 1107 3443 5563
4133E563k568l919l09j893k209k728J311N868J87j597q08J17N815L015l30j189
$$ 5563 2995 -924 -1233 -3126 -5335 -8063 -6752 -884 -697 -2294 -3102 -2985 2830 5845 5515 4326
4117D326k694j875k27K857r84k112k192j278M075L300l846L752p22n729l030M75
$$ 4326 1632 -243 -470 2387 1403 -709 -2901 -4179 -104 3196 -650 3102 2380 -3349 -6379 -5904
4101e904L468J237j043J353J547J921L17n80m803l648L137J457j238j731J119
$$ -5904 -2436 -1199 -2242 -889 658 2579 2896 2316 -2487 -6135 -2998 -1541 -2779 -4510 -3391
4086c391K26P33q65m210O22J650o30O054J510j806K392K08N57P24p58K755J125
$$ -3391 -3165 -2432 -3297 -7507 -6885 -5235 -5865 189 1699 -107 2285 2493 3050 3774 3016 5771 6896
4069F896p46j13m342k941J035L045K78l221k76l253O51M166K598j524r59k299
$$ 6896 6150 6037 1695 -1246 -211 2834 3112 -109 -385 -3638 -2987 1179 3777 2253 1294 -1005
4053a005n925K24j326K013K052J278J315K744J097K14j816K362k245k181J30P69
$$ -1005 -6930 -6706 -8032 -6019 -3967 -2689 -1374 1370 2467 2681 865 3227 982 -1199 -1069 -300
4037c00k28q86j651J628J820m27j278m59M6L092N294l062l925j169J870K406J041
$$ -300 -528 -1414 -3065 -1437 383 -44 -1322 -1781 -1735 1357 6651 3589 -336 -1505 365 2771 3812
4020C812k511Q34o04J438J21k705n89j151j916J844K978l98j432k106J847K242
$$ 3812 1301 2135 1531 2969 3090 385 -204 -1355 -3271 -1427 1551 1153 -279 -2385 -538 1704
4004A704j240K313j594l197j440P41k601J811K971K476K39n53L519J59n488L46
$$ 1704 464 2777 1183 -2014 -3454 -2713 -5314 -3503 -532 1944 2183 1630 5149 5308 -180 166
3988A66r66j020J995K277m92J568O6J86O4m887p46K371K661Q8j955p83j48K102
$$ 166 -800 -1820 175 2452 1960 3528 3594 3780 3844 -1043 -1789 582 3243 3331 1376 593 445 2547
3970B547o99p36J003P34J433j192m833n518o76K941J193l89r65J979L057j95j054
$$ 2547 1848 1112 2115 2849 4282 3090 -1743 -7261 -7937 -4996 -3803 -4192 -5157 -3178 -121 -316 -1370
3953a370j542J311K723J861j193K241m425k019l106k365J323P08M44j066q46M673
$$ -1370 -2912 -1601 1122 2983 1790 4031 -394 -2413 -5519 -7884 -6561 -5853 -5409 -6475 -7321 -2648
3937b648L771k784m179L63J133L351O11k44k151O241k503k117l88J405o53q25
$$ -2648 1123 -1661 -5840 -5477 -4344 -993 -382 -626 -2777 3464 961 -1156 -1544 -139 -792 -1617
3921a617k781j58M7O81M43L180p37j84L414J0132l699o794k451K187J485J907
$$ -1617 -4398 -4556 -4509 -3828 -3385 -205 -942 -1126 2288 12420 8721 1927 -524 1663 3148 5055
3905E055n20l532j445P20K249j60m144m056J780L246r35m102J271K814L502J244
$$ 5055 4535 1003 -442 278 2527 2367 -1777 -5833 -4053 -807 -1742 -5844 -4573 -1759 1743 2987
3889B987l696l057K489J615j560J693k227P55r4M23n08k648l55J057K104J511
$$ 2987 -709 -3766 -1277 338 -1222 471 -1756 -1001 -1095 -672 -1180 -3828 -4183 -3126 -1022 489
3873D89K159M513j384j690j843m046M044o52K193k247P24L154k363j243J540j241
$$ 489 2648 7161 5777 4087 2244 -1802 2242 1590 3783 1536 2260 5414 3051 1808 3348 2107
3857B107M2k060K236r89k190j899l656r45N25K593J769j055O58P45L737L192J685
$$ 2107 2149 89 2325 1336 -854 -2753 -6409 -7354 -6829 -4236 -2467 -3522 -2864 -2119 1618 4810 6495
3840F495j473k546j425k793j572m060J367j3o88K539j204j346l745j245K025L073
$$ 6495 5022 2476 1051 -1742 -3314 -7374 -6007 -6020 -6708 -4169 -5373 -6719 -10464 -11709 -9684 -6611
3824f611M234K91j36n92m07J537j481k044l00q14J269R22J665J58K529N1j242
$$ -6611 -2377 -2086 -2222 -2814 -3221 -1684 -3165 -5209 -5509 -6323 -5054 -4132 -2467 -2309 220 271 -971
3807i71m06l28P53m655K932j550J208p87K61J797O64j315m585J034M233k501K425
$$ -971 -1377 -1705 -952 -5607 -2675 -4225 -3017 -3804 -3543 -1746 -1082 -2397 -6982 -5948 -1715 -4216 -1791
3790a791j354L211J564J447k257m714l931L480L078q6k850j790J868N77o63K044
$$ -1791 -3145 66 1630 3077 820 -3894 -7825 -4345 -1267 -1353 -4203 -5993 -4125 -3548 -4211 -2167
3774b167m71j267l824K644L078N40p69k539J594k6J8P93j937N7L22J011K314K090
$$ -2167 -2638 -3905 -7729 -5085 -2007 -1467 -2236 -4775 -3181 -3207 -3189 -2396 -4333 -4276 -3954 -2943 -629 1461
3756A461N3j542k158J820M089p55m872j153K830K193k560p17j770j564j609K962
$$ 1461 1514 -28 -2186 -366 3723 2968 -1904 -3057 -227 1966 -594 -1311 -3081 -4645 -6254 -3292
3740c292p3o507o05L516L579P38k906j161L923M054j669k100P30J850K947k311
$$ -3292 -3365 -9872 -10477 -6961 -3382 -2644 -5550 -6711 -2788 1266 -403 -2503 -1773 77 3024 713
3724G13k297L99l604o96K617K979J313o04l415P23r13N74M3k41k442J319K157
$$ 713 -1584 -1185 -4789 -5485 -2868 111 1424 820 -2595 -1872 -2785 -2211 -2168 -2409 -4851 -3532 -1375
3707a375R63l016M559O534o10m182p70J034RJ542l075m510O7L592j888k16j315
$$ -1375 -412 -3428 1131 7665 7055 2873 2103 3137 3146 4688 1613 -2897 -2830 762 -1126 -1342 -2657
3690b657K81L946J230K171k675M10J583j614o282m472n50K824K122j084P98L743
$$ -2657 -2376 1570 2800 4971 2296 2706 4289 2675 -3607 -8079 -8629 -5805 -3683 -4767 -3969 -226
3674b26N689J954m637m927j495L387K220p6l061p42L566J052k456O05k729R30
$$ -226 5463 7417 2780 -2147 -3642 -255 1965 1889 -1172 -1914 1652 2704 248 853 -1876 -946
3658i46J659J204O4J637m23m368J98J589k640m663o76L378L469o997j886M257
$$ -946 713 1917 1981 3618 3195 -1173 -975 614 -2026 -6689 -7365 -3987 -518 -7515 -9401 -5144
3642e144N307J441m693J248Q75k167J657K902k440l091K588n45k277q8K913o80
$$ -5144 163 1604 -3089 -1841 -966 -3133 -1476 1426 -1014 -4105 -1517 -2062 -4339 -4427 -1514 -2194
3626b194k978L785L919K560m724n408k416k125p60K658L762O91J093j10k135M46
$$ -2194 -5172 -1387 2532 5092 368 -5040 -7456 -9581 -10341 -7683 -3921 -3230 -2137 -2247 -4382 -3936
3610c936j198M14J118J745Q34j459J738L90l266k242j84l78J106J053r83J935
$$ -3936 -5134 -4720 -3602 -1857 -1023 -2482 -744 -354 -3620 -5862 -6046 -6424 -5318 -4265 -5248 -3313
3594c313J785K987Q89L835m28k97P72o87P36k703j879k439k228k568j803p13j739
$$ -3313 -1528 1459 2348 6183 5755 5458 6230 5543 6279 3576 1697 -742 -2970 -5538 -7341 -8054 -9793
3577i793K269J88N32L392K92J681O904k688l008K619M997J376l978o695p07j11
$$ -9793 -7524 -7336 -6804 -3412 -3120 -1439 5465 2777 -231 2388 7385 8761 4783 -1912 -2619 -2730
3561b730j498j284j273K850j241J76J912R12J5K125o54l130l60J996j51J378J703
$$ -2730 -4228 -5512 -6785 -3935 -5176 -5000 -3088 -2176 -2161 -36 -690 -3820 -4180 -2184 -2335 -957 746
3544G46K385L188k275K195j243j294k092O77j407j727k036o86M46L682l031k870
$$ 746 3131 6319 4044 6239 4996 3702 1610 2287 880 -847 -2883 -3569 -3123 559 -2472 -5342
3528e342N54M274L370k758n16R02J955J86n9Q86j869J335J27P56N33m506k53K671
$$ -5342 -4788 -514 2856 98 -418 484 2439 2625 2566 3452 1583 2918 3045 3801 4334 -172 -425 2246
3510B246P6l942k824k015N844L870p48l075m649J724J188k82J047J818J8j224
$$ 2246 2322 -1620 -4444 -6459 -615 3255 2507 -568 -5217 -3493 -2305 -2587 -1540 278 296 -928
3494i28j210j689j663J61o47K262J955J913k696l392m96k6j689k809N107M134
$$ -928 -2138 -3827 -5490 -5329 -5976 -3714 -1759 154 -2542 -5934 -6430 -6456 -8145 -10954 -5847 -1713
3478a713J498j194rP52p73k093J140K316J522J914o91n195r2o92j348K683J470
$$ -1713 -215 -1409 -1418 -666 -1439 -3532 -2392 -76 1446 3360 2669 -2526 -2618 -3310 -4658 -1975 -505
3461e05P24k16Q49Q31m50j438j283m339N78N351K857M51l670o93M545L926j647
$$ -505 219 3 852 1683 1233 -205 -1488 -5827 -5249 102 2959 3410 -260 -953 3592 7518 5871
3444E871j194p13k362j086k422k774R27J529k050n44M52j673K499J548J741o433
$$ 5871 4677 3964 1602 516 -1906 -4680 -3753 -2224 -4274 -4818 -4366 -6039 -3540 -1992 -251 -6684
3428f684k862J895M045J865J588k589P84k08O296J904L821m612l14R2m98l518
$$ -6684 -9546 -7651 -3606 -1741 -153 -2742 -1958 -2166 4130 6034 9855 5243 4929 5021 4523 1005
3412A005J498q41L70K229j862p42k581j419J257L617J540n72p51l083m861j501
$$ 1005 2503 1662 2032 4261 2399 1657 -924 -2343 -1086 2531 4071 3499 2748 -335 -5196 -6697
3396f697J236J737J032J328n9P43j25j165L141N028l010o055o83J678k02K604
$$ -6697 -5461 -3724 -2692 -1364 -1423 -680 -805 -1970 1171 6199 3189 -2866 -3549 -1871 -2073 531
3380E31N19o495J269P012l32J39q07N34K691k266o220j391j388J943J129m31j917
$$ 531 1050 -5445 -4176 2836 2504 2643 1836 2370 5061 2795 -3425 -4816 -6204 -4261 -3132 -3563 -5480
3363e480K78j105j98L426N474k992l497l603n68O81Q75Q46J178Q28k116k543L90
$$ -5480 -5202 -6307 -6505 -3079 2395 -597 -4094 -7697 -8265 -7584 -6709 -5863 -4685 -3857 -5973 -8516 -8126
3346h126M536N227l955j735N664N42P39j7K13L484j406q30j240j864k562j389
$$ -8126 -3590 1637 -2318 -4053 1611 2153 2892 2875 3088 6572 5166 4336 3096 1232 -1330 -2719
3330b719l228k31K413J917J90l683k925J094l229k089K686N241J476N008J297
$$ -2719 -5947 -6178 -3765 -1848 -1658 -5341 -8266 -7172 -10401 -12490 -9804 -4563 -3087 1921 3218
3315C218L160K137o100l146K335R15j653j13K975j046l662j211M096J690j246
$$ 3218 6378 8515 2415 -731 1604 2519 866 753 3728 2682 -980 -2191 1905 3595 2349
3300B349n336K798K346n16k135L733L087l00p899j999l41J650k342m38k12J833
$$ 2349 -2987 -189 2157 1641 -494 3239 6326 6026 -1873 -3872 -4213 -2563 -4905 -5343 -5555 -3722
3284c722K275N290L038l972j21L25o89l921k728l992P81k054%L527N155M236J435
$$ -3722 -1447 3843 6881 2909 2788 3113 2424 -1497 -4225 -8217 -7436 -9490 -9490 -5963 -808 3428 4863
3267D863K31k028k781j343k708J183k85N54J241k122k779J143M268k048k340Q86
$$ 4863 5094 3066 285 -1058 -3766 -2583 -2868 -2314 -1073 -3195 -5974 -4831 -563 -2611 -4951 -4065
3251d065M065j12j872J80j015P96L496n77k330j700J006J14P21R5R37J340l638
$$ -4065 0 -112 -1984 -1804 -2819 -2023 1473 896 -1434 -3134 -2128 -2014 -1293 -1198 -261 1079 -2559
3234b559j448J293J740L710J217j10L885l003k337M1q93j891n040Q61O359j377
$$ -2559 -4007 -2714 -974 2736 3953 3843 7728 4725 2388 2429 1536 -355 -5395 -4534 1825 448
3218D48r968KN454M475k430j227k48m563k955J131Q160L403J328j794l762j24
$$ 448 -9520 -9518 -4064 411 -2019 -3246 -3494 -8057 -11012 -9881 -1721 1682 3010 1216 -2546 -2670
3202b670j943k210M381L523J117j637o41j722j956k762J71R91j428j086M222k25
$$ -2670 -4613 -6823 -2442 1081 2198 561 -80 -1802 -3758 -6520 -6349 -5358 -6786 -7872 -3650 -3875
3186c875L200K682j685p47J216k032k519J852l644J46M187N84k139n7N197Q50
$$ -3875 -675 2007 322 -425 791 -1241 -3760 -1908 -5552 -5406 -1219 -635 -2774 -2831 2366 3216
3170C216L027k421K83J442n008l116L539L079k384l643j672L072L508k745l018
$$ 3216 6243 3822 4105 5547 539 -2577 962 4041 1657 -1986 -3658 -586 2922 177 -2841
3155b841K156J081Q03L606J774k841j136n71j839k500J22P36j348K97K717l009
$$ -2841 -685 396 1199 4805 6579 3738 2602 2031 192 -2308 -2186 -1450 -2798 -2501 216 -2793
3139b793N71J937m100j158K896j292j611m3J189L890j13k130L256K309J34J989
$$ -2793 -2222 -285 -4385 -5543 -2647 -3939 -5550 -5593 -4404 -514 -627 -2757 499 2808 2942 4931
3123D931Q64J249O19l960k159J12j339j994m55L024K887M83l022O98L348R25k719
$$ 4931 5795 7044 7663 3703 1544 1656 317 -1677 -2132 892 3779 4262 1240 1938 5286 6211 3492
3106C492o55K713k780l781j822J297L770R25k136L472K665k41k894l245L662J037
$$ 3492 2837 5550 2770 -1011 -2833 -1536 2234 3159 1023 4495 7160 6919 4025 780 4442 5479
3090E479m35k206p16q01m24k74k52J107k410l705k20M148J114k392J246j010j772
$$ 5479 5044 2838 2122 1321 897 623 371 1478 -932 -4637 -4857 -709 405 -1987 -741 -1751 -3523
3073c523l84K464K967L138j478m878N399N486l524m860j735K130L348K744r89
$$ -3523 -3907 -1443 1524 4662 3184 -1694 3705 9191 5667 807 -928 1202 4550 7294 6305
3058F305j872J973J885M43k349k489R91L437k340n156l058K302k532n404q25M726
$$ 6305 4433 6406 8291 8734 6385 3896 4887 8324 5984 828 -2230 72 -2460 -7864 -8689 -3963
3042c963O623L626l679k645J889N60j926J02k07L382M471m176n423p19J551j318
$$ -3963 2660 6286 2607 -38 1851 2411 485 587 380 3762 8233 4057 -1366 -2085 -534 -1852
3026a852o38M297L680J70k550o263J14J460L658N890m66n571m380O41j225M82
$$ -1852 -2490 1807 5487 5657 3107 -3156 -3042 -1582 2076 7966 7500 1929 -2451 -1810 -3035 -2553
3010b553K926K779j540k879J05L402L11p763k352M603J416j518j755J978K057
$$ -2553 373 3152 1612 -1267 -1162 2240 2551 -5212 -7564 -2961 -1545 -3063 -4818 -2840 -783
2995g83M81m39j21K44J099L35k98Q8l582j673M593J944k098l50o30J574l391j086
$$ -783 -302 -741 -862 -618 481 816 518 606 -2976 -4649 -56 1888 -210 -560 -1190 384 -3007 -4093
2977d093m71J748j056j435L33K038j0j183j258J700k36j627J210L514p22j219
$$ -4093 -4564 -2816 -3872 -5307 -4974 -2936 -2946 -4129 -5387 -3687 -3923 -5550 -4340 -826 -1548 -2767
2961b767J118J803m10m92K367J749j768N6l069m442L018K38n29j758r5L920Q70
$$ -2767 -1649 154 -256 -748 1619 3368 1600 1656 -1413 -5855 -2837 -2599 -3128 -4886 -4981 -1061 -191
2944a91k336j658l499j196J569K956p32K236l47l792J718N168J28l516k537J169
$$ -191 -2527 -4185 -7684 -8880 -7311 -4355 -5087 -2851 -3198 -6990 -5272 -104 24 -3492 -6029 -4860
2928d860J939J830O21R79K379P1o599k624L324K928K597J606k064r88M1l66l136
$$ -4860 -2921 -1091 -470 509 2888 2959 -3640 -6264 -2940 -12 2585 4191 2127 1139 1180 814 -2322
2911b322K016N907j59k28n705R2K717K06L70p39l269J86J15R17J3n56q31K978
$$ -2322 -306 5601 5442 5214 -491 -399 2318 2524 2894 2155 -1114 -928 -813 104 117 -439 -1270 1708
2893A708M563Q87k610l985O42m48l0J975L33K795n7m219r8m357j602j191l282
$$ 1708 6271 7158 4548 563 1205 757 727 2702 3035 5830 5773 1554 1456 -2901 -4503 -5694 -8976
2876h976o91N395J309j686J624J564L071L419J47j817j183j523k416o02J221p96
$$ -8976 -9667 -4272 -2963 -4649 -3025 -1461 1610 5029 5176 3359 2176 653 -1763 -2365 -1144 -1940
2860a940J51k088J021J032J185J342K12j623l475K597K466J596L52k301k6k547
$$ -1940 -1789 -3877 -2856 -1824 -639 703 915 -708 -4183 -1586 880 2476 2828 527 501 -2046
2844b046k008k884L284L028k918p71j117N10n13J688o66L008J084K33k837k005
$$ -2046 -4054 -6938 -3654 -626 -3544 -4315 -5432 -4922 -5435 -3747 -4413 -1405 -321 -88 -2925 -4930
2828d930K778l18N235J208k033n858k556N987J483j817J620l186j969J994M906
$$ -4930 -2152 -2470 2765 3973 1940 -3918 -6474 -487 996 -821 799 -2387 -4356 -2362 2544
2813B544J428q92j856k720n860L911K986P62J00l648K401L113l17l514n6k231
$$ 2544 3972 3080 1224 -1496 -7356 -3445 -459 303 403 -3245 -844 2269 1952 -1562 -1618 -3849
2797c849N71J879j84q79J445Q74L321L772K333Q1o228J155L43m372j825n08O27
$$ -3849 -3278 -1399 -1583 -2462 -1017 -143 3178 6950 9283 9364 3136 4291 4634 262 -1563 -2071 -1444
2780a444k018j958J615o34J289p36O43J777K164J682L942M40k938p01p59J662
$$ -1444 -3462 -5420 -3805 -4439 -3150 -3886 -3243 -1466 698 2380 6322 6762 3824 3123 2364 4026
2764D026K717r52k466j927J099p008k927O18J759M692J538N42j935j10k20j08
$$ 4026 6743 5791 3325 1398 2497 -4511 -7438 -6820 -5061 -369 1169 1711 -224 -334 -554 -662
2748f62j057k310J078L88r81M745K490L652Lp195j314M292j046k246J785k410
$$ -662 -1719 -4029 -2951 -2563 -3544 1201 3691 7343 7346 151 -1163 3129 2083 -163 1622 -788
2732g88k180K388J042n73J949J202l674J765L180l368l453N24K041O34L38j591
$$ -788 -2968 -580 462 -111 1838 3040 -634 1131 4311 943 -2510 -1986 55 689 1027 -564
2716e64j414m31K659k363M858j204j510k678L10l292L7L221l169K051J90Q5j614
$$ -564 -1978 -2409 250 -2113 2745 1541 31 -2647 -2337 -5629 -5592 -2371 -5540 -3489 -3299 -3214 -4828
2699d828L722k244j364L195L004J717j141k56k758k020j015J326K578j811M96
$$ -4828 -1106 -3350 -4714 -1519 1485 3202 2061 1805 -953 -2973 -3988 -2662 -84 -1895 -1399
2684a399L10j506j247L60k081R35j22K033K231K662k362o78J768O59J348J166
$$ -1399 -1089 -2595 -3842 -3482 -5563 -4628 -4750 -2717 -486 2176 -186 -864 904 1563 2911 4077
2668D077j29k133J216j505K04J038o87J181j693J955l323N87P80k051m91Rj970
$$ 4077 3948 1815 3031 1526 1730 2768 2081 3262 1569 3524 201 788 1568 -483 -974 -965 -2935
2651b935K988J109N02k54J207j097j27l58j002K642m00M69m09m744R76J665k511
$$ -2935 53 1162 1664 1410 2617 1520 1393 1035 33 2675 2275 2744 2335 -2409 -1433 232 -2279
2634b279J216P14L96j64L862K826k063m520q99K58R23L085r88q73J730L844l215
$$ -2279 -1063 -349 47 -117 3745 6571 4508 -12 -911 -653 270 3355 2367 1494 3224 7068 3853
2617C853l358l894p66k785J861K99m86j395J308L694K779L384q56l379j270J809
$$ 3853 495 -3399 -4165 -6950 -5089 -4790 -5276 -6671 -5363 -1669 1110 4494 3638 259 -1011 798
2601G98O059L485l091l710l237l700j999J208m63J369M86M60K502K476k917M238
$$ 798 6857 10342 7251 3541 304 -3396 -5395 -4187 -4650 -3281 -2795 -2335 167 2643 -274 3964
2585C964J679j32J378k450n87J85J426l419n90K115l596l054K044k58J161K979
$$ 3964 5643 5511 6889 4439 3852 4037 5463 2044 1454 3569 -27 -3081 -1037 -1295 -134 2845
2569B845j61l247j239L190j495P02L913j469l724J56k96J059J432j618J403J794
$$ 2845 2684 -563 -1802 1388 -107 595 4508 3039 -685 -529 -825 234 1666 48 1451 3245
2553C245l445k410L45J489K76l012l555J266K970R16M489J281j268j188K02j393
$$ 3245 -200 -2610 -2265 -776 -500 -3512 -7067 -5801 -2831 -1915 2574 3855 2587 1399 1601 208
2537B08n70J557J56P94j37l09J526p40q60j952j346M56K23K029K297L0l886K150
$$ 208 -362 1195 1351 2145 2008 1699 3225 2485 1625 -327 -1673 -1217 -994 1035 3332 3362 -524 1626
2519A626k27l035m69R22L326K87J065j084l410j739L142O203j044o179M3k019
$$ 1626 1399 -1636 -2105 -1183 2143 2430 3495 2411 -999 -2738 404 6607 5563 -616 -573 -2592
2503b592l152j199N717J964K47j828J15p65Q48k000m372K295L908M052J589o96
$$ -2592 -5744 -6943 -1226 738 985 -843 -728 -1493 -645 -2645 -7017 -4722 -814 3238 4827 4131
2487D131l876j376J772k35j404j081M44l116k264N731r89j519J434k287J763J296
$$ 4131 255 -1121 651 416 -988 -2069 -1625 -4741 -7005 -1274 -2263 -3782 -2348 -4635 -2872 -1576
2471a576J072n42N85O652j475n334m66J96J37p44l109k873K232J411K413J888
$$ -1576 -504 -1046 -461 6191 4716 -618 -1084 -888 -751 -1495 -4604 -7477 -5245 -3834 -1421 467
2455D67L095M630j18m763l149l088j76m8k867N63j016j619J349L713K288k620
$$ 467 3562 8192 8074 3311 162 -2926 -3102 -3150 -6017 -5454 -6470 -8089 -6740 -3027 -739 -3359
2439c359k502N6j022j696M732L222L379l375k620j313M34J406l190j163J209K77
$$ -3359 -5861 -5805 -6827 -8523 -3791 -569 2810 -565 -3185 -4498 -4064 -2658 -5848 -7011 -5802 -5525
2423e525J132L635M01J152l17j887J549p12K331m99k783k490j510K410P262Q84
$$ -5525 -4393 -758 -357 795 478 -1409 140 -572 1759 1260 -1523 -4013 -5523 -3113 4149 5033
2407E033j120J394k109K09j658j0n397j36L421r27j094K658J956L454L460J40
$$ 5033 3913 5307 3198 3407 1749 1739 -3658 -3794 -373 -1300 -2394 264 2220 5674 9134 9274
2391I274o431m808j647K465J816k48q26N102M302l800l573j409k305k095M972
$$ 9274 2843 -1965 -3612 -1147 669 421 -405 4697 8999 5199 1626 217 -2088 -4183 789
2376G89N75J088K812K17J580k174k055K03L573l105j854j734J143L25J593P45
$$ 789 1364 2452 5264 5481 7061 4887 2832 3035 6608 3503 1649 -85 1058 1383 2976 3721
2360C721j288j279L15J98K252j206j221L290j76j527n74K254k744Q85N12j663
$$ 3721 2433 1154 1469 1667 3919 2713 1492 4782 4606 3079 2505 4759 2015 2900 3412 1749
2344A749q83n08l198L0l5J643K717j548n826j650K035K533j798k095M886K566
$$ 1749 866 358 -2840 -2810 -2845 -1202 1515 -33 -5859 -7509 -5474 -2941 -4739 -6834 -1948 618
2328F18K041J229k751J089k21l829n438k668L308K599J636K474L735j770P04j981
$$ 618 2659 3888 1137 2226 2005 -1824 -7262 -9930 -6622 -4023 -2387 87 3822 2052 2756 775
2312G75k938P24q76m936J093j906n98J146k894N87m04L979L305j723L84K429N662
$$ 775 -2163 -1439 -2315 -7251 -6158 -8064 -8662 -7516 -10410 -9823 -10227 -6248 -2943 -4666 -4282 -1853 3809
2295C809J648j529L03j406j645k132j562j65K026j434J611M471k36o929j446L803
$$ 3809 5457 3928 4231 2825 1180 -952 -2514 -2679 -653 -2087 -476 3995 3759 -3170 -4616 -813
2279h13K232k063J272K630l434m01J850Q98j363k587K20K838J978l918J173L615
$$ -813 1419 -644 628 3258 -176 -577 1273 2171 808 -1779 -1559 1279 3257 -661 512 4127
2263D127J709R16j966l390k878k224K740J688L936j204l879k53J89R33K145N71
$$ 4127 5836 6752 4786 1396 -1482 -3706 -966 722 4658 3454 -425 -678 -489 444 2589 3160
2247C160l331o25k210K030k23O6k650m163L416J954j29O66l427K108L431l710
$$ 3160 -171 -796 -3006 -976 -1199 -1133 -3783 -7946 -4530 -2576 -2705 -2039 -5466 -3358 73 -3637
2231c637p64LJ953K554k49J018J464l27j094j460N2K058K220j960k437K26J560
$$ -3637 -4401 -4398 -2445 109 -140 878 2342 2015 921 -539 -487 1571 3791 1831 -606 -380 1180
2214A180j6j335K339M891k46l349J620K53k859l809l832L233O781l59q84j620
$$ 1180 1164 -171 2168 7059 6813 3464 5084 5337 2478 -1331 -5163 -1930 4851 4492 3608 1988
2198A988k011j204k100r60l65k142K759M464M0J043l65P31k141j782j447M71J07
$$ 1988 -23 -1227 -3327 -4287 -4652 -6794 -4035 429 469 1512 1147 1878 -263 -2045 -3492 -3021 -2914
2181b914J298k850l031N122R98j721L203J129Q6k858K190K143L03q26j347M0K769
$$ -2914 -1616 -4466 -7497 -2375 -1377 -3098 105 1234 1320 -1538 652 2795 3098 2272 925 965 3734
2164C734k474l250J66K319M21J432J281j67j77k078k620k984k822M113K393p61
$$ 3734 1260 -1990 -1824 495 916 2348 3629 3462 3285 1207 -1413 -4397 -7219 -3106 -713 -1474
2148a474n65k698j346j438J881K375M434J998k194j406o051m859J926M995K698
$$ -1474 -2039 -4737 -6083 -7521 -5640 -3265 1169 3167 973 -433 -6484 -11343 -9417 -4422 -1724
2133a724m01K265r31k051j933m64j163j807J462o07L856K585r15L982O02J196
$$ -1724 -2125 140 -791 -2842 -4775 -5239 -6402 -8209 -6747 -7354 -3498 -913 -1828 2154 2756 3952
2117C952l814K012Q76m005L542J379M293K82j981l828j683J534K020n20k382j877
$$ 3952 138 2150 3026 -979 2563 3942 8235 8517 6536 2708 1025 2559 4579 4059 1677 -200
2101b00J762M999k055l095o64J959K210q01M21J688J603k857L97l00j118K845
$$ -200 1562 6561 4506 1411 747 2706 4916 4115 4536 6224 7827 4970 5367 5067 3949 6794
2085F794P06l366l040J512j273k226l923k197j09p08K822K587j164J509J860q04
$$ 6794 7500 4134 1094 2606 1333 -893 -4816 -7013 -7122 -7830 -5008 -2421 -3585 -2076 -216 -1020
2069a020j257m121J530N75n92K76K781n80r73P74l663j250O33N041K954J352q79
$$ -1020 -2277 -6398 -4868 -4293 -4885 -4609 -1828 -2408 -3381 -2607 -6270 -7520 -6887 -1846 1108 2460 1581
2052A581o0K992l629l305j262J92L416J374q9M10j413J91J862l941l371K071J074
$$ 1581 1521 4513 884 -2421 -3683 -3491 -75 1299 1210 1620 207 398 2260 -1681 -5052 -2981 -1907
2035a907j819L202J576J750j464J132K33k084J218N32j673k433K28l107K70K013
$$ -1907 -3726 -524 1052 2802 1338 2470 2703 619 1837 2369 696 -1737 -1509 -4616 -4346 -2333
2019b333j915J23J082R59L915o62o95n26J443L287n069Q7L48j663j294j19k929
$$ -2333 -4248 -4125 -3043 -2084 1831 1169 474 -52 1391 4678 -391 -304 44 -1619 -2913 -3032 -5961
2002e961L813K494K68k211j184J308L350J546k430J278J838l82n513k308j407
$$ -5961 -2148 346 614 -1597 -2781 -1473 1877 3423 993 2271 4109 3727 -1786 -4094 -5501
1987e501L512L322k17m224j680L009J531R23M2R85l050m99K962N481r02k190l56
$$ -5501 -1989 1333 1116 -3108 -4788 -1779 -248 675 717 1702 -1348 -1847 1115 6596 5694 3504 3148
1970C148J407Q00l98j190k981k791M34N138j482k991K032M19K00m196J238j707
$$ 3148 4555 5355 4957 3767 786 -2005 -1571 3567 2085 -906 1126 1545 1745 -2451 -1213 -2920
1954b920j84L935j12n60j864N12L661K514m548j161N57j983K850N522k203m011
$$ -2920 -3104 831 719 159 -1705 -1193 2468 4982 434 -727 -170 -2153 697 6219 4016 5
1938Ej218k197k131K71L468J047J116J293N98j320n364L942K710J029K529J926
$$ 5 -1213 -3410 -5541 -5270 -1802 -755 361 1654 2252 932 -4432 -490 2220 3249 5778 7704
1922G704J425M34k53p866J6L06j435J043l18K175J431R7k206m111j059J575L036
$$ 7704 9129 9563 9310 1444 1460 1766 331 1374 1056 3231 4662 4759 2553 -1558 -2617 -1042 1994
1905A994M46j144P90j029K11R42O09J323m27l881r18L953K959K889O26l563K78
$$ 1994 2440 1296 2086 1057 1268 2210 2819 4142 3715 -166 -1084 2869 5828 8717 9343 5780 6058
1888F058p18j315k952k761J29M346l18k3o02j970o2K777J935O00l067k161j385
$$ 6058 5340 4025 1073 -1688 -1559 2787 2469 2446 1844 -126 -188 2589 4524 5124 2057 -104 -1489
1871a489k406J552O30J910K970k860n009K16K645M763K604K42j233k786L202K758
$$ -1489 -3895 -2343 -1713 197 3167 307 -4702 -4486 -1841 2922 5526 5768 4535 1749 4951 7709
1855G709j828j737J002m728j14j497M986q4m743j853J943K078l524k403N45K596
$$ 7709 5881 4144 5146 418 304 -1193 3793 3709 -1034 -2887 -944 1134 -2390 -4793 -4248 -1652
1839a652L862P2R38k999N69K218j114k268K085J983J232L319l919j999N538j887
$$ -1652 2210 2282 3220 221 790 3008 1894 -374 1711 3694 4926 8245 4326 2327 7865 5978
1823E978n520N30Q298r70m723j702J199k73N24Q97J247K34p61J674J501m235j365
$$ 5978 458 988 9286 8316 3593 1891 3090 2817 3341 4238 5485 5719 4958 6632 8133 3898 2533
1806B533J591l64M97r3m78N531j162j183r12r69j973k798J075K164K003L214n872
$$ 2533 4124 3760 4257 4164 3686 9217 8055 6872 5960 4991 3018 220 1295 3459 5462 8676 2804
1789B804m124l399l95J929J742L350k116n791j325J852J317j264L733L072p3K22
$$ 2804 -1320 -4719 -5114 -3185 -1443 1907 -209 -6000 -7325 -5473 -4156 -5420 -1687 1385 1312 1534
1773A534q87J032N109j208j815p28j951n69P01m215K217N360N702j886n840k52
$$ 1534 647 1679 6788 5580 3765 3037 1086 517 1218 -2997 -780 4580 10282 8396 2556 2304
1757B304K802O97m467k819M98K256k77J481K047J106n77r23l013j329J384j875
$$ 2304 5106 5803 1336 -1483 -985 1271 994 2475 4522 5628 5051 4128 1115 -214 1170 -705
1741g05J884j44j537p54J574N30j972J327O85J254Nj577k318O4k521K083N712
$$ -705 1179 1035 -502 -1256 318 848 -1124 203 888 2142 2147 570 -1748 -1684 -4205 -2122 3590
1724C590K71p70L360J683o806r84J480J761k251k403k420r29K639L621M073j543
$$ 3590 3861 3091 6451 8134 1328 344 1824 3585 1334 -1069 -3489 -4418 -1779 1842 5915 4372
1708D372j865K19k803m29m183N17J512K501J182J439K291J686r44l046R35J560
$$ 4372 2507 2726 -77 -506 -4689 -4172 -2660 -159 1023 2462 4753 6439 5495 2449 3384 4944
$$ [...]
##END NTUPLES=NMR SPECTRUM
##END=
