##TITLE=Analysis number 313752
Compound Code mo 07737
Project Code adrs
Chemist Name stores
##JCAMPDX= 6.0         $$ Bruker NMR JCAMP-DX V2.0
##DATA TYPE= NMR SPECTRUM
##DATA CLASS= NTUPLES
##ORIGIN= Bruker BioSpin GmbH
##OWNER= NMR
$$ XWIN-NMR		Version 3.5
$$ Tue Sep 20 13:45:48 2005 GMT Daylight Time (UT+1h)  MAYBRIDGE\NMR@NMR_250MHZ
##.OBSERVE FREQUENCY= 250.131544655141
##.OBSERVE NUCLEUS= ^1H
##.ACQUISITION MODE= SIMULTANEOUS (DQD)
##.ACQUISITION SCHEME= undefined
##.AVERAGES= 16
##.DIGITISER RES= 18
##SPECTROMETER/DATA SYSTEM= dpx250
##.PULSE SEQUENCE= zg30
##.SOLVENT NAME= CDCl3
##.SHIFT REFERENCE= (INTERNAL, CDCl3, 0, 16.522)
##AUDIT TRAIL= $$ (NUMBER, WHEN, WHO, WHERE, WHAT)
$$ ##TITLE= Audit trail, XWIN-NMR		Version 3.5
$$ ##JCAMPDX= 5.01
$$ ##ORIGIN= Bruker BioSpin GmbH
$$ ##OWNER= NMR
$$ C:\u/data/dgb/nmr/ADRS/9700/pdata/1/auditp.txt
$$ ##AUDIT TRAIL=  $$ (NUMBER, WHEN, WHO, WHERE, WHAT)
(   1,<2005-09-20 13:45:07.86 +100>,<MAYBRIDGE\NMR>,<NMR_250MHZ>,
      <created by zg, POWCHK disabled, PULCHK disabled
       configuration hash MD5:
       62 19 C7 07 E1 42 D1 B7 37 6C 3D D0 77 39 F9 E6
       data hash MD5: 64K
       75 0E 2F A9 54 BD C7 D6 A4 F4 06 03 33 86 DC 51>)
(   2,<2005-09-20 13:45:26.14 +100>,<MAYBRIDGE\NMR>,<NMR_250MHZ>,
      <Start of raw data processing
       ef LB = 0.3 FT_mod = 6 PKNL = 1 SI = 32K 
       data hash MD5: 32K
       3F D3 BF 0B C6 B2 DA F9 28 DB 10 A9 04 67 E4 44>)
(   3,<2005-09-20 13:45:32.08 +100>,<MAYBRIDGE\NMR>,<NMR_250MHZ>,
      <apk 
       data hash MD5: 32K
       81 E6 46 75 1B 51 27 34 A3 61 04 57 09 0B 1A B5>)
(   4,<2005-09-20 13:45:33.81 +100>,<MAYBRIDGE\NMR>,<NMR_250MHZ>,
      <abs ABSG = 5 
       data hash MD5: 32K
       DA 66 DD 80 19 16 BD E2 29 52 4E 38 B8 DA C6 39>)
$$ ##END=
$$ 
$$ hash MD5
$$ 62 70 2C 7A E7 2B 8C CA 93 00 A7 FB D1 E3 2F BE
##$RELAX= 
##$RELAX= 
##$RELAX= 
##$RELAX= 
##$RELAX= 
##$RELAX= 
##$RELAX= 
$$ Bruker specific parameters
$$ --------------------------
##$DU= <C:\u>
##$EXPNO= 9700
##$NAME= <ADRS>
##$PROCNO= 1
##$TYPE= <nmr>
##$USER= <dgb>
##$AMP= (0..31)
100 100 100 100 100 100 100 100 100 100 100 100 100 100 100 100 100 100 
100 100 100 100 100 100 100 100 100 100 100 100 100 100 
##$AQSEQ= 0
##$AQ_mod= 3
##$AUNM= <au_zg>
##$AUTOPOS= <37 >
##$BF1= 250.13
##$BF2= 250.13
##$BF3= 250.13
##$BF4= 250.13
##$BF5= 500.13
##$BF6= 500.13
##$BF7= 500.13
##$BF8= 500.13
##$BYTORDA= 1
##$CFDGTYP= 0
##$CFRGTYP= 5
##$CHEMSTR= <none>
##$CNST= (0..31)
1 1 145 1 1 1 1 1 1 1 1 1 1 1 1 1 1 1 1 1 1 1 1 1 1 1 1 1 1 1 1 1 
##$CPDPRG= <>
##$CPDPRG1= <>
##$CPDPRG2= <>
##$CPDPRG3= <>
##$CPDPRG4= <mlev>
##$CPDPRG5= <mlev>
##$CPDPRG6= <mlev>
##$CPDPRG7= <mlev>
##$CPDPRG8= <mlev>
##$CPDPRGB= <>
##$CPDPRGT= <>
##$D= (0..31)
0 1 0 0 0 0 0 0 0 0.06 0 0 0 0 0 0 0.0002 0 0 0 0 0 0 0 0 0 0 0 0 0 0 
0 
##$DATE= 1127220305
##$DBL= (0..7)
120 120 120 120 120 120 120 120 
##$DBP= (0..7)
150 150 150 150 150 150 150 150 
##$DBP07= 0
##$DBPNAM0= <>
##$DBPNAM1= <>
##$DBPNAM2= <>
$$ [...]
##$SUBNAM7= <"">
##$SUBNAM8= <"">
##$SUBNAM9= <"">
##$SW= 20.6930455092707
##$SWIBOX= (0..15)
0 0 3 0 0 0 0 0 0 0 0 0 0 0 0 0 
##$SW_h= 5175.983436853
##$TD= 65536
##$TD0= 1
##$TE= 295.16
##$TE2= 300
##$TE3= 300
##$TEG= 300
##$TL= (0..7)
0 120 120 120 120 120 120 120 
##$TP= (0..7)
150 150 150 150 150 150 150 150 
##$TP07= 0
##$TPNAME0= <>
##$TPNAME1= <>
##$TPNAME2= <>
##$TPNAME3= <>
##$TPNAME4= <>
##$TPNAME5= <>
##$TPNAME6= <>
##$TPNAME7= <>
##$TPOAL= (0..7)
0.5 0.5 0.5 0.5 0.5 0.5 0.5 0.5 
##$TPOFFS= (0..7)
0 0 0 0 0 0 0 0 
##$TUNHIN= 0
##$TUNHOUT= 0
##$TUNXOUT= 0
##$USERA1= <user>
##$USERA2= <user>
##$USERA3= <user>
##$USERA4= <user>
##$USERA5= <user>
##$V9= 5
##$VALIST= <valist>
##$VCLIST= <CCCCCCCCCCCCCCC>
##$VD= 0
##$VDLIST= <DDDDDDDDDDDDDDD>
##$VPLIST= <PPPPPPPPPPPPPPP>
##$VTLIST= <TTTTTTTTTTTTTTT>
##$WBST= 1024
##$WBSW= 4
##$XGAIN= (0..3)
0 0 0 0 
##$XL= 0
##$YL= 0
##$YMAX_a= 619704
##$YMIN_a= -619273
##$ZGOPTNS= <>
##$ZL1= 120
##$ZL2= 120
##$ZL3= 120
##$ZL4= 120
##$ABSF1= 16.522
##$ABSF2= -4.171173
##$ABSG= 5
##$ABSL= 3
##$ALPHA= 0
##$AQORDER= 0
##$ASSFAC= 0
##$ASSFACI= 0
##$ASSFACX= 0
##$ASSWID= 0
##$AUNMP= <proc_1d>
##$AZFE= 0.1
##$AZFW= 0.1
##$BCFW= 0
##$BC_mod= 0
##$BYTORDP= 0
##$COROFFS= 0
##$CY= 12.5
##$DATMOD= 1
##$DC= 0
##$DFILT= <>
##$DTYPP= 0
##$F1P= 14.0000005364418
##$F2P= -0.99999901652339
##$FCOR= 0.5
##$FTSIZE= 32768
##$FT_mod= 6
##$GAMMA= 0
##$GB= 0
##$INTBC= 1
##$INTSCL= 1
##$ISEN= 128
##$LB= 0.3
##$LEV0= 0
##$LPBIN= 0
##$MAXI= 10000
##$MC2= 0
##$MEAN= 0
##$ME_mod= 0
##$MI= 0
##$NCOEF= 0
##$NC_proc= -2
##$NLEV= 6
##$NOISF1= 0
##$NOISF2= 0
##$NSP= 0
##$NTH_PI= 0
##$NZP= 0
##$OFFSET= 16.522
##$PC= 1
##$PHC0= -79.05457
##$PHC1= 4.040257
##$PH_mod= 1
##$PKNL= yes
##$PPARMOD= 0
##$PSCAL= 4
##$PSIGN= 0
##$REVERSE= no
##$SF= 250.13
##$SI= 32768
##$SIGF1= 0
##$SIGF2= 0
##$SINO= 400
##$SIOLD= 32768
##$SREGLST= <1H.CDCl3>
##$SSB= 0
##$STSI= 32768
##$STSR= 0
##$SW_p= 5175.98343685301
##$SYMM= 0
##$S_DEV= 0
##$TDeff= 65536
##$TDoff= 0
##$TI= <Analysis number 999999
Compound Code 99
Book Reference 9
Project Code 9>
##$TILT= no
##$TM1= 0
##$TM2= 0
##$TOPLEV= 0
##$USERP1= <user>
##$USERP2= <user>
##$USERP3= <user>
##$USERP4= <user>
##$USERP5= <user>
##$WDW= 1
##$XDIM= 32768
##$YMAX_p= 332510996
##$YMIN_p= -50168
$$ End of Bruker specific parameters
$$ ---------------------------------
##NTUPLES= NMR SPECTRUM
##VAR_NAME=  FREQUENCY,     SPECTRUM/REAL,   SPECTRUM/IMAG
##SYMBOL=    X,             R,               I
##VAR_TYPE=  INDEPENDENT,   DEPENDENT,       DEPENDENT
##VAR_FORM=  AFFN,          ASDF,            ASDF
##VAR_DIM=   32768,         32768,           32768
##UNITS=     HZ,            ARBITRARY UNITS, ARBITRARY UNITS
##FACTOR=    0.157963299565203, 1,           1
##FIRST=     4132.6476996994, 0,             0
##LAST=      -1043.33573715361, 0,           0
##MIN=       -1043.33573715361, -50168,      0
##MAX=       4132.6476996994, 332510996,     0
$$ Real data points
##PAGE= N=1
##DATA TABLE= (X++(R..R)), XYDATA
$$ [...]
17360c457K094P49l860M00M860l042L183P910R178o36k252k766N573l42l379J305
17344A5518j1118p428l577r14P538j691q966n040j427m887N151O024j255P176
17330d896N894m405m715n235L701N310N925o245o41L772l757j417j28K30N930
17315f77m4o824l516N723J94L155j161m385K431P740L634m291j523n025J499K838
17299b32k488j872J229K755r74j682m343k681l022Q842m3j735j650m585n030k1
17283a7532Q386L571l210m888Q723M262L511p01r361p10J881K009P923l17l709
17268a62j657K91P0o07q917J74J2743J716r246r383N155R122k163L374N154m510
17252A154l807l221m28O686k147l997j151n216n49m3k973L564P035K942m941m66
$$ y = [-3457, -1363, -614, -4474, -4074, 786, -2256, 927, 8837, 18015, 17379, 15127, 12361, 17934, 17592, 14213, 15518, 4400, -3028, -6605, -7519, 19, -1672, -10638, -15678, -17105, -21992, -16841, -10817, -12072, -4896, 998, -3407, -8122, -13357, -9656, -4346, 1579, -4666, -5307, -1535, -5292, -6709, -6837, -6607, -677, -721, -7545, -11061, -5338, -5144, -1989, -3150, -7535, -5104, 2636, 6270, 1979, 456, -4569, -3070, -232, -2720, -4592, -3363, -608, -1582, -3264, -7607, -10288, -13310, -4468, -4511, -6246, -7896, -12481, -17511, -17532, -9146, -5575, -8785, -13673, -4950, -688, 2823, 2122, -7239, -7949, -6068, -4059, 3864, 3547, -162, -1819, -1528, -1458, -2065, -10982, -10808, 1935, 3651, -5595, -14978, -9823, -701, -2864, 510, 5664, 1154, -2653, -5874, -6302, 384, -1763, -5760, -6911, -12127, -12676, -12719, -15692, -12128, -5093, -2151, -7092, -7558]
17236g558J363l254J974J0L583K355k076L692N286K670j0175n595N244l684j0289
17221a6454R255Q575N018l690k189K65j724J496o168R31J486L386p03o441j448
17206h405K754o05O926K855j810o739n994O271J616q97K742J724k372n902P831
17191eO258K086n539p958k236L102o71n631J402K870O13P552J848o050k230K276
17175b313L436L741K577m570k385M19m832m365j472m746n720N956J1271J93m916
17160g726M233M54K30j726K462M478n145p901r427k133Q512O231l726l87L9j283
17144a2815M435O902P768m31n658j903l208l152p400L006N944J415K581M965K939
17129E388l407o72n339l07K023L697l654K530j439k61o660m26o45j881Q86J685
$$ y = [-7558, -6195, -9449, -7475, -7465, -3882, -1527, -3603, 89, 5375, 8045, -2130, -7725, -2481, -6165, -16454, -7199, 1376, 6394, 2704, 515, 780, -944, 552, -5616, -4685, -3199, 187, -516, -6957, -8405, -5651, -6256, 670, 3525, 1715, -5024, -11018, -4747, -3131, -4028, -1286, 438, -1934, -7836, -5, 6253, 8339, 2800, -5158, -7394, -4292, -4963, -10594, -9192, -6322, -5709, 1843, 3691, -2359, -4589, -2313, 1123, 4864, 7441, 2871, 486, 905, -3927, -8292, -9764, -14510, -20230, -14274, -3003, -2810, -7726, -3493, -3039, -2809, -4535, -2073, 2405, -2740, -10641, -20068, -22201, -13689, -7458, -11184, -11571, -11532, -12815, -8380, -1478, 6290, 5859, 201, -1702, -4910, -8062, -15462, -12456, -6512, -5097, -2516, 2449, 5388, 1981, 1309, -4030, -4337, -2314, 1383, -2271, 259, -1180, -1441, -8101, -8527, -9172, -11053, -10167, -8482]
17113h482Q845K484J043J228j852o599L76j091m684N430o91k723l443L717j485
17098g927M143K114M04j90J284m339K600O79P0m584o57O97R93L308N981K494k930
17081D140n564o147j691M20K564Q801J256n057K81m448j0625l492K459L949Q179
17066d975M245K913R32k982q825r640N515L451o32l920m810L061J0137R99l006
17051g537j524L019K795N837O089l356j3043q212n212Q108M307m113L48o88j865
17036a5047N389J458J200K955m331k369n80j279J419J389M495Q59K469N069p757
17021d661j218M672M262m117q536o081k190L354N079K971L051N593N228l278j491
17006B638p20j841J512O225k37l800k233r36J400l362j0438l525K589N545N870
$$ y = [-8482, 363, 2847, 3890, 5118, 3266, -3333, -2957, -4048, -8732, -3302, -3993, -6716, -10159, -6442, -7927, -3784, -1670, -1266, -1456, -172, -4511, -1911, -1232, -1162, -5746, -6403, -5706, -4713, -1405, 4576, 7070, 4140, -1424, -7571, -9262, -8842, -6278, 2523, 3779, -1278, -997, -5445, -16070, -19562, -17103, -13154, -4975, -730, 2183, 3115, 133, -8692, -18332, -12817, -9366, -9998, -13918, -18728, -15667, -5530, -4531, -7537, -9061, -6042, -3247, 2590, 8679, 5323, -7720, -15932, -21144, -13036, -8729, -12842, -12494, -13182, -15047, -9658, -8200, -7000, -4045, -8376, -10745, -11325, -12604, -11185, -9796, -5301, -4442, -1973, 3096, -4661, -5879, -1207, 3055, -1062, -9598, -15679, -17869, -14515, -9436, -6465, -3414, 2179, 7407, 4129, 2638, 1918, 77, 1589, 7814, 7577, 3777, 1544, 608, 2008, -1354, -11792, -15317, -12728, -7183, -1313]
16991a313j870m849K363M618L268m030k209l980p255K014O791K705k317J609M271
16976a84K525n589m760N207J710l503j895J80M343M81n184o68j689N682J16l543
16960f771J890L764j832K171J052j256K674M08K548k750k729L129K767k40J898
16945F723M34j3807j2447N369O565L721n82L641m373q874j092Q154J0486j023
16931B895r257k432j49j554L91N762j112j732k192O44j306n467p5L476P364L651
16915a093O06j952q172j943O078L580o11K746m125j100O861o53o178m787J958
16900h785N043R24p584N049M284N256M750r017n033n440k334L439J529k769O37
16885a0051L887K647k193q207n857M414k730J367J037k342l592L397K478l453
$$ y = [-1313, -3183, -8032, -5669, -1051, 2217, -1813, -4022, -8002, -15257, -13243, -6452, -3747, -6064, -4455, -184, 2341, -3248, -8008, -2801, -1091, -4594, -6489, -6309, -1966, -1485, -6669, -7337, -9026, -3344, -3228, -6771, -4881, -1117, -2949, -778, 274, -982, 1692, 2100, 4648, 1898, -831, 2298, 5065, 4825, 6723, 7157, -6650, -19097, -13728, -7163, -3442, -4024, -383, -4756, -13630, -14722, -6568, 3918, 2895, -6362, -8794, -8943, -10497, -10106, -4344, -5456, -7188, -9380, -8736, -10042, -15509, -15584, -12108, -4744, -1093, -487, -2439, -10611, -12554, -6476, -2896, -3507, -761, -4886, -5986, 875, 222, -5956, -10743, -8785, -3742, -2818, -10402, -5353, -1069, 4187, 8937, -80, -5113, -10553, -12887, -9448, -7919, -10688, -10051, -6164, -3517, -5710, -13917, -19774, -15360, -18090, -16723, -15686, -18028, -21620, -18223, -15745, -19198]
16871a9198O352M651L93k443M214N986n00n136k967k804Q58J911k338l291j216
16856a5528M827P058P139L793M023l904k028m861l221m30K765Q83j792k024R32
16841b368L082n80r381j266L970N95l869j243M020J631J34J391R14m751j003L696
16825e028n832k801k490J318O886P14N597Q938j439p233L36K245K339M323k411
16810E462l625j482j86k322n609r68l67O187L189k708n858M764M501k564k126
16795c712n071j448l213O1J902O817K431p278q024N060M335o9M795k435k108Q61
16779g096n1R21j147L683O323j191n238m034L184J346j270K640j606l873L387
16764d022N740o29k175l000j064m95O738j450R67L593k706l23j621l911r36K095
$$ y = [-19198, -12846, -8195, -7802, -10245, -6031, -45, -545, -5681, -8648, -11452, -10594, -8683, -11021, -14312, -15528, -10701, -3643, 3496, 7289, 11312, 7408, 5380, 519, -2702, -3132, -367, 516, -1276, -3300, -2368, 714, 134, -9247, -10513, -6543, -5948, -9817, -11060, -7040, -5409, -5275, -3884, -2970, -7721, -8724, -5028, -10860, -13661, -16151, -14833, -7947, -7233, -1636, 7302, 5863, -1370, -1034, 1211, 3550, 7873, 5462, 1837, 355, 169, -2153, -7762, -8730, -9097, -2910, 279, -2429, -8287, -3523, 978, -1586, -3712, -8783, -10231, -13444, -13383, -11481, -4664, -2233, -9511, -17535, -12475, -8140, -8209, -3414, -5849, -7957, -7096, -7147, -6226, -7373, -3690, 2633, 1442, -3796, -7830, -4646, -3300, -4570, -1930, -3536, -7409, -4022, 1718, 1089, -1086, -4086, -5150, -5645, 1093, -357, 610, 4203, 1497, 1174, -447, -4358, -5294, -3199]
16748c199J580J594l681j606K691L30K36M990P627j53J10j0741o016m152M569
16733e821n235j217M368P83P12K002O977K730l77k346l504o531k455j737r70O540
16717f081N965k201j734m325m483l738L327L11P94j830N048L219l301K359Rl640
16701a0301k583K445K743K789j105o571l188N312O708k489k34N642O47q246p181
16686a5612L270Q596R23J040p30l413l753O46k812J831L70L299N145o137m900
16671a2237N14K490m398K991Q750M875q684Q51K854l807P3Q2J870k720j708N48
16655g656L65n79O70M343k99o615j390k50K365q54L142K60l39p26M591p322j888
16638a2182K081K050l172l356P79J051k646j814k947O028J757l590P507L361j048
$$ y = [-3199, -1619, -25, -3706, -5312, -2621, -2291, -2055, 2935, 10562, 10409, 10519, -222, -6238, -10390, -5821, -11056, -12273, -7905, -7122, -6410, -4408, 2569, 5299, 4922, 2576, -928, -7459, -9914, -11651, -12621, -6081, -116, -2317, -4051, -8376, -12859, -16597, -13270, -12959, -12165, -13995, -8947, -5728, -9029, -6670, -6661, -10301, -12884, -10439, -7696, -4907, -6012, -12583, -15771, -10459, -3751, -6240, -6474, -832, -185, -8431, -15612, -12342, -3746, -2823, -1783, -2513, -5926, -9679, -9033, -11845, -10014, -9644, -6345, -1200, -7337, -12237, -11723, -9233, -13631, -10640, -1890, 2985, -5699, -4848, -1994, -5801, -5728, -5646, -3776, -6496, -8204, -7656, -7291, -7870, -7200, -2857, -3156, -9771, -11161, -11411, -9046, -9900, -6758, -6498, -6837, -7563, -2972, -10294, -12182, -10101, -8051, -11223, -14579, -13800, -12749, -15395, -17209, -20156, -14128, -12371, -15961, -8454, -5093, -6141]
16623f141O747N074o763q928j918j365o21K82K870J2838N955l72l902l786J571
16608A541k884j586o80P706K401J215m968p783N929K163j298L10j225k747m008
16593e914k490R98K386l093l131J42k174j171O188K348p72j031K21j307L241l139
16577h698k103j055K857M157N148J046p602m921j80m122n863K644Q70o12K444
16562a5990J0720N429j979Q28k07m813k335o591j223J118K61M840N337L541K319
16547A255o78M455j820J068k95j72j0250j066o42K654M502J01O72n197o409P20
16531a1102l238j144M342M104j149J808o428k365P372M161j092M801L084m824
16517a670L41J08l37j490k68k74n151K630O091L510k113M03K220j36l547k343
$$ y = [-6141, 606, 5680, -1083, -10011, -11929, -13294, -13915, -13633, -10763, 2075, 8030, 7658, 3756, -30, 1541, -1343, -2929, -3609, 4097, 6498, 7713, 2745, -5038, 891, 3054, 1756, 2066, 841, -1906, -5914, -8404, -7406, -5020, -8113, -11244, -11102, -13276, -14447, -8259, -5911, -6683, -7714, -7493, -8800, -5559, -8698, -10801, -11856, -8999, -4842, 306, 1352, -6250, -11171, -11351, -15473, -21336, -18692, -17822, -18434, -15990, -5270, 159, -1820, -992, -1199, -6012, -8347, -14938, -16161, -15043, -14782, -9942, -4605, -1064, 1255, 577, 5032, 3212, 4280, 3985, 3813, -6437, -7503, -8145, -5491, -989, -888, -216, -5413, -11822, -11102, -14340, -15484, -11142, -7038, -8187, -6379, -12807, -15172, -7800, -3639, -4731, 70, 3154, -1670, -1329, -1221, -1558, -3048, -3316, -3590, -8741, -6111, -20, 3490, 1377, 1780, 4000, 3864, 317, -2026]
16501b026m708m328j829O99m89P971M77M26N668N41K637p060j2614K956N40J362
16485i777N031q211L427K963l026n383J345o01J468L220P98p82o351m097O132
16470a3844P861j382mJ353L011n671k572O61J75L766J0799l313q806L357L696
16455i13J545L459l082q261n996R59R95P16m907j75J0251L608m171j76o10k9Q00
16438e987N829P511J762k675l138j5K184q906J677J156J721M599J630L097l488
16423F957m660o927J503J600k009M993J82j062N398j0092o620N94j540r87O963
16408e707K529k473p99K923Q99K452Q460P120m755o259l096o355l764k03M46J104
16392g478l531o83l431L232L76M073k718j726L210M30J948j531n66J282K031K091
$$ y = [-2026, -6734, -11062, -12891, -12192, -12681, -4710, -4233, -3807, 1861, 2402, 5039, -2021, -14635, -11679, -11139, -9777, -4746, -12957, -9530, -6567, -9593, -14976, -13631, -14232, -12764, -9544, -8746, -9528, -15879, -19976, -13844, -5983, -7365, -7369, -6016, -3005, -8676, -11248, -10587, -10412, -6646, 4153, 840, -7966, -4609, -913, 632, 4091, 1009, -7252, -13248, -12289, -11294, -10578, -15485, -15660, -5409, -1801, -5972, -6148, -6758, -6787, -5987, -158, 7353, 9115, 6440, 3302, 3287, 5471, -3435, -1758, -602, 1119, 5718, 7348, 10445, 6957, 2297, -4630, -3127, -1527, -3536, 1457, 1639, 577, 5975, -4117, -10737, -10143, -11683, -12670, -5707, -3178, -5651, -6450, -3527, -2628, -176, 8284, 15404, 10649, 4390, 1294, -5061, -8825, -9028, -8582, -7478, -11009, -11692, -15123, -11891, -11515, -7442, -10160, -11886, -8676, -8246, -6298, -7829, -8395, -7113, -5082, -2991]
16376b991R880m96k007p039L91J141M648J379q32j455p0n339j4612o379P513R770
16360f498M513M848n906N44Q47K030M77p929k895L07k814J702O515K558n841o53
16344h195n569K660j061K634K507j0585k108L683K563K022k51j360J645M489m98
16329g424P23M081N52M530j019p495m965J53M755N41l802k959l807k004J371j119
16313a7888p00k226O155K706L871K873j413M36P492M060m966m007n700k299L573
16298h033K442N1P100R55o373p933J126O36R73N669k880l675Q828Q68j709K804
16282H49K517J796l758j241L609K559k275p321j564K514M870k096L276J407k392
16267B750q74j811m592J216P563M93m224J056m174r65N0l877l94L451L847K613
$$ y = [-2991, 6889, 6393, 4386, -2653, -2262, -1121, 3527, 4906, 4074, 2619, 2549, -2790, -17402, -23781, -16268, -6498, -1985, 2863, -3043, -2499, -1652, 378, 855, -7074, -9969, -9662, -12476, -10774, -4259, -1701, -7542, -8195, -13764, -11104, -12165, -9531, -7024, -17609, -19717, -16034, -13471, -11449, -11700, -13060, -11415, -6926, -7424, -6701, -2620, -2068, 2462, 1443, -6052, -11017, -10864, -6109, -5568, -9370, -12329, -16136, -18140, -16769, -17888, -18588, -20814, -14659, -11953, -8082, -5209, -6622, -6186, 1306, 5366, 400, -3607, -9307, -11606, -8033, -5591, -5540, 1560, 2515, -3858, -11791, -10665, -10029, -9056, -3387, -6267, -9942, -1114, -246, -1955, 849, 3366, 5162, 1404, 163, 3772, 6331, 4056, -3265, -4829, -2315, 2555, 459, 3735, 5142, 2750, 1876, 65, -4527, -3311, 4252, 4745, 521, 1577, -2597, -3562, -3512, -7389, -7783, -4332, -485, 2128]
16251B128L82l733n120k209n04O025l1n769p04M939L52l167l619o948J041O149
16235a0788N074N376K856k863j623q510l046M989K692k188J632N426l304l882
16221h159q440q58J663N092N034M6J212j714K962O186p790n846L796j460N633
16206b643j730n04J625l583k11p019K760J0835R33j485N47m589n142m736P300
16191g642N134J369K073L766J079m919k643k675K193P901n64k792q10j869l90
16176g89L667k841q321n566O033j86L530K8n432l204r84J858K371M970J495R50
16160b421m405l524P53k615K518K390M879o15O527o43l732K191J963m515k588
16145c837n961k975k045K119J353m971J133M544j770j028O738O578J710o056k742
$$ y = [2128, 2510, -1223, -6343, -8552, -9056, -3031, -3062, -8831, -9535, -4596, -4244, -7411, -11030, -17978, -16937, -10788, -5714, -338, 2518, -345, -1968, -10478, -13524, -8535, -5843, -8031, -6399, -973, -4277, -8159, -16599, -17457, -15794, -10702, -5668, -5622, -4410, -6124, -3162, 3024, -4766, -10612, -6816, -8276, -2643, -4373, -4877, -3252, -6835, -7046, -14065, -11305, -470, 463, -1022, -475, -5064, -10206, -14942, -7642, -2508, -1139, 934, 4700, 5779, 860, -1783, -4458, -2265, 5636, 5072, 2280, 1470, -399, -789, 2878, 37, -8284, -13850, -7817, -8003, -4473, -4445, -9877, -13081, -14065, -12207, -9836, -4866, -3371, -2421, -6826, -10350, -9597, -12212, -9694, -7304, -2425, -3040, 3487, 2844, -888, 1303, 3266, -1249, -3837, -9798, -12773, -14818, -12699, -11346, -16317, -15184, -10640, -12410, -13438, -6700, -122, 1588, -4468, -7210]
16130g210J473k741J464O043R52l084K860K228k875j661j339j04J15l298J655
16115e522p2Q21J984N715l517m545j193N10p95k130N518N176j206n685l210n29
16099h680k075n157J178P249K735p51M968K486j244m043n207k179L337N135m223
16084f471j069K089L639K695l928K791j099m094l96k802Q51K674n425L007m68
16069h006K50J221P041M862m126J508P374P602n200n710K45J042j104k251L215
16054G963K027n27p300p729j917M161K262J16J6N662K932L287o965n795l406j23
16038e336o126R95P243K224K618k69J372m961l607n406m046q95o451O170Q673
16023g802l87o27L007o54L345l492m461M242k43l966q108k248O981L424N089K762
$$ y = [-7210, -5737, -8478, -7014, -971, -19, -3103, -243, 1985, -890, -2551, -3890, -3994, -3879, -7177, -5522, -5594, -4773, -2789, 2926, -591, -5136, -6329, -5819, -6614, -8744, -3226, 1950, 744, -4941, -8151, -8680, -10755, -15912, -14734, -7485, -4750, -5501, -533, 1953, 709, -3334, -8541, -10720, -7383, -2248, -6471, -7540, -5451, -1812, 883, -3045, -254, -1353, -5447, -5843, -8645, -7794, -5120, -10545, -7538, -8006, -7756, -6535, 506, 5368, 1242, 2750, 10124, 17726, 12526, 6816, 7061, 8103, 6999, 4748, 7963, 9990, 9463, 2163, -5566, -7483, -3322, -1060, -944, -928, 4734, 7666, 10953, 3988, -1807, -5213, -5336, -11462, -10467, -3224, -1000, 1618, 1349, 2721, -2240, -5847, -11253, -15299, -16194, -22645, -16475, -7802, -8189, -8816, -5809, -6463, -3118, -6610, -11071, -6829, -7072, -11038, -19146, -21394, -14413, -10989, -5900, -3138]
16007c138K006K680N081J606p284J566k774k016l19L847n822l907j302J620J755
15992f401K938P048l091l451j09q997k159O589J131K072J713N50M092Q064j795
15977H194j225l953K112o274n004l155K424k075L861p12k101Q63M422L097O628
15962G102J999j603m063l740k471l711j585L928k400k85j72m537M747J508k12
15947e495q172m656J004p59q645O811L751m389M109K805O228J914k746L300P84
15932d156k241j847j528M352O649o46K707l980k054J058l595m485L912M24m730
15917a0160l449N25L088J836j449J432k363N364p50l331N382M927l875M09N124
15902B710L37L632L902j995j0398r45N082M262m139k028j450J426K336k220k074
$$ y = [-3138, -1132, 1548, 6629, 8235, 951, 2517, -257, -2273, -2592, 1255, -4567, -8474, -9776, -8156, -6401, -3463, 3585, 494, -2957, -3066, -12063, -14222, -7633, -6502, -4430, -2717, -2167, 1925, 9989, 8194, 6969, 3016, 5128, -1146, -6150, -9305, -6881, -8956, -5095, -5807, -7908, -7045, -2623, 474, 7102, 9101, 7498, 3435, -305, -2776, -6487, -8072, -4144, -6544, -6829, -7001, -11538, -6791, -5283, -5495, -13667, -18323, -17319, -18078, -26723, -19912, -16161, -20550, -16441, -13636, -7408, -5494, -8240, -4940, -4156, -6397, -8244, -9772, -5420, 1229, 583, 3290, -690, -2744, -1686, -5281, -9766, -5854, -5430, -10160, -13609, -13084, -9996, -8160, -9609, -8177, -10540, -5176, -5926, -9257, -3875, 1052, -2823, -2414, 2710, 3047, 6679, 10581, 8586, -1812, -2757, 2325, 6587, 2448, 420, -1030, 396, 2732, 512, -1562]
15887a562K506j076l857j825R25j869n77L576j285n49L340K242n9Q77M90j581
15871b84q99l735P307l14k114J308r08l350K632k962N33N667O90m478k902L328
15855d81m182K460M252n232j877J011R4l143J685J57l27L145o67J657K044j103
15839e07p973M22Q00k253K699N583k605n155n102K74K293P318K584p148m833O328
15823g275R380M495m496L056P87n571q799J849N281M527R95q356j497m89p047
15808a3160m675L167P771N906n440R11o314J362j463K634P267Q136K599l334J368
15793F735J761m602j3280J031J47J782O484L384j276n369m225l726L172L514M257
15778b11j919N881L937n814o339J936o241n381o59L128o65k957k52J205P95M800
$$ y = [-1562, 944, -132, -3989, -5814, -4889, -6758, -7335, -3759, -5044, -5593, -2253, -11, -70, 807, 1297, -284, -1183, -4918, 2389, 2075, -39, 1269, 361, -2989, -357, -3319, -2786, 2881, 3571, -907, -3809, -481, -4663, -2203, 2049, -3183, -5060, -4049, -3955, -7098, -5413, -5256, -5583, -2438, -3105, -1448, 596, -507, -8480, -8058, -7258, -9511, -6812, -1229, -3834, -8989, -14091, -13817, -11524, -4206, -1622, -8770, -13603, -7275, 2105, 6600, 2104, 5160, 5947, 376, -8423, -6574, -1293, 3234, 4229, -4127, -5624, -6113, -13160, -17835, -14668, -6897, -991, -6431, -5520, -11834, -10472, -11935, -9301, -2034, 6102, 8701, 5367, 6735, 8496, 3894, -9386, -8355, -8208, -6426, 58, 3442, 2166, -3203, -7428, -11154, -7982, -4468, -211, -2130, 3751, 7688, 1874, -4465, -2529, -8770, -14151, -14810, -11682, -12347, -15304, -15556, -14351, -13556, -8756]
15762h756L453j755P5l32J368J264q73L987O994P88r333l219J680N887J80m074
15746b666n574J057K610P296m531n077K346M983j424l537k237l563L717Q813p46
15731A467k139k126n573n217p7M685k11J726j818j690o06L178K510L462J351k089
15715c167p08N230M027Q058o077j2565m293J295j534K323j073M388N299j902n349
15700f048j245L368K991L908r2n889Q85n526l470r357k027Q809Q483M454k46n768
15684f770J448J229L169J066P650L701n286m081n416K729R547n272p01K075l454
15669A634N99L927Q045j1656j0245m27J607M988N181o92l457p019k335L459K398
15654c993k039O92K827N470j927n332m788o7J022J696Q24P145P420J485n871j0700
$$ y = [-8756, -5303, -7058, -6983, -7315, -5947, -4683, -5556, -1569, 5425, 6213, -3120, -6339, -4659, 1228, 1408, -2666, -8240, -7183, -4573, 2723, -1808, -6885, -4539, 444, -980, -4517, -6754, -10317, -6600, 2213, 1467, -672, -2798, -8371, -13588, -13665, -8980, -9191, -7465, -9283, -10973, -11579, -8401, -5891, -2429, -1078, -3167, -3875, 1355, 5382, 13440, 7363, -5202, -9495, -8200, -9734, -7411, -8484, -4096, 1203, -699, -6048, -7293, -3925, -934, 2974, 2882, -3007, -2122, -7648, -11118, -20475, -22502, -13693, -5210, -756, -1002, -6770, -5322, -4093, -924, 142, 7792, 11493, 6207, 2126, -3290, -561, 8986, 3714, 3013, 5088, 1634, 2233, 6160, 14205, 2549, -7696, -8123, -6516, -1528, 3653, 2961, -496, -7515, -9850, -6391, -3993, -6032, -5340, -2513, 2957, 1030, -4302, -9090, -9157, -8135, -6439, -5615, 1530, 8950, 10435, 4564, -6136]
15638f136J829P42n326l414M374O955j725k668o63j950k438K254J838J32q63k842
15622i901k406O611L345k477r54J58R874L942o369j1772o4M392N47O064K030Q99
15606C919N44k522j090n521m83O90P014L197o765L001J1258r99j0718p042L83
15591e134k433k215M80M130k83K159M553k092L21l424o875j86N694J335l391r68
15575h329m14m115k508K764P668N4K117L724k457N248J365J491J100k7p072j392
15559g83k246q2n6q06L273K739l116m538l144j781P118o05L34M13K248j579J555
15542a056J053J470M66l793k807j548P731L993j842k747l947L511M947k791l485
15527h45k975J964k95O063R23m385o628q597m521k282J537R195N504R35K983m499
$$ y = [-6136, -4307, -3565, -8891, -12305, -7931, -976, -2701, -5369, -6032, -7982, -10420, -8166, -6328, -6196, -7059, -9901, -12307, -5696, -2351, -4828, -5782, -5624, 4250, 8192, 1823, -9949, -10013, -5621, -5074, 990, 3020, 3919, 4463, 1941, 851, -4670, -5153, -4463, 2551, 5748, -1017, 1984, 13242, 12243, 1525, -5517, -5134, -7567, -9782, -9302, -5172, -5455, -3296, 1257, -835, -514, -3938, -10813, -10999, -5305, -3970, -7361, -8329, -8743, -12858, -15366, -12602, -4934, -4880, -2763, 961, -1496, 3752, 5117, 6608, 7708, 7681, 609, -783, -3029, -3111, -3167, -3973, -700, 2039, -1077, -5615, -8759, -10540, -3422, -4027, -3693, -3280, -1032, -2611, -1056, -3, 1467, 1933, -1860, -4667, -6215, 1516, 5509, 3667, 920, -3027, 484, 5431, 2640, -845, -3820, -1856, -2151, 3912, 4835, 450, -6178, -14775, -19296, -21578, -20041, -10846, -5342, -4407, -1424, -5923]
15511e923r51L20P266O95n762L898R144n52n492m029l743J314j920R01J467o165
15495i532k534o58K128L447L746j08k761N5o73J921J0155M413m972l00L814q246
15479a05J121K234J58k907o629O034M321l327p597K336J327j11j95k823M208R285
15463G330l354m689K551m713J20k657j747J069M923m34p924J577L683k819L336
15448c748M32L740N133k958m473M22k322m937N00l889P414N583j199j591n876
15433g769k479R10O67L018K018N451K403k420m684L44P69n614k877O25J254N547
15417b837M902j374L001N059j391J0q275J023J620J744k992M832P945K84n2p825
15401E674J41o461m949L813O71K367k308N189K618n483J852K368o798o346m562
$$ y = [-5923, -6874, -6554, 712, 1407, -4355, -457, 8687, 8135, 2643, -1386, -5129, -3815, -5735, -4834, -3367, -9532, -12066, -12724, -10596, -7149, -3403, -3511, -6272, -6217, -6890, -4969, 5186, 9599, 4627, 4327, 8141, -105, 1016, 3250, 3408, 501, -6128, -94, 4227, 900, -6697, -4361, -3034, -3145, -3340, -6163, -1955, 7330, 3976, -713, 1838, -2875, -2755, -5412, -7159, -6090, -1167, -1601, -9525, -7948, -4265, -7084, -3748, -3316, 424, 5557, 2599, -1874, -1452, -3774, -8711, -8211, -12100, -4686, 897, -302, -1893, -7769, -10248, -9338, -8671, -5653, -3635, 1816, 4219, 1799, -2885, -2541, -1772, -7386, -10263, -9638, -8384, -2837, 2065, 691, 3692, 8751, 7360, 7370, -905, 118, 1738, 3482, 490, 5322, 13267, 13551, 13499, 5674, 5815, -646, -5595, -1782, -1111, 1256, -1052, 4137, 6755, 1272, 3124, 5492, -1306, -7652, -12214]
15386a2214j296M868Q077R91l395l153p546j816L871M970K917o79L298l821k419
15371g347M74J628l742j329K311J307O281L902L556m325l219N28j454o4k0m492
15355f005J065k062l683Q475N603m811R72R96m631L659K809n909n655k909K47
15340a1839M334k989n467J113P329N479j572k749k047J585J640k230k715l347
15326a3475k320N402N820M306M075L795j681j267l800l078K361K13k402L025M125
15311E099j932K924L619j670K41J955m176m504km141J84P78p90M78n172j547K975
15294e681M992N559j878o822J387k198l195N332J728k990j798m668j648M148L050
15279d682L375N366O324m571q637J24N294J603J791L34o511j362J331j642O05
$$ y = [-12214, -13510, -8642, -565, 426, -2969, -6122, -13668, -15484, -11613, -6643, -3726, -4405, -1107, -4928, -7347, -6873, -5245, -8987, -10316, -8005, -6698, -417, 3485, 7041, 2716, -503, 25, -1429, -1493, -1513, -6005, -4940, -7002, -10685, -2210, 3393, -1418, -446, 550, -4081, -422, 2387, -3522, -9177, -12086, -11839, -7505, -10494, -15961, -14848, -7519, -2040, -3612, -6361, -8408, -6823, -5183, -7413, -10128, -13475, -15795, -10393, -4573, -267, 3808, 7603, 5922, 4655, 855, -2223, 138, 351, -2051, 974, 5099, 3167, 6091, 9710, 8040, 8281, 10236, 6060, 1556, 1554, -2587, -2403, -1625, -2415, -1937, -7109, -8656, -5681, -689, 4870, 2992, -3830, -2443, -4641, -7836, -2504, -776, -3766, -5564, -10232, -11880, -7732, -4682, -1307, 4059, 10383, 5812, -2825, -2701, 2593, 4196, 5987, 6321, -190, -1552, -221, -1863, -1258]
15264a258k981l815l848N73L480L478L173j277l553l249L76J264M350K466K212
15249A391n977o78k279l220L708J024M516L954n524j290K908L933M695j823J96
15234E534k431L697j274j935m662l557J048n3K618o02m412M550O222r40k456k81
15218A066J344L621m36J030o255n110k669j358M94j593o43Q476M082K51M44p115
15202d371J45O899n43L758k253l200j527P431k654l201l919J132J142l163M039
15187b85n382l294l577M727J420n127J450R54J060l197J619L087J094m907k68
15172a0626P443O375n199m492J007J795q23m536O917M628N714j36k18j645p057
15157h53k164N056j928l001N163M058J20o914j519L270k155K482N15M863j343
$$ y = [-1258, -4239, -8054, -11902, -11329, -7849, -4371, -1198, -2475, -6028, -9277, -8901, -7637, -3287, -821, 1391, -4586, -5264, -7543, -10763, -7055, -6031, -1515, 2439, -3085, -4375, -1467, 2466, 7161, 5338, 5534, 3103, 6800, 5526, 3591, -1071, -4628, -3580, -3633, -1015, -1617, -6029, -1479, 4743, 3803, 1347, 1066, 2410, 6031, 5595, 6625, 370, -4740, -7409, -8767, -8273, -9866, -10509, -2033, 2049, 2300, 2744, -4371, -4226, 2673, 2130, 5888, 3635, 435, -1092, 6339, 3685, 484, -3435, -2303, -1161, -4324, -285, -5667, -8961, -12538, -7811, -6391, -11518, -10068, -9114, -8054, -11251, -9632, -6545, -5451, -10358, -10626, -3183, 3192, -2007, -6499, -5492, -3697, -4520, -9056, -2139, 2489, 8203, 8067, 7849, 6204, -853, -3017, 2039, 111, -2890, 2273, 6331, 6451, -463, -1982, 1288, -867, 1615, 2130, 6993, 5650]
15142E650j815p270n196R787J291j373L635K094K73R01K975P70o120p211j299
15127b908j539K715K752K820M481m974m929K187j222m916O339l820o972M0O287
15112c659k962R51O507N495l28q612n444J0682Q826k961q877l514K824j2l168
15097d252M474L123o78m393l968%l624m326Q06Q269M620j343m733k717N784Q429
15081E471J855m591K026M206P53n402K293q62j719l862m974q03N2k907m082M96
15065a2050K473L119J403k402O047J0538J888q060r463J954N4L223O206q54k399
15050A677m556J192R20K626J307m629K715O481K043l794o12L06K222l482q033
15035c617M22Q209K511j668k488K455Q58l832L593o341p761N459K425o996p82
$$ y = [5650, 3835, -3435, -8631, 1156, 2447, 1074, 4709, 6803, 7076, 7977, 10952, 11722, 5602, -1609, -2908, -4447, -1732, 1020, 3840, 8321, 3347, -1582, 605, -617, -5533, 806, -3014, -9986, -9946, -3659, -6621, -5670, 837, 6332, 6004, -2608, -8052, 2630, 11456, 8495, -382, -3896, -1072, -1084, -4252, 222, 3345, 2667, -1726, -5694, -5694, -9318, -13644, -12838, -4569, 51, -1292, -6025, -8742, -2958, 5471, 7326, 2735, 4761, 8967, 9720, 4318, 6611, 5749, 4030, 168, -4806, -5609, -5557, -8464, -12546, -12050, -9577, -6458, -5055, -7457, -1410, 9128, 11016, 2956, -6507, -4553, -4499, -1276, 4930, 4076, 1677, -2879, -1687, -767, 1859, 3166, -1463, 1252, 7733, 9776, 5982, 5370, 5676, 7898, 4416, -3617, -3195, 5014, 7525, 5857, 3369, 5824, 6682, 2850, 6443, 102, -7659, -2200, 225, -6771, -7553]
15020g553M783k944j519Q556M837k847o876j372k15j242K410p058L261R300K408
15005C929j996L006j503k664R58l349L72L788P198K350n865m418L135k491R09
14990C359p46m077j497l222L936P190j735L818o165K057k65J850L179j022l09
14975F351m85l041L304K960q527l651K389k558l236L17O209P15l586M533Q139
14960I833j453l667J041J394j202j161j60j22k037o244K993M412J590l638l763
14945b184j821K566P145l41l358m842o161N258L603k259L066m514k692J709J038
14930c787L075L595k07m509j983j200M110N116K216J230j247l37r60l236j259
14915F17m3j294j726M895M716R96j357J97k231n761j010k896o66n39Q94N418k27
$$ y = [-7553, -2770, -5714, -7233, 1323, 6160, 3313, -3563, -4935, -5150, -6392, -3982, -11040, -7779, 1521, 3929, 1933, 4939, 3436, 772, 1730, -1619, -1247, 2541, 9739, 12089, 6224, 1806, 4941, 2450, 3359, 2613, -1464, -2961, -6183, -2247, 4943, 3208, 7026, 861, 2918, 2653, 4503, 7682, 6660, 6351, 5866, 2825, 6129, 9089, 562, -3089, -700, -3258, -6494, -6177, 32, 747, -2839, 1694, 9833, 8380, 4713, 5754, 7148, 5946, 4785, 4625, 4503, 2466, -3778, -785, 3627, 5217, 1579, -2184, -4005, -1439, 5706, 5365, 2007, -2835, -8996, -3738, -135, -2394, 672, -3842, -6534, -4825, -3787, -712, 2883, 2676, -1833, -3816, -5016, -906, 4210, 6426, 7656, 6409, 6072, 5112, 1876, 617, 574, -720, -2446, 2449, 7165, 8161, 6804, 7001, 4770, -991, -2001, -4897, -5563, -6102, -5208, 210, -17]
14898a7k092l811J211k529o692Nk393K950N966n084o195o55J630K336O934N151
14882c285l136L419N168K233k146k667m15m109j919M228m21r84m726J289J068
14867f403M573R41J97q08k260j02K071P563Q135K81p657o512l501K762O294m104
14851A470k944K471q12r20m7J653L362M253j969n458q265K286R034M263n209k161
14835A007J574J40J059j255o597m08N213r9J058L869P29m376q15N92L947J681
14819G319n257Q23N011K702j785l393k15j177M069M28m408j701k452l536l161
14804f733j594M920M115o131J355J310l195J086j238l302L163L468J181J254n99
14789i40K66l444o708L05M200L440l610p426Q83P323K925J522L756k514l32O147
$$ y = [-17, -2109, -5920, -4709, -7238, -13930, -13925, -16318, -13368, -7402, -12486, -18681, -19336, -17706, -15370, -8436, -3285, -6421, -3002, 2166, 4399, 2253, -414, -829, -4938, -6857, -2629, -3050, -4034, -8760, -7471, -6403, -1830, -889, -692, -1500, -3760, -3862, -1791, 5772, 13907, 14188, 6531, 19, -3482, -720, 5574, 1470, -1474, 997, 185, -735, -782, 871, 4233, 8486, 6517, 1059, -7206, -4920, 4114, 8377, 3168, 1007, 2581, 2721, 3780, 2525, -4072, -4480, 733, 634, 1692, 5561, 6290, 1914, 1099, 1691, 5638, 7319, 2062, 2885, 7896, 10598, 8813, 5420, 5205, 4028, 8097, 8525, 4117, 2416, -36, -3572, -6733, -8327, -3407, 708, -5423, -4068, -2758, -5953, -4867, -6105, -9407, -6244, -2776, -1595, -341, -940, -674, -4118, -10826, -10521, -6321, -2881, -6491, -13917, -13034, -5711, -2786, -1264, 2492, -22, -354, 5793]
14773E793j665p969N037K284M285o296r60n125m583k973L764L166k343m250J226
14758a0609J067K387P951k631J061L254K582n971k832k586k265J959M061O80o251
14743h143q10J660L001L72N590q98l148K068j237p411m922K580Q917n2o20l97
14727c450N18M075l871k623J070n60m559o67K383J269P639K904j45o903l963o131
14711a3014l361J2684Q408m328n102l820n483M789R352N751j25k833k053J732
14697B597q29j517N680R0k327m51L994j882m551o23m58K317P26m53l374K51j276
14680b086j723K944l497N69l067N27M505L076l05J1191M354L369J406p686k375
14665A1202k712n456l239o978o53N929P910J986j603r184k554Q06J64K933O460
$$ y = [5793, 4128, -3841, 1196, 3480, 7765, 1469, 509, -4616, -9199, -12172, -8408, -5242, -7585, -11835, -10609, -9542, -7155, 796, -1835, -774, 2480, 5062, -909, -3741, -6327, -8592, -6633, -2572, -1892, -8143, -8953, -7293, -4292, -3920, 1670, 772, -2376, -308, -1545, -8956, -13878, -11298, -2381, -2433, -3053, -3450, -2932, 1143, -2728, -5351, -4281, -4841, -9400, -10067, -7684, -6415, 1224, 4128, 3983, -2920, -6883, -13014, -16375, -3691, 4717, 389, -4713, -8533, -14016, -9227, 125, 5876, 5751, 2918, 865, 2597, 1768, 251, 5931, 6021, 3694, 3243, 7237, 5355, 804, 181, -277, 2040, 2766, 2313, -1061, -810, -2086, -3809, -865, -4362, -3793, -6860, -6333, -1828, 1248, 943, 12134, 16488, 19857, 21263, 13577, 11202, 8490, 3034, -205, -7183, -7836, -1907, 6003, 7989, 6386, -2798, -5352, -4546, -4382, -1449, 5011]
14650E011J902J750j523n469q954k673O465j662K820R674J0472J81q311k316N35
14635G902N309J37J744j476r603m518j20k7m048q13L960j556j250R28K411j42
14619a162M438N878k266p763o288K704L577K494R4J177j253n101k228n400J346
14604i753O870O530L337j993j552m602j238O214K043m7K753N753j0965o846l275
14589f771j989N453P047L275k850j778k994P05J408L130J665j84J802J336k914
14574F341j097j48l665n09l701o93L094l151n275M309P576L127j617Q7J708m70
14558E916k552q70j265l901M660K635m724m17P027J984L043K760k660k849l055
14543E732L378k06l599k629o284K851j466l23O406j387o82o136j6n50n636M901
$$ y = [5011, 6913, 8663, 7140, 1671, -7283, -9956, -3491, -5153, -2333, 7341, 17813, 17994, 9683, 7367, 7902, 13211, 13348, 15092, 13616, 4013, -505, -625, -652, -4700, -5513, -1553, -3109, -4359, -3431, -1020, -1162, 3276, 9154, 6888, -875, -7163, -4459, -882, 1612, 1706, 2883, 1630, -3471, -5699, -11099, -9753, -2883, 3647, 6984, 4991, 3439, -1163, -2401, 3813, 5856, 5809, 8562, 14315, 3350, -3496, -6771, -8760, -3307, 3740, 7015, 4165, 2387, -607, 98, 1506, 4636, 6301, 6117, 7919, 9255, 6341, 5244, 5096, 1431, 922, -2779, -3472, -378, -3529, -8804, -4495, 3081, 6208, 4591, 4678, 6386, 5916, 3364, 2494, 1229, -2672, 1988, 4623, -101, -518, 6509, 8493, 11536, 14296, 11636, 8787, 5732, 9110, 8904, 5305, 2676, -3608, -757, -2223, -2546, 3860, 2473, 1791, -4345, -4361, -4911, -10547, -5646]
14527e646O728l745p972J84M311K485K482L957K293J618L094k969k747m256r174
14512i357m955L919L911M628M968M252L465r414k574n753j886q27J63l432l886
14497a6778P234Q035P981j528n363O254J814m302Q018L078o657j037q6j450l470
14482A743l166K999N966m292k491l42k37m649J882K781l712k509O064L449r81
14467B505J906o23J907q58o608l572q98q401n684M254L489L732M394j076M82O923
14451A872j308l16p14o43j728k958j662p98M721j059o64J664N239Q96q89k094
14435d41k644J875j230J297J286O255j553J308j44m628n299J0094M462l683o910
14420D5o892L902L610j163M823m962j993m27N707J743p956K729J978j933m373
$$ y = [-5646, 1082, -2663, -10635, -10451, -6140, -3655, -1173, 2784, 5077, 6695, 9789, 6820, 4073, -183, -9357, -14312, -10393, -6482, -1854, 3114, 7366, 10831, 1417, -1157, -6910, -8796, -9623, -9460, -12892, -16778, -9544, -1509, 6472, 4944, -419, 5835, 7649, 3347, 11365, 14443, 7786, 6749, 6663, 5213, 1743, -1423, 1576, 7542, 3250, 759, 417, 180, -4469, -2587, 194, -3518, -6027, 37, 3486, 2505, 4411, 3788, 5695, 4837, -1771, -5343, -6241, -14642, -20326, -16072, -12583, -8851, -4457, -5533, -5051, 1872, 564, 248, -466, -1109, -2837, -5795, -7457, -8255, -3534, -4593, -5257, -3593, 1646, 2542, 1653, -441, -3085, -1210, -2440, -1143, 143, 6398, 4845, 6153, 6009, 1381, -3918, 6176, 10638, 6955, 45, -6847, -2945, 665, -498, 4325, -637, -2630, -3057, 2650, 4393, -3563, -834, 1144, -789, -5162]
14405e162O00K093j606J121R897M232p363l186L684M425p555m403j187M58n09
14390d461k188K854L669K715L66m257J693j222n020k37Q661o336m738k298O494
14375d305j623k024j268J635j148j334N820M295L688j579r66r113N491J841o421
14360g011j26Q890K228J590N48n420M931n514m428k952k410L461J499Q94N915
14345B095n16P25n37m225k988J645k498M301P343m064m460k698M185L033N964
14330G305K91j370J208M023m344q443N624N508k967K745J393r64l307p62P1l707
14314B304K268n428j2150r533O62N520M878N818j310M575l679k314J795J703J471
14299c420J508l293l574k530n259J684M806L037M327L950o19Q04l33l718q131
$$ y = [-5162, -4562, -2469, -4075, -2954, 6943, 11175, 3812, 626, 4310, 8735, 1180, -3223, -4410, -3952, -4461, -6649, -3795, -126, 2589, 2955, -1302, 391, -831, -5851, -6088, 2573, -3763, -8501, -10799, -4305, -5928, -7952, -9220, -7585, -8733, -10067, -4247, 48, 3736, 2157, 1191, -7922, -2431, -590, -7011, -7137, 1753, 3981, 5571, 6119, 699, 5630, 116, -4312, -7264, -9674, -6213, -4714, -3820, 2095, 1579, 2304, 1767, -2458, -5446, -3801, -6299, -1998, 5345, 1281, -3179, -5877, -1692, 1341, 7305, 7596, 6226, 7434, 11457, 7113, -1330, 4294, 9802, 6835, 9580, 10973, 10009, 6702, 5940, 6011, 2304, 4572, -856, -13006, -22539, -21877, -16357, -11479, -5661, -6971, -2396, -6075, -8389, -6594, -4891, -3420, -1912, -5205, -8779, -11309, -16568, -14884, -10078, -7041, -2714, 1236, 617, 1421, 1088, -2630, -10761]
14284a0761l402K819J324O670l79K425p883L387M056K473q40j396j712j003K504
14269a718J917J285m253M754M34j416l201j463M258M702K185L608r231m670j914
14254d723O912J466n538n680J347M607N71N050p80n692K496L681R61n269m22l648
14238d661j459L418O116O429J182O58k921n263l190M8K968j64N208l197j752K392
14222E812l248r33k097L482J849N063k212k243J291k662l117k900m060j174l125
14207a0274O534p434n108J2950K293L735n242p256R974O423K758n483k08j595
14193B067J482K443L768j448j821j640k175J461O342l216n422n475m737j776J431
14178h716O790N352P72o646k499O311K396j35M217p459m026K144k092j161j440
$$ y = [-10761, -14163, -11344, -10020, -3350, -3729, -1304, -9187, -5800, -1744, 729, -111, -1507, -3219, -4222, -1718, 199, 1484, -2769, 1985, 2419, 1003, -2198, -3661, 597, 5299, 7484, 11092, 1861, -2809, -4723, 2189, 3655, -1883, -7563, -6216, -1609, -1038, 4012, 3232, -2460, 36, 3717, 4678, -591, -1013, -4661, -6120, -2702, 3414, 9843, 11025, 11683, 8762, 3499, 309, 357, 3325, 3161, 8369, 5172, 3420, 5812, 2564, 1631, -466, 3016, 4865, 9928, 7716, 5473, 6764, 4102, 985, -1915, -5975, -7149, -10274, -3740, -11174, -16282, -3332, -1039, 2696, -2546, -9802, 172, 6595, 9353, 3870, 3662, 2067, 3549, 5992, 9760, 8312, 6491, 4851, 2676, 4137, 10479, 7263, 1841, -3634, -8371, -10147, -8716, -1926, 3426, 4198, -2448, -4947, 1364, 3760, 3625, 7842, 383, -3643, -1499, -3591, -4752, -6192]
14163f192k986o522P93R663N050k05p47m76L657M068n800m878l74j061k480l36
14147h826p9j508M868j025J0910K33q469l664M686N329q34m034k290j197j173
14132g073K931M35m767Q516N726m508r65l299k889n84O028J460n406m861K342
14117f914K767j004N756R192j965m477m592j928L478J638l11N94o81m132K712
14102A33m554N84Q22o108K181O775N557k466P94n748J658R55k158m445p97K956
14086c861O320j807l741K416n313m141L222M280j443M699O292n640P74M205p23
14071E539m369m339j278p70O624J321K621k377L764J384n302l639l440n38K472
14056b327K007j400M503m3P94M499L054J874k520j398k66M921M385r166n212K48
$$ y = [-6192, -9178, -15700, -14907, -5244, -194, -399, -1146, -1622, 2035, 6103, 303, -4575, -4949, -6010, -8490, -8826, -8905, -10413, -5545, -6570, 4340, 4573, -3896, -7560, -2874, 2455, 1621, -2413, -4703, -5900, -7073, -4142, -3707, -8474, 42, 5768, 1260, 295, -3004, -5893, -6477, -449, 1011, -4395, -9256, -6914, -4147, -5151, 605, 9797, 7832, 3355, -1237, -3165, 313, 1951, 1640, 2234, 1553, -2579, 133, -4421, -3837, -3015, -9123, -6942, -167, 5390, 2924, 3718, -2030, -372, 583, -1575, -6020, -6817, -3861, 2459, 652, -3089, -673, -5986, -10127, -6905, -2625, -4068, 631, 6923, 1283, 2057, 6262, 5539, 1170, -3169, -4447, -5217, 1407, 2728, 5349, 2972, 6736, 8120, 2818, -821, -4261, -4799, -2327, -320, -1720, 2783, 2740, 3534, 8033, 11087, 12961, 10441, 9043, 8777, 13698, 18083, 8917, 3705, 3953]
14040C953o989n276P473K003j982R55J597M559O966N059q240K74o125n877J514
14025a36l9P25K772P2j693J626j817o217J410J778r0M489M809j121j824j905l855
14008a016p289L782N479J29M510l508o754j961M044O267j0026l195O32L703L498
13993a705J027j1382m504L497j682k751N596R813k2O540N358l695j1243m86Q66
13978d773j405l885K737K424N767O446l408J811P173l597p759K206k679j357J129
13963H30j785j586Q339M844J48q15J494l594o753j545O999j341M064O467n879
13948I887k565P763k72o60j1557o521L884M103o834R21O625j088r826l74m22l592
13932a0528k825R524M228o36R97L310k186N651R92m222n601n88m737L854K680
$$ y = [3953, -3036, -8312, -839, 1164, -818, 137, 1734, 6293, 13259, 18318, 10078, 10352, 4227, -1650, -136, -175, 550, 3322, 3394, 1701, 3327, 1510, -4707, -3297, -1519, -1609, 2880, 7689, 6568, 4744, 2839, -1016, -8305, -4523, 956, 1085, 5595, 2087, -4667, -6628, -2584, 3683, -6343, -9538, -8906, -5203, -1705, -678, -12060, -16564, -13067, -14749, -17500, -11904, -2091, -2113, 4427, 9785, 6090, -5153, -5639, -4773, -6178, -10063, -7326, -4902, 865, 7311, 3903, 5714, 12887, 9290, 1531, 3737, 1058, -299, 830, -955, -2541, 5798, 10642, 10790, 9975, 11469, 7875, 1122, -423, 6576, 5235, 9299, 15766, 9887, 7322, 15085, 14813, 14153, 2596, -3925, -41, 4062, -2772, -1851, 4774, 3686, -6140, -6514, -6936, -10528, -13353, -3829, 399, -237, 760, 4070, 1884, 7535, 8527, 4305, -1296, -1884, -6621, -2767, -87]
13917h7R627N144p38j495m489m128L294N103O3p070o535R44J0213Q427o400m455
13901G418N93R84l859J714N906J645n918m18m740n369J070k815p333K586R622
13886A086Q963L204m228P72p83K812k568k857m671m018n214M011j828J986L582
13871B49j278Q78L790l25m497o92n23N653j828l533p77M987M294k774m99l435
13855c10J531J143q38l234L125M642o481R92j806l37K491P6R78o23l141K768N114
13838F090j504l665L21J960J685L061o883n348m065M004K641M399K315K622K01
13823G834m016q74K193L699j828m290m024P54J985k287j095o638k984L850j439
13808i160M602J0168N748q585p796M277L876M826J799j44o244q603p703J654N623
$$ y = [-87, 9540, 14684, 13946, 12451, 7962, 3834, 7128, 12231, 12294, 5224, -1311, -367, 9846, 18273, 11873, 7418, 8011, 8995, 5136, 6850, 12756, 14401, 8483, 8065, 3325, -2044, -974, -3789, -11122, -8536, 1086, 10049, 13253, 9025, 9797, 9014, 11826, 9258, 6401, 1730, -2288, -7502, -3491, -5319, -3333, 249, -1029, -151, 3639, 3314, -1183, -1875, -2398, 3255, 1427, -2106, -2883, 2104, 6398, 3624, 3125, -310, 1221, 2364, 1526, -1708, 1417, 6059, -422, 570, -1236, -1573, 918, 994, 1972, 1349, -1792, 976, 6090, 4586, 921, 1242, 3202, 4887, 7948, 1065, -4283, -8348, -4344, -1703, 2696, 5011, 7633, 7834, 3818, 2944, 5137, 8836, 7008, 2718, -1306, -552, 1433, -854, -1949, -8587, -11571, -7721, -9160, -4558, 5610, 11358, 2773, -5023, -746, 3130, 7956, 9755, 9611, 3367, -5236, -12939, -11285, -5662]
13793e662l856L87j328O318K506K43J420j593q32p263l441O820q0R01M874o795
13777g381M793N981j92J396j941n405l060k046l387L852O507l073M549O662Q073
13762A5328p348o987L49J852j749O508L207k837O435l149m823m69Q64m024K045
13747E202k56p372m415m162M325N181L623L72n782m936K272M936J3338j697l295
13732G334J590J783m548j518m201L80M950K420j636N735l702l164j018K99L213
13717G917j896j65o728j3013N691R835J453j042m036M795K097J551j940R49j959
13702C509k686J412k757n925L521J1200M146j470n545o418o616j099J295L852
13688c581k644n574J687R454M575m739L816L800L042L161N314m205l001q52m756
$$ y = [-5662, -9518, -9131, -10459, -4141, -1635, -1392, 28, -1565, -2397, -9660, -13101, -6281, -6361, -5460, -586, -7381, -2588, 3393, 3201, 4597, 2656, -2749, -5809, -7855, -11242, -7390, -883, -3956, 593, 7255, 15328, 7980, 993, 1342, 3194, 1445, 7953, 11160, 8323, 14758, 11609, 6786, 6317, 7181, 3157, 5202, 4946, -2426, -6841, -11003, -6678, -1497, 2126, 2498, -3284, -8220, -5948, -1012, 12326, 10629, 7334, 8924, 10707, 6159, 4641, 440, 820, 5770, 8190, 6554, 12289, 8587, 5423, 4405, 4704, 7917, 6021, 5856, -872, -13885, -8194, 1641, 3094, 2052, -1984, 2811, 4908, 6459, 4519, 5468, 3509, 823, 2235, -522, -6447, -2926, 8274, 12420, 10950, 5405, -1013, -7629, -8728, -7433, -3581, -6225, -11799, -10112, -658, 3917, -822, 2994, 6794, 9836, 12997, 18311, 14106, 11105, 10253, 5497]
13673E497n233P844j51p846k994r4o561K14P699J1081J121q450j1260L428L887
13658a818Q513M545n470m888m558q206M150J966l953K715L437P747L332M342m038
13643G816p888J00M377k213K230J723P89j60K83k975r813r92O123J258K552m26
13627B784r39l499m183m111N390O04k44L088M358J387q54p975l368O920M975m26
13611C907j531l218l216N511J836L044m546l916l59J453M571J274J466J601j071
13596F806J530j681k433L079l167l218m317N7M248m938m407M469J0187K527p502
13581A240p214m421r79N995N384p21L953q82m724l174j474n931q94N16N315L052
13565d959L33J907M818O60N054k640L662n549l268p540n419M652J0031L875P31
$$ y = [5497, 264, 8108, 7957, 111, -2883, -2977, -9538, -9324, -1625, 9456, 10577, 2127, -9133, -5705, -1818, 6695, 11240, 5770, 882, -3676, -11882, -7732, -5766, -9719, -7004, -3567, 4180, 7512, 11854, 7816, -72, 28, 4405, 2192, 4422, 6145, 6934, 6774, 7057, 4082, -5731, -6723, -600, 658, 3210, 2784, 1845, -1654, -5837, -9948, -4558, -3954, -4198, -1110, 3248, 4635, 3781, -4194, -7562, -642, 4333, 3907, 2376, -842, -4058, 1453, 3289, 6333, 1787, -2129, -2488, -1035, 3536, 4810, 6276, 7877, 6806, 8336, 6655, 4222, 7301, 4134, 916, -3401, -3344, 904, -4034, -8441, -3972, 6215, 8742, 1240, -5974, -10395, -11374, -5379, 5, -716, 3237, 2355, -2369, -5543, -7017, -12948, -13842, -13326, -8011, -4959, -4626, -2719, 2099, 2759, 7813, 5173, 8835, 3286, 18, -7522, -12941, -8289, 1742, 5617, 6348]
13550F348K332n528l540n332n798M338L531L904N178K81o134l596Q51M754K17
13535A806m426L674k532N93r89k597M634O008j130L112n25l974J962j587J085
13520E114j350m908n028R874M159K04m45o890l231L297l547k866J07N277M926
13505D693J937n117k99m2O421m232m899N01J543o66J050l718m038o028P870M425
13489e99L472J509n87p63p716m274o117j42N753N079J0474K904R07o067K144n187
13473G90l898M749k472n076l791k481R816L919p32M033j990k495n04J0211n178
13458D901q398O25J704K898k926l893M715J631K224m705o29K031l832j521Q460
13443C285p75l478p4O725J181m771m398p25L00K146K415K6O451j102q603K985
$$ y = [6348, 8680, 3152, -388, -5720, -11518, -7180, -3649, 255, 5433, 5714, -420, -4016, -3165, 1589, 1806, -2620, 1054, -1478, -885, -1874, -4471, 163, 6171, 5041, 8153, 7628, 3654, 5616, 4029, 5114, 3764, -1144, -6172, 3702, 7861, 8065, 7620, 730, -2501, 796, -2751, -5617, -5510, -233, 4693, 6630, 1513, 1214, 1172, 7593, 3361, -1538, -1037, 506, -160, 890, -2828, -6866, -12894, -5024, -599, 2873, 4382, 3795, 3032, -4684, -8958, -15075, -15217, -9464, -4385, 6089, 8993, 9900, 3833, 5977, 790, -3108, 1641, -831, -5907, -9698, -12179, -2363, 1556, 824, 4857, 2867, 372, -132, 10079, 4901, -3497, -2872, -1168, 1730, -1196, -5089, -374, 1257, 3481, -1224, -1853, 178, -3654, -5175, 3285, 2510, -968, -1042, 5683, 6864, 2093, -2305, -3030, -2730, -584, 1831, 1857, 8308, 7206, -1397, 1588]
13427A588j28j432O57p292M059Q02k433l449N176p22L276n779n296k05j107N760
13411f525O606L957O534O964k511m353J685l69m311o075r601N923J1953M36n910
13396D403p970n008N011J0853j17m217Q829J463r67J52P66J861K736J699k560
13381A6934n424K608l152J702N935J816j0161k011L761m329o189j753L843K735
13367F315O062K951l141k374p493L556J834m862j644L122J834k927K615M672m578
13352E942n963k884M027L324m423l054R319K438j070N80j925o425k447M288M396
13337F123J426l1J38O065J399J558m202N59N05P97n315J232l039l548n19j666
13321A482n180j165l63k241n29N059J2775J615M363m571l984M756k258K144J293
$$ y = [1588, 1460, 28, 685, -6607, -2548, -1746, -4179, -7628, -2452, -3174, 102, -5677, -10973, -11178, -12285, -6525, 81, 4038, 10572, 17536, 15025, 10672, 12357, 11988, 7677, 1602, -7999, -2076, 9877, 10313, 4403, -3567, -8575, -3564, 7289, 7172, 2955, 11784, 13247, 12280, 12432, 13198, 15059, 17795, 19494, 16934, 11510, 14118, 10966, 12668, 18603, 20419, 10258, 8247, 12008, 7679, 1490, -263, 3580, 6315, 12377, 15328, 12187, 9813, 2320, 5876, 7710, 2848, 1204, 4326, 6160, 3233, 5848, 10520, 5942, -21, -2905, 1122, 4446, 23, -3031, 6288, 8726, 7656, 8236, 6311, -114, -2561, 1727, 6123, 7549, 7518, 7656, 13721, 15120, 16678, 12476, 13035, 13540, 14337, 9022, 10254, 7215, 3667, 3148, 1482, -3698, -4863, -5226, -7467, -7996, -2937, 9838, 11453, 15816, 11245, 7261, 12017, 9759, 11903, 13196]
13306A3196m16J0636p197m329r98m246m800l903J0504K585m756j942j816L610
13292F128M907K715K138n144o172k396j526N857K480k250r244K015L465l798n880
13277f705N509j369j796L179j88l071Q44Q392N889N874m209j0708J921m149k041
13262b628P699L512R24m569K45K807J277k173n083n098P16N28N761m31J876J957
13246G320k00k787n782N002K521m01L108L986o027l373j712M083P240L860l051
13231A3787n897k382K532K848K537m992o245K387k51l731n689r92Q199N863m64
13216G510l059j82l25J132n2m592J172M259K480j931p284M112P66o392K211k881
13200c056m868j327L462Q455J825P075q49n689J391L606p923k87L359K151j114
$$ y = [13196, 12780, 23416, 16219, 11890, 10892, 6646, 1846, -2057, 8447, 11032, 6276, 4334, 2518, 6128, 11035, 13750, 15888, 10744, 4572, 2176, 650, 6507, 8987, 6737, -2507, -492, 2973, -825, -6705, -1196, -2565, -4361, -1182, -1370, -4441, -3597, 4795, 10684, 16558, 12349, 1641, 3562, -587, -2628, 5071, 8583, 9507, 4938, 5183, 7990, 9267, 7094, 2011, -3087, -2371, -1843, 3918, 3487, 5363, 7320, 7120, 4333, -1449, 3553, 6074, 5673, 8781, 12767, 6740, 3367, 1655, 5738, 12978, 16838, 13787, 7890, 5508, 8040, 10888, 13425, 8433, 2188, 4575, 4324, 593, -5096, -6088, 2111, 7974, 7510, 4451, 4269, 3944, 5076, 5024, 432, 1604, 5863, 8343, 6412, -872, 3240, 4006, -2386, -175, -3056, -7924, -9251, -5789, 2666, 4491, 11566, 10717, 5028, 6419, 10025, 2102, 1815, 5174, 7325, 6211]
13185F211p36N250O01k530J940p284K419k346O0r45j780l3J004J246L483J364
13169G924M694K223k903j980J364p469k135j189P161M65j073p780k778k434K243
13154c667L52K3n894M357L880o377L605J0652j04l4P62l941K938k905K54k568
13138A333m301N77L313j237m085K147Q877O399L066M015o208l308L029j0014q022
13123d419P284K945J052l105Q97n10K735N46l63k406L32J964j992k197j547N952
13107G168k653o10N687N19K377l280k320k126l469n36O41R69m347l25k418K951
13091a772L775j005J353J309N381K323N650M399l483p122j83Q65k138l842n225
13076B85J228O955N71k622L030j02n228j915J866l70j583K237O569M982L225n516
$$ y = [6211, 5475, 10725, 11326, 8796, 10736, 3452, 5871, 3525, 3585, 2640, 860, 827, 1831, 3077, 6560, 7924, 12618, 14841, 11938, 9958, 11322, 3853, 1718, 529, 7690, 8155, 7082, -698, -3476, -5910, -3667, -3315, -3292, -9186, -4829, -949, -7326, -3721, 6931, 6827, 6793, 7555, 3614, 6552, 3647, 3901, 1333, -2968, -2391, 922, -315, -4400, -2253, 6624, 13023, 16089, 20104, 13896, 10588, 13617, 3603, -4419, 2865, 5810, 6862, 3757, 4654, 4144, 6879, 7425, 7062, 4656, 4988, 6952, 4960, 2763, 1216, 7168, 4515, 3905, 9592, 10111, 12488, 9208, 6888, 4762, 1293, 757, 1398, 2367, -1980, -2305, -4723, -1772, 2003, 998, 2351, 3660, 9041, 11364, 17014, 21413, 17930, 10808, 10625, 11490, 9352, 5510, 285, 1513, 8468, 9039, 6417, 9447, 9345, 4117, 2202, 4068, 3698, 2115, 4352, 10921, 15903, 19128, 13612]
13060A3612o205p887o62M392M995L148j322o061q50l90o315R46J182R146L166
13045A0895J820k538m936l560M3N718k783l609J05P161K574L889k75l843o773
13030C888K702K255L743l812k081O04k777M726k596j774l125r93L644k35j679
13015B490N676k779j67K847P781m086n168P651N98M528M07n064m033q487k473
13000b79L41N325K253q99p909O527N601l406m357m792O7N282M275K26K547L796
12984A4598k119l078k648k995j723O667m772p825q71J525k705L489k644k549J015
12969f635j700L364m52n736J444k916R563L53K438J541K781P45L846o851R5J840
12953C720J080K826k477J327m299l571k104j246K623K038M954P038N856j887p681
$$ y = [13612, 7407, -480, -1142, 3250, 8245, 11393, 10071, 4010, 3160, 2770, -3545, -2599, -1417, 7729, 10895, 12715, 10177, 5241, 1681, 1724, 7442, 4659, 1050, 1155, 8316, 10890, 14779, 14504, 10661, 3888, 6590, 8845, 12588, 8776, 6695, 7299, 4522, 9248, 6652, 4878, 1753, 760, 4404, 4169, 2490, 8166, 5387, 5220, 8067, 15848, 11762, 6594, 14245, 14843, 19371, 19778, 14714, 10681, 2194, -279, 62, 5387, 7640, 6741, -1168, 5359, 10960, 7554, 3197, -1595, -1528, 3754, 8029, 8255, 10802, 14598, 12479, 9401, 6753, 3758, 2035, 8702, 3930, -3895, -4766, -3241, -5946, -2457, -5101, -7650, -6635, -8335, -4971, -5423, -11159, -9715, -12631, -3068, -2715, -277, 1264, 4045, 4790, 8636, 1785, 1880, 3720, 4800, 7626, 5149, 6476, 2177, -1394, -3498, -4744, -2121, -83, 4871, 11909, 17765, 15878, 8197]
12938H197L174j67j21o9n787q286l4M101K499o87q015J863N857L216J271K741
12922I753m293m238j0N611K307k185m271K025K683L587o910n203l66p487j5J1324
12906B312J0173M410o088q272j399k62J705N88l454N309L233O755K889p68j0082
12891G049K71m013N09P203o005j959j07k768O2K644N094J0033l682o641j380K017
12875H327L424J252l641o360J739O038k100j136L581K657j219M384k006k404O040
12860A8576J353K361j213r997k611K774k618K306j433m166r76j804l150L39L063
12845B804r720J288N313L671K366m305m767j828O58M328k293P73O070J001m081
12830A278j110O220L68k211L050l497n423m79k935M546O505N534l367m226m023
$$ y = [8197, 11371, 11204, 11083, 11014, 5227, -3059, -3093, 1008, 3507, 2820, -5195, -3332, 2525, 5741, 7012, 9753, 5460, 1222, 1212, 6823, 9130, 6945, 2674, 4699, 7382, 10969, 4059, -1144, -1510, -8997, -9012, 2312, 12485, 16895, 10807, 2535, 1136, 874, 2579, 3167, -287, 5022, 8255, 15010, 17899, 17131, 7049, 7320, 3307, 3816, 11019, 5014, 3055, 2948, 180, 242, 2886, 7980, 18013, 14331, 7690, 6310, 8327, 11751, 13003, 9362, 3002, 4741, 10779, 8679, 7543, 11124, 13781, 12562, 16946, 14940, 12536, 18576, 19929, 22290, 21077, 11080, 8469, 11243, 8625, 10931, 9498, 5332, 4356, 2552, -598, -259, 2804, -6916, -5628, -315, 3356, 5722, 1417, -3350, -5178, -4520, -192, -2485, -1712, 4358, 5359, 1278, 168, 6388, 6756, 4545, 7595, 4098, -1325, -1804, -4739, -193, 6312, 11846, 8479, 4253, 230]
12815B30M180Q140m122k575j50k156m223R917R798n606q379k275Q179Q06M28m78
12799A1714j384K54J192m245o769j363N179j686J76M799L898L664J514m286q407
12784D250L810N344n247r626o0l806k162K780Q619J626l153k003k989J105k100
12769c612M047M537R96j253j753r36R29k6K515p82n381L463R082K621m313n896
12753D238n521K313M627m687r210P142R856N330m072n716k341J605m80j851J263
12738B496M769L273m913q134J540q7k446m409M633O339Q414Q98j0867K994O757
12723A1257k006n083M114J659k488J84j142k382m312l140J0424R177n148N143
12709A6257J210l595j0997m738N425Q925L134l490k029o974K97N331M830j386
$$ y = [230, 4410, 12550, 8428, 5853, 5703, 3547, -676, 9241, 19039, 13433, 5054, 2779, 10958, 11764, 12192, 11714, 10330, 10584, 11776, 7531, 762, -601, 4578, 2892, 3068, 7867, 11765, 15429, 16943, 12657, 4250, 8060, 13404, 8157, -1469, -1529, -5335, -7497, -4717, 3902, 5528, 2375, 372, -2617, -1512, -3612, 435, 4972, 5968, 4715, 2962, 2026, 2955, 2929, 5444, 4662, -719, 2744, 11826, 14447, 10134, 4238, -1283, 1030, 5657, 970, -8240, -1098, 8758, 14088, 10016, 4300, 1959, 3564, 3084, 1233, 2496, 7265, 10538, 5625, -2509, -969, -1056, -3502, -7911, -3278, 3061, 11475, 12373, 1506, 4500, 11257, 9251, 4168, 8282, 9941, 7453, 7637, 6495, 4113, -199, -3339, 7085, 16262, 11114, 16257, 17467, 13872, 2875, -1863, 3562, 12487, 15621, 12131, 10102, 3128, 3425, 8756, 13586, 12200]
12695A2200R80l884r260L693M238N839K156k731n767p983P431L713O354L856R59
12680B1794J837l600o220j750r68q672j074J0971Q616K257J7p648o501j05O094
12665A5048J050n273n427j018M956M692L057j251q158p694K845M382N079k395
12651I893n097N60j168k595O57R067M11l676K110m926l849j759M108P58O26k985
12635B135N41j013m507J142J196L699l400J954J266O614J93J342k642n491r869
12620f840N429O796K962L196L275L418j127l341r31O871j692l667j786P930J831
12605B2324l735q875l804J937k141q268m075M956N36l08j194p51J307j620L269
12590d42L419l754l600q68N299N749J516L442K059J519M78K94j441K060k643R73
$$ y = [12200, 13180, 9296, 36, 3729, 7967, 13806, 15962, 13231, 7464, -519, 6912, 10625, 16979, 20835, 21794, 23631, 20031, 13811, 12061, 11093, 2421, 1347, 12318, 20934, 23191, 23208, 15560, 9059, 8954, 15048, 16098, 10825, 5398, 4380, 9336, 14028, 17085, 15834, 7676, -18, 2827, 7209, 12288, 9893, 4796, 5356, 4188, 1593, 2250, 11317, 11728, 8052, 10162, 5236, 1387, -372, 3736, 4494, 5120, 2135, 2676, 1663, -2844, -1702, -506, 3193, -207, 1747, 3013, 9627, 9820, 11162, 8520, 3029, -6840, -1411, 5385, 8347, 11543, 14818, 18236, 17109, 13768, 12837, 19708, 18016, 14349, 12563, 20493, 22324, 18589, 9714, 5910, 7847, 5706, -2562, -6637, -1681, -1145, -1453, -2647, -3398, -2091, -3711, -442, 2977, -777, -4377, -5245, 54, 5803, 7319, 10761, 12820, 14339, 14817, 15111, 13670, 15730, 13087, 14060]
12574A4060L765o382l181M655j781k86m963k326K015n436L401K053j721L06K396
12559F575M111K512J169K420j422n935l881O53J638K542J453j038n155p96J728
12544F574p54p970j588K108N691j630L700P516n98k169n909Q97N231L606n605
12529I100J904K590o532k278J766k248m634J707k836r77O27n530O112J2735M960
12514A6466n009m657n763k078j228P525O472o23q483p148N261K144j056Q1k791
12499h87M740M034q911p256k384K507K000K528M560N385j643j464n146K977m153
12484c113l195P352R948P193j951m209l405j997k996m309O361l98K938L169K43
12469A1631l70N363k107m504k398J254K79K48J579J455N30m330k422p278J175
$$ y = [14060, 17825, 11443, 8262, 12917, 11136, 10850, 5887, 3561, 5576, 140, 3541, 5594, 3873, 4179, 6575, 10686, 13198, 14367, 16787, 15365, 9430, 5549, 6202, 7840, 10382, 11835, 10797, 5642, 4846, 6574, 5820, -2150, -3738, -1630, 4061, 2431, 6131, 13647, 13049, 10880, 4971, 5868, 11099, 14705, 9100, 11004, 13594, 7062, 4784, 6550, 4302, -332, 1375, -1461, -2438, -1811, -7341, -1229, 11506, 16466, 11457, 6800, 1037, -1041, -2269, 5256, 11728, 11105, 2622, -4526, 735, 2879, 1823, 1904, -887, 3853, 7887, -1024, -8280, -10664, -8157, -6157, -3629, 931, 6316, 4673, 3209, -1937, 1040, -3113, -6308, 1044, 10992, 18185, 16234, 12025, 8620, 6623, 3627, -682, 5679, 5281, 8219, 11388, 11631, 11261, 16624, 14517, 10013, 7615, 8869, 9148, 9396, 10975, 12430, 12960, 8630, 6208, -1070, 105]
12454A05J483k82p25O894P064O635n12n669k704p895M236Q760j470l878k874K033
12438A1201N609k92k517q356J226N873J746L773N96n969p445l62J557L67N846
12423A2853M494k785P83m790o818J758N207K094j248J735K858m644l604J72K825
12408A0890L237j222j703p189O24q37J442K355K506k622l301K256N816M388M793
12393B1433j537L80J799K092k331k669n939m261J664K48K376p85l24O182J563
12378A9891j836k192l789K724K897Q41l289l200k79j750o701j189J117L827p23
12363F349k465M265K493j627j192p64k626M520K440k976j256o267n43J0893L292
12348A4536l593n068j240J7L744K459m26J18J014L145J076M498L320l773m538
$$ y = [105, 1588, 1306, 581, 7475, 14539, 21174, 20662, 14993, 12289, 4394, 8630, 17390, 15920, 12042, 9168, 11201, 16810, 16518, 14001, 5645, 6871, 12744, 14490, 18263, 18859, 12890, 5445, 5083, 6640, 7007, 12853, 17347, 14562, 15345, 10555, 3737, 5495, 10702, 12796, 11548, 13283, 16141, 11497, 7893, 8065, 10890, 14127, 12905, 11202, 4013, 4637, 3800, 5242, 7597, 10103, 7481, 4180, 6436, 12252, 16640, 21433, 19896, 20276, 22075, 24167, 21836, 19167, 13228, 8967, 10631, 10879, 13255, 12470, 12146, 18328, 19891, 18055, 15863, 12074, 14798, 17695, 18536, 15247, 12047, 11768, 10018, 3317, 2128, 3245, 7072, 6349, 3884, 8149, 10642, 9015, 7823, 7059, 4433, 8953, 11393, 8417, 7161, 894, 351, 11244, 14536, 10943, 5875, 4635, 4652, 8396, 10855, 10429, 10547, 11561, 14706, 15782, 20280, 23600, 19827, 15289]
12333A5289L521o832N86N578N00l050j824o187k891m653o640j722M121L693M055
12318C544k694m081L140N769Q46N38L366R366Q14k742L325L231k384m672j2799
12303D567r19j370P073N259K668o835k131O763Q050k220n880K948K240j885o436
12288A1892O486L587r87R13l739k458j680k165J149L310P281J102m202m133N52
12273A6908k445k873K625N108L237J509p378n776k42M688L725m249l181N32O611
12258A8799p634n148k70P852O13K312j14m921K302J836J516o92O382r07l686m425
12242A3815q7j946o63J972J927M076l241j821O796J789k132k462L901L186k093
12227B3017o632p747R3j930j0230m650L605j413j307O460J1058L097J892j195
$$ y = [15289, 18810, 11978, 12564, 18142, 18642, 15592, 13768, 7581, 4690, 37, -6603, -8325, -4204, -511, 3544, 850, -3231, -91, 5678, 6524, 7062, 10428, 19794, 20608, 17866, 21191, 24422, 22038, 17366, 4567, 3648, 2278, 9351, 14610, 17278, 10443, 8312, 15075, 23125, 20905, 15025, 17973, 20213, 18328, 11892, 18378, 21965, 20978, 21891, 18152, 15694, 14014, 11849, 12998, 16308, 23589, 24691, 20489, 16356, 16908, 14463, 11590, 14215, 19323, 22560, 24069, 16691, 10915, 10673, 15361, 19086, 14837, 11656, 12188, 18799, 11165, 6017, 5747, 13599, 14212, 16524, 16410, 11489, 13791, 15627, 17143, 16451, 22833, 21926, 18240, 13815, 13728, 11782, 11119, 13091, 15018, 19094, 15853, 14032, 20828, 22617, 20485, 18023, 21924, 25110, 23017, 16385, 8638, 8731, 6801, -3429, -8079, -4474, -5887, -7194, -734, 10324, 13421, 15313, 14118]
12213A4118m829m326j4L77k730J028N061J87M25M916M33m82m301J269K784j314
12197A2602j918P84J760O820j497o449P16j438K281j203N328J587j041j461l881
12182A2990K595j741K750p52j360L994M775K359o866p566J506K824J298K69j28
12167A6947j941l939M041k340M311k63k943j086N069K301k076l418n75j089K306
12152A5305J805k544l125o027l527J570k107R59L110k525L424J0551j762j147
12138A3960J799O058k890o902m060M250k405l787O27J479J273L654K706p8J945
12123A7629j280k171o231k428R509P596k938m814n364q58P90M760N166m266k068
12108A3032L569N99o368P34K284M206L82K540j096k87O757M649M56p66l34k075
$$ y = [14118, 9289, 4963, 4949, 5326, 2596, 3624, 8685, 8872, 9297, 14213, 14646, 14164, 9863, 11132, 13916, 12602, 10684, 11468, 13228, 20048, 18551, 12102, 12818, 11380, 13661, 12458, 17786, 19373, 18332, 16871, 12990, 15585, 13844, 16594, 15842, 14482, 18476, 23251, 25610, 18744, 11178, 12684, 15508, 16806, 17075, 16947, 15006, 11067, 15108, 12768, 17079, 16816, 13873, 12787, 17856, 20157, 18081, 14663, 14088, 12999, 15305, 17110, 14566, 11441, 5414, 1887, 3457, 1350, 2309, 5419, 2894, 6318, 16869, 15107, 13960, 15759, 21817, 18927, 12025, 7965, 12215, 9810, 6023, 6650, 8129, 9402, 13056, 15762, 15684, 17629, 16349, 14178, 7947, 5519, 15028, 22624, 19686, 14872, 9508, 8650, 9440, 14200, 19366, 15100, 13032, 16601, 17200, 10832, 11566, 13850, 18056, 18438, 20978, 19882, 19595, 26352, 31001, 31457, 30691, 30357, 28282]
12092B8282j0888o297L988N590n220J832J412k569M573j872r69N194N84k163o966
12077A4511n11j565P34r023k824k452L317R169k962p919Q30O655R782O153j091
12062B2804p499l001N290K300j541J049o61p27L602l192m339j897K386N645L196
12047B3415j425k539j065J788L465L757l252k351P75L191l00o988r81m26p009
12032A0055l110O092j313p61L942j704P48J56p898q66j510P129O426O154K603
12017B6143n59K79j374j0723L101K794j974q193j369P906K914j887j1675n646
12003b63P659R788j322n237K140J784N79J099k328K340o579q29j48r82J996M294
11987A3991k062o443N263R834L022o908K327N005J561j825k125O52j84j50j561
$$ y = [28282, 17394, 11097, 15085, 20675, 15455, 17287, 18699, 16130, 20703, 18831, 17862, 23056, 23640, 21477, 14511, 14000, 12435, 13169, 4146, 1322, -1130, 2187, 11356, 8394, 475, 1305, 7960, 17742, 23895, 22804, 15305, 12304, 17594, 19894, 18353, 19402, 18741, 18014, 21616, 18424, 14085, 12188, 14574, 20219, 23415, 21990, 19451, 18386, 20174, 23639, 27396, 24144, 21793, 22568, 25759, 25459, 18471, 17490, 17064, 10055, 6945, 13037, 11724, 10963, 14905, 13201, 13949, 14105, 6207, 5341, 3831, 10960, 17386, 23540, 26143, 25584, 25863, 24489, 13766, 16867, 19661, 17687, 9494, 8125, 16031, 18945, 17058, 5383, -263, 7396, 17184, 15862, 10625, 12765, 14549, 15128, 16227, 13899, 16239, 9660, 8831, 8683, 7701, 9697, 13991, 11929, 5486, 10749, 20583, 23605, 16697, 19024, 24029, 25590, 23765, 21640, 22292, 22108, 21958, 20397]
11972B0397M229o932j726J419k384K224Q483n868r219N527L433R67J2n834j363
11957A3365J28P91K599L069P92K987J90n491L769N355n507m875j864M622J731
11942B1661M901J88n920m721L999l989m721p65k137L052M387k22N08l82J569j18
11926A7290N80L232J712l412q31M303l138l101K768k948k195J492p3P996J769
11911B5444k810l056n120m065m535r37J42O898l747M793N433m34p286k118J068
11896I670N284J959k360j517j690k02K395N241j03k623O52l661j740J39M253N92
11880A6289K326K615N524m830k545J455L720N278k056o022J17P272K752p488j1763
11865A2644l880K319K590N14m83j052J742K712n050l397O519L215N782P827K919
$$ y = [20397, 24626, 17694, 15968, 17387, 15003, 17227, 25710, 19842, 10623, 16150, 19583, 20550, 20562, 14728, 13365, 13493, 14284, 16883, 19952, 20744, 23731, 23921, 18430, 22199, 27554, 22047, 17172, 15308, 19930, 21661, 26562, 26750, 20830, 16109, 20108, 16119, 11398, 10633, 8496, 11548, 15935, 15713, 16221, 15839, 17408, 17290, 17870, 21102, 22814, 19402, 18571, 22874, 19736, 16635, 19403, 16455, 14260, 15752, 15679, 23675, 25444, 22634, 19578, 14458, 10393, 5858, 4921, 5063, 11961, 8214, 13007, 18440, 18006, 10720, 8602, 9670, 14954, 16913, 14553, 13036, 11346, 11144, 13539, 18780, 18677, 16054, 16706, 13045, 11305, 11444, 15697, 16289, 18615, 21230, 26754, 21924, 19379, 20834, 24554, 29832, 27776, 21754, 21871, 29143, 31895, 24407, 12644, 8764, 11083, 13673, 14187, 13704, 12652, 14394, 17106, 12056, 8659, 15178, 18393, 24175, 32002, 34921]
11850C4921p162j168o113j269P743M978M32k069n259l765Q093j878j413M00p99
11835B5672j615l251q107j599N684O904K259J262o521l440N318L825P089R54n288
11820B9146J012l998p541O802M272l260K427j697n765l866q395K845L353J978
11806A7313n827l63M253N482K920m70J686k012K75M253O632L443n532j927o153
11791B3973n233L851N049k672M238K082Q04J31m498r176J293K168O114l447j417
11776B3260n44j54k404J791R24n246J625L479l832l494J614K018L913Q844l588
11761B8206o182P28Q641n227l164k082K494k73k94N65K077J211p610p43K506O215
11745B7068k49o635j598K233j19l03N595l706p03J928M839n627n142N823K547
$$ y = [34921, 27759, 26591, 20478, 19209, 26952, 31930, 32362, 30293, 25034, 21269, 29362, 27484, 26071, 26471, 25672, 24057, 20806, 12699, 11100, 16784, 23688, 25947, 27209, 20688, 17248, 22566, 26391, 33480, 34434, 29146, 30158, 26160, 18619, 25421, 29693, 26433, 28860, 27163, 21398, 17532, 9137, 11982, 15335, 17313, 11486, 11123, 15376, 20858, 23778, 23308, 24994, 22982, 23257, 27510, 34142, 37585, 32053, 30126, 23973, 18740, 22591, 27640, 24968, 29206, 31288, 32092, 32223, 27725, 18549, 19842, 22010, 28124, 24677, 23260, 22716, 22562, 20158, 21949, 22873, 17627, 19252, 22731, 18899, 15405, 17019, 19037, 22950, 31794, 28206, 22024, 22752, 31393, 26166, 23002, 20920, 23414, 23141, 22847, 23412, 25489, 26700, 19090, 18347, 20853, 27068, 26819, 20184, 18586, 20819, 20700, 20397, 25992, 22286, 21583, 23511, 28350, 22723, 17581, 23404, 25951]
11730B5951K842k887k430r79l593k34Q169K915n477k218n742m401l385L174K364
11715A4069N887L838K1k798L859L419k719j896k70l487o2q49n148J003l880l022
11699G965k585j145R326P882O088K590o59K081o460p326n864J791N961K027l755
11684A7917j462R45M740m69m127j449L269P515N650J125R36J508m026o875O237
11669C1434O278m18Q32o151l146n33o092j067m812J1j017l388P2N130R775O857
11653C3765J1394n160q406j191n78p87q23Q3j512o572j520Q55M576K786N423N239
11637C7572n682n298j682J541m488o512K491M498L879j056j0835k727n715P232
11623A3218J1912J862L845l605k624r29l14Q8j272K478O906k994j814M317L485
$$ y = [25951, 28793, 25906, 23476, 22497, 18904, 18670, 26839, 29754, 24277, 22059, 16317, 11916, 8531, 11705, 14069, 19956, 23794, 23815, 21017, 24876, 28295, 25576, 23680, 23410, 19923, 19861, 19012, 13864, 14867, 10987, 7965, 5380, 4235, 13561, 21443, 27531, 30121, 29462, 31543, 25083, 17757, 11893, 13684, 19645, 21672, 17917, 16455, 17400, 22140, 21671, 17544, 16095, 19364, 26879, 32529, 33654, 34590, 36098, 32072, 25197, 31434, 37712, 37294, 38126, 31975, 28829, 28296, 22204, 21137, 16325, 16336, 15319, 11931, 12003, 17133, 26908, 33765, 45159, 39999, 31593, 30402, 29824, 29037, 28214, 28297, 26785, 20213, 18693, 19548, 24124, 26910, 32333, 37572, 31890, 26592, 24910, 26451, 21963, 15451, 17942, 22440, 26319, 25263, 14428, 11701, 5986, 13218, 25130, 26992, 30837, 27232, 24608, 23679, 23365, 23453, 22181, 24659, 31565, 28571, 26757, 31074, 34559]
11608C4559k056m859r00K10K165L647o009l523k673Q79k358M271N63l694J651
11593B1873L220M598Q17j500n706K593l29j558J246J092J475l859p860k134J799
11578A5767P192K69O466k63m210J282M391J322k618j188K505N270K256k718m23
11563C5300n103m335j258J373Q55M073K134J932o438r08l424L094M505K485l98
11548C3887j761M13m419r715N91N343N842j641J112N39k659l473r21O07j816P122
11532B9051J1805l55j0122k754K062J252n11j53j888L701n15n176j932N049K947
11517C2461K076J307K520o61q458m445l70P367K500m671J183j901l111K952J458
11502C0207Q24N462N629l085o921m756J92M468j2l197k828K670M112L606K278
$$ y = [34559, 32503, 27644, 26744, 26954, 29119, 32766, 26757, 23234, 20561, 21440, 19082, 23353, 23916, 20222, 21873, 25093, 29691, 30508, 29008, 23302, 25895, 25566, 24008, 25254, 26346, 27821, 23962, 16102, 13968, 15767, 22959, 23228, 29694, 29431, 25221, 26503, 30894, 32216, 29598, 28410, 30915, 36185, 38441, 35723, 35300, 30197, 25862, 24604, 25977, 26832, 30905, 33039, 34971, 28533, 27625, 24201, 27295, 31800, 34285, 33887, 32126, 32539, 28120, 18405, 18996, 24339, 30181, 28540, 29652, 30191, 27532, 24059, 23138, 23745, 21929, 29051, 40856, 40501, 30379, 27625, 29687, 30939, 30428, 30275, 28387, 32088, 31573, 26397, 24465, 29514, 32461, 34537, 35844, 38364, 37703, 29245, 24800, 24430, 31797, 34297, 29626, 30809, 28908, 25797, 28749, 30207, 31031, 36493, 42122, 39037, 32116, 27360, 27552, 32020, 32008, 28811, 25983, 28653, 32765, 36371, 38649]
11487C8649K029K280k411o393r44O65L416m288j84k295l838M936m63K385l149
11472C0395o577M356R217K597n438n710O08J532M233j78q85K293L019j642K414
11457D0234J692j366l093L693M247m103l141m424m607o556M27N802k284j783p21
11442B4017K809j336M203N672j406o37K334N815K078m983m023k646K078l015L01
11427C1261O865N40q682j316J406j2L162j248R43N749J845K105n552o498L241
11412C3809l006m15M616J537o52m24l207k875M35R019l976k710J360j659k066
11397B9786j648l712j597L468k115Q19L896k658Q62M512Q02p8m38n509k943N468
11381B8915O732P30j094K873L94m244R62Q43n941m389l575O396O716k129l763
$$ y = [38649, 40678, 42958, 40547, 34154, 33210, 33875, 37291, 33003, 32819, 30524, 26686, 31622, 31159, 33544, 30395, 23818, 28174, 37391, 39988, 34550, 28840, 29448, 30980, 35213, 35035, 34150, 36443, 39462, 37820, 40234, 41926, 40560, 37467, 41160, 45407, 41304, 38163, 33739, 29132, 22576, 23003, 28805, 26521, 24738, 24017, 26826, 25490, 29693, 35365, 33959, 33322, 35656, 41471, 43549, 38566, 34543, 31897, 33975, 30960, 31261, 38126, 38666, 29984, 28668, 30074, 30062, 33224, 31976, 32919, 38668, 40513, 42618, 37066, 30568, 33809, 30803, 30388, 35004, 36541, 35889, 35465, 32258, 29383, 29818, 38837, 34861, 32151, 33511, 31852, 29786, 28138, 24426, 22829, 26297, 24182, 25001, 28897, 26239, 27101, 31613, 32415, 32337, 31899, 26390, 23447, 28915, 35647, 36377, 35283, 38156, 38550, 34306, 35268, 36111, 30170, 25781, 22206, 28602, 35318, 33189, 29426]
11366B9426J589M191L399N350O92q406n054P010K331m964L45l434j788J929N97
11351C3213K731P098j344P59J815m641o17L33J388K20K752J716j26j587o754k504
11335C4452K516J512k103Q312P35j483n711L70M04K652j324P855L459j860k086
11320D7700m051m079K786O084K03m351k052P206L065m207j512J492n637L6l827
11305C8856m954k392m047N408Q619N354lm533k23o320N00K886J172J674L410O686
11289E2093k553p807o70p469L987M609K800n9K834M55j872l78L799Q344J792J068
11273F0973m500l827q131j75o207j489P717L188q525k465O329M04L936J0613J390
11258E9231n98l007K105k375o803N04L686J539L84J33p035M517P614j49k319L526
$$ y = [29426, 31015, 35206, 38605, 43955, 44647, 36241, 31187, 38197, 40528, 35564, 35909, 32475, 30687, 32616, 33213, 35944, 43042, 41698, 42457, 44272, 39631, 39014, 39347, 40735, 40955, 43707, 45423, 45297, 43710, 36956, 34452, 36968, 38480, 36377, 44689, 45424, 43941, 38230, 38600, 39004, 41656, 40332, 48187, 51646, 49786, 47700, 43649, 39570, 42356, 48440, 48643, 44292, 42240, 49446, 52511, 48304, 46792, 48284, 42647, 42683, 38856, 33902, 31510, 27463, 32871, 41490, 46844, 46841, 42308, 42085, 35765, 36265, 39151, 40323, 41997, 45407, 52093, 49540, 41733, 41063, 33594, 37581, 42190, 44990, 44931, 47765, 48220, 46348, 45970, 49769, 58113, 59905, 60973, 56473, 52646, 44515, 44340, 38133, 36644, 44361, 47549, 39024, 36559, 42888, 43292, 47228, 57841, 59231, 58633, 55626, 57731, 55356, 48553, 49057, 52743, 54282, 54666, 54799, 47764, 52281, 59895, 59746, 57427, 60953]
11242F0953k134l041N449P053o435k974r368l371O838j511l075M616R104K505
11228F4609j410L120n159J375o83m302k82k879o451M223P158O774N805k159j1749
11213E7990P50j239p691k619m79l896M024J00J504r57N369N702p618n732l332
11198D1876q55N467O337L169m107K152J051j462j1986K333J1877k901p918l101
11184D1932O09o64K339Q83O706p3m55k021J13N021n502n157O735P041k265j549
11168E3693L4k833k533P832L504L937P7P632m837l746O76N15K97q65N82j796N820
11151F7989P032J0372M899O456J2420Q519J0044O632L562n227o41P28r555j3027
11137A10203j2718j0884q603o000j409n362o94m06l786n3M626O674m95l964l908
$$ y = [60953, 58819, 55778, 61227, 68280, 61845, 58871, 49503, 46132, 52970, 51459, 48384, 53000, 62104, 64609, 63199, 66319, 61160, 62535, 61852, 57550, 57268, 54389, 47938, 52161, 59319, 66093, 71898, 69739, 57990, 58740, 57501, 49810, 47191, 46712, 42816, 46840, 46940, 48444, 47487, 52856, 58558, 50940, 45208, 41876, 41021, 46488, 52825, 55994, 51887, 54039, 55090, 53628, 41642, 43975, 55852, 52951, 45033, 41932, 42541, 41877, 44216, 45099, 51805, 51732, 51277, 49256, 49369, 54390, 48888, 43731, 50466, 57507, 55242, 53693, 53727, 50894, 48361, 56193, 59697, 63634, 63711, 71343, 66506, 62760, 63436, 63951, 64248, 63383, 63965, 62169, 67989, 75021, 85393, 90292, 96748, 109168, 117687, 127731, 134363, 137925, 132698, 132057, 132785, 123230, 110203, 97485, 86601, 77998, 71998, 70589, 65227, 64533, 64127, 60341, 60288, 64914, 71588, 71093, 67129, 63221]
11122F3221K353O633k614P85J528M59n173m726m467L680m943k29P741m73J443
11107F5218J394k28o396m726L812O548M119K419K391l097k248M6j654p67N853
11092G2684J717O561J3051r05P91M01J943m24o054o715K498l352K756k30j0891
11077G3831m259L100K353J080K3j338J932N234K906l827n856o705L32J882M345
11062G5033K534m453m108M055k902L260l679j3663j619N536L882m35L801O568
11048G3810l831o292p025l3Q492J224j324Q65M875L860K304l910Q49J142P31O126
11032H1863r034q128M922J062M242J259P722L534p280J486k064R95J357K197O111
11017I0244k475K651J481L115J0410J5180J5289J727k542o127j3550j252N602
$$ y = [63221, 65574, 72207, 69593, 70378, 71906, 72365, 67192, 62466, 57999, 61679, 56736, 56507, 64248, 63775, 65218, 66612, 66384, 59988, 55262, 59074, 65622, 69741, 72160, 74551, 71454, 69206, 69252, 67598, 66831, 72684, 74401, 80962, 94013, 93108, 93899, 94300, 96243, 95819, 89765, 83050, 85548, 82196, 84952, 84722, 73831, 69572, 72672, 75025, 76105, 76128, 74790, 76722, 81956, 84862, 81035, 75179, 68474, 68806, 70688, 75033, 77567, 73114, 69006, 73061, 70159, 73419, 69740, 56077, 54458, 59994, 63876, 63441, 67242, 73810, 69979, 63687, 56662, 56629, 65121, 66345, 65021, 65886, 70761, 74621, 76925, 73015, 73864, 75006, 75737, 81863, 72829, 64701, 69623, 70685, 74927, 76186, 83908, 87442, 80162, 81648, 79584, 80579, 81936, 84133, 90244, 87769, 90420, 91901, 95016, 105426, 120606, 135895, 137622, 135080, 128953, 115403, 114151, 119753]
11004A19753Q72J415J1075J95J73k780r714j2355k0589m920P053O609l679o899
10990H6209l536M42O3J126J301P946N424J097P154M360J0588J0134J2840J2576
10976A57724O857K696M632K042o060j2683j2045j3327j2371n400L65K19n54k176
10962A09919P13L927N464O929R145Q723j071k559j587K664k255j497J133l12o732
10947A32604p688M932K773o446q075l436l051o990k012M020L229O609M654J106
10933A22229o885L171J909P58K837l68Q171K498j477L502J0538l901p613K367
10919A37736M11M412m689k215P99m731r61P503L841Q328K378J697O236L298L774
10904A67817J3173Q794K538Q997J1140R106J3214J3782J8287K7828M7297O0787
$$ y = [119753, 120625, 122040, 133115, 133310, 133483, 130703, 120989, 108634, 88045, 83125, 90178, 96787, 93108, 86209, 82673, 83115, 83178, 84304, 85605, 93551, 98975, 100072, 107226, 111586, 122174, 132308, 145148, 157724, 164581, 167277, 171909, 173951, 167891, 155208, 143163, 129836, 117465, 112065, 112430, 112649, 112095, 109919, 110632, 114559, 120023, 126952, 136097, 144820, 143749, 141190, 139603, 142267, 140012, 138515, 139648, 139336, 132604, 124916, 129848, 132621, 126175, 118100, 114664, 111613, 104623, 102611, 106631, 109860, 116469, 121123, 122229, 115344, 118515, 120424, 121182, 124019, 123651, 131822, 134320, 132843, 136345, 146883, 142982, 135369, 137736, 138147, 142559, 137870, 135655, 136454, 131723, 130762, 138265, 142106, 150434, 152812, 154509, 160745, 164043, 167817, 180990, 189784, 192322, 201319, 212459, 221565, 234779, 248561, 266848, 294676, 341973, 402760]
10892D02760R4136J34455J87867K16383J89781J75999J25744J03815R1249P3624
10882A795813R1910N5787j0261l8844o7034o6829o9063r6390j14689j78186k06038
10871A096176j87856j69502j31109r7639o3604m2732l7114l5550k4257k0671k5060
10860B61082k2533k0643k2112j4002r697j2184j1849q022k745n359K734L60j80
10847A34850O202K3n536m292l625j782K958J193l950n932m245K96M599j84J676
10832A22251k413K622n500j5611o52P643Q41p172J674J3712L791J0411P284M976
10818A43857P67K77N146L292M084K725k355m46j22n70r07Q37k779J026P310l911
10802A58231n338L371k641J695l739n594L887n343j5376r520Q907K520j375k93
$$ y = [402760, 496896, 631351, 819218, 1035601, 1225382, 1401381, 1527125, 1630940, 1722189, 1795813, 1887723, 1943510, 1933249, 1894405, 1827371, 1760542, 1691479, 1595089, 1480400, 1302214, 1096176, 908320, 738818, 607709, 510070, 446466, 403734, 366620, 331070, 306813, 286142, 261082, 238549, 217906, 195794, 181792, 172095, 159911, 148062, 140040, 137295, 131936, 134670, 135030, 134850, 141052, 141075, 135539, 131247, 127622, 125840, 128798, 129991, 126041, 120109, 115864, 116160, 120759, 120575, 122251, 119838, 122460, 116960, 101349, 100697, 108340, 109181, 102009, 103683, 117395, 121186, 131597, 138881, 143857, 144624, 144901, 150047, 153339, 157423, 160148, 157793, 157347, 157225, 156655, 155748, 156585, 153806, 154832, 162142, 158231, 152893, 156264, 153623, 155318, 151579, 145985, 149872, 144529, 129153, 119633, 128540, 131060, 129685, 129392]
10788A29392N07N431N387O74J844J260k264L90o823o488J696K185P40M317l312
10773A34936Q35J597m396k084n665j3203m256M818Q604J1040O383P638L029J311
10759A50587M412R24J501J497k72j966J1135Q229k489k813K270M164P793j97O23
10744A85398P303R927J1330R660O977J0424J8933J7834N197P182K0164J4189J9045
10731C43563K1606R348K220K158L519l546k55P4p009j1361j6261j1337j2727j4132
10717C05860n643o963j4466j6196j2487q291p908o708l911N896K800p181j946
10704B22856O207k305Q67k434j856j153k220o51j331k959J118O990J672q58j845
10689B22098q22M492Q919Q729j041N497R683L456L040L249J0138K480n140r970
$$ y = [129392, 129899, 135330, 140717, 141391, 143235, 144495, 142231, 142621, 135798, 129310, 131006, 133191, 133931, 138248, 134936, 135771, 137368, 132972, 130888, 125223, 112020, 107764, 112582, 121186, 132226, 138609, 146247, 149276, 150587, 154999, 155923, 157424, 158921, 158649, 156683, 167818, 176047, 173558, 170745, 173015, 177179, 184972, 184775, 185398, 192701, 202628, 213958, 223618, 230595, 241019, 259952, 277786, 282983, 290165, 310329, 324518, 343563, 365169, 374517, 376737, 378895, 382414, 378868, 378613, 378687, 371678, 360317, 344056, 332719, 319992, 305860, 300217, 293254, 278788, 262592, 250105, 241814, 233906, 227198, 223287, 229183, 231983, 224802, 222856, 229063, 226758, 227625, 225191, 223335, 222182, 219962, 219311, 217980, 215021, 216139, 223129, 224801, 223943, 222098, 221276, 225768, 234687, 243416, 242375, 247872, 257555, 261011, 264051, 267300, 277438, 279918, 274778, 264808]
10675B64808o334k381q746j2250k787j3051j3348j701l429j0776r333k963j252
10662A76457o404n064J427J261p61M205J808m046J0124J7444J3406N148L922R264
10648B28191N226J291J683l21L385Q250J4229J488j177J2403J4679R585k432o527
10634B89953J005J146K139l735r083p821Q160Q145P442Q312m260o58J0029J1207
10620C21981J1153J0177Q442O445Q547O141P598Q041O788M395K244L428p906q893
10606C88581k1703r194J116p760m105k708R377R640L447Q029J3552J2319J7872
10593D18463K5225K4080K1839K0164K5864L5016K1753J9608K4266K5738K8201
10582F90217L8246M1911L9298M6652M0067L8277L0817L1428L9717L9668L3817
$$ y = [264808, 258474, 256093, 247347, 235097, 232310, 219259, 205911, 204210, 200781, 190005, 180672, 177709, 176457, 170053, 164989, 166416, 167677, 166916, 171121, 172929, 168883, 179007, 196451, 209857, 215005, 218927, 228191, 233417, 234708, 236391, 236070, 239455, 247705, 261934, 263422, 262245, 274648, 289327, 298912, 296480, 289953, 290958, 292104, 294243, 290508, 281425, 273604, 281764, 289909, 297351, 305663, 301403, 300745, 310774, 321981, 333134, 343311, 351753, 358198, 366745, 372886, 380484, 388525, 395313, 399708, 401952, 405380, 397474, 388581, 366878, 357684, 358800, 351040, 346935, 344227, 353604, 363244, 366691, 374720, 388272, 400591, 418463, 443688, 467768, 489607, 509771, 535635, 570651, 592404, 612012, 636278, 662016, 690217, 728463, 770374, 809672, 856324, 896391, 934668, 965485, 996913, 1036630, 1076298, 1110115]
10571A110115K6080L7080M0447L7179K3229L1201J7554m629m060R840K2017J6465
10559A362518J3650J2838K0070K0918J1571J66j1586j9647k5607k0568n633J2412
10547A371102K3272L1314K7881K4305K4549L9301L9464L8479L2418L6087L9775
10536A727947M5618N1710M8020N0230O2009P0128O6246P5155P7325P7894P4420
10525B426702Q5377J06700J07740J12747J16866J26837J44759J63089J67372J82331
10515C740520J99479K17122K39721K68195K90371L21538L53534L89754M45403
10506F465637N09107N77051O59044P94264R74368J153817J324469J528809J607185
10497A5593751J667929J775611J862701K133487K357571K704134L213798L704251
$$ y = [1110115, 1136195, 1173275, 1213722, 1250901, 1274130, 1305331, 1322885, 1318256, 1314196, 1324036, 1346053, 1362518, 1376168, 1389006, 1409076, 1429994, 1441565, 1441731, 1430145, 1410498, 1384891, 1364323, 1358690, 1371102, 1394374, 1425688, 1453569, 1477874, 1502423, 1541724, 1581188, 1619667, 1652085, 1688172, 1727947, 1773565, 1825275, 1873295, 1923525, 1985534, 2055662, 2121908, 2197063, 2274388, 2352282, 2426702, 2512079, 2618779, 2726519, 2839266, 2956132, 3082969, 3227728, 3390817, 3558189, 3740520, 3939999, 4157121, 4396842, 4665037, 4955408, 5276946, 5630480, 6020234, 6465637, 6974744, 7551795, 8210839, 9005103, 9979471, 11133288, 12457757, 13986566, 15593751, 17261680, 19037291, 20899992, 23033479, 25391050, 28095184, 31308982, 35013233]
10489C5013233M535968N825660P723418J0842361J5738035K3822305L5092696
10482A38593676M0298299L3890279L1084995K2611997J6395101J3747525J0245723
10475C06867595J6279750R363651l751534o741313j1324276j2353856j0733129
10468B87606888j6719731j8014959k8466009l6205916l5706705l2228002k4832064
10461I5433502j7361335j2086456q895086o791759n758677n238141m854573m684885
10453B9762590m277310l724985l130782k526383k112336j804084j530284j312688
10445I343738j138693r56657q07004o68840n50972m57454l87281l35383k93432
10436C748022k64656k32370k09873j90117j83006j66599j49647j35136j26742
$$ y = [35013233, 39549201, 45374861, 53098279, 63940640, 79678675, 103500980, 138593676, 178891975, 212782254, 243867249, 266479246, 282874347, 296621872, 306867595, 323147345, 332510996, 328759462, 322018149, 310693873, 298340017, 287606888, 270887157, 252872198, 224406189, 188200273, 152493568, 120265566, 95433502, 78072167, 65985711, 57090625, 50298866, 44540189, 39302048, 34447475, 29762590, 25485280, 21760295, 18629513, 16103130, 13990794, 12186710, 10656426, 9343738, 8205045, 7248388, 6441384, 5772544, 5221572, 4764118, 4376837, 4041454, 3748022, 3483366, 3250996, 3041123, 2851006, 2668000, 2501401, 2351754, 2216618, 2089876]
10427B089876j16821j07041r7224q1204p0956o7631p1207o4614o3983o9573o4089
10416A215533n1564m7452l6823m5582m5143m2441m5802m3993m5367m2677l5513
10405G33176l2708l4141k2710k1986j8148l430m837j3473j3546r927j1026r629
10393E37615n818o255j0661p910p171m666j1545j0714j5166q429j3869k0772j7264
10380C97375j0195k1315o928m387n613j2372q256p326R44O890Q862J0439J1036
10367C59154J1723K078L283o389l981l314L915J4579J8832J8401P084J5934K7138
10354D68437K5051J5883J8029J4767J0863J0162J176M911M965q550p950j5348
10342E42396j8202j9331k7513l1716k1546j8237k1235k9851j9771j1147m304j0364
$$ y = [2089876, 1973055, 1866014, 1768790, 1687586, 1616630, 1548999, 1477792, 1413178, 1349195, 1279622, 1215533, 1163969, 1116517, 1079694, 1034112, 988969, 946528, 900726, 856733, 811366, 768689, 733176, 700468, 666327, 643617, 621631, 603483, 600053, 595216, 581743, 568197, 558270, 547244, 537615, 531797, 525542, 514881, 506971, 499800, 495134, 483589, 472875, 457709, 449280, 435411, 414639, 397375, 387180, 365865, 358937, 354550, 348937, 336565, 328309, 320983, 321927, 328817, 337679, 348118, 359154, 370877, 372955, 376238, 369849, 365868, 362554, 366469, 381048, 399880, 418281, 425365, 441299, 468437, 493488, 509371, 527400, 542167, 553030, 563192, 564368, 569279, 574244, 565694, 557744, 542396, 524194, 504863, 477350, 445634, 424088, 405851, 384616, 354765, 334994, 323847, 319543, 309179]
10330C09179o919m444j2464r437j812p034j0644j2572n737J227k284j148q879
10317B27032j1723n989o013m568j5176j3767o453q708J93l307n247m183J292M55
10303A43838o653k428J986l858o691m858P239J0404J3987O097J0452P409m329
10290A72595j3467K905Q873R77Q42Q19n277j6095j4765k895n060j6781r089j9581
10276H4001j7035j4566r633k548l724n58l331j0060r122j77Q84k446N917l464
10262A4138n067J1227N512M603P661r37r774J120O246P189p08J789L719p544p368
10247C1806j0066Q84L132m840o701p26j604m500j13O859J1942K514o84l402J86
10232B4687O63l41P27m857j238q05k024p051k63K129n709P54O965J743O306M326
$$ y = [309179, 302260, 297816, 285352, 275915, 274103, 267069, 256425, 243853, 238116, 239343, 237059, 235911, 227032, 215309, 209320, 203307, 198739, 183563, 169796, 163343, 154635, 154828, 151521, 146274, 142091, 143383, 143838, 137185, 134757, 136743, 132885, 126194, 121336, 128575, 138979, 152966, 159063, 169515, 176924, 172595, 159128, 162033, 170906, 171883, 172725, 173544, 168267, 152172, 137407, 134512, 129452, 112671, 103582, 84001, 66966, 52400, 42767, 40219, 36495, 35937, 32606, 22546, 13424, 13247, 14131, 11685, 17602, 14138, 9071, 20298, 25810, 30413, 38074, 37137, 27363, 28483, 34729, 41918, 41210, 42999, 46718, 39174, 31806, 21740, 22624, 25756, 20916, 14215, 13489, 11885, 7385, 7272, 14131, 26073, 28587, 27903, 24501, 24687, 25350, 25009, 25736, 20879, 19641, 18836, 16812, 9761, 9498, 11627, 5918, 6672, 13637, 15380, 21686, 26012]
10216B6012n269k276M274J634k745p145R934L261l57m342m174o89K231l005q084
10201I260j429J793N966L565O16n299j773O18k324N109j579l942j737L770P199
10186A9813O37j677K589M53r06L7N885k399n485P25Q338j75l966o142k918o512
10170H297l951K053m591m602L446j018j414L339p83j055j983O568j789j1463o683
10155a5629M427M306q14j1229j9663o247m788n31L254O148J599j14K27l733J943
10140d0844N028j035q84N065K737j258j288l396M009L381j335m229K736P577J696
10125b2040N78K699N71l040l742O935R157N765p427l452L936R042J0473M042o029
10110G468j187m354n51j850L219N172K98k007J835P887L290p06j725O666L526
$$ y = [26012, 20743, 18467, 22741, 24375, 21630, 14485, 24419, 27680, 27323, 22981, 18807, 18118, 20349, 17344, 9260, 7831, 9624, 15590, 19155, 19771, 14472, 12699, 13317, 10993, 16102, 14523, 10581, 8844, 12614, 19813, 20450, 18773, 21362, 21815, 20909, 20946, 26831, 24432, 18947, 19672, 28010, 27835, 23869, 17727, 14809, 8297, 4346, 6399, 1808, -2794, 652, -366, -1780, 1559, 776, -279, -2262, 4306, 2517, -8946, -15629, -11202, -6896, -7710, -18939, -38602, -44849, -49637, -50168, -46914, -40766, -39167, -39281, -39054, -42787, -40844, -35816, -36851, -37735, -32670, -29933, -31191, -32479, -35875, -31866, -28485, -29820, -34049, -31313, -23736, -22040, -21462, -18763, -18192, -21232, -24974, -18039, -8882, -3117, -10544, -13996, -10060, -1018, 9455, 13497, 7468, 6281, 1927, 1376, -474, 2745, 7917, 8215, 6208, 8043, 15930, 19220, 18514, 16789, 23455, 26981]
10095B6981p845l653M232N768K937K394J555P543J1589O957P683J2021R043N744
10081I2949N877R243J4713K2817K2347J9802K9508M0294O4102Q1884J28738J96326
10069G28600K17034J85524J74631J32609J12223Q5217O7141R9935N8498n599k7370
10058A828443o3628o8589p2495j07396j22383j79401k12249k06068j82113j36470
10048D77651j01399p3342m8380l4036l2139l0511k7624j9098k0696j4082j4505
10037F1839j7339j4762j2772q471p358j0328o551l863l193K451J386j4030q352
10024d1343O630M092l584j003n95j953J345O697P562Q9Q06j951L702M986k364
10009a6884l309J427q75n045L29J299j178n45J886J1179K094j030M91n696l658
$$ y = [26981, 19136, 15483, 19715, 25483, 28420, 30814, 32369, 39912, 51501, 58458, 66141, 78162, 87205, 92949, 98826, 108069, 122782, 145599, 167946, 187748, 217256, 257550, 321652, 403536, 532274, 728600, 945634, 1131158, 1305789, 1438398, 1550621, 1635838, 1702979, 1802914, 1861412, 1855813, 1828443, 1764815, 1696226, 1623731, 1516335, 1393952, 1214551, 1002302, 796234, 614121, 477651, 376252, 302910, 254530, 220494, 188355, 157844, 130220, 111122, 90426, 76344, 61839, 44500, 29738, 16966, 8495, 1137, -9191, -15742, -19605, -22798, -20347, -18961, -32991, -41343, -34713, -30621, -34205, -35208, -35803, -37756, -36411, -29714, -22152, -22063, -21257, -23208, -19506, -14520, -16884, -20193, -18766, -19641, -24686, -24357, -23058, -24236, -24781, -22895, -11716, -9622, -10652, -10161, -15857, -19515]
9994a9515k8j281j039k105k935k569K952M980m411n862J9K914k238M113Q753R76
9978a7276K295q08r539p704k841k186L397O882L922J714j048N303L183L281N35
9963a0890o641M13O383P265O392J1393M401p010q575o396p926k954q477n891k835
9948c1348K685k492N205M807m446n333P158M634l484j819m564p753N253R084N120
9933a7293L256O63p67k853n252j883N506k16l595l190l903P70k377n84J221J071
9917b9426P0M394K255o59l827K948l19m612k642J849L476k210M598m15o21M392
9901b0749K065j180J60l319j725k722q24P270K199J308m793R27J258k605n178
9886b7908j047q18j82R67M957K152M392K022J08r078q971n274M41L872P545L532
$$ y = [-19515, -19543, -20824, -21863, -23968, -26903, -29472, -26520, -21540, -25951, -31813, -31794, -28880, -31118, -27005, -18252, -17276, -14981, -15789, -25328, -33032, -35873, -38059, -34662, -27780, -23858, -22144, -23192, -17889, -14706, -11425, -10890, -17531, -17118, -10735, -3470, 2922, 14315, 18716, 11706, 3131, -3265, -11191, -14145, -22622, -28513, -31348, -28663, -31155, -25950, -21143, -25589, -30922, -23764, -19130, -22614, -24433, -28997, -36750, -31497, -22413, -17293, -14037, -13374, -14141, -16994, -22246, -24129, -18623, -18839, -22434, -25624, -29527, -28757, -31134, -31718, -30497, -29426, -29356, -24962, -22707, -23366, -27193, -24245, -24564, -29176, -31818, -29969, -26493, -28703, -24105, -24520, -25141, -20749, -18684, -19864, -19704, -23023, -24748, -27470, -28294, -21024, -18825, -17517, -22310, -21383, -20125, -22730, -27908, -28955, -29773, -29955, -28988, -24031, -21879, -17487, -15465, -15357, -24435, -33406, -38680, -38239, -34367, -26822, -23290]
9870b3290M115l643o944j711J346L086o397J890K174L86j220Q1J331l517M487
9855b7826J423K628o517J74K032m892M514R97R39L226N695O294N80l74j467K497
9839a0077l727j0235j193O582p174k353qp248q435P14R989Q010l163P778N775
9824a4765l439p158q215l636M108O003n42j24K976o74J609l526m305L840j027
9809b8875m310J103J224P098K319m508n913n310l645J1205O250J725l718j865
9795b7220N66j501J225J067k608m710R52o41J140l803j07Q37N71N658Q630J676
9779a8268n430k745N498M603j904K264O83L134k224q20j0462q095j50j985N455
9764c0446P585M293K155J0433J090o994P78r51j341R08J388O716P319r482m513
$$ y = [-23290, -19175, -22818, -29762, -31473, -30127, -27041, -33438, -31548, -29374, -28988, -30208, -30127, -28796, -32313, -27826, -26403, -23775, -30292, -30118, -28086, -32978, -28464, -27467, -26528, -23302, -17607, -11313, -10733, -11107, -12574, -10077, -13804, -24039, -25232, -18650, -25824, -28177, -28185, -35433, -43868, -43154, -33165, -25155, -28318, -20540, -14765, -18204, -25362, -33577, -37213, -33105, -27102, -27644, -27768, -24792, -25466, -23857, -27383, -31688, -27848, -28875, -33185, -32082, -30858, -23760, -21441, -25949, -31862, -37172, -40817, -29612, -23362, -21637, -25355, -27220, -26654, -28155, -26930, -25863, -28471, -33181, -32229, -32870, -31730, -35533, -35640, -34803, -34232, -28574, -19944, -18268, -23698, -26443, -20945, -16342, -18246, -15982, -15299, -12165, -14389, -15209, -25671, -33766, -33916, -35901, -30446, -22861, -18568, -16413, -5980, -4890, -11884, -11106, -12057, -13398, -12490, -11102, -4386, 2933, -6549, -11062]
9749a1062K687n429N94J298L827n40l583l798q336K199K511n757P94J108J342
9734b2145j817K219M101j149J926P013j636o143o657j273J929K587J293m985o977
9719c1714K335L822L121L784L921J147j432o813m504k63R782L236N07l191m897
9704b1159j924M054J134M38m070l188L822J653k998j641k831J899M207K212P343
9689a1049L659m679j2590m850N266N102j262o958K134O272O160M962j026l132
9675a1991k607L939R208K105l873p40p07q583l109J043m680l187J982k845L428
9660b0617M667K560J020j009L881J169l385K412O299K057o004k828R70q63j813
9645a1484o03M634k221l178N487j244m132n033J0578J1393j226l198j729j509
$$ y = [-11062, -8375, -13804, -13210, -11912, -8085, -8625, -12208, -16006, -24342, -22143, -19632, -25389, -24595, -23487, -22145, -23962, -21743, -17642, -18791, -16865, -9852, -11488, -17631, -24288, -25561, -23632, -21045, -19752, -24737, -31714, -29379, -25557, -22436, -18652, -14731, -13584, -15016, -21829, -26333, -26596, -16814, -13578, -13071, -16262, -21159, -23083, -19029, -17895, -17457, -21527, -24715, -20893, -19240, -22238, -23879, -26710, -24811, -20604, -18392, -11049, -7390, -12069, -24659, -29509, -24243, -19141, -20403, -27361, -25227, -18955, -12795, -7833, -8859, -11991, -14598, -10659, -1451, 654, -3219, -3959, -4666, -13249, -16358, -15315, -19995, -23182, -21200, -24045, -20617, -15950, -13390, -12370, -13379, -9498, -8329, -11714, -9302, -3003, -946, -6950, -9778, -8808, -9671, -11484, -12087, -7453, -9674, -12852, -7365, -8609, -12741, -17774, -7196, 4197, 2971, -227, -1956, -3465]
9631c465Po926k098O031m56p356j947J465K270J304n468L420J2029P683M79M546
9615A1518n820m809J449J87j016Q9J946r89P462N002l091l726K435K826r90j786
9599A0687k061K423O39J011M06o107J981N061m43r54l966o3Q919M632k313j21
9583A9731j271Q448J473K097L360R55L083R95K93L035m873Q84K082p947l543R341
9567C8143P54L021P502%J528O421J157M806O650j840l041Q308N479R393J788n347
9551H4722R257L525O364J913J727J1198M361M308J2982J1514J8855N926J525K854
9537A81031J4427Q520L600J3846J4030J0563J9054K0347J5443K1027J7242J5844
9525C54974K3150J4397K2703K6375L1717L3931L7670L5523M3538M2375M6455N4508
$$ y = [-3465, -3458, -10384, -12482, -6451, -6907, -14263, -16210, -14745, -12475, -11171, -16639, -13219, -1190, 6493, 6972, 11518, 5698, 889, 2338, 2525, 1509, 1598, 3544, 2555, 10017, 15019, 11928, 8202, 10637, 13463, 12473, 10687, 8626, 11049, 11688, 12699, 13105, 6998, 8979, 14040, 13597, 12643, 8677, 8614, 17533, 22165, 19852, 19731, 18460, 26908, 28381, 30478, 33838, 34793, 37876, 38871, 39164, 42199, 37326, 38210, 40292, 32345, 28802, 38143, 38897, 41918, 49420, 49420, 50948, 57369, 58526, 63332, 69982, 68142, 65101, 73409, 78888, 88281, 90069, 84722, 93979, 97504, 103868, 105781, 107508, 118706, 123067, 127375, 140357, 151871, 170726, 176652, 178177, 181031, 195458, 203978, 207578, 221424, 235454, 246017, 265071, 285418, 300861, 321888, 339130, 354974, 378124, 392521, 415224, 441599, 473316, 507247, 544917, 580440, 623978, 666353, 712808, 767316]
9513G67316M9890M9009N2327N8266O0419N1779M3863L5102K6526K8267J7468K703
9501A242935q699j5071k5137m2137m3377m8581n1353m7673n1029n9152n6603n2877
9489G41246m7180m2806l6373l9753m9971l3349l5215l8811k7180k8230k7712j8564
9477C16102j5744j2202j7840j7494j3918r888q605q795j6954j5827j3251j6603
9465A48981j2869n195n245r239o138l651J810k937l962p415q917j359j319R14
9451H3459n042j2169r300L29M220K245j209l109m076n4j90j985r090p625j501
9436C4903k444m171N28Q732k164k269l778k702l77j759R09K886J404o894p225
9421A5579j0092K162J0742k227p51m086J202K386N907p078k147K019J0J681M47
$$ y = [767316, 817206, 866215, 918542, 976808, 1037227, 1089006, 1132869, 1167971, 1194497, 1222764, 1240232, 1242935, 1234236, 1219165, 1194028, 1151891, 1108514, 1059933, 1008580, 960907, 909878, 850726, 794123, 741246, 694066, 651260, 614887, 575134, 525163, 491814, 456599, 417788, 390608, 362378, 334666, 316102, 300358, 288156, 270316, 252822, 238904, 229016, 220411, 211616, 194662, 178835, 165584, 148981, 136112, 130917, 125672, 116433, 110295, 106644, 108454, 105517, 101555, 94140, 85223, 83864, 82545, 83459, 78417, 66248, 56948, 57277, 61497, 63742, 62533, 59424, 55348, 55294, 55104, 53119, 44029, 36404, 34903, 32459, 28288, 28816, 37548, 35384, 33115, 29337, 26635, 26258, 24499, 25408, 28294, 29698, 22804, 15579, 5487, 7649, 18391, 16164, 15413, 11327, 12529, 14915, 20822, 13744, 11597, 13616, 13626, 15307, 15754]
9406A5754m783j63L92L317j096Q11l8m80L857k734j3537m620L084N346k313K420
9390E217q154O78N118p224l279k155J976K298l106K968R799K186P938j074p654
9375E532K323j069o128l530L310L87l907j858m087j271J210J675K163L303l204
9360e151q32m45m605K858J0789M772L542M979k624k588n06j0995k447k660m42
9345f355N501M827j0743k580j831N60M419O38j819k94O938k575l654l316O143
9330d141K100N867n261k352m135J466L33L690j476p403n346l784L630M686J617
9315a0509J66J187M374N645P21p94k025L531n878k430n570j131P915j946m376
9300a1120Q499N977j763m609N891K73L216j440K77n100m788K209K545k42n650
$$ y = [15754, 10971, 10808, 11200, 14517, 13421, 14232, 14194, 13714, 17571, 14837, 1300, -3320, -236, 5110, 2797, 5217, -2937, -2259, 2859, -4365, -7644, -9799, -7823, -5525, -8631, -5663, 4136, 6322, 14260, 13186, 5532, 7855, 6786, 658, -2872, 438, 825, -3082, -4940, -9027, -10298, -9088, -7413, -5250, -1947, -5151, -5983, -6428, -11033, -8175, 2614, 7386, 10928, 15907, 13283, 10695, 10189, -806, -3253, -5913, -6355, -854, 3973, -6770, -9350, -11181, -10621, -6202, -5564, -7383, -7677, -739, -3314, -6968, -10284, -4141, -2041, 3826, -1435, -3787, -7922, -6456, -6123, -2433, -3909, -11312, -16658, -20442, -16812, -12126, -10509, -10343, -9156, -4782, 863, 1584, 790, -1235, 2296, -3582, -6012, -11582, -12713, -4798, -6744, -11120, -2621, 3356, 1593, -3016, 2875, 3148, 6364, 4924, 5201, 101, -4687, -2478, 67, -175, -5825]
9285e825J445M694j877m036r95K863j74j066J889j219l927r50j899k561m060o95
9269a8393N997M337k81l183J072r8l938o985j224N202J482K727L725R82q225J842
9253a4961K237J548N427L594M247k799o038k398l185j315m130j621j176L223k741
9238b0088J783n75p6M617k759n456K827L826N652j676k771p92l252J775J251J93
9222a5521R1K774k768N387Q295K68m735p0Q69R037k525r148K545K630p4O51j308
9205c602j552j0188o434j209M600j925j204J986N953L115k335k974R92K023K909
9190i845l050M368K872L474q235j091j241j742K151J2526m452j734j484J655M7
9175e781J275L256N422j796K55K476l889j179k550j555o106K94L211k300j543
$$ y = [-5825, -4380, 314, -1563, -5599, -6594, -3731, -3905, -4971, -3082, -4301, -8228, -9178, -11077, -13638, -17698, -18393, -12396, -8059, -8340, -11523, -10451, -10549, -14487, -21472, -22696, -17494, -16012, -13285, -9560, -8578, -16803, -14961, -12724, -11176, -5749, -2155, 2092, -707, -6745, -9143, -12328, -13643, -17773, -19394, -20570, -17347, -20088, -18305, -18880, -18956, -14339, -17098, -22554, -19727, -15901, -10249, -11925, -14696, -15488, -18740, -16965, -15714, -15521, -15430, -12656, -15424, -10037, -1742, -1474, -6209, -6279, -5410, 3627, 1102, -8046, -5501, -2871, -2945, -2294, -3602, -5154, -15342, -21776, -22985, -18385, -20310, -21514, -19528, -13575, -10460, -12795, -15769, -14777, -12754, -9845, -12895, -8527, -5655, -2181, -10416, -11507, -12748, -14490, -12339, 187, -4265, -5999, -7483, -5828, -5781, -4506, -1250, 4172, 2376, 2631, 5107, 1218, 39, -2511, -4066, -10172, -9878, -6667, -8967, -10510]
9160a0510m335j619M625O842k745n102r51N174p70O772n45N80m673r000j130O081
9144a1306N418r35l259l833J339L435k656o090m360K152K796L814Q939k63k055
9129f864Q11l345m22L854M402o810l355n505j002O176P195K364l786l046J083
9114h250L505o12N767K572j3889k460M631M226N905n106K325k558j519J712r34
9099d685J997n632j335M144J965n500p1J759k284m507k563k22L830L937j658j361
9083a2186j392k182m290J814J315J551l578J045L932N755Q546m458m739J803j059
9068h123j296j19N449L062k372k366n343j48m062K72M948K775n003k794j22J093
9052a4149m599L365L370Q00k629R67P131k257j765q85L571l671l901r36K215M721
$$ y = [-10510, -14845, -16464, -11839, -4997, -7742, -12844, -13795, -8621, -9391, -2619, -3164, -2584, -7257, -16257, -17387, -11306, -5888, -6823, -10082, -13915, -12576, -9141, -11797, -17887, -22247, -20095, -17299, -13485, -4546, -4809, -6864, -6053, -9398, -9820, -5966, -1564, -8374, -11729, -17234, -18236, -12060, -4865, -2501, -6287, -9333, -8250, -4745, -5357, 410, 2982, -10907, -13367, -8736, -4510, 1395, -3711, -1386, -3944, -5463, -3751, -4685, -2688, -8320, -9655, -5511, -3546, -9046, -9117, -7358, -9642, -14149, -16712, -16934, -13104, -9167, -10825, -12186, -13578, -15760, -20050, -18236, -16921, -15370, -18948, -17903, -13971, -8216, 330, -4128, -8867, -7064, -8123, -9419, -9538, -4089, -1027, -3399, -5765, -11108, -11256, -15318, -15046, -10098, -7323, -12326, -15120, -15242, -14149, -18748, -15383, -12013, -11213, -13842, -12875, -5744, -8001, -9766, -10651, -7080, -10751, -14652, -15588, -13373, -8652]
9036h652n34n481p77O506N222m036k904M471N819k803k644L026j721l685L519
9021d674K067m255m553m354K405L87m682l686J500J1309P612L290N461l192j0719
9006f084J192O4m485j754K736N489N65k899Q42k161j447l620k478N537M34q28
8990h897L591K424o531j63R98L495l423j223l7K394O328l719m707j678k971K427
8974a1692M310m042l891m885R780N227J66P95J847j322m430K024o44Q185J368
8959B796j236m73k547L413j367k305k091j369j150q083J604L195M911j313J429
8944d586O95k338j631K516J798k441j422k136J0605m152p733N21K113j844L460
8929f575J767o072P18J0825k130J918n917L32K820L629l256J828O25p83j927m907
$$ y = [-8652, -9186, -14667, -15444, -8938, -3716, -7752, -10656, -6185, -366, -3169, -5813, -2787, -4508, -8193, -4674, -2607, -6862, -11415, -15769, -13364, -12977, -17659, -21345, -19845, -8536, -924, 2366, 7827, 4635, -6084, -4892, -4828, -9313, -11067, -8331, -2842, -2277, -5176, -4334, -6495, -7942, -11562, -14040, -8503, -8069, -8897, -5306, -2882, -9413, -9576, -8578, -5083, -8506, -9729, -9766, -7372, -1044, -4763, -9470, -11148, -14119, -11692, -7382, -11424, -15315, -20200, -10420, -5193, -5027, -4232, -2385, -3707, -8137, -6113, -6757, 1428, 2796, 1560, 1087, -1460, 1953, 586, -1719, -3810, -5179, -6329, -14412, -12808, -9613, -4702, -6015, -4586, -3891, -6229, -7860, -5344, -3546, -5987, -7409, -9545, 1060, -3092, -10825, -10304, -8191, -10035, -6575, -4808, -10880, -10162, 663, -1467, 451, -5466, -5134, -2314, 1315, -1941, -113, 512, -271, -2198, -7105]
8913g105k393j61l402R09M238L348J823J889j435J534K842J328K872K380k347
8898F320l719r200n476Q150M192m898m027l313L247L764l342l502n581m975K037
8883b0323j602k358q38m66N582Q891J11J824j127q76K888L046r15k989J497K57
8867g398k924m147M669K173l860M119L232L125m872k797K568R845L229n801J753
8852B914P223j601q325p164J472m077K032L905n499j408j851J815J956j433p291
8837a7332q084L667O644P030L673M715q153n455O8k56K388M611R89J561O787k821
8821C2K696J740m988m895k112K094L863N164m80l000o677p946j737KM266J801
8805a0177L318j450J107J898K905m69J987J815n776k803M54o437K201L586j423
$$ y = [-7105, -9498, -9659, -13061, -12152, -7914, -4566, -2743, -854, -2289, -755, 2087, 3415, 6287, 8667, 6320, 2601, -6599, -12075, -3925, 267, -4631, -8658, -11971, -8724, -4960, -8302, -11804, -17385, -22360, -20323, -21925, -24283, -25121, -25587, -20005, -11114, -11003, -9179, -10306, -11182, -8294, -5248, -6163, -9152, -7655, -7398, -10322, -14469, -9800, -7627, -11487, -7368, -4136, -1011, -5883, -8680, -6112, 3733, 6962, 1161, 2914, 10137, 8536, 211, -6953, -5481, -9558, -7526, -3621, -9120, -10528, -12379, -10564, -8608, -10041, -17332, -25416, -21749, -15105, -8075, -4402, 313, -7840, -13295, -13227, -13483, -11095, -6484, -5495, -3934, 2853, 32, 2728, 4468, -520, -5415, -7527, -5433, -1570, 3594, 3114, 114, -6563, -14509, -16246, -16244, -11978, -10177, -6859, -8309, -7202, -5304, -2399, -2868, -881, 934, -4842, -7645, -7191, -13628, -11427, -7841, -9264]
8790i264Q19n285n932J641M56J0224P326K578m807n143k447Q02Q08l697k787R6
8774a4612Q643R72J086Q974M236k549j816L33o897k955N279K044r99L709J228
8759F676j457k281l687M461j936M83k838o462J893Q287M983k165j993j1190K949
8744d277Q221l339k649j852j102J998J094J836J509n134k55M875K940l7j246k569
8728A3P91m447l457j282M848L295l043L048M119P656O754K77M13J90l294p445
8712H436p708K407K319P467j413p581j607K682L354l12N72o231n778L78N117N906
8696H008l204P018P484k371n665j705o062J302K879J409M50q884k21J0625p57
8681A0306J92L743r68p497j826M826L611k376j441J208K213l738o783l64m943
$$ y = [-9264, -8445, -13730, -19662, -18021, -17565, -7341, -15, 2563, -2244, -7387, -9834, -9032, -8224, -11921, -14708, -14612, -5969, -4997, -3911, 5063, 9299, 6750, 4934, 5267, -1630, -4585, 694, 2738, 1739, 5448, 6676, 5219, 2938, -749, 3712, 1776, 2259, -579, -7041, -5148, 3139, 8122, 5957, 3964, -7226, -4277, 3944, 605, -2044, -3896, -4998, -3000, -1906, -70, 1439, -3695, -3950, 925, 3865, 3828, 2582, 13, 804, -3643, -7100, -8382, -3534, -239, -3282, -234, 3885, 11541, 18295, 18572, 18985, 19175, 15881, 8436, 728, 3135, 5454, 12921, 11508, 3927, 2320, 5002, 8356, 8044, 8616, 2385, -3393, -3015, 2102, 8008, 4804, 11822, 19306, 16935, 11270, 9565, 3503, 4805, 7684, 9093, 9543, 659, 438, 11063, 10306, 10498, 14241, 13273, 5776, 3950, 8776, 12387, 10011, 8570, 9778, 11991, 8253, 1470, 1106, -3837]
8666c837N895J094K466p138m973J2245J4129J826m054J394K944N239k94l550j070
8651B2316m49n947o585L23N659q10p45K638k886k466o320J384M004L557N018L284
8635B1975L431J17L153j230j840m83k138m111k829o751L267L794l401K089L456
8620A8499M830K970O58k478j509K713p126n184N964K402j984N003j196P689J632
8605C2883N323O174J463k235K293J78l361R926Q108K696K216Q819J715J0537J5058
8590A01793J0119P013K383J1087J5241O216J0904J1034L085J210l665j4839j2487
8577A49094p901j0727j2375j6114j7980j1074m792n646m46m230k873j882p128
8564D5926k949K510l324j643P41o905l018p668l786j513j1L017j365N064M147
$$ y = [-3837, 2058, 3152, 5618, -1520, -6493, 5752, 19881, 21707, 17653, 19047, 21991, 27230, 26936, 23386, 22316, 21867, 15920, 9335, 9658, 15317, 14507, 13762, 16400, 13514, 11048, 4728, 6112, 10116, 13673, 18691, 21975, 25406, 25523, 28676, 27446, 25606, 25123, 22985, 18874, 16045, 9294, 12561, 16355, 12954, 15043, 18499, 23329, 26299, 26957, 24479, 22970, 25683, 18557, 13373, 19337, 21739, 19755, 24758, 23562, 31251, 32883, 38206, 44380, 45843, 43608, 45901, 46079, 42718, 52644, 60752, 63448, 65664, 74483, 76198, 86735, 101793, 111912, 118925, 121308, 132395, 147636, 153852, 164756, 175790, 178875, 180085, 176420, 161581, 149094, 141193, 130466, 118091, 101977, 83997, 72923, 68131, 62485, 62039, 57809, 54936, 53054, 45926, 42977, 45487, 42163, 40520, 41261, 34356, 31338, 23670, 19884, 18371, 18360, 21377, 20012, 25076, 29223]
8549B9223o257n624m561l779m343O242O347L168q44p423J32j394l503n824O34
8534B194L466j894k241L790J0584L389L304K748j56M55n73k148q780p595l380
8519C163j9k447O53L658M300L70m256m210L550M317M195J702K287m320m792R64
8503I115J579K908K21k830k001m741j034L199q649J424O175R738L483n687n308
8488G592j216K090l729m647L04M395J529K958J698J948Q10p588O761K336m465
8473A0776M293k505m394l493p856k128j137k425L550K967O897M307n938j938L86
8458A362l070M622R54l897m413Q29N826M510L778O666m227k322j339j590M521
8443A2210N177k124n022n091m300n645J053L016n503k763K831O97K33k992K039
$$ y = [29223, 22966, 17342, 12781, 9002, 4659, 10901, 17248, 20416, 19572, 12149, 12281, 10887, 7384, 1560, 2194, 5660, 3766, 1525, 5315, 15899, 19288, 22592, 25340, 25184, 25639, 25066, 22918, 14138, 6543, 3163, 3144, 697, 1350, 5008, 9308, 9678, 5422, 1212, 4762, 9079, 13274, 14976, 17263, 12943, 8151, 9115, 10694, 13602, 13823, 10993, 8992, 4251, 3217, 6416, -2233, -809, 5366, 15104, 18587, 12900, 7592, 6376, 8466, 4737, 90, 394, 4789, 6318, 9276, 10974, 12922, 13732, 6144, 12905, 15241, 10776, 15069, 12564, 8170, 4677, -3179, -5307, -6444, -8869, -5319, -2352, 4545, 8852, 2914, 976, 1362, -1708, 2914, 3868, -29, -4442, -3613, 2213, 6723, 10501, 17167, 12940, 10618, 9279, 7689, 12210, 17387, 15263, 10241, 5150, 850, -4795, -3742, -726, -6229, -8992, -6161, -5464, -5231, -8223, -6184]
8428f184Q596L878j794k060l384L202N689o083j573o54J783l40j978Q513K061
8413I672n246q15M154N528J770j0671j0392j6r20K511O189K613J168L901J784
8398A1230L446j013l355J161p168q720K615O297M242n426m733m080L152l439k326
8383h117N455k504K175N023N79P65K955J625k051o183p163N960P444q9k92n577
8367EN41K563k483K908K518n303M88N107k802q607l970N592L545q09M292k217
8351A368J075O804j908j215m232k226J437J608L453j139j614k627k963k592J07
8336d664K125P75N768l07k264j5K079J910m351j1969m175Q72O969L972l195k441
8320h911R470J32l086N022k16k934l520L148R041J080R20l226l436K895K309o63
$$ y = [-6184, 2412, 6290, 4496, 2436, -948, 2254, 7943, 1860, 287, -367, 1416, 1076, -902, 7611, 9672, 4426, 3611, 7765, 13293, 15063, 4392, -6000, -6016, -6936, -4425, 1764, 4377, 5545, 9446, 11230, 14676, 13663, 10308, 11469, 4301, -4419, -1804, 4493, 8735, 3309, -1424, -5504, -2352, -5791, -8117, -2662, -5166, -2991, 2032, 2611, 3376, 6331, 7956, 5905, -278, -7441, -1481, 5963, 5874, 5582, 5, 546, 3109, 626, 3534, 6052, 749, 1237, 6344, 3542, -5065, -9035, -3443, 102, -707, 3585, 1368, 2443, 9247, 7339, 6124, 1892, -334, 1103, 2711, 6164, 5025, 3411, 784, -2179, -4771, -4664, -2539, -1764, 4004, 3697, 1433, 1418, 3497, 5407, 1056, -10913, -15088, -14216, -7247, -3275, -6470, -8911, 559, 691, -2395, 2627, 2411, -523, -4043, -895, 8146, 9226, 10146, 6920, 3484, 6379, 8688, 8025]
8304H025m804k430q94R7O372l431k807o94m542K646k199l660L984N78K61O090
8288B592j557L95J656N163k131m219l461M161m188p046Q17K31L556K033K073m39
8272c64q889j832K627j009K563M888M821p878k033L0O630N404L173l723n106k192
8256b890Q32N105L561j709p279m509k216O262P56l880L595K028m36l079Q36o75
8240c698j81o293m14j14M884M588j042k850p57m904m33M357K049k024K311j276
8224e797j128k73K81K883L300M494K972j130o935k952k434L551L763l684q136
8209a1225j366k113R458K857o61l577j598L775K039J456m175J255L875j024k749
8194c773j016P525M366k380k378M879k190q092l43J000j456J1938Q480m069l323
$$ y = [8025, 3221, 791, -103, -6, 6366, 2935, 128, -566, -5108, -2462, -4661, -8321, -4337, -3759, -3498, 2592, 1035, 1430, 3086, 8249, 6118, 1899, -1562, 2599, -1589, -8635, -7818, -7587, -4031, -1998, 75, -364, -9253, -11085, -8458, -9467, -6904, -2016, 2805, -5073, -7106, -7076, -446, 4958, 8131, 4408, -698, -2890, -2058, 3047, 6608, 4899, -2380, -6889, -9105, -2843, -2087, -5967, -2372, -344, -780, -3859, -3023, -3698, -3879, -10172, -10586, -10700, -5816, -1228, -2270, -5120, -5877, -10781, -11214, -6857, -4808, -6832, -4521, -5797, -6925, -7198, -6917, -4034, -734, 3760, 6732, 5602, -1333, -4285, -6719, -3168, 595, -3089, -11225, -12591, -14704, -5246, -2389, -3050, -6627, -8225, -4450, -2411, -955, -5130, -3875, 0, -1024, -3773, -4789, 2736, 7102, 4722, 2344, 7223, 5033, -3059, -3402, -2402, -3858, 8080, 16560, 12491, 9168]
8179I168j876Oj903l863O023m91o838p156q418k253N095N084Q195k32K453L783
8163F777j349m575m699J047O499M331l07M090j683k325q459j1697R61N323M663
8148a403L168j1616O308M464N13K925L37m396n865N328O9n693J93n5J653M280
8132B10K624J670J214k448j79J058J459n565l58L132k081m775o93M547O369J824
8116H008J161L881Q9r6l145r85l659p885j332L805j887l993o2O43M337K569R06
8099B355K982N655p25j394l287q39j754n212K343O641N79r386k78j595j497L320
8083b092K428L264l411j587j239O106P079l152K811M261p041n915j429j879j388
8068c184m091Q749M098k244k641l333n858M312r62l919N234M884j06K154l101
$$ y = [9168, 7292, 7298, 5395, 1532, 7555, 7064, 226, -6930, -15348, -17601, -12506, -7422, 773, 541, 2994, 6777, 5428, 853, -3846, -2799, 3700, 8031, 7724, 11814, 10131, 7806, -653, -12350, -11389, -6066, -1403, 1765, -9851, -3543, 921, 1434, 4359, 4696, 300, -5565, -237, -168, -5861, -5668, -5723, -4070, 210, 2834, 4504, 5718, 3270, 3091, 4149, 5608, 43, -315, 2817, 736, -4039, -4732, -185, 6184, 8008, 9169, 13050, 13139, 13043, 9898, 8913, 5254, -2631, -3963, -158, -2045, -6038, -6100, -5457, -1120, 1449, 2355, 5337, 10992, 10267, 8873, 5586, 4747, 2993, -2219, 124, 6765, 7344, -2042, -2320, -3915, -5412, -2092, 336, 3600, 189, -1398, -2637, 3469, 10548, 7396, 10207, 14468, 7427, 1512, 83, -1796, -3184, -7275, 1474, 5572, 3328, 687, -2646, -8504, -4192, -5154, -9073, -3839, 1045, 939, 3093, -8]
8053ho667p440o17M278L974L622P392K820j355l262K040K65l001K174K279J214
8037G708M51Q059P446K624q199j636o081n836O102J1214J280k166k044l518p866
8022G538o342N880j689k993R22l549M568j019O295M893k613l694N831Q083k344
8007A9767l010J2637M031q266r098j003M098M348l065j595L17m043K547P048K552
7992B7265L386J481m761M708j645Q92N20l266l296J786O827M123L664n689p119
7977B8876k962l297l339m148J514M073M203j273N337L989n48o672Q05L025j01
7962B9482j268k818m973l130R0L260p03M309O082N873n337k277m398n63R335k095
7946C0869J469P61O46J05L189N132K468o74q02J92n406j560j403o878K073M469
$$ y = [-8, -6675, -14115, -14732, -10454, -6480, -2858, 4534, 7354, 5999, 2737, 4777, 5042, 2041, 4215, 6494, 7708, 8159, 16218, 23664, 26288, 18089, 16453, 10372, 4536, 10638, 21852, 23132, 20966, 18922, 15404, 7538, 1196, 7076, 5387, 2394, 3316, -233, 4335, 3316, 9611, 14504, 11891, 8197, 14028, 22111, 19767, 16757, 29394, 33425, 25159, 16061, 15058, 19156, 23504, 20439, 18844, 19161, 15118, 17665, 24713, 27265, 30651, 32132, 27371, 32079, 30434, 31326, 31846, 28580, 25284, 27070, 33897, 38020, 41684, 35995, 28876, 25914, 22617, 19278, 15130, 16644, 20717, 24920, 23647, 28984, 32973, 32425, 25753, 26558, 29583, 29482, 28214, 25396, 20423, 17293, 17383, 20643, 19940, 24249, 30331, 36204, 30867, 28590, 24192, 23629, 32964, 30869, 32338, 33099, 33745, 33850, 37039, 42171, 44639, 43965, 43163, 43355, 37949, 36389, 34986, 28108, 30181, 34650]
7930C4650Q79J701j1413j5848k31Q608L236K093O456N18k285l873N06r48j695
7915B2354l183o445M146K233j225k388j403J0311N440M60J192J783l089m491l473
7900B2222K250Q282L563n794k731K882R8m196r1j734l228m90r822l770q98j156
7884E387K330R37J369m61O668L614N79k046k802l268k174j307J401N768L114n086
7868A4023q493m309k30J127O010m941n260L321j496j220M326l311m49L356L957
7853F411N390l227k218l458K476J899P466O732p20n13o852q787n868o85O38J922
7837F06j163P18O946p042R62L906M583K9k408j195K105n248l255L104k326m107
7821c785l787m755m58K691N968L458o96J306Q00j169L512j8J441l563m594l270
$$ y = [34650, 35529, 37230, 25817, 9969, 9738, 18346, 21582, 23675, 30131, 30649, 28364, 24491, 24997, 24049, 22354, 19171, 12726, 16872, 19105, 17880, 15492, 14089, 24400, 29840, 30300, 31492, 33275, 30186, 25695, 22222, 24472, 32754, 36317, 30523, 27792, 30674, 30772, 26576, 26485, 24751, 21523, 21033, 11211, 7441, 6543, 5387, 7717, 8654, 10023, 9562, 16230, 19844, 20423, 18377, 15575, 12307, 10133, 8826, 10227, 15995, 19109, 14023, 5530, 1221, 991, 2118, 8128, 3187, -2073, 1248, -248, -1468, 2858, -453, -902, 2454, 6411, 11801, 8574, 6356, 2898, 5374, 7273, 14739, 21471, 20751, 20238, 13386, 4599, -1269, -1954, -1316, 606, -557, 161, 7107, 65, 1027, 4933, 9516, 9545, 7137, 5942, 8047, 2799, -456, 2648, 322, -3785, -7572, -12327, -12785, -10094, -4126, -668, -1364, -58, 742, -427, 3085, 3067, 4508, 945, -3649, -6919]
7805f919J69q13O079L482K103m516M354K143k475J65K51L658Q89l457J944l388
7789C669j963k337o01Q291K991j533m45J056k530k413M383L098o887r360n326
7774i907L937k537o394l501K425M439O487K743k612M032L264k515K320K216J552
7759E949p19n026j248k959p567O54k695N36Q79k119M773M499J374l70K046Q019
7743F026n87M59K472j93m106m30o561n703n7O965O471l303k582M981j987n267
7727c402p803K005M86J206j488J0676K447p290Q30O409M35l151n541j910j013
7712g104K958L252n864j879M656L59l679j41j011n595o13L665O83k689O464Q41
7696e697M406N415J896M362J730j61n995p010k172o720J283k956q880L91P265
$$ y = [-6919, -6750, -7563, -1484, 1998, 4101, -415, 3939, 6082, 3607, 3772, 4023, 7681, 8570, 5113, 7057, 3669, 1706, -631, -1232, 7059, 10050, 8517, 8072, 9128, 6598, 4185, 8568, 11666, 4779, -4581, -9907, -5970, -8507, -14901, -18402, -15977, -11538, -5051, -2308, -4920, -888, 2376, -139, 2181, 4397, 5949, 5230, 204, -1044, -4003, -11570, -10916, -13611, -13075, -12196, -14315, -9542, -5043, -3669, -4039, -1993, 6026, 5439, 5898, 8370, 8177, 4071, 3641, -2920, -8623, -8680, -1715, 4756, 1453, -1129, 3852, 1865, -3402, -11205, -9200, -8714, -7508, -8996, 1680, 4127, -3163, -2333, 4076, 4511, 1360, -4181, -6091, -7104, -4146, -894, -6758, -8637, -3981, -3622, -7301, -7442, -8453, -14048, -14661, -10996, -10313, -13002, -6538, -5697, -1291, 4124, 6020, 10382, 12112, 11951, 5956, -1054, -3226, -9946, -8663, -11619, -20499, -20108, -12843]
7681a2843N671k504k419r81L51L12K388M804K02m957k891Q16m46j53M132J356
7665g162k310j686l44K6j448K151j50m566Q741q82j289R60M98m824J14P200M831
7648a40k454k810p1J060j169K636O417m191m041k925j192j232j182j162K577L904
7632e975L691q95n679n162L57J851J451J863j076L507J543o76o418j347N899Q701
7616A635J891n208p136l280Q23K999L311L724J446M347k443k842J410K951o422
7601b794l638J5Q68P233M873q920l216O521P55o755p463K639K042O700M250j2604
7585i494j962M528m525J345oj790r09M885O621K968l673L873L26l21k354l066
7569c554J342j93q039j302j477M925L687J765l136K606k69R35O251l632J619q36
$$ y = [-12843, -7172, -9676, -12095, -13076, -12725, -12413, -10025, -5221, -5019, -9976, -12867, -12051, -12497, -12650, -8518, -7162, -9472, -11158, -11502, -11476, -12924, -10773, -10923, -15489, -6748, -7630, -8919, -7959, -7461, -12285, -12171, -4971, -140, -2594, -5404, -5475, -4415, -5584, -2948, 3469, -722, -4763, -7688, -8880, -10112, -11294, -12456, -9879, -5975, -2284, -3179, -8858, -14020, -13663, -11812, -10361, -8498, -9574, -6067, -4524, -5200, -11618, -12965, -7066, 1635, 3526, -1682, -8818, -12098, -11275, -8276, -4965, -1241, 205, 4552, 2109, -733, 677, 3628, -2794, -6432, -6417, -5549, 1684, 6557, -2363, -5579, 942, 1697, -5058, -12521, -9882, -7840, -1140, 3110, -9494, -11456, -6928, -11453, -10108, -10114, -11904, -12813, -7928, -1307, 1661, -2012, 1861, 2187, 1866, -488, -3554, -2212, -2405, -10444, -11746, -13223, -8298, -4611, -2846, -5982, -3376, -3645, -2710, 3541, -91, 1528, 692]
7553F92p130m63o184j976J268P47m67J177N124l79l42n09K768M307M017l950l060
7536d360k559k060N484K920j60N9k695o984l101M096L72r92O116j147J889l629
7520f751k763K252J11L148L935J360l222j441n747m654o15N692K002l846n604
7505a6143P86M727n200j292M457K862L448k849k325P497J526o108R08l713M70
7490a0949M371L277k352K540M001P07M403m12n732k500L581M201L587m922p735
7475c934j059N456P19k665n622k392n430M470J220j452K157O324o65k075M87n586
7459a0047m013J975m09l56k154L978K900j009k199L397P735O746k096k850J508
7444C106L60J090j27j998m220r395L084J96j592N79N008j189p467l573P006J1204
$$ y = [692, -6438, -6901, -13085, -15061, -13793, -13046, -13513, -12336, -7212, -7591, -7933, -8442, -5674, -1367, 2650, -1300, -4360, -6919, -8979, -3495, -575, -735, -676, -3371, -10355, -13456, -9360, -8988, -9980, -3864, -5011, -3122, -6751, -9514, -7262, -7151, -4003, -68, 1292, -1930, -3371, -9118, -13772, -14387, -8695, -6693, -10539, -16143, -15357, -10630, -15830, -17122, -12665, -9803, -6355, -9204, -11529, -4032, -2506, -8614, -7706, -11419, -10949, -6578, -3301, -5653, -3113, 888, 1595, 5998, 5586, -146, -2646, 935, 5136, 8723, 3801, -3934, -4993, 463, 1182, -1483, -7105, -9497, -14927, -10457, -9237, -10689, -8532, -2208, -2873, -4948, -4461, -10047, -14060, -12085, -12494, -12850, -15004, -11026, -8126, -9135, -11334, -7937, -202, 6544, 4448, 1598, 3106, 3466, 4556, 4429, 2431, -1789, -11184, -8100, -7904, -9496, -8917, -3909, -5098, -12565, -16138, -9132, 2072]
7428B072j369j1530l320j742L460J531Q975M80J370j476L45P80j703L45k093m61
7412d336K435o297o352J0772O656m674j783j274p87l447n014J115j435J261P764
7397e396J646r95l992m470P86P433N958J322o459o050m513P58n21j816P75M612
7381a0922K075J161K711o297O411K703m312L872J968M415n638j0723k146N323
7367i399L851k605j020J608N731K50M964n549q594l136k203K900k705J652N458
7352h797J0132L547j745m320K334j358J732j715m118J876J0120l65m449k409m836
7337d371R81M866O60m338J973O696k425j0836m28M68o784l27L751M415M667O753
7321E721k634K205L735K553L321k985p27k741k820K09k014L116k663K35l071m260
$$ y = [2072, 703, -10827, -14147, -15889, -12429, -10898, -1923, -1443, -73, -1549, -1204, -424, -2127, -1782, -3875, -4336, -1901, -8198, -14550, -3778, 2878, -1796, -3579, -4853, -5640, -9087, -14101, -12986, -14421, -13160, -5396, -3750, -4745, -8737, -13207, -12421, -4988, 970, 2292, -4167, -10217, -14730, -13972, -14493, -16309, -15534, -10922, -8847, -7686, -4975, -11272, -4861, -2158, -6470, -2598, -630, 3785, -1853, -12576, -14722, -9399, -5548, -8153, -9173, -7565, -1834, -1584, 3380, -2169, -10763, -13899, -16102, -13202, -15907, -14255, -8797, 1335, 4882, 3137, -1183, 1151, -207, 1525, -190, -4308, -2432, 7688, 7323, 2874, 465, -4371, -3390, 1476, 2136, -2202, -229, 6467, 4042, -6794, -7222, -6754, -13538, -13865, -10114, -5699, -1032, 5721, 3087, 5292, 9027, 11580, 14901, 11916, 11189, 8448, 5628, 5837, 3823, 6939, 4276, 4511, 1440, -2820]
7305b820N56J253J258J362M663l34n292j0895K209M774K780l003J428J618J896
7290A453k807j779j932n148M556n66j0670j214M881P479M732l17L780n639p259
7275a0450k8N353J790l241m845J468L041M151J25l463K41J010j331P05Q012Q341
7259A0879o078j4338k737R320n234j092Q98L699O09N21o865j571O219Q565N207
7244H002Mq948p330o83j215m31q949j799R228M383k083l099M0p43L652J837J635
7227f499l110k152K221j03P2L899j079J283M083k797o67m77J317Q194J454l649
7211A990K750l151j563L038j831k903L797m46l028L292J172O24R498m557l673
7196E009p824k494P288J894k433l229J244k267J555M364m526K073N272o48l479
$$ y = [-2820, -2264, -1011, 247, 1609, 6272, 5938, 646, -10249, -8040, -3266, -486, -3489, -2061, -443, 1453, -1354, -3133, -5065, -10213, -5657, -6223, -16893, -18107, -13226, -5747, -1015, -1332, 2448, -3191, -10450, -10478, -5125, -3335, -6576, -11421, -9953, -6912, -2761, -2636, -6099, -5858, -4848, -6179, -5474, 2538, 10879, 4801, -9537, -12274, -2954, -8188, -9280, -8382, -4683, -4074, -3553, -10418, -11989, -5770, 2795, 8002, 8006, -942, -8272, -8955, -10170, -10601, -19550, -21349, -12121, -7738, -9821, -12920, -12880, -13623, -9971, -8134, -6499, -9609, -11761, -9540, -9643, -9571, -5672, -6751, -5468, -1385, -4182, -4849, -5326, -4009, 4185, 5639, 1990, 4740, 1589, 26, 3064, 1233, -1670, 2127, 1681, -1347, 1945, 3117, 3741, 13239, 8682, 5009, -2815, -5309, 1979, 3873, 1440, -1789, -545, -2812, -1257, 3107, -1419, 654, 5926, 5278, 1799]
7181A799q371j791P921J908o846p657J335O339P904J29L198J087o866n085l035
7166h031k282o617m69N610K723J279L150l179P763O76k181k478P552J432o799
7151a851k261R945N333l336o491j076o975l067K887l41N009L19j574N94j890L123
7135a652N685k564J71J946J033j333o15R53q19l891l618o96L125j95L142L275
7119C947p42k547o991N89j752j50J732o907j631k809L346Q160p622r270J0894
7104a1753M382J860Q853K048l810k572l46j393N35K350J97m852k185j928M125
7089d489J0440n805m952M040J999l566j65l873o93J421O151O603l371p145j837
7074e242L626m680k4M44l358m48N857K110l535R79l028q589K366L019k80N831
$$ y = [1799, -6572, -8363, -442, 1466, -5380, -13037, -11702, -5363, 2541, 2670, 5868, 6955, 89, -4996, -8031, -10313, -16930, -17399, -11789, -9066, -7787, -4637, -7816, -53, 623, -1558, -4036, 3516, 4948, -1851, -4112, 5833, 11166, 7830, 1339, 263, -6712, -9779, -6892, -7233, -2224, -1905, -3479, -2885, -4775, -1652, 4033, 1469, 1640, 3586, 4619, 3286, 2671, 3624, 2805, -1086, -4704, -5400, -2275, -2470, 672, 3947, 3205, 658, -6333, -5744, -7496, -7646, -5914, -12821, -14452, -17261, -13915, -5755, -13377, -22647, -11753, -7371, -5511, 3342, 5390, 1580, -992, -1338, -2731, -2196, 154, 351, -4501, -6686, -8614, -4489, 5951, 146, -4806, -766, 1233, -2333, -2498, -6371, -7064, -5643, 508, 7111, 3740, -3405, -5242, -1616, -6296, -6320, -5876, -9234, -9682, -3825, -1715, -5250, -4271, -7299, -15888, -13522, -10503, -10783, -4952]
7058d952j55K996j881L28j189p22M667K48r60l549k326m03m339o669J662N439
7042a1805J007M407R029qm703q057j674o190L442Q40l61N937Q125k435k774N697
7026D77m147m867O431O164n806k795O514R02m898O277P60j647J503L756l4p169
7010A421k248j113k301j328P103L841o968J678k249q607n930L393j510O74J361
6995a2783j930L451R172o69l719p89m95k472N000O801P55p050J658R654l52r120
6979b888l345P546l891j563P01j705n460N892M856m84l471p093k074P186L309
6964b484l230o699k105L371M420M860j784o358k345k391j157M023O57R955L352
6949B085K000L46j913J537K61j310K340O91p112m616L432J138j506K85k593j178
$$ y = [-4952, -5107, -2111, -3992, -3664, -4853, -5575, -908, -660, -1620, -5169, -7495, -7898, -12237, -18906, -17244, -11805, -10798, -6391, 2638, 2630, -2073, -10130, -11804, -17994, -14552, -13712, -14073, -8136, -11, -2446, -5220, 477, -3670, -8537, -2106, 4058, -1748, -4543, 1971, 2873, -2025, 4252, 5012, 3365, 4868, 8624, 8590, 1421, -827, -1940, -4241, -5569, 1534, 5375, -1593, 85, -2164, -10771, -16701, -13308, -14818, -14144, -12783, -14713, -11262, -2090, -2759, -6478, -7267, -7762, -10234, -5234, 1567, 2322, -4728, -3070, 6584, 6232, -2888, -6233, 1313, -2578, -4141, -3440, -5145, -10605, -4713, 143, -341, -3812, -10905, -12979, -5793, -2484, -5714, -12413, -14518, -11147, -6727, -1867, -3651, -10009, -12354, -14745, -15902, -11879, -11222, -1267, 2085, 4085, 4431, 2518, 4055, 4316, 3006, 5346, 6037, -1075, -5691, -2259, -1121, -2627, -2342, -4935, -6113]
6933f113M052K902K633n094l543m05O276L849M409m567q579q336J872R325j085
6918b404n119M186l209p71N455k314j865R63k581r001N057J1562J547K310k474
6903A342q645m682J823J091j667L089Q94M435j064m89m582m813M165O077m370
6888g396l986N7J75P49J413L335M910k227J391j260o964K13J2489J943j128N28
6872D242K54j652n069J410M143l730O4n769L497J076O657K587p483L235L973j311
6856F124M864m430m874j0057o521O868R238l736o417j085o00o65L821k223o359
6841a6052k022J794M787P083N109j52m884R56K168r32l789o088o963n208M644
6826a9549K390k485K93M99M006L495j071l048M93O652L35L702j935K092k411n08
$$ y = [-6113, -2061, 841, 3474, -1620, -5163, -5568, 708, 4557, 8966, 4399, -4180, -12516, -10644, -1319, -2404, -7523, -3337, -6546, -7317, -1862, -4176, -6041, -5078, -7659, -16660, -11603, -41, 1506, 3816, 1342, -7303, -11985, -10162, -9071, -10738, -7649, -6755, -2320, -3384, -3873, -8455, -13268, -9103, -3026, -7396, -11382, -11325, -11150, -10401, -8988, -5653, -743, -2970, -1579, -2839, -9803, -9590, 2899, 4842, 3714, 4242, 4496, 2844, -2225, -815, 3328, -402, -338, -6107, -2610, -1534, 5123, 7710, 227, 3462, 7435, 6124, 10988, 6558, 1684, -8373, -14894, -8026, 1212, -2524, -8941, -10026, -10626, -11291, -7470, -9693, -16052, -18074, -16280, -11493, -4410, 699, 547, -4337, -3381, -1213, -2145, -5934, -12022, -18985, -24193, -19549, -17159, -19644, -19351, -18852, -14846, -11351, -12422, -15470, -14977, -8325, -7990, -4288, -6223, -4131, -6542, -7050]
6810g050L913J601Q97m85k676l482J053K964M959j605m543L040K421o756p106
6795a2855K848K616k171P812j857m738K633Q137J106o776l772P979j910q09K607
6780H50M35m266q046k461j278L672L213o04k321l917j227P730J0955J618L56J547
6764F256l522j340k528p957Q866P068l510P44j07P487J1882P346n073o473j2724
6749F415k059N871m922o343N234J81J51K019m7j868J97L427K187J372j731o591
6733C493j286L365K41j503j934n475o215N85O270R08O357J258o474k94m249J275
6717c678L997L268K096N459M199n309l570k496r586l634L507J294N325O479n675
6702A676p154j138L3J437O665N199M7l821n307P092L65p147j488M5n23j859n972
$$ y = [-7050, -3137, -1536, -639, -1124, -3800, -7282, -6229, -3265, 1694, 89, -4454, -1414, 1007, -5749, -12855, -10007, -7391, -9562, -1750, -3607, -8345, -5712, 2425, 3531, -3245, -7017, 962, -948, -1757, 850, 1285, -2981, -11027, -13488, -14766, -11094, -7881, -8485, -10806, -14723, -15950, -8220, 2735, 4353, 4709, 6256, 2734, 1394, -1134, -9091, -225, 6843, 3333, 4077, 3970, 11457, 23339, 30685, 25612, 19139, 6415, 4356, 10227, 5305, -1038, 4196, 4377, 4528, 6547, 6500, 4632, 4829, 8256, 10443, 11815, 10084, 3493, 2207, 5572, 5813, 4310, 2376, -3099, -9314, -8729, -2459, -1551, 4806, 6064, -410, -704, -4953, -3678, 319, 3587, 5683, 11142, 15341, 10032, 6462, 3966, -5620, -9254, -5747, -4453, 872, 7351, 1676, -5478, -6616, -6583, -5146, 1519, 6718, 6765, 2944, -2363, 4729, 5094, -2053, -3541, -3496, -4019, -5878, -11850]
6685a1850K389J268J205k051L031j348o54M692Q581k105q291J176K903j007n09
6670b570m77k308k000J817l898j0801j21R066J259K640K251O084K785p83m558
6655a614r327k513O606K062j753M29r75J911R359n493p908N51l936j495Q263J148
6639d685l654j850k909q72P222M836n38j113J190p20r369M297M386N364k152l770
6623d337J439n63l87R95L391r14n555M850N254j704j414p383k153o85j343J794
6607h715J107J662M545M504P800J320l194p245o573j684n438J951j825L719J0126
6592B060J018l164k621J498m451J664L278l013L119L508m607M009J481o865l417
6577f503K521Q01j557l49m853k979K603N700J0564R99q50l286l893p191o132o892
$$ y = [-11850, -9461, -8193, -6988, -9039, -6008, -7356, -8010, -3318, 5263, 3158, -5133, -3957, -1054, -2061, -2570, -3047, -5355, -7355, -5538, -9436, -20237, -20358, -11292, -10033, -7393, -5142, 942, 3727, 2944, -1614, -10941, -13454, -6848, -4786, -6539, -6110, -7085, -5174, 4185, -1308, -9216, -8665, -12601, -14096, -5833, -4685, -8339, -10189, -13098, -13970, -6748, -1912, -2450, -3563, -2373, -3093, -12462, -8165, -3779, 1585, -567, -4337, -2898, -3461, -3848, -2853, 538, -376, -5931, -1081, 4173, 2469, 1055, -6328, -8481, -9166, -10509, -8715, -7608, -5946, -1401, 3103, 10903, 12223, 9029, 1784, -4789, -6473, -11911, -9960, -11785, -8066, 2060, 3078, -86, -2707, -1209, -5660, -3996, -718, -3731, -612, 2896, -1711, 2298, 3779, -3086, -6503, -3982, -3181, -4738, -5087, -9940, -12919, -10316, -4616, 5948, 6947, 6097, 2811, -1082, -8273, -14405, -21297]
6561b1297J145R763l139P863p36m766j320l287J0343P085o293j909l893J547N125
6546c769N738n350M297P719o338n0Q202j0412q170N516O901M124l136n078n89
6531c95L256l141J243Q85n680K379J893q463m350n299M7N155L051J0525M169n24
6515D751o034K608J240j449M809J728l782m886l227J953p00k222N619k169j896
6500c657l693n975l212N692J1446N522O19J06p045l111L920O711j315o110M822
6485D720M874o184k999L381L825j811n331j0499k965J732N500J495L096p189j2099
6470b0454P96J3122j74m243O764K055O6J289n069j829o733l680J3096R695j53
6455D548J239n795j0503j117k507K929L756K173l380l849j527P790Q257j206l435
$$ y = [-21297, -20152, -10389, -13528, -5665, -6401, -11167, -12487, -15774, -5431, 1654, -4639, -6548, -10441, -8894, -3769, 1969, -3381, 916, 8635, 2297, 2247, 10449, 37, -8133, -2617, 4284, 8408, 5272, 194, -395, 2861, -280, 963, 1848, -3832, -1453, 440, -8023, -12373, -17672, -17625, -12470, -9419, 1106, 5275, 4751, -1283, 1325, 2565, 1116, 5925, 7653, 3871, -1015, -4242, -2289, -2989, -5211, 408, -1761, -3657, -7350, -13325, -16537, -10845, 601, 6123, 6742, 6848, -197, -3308, 612, 7323, 6008, -102, 4720, 9594, 3410, 411, 3792, 7617, 5806, 475, -10024, -12989, -11257, -5757, -4262, -1166, -8355, -20454, -19658, -6536, -6710, -10953, -4189, -2134, -2068, -779, -5848, -7677, -14410, -18090, -4994, 4701, 4548, 5787, -8, -10511, -11628, -14135, -11206, -7450, -5277, -8657, -12506, -14033, -6243, 2014, 808, -2627]
6440b627L620K519m556R68L466j963M295q95n904n329q848k667K039K200P135
6425f547j439l02L232J89l639P85N573N93m542l29J552j413j0549L996O847k11
6409f204k481q137M349P724j326l519J315K934M909k286L35m912M026M2O29K46
6393b356o825Q4N070l142n461O010J274n743M911K878J887N09l164k087j422L363
6377d214M538m893k736j19L353J360m393k239N788m222P85L670J650M404j761
6362I71q208q011K574P262m42K32K899P133L91k916m967J554L851k270k092N069
6346C030L312o568m042o03l233K125N916L22p522j330k493j353K345Q567j557
6331c084j224J979k332M5o79R208J792j2456o582M433R42N357R54L50L261L246
$$ y = [-2627, 993, 3512, -1044, -76, 3390, 1427, 5722, 4827, -1077, -6406, -15254, -17921, -15882, -13682, -6547, -7986, -8288, -5056, -4867, -8506, -7721, -2148, -1555, -6097, -6426, -4874, -6287, -16836, -12840, -5993, -6204, -8685, -16822, -12473, -4749, -6075, -9594, -8279, -5345, -436, -2722, -2387, -7299, -3273, -3231, -2602, -2356, -9181, -9097, -4027, -7169, -12630, -6620, -5346, -11089, -6178, -3300, -1413, -904, -4068, -6155, -7577, -4214, 324, -4569, -7305, -7424, -4071, -2711, -7104, -9343, -3555, -7777, -6992, -3322, -1672, 2732, 971, -7237, -15248, -12674, -5412, -5854, -5622, -2723, 4410, 4801, 1885, -3082, -1528, 2323, 53, -2039, 3030, 6342, -226, -4268, -4871, -8104, -5979, -63, 259, -7263, -8593, -11086, -12439, -10094, -1527, -3084, -4308, -2329, -4661, -4616, -5295, 3913, 5705, -6751, -13333, -8900, -7958, -2601, -1647, -1297, 1964, 5210]
6315E210n522k544m33L191M549J751q495p02J028n202O084P219M742p875q155
6300e154l511N000j207p35l890l257m192k062M569M544n06J680q64k117N688m043
6284a0057K451k389L513l837J228J1057l741n033n29j115n847K537K386O90m569
6269a3255j747M091N417M112j017m147j053J378o92K562p274n034Q312N261K194
6254h92L646M28o18l568M56m844j308l59L500k185K322r27m650N026l826l476
6238a1275j456J989N756P109M650k596p697N135j293j531j517o867j845P41L297
6223g400L568J505O24k844M260P311J077M423k677o673k557L465J570q94n439
6208f81P84l43J990M318j873l416J92n34m635l087L782L611K37J087L049n259
$$ y = [5210, -312, -2856, -3289, -98, 4451, 6202, -2293, -2995, -1967, -7169, -1085, 6134, 10876, 3001, -5154, -8665, -3665, -4872, -5607, -9497, -12754, -16946, -19008, -14439, -9895, -10401, -8721, -9585, -11702, -6014, -10057, -7606, -9995, -6482, -10319, -9091, 1966, -1775, -6808, -7337, -8452, -14299, -11762, -9376, -8686, -13255, -15002, -10911, -5494, -1382, -2399, -6546, -7599, -6221, -6913, -4351, -11625, -16659, -8347, -3086, -892, 2754, 3182, 2564, -1004, -548, -5392, -6700, -7059, -3559, -5744, -3422, -4349, -8999, -3973, -7799, -11275, -12731, -10742, -4986, 2123, 6773, 4177, -3520, 1615, 322, -1209, -2726, -9593, -11438, -10697, -7400, -3832, -2327, -1703, -4547, -287, 7024, 8101, 12524, 9847, 3174, 617, 4082, 5652, 4758, -681, 103, -240, 1750, 6068, 4195, 779, 971, 437, -4198, -7285, -3503, 108, 345, 1432, 4481, -778]
6192g78R67L107K368k57n125l779l911o106J776O088P169N817j299j250N61r812
6176d464L273O98N043p09n698k106j690k361J009k320L747m11k548O653P033j061
6160D088m012k305J262k11L86o300j733L744l682J090J897m803M658Q559k369
6145B69m952J694l180m125M313K113K86L511O25j866K964M70L29k560J08L502
6129C501K948o138m632J716j278m672N99O737k967j616R82N113k923l622Q35N35
6113d882k152j140K206l380N702J000J978k607M761J722J385m617N25N2m868l414
6097g729M1M478O738L198j243p450q07q92l228l17J982J363O59P93l389m759J0430
6080a32N500k621k627m409M9J705p477R14L659m686k977J644k453N145M775k122
$$ y = [-778, 189, 3296, 5664, 5407, 282, -3497, -7408, -13514, -11738, -5650, 1519, 7336, 6037, 4787, 5348, -4464, -1191, -493, 4550, 3841, -1857, -3963, -5653, -8014, -7005, -9325, -5578, -5989, -8537, -1884, 5149, 4088, 76, -2229, -967, -1178, -792, -7092, -8825, -5081, -8763, -7673, -5776, -10579, -5921, 2638, 269, -4683, -2989, -6169, -10294, -5981, -3868, -3582, -71, 554, -1312, 1652, 2122, 2451, -109, -1, 3501, 6449, 311, -4321, -2605, -3883, -8555, -7956, -1219, -4186, -5802, -4820, 293, -2630, -6252, -5417, -4882, -7034, -8174, -5968, -9348, -3646, -2646, -668, -3275, 1486, 3208, 4593, -24, 501, 553, -4315, -7729, -7688, -3210, 3528, 6726, 5483, -1967, -2774, -3666, -6894, -7211, -5229, -3866, -3207, -2414, -5803, -10562, -132, 5368, 2747, 120, -4289, -4240, -2535, -10012, -9098, -5439, -10125, -13102, -11458, -13911, -8766, -3991, -6113]
6064f113r05j085O19L117K254L331M800r9R95n946M18J733L4l749j183n549m276
6047a1604n277K282Q455M540k3k45O82P352m152j0571m834L261L624J439J481
6032c590R93j592j977P891K362M406l795j755j593L270K342l890k025j096M70
6017D21o915m446N532P164j714m890m637J3Q4J647k822k001J56l739M39R955L750
6000b003l386p96K641K201q958K138Q676O854n572K184N8m332p352n95O108Q24
5984a310l702K811q49j726P07j369K972M64k084j152j764j672K022p015K444K897
5968h326P850Q697j375n948l807l71j453k41k873n6O875L066l535j360j436J307
5952b986l065l591l142q53P836o313p6J0318K595k988m487p232P25P635M319k46
$$ y = [-6113, -7018, -8103, -7484, -4367, -2113, 1218, 6018, 5919, 6914, 968, 1386, 3119, 3153, -596, -1779, -7328, -11604, -16881, -14599, -6144, -1604, -1627, -1872, -1190, 6162, 2010, -8561, -13395, -10134, -6510, -5071, -3590, -2597, -4189, -6166, 1725, 4087, 8493, 4698, 2943, 1350, 4620, 6962, 3072, 1047, -49, 421, -6494, -10940, -5408, 1756, 42, -4848, -9485, -9472, -9388, -7741, -10563, -12564, -12408, -16147, -15708, -5753, -2003, -5389, -6185, -3544, -1343, -10301, -8163, 513, 7367, 1795, 3979, 4037, -295, -7647, -8242, -2134, -1310, -5012, -2201, -3050, -4776, -4069, -5438, -2466, -2002, -4086, -5238, -7002, -8674, -6652, -13667, -11223, -8326, -476, 8221, 6846, 898, -2909, -3280, -4733, -4974, -7847, -7903, -1028, 2038, -1497, -2857, -4293, -2986, -6051, -9642, -12784, -13637, -5801, -12114, -12190, -1872, 723, -2265, -6752, -13984, -13259, -5624, -1305, -1551]
5936a551J291m799l673K493K138n360J101K788l83K733M43P0l070p03J014L877
5920a591L351J839k214J629j026j997k285P53j952K100N450j441J174L787J038
5905H615n000l060N397q37o775N213k119o590o90J305m166N068O670l377l226
5890c572K336k40o590l601K155J427O899o26p05n153j57L224M313P069J347j801
5874F325p450m542J572N006J263m943j683p182n4J057k272L37O32J776P761O466
5858D069K246m595L618J047m034n68k656J404k86P24j32R57k149m671P173p317
5842e170M9L953M35K861P19J272k192r392j748l081m188P92q66p20M60P188j340
5825a0968m816K511M611L474K003n062J873O621k363j013J863K879J848J928j189
$$ y = [-1551, -260, -5059, -8732, -6239, -4101, -9461, -8360, -5572, -5955, -3222, -2779, -2709, -5779, -6482, -5468, -1591, 1760, 3599, 1385, 3014, 1988, -9, -2294, -1541, -3493, -1393, 4057, 2616, 3790, 7577, 8615, 3615, 555, 5952, 5115, -1660, 3553, 1434, -5156, -5846, -4541, -8707, -3639, 3031, -346, -3572, -1236, -1476, -8066, -11667, -9512, -8085, -1186, -1812, -2517, -7670, -7827, -4603, -290, 6779, 8126, 6325, -1125, -5667, -4095, 911, 2174, -2769, -4452, -11634, -11688, -10631, -12903, -12566, -11934, -10158, -2397, 4069, 6315, 1720, 5338, 6385, 2351, 1783, -873, 531, 245, 969, 837, 1794, -355, -5026, 2147, -5170, -5121, -1168, -733, 2128, 2847, 4119, 1927, -7465, -9213, -12294, -16482, -15690, -16556, -17276, -16816, -9628, -10968, -15784, -13273, -8662, -5188, -3185, -8247, -6374, 247, -2116, -3129, -1266, 1613, 3461, 5389, 4200]
5810D200m698q409P73P125n42j857P393r9r890l664j525P47O919J1021J371l708
5794E157j425J049K142l710M428M835L048o926l646J940L718Q25n953j468j45
5779C869k91J327O183N276k705o246j0280J891K337r81J013M889l662O52n920
5764b648m433K854N127l291m370J204L417K641K20N372j66q161o676J246O334
5749a330Q029q57q884K604L045j801N095q496m171l982J457L046K637J460M343
5734B195M5l065J197K774L114j264l812m240o471R74K730J113j276O626L31l762
5718b791L424J0623m211p348J145k131J655K912k31N887K492J055o255n621o720
5703f115m214k713L269J0846P13O69m290o611j699N530r51L700k372j648O81J3565
$$ y = [4200, -498, -8907, -8134, -1009, -1551, -3408, 3985, 3886, -6004, -9668, -11193, -10446, -3527, 7494, 8865, 5157, 3732, 4781, 6923, 3213, 7641, 12476, 15524, 8598, 4952, 6892, 10610, 11435, 5482, 4014, 3869, 3578, 4905, 11088, 16364, 13659, 7413, -2867, -976, 1361, 380, 1393, 6282, 2620, 3272, -2648, -7081, -4227, 900, -2391, -6761, -5557, -2140, 501, 721, 6093, 5927, -2234, -8910, -7664, -1330, 6699, 5842, -3042, -438, 2607, 806, 5901, -2595, -6766, -10748, -9291, -6245, -3608, -2148, 2195, 2240, -825, 372, 3146, 6260, 4996, 1184, -3056, -9527, -8553, -5823, -4710, -5986, 640, 971, -2791, 633, 11256, 7045, -303, 842, -1289, 366, 3278, 3047, 8934, 11426, 12481, 6226, 605, -6115, -10329, -13042, -9773, 1073, 1786, 2455, -1835, -8446, -10145, -4615, -5566, -1866, -4238, -5886, -5205, 8360]
5687H360P998o388r586Q02L334m65r92m949q221L645L600K51j184N279N60n305
5671c261m010R68l95P888P328P26k524o541l248M942m461L09N246K208k155k147
5655H73K114L335k887k385J576M193l804J59l575j708j694%n687n000M476J588
5639h426K801J456M91J212Q446K369j934L280l838k842l835O860P319m464K541
5624A1436k835j181O067M171k693q241m210N282K779k212n778N53J39o274o690
5609i687Q730M211l497o053k7P665R90m059j878M024l0j696j0401l718k279L182
5593a4523Q190Q263P590l855n570l36k582N70L247K594j951O46p3J53R27m180
5577h90m140n28L245L734k142N69R271r62j0701q298J749p74R075L173J867o600
$$ y = [8360, 16358, 9970, 384, 1186, 4520, 4055, 3063, -1886, -10107, -6462, -2862, -2611, -3795, 1484, 2044, -3261, -7271, -6303, -6698, 1190, 8518, 9244, 6720, 179, -3069, 1873, -2588, -2279, 2967, 5175, 3020, 873, 2987, 6322, 3435, 1050, 2626, 6819, 3015, 3174, -401, -2109, -3803, -3803, -9490, -14490, -10014, -8426, -5625, -4169, -3678, -2466, 5980, 8349, 6415, 9695, 5857, 3015, -820, 6040, 13359, 8895, 11436, 8601, 7420, 13487, 17658, 14965, 6724, 2514, 7796, 10575, 8363, 2585, 3138, 3277, -2997, -9687, -957, 3254, -243, -6296, -6323, 1342, 2332, -1727, -3605, 419, 389, -1307, -11708, -15426, -17705, -14523, -6333, 1930, 9520, 5665, 95, -241, -2823, -2253, 994, 3588, 1637, 2283, 2210, 2363, 3290, -890, -5030, -5558, -2313, 1421, -721, -152, 9119, 8157, -2544, -10842, -9093, -9867, -792, 2381, 4248, -2352]
5561b352J545L378Q37n692O64N82O674q28n34m283j966N831L270M68m596j971
5545A027L374p11m858O585J276j547J722N629l889r633l038J149N016J673n290
5530a515l909R006Q37j766l125J46n87k469K822j666L142P138L763q768k300j441
5514f92K482R11L685L101r08J045k540m104j057l097j395l981L512m54r086M466
5498h112P521P597m355q144k620j348j766K414L519J945N170N207m581K059m135
5483C71j959q69J059j409J695O924l374p38l244q962K808O055L296k601J657J961
5467B670r51m602k291J004J787R06L362L154K145n045l749j0168l803P223R54
5452g404m006n189J137P447o51J97Q425L345N698j66M091j477p693k774k620M915
$$ y = [-2352, -807, 2571, 3408, -2284, -1620, -1038, 5636, 4808, 4274, -9, -1975, 3856, 7126, 7594, 2998, 1027, 4401, 3690, -1168, 5417, 6693, 5146, 6868, 12497, 8608, -1025, -4063, -2914, 2102, 3775, -1515, -5424, 3582, 4419, 2653, -472, -326, -913, -3382, -560, -2226, 916, 8054, 11817, 3049, 749, -692, 1790, 2701, 6386, 9487, 8579, 9624, 7084, 2980, 1923, -1174, -2569, -6550, -3038, -3492, -12578, -8112, -591, 7006, 2651, -5493, -8113, -9461, -11227, -8813, -5294, -3349, 1821, 7028, 2447, 4506, 371, -1588, -2457, -1398, -2807, -1112, 5812, 2438, 1700, -1544, -10506, -7698, -1643, 1653, -948, 709, 2670, 1719, -2883, -5174, -4170, -2383, -1477, 1885, 5039, 7184, 2139, -1610, -11778, -15581, -8358, -7404, -11410, -16599, -15462, -8015, -8666, -8469, -44, 3301, 8999, 8833, 12924, 11447, 3754, 980, -1640, 3275]
5436C275O899n886l012j908j012O626N375m06o069R44k087q493J615M382m466
5421d223k834M47O418p50m425p525O03J0801J397O99O080k605k548j45M151K584
5405H125l481J956J0p234o210N577L615k557m478J490Q453Q961m415k673O897
5390A4036m225o322J602o1K446K400L18n349P3M367j167m298m777O63K134j714
5374A26j361r37m567k060J866J45L37O2m242J295N339K770K394k003N632P301
5358A2097j372n597j0092K654M626M693j551n67n730k212J933Q801m536r027Q17
5343e063K656m71j913O121J677o42K61l432L310L073p12l971J256J378O870k121
5327H277j0957j655j758J208L382M102J611o849k470j166j03M800J083k640n467
$$ y = [3275, 10174, 4288, 1276, -632, -1644, 4982, 10357, 9951, 3882, 4826, 2739, -5754, -4139, 243, -4223, -7057, -6610, -192, -942, -5367, -12892, -12289, -1488, -91, 608, 6688, 4083, 1535, 1390, 5541, 8125, 4644, 6600, 6610, -624, -6834, -1257, 2358, -199, -4677, -3187, 5266, 14227, 9812, 7139, 14036, 9811, 3489, 5091, 5030, 7476, 9876, 10194, 4845, 4918, 9285, 8118, 3820, -957, -294, 1840, 126, -1235, -2172, -6739, -8799, -6933, -6788, -6451, -6389, -10631, -9336, -3997, -1227, 1167, -836, 4796, 12097, 10725, 5128, -4964, -2310, 2316, 7009, 5458, 4891, -839, -3051, -1118, 7683, 3147, -5880, -5063, -2407, -2878, -4791, 1330, 3007, 2365, 2626, -806, 2504, 5577, 4865, 894, 2150, 3528, 10398, 8277, -2680, -4335, -6093, -4885, -1503, 2599, 4210, -2639, -5109, -6275, -6378, -1578, -495, -3135, -8602]
5312h602j349L575l569j554l631j996l39L699N139M890O737L661J285j075q172
5297a301k780N596j689N68K904p412k306j83k370P356J973L239L684q16l708k416
5281C39j454q898K291J0711L831n756P0m036k936j797M262P582J733N946n136
5266F752j1449J731M958j340l708J37j034j766J377O531P427l055n235P13L263
5251E302p2L798n334j473j637L076N421m754o448k183O02K029L824n055M706K968
5235D770j213J235r117o127O372j559k180N637M963m855J013P58o58J832k533
5220a662m08K158j064j592j85L063k840O11m295l9J0024K536p73Q509M360o450
5204A1953o170M25L803o23l570K536K993n499l659J595k641j225o92n243l075
$$ y = [-8602, -9951, -6376, -9945, -11499, -15130, -17126, -17465, -13766, -8627, -3737, 3000, 6661, 7946, 6871, -1301, -4081, 1515, -174, 394, 3298, -4114, -6420, -6603, -8973, -1617, 356, 3595, 7279, 6463, 2755, 339, -1115, -10013, -7722, 2989, 6820, 1064, 1134, -2902, -5838, -7635, -3373, 4209, 5942, 11888, 6752, -4697, -2966, 1992, 652, -3056, -2919, -3953, -5719, -4342, 2189, 9616, 6561, 1326, 2039, 5302, 5230, 9028, 3694, 2221, 584, 3660, 9081, 4327, -2121, -4304, -3702, -1673, 2151, -2904, 1802, 4770, 3557, 4792, -4325, -10452, -4080, -5639, -7819, -2182, 2781, -2074, -1061, -303, -961, 871, -1662, -2070, 88, -976, -2568, -2753, 310, -2530, -1919, -6214, -6253, 3771, 6307, 5534, 14043, 18403, 11953, 5783, 6208, 10011, 9388, 5818, 8354, 11347, 5848, 2189, 3784, 1143, -82, -774, -6017, -9092]
5189i092L490O95j266N065J805k308j065P710k044n599K019J687k903j48J278
5174f76N067L876j00o421j1625k707O815P007N312J314l900l605j673r05l212
5159e433O646k252j042l286L955O895J52m616o634O082L708k41m291n711L1K563
5143c474J839m353J063M062q75P83K767L81Q61J971k07J084q69l253J205K4p75
5126B234L631P156j922k666O962q295l365L034L253l431n238K605M353k6n831
5111B454m23K928l988l37j075L264J75m56j189M230O048L436l36O61L009p102
5095A1299j3338n670Q28L825K605m88J90k49q439K561N698j906n320j526J2208
5080B278P267p09R97j122o939L24m155m557L731k998L290O383m74l330j1700L896
$$ y = [-9092, -5602, -4907, -6173, -1108, 697, -1611, -2676, 5034, 2990, -2609, -590, 1097, -1806, -1954, -676, 4391, 8267, 8167, 1746, -9879, -12586, -5771, 1236, 6548, 7862, 3962, 357, -1316, -2221, -5433, 1213, -1039, -2081, -5367, -1412, 5483, 5635, 1019, -5615, 467, 4175, 3934, -357, -6068, -6037, -3474, -1635, -5988, -4925, -863, -1738, -955, 1812, 2193, 3054, 5025, 4818, 5902, 5033, 1780, 2985, 3009, 2234, 5865, 13021, 11099, 8433, 15395, 7100, 3735, 6769, 10022, 6591, 1353, 3958, 8311, 8285, 2454, 2031, 4959, 971, 634, -441, 2823, 2998, 2542, 1353, 5583, 11631, 15067, 14731, 15392, 18401, 11299, -2039, -7709, -6881, -3056, -451, -939, -749, -998, -9437, -6876, -1178, -3084, -8404, -9930, 2278, 9545, 8836, 9833, 8711, 1772, 2096, -2059, -6616, -2885, -5883, -2593, 3790, 3316, -14, -11714, -7818]
5064g818J1952J815N247K718p419o506j82j90l047k686P224K522J014M336k191
5049F789N98n609K31l699k168J693k566k747M66J006K969n152m556K963Q657j823
5033b948P71l072M216N736J646k032J133K56J088n216m828l3r796k978P95K635
5017a2627K009R690O323j534k442q612K103o1M324Q44N115K438j437M35P71l382
5001C957Q79j460K714k177Q37m432k163n229p58P769L63k102R008O022n476k564
4985E188l28L883o596q282l862K021p06M794M74k343M662Q79J554K878J913k108
4969D021O7m727L709L629l807k873m277j299J230j356L324J392K700J33m633J768
4953i99N457K542n503j378o00n168p25N724J348o709l822L055L196J941M030o397
$$ y = [-7818, 4134, 5949, 11196, 13914, 6495, -11, -193, -383, -3430, -6116, 1108, 3630, 4644, 8980, 6789, 7387, 1778, 2009, -1690, -3858, -2165, -4731, -7478, -7012, -6006, -3037, -8189, -12745, -9782, -1125, -2948, -2177, -5249, -1033, 4703, 6349, 4317, 5450, 5706, 6794, 1578, -3250, -3283, -13079, -16057, -15262, -12627, -10618, -928, 5395, 3861, 1419, -7193, -5090, -5151, -827, 17, 5132, 7570, 6133, 6568, 7339, 3957, 4836, 3376, 6090, 3913, 4750, 318, -1845, -7074, -7832, -63, 300, -1802, 7206, 13228, 7752, 5188, 4860, 8743, 2147, -6135, -9997, -7976, -8682, -3888, -3414, -5757, -1095, -216, 1338, 4216, 6129, 4021, 4088, -639, 3070, 6699, 2892, 19, -4258, -5557, -4327, -5683, -2359, -967, 1733, 1866, -2767, -999, 4458, 7000, 1497, 119, -481, -5649, -6374, -650, 698, -6011, -9833, -6778, -3582, -1641, 2389, -4008]
4937d008q819L001R512M236l643k848j03Q72j087l618L120K705O12M354q85O67
4921D068n720J369K066M540k340r531Q23k9M385J824J870P6j440J563k08J34k716
4904G34r18L244l203k706M774O04l117p46K572j177m988J780J544l603k824K075
4888e955K521P688L540l311K543l054J532k507P40R6M342p46o049r97M878K939
4872H200n24q992M64M130n621o004m403M074P281J390J606M673m413k590L704
4857B975J255p346M99P173M026n46k921K720K441L449N254p813j1445j663j289
4842c231m7K281N940L050K789n292n971o392J841j37O873O345k145j724l998o622
4826f440K844J0324N420m221l818O049l175m383j783o668n957M260Q274K530M24
$$ y = [-4008, -12827, -9826, -314, 3922, 279, -2569, -2672, -1800, -2887, -6505, -3385, -680, -68, 4286, 3401, 4068, -1652, -283, 1783, 6323, 3983, -5548, -4725, -4754, -369, 1455, 3325, 3401, 1961, 3524, 3316, 3450, 734, -184, 3060, -143, -2849, 1925, 2529, -588, -1334, 1238, 61, -4927, -3147, -1603, -5206, -8030, -5955, -3434, 4254, 7794, 4483, 7026, 3972, 5504, 2997, 3737, 3833, 8175, 7429, 1380, 383, 5261, 8200, 7676, -1316, -852, 3278, -2343, -8347, -12750, -8676, -1395, -5, 1601, 6274, 1861, -729, 2975, 4230, -3116, -2617, 4556, 8582, 8036, 5115, 7835, 10276, 13725, 18979, 11166, -279, -1942, -3231, -3278, -997, 4943, 7993, 10782, 5490, -481, -6873, -5032, -5169, 1704, 8049, 5904, 4180, 182, -6440, -3596, 6728, 12148, 7927, 4109, 10158, 6983, 2600, 817, -5851, -11808, -7548, 726, 3256, 3680]
4811C680m099M466J348k946l136n264L339J0220L370k382n420m433M878N790R77
4796A0388n300L232M376k823j0639l360K848L529J366j0332k970O159J689Q257
4782F420K442p133j287K314l848n09l066m380J516K245j054k345k752K923J1918
4767C404N088r123j0644k155R507J902N221P545P54l591M679J407m946j0915o351
4752h218j894P625P852J29K054j021N149J677l399l695M40L307L830K933K275
4737A9044o862m046m637l109m245j253Q643M368j2904p50N392J060o456o077j501
4722a3333L489J0752m75m000l792O597J870o70l043Q906N010p490o004m067M96
4707e754m90J878L350k796J88N93M154K835j008K669L324l965o216L392l604n815
$$ y = [3680, -419, 4047, 5395, 2449, -687, -5951, -2612, 7608, 10978, 8596, 3176, -1257, 3621, 9411, 10388, 5088, 8320, 12696, 9873, -766, -4126, -1278, 2251, 3617, -6715, -9685, -3526, -1837, 6420, 8862, 1729, 442, 2756, -1092, -1601, -4667, -9047, -7531, -5286, -6340, -8685, -11437, -8514, 3404, 8492, -631, -11275, -13430, -3923, -2021, 3200, 10745, 11499, 7908, 12587, 13994, 9048, -1867, -8218, -10112, -2487, 5365, 5494, 7548, 6527, 11676, 13353, 9954, 6259, 6699, 10006, 13836, 16769, 19044, 12182, 8136, 3499, 390, -3855, -5108, 3535, 7903, -5001, -5751, -359, 701, -5755, -11832, -13333, -9844, 908, 433, -3567, -7359, -762, 1108, 438, -2605, 6301, 11311, 3821, -2183, -6250, -5754, -6244, -4366, -1016, -3812, -3624, -3031, 1123, 3958, 2950, 5619, 8943, 4978, -1238, 2154, -1450, -7265]
4691g265L436j59L175J840k232P634K587q00j162n122j922K09N42j89j385k939
4675c752k283L122Q75M050o17K62L46j030L501J337k055k839m464j047J317K593
4659f84j205j121M52Pn961M299L801L114p929m107M359Q46m45r23k783L227L053
4642b000j68m522n09O96Q858M089j140K237l765k734J893l084p334J570l83J024
4626e272O605L99l192L212L405O026l706k940m98M739K763n337p858q15R06k088
4610c651l206N227J033k768L99j136N849L351O343k1n505j0010j400L579j050
4595b966m595J676K667J631m565o52K502m43j73j618J271l610j922J0208N465
4580D876r29L037j604l651K130n61m504J865j3o016K85j15J342K338r99K33M062
$$ y = [-7265, -3829, -3988, -813, 1027, -1205, 6429, 9016, 8216, 7054, 1932, 10, 219, 761, 572, -813, -3752, -6035, -2913, -2038, 2012, 1395, 1657, 2003, 973, 4474, 5811, 3756, 917, -3547, -4594, -3277, -684, -1889, -3010, -2558, -2551, -8512, -4213, -412, 2702, -5227, -9334, -4975, -4129, -4574, -5497, -8280, -5053, -2000, -2168, -6690, -7199, -6503, 2355, 6444, 5304, 7541, 3776, 1042, 2935, -149, -7483, -5913, -6296, -5272, 1333, 1732, -1460, 1752, 5157, 11183, 7477, 4537, 4039, 8778, 11541, 6204, -1654, -2469, -1563, -3651, -6857, -1630, -597, -3365, -2966, -4102, 1747, 5098, 11441, 11420, 5915, -4095, -5495, -1916, -2966, -7561, -5885, -3218, -1587, -6152, -6804, -4302, -4745, -4918, -6536, -5265, -8875, -10797, -589, 4876, 3947, 6984, 5380, 1729, 3859, 3298, -1206, 659, 646, -5370, -5085, -5200, -3858, -1520, -2519, -2286, 1776]
4563A776l46n757l18j673o81N86L731J296p902n930L873M857l822O041O688m175
4547a756j993R89q023n00o32R187Q530m434m041k90M240J326k355P63n023n739
4531i751J536L170l215M202N009K584k820Q19N315p486j427J930k673p200j904
4516a1911N419l54L37N479Q674R03K125m424l716L307k715j1067k720j367J566
4501a0464l950O83K581l753L774M076J188l94l284n278L16J433M597L434J512
4486c529L046J222o73r62J951k755l411L926L959l776l605l770K067J094O70J086
4470c460L531M766N081k499J414J716n275m803l954M740n91o617j417l207p69
4455a1344R68J924J865M234K229l401L974M062m204m574k102L605K615N169l328
$$ y = [1776, 1430, -4327, -4645, -6318, -6999, -6413, -2682, -1386, -9288, -15218, -11345, -6488, -10310, -4269, 2419, -1756, -3749, -2760, -10783, -11283, -11915, -2728, 5802, 1368, -2673, -2963, 1277, 2603, 248, 1011, -4012, -9751, -8215, -5045, -8260, -4058, 951, 3535, 715, 1534, 6849, -637, -2064, -134, -2807, -10007, -11911, -6492, -6846, -6509, -1030, 7644, 8547, 10672, 6248, 2532, 5839, 3124, -7943, -10663, -12030, -10464, -14414, -13731, -11150, -14903, -11129, -7053, -5865, -6259, -9543, -14821, -14505, -13072, -8475, -5041, -3529, -483, 739, 66, -896, 1055, -1700, -5111, -1185, 2774, -1002, -4607, -8377, -6310, -5216, -4546, -3460, 71, 4837, 9918, 7419, 8833, 10549, 5274, 471, -3483, 1257, 666, -5951, -7368, -10575, -11344, -10376, -8452, -6587, -2353, -124, -3525, 449, 4511, 307, -4267, -6369, -2764, -149, 5020, 1692]
4440A692k335L847o422m100k624j499j721J491M818K023Q124m78r63N603N625
4425A3081l749n63O39n054Q2L961k112l353M856P20n504R09Q277l431Q97O599
4409A6255k830k624j996q620l213j078n07O508J358o72J871n654q852k217N136
4394g135M293j060K4j743P053l733j340J879j757L122J884k806N525O06p63K314
4378F363L543k297k301m008q17j704j387k574J663P346J03k966P02K839k030J926
4362D401K770k585J912m263j505L284K716q04r083l19k356k937O923J035l697
4347d508r189n818M092N747M73J576Q976K677n569R58M586J469N334l252p420
4332A32P09O075q06k802p788k903P835M151K088J949k394o356Q60k211p38m183
$$ y = [1692, -643, 3204, -3218, -7318, -9942, -11441, -13162, -11671, -6853, -4830, 3294, 2816, 1853, 7456, 13081, 9332, 8769, 9408, 4354, 4436, 8397, 6285, 2932, 7788, 8508, 3004, 3913, 12190, 8759, 9656, 16255, 13425, 10801, 8805, 185, -3028, -4106, -4613, 1895, 3253, 2581, 4452, -1202, -10054, -12271, -7135, -2842, -3902, -3878, -5621, 1432, -2301, -3641, -1762, -3519, -397, 1487, -1319, 4206, 4812, 4049, 6363, 9906, 7609, 5308, 1300, 483, -1221, -2608, -5182, -3519, 3827, 3930, 964, 1666, 4505, 2475, 4401, 7171, 4586, 6498, 2235, 730, 4014, 6730, 5926, -3157, -3476, -5832, -8769, -1846, -811, -4508, -13697, -19515, -15423, -9676, -9203, -7627, 1349, 4026, -1543, -585, 4001, 5470, 10804, 7552, 132, 841, 6916, 6110, 3308, -4480, -7383, 452, 4603, 6691, 8640, 6246, -110, 750, -1461, -2199, -6382]
4316f382m214m046M122M476J876J423k10J281r9M87j137j003L651m34K07m641
4300d643K160M632R86J891p285J050K424N95N981J378K597M58Q09l207l722m943
4284A161j0265M723Q430q32k072K348N23m099J641q98l901n089k134K792k249
4269i921l937k785R489N938L035l775n705l439M788N476O813K571K665k565l935
4254D713j751k635L008r47L530N504R55l595n557n349M188j448m304o778o91J0265
4238h92N755j722p66m25j787j192J494M85O545p5m514J592O988N141r076j7352
4222i801K086P056n79J638m662J706N499N081j02O78l239j549K845j481L556j136
4206G596l230r08l32J610j534o64k361k726J868M103k529j0715j439L943M29j79
$$ y = [-6382, -10596, -14642, -10520, -6044, -4168, -2745, -2955, -1674, -1773, -1286, -2423, -3426, 225, -209, -2, -4643, -2483, 2149, 3135, 5026, -2259, -1209, 1215, 1810, 7791, 9169, 11766, 12224, 13033, 9826, 6104, 1161, -9104, -4381, 4049, 3217, 1145, 3493, 4016, -83, 1558, 660, -3241, -8330, -10464, -7672, -9921, -13858, -16643, -7154, -1216, 1819, -1956, -7661, -11100, -6312, -836, 5977, 8548, 11213, 8648, 4713, 2962, 327, 3335, 2388, 5918, 11422, 12377, 8782, 3225, -2124, 2064, 616, -3688, -10466, -11157, -892, 4863, 3141, 2375, 1950, 163, -1029, 465, 950, 7495, 7420, 2906, 4498, 11486, 16627, 7551, -9801, -7715, -659, -1238, 400, -4262, -2556, 2943, 8024, 7922, 8600, 5361, 3812, 6657, 5176, 8732, 7596, 4366, 3458, 3126, 4736, 3202, 2538, 177, -2549, -681, 3422, 893, -9822, -11261, -7318, -6889, -7068]
4190g068P005R37k213M885K378k503l565k507m174M641O298P64m606L43O998K794
4174A0407m536R16k745M001j221p220m120N657P782K750r83J771O91m786l781
4159D583P20k231l084l843M094N744N73n236k457L144L16m863P188m062j0985
4144a0399k673M495L749J0119N34r443m731K832J0458m005J706N490M520o36l288
4129H728J18k944q323l120M268J916Q73L649l203k97l898J43O83K341O90O86n230
4112b920J867N373O96L266K13o806j642o455j541J482J803L430m033M181j0j191
4096b287p472l559L683M405N990L723l257j306N41j205n947k852O149Q25L081
4081E12M813o27p350L419J562k840K694K743o787M34L229J310R44K259l189K380
$$ y = [-7068, -63, 874, -1339, 3546, 5924, 3421, -144, -2651, -6825, -2184, 4114, 4878, 272, 615, 7613, 10407, 5871, 6787, 4042, 8043, 6822, -398, -4518, 1139, 8921, 11671, 10688, 12459, 13150, 8364, 4583, 5303, 3072, -12, -3855, 239, 5983, 6556, 1320, -1137, 2007, 2323, -2540, 4648, 586, -10399, -13072, -8577, -4828, 5291, 5825, -3618, -8349, -5517, 4941, 936, 2642, 8132, 12652, 12016, 8728, 8846, 5902, -2421, -5541, -1273, 643, 1516, 5165, 1962, 1665, -2233, -2090, -1407, 934, 1624, 2310, -2920, -1053, 4320, 5016, 8282, 8495, 1689, 47, -6408, -7949, -6467, -4664, -1234, -5267, -1086, -1096, -2287, -9759, -13318, -9635, -5230, 760, 4483, 1226, -80, 461, -744, -6691, -9543, -3394, -2569, 512, 5325, 4698, -2652, 767, 2329, -511, 2183, 4926, -1861, -1427, 1802, 3112, 4056, 6315, 3126, 5506]
4065E506M477n563l27K118K825p240n392L398J408j1236j755J0030N025J860M223
4050I357J130r077m832j299j633j295o788q61Q113J1766o962L953N267j740k331
4035B768p294p760M140J1119M278l547p592m860n679Q797P058m066M407L182K370
4020G321J251n530l994J09L140p10l074j395J707j308j028m185k171J0964L207
4005D304K381O45n239j13J406q68J612N253Q316k691m005q78M129n293m014J196
3989F141k951N29j881N144M277m395m761m827l009n148O094J2521J863j957P67
3974H407k378q381l455Q27L969J205L401K552r608Q01M669m282J439L635N533
3959H334M77J056m216p75l980k545R52k840N427j954Q50M320k165j265K898n854
$$ y = [5506, 9983, 4420, 4093, 6211, 9036, 1796, -3596, -198, 1210, -10026, -11781, -1751, 3274, 5134, 9357, 10487, 1410, -3422, -4721, -6354, -7649, -14437, -15298, -7185, 4581, -2381, 1572, 6839, 5099, 2768, -4526, -12286, -8146, 2973, 7251, 3704, -3888, -8748, -14427, -5630, 1428, -2638, 1769, 4951, 7321, 8572, 3042, -952, -843, 2297, 1587, -1487, -2882, -1175, -2483, -3511, -7696, -9867, 1097, 4304, 6685, 7330, 2091, 1978, 3384, 2516, 4128, 9381, 17697, 15006, 11001, 10123, 14252, 8959, 4945, 6141, 3190, 3719, 1838, 6982, 11259, 6864, 2103, -2724, -5733, -10881, -4787, 7734, 9597, 7640, 8407, 6029, -2352, -5807, -4980, -1011, 194, 3595, 6147, -3461, -2660, 2009, -2273, -834, 2801, 8334, 8811, 9867, 5651, 4876, 896, -1649, -697, -3537, 1890, -64, 786, 5106, 2941, 1676, 4574, -1280]
3943a280n876l527j874l212p30N778L984J718M136k080k236N19M363L061J777
3928D521l070o168o24N087K348K329J66K960L490P17K226j274p426m358j201l260
3912c537L815R658m71j734m829N18L356K910K779k465k243q85j756q46l097J1178
3896A2351M249o501o964o134k814n432M822n26N446O468K164k372k802o27L403
3881D731M8J513P11N81K95m471m843L893N478K262k481j795j951K044J742n280
3865B477j977nJ225l649n062M384M109O41j121M945m336k849N51k525J255j48
3849b085N401j448o338L863q12M094P605k57l561J66R81p449l236m565O425O086
3833D870K236j398O794M57j405L776m341J710k08J05K183r08R17R40m594o179
$$ y = [-1280, -7156, -10683, -12557, -15769, -16499, -10721, -6737, -5019, -883, -2963, -5199, -4680, -317, 2744, 4521, 1451, -4717, -5341, -254, 2094, 4423, 4589, 7549, 11039, 11756, 13982, 12708, 5282, 924, -277, -3537, 278, 9936, 9465, 7731, 2902, 3420, 6776, 9686, 12465, 10000, 7757, 6872, 5116, 4270, 1173, 12351, 16600, 10099, 3135, -2999, -5813, -11245, -6423, -6949, -1503, 4965, 7129, 4757, 1955, 1328, 4731, 4779, 6292, 7003, 7584, 7879, 3408, -1435, 2458, 7936, 10198, 7717, 5922, 3971, 6015, 7757, 2477, 500, 495, 1720, -1929, -6991, -2607, 1502, 2143, 1022, 5967, 1631, -1218, -667, -3192, -1937, -2085, 3316, 1868, -4470, -607, -1419, 2675, 10280, 10023, 6462, 6628, 7609, 160, -3076, -7641, -1216, 4870, 7106, 5708, 12502, 12959, 11554, 15330, 10989, 12699, 12491, 12596, 14779, 13871, 14788, 15728, 11134, 4955]
3817D955k465L532L817P6j092L921J637N59M65p09l734n756n646K747p930j1872
3801a7495M941J1207M302m883l505J777L696L789m308l327J073M937L916j027
3787E093k561J494L622j344k123N28N784K511K182n423k873o318n765k371n39
3772h103J026l308M844Q091r91p819k651K205J998n08j493L947k469P42M680L570
3756C761n001L293L542R71L2l996k801k353n088q60j164J159L309k126O58O487
3740a77N379L922k548l21n499k43P00l730M165P932n090p795k598P36n829p243
3724a8239Q720m34m32O225N072K607L731N932m901o336k559j375J389n237L943
3709a894l7j459K95Q257J47K631l778n497j188l396l474n9L302O79l113m85M739
$$ y = [4955, 2490, 6022, 9839, 9915, 8823, 12744, 14381, 14940, 15405, 14696, 10962, 5206, -440, 2307, -5623, -17495, -12554, -1347, 2955, -1928, -5433, -3656, 40, 3829, -479, -3806, -2733, 2204, 6120, 5093, 2532, 4026, 7648, 6304, 4181, 4709, 10493, 13004, 15186, 9763, 6890, 572, -5193, -7564, -8103, -7077, -10385, -5541, 2550, 1559, -6260, -8911, -6706, -4708, -5216, -6709, -2762, -5231, -4489, 191, 3761, -1240, 2053, 5595, 6566, 6598, 2602, -199, -2552, -7640, -8500, -9664, -8505, -5196, -7322, -6664, -177, 5202, 9124, 6576, 6255, 756, 513, 1213, -2517, 1648, 9580, 4490, -3305, -5903, -5167, -10996, -18239, -9519, -9953, -10385, -4160, 912, 3519, 7250, 13182, 8281, 1945, -614, -1989, -600, -5837, -1894, -1931, -3390, -3095, 5162, 5309, 7940, 4162, -1335, -2523, -5919, -9393, -9452, -6150, -5471, -8584, -9069, -4330]
3692d330L289L50l354l374P830J0399J511j887m903o684l26q83j912m018P58l556
3676a1090J381n45k851P090R223J388m022R71Q70J005l536m725R22J783l068O446
3660A242J813N51j406K499L116l622l164K24K06j81J328m419k162Q238N400m822
3644D841m42j088K898O437K736K268q118j546m114n884J642q78M588q37j010L500
3628D993n757n580r98O790O125n096p483J26O348J625m751r480P904L582N78M003
3612B929O78q429M198R2o815l695Q444Q07o950K110J2815K030n946K155j928K472
3596D967M5q37j405p176n271M455Q556K838n708J449o488L78O074P454n072m200
3580E9O745K001l751l476l058L396j360n27o246L908M3J262P531L430m47o72l565
$$ y = [-4330, -1041, -691, -4045, -7419, 411, 10810, 12321, 10434, 5531, -1153, -1479, -2362, -4274, -8292, -7534, -11090, -9709, -10254, -13105, -6015, 3208, 4596, 574, 1545, 2415, 3420, -116, -4841, -3919, -2136, -5204, 1242, 3055, 3606, 2200, 4699, 7815, 4193, 1029, 1253, 1459, 1278, 2606, -1813, -3975, 4263, 9663, 4841, 4399, 3311, 6209, 12646, 15382, 17650, 9532, 7986, 3872, -2012, -370, -1248, 3340, 2503, 1493, 4993, -764, -6344, -7342, -552, 5573, 477, -7006, -6880, -532, 1093, -3658, -13138, -5234, -1652, -1074, 2929, 3607, -4822, -624, -532, -7347, -11042, -2598, -1791, -8741, -6631, 6184, 8214, 2268, 4423, 2495, 4967, 5012, 4175, 2770, -4406, -9677, -5222, 3334, 6172, 464, 1913, -4575, -4197, 1877, 9331, 4259, 59, 6804, 8805, 5054, 1578, -1480, 1916, 556, 29, -6217, -2309, -2266, -1004, 6527, 9957, 9510, 8838, 5273]
3563E273k143O166k125p74j549k717Q18K609l908j536k456l248K703P4M970R04
3547C061L220J99l003j897O518K408m19j695k335p3L537k651n270j683K278p549
3531e354m206j561l62J293L146K465K029K944J818O743j673Q87p025m388K856
3516c88k164j391Q636m108j0200Q210L746j810j584k557K33m44J653K975K432
3501C239J493m114k712n44O529L835J679l666o617K256K452k279K953N327l6m196
3485E599k534M969k815m987M98Q95l308K131k195M329n91l523N08N618j787o700
$$ y = [5273, 3130, 9296, 7171, 6397, 4848, 2131, 2949, 5558, 1650, 114, -2342, -5590, -2887, -2813, 2157, 3061, 6281, 6480, 3477, 1580, 8098, 10506, 10087, 8392, 6057, 5984, 9521, 6870, 1600, -83, 2195, -5354, -9560, -11121, -11483, -10190, -7044, -4579, -2550, 394, 2212, 8955, 7282, 8169, 1144, -3244, -388, -2552, -3943, 4693, 585, -9615, -1405, 2341, 531, -1053, -3610, -3377, -3821, -2168, 807, 3239, 4732, 618, -2094, -2638, 3891, 7726, 9405, 5739, -878, 1378, 3830, 1551, 4504, 9831, 9795, 5599, 3065, 8034, 5219, 232, 730, 1625, -1683, 448, -1747, 2582, 1991, -1532, -1024, 4594, 2807, -3893]
$$ [...]
##END NTUPLES=NMR SPECTRUM
##END=
