##TITLE=Analysis number 319141
Compound Code mo 07739
Project Code adrs
Chemist Name chemcon
##JCAMPDX= 6.0         $$ Bruker NMR JCAMP-DX V2.0
##DATA TYPE= NMR SPECTRUM
##DATA CLASS= NTUPLES
##ORIGIN= Bruker BioSpin GmbH
##OWNER= nmr
$$ XWIN-NMR		Version 3.5
$$ Wed May  3 14:23:05 2006 GMT Daylight Time (UT+1h)  MAYBRIDGE\nmr@NMR_250MHZ
##.OBSERVE FREQUENCY= 250.131544655141
##.OBSERVE NUCLEUS= ^1H
##.ACQUISITION MODE= SIMULTANEOUS (DQD)
##.ACQUISITION SCHEME= undefined
##.AVERAGES= 16
##.DIGITISER RES= 18
##SPECTROMETER/DATA SYSTEM= dpx250
##.PULSE SEQUENCE= zg30
##.SOLVENT NAME= DMSO
##.SHIFT REFERENCE= (INTERNAL, DMSO, 0, 16.522)
##AUDIT TRAIL= $$ (NUMBER, WHEN, WHO, WHERE, WHAT)
$$ ##TITLE= Audit trail, XWIN-NMR		Version 3.5
$$ ##JCAMPDX= 5.01
$$ ##ORIGIN= Bruker BioSpin GmbH
$$ ##OWNER= nmr
$$ C:\u/data/dgb/nmr/ADRS/3750/pdata/1/auditp.txt
$$ ##AUDIT TRAIL=  $$ (NUMBER, WHEN, WHO, WHERE, WHAT)
(   1,<2006-05-03 14:22:18.68 +100>,<MAYBRIDGE\nmr>,<NMR_250MHZ>,
      <created by zg, POWCHK disabled, PULCHK disabled
       configuration hash MD5:
       84 BC 41 DB A1 6E 1D 46 DA 25 12 A5 C1 ED C5 3A
       data hash MD5: 64K
       B2 46 7E E8 0D FE 63 DF 26 77 95 B7 AC FF 0C D7>)
(   2,<2006-05-03 14:22:42.12 +100>,<MAYBRIDGE\nmr>,<NMR_250MHZ>,
      <Start of raw data processing
       ef LB = 0.3 FT_mod = 6 PKNL = 1 SI = 32K 
       data hash MD5: 32K
       4D B9 D9 FB F6 FD C4 92 2F C1 55 6D D4 77 9D C7>)
(   3,<2006-05-03 14:22:46.21 +100>,<MAYBRIDGE\nmr>,<NMR_250MHZ>,
      <apk 
       data hash MD5: 32K
       9D 34 08 16 DF 2F 59 AF BD BC D5 0E E1 56 BA DA>)
(   4,<2006-05-03 14:22:47.02 +100>,<MAYBRIDGE\nmr>,<NMR_250MHZ>,
      <abs ABSG = 5 
       data hash MD5: 32K
       5C FB 5B DD AA A3 F8 21 D8 95 19 EC 0E EF B6 05>)
$$ ##END=
$$ 
$$ hash MD5
$$ 1B 80 49 7D A3 92 CB 51 44 50 CE 64 62 77 48 6B
##$RELAX= 
##$RELAX= 
##$RELAX= 
##$RELAX= 
##$RELAX= 
##$RELAX= 
##$RELAX= 
$$ Bruker specific parameters
$$ --------------------------
##$DU= <C:\u>
##$EXPNO= 3750
##$NAME= <ADRS>
##$PROCNO= 1
##$TYPE= <nmr>
##$USER= <dgb>
##$AMP= (0..31)
100 100 100 100 100 100 100 100 100 100 100 100 100 100 100 100 100 100 
100 100 100 100 100 100 100 100 100 100 100 100 100 100 
##$AQSEQ= 0
##$AQ_mod= 3
##$AUNM= <au_zg>
##$AUTOPOS= <37 >
##$BF1= 250.13
##$BF2= 250.13
##$BF3= 250.13
##$BF4= 250.13
##$BF5= 500.13
##$BF6= 500.13
##$BF7= 500.13
##$BF8= 500.13
##$BYTORDA= 1
##$CFDGTYP= 0
##$CFRGTYP= 5
##$CHEMSTR= <none>
##$CNST= (0..31)
1 1 145 1 1 1 1 1 1 1 1 1 1 1 1 1 1 1 1 1 1 1 1 1 1 1 1 1 1 1 1 1 
##$CPDPRG= <>
##$CPDPRG1= <>
##$CPDPRG2= <>
##$CPDPRG3= <>
##$CPDPRG4= <mlev>
##$CPDPRG5= <mlev>
##$CPDPRG6= <mlev>
##$CPDPRG7= <mlev>
##$CPDPRG8= <mlev>
##$CPDPRGB= <>
##$CPDPRGT= <>
##$D= (0..31)
0 1 0 0 0 0 0 0 0 0.06 0 0 0 0 0 0 0.0002 0 0 0 0 0 0 0 0 0 0 0 0 0 0 
0 
##$DATE= 1146662537
##$DBL= (0..7)
120 120 120 120 120 120 120 120 
##$DBP= (0..7)
150 150 150 150 150 150 150 150 
##$DBP07= 0
##$DBPNAM0= <>
##$DBPNAM1= <>
##$DBPNAM2= <>
$$ [...]
##$SUBNAM6= <"">
##$SUBNAM7= <"">
##$SUBNAM8= <"">
##$SUBNAM9= <"">
##$SW= 20.6930455092707
##$SWIBOX= (0..15)
0 0 3 0 0 0 0 0 0 0 0 0 0 0 0 0 
##$SW_h= 5175.983436853
##$TD= 65536
##$TD0= 1
##$TE= 296.16
##$TE2= 300
##$TE3= 300
##$TEG= 300
##$TL= (0..7)
0 120 120 120 120 120 120 120 
##$TP= (0..7)
150 150 150 150 150 150 150 150 
##$TP07= 0
##$TPNAME0= <>
##$TPNAME1= <>
##$TPNAME2= <>
##$TPNAME3= <>
##$TPNAME4= <>
##$TPNAME5= <>
##$TPNAME6= <>
##$TPNAME7= <>
##$TPOAL= (0..7)
0.5 0.5 0.5 0.5 0.5 0.5 0.5 0.5 
##$TPOFFS= (0..7)
0 0 0 0 0 0 0 0 
##$TUNHIN= 0
##$TUNHOUT= 0
##$TUNXOUT= 0
##$USERA1= <user>
##$USERA2= <user>
##$USERA3= <user>
##$USERA4= <user>
##$USERA5= <user>
##$V9= 5
##$VALIST= <valist>
##$VCLIST= <CCCCCCCCCCCCCCC>
##$VD= 0
##$VDLIST= <DDDDDDDDDDDDDDD>
##$VPLIST= <PPPPPPPPPPPPPPP>
##$VTLIST= <TTTTTTTTTTTTTTT>
##$WBST= 1024
##$WBSW= 4
##$XGAIN= (0..3)
0 0 0 0 
##$XL= 0
##$YL= 0
##$YMAX_a= 281629
##$YMIN_a= -410551
##$ZGOPTNS= <>
##$ZL1= 120
##$ZL2= 120
##$ZL3= 120
##$ZL4= 120
##$ABSF1= 16.522
##$ABSF2= -4.171173
##$ABSG= 5
##$ABSL= 3
##$ALPHA= 0
##$AQORDER= 0
##$ASSFAC= 0
##$ASSFACI= 0
##$ASSFACX= 0
##$ASSWID= 0
##$AUNMP= <proc_1d>
##$AZFE= 0.1
##$AZFW= 0.1
##$BCFW= 0
##$BC_mod= 0
##$BYTORDP= 0
##$COROFFS= 0
##$CY= 12.5
##$DATMOD= 1
##$DC= 0
##$DFILT= <>
##$DTYPP= 0
##$F1P= 14.0000005364418
##$F2P= -0.99999901652339
##$FCOR= 0.5
##$FTSIZE= 32768
##$FT_mod= 6
##$GAMMA= 0
##$GB= 0
##$INTBC= 1
##$INTSCL= 1
##$ISEN= 128
##$LB= 0.3
##$LEV0= 0
##$LPBIN= 0
##$MAXI= 10000
##$MC2= 0
##$MEAN= 0
##$ME_mod= 0
##$MI= 0
##$NCOEF= 0
##$NC_proc= -4
##$NLEV= 6
##$NOISF1= 0
##$NOISF2= 0
##$NSP= 0
##$NTH_PI= 0
##$NZP= 0
##$OFFSET= 16.522
##$PC= 1
##$PHC0= 156.398
##$PHC1= 20.84684
##$PH_mod= 1
##$PKNL= yes
##$PPARMOD= 0
##$PSCAL= 4
##$PSIGN= 0
##$REVERSE= no
##$SF= 250.13
##$SI= 32768
##$SIGF1= 0
##$SIGF2= 0
##$SINO= 400
##$SIOLD= 32768
##$SREGLST= <1H.DMSO>
##$SSB= 0
##$STSI= 32768
##$STSR= 0
##$SW_p= 5175.98343685301
##$SYMM= 0
##$S_DEV= 0
##$TDeff= 65536
##$TDoff= 0
##$TI= <Analysis number 999999
Compound Code 99
Book Reference 9
Project Code 9>
##$TILT= no
##$TM1= 0
##$TM2= 0
##$TOPLEV= 0
##$USERP1= <user>
##$USERP2= <user>
##$USERP3= <user>
##$USERP4= <user>
##$USERP5= <user>
##$WDW= 1
##$XDIM= 32768
##$YMAX_p= 289254024
##$YMIN_p= -580398
$$ End of Bruker specific parameters
$$ ---------------------------------
##NTUPLES= NMR SPECTRUM
##VAR_NAME=  FREQUENCY,     SPECTRUM/REAL,   SPECTRUM/IMAG
##SYMBOL=    X,             R,               I
##VAR_TYPE=  INDEPENDENT,   DEPENDENT,       DEPENDENT
##VAR_FORM=  AFFN,          ASDF,            ASDF
##VAR_DIM=   32768,         32768,           32768
##UNITS=     HZ,            ARBITRARY UNITS, ARBITRARY UNITS
##FACTOR=    0.157963299565203, 1,           1
##FIRST=     4132.6476996994, 0,             0
##LAST=      -1043.33573715361, 0,           0
##MIN=       -1043.33573715361, -580398,     0
##MAX=       4132.6476996994, 289254024,     0
$$ Real data points
##PAGE= N=1
##DATA TABLE= (X++(R..R)), XYDATA
$$ [...]
15730b84423N8335J47759J9166p3259J6990j3193l351Q2192m139m0304q1558l6248
$$ -284423 -226088 -78329 -59163 -132422 -115432 -128625 -131976 -49784 -53923 -94227 -175785 -212033
15718b12033P5321K4056J41759R5019n6667p4490q2410r7787R754M3641l7793
$$ -212033 -136712 -112656 29103 124122 67455 -7035 -89445 -187232 -177478 -133837 -171630
15707a71630J40637L0771j38497J6018J05654k6595j70359J63371K0221p0831
$$ -171630 -30993 -222 -138719 -122701 -17047 -43642 -214001 -50630 -30409 -101240
15697a01240K7751Q6929l8513q1123l3747P2249K7314R1596j9831R3886K1501
$$ -101240 -73489 13440 -25073 -106196 -139943 -67694 -40380 51216 31385 125271 146772
15686A46772o8720q0960q6706K720m2193p848J00057L0131p0918K0032Q7519M0646
$$ 146772 78052 -2908 -89614 -86894 -129087 -136935 -36878 -6747 -77665 -57633 29886 70532
15674G0532n8724o2828n6374J21174n1722j9051M4077J53837J43568q880j27603
$$ 70532 11808 -51020 -107394 13780 -37942 -56993 -12916 140921 284489 275609 148006
15663A48006l8381Q1681L0660j5984q0772j25751k8466K6122o221r0431p593J02565
$$ 148006 109625 191306 221966 205982 125210 -541 -29007 -2885 -9106 -99537 -107130 -4565
15651d565m7899K9441O1332J46190P3247l6437j33960j94771O4728J05836j2633
$$ -4565 -52464 -23023 38309 184499 257746 221309 87349 -107422 -42694 63142 50509
15640E0509j55882n8714P4781j16359j7959J6569M4511L07170J1989j06409K0853
$$ 50509 -105373 -164087 -89306 -205665 -223624 -207055 -162544 144626 156615 50206 71059
15629G1059j5134q4620l9528N0796m8959k7020M0552M2959k6731k5285J16996
$$ 71059 55925 -28695 -68223 -17427 -66386 -93406 -52854 -9895 -36626 -61911 55085
15618E5085R5599l6441K7089j59240j48574J00587M7165M062P4272M4233n4454
$$ 55085 150684 114243 141332 -17908 -166482 -65895 -18730 -14668 59604 103837 49383
15607D9383m7612J66347L1416k18202k06448k4343R7084M4140K2919J2205Q3700
$$ 49383 1771 168118 199534 -18668 -225116 -249459 -152375 -108235 -85316 -73111 10589
15596A0589M0773Q4054l0170j65735r4403Q5033J28022p5721p0554j3484J73595
$$ 10589 51362 135416 105246 -60489 -154892 -69859 58163 -17558 -88112 -101596 71999
15585G1999M6947r448n234m708K7263q5186o1374O5826J30270J843n8317N9924
$$ 71999 118946 109498 104264 99556 126819 41633 -19741 46085 176355 178198 119881 179805
15573A79805K958j17080k287R760j1891J4586k7763K7045n6914q6688k5164m5878
$$ 179805 182763 65683 63396 73156 61265 75851 48088 75133 18219 -68469 -93633 -139511
15561a39511n223J59323n17l7503j34565p3007q8601l0368R1109J71387R0995
$$ -139511 -144734 14589 14072 -23431 -157996 -231003 -319604 -349972 -258863 -87476 3519
15550C519n3188J35033q441j06725m3535j6109l7422P1820M2674N8752K3348j5704
$$ 3519 -49669 85364 76923 -29802 -73337 -89446 -126868 -55048 -12374 46378 69726 54022
15538E4022q0648r9697N4038M3583N1276l9125j34453k4106M7499j52905r9124
$$ 54022 -26626 -126323 -72285 -28702 22574 -16551 -151004 -175110 -127611 -280516 -379640
15527c79640J51216J06347Q3013m9770M1728K4570o2915k8566R0863J64409P7452
$$ -379640 -228424 -122077 -39064 -88834 -47106 -22536 -85451 -114017 -23154 141255 218707
15516B18707j32216j47787j74041k2138M9197O5596J36768Q3105m0524p3518Q319
$$ 218707 86491 -61296 -235337 -257475 -208278 -142682 -5914 77191 36667 -36851 -28532
15505b8532J3599L6472K11390J3739k6677n5056m7475m6328k5253J0379j06615
$$ -28532 -14933 21539 232929 246668 219991 164935 117460 71132 45879 56258 -50357
15494e0357m1154K9290J494P7518j22918R211j1788j1672q4932K7058l0413J5879
$$ -50357 -91511 -62221 -60727 16791 -106127 -96916 -108704 -120376 -205308 -178250 -208663 -192784
15482a92784l2516N9570L6733J1569l7216N9505N943p6624p0328P9742M4787J01701
$$ -192784 -225300 -165730 -128997 -117428 -154644 -95139 -89196 -165820 -236148 -156406 -111619 -9918
15470i918j3873j40364K8636L03505k1320j82672l7121k0593L3481J6199O5636
$$ -9918 -23791 -164155 -135519 167986 146666 -36006 -73127 -93720 -60239 -44040 21596
15459B1596N3846n8921j74821j21115o578N4669J58160m7312j65637J75031J97291
$$ 21596 75442 16521 -158300 -279415 -285993 -231324 -73164 -120476 -286113 -111082 86209
15448H6209k2013j10145j25339K7090M3420m005J0393L1523J02289L1816J06198
$$ 86209 64196 -45949 -171288 -144198 -100778 -104783 -94390 -62867 39422 71238 177436
15437A77436o3388P618k7133r0304q1056n1658P0688R6978J20579n9848N5003
$$ 177436 114048 121666 94533 4229 -76827 -128485 -57797 39181 159760 99912 154915
15426A54915k4458M2244K1336j20947j66674j73616N836k2258L902J55853O3418
$$ 154915 130457 172701 194037 73090 -93584 -267200 -261364 -283622 -279720 -123867 -60449
15415f0449k9961q2544J522o790q8645j17493P2598J78942R17j08632k8393m4448
$$ -60449 -90410 -172954 -171432 -178222 -266867 -384360 -311762 -132820 -131903 -240535 -268928 -313376
15403c13376j0763M5337J64535N4361M658O5901J2371M1314r7932J5105J2042
$$ -313376 -324139 -278802 -114267 -59906 -55248 10653 23024 64338 -33594 -18489 -6447
15392f447n5509o6956j1384l5757R0108R2426r826J3155m8432p1929r3210Q7413
$$ -6447 -61956 -128912 -140296 -176053 -85945 6481 -3345 9810 -38622 -110551 -203761 -116348
15380a16348J87924J17377N3056l4757o0054J02153j49584j83775K3129O7907
$$ -116348 71576 188953 242009 207252 147198 249351 99767 -84008 -60879 7028
15370G028k5819Q962o5118q6886Q0858J67809J65954R5108j88953j5312j58198
$$ 7028 -18791 -9829 -74947 -161833 -80975 86834 252788 347896 158943 143631 -14567
15359a4567j44234O4856j3470O2084O0964P3235m7804j40896q8179K5107M1213
$$ -14567 -158801 -93945 -107415 -45331 15633 88868 41064 -99832 -188011 -162904 -121691
15348a21691n6183R8692m2308j33593M7747J19692J02120p268P0966L8378j28598
$$ -121691 -177874 -79182 -121490 -255083 -207336 -87644 14476 7208 78174 116552 -12046
15337a2046Q776Q452m1861J03748L8968p5968m5960l2141M3483J0589q6463K4017
$$ -12046 -3270 5182 -36679 67069 106037 30069 -15891 -48032 -4549 6040 -80423 -56406
15325e6406l4391k14016N129K43440q594n2202M4799L3008j3088o649R7041K3550
$$ -56406 -90797 -304813 -299684 -56244 -64838 -117040 -72241 -39233 -52321 -58970 38071 61621
15313F1621o2124J1027J2284N4535O099q9082K5885L5799J7939j10701m6778K3094
$$ 61621 -503 10524 22808 77343 83442 -5640 20245 56044 73983 -36718 -83496 -60402
15301f0402J51328p3520k2647P3673Q4097o3575n3781k05955j43868J66359K4727
$$ -60402 90926 17406 -5241 68432 152529 88954 35173 -170782 -314650 -148291 -123564
15290a23564q4517M9938J65161J34338k7254K3501l9712o7934n1110N5383r8085
$$ -123564 -208081 -158143 7018 141356 114102 137603 97891 29957 -21153 34230 -63855
15279f3855l2190L2592P775o1064r0789J39062J3696j8204m151N9185L7336L2791
$$ -63855 -96045 -63453 -55678 -116742 -207531 -68469 -54773 -72977 -77128 -17943 19393 52184
15267E2184N1270q3925j4426j8327q768o3355r1920P8069O1339k1430j39594K5018
$$ 52184 103454 19529 5103 -13224 -21992 -85347 -177267 -99198 -37859 -59289 -198883 -173865
15255a73865J86167J36870J0789q5744r7031p7144l2201L7042J58799Q3250M7672
$$ -173865 12302 149172 159961 74217 -22814 -99958 -132159 -95117 63682 146932 194604
15244A94604m9786j40982n603J06631j27873m4856J01787P5089q986j6720n9142
$$ 194604 144818 3836 -1767 104864 -23009 -67865 33922 109011 100025 83305 24163
15233B4163P0111K4520k9487r8800q4007j23892R3562K59418J32897o6796l3060
$$ 24163 94274 118794 89307 -9493 -93500 -217392 -123830 135588 268485 201689 168629
15222A68629o2672m984P545p2711k18889R5506J501M769j4922j0629P4200J32430
$$ 168629 105957 100973 108518 35807 -183082 -87576 -86075 -81306 -96228 -106857 -32657 99773
15210I9773j093j85051O8581P9993m258o7121K3067r4739O6607o3645K7434O9179
$$ 99773 98680 -86371 -17790 62203 57945 -9176 13891 -80848 -14241 -77886 -50452 18727
15198A8727K1639j18321j20840J33267K49141P6733J14416L7114j01874j12240
$$ 18727 40366 -77955 -198795 -65528 183613 260346 374762 411876 310002 197762
15188A97762n7020p491J1459l0414L1903n1525n7684p8960K3983J24554N6952
$$ 197762 140742 133251 144710 114296 146199 94674 36990 -41970 -17987 106567 163519
15177A63519O9274M4771j96096j55355l9228M2069l0801o7306o8582K1195O4595
$$ 163519 232793 277564 81468 -73887 -113115 -71046 -101847 -169153 -237735 -216540 -151945
15166a51945M9830J25543K0719j26319m5119L1545l4219m8340k588J1320J0766
$$ -151945 -102115 23428 44147 -82172 -127291 -95746 -129965 -178305 -180893 -169573 -158807
15155a58807R4796K01362J72758k0517k03092j996K1904k5021J0342k7380J7168
$$ -158807 -64011 137351 310109 289592 86500 84504 106408 81387 91729 64349 81517
15144H1517J16074J5534o4870j67333j43493K7155J8216k6979o1783m7341R2497
$$ 81517 197591 213125 148255 -19078 -162571 -135416 -117200 -144179 -205962 -253303 -160806
15133a60806J59838k3953j71547J16159K4287O1861p6760q9194N6147J01270l6437
$$ -160806 -968 -24921 -196468 -80309 -56022 5839 -70921 -160115 -103968 -2698 -39135
15122c9135j6981J15570M9966Q9007O673j22622L9247J0452P8280j4011l1848
$$ -39135 -56116 59454 109420 198427 205100 82478 121725 132177 210457 196446 164598
15111A64598l435j09542J6949l5632m0966J57086Q8958r5287o8879n8621R348
$$ 164598 161163 51621 68570 32938 -8028 149058 238016 142729 73850 15229 24577
15100B4577P5702R5383k6695n608J00017n6976M0681M1065n097r8967n1304k4436
$$ 24577 100279 195662 168967 163359 263376 206400 247081 288146 283049 184082 132778 108342
15088A08342O1825J15677J61742j38767L7652K07712J57358J533j3362l4420m1743
$$ 108342 170167 285844 447586 308819 346471 554183 711541 713074 699712 665292 623549
15077F23549j78403r8427p941k0421k5938N5347n4141j23412j86741N8756M6329
$$ 623549 445146 346719 338778 318357 292419 347766 293625 170213 -16528 42228 88557
15066H8557P1912q9860m2617j0516P9233n0174j18638K4865n0476m8073K27728
$$ 88557 160469 70609 27992 17476 96709 46535 -72103 -47238 -97714 -145787 81941
15055H1941J46311L1672j7927P0154j51997m8018p791J5883j08587k2422J8958
$$ 81941 228252 259924 241997 312151 160154 112136 104345 120228 11641 -10781 8177
15044H177o162m1889P5462L7420J30169J4453l8750r5390j77135L4344k729m5796
$$ 8177 2015 -39874 35588 73008 203177 217630 178880 83490 -93645 -59301 -62030 -107826
15032a07826j8779N0821J03450Q39m9008k5769P1238j65959o1760O4392L9512
$$ -107826 -126605 -75784 27666 28505 -20503 -46272 24966 -140993 -202753 -138361 -98849
15021i8849j5512J88917J12452N9310q2740j07810l3604Q9791k6495N7299j19996
$$ -98849 -114361 74556 187008 246318 163578 55768 22164 111955 85460 142759 22763
15010B2763j7034l281r8384o128j2865m8353n9174l9323J51592Q9220o7377q3209
$$ 22763 5729 2448 -95936 -102064 -114929 -163282 -222456 -261779 -110187 -20967 -88344 -171553
14998a71553m9188K6195J05973J31442J01634J30350n878j59459N0224J2515o863
$$ -171553 -220741 -194546 -88573 42869 144503 274853 268975 109516 159740 172255 165392
14987A65392M7606o8065j46790n7409O2052j10385N4755J11683L5982m942K6590
$$ 165392 212998 144933 -1857 -59266 2786 -107599 -52844 58839 94821 89879 116469
14976A16469p8426j63553Q0453P6580M9445R2113P7669j19553j00590R736L8090
$$ 116469 38043 -125510 -45057 31523 80968 173081 250750 131197 30607 40343 78433
14965G8433O820K1546m5542k63545m8646J40816P6313J51786O0353N2553p3929
$$ 78433 85253 106799 61257 -202288 -250934 -110118 -33805 117981 178334 230887 156958
14954A56958q9940M3417P9133l6259n2018j3972M7722m0405O0786j9028o0724
$$ 156958 67018 110435 189568 153309 101291 87319 135041 94636 155422 136394 75670
14943G5670J1764l3202R254o0706O9m078M0579n5048n5916J2198K45263r0430
$$ 75670 87434 54232 63486 2780 2849 -1229 39350 -15698 -71614 -59416 185847 95417
14931I5417j34950j05897o1481r683J03686O7927J13289Q0790J06063K3897p4422
$$ 95417 -39533 -145430 -206911 -216594 -112908 -44981 68308 149098 255161 279058 204636
14920B04636J7761j2523l0289K6869o5118j10307O5962j2015n3868j5957O0853
$$ 204636 222397 209874 179585 206454 141336 31029 96991 84976 31108 15151 76004
14909G6004J29083m6277j75458j62166K9897J22499L6832J6872r3614J45550J00563
$$ 76004 205087 158810 -16648 -178814 -148917 -26418 10414 27286 -66328 79222 179785
14898A79785k6275j2540q3180N5883k1554M7687M3014K4062q578j11119J860p7941
$$ 179785 153510 140970 57790 113673 92119 139806 182820 206882 198304 87185 89045 11104
14886A1104j07656K9574J12053J56813j8900j44927R1R9704n5987m2837n3700
$$ 11104 -96552 -66978 45075 201888 182988 38061 38152 137856 81869 39032 -14668
14875a4668J4139Q886J10480K9473P5116J16138j01153p0343n1573j07458J6686
$$ -14668 -529 8357 118837 148310 223426 339564 238411 168068 116495 9037 25723
14864B5723L3168m2708N385k2215K3282M0467P6395K4283j45498j7658L6047J33448
$$ 25723 58891 16183 21568 -647 22635 63102 139497 163780 18282 624 36671 170119
14852A70119K1138j42775r0389P9712M6694P622j14856P7101O5069q622J30446
$$ 170119 191257 48482 -41907 37805 84499 92121 -22735 54366 119435 110813 241259
14841B41259K07847n9359j77028P4242Q9832j68569p6529p9427R7455m7747N9100
$$ 241259 449106 389747 212719 286961 376793 208224 131695 52268 149723 101976 161076
14830A61076k5806Q4197J08405L5553r5020r7790P7302Q0920K3370k39949k4922
$$ 161076 135270 219467 327872 363425 268405 170615 247917 328837 352207 112258 87336
14819H7336J12467J10744P907K4037M3682r3559j73060k08403j21542J03229P1306
$$ 87336 199803 310547 318454 342491 386173 292614 119554 -88849 -210391 -107162 -35856
14808c5856J4693J6340M2954k9064P1909k8767R3354P7794p1909P1311P9464o3482
$$ -35856 -21163 -4823 38131 9067 80976 52209 145563 223357 151448 222759 302223 238741
14796B38741j53623j4591m3640l9245K07775J72208o10p8562m0835l731o7218
$$ 238741 85118 70527 26887 -12358 195417 367625 367015 288453 247618 243887 176669
14785A76669L6559j8683R4409N084j3414k9957N3474l1103r590M9035J7951l4615
$$ 176669 213228 194545 288954 294038 280624 250667 304141 273038 263448 312483 330434 295819
14773B95819j62720K1506M8369R729N9404M1593P311o127m9526l3193j80638r2025
$$ 295819 133099 154605 202974 212703 272107 313700 321011 314884 265358 232165 51527 -40498
14761d0498R9794j7272N6613J51378J61587J2104L903Q410j67898J22010K1290
$$ -40498 59296 42024 98637 250015 411602 423706 427609 436019 268121 390131 411421
14750D11421l6950K3778K0038P777K4870J13490r1862r0313q1803L9035M1082
$$ 411421 374471 398249 418287 426064 450934 564424 472562 382249 300446 339481 380563
14739C80563K5150J8898q3892q1719P6082K40121K8452q1435N0239N0350q7191
$$ 380563 405713 424611 340719 259000 335082 575203 603655 522220 572459 622809 535618
14728E35618j34704M0968O869R800o0829j07048R9151J88954m5204j03288J36545
$$ 535618 400914 441882 448751 458551 397722 290674 389825 578779 533575 430287 566832
14717E66832L1699K2857J40458Q8399J8177p4358M172M4921j32011j00368r2905
$$ 566832 598531 621388 761846 850245 868422 794064 798236 843157 711146 610778 517873
14706E17873P3628J00204R599J37606q0489j18937J24692M2909Q6918q264P6158
$$ 517873 591501 691705 701304 838910 758421 639484 764176 807085 894003 885739 961897
14695I61897O2157Q6804J1963p2510J4511k7348J22467K602l3366J22079L1599
$$ 961897 1024054 1110858 1122821 1050311 1064822 1037474 1159941 1162543 1129177 1251256 1282855
14684A282855M4685J38445O2384M892L3355J25483O6814J23136j51705n7155J79842
$$ 1282855 1327540 1465985 1528369 1533261 1566616 1692099 1758913 1882049 1730344 1673189 1853031
14673A853031J44059J91429K61623K06999L8171N5171J87846K45309L29050L77808
$$ 1853031 1997090 2188519 2450142 2657141 2695312 2750483 2938329 3183638 3512688 3890496
14663C890496M38526M94247M77190N04014N62822O83219Q53257J149550J097525
$$ 3890496 4329022 4823269 5300459 5804473 6367295 7050514 7903771 9053321 10150846
14654A0150846J046899J510079J818479K090681K645428L215606M178006N614775
$$ 10150846 11197745 12707824 14526303 16616984 19262412 22478018 26656024 32270799
14646C2270799P862672J0632838J4560258J8300092J9981599J8440812J4150188
$$ 32270799 40133471 50766309 65326567 83626659 103608258 122049070 136199258
14639A36199258Q776900J048029r183304j7959519k0975634j8757623j4532604
$$ 136199258 144976158 146024187 136840883 118881364 97905730 79148107 64615503
14632F4615503j0625344p786249n789514m475326l529383k842681k537141k110498
$$ 64615503 53990159 46203910 40414396 35939070 32409687 29567006 27029865 24919367
14624B4919367j640294j362128j264224j199398r76617q43742p14381q00092o94761
$$ 24919367 23279073 21916945 20652721 19453323 18476706 17632964 16918583 16118491 15423730
14615A5423730q09770p43093m18664m78206m32279m50206m53491n40754l98451
$$ 15423730 14613960 13870867 13452203 12973997 12541718 12091512 11638021 11097267 10698816
14606A0698816k59058l69540l95491l57401m02546k85654m0619r5809k52616j90549
$$ 10698816 10439758 10070218 9674727 9317326 8914780 8629126 8588507 8492698 8240082 8049533
14596H049533k77810k86819k14528k28280k54940k11687j68347q6001k32190k68553
$$ 8049533 7771723 7484904 7270376 7042096 6787156 6575469 6407122 6321121 6088931 5820378
14586E820378r9906j32226j95969j43012j28779j07986j1663M466j48078k36170
$$ 5820378 5720472 5588246 5392277 5249265 5120486 5012500 5000837 5005303 4857225 4621055
14576D621055j34656j24572k59317j02723l5611J1270l772J9462n7988j30765
$$ 4621055 4486399 4361827 4102510 3999787 3964176 3975446 3971674 3991136 3933148 3802383
14566C802383r1112l5098q4117j09050j54841l0675J27621K5683j65671p3462
$$ 3802383 3711271 3676173 3592056 3483006 3328165 3297490 3425111 3450794 3285123 3211661
14556C211661r0536j00196j32205k2032K673n005j36667p558Q588m8470j24112
$$ 3211661 3121125 3020929 2888724 2866692 2869365 2864360 2727693 2720135 2728723 2680253 2556141
14545B556141j40478o6310j06426o1887J14482M5000K0473j4430j58408j66828
$$ 2556141 2415663 2349353 2242927 2181040 2295522 2340522 2360995 2346565 2188157 2021329
14535B021329K9088k2116k165O3542M5488q6573j5484m8819p4377j18228M9204
$$ 2021329 2050417 2028301 2026136 2089678 2135166 2048593 2033109 1984290 1909913 1791685 1840889
14524A840889n471R431j23073j9098o7959j87901q958M8116o343o7384M3352J0205
$$ 1840889 1835418 1844849 1721776 1702678 1634719 1446818 1437860 1485976 1479633 1412249 1455601 1465806
14512A465806p4789Q5466N0857j11980j526P579o2903k3133m3034j10694Q149
$$ 1465806 1391017 1476483 1527340 1415360 1413834 1421413 1358510 1335377 1292343 1181649 1189798
14501A189798j03446j59221N2573P1165J37300j8599p4220J63638j1121j57326
$$ 1189798 1086352 927131 979704 1050869 1188169 1169570 1095350 1258988 1247867 1090541
14491A090541p8119K0239j1257m0352N5577K3846j08300j36487o3713J5239Q3463
$$ 1090541 1012422 1032661 1021404 981052 1036629 1060475 952175 815688 751975 767214 850677
14480H50677r6081n3126N8743m3773K5970j36353L7214N6532J3961o1872j62105
$$ 850677 754596 701470 760213 716440 742410 606057 643271 699803 713764 651892 489787
14469D89787P5336J19263j3712q3160j30225J14217J0855N5229o1350m0853l6509
$$ 489787 565123 684386 670674 587514 457289 571506 582361 637590 576240 535387 498878
14458D98878M2325P4329J18762p6152q9629j64005n4111J97543O3770j50825r18
$$ 498878 541203 615532 734294 658142 568513 404508 350397 547940 611710 460885 459967
14447D59967l459k6756r2876k9122n5319N2836K10890R2463j1804j59576K156
$$ 459967 456508 429752 336876 307754 252435 305271 516161 608624 596820 437244 439400
14436D39400K5905K064P665m5706j06638j3360j20092O8775O5695p749k1550N6078
$$ 439400 465305 467369 475034 429328 322690 309330 189238 258013 323708 315959 294409 350487
14424C50487o3365j51134K475Q0660J01759P2261L1793P2408n5842r0582q3569
$$ 350487 287122 135988 138463 219123 320882 393143 424936 497344 441502 350920 267351
14413B67351n4750l3333N0532L2998R1829J05762P9581M0325j26879r0262O2409
$$ 267351 212601 179268 229800 262798 354627 460389 539970 580295 453416 363154 425563
14402D25563o438R5988J0579j07212m4011J1979j37084k5084l4324q932J59886
$$ 425563 419125 515113 525692 418480 374469 386448 249364 224280 189956 181024 340910
14391C40910R218J1776n7525j2552l1482m5288o094K2144M2005n4819l4974J33190
$$ 340910 350128 361904 304379 291827 260345 215057 208963 231107 273112 218293 183319 316509
14379C16509N4070j28521j3671N2422j1886p8712P184r2145J216p6763O1554N8817
$$ 316509 370579 242058 228387 280809 268923 190211 197395 105250 106466 29703 91257 150074
14367A50074l3143o3410l7352J13594K8789j31878m1706l6702P5027j5908l723
$$ 150074 116931 53521 16169 129763 158552 26674 -15032 -51734 23293 7385 3662
14356C662J39782J03131p9723j11595j08914r3872L6563M8047M3319L0298K4730
$$ 3662 143444 246575 166852 55257 -53657 -147529 -110966 -62919 -19600 10698 35428
14345C5428m0889L7496k1601k7100J87140R5607k9756j08264N688N2403j17111
$$ 35428 -5461 32035 10434 -16666 170474 266081 236325 128061 133749 186152 69041
14334F9041l5345j05021k6822Q8176j0587L5554q289J26206M4291q8302k9939
$$ 69041 33696 -71325 -98147 -9971 -20558 14996 6707 132913 177204 88902 58963
14323E8963q815R337l928N1667L572j5380J9014m2952j60950j9478J01769O0121
$$ 58963 50148 59485 55557 107224 110796 95416 114430 71478 -89472 -108950 -7181 52940
14311E2940K8972l3927l6955J34991L6715j74746L2183N3324J31943l9761q671
$$ 52940 81912 47985 11030 146021 182736 7990 40173 93497 225440 185679 177008
14300A77008m0870j00065q6919m8649Q4048L9297J674p125R9637J02277j29445
$$ 177008 136138 36073 -50846 -99495 -15447 23850 25524 18399 118036 220313 90868
14289I0868L1026p6176m2916O276j0096J23609m851n6438j27069n2200m7707N866
$$ 90868 121894 45718 2802 9078 -1018 122591 117740 61302 -65767 -117967 -165674 -159808
14277a59808L1088R7380M2916K7704k03437j51337J76484R7196L3152J99052P0909
$$ -159808 -128720 -31340 11576 39280 -164157 -315494 -139010 -41814 -8662 190390 261299
14266B61299j11899M4334r3450j54866n8477q621k2871Q8879J26631L5065J2640
$$ 261299 149400 193734 100284 -54582 -113059 -121680 -144551 -55672 70959 106024 118664
14255A18664n7703m6217r5167k15L6369o2890R244O3943J05169M9195K4660j17375
$$ 118664 60961 14744 -80423 -80638 -44269 -107159 -97915 -33972 71197 120392 145052 27677
14243B7677n636J14197k6596k04032M5150P1408J65069Q2181j6744j11651j05145
$$ 27677 22041 136238 109642 -94390 -49240 22168 187237 269418 252674 141023 35878
14232C5878N4212R9175j52326q6086P0239J47394J0840r3117J9272J7461r058
$$ 35878 90090 189265 36939 -49147 21092 168486 179326 86209 105481 122942 113884
14221A13884J43480N9174j78461m1686P7363l6084p2269Q1079o583m8566n8974
$$ 113884 257364 316538 138077 96391 173754 137670 65401 146480 139897 91331 32357
14210C2357L1486N7487m0451m7684q626k3413J20140J02566j04231j6042r3515
$$ 32357 63843 121330 80879 33195 24569 1156 121296 223862 119631 103589 10074
14199A0074L799J37764P8963m8296R1094Q6297J31475k9543J02385N940j42077
$$ 10074 13873 151637 230600 182304 273398 359695 491170 461627 564012 569952 427875
14188D27875L9605o8541k002J26731k02463n0202O6157j14927l9858n0325o7972
$$ 427875 467480 398939 396937 523668 321205 271003 337160 222233 182375 132050 64078
14177F4078N141r2J6556j31988j1207l1630J26164R9044K1769k6427J22509K0948
$$ 64078 69219 69127 85683 -46305 -57512 -89142 37022 136066 157835 131408 253917 274865
14165B74865j29013j68952Q0101M3478m5513J8398K0591Q0288L2660N1879K9028
$$ 274865 145852 -23100 57001 100479 54966 73364 93955 174243 206903 258782 287810
14154B87810N2979q3597n3455k3738o4640l1930r5453j1398Q7685M4473n5169
$$ 287810 340789 257192 203737 179999 115359 83429 -12024 -23422 64263 108736 53567
14143E3567r3827j1922q468L7962m1745N2147l7132Q8981J31585M6783j8061J7453
$$ 53567 -40260 -52182 -60650 -22688 -64433 -12286 -49418 39563 171148 217931 199870 217323
14131B17323k0976j3854J9406J1301R591N9491j11366K0748Q1832j33853j6618
$$ 217323 196347 182493 201899 213200 222791 282282 170916 191664 273496 139643 123025
14120A23025P2052j44086o3991J8832J53187j6100j01136j3966Q4644M8529P9508
$$ 123025 195077 50991 -13000 5832 159019 142919 41783 27817 112461 160990 240498
14109B40498J7778j26794R2385O041j50898j19964n4362M5077m5987P9435L1813
$$ 240498 258276 131482 223867 229908 79010 -40954 -95316 -50239 -96226 -16791 15022
14098A5022N6434o2088j29586r4942k2328J61457J61921j8816R9114M1820o0142
$$ 15022 71456 9368 -120218 -215160 -237488 -76031 85890 67074 166188 208008 147866
14087A47866k8499j24913j44702J19200Q5567l5003n1498p6059L7726r2882r398
$$ 147866 119367 -5546 -150248 -31048 54519 19516 -31982 -108041 -70315 -163197 -172595
14076a72595n1540N6647O6654K9736m4799j2252J57178J76223l9143j68753M8419
$$ -172595 -224135 -167488 -100834 -71098 -115897 -128149 29029 205252 166109 -2644 45775
14065D5775p5504P3539P54j32295Q7869J95921J23951j59748j16777Q6293Q0734
$$ 45775 -29729 43810 44564 -87731 138 196059 320010 160262 43485 129778 210512
14054B10512r971j03678k4164m2115r8323K6701J02927L5476p8744j30844r0852
$$ 210512 200541 96863 72699 30584 -67739 -41038 61889 97365 18621 -112223 -203075
14043b03075O6795L187J3989J57274J8483K2574n5688K0729M0768m1801K8736
$$ -203075 -136280 -133093 -119104 38170 56653 79227 23539 44268 85036 43235 71971
14032G1971j1675p6174o2327m1279l1624Q1751J19860k42P2401m477j18311O4355
$$ 71971 60296 -15878 -78205 -119484 -151108 -69357 50503 50261 122662 118185 -126 64229
14020F4229J25072o9608O3479r2282j07958q0696m2437M3137J1396j40833j8617
$$ 64229 189301 119693 183172 90890 -17068 -97764 -140201 -97064 -85668 -226501 -245118
14009b45118J05795M6336j7693k7628k3333p594N6571n049q8730j49478J21168
$$ -245118 -139323 -92987 -110680 -138308 -161641 -169235 -112664 -117713 -206443 -355921 -234753
13998b34753J39379l3926P3869M8570r2770J02037R6234n5215r6667P909L2714
$$ -234753 -95374 -129300 -55431 -6861 -99631 2406 98640 43425 -53242 -45333 -12619
13987a2619Q3652J7616m3934J05985L2081K6756q0107r4062O9399L0575K7981
$$ -12619 71033 88649 44715 150700 182781 209537 129430 35368 104767 135342 163323
13976A63323n2124k25181j59823R6174K06117N926Q932k1656j22804p837N2714
$$ 163323 111199 -113982 -273805 -177631 28486 34412 43344 21688 -101116 -108953 -56239
13965e6239J1683j03314J17520L038p8155k8216P1816J01931L0232r5721j37812
$$ -56239 -44556 -147870 -30350 -27312 -105467 -133683 -61867 40064 70296 -25425 -163237
13954a63237n4678Q1494R5091L078j39136p5402M833J04141K4820L1642l9759
$$ -163237 -217915 -136421 -41330 -38252 -177388 -252790 -247957 -143816 -118996 -87354 -127113
13943a27113j13128K5101J40733P2611q954O2403mj28677J0000o4982o8233J01658
$$ -127113 -240241 -215140 -74407 -1796 -10750 51653 51649 -77028 -67028 -132010 -200243 -98585
13931i8585J26279N5387L9590k6896j96817n5087M3207L4113J02070p5158k7236
$$ -98585 27694 83081 122671 95775 -101042 -156129 -112922 -78809 23261 -51897 -79133
13920g9133O1052n4697K673l5175J00762J9012K7861j00494o5391R9K8876K4824
$$ -79133 -18081 -72778 -70105 -105280 -4518 14494 42355 -58139 -123530 -123431 -94555 -69731
13908f9731J40294P2551j21215j17574q7799R0667j6361j29401j69206P0360J76850
$$ -69731 70563 143114 21899 -95675 -183474 -92807 -109168 -238569 -407775 -337415 -160565
13897a60565J60000R9986R1184j15102j19681K0024P7621P0893L6348r1648o300
$$ -160565 -565 99421 190605 75503 -44178 -24154 53467 124360 160708 69060 62760
13886F2760m267j49828m466Q708J7508J15717M1105j11554k4560r5130q2168J72549
$$ 62760 58493 -91335 -95801 -87093 -69585 46132 87237 -24317 -48877 -144007 -226175 -53626
13874e3626J6526p3206j3382N3875M1636l3735L1355N6339J9035L2996O7739m8884
$$ -53626 -37100 -110306 -123688 -69813 -28177 -61912 -30557 25782 44817 77813 145552 96668
13862I6668j21273k42r0554M5527J15687p1697K6606j05097K6264K7648J79486
$$ 96668 -24605 -24847 -115401 -69874 45813 -25884 722 -104375 -78111 -50463 129023
13851A29023J4321M549q978r6660j67686l8530M1011Q3746J58291l4070j3003
$$ 129023 143344 147893 138915 42255 -125431 -163961 -122950 -39204 119087 85017 72014
13840G2014m8460R2743o2207j1608N423m2604r935N1995p8389q1986L565K8861
$$ 72014 23554 116297 54090 42482 47905 5301 -4634 47361 -31028 -113014 -109449 -80588
13828h0588Q5110J24572L4359j4792o8579l3393J2931j2883p9299o3856j32690
$$ -80588 4522 129094 163453 148661 80082 46689 59620 46737 -32562 -96418 -229108
13817b29108J04930O2231l1279J09874j03610J9194N777Q1176m8520m0494k2740
$$ -229108 -124178 -61947 -93226 16648 -86962 -67768 -61991 19185 -29335 -69829 -92569
13806i2569k0334J74455J60516M2283r1517q0951j6596n8974R2122R2288j07482
$$ -92569 -112903 61552 222068 264351 172834 91883 75287 16313 108435 200723 93241
13795I3241k07857k4235J8245J19531P8297O7246J09307k7688j40510r6085j36120
$$ 93241 -114616 -138851 -120606 -1075 77222 144468 253775 226087 85577 -10508 -146628
13784a46628j95177L8959J61995N3310J6767p5255m0356k7165K9405p5831l5592
$$ -146628 -341805 -302846 -140851 -87541 -70774 -146029 -186385 -213550 -184145 -259976 -295568
13773b95568J35716k4379n6361J6562J23305j0740j15067O6452R7990k236J18511
$$ -295568 -159852 -184231 -240592 -224030 -100725 -111465 -226532 -160080 -62090 -64326 54185
13762E4185M8247q3861n4315q3196N9657k164l2767q9999J30843M4410o1472M1805
$$ 54185 102432 18571 -35744 -118940 -59283 -61447 -94214 -184213 -53370 -8960 -70432 -28627
13750b8627J60156l5259k08052r9596n4541Q4493O6879Q8549Q4386l7815p0079
$$ -28627 131529 96270 -111782 -211378 -265919 -181426 -114547 -25998 58388 20573 -49506
13739d9506j5392J1348n8873j00674J0475Q9425J26948r6093m4378Q4937J67546
$$ -49506 -64898 -53550 -112423 -213097 -202622 -113197 13751 -82342 -126720 -41783 125763
13728A25763L7675P46r5567r4777j61474n6471N1042p1578O9894J47943L0157
$$ 125763 163438 164184 68617 -26160 -187634 -244105 -193063 -264641 -194747 -46804 -16647
13717a6647j44992K49K9334k9953K2784K00175R6708p5887o6541Q8664J04436
$$ -16647 -161639 -161390 -132056 -162009 -139225 60950 157658 81771 15230 103894 208330
13706B08330o9065P5028K05309j49989j03309K4938l8611j8559m7229q0101k34517
$$ 208330 139265 214293 419602 269613 166304 191242 152631 134072 86843 6742 -227775
13695b27775j7107K25411N7169P1406J9004l6850n4258n7116M1057J37747J20739
$$ -227775 -244882 -19471 37698 109104 128108 91258 37000 -20116 20941 158688 279427
13684B79427n9001q6339p7376q1972Q6798J3002j8461j73550L4755J71598o4526
$$ 279427 220426 134087 56711 -25261 61537 74539 56078 -117472 -82717 88881 24355
13673B4355m9041r9183M8117M6830o9598J16695J10977n1330l1397j4783m5974
$$ 24355 -24686 -123869 -75752 -28922 -98520 18175 129152 77822 46425 31642 -14332
13662a4332o0092J74974J71548J295j21872j77844n3832l2749N5120m0806o7152
$$ -14332 -74424 100550 272098 273393 151521 -26323 -80155 -112904 -57784 -98590 -165742
13651a65742R9943Q7428P4983m8811J68194J10327k6725k625M2091J4607k1246
$$ -165742 -65799 21629 96612 47801 215995 326322 299597 296972 339063 353670 332424
13640C32424j12675j25414r7233O3204N7424K4051j03649m5654R8009J34983p9049
$$ 332424 219749 94335 -2898 60306 117730 141781 38132 -7522 90487 225470 146421
13629A46421n8111l001j41198o498J36234J486j42920R0720n3833P6120n3563
$$ 146421 88310 85309 -55889 -62387 73847 75333 -67587 23133 -30700 45420 -8143
13618h143j2090L2956P2865K3699P8096L6546j73642p1622M1188K59989q7921
$$ -8143 -20233 12723 85588 109287 187383 223929 50287 -21335 19853 279842 191921
13607A91921j82678k4924j48870J4882J45259J30510J7454j68423j97562N1615
$$ 191921 9243 -15681 -164551 -149669 -4410 126100 143554 -24869 -222431 -170816
13597a70816J35901r5984O2461O5943M0195j06267j35379m3774K6699N0994R7007
$$ -170816 -34915 -130899 -68438 -2495 37700 -68567 -203946 -247720 -221021 -170027 -73020
13586g3020P7015L5341R9232L9q9494q7874M0982O6852j4597k5591J4871M9286
$$ -73020 3995 39336 138568 138607 49113 -38761 2221 69073 54476 28885 43756 93042
13574I3042J25614J12943N6180j10123r7711R7348r0066j59459p1411p5698J29665
$$ 93042 218656 331599 387779 277656 179945 277293 187227 27768 -43643 -119341 10324
13563A0324J73789j6964K1961L1635J1588l4633J0580j55308L707R5741p498J7380
$$ 10324 184113 167149 189110 220745 232333 197700 208280 52972 56679 152420 144922 162302
13551A62302k3816k1315j8314O6692J05229m2446m1991o1308K1005M0696j66267
$$ 162302 138486 117171 98857 165549 270778 228332 186341 125033 146038 186734 20467
13540B0467j3477J59717J6418j21142j3301P5096O0420n6008q8922J2098Q0943
$$ 20467 6990 166707 183125 61983 48682 123778 184198 128190 39268 51366 132309
13529A32309k5761R3992l1529j01333j02088k4954J00099j5332k204N0522J6388
$$ 132309 106548 200540 169011 67678 -34410 -59364 40735 25403 23199 73721 90109
13518I0109J03607N0505j715l6753M4852l0656L7415j6606m4004q5524M3753R6429
$$ 90109 193716 244221 242506 205753 250605 219949 257364 240758 196754 111230 154983 251412
13506B51412j15335j49347o8512L8738N9922o3755p9119O7947R4388N5892m2674
$$ 251412 136077 -13270 -81782 -43044 16878 -46877 -125996 -58049 36339 92231 49557
13495D9557O8873o960M2255k5038K1730Q1607j14763j04720O2009J14435k8550
$$ 49557 118430 111470 153725 128687 150417 232024 117261 12541 74550 188985 160435
13484A60435j02830N8108K7448j4759j8925L473R2422K0716j79986K6894R2316
$$ 160435 57605 115713 143161 128402 109477 112950 205372 226088 46102 72996 165312
13473A65312p2438j17948K8716J36313J2379o4118J60393n1103j6734P6186p7074
$$ 165312 92874 -25074 3642 139955 152334 88216 248609 197506 180772 256958 179884
13462A79884r8037M5608K6225J04176k3132o8308r4293k6129l120M6578J42005
$$ 179884 81847 127455 153680 257856 234724 166416 72123 45994 42874 89452 231457
13451B31457j66539K0475o0070p4943p3977n0974N1337R7099J93317O2638n1935
$$ 231457 64918 85393 25323 -49620 -123597 -174571 -123234 -26135 167182 229820 177885
13440A77885J3666l558N650p3741k67117J3405Q1976J20557M7789J0802K1955
$$ 177885 191551 187993 193643 119902 -147215 -133810 -51834 68723 116512 127314 149269
13429A49269l4912j3540N0726j5752L9108n4728N5156O5825l5903o5015J14098
$$ 149269 114357 100817 151543 135791 174899 120171 175327 241152 205249 140234 254332
13418B54332P1091O9491n40j35466o7847l9617P9823k44m1987k3265r3434k7296
$$ 254332 325423 394914 394374 258908 191061 151444 231267 231023 189036 165771 72337 45041
13406D5041r14J02656n0112o5210J92032l3845j62868J3621J02302J12549L7899
$$ 45041 44127 146783 96671 31461 223493 189648 26780 40401 142703 255252 293151
13395B93151k4312q4426m9392P7137k6587j8261p0379J11861J21207j36954m3415
$$ 293151 268839 184413 135021 212158 185571 167310 96931 208792 329999 193045 149630
13384A49630M7005l9765J4183O6385q1163Q191J2069q4273L1346n7958O520j8232
$$ 149630 196635 156870 171053 237438 156275 164466 176535 92262 123608 65650 72170 53938
13372E3938j59557j030Q6712p468J05510J1797L2403R4675L6626k19306P092M9487
$$ 53938 -105619 -106649 -19937 -27405 78105 89902 122305 216980 253606 34300 41392 90879
13360I0879Q2309j09826j00626L2962Q8845P1337J4961q2507P2716r1805m3933
$$ 90879 173188 63362 -37264 -4302 84543 155880 170841 88334 161050 69245 25312
13349B5312J19494O1974L2521m69n0272J1316Q1913m8612N5440J03126p7691j15734
$$ 25312 144806 206780 239301 238832 188560 199876 281789 233177 288617 391743 314052 198318
13337A98318J12976R4855r6076n1116k1162r7016r0632J8122P513L4751Q5007
$$ 198318 311294 406149 310073 258957 237795 140779 50147 68269 75782 110533 195540
13326A95540k0658r0820P6779L7435j82919M091J49803J16696k4881n2202J2878
$$ 195540 174882 84062 160841 198276 15357 19448 169251 285947 261066 208864 221742
13315B21742p4406M0470j09371o015j56504K0395J20297k2872K5876N3088J509
$$ 221742 147336 187806 78435 72420 -84084 -63689 56608 33736 59612 112700 114209
13304A14209j32746k12179n8698O5900K9151l1274k2719j5913P5862J60938J58892
$$ 114209 -18537 -230716 -289414 -223514 -194363 -225637 -248356 -264269 -188407 -27469 131423
13293A31423R0100M4876O2284j39728K6659p2881j12076O0274K22638j6139m8479
$$ 131423 221523 266399 328683 188955 215614 142733 30657 90931 313569 297430 248951
13282B48951l1643j92624L544K3135J09598P4632n0022j15834n8253j3549P7398
$$ 248951 217308 24684 28228 51363 160961 235593 185571 69737 11484 -2065 75333
13271G5333o923j4433k9503N9292o5931m1613M0823O6589M250P969J23817L7603
$$ 75333 68410 53977 24474 83766 17835 -23778 17045 83634 87884 95853 219670 257273
13259B57273q7209j8428k3069j56895R060J50511Q4741J08182m8889R416j8656
$$ 257273 170064 151636 128567 -28328 -19268 131243 215984 324166 275277 284693 266037
13248B66037m5282O372k9363j47425l1975Q0595J27482J27895j30856j21507p8451
$$ 266037 220755 227127 197764 50339 18364 98959 226441 354336 223480 101973 23522
13237B3522j35786J2423P8267J1978l6971P3418m1613N5215J36803q0884K9581
$$ 23522 -112264 -99841 -21574 -9596 -46567 26851 -14762 40453 177256 96372 125953
13226A25953J67472L6640o9030l2019N184n4603m510n5822Q574p6906p5681Q9024
$$ 125953 293425 330065 261035 229016 234200 179597 175087 119265 127839 50933 -24748 64276
13214F4276j8133j687L6873J41818R2903j20291j0819N0730O8862r3961k6476
$$ 64276 46143 44456 81329 223147 316050 195759 184940 235670 304532 210571 184095
13203A84095N1486r5829O1013J2028J7539J7247j3088k6867o2744q0429k299K0687
$$ 184095 235581 139752 200765 212793 230332 247579 234491 207624 144880 64451 62152 82839
13191H2839J98915O8292j83892j51088L0953N3747q2862p6306l0407N6625J20698
$$ 82839 281754 350046 166154 15066 46019 99766 16904 -59402 -89809 -33184 87514
13180H7514m6259p6943M7517J78825j2844j10729R027J0031p7026o3821P4668
$$ 87514 41255 -35688 11829 190654 177810 67081 76108 86139 9113 -54708 19960
13169A9960M9425P8870R2525J83968j02352q3312l737r1480N5917m4386j0650
$$ 19960 69385 148255 240780 424748 322396 239084 235347 143867 199784 155398 144748
13158A44748k6529J04183j07075J4883r580j32055J6926J72238J69885r4836j49482
$$ 144748 118219 222402 115327 130210 120630 -11425 5501 177739 347624 252788 103306
13147A03306l2973N492J6256L1240Q8402p2964n1612m2420j5616R6725N6585p4884
$$ 103306 70333 75825 92081 123321 211723 138759 87147 44727 29111 125836 182421 107537
13135A07537r2330j10721J58017N3327L3946m2489O9347K8132J10719J1873P7946
$$ 107537 15207 -95514 62503 115830 149776 107287 176634 204766 315485 327358 405304
13124D05304K3852j64030O7519J04218o175j11865j23988l6671J20662K11070
$$ 405304 429156 265126 332645 436863 430688 318823 194835 158164 278826 489896
13114D89896m7857j32039n6672M4993j17256l9271R2253n2606n9796P591j3263
$$ 489896 442039 310000 253328 298321 181065 141794 234047 181441 121645 129236 115973
13103A15973o0034o0390J18137J48804N8291j35339J1179N0357J6834q8091m8448
$$ 115973 55939 -4451 113686 262490 320781 185442 196621 246978 263812 175721 127273
13092A27273J24489P7124k9761j40551k8666J7316J09715J46114L4454q5200j01924
$$ 127273 251762 328886 299125 158574 129908 147224 256939 403053 437507 352307 250383
13081B50383M7827K4798k1038O999j8559o2306j19873l7049Q9240M8326m6954
$$ 250383 298210 323008 301970 308969 290410 228104 108231 71182 160422 208748 161794
13070A61794k8831m0044M8549J69682k0709q5179N16m4479j33162O5135M8799
$$ 161794 132963 92919 141468 311150 290441 205262 205778 161299 28137 93272 142071
13059A42071j09449r2757L8269J72393K11473J28915j51320k15554j37941L8000
$$ 142071 32622 -60135 -21866 150527 362000 490915 339595 124041 -13900 24100
13049B4100K6577R8147J25932J6996q1922j08465p794L4540Q4021J07778O7138
$$ 24100 50677 148824 274756 291752 209830 101365 93571 128111 212132 319910 387048
13038C87048J5081k8072R3113k5172r3431R5751O8363m302q4338j64113j08611
$$ 387048 402129 374057 467170 441998 348567 444318 512681 508379 424041 259928 151317
13027A51317j8340J620l1648p0675J8172j8330K805J43859J61119o0118k17161
$$ 151317 132977 134597 102949 32274 50446 32116 34921 178780 339899 279781 62620
13016F2620p3137J12592o2646o4148J23058J22484l6133J46041J45694n5463n1698
$$ 62620 -10517 102075 39429 -24719 98339 220823 184690 330731 476425 420962 369264
13005C69264L3007j05316m2093K1749L6898p0446J2100k489Q320K1028J40710
$$ 369264 402271 296955 254862 276611 313509 243063 255163 252674 260994 282022 422732
12994D22732m6979p6942J2205Q175J8024j20414o6895o3428j31628P5546J49826
$$ 422732 375753 298811 311016 319191 337215 216801 149906 86478 -45150 30396 180222
12983A80222J74999k3349K3978O3464p1560p272M112j95772n0276p8902k9385
$$ 180222 355221 331872 355850 419314 347754 340482 344594 148822 98546 19644 -9741
12972i741L1727K2090m1569J4068J42683J47937m6534j01334j8202l5907L3590
$$ -9741 21986 44076 2507 16575 159258 307195 260661 159327 141125 105218 138808
12961A38808L4000J49060o5433j9719J91080j8626M0802Q6752l5310p4080r7876
$$ 138808 172808 321868 256435 236716 427796 409170 449972 536724 501414 427334 329458
12950C29458L4723J2966M7394l8934n7357k3098J24887N0711O126L9726k08514
$$ 329458 364181 377147 424541 385607 328250 305152 430039 480750 486876 526602 318088
12939C18088o2169J5554j3533n4601O7971q640j19718P091m4136M9695j30027
$$ 318088 255919 271473 257940 203339 271310 262670 142952 150043 105907 155602 25575
12928B5575m6274M9471j3298N5643O6443L8359n7301P4649J43734l4357n6820
$$ 25575 -20699 28772 15474 71117 137560 175919 118618 193267 337001 302644 245824
12917B45824o3882l6380P0690o1710m982N5378r8072o2018j0363N183J72658J01622
$$ 245824 181942 145562 216252 154542 149560 204938 106866 44848 34485 39668 212326 313948
12905C13948r868l1429P568j37072p9558P5982Q0470k9230J2939M4486Q7602O3366
$$ 313948 304080 272651 280219 143147 63589 139571 220041 190811 203750 248236 335838 399204
12893C99204r7436o0295l5578p6049q575J01767j16019k1695J32294K2998r6667
$$ 399204 301768 241473 205895 129846 121271 223038 107019 85324 217618 240616 143949
12882A43949m7903P7131N875J27437P6921j21209n1150R2973L384l8550j70961
$$ 143949 96046 173177 179052 306489 383410 262201 211051 304024 307408 268858 97897
12871I7897K1776O7742j7642M0226k8525L5360K1349m9189j6806R7269J04595
$$ 97897 119673 187415 169773 209999 181474 216834 238183 188994 172188 269457 374052
12860C74052r4336o3834J46129K1326r2028j26142L0830N0068m6387M0236Q9510
$$ 374052 279716 215882 362011 383337 291309 165167 195997 246065 199678 239914 329424
12849C29424O1675L2176R0249j02436M0928P586p5697j51423m9732J1695R8800
$$ 329424 391099 423275 513524 411088 452016 459602 383905 232482 182750 194445 293245
12838B93245L310j08120J1716o2692P8340J50879R6590j64280L4239R8615M3120
$$ 293245 296555 188435 200151 137459 215799 366678 463268 298988 333227 431842 474962
12827D74962m621n4943q6195M4399J43756J2940P868n1044p6762j56103L9847
$$ 474962 470341 415398 329203 373602 517358 530298 538166 487122 410360 254257 294104
12816B94104j4296o0560Q1829Q2114J0299j7098N1213Q3974J5397j5383j33853
$$ 294104 279808 219248 301077 383191 393490 376392 427605 511579 526976 511593 377740
12805C77740p4171L7564m3782j0100M9805P503j39395j29586j0906J40922L9983
$$ 377740 303569 341133 297351 287251 337056 344559 205164 75578 64672 205594 245577
12794B45577J3215p0117O2861K6151l9981j8467N9666m0441N708o6184O1978O2174
$$ 245577 258792 188675 251536 277687 237706 219239 278905 238464 244172 177988 239966 302140
12782C02140k2696J5406j77181o8772M1076K36890K12868n3460j21825M9682r0912
$$ 302140 279444 294850 117669 48897 89973 326863 539731 486271 364446 414128 323216
12771C23216o1698Q2988O8715l3847k7228P1752n2028j61563m8590P9054O3629
$$ 323216 261518 344506 413221 379374 352146 423898 371870 210307 161717 240771 304400
12760C04400k8735o0078J05609J17381L7561j75261j45886P6132J95220m7438
$$ 304400 275665 215587 321196 438577 476138 300877 154991 231123 426343 378905
12750C78905n9639q510k2531N5804M4090l2045J02745n2271j06453j50114J55820
$$ 378905 319266 310756 288225 344029 388119 356074 458819 406548 300095 149981 305801
12739C05801J60689p6231j84783J884J68632K22591R2563Q2547j94373l3254j5346
$$ 305801 466490 390259 205476 207360 375992 598583 691146 773693 579320 546066 530720
12728E30720k6926j5691J6933p2702q856O2798p4477M2442O9643j54341j37141
$$ 530720 503794 488103 505036 432334 423478 486276 411799 454241 523884 369543 232402
12717B32402r5320O7758O6793J02740M9981M247N4877P559L037j3401j13207o0644
$$ 232402 137082 204840 271633 374373 424354 428601 483478 491037 494074 480673 367466 306822
12705C06822J0660J01013O0898l410j91356O369J06269j04626M5065J29930Q452
$$ 306822 317482 418495 479393 475983 284627 290996 397265 292639 337704 467634 476086
12694D76086k4555j5803r878J2561K6561n9568Q2932Q4215n8900j26214m1694
$$ 476086 451531 435728 425850 438411 464972 405404 488336 572551 513651 387437 345743
12683C45743M4663k9398q1415J05234J40056r193n1653j5420o6916j777k9161
$$ 345743 390406 361008 279593 384827 524883 515690 464037 448617 381701 379924 350763
12672C50763K1940J13891j0210j48234m1979J50859P4568M6832l2646r865J31498
$$ 350763 372703 486594 476384 328150 286171 437030 511598 558430 525784 515919 647417
12661F47417m0756N6159n1576q0918m0179n7948l3532q144p9763L8625J34378
$$ 647417 606661 662820 611244 530326 490147 432199 398667 390523 310760 349385 483763
12650D83763K05786N6792N0850J9466j87381j53534J6767k7400M3093k3006K3345
$$ 483763 689549 746341 797191 816657 629276 475742 492509 465109 508202 485196 508541
12639E08541M9489l4374j02833J40105Q1533q0938K6898M3505q7438m2811l0600
$$ 508541 558030 523656 420823 560928 642461 561523 588421 631926 544488 501677 471077
12628D71077j4436M9387Q8408j915j8331l5642r0048m2950K9849M0780J28207
$$ 471077 456641 506028 594436 592521 574190 538548 448500 405550 435399 476179 604386
12617F04386m5581o2498Q835o2076l2247R8948J12156P7102L7683J7396O2260
$$ 604386 558805 496307 505142 443066 410819 509767 621923 699025 736708 754104 816364
12606H16364O7875O6175j5570j34261j23427j10319O8807N2713P3753J41963k6788
$$ 816364 884239 950414 934844 800583 677156 566837 635644 688357 762110 904073 877285
12595H77285j78010M8284o5743j45653k5159j864q469J04926J13703J15733n3460
$$ 877285 699275 747559 681816 536163 511004 509140 500671 605597 719300 835033 781573
12584G81573j17459j75m8224j67005J04756K51j31329k4312O2507N4460Q2356
$$ 781573 664114 663939 615715 448710 553466 553717 422388 398076 460583 515043 597399
12573E97399P88J59342M3002k6406J7808q0859j32722j74317P2759N986M2239
$$ 597399 598187 757529 800531 774125 791933 711074 578352 404035 476794 482780 525019
12562E25019R0391p6532J54562J57367j7886q1316j78992q8818J38333R2634p5995
$$ 525019 615410 538878 693440 850807 832921 751605 572613 483795 622128 714762 638767
12551F38767J3019k2797l3661L8666Q9976L7756j22180l2140q0183l6376M6659
$$ 638767 651786 628989 595328 633994 723970 761726 639546 607406 527223 490847 537506
12540E37506J48901J19430j13340k4741R449j06769q8586Q9871J50077k9615p3954
$$ 537506 686407 805837 692497 667756 677205 570436 481850 571721 721798 692183 618229
12529F18229r006J48818J65892n1700q1957k7406R8134K6679L0210p0851j8618
$$ 618229 609223 758041 923933 872233 790276 762870 861004 887683 917893 847042 828424
12518H28424N8487k8454N627M0316M9837o5711R892p8915j12929l7729J24092
$$ 828424 886911 858457 864084 904400 954237 888526 898418 819503 706574 668845 792937
12507G92937J13155j01523q7050N3558R4488m4945m5100j22503K1534K5328R5639
$$ 792937 906092 804569 717519 771077 865565 820620 775520 653017 674551 699879 795518
12496G95518J76309m7351j64376o5640J3555O1422J39286J53164O7388r192j38281
$$ 795518 971827 924476 760100 694460 708015 769437 908723 1061887 1129275 1120083 981802
12485I81802n3962J60674Q888j01419j54035j11269P0808J09786L3245p3233J3093
$$ 981802 927840 1088514 1097402 995983 841948 730679 801487 911273 944518 871285 884378
12474H84378k4386j29856Q72k5629P1949N0979k2600j62864j2297J20584J95455
$$ 884378 859992 730136 731008 705379 777328 828307 805707 642843 630546 751130 946585
12463I46585P9693M3404N5314j2035l9306l252J21226j16969j44591o4725J922
$$ 946585 1026278 1069682 1124996 1112961 1073655 1070403 1191629 1074660 930069 865344 867266
12452H67266k827n1909l3506M7293R4814J5576m6344p050m4431R991L8394O8053
$$ 867266 864439 812530 779024 826317 921131 936707 890363 883313 838882 848873 887267 955320
12440I55320O7614o8048j9211l0462J24910O5631j02148j09552k5787J18901M6344
$$ 955320 1022934 954886 935675 905213 1030123 1095754 993606 884054 858267 977168 1023512
12429A023512p084l4329P0292J73585k42026l8055K6403l6494N8618J11328l6955
$$ 1023512 1016428 982099 1052391 1225976 983950 945895 972298 935804 994422 1105750 1068795
12418A068795j84035Q152N5672J00435K9753P4321j56105q2437o6391p1550J6058
$$ 1068795 884760 892912 948584 1049019 1078772 1153093 996988 914551 848160 776610 792668
12407G92668j11137Q933M0762K09892L8768P2275J55351m5312j01302n0406l3213
$$ 792668 681531 690464 731226 941118 979886 1052161 1207512 1162200 1060898 1010492 977279
12396I77279k7713P8796P6185l8091O4294J04150k4020l128j08233m4399J7034
$$ 977279 949566 1028362 1104547 1066456 1130750 1234900 1210880 1207752 1099519 1055120 1072154
12385A072154K4804K9253L283L4241J85886p0890l6810j32430j57675K20351J60421
$$ 1072154 1096958 1126211 1129494 1163735 1349621 1278731 1241921 1109491 951816 1172167 1332588
12374A332588j4674n4706N5286M0578n6583l945l2560m3088r1215l8193j01610
$$ 1332588 1317914 1263208 1318494 1359072 1302489 1298544 1265984 1222896 1131681 1093488 991878
12363I91878Q7415O8221r507K1411Q8640l5338Q3579M6261j71840r3382J14397
$$ 991878 1079293 1147514 1138007 1159418 1248058 1212720 1296299 1342560 1170720 1077338 1191735
12352A191735J49099O6730j21643N270J07554n1606p7867j7422l84N2247N6744
$$ 1191735 1340834 1407564 1285921 1291191 1398745 1347139 1269272 1251850 1251466 1303713 1360457
12341A360457p0638J5121p7693n3630j2308m2736P6948N8560N519J57737O2552
$$ 1360457 1289819 1304940 1227247 1173617 1161309 1118573 1195521 1254081 1259600 1417337 1479889
12330A479889l4451l1994M1039M1419J0202Q7837j42646j37043M9239O4610J47739
$$ 1479889 1445438 1413444 1454483 1495902 1506104 1593941 1451295 1314252 1363491 1428101 1575840
12319A575840J20222j9936k45909l2896J13878Q7416l7599r9918J6197l4826J09233
$$ 1575840 1696062 1676126 1430217 1397321 1511199 1598615 1561016 1461098 1477295 1442469 1551702
12308A551702m6943j20441Q2679k4584l154Q1924P6715J03735O0981r1202k4141
$$ 1551702 1504759 1384318 1466997 1442413 1439259 1521183 1597898 1701633 1762614 1671412 1647271
12297A647271p0878j32046p721J02052J36870L1996n9753j11176j28675R1441
$$ 1647271 1576393 1444347 1436626 1538678 1675548 1707544 1647791 1536615 1407940 1499381
12287A499381P7329N1709J46458N014k68322q9548J26147J02445J09116K4525
$$ 1499381 1576710 1628419 1774877 1779891 1511569 1422021 1548168 1650613 1759729 1784254
12277A784254j8503L5702M5939J40701K435j73575o6045j1026O4867Q5970j27595
$$ 1784254 1765751 1801453 1847392 1988093 1990528 1816953 1750908 1739882 1804749 1890719 1763124
12266A763124k67326q2460L99934Q1766r3630O6294R9741p1677p6733J31388r2381
$$ 1763124 1495798 1413338 1813272 1895038 1801408 1867702 1967443 1895766 1819033 1950421 1858040
12255A858040o4154J23499J07345J8857N8000J32530j18275O617k9099j20370
$$ 1858040 1793886 1917385 2024730 2043587 2101587 2234117 2115842 2122459 2093360 1972990
12245A972990q5072j01145J31005k410M6705n4616m4282N7540j0328m8739O4726
$$ 1972990 1887918 1786773 1917778 1915368 1962073 1907457 1863175 1920715 1910387 1861648 1926374
12234A926374l3541q8403Q991J25944N1326J80092L2134j44783l5532J21884j0975
$$ 1926374 1892833 1804430 1813421 1939365 1990691 2170783 2202917 2058134 2022602 2144486 2133511
12223B133511j16673k0406o201j2639J44340j5562Q080K58480N7836j36144j64155
$$ 2133511 2016838 1996432 1990231 1977592 2121932 2106370 2114450 2372930 2430766 2294622 2130467
12212B130467O1767N7234J21334k0159n6899k9970J26115J99j6340n4331j71934
$$ 2130467 2192234 2249468 2370802 2350643 2293744 2263774 2389889 2390088 2373748 2319417 2147483
12201B147483n0405q230J33243Q8904K0020j3449O2972k9510K2602J09718J5045
$$ 2147483 2097078 2088848 2222091 2310995 2331015 2317566 2380538 2351028 2373630 2483348 2498393
12190B498393J10606M798j10685m0054Q9160N212J267j69778l2578J18315m4673
$$ 2498393 2608999 2613797 2503112 2463058 2552218 2557430 2558697 2388919 2356341 2474656 2429983
12179B429983J09982o3625j96335J3504J66408N3303q844l8314m3807R0531J06002
$$ 2429983 2539965 2476340 2280005 2293509 2459917 2513220 2504376 2466062 2422255 2512786 2618788
12168B618788l1951n3250j7300j69937n4401K80431R2196R971J04981O0379j5563
$$ 2618788 2586837 2533587 2516287 2346350 2291949 2572380 2664576 2674547 2779528 2839907 2824344
12157B824344k3458n5222p0639M2306J5276J00942j3635q4391k3249J8975J01068
$$ 2824344 2800886 2745664 2675025 2717331 2732607 2833549 2819914 2735523 2712274 2731249 2832317
12146B832317P7809N1476O4614O0968o1084O304J18109J17010j24414J3010Q799
$$ 2832317 2910126 2961602 3026216 3087184 3026100 3032404 3150513 3267523 3143109 3156119 3164918
12135C164918n8301m1914k6250j9529j7276P4133P0921k3376m2335R63P3969J43411
$$ 3164918 3106617 3064703 3038453 3018924 3001648 3075781 3146702 3123326 3080991 3081954 3155923 3299334
12123C299334k2090k31299k3090J82920P718K0117K8210j32646l6654N6174J4157
$$ 3299334 3277244 3045945 3022855 3205775 3213493 3233610 3261820 3129174 3092520 3148694 3162851
12112C162851L7175J30225J75771j5547l7542m3997o5179N0931j3277J7896j6145
$$ 3162851 3200026 3330251 3506022 3490475 3452933 3408936 3343757 3394688 3381411 3399307 3383162
12101C383162M3481n4664J95122J47366j0070J519m0723k3516p8160k814J34475
$$ 3383162 3426643 3371979 3567101 3714467 3704397 3705916 3665193 3641677 3563517 3560703 3695178
12090C695178J41624M2305N1629j05622M8186K160l0663N426M9817O520n8943
$$ 3695178 3836802 3879107 3930736 3825114 3873300 3875460 3844797 3850223 3900040 3906560 3847617
12079C847617K8870n520J2198J15857M5769n0351p3574J8078P2977l284m7853
$$ 3847617 3876487 3870967 3883165 3999022 4044791 3994440 3920866 3938944 4011921 4008637 3960784
12068C960784j9503q7125M6393J45074R7020O6387L3334Q238J05760k0889O1510
$$ 3960784 3941281 3854156 3900549 4045623 4142643 4209030 4242364 4250602 4356362 4335473 4396983
12057D396983m8154n2126j8177J6085R3638N1199R3626Q8076q3935o8665m9002
$$ 4396983 4348829 4296703 4278526 4294611 4388249 4439448 4533074 4621150 4537215 4468550 4419548
12046D419548j05187n4680L2435J19933L12124R4002k49380j34895l2587L527
$$ 4419548 4314361 4259681 4292116 4412049 4724173 4818175 4568795 4433900 4401313 4404840
12036D404840J69170o0664k8246K7447N4812J91859J28428P5418N2024k02679
$$ 4404840 4574010 4513346 4485100 4512547 4567359 4759218 4887646 4963064 5015088 4812409
12026D812409J275O0897j20639p2021J37818J44270n1463K7454o0733j2300M1815
$$ 4812409 4813684 4874581 4753942 4681921 4819739 4964009 4912546 4940000 4879267 4866967 4908782
12015D908782Q5327M1384n100J43684Q2075J1253j8716K4023r9824j98763j04849
$$ 4908782 4994109 5035493 5030393 5174077 5256152 5267405 5248689 5272712 5172888 4974125 4869276
12004D869276J46834J01848J0228l2399m14n4249r563J03588m8831j0505o6076
$$ 4869276 5016110 5117958 5128186 5095787 5095373 5041124 5031561 5135149 5086318 5075813 5009737
11993E009737K7483K433N7537M1250o2633l2899M0532j7038M7475L3329Q6271
$$ 5009737 5037220 5039653 5097190 5138440 5075807 5042908 5083440 5066402 5113877 5147206 5233477
11982E233477J32537J86483l545j32238O927J67442R6672K5663J07473N0933L4620
$$ 5233477 5366014 5552497 5548952 5416714 5423641 5591083 5687755 5713418 5820891 5871824 5906444
11971E906444j39618j61105M319L1987r2148n2324M5134J97876J19930j15146
$$ 5906444 5766826 5605721 5610040 5642027 5549879 5497555 5542689 5740565 5860495 5745349
11961E745349j07678Q1789J18797J8873o4455J8843R6936Q4782j13637m6883M7336
$$ 5745349 5637671 5719460 5838257 5857130 5792675 5811518 5908454 5993236 5879599 5832716 5880052
11950E880052l5743n9211P0204J43559K7123o6165j30380q2787j73441m5373M4188
$$ 5880052 5844309 5785098 5855302 5998861 6025984 5959819 5829439 5746652 5573211 5527838 5572026
11939E572026J49195m3777M2808N6715K2619Q4290J63181j00868K2391K7647k7153
$$ 5572026 5721221 5677444 5720252 5776967 5799586 5883876 6047057 5946189 5968580 5996227 5969074
11928E969074q1425q2967K7080q6780Q292K666l3034O1015J00909M3546k136J60610
$$ 5969074 5887649 5804682 5831762 5744982 5753274 5755940 5722906 5783921 5884830 5928376 5926240 6086850
11916F086850k6273r5088k2348l3566k9637L8928N8038o8815j26802L5962L3621
$$ 6086850 6060577 5965489 5943141 5909575 5879938 5918866 5976904 5908089 5781287 5817249 5850870
11905E850870j8299k897K0494q6861R190Q3652J12678N442k2023N2511j12188
$$ 5850870 5832571 5829674 5850168 5763307 5772497 5856149 5968827 5974269 5952246 6004757 5892569
11894E892569l3385J09127J45069j52580l3460P3546K806j4790m9778o8140Q2719
$$ 5892569 5859184 5968311 6113380 5960800 5927340 6000886 6003692 5988902 5939124 5870984 5953703
11883E953703j748j7649j85053q4434K05300K07929L6666j00894j74958k07900
$$ 5953703 5951955 5934306 5749253 5664819 5870119 6078048 6114714 6013820 5838862 5630962
11873E630962j64447J56800J70214Q2215k7730K34J01532J39221J6504j40531
$$ 5630962 5466515 5623315 5793529 5875744 5848014 5848248 5949780 6089001 6105505 5964974
11863E964974j89885j58308O2675j1949m0058l6570k5540M6063O3281r2877m5480
$$ 5964974 5775089 5616781 5679456 5667507 5627449 5590879 5565339 5611402 5674683 5581806 5536326
11852E536326P3319R0446j9042n7052N4366j56688k6369Q0045J1412l0573n2603
$$ 5536326 5609645 5700091 5681049 5623997 5678363 5521675 5495306 5575351 5586763 5556190 5503587
11841E503587m5721l6567n7633j31736L9877j1902l4958J9576k2292L3386K7108
$$ 5503587 5457866 5421299 5363666 5231930 5271807 5259905 5224947 5244523 5222231 5255617 5282725
11830E282725P9253R316R5114q6719j18789j6026l0178o1529j36642p8305j18886
$$ 5282725 5361978 5371294 5466408 5379689 5260900 5244874 5214696 5153167 5016525 4938220 4819334
11819D819334R947l2668J08234J28244J78406K3043q5761j42974r2376m4808P5610
$$ 4819334 4829281 4796613 4904847 5033091 5211497 5234540 5148779 5005805 4913429 4868621 4944231
11808D944231n0522J30543O4317m187n3437q3480m1313m9317j3635K28303q6493
$$ 4944231 4893709 5024252 5088569 5084382 5030945 4947465 4906152 4856835 4843200 5071503 4985010
11797D985010j71527N9337l2755o9693j68726n4971P4726P0031l0850J10195J21597
$$ 4985010 4813483 4872820 4840065 4770372 4601646 4546675 4621401 4691432 4660582 4770777 4892374
11786D892374j41168k936j48375N445J01057n0881m9121L7546q1495q7154l0931
$$ 4892374 4751206 4748270 4599895 4605340 4706397 4655516 4606395 4643941 4562446 4475292 4444361
11775D444361j01918j59482J5248R7258J63710Q4771k180O583k1097j6323N637
$$ 4444361 4342443 4182961 4198209 4295467 4459177 4543948 4541768 4548351 4527254 4510931 4516568
11764D516568j50814K6705j8259p632J01220m958m2741j65622O150l9401j03574
$$ 4516568 4365754 4392459 4374200 4366568 4467788 4462830 4420089 4254467 4260617 4221216 4117642
11753D117642J00454K4824n8266J7920j02225j31272l9283L613J53661j0922j63687
$$ 4117642 4218096 4242920 4184654 4202574 4100349 3969077 3929794 3933407 4087068 4076146 3912459
11742C912459j09659J4918P662K382j1174j53810n63R5427l6870p4964o3288n9923
$$ 3912459 3802800 3817718 3825380 3827762 3816588 3662778 3662215 3757642 3720772 3645808 3582520 3522597
11730C522597j4624q945J56623N3779l0069r032j37825m607K64230O0685j61465
$$ 3522597 3507973 3499028 3655651 3709430 3679361 3670329 3532504 3527897 3792127 3852812 3691347
11719C691347p6165j9210q1602m7014Q8001P8983j16821n9036k8294J4529J3368
$$ 3691347 3615182 3595972 3514370 3467356 3555357 3634340 3517519 3458483 3430189 3444718 3458086
11708C458086J01180J8949j47658J4056k2175J34641M0096j97656k6699j7077
$$ 3458086 3559266 3578215 3430557 3444613 3422438 3557079 3597175 3399519 3372820 3355743
11698C355743n1492K3303J20832P4855j17553k7935L3059q9384j58550j06323
$$ 3355743 3304251 3327554 3448386 3523241 3405688 3377753 3410812 3321428 3162878 3056555
11688C056555J65459N6217r9661n7617l8262r2152o8586J15068M4725r5524j7421
$$ 3056555 3222014 3278231 3178570 3120953 3082691 2990539 2921953 3037021 3081746 2986222 2968801
11677B968801o6188o0758K420J18680L3644L5897o1397j5418r5504p7009j58449
$$ 2968801 2902613 2841855 2844275 2962955 2996599 3032496 2971099 2955681 2860177 2783168 2624719
11666B624719k6566P3254J54864P9500L7191j31456J9697Q8705L744j04730q7844
$$ 2624719 2598153 2671407 2826271 2905771 2942962 2811506 2831203 2919908 2923652 2818922 2731078
11655B731078P0580J07978j1861p3601k19700l7391L3714j7079m3974r3318O3690
$$ 2731078 2801658 2909636 2897775 2824174 2604474 2567083 2600797 2583718 2539744 2446426 2510116
11644B510116J11109L0543q0412n5448o9765q9247L7750L068k1758p5518m5314
$$ 2510116 2621225 2651768 2571356 2515908 2446143 2356896 2394646 2397714 2375956 2300438 2255124
11633B255124J9646R2282P0675O2659R0292m1281J6730m7653R937L0291k7847
$$ 2255124 2274770 2367052 2437727 2500386 2590678 2549397 2566127 2518474 2528411 2558702 2530855
11622B530855o8135k15556R378O7100j55753M8499J55830J13788L30l4360q0200
$$ 2530855 2462720 2247164 2256542 2323642 2167889 2216388 2372218 2486006 2486336 2451976 2371776
11611B371776j8437J29428O7807j04703k4169n248N3235j60703j11990l8396K6160
$$ 2371776 2353339 2482767 2550574 2445871 2421702 2416454 2469689 2308986 2196996 2158600 2184760
11600B184760M0145o6386n1788N3426L515k748M6321j6261o3420Q9294n8915p5916
$$ 2184760 2224905 2158519 2106731 2160157 2163672 2160924 2207245 2190984 2127564 2216858 2157943 2082027
11588B082027l6915j1623N0710Q0414p1023O9246R9401q6228j18927n4625j3795
$$ 2082027 2045112 2033489 2084199 2164613 2093590 2162836 2262237 2176009 2057082 2002457 1988662
11577A988662j06509J26129o2674p2240j3195J376J30332q9595p4617o8712j16787
$$ 1988662 1882153 2008282 1945608 1873368 1860173 1861549 1991881 1902286 1827669 1758957 1642170
11566A642170N0711O499O2872O0466j8316J01882M4949N9972p8411j78261N6221
$$ 1642170 1692881 1699380 1762252 1822718 1804402 1906284 1951233 2011205 1932794 1754533 1810754
11555A810754J53777Q4587j55648k08292j48797q9861J6514P4727J44935j41821
$$ 1810754 1964531 2049118 1893470 1685178 1536381 1446520 1463034 1537761 1682696 1540875
11545A540875j8198j9155R5791R3482m3476j3966R4388Q1271q9297P1453r329
$$ 1540875 1522677 1503522 1599313 1692795 1649319 1635353 1729741 1811012 1721715 1793168 1783839
11534A783839k21572r884J08441J3783j51064q9663j28869L2985J35722J23019
$$ 1783839 1562267 1552383 1660824 1674607 1523543 1433880 1305011 1337996 1473718 1596737
11524A596737J09847Q837R907Q1842q6441j17622j33228j37421J4931q637J27388
$$ 1596737 1706584 1715421 1725328 1807170 1720729 1603107 1469879 1332458 1347389 1338752 1466140
11513A466140L4332j1518J846n6920J921J4673l743j28474j61422n0882O0667
$$ 1466140 1500472 1488954 1490800 1433880 1435801 1450474 1446731 1318257 1156835 1105953 1166620
11502A166620K346M3092n390J551L2774N7741P708P9473j7334J00658J17345m4302
$$ 1166620 1168966 1212058 1206668 1208219 1240993 1298734 1306442 1385915 1368581 1469239 1586584 1542282
11490A542282j92142r4223o2153Q5207J66146p1463n4115J32522O3394q1254j11343
$$ 1542282 1350140 1255917 1193764 1278971 1445117 1373654 1319539 1452061 1515455 1434201 1322858
11479A322858k0883n1628m7151k7725o4805Q4053J52809J7072j21195n0040J42974
$$ 1322858 1301975 1250347 1203196 1175471 1110666 1194719 1347528 1364600 1243405 1193365 1336339
11468A336339m7348o0807l1220r2604N9626M569N9037Q3714m7950l0407p1734
$$ 1336339 1288991 1228184 1196964 1104360 1163986 1168555 1227592 1311306 1263356 1232949 1161215
11457A161215j08475j04651j064J23847O4610l2624l660j33925N8865J48206M0789
$$ 1161215 1052740 948089 947025 1070872 1135482 1102858 1099198 965273 1024138 1172344 1213133
11446A213133J24464q0494q2681m3433K2525r7818K217j156l299L6330N8768P4766
$$ 1213133 1337597 1257103 1174422 1130989 1153514 1055696 1057913 1056757 1053458 1089788 1148556 1223322
11434A223322p8348k12818r9129k6267L8491K4464K2303j6829o2842J25051J67867
$$ 1223322 1144974 932156 833027 806760 845251 869715 892018 875189 812347 937398 1105265
11423A105265J37646N7459j78197L0809j02207q6990M3680p110j36444Q4565M8737
$$ 1105265 1242911 1300370 1122173 1152982 1050775 963785 1007465 1000355 863911 948476 997213
11412I97213n4150K1843J53290p1958n9153o822R5639j87600r2362j8940K5450
$$ 997213 943063 964906 1118196 1046238 987085 980263 1075902 888302 795940 777000 802450
11401H02450K3323L3537j34440K1273J97816J15816K0907J447n0996k50753K0446
$$ 802450 825773 859310 724870 746143 943959 1059775 1080682 1082129 1031133 780380 800826
11390H00826R3448O2092l0611n6447K3545J49431P7076r5371P3305m468l8853
$$ 800826 894274 956366 925755 869308 892853 1042284 1119360 1023989 1097294 1092826 1053973
11379A053973j21988l9383l8626j47720j20331j2057J4893J23523R5360l5295
$$ 1053973 931985 892602 853976 706256 585925 573868 588761 712284 807644 772349
11369G72349p1815J8369P118q2117L1879J13261R6925N9585q7502l1045n1362
$$ 772349 700534 718903 726021 643904 675783 789044 885969 945554 858052 827007 775645
11358G75645l1609M2767o8611m3209J4784K6849m8334J13877J80257j25874k8429
$$ 775645 744036 786803 718192 674983 689767 716616 668282 782159 962416 836542 808113
11347H08113M1830j04441j3606Q4600R2523q7507j55374p0588k1434p696M454
$$ 808113 849943 745502 731896 816496 909019 821512 666138 595550 574116 566420 570874
11336E70874p3356N2581K04534R4790q1281M5026M5158j13254N7225m0795j5769
$$ 570874 497518 550099 754633 849423 768142 813168 858326 745072 802297 761502 745733
11325G45733r9188j13431o4286j16545K7959j0683J50896J75239j1990m7949R6061
$$ 745733 646545 533114 468828 352283 380242 369559 520455 695694 683704 635755 731816
11314G31816R0609o600j13384N233n3306r1610M7033J49338o9637O1196K8183
$$ 731816 822425 815825 702441 707674 654368 562758 609791 759129 689492 750688 778871
11303G78871j71952k6708J15861q338k8710k0414Q8111k8651j43760K5640R7409
$$ 778871 606919 580211 696072 687734 659024 638610 726721 698070 554310 579950 677359
11292F77359q1464q3083j13806J40130J30086l391r0964l6713o9061m6781N2838
$$ 677359 595895 512812 399006 539136 669222 665831 574867 538154 469093 422312 475150
11281D75150M5706J05964K3297j17014j25740q0162K8333J04861K1327m2509k0068
$$ 475150 520856 626820 650117 533103 407363 327201 355534 460395 481722 439213 419145
11270D19145k4330J61829J24709n3863N693N5385P5774K2092q0771j20919m3474
$$ 419145 394815 556644 681353 627490 633183 688568 764342 786434 705663 584744 541270
11259E41270j03548P0745j9990K999N9851J16956p2804N615j05680M6341N7658
$$ 541270 437722 508467 488477 491476 551327 668283 595479 601094 495414 541755 599413
11248E99413J52427R4301j12877j2700J7330r3389j6246P636m8128R4513p2091
$$ 599413 751840 846141 733264 720564 737894 644505 628259 635895 587767 682280 610189
11237F10189q1991o5303l8937J18114o3254m1160P4885m978j16729j02941K8461
$$ 610189 528198 462895 423958 542072 478818 437658 512543 507565 390836 287895 316356
11226C16356p3228K4161J49250K41078M2044p3343j44628M1558N4180J60697n3925
$$ 316356 243128 267289 416539 657617 699661 626318 481690 523248 577428 738125 684200
11215F84200k24889m4429J22218J64298p6208j38361q2450M666K75Q1082n2211
$$ 684200 459311 414882 537100 701398 625190 486829 404379 409045 409320 490402 438191
11204D38191J60R4295k3250J78852J30336K5589L7165Q1261J08095L3988j56181
$$ 438191 438351 532646 509396 688248 818584 844173 881338 962599 1070694 1104682 948501
11193I48501j83931k5758p1488J16495o8936o1210k2184n6132o8415r1493k0770
$$ 948501 764570 738812 667324 783819 714883 653673 631489 575357 506942 415449 394679
11182C94679j4949l1845J00458K3241M1265Q717l6650k4326m3451k0220P0570
$$ 394679 379730 347885 448343 471584 512849 521566 484916 460590 417139 396919 467489
11171D67489K0802M1463J60622J74545p267q4659k02904j56352M7246R8077J22625
$$ 467489 488291 529754 690376 864921 857654 772995 570091 413739 460985 559062 681687
11160F81687J6734j08544j22640r2374J84152N1059j24285k9325L5461O515j44372
$$ 681687 698421 589877 467237 374863 559015 610074 485789 456464 491925 498440 354068
11149C54068j17846k4246j4208L290J23437J43892l1625j57108j46056J34641
$$ 354068 236222 211976 197768 201058 324495 468387 436762 279654 133598 268239
11139B68239M1014O4417J8930k3467p6556L7991P7922O838l0741p6914n304R217
$$ 268239 309253 373670 392600 369133 292577 330568 408490 415328 384587 307673 302369 311586
11127C11586J30708j07946p7836J74161M1153p5319J348o8625j2761O0527O3519
$$ 311586 442294 334348 256512 430673 471826 396507 397855 329230 316469 376996 440515
11116D40515J02891r244o1178K4580r7191j35408M8904P1012n7041j11703j4174
$$ 440515 543406 534162 472984 497564 400373 264965 313869 384881 327840 216137 201963
11105B01963M6568l5212p4450J35244P6038j2687k8282J05221M8656Q794j09331
$$ 201963 248531 213319 138869 274113 350151 337464 309182 414403 463059 471853 362522
11094C62522j27370R8848O0567k05186j21339n2495k4749k3657j6342Q3961O2373
$$ 362522 235152 334000 394567 189381 68042 15547 -9202 -32859 -49201 34760 97133
11083I7133m6298j7191M0928P6249n5980l5552J95266J79594n0564j69400q5277
$$ 97133 50835 33644 74572 150821 94841 59289 254555 434149 383585 214185 128908
11072A28908P1046K5087j00701o1925Q4425L7618j06054k4072k1039R0225J20072
$$ 128908 199954 225041 124340 62415 146840 184458 78404 54332 33293 123518 243590
11061B43590o475k0496J42181K162J68N9626k0983j10840p7861j9969J8142J7650
$$ 243590 237115 216619 358800 360962 361130 420756 399773 288933 211072 191103 209245 226895
11049B26895j1025J17115n4521p403J34883q463Q650o7570j14952Q2585J69047
$$ 226895 215870 332985 278464 271061 405944 397481 406131 338561 223609 306194 475241
11038D75241J17428J3109M7715M2027l6807J9979m0741J6590n7078J33557J18976
$$ 475241 592669 605778 653493 695520 658713 678692 637951 654541 597463 731020 849996
11027H49996J21578J03033n7988l7294N6324n6389n1538J13506j9702k349J3302
$$ 849996 971574 1074607 1016619 979325 1035649 979260 927722 1041228 1021526 1019177 1032479
11016A032479J54877L01953K1137k6263o0134j93487q0817j60983q5674j20651
$$ 1032479 1187356 1489309 1510446 1484183 1424049 1230562 1149745 988762 903088 782437
11006G82437l8389K48135J27361p052R4209j30758k05389o6949M2125O2425J43551
$$ 782437 744048 992183 1119544 1112492 1206701 1075943 870554 803605 845730 908155 1051706
10995A051706m1608j18517q8228L742j19273J508J98947j5690p2010j98781M1710
$$ 1051706 1010098 891581 803353 807095 687822 689330 888277 872587 800577 601796 643506
10984F43506j43399j18684K0774n7608q6014p2331L9895l6410m3698J64942J1485
$$ 643506 500107 381423 402197 344589 258575 186244 226139 189729 146031 310973 322458
10973C22458O89K1009M072j04287l8152J6284L6739n2659Q827K2441j00590O6887
$$ 322458 323147 344156 348228 243941 205789 222073 258812 206153 214980 237421 136831 203718
10961B03718P5975J20064m8785j25044j36181M385j0030Q2581J67360L9471n2117
$$ 203718 279693 399757 350972 225928 89747 94132 84102 166683 334043 373514 321397
10950C21397K01293J8951l7351R776J90159k1883j05157n3740j52262j31066j6929
$$ 321397 522690 541641 504290 514066 704225 682342 577185 523445 371183 240117 223188
10939B23188P0159J6885Q9222j425j57371l4057J18308K1589m3340j8692R9743
$$ 223188 293347 310232 399454 398029 240658 206601 324909 346498 303158 284466 384209
10928C84209j90058j81257J05416K29610J07532l2397J42861L00737K55401J41721
$$ 384209 194151 12894 118310 347920 455452 423055 565916 866653 1122054 1263775
10918A263775M0589R9974J34251N9101k14154k67551q9161j40758k39684o6531
$$ 1263775 1304364 1404338 1538589 1597690 1383536 1115985 1026824 886066 646382 579851
10908E79851K0205j39732j24496k00695q1502N9693p3978R3499J46378O2897o036
$$ 579851 600056 460324 335828 135133 53631 113324 39346 132845 279223 342120 336084
10897C36084j28408K6921K011o1585r021q6306o5258m2032o7014j9306J02838
$$ 336084 207676 234597 236608 175023 166002 79696 14438 -27594 -94608 -113914 -11076
10886a1076Q9847K2571m4372q6863o5773o2016N3046L3871r3199k4564M5914j7052
$$ -11076 78771 101342 56970 -29893 -95666 -157682 -104636 -70765 -163964 -188528 -142614 -159666
10874a59666m9195O3913J56020N0330N0519n3520j34792Q838K1594R2392K2195
$$ -159666 -208861 -144948 11072 61402 111921 58401 -76391 -67553 -45959 46433 68628
10863F8628k1825j4923K3783R8534J00622o7570M1372M7468n5053J12274n5238
$$ 68628 46803 31880 55663 154197 254819 187249 228621 276089 221036 333310 278072
10852B78072k6734q5543l7504J08247J31997K36r9048j10911j84633o3443M1121
$$ 278072 251338 165795 128291 236538 368535 368771 269723 158812 -25821 -89264 -48143
10841d8143Q0833k849n4627k0502P1742p6018R7113J12952l9870K2948j32817
$$ -48143 32690 29841 -24786 -45288 26454 -49564 47549 160501 120631 143579 10762
10830A0762N032r7750k9928R9786O2683K6810L8928j6262J32796l2389j15830
$$ 10762 15794 -81956 -111884 -12098 50585 77395 116323 100061 232857 200468 84638
10819H4638K0713Q8691j18753M1421L2078j26755r0252p2087O4031J19185M0115
$$ 84638 105351 194042 75289 116710 148788 22033 -68219 -140306 -76275 42910 83025
10808H3025j39995P44m0244j26721k2945J43592L3884j49647L3081J27467Q2705
$$ 83025 -56970 -56226 -96470 -223191 -246136 -102544 -68660 -218307 -185226 -57759 24946
10797B4946p0015r8759r4197J12808n4488K8348m1254p6284N6194J43368P901
$$ 24946 -45069 -143828 -238025 -125217 -179705 -151357 -192611 -268895 -212701 -69333 -61432
10786f1432p9147K8231M222k6298p3457L5861R3467O3263N9731K490j05583k9414
$$ -61432 -140579 -112348 -108126 -134424 -207881 -172020 -78553 -15290 44441 46931 -58652 -88066
10774h8066k1968J48104J30641M7895J03085R958k4486j51957m531l6184j48652
$$ -88066 -110034 38070 168711 216606 319691 329649 305163 153206 148675 112491 -36161
10763c6161r7301J46767O2469j00973r4098m3821J00951J09993J7964O057j79977
$$ -36161 -133462 13305 75774 -25199 -119297 -163118 -62167 47826 65790 71847 -108130
10752a08130j13021J2687L4191O2824P4629J415m6878k9447j5388l4983K857n9124
$$ -108130 -221151 -208464 -174273 -111449 -36820 -35405 -82283 -111730 -127118 -162101 -159244 -218368
10740b18368k9627L2823P8947j71855J06023P989q9036L3207j1222p4192M7220
$$ -218368 -247995 -215172 -136225 -308080 -202057 -194068 -283104 -249897 -261119 -335311 -288091
10729b88091J84055K32580n7545j52894p8536L132Q5759L0342j20178o1805l2096
$$ -288091 -104036 128544 70999 -81895 -160431 -157299 -71540 -41198 -161376 -223181 -255277
10718b55277K0497J09135O2230m057J08731O1891j41315n6971J58883J43277q4349
$$ -255277 -234780 -125645 -63415 -67472 41259 103150 -38165 -95136 63747 207024 122675
10707A22675j7075M3842p1730Q05l7883K3217j4217k4048p6030K4623l223r1401
$$ 122675 105600 149442 77712 78517 40634 63851 49634 25586 -50444 -25821 -29044 -120445
10695a20445M7750L9872o5855j2435J33519j49270j74225r6689K15411n7088p2521
$$ -120445 -72695 -32823 -98678 -111113 22406 -126864 -301089 -397778 -182367 -239455 -311976
10684c11976K451o3429k2002L7862R0785Q5468K1328J13667j05187j07909J093
$$ -311976 -309525 -372954 -394956 -357094 -266309 -180841 -159513 -45846 -151033 -258942 -257849
10673b57849N0161j9648p1930Q7529q4194o4725J06908J7705l9051r4383K38679
$$ -257849 -207688 -227336 -299266 -211737 -295931 -360656 -253748 -236043 -275094 -369477 -130798
10662a30798J67683m7557j152J11670R7667j7013o4346j1093R2039J4153k5332
$$ -130798 36885 -10672 -11824 99846 197513 180500 116154 105061 197100 211253 185921
10651A85921K01660J9958J57972J15421j42962J88K54348L0272R2017J02736J52457
$$ 185921 387581 407539 565511 680932 537970 538158 792506 822778 914795 1017531 1169988
10640A169988P1208N0975l7495r1253j86875k06595p4944J39690J95448L32463
$$ 1169988 1241196 1292171 1254676 1163423 976548 769953 695009 834699 1030147 1362610
10630A362610M31318N22766N36487O05338O04583N18344N17017N50545K05170
$$ 1362610 1793928 2316694 2853181 3458519 4063102 4581446 5098463 5649008 5854178
10621E854178M8742L69950O47302R09593J266740K131597K808281L872789N108313
$$ 5854178 5902920 6272870 6920172 7829765 9096505 11228102 14036383 17909172 23017485
10612B3017485O770437Q145259Q643084Q376312P402365O173103L697569L90780
$$ 23017485 29787922 37933181 46576265 54952577 62354942 68528045 72225614 72616394
10604G2616394j903572j224256J665428N884263J0697252J4974398J6784118J5532215
$$ 72616394 70712822 69488566 71153994 77038257 87735509 102709907 119494025 135026240
10596A35026240J3182281R676844K734017o351083j1049203r145678k841047M847478
$$ 135026240 148208521 157885365 160619382 154268299 143219096 134073418 131232371 136079849
10588A36079849J2682292J9149795K1330633J8510017J3717486P597637l296195
$$ 136079849 148762141 167911936 189242569 207752586 221470072 229067709 225771514
10581B25771514j6888070k3452283k0066525j2460710m428155K866663Q047420
$$ 225771514 208883444 185431161 165364636 152903926 148475771 151342434 159389854
10574A59389854R853195P854548M507515K8390p452527j5939383j9201812j6400039
$$ 159389854 169243049 177097597 181605112 181633502 174180975 158241592 139039780 122639741
10566A22639741j1086186n957904j840003O46582J380977O33878p96277k885876
$$ 122639741 111553555 105595651 103755648 104402230 105783207 106417085 105620808 102734932
10558A02734932o046638q982363j0111944r265038p287247n417414m544149l788802
$$ 102734932 96688294 87705931 77593987 68328949 61041702 55624288 51080139 47291337
10550D7291337k925346k398614j926116j577707j489677j405812j167433j106936
$$ 47291337 44365991 41967377 40041261 38463554 36973877 35568065 34400632 33293696
10542C3293696j020520o25127n05684n91650n68629j48140k0682j45370j80208
$$ 33293696 32273176 31648049 31142365 30550715 29982086 29833946 29813264 29667894 29487686
10533B9487686k86069l26245j83262Q429L13104N88361R59709J069114J745185
$$ 29487686 29201617 28875372 28692110 28700539 29013643 29602004 30561713 31630827 33376012
10524C3376012K218705L026562M238651O311994R432656J4370322K2584945L4125362
$$ 33376012 35594717 38621279 42859930 49171924 58604580 72974902 95559847 129685209
10516A29685209M4365890M4078425L2573184K3267225J5284091r652352m4602304
$$ 129685209 174051099 218129524 250702708 273969933 289254024 279601672 234999368
10509B34999368n4313296m1946173k7867716j8473804j2626085r249965p052041
$$ 234999368 180686072 138739899 110872183 92398379 79772294 70522329 63470288
10502F3470288n578949m617949l606425l114175k517707k061836j690658j389394
$$ 63470288 57891339 53273390 49666965 46552790 44035083 41973247 40282589 38893195
10494C8893195j198432j065287r75704q54392r04795q97281q84974r99940j169825
$$ 38893195 37694763 36629476 35653772 34799380 33894585 32997304 32112330 31112390 29942565
10485B9942565j115599j060170r06743r23651q42622p36597n33318o07637m21708
$$ 29942565 28826966 27766796 26860053 25936402 25093780 24357183 23823865 23216228 22794520
10476B2794520n64263n78490o56343n26316l13154l37561l88795m53348n03219
$$ 22794520 22230257 21651767 20995424 20469108 20155954 19818393 19429598 18976250 18473031
10467A8473031l87313m59985o02244l77944l25555l00095l89324l51491l12751
$$ 18473031 18085718 17625733 17023489 16645545 16319990 16019895 15630571 15279080 14966329
10458A4966329l29534l21302l36993l71074k30098j63399j92037k91858k18772
$$ 14966329 14636795 14315493 13978500 13607426 13377328 13213929 13021892 12730034 12511262
10449A2511262n6900k72369k65057k52898k33110k93318j09501q9022j94132j23184
$$ 12511262 12454362 12181993 11916936 11664038 11430928 11137610 11028109 10939087 10744955 10621771
10439A0621771l16128k79068k43041j76670j05373j89154k33147n8316o8100j27332
$$ 10621771 10305643 10026575 9783534 9606864 9501491 9312337 9079190 9020874 8952774 8825442
10429H825442m0955k05367j63693j58338k67122j65398p5574j22686j72634q4820
$$ 8825442 8784487 8579120 8415427 8257089 7989967 7824569 7748995 7626309 7453675 7368855
10419G368855q874K5458m8554j02973N9586j78369j58875r9107j2534j58896k76330
$$ 7368855 7359981 7385439 7336885 7233912 7293498 7115129 6956254 6857147 6844613 6685717 6409387
10408F409387p0306q5351j69858k39166n6971J766r2611k80467K090k348q6178
$$ 6409387 6339081 6253730 6083872 5844706 5787735 5789501 5696890 5416423 5418513 5416165 5329987
10397E329987k5903p0307k9846r4755j07873j69683q6680m7806l8295J1083m7897
$$ 5329987 5304084 5233777 5203931 5109176 5001303 4831620 4744940 4697134 4658839 4669922 4622025
10386D622025r7866j44095j85715j07517j5247O7280m940k8784j88971r9167j02679
$$ 4622025 4524159 4380064 4194349 4086832 4071585 4138865 4133925 4105141 3916170 3817003 3714324
10375C714324q3892j34930j25643J20365K8404l1196n7162m773j00408n6235j13312
$$ 3714324 3630432 3495502 3369859 3490224 3518628 3487432 3430270 3425497 3325089 3268854 3155542
10364C155542m4211M8216k5792j6630J70907Q2434j79750Q988L2367l7801j93803
$$ 3155542 3111331 3159547 3133755 3117125 3288032 3370466 3190716 3199704 3232071 3194270 3000467
10353C000467j61711o8361l3584q2533k2283L528p110R7482n1257j54718j03217
$$ 3000467 2838756 2770395 2736811 2654278 2631995 2635523 2628413 2725895 2674638 2519920 2416703
10342B416703N9885p4900j72653j09522K1158k4031o8390O834R9193p2417J9551
$$ 2416703 2476588 2401688 2229035 2119513 2140671 2116640 2048250 2055084 2154277 2081860 2101411
10331B101411R8412J08136k7625q0751j00752q2672m1653j44060p4215K41594
$$ 2101411 2199823 2307959 2280334 2199583 2098831 2016159 1974506 1830446 1756231 1997825
10321A997825k3828j72752q8066J86223K7829r1420J4747l996k87381J027K25596
$$ 1997825 1973997 1801245 1713179 1899402 1927231 1835811 1850558 1846562 1559181 1560208 1785804
10310A785804K00594k6496q5258n1050n6094k5819j16838j68740m3045p8673r7378
$$ 1785804 1986398 1959902 1874644 1823594 1767500 1741681 1624843 1456103 1413058 1334385 1237007
10299A237007P2530L0659p401J64153J01236L403j27550n4504n9348K5003L6749
$$ 1237007 1309537 1340196 1332795 1496948 1598184 1601587 1474037 1419533 1360185 1385188 1421937
10288A421937K9082R4321J2500j30526k50389q156K1841P5752k9897q3160r9608
$$ 1421937 1451019 1545340 1557840 1427314 1176925 1168769 1190610 1266362 1236465 1153305 1053697
10277A053697p003q2256N7016N7690l3107K2725k6851j773Q4639L8390O8791N704
$$ 1053697 1046694 964438 1021454 1079144 1046037 1068762 1041911 1040138 1124777 1163167 1231958 1237662
10265A237662k4454j38527m623k0989M3836m3992j60896m5394M7715L8048J28131
$$ 1237662 1213208 1074681 1070058 1049069 1092905 1048913 888017 842623 890338 928386 1056517
10254A056517j4809k08290o1880J78472N6797J4827K0281Q100l110l7137k8744
$$ 1056517 1041708 833418 771538 950010 1006807 1021634 1041915 1050015 1046905 1009768 981024
10243I81024j4083j82413j21574M3655o9069J20065Q5762l2807p101k6958j27313
$$ 981024 966941 784528 662954 706609 637540 757605 843367 810560 803459 776501 649188
10232F49188K1206M468O9348N0200J32862K8286p6671n3733m4147o2492p1144
$$ 649188 670394 674862 744210 794410 927272 955558 878887 825154 781007 718515 647371
10221F47371N2353N6376O4714k8653p1500K7557j5391o9132J5517N9685M401j49546
$$ 647371 699724 756100 820814 792161 720661 748218 732827 663695 679212 738897 743298 593752
10209E93752j2236K6318O0455Q5162j5761L2885p105o2195K0003L0850J357j106
$$ 593752 581516 607834 668289 753451 737690 770575 763470 701275 721278 752128 753485 752379
10197G52379m2554j20193k9095P5033o208q6023K0338k3619p0771J75289J03003
$$ 752379 709825 589632 560537 635570 629362 543339 563677 540058 469287 644576 747579
10186G47579j27221n2732J8751l2360n132j08619L1518M4752M4494K6344k0881
$$ 747579 620358 567626 586377 554017 548885 440266 471784 516536 561030 587374 566493
10175E66493O0271J31522K5185j47616j09679J58812J70897P0922L6619L9266
$$ 566493 626764 758286 783471 635855 526176 684988 855885 926807 963426 1002692
10165A002692K8341K8096J43024L6556k0960O4142O4860p2899P9662m4104m5454
$$ 1002692 1031033 1059129 1202153 1238709 1217749 1281891 1346751 1273852 1353514 1309410 1263956
10154A263956N4427n947J2786J42085O1818N0557J32059O1711M8746N644p5741
$$ 1263956 1318383 1312436 1325222 1467307 1529125 1579682 1711741 1773452 1822198 1827842 1752101
10143A752101k85687j92481q7706L6738Q3916L7023L030k0205l5547l5431n9004
$$ 1752101 1466414 1273933 1186227 1222965 1306881 1343904 1346934 1326729 1291182 1255751 1196747
10132A196747K9394l651p0080k36083k2900r243m3825L1624m0274R0110R4748
$$ 1196747 1226141 1222490 1152410 916327 893427 884184 840359 871983 831709 921819 1016567
10121A016567q4745J8227m1169j28658K887n7671j3596N8056m70r405n1063K4021
$$ 1016567 931822 950049 908880 780222 783109 725438 711842 769898 769428 760023 708960 732981
10109G32981J56365J20869J74026J69744K79723K12174N3614O1358k02484l84761
$$ 732981 889346 1010215 1184241 1353985 1633708 1845882 1899496 1960854 1758370 1373609
10099A373609k05473j38796k03839q3572J39658J1305j41961j66090J37363L6123
$$ 1373609 1168136 1029340 825501 741929 881587 892892 750931 584841 722204 758327
10089G58327q8220k1088m2668j23466r3315J05357N9469P258m6802n2984l3639
$$ 758327 670107 649019 606351 482885 389570 494927 554396 561654 514852 461868 428229
10078D28229q5660p9467M6232L3755k8547J03899O088o4766o9655J47171J10292
$$ 428229 342569 263102 309334 343089 314542 418441 424529 359763 290108 437279 547571
10067E47571J3755k1968k14732j02340J91347J79348o4698j04119k2435Q4709
$$ 547571 561326 539358 324626 222286 413633 592981 528283 424164 401729 486438
10057D86438k4161j03517n036o2764J37997Q9028r2448J4062Q6850Q1125J36504
$$ 486438 462277 358760 353724 290960 428957 517985 425537 439599 526449 607574 744078
10046G44078P1327q753k49053o7475J6664j46342j22811m9369R024l9210o9691
$$ 744078 815405 806652 557599 490124 506788 360446 237635 188266 197290 158080 88389
10035H8389M8442j7021Q6084O238m5218l2293r8712O2918m383q27q9819j57468
$$ 88389 136831 119810 205894 212132 166914 134621 35909 98827 94444 93617 3798 -153670
10023a53670J2248J51103L1922P4185J48101L8979O1800M9661k9316p6412l5375
$$ -153670 -141422 9681 41603 115788 263889 302868 364668 414329 385013 308601 273226
10012B73226M8442q1026o8461O7291n0685q0108J45616k2794o3433P7559N7317
$$ 273226 321668 240642 172181 239472 188787 108679 254295 231501 168068 245627 302944
10001C02944k7620j06185k3902J57597R5912J1357j01433k7296J50350k4320p5826
$$ 302944 275324 169139 145237 302834 398746 410103 308670 281374 431724 407404 331578
9990C31578k22682p5615J10433j47872q5821K57075K24213P0853N6087j35078
$$ 331578 108896 33281 143714 -4158 -89979 167096 391309 462162 518249 383171
9980C83171r6345J3687r0410j36924N0918N7064p5084j2350N5869J60365m1865
$$ 383171 286826 300513 210103 73179 124097 181161 106077 93727 149596 309961 268096
9969B68096k3757M4065J47175P9378o7677q2546j71614k0300J52501J7448N8780
$$ 268096 244339 288404 435579 514957 447280 364734 193120 172820 325321 342769 401549
9958D01549n4163K5621J05084j971J2358J09402j05537r0750q665q6738q5278
$$ 401549 347386 373007 478091 476120 488478 597880 492343 401593 392928 306190 220912
9947B20912q2444J4483K8254P7324o5392R4770j60933m9888R6539n1046P2632
$$ 220912 138468 152951 181205 258529 193137 287907 126974 77086 173625 122579 195211
9936A95211k6383o1823m8548J86855R9590j26829K9757R0500Q7454r0605J13273
$$ 195211 168828 107005 58457 245312 344902 218073 247830 338330 425784 335179 448452
9925D48452J20396k24275j52504m1797k821j03093P8057M2655J1777J27407j6464
$$ 448452 568848 344573 192069 150272 147451 44358 122415 165070 176847 304254 287790
9914B87790P1321q5689q4865j50816j23635O0646J84193Q8665P9299n8736m4607
$$ 287790 359111 273422 188557 37741 -85894 -25248 158945 247610 326909 268173 223566
9903B23566j06435N6384N6932o8376J83036m2636m1820j527q0765l0783R1428
$$ 223566 117131 173515 230447 162071 345107 302471 260651 259124 178359 147576 239004
9892B39004R8177j3622R1097j87391o0990p8902P0918J20176K0466R709O84P7822
$$ 239004 337181 323559 414656 227265 166275 87373 158291 278467 298933 308642 309326 387148
9880C87148r2700k7076p68P386r3785L4433K4647J43980m1772j13827l6352R524
$$ 387148 294448 267372 266604 273990 180205 214638 239285 383265 341493 227666 191314 200838
9868B00838Q5092K6083o8851j00282N9689K6259l8935r9564n5219k6240J48864
$$ 200838 285930 312013 243162 142880 202569 228828 189893 90329 35110 8870 157734
9857A57734K6749N7154o472j42165j89787J35303K41749M4027j00977q7607o4686
$$ 157734 184483 241637 235165 93000 -96787 38516 280265 324292 223315 135708 71022
9846G1022P6942O6560K4127K602r5576r5023J77035J26363l7467j63010J2293
$$ 71022 147964 214524 238651 241253 145677 50654 227689 354052 316585 153575 165868
9835A65868J02642n1091m7771o4194K9991R7600K7444p1314o523K5572n2725M2678
$$ 165868 268510 217419 169648 105454 135445 233045 260489 189175 182652 208224 155499 198177
9823A98177j5665j01196J21923L1665n157n8224m2072o0047q0896p6371O5168
$$ 198177 182512 81316 203239 234904 229747 171523 129451 69404 -11492 -87863 -22695
9812b2695r47k2654J03944K3939J15829Q7250J8007p0441r2510k9986O2575O4168
$$ -22695 -23642 -46296 57648 81587 197416 284666 302673 232232 139722 109736 172311 236479
9800B36479Q5781K0668P657O0236j6104j72297j76510J31209m75j3659j4545p834
$$ 236479 322260 342928 350585 410821 394717 222420 45910 177119 176644 162985 148440 140606
9788A40606J62308m5227j83211o2590J7775l4510J2604L3494K7789K7524m9225
$$ 140606 302914 257687 74476 11886 29661 -4849 7755 41249 69038 96562 47337
9777D7337n57j2721L9485p7921o9289J01334P8521j290l5457Q1733J24040r7255
$$ 47337 46780 34059 73544 -4377 -73666 27668 106189 104899 69442 151175 275215 177960
9765A77960N5J16281R1728k5055q1869k06877m5438J85711j5428r3971q7950O0602
$$ 177960 178015 294296 386024 360969 279100 72223 26785 212496 197068 103097 15147 75749
9753G5749j9806j18973R3127J396P7542J72351k854q2709n4601r3005P1498j50164
$$ 75749 55943 -63030 30097 31493 109035 281386 278532 195823 141222 48217 119715 -30449
9741c0449q4031m7437L0298J43523K56327J25615n4617q3967j2936q0672j03627
$$ -30449 -114480 -161917 -131619 11904 268231 393846 339229 255262 242326 161654 58027
9730E8027o641M0971J5916K2555o4516P3610K4174j76863r4213J53667l2176R8152
$$ 58027 51386 92357 108273 130828 66312 139922 164096 -12767 -106980 46687 14511 112663
9718A12663j4076L2601n6934O8958l4827k18032J424J22556m3617P4311r6789
$$ 112663 98587 131188 74254 143212 108385 -109647 -108223 14333 -29284 45027 -51762
9707e1762r3787J12207Q0513r9810k5032J22207K7090L2306L4336J4357l8128
$$ -51762 -145549 -33342 47171 -52639 -77671 44536 71626 103932 138268 152625 114497
9696A14497N638q535l3013J06242J5112r6204j07774l1040N2538L9243l0113M9500
$$ 114497 120135 111600 78587 184829 199941 103737 -4037 -35077 17461 56704 26591 76091
9684G6091J741l737j6493P542j3565r5098K2650j8029j09650j11858m6543K00658
$$ 76091 77832 74095 57602 65144 51579 -43519 -20869 -38898 -148548 -260406 -306949 -106291
9672a06291P8963L7282L9305J477O89r8062k3037L6389J71968J32922m0821j7989
$$ -106291 -27328 9954 49259 50736 51425 -46637 -69674 -33285 138683 271605 230784 212795
9660B12795O9660l4852l7550p9096R3845n8667N3698J44642L7925K482m1399l0392
$$ 212795 282455 247603 210053 130957 224802 166135 219833 364475 402400 404882 363483 333091
9648C33091K422J16823K18416K58581o5603l34287j35059l7755n0589j33523k7404
$$ 333091 335513 452336 670752 929333 863730 529443 394384 356629 306040 172517 145113
9637A45113R7739K8490o4955k5240Q1319n261K1818j77059n9672K9061j334j4280
$$ 145113 242852 271342 206387 181147 262466 257205 279023 101964 42292 71353 70019 55739
9625E5739j4162l7860K2177l0187L0469j9721r459L2999J3294J41527J66488L2227
$$ 55739 41577 3717 25894 -4293 26176 6455 -3004 29995 43289 184816 351304 383531
9613C83531L2099R7082j07895j20620O5218K9908j92469o5407n8472N9113N0969
$$ 383531 415630 512712 404817 284197 349415 379323 186854 121447 62975 122088 173057
9602A73057N7427N1069O9928m3552j10075Q964n6185M4049l7491k7221q3426q7380
$$ 173057 230484 281553 351481 307929 197854 206818 150633 194682 157191 129970 46544 -40836
9590d0836m4428j03364l8697R1320K88588J00785q7408L881k6675P7401R3199
$$ -40836 -85264 -188628 -227325 -136005 152583 253368 165960 169841 143166 220567 313766
9579C13766k85341j32927n2174n1494M3877P9739j4519j7078J62293J34743K9415
$$ 313766 28425 -104502 -156676 -208170 -164293 -84554 -99073 -116151 46142 180885 210300
9568B10300P0711P2796Q2694j25415l2539j03513O4711J41973p4028j02462j2195
$$ 210300 281011 353807 436501 311086 278547 175034 239745 381718 307690 205228 193033
9557A93033J00278n5458o8730k53M7217n781K690J8777j29798Q480J83456n7430
$$ 193033 293311 237853 169123 168870 216087 210306 212996 231773 101975 110455 293911 236481
9545B36481j42828l0717J43563O552q5366m2957M0936n2303K4842J80349J28658
$$ 236481 93653 62936 206499 213051 127685 84728 125664 73361 98203 278552 407210
9534D07210k5612k9531k5066p1546j57524J03074o657j51000q6418n3268q466
$$ 407210 381598 352067 327001 255455 97931 201005 194348 43348 -43070 -96338 -104804
9523a04804p6458j4947J3759J20227J6333K0615j7870q9992J4265J09302Q0775
$$ -104804 -181262 -196209 -182450 -62223 -45890 -25275 -43145 -133137 -118872 -9570 71205
9512G1205Q9858N3059J5233o679o9M4289p1999j005K8185O936j48201M7549l1009
$$ 71205 161063 214122 229355 222676 222607 266896 194897 193892 222077 229013 80812 128361 97352
9499I7352J33352O6077Q4349M1598j52797j51285l5914j2835J87239N492j77122
$$ 97352 230704 296781 381130 422728 269931 118646 82732 69897 257136 262628 85506
9488H5506O471P0631P9833p7763j17406J24789j7876j16704p1281N0480k7227
$$ 85506 91977 162608 242441 164678 47272 172061 154185 37481 -33800 16680 -10547
9477a0547j7242M2412j135J09738L3861j15419p9429R7219N3256k5406l8903n7422
$$ -10547 -27789 14623 13488 123226 157087 41668 -37761 59458 112714 87308 48405 -9017
9465i017k5377p3203L5368K06548J1005p3576j47652l144J14139k3053j52705
$$ -9017 -34394 -107597 -72229 134319 145324 71748 -75904 -79048 35091 12038 -140667
9454a40667l1000l691j8441O1740J18305L6388R2142n9365P4457p5586j7097J23325
$$ -140667 -171667 -175358 -193799 -132059 -13754 22634 114776 55411 129868 54282 37185 160510
9442A60510j8484j72455j11517q3359j12646l9736Q4430J38402L4975M9726J51066
$$ 160510 142026 -30429 -141946 -225305 -337951 -377687 -293257 -154855 -119880 -70154 80912
9431H0912J01094M1876J1785O030q3239n2570n4199L8818L5104o3366r2671K3360
$$ 80912 182006 223882 235667 241697 158458 105888 51689 90507 125611 62245 -30426 -7066
9419g066l0375P4011q3375m8645l9317l2849q7085N4915J92584l2947j9571L6631
$$ -7066 -37441 36570 -46805 -95450 -134767 -167616 -254701 -199786 -7202 -40149 -59720 -23089
9407b3089n6929r5386J8271N7227K05290m0541j37141k5409O9021j1440l5216
$$ -23089 -80018 -175404 -157133 -99906 105384 64843 -72298 -97707 -28686 -40126 -75342
9396g5342j2045p6245O8526K28610q7031j19049m4733J00102J09436P5220K0416
$$ -75342 -87387 -163632 -95106 133504 46473 -72576 -117309 -17207 92229 167449 187865
9385A87865m1957k4479k8336p5783k2265N0273N7842J57981o0621j25246q9247
$$ 187865 145908 121429 93093 17310 -4955 45318 103160 261141 200520 75274 -13973
9374a3973q7133M1901l1178M4002L2014k0182l8734j39353o6954J45683J16487
$$ -13973 -101106 -59205 -90383 -46381 -14367 -34549 -73283 -212636 -279590 -133907 -17420
9363a7420m2119N103P2760K2882Q5016L6686R667p1779p3974J19041J53339q997
$$ -17420 -59539 -54436 18324 41206 126222 162908 172575 100796 26822 145863 299202 290205
9351B90205q0179k5975j75416p075Q6369j24811m5806J02104k0456q0121R7671
$$ 290205 210026 184051 8635 1560 87929 -36882 -82688 19416 -1040 -81161 16510
9340A6510N4889k1347j09544J35983j5404k58431K96J29151J07005M0130j25943
$$ 16510 71399 50052 -59492 76491 61087 -197344 -197048 -67897 39108 79238 -46705
9329d6705O8813k6885o5415J32149k6051K187o805j9383J66036N906p3923K9785
$$ -46705 22108 -4777 -70192 61957 35906 38093 31288 11905 177941 183847 109924 139709
9317A39709j07669p6990m1577r1184R1372L2750m4139J45325O3097j4660M5877
$$ 139709 32040 -44950 -86527 -177711 -86339 -53589 -97728 47597 110694 96034 141911
9306A41911L8121j48174p7199R1043n9936J0125n235J37773J01350l7421j46513
$$ 141911 180032 31858 -45341 45702 -14234 -4109 -9344 128429 229779 192358 45845
9295D5845j86711O1895J07406J32359m4284j58296r292p8808O780J9938P4300
$$ 45845 -140866 -78971 28435 160794 116510 -41786 -51078 -129886 -123106 -103168 -28868
9284b8868Q2063m1318m5942K3562q6678n1071J17413J22549l6071l3649m2153
$$ -28868 53195 11877 -34065 -10503 -97181 -148252 -30839 91710 55639 21990 -20163
9273b0163J20598q9767K9123L6790l2764J60778K2456j68635M1950J24670o3213
$$ -20163 100435 10668 39791 76581 43817 204595 227051 58416 100366 225036 161823
9262A61823j35891J74720J08298l8525q6102p1499J6464l3745q9854q6138l9938
$$ 161823 25932 200652 308950 270425 184323 112824 129288 95543 5689 -80449 -120387
9251a20387J46374J3292Q047J36795l3651o7986n9416J14719J38473o543j23484
$$ -120387 25987 39279 47326 184121 150470 82484 23068 137787 276260 269717 146233
9240A46233r1585l2142j30186Q5638N9575p0637M6835Q1829p536j445p2539r5425
$$ 146233 54648 22506 -107680 -22042 37533 -33104 13731 95560 88024 86579 14040 -81385
9228h1385p9651Q7724M0678J4956q6052r512P5903Q2075P3265j20666L3817o9330
$$ -81385 -161036 -73312 -32634 -17678 -103730 -113242 -37339 44736 118001 -2665 31152 -38178
9216c8178k7546m0090J7016M5060o1822j55930J10707P8503P5050M0281J62955
$$ -38178 -65724 -105814 -88798 -43738 -105560 -261490 -150783 -72280 2770 43051 206006
9205B06006P2230p6512j28915o0220K8332J6742J82784J5997j44846j79522J0298
$$ 206006 278236 201724 72809 12589 40921 57663 240447 256444 111598 -67924 -57626
9194e7626J40567J55705n7838j69475R776R0309J43149q6498j14103R5377j11481
$$ -57626 82941 238646 180808 11333 21109 111418 254567 168069 53966 149343 37862
9183C7862l5680O3739j06688m6242q872N4505J11639J29240N0786j7011O3044
$$ 37862 2182 65921 -40767 -87009 -95881 -41376 70263 199503 250289 233278 296322
9172B96322q1515r1673k11310J11294J26117n0570n1694R8192J13795j42564r8259
$$ 296322 214807 123134 -88176 23118 149235 98665 46971 145163 258958 116394 18135
9161A8135j13922Q0545J89019J07202K31n3462M7099J15982j20308k19922p0133
$$ 18135 -95787 -15242 173777 280979 281210 227748 274847 390829 270521 50599 -19534
9150a9534J03608r601o9807J18269J50271K0956q9193L8847J00334J4367p5074
$$ -19534 84074 74473 4666 122935 273206 294162 204969 243816 344150 358517 283443
9139B83443l6892Q1850k3819j57421j30194l1791J43274J3482L585l8881n126
$$ 283443 246551 328401 304582 147161 16967 -14824 128450 141932 145517 106636 101510
9128A01510N3117N5165m87n1606J8188m3835p9452j7297o1154q6519l4231O9482
$$ 101510 154627 209792 209305 157699 175887 132052 52600 35303 -25851 -112370 -146601 -77119
9116g7119J7588n5995J86883P0764o3359j29636r9615m9148j0098m5938R914J61950
$$ -77119 -59531 -115526 71357 142121 78762 -50874 -150489 -199637 -209735 -255673 -245759 -83809
9104h3809M6709o3747J04078P1096K2315j89983j27341m1259J06575j4516J88195
$$ -83809 -37100 -100847 3231 74327 96642 -93341 -220682 -261941 -155366 -169882 18313
9093A8313J70447J0223q6464k3986n1737k3174K29444J17061q8360n1126j03131
$$ 18313 188760 198983 112519 88533 36796 13622 243066 360127 271767 220641 117510
9082A17510O9105j67416q4884J87335J34569p6795n5222j12543k4597R9461N3239
$$ 117510 186615 19199 -65685 121650 256219 179424 124202 11659 -12938 86523 139762
9071A39762q356R4824K11247k4425j2924m8914j56042j61326r1983j63695P53
$$ 139762 131406 226230 437477 413052 400128 351214 195172 33846 -58137 -221832 -221079
9060b21079P558l4o6566N4965J77093R330R9541j8253J00589K8843o9043j23876
$$ -221079 -213521 -213555 -280121 -225156 -48063 -38733 60808 42555 143144 171987 102944 -20932
9048b0932j47716n0012J52984J11201p5358r60K4036r31j72818J5872O4060J2297
$$ -20932 -168648 -218660 -65676 45525 -29833 -30793 -6757 -7688 -180506 -164634 -100574 -88277
9036h8277j0227O1165J6589q2180o0599J40141K1438q7012j52931j89470K39621
$$ -88277 -98504 -37339 -20750 -102930 -163529 -23388 -1950 -88962 -241893 -431363 -191742
9025a91742J96229K6002n2002q6679j3234j4032K8845N8059J54681J46453M5045
$$ -191742 4487 30489 -21513 -108192 -121426 -135458 -106613 -48554 106127 252580 297625
9014B97625p9255j64952l6542j20303k9531q9856r1019L6887K65802J26851P5095
$$ 297625 218370 53418 16876 -103427 -132958 -222814 -313833 -276946 -11144 115707 190802
9003A90802m1567K8436j3359j25537j43749J00204J31790P2949j5406J2940J17537
$$ 190802 149235 177671 164312 38775 -104974 -4770 127020 199969 184563 197503 315040
8992C15040j18712j18200K0810j5848q0628K1084L647O6024J8912j21229M7061
$$ 315040 196328 78128 98938 83090 2462 23546 27193 93217 112129 -9100 37961
8981C7961k8395p7291j40356o6720J68045M3191q0939R7507J06775p5347j02896
$$ 37961 9566 -67725 -208081 -274801 -106756 -63565 -144504 -46997 59778 -15569 -118465
8970a18465J49364O5675m5020K2951m6485L059m5033n7442n5380J3727M2833N0633
$$ -118465 30899 96574 51554 74505 28020 31079 -13954 -71396 -126776 -113049 -70216 -19583
8958a9583l6673k4480o158Q3153k0143q1641j76637o1907M667J10627J29826M2347
$$ -19583 -56256 -80736 -86894 -3741 -23884 -105525 -282162 -344069 -339402 -228775 -98949 -56602
8946e6602M514k691Q9804m4338j29289N4621o0843p4231m0167L5911K04023N3110
$$ -56602 -52088 -54779 35025 -9313 -138602 -83981 -144824 -219055 -259222 -223311 -19288 33822
8934C3822P3853k5380n3708j19062j4374J3146J1807n0238j173J90532J9586j6820
$$ 33822 107675 82295 28587 -90475 -104849 -91703 -79896 -130134 -131307 59225 78811 61991
8922F1991j4324L0893J201L8799N0420j18064j57073o1690P9812J74077Q4495
$$ 61991 47667 78560 79761 118560 168980 50916 -106157 -167847 -88035 86042 170537
8911A70537o1067j4511l4484J588o8774j64207J1225K7282N9030p6960n4165L7061
$$ 170537 109470 94959 60475 62063 -6711 -170918 -159693 -132411 -73381 -150341 -204506 -167445
8899a67445M3919J13352r0650p8684j1199J19472j0847N5746Q1713L0699M1456
$$ -167445 -123526 -10174 -100824 -179508 -190707 -71235 -82082 -26336 55377 86076 127532
8888A27532k7491j40753R6247J60267M3881p5879k3432O612m7348M4794M7079
$$ 127532 100041 -40712 55535 215802 259683 183804 160372 166984 119636 164430 211509
8877B11509q0694n1856j41650m81N4372O3448R4342N5280l1919j08854q7535O9060
$$ 211509 130815 78959 -62691 -63172 -8800 54648 148990 204270 172351 63497 -24038 45022
8865D5022l0274o3732J37080R5281q3907n6992k2683k1455L1503j24508l1092
$$ 45022 14748 -48984 88096 183377 99470 42478 19795 -1660 29843 -94665 -125757
8854a25757J13704J66401Q6046l5759p5712p7664j35291J18474P7016m1826p4710
$$ -125757 -12053 154348 240394 204635 128923 51259 -84032 34442 111458 69632 -5078
8843e078j2237R5533r4616P600J17653j49206l9926m253m338J22609P7052J4882
$$ -5078 -17315 78218 -16398 -8798 108855 -40351 -80277 -84530 -88868 33741 110793 125675
8831A25675J8346j92860n7137J8169n2866P3814R8293L4225r9983j8624j42488
$$ 125675 144021 -48839 -105976 -87807 -140673 -66859 31434 65659 -34324 -52948 -195436
8820a95436J8367K1024N3262j790Q695M0109R624o8157l2602K517L3799J44661
$$ -195436 -177069 -156045 -102783 -104573 -95878 -55769 -46145 -114302 -146904 -144387 -110588 34073
8808C4073j08540k7474M5150l936m1488O0380P1356j14998l1973o9935J28233
$$ 34073 -74467 -101941 -56791 -60727 -102215 -41835 29521 -85477 -117450 -187385 -59152
8797e9152J94426R2078j21430K8139j1997p1851q7825M5138Q6161R7622J47740
$$ -59152 135274 227352 105922 134061 122064 50213 -37612 7526 93687 191309 339049
8786C39049N7228r6017m4883l1142n0381p2221q1945j33119j26545O4692O6441
$$ 339049 396277 300260 255377 224235 173854 101633 19688 -113431 -239976 -175284 -108843
8775a08843N806K2788K9599j23436J03625J03433j62914j77120q1768J4937J80887
$$ -108843 -103037 -80249 -50650 -174086 -70461 32972 -129942 -307062 -388830 -373893 -193006
8764a93006J87330p9909n5011J70113Q8638n9501p7047M0193M4436n3825K4830
$$ -193006 -5676 -85585 -140596 29517 118155 58654 -18393 21800 66236 12411 37241
8753C7241J02137R604j40946j13396N2904L1344P961P4382J25881J5300J1934
$$ 37241 139378 148982 8036 -105360 -52456 -21112 -13151 61231 187112 202412 214346
8742B14346m972M6733r9736o1735o6668P7680J30421J9357j06416j61552o4322
$$ 214346 209374 256107 156371 94636 27968 105648 236069 255426 149010 -12542 -76864
8731g6864J62370O5657o8882R5327j11179K9969Q7765q7831m1945J35137Q7741
$$ -76864 85506 151163 82281 177608 66429 96398 184163 96332 54387 189524 277265
8720B77265q0582o8510P0673o759j27302n6467K2410k0948R128l4850P3739J9765
$$ 277265 196683 128173 198846 192087 64785 8318 30728 9780 18908 -15942 57797 77562
8708G7562n5918p2267P7883q6076N8919R4912r8470M6371R2634k2888j41736n545
$$ 77562 21644 -50623 27260 -58816 103 95015 -3455 42916 135550 112662 -29074 -34619
8696c4619R7911M6434p2973n245P0942j3128O3057J47743m6700j06087j67303
$$ -34619 63292 109726 36753 31508 102450 89322 152379 300122 253422 147335 -19968
8685a9968j0430P3241J47204n5970j47911l4693L2733L7644R2118L3709j09189
$$ -19968 -30398 42843 190047 134077 -13834 -48527 -15794 21850 113968 147677 38488
8674C8488O9235Q572o2163J04582l4069J450p7864p4691J8828n0961L2224J43370
$$ 38488 107723 116295 54132 158714 124645 126095 48231 -26460 -7632 -58593 -26369 117001
8662A17001l0299m6322N7331o6662q5487o5976P7287P7777N8262K9011J6421j29433
$$ 117001 86702 40380 97711 31049 -54438 -120414 -43127 34650 92912 121923 138344 8911
8650H911m0104j52683N0876P9256P5135J9828o3114K6984J9523n9423J222q6121
$$ 8911 -31193 -183876 -133000 -53744 21391 41219 -21895 5089 24612 -34811 -33589 -119710
8638a19710Q3587Q6950L1301N2676j04751j26013j26311R059J55724J67624n5502
$$ -119710 -36123 50827 82128 134804 30053 -95960 -222271 -213212 -57488 110136 54634
8627E4634K9510j2806j39114r0723p982M2472J3440q9678n2503K6923J4193m0835
$$ 54634 84144 71338 -67776 -158499 -166481 -124009 -110569 -200247 -252750 -225827 -211634 -252469
8615b52469M2521Q1730j1086Q7585P7695k1848r7094P5225O2607Q209n9136j666
$$ -252469 -209948 -128218 -139304 -51719 25976 4128 -92966 -17741 44866 53075 -6061 -7727
8603g727J55626P5348k9965N112j37059l1012m6285n8653Q2529Q1514k4567o0379
$$ -7727 147899 223247 193282 198394 61335 30323 -15962 -74615 7914 89428 64861 4482
8591D482R5944M1081l7264O0457j8243m935L0125J26503J2911q3925l3016P7809
$$ 4482 100426 141507 104243 164700 146457 141522 171647 298150 311061 227136 194120 271929
8579B71929j08334j15402J4472K9273J46043L5525p312O300l0694p2197n9750
$$ 271929 163595 48193 62665 91938 237981 273506 266194 272494 241800 169603 109853
8568A09853p2228q2542R5514R8910l7194L6827K0149k6238J4014j04297j02663
$$ 109853 37625 -44917 50597 149507 112313 149140 169289 143051 157065 52768 -49895
8557d9895j70445j5116K02888K6372m1407J0665j8860O0130p0021k4303M3850
$$ -49895 -220340 -235456 -32568 -6196 -47603 -36938 -55798 4332 -65689 -89992 -46142
8546d6142J00061J5620N9339j1562J30525n6263j83196j20225Q2131L5654p8411
$$ -46142 53919 69539 128878 117316 247841 191578 8382 -111843 -29712 5942 -72469
8535g2469M4349k2857Q0397L0998L6668L4203n2875n0996m175K6252J3024j94996
$$ -72469 -28120 -50977 29420 60418 97086 131289 78414 27418 23243 49495 62519 -132477
8523a32477r0127J32314J00912J77562J33141p2176j01476r2542j3020j07742
$$ -132477 -222604 -90290 10622 188184 321325 249149 147673 55131 42111 -65631
8513f5631j9853n2601m9459N8765m6004Q3159J15386m1525o3093J21694O3910
$$ -65631 -85484 -138085 -187544 -128779 -174783 -91624 23762 -17763 -80856 40838 104748
8502A04748L659k1167j62868Q0729J21176j7890p9592p1549r593J58769j2654
$$ 104748 108407 87240 -75628 5101 126277 108387 28795 -42754 -52347 106422 93768
8491I3768l5497K5889o4362j34312m2353r1746p4362J47731J13949M3978j07169
$$ 93768 58271 84160 19798 -114514 -156867 -248613 -322975 -175244 -61295 -17317 -124486
8480a24486p1207P4937k0782m7999J2563n602L7732M1966n5198Q4520N8845M8090
$$ -124486 -195693 -120756 -141538 -189537 -176974 -182576 -144844 -102878 -158076 -73556 -14711 33379
8468C3379o0607n7602o3265k187P5544K0086J1878L5955N5888m1098O9154P8543
$$ 33379 -27228 -84830 -148095 -150282 -74738 -54652 -42774 -6819 49069 7971 77125 155668
8456A55668N8383M5250K4769j02446l7777j15642j86950K8320J93285J2005p3499
$$ 155668 214051 259301 284070 181624 143847 28205 -158745 -130425 62860 74865 1366
8445A366j45426M9652O7835l857k6625P6364O8702J787J4702j7069k3938j65800
$$ 1366 -144060 -94408 -26573 -30430 -57055 19309 88011 89798 104500 87431 63493 -102307
8433a02307o533J71341j28705j13091K2668O6202J88983K6727j45412K2757J08322
$$ -102307 -108840 62501 -66204 -179295 -156627 -90425 98558 125285 -20127 2630 110952
8422A10952k888p9315m2693R0414j2820O9253j0442P405j90315o5672J44273J28110
$$ 110952 108064 28749 -13944 76470 63650 132903 122461 129866 -60449 -126121 18152 146262
8410A46262L6048l3259k7796o8375j55262k9994P6967L0773J3992J0880J0558
$$ 146262 182310 149051 121255 52880 -102382 -132376 -55409 -24636 -10644 236 10794
8399A0794j42892j15555K4007O6960j6420J47638J96765R2755r8181J6155L5145
$$ 10794 -132098 -247653 -223646 -156686 -173106 -25468 171297 264052 165871 182026 217171
8388B17171q5800o9993l372n8999k6119L3354M717k7246p684j3379O2906n5862
$$ 217171 131371 61378 58006 -993 -27112 6242 10959 -16287 -23971 -37350 25556 -30306
8376c0306o3431L5783L4198o3895n9360j61330O1735J79872J30070J6417J08312
$$ -30306 -93737 -57954 -23756 -87651 -147011 -308341 -246606 -66734 63336 79753 188065
8365A88065p3763k09474k6542o2838J57975N1151k3296n9318j71931j14235n9197
$$ 188065 114302 -95172 -121714 -184552 -26577 24574 1278 -58040 -229971 -344206 -403403
8354d03403J19984N2458R587J57927L6597J26480j23776j83904N7307M7294K00498
$$ -403403 -283419 -230961 -221374 -63447 -26850 99630 -24146 -208050 -150743 -103449 97049
8343I7049R9425m3919q2329M6857P9822k5324p7880j54368p0453L4479R0635j56172
$$ 97049 196474 152555 70226 117083 196905 171581 93701 -60667 -131120 -96641 -6006 -162178
8331a62178M8865P7304K0197J62383J7060k7297n4555J3880p0568L9191n9756
$$ -162178 -113313 -36009 -15812 146571 163631 136334 81779 95659 25091 64282 4526
8320D526j22485P925Q5487J27612L8969o4602j4696M5379j0031k0051Q9419J763
$$ 4526 -117959 -110034 -24547 103065 142034 77432 62736 108115 98084 78033 167452 169215
8308A69215r4611K4826j6630o7599m5302O7338n7213m7755J2245O9037j5204n7605
$$ 169215 74604 99430 82800 15201 -30101 37237 -19976 -67731 -55486 13551 -1653 -59258
8296e9258k9129r2044K2864J48457Q6243J06803l5440K852P0408R4652J54691
$$ -59258 -88387 -180431 -157567 -9110 77133 183936 148496 151348 221756 316408 471099
8285D71099J85772J68429L09835J38878l68017l32267r9914l07331j04737J8923
$$ 471099 656871 825300 1135135 1274013 905996 573729 473815 166484 61747 80670
8275H0670J35372j02610l3069J31298j16194J0651Q5559p1746M785o180q5437
$$ 80670 216042 113432 80363 211661 95467 106118 191677 119931 124716 118536 33099
8264C3099O7419P6999n4520j61663L4253k8946o6577N4808K67p768L7895Q6275
$$ 33099 100518 177517 122997 -38666 -4413 -33359 -99936 -45128 -44861 -52629 -14734 71541
8252G1541J34657o2970l2558J13009J97966O4080K8620J45860R9588O489k87794
$$ 71541 206198 143228 110670 223679 421645 485725 514345 660205 759793 766282 478488
8241D78488k45048k08174k5995N420J1319J01559q8521r902J01015K9930j36058
$$ 478488 233440 25266 -729 4691 16010 117569 29048 19146 120161 150091 14033
8230A4033P158k0292p9144J19606O6260N9583Q6197m540l087k44995q1562M5422
$$ 14033 21191 899 -78245 41361 107621 167204 253401 248861 245774 779 -80783 -35361
8218c5361J27190P9119o8380m1915l2353L3624J0291L5399j05253j7394J52808
$$ -35361 91829 170948 102568 60653 28300 61924 72215 107614 2361 -15033 137775
8207A37775k7042j74771j04706q4200N158L0249O1510k3372Q6636K3143P5652
$$ 137775 110733 -64038 -168744 -252944 -247786 -217537 -156027 -179399 -92763 -69620 6032
8196F032P4091k3188p199r2376p6623m1167O1233O8309N453j563K8939P6964l4127
$$ 6032 80123 56935 49736 -42640 -119263 -160430 -99197 -30888 -25435 -26998 1941 78905 44778
8183D4778J99560j0324j30719J5158P4039L677j8100m4620q2713j65102k9385
$$ 44778 244338 234014 103295 118453 192492 196169 178069 133449 50736 -114366 -143751
8172a43751J4727O0388L7453N4969p1085p5359o8953J11906j731j37333k3818
$$ -143751 -129024 -68636 -31183 23786 -47299 -122658 -191611 -79705 -81436 -218769 -242587
8161b42587J10681R1485J11828J20619J7866p2635m5099o7725n3282q375J01099
$$ -242587 -131906 -40421 71407 192026 209892 137257 92158 24433 -28849 -37224 63875
8150F3875K19992k6079j42657J0842j32212l5415j8175Q811j09847L8176M5261
$$ 63875 283867 257788 115131 125973 -6239 -41654 -59829 -51018 -160865 -122689 -77428
8139g7428J04232L9950K9252N1746j25555K2322k3142p4708j86972P3174J69054
$$ -77428 26804 66754 96006 147752 22197 44519 21377 -53331 -240303 -167129 1925
8128A925K06638q6253j38872M713n7558n2723j05989k0064R8061J64885J13473
$$ 1925 208563 122310 -16562 -11849 -69407 -122130 -228119 -248183 -150122 14763 128236
8117A28236K6199J0963j27332j58341n5266p5217Q1636J37611k8140o38j6854
$$ 128236 154435 165398 38066 -120275 -175541 -250758 -169122 -31511 -59651 -60289 -77143
8106g7143q928o8824P4563J17063n4962r9947n983K9060N5825M1966p5463J8045
$$ -77143 -86071 -154895 -80332 36731 -18231 -118178 -124161 -95101 -39276 2690 -72773 -54728
8094e4728l9109l866k1791L0117J61601J8215j76472j05596P4619O0701R2854
$$ -54728 -93837 -97703 -119494 -89377 72224 90439 -86033 -191629 -117010 -56309 36545
8083C6545o3113J34156O8292j6714J9770p5402n4601o3806k7393l8349P482m538
$$ 36545 -26568 107588 175880 159166 178936 103534 48933 -14873 -42266 -80615 -73133 -77671
8071g7671M5640K9299l80Q1444J9748N9952o2430q8264o4688k7161R52K9060Q568
$$ -77671 -32031 -2732 -3112 78332 98080 158032 95602 7338 -57350 -84511 -83559 -54499 -45931
8058d5931P6764j555L113l2361J3883O4546O3256j6848j69264l8816m3662n9051
$$ -45931 30833 29278 32391 30 13913 78459 141715 124867 -44397 -83213 -126875 -185926
8046a85926J04159M2307L0047J52042n236P7129k5076l1534K9074r8759j30703
$$ -185926 -81767 -39460 -9413 142629 137393 214522 189446 157912 186986 88227 -42476
8035d2476k4493p9731o1291n41J04902J32404J0983K5436o5331j11588q0594K8657
$$ -42476 -66969 -146700 -207991 -208532 -103630 28774 39757 65193 -138 -111726 -192320 -163663
8023a63663P973K4046p6555p2498P9773J23375Q9910O9087k3958Q7209P5149k9565
$$ -163663 -155690 -131644 -208199 -280697 -200924 -77549 12361 81448 57490 144699 219848 190283
8011A90283j60432k7197O7414m6375j53578q3768M0792R9157q0739J6756Q0125
$$ 190283 29851 2654 70068 23693 -129885 -213653 -172861 -73704 -154443 -137687 -57562
8000e7562j53490m0327K09545J18867q9619Q8551M6442l6738M1245j0800l5547
$$ -57562 -211052 -251379 -41834 77033 -12586 75965 122407 85669 126914 116114 80567
7989H0567j35058n5941n336m7649J06463N5532J21128k4317j62951j45703J2981
$$ 80567 -54491 -110432 -115768 -163417 -56954 -1422 119706 95389 -67562 -213265 -200284
7978b00284K01758N8492L599p0844q333n4810p0194J9745L6417N9298M6733p9468
$$ -200284 1474 59966 63565 -7279 -15612 -70422 -140616 -120871 -84454 -25156 21577 -57891
7966e7891M3658K9141j9029J10179O8761J01274R092j15487o7090L5877j8767
$$ -57891 -14233 14908 -4121 106058 174819 276093 285185 169698 102608 138485 119718
7955A19718o9071P2339R666l871q3866q5408J04000M6449j0938L7397p771j27275
$$ 119718 50647 122986 132652 128781 44915 -40493 63507 109956 99018 136415 128644 1369
7943A369L8239J6360L2964j10763m4229l2487p2076M2453Q8909R8537N8856J541
$$ 1369 39608 55968 88932 -21831 -66060 -98547 -170623 -128170 -39261 59276 118132 119673
7931A19673j18917j21860j12403M6746J43135M9245k0298p6685N2698m7899N4931
$$ 119673 756 -121104 -233507 -186761 -43626 5619 -14679 -91364 -38666 -86565 -31634
7920c1634J84903j48394k75397J08391R5867M2404Q0105J02601o9171k228M0514
$$ -31634 153269 4875 -270522 -162131 -66264 -23860 56245 158846 89675 87447 127961
7909A27961l8552l5190o9652q7834J25118O8281k4523k153n1155l6185P3408k2648
$$ 127961 89409 54219 -15433 -103267 21851 90132 65609 63456 12301 -23884 49524 26876
7897B6876k5021O9022J75610j2627k31856p3593K02984O0742l7300j54017n306
$$ 26876 1855 70877 246487 233860 2004 -71589 131395 192137 154837 820 -4486
7886d486R0309L536K7871j0451j4263k7121R7608m6405r9616K6633O1902J02402
$$ -4486 85823 89359 117230 106779 92516 65395 163003 116598 16982 43615 105517 207919
7874B07919J3362k25496r6117o7168N6377l1259L9130N3126p8434o4979N0034
$$ 207919 221281 -4215 -100332 -167500 -111123 -142382 -103252 -50126 -128560 -193539 -143505
7863a43505J38731K22806p513r6249J3095j09801M6820p9314P093N3147M3566
$$ -143505 -4774 218032 210519 114270 127365 17564 64384 -14930 -7837 45310 88876
7852H8876n3601O4487J48952j15935j5161L9543K1792k6405j77028r738J1824
$$ 88876 35275 99762 248714 132779 117618 157161 178953 152548 -24480 -34218 -22394
7841b2394R870q9529p0392j8113R2725J33054k5252j13085r3023O1776J77665
$$ -22394 -12524 -102053 -172445 -190558 -97833 35221 9969 -103116 -196139 -134363 43302
7830D3302J40413l0207N354K2690P7279n1864r2796j86724K883J15588k1422j31913
$$ 43302 183715 153508 158862 181552 258831 206967 114171 -72553 -69670 45918 24496 -107417
7818a07417J52792o578j69894k3819R491P204L8100R2401J79981j19926j35381
$$ -107417 45375 38797 -131097 -154916 -145425 -138221 -100121 -7720 172261 52335 -83046
7807h3046O353k41K2524J19948l5142r3034n8712j09586M126M8696Q1338J04159
$$ -83046 -76693 -76934 -54410 65538 30396 -62638 -121350 -230936 -226810 -178114 -96776 7383
7795G383m7064m1909O1308k5549l8j13225P9955J29634M9753N3489K3641j05032
$$ 7383 -39681 -81590 -20282 -45831 -45869 -159094 -79139 50495 100248 153737 177378 72346
7783G2346j252n685p3747J01156r8094o6951Q913N3013j25333r8994J2070J72392
$$ 72346 71094 65409 -8338 92818 -5276 -72227 -63314 -10301 -135634 -234628 -222558 -50166
7771e0166r532N6624L1974N7324k9190o768N48o8338p6986O5756K029K1409M642
$$ -50166 -59698 -3074 28900 86224 57034 50266 50814 -17524 -94510 -28754 -26725 -5316 -674
7758f74J9570M640j5519Q1602Q8337J9049j34918k24218k02423J50439K14388
$$ -674 18896 23536 8017 89619 177956 197005 62087 -162131 -364554 -214115 273
7747B73q9707m8701M1954L1614l1941o6780j4678Q5415J47760j53674m210J19938
$$ 273 -89434 -138135 -96181 -64567 -96508 -163288 -177966 -92551 55209 -98465 -102675 17263
7735A7263q2071p8845k9971J13319J94745j1362J7618R538j5512p8590P8121M561
$$ 17263 -64808 -143653 -173624 -60305 134440 123078 140696 150234 134722 56132 134253 138814
7723A38814o1963M9888j3585j7542L2652o5824m7142N8295O614M6348q9973j38557
$$ 138814 76851 126739 113154 95612 128264 62440 15298 73593 80207 126555 36582 -101975
7711a01975k9057R325J78505j3710j04309p1616J6433p7288P7719R7117m3622
$$ -101975 -131032 -121707 56798 43088 -61221 -132837 -116404 -193692 -115973 -18856 -62478
7700f2478r367K4739K1187q7065j50Q980L7092L4966q7342K6347o060k26175n9402
$$ -62478 -71845 -47106 -25919 -112984 -113134 -104154 -67062 -32096 -119438 -93091 -99151 -325326 -384728
7687c84728P0130J3316K9047J34535R4455P8830K1675m9217J9256J4782p3245
$$ -384728 -314598 -301282 -272235 -137700 -43245 35585 57260 8043 27299 42081 -31164
7676c1164q6176J5963O6031q4162p2373N6329j535L3973o9660q5622Q8946n2116
$$ -31164 -117340 -101377 -35346 -119508 -191881 -135552 -137087 -103114 -172774 -258396 -169450 -221566
7664b21566J33836j9240o4208K0725R1771J29817M9036N315j29833j43338j4079
$$ -221566 -87730 -106970 -171178 -150453 -58682 71135 120171 125486 -4347 -147685 -161764
7653a61764q068J44582q94k4182j05870p5490l4736J40015K15556o0944n8233
$$ -161764 -169832 -25250 -26144 -50326 -156196 -231686 -266422 -126407 89149 28205 -30028
7642c0028n3633n5042k1336L1640J79662K8662o5794O2700j0901j27466o0895
$$ -30028 -83661 -138703 -160039 -128399 51263 79925 14131 76831 65930 -61536 -122431
7631a22431J15352J13523p7425O744o8285n4817K7537l3924l7338K6097J01823
$$ -122431 -7079 106444 29019 35763 -32522 -87339 -59802 -93726 -131064 -104967 -3144
7620c144N7036m6684J0896k7968K0265O0218Q039j3544j1635K1536m0248m1552
$$ -3144 53892 7208 18104 -9864 10401 70619 78658 65114 53479 75015 34767 -6785
7608f785r6213j6656Q8504P6379l5559j58446j58142J4170l5536R2489J11586
$$ -6785 -102998 -119654 -31150 45229 9670 -148776 -306918 -292748 -328284 -235795 -124209
7597a24209Q4782r7348L0030M7095K898J23368K0481O7498j25113j4279K27883
$$ -124209 -39427 -136775 -106745 -59650 -56752 66616 87097 154595 29482 15203 243086
7586B43086L826j05542k48270M2466K6553L9243p7063o488P7352J1573J21793
$$ 243086 246912 141370 -106900 -64434 -37881 1362 -75701 -82189 -4837 6736 128529
7575A28529N6563j18931q4645j21916j20222j3588J10927M4892n2807l3841N71
$$ 128529 185092 66161 -18484 -140400 -260622 -274210 -163283 -118391 -171198 -205039 -204468
7564b04468J70774J76151R5330j34506j21953r0801l9614j506J15955o5822j53745
$$ -204468 -33694 142457 237787 103281 -18672 -109473 -149087 -150593 -34638 -100460 -254205
7553b54205M7364L3429n6244R5314L1091l6560r645k0027Q5318k4535o2090P3471
$$ -254205 -206841 -173412 -229656 -134342 -103251 -139811 -149456 -169483 -84165 -108700 -170790 -97319
7541i7319J94097Q5484q0817n6117j1019q1570j02200k998M6255Q3710J71712
$$ -97319 96778 182262 101445 45328 34309 -47261 -149461 -152459 -106204 -22494 149218
7530A49218J2676j5982O5611m1615q0451M5518Q7539m5051r2507K5400J51104
$$ 149218 161894 145912 211523 169908 89457 134975 222514 177463 84956 110356 261460
7519B61460j57816j97522L9073J20360P3032n5026j33527p2502N991L5191Q5171
$$ 261460 103644 -93878 -54805 65555 138587 83561 -49966 -122468 -116477 -81286 3885
7508C885N9229M0704K0009O9518P2527k0941l08468j18724K9712q5388K7816L4
$$ 3885 63114 103818 123827 193345 265872 244931 -63537 -182261 -152549 -237937 -210121 -210087
7496b10087K280m012N1149J35991N009P5920m8653j32515n7907l3011L3229n828
$$ -210087 -207807 -211819 -160670 -24679 -19670 56250 7597 -124918 -182825 -215836 -182607 -188435
7484a88435L2471j8807P799K0613r2494K3224K43071J73415n4921j24638n6377
$$ -188435 -155964 -174771 -166972 -146359 -238853 -215629 27442 200857 145936 21298 -35079
7473c5079l3535j20920j43799l8006Q9999K480J43135j2037j45429Q1874M3359
$$ -35079 -68614 -189534 -333333 -371339 -281340 -278860 -135725 -147762 -293191 -211317 -167958
7462a67958j5393n4561l4326J14063J34829q663o854J03998j3638P5597k5515
$$ -167958 -183351 -237912 -272238 -158175 -23346 -32009 -38863 65135 51497 127094 101579
7451A01579m7970k14268j12016j6178J28189J65426p5236M309j7254K920p5529
$$ 101579 53609 -160659 -272675 -288853 -160664 4762 -70474 -66165 -83419 -80499 -156028
7440a56028L6779O5390k29727n7542L0950Q7326J62346j75332K3994J06349p8042
$$ -156028 -119249 -53859 -283586 -341128 -310178 -222852 -60506 -235838 -211844 -105495 -183537
7429a83537O7442O5959J09339r9293J23582J20845J0879j40434k7586M0123m8825
$$ -183537 -116095 -50136 59203 -40090 83492 204337 215216 74782 47196 87319 38494
7418C8494p1847j77237n9094p317J34731L6722Q9520r8065j18539P9202k0071
$$ 38494 -33353 -210590 -269684 -277001 -142270 -105548 -16028 -114093 -232632 -153430 -173501
7407a73501L4931L1960O016J04713N1005j06875k1502l3922L3055q5519o9739
$$ -173501 -138570 -106610 -100594 4119 55124 -51751 -73253 -107175 -74120 -159639 -229378
7396b29378O0880J96978Q910m959r8464o3223J76858P2119L4164m8895k8718P270
$$ -229378 -168498 28480 37390 32431 -66033 -129256 47602 119721 153885 104990 76272 83542
7384H3542j05907N2112L6194j2789m0458q8948k5429l6358P4217o1392J0467J12207
$$ 83542 -22365 29747 65941 53152 12694 -76254 -101683 -138041 -63824 -125216 -114749 -2542
7372b542l9165n4367l118J10612M7896M8129j78050k63865K8044M1650J14129
$$ -2542 -41707 -96074 -99192 11420 59316 107445 -70605 -334470 -306426 -264776 -150647
7361a50647M0619J2098j12089m711j21770J70305P0028J37291P6422j1579j95888
$$ -150647 -110028 -97930 -210019 -214730 -336500 -166195 -96167 41124 117546 105967 -89921
7350h9921k33511p28K3346L3659J09536J2134p4153N0300K0907m935Q1536N7386
$$ -89921 -323432 -324160 -300814 -267155 -157619 -145485 -219638 -169338 -148431 -153366 -71830 -14444
7338a4444k7270j53436M9438K8606J56349J73452j00703j49513K8578M2499j0563
$$ -14444 -41714 -195150 -145712 -117106 39243 212695 111992 -37521 -8943 33556 22993
7327B2993P902M9177J23971j9925p4001p4211o1501P9918J55604q1888j25605
$$ 22993 30895 80072 204043 184118 110117 35906 -25595 54323 209927 128039 2434
7316B434O4092J81428J3992J5160j72676n0398n7672J84289Q8878j07622j04873
$$ 2434 66526 247954 261946 277106 104430 54032 -3640 180649 269527 161905 57032
7305E7032r8735p3806k6218J3092r0256j5818J49118J7239K6207O947m8145J25827
$$ 57032 -41703 -115509 -141727 -128635 -218891 -234709 -85591 -68352 -42145 -35198 -83343 42484
7293D2484J2033q3844n9487o2956L6495m9860q4422K3772L7098R0701J53326n852
$$ 42484 54517 -29327 -88814 -151770 -115275 -165135 -249557 -225785 -188687 -97986 55340 49488
7281D9488j8578j9034o3143L3966L5274J25772L9987o7560l7902M945K6019l4832
$$ 49488 30910 11876 -51267 -17301 17973 143745 183732 116172 78270 83215 109234 74402
7269G4402L6427K252r6155L1800k8398o7461K5995o8994m2494J08977J22696j4087
$$ 74402 110829 113081 16926 48726 20328 -47133 -21138 -90132 -132626 -23649 99047 84960
7257H4960j84605j62327P9633L9901k7651M513J19964P3706P8412q3566j14843
$$ 84960 -99645 -261972 -182339 -142438 -170089 -165576 -45612 28094 106506 22940 -91903
7246i1903P427O5061l247L0440L7379R1628M260k02569m9796J45777J19141l2642
$$ -91903 -84476 -19415 -22662 7778 45157 136785 141045 -61524 -111320 34457 153598 120956
7234A20956j7759o8293j36225K5542J49855k6268q5664R503K8912k1121Q7626
$$ 120956 103197 34904 -101321 -75779 74076 47808 -37856 -28353 559 -20562 67064
7223F7064M5920j27298j37434n9165N3875M7048J24370M9126k9944J4033r1145
$$ 67064 112984 -14314 -151748 -210913 -157038 -109990 14380 63506 33562 47595 -43550
7212d3550o001J10710j39635r8620J3619Q5877j13627n3501j2184L7202Q3455
$$ -43550 -49551 61159 -78476 -177096 -163477 -77600 -191227 -244728 -256912 -219710 -136255
7201a36255m8711J10390J10873o807J1560J01021J23686K2944r4729j1551n193
$$ -136255 -184966 -74576 36297 29490 41050 142071 265757 288701 193972 182421 177228
7190A77228o3965L5862p838j63207k11038N8045J40354R0937J22593L2855o7189
$$ 177228 113263 149125 141287 -21920 -232958 -174913 -34559 56378 178971 211826 144637
7179A44637P3634j5038j25032k7420n1612r4815q552l0688p9202J2732K9149N0761
$$ 144637 218271 203233 78201 50781 -831 -95646 -104198 -134886 -214088 -201356 -172207 -121446
7167a21446m409j7156J14452L7044J10911L9820j04731j19182L557P606Q8134
$$ -121446 -125855 -143011 -28559 8485 119396 159216 54485 -64697 -61140 -53534 34600
7156C4600K7623J4384K0068n4549k6286k7083M3544N5875m3151j72163n315j8749
$$ 34600 62223 76607 96675 42126 15840 -11243 32301 88176 45025 -127138 -132453 -151202
7144a51202K0795m9207M4716J28521J62239p2459j40138q6130r5662J04407r3446
$$ -151202 -130407 -179614 -134898 -6377 155862 83403 -56735 -142865 -238527 -134120 -227566
7133b27566o2611L3826j46936K1259J05441J22403J01543r1978j32303j5371J77789
$$ -227566 -290177 -256351 -403287 -382028 -276587 -154184 -52641 -144619 -276922 -292293 -114504
7122a14504N8109m010J25458J42667j22600o7125O0815q6413k03143r474J26933
$$ -114504 -56395 -60405 65053 207720 85120 17995 78810 -7603 -210746 -220220 -93287
7111i3287L2559n6048J42786N2045j57701p1909K7414R2381j1311K06542q9151
$$ -93287 -60728 -116776 26010 78055 -79646 -151555 -124141 -31760 -43071 163471 74320
7100G4320j42629j951k6828L4943L8265q4784j06099O3852J24483l8977M8952
$$ 74320 -68309 -70260 -97088 -62145 -23880 -108664 -214763 -150911 -26428 -65405 -16453
7089a6453m8884j09520J5873J42538l6332p8901j23407L7553N0310N6530K33437
$$ -16453 -65337 -174857 -158984 -16446 -52778 -131679 -255086 -217533 -167223 -110693 122744
7078A22744n5360M8465Q603l5888j33903J501j04413q5204J3249O7437k2580N8130
$$ 122744 67384 115849 124452 88564 -45339 -43838 -148251 -233455 -220206 -152769 -175349 -117219
7066a17219J14712L9934j76994k2344J2725m3359L1177l6284M6409J31846K41011
$$ -117219 -2507 37427 -139567 -161911 -149186 -192545 -161368 -197652 -151243 -19397 221614
7055B21614j74880k10781k2806O9090j3665M1229k31j6494j38994j09158J11280
$$ 221614 46734 -164047 -186853 -117763 -131428 -90199 -90430 -106924 -245918 -355076 -243796
7044b43796K55478L8778q754l1353l7305n4476P3327l1256J6406J03365k7437
$$ -243796 11682 50460 41706 10353 -26952 -81428 -8101 -39357 -22951 80414 52977
7033E2977j09317J9648K6445M0264N0204K630j33907m9250J2262q678R1593k6110
$$ 52977 -56340 -36692 -10247 30017 80221 82851 -51056 -100306 -88044 -96722 -5129 -31239
7021c1239j10054j15313J35947O6328n6187J00389J44739r1479j61070k2658j22550
$$ -31239 -141293 -256606 -120659 -54331 -110518 -10129 134610 43131 -117939 -140597 -263147
7010b63147q7330J26463m1844O1132k0761L6893P2370o4659q6818l8668Q2648
$$ -263147 -350477 -224014 -265858 -204726 -225487 -188594 -116224 -180883 -267701 -306369 -223721
6999b23721J56495j21740J2722l4090M0607L667n0360L6955K6220P2246O5566
$$ -223721 -67226 -188966 -176244 -210334 -169727 -166060 -216420 -179465 -153245 -80999 -15433
6988a5433p7961K0774r5054J8711J78130n993j72471k00618O7552n5587K1597
$$ -15433 -93394 -72620 -167674 -148963 29167 23174 -149297 -349915 -282363 -337950 -316353
6977c16353Q4924J83028J47133p6533q9736o0591L3463K5635L0343L6243n1436
$$ -316353 -231429 -48401 98732 22199 -67537 -128128 -94665 -69030 -38687 -2444 -53880
6966e3880j62231j15234N5374K30696R6448M8867m549J4062j50343k4154j940
$$ -53880 -216111 -331345 -275971 -45275 51173 100040 95491 109553 -40790 -64944 -66884
6955f6884l4376k0874R4470j88597m8482J38156M8194n9390K3700k1768O9633
$$ -66884 -101260 -122134 -27664 -216261 -264743 -126587 -78393 -137783 -114083 -135851 -66218
6944f6218r7025j47519J33417L9357m0162K3046N258q605q3646N387M689R4815
$$ -66218 -163243 -310762 -177345 -137988 -178150 -155104 -149846 -158451 -242097 -236710 -232021 -137206
6932a37206j9513j07056L5666Q7379k7186p380l3571M9110M5732K3880O5026O4738
$$ -137206 -156719 -263775 -228109 -140730 -167916 -175296 -208867 -159757 -114025 -90145 -25119 39619
6920C9619J378n5797M2086o0979j55677k47798J16061J8880J28330J78558l2381
$$ 39619 40997 -14800 27286 -33693 -189370 -437168 -321107 -302227 -173897 4661 -27720
6909b7720p3307q9768p4632r0930L2568Q2075R84J43435O0n550R4448k3106j32187
$$ -27720 -101027 -190795 -265427 -356357 -323789 -241714 -240730 -97295 -97235 -102785 -8337 -31443 -163630
6896a63630O2840J76783J46076j60356j12003n5259j48759j00682J24106J29781
$$ -163630 -100790 75993 222069 61713 -50290 -105549 -254308 -354990 -230884 -101103
6886a01103j278J6675R1135J41852j81291j15992j5443O866J34229p4931j88691
$$ -101103 -102381 -85706 5429 147281 -34010 -150002 -165445 -158579 -24350 -99281 -287972
6875b87972R8468K59007P6196j35767j90170J6390K187m2476J61817P6851m1243
$$ -287972 -189504 69503 145699 9932 -180238 -163848 -161661 -204137 -42320 34531 -6712
6864f712m0747L6962o1285j25175j2368R3594J36885K0611Q1453R2673J1317j11906
$$ -6712 -47459 -10497 -71782 -196957 -209325 -115731 21154 41765 123218 215891 227208 115302
6852A15302J503m5395j2313r6819j00359P8270J0974j2638q870K12968J03549
$$ 115302 116805 71410 59097 -37722 -138081 -59811 -48837 -61475 -70345 142623 246172
6841B46172n2745j84845k25115j37987J39229J86950N4885J29330m4849j21696
$$ 246172 193427 8582 -216533 -354520 -215291 -28341 26544 155874 111025 -10671
6831a0671k20263N3580J42322k9100O2457R2931n1020Q334K21214M6115q6705
$$ -10671 -230934 -177354 -35032 -64132 -1675 91256 40236 48570 269784 315899 229194
6820B29194j13551Q173k7609j05406O6566Q6678N074J33607l2774j66109j5606
$$ 229194 115643 123816 96207 -9199 57367 144045 149119 282726 249952 83843 68237
6809F8237j956j16867N2949M1162J04679P9977Q0098q9472m1723l5505J3999r8020
$$ 68237 66281 -50586 2363 43525 148204 228181 308279 218807 177084 141579 155578 57558
6797E7558l2245l5378j35002l4058R3615J39303n7369R1820K5515Q8767o7452
$$ 57558 25313 -10065 -145067 -179125 -85510 53793 -3576 88244 113759 202526 135074
6786A35074k64914K980J26086L9129L7552N311O5808J2034q8808j10902n6014
$$ 135074 -129840 -126860 -774 38355 75907 81218 147026 159060 70252 -40650 -96664
6775i6664m1200K2034J6285l7562N7472K0115J6130J58189j2316k3775Q6436n1850
$$ -96664 -137864 -115830 -99545 -137107 -79635 -59520 -43390 114799 102483 78708 165144 113294
6763A13294r1118p3379J1263J5663Q801m3454K5647k6190q8509O3480Q1391j24208
$$ 113294 22176 -51203 -39940 -24277 -15476 -58930 -33283 -59473 -147982 -84502 -3111 -127319
6751a27319k3370P7168p1450l8916K6616K4162J37719J9394o8361j62186k561
$$ -127319 -150689 -73521 -144971 -183887 -157271 -133109 4610 24004 -44357 -206543 -209104
6740b09104n8378J24910J5261j4943K594L3387l7723P9919J81642j7651j74600
$$ -209104 -267482 -142572 -127311 -142254 -139660 -106273 -143996 -64077 117565 99914 -74686
6729g4686l0512N0071j77876n0210O4405n428O2535R1847J49621n2434j333r0811
$$ -74686 -105198 -55127 -233003 -283213 -218808 -224236 -161701 -69854 79767 27333 26000 -64811
6717f4811l4058L6470j33271j01531R6283M3570J68332j3735j29431q8681j568
$$ -64811 -98869 -62399 -195670 -297201 -200918 -157348 10984 -2751 -132182 -220863 -222431
6706b22431j8565J2031R2866P7553l0256P3226O0407l5750L8874l3572n5996l7435
$$ -222431 -240996 -228965 -136099 -58546 -88802 -15576 44831 9081 47955 14383 -41613 -79048
6694g9048p9041q4715k9914l702P3431R344j9481J13651M4692m5253j84258m7155
$$ -79048 -158089 -242804 -272718 -276420 -202989 -193645 -213126 -99475 -54783 -100036 -284294 -331449
6682c31449O7568J31825Q6618L5942n7879Q0322R6505j45622j39218J1897M4371
$$ -331449 -263881 -132056 -45438 -9496 -67375 12947 109452 -36170 -175388 -163491 -119120
6671a19120o3701P9062M5737L1907j54671M0468K18362J14372K4328M9357J1942
$$ -119120 -182821 -103759 -58022 -26115 -180786 -140318 78044 192416 216744 266101 278043
6660B78043o2946q5203M9791J8184j27958j63909L527n1023k9656m7198O6896
$$ 278043 215097 129894 179685 197869 69911 -93998 -90471 -141494 -171150 -218348 -151452
6649a51452J3335p9254K1848L8832j3305N1712Q1544k5559L6008p3890n2699L5397
$$ -151452 -138117 -217371 -195523 -156691 -169996 -118284 -36740 -62299 -26291 -100181 -152880 -117483
6637a17483J1103O2820j31129o3193K02489J26827n7727R6958r6461m2705o5761
$$ -117483 -106380 -43560 -174689 -237882 -35393 91434 33707 130665 34204 -8501 -74262
6626g4262j6905R833L3614M7033N7950l7575k3478N2168p1021j6862p5310l4203
$$ -74262 -91167 -81334 -47720 -687 57263 19688 -3790 48378 -22643 -39505 -114815 -149018
6614a49018P3139Q2089k0697L3115M336L7090q0142M5693j5912m1296o5440j68495
$$ -149018 -75879 6210 -14487 18628 22964 60054 -20088 25605 9693 -31603 -97043 -265538
6602b65538J30764k5134j37431o0192J66474J07315m3989N1926r8750n8798J11199
$$ -265538 -134774 -159908 -297339 -357531 -191057 -83742 -127731 -75805 -174555 -233353 -122154
6591a22154O2981k0925O691J22252p5442Q8117J97104m6494r3849j21529j40334
$$ -122154 -59173 -80098 -73407 48845 -26597 61520 258624 212130 118281 -3248 -143582
6580a43582L3231L556Q5181J5178j9149k2130q313j6602m5189J6916J24337Q366
$$ -143582 -110351 -106795 -21614 -6436 -25585 -47715 -56028 -72630 -117819 -100903 23434 31800
6568C1800p8170p6157m3526J71207K7414Q2917k1272j07067P9457J3318Q0160
$$ 31800 -46370 -122527 -166053 5154 32568 115485 94213 -12854 66603 79921 160081
6557A60081r827m3138N4110J03601j41510K2156N421j7570j19788k4341N4009
$$ 160081 150254 107116 161226 264827 123317 145473 150894 133324 13536 -10805 43204
6546D3204M5866n2438K65636n3657n4773L9588j17437r7970o0929j2315J36187
$$ 43204 89070 36632 302268 248611 193838 233426 115989 18019 -42910 -55225 80962
6535H0962r4221o3123K4890J55914L956O818P2777J10559n4596j06018k6240q6473
$$ 80962 -13259 -76382 -51492 104422 108378 115196 187973 298532 243936 137918 111678 25205
6523B5205r5663p6787j56208j71405J49173K47961R8640R2685p5433O767p1992
$$ 25205 -70458 -147245 -303453 -474858 -325685 -77724 20916 113601 38168 44935 -27057
6512b7057l6964q4078N9238J62913l3676k00141L8469J41640O9953m7458K6609
$$ -27057 -64021 -148099 -88861 74052 40376 -159765 -121296 20344 90297 42839 69448
6501F9448j74464j62722J76756J43831M033P191q0062k6403q6251l1277J49815
$$ 69448 -105016 -267738 -90982 52849 56882 64073 -15989 -42392 -128643 -159920 -10105
6490a0105O8752k5053p0619q1458p2313J35180J08625m0590m085K3148q5651R116
$$ -10105 58647 33594 -37025 -118483 -190796 -55616 53009 12419 8334 31482 -54169 -45053
6478d5053n9808j12454M4789J85345J04700n7612p9131K3931j17219m3589j8639
$$ -45053 -104861 -217315 -172526 12819 117519 59907 -19224 4707 -112512 -156101 -174740
6467a74740N3748o4777Q3186J45466M6163o9570j265n7867j279p1006J0989J41197
$$ -174740 -120992 -185769 -102583 42883 89046 19476 18211 -39656 -40935 -111941 -100952 40245
6455D0245O7353j54932k01228j05901R1830J56628N3456M119L3339k505j9297
$$ 40245 107598 -47334 -248562 -354463 -262633 -106005 -52549 -48430 -15091 -17596 -36893
6444c6893O9038o517j57999k4111K5232j802M7748N6023P1563j08773m9395j0767
$$ -36893 32145 25628 -132371 -156482 -131250 -133052 -85304 -29281 42282 -66491 -115886 -126653
6432a26653J01652J05132J51843j06492j48647q2903R8694q6425j7387r0155q416
$$ -126653 -25001 80131 231974 125482 -23165 -106068 -7374 -93799 -111186 -201341 -209757
6421b09757m8970J7874J07369j6578k5833N3349M3364O6953P1278j23449p4241
$$ -209757 -258727 -240853 -133484 -150062 -175895 -122546 -79182 -12229 59049 -64400 -138641
6410a38641R211J00214l0551j21854P4702J02759k419j21140l8599N239j6705
$$ -138641 -129430 -29216 -59767 -181621 -106919 -4160 -6579 -127719 -166318 -161079 -177784
6399a77784J04006j9537O2776M6305n0134p2979o1759N3290L2440L3923J22501
$$ -177784 -73778 -93315 -30539 15766 -34368 -107347 -169106 -115816 -83376 -49453 73048
6388G3048L0072p198M3228j17295l6130K8476m7399P0813J30872q4617m0313O9779
$$ 73048 103120 95922 139150 21855 -14275 14201 -33198 37615 168487 83870 43557 113336
6376A13336r4636k02887j7247R4979l753j2962L2077M0025N7366L8251j49576
$$ 113336 18700 -184187 -201434 -106455 -110208 -123170 -91093 -51068 6298 44549 -105027
6365a05027J3297N9789L0814j860J15271K5316L8277n5942k27807L5000J35744
$$ -105027 -91730 -31941 -1127 -2987 112284 137600 175877 119935 -107872 -72872 62872
6354F2872J25000P1043j34434p1719n9118Q3522m4399n7990L7417k3870q3943
$$ 62872 187872 258915 124481 52762 -6356 77166 32767 -25223 12194 -11676 -95619
6343i5619K8371N6995K01813L6971q3981n9000L9524m2558j97919M3715L7888
$$ -95619 -67248 -10253 191560 228531 144550 85550 125074 82516 -115403 -71688 -33800
6332c3800o7153j7924J06441K8978j02924Q2800p3030j76825l5752l2412M7554
$$ -33800 -100953 -118877 -12436 16542 -86382 -3582 -76612 -253437 -289189 -321601 -274047
6321b74047J08095m4476n2283J49893P4166P4991k4710o6268m0650r8173p3467
$$ -274047 -165952 -210428 -262711 -112818 -38652 36339 11629 -54639 -95289 -193462 -266929
6310b66929L1353O5886n817K319m0634r8328K5152J91425M8999L2155J04751m334
$$ -266929 -235576 -169690 -175507 -173188 -213822 -312150 -286998 -95573 -46574 -14419 90332 85998
6298H5998m0616N386M1902J7638k526n8157P281O7123j08896j8881o7546J4103
$$ 85998 45382 50768 92670 110308 107782 49625 56906 124029 15133 -3748 -71294 -57191
6286e7191o3065O7085Q9856j33763m559J07416K6326Q8901J792j48528M1650L6614
$$ -57191 -120256 -53171 36685 -97078 -101637 5779 32105 121006 122798 -25730 15920 52534
6274E2534o5265l7146q7623L3025J11963L4304j03451o3610K5183N2891q09o7219
$$ 52534 -12731 -49877 -137500 -104475 7488 41792 -61659 -125269 -100086 -47195 -48004 -115223
6262a15223L4805P0505p96J71089q214m0862m7401j51060l8290n2218J9616l3349
$$ -115223 -80418 -9913 -10709 160380 152166 111304 63903 -87157 -125447 -177665 -158049 -191398
6250a91398Q3467J9153J24651l044k5865J2050n3793j9203n1755n1618L3853M1533
$$ -191398 -107931 -88778 35873 32829 6964 19014 -34779 -53982 -105737 -157355 -123502 -81969
6238h1969J6549k8049P0751k431n8281r8495q0944J20888l762j1840M9139Q6991
$$ -81969 -65420 -93469 -22718 -25149 -83430 -181925 -262869 -141981 -145743 -157583 -108444 -21453
6226b1453N8375o2289J1141l5939j30375Q3207P3207j13417l527J2448L2306N7251
$$ -21453 36922 -25367 -14226 -50165 -180540 -97333 -24126 -137543 -141070 -128622 -96316 -39065
6214c9065n9382n9807P0940J2758J7667L3122L6721M0284j14180M7945N9934o9959
$$ -39065 -98447 -158254 -87314 -74556 -56889 -23767 12954 53238 -60942 -12997 46937 -23022
6202b3022l7258J2632l951q0209n7478p2414J6376J30606J8055N4640J54369n5674
$$ -23022 -60280 -47648 -51599 -131808 -189286 -261700 -245324 -114718 -96663 -42023 112346 56672
6190E6672L9818L3000k0547q3384p1207R8749m693Q5675L9317K1037o9463j85062
$$ 56672 96490 129490 108943 25559 -45648 53101 48408 134083 173400 194437 124974 -60088
6178f0088J1550O2754J3640k7419J42004J87746m6900k7699j22593j08295l6790
$$ -60088 -48538 14216 27856 437 142441 330187 283287 255588 132995 24700 -12090
6167a2090q9751l9891l5408J50285J51606m6056m8998k5181L0377l4442k1973
$$ -12090 -101841 -141732 -177140 -26855 124751 78695 29697 4516 34893 451 -21522
6156b1522q0906n8417m8814L5606j07169m5300O8426K56244J9553j07715O565
$$ -21522 -102428 -160845 -209659 -174053 -281222 -326522 -258096 -1852 17701 -90014 -83449
6145h3449J12576p417j79785q8706m3472M8261J0560j14230P7020L7425l9062
$$ -83449 29127 21710 -158075 -246781 -290253 -241992 -231432 -345662 -268642 -231217 -270279
6134b70279l5888K19077J39030k1745n4862j33773R2310J0372k7115J6415O6528
$$ -270279 -306167 -87090 51940 30195 -24667 -158440 -66130 -55758 -82873 -66458 70
6123G0N1774q9170l8232O5921J22588O1985M5162l3988O813j49182j29884O5767
$$ 70 51844 -37326 -75558 -9637 112951 174936 220098 186110 192923 43741 -86143 -20376
6111b0376n6605K690k4581j4128m6692J0173P5975J17136r4490m9082j155J2266
$$ -20376 -76981 -74291 -98872 -113000 -159692 -149519 -73544 43592 -50898 -99980 -101135 -88869
6099h8869n4151j48734J28056J13548q0035j03411N6497J31807R1436n7088M0009
$$ -88869 -143020 -291754 -163698 -50150 -130185 -233596 -177099 -45292 46144 -10944 29065
6088B9065l4017r6559k7397l042J67976J40368l0912k30309l271K25616l0436
$$ 29065 -4952 -101511 -128908 -131950 36026 176394 145482 -84827 -88098 137518 107082
6077A07082j31096j62962n9241R7267O7343Q9435J7497o0246j10802l4067N9575
$$ 107082 -24014 -186976 -246217 -148950 -81607 7828 25325 -34921 -145723 -179790 -120215
6066a20215J08327P1615j07354K26099N3624l7496j01624j33164K7390J82941
$$ -120215 -11888 59727 -47627 178472 232096 194600 92976 -40188 -12798 170143
6056A70143O7696o5910j21732j13164j10373l0306J35458N5836O663J8877K5480
$$ 170143 237839 171929 50197 -62967 -173340 -203646 -68188 -12352 -5689 13188 38668
6045C8668m7163n5235L5063R2387J19494O4681p9484j91096P3437j07815j37681
$$ 38668 -8495 -63730 -28667 63720 183214 247895 168411 -22685 50752 -57063 -194744
6034a94744j09332o1869J64227J34432K1685J5057Q0983J5318N8172J7619q9691
$$ -194744 -304076 -365945 -201718 -67286 -45601 -30544 50439 65757 123929 141548 51857
6023E1857P118o0860O2559k2026J8483J09493j1530j04599j02047O180J17310
$$ 51857 58975 -1885 60674 38648 57131 166624 155094 50495 -51552 -45372 71938
6012G1938J92000P8363j32312j72194p4005P4155M1554l933n0429P2560J43379
$$ 71938 263938 342301 209989 37795 -36210 37945 79499 75566 25137 97697 241076
6001B41076n9007j26434j12115q7980K2026J05637p142j7148j32171K4665j24015
$$ 241076 182069 55635 -56480 -144460 -122434 -16797 -23939 -41087 -173258 -148593 -272608
5990b72608l7342J39558Q4953L8320l2214J962j2080J10510p4889o9727P2205
$$ -272608 -309950 -170392 -85439 -47119 -79333 -77371 -89451 21059 -53830 -123557 -51352
5979e1352J6908L6812o8845O4914M1142q3946r4482K342m400q4117j40189j6392
$$ -51352 -34444 2368 -66477 -1563 39579 -44367 -138849 -136507 -140907 -225024 -365213 -381605
5967c81605J3813p743M8633J43390r5094Q8466J5611k8152R5905m5874q344P4354
$$ -381605 -367792 -375535 -326902 -183512 -278606 -190140 -174529 -202681 -106776 -152650 -160994 -86640
5955h6640R4303l7932j56150P0514K39094M0222p8615P85Q9786J2090j14296o0009
$$ -86640 7663 -30269 -186419 -115905 123189 163411 84796 85581 175367 187457 73161 13152
5943A3152J33880N7138m4123o5119o4619K3422l2962j04173j167J5592m5890L1401
$$ 13152 147032 204170 160047 94928 30309 53731 20769 -83404 -84571 -68979 -114869 -83468
5931h3468M5566P0856k0208l7176L7701J9558K5156P1809q669P7508P8761L8553
$$ -83468 -37902 32954 12746 -24430 13271 32829 57985 129794 121125 198633 277394 315947
5919C15947L9386j12747j00891n1372j37403o7527N1186J18137q0147p9152K6305
$$ 315947 355333 242586 141695 90323 -47080 -114607 -63421 54716 -25431 -104583 -78278
5908g8278J13746q8947k8469J22994L0030M3364o133j08305k9616J1687N094M3257
$$ -78278 35468 -53479 -81948 41046 71076 114440 108307 2 -29614 -17927 -12833 30424
5896C0424J3878l6592K1056m1056j70611N8265J56512P5735L9139l0916p3937
$$ 30424 44302 7710 28766 -12290 -182901 -124636 31876 107611 146750 115834 41897
5885D1897q959J2013n6140m1846M9008j4419K5942j49736N9388r089m0194j6296
$$ 41897 32938 44951 -11189 -53035 -4027 -18446 7496 -142240 -82852 -91941 -132135 -148431
5873a48431N3927J3920J72933J06493q1590m589o4740j69552l5273Q3543J12171
$$ -148431 -94504 -80584 92349 198842 117252 112663 47923 -121629 -156902 -73359 38812
5862C8812o1440J359m4104l9441j17596o7899M8574M3486J0088O6300J13280k8942
$$ 38812 -22628 -21269 -65373 -104814 -222410 -290309 -241735 -198249 -188161 -121861 -8581 -37523
5850c7523j42971J08261J62530J3737j76402n593J8113j61096j6201N1570P7460
$$ -37523 -180494 -72233 90297 104034 -72368 -77961 -59848 -220944 -237145 -185575 -108115
5839a08115l290n0548o4002N7513L893N8797R9923L7970M0369l6793J5667m6395
$$ -108115 -111405 -161953 -225955 -168442 -164549 -105752 -5829 32141 72510 35717 51384 4989
5827D989j03161k7574J7982q697r6574M5091j17473k2476J77797J33185J3602
$$ 4989 -98172 -125746 -107764 -116461 -213035 -167944 -285417 -307893 -130096 3089 16691
5816A6691K0334l3158l8532L778M6859K0749j29403j20079o860J03548J35287
$$ 16691 37025 3867 -34665 -30887 15972 36721 -92682 -212761 -219621 -116073 19214
5805A9214J23348j109n0062q8774R45Q3866M8132j63164m7307m2988J9824j0228
$$ 19214 142562 141453 91391 2617 3562 87428 135560 -27604 -74911 -117899 -98075 -108303
5793a08303N6078P664R949j990q1854L2250M8681N5630j75975j35574o3067J28985
$$ -108303 -52225 -44561 -34612 -36602 -118456 -86206 -37525 18105 -157870 -293444 -356511 -227526
5781b27526J60766j47925J6352K53098N0023j51442j47416o3944J98104O9784
$$ -227526 -66760 -214685 -198333 54765 104788 -46654 -194070 -258014 -59910 9874
5771I874N9948M1380n3304k0894n3929l5748O4191J0748R1227K37503N4125k1085
$$ 9874 69822 111202 57898 37004 -16925 -52673 11518 22266 113493 350996 405121 384036
5759C84036j27028j47017j52523L6877p0493J4158k3828J9552n4985J22178J31947
$$ 384036 257008 109991 -42532 -5655 -76148 -61990 -85818 -66266 -121251 927 132874
5748A32874r9693O4316O305K0349j1812p1065L1991Q9936K4309r3737p0056Q763
$$ 132874 33181 97497 103802 124151 112339 41274 73265 163201 187510 93773 23717 32480
5736C2480n4360p9613j69056n6633Q8179R3972O9348J10075N2866Q8314k396o5804
$$ 32480 -21880 -101493 -270549 -327182 -239003 -145031 -75683 34392 87258 175572 173176 107372
5724A07372q075j34115j11411R5271n0131q944J3989k9715O8360J0143J10169
$$ 107372 99297 -34818 -146229 -50958 -101089 -110033 -96044 -125759 -57399 -47256 62913
5713F2913L2614O8870k0477p5918m4393N4578K3643p3944j35100M986r367j332
$$ 62913 95527 164397 143920 68002 23609 78187 101830 27886 -107214 -102228 -111595 -112927
5701a12927m880q6022P4145L8547q0074q802K7666J69610L0518j53344m9735j4355
$$ -112927 -117807 -203829 -129684 -91137 -171211 -180013 -152347 17263 47781 -105563 -155298 -169653
5689a69653l5346K1519r5197O8896P8548J17269M0560m8426Q3155q3926j74488
$$ -169653 -204999 -183480 -278677 -209781 -131233 -13964 26596 -21830 61325 -22601 -197089
5678a97089j53536R4286K08686O5545o8786M2082m3687L763Q3838j4896N1217
$$ -197089 -350625 -256339 -47653 17892 -50894 -8812 -52499 -48736 35102 20206 71423
5667G1423J00466R720M8217l7323j15424j82390P469M6861R6625n3170j0342K9742
$$ 71423 171889 181609 229826 192503 77079 -105311 -97842 -50981 45644 -7526 -17868 11874
5655A1874l1927r5015j03411k083Q2653J62915N7275j10121j29657N0901J93039
$$ 11874 -20053 -115068 -218479 -220562 -137909 25006 82281 -27840 -157497 -106596 86443
5644H6443K9334j06855l9429L6276o8984o8956j6425r0363l6262N0088n6855j3812
$$ 86443 115777 8922 -30507 5769 -63215 -132171 -148596 -238959 -275221 -225133 -281988 -295800
5632b95800M7365r9846l4501R5851O3910R7057K34181J4347j23654o9528j22426
$$ -295800 -248435 -348281 -382782 -286931 -223021 -125964 108217 122564 -1090 -70618 -193044
5621a93044m6670P6652O4062n3313l5593J31549P3632m3185l7186n2219N0132
$$ -193044 -239714 -163062 -99000 -152313 -187906 -56357 17275 -25910 -63096 -115315 -65183
5610f5183J14041N7283R3991M0245k6620j21288l0761L5501m8869k7942o964L6930
$$ -65183 48858 106141 200132 240377 213757 92469 61708 97209 48340 20398 13434 50364
5598E0364L5978L1062j32770j36818j15616O213o669J246N8782J30804L9708K6029
$$ 50364 86342 117404 -15366 -152184 -267800 -261587 -268256 -267010 -208228 -77424 -37716 -11687
5586a1687k9119l0203M6504j44009M1894N8175j9729L836Q9391J3756m2965p514
$$ -11687 -40806 -71009 -24505 -168514 -126620 -68445 -88174 -84338 5053 18809 -24156 -31670
5574c1670P9579J41000n713q7745j95907q2656O8016Q5580O4619O9376L151j39501
$$ -31670 47909 188909 183196 95451 -100456 -183112 -115096 -29516 35103 104479 107630 -31871
5562c1871m6017J31619J13011L0541r6031j11774R6506M0015j4932O4293J6051
$$ -31871 -77888 53731 166742 197283 101252 -10522 85984 125999 111067 175360 191411
5551A91411n3106k03562r5121k0239m9221k1938N8091j3682k2705K02810J09040
$$ 191411 138305 -65257 -160378 -180617 -229838 -251776 -193685 -207367 -230072 -27262 81778
5540H1778l2798k5694L5119p5146o7804P8852J46789j9373j00677P1681P8531
$$ 81778 48980 23286 58405 -16741 -84545 -5693 141096 121723 21046 92727 171258
5529A71258m5926k0460L8322q3562j02071J37787L7833p9762o4730l8770p9606
$$ 171258 125332 104872 143194 59632 -42439 95348 133181 53419 -11311 -50081 -129687
5518a29687J13545P0092k0131n044M0554J09015n8662k01931p7714n794J12332
$$ -129687 -16142 53950 33819 28775 69329 178344 119682 -82249 -159963 -165757 -53425
5507e3425J64140m9630J1498J5772l2284k7662j14279L7183p0191m0410J4934
$$ -53425 110715 61085 72583 88355 56071 28409 -85870 -48687 -118878 -159288 -144354
5496a44354o5214R4939K26617J27549m0172n3439j5214j04412Q2023j17094j00741
$$ -144354 -209568 -114629 111988 239537 199365 145926 130712 26300 108323 -8771 -109512
5485a09512K0559K6578j0126J15892J42506r8240N2184j04693j8804J57527K5686
$$ -109512 -88953 -62375 -72501 43391 185897 87657 139841 35148 16344 173871 199557
5474A99557j49060m5645J33100K990j1757j6877o5774J8730J1040Q3886j7791
$$ 199557 50497 4852 137952 140942 129185 112308 46534 65264 76304 160190 142399
5463A42399M9600N5601J9002j12954j41118p3414K8531M755J23581K3009M7073
$$ 142399 191999 247600 266602 153648 12530 -60884 -32353 -27598 95983 118992 166065
5452A66065n2709n5224k6363n4198j1454N1013k2443j47354l1662k6523N805n2274
$$ 166065 113356 58132 31769 -22429 -33883 17130 -5313 -152667 -184329 -210852 -205047 -257321
5440b57321N6630J18869K2079P8316L6073P0962N2459Q8985q8793j18616n5200
$$ -257321 -200691 -81822 -59743 18573 54646 125608 178067 267052 178259 59643 4443
5429D443o5040N9933m7419j13488N7898P5314p1108M8689N1223J0637j52655l3914
$$ 4443 -60597 -664 -48083 -161571 -103673 -28359 -99467 -50778 445 11082 -141573 -175487
5417a75487m9743Q6654Q8540K0401l628m9820n3240j34293J8260q425l0498O6646
$$ -175487 -225230 -138576 -50036 -29635 -33263 -83083 -136323 -270616 -252356 -260781 -291279 -224633
5405b24633J60883L6020N1627j9720p5111r7787N4023J20287N5355l4772J03333
$$ -224633 -63750 -27730 23897 4177 -70934 -168721 -114698 5589 60944 26172 129505
5394A29505j622n5609o7470j73030J3265J25715K8595j03249K5492O0997R3300
$$ 129505 127883 72274 4804 -168226 -154961 -29246 -651 -103900 -78408 -17411 75889
5383G5889L4932R9392j06661o7673O7919q683l7831m5336m285n8131j8501j4088
$$ 75889 110821 210213 103552 35879 103798 95115 57284 11948 7663 -50468 -68969 -83057
5371h3057N6654j5377K2679J45892j0614j26252L3545K034n4250L8572P3084n582
$$ -83057 -26403 -41780 -19101 126791 116177 -10075 23470 25504 -28746 9826 82910 77328
5359G7328j57312J9098k9667K529r9809o2350O1776n2511Q5136m1741O3218R4735
$$ 77328 -79984 -60886 -90553 -88024 -187833 -250183 -188407 -240918 -155782 -197523 -134305 -39570
5347c9570j8576J16099q6048n4771o80P8534L1693o2465o1244N4596M7806l5920
$$ -39570 -58146 57953 -28095 -82866 -83546 -5012 26681 -35784 -97028 -42432 5374 -30546
5335c0546n3192J11978J04430J76815J04839L523k44916l8592j6205K8867j95133
$$ -30546 -83738 28240 132670 309485 414324 417847 172931 134339 118134 147001 -48132
5324d8132o9516J75603P0248j17098L0855P8315K311m9604r37q717k7663J12042
$$ -48132 -117648 57955 128203 11105 41960 120275 122586 72982 72045 63328 35665 147707
5312A47707n6091J1638o9707q1279o2265R0144j16000n4580P7425Q4731o153K8652
$$ 147707 91616 103254 33547 -47732 -109997 -19853 -135853 -190433 -113008 -28277 -34430 -5778
5300e778o1414R6693J67879m0034n4370o1258k32940L7933J00049L5434o0418
$$ -5778 -67192 29501 197380 157346 102976 41718 -191222 -153289 -53240 -17806 -78224
5289g8224m3825J16383Q5113J5O414j20868r1086J20938J5362k7632j1235N7506
$$ -78224 -122049 -5666 79447 79462 85876 -34992 -126078 -5140 10222 -17410 -28645 28861
5277B8861l1876n6989J10183l6053j10001j11778J32733k3851j2842n585o9848
$$ 28861 -3015 -60004 50179 14126 -95875 -207653 -74920 -98771 -111613 -117198 -187046
5266a87046P8969K12464o5788j28433J5389N0405k5850r2089n1658L7466O4753
$$ -187046 -108077 104387 38599 -89834 -74445 -24040 -49890 -141979 -193637 -156171 -91418
5255i1418r8003O8295l3202J2918L1075o3310j919j1392l8210M591N681J57075
$$ -91418 -189421 -121126 -154328 -141410 -110335 -173645 -175564 -186956 -225166 -220575 -214894 -57819
5243e7819J8477j32598K2404N2107J18711J05981j40328j02604Q8268J1278l9465
$$ -57819 -39342 -171940 -149536 -97429 21282 127263 -13065 -115669 -27401 -16123 -55588
5232e5588L08J8005q8307j01797M6475P0101N9502O9995m2476J31951k0979m8578
$$ -55588 -55280 -37275 -125582 -227379 -180904 -110803 -51301 18694 -23782 108169 87190 38612
5220C8612l7527p0070o5313P6186j0255J5474j31843q2502N4001K7028o118L9227
$$ 38612 1085 -68985 -134298 -58112 -68367 -52893 -184736 -267238 -213237 -186209 -192327 -153100
5208a53100J4227M116J82425J41357j14648p1628n1971m9796L4881R9274n4032
$$ -153100 -138873 -134757 47668 189025 74377 2749 -49222 -99018 -64137 35137 -18895
5197a8895o302J67448l2743k37463l5751K5318m0154N9016J61453k9455o8358
$$ -18895 -25197 142251 109508 -127955 -163706 -138388 -178542 -119526 41927 12472 -55886
5186e5886R736J01845N2631o7338m0220M3108j0116m0835J0531J8199j6180l032
$$ -55886 -46150 55695 108326 40988 768 43876 33760 -7075 3456 21655 5475 2443
5174B443K4637r9026j09518o4398q977r209L265P4500N0577j14614M9234k6593
$$ 2443 27080 -71946 -181464 -245862 -254839 -264048 -260783 -186283 -135706 -250320 -201086 -227679
5162b27679m5916Q0101J44035O4440m56O708m7967k215j20921J9884o480L0715
$$ -227679 -273595 -193494 -49459 14981 14525 21233 -26734 -28949 -149870 -129986 -136466 -105751
5150a05751p2250q3936Q5928J9978q4765J8694p1973N3549j7606K21655J47047
$$ -105751 -178001 -261937 -176009 -156031 -240796 -222102 -294075 -240526 -258132 -36477 110570
5139A10570k38998k07810Q7594J56578O234L932L7759j20351j57552l2190J20564
$$ 110570 -128428 -336238 -248644 -92066 -85832 -81900 -44141 -164492 -322044 -354234 -233670
5128b33670L2208P5660J49292J22736N3843r8973j2880J9528q6265Q312J01522
$$ -233670 -201462 -125802 23490 146226 200069 101096 88216 107744 21479 29791 131313
5117A31313L342j1601M7438o3909o6055N6028J18998J12471j01620j03117O3878
$$ 131313 134655 123054 170492 106583 40528 96556 215554 328025 226405 123288 187166
5106A87166k232q5002m6620p2905K6618l471j61817j0930Q89o1800J31776K81201
$$ 187166 184934 99932 53312 -19593 7025 3554 -158263 -169193 -168304 -230104 -98328 182873
$$ [...]
##END NTUPLES=NMR SPECTRUM
##END=
