##TITLE=Analysis number 317528
Compound Code mo 07747
Project Code qc-cat
Chemist Name chemcon
##JCAMPDX= 6.0         $$ Bruker NMR JCAMP-DX V2.0
##DATA TYPE= NMR SPECTRUM
##DATA CLASS= NTUPLES
##ORIGIN= Bruker BioSpin GmbH
##OWNER= nmr
$$ XWIN-NMR		Version 3.5
$$ Wed Feb 22 12:54:47 2006 GMT Standard Time (UT+0h)  MAYBRIDGE\nmr@NMR_250MHZ
##.OBSERVE FREQUENCY= 250.131544655141
##.OBSERVE NUCLEUS= ^1H
##.ACQUISITION MODE= SIMULTANEOUS (DQD)
##.ACQUISITION SCHEME= undefined
##.AVERAGES= 16
##.DIGITISER RES= 18
##SPECTROMETER/DATA SYSTEM= dpx250
##.PULSE SEQUENCE= zg30
##.SOLVENT NAME= DMSO
##.SHIFT REFERENCE= (INTERNAL, DMSO, 0, 16.522)
##AUDIT TRAIL= $$ (NUMBER, WHEN, WHO, WHERE, WHAT)
$$ ##TITLE= Audit trail, XWIN-NMR		Version 3.5
$$ ##JCAMPDX= 5.01
$$ ##ORIGIN= Bruker BioSpin GmbH
$$ ##OWNER= nmr
$$ C:\u/data/dgb/nmr/ADRS/16700/pdata/1/auditp.txt
$$ ##AUDIT TRAIL=  $$ (NUMBER, WHEN, WHO, WHERE, WHAT)
(   1,<2006-02-22 12:53:54.17 +000>,<MAYBRIDGE\nmr>,<NMR_250MHZ>,
      <created by zg, POWCHK disabled, PULCHK disabled
       configuration hash MD5:
       84 BC 41 DB A1 6E 1D 46 DA 25 12 A5 C1 ED C5 3A
       data hash MD5: 64K
       EC 73 2E B2 7A 38 68 D5 82 78 00 17 95 34 D9 F3>)
(   2,<2006-02-22 12:54:17.32 +000>,<MAYBRIDGE\nmr>,<NMR_250MHZ>,
      <Start of raw data processing
       ef LB = 0.3 FT_mod = 6 PKNL = 1 SI = 32K 
       data hash MD5: 32K
       02 CB 40 2B 7B 79 06 A3 9A 4D B7 C4 08 B8 77 ED>)
(   3,<2006-02-22 12:54:23.46 +000>,<MAYBRIDGE\nmr>,<NMR_250MHZ>,
      <apk 
       data hash MD5: 32K
       BB 01 48 B4 50 E2 BA 79 B0 E2 02 B5 C3 4C AF 5D>)
(   4,<2006-02-22 12:54:25.63 +000>,<MAYBRIDGE\nmr>,<NMR_250MHZ>,
      <abs ABSG = 5 
       data hash MD5: 32K
       4D D2 82 05 D8 52 5E 82 7D 06 60 06 65 9A EE 33>)
$$ ##END=
$$ 
$$ hash MD5
$$ 41 51 BA 5B D3 B1 9C AC 0B 4D 1D F6 29 16 B3 31
##$RELAX= 
##$RELAX= 
##$RELAX= 
##$RELAX= 
##$RELAX= 
##$RELAX= 
##$RELAX= 
$$ Bruker specific parameters
$$ --------------------------
##$DU= <C:\u>
##$EXPNO= 16700
##$NAME= <ADRS>
##$PROCNO= 1
##$TYPE= <nmr>
##$USER= <dgb>
##$AMP= (0..31)
100 100 100 100 100 100 100 100 100 100 100 100 100 100 100 100 100 100 
100 100 100 100 100 100 100 100 100 100 100 100 100 100 
##$AQSEQ= 0
##$AQ_mod= 3
##$AUNM= <au_zg>
##$AUTOPOS= <30 >
##$BF1= 250.13
##$BF2= 250.13
##$BF3= 250.13
##$BF4= 250.13
##$BF5= 500.13
##$BF6= 500.13
##$BF7= 500.13
##$BF8= 500.13
##$BYTORDA= 1
##$CFDGTYP= 0
##$CFRGTYP= 5
##$CHEMSTR= <none>
##$CNST= (0..31)
1 1 145 1 1 1 1 1 1 1 1 1 1 1 1 1 1 1 1 1 1 1 1 1 1 1 1 1 1 1 1 1 
##$CPDPRG= <>
##$CPDPRG1= <>
##$CPDPRG2= <>
##$CPDPRG3= <>
##$CPDPRG4= <mlev>
##$CPDPRG5= <mlev>
##$CPDPRG6= <mlev>
##$CPDPRG7= <mlev>
##$CPDPRG8= <mlev>
##$CPDPRGB= <>
##$CPDPRGT= <>
##$D= (0..31)
0 1 0 0 0 0 0 0 0 0.06 0 0 0 0 0 0 0.0002 0 0 0 0 0 0 0 0 0 0 0 0 0 0 
0 
##$DATE= 1140612831
##$DBL= (0..7)
120 120 120 120 120 120 120 120 
##$DBP= (0..7)
150 150 150 150 150 150 150 150 
##$DBP07= 0
##$DBPNAM0= <>
##$DBPNAM1= <>
##$DBPNAM2= <>
$$ [...]
##$SUBNAM6= <"">
##$SUBNAM7= <"">
##$SUBNAM8= <"">
##$SUBNAM9= <"">
##$SW= 20.6930455092707
##$SWIBOX= (0..15)
0 0 3 0 0 0 0 0 0 0 0 0 0 0 0 0 
##$SW_h= 5175.983436853
##$TD= 65536
##$TD0= 1
##$TE= 293.16
##$TE2= 300
##$TE3= 300
##$TEG= 300
##$TL= (0..7)
0 120 120 120 120 120 120 120 
##$TP= (0..7)
150 150 150 150 150 150 150 150 
##$TP07= 0
##$TPNAME0= <>
##$TPNAME1= <>
##$TPNAME2= <>
##$TPNAME3= <>
##$TPNAME4= <>
##$TPNAME5= <>
##$TPNAME6= <>
##$TPNAME7= <>
##$TPOAL= (0..7)
0.5 0.5 0.5 0.5 0.5 0.5 0.5 0.5 
##$TPOFFS= (0..7)
0 0 0 0 0 0 0 0 
##$TUNHIN= 0
##$TUNHOUT= 0
##$TUNXOUT= 0
##$USERA1= <user>
##$USERA2= <user>
##$USERA3= <user>
##$USERA4= <user>
##$USERA5= <user>
##$V9= 5
##$VALIST= <valist>
##$VCLIST= <CCCCCCCCCCCCCCC>
##$VD= 0
##$VDLIST= <DDDDDDDDDDDDDDD>
##$VPLIST= <PPPPPPPPPPPPPPP>
##$VTLIST= <TTTTTTTTTTTTTTT>
##$WBST= 1024
##$WBSW= 4
##$XGAIN= (0..3)
0 0 0 0 
##$XL= 0
##$YL= 0
##$YMAX_a= 356534
##$YMIN_a= -359160
##$ZGOPTNS= <>
##$ZL1= 120
##$ZL2= 120
##$ZL3= 120
##$ZL4= 120
##$ABSF1= 16.522
##$ABSF2= -4.171173
##$ABSG= 5
##$ABSL= 3
##$ALPHA= 0
##$AQORDER= 0
##$ASSFAC= 0
##$ASSFACI= 0
##$ASSFACX= 0
##$ASSWID= 0
##$AUNMP= <proc_1d>
##$AZFE= 0.1
##$AZFW= 0.1
##$BCFW= 0
##$BC_mod= 0
##$BYTORDP= 0
##$COROFFS= 0
##$CY= 12.5
##$DATMOD= 1
##$DC= 0
##$DFILT= <>
##$DTYPP= 0
##$F1P= 14.0000005364418
##$F2P= -0.99999901652339
##$FCOR= 0.5
##$FTSIZE= 32768
##$FT_mod= 6
##$GAMMA= 0
##$GB= 0
##$INTBC= 1
##$INTSCL= 1
##$ISEN= 128
##$LB= 0.3
##$LEV0= 0
##$LPBIN= 0
##$MAXI= 10000
##$MC2= 0
##$MEAN= 0
##$ME_mod= 0
##$MI= 0
##$NCOEF= 0
##$NC_proc= -4
##$NLEV= 6
##$NOISF1= 0
##$NOISF2= 0
##$NSP= 0
##$NTH_PI= 0
##$NZP= 0
##$OFFSET= 16.522
##$PC= 1
##$PHC0= 239.7191
##$PHC1= 6.14915
##$PH_mod= 1
##$PKNL= yes
##$PPARMOD= 0
##$PSCAL= 4
##$PSIGN= 0
##$REVERSE= no
##$SF= 250.13
##$SI= 32768
##$SIGF1= 0
##$SIGF2= 0
##$SINO= 400
##$SIOLD= 32768
##$SREGLST= <1H.DMSO>
##$SSB= 0
##$STSI= 32768
##$STSR= 0
##$SW_p= 5175.98343685301
##$SYMM= 0
##$S_DEV= 0
##$TDeff= 65536
##$TDoff= 0
##$TI= <Analysis number 999999
Compound Code 99
Book Reference 9
Project Code 9>
##$TILT= no
##$TM1= 0
##$TM2= 0
##$TOPLEV= 0
##$USERP1= <user>
##$USERP2= <user>
##$USERP3= <user>
##$USERP4= <user>
##$USERP5= <user>
##$WDW= 1
##$XDIM= 32768
##$YMAX_p= 333773978
##$YMIN_p= -413004
$$ End of Bruker specific parameters
$$ ---------------------------------
##NTUPLES= NMR SPECTRUM
##VAR_NAME=  FREQUENCY,     SPECTRUM/REAL,   SPECTRUM/IMAG
##SYMBOL=    X,             R,               I
##VAR_TYPE=  INDEPENDENT,   DEPENDENT,       DEPENDENT
##VAR_FORM=  AFFN,          ASDF,            ASDF
##VAR_DIM=   32768,         32768,           32768
##UNITS=     HZ,            ARBITRARY UNITS, ARBITRARY UNITS
##FACTOR=    0.157963299565203, 1,           1
##FIRST=     4132.6476996994, 0,             0
##LAST=      -1043.33573715361, 0,           0
##MIN=       -1043.33573715361, -413004,     0
##MAX=       4132.6476996994, 333773978,     0
$$ Real data points
##PAGE= N=1
##DATA TABLE= (X++(R..R)), XYDATA
$$ [...]
19494 133551 63618 2929 -78263 -65267 26033 20681 -97531 -131821 -148142 -40153 23845
19483 23845 77751 50695 71075 102593 137722 129957 135575 149042 86100 -24389 -104211 -205835
19471 -205835 -187749 -61970 -128049 -203185 -132433 30354 102917 56932 18955 42746 36005
19460 36005 86751 67579 -4997 -96108 -141227 -60195 -68900 -85007 -53769 -25316 14631 65667
19448 65667 75250 136982 191835 299770 306645 251872 218272 213049 99352 33977 62959 47983
19436 47983 -11457 33849 117419 140577 50496 -125196 -127224 -32837 -43335 -83163 -45048 22567
19424 22567 70674 69295 52472 78164 127892 111898 43857 13638 58068 2310 -32339 -10389
19412 -10389 -16062 -18589 -105686 -129302 -102574 -76712 -61947 50024 161542 39072 27591
19401 27591 48912 -18547 -83634 -46812 -34177 -22679 27414 -6339 -46422 -22037 75439 98302
19389 98302 54763 32366 64589 137830 46488 14362 81914 48552 24067 -36297 -78363 -75748
19377 -75748 2876 61014 63554 11827 -56474 -74936 -60573 -57299 39785 -29665 7303 80676
19365 80676 56085 8581 3060 -84787 -107642 -105025 -59958 27975 162963 203915 94446 19349
19353 19349 42521 17467 -42089 -46413 -20528 48567 30274 -23324 -94343 -117546 -21206 83627
19341 83627 80147 -28974 -36874 48080 14283 -26494 -32773 46770 53240 119387 105208 84442
19329 84442 104158 -29339 -86882 13343 11760 41587 25623 66792 107485 61088 6922
19318 6922 -13375 32233 84733 98986 95087 37040 -2861 -22271 -18174 -29927 -68987 -54377
19306 -54377 41581 39860 9058 62138 160817 128234 -2044 -80530 -138910 -14930 79649
19295 79649 -18491 -13358 16539 17492 -42785 -53695 44222 134472 86644 103913 126164 128828
19283 128828 153205 121200 48657 1648 23227 121878 60684 160243 187276 114603 153591
19272 153591 191072 80787 -12562 173496 258187 222864 176663 120355 55266 90911 52326
19261 52326 2033 75563 148487 93399 65356 57354 60388 1652 -28965 -13821 103626 95230
19249 95230 74165 59975 99750 98453 49214 -60062 -75823 10925 -14872 55700 71718 63461
19237 63461 48810 -30417 13073 133409 63409 -44042 16317 142615 184703 176888 143773
19226 143773 99938 152812 137893 23105 35001 210200 199213 198372 189776 97803 94331 114059
19214 114059 97773 122524 111397 37009 -40884 25048 -33926 -152491 -113869 -64357 35044
19203 35044 218904 294349 210012 165025 59406 5139 30025 -110487 -63730 22267 51895
19192 51895 150387 172652 158208 96110 107016 65459 11161 -57821 -122922 -64483 92721
19181 92721 -2521 35202 64497 70350 106936 154082 298310 343350 409100 348703 193109
19170 193109 194140 195206 197553 224567 247903 271737 264248 264682 197583 105743 179438 188137 201532
19157 201532 171848 176650 179836 239311 228138 192993 135942 155560 222887 250648 287376 302095
19145 302095 318350 317219 299986 309874 299853 201525 217653 299784 373507 279988 176275 228703
19133 228703 190615 278190 350154 328722 384656 369266 417833 409114 292176 185713 142398
19122 142398 204951 442873 508703 655856 737704 746912 700699 564437 694830 772204 811289
19111 811289 669116 567065 773371 860090 826161 842448 859802 907678 828549 780619 864531
19100 864531 913833 914093 987353 1106046 1142478 1165466 1229919 1309364 1401920 1588722 1844985
19089 1844985 2107717 2309125 2553047 2725685 2965432 3371582 3765202 4228092 4652392
19080 4652392 5032650 5613571 6396585 7436310 8933809 10893010 13799975 18217634 24936665
19071 24936665 34919425 47447793 59055152 67864617 75244190 81721304 84889661 84067425
19063 84067425 82097959 81595448 83890347 87258245 88746638 88911089 88973181 87060435 81151006
19054 81151006 71946501 61076785 49395811 38477689 29859980 23898855 19643918 16480309
19046 16480309 14133490 12397813 11014522 9968922 9166545 8410346 7649128 7033029 6579962
19037 6579962 6076667 5526759 5109727 4781395 4537774 4393838 4092116 3810332 3515135
19028 3515135 3270097 3035758 2771195 2614149 2532986 2419790 2403165 2288153 2200757 2066225
19018 2066225 1990594 2036601 1958730 1860209 1733140 1565137 1424744 1442549 1397536 1275177
19008 1275177 1174440 1187088 1280647 1085847 837210 742116 718084 705134 714606 657371 649908
18997 649908 710790 718974 640462 599707 630965 619402 556091 571806 471251 448877 446749 452676
18985 452676 383536 258272 169331 171543 235196 357853 377554 334639 337410 327222 306599
18974 306599 227974 220140 126131 97901 65676 145040 240309 235772 284365 206321 189937 206591
18962 206591 176371 230852 285792 235438 161942 216532 335953 290508 226112 179955 243750
18951 243750 316761 305214 235317 202032 152852 148039 258941 345278 274797 196797 214531
18940 214531 189117 138607 106621 160012 175628 222511 138632 -32382 -50741 66139 161247
18929 161247 148341 110319 107933 164041 70965 -4301 37191 47906 112882 93638 23020 28384
18917 28384 183587 207206 215781 201496 265083 272439 327538 358263 305653 224459 270930 254126
18905 254126 202498 180936 169794 141201 274329 316800 318883 264768 276055 219594 115429
18894 115429 32676 73593 130418 28241 26042 -19310 -80713 -35942 -43605 -99253 -63129 -16318
18882 -16318 1577 -109189 -49533 170008 176193 112818 117214 179187 335918 333756 141317
18871 141317 113789 137529 143015 106797 80387 22876 19807 136609 181502 270770 292992 295904
18859 295904 225155 65926 33462 128682 227474 373422 365032 245450 283642 192590 41551
18848 41551 74173 114515 150280 159415 115503 75114 93517 159853 172173 189952 272906 176861
18836 176861 101699 93518 106337 190745 282833 247927 154742 12532 17875 142972 285815
18825 285815 322459 304528 299994 373827 420183 306280 196688 197519 139830 93331 154390 176675
18813 176675 172330 157315 164772 209560 232352 204255 220161 192814 97838 82543 73580 116627
18801 116627 66706 71877 125142 169424 232318 292575 276340 288395 257135 174528 92778 6690
18789 6690 -59844 -71253 33626 31149 44804 163295 157791 111982 100642 14878 -15475 48956
18777 48956 177600 248597 130052 22964 58266 147352 270411 266927 285572 255082 129449
18766 129449 -28622 -67424 28347 4847 -3866 70298 76335 127581 96649 69252 110474 151279
18754 151279 26458 -51266 -81104 -20141 103106 66060 -8725 933 69600 170108 167403
18743 167403 244758 310142 194567 93989 46165 69241 109378 96426 28651 24169 -28709
18732 -28709 -1149 44976 103786 206081 246602 113564 147045 188026 153212 71718 -51175
18721 -51175 -40039 35770 109745 138532 134758 147437 121966 77458 166216 140956 93096 144349
18709 144349 180635 196553 236643 153072 46923 23001 -8724 21376 55096 103227 160512
18698 160512 187977 140547 152441 188452 259457 272409 239992 144796 1216 -51996 74553
18687 74553 58317 1742 95822 156959 186387 127406 12277 -36800 73205 101416 108129
18676 108129 182569 252383 204648 224658 244845 229923 181568 41487 13162 94500 84871
18665 84871 163671 179086 213707 205346 195068 243712 241954 301010 316534 348149 485916 480378
18653 480378 431866 448228 438472 413728 505337 544111 543011 596448 583759 602744 515887 452382
18641 452382 496056 654575 799157 942592 996271 1018364 1033253 994138 1071054 1326109 1468156
18630 1468156 1504688 1623628 1698035 1910729 2235483 2491374 2579812 2703382 3019789 3471833
18620 3471833 4028530 4819519 5919717 7609027 10273550 14456175 21040121 29457134
18612 29457134 36728978 39689833 38777427 35232935 30448683 26554386 25137218 27040438
18604 27040438 31840241 37394404 40189280 39037310 35046168 29139408 22668527 17348863
18596 17348863 13673029 11114834 9213669 7886981 6988321 6229957 5707711 5353680 5089295
18587 5089295 4879858 4716757 4508202 4474426 4333662 4206213 4001651 3931677 3982724 4031131
18577 4031131 4059614 4219842 4375542 4579418 4798483 5064060 5353676 5728983 6241429 6923980
18567 6923980 7917623 9371502 11584494 14906367 20041981 28337628 39895369 52039464
18559 52039464 59550147 60806643 57273204 50680756 44017172 40128403 40720230 46134452
18551 46134452 54832879 61891154 63072729 58728758 50584347 40463222 31044796 23890036
18543 23890036 18954965 15554075 13173216 11452541 10220523 9208884 8356359 7637057
18535 7637057 7033401 6458678 5796209 5286958 4870090 4455349 4099316 3754429 3461193
18526 3461193 3238659 3251204 3240772 3211954 3157255 2953878 2765561 2544744 2454649 2296812
18516 2296812 2159264 2153071 2093562 2019264 2074116 2072927 2030343 1909096 1706708 1414116 1224736
18505 1224736 1142164 1030176 991905 990678 895729 914275 943543 932133 853696 796521 839700
18494 839700 843433 754279 718930 721433 752790 696594 607680 562824 538847 556076 506438 562314
18482 562314 577506 471947 433587 469351 455926 382939 340011 377280 409179 433210 344510
18471 344510 339141 373539 362845 375962 402757 492774 456025 416804 268213 166897 198462
18460 198462 289612 330896 370515 365994 441481 308020 162642 217445 231431 243047 289564
18449 289564 275697 319370 344381 384060 485578 445162 372036 393660 343497 396157 510640
18438 510640 503620 443651 513554 505103 426190 407615 397558 365387 371747 392729 443549 468967
18426 468967 492596 515919 474277 462412 587146 650063 658974 532494 501096 504766 524518
18415 524518 498202 541401 707562 739687 759756 702299 782774 784833 735270 751817 886425
18404 886425 942241 929974 947926 1084212 1148179 1161610 1234638 1443813 1661117 1844180 2120214
18393 2120214 2386830 2549078 2570085 2580116 2673945 2809533 2983988 3097384 3366494 3655376
18383 3655376 4129672 4817600 5717035 6722855 8257025 10229640 13017435 17092560 22737884
18374 22737884 29684644 37644073 46191738 54786602 63055230 70001967 74281142 75209696
18366 75209696 73007641 68332274 61748530 53964392 45856271 38019715 30818318 24880462
18358 24880462 20224507 16493195 13853070 11785167 10148401 8897293 7895117 7092031
18350 7092031 6537262 6198086 5945058 5755706 5463330 5372978 5363436 5217171 5017500 4798845
18340 4798845 4644818 4543559 4449429 4434362 4337253 4186281 4090788 4046755 4126481 4227509
18330 4227509 4406024 4713391 5172683 5976374 6923007 8295081 10457416 13430822 17417393
18321 17417393 22383101 27901803 33502377 39116892 44392268 48301669 49995009 49516651
18313 49516651 47093326 43160187 38256884 32823115 27455086 22463305 18056991 14531540
18305 14531540 11823647 9783891 8231072 7064154 6157954 5467405 4885333 4406577 4069699
18296 4069699 3827667 3505909 3334777 3277608 3081513 2895897 2755450 2470120 2316702 2260838
18286 2260838 2182849 2113930 2034879 1827537 1666177 1548692 1449688 1418623 1365182 1279648 1248648
18275 1248648 1234465 1226870 1263466 1206754 1091252 953741 725425 691995 717797 692847 701949
18264 701949 586812 542802 609835 616589 596879 539811 495758 509085 462661 422784 337848
18253 337848 387906 457541 405340 370587 357329 313799 262454 230513 204336 212499 180883 133949
18241 133949 62291 210971 356981 330329 291528 265649 340324 293886 203366 165587 273728
18230 273728 233758 212620 233961 237257 150578 121737 96783 124866 241719 254733 264276 341224
18218 341224 429647 365140 272679 314797 274927 316740 302404 289363 366551 396627 359625
18207 359625 152261 93471 39909 192694 328294 320013 249375 196154 190799 172321 95120
18196 95120 123364 228370 258286 145565 60777 26993 128499 142785 155282 117854 106787
18185 106787 131376 130649 181882 217833 241111 183229 139591 82691 23445 -59210 69101 163156
18173 163156 229984 232150 163974 144059 138819 220483 202578 160041 126924 18585 56344 199915
18161 199915 280384 289003 261371 351312 225393 79222 105664 159767 150111 52686 -16718
18150 -16718 67158 134541 -13190 -71931 -35119 41873 131760 226568 219099 296870 327557 189984
18138 189984 143376 215449 279880 189120 139807 146082 97586 115559 82344 101061 111462 88786
18126 88786 45612 -58506 -79439 -29986 53919 -41471 -52731 -59942 -59900 30527 52529 75076
18114 75076 85158 43629 134592 187402 112755 80335 98312 69994 16935 10322 78625 137346
18102 137346 122134 117263 108021 103002 189166 242266 298261 388115 354943 307758 339538 363929
18090 363929 467954 605234 553498 546385 539842 564597 525031 412488 296250 233743 215575
18079 215575 270682 266366 176515 117796 120464 199921 218486 217949 209114 220586 147099 99678
18067 99678 24225 12797 -25072 -89121 -77731 -41691 92303 47341 71383 225610 295198
18056 295198 174788 126296 62507 55758 134370 166334 88587 17346 46994 5563 32890
18045 32890 173795 247266 253622 262337 209598 183509 162206 241778 242257 178559 260964 239329
18033 239329 176787 195162 131806 98727 97631 128300 57539 47536 15056 30047 48073 62174
18021 62174 21144 62523 105776 97088 162218 124862 41646 13912 57919 72909 19508 -85385
18009 -85385 -71096 -76494 30102 131709 123082 69683 29142 5585 28952 45494 33080 13348
17997 13348 33563 100358 44582 51539 126813 115914 128617 61145 48708 -1001 147873 214781
17985 214781 172358 149821 95986 29246 -1142 -11114 63030 102646 87382 9764 23893 26200
17973 26200 155730 154600 57214 52070 63612 109934 167511 233020 167263 71197 33639 -20118
17961 -20118 -57375 -93532 -78670 36639 36388 -17803 -100306 -85390 -99226 -217340 -323093
17950 -323093 -180181 -50409 -47176 -78158 -123275 -93911 -181006 -132679 -29182 -5646 -1665
17939 -1665 83811 -56708 -73984 -101022 -105121 -89240 -34643 -71546 -90280 -1966 56973 70970
17927 70970 40270 7931 63329 84881 -5463 10119 93689 59812 38241 203305 225414
17916 225414 156222 94065 129562 186958 65090 103137 157204 174809 155745 231097 253845
17905 253845 186232 153745 139036 124233 -40314 -99457 -94950 -70778 -63919 67259 121003
17894 121003 153253 50596 -65649 -116272 -118304 -34700 2824 -3380 -18433 -28444 126032
17883 126032 159946 44788 -16080 -42042 -54644 -78003 -73573 -54908 -80134 -88475 -189550
17872 -189550 -97044 12952 86238 141471 232951 279897 300804 320839 253464 286848 361625
17861 361625 249730 208408 185208 93882 41645 90898 63723 60947 97437 98897 144961 109676
17849 109676 1372 -66495 -32003 30274 53365 41237 -5451 -58229 -79587 -49253 26823
17838 26823 -2092 12695 -31914 -81716 -135919 -49294 51663 86062 114514 204251 139911
17827 139911 118360 73830 27137 -5232 -25555 47057 135123 159725 200294 248274 178124
17816 178124 80176 152019 224224 233958 227400 140600 50733 87435 162221 168575 208426 162085
17804 162085 133039 108831 128746 18093 -84462 -84046 -52397 33120 27401 -40021 10156 102877
17792 102877 94681 -1389 65142 86299 111590 116846 33787 59724 112232 208870 259890 236965
17780 236965 133376 59691 77798 48022 -23516 -86840 -148925 -102144 -127957 -199972 -144864
17769 -144864 -78240 34357 77931 106283 144356 49647 33734 100869 86099 121982 102821
17758 102821 83691 99195 86641 -3015 -83211 -120779 -168031 -106501 -101004 -64071 -78765 -98997
17746 -98997 -39638 42669 100006 -3974 3328 29736 47553 36477 38697 85559 80187 154625
17734 154625 12132 17003 175785 146825 -123554 -252157 -237223 -219088 -150243 -137048 -175425
17723 -175425 -118219 -91527 -204708 -221593 -136707 -75281 -91779 -115065 -104722 -1938 8728
17712 8728 -25240 48651 -36711 -136534 -211325 -217365 -65295 33723 55391 23056 -69020 -150552
17700 -150552 -106719 -81707 -160511 -104951 -114580 -28501 77888 56990 2249 -49114 -124406
17689 -124406 -67747 -14813 106786 41835 32623 57322 53968 40497 6263 -50763 -92322 -60576
17677 -60576 -49079 -8444 21952 26591 13282 -85986 -149752 -65112 -26896 46354 20993 -86464
17665 -86464 -38471 -13143 93427 108034 -116 -1154 627 30013 12833 26882 88118 116765
17653 116765 23025 -59297 -63892 -104159 -152601 -112703 -3465 24137 48333 53284 12400 -26646
17641 -26646 -40808 -147843 -44272 114901 97608 53921 21654 24547 5375 8027 33586
17630 33586 -103437 -155817 -121246 -113013 -130551 -191979 -237738 -219827 -111232 -123431 -196492
17619 -196492 -163446 -79422 -24421 -102200 -121997 -75588 -94924 -183803 -91028 -24244 -70175
17608 -70175 -174922 -171132 -102800 18108 22801 29553 -8921 32579 119894 61456 128754 77845
17596 77845 121279 131841 122483 145260 188933 192206 134610 87152 122356 178759 102247 5139
17584 5139 -17405 -106038 -105861 -63654 -37451 -41751 56347 137958 66467 23195 22057 22324 86815
17571 86815 64769 11147 1204 6281 57341 146310 160132 88718 95596 43594 66034 173495
17559 173495 67288 74581 143497 10662 -79980 -181701 -285302 -250542 -169958 -138168 -103489
17548 -103489 -53808 -111569 -113353 -51850 -13765 16428 9323 60912 89928 159045 168920 184840
17536 184840 269244 308739 268111 128995 211296 234154 157529 136818 39155 -18614 -16394
17525 -16394 -23636 -48960 -79957 19438 50245 4921 -15512 33475 -12618 137341 136603 16508
17513 16508 -17497 -6941 37429 21920 45940 26754 -17429 -27161 -64013 -61149 -50829 -60274
17501 -60274 10341 38455 -27025 -83562 -91772 -120656 -138240 -66562 -31869 -4832 -82842 -126138
17489 -126138 -64690 -104341 -139784 -133398 -110603 -195553 -182672 -173648 -91349 -31565 -39432 19978
17477 19978 53186 41489 15446 -59931 -84775 5243 -37175 3741 23966 -29074 -87872 -58517
17465 -58517 -22748 -16620 48606 70178 -6599 -15632 2958 -64339 -126063 -51649 -48197 -21562
17453 -21562 65833 127028 75448 -73164 -73138 -45607 127754 287818 257653 124817 92475
17442 92475 64042 42939 6261 65641 10386 47041 3499 12765 26888 -77569 13811 34196
17430 34196 59604 -4845 -91490 -33386 14029 -20258 4302 -134166 -145041 -127431 -9075
17419 -9075 9394 -28442 13685 83160 126512 73273 47293 -42156 -102741 -21171 83705 92262
17407 92262 60202 71791 95712 149360 110111 93724 62274 -8972 -117448 -175023 -110941
17396 -110941 -137159 -244935 -232523 -87763 21463 19278 -117125 -78841 -14525 63708 91289
17385 91289 26091 -40524 16075 109877 219683 231983 105204 -67378 -146783 -109397 -54542
17374 -54542 -16304 -11546 -12294 -12108 -48499 -157573 -163786 -84744 -26580 -81270 -98995 -99499 -126763
17361 -126763 -184686 -132187 -49294 -4324 -35791 -31839 -67003 25956 13038 -144650 -161207
17350 -161207 17133 72569 59312 1756 1662 42083 25942 43931 115854 192389 145810 137504
17338 137504 43337 45214 1534 24843 112029 119567 -47350 -149498 -186836 -112582 11906
17327 11906 57731 64339 12647 -79976 -78460 41131 107366 129486 73096 14268 -6989 51792
17315 51792 -50357 -66357 -53214 -45290 12151 -39806 -119660 -150980 -216071 -282708 -323358 -177201
17303 -177201 -54866 39889 37247 -6876 63638 17251 107912 86917 82555 4527 -6915 124641
17291 124641 184148 33898 -22082 -23774 -48470 -92418 -13093 -18129 -63924 6217 87020 78848
17279 78848 -19783 -27947 -27082 52947 17689 47493 138085 21374 23050 17167 -57044 -58383 91870
17266 91870 195864 131924 14396 17627 39239 64603 62252 21452 -32852 -145269 -218190
17255 -218190 -216146 -134207 -33295 -29692 -5491 -81917 -119820 -73785 -43678 -50564 -126466 -147067
17243 -147067 29267 76184 -17580 -95653 -145632 -124106 -82268 8426 48118 27456 -79239
17232 -79239 -111527 -113869 -25266 -49176 -54154 -127764 -96159 -103358 -213509 -127850 -49616 -113064
17220 -113064 -220319 -258071 -180187 -62555 2240 -13155 -53377 -158394 -177226 3112 139935
17209 139935 55691 -102381 -138090 -54583 28739 145018 112879 -55530 -35498 -14769 -49835
17198 -49835 -76400 -98213 -132885 -154352 -152795 -115510 -35470 -112349 -71916 -84715 -52742 -69872
17186 -69872 -70739 -95919 -152418 -181162 -186522 -127892 -84432 -104270 -16154 -66067 -64060 -93717
17174 -93717 -199599 -187720 -127433 -92929 -49297 17461 -46997 -24116 -6461 11384 81588
17163 81588 63859 16977 -11247 -99683 24670 108614 190456 244808 237986 228701 151918 24199
17151 24199 -79506 -89475 -81183 -163664 -188989 -115322 -59984 -72241 -43411 -44006 -135072 -67762
17139 -67762 58469 75577 18250 40078 -71902 -275931 -352023 -251951 -200425 -32302 183656
17128 183656 183540 151944 48113 -31947 13254 23408 -9937 -90728 77171 157287 139899
17117 139899 108591 59614 27102 -115895 -130613 -113779 -136952 -284966 -294432 -207811 -119834
17106 -119834 -25465 -25359 -16244 -30971 -14669 -29404 -74602 -168083 -106604 -28320 -105282 -142248
17094 -142248 -23001 79433 32044 11662 9458 62848 68876 -62848 -156827 -174666 -101708
17083 -101708 -81188 -70758 -112626 -154082 -148706 -155219 -40586 88910 167641 150487 129830
17072 129830 127583 102695 18218 -36989 -87769 -121361 -56505 -100718 -168948 -198839 -176149 -118604
17060 -118604 -78724 -73981 -33000 3064 -50211 -61642 -13846 30073 112469 208263 108750 147495
17048 147495 142518 4335 -187052 -293776 -209774 -151699 -60513 -28215 -47134 -123925 -103747
17037 -103747 -94719 -100708 -235056 -247193 -164383 -90491 16776 -53268 -148167 -170594 -128029
17026 -128029 -88799 -122364 -113458 -49109 -29035 -6108 -13152 -39309 -54798 -179179 -232772 -268980
17014 -268980 -256439 -140969 48882 201258 150273 232884 227665 130253 29861 43633 112100
17003 112100 202465 135407 26200 24022 18455 -38390 -11023 97968 -37694 -67419 -31736
16992 -31736 -41866 -57730 -21980 -141224 -219366 -157929 -90491 -80990 -43522 -73921 -93441 -29314
16980 -29314 50866 50822 67650 14896 -15400 44202 84555 -1091 -16765 -51990 -53253 -19654
16968 -19654 88443 129590 125595 223145 271812 160009 50705 22394 27311 11721 35901
16957 35901 56072 125975 93756 49652 41195 157 51353 13365 -58807 -6370 92385 40430
16945 40430 -93165 -61702 42738 123934 80251 40304 106816 147706 116412 111319 40331
16934 40331 -5103 -87106 14263 148984 89532 30435 -12791 72174 9625 -48498 -64015
16923 -64015 -36460 -48167 -50440 5474 22940 -82313 -42631 -68484 -95663 -150128 -252440
16912 -252440 -155143 -92857 9628 35948 -37784 -88820 -138620 -155080 -117157 -187280 -174882
16901 -174882 -112175 -148348 -167923 -223104 -227321 -111198 -75892 44422 86892 101244 107941
16890 107941 -18906 -174332 -184285 -111279 84842 96170 31311 103331 204099 192654 127711
16879 127711 -42201 -151401 -129522 -46437 35545 35223 14301 57948 12863 -52461 -99575
16868 -99575 -115106 24165 106303 107858 16624 -82135 -86627 -134079 -216803 -125840 -32547 39398
16856 39398 135107 93528 114465 172557 145385 76890 42416 -34305 -166895 -184435 -164398
16845 -164398 -164099 -103931 -93909 -41036 -84309 -81788 4771 103615 -5197 -117969 -164279 -31742
16833 -31742 11193 12643 65446 29628 -6248 -108568 -135635 -28977 35701 53136 36304
16822 36304 37882 40775 52015 77476 32719 -88733 -98069 -57061 -87407 -89134 -48186 -35593
16810 -35593 -23969 -59620 -40850 -5391 -4586 14299 84005 146218 122123 150961 112645 62822
16798 62822 -15745 -68482 -113414 -22408 81993 51005 -33015 -126828 -108730 -37960 -125989
16787 -125989 -235446 -250175 -253566 -272318 -229900 -113085 -29907 116163 100306 47579 -9027
16776 -9027 -59908 -10756 70295 -30050 -93088 -62230 -151562 -130246 -100649 -77327 -52774 -110707
16764 -110707 -54780 -64202 -147376 -122804 -13093 -90923 -4323 -1436 70097 26565 -83306
16753 -83306 -87035 -73288 -75146 -43540 -30603 -31211 -128052 -234832 -275654 -196759 -108017 -48850
16741 -48850 39683 190877 112441 26959 -47788 -76238 -37191 -13006 65821 39272 -48352
16730 -48352 58263 44374 -58257 -66494 -107827 -35948 -50394 -158043 -185590 -186911 -185529 -186557
16718 -186557 -187332 -96869 -18152 -42498 18388 53444 49199 -19620 -31094 -42627 -7988 -37216
16706 -37216 -4188 83297 -3172 -73564 -38406 -68255 1941 -21009 -58709 -50650 -90184 -76467
16694 -76467 -19883 -141145 -97041 -35635 -180671 -217036 -140612 -57936 -54783 5652 60041
16683 60041 -11961 -6981 70937 90596 72500 68014 19206 26380 2530 -55636 -155104 -208773
16671 -208773 -174261 -88126 -55709 15095 45067 28642 -29031 22704 -45635 -66570 11351
16660 11351 -101965 -95517 -88973 2010 40884 -66229 -81639 -92369 -75315 -42397 -95648 -112730
16648 -112730 -44106 -15792 -93743 -93223 -23540 -133113 -227205 -218231 -242988 -162730 -105728 -125289
16636 -125289 -158196 -217707 -183651 -188588 -219710 -156876 -52583 -22018 -29014 24344 93218 111492
16624 111492 211385 209157 185945 114388 13758 -32335 62734 51551 23197 6803 -44181
16613 -44181 -34413 -48859 -109608 -178331 -41749 -8924 43777 96184 72014 141649 25979
16602 25979 -13802 -22264 -62145 -18175 -87591 -76507 -49862 -103284 -66057 -78026 -49649 -45907
16590 -45907 -65309 -92911 19847 174453 110640 30174 -10896 99 42613 20861 65215
16579 65215 -5641 -36169 -79520 -37679 -142166 -125329 -124802 -184974 -181549 -145478 -258553 -263434
16567 -263434 -300260 -304806 -187567 -96484 23528 -47780 1935 72027 36741 73198 36113
16556 36113 46706 94382 51607 -30997 -75901 7674 -66372 -50667 5904 -42273 -67090 -38911
16544 -38911 -76438 -48794 -43588 -37260 21073 13201 -15459 -146610 -138404 -108578 -116098 -174702
16532 -174702 -202446 -187345 -57676 58256 63825 -70132 6950 -18045 -68482 -89041 -25722
16521 -25722 -53029 -61031 -61393 -30436 -56016 -120943 -103356 53631 163705 162221 99132 145983
16509 145983 50472 -58348 -259967 -291505 -169680 -120651 -91434 -106185 -197317 -182858 -45214
16498 -45214 -22517 -105404 -6026 35436 -184308 -155563 -69774 -119683 -108348 -61759 -36601
16487 -36601 -69477 -128890 -136419 -127136 -133147 -195737 -228924 -126591 -115144 -161695 -124691 -49396
16475 -49396 -81837 -172152 -101990 -23744 -64764 -70845 -690 61172 89843 -8360 -94076 -114598
16463 -114598 31540 140390 99368 62046 135820 199886 190229 153856 -60922 -2909 157619
16452 157619 225822 200851 131613 56548 -88418 -185382 -96253 14622 32526 -89261 -184849
16441 -184849 -200603 -174150 -107793 -141283 -106468 -70225 -42120 14642 -1937 -11108 -112843
16430 -112843 -136981 -84838 7386 -20076 -130146 -189357 -159607 -96448 -97990 -103343 -166986 -169941
16418 -169941 -149954 -37487 -87712 -135723 -144996 -57146 -20890 -108716 -181287 -127285 -30001
16407 -30001 -61933 -49853 -36016 -43897 -64664 -95534 -37332 7514 -39997 -103117 -13140 4281
16395 4281 20353 -14901 -79245 -69927 -20864 -4343 -6542 -56709 -134672 -84238 -63301 43836
16383 43836 122550 83917 136497 118918 -8312 -127057 -180067 -159854 -95325 100775 184387
16372 184387 112159 68061 100603 131701 27863 -34310 -73810 24076 133909 131254 47303
16361 47303 115850 168645 167790 33773 25214 513 -29270 -122904 -187235 -93650 24399 106250
16349 106250 104378 81894 104735 146061 177726 104718 -2424 -32211 -28646 19644 7252 -61595
16337 -61595 -76326 -30403 -30331 -61032 -30640 54704 29516 39061 -19427 -21789 -22412 1993 -2756
16324 -2756 -85741 -163750 -166482 -139183 -34590 103590 129746 105408 -16108 -16134 109871 77971
16312 77971 -61477 4662 79822 19084 32304 -4008 -66419 -96844 -64299 -85032 -127353
16301 -127353 -117163 11348 55552 -53168 -53084 -40657 -100835 68964 95547 -17590 28661
16290 28661 -92560 -87433 -50330 18679 18657 29991 7742 3247 34508 911 -48759 -7886
16278 -7886 72522 70547 84902 77382 -67053 -82203 -21468 -78675 -74088 -98900 -133927 -186903
16266 -186903 -259553 -271716 -266626 -217846 -218460 -235970 -279113 -252071 -262590 -204323 -119720 -77006
16254 -77006 -115260 -124510 -104571 -3480 74992 113249 32967 -80033 -112607 -169903 -232584
16243 -232584 -234129 -187483 -148859 -189619 -166079 -92916 -19041 -43267 -10702 49789 -62459
16232 -62459 -124858 -53060 10304 132589 165639 157546 156217 108679 11501 -6285 -54832 -61985
16220 -61985 -28825 64567 66483 67400 79511 -7175 -34482 49627 92749 114634 142658 118965
16208 118965 14592 -85414 -131379 -58276 20856 -43237 -162082 -164427 -180800 -155676 -41376
16197 -41376 28614 88634 192706 107985 -44865 -161595 -152427 -102841 -73722 24021 9008
16186 9008 18396 36823 98263 136863 56880 -11734 -17654 -58124 -94422 -112546 -62084 -84556
16174 -84556 -68233 -156863 -168658 -98428 -3066 22933 5461 -121876 -120498 59638 70098
16163 70098 -4206 -33738 -71272 -69734 -73957 -101337 -122632 -52062 64017 7576 -34650 -85390
16151 -85390 -76998 -94012 -202592 -109897 -156271 -164474 -143105 -150070 -93595 -124948 -156141 -110294
16139 -110294 -43422 -133506 -56066 4255 102854 145678 40821 -90323 -64018 -93005 -8138
16128 -8138 10521 -41823 -5512 -14840 85084 -30100 -71689 -121941 -11394 43642 17949 67494
16116 67494 66565 75552 81479 58273 -37405 -10288 83899 74492 84455 110167 29425 -20117 -82315
16103 -82315 -56275 -96721 -222575 -177859 -71155 19688 64500 40018 37305 61503 8509
16092 8509 -64167 -35440 -70567 -49716 7382 16892 -20500 11139 81726 169226 235080 212454
16080 212454 78623 64321 116912 78364 110421 15514 -123684 -178658 -181684 -194263 -193993 -30614
16068 -30614 54100 -50521 -138165 -137006 -195614 -207521 -103661 -13512 -69320 -182177 -247736
16057 -247736 -192077 -234924 -281086 -264700 -181257 -95023 -28021 64796 129310 15374 -193034
16046 -193034 -266484 -124117 -17463 -77167 -145444 -111111 19184 -15825 -129694 -97032 -8990
16035 -8990 31111 -22481 -35345 -44741 -80928 -105710 -170243 -276135 -269009 -130410 -121694 -230980
16023 -230980 -288356 -212289 -199433 -199943 -113407 -163820 -126021 -85063 -8648 -113905 -88351 -5740
16011 -5740 44313 21688 109614 19433 -108727 -96038 -98293 -5609 64496 127465 72961 -40002
15999 -40002 35947 -25388 -123313 -162633 -140853 -7912 -86155 -148299 -198796 -94560 -79695
15988 -79695 -146594 -252150 -81539 42373 53909 -23295 -88931 -81397 -103567 -115635 -97382
15977 -97382 -147736 -73695 -56786 -46407 -73288 -76397 -34937 4050 51415 -83032 -134557 -41480
15965 -41480 -77011 -131117 -102413 -60284 42704 81356 139011 107778 24425 30975 79540 100801
15953 100801 128527 110751 55636 91988 73771 65116 44894 56259 15490 -18399 -79292 -134978
15941 -134978 -106396 -81571 48811 129814 86178 -62120 -39197 79944 30614 -95873 -157808
15930 -157808 -90791 -87692 -66000 -94623 -125881 -129096 -184712 -229441 -174914 -137233 -143652 -87253
15918 -87253 -67316 -59045 20386 39234 59458 -20840 14483 161674 -31568 -203687 -265105
15907 -265105 -117280 -92215 -171500 -199488 -154888 -113771 -128194 -87758 -86522 -126119 -160065
15896 -160065 -167066 -35708 23310 -12970 -19071 -10979 638 -25833 5993 -77192 -91121 -9324
15884 -9324 2894 -81810 -89785 1297 23815 -50698 -178264 -149952 -130517 -55476 -40040 -92733
15872 -92733 -167290 -195046 -143042 -156223 -162859 -56126 11073 32749 24967 -68739 -49598 -38733
15860 -38733 -31558 71575 199853 22165 -94266 -92230 -118240 -160333 -164464 -109182 11327
15849 11327 121521 136811 -51271 -188581 -126108 -11890 -59421 -165535 -276376 -203315
15839 -203315 -52900 -39590 44870 52992 86742 -4930 -57362 -45977 -38494 -78178 -106477 -128583
15827 -128583 -210873 -118622 -141012 -223527 -285187 -265366 -132921 17965 25300 90924 116744
15816 116744 12897 -37819 -54826 -5949 -40786 -116289 -9215 84525 107078 73014 79720
15805 79720 -504 89693 23774 -20120 -37147 33157 -38260 -25705 58863 142937 79241 50252
15793 50252 71131 95239 -5723 8566 38223 -19542 -10940 80940 64447 72246 122951 81251
15781 81251 27870 52102 68344 -15277 57267 162794 77898 -4621 7900 -2100 28777
15770 28777 70290 65215 54518 -45805 -122023 -101116 -71990 -28778 -27459 28675 101035 74166
15758 74166 -4939 -114444 -200838 -162590 -55177 -35781 -3695 -7577 -5529 -77653 -121530 -114790
15746 -114790 -164348 -165717 -81682 -9037 42285 29375 -10007 -96429 -123163 -119077 -166377 -302232
15734 -302232 -214495 -118574 -63821 1072 109830 173709 168966 187754 99482 26855 47294
15723 47294 -28842 63183 96700 66442 68408 61676 -36289 -48392 -34586 159501 215921 109819
15711 109819 -5327 -120903 -80580 -58038 -19497 -23802 -48698 -102282 -163859 -80003 -23138
15700 -23138 9571 -48234 -103409 -182448 -85146 18441 -51998 -116881 -87672 -110138 -80697
15689 -80697 -78050 -66155 -12692 16352 -102864 -85324 -5581 -52834 -47751 -13972 -32633 -19605
15677 -19605 8527 49580 47143 -129467 -205284 -233585 -224394 -166920 -173664 -68034 68138 107615
15665 107615 67413 -90721 -121115 -20230 71969 84767 18678 -20429 9905 -913 -50050
15654 -50050 -70785 -131672 -62017 -79663 -169658 -158396 -86942 34496 5725 -50247 -35344
15643 -35344 -9442 -65907 -94844 -70484 -17181 -57962 -173020 -134560 -61613 -110352 -72565
15632 -72565 -64597 -58763 -41173 42572 13644 -85150 -97542 -26632 -18982 -59007 -69687 -85149
15620 -85149 -66281 -146562 -83830 -9190 -37879 -34337 -55449 -9299 -4325 -148145 -183683 -141847
15608 -141847 -11942 5881 -14744 -43501 45559 63451 79257 112226 88873 135998 162117
15597 162117 147896 67474 -3516 -107326 -92233 56505 111022 164716 106066 6408 -61683
15586 -61683 -117516 -68382 -32823 -13245 31311 16493 -18468 -17502 -7307 -1171 4109 -15052
15574 -15052 -4396 22897 129267 169869 130087 106072 73069 14596 -31281 -71477 -61266
15563 -61266 -35135 25524 -42214 -78536 -71567 -181779 -207271 -117875 -111338 -63176 -16265 102894
15551 102894 516 -13511 44850 8927 11606 -121711 -162739 -165549 -72253 -33963 -86524
15540 -86524 -153039 -157479 -74592 -50509 -184100 -242949 -148067 -3998 -56463 -71464 -87406
15529 -87406 1722 52651 117388 124841 69917 -1572 -37564 -52536 28531 113949 96410 95892
15517 95892 24512 -19646 44914 53919 45038 -23244 -99614 -95248 -83081 -90750 -186690 -260772
15505 -260772 -243677 -222740 -153133 -112268 -14582 81969 111823 101130 126754 125056 81989 86157
15493 86157 140249 114839 122517 66032 50811 5100 69585 71177 74322 44866 21995 82516
15481 82516 67544 -41696 -91181 -29114 -31786 22445 -20196 -33233 48464 184550 116111
15470 116111 -8923 -76629 -98870 -115655 -144117 -57329 52815 73533 71744 75144 -40064
15459 -40064 -42562 92043 151254 127464 103486 144489 113531 32697 -16324 21647 -23089 28171
15447 28171 69955 59678 -30576 -49796 -23141 -2057 6806 -52088 -15140 -27263 -20618 48664
15435 48664 -12496 19254 129374 28420 4084 -7664 -30573 -72659 -142916 -72656 59925
15424 59925 83451 123730 27632 74711 37609 80423 82905 108716 119939 148969 116095 88596
15412 88596 32213 88281 111894 130761 20775 16080 -69576 -137845 -198849 -124717 -47384 -10923
15400 -10923 87026 44363 -84470 -31416 98382 176220 196381 148105 -19574 -77325 -21218
15389 -21218 -42859 86139 210362 117542 34731 44322 7153 -69781 -46955 -19777 36408
15378 36408 88492 112737 102446 27706 47587 -35529 27672 55871 61846 42358 -49075 -87720
15366 -87720 31950 62356 162455 59001 -27579 32839 184599 256853 235306 230547 154200
15355 154200 182917 251543 263468 287342 182851 79707 40235 64831 54493 58945 29087
15344 29087 37400 101039 100973 125241 110630 68181 131471 156816 98414 53540 7929 -40923
15332 -40923 -73935 -48482 -122944 -100077 -34918 -23103 -11924 -25578 3148 103409 170193
15321 170193 160167 163336 124870 778 -45213 31609 32332 48701 102580 54221 -13924 19640
15309 19640 12165 34423 104192 78610 73495 83819 167943 167860 96720 12878 10303 19418 -34720
15296 -34720 -19795 38714 6725 23572 98964 140755 113636 36989 -69033 -41355 -19190
15285 -19190 -44505 14559 77709 86977 51013 -67402 -25791 -18102 -4449 35161 28944 49307
15273 49307 -36212 -82662 27303 53375 -4524 -62817 -11388 112231 125136 145508 208121
15262 208121 157920 95989 68091 135812 88964 47453 114583 144808 66967 129636 150436
15251 150436 34586 -5326 -10981 34837 38193 101813 129083 53562 13650 124318 182313
15240 182313 90739 14158 -67089 -73555 -14604 204091 186873 97247 28491 76865 93979
15229 93979 77226 138679 182878 107350 124596 83565 5537 19672 70487 32374 49386 67094
15217 67094 21236 -5686 -33891 -40417 -101940 -67571 64687 101632 73766 48743 -2573 -12465
15205 -12465 -24052 -57353 -86309 -101592 -15016 -24941 45226 36074 44985 84620 67631 63181
15193 63181 -66347 -128630 -71296 15922 51865 72535 -40625 -174536 -123433 78073 109165
15182 109165 127001 109543 20217 7858 -149238 -216374 -163718 -66825 21238 4444 -18573
15171 -18573 -64227 -100200 -92495 -10775 108267 138729 166254 163479 70520 10062 -115702 -210173
15159 -210173 -162313 -100984 -2648 71115 100070 21361 13047 53322 -44834 766 69538 79657
15147 79657 8907 -7824 35032 -5019 -30520 -67235 -94484 -70596 -8011 -89240 -189216 -263275
15135 -263275 -278439 -185749 -103998 -36790 45502 27743 -115055 -94150 -36064 10835 53584
15124 53584 82966 24952 -36184 -2190 110762 136244 167884 229464 127769 -20588 -43630
15113 -43630 -44324 -2044 -56242 -127717 -134378 -108553 -71034 56437 73750 66602 -16797 -54364
15101 -54364 -57997 -84096 -72709 -93477 -74332 -24928 -11854 -16969 49609 103491 -5971 -73465
15089 -73465 -18739 48032 100048 -22068 -84961 -106055 -125820 -57162 20211 -56813 -186706
15078 -186706 -107801 43508 35448 -4687 -101626 -67119 -52138 -55754 -122612 -119472 -115154 -36699
15066 -36699 -6258 -36787 -4680 -32093 -81769 -43526 -4994 -10022 -12604 -8206 -55648 -144002
15054 -144002 -151306 -109802 -76184 -81016 -96152 -30348 -18842 -9263 -5465 -31926 -3471 92382
15042 92382 113835 40240 -81482 -166132 -139697 -125767 -73750 -51217 44227 -9546 57930
15031 57930 147076 145119 131722 179700 171516 26424 58157 108953 85415 26959 -13687 -38945
15019 -38945 -1194 -33365 -26669 20665 9429 -149963 -182534 -113359 57827 137144 92391
15008 92391 77394 194181 191214 167060 78079 5541 -41549 -55145 84746 76619 -26508
14997 -26508 -86965 -46007 -32283 -6024 -32575 -44008 -119701 -114767 -38796 122525 130464 67357
14985 67357 55603 5809 -203545 -270742 -286152 -308131 -193846 -263748 -162567 -117670 -51326
14974 -51326 75890 38115 -98986 -238714 -246467 -148075 -8769 35081 81428 116874 11228
14963 11228 -29899 16394 -18821 -46646 -61291 -36441 -22099 -51468 -57163 -65700 -19365 11335
14951 11335 -19318 25629 37351 -68942 -156185 -250810 -161040 -114502 -164472 -187922 -181425 -131829
14939 -131829 -111688 -131813 -97480 -72998 -125586 -201533 -159423 -129734 -205912 -169935 -113947
14928 -113947 -59940 -68376 -144699 -160466 -92529 -26395 18589 -13155 19366 99478 81620 67433
14916 67433 82574 59442 -47061 -93890 -18076 -34640 34983 62379 37205 5040 50449
14905 50449 106772 41081 -66831 -156710 -207927 -125623 -96238 -67432 -39318 -60632 -22541
14894 -22541 -17192 10882 63999 88974 -70029 -120907 -44124 -46860 -71467 -135873 -161376 -174879
14882 -174879 -157836 -84780 -64235 -69270 4806 -87144 -168055 -107928 -202944 -213088 -90009
14871 -90009 -7174 -33776 -116422 -137179 -6823 60563 -61860 -33969 59019 155603 219610
14860 219610 210732 212673 245346 113617 16293 27528 -21158 -83403 -84631 -71903 -73303 -69441
14848 -69441 58704 93830 67334 -18557 -47139 -8164 21290 26540 61467 11374 -51588 -96780
14836 -96780 -64204 -61036 1083 -3291 -11202 -75965 -218283 -245857 -220127 -130220 -101028 -79199
14824 -79199 -99625 -197989 -252316 -322923 -256080 -161841 -47901 14156 65981 75343 14073 -48190
14812 -48190 -96920 -115141 -115697 -179441 -101084 -48396 -20494 33811 86362 108541 18094 13073
14800 13073 -27362 -4138 -62987 -82026 -40160 -12361 -83372 -74813 -106190 -184675 -150899 -148314
14788 -148314 -56084 109422 94157 -48925 -27921 -6456 -30794 -63690 -66952 -75874 -136773
14777 -136773 -136443 -8353 130044 158558 70291 726 -18012 -24943 47773 93386 103881 -22563
14765 -22563 -30994 34434 51418 11439 77640 97746 88511 60826 -11288 42284 148136 127747
14753 127747 -29341 -2047 57887 67996 40875 125466 62088 7343 -58067 -39807 14316
14742 14316 16676 9366 -41006 -18239 80392 8722 -12140 -12114 8503 48724 97044 105828 163595
14729 163595 37470 -7571 15623 -3289 29429 64754 158054 182555 154356 139253 244233
14718 244233 240336 161106 96732 12215 -1060 18932 6384 47769 103322 91523 18259 109719
14706 109719 166365 259144 287298 299723 232434 230252 188207 134524 125359 69239 45106 -38646
14694 -38646 -73120 -109662 -89573 -8588 -57213 -25903 -19266 149641 118871 68773 29536 70588
14682 70588 84233 38951 -43115 -18594 18597 -47835 -66978 18859 3311 4921 -45047 -100660
14670 -100660 28767 52344 -15654 -28494 -48003 -100658 -73299 -45993 -19489 -61350 -51844
14659 -51844 -112606 -115825 -32679 -67556 -50219 -44073 -67130 50106 -12868 -20429 96899 94918
14647 94918 -27895 -130090 -90812 -28469 2747 -34213 55784 178381 185897 88472 -37194
14636 -37194 -80918 -50626 68383 22654 16772 61469 36740 77741 111207 42308 50530 85679
14624 85679 11133 -40322 51067 119873 31575 3089 56222 196564 247354 185984 106337
14613 106337 61224 106799 90879 120777 101925 73116 19399 -48536 -107246 -83455 -11275
14602 -11275 44441 48816 51056 101564 81568 55806 49149 -21887 23293 18647 -5474 3690 -59098
14589 -59098 -33394 -26337 -33126 -50535 -71153 -69791 -90191 -82076 33946 53901 26728 -59859
14577 -59859 -110246 -87650 -166565 -95861 -91702 5752 91120 105324 113371 -8086 -88511 -20626
14565 -20626 77336 86110 133489 112330 67432 76529 108731 79474 121511 128958 142459 50619
14553 50619 -26865 -42000 36562 36874 -10046 -62153 -81835 48854 67236 7941 -78682 -49664
14541 -49664 5418 -12593 1675 -48078 -65486 23997 84633 43865 13562 14568 25082 -26877
14529 -26877 -26213 4707 -13482 26122 42430 10372 39665 25570 -35073 -37607 -76530 -115415
14517 -115415 -81893 -61882 -66673 -55744 -27346 -75558 -152411 -148639 -242227 -251964 -252540 -175988
14505 -175988 -33107 83999 109693 57466 84472 125834 75458 38339 45317 66609 -18110
14494 -18110 -17662 44765 47815 -13247 -48157 -24363 53619 35392 -19347 -53751 -7864 32674
14482 32674 64541 97411 193076 168817 188114 151280 135728 98516 -12216 -130929 -172018
14471 -172018 -157303 -100847 15646 74837 199771 203879 151556 171204 105780 24240 68453
14460 68453 85175 -31122 -95049 36704 30412 95411 160924 107587 17364 50033 105606
14449 105606 122832 139807 40921 -41930 39138 47246 18302 5486 -40896 -25350 81115
14438 81115 138947 112880 31502 19752 60728 39958 -17625 -20394 53780 108695 98685 65268
14426 65268 -10158 -23311 -39293 -139493 -249115 -220986 -113457 20451 -41755 -118654 -233387
14415 -233387 -155315 -73761 -86856 -46830 55832 93964 124505 40822 -45995 -97344 -64734
14404 -64734 -37727 -88906 -106916 -142405 -87340 -64666 -37387 -4 73302 47448 -30290 -11855
14392 -11855 6747 1757 25659 11715 -66858 -32353 -28396 15825 33721 -4552 13974 55361
14380 55361 130548 63862 9395 24915 84584 139276 -51232 -147704 -90808 -51452 -38458
14369 -38458 -59639 -49770 -57211 -592 30808 -41198 -155423 -120437 -5759 -17975 -115218 -201364
14357 -201364 -179039 -86703 13677 19966 60676 21574 -121706 -235937 -247581 -145217 -95497
14346 -95497 -102604 -114125 -39346 -55343 -117014 -141428 -182808 -236376 -188127 -68626 3950 -18305
14334 -18305 35166 57194 -8602 -105265 -105675 -119449 -117349 -120487 -94885 -45997 -14067 22116
14322 22116 -65171 -4943 -26153 -105870 -126195 -140811 -152060 -132451 -77052 -135009 -115409 -102640
14310 -102640 -14881 31377 7781 -108161 -97797 -40971 -39834 -171916 -98615 -66295 -139487
14299 -139487 -203854 -193635 -198533 -282113 -323705 -202173 -109500 -5227 4721 -47114 -57236
14288 -57236 -173730 -164346 -81796 -71549 -137288 -156554 -146301 -69416 2010 44439 -93739
14277 -93739 -125490 -105767 -141360 -134706 -84178 -31880 -34177 581 -124077 -183947 -220532 -165522
14265 -165522 -152918 -220751 -183422 -212171 -43767 61409 -23858 8290 61038 45186 21403
14254 21403 25390 39662 120137 190268 166639 27721 -56351 -65201 63252 198922 149930
14243 149930 61719 -18304 -34811 -38098 -73307 -25520 -38307 -51589 -54743 -174198 -190513 -114269
14231 -114269 -23403 42592 -29107 -21861 -27150 -49198 -67382 -116292 -90558 -40527 5765 59622
14219 59622 65502 59628 88823 55511 20896 -5228 667 21738 36677 -49307 -245964 -286285
14207 -286285 -252850 -124201 -37212 -125169 -185881 -10792 125933 47818 -21766 -143648 -151910
14196 -151910 -136475 -229552 -284547 -184050 -127530 -175894 -144091 26677 100957 110060 -7013
14185 -7013 -19870 73738 146762 46917 9637 28000 -49903 -56426 -27080 3474 -89057 -144617
14173 -144617 -157163 -140729 -53494 -45125 -12561 -3167 16030 -63500 -99340 -61114 4342 15648
14161 15648 5493 -150909 -199975 -129146 -196578 -237582 -291476 -227704 -199839 -181259 -132799
14150 -132799 -132030 -104677 -174133 -80753 15303 51371 20020 -6132 54230 20056 -138674 -160650
14138 -160650 -133960 -151773 -173307 -139247 -148369 -198342 -195600 -76626 12684 -2197 -2169 -50568
14126 -50568 -33159 -318 24148 -80357 -17800 101673 141592 88249 156414 93921 111115
14115 111115 41575 -56705 -24032 73807 83347 4323 20449 3535 -49793 -9379 2878 -27394
14103 -27394 -27026 -32497 -35972 -17028 23729 -7019 -75481 -215478 -187981 -79007 725 62568
14091 62568 16611 8570 -50297 -76142 -11137 -90823 -138129 -107732 -129422 -65260 -74784 -115136
14079 -115136 -74032 -59459 -65188 -83511 -83061 -113338 -81905 -159605 -200498 -43382 51980 -13209
14067 -13209 -100983 -169766 -50235 -78567 -90901 -77973 -178721 -158777 85432 126230 15243
14056 15243 16297 -19049 -147807 -136338 -98273 -102572 -187378 -137486 1614 15280 26608 -5293
14044 -5293 21573 993 -84399 -108768 -78486 -122571 -123753 -148564 -183201 -178939 -188501 -197203 -67444
14031 -67444 4520 13454 50132 254 -95536 -77908 -84999 -94801 -133633 -175907 -242789 -157348
14019 -157348 -141453 -232130 -152278 -88075 -564 61973 15379 -77234 -117277 -18129 62867
14008 62867 7517 15167 50686 -24753 -17648 -31407 33205 -30991 -180561 -230056 -169449 -81508
13996 -81508 -110589 -60347 -85485 -62051 -39421 -173059 -157941 -135770 -88897 -125077 -103564
13985 -103564 96014 88332 26782 -30836 -124479 -203147 -157406 -92146 -19129 -42174 -124732
13974 -124732 -174222 -229368 -179065 -47339 2383 4923 14322 57465 -84 23385 59455 15010
13962 15010 58419 78504 80475 136241 153481 70545 8057 8838 75373 121722 137165 86469
13950 86469 24875 14765 73985 73766 68271 78832 149437 189774 203258 114868 220511 363875
13938 363875 273216 83648 78690 53313 -3928 103201 145040 92762 141924 174816 161811
13927 161811 225188 167730 19324 -23509 32739 83893 71009 86257 153215 135410 95271
13916 95271 104188 103938 42473 11199 30032 14428 101649 123847 108175 166097 202576 160959
13904 160959 79340 58172 39244 -336 73687 91232 89686 2445 -16335 37715 33917 166777
13892 166777 152631 142741 119783 148425 172843 173671 111651 124288 29333 -60411 -102581 -62963
13880 -62963 7138 53078 -19561 -47752 38177 108343 25641 23762 29480 152429 240977 167140
13868 167140 58855 33677 -4316 35519 112865 180555 26281 -42365 41461 128033 185856
13857 185856 231557 170758 42037 36558 49648 58420 47089 106520 133355 63909 84955 109570
13845 109570 134572 109698 32324 52004 2561 -82437 -52216 7075 20371 36723 -3147
13834 -3147 -14846 34990 1610 -72767 -179538 -212420 -140757 -167162 -48337 28017 -16084
13823 -16084 -89139 -95200 -215660 -239863 -221528 -170766 -69249 -68629 -21851 -8342 23184 3568
13811 3568 -22398 -83484 43002 187996 123330 128984 36731 -81535 -82399 -70241 -16528 77990
13799 77990 106490 12534 -90024 -42766 23487 2409 -55341 -21423 -77537 -86347 -154820 -90749
13787 -90749 -56770 -4470 98277 13269 -49005 -35012 -74098 -58086 -8280 -41683 46046
13776 46046 180670 188316 156975 182668 147971 95255 144183 259613 205974 111442 60665
13765 60665 85952 15701 1638 -52709 -57413 50070 97048 106808 131505 101558 92797 197985
13753 197985 153287 38222 108571 148914 59436 39134 47899 85621 52316 21427 28795 -4070
13741 -4070 -47052 -60856 -58159 -49243 -25992 4883 -30969 3997 55154 87925 140871 171197
13729 171197 207686 233932 92848 59975 76513 89187 146430 44553 -2061 46394 -13619
13718 -13619 -90588 -28313 -166337 -172043 -131547 -58815 29920 -33734 -123518 -295110 -413004
13707 -413004 -397332 -264198 -162163 -39201 1139 -55539 -138406 -197698 -88394 -2011 41287
13696 41287 -42201 -110197 -136650 -309425 -252641 -98865 -108441 -76583 -54109 58912 -12850
13685 -12850 -111100 -230876 -269329 -201842 -268808 -200876 -115201 -90330 -53081 -5519 -5197 -48266
13673 -48266 1524 10783 38568 108706 98190 2195 -2933 71057 -3690 -15311 116 -37868
13661 -37868 -93874 -4595 55012 84018 10807 20441 99126 98786 72282 37522 24005 62884
13649 62884 -61417 -100959 -53502 -146970 -79752 -15481 38387 39992 -81915 -79788 -32118 11236
13637 11236 34164 1285 -104475 -80900 -105813 -186812 -171792 -21291 79432 -16402 -92385
13626 -92385 -148598 -101973 -95010 -99115 35323 116071 135408 41629 -11573 22462 10333 24358
13614 24358 -3824 62822 82627 24801 -24258 -20339 -21375 -20617 -43546 -12267 17590 -11401
13602 -11401 -10777 -16703 -22622 -46830 -19631 62356 -2787 -38879 -23750 48637 202134 172926
13590 172926 132556 167475 60170 -21881 -54027 -98308 -88557 -17329 22482 -58851 -48631
13579 -48631 -81622 -116300 -99522 -115831 -99609 -118138 -140151 -40805 -46745 -134953 -77081 -68031
13567 -68031 -103252 -119428 -87126 -88991 47292 72008 -48224 -180028 -229192 -262605 -253984
13556 -253984 -200233 -79441 -80106 -161778 -109161 -100221 -161674 -194526 -167208 -87285 -30289 -74423
13544 -74423 -173279 -129038 -66273 -70001 -140963 -139413 -84639 -177379 -194891 -215233 -266463 -174184
13532 -174184 700 33428 -28416 -36518 23186 50375 -6143 -12280 106629 126643 137345
13521 137345 8366 -35282 -91705 -118695 -59490 -70452 -77931 -38705 -14426 -2632 -35155
13510 -35155 -94142 -63051 -29558 19190 69069 11107 -13529 62392 143826 138704 156593 120739
13498 120739 42090 -36233 -53467 -4380 -53560 -72991 -128717 -149406 -70629 33143 58507
13487 58507 -27023 49679 31379 -128260 -243704 -65513 -50392 -118651 -116822 -86123 -99863
13476 -99863 289 55678 67021 -45392 -74565 -13819 -18276 -117056 -82320 -115126 -89238
13465 -89238 -56947 -82382 -143346 -183420 -89033 32975 29634 66862 73710 43851 3001 -97334
13453 -97334 -134182 -68226 -56669 -87864 -38761 4354 73981 79977 -39875 -96085 -155660 -212666
13441 -212666 -73941 -18208 -70276 66752 140001 144524 60197 -4501 -97006 -111718 27920
13430 27920 17158 -53470 -21365 42783 44945 88854 65603 -13039 45038 -43034 -70835 -85521
13418 -85521 -16905 81310 113728 121302 17097 -107296 57602 169993 114556 2859 81431
13407 81431 109097 117350 109961 -47933 45913 136752 159962 144764 183112 170159 118360 103932
13395 103932 98533 164847 201255 166760 132520 142265 91956 38277 -67276 -163184 -92311 -57508
13383 -57508 -23001 -38844 46437 114327 66499 -53777 28672 93131 41042 98258 64291
13372 64291 -22331 -28205 57512 99446 92925 24266 -9645 18541 54099 27970 -111792 -141453
13360 -141453 -78085 45693 112120 189271 179650 145510 128759 172192 170483 160674 32877 16540
13348 16540 14653 34639 44458 67633 156924 116409 100762 135557 179500 142568 71599 73821
13336 73821 148056 148998 77992 -42415 -106968 -84798 15826 67976 113738 94117 -15119
13325 -15119 -53485 -55664 17011 -20332 -144724 -195535 -96188 -89564 -221670 -244369 -134515
13314 -134515 -57254 -51069 -45333 -62223 -34149 72135 22394 -88474 -52443 -72152 -88080
13303 -88080 49790 77708 34895 -51438 -98938 -110397 -88799 -75619 -47962 -17233 12075
13292 12075 10239 -9260 8222 6849 -54520 -97761 -130753 -105083 8798 66738 92092 104807
13280 104807 97444 44761 9020 2129 -8197 5685 16945 -64301 -43925 5522 71398 55069
13268 55069 56577 32007 -12250 -32794 -97 -458 64023 77771 40282 -4173 -32626 -81642
13256 -81642 -14555 -82302 -105789 -119193 -139925 -74402 -78509 -23381 77494 40003 10753 -76206
13244 -76206 -34319 -6968 1883 26518 -47631 -51274 24505 -109288 -197383 -113162 -61623 -127929
13232 -127929 -66263 -1765 114860 147248 126193 103107 122297 152442 91189 52022 36403
13221 36403 30421 104611 83046 -47971 -154296 -12815 24056 -49302 -8251 30217 -666
13210 -666 -71609 -191557 -251548 -184678 -99045 -21733 35553 91847 37570 2373 76283 56130
13198 56130 -71692 -146959 -138321 -132349 -91806 -106434 -51032 -81610 -25879 83501 108139 54726
13186 54726 103235 117078 102052 108033 -4738 57652 99869 -23666 18341 115812 68739
13175 68739 -80006 -69113 -87204 -108685 -188835 -167482 -63988 -39392 -32396 -48681 -65760
13164 -65760 8763 -31615 -153480 -165999 -154551 -206057 -260506 -183712 -112513 -154627 -118122
13153 -118122 -18574 41195 29481 -48839 -735 2789 -34301 -101823 -87936 -209130 -210641 -47455
13141 -47455 23836 13104 41715 79081 98801 22439 867 62556 18599 -80023 -47527 -46688
13129 -46688 406 134133 189668 187273 137897 41662 56502 34850 51454 38807 4106 42287
13117 42287 30927 -35382 -25060 -21108 19342 61073 55363 17402 -41904 -74364 -92823 -197367
13105 -197367 -167280 -179848 -179572 -119024 -53806 3500 67841 106228 44456 -56050 25186 51729
13093 51729 72879 -3206 29718 42849 -13612 -92818 -71468 -27015 33834 -20924 -14040 -25876
13081 -25876 -35815 -47768 -92050 7059 74842 54460 60742 27193 84096 65583 53936 85887
13069 85887 89205 33078 -18743 -37657 -87399 -99526 -21556 -134291 -203195 -147990 -117304 -35836
13057 -35836 79294 -28850 -65943 -107467 -118753 -47730 77772 88225 48120 88777 -10438
13046 -10438 -12558 73849 119901 103887 58057 -16867 -34001 52532 89265 46640 351 81422
13034 81422 140783 26371 -119177 -126058 -8990 87723 47711 8947 100806 114132 127357
13023 127357 153851 95989 127126 140800 16611 -25992 11905 48430 164527 207170 147280
13012 147280 145193 193555 146604 119121 59893 -39195 67556 198162 283785 241554 185641
13001 185641 208309 184424 157847 170192 162764 47619 48428 127159 81689 98313 65728 37288
12989 37288 13147 54254 79831 71637 -73041 -222505 -214677 -262042 -169049 -14348 27606
12978 27606 39250 41656 26649 -27443 -91085 -140742 -106932 -18240 21078 -14184 3172 -23170
12966 -23170 -14577 45397 117367 106263 197744 179904 130331 -46022 -48978 53648 51727 65285
12954 65285 62050 -93673 4778 -28966 -9996 -47291 -137310 -239290 -186600 -119375 -60192
12943 -60192 -88278 -63478 1702 -71279 -68410 -33890 20856 -22881 -118361 -131776 -79568 5146
12931 5146 88739 13157 22176 -52265 4651 39992 4992 42215 -18243 -21638 -17743 -66899
12919 -66899 -55246 -37049 -16543 34448 89236 -20980 -148568 -26552 13863 -5828 76178
12908 76178 148692 43960 -114915 -128129 6897 110006 210436 89820 69075 34464
12898 34464 4128 -25489 -25761 46150 42442 66499 86274 72517 155109 286955 241107 72045
12886 72045 -17002 -102406 -147011 -76487 -96303 -159997 -127713 -76686 -35414 -7764 -39623 2252
12874 2252 18552 51567 112669 67934 141047 106796 74499 119005 82469 -67685 -49495 -24777
12862 -24777 -44050 -28980 42527 113938 155944 124197 34598 83594 127332 211986 211993 150011
12850 150011 16363 135126 197932 124408 75396 78587 36777 87689 126733 101044 100079 69269
12838 69269 48544 80078 -28049 46904 156595 189136 156124 -12237 -102126 -33295 112664
12827 112664 234582 149742 30319 -68535 -71076 22597 94270 67929 11695 -76750 -124619
12816 -124619 8716 74887 41450 -44940 -178614 -268539 -185332 -212192 -120274 -37242 -69259
12805 -69259 -108625 -126488 -142903 -45721 7244 23745 13551 28792 8636 60577 144393 201839
12793 201839 101752 62773 -6661 -65661 -90403 -109882 -170159 -156789 1481 49189 109664
12782 109664 154047 101636 -10741 -87313 -76540 -64988 -32125 -6917 21160 -3437 11451
12771 11451 39376 -16512 -48196 38224 62377 105273 83944 -54219 -109085 -3783 75225
12760 75225 109562 43753 108542 151217 112971 7333 87168 226184 178434 207772 142431
12749 142431 48450 -17278 -20997 2760 -10572 -67553 -56444 49787 129744 124806 51868 -50669
12737 -50669 -32042 -10378 5686 -75705 -60645 29710 39917 85523 157985 159610 18864 -24879
12725 -24879 -117558 -66015 -22007 -57622 -33390 -130189 -114097 3442 19182 -12403 10278
12714 10278 -11026 63836 -25487 -92354 -109054 -22100 37028 98309 97041 114314 115810 82844
12702 82844 13391 9845 99673 25439 -72542 -64642 -41002 -53052 -26435 -66192 -120023 -143812
12690 -143812 -116184 -112674 -71756 26821 -31927 -2940 6509 53564 107388 121901 162101 216616
12678 216616 212305 -23423 -91135 34685 37850 -1014 53342 9353 -63236 -98542 -75810
12667 -75810 -5635 38900 -5083 36556 82710 67234 -8246 -47546 -136775 -163005 -136104 -194893
12655 -194893 -208248 -162570 -156929 -150504 -95405 -61270 -97810 -75878 -107461 -43238 44544 -13002
12643 -13002 -286 -5813 25315 -3852 -48008 -163409 -122646 -140110 -111143 5603 87312
12632 87312 129838 136777 11322 35172 17474 53729 67478 44865 71398 97378 119189 150249
12620 150249 171643 147469 17297 15115 -11080 -88288 -12051 97696 122754 119211 84326
12609 84326 -85555 -151357 -105576 -7699 42504 36071 41400 15967 45155 63400 4109 -87476
12597 -87476 -81653 -91672 -139304 -123514 33863 64526 32568 20872 -24193 -21183 -5887 6640
12585 6640 -13912 -100073 3957 101747 137386 65124 24795 -1258 -14992 20914 48294 5533
12573 5533 -8703 31677 122208 173373 212267 166438 -57551 -54098 31288 49743 181462 240382
12561 240382 169335 144477 125967 20798 -10934 -30805 -32761 -43393 -89289 -103413 -143543
12550 -143543 -86509 25306 -7209 23894 70080 59142 21076 76582 92326 95425 94699 140344
12538 140344 137193 135200 139347 217105 234380 262165 249847 101953 133895 246869 181506 46481
12526 46481 23858 43030 3318 -36339 15695 6640 -22760 35094 15850 2799 43529 163471
12514 163471 89690 49666 -9255 806 8271 -25062 -34040 -7546 124914 156388 63215 40505
12502 40505 97508 33368 26103 75063 152161 125122 36102 -129522 -67518 34499 64775
12491 64775 12606 -12300 -17940 -30382 58085 145576 168600 155474 282324 396817 291853
12480 291853 236329 247979 177131 90625 81257 41710 56032 122041 186720 125844 209693 280303
12468 280303 280138 197212 41496 -81883 -81231 -11868 18908 121313 190044 257129 238564 241398
12456 241398 265778 211815 64723 15240 -40204 43118 59871 49677 -62575 -181640 -209243
12445 -209243 -77122 86203 131706 132968 142886 239855 232730 202410 158789 47178 47066 128047
12433 128047 235821 185151 1825 -71021 38082 142824 177114 212654 243505 136588
12423 136588 105479 164670 235240 223028 123962 145864 215770 126071 132855 113565 118502 191785
12411 191785 252513 270897 179792 105746 103961 84785 1072 32041 165988 185778 157415
12400 157415 236876 325548 337535 343010 297230 264724 299556 268609 240943 244569 220726 179915
12388 179915 121104 29676 48042 115648 147352 209838 215656 105338 -26833 -66419 31857
12377 31857 119326 203610 185261 170095 229110 369659 319829 328377 301890 306725 289493 348127
12365 348127 283684 259766 250364 188880 112127 54846 87850 114776 204878 246189 233819 343192
12353 343192 251056 156995 202481 219256 249290 162022 121848 165858 109551 93920 116686
12342 116686 169685 180479 183070 209119 258579 250374 244569 217911 238807 246216 156408 113296
12330 113296 150696 160391 150801 137163 135719 68022 -10913 -19763 -52389 -50368 -24905 78383
12318 78383 184771 292783 159228 155979 258699 259182 227217 170510 187402 283269 331469
12307 331469 341772 186652 81735 69856 153146 95821 -83247 78359 195086 141521
12297 141521 189234 254266 219646 176559 37832 -13754 25292 65833 96366 179815 200434
12286 200434 176797 165610 177010 161989 78701 47302 76099 78244 197139 241760 198024
12275 198024 126811 109035 76779 188177 196018 102512 142053 180229 204428 216003 235559
12264 235559 197344 152256 184291 219653 156129 124191 67911 122920 146751 153106 202002 258917
12252 258917 186210 119459 99890 138130 184578 128925 92065 221840 198456 151282 134809
12241 134809 116279 138490 116534 16341 2152 116554 230734 261603 299201 289573 286951
12230 286951 219251 172717 175456 175189 158887 157601 368679 457765 295715 253941 241640 250608
12218 250608 202854 162630 139778 130307 77624 -13745 68051 194143 210353 310500 283129
12207 283129 265388 263839 314168 235682 201113 231507 243253 196833 188889 163794 107345 242878
12195 242878 365081 324181 274030 168564 211419 230017 162894 124286 200804 236635 245911
12184 245911 212709 203640 238999 268723 276597 293194 283346 317164 390515 372454 331142 207105
12172 207105 251025 306357 206247 145703 174515 271163 368522 317099 227433 292883 339859
12161 339859 322001 292830 224705 209485 183915 179517 208212 178871 166199 173220 178324 214763
12149 214763 213346 399133 443177 373662 253530 214344 294549 277368 235010 169671 278383
12138 278383 353061 316525 292823 302264 293945 275531 166983 250081 337898 290736 229602 250958
12126 250958 341329 358473 325078 298435 210602 122965 -13042 20991 48253 3420 15890
12115 15890 178771 381338 351561 309462 265161 226505 302180 325800 305376 225551 300774
12104 300774 297424 340863 434769 371144 315551 277032 240007 383256 382512 316103 307045 322439
12092 322439 313562 263857 201304 137202 182505 207846 218815 233777 259589 236874 217535 169636
12080 169636 188778 246341 169899 164341 168794 246253 252877 205950 208533 202706 175568 139262
12068 139262 122063 199599 347237 358273 293786 259751 384233 453767 398827 442803 439321
12057 439321 442110 460371 419980 420480 549997 635666 529435 426104 419997 509854 594114 614814
12045 614814 528595 544498 500733 420881 408299 464034 539466 673540 731243 763022 797816
12034 797816 908003 886854 732175 688927 666969 618736 565249 614422 638165 695917 709766
12023 709766 746024 867373 974503 914632 850483 940557 923334 796227 839041 761436 650971
12012 650971 686981 804610 925938 1029437 1024192 976512 975076 943782 893737 957857 950778
12001 950778 966821 1040174 1018070 1137615 1239851 1340972 1467057 1380761 1334610 1304613 1296586
11990 1296586 1320166 1196915 1273923 1517041 1614956 1709272 1747400 1745203 1832573 1947748 2033326
11979 2033326 2082728 2157823 2387783 2423726 2423043 2529854 2511907 2653967 2912460 3048345 3235728
11968 3235728 3334953 3411323 3447326 3636773 3847279 4135563 4410662 4560073 4865383 5122940
11958 5122940 5443528 5784807 6160609 6550945 6969547 7475436 7915311 8341562 8760515
11949 8760515 9321222 10070817 10938307 11867675 12805861 13956303 15201660 16569808 18081076
11940 18081076 19906355 21914169 24215205 26841263 29881145 33460731 37423144 41859769
11932 41859769 46902500 52263403 57858363 63608361 69134065 74014916 77864154 80233370
11924 80233370 80897874 79811383 77144153 73296520 68708030 63554562 58280907 53109943
11916 53109943 48158052 43641865 39563190 35852743 32534429 29616031 27047837 24709407
11908 24709407 22737842 21031903 19450331 17948069 16763020 15670861 14648465 13648156
11900 13648156 12665894 11900516 11173882 10609920 10062217 9512328 8881669 8411186 7981506
11891 7981506 7651696 7399462 7071448 6632463 6143809 5803095 5703360 5502374 5368226 5083582
11881 5083582 4790176 4568601 4392430 4126955 3926821 3796310 3751976 3622268 3341303 3187221
11871 3187221 3134010 3048792 3027992 3008613 2888907 2722363 2602149 2524666 2521326 2458769 2330697
11860 2330697 2109351 2031671 2090254 2116809 2096315 2064929 2077016 2064826 1887129 1732153 1689264
11849 1689264 1668881 1646137 1620347 1496454 1300197 1256745 1350913 1292774 1194357 1252924 1325087
11838 1325087 1313021 1198459 986693 1057186 1069036 1041618 1063062 1061210 901096 766634 725263
11827 725263 845420 956660 872854 650369 580291 723785 868941 906602 886185 872147
11817 872147 818457 733419 618127 499991 499580 599137 838337 791171 704319 690036 689446 683143
11805 683143 746194 728640 705123 626344 560289 454495 402987 526596 660141 633974 557123
11794 557123 516149 499701 517977 528937 532297 509386 480192 463753 469364 399669 388042 461731
11782 461731 448924 381583 429944 528045 497660 519476 568790 556088 378985 299462 386316
11771 386316 433619 484319 381862 439983 399477 297912 312374 282763 341074 339021 246976
11760 246976 270195 264327 278243 271128 288787 210977 161246 103523 88382 190141 338264
11749 338264 257037 219426 211995 150085 85283 43250 200435 267884 305581 309441 275713 300708
11737 300708 297577 330126 353896 364792 389350 447561 450685 449946 382239 237352 60509 42225
11725 42225 139144 189530 256536 312123 368344 302871 230869 220619 204400 223142 280132 239389
11713 239389 164088 178637 280730 106690 11607 71221 44053 112708 203206 196454 124854
11702 124854 84479 85895 197138 138437 54923 86690 130585 181802 345002 360822 307018
11691 307018 331664 348387 289125 213586 130259 80721 38858 23748 64372 45283 124462
11680 124462 169261 162912 124684 60046 -25213 -121964 -104061 -8963 149192 170742 51757
11669 51757 3643 27329 96081 214222 122574 55044 110593 69792 -38348 45594 133806
11658 133806 170334 118512 110643 91772 79854 157631 110111 71924 177860 213327 160788
11647 160788 149159 155278 63212 116813 100164 77073 132377 26809 -17880 -47564 -51145 39131
11635 39131 -13021 -66364 9870 84776 61136 101603 191292 205694 120425 167310 223824 105858
11623 105858 17301 186 -62454 -12977 41121 10892 38032 84305 45448 -40074 -67448
11612 -67448 -15344 47613 -54662 -130519 -171313 -124731 -51400 -87975 -113132 -130422 -62225
11601 -62225 79774 111640 74936 36357 27644 3410 -6001 2366 32418 70612 152530 177838
11589 177838 179614 76411 -21352 -93122 -152122 -258 73895 61604 -44559 -10205 117215
11578 117215 157859 197809 186044 104937 76718 -19838 996 16865 81936 64997 19592
11567 19592 66954 20510 1046 38921 31778 15150 85478 155583 163707 145932 189520 200529
11555 200529 189238 121233 116663 55776 -24311 -27211 -8463 1858 25707 5069 -77410 -67128
11543 -67128 45313 73779 106011 125755 205172 250099 175256 53820 91251 194202 209237
11532 209237 138647 65563 -20331 39504 145730 100977 59952 89208 150606 208788 58056
11521 58056 1791 -55868 -1957 4547 -1402 -46237 -45689 38705 104337 41217 -44686 -66809
11509 -66809 -117876 -115162 -90196 -4996 58174 -2191 -86901 -110591 -26002 -3588 -64295 -176584
11497 -176584 -131005 -61953 6466 94334 119078 131471 119475 105517 51255 46457 -8088 -18887
11485 -18887 80794 100183 108164 98121 39112 -10873 97425 60155 40380 121337 233866
11474 233866 158560 169232 187241 201663 98688 104519 179383 221048 212231 95330 74350
11463 74350 44506 -873 -19998 -77719 -117478 -98746 -72411 -17823 -62886 -9210 71073 83194
11451 83194 24460 -75095 -4815 15620 -41139 -27125 -64711 -96538 -81508 -12808 -17835 -123102
11439 -123102 -158692 -190747 -154972 2854 15506 -34964 -49627 -23087 -51413 -13189 37406
11428 37406 6390 -21843 21147 99184 34918 83273 100677 113584 115299 55359 69991 79893
11416 79893 119918 99271 57621 34947 -9242 -1123 -7999 -19735 -166868 -110807 -55576 -166785
11404 -166785 -144374 -99584 -36660 -3964 55560 92148 44906 -35578 69191 58787 -7769
11393 -7769 -41097 22470 84556 48718 40963 -4722 58178 40481 66810 103021 52965 19237
11381 19237 -11930 69813 142341 175449 187006 166428 104904 74564 64955 128612 118526 1621
11369 1621 -85420 -27922 -82456 -74037 29475 -45061 -89401 7000 158327 296733 161527
11358 161527 68228 12885 -90085 -57218 -15562 20411 -57508 -80207 59426 65343 -41499
11347 -41499 -9783 -44395 -63060 -96385 -52130 9813 8501 119206 131160 90757 96009 106972
11335 106972 91855 2408 -25439 -51077 4649 139611 197380 151725 62226 89997 185749
11324 185749 196777 65662 126707 167227 137320 36842 -52531 -86650 -109961 -53510 26460
11313 26460 16057 -19865 38504 13490 -43363 72543 64477 10103 -28885 -117262 -84036 -11467
11301 -11467 30392 65346 130468 59805 9322 35324 -27132 52140 66560 75378 109245 62341
11289 62341 -40812 -26998 -9048 79768 99860 -28300 -59500 -40437 -16401 -86737 -35089
11278 -35089 54490 28359 80034 72476 9204 26833 59790 63175 16124 26926 79612 31078
11266 31078 10290 21612 126433 128400 116579 110033 116679 147093 111164 51839 145764 161950
11254 161950 129783 186039 154745 117199 46576 -19645 19240 108069 111521 168054 66451
11243 66451 -81688 -159180 -175514 -219249 -180342 -28903 -69840 -14060 62004 -24667 -81618
11232 -81618 -12525 89609 103000 106635 59945 -20520 19262 31010 -48336 -158221 -145291
11221 -145291 -39825 -27996 -135984 -107029 -106433 -36124 123164 159812 153251 36034 6844
11210 6844 -9690 -68785 -74205 -83470 -158296 -177962 -145042 -92027 -104810 8881 80461 63639
11198 63639 -6666 -105140 -16223 9487 36512 128924 152267 149114 126773 40575 -3805 -8152
11186 -8152 73684 66749 -31128 -85819 -18014 93475 146321 75511 96664 152301 193223 201336
11174 201336 97441 110644 128574 24341 51630 83768 179755 232096 155756 99473 141362
11163 141362 201299 183870 95482 61056 -53200 -115464 -67292 -20714 17824 -74071 -50690
11152 -50690 -14573 -18848 60810 65737 -54817 -122112 -224553 -201148 -103631 2945 -42146
11141 -42146 68559 80732 24234 -41108 -123263 -83877 -71687 20624 70750 134713 203730
11130 203730 205166 145355 115117 108696 145148 206549 230860 150177 211472 262568 145940 117865
11118 117865 200017 221245 128676 111569 204546 250327 184000 158214 159725 165827 142543 116782
11106 116782 73973 -19628 -6593 42364 44939 96680 59817 83122 181960 180728 145749 61858
11094 61858 8288 48797 93321 165249 149851 96684 62399 31611 -16 47295 107343 140620
11082 140620 164274 77679 117878 234627 300534 274542 251504 162863 205901 276185 251862
11071 251862 185803 179816 153605 173389 144104 157905 239863 202109 127703 167081 95965 87843
11059 87843 177042 64812 8453 74915 193136 233386 84746 42617 61386 60495 126212
11048 126212 106140 25345 46577 18661 -21678 52547 78394 124254 244516 282382 294971
11037 294971 323932 397257 473328 492115 494580 529726 540473 370183 357723 460325 535565
11026 535565 628828 757873 845931 895207 876594 755351 636305 638626 635921 622901 775015
11015 775015 907593 1036573 1162513 1051636 937975 874256 784192 641636 542886 434828
11005 434828 327583 507660 618480 635986 568574 630430 633741 461598 469808 527794 581262
10994 581262 570565 416557 520326 526095 374534 425040 429154 385130 280676 180653 191809
10983 191809 261279 166760 215318 292183 267100 217827 130242 92700 62927 62364 -32417 -65125
10971 -65125 -15259 14713 24495 23212 114534 146734 77512 164087 162148 126774 90881 95746
10959 95746 101624 89238 68066 61639 117634 307173 325403 240719 154613 188239 183749 99239
10947 99239 -14607 -2599 39597 165832 103297 -4574 39330 70070 3198 42371 101939
10936 101939 76405 41576 144088 136148 56349 22491 -29810 106672 188117 103176 -1720
10925 -1720 5045 -63098 3616 12445 -45616 -50485 41273 171902 240547 169257 162916 136117
10913 136117 137873 257416 354361 372951 346464 252228 37122 24312 117024 209692 32086
10902 32086 20775 94139 83681 75883 74128 103431 140261 207644 166144 192806 215054 277237
10890 277237 234487 186665 149195 112448 156934 183140 241747 300727 305599 288163 282560 323830
10878 323830 295793 237032 186341 242954 290448 219056 186005 203104 156751 -49794 -134000
10867 -134000 -125272 -131477 -71669 60958 27945 20253 23498 -101911 -50623 127117 271585
10856 271585 277918 263846 324808 291164 203351 195052 169505 121676 101747 86428 114015 192179
10844 192179 178921 152632 161897 233517 328907 345724 343830 327096 217042 247365 300093 310407
10832 310407 274505 156015 110969 71266 84544 15141 72509 34690 52386 109423 163322
10821 163322 151279 169696 134940 196781 314988 309381 145961 42147 93737 145203 155585
10810 155585 146061 229694 270202 213676 151870 118549 73362 140925 201496 136004 127383 152443
10798 152443 72824 56972 140501 212794 212390 206438 105439 28174 130029 174150 115625 133768
10786 133768 43080 -53179 -132613 -124962 -116184 -25865 -4804 -8464 169748 296831 382099 316748
10774 316748 132878 54983 30528 96271 146029 195029 135371 100206 40192 147853 201221
10763 201221 262079 230708 192668 303954 331043 330559 435835 424218 436230 502371 461958
10752 461958 311181 154324 144446 231442 378896 485060 557699 673148 873901 1034311
10742 1034311 1125228 1214982 1353971 1450185 1481642 1533035 1637179 1585114 1506739 1545780 1450216
10731 1450216 1218880 1072844 1007586 908667 892577 792944 597052 584027 681827 605322 451781
10720 451781 386145 419572 400349 338473 363866 376258 252219 198821 208222 269716 268427 396386
10708 396386 489490 455751 389478 240360 222901 261909 372258 338867 332864 380987 440470
10697 440470 463514 529322 525070 541697 445923 370606 403456 410138 398614 504728 546410 552991
10685 552991 466376 394486 438792 361697 293504 365895 443276 398544 278919 416333 605074
10674 605074 627294 529795 534419 620864 577894 525986 444009 612211 673799 590966 517226
10663 517226 454114 458645 547585 541771 548502 567365 536079 589648 681800 791237 826353 864596
10651 864596 742319 652586 735755 910315 1155218 1202714 1307309 1473877 1573153 1646643
10641 1646643 1842940 1965099 1837339 1731739 1683411 1577495 1543485 1604926 1630855 1726668
10631 1726668 1885744 1979055 2102954 2255109 2511028 2782366 3145825 3573457 3930520 4298115
10621 4298115 4556245 4770931 5200852 5752495 6438795 7396225 8675895 10184521 12310138
10612 12310138 15299470 19368053 24685528 31339284 38772133 45739251 50762959 53349410
10604 53349410 53698519 52718466 51690438 51813426 54205916 59676068 68776906 81488638
10596 81488638 96055558 108835863 116305761 117490767 113448396 106502590 99775999 95616529
10588 95616529 95722806 101160227 112110256 128045966 145887681 159865836 165307419 161424879
10580 161424879 149966327 134541216 119588216 108268635 101592748 100099011 103575610
10573 103575610 110956960 119343589 124733451 124028818 117224349 106023316 92815070 80457137
10565 80457137 70826977 64424727 61106441 60396901 61402484 62659831 62518070 60028340
10557 60028340 55242041 48772032 41569666 34748822 28964137 24305556 20734124 17909510
10549 17909510 15711499 14125507 12889279 11809103 10799522 9931231 9286481 8679877
10541 8679877 8115540 7378618 6822091 6446843 6033627 5800131 5579053 5319947 5025715
10532 5025715 4885246 4667792 4526696 4269276 4033230 3824158 3731441 3571388 3312486 3056858
10522 3056858 2899853 2727237 2611590 2555929 2449156 2230657 2100075 2067437 1998435 1925397
10512 1925397 2013083 1975652 1897956 1780695 1681641 1641833 1646775 1634439 1419558 1351815 1371541
10501 1371541 1333315 1283608 1251125 1163992 1002552 1007264 1009642 933318 806663 812470 822117 776072
10489 776072 758026 873023 847057 811974 788658 839652 821030 819098 792333 798179 822224 818766
10477 818766 754123 831820 942603 1042082 1029860 980465 935955 922685 866856 897126 913806
10466 913806 1007453 1031372 1120092 1259930 1384632 1470553 1397440 1399248 1347139 1405374 1427505
10455 1427505 1482694 1650877 1908239 2150794 2302307 2518098 2591519 2782875 2846067 2862275
10445 2862275 2702653 2536808 2515400 2458834 2192864 1927124 1775395 1630665 1602083 1607399
10435 1607399 1663171 1633267 1673099 1679396 1640752 1574359 1553009 1552588 1475516 1483382 1517734 1553177
10423 1553177 1516720 1445776 1400949 1393859 1432062 1545693 1610782 1602569 1693833 1779634 1810780
10412 1810780 1904902 1884566 1908987 2027160 1940813 1948136 2090748 2272881 2346445 2440575 2475886
10401 2475886 2547514 2593169 2534655 2482538 2416528 2378509 2323930 2212701 2263412 2375438 2433700
10390 2433700 2444106 2566160 2768332 2839745 2877734 3015848 3002758 3010998 3208680 3435001
10380 3435001 3626347 3805664 3997269 4211653 4435952 4596965 4816743 5132851 5462160
10371 5462160 5769879 6148194 6535228 6932166 7310385 7838864 8472124 9119818 9787968
10362 9787968 10741468 11835056 12968391 14212251 15527346 17001706 18714558 20707533
10354 20707533 23040030 25704840 29087751 33128590 37991546 43893115 51170991 60113557
10346 60113557 71344411 85415100 102933782 124565828 150487464 180466093 212669984
10339 212669984 244275192 271734501 292517572 305329095 308698885 301925539 285528688
10332 285528688 261657899 232907167 202392101 173020173 146601436 123952422 105122905
10325 105122905 89666181 77042383 66940614 58668504 51854469 46223722 41564028
10318 41564028 37634362 34340581 31527049 29156108 26859699 24886223 23246251 21728473
10310 21728473 20204575 18829572 17642837 16602546 15585857 14621055 13774477 13136244
10302 13136244 12452260 11859153 11335432 10757772 10178435 9635070 9199192 8822256 8490039
10293 8490039 8097280 7642552 7268397 6972880 6504699 6185582 5906570 5622193 5249527
10284 5249527 5022738 4750524 4610268 4537713 4307292 4094100 4065376 3967899 3803282 3638256
10274 3638256 3431834 3362790 3254098 3156632 3017802 2930335 2779542 2607755 2521990 2364179
10264 2364179 2357548 2346327 2118924 2046080 1998721 1982269 1940840 1971008 1841731 1812700 1853826
10253 1853826 1849338 1800381 1701369 1712724 1629743 1602472 1583047 1550089 1517235 1467299 1457356 1445718
10241 1445718 1460514 1406131 1342356 1317457 1373939 1273575 1215418 1186957 1213721 1182384 1160882
10230 1160882 1162967 1143838 1037528 888635 840021 785744 887339 890760 924898 963116 964969
10219 964969 947649 971947 968094 998703 1078042 1125135 1144843 1091111 902860 771326 771848 820004
10207 820004 871752 787128 724851 665072 650650 679491 797768 871390 1035704 998099 929221
10196 929221 916783 905514 899481 926615 967000 932600 902024 879831 1003172 1066047 1167091
10185 1167091 1356736 1373415 1430161 1524427 1555777 1596284 1596160 1449819 1318479 1212816 1197277
10174 1197277 1246906 1291577 1325422 1283652 1337431 1346419 1360067 1304293 1284748 1252147 1141483
10163 1141483 1171436 1300644 1462005 1552043 1644297 1814909 1779417 1599212 1595120 1667922 1664150
10152 1664150 1711105 1755045 1685096 1789305 1876613 1955503 1984308 1870027 1814265 1864494 1836251
10141 1836251 1749927 1612206 1598127 1686393 1639161 1748528 1780978 1912030 1983074 1995526 1865769
10130 1865769 1847151 1855899 1847309 1885557 1827618 1864981 1840687 1778083 1646855 1737842 1798660
10119 1798660 1872392 1849074 1851197 1785212 1822405 1963295 1934275 1924788 1897840 2008826 1980560
10108 1980560 1849563 1880843 1983510 2301771 2422048 2435591 2538347 2639703 2618097 2694450
10098 2694450 2911755 3014524 3012085 3111028 3417222 3701369 3852932 3952745 4240810 4501673
10088 4501673 4722423 5030918 5286650 5583593 5980939 6323704 6810221 7431029 7874251
10079 7874251 8473777 9264027 10291839 11430006 12660049 13934192 15403591 17030019
10071 17030019 18914688 20988938 23342857 26213595 29468691 33282986 38015507 44065956
10063 44065956 51792123 61792306 74977116 92258124 114528686 142458904 176098121
10056 176098121 214864363 255144273 288910793 312584896 328117485 333773978 325187393
10049 325187393 304306033 275214078 240411295 203943526 170371384 141675265 118057641
10042 118057641 99204423 84158657 72161461 62878383 55390482 49217129 44175294
10035 44175294 39921912 36210430 33050079 30196474 27807694 25623366 23610415 21728846
10027 21728846 20032269 18527053 17138345 15869594 14828281 13994781 13143026 12416476
10019 12416476 11834880 11248819 10689366 10062047 9524887 9080533 8793416 8399338 7919349
10010 7919349 7494852 7156126 6848285 6488193 6060778 5692531 5440130 5284676 5115841
10001 5115841 4873108 4631401 4400369 4117658 3885297 3691690 3451176 3237140 3127494
9992 3127494 3106696 3079084 3052495 3031390 2913565 2741213 2631392 2569223 2521689 2397523 2293360
9981 2293360 2115751 1971835 1945264 1928817 1825360 1746449 1786909 1670972 1561337 1468949
9971 1468949 1347654 1321476 1311809 1277532 1191785 1189382 1251641 1343109 1377278 1313137 1363174 1424408
9959 1424408 1402200 1317761 1310300 1260400 1232362 1155477 1100268 1163707 1244561 1270203 1280031 1220093
9947 1220093 1161435 1067496 1052841 1046108 1088676 1210261 1254921 1355337 1573345 1618364 1600450
9936 1600450 1625298 1730305 1848884 1964680 2146547 2289511 2496032 2676252 2735078 2647342
9926 2647342 2604981 2580553 2782443 3168745 3459387 3330595 2990388 2604824 2158125 1760053
9916 1760053 1425532 1238913 1178155 1115443 1073179 990592 953676 804419 691408 637710 715608
9905 715608 793603 800121 881789 919884 881963 824919 953432 1015232 974288 1005061 932199 884877
9893 884877 903535 828281 745494 653694 531611 522379 633461 674282 604685 491036 403357
9882 403357 411344 479215 452424 357197 260278 249850 304552 450125 556146 401274 264694
9871 264694 391056 393832 312500 230302 198193 198440 211383 94291 83687 82265 185638 159709
9859 159709 132506 158718 153400 110444 230562 363580 327130 205498 124810 150207 156349
9848 156349 138299 82311 113078 173185 203951 160688 140770 48702 44835 63387 78529 27368
9836 27368 -24092 -26251 9874 111103 68878 120967 151873 108247 163238 311359 336134 203154
9824 203154 83915 97208 154944 190689 80842 91241 142539 137122 198821 288139 252861
9813 252861 192366 218478 274295 317262 364753 433435 406464 349599 333750 318779 237004 209429
9801 209429 215841 270689 263842 130381 90110 177198 266076 186484 158295 177657 128107 19340
9789 19340 107938 232044 306729 215299 158058 117372 96070 149099 217555 162127 188981 185371
9777 185371 40542 13317 75004 116259 141320 117494 167352 218994 118438 34362 32835
9766 32835 36091 -7465 -32245 -57219 -30406 42377 24546 -53451 -13018 72669 82925 78817
9754 78817 15649 -1709 66637 139194 161005 138452 146533 24625 -107356 -72368 130249
9743 130249 265693 135118 20684 84114 36540 -47688 -166284 -90294 -35907 8951 -49453
9732 -49453 -116295 -28501 124034 151477 121502 62293 92631 115711 167348 64449 -3046
9721 -3046 47452 42940 27623 16952 16329 7229 -22266 -18795 25448 91905 121008 81466 112882
9708 112882 60342 51679 107078 73916 61832 166050 149493 148820 105725 113887 249785 277226
9696 277226 160655 100545 91934 18588 7310 151972 204365 44051 -67325 -71414 -86874
9685 -86874 -164120 -164091 -131283 -8460 84770 190138 227240 149200 82454 77145 158443 267449
9673 267449 257945 185955 132064 77729 86388 261657 260604 175796 229377 237972 404769 513486
9661 513486 494310 434637 485720 640110 770526 933325 1136891 1326010 1504383 1550806
9651 1550806 1667906 1718078 1702431 1703664 1686346 1703693 1535075 1320858 1188901 1028498 951107
9640 951107 787734 655241 526903 427708 336260 290569 258140 253761 191484 167733 261513
9629 261513 283004 146644 26223 31309 108082 153170 144145 148727 138459 163394 135039 127386
9617 127386 121664 105465 18625 16972 75625 75286 150242 308308 325772 295146 257902 247558
9605 247558 220608 215830 108500 105555 125490 128943 79661 124254 140875 131030 162131 228769
9593 228769 148758 81003 46300 24656 71033 55244 -4019 -40354 -75639 3775 156115
9582 156115 158519 -9112 -114388 16686 56458 127947 66243 45096 86908 29204 -95723
9571 -95723 -59921 12078 -2027 23018 -49902 -41318 -5888 65060 35840 32791 8193 -90837
9559 -90837 -68577 -23034 14705 -68628 -169938 -119501 -104804 -108372 17945 121839 34354
9548 34354 -50438 7488 -1736 38917 22722 7894 -5582 -71545 -87886 -62092 -2347 -17827
9536 -17827 2808 24008 33182 -42663 -106468 -65138 -56023 -80225 -35304 -45452 -79790 19264
9524 19264 96443 77131 -24181 -12424 14971 79562 99224 125426 151612 182125 46207
9513 46207 985 -84635 -158791 -61058 22647 -61013 15258 119297 191813 214426 177865 107351
9501 107351 128072 269742 278626 225350 197462 161484 88940 41510 60035 113281 215214
9490 215214 181315 23889 -74560 -147124 -59539 -56329 -80563 -131890 -23623 23813 -39402
9479 -39402 -107564 -177141 -108203 -20698 -13366 -64656 -33304 31530 111097 24731 16314 104091
9467 104091 52232 -60884 -64628 46911 146415 32094 -72874 -61774 -42799 -66739 9499
9456 9499 65415 95218 104378 86646 113680 121552 51644 18699 73409 65924 25007 45590 104559
9443 104559 87570 17226 88014 89029 41748 41093 112526 126359 76475 5502 -55381 -25923
9431 -25923 -46657 -113592 -131722 -70691 -28712 -92611 -26116 -45126 -35004 -79881 -161672 -163619
9419 -163619 -88036 57105 58945 -14847 35104 154575 245814 160162 138512 108396 -36460
9408 -36460 -53470 -22821 28051 12925 72605 179542 155383 101586 67939 99222 233039
9397 233039 295863 275569 183006 195601 234046 153727 62033 92473 109303 36433 29978 -28569
9385 -28569 17135 86868 81297 20970 35311 46734 -2836 63219 143820 158439 212271 190851
9373 190851 204207 213570 304155 265902 208064 166200 203109 151911 98686 129431 183930 119861
9361 119861 99810 155719 224353 253083 227159 152834 24642 41776 160153 206935 232605
9350 232605 250935 242844 321448 329171 324295 263926 282348 316704 361966 269559 253257 203587
9338 203587 276650 300242 231600 281345 389873 382337 424957 440186 417955 429761 394858 362391
9326 362391 268449 184883 228020 154490 60664 106025 119064 121017 30581 28666 132459 45604
9314 45604 25814 135463 143326 117104 218876 273422 362591 391625 353444 309865 267379 175473
9302 175473 101973 78466 46967 143178 165597 231436 238146 237248 234473 270476 289832 290429 277645
9289 277645 266006 247098 181009 170509 222786 275917 325892 386420 388183 374663 186468 9679
9277 9679 -80220 -84713 34253 172211 122531 38196 26510 -9888 41299 17592 -56431 65108
9265 65108 188941 134719 52445 -6220 2984 -29233 -5472 -51260 -28541 45190 80855 132568
9253 132568 50798 -145356 -169585 -67592 -21186 98886 86137 64358 90128 105133 150369
9242 150369 100697 -14335 -11178 17697 65179 114375 170956 179785 172224 34505 -52587 -35772
9230 -35772 12705 -16820 64575 136748 207654 166843 -53454 -113346 -72530 33730 112742
9219 112742 121470 66740 10636 19638 59414 33263 41824 65386 202621 170956 156606 13118
9207 13118 -61883 -39579 -18309 -22337 -81561 -28160 69005 195860 241968 213287 213776 162454
9195 162454 72458 96598 165984 239026 225459 180945 101821 119170 120082 56220 -23560 -105847
9183 -105847 -118079 -70171 -44104 -97916 -131699 -19078 21197 -16085 -78566 -63333 19649
9172 19649 49681 38119 35691 -6799 -86424 -76067 -5430 -42190 -127322 -104129 54618 34551
9160 34551 -4016 55589 -82525 -38498 56248 47109 57986 60046 87905 85871 -63158 -154678
9148 -154678 -118484 -39834 102790 215254 289624 189415 70383 68723 177560 110765 54332
9137 54332 74216 37226 74990 57725 -47681 -82525 -32223 -17316 -103646 -13846 31088 -132025
9125 -132025 -70799 92953 99026 36144 46131 18553 40586 -6533 -45835 -47285 -168538 -197653
9113 -197653 -142753 -146231 -190009 -135765 -73893 -49956 -35019 -135565 -145204 -97713 -22743 71827
9101 71827 176908 170240 98150 164554 174710 138374 73508 63245 118580 131231 74182 133551
9089 133551 120061 74707 -2552 69135 8725 39160 48094 101253 39284 36368 217828 340228
9077 340228 317512 135615 71939 39028 -37957 -97967 -93951 -62918 63379 81026 153436
9066 153436 117471 63737 16461 20593 -20918 -84479 -9244 56363 84899 78855 134327 52067
9054 52067 13545 -24768 -28066 -10923 54529 14554 -81969 -52223 -161088 -243363 -227274 -242755
9042 -242755 -206451 -148526 -72359 52966 127158 54174 -2333 -38129 -12033 -61044 -65379 -85929
9030 -85929 -40967 21387 -22251 -191002 -201744 -50114 -13876 -38306 -52701 -48892 -9146 41538
9018 41538 136232 214834 187757 247595 209960 124098 32157 -7211 39069 69050 37985 25824
9006 25824 -40642 90228 200691 201393 237056 179907 201961 195190 174536 73380 132884 182676
8994 182676 231682 189506 96260 102799 160547 232452 146364 -22239 -38819 -36050 75314 186975
8982 186975 169191 98407 -5223 -48835 -34980 -87280 -117770 -157312 -160143 -65917 -94218 -110958
8970 -110958 -43559 46409 -11469 27096 163438 56022 -45005 -36576 22632 -9168 -32202
8959 -32202 29407 113561 148362 84435 83363 105239 116867 36437 -44514 -31922 54611 126148
8947 126148 80886 -54779 -132790 -207411 -162204 -152037 -94086 65440 10068 -94639 -159325
8936 -159325 -129828 -50143 -115172 -104804 -43457 -65844 -62005 -27704 -38921 -139534 -188839 -93066
8924 -93066 -11824 -66805 -35126 -83755 -78643 -51674 -12654 71772 28715 -97954 -138617 -163206
8912 -163206 -142772 -41169 -45696 -91813 -106357 -148533 -164824 -113318 60492 135250 10174
8901 10174 -97842 -63514 15011 -8923 -57692 1557 28851 41813 6842 26415 162968
8890 162968 237960 171978 7546 5974 -13218 21122 136508 118930 143708 134876 113231 100993
8878 100993 -6614 40038 75101 -11595 -21174 -3760 73129 111830 113228 58414 109183 126876
8866 126876 201545 128188 68540 65013 63272 25951 93435 210244 195812 1378 -78606 -12956
8854 -12956 112280 188351 168383 164696 59763 -107465 -73072 33739 138533 79304 1262
8843 1262 26951 50226 84596 49516 -6658 19110 29808 58831 35477 -32686 -54165 -36507
8831 -36507 44341 78993 -43954 -149121 -104183 -91 -458 -75100 -39161 -10993 50456 96774
8819 96774 12951 102915 171761 122379 161327 177847 48508 73386 36966 -55673 -132017 -30425
8807 -30425 95257 178040 267662 299477 230666 229436 292820 297621 290505 197185 227103 204351
8795 204351 232112 236765 229015 139448 199074 130947 112968 197412 192217 134592 135441 140998 69535
8782 69535 -3553 -24813 -24146 50097 194371 220786 338209 350904 291221 199915 75230 54124
8770 54124 76169 74878 49432 89187 106295 126889 167442 162455 152970 180460 251439 262264
8758 262264 210544 185950 135988 112086 173971 165253 115616 150547 197812 262381 260318 403039
8746 403039 531731 466564 453544 397189 315088 420145 556854 754816 948563 1120935
8736 1120935 1305051 1411650 1410077 1388609 1317666 1239796 1002431 764271 708868 649657 635105
8725 635105 595576 519819 413915 464503 461975 426282 448375 539727 569221 550088 415686
8714 415686 336493 298424 312976 289747 309990 351099 350355 347048 417361 487438 461726 444490
8702 444490 451715 481869 437338 463642 560658 612944 666213 766672 855261 1055768 1186265
8691 1186265 1448171 1608483 1627714 1560656 1344454 1177923 1107173 1021692 928154 729941
8681 729941 593218 587357 487554 360224 353080 350718 232619 246141 302108 237410 112234
8670 112234 98972 185115 215183 195554 104006 84090 127727 165481 285849 295852 263889
8659 263889 211887 277068 293634 151533 127661 167234 105359 64556 45034 77194 81894 100931
8647 100931 166660 206630 298882 205212 160632 215473 231980 237730 206682 67530 40244 141147
8635 141147 161541 43504 -18324 -21301 31909 75563 56728 -6382 -50545 -62213 -107473 -63247
8623 -63247 79668 -18436 -56484 83200 76959 -13329 -25134 -13872 -40890 8784 100168 70492
8611 70492 40605 28543 77576 89150 34474 17706 -51145 -139958 -70055 31125 57758 124245
8599 124245 191895 175114 101536 -63754 -39052 58754 82946 57727 113690 183292 160776
8588 160776 92719 96705 56047 88927 168316 185360 140690 159470 183218 225629 290088 342994
8576 342994 328686 177267 100899 50448 41397 184465 322042 319742 322354 319486 278337 292524
8564 292524 199401 154475 147954 60347 106714 149950 208265 203585 163186 144512 118883 143808
8552 143808 183430 174537 167905 158238 190345 161050 159435 50090 -86037 -61418 35618 86862
8540 86862 127559 86277 110725 198389 233470 315244 243298 197738 192764 94255 -41399 -105098
8528 -105098 -30064 4736 -38097 -95300 -82816 -108089 18581 78716 46652 89893 68746
8517 68746 -20017 3459 11330 -15238 51830 58435 18231 70861 52399 105620 77421 45756
8505 45756 -41721 -32352 6306 32962 144439 178473 253290 290797 198581 123028 109712 97836
8493 97836 178266 156492 125200 65119 -20115 -50770 -30765 -68594 -101406 -202479 -133821 -19338
8481 -19338 21778 70395 142087 121294 111772 -29391 11600 88036 77025 62813 -10629 -12897
8469 -12897 -99308 -3068 129785 101908 9072 20942 166618 176509 166529 90576 -54672 -138918
8457 -138918 -86429 -11672 -11377 -34234 38119 78692 98464 56349 89173 43430 -22038 3030
8445 3030 60027 67761 10962 19729 91036 115678 148244 179101 126303 71989 32075 -5493
8433 -5493 -20519 92707 39422 29395 54055 3363 6402 10976 86902 48553 9874 20690
8421 20690 93052 37279 57437 31811 -23379 -73330 -65629 32750 40827 37803 67944 36400
8409 36400 13204 58263 60487 47586 80491 64285 75314 162940 62086 -68876 -110896 -48190
8397 -48190 20306 32739 -8000 -27567 22728 -88488 -120240 -23757 -11849 -66744 -27470 -31131
8385 -31131 -65400 -86006 -64248 -94095 -192247 -266426 -178355 -94200 -112055 -195094 -269060 -257712
8373 -257712 -221263 -76397 13417 -42253 -88585 22195 26725 62407 4443 34471 38060 5879
8361 5879 59350 -60703 -179337 -107298 25201 84048 20745 -65826 -58326 19068 73284 83314
8349 83314 81443 135145 197348 290549 330538 153717 -30966 -53658 -42078 -15126 -29493 -81212
8337 -81212 -152620 -85509 8439 127820 142146 56890 70116 68516 151207 216856 159471 41946
8325 41946 -3095 56349 72829 -11730 -102524 -195302 -106008 -46177 245 68606 -497 -77260
8313 -77260 21510 92546 7680 -14050 9382 -76185 -47268 896 -93574 -88552 -142781 -154562
8301 -154562 -120257 -35592 12965 -52311 -4292 51303 71929 86294 155276 209909 118741 40714
8289 40714 -19121 49526 88694 2333 -30620 21467 37420 -21033 -19314 -47851 -122210 -50023
8277 -50023 -72778 56198 77672 32000 26571 69756 29461 -112788 -206422 -141601 -54050 52700
8265 52700 114964 100142 92648 60255 31665 105942 61316 28567 -44193 -50521 23668 74428
8253 74428 60948 -71452 -17217 119388 192411 162623 96119 124090 -3696 -82281 28439
8242 28439 102656 178849 145143 116022 180233 87755 85778 49349 12860 -8124 63133 -38565
8230 -38565 -212860 -206147 -122880 -152203 -93486 -111484 -186893 -278273 -217991 -134512 -92130 -30951
8218 -30951 -27570 30580 2438 -87186 -97741 -145417 -169623 -151166 -141812 -158098 -147772 -49556
8206 -49556 -15287 -112092 -228854 -190160 -49687 -102630 2758 91801 98470 73017 72885 79868
8194 79868 151641 173848 140308 38148 -17340 -59243 -7489 -71026 -142363 -167006 -218187 -158542
8182 -158542 -93053 -94216 -90772 -91536 22691 50227 -31730 -66530 -111404 -46758 -12722 -91184
8170 -91184 -103284 -78893 -102359 -81522 -50571 19393 -10072 104661 118242 28045 10001 -13279
8158 -13279 -123699 -148923 -68593 -124675 -145821 -64088 -55591 -69937 -50480 12477 24194 -58201
8146 -58201 -46083 20723 79638 44966 -44622 -172171 -145244 -189423 -175556 -126213 -64133 -121619
8134 -121619 -206395 -137775 -122558 -174855 -202166 -123925 -46773 84802 94304 54624 70582 44699
8122 44699 -32927 -73424 -53205 1490 32552 -94194 -152918 -164097 -76531 -67733 -72387 -103923
8110 -103923 -142093 -123265 41033 96046 64657 52753 126184 61821 55291 29905 126065 84042
8098 84042 -22845 -68624 -58760 -45152 -12345 -33015 -55980 28534 -22725 -76011 -24276 8993
8086 8993 -39410 -52756 37244 -26293 -96481 -82964 -29511 -37660 -44646 131 51984 41256
8074 41256 28386 -30156 -101876 -99443 -181736 -164513 -108993 -55047 -96681 -90326 -74877 70292
8062 70292 123899 27713 4209 -46276 -107984 -125723 -29571 14201 75483 55084 33168 -25161
8050 -25161 -60111 45303 78512 83680 123905 24545 11676 32364 76371 30759 -50827 17091
8038 17091 53820 -22151 -68843 -124711 -114600 -75799 -52255 -10517 10793 12191 18819 37433
8026 37433 27558 85555 82616 61570 28060 -21647 12744 -48454 -117965 12535 116494 49860
8014 49860 -12138 7128 -27242 -11702 68991 117722 93525 -40813 -202909 -211149 -115846 -78872
8002 -78872 8445 49135 76199 63428 64769 107969 58602 38816 -31856 -143984 -129949 -57128
7990 -57128 26211 75802 49564 -35914 -117219 -25216 1852 -44914 -51623 -88010 -96592 -13516
7978 -13516 67879 89523 37981 18467 -51313 -75952 26117 41451 52319 -20098 -93188 -135263
7966 -135263 -62747 -25629 -57983 29793 39461 -19793 -47063 -79082 -132005 4890 111725
7955 111725 50283 -18763 -44473 -39731 -65801 -725 70395 136829 123411 60746 53907 -31897
7943 -31897 -62870 -118585 -54057 -58219 -67215 -95068 -75151 -56502 -93826 -109088 -58301 -63779
7931 -63779 -109732 -23181 -47234 -99808 -73757 -93982 -66555 31199 25066 7279 -13299 30293
7919 30293 72553 8673 62510 19635 -27974 -20980 -100757 -47827 125217 222098 152765 64513
7907 64513 50574 90160 74401 24011 -52884 -91123 -178418 -167532 -68742 31403 88434 28251
7895 28251 63935 32081 -11219 -30059 -48212 -75904 13029 91227 121073 91120 105332 123243
7883 123243 174023 116199 89468 123218 143887 56374 7980 -57311 -41930 -33736 -42249 -121071
7871 -121071 -166217 -164427 -182214 -187269 -54526 103381 133293 -5421 -34003 65054 13297
7860 13297 3818 49505 75195 88080 170342 159265 65038 260091 429767 408166 407714 578166
7848 578166 674161 675452 705119 694064 586809 543752 494239 364225 345733 271251 243809
7837 243809 126872 12525 57095 88679 97598 134716 77629 -4986 -60570 -60376 8275 65792
7825 65792 36438 -2768 15439 109290 172401 210438 291461 324224 265578 269363 366422 373207
7813 373207 342730 349578 352316 341331 444017 592563 643233 653819 796417 992274 1225877
7802 1225877 1435447 1486322 1484751 1340179 1163084 1009923 802970 562584 512162 511883 442551
7791 442551 316338 220057 245634 302332 224650 124987 252866 294581 329716 226907 111342
7780 111342 106441 91745 9874 58399 50621 -36783 -62859 9187 29423 18925 -11689 -98324
7768 -98324 -82068 -69316 47650 199752 209800 135166 113208 167126 227610 271801 279080 372163
7756 372163 563524 652150 684991 676886 691513 659137 671828 606622 503149 487411 414226
7745 414226 260841 175647 236473 142219 134344 32095 -9821 92240 110500 161542 112564
7734 112564 97963 184738 227511 176301 92752 21882 -67706 -115251 -56655 -25524 21266 -19426
7722 -19426 -82117 -43208 30223 23731 -25427 -1629 26463 63985 -94903 -81377 113563 115129
7710 115129 85672 165660 185014 128938 208624 221701 160534 126508 42308 49216 44613 17679
7698 17679 51791 41062 3171 39867 115190 27158 21575 -18167 -82601 6190 102320 98094
7686 98094 -24186 -111608 -42164 2859 253 7187 93362 92956 76171 -66362 -201863 -149010
7674 -149010 -20831 41872 24743 -53470 2205 63411 9391 32979 25025 11239 50260 120893
7662 120893 1010 -73765 39955 117660 2937 -98732 -156051 -139996 -19011 87513
7652 87513 31381 31321 131568 181208 163616 103983 56044 20078 76000 122697 76879 90581
7640 90581 168470 142473 -51885 -123209 -14241 13013 -6070 -75610 -17861 -54240 -161376
7629 -161376 -117451 -41400 -13371 -21868 -100660 -89344 -108124 -93644 -45208 -100373 -134301 -165454
7617 -165454 -190497 -243473 -206515 -86629 -28222 6829 87250 -9642 -96636 -12407 36261
7606 36261 -75674 -160291 -57945 -28808 -84817 -52641 -126427 -213645 -208883 -134827 -177575 -228899
7594 -228899 -98221 -82440 -86489 -21909 -8717 -134800 -215054 -156865 -73629 -157895 -294723
7583 -294723 -281267 -173878 -121221 -32536 38782 33852 -110497 -109928 4093 -16610 -104652 -192607
7571 -192607 -222678 -153448 -111946 -141851 -77798 -41241 -104971 -182982 -3775 64578 9126
7560 9126 8114 -11387 -1235 22385 -58646 -76134 14981 -17642 -153513 -78123 64570 83404
7548 83404 13613 13730 36699 40077 9787 53199 54757 -2917 -75393 -46399 16056 24503 60367
7535 60367 45966 -46933 -85297 -64809 -27991 31633 152986 84940 -33193 -7125 31872
7524 31872 66893 113306 86421 -12972 -101325 -180854 -134193 -55335 8194 92008 -25382 -66624
7512 -66624 -645 32624 56481 120333 103259 -108985 -120539 -159686 -228295 -301240 -247108 -161814
7500 -161814 -119348 -95027 -5365 38250 -48657 -216157 -204836 -123353 -191282 -87695 -105899
7489 -105899 -191383 -135246 -77685 -55390 -27151 28707 -54296 -49482 44440 69997 -124854 -202644
7477 -202644 -101260 -10666 -107567 -170686 -80967 -59336 -105440 -51698 -101950 -199098 -194316 -113286
7465 -113286 -124810 -124035 -116122 -104889 -122541 -153742 -155773 -137294 -125937 -205653 -152548 -82269
7453 -82269 -37006 -41384 -33278 -36727 -45094 -37721 66766 168409 122949 115025 151708 71605 115040
7440 115040 95932 -20116 -98809 -27331 -17661 -62580 -147545 -175426 -96024 -13120 37528 78884
7428 78884 59654 -33707 -28031 35856 13557 -29358 -68816 -151693 -163686 -215024 -179246 -107859
7416 -107859 16964 60651 109087 102454 50500 63590 16121 -4848 70751 32537 -3195 -50536
7404 -50536 -176248 -97114 -59425 -39584 -13874 -24094 -40390 -64969 59762 77957 -30919
7393 -30919 22984 -1694 -15456 -62225 13130 19140 -10339 -35120 -10876 -23705 -21524 -44367
7381 -44367 -83165 -32299 51543 112317 68535 -99702 -3345 -6288 -109478 -187491 -174547 -208376
7369 -208376 -161683 -104395 -114967 -129598 -175270 -162846 -222297 -209889 -166068 -144963 -143778 -85150
7357 -85150 -6683 139534 107996 -26447 -40039 3331 64503 38263 82767 145376 48010
7346 48010 -142183 -164130 -90380 -118783 -140592 -84969 -42397 -102540 -87740 -95809 -97950 -99882
7334 -99882 -32730 18516 89096 11310 -113718 -107842 -164508 -148940 -138527 -121233 -141481 -183087
7322 -183087 -200887 -206588 -171405 -184043 -148849 -168164 -154903 -41979 -16491 -149317 -156044 -108713
7310 -108713 -138155 -223624 -243449 -259197 -226300 -52605 75739 68956 -17004 -144424 -221969
7299 -221969 -172502 -123123 -84548 -103847 -116466 -185881 -169350 -80170 -154571 -187278 -160508 -137740
7287 -137740 -78103 7560 117281 45605 -129640 -191585 -149843 -113114 9422 26806 4998
7276 4998 12598 15582 17911 103956 117251 96611 156106 125111 23925 -69205 -51814 -38035
7264 -38035 92857 141390 21584 -97206 -40689 -40675 -76875 -39909 -43269 5264 -3682 36589
7252 36589 167882 119655 115926 83120 154258 104836 -34316 -2784 33112 74574 147528 38755
7240 38755 -55055 -44188 -45443 -67455 -135333 -125690 -12442 47093 61085 128756 103512 51679
7228 51679 32640 -92382 -65150 -16274 -12270 -25942 -62573 -98537 -55709 -88341 -191905 -157855
7216 -157855 -48992 7101 -32370 -23614 32618 36312 63437 96792 64924 -20963 -8702 98304
7204 98304 116022 -1058 -7963 115292 31531 -16308 -54470 -238 62867 72282 19357 41094
7192 41094 -33103 -16184 64488 67154 5290 -27999 65535 1462 85785 127474 159847 125665
7180 125665 43535 -43858 -20800 67140 66656 22799 -8491 16160 -6103 -27375 -114186 -200539
7168 -200539 -105285 -23142 -26933 95634 129977 130903 107716 98526 52077 -52058 -136766 -74467
7156 -74467 -81511 -129950 -134316 -180056 -122047 47833 85398 6994 -58572 -129007 -98472 -30413
7144 -30413 -2557 -16622 27129 43783 53077 68847 -17697 -181290 -156263 -79909 -1466 31354
7132 31354 60354 143085 135828 179486 205986 191070 98112 82662 164654 228306 165674 148360
7120 148360 76074 60274 50076 -92958 -98226 -94672 -72119 -124435 -58103 -14 -50499 -78674
7108 -78674 -95909 -46353 -91284 -111487 -118063 -114070 -125742 -108626 -109623 -204490 -99726 -28737
7096 -28737 -68871 -27528 42557 10587 72232 74802 -14474 34493 -13130 12152 144544 246563
7084 246563 191932 65661 33454 17584 -111762 -137905 -25175 115841 95380 118056 42350
7073 42350 -19521 -34535 -61407 5173 -28849 -115218 -152827 -236835 -186014 -82692 -31313 -14439
7061 -14439 -50554 -83454 -19060 -71788 -91925 -61325 31203 26171 57761 68249 47306 70755
7049 70755 20135 32372 120922 92541 2843 10209 69619 -42510 -123829 -114408 -56254 -41131
7037 -41131 -121887 -157492 -100892 15708 55110 -44342 -58220 -26044 -12319 15326 27186 10892
7025 10892 9598 8470 -80288 -79493 -75485 -109164 -97741 -34977 -158038 -166884 -128424 -93079 44084
7012 44084 28336 -33467 -161330 -323050 -339655 -236772 -99884 -65840 -95795 -79471 -152181
7001 -152181 -253735 -334680 -149009 22991 465 -67182 -72782 6161 48313 -37450 54918
6990 54918 -42124 -196146 -134488 -27949 40476 -14585 -30335 6678 73890 21906 37025
6979 37025 51351 38214 64750 63399 33091 51530 137728 90243 -31475 -36901 -29873 -9989
6967 -9989 11153 32860 2468 -28959 -121930 -118298 -166943 -126022 -63355 -133387 -152799 -132057
6955 -132057 -109735 -100313 -160737 -203720 -208044 -169492 -255820 -266651 -160541 -86329 12019 48548
6943 48548 12710 -37244 -6455 -42616 -50091 -87864 -73444 -36017 -71635 -23347 -102948 -111982
6931 -111982 -102776 -80601 -104502 -214588 -141075 -28298 -23665 7980 74989 65348 -1159 13892
6919 13892 88861 185491 277875 163725 133689 278 -80845 -44915 -28365 16132 34524
6908 34524 -80788 -125419 -198952 -213489 -177609 -52426 -69206 -107011 27304 44473 -45657
6897 -45657 -65918 -49162 -82656 -167650 -217330 -192821 -94898 32124 167978 164613 159645 183106
6885 183106 97413 -21467 -106617 -47383 76962 76023 -19998 -106428 -103380 -16949 -100986 -64739
6873 -64739 -27706 -115657 -139172 38677 98019 -56884 -176884 -200765 -123285 -41127 -22494
6862 -22494 -46804 -61129 -113309 -178844 -218969 -194354 -203849 -107210 -19098 48448 -48716 -92803
6850 -92803 -68221 -38625 -6988 99378 59506 -26465 -67378 -99228 -108789 -33387 10839 15393
6838 15393 -46857 -10779 -57057 -86074 -106209 -87800 -57863 -85166 40629 13415 21887 103240
6826 103240 -16031 -116381 -158499 -191653 -230141 -194601 -246832 -213576 -169703 -39942 -1817
6815 -1817 -93251 -125356 -201784 -146129 -60789 4007 -18161 -27234 -104405 -119163 11429 28825
6803 28825 19292 -20838 -70434 -23413 -12529 -64229 -52564 -117357 -195319 -110909 -90833 -51787
6791 -51787 65405 119760 4793 -47690 -23681 24907 55622 112398 27067 -49239 -50308 -91661
6779 -91661 -113884 -80933 -166651 -184539 -58377 -9085 -67013 -141622 -117856 -78030 -67022 -83328
6767 -83328 -71174 -115956 -82271 -102833 -96447 -36304 -130127 -136538 -133285 -116699 25204 72131
6755 72131 5365 -74652 -156865 -141153 -70852 -78616 -121385 -109695 -109090 -81886 -53292 -83942
6743 -83942 -95497 -18086 48859 98345 46236 -10285 -99420 -109102 298 103597 48399 -32965
6731 -32965 -6008 -43799 -156153 -133121 -85315 -147830 -137746 -76319 -103034 -147761 -253295
6720 -253295 -277388 -162237 -8235 -2370 -44988 -158044 -161446 -215751 -278548 -255821 -237715
6709 -237715 -90147 -54507 -76967 -29899 21304 -76770 -169161 -230762 -214990 -116745 -56672
6698 -56672 -74512 -170142 -153305 -162534 -141173 -82205 -8422 -130222 -171674 -143553 -170244 -201642
6686 -201642 -259135 -136782 -72414 -122280 -70486 -38817 -8216 58131 129894 35364 -11039
6675 -11039 49029 109970 98494 168745 110314 -8008 -34141 -66909 -70293 -159275 -118493 -116772
6663 -116772 -155732 -229481 -235069 -111501 -219487 -200763 -171823 -122686 -91561 34817 88910
6652 88910 39831 64699 -89439 -147972 -118403 -94089 -24226 -51654 -51335 72317 247972 235098
6640 235098 64149 -22901 101673 134705 129274 43052 -33092 -57218 -160879 -106511 82612
6629 82612 70511 -8106 101988 70131 -53098 -106378 -71172 -99967 -133336 -93467 -119025
6618 -119025 -92188 -129260 -203924 -111971 1379 19712 30837 63150 62409 78957 -36138 -97268
6606 -97268 -115313 -93493 -141150 -161085 -136122 -1144 -63241 -27015 25335 124630 16557
6595 16557 -94461 -103615 -2346 56610 27181 -1867 17029 23933 -19779 41116 46616 45884
6583 45884 104560 189437 226500 108345 39309 -1880 -18014 -19973 -37126 35198 104415 92987
6571 92987 3639 14220 -44130 -51302 -67114 -23526 -65100 -73320 -65834 -69294 -72024 -77285 -84423
6558 -84423 -52335 -8000 -25018 -12702 -32932 -30581 -101980 -91712 -15217 69432 133307 62764
6546 62764 32677 9892 74475 41411 96049 126841 -19286 -165662 -106920 73926 127354
6535 127354 87347 8815 -4307 41982 65382 74118 -8613 -53790 21939 22227 -26704 41509
6523 41509 108511 36734 47013 6331 110917 59121 -65505 -78172 -21624 64111 8588
6512 8588 -46945 -118824 -153053 -103439 -179225 -195354 -146149 -113660 -121943 -55521 47204 31169
6500 31169 86608 133911 127835 124801 113729 107569 193661 220268 192302 124607 82894 -34834
6488 -34834 -89614 -53931 49617 -51681 -86940 -25920 -3361 -37152 -27146 -86545 -159745
6477 -159745 -109892 -151258 -159328 14071 39109 -27655 -47936 -63076 -84678 -28176 7492 8573
6465 8573 13894 53759 55751 1875 17438 71227 110144 12127 -47590 -72463 2830 42626
6453 42626 7411 41881 29354 -26431 17723 50367 -19988 -53601 -43741 -125755 -102753 -83100
6441 -83100 -88535 -136000 -171351 -259422 -287000 -272256 -314119 -282063 -257860 -165544 -111271 -199838
6429 -199838 -217068 -119938 68073 57914 -88965 -146860 -157966 -110536 -65559 -95145 -101649
6418 -101649 -82131 58844 27618 -32180 -102847 -128131 -44344 -49301 -162868 -91363 -121046
6407 -121046 -238335 -271070 -181053 -120671 -97518 -38269 37676 -57385 -175503 -119200 -109145
6396 -109145 -87341 -24252 55991 -12375 -193401 -365801 -361895 -269348 -178130 -77135 -29307
6385 -29307 -67563 -64470 34490 109876 -24223 -130700 -188597 -235547 -304908 -362861 -375778 -332410
6373 -332410 -243542 -144663 -76496 -42003 -73529 -136227 -114305 -69595 -97947 -98099 -164003 -220140
6361 -220140 -205815 -178144 -118959 -119532 -31309 29461 46057 96842 107665 10590 -80701 47128
6349 47128 23548 -92819 -70051 -161256 -164201 -118154 -55490 -66304 -14291 84615 6325 -108806
6337 -108806 -11483 -15113 -6793 11954 -2937 -51201 -35105 -48487 -82440 -29623 23319 -16298
6325 -16298 -34015 -21493 -55346 -10300 31582 80499 23362 -75270 -80328 -86080 6682 9127
6313 9127 40221 -48252 -181371 -212233 -92113 -94899 -161655 -121076 -97999 -105892 -87929 -151129
6301 -151129 -112511 -101498 -181263 -184750 -116171 -126461 -155315 -136896 -155952 -70260 -3631 3706
6289 3706 -113045 -110871 -123267 -95438 -110180 -80942 44308 43543 23735 47792 82765 58749
6277 58749 60949 50925 88925 38293 -93985 -40405 83852 109774 33238 -25688 -80861 -47697
6265 -47697 -66614 -74560 -54434 -21508 -66399 -93251 -44882 1661 31978 15212 -64222 -100165
6253 -100165 -31756 -18926 33856 75267 122711 12480 -97955 -50591 92246 78761 66212
6242 66212 84930 118853 168019 93898 -10438 -42807 -37815 -119090 -131579 -118624 -163423 -54576
6230 -54576 11214 76159 76271 -42292 -60543 -96384 -96345 -88872 21246 84157 40482 -86533
6218 -86533 -106346 -35915 71224 181721 154706 77356 17917 30515 96422 179172 123259
6207 123259 105100 56670 13029 61699 929 -35473 -75444 -38120 6249 42689 1732 -31955
6195 -31955 19913 52687 16564 29856 68416 136737 260801 180455 98356 65898 29576 -27946
6183 -27946 18358 70257 47580 2988 -8512 -71579 -61879 35906 79692 88576 69399 50595
6171 50595 37825 50932 72941 -19703 -122893 -130425 -150405 -113841 -67748 14559 9804 9807 -21456
6158 -21456 -44312 24128 -26805 -4988 26547 -14495 -27175 -14719 -54060 -68087 -32796 -58182
6146 -58182 -111144 -104298 -31651 -90166 -169949 -213871 -184572 -102402 -12091 58597 82896 -5272
6134 -5272 -67416 -87283 -106801 -56826 13209 46014 77732 -10519 -69074 -29744 -2245 -83333
6122 -83333 -27611 -58176 -112985 -92150 -108358 -166248 -192270 -160728 -173306 -284174 -180426
6111 -180426 -17643 132433 88938 38676 -30434 -19521 53808 -34073 -59286 9605 -4479
6100 -4479 -2102 93626 112754 80428 42469 92659 120770 142044 49139 15302 11744 60079
6088 60079 105850 82143 -30993 -65179 2478 -11414 -41778 24708 126667 40469 -46327
6077 -46327 41466 76565 -25640 -55230 -67284 -58039 -146292 -98051 30124 37099 89617 32573
6065 32573 -6781 33041 42928 41021 73815 15509 -19638 -135887 -117136 -151991 -102315 -97871
6053 -97871 -36598 -74114 -114215 -43470 84128 132902 66363 -11136 90659 84526 18482 17477
6041 17477 -17359 -63460 -76105 -116008 -168687 -123808 -112661 -90304 -115433 -164899 -131633 -75024
6029 -75024 -136649 -153729 -277410 -174674 -90858 -165962 -193103 -181153 -114804 -22778 -59408
6018 -59408 -92538 -71125 5098 -58048 -121867 -100047 -113433 -57755 -171482 -213354 -144022 -124573
6006 -124573 -149214 -221805 -293945 -313706 -251083 -161541 -182644 -165091 -27602 63582 31685
5995 31685 37536 -16212 64789 -1097 -108685 -237157 -151714 -96431 -80628 -133211 -140922 -168055
5983 -168055 -191437 -98468 -66639 -129470 -67678 -24972 -75855 -96561 -107250 -90394 -193423
5972 -193423 -289523 -138492 -19567 -66101 -75690 3712 19954 8289 -69 35836 -26116 -61181
5960 -61181 -83611 -127362 -111557 -96114 -122946 -178542 -78279 33985 139060 63010 -16989
5949 -16989 -122564 -90192 -180987 -170457 -71058 -65142 55088 87326 -45501 -194056 -259194
5938 -259194 -114745 5638 61251 -85024 -79197 -70579 -75486 26148 59299 74758 61869
5927 61869 41738 34006 69117 43703 17158 84702 119236 75768 1957 -73607 1680 146586
5915 146586 228698 189468 95639 32402 8042 -1015 -27324 -6038 1029 69567 139633 199531
5903 199531 155730 134136 184035 78281 -66081 -80484 -104857 -158876 -135195 -70087 11860
5892 11860 74507 77839 115881 70449 -14748 8112 171585 209414 141535 84984 28970 -6779
5880 -6779 66552 8681 -96318 -142387 -210603 -204744 -147417 -38015 43270 -8418 -22433 -5815
5868 -5815 39717 77225 43778 -18674 14892 45142 -58039 -64116 36998 36763 -10526 -67774
5856 -67774 -89967 -45535 29516 -4786 -69989 48374 41675 -177023 -267990 -239583 -145652 -29229
5844 -29229 -54731 -66309 31891 103863 76632 -14127 -40466 32339 62131 126196 101771 94501
5832 94501 74534 -447 -60867 -70091 -41650 -50943 -20418 -16521 176977 247992 202097 140084
5820 140084 54841 6924 -969 37213 30857 15013 58321 80402 63993 -31561 -73626 55940
5808 55940 83149 51498 -31104 -75993 51879 76702 83175 23752 -118001 -82034 -9280 32769
5796 32769 7679 -4218 29100 -68580 -37376 -62460 -106807 -220947 -232992 -151195 -17898
5785 -17898 97964 36260 6474 25498 -49066 -73122 -13085 1389 -130490 -186856 -144411
5774 -144411 -59260 -56477 -86222 -35243 43397 -72700 -290508 -315068 -157068 -53160 -70478
5763 -70478 -21373 -10066 -40378 -129638 -126089 -63549 -94653 -117692 -122534 -121616 -96136 -140776 -95517
5750 -95517 -147043 -16189 122566 161190 121752 43065 -31370 -28997 10671 80463 58967 88806
5738 88806 17092 -112692 -170225 -185235 -111452 -62640 -66792 -40517 -48824 -36503 -110877 -73900
5726 -73900 70081 84784 -71616 -109644 -67690 -90276 -6286 -54 82578 80562 90182 104643
5714 104643 71952 13515 -49173 -97094 -52733 -35943 -26857 -88161 -105065 -26866 807 -6566
5702 -6566 -6275 -39948 -38261 -111736 -31765 -25521 -74166 -47741 -32855 15733 102525 129591 53025
5689 53025 -28021 -81422 -18057 -53907 -8443 -1516 76943 215075 156115 121621 116232 4778
5677 4778 -22836 -30405 -79270 -110256 -103375 -71968 35780 -12453 21970 43001 5143 63359
5665 63359 109322 56457 15439 22915 -120770 -154532 -62801 -47784 -36412 28946 -35164 -203683
5653 -203683 -224269 -135497 -64953 -53068 -91698 -111679 -187836 -192582 -82618 -11901 69605 89088
5641 89088 102068 141452 161975 157943 96932 31126 152401 106998 19905 25318 -75029 -24345
5629 -24345 -27426 -134462 -171902 -111141 -201070 -166358 -51822 -34010 -86276 -143453 -106729 -75283
5617 -75283 -170134 -180404 -83005 -83608 -65399 28961 116598 79738 23697 20186 56643 -841
5605 -841 95614 164885 159810 193751 75285 7244 19636 -21019 -8278 12259 50859 40287
5593 40287 13611 32834 -63320 -105815 -147067 -199620 -240549 -153663 -64982 -59017 -73823 -60314
5581 -60314 -77650 -135897 -4664 102290 157726 27249 -50605 50564 47952 67677 10210
5570 10210 -45889 -111081 -178004 -223446 -159483 -152722 -199381 -181726 -85963 -30814 64596 63488
5558 63488 33648 -44615 -115940 -131577 -199593 -164385 -105576 -70849 -1900 2718 79165 3262
5546 3262 -65435 -182592 -243019 -259426 -191787 -178185 -201180 -137096 -65604 -109008 -197944 -270100
5534 -270100 -182756 -105792 -15385 109425 98665 72088 67686 -27853 -133237 -150420 -189760
5523 -189760 -208349 -263502 -227351 -91786 63019 132954 98427 -6368 -115223 -123146 50146
5512 50146 63751 -54695 -20101 17311 -35011 -117559 -124524 -41491 120534 242949 174201
5501 174201 25190 -101509 -117213 -66046 -48364 41184 36035 -53879 -72714 -86445 -102594
5490 -102594 -82333 -2671 -75550 -205237 -202666 -228626 -181299 -152255 -83406 3029 30202 14641
5478 14641 -18764 3729 -14877 -16528 15858 86602 140764 174616 260162 232490 149110 -1997
5466 -1997 -61472 15979 22094 -67018 -106351 -121195 -93604 10101 -24241 -104475 -103267 -78902
5454 -78902 -82536 -195800 -126639 -159035 -126191 -129848 -120499 -191490 -218291 -88745 -1971 63841
5442 63841 153005 128327 19770 -60387 -93020 -172747 -56174 -28463 -38475 -10 64155
5431 64155 206976 204884 126216 74174 151235 141623 48015 -109908 -242647 -204972 -92477
5420 -92477 7881 80049 156520 124567 -24372 -59203 -48409 -58647 -59996 -84036 -111521 -65078
5408 -65078 -6394 -16200 -129393 -117972 -187782 -238490 -142795 14109 91871 -32076 -148538
5397 -148538 -160100 -143930 -179588 -82003 11486 30781 45284 9861 53426 63022 22160 -22992
5385 -22992 -76850 -38761 10270 60082 90759 -71090 -89866 -124876 -87690 -108952 -149273 -146471
5373 -146471 -88267 -88883 -115966 -106027 -38597 36005 -4507 -9848 -23145 1478 56429 -12572
5361 -12572 -57 10458 13229 104923 107920 79554 78704 -8410 -134207 -88973 71703 109661
5349 109661 214845 199893 -28933 -185810 -216119 -243275 -133199 -30204 -24354 11264 6637
5338 6637 -60863 -57771 -94566 -134565 -112835 -145886 -162479 -89309 43146 74318 -49045 -110004
5326 -110004 -41253 -106141 -94685 -61615 -86704 -75887 -71251 -88681 -153441 -108180 2196 55081
5314 55081 67860 122809 89095 85371 136129 77625 10708 -63168 -20392 -85186 -76453 -39385
5302 -39385 15657 11878 49298 92694 -23562 -82686 -159578 -191743 -114273 -56504 -23611 -14893
5290 -14893 -3432 -14053 30606 63076 -4100 -28497 -31525 -15648 -66639 -102193 -104688 -93895
5278 -93895 -131672 -49462 69000 134721 260407 138848 -61868 -70808 -3466 41694 57054
5267 57054 -21977 -145718 -142803 -150286 -24920 105574 140856 132104 91957 26721 -45553 -51228
5255 -51228 -82451 -101571 -17849 33672 -10003 -73238 -116329 -108187 -75816 -121828 -116502 -80299
5243 -80299 -168655 -175415 -137539 -73701 4021 59083 48887 -22603 5729 60486 -51910 -84366
5231 -84366 -98600 -191762 -267614 -203304 -99997 43551 120470 36133 14849 -11703 -24985
5220 -24985 -32769 -29087 -76752 -155425 -180894 -121374 -23021 15468 56948 27797 39689 -31354
5208 -31354 -28598 25255 -27098 -42473 -93078 -206358 -208250 -159802 -69929 -78220 -144693 -139467
5196 -139467 -79550 -124091 23947 68955 28691 -89043 -2492 196043 227832 155862 140321
5185 140321 79459 14508 -14175 -53672 -86038 -70301 -76500 -87121 -89104 -84909 -141191 -81280
5173 -81280 -46430 -76920 -131182 -171634 -218152 -151726 -4634 40349 60027 18627 39672 79995
5161 79995 80531 120975 95207 13992 38435 -15095 -88959 -96918 -101995 -8031 27260 53277 50261
5148 50261 -23059 -27424 -70508 -126044 -101583 6600 45636 37470 -35008 -31427 -33214 -145048
5136 -145048 -87158 35507 63599 7901 -35356 -22163 -85914 -7456 -20435 -66849 -96803
5125 -96803 33618 101412 52455 -21309 -11758 55748 55567 -515 -8813 -14388 65578 40284 -74549
5112 -74549 -95537 -81665 24044 174075 164467 88073 -23517 -78922 35099 -68098 -187817
5101 -187817 -197146 -108741 -101369 -146613 -52803 -70156 -105132 -59433 70960 94487 10395 17521
5089 17521 64227 76771 20825 -88714 -112009 -43499 -60760 -156786 -93601 -52553 -55729 -111960
5077 -111960 -157781 -88617 -38643 -91179 -107991 -63665 -11650 -66327 -58859 -4057 32603 119520
5065 119520 114501 89095 117140 108848 93751 13379 -75935 -54527 -47556 57992 75517 31208
5053 31208 67337 100778 102795 167442 173014 173112 53126 -12208 800 -61731 -63345 -67733 -76396
5040 -76396 -131010 -131728 -97784 -68111 -2227 -60302 -94030 -71581 -85283 -169518 -167948 -74292
5028 -74292 -76488 30355 31885 25435 39195 93014 15025 -52290 20145 -20126 -38551 -31552
5016 -31552 -72696 -47494 -17126 15263 109237 157950 29801 -74481 -12908 84156 43388
5005 43388 -21050 -23365 84695 157060 155756 58088 -261 -46214 -107418 -54157 -60075 -31816
4993 -31816 -19788 10461 -9527 -57159 -12508 7201 -27089 -7027 -31330 58810 174092 93099
4981 93099 -19920 -3012 7291 29778 121668 107892 78796 -33202 -62135 -85922 -75053
4970 -75053 -39275 17123 61290 107519 78746 -3185 -38717 -63707 -82251 -74155 -18570 94997
4958 94997 118547 118748 99477 14034 -42416 -29720 36645 75509 73672 41754 149459 193110
4946 193110 259254 262422 184612 109125 148967 163256 141055 -19439 -41030 53698 43272 107545
4934 107545 110960 85005 85763 -5725 -31303 2188 50606 61502 27367 37797 51363 61098
4922 61098 11821 -9404 20235 -62742 -73548 -26749 -52523 -88116 -140692 -162924 -131646 9981
4910 9981 23839 71771 192128 190645 158134 56327 5734 1515 42752 -58883 -105983 -113131
4898 -113131 -50635 -14924 -169547 -280885 -277155 -181269 -14241 160004 196256 101497 39196
4887 39196 84756 73207 66768 65711 97956 113618 178425 160973 125868 19966 -17953 -17221
4875 -17221 27364 43633 25266 18253 37927 91894 60000 17424 -4605 58709 98047 -12980
4863 -12980 -80839 -88166 -71195 36251 86913 21121 -40485 17987 39707 14269 17564 73538
4851 73538 245438 334611 251056 43209 19462 27411 -55824 -109473 -69845 26181 28542 35773
4839 35773 16462 -98645 -73581 -86376 -32794 -37308 -95305 -93685 -125292 -90133 -204797 -289834
4827 -289834 -128643 39430 -56220 -188757 -166320 -71504 -42690 -155784 -179220 -169434 -165749
4816 -165749 -110150 -101044 9926 150152 146832 119194 40833 69270 -24383 -60297 -55623 -132539
4804 -132539 -210737 -125739 38932 39996 -54064 -45805 37671 93515 68918 698 -13734 -84481
4792 -84481 -202958 -267996 -264746 -156542 -39009 331 42133 -49334 -69587 -131128 -84703
4781 -84703 -167 14368 5216 -46850 28528 11165 -78781 -78042 -114139 -86456 11258 15504 -21010
4768 -21010 -103239 -169414 -13261 77800 32197 -30056 -15453 -28178 -30116 -55382 -21345 7899
4756 7899 68290 -24174 -43443 -89666 -92324 -15651 12626 25297 -137295 -160338 -46630 51162
4744 51162 18400 -53020 -144893 -122601 -68467 -80517 38103 39500 23424 69552 -26033 -94511
4732 -94511 -71965 -54446 -142521 -92277 -153564 -104377 -181831 -194375 -147845 -82737 -77093 -13887
4720 -13887 -2267 -59524 -127620 -78997 -21075 -62573 -17675 -113014 -130785 -151450 -147950 -228291
4708 -228291 -295618 -262250 -141272 -105632 -178895 -103269 39632 153577 194912 154636 81157
4697 81157 13543 7247 23827 75290 4895 106618 71545 -57019 -53503 -21747 -36003 54432
4685 54432 123925 93415 59979 -61577 -109400 -122367 -21407 142202 218717 166354 103418
4674 103418 17726 20968 25955 -81473 -104759 -12425 -13857 39443 52310 -57461 -155177 -80042
4662 -80042 -128350 -185237 -168569 -132491 -104913 -108469 -198975 -216890 -217148 -231802 -57701 36682
4650 36682 -81717 -151023 -84599 75238 213343 248434 201313 144092 58370 14019 -20228
4639 -20228 39168 71740 186277 163651 -48802 -169411 -106493 -84099 -167521 -88998 -50841
4628 -50841 -53612 67415 145875 72066 123952 57285 -1417 -59134 21093 -51243 -113591 -55809
4616 -55809 12778 40864 -11630 -81448 10078 -4528 -897 -46789 -8516 -73516 2056 -29250
4604 -29250 -47983 -21594 -28177 97390 205883 238753 117938 65680 -57903 -51620 -127486
4593 -127486 -128969 -161697 -156673 -142432 -62580 -143529 -164065 -145998 -73930 -118088 -65546 11468
4581 11468 55034 -89071 -124872 -240897 -275465 -142365 -162564 -122389 -94788 22056 26336
4570 26336 94496 59476 -1981 -3788 34275 99401 43963 -10176 -125189 -140688 -135466 -152560
4558 -152560 -102875 -108783 -90821 -43160 -142476 -145384 -16012 16872 7675 25477 -3739 -14770
4546 -14770 89235 46862 56699 178388 240644 162574 -9119 -30715 9519 -24739 -42141
4535 -42141 -15445 14307 -4833 -63340 -79090 20824 36319 -12156 -109115 -105032 19360 5562
4523 5562 10100 113118 200818 238138 171632 169095 230941 162855 139574 100603 127516 165912
4511 165912 201074 223174 221026 235328 88451 80019 78299 41328 -16509 18942 154372 153567
4499 153567 18269 10909 44958 127321 139626 155831 174520 173930 122956 -214 -96047 -82886
4487 -82886 45018 93710 52502 96569 -26620 -97585 -84814 -37747 -76343 -153682 -142542
4476 -142542 -31718 43100 77385 43146 115642 155565 129458 75356 113075 180110 152631
4465 152631 132055 127531 132109 190833 116230 96807 50535 18440 -26315 -138448 -122094 -22492
4453 -22492 -53965 -102020 -67393 -107561 -122221 -137550 -125667 -33947 -31099 -36737 -27507 -96811
4441 -96811 -133974 -76439 -115814 -170459 -251064 -263228 -161855 -115537 -89272 -69989 -72152 -101816
4429 -101816 -125796 -94210 -91559 -85867 25580 136832 128006 76682 9493 13572 4641 45872
4417 45872 -44 -64286 -73282 -91485 -122427 -137770 -88083 -87387 -75384 -20175 -40168 -63521
4405 -63521 8124 54250 -5458 7049 27922 -22316 -32067 -124473 -64937 1615 -68490 -98118
4393 -98118 -164186 -195621 -223540 -116268 27234 8738 -122441 -136134 -76991 -63903 -62881
4382 -62881 -53362 -11320 -21039 -82159 -29221 45908 64955 123007 109303 137155 111436 58234
4370 58234 42766 72627 56241 78426 7556 -193180 -281691 -246967 -168261 -57827 -58420 -94159
4358 -94159 -91200 -83967 -116809 -98525 49842 108783 61035 22676 103040 98772 88696 58074
4346 58074 -75136 -140184 -106517 -86967 -167205 -217911 -123849 -46942 -21799 -14384 -131972 -171837
4334 -171837 -150776 -146990 -140208 -64795 -55634 -21618 22109 105133 147187 136478 46050 -39136
4322 -39136 -143566 -234004 -220394 -251660 -218257 -166160 -78323 -73613 -33476 -51520 -66422 -113065
4310 -113065 -20978 83286 60107 9693 -9346 -58275 -106036 -109738 -136845 -119826 -89322 -122863
4298 -122863 -68024 -70530 -132115 5241 -32350 -80319 -20548 23811 98588 91026 -47797 -170570
4286 -170570 -231419 -150905 -80196 6956 40674 63885 63826 16231 -60228 5326 64599 40488
4274 40488 25003 18531 -13435 -18800 42565 42848 -19705 -41551 -32846 -48177 -9721 4887 58211
4261 58211 39716 6136 -2946 65345 102207 27134 12447 13183 3533 -120000 -187446 -163874
4249 -163874 -102927 -60433 -171531 -164862 -141616 -100728 -55554 -78035 -149915 -143123 -163093 -178275
4237 -178275 -77742 -49186 -83237 49183 97772 59524 45327 17282 27075 43932 -85216
4226 -85216 -76333 -40176 -38878 -87490 -132422 -165127 -146156 -92324 -31369 -30105 -53288 14552
4214 14552 94767 146681 236235 206175 214649 148100 -21135 -57613 -12362 4159 2970 4244
4202 4244 -87146 -34690 15439 -58851 -83758 -80902 -126074 -167748 -132475 -120723 -67005 -133041
4190 -133041 -145642 -38494 43236 22899 -10457 -12391 37370 -6038 -74758 -108944 -44425 -17271
4178 -17271 -61636 -88625 -59435 50921 84814 54829 24735 -76449 -104687 -107948 -131216 -11390
4166 -11390 -74576 -141942 -152998 -121950 -98830 -114478 -84496 -79073 -134806 -48823 -51452 -112975
4154 -112975 -130054 -192700 -98460 -110442 -183581 -197323 -172885 -65805 -58101 -172752 -169732 -138772
4142 -138772 -142410 -139124 -45712 -73588 -51827 -37352 3091 80021 61782 -66089 -8164 -9123
4130 -9123 -27856 89 -5337 -38840 -12258 36084 130725 174356 219964 194940 107141 -56918
4118 -56918 -67689 -95005 -76569 -95505 -35228 -24932 -55556 -1655 26460 -5378 79259 96332
4106 96332 118401 146606 -63549 -95196 -58882 -95873 -70343 7184 90154 86830 -3033 -58184
4094 -58184 -57690 -2224 -88608 -20863 62248 29857 -11187 -20917 31602 33187 26675 3000 -77923
4081 -77923 -104793 -41187 -36637 10265 81368 121798 83799 -12683 -188390 -173059 -10283 80014
4069 80014 82169 82758 135177 115275 72927 4054 -74516 41247 30354 4320 -22480 -76254
4057 -76254 -167042 -177140 -135258 -102176 -181975 -258951 -171825 -117631 -86276 -8495 46769 145285
4045 145285 23355 16316 29117 8101 67267 98879 163191 161890 96811 10745 -75188 -145665
4033 -145665 -110513 -47055 53752 158432 132882 127816 127955 127890 126498 204340 143167 82812 90098
4020 90098 129941 106171 66155 69962 74089 -34303 -96984 -118546 -155937 -38236 42224 43132
4008 43132 -113776 -158593 -78595 -33368 -174780 -103481 -50084 -51676 -82987 -102000 -71951 -40490
3996 -40490 -85404 -130338 -161306 -110949 -80926 17014 54632 100191 26295 2306 -21161 -50088
3984 -50088 -159676 -131882 -139919 -181773 -61811 -45731 -28781 105731 35171 -17575 -93324
3973 -93324 -150172 -214526 -152777 -63950 -32024 -4382 -66369 -220470 -78893 54588 -49067
3962 -49067 -147805 -100812 -33661 7125 53704 73577 -3015 -28059 -67095 -175737 -115372 -81870
3950 -81870 -122233 -57475 22370 73754 63000 29244 7107 -11979 -26111 53787 54881 53593
3938 53593 54613 63452 109178 80336 74845 63358 123767 241896 171617 54426 -7491 105849
3926 105849 134258 132325 95249 -9194 -13401 7583 -72000 -136450 -176038 -198058 -159544 -95146
3914 -95146 -112735 -51805 49676 6487 -18557 14697 -51596 -54949 91835 59614 -12849 -50599
3902 -50599 -12859 20484 -15511 -1753 -14826 -18990 -78120 -99764 -50536 -31694 -121967 36003
3890 36003 104806 -26109 -103440 -57217 -83740 -64027 -12873 -47450 -155764 -137458 -7734
3879 -7734 6599 -16261 52994 77194 144575 121208 62015 140600 33694 10768 22918 45032
3867 45032 -6631 -115694 -22234 49655 90490 57639 51920 88626 89971 8109 -32560 -12023
3855 -12023 -30174 -14625 -27772 -2411 -81506 -90172 -8065 59357 18117 -17980 -52404 9267
3843 9267 9046 21718 63621 81452 89681 -9363 -51842 -75155 -76254 -27116 65132 100087 133540
3830 133540 110907 -79869 -140568 -71857 -14295 86815 131707 156049 64858 65411 45997 80704
3818 80704 101287 -418 -61390 -34327 -3512 -2632 23695 29179 26642 25536 65084 121821 189752
3805 189752 104945 -8452 -20925 -59445 -59279 -21380 41999 152101 186969 122578 145068 86026
3793 86026 15479 -61522 1059 40833 -25808 -86298 -57053 84902 130164 77401 90915 97376
3781 97376 125258 116790 71009 5665 -130740 -254804 -304097 -183946 -217301 -133094 -59574
3770 -59574 -2236 105253 58040 49419 70446 83095 49271 -27608 16515 24481 95539 171497
3758 171497 217551 173156 218958 164781 75969 30223 -13950 -56256 -69408 -20576 4949 49901
3746 49901 -5339 42798 11831 -159249 -138749 -101039 -104525 -23404 21148 -8518 25559 40384
3734 40384 182440 246882 114329 88742 117895 132646 42105 5659 -9804 -77730 -125559
3723 -125559 -92248 -16140 -64246 -98199 -142404 -116514 -123015 -123834 -96459 -14556 -84122 -154440
3711 -154440 -67842 -62007 -41372 -56491 -43580 -14864 -79521 54383 122515 216049 146135 -13208
3699 -13208 -20139 50634 -38115 -50820 -105482 -16168 15208 68749 29170 -29105 43440 30657
3687 30657 -63795 -14763 18805 61622 30438 22126 -46289 -84400 -55323 40426 98995 146581
3675 146581 160757 125066 143569 124117 103537 50 -29907 20267 -6886 -30500 -100337
3664 -100337 -230165 -193984 -108391 -54708 2016 12104 33524 9331 19825 -21686 -51380
3653 -51380 -39018 31677 108993 41566 -49073 -104730 -27082 -62810 -157173 -85057 42009 -27445
3641 -27445 33137 -13388 -158513 -211237 -232793 -141976 -15957 59525 70590 -767 -11373
3630 -11373 39185 -62834 -180892 -195247 -117002 -50291 -96200 -187816 -155442 -62217 -73991
3619 -73991 -56544 -48806 39305 79165 16728 -62293 -110799 -56950 -2021 42346 39504 129892
3607 129892 206660 216270 92399 15986 -34329 -18186 119846 311683 261994 188101 120067
3596 120067 91477 138326 108178 62227 32976 89525 144010 111507 72469 21203 -8317 4590
3584 4590 -74931 2257 66327 5780 55158 52206 -73111 -78119 4561 53018 123664 88203
3572 88203 52835 85785 57548 28551 19545 -16837 -1757 73678 202214 217816 111642 25662
3560 25662 44885 61556 89134 39480 -9481 -15276 -55808 -10856 -124584 -117513 -104880 -4734
3548 -4734 37927 -22054 -81032 -137166 -74174 -66641 -191107 -243932 -138517 -84989 -133209 -107851
3536 -107851 -96449 15250 36204 52535 94028 89215 56553 96194 34247 -10308 14034 -52251
3524 -52251 -123037 -47875 68009 47617 -48862 -29166 37009 31339 -179 66222 40187 38948
3512 38948 -4782 47806 115803 168398 44497 106378 102895 65832 16829 46888 82456 145218
3500 145218 190314 147356 7598 18714 -39931 83519 103370 78959 79979 71166 5478 20241
3488 20241 47976 -15683 8187 81907 100224 -72441 -107348 51368 63895 -31528 -89203
3477 -89203 -60088 -87613 -77796 -110094 -52422 -17809 27154 94709 118969 103381 44733 4034
3465 4034 26993 114278 52073 -48339 -46657 31569 32522 -6772 14061 110295 168416 183489
3453 183489 140895 77659 116169 10096 -162045 -203627 -180445 -155585 -157211 -174683 -98995
3442 -98995 -3437 -19050 -95297 -45189 45311 89141 49831 29837 60196 25099 113371 111744
3430 111744 45409 45075 -75363 -131084 -85847 -92943 -99658 -119382 -104541 -63059 -30359 -91941
3418 -91941 -98490 9612 29471 3058 -130256 -135994 -158789 -170744 -74366 -52907 -100737 -100169
3406 -100169 -27019 -84520 -104290 -16169 7167 111481 181985 80415 44559 63056 45541
3395 45541 -56643 9741 173658 211354 57703 -68281 -222381 -167888 40314 80691 38793
3384 38793 86136 175330 116519 49931 97910 124529 77225 95018 174836 132087 57298 -26764
3372 -26764 -94986 -137524 -164073 -68991 30504 36049 25994 -9256 24752 29841 -246 29875
3360 29875 67779 80797 -17454 1989 -10271 -9406 49787 57086 41952 67255 52418 -7058
3348 -7058 22055 60738 175298 111765 43132 10445 39962 9613 81685 134491 114454 119963
3336 119963 -85835 -161295 -76039 6409 87482 117920 -48375 -94784 -84402 -95468 -154251
3325 -154251 -95021 15141 91712 11834 30611 88317 97730 61614 103695 47869 63409 3748
3313 3748 -60208 -10505 -1519 -53912 -37508 -63867 -59737 -38375 -47746 829 18961 -37936 63696
3300 63696 151168 117722 8039 70206 102746 80525 47401 92723 34266 -25414 -34303 -78370
3288 -78370 -76411 -61008 -131329 -87378 -4770 4553 7298 68196 30823 -43205 -51454 -14134 -29939
3275 -29939 -75506 -48267 -15047 -442 155627 229746 61527 -29313 -63495 -64181 -108363 -64162
3263 -64162 -79523 -28636 29583 56553 16020 76760 228207 253537 134741 74097 69489 90369
3251 90369 88804 100861 -52182 11004 44380 15768 20125 44575 11744 -29259 -131058 -132331
3239 -132331 -187411 -112170 65433 150201 111115 79944 45170 100838 92934 42061 -103717
3228 -103717 -132550 -87278 -69695 -30507 -23504 33723 15375 -43665 -61783 95428 151079 80389
3216 80389 71660 53917 5799 -1626 56277 102794 -9010 -103076 -155003 -60850 -58651 -33140
3204 -33140 -125138 -117633 -31284 -37325 -21302 21050 49213 -80 46747 95513 122288 96739
3192 96739 138749 80754 13003 12865 -80195 -191799 -279391 -306807 -235544 -45483 -59407 -91711
3180 -91711 57389 111582 105549 100882 -66763 -204326 -209914 -201004 -153774 -160634 -158624 -68168
3168 -68168 13207 58066 131707 166806 84917 85648 49513 74499 24053 25225 -41336 -127250
3156 -127250 -140663 -160572 -117664 -84436 -68073 -178263 -261367 -260334 -184399 -68236 -28008
3145 -28008 74128 36717 48878 18157 85671 97292 89508 86298 141897 198812 152079 150927
3133 150927 78628 16015 -11651 -39615 -10638 14691 21004 -60482 -96652 40418 150185
3122 150185 87437 32641 89306 38036 -16391 -28067 61351 90321 9003 -118121 -75313
3111 -75313 25721 75348 127736 101419 115817 64786 114866 171852 95659 88189 27471 -33627
3099 -33627 -107574 -153351 -108922 -88653 -64130 11725 18242 -81951 -16012 79025 95289 -1834
3087 -1834 -33718 -39867 -6512 93568 27947 -24835 44728 187324 236720 224471 119232 -15081
3075 -15081 -13920 -54373 -43907 20404 12820 79007 20797 -95534 -114037 -29388 1296 -19861
3063 -19861 -98097 -110141 -80284 -28715 18371 -1154 60695 186585 126005 30652 -54394 -84093
3051 -84093 -84788 22242 54900 69039 -9641 -36915 -25077 -116631 -155377 -32522 18912 -81048
3039 -81048 -61910 17394 1991 4496 -43073 -18226 -5933 -66805 -33351 43468 46873 -15010
3027 -15010 -10904 -25731 25169 10096 19728 51397 92604 125579 102553 64559 -9504 -112268
3015 -112268 -110855 -43181 -11686 84170 172909 117954 126087 106177 66615 -22973 41366 76346
3003 76346 -18108 -10809 -30181 -88141 -102880 -43785 37918 11587 -7155 -130072 -144173 -86030
2991 -86030 -71995 -137618 -88694 -10517 34041 -42129 -22952 -16872 44673 131394 -18778 -135096
2979 -135096 -202765 -93477 36546 117970 67989 4914 35187 103794 111312 7060 -9895
2968 -9895 -97166 -122224 -43369 -19775 -28147 -70821 -46188 56324 51126 -17486 58526 55182
2956 55182 75612 136213 54806 130049 107525 45195 12654 57204 128188 90453 51238 6335
2944 6335 3591 172204 255211 266394 145724 -12003 -49576 -31439 -104196 -152235 -118660 -43668
2932 -43668 49085 99909 118051 61493 -41767 -85814 -16973 82893 -29379 -114120 -155136
2921 -155136 -154855 -72467 -76144 -22487 116145 166023 84987 18229 -74084 -59717 80021 121072
2909 121072 44156 -72975 13740 32185 -49288 -81811 -84325 -54772 33841 220505 217100 161019
2897 161019 102033 91261 -49107 -81909 -103215 -157902 -88935 112092 97385 119124 102768
2886 102768 65005 126489 122741 149859 149140 71654 43805 79283 31828 66082 52580 -3006
2874 -3006 52099 94815 92398 90339 81785 30661 113445 118061 37898 -77698 -78398 -45308 -62977
2861 -62977 22703 128266 12258 -31219 -80266 -122173 -149081 -73954 39018 45034 116903
2850 116903 104968 52771 129595 246992 238909 149220 58952 105758 179554 158474 85751 5928
2838 5928 32860 -7825 -51850 -68901 -18157 -17775 -35582 -77990 8243 167804 110435 -19047
2826 -19047 79810 50217 47693 118421 40969 -5938 30024 48283 106174 88714 96103 112009
2814 112009 77884 89135 145245 175633 -4410 -77510 -115213 -11374 26927 -59927 -104124
2803 -104124 24066 35079 91788 85682 97530 76214 32358 98092 95066 14198 116206 170280
2791 170280 125295 30954 29430 35583 86323 29279 25001 -77739 -100534 -89029 -71725 8126
2779 8126 -11155 -44807 -90879 -11284 -1643 -33292 -76586 -35741 -85481 -172358 -163472 -129029
2767 -129029 8771 -6261 61371 12302 -56499 -55182 5223 -74575 -135806 -141116 -86810 17297
2755 17297 59947 23651 -64810 -87922 -53312 34389 21920 -177225 -338260 -188303 -54774
2744 -54774 -10640 -29086 -117112 -211774 -205292 -102370 18182 -21584 63503 108728 172588 86163
2732 86163 -22123 11759 -23418 -44007 -12585 -3161 107128 97396 73360 76282 -15822 -55566
2720 -55566 -9837 57696 77471 56418 43770 79226 110223 50364 -54389 -90814 -2636 107437
2708 107437 22602 -69105 -63552 -135956 -118452 -74036 -1439 36531 5703 -94135 -158129 -86445
2696 -86445 -11809 76070 183021 224724 152883 61801 107139 106264 126839 133599 65782 91102
2684 91102 117651 218410 192478 157957 165211 -342 -99584 96967 221213 185766 62863
2673 62863 -82863 -160865 -179066 -160046 -161852 -114632 -60974 -37087 -101038 -13876 -74168 -125810
2661 -125810 -134063 -29881 12730 32697 57812 -3373 -70025 -11240 -88998 -97762 -69971 -136827
2649 -136827 -65301 -16833 12103 82693 156298 83440 7815 48483 20816 -80201 -28720
2638 -28720 5968 -93482 -71880 103204 201408 127371 157304 126352 95545 125197 208657 207257
2626 207257 317669 293550 146789 -58279 -18815 134079 138711 65543 63403 20091 -34615
2615 -34615 -66141 76400 232315 182740 191406 138182 -22312 -19802 -18188 -8298 65145 16112
2603 16112 32524 102684 159531 94487 90864 5139 -85711 -79895 -133429 -83405 -35817 19544
2591 19544 77545 99208 50533 51921 62462 52225 83314 74801 66663 20307 57892 80960
2579 80960 -1862 -41368 -80532 -126569 -58426 -9876 58919 72408 109616 96239 99243 89717
2567 89717 16091 -126590 -133441 -48298 -22802 35510 43555 22473 42481 101464 121152 79844
2555 79844 -39244 -122100 -58371 -51757 -67367 -93924 -159291 -128765 -109174 -105093 -93419 -43125
2543 -43125 -35679 -29200 -60789 -7706 51712 109604 68721 128274 266033 198872 86909 13310
2531 13310 99617 19108 -73226 45977 61787 4473 97374 118696 62608 -2070 19100 -20802
2519 -20802 -109762 -84412 -31277 109072 163782 123824 -20454 -15647 32341 -43755 -76098 46235
2507 46235 125017 126141 125735 79948 -21947 -81033 -26528 -10712 35864 41967 63074 41353
2495 41353 -34784 -40335 47171 121904 25361 76687 93620 37392 -19107 38350 -52498 -114185
2483 -114185 -135357 -85385 89901 106769 99707 38510 5852 66302 79336 136691 106712 38921
2471 38921 2177 -5743 17216 106977 125274 18160 1277 47609 135967 189183 146059 233631
2459 233631 275456 233384 134453 104496 84745 13380 113162 252393 292705 162155 25736
2448 25736 79392 66177 -50780 -93795 -10950 -14047 -103462 -77484 -96256 -45560 -14395 -4351
2436 -4351 37140 76090 63413 38171 26611 -15508 55074 130462 48096 328 -38999 -76547
2424 -76547 -33704 56929 115360 104882 67463 101374 110396 76051 69788 115365 88341 82477
2412 82477 97751 185000 152678 185371 203680 155551 117180 170265 110102 -27917 34247 -15037
2400 -15037 -19265 -78721 -114503 -176911 -141774 -126536 -126290 -8323 91078 45930 -40317 35791
2388 35791 40846 -18771 49302 24513 -46541 -128943 -37159 14251 26166 -54103 -244677 -338511
2376 -338511 -259592 -100173 -56204 -4069 -10318 70422 -37578 -150197 -43625 -1832 -16165
2365 -16165 -126910 -133591 -126381 -34586 -67126 -15236 -75407 -221299 -232047 -140945 -27856 110491
2353 110491 122418 183086 190697 103988 109797 193418 164175 98192 77050 -36638 -83222 -65260
2341 -65260 -97521 -47670 142293 131920 15347 1379 30949 59793 83977 -65550 -154940
2330 -154940 -81231 -95779 -81098 -55157 -66689 7718 50637 75435 -1665 -12912 30842 54758
2318 54758 59438 37756 -33743 46905 57787 -97993 -187979 -152494 -30598 -28290 24334 71712
2306 71712 42176 17096 22988 -19138 98452 121030 35653 125641 43729 -69936 -35215 17653
2294 17653 101530 123120 32118 -215982 -188559 -104738 -97356 -15175 36695 39692 100134 97359
2282 97359 317 -148409 -99452 3399 150853 251949 224515 184651 89008 -8375 -57406
2271 -57406 -116107 8490 38138 68489 137038 101082 126267 136390 204691 244382 261355 261225
2259 261225 131792 72124 74867 71769 95644 41711 40923 77009 166046 167733 139587 139388 76865
2246 76865 11733 -96561 -98714 -20954 49261 33766 -44801 -115969 -29282 -12547 -6534 102757
2234 102757 135464 180578 173852 110116 53694 3905 -61671 -56522 -113569 -109646 -86158 10994
2222 10994 80128 80222 64632 60926 25106 1700 45206 56297 29640 -88643 -93539 -36509 40616
2209 40616 71274 140416 213996 145044 21978 -46898 -119850 -94035 -132932 -174591 -205066 -217178
2197 -217178 -185247 -169495 -142596 53754 189641 171808 80529 -5542 -12811 11291 81575
2186 81575 135491 132524 75583 138751 37571 -72135 -14861 34713 25666 48188 100282 224588
2174 224588 266099 128292 73672 14708 45135 79310 51996 107209 149237 65365 42020
2163 42020 56940 148848 247815 243788 136488 130220 9619 -82579 -70526 -100263 -31826 23430
2151 23430 94231 178804 92731 30119 -18451 22233 -39018 -139771 -45830 2635 21460 78802
2139 78802 163523 73533 78249 66647 39587 32823 16150 14195 -3305 -91862 -118389 -47760
2127 -47760 101623 193285 142228 122153 38826 30224 89225 36321 37456 -1574 37499 66192
2115 66192 200583 222173 172670 121426 213279 154441 58204 56088 99607 114327 110456 2651
2103 2651 -120208 -243753 -189763 -140955 -35255 72700 76581 56844 27058 31472 56391 -66532
2091 -66532 -114001 -84457 -164763 -170840 -165293 12849 126487 101704 3459 -97676 -110427 -47117
2079 -47117 55611 173217 128844 50864 24196 85932 81787 34359 14642 -195213 -142297
2068 -142297 -25496 168861 140053 30542 26767 -19937 -9955 72853 27520 -7230 83429
2057 83429 29554 -15369 -39539 12081 35887 20458 -51442 -33732 -14883 56474 82761 53897
2045 53897 22329 30106 65828 3284 -1853 20708 3430 27677 37253 30362 43008 -7595 -38403
2032 -38403 68006 51717 -46770 -58314 -3410 -10832 -11298 -27127 -51140 -20895 -58214 -76101
2020 -76101 -28497 1130 29955 36824 62885 -3765 -34624 -1676 56308 59536 -36094 -157262
2008 -157262 -184480 -175719 -115074 -5515 33899 7109 -35629 -58857 -10821 -65023 -92881 -75920
1996 -75920 -118820 -87483 -9615 7119 -22448 -4430 27761 103612 98314 114884 99491 -1932
1984 -1932 -129586 -84919 -10677 5564 27122 8098 28197 74567 -3079 -122333 -67860 10888
1972 10888 96487 248165 162294 32166 -32861 -61124 31954 -5348 -62943 -107214 -59898
1961 -59898 -87209 -158419 -137490 -44657 -31983 -102435 -100542 11929 74425 28722 -27589 -67981
1949 -67981 -69016 -35978 -2291 50554 13452 -84608 -101153 -58337 -59189 -139631 -137918 -60221 -6963
1936 -6963 9880 20037 131549 161686 85933 82483 113570 81050 -84424 -75850 38444 33389
1924 33389 110741 221988 227277 128020 17225 -39278 -34272 5809 82047 134591 63640 -6474
1912 -6474 17844 9143 20628 42907 -29801 -75891 -96114 -54593 -72774 10824 20148 -20757
1900 -20757 -26971 -18373 -47225 -96886 -107057 -53836 -43123 -26132 -63528 16820 12982 -63471
1888 -63471 2177 89055 63958 62054 119149 46450 66421 62188 -21816 -142743 -99904 -22149
1876 -22149 -54870 -72640 -29934 -90176 -68604 -113723 -149102 -50655 -46236 -57062 -49739 37336
1864 37336 42861 -40813 -101945 68467 97758 -5588 -24280 57643 111072 73928 44583 11098
1852 11098 -50153 -96260 -53595 43794 -36933 -56135 -63153 -18880 -64313 -83944 53497 123163
1840 123163 97436 77232 78389 -19880 -12452 129882 197786 180946 156905 94964 74041 19810
1828 19810 23879 8392 80549 57863 -21142 16179 136502 57802 -10103 -125988 -207348 -273525
1816 -273525 -192573 -86029 -61597 -130621 -86625 8413 16079 83004 25551 -24976 -31289 16102
1804 16102 25339 -15946 -109341 -92138 -10955 -17554 -106031 -63615 7086 -86101 -201384 -261389
1792 -261389 -231092 -191819 -212401 -212685 -54855 22049 -29897 -49083 -12274 -39262 -53788 42999
1780 42999 39768 -44543 -70205 -89483 -28967 52008 41533 34546 -15433 -113941 -87852 43085
1768 43085 129644 72873 -13617 2960 37714 24191 8093 63081 49819 -29506 -21868 -224
1756 -224 4426 26042 32827 -35471 -51605 -7556 99833 50065 -54099 -128246 -155693 -116820
1744 -116820 -77980 -34892 -130687 -68324 -50463 29989 -2004 108992 205644 96923 -2847
1733 -2847 -39432 -65267 -14731 -37060 10169 4814 -78527 -186400 -234702 -100037 -46021 -83436
1721 -83436 -7150 66156 109516 130761 89216 13436 -45001 -80118 -77934 -58151 -38544 50851
1709 50851 73570 -64055 -48205 -19480 23604 49370 -103484 -162293 -59264 50536 -20406
1698 -20406 -68661 -51710 30194 44978 9286 4387 35744 -75650 -187312 -221877 -146330 -104480
1686 -104480 -203383 -217287 -166241 -55240 -20971 -116182 -60569 -31068 -53715 50904 47064
1675 47064 171014 207789 180136 160389 84829 -64363 -180906 -123444 -19624 60190 67462
1664 67462 37218 -109033 -162391 -95069 -12306 -2512 -89961 -1219 174965 147006 208883 189644
1652 189644 151570 193248 244638 116414 23776 136435 125095 126661 204740 172806 149245
1641 149245 92128 72188 119509 164465 70648 1859 -90790 -163395 -50418 82650 47666
1630 47666 -1960 47622 -34000 -6202 -16200 -35063 31905 111336 107689 31438 -24125 -74999
1618 -74999 -83061 -13644 -35580 -33325 -81257 -147323 -147066 -80456 8543 94420 121767 54815 45423
1605 45423 38025 -23056 -25776 -61292 -99226 -28828 -67590 12236 -15203 31453 201292 140560
1593 140560 114236 82350 -23173 -50059 -114646 -205238 -125716 -37980 46350 -102807 -285360
1582 -285360 -292251 -244572 -209533 -85552 7315 74737 105494 56459 58409 43873 45851 -11164
1570 -11164 -7716 43384 14021 112393 94386 -35760 -8785 -40565 -202328 -220177 -171141 -126675
1558 -126675 24526 143265 109768 81726 -17548 27604 145902 177121 124146 45238 -146
1547 -146 65298 116077 49068 -75092 -30751 -18606 -14050 -28431 -61317 33312 34152 40947 -21402
1534 -21402 -8530 80116 84644 90705 76906 -20165 -14367 -17223 22224 -1882 28042 45973 109062
1521 109062 99429 102516 123615 69594 115422 142130 155682 150630 90752 -5543 48763 108388
1509 108388 68203 62821 104075 33291 31377 69571 35963 32449 62560 99386 15119 -12226
1497 -12226 40269 69177 -44743 -79299 -191410 -229147 -222025 -136818 -58426 -83057 5525 47138
1485 47138 87329 -8105 -61860 -110382 -37625 -50928 -70943 -104412 -52268 48717 54044 -23812
1473 -23812 65780 182900 197329 155446 99608 35042 -12364 16543 34874 2049 -45537 -55713
1461 -55713 63116 -1647 -127354 -261241 -213680 -74790 97498 94313 46480 84005 107434
1450 107434 166882 142105 7711 -57919 -76262 -111722 -101012 4009 -14148 -5986 77714
1439 77714 43800 40513 17263 34055 85127 171530 167290 148529 111058 -10570 20040 96485
1427 96485 98148 40892 -3549 14595 -16135 -80910 -19802 141618 94650 -9510 72801 123297
1415 123297 165702 112358 107407 139175 129895 169844 192096 175155 86696 80880 41460 -55524
1403 -55524 -8026 13621 37024 12142 8597 -10158 146955 171773 196601 133208 131818 92835
1391 92835 57478 33443 17327 -135259 -148823 -27457 87591 40494 -64271 -183104 -189607
1380 -189607 -101988 -39448 -103862 -206773 -207046 -129277 -111910 -84817 -142212 -85414 -133839 -107664
1368 -107664 -105482 3065 -60001 -22217 -65998 -86472 -84227 39109 110786 112428 94381 -1346
1356 -1346 8496 -48559 -89994 -141303 -199951 -204101 -114433 -135766 -83049 -109709 -150894 -91040
1344 -91040 -17749 69522 90768 77563 116966 93307 60419 -25900 40012 244273 300159 195682
1332 195682 87086 67419 36678 41000 62458 -37327 -24858 58428 96936 89331 88048 38084
1320 38084 -31740 30908 49859 34415 26795 -8580 45267 218740 168104 172600 256507 249722
1308 249722 193962 142150 107995 152003 184953 168308 121448 23871 -9167 -23779 13637 -35527
1296 -35527 -45579 -122829 -84256 -62624 -36660 40200 18862 57903 71204 12261 -13473 40180
1284 40180 -27454 -66344 -156548 -202672 -102807 22053 45783 9857 -63545 -65383 -39102 -6573
1272 -6573 94797 87771 30075 28313 2917 98416 154317 -12885 -108198 -94544 -169048 -140531
1260 -140531 -143287 -113058 -100700 -41766 57887 100299 79599 32188 120845 235311 174842 176020
1248 176020 215374 158016 138354 52943 11855 -54134 -67506 -10936 -26806 -40324 11867 -34226
1236 -34226 -4062 131818 48725 10486 21230 -89119 -126014 -125263 -53285 34092 81940 75954
1224 75954 -67042 -62826 40961 121560 156610 131446 104577 113327 -4478 -82102 -53693 -97828
1212 -97828 -20864 81602 102118 47615 -129378 -158688 -99476 -74290 -55905 46301 69373
1201 69373 -4697 -31118 45072 101830 44578 -67496 -167489 -152922 -149578 -28376 101202
1190 101202 73040 15414 -28848 -79725 -36018 -47055 -77841 -103428 -94877 -60954 -84997 -65790
1178 -65790 -85721 5351 103378 -12802 -87188 -171007 -130608 -24061 93650 108746 38376
1167 38376 -38585 -27044 -42178 -48374 53656 237991 143502 85544 64239 5754 -78908 -126130
1155 -126130 -122506 -174331 -66268 -82171 -75623 -9732 67540 27507 19667 69327 57088 -60670
1143 -60670 -100470 -147452 -246784 -289773 -159946 -150412 -137382 -63807 35275 -53397 -112908 -212235
1131 -212235 -82228 -33825 -33939 -148806 -162991 -75369 -31049 23418 -45030 -92074 -80935 5609
1119 5609 -22908 -124599 -214289 -267097 -264717 -180759 -31412 104277 126388 1086 -70047
1108 -70047 -61314 36690 11022 -41918 67248 171726 64837 -45610 -71981 -43555 39229
1097 39229 23105 2779 46210 -42974 -97226 -24899 -52243 -90400 -98734 -53395 65492 68162
1085 68162 28884 83546 198774 235090 313943 227933 132885 116850 103592 2417 -47633
1074 -47633 -67358 -19879 468 45163 134046 38875 -91216 -151134 -88722 -529 -26864 18818
1062 18818 6275 58911 123774 58422 -59809 -65488 71504 145932 138194 148296 115838 33041
1050 33041 108993 51125 -56131 9721 44339 33324 77187 66489 45387 69907 -19327 -12662
1038 -12662 48134 92510 60255 37188 18058 -81325 -52684 64089 55842 8402 -52160 25288
1026 25288 106259 39011 170043 125464 93523 55295 108649 50643 -121798 -111791 -85264
1015 -85264 -78323 -133798 -131447 -18512 43868 1859 35997 126534 31054 17812 49757 34600
1003 34600 33888 -5973 -32113 -105489 -148822 -80768 -22231 -97757 -47996 57736 117009 37096
991 37096 -53946 -18368 21307 -48115 -21928 21105 149704 179882 192764 38722 8474 80566
979 80566 68659 50072 54428 151590 205474 228221 103516 12533 38802 18564 74926 73250
967 73250 -25697 -122 52917 -2044 4673 36813 80705 105609 123394 82252 1987 2329 21725
954 21725 65550 213562 235581 115471 81952 6102 102530 102066 5259 -78551 -83033 -110898
942 -110898 -56154 27890 118659 136731 295212 268052 206561 159262 179123 151701 102304 44293
930 44293 15181 22997 49908 18906 70533 23087 -80600 1651 81077 24574 47159 83024
918 83024 127041 223418 323135 282538 168733 74599 -33023 -69268 -89688 67928 121766
907 121766 178821 181589 153118 102850 9458 -59857 -76825 -121728 -168120 -151165 -109694 19396
895 19396 87241 125191 119951 23799 1423 38657 122066 169870 121185 199825 226599 212453
883 212453 275411 167078 102554 7135 -36204 -9739 14620 14281 87960 84476 97575 4611
871 4611 -92112 -82149 -38280 -101598 -83802 -143179 -180217 -116764 -53159 -81853 -20937 1758
859 1758 -67876 1709 165673 206263 69687 -16752 -28116 -49067 -31177 79360 144695 100265
847 100265 91379 47911 8143 55374 123781 142857 101738 69950 48656 -63623 5172 59159
835 59159 -31621 -60078 -134877 -83073 -48491 -58057 -65497 -90153 -42880 -29233 -64831 47518
823 47518 83715 -12461 -60273 -17277 75077 86802 89320 94386 -44847 -32148 108850 180626
811 180626 153624 69772 75592 103312 83900 64014 118196 216908 159418 62703 -34126 57943
799 57943 74126 9937 -97716 -101725 -86552 54056 93936 11323 39029 25216 60517 139315
787 139315 61937 13894 20056 -28306 -10642 8240 -51359 -97972 -22622 124443 141804 116318
775 116318 94584 94866 161799 173841 221796 129403 80842 50067 75467 56863 76173 51310
763 51310 73947 72695 75632 157324 188706 249195 122172 -37825 -13365 112945 70771 10268
751 10268 95267 58281 -33231 28184 63848 91438 107583 66088 120408 146520 -11362 -22139
739 -22139 13800 108159 137931 69679 70766 57242 55391 68963 127421 121545 81933 105822 81510
726 81510 56603 67321 45284 64858 137455 71409 127144 183544 87570 19167 275 46905
714 46905 36499 1987 36701 14234 -20924 -82877 24379 44358 96055 120173 58612 99151
702 99151 142448 145372 114930 31959 30733 160576 169431 101218 112637 183572 178547 131760 36409
689 36409 28259 -22204 -30824 46001 92762 63734 74535 148037 178184 145886 217534 273200
677 273200 152209 -43403 -69221 -88444 -44402 -31887 -11814 17197 66721 141706 194675
666 194675 220360 160716 105298 46474 -18016 9971 61001 153571 98023 -50105 -118160 -25969
654 -25969 122139 179795 163437 119906 105971 73774 155851 198882 130077 -70189 -166754 -103024
642 -103024 -27798 39168 13905 82456 151554 16332 -68585 -22855 -92131 -25095 -36691 -65197
630 -65197 -62271 -5513 101882 155297 155742 177012 122896 35503 45342 73589 200119 181325
618 181325 115240 49264 8733 -107998 -102115 -41774 -30849 27501 -21255 -84484 -120657 -109400
606 -109400 89847 138376 116136 119836 125485 99543 66351 61963 27299 15673 62264 134158
594 134158 177655 86944 11467 39509 70555 53691 135664 158759 82179 148093 161656 65489
582 65489 79872 306121 282599 143204 121628 79293 51406 96213 157680 160109 200581 139599
570 139599 118543 182942 285353 326611 242098 146299 76029 82207 115147 170000 98825 61864
558 61864 38737 99793 131878 158929 121297 98233 112961 63589 20707 20349 94829 114224
546 114224 209586 148487 79704 -18972 -31545 -36112 -44411 -35648 -44616 21852 -52500 -54865 -43342
533 -43342 -108924 -101146 38624 43088 57653 95048 179998 274420 273890 271274 299972 286053 240298
520 240298 146482 16194 -13085 124423 121323 139567 145922 174770 139752 129854 34813 -68719
508 -68719 -95265 -66970 -70113 46899 152682 83369 -4353 -2939 6540 31392 79004 49813
496 49813 71106 55377 -26089 -47459 -72132 -59663 -33856 16664 59407 93372 95565 150904
484 150904 68070 -58969 -157767 -137909 -34064 46317 -15413 -133818 -137810 -91216 -37028
473 -37028 -20652 50482 93592 49525 90184 148792 230620 197990 169147 198208 273362 195142
461 195142 117282 135008 170509 116969 125814 37194 -11170 -43776 -56273 42388 -19507 -107876
449 -107876 -44315 22429 92364 73073 81447 70978 84341 -10486 -25199 86517 26715 7702
437 7702 -6685 -24043 -20025 29071 -45558 -39379 83100 133762 60657 102942 186877 125855
425 125855 126460 210019 207950 111360 88416 95201 -28256 -50870 -35389 42563 43097 43357 -17952
412 -17952 -121937 -8573 52653 -33073 36000 157505 173677 63152 70785 109259 85486
401 85486 76188 120811 155527 123905 117798 195472 223296 161942 148742 136711 130803 251918
389 251918 185576 191135 206481 184562 206498 78484 46651 121688 125159 154682 114747 92105
377 92105 10002 38997 80212 95197 206977 201909 201417 130618 101908 104219 77786 49879 62617
364 62617 103201 119286 28761 -22123 -35347 -42165 -8101 -16653 -50315 -33227 66096 57990 50554
351 50554 42107 55156 29611 75241 125423 143936 82292 92146 144491 161608 146167 162407
339 162407 219688 115536 -47290 34130 93954 88692 115947 -15849 -71932 -57788 17322
328 17322 89343 63548 52658 43200 136640 43614 1111 61658 89694 30444 -36040 -79471
316 -79471 -118160 -132525 -74867 -33789 12196 -17872 -62948 -18637 61466 102848 119829 48285
304 48285 62092 37099 40532 102666 197177 103777 -14200 -124822 -164208 -109577 69600 157937
292 157937 101797 77468 73189 18960 -28755 9652 44348 21657 -15466 19199 65742 121332
280 121332 126359 124947 125530 114207 156000 167410 165760 212316 153520 164464 139220 88411 17544
267 17544 59873 97982 143909 152568 144639 95624 85834 140451 144352 102474 73675 38114 131237
254 131237 221081 227528 151389 119002 166640 67121 -54854 43295 39846 104251 102712 110749
242 110749 136357 187964 115325 114158 110033 193534 182150 138329 157019 129353 137511 96306
230 96306 130075 159696 127887 62912 88943 99394 95973 78442 71693 103038 113455 140958
218 140958 67384 48535 36883 24750 116820 46930 95164 210757 217402 194851 182435 100728
206 100728 36361 30643 60806 67907 84927 135289 139656 118342 102001 100704 178770 205736 210866
193 210866 263344 232321 81821 18983 110805 65813 -25305 22856 -87231 -91696 -41112 -85389
181 -85389 -74234 54808 104772 49025 -15181 -38431 23541 -9587 -97656 -119767 -143462 -73756
169 -73756 13599 36733 37911 120977 128337 33349 -30905 24620 82088 71812 21188 85003
157 85003 126950 79760 108266 156037 158330 31952 -76208 -62980 -11813 35268 108360 147172
145 147172 184841 189689 107336 5893 -30546 387 -6037 29635 60312 35478 -6962 -28630
133 -28630 6342 -16084 21417 24985 43358 85587 99422 125710 172349 109459 68872 141511
$$ [...]
##END NTUPLES=NMR SPECTRUM
##END=
