##TITLE=Analysis number 318920
Compound Code mo 07759
Book Reference 423/68
Project Code adrs
Chemist Name bruced
##JCAMPDX= 6.0         $$ Bruker NMR JCAMP-DX V2.0
##DATA TYPE= NMR SPECTRUM
##DATA CLASS= NTUPLES
##ORIGIN= Bruker BioSpin GmbH
##OWNER= nmr
$$ XWIN-NMR		Version 3.5
$$ Tue Apr 25 08:40:18 2006 GMT Daylight Time (UT+1h)  MAYBRIDGE\nmr@NMR_250MHZ
##.OBSERVE FREQUENCY= 250.131544655141
##.OBSERVE NUCLEUS= ^1H
##.ACQUISITION MODE= SIMULTANEOUS (DQD)
##.ACQUISITION SCHEME= undefined
##.AVERAGES= 16
##.DIGITISER RES= 18
##SPECTROMETER/DATA SYSTEM= dpx250
##.PULSE SEQUENCE= zg30
##.SOLVENT NAME= CDCl3
##.SHIFT REFERENCE= (INTERNAL, CDCl3, 0, 16.522)
##AUDIT TRAIL= $$ (NUMBER, WHEN, WHO, WHERE, WHAT)
$$ ##TITLE= Audit trail, XWIN-NMR		Version 3.5
$$ ##JCAMPDX= 5.01
$$ ##ORIGIN= Bruker BioSpin GmbH
$$ ##OWNER= nmr
$$ C:\u/data/dgb/nmr/ADRS/2890/pdata/1/auditp.txt
$$ ##AUDIT TRAIL=  $$ (NUMBER, WHEN, WHO, WHERE, WHAT)
(   1,<2006-04-25 08:39:45.29 +100>,<MAYBRIDGE\nmr>,<NMR_250MHZ>,
      <created by zg, POWCHK disabled, PULCHK disabled
       configuration hash MD5:
       84 BC 41 DB A1 6E 1D 46 DA 25 12 A5 C1 ED C5 3A
       data hash MD5: 64K
       4D 66 7B DA A1 3A 1E A5 BB BE 03 F3 FD 06 1F 03>)
(   2,<2006-04-25 08:40:02.63 +100>,<MAYBRIDGE\nmr>,<NMR_250MHZ>,
      <Start of raw data processing
       ef LB = 0.3 FT_mod = 6 PKNL = 1 SI = 32K 
       data hash MD5: 32K
       1F B2 9A 45 17 D9 A0 C2 FD 27 57 BC C0 D9 B4 F4>)
(   3,<2006-04-25 08:40:07.21 +100>,<MAYBRIDGE\nmr>,<NMR_250MHZ>,
      <apk 
       data hash MD5: 32K
       85 59 47 2C D4 AD 63 9B 3C 8A 01 45 E9 C3 C1 94>)
(   4,<2006-04-25 08:40:08.52 +100>,<MAYBRIDGE\nmr>,<NMR_250MHZ>,
      <abs ABSG = 5 
       data hash MD5: 32K
       05 AA 63 13 EC 51 81 67 70 DC 1B C7 5E 18 89 1B>)
$$ ##END=
$$ 
$$ hash MD5
$$ 75 A5 4B 65 73 6B 1C 33 89 1F 67 28 70 D0 72 86
##$RELAX= 
##$RELAX= 
##$RELAX= 
##$RELAX= 
##$RELAX= 
##$RELAX= 
##$RELAX= 
$$ Bruker specific parameters
$$ --------------------------
##$DU= <C:\u>
##$EXPNO= 2890
##$NAME= <ADRS>
##$PROCNO= 1
##$TYPE= <nmr>
##$USER= <dgb>
##$AMP= (0..31)
100 100 100 100 100 100 100 100 100 100 100 100 100 100 100 100 100 100 
100 100 100 100 100 100 100 100 100 100 100 100 100 100 
##$AQSEQ= 0
##$AQ_mod= 3
##$AUNM= <au_zg>
##$AUTOPOS= <2 >
##$BF1= 250.13
##$BF2= 250.13
##$BF3= 250.13
##$BF4= 250.13
##$BF5= 500.13
##$BF6= 500.13
##$BF7= 500.13
##$BF8= 500.13
##$BYTORDA= 1
##$CFDGTYP= 0
##$CFRGTYP= 5
##$CHEMSTR= <none>
##$CNST= (0..31)
1 1 145 1 1 1 1 1 1 1 1 1 1 1 1 1 1 1 1 1 1 1 1 1 1 1 1 1 1 1 1 1 
##$CPDPRG= <>
##$CPDPRG1= <>
##$CPDPRG2= <>
##$CPDPRG3= <>
##$CPDPRG4= <mlev>
##$CPDPRG5= <mlev>
##$CPDPRG6= <mlev>
##$CPDPRG7= <mlev>
##$CPDPRG8= <mlev>
##$CPDPRGB= <>
##$CPDPRGT= <>
##$D= (0..31)
0 1 0 0 0 0 0 0 0 0.06 0 0 0 0 0 0 0.0002 0 0 0 0 0 0 0 0 0 0 0 0 0 0 
0 
##$DATE= 1145950782
##$DBL= (0..7)
120 120 120 120 120 120 120 120 
##$DBP= (0..7)
150 150 150 150 150 150 150 150 
##$DBP07= 0
##$DBPNAM0= <>
##$DBPNAM1= <>
$$ [...]
##$SUBNAM7= <"">
##$SUBNAM8= <"">
##$SUBNAM9= <"">
##$SW= 20.6930455092707
##$SWIBOX= (0..15)
0 0 3 0 0 0 0 0 0 0 0 0 0 0 0 0 
##$SW_h= 5175.983436853
##$TD= 65536
##$TD0= 1
##$TE= 295.16
##$TE2= 300
##$TE3= 300
##$TEG= 300
##$TL= (0..7)
0 120 120 120 120 120 120 120 
##$TP= (0..7)
150 150 150 150 150 150 150 150 
##$TP07= 0
##$TPNAME0= <>
##$TPNAME1= <>
##$TPNAME2= <>
##$TPNAME3= <>
##$TPNAME4= <>
##$TPNAME5= <>
##$TPNAME6= <>
##$TPNAME7= <>
##$TPOAL= (0..7)
0.5 0.5 0.5 0.5 0.5 0.5 0.5 0.5 
##$TPOFFS= (0..7)
0 0 0 0 0 0 0 0 
##$TUNHIN= 0
##$TUNHOUT= 0
##$TUNXOUT= 0
##$USERA1= <user>
##$USERA2= <user>
##$USERA3= <user>
##$USERA4= <user>
##$USERA5= <user>
##$V9= 5
##$VALIST= <valist>
##$VCLIST= <CCCCCCCCCCCCCCC>
##$VD= 0
##$VDLIST= <DDDDDDDDDDDDDDD>
##$VPLIST= <PPPPPPPPPPPPPPP>
##$VTLIST= <TTTTTTTTTTTTTTT>
##$WBST= 1024
##$WBSW= 4
##$XGAIN= (0..3)
0 0 0 0 
##$XL= 0
##$YL= 0
##$YMAX_a= 543871
##$YMIN_a= -475071
##$ZGOPTNS= <>
##$ZL1= 120
##$ZL2= 120
##$ZL3= 120
##$ZL4= 120
##$ABSF1= 16.522
##$ABSF2= -4.171173
##$ABSG= 5
##$ABSL= 3
##$ALPHA= 0
##$AQORDER= 0
##$ASSFAC= 0
##$ASSFACI= 0
##$ASSFACX= 0
##$ASSWID= 0
##$AUNMP= <proc_1d>
##$AZFE= 0.1
##$AZFW= 0.1
##$BCFW= 0
##$BC_mod= 0
##$BYTORDP= 0
##$COROFFS= 0
##$CY= 12.5
##$DATMOD= 1
##$DC= 0
##$DFILT= <>
##$DTYPP= 0
##$F1P= 14.0000005364418
##$F2P= -0.99999901652339
##$FCOR= 0.5
##$FTSIZE= 32768
##$FT_mod= 6
##$GAMMA= 0
##$GB= 0
##$INTBC= 1
##$INTSCL= 1
##$ISEN= 128
##$LB= 0.3
##$LEV0= 0
##$LPBIN= 0
##$MAXI= 10000
##$MC2= 0
##$MEAN= 0
##$ME_mod= 0
##$MI= 0
##$NCOEF= 0
##$NC_proc= -4
##$NLEV= 6
##$NOISF1= 0
##$NOISF2= 0
##$NSP= 0
##$NTH_PI= 0
##$NZP= 0
##$OFFSET= 16.522
##$PC= 1
##$PHC0= 13.71225
##$PHC1= 4.257208
##$PH_mod= 1
##$PKNL= yes
##$PPARMOD= 0
##$PSCAL= 4
##$PSIGN= 0
##$REVERSE= no
##$SF= 250.13
##$SI= 32768
##$SIGF1= 0
##$SIGF2= 0
##$SINO= 400
##$SIOLD= 32768
##$SREGLST= <1H.CDCl3>
##$SSB= 0
##$STSI= 32768
##$STSR= 0
##$SW_p= 5175.98343685301
##$SYMM= 0
##$S_DEV= 0
##$TDeff= 65536
##$TDoff= 0
##$TI= <Analysis number 999999
Compound Code 99
Book Reference 9
Project Code 9>
##$TILT= no
##$TM1= 0
##$TM2= 0
##$TOPLEV= 0
##$USERP1= <user>
##$USERP2= <user>
##$USERP3= <user>
##$USERP4= <user>
##$USERP5= <user>
##$WDW= 1
##$XDIM= 32768
##$YMAX_p= 414752541
##$YMIN_p= -637977
$$ End of Bruker specific parameters
$$ ---------------------------------
##NTUPLES= NMR SPECTRUM
##VAR_NAME=  FREQUENCY,     SPECTRUM/REAL,   SPECTRUM/IMAG
##SYMBOL=    X,             R,               I
##VAR_TYPE=  INDEPENDENT,   DEPENDENT,       DEPENDENT
##VAR_FORM=  AFFN,          ASDF,            ASDF
##VAR_DIM=   32768,         32768,           32768
##UNITS=     HZ,            ARBITRARY UNITS, ARBITRARY UNITS
##FACTOR=    0.157963299565203, 1,           1
##FIRST=     4132.6476996994, 0,             0
##LAST=      -1043.33573715361, 0,           0
##MIN=       -1043.33573715361, -637977,     0
##MAX=       4132.6476996994, 414752541,     0
$$ Real data points
##PAGE= N=1
##DATA TABLE= (X++(R..R)), XYDATA
$$ [...]
20468 7691 -6268 -16840 -15545 -6570 -243 8793 9817 10093 3703 -8533 -5188 -8018 -3624 6249
20454 6249 9322 4986 -6059 -9947 -3394 7994 -1312 -12634 1557 6796 177 -5131 -2800 -12649
20440 -12649 -7038 10414 14701 14226 16896 14933 12896 14539 11074 6300 2420 -943 -296 -7207 -16248
20425 -16248 -19323 -18413 -13258 -4974 816 685 -2573 964 6620 8907 7904 8622 3750 8402 12637
20410 12637 15699 18816 13049 14308 9835 10285 12575 8702 1557 3564 4735 -3034 -6626 -2323 4825
20395 4825 7776 -4034 -1671 -4507 -2253 -3923 6198 11124 3048 -697 4728 7637 1816 -8466
20381 -8466 -5389 -2619 -174 9763 13618 7477 3996 5069 7319 3788 14227 18550 6251 4043
20367 4043 10327 14092 440 -7528 -4597 -10075 -18363 -7002 -7913 -10214 -10504 -2613 1345 1813 1404
20352 1404 -1218 -2171 -8866 -9246 -10874 -12008 -20921 -18321 -17687 -14884 -8139 -3055 -222 3820 -3289
20337 -3289 -940 2546 -46 7296 10131 2445 2274 885 686 4067 571 -7500 -12331 -12438 -7384
20322 -7384 -6263 -8677 4452 6309 5427 2363 2016 4597 1433 -7063 -12872 -16405 -9877 -4993 235
20307 235 -904 -400 14625 15400 -2448 -449 8419 3226 -847 7628 525 -5967 4659 11026 -2982
20292 -2982 -7084 -6597 -4510 2342 -7926 -18021 -5004 2310 3350 18385 14558 5801 -10698 -10335
20278 -10335 -8936 -9032 -664 -7555 -12851 -15447 -18572 -15610 -7114 2717 -6421 -10756 -8431 821 5281
20263 5281 7402 4012 8433 9148 7261 5739 511 5066 -586 -4521 -1985 2980 -3466 -12277 -6182
20248 -6182 -3600 -1112 7525 11630 -1960 -14780 -8202 -1891 4659 10312 6937 11317 -601 -9042
20234 -9042 -11472 -10842 -7668 -7152 -806 381 -5879 -6257 1006 2530 422 4352 4041 4728 9729 8168
20218 8168 1421 4462 8170 4184 -6103 -19736 -25813 -15879 -6896 5709 7287 -267 -6178 -4034
20204 -4034 -8522 -14654 -11933 -5992 -2841 -240 -105 -7651 -4790 -2831 -2564 -3520 -4108 -12331 -17383 -10424
20188 -10424 -6235 -7808 -6039 -830 -1875 -1798 -4192 -11730 -1507 1783 -3510 -70 5596 10074 1689
20173 1689 -19012 -10707 3662 15783 15536 12179 16067 13784 6830 -2161 -2454 7518 6668 -2604 -7166
20158 -7166 -9089 -7899 347 5271 7202 9998 15943 17670 13419 2495 -1863 2257 4655 -2377
20144 -2377 -5483 -7416 -7145 -5477 5685 14411 15825 15037 14868 2560 -3990 -2069 -4030 -2290 5481
20129 5481 412 -4157 -4127 -7246 -10518 -7294 -1488 -1230 -1348 -2275 4079 10783 -20 -5430 -6755 -13107
20113 -13107 -7863 861 949 6580 1042 500 3664 -4901 -5184 -890 -4225 -16908 -18135 -11280 -5203
20098 -5203 2211 4320 8743 5760 5710 2218 8907 -1022 -746 -2411 3806 6488 3156 455 -6228
20083 -6228 -4382 -4976 -2301 -1973 -5013 1825 2807 -1465 -7931 -9929 -9880 -10466 -4846 1025 -7605 -5336
20067 -5336 3157 2027 4611 2969 -12632 -14813 -4534 -9381 -21256 -17120 -6074 -1878 -5057 -5947
20053 -5947 -3765 -2584 -5119 -5956 -8844 -5081 16772 26798 21079 12766 16474 22548 21437 10586
20039 10586 18199 23027 25337 25017 22944 10329 -3336 -564 2099 1330 5280 5667 9120 7108 8760
20024 8760 21296 22739 13985 9184 6583 11730 10034 16105 23624 17258 11586 12859 9163 9805 13235
20009 13235 18894 17650 10971 12324 12373 9757 9463 7539 12459 3735 -12958 -18427 1042 10344 7630
19994 7630 737 1094 5984 4716 2639 -100 4480 -5056 -8808 3201 9397 9756 10053 19179 17339
19979 17339 8153 3117 8968 20487 25746 14807 10334 350 2210 2245 696 3749 4367 4734 12656
19964 12656 8163 4006 11531 10253 -372 -675 8076 3756 8700 19569 22222 21649 25156 25134 21141
19949 21141 26914 31041 38273 39482 40807 50146 51318 52260 49423 46023 44217 37384 25308 25654 32020
19934 32020 41764 32196 14604 7868 16563 7469 3552 12375 9955 13136 11333 -1348 -1775 6725
19920 6725 7870 3384 9767 8748 48 5302 6513 -7315 -7222 -12395 -8952 -8850 -7846 1942 14681
19905 14681 11838 7338 1991 2750 4703 8677 9121 6200 5889 108 1915 2384 8406 13073 13605 14046
19889 14046 9331 1941 -723 -1325 12848 15439 12294 2400 1785 12338 12846 10567 5347 10299 12411
19874 12411 20062 18862 15395 22264 26793 18989 19282 18561 17707 24409 9589 884 8066 27862 18352
19859 18352 15586 7190 2566 -4764 10 4986 -2933 3770 3488 6915 12040 13589 16720 14236 1647
19844 1647 -6040 -1051 -640 -4698 -8914 -9151 -7360 -1688 -4154 4895 17132 21568 17657 21302 25709
19829 25709 20538 12972 11424 14355 10800 7114 7795 7495 8594 9317 13186 14473 12921 4702 4310
19814 4310 7883 1036 -1799 -1313 -1859 -1805 -4458 799 690 7311 7144 8822 5134 10469 14118 15009
19798 15009 4326 -5163 -5590 -19833 -14901 -7634 -666 1898 -7568 -21038 -18166 -12410 -5591 2823
19784 2823 7739 3616 -1292 5514 15319 17258 11876 10232 9369 3339 867 4753 536 6926 19126
19769 19126 18331 1802 -3127 -249 1039 -2826 -2427 -10828 -9441 -2074 1008 -1922 -4200 -9256 -6772
19754 -6772 -1769 3364 14538 19749 11927 11365 21511 28734 40512 44439 44548 51486 63297 61337
19740 61337 43393 25033 17088 11261 10255 14429 17160 11171 7216 6956 7573 10701 21791 20009
19726 20009 15442 11876 4399 7253 10462 15441 21094 31634 34590 38311 46575 42638 35402 27600
19712 27600 18516 12151 21202 33851 38293 45124 51760 47818 40417 37739 38821 35313 35884 34863
19698 34863 33753 28155 23753 17176 18874 11922 6666 14365 21350 8150 3533 -1071 -1144 694 -1178
19683 -1178 8709 15879 32514 38645 44096 57015 57410 55980 54647 51087 39692 45106 52041 61734
19669 61734 66838 67266 66147 70745 62205 71820 63361 51184 38560 31399 37981 43203 41190 45671
19655 45671 53745 45738 31481 23434 22432 33601 39028 37503 40340 37201 39217 37445 38306 41023
19641 41023 47410 43006 39374 38897 43079 49716 60825 56323 54851 72480 85234 81276 82067 96765
19627 96765 117476 140596 166960 201998 248732 303326 353473 411163 464421 512372 546042 576096
19615 576096 591087 583489 563205 538696 505018 453463 395662 344352 301712 261376 221802 187593
19603 187593 159624 144788 139275 120282 101208 94146 97454 86942 81193 85703 90931 90270 90223 95234
19589 95234 91954 86602 71749 57160 47883 56082 69465 72294 64318 58492 59245 53141 50305 46341
19575 46341 42633 41603 40483 39923 42308 51365 56861 57014 45716 33774 34593 37346 52350 57719
19561 57719 47188 44698 54565 55200 52213 37661 34609 34848 36423 28868 27192 35624 35164 30122 35617
19546 35617 24527 18498 26169 31313 43489 48137 42518 41245 43043 46731 36819 32695 22344 18837
19532 18837 26153 22944 17571 20403 33339 41578 44690 41530 36953 34653 38142 41369 43194 45260
19518 45260 46023 35776 27007 31704 47288 52105 48460 33225 26533 29933 41368 37275 35037 24991
19504 24991 25919 24159 17587 23246 31229 32350 29750 27496 24378 24611 20893 26028 41617 34646 26873
19489 26873 26488 31310 40971 27824 31239 33348 35793 24235 11887 14047 19695 29248 44057 43776
19475 43776 41105 35122 31588 30293 28496 31219 36285 37072 33024 34552 26207 23982 23847 28435 31096
19460 31096 39708 35043 23498 20405 33676 38187 35648 38549 45777 40376 41688 41974 35679 39897
19446 39897 36525 37795 29912 33703 41720 49860 57895 51365 44498 38631 32397 45109 43710 38299
19432 38299 34653 34788 34557 25604 32824 44885 46520 41457 38928 36891 25539 19703 13044 14884
19418 14884 22325 30416 38894 41075 40210 36311 26423 34823 37288 47917 52585 54464 58373 63188
19404 63188 65391 74759 86808 95834 97453 95408 102147 99606 101875 119342 134637 141843 146742 145222
19390 145222 143166 147102 136663 115615 101833 92111 78901 79889 74639 60151 45019 50557 55542
19377 55542 59443 65892 67835 67804 61865 45961 43490 48244 48227 51662 53652 56972 42911 32939 34235
19362 34235 33319 41576 34821 29246 33473 38743 44443 52842 52626 41655 40440 48370 47317 36253
19348 36253 28048 28069 25915 32704 39318 37749 37989 34067 39762 56248 53814 43857 45865 54949 66286
19333 66286 68764 73017 70890 78035 92514 102026 113438 139023 157523 185663 220468 281182 352097
19320 352097 421787 482849 548390 622968 681002 697785 693873 675168 632271 572391 510428 442760
19308 442760 367756 299470 247508 208667 186052 172119 177302 193351 193200 189115 188235 192563 193985
19295 193985 193396 191675 192493 189498 173740 153676 136983 126415 116281 107724 99178 104118 101773
19282 101773 115557 128271 123193 122702 124819 110355 110180 113968 101923 96735 96865 91976 92421 90035
19268 90035 87808 85349 95379 108491 111180 102106 99956 115586 126072 132427 128414 128224 125424 115197
19254 115197 105108 104829 96951 84780 79146 65826 55877 36373 19457 -7180 -21742 -35880
19242 -35880 -49677 -61716 -75915 -76881 -70164 -64961 -62912 -55176 -59794 -66126 -61172 -40332 -8570
19229 -8570 15258 39588 57628 83456 110112 126918 129030 129139 134767 135130 140429 145454 140004 143860
19215 143860 151206 148971 153099 164585 160325 154396 151132 156219 155309 153398 146988 150178 155396 152059
19201 152059 153416 155536 157990 167728 183050 177684 178292 184663 189350 204564 213252 216153 218978 220745
19187 220745 233755 246249 249953 256151 279244 304111 326746 354526 399161 447559 510506 589574
19175 589574 669791 754480 824982 892565 933093 967082 987589 995231 997498 983857 951731 905293
19163 905293 870408 841055 802768 775077 750808 735940 726108 737470 744370 743005 759801 785818
19151 785818 817669 853902 908623 996205 1119067 1281003 1504104 1781378 2130856 2551205
19141 2551205 3038781 3564497 4098348 4612075 5048339 5346499 5528279 5614562 5540432 5290283
19131 5290283 4934412 4554871 4115287 3612842 3138042 2739732 2405483 2111185 1868180
19122 1868180 1698159 1566942 1457703 1361213 1293559 1241204 1183118 1137163 1108357 1085168 1057128
19111 1057128 1039745 1037334 1039293 1048985 1063909 1076330 1077269 1081375 1097996 1108976 1112676 1112549 1107955
19098 1107955 1118351 1130209 1139486 1131501 1132901 1134383 1139948 1159373 1175063 1189114 1219781 1249362
19086 1249362 1281581 1329408 1393714 1471039 1577065 1728114 1894560 2087922 2329696 2603704
19076 2603704 2902029 3216742 3547208 3901290 4256148 4601857 4922295 5219518 5496302
19067 5496302 5724681 5937687 6133548 6348155 6587656 6885720 7292692 7851105 8643589
19058 8643589 9784705 11440073 13812396 17137186 21628459 27450910 34753445 43595996
19050 43595996 53712226 64627771 75894369 86907776 96536776 103724942 108467679
19043 108467679 110879045 110207273 106004013 99214730 91056715 81688332 71223612 60797960
19035 60797960 51516766 43627465 36932986 31394118 27057703 23785922 21336665 19473545
19027 19473545 18002882 16791534 15792581 14951967 14229966 13619964 13093940 12642522 12267299
19018 12267299 11926743 11626650 11341433 11064375 10791329 10519489 10228671 9913638 9583202
19009 9583202 9240470 8897325 8562727 8233648 7916664 7624715 7359226 7112526 6880207
19000 6880207 6668848 6472120 6282860 6105651 5928803 5768387 5589637 5410027 5242794
18991 5242794 5073814 4924533 4782112 4636012 4496002 4379323 4280725 4172937 4072343 3985519
18981 3985519 3898449 3802941 3705733 3618793 3523371 3454012 3380192 3305371 3234605 3149020 3061415
18970 3061415 2981446 2910327 2845963 2784053 2712972 2649047 2594901 2551604 2513017 2460698 2415392
18959 2415392 2373525 2324989 2277290 2237567 2200547 2168908 2122674 2060264 2004063 1945266 1888290
18948 1888290 1829099 1782143 1724554 1655654 1609131 1563827 1514791 1469427 1447557 1427999 1397229
18937 1397229 1354168 1321424 1295278 1291032 1301290 1313602 1331126 1356197 1376478 1412888 1459168
18926 1459168 1512469 1549997 1586188 1639459 1688221 1733129 1774133 1809936 1825876 1830951 1825926 1818110
18914 1818110 1800151 1765548 1721994 1689785 1649696 1598067 1549661 1503600 1463916 1429168 1392569
18903 1392569 1349891 1306058 1264995 1225871 1194983 1171142 1142266 1124314 1103639 1081749 1067761
18892 1067761 1069962 1057703 1043926 1027910 1016405 1006920 994473 966077 944801 942001 949513 955439
18880 955439 973051 995537 1029749 1080286 1136164 1199875 1276954 1353299 1431258 1490323 1537052
18869 1537052 1554370 1548036 1543841 1520723 1475804 1431370 1388804 1339239 1301714 1282153 1267429 1245427
18857 1245427 1232622 1241112 1243916 1236610 1231306 1234668 1236920 1240467 1237997 1234552 1249852 1277809 1301338
18844 1301338 1323985 1360036 1401959 1471505 1588212 1773807 2028058 2358437 2800078 3360993
18834 3360993 3978138 4626582 5288458 5856348 6210801 6406818 6461502 6232810 5768801 5249438
18824 5249438 4678131 4036485 3432230 2951993 2558924 2242843 2007326 1835267 1704113
18815 1704113 1600871 1518472 1448797 1399236 1356368 1316468 1298311 1274349 1239671 1212288 1201787
18804 1201787 1203684 1208369 1211122 1211811 1209444 1208220 1193913 1190281 1190212 1180623 1178407 1181827 1186027 1185268 1196471
18789 1196471 1219825 1242063 1284314 1336101 1397544 1472577 1594120 1732581 1889670 2074964
18779 2074964 2285312 2505311 2708677 2882676 3031109 3145425 3207910 3232125 3231261 3217729
18769 3217729 3204998 3218920 3276200 3373329 3531250 3756023 4040317 4399228 4858313 5451444
18759 5451444 6224926 7231059 8561381 10376403 12902132 16446060 21338227 27869991
18751 27869991 36316130 46854348 59186947 72544407 86273525 99506978 110408323
18744 110408323 117602725 121344516 121342462 116518815 107762909 97132149 85226927 72481772
18736 72481772 60446170 50232734 41871244 35173194 30025823 26197664 23364892 21207962
18728 21207962 19469660 18022725 16795994 15743682 14833440 14037052 13340137 12728779 12211549
18719 12211549 11770686 11397190 11090645 10851115 10639311 10468004 10323391 10179249 10029022
18710 10029022 9841129 9616823 9368627 9085153 8766920 8425957 8084283 7740373 7417758
18701 7417758 7121132 6848763 6597721 6368380 6159153 5958864 5770934 5582857 5406702
18692 5406702 5232776 5072404 4919754 4764957 4629401 4502684 4382691 4279474 4177999
18683 4177999 4070280 3976218 3885481 3801610 3719419 3636433 3552958 3475399 3404678 3328063 3252765
18672 3252765 3180992 3112379 3037767 2954609 2871911 2797319 2735612 2676485 2619506 2571924 2530264
18661 2530264 2479430 2416710 2356478 2310752 2275654 2228366 2188550 2147614 2123556 2092759 2056853
18650 2056853 2026014 1988551 1946893 1908094 1874788 1840692 1804375 1768034 1731668 1698930 1678594
18639 1678594 1656754 1630698 1607298 1576110 1553336 1542543 1531459 1509079 1481488 1456803 1454451
18628 1454451 1456256 1464982 1483767 1508914 1545568 1590448 1637586 1675177 1707797 1745603 1778425 1797786
18616 1797786 1816340 1810557 1779007 1736088 1681652 1639574 1592241 1533258 1471702 1427127 1390579
18605 1390579 1349372 1302018 1261200 1221389 1178835 1145476 1120705 1095700 1062268 1032079 1012055
18594 1012055 992381 982027 969693 953252 933631 921840 909086 892718 863735 836639 809918
18583 809918 786659 761847 738761 723593 712565 689860 667698 657531 633432 620654 627287 621557
18571 621557 608849 595651 572797 560676 548577 529027 521066 516355 512208 506844 506057 527095 545052
18558 545052 569935 592649 627105 655561 678215 694011 711595 714690 712688 703649 687955 683182
18546 683182 683327 659869 642157 620715 603302 578123 555598 532895 499766 468641 446303 426381
18534 426381 404306 373431 347378 333490 341133 344399 338045 330063 315550 318695 313734 305191 306127
18521 306127 309161 314162 308724 309813 303013 290563 287707 273284 263004 261473 258775 259291 265875 270904
18507 270904 272091 271711 280117 275820 267122 263341 254631 244538 249008 250041 245451 235262 224830 227516
18493 227516 235064 242461 243374 253845 264289 261545 262449 274700 293646 300700 288799 285393 277722
18480 277722 286057 298394 304047 304618 316542 334016 354793 387349 442280 496046 536894 590094
18468 590094 643371 682483 702663 713264 714678 722992 700942 650901 600045 551065 507420 460040
18456 460040 411300 358504 314361 288940 274131 257070 230526 207514 209152 200338 191740 183776
18444 183776 172942 165731 168473 174601 172115 169838 162035 155369 154276 147522 137271 133687 122673
18431 122673 130964 133188 124519 124153 119006 119035 123677 112066 116234 119720 113692 111380 103529 103114 108190
18416 108190 110603 105432 93510 95839 107432 111578 109215 106468 101926 98318 100383 90389 87387 86967
18402 86967 83794 89151 94239 90078 86539 84889 65455 50891 60738 69970 75191 70196 74033 70339
18388 70339 68358 73207 74554 69014 71170 66273 62045 63242 60947 55587 52758 48409 59629 64652
18374 64652 61159 55647 56214 53746 53511 40721 25350 27891 26941 37410 42931 47882 57735 55857
18360 55857 57616 59645 61515 58294 57032 56409 41533 30322 35482 33777 31422 34401 35903 36683
18346 36683 39098 25763 16721 30850 46124 44876 43437 42046 37349 39555 39818 39627 46871 44472
18332 44472 32433 26908 35133 36393 34120 32274 27446 26471 32836 44765 45373 35830 46283 49881
18318 49881 58371 59508 47641 43599 42236 42747 38425 33368 40852 28954 22699 25254 24143 24867
18304 24867 24958 30980 39184 36310 21138 17907 22706 22873 14185 4327 12985 29867 39789 40786 33666
18289 33666 30656 23221 16588 20642 28517 24773 21182 16119 20746 18271 22831 20604 20637 21065 22580
18274 22580 25529 24460 33482 30710 22866 20439 20685 19810 15239 18615 19603 18998 21386 21711 20841 20193
18258 20193 12441 16718 21519 19126 18751 18709 21380 27368 33900 39144 31375 26406 33075 28150 26227
18243 26227 26817 32006 46112 47750 43026 41151 32219 41970 50097 69451 96549 106220 93171 78574
18229 78574 75036 62940 49625 50997 60449 55586 45775 38360 29919 31594 40538 34716 31458 36316
18215 36316 38000 39000 40963 47256 43961 40981 39990 36936 43041 46319 42243 39508 43740 48916 51726
18200 51726 58630 55760 45196 46928 62721 72378 77377 66829 67404 64271 66566 65975 56587 58830
18186 58830 62066 56014 62509 76131 76240 72850 58674 65021 77353 87865 104891 125542 153437
18173 153437 191654 239756 303583 376822 452467 519130 581079 620020 648429 655589 643546 613122
18161 613122 567897 504021 440874 381740 328846 283475 238389 208805 187840 181963 166570 144182
18149 144182 131634 117636 106139 106514 113186 107120 104125 103312 111297 115208 117286 105217 92686
18136 92686 95690 100468 101325 108742 114191 112416 118166 124172 129507 142926 146716 157420 169380 178723
18122 178723 195920 217557 242339 274152 309398 359798 418407 487817 592758 745487 963867
18111 963867 1302241 1898194 3015506 4959303 7413371 9345073 10822736 11307491 8689016
18102 8689016 5308633 3437351 2503283 1965044 1619247 1387570 1219163 1091194 1006037
18093 1006037 948712 885188 821576 767550 731809 695810 656474 617688 581309 557148 540431
18082 540431 521903 504546 481879 459305 444064 441163 440475 435683 427047 423867 413288 392382 379307
18069 379307 357850 341491 329323 319674 312849 302271 290435 280911 267905 266023 260986 245888
18057 245888 239406 234324 229212 219207 219369 215947 218794 220691 220631 208847 200218 198412 199706 196992
18043 196992 192629 183593 178174 173635 165817 169409 167631 156970 154502 148470 141574 140394 145071 137981
18029 137981 121781 118293 119574 116912 109587 119023 131280 134555 118226 96640 96064 99847 95115
18016 95115 92002 93966 95775 100684 96872 80177 75811 81202 70220 66992 72219 86863 90197 84780
18002 84780 81057 76652 72696 71915 75327 76299 75751 74747 75396 76734 79539 75750 75153 75701 72396 73925
17986 73925 71483 66696 74110 77979 87021 90628 96193 109584 112756 106440 90766 80932 86965 89881
17972 89881 87264 83540 74640 70642 70718 66928 65987 63840 60223 58078 60716 68137 58066 54947 65933
17957 65933 55441 46046 42738 44331 38577 24799 25966 29647 35303 32369 30758 34432 34416 33038
17943 33038 22241 28417 35972 37131 33922 31135 34304 36132 43147 36425 35660 36145 32518 30898 23255
17928 23255 21182 25986 27470 22674 23148 34559 41669 48283 41072 28826 31192 39596 40558 41686
17914 41686 52725 54270 40371 40711 44543 34280 40742 52568 48681 38365 29053 28253 27844 23696
17900 23696 32876 33861 25248 29260 34526 31236 16735 6644 -1063 3771 18480 26475 18430 19210
17886 19210 14390 3997 13238 12947 12639 18963 19311 17774 24262 21378 12443 13271 15048 4096 -6922
17871 -6922 4960 8808 9139 4999 10144 21821 22185 7617 6152 14728 13742 16604 18432 24048 21790
17856 21790 15983 16038 19339 14510 3287 -4527 1419 8291 17683 20845 30148 28560 35754 25666
17842 25666 23373 21832 19901 25873 17311 166 -604 10636 21300 32188 31760 22052 13127 16832
17828 16832 11984 13061 19242 9583 7330 11790 7390 6836 13668 13794 11301 8969 3404 5207 15843
17813 15843 12209 15329 23809 21674 23541 19393 22342 15916 12834 7124 -94 -826 12270 11927 13802
17798 13802 21461 27145 20215 18526 22730 18559 13524 17492 13156 2089 -1198 -1707 8918 13476
17784 13476 16123 12054 15215 16583 19061 17379 12913 8013 6567 14239 7821 6141 4931 7863
17770 7863 8261 10286 11589 10111 4380 2227 -3275 -1185 5913 6028 2021 -2048 -2993 -9647 -9560 -1338
17754 -1338 2988 -1979 -4821 -1437 -2827 -5322 -5312 5104 20562 22424 30244 34436 36113 25373
17740 25373 14174 10023 6258 6581 6388 2773 -909 -10337 -17493 -10944 -1821 -1037 -3088 -8961 -13004
17725 -13004 -2234 4968 -4599 -7030 -7712 -4779 -191 3970 2811 -5679 -6766 -5064 -4954 -6110 -3760
17710 -3760 -5519 1101 920 -3958 -1145 -6307 -1458 4179 3607 -875 -2981 1768 -5347 -3319 -5058
17695 -5058 -7816 -6951 1636 1107 4154 11935 18699 12566 11847 13297 5479 1822 6238 951 2298
17680 2298 2254 8006 762 -2297 -5017 -15124 -15397 -11501 -3230 4091 7731 9148 4599 2775 6015
17665 6015 6303 2665 -1605 4075 8352 14577 6331 -2019 -9021 -7110 -2636 -4207 -13088 -16774 -16851
17650 -16851 -6594 -1326 -104 -4266 -18759 -21505 -18095 -17317 -13700 -10205 -4275 -3408 -6602 -6582 -16662
17635 -16662 -18045 -14770 -11266 -11429 -6924 -1577 -2762 -11367 -9538 791 3789 3229 1100 2011 -5804
17620 -5804 -11654 -7370 -208 2168 1563 2084 1381 -312 5460 14816 5129 10481 14075 7055 -4349
17605 -4349 -16405 -17696 -5798 -3950 -7117 -4633 -4213 -11079 648 2274 4068 1796 -7200 -9239
17591 -9239 -13238 -10396 -1663 6293 9264 7627 6980 6855 -1786 -13018 -8570 -7635 -9488 -2727 976
17576 976 7156 11055 4433 9010 15063 17401 18183 7537 -161 -5321 -7749 -10554 -7429 -12367 -5627
17561 -5627 1435 3211 7827 8321 -2652 2633 3795 -6254 -14236 -18577 -11888 -14442 -14465 -12276 -19380
17546 -19380 -17923 -20031 -20115 -10477 -1753 -1787 -2486 -8238 -9340 -3134 -8397 -7781 2735 -8360 -16442
17531 -16442 -18815 -13259 -11911 -10844 -1974 3458 4731 4833 3982 1040 2383 4623 10754 21820 17825
17516 17825 10578 3787 -336 -2083 824 6689 431 -4741 -1995 9906 8143 2574 5311 10344
17502 10344 1739 5427 9139 8409 2462 1369 2077 522 -785 271 -8246 -5030 -202 -11635 -11516
17487 -11516 -9279 -7733 -3457 -2531 -4402 -2738 -5690 -10193 -10492 -9842 -7293 4171 4859 394 7781
17472 7781 13701 12315 15087 7661 -3082 -6967 -4088 6867 6964 6652 1398 -5027 2105 12185 16724
17457 16724 9488 1345 997 1719 -4964 -6739 -955 -6535 -7625 5135 5170 7007 -3880 -2952 -3246
17442 -3246 1937 14922 25814 45487 51540 57146 58056 32159 14578 12319 15849 13072 3315 -1228
17428 -1228 -3412 -8172 -9473 -4541 -336 -833 -979 -432 2609 6858 8678 6675 3271 8522 630
17413 630 -2742 -1186 -4058 -807 4344 4286 5358 610 -4567 1953 -6746 -12444 -15485 -18949 -12996
17398 -12996 348 9265 11444 7345 3848 3405 -4866 -17519 -19810 -14519 -20559 -15108 -4041 848
17384 848 12797 17040 15346 15126 9683 -6784 -5258 -4855 -16634 -25669 -27490 -26008 -12561 -8908
17370 -8908 -14984 -5907 -5570 -12942 -13972 -21424 -17705 -13873 -4081 4961 6887 5464 2940 9483 7933
17355 7933 3038 -881 -10897 -9007 -6266 -4167 -5952 -5572 -10488 -15730 -11338 -14967 -16439 -4035
17341 -4035 -1857 -4882 -5209 -6597 -5121 -4855 1446 4253 11316 14759 -775 -10190 -2965 -3370 -5522
17326 -5522 -7457 -5760 -12504 -14686 -11006 -14518 -17780 -15815 -15845 -7961 -4401 -4508 -767 -544 675 10877
17310 10877 8707 1935 -4626 2238 11194 8844 9544 16423 6987 2768 3445 -3742 -4254 -2454 4044
17295 4044 3324 7642 -3029 -12625 -6426 -16047 -14557 -5989 -2012 -1750 1033 12113 9263 -3884
17281 -3884 7447 9552 -228 -407 1568 -1638 -13344 -24951 -9208 6159 5649 -4828 -5183 -1465
17267 -1465 -3320 -3476 -5006 -1363 2101 4755 12523 1394 -4720 -2372 -9041 -14397 -12973 -7572 -5194
17252 -5194 -4635 7826 24637 26595 14764 7991 7851 6723 4647 3509 3942 3033 -5373 -5421 -1002
17237 -1002 -5437 -6010 -12106 -8621 518 4415 9164 969 -14910 -14275 -5110 -7218 -7302 -5969 -12586
17222 -12586 -20713 -22778 -15186 -15835 -17991 -15518 -13953 -2839 9708 7708 9206 8302 5013 1454
17208 1454 376 4730 -1204 6317 3440 -9836 -21362 -20703 -12772 -10488 -10746 -5924 -4861 -3338 -2806
17193 -2806 -2143 2753 3191 -1048 -188 6592 10475 13604 18621 16627 14533 12735 10511 10279 3819 -4359
17177 -4359 -5565 -1967 -78 4526 7591 -947 1875 -735 -10167 -12879 -10270 -12519 -10458 -12505 -17336
17162 -17336 -12912 -13457 -7329 -3645 -14359 -15894 -7740 -12576 -16115 -15792 -2602 -330 -2436 -6175
17148 -6175 -5816 -3264 3453 5080 5543 1246 -11552 -9938 -9454 -13196 -19603 -13387 -3636 -4375 -2543
17133 -2543 -7673 -7402 -2522 -4661 -7781 -8640 -4945 -4166 -8997 -22284 -27388 -26250 -20546 -13450 -15551
17118 -15551 -12878 -14927 -16610 -27339 -29233 -20693 -10915 -14851 -21410 -26189 -27157 -20020 -17960 -14033
17104 -14033 -12056 -9925 -7844 -15233 -15287 -7144 -14122 -8528 -7351 -7697 -13201 -15705 -10687 -13278 -16299
17089 -16299 -22261 -24403 -27066 -21253 -18124 -18500 -18892 -2328 1678 -154 -5963 -11060 -12058 -6405 -3505
17074 -3505 -247 -175 7514 9545 -469 -10178 -9833 -12163 -13783 -11628 -7998 -6617 -7329 -8432 -5775
17059 -5775 -9816 -20932 -16860 -12192 -15667 -13359 -15350 -13059 -5467 -12134 -15836 -5156 1149 8016
17045 8016 11635 504 -8445 -5519 1917 1174 -2438 -11973 -18428 -13023 -8127 -19211 -12899 -7186
17031 -7186 -8807 -12834 -10052 -6374 -4154 -7385 -14501 -10947 -8852 -8694 -10241 1784 5525 11109 4643
17016 4643 -5241 1291 -2699 -6402 -9139 -14556 -10618 -5231 -10945 -13053 -11206 -10153 -10307 -3997 2890
17001 2890 15614 14349 1120 -5458 -9262 -5944 -8087 -4767 3077 4753 -247 -6655 -12186 -7891
16987 -7891 2052 -1195 -8993 -24461 -25952 -21677 -20565 -24481 -20033 -18835 -20765 -16894 -30772 -38174
16973 -38174 -30370 -22203 -19917 -6774 -2333 -1705 -6196 -650 6806 12598 16234 8193 4706 2953
16959 2953 28 39 -1774 -8551 -2360 -4821 2510 11391 15924 6972 3454 2365 6978 10664 14263
16944 14263 5329 -7424 -6237 -1641 -5314 -12746 -26539 -17772 -4592 -1382 2708 13069 6461
16931 6461 -5888 -13852 -14580 -18980 -19622 -25560 -22174 -10227 -4205 -5225 -11831 -23453 -30688 -22369
16917 -22369 -2476 76 -2010 4791 8238 12924 14450 14852 11912 15569 20221 12701 4888 -12205
16903 -12205 -18998 -24738 -21944 -19283 -20056 -22335 -15782 -6166 -3055 -8894 -6446 5708 8315 11716
16889 11716 13963 3840 11347 1456 265 14781 18937 18068 10704 7603 10399 15079 17703 27098
16875 27098 18646 7568 672 3077 1252 -2749 -15169 -24170 -22791 -9835 -1919 -2091 -3745 -2357
16861 -2357 11885 17653 10739 2233 -2863 3108 4808 1947 -9614 -20459 -16824 -9033 -166 4123
16847 4123 -726 2010 7359 5085 3708 -3196 -4531 3805 -17 -6645 -3737 -1528 -6423 -11617 -13324
16832 -13324 -16351 -15049 -7150 342 -1137 -2747 -3790 -7340 -14168 -11269 1045 4780 3373 -67
16818 -67 -2493 -6005 -4136 9726 17447 7440 5383 5560 771 -210 -609 -1656 -5416 6450 4585
16803 4585 1033 -3759 -8287 -8605 -10356 2649 2257 -2859 -9410 -8120 155 2981 -835 4034 17809
16788 17809 5537 -10575 -7444 589 2907 2893 -1302 -2000 -6577 -11951 -13482 -13748 -17963 -18479 -8035
16773 -8035 1496 -3737 -15390 -13926 -2654 -3218 -13343 -17364 -11088 -2361 6113 -386 -2800 2426
16759 2426 7581 5140 6561 8046 9019 -1364 -1014 8632 8638 11330 12486 -82 -20354 -26893 -23804
16744 -23804 -19585 -17401 -16570 -23967 -27806 -18044 -9700 -5481 1506 7314 -1459 -4923 -7676 -8160 -14454
16729 -14454 -17437 -9500 -7255 -8705 -11500 -11852 -9938 -12757 -8513 -7552 -15583 -16355 -6689 6891 5194
16714 5194 5152 -902 -14002 -20382 -16062 -6783 -3431 -6923 -10529 -13301 -17574 -12333 -7066 -8862 -14048
16699 -14048 -22017 -18618 -17960 -20518 -12671 -13468 -23982 -33453 -26598 -15239 -18036 -18742 -12332 -12208 -8457
16684 -8457 -5649 -2783 2083 6904 -3302 -8242 -6800 -11618 -9198 -10521 -15829 -15474 -16773 -1103
16670 -1103 -2363 24 -2188 -1168 1457 2864 2711 -341 -7859 -2954 -1733 3365 -1720 -4361 -1635
16655 -1635 -10174 -2092 2724 -5183 -10444 -4187 23 -4674 -7898 -6691 -3053 -2123 -11424 -12785 -3046
16640 -3046 -2928 -11337 -14076 -8445 4949 7789 16359 18296 6996 -2347 -1681 -7810 -16590 -17296 -14842
16625 -14842 -12405 -14015 -5254 -2145 3982 5 -9466 -9939 -8225 -6262 -11194 -13999 -1423 -358
16611 -358 -16600 -19887 -22635 -19308 -18899 -25619 -22561 -20254 -7770 -4681 -3030 10254 17561 4586
16597 4586 -1232 -4670 5075 3500 -2831 -8984 3244 6801 1613 3551 95 -6685 -4342 -9586
16583 -9586 -23641 -23331 -22486 -22225 -16543 -9006 -1207 -10340 -17484 -16599 -17852 -10587 -1429 -7078 -21556
16568 -21556 -30540 -24975 -14069 -15051 -15502 -13301 -12497 -14533 -15632 -14634 -15513 -13913 -21759 -18853 -15640
16553 -15640 -4924 5635 939 11620 18881 13349 8583 7042 2286 -5643 -17105 -18102 -16570 -11248
16539 -11248 -83 4326 348 1674 5312 -3571 -13328 -10044 -4356 -3337 -15086 -12598 -10894 -18237
16525 -18237 -23024 -26719 -18634 -14844 -8835 -4354 2888 341 -1070 -4981 -1533 -7995 -15201 -8764
16511 -8764 -3580 -3429 -2653 -1704 -789 -1677 -2432 -8715 -16034 -11760 -4347 -6160 -11638 -7974 -2987 -3151
16495 -3151 -6655 -14208 -4946 -4219 -8390 -15734 -17162 -14769 -17669 -19927 -32906 -37641 -33484 -29263 -20163
16480 -20163 -14417 -10928 -918 -1081 -4532 -2553 -3800 -13109 -15461 -17771 -8808 -2974 -7325 -13870
16466 -13870 -23963 -28325 -25079 -20721 -12954 -19998 -26161 -25508 -18139 -11940 -14561 -5062 -4783 2508 -1186
16451 -1186 -13709 -20008 -19775 -27478 -24759 -27478 -34176 -24910 -3016 552 2702 -123 1249 170
16437 170 -6990 -10130 -7968 -1017 -2189 -15025 -19425 -18282 -4161 3180 -7058 -12770 -16817 -15956
16423 -15956 -14121 -14927 -17125 -11301 -6735 -6688 -8494 -8410 -8634 -10037 -732 6134 -4277 -12269 -7955 -2009
16407 -2009 2798 6419 15718 15771 22854 15617 1968 -1847 -9110 -5074 -4336 -9054 -559 4055 -3262
16392 -3262 -3643 7362 11291 6554 -6529 -11045 -5291 308 13071 10598 18002 22078 3901 -7370
16378 -7370 -13963 -19276 -13683 -4170 -5788 -10343 -6179 -4453 -12741 -18133 -16270 -20626 -26618 -21028 -18703
16363 -18703 -14340 -8836 -7414 -3780 1709 3759 -4483 -12027 -14521 -25107 -24244 -24588 -17001 -5467
16349 -5467 -1203 -4146 -8287 -19900 -17018 -17006 -23584 -26548 -24944 -5533 3121 -2774 -11071 -17117 -13944
16334 -13944 -12959 -10782 -9752 -5915 -15507 -25219 -13933 -1699 4214 966 -219 2942 6459 -1464
16320 -1464 -3753 -4235 -8677 -15598 -14839 -8869 -12605 -9556 -9396 -11362 -17030 -20084 -12824 -6061 -8595
16305 -8595 -6905 -14006 -13046 -7412 -2396 -502 -6570 -12746 -9557 -13464 -17568 -10029 -10855 -12314 -4978
16290 -4978 -5846 -3306 -2110 -2806 -566 -12550 -12041 3876 -30 -14959 -15194 -9008 -7724 -10727 -13393
16275 -13393 -3442 -1957 -5032 -9746 4263 9552 6883 15609 15850 9045 -59 -8746 -5839 -2842
16261 -2842 1221 -1823 -5255 -5169 -2457 8637 1110 -11502 -8666 -9143 -4988 -4532 -5576 -1109 -1786
16246 -1786 -7494 -17596 -32470 -29143 -24856 -13892 -15296 -8555 -5803 -4148 -632 -2328 -881 -2067
16232 -2067 -10435 -9018 1023 7479 3600 -6235 -14 6210 1184 -158 3229 13411 15904 17032
16218 17032 10671 -5719 -16851 -18845 -22269 -10565 -12199 -21013 -29399 -30118 -19352 -5776 -7522
16205 -7522 -14608 -13558 -1353 4198 3271 5446 12032 5972 -2864 -20167 -23840 -14887 -6675 -4119
16191 -4119 -15178 -23973 -27393 -37394 -34442 -25829 -19541 -8154 -729 -4495 -6286 985 -2292 -16723
16177 -16723 -16647 -8428 -7257 -11943 -21820 -25894 -18669 -7690 -9820 -8575 -9945 -9632 -6152 -8327 -5536
16162 -5536 -126 -2355 -16395 -9237 3296 9379 8148 -158 -3559 -720 -8659 -14546 -18540 -21049
16148 -21049 -22970 -23173 -30275 -30695 -30770 -27486 -24271 -23578 -20397 -13443 -11712 -11087 -6552 -4795 6503 15222
16132 15222 16266 11306 4214 -7253 -23485 -31247 -25529 -23341 -19279 -1583 1225 -7603 -14672 -18095
16118 -18095 -11401 -8973 -7882 -8100 -10326 -5939 -207 -7454 -9324 -5750 -5879 -6257 -14771 -13207 -6018
16103 -6018 -8253 -15737 -19849 -12943 -5553 3822 -1041 -7197 -4971 -8935 -12596 -18756 -20235 -9787
16089 -9787 -11507 -12771 -13776 -17396 -26091 -18866 -14262 -12608 -15055 -14681 -13669 -11465 -11665 -12193 -4743
16074 -4743 1202 -3657 -16606 -24209 -21813 -19267 -12719 -7593 -17273 -19569 -14828 -6476 -14739 -17299
16060 -17299 -12174 1116 12375 727 -10535 -5584 4736 -2579 -8744 -12978 -13913 -27624 -27420
16047 -27420 -28127 -28186 -9407 -5696 -15030 -7535 -369 -9467 -14526 -9590 5062 10225 5434 4369 3519
16032 3519 -9140 -8737 209 -2388 -551 6446 9481 2583 -10712 -19559 -21564 -16838 -15303 -15998 -15190
16017 -15190 -14510 -4821 -6706 -12042 -8798 -1403 -13945 -28439 -28306 -27256 -22788 -11436 -15609 -13322
16003 -13322 -4699 -7400 -7844 -16250 -17943 -21681 -15546 -20719 -19582 -14946 -20298 -19916 -16295 -24468 -21516
15988 -21516 -11736 -5661 -8007 -13956 -6213 -4747 -1543 -4057 -18387 -21274 -13501 -21048 -30176 -28958
15974 -28958 -23430 -14493 -14042 -16106 -21380 -25676 -17125 -7409 -8780 -6520 -1894 2616 1261 8929 8028
15959 8028 -1060 671 11939 7950 2001 -4392 -14518 -16051 -14524 -15080 -10265 -14553 -8785 1194
15945 1194 10146 7412 -1139 -5887 -355 -167 5792 14090 17911 10560 3440 768 -220 4451 7040
15930 7040 17669 9196 -4398 -11340 -8387 -7958 -3474 2669 2788 -6 -5489 -8134 -3212 4967 -266
15915 -266 -8244 -19121 -18627 -24828 -26126 -22971 -18996 -17140 -19451 -27144 -19783 -16795 -14816 -9475 -548
15900 -548 7420 654 -10350 -11207 -4667 4625 2660 -3722 -1831 4130 -3607 -6975 -11200 -10984 -14483
15885 -14483 -19673 -14527 -13096 -10535 -6309 3899 13641 11360 873 -9914 -13836 -14699 -12668 -15746
15871 -15746 -12911 -9090 -7715 -13795 -15483 -7346 -6578 -11250 -17191 -7476 -11636 -8150 7258 10518
15857 10518 915 -1367 -4250 -6711 -8379 -994 -3278 -5651 -7088 -5475 -6163 -5269 1779 10816 14490
15842 14490 7021 -3474 -8628 -9030 -10494 1861 9512 12546 3069 -4439 -2702 -4304 -3604 -6002
15828 -6002 -6843 -8811 -21759 -23435 -12453 -7578 -8461 -1991 -9403 -19847 -17554 -1725 -4514 -6580
15814 -6580 10999 9071 -1873 -800 -10209 -17883 -16632 -19570 -20927 -10582 -3248 -6640 -5898 -7109
15800 -7109 -5675 -4632 -3140 -7080 -12410 -3507 -1186 -6161 -3946 -1099 -2452 -1494 -881 -196 -7437
15785 -7437 -10275 -8096 -3478 -5281 -10941 -5600 -12396 -19920 -19845 -16262 -24638 -26680 -31180 -36275 -33091
15770 -33091 -32558 -30675 -16460 -17823 -15466 -13409 -5985 -358 -9103 -11818 -10327 -15574 -20810 -14494
15756 -14494 -18122 -18186 -5856 -292 5890 12871 6869 -9623 -6718 5708 6034 -1595 -1765 1119 -2277
15741 -2277 -10828 -11131 -15299 -16173 -16632 -23257 -17833 -13762 -9940 -14629 -22712 -27528 -21345 -13140 -18773
15726 -18773 -17036 -11594 -7029 -2132 -2831 -8872 -7588 -4617 -2864 -92 6320 -43 4825 10683 4160
15711 4160 8371 3038 -2798 -1879 -4757 -8567 -16245 -14504 -7704 -4541 -126 -891 -3797 3736 -352
15696 -352 -2427 5937 2646 -4324 -6208 -7990 -8163 -14634 -13274 -12108 -10894 -11364 -9082 -14554 -20728
15681 -20728 -14433 -10357 -14767 -17207 -7660 -3431 -12870 -3929 -1306 -8429 -15181 -14255 -13117 -7071 -3924
15666 -3924 -5308 -2342 -9449 -9757 -8160 -23492 -26755 -15279 -4318 -11532 -13843 -5840 -8202 -2509
15652 -2509 -2912 -11328 -7597 -3973 -3332 -3226 -4875 -5272 -10331 -17980 -22321 -19178 -17390 -21931 -24266 -27481
15636 -27481 -27013 -18340 -16205 -10710 -7666 -9151 -8404 -5591 -8505 -6258 -10761 -9964 -6561 -11450 -11123
15621 -11123 -8552 -9448 -18186 -18020 -15995 -1726 9145 3975 -140 11507 22968 18037 9706 6173
15607 6173 3202 -5334 -487 7187 13412 10290 19299 13329 723 4787 -11459 -19136 -11920 -11333
15593 -11333 -10734 -12465 -16409 -12504 -9437 -13416 -16475 -13637 -13800 -16180 -13301 -10731 -130 46 -9414
15578 -9414 -11964 -9293 -7130 -5131 -2467 -4783 6735 8904 930 -2315 -768 -1658 -2470 -276 -6243
15563 -6243 -7827 -13083 -18625 -18762 -15398 -20473 -24688 -21070 -18803 -20271 -17690 -15570 -18058 -15751 -12409
15548 -12409 -8937 -11140 -8963 -7172 -5678 -21072 -22579 -20247 -20231 -14182 -13585 -14102 -18872 -13029 -12404
15533 -12404 -23338 -14846 -16139 -17029 -21333 -17852 -9874 1067 5757 7885 87 -4339 -914 4250
15519 4250 2203 1302 2285 -7671 -13335 -2292 3439 -572 -1569 348 4146 6194 1781 6118 992
15504 992 -2226 -6916 -8307 -11135 -17906 -19240 -11829 -12076 -5434 -3327 -9157 -1487 1339 3554 -740
15489 -740 11890 15249 13393 11496 -3322 -5064 -3521 151 -7039 -21652 -18322 -11395 -1968 -191
15475 -191 -12188 -7178 -6274 -7920 -9560 -12625 -14397 -11536 667 2805 1550 -875 -4606 -3238 -11247
15460 -11247 -13131 -5681 -1427 -6846 -7563 -7716 -17685 -20781 -24195 -17687 -8640 -6738 -5633 -12839 -17385
15445 -17385 -18824 -7128 -13966 -21243 -16501 -8760 -6920 -5566 -12117 -5323 -10219 -6807 -8734 -18416
15431 -18416 -6703 -4517 -11148 -19764 -19714 -22800 -21885 -19412 -27732 -29720 -18639 -6394 -6745 -9702 -11727
15416 -11727 -24053 -18980 -7247 1219 -2501 1831 3416 7734 9683 3793 -6088 -1925 1076 -187
15402 -187 -7485 -11118 -20584 -23718 -13918 -5675 -5117 -1570 -7964 -7345 -5157 -5064 -2094 -2567 -3586 -6270
15386 -6270 -7951 -15136 -19790 -11925 -10880 -13215 -9814 -6505 -3666 -9922 -21062 -18302 -16454 -8212
15372 -8212 -4095 -7673 -16445 -27208 -19952 -8988 -6467 7340 2487 423 -707 -4630 -7429 -15542
15358 -15542 -16420 -11728 -12154 -8387 1484 -3953 695 7888 10686 3000 -2997 -5325 -9419 -8955 -10333
15343 -10333 -3838 -1105 -2987 482 994 -3861 -6582 3886 1208 -10064 -2273 4067 1619 15406
15329 15406 15440 10267 14093 754 -15122 -15321 -16226 -19458 -11858 -9058 -7119 -14547 -12759 -5918 -5460
15314 -5460 -6999 -16687 -24265 -28416 -30362 -26556 -15689 -15977 -17399 -8447 -16633 -20732 -17102 -11591 -9027
15299 -9027 -7215 3572 8689 1477 -15843 -12283 5294 8281 10657 7943 3616 3621 6641 4644 6257
15284 6257 4773 2109 -4686 -10342 -11925 -7158 15 -2492 -12487 -7287 -12851 -13760 -7340 2063 2714
15269 2714 -5020 -15392 -14151 -6833 -6764 -9271 -3376 7023 -891 -539 -3174 -816 -3667 -5252 -11204
15254 -11204 -7237 -7674 -7222 1131 2041 454 189 -1471 225 -375 -68 -1101 -5078 -7613 -12575 -17539
15238 -17539 -15077 -11528 -19912 -27019 -30920 -17324 -10698 -5323 -3412 -6257 -10070 -20038 -19750 -18619
15224 -18619 -11556 -15857 -14188 -10640 -9266 -4285 1486 5078 -8171 -21169 -16828 -12246 -4724 582
15210 582 -5411 -11339 -15521 -18245 -15284 -19600 -22082 -9866 -2506 -5312 -1742 2375 1855 -8182 -12407
15195 -12407 -14817 -27538 -24930 -16031 -12871 -7676 -4960 -14637 -21900 -23923 -23062 -29433 -31799 -25571
15181 -25571 -14049 1603 4251 -3087 -9025 -9003 -6547 -5874 -7960 -11805 -14387 -8832 -15697 -14425 -5102
15166 -5102 2121 7014 5282 -4938 -7974 -7936 -17403 -22404 -30666 -25665 -20871 -20059 -16985 -10480 -8208
15151 -8208 -6907 -13399 -8595 -7081 -9059 -2376 -5635 -15273 -14192 -17102 -12967 -4419 2608 1586 -8151
15136 -8151 -11515 -14085 -15921 -7182 1080 2371 -6936 -7131 -1204 -8970 -14693 -23339 -24190 -23886 -10623
15121 -10623 -10587 -13320 -3078 -1396 -15187 -13622 -9253 -10423 -1045 -4311 -14761 -13174 -11819 -4415
15107 -4415 3385 1104 2754 3816 -329 592 -2824 1600 14708 8191 810 -7220 -5182 -10762 -11749
15092 -11749 -10313 -13914 -11759 -10655 -16906 -23191 -19119 -16384 -6690 4453 3743 -4101 -16418 -18134
15078 -18134 -12001 -6129 -16484 -22639 -21016 -17431 -21884 -27376 -25828 -14800 -7968 -9769 -12601 -12360
15064 -12360 -21499 -17198 -16574 -22328 -11680 -9698 -5488 2918 482 -2639 672 -4995 -11223 -12518
15050 -12518 -10681 -12644 -13516 -11819 -6882 -2237 247 1966 3438 5046 4778 -2152 -4794 -12742 -11899
15035 -11899 -632 13107 9546 1084 3884 6926 3537 6778 6927 11691 8896 9057 9521 2444 -11999
15020 -11999 -17772 -19995 -19557 -10113 -5222 -13368 -17498 -23541 -27906 -26982 -14894 -10965 -9041 -17048 -11914
15005 -11914 -6924 -9646 -10987 -7983 -2661 2407 -1230 -2955 -3486 -7067 -19178 -16475 -3691 1324
14991 1324 6113 9 -9744 -13951 -19814 -28305 -27026 -26660 -22520 -6471 -7466 -14564 -14142 -16940 -11286
14976 -11286 -1086 8567 6442 5983 -225 -2046 -1247 -129 6804 16 258 3944 8384 11082 10069
14961 10069 1013 -4287 -3959 -3259 -7253 -7188 -7750 -16695 -13804 -16357 -19494 -16255 -9365 -14196 -17138 -10301
14945 -10301 -8263 -1485 6936 4163 5951 1592 -4124 -4308 3304 2955 -3450 -5309 -4547 -2992 -7991
14930 -7991 -3358 6674 6137 -4672 -14129 -12668 -21410 -30235 -34886 -42753 -47025 -43398 -32611 -32689 -37909
14915 -37909 -28153 -21320 -12948 -10779 -5657 -5849 -6843 -5661 1124 2307 11293 12156 3436 -6056 -4866
14900 -4866 -6211 -3406 -5798 -6747 -3156 -7795 -6558 -6662 -7190 1867 -4806 -13682 -11222 -9903 -12478
14885 -12478 -22577 -25833 -25539 -17000 -2625 2286 1930 288 -10317 -13942 -9024 -3181 4735 3603
14871 3603 7112 2034 -6725 -10060 -10541 -5858 3606 -2449 -8602 -5853 -6154 -3909 -6482 -12017 -11418
14856 -11418 -8165 -9622 1876 -864 -7353 -8295 -9483 -5289 -12221 -14892 -9795 -10449 -10867 628 -12680
14841 -12680 -18115 -12400 -5012 6097 6015 2210 -4153 -3542 -7156 -9039 -4428 4440 11459 9471 3374
14826 3374 -5265 -7166 -6272 -8153 -4457 -4340 -5729 -12979 -15490 -24071 -16853 -15716 -20027 -12589 -7298
14811 -7298 -6255 -694 -2211 -8276 -14350 -14145 -11496 -14562 -5853 4966 65 -7737 -16221 -15346 -17026
14796 -17026 -21045 -15855 -10736 -12877 -9290 -4187 2864 7965 -1521 -1557 -1747 -8955 -7490 5840 8648
14781 8648 2355 7857 11723 5753 1539 -19 5718 2760 2449 7046 9684 7651 -4563 -6632 -641
14766 -641 -1304 -1672 -1731 -79 7637 3874 30 2578 582 -5288 -22243 -28642 -24855 -20503 -9081
14751 -9081 1337 3126 4472 -1191 -5612 -9066 -7098 16 6673 633 -7359 -9477 -10149 -25375
14737 -25375 -25675 -20527 -7268 111 2332 -141 -277 7865 -880 -17562 -6654 -444 -4436 -5012
14723 -5012 -7832 1869 146 5194 1787 -7034 -6623 824 762 -3567 -63 12135 17441 12332 1756
14708 1756 2246 5225 1419 -7716 -18118 -18949 -19586 -17859 -9033 5753 9177 -1893 -11239 -9464 -10414
14693 -10414 -2139 -355 -2200 27 -11542 -21192 -19012 -14549 -3781 7354 14819 16663 8363 3245
14679 3245 1375 -3451 7449 17784 13226 -4416 2376 -1623 4253 2758 2138 4198 -1967 -7704
14665 -7704 -8302 -9196 -3285 -2965 -3779 -5909 -15101 -5755 -3535 -11090 -2197 -1084 -10146 -8444 -2249 -2189
14649 -2189 -3188 11158 12338 4948 -4989 -10806 3099 13505 13572 5791 6363 11195 4492 -2417 -5573
14634 -5573 -6601 -7957 1857 6107 2107 6082 6751 2458 6776 -3748 -7091 -7901 -3946 -1613 -8677
14619 -8677 -420 6360 19506 14297 10954 10247 8610 6060 -845 -3817 -11474 -10095 -6430 -4970 -5083
14604 -5083 1242 -4054 -4910 -3717 -5261 -2397 -258 -3907 2008 6984 15593 19760 16240 9064 -2101
14589 -2101 -6254 -9190 -9144 322 3374 2845 -5655 -8300 -7122 -4906 866 -6384 -5462 4722 2048
14574 2048 -7376 -5242 -818 -893 1104 -12370 -12756 1415 8543 7690 6503 -12067 -17724 -10157 -10079
14559 -10079 -16339 -11074 -5455 -9514 -11584 -6408 -7760 -12514 -19162 -21816 -21783 -17679 -17199 -15587 -5683
14544 -5683 -19654 -18749 -13877 -3985 -624 -2711 5169 10245 9713 6021 15962 16042 10995 6822 1944
14529 1944 -4474 -8929 -9757 -9798 -5501 896 3577 1976 1936 3864 5733 3017 -2972 -7522 -7503 5622
14513 5622 4297 -1379 1755 10881 6629 -11340 -13559 -12444 -17863 -18761 -17258 -18972 -19063 -12273 -13773
14498 -13773 -14111 -5097 3493 1135 -2081 -3850 -9666 -8753 -7010 -5674 -3023 2191 1908 7222 3320
14483 3320 3382 6820 3522 3586 3546 1257 13 -6815 -15279 -14646 -10602 -6820 2252 4180 5133 7548 1011
14466 1011 -6631 -14713 -5978 10878 13044 15276 13915 13780 11445 13394 11108 15028 14491 13070 5198
14451 5198 4079 2986 -3264 -5820 -10676 -16334 -17481 -13490 -7034 -3580 -4441 7825 13882 12093 -1750
14436 -1750 -1834 -1275 -3135 -2283 6451 -9368 -22899 -13194 -4315 -7500 -19245 -22756 -25916 -13352 -3446
14421 -3446 -4850 125 5867 11764 12352 5212 -4986 -5337 3972 6544 6737 3142 11446 1474 -6143
14406 -6143 -14036 -11926 -2067 11051 13148 5363 -4451 200 1272 4662 2165 1125 5641 3571
14392 3571 -2608 -9540 -12688 -6086 4453 -3586 -2847 2298 6192 18006 17061 16471 14206 2396 8230
14377 8230 9887 1635 -3280 2407 6818 7533 6467 8102 12273 16824 13988 3285 -746 -2321 4283
14362 4283 4048 -2084 -5131 -6934 -22045 -24273 -18564 -11534 -13374 -15912 -13667 -10940 -13960 -4124 -59
14347 -59 -914 -4087 -4703 6643 11580 4414 2472 -63 -9683 -5707 -5377 -15964 -18544 -6857 -7539
14332 -7539 -13241 -6661 -8508 3962 15146 5986 5174 4515 1531 6379 9547 7390 8017 5261 9499
14317 9499 8170 -7707 -13377 -4324 6728 6967 6622 2565 -1632 -2896 4034 1422 -3774 -2383 -6595
14302 -6595 -3241 -6682 -7747 2246 -1103 3407 16734 13869 -6748 -14854 -15676 -19921 -15849 -16892
14288 -16892 -20039 -10315 -2545 3599 -1041 -5068 715 -2311 -8375 -11750 -9854 -5443 -2168 -446
14274 -446 2038 739 527 -3058 -3055 -6456 1984 14857 11599 1805 -7478 -15474 -12740 -5294 2594 4150
14258 4150 -773 2096 2042 4816 11043 9779 7052 7046 -3470 -6568 2896 10611 611 -1798 15323
14243 15323 14277 14166 13653 13596 12911 838 -5739 -7232 -16611 -17990 -14900 -15823 -17156 -14972 -3922
14228 -3922 -711 190 1771 6955 9131 5277 3568 -5594 -8919 -8499 -6505 2334 2777 -8667 -9794
14213 -9794 -3664 -6489 -8894 -590 -642 -8162 -15496 -16360 -15291 -7768 -6187 -7679 -16382 -15026 -5380
14198 -5380 9236 13575 17146 12066 10637 11578 6162 5125 14466 12228 5795 -1079 -9454 1598
14184 1598 4396 7354 7156 8226 7388 9270 6668 5774 3817 6537 873 897 2898 10095 6942 5812
14168 5812 -2358 882 1763 9322 3783 -6418 -492 4714 4916 -3254 -16742 -14979 -10805 -1703 13669
14153 13669 11645 4568 12032 14999 13553 10468 8684 5191 -1547 3225 6461 646 1853 2746 -3544
14138 -3544 -16040 -16098 -3861 2733 -608 -12721 -25171 -16421 -1 2371 -1066 -842 826 5411
14124 5411 5243 2989 5254 8117 3991 -7301 -4626 -4987 8627 12218 7765 -6924 -7671 -5132 -8212
14109 -8212 6093 10507 13314 15038 9926 52 -408 -2456 2102 6930 3615 -1315 2885 5474 7585
14094 7585 10300 12184 14594 12886 13620 4564 5572 6325 -4556 255 -1457 -17906 -20865 -18791 -13216
14079 -13216 -8225 227 8523 8267 10314 2703 -7108 7707 14264 3620 4571 -2882 -3021 -3276 -7098
14064 -7098 -8777 -13475 -8879 885 -4609 -9711 -15116 -17022 -14924 -12801 -15677 -775 1004 194 -6892
14049 -6892 -7700 4502 23964 23839 18710 13515 9887 6507 15277 17615 9658 5533 -3125 -2358 -2610
14034 -2610 -7045 -7446 -3394 1591 -2179 -2065 1159 4370 -5336 -8991 -9768 -5546 -5544 717 -6393 -23013
14018 -23013 -13244 -6753 -464 5496 -8483 -12035 -7605 -6922 -8454 -5318 -3963 4273 4357 3251 -6941
14003 -6941 -10178 -7213 -22183 -33767 -26997 -14858 -12750 -8673 -8367 -14902 -9378 -7571 -13076 -9833
13989 -9833 -10568 -12277 -5877 7427 22068 33892 35343 25578 16191 11805 15007 -891 -5943 -10459
13975 -10459 -18140 -21497 -13277 -1446 -5348 4748 13506 17232 14425 19709 18163 21815 11856 7405
13961 7405 6337 14806 18745 18605 9645 366 -1542 7383 12899 7647 10901 15606 16899 11903 184
13946 184 -13353 -15094 -4764 -3745 -14404 -13316 -3337 1631 -590 -4809 -6282 -5985 -7453 -13403
13932 -13403 -806 6461 4020 17263 16240 10414 8374 8236 9615 10828 11065 10336 12123 10566 16812
13917 16812 17568 11110 226 3366 657 -206 2960 4679 13410 26457 28397 16104 -3341 -10152
13903 -10152 -6904 4214 8584 11201 13410 4976 -6941 -2095 -5484 -12814 -3330 -1964 322 -7752
13889 -7752 -7669 -8729 -4437 9449 7051 5444 4670 -3380 -5163 955 10817 16488 18429 5932 -4319
13874 -4319 2621 8935 11974 12762 17430 19719 20927 12076 7194 9165 12404 9895 13995 23442 17735
13859 17735 16583 15056 6910 5922 5914 9346 13606 9213 3660 7260 21918 30611 20890 17149 10935
13844 10935 -1068 -7042 -8417 -10538 1147 -461 -2551 4136 7693 4661 5568 9674 12743 7740
13830 7740 6474 7389 11808 13154 9714 6667 4068 1783 -2715 -11128 -17584 -8648 -5320 1378 16787
13815 16787 10034 3995 -2417 -5370 -5557 -4620 -7535 -1072 7157 3863 5525 14445 16020 17650 19653
13800 19653 13782 13737 23901 18298 13248 7625 -734 5785 8295 9308 10448 8878 4234 1883 9134
13785 9134 2214 5868 6666 9760 14403 17439 17405 6882 -4124 -14263 -20836 -21158 -17211 -20221 -17938
13770 -17938 -13090 -7938 -2875 -3737 -5190 -80 13418 16507 4149 8793 1945 -400 1146 -2675
13756 -2675 5682 16247 18404 19162 6436 -4060 1385 10148 8375 1377 498 1276 7461 14800 9056
13741 9056 13239 16168 10968 4338 2145 2834 3279 4117 13553 13905 8076 7109 6700 -1049 -2147 -3147
13725 -3147 2205 8104 8464 1284 8079 12881 12946 9795 4439 -5263 -14089 -1423 12036 17606 15239
13710 15239 6270 -3564 3008 -1617 602 8301 9316 21894 20518 18206 22802 19854 12645 12639 19898
13695 19898 18474 13854 14593 16127 18839 13626 15062 8431 5242 12396 12129 20039 24351 13994 10415
13680 10415 17483 13581 7463 8405 8820 -8941 -15388 -6260 8107 8500 9055 10438 12284 4220 -9697
13665 -9697 -9106 -2571 -1395 -4295 -2300 2360 5120 12006 12135 14014 28541 28548 12197 6555 -7323
13650 -7323 -1448 5481 8582 5927 7068 1387 6624 4554 6828 4201 5728 15520 21703 12154 -4374
13635 -4374 -16082 -5906 12058 13873 19954 16384 4416 -7140 -3564 1182 4639 6133 5697 6674
13621 6674 363 501 3130 5900 7057 17166 22200 16430 21843 23408 13073 -2869 1433 11343
13607 11343 17361 8033 8779 8260 10665 4067 2491 12150 11838 8720 8785 18124 20739 9328 7715
13592 7715 11566 6409 3670 5655 11383 905 -20 13498 17065 8407 11273 18509 24434 24619 19768
13577 19768 17312 13132 20157 13307 5591 3677 21844 22876 14737 7475 5984 14252 19508 24448
13563 24448 35774 35556 32166 26423 23490 22874 31162 34890 33959 39669 42646 34116 33827 29271 24363
13548 24363 35994 25746 10164 4432 8260 16381 16754 17732 12109 19527 28358 33757 17254 5529
13534 5529 7847 13546 17248 13189 11013 9668 16391 12565 3573 -3435 -2840 10674 11409 7814 4031
13519 4031 10253 21970 24097 22149 14758 18230 10853 7106 8064 8939 19057 7308 8699 8673 8316
13504 8316 9430 9176 7289 8016 11717 12975 14788 19194 21266 12958 10368 8687 5656 18136 12959
13489 12959 8962 16975 20173 28671 30647 20264 8474 3308 -7300 -293 3058 2609 11391 13420
13475 13420 16342 13950 14361 11186 11627 13311 1122 1897 381 1525 2324 11039 9293 21593 30014
13460 30014 22002 17024 20136 22775 15527 14302 9430 9774 17384 19789 16622 16731 17784 12571 13014
13445 13014 15013 18978 20674 18286 11203 11587 17933 16422 21922 19966 14443 20812 24572 20179 19385
13430 19385 23089 17453 12706 11331 15931 11380 7487 13066 25002 23648 23664 27911 29689 22086 13302
13415 13302 21883 36203 39093 39146 42296 32595 24902 30650 31516 25149 28339 30593 26322 30422 21058
13400 21058 19895 21389 20709 15413 20318 19045 20544 12303 15746 24320 21061 11543 13573 11854 16787
13385 16787 25144 34781 36032 32932 30876 26325 22829 24989 21052 8249 8755 11130 21901 11981
13371 11981 4944 8408 22413 22090 16762 29307 33605 31963 42600 39617 29552 23078 23437 19847
13357 19847 16978 26533 34335 42515 41369 40301 41451 41579 43487 41968 26825 19717 15600 20825
13343 20825 14432 15644 30707 40340 27106 19741 12161 11689 19390 13275 13712 20866 28092 34594
13329 34594 27964 24718 26784 19224 21595 15095 12566 23681 29292 21073 4422 10232 22032 25494
13315 25494 24392 28970 26732 23321 24714 17326 22517 30386 27809 19856 21455 23371 22645 15349 18226
13300 18226 25405 22595 23589 22294 16935 7398 7880 11745 10367 13315 19006 20171 24567 22821 26581
13285 26581 25046 18827 22944 27213 21088 7244 7955 11930 16676 25475 30445 21923 18206 18569 21212
13270 21212 19704 14794 17058 22116 28644 29923 27108 22248 24611 36798 41476 33446 25436 28710
13256 28710 33127 29563 26632 23231 15824 15750 23846 25331 17873 27344 30531 24500 24800 27288 21818
13241 21818 23162 24328 14645 7956 9195 7967 8128 9576 20046 30417 30748 30518 32530 31847 25287
13226 25287 24380 30726 35965 33254 34971 44433 49476 45062 37635 37214 32890 30600 26316 31407 32087
13211 32087 34250 40286 38474 41762 32535 21029 28055 39320 48250 52243 53171 50360 49143 43391
13197 43391 36622 33546 29900 30262 38673 40756 45552 42043 41823 45849 40559 38938 39257 43928 43689
13182 43689 29026 28835 24891 30568 28819 19500 16886 19634 24741 30644 35011 38546 42063 46373
13168 46373 36491 27480 21481 21175 31258 34577 27525 20746 7532 3569 2674 9758 17780 27641
13154 27641 26632 30983 30629 42556 56263 59496 61541 64141 64006 48226 45090 37713 22151 14605
13140 14605 3897 5677 16595 18096 21503 30492 37046 33898 33232 32803 35429 43849 43387 39189 29830
13125 29830 34968 46258 60558 56723 51485 54205 64806 77168 70845 65090 67280 64941 60645
13112 60645 56368 54184 48106 44955 37939 30393 30627 38913 56462 59351 55779 50837 52505 43401
13098 43401 36002 33059 31225 33902 33525 26247 27837 38675 43912 48409 64309 72458 82981 102694
13084 102694 112012 105785 97382 98407 84611 64761 52824 39587 30259 34147 31162 41896 54252
13071 54252 56649 54571 59769 59977 58182 54053 54616 50814 48109 54683 56603 58314 52916 46310 47040
13056 47040 51036 53863 62118 72584 73237 77688 76160 72865 70389 64279 69873 78959 69401 57935
13042 57935 56569 57508 55660 61675 67241 60266 45666 39482 34672 34505 37272 36207 43108 42087 45649
13027 45649 47106 47699 33548 29750 39231 54249 65889 76008 68311 63894 65529 66360 61133 55383
13013 55383 38367 23649 22079 34617 38414 37112 47700 47015 35970 39581 44261 38535 28000
13000 28000 29245 30742 40728 59983 60922 66458 67740 53852 44609 47957 44381 40886 37237 50914
12986 50914 63749 58343 49788 52343 52079 55403 49100 37751 45396 52066 46000 41015 46458 44519
12972 44519 44531 41164 42326 37148 30082 35365 45063 47653 46963 51662 59395 64087 66604 55419 41945
12957 41945 39158 55357 61659 63103 61432 52381 57538 67878 68606 59333 51772 56373 65935 65209
12943 65209 53398 48287 43429 44168 46683 55916 63986 65567 55613 41271 34926 43414 45468 51958
12929 51958 57078 58274 60548 45030 51698 58312 56532 63619 59733 55682 55676 58480 63892 68240 60007
12914 60007 69171 62820 55102 57184 60333 66662 75197 80415 74595 68931 58889 57358 63862 60285
12900 60285 61726 64950 67099 71578 83044 85826 84998 93805 97377 94890 96320 97427 100467 107810
12886 107810 109531 102549 96360 87861 77997 71892 79132 75023 75914 72866 71210 63771 56123 63937
12872 63937 74382 82934 90011 96220 101905 104524 95444 97750 95317 90976 88930 102130 107675 102889
12858 102889 100626 113850 117707 115942 112830 109145 97052 101046 108743 106913 105472 114784 118945 116730
12844 116730 116569 119185 119656 118897 117768 106694 108215 115614 121368 125255 116361 100283 102242 94816
12830 94816 97056 109742 121860 123361 123668 115614 110371 116669 124218 125168 126679 137880 130946 125938
12816 125938 127064 122193 112129 113371 111051 107857 106679 115062 113401 120241 124216 129656 121329 116416
12802 116416 114161 110652 105455 109412 105686 96762 101217 108452 111136 113285 116049 121051 115993 115707
12788 115707 124069 124705 125143 123962 117294 109484 99834 103582 103704 104259 102645 103809 103360 118393 115073
12773 115073 107110 106337 100067 104309 113477 111628 111061 112708 110304 111780 112930 114257 110923 103246 92771
12758 92771 92184 96587 93645 86082 88008 92195 94642 100090 99018 103005 110432 113848 98376 89772
12744 89772 104817 108262 108785 105040 102537 99830 96416 98362 99913 104478 112040 110399 111712 116376
12730 116376 127867 129520 125244 122417 119408 107888 104869 105688 96050 88722 93091 95039 93028 96174
12716 96174 100317 98132 93711 90686 93597 105296 106713 116061 116144 116882 126876 139456 144091 143551 143717
12701 143717 139732 135687 129924 129452 125339 124628 135448 147221 148198 144195 135506 128840 118511 118441 125068
12686 125068 117050 119236 125602 135215 130166 128912 119802 117526 122828 134073 127514 125415 135295 144719
12672 144719 155299 156417 159295 157448 160161 165193 161588 149729 151935 151057 149152 154200 158958 157697
12658 157697 157892 173657 177936 169928 165278 160841 168144 160756 149274 140897 147096 150216 144062 150376
12644 150376 154416 154052 153979 154539 152777 162258 173617 177109 171766 159029 158031 156857 150224 149693 159097
12629 159097 179139 193091 189385 188051 182603 166823 165262 159927 146119 131242 126677 126776 131265
12616 131265 142876 146452 157208 154505 153772 146092 134996 126574 125101 129677 145300 161392 180527
12603 180527 189129 190765 192377 188495 189136 192354 195606 196876 194872 190001 213609 248529 260621 266635
12589 266635 286519 315564 344349 373620 428351 495676 572771 659901 739658 805258 840829
12578 840829 831635 791822 744121 672502 595617 542557 496910 470262 446694 429835 418972 423813
12566 423813 426362 438396 461519 495625 542750 581474 610044 640743 680165 701390 707800 715050
12554 715050 738516 774231 813297 864517 933275 1002213 1053569 1108899 1146102 1142937 1107166 1046189
12542 1046189 968932 908550 872323 845808 837234 843603 832536 827304 807299 772431 742051 711754
12530 711754 678684 646302 620033 594196 582780 587311 596278 611037 632238 654477 702428 763088
12518 763088 831357 909470 986205 1039128 1059165 1043316 993626 915312 828641 741188 664189
12507 664189 606092 563544 534860 512951 486025 457927 440882 423085 411539 409999 404710 401977
12495 401977 402400 402071 393459 392363 389861 387428 382757 374674 369611 370042 377821 373014 376594 371293 366737
12480 366737 377745 390930 399736 388696 383209 388873 394093 389453 402795 412897 408143 405850 409421
12467 409421 418257 422757 432416 433209 445683 450163 449406 460868 469674 475907 491403 501242 516174 522153
12453 522153 524914 532409 545573 569640 593467 628905 658385 683922 719918 765969 812208 852996
12441 852996 901622 955820 1025522 1099753 1170722 1249183 1341040 1475710 1631344 1803197 2016667
12430 2016667 2288832 2632010 3071434 3645103 4406025 5433937 6885088 8957978 11918983
12421 11918983 15962097 20796836 25473599 28903543 30144499 28183603 23456843 18209020
12413 18209020 14051843 11135937 9114878 7673193 6614777 5824702 5235625 4787323
12405 4787323 4430741 4135071 3893529 3685963 3489947 3327271 3171800 3016464 2869142
12396 2869142 2736064 2619219 2509093 2398208 2298618 2201222 2123289 2053857 1992794 1945685
12386 1945685 1893073 1842545 1814356 1786718 1752936 1703749 1661836 1625153 1588719 1560075 1535656
12375 1535656 1510659 1486094 1466084 1442311 1419644 1402074 1373954 1343145 1311069 1271405 1228156
12364 1228156 1203533 1179776 1161337 1151437 1144406 1135411 1119738 1091308 1053783 1009129 974123 935955
12352 935955 888772 837603 798121 760252 729549 707511 687987 676985 672008 657259 647405 657019
12340 657019 671249 678567 705061 745932 779066 806556 820598 826956 819570 805359 786997 762906
12328 762906 749501 733767 720839 697817 675935 649488 612161 576784 549167 534199 515500
12317 515500 519912 521595 530873 540356 537561 534530 522181 495061 471317 449890 447700 458245 501303
12304 501303 545161 595161 639169 673857 716116 753203 778593 814431 857909 898375 937002
12293 937002 967193 980722 987756 988183 961877 927740 900810 901882 910997 932120 979825 1053462
12281 1053462 1134553 1231176 1329018 1429860 1532967 1616550 1662924 1670920 1654067 1622434 1594163
12270 1594163 1572567 1559174 1551301 1550099 1556942 1568731 1584478 1595115 1600996 1615057 1637429 1659146
12258 1659146 1684512 1715372 1753118 1799563 1840359 1878097 1911617 1940233 2009175 2075963 2145433
12247 2145433 2220219 2310647 2393716 2441210 2466567 2465027 2448560 2428282 2412531 2406691 2418066 2459459
12235 2459459 2518390 2603130 2703925 2813460 2941776 3076577 3208291 3344199 3487447 3628342
12225 3628342 3767213 3882257 3965121 4007906 4011639 3976354 3913078 3854888 3803610 3781212 3794554
12214 3794554 3831667 3896068 3994222 4090307 4151303 4173098 4161597 4146274 4132073 4129121 4143051
12203 4143051 4181917 4233244 4301443 4392356 4493155 4591933 4695118 4801279 4898343 4990353 5097695
12192 5097695 5185465 5264453 5337938 5395630 5433416 5456462 5478254 5495624 5513945 5544963 5572022
12181 5572022 5608957 5659766 5738453 5842732 5959621 6095835 6234487 6405320 6611656 6865617
12171 6865617 7162693 7508099 7929841 8437618 9055178 9802208 10710087 11798085 13138936
12162 13138936 14778192 16760220 19172010 22134763 25805152 30464689 36507042 44492831
12154 44492831 55056582 68594048 84747651 101950339 117517989 128349142 131780592
12147 131780592 126811769 115109783 100271220 85753557 73479063 63939441 56951701
12140 56951701 52102441 49001945 47319615 46869734 47630005 49702013 53254415 58300130
12132 58300130 64625776 71800473 79195535 86095694 91964007 96635614 100182456 102889072
12124 102889072 105319161 108433657 113358317 120907501 130990654 142278731 152500091
12117 152500091 159169330 160370361 155582106 145983819 134063291 122489467 113155342 106942863
12109 106942863 103896058 103457995 104635969 106195916 106957847 106144502 103508999 99242239
12101 99242239 93719659 87381992 80717543 74408536 69190974 65546073 63575209 63201200
12093 63201200 64423645 67408204 72537945 80342070 91304300 105529541 122292600 139677753
12085 139677753 154696531 164061089 165198476 157261028 141945691 122983992 104300897
12078 104300897 88290967 75611958 65903635 58512846 52823589 48339347 44693727 41634465
12070 41634465 38989774 36666428 34626338 32815508 31197253 29751503 28448892 27266687
12062 27266687 26197502 25218814 24324091 23484129 22667703 21904682 21203773 20552089 19956204
12053 19956204 19399410 18884190 18392285 17924792 17470077 17035385 16599494 16176761 15776367
12044 15776367 15393291 15025694 14678816 14333245 14001805 13685686 13361091 13043562 12733057
12035 12733057 12425743 12120559 11845597 11584077 11351465 11139278 10948963 10767009 10596367
12026 10596367 10438230 10286828 10135559 9970570 9807043 9638751 9457643 9265888 9082606
12017 9082606 8904377 8705561 8526126 8361607 8192618 8027743 7858275 7712197 7572736
12008 7572736 7436384 7317254 7208927 7101722 6989642 6896137 6815697 6739983 6672075 6612994
11998 6612994 6564038 6517652 6485382 6450077 6410873 6364635 6298363 6221095 6133288 6022642 5908405
11987 5908405 5791835 5685899 5585643 5482571 5400250 5332847 5261547 5189291 5120616 5051383
11977 5051383 4985948 4909794 4812542 4726988 4641113 4546054 4457119 4385019 4319091 4273909 4258484
11966 4258484 4251187 4266732 4308368 4384357 4480915 4595822 4707692 4777835 4792951 4745642 4632702
11955 4632702 4473951 4303138 4135314 3987036 3871409 3765068 3660271 3568923 3486311 3407741
11945 3407741 3311497 3210317 3112230 3014988 2930232 2863733 2804289 2765185 2724926 2688724 2658465
11934 2658465 2629139 2605448 2584091 2564755 2563406 2582744 2589595 2606896 2623905 2628334 2598339 2566495
11922 2566495 2546274 2540078 2552714 2606443 2681710 2776009 2867683 2945663 2978499 2954617 2886536
11911 2886536 2788177 2651598 2511833 2384491 2276805 2190380 2117101 2079752 2055740 2037056
11901 2037056 2043337 2068804 2110527 2173722 2238945 2305140 2375476 2433983 2480068 2498684 2494186 2492062
11889 2492062 2498611 2521891 2564575 2619051 2673507 2701003 2691726 2644827 2566532 2456623 2317883
11878 2317883 2180066 2068332 1985254 1931660 1892952 1880148 1873548 1876541 1885826 1895059 1887252 1869088
11866 1869088 1847815 1803885 1752848 1701664 1650422 1627139 1635266 1661835 1703113 1756881 1843543
11855 1843543 1936121 2029071 2106322 2159470 2164430 2115388 2025543 1907007 1763976 1622558 1514474
11844 1514474 1417953 1331108 1266587 1198874 1142872 1102486 1057366 1029294 997583 973279 958012
11833 958012 940558 925819 913959 904039 897770 882779 875100 877420 872679 858188 847855 836208
11821 836208 822900 812524 793258 764152 744761 738075 726549 718661 716852 713211 714280 714270 711430
11808 711430 697665 676225 663683 646295 634989 625121 611217 601085 578105 562088 565516 573403
11796 573403 564892 563019 562493 564907 559941 558124 562363 569275 574417 571933 556794 552378 552931 541941
11782 541941 546317 548339 547161 545871 550217 545943 534717 517540 507551 504217 499666 496253 484722
11769 484722 481424 478234 476394 481847 495889 494697 487116 486129 480034 480089 477289 461568 449528 450339
11755 450339 453253 457723 462686 473668 477672 476299 485948 491764 498063 494662 485770 477941 470086 457403
11741 457403 439753 430106 424801 422974 424025 425490 426898 420485 410009 405274 409787 424007 418317
11728 418317 409115 411617 429442 436500 441071 449103 458537 475846 508044 538500 575546 622549 669624
11715 669624 745128 825662 874044 886172 882364 843242 795345 741197 704041 663474 624576 594975
11703 594975 570064 559013 560951 554535 547281 560532 580583 602287 623406 650777 688498 730365
11691 730365 783656 829518 871805 901581 936119 962491 999101 1060177 1130902 1194242 1252930
11680 1252930 1303480 1351326 1394173 1432230 1476386 1522104 1545866 1540969 1507510 1450816 1388124
11669 1388124 1321835 1252400 1178553 1131472 1071304 1023256 980885 940725 910203 905919 908578 935715
11657 935715 974255 1026691 1084954 1150272 1212666 1268060 1324851 1394181 1461299 1523280 1563393
11646 1563393 1585925 1574823 1531782 1489040 1457190 1424745 1392003 1347800 1289213 1220921 1165255
11635 1165255 1097538 1034038 987126 957908 921852 898612 867449 827452 793895 755288 707176
11624 707176 666693 635759 604906 586007 575738 571155 578267 592638 607463 628788 669679 726731
11612 726731 780010 833013 880239 906967 900950 865425 811497 745168 673736 619128 566752 512591
11600 512591 477796 456289 439751 421592 396253 379453 362341 352224 341463 335613 340068 344874
11588 344874 344624 334780 335489 335065 327938 316459 303351 305819 298958 288919 281100 278759 280781 282156
11574 282156 269680 262916 253245 239197 242447 246076 243820 242166 234153 222449 219042 217801 221801
11561 221801 225433 236180 238163 247735 253284 243035 238213 232370 217298 207445 208988 222303 218257
11548 218257 208566 200401 207062 211112 207935 206232 201062 206454 220090 213553 203701 190291 186109 201535
11534 201535 217689 215412 220198 224798 230234 233590 224830 220065 228141 231330 233921 239825 228389 226274
11520 226274 225038 216738 214075 203740 200826 192822 172924 156935 149629 143085 150255 171461 194790
11507 194790 220292 252742 276206 287355 297474 305438 310203 326018 326264 301452 281213 266627
11495 266627 252122 232787 227640 224122 226406 235002 233875 228148 235816 246943 261052 280636 278834
11482 278834 281056 276186 267784 266660 257086 246797 236683 240939 244932 248091 266976 279751 284215
11469 284215 298351 304941 305878 307935 310142 305838 313304 319985 328007 332826 326009 310460 291532 257757
11455 257757 221189 171315 119195 79524 49847 43686 38030 37636 42592 37043 21440 7288 4288
11442 4288 2315 15421 42265 75639 120983 168048 213505 245847 266685 267020 243485 232343
11430 232343 223517 213733 206762 206521 200966 195624 179021 153825 115018 85949 70081 65068 66941
11417 66941 75499 100338 118561 136022 146627 133417 112572 89912 66069 52719 60154 73640
11405 73640 111639 158408 198645 235594 265454 290193 321417 352031 381892 419024 450468 473134
11393 473134 492401 514616 521454 511994 499195 504013 512995 533337 569803 627056 703436 807861
11381 807861 937891 1092300 1260210 1415648 1558772 1671842 1728981 1732472 1703396 1658148
11371 1658148 1609744 1546219 1494731 1451294 1416481 1397652 1391022 1386183 1391335 1419661 1449900 1480908
11359 1480908 1513591 1547181 1586443 1614380 1623821 1641853 1652892 1657913 1684482 1728164 1796897 1885110
11347 1885110 1962065 2054325 2147678 2225087 2260581 2261152 2241569 2211977 2186985 2174020 2168504 2184738
11335 2184738 2210744 2237224 2257231 2278307 2290488 2291010 2292609 2289706 2289217 2297231 2308001 2336613 2390511
11322 2390511 2473998 2588003 2747341 2938641 3148144 3355076 3541569 3680291 3756735 3786891
11312 3786891 3776397 3715585 3636166 3543636 3434374 3355011 3304890 3285695 3279004 3285797 3319837
11301 3319837 3360110 3411491 3479545 3540622 3585288 3620843 3660137 3697138 3730107 3791279 3890233
11290 3890233 4020816 4180860 4374387 4589743 4817243 5045797 5289764 5549076 5850814
11281 5850814 6212705 6635187 7109271 7593219 8023007 8336016 8505938 8569634 8609882 8723336
11271 8723336 8955672 9316227 9800848 10412574 11156361 12023518 13036172 14257772 15751922
11262 15751922 17613567 19980181 23064342 27111931 32488199 39687593 49319388 62017406
11254 62017406 78143573 97216325 117359306 135427835 147961012 151983986 146092684
11247 146092684 132197820 114698247 97503252 82835926 71519011 63421242 57978259
11240 57978259 54654168 53044252 52963037 54361595 57238210 61620896 67422508 74306607
11232 74306607 81652286 88620080 94207336 97630639 98634212 97737112 96118878 95112722
11224 95112722 95829162 99043438 105221901 114438882 126210291 139236742 151387051 160187143
11216 160187143 163498874 160355414 151780768 140624481 129948754 121692112 116471740 113860777
11208 113860777 112781354 111909071 110041830 106350370 100613445 93337276 85491555 78004899
11200 78004899 71501356 66290837 62392694 59754486 58337130 58119288 59154721 61655032
11192 61655032 65964412 72555636 81902209 94233278 109060314 124709969 138399725
11185 138399725 147027506 148079480 140476036 125807284 108188602 91543486 77702564
11178 77702564 66868262 58599162 52286933 47410842 43571561 40453287 37856427 35666085
11170 35666085 33790134 32142548 30656069 29291722 28017676 26812505 25702697 24666075
11162 24666075 23704124 22813235 21981032 21209603 20486200 19833072 19234680 18698058 18196263
11153 18196263 17723844 17274256 16852386 16433071 16019486 15611156 15205979 14818688 14438777
11144 14438777 14080023 13727314 13384312 13058516 12740340 12431422 12132908 11853803 11583187
11135 11583187 11306860 11049849 10816480 10593526 10379872 10194601 10045046 9904413 9782418
11126 9782418 9671668 9560872 9445115 9311054 9154847 8995788 8821907 8631259 8437301
11117 8437301 8255408 8077244 7901598 7727839 7562473 7405887 7265959 7136086 7020280
11108 7020280 6906433 6813817 6716039 6621585 6528614 6439619 6351743 6266370 6182900 6105827 6035839
11097 6035839 5969891 5910649 5870688 5833006 5816611 5789088 5737356 5674574 5605523 5516504 5433118
11086 5433118 5356714 5269859 5197869 5122404 5037552 4954655 4875658 4796416 4698775 4593627 4487432
11075 4487432 4379093 4275677 4197904 4115683 4039476 3975234 3912415 3869765 3836915 3821699 3834429
11064 3834429 3875332 3945277 4049055 4151840 4231598 4262293 4223315 4136797 4011041 3863917
11054 3863917 3721405 3600935 3507972 3416810 3325753 3258417 3192134 3120028 3032970 2950046 2864564
11043 2864564 2777817 2691595 2630606 2570570 2516168 2481995 2446723 2416861 2389354 2361487 2333858
11032 2333858 2306079 2289309 2275675 2268092 2273923 2276537 2283469 2259481 2213254 2164612 2111596 2066021
11020 2066021 2026373 2002716 1982189 1958473 1938118 1918717 1898721 1861845 1817405 1759632 1692203
11009 1692203 1640130 1593796 1548022 1511463 1482835 1461591 1439561 1414868 1391690 1383333 1394141
10998 1394141 1408253 1427928 1462274 1504338 1532180 1538950 1523684 1499578 1478374 1441998 1408158
10987 1408158 1390491 1369384 1342029 1307355 1280245 1258323 1207365 1155074 1123721 1096298 1058047
10976 1058047 1014926 986871 970407 958462 963557 958280 955358 948389 949280 946677 936166 920472 902653
10963 902653 876040 875478 875763 868823 859527 852835 846187 837340 830356 827745 812846 793272 777905 760861
10949 760861 743451 733617 737865 726458 710392 690307 684056 679171 669261 663175 649192 633153 625293
10936 625293 617672 609494 613381 613648 609376 613957 611634 611397 615413 624314 632749 630249 614943 596206
10922 596206 577711 562970 549120 531449 514392 502879 491570 482044 467495 460313 459520 452671
10910 452671 431141 426569 433915 428972 422966 417441 416485 409043 405796 398187 398752 391671 374708 368726
10896 368726 369393 377269 374760 373390 369977 360391 350082 350237 349988 351901 357937 353221 334490 328301
10882 328301 327705 324706 322060 320228 318239 308378 307426 298188 301416 301798 297972 284821 277164 275026 273811
10867 273811 291077 298617 293245 291460 289005 285340 287036 287364 274733 272562 281992 270637 250871
10854 250871 243410 242506 247927 244808 247127 236282 243386 250422 259021 269264 272299 279432 285395 283829
10840 283829 289031 304270 315840 325291 331273 337586 335095 335130 335262 333763 350232 377712 398313 428268
10826 428268 465256 516656 585013 661129 743009 827103 894833 947465 955337 925007 865568 789794
10814 789794 715466 649030 584379 543276 522971 519549 509130 516261 533608 560150 598704 631482
10802 631482 669973 718632 758906 766520 773100 793043 800511 789316 789632 797359 817492 850702 896130
10789 896130 952213 1011930 1052070 1071381 1063932 1039720 989074 930997 892424 867197 856189 850669
10777 850669 854484 863097 853490 829718 800043 769070 733916 700586 686282 660716 640811 631903
10765 631903 631767 641675 656183 673919 691715 716326 765126 834279 906013 971379 1041528 1067975
10753 1067975 1045550 989045 905839 823978 757549 694605 644274 613662 599667 576582 555691
10742 555691 534096 524851 515341 519860 521317 521513 519811 517517 525738 532439 545729 581861 611051
10729 611051 658017 695873 742139 809421 879242 955989 1053025 1170661 1311187 1473919 1652784
10718 1652784 1847245 2020628 2156930 2242777 2260604 2217606 2126075 2001331 1875512 1753114
10708 1753114 1649895 1554068 1472722 1426450 1417531 1423504 1444643 1474210 1519058 1576102 1626756
10697 1626756 1679502 1732555 1793438 1865151 1942575 2014415 2090106 2153100 2216157 2285714 2370107
10686 2370107 2460009 2559530 2661063 2743246 2783544 2787902 2770674 2713869 2636808 2562657 2481683
10675 2481683 2402799 2312809 2218611 2122046 2023119 1932320 1856191 1806894 1753896 1713281 1686688
10664 1686688 1672995 1666819 1671656 1697907 1758908 1854812 1998753 2203176 2484217 2833386 3233385
10653 3233385 3659697 4064142 4346261 4512147 4594835 4517343 4180506 3748788 3364329 2999734
10643 2999734 2593394 2233071 1996166 1877239 1867124 1909871 1925401 1931096 1860912 1608888
10633 1608888 1351763 1198249 1102743 1037526 972979 930005 895841 857084 829807 808323 793537
10622 793537 769985 732876 707756 691405 675899 661511 646480 629988 617293 600287 582727
10611 582727 574458 562216 549991 537697 527170 518189 512837 497298 473688 463942 457637 450287 440881
10598 440881 432436 414965 402000 393498 388650 388276 381041 371015 372129 372652 366449 356636 352198 350350
10584 350350 345583 356348 361143 357055 350405 346612 348885 341738 330861 326664 323067 315624 309584 309987
10570 309987 295958 286526 290204 298144 288900 290277 289223 288549 290957 287487 271617 266699 268815 266098
10556 266098 265343 257726 264279 272747 280170 286491 297355 282074 258058 247800 250771 254857 257907
10543 257907 258212 251063 246586 235045 225881 229618 226654 225062 223076 210011 200798 206313 215661 227822
10529 227822 234688 233331 235429 242497 246226 250485 245031 238317 246441 241604 220983 198422 183658
10516 183658 161304 142251 126133 119391 116815 119929 171273 246040 315705 365415 441098 544584
10504 544584 603813 589715 563402 574720 577981 535369 451285 390008 376652 355785 305686 264501
10492 264501 234979 224822 223966 218796 221945 232777 252636 257547 269460 275951 295191 316201 325196
10479 325196 326870 313111 297933 281507 267435 257265 235500 220488 215468 217714 220494 224813
10467 224813 213642 214231 230138 242925 261707 276058 290693 287847 266038 227293 143402 58518
10455 58518 -21635 -118708 -229151 -319559 -351807 -375241 -412041 -441836 -451958 -478604 -527199
10444 -527199 -568314 -598423 -637895 -637977 -569461 -491137 -416331 -282227 -102068 41069 133936
10433 133936 236770 341571 403032 431523 447950 458692 467723 484516 509664 507306 507747 515697
10421 515697 511023 504424 503681 523730 532954 537664 546868 564731 582851 585184 586111 584666 562177 530730
10407 530730 500383 484118 466303 450095 452926 460798 476562 491740 522414 568198 600957 614440
10395 614440 641057 678573 701756 709648 725236 759344 776453 816494 866301 931501 1030356 1170271
10383 1170271 1364113 1621397 1938232 2274310 2538890 2793375 3076790 3281883 3281191 3135500
10373 3135500 3014874 2889672 2685047 2438730 2243893 2093025 1984388 1907077 1860732 1818742
10363 1818742 1781534 1754528 1738149 1747726 1765303 1786106 1810549 1827050 1805350 1789652 1771470
10352 1771470 1730088 1680895 1638808 1612001 1603386 1604983 1628500 1654103 1677495 1696890 1715591 1727609
10340 1727609 1717175 1694701 1674487 1652798 1635586 1612963 1591806 1601792 1614212 1624992 1640744
10329 1640744 1658901 1682298 1700635 1722775 1752998 1795516 1843988 1914460 1995750 2111480 2278801
10318 2278801 2522294 2873836 3401005 4121880 4900878 5646160 6394923 6845630 6879540 6887659
10308 6887659 6997903 6874954 6490098 6365656 6721018 7595353 9023406 10900971 13053405
10299 13053405 15478536 17901693 19651510 20789482 21654336 21695992 20225357 18060837
10291 18060837 16209073 14452004 12352012 10431490 9166939 8415196 7981455 7765481
10283 7765481 7679575 7672156 7734659 7875940 8062614 8311747 8680910 9174621 9769316 10467017
10273 10467017 11312289 12295339 13318503 14409836 15731288 17295295 18980162 20920627
10265 20920627 23421209 26545496 30400996 35329832 41683891 49978140 61388832 78257232
10257 78257232 104019494 140948274 185842724 234084542 288179146 340411434 373454887
10250 373454887 393784118 412959273 414752541 379130677 328920691 289880864 252549541
10243 252549541 202039607 153870184 121187761 100517307 86929576 77483665 70402959
10236 70402959 64801860 60323478 56605022 53351207 50479926 47915252 45521272 43315321
10228 43315321 41313431 39382819 37479877 35704095 34107482 32621842 31227470 29962863
10220 29962863 28864967 27920267 27090703 26319372 25602905 24916860 24250170 23596803 22949893
10211 22949893 22312177 21676347 21066913 20480922 19901046 19333574 18790821 18261956 17719023
10202 17719023 17178229 16658967 16141249 15634290 15140723 14676138 14234149 13798400 13404724
10193 13404724 13034331 12708775 12415302 12118349 11846365 11606583 11376516 11139679 10908030
10184 10908030 10696217 10483182 10237420 9982308 9728238 9494094 9261799 9025836 8792600
10175 8792600 8574160 8382796 8198817 8014630 7844954 7682908 7523473 7363478 7216444
10166 7216444 7072814 6936785 6795419 6666850 6534358 6386432 6247637 6125055 6017708
10157 6017708 5900762 5784987 5671025 5570507 5475116 5363611 5258767 5158816 5069967 4974277
10147 4974277 4886066 4806982 4740659 4681383 4612515 4540112 4479049 4417676 4356414 4292606 4229225
10136 4229225 4176838 4145737 4138229 4156506 4202749 4285699 4409836 4590977 4761709 4950445 5175369
10125 5175369 5363313 5452805 5506603 5539326 5494876 5341883 5160052 4994546 4805462 4608957
10115 4608957 4426545 4265572 4119999 3988158 3863760 3741444 3626148 3509026 3394914
10106 3394914 3308753 3222019 3151650 3072958 2998875 2933643 2884147 2820346 2754444 2693499 2629140
10095 2629140 2550359 2489756 2440780 2388562 2324335 2261325 2193226 2133913 2080629 2027664 1983007
10084 1983007 1946078 1911265 1875182 1848770 1811171 1770199 1728346 1688309 1642999 1583634 1533629
10073 1533629 1499350 1460751 1417840 1381733 1347527 1314690 1315257 1353414 1405618 1482631 1599645
10062 1599645 1720816 1820806 1928765 2056221 2118210 2084163 2049839 2030399 1991432 1917584 1848394
10051 1848394 1812717 1775976 1734658 1701047 1649047 1578827 1504542 1416722 1312887 1198121 1116900
10040 1116900 1060831 994030 947530 930654 927151 924195 924875 938380 935705 927235 916405 904817
10028 904817 886432 862834 850617 835007 817280 798443 778462 757297 742717 717871 696642
10017 696642 678449 657669 650760 654353 656087 649923 635641 630968 628999 621365 621575 617017 613618 616928
10003 616928 620578 616487 620171 618078 613673 620815 637376 654238 675330 704001 718113 738127 750750
9990 750750 765468 770342 761240 734599 709869 682190 648231 616905 570438 528805 500154 479155
9978 479155 471527 456892 434491 426761 427981 431468 430271 425429 413311 400236 403213 411579 401350
9965 401350 385694 382285 383496 364675 343111 330390 328618 333766 340292 341106 332927 322560 305708
9952 305708 294610 298714 296747 289300 281188 274349 263977 266917 271457 267540 254579 251124 254052 256379
9938 256379 256679 250638 246318 247169 243613 226955 217696 220798 220386 212393 206632 205269 207106 210066 213925
9923 213925 219424 212607 197684 199619 218823 228454 227965 230531 242805 264722 288488 306810 327325
9910 327325 344556 344536 340599 312089 276741 257960 233518 220689 211312 204687 208440 211799 206042
9897 206042 197866 188040 187272 200441 218926 233322 235614 226906 227740 236001 237029 232240 214671 212523
9883 212523 197219 181017 181200 181355 179186 176507 167395 160557 155872 160184 167075 171090 175071 172023
9869 172023 161086 152218 159390 167511 165755 152292 155877 166610 172883 176452 187481 221994 246806
9856 246806 278691 319233 367861 436334 548301 716881 937935 1181598 1459501 1770571
9846 1770571 2024166 2180924 2298457 2376610 2283382 2023824 1772969 1568271 1321258 1042992
9836 1042992 812139 673427 593666 541287 501804 479792 450636 418204 390317 364553 347305
9825 347305 337411 317485 297889 288821 283358 271008 252351 246010 240267 225079 219680 214539 203044
9812 203044 186968 185540 187095 176010 180175 187419 193828 192301 188344 189625 186061 181305 170720 163805
9798 163805 171482 168854 163799 153391 139458 129768 132060 133296 122758 117317 114371 105544 101533 96930
9784 96930 96816 95364 92513 79826 82392 89285 81673 82348 81792 84200 93668 105640 112346 113414 108523
9769 108523 101718 100870 99864 95188 85499 83989 78102 76104 77017 80853 79472 71544 60656 62832 63279
9754 63279 52748 64693 71074 68762 71476 77225 82655 79077 75574 60100 59275 61493 61982 57643
9740 57643 47901 37329 36997 40244 40072 38624 38018 26813 29193 35961 35178 34308 40524 53534 60619
9725 60619 65955 57902 59002 65098 60504 56753 61482 57804 62304 51862 43969 41761 41647 48786 47309
9710 47309 49186 59006 57848 45760 50488 49144 42275 39412 31422 31068 30176 31392 28371 27403 25216
9695 25216 24042 23100 14458 13681 20607 22622 30525 39664 37160 25017 27165 35154 38555 40238 41771
9680 41771 46731 38802 33616 38595 44056 52589 60251 53374 44086 37267 38848 33594 26340 20613 22447
9665 22447 26080 41204 43856 31299 21705 22395 26296 32400 46704 53478 63250 65732 69867 74791
9651 74791 73089 68270 59431 61420 60601 66264 62763 58015 57479 59745 53554 48079 52896 48481 47502
9636 47502 42005 45828 52752 61675 65946 65455 59662 56072 59846 60202 60452 71386 81421 83011 83776
9621 83776 85837 77855 67724 60512 60237 64432 66139 60866 61842 62401 62072 66490 68657 67866 64226 62245
9605 62245 58781 65038 69020 66636 65494 60236 65931 65697 65059 68720 62141 52759 51094 54814 54833 46638
9589 46638 46207 43786 27597 23153 24288 35870 39088 40327 37792 39278 37360 40037 51380 43418
9575 43418 40284 40513 45481 48850 53953 53238 50591 54645 57242 58842 53089 50663 60636 63043 59304
9560 59304 60411 62264 59424 56343 62587 66893 65828 69057 64076 64017 65330 61168 55718 54347 57249
9545 57249 71550 71918 73745 75364 66322 74237 79466 87761 92340 93977 99541 96706 89517 84231 86447
9530 86447 89990 83766 84580 84769 78567 75133 70397 72652 77728 81227 82114 84827 80425 76676 72964
9515 72964 69466 64388 62483 70048 72422 81381 100563 111584 117638 118176 125893 138174 137488 140665
9501 140665 147328 153878 143684 129541 133668 136230 132559 122448 123780 128666 124209 124002 122144 133977
9487 133977 137428 130477 123611 123072 119278 129523 134353 133197 122284 121744 120840 121296 122363 112314 108158
9472 108158 107752 107972 100927 107075 114088 118056 109121 99367 106735 103620 107559 110899 106177 88112 79279
9457 79279 61302 50538 45000 31218 31794 23032 6527 5319 -479 4196 -4821 -13607 -9918 -542
9443 -542 2906 8945 26596 51891 71063 87592 102679 109827 126752 142029 151555 166101 167901
9430 167901 181865 200995 213147 212381 215427 214175 223054 243227 271516 272637 258437 258626 260823
9417 260823 265557 280106 292087 295425 308600 320174 319458 320006 310704 312505 324022 331293 333665 341236
9403 341236 345319 351013 373792 394532 401393 414611 432579 440286 448308 457319 471551 486258 509181
9390 509181 532559 552299 582508 621078 660823 699970 738711 775368 821352 864937 903451 933648
9378 933648 959704 967533 977504 981222 976113 962455 951450 941921 931429 926317 920723 914046 893231
9365 893231 880390 868568 871108 857126 846320 840155 843736 849180 862160 872930 880545 883670 887780
9352 887780 902924 917245 930757 942173 949826 947331 939631 938151 937237 935996 936280 952906 967582
9339 967582 994091 1012566 1022714 1035394 1056147 1081170 1091099 1102796 1119181 1131673 1143652 1160508
9327 1160508 1186825 1201259 1214356 1233580 1251475 1280093 1310735 1347586 1388896 1428512 1463552
9316 1463552 1513236 1564562 1599234 1626964 1668136 1708880 1756061 1794568 1840448 1889707 1934958
9305 1934958 1980361 2047719 2116006 2189093 2263476 2337879 2421797 2508419 2613005 2715609 2810993
9294 2810993 2938840 3059247 3190671 3351270 3525399 3703897 3898854 4107602 4324743 4558254
9284 4558254 4816193 5085362 5380199 5700940 6042712 6421777 6845716 7322154 7859818 8450280
9274 8450280 9097868 9825643 10622881 11529236 12547496 13697390 15011681 16519581 18237514
9265 18237514 20200898 22448405 25040569 28039270 31493510 35445175 39925922 44953147
9257 44953147 50466753 56325304 62270929 67905800 72765405 76389493 78384727 78497979
9249 78497979 76774962 73490154 69086932 64053291 58841841 53766985 49020012 44705117
9241 44705117 40858052 37464257 34456994 31814777 29491226 27445941 25629531 24000791
9233 24000791 22549602 21236840 20052063 18993132 18032545 17150529 16337107 15593186 14902578
9224 14902578 14267294 13687882 13151572 12652908 12186053 11738356 11335753 10958271 10603991
9215 10603991 10264835 9946075 9641072 9349433 9066743 8787941 8521481 8264701 8028426
9206 8028426 7794611 7572724 7353151 7134679 6921418 6709830 6525675 6347260 6171058 6020351
9196 6020351 5879151 5731783 5580716 5433796 5283977 5144038 5010695 4878382 4767532 4666545
9186 4666545 4554486 4440240 4347101 4260124 4165930 4065160 3970757 3882465 3795899 3706228 3625763
9175 3625763 3546643 3469381 3401668 3325130 3249377 3179847 3115652 3046224 2990895 2934122 2877337
9164 2877337 2819637 2766134 2709343 2654143 2601244 2547489 2504083 2466533 2428971 2383208 2343162
9153 2343162 2305051 2268124 2232634 2201551 2168115 2127992 2090392 2064579 2042151 2014063 1987270
9142 1987270 1966809 1932132 1915696 1901287 1880569 1858467 1847507 1839293 1838470 1844689 1838747 1838656 1853627
9129 1853627 1871716 1878146 1885974 1895991 1895238 1884386 1866299 1849742 1831968 1799108 1760711 1725857
9117 1725857 1687466 1654096 1622147 1581300 1542731 1505597 1474347 1438128 1406285 1374654 1339688
9106 1339688 1314883 1296019 1273236 1243931 1224353 1198039 1171552 1152328 1127953 1103016 1080608
9095 1080608 1065119 1047076 1027518 1001438 981457 971314 951289 921909 896628 885080 866154
9084 866154 843748 837491 828183 812983 798529 781030 768649 771704 770550 764130 754027 732137 715046
9071 715046 716333 710201 712571 710343 709251 716944 727374 741930 754322 758077 757298 759671 754814 755922
9057 755922 747454 734300 718798 720841 711568 705089 700508 691771 672828 649930 639431 618605 591894
9044 591894 573356 563037 549612 542110 521848 508869 509054 497797 490854 487809 473614 454127 439539
9031 439539 434503 436429 436809 433896 422851 421196 413454 396291 382922 373495 371407 367590 371988 373912
9017 373912 358732 348738 350685 354096 345499 322741 314753 309591 322380 318655 315706 320671 312567 309174
9003 309174 309507 303973 308910 305726 294052 292005 294210 297062 297721 301744 306488 302905 292817 289796
8989 289796 283915 283206 280576 276674 272328 266705 265916 256004 245852 247072 226717 218446 210916 202962
8975 202962 206068 216358 212935 210161 217474 206713 196419 189216 179637 182063 188241 182716 182818 184963
8961 184963 182422 172606 156896 156820 163240 169124 162471 159519 167519 169144 153151 140698 144131 143970
8947 143970 146127 145453 138427 126296 128189 140478 153665 151291 149967 143068 151946 150797 140904 132976
8933 132976 129002 129633 132725 132212 126224 116471 101335 105005 112005 103532 107043 119742 124168 116687
8919 116687 109780 104196 95028 96134 100376 109993 114814 107980 97833 95692 98426 91055 85620 84548
8905 84548 77767 85714 95026 96706 93636 77583 69844 73300 80506 79959 73601 76000 70866 65932 69997
8890 69997 70181 64913 54765 52320 56056 57267 63610 69261 68100 59608 59412 65212 52961 43908 40040
8875 40040 46591 50995 66150 76283 71530 68628 63331 64304 64432 60317 62342 52665 52835 60538 51461
8860 51461 46065 52947 62978 58297 54508 51146 42501 29259 22380 19411 22126 23301 32566 48808
8846 48808 51182 54397 59638 62201 60242 55838 51524 50120 52675 57531 58541 60822 62191 53991 46187
8831 46187 37037 31247 33405 41054 38831 33532 40343 39405 23945 21583 31410 27289 28690 31387 39908
8816 39908 44295 42344 41508 39182 41651 40383 41714 35111 32432 37155 43516 57253 61132 62247 63134
8801 63134 69795 66095 47325 34471 37544 34289 33129 36190 49559 59447 46206 40228 44881 37392
8787 37392 24446 28890 37464 43177 36479 23778 29399 39466 37601 35822 38070 35080 18813 2849
8773 2849 821 18517 20125 18958 14249 6757 18877 24687 25848 31928 29744 24862 28858 35427
8759 35427 29553 31260 26486 21980 26307 28257 27661 30544 30379 27556 23186 27726 36471 37497 34116
8744 34116 30474 36587 35484 24936 14003 9648 4695 -3611 -6352 3527 11909 20875 24140 29481
8730 29481 33699 25941 10065 -3025 3171 11752 27416 22594 8859 3169 1121 -2017 5538 1814
8716 1814 6760 -1897 1999 17871 18508 9581 9609 5046 589 2182 10773 8475 11738 29808 27976
8701 27976 16566 9812 13885 24581 18362 7604 12018 14279 8286 -2489 -7089 -14233 -3197
8688 -3197 9040 10583 8458 8230 12093 4174 -2275 8259 11887 7050 6811 8141 9005 7361 5101
8673 5101 4317 6310 3625 6479 15218 17289 19433 14928 -35 -4911 6717 14049 16292 15383 13072
8658 13072 7959 8461 10026 11576 10408 11130 11400 17372 26572 22901 26002 16371 12984 23285 21062
8643 21062 10350 9288 12025 18129 20824 15467 17370 27768 35951 40690 33289 29872 28579 31962
8629 31962 25779 28126 23650 25247 38652 42903 49128 52330 54822 58165 59629 57707 52332 49971
8615 49971 42155 32739 36301 41354 41380 47660 44734 31563 32878 36132 36127 41822 42531 37666 30034 25579
8599 25579 27155 31937 29885 40387 47068 47304 43344 44531 41947 32484 30584 41430 44473 36355
8585 36355 31045 30414 32427 38280 36484 37420 34043 29639 28044 33320 34252 30981 38566 48971 60948
8570 60948 53486 37779 38247 50158 51680 57569 55706 64214 75642 97070 120391 135488 131422
8557 131422 130931 130391 126504 111389 99309 81643 60983 55037 61074 59667 51012 59729 77462 91795
8543 91795 84618 79764 81358 84486 99828 106944 113751 109547 116091 121701 115817 107405 102657 108529
8529 108529 113976 115384 122075 130397 127921 132250 143913 153393 142132 140783 138906 134230 127942 134159
8515 134159 145703 166010 189340 224717 270734 294481 310005 290747 254460 226868 195176 188671
8503 188671 190375 185231 188305 194364 211776 223032 235906 245324 261503 282401 302825 326277 349008
8490 349008 364863 386659 414213 432701 451898 457553 450245 439815 420947 390204 367171 358362
8478 358362 345294 330266 306734 289842 278115 261601 247211 235539 226268 209300 182128 164320
8466 164320 167658 180370 182559 194360 204421 205495 189641 172433 149938 130388 123810 119758 114245
8453 114245 110616 106656 100553 103764 89168 88809 85767 69131 62228 64519 66719 68120 64889 66644
8439 66644 84543 90436 86065 72096 58110 47326 48886 65681 68043 59599 62032 55371 50799
8426 50799 44957 40339 35817 33855 35382 42367 54590 62436 62221 61679 65959 76411 72283 62454 59942
8411 59942 59678 55030 52123 48764 47095 40286 34479 32960 40974 44930 46957 41712 32459 41072 56585
8396 56585 53438 53649 53632 41747 37116 25500 18313 15168 19161 23741 23967 30781 41720 41857 36290
8381 36290 36883 41142 36221 28520 25400 26935 33193 30275 15950 20874 25871 32052 26712 22229 18031
8366 18031 15544 19370 17256 -3134 -3529 3866 5677 11526 6203 2903 5830 8314 16678 35493
8352 35493 47416 53888 59910 58045 46214 45817 35202 21209 10002 3084 5194 14078 18429 11184
8338 11184 5782 -1214 -2951 9919 18912 16380 8557 15361 28600 38755 34709 22297 25487 25049
8324 25049 21820 20773 19022 12487 5192 5363 8632 4450 -2516 -7287 -1559 6850 11350 16594 15950
8309 15950 14346 13076 8356 9687 7253 4039 -1755 -1053 2918 11200 15195 18164 20581 22173 24344
8294 24344 26037 26965 18193 45 4136 15268 17024 15077 11199 1889 -6358 4502 8513 5681
8280 5681 11775 17706 17664 17736 30988 22251 10042 7440 9992 18237 16701 20152 19197 24106 17074 13404
8264 13404 10236 17551 22868 26186 26158 21579 19768 22165 20805 16202 27948 28369 25728 29163 30344
8249 30344 29676 17959 12899 12537 18176 18264 17175 12189 7685 9157 10580 14227 16432 23149 29914
8234 29914 29202 30237 37071 48596 45810 37704 41847 43308 44419 34602 27673 23898 30871 32323 28826
8219 28826 23579 16823 10662 5565 623 -3405 2016 9256 11606 12530 12952 15854 19320 17209 9392
8204 9392 8224 14445 23262 30788 30815 30445 37943 32989 21352 19026 13347 8179 6378 17732 21361
8189 21361 27739 33364 44320 32890 21336 14850 11679 9216 10707 11662 15101 15873 9955 8387
8175 8387 14674 13759 16007 20341 9242 1894 4893 2886 2117 7001 11762 6722 3651 3941 9733
8160 9733 8615 4672 -8715 -15779 -9953 -1474 8371 13935 19349 12961 1446 677 712 -1224 1681
8145 1681 7409 12609 16140 15284 14011 21219 32470 36626 35061 24150 17563 8626 9678 9564 771
8130 771 -5957 -9534 -11036 -1264 -3379 -7731 -8326 -3382 -4170 -7271 -2913 3183 -8544 -15970 -21857
8115 -21857 -18974 -13613 -8766 -1917 -3246 6781 12833 2294 1041 1770 -9243 -12370 -18143 -6718
8101 -6718 -1676 -4902 -6096 -12159 -16822 -15498 -12184 -17715 -20186 -11676 -4634 -177 3289 6540 13643
8086 13643 12348 5253 1607 4936 2524 2639 2403 -3064 3361 -1028 -13423 -15262 -7771 -5890 -1906
8071 -1906 -707 3786 5033 6603 10829 9844 12409 8036 -2994 -2224 -3329 -3803 3085 6819 4422
8056 4422 1899 467 -1020 6232 20477 16240 182 -7246 -6750 3671 18266 25009 14547 9950
8042 9950 10263 8444 5224 -8359 -17045 -8473 -7544 -4272 -21 -12640 -11596 -5729 -4577 -7428 2392
8027 2392 5197 3648 -4556 -5698 2590 -567 3718 -88 -3279 -7090 -2891 -293 3825 10572 9083
8012 9083 2876 -3174 -11856 -13748 -2823 346 8478 18548 19841 13074 15761 23214 29697 21895
7998 21895 -397 -2575 994 9688 16047 20596 18008 4600 -14531 -23892 -10545 45 15 -5063
7984 -5063 -12416 -8053 9918 12291 8819 5379 -55 6326 13786 4588 7304 5010 -3463 -6522 -9036
7969 -9036 15 -5018 -1018 -1036 6932 18237 18048 17713 22787 32066 31076 14454 5094 6198 3235 6912
7953 6912 9265 16099 16350 3249 6012 2075 3816 9952 10345 922 7095 14350 26579 25786 24261
7938 24261 34407 37249 33515 30704 28264 22466 18616 28694 34872 26201 9509 4361 7741 17331
7924 17331 28924 23963 18281 14416 3454 13238 22845 27962 21345 14456 8439 9972 8499 9190
7910 9190 15899 21444 23571 25691 33553 31225 33121 39924 41801 39489 42650 49882 51742 63829 68022
7895 68022 62104 60943 65532 71004 78108 86937 96110 92737 86971 72101 70380 65274 64843 66525 70921
7880 70921 54426 47959 53216 49819 35215 18533 5606 535 8871 12232 13722 16684 17052 29407
7866 29407 42444 44336 38981 37688 37574 34018 34729 38937 36498 42263 39892 38621 47622 49829 63167
7851 63167 69277 70655 61770 58839 54847 60001 61800 54011 49078 51361 48547 44458 55125 53474
7837 53474 40103 39607 36385 30019 41247 35149 26166 24474 29851 31354 33755 32157 34294 40947
7823 40947 48470 44980 38206 44379 37214 27336 23206 18561 18583 6984 13606 17389 19904 29983 34421
7808 34421 36767 38849 35518 38443 43042 39906 33041 23357 20039 17627 22827 27262 26119 21144 19143
7793 19143 25086 16786 18236 27257 21597 15786 18142 25343 29796 23279 20118 12604 19805 30979
7779 30979 22472 12520 14441 19460 17939 16181 17056 11865 15539 20187 10868 9606 9527 13768 10538
7764 10538 15874 7985 -1956 -842 2649 5394 12866 15285 19961 14118 2505 4069 -6206 2706
7750 2706 9415 6745 9754 18706 19002 15087 6919 2009 5858 11680 4345 3343 4888 7517 2855
7735 2855 8113 12759 14142 7834 497 2090 2304 5856 -7406 -19088 -22190 -8737 -2359 -1563 -1115
7720 -1115 5625 10390 2940 -5486 4969 6855 -7494 -10673 4100 6342 7926 12842 15099 8139
7706 8139 -3345 308 6989 703 196 -14384 -22543 -28811 -19539 -8388 -4592 2272 -2529 -2263 -441
7691 -441 -1416 -2300 -137 -1572 9017 14790 18506 16167 17005 10150 824 -4469 -6191 -6699 -786 2640
7675 2640 10990 18965 9100 -2674 -10655 -19672 -21584 -16646 -11792 -12705 -14556 -15919 -21821 -18058 -4853
7660 -4853 -3193 -10693 -9392 -9457 -14329 -17037 -23161 -16734 -12656 -12960 -18676 -16244 -3287 -4397 -9356
7645 -9356 -8397 -9049 -16374 -22985 -21100 -16086 -19725 -14563 -12257 -11856 -14106 -19727 -10552 -6631 -5880 -7460
7629 -7460 -4461 -1921 3431 14086 11214 10625 3863 -3978 -1190 -12525 -18743 -12460 -18779 -23022 -28206
7614 -28206 -25877 -16608 -9830 -6226 3062 3433 -2569 -2635 -11751 -19409 -13869 -12675 -12359 -12495 -11746 -15514
7598 -15514 -21862 -21193 -23253 -24257 -18898 -24501 -25324 -21306 -13637 -3661 -10900 -8943 -2918 -7528 -3544
7583 -3544 -4346 -2314 2541 11040 7753 -12035 -22091 -15691 -19999 -15958 -14579 -18967 -19687 -15177 -23171
7568 -23171 -11975 358 -2088 -5762 -10421 -26719 -38914 -41484 -38511 -20343 -5071 -9949 -13701
7555 -13701 -17173 -25458 -35355 -42075 -25885 -12307 -9792 -2705 1802 -10197 -16356 -16421 -12467 -11404
7541 -11404 -8233 -563 -6305 -4433 720 -7419 -16122 -9417 -6674 -3083 -13883 -20929 -12313 -18330
7527 -18330 -21820 -9158 -12166 -12229 -11149 -10295 -16180 -22168 -22103 -20192 -14093 -21521 -14474 -9659 -8818 -384
7511 -384 389 5754 1831 -6937 -11772 -17559 -15809 -15083 -5159 -10347 -15322 -17584 -15757 -19502 -24454 -24197
7495 -24197 -21906 -18969 -16558 -24543 -21116 -13930 -8965 -12060 -21633 -20518 -18330 -18820 -8942 -9881 -15582
7480 -15582 -18427 -26648 -22185 -32045 -35663 -23994 -17575 -14703 -13643 -6470 2912 8468 9595 1954
7466 1954 441 -8067 -4829 7203 6165 -1863 -12234 -20300 -24830 -22637 -14338 -21529 -28677 -24612
7452 -24612 -24468 -18925 -12927 -6118 2206 -8325 -27435 -24214 -18134 -15168 -8147 -5408 -529 2428
7438 2428 -4953 -11752 -14075 -20064 -24322 -15381 -7977 -3352 -2042 7565 12889 16753 18805 12242 2102
7423 2102 -3023 -6189 -9866 -9833 -14185 -27857 -36972 -40550 -29652 -31660 -27712 -26581 -32948 -36804 -43845
7408 -43845 -34002 -19417 -12686 -12898 -12143 -13431 -11439 -4987 3391 -134 -8912 -19966 -31357 -32500
7394 -32500 -26309 -31897 -23093 -10542 1906 -3728 -15195 -15190 -200 1424 -3250 -7250 -9798 -6325
7380 -6325 -527 2389 8275 10061 -1864 -11037 -21371 -15630 -15991 -33673 -35419 -25842 -17221 -16637 -11151
7365 -11151 -2000 -8345 -16414 -18764 -13843 -14284 59 4849 -1870 -11653 -18911 -17455 -14845 -6205 -439
7350 -439 942 8300 5782 -2471 -6141 -4870 -9737 -8604 -12314 -6042 -9569 -12127 -3719 -5515 -9526
7335 -9526 -22211 -25675 -14859 -8878 -5501 -11829 -19609 -14069 -6609 -1301 -7263 -13367 -15930 -13627
7321 -13627 -23439 -22521 -21293 -17413 -14154 -25498 -30878 -25647 -14993 -6269 -8174 -14560 -2249 -3093
7307 -3093 -7627 -9463 -16265 -22128 -9436 -5611 459 7592 -151 -4975 -5016 -5450 -4459 -3731 -9759 -15356
7291 -15356 -5852 -2559 -18106 -24549 -19809 -16129 -12607 -13616 -14189 -11788 -3549 2673 5068 -3388 -10594
7276 -10594 -14053 -21327 -23363 -9007 -8392 -13076 -7676 -11719 -18330 -27412 -29919 -19699 -6985 -10919
7262 -10919 -8749 -7277 -12143 -146 12647 10169 -1683 -5573 -7825 -5823 -6752 -5209 -15324 -18800
7248 -18800 -14392 -13085 -3114 7066 11050 1962 -9156 -13572 -7389 -5794 -6155 -5925 -5558 -4583 6449
7233 6449 3240 -3427 -3983 -1692 -7572 -5885 4565 2685 -3985 -674 -11675 -18184 -14158 -10123 -17105
7218 -17105 -20161 -22154 -13576 -8889 -2517 -5828 -13606 -7218 -5704 -6336 12324 18212 9824 -2423
7204 -2423 -1234 -1564 -6258 -16968 -25489 -24247 -20664 -6589 -6267 -8483 -5515 -8057 -6647 2042 -4111
7189 -4111 -9898 -9549 -8249 -11426 -7885 -12017 -8058 -8588 -9534 -12712 -12870 -24716 -23952 -18279 -16174 -12516
7173 -12516 -455 -2224 -5506 -5711 -9905 -10014 -5946 -11761 -19428 -17804 -17721 -19163 -21552 -18759 -7054
7158 -7054 8080 7171 -10406 -21617 -17830 -14306 -9729 -12673 -4171 6174 -3853 -8017 -14109 -25082
7144 -25082 -27455 -18123 -12527 -8815 -9526 -10274 -3448 -1606 -8532 -7665 1609 -2678 -8807 -13154 -14437
7129 -14437 -1069 3109 -6642 -13887 -10398 -16082 -13094 -9578 -8240 -12486 -16038 -7912 4191 -140
7115 -140 -5776 -479 1321 -2554 -7098 1886 -4949 -8257 -9658 -10998 -6009 -5706 -3303 4159 1220
7100 1220 -1604 2200 9609 16076 24645 14290 12766 9627 3715 4904 5468 2650 -2738 -4431 -1416
7085 -1416 -7955 -9154 -3527 3623 -681 -7164 -9410 -9439 -14315 -7634 -6454 -10827 -16762 -15297 -8425
7070 -8425 -5343 -7499 -10867 -18036 -14043 -15420 -12454 -14401 -15824 -24148 -25014 -15961 -10251 -8219 -2877
7055 -2877 -6024 -19099 -25473 -19593 -18001 -23050 -13076 -16419 -22925 -24464 -9026 -9293 -10778 -10770 -4788
7040 -4788 -8689 1087 5658 -2355 -6747 -5438 -1216 -16094 -27471 -29122 -29804 -20298 -15338 -15052 -18792
7025 -18792 -19949 -18707 -18695 -15787 -14347 -8554 -4939 -5535 -6256 -9312 -8747 9017 11231 6850 8206 1209
7009 1209 -14501 -11320 -10624 -11634 -9819 -7575 1593 -365 -9814 -23579 -29965 -38938 -37510 -23938
6995 -23938 -7542 -7870 -11400 -2338 3908 8304 1094 -7819 -1063 -2905 -6462 -8760 -9134 -13094 -8074
6980 -8074 -1395 -709 2044 -248 -7180 -15687 -24106 -16866 -5811 1729 1490 2367 1065 -2795 -8292
6965 -8292 -4437 -8756 -8073 -8054 -5063 405 -6151 -11231 -3034 151 -3942 2011 1179 -2625 -3993 1403
6949 1403 2400 -8080 -14671 -5981 -3729 -3689 1633 1657 1709 2393 6805 -2825 -3909 -2649 8860 3554
6933 3554 -8965 -16265 -9155 -13345 -11660 -11076 -14407 -15100 -12783 -3657 293 1526 4834 5542 5619 -4304
6917 -4304 216 3221 1383 -5400 -15487 -23305 -23852 -23872 -14306 -3946 692 7337 9098 -4542 -14399
6902 -14399 -17369 -13043 -8111 -6253 -2549 -1917 -7579 -9629 -11379 -11437 -14068 -16542 -21897 -23694 -24470 -5341
6886 -5341 -2718 525 -3024 -9069 -5325 2809 -4142 -18907 -16807 -18923 -13188 -12685 -20656 -24656 -20660
6871 -20660 -17948 -7139 -4795 -11108 -17090 -18619 -20359 -26673 -19495 -13932 -12790 -6991 -8077 -7652 -2245
6856 -2245 -6509 -13646 -10984 -10311 -13417 -13389 -5027 3858 4009 -8340 -21339 -22753 -13770 -18638 -22387
6841 -22387 -16480 -3376 -1412 3370 -3529 -11066 -23302 -26297 -19327 -15636 -8888 -12759 -15478 -12392
6827 -12392 -16542 -13195 -6505 -19320 -31913 -25261 -17160 -3965 -1401 1046 -3465 -12606 -17898 -20267
6813 -20267 -18837 -16032 -17148 -15848 -19032 -15838 -14961 -12553 -7599 -3749 -14781 -8779 -9609 -8498 -4443
6798 -4443 -2223 -4444 -1044 -3668 -11083 -11420 -3816 -12967 -18091 -22846 -31808 -23738 -23678 -29018 -23279 -10932
6782 -10932 -10474 -21076 -15605 -8369 -9344 -8757 -12657 -18602 -16492 -6293 -11597 -16988 -18270 -24758 -26667
6767 -26667 -6993 -3452 -3929 648 -2469 -3046 490 -5137 -6090 -9348 -14477 -9529 -5638 -11853 -20415
6752 -20415 -8877 -8889 -27758 -24041 -18470 -19171 -14643 -3437 2236 12350 6011 1157 315 -2823 7122
6737 7122 18370 12890 -8156 -21813 -24281 -24297 -18712 -15218 -18527 -14263 -5702 2253 11546 11792 4133
6722 4133 382 -862 -4014 -4919 3991 -5114 -12851 -8536 -8371 -6985 -6517 -9108 1958 1463 1881 6580
6706 6580 4040 -308 1838 340 -3712 4513 10605 -7585 -3074 3231 2590 -11221 -12417 8320
6692 8320 19530 29864 17683 6422 -6510 -10257 2940 7339 -958 -4661 -5930 -2220 -3139 -3597
6678 -3597 -8871 -8086 -7684 -8734 -5631 -1699 -3812 -7243 -13889 -24863 -33097 -25808 -3922 -1268 -1352
6663 -1352 7808 9258 4403 5346 4876 -3148 -529 181 1974 6682 4700 4527 -296 -5227 -598 7797
6647 7797 15521 21362 20070 19451 26585 36954 52718 60901 63944 71752 79268 90349 112516 138435
6633 138435 165889 204767 251450 287157 303934 302197 266098 211470 157934 112876 87479 65587
6621 65587 56198 49806 36841 24990 21289 22442 16994 18586 24849 28740 28207 23325 24605 30081
6607 30081 30275 26376 29973 32149 28557 24496 26092 22416 21613 14771 21228 23605 23694 17364 15326 17937
6591 17937 26285 26971 23029 20014 22778 22390 18328 8756 5869 3418 7385 15322 25937 25136 19945
6576 19945 16313 6373 -1526 -4647 -8295 -9647 -1784 8153 10989 11424 1388 -3663 -4434 -11328 -11263
6561 -11263 -4027 -2375 -5420 -9295 -6253 5049 4792 6420 9315 6553 -3274 1578 -6193 -13338 -16879
6546 -16879 -15283 -14204 -2184 1744 -4370 -4193 171 1452 9784 11726 1887 -8174 -4453 3138
6532 3138 -1615 -3245 -4826 463 5086 6671 8473 6264 7799 12573 2646 11288 8498 -5941 -12491
6517 -12491 -16817 -17803 -11746 -4000 -5552 -1162 2947 8009 10583 8482 6698 11695 15672 10519 8641
6502 8641 9442 11030 4864 3263 6679 9144 10318 10009 8259 3288 -5114 -9095 -1091 249 -5100
6487 -5100 -1365 2596 929 -9490 -16763 -15360 -12882 -18342 -10681 3776 6399 7525 6048 10
6473 10 -8065 -15430 -14642 -13337 -18266 -17568 -15779 -9945 -13807 -22447 -23540 -22048 -7184 -1056 -9780 -12464
6457 -12464 -8162 -9129 -8317 -13107 -11528 -4395 -6574 5416 8939 6808 5236 1971 2895 3350 -14031
6442 -14031 -14000 -18000 -13160 -17721 -21144 -22333 -5029 9118 3589 2968 291 -3859 -3445 -4720 -13867
6427 -13867 -14784 -11852 -19300 -17812 -13414 -17417 -18254 -17500 -25330 -21408 -25519 -21747 -17075 -13413 -25838
6412 -25838 -33092 -30395 -26457 -22893 -16338 -7621 -9957 -13962 -7388 294 -4050 -8593 -5645 -4737 -944
6397 -944 -1695 -10541 -11855 -16067 -25639 -22919 -14025 -22392 -26498 -22638 -21281 -12214 1191 5083 6387
6382 6387 7925 4314 343 7989 4367 -673 487 2502 4946 6494 -5192 -5543 2855 -324 -608
6367 -608 825 -2056 -2332 7363 11703 12955 13809 10268 8946 -554 -14512 -27832 -23072 -12001 4803
6352 4803 11814 5129 1514 -3863 -2080 -8582 -12484 -9757 -12673 -8450 -5420 -1480 -1806 -512 -3012
6337 -3012 -5754 -4904 -6516 -3673 7446 13871 11222 -3302 -12328 -6343 -6792 -11656 -15336 -17552 -16620
6322 -16620 -12355 -12080 -20606 -24829 -21283 -13156 -13383 -20398 -23827 -16941 -16364 -8229 -2375 -6658 -8543
6307 -8543 -19704 -23344 -27578 -30741 -16140 -16565 -18625 -18417 -13459 -10010 -14407 -9875 -12244 -4525 -2947
6292 -2947 -15856 -13996 -10995 -8288 -7808 -7406 -14578 -17106 -14161 -17544 -13894 -7861 -11019 -10850 -2747
6277 -2747 -4750 -8431 -6892 -4211 -5019 -3219 4487 -9591 -11437 -5040 -7945 -12301 -4103 -7107 -5685
6262 -5685 -2258 -5314 -12213 15 10384 5188 728 -5130 -9604 -9939 -13442 -9884 -2772 -9045 -18861
6247 -18861 -22793 -13627 -12505 -12498 -6845 6819 7135 -4198 -4565 898 -2800 -12855 -17017 -23527 -31330
6232 -31330 -30739 -17142 -5138 -10184 -18134 -10572 -12544 -14102 -8192 -4396 6549 7721 -535 -1065
6218 -1065 5266 1714 -5097 -4723 -8157 -8172 -10254 -14478 -13226 -10926 -8175 -7448 -8374 -2437 -393 5760
6202 5760 7050 -9594 -12929 -2350 3778 -2021 -2605 1978 459 1486 -8 -7235 -15187 -22665 -16854
6187 -16854 -18734 -19997 -14961 -14680 -18525 -16049 -15590 -14112 -20410 -16573 -8032 -11089 -3670 -266 -2972
6172 -2972 -2977 -8067 -10047 -12527 -10793 -12574 -13723 -15715 -24188 -19011 -14630 -22438 -33649 -27887 -22118
6157 -22118 -17625 -14568 -3521 973 -8921 -2427 9431 6059 2166 -6997 -15474 -17165 -9845 -1369
6143 -1369 12518 13905 11361 12759 2757 -10885 -9545 -5808 -11945 -6992 -7552 -10223 -11981 -25304
6129 -25304 -25105 -9862 555 -2294 -13531 -12538 -10314 -7181 -8985 -15865 -13310 -10797 -14041 -14184 -11310
6114 -11310 -12731 -23052 -24487 -18979 -20274 -16199 -13549 5858 4670 -1527 -11053 -10215 -3388 -9073
6100 -9073 -17852 -15537 -9108 -13546 -22917 -13327 -10749 -13469 -6087 -2677 4297 7538 -5576 -5217 7913
6085 7913 12476 7696 -1422 4435 13679 12077 4042 -3119 -7082 -3841 2714 -3104 -10106 -14330 -20433
6070 -20433 -23349 -13909 -3769 2013 4599 -10499 -15447 -13012 -10258 -8427 -8263 -5568 -8495 -7692 1490
6055 1490 -2607 -6140 -10178 -6326 -5508 -1074 -9013 -16632 -18401 -18839 -10626 -11852 -22168 -31725 -25989
6040 -25989 -12336 3667 4081 -2310 -13938 -19462 -12154 -5501 -86 -3620 -3989 695 11858 3992
6026 3992 -4569 -1848 6345 5053 2740 2996 3468 -4077 -8694 -6316 -4978 9289 2240 -9051 -15705
6011 -15705 -16193 -14865 -14436 -17315 -24903 -28296 -19264 -6966 -5065 -6596 -6292 -1347 -5816 -2601 -2587 432
5995 432 2114 -8626 -17762 -15577 -8544 -4820 -9080 -5571 3583 11916 6269 32 -2138 -4334 -9110
5980 -9110 -8795 -5747 -349 4448 -5490 -15324 -15014 -11827 -12772 -14833 -19420 -28815 -32160 -29227 -18912
5965 -18912 -13929 -16154 -12719 -5006 -6990 -8861 -8476 -11301 -16670 -19873 -10713 -4221 68 -6231 -31
5950 -31 8463 12931 -164 -8305 -4574 -7049 -9283 -14384 -19407 -9651 -1352 2568 2000 -1376 3615
5935 3615 1921 -11029 -11334 -3675 -9089 -12940 -6192 2090 -1031 -7984 -17873 -24906 -11732 -2583 -4164
5920 -4164 -10631 -17198 -18323 -12042 -9292 -4145 2660 4115 7963 9165 -2378 2040 5793 -7143
5906 -7143 -4788 1646 3288 -842 1178 2852 -2311 -10260 -23924 -18785 -7570 -10347 -6746 -2050
5892 -2050 -3905 -7304 -9871 -13116 -11507 -15774 -9952 -8225 -10580 -4102 3600 4854 -4330 1553 -8456
5877 -8456 -17818 -18336 -12343 -8228 -2063 -9559 -10087 -9582 465 10229 12421 2848 1269 6299 9463
5862 9463 6758 2543 2995 -4381 -9733 -4838 840 -3789 -12206 -18665 -9660 -2418 -7074 -9998 -6326
5847 -6326 717 -5112 -6485 -2144 -5258 -6802 -5802 -905 -2058 -2212 -7003 54 8074 9361 9763
5832 9763 -3938 -17355 -19159 -13166 -4795 -14464 -13116 -4557 -15521 -11089 -4058 -4001 -3829 2937 9082
5817 9082 7016 4390 -912 2979 1716 4042 8378 2521 3783 14245 10936 1242 -7872 -9374 -7458
5802 -7458 -10976 -12900 -10837 1105 11913 7947 -3427 -4426 -4076 1213 -2551 -4740 -2100 -9347 -17295
5787 -17295 -19453 -12030 -11141 -22730 -22672 -16161 -8188 -5782 -3022 5143 15008 10523 8711 4076 1858
5772 1858 -466 -4111 3293 -1957 -9146 -22700 -25137 -21417 -26533 -17892 -13789 -17255 -13102 -5501 -11725
5757 -11725 -18330 -24699 -23123 -28487 -20324 -5570 4122 4741 -4975 -14679 -22867 -25645 -29072 -23630 -11268
5742 -11268 -8309 -10441 -17758 -23495 -22251 -15514 -12730 -9148 3570 6424 1948 7640 11492 7368
5728 7368 8428 2599 -12555 -10770 -7698 -4498 -21 651 4553 3688 7369 1897 -6841 -1743 1599
5713 1599 -2938 -10695 -11337 -16030 -22086 -14721 -9673 67 4098 126 411 1154 -3445 -2900 -1325 -8724
5697 -8724 -13915 -17840 -20022 -15946 -4596 -6600 -3257 383 4124 -3715 -12369 -6180 -6200 -1458 -657
5682 -657 4337 709 -7412 604 543 1660 4471 -637 -6400 -10743 -2239 9499 11874 6704 5729 4211
5666 4211 -1041 3407 1719 6341 11021 -1858 -11482 -11238 -9031 -5912 -2882 3020 17457 19714 13802
5651 13802 14167 11598 1935 5155 658 1064 -1166 -889 13646 10760 5561 3845 2584 -546 -1333
5636 -1333 -18137 -25024 -29419 -28339 -22372 -23551 -29664 -27923 -21148 -24883 -27739 -13303 -12372 -16536 -20763
5621 -20763 -20022 -3572 5040 -3618 -15362 -14460 -16155 -9830 -12961 -8283 -13721 -25761 -17973 -12116
5607 -12116 -8962 -2709 -1255 -9748 -5165 8444 15483 17821 20357 23170 11036 2466 -2501 -695
5593 -695 -4096 -4004 -5126 -7871 -10466 -8613 -9633 -5058 9128 16965 15100 18818 21781 17324 10013
5578 10013 12586 14265 6816 6850 6425 9089 6643 -8172 -19761 -15140 -10771 -767 3043 -3818 8821
5563 8821 11207 10573 13668 15441 6340 -6849 -11306 -14592 -8896 -4531 949 1928 8217 11285 4117
5548 4117 -2247 2658 -2623 1663 3687 4515 -3748 -12589 -8200 -3554 256 955 4499 6178 -83
5533 -83 -6853 -12139 1537 -1215 -11771 -8534 1491 2644 444 -941 4170 533 -3639 -1745 1998
5518 1998 8547 593 2554 6862 10594 -418 -15629 -10122 -4746 3543 8919 9536 5282 4596 -421
5503 -421 -2564 -8757 -11901 -13487 -8108 -4712 -15816 -18845 -10011 1960 5273 4635 -2022 277 3813
5488 3813 2641 6459 15571 10203 -3753 -939 -5719 -9449 -3677 3282 12757 6630 430 -2258 -4062
5473 -4062 -3990 -4774 -4747 -3135 -5818 8701 6072 5861 8321 11470 9384 1348 2313 -848 -651 9121 21277
5456 21277 21343 17659 10968 4506 3406 1897 -54 -7966 -14453 -11739 -7894 -11912 -19729 -23510 -13614
5441 -13614 -4626 9285 10590 7547 904 150 -2686 -9123 -6309 -359 5743 10673 11189 6645 3614
5426 3614 12170 23538 27478 14575 2481 5174 5581 -2143 2696 -8801 -11105 1215 3689 -5943
5412 -5943 -11070 -12280 -9198 -16813 -15521 -6656 -5524 -14791 -16260 -15267 -12122 -7247 661 166 -3830
5397 -3830 8021 10563 8182 9099 14177 18990 13635 11666 -657 3706 1049 6917 8879 4602 -4396
5382 -4396 -4042 5571 14164 2801 -9680 -8131 2566 8768 8794 5397 -4592 -8526 -10176 -3694 6267
5367 6267 10295 4413 5842 2923 4642 2308 -3107 -2611 7858 6438 508 -5231 -3563 -4143 1072
5352 1072 -42 8557 12347 7286 4950 8200 20227 11411 474 -6866 1248 8193 -2621 -16190
5338 -16190 -18000 -11124 -8399 -5581 -6467 -12126 -4904 -2730 -5363 -1850 370 -687 -10188 -11425 -5132
5323 -5132 -1002 -8374 -10803 -16426 -19324 -12669 -4911 -2146 -1232 2452 -755 -13003 -16006 -12765 -4225
5308 -4225 7219 15704 15567 14279 6960 -6731 378 10511 12325 12992 20694 12168 4501 1847 -3144
5293 -3144 -4046 -349 -8641 -17315 -17433 -22253 -17630 -12815 -16492 -14564 -10809 -4771 -3945 -11866 -5066 -9520
5277 -9520 -16529 -21493 -21271 -13996 -4317 3374 -780 -2848 104 -1342 1155 -2546 -8797 -11611 -14110
5262 -14110 -9883 -6157 -322 -6137 -5878 -10590 -12329 -9044 -12880 -2063 -9888 -16408 -12592 -4056 -4837
5247 -4837 -14707 -4715 4256 2476 3638 2548 16835 14808 377 -3162 1939 6099 12436 3218
5233 3218 -9423 -10064 -14868 -15396 -6540 5563 8056 6754 5026 9814 13158 10814 9734 7335 2533
5218 2533 3559 16604 20378 5467 2779 964 -5633 -11154 -4852 -8073 -8759 -9990 -11617 -7500 -7826
5203 -7826 -4176 -5557 -9864 -17066 -17703 -6470 -8508 -15463 -18028 -12386 -5613 -6297 -14270 -4805 -3885
5188 -3885 397 -1172 -10069 -18588 -13334 -8346 -9426 -5828 -11702 -18937 -18182 -13266 -5458 6751 12007
5173 12007 12352 13848 16470 21195 10412 6628 1163 -453 5826 3084 3730 5429 9266 2809 -3222
5158 -3222 -4208 -4057 1586 -2462 -3362 1964 8700 10502 2353 3164 8533 -3757 393 4211 10731 5646
5142 5646 9706 3534 -2037 1299 727 -8556 -8939 -11331 -6211 -8637 -6433 -2939 -14267 -12223 4317
5127 4317 13130 8225 5669 368 -1425 -8146 -9817 -9768 -1305 3454 -4498 -20494 -16452 -4595 1335
5112 1335 4567 14309 8213 822 -9738 -13615 -4701 -2728 -6550 -4265 -6411 -3307 -5066 -15732
5098 -15732 -9037 -8420 -11337 -4977 -2874 1449 2407 5630 7371 12281 13177 5251 4883 5415 -8012 -10433
5082 -10433 -9288 -4651 -4788 -5721 -7101 -4562 -6534 -11854 -9924 -7582 -8367 596 8843 5298 -6149
5067 -6149 -12776 -16080 -10374 -17477 -11590 -6453 -10196 -8804 1844 11323 15908 13822 9679 -1651
5053 -1651 -7915 -11806 -23404 -22687 -7975 -188 -1024 -3866 -2533 -1515 -7971 -6475 -3937 -2130 -7879
5038 -7879 -6207 8275 11478 7809 2060 1729 -284 -3144 -783 -10252 -11513 -9294 -2770 -3970 -7364
5023 -7364 -2434 -4674 -8061 -7108 -9647 3102 18256 23261 22943 20251 16573 10781 12562 8669 10380
5008 10380 13276 11268 6619 8361 9317 11374 12017 5970 4678 7335 9348 10514 17326 16746 14022
4993 14022 15245 14796 8674 -1688 -810 2091 7150 5831 2553 810 4288 952 1259 6850 8098
4978 8098 5374 -3667 -5279 3601 10533 -1468 -7229 -23992 -20716 -10778 -12029 -12209 -10736 -6005 -4427
4963 -4427 -7069 -3293 43 -635 -1307 -13115 -15540 -17514 -10204 4377 3727 -10190 -3592 3489 227
4948 227 -5716 1788 4116 348 -5903 -7476 5328 11982 8364 -278 -14135 -17099 -8463 -8124 -12681
4933 -12681 -10011 -8361 1718 711 7590 9244 11933 11348 279 -10777 -8177 7084 9597 721
4919 721 4052 1886 184 645 -3445 584 -1963 -11649 -13531 -14091 -16652 -18394 -9514 -1037 -1068 -2042
4903 -2042 -11192 -10736 -821 8640 7474 4908 4980 129 1055 -299 2427 -2596 -10248 -1247 -2179 -10104
4887 -10104 -13091 -8413 -8507 -8770 -9891 -7245 -10295 -12392 -11760 -7355 -2489 3660 2884 -6856 -11542 -1858
4871 -1858 5831 13774 15972 1131 -12395 -21612 -27433 -19826 -10791 -4699 -3390 2170 1722 6010 5099
4856 5099 4128 -5516 -9854 -6352 -7861 -1190 5297 -3420 7495 7819 5365 3368 8377 -4410 -11763
4841 -11763 -3729 2937 -674 -6009 -6354 28 7154 4408 -485 -5633 7758 3485 -5334 -12781 -16820
4826 -16820 -14428 -6658 5412 9491 7602 5659 2751 -4454 -10326 4050 8199 9382 10881 5873
4812 5873 2707 7838 14757 11300 -5928 -9318 -6665 -1808 -3966 -4902 -1485 -6578 -6899 -4565 -7173
4797 -7173 -1554 -1303 -6647 -6552 -2805 -6050 -9266 -7644 3723 -5373 -8656 -4273 -7115 -12817 -4131
4782 -4131 2007 -7086 -17165 -17002 -10157 -12367 -12104 -13348 -12094 -11136 -10530 -19225 -18152 -14979 -8507 -1653
4766 -1653 9 -856 7533 6594 -2578 -10385 -18648 -28219 -25276 -5216 5378 10 -9183 -7632 -238
4751 -238 -602 -4632 -8588 -10062 -17970 -14681 -12433 -10687 -3456 -835 -557 -2905 3055 6270 4786 -5242
4735 -5242 -15801 -13182 -4062 -14782 -20671 -23022 -26991 -15268 -5559 -804 5783 -6309 -9079 -8160
4721 -8160 -1138 514 -6508 -9139 -6452 3704 1290 -610 -1479 2812 -1064 -5276 -6353 -6176 -755
4706 -755 -1960 -9308 -4598 -10135 -18296 -19133 -24506 -16744 -11465 -1041 653 -6400 -8463 -7672 -11459
4691 -11459 -6953 -1359 913 1327 -471 -8075 -9441 -6447 4972 3739 -93 2501 4099 -4466 -6913
4676 -6913 -8723 -7463 -10494 -7699 894 2161 11226 10764 15514 13641 8111 5146 2253 -4847 -8433
4661 -8433 -8309 -11029 -3376 10426 12597 4642 -1142 1242 -2117 -4869 -4178 -5408 535 2055 -8347
4646 -8347 -14182 -16349 -15876 -14365 -13949 -15617 -13133 -9559 586 2383 712 -4169 -8772 -7332 -12035
4631 -12035 -18392 -18113 -16331 -8873 4226 10832 10952 -228 -9246 -8946 5476 7328 -4114 -193
4617 -193 8105 1360 -4431 -10659 -12801 -15795 -15319 -4333 -10948 -6630 322 76 6606 6879 5660 17705
4601 17705 12286 954 4057 11456 5525 -494 -5462 -10784 -21659 -25919 -12865 -3118 7699 17897
4587 17897 4044 -9419 -13728 -18218 -12633 -9751 -12269 -7364 4902 13481 17452 15934 11164 4815
4573 4815 1184 -6032 -962 11093 16409 28074 24973 21340 18802 15984 2208 -4360 6426 14458
4559 14458 11317 -4413 -9846 -10344 -11774 -18000 -18119 -7319 -2611 4602 10786 7550 3147 13806
4545 13806 9263 4043 5389 -7876 -16072 -21245 -27394 -28065 -16371 -15590 -14938 -7004 5003 2115 -709
4530 -709 7151 6563 2288 -1973 9173 8059 94 -5746 -11116 -4108 -9733 -5378 -318 -1875 -6131
4515 -6131 -124 -485 -7306 -2201 5157 8978 10541 8911 1764 3661 2603 -1175 976 3538 6021
4500 6021 4924 -301 -2209 -2804 -588 4069 12378 12645 10813 2470 -1537 4841 -5361 -12973 -7109
4485 -7109 -294 851 1667 4042 -671 -10732 -17205 -21906 -15056 -5668 -5618 417 10904 13577 6761
4470 6761 8309 12682 11812 5618 -2058 -3877 1674 -3990 -8442 5051 14690 10915 4258 -8425 -10156
4455 -10156 -3326 1416 224 -10914 -12710 -5023 -3244 3005 8860 6870 9518 18338 23725 16747
4441 16747 14009 11128 8262 11423 5024 13537 4828 -4562 1175 11293 11318 5237 -4821 -6648 -3463
4426 -3463 -369 2211 -4348 -6280 -10390 -8460 -8918 -12985 -4075 -911 -4941 -6338 -9341 -10141 -11190
4411 -11190 -2011 2943 7670 10944 2173 -9318 -12982 -10108 -4602 1575 1613 6300 14500 4782 514
4396 514 -5610 -6131 -9846 -10374 -1832 -183 -7391 -10710 -7701 -3536 388 10799 6670 -5851 -4972
4381 -4972 2159 -1442 -8574 -1601 4682 12823 989 -1061 678 -207 -8043 -7719 -7581 55 838 11613
4365 11613 1825 -3580 -5077 -5431 -12950 -8049 5713 8888 10831 14868 17138 8862 9434 6592 13390
4350 13390 7565 5120 6685 10782 13751 6560 2705 7934 2247 -2223 -5640 -16854 -30553 -29258
4336 -29258 -7993 -5516 6235 13866 12806 17221 17292 17153 10186 3134 -2280 -15056 -16653 -4347
4322 -4347 1151 1454 4313 15480 22010 30243 26271 15303 10245 15817 20567 23998 24120 16651 7949
4307 7949 5750 1010 2398 14894 26726 22086 11409 4744 3769 1347 463 8290 9522 6181 10959
4292 10959 4476 -15 3522 11024 4656 -4769 -2444 3591 -627 -6984 -10242 -10552 -1559 -2795 -9176
4277 -9176 598 9832 11135 2879 -12856 -11864 -2696 -1373 -5890 -1947 -2138 -301 -3392 -13245 -11905
4262 -11905 -2469 259 546 -9576 -8954 -10176 -15348 -3547 -949 -685 -7395 -8387 -2952 7921 5517
4247 5517 3722 1665 10312 16950 10437 7127 4260 9908 5151 4075 4164 4762 -3327 -8948 -9441 -9894
4231 -9894 -12138 -14749 -19848 -20140 -11256 2280 1407 3104 -3259 2106 2841 -703 7002 11361 144
4216 144 -7385 -7589 -19299 -16763 -12420 -7773 37 13064 14617 16692 9537 9639 10316 -5295 -10451
4201 -10451 -8860 -6187 -4489 -1927 -4796 -12154 -9835 -14486 -14117 -10540 -4364 6487 -1465 1143 -1886
4186 -1886 2570 -737 6094 3252 -552 -3230 -7279 -7708 -350 3763 -356 -3384 -1771 -2300 -4043
4171 -4043 -11015 -2907 1745 3928 -5068 -3010 -3427 -5718 7254 12034 4165 896 -1053 5788 7748
4156 7748 -6197 -8775 -11288 -7531 1789 -7164 -4538 8277 11886 7804 5087 2213 -6383 -5117
4142 -5117 -7475 -8921 -1531 -2907 -8330 -1994 12505 11540 18037 17050 15359 16851 12677 7298 2320
4127 2320 -744 -3565 213 -1418 -7863 -8534 -3397 -6500 -931 10377 7074 -4478 -5514 806 -6303
4112 -6303 -14544 -16280 -12821 -3119 -2872 2666 2989 -6167 3331 11580 6981 -2135 -7030 -11908 -5600
4097 -5600 9699 16678 16691 16565 10039 5262 7390 11964 13254 16245 2499 -10716 -14144 217 17777
4082 17777 8089 1632 -1955 4250 3756 6232 1388 -425 4933 9462 16585 7877 6894 10358 921
4067 921 -360 -317 -4524 -6420 1569 4769 3226 12780 16999 5227 -2164 -5124 -11076 -6894 -955
4052 -955 -1181 1885 4503 16624 23931 16039 4103 -962 7843 9940 7830 1666 4664 -4512 5926
4037 5926 6639 227 -743 6621 14708 12845 9384 4736 9572 15980 10637 7799 7840 2872 -1593 465
4021 465 1710 3206 6880 1358 -3335 -2136 7069 522 -5975 -4399 -802 -1931 -4475 -12423 -8580
4006 -8580 -674 -3559 -10316 -5540 1109 -381 -2034 1845 -601 7243 10271 9836 7963 2551 1070
3991 1070 8370 14143 10396 9079 5938 -3550 -17642 -19473 -11396 -13910 -11015 -2518 -7837 -15579 -11199
3976 -11199 -10278 -7302 -9396 -9246 -9291 -9204 564 15061 11941 2412 -9592 -3516 6678 10337 10266 3952
3960 3952 -4302 -12070 -15857 -17806 -15853 -13585 -36 5194 2283 -8939 -10655 327 -4336 -11766
3946 -11766 -15033 -3280 8964 2330 -5327 -5266 -6402 -15414 -8081 -2288 -3954 -9327 -10926 -3481 -6039
3931 -6039 -4886 -7461 -5488 4227 12024 17014 10222 11254 13975 13393 6791 -983 1748 5489 10774
3916 10774 19021 14968 18483 18105 12375 6303 10365 8168 15907 23209 22183 16115 6809 -5666 -14493
3901 -14493 -4881 -5128 -9810 -6164 -7217 -5342 -665 558 -1553 5568 7612 15110 12438 11948 5723
3886 5723 3683 3370 -4295 542 13836 9785 -1306 -477 2886 -2288 2175 10004 4895 -1342 7749
3871 7749 18636 24436 19825 9209 10353 15402 21566 16600 7388 -1155 1235 -811 -7428 -15981
3857 -15981 -16770 -11144 -1357 5855 3613 749 -7406 -3350 2831 1325 -5329 -4501 4928 5674 -3897
3842 -3897 -9144 -7269 3938 7659 13130 12412 6396 4848 3321 1808 -1391 -4027 4322 13795 24829
3827 24829 20788 15808 15764 11241 10022 8270 11149 3796 -1326 3090 8549 10083 4237 1663 567
3812 567 9453 15810 8162 -4126 -14864 -14209 -15124 -18839 -16267 -3409 9273 5251 -5044 -715
3798 -715 3369 7808 7460 -5328 -8550 -5595 1239 9851 13002 13752 7361 8686 11524 13318 11465
3783 11465 -3408 -544 4972 4861 3995 -6998 -8921 -10535 -8122 1262 2865 -12201 -11222 -3608 1690
3768 1690 4471 4110 4035 12127 20965 26508 15508 9796 -2741 -11219 -4044 4083 -3297 -13442 -18614
3753 -18614 -8859 -2344 -5334 2840 12051 16985 19430 15152 9797 4614 5715 8895 9989 13483 7116
3738 7116 12524 21034 9699 6457 11857 8035 10901 19393 22277 21413 16806 8707 4028 -7735 -14717
3723 -14717 -5185 -3429 242 3799 3568 13492 11178 4027 8212 6957 8373 8749 5278 11225 7794
3708 7794 4151 1480 816 327 1975 4408 6506 5232 7788 8677 3616 7064 17381 17851 20407 22406
3692 22406 15726 9748 -3161 -14060 -7895 1751 -4556 -11783 -9481 -10685 -7565 2783 16247 14087
3678 14087 6718 -7021 -5054 -3489 -922 4572 191 1021 3518 -2183 -5926 -10895 -16398 -15438 -15173
3663 -15173 -9827 -13009 -12325 -795 -2239 2535 9765 -80 6175 8888 6090 -175 1790 9301 12853
3648 12853 18949 22037 16977 4508 4515 5709 -5073 -9685 -5954 3498 2692 -3662 1359 -869 -1507
3633 -1507 2564 2661 -3631 1006 15202 21576 18086 23421 15993 8206 13631 7597 12055 5496 2160
3618 2160 -8114 -5541 -4880 3319 11748 7020 -2933 -7779 -6641 -3161 168 -7343 -11022 -10736 -12497
3603 -12497 -15868 -18440 -19103 -26306 -30439 -15333 -1888 8679 13842 21237 21778 21419 27226 25651 21729
3588 21729 22969 10789 7581 17428 22521 25707 27549 20636 7073 -6631 -14864 -6263 4089 7683
3574 7683 4612 5194 6743 7604 6202 469 5561 4739 4726 4078 4047 945 2078 -840 -4319 215 6772
3557 6772 5215 -1174 -7944 -12078 -16533 -19328 -18465 -13062 -24981 -36089 -27898 -16888 -6730 -12489
3543 -12489 -9310 718 11294 7072 4785 6845 9786 8065 10286 9446 8143 -4196 -10378 -10058
3529 -10058 -6018 3049 11752 14008 8664 -6092 -8246 -65 -1009 -7407 -6183 -4418 -1530 -876 -3260
3514 -3260 4646 -1775 -4965 1778 6925 2866 -2231 -14237 -17543 -16247 -22002 -19136 -12294 -8053 -4332
3499 -4332 -6904 -12369 -9608 -6081 171 2327 301 8082 15137 7665 6044 6289 660 -7205 -12274
3484 -12274 -11474 -79 4232 364 -8814 -5102 2478 -179 6339 17438 23588 24342 9696 11635
3470 11635 15487 495 -12187 -18819 -20192 -10784 -4607 -1513 -10587 -12837 -13710 -19864 -14598 -7262
3456 -7262 -3790 -3738 -1548 -4595 -4779 -6025 -8698 -8157 3965 16524 21740 19683 15284 4460 2508
3441 2508 15836 26817 20532 8624 1194 11441 24131 23096 14676 8897 6900 2118 520 -4956
3427 -4956 -4159 -6794 -7502 -5884 -1863 7651 6228 372 820 -4153 -14446 -18401 -19799 -10252 -14945
3412 -14945 -21863 -10175 -4317 613 5793 9408 6818 1428 -8469 -15167 -10053 -3867 2784 17495
3398 17495 15894 10885 10523 -1575 -1010 -1331 5117 541 2556 -3526 -11360 -17490 -14768 -4647 4746
3383 4746 6228 158 -5070 -3281 -9640 -560 6006 5578 11000 10105 12993 5437 -3977 277 2735
3368 2735 -3994 -4878 -17111 -14373 -11673 -4634 -3664 -7864 538 406 1107 13615 27914 32057 32732
3353 32732 24117 13676 13136 9580 -2869 653 8200 8483 3507 -6325 2295 4804 1210 2450 4048
3338 4048 9274 14238 8305 6598 1608 -2798 -1136 -2839 -4546 -5015 -1903 -3009 5527 -3449 -2410
3323 -2410 -206 7831 19807 22462 21659 14881 5519 8134 14364 13860 5389 -4247 -917 -1426 -8167
3308 -8167 -8968 -7021 -10739 -6277 -5474 -5704 -12554 -12315 -10559 -13809 -7728 -10505 -27454 -28571 -18935 -16558
3292 -16558 -6901 -2035 4751 3616 5933 -2308 -13520 -7774 928 -13298 -12945 -10417 -12712 -15956
3278 -15956 -5412 -1068 -446 5305 10106 11619 9125 7511 7717 -1550 -2017 5490 2181 -1 -11344
3263 -11344 -9314 -3232 -5930 -3989 -4313 -4622 -9118 -6846 3982 7053 5384 6363 5587 2794 -2054
3248 -2054 10960 15275 13095 -2014 -6836 -134 2843 -2069 -5505 -4822 -6108 -3429 5692 5471 1231
3233 1231 -2120 -1693 4422 -6014 -20429 -21247 -16997 -7087 -4194 352 1928 8430 16801 15768 16205
3218 16205 17181 12783 10584 15643 21463 18443 11509 9102 6761 2672 623 11077 19288 15851 7944
3203 7944 3695 5363 11495 16022 6468 6861 23904 31492 35800 31209 17831 10036 9628 3804 -4874
3188 -4874 -9689 -5344 872 -3205 -2790 -3886 -8900 -4694 -6309 -4669 -146 3921 7829 11133 12655
3173 12655 -719 -488 4429 2413 -10355 -18896 -18097 -8499 -3173 6033 5292 9356 9747 5323 -8214
3158 -8214 -6829 -3753 -8438 -2931 1862 -3134 -7449 -997 2190 11616 11541 12471 5844 1606 1587 2884
3142 2884 1139 -409 -1988 -4437 -12533 3651 11157 675 -2937 560 -3487 -1373 6249 22982
3128 22982 22811 9342 7057 7868 8054 180 -5456 -4838 -6533 -17466 -21638 -19922 -12241 -2356 1199
3113 1199 11336 12770 6384 10697 8431 11121 13177 4737 3446 2648 4288 10828 8983 3986 -4508
3098 -4508 -7880 -2786 657 11383 17221 22682 25598 22725 26576 20805 6362 -367 -2612 -5709
3084 -5709 -2201 3508 11437 11125 4765 823 -5957 -3214 1319 6966 7847 7795 -1904 -4219 10817 10179
3068 10179 2121 14924 5075 -6434 -12361 -764 -860 -5001 -6691 -8110 -16337 -8445 -7217 -2333
3054 -2333 7173 3445 3444 -3489 -70 6225 6953 5858 10616 5403 2044 -401 -141 7792 17076 7908
3038 7908 3468 2809 3958 6750 5756 -4078 -4478 -1377 -791 -6854 -5214 -2243 99 4186 5998 11522
3022 11522 18338 14037 10386 6022 3504 -4430 -15771 -11573 4741 2821 125 7159 8412 14826
3008 14826 13046 14080 15513 8477 -811 -226 428 1836 4854 11764 5399 31 -5552 -4272 657
2993 657 4523 81 -6249 -3347 -3229 1436 3208 3515 -3755 -2140 2128 7330 8361 -2519 -2092 5511
2977 5511 140 -10817 -1144 -182 5315 15963 13939 11927 9745 12889 13123 10596 -273 -2674 1472
2962 1472 -2700 1866 8588 12049 9957 1224 -4561 -3939 -2480 -956 -19 -2337 -3408 -522 -1116 -6226
2946 -6226 -6931 -1210 3788 6157 12762 6526 -8635 -5093 4052 8025 5195 -1543 -3624 -8169 -10307
2931 -10307 -10870 -5294 1988 2545 -1886 -356 -7463 -12378 -9715 -413 -918 -341 -3660 -391 646 5461
2915 5461 1764 5471 14274 6518 -3779 -11313 -14840 -21054 -15212 -20303 -19089 -2865 5764 8952
2901 8952 1949 4162 14985 12313 10722 14230 16575 14676 10360 7712 2839 8147 6204 1136 2967
2886 2967 8778 13560 11240 -29 1240 4882 4242 -5305 -17270 -4763 7642 5901 -2030 -8531
2872 -8531 -10397 -10095 -10038 -12804 -11626 -5146 -7312 -2164 -4805 221 7691 8902 12440 5121 -4406 -4498
2856 -4498 3922 -6086 -9934 3247 -810 -2585 -1497 -4575 3585 19694 16320 -2670 -9895 -14820
2842 -14820 -5679 419 11401 10518 1843 -3284 -1977 -8935 -6647 4436 -1154 -2273 -264 9603
2828 9603 10293 -444 -7573 -456 7669 2030 -4795 -6040 -18 940 1917 6 -1045 -6595 -9821
2813 -9821 -73 -3905 -2437 -10649 -3372 5638 11713 11312 2764 11224 21740 12500 7261 9555 2334
2798 2334 -3526 -8513 -9317 -2812 -3606 59 3144 2417 559 -5526 -15618 -23309 -7775 -1715 -3274
2783 -3274 -3270 2899 -3126 -16993 -16797 -21281 -18114 -9660 -4590 2336 3881 4716 49 2210 4337 9641
2767 9641 15120 18746 16849 10503 962 3505 8562 13927 4339 7642 13036 16802 17895 8045 7833
2752 7833 16645 8678 -2217 -179 -7529 -4971 -1699 3926 2585 -4678 -7082 -12239 -7279 10392
2738 10392 8388 1331 2439 -1913 2266 5333 11281 12314 7635 8354 11052 7878 12865 15634 23882
2723 23882 21984 25456 15971 7695 8596 8690 11609 1858 1648 -1703 7198 22227 22308 20457 8949 9495
2707 9495 18107 15399 8585 1745 -14492 -11910 -10350 -1119 5493 8925 14675 12260 15279 15876 14078
2692 14078 11806 5128 -367 -1077 1592 -9342 -13219 -18231 -18532 -21171 -16492 -7863 -2129 -3734 -486
2677 -486 967 212 -3503 1182 2845 1248 -6414 -1880 5361 6298 8925 13916 9423 -11665 -9905
2662 -9905 -9899 -8728 -18142 -33823 -31354 -23662 -13955 -12651 -16834 -17260 -15437 -12852 -7370 -7052 -11070 -7155
2646 -7155 -3044 -1568 3441 5756 12578 19004 18968 16754 11302 4311 1435 -3382 -3119 -6408 -4095 610
2630 610 2050 -4003 5639 11372 5030 7514 5827 6982 9781 8336 368 -1693 -613 -907 -5953
2615 -5953 -9952 -9957 -3577 -7042 -12785 -7253 -4334 564 6394 14025 14895 13554 13134 20132 14044 10513
2599 10513 17648 16674 16152 18342 13686 -2142 392 3704 8633 7143 4770 -1263 -14571 -18578 -21271
2584 -21271 -8974 8667 7476 21240 27794 10378 5944 14777 20920 12440 5767 4652 5824 9037
2570 9037 4374 -1402 -6946 -4649 3627 16649 15678 5639 -2598 -1332 183 4634 177 -3166 -1413
2555 -1413 -5215 -8380 -1880 419 -4749 -564 7380 7377 6247 6923 9144 5751 7192 6762 6826 7034 -150
2538 -150 -11188 -13185 -7850 -3666 2959 791 -814 5184 10900 12522 14223 13671 3504 6784 9827
2523 9827 3265 -6613 -2851 899 671 7632 7689 1193 -8323 -7868 -7645 -11768 815 -1371 -5651 -9573
2507 -9573 -11714 3704 6160 7661 7345 2633 -203 4532 11113 11689 3837 8861 11253 10487 8691
2492 8691 10757 6003 -1604 -9848 -5625 4709 19019 26548 18251 4008 -3372 -3786 -3692 -4290 1656
2477 1656 13052 8057 655 -1334 176 -1850 6250 14473 17123 10498 6068 -2724 -1537 3476 6949
2462 6949 7779 10663 7765 8089 8555 7757 17836 13587 4473 3182 -3300 -3762 -3631 6 4969 -192
2446 -192 -3317 -9072 -15201 -14992 -3713 7641 2055 -4431 -2589 5669 5509 -2994 -2535 -232 3174
2431 3174 5459 15144 21858 21097 10800 15869 19432 22981 24616 17957 12365 8777 5218 11465 5146
2416 5146 1338 -1791 442 2543 8436 16288 24828 29254 19427 5788 -255 -6292 -8362 -5941 4194
2401 4194 2115 159 -2088 665 5960 16634 12589 3509 -189 6436 16534 17901 16292 17727
2387 17727 21431 17952 6797 7312 8269 9164 7748 9660 13952 14246 12538 5562 4540 9449 8582 10146
2371 10146 5416 6613 5142 6198 3460 2681 5488 5113 18702 1628 -16499 -19166 -14485 -9633
2357 -9633 1131 5041 2711 5256 11327 15286 10304 6507 -4935 -4125 850 6568 4674 3711 15574
2342 15574 15029 -383 2599 -516 -141 595 1095 -23 7812 9678 9610 9657 7565 -5299 -21617 -14239
2326 -14239 -4771 3570 92 -1235 -6896 -14083 -7864 -5396 -1397 -6865 -8130 3934 6060 11985
2312 11985 17408 14284 5004 -5146 -792 7975 7403 874 -705 11528 14171 11394 19536 21470
2298 21470 11115 10293 10921 13406 19788 24073 14978 6210 6033 -2058 3676 -928 -8039 -17322 -17427
2283 -17427 -13514 -13715 -25633 -24881 -5566 -7762 -14064 -18946 -13343 -6807 1722 8058 3615 1676 5247
2268 5247 2238 3772 9112 9533 9468 7996 11330 20317 15836 10826 10676 10483 5471 -3983 -6831 3859
2252 3859 9290 3925 2858 -146 1125 -2882 -4404 162 18298 25906 31920 29737 16793 12658
2238 12658 6396 4445 1811 3282 9643 14902 17692 9205 8117 10311 2912 -3940 -8004 4997
2224 4997 16982 18922 27400 13842 9261 17039 15020 2932 -4796 -9369 -9681 -14008 -12031 -6445
2210 -6445 -1705 1515 -4609 -7288 929 5498 6935 -221 -7944 -9446 -4560 -1272 2279 16937 25673
2195 25673 23719 5763 11490 15558 911 -12808 -16322 -13965 -4362 -2673 -2283 8345 2569 -4442
2181 -4442 -10005 -1803 5315 9688 11571 9180 11525 5149 5355 17200 22563 12092 11416 11688 12929
2166 12929 1455 -3306 -820 4330 6731 3161 -1842 -2590 3580 2274 6183 4253 8683 8802 4130
2151 4130 -1412 2556 -2268 130 -552 5551 10486 9566 7438 5583 4085 -7317 -10377 -7338 -4652
2136 -4652 1917 6868 -493 -1441 -5310 -8732 -3849 543 5238 -1136 -6144 -10833 -13750 -14335 508
2121 508 14817 9201 4296 -5045 -9512 -15791 -8693 7367 12598 4129 10000 8583 8488 2370 7316
2106 7316 3218 -6930 -5866 529 -2695 -1785 -7095 -9193 589 -1017 -2667 -3824 -5788 3367 6586
2091 6586 6833 3950 910 4753 -4169 -9935 5408 9664 10031 -983 -9342 -16678 -9079 -6697 -6942
2076 -6942 -7184 919 3758 -2495 -1821 5261 6423 12695 14087 8237 8025 12630 22019 21495 15204 8969
2060 8969 13023 11308 9403 10752 21988 19548 1341 -7638 -5439 709 5847 524 3715 1231
2046 1231 3664 7557 -1417 -768 -269 -395 466 -6994 -10895 -2952 5885 14743 10999 5719 10027 10244
2030 10244 4228 2819 734 -2643 283 4384 9765 15039 11215 1380 -94 -174 9190 9636 3749
2015 3749 -2677 -7865 -7334 2610 -725 4401 250 -5266 -6530 -4192 -2137 -14197 -23766 -17330 -20219
2000 -20219 -22169 -18132 -11515 -16106 -14263 -9274 -8432 -10350 -19061 -16503 -6527 -6501 4471 13465 13442 8168
1984 8168 4339 6084 3283 5084 5632 9860 10542 10230 3118 -4828 -7574 -8241 -16244 -10894 -1947 -1597
1968 -1597 -1519 3629 -2171 -7593 -7814 -9323 -2099 1219 -1087 -1473 -4366 -8793 -5318 -5360 -16892 -20533
1952 -20533 -14790 -1305 8341 15134 7952 -1689 -5405 -9752 -12300 -4920 6854 13220 -1431 -10576
1938 -10576 -6054 -2795 -1303 -1396 -1935 -14525 -19487 -17667 -4805 -136 -11884 -9251 -669 -2321 -2173
1923 -2173 -7889 -12624 -10426 -3040 1290 11275 9606 988 1294 84 -2718 4711 10370 10536 10008 1778
1907 1778 -5827 -2660 5002 4666 5889 2066 17743 22425 13662 13331 11407 6936 4820 -4046 -8687
1892 -8687 1026 6693 3239 5158 5004 -1279 1958 6937 -5820 -5686 -2816 8408 12680 3370 -6253
1877 -6253 -6281 -6216 -7855 -12024 -9035 6502 14048 13963 13794 9989 4173 -7953 -7913 655 4741 2196 -2114
1860 -2114 -1045 -6995 -12320 -8517 -7778 -1501 2157 1064 5285 1369 4917 16522 17475 14890 7004
1845 7004 12935 20589 14013 -1698 -4317 279 3260 8276 10714 9150 9984 6572 13049 7313 7437
1830 7437 10244 8842 12466 13008 12537 17659 10956 -3586 -6457 -4753 -7346 -9509 -3986 -2785 -191
1815 -191 5218 15441 24478 33438 26722 16927 11747 -1964 -2879 4609 8331 11428 7753 3298 1971
1800 1971 2403 3844 4560 6688 14176 15850 19935 9405 -6341 -20161 -22472 -23793 -19944 -19517 -15448
1785 -15448 -10933 -2758 5754 -1870 -9088 -3921 -7136 -5851 -6411 -14467 -18648 -16391 -17805 -8999 -7090
1770 -7090 485 -687 -6709 -16219 -7812 2544 6850 4645 14649 30707 39613 43400 52693 56300
1756 56300 61121 58435 51483 44923 38505 21949 26528 20431 181 -11616 -20743 -22011 -15903 -17372
1742 -17372 -12793 -9375 -7169 4660 15722 9681 1647 2775 -1206 -4540 -5442 -203 3881 990
1728 990 -7063 -7668 -826 -599 5313 1392 5987 -6460 -7425 2950 9750 9700 9463 10153 5214 -1317
1712 -1317 3176 10551 5259 -6793 -19734 -23788 -16738 -4533 3058 10065 13275 14185 22569 27066
1698 27066 25031 21233 13950 3825 -4904 -7220 -9019 -12736 -11750 -8429 -1216 -9238 -1143 8486 11825
1683 11825 16769 22012 21894 14474 10721 7554 24938 24284 14707 13627 18558 12622 3027 -3711 -9130
1668 -9130 -8712 -5414 -11580 -12770 -10683 -2259 -2231 -877 -5381 -4952 -4004 -6798 -7606 -6746 -4142 -4788 3458
1651 3458 7009 13424 4307 -322 -2307 -7034 -9322 -11521 -9202 -5773 -2082 3586 7665 3572 4817
1636 4817 108 -1180 -10358 -21571 -27119 -21049 -16235 -8826 -13505 -13000 -6140 -8169 -10555 -3416 -10874
1621 -10874 -7280 -4820 -8347 -12016 -17315 -29043 -25275 -9962 -4872 -5009 1173 8559 5578 2081
1607 2081 746 1059 -1366 -6986 -7179 -12306 -10323 -2557 8317 9388 4029 8342 7450 -1416 -7979
1592 -7979 -14605 -7849 -10993 -11193 -8104 -4107 -894 -6315 -7022 -5400 -2208 -2866 -7254 2873 10685
1577 10685 12420 13078 14353 15745 13936 13665 10685 -5301 -3167 10115 9445 12178 16579 11782 10291
1562 10291 2915 1610 9557 18052 16017 2254 -8152 -11197 -3757 -302 1576 4814 2824 8243
1548 8243 12985 8055 6454 3829 5800 4288 -3974 -27 5014 2716 -5763 1266 1333 3634 5193
1533 5193 1876 9489 18235 23259 14001 10943 9992 6544 -1495 -1048 1932 5699 8470 8292 5200 3276
1517 3276 2452 375 4186 -864 6863 7551 1168 1768 3358 5258 -5778 -11228 -18749 -4071 2017
1502 2017 -3209 -7226 6468 18447 17161 12514 -287 -4905 -4506 -1682 -6272 -6640 -6181 -2736 966
1487 966 6248 1623 -10257 -12469 -13060 -12101 -11931 -10844 -19324 -14491 -14037 -17475 -9747 -7104 -6993 -6870
1471 -6870 -1435 1401 246 -3122 -3663 617 4670 10165 4231 -284 13785 17390 15702 21142 28723
1456 28723 32887 27725 19235 24219 32823 41590 34581 24574 20679 17897 5468 -5302 627 -1042
1442 -1042 -1840 3211 2378 -5737 -5486 -1509 -5712 -7662 -8701 -7416 -6528 -6197 -8650 -13608 -4793 1073
1426 1073 -5854 -9893 -10316 -16164 -12414 -12409 -15323 -19080 -19760 -22295 -4832 -2274 -3568 -9878 -8392 -5062
1410 -5062 -15476 -11222 -7148 4984 14489 5166 -1207 4883 11494 13660 13262 5996 7528 3791 -9839
1395 -9839 -18674 -21741 -19292 -8953 -3806 3364 -5238 -9791 -9415 -5013 -2080 7606 10200 7321 117
1380 117 -3 4273 12915 17230 7635 8745 5935 171 -3518 -3410 -3263 -8118 1305 5503 5787 4682
1364 4682 -381 -1066 8812 9454 12823 14510 12922 6178 9906 14535 17679 21745 23585 18722 8475
1349 8475 2505 4538 109 -4080 -11681 -10558 -11839 -11192 -4471 2226 -8857 -5593 3404 5307 5885
1334 5885 6910 11373 10506 10222 18699 16266 7854 -311 -373 1954 -9659 -2026 4116 1910 5725 13663
1318 13663 10874 8044 6140 14275 22991 26498 18327 6632 -10400 -16756 505 8803 5956 2075
1304 2075 -3973 3093 5046 -4504 -17548 -5886 4127 -11260 -15525 -10697 -2844 5947 568 -3105
1290 -3105 -5767 -12240 -3370 -10101 -8009 -3989 237 4997 259 -7559 -4998 -4347 982 -1823 -9813
1275 -9813 -8010 -2045 -7177 -8251 -12829 -16960 -9415 -11069 -12310 -3155 -537 4906 4282 939 -10921
1260 -10921 -10565 -10884 -5501 -7449 -11462 -5276 11526 19836 10679 3157 -3240 -1111 6764 16913 22797
1245 22797 23335 19684 16193 16156 10097 12529 15332 12979 18529 17820 7369 8025 14478 14798 10462 13151
1229 13151 15298 17115 13961 19801 23919 11538 -1507 4162 -4010 -6430 -7568 -462 3543 5425
1215 5425 4629 -572 3833 8499 7497 -2260 -5981 -12149 -8843 8038 11729 8330 2927 394 -483
1200 -483 -7958 -4532 -7645 -4078 3922 7936 3325 2939 2623 8040 2150 1385 3998 3593 -5968 -10193
1184 -10193 -12444 -19140 -16836 -20099 -17475 -17480 -14435 -32 5902 -3532 -10659 -16181 -13087 -9910 -4554
1169 -4554 -6220 -7042 -35 -4597 -12511 -13014 -10391 2810 5058 1978 983 2181 -2014 -9673 -8239
1154 -8239 -16215 -15723 -13658 -8681 -157 -88 1377 1559 4271 3333 6623 3894 -2087 2943 3932 336
1138 336 -434 2824 1652 1974 6448 4562 718 -2219 610 -1111 7412 9505 6369 10340 9457 1419
1122 1419 -2451 -1223 10128 20274 15419 13126 5591 -28 -1002 -3806 -10121 1003 458 -8987 -10298
1107 -10298 -3687 8336 10082 2215 -9375 -10445 -9123 -13203 -17664 -17744 -5524 14423 23084 7105
1093 7105 -7232 -9938 -11774 -12647 2494 3666 3779 4097 1356 -7082 -1649 -5101 -9608 -10775 -5287
1078 -5287 -5124 -5368 3059 12053 5368 5371 6343 10040 11841 1310 -9001 -12802 -8580 -6530 -6274 -7576
1062 -7576 -7398 -18165 -19843 -10374 -3650 2443 8534 12370 -1302 -3714 4885 611 -10593 56
1048 56 -1606 -6152 -4383 -3336 1044 7381 5659 6580 1765 4537 8398 4611 -1463 -10422 -6354 -4637
1032 -4637 -2295 -9624 -10342 -1892 -14060 -14197 -7370 -1119 -5250 -783 6279 3197 4004 -9816 -25854
1017 -25854 -22821 -17241 -12137 -11454 -10807 -934 -3757 -13099 -15537 -17801 -11069 -5268 -7887 -1347 9483
1002 9483 19473 18345 12541 10515 12993 8940 1160 232 -2039 -707 -2479 -8855 -9353 -11243 -3917
987 -3917 5770 8264 10534 14902 17517 10895 4304 1491 8065 11834 17284 8911 -511 -17767 -25704
972 -25704 -15561 -14495 -17906 -13807 -10462 -5446 5762 7566 1415 -5372 -7201 2879 -1829 -1154
958 -1154 2624 -2158 -12609 -2215 1166 8612 3320 -841 10987 12689 -2244 -4805 -3899 -2559
944 -2559 1645 -1178 -583 1235 -2435 -8334 -8709 -18464 -22099 -17090 -18211 -26640 -16210 -2908 7942
929 7942 -881 364 3568 7777 8061 1781 -3946 -4989 997 7532 4612 -5503 -14029 -9050 4168
914 4168 17992 10306 1371 1332 4851 3983 2187 6392 11394 10992 6070 91 -6843 -3225 4523 1476
898 1476 3472 7590 5789 6062 -4638 -17089 -21260 -18259 -15992 -12121 -16725 -22089 -20168 -21745 -18731
883 -18731 -13079 -13950 -16270 -18145 -17499 -18261 -9722 -355 -5009 -6360 1465 -1190 -6866 -13930 -7229 2253
867 2253 6686 -215 -3947 -2175 -8943 -14905 -20963 -24466 -20457 -11466 -12645 -12452 -12705 -16437 -20863 -21268
851 -21268 -23517 -24532 -29133 -23657 -13635 -3206 -262 172 2459 -8573 -14455 -20698 -24200 -13584
837 -13584 2993 2886 -4520 -164 11026 19590 19256 8711 -1802 -9742 -3032 4642 14260 9922
823 9922 4111 8460 8524 -2533 -18497 -26433 -20897 -10402 -9641 -8956 -14324 -22638 -15047 -11207 -8933
808 -8933 7667 10550 17129 25775 25144 2982 -7283 -17805 -11711 -2738 -5503 -8234 -17633 -15219
794 -15219 -7963 -10766 -12225 -1963 1996 12699 15039 1604 291 3824 821 -4953 -2095 -3028
780 -3028 -145 -3833 -5984 -4993 -154 1509 954 7389 10529 4569 -8712 -8139 320 -689 6458 -2448
764 -2448 -4211 -1229 607 3353 -1321 1284 1426 8198 9563 5841 3077 1665 -8796 -10934 -6290
749 -6290 -2747 -9 -1753 -9118 -4685 7519 16822 13936 -706 -10553 -16214 -17609 -5724 -4473
735 -4473 -8997 -13854 -5192 -4556 -12158 -14324 -9656 -8195 -5271 -6336 -4685 -8576 -13243 -21227 -23036
720 -23036 -15263 -8582 -2708 -956 296 -6576 -12017 -12037 -8942 -7002 -10821 -12217 -14611 -19007 -18062 -15933
704 -15933 -12357 -8679 -1345 2254 -3234 -4068 -2795 -7028 -10291 -3758 3692 -5450 -10880 -18890 -19664
689 -19664 -18153 -14878 -12523 -6919 3141 4160 -1163 -11993 -13431 -18200 -12755 4102 6321 3016
675 3016 -8 1756 8971 2627 -1603 2310 -6499 -15243 -13377 -8529 -6916 -12515 -20276 -14290 -2141
660 -2141 -7044 -11620 -6979 -3532 4646 -490 -4074 -8136 -4267 2588 -4621 -7163 227 6170 -4118
645 -4118 -6140 -4081 -16813 -20937 -21425 -18632 -11516 -7264 -5392 4246 3804 3463 -4234 -8434 -7715 -9172
629 -9172 -20421 -14107 -8659 -12458 -16096 -15913 -11412 -5410 -11155 -11436 -11086 2490 9162 7898 -1734
614 -1734 -10714 14 -820 -458 8801 3106 -6185 -15584 -16371 -8138 164 3309 6511 5292 1571 -3773
598 -3773 1798 -1584 -3001 2652 345 -3280 1712 -6985 -15562 -9263 -412 -4311 -6962 -20212 -21594
583 -21594 -4885 -7944 -7662 -3067 5123 6736 -3615 -5709 -8067 -9396 -5023 724 -4144 1709 7824
568 7824 1935 -3112 -1056 -2925 -342 85 122 1238 -16258 -25061 -16711 -12255 -16818 -18984 -15988 -14313
552 -14313 -7005 -2333 -1471 4148 6017 2417 -136 1769 -1201 -5012 -7107 -7932 -8986 -3331 1000
537 1000 4532 -929 4312 9693 9843 13569 11674 1751 -5163 -13742 -8583 2171 5075 1847 908
522 908 1975 -5110 -7555 -7443 -5678 -12895 -14143 -13015 -14585 -12133 -16488 -13124 -5360 -2358 1501 7741
506 7741 -2963 -5156 -11753 -12639 -8692 -7335 -11962 -16699 -9737 -6348 -8604 -8392 -21197 -15492 -2871
491 -2871 -13301 -19464 -13533 -14337 -12046 -18463 -16187 -478 1731 -4615 -2058 -5394 -3498 -3601 -4401
476 -4401 -3357 2974 10311 11936 -5231 -9770 -12286 -10534 -16708 -15311 -14599 -8874 -5548 -5427 -11269
461 -11269 946 8401 5114 6714 7509 3537 -5863 -11382 -8895 -3081 -5333 -5895 -3945 -5297 -9446
446 -9446 -10402 -14152 -18624 -17965 -13814 -10746 -11273 -14833 -11393 -14240 -10095 -11408 -11948 -4821 -3127 -1937
430 -1937 -10172 -11471 -8246 -8040 -14159 -25187 -17674 -11006 3199 4254 3460 -4170 -1615 1346 1422 -5060
414 -5060 -7303 -4136 2135 2268 6730 -3321 -11219 -7756 -5084 -4617 -7176 -10749 -2488 3146 -7123
399 -7123 -22808 -23611 -17333 -16719 -13424 -6847 -5314 -6498 -5524 -3641 -13561 -18774 -14208 -15325 -16537 -10357
383 -10357 -9278 -10984 -14869 -15289 -8502 -13735 -9506 -6403 -3571 -504 -1303 -5569 -9712 -15667 -17775
368 -17775 -20325 -11945 -923 4652 9665 10986 9716 1901 -4789 -268 124 -2368 -2080 5624 15469
353 15469 19844 12396 -932 -17534 -20469 -9568 -2118 -5521 173 -5949 -13043 -12708 -8651 -5454
339 -5454 -11558 -7494 -9464 -10249 2671 11722 -3761 -12814 -14864 -8309 -6214 -8039 -8075 -1100 8097
324 8097 4744 1071 -4440 -13556 -13371 -9928 -555 2481 -3522 -11921 -18101 -10521 -3262 -4087 9624
309 9624 9340 4435 -6200 -13568 -13678 -14253 -13631 -12848 -9936 -5532 -10477 -15460 -18491 -15923 -13237 -15153
293 -15153 -8526 -7816 -12586 -21564 -23555 -8292 -5694 -4407 -4389 -11716 -16839 -17353 -22863 -18425 -17573 -21765
277 -21765 -17166 -16954 -13735 -9806 -1374 1078 -3401 -3160 -5310 -3305 -383 -7077 -7562 -2201 -8330 -12270
261 -12270 -4372 9330 8829 4101 5637 -2055 -9100 -9019 -13468 -13032 -7065 -7024 -6991 -12399 -16740 -11019 -2980
244 -2980 -7302 -5675 -6574 -6517 -918 722 -6311 -14767 -16833 -19366 -13323 -4230 -4507 -5753 -4811 -10122
228 -10122 -19946 -14248 -9155 -4166 -659 5877 7006 4721 1976 -7156 -15993 -11261 7975 2484 -57
213 -57 -9445 -13073 -13509 -12749 -13517 -17532 -17519 -10975 -10214 -12612 -14049 -10636 -16292 -8527 3196 -7741 -6588
196 -6588 -1112 -3301 -9293 -11081 -21486 -25970 -26591 -23332 -20701 -25742 -20452 -10052 -2476 -1833 -9769
181 -9769 -9417 -2562 -2058 -2567 -9790 -13147 -9583 794 2656 10362 11741 11800 9948 2051 -3281 -5663
165 -5663 -3393 -1418 -3694 -6473 -4678 22 5946 6242 2283 1879 -6724 -18893 -16213 -8860 -3883
150 -3883 -3506 -9872 -6374 -2242 2595 -6625 -11809 -3807 -1117 -9086 -11831 -13776 -10048 -4617 -2364
135 -2364 -6252 -12863 -18630 -15761 -10134 -8532 -2305 -596 848 -4667 -2424 -1572 1477 504 -6103 -4416
119 -4416 -8618 -8764 -2461 -3259 -5975 -8211 -11421 -14089 -16323 -17157 -17680 -11033 -8394 -10971 -8425 -1759
103 -1759 4157 6366 -1499 -8673 -10791 -7459 -5955 -12042 -15353 -21100 -20600 -17303 -12535 -8151 -3969
88 -3969 -5050 -7464 -12326 -14550 -19634 -18881 -11892 -4285 -5335 -10800 -16027 -14172 -7867 1223 1007 -550
72 -550 -7455 -8661 -2647 -4513 -8718 -14238 -5090 529 -8133 -18604 -15216 -15606 -11458 -16230 -12920 -5969
56 -5969 -4913 -16976 -19257 -12936 -10098 -1882 -4037 -7654 -7860 -7274 -6942 -4621 -12101 -22383 -21796 -17144
40 -17144 -17035 -20029 -12941 -11315 -11992 -7261 -8466 -12234 -16738 -20964 -10917 -5595 -4409 -7636 -5518
25 -5518 -1273 2081 1905 18 -5549 -5053 -9375 -10394 -13851 -11074 -9516 -7220 -10005 -8878 -13234 -6632
9 -6632 -5234 -4424 2677 -1130 -9119 -11297 -3511 830 -4434
0 -4434
$$ Imaginary data points
##PAGE= N=2
##DATA TABLE= (X++(I..I)), XYDATA
32767 126464 125872 121073 122285 130762 135627 133724 133146 132728 137488 138992 136978 135886 133244 138349 145865
32752 145865 147051 145762 142694 139296 141173 149559 155141 153980 153948 159429 165109 166019 166128 161181 166670
32737 166670 172506 173832 171971 175889 183291 180606 171170 170472 170158 180154 182468 178842 180094 180692 181015
32722 181015 182891 192030 203042 205529 202802 204303 204177 201857 201770 201962 207022 214230 208736 210307 214818
32707 214818 215916 216954 222406 223671 232048 235157 229421 222129 222292 218860 221200 229735 234694 236500
32693 236500 235539 231716 230185 238869 240568 240747 252396 255544 251928 249076 246399 240953 230677 229271
32679 229271 242600 250189 255885 266059 273209 274086 281048 278677 272460 268536 268364 274402 273013 278845
32665 278845 285088 283715 283556 284237 285537 289788 290600 295149 292488 296979 295155 293961 293690 294341 294064 305014
32649 305014 312359 308867 307253 300680 295274 299659 302429 305795 305337 303764 307085 303663 306479 310499
32635 310499 310234 309447 319211 325013 332722 330477 329778 330357 333474 336740 334058 337185 339177 334926 338942
32620 338942 351033 352551 347360 349435 353198 358890 361478 357521 360921 362515 363342 359526 358976 356547
32606 356547 355809 365026 368297 371926 382115 386711 377498 370028 366819 366673 375663 384694 384798 380841 383192
32591 383192 384144 383631 383787 389043 385889 385396 388755 401089 405142 405751 397786 397884 400099 390771 388019 388676
32575 388676 392272 397542 401991 396695 393984 401300 404227 407050 407650 407584 418254 416027 416354 418191 414043
32560 414043 412357 411361 415187 427284 428679 428881 425637 430476 430784 432145 433417 430647 435281 435456 440483
32545 440483 439803 435505 433068 433555 434285 439715 436246 434883 436352 431459 434384 446293 457726 463730
32531 463730 465867 466090 471489 467032 460966 450906 454167 464641 468127 465542 467519 473833 477907 479392
32517 479392 477783 471435 464473 474310 481019 481622 472245 472335 468723 470916 475650 489704 498624 495611 492981
32502 492981 499676 500791 499344 494903 494225 484789 482484 486899 491106 493915 491922 502340 500417 501552
32488 501552 503474 505909 507402 499614 500230 498165 495741 499735 509178 510502 510608 521989 518214 516733
32474 516733 524550 533224 533659 540156 537217 529955 521917 520576 520076 520423 519715 519581 522017 533175 534703
32459 534703 534209 536800 535777 537865 536197 524027 522354 520724 522644 520142 521563 523869 518306 525441
32445 525441 539162 542172 537602 531261 544036 550146 551599 555538 550866 550339 550761 551098 553917 547014
32431 547014 546956 552553 553589 548873 554300 563766 564754 551646 541330 537507 531749 539697 551670 548026
32417 548026 545835 551037 555106 557951 572842 569209 565677 562024 562341 568960 569429 564024 558472 555538
32403 555538 563039 573877 580865 582062 580065 581973 584078 578890 576491 567080 569139 581384 579016 578694
32389 578694 571961 559994 558403 560678 571764 578957 578341 575747 572368 572374 574010 571932 579304 585976 590101
32374 590101 592943 594043 591211 580790 572093 574343 576416 575741 583384 587564 596855 597799 599392 593389
32360 593389 592926 602346 599459 584830 583855 590752 602775 604541 591585 589348 587437 585080 596138 606727
32346 606727 604399 602738 600567 597810 602883 607621 599086 593724 601211 602072 603638 607272 611320 602836
32332 602836 594329 600425 602231 590715 594985 595649 592008 588245 602040 619956 621513 623897 617729 621210
32318 621210 619617 624276 624980 614157 600438 600430 616176 615290 617794 615191 613111 610046 600870 584388
32304 584388 587027 599804 610443 613504 618402 616857 618579 633940 635250 630251 622534 610918 606380
32291 606380 606826 620472 622813 621395 620142 611248 604670 616443 614184 612967 613003 615582 625597 624652
32277 624652 622316 629269 633241 634723 631598 636295 638462 629343 615354 614601 619879 619467 617306 625900
32263 625900 632583 632414 620586 616748 623099 616361 609463 606780 611973 619150 622600 625169 625978 630203
32249 630203 630306 629620 622528 621327 617674 617669 625869 625635 628416 634411 632108 634160 634825 636529 626853 614897
32233 614897 620767 629511 629487 630349 637922 636866 634598 626669 618306 619358 619588 625488 631912 632732 629546
32218 629546 630192 634768 628675 627769 627745 626518 637019 643475 641790 638599 643303 647181 643234 635962 631213
32203 631213 627451 628979 633296 631465 622756 627072 616698 620631 625651 625584 627027 628696 628133 632471 630480
32188 630480 626171 624241 626167 626388 628197 630471 626338 622390 635215 641277 630819 631021 642163 642656
32174 642656 640564 640095 641293 651070 645013 639185 630139 630846 636950 641298 639848 635476 651879 649771
32160 649771 635912 632411 637705 640670 632431 630879 627324 627750 629166 632583 636693 635408 631408 627750
32146 627750 641317 649836 642972 649330 644117 640590 641930 652035 646307 644879 645583 643563 648253 651389
32132 651389 650867 651324 652154 645215 641711 639293 633511 642525 645434 647952 649956 638308 644936 646700 644931
32117 644931 653864 653528 645694 644155 644822 643376 644267 649556 648082 651045 656573 644062 647959 656439 653027
32102 653027 645769 653584 650422 655951 655900 649309 649796 653456 658323 653486 641245 635080 636382 643953 650182
32087 650182 654896 652472 647566 643270 633363 630164 631213 632032 640132 639919 635645 634464 644898 650916
32073 650916 648575 639951 637278 644855 643028 645852 646034 650706 657116 658906 665118 663382 659093 658243 652729
32058 652729 642101 642790 642785 650213 659941 655727 658923 656558 649326 648540 653640 654761 649601 645074 646053
32043 646053 646911 650311 658277 660831 655438 654111 647094 638823 634780 646302 647327 646721 650027 647678
32029 647678 649407 645124 638640 638630 639282 637190 642344 646689 651266 645899 637968 642069 639036 647459 664789
32014 664789 657627 652809 663762 658296 652743 653133 657397 667325 660983 648962 648641 656511 659026 654491
32000 654491 648046 648005 643822 636857 648202 646283 645877 659862 650449 641029 646060 641689 643577 650456
31986 650456 653835 645509 653920 656335 656882 650202 649152 646452 650257 656180 650675 648115 644718 647710
31972 647710 642603 631397 625398 622217 624240 638860 642324 651485 646042 636236 633694 636089 641188 653478
31958 653478 655164 648807 638281 633682 632012 630710 634846 646695 651500 647577 645013 652265 663174
31945 663174 659413 654363 652307 653361 656153 653509 645313 644029 647436 652996 653729 649221 646540 645276
31931 645276 650144 653648 648600 642315 644896 636421 642173 640982 638958 645103 644808 650393 651408 662987
31917 662987 670991 665831 652880 647108 643599 640435 648455 645994 653322 657845 649380 655255 661099 651499
31903 651499 639529 643314 642405 650139 648841 644913 652280 655987 655133 659575 650798 648722 660849 669523
31889 669523 663253 648900 649074 646941 641452 647903 651454 656941 666733 663216 666191 667123 673139 674946
31875 674946 664137 648944 644309 654749 653498 656675 657333 658602 664376 654210 646745 656136 658462
31862 658462 664193 669513 666774 658717 657607 667105 673049 666573 664778 661944 658458 651189 640062 641699
31848 641699 647828 647717 646555 642550 647729 656678 664203 660193 655085 657505 665702 666437 661754 663785 667033
$$ [...]
##END NTUPLES=NMR SPECTRUM
##END=
