##TITLE=316673	mo 07768	444/76	adrs	howarde
##JCAMPDX= 6.0         $$ Bruker NMR JCAMP-DX V2.0
##DATA TYPE= NMR SPECTRUM
##DATA CLASS= NTUPLES
##ORIGIN= Bruker BioSpin GmbH
##OWNER= nmr
$$ XWIN-NMR		Version 3.5
$$ Tue Jul 11 13:22:24 2006 GMT Daylight Time (UT+1h)  MAYBRIDGE\nmr@NMR_250MHZ
##.OBSERVE FREQUENCY= 250.131544655141
##.OBSERVE NUCLEUS= ^1H
##.ACQUISITION MODE= SIMULTANEOUS (DQD)
##.ACQUISITION SCHEME= undefined
##.AVERAGES= 16
##.DIGITISER RES= 18
##SPECTROMETER/DATA SYSTEM= dpx250
##.PULSE SEQUENCE= zg30
##.SOLVENT NAME= CDCl3
##.SHIFT REFERENCE= (INTERNAL, CDCl3, 0, 16.522)
##AUDIT TRAIL= $$ (NUMBER, WHEN, WHO, WHERE, WHAT)
$$ ##TITLE= Audit trail, XWIN-NMR		Version 3.5
$$ ##JCAMPDX= 5.01
$$ ##ORIGIN= Bruker BioSpin GmbH
$$ ##OWNER= nmr
$$ C:/u/data/dgb/nmr/ADRS/15100/pdata/1/auditp.txt
$$ ##AUDIT TRAIL=  $$ (NUMBER, WHEN, WHO, WHERE, WHAT)
(   1,<2006-01-24 09:07:58.69 +000>,<MAYBRIDGE\nmr>,<NMR_250MHZ>,
      <created by zg, POWCHK disabled, PULCHK disabled
       configuration hash MD5:
       62 19 C7 07 E1 42 D1 B7 37 6C 3D D0 77 39 F9 E6
       data hash MD5: 64K
       C3 E4 BC 4D 66 6F 80 B0 5C 13 9C DC FF 07 64 6F>)
(   2,<2006-01-24 09:08:07.36 +000>,<MAYBRIDGE\nmr>,<NMR_250MHZ>,
      <Start of raw data processing
       ef LB = 0.3 FT_mod = 6 PKNL = 1 SI = 32K 
       data hash MD5: 32K
       16 09 C0 48 73 8C F9 65 B0 9E FC E3 82 83 7F 03>)
(   3,<2006-01-24 09:08:09.72 +000>,<MAYBRIDGE\nmr>,<NMR_250MHZ>,
      <apk 
       data hash MD5: 32K
       B7 7B B1 1A 0F 68 43 42 01 9D 34 8C 2A E9 56 F4>)
(   4,<2006-01-24 09:08:14.48 +000>,<MAYBRIDGE\nmr>,<NMR_250MHZ>,
      <abs ABSG = 5 
       data hash MD5: 32K
       1D 49 39 B0 2D A5 3E 36 EF 9C FD 59 E5 6C 3B E9>)
$$ ##END=
$$ 
$$ hash MD5
$$ 77 F7 5A A0 18 6B BF 92 5F 22 49 D7 67 6B AD B5
##$RELAX= 
##$RELAX= 
##$RELAX= 
##$RELAX= 
##$RELAX= 
##$RELAX= 
##$RELAX= 
$$ Bruker specific parameters
$$ --------------------------
##$DU= <C:\Restored>
##$EXPNO= 15100
##$NAME= <ADRS>
##$PROCNO= 1
##$TYPE= <nmr>
##$USER= <dgb>
##$AMP= (0..31)
100 100 100 100 100 100 100 100 100 100 100 100 100 100 100 100 100 100 
100 100 100 100 100 100 100 100 100 100 100 100 100 100 
##$AQSEQ= 0
##$AQ_mod= 3
##$AUNM= <au_zg>
##$AUTOPOS= <9 >
##$BF1= 250.13
##$BF2= 250.13
##$BF3= 250.13
##$BF4= 250.13
##$BF5= 500.13
##$BF6= 500.13
##$BF7= 500.13
##$BF8= 500.13
##$BYTORDA= 1
##$CFDGTYP= 0
##$CFRGTYP= 5
##$CHEMSTR= <none>
##$CNST= (0..31)
1 1 145 1 1 1 1 1 1 1 1 1 1 1 1 1 1 1 1 1 1 1 1 1 1 1 1 1 1 1 1 1 
##$CPDPRG= <>
##$CPDPRG1= <>
##$CPDPRG2= <>
##$CPDPRG3= <>
##$CPDPRG4= <mlev>
##$CPDPRG5= <mlev>
##$CPDPRG6= <mlev>
##$CPDPRG7= <mlev>
##$CPDPRG8= <mlev>
##$CPDPRGB= <>
##$CPDPRGT= <>
##$D= (0..31)
0 1 0 0 0 0 0 0 0 0.06 0 0 0 0 0 0 0.0002 0 0 0 0 0 0 0 0 0 0 0 0 0 0 
0 
##$DATE= 1138093676
##$DBL= (0..7)
120 120 120 120 120 120 120 120 
##$DBP= (0..7)
150 150 150 150 150 150 150 150 
##$DBP07= 0
##$DBPNAM0= <>
##$DBPNAM1= <>
##$DBPNAM2= <>
##$DBPNAM3= <>
##$DBPNAM4= <>
##$DBPNAM5= <>
$$ [...]
##$SUBNAM7= <"">
##$SUBNAM8= <"">
##$SUBNAM9= <"">
##$SW= 20.6930455092707
##$SWIBOX= (0..15)
0 0 3 0 0 0 0 0 0 0 0 0 0 0 0 0 
##$SW_h= 5175.983436853
##$TD= 65536
##$TD0= 1
##$TE= 294.16
##$TE2= 300
##$TE3= 300
##$TEG= 300
##$TL= (0..7)
0 120 120 120 120 120 120 120 
##$TP= (0..7)
150 150 150 150 150 150 150 150 
##$TP07= 0
##$TPNAME0= <>
##$TPNAME1= <>
##$TPNAME2= <>
##$TPNAME3= <>
##$TPNAME4= <>
##$TPNAME5= <>
##$TPNAME6= <>
##$TPNAME7= <>
##$TPOAL= (0..7)
0.5 0.5 0.5 0.5 0.5 0.5 0.5 0.5 
##$TPOFFS= (0..7)
0 0 0 0 0 0 0 0 
##$TUNHIN= 0
##$TUNHOUT= 0
##$TUNXOUT= 0
##$USERA1= <user>
##$USERA2= <user>
##$USERA3= <user>
##$USERA4= <user>
##$USERA5= <user>
##$V9= 5
##$VALIST= <valist>
##$VCLIST= <CCCCCCCCCCCCCCC>
##$VD= 0
##$VDLIST= <DDDDDDDDDDDDDDD>
##$VPLIST= <PPPPPPPPPPPPPPP>
##$VTLIST= <TTTTTTTTTTTTTTT>
##$WBST= 1024
##$WBSW= 4
##$XGAIN= (0..3)
0 0 0 0 
##$XL= 0
##$YL= 0
##$YMAX_a= 536276
##$YMIN_a= -595771
##$ZGOPTNS= <>
##$ZL1= 120
##$ZL2= 120
##$ZL3= 120
##$ZL4= 120
##$ABSF1= 16.522
##$ABSF2= -4.171173
##$ABSG= 5
##$ABSL= 3
##$ALPHA= 0
##$AQORDER= 0
##$ASSFAC= 0
##$ASSFACI= 0
##$ASSFACX= 0
##$ASSWID= 0
##$AUNMP= <proc_1d>
##$AZFE= 0.1
##$AZFW= 0.1
##$BCFW= 0
##$BC_mod= 0
##$BYTORDP= 0
##$COROFFS= 0
##$CY= 12.5
##$DATMOD= 1
##$DC= 0
##$DFILT= <>
##$DTYPP= 0
##$F1P= 14.0000005364418
##$F2P= -0.99999901652339
##$FCOR= 0.5
##$FTSIZE= 32768
##$FT_mod= 6
##$GAMMA= 0
##$GB= 0
##$INTBC= 1
##$INTSCL= 1
##$ISEN= 128
##$LB= 0.3
##$LEV0= 0
##$LPBIN= 0
##$MAXI= 10000
##$MC2= 0
##$MEAN= 0
##$ME_mod= 0
##$MI= 0
##$NCOEF= 0
##$NC_proc= -3
##$NLEV= 6
##$NOISF1= 0
##$NOISF2= 0
##$NSP= 0
##$NTH_PI= 0
##$NZP= 0
##$OFFSET= 16.522
##$PC= 1
##$PHC0= 241.0387
##$PHC1= 4.957094
##$PH_mod= 1
##$PKNL= yes
##$PPARMOD= 0
##$PSCAL= 4
##$PSIGN= 0
##$REVERSE= no
##$SF= 250.13
##$SI= 32768
##$SIGF1= 0
##$SIGF2= 0
##$SINO= 400
##$SIOLD= 32768
##$SREGLST= <1H.CDCl3>
##$SSB= 0
##$STSI= 32768
##$STSR= 0
##$SW_p= 5175.98343685301
##$SYMM= 0
##$S_DEV= 0
##$TDeff= 65536
##$TDoff= 0
##$TI= <Analysis number 999999
Compound Code 99
Book Reference 9
Project Code 9>
##$TILT= no
##$TM1= 0
##$TM2= 0
##$TOPLEV= 0
##$USERP1= <user>
##$USERP2= <user>
##$USERP3= <user>
##$USERP4= <user>
##$USERP5= <user>
##$WDW= 1
##$XDIM= 32768
##$YMAX_p= 430089764
##$YMIN_p= -115901
$$ End of Bruker specific parameters
$$ ---------------------------------
##NTUPLES= NMR SPECTRUM
##VAR_NAME=  FREQUENCY,     SPECTRUM/REAL,   SPECTRUM/IMAG
##SYMBOL=    X,             R,               I
##VAR_TYPE=  INDEPENDENT,   DEPENDENT,       DEPENDENT
##VAR_FORM=  AFFN,          ASDF,            ASDF
##VAR_DIM=   32768,         32768,           32768
##UNITS=     HZ,            ARBITRARY UNITS, ARBITRARY UNITS
##FACTOR=    0.157963299565203, 1,           1
##FIRST=     4132.6476996994, 0,             0
##LAST=      -1043.33573715361, 0,           0
##MIN=       -1043.33573715361, -115901,     0
##MAX=       4132.6476996994, 430089764,     0
$$ Real data points
##PAGE= N=1
##DATA TABLE= (X++(R..R)), XYDATA
$$ [...]
20369E3120j9812K321J059q466k6701j0823K6552J5806r029j184j2532j6989J4531
$$ 53120 33308 35629 36688 28222 1521 -9302 17250 33056 24027 22843 10311 -6678 7853
20356G853J6892q810l253n381j2163N417K0390j723j5632Q594L03j992o752K211
$$ 7853 24745 15935 12682 7301 -4862 555 20945 19222 3590 12184 12487 10495 3743 5954
20342E954k10R969j950r613P398K1312N050j1120j833j0797o420J1733K016q461
$$ 5954 5744 15713 13763 4150 11548 32860 37910 26790 24957 14160 7740 19473 21489 13028
20328A3028r062j0407M675J541k829k776M069N740K13q902J4535J0657P051j4264
$$ 13028 3966 -6441 -1766 -225 -3054 -5830 -1761 3979 4192 -4710 9825 20482 27533 13269
20314A3269p413p508R059J0751R05l0834J265K1390J3235k1295R98P605j198P644
$$ 13269 5856 -1652 7407 18158 19063 -11771 -10506 10884 24119 2824 3822 11427 10229 17873
20300A7873j681J3702l510j8237J2368O014j9074p633R999J2162J2836K0547j3110
$$ 17873 16192 29894 26384 8147 20515 26529 7455 -178 9821 21983 34819 55366 42256
20287D2256j9777L677j0682p306J4203L418j0620m594J0265J1956L250j286m516
$$ 42256 22479 26156 15474 8168 22371 25789 15169 10575 20840 32796 36046 34760 30244
20274C0244p478o957j429K7625j5247j9735j833R55N959P189O277p019K714J3496
$$ 30244 22766 15809 14380 42005 26758 7023 5190 6145 12104 19293 25570 18551 21265 34761
20260C4761j2590N903J5355q56m532J2260J8965J749o312j3750j2016L625o336
$$ 34761 22171 28074 43429 42573 38041 50301 69266 71015 64703 50953 38937 42562 36226
20247C6226K925k3391k1345M793J5446J8376J4913M548O88j2485q862m754N61
$$ 36226 39151 15760 -5585 -792 14654 33030 47943 52491 53179 40694 31832 27078 27639
20234B7639J1937p447j4901R14J6076J1513j3104n253j3856o518J576k564j8285
$$ 27639 39576 32129 17228 18142 34218 45731 32627 27374 13518 7000 8576 6012 -12273
20221a2273J6473K4182R462P554J24j2766k7054m860M477J6210l894k6161n361
$$ -12273 4200 28382 37844 45398 45522 32756 5702 842 5319 21529 17635 -8526 -13887
20208a3887K1201Q073J2979M584J0946o612r286m430J352O912J0366j0060j9410
$$ -13887 7314 15387 28366 32950 43896 37284 27998 23568 24920 31832 42198 32138 12728
20195A2728p424K2964J7821o706l567K362j0316m923m935n017R641K2670M257
$$ 12728 5304 28268 46089 39383 35816 38178 27862 22939 18004 12987 22628 45298 49555
20182D9555j3494Q263R30l463J5595r582k8862j6066O386J1835j8491O20J3821
$$ 49555 36061 44324 45254 41791 57386 47804 18942 2876 9262 21097 2606 3226 17047
20169A7047K990n670L172J5745J664j816j5062k2564N875J0767P66K365L688O702
$$ 17047 20037 14367 17539 33284 34948 33132 18070 -4494 1381 12148 12914 15279 18967 25669
20155B5669P730P68M646J4169o395r915p509K0020L006r792M596J8615j7100j5684
$$ 25669 33399 34167 38813 52982 46587 36672 29163 49183 52189 42397 46993 65608 48508 32824
20141C2824J50L227p858q321N551J9948L415j2431o206p340J7892n297j411j798
$$ 32824 32974 36201 28343 20022 25573 45521 48936 36505 30299 22959 40851 35554 34143 32345
20127C2345J0788L113k977M088J2850P873m884k347j9932l9341O957J6604L039
$$ 32345 43133 46246 43269 47357 60207 68080 63196 60849 40917 1576 8533 25137 28176
20114B8176J302N829n232M911R568L179r543j7482J519j6233k811L0081J6881
$$ 28176 29478 35307 30075 34986 44554 47733 38190 20708 22227 5994 3183 33264 50145
20101E0145j5266k3502J6523J0447N767k5714P761j718j1518R397K0426M354Q65
$$ 50145 34879 11377 27900 38347 44114 18400 26161 24443 12925 22322 42748 47102 47967
20088D7967m534J165r034m536p518J8387J999j0354j04n062m547L321j1341j1390
$$ 47967 43433 44598 35564 31028 23510 41897 43896 33542 33438 28376 23829 27150 15809 4419
20074D419n038J6100M954j0119K847J4087K3600j2334j8132L996J9953j338j8585
$$ 4419 -619 15481 20435 10316 13163 27250 50850 38516 20384 24380 44333 42995 24410
20061B4410r705Q133O848J4755p62j7625P855O638k2443j7220K406n354l75r967
$$ 24410 14705 22838 29686 44441 43679 26054 33909 40547 18104 884 3290 -2064 -2439 -12406
20047a2406j807j362M2123K9752J7739q489J322r781j9701m582q286j068l354
$$ -12406 -14213 -15575 26548 56300 74039 65550 66872 57091 37390 32808 24522 23454 20100
20034B0100J6535K299O941L057j7028J6598J9565o282l177j223o440k2126r133
$$ 20100 36635 38934 45875 48932 31904 48502 68067 61785 58608 57385 50945 28819 19686
20021A9686O843J0524j1091j732R439J9864m870L167o586j638L88j938J0294J58
$$ 19686 26529 37053 25962 24230 33669 53533 48663 51830 45244 43606 43994 42056 52350 52508
20007E2508N327j4115k043Q406P022r232j0280k937j2946j0132J2911J3442L995
$$ 52508 57835 43720 41677 50083 57105 47873 37593 34656 21710 11578 24489 37931 41926
19994D1926k664Q160Q273l067j1079J165q907q594l191r076k631o686Q340J4824
$$ 41926 39262 47422 55695 52628 41549 42714 33807 25213 22022 12946 10315 3629 11969 26793
19980B6793J749J07R855M983r804r495K6161n956k465J1777j7348k6198n415J8597
$$ 26793 28542 28649 38504 43487 33683 24188 50349 44393 41928 53705 36357 10159 4744 23341
19966B3341n507p65Q386P274p517J1820n354k7784j3114r22p187K9212K8152R285
$$ 23341 17834 17069 25455 32729 25212 37032 31678 3894 -9220 -10142 -17329 11883 40035 49320
19952D9320j2756m087m509p992o161J7717L305k1867J9501J41j3801j6745n129
$$ 49320 36564 32477 27968 19976 13815 31532 34837 12970 32471 32612 18811 2066 -3063
19939c063q903K7342K0491k739J0669l2p844J7684Q249l80j4373j0726j8106J4702
$$ -3063 -11966 15376 35867 33128 43797 43765 35921 53605 61854 61474 47101 36375 18269 32971
19925C2971J0723j196L166l487l230j3302j1552J6719j246k7158J9491K641L751
$$ 32971 43694 42498 45664 42177 38947 25645 14093 30812 29566 2408 21899 24540 28291
19912B8291p888M383K5373P432n720r977j050J98j032l604j6757N950m286j3893
$$ 28291 20403 24786 50159 57591 51871 41894 40844 41042 40010 36406 19649 25599 21313 7420
19898G420j2498p52J1107J7866P413N467M095q041q87j0734P605J2420K283q036
$$ 7420 -5078 -5830 5277 23143 30556 36023 40118 32077 31190 20456 28061 40481 42764 34728
19884C4728J0508m404q649j797J1377J2701n505k217K02n078J228n898j7654l367
$$ 34728 45236 40832 32183 30386 41763 54464 48959 46742 46944 41866 43094 37196 19542 16175
19870A6175L892Q727k601R424m424j1499j9740O592J1296J6958J1384l030K5455
$$ 16175 20067 28794 26193 35617 31193 19694 -46 6546 17842 34800 46184 43154 68609
19857F8609P305j5157j698m679K154j2707N170N514J9064j6764j8282k1525L713
$$ 68609 75914 60757 59059 54380 56534 43827 48997 54511 73575 56811 38529 17004 20717
19844B0717L217Q479J926q593j2180l460M093j0686j899J3894J0881m596J5182
$$ 20717 23934 32413 34339 25746 13566 10106 14199 3513 1614 15508 26389 21793 36975
19831C6975p715R92J93Q62J1301n826r804O213J3359k0075J208J7521M202j245
$$ 36975 29260 30252 30445 31307 42608 36782 26978 33191 46550 26475 27683 45204 49406 48161
19817D8161K390m592N598J232q87J541r086m961J7688M446J5176r557n368m127
$$ 48161 50551 45959 51557 52789 51902 53443 44357 39396 57084 61530 76706 67149 61781 57654
19803E7654l774m381J0567r7N737J3749k937j9389p724j991q100J0491R296j4399
$$ 57654 53880 49499 60066 59969 65706 79455 76518 57129 49405 47414 39314 49805 59101 44702
19789D4702J01q374M63q361K989J9955N340K376k1631j0554o191J753K1123J223
$$ 44702 44803 36429 36892 28531 31520 51475 56815 59191 37560 27006 20815 22568 43691 44914
19775D4914K1651O776o511k974J869k632o157J980k57j2339J4466j229j0623R672
$$ 44914 66565 73341 66830 63856 65725 63093 56936 58916 58659 46320 60786 59557 48934 58606
19761E8606q292N317Q43j1202R062J0947O850l948j474l948Q817j0200j1286q689
$$ 58606 50314 55631 56474 45272 54334 65281 72131 68183 66709 62761 71578 61378 50092 41403
19747D1403O304O573l779j0288J85j2622j2560j041J6573l089Q186K8821k768
$$ 41403 47707 54280 50501 40213 40398 27776 15216 14175 30748 27659 35845 64666 61898
19734F1898j0829P234K0695J7592k2449k6621J2039J6849o929k2986j5345j2715
$$ 61898 51069 58303 78998 96590 74141 47520 59559 76408 69479 46493 31148 18433
19722A8433o942K8605O132J876P969k576j0198m773j2280K014n383q567J3576
$$ 18433 11491 40096 46228 48104 56073 53497 43299 38526 26246 28260 22877 14310 27886
19709B7886P474J0127L789J8648r461o625j892k231J0875J0765M694j6264o883
$$ 27886 35360 45487 49276 67924 58463 51838 49946 47715 58590 69355 74049 57785 50902
19696E0902P346K110l2212j3705jm607R446L5406J6205m02o540M641J3868n06
$$ 50902 58248 60358 28146 14441 14440 9833 19279 54685 70890 70488 63948 68589 82457 81951
19682H1951k0161L19M10m684K2064n02l328l558L458k6534k0502q070J7855L411
$$ 81951 61790 62109 62519 57835 79899 79397 76069 72511 75969 49435 28933 20863 38718 42129
19668D2129J4729K627o033k510j016R3K900k652k880J0800Q365P652n244j8045
$$ 42129 56858 59485 53452 50942 49926 50019 52919 50267 47387 58187 66552 74204 68960 50915
19654E0915q704O421N968J364k843O512N87L861L400N722j8691k5919M202J3557
$$ 50915 42211 48632 54600 55964 53121 59633 60220 64081 67481 73203 54512 28593 32795 46352
19640D6352Q525J9539k427O00p718o26K853r578j663j0369o606J3145K8808k9088
$$ 46352 54877 74416 71989 72589 64871 64245 67098 57520 55857 45488 38882 52027 80835 51747
19626E1747j8400L402J6462p531m245K6644o705k729J131k0029k615M930l265
$$ 51747 33347 36749 53211 45680 41435 68079 61374 58645 59776 39747 37132 42062 38797
19613C8797J7382L0488m95p625J1737J8801K2776k152n550j9316j1365p619J9657
$$ 38797 56179 86667 86172 78547 90284 109085 131861 129709 124159 104843 93478 85859 105516
19600A05516r034l1093m974J2703J2709j1517j3821k91l422L766Q840R406j0707
$$ 105516 96482 65389 60415 73118 85827 74310 60489 60198 56776 60542 69382 78788 68081
19587F8081m209J6067j3887j4577J2526p519K144j568J0208J0589j0175J3822
$$ 68081 63872 79939 66052 51475 64001 56482 58626 57058 67266 77855 67680 81502
19575H1502j2309n161l554P415J1984O26r544k931K1079L0317N832n890M841p280
$$ 81502 69193 64032 60478 67893 79877 80503 70959 68028 89107 119424 125256 119366 124207 116927
19561A16927j2578j3314R949R505j5774J2102J0723N131J2313M377j8795m260
$$ 116927 104349 91035 100984 110489 94715 106817 117540 122671 134984 139361 120566 116306
19549A16306k5742n902J6008M725l341k7560p84k043l64K06m778K0204Q851j9782
$$ 116306 90564 84662 100670 105395 102054 74494 73710 71667 71303 71509 66731 86935 95786 76004
19535G6004m621q004O519j0515n286M237K1852J3947P859Q411j7993j3029j6239
$$ 76004 71383 63379 69898 59383 54097 58334 80186 94133 101992 110403 92410 79381 63142
19522F3142l327N616J5177K3260j71j2412j1518J799J1210L774J9658q415j8531
$$ 63142 59815 65431 80608 103868 103697 91285 79767 81566 92776 96550 116208 107793 89262
19509H9262m264j0257M785k811J027J5490K2679j388p894L12l687j8639p645r748
$$ 89262 84998 74741 79526 76715 77742 93232 115911 114523 106629 106941 103254 84615 76970 67222
19495F7222P794K5237J2271j0333j6930q615N9J1091L765K3026j2796j2644J0508
$$ 67222 75016 100253 112524 102191 85261 76646 76705 87796 91561 114587 101791 89147 99655
19482I9655l970o445k7248P016K0036J3020K871k846p128k5252k4702N966J5229
$$ 99655 95685 89240 61992 69008 89044 102064 104935 102089 94961 69709 45007 50973 66202
19469F6202m233p541R840J2849M407K3238k458j2095n01n747m941j325J3849L780
$$ 66202 61969 54428 64268 77117 81524 104762 102304 90209 89708 83961 79020 77695 91544 95324
19455I5324Q202r566N153o870j0154m817q89J2676L566j1798o849J0243o000J0693
$$ 95324 103526 93960 99113 92243 82089 77272 76383 89059 92625 80827 73978 84221 78221 88914
19441H8914J0587k319j1614L113k2052q060K062K0084R686m566M556O615J6000
$$ 88914 99501 97182 85568 88681 66629 58569 60631 80715 90401 85835 90391 97006 113006
19428A13006j4075R387l6L829J2216J5061J3989n802j9579j5264J7935K1465K1851
$$ 113006 98931 108318 108282 112111 124327 139388 153377 147575 127996 112732 130667 152132 173983
19415A73983m828n97J4720K1775K0022L7609M3198M5217N7595M4075J8337K9122
$$ 173983 169155 168558 183278 205053 225075 262684 305882 351099 408694 452769 471106 500228
19403E00228K8226K152k1471j704r151P763o060m576J0404K4492K8658K1218M83
$$ 500228 528454 530606 509135 507431 498280 506043 499983 495407 505811 530303 558961 580179 580662
19390E80662K8275L6479J5259j7988k8451j6820k8623l1477n3779l9874n6511
$$ 580662 608937 645416 660675 642687 614236 597416 568793 537316 483537 443663 387152
19379C87152m3827l9264k3072l9744k1584r55R626m971k234j1725p24m032k080
$$ 387152 343325 304061 280989 241245 219661 218706 228332 223361 221127 209402 208678 204646 202566
19366B02566J5526J6398R223M033J5596J2843O537J4764L7213J6365J3600K0685
$$ 202566 218092 234490 243713 247746 263342 276185 282722 297486 334699 351064 364664 385349
19354C85349L8257N2336O8511M2251N0339M0752M8704M9741K0847J003o281j3512
$$ 385349 423606 475942 544453 586704 637043 677795 726499 776240 797087 798090 791809 778297
19342G78297k3558K342K183k7885k6473k3598l0333n1971m3798m2226m5284l8908
$$ 778297 754739 757081 759264 731379 704906 681308 650975 599004 555206 512980 467696 428788
19330D28788l5170k2074k7474j1586k7301j7449m654j6243l0455j1994k0980p420
$$ 428788 393618 371544 344070 332484 305183 287734 283080 266837 236382 224388 203408 195988
19318A95988l850m934m432K184p228n420k2816J6164K1747k1856o826J1998k764
$$ 195988 192138 187204 182772 184956 177728 172308 149492 165656 187403 165547 158721 170719 167955
19305A67955j9865k4465o296J0678j7001p64J0415J5739K4142P701j4131j480
$$ 167955 148090 123625 117329 128007 111006 110242 120657 136396 160538 168239 154108 152628
19293A52628R130k43Q54j1450n539j5826m469J7709L496M99N06R385J9550J3359
$$ 152628 161758 161515 162369 150919 145380 129554 125085 142794 146290 146789 147295 156680 176230 189589
19279A89589j9739o016j589k245k229K0963n606k1328L667N032o870o459J1985
$$ 189589 169850 163834 162245 160000 157771 178734 173128 151800 155467 160499 153629 147170 159155
19266A59155p74p736m439O224K2464N055J0398J7955o88M55J3036L361R206K0558
$$ 159155 158381 150645 146206 152430 174894 179949 190347 208302 207614 208069 221105 224466 233672 254230
19252B54230M5463K8459L1242K7216K8864K3641K5098K8844K3392N105J4075K933
$$ 254230 299693 328152 359394 386610 415474 439115 464213 493057 516449 521554 535629 538562
19240E38562M2117M1410K1067j973J5843o797k504O435l9372l0252j2808l0427
$$ 538562 580679 622089 643156 641183 657026 650229 647725 654160 614788 584536 571728 541301
19228E41301k9399l1121l6156k6224l558j1898j1667q055k2582m3359k5606O820
$$ 541301 511902 480781 444625 418401 414843 402945 391278 383223 360641 317282 291676 298496
19216B98496o191j6723J5125L783k3571K008k359R136j5621J4434L1027J9311
$$ 298496 292305 275582 290707 294490 270919 272927 270568 279704 264083 278517 309544 328855
19204C28855R381L718L0648L0453N0833L1996L2426K6442K1020M0149L0367J7865
$$ 328855 338236 341954 372602 403055 453888 485884 518310 544752 565772 605921 636288 654153
19192F54153M5879K8516J4133K826P197J4111k495O177m935K541J1962j3679L85
$$ 654153 700032 728548 742681 745507 752704 766815 764320 770497 765562 768103 780065 766386 766771
19179G66771q763R342j9055m2043l6049l3265k3508m2172l3754m3833l9022l9952
$$ 766771 758008 767350 748295 706252 670203 636938 613430 571258 537504 493671 454649 414697
19167D14697k1623k8642l0158l8880j4568j3242j0491J742j4644j2049J7601L741
$$ 414697 393074 364432 334274 295394 280826 267584 257093 258835 244191 232142 249743 253484
19155B53484o426k7276L0r733J4939J6114J734j3787J0479N119Q854p69k83J4701
$$ 253484 247058 219782 219812 210079 225018 241132 242866 229079 239558 244677 253531 252762 252479 267180
19141B67180J9718m013L891m168l420n816M773j505J5770Q128p382j6263J2625
$$ 267180 286898 282885 286776 282608 279188 273372 278145 276640 292410 300538 293156 276893 289518
19128B89518O639O610J7843k0986r632o484J850J4731r063O019L965K615j1103
$$ 289518 296157 302767 320610 299624 289992 283508 285358 300089 291026 297045 301010 303625 292522
19115B92522o709J5J6373J8397r82k4432K143j8922j1056K7355J8798r669P397
$$ 292522 285813 285828 302201 320598 319616 295184 297327 278405 267349 294704 313502 303833 311230
19102C11230J0112r448N68O327M511L625j735k7609k218O394o538J5365l909k723
$$ 311230 321342 311894 312462 318789 323300 326925 325190 297581 295363 301757 295219 310584 306675 303952
19088C03952J933N197K8287M0567r19k589p819k1757j2321N084k5485j4636Q695
$$ 303952 305885 311082 339369 379936 379017 376428 368609 346852 334531 339615 314130 299494 308189
19075C08189J1439Q257o142j4837j6577J491J9001r11m611K273M860J211j0804
$$ 308189 319628 327885 321743 306906 290329 291820 310821 309910 305299 307572 312432 313643 302839
19062C02839N489j2693k782K7781K0857J1887K353l1607j9799o284l187K2079
$$ 302839 308328 295635 292853 320634 341491 353378 355731 324124 304325 298041 294854 316933
19050C16933K9843L557J3965k274k467k114K622J3844J9799M766j7583j8151R785
$$ 316933 346776 350333 364298 362024 359557 357443 360065 373909 393708 398474 380891 362740 372525
19037C72525L0558L558j6992j6777K147K0604R451p366j1333J9924K00l066n335
$$ 372525 403083 406641 389649 372872 375019 395623 405074 397708 386375 406299 406499 403433 398098
19024C98098j3918O336j0071J550m827K598J26J0790M30p031M22O906K8623J0782
$$ 398098 384180 390516 380445 381995 377168 379766 379892 390682 391112 384081 384503 391409 420032 430814
19010D30814O152J0617K4327J8771L1306J0723J2665J8923l924L519j717j8047
$$ 430814 436966 447583 471910 490681 521987 532710 545375 564298 560374 563893 562176 544129
18998E44129l871r794j5643q349J6271Q270K052l523J7505K9613J0602Q37O333
$$ 544129 540258 530464 514821 506472 522743 531013 533065 529542 547047 576660 587262 588099 594432
18985E94432p045J8497Q714K1281k269J7767J7309J6963K310o895J4052K0382
$$ 594432 587387 605884 614598 635879 633610 651377 668686 685649 687959 681064 695116 715498
18973G15498K0306L505R428J4157K1284J4367q05M972L059K7583K0757J8537K2932
$$ 715498 735804 739309 748737 762894 784178 798545 797740 802712 805771 833354 854111 872648 895580
18960H95580J4464R335K2265J9815K5146O903K2558M3440J764L408Q665J659K9394
$$ 895580 910044 919379 941644 961459 986605 993508 1016066 1059506 1061270 1064678 1073343 1075002 1104396
18947A104396K3322L522j6629m480Q149J834j7367M825J9944J9175M0843K3353
$$ 1104396 1127718 1131240 1114611 1110131 1118280 1120114 1102747 1107572 1127516 1146691 1187534 1210887
18935A210887L080K9290J9972L3618N6331M9337M2339N7888O0165L4069N3925
$$ 1210887 1213967 1243257 1263229 1296847 1353178 1402515 1444854 1502742 1562907 1596976 1650901
18924A650901P1285N5182M8510N7363O1054P4690O6770Q9540R0389J15344J41250
$$ 1650901 1722186 1777368 1825878 1883241 1944295 2018985 2085755 2175295 2265684 2381028 2522278
18913B522278J61279J85249K03880K12820J94856K39963K66506L20285L92518
$$ 2522278 2683557 2868806 3072686 3285506 3480362 3720325 3986831 4307116 4699634
18904D699634M93162O18848P60989R14767J030128J174188J407333J587584J683914
$$ 4699634 5192796 5811644 6572633 7487400 8517528 9691716 11099049 12686633 14370547
18895A4370547J681522J877973K332414L080530L924752M754479N526559O301375
$$ 14370547 16052069 17930042 20262456 23342986 27267738 32022217 37548776 43850151
18887D3850151P659657R164446R564460P983135O288799O035472N513194K808180
$$ 43850151 51509808 60674254 70238714 78221849 84510648 90546120 96059314 98867494
18879I8867494j096509l028577l482231m352696o027529o625276n874364n044368
$$ 98867494 97770985 94742408 91260177 86907481 80879952 74254676 68380312 63335944
18871F3335944m987732m943321m320979l654735l553936l913564l949837l685223
$$ 63335944 58348212 53404891 49083912 45429177 41875241 37961677 34011840 30326617
18863C0326617l431526l243549k905953k436362j877006j399403r26854n18152
$$ 30326617 26895091 23651542 20745589 18309227 16432221 15032818 14105964 13587812
18855A3587812j75812J46188M70574Q74790J372913J995059K595499L163024L677045
$$ 13587812 13412000 13558188 14028762 14903552 16276465 18271524 20867023 24030047 27707092
18846B7707092M272565M992986N366544M964421M349802M450329M969540N244049
$$ 27707092 31979657 36972643 42339187 47303608 51653410 56103739 61073279 66317328
18838F6317328N499754O502200Q345819J0699918J2770683J4002259J4458363
$$ 66317328 71817082 78319282 86665101 97365019 110135702 124137961 138596324
18831A38596324J4801765J4554714J1618635O632511J947794j386479n477173
$$ 138596324 153398089 167952803 179571438 186203949 188151743 186765264 181288091
18824A81288091j0576189j4697442j6193110j6158236j5718113j5035802j3715048
$$ 181288091 170711902 156014460 139821350 123663114 107945001 92909199 79194151
18817G9194151j1585920r354452p742727o901439o103645n169661m481467m051660
$$ 79194151 67608231 58253779 50511052 43609613 37505968 32336307 27854840 23803180
18809B3803180l614228l058981k504626k012098j578575j177439r10704p40971
$$ 23803180 20188952 17129971 14625345 12613247 11034672 9857233 8946529 8205558
18801H205558n89422m78809m55421m38037l91638l79531l57597l60848l07025
$$ 8205558 7616136 7137327 6681906 6243869 5852231 5472700 5115103 4754255 4447230
18792D447230k45545k26722j91811j62995j66318j49588j15056j32176j33593
$$ 4447230 4201685 3974963 3783152 3620157 3453839 3304251 3189195 3057019 2923426
18783B923426r8069p3937r4471q9363n4924n5148m8238n2972k8060k3532k1161
$$ 2923426 2825357 2751420 2656949 2567586 2512662 2457514 2409276 2356304 2328244 2304712 2283551
18772B283551j0239K0001K3932L7382K4114N8498Q0913R8631J14024J20687R4211
$$ 2283551 2273312 2293313 2317245 2354627 2378741 2437239 2518152 2616783 2730807 2851494 2945705
18761B945705R7724J12485J33051J20413J39403K05276K35263K21303K48476K70927
$$ 2945705 3043429 3155914 3288965 3409378 3548781 3754057 3989320 4210623 4459099 4730026
18751D730026K68037K88609L25068L59512L81559M08179M68888N63595O33501
$$ 4730026 4998063 5286672 5611740 5971252 6352811 6760990 7229878 7793473 8426974
18742H426974P45115R37625J210262J496570J826718K215784K640017L058008
$$ 8426974 9172089 10109714 11319976 12816546 14643264 16859048 19499065 22557073
18734B2557073L425752L970634M752307N385589O226149P395183Q765237J0222086
$$ 22557073 25982825 29953459 34705766 40091355 46317504 53712687 62477924 72700010
18726G2700010J1359648J2444916J3352502J4004078J3883968J2129134R709846
$$ 72700010 84059658 96504574 109857076 123861154 137745122 149874256 159584102
18719A59584102Q076760N421257J562291k133705n321821p227726r586006j1731328
$$ 159584102 167660862 173082119 174644410 172510705 167188884 159961158 150375152 138643824
18711A38643824j1887672j1594956j1247241j0313692r332651q348875p202748
$$ 138643824 126756152 115161196 103913955 93600263 84267612 75918737 68715989
18704F8715989o315406n537351n251137n099001m660019m432945m295134l976281
$$ 68715989 62400583 56863232 51612095 46513094 41853075 37420130 33124996 29148715
18696B9148715l518227l067779k624475k155964j653428j134305o98997k48019
$$ 29148715 25630488 22562709 19938234 17782270 16128842 14994537 14295540 14047521
18688A4047521K05199N78251R70953J445907J902348K271934K576884K893183
$$ 14047521 14252720 14830971 15801924 17247831 19150179 21422113 23998997 26892180
18680B6892180L329352L401818L330137L603675M001482M399119M478453M486391
$$ 26892180 30221532 33623350 36953487 40557162 44558644 48957763 53436216 57922607
18672E7922607N079253N598945N134238M685815M460223M333559L088717N78517
$$ 57922607 63001860 68600805 73735043 78420858 82881081 87214640 90303357 90881874
18664I0881874o11685j511463k944417m831157o310000o531620o868134p315995
$$ 90881874 90270189 88758726 85814309 80983152 74673152 68141532 61273398 53957403
18656E3957403p022329o338672n715259n060653m372036l591102k952158k541451
$$ 53957403 46935074 40596402 34881143 29820490 25448454 21857352 18905194 16363743
18648A6363743k092091j736928j549116j362869j179648r99893q91949q11984
$$ 16363743 14271652 12534724 10985608 9622739 8443091 7443198 6551249 5739265
18640E739265o92016n54761m74949m07296l40232l12235k69132k49573k22985
$$ 5739265 5047249 4492488 4017539 3610243 3270011 2957776 2688644 2439071 2216086
18631B216086j96885j78109j46964j29610j07878j10359r4914o8951o7325q5144
$$ 2216086 2019201 1841092 1694128 1564518 1456640 1346281 1251367 1182416 1115091 1029947
18621A029947n8019j7710k6709l2934k0761m5331o2908l7653j9315J7198J5410
$$ 1029947 971928 954218 927509 894575 873814 828483 765575 727922 708607 725805 741215
18610G41215k489q963l883J9655k875K726L482m61j1269l3021l9460l5050k7691
$$ 741215 738726 729763 725880 745535 742660 745386 748868 748407 737138 704117 664657 629607 601916
18597F01916j5588j9684l2415l3138k8287j6389j5689j7861k2728j7414j4655
$$ 601916 586328 566644 534229 501091 472804 456415 440726 422865 400137 382723 368068
18586C68068j0287j6205R714J1019r870o712r66j7908l3409n2537j7713j7487
$$ 368068 357781 341576 351290 362309 352439 345727 344761 326853 293444 240907 223194 205707
18574B05707O451j658m0489m032J1091J0476k1111k5078Q260J7949J229M982N163
$$ 205707 212158 210500 170011 165979 177070 187546 166435 141357 149617 167566 168795 173777 178940
18561A78940m521j0157M806J8068J6799J2848P966L1053n539j1516P924J6628
$$ 178940 174419 164262 169068 187136 203935 216783 224749 255802 250263 238747 246671 263299
18549B63299J8132K4324J0476K6817j1259k0833K704K0010L1830J0030K4804J4569
$$ 263299 281431 305755 316231 343048 331789 310956 313660 333670 365500 375530 400334 414903
18537D14903M324P008N553J3730O818l089k3901Q111k670j7793j1361m0189l9172
$$ 414903 419227 426235 431788 445518 452336 449247 425346 433457 430787 412994 401633 361444 322272
18524C22272k0546k8824n1214l7504k5185k2936k1582k1913j09j467q847K627
$$ 322272 301726 272902 221688 184184 158999 136063 114481 92568 92459 90992 82145 84772
18512H4772j2765k2022j0497J5100p416j0099K588M504j0742p060R47J5081P775
$$ 84772 72007 49985 39488 54588 47172 37073 39661 44165 33423 26363 27310 42391 50166
18499E0166j1247J413J5439K4622J2031R860J5936P357p488J0909K4116P393M40
$$ 50166 38919 40332 55771 80393 92424 102284 118220 125577 118089 128998 153114 160507 160947
18486A60947j66K0072m79J457N130J6491J996j3177o793K70R385N240k1727k3109
$$ 160947 160781 180853 180374 181831 186961 203452 205448 192271 185478 185748 195133 200373 178646 155537
18472A55537j3854j7461k4328L251K976j5828j2117q558r160J1035r800r537j8492
$$ 155537 141683 124222 99894 103145 106121 90293 78176 69618 60458 71493 61693 52156 33664
18459C3664l758K345j5384j3180k2575L453l972Q689K1270M687n878k4221j0326
$$ 33664 29906 32251 16867 3687 -18888 -15435 -19407 -10718 10552 15239 9361 -14860 -25186
18446b5186L2411l035p528J0180j492o107j1356j8435p753J1944J1176L1043J6639
$$ -25186 7225 4190 -3338 6842 5350 -757 -12113 -30548 -38301 -26357 -15181 15862 32501
18433C2501r160j5067q492p017o15k791J518l367p7k318M96o286j4426K445k5709
$$ 32501 23341 8274 -218 -7235 -7850 -10641 -9123 -12490 -12567 -14885 -14389 -20675 -35101 -32656 -58365
18418e8365j129K7065J2467j5451R21K2724J0901l418q500k6594J9461K1500M0363
$$ -58365 -59494 -32429 -19962 -35413 -34492 -11768 -867 -4285 -12785 -39379 -19918 1582 41945
18405D1945l709k8056m618J411J297j7097m052O314K5631J9133K509N415J7484
$$ 41945 38236 10180 5562 6973 8270 -8827 -12879 -6565 19066 38199 40708 46123 63607
18392F3607M292j7933l323N547p335j4682Q929Q223m431N210k3612o528n436l366
$$ 63607 67899 49966 46643 52190 44855 30173 39102 47325 42894 48104 24492 17964 12528 9162
18378I162J7047j9968J4259K5054j5155j0904L729J1850K5373K4368Q704K8106
$$ 9162 26209 6241 20500 45554 30399 19495 23224 35074 60447 84815 93519 121625
18366A21625L0470M4060L6496N3805L8173M5349M4310M2245K5649N136L2405L7635
$$ 121625 152095 196155 232651 286456 324629 369978 414288 456533 482182 487318 519723 557358
18354E57358K0187J7099J4062J1377K8410L8451K1421N512N63m107k4448r242
$$ 557358 577545 594644 608706 620083 648493 686944 708365 713877 714440 710333 685885 676643
18342F76643n1141n6251m8465n6904m4820m2850j8009k0307k6971k5194k6807
$$ 676643 625502 569251 520786 463882 419062 376212 358203 337896 310925 285731 258924
18331B58924l5330k1980l2181k0069R489j9701k6587k3732k8042J1586P568j0653
$$ 258924 223594 201614 169433 149364 158853 139152 112565 88833 60791 72377 79945 69292
18319F9292j768Q627P080K9880M0491J5508K0107K5133L8016L5788M3664L1215
$$ 69292 67524 76151 83231 113111 153602 169110 189217 214350 252366 288154 331818 363033
18307C63033J9111L0257m20J5608J0236J1204K0629m016P009K500q71j9715k0455
$$ 363033 382144 412401 411981 427589 437825 449029 469658 465642 472651 475151 474280 454565 434110
18294D34110k4952p641j278j2314o991k1239k3465j4296k4131k1405j5490n1098
$$ 434110 409158 401517 400239 387925 380934 359695 336230 321934 297803 276398 260908 209810
18282B09810l8850m0304j2197m062q240j1254p516j7474j8698j1744L987k0626
$$ 209810 170960 130656 118459 114397 106157 94903 87387 69913 51215 39471 43458 22832
18270B2832r907J1851J6282k540j6666j5235l098j0497K311J7322j3659n670j0585
$$ 22832 12925 24776 41058 38518 21852 6617 3519 -6978 -4667 12655 -1004 -6674 -17259
18257a7259n918j3081J4938M980j0464J2324n769O431K592j4161j8370j6916R520
$$ -17259 -23177 -36258 -21320 -16340 -26804 -14480 -20249 -13818 -11226 -25387 -43757 -60673 -51153
18244e1153K5092M898Q222J7883P928M572j9102L146L0614N264k6135j2359J615
$$ -51153 -26061 -21163 -12941 4942 12870 17442 -1660 1486 32100 37364 11229 -1130 485
18231D85R202K2423J4001P189K1403q423O079P832L818L483N595P591J4388N032
$$ 485 9687 32110 46111 53300 74703 66280 72359 80191 84009 87492 93087 100678 115066 120098
18217A20098J917L8490M3934K4750K3538M7627L5764M9565M6409L2275J3642M0036
$$ 120098 122015 160505 204439 229189 252727 300354 336118 385683 432092 464367 478009 518045
18205E18045M0183K4087J6020K3351J2378J4383K1027K00k4273k6910k3025m2683
$$ 518045 558228 582315 598335 621686 634064 648447 669474 669674 645401 618491 595466 552783
18193E52783l8184n5426m9775m3568l7269k5504k0212k8086n1399k2074k768L115
$$ 552783 514599 459173 409398 365830 328561 303057 282845 254759 203360 181286 178518 181633
18181A81633n175J0290p003j3010j8195j8141o84q167j4578k671J8785K0608K4564
$$ 181633 176458 186748 179745 166735 148540 130399 129715 121548 106970 104299 123084 143692 168256
18168A68256J3737K188J7909J7678L4577J2686L3143M7238M5740K8088K0592K1098
$$ 168256 181993 184181 202090 219768 254345 267031 300174 347412 393152 421240 441832 462930
18156D62930K2545K1296J1670j4758k3529K885K417n011n992L075J6743J3372
$$ 462930 485475 506771 518441 503683 480154 483039 485456 480445 474453 477528 494271 507643
18144E07643J7233J5458N878j8284k5059Q41j4541j9953k0296l6724l7256k2237
$$ 507643 524876 540334 546212 527928 502869 503710 489169 469216 448920 412196 374940 352703
18132C52703R185q603j9382k3926r825J0870J0787J0510M7341M9675M5835O6180
$$ 352703 361888 353285 333903 309977 300152 311022 321809 332319 379660 429335 475170 541350
18120E41350Q2604Q4626Q4303J05068J22666J74156K28931L31315M62586O82662
$$ 541350 623954 708580 792883 897951 1020617 1194773 1423704 1755019 2217605 2900267
18110B900267R77585J469284K539853M904493R513221R950844k988048n867790
$$ 2900267 3877852 5347136 7886989 12791482 22304703 32255547 29267499 23399709
18102B3399709k978161m030821n682344l673365k035801j386227j023240p08646
$$ 23399709 20421548 16390727 10708383 7035018 4999217 3612990 2589750 1881104
18094A881104m69973k99689k05469j61288j16629r7467o2313p3058m1046l2761
$$ 1881104 1411131 1111442 905973 744685 628056 530589 468276 395218 354172 321411
18084C21411l9094k1304k1709N329l2620m1093j8029l392m707l1606j1577r294
$$ 321411 282317 261013 239304 244633 212013 170920 152891 149499 144792 113186 101609 92315
18072I2315p937o741m527L171m90j0181j5792j8792J739j8407J3348N946q639
$$ 92315 84378 77637 73110 76281 75791 65610 49818 31026 32765 14358 27706 33652 25013
18059B5013k336m275R081k994k1405r268j2012m896l241J3831m219j500J7088
$$ 25013 22677 18402 27483 24489 3084 -6184 -18196 -23092 -26333 -12502 -16721 -18221 -1133
18046a133J0839K1331J5721k3909J418j1133q309O915k1076j4616P311j5250p474
$$ -1133 9706 31037 46758 22849 24267 13134 4825 11740 -9336 -23952 -16641 -31891 -39365
18033c9365K2995J3477j1712J1332j498r857q660R399r812j5848K2191J2217q944
$$ -39365 -16370 -2893 -14605 -3273 -4771 -14628 -23288 -13889 -23701 -39549 -17358 -5141 -14085
18020a4085N993j7820J7574K15j3640R983o06j4202J2585p373j2674Q494p499
$$ -14085 -8092 -25912 -8338 -8123 -21763 -11780 -12386 -26588 -14003 -21376 -34050 -25556 -33055
18007c3055Q452J1313M895J1635l386o940j133K028k9769p090J4755J4371J225
$$ -33055 -24603 -13290 -8395 3240 -146 -7086 -8219 -6191 -35960 -43050 -28295 -13924 -12699
17994a2699k0709J909r896L207J2475n473j5086j0400j0475j4082K6250J0654
$$ -12699 -33408 -31499 -41395 -38188 -25713 -31186 -46272 -56672 -67147 -81229 -54979 -44325
17982d4325P494L890j053k302J9233R418l62j9811q431J3925m595j8688L616n003
$$ -44325 -36831 -32941 -33994 -36296 -17063 -7645 -8007 -27818 -36249 -22324 -26919 -45607 -41991 -46994
17968d6994k496j8790J0263l628J8983L0965K640j770K2758Q607k0962j8976q82
$$ -46994 -49490 -68280 -58017 -61645 -42662 -11697 -9057 -10827 11931 20538 -424 -19400 -20282
17955b0282L080J007p928j2629M678K5086j1109o726N767j0268r626O33N432j430
$$ -20282 -17202 -16195 -24123 -36752 -32074 -6988 -18097 -24823 -19056 -29324 -38950 -38317 -32885 -34315
17941c4315j301J1974R141L2863J0440k4014k7927p141j1367r78M867Q185J590
$$ -34315 -35616 -23642 -14501 18362 28802 4788 -23139 -30280 -41647 -42625 -37758 -29573 -27983
17928b7983M994j9961j1277n072R165N208o602L838K6808K2511J0173l746k9138
$$ -27983 -22989 -42950 -54227 -59299 -50134 -44926 -51528 -47690 -20882 1629 11802 8056 -21082
17915b1082l019j0936n968K293l90k5984p454J9434J8432j424k0401j860m376
$$ -21082 -24101 -35037 -41005 -38712 -39102 -65086 -72540 -53106 -34674 -36098 -56499 -58359 -62735
17902f2735m837J5957J1235l649j166Q595K8048J7827j1897l061P269j2375M03
$$ -62735 -67572 -51615 -40380 -44029 -45195 -36600 -8552 9275 -2622 -5683 1586 -10789 -10386
17889a0386L123j0511k0357n421l55j489O688L91N423J1592R547j4373j5953J3354
$$ -10386 -7263 -17774 -38131 -43552 -43907 -45396 -38708 -38317 -32894 -21302 -11755 -26128 -42081 -28727
17875b8727O541p427k7101j4945R808L195N299j013J016K0810J5015j9719r642
$$ -28727 -22186 -29613 -56714 -71659 -61851 -58656 -53357 -54370 -53354 -32544 -17529 -37248 -46890
17862d6890j2655j7802K6655J0650J536J0808j9869j6731K5230J5223r064q051
$$ -46890 -59545 -77347 -50692 -40042 -38506 -27698 -47567 -64298 -39068 -23845 -32909 -40960
17850d0960j667k1548p854N489J5811K6711K2129o615k2964k6455J0347J9932
$$ -40960 -42627 -64175 -72029 -66540 -50729 -24018 -1889 -8504 -31468 -57923 -47576 -27644
17838b7644r682J2429R98j0838l038J9850m62k3621j920l733O250M321N999p84
$$ -27644 -37326 -24897 -23899 -34737 -37775 -17925 -18387 -42008 -43928 -47661 -41411 -37090 -31091 -31875
17824c1875J574N341N55q529j908k37Q53N882M583Q913k4088j2455J0506J1113
$$ -31875 -30301 -24960 -24405 -32934 -34842 -35079 -34226 -28344 -23761 -14848 -38936 -51391 -40885 -29772
17810b9772J837r66J6227j653j8111K4654J2966r387j6492r397k391K356K652
$$ -29772 -27935 -28901 -12674 -14327 -32438 -7784 5182 -4205 -20697 -30094 -32485 -30129 -27477
17797b7477Q637k640J171K12R087Q044j1495j70P322K5552j7391k3950N760K6603
$$ -27477 -18840 -21480 -20309 -20097 -11010 -2966 -14461 -14631 -7309 18243 852 -23098 -17338 9265
17783I265Q182p223j1229L956P222M75j892k6967k6766m267P034j6174j5795Q56
$$ 9265 17447 10224 -1005 2951 10173 10648 8756 -18211 -44977 -49244 -42210 -58384 -74179 -73323
17769g3323J5832J4624K3650L617L892j9047N980j0934P636l344O994R552j3627
$$ -73323 -57491 -42867 -19217 -15600 -11708 -30755 -24775 -35709 -28073 -31417 -24423 -14871 -28498
17756b8498j9744N535J6513K693M695j1483j3877K1671J3151L305j4033j0519
$$ -28498 -48242 -42707 -26194 -23501 -18806 -30289 -44166 -22495 -9344 -6039 -20072 -30591
17744c0591m85k082P901J25k3317J2768L5322J6691n775J0206K730j6038k9068
$$ -30591 -31076 -33158 -25257 -25132 -48449 -35681 -359 16332 10557 20763 23493 7455 -21613
17731b1613k1574K616o559K1364J9186M290q522k6087K3173J6017l844P972o876
$$ -21613 -43187 -40571 -47130 -25766 -6580 -2290 -10812 -36899 -13726 2291 -1553 6419 -457
17718d57n504J6576J1298m695q797R692q973p851n826j3250M578l258n772j5828
$$ -457 -5961 10615 21913 17218 8421 18113 9140 1289 -4537 -17787 -13209 -16467 -22239 -38067
17704c8067P732J9154m798j4863j6472n94q835J7767K2062J4898L82j4603p939
$$ -38067 -30335 -11181 -15979 -30842 -47314 -47908 -56743 -38976 -16914 -2016 -1634 -16237 -24176
17691b4176J9586K321k9084j0860r053P446Q510J5340J5643p525P564l036k0634
$$ -24176 -4590 -2269 -31353 -42213 -51266 -43820 -35310 -19970 -4327 -11852 -4288 -7324 -27958
17678b7958j2582O342N581P028j0602k832j0304k070R13K1218J0090M506Q92j8979
$$ -27958 -40540 -34198 -28617 -21589 -32191 -35023 -45327 -47397 -46484 -25266 -15176 -10670 -9778 -28757
17664b8757p255J9386J7613q074j1539r201J446o928k165K0422N638k5734O107
$$ -28757 -36012 -16626 987 -7087 -18626 -27827 -26381 -33309 -35474 -15052 -9414 -35148 -29041
17651b9041K291J4365M804J3901j2171m015K321j3729r674j1018r691n941J2618
$$ -29041 -26750 -12385 -7581 6320 -5851 -9866 -7545 -21274 -30948 -41966 -51657 -57598 -44980
17638d4980O022J0255p542j4965Q087J8776J288N09Q627J861j338J0439Q185k7673
$$ -44980 -38958 -28703 -36245 -51210 -43123 -24347 -23059 -22550 -13923 -12062 -13400 -2961 5224 -22449
17624b2449j1950J2610J8497n463q374q63k307P13r387J6286n97M13j1550p00
$$ -22449 -34399 -21789 -3292 -8755 -17129 -17992 -20299 -19586 -28973 -12687 -13284 -12871 -24421 -25121
17610b5121j4739r226q322O979J1735J3796K4406J8969k4582j1703R46J3716K713
$$ -25121 -39860 -49086 -57408 -50429 -38694 -24898 -492 18477 -6105 -17808 -16862 -3146 -433
17597d33M430M322m034j8133l021q520j7599J470M651p49J2246P101j2047n405
$$ -433 3997 8319 4285 -13848 -16869 -25389 -42988 -41518 -36867 -37616 -25370 -18269 -30316 -35721
17583c5721j885J631N47K210J938L352K7498j4295m657K257j6594n123J7690l34
$$ -35721 -37606 -35975 -35428 -33218 -31280 -27928 -430 -14725 -19382 -17125 -33719 -38842 -21152 -21486
17569b1486j0491m231p636j504O864o73M933J7682p25j486N452l3241j6331J5016
$$ -21486 -31977 -36208 -43844 -45348 -38484 -39157 -34224 -16542 -17267 -18753 -13301 -46542 -62873 -47857
17555d7857K0566o117N070K9628k432q245n67J510O633J145m690J2346j3811M726
$$ -47857 -27291 -33408 -28338 1290 -1142 -9387 -9954 -8444 -1811 -666 -5356 6990 -6821 -2095
17541b095k2300o969q931l610o332M060K4886J1766j8739M898P572r100q451p970
$$ -2095 -24395 -31364 -40295 -43905 -50237 -46177 -21291 -9525 -28264 -23366 -15794 -24894 -33345 -41315
17527d1315M671K3358k621M00O30k609O786J2984J0566o646k7636M707O54n784
$$ -41315 -36644 -13286 -15907 -15507 -14877 -17486 -10700 2284 12850 6204 -21432 -16725 -16071 -21855
17513b1855R571J3783p178p701n532j698n231J3414K3118N610P97j0134k9492
$$ -21855 -12284 1499 -5679 -13380 -18912 -20610 -25841 -12427 10691 16301 17098 6964 -22528
17500b2528j3475J6545K1155L213p623k0386m009Q533j0805K03j1268J1948n504
$$ -22528 -36003 -19458 1697 4910 -2713 -23099 -27108 -18575 -29380 -29177 -40445 -28497 -34001
17487c4001O442m311J3181j7547j5669Q550J9117J0460q488M972j976R650M982
$$ -34001 -27559 -31870 -18689 -36236 -51905 -43355 -24238 -13778 -22266 -17294 -19270 -9620 -4638
17474d638n036M65j7356j6785m621J8037K0114r095J403k412k204r171k370k2661
$$ -4638 -9674 -9209 -26565 -43350 -47971 -29934 -9820 -18915 -17512 -19924 -22128 -31299 -33669 -56330
17460e6330Q816P006r509q570L762r026n421K6508J1342O17R375O826p077j250
$$ -56330 -47514 -40508 -50017 -58587 -54825 -63851 -69272 -42764 -31422 -30805 -21430 -14604 -21681 -22931
17446b2931J7168K2863J4000j3684J3839K1297K2949M3210L1451k4771l9613l1470
$$ -22931 -5763 17100 31100 17416 31255 52552 75501 118711 150162 125391 85778 54308
17434E4308j9338n326O537l558j4237k9343P279N594p083M193J5309k8195l3604
$$ 54308 34970 29644 36181 32623 18386 -10957 -3678 1916 -5167 -974 14335 -13860 -47464
17421d7464j1382O705Q723J7798j115q030n137L387J792Kr155N674J5412R103
$$ -47464 -58846 -52141 -43418 -25620 -26735 -34765 -39902 -36515 -34723 -34721 -43876 -38202 -22790 -13687
17407a3687q378p369o578p599J358L6104K2048M255k2163m0002j4266J8830L336
$$ -13687 -22065 -29434 -36012 -43611 -42253 -6149 15899 20154 -2009 -42011 -56277 -37447 -34111
17394c4111J9067J4006O08J8727k384j2870q621j0648J5269J4699Q24j4949P047
$$ -34111 -15044 -1038 -430 18297 15913 3043 -5578 -16226 -957 13742 14566 -383 6664
17381F664J1553k0271k6021J3139Q859j1174J2077q762j4486p496K115J4890N599
$$ 6664 18217 -2054 -28075 -14936 -6077 -17251 -5174 -13936 -28422 -35918 -33803 -18913 -13314
17368a3314j2367j9728r054o77J2530K8827m268j2175n03O469K808J4302P981
$$ -13314 -25681 -45409 -54463 -55140 -42610 -13783 -18051 -30226 -30729 -24260 -21452 -7150 831
17355H31J531j5995j1032M322J2857r18O481l779k4573n751J1026j5044P151M1912
$$ 831 2362 -13633 -24665 -20343 -7486 -8404 -1923 -5702 -30275 -36026 -25000 -40044 -32893 9019
17341I019J5012j0368r202j5722l277k5338j6178K0004L5351J9606j4929j0809
$$ 9019 24031 13663 4461 -11261 -14538 -39876 -56054 -36050 -699 18907 3978 -6831
17329f831p217M906P210M162m839o869r13R890K8917j5108o165R671j5700r285
$$ -6831 -14048 -9142 -1932 2230 -2609 -9478 -10391 -501 28416 13308 7143 16814 1114 -8171
17315h171Q191j1403j7283J0233n22k947j6932J1024J9005J5983K782m630j732
$$ -8171 20 -11383 -28666 -18433 -18955 -21902 -38834 -27810 -8805 7178 9960 5330 3598
17302C598N349l642j7491j0389J0281J108O111r5R570Q330r875m978K0698j096
$$ 3598 8947 5305 -12186 -22575 -12294 -11186 -5075 -5170 4400 12730 2855 -2123 18575 17479
17288A7479j5784p142P50N43j467J667N303o16J9561L037J1037j433k5614l661
$$ 17479 1695 -5447 -4697 -4154 -5621 -3954 1349 733 20294 23331 34368 32935 7321 3660
17274C660J6265Oq615j0315n538l631p792J423J4385O719N303o790P90M736j2939
$$ 3660 19925 19931 11316 1001 -4537 -8168 -15960 -14537 -152 6567 11870 5080 5870 10606 -2333
17259b333k2957j7345J4599J7856J4314k810j4020K531n68j1572l483j4193j2368
$$ -2333 -25290 -42635 -28036 -10180 4134 1324 -12696 -10165 -10733 -22305 -25788 -39981 -52349
17246e2349K3784K8849J3331k2164o978K5468N753j1023m963J77n073r544J233
$$ -52349 -28565 284 13615 -8549 -15527 9941 15694 4671 -292 -115 -5188 -14732 -13499
17233a3499J2953K0006L165p642j8599k294l009m54O378p154r749j6365M21k0985
$$ -13499 -546 19460 22625 14983 -3616 -5910 -8919 -9373 -2995 -10149 -19898 -36263 -35842 -56827
17219e6827O083K2428N262J6673l144Q28j2328p083j2444J024m841K0981J9031
$$ -56827 -50744 -28316 -23054 -6381 -9525 -8697 -21025 -28108 -40552 -39528 -44369 -23388 -4357
17206d357J2285m096j7496k3010M415L4019R903j1114j9387l381J7233M452N65
$$ -4357 7928 3832 -13664 -36674 -32259 1760 11663 549 -18838 -22219 -4986 -534 31
17193C1j6122k5764r804J6911J8928K2717J0481m097J879k2036k9997k0521N767
$$ 31 -16091 -41855 -51659 -34748 -15820 6897 17378 13281 15160 -6876 -36873 -57394 -51627
17180e1627K5627J3295q372Q643m894m297J3144J4534J2971M160j0476j4412l125
$$ -51627 -26000 -12705 -21077 -12434 -17328 -21625 -8481 6053 19024 23184 12708 -1704 -4829
17167d829K2318m24l43n652K063J2656q642j4547R805L975p460K333J575O613
$$ -4829 17489 17065 16722 11070 13133 25789 17147 2600 12405 16380 8920 11253 12828 19441
17153A9441l75j9063r357n713j1785p237j1419Q373J0589j665k4P996j1786Q428
$$ 19441 19066 3 -9354 -15067 -26852 -34089 -45508 -37135 -26546 -28211 -28235 -20239 -32025 -23597
17139b3597j5774k3128J923K6089K0319K915l020M094M002R79o346j3325P334
$$ -23597 -39371 -62499 -60576 -34487 -14168 -11253 -14273 -10179 -6177 -5198 -11544 -24869 -17535
17126a7535K889j7909O149n486m295J696j1029O051J954j1431J530M301O17K0199
$$ -17535 -14646 -32555 -26406 -31892 -36187 -34491 -45520 -39469 -37515 -48946 -47416 -43115 -42498 -22299
17112b2299R022P235J8349j6570l591J1672J5349j1620j5278k6028k3136J4268
$$ -22299 -13277 -6042 12307 -4263 -7854 3818 19167 7547 -7731 -33759 -56895 -42627
17100d2627J5725R350J0177m398Q869M047j3798j0568L515J176k355J7950J8820
$$ -42627 -26902 -17552 -7375 -11773 -2904 1143 -12655 -23223 -19708 -18532 -20887 -2937 15883
17087A5883m591k1355j6833J1210L29j0001j2280j0045k472J6124J7037N397k1220
$$ 15883 11292 -10063 -26896 -15686 -15357 -25358 -37638 -47683 -50155 -34031 -16994 -11597 -32817
17074c2817L512K1726P06j835k0016J1576K0294m507p439R167M725n234l632j3114
$$ -32817 -29305 -7579 -6873 -8708 -28724 -17148 3146 -1361 -8800 367 5092 -142 -3774 -16888
17060a6888j7262j1680Q158J1676o233n884l009K6141N486q286o003l13J3385
$$ -16888 -34150 -45830 -37672 -25996 -32229 -38113 -41122 -14981 -9495 -17781 -23784 -24097 -10712
17047a0712R1k3969j6398J5999J0799L3j1576O752N365j128L549m542l14j0620
$$ -10712 -10621 -34590 -50988 -34989 -24190 -24157 -35733 -28981 -23616 -24744 -21195 -25737 -26051 -36671
17033c6671o45N010J1573q70o480P461K4319J1306O372R656k3706o290j2909J965
$$ -36671 -37316 -32306 -20733 -21603 -28083 -20622 3697 15003 21375 31031 7325 1035 -11874 -9909
17019i909m400p863j420L413j1502K7291q4j9405k0004k1048Q225K0267K4342
$$ -9909 -14309 -22172 -23592 -20179 -31681 -4390 -4474 -23879 -43883 -64931 -56706 -36439 -12097
17006a2097m93n092l434j2150j834R067j4556M97J5628k551Q883l348K1980J5520
$$ -12097 -12590 -17682 -21116 -33266 -35100 -26033 -40589 -40092 -24464 -27015 -18132 -21480 500 16020
16992A6020k0820K903J9734J780K149k2387n161Q598Q157q590r495j8731J0458
$$ 16020 -4800 -1897 17837 19617 21766 -621 -5782 2816 10973 2383 -7112 -25843 -15385
16979a5385K0488Q519j2544j5237j6823J663P795R705j7693O45J6112P209r14
$$ -15385 5103 13622 1078 -14159 -30982 -29319 -21524 -11819 -29512 -28867 -12755 -5546 -6460
16966f460L636J8084L925j6160l7223K782J2181j5066j7495n002M434J5598J4676
$$ -6460 -2824 15260 19185 3025 -34198 -31416 -19235 -34301 -51796 -56798 -52364 -36766 -22090
16953b2090J8965J0763J9432O678j8873k8972K295Q712j5331K707J8148J283m371
$$ -22090 -3125 7638 27070 33748 14875 -14097 -11802 -3090 -18421 -15714 2434 3717 -654
16940f54l533P970O289l19j6481k8058O491J6646J3645K219j601o746j5600o678
$$ -654 -4187 3783 10072 9753 -6728 -34786 -28295 -11649 1996 4215 2614 -4132 -19732 -26410
16926b6410O510J6624J6703J4796O414j5268k7189j3159l737m166L391J5771J7469
$$ -26410 -19900 -3276 13427 28223 34637 19369 -7820 -20979 -24716 -28882 -25491 -9720 7749
16913G749N11M307k8466j7105K0470L459p471j974N351l350J7132j6048L299Q809
$$ 7749 8260 12567 -15899 -33004 -12534 -9075 -16546 -18520 -13169 -16519 613 -15435 -12136 -3327
16899c327R472j1378M921N442j5908K897J3533L351n262j4207P04o553k745Q4
$$ -3327 6145 -5233 -312 5130 -10778 -7881 5652 9003 3741 -10466 -9762 -16315 -19060 -18976
16885a8976r7r194K637K0993k84r14j466L806l319l916n014Q115P295k1467k8258
$$ -18976 -19073 -28267 -25630 -4637 -4921 -5835 -7301 -3495 -6814 -10730 -15744 -7629 -334 -21801 -50059
16870e0059k323K3728J1702N3k4437j8718J6289L355p860N99J8358K3848j5685
$$ -50059 -52382 -28654 -16952 -16899 -41336 -60054 -43765 -40410 -48270 -47671 -29313 -5465 -21150
16857b1150j5662K0899J4406n528p704J1193k039l263m690J3487Q61O088K621
$$ -21150 -36812 -15913 -1507 -7035 -14739 -3546 -5585 -8848 -13538 -51 810 6898 9519
16844I519o469Q511r528j2371J5102J3935o253J0318q190j208j372o032R043r092
$$ 9519 3050 11561 2033 -10338 4764 18699 12446 22764 14574 13366 11994 5962 15005 5913
16830E913Q627R339k902j1943q844j5404j8216R254J9235K829R837k319K889K1380
$$ 5913 14540 23879 20977 9034 190 -15214 -33430 -24176 -4941 -2112 7725 5406 8295 29675
16816B9675j4909k2024j9448j299L320j0190M603L0571o877j8937r26J0169j033
$$ 29675 14766 -7258 -26706 -28005 -24685 -34875 -30272 299 -6578 -25515 -26441 -16272 -17305
16803a7305n595m514P131k07m261J3590j1514o746k177K155o022J5050J4517P819
$$ -17305 -22900 -27414 -20283 -20490 -24751 -11161 -22675 -29421 -31598 -29443 -35465 -20415 -5898 1921
16789A921J6388j0639n211L7J0693m07j4548m475M181K132j406n765j1997J6654
$$ 1921 18309 7670 2459 2496 13189 12782 -1766 -6241 -2060 72 -1334 -7099 -19096 -2442
16775b442N219j5476j709K116n206j577j9955k066J5705k279J336k984K834P038
$$ -2442 2777 -12699 -14408 -12292 -17498 -19075 -39030 -41096 -25391 -27670 -26334 -29318 -26484 -19446
16761a9446K2295P312k6196P357J8262N05p566q882j1039p092J839r153N016J5529
$$ -19446 2849 10161 -16035 -8678 9584 10089 2523 -6359 -17398 -24490 -22651 -31804 -26788 -11259
16747a1259n081J3548Q470p233j4482j3772j357k0240m771N982J1725K4757o216
$$ -11259 -16340 -2792 5678 -1555 -16037 -29809 -31166 -51406 -56177 -50195 -38470 -13713 -19929
16734a9929p11l075j6448K3106m787m386M004J3481n334l0792J2219j013L656
$$ -19929 -20640 -23715 -40163 -17057 -21844 -26230 -22226 -8745 -14079 -44871 -32652 -33665 -30009
16721c0009m59r586K1480J5499R540J469k1709Q413j3591k7434M197L121J3855
$$ -30009 -30468 -40054 -18574 -3075 6465 7934 -13775 -5362 -18953 -46387 -42190 -39069 -25214
16708b5214Q033J1338J8850m213k42L631N898j3938j6948K3332M408k8808j8805
$$ -25214 -17181 -5843 13007 8794 8552 12183 18081 4143 -12805 10527 14935 -13873 -32678
16695c2678J1897K8152J8583l541j9667j406l032o34N945k1751j7037J3678J7990
$$ -32678 -20781 7371 25954 22413 2746 1340 -1692 -2326 3619 -18132 -35169 -21491 -3501
16682c501M899L436k0529j5858k704N677O422Q768J3488l737o995p871l202k0357
$$ -3501 1398 4834 -15695 -31553 -34257 -28580 -22158 -13390 98 -3639 -10634 -18505 -21707 -42064
16668d2064j930J3287Q122j3473m069K9203J7460j6957j2194n416j442R278J5040
$$ -42064 -43994 -30707 -22585 -36058 -40127 -10924 6536 -10421 -22615 -28031 -29473 -20195 -5155
16655e155k207Q193Q4p258o794J4253O910N179L188j0755J3251k256q698j2644
$$ -5155 -7362 831 915 -6343 -13137 1116 8026 13205 16393 5638 18889 16633 7935 -4709
16641d709O816K1376M09j3684o157L371n283p667j560n034j0921M327J5160K7604
$$ -4709 2107 23483 23892 10208 4051 7422 2139 -5528 -7088 -12122 -23043 -18716 -3556 24048
16627B4048q529k995m81j4167J7804j097j4280K455J4137j1509k608r980j8001
$$ 24048 15519 12524 12043 -2124 15680 14583 303 2758 16895 5386 2778 -7202 -25203
16614b5203J2906P826j0769R990J5741j1290k2091l459J1487J0862L384J1356
$$ -25203 -12297 -4471 -15240 -5250 10491 -799 -22890 -26349 -14862 -4000 -616 10740
16602A0740j0516k0625Q430m049l719K3783K8663j0260k8682j500J896K922L054
$$ 10740 224 -20401 -11971 -16020 -19739 4044 32707 22447 -6235 -7735 -5839 -2917 137
16589A37o375j889J8356L643O19j8182j0518j026J2590j6325K215J4387M224j5393
$$ 137 -6238 -8127 10229 13872 14491 -3691 -14209 -15235 -2645 -18970 -16755 -2368 1856 -13537
16575a3537O606J5671r334j9295L115l318n511M242r180M5777J4069j593j0998
$$ -13537 -6931 8740 -594 -19889 -16774 -20092 -25603 -21361 -30541 15236 29305 27712 16714
16562A6714L023j0462j8921j0267k102p66J876Q076l273l654L549J6285j1347
$$ 16714 19737 9275 -9646 -19913 -22015 -22781 -20905 -12829 -16102 -19756 -16207 78 -11269
16549a1269O636j7538l248q948j1451M898J0381M637k790j7116J6290L1943P963
$$ -11269 -4633 -22171 -25419 -34367 -45818 -40920 -30539 -25902 -28692 -45808 -29518 2425 10388
16536A0388o891j7004L494J4265M909k642L249p232r997p363n150N547q816J4479
$$ 10388 3497 -13507 -10013 4252 9161 6519 9768 2536 -7461 -14824 -19974 -14427 -23243 -8764
16522h764J5622j467q026q512p374J4720N078q215M377L07J42M971k0150q936
$$ -8764 6858 5391 -2635 -11147 -18521 -3801 1277 -6938 -2561 -2254 -2112 2859 -17291 -26227
16508b6227J0011L477n046j3376j232J450K547L291J0814L221p130j158K2055
$$ -26227 -16216 -12739 -17785 -31161 -32393 -30943 -28396 -25105 -14291 -11070 -18200 -19358 2697
16495B697M31J1436m057j6081j158m015l146l627j8958o291K3760P731l60K933
$$ 2697 3128 14564 10507 -5574 -6732 -10747 -13893 -17520 -36478 -42769 -19009 -11278 -11638 -8705
16481h705R872j97M318L746l45o306k961K1389j4654l156O827N83j778j4380j6202
$$ -8705 1167 970 5288 9034 8689 2383 -578 20811 6157 3001 9828 10411 8633 -5747 -21949
16466b1949K3554N139k3766j8598J0809J3713P723J0134J5970N326j8979j8188
$$ -21949 1605 6744 -17022 -35620 -24811 -11098 -3375 6759 22729 28055 9076 -9112
16454i112P993O425j5427Q87O39r541j7864j1154j230K3738L8329M137n84l917
$$ -9112 -1119 5306 -10121 -9234 -8595 -18136 -36000 -47154 -48384 -24646 13683 17820 17236 13319
16440A3319J777m092J2241M241r263k1853j6874q494J564j3232r099L1631L3239
$$ 13319 15096 11004 23245 27486 18223 -3630 -20504 -28998 -27434 -40666 -49765 -18134 15105
16427A5105M726j7050m17q642K617L292r207Q65m818j696P447p376J0288L599
$$ 15105 19831 2781 2364 -6278 -3661 -369 -9576 -8711 -13529 -15225 -7778 -15154 -4866 -1267
16413a267l185n530j2570O86j4836K340M281N281J4125j9657J7535J1357J0827
$$ -1267 -4452 -9982 -22552 -21866 -36702 -34362 -30081 -24800 -10675 -30332 -12797 -1440 9387
16400I387k2919N047p842j4473p022Q453K1635q654k4178p919p973K0317J4611
$$ 9387 -13532 -8485 -16327 -30800 -37822 -29369 -7734 -16388 -40566 -48485 -56458 -36141 -21530
16387b1530n662J2077J5027m437J333j971o99M318J0212j0773j0835j7097j2509
$$ -21530 -27192 -15115 -88 -4525 -3192 -5163 -5862 -1544 8668 -2105 -12940 -30037 -42546
16374d2546K0180J6698J0853j1893o810j2630J2473L2098K261l852n553o818J057
$$ -42546 -22366 -5668 5185 -6708 -13518 -26148 -13675 18423 20684 16832 11279 4461 5518
16361E518m322L323j16J0205J6477j706k569j5614o791p50M292k0790K2733J5953
$$ 5518 1196 4519 4403 14608 31085 29379 26810 11196 4405 3655 7947 -12843 9890 25843
16347B5843p361q256q588k545R395K951k081J904J0491j0953J355j6705m140J6488
$$ 25843 18482 10226 1638 -907 8488 11439 9358 11262 21753 10800 12155 -4550 -8690 7798
16333G798j3108M429L1420k48k6998k279j7150J0753R528r828L074L035p723p169
$$ 7798 -5310 -881 30539 30291 3293 1014 -16136 -5383 4145 -5683 -2609 426 -7297 -14466
16319a4466K3307K7736k902j7217j4175m930O727J002r787J6049l30l424K263
$$ -14466 8841 36577 33675 16458 2283 -2647 4080 5082 -4705 11344 11014 7590 9853
16306I853n631N52q954P016J7994K301j65P13r327j062K249j9468p455K9353J1088
$$ 9853 4222 4774 -4180 2836 20830 23131 22966 23679 14352 13290 15539 -3929 -11384 17969 29057
16291B9057n298L87j2720O127k3199j6407J670K88J8503J2456J3526j1635j7063
$$ 29057 23759 24146 11426 17553 -5646 -22053 -20383 -20095 -1592 10864 24390 12755 -4308
16278d308j549o231j1579R426J9227K546J787p429j1061j444Q108j961j706k946
$$ -4308 -5857 -12088 -23667 -14241 4986 7532 9319 1890 -9171 -10615 -2507 -4468 -6174 -9120
16264i120J310j680M081j2357P61K415k8599r866K1669J8687J8207K951Q665O188
$$ -9120 -7810 -9490 -5409 -17766 -17005 -14590 -43189 -53055 -31386 -12699 5508 8459 17124 23312
16250B3312j5076q158K546N585Q483l036n734n550N603R261j7789l492J760j0655
$$ 23312 8236 78 2624 8209 16692 13656 7922 2372 7975 17236 -553 -4045 -2285 -12940
16236a2940R943p550K311l467l557J3726Q499n413O178K429K618j366k3094J084
$$ -12940 -2997 -10547 -8236 -11703 -15260 -1534 6965 1552 7730 10159 12777 11411 -11683 -10599
16222a0599J9768N7j1793j6291J0331J8281J2995o921k1330m766R077J3088k511
$$ -10599 9169 9226 -2567 -18858 -8527 9754 22749 15828 -5502 -10268 -1191 11897 9386
16209I386R104l0623k6252K2604K1820m25j1805O959o907P065J7619q759r09N520
$$ 9386 18490 -12133 -38385 -15781 6039 5614 -6191 768 -6139 926 18545 9786 8877 14397
16195A4397j2903m803r863l115Q382N14k7867Q350K1058J5166j2978k652J4992
$$ 14397 1494 -3309 -13172 -16287 -7905 -7391 -35258 -26908 -5850 9316 -3662 -6314 8678
16182H678j1962j0560J1698J949q976J2402R525m014k4414j774J0527J214r016
$$ 8678 -3284 -13844 -2146 -197 -9173 3229 12754 8740 -15674 -17448 -6921 -5707 -14723
16169a4723n173j083l424J2837m729J385j409P413K0052L924L48k595n647m138
$$ -14723 -19896 -20979 -24403 -11566 -16295 -14910 -16319 -8906 11146 15070 15418 12823 7176 3038
16155C038l92M206j7431k37Q915J3196j679q631j4859j720K1044P780R339m94
$$ 3038 2646 6852 -10579 -10816 -1901 11295 9616 985 -13874 -15594 5450 13230 22569 22075
16141B2075k0744l163K591m545q204q846K4872J4637n055j474q578J019m306j2626
$$ 22075 1331 -1832 759 -3786 -11990 -20836 4036 18673 13618 12144 3566 4585 279 -12347
16127a2347j824J0693R799k015N746k825o105k788K4684P005j3382o475j721j0758
$$ -12347 -14171 -3478 6321 4306 10052 7227 1122 -1666 23018 30023 16641 10166 8445 -2313
16113b313N384K7362M067r07J2305m16q439k2720j0923J042K037K393j45N413
$$ -2313 3071 30433 34500 33593 45898 45482 37043 14323 3400 4442 6479 8872 8727 14140
16099A4140k466j1751q525L765m455K944m683M952J0530o004K3755J2479k2679
$$ 14140 11674 -77 -8602 -4837 -9292 -6348 -11031 -6079 4451 -1553 22202 34681 12002
16086A2002n402k455J7273M657l2420j1024P686K266o008L660R010m004j0676
$$ 12002 6600 4145 21418 26075 -6345 -17369 -9683 -7417 -13425 -9765 -755 -4759 -15435
16073a5435K266m018O3p067R497J1084O499K7466o457l1063n200K508j3908J2603
$$ -15435 -13169 -17187 -17124 -24191 -14694 -3610 2889 30355 23898 -7165 -12365 -9857 -23765 -11162
16059a1162J179j0054N88J3436o698R36K9735P701j1694K2730j702j0928j1012
$$ -11162 -9983 -20037 -19449 -6013 -12711 -11775 17960 25661 13967 36697 34995 24067 13055
16046A3055j6754P148L676J2217L703J2988o469k1504k5742k4837K4820L1526
$$ 13055 -3699 3449 7125 19342 23045 36033 29564 8060 -17682 -42519 -17699 13827
16034A3827K0137L828j6424j2468M115j918J39j0859j975P967R203J067Q183r404
$$ 13827 33964 37792 21368 8900 13015 11097 11236 377 -1598 6369 15572 16639 24822 15418
16020A5418k6772l71j801J2610J1070p365l111q177q940J1121K198P422M098J1160
$$ 15418 -11354 -11725 -13526 -916 10154 2789 -322 -8499 -17439 -6318 -4120 3302 7400 18560
16006A8560j7009K656o420l346j297j3269p998K895J864P54o064J0666J3557Q320
$$ 18560 1551 4207 -2213 -5559 -6856 -20125 -28123 -25228 -23364 -22610 -28674 -18008 -4451 3869
15992C869K6612l390O479k0654l3021j482o059K682Q613J2972J2023j7635j5127
$$ 3869 30481 27091 33570 12916 -20105 -21587 -27646 -24964 -16351 -3379 8644 -8991 -24118
15979b4118O917J4055J1098j919q790l549l397K428n315r328J0174K3031L957
$$ -24118 -17201 -3146 7952 6033 -2757 -6306 -9703 -7275 -12590 -21918 -11744 11287 15244
15966A5244J0535q507j1073L35J390L705r837K1538J2527k156k2838j3166j538
$$ 15244 25779 17272 6199 6534 7924 11629 1792 23330 35857 33701 10863 -2303 -3841
15953c841J0085Q069j0732j4601j5131P494Q054k577r34M195m572K0453P572o188
$$ -3841 6244 14313 3581 -11020 -26151 -18657 -10603 -13180 -14114 -9919 -14491 5962 13534 7346
15939G346K873n683m074n649J6597J3662J4958J6101r385j4841j6230o175N187
$$ 7346 10219 4536 462 -5187 11410 25072 40030 56131 46746 31905 15675 9500 14687
15926A4687p846k4178j1474m57J7738R851Q385J5363o389J765J1322J091j1497
$$ 14687 6841 -17337 -28811 -29268 -11530 -1679 6706 22069 15680 17445 28767 29858 18361
15913A8361l844K0851m035p429m499N250l306k814k988k461O118Q402r657j4298
$$ 18361 14517 35368 31333 23904 19405 24655 21349 18535 15547 13086 19204 27606 17949 3651
15899C651L269p475K310J9079k0160k6714k94J2178L483J4258J0259n217N279
$$ 3651 6920 -555 1755 20834 674 -26040 -26334 -14156 -10673 3585 13844 8627 13906
15886A3906j396l59n14O776L706L444K0957p644j1036k111n841j2685j6521m558
$$ 13906 12510 12151 11637 18413 22119 25563 46520 38876 27840 25729 19888 7203 -9318 -13876
15872a3876K157J968j2541j4806K0235K2382K042m598K756o167n878M987P766
$$ -13876 -11719 -9751 -22292 -37098 -16863 5519 7561 2963 5719 -448 -6326 -1339 6427
15859F427j205R314J4087K108o404J6529q119m116K285n962o809n82j6195k2943
$$ 6427 5222 14536 28623 30731 24327 40856 32737 28621 30906 24944 18135 17553 1358 -21585
15845b1585L835K5434N873M081o392j8213j3244r676j0537J0966J1490O797J0546
$$ -21585 -17750 7684 13557 17638 11246 -6967 -20211 -29887 -40424 -29458 -17968 -11171 -625
15832f25J9688j1462j7024K994K443J2156J3120m976j0233j3012N79o045n454
$$ -625 19063 7601 -9423 -6429 -3986 8170 21290 16314 6081 -6931 -6352 -12397 -17851
15819a7851L0481K8224j7830k2831j3572R11j576J5304K0359J5798j966j1037
$$ -17851 12630 40854 23024 193 -13379 -12468 -14044 1260 21619 37417 35451 24414
15807B4414N239J3947j8099N398l954m615r414P00N96R25N699J6080m714J581
$$ 24414 29653 43600 25501 30899 26945 22330 12916 13616 14212 15137 20836 36916 32202 33783
15793C3783j7788J6176K920j1451nK0243J5946j887k4624n560o591O82N875J365
$$ 33783 15995 32171 35091 23640 23635 43878 59824 57937 33313 27753 21162 21844 27719 29084
15779B9084R6K142k3318J8051K2121k1768k2164j3947j1922J1050Q552Q394P467
$$ 29084 29180 31322 8004 26055 48176 26408 4244 -9703 -21625 -10575 -2023 6371 13838
15766A3838Q323n622J902J408R097j9963k0274O356J6834j0903m680R474P808
$$ 13838 22161 16539 18441 19849 28946 8983 -11291 -4935 11899 996 -3684 5790 13598
15753A3598k5757N66m628J8085L603L98j0307M175Q44M841J6916R743j2456j4960
$$ 13598 -12159 -11593 -16221 1864 5467 5865 -4442 -267 577 5418 22334 32077 19621 4661
15739D661j0266J7024J2759l603L281l813o08O3l27n219l101J0310J6266q795
$$ 4661 -5605 11419 24178 20575 23856 20043 19435 19498 19171 13952 10851 21161 37427 28632
15725B8632O411L541o086m612J4957L582p542q631j6901j3130K0860q886j5067
$$ 28632 35043 38584 32498 27886 42843 46425 38883 30252 13351 221 21081 12195 -2872
15712b872j7315O008L382o911J6173J5294o318n955p072o11K1599J5906q89j4932
$$ -2872 -20187 -14179 -10797 -17708 -1535 13759 7441 1486 -5586 -6197 15402 31308 30419 15487
15698A5487k757J2440o212n946J3208J391q534M266j1302K730j6546j1100L215
$$ 15487 12730 25170 18958 13012 26220 27611 19077 23343 12041 14771 -1775 -12875 -9660
15685i660L6452L958j5184n656M662J0894n650L380J8090j7388k4726j480R005
$$ -9660 26792 30750 15566 9910 14572 25466 19816 23196 41286 23898 -828 -2308 6697
15672F697J2740N970m398j5328Q98j186j4250k1645K643J6121N523j993O291J8966
$$ 6697 19437 25407 21009 5681 6579 5393 -8857 -30502 -27859 -11738 -6215 -8208 -1917 17049
15658A7049Q655Q36J6204J915p768o090j5137l098Q599Q833Q89q383J1886M898
$$ 17049 25704 26540 42744 44659 36891 30801 15664 12566 21165 29998 30887 22504 34390 39288
15644C9288N97K131j6238k3844N790J5474n241J944p474n42j0538l6237k8816
$$ 39288 39885 42016 25778 1934 7724 23198 17957 19901 12427 11885 1347 -34890 -63706
15631f3706J1685J6286M897K7703L147K1102p656l1779o807J9793K0006j397j7271
$$ -63706 -52021 -35735 -30838 -3135 12 21114 13458 -18321 -25128 -5335 14671 13274 -3997
15618c997J0072r341J3992r717O403k746Q699K404K701o113K15r743J2004P002
$$ -3997 6075 -3266 10726 1009 7412 4666 13365 15769 18470 12357 12572 2829 14833 21835
15604B1835n567J0572n819q417l475L188J117j4736l422M63J6779J0340j881q931
$$ 21835 16268 26840 21021 12604 9129 12317 13434 -1302 -4724 -4261 12518 22858 20977 12046
15590A2046Q421o81j0567n718L820r84J024O587R112p43R045L111j2207J179m906
$$ 12046 20467 19786 9219 3501 7321 6337 7361 13948 23060 22317 31362 34473 22266 23445 18539
15575A8539m820o125j4604n670o282O597K5889r894j4759K341P246k036r058L057
$$ 18539 13719 7594 -7010 -12680 -18962 -12365 13524 3630 -11129 -8788 -1542 -3578 -12636 -9579
15561i579r661J0203J9910K229o382p539n439J2079k661q199J4150K718O501j9063
$$ -9579 -19240 -9037 10873 13102 6720 -819 -6258 5821 3160 -5039 9111 11829 18330 -733
15547g33j4479L902p747J989J9463O869l1975J0164J6056K394R581M384j3613
$$ -733 -15212 -11310 -19057 -17068 2395 9264 -22711 -12547 3509 5903 15484 19868 6255
15534F255p743m377j1512P770Q786J2655R306P845p50M143O171j280l853j9299
$$ 6255 -1488 -5865 -17377 -9607 -821 11834 21140 28985 28235 32378 38549 37269 33416 14117
15520A4117P501p957M679M043l296j8974O687j072k2119N882K0994L2762L653
$$ 14117 21618 13661 18340 22383 19087 113 6800 5728 -16391 -10509 10485 43247 46900
15507D6900Q83O21j5012j492j4389J4130Q122R160j4716m904l337p404k119o922
$$ 46900 47783 48404 33392 31900 17511 31641 39763 48923 34207 29303 25966 18562 16443 9521
15493I521q624M328p99j8155R267P483R346N807J1644j7338l055J5434L680j1933
$$ 9521 897 5225 4426 -13729 -4462 3021 12367 18174 29818 12480 9425 24859 28539 16606
15479A6606R097O474L467j0415j9209j5503J1200K6588m876k066o256m78M595
$$ 16606 25703 32177 35644 25229 6020 -9483 1717 28305 23429 21363 15107 14629 19224
15466A9224J8992p369j0103l35j8528o725J904k35J0883J4588P845J0821j5023
$$ 19224 38216 30847 20744 20409 1881 -4844 -2940 -3175 7708 22296 30141 40962 25939
15453B5939q572j5006N238J3761J2127R174j3709j2429j3172k479N949k2074R888
$$ 25939 17367 2361 7599 21360 33487 42661 28952 16523 3351 872 6821 -15253 -5365
15440e365k202L414Q093J323m706P687k0387k555J1347J1998Q714k672J0417O336
$$ -5365 -7567 -4153 3940 5263 557 8244 -12143 -14698 -3351 8647 17361 14689 25106 31442
15426C1442K629J586O176j8892j3808j517J0250K3315l458j1953P002j579M054
$$ 31442 34071 35657 41833 22941 9133 7616 17866 41181 37723 25770 32772 31193 35247
15413C5247R966N979j0535M028L044o884L465p698j6364p02l020p091J1775J9603
$$ 35247 45213 51192 40657 44685 47729 40845 44310 36612 20248 19546 16526 9435 21210 40813
15399D0813J6801n980j0142k0520j4670P19J3784p433j1881J5309N433j0336p043
$$ 40813 57614 51634 41492 20972 6302 7021 20805 13372 1491 16800 22233 11897 4854
15386D854j290J5791l223J8185N90j3681J346j80P610R144j6376j2133P12J3049
$$ 4854 3564 19355 16132 34317 34907 21226 22572 22392 30002 39146 22770 10637 11349 24398
15372B4398L364M993j0998O684P242j879O790M568q449j6389k894m845n22J4032
$$ 24398 27762 32755 21757 28441 35683 33804 40594 45162 36713 20324 17430 12585 12063 26095
15358B6095J6152Q068R735J498j2623j5309j1723o888R290J2924L484M920j0516
$$ 26095 42247 50315 60050 61548 48925 33616 21893 15005 24295 37219 40703 45623 35107
15345C5107q680J6771O313j2106n758J531j294j2365o61k0102j1210J9039J3759
$$ 35107 26427 43198 49511 37405 31647 33178 31884 19519 18858 -1244 -12454 6585 20344
15332B0344r756L025M68J1853j529j2526q968M969J4267p361j0149K697j6410
$$ 20344 10588 13613 14081 25934 24405 11879 2911 7880 22147 14786 4637 7334 -9076
15319i076j0561j721q279J3921Q665O506j0585q58O56R670K4457J2031J0516j3048
$$ -9076 -19637 -21358 -29637 -15716 -7051 -545 -11130 -11988 -11332 -1662 22795 34826 45342 32294
15305C2294M060L154l671M795q05J725o953K73J2956J574L04j569j3737k2315
$$ 32294 36354 39508 35837 40632 39827 41552 34599 34872 47828 49402 49706 48137 34400 12085
15291A2085R824K0075j3721j145J0731N03j5654M857j2154N794j0116j180p890
$$ 12085 21909 41984 28263 27118 37849 38352 22698 27555 15401 21195 11079 9899 2009
15278B009r631Q954J014J7852J2716m007j347Q218J3509L642r69J4284J596N191
$$ 2009 -7622 1332 2346 20198 32914 28907 27560 35778 49287 52929 51960 66244 67840 73031
15264G3031O696j3058k4104k6235J1792J5879j1504j1323j127J5221l199o983
$$ 73031 79727 66669 42565 16330 28122 44001 32497 21174 20047 35268 32069 25086
15252B5086q25J0066p331q472O263K8564r793j3967O307o19N980R288J183j6592
$$ 25086 24261 34327 26996 18524 24787 53351 43558 29591 35898 35279 41259 50547 51730 35138
15238C5138L950L542K120J5255J2031J1066J650n608l755J699j5792j3013O223
$$ 35138 39088 42630 44750 60005 72036 83102 84752 79144 75389 77088 61296 48283 54506
15225E4506O113N986r297m727j0118k0206O143J7182j1789j6814j1429q845P235
$$ 54506 60619 66605 57308 52581 42463 22257 28400 45582 33793 16979 5550 -3295 3940
15212C940K777j9221L445K8276P942n51j1447j126P500J5673l634M341K936m972
$$ 3940 6717 -12504 -9059 19217 27159 26608 15161 14035 21535 37208 33574 37915 40851 35879
15198C5879l22o844r313l312O524O688J0404J7206j8704r545j7422q132J3000
$$ 35879 35557 28713 19400 16088 22612 29300 39704 56910 38206 28661 11239 3107 16107
15185A6107P741J128Q790L964j4164n007j7831r418O958J9894L315r042J0197
$$ 16107 23848 24976 33766 37730 23566 18559 728 -8690 -1732 18162 21477 12435 22632
15172B2632R192L910n965l087O815k410J3604p049j0862M023K1881n517l002K167
$$ 22632 31824 35734 29769 26682 33497 31087 44691 37642 26780 30803 52684 47167 44165 46332
15158D6332k404j5965j0841K022M487m171k052K7331l547R304J3864r953k7494
$$ 46332 43928 27963 17122 19144 23631 19460 17408 44739 41192 50496 64360 54407 26913
15145B6913M359O422p389J2610N443m514Q734Q816j5101j1723q580N854Q596P50
$$ 26913 31272 37694 30305 42915 48358 43844 52578 61394 46293 34570 25990 31844 40440 41190
15131D1190J2986L886k657l085K238j1212m185M4m226J8889N072q544j139J3988
$$ 41190 54176 58062 55405 52320 54558 43346 39161 39205 34979 53868 58940 50396 49257 63245
15117F3245J1998l939p749n783O427n414J2932j403j1684j2707j497K065M029
$$ 63245 75243 71304 63555 57772 64199 58785 71717 70314 58630 45923 44426 46491 50520
15104E0520n325j4808j3264L3364K6533k4415p574R997r340L062J8057N564O700
$$ 50520 45195 30387 17123 50487 77020 52605 45031 55028 45688 48750 66807 72371 79071
15091G9071j7742r909K2067j4062k7476J2071J217O378j4690j4140K059K0241
$$ 79071 61329 51420 73487 59425 31949 44020 45237 51615 36925 22785 24844 45085
15079D5085M630r167j8039q219Q505J7073O649L919Q67n813L880r879J1556J1334
$$ 45085 49715 40548 22509 14290 22795 39868 46517 50436 51303 45490 49370 39491 51047 62381
15065F2381L251q653q995r599M653q213n473P446r58K9467j086j6336l317m955
$$ 62381 65632 56979 47984 38385 43038 34825 29352 36798 35840 65307 64221 47885 44568 39613
15051C9613N265K783j4348J412K0781K1120R310n854j0436j2306j0830J2948J1780
$$ 39613 44878 47661 33313 34725 55506 76626 85936 80082 69646 57340 46510 59458 71238
15038G1238M164q458k465j7923J3J1084j3036J6863J6295j7204k1111k6928p172
$$ 71238 75402 66944 64479 46556 46569 57653 44617 61480 77775 60571 39460 12532 5360
15025E360L603N202K926j4049O504N1931K9966j114J2480j1337k2176j0909j3673
$$ 5360 8963 14165 17091 3042 9546 61477 91443 90329 102809 91472 69296 58387 44714
15012D4714j8288q483J2855L0162R329j7967j760n549o307J0406Q295N033L505
$$ 44714 26426 17943 30798 60960 70289 52322 50562 45013 38706 49112 57407 62440 65945
14999F5945N915j2344m436M330K2217R02k2176k2259o14n911l953J5825K570J1132
$$ 65945 71860 59516 55080 59410 81627 82529 60353 38094 37480 31569 27616 43441 46011 57143
14985E7143j1859j4957J1219J0195M497J2311J5729j9486j6313M2796K5382j6024
$$ 57143 45284 30327 41546 51741 56238 68549 84278 64792 48479 91275 116657 100633
14973A00633j1511o462m576j8028j2102j858j6654r346j738K6004P931j1132j3057
$$ 100633 89122 82660 78084 60056 47954 46096 29442 20096 18358 44362 52293 41161 28104
14960B8104J893J5707J2171K630P156l482q44J1945m500J3427M626q711m366j9466
$$ 28104 29997 45704 57875 60505 67661 64179 63335 75280 70780 84207 88833 80122 75756 56290
14946E6290l747K0250J2511J8966p372n242r854n979N870l446J2327o485k2870
$$ 56290 52543 72793 85304 104270 96898 91656 81802 75823 81693 78247 90574 84089 61219
14933F1219j4430J0486P492l425J5235K7045O065j7727j4303o85J63j6034k2591
$$ 61219 46789 57275 64767 61342 76577 103622 109687 91960 77657 76972 77135 61101 38510
14920C8510j594J0799q68M616J0066O837j210j9218j0901J4068J9322l911J5563
$$ 38510 36916 47715 46847 51463 61529 68366 67156 47938 37037 51105 70427 66516 82079
14907H2079M966l157P767j6644o518j823o677K5211K6496j5961o375O348K1852
$$ 82079 87045 83888 91655 75011 68493 66670 59993 85204 111700 95739 89364 95712 117564
14894A17564j748l9572m1389P764P308N790J1073J4990K0770L058q629K498L006
$$ 117564 115816 76244 34855 42619 49927 55717 66790 81780 102550 105608 96979 99477 102483
14881A02483K1640K662l150k34M114j1193N209j142M644M523Q33K5785K3823J5013
$$ 102483 124123 126785 123635 123401 127515 116322 121531 120389 125033 129556 130389 156174 179997 195010
14867A95010N653P566J4880J9204J9812K4945K3894M1040M5342N8233J01279J24071
$$ 195010 200663 208229 223109 242313 262125 287070 310964 352004 397346 455579 556858 680929
14855F80929J60485K41380K84138K68578K80182K30310J35899N1627n0035j34727
$$ 680929 841414 1082794 1366932 1635510 1915692 2146002 2281901 2333528 2283493 2148766
14845B148766k15519k67462k78928k56458k38523j86302j39252j15466p9491o4232
$$ 2148766 1933247 1665785 1386857 1130399 891876 705574 566322 450856 371365 307133
14835C07133l2533J812l1125l9651r395k3423j5919j0332J985R596k0587m1621
$$ 307133 274600 276412 245287 205636 196241 172818 156899 146567 148552 158148 137561 95940
14823I5940j0139K02Q10j319K6666J9754J186j900J003k202n252J0714J6377K994
$$ 95940 85801 86003 86813 85494 112160 131914 133100 131200 132203 130001 124749 135463 151840 154834
14809A54834r528J285j6470P25k885j4031q655L380q79j1455j22J1804J7170j5630
$$ 154834 145306 146591 130121 130846 127961 113930 105275 108655 107776 96321 96199 108003 125173 109543
14795A09543r529O37r125k2059L00J0113p69J923M2783L2624j8095k633J5099
$$ 109543 100014 100651 91526 69467 69767 79880 79111 81034 123817 156441 138346 135713 150812
14782A50812k027J3319k645K911R9l328J4598R373m066j9061q149k4925j7083
$$ 150812 148785 162104 159459 162370 162469 159141 173739 183112 179046 159985 151836 126911 109828
14769A09828L142K5257j0605j3059J590J4555k461n919N379M087K215j1798r883
$$ 109828 112970 138227 127622 114563 116153 130708 128247 122328 127707 131794 134009 122211 112328
14756A12328o089M310P003R184j5692j6804R715J7439j922R870J3043J7746M947
$$ 112328 106239 110549 117552 126736 111044 94240 103955 121394 119472 129342 142385 160131 165078
14743A65078q03k0815j3737j214M235k5750J0744J9977k171q685O031j3091K102
$$ 165078 164275 143460 129723 128509 132744 106994 117738 137715 135544 126859 132890 119799 121901
14730A21901J9167K615j4173o02J9788j3230j7647o80l27N196J4833j8045M334
$$ 121901 141068 143683 129510 128908 148696 135466 117819 117139 116812 122008 136841 118796 123130
14717A23130J5548K2150M735J600j1697p712N708R474P831J6814r138Q692K475
$$ 123130 138678 160828 165563 167163 155466 147754 153462 162936 170767 187581 178443 187135 189610
14704A89610K754M116L70L379j262o48O912J279j0557M942L0344R974J4042Q189
$$ 189610 192364 196480 196850 200229 198967 198319 205231 206510 195953 200895 231239 241213 255255 263444
14690B63444R90j6995j1586j8962l900Q24J348l664M388k806j316o33j0694M232
$$ 263444 264434 247439 235853 216891 212991 213815 215163 211499 215887 213081 211765 211132 200438 204670
14676B04670k06L572J073o829q493J3782K3445L246j3459j1575K82p137J3145
$$ 204670 204464 208036 209109 202280 193787 207569 231014 234260 220801 209226 209508 202371 215516
14663B15516J0757K0276n473j5280J3269K3747Q83R774J5129q88J0135J2337l296
$$ 215516 226273 246549 241076 225796 239065 262812 263695 273469 288598 287710 297845 310182 306886
14650C06886j7107J0560O948J1030K4659J9557p890L736J1800J4733O669K4367
$$ 306886 289779 300339 307287 318317 342976 362533 354643 358379 370179 384912 391581 415948
14638D15948M1362K7083K6366K7207L2422O2803O6556M7693N0512K7071O065o951
$$ 415948 457310 484393 510759 537966 570388 633191 699747 747440 797952 825023 831088 824137
14626H24137n5045n3499m4558m9282n1389n4883n7131l4058j6638k3422k6906
$$ 824137 769092 715593 671035 621753 570364 515481 458350 424292 407654 384232 357326
14615C57326j2876n732R709j1873k2822k5316J448R965Q575k3309j996M922j1362
$$ 357326 344450 338718 348427 336554 313732 288416 289864 299829 308404 285095 283099 288021 276659
14602B76659L493l051L654o034j2559k3539l4612r52j073k0208k8875m7286l6054
$$ 276659 280152 277101 280755 274721 262162 238623 204011 203059 201986 181778 152903 105617 69563
14589F9563k2278k2944j9985J28q378P689L1375L6728J611K2049K4873J3814Q829
$$ 69563 47285 24341 4356 4484 -3894 3795 35170 71898 73509 95558 120431 134245 143074
14576A43074L6312J7625Q049L855K6163q31R65J654L505J2539J1602J6254J6744
$$ 143074 179386 197011 205060 208915 235078 234247 235212 236866 240371 252910 264512 280766 297510
14563B97510q325j896J6404J9504J8870J3972K2852L2207J6549K0823p144O535
$$ 297510 289185 287289 303693 323197 342067 356039 378891 411098 427647 448470 441326 447861
14551D47861O69k888m443J564Q93K1367J5063K3530J0752J2535K2941p38p964
$$ 447861 448530 445642 441199 442763 443656 465023 480086 503616 514368 526903 549844 549106 541142
14538E41142J0685K6768M8713M8480N0441R0867J26883J93933K57715K67550K77587
$$ 541142 551827 578595 627308 675788 726229 817096 943979 1137912 1395627 1663177 1940764
14527A940764K78744K33927J65448R4728k8381j23627j79860k39623k69423k71609
$$ 1940764 2219508 2453435 2618883 2713611 2685230 2561603 2381743 2142120 1872697 1601088
14517A601088k32529k04311j63518j57686r7112o8954m5298l2862Q412K1515N820
$$ 1601088 1368559 1164248 1000730 843044 745932 676978 631680 598818 607230 628745 634565
14506F34565N727J4557K1842K2003P056K2819K2423L7272J1216N032K2067J3320
$$ 634565 640292 654849 676691 698694 705750 728569 750992 788264 799480 804512 826579 839899
14494H39899L154k1117J4280K373k1739j0716k2073o411L127j8001J36q601N183
$$ 839899 843053 821936 836216 838589 816850 806134 784061 777650 780777 762776 762912 754311 759494
14481G59494K8016M1680L2912K1941J6205K9327L3395K2217K2828K7525L7741
$$ 759494 787510 829190 862102 884043 900248 929575 962970 985187 1008015 1035540 1073281
14470A073281K2939K5649M6866M8273K9839N4172M6586M3561M6984K7899K7510
$$ 1073281 1096220 1121869 1168735 1217008 1246847 1301019 1347605 1391166 1438150 1466049 1493559
14459A493559M1708O0271L6105M5332N8644N4073N8224M9639N2102N7873N6555
$$ 1493559 1535267 1595538 1631643 1676975 1735619 1789692 1847916 1897555 1949657 2007530 2064085
14448B064085N3397Q7432J06925J09719J31729J09896J17362J42150J48085J82332
$$ 2064085 2117482 2204914 2311839 2421558 2553287 2663183 2780545 2922695 3070780 3253112
14438C253112J70194J62198J63968J81380K18733K46263K50984K86529L26204
$$ 3253112 3423306 3585504 3749472 3930852 4149585 4395848 4646832 4933361 5259565
14429E259565L62743M35543M77543N59872O97966Q34042J020525J276655J560471
$$ 5259565 5622308 6057851 6535394 7095266 7793232 8627274 9647799 10924454 12484925
14420A2484925J850847K112630K351036K519706K682399K869658L114235L599583
$$ 12484925 14335772 16448402 18799438 21319144 24001543 26871201 29985436 33585019
14412C3585019M545386O158344Q813018J2909920J8781307K6512106L5527849
$$ 33585019 38130405 44288749 53101767 66011687 84792994 111305100 146832949
14405A46832949M4414071N1534736N4443236N1761082M2880143K8121465J0102082
$$ 146832949 191247020 242781756 297224992 348986074 391866217 419987682 430089764
14398D30089764r362536k7063424m0799253m9172938n1815847m9816651m4104139
$$ 430089764 420727228 393663804 352864551 303691613 251875766 202059115 157954976
14391A57954976l6540642k8734374k1530838j5504573j0898286p602606n395925
$$ 157954976 121414334 92679960 71149122 55644549 44746263 37143657 31747732
14384C1747732l995522l113372k646120k387453k223450k075501j892470j693357
$$ 31747732 27752210 24638838 21992718 19605265 17381815 15306314 13413844 11720487
14376A1720487j480495j271661j052869q55691p13230n91743n05684m58152l92101
$$ 11720487 10239992 8968331 7915462 7059771 6346541 5754798 5249114 4790962 4398861
14367D398861l37279l12367k94844k53100k06723k06644j83495j55324j44891
$$ 4398861 4061582 3749215 3454371 3201271 2994548 2787904 2604409 2449085 2304194
14358B304194j16491j01511j04897j10038p5063p2510q0096o2164p2065o2351
$$ 2304194 2187703 2086192 1981295 1871257 1796194 1723684 1643588 1581424 1509359 1447008
14348A447008o3259p7456o3838m4015k5707m7815n7124o1128m9492l0044k1927
$$ 1447008 1383749 1306293 1242455 1198440 1172733 1124918 1067794 1006666 957174 927130 905203
14337I05203l5454l6141l8800k3777k9410o271r274k0342j1352q461l6490j5055
$$ 905203 869749 833608 794808 771031 741621 735350 726076 705734 694382 685921 649431 634376
14325F34376j8478l6985k105q518j7150p507M40k827k2570j6622j2810k4580k9012
$$ 634376 615898 578913 576808 568290 551140 543633 544073 541246 518676 502054 489244 464664 435652
14312D35652k3584l4637l1539n8328n0261k9672j3513p014j1808j0382J3099m713
$$ 435652 412068 377431 345892 287564 237303 207631 194118 187104 175296 164914 178013 173300
14300A73300r262j2541o703J1045K7327P184M1196J7568J9516L0252J3211J3858
$$ 173300 164038 151497 144794 155839 183166 190350 231546 249114 268630 298882 312093 325951
14288C25951J3425k961j0533j6059n1783n6538o8533n4028n7228m7595l5064l3503
$$ 325951 339376 336415 325882 309823 258040 201502 132969 78941 21713 -25882 -60946 -94449
14276i4449k1452R089K5893J3328L5535L6671L5692J8476K6683J6000L288l782
$$ -94449 -115901 -106812 -80919 -67591 -32056 4615 40307 58783 85466 101466 104754 100972
14264A00972r294j2174O99j0319j2854j7278K481l730j2472o722q543j7991l432
$$ 100972 91678 79504 80203 69884 57030 39752 42233 38503 26031 19309 10766 -7225 -10657
14251a0657O279K2059K2452J026q942J492n640j0790j0008k817Q739J5389J5603
$$ -10657 -4378 17681 40133 41159 32217 33709 28069 17279 7271 4454 13193 28582 44185
14238D4185K0104J1608P623O977N245N290J2170K2424n831n676j850N032N291
$$ 44185 64289 75897 83520 90497 95742 101032 113202 135626 129795 124119 122269 127301 132592
14225A32592J9749J3077j0703q825P785J5193J6685m464J4267L1144K4217L0328
$$ 132592 152341 165418 154715 145890 153675 168868 185553 181089 195356 226500 250717 281045
14213B81045J4278Q377L659k1688k2219k5147l9073l0306j5937l5941l3551K825
$$ 281045 295323 303700 307359 285671 263452 238305 199232 168926 152989 117048 83497 86322
14201H6322n178j7518P688j873k7560k1949J2155q404l1672r137O507K1463J11
$$ 86322 81144 63626 71314 69441 41881 19932 32087 23683 -7989 -17126 -10619 10844 10955
14188A0955n260l1887j0361J1028j9218l390L009j1712M907J0473J7539K4037
$$ 10955 5695 -26192 -36553 -25525 -44743 -48133 -45124 -56836 -51929 -41456 -23917 120
14176A20J4893o55O547q098m179j7973j3226J3995L406k1923R237K2585N171k857
$$ 120 15013 14358 20905 12807 8628 -9345 -22571 -8576 -5170 -27093 -17856 4729 9900 7043
14162G043N22j2678p162k1977n853K4001K498j842j0492K657Q142J1927J8708
$$ 7043 7565 -5113 -12275 -34252 -40105 -16104 -13606 -15448 -25940 -23283 -15141 -3214 15494
14149A5494k5210k3513L5189K8185q99J114K757j141j640j6743r03N864K510l547
$$ 15494 -9716 -33229 1960 30145 29246 30360 33117 31976 30336 13593 12690 18554 21064 17517
14135A7517l493j1514j2204j3253l964J174Q978r966k0041L42L944n989k91r211
$$ 17517 14024 2510 -9694 -22947 -26911 -25737 -16759 -26725 -46766 -46424 -42480 -48469 -48760 -57971
14121e7971l836J4316J228r486k986J5206j4479n344J144k1855p506n237J442
$$ -57971 -61807 -47491 -46263 -55749 -58735 -43529 -58008 -63352 -62208 -84063 -91569 -96806 -95364
14108i5364N657n339N102L138M650k896L886P651l976J0558o246j568J4667k114
$$ -95364 -89707 -95046 -89944 -86806 -82156 -85052 -81166 -73515 -77491 -66933 -73179 -74747 -60080 -62194
14094f2194O094J8363J8780r999j3688J3740j906j0730J2888K92l697k988J0211
$$ -62194 -56100 -37737 -18957 -28956 -42644 -28904 -30810 -41540 -28652 -28360 -32057 -35045 -24834
14081b4834J580K873l958j0552O33M537k317J6636K130l319J2416J0745R410J8448
$$ -24834 -23254 -20381 -24339 -34891 -34258 -29721 -32038 -15402 -13272 -16591 -4175 6570 15980 34428
14067C4428j1424l6172k112J2272n578j7754o819R749K1419o564q364k3844J0712
$$ 34428 23004 -13168 -15280 -3008 -8586 -26340 -33159 -23410 -1991 -8555 -16919 -40763 -30051
14054c0051J1965m811k2903J8222L4408K0865j4784j4477r567j955J4851Q206
$$ -30051 -18086 -22897 -45800 -27578 6830 27695 12911 -1566 -11133 -13088 1763 9969
14042I969J080n006k2342l150J3716j5969j2311O668O687N297o791K568l682k1377
$$ 9969 11049 6043 -16299 -19449 -5733 -21702 -34013 -27345 -20658 -15361 -22152 -19584 -23266 -44643
14028d4643J908J7422J3382o872R92J5149J9392n634l1348j381Q766N736o567
$$ -44643 -42735 -25313 -11931 -18803 -17811 -2662 16730 11096 -20252 -21633 -12867 -7131 -13698
14015a3698J153O632j0830N371Q24n765J6152K0462r748k0256l041j3777k0181
$$ -13698 -12545 -5913 -16743 -11372 -10548 -16313 -161 20301 10553 -9703 -12744 -26521 -46702
14002d6702J0583m98J7487P782L429R807j2098K385j49J1900o230j7604j6924
$$ -46702 -36119 -36617 -19130 -11348 -7919 1888 -10210 -7825 -7974 3926 -2304 -19908 -36832
13989c6832L751P756N099m995q635O977L2899J9130N317j6986j1487j1632n291
$$ -36832 -33081 -25325 -20226 -25221 -33856 -26879 6020 25150 30467 13481 1994 -9638 -14929
13976a4929N172J4617J2787k502K1741J5991j8030k3190J500L020K0422L780L2435
$$ -14929 -9757 4860 17647 15145 36886 52877 34847 11657 13157 16177 36599 40379 72814
13963G2814K5694J85N165K2993K1907J9337L3864K8854M0416R0140J02896J27111
$$ 72814 98508 98693 103858 126851 148758 168095 201959 230813 271229 361369 464265 591376
13951E91376J71346K31318K54178K52339K93396K55059J36511O3607j4819j23701
$$ 591376 762722 994040 1248218 1500557 1793953 2049012 2185523 2249130 2234311 2110610
13941B110610k29498k61703k49826k68347k24811k03759j53672j12486o1865k0812
$$ 2110610 1881112 1619409 1369583 1101236 876425 672666 518994 406508 344643 323831
13931C23831k7841Q273L2032M1180O4865M9654K3007J7193L1039K066k3264l0033
$$ 323831 295990 304263 336295 377475 442340 491994 515001 532194 563233 565299 542035 512002
13919E12002l7720l2602p2742q0623o9895o4479m0919q357k8963j9267k234o999
$$ 512002 474282 441680 368938 288315 218420 153941 113022 104665 75702 56435 54201 47202
13907D7202n916j682j8087j3668O436R413l7360k1630j452J505M226J4949j1085
$$ 47202 41286 39604 21517 7849 14285 23698 -13662 -35292 -36744 -35239 -31013 -16064 -27149
13894b7149j3441k207K1000K4211Q247K220K949j5759l1174j2470J3524J8014
$$ -27149 -40590 -42797 -21797 2414 10661 12881 15830 71 -31103 -43573 -30049 -12035
13882a2035R022j0071n777Q692P630j7887m096O210o98j1319m81J323j5590l232
$$ -12035 -3013 -13084 -18861 -10169 -2539 -20426 -24522 -18312 -19010 -30329 -30810 -29487 -45077 -48309
13868d8309J4734j1759j2651M805J2621K1379J1666L253N4M794Q333j5482j0536
$$ -48309 -33575 -45334 -57985 -53180 -40559 -19180 -7514 -4261 -4207 587 8920 -6562 -17098
13855a7098o235k1082n175J3547K3936O620j0353M902l797j0752k322J5179J6286
$$ -17098 -23333 -44415 -49590 -36043 -12107 -5487 -15840 -10938 -14735 -25487 -27809 -12630 3656
13842C656L3354k210l7263j3889j71N686R663q490n140N181j0524K615j0838K009
$$ 3656 37010 34800 -2463 -16352 -16523 -10837 -1174 -9664 -14804 -9623 -20147 -17532 -28370 -26361
13828b6361J1220p382l129M7Q954J9834j1940k7892o852P364K5674J5498q944
$$ -26361 -15141 -22523 -25652 -25605 -16651 3183 -8757 -36649 -43501 -36137 -10463 5035 -3909
13815c909k5811L236J837R216K4235J2585o960L740r925l655j0825j5095j1833
$$ -3909 -29720 -26484 -24647 -15431 8804 21389 14429 18169 8244 4589 -6236 -21331 -33164
13802c3164n456J3620J4056K3537P90m424N985l078p266k6140q848P099m174Q053
$$ -33164 -38620 -25000 -10944 12593 13383 8959 14944 11866 4600 -21540 -30388 -23289 -27463 -19410
13788a9410P231M498n606j6946J464l289O808J1783J3500J1711j6859J716o237
$$ -19410 -12179 -7681 -13287 -30233 -28769 -32058 -25250 -13467 33 11744 -5115 -3399 -9636
13775i636l0070j3637K0109K2914J8827K5503n176Q676J7359j1649o474J0202
$$ -9636 -39706 -53343 -33234 -10320 8507 34010 28834 37510 54869 43220 36746 46948
13763D6948L150k0850R149J2757O834o872Q947Q656k4952j4899j3597Q146J3643
$$ 46948 50098 29248 38397 51154 57988 51116 60063 68719 43767 28868 15271 23417 37060
13750C7060j8273k4987l977l078O775N969l868l837M681j2367j4351J5218n300
$$ 37060 18787 -6200 -10177 -13255 -6480 -511 -4379 -8216 -3535 -15902 -30253 -15035 -20335
13737b0335o196K70l868k544O004K8595M701j3027p312j6639l465K28o094l536
$$ -20335 -26531 -26261 -30129 -32673 -26669 1926 6627 -6400 -13712 -30351 -33816 -33588 -39682 -43218
13723d3218J0457R183n565j4620p400J305L0890J2597j152K000k467j6962j0067
$$ -43218 -32761 -23578 -29143 -43763 -51163 -49858 -18968 -6371 -7523 -5523 -7990 -24952 -35019
13710c5019J952L201r024O251K4106k590j6081L817J021j2253j0652J9907N572
$$ -35019 -33067 -29866 -38890 -32639 -8533 -11123 -27204 -23387 -22366 -34619 -45271 -25364 -19792
13697a9792K738j3524O526K0900O801j1230j7441l422j1L072J3145m317L721R618
$$ -19792 -17054 -30578 -24052 -3152 3649 -7581 -25022 -28444 -28455 -25383 -12238 -16555 -12834 -3216
13683c216j279q328R798J3948j0189j7765j936K213J2262O434P455j1653j234
$$ -3216 -4495 -12823 -3025 10923 734 -17031 -18967 -16754 -4492 1942 9397 -2256 -3490
13670c490P013j3582k3256m088o607j729R772J2801k593Q983p600M090N70k1484
$$ -3490 3523 -10059 -33315 -37403 -44010 -45739 -35967 -23166 -25759 -16776 -24376 -20286 -19716 -41200
13656d1200l077j072J4293p41j5025k196J0381J169l385N421O068R594N911k940
$$ -41200 -44277 -45349 -31056 -31797 -46822 -49018 -38637 -37468 -40853 -35432 -29364 -19770 -13859 -16799
13642a6799N214K6658Q317j1129k9488P1J0711r82M75Q064j2234R61p538M374
$$ -16799 -11585 15073 23390 12261 -17227 -17156 -6445 -7427 -6952 1112 -11122 -10161 -17699 -13325
13628a3325J8568Q480j9123J0810R145l156J1504J718k5315j8144j2703J1981
$$ -13325 5243 13723 -5400 5410 14555 11399 22903 24621 -694 -18838 -31541 -19560
13616a9560J2238o902q405r619N977l010j5070K1874K7916P342J7952K516K2214
$$ -19560 -7322 -14224 -22629 -32248 -26271 -29281 -44351 -22477 5439 12781 30733 33249 55463
13603E5463K1523J8896K1176L1910M5275N4774N3468N8242M5503P6625M2839J5610
$$ 55463 76986 95882 117058 148968 194243 249017 302485 360727 406230 482855 525694 541304
13591E41304p227M447L055l456J2250j1120J8920L9156L3588K6035K4840J3701
$$ 541304 534077 538524 541579 538123 550373 539253 558173 597329 630917 656952 681792 695493
13579F95493l825j2886m6827o2923p5202p2797o9707n5990o4632m3639l7096k5553
$$ 695493 691668 678782 631955 569032 493830 421033 351326 295336 230704 187065 149969 124416
13567A24416l0570P675j6105j5376o688J1441L200q48k6495j5926j1310m25K33
$$ 124416 93846 101521 85416 70040 63352 74793 77993 77145 50650 34724 23414 22989 23222
13554B3222N398j7278k3484P954l924j885k4476j2165M875K5582J0424J4351J1232
$$ 23222 28620 11342 -12142 -4188 -8112 -9997 -34473 -46638 -41763 -16181 -5757 8594 19826
13541A9826j6145l882k492j2858j764K881J5278P768P623L067L584m800j9709
$$ 19826 3681 -201 -2693 -15551 -17315 -14434 844 8612 16235 19302 22886 18086 -1623
13528a623p020j5252J659K5909p647J635j4754k872J9474J1568J588q344P482
$$ -1623 -8643 -23895 -22236 3673 -3974 -2339 -17093 -19965 -491 11077 12665 4321 11803
13515A1803L752k0783l2904N477K2022j3443k896J1020o827J6982J2146L375j1534
$$ 11803 15555 -5228 -38132 -32655 -10633 -24076 -26972 -15952 -22779 -5797 6349 9724 -1810
13502a810J768l133n689M294m779P234n499k186m248k9704n383K0874P513p317
$$ -1810 -42 -3175 -8864 -4570 -9349 -2115 -7614 -9800 -14048 -43752 -49135 -28261 -20748 -28065
13488b8065R199J8382j0359k3843k1568K251J2917J8890J1980Q377M054j0353
$$ -28065 -18866 -484 -10843 -34686 -56254 -54003 -41086 -22196 -10216 -1839 2215 -8138
13476h138p223L218p513O299M514P098j129j0466Q565Q480O942j1574K794R909
$$ -8138 -15361 -12143 -19656 -13357 -8843 -1745 -2874 -13340 -4775 3705 10647 -927 1867 11776
13462A1776r230j3109L165o617m24P609o9j3072o455o877k830Q156J4917Q820
$$ 11776 2546 -10563 -7398 -14015 -14439 -6830 -6899 -19971 -26426 -33303 -36133 -27977 -13060 -4240
13448d240n727K114O648Q112L206j3811j6980j6683J4646m933j2245P37J1799
$$ -4240 -9967 -7853 -1205 6907 10113 -3698 -20678 -37361 -22715 -27648 -39893 -39156 -27357
13435b7357m834K3228K5010k1223N793J1665K691O615j2989m807Q083N839Q26
$$ -27357 -32191 -8963 16047 -5176 617 12282 14973 21588 8599 3792 11875 17714 18540
13422A8540n16J6420K0499M474r549K0180J3271P739K270j30O603j8282l4436
$$ 18540 18024 34444 54943 59417 49868 70048 83319 91058 93328 93198 99801 81519 47083
13409D7083r62j4819o784j1526k5732j4044J4988K1518J2208j3736j8236j4491
$$ 47083 46121 31302 24518 12992 -12740 -26784 -11796 9722 21930 8194 -10042 -24533
13397b4533K073R285j3128K112M734M403R021O777n827l950L844J8084j316r532
$$ -24533 -22460 -13175 -26303 -24191 -19457 -15054 -6033 744 -5083 -9033 -5189 12895 11579 2047
13383B047j6953Q34J5081l737J0044k074J454N98k507j6351j2349k816K3659q113
$$ 2047 -14906 -14072 1009 -2728 7316 5242 6696 7294 4787 -11564 -23913 -26729 -3070 -11183
13369a1183j4392P568K2012o149l322j4028k69K331j5255j0535M655l726J7679
$$ -11183 -25575 -18007 4005 -2144 -5466 -19494 -19763 -17432 -32687 -43222 -38567 -42293 -24614
13356b4614R626M347M683P661j0938j6789Q064N66J7312P767r119J2091O526K439
$$ -24614 -14988 -10641 -5958 1703 -9235 -26024 -17960 -17394 -82 7685 -1434 10657 17183 19622
13342A9622q347j3227o33l083j0624r870j2259J1497J8881O633O835J973J8259
$$ 19622 11275 -1952 -2585 -5668 -16292 -26162 -38421 -26924 -8043 -1410 5425 7398 25657
13329B5657N774j0269j0572l201j4538K739L021q649q22J001q340q075J771J4609
$$ 25657 31431 21162 10590 7389 -7149 -4410 -1389 -10038 -10860 -9859 -18199 -26274 -24503 -9894
13315i894J5850K439O040L719r903O371o082R62p29K074j2970J170j3948k551
$$ -9894 5956 8395 14435 18154 8251 14622 8540 9502 8773 10847 -2123 -953 -14901 -17452
13301a7452k345j3991k2099N186J0107K3675J0226K014m081R123N003m930J035
$$ -17452 -19797 -33788 -55887 -50701 -40594 -16919 -6693 -4679 -8760 363 5366 436 1471
13288A471j640O826L248r346J5032K753l447o025Q362o306r737l051n058q714
$$ 1471 -169 6657 9905 559 15591 18344 14897 8872 17234 10928 1191 -1860 -6918 -15632
13274a5632P648m522j0618j8836j419M964K5505L514n212n874L38J268j0641j4028
$$ -15632 -7984 -12506 -23124 -41960 -43379 -38415 -12910 -9396 -14608 -20482 -20144 -18876 -29517 -43545
13260d3545r138R992K4076j2609m933N738J98j2796K241J806Q664J0295J084l465
$$ -43545 -52683 -42691 -18615 -31224 -36157 -30419 -30221 -43017 -40776 -38970 -30306 -20011 -18927 -22392
13246b2392J3342Q402n675j0860R005j2296l53Q18J7326J9302L780n253j2895
$$ -22392 -9050 -648 -6323 -17183 -8178 -20474 -20827 -20009 -2683 16619 20399 15146 2251
13233B251j1626N936n097J7747J717j4143K809J4987Q700J46k1408j9539r086
$$ 2251 -9375 -3439 -8536 9211 10928 -3215 -406 14581 23281 23427 2019 -17520 -26606
13220b6606M619P848P231k678r0l221K240k6446j5273p583L5262M7497J8486k833
$$ -26606 -21987 -14139 -6908 -9586 -9676 -12897 -10657 -37103 -52376 -59959 -24697 22800 41286 38453
13206C8453J1595J6202K4525J4781J2266K829j1020m496q786j5037j2634p909
$$ 38453 50048 66250 90775 105556 117822 120651 109631 105135 96349 81312 68678 60769
13194F0769q880k1310j5282j0528J963K832j2839Q239P156o491R722N12K397M175
$$ 60769 51889 30579 15297 4769 6732 9564 -3275 4964 12120 5629 15351 15863 18260 22435
13180B2435j5045k2282j4000p350M720L796R039j326j6100J3620O967j3691j9412
$$ 22435 7390 -14892 -28892 -36242 -31522 -27726 -18687 -20013 -36113 -22493 -15526 -29217 -48629
13167d8629J1846J8139J4314J228Q258k831J24j929o353M992N475J0178r216m742
$$ -48629 -36783 -18644 -4330 -3102 5156 2325 2449 520 -5833 -841 4634 14812 5596 854
13153H54J1352m654j3561j6300L066J727J302O819J672k0101P363J0116K0327
$$ 854 12206 7552 -6009 -22309 -19243 -17516 -16214 -9395 -7723 -27824 -20461 -10345 9982
13140I982J8620K803J3421k0893k4256j8282j1485Q237m072O132L25m08N719J8381
$$ 9982 28602 31405 44826 23933 -323 -18605 -30090 -21853 -25925 -19793 -19468 -19876 -14157 4224
13126D224j0641O745P20j0298k7640m911j692J2796Q112K262j0558q574k423M870
$$ 4224 -6417 328 1048 -9250 -36890 -41801 -43493 -30697 -22585 -20323 -30881 -39455 -41878 -37008
13112c7008J6490J3089p141J1140R844K015N856j7925j1108p177O567K0079K1339
$$ -37008 -20518 -7429 -14570 -3430 6414 8429 14285 -3640 -14748 -21925 -15358 4721 26060
13099B6060K822k312k187k2670n478r806k973j1039l234r062j0210J4489K1419
$$ 26060 28882 26570 24383 1713 -3765 -13571 -16544 -27583 -30817 -39879 -50089 -35600 -14181
13086a4181M849p38j8104k2060O475J1730R297R123O911M563L295k84R557k1396
$$ -14181 -9332 -10070 -28174 -50234 -43759 -32029 -22732 -13609 -6698 -2135 1160 876 10433 -10963
13072a0963j1890Q396J9745N572j5561r362O967O323k517K018N762J7892J1794
$$ -10963 -22853 -14457 5288 10860 -4701 -14063 -7096 -773 -3290 -1272 4490 22382 34176
13059C4176n454N536J1801j8248o295k9003k7919j0411j6435J3550J6218Q386
$$ 34176 28722 34258 46059 27811 21516 -7487 -35406 -45817 -62252 -48702 -32484 -24098
13047b4098J5529J3023P860N601P806N258k2124k0372r838R204R521k404J558
$$ -24098 -8569 4454 12314 17915 25721 30979 8855 -11517 -21355 -12151 -2630 -5034 -3476
13034c476m41J3403M33N255J546k529j1127n805m269o524j8064k1272l711J0276
$$ -3476 -3917 9486 9919 15174 16720 14191 3064 -2741 -7010 -13534 -31598 -52870 -56581 -46305
13020d6305P437L1400K8538l2295k9251N120J9874q577m777p401J1767j1516J2353
$$ -46305 -38868 -7468 21070 -11225 -40476 -35356 -15482 -24059 -28836 -36237 -24470 -35986 -23633
13007b3633L2673O820l0083j8996n26N613N325J1638j3390N631J7668R398J1847
$$ -23633 9040 15860 -14223 -33219 -33745 -28132 -22807 -11169 -24559 -18928 -1260 8138 19985
12994A9985J0321o665j5740p629m501J1729j1515j6910q484J0285K3755J4418
$$ 19985 30306 23641 7901 272 -4229 7500 -4015 -20925 -29409 -19124 4631 19049
12982A9049q427n402L917J2827k4127o549J301L405r270O10K213q681j4526o656
$$ 19049 10622 5220 9137 21964 -2163 -8712 -7411 -4006 -13276 -12666 -10453 -19134 -33660 -40316
12968d0316j750J8689Q460m902Q582j3934j0411q182j993K6818j074J941M445
$$ -40316 -42066 -23377 -14917 -19819 -11237 -25171 -35582 -43764 -45757 -18939 -20013 -18072 -13627
12955a3627j902N209J2277L697n044k67r340j0223r7J2223M029q647j1208j3764
$$ -13627 -15529 -10320 1957 5654 610 343 -8997 -19220 -19317 -7094 -3065 -11712 -22920 -36684
12941c6684K855J6952l697J4459L1384M892o804Q314j508m368k447m79j9246j6032
$$ -36684 -33829 -16877 -20574 -6115 25269 30161 23357 31671 30163 25795 23348 22869 3623 -12409
12927a2409q125J2488J0231r500r147k403j391J5665J7027j9339R26M791K426
$$ -12409 -20534 -8046 2185 -7315 -16462 -18865 -20256 -4591 12436 -6903 -5977 -1186 1240
12914A240k82j664q127j4277P661P669j3301j5266K1383O896j0454m206m369J7463
$$ 1240 958 -706 -8833 -23110 -15449 -7780 -21081 -36347 -14964 -8068 -18522 -22728 -27097 -9634
12900i634J5209L314n681j5201k3182R606O630j0847K377J5445O150j9230L774
$$ -9634 5575 8889 3208 -11993 -35175 -25569 -18939 -29786 -27409 -11964 -5814 -25044 -21270
12887b1270O042J6008J6199Q773J1989P473J2082M6447L1994n420j3943r996k7970
$$ -21270 -15228 780 16979 25752 37741 45214 57296 103743 135737 130317 116374 106378 78408
12874G8408k2643j6555m814j824Q312k4863j3686N083j3720R067q410Q888j1816
$$ 78408 55765 39210 34396 32572 40884 16021 2335 7418 -6302 2765 -5645 3243 -8573
12861h573J270j6819l2P178J939p263M591o541J967J7529J0833j2399J233J2146
$$ -8573 -7303 -24122 -24154 -16976 -15037 -22300 -17709 -24250 -22283 -4754 6079 -6320 -5087 7059
12847G059j5337J0882J2180m658O887k72j2493r758p207j3168L742l743k296K4852
$$ 7059 -8278 2604 14784 10126 17013 16741 4248 -5510 -12717 -25885 -22143 -25886 -28182 -3330
12833c330P261j1818M344K9678r553j5801M836k056R752j7048j1043R22L927M359
$$ -3330 3931 -7887 -3543 26135 16582 781 5617 3561 13313 -3735 -14778 -13856 -9929 -5570
12819e570l927J9935l642k5399j7369n617P718J6558k89o453J7140J0451R954
$$ -5570 -9497 10438 6796 -18603 -35972 -41589 -33871 -17313 -17602 -24055 -6915 3536 13490
12806A3490j1445L7N403R506Q619j913q39R948n835J9588o946j9976k1125O947
$$ 13490 2045 2082 7485 16991 25610 23697 22858 32806 26971 46559 39613 19637 -1488 5459
12792E459Q696l72J8643j2571l6726j5426M719J3230O778Q069Q176r912q379J6172
$$ 5459 14155 13783 32426 19855 -16871 -32297 -27578 -14348 -7570 499 8675 -1237 -9616 6556
12778F556r951j2296j5208j9060O87J8767J1839K6369N858n920m328k45j209J3280
$$ 6556 -3395 -15691 -30899 -49959 -49272 -30505 -18666 7703 13561 7641 3313 3068 1859 15139
12764A5139P342k2017j9613o929N328J8702p169j5001n792j0299m335P110J9464
$$ 15139 22481 464 -19149 -26078 -20750 -2048 -9217 -24218 -30010 -40309 -44644 -37534 -18070
12751a8070M276J9038J1542j810j1066J331M378o251p474k146M550R698j231m909
$$ -18070 -13794 5244 16786 14976 3910 5241 9619 3368 -4106 -6252 -1702 7996 6765 1856
12737A856l185J6777j4229j9952j8301J4248J6894J5401J0580m411k143m780n28
$$ 1856 -1329 15448 1219 -18733 -37034 -22786 -5892 9509 20089 15678 13535 8755 8227
12724H227j0937p691j043n003L029R003J6143R670j583j0071P408k98K397k094
$$ 8227 -2710 -10401 -11444 -16447 -13418 -4415 11728 21398 19815 9744 17152 16854 19251 17157
12710A7157m534O796m999j3029o696j2091j0237K3019J0162r561Q641P536J7918
$$ 17157 12623 19419 14420 1391 -5305 -17396 -27633 -4614 5548 -4013 4628 12164 30082
12697C0082J441j7628k4104P776J6490j5157q882J2462K577k7944M906Q091J0263
$$ 30082 31523 13895 -10209 -2433 14057 -1100 -9982 2480 5057 -22887 -17981 -9890 373
12684C73Q530k705P936J3379Q025J0195O371R211L1048K4797J6036K2511M0670
$$ 373 8903 6198 14134 27513 35538 45733 52104 61315 92363 117160 133196 155707 196377
12671A96377N9215J04537K08164M05551K49661j69679j72049j11520j86800j94647
$$ 196377 255592 360129 568293 973844 1223505 1053826 881777 770257 583457 388810
12661C88810j16050n9995n4616o3540l2897j4645P915L262j5675l2102r59n046
$$ 388810 272760 212765 158149 94609 61712 47067 54982 58244 42569 10467 9508 4462
12649D462K0293Q710J2392j5844k1334r213p871K428j647j1953j1478K2632K923
$$ 4462 24755 33465 45857 30013 8679 -534 -8405 -5977 -7624 -19577 -31055 -8423 -5500
12636e500R661J6128L317k2555j0076j694j9283J1854K7126J7041r573p054j0060
$$ -5500 4161 20289 23606 1051 -9025 -10719 -30002 -18148 8978 26019 16446 9392 -668
12623f68m073k821j1779p37o220o347K265N354j3722J2089M516K362R062n073
$$ -668 -4741 -7562 -19341 -20078 -26298 -32645 -30380 -25026 -38748 -26659 -22143 -19781 -10719 -15792
12609a5792M27J667O812k959n511k028K0868J990j0572o372N898K2670J6932Q21
$$ -15792 -15365 -13698 -6886 -9845 -15356 -17384 3484 5474 -5098 -11470 -5572 17098 34030 34851
12595C4851j0815j4864j4579N695r737j3802J906J5630L0417j8620j2452m404
$$ 34851 24036 9172 -5407 288 -9449 -23251 -21345 -5715 24702 6082 -6370 -10774
12583a0774l315L108J0536J357o752n488q679J0997K3510J0096j4660J815N51
$$ -10774 -14089 -10981 -445 912 -5840 -11328 -20007 -9010 14500 24596 9936 11751 12302
12570A2302J691l243n16m497r838j9443l162Q935N060J6170m464K4655J5084k2994
$$ 12302 13993 10750 10234 5737 -4101 -23544 -26706 -17771 -12711 3459 -1005 23650 38734 15740
12556A5740l282J1087J014k2898k8448j9441J0211L83P135J5769N856o590J1108
$$ 15740 12458 23545 24559 1661 -26787 -46228 -36017 -35634 -28499 -12730 -6874 -13464 -2356
12543b356J1615J6012j2303k3154P516P34J394l987j2689P011J5929J0395j5840
$$ -2356 9259 25271 12968 -10186 -2670 -1936 -542 -4529 -17218 -10207 5722 16117 277
12530B77j0755j270L644m743k346K248q037J3339j2259j9447Q696O721n156Q84
$$ 277 -10478 -11748 -8104 -12847 -15193 -12945 -20982 -7643 -19902 -39349 -30653 -23932 -29088 -28204
12516b8204P12P974J2778J7043P405j3877J7o372q195O101P713j263K856J0385
$$ -28204 -27492 -19518 -6740 10303 17708 3831 3848 -2524 -10719 -4618 3095 1832 4688 15073
12502A5073j1999l4991n561n80k946M994K5079J596l2339L768m583R382K9635
$$ 15073 3074 -31917 -37478 -38058 -41004 -36010 -10931 -9335 -41674 -37906 -42489 -33107 -3472
12489c472J3734n897j6184r466j229p575l261m559R372L588k05J7635J2785O347
$$ -3472 10262 4365 -11819 -21285 -22514 -30089 -33350 -37909 -28537 -24949 -25154 -7519 5266 11613
12475A1613M691k755J6014j8348l8555m672K666K1810J7269k095j3023k4155K9423
$$ 11613 16304 13549 29563 11215 -27340 -32012 -29346 -7536 9733 7638 -5385 -29540 -117
12462a17J6888j6641r041R663l016J9264K2684m285p158l182l398O605o800k7232
$$ -117 16771 130 -8911 752 -2264 17000 39684 35399 28241 25059 21661 28266 21466 -5766
12448e766J612K2423j5122l89j974n276J1699K4711j4703q671k509j3501n6R671
$$ -5766 -4154 18269 3147 2758 784 -4492 7207 31918 17215 8544 6035 -7466 -7522 2149
12434B149O906L171K2592K843R578J0196M08K590N593K09K5814J7643L1958M6765
$$ 2149 9055 12226 34818 37661 47239 57435 57843 60433 66026 66235 92049 109692 141650 188415
12420A88415O5201Q2800J76937L14607M42378M70914K99795J1138k21531l03315
$$ 188415 253616 336416 513353 827960 1270338 1741252 2041047 2052185 1830654 1527339
12410A527339l50565l23556k68113j88345j21061p3084n0813l3882l6442j1652
$$ 1527339 1176774 853218 585105 396760 275699 202615 151802 117920 81478 69826
12400F9826j1976m095j2114M209p506M363q868J0548j1988k2715j4963o711J9516
$$ 69826 57850 53755 41641 45850 38344 42707 33839 44387 32399 9684 -5279 -11990 7526
12387G526R198j1426K846O145j0562q356j4538J49J3442P721K768J0830R389K194
$$ 7526 16724 5298 8144 14289 3727 -4629 -19167 -19018 -5576 2145 4913 15743 25132 27326
12373B7326K597j604l116J4705o554k1163m272k042n557R764j1882q441P249O855
$$ 27326 29923 28319 25203 39908 33354 12191 7919 5877 320 10084 -1798 -10239 -2990 3865
12359C865J361p02N065R919J9566j3302j8854p441N695L830O477R598J2776L808
$$ 3865 5226 4524 9589 19508 39074 25772 6918 -523 5172 9002 15479 25077 37853 41661
12345D1661l601j6871Jj5664j5180j7702L677K3301J0479j779j1968m153O987
$$ 41661 38060 21189 21190 5526 -9654 -27356 -23679 -378 10101 8322 -3646 -7799 -812
12332h12o913J969J0942p284N057J5317q141q800m799J0336n736j3043K95J232
$$ -812 -7725 -5756 5186 -2098 2959 18276 10135 1335 -3464 6872 1136 -11907 -11612 -10380
12318a0380Q433J7079K650r155N597N784n274j1999Q300l710Q177K107j7000k6720
$$ -10380 -1947 15132 17782 8627 14224 20008 14734 2735 11035 7325 15502 17609 609 -26111
12304b6111J4701K4480L164o622J4160Q596j6880k9181N880L910j2552K0715R186
$$ -26111 -11410 13070 16234 9612 23772 32368 15488 -13693 -7813 -3903 -16455 4260 13446
12291A3446K578N707L455j2251k2031Q65P666l055J251q084J2468M33j9235Q86
$$ 13446 16024 21731 25186 12935 -9096 -8231 -565 -3620 -2369 -10453 2015 2448 -16787 -15901
12277a5901R648M712P706N282j5957k2147k235L7950K0163N661j2331j5167o418
$$ -15901 -6253 -1541 6165 11447 -4510 -26657 -28892 9058 29221 34882 22551 7384 966
12264I66l0761j6301l788k588K5094N272L662J3198R330o527J467j0499j575l381
$$ 966 -29795 -46096 -49884 -52472 -27378 -22106 -18444 -5246 4084 -2443 -976 -11475 -13050 -16431
12250a6431J539K830J8369L10j7252r014J8801J2201j2069j3200q695K991n540
$$ -16431 -14892 -12062 6307 6617 -10635 -19649 -848 11353 -716 -13916 -22611 -19620 -25160
12237b5160M71m02p775l157L9431L0517J631k7311r95j4306J8433r960j3276N148
$$ -25160 -24689 -25091 -32866 -36023 3408 33925 35556 8245 7250 -7056 11377 1417 -11859 -6711
12223f711R885Q010J5559J2158j8150k1399j1468q530J0947k521k890j968J9220
$$ -6711 3174 11184 26743 38901 20751 -648 -12116 -20646 -9699 -12220 -15110 -17078 2142
12210B142J2645j2876J711r435k1824j2600M42J1177J1397j0119p645J3413J7519
$$ 2142 14787 1911 3622 -5813 -27637 -40237 -39795 -28618 -17221 -27340 -34985 -21572 -4053
12197d053N772j8808m084J5302l821L693k609r452n471K417j1192J410J5249J5311
$$ -4053 1719 -17089 -21173 -5871 -9692 -5999 -8608 -18060 -23531 -21114 -32306 -30896 -15647 -336
12183c36N44l41M406l430n892j3653J296J2126J2941r331j3778J6916j1532m531
$$ -336 208 -133 4273 843 -5049 -18702 -17406 -5280 7661 -1670 -15448 1468 -10064 -14595
12169a4595q379l948L684k00j0566n359J6330j516J0388l504J7034j147j4795
$$ -14595 -22974 -26922 -23238 -23438 -34004 -39363 -23033 -24549 -14161 -17665 -631 -1778 -16573
12156a6573j6394l491j2536p948J9740J9685l708J3130J7742R78k7870o115J0879
$$ -16573 -32967 -36458 -48994 -56942 -37202 -17517 -21225 -8095 9647 10625 -17245 -23360 -12481
12143a2481J0895M760j7851p886J4313J4316J0798J707K683o039k4143n58P014
$$ -12481 -1586 3174 -14677 -22563 -8250 6066 16864 18571 21254 15215 -8928 -9486 -2472
12130b472K600p198O860J453J5440j0993O070j2654J4288M951j6908K919R750
$$ -2472 128 -7070 -210 1243 16683 5690 11760 -894 13394 18345 1437 4356 14106
12117A4106K898j0189p799o355J2735K4420M198j026o185P865M554m862k1122
$$ 14106 17004 6815 -984 -7339 5396 29816 34014 32988 26803 34668 39222 34360 13238
12104A3238k626n606r303J4695j4820k3446J3457m182M657J0490O866O615j564
$$ 13238 10612 5006 -4297 10398 -4422 -27868 -14411 -18593 -13936 -3446 3420 10035 8471
12091H471o750J5025k874j5793m606q049j3305O054J2860j5038N431M474J1712
$$ 8471 1721 16746 13872 -1921 -6527 -14576 -27881 -21827 -8967 -24005 -18574 -14100 -2388
12078b388K2838k86q480j5850p725O135l404j224R520q855j5100l568m129P398
$$ -2388 20450 20164 11684 -4166 -11891 -5756 -9160 -10384 -864 -9719 -24819 -28387 -32516 -25118
12064b5118p3J8415J9310r132j1250M950M325n215p532m195K914j965Q934N653
$$ -25118 -25191 -6776 12534 3402 -7848 -2898 1427 -3788 -11320 -15515 -12601 -14566 -5632 21
12050B1j710k1395k4786O182Q268n569R368K5586N342K484P411m082M80j2773
$$ 21 -1689 -23084 -47870 -41688 -33420 -38989 -29621 -4035 1307 3791 11202 7120 7600 -5173
12036e173l56j1412j4927J0363o896K179J0506Q55Q636L0312p192p589p040Q22
$$ -5173 -5529 -16941 -31868 -21505 -28401 -26222 -15716 -14861 -6225 24087 16895 9306 2266 3088
12022C088K2890O2342P9374P6787K1m5492k2353k9280p3123l5436l4006k8661
$$ 3088 25978 88320 167694 244481 244502 199010 176657 147377 74254 38818 4812 -23849
12010b3849n032K1046m534j3127J9206j600K952l410L606Q139m542j7016P919
$$ -23849 -28881 -7835 -12369 -25496 -6290 -7890 -4938 -8348 -4742 3397 -1145 -18161 -10242
11997a0242l391J048j242K544M771K4588j1841l1524q135j4339K412R203R987
$$ -10242 -13633 -12585 -13827 -11283 -6512 18076 6235 -25289 -33424 -47763 -45351 -36148 -26161
11984b6161K1421j576J8467l158l5086m369K8081J5030r01J3014j776k3162J691
$$ -26161 -4740 -6316 12151 8993 -26093 -30462 -2381 12649 11748 24762 22986 -176 1515
11971A515R25N503k1935j0283q838J9468J2621j1819N041m771m532Q622m970N433
$$ 1515 2440 7943 -13992 -24275 -33113 -13645 -1024 -12843 -7802 -12573 -17105 -8483 -13453 -8020
11957h020J2657R496r128n02M767O340j0202L073J224Q332k0844j7833J2553l102
$$ -8020 4637 14133 5005 4503 9270 15610 5408 8481 9705 18037 -2807 -20640 -8087 -11189
11943a1189K193j7129o755O850J6475J3307q762K70j1354J136k041J864J3192
$$ -11189 -8996 -26125 -32880 -26030 -9555 3752 -5010 -4740 -16094 -14958 -16999 -15135 -1943
11930a943q720m788k059M031J8061J993j5200j040j3667J6247N595j553j4758
$$ -1943 -10663 -15451 -17510 -13479 4582 6575 -8625 -9665 -23332 -7085 -1490 -3043 -17801
11917a7801n233Q851J4600r212R066j5907l114m695j1496N291J1762J310M119
$$ -17801 -23034 -14183 417 -8795 271 -15636 -18750 -23445 -34941 -29650 -17888 -16578 -12459
11904a2459m501l913O265K941J5873J8351m485o073j3689k0074j2210K750J7666
$$ -12459 -16960 -20873 -14608 -11667 4206 22557 18072 11999 -1690 -21764 -33974 -31224 -13558
11891a3558N888k054j5250K845J0921J3815J649j7808q546J1542M855m862J9738
$$ -13558 -7670 -9724 -24974 -22129 -11208 2607 4256 -13552 -22098 -10556 -5701 -10563 9175
11878I175j0939k4880R558j2993j6006J2895J3157K2355n799l72P080o683j8134
$$ 9175 -1764 -26644 -17086 -30079 -46085 -33190 -20033 2322 -3477 -3849 3231 -3452 -21586
11865b1586p289J5146P993J6763K4084j6535m891J1772K584R647l1155o320N090
$$ -21586 -28875 -13729 -5736 11027 35111 18576 13685 25457 28041 37688 6533 213 5303
11852E303n593m57j914k572N680J4841K712q39p282j1848o260P63m260M993K7416
$$ 5303 -290 -747 -2661 -5233 447 15288 18000 17161 9879 -1969 -8229 -7466 -11726 -6733 20683
11837B0683N576j3448j6345r458J2332Q94r908n090n908j2184p310k047K3829
$$ 20683 26259 12811 -3534 -12992 -660 234 -9674 -14764 -20672 -32856 -40166 -42213 -18384
11824a8384N229L673K2j6388j6618L6096J9251J6494j02l3808N74J155j7179J2515
$$ -18384 -13155 -9482 -9460 -25848 -42466 -6370 12881 29375 29273 -4535 -3961 -2806 -19985 -7470
11810g470N365j0185j358M948Q825K7747l489j3324l180l995k538J8517k863j4768
$$ -7470 -2105 -12290 -13648 -8700 125 27872 24383 11059 7879 3884 1346 19863 17000 2232
11796B232j0678M48P609M123o518p024j0992J1049P988j336k3837k580Q170q92
$$ 2232 -8446 -7998 -389 3734 -2784 -9808 -20800 -9751 -1763 -3099 -26936 -29516 -21346 -22238
11782b2238K5689L1704j2626o833m128j803k81k4269r702l622K306L949Q495m506
$$ -22238 3451 35155 22529 15696 11568 9765 9484 -14785 -24487 -28109 -25803 -21854 -13359 -17865
11768a7865k0564j0898J7272L2273p46j2710m803l981O442J5944k1377J1189k397
$$ -17865 -38429 -49327 -32055 218 -528 -13238 -18041 -22022 -15580 364 -21013 -9824 -12221
11755a2221l591l119K215J0656r33j5321N747J1590M184N343k8863j655K4098
$$ -12221 -15812 -18931 -16716 -6060 -6993 -22314 -16567 -4977 -793 4550 -24313 -25968 -1870
11742a870L3269N65l0533j8376Q142J433l279j2855p085Q781N000M565J0836J0144
$$ -1870 31399 31964 1431 -16945 -8803 -7370 -10649 -23504 -30589 -21808 -16808 -12243 -1407 8737
11728H737j4373k086K90J5416L383J9309m52J1476o508j6682J1945j283k2251
$$ 8737 -5636 -7722 -7432 7984 11367 30676 30224 41700 35192 18510 30455 29172 6921
11715F921l1078j587P258K472J6873J3894L765M561j4011q305J9756j1396R287
$$ 6921 -24157 -25744 -18486 -16014 859 14753 18518 23079 9068 763 20519 9123 18410
11702A8410P6j8280r414R988n600j8588M208J0313n76n201n729Q986K5080j0535
$$ 18410 18486 206 -9208 780 -4820 -23408 -19200 -8887 -9463 -14664 -20393 -11407 13673 3138
11688C138m918j2760O923m120O288lj2614L351K7747J7032k3746j5082O043P023
$$ 3138 -1780 -14540 -7617 -11737 -5449 -5452 -18066 -14715 13032 30064 6318 -8764 -2721 4302
11674D302J5941J6710l0186j3710j1032o069J2069j0437j3299n866q352L838J9741
$$ 4302 20243 36953 6767 -6943 -17975 -24044 -11975 -22412 -35711 -41577 -49929 -46091 -26350
11661b6350Q90j5134J1595R481N143J5662k1143m51R340n555P386J3014R899J2413
$$ -26350 -25460 -40594 -28999 -19518 -14375 1287 -19856 -20307 -10967 -16522 -9136 3878 13777 26190
11647B6190l955k1993k0500k757J7397K7714J1304o383q905l917m521J263J2277
$$ 26190 22235 242 -20258 -23015 -5618 22096 33400 27017 18112 14195 9674 10937 23214
11634B3214J3077M731j5311k009j5375j3474J0995J5965N11l6329j9163O629K3632
$$ 23214 36291 41022 25711 23702 8327 -5147 5848 21813 22324 -14005 -33168 -26539 -2907
11621b907q26k450l870j3836p230N654J2420K0394O807k480n911j3425J80J4093
$$ -2907 -3733 -6183 -10053 -23889 -31119 -25465 -13045 7349 14156 11676 5765 -7660 -7480 6613
11607F613o353j4079k487p209Q012J016J1371j371j4797J8184J8333q19j3273
$$ 6613 260 -13819 -16306 -23515 -15503 -14487 -3116 -4487 -19284 -1100 17233 16414 3141
11594C141j1802M770J1835p514j2373K0540k429j6322R723K3938L004q589k5681
$$ 3141 -8661 -3891 7944 430 -11943 8597 6168 -10154 -431 23507 26511 17922 -7759
11581g759k6904M513K3928J7163k4053k6342Q856K6662O196o840j335j938K388
$$ -7759 -34663 -30150 -6222 10941 -13112 -39454 -30598 -3936 2260 -4580 -5915 -7853 -5465
11568e465j3060k75j438L0354K0772N985q79j1390k3412q711O6K1119J5490q257
$$ -5465 -18525 -18800 -20238 10116 30888 36873 35994 24604 1192 -7519 -7453 13666 29156 20899
11554B0899m341m029J029r343j8104k823O29n204L477K3461r192o588J4167Q583
$$ 20899 16558 12529 13558 4215 -13889 -16712 -16083 -21287 -17810 5651 -3541 -10129 4038 12621
11540A2621o878j9277q928P062M1597J8380k3538q631J059q866k1019K500R956
$$ 12621 5743 -13534 -22462 -15400 26197 44577 21039 12408 13467 4601 -16418 -13918 -3962
11527c962N79p820k1617L57J429J814R745L853M726j3769j1743Q467K5096l073
$$ -3962 -3383 -11203 -32820 -32463 -31034 -29220 -19475 -15622 -10896 -24665 -36408 -27941 -2845 -5918
11513e918j3420M23l093J2525J2420j5225m840J7625Q00l454J159J0534P039p069
$$ -5918 -19338 -18915 -22008 -9483 2937 -12288 -17128 497 1297 -2157 -998 9536 16575 9506
11499I506k6424k633L645K6671Q193p539m753m063q024J7884K925k4751j4416
$$ 9506 -16918 -19551 -15906 10765 18958 11419 6666 2603 -5421 12463 15388 -9363 -23779
11486b3779K880J0981o933J7209J2061J2790q636q527O598J7493n502r041o574
$$ -23779 -20899 -9918 -16851 358 12419 25209 16573 8046 14644 32137 26635 17594 11020
11473A1020J896j2508q140j304M253j8497m557O77P921K6074K643p350l745P515
$$ 11020 12916 408 -7732 -9036 -4783 -23280 -27837 -27160 -19239 6835 9478 2128 -1617 5898
11459E898M759N533j2127l975j292p142k486N806l405j0690P534J1955m114j1618
$$ 5898 10657 16190 4063 88 -1204 -8346 -10832 -5026 -8431 -19121 -11587 368 -3746 -15364
11445a5364j0455j0763L905k190J0114J8342K0066j5502j2998N177P358J4873
$$ -15364 -25819 -36582 -32677 -34867 -24753 -6411 13655 -1847 -14845 -9668 -2310 12563
11433A2563j6347j347J8517J3823j929j7453p249l934P957M106l8910m356L3628
$$ 12563 -3784 -5131 13386 27209 25280 7827 578 -3356 4601 8707 -30203 -34559 -931
11420i31K2136J833j1906j4J0148O134j8283P474P412P409k016l6715j3916J2264
$$ -931 21205 23038 11132 11118 21266 27400 9117 16591 24003 31412 29396 -7319 -21235 -8971
11406h971l308r076n421j6468J2984R548J7297K61j1923n677O340J0910Q579q531
$$ -8971 -12279 -21355 -26776 -43244 -30260 -20712 -3415 -3154 -15077 -20754 -14414 -3504 5075 -3456
11392c456k624K0171K0946Q302L6942O0613Q7698Q9562l9553o4915n1541l7180
$$ -3456 -6080 14091 35037 43339 80281 140894 228592 318154 278601 213686 162145 124965
11380A24965m4782l3833j7336j2733o017j972L091N326J60M966o986k002j3253
$$ 124965 80183 46350 29014 16281 10264 8292 11383 16709 16869 21835 14849 12847 -406
11367d06M643O080m492K992j1236j9723k3739M040J9842O199q193j469J806n087
$$ -406 4237 10317 5825 8817 -2419 -22142 -45881 -41841 -21999 -15800 -23993 -25462 -23656 -28743
11353b8743o732m698O80J2956N369L663R422J02j2009q563P37M217J5338Q08o257
$$ -28743 -35475 -40173 -39493 -26537 -21168 -17505 -8083 -7981 -19990 -28553 -27816 -23599 -8261 -7453 -13710
11338a3710p19M414M317J0685K959o185j5964L769K0608N876J0696L424j5965
$$ -13710 -14429 -10015 -5698 4987 7946 1761 -14203 -10434 10174 16050 26746 30170 14205
11325A4205q153Q278J4036m65j1392q554J804J4846j8893n090R114L74M567Q120
$$ 14205 6052 14330 28366 27901 16509 7955 9759 24605 5712 622 9736 10110 14677 22797
11311B2797j810p067p755k8414n022K8350R743K074M348N244L478q071j3776j5226
$$ 22797 20987 13920 6165 -22249 -27271 1079 10822 12896 17244 22488 25966 17895 4119 -11107
11297a1107n154k349M721O174k398k914q030q254K642J3155m333n170K88j975
$$ -11107 -16261 -18610 -13889 -7715 -10113 -13027 -21057 -29311 -26669 -13514 -17847 -23017 -22729 -24704
11283b4704l130L162K2906J6921l900r059l0211k137l13J571j0941O210O079J6029
$$ -24704 -27834 -24672 -1766 15155 11255 2196 -28015 -30152 -30465 -28894 -39835 -33625 -27546 -11517
11269a1517K4315p776l4473K02Q017P86J7709K5089Q568j6424q934Q209j2335
$$ -11517 12798 5022 -29451 -29249 -21232 -20446 -2737 22352 30920 14496 5562 13771 1436
11256A436j6435P551K4632j809j0021m622K126L05J072p390N289Q045j519j4785
$$ 1436 -14999 -7448 17184 15375 5354 732 2858 3163 4235 -3155 2134 10179 8660 -6125
11242f125j5081J8958J4999J2556j604j4175n041O201Q35l85k9359j9451K6219
$$ -6125 -21206 -2248 12751 25307 23703 9528 4487 10688 11523 11138 -18221 -37672 -11453
11229a1453J5668j781R0N978l882N998n71j2363O935K0387K389m176r098K0527
$$ -11453 4215 2434 2524 8502 4620 10618 10047 -2316 4619 25006 27395 23219 14121 34648
11215C4648R611j9727k3998j9861K3514J1490k893k557j4606q895J7899M319o364
$$ 34648 44259 24532 534 -19327 4187 15677 12784 10227 -4379 -13274 4625 8944 2580
11202B580k207p329j6532K46n059R714J3151n434p657J4714J5680Q528J2128p2
$$ 2580 373 -6956 -23488 -23242 -28301 -18587 -5436 -10870 -18527 -3813 11867 20395 32523 32451
11188C2451k4593k0302k1237k045J5066L512J2011J6117M978M031J0577p358n392
$$ 32451 7858 -12444 -33681 -35726 -20660 -17148 -5137 10980 15958 19989 30566 23208 17816
11175A7816n386q975p737J5095Q264J854l340J6552k548q345j4106j7925L246
$$ 17816 12430 3455 -4282 10813 19077 20931 17591 34143 31595 23250 9144 -8781 -5535
11162e535K2491q272k382m777j9658K2888j0536j4789M636p760j34N804K4115
$$ -5535 16956 8684 6302 1525 -18133 4755 -5781 -20570 -15934 -23694 -23828 -18024 6091
11149F091K5504N532k6962k7018J1601J0581m388n412n535j469J2124n2j3797
$$ 6091 31595 37127 10165 -16853 -5252 5329 941 -4471 -10006 -11475 649 597 -13200
11136a3200q883J91J3179K328Q527J0694r453L99K1220O062J1744j134q220m538
$$ -13200 -22083 -21892 -8713 -6385 2142 12836 3383 3782 25002 31064 42808 41674 33454 28916
11122B8916k3619j2808p184q41J715O850M54J7964J0350L349k460o550N848j1692
$$ 28916 5297 -7511 -14695 -15536 -13821 -6971 -6517 11447 21797 25146 22686 16136 21984 10292
11108A0292l4193j9639K9970O037n041J9290m73J092J1826p772J2589j7643j7036
$$ 10292 -23901 -43540 -13570 -7533 -12574 6716 6243 7335 19161 11389 23978 6335 -10701
11095a0701j5481q269P069J3100P269n909J3342J3784p467j0066p700q018n660
$$ -10701 -26182 -34451 -27382 -14282 -7013 -12922 420 14204 6737 -3329 -11029 -19047 -24707
11082b4707O33P862J5876K649l54L862j7347J3760k04q422l023O57n128Q228K672
$$ -24707 -24074 -16212 -336 2313 1959 5821 -11526 2234 2030 -6392 -9415 -8758 -13886 -5658 -2986
11067b986M555M989n131j4356J3953M209j7620N888m902J8840m099k1516L710
$$ -2986 1569 6558 1427 -12929 1024 5233 -12387 -6499 -11401 7439 3340 -18176 -14466
11054a4466j535N227p852L866K8368J0215J2768M617l908j3657k2513j7345J14
$$ -14466 -16001 -10774 -18626 -14760 13608 23823 36591 41208 37300 23643 1130 -16215 -16101
11041a6101J6765L786k532M214q144j1362j2063J4187o93Q754j3624L477m343
$$ -16101 664 4450 1918 6132 -2012 -13374 -25437 -11250 -11943 -3189 -16813 -13336 -17679
11028a7679j2391j957K9121R069R299k838j489J2031J464L986r790l4192L095
$$ -17679 -30070 -32027 -2906 6163 15462 12624 11135 23166 24630 28616 18826 -15366 -12271
11015a2271L1989K5798P94p887k3856j1879j1608P05N035k1258m00j1385J5317
$$ -12271 19718 45516 46310 38423 14567 2688 -8920 -8215 -3180 -24438 -24838 -36223 -20906
11002b0906J2117M673L491m602N742K2455l285j0138p084j681R181J1799j7758
$$ -20906 -8789 -4116 -625 -5227 515 22970 19685 9547 2463 782 9963 21762 4004
10989D004j9115Q6j2830j49K3068K1787L438j0869J0726K354k3453P913M756k380
$$ 4004 -15111 -15025 -27855 -28004 -4936 16851 20289 9420 20146 22500 -953 6960 11716 9336
10975I336P042n339N520J8889j0263M04j3414l7929j7572K1962K8027j362p379
$$ 9336 16378 11039 16559 35448 25185 25589 12175 -25754 -43326 -21364 6663 5301 -2078
10962b078j9154R916J3605k950J2805L448l456p264o920k977l062J389Q304j6756
$$ -2078 -21232 -11316 2289 -661 12144 15592 12136 4872 -2048 -5025 -8087 -6698 1606 -15150
10948a5150k6249K2427J1614J4653k601j0382J6092J1158j1884m337j556L572
$$ -15150 -41399 -18972 -7358 7295 4694 -5688 10404 21562 9678 5341 3785 7357
10936G357J5164K016j978p928k7387j5527K0473J1612K860o101j8496o695J2416
$$ 7357 22521 24537 22559 14631 -12756 -28283 -7810 3802 6662 561 -17935 -24630 -12214
10923a2214J3737L528Q331j0294k1326j6787j231K3700N979Q824n215j6201k1524
$$ -12214 1523 5051 13382 3088 -18238 -35025 -36256 -12556 -6577 2247 -2968 -19169 -40693
10910d0693l550K1155L1244K9745j9182n945q948k4194j8631N883J0172J3959
$$ -40693 -44243 -23088 8156 37901 18719 12774 3826 -20368 -38999 -33116 -22944 -8985
10898h985J9437L61N451j8873q385Q250R134N902o326J874J2204O320m771O015
$$ -8985 10452 10813 16264 -2609 -10994 -2744 6390 12292 5966 7840 20044 26364 21593 27608
10884B7608n531j7093k1780J6917L2853M598O204k7524k7709m970P740Q371k100
$$ 27608 22077 4984 -16796 121 32974 37572 43776 16252 -11457 -16427 -8687 -316 -2416
10871b416J4609J0132j1818j3628j8126M737J6594j089p09j123M165r597j170
$$ -2416 12193 22325 10507 -3121 -21247 -16510 84 -1005 -1714 -2837 1328 -8269 -9439
10858i439r016j4757J6709J9870J2481J1242j5141j4981N196R729p981j3626j453
$$ -9439 -18455 -33212 -16503 3367 15848 27090 11949 -3032 2164 11893 3912 -9714 -11167
10845a1167j1433j55J8627J0574M786o499L666l5468r376P459N206K5586j953
$$ -11167 -22600 -22755 -4128 6446 11232 4733 8399 -27069 -36445 -28986 -23780 1806 -147
10832a47L42j1269o226k147K639l148L178J1638j3641J4126J8729R34j601n553
$$ -147 195 -11074 -17300 -19447 -16808 -19956 -16778 -5140 -18781 -4655 14074 15008 13407 7854
10818G854O901P363J0926J998k9504j0610p820O718L567m29P832K0805K727k866
$$ 7854 14755 22118 33044 35042 5538 -5072 -12892 -6174 -2607 -3036 4796 25601 28328 25462
10804B5462J387L376p013j4480O347O42o520n500O508P091q578L138K147n381
$$ 25462 26849 30225 23212 8732 15079 15721 9201 3701 10209 17300 8722 11860 14007 8626
10790H626M172o797k0401j9403O352J0518P222L397J4116L964O61q044L31m583
$$ 8626 12798 6001 -14400 -33803 -27451 -16933 -9711 -6314 7802 11766 12427 4383 4714 131
10776A31P862o294k6199j1656o504Q968J7583O778j1443j1198J5417P019R47Q217
$$ 131 7993 1699 -24500 -36156 -42660 -33692 -16109 -9331 -20774 -31972 -16555 -9536 -8589 -372
10762c72L607N271J0750J5400K379p909N712j9533j2716n194K390Q279k3011j9398
$$ -372 3235 8506 19256 34656 37035 29126 34838 15305 2589 -2605 -215 8064 -14947 -34345
10748c4345J4873J5718J2149P278r403p752k286Q368m250k646P549j2199j1729
$$ -34345 -19472 -3754 8395 15673 6270 -1482 -3768 4600 350 -2296 5253 -6946 -18675
10735a8675J1389J1282n239j1545j6545K285J4706L217j598M496K63O18O493j1045
$$ -18675 -7286 3996 -1243 -12788 -29333 -27048 -12342 -9125 -10723 -6227 -5964 -5346 1147 -9898
10721i898m03R415J4509j0019j409p339p208Q320q385M028J2418K214r079J542
$$ -9898 -10301 -886 13623 3604 2195 -5144 -12352 -4032 -12417 -8389 4029 6243 -2836 -1294
10707a294O887k658j3243J809R023j291J2390k837o990m881j2113n149P55K887
$$ -1294 5593 2935 -10308 -8499 524 -767 11623 8786 1796 -3085 -15198 -20347 -19592 -16705
10693a6705J183L11K2546Q344k1937K3748o685l6770J9364J5928Q642m515j1242
$$ -16705 -15522 -15211 7335 15679 -6258 17490 10805 -25965 -6601 9327 17969 13454 2212
10680B212O123j647q189j5728j3145O577K6700K0336R50n201m137J1871M002j3359
$$ 2212 8335 6688 -1501 -17229 -30374 -23797 2903 23239 24189 18988 14851 26722 30724 17365
10666A7365o453J3431J8812o271j1200l692p554J1736P356k1452o46j2083k2011
$$ 17365 10912 24343 43155 36884 25684 21992 14438 26174 33530 12078 11432 -651 -22662
10653b2662k3939J7263K5736R816M129M204J219N87m589j8782M277P963k1625
$$ -22662 -46601 -29338 -3602 6214 10343 14547 15766 16353 11764 -7018 -2741 5222 -16403
10640a6403Q370J5011L970m39l338O200j549r614j171J344j4399j862J1690J0389
$$ -16403 -8033 6978 10948 10509 7171 13371 11822 2208 1037 2381 -12018 -13880 -2190 8199
10626H199N800r559J812O133J2233r330j249j9553k4391J8819J6961K7792p401
$$ 8199 13999 4440 6252 12385 24618 15288 14039 -5514 -29905 -11086 5875 33667 26266
10613B6266m66J1125j0332N885J222O00J450j7037l610R628L378O109j6608j0642
$$ 26266 25800 36925 26593 32478 33700 34300 35750 18713 15103 24731 28109 34218 17610 6968
10599F968O877Q349J4887R115o534j2406k4463J1014j8445o648J744j0600J3005
$$ 6968 13845 22194 37081 46196 39662 27256 2793 13807 -4638 -11286 -9542 -20142 -7137
10586g137N897o466Q62n350j4886M451K3809J0248j1373q545J7442k915N332O406
$$ -7137 -1240 -7706 -6844 -12194 -27080 -22629 1180 11428 55 -8490 8952 6037 11369 17775
10572A7775j0023j1474p902r294K751L4K0563K37l773J3857K540P803r21J5896
$$ 17775 7752 -3722 -11624 -20918 -18167 -18133 2430 2667 -1106 12751 15291 23094 22173 38069
10558C8069l620k2294l415J2524P685N360j4937J2700l280n489M11l546k824P526
$$ 38069 34449 12155 8740 21264 28949 34309 19372 32072 28792 23303 23714 20168 17344 24870
10544B4870j500R06k3891r922k267Q602J073j1947p428L377J2184J006j3523j692
$$ 24870 23370 24276 385 -9537 -11804 -3202 -2129 -14076 -21504 -18127 -5943 -4937 -18460 -20152
10530b0152k222L852J6945P145O54N323N579J4144o258n417k1264m161J3107J5821
$$ -20152 -22374 -18522 -1577 5568 6222 11545 17124 31268 25010 19593 -1671 -5832 7275 23096
10516B3096j0663O547N572m44m831j6026q70R707M941J5805k815j4806J287L160
$$ 23096 12433 18980 24552 24108 19277 3251 2381 12088 17029 32834 30019 15213 16500 19660
10502A9660j334M610k325o168K465o552N325J2552j2643o937P438K3844k162j2453
$$ 19660 18326 22936 20611 14443 16908 10356 15681 28233 15590 8653 16091 39935 37773 25320
10488B5320j4873l3516j1122K1804n609M565P052q196R943j3129L509p751K216
$$ 25320 10447 -23069 -34191 -12387 -17996 -13431 -6379 -14575 -4632 -17761 -14252 -22003 -19787
10475a9787o210p330J0418Q120R422K005J3083P939l577p430K474Q534J7508M257
$$ -19787 -25997 -33327 -22909 -14789 -5367 -3362 9721 17660 14083 6653 9127 17661 35169 39426
10461C9426l832j4049p102K156n324K681j790k208k1100J709J5447M582L482K748
$$ 39426 35594 21545 14443 16599 11275 13956 12166 9958 -11142 -9433 6014 10596 14078 16826
10447A6826J2087J111J836n905k2470j4770o953J8010M812j3982j782L148K3K7832
$$ 16826 28913 30024 31860 25955 3485 -11285 -18238 -228 4584 -9398 -11180 -8032 -8009 19823
10433A9823L3225k85k2027l1232m655O210p048o290N17q02J2333J8012o019j117
$$ 19823 53048 52763 30736 -496 -5151 1059 -5989 -12279 -11762 -12564 -231 17781 11762 10645
10419A0645Q41p907n677Q153P583k4132j6201O450J1313J4618P929j2117j747
$$ 10645 11486 3579 -2098 6055 13638 -10494 -26695 -20245 -8932 5686 13615 1498 -249
10406b49N882l276l862J5763p556j1606R823L0576j867J2952m472R459n64j0919
$$ -249 5633 2357 -1505 14258 6702 -4904 4919 35495 33628 46580 42108 51567 51003 40084
10392D0084r196R353j1431k0497j1684K415J081j0743J2060K3929J0346j0712
$$ 40084 30888 40241 28810 8313 -3371 -956 125 -10618 1442 25371 35717 25005
10380B5005p80l193m979J813p436p729k192j3141n370J0530Q747j7842J6112J8275
$$ 25005 24225 21032 16053 17866 10430 2701 509 -12632 -18002 -7472 1275 -16567 -455 17820
10366A7820K316M24r916O309K688j0280j807J5596p602j9788N168k505O069r84
$$ 17820 20136 20560 10644 16953 19641 9361 7554 23150 15548 -4240 928 -1577 4492 3508
10352C508j1790l367J1554J5920J5321N379j3867j9389K425P266j6668P298J4038
$$ 3508 -8282 -11649 -95 15825 31146 36525 22658 3269 5694 12960 -3708 3590 17628
10339A7628Q922j2055K115P91J3081j1400r9J0996l71J7166N116k2494j7210P792
$$ 17628 26550 14495 16610 17401 30482 19082 18983 29979 29608 46774 51890 29396 12186 19978
10325A9978J422k6467Q22J2254p095R147N768j795P557Q416r063N241N898j8464
$$ 19978 21400 -5067 -4245 8009 914 10061 15829 14034 21591 30007 20944 26185 32083 13619
10311A3619M133J1435j399r562j0760n727J2679J6098O575L965m727J836K948
$$ 13619 17752 29187 27788 18226 7466 1739 14418 30516 37091 41056 36329 38165 41113
10298D1113l2567j7794j5806O133j62J6076J5711Q014K010m078O219P214l517
$$ 41113 8546 -9248 -25054 -18921 -19083 -3007 12704 20718 22728 18650 24869 32083 28566
10285B8566M27M672l344j4678R771L022r469J1224j9241M923K3054j3859r339
$$ 28566 28993 33665 30321 15643 25414 28436 18967 30191 10950 15873 38927 25068 15729
10272A5729J9057l148J396j2910j1888m568J6135J2200J1759k3549k171Q232K705
$$ 15729 34786 31638 33034 20124 8236 3668 19803 32003 43762 20213 18042 26274 28979
10259B8979r373N02p951l669J1490j2633K855K177j855Q305m825l167R705r862
$$ 28979 19606 20108 12157 8488 19978 7345 10200 12377 10522 18827 14002 10835 20540 10678
10245A0678j535l16o465n361L981r480R733R957J535j6243k942m710j1690O947
$$ 10678 9143 8827 2362 -2999 982 -8498 1235 11192 12727 -3516 -6458 -11168 -22858 -15911
10231a5911K2902J153n106j5799k6506O479K3593m78O590L922K3638K3842k806
$$ -15911 6991 8144 3038 -12761 -39267 -32788 -9195 -9673 -3083 839 24477 48319 45513
10218D5513j4151q497j3120J7026J6659m216k703M440j984j35N8K184r000k600
$$ 45513 31362 22865 9745 26771 43430 39214 36511 40951 38967 38832 38890 41074 32074 29474
10204B9474j1501q88n947k4140j0496K789J173L513K3522J9071L128o898j2820
$$ 29474 17973 17085 11138 -13002 -23498 -20709 -19536 -16023 7499 26570 29698 22800 9980
10191I980j7262r093R055J1543L385M307J2375j038m998J844l328l662K0857J0386
$$ 9980 -7282 -16375 -7320 4223 7608 11915 24290 23252 18254 20098 16770 13108 33965 44351
10177D4351N38n087j2396O672J1274N780r851l430L2j088j3008R576k5514Q374
$$ 44351 44889 39802 27406 34078 45352 51132 41281 37851 37883 36795 23787 33363 7849 16223
10163A6223o750M079J676N640Q120k044o00J018j471M326j2967J8675J7142M124
$$ 16223 9473 13552 15228 20868 28988 26944 26344 27362 25891 30217 17250 35925 53067 57191
10149E7191P694j1289M107l55j2890k8720k905J5130O73k4656r020K0006K8207
$$ 57191 64885 53596 57703 57348 44458 15738 12833 27963 28636 3980 -5040 14966 43173
10136D3173O13j2466j738J1333J8279m714L992r182L75p770j4540L17M900p01
$$ 43173 43786 31320 29582 40915 59194 54480 58472 49290 49665 41895 27355 27672 32572 31871
10122C1871K3789J372j2825L245j3938j3069J2157J3096l128M647Q092N570q791
$$ 31871 55660 57032 44207 47452 33514 20445 32602 45698 42570 47217 55309 60879 52088
10109E2088N953p736j9805r704Q62n983J7799J2602j2866q598P022j355J3162
$$ 52088 58041 50305 30500 20796 21658 15675 33474 46076 33210 24612 31634 30279 43441
10096D3441O976j282N844o561m267M056J5950J6535J4298j301o750J2625j2911
$$ 43441 50417 49135 54979 48418 44151 48207 64157 80692 94990 93689 86939 99564 86653
10083H6653j1748l328J1654M1511Q557l598j5411q169k7464j3797o366J9102K8453
$$ 86653 74905 71577 83231 124742 133299 129701 114290 106121 78657 64860 58494 77596 106049
10070A06049K0469k4952j4158O206K4510J1252J5415J1550j3387K990K2020K6272
$$ 106049 126518 101566 87408 93614 118124 129376 144791 156341 142954 145944 167964 194236
10058A94236N744J0687K7539L9962O5587R9709J27283K30280M51915Q31042L26324
$$ 194236 199980 210667 238206 278168 343755 443464 570747 801027 1252942 2083984 2410308
10047B410308m62289l09999j91336l56506l48319j97657j15835p8355q8009n3944
$$ 2410308 1948019 1638020 1446684 1090178 741859 544202 428367 350012 262003 208059
10037B08059l4463N398o176k9061P319p589J0206Q409j1122J294l090k0223K1820
$$ 208059 173596 178994 172818 143757 151076 143487 153693 162102 150980 152274 149184 128961 150781
10024A50781J2254N248J1110J9943K91j704J2403j08N135O235j845L901j788J4839
$$ 150781 163035 168283 179393 199336 199627 197923 210326 210218 215353 221588 219743 223644 221856 236695
10010B36695K3332r88J8421m259j346j0491O702J2380O598N112K7066L5348K2573
$$ 236695 260027 259039 277460 273201 271855 261364 268066 280446 287044 292156 319222 354570 377143
9997C77143J405J2720J5349J2211K3250Q066L8272L0004O5632O0471M0999O8303
$$ 377143 378548 391268 406617 418828 442078 450144 488416 518420 584052 644523 685522 753825
9985G53825M8188K0320q318J5833J4832J7431P280R296M6225O9686Q5477O9609
$$ 753825 802013 822333 814015 829848 844680 862111 869391 878687 924912 994598 1080075 1149684
9973A149684O8478J00713J08733J16419J04687J14921J33356J50797J72413K18331
$$ 1149684 1218162 1318875 1427608 1544027 1648714 1763635 1896991 2047788 2220201 2438532
9963B438532K34966K61348K78838L44748L70956M16079M73801N21834N37572N67423
$$ 2438532 2673498 2934846 3213684 3558432 3929388 4345467 4819268 5341102 5878674 6446097
9953F446097N90821N64912N29425M20102K86637J47034k8549k11004l59402m65002
$$ 6446097 7036918 7601830 8131255 8551357 8837994 8985028 8956479 8745475 8386073 7921071
9943G921071n50463o06237o01198n82168n42124m90584m37852m07295l58312l19048
$$ 7921071 7370608 6764371 6163173 5581005 5038881 4548297 4110445 3703150 3344838 3025790
9933C025790k99315k54278k32661k08747j57728j33560j24564j19817r5270j00176
$$ 3025790 2726475 2472197 2239536 2030789 1873061 1739501 1614937 1495120 1399850 1299674
9923A299674r9624p7942o1082p2687n3054m8313m4062k3679k0990n1056o3646
$$ 1299674 1200050 1122108 1061026 988339 935285 886972 842910 819231 798241 747185 683539
9912F83539n0110l0648n394r384j2784j9909j3396J1477K974K6438K7205L1550
$$ 683539 633429 602781 597387 588003 575219 555310 541914 553391 556365 582803 610008 641558
9900F41558J00778J50104K30127M31363P91928Q75910j32242n25882k98131l55037
$$ 641558 742336 892440 1122567 1553930 2345858 3221768 3089526 2563644 2265513 1910476
9890A910476n24383l90326k07071j48853j09826q0230m8900k5247k3671l5425
$$ 1910476 1386093 995767 788696 639843 530017 449787 400887 375640 351969 316544
9880C16544k4661O139J0495K7146K9355L8614K9109M8399J13534K06217L62678
$$ 316544 291883 298022 308517 335663 365018 403632 432741 481140 594674 800891 1163569
9869A163569M83431M46544J63234j42037l21892l41770l24601k85735k21653j56234
$$ 1163569 1647000 2093544 2256778 2114741 1792849 1451079 1126478 840743 619090 462856
9859D62856j09770o8009m8874l5337j8404K225j0282n112q069j1527p230j7114
$$ 462856 353086 285077 236203 200866 182462 184687 174405 169293 161224 149697 142467 125353
9847A25353j3216Q650j3112L740P109p791l0106j4805Q206Q089M388k0034J1314
$$ 125353 112137 120787 107675 111415 118524 110733 80627 65822 74028 82117 86505 66471 77785
9834G7785q160j9721J004J2381P412p648k277L905O448n087j4083k4793O097K2810
$$ 77785 69625 49904 50908 63289 70701 63053 60776 64681 71129 66042 51959 27166 33263 56073
9820E6073n226j3193j653J2126J8951j4540k8230l250J0835N912k2023m385K6770
$$ 56073 50847 37654 36001 48127 67078 52538 24308 21058 31893 37805 15782 11397 38167
9807C8167K2730k727O407l3409j5686P222J4917m259m620M62p304J3945P013j749
$$ 38167 60897 58170 64577 31168 15482 22704 37621 33362 28742 29204 21900 35845 42858 41109
9793D1109K59M638j9816j8316K0073J1923J039O237k4686m712m444j2346N308
$$ 41109 41368 46006 26190 7874 27947 39870 40909 47146 22460 17748 13304 958 6266
9780F266P237J4096J0803j3607j8064m683o402k574N403l555O491m000j2719J329
$$ 6266 13503 27599 38402 24795 6731 2048 -4354 -6928 -1525 -5080 1411 -2589 -15308 -13979
9766a3979J3007Q077N46r687o33J5245K5861l585j5301J4947n389n106K1059J2500
$$ -13979 -972 7105 7651 -2036 -2669 12576 38437 34852 19551 34498 29109 24003 45062 57562
9752E7562j8901j2836l614o879n844j862J9980J0515J580l004M534j9295j1136
$$ 57562 38661 25825 22211 15332 9488 7626 27606 38121 39701 36697 41231 21936 10800
9739A0800O735J6127K4038R759j4751j3303l849N909j4181r490k0633q085Q557
$$ 10800 17535 33662 57700 67459 52708 39405 35556 41465 27284 17794 -2839 -10924 -2367
9726b367K8766r708k3844p904K1163K9315N714r321k0221m148J1849L560L876
$$ -2367 26399 16691 -7153 -15057 6106 35421 41135 31814 11593 7445 19294 22854 26730
9713B6730J881m80q334o945J0173J5490J2471p464k8722J40m216k0219K082J9442
$$ 26730 28611 28131 19797 12852 23025 38515 50986 43522 14800 14940 10724 -9495 -7413 12029
9699A2029L0948l490j6939k6057n545J9136J8761M345l720l713j7446J5758P826
$$ 12029 42977 39487 22548 -3509 -9054 10082 28843 33188 29468 25755 8309 24067 31893
9686C1893j966j3969J4998K4129j2369J1261k295l5711k6248j718J1163K0046
$$ 31893 29927 15958 30956 55085 42716 53977 51682 15971 -10277 -11995 -832 19214
9674A9214m348m321j800j1448R220P977j6942j1423j552P617N519J4057O257m214
$$ 19214 14866 10545 8745 -2703 6517 14494 -2448 -13871 -15423 -7806 -2287 11770 18027 13813
9660A3813q500K2547N104m688j0043P960k0328q143o266P750Q975p344n319K4054
$$ 13813 5313 27860 32964 28276 18233 26193 5865 -2278 -8544 -794 8181 837 -4482 19572
9646A9572P480q495P338j1957j1708l996K514J1544J863r6j7230n41J473K08j985
$$ 19572 27052 18557 25895 13938 2230 -1766 748 12292 14155 14059 -3171 -3712 -2239 -2031 -4016
9631d016q447R235R1J0929K645q715j7515J1434K468n283P668Q477k379n997k72
$$ -4016 -12463 -3228 -3137 7792 10437 1722 -15793 -4359 -1891 -7174 494 8971 6592 595 323
9616C23p470j0542K499P019k140o640L792M860O090O469L216L876R795k3617r276
$$ 323 -7147 -17689 -15190 -8171 -10311 -16951 -13159 -8299 -2209 4260 7476 11352 21147 -2470 -11746
9601a1746o53J4479R177r110j832j4536m445J1749L584n950o288j0733j419j1951
$$ -11746 -12399 2080 11257 2147 315 -14221 -18666 -6917 -3333 -9283 -15571 -26304 -27723 -39674
9587c9674j106J9802K5583J8795L136K004o437j4509R98R99O969K4500k447o287
$$ -39674 -40780 -20978 4605 23400 26536 28540 22103 7594 8592 9591 16560 41060 38613 32326
9573C2326j5506k4463k166L0084n307n995k588j1964k1100J0385J3631n166n702
$$ 32326 16820 -7643 -9809 20275 14968 8973 6385 -5579 -26679 -16294 -2663 -7829 -13531
9560a3531J365L810Q456J5715L310j3953j0370m876j5786N275O196M526Q752J042
$$ -13531 -12166 -8356 100 15815 19125 5172 -5198 -10074 -25860 -20585 -14389 -9863 -1111 -69
9546f9P321K89J5366n520l190O094J3763j9446k3099l279m400n712j0219n685
$$ -69 7252 7541 22907 17387 14197 20291 34054 14608 -8491 -11770 -16170 -21882 -32101 -37786
9532c7786j20j0968M2j851O825M2765J4198o450J187m033Q842p807O266O625J0366
$$ -37786 -37906 -48874 -48832 -50683 -43858 -1093 13105 6655 7842 3809 12651 4844 11110 17735 28101
9517B8101p352j8027j0908q264J6411k310M803J2064M766J3582j2075J844J0828
$$ 28101 20749 2722 -8186 -16450 -39 -2349 2454 14518 19284 32866 20791 22635 33463
9504C3463L55p8k836p199j2070l712L503O041n047J051L983O37j3551k150K329
$$ 33463 33818 33740 30904 23705 11635 7923 11426 17467 12420 13471 17454 18091 4540 2390 4719
9489D719J9931K877o971L331J750l447j3652Q597K0556Q027j4761j7716K774o988
$$ 4719 24650 27527 20556 23887 25637 22190 8538 17135 37691 45718 30957 13241 16015 9027
9475I027o363m163j2129k448O07r232J1786M372k2125R539K2129n917k7429r964
$$ 9027 2664 -1499 -13628 -16076 -15469 -24701 -12915 -8543 -30668 -21129 1000 -4917 -32346 -42310
9461d2310L1588K5960j7230m825J2519J6639R896l269L209j6348j2546m71j2860
$$ -42310 -10722 15238 -1992 -6817 5702 22341 32237 28968 32177 15829 3283 2812 -10048
9448a0048j5371P467Q373M201p727P604O157J0558J817J4812r377N280k1713L113
$$ -10048 -25419 -17952 -9579 -5378 -13105 -5501 656 11214 13031 27843 18466 23746 2033 5146
9434E146j8336j4336O972P315K0981J8567j1251k7414p654J5417k2540k3029K1311
$$ 5146 -13190 -27526 -20554 -13239 7742 26309 15058 -12356 -20010 -4593 -27133 -50162 -28851
9421b8851J8517K7209k986Q210J095k0516J185J12J5810M010N119J0826j6890
$$ -28851 -10334 16875 13889 22099 23194 2678 3863 3975 19785 23795 28914 39740 22850
9408B2850N894p06p628J3897n417O903j3779n153j8361N125J7902R260j7667N57
$$ 22850 28744 28038 20410 34307 28890 35793 22014 16861 -1500 3625 21527 30787 13120 13677
9394A3677q134P738r666k2490K240L624J935p506J2259K1530j5946K141J1820
$$ 13677 5543 13281 3615 -18875 -16635 -13011 -11076 -18582 -6323 15207 -739 1402 13222
9381A3222J0605r809j2237j1283N05m315n091R41q211j605J8070J2221N654K786
$$ 13222 23827 14018 1781 -9502 -8997 -13312 -18403 -17462 -25673 -27278 -9208 3013 8667 11453
9367A1453Q633J4069p0l506m630j4789O894K8806j9141o039L281O216j0246k2693
$$ 11453 20086 34155 34085 30579 25949 11160 18054 46860 27719 21680 24961 31177 20931 -1762
9353a762j2649N728J7140n723j2829J071P119K8434J4870L865n077k0426p213
$$ -1762 -14411 -8683 8457 2734 -10095 -9024 -1905 26529 41399 45264 40187 19761 12548
9340A2548M221j1550k365J8780q301j8552M852N320j4557p344P02r066J3980J9633
$$ 12548 16769 5219 2854 21634 13333 -5219 -367 4953 -9604 -16948 -16246 -25312 -11332 8301
9326H301n740m623M374j2620n091J3611P978M94J488p436j6476J4703p104k0655
$$ 8301 2561 -2062 2312 -10308 -15399 -1788 6190 6684 8172 736 -15740 -1037 -8141 -28796
9312b8796K6793J9925r65J789r21r115l914k263k148l23l084j80P010N532j981
$$ -28796 -2003 17922 16957 18746 17825 8710 4796 2533 385 62 -3022 -3202 3808 9340 7359
9297G359q923j9908K175l947J0927o668p935R509L0299o11j6039k938L712Q127
$$ 7359 -1564 -21472 -19297 -23244 -12317 -18985 -26920 -17411 12888 12277 -3762 -6700 -2988 5139
9283E139O534m53l641n35O308M859j6121k6633L166R923P254r450M495J1136J9586
$$ 5139 11673 11220 7579 7044 13352 18211 2090 -24543 -21377 -11454 -4200 -13650 -9155 1981 21567
9268B1567J2342K32o613p230p121J5848m540j8656k0295P313J725j1263j2151
$$ 21567 33909 34141 27528 20298 13177 29025 24485 5829 -14466 -7153 -5428 -16691 -28842
9255b8842Q323P836M392K8462J1963l447j1829N598J3145m845j7428j4625P605
$$ -28842 -20519 -12683 -8291 20171 32134 28687 16858 22456 35601 30756 13328 -1297 6308
9242F308J6239n501k5403m361J801P616k957N220l638R067m590m831r572n938
$$ 6308 22547 17046 -8357 -12718 -10917 -3301 -6258 -1038 -4676 4391 -199 -5030 -14602 -20540
9228b0540N744Q015r591J3877J4341J1746N374J317L996R599j2740j6601Q385
$$ -20540 -14796 -6781 -16372 -2495 11846 23592 28966 30283 34279 43878 31138 14537 22922
9215B2922o476L784L6659j6131k2556j6376r464J0415K7456j475k1010j6457R75
$$ 22922 16446 20230 56889 40758 18202 1826 -7638 2777 30233 28758 7748 -8709 -7734
9202g734j1588m733J3781K5313K432j7399j6800J0188K5882o537k4082k29K417
$$ -7734 -19322 -24055 -10274 15039 17471 72 -16728 -6540 19342 12805 -11277 -11506 -9089
9189i089M017M272N430l593O302r130j4320J5929M965o901j0003n327p285n209
$$ -9089 -5072 -800 4630 1037 7339 -1791 -16111 -182 4783 -2118 -12121 -17448 -24733 -29942
9175b9942J612P56kj568J0393J6675r389q326N709J3471l463l637J0794l89L294
$$ -29942 -28330 -27574 -27576 -29144 -18751 -2076 -11465 -19791 -14082 -611 -4074 -7711 3083 2694 5988
9160E988O283N219q06J3863J6329j5929j1016O515k770j9360k6459r180P180K4867
$$ 5988 12271 17490 16684 30547 46876 30947 19931 26446 23676 4316 -22143 -31323 -24143 724
9146G24J5946O97m898o188j234l383j5867p346l765N471O477J3045O229k14j5155
$$ 724 16670 17367 12469 6281 5047 1664 -14203 -21549 -25314 -19843 -13366 -321 5908 5694 -9461
9131i461j524J4461Q497P496K638j3942j0021m799k1891r794J0207J6245j147
$$ -9461 -10985 3476 11973 19469 22107 8165 -1856 -6655 -28546 -38340 -28133 -11888 -13035
9118a3035k349R547J192K589j3239J2563L955J0938n844p646J2113k165j8566
$$ -13035 -15384 -5837 -4645 -2056 -15295 -2732 1223 12161 6317 -1329 10784 8619 -9947
9105i947p713j0003J1648K0951J4154j6565o89K26J2066R387J2956n774j0281
$$ -9947 -17660 -27663 -16015 4936 19090 2525 1836 2062 14128 23515 36471 30697 20416
9092B0416j3130o26M372m427L145Q854J2551k1740n546K4419N179j331K765p015
$$ 20416 7286 6660 11032 6605 9750 18604 31155 9415 3869 28288 33467 32136 34901 27886
9078B7886m023j1968j1788n712j7219k7067N851K1678O700j5089q901J1292R651
$$ 27886 23863 11895 107 -5605 -22824 -49891 -44040 -22362 -15662 -30751 -39652 -28360 -18709
9065a8709K023l5N644J5011J9092K0844p520j2638k0586k1522K571J489j5418
$$ -18709 -16686 -16721 -11077 3934 23026 43870 36350 23712 3126 -18396 -15825 -14336 -29754
9052b9754J1236Q508J5328J9130J7204j3045l8048j3787O727Q224R976n614j6335
$$ -29754 -18518 -10010 5318 24448 41652 28607 -9441 -23228 -16501 -8277 1699 -3915 -20250
9039b0250M75J0671l488m590L857N560q400K561Q926J3778K5055n240k5392N797
$$ -20250 -19775 -9104 -12592 -17182 -13325 -7765 -16165 -13604 -4678 9100 34155 28915 3523 9320
9025I320J1526O684q157J099p092j2808j6096M730J1712n896j9906J8807J0863
$$ 9320 20846 27530 19373 20472 13380 572 -15524 -10794 918 -4978 -24884 -6077 4786
9012D786O873J8732N365o367k2610m162P389J1872j7155m860L012j3529k1119
$$ 4786 11659 30391 35756 29389 6779 2617 10006 21878 4723 -137 2875 -10654 -31773
8999c1773P130J3887K1570j4228k4574j5367R900Q785Q921P692Q642n945j4237
$$ -31773 -24643 -10756 10814 -3414 -27988 -43355 -33455 -24670 -15749 -8057 585 -5360 -19597
8986a9597p077R447K02l980L260J3781K2774N494k7477n053J0000j290J8705r157
$$ -19597 -26674 -17227 -17025 -21005 -17745 -3964 18810 24304 -3173 -8226 1774 484 19189 10032
8972A0032J0100o937n162m670N54K472P931o421Q746L60k2719j4098p714j7443
$$ 10032 20132 13195 8033 3363 3917 6389 14320 7899 16645 17005 -5714 -19812 -27526 -44969
8958d4969j79K1395L161q398l61n605R801K2464L669k606P564L462M673j752l195
$$ -44969 -45148 -23753 -20592 -28990 -29351 -34956 -25155 -2691 978 -1628 5936 9398 14071 12319 9124
8943I124k5970j5257K2457K3110l828p720K786n181j371N125J8080q541K086R556
$$ 9124 -16846 -32103 -9646 13464 9636 1916 4702 -479 -1850 3275 21355 12814 14900 24456
8929B4456n06r736j1509m986Q917k142k780o034K322Q337L01j8796k666o343j2740
$$ 24456 23950 14214 2705 -2281 6636 4494 1714 -4320 -1998 6339 6640 -12156 -14822 -21165 -33905
8914c3905J1756N839L626J902j520m654J9842m48j3364P41m67J6091J2926j4037
$$ -33905 -22149 -16310 -12684 -10782 -12302 -16956 2886 2438 -10926 -10185 -10652 5439 18365 4328
8900D328j4461k3236r774Q214L312R360M406p37P754P536j769p3K573k244J1662
$$ 4328 -10133 -33369 -43143 -34929 -31617 -22257 -17851 -18588 -10834 -3298 -5067 -5140 -2567 -4811 6851
8885F851R329k661j3353m273j2189m398J1521Q985J40k224P171l558Q366J2975
$$ 6851 16180 13519 166 -4107 -16296 -20694 -9173 -188 -48 -2272 4899 1341 9707 22682
8871B2682o779l4303k7185K577J3757J5001J9806j2958q379Q915m558J748J2013
$$ 22682 15903 -18400 -45585 -43008 -29251 -14250 5556 -7402 -15781 -6866 -11424 -9676 2337
8858B337P498N429n445Q590J4092k456j1763R42l0533j3510J9715K5704n804j1672
$$ 2337 9835 15264 9819 18409 32501 30045 18282 19224 -11309 -24819 -5104 20600 14796 3124
8844C124M237P236r743j7104j6066J0671O263j1309K8431L5119j1006l2153l819
$$ 3124 7361 14597 4854 -12250 -28316 -17645 -11382 -22691 5740 40859 29853 -2300 -6119
8831f119K2315M594k1790L976M450M320m684L008j4673j2119n206Q514k6573k725
$$ -6119 16196 20790 -1000 2976 7426 11746 7062 10070 -4603 -16722 -21928 -13414 -39987 -42712
8817d2712O371J2730J7408P102l765l691N172q307n201m856J7159L636j7259J299
$$ -42712 -36341 -23611 -6203 899 -2866 -6557 -1385 -9692 -14893 -19749 -2590 1046 -16213 -14914
8803a4914J2534lj1672q994J7135J0566N226m675p502j0881J5174R483P066K0912
$$ -14914 -2380 -2383 -14055 -23049 -5914 4652 9878 5203 -2299 -13180 1994 11477 18543 39455
8789C9455j0747R915J3019l2653j4411j1602j3501J4863P349N636m36m08j0099
$$ 39455 28708 38623 51642 18989 4578 -7024 -20525 -5662 1687 7323 6887 6479 -3620
8776c620J0634J116j261J2142l033j4235Q11P911j535j8175j7592J0156M220l172
$$ -3620 7014 8130 6869 19011 15978 1743 2554 10465 8930 -9245 -26837 -16681 -12461 -15633
8762a5633N1K0272K5469m805Q67N60r619R752J468j0241N88m246N092N044j3467
$$ -15633 -15582 4690 30159 25354 26221 26781 17162 26914 28382 18141 18729 14483 19575 24619 11152
8747A1152J2579k37n157q225R515J3637k4257k3480L908P181k355j3191K0336
$$ 11152 23731 23494 18337 10112 19627 33264 9007 -14473 -10565 -3384 -5739 -18930 1406
8734A406L66J014J4030q018j1961N838p107q751L999K928K074J6338J318j7761
$$ 1406 1772 2786 16816 8798 -3163 2675 -4432 -13183 -9184 -6256 -4182 12156 13474 -4287
8720d287o48j2012N898J6539j0917m239K465J8547Q946J8004l759r308j0796O064
$$ -4287 -4935 -16947 -11049 5490 -5427 -9666 -7201 11346 20292 38296 34537 25229 14433 20497
8706B0497P295M18j6744j1438J1253m408j6907K569J7447N841j8318j7284K2609
$$ 20497 27792 28210 11466 28 11281 6873 -10034 -7465 9982 15823 -2495 -19779 2830
8693B830L5316j7562o412J0647k93q502j5728j7427J5885Q525q850j4964j4145
$$ 2830 38146 20584 14172 24819 24526 16024 296 -17131 -1246 7279 -1571 -16535 -30680
8680c0680N056K2601J8808L1830o682j8325k234k4279n789n94P799n898J4624
$$ -30680 -25624 -3023 15785 47615 40933 22608 20374 -3905 -9694 -10288 -2489 -8387 6237
8667F237J2899J9584L709o624n993k0680l458J7746k831n952J333L618l668K345
$$ 6237 19136 38720 42429 35805 29812 9132 5674 23420 20589 14637 15970 19588 15920 18265
8653A8265J1516L798j7879j5663j95q60J1054M040J3085K3987p454k4782j907
$$ 18265 29781 33579 15700 37 -158 -1018 10036 14076 27161 51148 43694 18912 17005
8640A7005P172j5138m359O483j0523j5264Q137K016J1790J4438K8648r299p852
$$ 17005 24177 9039 4680 11163 640 -14624 -6487 -4471 7319 21757 50405 41106 33254
8627C3254P340J8832J4327j870q032j2153P817m849K518R202K3305M534J335l342
$$ 33254 40594 59426 73753 71883 63851 51698 59515 54666 57184 66386 89691 94225 95560 92218
8613I2218p379n007k514J9915K3849R138P165P321K6662K2654J5285o825j3986
$$ 92218 84839 79832 77318 97233 121082 130220 137385 144706 171368 194022 209307 202482 188496
8600A88496m090r110k3024j1939k0308k1530j1157M723R492q540j7351p395J650
$$ 188496 184406 175296 152272 140333 120025 98495 87338 92061 101553 93013 75662 68267 69917
8587F9917j9025J3284j0608k3138p086J2800n373j8855j6499J3266J7512P770
$$ 69917 50892 64176 53568 30430 23344 36144 30771 11916 -4583 8683 26195 33965
8575C3965J6714k0049l0523l212J6417q216m314J3204O001O035M176k0592p128
$$ 33965 50679 30630 107 -3105 13312 5096 782 13986 19987 26022 30198 9606 2478
8562B478N551M309k288o209J491L95j4094l538n412L721J0190o34n106J3802k962
$$ 2478 8029 12338 10050 3841 5332 5727 -8367 -11905 -17317 -13596 -3406 -4040 -9146 4656 1694
8547A694n310J0235k685m303P022N741j2400k982O939N244o33J9957P986l186
$$ 1694 -3616 6619 3934 -369 6653 12394 -6 -2988 3951 9195 8562 28519 36505 33319
8533C3319p937J4185L525K919k1978o0l452j027J617l335p143l53j1195J891J8081
$$ 33319 25382 39567 43092 46011 24033 23973 20521 19494 21111 17776 10633 10280 -915 976 19057
8518A9057J9399r94j6627Q04j0211J3361P188p49j1625j0578r634m603N295Q864
$$ 19057 38456 37462 20835 21639 11428 24789 31977 31228 19603 9025 -609 -5212 83 8947
8504H947m46k1964o520P579K905j6240l614J5634L5572J0383j5352k4203k436
$$ 8947 8501 -13463 -19983 -12404 -9499 -25739 -29353 -13719 21853 32236 16884 -7319 -9755
8491i755M80O483K0593J0243m165j8605o171j620j3601K649J2870Q415k1323j3474
$$ -9755 -9275 -2792 17801 28044 23879 5274 -897 -2517 -16118 -13469 -599 7816 -13507 -26981
8477b6981L2356J5492m812Q000j2367j7200j1710j635j7313J2459J6784K0047
$$ -26981 5375 20867 16055 24055 11688 -5512 -17222 -18857 -36170 -23711 -6927 13120
8465A3120J143j6426o763o555Q72j0488O183K6005Q149j0133j6318j8365n589
$$ 13120 14263 -2163 -8926 -15481 -14609 -25097 -18914 7091 15240 5107 -11211 -29576 -35165
8452c5165j9716J1865L9528k974j321j3072q283J6516J1390j7134K894O543J3122
$$ -35165 -54881 -43016 -3488 -6462 -7783 -20855 -29138 -12622 -1232 -18366 -15472 -8929 4193
8439D193q845N459M174k286Q751p00j3950j1825q593L582J4448K8790j8009r853
$$ 4193 -4652 807 4981 2695 11446 10746 -3204 -15029 -23622 -20040 -5592 23198 5189 -4664
8425d664m119n01M571q680L217N789P771O600k39r73J7573L98K318j3701n326
$$ -4664 -8783 -9284 -4713 -13393 -10176 -4387 3384 9984 9745 8772 26345 26743 29061 15360 10034
8410A0034j8919j0888J0664q24J4604R408P778k7590j6648Q032k786K066K583
$$ 10034 -8885 -19773 -9109 -9933 4671 14079 21857 -5733 -22381 -14349 -17135 -15069 -12486
8397a2486N647J278M962o306r916n78K4166K1616L077j8838j3763O393O669l059
$$ -12486 -6839 -5561 -599 -6905 -16821 -17399 6767 28383 31460 12622 -1141 5252 11921 8862
8383H862K1651M078L941M843k5408j3521P262L426j2927n710O922Q685J329m812
$$ 8862 30513 34591 38532 43375 17967 4446 11708 15134 2207 -3503 3419 12104 13433 8621
8369H621o607m800R394j457j4056J673K0398K9009q398j8838J8749p526r443r72
$$ 8621 2014 -2786 6608 5151 -8905 -7232 13166 42175 33777 14939 33688 26162 16719 15747
8355A5747j3017r8r471k6289n290R721O978J5501Q061o100K76J8541J576L24n241
$$ 15747 2730 2632 -6839 -33128 -38418 -28697 -21719 -6218 1843 -4257 -3981 14560 16136 16460 11219
8340A1219R009m2p95M549J4713O172j3426k1416k2340l493R850K159j1612J6103
$$ 11219 20228 20186 19391 23940 38653 44825 31399 9983 -12357 -15850 -6000 -3841 -15453 650
8326F50k223j2062Q789O51R231K623j3275k564l817J9874N218m617j0425j725
$$ 650 -1573 -13635 -4846 -4195 5036 7659 -5616 -8180 -11997 7877 13095 8478 -1947 -3672
8312c672q115J121r153L559N122J0930M563j0205k0134Q587m235J5508J0827m669
$$ -3672 -11787 -10666 -19819 -16260 -11138 -208 4355 -5850 -25984 -17397 -21632 -6124 4703 34
8298C4j1054J389k200J1957Q966J1233j826k999L716j9325q748n342Q645J2875
$$ 34 -11020 -9631 -11831 126 9092 20325 18499 15500 19216 -109 -8857 -14199 -5554 7321
8284G321J0492Q543J1530r097k8203k427P392j8817m807m975p388Q042k613M539
$$ 7321 17813 26356 37886 28789 586 -1841 5551 -13266 -18073 -23048 -30436 -22394 -25007 -20468
8270b0468J3489m420J026J3906J3931J4327l747k9703J292K7903p05j8441p101
$$ -20468 -6979 -11399 -10373 3533 17464 31791 28044 -1659 -367 27536 26831 8390 1289
8257A289L70n903j22J4746M084j1371l563K651j0528j4782J8144o37j9953l495
$$ 1289 1659 -4244 -4366 10380 14464 3093 -470 2181 -8347 -23129 -4985 -5622 -25575 -29070
8243b9070O5J2028M898j3701J5187R717n497R049P485l356J3221Q316k599q968
$$ -29070 -29005 -16977 -12079 -25780 -10593 -876 -6373 2676 10161 6805 20026 28342 25743 16775
8229A6775j9624r724N063J7528J9283l916j4491j6914M396L823n906j1216j3840
$$ 16775 -2849 -12573 -7510 10018 29301 25385 10894 -6020 -1624 2199 -3707 -14923 -28763
8216b8763J0452K716J4520K2317j1161m749P694J6743o867k4656k0421r995K422
$$ -28763 -18311 -15595 -1075 21242 10081 5332 13026 29769 22902 -1754 -22175 -32170 -29748
8203b9748J2623K0751J2962o215M304K3269n885k4636l0963L043J5154Q784O342
$$ -29748 -17125 3626 16588 10373 14677 37946 32061 7425 -23538 -20495 -5341 3443 9785
8190I785j162M947M531J7086k125j7726k1977L165J0349n905J1418J0867J2796
$$ 9785 8623 13570 18101 35187 33062 15336 -6641 -3476 6873 968 12386 23253 36049
8177C6049j5419j3924p845j5257Q900k295j6458K905J0630j212o022j343J8756
$$ 36049 20630 6706 -1139 -16396 -7496 -9791 -26249 -23344 -12714 -13926 -19948 -21291 -2535
8164b535J0036K615J1437p520L889n654q517O461m124l624K849j014J2418N391
$$ -2535 7501 10116 21553 14033 17922 12268 3751 10212 6088 2464 5313 4299 16717 22108
$$ [...]
##END NTUPLES=NMR SPECTRUM
##END=
