##TITLE=Analysis number 319299
Compound Code cc 12210
Book Reference 420/128/2
Project Code adrs
Chemist Name stuartg
##JCAMPDX= 6.0         $$ Bruker NMR JCAMP-DX V2.0
##DATA TYPE= NMR SPECTRUM
##DATA CLASS= NTUPLES
##ORIGIN= Bruker BioSpin GmbH
##OWNER= nmr
$$ XWIN-NMR		Version 3.5
$$ Tue May  9 12:42:48 2006 GMT Daylight Time (UT+1h)  MAYBRIDGE\nmr@NMR_250MHZ
##.OBSERVE FREQUENCY= 250.131544655141
##.OBSERVE NUCLEUS= ^1H
##.ACQUISITION MODE= SIMULTANEOUS (DQD)
##.ACQUISITION SCHEME= undefined
##.AVERAGES= 16
##.DIGITISER RES= 18
##SPECTROMETER/DATA SYSTEM= dpx250
##.PULSE SEQUENCE= zg30
##.SOLVENT NAME= CDCl3
##.SHIFT REFERENCE= (INTERNAL, CDCl3, 0, 16.522)
##AUDIT TRAIL= $$ (NUMBER, WHEN, WHO, WHERE, WHAT)
$$ ##TITLE= Audit trail, XWIN-NMR		Version 3.5
$$ ##JCAMPDX= 5.01
$$ ##ORIGIN= Bruker BioSpin GmbH
$$ ##OWNER= nmr
$$ C:\u/data/dgb/nmr/ADRS/3970/pdata/1/auditp.txt
$$ ##AUDIT TRAIL=  $$ (NUMBER, WHEN, WHO, WHERE, WHAT)
(   1,<2006-05-09 12:42:00.41 +100>,<MAYBRIDGE\nmr>,<NMR_250MHZ>,
      <created by zg, POWCHK disabled, PULCHK disabled
       configuration hash MD5:
       84 BC 41 DB A1 6E 1D 46 DA 25 12 A5 C1 ED C5 3A
       data hash MD5: 64K
       93 E7 A1 1E C2 96 7A D5 9C EA 08 EB 7B 12 B8 0C>)
(   2,<2006-05-09 12:42:25.36 +100>,<MAYBRIDGE\nmr>,<NMR_250MHZ>,
      <Start of raw data processing
       ef LB = 0.3 FT_mod = 6 PKNL = 1 SI = 32K 
       data hash MD5: 32K
       78 69 1A 7F 92 08 C2 D9 AE EC 59 9E 21 D0 3C 3E>)
(   3,<2006-05-09 12:42:30.22 +100>,<MAYBRIDGE\nmr>,<NMR_250MHZ>,
      <apk 
       data hash MD5: 32K
       C8 D1 B0 5D 3A 94 0D 87 E4 3E B5 F2 53 61 A5 0A>)
(   4,<2006-05-09 12:42:31.81 +100>,<MAYBRIDGE\nmr>,<NMR_250MHZ>,
      <abs ABSG = 5 
       data hash MD5: 32K
       A9 C7 DF C7 CD 85 94 BE 87 2F B8 E4 96 D8 0F FD>)
$$ ##END=
$$ 
$$ hash MD5
$$ 2A 5A C4 CE 91 12 CF 91 04 2E 13 8C A3 AA 8C 51
##$RELAX= 
##$RELAX= 
##$RELAX= 
##$RELAX= 
##$RELAX= 
##$RELAX= 
##$RELAX= 
$$ Bruker specific parameters
$$ --------------------------
##$DU= <C:\u>
##$EXPNO= 3970
##$NAME= <ADRS>
##$PROCNO= 1
##$TYPE= <nmr>
##$USER= <dgb>
##$AMP= (0..31)
100 100 100 100 100 100 100 100 100 100 100 100 100 100 100 100 100 100 
100 100 100 100 100 100 100 100 100 100 100 100 100 100 
##$AQSEQ= 0
##$AQ_mod= 3
##$AUNM= <au_zg>
##$AUTOPOS= <31 >
##$BF1= 250.13
##$BF2= 250.13
##$BF3= 250.13
##$BF4= 250.13
##$BF5= 500.13
##$BF6= 500.13
##$BF7= 500.13
##$BF8= 500.13
##$BYTORDA= 1
##$CFDGTYP= 0
##$CFRGTYP= 5
##$CHEMSTR= <none>
##$CNST= (0..31)
1 1 145 1 1 1 1 1 1 1 1 1 1 1 1 1 1 1 1 1 1 1 1 1 1 1 1 1 1 1 1 1 
##$CPDPRG= <>
##$CPDPRG1= <>
##$CPDPRG2= <>
##$CPDPRG3= <>
##$CPDPRG4= <mlev>
##$CPDPRG5= <mlev>
##$CPDPRG6= <mlev>
##$CPDPRG7= <mlev>
##$CPDPRG8= <mlev>
##$CPDPRGB= <>
##$CPDPRGT= <>
##$D= (0..31)
0 1 0 0 0 0 0 0 0 0.06 0 0 0 0 0 0 0.0002 0 0 0 0 0 0 0 0 0 0 0 0 0 0 
0 
##$DATE= 1147174918
##$DBL= (0..7)
120 120 120 120 120 120 120 120 
##$DBP= (0..7)
150 150 150 150 150 150 150 150 
##$DBP07= 0
##$DBPNAM0= <>
##$DBPNAM1= <>
$$ [...]
##$SUBNAM7= <"">
##$SUBNAM8= <"">
##$SUBNAM9= <"">
##$SW= 20.6930455092707
##$SWIBOX= (0..15)
0 0 3 0 0 0 0 0 0 0 0 0 0 0 0 0 
##$SW_h= 5175.983436853
##$TD= 65536
##$TD0= 1
##$TE= 295.16
##$TE2= 300
##$TE3= 300
##$TEG= 300
##$TL= (0..7)
0 120 120 120 120 120 120 120 
##$TP= (0..7)
150 150 150 150 150 150 150 150 
##$TP07= 0
##$TPNAME0= <>
##$TPNAME1= <>
##$TPNAME2= <>
##$TPNAME3= <>
##$TPNAME4= <>
##$TPNAME5= <>
##$TPNAME6= <>
##$TPNAME7= <>
##$TPOAL= (0..7)
0.5 0.5 0.5 0.5 0.5 0.5 0.5 0.5 
##$TPOFFS= (0..7)
0 0 0 0 0 0 0 0 
##$TUNHIN= 0
##$TUNHOUT= 0
##$TUNXOUT= 0
##$USERA1= <user>
##$USERA2= <user>
##$USERA3= <user>
##$USERA4= <user>
##$USERA5= <user>
##$V9= 5
##$VALIST= <valist>
##$VCLIST= <CCCCCCCCCCCCCCC>
##$VD= 0
##$VDLIST= <DDDDDDDDDDDDDDD>
##$VPLIST= <PPPPPPPPPPPPPPP>
##$VTLIST= <TTTTTTTTTTTTTTT>
##$WBST= 1024
##$WBSW= 4
##$XGAIN= (0..3)
0 0 0 0 
##$XL= 0
##$YL= 0
##$YMAX_a= 319568
##$YMIN_a= -345728
##$ZGOPTNS= <>
##$ZL1= 120
##$ZL2= 120
##$ZL3= 120
##$ZL4= 120
##$ABSF1= 16.522
##$ABSF2= -4.171173
##$ABSG= 5
##$ABSL= 3
##$ALPHA= 0
##$AQORDER= 0
##$ASSFAC= 0
##$ASSFACI= 0
##$ASSFACX= 0
##$ASSWID= 0
##$AUNMP= <proc_1d>
##$AZFE= 0.1
##$AZFW= 0.1
##$BCFW= 0
##$BC_mod= 0
##$BYTORDP= 0
##$COROFFS= 0
##$CY= 12.5
##$DATMOD= 1
##$DC= 0
##$DFILT= <>
##$DTYPP= 0
##$F1P= 14.0000005364418
##$F2P= -0.99999901652339
##$FCOR= 0.5
##$FTSIZE= 32768
##$FT_mod= 6
##$GAMMA= 0
##$GB= 0
##$INTBC= 1
##$INTSCL= 1
##$ISEN= 128
##$LB= 0.3
##$LEV0= 0
##$LPBIN= 0
##$MAXI= 10000
##$MC2= 0
##$MEAN= 0
##$ME_mod= 0
##$MI= 0
##$NCOEF= 0
##$NC_proc= -4
##$NLEV= 6
##$NOISF1= 0
##$NOISF2= 0
##$NSP= 0
##$NTH_PI= 0
##$NZP= 0
##$OFFSET= 16.522
##$PC= 1
##$PHC0= 179.0094
##$PHC1= -6.844043
##$PH_mod= 1
##$PKNL= yes
##$PPARMOD= 0
##$PSCAL= 4
##$PSIGN= 0
##$REVERSE= no
##$SF= 250.13
##$SI= 32768
##$SIGF1= 0
##$SIGF2= 0
##$SINO= 400
##$SIOLD= 32768
##$SREGLST= <1H.CDCl3>
##$SSB= 0
##$STSI= 32768
##$STSR= 0
##$SW_p= 5175.98343685301
##$SYMM= 0
##$S_DEV= 0
##$TDeff= 65536
##$TDoff= 0
##$TI= <Analysis number 999999
Compound Code 99
Book Reference 9
Project Code 9>
##$TILT= no
##$TM1= 0
##$TM2= 0
##$TOPLEV= 0
##$USERP1= <user>
##$USERP2= <user>
##$USERP3= <user>
##$USERP4= <user>
##$USERP5= <user>
##$WDW= 1
##$XDIM= 32768
##$YMAX_p= 275279489
##$YMIN_p= -416531
$$ End of Bruker specific parameters
$$ ---------------------------------
##NTUPLES= NMR SPECTRUM
##VAR_NAME=  FREQUENCY,     SPECTRUM/REAL,   SPECTRUM/IMAG
##SYMBOL=    X,             R,               I
##VAR_TYPE=  INDEPENDENT,   DEPENDENT,       DEPENDENT
##VAR_FORM=  AFFN,          ASDF,            ASDF
##VAR_DIM=   32768,         32768,           32768
##UNITS=     HZ,            ARBITRARY UNITS, ARBITRARY UNITS
##FACTOR=    0.157963299565203, 1,           1
##FIRST=     4132.6476996994, 0,             0
##LAST=      -1043.33573715361, 0,           0
##MIN=       -1043.33573715361, -416531,     0
##MAX=       4132.6476996994, 275279489,     0
$$ Real data points
##PAGE= N=1
##DATA TABLE= (X++(R..R)), XYDATA
$$ [...]
23557E3280n1666j44113k6538L4566L4030J55180P5245r6255j60217J1646K744
23546a12098J0000M2634j9682J2361J3577P9195Q1492L7318L7662m3737l8869
23535I9853K6017N0087r623j262o3435N332n0754j0751o5984j6534R66l1519j58328
23522b25935O6251Q5230N4952N8302j42981l8446J45747J23895J5750l365r3841
23511D5559K593R3453N152J11356p6883j10818j90543J19034Q6951m3476j5771
23500B6607J54506Q249o1514r7404K5654N1819M0981j46247Q0518l9328j53382
23489a09541K1935J12066N8548l3029J8560l988q6823q3407J10726K3147j1604
23478A6590o3070m339p3751l3176J8702M9294j2577K4454O6385J25695L2704j97243
$$ y = [53280, 1614, -142499, -169037, -134471, -100441, 54739, 129984, 33729, -126488, -114842, -112098, -102098, -59464, -79146, -66785, -53208, 25987, 107479, 144797, 182459, 138722, 99853, 125870, 175957, 166334, 165072, 101637, 106969, 56215, 45464, -20520, -37054, -36088, -67607, -225935, -159684, -74454, -19502, 38800, -104181, -142627, 3120, 127015, 142765, 139400, 45559, 48152, 141605, 146757, 258113, 181230, 70412, -120131, -1097, 85854, 42378, 26607, 181113, 189362, 127848, 30444, 56098, 107917, 148898, 2651, 83169, 43841, -109541, -87606, 24460, 83008, 49979, 68539, 64551, -22272, -105679, 5047, 28194, 16590, -46480, -50819, -124570, -157746, -139044, -89750, -102327, -77873, -11488, 114207, 146911, -50332]
23466e0332r316Q3631J3048J9827l2702M7815j52980o6891M9008l0686P3187K0389
23454c6002O5197l2679j06636N8223Q6815m8330p8145M3945P6490n786m6359l5155
23442e8422K0538J05999R3422m4290q8153K9812j6934o1241o5703j16934K0781
23431a81125p245Q3763m9168m6943n7871O8378J84720k5242K4679R1122N295J9254
23419A09617N377j10181N5019M9639m9674M8962r7345r2842J3180O0678K5945
23408A8375j9140L4973k6886N4428j3370k4234L2621J4971P893P975M0591j29142
23396i45l7832Q6943R523k7565M4339l7477k1867P5426N8551j02097q0802J36129
23384A02326J18364J7535K7424r9180j24233O3940J06124J0209o9443j27763m4148
$$ y = [-50332, -59648, 23983, 37031, 56858, 24156, 71971, -81009, -147900, -98892, -129578, -56391, -36002, 29195, -3484, -110120, -51897, 34918, -13412, -91557, -47612, 28878, 23092, -23267, -58422, -37884, 68115, 161537, 117247, 29094, 58906, 41972, -19269, -84972, -201906, -181125, -188370, -104607, -153775, -200718, -258589, -190211, -5491, -30733, -6054, 85068, 90363, 109617, 114994, 4813, 59832, 109471, 59797, 108759, 11414, -81428, -68248, -7570, 18375, -765, 34208, 7322, 61750, 48380, 24146, 56767, 71738, 79631, 87606, 128197, -945, -38777, 48166, 57689, 30124, 74463, 36986, 15119, 90545, 149096, 46999, -33803, 102326, 220690, 238225, 265649, 166469, 42236, 106176, 212300, 222509, 153066, 25303, -18845]
23373a8845o4966j01289j5097J7880N1056O0377q4577N7777J90060l5059L1603
23362H8920O0533k4428j56884j08923j02197J8268J40981J01751j02021J03582
23352A9582J74888m650N649j9542o2625r295P3166j3679K1618j09954l7191J7291
23340E5258o1195l8142P9422M9840L385n2154O608q2931j00997M802K4188j55092
23328b67008o3710k4950J15441R3091K4779P71J23752O5869K0769j09353q2415
23317a02964J30197R1396K0228O9015j93271j7646j4619j7798Q3758O6798L7395
23306A52489R9583r3594j49984j90291k853N2433Q1155m5303j28619l5322J39960
23295a20346L8610k0860p2018L7912J8617J5942J20289j548j23687j41840L9469
$$ y = [-18845, -83811, -185100, -200197, -182317, -131261, -70884, -155461, -97684, 92376, 57317, 88920, 149453, 125025, -31859, -140782, -242979, -224711, -83730, 18021, -84000, 19582, 194470, 189820, 195469, 175927, 113302, 104007, 177173, 163494, 185112, 75158, 37967, 55258, -5937, -44079, 35343, 85183, 88568, 36414, 43022, -39909, -140906, -136104, -111916, -267008, -330718, -355668, -240227, -147136, -122357, -121586, 2166, 68035, 88804, -20549, -102964, 27233, 118629, 138857, 207872, 14601, -3045, -17664, -35462, 48296, 115094, 152489, 252072, 158478, 8494, -181797, -184650, -132217, -51062, -96365, -224984, -260306, -120346, -81736, -102596, -174614, -136702, -118085, -102143, 18146, 16598, -107089, -248929, -209460]
23284b09460O5875q5962P8211J64389K4964n2273k242K2111O911L8670J923J9772
23272G2889q8896j02877P546J13784K4992K1212o0693N497K85J1513m6068K8511
23260a2305O9376J6538n0371P8021R2772k149Q5663r8794k2436M927p5509m1366
23248D4367L5327J63343q0640n0314q0199n2713j4688j01451K4681O8822K8168
23237a5297P9076M4465o5548q3340n5590R564K2546q3059r242l4409N7862J65167
23225C2195m4047q0652o109J6911O2711R6251m6373q9809m9156n7526M5461J63349
23213D3206R5034o662L2707o4386j26985o9156l0817N7360M4754J27733l8872
23202F3916J0168P5144O1888k4877j28889j98131l9557K23154K5841m5096p9125
$$ y = [-209460, -143585, -229547, -151336, 13053, 38017, -14256, -16498, 5613, 12524, 51194, 53117, 72889, -16007, -118884, -111338, 2446, 27438, 48650, -12043, -6546, -6261, 5252, -40816, -12305, 57071, 73609, 23238, 101259, 194031, 191882, 277545, 178751, 156315, 161242, 85733, 44367, 79694, 243037, 162397, 112083, 31884, -20829, -35517, -136968, -112287, -43465, -15297, 63779, 108244, 42696, -40644, -96234, -86670, -64124, -147183, -156425, -190834, -132972, 32195, -11852, -92504, -98613, -81702, -18991, 77260, 30887, -58922, -108078, -165604, -120143, 43206, 138240, 131578, 164285, 99899, -27086, -96242, -127059, -69699, -24945, 102788, 63916, 74084, 149228, 211116, 186239, 57350, -140781, -180338, 42816, 68657, 23561, -55564]
23191e5564j16061k0137m3762J03326J6402L6214P7932L9209J44456n2956l7738
23180I1321Q2025k5292j06106l3634K5467J5056K3783O917j10565n7196l147l8351
23168a29722P2969m0352j58552R6346O1879Q0833J13868K3107n4802K0544j2535
23157G3583N8509O1900K6008l0766j40385j024o0168r2950O9385P8013P8521n8346
23145F2280j13441j61050J12490J41444r0925n1390J3143P6332M5275N5205j2887
23134G6476n062o5454k0978j7308j27790m5750O9547N3069M8462Q4977m039O43
23122D6793K6822j28304N9224J19789k4960n8578r5922j18938k074J6424m1816
23111b01540R5524M8786j21244N7746J825M9596Q5795K5649P3155p2383J1240
$$ y = [-55564, -171625, -191762, -235524, -132198, -115796, -79582, -1650, 37559, 182015, 129059, 91321, 173346, 148054, 41948, 8314, 33781, 48837, 72620, 79537, -31028, -88224, -91371, -129722, -56753, -97105, -255657, -159311, -97432, -16599, 97269, 120376, 65574, 86118, 73583, 132092, 193992, 220000, 189234, 48849, 47825, -12343, -105293, -35908, 42105, 120626, 62280, -51161, -212211, -99721, 41723, -49202, -100592, -87449, -11117, 34158, 89363, 76476, 71414, 5960, -15018, -32326, -160116, -205866, -136319, -83250, -34788, 50189, 46150, 46793, 73615, -54689, 4535, 124324, 99364, 40786, -55136, -174074, -176148, -159724, -201540, -106016, -57230, -178474, -120728, -118903, -69307, 16488, 42137, 115292, 42909, 54149]
23100E4149o5150j72139o5847j6573M2708M0588O1984M1213j3147P77J800N7810
23088c1827p6984n044K1370l5176l3955N681R4176Q3455n4157n4101m6517L3669
23076i9410J13686J42021l5158j57782l4817l3153p2206K841J60380L6543k6375
23065c430q2707J25229P8603j57313O04M9425J13668Q2455l3474r9776m1070l3052
23053h38J5389Q4949K449j530N4557K2997p1344J9240K4147J5604j23655j86230
23041a44265o446M8834l1685q4373M3088l1965J3046P8092j7730Q65J13649J32052
23029A13162L0139j17570j23192j03800J07864P8787M9327j04923M0780p369P1234
23018C4439K5157j27059j9598R8937j05221k4415J5016p9274Q9707J33659p5842
$$ y = [54149, -11001, -183140, -248987, -265560, -222852, -182264, -120280, -79067, -92214, -91437, -89637, -31827, -108811, -113855, -92485, -127661, -161616, -155935, -61759, 21696, -32461, -86562, -133079, -99410, 14276, 156297, 121139, -36643, -71460, -104613, -176819, -173978, -13598, 22945, -3430, -86137, 39092, 117695, -39618, -39014, 10411, 124079, 206534, 173060, 73284, 32214, -838, 14551, 99500, 101949, 100419, 154976, 177973, 106629, 125869, 150016, 165620, 41965, -144265, -150711, -101877, -133562, -217935, -174847, -206812, -193766, -115674, -133404, -132539, -18890, 113162, 143301, 25731, -97461, -201261, -93397, -14610, 34717, -70206, -29426, -36795, 34439, 59596, -67463, -87061, 11876, -93345, -117760, -102744, -182018, -92311, 41348, -34494]
23007c4494j12337J14350J59206N9499q6063j23217p8713M3933Q5340R4119N584
22996A27207l2312o3845q5123k8680m8908m6917M5392k0661J58511L6918l8196
22985C386k5054K1886K388p1775j32074L8937M6585K4585n971M9113O3602j7685
22973b077l4700j5895J3442n3972L598P6050J34387J8092j14383n4829p6429l9371
22961a46087l2116M1450J27454N0787N5857L2724K7314J06002P2260j09961k59227
22950c3543L647N0005l5907K5658m2535M0011j2747O9034q4334j05400L6540k6769
22938a16340R9004J01074L5197O3190n2487r3500p2770r2065L003P4491O7166
22927A5963P2702m2497n7899q2129q7659M3442j1033N525p301Q9587r675o7081
$$ y = [-34494, -146831, -32481, 126725, 186224, 100161, -23056, -101769, -57836, 27504, 121623, 127207, 94895, 31050, -54073, -82753, -131661, -178578, -133186, -153847, 4664, 41582, 3386, -21668, 218, 2606, -69169, -201243, -162306, -115721, -91136, -97107, -47994, 15608, -2077, -36777, -52672, -39230, -93202, -89604, -13554, 120833, 138925, 24542, -30287, -106716, -146087, -178203, -136753, -9299, 41488, 97345, 130069, 157383, 263385, 335645, 225684, -33543, -29896, 20109, -15798, 9860, -32675, 7336, -5411, 63623, -20711, -126111, -89571, -116340, -17336, 83738, 118935, 182125, 129638, 36138, -36632, -128697, -125694, -51203, 15963, 88665, 46168, -11731, -93860, -181519, -138077, -149110, -143585, -150886, -61299, -70974, -138055]
22915a38055j49925l9407P6477j5602p0210L3039J72774J37679J04998r1227q1216
22904f0675n6320p0368Q3735P5663Q9697m038o4322k0355P060n189p3454m034
22892a02600M1032m3225J9441p6537K8397R9677J56946R85j55896n4159P7410
22881h529M8271L0031J7137j43591K1736N8970L8253M9251q8139J05086J47846
22870B76322K7862j92632q4657l5124J3215P8775l9477j3030l4654L0442N201
22859C2243J8257J1837K0620N0390k1240K9837J02546P0101r0885k57046n3706
22848h7046J14073n4954m0512r5785Q3645K17707Q8347J161j07206j33731o7055
22837h1356j5744p4104k756N5066N8473R9518Q888j70630n3401K8727L1390M193
$$ y = [-138055, -287980, -327387, -250910, -266512, -336722, -303683, -130909, 6770, 111768, 20541, -60675, -116995, -187363, -103628, -27965, 61732, 57694, -6628, -26983, -19923, -25112, -98566, -102600, -61568, -104793, -85352, -161889, -133492, -33815, 123131, 124116, -31780, -85939, -8529, 39742, 69773, 86910, -56681, -34945, 24025, 62278, 111529, 23390, 128476, 276322, 304184, 111552, 26895, -8229, 4986, 83761, 44284, 31254, -3400, 27042, 32243, 50500, 62337, 82957, 133347, 112107, 141944, 244490, 314591, 223706, -33340, -87046, 27027, -27927, -68439, -164224, -80579, 137128, 225475, 226636, 119430, -14301, -81356, -97100, -171204, -173960, -118894, -60421, 39097, 47985, -122645, -176046, -147319, -115929, -111736]
22825a11736n638m0895J10126L3171N1570j0006m7137n3415N0103J12874J03824
22814A92841j4175j86878p2268J44025K5006j0451N2000J2893k1636r0384l2410
22803a437n5785P1436N407r15J15164j7215r1039o9130m4612J40016p3224l4457
22791e5791J2820p842N7417J20318P5554q8597j37951J0316J15971P6233n0499
22780A27949q4072j69622L1885J87702m2156j44377j2714Q2472Q7699l1466j32592
22769i9292K8437N6852N2172n2646R7988n3746r5004o6588o0356m4627L7841O7466
22757a31503k5358j38139J28078J21498N5951p5676k5478l6251N4586J16434J04838
22746A48980P5933r889Q649J01718o5629o8508K4912n3437j32787j12473l8330
$$ y = [-111736, -117374, -158269, -48143, -14972, 36598, 26592, -20545, -73960, -23857, 89017, 192841, 178666, -8212, -80480, 63545, 88551, 78100, 130100, 142993, 121357, 30973, -1437, -57222, 14214, 19621, 18706, 133870, 116655, 25616, -43514, -88126, 51890, -21334, -55791, -42971, -50813, 6604, 126922, 202476, 113879, -24072, -13756, 102215, 178448, 127949, 43877, -125745, -93860, 93842, 51686, -92691, -105405, -22933, 64766, 33300, -99292, -70855, -14003, 38169, -14477, 83511, 29765, -65239, -131827, -192183, -236810, -198969, -131503, -156861, -295000, -166922, -45424, 10527, -65149, -90627, -126878, -72292, 44142, 148980, 224913, 215024, 223673, 325391, 259762, 191254, 216166, 162729, 29942, -82531, -120861]
22735a20861m2296J83385J41012r1740k9625r5032n404K7198p7160O4554o5371
22724a11340M1346k659K1591L3686q955K8719j7535L385Q5844J8164j02990k09101
22712b19845p5900m7545m9632Q0233M7240L4410J01501J66584L5992j59909r631
22701i6502L7390P7248L0961j23391m7322O646j11217o7848J93951N3098k0945
22690f7931k4064Q3221J51638j7823j78501j056N5136r1893J3595J6852n3960
22679a14786q645P3979J0033p033j127Q8432l6077M9302l6336p689q3217j91853
22667b65017q7472Q9686J71692J50952q2227J1741p774J23362K600j56019j93936
22656b42412o707L1711L876j10804J14467J21327J0390q6676Q4119Q0424r041
$$ y = [-120861, -163157, 20228, 161240, 69500, 39875, -55157, -60561, -33363, -110523, -45969, -111340, -69994, -72653, -51062, -17376, -26331, 2388, -15147, -11762, 74082, 92246, -10744, -219845, -295745, -343290, -392922, -312689, -265449, -231039, -129538, 37046, 73038, -86871, -96502, -59112, 18136, 49097, -74294, -121616, -114970, -226187, -294035, -100084, -46986, -67931, -91995, -8774, 142864, 125041, -53460, -54516, 620, -91273, -77678, -60826, -114786, -123431, -49452, -39419, -46452, -47579, 40853, 4776, 54078, 17742, 10053, -73164, -265017, -352489, -262803, -91111, 59841, -22386, -10645, -18419, 104943, 107543, -48476, -242412, -249119, -217408, -213532, -324336, -209869, -88542, -78152, -164828, -80709, -285, -9326]
22645i326r9296l1535L2519r268l0472J22666K6895L973L3575L5889k1987o9288
22633a5655p0123l1996P4531M171k6849J15418j17293j7044J55500j0227P881
22622F8314L6308l4025j3682M8276K2078k7534p3884p6833K5346l5072k3376l6457
22610a20541J8072N584k096m7662m2417N2126o4370Q4651Q0323N422L2056j0074
22598h926j53078o3777L309J7422J26663L6644L482Q0564J0637j06882m0623m5549
22586a40114N7043J2517q5961k6285K6232M6588P778k4778J07242K5588j7500
22575a1650j17806j43328l5381J20310J15524k1661O0765l1281l0043J61103Q0588
22564A47140K8615q8279j07411O6059M5492j7727k5703K632j4862m2500K5071
$$ y = [-9326, -108622, -140157, -107638, -116906, -147378, -24712, 2183, 6156, 39731, 75620, 53633, -15655, -85778, -117774, -43243, -39072, -65921, 49497, -67796, -84840, 70660, 60433, 68314, 104622, 70597, 56915, 105191, 127269, 99735, 25851, -50982, -25636, -60708, -84084, -120541, -102469, -96885, -98981, -146643, -189060, -136934, -201304, -116653, -36330, -30908, 1148, -8926, -162004, -225781, -222472, -205050, -78387, -41743, -38261, 42303, 52940, -53942, -94565, -140114, -83071, -70554, -156515, -182800, -156568, -109980, -102202, -126980, -19738, 5850, -11650, -129456, -272784, -308165, -187855, -72331, -93992, -33227, -64508, -94551, 66552, 147140, 175755, 87476, -19935, 46124, 91616, 73889, 48186, 50818, 35956, -6544, 18527]
22553A8527q9119p7461M3020J17224k922j0298N6427K3855R4828j1103k9765j02195
22541C1018n6828n5808o7168L2590M4684Q7156L3587m3807k144j3390k0538j1013
22529d1661j23351M0149O028O3053M2597L7486J33656O9315j13588q8609o0722
22518c5647j22740k7086J11302n0935n3118Q7599N2221R9057p198J5817N1994
22507A21266M8130q3206n6001j7376n3611Q8413k9429j29068O0176J1061l3185
22496g2830j9961J037J8847N2444N6279J5968M394R8016J6977Q2445p0354N6798
22484B40060L490j27073o1881j15864q3578J00313o2075K0860J25034J2763k6889
22473B5160q227m8653m0085J14087O28O2014l7260o6734m1860J9519q8485j6599
$$ y = [18527, -70592, -148053, -105033, 12191, 9269, -1029, 55398, 79253, 174081, 162978, 133213, 31018, -25810, -81618, -148786, -116196, -71512, 15644, 49231, 5424, 3280, -10110, -30648, -41661, -165012, -124863, -118835, -55782, -13185, 24301, 157957, 227272, 113684, 25075, -35647, -158387, -185473, -74171, -125106, -178224, -90625, -38404, 60653, 53455, 69272, 121266, 169396, 86190, 30189, 12813, -40798, 47615, 18186, -110882, -50706, -39645, -72830, -92791, -91754, -72907, -20463, 35816, 51784, 56178, 154194, 171171, 253616, 183262, 240060, 243550, 116477, 54596, -61268, -144846, -44533, -106608, -85748, 39286, 52049, 25160, 16933, -31720, -71805, 42282, 42910, 104924, 67664, 930, -40930, -21411, -109896, -126495]
22461a26495q762l9276Q2924L2838q9050N5233J23945P4572k3046l4822p4044
22450b5983n5570j3874N9841Q9820Q1922P6140m7044o254k4221K8223L3496p3201
22438A23295j29492j74550Q0983J25022j45340k217O0875J8648l8091M4923K3328
22427a2616o3866N776J11366N0529J6345l2830r1455O2228J38522M6639j41513
22416H9125j63072q0380M9601K6045J13230M9110j17119l9243Q0707L2647k0606
22405B0045N4041J10052j00718j26670M5691P3655r7436R5358R2519j20644l9738
22394F155n6686m76K6902L1319m9229n0724J1650O1810k4037j6287K5274J0535
22382b3794O1057n6283p4570n6266l3656j04130P213K25281J89507O5343m2715
$$ y = [-126495, -135257, -174533, -91609, -58771, -147821, -92588, 31357, 105929, 82883, 48061, -25983, -81553, -95427, -35586, 54234, 136156, 212296, 165252, 158998, 134777, 163000, 196496, 123295, -6197, -180747, -99764, 25258, -120082, -122299, -61424, -42776, -80867, -35944, -12616, -76482, -70706, 40660, 91189, 107534, 74704, -16751, 45477, 183999, 230638, 89125, -73947, -154327, -104726, -78681, 34549, 83659, -33460, -72703, 8004, 40651, 20045, 74086, 184138, 83420, -43250, 2441, 76096, -21340, 74018, 166537, 45893, 6155, -50531, -51007, -24105, 7214, -42015, -92739, -81089, -19279, -43316, -59603, -34329, -23794, 37263, -19020, -93590, -149856, -183512, -287642, -280429, -55148, 134359, 199702, 156987]
22371A56987o3468r750q4655p3871J3816J3671O8393j4352J05751j196J3349k8332
22359I6343p2059j34339j44282O4677O1089L4257n3216L1406P5058K9329L9213
22348B7476P4582q773o8573k2640K0492r2265R186J38123M5549M3086k8671M6969
22336A84541k6060l1977k2928m3201J88826l60o0233j19462J2264q6301k8949
22325c3840J44834M1036n7115j30435j41706n5642M8293J29524P965r9912O9410
22314g7588P3317P2484q179O26q1267k0675j898q1325N9200O0759L2915r7356
22302f8987k062K3810J4852K928J3139O0474j4962n875j13498j42047K2N1401
22290a80805j26149J32538J31546R1253K2091J3050j8585n2431p5102Q9Q2594
$$ y = [156987, 93519, 83769, -886, -74757, -60941, -47270, 21123, 6771, 112522, 111326, 124675, 96343, 24284, -110055, -254337, -189660, -128571, -94314, -147530, -116124, -41066, -11737, 27476, 102058, 93285, 24712, 2072, 22564, -69701, -60515, 77608, 123157, 166243, 137572, 184541, 158481, 126504, 103576, 60375, 249201, 248841, 188608, 69146, 81410, -4891, -33840, 110994, 152030, 94915, -35520, -177226, -232868, -184575, -55051, -47086, -146998, -77588, -4271, 68213, 60034, 60660, -20607, -41282, -43180, -124505, -65305, -4546, 28369, -68987, -71049, -47239, -32387, -29459, -16320, 44154, 29192, 23317, -90181, -232228, -232206, -180805, -306954, -174416, -42870, 48383, 70474, 83524, 64939, 12508, -62594, -62505, 20089]
22279B0089j4368R4182L7567p6310r5909L7403j7048N5760j1192m302L1348o2114
22267d894j4808l5474Q6766J3250l2875L0135M0238p4895M5768Q2354l5243M5101
22255A45423R1499j47540j04543o8000m8204l3264M2015J08448K6525M330K0075
22244C6764J01718L9790n1158l0562l8820j6286N0525j6380q7003j17679O215
22233a22876J31122J52618k9506j34747p5795K4489L9818o0849N8341N9185k3137
22222A8663R915J1645m8538r6422j55142p414J10940n86K6527J11745k4198L3067
22210i798o344J06825l3327j12096j35197o9705J20697J95748N6723j12908o7279
22199f6661K7488j11906O9770N7843m4227j04424o1318N8668J8173J321K10223
$$ y = [20089, 5721, 99903, 137470, 61160, -34749, 2654, -14394, 41366, 30174, 25872, 57220, -4894, -19702, -55176, 31590, 44840, 11965, 42100, 82338, 7443, 53211, 135565, 100322, 145423, 236922, 89382, -15161, -83161, -131365, -164629, -122614, -14166, 12359, 16689, 36764, 138482, 178272, 127114, 96552, 57732, 41446, 91971, 75591, -11412, -129091, -122876, 8246, 160864, 131358, -3389, -79184, -54695, -14877, -75726, -17385, 41800, 18663, 28578, 40223, -8315, -104737, -259879, -267293, -156353, -156939, -130412, -18667, -42865, -9798, -16142, 90683, 57356, -54740, -189937, -259642, -138945, 56803, 113526, 618, -66661, -39173, -151079, -81309, -23466, -67693, -172117, -233435, -174767, -156594, -155273, 54950]
22188E4950J3650J8757J4935r7647J17395K7940q6834j21534L9904q768q408n5495
22176i1155j8116J16446Q6118O686j455r4581j4549j23474m7401J57144L7698
22165A3361n5391p9894k491K3537Q6714n534n2483L0525k8595P4243J61795O1946
22153B27733Q818J1176j45679l1197l6099q8379p6877k9538M8909R3514P7874
22142F0255r0938k0902Q5380k2850r8884J10999K6471L0862o9164P9152J08084
22131A98465k31277j90851j2751O8400R1408L6089n5394Q7133N945L8629o0581
22120b4785j34642R4980P4345N1260J01536l6259j40322m1808K2582Q2252p2685
22109b3546j55564R2383J0347N600q3556N9551K5336J40671j7968j14961P0017
$$ y = [54950, 68600, 87357, 102292, 4645, 122040, 149980, 63146, -58388, -18484, -27252, -35660, -91155, -109271, 7175, 93293, 99979, 98524, 3943, -10606, -134080, -181481, -24337, 13361, -42030, -121924, -124415, -100878, -14164, -19698, -72181, -41656, -70251, 3992, 165787, 227733, 236551, 247727, 102048, 70851, 34752, -53627, -130504, -160042, -111133, -17619, 60255, -30683, -51585, 33795, 10945, -87939, 23060, 49531, 80393, 11229, 90381, 198465, -32812, -223663, -236414, -168014, -76606, -40517, -95911, -8778, -2833, 35796, -24785, -159427, -64447, 9898, 61158, 162694, 126435, -13887, -55695, -33113, 49139, -23546, -179110, -86727, -76380, -70780, -154336, -94785, -69449, 71222, 53254, -61707, 8310]
22098H310M8724J52543k6481K34n2697r3860J6614L2728j23194m6301O9761n841
22086a9460O4619m9429m4677J27897K12868Q6509j30909o5634j11303r5500q5836
22075a10855r7429j8809Q9153J32162o2399m3517L3494O8205j2283q46K4802l4594
22063c2916L4730R8739K8204L6862k8025o2864k0943J5050m7393J16j6694J8440
22051B3306K4353O0522L8051K1306P2067p6056j10721N3168l3122r2435l7101
22040e6662o6250m2145J17309J25105j9842K383N6217J8829M6265J9192o9909
22029A30492J05323l8950j74773j06630J8133o369p8819p417L8657m930J2816
22018a12467p474o8442Q8990K05178J49943p9751j08258j74014J0544m0906K8465
$$ y = [8310, 57034, 209577, 183096, 183330, 130633, 36773, 53387, 86115, -37079, -83380, -13619, -19460, 45159, -4270, -48947, 78950, 291818, 378327, 247418, 181784, 70481, -25019, -110855, -208284, -227093, -137940, -5778, -68177, -111694, -78200, -9995, -22278, -23124, 1678, -32916, 1814, 100553, 128757, 165619, 137594, 74730, 53787, 68837, 21444, 21560, 4866, 23306, 47659, 108181, 146232, 167538, 239605, 163549, 52828, 105996, 72874, -19561, -56662, -122912, -165057, -47748, 77357, 57515, 59898, 116115, 134944, 181209, 200401, 130492, 235815, 196865, 22092, -84538, -66405, -72774, -151593, -159010, -120353, -125283, -112467, -119941, -188383, -99393, 105785, 255728, 175977, 67719, -106295, -95751, -136657, -108192]
22007a08192J17371j5444k6334j4399M4562J00975m3304M4627r7362j23865K6278
21996i5087J2923o0751J14678L8180J0725K8623l2933j41052n3577J7102R2011
21985f9158R5512L5949M5209k6312J06150k1702K0986J20665j43259k08724j24419
21974a69103j1118M4533J62510J68237j00138p5428Q921j5842p8893l8549l2910
21963a37780n3557J17638J10290O592K7320q6615N2828O7613k2440n2167j9184
21952A0538N6260R9693J00279k2660j09779n1917j39707j73086K5256K10033N4212
21941E9122l7469M2145l3826K8569M7878j27240k0818r362O1025L981r0817L5120
21929d1692R4831j6297j01797J8554M6712j6703j00711J04568m336l7263j02639
$$ y = [-108192, 9179, -6265, -32599, -46998, -2436, 98539, 55235, 99862, 2500, -121365, -95087, -82164, -142915, -28237, 9943, 20668, 49291, 16358, -124694, -178271, -161169, -69158, 26354, 62303, 107512, 81200, 187350, 165648, 186634, 307299, 164040, -44684, -169103, -180221, -135688, 26822, 195059, 94921, 19493, 28414, 12572, -66321, -104870, -137780, -191337, -73699, 36591, 43183, 70503, -16112, 36716, 104329, 81889, 29722, 10538, 66798, 166491, 266770, 244110, 134331, 82414, -57293, -230379, -205123, 4910, 59122, 21653, 63798, 29972, 58541, 106419, -20821, -41639, -51001, 10024, 14005, -76812, -41692, 53139, 36842, -64955, -46401, 311, -16392, -117103, -12535, -16871, -54134, -156773]
21918a56773J20103k3503m5131N9629J00079j50073q9343l8558J23318R6094q2595
21907h6753L0937K0298n9557j25410l8288L5779J34374J87236K160O0399N9607
21896B20782n8895k20439q3065O5735J09737J12740j13394j44433J1048J03369
21886C185r229N1434n427M3373R3074L743j31157L4251K610j2389m8688o1194
21874c6414p2128p1986j7239J50293p1220O097K5136J23234k7163O9570J7775
21863I5955q3477j18144k9980j2177J5797M3787N2511P378Q7122m3485N6293j05805
21851c4225j02280O6284J41629J04169m6933J2051r511j8982k4306o3238l3137
21840h479j5846l3108J0183J7469l0741J1948P3884l2366r8156l6884l2873J24590
$$ y = [-156773, -36670, -60173, -105304, -45675, 54404, -95669, -185012, -223570, -100252, -4158, -86753, -55816, -35518, -95075, -220485, -258773, -222994, -88620, 98616, 100776, 161175, 220782, 161887, -58552, -141617, -75882, 33855, 146595, 33201, -111232, -100184, 3185, -6044, 45390, 39963, 83336, 176410, 180153, 48996, 83247, 85857, 73468, 24780, -36414, -108542, -180528, -197767, -47474, -118694, -112597, -87461, 35773, 8610, 78180, 95955, 12478, -105666, -135646, -147823, -132026, -88239, -35728, -28350, 58772, 15287, 71580, -34225, -136505, -70221, 71408, 175577, 128644, 140695, 131184, 112202, 87896, 24658, -8479, -24325, -57433, -47250, -29781, -60522, -48574, 25310, -7056, -105212, -142096, -174969, -50379]
21828e0379K14509q1269N2688j4820L5372q4961Q06p2893N608n8835q7394M4002
21816i7566J40341K1831j33621L0897J20322K467o1065p449m3552m252j06438
21805a38085k02940K0548J94682R6829R0296K0076N4114r1643k7455m3128q3256
21794a09962m4122P1566Q3413k1871J6300O188p6j05943m8782j4412k2948J4675
21782a75974J5J27269J34678N798m422N3369j45115Q1524N9761j73319r6050L4390
21770i8076J8878J1099p450j45650m3122j4655N8821J23693J72450J36635r1863
21759A20760k20704k0474p3102M8730J02289J8952L4850K6162o1409m4586J3792
21748e4740J60662m3158j10773M4890J42435K053J9324K8800O3648k6475j58927
$$ y = [-50379, 164130, 82861, 135549, 120729, 156101, 71140, 71946, -947, 4661, -54174, -141568, -97566, 42775, 64606, -69015, -38118, 82204, 84671, 23606, 16157, -27395, -31647, -138085, -341025, -320477, -125795, -28966, 61330, 81406, 135520, 43877, 16422, -26706, -109962, -154084, -82518, 895, -20976, -4676, 1512, 1436, -104507, -153289, -167701, -190649, -175974, -175959, -48690, 85988, 91786, 87364, 140733, -4382, 77142, 136903, -36416, -132466, -98076, -79198, -68099, -75549, -221199, -264321, -278976, -220155, -96462, 75988, 212623, 120760, -99944, -120418, -193520, -144790, -42501, -23549, 11301, 37463, -23946, -68532, -54740, 105922, 62764, -48009, -3119, 139316, 141369, 160693, 189493, 253141, 226666, 67739]
21737F7739J6014Q9426r4459q0398J29942M1597j39947o8858L4435Q0492o9747
21726F236j16249p8545K5434k769o0833j3220Q6800L7681k973j0983o4352J43186
21714e0587P0683r0948p932P9193K1684J7181l8921j2562q815N2748M3915J2990
21702H8629Q6917j17566j39069Q0857K5441j2023J23885P7645N6957M6125j62283
21691A55515k2588K4195p3687l6567L2530j3346o9765r5817M0562j2349K9958
21680d1359L941N739q2844k9221o9529J06448J24891J6688N9045Q2773K5837o1594
21668A40815n9181J2317J6238l5521j1865o6855j10519K0613N3272J35040M9816
21657A44170L9333L7987p1965j05222K1869M5686q8686L1610M8525o725K6515
$$ y = [67739, 83753, 173179, 78720, -1678, 128264, 169861, 29914, -38944, -4509, 75983, 6236, -110013, -188558, -163124, -165893, -226726, -239946, -153146, -115465, -118438, -129421, -193773, -50587, 20096, -70852, -78784, 409, 22093, 39274, 353, -12209, -21024, 31724, 75639, 88629, 175546, 57980, -81089, -232, 25209, 13186, 137071, 214716, 271673, 317798, 155515, 132927, 157122, 83435, 46868, 79398, 66052, -3713, -99530, -58968, -71317, -41359, -37418, -31679, -114523, -143744, -213273, -106825, 18066, 34754, 93799, 176572, 202409, 140815, 81634, 93951, 110189, 74668, 62803, -4052, -114571, -93958, -40686, 94354, 144170, 183503, 221490, 149525, 44303, 66172, 111858, 23172, 54782, 103307, 96582, 123097]
21646A23097p2444P493q0397j17704n6409K0880Q5137N6773M8485j23217P0213
21635c8093N1261Q2061M4677K5292K7122J7999j8077o7389n5260q371O8919p1031
21623E9110l4712M0894P326k3243o0175n173j424k3043k7386J2028R27l1341n8731
21610a44943P9115K8122K9075Q4873J48544M8395o9406r3217o2702j9998R233
21599C7091n1350O9162J7593p3655R822l0044r1049R7330j3816l4241J10454o9301
21587b2004o1137M8397l0564k4929j1516M0627R5949o5174J412K18009O5079j04456
21575A49693j03531j07715m8467N7327L5726K25606J16330j24071j38048k0474
21565D2376P6878k05038n8586J6801q625O8566P1939n8940R619R5157L6998p997
$$ y = [123097, 50653, 58146, -22251, -139955, -196364, -175484, -90347, -33574, 14911, -108306, -38093, 13168, 95229, 139906, 165198, 192320, 210319, 192242, 124853, 69593, 61222, 130141, 59110, 24398, 65292, 72618, 49375, -10800, -15973, -17397, -40440, -67826, -55798, -54871, -86212, -144943, -65828, -37706, -8631, 76242, 224786, 273181, 203775, 110558, 47856, 27858, 37091, -14259, 54903, 72496, -1159, 8663, -21381, -112430, -15100, -28916, -63157, 47297, -22004, -83141, -34744, -65308, -90237, -101753, -61126, 34823, -30351, -28939, 189070, 254149, 149693, 46162, -61553, -110020, -52693, -16967, 208639, 324969, 200898, 62850, 42376, 119254, -85784, -144370, -127569, -136194, -67628, 4311, -54629, -45010, 50147, 87145, 79148]
21553G9148k3398r8589m7292N7155Q6785p9740j03516j589L736O8185J54110L4502
21541A29497o7199n4332J27009J49794M2962j2326j61583m1202k1427n887N0451
21530A35757Q3454n6511j34430m313J31640j9267j25785j07444q4211J35667J18947
21519G3504q6297O5531K8180q6893K4599p953m0172O8343j04613l3571J03510
21508D168M924O371N5365p426o8211j11070o5374K5845K3289O9206J52113j9991
21496F9209j15254L2158J01232k6492p1401k4796m3959M4139J01230J09532m0873
21485A34725j47666k8014L1512K3497K3482p7049o4001M8904L4422o6552J10144
21474B3404O2829J3964j9722K1059j07944o6778l7543p3715L2251R5285R5450
$$ y = [79148, 55750, -42839, -90131, -32976, 53809, -25931, -129447, -131036, -127300, -59115, 94995, 129497, 62298, 7966, 134975, 284769, 327731, 315405, 153822, 112620, 91193, 85306, 135757, 219211, 162700, 28270, 23957, 155597, 136330, 10545, -96899, -181110, -45443, 73504, -12793, 52738, 80918, -5975, 18624, 10671, -29501, 38842, -65771, -99342, 4168, 9092, 15463, 70828, 63402, -4809, -115879, -181253, -155408, -132119, -62913, 89200, 69209, -46045, -13887, 87345, 60853, -10548, -35344, -79303, -35164, 66066, 175598, 134725, -12941, -40955, -9443, 14054, 37536, -39513, -103514, -54610, -20188, -86740, 23404, 86233, 100197, 80475, 101534, -6410, -73188, -110731, -184446, -152195, -56910, 38540]
21463C8540j37537L1571P5364m9473J02362N6703l4343k792r3970o7780N598j0800
21451h6557R3313J31359o6174j17787P890M1782n8682O9341Q7916J11420O8712
21440B82533o8517m9221j30208m5728m41K5833L4129l8849P8506N2031r0795q7093
21428c7820j52180P5487J19048P8471m8707m0775n9557J924K2302K9537j968L2089
21416A7851M8572L2965j510k9655J8652L7615M5675K7105o9631R386N5363j66235
21404B6153J1260M6598L2548o7814j9453n6877J4523o067P6167R5924O6458k7774
21392A91646j2208m1194p3553M2658P360j07517J1748l429q9943l8223R0350k1005
21380d3310k8387P5504K0683P3279Q6523j9645p3771K2242Q7834j11974j35677
$$ y = [38540, -98997, -67426, 7938, -41535, 60827, 117530, 83187, 80395, -13575, -81355, -75757, -86557, 6756, 138115, 71941, -45846, -37956, 3826, -54856, 14485, 102401, 213821, 282533, 214016, 164795, 34587, -11141, -11582, 14251, 48380, 9531, 88037, 140068, 49273, -37820, -190000, -114513, 4535, 83006, 34299, -6476, -66033, -64109, -41807, -12270, -14238, 17851, 66423, 99388, 97878, 68223, 86875, 124490, 170165, 197270, 127639, 137025, 192388, 26153, 37413, 84011, 116559, 48745, 29292, -27585, -13062, -19129, 57038, 152962, 219420, 191646, 179438, 138244, 64691, 107349, 114709, 7192, 18940, 15511, -74432, -112655, -22305, -43310, -71697, 3807, 24490, 97769, 184292, 164647, 90876, 113118, 200952, 88978, -46699]
21369d6699J00794K1061J06434j19505j8324J3738O9143M043q3683M5875j6307
21358G6570N234q0161N4146J01803o7451m7852J9940Q571M9673p209j06815l8219
21346c1770M073P4000L5012l846N1999k736j32513k3431K9250J6268L9089K2714
21334G8109K3749p2285j43920j39427q2291J78262K24550L6095j700J6994q367
21323A09769j27436Q312k5007j05701k0546M6398P0133r3234o6958R6459K32017
21312A24206k002m8316M5708l0182r9144j46639m2995J29442O8411l645R814n5196
21300e0538J6868M6498K5883P0372k8422j05901P0868P3006m4577m691l2982J4130
21288E0514m2497p8225N7421K4701k7146J8245O1629n4090R8997K3849J1919J00022
$$ y = [-46699, 54095, 75156, 181590, 62085, 43761, 57499, 126642, 130685, 47002, 92877, 76570, 81804, 1643, 55789, 157592, 90141, 42289, 62229, 70800, 120473, 113264, 6449, -31770, -27697, 46303, 81315, 77469, 129468, 126732, -5781, -29212, 38, 16306, 55395, 78109, 101858, 29573, -114347, -253774, -336065, -157803, 66747, 102842, 101142, 118136, 109769, -17667, -9355, -34362, -140063, -160609, -114211, -44078, -137312, -204270, -107811, 124206, 122204, 73888, 119596, 89414, -9730, -156369, -199364, -69922, -1511, -5156, 4658, -50538, -33670, 12828, 38711, 109083, 80661, -25240, 45628, 118634, 74057, 69366, 36384, 50514, 8017, -70208, -12787, 11914, -15232, 3013, 64642, 10552, 109549, 133398, 145317, 245339]
21276B45339j1347j08870Q148o3092L5448l932k3516m0500j8208J3260K2664N5379
21264A10773m7744L4754J531j4871N365N8110l9244N614Q7116K38n9420o6695
21252G5527q1383Q24Q823N3906j7167k2004M017r4997n2258j5374L3503j0318
21240a16901j8597l2834O4327n3957O960j5046q3884Q1732P8694K265O260n4557
21228a35538J415k352O8196Q2155J0161M9506R2368K2553L2100j17930j12761
21217a0127n4488J4421Q892m197p662p7430l6697K2402j2412K1825J08317N5702
21205B8546Q533O846n5019n1623J62396J02037j65423j21347K7219m1980p3488
21194a73303K5795N6033k1441n4768j31276k1816O8903P1215N9044j39020J16134
$$ y = [245339, 233992, 125122, 133270, 70178, 105626, 101694, 78178, 37678, 19470, 32730, 55394, 110773, 63029, 97783, 99314, 84443, 89808, 147918, 108674, 114288, 201404, 201642, 142222, 75527, -5856, -5032, 3791, 57697, 40530, 18526, 22543, -72454, -124712, -140086, -106583, -116901, -135498, -168332, -104005, -157962, -151002, -166048, -249932, -168200, -89506, -87241, -80981, -135538, -134123, -136475, -68279, 13876, 24037, 73543, 165911, 188464, 220564, 102634, -10127, -64615, -50194, -41302, -45499, -53161, -130591, -167288, -144886, -157298, -135473, -27156, 28546, 37079, 43925, -11094, -62717, 99679, 201716, 36293, -85054, -57835, -99815, -173303, -147508, -91475, -112916, -167684, -298960, -320776, -251873, -180658, -121614, -260634, -144500]
21183a44500L6242Q0173N1185j04593K32R6672n1446P1800M0234M9459P532N6736
21171A89726k7266j63144r2415J47925k955n0295l4118M8487K7032L746n4335
21160g612J12440l1968M2517o3075m8750J2857N3274j4170P6150l1408p4173M5134
21148G1216L6885O0870k8108J7713O5087l3396p0956q8702j23462j2826n9057
21137a64736m6562N374K25324j0221k0761o9279K9859L2162N7047N1203M7568
21126A36978q109j39992j1790P9814M497J2558Q1719l5029k8297j25356p7306
21115a10313O9803N8120j17118q6727j1087L3652J02465k5195j42782L7126J06542
21104h5514N3245q7765j34440k0691N2481M9164J1028J07274M2460P7311m2047
$$ y = [-144500, -108258, -28085, 23100, -81493, -81261, 15411, -36035, 35765, 75999, 125458, 132990, 189726, 162460, -684, -93099, 54826, 51871, 1576, -32542, 15945, 42977, 46723, -7612, 104828, 72860, 115377, 52302, 3552, 16409, 69683, 55513, 131663, 100255, 26082, 71216, 108101, 168971, 140863, 158576, 223663, 190267, 119311, 30609, -92853, -105679, -164736, -211298, -205924, 19400, 9179, -11582, -80861, -51002, -18840, 38207, 89410, 136978, 128869, -11123, -22913, 56901, 61398, 73956, 155675, 120646, 92349, -33007, -110313, -40510, 17610, -99508, -186235, -197322, -163670, -61205, -86400, -229182, -192056, -85514, -32269, -120034, -254474, -275165, -222684, -173520, -162492, -55218, -12758, 64553, 22506]
21093B2506l6128K7913l5844N0222M8675o7063J3311J06249m9444R3122N9362
21082B32881m2683j72922o8198J5381M796K1111K13o6562p4345J05299j235j49357
21070a95621M1995J26416n5330K5045K8113M6467K561M4136j69813k2431K816
21059a25646o1092P6791R9995J1599j5470q4835j3410O1596o0561J3231L787l253
21047i7268O4352n5100p8024O9272J38980M7407j5770m0665o630m4824R2055R6409
21035A70194o8344k5142j09191J36541K4152q7270O356l7643j768j088M0811L7570
21023H5178m3035j50814r3748o5111Q4649J14819L1175o9045K3442J67313J11935
21012A96758O7252l6370K7209L1818m4273o7781j12271j4709p2078r3753p6880
$$ y = [22506, -13622, 14291, -21553, 28669, 77344, 10281, 23592, 129841, 80397, 173519, 232881, 190198, 17276, -50922, -35541, -30745, -9634, -9421, -75983, -150328, -45029, -46264, -195621, -153626, -27210, -82540, -57495, -29382, 17085, 19646, 63782, -106031, -128462, -125646, -186738, -109947, -9952, 1647, -13823, -98658, -112068, -50472, -111033, -97802, -94015, -97268, -32916, -88016, -166040, -96768, 42212, 89619, 73849, 33184, 26554, -18270, 73785, 170194, 101850, 76708, -32483, 104058, 128210, 40940, 47296, 9653, 7885, 6797, 47608, 85178, 42143, -108671, -202419, -267530, -182881, -68062, -36887, -105932, -82490, 84823, 196758, 264010, 227640, 254849, 286667, 242394, 174613, 62342, 47633, -24445, -118198, -195078]
21001a95078P9339J7453j00675R6566N1613r535m8357P9055M4442P5540n2841
20990C7522j19033m2474p4936M4054L8205l4219J02410N3978K8874M7592L1497
20979A13470O5554j81324j33128l2593P1045J40221J16363j06163r9808k7353
20969g3716Q7294R7063p4518m4715n3642R401k2497j19681J3477M5613l1120L3738
20957a33303K4101j2252J6810M5185L7320K0122P2554J4768j08859q6583Q5798
20946b4339O9798o3218q7593o9988K296J27931M7093j04093m4889L5106J03084
20935h812K4908Q6196l725r2805J5231O6141J7579r6498o6291q3416P80L400P0324
20922f6988O1015K5379M0816K5930r9884k8906J01451p335j10336p2201k0691
$$ y = [-195078, -115739, -98286, -198961, -102395, -50782, -60317, -108674, -29619, 14823, 90363, 37522, -81511, -123985, -198921, -154867, -116662, -150881, -48471, 5507, 34381, 81973, 113470, 179024, -2300, -135428, -168021, -96976, 43245, 159608, 53445, -46363, -73716, 13578, 110641, 36123, -8592, -62234, -52833, -75330, -195011, -181534, -135921, -167041, -133303, -109202, -121454, -104644, -59459, -22139, -2017, 70537, 85305, -23554, -110137, -24339, 45459, -17759, -105352, -175340, -173044, -45113, 1980, -102113, -147002, -111896, -8812, 16096, 102292, 98567, 5762, 20993, 87134, 104713, 8215, -58076, -141492, -140712, -137312, -66988, -5973, 19406, 60222, 86152, -13732, -42638, 58813, 51478, -58858, -131059, -151750]
20911a51750l6534m772P127J77823J24712j37228j58217L8135K5786P1163J45209
20900A01454k9296q3298p0092O545O7508N6550L1388k031o4303Q129j05106m5033
20888a27585N4103Q2549J08828J7743k6989m9937n4415K0783k7002J05223J51904
20877B55205p321o3955r3251j4714j35643J6725m1061J2618j7741l4549M2967
20866h0720Q5519K1703M1508o5359j4576j062J05073q1204p4553K2009O2582l7262
20854a6342N6246l9191q7121P7197R1012j21924m0548J49065Q745j7055M5073
20843A05157m2185j777O8793M0175k1033r2231p1955L842j24242N0623n9266R1405
20831e2694J14215p4533Q4515J53644l7611r1693K969j79101l2601l302Q0210
$$ y = [-151750, -188284, -193056, -185929, -8106, 116606, -20622, -178839, -140704, -114918, -43755, 101454, 72158, -11140, -81232, -74687, -7179, 49371, 80759, 78728, 14425, 22554, -82552, -127585, -73482, 9067, 117895, 135638, 108649, 58712, 4297, 25080, -1922, 103301, 255205, 247884, 183929, 90678, 75964, -59679, -42954, -84015, -71397, -89138, -123687, -80720, 4799, 26502, 68010, 2651, -11925, -12987, 92086, 10882, -63671, -41662, 20920, -16342, 39904, 713, -86408, -9211, 81801, -40123, -80671, 68394, 77139, 60084, 105157, 62972, 61195, 129988, 170163, 149130, 56899, -15056, -11214, -135456, -84833, -144099, -52694, 61521, -13012, 71503, 225147, 187536, 95843, 98812, -80289, -112890, -116192, -35982]
20820c5982N0138J2587M5845p3640q1508q8869k1005J09521L3652N7962J8925
20809B7626r1657p8332M0150P2439J18645L7713r387J523r524j8972j8307j29659
20797e7742j42929j00875k7935K42634K8598o1531k5268R6939J63410L6445K6231
20786A77977r1261p0691M3816L989L4367L3486k8337j26188p8852j09151J5741
20775a95104J31928K7468j8192o0784K787O8265L6913J12454N405j70292k1100
20764h0252J28209P1314M7321l837k2104m0467K3954q2354j23419n236K3171n3736
20752a17436k5283N7371j0939R736n2575J3664J76612R7593r604r9442n7845K9059
20740A0911J4039q4022n3877M6282J8740J27931M7549m2806j02856j34617J75125
$$ y = [-35982, 14156, 26743, 72588, -1052, -82560, -171429, -192434, -82913, -49261, 8701, 27626, -64031, -142363, -102213, -29774, 88871, 126584, 117197, 118720, 109196, 90224, 71917, -57742, -200671, -301546, -329481, -86847, -58249, -119780, -145048, -48109, 115301, 151746, 177977, 86716, 16025, 59841, 63830, 98197, 131683, 103346, -22842, -101694, -210845, -195104, -63176, -35708, -53900, -114684, -111897, -43632, -6719, 105735, 111140, -59152, -80252, 47957, 119271, 166592, 162755, 140651, 100184, 124138, 41784, -81635, -86871, -63700, -117436, -142719, -85348, -96287, -86551, -139126, -125462, 51150, 148743, 139139, 39697, -18148, 10911, 24950, -59072, -112949, -66667, -47927, 80004, 127553, 84747, -18109, -152726, 22399]
20729B2399L7855j01242m948P938l6251L468J0366j7013Q8243j5335n3059j5433
20717g3012J23978L611l9820k080j1150q6367k0002n0170o7247Q0048O6448L4533
20705d1230q5196k9988l8077R4454J48189j11868J34L450J02031J114l7179L0427
20693C6261k5418r9047L6524M0548K4171M166L037l1389m4692P6481j4501L8802
20681D4943M0223k575K454L0066o6402l5946m1820J0979R6225M0141j675Q3410
20669B00023o5055j22182o226J16587O693n0129J371N0957J5438O4656j04007
20658A08126k6514o5109P969Q9280m7107R5064j3681p0272P6290j26592K641N520
20646C5615r8346q1871K13043J47025J5131q2485j48845p5389N0948O3738n7182
$$ y = [22399, 60254, -40988, -45936, -37998, -74249, -70781, -60415, -77428, 10815, -4520, -57579, -73012, 50966, 54577, 14757, 12677, 1527, -84840, -104842, -155012, -222259, -142211, -75763, -41230, -126426, -156414, -194491, -100037, 48152, -63716, -63582, -60132, 41899, 43013, 5834, 36261, 10843, -88204, -51680, -11132, 13039, 17205, 20242, -11147, -55839, 20642, 6141, 44943, 85166, 82591, 85045, 115111, 48709, 12763, -29057, -18078, 78147, 118288, 116613, 200023, 134968, 12786, 6560, 123147, 129840, 79711, 81082, 132039, 147477, 212133, 108126, 81612, 16503, 24472, 113752, 66645, 161709, 148028, 77756, 154046, 27454, 30095, 35615, -62731, -144602, 68441, 215466, 230597, 148112, -733, -76122, -25174, 38564, -18618]
20635a8618o5609K21982J94439j83126j58259K5928m5175N7175R0163l7255m2573
20624C9072J3013M4439j0849K3893q8476j16356o0228M9820J03513M8815M2147
20613H8803m6325j29434n1392M2554R5534P8021J10198l3663m4953Q3855r1294
20602A01904r7926L0348m7538J8Q1014m0870j48812j34260l8900r1003J20675
20591b65350N3003P6316J04339l7620j31333Q5011J35947N5267n5269p9861J06088
20580D6538J5117O8151j5564k0957k4933j11327k5652p505K8544j7903l5524l5569
20568a36584l5843L0663O3297j9860R1660j32407j53180O7306K17959M9521J9328
20557F1860J1185P5300o4944L6073n2519q8192j7432J52040n3459j19034k213
$$ y = [-18618, -84227, 137755, 332194, 149068, -9191, 16737, -28438, 28737, 118900, 81645, 39072, 52085, 96524, 85675, 109568, 21092, -95264, -155492, -105672, -2159, 46656, 88803, 42478, -86956, -138348, -95794, -260, 77761, 187959, 154296, 109343, 193198, 101904, 3978, 34326, -13212, -13194, 67820, 26950, -121862, -256122, -295022, -386025, -265350, -212347, -136031, -31692, -69312, -200645, -115634, 20313, 75580, 20311, -59550, 46538, 61655, 129806, 114242, 93285, 68352, -42975, -68627, -76132, -47588, -65491, -101015, -136584, -172427, -141764, -78467, -98327, -6667, -139074, -292254, -224948, -6989, 42532, 61860, 73045, 148345, 83401, 119474, 66955, -21237, -38669, 113371, 59912, -59122, -61335]
20546f1335R2865N3083j41090N4622N0632j13836j25989j8924J20958l6562R555
20535a16021J85898m04O2692j08224j10483m6450N6865J05130K8710O4549k825
20524A19437r5549o3390j10008K983J02454K40282J9274O79j32015j47008j44178
20513b07039L7066r3958j6613J5469J09910J05981J5788j7671n9775J240r1859
20502b01461M1228M5612k0338J886Q3460J42894J0358q0084j2857L2564N294l3141
20490A5415j6312L88Q0775o599L99l164j25384l5225J17670r5099J13527J86940
20478B33331j1470j93547l696Q548j6302J2910M9820K707l1232m6373n1790J8952
20466b8142J31993J11465l1239j33820m4554J64590K1946k3910j05421n1825n6167
$$ y = [-61335, 31530, 84613, -56477, -1855, 48777, -65059, -191048, -209972, -89014, -125576, -116021, 69877, 69473, 132165, 23941, -86542, -132992, -76127, 29003, 57713, 122262, 119437, 23888, -39502, -149510, -146527, -44073, 196209, 215483, 216162, 84147, -62861, -207039, -169973, -263931, -280544, -265075, -155165, -49184, -33396, -51067, -110842, -109602, -201461, -160233, -114621, -134959, -133073, -49613, 93281, 103639, 23555, 10698, 43262, 48556, 15415, -897, -509, 80266, 73667, 74066, 70902, -54482, -89707, 27963, -67136, 46391, 233331, 221861, 28314, 24618, 33166, 16864, 29774, 79594, 82301, 51069, 4696, -47094, -28142, 103851, 215316, 184077, 50257, 5703, 170293, 192239, 168329, 62908, 11083, -45084]
20455d5084O239M4756n549m5050o0116R6847r2657J7724K2127M3310r6891m6440
20443a60784r5845l9980J13700R6760O845J33670K701n5238J0987m6364l0023
20432f3571n7585J9881N05L0221l1887n4589N5923J16683n983L4780n2215P2194
20420F4357j6123o0102L1170J04785n6517l8840L7207O3044M3323J3801j27713
20409E8392j00452J013M8737O1262r950M5733j0848k1847l4286P2895P7349r4663
20397I3335r0544J04191N3847K2934o9867q6367J2348p6099p1449J11860J76335
20386A80524J56864l8703K2417k9683n3860j31005j24627R4233J59144M6872j19313
20375A62863j34572K1357L8718o4982j34050k3844O4962J59546J34620j29157
$$ y = [-45084, -38845, 5911, 362, -44688, -104804, -7957, -100614, -82890, -60763, -17453, -114344, -160784, -256629, -296609, -182909, -86149, -79304, 54366, 57067, 1829, 12816, -33548, -63571, -121156, -101275, -100770, -70549, -102436, -157025, -101102, 15581, 9598, 44378, -7837, 64357, 48234, -11868, 19302, 124087, 67570, 28730, 65937, 128981, 172304, 186105, 58392, -42060, -41047, 7690, 68952, 59002, 104735, 93887, 72040, 37754, 110649, 187998, 93335, 2791, 106982, 160829, 183763, 113896, 27529, 39877, -36222, -107671, 4189, 180524, 337388, 298685, 321102, 291419, 237559, 106554, -18073, 76160, 235304, 282176, 162863, 28291, 49648, 88366, 23384, -110666, -134510, -69548, 89998, 224618, 95461]
20365I5461q4689l6336J04475J23741N7673P511j17548r7779o6188j1509p4583
20354i9771N8029M2360o4169o9412L704l3608M6521P2691L6567j16189n1726N5980
20342a19023L4714K6844j05763J7382p3563J5040J28631R3873P4727P8258k5914
20331A45206J9746k4089o5974j07652J59252O1296n3828q0654o019k363l7140
20320G781O8906N8854o3753n1739j79912j60675J00516J46169J81945L8033O4392
20309B10517j1150m9666j79611q4348q5276J2666k1450M7291L7738M2615N4157
20298b6517K1341J3610o4500j38252j07368J04723N5601p7058o7212J64791J43856
20287B3015J15566J41386n8092k04867k4251k1489m9323L3999J8573N578j38105
$$ y = [95461, 10772, -25564, 78911, 202652, 260325, 267836, 150288, 52509, -13679, -25188, -99771, -41742, 618, -63551, -132963, -129259, -162867, -116346, -43655, -7088, -123277, -175003, -119023, -84309, -57465, -163228, -145846, -219409, -204369, -75738, 18135, 92862, 171120, 145206, 164952, 140863, 74889, -32763, 126489, 187785, 133957, 53303, 47284, 44921, 7781, 76687, 135541, 71788, 20049, -159863, -320538, -220022, -73853, 108092, 146125, 210517, 199367, 149701, -29910, -114258, -199534, -186868, -208318, -161027, -123289, -80674, -26517, -5176, 8434, -56066, -194318, -301686, -196963, -141362, -218420, -285632, -120841, 23015, 138581, 279967, 221875, 17008, -7243, -28732, -78055, -44056, -25483, -19905, -158010]
20276a58010M3165J33489Q0262M9494j11806q4617J199J38522l7391j17515l3490
20265i6698P2855N6766k4778K5926n2593M2106O4774P5986J5425j63951j15769
20254i9951j7137O5827P9358N0656M4624k5418j34766m852l165J19771n2708r722
20242A2517o4315r4715N0284J31783k6274M8680k6880k901L9148J7023j3831n4603
20230A5916k391K0619O2887k6726q0218m8719L9409m015R4875N4861j10911o6382
20218e0795j1479K6675J11842N1832J0367j10595n014J21079J64747m8667j72826
20207H7166o3190o247k2883o0369j9663j3936P400Q1825Q1478P6779m6117o9306
20195C2937j6393p014k0556L7821L169k8347J3788O4099M4433p6990j6485J7922
$$ y = [-158010, -114845, 18644, 98906, 148400, 36594, -48023, -46824, 91698, 54307, -63208, -96698, -23843, 32923, 8145, 34071, -18522, 23584, 88358, 164344, 179769, 15818, -99951, -117088, -51261, 28097, 78753, 123377, 97959, -36807, -41659, -44824, 74947, 22239, 12517, -51798, -146513, -96229, 35554, 9280, 57960, 31080, 28179, 67327, 84350, 70519, 15916, 13525, 34144, 97031, 70305, -9913, -58632, -19223, -23238, 71637, 126498, 15587, -50795, -62274, -35599, 76243, 128075, 138442, 27847, 22833, 143912, 308659, 259992, 87166, 23976, 17729, -5154, -65523, -85186, -99122, -91722, -9897, 71581, 148360, 102243, 32937, 16544, 9530, -11026, 26795, 29964, 1617, 15405, 79504, 123937, 46947, 30462, 48384]
20183D8384k8974L5283l9179N5923k0345O867p790j53932k2770m6670L102J21353
20171d8748R1924J26469o7130j3573o1407O9690J26447k6479J3820k2662j88844
20160d93r6346R1420K8219L5027k7729L1068q1953k5791L8874r15k9588j5664
20148e3871M1932j07999j9601J44742M4661J4723j9179r5019j20978n721P5368
20137a00942R7013J09958o8272j85237J7000P8093o1275L8951R6923J35164m5236
20126A12140j44496J65189K31565l9441q1745J6510j27938j1965n4304o7718n1519
20115e3722q9695l5117J77542q1851m3311J36420K276j25920J0709k839K7226
20104g8282l5430P5498J35488O4960j01433o8315r3658n059J32930P7009M2287
$$ y = [48384, 19410, 54693, 15514, 71437, 51092, 57959, 50169, -103763, -126533, -173203, -170101, -48748, 43176, 169645, 102515, 88942, 27535, 97225, 223672, 197193, 211013, 188351, -493, -96839, -5419, 22800, 57827, 30098, 61166, -20787, -46578, -7704, -8619, -38207, -53871, -11939, -119938, -139539, 5203, 49864, 64587, 45408, -49611, -170589, -176310, -100942, -3929, 106029, 37757, -147480, -130480, -52387, -113662, -74711, 22212, 157376, 112140, -32356, 132833, 364398, 324957, 243212, 259722, 131784, 119819, 65515, -2203, -53722, -143417, -178534, -992, -82843, -126154, 10266, 12542, -113378, -102669, -105508, -78282, -113712, -38214, 97274, 162234, 60801, -7514, -101172, -106231, 26699, 103708, 145995]
20093A45995j04159j11374O952O7209l9177q7600P1121Q9371K5649j09258L6966
20082h305O4651n4744p3743P536q5390M9612J894K9415m2544p2160R0264M4528
20070d8986N1863l6068J9484J0689N9005j8166n7656J14350J15119R8612O1018
20059C69264k00166n9228R2098J2148K7382o816j46186j14600k2617K1499L3151
20048E929O1375N2856q0012l1298j14990l6093Q5393R0057J895q1154l3492Q3969
20036D435L8645Q7263L5192N4830m5469j26094p0265q5974j4018J59629K135p9025
20024c8716J04949j2958r0587l2905m7145L6169J32921J03856j31703q1904k4295
20013h2318O436O883Q592J03270Q6074L6538R600o9753p2776l2729O2286j5391
$$ y = [145995, 41836, -69538, -62586, 4623, -34554, -122154, -51033, 38338, 63987, -45271, -8305, 56346, 1602, -72141, -64605, -149995, -100383, -98489, -69074, -111618, -183778, -93514, -48986, 2877, -33191, -13707, -3018, 55987, 37821, -19835, 94515, 209634, 308246, 369264, 169098, 109870, 201968, 214116, 241498, 234682, 88496, -26104, -48721, -27222, 5929, 67304, 120160, 40148, 8850, -106140, -142233, -56840, 33217, 35112, -46042, -79534, 4435, 43080, 130343, 165535, 220365, 174896, 48802, -21463, -107437, -121455, 38174, 40309, -38716, 66233, 53275, -37312, -70217, -117362, -81193, 51728, 155584, 23881, -58023, -82318, -75882, -68999, -60407, 42863, 128937, 165475, 175075, 105322, 32546, -183, 62103, 46712]
20001D6712j4533r6897J0741J07905j3621j6657j9025M9668k8725k4355J05478
19990A06691J29532J1865q1253q1542m038P7782j45369m0323L0639p3937r479
19979g9432n4767j40354l726J23051O8908R9958n227p1177j5153j6200P9335J8761
19967C977L1988j3360O5312L5439l1725Q3050O3466p624j34141j49610l6882L1207
19955e8903J94353K4143j25728j43555j29470p5920J306K08506N4288q9764k5890
19944a66634l1742O7368Q5132r4261L5439k3632j28679O7555J04203P289J4425
19933f3537Q1974J10469o5188p4716l3200l430R1302Q8104J02595m1625j35599
19922E7149K2326P9991k2297l7848M0016k2124j27683K0125L8489J8473n8787
$$ y = [46712, 32179, -64718, -53977, 53928, 40307, 23650, 4625, 54293, 25568, 1213, 106691, 236223, 248088, 166835, 85293, 81255, 159037, 13668, -26655, 3984, -69953, -79432, -134199, -274553, -278279, -155228, -86320, 13638, 8411, -62766, -77919, -94119, -14784, 3977, 35965, 22605, 87917, 123356, 91631, 174681, 238147, 230523, 96382, -53228, -90110, -58903, 135450, 159593, 33865, -109690, -239160, -315080, -313774, -105268, -50980, -140744, -166634, -198376, -131008, -45876, -140137, -104698, -128330, -257009, -189454, -85251, -77962, -63537, 18437, 128906, 63718, -10998, -44198, -47628, 43674, 131778, 234373, 192748, 57149, 79475, 159466, 137169, 99321, 139337, 117213, -10470, 9655, 48144, 66617, 7830]
19911G830m5225P36L6493l2004P9374m9625r6o9285P2793n5980n9132o6816N294
19898a75643r985R5860K84855P3035n5581m6066q0726o4075p3638j3696j33660
19887a99320n9610J41189P9375J00587o6851R516J14875j11233J6692J4772m7813
19876g821J08846P5568r9741O5503p2420j06842J3886K1279q3500q2396r5119
19865b62757M7190J26728l7834R2702N5964K9104l469r4367l884R0003o6347J04158
19853G7191J9124l3567k4046J7334r9623k3530K1646o9284N9576J00055p5632
19842c0756j3599N0763p8657o0470J2704n2655P023O7230j0958J53470K0686O2656
19830A27437k7657j53945j1944M1216j15490O4294N0991P401K323k5011n319n4349
$$ y = [7830, -37395, -36659, -166, -32170, 47204, -2421, -2517, -71802, 991, -54989, -114121, -180937, -175643, -185628, -89768, 195087, 268122, 212541, 166475, 85749, 21674, -51964, -65660, -199320, -258930, -117741, -38366, 62221, -4630, 4886, 119761, 8528, 25220, 39992, -7821, 101025, 176593, 76852, 142355, 69935, -36907, -23021, -1742, -85242, -167638, -262757, -215567, -88839, -126673, -33971, 21993, 51097, 47628, -46739, -50623, 39380, -26967, 77191, 96315, 62748, 38702, 56036, -43587, -67117, -45471, -114755, -55179, 44876, -30756, -44355, 6408, -72249, -132719, -120015, -172670, -165647, -98417, -109375, 44095, 64781, 127437, 99780, -54165, -66109, -24893, -140383, -76089, -25098, -17697, -15374, -40385, -45704, -100053]
19818a00053j33692M5140Q2121O3684J4824m6282m9722o9245k3893r6610J34484
19807a79244J01020K9792J28314L1727M5460m2764n2055K837l0631l7832K7953
19796B4577k9214J29542L0784j3672j56233p636m8399J5175R1423O6816m0831
19785F2332O6357l4171n4912j28601n0732J37903P7209J14896j45886K072l4588
19774A1879J1940J13180m319o1996j67696J4660N865o3728m1925J15106P4831
19763G797M6429J254J5836k8573p1734j6834q6564R382J01398n9333L9485p425
19751d8882j0230j0054J08148P8697j4377r842Q8911o7537j29753l4219J24278
19740G5140P8880m5760J28231J13485j39343j18992Q981k848q9308l4654P935
$$ y = [-100053, -233745, -188605, -106484, -42800, -27976, -74258, -123980, -193225, -217118, -313728, -179244, -78224, -48432, 79882, 111609, 157069, 114305, 62250, 65087, 34456, -3376, 24577, -4637, 124905, 155689, 142017, -14216, -21852, -70251, -55076, 36347, 103163, 62332, 128689, 94518, 39606, -88995, -139727, -1824, 75385, 190281, 44395, 46467, 11879, 23819, 136999, 132680, 70684, -97012, -82352, -76487, -140215, -182140, -67034, 7797, 54226, 55480, 71316, 42743, -28991, -45825, -132389, -123007, -21609, -80942, -41457, -48882, -59112, -69166, 38982, 117679, 103302, 93460, 182371, 114834, -14919, -49138, 75140, 154020, 108260, 236491, 349976, 210633, 91641, 100622, 97774, 8466, -26188, -18253]
19729a8253R4605J3170j10870Q389o310L219k3980p0825O3367J9027Q0028K4005
19717G5572n0400Q6947j0022k8942N5264K525J9580J7417j27925n921j03k9084
19705D908o1147N7639K6665L6303L8041N196l0443l1366N6921R0859P578p7443
19693A23711p1170m8037j8503J03738k3088m2663L2220J5626K3719n1579J63393
19682B07367J2704Q4461r6773j19240J04730j8846j41428j0834k4775n8662q0737
19671a42033R0149K01540P0870j48392j01915q9966Q7290N5197N340P1199j26234
19660b6955n5640n1174O7380P3348j15182l0381N8519J29312p3373j4963R1292
19649E2183m0483k6105r5657j4552j549L9670M8223j19730q5967J13065J49032
$$ y = [-18253, 76352, 89522, -21348, -12959, -19269, -16050, -40030, -110855, -47488, -28461, 51567, 75572, 25172, 112119, 102097, 73155, 128419, 130944, 150524, 167941, 40016, 34095, 33992, 4908, -56239, 1400, 28065, 64368, 102409, 107605, 77162, 45796, 102717, 193576, 201154, 123711, 52541, 4504, -13999, 89739, 66651, 23988, 56208, 71834, 95553, 43974, 207367, 220071, 304532, 207759, 88519, 193249, 174403, 32975, 22141, -2634, -61296, -142033, -51884, 149656, 220526, 72134, -29781, -119747, -32457, 22740, 28080, 99279, -26955, -82595, -133769, -66389, 6959, -108223, -138604, -80085, 49227, -24146, -39109, 52183, 11700, -14405, -110062, -124614, -126163, -86493, -38270, -158000, -243967, -130902, 18130]
19638A8130j189J4179R2785L7333j238j35073j58338l63p2031j6782J26749J61978
19626F6140N5715n3991O7121L7782o1551O1841M148o5515j14078l763P7408N916
19614G7173l4713l6755l3570j2997L9027o0391M4203m0053j7458l3507P8186M0778
19602I923p9888j29598N7310J39696P3628l7218L2122J3512l9747N2227p1415
19591B0552K9965N5232r8506m5889m5955m5935P1732O7932J17555M2095j13855
19580E4923m1600q4270l410J15455Q2019L5315j26732j74628o5511N1109Q7326
19569g0004J34998l0815n7468j13738O1107J05187j7053K3635O5050j0191r6929
19558f221O9329o9030o1645l9591m7268q4825J19126J39106J23419R9456k3311
$$ y = [18130, 16941, 31120, 123905, 161238, 160000, 24927, -133411, -133774, -205805, -222587, -95838, 66140, 121855, 67864, 134985, 172767, 111216, 173057, 177205, 111690, -2388, -6151, 71257, 77173, 42460, 5705, -27865, -40862, -1835, -62226, -18023, -58076, -75534, -109041, -30855, 9923, -69965, -199563, -142253, -2557, 71071, 33853, 65975, 79487, 39740, 91967, 20552, 50517, 105749, 7243, -38646, -84601, -130536, -58804, 9128, 126683, 168778, 54923, 13323, -70947, -74357, 41098, 123117, 158432, 31700, -142928, -208439, -157330, -70004, 64994, 34179, -23289, -137027, -75920, 29267, 12214, 35849, 100899, 90708, -6221, 63108, -5922, -67567, -107158, -154426, -239251, -120125, 18981, 142400, 241856, 218545]
19547B18545p2859Q2308m156j4474J03706j17018q9516j51018j7406m2362J10417
19536F167J03923k8369j10588L2502K9715m3642n2536J20985j5228p5299r6779
19525a29149L1995O9575O4450l2076j7183l4694p0917L3927J24249l7670j62058
19514a59551m0241j299O2779N9254J5663P8931J2794k0598N8381L6774r940k967
19502H9980n4142m8171o0357R1925R5552m1861p4678q5546K1928J00288O6284
19491A01202o45k7697P7127j9042r61l7932l837j42387q0941J2045M1945m102
19479h5225o7478N1098J33462J20797O1725N58j47027j57847O8677j0195l7793
19468f9248O7721J42769l411J8939j02491M2454O0616J4373J03959Q5196j47354
$$ y = [218545, 145686, 227994, 223838, 209364, 313070, 196052, 106536, -44482, -61888, -104250, 6167, 110090, 81721, -28867, 3635, 33350, -10292, -62828, 58157, 42929, -32370, -129149, -97154, -27579, 36871, 4795, -12388, -47082, -117999, -84072, 40177, 2507, -159551, -199792, -201091, -138312, -79058, -63395, 15536, 28330, 7732, 66113, 102887, 92947, 89980, 35838, -12333, -72690, 19235, 114787, 72926, -1752, -87298, -65370, 34918, 101202, 100557, 72860, 149987, 130945, 129984, 92052, 88215, -54172, -135113, -123068, -81123, -85225, -152703, -101605, 31857, 152654, 214379, 214937, 67910, -89937, -21260, -31455, -69248, -1527, 141242, 137831, 156770, 54279, 96733, 157349, 171722, 275681, 360877, 213523]
19457B13523p5665l8301J11678k2280j12439K8609j1186q2329j4991J5210j9429
19446g600J14139L0053J0423J9028r7764p5584R8604N434r8068R473r459j00263
19434a01584N4388J10334k2197J1302q4354R9472J27083q2179o6582n4532n7519
19423f6368M0094O9589K8753M3686j4047l989p6945j09974m6948j9373N3691R0698
19411a1133N5367J5800J10677J37876N3017j49452k96703j25552R3458K02594
19401H5949J18660j42006j24797p6216O0956M4170J53525K45875q6047j06234
19391A73835L7336K04431K0460j75823l7609J77252Q3517j02168n9246r96o0258
19380B60731j55194M2983O6054J06135N861o0047J0813n0912p147N1952N7677
$$ y = [213523, 137858, 99557, 211235, 188955, 76516, 105125, 93939, 11610, -3381, 11829, -7600, 106539, 136592, 147015, 166043, 68279, -7305, 91299, 96733, -1335, 8138, -1321, -101584, -47196, 63138, 40941, 52243, -32111, 67361, 194444, 112265, 45683, -8849, -66368, -26274, 43315, 72068, 115754, 101707, 97718, 20773, -89201, -136149, -155522, -101831, -11133, 44234, 60034, 170711, 308587, 361604, 212152, -84551, -210103, -116645, 85949, 204609, 62603, -62194, -138410, -77454, -33284, 120241, 366116, 280069, 173835, 211171, 415602, 436062, 260239, 222630, 399882, 483399, 381231, 321985, 320989, 260731, 105537, 148520, 214574, 320709, 326570, 266523, 277336, 226424, 219277, 271229, 328906]
19369C28906N3830K8382L535M8944n1083r7968q8335m5281O4290N3602n7914l8055
19357B02853p478j00455p3988j4206Q0376J06230m3183P2909j1035K9462J38026
19346C79511n7159M7233J9828n0062j9035L106j7168j8259Q0587o7679j08957
19335A91946L859J9110J6282p3252L6158P8002L3116l1567m9161J33415J00844
19324D58752r6043j03200o6069J3972J13269J0219n296L1816j36896p2932o647
19313A40945R9110N439l4107j5816j4597L2474R5782M606Q9255K18375J53172
19302G74638L3257j92675j23066r1219r6111o9772O1695P7811J01841m0298n798
19291D30303j9318k9273j00892m7467R1330J05482J6315j9853p4884j6664N4394
$$ y = [328906, 382736, 411118, 414653, 463597, 412514, 314546, 226211, 180930, 245220, 298822, 240908, 202853, 195375, 94920, 20932, 6726, 87102, 193332, 150149, 223058, 212023, 241485, 379511, 322352, 369585, 389413, 339351, 320316, 323422, 306254, 287995, 368582, 300903, 191946, 195805, 214915, 231197, 157945, 194103, 272105, 305221, 273654, 224493, 357908, 458752, 362709, 259509, 193440, 207412, 320681, 330900, 325604, 357420, 220524, 147592, 140945, 240055, 245494, 211387, 195571, 180974, 213448, 309230, 313836, 403091, 621466, 774638, 807895, 615220, 492154, 400935, 304824, 235052, 296747, 374558, 476399, 436101, 430303, 410985, 381712, 280820, 233353, 324683, 430165, 446480, 426627, 351743, 335079, 389473]
19280C89473L0441k898l8259j52203p751J04596L8717j02058m3530p7400k1362
19269A17766O1774N3777J16301m3812P2878J04667n9554j49601J45551j01119
19259C18628k6023J9053M3177j17704q7114K6424o147k1074J19707P503j54787
19248A21643r0494J12297L5578J02935M2220J2319j05783l2654R8842j6428n6445
19237B24030P7347J00850L435m2160j70253j47360L7315q2625N1766M6604m4759
19226E4190K2773n4240m4257R9269Q8600j90481n8814M2971J24437m0550k5094
19215A8804J24245N4011j7355Q2441N926k8356M7789L4997m9831n7947j9142q8928
19203A06654k4762n424O9406K7857J7548p9093m7167P7451j1477j05438O2445
$$ y = [389473, 419914, 417016, 378757, 226554, 218803, 323399, 362116, 260058, 216528, 139128, 117766, 179540, 233317, 349618, 305806, 378684, 483351, 423797, 274196, 419747, 318628, 292605, 311658, 354835, 237131, 150017, 176441, 170294, 149220, 268927, 276430, 121643, 31149, 143446, 179024, 281959, 324179, 336498, 230715, 198061, 296903, 280475, 224030, 301377, 402227, 405662, 363502, 193249, 45889, 83204, 579, 52345, 98949, 54190, 76963, 22723, -21534, 77735, 166335, -24146, -82960, -39989, 84448, 43898, 18804, 143049, 197060, 179705, 262146, 268072, 239716, 287505, 322502, 272671, 214724, 195582, 106654, 81892, 76468, 145874, 173731, 191279, 112186, 65019, 142470, 130993, 25555, 88000]
19192H8000J04397m7627K8271l9322m8995K5326q4020O6525j18301L6380Q0160
19181I0794j11342r1628J94803N3391q4310k5769n2985M2713L2903m1054m7244
19170c9728j5006M0656M8662l0228o9291J12711P2366L5436k4458l1311k4567
19159G5242L5465j9277K7016K5961j2092q168J00838M4574m0479j47828N2783
19148A34035n193L2761K1519N2472J25248j8565R7757J7343n937L5787J7994M3278
19136E48499l2953O8722J47729m1987j17246l8178P6115k521k2395j30984l4195
19125D20606Q008M2046L8312k2323j5959p6871p7271L139q5549J9741n2833J9429
19113B20475P3639J54148k8219l9622m0145K8749q460k4916N7374N0028p0474
$$ y = [88000, 192397, 144770, 173041, 133719, 84724, 110050, 26030, 92555, -25746, 10634, 90794, -20548, -112176, 82627, 136018, 51708, 25939, -27046, 15667, 48570, 7516, -39728, -54734, -14078, 34584, 4356, -64935, 47776, 120142, 155578, 131120, 99809, 75242, 110707, 91430, 118446, 144407, 132315, 124147, 224985, 269559, 229080, 81252, 134035, 128842, 161603, 183122, 235594, 360842, 342277, 440034, 457377, 451440, 487227, 505221, 548499, 515546, 584268, 731997, 690010, 572764, 534586, 610701, 608180, 585785, 454801, 420606, 428614, 470660, 508972, 486649, 470690, 393819, 316548, 319687, 234138, 253879, 201046, 220475, 294114, 448262, 420043, 380421, 340276, 369025, 360565, 335649, 393023, 443051, 372577]
19102C72577o9251L6120J57324R5492m4542j4436l0580O3308Q6130r9502o9807
19091D82833L6894J27557P1005l4612M2320K02041J12310Q946J7955P3710J17542
19080A258501J44261r610J3012M1955j10188j22734K1996k3505p1206m7982L7213
19069A131713J8867r01J7634j23187l252N9859N8323m7518q6045q8272M7604P3550
19057A058375q2619n2885L749O0651J72252J88662M0995J0166q1053j18038j29538
19046A070717j31693k5620N366K4911q2997J6729j6471k0176N750P7902M1667
19035I66085L0483J82005J91626Q3938J3460p9688m8243J581J3643J3681J5326
19024A383897J6823M2900J45980N8614k51490j47762p9497K9770J81034J46171
$$ y = [372577, 303326, 339446, 496770, 592262, 547720, 533284, 502704, 566012, 652142, 552640, 482833, 519727, 647284, 718289, 683677, 725997, 928038, 1040348, 1049294, 1067249, 1140959, 1258501, 1402762, 1393152, 1406164, 1448119, 1337931, 1215197, 1237193, 1213688, 1142482, 1094500, 1131713, 1150580, 1149679, 1167313, 1044126, 1040874, 1100733, 1159056, 1111538, 1025493, 937221, 984825, 1058375, 975756, 922871, 926620, 987271, 1159523, 1348185, 1389180, 1399346, 1318293, 1200255, 1070717, 939024, 913404, 918770, 943681, 860684, 877413, 860942, 840766, 846516, 924418, 966085, 996568, 1178573, 1370199, 1454137, 1467597, 1387909, 1339666, 1341247, 1354890, 1368571, 1383897, 1400720, 1443620, 1589600, 1648214, 1396724, 1248962, 1169465, 1199235, 1380269, 1526440]
19014A526440J2471j66666r7002K5928K72592N3328r424K773r455J30433N7197
19003A798615j09348q5721j885l5757k24448k30269k8379R5752M7715q704r8800
18992A118771J22455L5068j93769j17093j049O9976N3230P8170J4672n2920j24001
18981A003510j04697M9865l4799j04247M002l171j92949l8672K2449K870P7782
18970F81943P8684J16336M2086p0674k4082j01628j53308O661k8300J2660J5318
18959E75696J01451j1620m5210k4279K00845l767o9457m5491L1758N2814Q6783
18948H49523k2384l2201l4343j56928p8891K27349O3781j47394q2253n961L2988
18937F13286N1559j7937q479J17137J2643j21157o3959L9208J37946J83919R9812
$$ y = [1526440, 1538911, 1372245, 1275243, 1301171, 1573763, 1627091, 1617667, 1620440, 1610985, 1741418, 1798615, 1689267, 1603546, 1601661, 1565904, 1341456, 1111187, 1082808, 1178560, 1226275, 1217571, 1118771, 1241226, 1276294, 1082525, 965432, 964383, 1034359, 1087589, 1165759, 1180431, 1127511, 1003510, 898813, 948678, 913879, 809632, 813634, 810463, 617514, 578842, 601291, 604161, 681943, 760627, 876963, 919049, 848375, 824293, 722665, 569357, 576018, 547718, 560378, 575696, 677147, 665527, 620317, 596038, 796883, 793116, 723659, 678168, 709926, 762740, 849523, 827139, 794938, 760595, 603667, 524776, 752125, 815906, 668512, 586259, 580298, 613286, 664845, 646908, 638429, 755566, 768209, 647052, 583093, 622301, 760247, 944166, 1043978]
18926A043978q664M4099O9211J06435K47527K14702K50358L00139J52105n3703
18916B366187q2188P8338K01178R6422j77461j54848j53987j55820Q5737J23215
18906B226773M1739Q7458N1521M5328P3820M54229P34065Q92253J124138R81439
18896F712763J94931l4693K06702N03020K38298l25703n69507m40444J8258L40065
18886F843690N06399J160267K029932L357559M897425N986287N749469L941044
18878C4472072L411393N329729O997463M043259k358842n530757l200285j59688
18870D3004344p57348k548885k098051K41668Q11119j575971k835850j171065
18862C3069961J145280Q10764k537178m834361m247881k387872r98092J06899
$$ y = [1043978, 1035314, 1079413, 1148624, 1255059, 1502586, 1717288, 1967646, 2267785, 2419890, 2366187, 2283999, 2362337, 2563515, 2659937, 2482476, 2327628, 2173641, 2017821, 2103558, 2226773, 2268512, 2355970, 2407491, 2452819, 2526639, 2980868, 3714933, 4607186, 5731324, 6712763, 6907694, 6873001, 7079703, 7582723, 7821021, 7495318, 6925811, 6485367, 6503625, 6843690, 7350089, 8510356, 10540288, 13897847, 18795272, 24781559, 30531028, 34472072, 37883465, 43213194, 50210657, 54253916, 51895074, 46364317, 43164032, 43004344, 42246996, 39698111, 37600060, 37841728, 38652847, 37076876, 34241026, 33069961, 34215241, 35026005, 32488827, 27654466, 23406585, 21018713, 20020621, 20127520]
18854B0127520J318449K304479K568996J958284J606245K565990M736930O188627
18846D3375520N499341L771789K304546K302381K437952M4433m286383o505625
18838D8943954m692024p70847K401412K784632O31109r64208o60735K7952k101947
18829D5599298m576721m484346k413425J86135K620634N508900Q626642J0862913
18821F1930030J1469117J2009064J3825999J3783110R000383j016865p114211
18814A13886627o870953n297493q177900j3813184j5168231j1880879p377710
18807D5300277m064605j773754o6921J971575M447892O618356P610435N038066
18799F5081321p52921o478866p801127n356235j499042K174343N713504R303570
$$ y = [20127520, 21445969, 23750448, 26319444, 28277728, 29883973, 32449963, 37186893, 43375520, 48874861, 52646650, 54951196, 57253577, 59691529, 59735962, 55449579, 48943954, 44251930, 43481083, 45882495, 48667127, 49298236, 48334028, 47673293, 47701245, 45599298, 41022577, 36538231, 34124806, 34310941, 36931575, 42440475, 51067117, 61930030, 73399147, 85408211, 99234210, 113017320, 122017703, 121000838, 113886627, 107015674, 101718181, 93540281, 79727097, 64558866, 52677987, 45300277, 41235672, 39461918, 39394997, 41366572, 45814464, 52432820, 60043255, 65081321, 64328400, 57849534, 50048407, 44692172, 43193130, 45367473, 51080977, 60384547]
18791F0384547J1311590R117936K332433n867027j0244044j0381346q013253m812221
18783D3828615k361276j824406k102800k037536j472489j356492j511748j183366
18775B9978502j01608J398665L176687N476428P517149P495888M048679o22223
18767E8368167m769220n918837l861717L87274M743190Q482206J0435400Q574502
18759G6440965M137505m24637k479809k268231l139631n921493r410181j0256590
18751D6677898q531700n540180l424126k221081j662995j265745j096390o53208
18743B2282473k98673J03858P02257J131401R86296K65519p66680j824353k117570
18734B0464528j809588j285742j032397p49001n60378n28095m90743m61927m18120
$$ y = [60384547, 71696137, 80814073, 83146506, 77279479, 67035435, 56654089, 48640836, 43828615, 41467339, 39642933, 37540133, 35502597, 34030108, 32673616, 31161868, 29978502, 29876894, 31275559, 34452246, 39928674, 47445823, 54941711, 58990390, 58368167, 53598947, 47680110, 43818393, 44205667, 48948857, 57431063, 67866463, 76440965, 80578470, 80153833, 77674024, 75405793, 72266162, 66344669, 56934488, 46677898, 38146198, 32606018, 29181892, 26960811, 25297816, 24032071, 22935681, 22282473, 21983800, 22087658, 22789915, 23921316, 24907612, 25173131, 24406451, 22582098, 20464528, 18654940, 17369198, 16336801, 15587800, 15027422, 14499327, 14008584, 13546657, 13128537]
18725A3128537l04179k30244j64244j19731N945J32678L17457J96471j35466m21790
18715A2405434p03839o11189n85088m68685m67022k18413l05856k88555j49244
18706H607543j38212j29602j63031k87559j08031l5456j20130j53774j91678k65588
18696G014482k00517p3244O1859n0097p7504k23869k95673j87496k48699j91727
18686E527515L5216j02128r7286j56248J0220l8852j63376j36624r8172o0405
18676D719860j29641j72562m6059J21377r2449q5235j33187o7289j3448j58349
18666C943018k31516o4667J4261l2439L4656o152j28149j26633j35476j4118L8440
18655C291225j12497j73321n2179M620n3125K1290N5298q431j49534q2831M9056
$$ y = [13128537, 12824358, 12594114, 12429870, 12310139, 12316084, 12448762, 12766219, 12962690, 12827224, 12405434, 11701595, 11090406, 10505318, 10036633, 9569611, 9351198, 9045342, 8756787, 8607543, 8469331, 8339729, 8176698, 7889139, 7781108, 7745652, 7625522, 7471748, 7280070, 7014482, 6813965, 6740721, 6802580, 6752483, 6674979, 6451110, 6155437, 5967941, 5719242, 5527515, 5562731, 5460603, 5363317, 5207069, 5217289, 5178437, 5015061, 4878437, 4780265, 4719860, 4590219, 4417657, 4371598, 4492975, 4400526, 4315291, 4182104, 4114815, 4101367, 3943018, 3711502, 3646835, 3661096, 3628657, 3663313, 3657161, 3529012, 3402379, 3266903, 3252785, 3291225, 3178728, 3005407, 2953228, 2957848, 2904723, 2926013, 2981311, 2972880, 2823346, 2740515, 2789571]
18644B789571K704J6541J04216k00657j94973j13331o5307m9318q4392p6879l5103
18633B093072j10740j9768o0825M1911O5598J2538l7432j0739Q2m9755j19737
18622A804205j82120l9438R3619M9264p5774O1305k0903o3989M3263M4621q0572
18611A633481q754R0143J09765M8840r2923j02827j53286j42727k6958M6558J5669
18600A416981q0537o1067J77051L6066j51633j9767J1747K1296J9584Q8167j1413
18589A446475j26228j07158j22604J83238N6891j49103q8011r8953Q701L2777
18579A036025m571q639O4706N6922r1211j74478m2804p4111M1352j45715k1256
18568F36220J84217N7646j64528N3032K2497K7016j50835n3398N2993K8235q641
$$ y = [2789571, 2792275, 2808816, 2913032, 2712375, 2517402, 2404071, 2338764, 2289446, 2205054, 2128175, 2093072, 1982332, 1962564, 1901739, 1943650, 2009248, 2021786, 1984354, 1973615, 1973697, 1923942, 1804205, 1622085, 1582647, 1676266, 1725530, 1649756, 1711061, 1690158, 1626169, 1669432, 1714053, 1633481, 1624727, 1714870, 1824635, 1873475, 1780552, 1677725, 1524439, 1381712, 1354754, 1401312, 1416981, 1336444, 1275377, 1452428, 1488494, 1336861, 1317094, 1328841, 1350137, 1369721, 1457888, 1446475, 1320247, 1213089, 1090485, 1273723, 1330614, 1181511, 1093500, 994547, 1003248, 1036025, 1031454, 1022815, 1087521, 1144443, 1053232, 878754, 835950, 761839, 803191, 657476, 636220, 820437, 878083, 713555, 766587, 789084, 816100, 665265, 611867, 664860, 693095, 684454]
18557F84454P354l2180P8199j27786m1445k0800J84511J8295K6710m1681l3530
18546G02101l2113j04779M8085N4709K4620m4217j972o418l102M6326J3439j8874
18534F77805n1361J9973O7662j8163K2538l3767Q5189n5100m6896n5830r2191
18523E19859P2246M9716j9732q4708L5842J8446j1577n0930n5173J01886Q8501
18512F64376k9132q854r3604Q9370l3207q5545M5469J03915Q0399J836L853j6088
18500G22788K1805L1911K7739J1479q306r5811j45737q9146P2204R1258Q6296
18489G26480n8777j37743p1929j0332N9645M240J18712k0966O4044p784r5601
18478E69989j37107O4417J10639P3567P1500K5062p7144o1460j10802k4921K07803
$$ y = [684454, 691808, 659628, 737827, 610041, 568596, 547796, 732307, 750602, 777312, 735631, 702101, 669988, 565209, 613294, 668003, 692623, 648406, 646434, 640016, 636914, 683240, 696679, 677805, 626444, 646417, 714079, 695916, 718454, 684687, 769876, 714776, 667880, 612050, 519859, 592105, 641821, 622089, 537381, 573223, 591669, 580092, 529162, 473989, 575875, 664376, 635244, 626390, 532786, 622156, 588949, 503404, 548873, 652788, 733187, 735023, 738876, 722788, 744593, 776504, 804243, 815722, 807416, 711605, 565868, 476722, 548926, 640184, 726480, 667703, 529960, 458031, 447699, 507344, 511584, 630296, 609330, 673374, 665590, 569989, 432882, 497299, 607938, 681505, 753005, 778067, 700923, 639463, 528661, 503740, 711543]
18467G11543K7204J9199K0702Q4086J95449J38328K6179J14977j02023k45341
18457I90303j42974p8488J42633K52333P1734k23071q9041k4066l9356K5203l6012
18446H49198o4419n6304p814Q0914j32636m2957P2408k0496K5265J25925K9144
18435H58228l5897m6883N7216j16550P9331l469L8200j0146j00034r8507R330
18424F30819J14328K9388P7913N7260Q7482J20699J39512O1886K10838J24999
18414A655124P3171q0461l3774j63425j11232R528K17080J66746J72215N36313
18404B441285P69967P81700N83397L21562L2329j76253m81036m61780n04083m10350
18394B896738k82726p4440r0654j77195j98433j24537K7229K1471M7857L38785
$$ y = [711543, 738747, 757946, 778648, 862734, 1058183, 1196511, 1222690, 1337667, 1235644, 990303, 847329, 768841, 911474, 1163807, 1235541, 1012470, 923429, 899363, 860007, 885210, 849198, 784779, 728475, 720661, 801575, 668939, 625982, 698390, 677894, 703159, 829084, 858228, 822331, 775448, 832664, 716114, 795445, 791976, 830176, 820030, 719996, 621489, 630819, 745147, 774535, 852448, 909708, 997190, 1117889, 1257401, 1319287, 1530125, 1655124, 1728295, 1647834, 1614060, 1450635, 1339403, 1348931, 1566011, 1732757, 1904972, 2441285, 3211252, 3992952, 4576349, 4897911, 4930240, 4753987, 4272951, 3811171, 3307088, 2896738, 2614012, 2539572, 2448918, 2271723, 2073290, 1948753, 1975982, 1997453, 2045310, 2384095]
18384B384095L13317M257r0163o5161k15237l51657j93811k02722k16344o7144
18374A299430j10577R6836M5533L8837j6343j7454M3880J31975L4284K3729K8067
18363A598197R0928n716j1762J03478K19138Q2914J8809J69569J17595O8540Q9657
18352B541347J1583q9558l2867m3556k6641k4300Q8927N553l8203J7680n8132
18341B351833j80178q8522q3506j63006j10295p145J90389J2120j14536l8031
18331A769123k5248o5178q9122M6497J18259n7186K4224m3796j52549j38186K5497
18320A412335j32418o5440J26188R3895N3198l6462J0381J31163J03586P4716
18310A771142J14305R4635P5025O4327k4229J19317O3017L042R7265J4671O7489
$$ y = [2384095, 2697412, 2701669, 2611506, 2546345, 2331108, 1979451, 1785640, 1582918, 1366574, 1299430, 1188853, 1285689, 1331222, 1370059, 1353716, 1336262, 1380142, 1512117, 1546401, 1570130, 1598197, 1689125, 1683409, 1671647, 1775125, 1994263, 2077177, 2095986, 2265555, 2383150, 2451690, 2541347, 2552930, 2463372, 2430505, 2386949, 2360308, 2336008, 2424935, 2430488, 2392285, 2409965, 2351833, 2171655, 2083133, 1999627, 1836621, 1726326, 1719181, 1909570, 1921690, 1807154, 1769123, 1743875, 1678697, 1589575, 1636072, 1754331, 1697145, 1721369, 1677573, 1525024, 1386838, 1412335, 1279917, 1214477, 1340665, 1434560, 1487758, 1451296, 1461677, 1592840, 1696426, 1771142, 1885447, 1980082, 2055107, 2119434, 2095205, 2214522, 2277539, 2280581, 2377846, 2392517, 2460006]
18299B460006J20790J12035J00873J31686L8329j10260M223j3150n8502O1871
18289B847901j51054n0645K23855L00114N07177N44239O32597R93528J350994
18280G198706J127903L9156q82828j289507r19819l64493J05887M36309O06299
18271F057613J014353J588674K783722M205212N352862M750856Q11946l719921
18263B2845317n128192l547180j763862r41318p69720m68296j76283Q847K25813
18254A0285126K15935L27394R27583J412337J381342O31524j6466M3679O10771
18245A5819225P08550N53367O90172J112979J947709L247715N186988Q445758
18237C7712463J3662427K0108837K3543420J8358117K122664r978524q258103
$$ y = [2460006, 2580796, 2692831, 2793704, 2925390, 2963719, 2853459, 2857682, 2844532, 2786030, 2847901, 2696847, 2646202, 2870057, 3170171, 3677348, 4221587, 4854184, 5847712, 7198706, 8326609, 8365765, 7482937, 6193430, 5273611, 4909118, 5015005, 5451314, 6057613, 7071966, 8660640, 11444362, 15649574, 21002436, 25753292, 26565238, 22845317, 17717125, 14169945, 12406083, 11464765, 10695045, 10226749, 10050466, 10059313, 10285126, 10501061, 10828455, 11756038, 13168375, 14549717, 15181241, 15164775, 15208454, 15819225, 16527775, 17081142, 17771314, 18884293, 20832002, 24079717, 29266705, 37712463, 51374890, 71483727, 95027147, 113385264, 115507928, 105529404, 97271301]
18230I7271301L831206J3844938J4543908K192395j1828417j4045553m143919
18223A01665859R460155K2100237L1371609L4593187L2644193K7567710J4900318
18216B74303268R76221p434283l586366k343144j3935274l0826891l9395179l3733360
18208A44024992j9735557n244432O751554J5407649J8061275J0426143m32926
18201A69258698l921361l040761j0178108k1449061k4517798j8489776j1400766
18194G6261067o756709l990720k473051j239392k5582J208415K883783M731959
18186G0599770P358461J0542393J2571575R345611l64108r547371j0516096l954266
18178H6035969N242396J2805788J4639813O316503o809023j1241267m357291N396274
$$ y = [97271301, 101102507, 114947445, 129491353, 131683748, 119855331, 105809778, 101665859, 111126014, 133226251, 164597860, 199191047, 231835240, 259402950, 274303268, 275279489, 267845206, 264258840, 261915696, 247980422, 217153531, 177758352, 144024992, 124289435, 119045003, 125796557, 141204206, 159265481, 169691624, 169258698, 165337337, 162296576, 152118468, 130669407, 106151609, 87661833, 76261067, 69504358, 65513638, 63040587, 61801195, 61775613, 62984028, 65867811, 70599770, 77958231, 88500624, 101072199, 110417810, 110053702, 100506331, 89990235, 86035969, 91278365, 104084153, 118723966, 125040469, 118231446, 106990179, 102632888, 108029162]
18170A08029162Q928562J247177j2902087k0097581j7283986j0811430o391545
18163E0718272m134103k775507k091156j816345j641519j381520j217300q12882
18155C4847940m76916n48981q43989j431647j482063j289097q96813o24919o39959
18146B6613556m27422j32583K84948M17504O62706J323829K386442L340275K972760
18137C7442015M2308l364836m563855l669809k233932j351302r52222o37559l20507
18128B0390301k62823R1996N60604R48776R54648J9190j062376j450902r73518
18119A9215896m00065j37192j5981K26689N64085R70407J385687K373239L686416
18110B7869181O084299J0461825J8111843K8822187L5788621K7298271o503045
$$ y = [108029162, 116957724, 118204901, 105302814, 85205233, 67921247, 57109817, 50718272, 46584169, 43808662, 41717506, 39901161, 38259642, 36878122, 35660822, 34847940, 34371024, 33822043, 32978054, 31546407, 30064344, 28775247, 27878434, 27253515, 26613556, 26186134, 26053551, 26338499, 26756003, 27418709, 28742538, 31128980, 34469255, 37442015, 37484323, 34119487, 29555632, 25885823, 23651891, 22300589, 21348367, 20710808, 20390301, 20127478, 20219474, 20780078, 21728854, 22683502, 22702692, 21640316, 20189414, 19215896, 18815831, 18678639, 18662658, 18889347, 19453432, 20423839, 21809526, 24182765, 27869181, 33953480, 44415305, 62527148, 91349335, 127137956, 154436227, 147933182]
18103A47933182l3791167l6875902k3196101j2332646o805275m054607k857965
18096B8019519k074500j709391j471052j343886j158419r20447q88643q52184
18088A7600997o46410o00680l65967l87634m41524m94984m26434n59873m63478
18079A3214013l09220k11028k98803l96063l99350k70563l08368k51609j87182
18070A0581827k00011l34575l46311k79565j52301j55374k96751k31829k00405
18061H384705j19646r0059o4415o3743k46412j33024n3635j87406l47242j54072
18051F925051j76273k17448j30476j22761l5107r3746k13581m8249r7671j18083
18041E671656j33989k33451K0028m6592j89822j06006j71651q5187n7611n8387
$$ y = [147933182, 114142015, 77266113, 54070012, 41737366, 34932091, 30877484, 28019519, 25945019, 24235628, 22764576, 21420690, 20262271, 19341824, 18453181, 17600997, 16954587, 16353907, 15987940, 15600306, 15158782, 14663798, 14237364, 13677491, 13214013, 12904793, 12693765, 12394962, 11998899, 11599549, 11328986, 11020618, 10769009, 10581827, 10381816, 10047241, 9700930, 9421365, 9269064, 9113690, 8816939, 8585110, 8384705, 8265059, 8175000, 8110585, 8046842, 7800430, 7667406, 7613771, 7426365, 7079123, 6925051, 6748778, 6531330, 6400854, 6278093, 6242986, 6149240, 5935659, 5887410, 5789739, 5671656, 5537667, 5304216, 5324244, 5277652, 5087830, 4981824, 4810173, 4724986, 4667375, 4608988]
18031D608988o5697j20263J5897j4395j10201j5506n5837r1725j57538n9081L8787
18020C973429j1477l4720j35329j44478j07410m977j09583q161P6886J22134j03471
18009C512843j33362j28146j45429o5575m7677j4076P708j83379l1089N8981n5508
17998B775291j98239l131j6828J9060q6100n2132p4093R8548o321n4117j04719
17987B297219p2825o8379j1426j82652N0684J56583r6637j46924r2947r428J07718
17976A930986l9835n9784n7276j01654o2297J30482M2573r6176j22356K9940R2230
17965A686833j29268q3375k1009J9213J0551K0512J28861k5759m3066n6053p5343
17954A432097j2096j7009m918p7363N7955J0562q5728L0218o6778j22593m2033
$$ y = [4608988, 4543291, 4423028, 4438925, 4424530, 4314329, 4298823, 4242986, 4151261, 3993723, 3934642, 3973429, 3961952, 3927232, 3791903, 3647425, 3540015, 3535038, 3425455, 3417294, 3494180, 3616314, 3512843, 3379481, 3251335, 3105906, 3040331, 2992654, 2978578, 2986286, 2802907, 2771818, 2830799, 2775291, 2577052, 2573921, 2557093, 2576153, 2490053, 2437921, 2363828, 2462376, 2456055, 2401938, 2297219, 2224394, 2156015, 2144589, 1961937, 2012621, 2169204, 2072567, 1925643, 1832696, 1823268, 1930986, 1891151, 1831367, 1774091, 1672437, 1610140, 1740622, 1783195, 1687019, 1564663, 1594603, 1686833, 1557565, 1474190, 1453181, 1472394, 1482945, 1503457, 1632318, 1606559, 1563493, 1507440, 1432097, 1420001, 1402992, 1398074, 1320711, 1378666, 1389228, 1303500, 1333718, 1266940, 1144347, 1102314]
17943A102314k8204k8200o6726N1035l3779j01343r5586P6624P4183L0307r9971
17932H80654j40752r2871Q8524K16434J01987o6950j91115q7399J7624P9651q1601
17921G24186r5005j37199J07530J03548N330Q1498P6073k1839l0444R3609o1528
17910H45759r3950N986j6731J18122j4847j79553r4795M043Q9892N3303l3294
17899F83935q3402n2681q6887j50332J9850J35684P8339K1912p2939j33918Q5999
17888D45560R3577m0037k31645j6600L1220r5991J13521J40743J0181k0902O5229
17877D94856L2636L4966m7422k3297L532k4549J3497L6223Q4624Q0712j435l1307
17865F53036J5090J2134j11220j48943L34M3548J32346k2603q1839o9276j08066
$$ y = [1102314, 1074110, 1045910, 979184, 1030219, 996440, 895097, 799511, 876135, 950318, 980625, 880654, 739902, 647031, 735555, 951989, 1053976, 987026, 795911, 708512, 726136, 805787, 724186, 629181, 491982, 599512, 703060, 708390, 789888, 865961, 844122, 813678, 907287, 845759, 751809, 757795, 741064, 859186, 844339, 664786, 569991, 574034, 663926, 717229, 683935, 600533, 547852, 460965, 310633, 330483, 466167, 544506, 566418, 493479, 359561, 445560, 539137, 499100, 267455, 250855, 282075, 186084, 299605, 440348, 450529, 429627, 494856, 527492, 562458, 515036, 491739, 495271, 470722, 484219, 520442, 605066, 685778, 684343, 653036, 668126, 680260, 569040, 420097, 420431, 463979, 596325, 573722, 491883, 422607, 314541]
17854C14541r581J21473k9606j14816l8329O8287j16765m0573N6201M5339J4989
17843B71160j7789l976j1841l6844k3500o7423j20125j523J42524o6320l8947
17832B5396J160J0908K3117J87907M1331j34262L0120n9988n9142j3584J07075
17821A60038O423r1322P488K0959L1886J7839o5074j8067J7127L0336J7216K653
17809A37502J8812o0355P8684O6760r682J9309N1732n3322j19075K513M9277K7539
17797B09694o9570k0584K2682k6893J1567k9722J2144m6977J02996M1548Q258
17786B15143q8834j8673J4904r976k9154l2079K2678M7476P7420P968p9961m5625
17774H1287P500O9478J14783J9822k03226o8927J26523L4549q9115j2270L1750
$$ y = [314541, 304960, 426433, 396827, 282011, 243682, 311969, 195204, 154631, 210832, 256171, 271160, 253371, 249395, 237554, 200710, 177210, 109787, -10338, -11861, 130663, 64343, 25396, 26556, 37464, 60581, 248488, 289819, 155557, 185677, 125689, 66547, 52963, 160038, 166461, 75139, 82627, 103586, 135472, 153311, 88237, 70170, 87297, 117633, 134849, 137502, 156314, 95959, 174643, 241403, 231721, 251030, 302762, 249440, 130365, 132878, 182155, 209694, 140124, 119540, 142222, 115329, 126896, 97174, 109318, 62341, 165337, 206885, 215143, 126309, 107636, 122540, 112564, 83410, 51331, 74009, 121485, 198905, 206873, 126912, 81287, 88787, 158265, 273048, 292870, 89644, 20717, 147240, 181789, 92674, 80404, 112154]
17763A12154P537J19472M2344Q480j01047j3994O2506N1976p553j34638J6306
17752A63543J10625q185N0821K0757P6095J58185p0526p7288j30354o2149m7629
17741A83895Q8885J4417o7144q5483K5650r4114k7272J2717Q1103J18370J213
17730B52237L4776J6039Q9885M3311l6408Q828Q767l4487J0357J20501m008r6054
17718D13744q1065j02808K9371J24480Q0705K968j18634j02910P3129O2561p874
17707C73667J24139J27419R5005J07135j48701j18772n3366L5958N8799k6057
17697E75226q0435r1691j0768K2338j4234N0006M8408o8400j24348k7785J8352
17686B96669J09645l4626M9686P9919J6527j91225m5428J04996J84690J25457
$$ y = [112154, 119691, 239163, 281507, 289987, 188940, 174946, 237452, 289428, 281875, 147237, 163543, 274168, 265983, 316804, 337561, 413656, 571841, 501315, 424027, 293673, 231524, 183895, 272780, 287197, 220053, 134570, 160220, 66106, 38834, 51551, 132654, 251024, 252237, 287013, 303052, 392937, 436248, 399840, 408668, 417435, 382948, 393305, 513806, 509798, 413744, 332679, 229871, 259242, 383722, 464427, 467395, 348761, 245851, 318980, 381541, 373667, 497806, 625225, 720230, 827365, 678664, 559892, 506526, 542484, 601283, 575226, 494791, 403100, 392332, 414670, 400436, 450442, 498850, 430450, 306102, 278317, 296669, 406314, 371688, 421374, 501293, 517820, 326595, 281167, 386163, 570853, 696310]
17676F96310J12459L1624o1343n9445J0020N7122P0546L3510J07196K04490Q4425
17665A286914J95473M5942M8215o9611O4426p7926j87909j86825j66834n7716
17655H94149k36423j67338m8225n1977J7373J14419N5317j30167m7977l7847O7016
17644D28320l3312r7574j51333J0365m8607k1922R8718R7425j14962p8432R8078
17633A86764J92521J39535L7703J47040M7475j08252o4728j1372p1493j13637
17623C81556q1230N8033j2129o9058m9907k0114l2083k9665J232M6118O077o1684
17611A37146r787k1466O1269P4917j4512l3807j07536k1407n2633L3935Q1539
17600A27658j6179m0543K4220Q3600L8546r8520l4042O788M6888n9857j35540
$$ y = [696310, 808769, 840393, 779050, 719605, 729625, 786747, 857293, 890803, 997999, 1202489, 1286914, 1482387, 1528329, 1576544, 1506933, 1571359, 1493433, 1305524, 1118699, 951865, 894149, 657726, 490388, 442163, 390186, 407559, 521978, 577295, 447128, 399151, 361304, 428320, 395008, 297434, 146101, 156466, 107859, 85937, 184655, 282080, 167118, 88686, 186764, 379285, 518820, 556523, 703563, 751038, 642786, 578058, 566686, 495193, 381556, 300326, 358359, 346230, 277172, 227265, 207151, 175068, 145403, 146635, 192753, 198830, 137146, 127359, 105893, 167162, 242079, 227567, 193760, 86224, 64817, 12184, 46119, 127658, 111479, 70936, 95156, 178756, 217302, 118782, 84740, 91528, 138416, 78559, -56981]
17589e6981M4190O9489l7368n0088o817m96L269k2972J15492j9301J540l8384
17577A573K1619j108J0605N5005K7442N8929p0106n6931m5849Q4358J33652J13946
17565C33135o8096m7494Q530j3622p360k2018j95857k9383J23879N9500O2703
17554B03917K646j60799j73739O7542M0739J34732J01870K7395o7097r4633j0375
17543G2198k290j2878Q3133j2982p4500r4004J13750K4738j51066p9971M0571
17532i3301N1513K02233N4642o1210j5195M0444l9479o2097j10726R544R3067
17521F9435J2899p6897M9811r8222L6264j3318m95K8933Q991R5897q1116r591
17509B2591K2680p4209K8834K7520Q3906q6605J9339Q9739j9518l7493o5509l0497
$$ y = [-56981, -12791, 56698, 19330, -30758, -37575, -38071, -34802, -57774, 57718, 38417, 39957, 1573, 23192, 22084, 32689, 87694, 115136, 174065, 103959, 47028, 1179, 85537, 219189, 333135, 265039, 217545, 226075, 212453, 205093, 183075, -12782, -42165, 81714, 141214, 203917, 206563, 45764, -127975, -60433, -19694, 115038, 216908, 244303, 177206, 82573, 72198, 69908, 57030, 140163, 127181, 52681, -41323, 72427, 97165, -53901, -133872, -93301, -41788, 160445, 215087, 153877, 138682, 179126, 139647, 77550, -33176, -23632, 69435, 82334, 5437, 55248, -42974, -6710, -20028, -20523, 8410, 17401, 113298, 32182, 22591, 45271, -28938, -104, 27416, 111322, 24717, 44056, 133795, 114277, 76784, 11275, -19222]
17497a9222o0741p1004J6006M0990n0587q2279J18893k4946k9500J21159J75001
17486A33770m8107j54250N9974l597j76579M2114K496k750M6468O8139p7788l4131
17474a44241J52584J7870r4802r667J46596j53155m6229N6667O5283j5878Q9862
17463F4890J7884m8798j3408R841J8648p5097R0214J56349o0090j37374r069q847
17451E143J16514M3664L8008K8242p5209J2800K3685L0576J61328J70373L8865
17440E93989k893J30090J03485k21239k24416j26136j82973p6973N8195N8067
17430A09196q938o1325J004R743j02388j95215L8097J58203J1461P656J02925
17419G0419N5351m7316n6055r7231N254J45844q534j71477K3605P8408M1287m981
$$ y = [-19222, -79963, -150967, -134961, -93971, -144558, -226837, -107944, -132890, -162390, -41231, 133770, 85663, -68587, -8613, -12210, -188789, -146675, -144179, -146929, -100461, -32322, -110110, -144241, 8343, 26213, -68589, -78256, 68340, -84815, -131044, -74377, -9094, -24972, 64890, 82774, 33976, 20568, 30409, 49057, -26040, 64174, 220523, 160433, 23059, 13990, 5143, 121657, 165321, 203329, 231571, 156362, 169162, 192847, 223423, 384751, 555124, 593989, 591096, 721186, 824671, 603432, 379016, 252880, 69907, -7066, 51129, 109196, 100258, 38933, 39937, 49680, -52708, -247923, -209826, -51623, -40162, -32506, 70419, 125770, 78454, 22399, -74832, -69578, 76266, 67732, -103745, -80140, -1732, 39555, 34574]
17407C4574o494L3414R3003M8704j403j17045k89127p6158J98939K21471R0239
17396B30117k12027k12117R9838J76629j27774l5480P5067J38131o269K2113k0157
17385A28071M80o671p0875J0184K6784k5899Q2852r0817k0251l9599j480L3383
17373B6162o1946L2743j2539O7271J02597R9802m3794j89134j80446N928N8629
17362i4727l0423n8266R7458n4478M550N3633J65988l9960k6019M1916l0875N8042
17350H6839j6923j03026p284P4680J0663N8611N5765L2568M1462j8955j22235
17339I2165j71253k9306k3646p5373K07606J05408j33159j02622J07820R8917
17329G6557Q6237n1089j42451j257r1196O036n7310j09100J6411K03536N1081
$$ y = [34574, 28080, 61494, 154497, 203201, 201798, 84753, -204374, -280532, -81593, 139878, 230117, 18090, -194027, -94189, 82440, -45334, -80814, -5747, 132384, 126115, 148228, 128071, 128551, 121880, 51005, 61189, 87973, 62074, 144926, 54109, 33858, -5741, -7221, 26162, -35784, -3041, -15580, 51691, 154288, 254090, 210296, 21162, -159284, -153356, -94727, -125150, -183416, -85958, -140436, -135886, -82253, 83735, 43775, 17756, 59672, 28797, 86839, 69916, -33110, -40394, 34286, 44949, 103560, 159325, 191893, 233355, 214400, 92165, -79088, -108394, -132040, -207413, 193, 105601, -27558, -130180, -22360, 76557, 162794, 111705, -30746, -32003, -123199, -117163, -174473, -283573, -267162, -63626, -12545]
17318a2545q4658q3249j1596p7722K8989R3312N7991M8719j8318K8694J22132
17307I1749O1647n1564j61846J0993j9422K7871n4941j02059M5773O1932j1877
17296a01744Q4471P2033O1863J43448J39847j47283k10441k6695R7940k5680M0034
17285A27793j836j18186p9096J331L4272J91767k3630q9170j7623l5397k9082
17274c8857N5709j4002j9054K6914j79105n3570P9312J15439k6202O6830K9315
17263D2729Q1671q4774j56166m23O0842K967O3853J07733r952l4792k2326P976
17251E9338K2105j14340p2182Q6003N5303O1997o8961K5466r8541j2913m1198
17240i7923j4819m8592j37186M7838J22931K2541J8235J13964M0130p4606k4274
$$ y = [-12545, -97203, -180452, -192048, -269770, -240781, -147469, -89478, -40759, -59077, -30383, 91749, 153396, 101832, -60014, -49021, -68443, -40572, -95513, -197572, -151799, -89867, -101744, -17273, 54760, 116623, 260071, 399918, 252635, 42194, 15499, 113439, 87759, 127793, 125957, 7771, -71325, -69994, -35722, 156045, 132415, 43245, 25622, -9775, -38857, 16852, 2850, -16204, 10710, -168395, -221965, -142653, -27214, -53416, 13414, 42729, 124400, 39626, -116540, -116963, -56121, -53154, 10699, 118432, 108480, 73688, 51362, 59338, 81443, -32897, -105079, -19076, 36227, 98224, 29263, 54729, -43812, -56725, -97923, -112742, -161334, -298520, -250682, -127751, -105210, -86975, 26989, 67119, -7487, -31761]
17229c1761Q1323k3138L9531k6201j06914r5440O4292L6324n8628P2527J08761
17218F0676l2167n4178L464k5075K2956l998l1954o3483n0760J68125J3679r4319
17206h7034P0163N1929k083o537l510j0593j33297J8206l581o3795J72770J25932
17194A28570m1901M1126L8441j31387k29063j22456N7897J25554L5769O0865O6037
17183B9452J2457L0506m9027k4584R2282L2370j15348m0980k3943n2825k0016
17172a29656K3827J25045M168l8016L4237p3418m7678q6500q8289J0276n2441
17161c18445J15881J70756N6746j8756M3791r5016l625Q8657p9276r7869L8663
17150i8493K0644j27362M4549J27149R3353K8724j25582j29276M3725j1425j36078
$$ y = [-31761, 49562, 26424, 65955, 39754, -67160, -162600, -98308, -61984, -120612, -48085, 60676, 28509, -25669, -22205, -47280, -24324, -28322, -60276, -123759, -174519, -6394, 7285, -87034, -16871, 35058, 32975, 26438, 22928, 12335, -120962, -102756, -106337, -170132, 2638, 128570, 86669, 127795, 166236, 34849, -194214, -316670, -258773, -133219, -97450, -36585, 29452, 41909, 72415, 23388, -1196, 91086, 123456, 8108, -32872, -56815, -109640, -129656, -105829, 19216, 23384, -14632, 19605, -53813, -101491, -187991, -276280, -266004, -318445, -202564, -31808, 24938, 6182, 49973, -45043, -48668, 39989, -39287, -137156, -98493, -77849, -205211, -160662, -33513, 59840, 88564, -37018, -166294, -122569, -133994, -270072]
17139b70072L5281R9052O1544o3204j3041K9785J61314J57231K459j00510j82844
17128h3005k7621J05833j9414m6387l305O464L9571N2129L7363K9519r5349q2542
17116h6744N7239J2398n1041m0190J2332l7715J28187O157K9137k4789O510j0276
17104A205k9698K4572k5452r9170j03836O329j532J8711J05695m4248O61J17737
17092b9026n3716n6764O7064l556O1416O0189o4993o0258O9321l3491n2676Q3756
17080a2734o497j3608p5877m5095j3629O4656p5267m8135P4959J20204Q8411O6266
17068A23654J4302K4148P4770K5320j69689j90341q8909j6162O5885J06449Q9134
17057E8561M0494j6100j06091K4349L111L4038r264p2272r8564O2018o5938j02216
$$ y = [-270072, -234791, -135739, -74195, -137399, -150440, -120655, 40659, 197890, 200349, 99839, -83005, -110626, -4793, -24207, -70594, -73899, -67435, -27864, 24265, 61628, 91147, -4202, -86744, -29505, -17107, -68148, -108338, -96006, -133721, -5534, 623, 29760, 4971, 11481, 1205, -28493, -3921, -29373, -128543, -232379, -226050, -227582, -208871, -103176, -147424, -146763, -29026, -82742, -139506, -72442, -75998, -14582, 45607, -19386, -79644, -10323, -43814, -96490, -12734, -19231, -32839, -108716, -153811, -167440, -102784, -178051, -226186, -151227, -31023, 57388, 123654, 137956, 162104, 236874, 262194, 92505, -97836, -186745, -202907, -137022, -30573, 58561, 99055, 82955, -23136, 1213, 4324, 38362, 29098, -43174, -141738, -79720, -145658, -247874]
17045b47874O0185L3772K3979L471N9063n6452N4186k3801p5838K462Q3950K7843
17033e5054P039n9355J14146o2186j74945k3678J19344P1453P2179n5930r2944
17022a39931M8208R3093K1102j05159n1016K4138l5365j0194K9698K9298j9823
17011a15951O1715J3709p829K0954q2549m8600j03492l1627M1946J07513J26939
17000a7272J46160j07286j06391j5866J22082Q0609M0853N3747q8958q0682k5951
16989A045k3052l0196J5669J61852J04827O893M510j33344j08674j9975j05187
16978a25632q855P8140K0010O9957R5335n7424L4270M1361K1073Q777j51926o3538
16966c8452R2774k2849q783L3084j14710j9506M8002M885j7543N4277o1839K6676
$$ y = [-247874, -187689, -153917, -129938, -126467, -67404, -123856, -69670, -93471, -169309, -166847, -82897, -55054, -48015, -107370, 6776, -55410, -230355, -254033, -134689, -63236, 8943, -46987, -139931, -91723, 1370, 22472, -82687, -133703, -109565, -144930, -155124, -125426, -96128, -115951, -54236, -40527, -48356, -27402, -109951, -158551, -262043, -293670, -251724, -144211, -17272, 128888, 21602, -84789, -100655, 21427, 102036, 142889, 196636, 107678, 26996, 1045, -22007, -52203, -36534, 125318, 230145, 237038, 241548, 108204, -470, -20445, -125632, -134487, -56347, -36337, 33620, 128955, 71531, 105801, 147162, 168235, 177012, 25086, -38452, 54322, 31473, 22690, 55774, -58936, -78442, -30440, -25555, -43098, 11179, -50660, -23984]
16954b3984Q3122Q4278m6184m5892M5175Q8094l3763j39994m6197j50980j68380
16943c54705Q7435j3677J21664J60958O9787m5033p2761j3871M0272q091K6055
16932a967M427m8347p031n2831P5702J85084k3076r5459o7291P7618P0776J1124
16920A28729n3923R039j38764j65579o0667N1387Q4410N6986J61607m181m459
16909F4585k550r3313p9356r895J02389j7812J33562l1056o1448Q209P8482M6732
16897A38529K4986r128j82356n4252j7520o4835M279K5458J76394r8776J2498
16886d4723R3118L1264L338r9548m5504L6810N7506q4530p2419M4481J57980p877
16874F9896q4777j8141R138l6710J24669J05456j6513o1221k8280p0247p6081
$$ y = [-23984, 59138, 143416, 97232, 51340, 96515, 184609, 150846, 10852, -35345, -186325, -354705, -267270, -280947, -159283, 1675, 71462, 26429, -46332, -60203, -19931, -28022, -1967, 2460, -45887, -52918, -105749, -30047, 155037, 131961, 36502, -30789, 46829, 117605, 128729, 74806, 83845, -54919, -220498, -281165, -229778, -145368, -88382, 73225, 69044, 64585, 62035, -31278, -110634, -120529, -18140, -35952, 97610, 66554, 5106, 13315, 91797, 138529, 163515, 154387, -27969, -82221, -99741, -164576, -160297, -134839, 41555, -57221, -44723, 48395, 79659, 82997, -16551, -62055, -25245, 32261, -52269, -124688, -80207, 77773, 69896, -14881, -33022, -23884, -60594, 64075, 169531, 153018, 91797, 63517, -6730, -82811]
16863h2811o5324M0158N0688p6455Q6916k4167K7174L7620o5372j5146J43990
16852E7271J92628q0364j06679o9499N6596o311L4423M502m0179k9913L0630J9734
16840F2839j12152p7292j7360J44549L140j6428P6616k1366J01880J03422J0871
16829B58719k0956m5701q4072k05465j17166j6558J99233J04500j03334l1180
16819f1980j6551P9955q1039o7673O9008J06204l9093j42767J18305J35750l1906
16808F8213j10086m4127O0009M7193j02827Q0057K7440K3523j2122J8759o8461
16797a2429K0446K2954K6699j28597L5469J1627l0749O7869P4086m3725N9062
16786A02712L9798j93198j52912l6814P1577J7715K0987K2330p2116J01895O667
$$ y = [-82811, -148135, -107977, -57289, -133744, -46828, -70995, -43821, -6201, -71573, -86719, 57271, 249899, 169535, 62856, -6643, 49953, 43642, 78065, 82567, 42388, 12475, 43105, 62839, -49313, -126605, -143965, 584, 3724, -12704, 63912, 42546, 144426, 247848, 258719, 237763, 192062, 107990, -97475, -214641, -231199, -31966, 72534, -30800, -61980, -78531, 1424, -79615, -147288, -78280, 27924, -11169, -153936, -35631, 100119, 68213, -41873, -86000, -25991, 21202, -81625, -1568, 25872, 49395, 37273, 56032, -12429, 8017, 30971, 57670, -70927, -35458, -23831, -54580, 13289, 87375, 43650, 102712, 142510, -50688, -203600, -240414, -168837, -151122, -130135, -107805, -179921, -78026, -71359]
16775g1359O5944N5551J07227J9599p3415K585k335o0063L6788n3701j76850j6279
16763a66308J24975l4968j43484p0178J12216p9116l5895J43850Q9072j17051
16753a76887k7894J6891O3049J63866J23673R7493L8861r3659L6927r4776j09347
16742C8197p1199M4634K9087P802o7781r9765l0111N6187K8007M3304m1367M2244
16730b0761p0819m9224j6220J16666O479J9560P1590q2319j16295m5113O1376
16719a25080O0905p1364j28784o960Q4373O828l6653K3949P7443J7712J7093o0236
16707a40774r806k6263P7685N8443m1740L9135P6183p853k8825N200j21940J4795
16695a05760M6573j36815p2974j6300R3493q5182L6909O4063N9474R2759O9001
$$ y = [-71359, -5415, 50136, 157363, 176962, 103547, 106132, 103797, 43734, 80522, 26821, -150029, -166308, -41333, -76301, -219785, -289963, -177747, -256863, -292758, -148908, -59836, -176887, -204781, -187890, -124841, 39025, 162698, 260191, 299052, 205393, 242320, 147544, 38197, -33002, 11632, 40719, 48521, -19260, -119025, -149136, -92949, -64942, -21638, -63005, -20761, -91580, -140804, -157024, -40358, -33879, -14319, 57271, -25048, -141343, -186456, -125080, -64175, -135539, -264323, -271283, -186910, -180082, -216735, -192786, -115343, -97631, -80538, -140774, -150580, -176843, -99158, -40715, -82455, -43320, 32863, 25010, -3815, 1385, -120555, -105760, -59187, -196002, -268976, -285276, -191783, -276965, -240056, -175993, -116519, -23760, 45241]
16684D5241r5127j25027O5216J07728P3628j2708N8845q5770K7705L8181j02960
16673e048j01385o1593L9777O9851L1308J5434j5895k36751O3461J90441O9621
16662E9221r4461O0633P9322m0984q4583j21019j282R9909N2802k5830l015l6629
16650e5916j12918q089R7063L8760j0557K5023O0473m7641J1719l3905n5121j15035
16638b06144K2088j8429m199O8980j9244N6217O6892O6748J7312j13031j34879
16627a97689m6777J0831k6955Q7946N1141R0665J01073r1818J5999J2707r35O4131
16615G0319k7208m4658p5744O895o2727J18231J20013M4303P1816K4804j60880
16604H5164l02735n5217J48679J9295o769o527k3774K9304L5580N141J719o2108
$$ y = [45241, -49886, -174913, -109697, -1969, 71659, 58951, 117796, 32026, 59731, 97912, -5048, -106433, -168026, -128249, -58398, -27090, -11656, -27551, -264302, -200841, -10400, 59221, -35240, 25393, 104715, 63731, -20852, -141871, -143153, -43244, 9558, -16272, -19287, -55916, -168834, -176923, -79860, -41100, -51657, -26634, 33839, -13802, -2083, -35988, -91109, -206144, -184056, -202485, -206684, -137704, -156948, -100731, -33839, 32909, 50221, -62810, -197689, -244466, -233635, -260590, -172644, -121503, -30838, 70235, -21583, -5584, 7123, 6188, 70319, 43111, -1547, -77291, -70396, -133123, -14892, 105121, 149424, 221240, 246044, 85164, -217571, -272788, -124109, -104814, -111583, -118110, -141884, -112580, -77000, -71859, -70140, -132248]
16592a32248l8440m1897k1269N5025l4819J5869r2579P0289N8848K58380J56124
16581B53283j79052j14494n2290l712R3577J30466l5609q0339J9293R816o9949
16570b9010p4363l1413N6368P9082p3402p8986J3623P2550L6174J96982M5189
16559B12794l3748l862q2050j30618k3441J18578J75135p099k647j9675l2242
16548A71125O0220o0377j44083q5237n4013n4620J3054N706R6373N7121l1930
16537b6661q2167o0725J32565P6357N6994L1754j49173j32673N1269o1974m0707
16526b05141M0151R6369J6113j12781m5990k0851J18037J08064k9983m3775o5438
16515a45225k2447J0298q255p5006J64473J70300R2275j58420j13083L2361m207
$$ y = [-132248, -170688, -212585, -233854, -178829, -213648, -197779, -290358, -220069, -161221, 97159, 253283, 74231, -40263, -92553, -96265, -2688, 127778, 92169, 11830, 31123, 40939, -29010, -103373, -134786, -78418, 664, -72738, -151724, -138101, -65551, -29377, 167605, 212794, 179046, 175184, 93134, -37484, -60925, 57653, 232788, 225689, 223042, 203367, 171125, 231345, 170968, 26885, -58352, -112365, -166985, -153931, -148225, -51852, 5269, -26661, -108828, -169553, -36988, 39369, 96363, 128117, -21056, -153729, -102460, -164434, -205141, -164990, -68621, -52508, -165289, -211279, -232130, -114093, -6029, -36012, -79787, -145225, -167672, -157374, -165629, -240635, -76162, 94138, 186413, 27993, -85090, -52729, -56936]
16504e6936q0713m0319n3896J02629J54692O9249j186n5108j18696o0484Q4899
16493e5869J45775K8551p9002j18522J9957j06266l7020P7595J00672J50482k0054
16482A06299k0934J5139O5692M8995n2848o0310l3154n4381r325P5815O1938m6337
16470I6589J6309m817P1786m1313j8835j9192p776O0984N930j11692O911k9336
16458B5548O8263l15p650j7709j4286m7821O5357j07n5738o668J8676L3596J7803
16445G8949J2459j85168P0056J81167j3007q0940j14335O7647J52254J5910m680
16434A80312n6109j21899k0757K1740O1247K365n8588O9216J493p0220j4226p5462
16422h0888J9473J19354J3277K7362o8738P8938M6671m4174n7217L6832q6371
$$ y = [-56936, -137649, -177968, -231864, -129235, 25457, 94706, 93520, 38412, -80284, -140768, -55869, 89906, 118457, 39455, -79067, -59110, -165376, -202396, -124801, -24129, 126353, 106299, 85365, 100504, 166196, 215191, 162343, 102033, 68879, 14498, 5173, 80988, 142926, 96589, 112898, 108081, 179867, 138554, 119719, 100527, 92751, 153735, 159665, 47973, 54884, 25548, 93811, 93496, 85846, 68137, 53851, 6030, 71387, 71280, 15542, 8874, 27550, 61146, 78949, 91408, -93760, -23704, 157463, 144456, 63516, -50819, 16828, 169082, 184992, 180312, 124203, 2304, -18453, 3287, 64534, 66899, 8311, 77527, 79020, 8800, -5426, -80888, -61415, 57939, 71216, 98578, 29840, 108778, 155449, 111275, 54058, 90890, 4519]
16411D519q6058q505K1794q310j4468J45603R3312j00688K8268J38907K3592k2072
16399B15894j33466k391n9567J0058p8477m1847q8763J20351O5957L7165K3347
16388F8261r05M5684Q7625j3020q8856j9468n6548o5389o1808L0640N4969L9205
16376B0390r449J00300R369q8410J0677J44597N1456j25912j39677J11881J9372
16365A04594j5235Q05k065p1793j7333q3266k2767O157J0184J22412M4623p2474
16353C842l6613K3243k295N7645J89351o5890q5102k4502p5710o0987P9975N4620
16341E7577p1400l5733R2478J06361m7219m1504O290l3719p0914K9718P9957M4151
16329A16043R108r4361j17028J27507J16867j1876m2967l4598K7154n5615j5103
$$ y = [4519, -81539, -90044, -68250, -76560, -91028, 54575, 147887, 47199, 75467, 214374, 237966, 215894, 82428, 80037, 20470, 30528, -47949, -89796, -178559, -58208, 7749, 44914, 68261, 67356, 113040, 200665, 187645, 98789, 79321, 22773, -42616, -104424, -73784, -18815, 20390, 10941, 111241, 120610, 32200, 42877, 187474, 238930, 113018, -26659, 85222, 104594, 89359, 90164, 88099, 16306, -1027, -84293, -107060, -100903, -90719, 31693, 76316, 3842, -32771, -9528, -11823, 45822, 235173, 169283, 84181, 59679, -16031, -77018, 2957, 57577, -13823, -49556, 42922, 149283, 102064, 60560, 66850, 33131, -37783, -8065, 71892, 116043, 125151, 30790, -86238, 41269, 158136, 146260, 103293, 68695, 95849, 40234, 25131]
16318B5131j00044n0804M3630P5k3402J4177J4187j19547r0992M1654J32471J55320
16306D1856J79712n9562p4889J09750m4527K76q7770J43631j2632o8289J06033
16295B33589o8468j19815m3217O3900m9698l0849k6429l9680k3061L9577r116
16284g3267R0219j9880j12535n5142r3848M5887N8826Q1270P8420j5872N4124
16273C8202J04890l1905j03009j00973M59J9141L1656j6993J01145J39408l6472
16262A45549n1409n8128p8448J5725k571j4754m2027J5061q1021m3044j2456Q8943
16250a18580K33565N7230L2429M6092r7510L662J21271p9626j01442p0173o5404
16239c8486j11194P8549O8602J17480L7613k5968J7169o5920J3394O9723j29225
$$ y = [25131, -74913, -125717, -82087, -82012, -105414, -91237, -77050, -196597, -287589, -245935, -113464, 41856, 221568, 162006, 87117, 196867, 152340, 152616, 64846, 208477, 195845, 127556, 233589, 165121, 45306, 2089, 65989, 16291, -14558, -40987, -80667, -103728, -64151, -73267, 16952, -2928, -115463, -170605, -264453, -218566, -159740, -78470, -50, -15922, 38202, 143092, 111187, 8178, -92795, -92336, -73195, -41539, -58532, 42613, 182021, 145549, 94140, 36012, -42436, -26711, -29282, -44036, -86063, -71002, -152023, -195067, -207523, -118580, 114985, 172215, 204644, 250736, 153226, 156888, 278159, 198533, 97091, 26918, -38486, -149680, -71131, -2529, 114951, 152564, 126596, 143765, 77845, 91239, 160962, 31737]
16228C1737j11462R9471k8684R1107L3731j10691j12757P5598J51758j4610q8103
16217A7095p1284p682Q4171L5245L4958O1427p595j38095n0605Q6529M1567P3789
16205A59520j53999m9595L1044q7728J29701K06380L342j57356N397K8324k3730
16194I1300r8313j19674M0571O2362k35L6697J2426O8343r215m1942j3940L6164
16182F4544k7766m6567K9072j2535r857l4340J4503p1870q7232K291R5875N3703
16170c0179P3250P4213M9547P5461m5526j66518l6887J15389m2863O545K4763
16159I7195p0716J26436j7632j3468o1673p5701q7172n7024j4821J35232K1547
16148a7797M0036j03302j2992O6531R287K7364l0537Q559K8643M5o5801L7778
$$ y = [31737, -79725, 19746, -8938, 82169, 115900, 5209, -107548, -31950, 119808, 105198, 17095, -54189, -61871, 22300, 57545, 92503, 153930, 146335, 8240, -42365, 44164, 85731, 159520, 5521, -44074, -13030, -100758, 28943, 235323, 238665, 81309, 86706, 115030, 91300, -7013, -126687, -86116, -23754, -23989, 12708, 25134, 93477, 84262, 42320, 28380, 64544, 36778, -9789, 19283, 6748, -3109, -37449, -22946, -94816, -182048, -179757, -83882, -30179, 43071, 117284, 166831, 242292, 196766, 30248, -6639, 108750, 65887, 72432, 97195, 26479, 152915, 135283, 121815, 60142, -15559, -102731, -159755, -174576, -39344, -17797, 22239, -81063, -94055, -27524, -18237, 9127, -21410, -12851, 15792, 15837, -49964, -12186]
16136a2186J3806O2557M6781j05385j4497Q286j39584K1100l9822Q4609K253k6099
16124i8181L1118Q834l4550r649n4476j4711l9440L6497J5288J2942M2444L1346
16112g2538O133J05672R9738j7119j90199j6073P7190M9768m0715o5574L8582
16101b5135j0703p3O4622P8001P1445P766k7832j47358j65047k6346k2719k8261
16089b31640j0337N6099o5278L8811J04242l6348L5302K4258Q1058J19403K7528
16078A43098j24965o3820m1306J0160N6714K998j17236l6806o1169R8619J43388
16067I675J6560k6345j6321o1550J2287N7305L8235q2408k4755J02159J11915
16056A36757K0091o830j15211q0342J4709j0656j01872m783k992j6504Q4083M7912
$$ y = [-12186, 1620, 64177, 110958, 5573, -8924, -638, -140222, -119122, -158944, -74335, -72082, -98181, -67063, -58229, -92779, -102428, -156904, -171615, -211055, -174558, -159270, -146328, -103884, -72538, -66405, 39267, 139005, 121886, -68313, -84386, -7196, 42572, 1857, -63717, -25135, -35838, -35911, 28711, 106712, 178157, 185923, 158091, 10733, -154314, -180660, -203379, -231640, -241977, -185878, -251156, -212345, -108103, -144451, -109149, -84891, -3833, 115570, 143098, 18133, -45687, -86993, -76833, -20119, -17121, -134357, -171163, -232332, -133713, 9675, 26235, -110, -16431, -77981, -65694, -8389, 29846, -52562, -77317, 24842, 136757, 156848, 150018, 34807, -45535, -30826, -41482, -143354, -148137, -151129, -167633, -83550, -35638]
16044c5638l0138M68K888j29241k1761n6253M6836J46600P6735o21j45406p4409
16032b19940J17943j6369r2642m2901J77M5410N1015J03315M8727P1339J0685
16021G6759j19460m76L0965M7133L7181N7000j17243o6578J12117J42596m1920
16010A58074k20457J2564N267l4163J25967L7313M9824q4766r3552M7832j8766
15999a4863k7997K4199j5269n8762j05159l0676j7253J16248N3999n3911L8109
15988i1335N968K837k228J24273n1785M9661j2996o773N6187m8144m1056J03367
15976H7976J13483k4052j24843r5333P9107M7818k0834O5996o7837j03896K4900
15965a7515P787P4434K0586k5156L6828M0311R4492O7166q8095M3748L2955l5893
$$ y = [-35638, -65776, -65308, -62420, -191661, -213422, -269675, -222839, -76239, 496, -125, -145531, -219940, -101997, -118366, -211008, -253909, -253732, -208322, -157307, -53992, -5265, 66074, 76759, -42701, -43177, -12212, 34921, 72102, 129102, 11859, -54719, 57398, 199994, 158074, -62383, -49819, -44552, -78715, 47252, 84565, 134389, 49623, -43929, 3903, -14863, -42860, -18661, -33930, -92692, -197851, -228527, -245780, -129532, -75533, -129444, -91335, -85367, -82530, -84758, 39515, -12270, 37391, 24395, 17622, 73809, 25665, -15391, 87976, 201459, 177407, 52564, -42769, 36338, 84156, 63322, 129318, 61481, -42415, -17515, -9728, 64706, 85292, 60136, 96964, 137275, 231767, 298933, 210838, 254586, 287541, 251648]
15953B51648m0550j10155m8192J14707P1928Q130q3850r3767n4593j10137k10314
15942c05145P5247J55733J34830J5157K4090P5544p972J0135l1072j89241o8776
15931a11470n5143j1326K9429M9401p3537R0126M1659O9515j454J7643l0712O2850
15919G6981p7844j7230n2178K3594l7733J4884J80468l9177k2040Q4462Q4918
15908B19105N4955N760R552q5116j21868q0927Q9200P0836r713Q5405O4471j06476
15896A95184m5526j00968m4148J12242j4724J2900O0222K193j93417j26703o1831
15885b04576m2495J08869J02202k4714j15323Q9627P9381m0320P5265O3113k9106
15874F1923l3780j92710Q9962J27068j6224L8505m27k0082k6594o9034p1489K2919
$$ y = [251648, 211098, 100943, 52751, 167458, 239386, 247516, 163666, 69899, 15306, -94831, -305145, -229898, -74165, 60665, 75822, 99912, 175456, 167484, 177619, 146547, -42694, -111470, -166613, -177939, -148510, -99109, -172646, -82520, -40861, 28654, 27200, 44843, 14131, 76981, -863, -18093, -70271, -46677, -84410, -69526, 110942, 71765, 49725, 134187, 219105, 274060, 279820, 289372, 204256, 82388, 1461, 90661, 161497, 151784, 237189, 301660, 195184, 149658, 48690, 4542, 116784, 102060, 114960, 175182, 177375, -16042, -142745, -204576, -247071, -138202, -36000, -60714, -176037, -86410, -7029, -47349, 27916, 91029, 61923, 28143, -164567, -74605, 52463, 36239, 74744, 74317, 54235, 27641, -41393, -112882, -89963]
15862h9963M6216J05888Q8524P77m1400l8902J9864O2486N5395l4678j28212J3372
15850E9367m4770K4869Q8980Q910q2628n9419K4196j41122n3809O5367L9234O7607
15838c218Q0072L046l2744J05479m565m0725K4077o0108r0556j23668P993J735
15826a33182R6111P7693j13457l8354j7963J10092k427L9946P9326j32899q4018
15815a19132K9040M6850k2060J04814m9201J6477R0306J7454o6830k6584p210
15804A3924o2472P7481J38277J7140r7350j5175Q8677o7779j21484j9363O0534
15793A2410j17900j05669l0382L1291J75648j3853k4976o6977N7732M3602j0476
15782d9550j0648r0832j9510J55064Q0196J22477k8021j49270j85847Q030J13168
$$ y = [-89963, -43747, 62141, 150665, 151442, 110042, 71140, 91004, 153490, 208885, 174207, 45995, 59367, 14597, 39466, 128446, 137356, 54728, -4691, 19505, -121617, -175426, -110059, -70825, -3218, 76854, 79900, 47156, 152635, 148070, 107345, 131422, 71314, -19242, -142910, -134917, -133182, -37071, 40622, -72835, -111189, -129152, -19060, -21487, 18459, 97785, -35114, -119132, -90092, -43242, -65302, 39512, -9689, 6788, 97094, 114548, 47718, 21134, 13924, -48548, 28933, 167210, 184350, 87000, 71825, 160502, 92723, -28761, -48124, 12410, -105490, -211159, -241541, -210250, -34602, -48455, -73431, -140408, -82676, -39074, -49550, -60198, -151030, -170540, -15476, 64720, 187197, 159176, 9906, -175941, -167911, -54743]
15771e4743Q8813M0193l0101o1805J5573l213o4230p3733o1173n3861l9270J1838
15759b85712N6082j6449l3208J20074O0771n5180O8859K4004M8938o9672k0201
15748a01694k8280j1024J31815J69106n5432j93960j10055K612O6964J1183l5991
15737a54756J59448M1353m9150l2211r8399J9154M0154N5688O7799r8770j9638
15726f9328R1493O9990l7093o1387m3485L9811P9713N0270m4751k1042j63970
15715a09779r6061K8784J13512J64491j7102q4543o1693J13383K0290q8327J22205
15704A05160L8172j40779q5967K8147K1807p0132M8834J4964J2565J6716m3671
15693e4184r6822k2768N3941J62374j574L26J17089m109k5793n2044n7295l1442
$$ y = [-54743, 34070, 74263, 44162, -17643, -2070, -5283, -69513, -143246, -204419, -258280, -297550, -285712, -229630, -246079, -279287, -159213, -98442, -153622, -84763, -60759, -11821, -81493, -101694, -129974, -140998, -9183, 159923, 104491, -89469, -199524, -196912, -129948, -118765, -154756, 4692, 46045, -3105, -35316, -133715, -114561, -74407, -18719, 49080, -49690, -69328, 22165, 92155, 55062, -6325, -49810, -9999, 69714, 119984, 75233, 54191, -109779, -205840, -177056, -63544, 100947, 83845, -698, -62391, 50992, 71282, -17045, 105160, 143332, 2553, -83414, -55267, -33460, -103592, -54758, -39794, -27229, -10513, -54184, -151006, -173774, -119833, 42541, 40967, 41293, 158382, 154273, 128480, 76436, 19141, -12301]
15681a2301O4032o0167K9057R983P2875p4741n8551k03480p6055J69102L3037
15670a07209m2765l33N7302J10329M9989q8098l5814p899O9944l8069o7218J0585
15658h9256P1741R8548m6793l6221o189J3953o0585j17618m9928m280O4631J87709
15646B5712R5245J0852j13252r0147J1489m4281J4730J00459r9542q0502r4646
15635b63883J4784J64534J12047R182j11176p982J41657L3913r6025r9724O275
15624i6398K8786L6188J465p777N7229M2635l0894L7636O4512j27463n4453M1667
15612f867J6326j49629l3614N8469Q9374J2062l8550j0628j4775j0992N2060L9358
15600B594M5235l0325j29346n4435m8651J9663J0158J85891L2621r1687N207J0832
$$ y = [-12301, 51731, -8436, 20621, 30604, 103479, 28738, -29813, -233293, -309348, -140246, -107209, -149974, -150307, -93005, 17324, 67313, -20785, -56599, -64498, 5446, -32623, -99841, -89256, -17515, 81033, 34240, -1981, -8170, 5783, -54802, -172420, -222348, -226628, -161997, 25712, 120957, 131809, 18557, -71590, -60101, -104382, -89652, 10807, -88735, -169237, -263883, -249099, -84565, 27482, 36664, -74512, -82494, 59163, 93076, -2949, -102673, -96398, -67612, -31424, -29959, -37736, 19493, 62128, 31234, 68870, 133382, 5919, -48534, -6867, 9459, -140170, -173784, -115315, -25941, -13879, -52429, -63057, -77832, -88824, -36764, 2594, 47829, 17504, -111842, -166277, -214928, -195265, -185107, 784, 33405, -58282, -53075, -42243]
15588d2243J20947J34554P749p2298m2993j6330j9479k096M3876n0192m1312p547
15576A2636J08252O6720r9611o9516Q2065O9105j7197j7829k4787j11230P1886
15565G0494P5715M3594p9990o4727K5927P6024n2541n8859L4354K9661N7423M4510
15553B01585K2950p9998q7829N2120K4447R561j09622k8972n0464J2676O1216
15542B7670j6653n950o6797p2367N8633P3921L2740P8228r0010n7079k8715J04114
15530C7735l9479o3626k4388j2797j0896J33145n3330o8733L4013K130j6365K7614
15518e4977M1260O3589K2884j01369M0599L3957j05824o4772J66333l2663L5254
15507D4271O991L3434K4460q6781L7231J85544J9397q2168k18036r081J47160
$$ y = [-42243, 78704, 213258, 221007, 148709, 105716, 89386, 69907, 67811, 111687, 61495, 20183, 12636, 120888, 187608, 87997, 18481, 100546, 169651, 152454, 134625, 109838, -1392, 70494, 146209, 189803, 109813, 45086, 71013, 147037, 94496, 35637, 69991, 99652, 157075, 201585, 224535, 144537, 56708, 108828, 133275, 142836, 33214, 4242, -46222, -33546, 27670, 11017, 5067, -61730, -134097, -75464, -1543, 31197, 109425, 19415, -37664, -66379, 37735, -1744, -65370, -89758, -102555, -113451, 19694, -33636, -102369, -68356, -66226, -82591, -54977, -13717, 49872, 72756, -28613, 11986, 45943, -59881, -124653, 41680, 9017, 44271, 51262, 84696, 109156, 22375, 59606, 245150, 264547, 182379, -35657, -44738, 102422]
15496A02422K643j12086k5095M9453j8719J6926k4076j6272L9884m6843Q2728
15485E0965o4874k1161k990J2088J48961K1286j45198j36352M5073M8632m8644
15474i2214m8063P9514o2120R5641R9263J9185L380j06976m197L4730J18683r6673
15462D0153m5827Q1647n7335j414k2236j37789o4072Q5406J29904M8599j15496
15451e8460l530O7073l0940O4018P7376j02443l1121L0337o7799P8092o109q2154
15439f5660O4272n1308j03249Q7994J18572O2726m5516K5699J1709n2107m4608
15428H524j0118K0423P1628L9110p5435j14385k6874N4075L546l3105N190m5506
15416a02927K6100J24144j34001p0077J02403J87041N4040j04081j35j49952Q1664
$$ y = [102422, 105065, -7021, -32116, 17337, -1382, 15544, -8532, -24804, 15080, -31763, 50965, -13909, -35070, -38060, -25972, 122989, 144275, -923, -137275, -92202, -43570, -92214, -140277, -60763, -122883, -27242, 72021, 91206, 94586, -12390, -16587, 18143, 136826, 40153, -5674, 75973, 18638, 17224, -5012, -142801, -206873, -121467, 8437, 57036, -58460, -61990, 5083, -25857, 38161, 115537, 13094, -18027, 12310, -55489, 22603, 16494, -65660, -1388, -52696, -155945, -67951, 50621, 113347, 67831, 93530, 105239, 53132, 8524, -1594, 18829, 90457, 129567, 54132, -60253, -87127, -33052, -29506, -62611, -57421, -102927, -76827, 47317, -86684, -156761, -54358, 132683, 186723, 82642, 82507, -67445, 14219]
15405A4219J8332k2425l029L3810K5561J7763J3957j4425r1039n9534R912l4682
15393i1580m3825J22018L7427q4482P1440J54751O856r4321m1056Q7268q5680
15382C8816n7957K8761o8093N8225J13811m1396r0413r0081o5456m2696q517P1761
15370a53235P8520M5391J7402P304j02309J1072m9075o7001N9703J56917J00233
15359A04922O5493L6892j7649j75208M5099O6733l6446L3724k17476l7829M2724
15348h9021k558N577M4252j35406l8971J38981M5221J04526Q352L2143l7465l7247
15336C8384k1485k8838J7101J20475J1737j40085l8091P5156N5526r5784j54759
15325a60663Q1398R4065N9931O8064K5960R3933m7629r5625o3704k9749P2262
$$ y = [14219, 32551, 10126, 7097, 40907, 66468, 84231, 98188, 83763, -7276, -66810, -56898, -91580, -135405, -13387, 24040, -60442, 10998, 165749, 172605, 78284, 37228, 124496, 38816, -19141, 9620, -58473, -248, 113563, 72167, -18246, -108327, -173783, -216479, -224996, -153235, -74715, -29324, -11922, -4618, -106927, -95855, -144930, -211931, -152228, 4689, 104922, 170415, 207307, 189658, 14450, 59549, 126282, 89836, 123560, -93916, -131745, -89021, -91579, -86002, -41750, -177156, -216127, -77146, -31925, 72601, 80953, 113096, 75631, 38384, 16899, -11939, 5162, 125637, 137374, -2711, -40802, 34354, 89880, -5904, -160663, -79265, 14800, 74731, 142795, 168755, 262688, 215059, 119434, 55730, 25981, 98243]
15314I8243k7059L0390N0029n4418n6757l6965j11539j90491o177m283O5293J75162
15302f8572J5270L3443K4590N647o3369J02912J31884m3260N8285J23983M6308
15291C67121n2276j99223k5696j7035l8326p8415R2015m8370P8886O0734q7167
15280E2248j18269l5822l7965M8936P8786p049L5581J0k5913l6554j7504L4422
15268b9093P8718k7801m036j09222o5617J47992R790o6291n8562l6210K971Q4613
15256g2748K765N63P869K7540o5883l7918L2420q9067j9339J47017M4447o2701
15244h5035L0777m6468N5020M2688K6417M8361K643M3075o2132j31348o8113J05526
15232c8589J24500j3079l7478Q929K9184L396O1202k093m2681j32763j10881O6608
$$ y = [98243, 71184, 101574, 151603, 97185, 40428, 3463, -108076, -298567, -304744, -309027, -243734, -68572, -53302, -19859, 4731, 10378, -52991, 49921, 181805, 138545, 196830, 320813, 367121, 314845, 115622, 89926, 72891, 34565, -43850, 48165, -205, 78681, 139415, 52248, -66021, -101843, -139808, -90872, -12086, -19135, 16446, 16456, -9457, -46011, -63515, -29093, 49625, 21824, 17788, -91434, -157051, -9059, 731, -65560, -124122, -160332, -157361, -72748, -69983, -69420, -61551, -34011, -99894, -137812, -105392, -194459, -213798, -66781, -22334, -85035, -54258, -100726, -45706, -3018, 23399, 71760, 74403, 117478, 55346, -76002, -144115, -38589, 85911, 72832, 35354, 44283, 73467, 76863, 138065, 135972, 93291, -39472, -150353, -83745]
15220h3745L2099L3143K8275m077L9209J07137O4003o5094q1193L1812o9611k8828
15208C130M1818M472j83979J83J50498n9024j01846K1729n981r6575m4967J93084
15196g7458Q7157m1683K4721j0004k4026o3226k9444M5456Q0524J2869j02357
15185i7471m6635N3385N5630p4362j37606j05067K20J35094J39765J04573l9786
15174a2260O0081R5975K8964n9342j04084L0218M7590j4770j31535k0557m9304
15163a29024o0326L7791J16090j03388N5403L899M889j488j7667k9177N8268J98164
15151A33434j2456o7491O7085R5279n4233j71936M039J09433j5596j35882j16595
15140a64919k591N9883m0555P6371O0682M6228l3199Q888K8604J6601n9487m0271
$$ y = [-83745, -51646, -18503, 9772, 5695, 44904, 152041, 216044, 150950, 69757, 101569, 31958, 3130, 44948, 49420, -134559, -134376, 16122, -42902, -144748, -123019, -129000, -225575, -270542, -77458, 9699, -31984, -7263, -17267, -41293, -104519, -133963, -88507, -7983, 4886, -97471, -144106, -90721, -35091, -109453, -247059, -352126, -351906, -216812, -77047, 27526, -12260, 47821, 143796, 172760, 113418, 9334, 39552, 87142, 72372, -59163, -79720, -129024, -189350, -151559, -35469, -138857, -83454, -79555, -74666, -76154, -93821, -122998, -64730, 133434, 120978, 53487, 120572, 215851, 161618, -10318, -6279, 103154, 87558, -48324, -164919, -167510, -107627, -148182, -71811, -11129, 35099, 1900, 10788, 39392, 55993, -3494, -43765]
15128d3765k0510o6964M4689Q3194P1642K0326j59451j26440L3922R1139J37267
15117F5049L8228K1322j59505l3411J14867N0125o9842N940K2010R9819M0954
15106A95556n9412o5450j59851m2301P1263m901M1932m2162M8920K3237m0740
15095c3909K0219L5035J02277P5253o2347j7555n8002J51583o6842l8495k3486
15084H3731j36070j21408P9464Q8225M3756L9448J03560N0527j90459n4124j1522
15073b4872j31790K8551N460J495L7905n444l063R3617j14334r250L9504N8347
15061b3874k8018J34330O806o2059j2170L9082p7127o0558J39666M6779J36952
15050B39809Q8079r9558j90402j10806r582J24811N277l060K1345J1952m81k9141
$$ y = [-43765, -64275, -131239, -86550, -3356, 68286, 88612, -70839, -197279, -163357, -72218, 65049, 103277, 124599, -34906, -68317, 46550, 96675, 26833, 32773, 54783, 154602, 195556, 136144, 70694, -89157, -131458, -60195, -65096, -23164, -65326, -16406, 6831, -33909, -13690, 21345, 123622, 198875, 136528, 118973, 60971, 212554, 145712, 107217, 83731, -52339, -173747, -94283, -6058, 37698, 77146, 180706, 231233, 40774, -13350, -24872, -156662, -128111, -122651, -121156, -83251, -88695, -91758, 1859, -112475, -121725, -82221, -23874, -51892, 82438, 89244, 27185, 15015, 54097, -23030, -83588, 56078, 102857, 239809, 327888, 228330, 37928, -72878, -82460, 42351, 47628, 44568, 65913, 77865, 77384, 48243]
15038D8243l6669l0718l7175m665K1098R6673K3763q4380m8992O6005m3742M5941
15026A5382L4445j4303M7263m7314o2929J17134N890j64966o5902N5838P4025
15015e437j6454M4802n499q0928Q9507J00716L286n2233q8398J43510J8936m0603
15003A11205l2144p651K6153k4934L4065L3054j79598j50157m0428J56900J27333
14992E3798L4481p559K8946Q6591n203j04607M2557k1064J4949j48078k0418M8993
14980C386j3847q0163r2921m1585k8127Q8816k5322o8239o2031Q8676J42833j6194
14968a04718L3798K1274j25728N4060N6406j9998P5808k3669O2732L6746k8252
14957C8459l5613J5841p3058j46155o3998k9164m3151J6409l063J12812M5020
$$ y = [48243, 11574, -19144, -56319, -60984, -39886, 56787, 80550, -3830, -52822, 13183, -30559, 15382, 49827, 35524, 82787, 35473, -27456, 89678, 95568, -69398, -135300, -79462, -5437, -21891, 22911, 17412, -63516, 25991, 126707, 129993, 77760, -10638, 132872, 151808, 111205, 79061, 71410, 97563, 72629, 106694, 139748, -39850, -190007, -230435, -73535, 53798, 88279, 80720, 109666, 196257, 191054, 86447, 129004, 107940, 122889, -25189, -45607, 3386, -10461, -90624, -183545, -225130, -253257, -164441, -189763, -258002, -320033, -231357, -88524, -104718, -70920, -49646, -175374, -121314, -64908, -84906, -9098, -32767, 29965, 66711, 38459, 2846, 18687, -54371, -200526, -264524, -293688, -336839, -320430, -323493, -210681, -165661]
14946a65661J07603J0078l0002l1323k4805L4290m0372O5453M3027J5122o1937
14935g8527k419K4258n4443K3965r007M1938j8790O1506p0020n2515J14554L0482
14923A0982j07130o7750L4625j2940O5739q1400P656J76002R6495M2430J3314
14912A78023j1758m0518K3584k0962n3947j2513Q7900M928q3423j79623k571o4541
14900a75421o5554J21469J00979O8744j068l0466K4795j9324M3502l3166k9020
14889E470R3023P8767n5931j1412P0181P1754p2312j13827j38939l9349Q7493
14878b5082j7269q6395J7190J4024j16671q7701K3514K3307M5095J4325M0340
14867a55323q3479L5331J37592P5851r0631q2539P8492p049n236j0133n0120j11894
$$ y = [-165661, -58058, -47980, -77982, -109305, -134110, -99820, -140192, -74739, -31712, -16590, -78527, -80946, -56688, -111131, -87166, -96173, -54235, -73025, -11519, -81539, -134054, -19500, 10982, -96148, -163898, -129273, -142213, -76474, -157874, -150218, 25784, 122279, 164709, 178023, 166265, 125747, 149331, 128369, 74422, 61909, 149809, 154737, 71314, -108309, -110880, -175421, -240975, -119506, -18527, 50217, 49149, 18683, 43478, 24154, 67656, 34490, 5470, 98493, 177260, 121329, 109917, 180098, 251852, 179540, 65713, -73226, -112575, -25082, -42351, -128746, -111556, -97532, -214203, -301904, -278390, -255083, -209988, -195663, -155323, -238802, -203471, -65879, 9972, -80659, -163198, -84706, -91755, -96991, -107124, -157244, -269138]
14855b69138O001J03975M3556O2152J32651j773j89453N5839J9508K5173Q7733
14844G6224r364m7202n5124n7557m1961m8191L5802J17003n2994K846M4014r0106
14832a26610j6107Q2513q761J31873q2243j80340K4334O3755L5073p4281J259
14821a49535q681P9372N7771n320k8387p379O6392K01871m5041k15717k9277P9376
14809d555j0154N2926J13021R0782n3158k4019j1885j75530j01948K8074K0317
14798g6129r8703o2300o206r439J47600K10857J16025n3854j71428o0744j2389
14787g6710J19906j9948k7552k2443j837P8088n010o0606j5620J5791K2743o0479
14775e3677K6708k4120n4830J53773P9587j38607p9046J8755P9256N6931P185
$$ y = [-269138, -263137, -159162, -115606, -53454, 79197, 77424, -112029, -56190, -36682, -11509, 76224, 66860, 19658, -35466, -93023, -134984, -183175, -147373, -30370, -83364, -80518, -36504, -126610, -142717, -60204, -68965, 62908, -19335, -199675, -175341, -111586, -76513, -150794, -149535, -158216, -78844, -21073, -26393, -54780, -62159, 4233, 206104, 161063, -54654, -83931, -4555, -14709, 38217, 151238, 242020, 188862, 164843, 152958, -22572, -124520, -96446, -76129, -174832, -237132, -243338, -252777, -105177, 105680, 221705, 167851, -3577, -64321, -76710, 43196, 23248, -4304, -26747, -28584, 49504, 44494, -16112, -31732, -15941, 6802, -53677, -26969, -51089, -105919, 47854, 127441, -11166, -90212, -71457, 7799, 64730, 71915]
14764G1915o3535k3193R1104o6471M2571P3157j2266N0744J0805m5632J42O5785
14752A95126K5110j06997j42224j4793N2527M075k2954K480k8879o2052n0266
14741a48847j2214o6933k369J07116O4631m4285K4807K0707J68823L9960r5888
14730E5508n2211j03818R221O8509J961o6713p6190Q3731r432l8240R0977j07125
14718a43822O2987J33613K248J8341K8536L8147j6501n1584K8071R8826n9740
14707A39122q9485j27830o7338M3988R3915L4867j39133j32735L0994r5552o5294
14696c74481P436J33030J92128O0589k4907L2147K1792r1884j1540J09166J6538
14685G0014q5347k5827Q8380R6411j58065j53503O8711J16789J1128j61104R3425
$$ y = [71915, 8380, -14813, 76291, 9820, 52391, 125548, 113282, 164026, 174831, 129199, 129341, 195126, 220236, 113239, -28985, -43778, 8749, 12824, -10130, -7650, -36529, -98581, -148847, -161061, -227994, -230363, -123247, -58616, -102901, -78094, -57387, 111436, 151396, 55508, 3297, -100521, -91300, -22791, -20830, -87543, -163733, -80002, -89434, -127674, -36697, -143822, -80835, 52778, 55026, 73367, 101903, 140050, 123549, 71965, 100036, 198862, 139122, 49637, -78193, -145531, -101543, -7628, 27239, -111894, -244629, -213635, -309187, -374481, -367045, -234015, -41887, 18702, -6205, 25942, 47734, -44150, -55690, 53476, 70014, -15333, -41160, 47220, 143631, -14434, -167937, -99226, 17563, 28691, -132413, -38988]
14674c8988m8843j683J31287J38942P7122j87346j12644k6454n3808J20381J08280
14663A06246m311O7557m6574m3567n7125j44703O1651o877J0412N3663J62748
14652A59120m6628k7221l4690n6410P7686J5425n6858j18837m9869K2046m9863
14641a66099J27898J33332J61731o1686j30744m8167o1693Q1533o2749k781n7067
14630h6492l6643j11078Q4762j56521m1338J82052J25756l3445O7071p012m4926
14619e7814o2468l2992J3285J19005r3255O6397R0893L233j15872K508J45566
14608G8486M3671r5372q8856M0072P7178K7874m3050j621M4746L4004L8525o056
14596A49601j52418n0891L4473M8207n4299L1951J37097P1649p8528L2587l4618
$$ y = [-38988, -87831, -89514, 41773, 180715, 257837, 70491, -42153, -68607, -122415, -2034, 106246, 101935, 169492, 122918, 79351, 22226, -122477, -60826, -67703, -57291, -3628, 159120, 112492, 85271, 50581, -5829, 71857, 87282, 30424, -88413, -138282, -116236, -166099, -38201, 95131, 256862, 195176, 64432, 16265, -45428, 36105, -26644, -29425, -86492, -123135, -234213, -149451, -305972, -347310, -165258, -39502, -72947, -5876, -12888, -57814, -120282, -153274, -139989, -20984, -114239, -47842, 43051, 46284, -69588, -67080, 78486, 122157, 26785, -62071, -21999, 55179, 83053, 40003, 38382, 83128, 117132, 155657, 149601, -2817, -53708, -19235, 28972, -25327, 6624, 143721, 215370, 136842, 169429, 134811]
14585A34811j42633n5702o2507Q8003N2177j6498M5067Q7446N9619L9783n7748
14574A71818j3210L1317N7077j78703n7090o8370J12946O8973K8209n7746p4125
14563B1096o2913J02397J7204L8635q8560j8071j506R9537L0070p9199o988M0958
14551I2660k09362p9502J35106J01449l8659L5021J02695j6181N9617J03924j12773
14540A73995j8992p3150L5805j257k8712P4121o010R3217k278j24608l5917J756
14528H7970J29847L7771q7985K45j63241j1405Q0316J9234q402j82485m3390P2110
14516f9415O9991Q6433J45672J2440p9904j00533O0825Q2946j16639r5141m9692
14505e3017P3304j7022M9710M0974l8444m2933j4736r1283p2855j1593R8142K05459
$$ y = [134811, -7822, -63524, -126031, -38028, 14149, -2349, 42718, 130164, 189783, 229566, 171818, 158608, 189925, 247002, 68299, 11209, -57161, 55785, 124758, 152967, 95221, 21096, -41817, 60580, 77784, 116419, 27859, 9788, 8282, 107819, 137889, 58690, 51702, 92660, -116702, -196204, -61098, 40351, 1692, 36713, 139408, 123227, 182844, 286768, 173995, 155003, 81853, 117658, 116401, 87689, 161810, 155800, 249017, 246739, 122131, 86214, 87970, 217817, 255588, 167603, 167848, 4607, -6798, 73518, 92752, 84350, -98135, -141525, -69415, 576, 87009, 232681, 245121, 165217, 64684, 125509, 208455, 91816, -3325, -53017, 20287, 3265, 52975, 93949, 55505, 12572, -2164, -93447, -166302, -177895, -79753, 125706]
14493A25706j1191j52180K3686K3146k6076q3092o2117j850M9816K0065M4428
14482d9659N0358P4537J0304K8370r2203m7295N1588Q4255j5515l7641m4606q9666
14470g7173j1109j9322M0768K3113R2572R148n6234j9393J07186k6736j14080
14459e1260o9875R6206Q3315O6768K7825m998o6513j74895P7759K26536j04554
14448A06314j42874Q524n4075n9095K9208M7953l832Q484J4412O4559m1247j10409
14436a32078K7898Q0914P7774q1431l7693K2789L5471P2193J39702Q9089N3334
14425C47962j36668j13415o1159O5147m0327j46287J8823j2004L3236o589M4710
14414f571R9503P9050k9530M6595o7458p9550N454j48746k3438O3630O9035J519
$$ y = [125706, 114515, -37665, -13979, 9167, -16909, -100001, -162118, -163968, -114152, -94087, -49659, 699, 75236, 85540, 113910, 21707, -25588, 26000, 110255, 94740, 57099, 12493, -77173, -88282, -107604, -66836, -43723, 48849, 57997, 1763, -17630, 89556, 62820, -51260, -121135, -24929, 58386, 125154, 152979, 147981, 81468, -93427, -15668, 210868, 106314, -36560, -28036, -82111, -141206, -111998, -64045, -67877, -59393, -44981, 19578, -21669, -132078, -104180, -23266, 54508, -26923, -64616, -41827, -6356, 65837, 205539, 294628, 347962, 211294, 97879, 36720, 101867, 61540, -84747, -65924, -77928, -44692, -51281, -6571, 92932, 171982, 142452, 189047, 121589, 42039, 47493, -101253, -124691, -61061, 7974, 9493]
14402I493Q2567P2316L9049r7225L7108O8833o7518q1062m0061M0707P0570m7954
14390H6823r9425o907M9755p544j18013M6050R024J39988l6374l4723P458J9116
14378E5228j7935p778N3094n0076M1830n4672j26775K3974L2638k8583k2379M2396
14366e9038M7588J34142O6916r0789L4991R1484o1475o417K9581l2226p5527O5814
14354A45044n4996j04475j6745m7538J5508N3814P3578M7217P714N2492j55761
14343A5852j44954l1759O8936J5798P5480n9303j78697J15973P2550Q997m2194
14332h3321J7468O083l4906N7175P129j36067O2277Q1378p6956q868J9699L1011
14320e7898o5031L692N3085K9627N1783N958o4358n1528n6655j8685k6140O2299
$$ y = [9493, 92060, 164376, 203425, 106200, 143308, 212141, 144623, 63561, 23500, 64207, 134777, 86823, -12602, -19509, 30246, 22702, -95311, -49261, -40237, 99751, 63377, 28654, 36112, 55228, 37293, 29515, 82609, 32533, 74363, 19691, -107084, -83110, -50472, -79055, -101434, -59038, -11450, 122692, 189608, 98819, 133810, 225294, 163819, 157402, 186983, 154757, 79230, 145044, 90048, -14427, -31172, -78710, -63202, -9388, 64190, 111407, 119121, 171613, 15852, -129102, -160861, -91925, -76127, -647, -59950, -238647, -122674, -50124, -41127, -83321, -65853, -59770, -94676, -37501, -30372, -166439, -104162, -22784, -99740, -108608, -88909, -57898, -122929, -119237, -66152, -36525, 15258, 21216, -43142, -94670, -151325, -170010, -196150, -133851]
14308a33851M4963R4922j07889Q4496R9510m2804l9481j2484N2699j4471N8456
14297H4066k9746o2493P174j735P142Q6278k40O8752Q390p4194R771j6257o7036
14284A9872J808j5870O646J2125J78140J03595j90146j46107L5296Q5962k4266
14273F7055j9604n7692j31157j092R2224L9826j7055n9142j1478l6683k7860L6543
14261a26115M8785Q5992m840k4525l0160K7288L2639R8656J509r4817k1303P8971
14249G2080o3354Q7287R402p2887o9706L0884n4903l2579M7697k5386m7142Q3205
14237c5402O9090j02842Q3191P5847k9492k23000N7378Q098J07449O3968L8579
14226A12864k5392j10946m4222J25523o9506L087M5745K7709q7153K0118n3697
$$ y = [-133851, -88888, 6034, -101855, -17359, 82151, 39347, -134, -12618, 40081, 25610, 84066, 54320, -8173, -999, -2734, 4408, 90686, 90446, 159198, 167588, 93394, 103165, 86908, 19872, 21680, 5810, 12456, 24581, 202721, 306316, 116170, -29937, 5359, 91321, 67055, 47451, -10241, -141398, -142490, -50266, -10440, -27495, -86637, -98115, -134798, -162658, -126115, -77330, 8662, 3822, -20703, -50863, -23575, 9064, 107720, 109229, 14412, -6891, 72080, 8726, 96013, 105415, 32528, -37178, -6294, -61197, -93776, -46079, -71465, -118607, -35402, 33688, -69154, 14037, 89884, 60392, -162608, -105230, -97132, 10317, 74285, 112864, 87472, -23474, -67696, 57827, -11679, -8592, 37153, 64862, -22291, -2173, -55870]
14215e5870l5712K8169k3212l5727K0935l392R9118j5437L575J12192J04357l8663
14203A60333j39230l6900N3117O2292n109k2581q2926K0890q1993o2546L6723
14192i7930m0091q4484M3413m0371J45722Q5315J23508N2662q443p263j13488
14181E8550j44566k0636N654L8209J43418r971n5572l6270j00263L0274Q2234
14170h939M8335O7528p694L083k0386M5026R130n1575o9461L1840R9274N2344
14158A98505q2885j16990o747P1750Q0290P7058P6282k50o2638p2150j32867j82249
14146a52891j8970P6326R6421J10866R4700j2584j10209O0867M5062J4076n6398
14135A47266j15179m4322O8271J22566p1936p8010j3134Q4290k3444k8962Q9485
$$ y = [-55870, -91582, -63413, -86625, -122352, -101417, -104809, -5691, -21128, -17553, 94639, 198996, 160333, 21103, -15797, 37320, 99612, 94503, 71922, -11004, 9886, -72107, -134653, -97930, -138021, -222505, -179092, -219463, -73741, 11574, 135082, 187744, 179301, 172038, 58550, -86016, -106652, -100998, -62789, 80629, 70658, 15086, -21184, -121447, -91173, -8939, 39396, 106924, 99230, 102313, 81927, 126953, 136083, 84508, 15047, 46887, 146161, 198505, 115620, -1370, -8117, 63633, 143923, 220981, 297263, 297013, 234375, 162225, 29358, -152891, -171861, -95535, 886, 111752, 206452, 193868, 83659, 144526, 189588, 203664, 147266, 32087, -12235, 56036, 178602, 106666, 28656, 15522, 99812, 76368, 47406, 136891]
14124A36891L2362r0552k8013J11837r220m4150k48751m3054P5521J10720j23548
14113a19957o0313J47613M5464l1332N5386p904r0887M9622p6222o7961J30427
14102b6064O8323p9847n342R9958k6380J31909k7172j38111o6645J4772N6500
14091A901m728n2607P1081L7676m6797J0079k9621O8810k6866l4452P5752J7453
14079H7681o685J02403K2573j58132m7693J37125Q5467n2392L9402N0245q8056
14068A71938L1756m2601q2533j9534L4891n6727r126O6588j380m1993J5777L2600
14056I9656j6783q9639o1593l6434N2821R5146O7105o9395K5835n2564o2427N1051
14044B779n5261J7609O9986R2660r742j05313j942o5324j4357J3477L4082L3284
$$ y = [136891, 169253, 78701, 50688, 162525, 153305, 109155, -139596, -182650, -107129, 3591, -119957, -180270, -32657, 12807, -18525, 36861, 28957, -61930, -12308, -88530, -156491, -26064, 42259, -37588, -42930, 57028, 30648, 162557, 135385, -2726, -69371, -54599, 1901, -2827, -55434, 15647, 53323, 6526, 16605, -13016, 55794, 28928, -5524, 70228, 87681, 80996, 183399, 205972, 47840, 147, 137272, 222739, 170347, 209749, 259994, 171938, 203694, 161093, 78560, 59026, 93917, 37190, 28064, 94652, 93272, 51279, 67056, 99656, 82873, -6766, -68359, -104793, -51972, 43174, 110279, 40884, 66719, 14155, -48272, 2779, -52482, -34873, 35113, 127773, 118031, 12718, 10776, -54548, -68905, -55428, -21346, 11938]
14032A1938r7375q4288P2074n8329r048J3732r2761m1880n0906N3652J64727J00637
14020a7827J67340q378m8429j6777j29403k581N0774K5050j26579j5734l1815
14009a54359N0734M4191n2471l2227q7603L2803L9080O6543r6576K8629L2172
13998a29084O0353N3342O7662j2755j79990m3952L5643J00038J36280m4028K7229
13987G0738r5777q5295j17649P4892J22332R4730J43303K4278n1944K4107K2273
13976B25988m7491j69134K9805O635m0640N1045l089R207p5108j3909R1718j9209
13964D5818j39972l4062N3689j01776p6156M7196N2341j08678j2752J66955J07441
13953D4N6605M1653K3697r0095K4024n7022J1460L3095J4971j48m8018j37075
$$ y = [11938, -85437, -169725, -97651, -155980, -165028, -151296, -244057, -285937, -336843, -283191, -118464, -17827, 149513, 141135, 92706, 75929, -53474, -56055, -5281, 19769, -106810, -122544, -154359, -103625, -59434, -111905, -144132, -231735, -198932, -159852, -93309, -189885, -161256, -129084, -68731, -15389, 52273, 39518, -140472, -184424, -148781, -48743, 87537, 43509, 70738, -25039, -110334, -227983, -153091, -30759, 63971, 207274, 231552, 179608, 203715, 225988, 178497, 9363, 39168, 45803, 5163, 56208, 53119, 62326, -12782, -26691, 65027, 45818, -94154, -128216, -74527, -176303, -252459, -205263, -152922, -261600, -274352, -107397, 44, 56649, 98302, 121999, 31904, 55928, -1094, 10366, 43461, 58432, 58284, 10266, -126809]
13941a26809l0836n8419N7236J52241L2412J3055l69p287k1025N7408m5393j17568
13929i5354O116J25146J78279k02148k71926J16746J71606o860O7232p8422k5205
13918a4790k038n8596o1506L8070o6234R3416J70466l8760o3423J9214K6146M4807
13906H6772M6752O6679k3370n0195m0493R5867K1801j15850j73432j05188J86599
13895d058J42192N003q0595m3700k7908P9118m4262P3565o2238M2364O6661l4398
13883A11744l3156O1454R1883m8501l9057J00233P0039j49890n4663j23888k2959
13872c6761R697N2026l0427J28317n0493j23137J50776l4053j16143M0471O5598
13861E5871J20631k9748k25097k7581l9010J2512J47124k6900k399o8834O3350
$$ y = [-126809, -157645, -216064, -158828, -6587, 25825, 38880, 38511, 31224, 10199, 67607, 22214, -95354, -89238, 35908, 214187, 12039, -259887, -143141, 28465, 21605, 88837, 10415, -14790, -16828, -75424, -136930, -98860, -165094, -71678, 98788, 60028, -3395, 15819, 41965, 86772, 133524, 200203, 176833, 126638, 86145, 182012, 203813, 87963, -85469, -190657, -4058, 138134, 143137, 62542, 18842, -9066, 70052, 25790, 99355, 37117, 79481, 146142, 111744, 78588, 140042, 231925, 183424, 144367, 244600, 314639, 164749, 110086, -13802, -36761, -27064, 24962, -5465, 122852, 72359, -50778, 99998, 65945, -50198, -9727, 55871, 176502, 146754, -78343, -105924, -144934, -132422, 14702, -12198, -14597, -83431, -20081]
13850b0081m6811L1588M749L9689m7484Q960J5750O1805M6882r6268L2680l4506
13838c047q1593k4247J42797M7549k264Q6012N4895M7467o5816n3966L7537j09119
13826G6205j36063l9397m2001k4579L1587Q9442J5363m0818J22956O2030r219
13815A05506j50973K7609o4923J4216M3069Q717k1438M2026K1937O8021j10863
13804a7096n1510J22347P1432J00925p885k6208j40888l0749Q8514j8410J72709
13793B63181O4468l4059j22089k20745o7485J13283J51064o0015k6797l7252m1671
13782a8117k4817O9441J78583q249k3851J5586L1856j00875r0915j54155l9813
13771a65326L6899p2105j5364q7066P082J07038J71834j4595l2162M8722j4408
$$ y = [-20081, -66892, -35304, -30555, 9134, -38350, -29390, -13640, 48165, 95047, -1221, 31459, -3047, -84640, -108887, 33910, 81459, 79195, 165207, 220102, 267569, 201753, 147787, 185324, 76205, -59858, -99255, -141256, -165835, -134248, -44806, -29443, -70261, 52695, 114725, 105506, -45467, -17858, -82781, -68565, -25496, -16779, -38217, 3809, 25746, 93767, -17096, -68606, 53741, 125173, 226098, 218213, 192005, 51117, 20368, 108882, 90472, 263181, 327649, 293590, 171501, -49244, -116729, -3446, 147618, 87603, 60806, 23554, -18117, -42934, 26507, 205090, 196841, 172990, 188576, 220432, 119557, 28642, -125513, -165326, -128427, -200532, -215896, -302962, -295880, -188842, -17008, -31603, -63765, -15043, -29451]
13760b9451J02136L5583p3815j14997r476O7995O7359r2375q8569p1044p104J52290
13748f1468j4757n6952p1667L5262J26822J05025J09510n1507j63249r3525J21570
13737a4936n0874L94N9236o0117N1177k247j03977l4162J42685J12595L8876o8003
13725G0647l317M6377N7321O67R3106p5534j2652p1793p111O8673j84120j07754
13713a25490j8973R5795J8461J8545k2748K14465J5571q7251l5624Q114q1063
13702a98m0267j0992j4212j44283R907J36372J14501O5173k2436Q6693o3497j32519
13690a5758j09888j30N2291k514o5541Q0890M2107k8372l1535N0649M4911o8809
13678e1699j6669J9442q9464P1059M5540J08161m8809r7151K4495P2057L241j1395
$$ y = [-29451, 72685, 108268, 34453, -80544, -90020, -22025, 45334, -47041, -135610, -206654, -213758, -61468, -76225, -133177, -204844, -169582, -42760, 62265, 171775, 120268, -42981, -136506, -14936, -65810, -65416, -6180, -66297, -15120, -17367, -121344, -155506, -12821, 99774, 138650, 70647, 67330, 113707, 171028, 171695, 264801, 189267, 176615, 104822, 97711, 166384, -17736, -125490, -144463, -48668, -30207, -11662, -34410, 180055, 195626, 108375, 72751, 80865, -198, -40465, -51457, -65669, -209952, -200045, -63673, 50828, 116001, 93565, 180258, 116761, -15758, -125646, -125776, -73485, -75999, -141540, -60650, -18543, -46915, -78450, -27801, 17110, -51699, -68368, -48926, -138390, -67331, -21791, 86370, 37561, -59590, -35095, 36962, 40203, 28808]
13666B8808j08217Q5172R3707N0390k2094j33321O0559J78371k3354M827R951
13655B24799l1283J02876p0951j19933m8233p8851p7332J6253j3357J31750O4874
13644A00612L1004q3712j5941R6062M0458p6094M815k8580l3454o4113j3956l537
13632d6436j5526m3435O2727l5000J9236L6997M928r5942q387j9315l4260J09393
13620f5020J02752L3734J6881r8136p5385q8878q44J48431j2661q7675N139K5850
13608i5812L0045J27536m7794j25373j4882N9343j6430J24551K0428m5682m6968
13597c1038N3372R8465R9903q2962p5289N654r826L9989O5054p7266j10477Q7096
13585F2675P5059k4871m3799J4156n1668K518j9333j08538P3850J8257l8087j16574
$$ y = [28808, -79409, 5763, 99470, 149860, 127766, -5555, 55004, 233375, 210021, 214848, 224799, 193516, 296392, 225441, 105508, 57275, -21576, -98908, -82655, -96012, 35738, 100612, 131616, 47904, 31963, 128025, 168483, 92389, 97204, 68624, 35170, -28943, -42899, -46436, -61962, -105397, -42670, -77670, -58434, -21437, -16509, -112451, -120838, -140153, -174413, -65020, 37732, 71466, 88347, -9789, -85174, -174052, -174896, -26465, -39126, -126801, -121662, -95812, -65767, 61769, 13975, -111398, -126280, -66937, -83367, 41184, 61612, 15930, -31038, 22334, 120799, 220702, 137740, 62451, 68105, 58279, 98268, 163322, 86056, -24421, 62675, 137734, 112863, 69064, 83220, 31552, 34070, 14737, -93801, -19951, -1694, -39781, -156355]
13573a56355O1175Q1979J2751K047j31815j04547L2468J7894K3402J04172j6332
13562g3161m9282J2870K3842J57060n912j27713K2279k37k4902p7819L9784M2605
13550f0586J4583N3780O2258M2706J46174j76l1906j07372j04723m2640J5288
13539a2614R1986r0772q4643o6519J19121K2568M6835O1895J60090J5148R9118
13528C62213o102j7333j24602j41532k9571j26922n1899L9861J6358R998L9213
13517c0318n6814J2461j7692J5485Q977m0322m0003M1045K25946J60890Q2770
13506C62425p4194j71029N0548Q179j27577J19436M6914p8895j68105r95J22214
13495H8921l5398j03417n0313J35372P2331J1388Q1298q6679r8451K4691J17560
$$ y = [-156355, -95180, -13201, -450, 1597, -130218, -234765, -202297, -184403, -161001, -56829, -73161, -122443, -109573, -85731, 71329, 65417, -62296, -40017, -40254, -65156, -142975, -103191, -60586, -46003, 7777, 70035, 112741, 258915, 258739, 226833, 119461, 14738, -27902, -12614, 79372, -11400, -96043, -162562, -43441, -20873, 25962, 87857, 247947, 263095, 362213, 356111, 338778, 214176, 72644, 43073, -83849, -135748, -95887, -79529, -69531, -30318, -87132, -74671, -92363, -76878, -67901, -108223, -148226, -107181, 118765, 279655, 362425, 288231, 117202, 167750, 175929, 48352, 167788, 214702, 135807, -32298, -33293, 88921, 53523, -49894, -100207, 35165, 107496, 118884, 200182, 113503, 15052, 39743, 157303]
13484A57303M847O001m5315J4364J41481N7464m8804p9016j4004j44290P2595
13473A22626o762P2987k3280m7546N3901k0480q2384q2488N8241m686j03385M1054
13461b2202P414L6393j9936J6527l1973j11940J136R3265n694l9008P2133M362
13449D77j38400J26660J40004j7410p0314J702J939K7775J01096P599j67536l4326
13437b0734Q0508l4697L4016M7397J18620n9283j25977j5952K9929J21811M2711
13426B18349j62886j34574l7379J2587N692j14070q8669J25394J50716L0039M6557
13415E1756O4406L9095N9952r6694j03388m5629J72520L9112p1492j53846k3190
13404f7398K1235j9656J23478P7737n1231n3709L9003k4841j9912j07232m550
$$ y = [157303, 162150, 168151, 122836, 137200, 278681, 336145, 287341, 208325, 194321, 50031, 122626, 115864, 188851, 165571, 118025, 171926, 151446, 69062, -13426, 44815, 40129, -63256, -22202, -14788, 21605, 1669, 18196, -13777, -125717, -124581, -31316, -37010, -76018, -3885, 477, -137923, -11263, 128741, 111331, 41017, 42719, 44658, 72433, 173529, 181128, 13592, -20734, 59774, 25077, 59093, 106490, 225110, 165827, 39850, 23898, 53827, 175638, 218349, 55463, -79111, -116490, -103903, -98211, -212281, -300950, -175556, -24840, 5199, 51756, 116162, 155257, 215209, 118515, 15127, -30502, 142018, 181130, 109638, -44208, -67398, -46163, -65819, 57659, 135396, 84165, 30456, 69459, 44618, 24706, -82526, -87076]
13393h7076O1084n7030n6932P0014L7884L3699M811n3919l8741K0128J26893k1928
13381C8887K7447n4514L5365o0086m7514J5559p9038R1969O0227m3365M0876k7560
13369a747n434J43493K2696j14053l8318j44550M6698Q0402j5778n9553j2345
13358i8489N2043K8425L7248n8115L3831N3596P4449P9999j5806r2939L9160M8642
13346A82044r4935j3600R3710j00098j13980L4863J20996P4049k1782k21276j59543
13335b19552O9264J01272j2589q5870j4908P7973P4498k1926p8108M910J2640
13324i2396O4180J24581J7188j28147O6761P6568o9525l752n2560P7307R9809
13313A80014r6798m6469k7158n9422M2244K5676l4264K0852Q1362N1381m3559
$$ y = [-87076, -25992, -83022, -139954, -69940, -32056, 1643, 6454, -47465, -86206, -66078, 60815, 38887, 66334, 11820, 47185, -12901, -60415, -44856, -123894, -31925, 28302, -15063, 25813, -1747, -7181, 136312, 159008, 44955, 6637, -137913, -91215, -10813, -26591, -86144, -98489, -46446, -18021, 19227, -38888, -5057, 48539, 122988, 202987, 187181, 94242, 133402, 182044, 87109, 73509, 167219, 67121, -46859, -11996, 109000, 183049, 161267, -60009, -219552, -150288, -49016, -61605, -147475, -162383, -84410, -9912, -31838, -109946, -105036, -92396, -28216, 96365, 113553, -14594, 52167, 128735, 59210, 55458, 2898, 80205, 180014, 83216, 36747, 9589, -49833, -7589, 18087, -16177, 4675, 86037, 137418, 93859]
13302I3859k6233m3475k7242P9508M2323j23455l5425N9859J3202o4871o973j4803
13290e3726K1207p3756J6519J25140J1482P2997p6531m9152k1953N2750p709Q5650
13278A02918O235q8522k2346J8383J7431M2035j7688M0788N3960n6773K7038R2352
13266B15811p9254l6426k2731P5100p4999J465O1265J08291j9373J7728r685j10390
13254A26802o9588j04247j01125r0482R4092R2864P9593O5310K8961q2112N4607
13243I4675J8247j17504j26678L9054J12106k4949r1015p0476J9957L7453M2848
13232f6282O2664j0400l2052L1080K7878m1210L2732P1516j01737j22587q3790
13221b32188M5379K2185J2942K4675l7248o7621K8332J68881L1330L9880o7565
$$ y = [93859, 67626, 24151, -3091, 76417, 118740, -4715, -40140, 19719, 32921, -31950, -38923, -53726, -32519, -106275, -89756, 35384, 46866, 119863, 43332, -5820, -27773, 24977, 17268, 102918, 109153, 20631, -1715, 16668, 34099, 76134, 58446, 99234, 153194, 96421, 123459, 215811, 136557, 100131, 77400, 152500, 77501, 78966, 140231, 248522, 229149, 246877, 237192, 126802, 57214, -47033, -148158, -238640, -144548, -51684, 27909, 93219, 122180, 40068, 94675, 112922, -4582, -131260, -92206, 19900, -5049, -96064, -166540, -146583, -109130, -66282, -3618, -14018, -46070, -14990, 12888, -28322, 4410, 75926, -25811, -148398, -232188, -186809, -164624, -151682, -127007, -164255, -231876, -203544, -34663, -3333, 36547, -31018]
13210c1018k6180J64833M8544l3395o4606P2946P7951j78493j14646p7511N4172
13199a07403N7843L3935K0770r8901j30457K8423r1329p1011Q4349K11968J93240
13188A31427Q1189q066j25905k838m3978R6001l587j03925J1743R6183R2342o5554
13176A55032o3836K3730j3747j49743k527m1597p4556p3802J12761N5628j37008
13165b09665k4230J49258J22874N9561o3944N015Q049k172N0081j13191j8191
13154c6555o5381j00480R7615J34274Q9641j09919j15704j30591L4684P5625j79911
13143c06702O3478J53069J65370j1697M9902j30185k6262J04616p8931j64785
13133a82127p3357J5455K36785J5346o1311O9430J11933M4568p5890n8048P9972
$$ y = [-31018, -57198, 107635, 156179, 122784, 58178, 131124, 209075, 30582, -84064, -161575, -107403, -49560, -15625, 5145, -93756, -224213, -195790, -287119, -358130, -273781, -61813, 131427, 212616, 204550, 78645, 75807, 31829, 127830, 124243, 20318, 32061, 128244, 220586, 155032, 91196, 114926, 101179, -48564, -51091, -92688, -167244, -241046, -128285, -72657, -209665, -233895, -84637, 38237, 97798, 33854, 38869, 46918, 44746, 94827, -18364, -36555, -101936, -202416, -104801, 29473, 119114, 9195, -106509, -237100, -202416, -126791, -306702, -243224, -90155, 75215, 63518, 113420, -16765, -43027, 61589, -17342, -182127, -255484, -240029, -3244, 12102, -49209, 20221, 132154, 176722, 100832, 42784, 122756]
13122A22756P3356p4497j16692j2895K1999J01133L7246p8738l9151o9908n4343
13111h9734q4140J03743q3148k3486P5676P4006Q9453J7826k0995j5351K3028
13100F6878m2711l9290l6513m3399j8275J11912J6603j04390K3432l08j5990j2955
13088i5006J6944J62633N7481o001p5138r652q8026N9142J78402M1301j28448
13077A13632j2620r5492l4532n2848n4089R5920N3203l1719R5789L2485P5992
13066A85721M4860l0232j18308o5621q3197N6164l416m2731n9743K4805J18634
13055B6936k0399p4182q3671n660J5257J00635Q06J06007j2234j69467k7836J2165
13043a31643J53041m0514Q5993R7056q8775o4474J0061p9723k4419J50911J06317
$$ y = [122756, 196112, 121615, 4923, -7972, 14027, 115160, 152406, 73668, 34517, -35391, -89734, -173874, -70131, -153279, -176765, -101089, -27083, 62370, 80196, 59201, 43850, 66878, 24167, -15123, -51636, -95035, -113310, -1398, 15205, -89185, -65753, -66061, -82051, -95006, -78062, 84571, 142052, 136051, 60913, 51261, -36765, 22377, 200779, 242080, 113632, 101012, 5520, -29012, -81860, -135949, -40029, 13174, -18545, 77244, 109729, 185721, 230581, 200349, 82041, 16420, -66777, -10613, -14029, -56760, -116503, -91698, 26936, 6537, -67645, -151316, -156976, -141719, -41084, -40278, 65729, 53495, -115972, -143808, -131643, 21398, -19116, 66877, 163933, 75158, 10684, 20745, -58978, -83397, 67514, 173831]
13032A73831j05922r5517J23630O3902R415k0238l9758n6776q3679m0103o0704
13021a31919L7142l2943J9238R6824R216r0750J1554R8421Q5770O995K5411l8460
13009I6499J02375P3031J3814l3920j23236J2827m067k4903P8527L5985N0854
12998B77786L432j8440j52145m7857r8660k1412J51950N5766L2770O7521m3856
12987B06855j63392k6900Q8023N0333j1105j03817n8103L1402m5775q2279p103
12976a21861L9711o724k8989k3727l506j2572J19686q801o2459n3887O8506j4224
12964a08847L7695K1493J07203n2195q2311j7017N7433L5874k4438j6522o3153
12953a04785P4059j2388Q834o2400K6043K6429m5330M2281O2169p0559n4702N5503
$$ y = [173831, 67909, -27608, 96022, 159924, 169339, 149101, 109343, 52567, -31112, -71215, -131919, -94777, -127720, -108482, -11658, -2442, -93192, -81638, 16783, 102553, 109548, 134959, 96499, 198874, 271905, 285719, 251799, 128563, 141390, 137323, 112420, 190947, 226932, 277786, 281218, 262778, 110633, 62776, -35884, -57296, 94654, 150420, 183190, 250711, 206855, 43463, 16563, 104586, 154919, 143814, 39997, -18106, 13296, -32479, -114758, -121861, -82150, -88874, -117863, -141590, -145096, -157668, -37982, -46783, -109242, -163129, -94623, -108847, -71152, -49659, 57544, 5349, -76962, -93979, -36546, -672, -25110, -41632, -104785, -30726, -43114, -34280, -96680, -70637, -44208, -89538, -47257, 14912, -55647, -110349, -54846]
12941e4846M7286n7760L5966O0418j1004j10395j00076M799L8595Q1615O0758
12930d644L7383L6852m6076p4996o0990m8099R8840O7514J9590j2718Q157l1489
12918a0676k7934P7052N316M3003l9000j10950l913R8264l5377L3304k1484r7168
12906h9563L6778O8384j08034o7686K0912J6258J20384j87l1898J9344m6792l1066
12894i3166l1678j09217Q2181O7439O4941R1660M3927r7283M9543L9872q1495
12883B6724j00157j9807J04510o6403j9939J05028n8165j07197o6296P7985O4674
12872e9043M0874R5221K4580k4942p747j3868K1836J4787n6525N4491j8656j03889
12860c2881n1372p6640J2736L5118k3795l7237J24716K6504k3473M5936R5515
$$ y = [-54846, -7560, -65320, -29354, 31064, 20060, -90335, -190411, -185612, -147017, -65402, -4644, 32739, 69591, 23515, -51481, -112471, -160570, -61730, 5784, 25374, 12656, 20813, -10676, -38610, 38442, 43758, 86761, 47761, -63189, -67102, 31162, -4215, 29089, 7605, -89563, -52785, 15599, -92435, -160121, -139209, -122951, -2567, -2754, -34652, -15308, -62100, -93166, -124844, -234061, -151880, -84441, -19500, 72160, 116087, 18804, 68347, 108219, 26724, -73433, -93240, 11270, -55133, -75072, 29956, -28209, -135406, -201702, -123717, -59043, -18169, 77052, 101632, 76690, 68943, 55075, 76911, 91698, 35173, 89664, 71008, -32881, -84253, -160893, -148157, -113039, -136834, -174071, -49355, -22851, -46324, -388, 95127]
12849I5127J8850n5073j25399j43380K4146N0971r3803M1567J21683J19332k5405
12838B8616l3412Q0060J22295q4019M1287j3857o4868N0600J48425p0406j13602
12827I1119l7552O4042R3871j24140K2691k3375j02404J0794K784K6008L9509
12816F3347n8146L5526N6343j21765J5652j39471n5984j5191J8963K507K7705
12805a70514O1817n5484Q1626M9908N0474j4872j22892j26941J47151K11130m6473
$$ y = [95127, 113977, 58904, -66495, -209875, -185729, -134758, -228561, -186994, -65311, 54021, 28616, -4796, 75264, 197559, 113540, 154827, 140970, 76102, 126702, 275127, 204721, 91119, 53567, 117609, 211480, 87340, 110031, 86656, -15748, -4954, -2170, 23838, 63347, 5201, 40727, 97070, -24695, -9043, -148514, -204498, -219689, -200726, -198219, -170514, -108697, -164181, -82555, -32647, 17827, 2955, -119937, -246878, -99727, 111403, 64930]
$$ [...]
##END NTUPLES=NMR SPECTRUM
##END=
