##TITLE=Analysis number 320560
Compound Code cc 48413
Book Reference 471/82/3
Project Code adrs
Chemist Name carlr
##JCAMPDX= 6.0         $$ Bruker NMR JCAMP-DX V2.0
##DATA TYPE= NMR SPECTRUM
##DATA CLASS= NTUPLES
##ORIGIN= Bruker BioSpin GmbH
##OWNER= nmr
$$ XWIN-NMR		Version 3.5
$$ Thu Jun 29 13:07:20 2006 GMT Daylight Time (UT+1h)  MAYBRIDGE\nmr@NMR_250MHZ
##.OBSERVE FREQUENCY= 250.131544655141
##.OBSERVE NUCLEUS= ^1H
##.ACQUISITION MODE= SIMULTANEOUS (DQD)
##.ACQUISITION SCHEME= undefined
##.AVERAGES= 16
##.DIGITISER RES= 18
##SPECTROMETER/DATA SYSTEM= dpx250
##.PULSE SEQUENCE= zg30
##.SOLVENT NAME= CDCl3
##.SHIFT REFERENCE= (INTERNAL, CDCl3, 0, 16.4403)
##AUDIT TRAIL= $$ (NUMBER, WHEN, WHO, WHERE, WHAT)
$$ ##TITLE= Audit trail, XWIN-NMR		Version 3.5
$$ ##JCAMPDX= 5.01
$$ ##ORIGIN= Bruker BioSpin GmbH
$$ ##OWNER= nmr
$$ C:\u/data/dgb/nmr/ADRS/1870/pdata/1/auditp.txt
$$ ##AUDIT TRAIL=  $$ (NUMBER, WHEN, WHO, WHERE, WHAT)
(   1,<2006-06-29 13:06:53.79 +100>,<MAYBRIDGE\nmr>,<NMR_250MHZ>,
      <created by zg, POWCHK disabled, PULCHK disabled
       configuration hash MD5:
       E2 DF 36 D8 04 B2 41 60 5A D7 A3 38 5A 4B D0 FE
       data hash MD5: 64K
       80 03 D5 11 D2 90 B3 8F 0F F6 0D 78 E7 AA FB DA>)
(   2,<2006-06-29 13:07:09.55 +100>,<MAYBRIDGE\nmr>,<NMR_250MHZ>,
      <Start of raw data processing
       ef LB = 0.3 FT_mod = 6 PKNL = 1 SI = 32K 
       data hash MD5: 32K
       CA 54 B4 D3 4A E2 6C EA F6 54 AE 37 83 26 0D 81>)
(   3,<2006-06-29 13:07:11.11 +100>,<MAYBRIDGE\nmr>,<NMR_250MHZ>,
      <apk 
       data hash MD5: 32K
       E4 EA 24 0F 35 C0 30 60 E6 69 A6 DD 74 72 17 73>)
(   4,<2006-06-29 13:07:11.85 +100>,<MAYBRIDGE\nmr>,<NMR_250MHZ>,
      <abs ABSG = 5 
       data hash MD5: 32K
       BD 86 8B 52 87 75 23 1F C3 2B 63 54 96 36 E5 6D>)
$$ ##END=
$$ 
$$ hash MD5
$$ BB 33 D1 16 57 9D 88 D9 7C 34 C3 F2 41 06 DA C3
##$RELAX= 
##$RELAX= 
##$RELAX= 
##$RELAX= 
##$RELAX= 
##$RELAX= 
##$RELAX= 
$$ Bruker specific parameters
$$ --------------------------
##$DU= <C:\u>
##$EXPNO= 1870
##$NAME= <ADRS>
##$PROCNO= 1
##$TYPE= <nmr>
##$USER= <dgb>
##$AMP= (0..31)
100 100 100 100 100 100 100 100 100 100 100 100 100 100 100 100 100 100 
100 100 100 100 100 100 100 100 100 100 100 100 100 100 
##$AQSEQ= 0
##$AQ_mod= 3
##$AUNM= <au_zg>
##$AUTOPOS= <35 >
##$BF1= 250.13
##$BF2= 250.13
##$BF3= 250.13
##$BF4= 250.13
##$BF5= 500.13
##$BF6= 500.13
##$BF7= 500.13
##$BF8= 500.13
##$BYTORDA= 1
##$CFDGTYP= 0
##$CFRGTYP= 5
##$CHEMSTR= <none>
##$CNST= (0..31)
1 1 145 1 1 1 1 1 1 1 1 1 1 1 1 1 1 1 1 1 1 1 1 1 1 1 1 1 1 1 1 1 
##$CPDPRG= <>
##$CPDPRG1= <>
##$CPDPRG2= <>
##$CPDPRG3= <>
##$CPDPRG4= <mlev>
##$CPDPRG5= <mlev>
##$CPDPRG6= <mlev>
##$CPDPRG7= <mlev>
##$CPDPRG8= <mlev>
##$CPDPRGB= <>
##$CPDPRGT= <>
##$D= (0..31)
0 1 0 0 0 0 0 0 0 0.06 0 0 0 0 0 0 0.0002 0 0 0 0 0 0 0 0 0 0 0 0 0 0 
0 
##$DATE= 1151582812
##$DBL= (0..7)
120 120 120 120 120 120 120 120 
##$DBP= (0..7)
150 150 150 150 150 150 150 150 
##$DBP07= 0
##$DBPNAM0= <>
##$DBPNAM1= <>
$$ [...]
##$SUBNAM7= <"">
##$SUBNAM8= <"">
##$SUBNAM9= <"">
##$SW= 20.6930455092707
##$SWIBOX= (0..15)
0 0 3 0 0 0 0 0 0 0 0 0 0 0 0 0 
##$SW_h= 5175.983436853
##$TD= 65536
##$TD0= 1
##$TE= 296.16
##$TE2= 300
##$TE3= 300
##$TEG= 300
##$TL= (0..7)
0 120 120 120 120 120 120 120 
##$TP= (0..7)
150 150 150 150 150 150 150 150 
##$TP07= 0
##$TPNAME0= <>
##$TPNAME1= <>
##$TPNAME2= <>
##$TPNAME3= <>
##$TPNAME4= <>
##$TPNAME5= <>
##$TPNAME6= <>
##$TPNAME7= <>
##$TPOAL= (0..7)
0.5 0.5 0.5 0.5 0.5 0.5 0.5 0.5 
##$TPOFFS= (0..7)
0 0 0 0 0 0 0 0 
##$TUNHIN= 0
##$TUNHOUT= 0
##$TUNXOUT= 0
##$USERA1= <user>
##$USERA2= <user>
##$USERA3= <user>
##$USERA4= <user>
##$USERA5= <user>
##$V9= 5
##$VALIST= <valist>
##$VCLIST= <CCCCCCCCCCCCCCC>
##$VD= 0
##$VDLIST= <DDDDDDDDDDDDDDD>
##$VPLIST= <PPPPPPPPPPPPPPP>
##$VTLIST= <TTTTTTTTTTTTTTT>
##$WBST= 1024
##$WBSW= 4
##$XGAIN= (0..3)
0 0 0 0 
##$XL= 0
##$YL= 0
##$YMAX_a= 486485
##$YMIN_a= -503485
##$ZGOPTNS= <>
##$ZL1= 120
##$ZL2= 120
##$ZL3= 120
##$ZL4= 120
##$ABSF1= 16.44027
##$ABSF2= -4.252903
##$ABSG= 5
##$ABSL= 3
##$ALPHA= 0
##$AQORDER= 0
##$ASSFAC= 0
##$ASSFACI= 0
##$ASSFACX= 0
##$ASSWID= 0
##$AUNMP= <proc_1d>
##$AZFE= 0.1
##$AZFW= 0.1
##$BCFW= 0
##$BC_mod= 0
##$BYTORDP= 0
##$COROFFS= 0
##$CY= 12.5
##$DATMOD= 1
##$DC= 0
##$DFILT= <>
##$DTYPP= 0
##$F1P= 14.0000005364418
##$F2P= -0.99999901652339
##$FCOR= 0.5
##$FTSIZE= 32768
##$FT_mod= 6
##$GAMMA= 0
##$GB= 0
##$INTBC= 1
##$INTSCL= 1
##$ISEN= 128
##$LB= 0.3
##$LEV0= 0
##$LPBIN= 0
##$MAXI= 10000
##$MC2= 0
##$MEAN= 0
##$ME_mod= 0
##$MI= 0
##$NCOEF= 0
##$NC_proc= -4
##$NLEV= 6
##$NOISF1= 0
##$NOISF2= 0
##$NSP= 0
##$NTH_PI= 0
##$NZP= 0
##$OFFSET= 16.44027
##$PC= 1
##$PHC0= 170.1536
##$PHC1= 8.349352
##$PH_mod= 1
##$PKNL= yes
##$PPARMOD= 0
##$PSCAL= 4
##$PSIGN= 0
##$REVERSE= no
##$SF= 250.130020440855
##$SI= 32768
##$SIGF1= 0
##$SIGF2= 0
##$SINO= 400
##$SIOLD= 32768
##$SREGLST= <1H.CDCl3>
##$SSB= 0
##$STSI= 32768
##$STSR= 0
##$SW_p= 5175.98343685301
##$SYMM= 0
##$S_DEV= 0
##$TDeff= 65536
##$TDoff= 0
##$TI= <Analysis number 999999
Compound Code 99
Book Reference 9
Project Code 9>
##$TILT= no
##$TM1= 0
##$TM2= 0
##$TOPLEV= 0
##$USERP1= <user>
##$USERP2= <user>
##$USERP3= <user>
##$USERP4= <user>
##$USERP5= <user>
##$WDW= 1
##$XDIM= 32768
##$YMAX_p= 317249930
##$YMIN_p= -266702
$$ End of Bruker specific parameters
$$ ---------------------------------
##NTUPLES= NMR SPECTRUM
##VAR_NAME=  FREQUENCY,     SPECTRUM/REAL,   SPECTRUM/IMAG
##SYMBOL=    X,             R,               I
##VAR_TYPE=  INDEPENDENT,   DEPENDENT,       DEPENDENT
##VAR_FORM=  AFFN,          ASDF,            ASDF
##VAR_DIM=   32768,         32768,           32768
##UNITS=     HZ,            ARBITRARY UNITS, ARBITRARY UNITS
##FACTOR=    0.157963299565203, 1,           1
##FIRST=     4112.204938638, 0,              0
##LAST=      -1063.77849821501, 0,           0
##MIN=       -1063.77849821501, -266702,     0
##MAX=       4112.204938638, 317249930,      0
$$ Real data points
##PAGE= N=1
##DATA TABLE= (X++(R..R)), XYDATA
$$ [...]
18404B1590844o85408n29651m68529n67005p60205r17338r24106q62204o04337
18395A5272061l70399k70195k84410l14219m65695o89693p47216o26947m56434
18386A1046853m02118l20578k05566j88205j09721j05620n4339p5002n7711m2425
18376I485568j05771j0371J27579K98181P12869J191067J875540K438905K039571
18367A8053138J120209O18655k16038j493413j223012p7225Q77041J844005L362818
18358B2866178M702699L891668K015259R57489p44993l560358l633521k108501
18350B4385920j080432m00654J99616O14510J107038J709336K549161L646001
18342C2730496N252678P965932J2126414J9027599K9320578L7410656L1563361
$$ y = [21590844, 20905436, 20375785, 19907256, 19340251, 18580046, 17662708, 16738602, 15876398, 15272061, 14901662, 14631467, 14347057, 14032838, 13567143, 12877450, 12130234, 11503287, 11046853, 10644735, 10324157, 10118591, 9930386, 9820665, 9715045, 9660706, 9585704, 9527993, 9485568, 9379797, 9369426, 9497005, 9795186, 10508055, 11699122, 13574662, 16013567, 18053138, 19173347, 19792002, 19575964, 18082551, 16859539, 16782314, 17659355, 19503360, 22866178, 27568877, 31460545, 33475804, 34433293, 33688300, 30127942, 26494421, 24385920, 23305488, 22904834, 23104450, 23718960, 24825998, 26535334, 29084495, 32730496, 37983174, 45949106, 58075520, 77103119, 106423697, 143834353, 175397714]
18335A75397714J9443819J2379504J365601j2594198n153093J2056923J5296426
18328B18192696Q007515P588564M693088j5778887k6086039k0200487k0399933
18321A56016517k7406253k3271745j3929485p446821k877803J873447Q086577
18314I1044434J5580390J7837262R319375J192019m357663j6088300k4173431
18307I0354086j7985627j0786001o685050m445325l155724k220450j321760l63518
18299D3390631R06367K190786J944033Q74555P76427N65724K0802K012950N937465
18290E8619740R549708J1896127J2331334J1153885Q380784M016745j196607m853990
18282A09897726o908462q933773j1371619j1329353r757329r267104q435599n940966
$$ y = [175397714, 194841533, 207221037, 208586638, 195992440, 190839347, 202896270, 218192696, 226200211, 233788775, 238481863, 222702976, 196616937, 176416450, 156016517, 128610264, 105338519, 91409034, 83962213, 81084410, 82957857, 91044434, 106624824, 124462086, 133781461, 134973480, 130615817, 114527517, 90354086, 72368459, 61582458, 54897408, 50452083, 47296359, 45075909, 43754149, 43390631, 44296998, 46487784, 48431817, 49306372, 50082799, 50648523, 50669325, 52682275, 58619740, 68169448, 80065575, 92396909, 103550794, 111931578, 115948323, 114751716, 109897726, 102989264, 94055491, 82683872, 71354519, 61597190, 52330086, 43894487, 37953521]
18274C7953521l996277k820773k204794j680627j350355j184774j041701r36598
18266B2737622q06668q09830p75656p34126p34065p90234q68244q24141p16709
18257A5677949n86095n86357m61350k78019j45388o1311Q6006J87309K04202K87106
18247A4324052N18872Q57141J505844K427637L871354N491898O464112O553103
18239D2014013N957679M383863K027139q70249l249928m986364o065333o476944
18231C2733876n962441m778003l355835k190720j497057j159047r40309p58735
18223A2091729p65890p28999n90407n32805m96381l70746k19904k31124k53931
18214G901542j70451j91161k06210k28865k14343k52522k95439k72572q2293n9882
$$ y = [37953521, 33957244, 31136471, 28931677, 27251050, 25900695, 24715921, 23674220, 22737622, 21930954, 21121124, 20345468, 19611342, 18877277, 18087043, 17218799, 16394658, 15677949, 15091854, 14505497, 14044147, 13766128, 13620740, 13559429, 13645435, 13832744, 14036946, 14324052, 14842924, 15700065, 17205909, 19633546, 23504900, 28996798, 35460910, 42014013, 47971692, 52355555, 54382694, 53512445, 50262517, 45276153, 39210820, 32733876, 26771435, 21993432, 18637597, 16446877, 14949820, 13790773, 12850464, 12091729, 11325839, 10596840, 10006433, 9473628, 8977247, 8606501, 8386597, 8155473, 7901542, 7731091, 7539930, 7333720, 7104855, 6890512, 6637990, 6342551, 6069979, 5987686, 5927804]
18204E927804j0753j07873j99162k55116k49347k44869k30180j68479l1268l2883
18194D397874j07117m4928p5874j10845o8952m0661L767n4242p5801r8990l4687
18183C689544m609K1116l141K6612N7018k2193m6483l9660j9023q0494m5731m32
18171C532524m2710m5568k7442n0205n8791l4987K8906Q5388J7548P530l8071
18160C374122k2724k3267J9491O9292K9800k7344m5372M5525j029K1423P0025
18149C509942J41951J36405K18735K04014J66811J96431K27922K80285K99210
18140E381706M24832L18331L10802M70225O27399P28802Q96733J263825J760562
18131A2183217K295272L042116L559194L686341M169266M686360M106601L088252
$$ y = [5927804, 5917051, 5809178, 5610016, 5354900, 5105553, 4860684, 4630504, 4462025, 4430757, 4397874, 4290757, 4245829, 4169955, 4059110, 3990158, 3949497, 3953264, 3899022, 3823221, 3724231, 3689544, 3684935, 3706051, 3702910, 3729522, 3786540, 3764347, 3717864, 3678204, 3659181, 3578687, 3532956, 3532524, 3489814, 3444246, 3416804, 3366599, 3307808, 3272821, 3301727, 3387115, 3404663, 3412193, 3374122, 3351398, 3328131, 3347622, 3416914, 3446714, 3419370, 3373998, 3419523, 3418494, 3439917, 3509942, 3651893, 3788298, 4007033, 4211047, 4377858, 4574289, 4802211, 5082496, 5381706, 5806538, 6124869, 6435671, 6905896, 7533295, 8262097, 9158830, 10422655, 12183217, 14478489, 17520605, 21079799, 24766140, 28935406, 33621766, 37728367, 40816619]
18123D0816619L054334L381370K641117K190256L329260M593628M286670L619615
18115F7912869M417178N188180N720746R307445J6293008J3784353K130351j718239
18107A23035891n601988j9306934j9893121j1637506o914542n841226o084741
18100D7755833n319189m384793l882586l687220l070567k290185j851955j531417
18092B1737921j242940r63548q19829o94200o04212m05682j74073J44261M65297
18083A7442995R60776J439400J671751J878676K275433K381287J704260J309541
18075C1064119J579283J531503R56984R01676J801189K206541J512930J200356
18067D2754581J308771N63642p33417j118203j180507j942586k262717j665815
$$ y = [40816619, 43870953, 47252323, 49893440, 52083696, 55412956, 60006584, 64293254, 67912869, 72330047, 77518227, 83238973, 92546418, 108839426, 122623779, 124754130, 123035891, 117433903, 98126969, 78233848, 66596342, 59681800, 53840574, 47755833, 42436644, 38051851, 34169265, 30482045, 27411478, 25121293, 23269338, 21737921, 20494981, 19531433, 18711604, 18017404, 17413192, 17007510, 16833437, 16977698, 17442995, 18403771, 19843171, 21514922, 23393598, 25669031, 28050318, 29754578, 31064119, 32643402, 34174905, 35131889, 36033565, 37834754, 40041295, 41554225, 42754581, 44063352, 44626994, 43893577, 42775374, 41594867, 39652281, 37389564, 35723749]
18059C5723749j184650j374317j763406j477880j506926k276602k722820k384978
18051B1032170k156004k194657k036497j626000j171867q89127p10350n87885
18043I659783n63892o00254m96906m60284m26541l83378l81506m27957l04249
18034E614816k66263k78625k84945k89648k82142k06752j54133j47656j11242
18025C593410j54125j31574o7069j21627r7216j60308j76579j51253q7793o2999
18015B382867k6189q4417r9010r5591l4410l892l4847l3402o7895j52301m1545
18004A709368p658l3043n5109q5437l3447n209j0800J0243n4158o5499k8211n8420
17992A282620k8362p1326M7384R724k0009k978k4285r3755p9641K9197m4219j28231
$$ y = [35723749, 34539099, 33164782, 31401376, 29923496, 28416570, 26139968, 23417148, 21032170, 18876166, 16681509, 14645012, 13019012, 11847145, 10958018, 10247668, 9659783, 9095891, 8495637, 7998731, 7538447, 7111906, 6728528, 6347022, 5919065, 5614816, 5348553, 5069928, 4784983, 4495335, 4213193, 4006441, 3852308, 3704652, 3593410, 3439285, 3307711, 3240642, 3119015, 3021799, 2861491, 2684912, 2533659, 2445866, 2382867, 2356678, 2272261, 2173251, 2077660, 2043250, 2039358, 2004511, 1971109, 1903214, 1750913, 1709368, 1701710, 1668667, 1613558, 1528121, 1494674, 1489465, 1478665, 1488908, 1434750, 1369251, 1341040, 1282620, 1254258, 1182932, 1230316, 1240040, 1220031, 1217053, 1192768, 1099013, 1019372, 1048569, 1004350, 876119]
17980H76119J6980L5858J6649n2148j1719k34n5022k6342j9599k6978K9853P782
17968G91199q7520m1550m8355K6391R432m240Q69k014M0033m0259k2643m2064
17956E79279k428N3063L2529m1824l8263l8162M401Q5140N1462k215N2275n860
17944G29397j5547K0531J7702J9811J1942k9906n219N057p4864L38k1164q452
17932F49626P5710J4193j9225q016j0103m4008n3248l3264j2637L2561M697j5255
17920E81031o20j4553L3538o494n2300m5874K696L1981R242o685m9474o9112m1352
17907C72024q355M5500N110l8298m1793L5114P4690j4148k4700m7J7792k2883
17895D00006K0732n5046o3139M3543J1275l8216n7219k700J500L4169N3821l121
$$ y = [876119, 893099, 928957, 945606, 893458, 881739, 881505, 826483, 800141, 780542, 753564, 783417, 791199, 703679, 662129, 613774, 640165, 649597, 645357, 646226, 644212, 684245, 643986, 621343, 579279, 576851, 629914, 662443, 620619, 582356, 544194, 548595, 633735, 685197, 682982, 735257, 729397, 713850, 734381, 752083, 771894, 783836, 753930, 748711, 753768, 678904, 679242, 658078, 649626, 725336, 739529, 720304, 712288, 702185, 658177, 604929, 571665, 559028, 591589, 596286, 581031, 580411, 565858, 599396, 592902, 540602, 494728, 497424, 529405, 538647, 531962, 482488, 413376, 372024, 363669, 409169, 414279, 375981, 334188, 369302, 443992, 429844, 405144, 405097, 422889, 400006, 420738, 365692, 302553, 346096, 357371, 319155, 261936, 259236, 260736, 294905, 348726, 345605]
17883C45605Q821m1604m1451L1805N2662P2704j1631m5978k3953k3477K6214P6555
17871D26272J0059n4481L2542O0159P3798Q2992K2173J6239p24l8932j779K4213
17859F52531K9467R4851N2752L9041J3779P2613J1896J3717M1203n648j5046l8455
17847I62701j11582j21461j23458r5081k4482L7599Q5538Q1292L8576K6846M8056
17836H04544N5384N5051N925K4011L5109k3687k4272K5501J03687N1939j5729
17825A097463Q8799K6993M525l73o4046n6743j14623j68313j23307r0817m9562
17814E49996k2307j098m1884m8357K8799L0698n8655q217M9192M1682O389N1231
17802E77469P0530Q7129K7794K9286J0121o3291m8225p8948n9974k2585L8343
$$ y = [345605, 354426, 312822, 271371, 303176, 355838, 428542, 416911, 370933, 346980, 323503, 349717, 426272, 436331, 381850, 414392, 474551, 548349, 631341, 653514, 669753, 669029, 630097, 628318, 652531, 681998, 776849, 829601, 868642, 882421, 955034, 966930, 980647, 1021850, 1016202, 1001156, 962701, 851119, 729658, 606200, 511119, 486637, 524236, 609774, 691066, 729642, 756488, 804544, 859928, 914979, 920904, 944915, 980024, 956337, 932065, 957566, 1061253, 1113192, 1097463, 1186262, 1213255, 1217780, 1217407, 1153361, 1096618, 981995, 813682, 690375, 599558, 549996, 527689, 526591, 484707, 436350, 465149, 495847, 437192, 428975, 478167, 519849, 526238, 577469, 647999, 735128, 762922, 792208, 802329, 739038, 690813, 611865, 551891, 529306, 567649]
17791E67649p946K2928L0795J5737J647m3723j0366l1785l7425N342M2216P7446
17779F32515J4271J0037Q177J2119P909O878j6886r7628j56236l4777k6789O353
17767C65943n427K3843j6007n1736o8633m8430M3998L7475J0322l6342j9997J6860
17755B51869M6127J7929q3031l4628L4819N9347M3150L5247J4272J01825Q2862
17744E69788r96o7560q4857n6716o1795k9908l8641k0805O3194L0516O761O1255
17732C70236K6294L028J05908J38565O7704K4254k4755n0621m0583n5372p9074
17721D85584o2264j8951j4211k6724J8819K6637J2349K8347L5405M4059m5707
17710D83343m5686l6074K1171n3581m4957r6321j7492O9825j2629r1118K7588
$$ y = [567649, 559703, 582631, 613426, 629163, 630810, 587087, 576721, 544936, 507511, 512853, 555069, 632515, 646786, 656823, 665000, 677119, 685028, 691906, 675020, 577392, 421156, 386379, 359590, 365943, 360516, 384359, 368352, 316616, 247983, 199553, 243551, 281026, 291348, 255006, 235009, 251869, 297996, 315925, 232894, 198266, 233085, 292432, 335582, 370829, 385101, 486926, 569788, 568792, 501232, 416375, 359659, 297864, 267956, 229315, 208510, 271704, 302220, 308981, 370236, 396530, 399558, 505466, 644031, 711735, 735989, 711234, 660613, 620030, 564658, 485584, 423320, 404369, 390158, 363434, 382253, 408890, 421239, 449586, 484991, 529050, 483343, 437657, 401583, 422754, 369173, 324216, 227895, 210403, 280228, 267599, 176481, 204069]
17699B04069N5258J5133J07042N0832o469M2273J6552j6224k8063p8605r5756
17688B66042n483m3429o1091j086j9146j9138J9306k7728m3329J4376J2955O752
17676I9001N7438j4819j7164J4191k1301l5514m681R978J3831J2653k0611L4192
17664A27194n1486k7382r392k1906k3842N45O59Q175L6848m1536j5443q104k2537
17651d8207k631P583M9391N9121O4973L5442j12965l6588M4685L7547J5096k4733
17639H8714k1555m0707L5725K161P7914P1014N13K2621p2015j2261n2338o7832
17627C1954P1570N7827K8249k0808O8640p427M7986M6983M0728M8680m3351k6880
17615C44151O860K8681j6287n980O9949j5324m9169o6736k0405K3494L4779J5491
$$ y = [204069, 259327, 274460, 381502, 432334, 425865, 468138, 484690, 468466, 440403, 361798, 266042, 260559, 217130, 156039, 154953, 135807, 116669, 135975, 108247, 64918, 79294, 92249, 99001, 156439, 141620, 124456, 138647, 117346, 81832, 77151, 87129, 100960, 113613, 93002, 127194, 75708, 48326, 38934, 17028, -6814, -6269, -5610, 2565, 39413, -2123, -17566, -25670, -48207, -50838, -43255, 6136, 65257, 130230, 165672, 52707, 16119, 60804, 98351, 113447, 88714, 67159, 26452, 62177, 64338, 142252, 213266, 213779, 236400, 164385, 152124, 99786, 31954, 103524, 161351, 189600, 168792, 237432, 230005, 277991, 324974, 365702, 414382, 371031, 344151, 351011, 379692, 363405, 357425, 427374, 412050, 362881, 296145, 275740, 299234, 334013, 349504]
17603C49504l9825j1616o7342k514J5274N3889l2762k0764m4028r8482l6642M7741
17591A12433k850k5410K4394j3115q799O719j0257M6105P898N3657o379k6299
17579A58097K2215O4247J4143l399Q3221J07215n2732l0292l2271j717o3912L481
17567B68296J0641m3165m1156L6297j516P4412K7173j8560n6375o1913m5985O9701
17555B17850j239p9016r955Q7941O0927k5344J67k1723n7242l0839p3993k8188
17543C9346K9333p214j0934j8928K3580K8090l661K4191k384O5934j48m5021J6094
17530A38278O7008m435n7884o7787m286k4036O8854J4281K2004p575J923m5277
17518A01068p3407m484M8367P599K6572R297K974n0481j3948L3501n4493L8960
$$ y = [349504, 309679, 298063, 230721, 228207, 243481, 297370, 264608, 243844, 199816, 101334, 64692, 112433, 109583, 84173, 108567, 95452, 86653, 93372, 83115, 129220, 137118, 190775, 184396, 158097, 180312, 244559, 258702, 255303, 338524, 445739, 393007, 362715, 330444, 328727, 264815, 268296, 278937, 235772, 194616, 230913, 229397, 303809, 330982, 312422, 256047, 194134, 148149, 217850, 216611, 137595, 127640, 215581, 276508, 251164, 251331, 229608, 172366, 141527, 67534, 39346, 68679, 61465, 50531, 31603, 55183, 83273, 79612, 103803, 101419, 167353, 167205, 122184, 138278, 205286, 200851, 142967, 75180, 70894, 46858, 115712, 129993, 151997, 144422, 146345, 101068, 27661, 23177, 71544, 79143, 105715, 115012, 117986, 67505, 53557, 87058, 32565, 71525]
17506G1525r926j2422k3731K9319l016j6275o298L3007l0040l7282L1198K8586
17494E4645K9314K3807k1268j08830l6166O0534L8959O2576O7784l1575m3182
17483I6598p357l4915m3955m725K3160K5018l2191J4661J6991J180k816K2282
17471G3931k9395m0513J2795O2871J5242Q029n0528R526K1159j2018K1946O3208
17459A56253L5242k1782p7889l7916q090j832K5027k0921k9135k1933M7652N8707
17447A03383J4385L6297J06884J54472L2885j6452k5221o6120r1107p8844k8379
17436A42183m370j3725n6006n4402M0114q820j4437l2832N747M7882k5955o3392
17424c8013k9900L0752N4261M9453k8466o1250o3149P7949K2418j0404l3485Q702
$$ y = [71525, 61599, 49177, 25446, 54765, 51749, 35474, 29176, 62183, 32143, -5139, 26059, 54645, 83959, 107766, 86498, -22332, -58498, 2036, 40995, 103571, 171355, 139780, 96598, 89241, 54326, 10371, 5646, 28806, 53824, 21633, 36294, 53285, 54465, 51649, 73931, 44536, 4023, 16818, 79689, 94931, 102960, 52432, 61958, 83117, 71099, 93045, 156253, 191495, 169713, 91824, 53908, 45818, 43986, 69013, 48092, 18957, -2976, 44676, 103383, 117768, 154065, 260949, 415421, 448306, 431854, 406633, 340513, 249406, 170562, 142183, 137813, 124088, 68082, 13680, 53794, 44974, 30537, -2295, 3452, 51334, 25379, -38013, -67913, -37161, 17100, 66553, 38087, -23163, -86312, -8363, 14055, 3651, -29834, -21132]
17412b1132Q621K5270L7886k7423K27j4739k7295n7461j0688O2992O5190L5865
17400G7313j8789l356K130k607J173O9233K3423k6336n1610J5705n296n288l0630
17387D5065O732l3502k7986L6249K6532K7000m0307j6025m4508k1274J2169k4791
17375e4646K4777M0160k815N2295L0160k068j0917Q138J0021l7430Q889J2382
17363G8946q8990j578M3219K3644L0722J5602k0475j8629k8455k8579j181J8318
17351B2564J8280m5340q617K8231k8501M8847k2361k6026k9342j8911M0091k2302
17339d3387L9248O1066L6776J964m7740j17j937k2660n3155m013J01414N889k6352
17326D6996j3015K0780J5692K0309j2883m7546R6854J3719l9943k1334l4064K862
$$ y = [-21132, -12511, 12759, 50645, 23222, 23449, 8710, -18585, -76046, -86734, -23742, 41448, 77313, 58524, 55168, 57298, 54691, 55864, 125097, 148520, 122184, 70574, 86279, 80983, 75695, 45065, 51797, 18295, -9691, 26558, 53090, 80090, 39783, 23758, -20750, -42024, -29855, -54646, -29869, 10291, 7476, 59771, 89931, 87863, 76946, 85084, 95105, 57675, 66564, 78946, -10044, -11622, 31597, 55241, 85963, 101565, 81090, 62461, 34006, 5427, 4246, 22564, 40844, -4496, -13113, 15118, -13383, 35464, 13103, -12923, -42265, -61176, -21085, -43387, -4139, 56927, 93703, 95667, 47927, 47810, 45873, 23213, -29942, -33955, 67459, 73348, 46996, 33981, 54761, 70453, 90762, 77879, 30333, 127187, 140906, 100963, 79629, 45565, 48427]
17314D8427l1448k1423k6007N4076P3901L4728l5549p1285m0584M5549K6865M6697
17302A03947j1942j9622P3457L0266p0899n2448j1011K4813M565L1898K9045j1867
17290A20202n9180m8399N862Q0659K147J0175P865o2811j2855q020J9906k0200
17278C5351K7902J8605o315l7924m6937l9045m3997M6561O1445M2445j3260J8599
17266F3430O062n9141l3861m14L3052o8665l6644K8059L8769k8983N1852L7717
17254C1233K9630k6121j00652k0781j7264o5575K2389R2796Q3976j5734p4730
17243f0833j4795l4104O1238L2088o3076k7641L6911Q8185J3656k4585J352K1512
17231B9908K6786J108j4594o9684k5631L3406k6318j9515J5545L957J6288K0406
$$ y = [48427, 16979, -4444, -30451, 23625, 97526, 132254, 96705, 25420, -15164, 30385, 57250, 103947, 92005, 72383, 145840, 176106, 105207, 52759, 41748, 66561, 71126, 103024, 132069, 120202, 61022, 12623, 18485, 99144, 101291, 111466, 119331, 56520, 43665, 35645, 55551, 35351, 63253, 81858, 75543, 37619, -9318, -48363, -92360, -45799, 15646, 58091, 44831, 63430, 69492, 10351, -23510, -23924, 9128, -59537, -96181, -68122, -29353, -58336, -6484, 31233, 60863, 34742, -65910, -86691, -103955, -169530, -147141, -54345, 29631, 13897, -60833, -75628, -109732, -48494, -16406, -79482, -107123, -70212, 17973, 31629, 7044, 8396, 29908, 56694, 57802, 43208, -26476, -52107, -18701, -45019, -64534, -48989, -45032, -28744, -8338]
17219h338m747M5616J5837R748J4347m199Q368N0645p7746j1530K5774k2767o2046
17206b1038L0367K3710J6574P238p845k5832J1206k9277L600J5838k6203J1742
17194A0080k2458k1812J9982j3899O172N5851j8787m9097R349L9983j7009l7842
17182c9487N0181P2970m0351p0044m061M0932J2840j8140J0147l803m2341N3917
17170B2760M6217K6578o281P198j05819J663P3833L6058M2092J4777j06777q6708
17158c4409p991n767J2826J2645N2355L925j8093p9591K8354M1777k7201K8952
17146G782N1808O170l3396k5650l5853K450q429J6528R833N6155L9659j7822l7156
17133C2079n6497J1163M3989L205K4297k29J9719q048k6318m6919j7684L2830
$$ y = [-8338, -13085, 32531, 48368, 58116, 72463, 68264, 76632, 127277, 49531, 38001, 63775, 41008, -21038, 9329, 33039, 49613, 56851, 49006, 23174, 34380, 5103, 8703, 24541, -1662, 10080, -12378, -34190, -14208, -28107, -21935, 33916, 15129, -33968, -24619, 15364, -1645, -39487, 10694, 83664, 43313, -26731, -30792, 10140, 22980, 4840, 14987, 11184, -31157, 22760, 68977, 95555, 89274, 96472, -9347, -7684, 66149, 102207, 144299, 159076, 52299, -34409, -42400, -48167, -35341, -22696, 29659, 33584, 15491, -64100, -35746, 6031, -21170, 7782, 59590, 65760, 32364, 6714, -29139, -26689, -35118, -18590, -8757, 47398, 87057, 69235, 32079, -24418, -13255, 30734, 33939, 58236, 58007, 77726, 69678, 43360, -3559, -21243, 11587]
17121A1587j1922l3056j7059m2772M982L7660K2893M105J4783N7247L7028K764
17109H8240R683j3817l6147p827l2842l6133o739J7508J7705N3703L6818l5212
17097E4940q2750N3623L1241J1436j1717K5368J2148j1347O775J2576k4237l8254
17085C9802l0686K5657K2851J9624m2528j8315L6938J5243j9248K8700N0634q411
17073A20261O386j5458l9664j1290M4829k0266n7472q4358M1125L3623J7813J6342
17061E1871m7220k2986k2144P6731J2206l7767j5756k2597k507N2781J5952m9923
17049a1359R356N349m927r9625k9680N7704R8370L0091p8359m7370R4968J8851
17037D3369p105k744j8154J6881j06L4054k3762l5759R023j0326q7647K496M0078
$$ y = [11587, -335, -33391, -50450, -93222, -88240, -50580, -27687, -23582, -8799, 48448, 85476, 88240, 97923, 84106, 47959, 40132, 7290, -28843, -35582, -18074, -369, 53334, 90152, 54940, -27810, 25813, 57054, 68490, 56773, 82141, 94289, 82942, 89717, 102293, 78056, 39802, 9116, 34773, 57624, 77248, 34720, 16405, 53343, 68586, 49338, 78038, 128672, 120261, 126647, 111189, 71525, 60235, 105064, 84798, 27326, -57032, -15907, 17716, 35529, 51871, 4651, -18335, -40479, 36252, 48458, 10691, -5065, -27662, -30169, 22612, 38564, -11359, -2003, 3346, -1581, -101206, -130886, -73182, 25188, 55279, -23080, -70450, 24518, 43369, 36264, 33520, 15366, 32247, 32141, 66195, 42433, 6674, 15697, 5371, -82276, -79780, -39702]
17024c9702r591L4n560k8476J9000M8739J1478j5795q810K7734l956r2047k6766
17011a23718M6751M0834M1003k3070L876n5676p977J4530r109M190j0171N504
16999g3033R8318L1415n7328k1575o235M3887N7332J9417j3928m0854k1328j0921
16987E167l7479J9775J4079j3939m0808K5993L1081K9365j7491n5772n6209K7038
16975f9200J7867L5848q525P960M4531l1533l8832j8110N7424L5363M6610m316
16963G5087n2589n0862J1391k6824O785M6134Q882J0138q5269k7135J1070j4009
16951h7201N929J4945k8107O817Q1806J9228j2753m2316j6661M592L8346P8699
16939F3324l3139j4480R996M2483j8718k3154k7461M814N5039m420j4052J1895
$$ y = [-39702, -49293, -49259, -54819, -83295, -64295, -15556, -4078, -19873, -28683, -949, -4905, -96952, -123718, -76967, -36133, 4870, -18200, -14324, -70000, -77977, -63447, -72556, -68366, -78537, -73033, 25285, 56700, -628, -22203, -28438, 15449, 72781, 92198, 78270, 37416, 16088, 5167, -32312, -12537, 1542, -12397, -53205, -27212, 3869, 33234, 15743, -40029, -96238, -69200, -51333, -15485, -24010, -16050, 28481, -3052, -41884, -59994, -2570, 32793, 79403, 75087, 22498, -28364, -16973, -43797, -37012, 9122, 18004, 28142, -57127, -84262, -73192, -87201, -81272, -66327, -94434, -87617, -5811, 13417, 664, -41652, -58313, -53721, -15375, 63324, 30185, 15705, 25701, 68184, 49466, 26312, -1149, 3665, 58704, 54284, 40232, 52127]
16927E2127L6545k2369L169j7378r587P581q717j4482K207M1509P03m1026q6001
16914e5719k4129P8257J10003J7002n2413M756n206K5591o3656l8033m1084l1965
16902g6596n1508K5575K4568P784K3727J9286K2144K6699J3845q080m109K9643
16890E2978k3676J9637M67n060l907K1811l3816k0261n2669M8276l1397l5174
16878f2791O5516N1019m6910o3904M2931N1345J2659N2982m2276L5594K2959l7006
16866H2118k5984r87n446J9181j3083Q365L399k4805l0679m5180O768J06056J5350
16853I5073k3875l5326N5435M7186l4079o9663r250M0656n6107p1640k829L7602
16841b6817K2236Q0684J8123m2048o1331J5639J8632k5722M6313k0450n0943j9358
$$ y = [52127, 88672, 66303, 69472, 52094, 42507, 50088, 41371, 26889, 29096, 70605, 71308, 30282, -55719, -79848, -1591, 108412, 125414, 73001, 77757, 72551, 98142, 34486, -3547, -44631, -76596, -128104, -102529, -77961, -70177, -46450, -27164, -5020, 21679, 35524, 27444, 23335, 52978, 29302, 48939, 49406, 44346, 40439, 62250, 28434, 8173, -44496, 3780, -27617, -62791, 2725, 53744, 6834, -57070, -14139, 37206, 49865, 102847, 60571, 96165, 119124, 82118, 56134, 55147, 49701, 68882, 55799, 64164, 67563, 42758, 12079, -33101, -26333, 79723, 95073, 71198, 35872, 91307, 138493, 104414, 34751, 25501, 66157, 10050, -61590, -64419, -26817, -4581, 76103, 94226, 52178, -9153, 6486, 25118, -604, 45709, 25259, -25684, -45042]
16829d5042L4530K0060N452L4565m5515k6821k9193N1376l7231O218J7712O430
16817g459j6486m0880L3345N6549K1782n4837j0844J542J8992L182j7710l9657
16805e2481J5716M1204M00j5160k5648K4360N3302K4484j6446j0033j9895o356
16793A3447k0654J0017j865K553j5675M8925R7455J5123o4083o9986J0380k9584
16781c947l6190M3737Q3953J3058q7137m5707l4791J8257O1984m9268q970L6263
16769h758L802N3145o1696m7497N764j706P0249Q0745J2901k6771k6276J2396
16757F6298m5243j8795p5055P290O1233k3464j14470N244M4928K0659O3849K9288
16745B1762o034j760n644j3957n9207K2837P5726l583J422J2544j5544l1537k966
$$ y = [-45042, -10512, 9548, 15000, 49565, 4050, -22771, -51964, -588, -37819, -31601, -13889, -7459, -23945, -64825, -31480, 25069, 46851, -7986, -18830, -17288, 1704, 4886, -12824, -52481, -36765, 4439, 4839, -10321, -35969, -11609, 41693, 66177, 49731, 39698, 19803, 13447, -7207, 2810, 945, 3498, -12177, 36748, 134203, 149326, 85243, 15257, 25637, -3947, -40137, 3600, 87553, 100611, 13474, -32233, -67024, -48767, 13217, -36051, -45021, -8758, -4956, 48189, -13507, -61004, -55240, -56946, 13303, 94048, 106949, 80178, 53902, 66298, 21055, 2260, -72795, -65505, -4272, -27736, -142206, -136962, -92034, -71375, -7526, 21762, 15728, 13968, 8324, -5633, -64840, -42003, 33723, 30140, 31562, 44106, 28562, -2975, -5941]
16732e941L0761R8874k5643o0345l1855L227K8907j5327K7257j7598p0483j9834
16720e8000L0062L9311N51j2961K9548K5567p7504l2370m440k9230o0020N1774
16708i7712L3162m566M0323M6335M5904n6452j9766P4879j609m5446k5566K5078
16696A4564K6972Q1078k9145n4043l5966J0423N1038K7347j574L0933J2958j4515
16684A20070l0600k7257l9132o1303M0722l2249K8342K7430p6065l7739O1309
16673b6472O6602l3k0899k8446J2462L1761N5572k853L3901J7888m5245p9219
16661A5019m461j501J0630N077j770j1976o3604J1610N0244N7504m62n3929p0383
16648e8002J3436M243J4669M9387Q6579J4987m6040o929m0096J1633l758k9242
$$ y = [-5941, 24820, 123694, 98051, 37706, 5851, 9078, 37985, 22658, 49915, 32317, -38166, -58000, -27938, 11373, 11924, -1037, 28511, 54078, -23426, -55796, -60236, -89466, -149486, -97712, -64550, -69116, -28793, 17542, 63446, 6994, -12772, 62107, 60498, 15052, -10514, 14564, 41536, 122614, 93469, 39426, 3460, 13883, 64921, 92268, 90694, 121627, 134585, 120070, 89470, 62213, 23081, -38222, 2500, -29749, -1407, 26023, -50042, -87781, -26472, 40130, 40097, 19198, -9248, 3214, 34975, 90547, 87694, 121595, 139483, 94238, 15019, 10558, 9057, 19687, 24764, 22994, 11018, -52586, -40976, 9268, 66772, 66310, 12381, -58002, -44566, -40323, -25654, 23733, 110312, 125299, 79259, 72330, 32234, 43867, 40109, 10867]
16636A0867k2508j7915K1977j4799m5970k743O709L3934j6713K5434P001l5779
16624e0505L9946K0681j2689J1530M8018j4361P165k3589m1574m7558l6653M5019
16612e4570R2225M9053R651k1385o1314j0317O4797k4203p5696j758j1683k2027
16600f7227J3399M7883M555m2790O1922J6674M501K3645m3815k9069k408K3141
16588A0411K4426J7509r639m5125K1354P965k2782M1657P1399j097n3862K6743
16576H8959k6854o8900K2679N337n439O996j5383O656o741j8940N3l9114M2162
16563h529Q8300L9918l5646j8488j1855K3969L55M309K6973k2755J0461K492j8732
16550H0772J642N474M8757L587l5398j5789o014K690J7501L9183J119n2017R015
$$ y = [10867, -11641, -29556, -7579, -22378, -68348, -71091, -64382, -30448, -47161, -21727, -14726, -50505, -10559, 10122, -2567, 8963, 56981, 42620, 49785, 26196, -15378, -62936, -99589, -54570, 37655, 86708, 96359, 74974, 13660, 3343, 68140, 43937, -31759, -33517, -45200, -67227, -53828, -5945, -1390, -44180, 17742, 34416, 38917, 62562, 18747, -10322, -12730, 10411, 34837, 52346, 42707, -2418, 18936, 26901, 4119, 45776, 117175, 116078, 62216, 88959, 62105, -6795, 15884, 21221, 15782, 22778, 7395, 14051, 7310, -11630, -11577, -50691, -8529, 79771, 119689, 84043, 65555, 53700, 77669, 78024, 82333, 109306, 86551, 97012, 99504, 80772, 82414, 87888, 136645, 140232, 104834, 89045, 83031, 85721, 103222, 142405, 143524, 91507, 100522]
16537A00522m2325L7039K2323m217j5956j9009k0431k6866m1220J1588L0347O7573
16525I9368K3734J5971n5778M1099l1560n2576m2207l4355K5188K200M1741J6117
16513D8942j4673M6268L6864k0395p278l2902j810K3791j263m0612o7615L7480
16501F797L6977K4657K8531l9339p6586k6717Q0804N5715l6618o5791m5630L4969
16489b2231L8472J6141O5006O3394l874k7995j7712n8070N111j8762l103L9114
16477G5491Q413k934K5102j1356o9226j3206J5337p5026Q179o0814K9517O0703
16465i820M0379J7425k0300k9651m506N9410p6325q8365l8223N537N3625N0058
16453d0756M0632J6110k7022m9581K4442j5640J969Q750L6090P746j821k0019
$$ y = [100522, 58197, 95236, 117559, 113342, 97386, 78377, 57946, 31080, -10140, 1448, 31795, 99368, 123102, 139073, 83295, 124394, 92834, 40258, -1949, -36304, -11116, -8916, 32825, 48942, 34269, 80537, 117401, 97006, 89728, 56826, 55016, 78807, 77544, 36932, -30683, 6797, 43774, 68431, 96962, 57623, -18963, -45680, 35124, 90839, 54221, -11570, -57200, -22231, 16241, 32382, 97388, 160782, 156908, 128913, 111201, 53131, 58242, 39480, 36377, 75491, 83904, 80970, 106072, 94716, 25490, 12284, 27621, -47405, -39226, -100040, -70523, -9820, 30559, 47984, 27684, -1967, -6473, 52937, -23388, -111753, -149976, -144439, -90814, -40756, -124, 15986, -11036, -60617, -36175, -51815, -49846, -41096, -5006, 2740, 919, -19100]
16441a9100O0979q013n0455J2156l3088j4752j2976M622M5978Q5392J6654q552
16429G8845p6165n2878J7118k880j2440J9316j8479r477L1048M2203k3471N1214
16417D3954R5401k0771n0958m6505m9345J8550L0634L1290j411j9297n797J09364
16405A35109N2937k9192q3818l2448J9576N7917k93n5927o4863m1471j0532J3508
16393c9497M356L2258O7762J1209J7651J3493o1519L6766o372p5108r077k029
16381a0107L2137R303m9083k5352P7029N626O176n7737n7843K5148J3279L6072
16369D648k4441L1342J5736l3202m0290o3885O7531N2296R003k5370l985N3401
16357D2784O6473m2178r1864q959M6686Q6242J8690n0702m9096l2306N5039n0242
$$ y = [-19100, 41879, 33866, -16589, -4433, -37521, -52273, -65249, -60627, -14649, 70743, 87397, 78845, 2680, -50198, -33080, -35960, -48400, -29084, -47563, -57040, -25992, 16211, -7260, 43954, 139355, 118584, 67626, 21121, -28224, -9674, 20960, 52250, 50839, 31542, 25745, 135109, 188046, 158854, 75036, 42588, 62164, 120081, 119788, 63861, -1002, -42473, -53005, -39497, -35141, -2883, 64879, 76088, 93739, 107232, 45713, 82479, 76107, 999, -8078, -10107, 22030, 31333, -17750, -43102, 33927, 39553, 45729, -12008, -69851, -44703, -31424, 4648, -19793, 11549, 27285, -5917, -46207, -110092, -42561, 9735, 18738, -6632, -10617, 42784, 109257, 67079, -24785, -33744, 12942, 99184, 117874, 67172, 18076, -14230, 40809, -9433]
16345i433m3866J9078K5504O5846L89p1533p939Q914P4788K6901n3084m6723J4161
16332C003K8413J2620p3167m7832N2199L7821k6743p965n3989J3291L1591k0632
16320e1390r319N4673j6705j4351O8108J4780K7186K9058l7493l7828L4718mM4148
16307A05581J713m7235l1657j2169M7684l470J6559J4242l1755L9901J8280j2710
16295A04964k8985j8605j4782m7388j7788O3754J561o7658p1413K6244O2193L1053
16283B3150N2359n2854r3214J8540P3082k5441j2474O0881M2608m0292k4949k05
16271B1191l66J4068m8082m2264J0471J0067N317L3566j2146K4131m1898j07133
16259a33078l7965O336M6217J6656q1886L4080N8563K0404L7088M8354k7126J9393
$$ y = [-9433, -53299, -34221, -8717, 57129, 57518, -14015, -21954, -13040, 61748, 88649, 35565, -11158, 3003, 31416, 44036, -29131, -76963, -24764, 13057, -13686, -21651, -75640, -62349, -30758, -51390, -60709, -6036, -22741, -37092, 31016, 45796, 72982, 102040, 64547, 26719, 61437, 61433, 105581, 107294, 60059, 28402, 16233, 63917, 60447, 77006, 91248, 59493, 99394, 117674, 104964, 75979, 57374, 42592, -4796, -22584, 41170, 42731, -24927, -96340, -70096, -7903, 23150, 75509, 22655, -70559, -52019, 21063, -4378, -16852, 44029, 86637, 46345, 21396, 21191, 20825, 34893, -13189, -55453, -44982, -34915, -29598, 3968, -8178, 15953, -25945, -133078, -171043, -164707, -118490, -101834, -183720, -149640, -91077, -70673, -33585, 14769, -12357, 7036]
16247G036j8443l3118j6851M7542K4966K4492J3314l3776J1583L2482k0031l8182
16235A014k450M0498p7402O5M9104J0352l1791l5005P5482P028l4117k2694M0315
16222B0399k8246m3955j4834j1368r843N5995Q6743L7911J2875l4233n9342n9235
16210d7133k0155Q9800K8851j706r734P071l3177o490L4163j5095l6615j4111
16198b4331l7715o5028n518J1141O1210J6772j7152J6276K9992k9337l8222k4694
16186a06606L9403K6433N5559J1366l7420l63j0892k5416Q808p0530m2972O9135
16174h3495O8049l900r384R246j3302l2423K1254L1582Q9288o042n3447j0191
16162G235j8671k6530M713Q17J5571l8291K3588K0791N0509M6717K0351o0331
$$ y = [7036, -11407, -44525, -61376, -13834, 11132, 35624, 48938, 15162, 26745, 59227, 39196, 1014, -1436, 39062, -38340, -38275, 10829, 21181, -10610, -45615, 29867, 36895, 2778, -19916, 20399, -7847, -51802, -66636, -78004, -87847, -31852, 54891, 92802, 105677, 71444, 12102, -47133, -67288, 22512, 51363, 49657, 39923, 46994, 13817, 7327, 41490, 26395, -10220, -24331, -62046, -127074, -132592, -121451, -60241, -43469, -60621, -44345, -14353, -43690, -81912, -106606, -67203, -40770, 14789, 26155, -11265, -11628, -22520, -47936, -39128, -109658, -152630, -83495, -15446, -19346, -28730, -19484, -32786, -65209, -43955, -12373, 76915, 70873, 17426, 7235, -11436, -37966, -33253, -32436, -16865, -55156, -31568, -10777, 39732, 86449, 106800, 46469]
16150D6469m8210j1931j3894k2480P9L2801M55j5327q143J2212J7229k9496J8401
16137b1835L9871O3340L2449q810r7334n3398p3488M3436j3092L7625L1170K9792
16125I726Q7678k8570l4833o51l0379k5023K5031K1436k6420k4882J1413j5805
16113c1279k3539k9661N3276O8388L3721j6612k3258N0297J2309j3954K2298m0602
16101F1384k9140K2067N3755K135j19179k9651j9282J1347m186P0836J00970j1448
16089A09608p1099p9432N604N7417o843m6403n172J7612r292m1819j3944L662
16077h0101P0581M5933K6600k54K5767l5405o7422l4409m2689K5148P8950P3557
16065H6256K0041o3287n843n0523p4879q3865M4780L0057R7174K0266j6808R217
$$ y = [46469, -1741, -13672, -27566, -50046, -49967, -17166, -16711, -32038, -40181, -27969, -10740, -40236, -21835, 18036, 81376, 113825, 105015, 7681, -45717, -119205, -75769, -88861, -51236, -20066, 9726, 97404, 68834, 34001, 33350, 2971, -22052, 2979, 24415, -2005, -26887, -15474, -31279, -54818, -84479, -31203, 37185, 70906, 54294, 31036, 81333, 93642, 79688, 101986, 61384, 32244, 54311, 108066, 110201, -8978, -38629, -57911, -46564, -50750, 20086, 121056, 109608, 38509, -40923, -35319, 22098, 15255, -31148, -36320, -18708, -28000, -69819, -83763, -80101, -9520, 36413, 63013, 62759, 88526, 53121, -14301, -48710, -91399, -66251, 12699, 86256, 106297, 43010, 37167, -13356, -88235, -172100, -127320, -97263, -89, 20177, 3369, 12586]
16053A2586j6342J6323p6690K1152O5179m7030J4778M9068j0146k9790L0634J5342
16041D5064l0462J7979M2899j9315j6589K3219p726l3502j613O1125K3673o3122
16029D1630l7329l4970k144K0325k0535O6915Q4586k5516q2723k9100J0564N358
16017b939R168N68j9050j7918R271q056J1410K118n2414m5234K0622P1216P2617
16004E1379K2245p7707n0217K4141L7022M1966k5938O152K81j9595p3583l8337
15992a02191K3836k2787L6213O3671O2525J3421J6301o4956K5149J7843k555K8267
15980I4737O001k0306l1820k7072J7764K1231m6980j142N8572l0462j7854M5587
15968F8256l8863K1773O53k1954p6082M604j4684p3762L4384R6208K4059K7909
$$ y = [12586, -3756, 12567, -64123, -42971, 22208, -24822, -10044, 39024, 28878, -912, 29722, 45064, 14602, 32581, 75480, 56165, 39576, 62795, 55069, 21567, 19954, 81079, 104752, 41630, 4301, -30669, -32813, -12488, -33023, 33892, 118478, 92962, 10239, -18861, -8297, -2939, 6229, 6797, -12253, -30171, -20900, -28956, -17546, -15428, -67842, -113076, -92454, -21238, 51379, 73624, -4083, -54300, -30159, 6863, 48829, 22891, 29043, 29324, 9729, -63854, -102191, -78355, -101142, -64929, -1258, 61267, 74688, 90989, 26033, 51182, 69025, 66470, 94737, 100738, 80432, 48612, 21540, 39304, 60535, 13555, 12413, 70985, 40523, 22669, 68256, 29393, 51166, 51819, 29865, -46217, -41613, -56297, -130059, -95675, 533, 24592, 52501]
15956E2501J4609K1192l0869j3612q9366K4907J4737N507l7417o0096M2077P7366
15944B1536N340J3216N8135o4054k85M2944n6645q2582l8555L5638m8N3160N1671
15931C9471n2l2339J4215M628j0505j9940k4388q645k6073j290n8229j5188O4290
15918g4045L6504K495o191L2551N2709j1290J8268K9065j3211k3711k8016l833
15906A1295J6573l3990J9592L9714k5131n7783j2951q499N3125Q445N2141l8034
15894B4497m0101k4024l2475N378n5671L0050Q945L7023N8067l7924J0320O225
15882i690J749j7432J7387K153O6729L1239m653j4848N2074j7273j40014l8577
15870g1156J2566J9058K4722O597M3473j0034m6315k3088P3722K5629j6488n8332
$$ y = [52501, 67110, 88302, 57433, 43821, -45545, -20638, -5901, -394, -37811, -97907, -55830, 21536, 26876, 40092, 98227, 34173, 33888, 76832, 20187, -62395, -100950, -65312, -65360, -12200, 39471, 39419, 7080, 21295, 25923, 15418, -4522, -28910, -37555, -63628, -64918, -123147, -138335, -74045, -37541, -35046, -41237, -8686, 44023, 32733, 51001, 80066, 66855, 43144, 15128, 11295, 27868, -6122, 13470, 53184, 28053, -29730, -42681, -51180, 1945, 10390, 62531, 24497, -15604, -39628, -72103, -66725, -122396, -92346, -83401, -46378, 11689, -26235, -15915, -9690, -7941, -25373, -7986, -5833, 60896, 92135, 87482, 72634, 124708, 107435, -32579, -71156, -58590, -39532, -14810, -8213, 35260, 25226, -21089, -44177, 29545, 55174, 38686, -19646]
15858a9646l7319q445P662N3855N5086Q0517o550n8170r685j8960j8081K7346
15846D7610J2158K3016j3639N3131n1626n0409N292M379l5046J0657O054l4786
15834b3209m2004J3125J9337K8217J16122J6766j2875q4554j954K0036K0321L5816
15822A05144R537m0374n558P850j3257k1032L2716L1274j1308L107O652p4719
15810C0032O020O340J2028l4360j8045N2312n0229j9523N827L9101j3772l8370
15798b2639m7398M462K3513m745J6438N571J8944N3181N709Q479J7123M7943l7290
15785H9291o0961J1926l7038N367M3148M8399K8968k5184l6584J058o0J8994p2037
15772A5287o7859O6299O1346O2725p0127j279K5553M294L378P451K6503N55o5145
$$ y = [-19646, -56965, -65410, -57748, -3893, 51193, 131710, 125160, 66990, 57305, 38345, 20264, 47610, 59768, 82784, 69145, 122276, 70650, 20241, 25533, 29912, -5134, 5523, 11577, -23209, -65213, -52088, -32751, -4534, 111588, 128354, 115479, 30925, 28971, 49007, 69328, 105144, 114681, 74307, 68749, 76599, 63342, 42310, 75026, 106300, 94992, 98099, 104751, 30032, 36052, 42392, 54420, 20060, 2015, 54327, 4098, -15425, -9598, 29503, 15731, -22639, -70037, -65575, -42062, -46807, -30369, -24798, -5854, 47327, 53036, 61515, 78638, 126581, 89291, 28330, 40256, 3218, 8585, 51733, 100132, 129100, 103916, 67332, 68390, 68330, 87324, 15287, -52572, 13727, 75073, 137798, 67671, 66392, 91945, 96239, 99617, 107068, 133571, 134126, 68981]
15759F8981L4720j9672l7881N8747j3067J1330J3487m8282n0304k2972n642J4315
15747C760L1418L232K2188J1192j9444P583n9542m7981L8278O8231j0261q0861
15735c2207P490L2332p7493m2351R9048R670m4936L4980N5056l4318M9707k5133
15723C1845r018j8109O459k9272m7902k2475O529O8205K495L157N3525K2356n2225
15710A5570l6868m1743k4092P564R850J2495L4615P775m1443n2691N4290K0146
15698c4532k4468n83J1378r863l5399n9850N6232Q3504O2323j0459l2430K1050
15686B6903M4207p3005k4414l136j5443l19j0512q169K5026O9834M0184J1945
15674H3101o1379l3756K0929l7059l0181j3040O518P1654K1615j8313J3311k6183
$$ y = [68981, 103701, 84029, 46148, 104895, 91828, 103158, 116645, 68363, 18059, -4913, -10555, 3760, 35178, 38410, 60598, 71790, 52346, 59929, 387, -47594, -9316, 58915, 48654, -32207, -24717, 7615, -69878, -112229, -13181, -3511, -48447, -13467, 41589, 7271, 56978, 31845, 22827, 4718, 11177, -18095, -65997, -88472, -81943, -13738, -11243, -8086, 45439, 67795, 15570, -21298, -63041, -87133, -79569, -69719, -57224, -22609, -14834, -56277, -108968, -54678, -34532, -59000, -59583, -48205, -58068, -93467, -153317, -97085, -13581, 48742, 38283, 5853, 26903, 71110, -1895, -26309, -29445, -44888, -45207, -55719, -63888, -38862, 30972, 71156, 83101, 21722, -12034, 8895, -28164, -58345, -71385, -64867, 6787, 28402, 10089, 23400, -2783]
15662b783n7405j5537M9315M5489M431m604q2757j804Q9463N176j4075k9054M8215
15649C4070j9308p5677p4931M8499M0429m8132M9005L0659q813L5239K0424j6336
15637A5128p6964J8791J7024k37m3903k4429k4468O8018L7721o805k9495Q932
15625d0687L7633Q832j844r664L4310m847l4247m9581k7727M1997l5294J0022
15613g1097k8933L5821M2545N4045M7271k4144r8216k8945k0199O0107L6614q437
15601c568p2739n0520K0627K5665Q6054N5698K8335R602n8008k2603n6420N0797
15589A2920J2885J8666j9836l8303L0977J771k3124j3408o584R520Q839L9113
15577C3436K5432j8873p2605J6877J5471J5798P373J7315l7920k3168J7940N6712
$$ y = [-2783, -60188, -75725, -26410, 19079, 23510, 18906, -63851, -65655, 23808, 28984, 14909, -14145, 34070, 14762, -60915, -135846, -87347, -46918, -95050, -46045, -15386, -24199, 11040, 31464, 15128, -61836, -43045, -26021, -26258, -70161, -94590, -119058, -51040, -13319, -20124, -49619, -40687, -3054, 5778, 3934, -5730, 28580, 23733, -10514, -60095, -87822, -45825, -81119, -71097, -100030, -64209, -21664, 32381, 79652, 55508, -42708, -71653, -91852, -31745, 4869, -3568, -76307, -126827, -106200, -80535, 5519, 61217, 89552, 99154, 41146, 18543, -37877, 12920, 25805, 44471, 24635, -13668, 17309, 19080, -4044, -17452, -24036, -14516, -5677, 33436, 58868, 39995, -32610, -15733, -262, 15536, 22909, 40224, 2304, -20864, -2924, 53788]
15565E3788p763l1525l0327K5891j2314K2911M6880k6354k6064K346k019l5208
15553a9758P679R52L2395p837k9165J2783L4739J5400K0511j6779m5583k4324
15541a8987L8166J9094k386n182m5763K083K5962P469k0811p3729Q266M1677J8021
15528f120n0838l6095L4799K6693N1360k2329l2344J4318k5097j1247l9627P783
15516h8744M9593k9996l483O621J837K3422L1000J6998J1031N8222j1093r942
15504E5466J5954J3617o3119q0658k6865L3304M759R339k8477M15J7774k2360
15492g0851L3496L5590l879j7048J6993N799o4877j7874J3118M9942j4080o2317
15480i5988Q39J0921L1952P6044K5242l7174j8774M941K9864l531j1996k8875
$$ y = [53788, 46025, 14500, -15827, 10064, -2250, 20661, 67541, 41187, 15123, 17469, 15450, -19758, -12079, -11127, 21268, 13431, -15734, -2951, 31788, 47188, 67699, 50920, 5337, -18987, 19179, 38273, 35887, 30705, -15058, -12975, 12987, 20456, -355, -74084, -65818, -24141, -6120, -56958, -93053, -58254, -31561, 19799, -2530, -34874, -20556, -45653, -56900, -96527, -88744, -39151, -69147, -72630, -66009, -64172, -40750, -9750, 7248, 18279, 76501, 65408, 55466, 71420, 85037, 21918, -58740, -85605, -52301, -47542, -38203, -66680, -66265, -48491, -70851, -37355, -1765, -5644, -22692, -5699, 100, -64777, -82651, -69533, -19591, -33671, -95988, -95149, -84228, -52276, 23768, 49010, 11836, -6938, -1997, 27867, 24336, 12340, -16535]
15468a6535k9811O325M2740p036k975K6976J1405k0492m5977K2978J3193n0179
15456d9388p6081L7464Q3783K9637J8667J3698K6930p1729q0536J7803J7055K1595
15444a1102j8457j5596N2426O9867l0242n0688n2363K1647J4405j8982k1037L6951
15432b3171M976P520n0577j6066K2484o168k4123o2981O8261Q8304k3356k8136
15420d3033L3962R514o6312j4876L2048N4479j380k4243m4100k2056M6859P325
15408c1813o962J331K6172M2475n8349l9435J3715j4249K0220N9247j8984J280
15396e352J3485J0669m6936J905J4585l7266L3054q555l6633K0276N2912k7442
15384a5298o3805J3868K1183J1145N4695L8532l0245m6338n3147k3364N2892L1407
$$ y = [-16535, -46346, -40021, 2719, -4317, -7292, 19684, 31089, 10597, -35380, -12402, 791, -49388, -125469, -88005, -4222, 25415, 44082, 57780, 84710, 12981, -67555, -49752, -32697, -11102, -29559, -45155, 7271, 77138, 46896, -3792, -56155, -34508, -20103, -39085, -60122, -23171, -18195, -10675, -61252, -77318, -54834, -61002, -85125, -148106, -79845, 8459, -14897, -43033, -9071, 443, -65869, -80745, -48697, 5782, 4402, -19841, -63941, -85997, -39138, -31813, -38775, -37444, -11272, 31203, -27146, -66581, -52866, -67115, -46895, 12352, -6632, -5352, 8133, 18802, -28134, -26229, -11644, -48910, -15856, -24411, -61044, -40768, 12144, -15298, -79103, -65235, -44052, -32907, 21788, 60320, 30075, -16263, -69410, -92774, -39882, -8475]
15372h475p172m7331j6299M9296R1411O1855m4955j24189l2897L5120O4500n5866
15360c5002r12k8264l2673m2574J5252M7898J0390l221Q3450M7067j3215J3777
15348F1973l2952O625o537n0958K6674l3586R8224L1828l8767o2910M0877j1374
15336B9117l3021O3839J15083n0923p2580r121l035n0069n2948n6286M2898O9333
15324g713k419m0414k7031r928M8891N7376J1342J2297k2472J9336k9342p9173
15312f9250n0458O3085L3267o3579L4652J9594k2929O852M286O228M8213L6448
15300D6409L537j061n3981L652K449l7058N554N39L5233k3431q4082k5447L7847
15287h9840M529L1444j0056K7097O1051Q803K9509m0097n5631l2864l2694j7372
$$ y = [-8475, -15647, -62978, -79277, -29981, 61430, 123285, 78330, -45859, -78756, -43636, 20864, -35002, -35914, -64178, -96851, -139425, -124173, -76275, -65885, -69106, 14344, 61411, 48196, 61973, 29021, 35646, 29109, -21849, 4825, -28761, 69463, 101291, 62524, -386, 40491, 29117, -3904, 59935, 175018, 124095, 51515, 42394, 39359, -10710, -63658, -119944, -77046, -7713, -10132, -50546, -77577, -87505, -38614, 18762, 30104, 42401, 19929, 39265, 9923, -69250, -119708, -56623, -23356, -86935, -52283, -32689, -55618, -48766, -44480, -38252, 9961, 46409, 49946, 48885, -5096, -1444, 1005, -36053, -30499, -29960, 5273, -18158, -102240, -127687, -89840, -85311, -53867, -63923, -36826, 24225, 33028, 62537, 22440, -33191, -66055, -98749, -116121]
15275a16121L540L5491R0062L0896M1358j0775l6425m1047Q79N1686Q1315K9900
15263A60759l8724o1297j6493k3796j1932p519o0987N6157M9716K3284j7985n6968
15251e785o3170N2923J01330m6945q1668j4618O8890P643N9042P746l5134j5715
15239C4539j289p005p001J5921K2497L8950n6227n1885k3483O924p5336m236L1056
15226g6575N6165O51n336L4053p016O2464J5675j7878J5260k5494q9535q3205
15214a20771M2084M8014l9318K8769J5737k1032q998J8340L763L2138k048M7562
15202D4240l5674K9384j4567j7405L013k6676m2639l1476K6644q748J0091K1579
15190d2234K7491J3130l0873M267M2441L8891K189m3698m4762k976K9746k5525
$$ y = [-116121, -112581, -77090, 12972, 43868, 85226, 74451, 38026, -3021, -2142, 49544, 130859, 160759, 122035, 60738, 44245, 20449, 8517, 998, -59989, -3832, 45884, 69168, 51183, -5785, -68955, -16032, 85298, 38353, -43315, -57933, 10957, 18600, 77642, 85388, 50254, 34539, 33250, 26245, 19244, 35165, 57662, 96612, 40385, -11500, -34983, -28059, -103395, -107631, -76575, -20410, -19759, -25095, 8958, 1942, 64406, 80081, 62203, 77463, 51969, -37566, -120771, -78687, -30673, -69991, -41222, -25485, -46517, -55515, -37175, -33412, -1274, -3322, 44240, 8566, 37950, 23383, 5978, 8991, -17685, -60324, -91800, -65156, -73904, -63813, -42234, -14743, -1613, -32486, -28219, 14222, 53113, 55302, 11604, -33158, -36134, -6388, -31913]
15178c1913l7974N5389J6159j3106k6352K2691r057l9545k0065K8282K3855Q744
15166b2892L3602M702k3755l2841K3677L4783P51J5141J5828m992n028o187k6333
15153F456Q594q5836l0385j6701O3709J5834n668j8675Q791k002J2608J5619q11
15140b8467j5155o4124M3823N6781Q799M677K0239M4767J3359O981K408j9554
15128G4534k0114l7122k5357k0321j222j9199o1872M0003J3093k6427K4704N0033
15116i267m3490R470M6974M0013K2824k9863j8601l3400K3151J1881J8138K0763
15104E8593k0011n8510j0413m522K2308J6369K3081j8491j7340K0163L0064k132
15092C9159L2928k1499j1144r186m6456p614K8884K6841p2417j4997K4331N398
$$ y = [-31913, -69887, -14498, 1661, -11445, -37797, -15106, -24163, -63708, -83773, -55491, -31636, -22892, 10710, 15412, -8343, -41184, -17507, 17276, 18027, 33168, 48996, 44004, 38976, 32789, 6456, 15050, -70786, -101171, -117872, -54163, -38329, -43997, -62672, -53881, -55883, -43275, -27656, -28467, -43622, -107746, -63923, -7142, 1657, 6334, 26573, 71340, 84699, 91680, 94088, 74534, 54420, 17298, -8059, -28380, -29602, -48801, -110673, -70670, -57577, -84004, -59300, -9267, -52757, -43287, 3687, 43700, 66524, 36661, 18060, -15340, 7811, 19692, 37830, 58593, 38582, -19928, -30341, -34863, -12555, 3814, 26895, 8404, -8936, 11227, 41291, 39159, 72087, 50588, 39444, 30258, -16198, -23812, 5072, 31913, -40504, -55501, -31170, -25772]
15080b5772J9062l8788r033J0386M0156j4745n4895k8326q997L883j6288o592
15068a29949O6464L9695L2547k3146m8122J909K6227N2502j6619l5008j87j934
15056c5621l5617p214J0585J4272J8868J4278J7240j8900J9998M586K2117j6478
15044H114o460Q313l4452m163n019j5564L9354K482l552n501n3894J9193k9959
15031h1108k2713M7383p179J7794R2928M0980k1884p8447j0669L3672M5053O3949
15019A19759q0045o3310r79m0360l6698K4481O3540M2184J1647m8919Q366J2493
15007A2159o3142n1655l322L5165M9843j998j3050J3624K3238M7363J4555R759
14995G2539R443l6871o2581Q915J1220j9595L6305M4203l0428j17076l3909J4114
$$ y = [-25772, -6710, -45498, -54531, -44145, -3989, -18734, -73629, -101955, -110952, -107069, -123357, -129949, -63485, -23790, 8757, -14389, -62511, -60602, -34375, 18127, 1508, -33500, -33687, -35621, -71238, -78452, -67867, -53595, -34727, -20449, -3209, -22109, -2111, 2475, 24592, 8114, 1654, 9967, -24485, -28648, -33667, -49231, -9877, -7395, -10947, -16448, -70342, -51149, -81108, -103821, -56438, -63617, -45823, 47105, 88085, 66201, -12246, -22915, 10757, 55810, 119759, 39714, -23596, -24575, -64935, -101633, -77152, -13612, 28572, 40219, -8700, -334, 12159, -50983, -102638, -105960, -70795, -20952, -22950, -36000, -22376, 862, 48225, 62780, 72539, 81982, 45111, -17470, -8555, 2665, -16930, 19375, 63578, 33150, -83926, -117835, -103721]
14983a03721J3480M8126l5323n4968M7813M9587K3013m7512J1482L6367L2594
14972B0938K2761J5162j2568o1883M852J2453k4545O6270k1079K51r981k1151
14960h520l4187p014O2764J8695k9713L00L4069P9242O502K4552j184k4812q2760
14947C7934q7416J4680J3366J7567J0946k4684O115K6701J7336j6243m0992j9104
14935d3794j1249j2303K5834k5534r186Q530K0513M8082K6176K2171j296N372
14923E3316O8871n5652l0646L9686M3354m5570m5008J701m3081j3491J3593l3963
14911d6890m8538P3398j0631o340l6705L5692K4259L0415O4827l7707m7868K6414
14899B0326k2477k8095q552p97J8453K2094K0154k0737J1747N2490K5729l8194
$$ y = [-103721, -90241, -42115, -77438, -132406, -84593, -35006, -11993, -59505, -48023, -11656, 20938, 43699, 58861, 46293, -15590, -10738, 1715, -22830, 43440, 22361, 22612, 12631, -8520, -42707, -49721, 13043, 31738, 2025, 2325, 36394, 115636, 122138, 146690, 145506, 120694, 37934, -49482, -34802, -21436, -3869, 7077, -17607, -11492, 15209, 32545, 16302, -24690, -43794, -55043, -67346, -41512, -67046, -76232, -67702, -47189, 893, 27069, 49240, 47944, 53316, 122187, 66535, 35889, 75575, 118929, 73359, 28351, 30052, -13029, -26520, -12927, -46890, -95428, -22030, -32661, -39001, -75706, -40014, -15755, 14660, 79487, 41780, -6088, 20326, -2151, -30246, -38798, -39595, -21142, 952, 21106, 369, 12116, 64606, 90335, 52141]
14887E2141k3342k6465j8906k0526O4094J9110o0665j291j2976K6012k2429n5115
14875h0358J0926K4559K316n8965q000N5621J8027L5765k5920k5561p4533N699
14863a20424K9852O1762j6038L8985n699K8067N1920q4345m3621J6616J4377l3965
14851f2513j9457P6038N4634l7893j8327J9457k5116m6122j9398M2444m0553l6175
14839a12981Q3656M3585l3779l9487m7841K6462O0404N9504p4468r3359L3831
14828i4473J2823m3301k4910k5329N5114J01297p561o007L2668k2911q2535K6725
14816g8400O8396j0753J0000j494m723N0238J9134l8888l8134k0233L928K8219
14804a2710j9001k4658K0230N436M308o8823M1233L078L0064O292Q835K3243J7390
$$ y = [52141, 28799, 2334, -16572, -37098, 26996, 46106, -14559, -15850, -28826, -2814, -25243, -80358, -69432, -44873, -42557, -101522, -109522, -53901, -35874, -109, -26029, -51590, -126123, -120424, -90572, -28810, -44848, -5863, -11562, 16505, 68425, -15920, -59541, -42925, -28548, -62513, -81970, -5932, 48702, 10809, -7518, 11939, -13177, -59299, -78697, -36253, -76806, -112981, -29325, 14260, -19519, -59006, -106847, -80385, -19981, 39523, -34945, -128304, -94473, -81650, -124951, -149861, -175190, -120076, -18779, -26340, -32347, 321, -22590, -105125, -78400, -10004, -20757, -10757, -12251, -16974, 33264, 52398, 13510, -24624, -44857, -40929, -12710, -31711, -56369, -36139, -30703, -26395, -95218, -53985, -50907, -20843, -14551, -5716, 17527, 34917]
14791C4917j1998K6459j6677k9466o7565r69L1750R270N5541M4000l1369j13262
14779f9369l2971P7202j6513l4155L9111k7339m16M6767N8461L2122j2678n9657
14767E65n0464K1780K2623n229K1175J8383j3881n0207K669P2018o2337O241K4598
14754G934n471Q16J4153m0185k4019R823K1295K1840M6658l8933j6295J8821N361
14741B1798n0618J6277J6469j461k941O294k7111J1122m0937k4913J3843l2555
14729i4733J3576L2959J0339J1291L35L4272k9561l3261k7568j3913M4713n1930
14717a03481J8329K4927K742K5400j2586q548k2204m606K6124R9700o2733p4130
14705i1066P5574j309m3628N0360L0010m3286k4636L3565M6247n9220l0842P6090
$$ y = [34917, 22919, 49378, 32701, 3235, -64330, -65299, -33549, -24279, 31262, 75262, 43893, -69369, -102340, -25138, -41651, -75806, -36695, -64034, -64450, -17683, 40778, 72900, 60222, 565, -49899, -28119, -5496, -10725, 10450, 28833, 14952, -35255, -32586, 39432, -22905, -16664, 7934, 2463, 3279, 17432, -22753, -46772, -36949, -15654, 6186, 52844, 13911, -2384, 16437, 21798, -28820, -12543, 3926, 2465, -476, 5818, -21293, -10171, -51108, -76021, -62178, -94733, -81157, -48198, -37859, -26568, -26233, 8039, -21522, -54783, -82351, -96264, -51551, -103481, -85152, -60225, -57483, -32083, -44669, -53217, -75421, -80027, -53903, 45797, -16936, -91066, -15492, -16801, -60429, -10069, 19941, -23345, -47981, -14416, 31831, -27389, -58231, 17859]
14693A7859O8084j757N388j4512m425o1l0337n5976o3195Q385l851n305K6534
14680e3169J8815O449o812L5438K8419Q0094n998p8110k2953J488o407M7441N5639
14667A00334J0164N822l4913L5158o7111j2159M6093o22m5073m1932O7428J8517
14655H1706q560k2329J3428O6234P1778p9958n2040l196m761n0971o9941j4371
14643g2981J2420P78o462j6516j4406J0653K3772K0241l683p474j8094n1095k2816
14630a45663N8311K0874j953k2656K7306L262k9470J4352O0803P8121M9452l5977
14618G6762p0511m3200k6131K0130J2929m1081l0652L7486J7461N8538l0670k3922
14606d2861J8681l147l2988M7818k6512J2910M3798M0957n2445m4995N3628L4524
$$ y = [17859, 85943, 84186, 89574, 75062, 70637, 70576, 40239, -15737, -78932, -70547, -74398, -79703, -53169, -34354, -27905, -34717, 721, 29140, 109234, 103236, 25126, 2173, 3661, -2746, 44695, 100334, 110498, 116320, 81407, 116565, 49454, 37295, 83388, 82766, 37693, -4239, 63189, 81706, 73146, 50817, 64245, 130479, 202257, 122299, 70259, 67063, 62302, 11331, -58610, -72981, -60561, -59783, -66245, -82761, -97167, -86514, -62742, -42501, -46184, -53658, -71752, -122847, -145663, -87352, -66478, -68431, -91087, -63781, -60519, -89989, -75637, -14834, 63287, 112739, 76762, 6251, -36949, -63080, -42950, -30021, -71102, -101754, -64268, -46807, 11731, -18939, -42861, -24180, -27327, -60315, -12497, -39009, -26099, 17699, 58656, 6211, -38784, 14844, 49368]
14594D9368k3809j1511j5079j8975L3492k6959k4320o0729n5109K4308M0259L4907
14582e4157L8415l7509K5029Q6054r738r2427J3845L5477J9642Q9715J9600q708
14570A25238p1818j6390J6899M4859l1358o6257l1148J3874j4831p627K5797q025
14558b0787m4976l2852N0840L7876j346m4737M442M7833m92K4397j0076p7403
14546f7281n711k3901k1947J7123M2507K3196Q267J0751J7982n667k3091l6885
14534f4657j2008K9M9171K7724J2800l1699j2668R5579K9070k2400n556m2005
14522B3380k6916K5259k987q1814n6838J0771j3400M6118L5832m182m357J3465
14510c5669L0878K6643n4387m695j3787J5122j9977J3351K4625J4103p02k4723
$$ y = [49368, 25559, 14048, -1031, -20006, 13486, -13473, -37793, -98522, -153631, -129323, -89064, -54157, -15742, -53251, -28222, 57832, 48094, -44333, -30488, 4989, 24631, 114346, 133946, 125238, 53420, 37030, 53929, 98788, 67430, 1173, -29975, -16101, -30932, -38559, -12762, -20787, -65763, -98615, -47775, -9899, -11245, -55982, -51540, -3707, -4199, 20198, 10122, -67281, -72992, -96893, -118840, -101717, -59210, -36014, -27747, -16996, 986, -4681, -27772, -64657, -76665, -76636, -27465, 259, 13059, -18640, -31308, 64271, 93341, 70941, 65385, 23380, -3536, 21723, 18736, -63078, -119916, -109145, -122545, -76427, -40595, -44777, -49134, -35669, -4791, 21852, -32535, -37230, -51017, -35895, -55872, -42521, -17896, -3793, -4495, -29218]
14498b9218P394N2682J6899l0794J3202j4481m3590n6862k479N7247K1253L392
14486e355j9142o6095m1312M8302L5100K792M3288P353K0738j2458q191n07K2014
14473B6527J2319k4819k6809o4686o5305K3629O3388M4497O0428M2774j2457q732
14461G0754j4885m4385j8850q390j6247L5267L8610M0418j0378k4449m370m8370
14449e275q1056j0481j8073O351K7580O0118J292k4189l1355k1846J2693L2377
14437e1864l2266L0094k684L2520M1030O531k039k8644j2000N03O0408l5903n2340
14424d6654R547M167N1700k7320n9485j4804O7272N7437J8373p7006m0318O6067
14412H976l1893n1542k0699M1273M5190l3252K474M930J8630k5747M871K2445
$$ y = [-29218, -21824, 30858, 47757, 16963, 30165, 15684, -27906, -84768, -87247, -30000, -8747, -5355, -24497, -90592, -131904, -83602, -48502, -45710, -2422, 4931, 25669, 13211, 5020, 4513, 26527, 38846, 14027, -12782, -77468, -142773, -119144, -55756, -11259, 49169, 91943, 79486, 70754, 55869, 11484, -7366, -15756, -32003, 3264, 41874, 82292, 71914, 47465, 43095, -5275, -86331, -96812, -114885, -108534, -80954, -20836, -19544, -43733, -75088, -96934, -84241, -51864, -84130, -54036, -56720, -24200, 16830, 23361, 21322, -7322, -19322, -18819, 41589, 5686, -46654, -37107, -32940, 18760, -8560, -68045, -82849, -15577, 41860, 60233, -16773, -57091, 8976, -22917, -74459, -95158, -53885, -8695, -41947, -39473, -34543, -15913, -41660, -36789, -14344]
14400a4344O6711J9249l6025l5395j7128q790J6845l6033L8568K7414j6982l822
14388B68l7436P69K2328O1052p496k6416j0858j1846o3114p8617L7862R7780k857
14375a8581P6581N603o8834J9O471M0309N2546K6449j3160L5307L6804m310j8130
14362A57074Q488k7489k4700j3630q788J1219m4748m872K5475j7402M0789l783
14350I7633k7535P3120j1650r5658j01023j05328L8671L7970M0854M130l3212
14339h2028k185L3827p527n5459J5544J8460J4374K1220N9591J736o0553j06656
14327a49656M7924R2614J494k9602J2118r539q764J2346M4864l780J5922K2221
14315D8162l7896j6268N6197K4982j5864j6509J5728l3570m9623m5538m1696J452
$$ y = [-14344, 52367, 71616, 35591, 196, -16932, -25722, -8877, -44910, -6342, 21072, 4090, 268, -37168, -36399, -14071, 46981, 39485, 13069, 2211, -9635, -72749, -151366, -113504, -15724, -18581, 58000, 63603, -5231, -5212, 1259, 41568, 94114, 120563, 107403, 142710, 179514, 175204, 157074, 165562, 138073, 113373, 99743, 90955, 102174, 57426, 52554, 78029, 60627, 101416, 97633, 70098, 143218, 131568, 35910, -65113, -170441, -131770, -93800, -52946, -48816, -82028, -84213, -50386, -57913, -113372, -97828, -79368, -64994, -43774, 15817, 17553, -43000, -149656, -101732, -9118, -7624, -37226, -25108, -34647, -43411, -31065, 13799, 10019, 25941, 48162, 10266, -6002, 50195, 75177, 59313, 42804, 58532, 24962, -24661, -70199, -111895, -110443]
14303a10443N9493Q3915J2983j0089K5426K5269l0990k3924o377j4852j7274n5307
14291f2170l5410N6062N9158l3687l3898J5181J4520j4027l9485r25Q81L8720
14279c5080j3474k7534J07914M5775l3894q0808m359M3322R603J4891m1461j0219
14267b5324L6913J9538r684n9258l0276k3781j7672J9975M8162M4720J5152O7900
14255H6365n3790n7671J7445j2007P61k959L5295r201m4092m4239N6675M6336
14243A8918j3858L54J5943P589l3401k8046J5633k1158K6402j6202j2567p3824
14231a14217k4089N2299L9433k2653K7038J167l5974M0252J4331M6945q206O17
14219A6943k5279K9487j1284k3038k9821k8241L5848L5469R100k4410K487P526
$$ y = [-110443, -50950, 32965, 45948, 35859, 61285, 86554, 55564, 31640, 25263, 10411, -6863, -62170, -97580, -41518, 17640, -16047, -49945, -34764, -20244, -34271, -73756, -74681, -73800, -35080, -48554, -76088, 31826, 77601, 43707, -37101, -41460, 1862, 11465, 26356, -15105, -25324, 11589, 31127, 21443, -37815, -68091, -91872, -109544, -89569, -41407, 3313, 18465, 86365, 32575, -25096, -7651, -19658, -18897, -21856, 13439, 4238, -39854, -84093, -27418, 18918, 5060, 5414, 21357, 28946, -4455, -32501, -16868, -38026, -11624, -27826, -40393, -114217, -138306, -86007, -46574, -69227, -42189, -41022, -76996, -36744, -22413, 24532, 16326, 16943, -8336, 21151, 9867, -13171, -42992, -71233, -35385, 84, 9184, -15226, -12739, -5213]
14207e213K2469r997M566N5207K432N509o1705m6919j7607M4367J8354m7917p2418
14194a08872N1477L9132K9226M4167l3964m1645L699L5160O116M2627k3940j1134
14182C2049L843j6443m0040j1269L2791R762K2554J5237j4330k26o0525j4089
14170d0686M8334L0198j7722L0860J02723O9604j4823q4136k5712m051J1143p973
14158I7759k4485k0820M2244M1931p3267J6644L7512K2091M2931M870m9548o390
14146A31472l2674j821r799J0693m1327L412L1840p334J16Q4165O0979l3213J4825
14133B11334m4627n0966L5732P3291L758L0406k3993Q0931P2644L5513R0039J14329
14121F28391K21644K52743L17549M07116N39528O70527O32893N16557M89939M33942
$$ y = [-5213, 17256, 7259, 11825, 67032, 69464, 74973, 13268, -33651, -51258, -6891, 11463, -36454, -108872, -57395, -18263, 10963, 55130, 21166, -20479, -16780, 18380, 24496, 67123, 43183, 32049, 35892, 19449, -20591, -31860, 931, 10693, 33247, 48484, 34154, 33928, -26597, -40686, 7648, 37846, 20124, 50984, 153707, 223311, 208488, 124352, 98640, 94589, 105732, 97759, 73274, 52454, 94698, 136629, 63362, 80006, 117518, 139609, 182540, 187410, 137862, 131472, 98798, 96977, 87178, 97871, 56544, 59956, 91796, 84462, 84578, 168743, 229722, 196509, 211334, 166707, 115741, 151473, 224764, 228522, 258928, 234935, 315866, 388510, 424023, 514062, 628391, 850035, 1102778, 1420327, 1827443, 2366971, 3037498, 3670391, 4186948, 4676887, 5110829]
14111E110829K00673r1241k34392l71008n02280n09246n15325n21286m37750l95847
14101A733127k95962j57869j38278j36868p5925J2261o5426j17577j03069q2980
14091E71434j6260m5193j1630N526k2358n4922n0424k4112m8753m4083J2844J9673
14079B91742J7181J613j6475m4638o3819l6377N3287M7599n3244p0558l1880M7608
14067A42039L3819k3161j8084N9344Q0394n9914q9142K8973n113K9760O2614m6252
14055A95277o5814n4350m8178K0717L5208p801j5901O1226P200M8961l6635J1810
14043A51720N7168l7611k5997M093j6131l4643k8677m3936l615m701n8669M284
14031c6715m1459m0700O5344M2395K1731Q40J6533R165l9715k8854k4425N947
$$ y = [5110829, 5311502, 5220261, 4985869, 4614861, 4112581, 3603335, 3088010, 2566724, 2128974, 1733127, 1437165, 1279296, 1141018, 1004150, 928225, 940486, 875060, 757483, 654414, 571434, 555174, 509981, 498351, 503877, 481519, 426597, 376173, 352061, 303308, 259225, 272069, 291742, 308923, 310536, 294061, 249423, 185604, 149227, 202514, 250113, 196869, 126311, 94431, 142039, 175858, 152697, 134613, 193957, 274351, 214437, 125295, 154268, 149155, 178915, 241529, 195277, 129463, 75113, 26935, 47652, 82860, 75059, 59158, 120384, 127584, 176545, 139910, 151720, 208888, 171277, 145280, 149373, 133242, 98599, 69922, 25986, 22371, 17670, -40999, -36715, -78174, -118874, -53530, -11135, 10596, 11436, 27969, 37134, -2581, -31435, -55860, -49913]
14019d9913K7932n016J5637l269k9261k3051R940L1336K1605L938P322K3812O8115
14006I9127M297r7095j050N4615J1849Q07n1474j0282N1453p98j2303L6200k7155
13993E8191l9796K146J6224r4561j7531K3895O1984k1828k7600K2955M8673J225
13981C3977N4510m3181o1213j3907O0009Q760p383l4651m2273m1087K9584k2008
13969g8863m465M2637J24114Q1026p0380l4164P409j9487o2392k0209m733O0733
13957B1226J659j838j8592m935K0343P7551K6732J4772k8650j1001L9184L7323
13945A73774M5424Q369K1631n7549m2711p0781k1627J7354N6364q189j06696m562
13933A0801k0694L4633k099n3953j6097m972k4498R5182O1342Q050m5635L4004
$$ y = [-49913, -21981, -26997, -11360, -14629, -43890, -66941, -57001, -25665, -4060, -122, 7200, 31012, 99127, 103424, 6329, 5279, 59894, 71743, 72550, 21076, 10794, 62247, 61449, 49146, 85346, 58191, 18395, 20541, 36765, -57796, -75327, -51432, 10552, -11276, -38876, -15921, 32752, 33977, 88487, 45306, -15907, -29814, 30195, 38955, 31572, -3079, -45352, -86439, -56855, -78863, -83328, -40691, 83423, 164449, 94069, 59905, 67314, 47827, -14565, -34774, -39507, 21226, 22885, 21047, 2455, -2480, 17863, 95414, 122146, 136918, 108268, 97267, 136451, 173774, 219198, 227567, 249198, 191649, 148938, 78157, 56530, 73884, 130248, 122059, 15363, 10801, -9893, 24740, 22641, -31312, -47409, -52381, -76879, 18303, 79645, 87695, 42060, 76064]
13921G6064k90l0742l3770k1425j6806p326r015M0771L5871K4249m712j1857k4063
13908A6949N62j6574N9517n2304j4200L1686l6045J1278r466r804l908L1605J3512
13895B2808R048O4660n2775q2415J0629K8703K7812k997l2821l4093L8128k6953
13883c0266K0684o685M0898K3288r6560n8746K6124L3660K2504M2073J1300n216
13871B3058K2306q760j39296l0555P1241N3647L0224l3582k6436M2816m460J9901
13859B0104K7903p9203L4989J8733k079M5132m3999l2446m0678o3146M6718P2063
13847D091P6714O788j9504m1935k4279n866n042r127j2185L7944r393k4502k5569
13834e1865M0182Q1825m8728j6858L9941O901N297k3829n1148l429N8198m1192
$$ y = [76064, 75774, 45032, 11262, -10163, -26969, -34295, -43310, -2539, 33332, 57581, 52869, 41012, 16949, 17511, 937, 60454, 8150, -6050, 25636, -10409, 869, -8597, -18401, -22309, 9296, 22808, 31856, 96516, 43741, -38674, -28045, 658, 28470, 25473, -7348, -41441, -3313, -30266, -9582, -16267, 24631, 47919, -48641, -107387, -81263, -47603, -25099, 16974, 28274, 23058, 45364, 36604, -102692, -133247, -62006, -8359, 21865, -11717, -38153, 4663, 203, 20104, 48007, -31196, 3793, 22526, 20447, 65579, 21580, -10866, -51544, -114690, -67972, 4091, 80805, 87593, 68089, 26154, 1875, -3991, -9033, -18160, -30345, 7599, -1794, -26296, -51865, -11683, 70142, 21414, 4556, 44497, 51398, 56695, 32866, -18282, -21711, 36487, -4705]
13822d705j6068N9572N2280K0590m8793M629J7117M3728l6342Q097J6634J19j9785
13809I7073m2675J6868N354o777J8742k9347L1140o75m5338L6331R438p0462n4192
13796c4520o912K1960k539K0736M5780j7872L4678M0989q140q0677j8392J04286
13784I9377N2262n5147l1621l9473K0684P0657N3228n8554r8631L324J9360K2880
13772E8346p174j9448J9577K8873J1454R778m1999k2629m0007q022K2061n684
13760E126J2245l263R765k8302k266O080L5191M6071J7093k2884K442K5477j3108
13747H9667M631j2195K949N5951K2929n4898j5045j3231L7181O3616L4925L7313
13735B53793K9400P378p399n13O1317Q1790P8743M4545J1133P4784L8368J3582
$$ y = [-4705, -20773, 38799, 91079, 111669, 62876, 67505, 84622, 128350, 92008, 100105, 116739, 116858, 97073, 54398, 71266, 76620, 69843, 88585, 59238, 90378, 89703, 44365, 80696, 90134, 19672, -34520, -41432, -19472, -22011, -1275, 44505, 26633, 61311, 102300, 94160, 13483, -4909, 99377, 151639, 96492, 64871, 25398, 46082, 116739, 169967, 111413, 12782, 16106, 35466, 58346, 51172, 31724, 51301, 80174, 91628, 101406, 59407, 36778, -3229, -11251, 10810, 5126, 17371, 14108, 23873, -4429, -6695, -615, 34576, 80647, 97740, 74856, 77298, 102775, 89667, 94298, 82103, 85052, 141003, 163932, 109034, 93989, 80758, 117939, 181555, 216480, 253793, 283193, 290571, 283172, 282659, 343976, 425766, 504509, 549054, 560187, 634971, 673339, 686921]
13723F86921O862l1541l1101j9168L8024R726q4459q6696r689Q232m2461q3551
13711C61099j8301K5872L476J0110m1624n8368l632K1662o5363p8822r282L3135
13699A79962K1235O7527j6586k6602j681k1720O1071J301J708j0745R229L0930
13687B95629O7560P4319K9078m9018l7630J7771k9450n7597j8541n9234n3674
13676A79213n3224k9741M4501J7768o8342p170J7887o7350l6308j5236K8122L8449
13664D8569j8639n8775j2731K8989O4559j0161M4479j991k5146M5115Q12J1146
13652A16226k1965m2120r381l3783p50q067J7216j138J3407N2161M2527l5491
13640H8842r8424q875J2073n450L378K4460m495k2242Q0601l601m3015O69N925
$$ y = [686921, 693783, 662242, 631141, 611973, 649997, 659723, 575264, 488568, 478879, 487111, 444650, 361099, 342798, 368670, 372146, 382256, 340632, 282264, 278632, 300294, 234931, 156109, 146827, 179962, 201197, 268724, 252138, 225536, 223855, 202135, 263206, 264507, 266215, 255470, 264699, 295629, 363189, 437508, 466586, 417568, 379938, 397709, 368259, 310662, 292121, 232887, 179213, 125989, 96248, 140749, 158517, 90175, 83005, 100892, 33542, -2766, -18002, 10120, 48569, 29930, -28845, -41576, -12587, 51972, 41811, 86290, 84299, 59153, 104268, 105080, 116226, 94261, 52141, 42760, 8977, 8227, 160, 17376, 16238, 29645, 81806, 124333, 88842, -9582, -18457, -6384, -11834, -8456, 16004, 11509, -10733, 69868, 66267, 23252, 23921, 29846]
13627B9846L476j3915k9271l1501k6573Q55j2495L045N0889k0920O0379J465l7301
13614b2021j8027j0007K4696j654l7261m3318O4751M5919m6240Q491J5283J8421
13602i67L1021K0105k1324l9216k1902L0915N1336m3554r3824k2099O3773L0084
13590a5652J3938K9971K095n1747l6855j3856K6907K0381m102J4489O032K3294
13578A4895P7072j4802l9810m002J9105q476l4061n9598l7063j2443L3794r735
13566g5124k8831J01433M0204k1772J4817l1316O162P8972M719j6016k9973p1885
13554b8610m4599j2056K7042L2390M7541l1217q5901K2342L3758K191j1494J7968
13542c0645O8271K1503j7400N059n769p1614m2166L1562Q5662L9051j6406P8146
$$ y = [29846, 33322, 19407, -9864, -41365, -67938, -67083, -79578, -76533, -25644, -46564, 13815, 15280, -22021, -40048, -50055, -25359, -27013, -64274, -107592, -42841, 3078, -43162, -34671, -19388, -967, 30054, 50159, 28835, -10381, -32283, -1368, 49968, 6414, -87410, -109509, -45736, -15652, -1714, 28257, 30352, -21395, -58250, -72106, -45199, -24818, -28920, -14431, -8399, 14895, 91967, 77165, 37355, 33353, 52458, 43982, 9921, -49677, -86740, -99183, -65389, -75124, -103955, -2522, 37682, 15910, 30727, -589, 5573, 84545, 89264, 73248, 43275, -28610, -73209, -85265, -58223, -25833, 21708, -9509, -95410, -73068, -39310, -37119, -48613, -30645, 37626, 59129, 41729, 46788, 41019, -30595, -72761, -41199, 44463, 83514, 67108, 145254]
13530A45254k7361q8547j6204J8358j4762q853J9364O3485l4332p8839L4260R107
13518B0930M1393p702k0550K2600L4591m0611n2480K1442m5231j7581L1330L4810
13506B2941M2563Q368J0779k048l490k2450m454k1021k4330m249L0715J934j8094
13493A7164L9373P360k0108k9987k1835O253M4708o3124j8351J9937j00345J2927
13481a06028R4195K0754n7826k444N0909J2499m1474j9023K0406j3728p989O8199
13469A8450N5182j6107K7029m8893p6884j6249J2787J7534M546j4077L0020K0281
13457A3619j0823K9776J0706m1093n9211l4007j6979R1373R5389j5670J0899k3624
13445E0355p1845j5577K6224j1921r554n378O5037M5281J1051L1811K3312p0282
$$ y = [145254, 117893, 29346, 13142, 31500, 16738, 7885, 27249, 90734, 56402, -22437, 11823, 20930, 62323, 54621, 34071, 56671, 91262, 50651, -1829, 19613, -25618, -43199, -11869, 22941, 65504, 73872, 84651, 82603, 79113, 56663, 52209, 31188, 6858, 2609, 33324, 35258, 17164, 56537, 63897, 43789, 13802, -8033, -1780, 42928, -20196, -38547, -18610, -118955, -106028, -11833, 8921, -48905, -51349, -440, 12059, -29415, -48438, -28032, -41760, -49749, 18450, 73632, 57525, 84554, 35661, -41223, -57472, -44685, -27151, -22605, -36682, -6662, 13619, 2796, 32572, 43278, 2185, -57026, -91033, -108012, -16639, 78750, 63080, 73979, 50355, -21490, -37067, -10843, -22764, -32318, -37696, 27341, 72622, 83673, 115484, 138796, 68514]
13433F8514q2229o7832M2736K1468O4732M1885l321K0147m2577l1628J6887L0049
13421G8831L6931r468o8681k2814k1069M313N4413j2182n2118P465O3302P3086
13409A32009K0038l2207k8795N2381j6929j29864n9875l276K4316M5954K4891
13398B8643K9118L3222P592K3300p0887l6289L4913r521j4068k1411k418R521
13386A1715k8016L9763L6060m7743L8287p556M280o7512l4887P4420M1991p234
13374E3568n4060K3645N6345Q8381k6145r0476o1100m3704J5088K8340M4298j9310
13362A4870j5723P331J3947K0669M2333R437j3035l5780k8842q079o760J5261
13350A5629P1767J0316j3069l0653m5225M5544p722j0838P0727L074j8362n3184
$$ y = [68514, -13715, -81547, -38811, -17343, 47389, 89274, 85953, 106100, 63523, 31895, 48782, 78831, 115762, 106294, 37613, 14799, -6270, -1957, 52456, 40274, -11844, -4379, 58923, 132009, 152047, 119840, 91045, 143426, 126497, -3367, -63242, -66518, -42202, 3752, 28643, 57761, 90983, 98575, 121875, 50988, 14699, 49612, 40091, 26023, 4612, 2194, 11715, -16301, 23462, 59522, 11779, 50066, 42510, 46790, -20722, -55609, 18811, 60802, 53568, -492, 23153, 79498, 167879, 141734, 51258, -9842, -53546, -38458, -10118, 34180, 14870, -853, 6478, 20425, 41094, 83427, 92864, 79829, 44049, 15207, 7128, 368, 15629, 87396, 97712, 84643, 53990, 8765, 54309, 46587, 35749, 106476, 109550, 91188, 38004]
13338C8004J6812J5720k4673K3804M9443l6437j08705j9704J5296P0010N0546
13327I0116l3142k3444J1984j5466l4087j127L6230L8914m6932j0115k7662l6284
13315e1015k4994k2104j7239K4653J9848P0932M8549r0346j345m419N5737N3159
13303F1416K0062l3824o3042k716j92O835M4473M3745m5505k0628j5660j4924
13291a9960J0975L6827N5917l498l9964k7019l2663k8153J3720k6367k8125O1585
13279b6725O7634Q0832K1878J6415j2127P619r7626n5705L819p729l7718Q0254
13267D0821R8700M4393k825K3851l16l5969l9658M0096M900j6595Q8125Q1991
13255C27514J7132N5518J27465R3878J58104J76420J81066K13425J46695Q3814
$$ y = [38004, 54816, 70536, 45863, 69667, 119110, 82673, -26032, -45736, -30440, 39570, 90116, 56974, 33530, 45514, 30048, -4039, -5166, 31064, 69978, 23046, 12931, -14731, -51015, -76009, -98113, -115352, -90699, -70851, 81, 48630, -41716, -43061, -47480, 8257, 61416, 81478, 47654, -15388, -18104, -18296, -11461, 33012, 76757, 31252, 10624, -5036, -19960, -8985, 27842, 83759, 80261, 40297, 13278, -19385, -47538, -33818, -60185, -88310, -26725, 40909, 121741, 143619, 160034, 147907, 155526, 57900, 2195, 6014, -1715, -39433, 40821, 139521, 183914, 181089, 204940, 204624, 168655, 128997, 169093, 173993, 157398, 245523, 327514, 344646, 400164, 527629, 621507, 779611, 956031, 1137097, 1350522, 1497217, 1581031]
13245A581031N1459m782m0207n8397q3376j45482j84039k27627k17146q3148m9067
13234E39219l5882m7164q6253k6827K8032k0326p0480L167K5529m2416o6686p1182
13222A28731J19n6509k772N8869N2995l124m825J1124m4966p0390K3136N4588
13210A46976L9094n2110J1946k401m2562q75J7185n4092m8955k9067k6027J7404
13198b3484o053o408l1282K6076L8506L0723L0133K2862k553L7178P5884k9076
13186A62506j10752K6511M5728K3733m0210o6021J9236J9579j0918j5863P3453
13175A26982R56p1779M7790k7632j7636k7020l9972N566J8553K0247K9598J2738
13163G8391J3442o7112k2875j6070L283R370k3844j1432j1291j8445K1636O7566
$$ y = [1581031, 1632490, 1627708, 1587501, 1529104, 1445728, 1300246, 1116207, 888580, 671434, 588286, 539219, 503337, 456173, 369920, 343093, 371125, 350799, 280319, 283486, 309015, 266599, 199913, 128731, 128850, 72341, 69569, 128438, 181433, 178309, 173484, 184608, 139642, 69252, 92388, 146976, 186070, 133960, 145906, 143505, 100943, 100068, 117253, 63161, 14206, -14861, -40888, -23484, -29537, -35945, -67227, -41151, -2645, 28078, 58211, 81073, 78520, 115698, 191582, 162506, 51754, 78265, 123993, 147726, 107516, 41495, 60731, 80310, 69392, 53529, 126982, 127938, 56159, 103949, 76317, 58681, 31661, -8311, -2745, 15808, 36055, 65653, 78391, 91833, 24721, 1846, -14224, -10941, -1571, -25415, -36847, -48138, -66583, -44947, 22619]
13151B2619K810J3003m2814J231K476j3575M6809J130n3092o0745K7162L1261
13139b1725L5938O563K518L6712J4815m0409K4600K9206p8842m1155K0929K3289
13127A2439M4006M2665K0796o266r27l6488k4610K4045l2075l4951n2516K7614
13115a6268j04m7082k2829J0474j5537M3359M4519L9950N965k5875P857p3948
13103d9519j7499K6460J03815p671j5368R507p7920m1409O5945J21817m0458r3485
13091a5785N725K7042j4502m7296l0395k0566K7936R1750J3266k9963L0079K1918
13079E9209J5961M861N606M0085M0143j6799L463K0035J7706l3117q0606J5255
13067I1802Q1742K183q0588n7687K7317R515M2355j3865k8708j01623M209p024
$$ y = [22619, 25429, 38432, -4382, -3151, -675, -14250, 32559, 33689, -19403, -80148, -52986, -21725, 14213, 20776, 23294, 60006, 74821, 34412, 59012, 88218, 9376, -31779, -10850, 12439, 56445, 99110, 119906, 113640, 112713, 76225, 51615, 75660, 43585, 8634, -43882, -16268, -16372, -63454, -86283, -75809, -91346, -47987, -3468, 36482, 42447, 16572, 24429, -49519, -67018, -40558, 63257, 55586, 40218, 49725, -28195, -69604, -3659, 118158, 77700, -15785, -10060, 16982, 2480, -44816, -75211, -95777, -67841, 23909, 37175, 7212, 37291, 59209, 75170, 80031, 85637, 125722, 165865, 149066, 152529, 172564, 190270, 157153, 76547, 91802, 173544, 175727, 95139, 37452, 64769, 74284, 116639, 102774, 74066, -27557, -23348, -30372]
13055c0372j0061O4435O8137K4649J8167j0817p7589K1127N0720m5018k9940P917
13043E1355m2474m6204l1046J4847O7309k4882k2275M2852O9792K4623p5107J1037
13031C9827L6081k6115n8051k2020K2807L9505L4153k3446M2782K8942m5292k3769
13019D5404K6905k8176o0521j2619N593o6701r9864k433J6198o6772k3716Q1184
13007a85518J8228p977J4768J421L2387l6432Q963N4423K8698N5722J7381Q575
12995A0639M8016J96j6790p2477J1708K8323J6516L3711Q857p0738J0591l2686
12983b4134L192M1800k2773J2062M9880m7861r263L9104K2306p913k9261J6320
12971D3459k790N889q380Q4009R3312K2222J5290j606k3207n2994j2717k8813
$$ y = [-30372, -40433, 24002, 92139, 116788, 134955, 124138, 46549, 67676, 118396, 73378, 43438, 51355, 8881, -37323, -68369, -53522, 13787, -11095, -33370, 9482, 79274, 103897, 28790, 39827, 75908, 49793, -8258, -30278, -7471, 32034, 66187, 42741, 85523, 114465, 69173, 45404, 72309, 44133, -16388, -29007, -23414, -90115, -189979, -192412, -176214, -242986, -266702, -185518, -167290, -175267, -160499, -159078, -126691, -163123, -154160, -99737, -71039, -15317, 2064, 10639, 58655, 58851, 42061, -30416, -18708, 9615, 26131, 59842, 68699, -2039, 8552, -24134, -20942, 20858, -1915, 10147, 60027, 12166, 2903, 42007, 64313, 56400, 27139, 43459, 40669, 46558, 38178, 122187, 215499, 237721, 253011, 251405, 228198, 175204, 162487, 133674]
12959A33674J22766N9432l0558J07670l883n566O2957Q8060J04981Q0753k902
12948G17384n0233k704R7664M4092K8202j5614l7970k8707l4452N138m8895M3306
12936G17211r418n5061L7167M1501K8794n3801O8234p640l3851P6253m2422M586
12924G71553J9305r097k0743o0159j1150J26m3944L8248m9750p6452n5660N9306
12912E61583l825j1569K2344j4534q629j1623R8706j1586M3915N2563K1149k1178
12900G17316k4286M2115K0290M3053P0836O5512l5687L1246L0929M1561K6176
12889A029061L281j0996O9193L405J9614L1118o134L5093Q7490N1086N3860L6698
12877A402769J17723J27690R0637O6705R7251K22575J62631J70545L14971L29187
$$ y = [133674, 256440, 315872, 285314, 392984, 389101, 383535, 446492, 534552, 639533, 720286, 717384, 667151, 664447, 762111, 806203, 834405, 818791, 780821, 752114, 717662, 722800, 673905, 717211, 707793, 652732, 689899, 731400, 760194, 706393, 774627, 766987, 733136, 809389, 766967, 771553, 790858, 781761, 761018, 700859, 689709, 689835, 645891, 684139, 634389, 557937, 502277, 561583, 557758, 546189, 568533, 553999, 545370, 533747, 632453, 620867, 664782, 717345, 738494, 717316, 693030, 735145, 755435, 798488, 869324, 934836, 899149, 930395, 961324, 1002885, 1029061, 1032342, 1021346, 1090539, 1093944, 1113558, 1144676, 1138542, 1173635, 1261125, 1312211, 1366071, 1402769, 1520492, 1648182, 1738819, 1805524, 1902775, 2125350, 2287981, 2458526, 2773497, 3102684]
12867C102684L29818M26810N14503N74512O03782O47373N97625N13698L66505
12858G677310J14917K1684n2945j85026k45631j76869l4222M7943J07260J93628
12848G468049M04459N24632O23189Q16063R12027J189760J399532J549375J816675
12839A6703761K162280K424581K683240L039316L529533M263598N409077P442786
12831D7658172J0586426J4943446J9974115K5063524K9989222L4102358L5633122
12824B17950385L3690984K9184776K2481054J2920593J022138j0004303j8942226
12817B88303401k5717946l0464430l1985013l0096043k6490576k2486836j7996479
12810A03066078j3274085r680516p447513n998270n007846m483727m185007l965967
$$ y = [3102684, 3432502, 3859312, 4373815, 4948327, 5552109, 6199482, 6797107, 7310805, 7677310, 7792227, 7813911, 7760966, 7575940, 7330309, 7153440, 7119218, 7167161, 7274421, 7468049, 7872508, 8397140, 9020329, 9836392, 10748419, 11938179, 13337711, 14887086, 16703761, 18866041, 21290622, 23973862, 27013178, 30542711, 34806309, 40215386, 47658172, 58244598, 73188044, 93162159, 118225683, 148214905, 182317263, 217950385, 251641369, 280826145, 303307199, 316227792, 317249930, 307245627, 288303401, 262585455, 232121025, 200136012, 170039969, 143549393, 121062557, 103066078, 89791993, 80111477, 72663964, 66665694, 61657848, 57174121, 52989114, 49023147]
12802D9023147l647500l321172l116713k902601k652693k389386k104723j821971
12794B7066388j547727j441443j296168j269349j209793j048727r61216q48534
12786A7443431q17380p61424o76485o25364o08375n94721m93648m45946n30415
12777A1889673m86226n30385n43359l89226l30480l09572l68248k77990k23534
12768H430653j95479k07589k58469k85673j88818j87646k40450k58428k18356
12759F389745j84257k14769k59670k20730j73871j66324j71484k21438k49917
12750D527285j86900j75192j84455j94039k48426k41413j98970j75255j80918
12741B741717j64414j78070j37035q3775j01774r4889j04421j08703q6132o2940
$$ y = [49023147, 45375647, 42054475, 38937762, 36035161, 33382468, 30993082, 28888359, 27066388, 25518661, 24077218, 22781050, 21511701, 20301908, 19253181, 18291965, 17443431, 16626051, 15864627, 15188142, 14562778, 13954403, 13359682, 12866034, 12420088, 11889673, 11403447, 10873062, 10329703, 9940477, 9609997, 9300425, 8932177, 8654187, 8430653, 8235174, 8027585, 7769116, 7483443, 7294625, 7106979, 6866529, 6608101, 6389745, 6205488, 5990719, 5731049, 5510319, 5336448, 5170124, 4998640, 4777202, 4527285, 4340385, 4165193, 3980738, 3786699, 3538273, 3296860, 3097890, 2922635, 2741717, 2577303, 2399233, 2262198, 2178423, 2076649, 1981760, 1877339, 1768636, 1682504, 1619564]
12731A619564n1712r2033q8301m2850p6040p7217p6399o3284j9173l6389k5506
12720I70660m9686q6622o0829q279N4907J0946J543K6272P142n4225l3989J360
12708G79200o9528o0430K5339J8370L2172N942l9295L2211J7517k3378q3078k5622
12696F09420n200j9425l7802r160L5829l8807j9241j0422M597j3561o365R522
12684D99385K6569K0181j262O8031R2801L3279l8527o4918j6602k853J4489l225
12672F27348N6251O7145M207j9315k6074l4325k1039k6058R403J7784J969k4587
12660F32709K3238N8830j4230n9670j0149K9795l0704n1742m1600L3006N5012
12649F24495l9475o1890o6799R877N2219K4344Q85O284J3038K8808p105N487k7429
$$ y = [1619564, 1567852, 1475819, 1387518, 1344668, 1268628, 1191411, 1115012, 1051728, 1032555, 996166, 970660, 920974, 834352, 773523, 765244, 820151, 831097, 832640, 858912, 866054, 811829, 777840, 779200, 709672, 649242, 674581, 692951, 725123, 731065, 691770, 723981, 741498, 718120, 635042, 609420, 604220, 584795, 546993, 537833, 573662, 534855, 515614, 505192, 509789, 496228, 489863, 499385, 525954, 546135, 544873, 612904, 705705, 738984, 700457, 635539, 618937, 616084, 630573, 627348, 683599, 750744, 754951, 735636, 709562, 675237, 654198, 628140, 637543, 655327, 657296, 632709, 655947, 714777, 700547, 640877, 630728, 660523, 629819, 578077, 536477, 569483, 624495, 585020, 523130, 456331, 466208, 518427, 542771, 543656, 549940, 562978, 591786, 584681, 590168, 562739]
12636E62739j0579J32536J20901K6666j2715L3273L3393m7510q249n6941O092
12625G79606O826l2172l6991l1673j8246j00902p6907K7765K0121J0499m0707
12614E07219K727m880n7079j7696J6453l7089k623J026l5282p2396l0997n725
12602B63658k8786m9902k8664Q185K2203J2001K1092N1272m2396k6274l8839q886
12590A54664l6394L1507P8323N7412q4834j0221n6581J7053K6517j0571k549J5127
12578A79453K1510k430p6561n902J4322O3575q759N9913j3976l1850L1148K6674
12566B57117J1826m6728r343K2185J806L3441J539L353J3885m1903J9641P0789
12554C37608L2258M0042J3954n8168p7898p3081n6009k6314m3840J255q48n044
$$ y = [562739, 552160, 684696, 805597, 832263, 819548, 852821, 886214, 838704, 830455, 773514, 779606, 786432, 754260, 717269, 685596, 667350, 566448, 489541, 517306, 537427, 547926, 507219, 509946, 505066, 447987, 430291, 446744, 409655, 407032, 408058, 372776, 300380, 269383, 263658, 234872, 184970, 156306, 164491, 186694, 198695, 219787, 271059, 228663, 202389, 163550, 154664, 118270, 149777, 228100, 285512, 200678, 190457, 133876, 150929, 177446, 166875, 164326, 179453, 200963, 198533, 121972, 116070, 130392, 193967, 185208, 245121, 231145, 199295, 230443, 257117, 268943, 222215, 212872, 235057, 236863, 270304, 271843, 275196, 289081, 247178, 266819, 337608, 369866, 409908, 423862, 365694, 287796, 214715, 158706, 132392, 88552, 89807, 88959, 83915]
12542H3915K1479J2304J1081Q1206K3438l6716o3044j4961o6131j6983M4174k6554
12530E3208J4824R989L6711O521L9775p525l5868L4571J8692J9124j2360k0156
12518A57506J5042M939j0426l9499J8901N1955m934K3201q203n9739L4204k8829
12506A54118n9804k0878j8797J9952K9361P7202K2148o4404J5905K4527k1029
12495A58301k5182k456m2238K5217L8089l4082J6397l280n795N71j0508L5000
12483A50034J1017L630j0783j8988M2176J9458L6530l0426p4390o5206j7357N5801
12471A01496J2443j6042j9892k1833L5543L3437M4393Q294J5832k5180j5495m4784
12459A08212p5178K0905K2548K4460l761J2932j7298p1046m3894J00855J8915
$$ y = [83915, 105394, 117698, 128779, 209985, 233423, 196707, 133663, 118702, 52571, 35588, 79762, 53208, 68032, 78021, 114732, 121253, 161028, 153503, 117635, 152206, 170898, 190022, 177662, 157506, 172548, 177487, 167061, 127562, 146463, 198418, 193484, 216685, 208482, 148743, 182947, 154118, 94314, 73436, 54639, 74591, 103952, 181154, 203302, 138898, 154803, 179330, 158301, 133119, 130663, 88425, 113642, 151731, 117649, 134046, 130766, 124971, 125542, 115034, 150034, 161051, 164681, 153898, 134910, 177086, 196544, 233074, 202648, 128258, 63052, 45695, 101496, 113939, 97897, 78005, 56172, 91715, 125152, 169545, 177839, 193671, 168491, 152996, 108212, 33034, 53939, 76487, 100947, 97186, 110118, 92820, 21774, -22120, 78735, 97650]
12448I7650n292K564m0303j9584K7634M7645m338o953M2842l6693l7554M818l9642
12435C2794m9561O9277J7589k258p91P0514O2376j6835n7642l2679J8866k3681
12423H7969Q703j6034j1420j4330J5609P964O7179J0696o0335L8470K4016j5946
12411A42541j8019N7636L2259K9467K878k4072P722j6121L4979Q0341J9214P8446
12399D27271N5188R4909J42525K16105K53785K20328J68403Q9623N838j5587k0349
12388A638039k4190j41283k43366j51032n6323k10008j66394q3151m5352r1534
12378D25406j5204M165m1111L7002n5469m0947L3708n0735n0915N405m9428n7476
12366A44401m6870J4043J0976l5455L6215M9584k2064o0051J4009M9168O216m3515
$$ y = [97650, 92358, 94922, 54619, 35035, 62669, 110314, 105976, 99023, 141865, 105172, 67618, 72436, 32794, -16767, 52510, 70099, 67841, 67050, 137564, 199940, 183105, 125463, 92784, 111650, 87969, 96672, 80638, 69218, 54888, 70497, 78461, 145640, 156336, 96001, 134471, 158487, 142541, 124522, 182158, 214417, 243884, 246762, 222690, 230412, 214291, 249270, 329611, 348825, 427271, 482459, 577368, 719893, 935998, 1189783, 1410111, 1578514, 1668137, 1673975, 1658388, 1638039, 1613849, 1472566, 1229200, 1078168, 1021845, 811837, 645443, 562292, 516940, 425406, 410202, 414367, 373256, 410258, 354789, 313842, 347550, 296815, 245900, 251305, 201877, 144401, 97531, 111574, 122550, 87095, 123310, 172894, 150830, 90779, 104788, 153956, 160172, 116657]
12354A16657m9144M2288k2669l2154k9828l7865M1604N2740J2290j9003k0830
12343E4086M1469K1923j4883l9968j5691L5160M1560P4488J882n4199q1267J825
12331F6385r020m3053l2874j4512K0725J3340j2180J4041L1776K7193K0513n8959
12319B3375K4564J0908l5003O0986j503n6636L590L4743j5839j7471j5007K0138
12307C6845O1188N779n0490m6877l4226K4899k954p45l7720j3555j288O397K4511
12294b8236n54j3932J0922l5606m51l6512m308O6434L8560K9589k7224q983Q26
12281i475O5774L0292J9255k7861P30k3278j7153m306N839l883m3595N870L5407
12268C3616N2083J4455l1048l5180L078O5413J6357j1853k8803Q700p6019Q345
$$ y = [116657, 67513, 109801, 87132, 54978, 25150, -12715, 28889, 81629, 93919, 74916, 54086, 95555, 117478, 102595, 62627, 46936, 82096, 123656, 198144, 200026, 145827, 64560, 66385, 57365, 14312, -18562, -33074, -12349, 991, -11189, 2852, 34628, 61821, 82334, 23375, 47939, 58847, 23844, 84830, 83327, 26691, 30281, 65024, 49185, 31714, 16707, 36845, 98033, 103812, 53322, 6445, -27781, -2882, -5836, -6581, -44301, -57856, -59144, -52747, -28236, -28790, -42722, -31800, -67406, -67857, -104369, -108677, -42243, -3683, 25906, -1318, -10301, -9475, 56299, 86591, 105846, 77985, 78715, 55437, 38284, 33978, 39817, 35934, -7661, -1791, 33616, 85699, 100154, 69106, 33926, 37004, 102417, 118774, 106921, 78118, 86818, 10799, 19144]
12256A9144J3942o316l104k323M4927j8935n0037L8353l3406k5242J5785K3053
12244A5841L1469j2757o944r518k6705M845j4887K9300J8786J5834J2376m1055
12232A6585m4346j3413M7927P6883j0245l2455N4634j1495o8042n5261J4551J0389
12220a4288m7261k3876L4372N6562k6944o5880J0176O6503L2935m2403j5954M0805
12208D747O0284M8123n4293m9526k8401L3268N4287K8744k0545o255M4713k7531
12196H7615m7799j6760j205J5146J7572k9071j4392l7459k603j9299L4398k4531
12184c8388J0888K5406O9934n746J4151J5126n7687p4528N936j2490J9239L0067
12172A908Q767k0641j8701K0924k3044J0835L0672k6131P154j814r458L8905Q204
$$ y = [19144, 33086, 26770, 23666, 21343, 66270, 47335, -2702, 35651, 2245, -22997, -7212, 15841, 47310, 34553, 27609, 18091, -8614, -3769, -18656, 10644, 29430, 45264, 57640, 16585, -27761, -41174, 6753, 83636, 73391, 40936, 95570, 84075, 16033, -39228, -24677, -14288, -61549, -85425, -51053, 5509, -21435, -87315, -77139, -10636, 22299, -20104, -36058, 4747, 65031, 113154, 58861, 9335, -19066, 14202, 68489, 97233, 76688, 70433, 115146, 87615, 39816, 23056, 21851, 36997, 54569, 25498, 11106, -26353, -28956, -48255, -13857, -38388, -27500, -2094, 67840, 62094, 76245, 91371, 33684, -40844, -34908, -47398, -28159, 1908, 10675, -9966, -28667, -7743, -30787, -19952, 10720, -15411, -8257, -10071, -19529, 19376, 27580]
12159B7580o33K7121j0283J867M9369j9270j4948j1682m8549l7590J1485o858
12147c2391m9729k9426o309M9434N7785K8762N2612k3157j2825j4261m2738K6777
12135D534o435m6314j4468O5298P9775m3421J4704m6896K382J6501k6140j3520
12123a4000J9996N91q24k5084o2112M1065N2236j2289n1724N3665Q9155k5128
12111F5547k2642n0739K203K1148K9303L5461l7422K0398K8802m8260k7247J4603
12099C1155J8390l4308K3077K5636j8956L3611r245m7637j3918M3557K4215K1061
12087I6638j0012j00572p1649N1137M9913l2393J7113M9151j1527n5396m2197
12076e9794l2732M690K3334J2312N1485L3714K4796o4696p1527K7103J9305j3780
$$ y = [27580, 26947, 54068, 43785, 45652, 95021, 75751, 60803, 49121, 572, -37018, -25533, -32391, -82120, -111546, -117855, -68421, -10636, 18126, 70738, 47581, 34756, 20495, -22243, 4534, -1901, -48215, -62683, 2615, 82390, 38969, 53673, 6777, 9159, 25660, -480, -14000, 5996, 6587, 5763, -19321, -81433, -40368, 11868, -421, -52145, 1520, 90675, 65547, 42905, -7834, -5631, 15517, 44820, 80281, 42859, 63257, 92059, 43799, 16552, 31155, 49545, 15237, 38314, 63950, 44994, 78605, 69360, 21723, 7805, 51362, 75577, 96638, 86626, -13946, -85595, -34458, 15455, -16938, 175, 49326, 37799, -17597, -59794, -92526, -87836, -64502, -52190, -705, 33009, 57805, -6891, -78418, -51315, -32010, -45790]
12064d5790O2548o462J682n8400j4236J6784N2372l6298J7937L1751K4605k795
12052D3698L7481p772l7826j3758O1151L7383L0243j2245l2019m9786J8621R6354
12040A71525r5602J7488J6640k8707n6147k0644m1529L2851j5096o454n439K9300
12028a814N8399L1312l4627l9324j1022k3240J8834j6271O7467J2339L0017K9152
12016A21222j9730m0739p4032K1257j2582k4947Q619J3629P566M2255j1540k6447
12004D531L1518K5986p2913R54P895J7998K2016p779l1167n560j4448m9236L2778
11991c7427P8751n6422k8233R8826K9008k2535l0052K8956K8597L1533p963K058
11979A15097k8447k0066m7372n5829N100L566N3730n070l6768P952N7868J8261
$$ y = [-45790, 16758, 10296, 11978, -46422, -60658, -43874, 8498, -27800, -9863, 21888, 46493, 43698, 81179, 73407, 35581, 21823, 82974, 120357, 150600, 138355, 106336, 56550, 75171, 171525, 75923, 93411, 110051, 81344, 25197, 4553, -36976, -4125, -19221, -25675, -31114, -1814, 56585, 87897, 53270, 13946, 2924, -20316, -1482, -17753, 49714, 62053, 92070, 121222, 101492, 60753, -13279, 7978, -4604, -29551, -20932, -7303, 263, 42518, 30978, 4531, 36049, 62035, -10878, -9924, -2029, 15969, 37985, 30206, -961, -6521, -20969, -70205, -37427, 41324, -15098, -43331, 55495, 84503, 61968, 31916, 60872, 89469, 121002, 113039, 115097, 86650, 66584, 19212, -36617, -31517, -27951, 25779, 20709, -16059, -8107, 49761, 68022]
11967F8022l4867M696L7483J3947j10400o8989P0341K7701L2786L8669K3604p316
11955I5677j07747l0078m5955J402J01471l627J5882K356l831m9111m6858K1659
11943d8760k5754K1367J3863K137l3322J9020R839J3413M5609q001K9254O2353
11931A01018J9561n0342q787l3713J5504L1775l4882j8715j7386L3490m6645k7743
11919c6865L1131q281K9642P336l3790j1061p7605j85O9111m2970j6538N9318
11907c0757M7509m2690j7041L1745P2734P122l0445P606j8122k3380j0228o2229
11895f8176m9387N3316P2560l5671m3819K5701N835P302N0332M3340o753l5466
11883A9114j8096j0702k9898q151l6795N7532J3236p562m9382Q617J7221J648
$$ y = [68022, 33155, 37851, 75334, 89281, -21119, -90108, -19767, 7934, 40720, 79389, 102993, 95677, -12070, -42148, -88103, -86701, 14770, 11143, 27025, 29381, 25550, -23561, -70419, -48760, -74514, -53147, -39284, -37147, -70469, -51449, -41610, -28197, 17412, 9411, 38665, 101018, 120579, 70237, 61450, 27737, 43241, 75016, 40134, 21419, 4033, 37523, -9122, -36865, -5734, -14015, 15627, 22963, -10827, -21888, -99493, -99678, -30567, -73537, -90075, -30757, 16752, -25938, -42979, -11234, 61500, 68622, 38177, 45783, 27661, 4281, -5947, -68176, -117563, -64247, 8313, -27358, -71177, -45476, -39641, -32339, 17993, 61333, 54580, 19114, 1018, -9684, -39582, -47733, -84528, -26996, -13760, -21322, -70704, -62087, -44866, -43218]
11871d3218l4168K5273L7967M6336K0121J7561L6928o7456k5789k8206L8982l6611
11859a2280n6927m6542l886L4710K686R349J1274K1397M1398n1994k4369p370
11847h2554L6165J7212R627K4771M8685K2583l5403k6463M711j5066K4326K0820
11835D9414l199n772K4983K278k6460K2102N6270r099R288K2499l2609o6661j4485
11822B8549J11089O641r5123q0341J808r033k273M3551M4729J1690L4169m4914
11810E0542J4718L9144l4435k8694J3876l71j9369q199r3820k2050J09373O8179
11798H8894k3066n2231K928K703J2177J5536m0191n1369q7387l8296R3019O7154
11786a0129R728K3799P91j6019o5307L873J17908j7021m2885M345M290m7904o9949
$$ y = [-43218, -77386, -52113, -14146, 32190, 52311, 69872, 106800, 39344, 13555, -14651, 24331, -12280, -69207, -115749, -119635, -84925, -82239, -72890, -61616, -40219, 1179, -50815, -75184, -82554, -46389, -29177, -19550, 5221, 53906, 76489, 41086, 14623, 19334, 4268, 28594, 49414, 46215, 40443, 65426, 67704, 41244, 63346, 119616, 110517, 119805, 142304, 109695, 43034, 28549, 139638, 146279, 51156, -29185, -27377, -36410, -38683, 4868, 49597, 61287, 95456, 50542, 65260, 104404, 69969, 41275, 55151, 54780, 35411, 27212, -66608, -88658, 20715, 88894, 65828, 13597, 16525, 19228, 31405, 46941, 6750, -44619, -132006, -170302, -77283, -10129, -401, 23398, 24189, 8170, -57137, -53264, 64644, 47623, 4738, 9083, 13373, -34531, -104480]
11773a04480M4811L5102N0374L0614m2563j6198q905l8979m9146l0068J7949K7795
11761h3694J2679J925j6982M7613N3152J5582k9428K9472j5851l6137K2250P384
11749G965J4836K8674l275p888K3240p266n0652L5060K0811k3605j0003R804N889
11736D3590J1585M7610K7162K5542L5135m9053k6845J05588M4461q136J2154M8172
11724C16965O526l7610l3321n9583n3446j8626k7701j3278N222q521P61p649K0197
11711H9936q03k1212N8358j0605p7157K2378P1719P6673Q6906M7223J4022j1058
11699C46380o5436o6054m627N1068P3831O695L0576J4634m2666k6730J0518P427
11687C35616L4803k8327k5494o1659n4216K3641L1382k7177n4188p6332l8304
$$ y = [-104480, -59669, -24567, 25807, 56421, 13858, -2340, -11245, -50224, -99370, -129438, -111489, -83694, -71015, -69090, -86072, -38459, 14693, 30275, 847, 30319, 14468, -21669, 581, 7965, 22801, 51475, 48200, 40312, 63552, 56286, 5634, 40694, 61505, 37900, 27897, 37701, 43590, 55175, 102785, 129947, 155489, 190624, 141571, 114726, 220314, 264775, 256639, 268793, 316965, 323491, 285881, 252560, 192977, 139531, 120905, 93204, 79926, 85148, 76627, 77388, 69739, 89936, 89133, 67921, 126279, 115674, 38517, 60895, 132614, 209287, 296193, 343416, 357438, 346380, 280944, 214890, 210263, 261331, 335162, 341857, 372433, 387067, 344401, 317671, 328189, 335616, 370419, 342092, 316598, 254939, 200723, 224364, 255746, 228569, 174381, 98049, 59745]
11676E9745R8422n181J0845J5291j0302m0495o524J9323o908L527j237K6788L7562
11663B00856K1410O4959N4156L0069J4054K0048n5145n5742r9740l7831N346P033
11651A69473j0166m545L0616m942j0344n8239k7875l0220N464K5870l955K3979
11639A05116J7978l4588j2390J3884k5632l6561J9104k5508Q460R915j6993l742
11627A9043j9082p3378O602P8087M797J9220J582k8598l0891o575P85j5310K7726
11614a5992J3410K8873J5859k4320K0641j0797k3382Q062O6434k4656k6890p91
11602B6451k7838n8183o622O5000J8181m3931k0004K5127j9195k5932K6696K5601
11590a4649Q52j6558N746J8700n1538j3189N3420N6234N978r357J0987M98m7812
$$ y = [59745, 158167, 152986, 163831, 179122, 168820, 128325, 121801, 141124, 134216, 137743, 136506, 163294, 200856, 222266, 287225, 341381, 371450, 385504, 405552, 350407, 294665, 194925, 157094, 162440, 169473, 159307, 154762, 185378, 180436, 170092, 111853, 83978, 53758, 59222, 85092, 81137, 105116, 123094, 88506, 76116, 90000, 64368, 27807, 46911, 21403, 29863, 39778, 22785, 19043, -39, -73417, -66815, 11272, 16069, 35289, 36871, 8273, -22618, -29193, -28408, -43718, -15992, -2582, 26291, 42150, 17830, 38471, 27674, 4292, 12354, 78788, 54132, 27242, 26451, -1387, -59570, -66192, -1192, 16989, -26942, -46946, -21819, -41014, -66946, -40250, -14649, -13797, -30355, -24609, -5909, -57447, -70636, -17216, 39018, 44996, 35639, 46626, 47124, -688]
11577f88m1610l5024R0286Q6795l1751q9049k3799M1861p619J5516K562o228l1669
11564c0417k9673J0530j2581m298K0917k5384J1721l6978k0316J4162L9983O047
11552e6287l455o022P0042M3099J3009j9552k426l3846k2635j3280n9360K1477
11540f9236M6976p38j8955O584O822l3118J1200L9023j8279k3476M0382j7419
11528c0234K6994R992K6569m0411j3558M439m558K700k427K1748j3550m5655j39
11515e8090M2885K9338l5471p8268J2674N5681N1067l8165n7867K8846N6306J7694
11503B6630m9653j2373J711o0103l4457L4350K0144j305L879k0843m4060N972
11491a30108l5318j7105K3385J6536O5117R3333q067l3481L5145J74J696M4378
$$ y = [-688, -42298, -77322, 12964, 99759, 68008, -21041, -44840, -2979, -10598, 4918, 7480, 1252, -30417, -60090, -49560, -62141, -66439, -45522, -70906, -59185, -96163, -116479, -102317, -62334, -56287, -59742, -65764, 4278, 47377, 60386, 40834, 38408, 4562, -18073, -31353, -90713, -69236, -22260, -22998, -41953, -35369, -28547, -61665, -50465, -11442, -29721, -53197, -12815, -30234, -3240, 6752, 33321, -7090, -20648, -16209, -20767, -18067, -20494, 1254, -12296, -57951, -58090, -15205, 14133, -21338, -99606, -86932, -31251, 19816, -18349, -76216, -47370, 8936, 26630, -23023, -35396, -33685, -93788, -128245, -93895, -73751, -75056, -71177, -92020, -136080, -130108, -165426, -182531, -159146, -142610, -77493, 15840, 7773, -25708, 9437, 9611, 11307, 55685]
11479E5685q975r093k2274O167l5848K7108l3990k0472K6367P3355M4844q1148
11467B1726n5122o8397K9936M9506L975j6513j3707M288l610P5343K3637l5557
11455A5505L617k9756o4255k8559j7528N2995P4617M792k6207m9505j1300K5576
11443e0008M1475M9196l960j8862J7024o4467o7275L6365J6972l6379l4848L1736
11431h3031L4065N0598l0046n5273J0247q895j9511K0575O313K9923j1620L196
11419e3459l781l9253K0782K4389m4265k4863J9596Q6390R3648L0348q2490q1812
11407e4770k277L893k5464M0428J6390l0188M4191k4959k5487J1235L2900N0137
11395C6029l1819j1421n4497l4145o467j668j6200j9131L8541P7580P189J5961
$$ y = [55685, 46710, 37617, 15343, 21510, -14338, 12770, -21220, -41692, -15325, 58030, 102874, 21726, -33396, -101793, -71857, -22351, -18376, -34889, -48596, -44308, -47918, 27425, 51062, 15505, 19122, -10634, -74889, -103448, -120976, -67981, 6636, 11428, -14779, -64284, -75584, -50008, -8533, 40663, 36703, 17841, 34865, -29602, -96877, -60512, -43540, -79919, -114767, -83031, -48966, 1632, -28414, -83687, -73440, -82335, -101846, -81271, -74958, -45035, -56655, -53459, -57240, -96493, -75711, -51322, -95587, -120450, -100854, -14464, 79184, 109532, 27042, -54770, -57047, -53154, -78618, -38190, -21800, -51988, -7797, -32756, -58243, -47008, -14108, 36029, 4210, -7211, -61708, -95853, -102320, -103988, -120188, -139319, -100778, -23198, -16009, -48]
11383d8o6445P729K1152L8951O8348m3826j4152K375N8009k6076l2531j4903m3728
11370d5145K6086N0343k7837j3344O764o4N2944J5801K6035m3622j9692M8457
11358G6726j8896l9410m1690p1608l5278K3922j586P031K8645q51J9564L358r171
11345e9244m0608O0589Q1962l902j1362j3810p5664r179J6573N9777M9189L6597
11333I0918l6824o3070j7095j0581M6586j5608n5011K3986K5239N534l4191k6250
11321f6367L9929j8183k5514N618R36L6084p404k2292k2940l1205J6480Q1209
11309a3649k4485k8164k2338P4426N8225j6733n0871l1179M546j4932N929K6900
11297c2325j0935l7945k7787L1673Q822m260M1872K6917l3624n4177l4381j1326
$$ y = [-48, -66493, -58764, -37612, 1339, 69687, 25861, 11709, 14084, 72093, 46017, 13486, -1417, -45145, -19059, 31284, 3447, -9897, -3133, -3197, 49747, 65548, 91583, 47961, 28269, 76726, 57830, 18420, -23270, -94878, -130156, -106234, -107820, -100789, -72144, -72995, -53431, -50073, -59244, -99852, -39263, 42699, 38797, 27435, 13625, -62039, -71218, -54645, 5132, 54321, 90918, 54094, -8976, -26071, -36652, 9934, -5674, -60685, -36699, -11460, -5926, -40117, -66367, -26438, -44621, -70135, -64517, -63581, -27497, -34901, -57193, -80133, -111338, -94858, -13649, -38134, -66298, -88636, -14210, 44015, 27282, -23589, -54768, -50222, -65154, -59225, -32325, -43260, -81205, -108992, -77319, -68497, -72757, -30885, -3968, -37592, -91769, -126150, -137476]
11285a37476K7539J0099K3219K4041l2430j0329P450M4260L0138M1200J43n670
11273B2184l2520M0154J2349L4086N337m4398l1698M4731o6950q7923M632J4309
11261h5707N2520K5654l7595j9037j9841o6889L185P0936N7028L3887n8911K8556
11249a6214m81K1539J5946J3937j1055r162p6571m1293N9236n157L8524L0469
11237A9718m2815k2999N1291M0918n2915j990j3485k9977K3168K8952O5995k2519
11225D3342p9316j1296k3473j4044j024L1330j0035j1610Q3703N3352r475L8094
11213H9548p195n3979k8599n487o572j1655K0917m0302R494J5666P958K1616m809
11200F601l8244k2989k2145J9420j4663L6892J9477m041J7688J0017q12j2361
$$ y = [-137476, -109937, -99838, -76619, -52578, -85008, -95337, -87887, -43627, -13489, 27711, 27854, 22184, -10336, 29818, 42167, 76253, 81590, 37192, 5494, 50225, -16725, -104648, -100016, -85707, -33187, -7533, -45128, -64165, -84006, -150895, -147710, -76774, -19746, 14141, -44770, -16214, -16695, 4844, 20790, 34727, 23672, 14510, -62061, -103354, -44118, -49275, -10751, 19718, -23097, -46096, 5195, 46113, -6802, -8792, -22277, -52254, -29086, -134, 65861, 43342, -35974, -47270, -70743, -84787, -85811, -54481, -64516, -76126, 7577, 60929, 51454, 89548, 82353, 28374, -225, -5712, -12284, -23939, -3022, -43324, -33830, -18164, -10206, 11410, 6601, -31643, -54632, -76777, -57357, -72020, -35128, -15651, -19692, -2004, 8013, 7201, -5160]
11188e160p6615j5476Q8911K9312K689q002k0303L7733J3863n5o3140p674n5685
11175g9602j2338M6232J6733k5440R97N0123J2805m7912k1543Q184j109o8955
11163a21825m2766J3885J7849j8696Q9069L3609l9905K2569k9653n4491m2643
11152a72998P0870R3044L2331j5126j9822k9610R563J4114j8534k1902L9401J4350
11140d319N9619J3425r6732m3545j088L9374K0291j5026j3104J8222J279j02069
11128a23673n011J2067N7730P4183j5181l916j2124L5389J5856K439J5963r776
11116D3946K8633m730j13887p7273m7398J8588J0919P6227M2267J4423l666M1810
11104B9859J4130q1333m2993K7505M7928m7147l3856K6380N088N176l1555N174
$$ y = [-5160, -81775, -97251, -8340, 20972, 23661, 15659, -4644, 33089, 46952, 46897, -16243, -23917, -79602, -91940, -45708, -28975, -54415, -53418, -3295, 9510, -38402, -59945, -51761, -52870, -121825, -164591, -150706, -132857, -151553, -62484, -28875, -68780, -46211, -75864, -130355, -172998, -102128, -9084, 23247, 8121, -11701, -41311, -31748, -17634, -36168, -58070, -18669, -4319, 55300, 68725, -28007, -71552, -72640, -33266, -12975, -28001, -41105, -22883, -21604, -123673, -128684, -116617, -58887, 15296, 115, -3801, -15925, 19464, 35320, 37759, 53722, 43946, 72579, 67849, -46038, -123311, -170709, -152121, -141202, -64975, -22708, -8285, -11951, 29859, 43989, -37344, -80337, -52832, -4904, -52051, -85907, -59527, -54439, -49263, -80818, -75644]
11092g5644j6230k8456L7160r879j2673L1858N1896p383k534K1365K1245l2823
11080b2098n1414J6415Q8324o890n892r902j0097K0729o5135j2871L0369k994
11068c1456j5806L76K0938o318j6977J0945L4720M1348m1891o822M1189R817J1459
11055E1522O46k4117n4061J0960J7839L7674o3227q9689k0901J6362M906M6791
11043f5295J5906J569M4800k2441m8077M2810L075m4326l5839N8961N4104q396
11031c149R80j2400m2753m8493K3206R715Q06K2656N6403K2249n9960p5943R067
11018i7616R9779N5399l7456Q063K8797k488J7006k9840m4476m232j7366m1316
11006f5746m6163L2215M0547j6113m5914O8716J4798m448j9924J1721L0258M348
$$ y = [-75644, -91874, -120330, -83170, -93049, -105722, -73864, -21968, -29351, -31885, -10520, 10725, -22098, -73512, -57097, 31227, 24337, 18445, 8543, -1554, 19175, -45960, -58831, -28462, -31456, -47262, -46886, -25948, -32266, -49243, -38298, -3578, 37770, -4121, -10943, 30246, 40063, 51522, 52168, 28051, -26010, -15050, 2789, 40463, -22764, -112453, -133354, -116992, -112086, -65295, -49389, -47820, -3020, -25461, -73538, -30728, -27653, -71979, -107818, -48857, 5247, -3149, -2169, -14569, -57322, -105815, -82609, -72894, -72088, -49432, 6971, 29220, -30740, -106683, -97616, 2163, 57562, 20106, 28169, 56966, 54478, 71484, 41644, -2832, -7064, -24430, -65746, -111909, -79694, -39147, -55260, -101174, -32458, -17660, -22108, -42032, -30311, -53, 4295]
10994D295N5594L8351N092k7123p8609l8761K5515K0713k9765l6694p347J6269
10982e2470k5997m2049N8554O3215J6587k3996j9441m929L4991l890k5545R388
10970a5582k5580j6091M3465M7712j4726k2809k246j3282k1044J9624p714J8296
10958i977M192L3652n7838l8740M8236L6021K3303J8565k6555j6030J5346j9302
10946A0873o8835o585L5833M4445l7090q212K4156K1844n9692l5593L8316O9647
10934B9107l6439L2502O916O286J1688l6682j7053n763J1665n827q846K6246J7422
10921C1222q274o6005j740N2518J1763M3735J8002n9389n1249L592q777M47K453
10908c1702O2730m588q8364q0859m7569J8082K1183L2903Q7381k974P3637N646
$$ y = [4295, 59889, 98240, 103332, 76209, -2400, -41161, -15646, 5067, -24698, -61392, -68739, -52470, -78467, -120516, -61962, 1253, 17840, -6156, -25597, -30526, 4465, 575, -24970, -15582, -41162, -57253, -13788, 33924, 19198, -3611, -5857, -19139, -40183, -20559, -28273, -9977, -5785, 27867, -29971, -68711, -20475, 15546, 38849, 57414, 30859, 14829, 30175, 10873, -57962, -64547, -28714, 15731, -21359, -29571, -5415, 16429, -43263, -78856, -40540, 29107, -7332, 25170, 32086, 38372, 50060, 13378, -3675, -9438, 2227, -3600, -12446, 13800, 31222, 22948, -43057, -44797, 7721, 19484, 63219, 81221, 21832, -29417, -25825, -34602, -34155, -31702, 31028, 26440, -61924, -142783, -190352, -172270, -151087, -118184, -30803, -33777, 39860, 45506]
10896D5506m7979m7312l5506M7377N5827J4925k2226m6674k4319j9339k4664J3222
10884i1162n302R676k1992L030K0902L5528N2049j0709p2460k5910M8312M2872
10872a5166K9754L5932M3064k6368n4346J8297J3600k7335M1850J130P623J2676
10860H0711m903K2715p2533q7922J667Q4302J0031j29044j2032M7790L7355L0114
10848H251K2605J8082K2951p5153n5788j8958l3436J6777P1556L5911J0167J1434
10836C4399m7788m0926P654k2511j5549j6465j8910O8099J2703k2682K120m3488
10824a03344J6446L4927k230L713J0492M4791k984m2221l8165M524R6221K4871
10812D7041n6187j0673J7206p0226O107O2857O140N758m6134Q930J6611R551M6392
$$ y = [45506, -2473, -49785, -85291, -37914, 17913, 32838, 10612, -36062, -60381, -79720, -104384, -91162, -96464, -86788, -108780, -105750, -84848, -49320, 2729, -7980, -80440, -106350, -58038, -15166, 14588, 50520, 93584, 67216, 12870, 31167, 44767, 17432, 59282, 60412, 68035, 80711, 75808, 98523, 25990, -61932, -60265, 24037, 34068, -94976, -107008, -59218, -21863, 8251, 30856, 48938, 71889, -3264, -59052, -78010, -111446, -94669, -23113, 12798, 22965, 34399, -13389, -54315, -46661, -69172, -84721, -101186, -120096, -51997, -39294, -61976, -59856, -103344, -86898, -51971, -54201, -50488, -39996, 4795, 1811, -40410, -78575, -74051, 22170, 47041, -9146, -19819, -2613, -72839, -66732, -3875, 2265, 8023, -38111, -29181, -12570, -3019, 43373]
10799D3373n119J7214j7080n7834l3623J2060l3380o50j7680K7508O4155J2018
10787A0962p412k8590l6004r658J4691o062n9026j5454J05908O0109m1305p1612
10775h3453k258J6852J7216o284n170N2378o044j8488l8900m2817P449L6192K1401
10762e1926o04L3777k474n5815k8779O3195N511j3220m1322L7672Q909k8038k0642
10749i3756L0751M5701K2195J7814k9846m1856J003m1062J340R566k3600j0192
10737a11942L553m1471L6163N1086L1118n0240K563j7590L3580M0357J2169j6178
10725b6832k1994n6259k8605L0803M6074M9877m9948k9289M8962K8340q8597o1236
10713a58704O9975R8922k50m6029L890qo3758l25j7361M7497j0379L6004Q3829
$$ y = [43373, 38254, 55468, 38388, -19446, -53069, -41009, -74389, -75039, -92719, -65211, -1056, 10962, 3550, -25040, -61044, -70702, -56011, -62073, -121099, -136553, -30645, 29464, -11841, -83453, -85711, -68859, -51643, -57927, -63097, -10719, -16763, -35251, -74151, -116968, -109519, -73327, -51926, -52530, -18753, -21227, -77042, -105821, -42626, -37115, -50335, -91657, -53985, -45076, -73114, -93756, -63005, -17304, 4891, 22705, -7141, -48997, -47994, -89056, -87716, -78150, -101750, -111942, -108389, -149860, -113697, -62611, -31493, -81733, -79170, -96760, -63180, -22823, -10654, -26832, -48826, -105085, -133690, -102887, -56813, -6936, -56884, -86173, -37211, -8871, -97468, -158704, -88729, 10193, 9943, -36086, -32196, -32204, -95962, -96287, -113648, -66151, -76530, -40526, 43303]
10700D3303l6339m7257j2063J0469k2673j3577N3915O465k8501L585J683n5170
10688i6160J1317J2113l9705Q015J7966l8689Q2840P7013k064l66k8768k1344
10676a7832M3193L2034l2038l7386J202k7402j2388q183k3744L3723K7402l3725
10664e5144o0444k4700M8647M6761n0976j1950k1808M9701L3966j1457N3024J6519
10652A2139l4186j4001j0649p821O564M2110M9191l8478p8067K3507K7887K4897
10640C093L8530J6462q0940p2310J0080l201j1037j1652o482K5970p2N4j7681
10627a09186K0779m7163o2065P919R6458l7445j6522j7849j7841j28K290P7606
10615a03147N7619R238M3471N2012j1674k6522j1917n115j6992j406K7125J9198
$$ y = [43303, 6964, -40293, -52356, -41887, -64560, -78137, -24222, -17757, -46258, -42673, -40990, -96160, -84843, -72730, -112435, -104420, -86454, -125143, -42303, 34710, 32646, 32280, 3512, -17832, 25361, 57395, 25357, -12029, -10827, -38229, -50617, -58800, -82544, -48821, -21419, -55144, -115588, -140288, -91641, -44880, -95856, -107806, -129614, -79913, -45947, -57404, -4380, 12139, -22047, -36048, -46697, -54518, -47954, -5844, 43347, 4869, -73198, -49691, -21804, 3093, 41623, 58085, -22855, -95165, -85085, -88286, -99323, -110975, -117457, -91487, -91559, -91505, -109186, -88407, -135570, -197635, -189716, -93258, -130703, -147225, -165074, -182915, -183043, -180753, -103147, -45528, -36290, 7181, 59193, 47519, 20997, 9080, 3965, -13027, -14433, 12692, 31890]
10603C1890k4436m4028O633K5634J7101o1624l0878j3503o1594l2645K3748M2398
10591a21304J0179j1655k8821N2757K1800L2848j5724Q623N6713j2502n6083p5953
10579a39122N802K9391J8910Q113K8559j360q476O9400J9655j5251q9403j3930
10567h7712J0819P7577P9801k6145m3089m4400o5106J6903m336r374N44J0415
10555h4103j3034J0967j8383K154N2164L042n587k3412K950k6928m7248L39Q0618
10542f6461P7775n6948o8142m312K2685L5776L0423L4553J2546J2626j7305l6074
10530b2858l9548J6659K4516m66J2767m8238K8524N7231m3204m6759q880K3078
10518d7178r12m0819k331J2882p3564P770Q8732j1966M6002O10j7755k1339j1787
$$ y = [31890, 7454, -36574, -29941, -4307, 12794, -48830, -79708, -93211, -154805, -187450, -163702, -121304, -111125, -122780, -151601, -98844, -77044, -44196, -59920, -51297, 5416, -7086, -63169, -139122, -133320, -103929, -85019, -76906, -48347, -49707, -58183, 11217, 30872, 15621, -73782, -87712, -76893, 684, 80485, 54340, 11251, -33149, -98255, -81352, -85688, -95062, -94518, -84103, -97137, -86170, -104553, -102399, -50235, -47193, -52780, -76192, -73242, -100170, -147418, -147079, -66461, 11314, -45634, -113776, -118088, -95403, -59627, -29204, 5349, 17895, 30521, 13216, -22858, -62406, -45747, -21231, -21697, -8930, -57168, -28644, 28587, -14617, -61376, -70256, -47178, -48090, -88909, -91240, -78358, -151922, -144152, -55420, -67386, -21384, -20774, -38529, -59868, -71655]
10505g1655k1380J0556K0031K1935N325m3432p4635j3652Q9299M0890k3546J1429
10493d8835J6608O5749k0768l5073M803j9998k284j1656K7953K6496k4866K5479
10481C608J0968N837r014n9567j0644P2785J5005k4829j0967O920n2125n3707
10469a05730p3934r573N1783K7414J126M5077Q1012j7639o0681q1952M1649Q5578
10457a5870k7388M7628J1611J0745N762n7978l1668k4409J809J4617Q8762L5525
10445E9146K6164n2097p9267N964M0014K2342n4979M7963N4586n1464l1237n2824
10433f5689k0945N6311j6208l1800n1818K1255O8170J8556j0747m4647J4546K2456
10421d0560J4840L3364k608l1455j7249O2377M2056m3394q763K995M5520L712
$$ y = [-71655, -93035, -82479, -62448, -40513, -35188, -78620, -153255, -166907, -77608, -36718, -60264, -48835, -32227, 33522, 12754, -22319, -17516, -37514, -39798, -51454, -23501, 2995, -21871, 3608, 14576, 20413, 11399, -48168, -58812, 13973, 28978, 4149, -6818, 102, -52023, -105730, -179664, -189237, -137454, -110040, -108914, -63837, 17175, -464, -61145, -143097, -101448, -15870, -43258, 4370, 15981, 26726, 32488, -25490, -57158, -81567, -79758, -65141, 23621, 59146, 85310, 33213, -46054, -40090, -76, 22266, -32713, 15250, 69836, 18372, -12865, -65689, -86634, -30323, -46531, -78331, -130149, -108894, -40724, -22168, -32915, -77562, -63016, -40560, -25720, 7644, 5036, -26419, -43668, 18709, 60765, 17371, 8608, 11603, 57123, 60835]
10409F0835j9069n6497j5186Q9832R2815K8181J069l5444k2170n1886p7690j7795
10397b3005O196K177J4021j3971J296q3392j90J4189j3849k4723j8842m5854M3556
10384a42391k3676j08N0100J9915j3386J6846l3566M139O961P2014L4924r650
10372a7878q7870l1532l36O7050k9003j490P831l3428j279N6739J3085m0874r981
10359a08966j3930P05M4755N1194M3116j9041J192l7749j4375k216M189J3199
10347c7927J4935Q964j615J3353q226l1542k5726M3627j7020j9890k8092k8078
10335a17237q401M8488N7296K7008K7101P074n7467o0088N3854L3434M770k0781
10323d949K182k9736n2211N2688O0737k6319r191O5401o494j7570O916k9763m792
$$ y = [60835, 41766, -14731, -29917, 59915, 152730, 180911, 181980, 146536, 124366, 72480, -5210, -23005, -16809, -14632, -611, -14582, -13286, -96678, -96868, -82679, -96528, -121251, -140093, -185947, -142391, -166067, -166175, -116075, -96160, -109546, -92700, -126266, -122127, -115166, -43152, -8228, -17878, -105748, -137280, -137616, -70566, -99569, -101059, -93228, -126656, -127935, -71196, -58111, -98985, -108966, -122896, -122191, -77436, -26242, 16874, -2167, -975, -38724, -53099, -55315, -51126, -37927, -22992, -14028, -15643, -2290, -10516, -42058, -67784, -24157, -41177, -61067, -89159, -117237, -125638, -77150, -19854, 7154, 34255, 41329, -16138, -76226, -22372, 11062, 15832, -4949, -2767, -32503, -84714, -32026, 28711, 2392, -6799, 58602, 52108, 34538, 41454, 11691, 6899]
10310F899M5263K2010j3736j8742L249n3911L7226N1075l826o4880k2940r337
10298b1650n459p544J9427o7l6038j9636K4678K6557P8626o5799q1836j0069M6800
10285e2010J4932M3070L3906j3836m3819j1458J8672j0597l1332O045L4391n2993
10273f5029l2204K0781O1465L4800j3546m7319l0542K325L9776j2324o737k65
10261d8819j4934n081k0453q268K2253j7337l5535n854J2675J994K0478L3639
10249f5242j0697M0176J7625K2174N515m8501r5535N1905K2112K2021K78l777
10237d1946m1018J4140M204K4508n221R686N3221m4948K2565L632O790k7015K232
10224a9170N4784K0064m7517j3327l9603P426l2018M3364J03336M3150J747j0636
$$ y = [6899, 52162, 74172, 60436, 41694, 44943, -8968, 28258, 79333, 75507, 10627, -12313, -21650, -27109, -34653, -15226, -15293, -51331, -70967, -46289, -19732, 58894, -6905, -88741, -98810, -52010, -37078, 5992, 39898, 26062, -17757, -29215, -10543, -21140, -52472, -46427, -12036, -65029, -97233, -76452, -14987, 19813, 6267, -41052, -71594, -69269, -29493, -41817, -48554, -48819, -63753, -68834, -89287, -97555, -75302, -92639, -128174, -134028, -121353, -119359, -98881, -65242, -75939, -35763, -18138, 4036, 9551, -38950, -134485, -82580, -60468, -38447, -38169, -41946, -82964, -68824, -64620, -40112, -45333, -35647, 17574, -27374, -4809, -1177, 5613, -21402, -19170, 35614, 55678, 8161, -5166, -44769, -37343, -69361, -25997, 77339, 120489, 122236, 111600]
10212A11600m7635m3126J2046m7063p6614K3110Q161K2245j955L0422k9889o0489
10200i9187N8683m428Q677J2444L8566j296j3766j1430K0269n708m647k1471k9327
10187e2621n3693q899J7362N7432L1339J5859K7333k3837j8440p2525j6604R8480
10175A186K9046p3594k7181j0509M9483j7842p88K409J2689L8794j9895J2028
10163d174l1592p1827J2590O129j5863J5142N8372Q7132l483j3082l54k071j3471
10150B3448k1909k4558j308R979K0155j0887n986l3673k5750O8706R601m318L7693
10137D1193n688p1512l2903N0638L827J5822l1903l0040m8032J3341P6202J1254
10125g801k4936K7992N4473K0062n0630l2721k542K9119M7193j0280k2886L2954
$$ y = [111600, 63965, 20839, 32885, -14178, -90792, -67682, -59521, -37276, -39231, -8809, -38698, -99187, -40504, -44932, -36255, -23811, 14755, 13459, -307, -11737, 8532, 2824, -1823, -23294, -52621, -106314, -115213, -97851, -40419, -9080, 6779, 34112, 10275, -8165, -80690, -97294, 1186, 30232, -43362, -70543, -81052, -31569, -49411, -50199, -47790, -35101, 3693, -16202, -4174, -35766, -107593, -95003, -88874, -104737, -89595, -31223, 55909, 52426, 39344, 38990, 36919, 23448, 1539, -23019, -24327, -14348, 5807, -5080, -11066, -44739, -70489, -1783, 7818, 3500, 41193, 35505, -36007, -68910, -18272, -14445, 1377, -30526, -60566, -108598, -95257, -19055, -7801, -32737, -4745, 49728, 69790, 19160, -13561, -16103, 13016, 60209, 49929, 27043, 59997]
10113E9997m158p9943l0724K1749M4052M5300j2185J7395k1810k32L3138l8759
10101C3820k9994M2839L7315k4898K378m3043P8630N6624m676L4151n2600o6166
10089F4380j0020K6801m3207J157P136J2967J213J6303M9445J9286J6779J5750
10077A77990n7369Q069O0811R6985O3498O8668Q9819J07726J13005J04623L0082
10066H63907O5991J13804R4022J23326J03523K07421K74915L52890O70507J072073
10056C942379J537361K717874N089425Q177827O609227J969740N84528k053310
10048B8575051q439330p298939l684083j940803j254713q35331o18988n23936
10040C978928l96441k71200k43316j75801k28038j91122j29375p9293j06052j04729
$$ y = [59997, 55839, -24104, -54828, -33079, 10973, 56273, 44088, 61483, 39673, 39441, 72579, 33820, 3826, 46665, 83980, 59082, 61460, 18417, 97047, 153671, 148995, 183146, 130546, 64380, 54360, 81161, 37954, 39111, 46247, 59214, 60427, 76730, 126175, 145461, 162240, 177990, 120621, 128690, 189501, 286486, 349984, 418652, 508471, 616197, 729202, 833825, 863907, 929898, 1043702, 1137724, 1261050, 1364573, 1571994, 1846909, 2199799, 2870306, 3942379, 5479740, 8197614, 13287039, 21464866, 28074093, 30043833, 30628361, 28575051, 20135721, 12836782, 9152699, 7211896, 5957183, 5121852, 4502864, 3978928, 3582487, 3311287, 3067971, 2892170, 2664132, 2473010, 2343635, 2264342, 2158290, 2053561]
10030B053561j02146j23516j80154j99303j60229j23865q2707o361l3897n9807
10020I81576l5187o8360m4454n1734j4695r994j9514o4047k6628j2908o480O0611
10008F88186R528k0994m3030j9721m5006n0219k7893J8969n1921n9689j1032k9691
9996C57487k4758m704K5186M9878m4326n7760j5653N6585l0812o7519L7528l5122
9984B46010Q517l5318K1783l0723M2148R0645j4981q8417n5393p568l0223R988
9972A56468J812l080k907Q3596O6917L7355Q963L4573M2822K1989M1671L2724
9960E22903o2830n208P2558Q1296P9821j1433P721n2382n7751m0278L6012o2548
9948E07881j00377j7324l8481l9451j472P875j8588q439J4376p7461q9970k8987
$$ y = [2053561, 1951415, 1827899, 1647745, 1448442, 1288213, 1164348, 1081641, 1075280, 1041383, 981576, 946389, 878029, 833575, 781841, 767146, 757152, 737638, 673591, 646963, 634055, 627575, 688186, 697714, 676720, 633690, 613969, 568963, 518744, 490851, 509820, 457899, 398210, 387178, 357487, 332729, 328025, 353211, 403089, 358763, 301003, 285350, 341935, 311123, 243604, 281132, 246010, 254527, 219209, 240992, 210269, 252417, 343062, 328081, 239664, 184271, 176703, 146480, 156468, 158280, 155200, 152293, 235889, 302806, 340161, 349124, 383697, 426519, 448508, 490179, 522903, 460073, 454865, 527423, 608719, 688540, 677107, 684828, 632446, 574695, 534417, 570429, 507881, 407504, 390180, 351699, 312248, 310776, 318651, 300063, 291624, 306000, 228539, 138569, 109582]
9936A09582N874M0897j6715l3690j669j0685J2309M8155k4352q696K426m0826
9924H2610n503M9020p353j1819j0726j3811J9636l4118J955J4507k6620m0973
9912A6805j2867k5293N1689l578J1057L0220k182q034r839k428k7489n959K1824
9899C3926J01538L6973J9305R756j7677o3999k4712N9903n2192j3369K6658k8830
9887H7280Q64K8271n4743r414R613J1074k2346j0643L6844J5513k2060m5802l9511
9874a5060J2619M3043O0797n4827m7497J1887k233L0715K3324j6421k6446N433
9862B5334L0098J6078L4339L6472L9854o5525k7593n920M3689L496K3401m065
9850A49658n2028J1751O7890K18752L20729K40699K44729L08337L09029J21216
$$ y = [109582, 115456, 156353, 139638, 105948, 104279, 93594, 105903, 154058, 129706, 121010, 123436, 82610, 77107, 126127, 118774, 106955, 96229, 82418, 102054, 67936, 69891, 84398, 57778, 16805, 3938, -21355, 30334, 26756, 37813, 68033, 65851, 57817, 47978, 45550, 18061, 12102, 33926, 135464, 172437, 191742, 201498, 183821, 119822, 95110, 155013, 102821, 89452, 116110, 87280, 88144, 116415, 61672, 52258, 61871, 72945, 50599, 39956, 76800, 92313, 70253, 24451, -15060, -2441, 40602, 101399, 46572, -925, 10962, 8729, 39444, 62768, 46347, 19901, 25334, 55432, 71510, 105849, 142321, 182175, 116650, 89057, 83137, 126826, 130322, 153723, 149658, 97630, 109381, 177271, 396023, 716752, 957451, 1202180, 1510517, 1819546, 1940762]
9840A940762n7406k18083k76385l31264k53952j52541r7130n8602j23667n9839
9830C11893k0786J5311N6942m9096j29800l2562J8631L6445n033l9760P903J3697
9818A83785N976j8772n4215j7552k0901l638M7397q765K4648j0055n1932j971
9806G4005K009L5670n830l620l2138l9016l239k5545P2251K6733k1373n5991J2224
9793C6140L0241N6672R998j16169J6129P2245O7077J288m0281k3725l1374M6102
9781A24343j402J5279j867l0611O4672k3079n2528k7121R564k2805K0312K8215
9769A02972J3065K6504K0993M5217Q6830o1937o2224p9489K3021K1589o6042j03403
9757c2904J8616N5692L9141j9038n3012k5822J5165P8296P1165j0686r913K2499
$$ y = [1940762, 1883356, 1665273, 1388888, 1057624, 803672, 651131, 554001, 495399, 371732, 311893, 291107, 306418, 363360, 314264, 184464, 151902, 170533, 206978, 201945, 162185, 170088, 183785, 189761, 170989, 116774, 99222, 78321, 74683, 122080, 113315, 137963, 127908, 75976, 74005, 76014, 111684, 105854, 102234, 70096, 31080, 27841, 2296, 74547, 101280, 79907, 23916, 36140, 66381, 123053, 133051, 16882, 33011, 105256, 172333, 173621, 133340, 109615, 78241, 124343, 122941, 138220, 136353, 105742, 170414, 147335, 94807, 67686, 77250, 54445, 74757, 102972, 116037, 142541, 163534, 208751, 295581, 233644, 171420, 91931, 114952, 136541, 70499, -32904, -14288, 41404, 80545, 61507, 8495, -17327, -2162, 76134, 147299, 136613, 126700, 149199]
9745A49199l0602l0163K8759m6592m5856J9163K086o163P728M3412L2742M9077
9733A72790K4405k0673k6960L4254O2517M0034O8382P279L9180L2283L3789M0826
9721E08106P9791Q2176J01971O3258J0645l1193l219p353q5151j25366o7225o5258
9709D61182j0229Q6923m5417n9495m3151p7907p3707o5376J5045P216k7541k2722
9697A44821m7197m0194q602n3367J0882K3232J01666L3639l9931j8928L3716L2235
9685A71972j8309J4138m7359k7173m9898q7533q084N9432L490M6146Q427o7672
9673b423p1469N563O9805P0296O2534m5346j8862Q826Q236p3559K632M7861K8000
9660I2094J5146O635r515k6637q937L1151k6195m1909L100L0446N7846K6636L7966
$$ y = [149199, 118597, 88434, 117193, 70601, 24745, 43908, 45994, 39831, 47559, 90971, 123713, 172790, 197195, 176522, 149562, 183816, 246333, 286367, 354749, 362028, 401208, 433491, 467280, 508106, 587897, 670073, 772044, 835302, 845947, 814754, 811535, 804182, 719031, 593665, 526440, 461182, 450953, 537876, 492459, 432964, 389813, 311906, 238199, 172823, 187868, 195084, 167543, 144821, 97624, 57430, 48828, -4539, 6343, 29575, 131241, 164880, 124949, 106021, 139737, 171972, 153663, 167801, 120442, 93269, 43371, -44162, -52246, 7186, 10676, 56822, 65249, -2423, -73892, -68329, 1476, 71772, 134306, 88960, 70098, 78924, 87160, 13601, 16233, 64094, 92094, 107240, 113875, 104360, 77723, 68786, 99937, 73742, 31833, 34933, 65379, 123225, 149861, 187827]
9647A87827J300K2188k7472l9515p0532j8833O1629M0154j6224n4748l4080o8738
9635a7044j555L8008L1373J9950j5086L116K1331j0462p2463K5918N9873M1601
9623A24560j6417K3357k8838Q221k0513k3448l5796j4712J2529K0362l7302q1017
9611f9014j8796M5403L8890P699o9310L472M9809M1908l0901l8489p741J562K3634
9598b1874M4409L2630k7300L4033K9640K2125l900j8951k8614q4451M5200J7730
9586D0677l0440k1773j1668K8844K8159l2113n1542l8050K0848j9900O468J6906
9574f3584J4295O6301L0692j5100K4873n6698j4913J615N5364K4642n2168K7466
9562D2785K32k2451L2545n0953m9447O855M4631J6106m4702K2794N3058j6289
$$ y = [187827, 189127, 211315, 183843, 144328, 73796, 54963, 116592, 156746, 140522, 85774, 51694, -17044, -18599, 19409, 50782, 70732, 55646, 58762, 80093, 69631, -2832, 23086, 82959, 124560, 108143, 131500, 102662, 110883, 90370, 66922, 31126, 16414, 28943, 49305, 12003, -69014, -87810, -42407, -3517, 4182, -65128, -61656, -11847, 30061, -840, -39329, -47070, -45508, -21874, 22535, 55165, 27865, 61898, 91538, 113663, 109763, 90812, 62198, -22253, 22947, 40677, 10237, -11536, -23204, 5640, 33799, 1686, -49856, -87906, -67058, -86958, -80490, -63584, -49289, 17012, 47704, 32604, 57477, 779, -14134, -12519, 42845, 67487, 15319, 42785, 43017, 20566, 53111, 2158, -47289, -40434, 4197, 20303, -24399, -1605, 51453, 35164]
9550C5164J0305l4325j6801k5008P2354m655j6345l3524j7717p5837K305N8827
9538d5257L1949M1561j6183p591l6054Q710M7395K4545J6700K0602k7773N981
9526F4585J0968l2249l3418P2157J2490l5203n2853o9142l3074N8788R4458L5397
9514I2904j3511J7458K0876R069l7269j6472m1625K2282P8298J522j3974r235
9502A10323J1178n938K2203K1659K8705L5829j4440j4225k0359O5906M5541k8007
9490B58375k1678l7616l4022O45j6070P738r9837k1136M8376j7238L3083M1875
9478A42495M8976J0585j9958q327l6812n78P1916l2876k9913j016J4644Q869J3066
9465A81071N1735R821K1917O0733k1507o227J1916M3013J2735M983k0147m7638
$$ y = [35164, 45469, 11144, -5657, -30665, 41689, 37034, 20689, -12835, -30552, -106389, -104084, -45257, -13308, 28253, 12070, 4479, -31575, -22865, 24530, 49075, 65775, 86377, 58604, 64585, 75553, 43304, 9886, 82043, 94533, 59330, 6477, -62665, -95739, -36951, 57507, 92904, 79393, 96851, 117727, 126796, 89527, 73055, 31430, 53712, 132010, 133532, 119558, 110323, 121501, 115563, 137766, 159425, 188130, 223959, 209519, 195294, 174935, 240841, 286382, 258375, 236697, 199081, 165059, 165704, 149634, 157372, 57535, 36399, 84775, 67537, 100620, 142495, 191471, 202056, 182098, 173771, 136959, 136381, 208297, 175421, 145508, 144492, 159136, 168005, 181071, 232806, 242627, 264544, 325277, 303770, 297543, 309459, 352472, 365207, 370190, 350043, 302405]
9453C02405M7639M3203p363l3964o9280o3323L3646N0296l9892o1198j421O1711
9441B62459N0601k5402R986L243k9648j5411l3795K3851R857k1051K5882l366
9429B57206o268K6589l2755J7575M6847J7644l5164r6488K7387p057n0456J18313
9417B83373L3110k2600J4760K99m5835L2084k9462K9727l5317Q257m0859j13221
9405A14316j0571N3875l002M9891o1122m203k7037O538J3569K5347j4603j6684
9393A26314K6267N7769L8421K6485l2330j0320p6756k8036K8345N398O8096J5674
9381B45327k9744k9486n0251k5660K9221M6608m2228p2651l2244m741K4671L8316
9369I7138k8006p86K0846n0230L4080N7510M0138L5788n7227q3917q085o118M6820
$$ y = [302405, 350044, 393247, 385884, 351920, 282640, 219317, 252963, 303259, 263367, 202169, 200748, 262459, 313060, 287658, 297644, 300887, 271239, 255828, 222033, 245884, 255741, 234690, 260572, 257206, 250938, 277527, 244772, 262347, 309194, 326838, 291674, 195186, 222573, 215516, 165060, 283373, 316483, 293883, 308643, 308942, 263107, 295191, 265729, 295456, 260139, 268396, 227537, 114316, 103745, 157620, 154618, 204509, 143387, 139184, 112147, 118685, 132254, 157601, 142998, 126314, 152581, 210350, 248771, 275256, 242926, 232606, 155850, 127814, 156159, 161557, 229653, 245327, 215583, 186097, 135846, 110186, 139407, 186015, 143787, 71136, 38892, 34151, 58822, 97138, 69132, 68346, 89192, 38962, 73042, 130552, 170690, 206478, 149251, 65334, 57249, 51131, 97951]
9356I7951O7558L2781k5921l153k7193n3358J9916l755p0180j6123K8483J767
9344D8773n295k8816K2683O7691l0581k4658K9448K7002J2096O809K5727M7172
9332A98051k1336p1314m2073m7822M5556P8969O374J2481k5219m5424j4128k1386
9320E2729K3551O4901j0079L5981l5329J4296N5689O442K7987m7K4296O0190k4247
9307B96360l1928n4125M1818P3914r666l8490M4018L8895J3041k5755o028R673
9295C51727L9371j4438j00099n5917J3605O8598J8412o0389m1708K4272J5991
9284B59425J3637J0959l0620P720K331J4233j646J8639K596J5962K1592k5206
9272C09622j8523M198J2256J1297p076n9071m5113K1021q248p605M400n730p4675
$$ y = [97951, 165509, 198290, 172369, 169216, 142023, 88665, 108581, 104826, 34646, 18523, 47006, 48773, 43478, 14662, 37345, 105036, 74455, 49797, 79245, 106247, 118343, 125152, 150879, 198051, 176715, 105401, 63328, 15506, 61062, 140031, 146405, 158886, 133667, 88243, 74115, 52729, 76280, 141181, 131102, 167083, 131754, 146050, 201739, 208181, 236168, 236121, 260417, 320607, 296360, 264432, 210307, 252125, 326039, 316373, 277883, 321901, 360796, 373837, 348082, 342054, 351727, 391098, 376660, 276561, 220644, 234249, 302847, 321259, 260870, 219162, 243434, 259425, 273062, 284021, 253401, 261121, 263452, 277685, 276039, 294678, 297274, 313236, 334828, 309622, 291099, 295297, 307553, 318850, 311774, 252703, 207590, 228611, 220363, 212758, 217158, 211428, 136753]
9259A36753M3267O9857p769o883K7287k7186p0308p8646p806K3164J1528O7L8655
9246A51980J2996l880K2643L2893j3110J869j1809Q9476N1951N112l022q539R130
9233C37690L1639J6532M5007J0769j2133j954J5414l0260M9074M1053K551m264
9221E01118r991o967O739L7195K5088L38M922N1998q123N8340j359K8958N0369
9208G38625Q924m516l1705j8196J4776L3645P1259O1801j2185O1812P3788J5052
9196A013080K5829J7536m3382M7660R4536O8451Q8911P8891O7563M0068l5296
9185A463847k3170K008k5050M1290J9214K3611M6479J8473r194l6941l8837M784
9173A486514j1363N795K9638J3920m3018K7109P3987O1779O510p0894k2726K7482
$$ y = [136753, 180020, 249877, 242108, 235225, 262512, 235326, 165018, 86372, 78566, 101730, 113258, 113325, 151980, 164976, 161096, 183739, 216632, 203522, 205391, 193582, 283058, 335009, 340121, 337099, 328560, 337690, 369329, 385861, 430868, 441637, 429504, 427550, 442964, 412704, 461778, 502831, 505382, 501118, 491127, 484160, 490899, 528094, 553182, 553520, 558442, 610440, 602317, 660657, 659298, 688256, 738625, 747549, 743033, 711328, 693132, 707908, 741553, 812812, 874613, 862428, 924240, 998028, 1013080, 1038909, 1056445, 1013063, 1060723, 1155259, 1223710, 1312621, 1391512, 1459075, 1499143, 1463847, 1440677, 1442685, 1417635, 1458925, 1478139, 1501750, 1548229, 1566702, 1557508, 1520567, 1481730, 1486514, 1475151, 1480946, 1510584, 1524504, 1481486, 1508595, 1582582, 1644361, 1650871, 1579977, 1557251, 1584733]
9161A584733M0201P2927J09884J1182n1432n4768l0820J4120J16634L5436N0893
9150A898990L8165R968Q2843O1923Q933L1275N7216M0283M7175N433P4036N1592
9138B407832j3868N0398R8716L3192J7259M0324O7009N2622P5225J18328O6685
9127C013722J06009J13805N8308N6296P7901P9776J32253J82095R4732J19259
9117D034156J66868J80687J20193J49363K20894J58681J93869K36386K04247K26942
9107E892286L00015K40037K20841K73557K71711L26906L55977M69697M89105N22212
9097I362344N28586N72111P14721P33634P45259P97793Q61664R36845J053416
9088A6306373J159897J271117J430273J602704J743696J896503K168684K448957
$$ y = [1584733, 1624934, 1697861, 1807745, 1818927, 1767495, 1712727, 1681907, 1696027, 1812661, 1848097, 1898990, 1937155, 1947123, 2029966, 2091889, 2100822, 2132097, 2189313, 2229596, 2276771, 2282204, 2356240, 2407832, 2393964, 2444362, 2543078, 2576270, 2593529, 2633853, 2700862, 2753484, 2828709, 2947037, 3013722, 3119731, 3233536, 3291844, 3348140, 3426041, 3505817, 3638070, 3820165, 3914897, 4034156, 4201024, 4381711, 4501904, 4651267, 4872161, 5030842, 5224711, 5461097, 5665344, 5892286, 6192301, 6432338, 6653179, 6926736, 7198447, 7525353, 7881330, 8351027, 8840132, 9362344, 9890930, 10463041, 11177762, 11911396, 12656655, 13454448, 14316112, 15252957, 16306373, 17466270, 18737387, 20167660, 21770364, 23514060, 25410563, 27579247, 30028204]
9080C0028204K768497L134226L440442L975000M609061N226298O036034P031520
9072F6249282Q249418R696160J1497231J3452074J5565566J7795284J9850851
9065A62355866K1024602K0891589J8962953J5002392R131634K087572m952961
9058B44503647j1017878j5338737j7582812j8083528j7304732j5841156j4137404
9051A35197400j2352106j0810301r463051q271634p302614o528672n775128n160419
9043F9533475m709720m274719l814522l501460l209609k917071k714072k542067
9035D1850235k334354k042617j907474j797618j706067j591525j506780j379525
9027B7584275j204821j126480j051562j042873r53258q93220q77803q69371p27847
$$ y = [30028204, 32796701, 35930927, 39371369, 43346369, 47955430, 53181728, 59217762, 66249282, 74498700, 84194860, 95692091, 109144165, 124709731, 142505015, 162355866, 183380468, 204272057, 223235010, 238237402, 247369036, 249456608, 244503647, 233485769, 218147032, 200564220, 182480692, 165175960, 149334804, 135197400, 122845294, 112034993, 102571942, 94300308, 86997694, 80469022, 74693894, 69533475, 64823755, 60549036, 56734514, 53233054, 50023445, 47106374, 44392302, 41850235, 39515881, 37473264, 35565790, 33768172, 32062105, 30470580, 28963800, 27584275, 26379454, 25252974, 24201412, 23158539, 22205281, 21312061, 20434258, 19564887, 18837040]
9018A8837040p18030o74925o41138o02832o15603n12753m87176m79515m81428
9009A3623640m32173m06013m04013l65151l74440l69948l31490l50741k81183
9000A0308488l70529l06129k86767l27360k93461k93522k76247l06890k70738
8991G576845k65366k10879k31579k53381l05791k54391k72183k30280k25463k15377
8981E112155k22007k14056j36961j51837j74507j78303j84873j70637q9886m7581
8971C541507j46528j75127o0269p5059r8494r0578r6532j51485r5374j17372l8850
8960B395839n046k0501m8956r8504n9675J0777l1345n6459j36660o5486K2532
8949A906516M4942L4244o2432j08804r3444q467k9177o9862q4575m8454L0294
$$ y = [18837040, 18119010, 17444085, 16802947, 16200115, 15584512, 15071759, 14584583, 14105068, 13623640, 13191467, 12785454, 12381441, 12016290, 11641850, 11271902, 10940412, 10589671, 10308488, 9937959, 9631830, 9345063, 9017703, 8724242, 8430720, 8154473, 7847583, 7576845, 7311479, 7100600, 6869021, 6615640, 6309849, 6055458, 5783275, 5552995, 5327532, 5112155, 4890148, 4676092, 4539131, 4387294, 4212787, 4034484, 3849611, 3678974, 3589088, 3541507, 3394979, 3219852, 3159583, 3084524, 2986030, 2895452, 2798920, 2647435, 2552061, 2434689, 2395839, 2390793, 2370292, 2321336, 2222832, 2163157, 2173934, 2142589, 2086130, 1949470, 1883984, 1906516, 1951458, 1985702, 1923270, 1814466, 1721022, 1712555, 1683378, 1613516, 1528941, 1480487, 1510781]
8938A510781N4657M136l9576j8717n1973j3956K1106P546o1478l6431K8599k8479
8926A376215l7338o1198Q6561N7026m3799o6668K0204M1370K8252O3963n407n1078
8914A408103l5292p2908k7674J535M1843L2177k1997l8515j2354n0797j8100p84
8902A205237N2020j9674L3485m9432p0013k0064K6583L3810K1827k6501l3054
8891A154224l7100k2001P699k0760j1876k691j8624p3550r821R30N8653n325k7868
8878I91890Q9702M6490L1616M0167P461o3375n5939O930l1558K1282k2879o0167
8866A001620N0009L741r723r981n0552l3057l2521p535k8481j5089j4293Q029
8854H62167n0K0352j8634q3177m7512J4249K2790L7966J5084q4232k6136p2404
$$ y = [1510781, 1565438, 1569574, 1529998, 1511281, 1459308, 1445352, 1466458, 1474004, 1412526, 1376095, 1404694, 1376215, 1338877, 1277679, 1364240, 1421266, 1377467, 1310799, 1331003, 1372373, 1400625, 1464588, 1459181, 1408103, 1372811, 1299903, 1272229, 1273764, 1315607, 1347784, 1325787, 1287272, 1274918, 1224121, 1206021, 1205237, 1257257, 1237583, 1271068, 1221636, 1151623, 1131559, 1158142, 1191952, 1213779, 1187278, 1154224, 1117124, 1095123, 1102822, 1082062, 1070186, 1067495, 1048871, 975321, 965500, 966430, 1025083, 1019758, 991890, 1081592, 1128082, 1159698, 1199865, 1207326, 1143951, 1088012, 1094942, 1063384, 1084666, 1061787, 1001620, 1051629, 1055370, 1045647, 1035666, 985114, 952057, 919536, 912001, 883520, 868431, 854138, 862167, 862117, 882469, 863835, 780658, 733146, 747395, 770185, 808151, 823235, 739003, 712867, 640463]
8842F40463q7436r2816q569N6998N2246n2316o9967N1305M4647k0645J552M945
8830E20407J566J7507j9928j2564n0375o65O1690k0927j8234k7880n4286N413
8818D01724K3661J1509p845j0191J5580m5343k3870O3746J33702P5234J42n3614
8806E84435j4459L4401k5730L7799m4828p20p4692J6748N1666j3999o8466P605
8794D89760k4376k1l5555J0885J1416J8090n6256m898J7733L0496l5753L4419
8782D55940J5158K081n6901p4882K2552N1946K6937N5834N261l2485l5428p5962
8770C60051j0424q401m8924J1730M380L3969N864j2272k6879n76M9848J1279J8336
8757C87981o1522n3557L7155m875r0535K5481k0399j7759J9452M0845J5734L6434
$$ y = [640463, 553027, 460211, 451642, 508640, 560886, 508570, 438603, 489908, 534555, 513910, 515462, 520407, 521973, 539480, 519552, 506988, 456613, 455948, 517638, 496711, 478477, 450597, 396311, 401724, 425385, 436894, 429049, 418858, 434438, 389095, 365225, 428971, 562673, 637907, 638049, 584435, 569976, 604377, 578647, 616446, 571618, 570898, 496206, 512954, 564620, 550621, 482155, 489760, 465384, 465363, 429808, 440693, 452109, 470199, 413943, 409045, 426778, 457274, 421521, 455940, 471098, 473179, 416278, 341396, 363948, 415894, 442831, 498665, 503926, 471441, 436013, 360051, 349627, 341226, 292302, 304032, 308412, 342381, 348245, 335973, 309094, 308518, 358366, 369645, 387981, 326459, 272902, 310057, 305182, 214647, 240128, 219729, 201970, 221422, 262267, 278001, 314435]
8745C14435J5297l5262k8389m7760R807J12066j9085P808k9371k1934j5944p5213
8733A86455o876J02291N4218M220J4339m8228j0432K2209l5070l6738k5118M273
8721B25543q541q395M1866L3379j5609j2615m047J7034l0723N1854p784n1263
8709B30699j1030N0098J1472k9977K3489Q3566J3530p9258q4284L6193k7366p248
8697B09884J5412l2893m1443K5519J29312J8720n2752K5592P887j7724K3793k1720
8685B89587j177O108J899k1764o1692l4812j7919k8086j0399O7590K7618k12j3929
8672B02812L8821r499l202m7396l6074p338o875M2515M1690m5225p899K3120P809
8659A93259p539k7477k7079m4653r180R6463J3201J1230l0422k6112J2143j1772
$$ y = [314435, 329732, 294470, 266081, 218321, 228128, 340194, 321109, 328917, 299546, 277612, 261668, 186455, 179579, 281870, 336088, 340308, 354647, 306419, 295987, 318196, 283126, 246388, 221270, 225543, 217002, 208607, 250473, 283852, 268243, 255628, 251581, 268615, 237892, 289746, 281962, 230699, 219669, 269767, 281239, 251262, 274751, 358317, 371847, 292589, 208305, 244498, 217132, 209884, 225296, 192403, 150960, 176479, 305791, 324511, 271759, 297351, 305238, 287514, 311307, 289587, 288410, 294518, 296417, 274653, 212961, 178149, 160230, 132144, 121745, 189335, 216953, 216741, 202812, 241633, 232134, 228932, 181536, 145462, 138124, 131249, 173764, 215454, 170229, 162330, 185450, 193259, 185720, 158243, 131164, 86511, 77331, 173794, 186995, 198225, 167803, 141691, 153834, 142062]
8647A42062J7480q789K1129L404k1172k6602O7723N6991n4374o3196j0631J8621
8635A42646J894L7085K5408K6563R973j381K9297O0776l1835k2980j8097n6250
8623B03099M2179Q5147J8291j0446J1906j806k577k5378l2746l3097n1249l6882
8611A66441K3758J19800O3697k1013l496l6082q272m1279j07989j995k329Q293
8599A59534p786J7712O7184n7843n6652M3041p23N6707L4990k7874n3259l06j5708
8586A59017J2063M5029o94J7612l075k8319n8952o605N7549J8730K2686N0758
8574B85799n9934o5425K4802J9701o0638l0818j0658K4865M0598j4334q6691N2423
8562A19690N8384P2550r987M726K2832m0809n9376r699j2142m1332r626L0239
$$ y = [142062, 159542, 150753, 171882, 175286, 154114, 127512, 195235, 252226, 197852, 134656, 124025, 142646, 144540, 181625, 207033, 233596, 243569, 242188, 271485, 332261, 300426, 277446, 259349, 203099, 245278, 330425, 348716, 338270, 350176, 348370, 345793, 320415, 287669, 254572, 203323, 166441, 190199, 309999, 373696, 352683, 349187, 313105, 304833, 263554, 155565, 153570, 151241, 159534, 151748, 169460, 236644, 178801, 122149, 165190, 164467, 221174, 256164, 228290, 175031, 174725, 159017, 171080, 216109, 215415, 233027, 229952, 201633, 142681, 136076, 193625, 212355, 235041, 285799, 225865, 160440, 185242, 204943, 144305, 113487, 102829, 127694, 168292, 153958, 67267, 119690, 178074, 250624, 240637, 245363, 268195, 227386, 168010, 158311, 146169, 104837, 95211, 125450]
8550A25450K3586J3385r04J400l3871j3898Q0705M3138J8753j8091m8779q8967
8538A01907M335N200L2783M62k109Q554n881k5480l6010j6990K3393N038N205
8525A00407K9194K8949K2528m8212n6196j2375K5635J1369k5063K7448N7592k5485
8513A35791j9304K6255k4522K4085M443j2792P423J8109Q710L0187n279l6481
8501A56625o763N475l9439J2751Q3134n2823l0953L557o6259n500M386J2063J5836
8488I2090k1270n4241M8270L9823O043j5802p223K9520N251p0484r4307Q8581
8476D6251O4518l8681N0508K6796j8684J9518m904R941p2097n5233n1425K6343
8464B851N5474P82l6341P4682r379k4488N8527L4330k3778m1312n9014K1070L2817
$$ y = [125450, 149036, 162421, 161517, 162917, 129046, 115148, 195853, 238991, 257744, 239653, 190874, 101907, 106242, 111442, 144225, 144687, 142578, 151132, 145251, 119771, 83761, 66771, 90164, 95202, 100407, 129601, 158550, 181078, 132866, 76670, 64295, 89930, 101299, 76236, 103684, 161276, 135791, 116487, 142742, 118220, 142305, 146748, 133956, 141379, 159488, 168198, 198385, 193106, 156625, 149862, 155337, 115898, 128649, 211783, 158960, 128007, 131564, 65305, 59805, 64191, 76254, 92090, 70820, 16579, 64849, 104672, 110715, 94913, 87690, 117210, 122461, 51977, -42330, 46251, 110769, 72088, 122596, 149392, 130708, 150226, 145322, 155263, 83166, 27933, -23492, 2851, 58325, 59107, 22766, 97448, 88069, 63581, 122108, 156438, 132660, 91348, 32334, 53404, 86221]
8451H6221J1374J0794j9228k0332k0555J3563O1113J5612L912j3693l3441j6290
8439G9050K7312k1576M6073L141k6856N895J6581M6062k2360j3692j4101m0583
8427H4946m2771M5628O0199L4637o1933j1972N3891p6799k7758Q065K1877l7052
8415E0958k7245k6951m72K9190k7319K7300L2558L5086R660l3968m2105J8900
8403D5592m1572k2313K9219N3192L7472L1863L3870k9168n5915r1644l7666L5352
8391a1718J6421K7966N212l5010n7570l444Q2577M0095M4475J4402J6479l556
8379A36329K8268r414L0785L4506k4654N390o2505r3662j22087Q284O5298K966
8367d96J6057N4335k4662r600L7629O1909n133J1710k6512k6005M0593N381L3759
$$ y = [86221, 97595, 108389, 89161, 68829, 48274, 61837, 122950, 138562, 142474, 128781, 95340, 79050, 106362, 84786, 130859, 134000, 107144, 113039, 129620, 175682, 153322, 139630, 125529, 84946, 42175, 87803, 148002, 182639, 120706, 108734, 162625, 85826, 58068, 66133, 88010, 50958, 23713, -3238, -3710, 25480, -1839, 25461, 58019, 93105, 102765, 68797, 26692, 45592, 4020, -18293, 10926, 64118, 101590, 133453, 167323, 138155, 82240, -9404, -47070, -11718, 4703, 32669, 37881, 2871, -54699, -58143, 24434, 64529, 109004, 123406, 139885, 136329, 164597, 155183, 185968, 220474, 195820, 201210, 138705, 45043, -77044, -68760, -3462, -496, 15561, 69896, 45234, 35634, 73263, 135172, 130039, 141749, 115237, 89232, 129825, 135206, 168965]
8354A68965K5639k4783k115J687m26m951j0540l9053l1973l4148j1093O603p68
8341D3044P6685N239m8074j7125J9890L3207j5883r5987Q644K8122k4311K6545
8329C9996J8362J6541K5609K213K8743k933o7381o581M8877J9670L830M766K6078
8316A57790j1516j00584l5953q982K0174p4170o5134N4650N4648Q4732O8209k9381
8304A14483q1679m5357o0924L4593M6601O8236j1013M9151K5391k5136J0663Q3031
8292B08040K5868l7409m8694n9537O3L4493j58k6197l1072o2448J7373J0159j7252
8279A3229M4922M8964o652j1575m1337n2875L6337L7015K1480k7909m2920n99
8267A8080l5824n3543K2065N3006l6238J0544j1089l0379R3543N3457j2268L9754
$$ y = [168965, 194604, 169821, 167706, 169393, 168967, 164016, 153476, 114423, 82450, 48302, 37209, 43812, 43044, 119729, 124968, 76894, 59769, 79659, 112866, 96983, 996, 9640, 37762, 13451, 39996, 58358, 74899, 100508, 102721, 131464, 128531, 61150, 54569, 103446, 123116, 126946, 131712, 157790, 146274, 45690, 9737, 755, 20929, -53241, -118375, -63725, -9077, 75655, 143864, 114483, 32804, -12553, -73477, -38884, 7717, 75953, 64940, 114091, 139482, 114346, 125009, 208040, 233908, 196499, 147805, 88268, 88331, 122824, 122666, 96469, 65397, 2949, 20322, 30481, 13229, 58151, 107115, 100463, 88888, 47551, -5324, 31013, 68028, 89508, 61599, 18679, 18080, -17744, -71287, -49222, 3784, -32454, -21910, -32999, -63378, 30165, 83622, 71354, 111108]
8255A11108L2936L2905m8692J3191M4268K8130p5640k4046Q944k163O6L724Q213
8242A32944o7520o3014P914J07437M2641m1298o1129L2077K9788K1480k0814k8518
8230I1988L138J4828N427p1267R264n7821R499R1262k5643q1728m5178J7524N8038
8217A9331N4847K2577n97m542k2129M796n8664J9961J7726J589j4057k5131K9029
8204D4736m2893K7245o059n6748Q192l721J1563o765O9903L9466K5573k0923l2324
8191E7245n3693L1144k1146o3069q275L5976P8394j7686k1337r533L17l343k4098
8178a9104K4527O4806r031l2353J1804K4392J7310R232k4539m2494N191l729P034
8165C3046L2594N0398l9615k2181r789K0584m0623L9444K5672M0073l5231J5215
$$ y = [111108, 144044, 176949, 128257, 141448, 185716, 213846, 138206, 114160, 123104, 120941, 121007, 124731, 132944, 65424, 2410, 10324, 117761, 160402, 119104, 57975, 90052, 119840, 141320, 120506, 91988, 95126, 109954, 115381, 44114, 53378, -4443, 5056, 96318, 70675, -11053, -56231, -38707, 19331, 74178, 96755, 96158, 91616, 69487, 74283, 15619, 35580, 53306, 54895, 40838, 15707, 44736, 1843, 29088, 23029, -33719, -25527, -29248, -17685, -24450, 45453, 84919, 110492, 89569, 57245, 3552, 34696, 13550, -49519, -57794, -21818, 56576, 38890, 17553, 8020, 8337, 4994, -19104, 5423, 70229, 61198, 28845, 40649, 65041, 82351, 91583, 67044, 24550, 29741, 26012, 33046, 65640, 116038, 76423, 54242, 44453, 65037, 24414, 63858, 89530, 129603, 94372, 109587]
8153A09587n9179n9128K6474k4733M7249N1294P928p399R643j7725M4558q931
8141A19638o589m9566k9475l7188L1507P2402r1190p407M5434K5056k9868l504
8129C9250k1739k405L8011J1264m4666j5389L4922K083J4467R271l0290k6604
8117H175p529J2224o883J8314J5844J9020K7044l8784q420k156k3193k1361k0460
8104b8165J6282j15J8163Q981M466J8877L9824L603n6677p613L2552K6475J3882
8091I0535L8502k3074k1421r872K7794K145o666l5519J3114K2210n3189J2177
8079E6736L9470l4579l9129n407m7243k184O4986j7793m113o6156L8117J01499
8067H4204O2335j3295n2388m632J0952k647j711M1482r1423p1625M415o275L2862
$$ y = [109587, 50408, -8720, 17754, -6979, 40270, 91564, 99492, 92093, 101736, 84011, 128569, 119638, 113049, 63483, 34008, -3180, 28327, 100729, 9539, 2132, 47566, 72622, 42754, 39250, 17511, 15106, 53117, 64381, 19715, 4326, 39248, 41331, 55798, 65069, 34779, 8175, 646, 12870, 5987, 24301, 40145, 59165, 86209, 47425, 39005, 36849, 13656, -7705, -28165, -11883, -11998, 6165, 15146, 19612, 38489, 78313, 81916, 25239, 17626, 50178, 76653, 90535, 129037, 105963, 84542, 74670, 102464, 104609, 97943, 62424, 75538, 97748, 44559, 56736, 96206, 61627, 22498, 17091, -30152, -32336, 32650, 14857, 10744, -55412, -17295, 84204, 146539, 133244, 80856, 76224, 87176, 84529, 82818, 124300, 32877, -38748, -34333, -40608, -7746]
8054g746K1478M922J8101M600O9592J910j2854m6927m6550J8589N6269L3174K988
8041A17546q7878k5811P8593J1786j7853J7590k4508m1135m3227j6357J8588J9618
8029F952Q941J5337K0901P884k4540r512k4806J8990l5073O158L8200j4926K5805
8016D0311M117Q983K8328p0634o9988j96N5698O2313J5180j1518L0864q437o1547
8003B3474j8372l5197O578L6144L3937l5283M9849N4910L8257Q140l686k6316
7991A32435j9076o1880M9905Q0159J6666l6562n7778j8903l6944l5333L1244K361
7979D6294K8847M9381N0302M37k3156n2633k0548J0892m3842J6891L6746O4075
7967A63686J1718k5078J3123m663k4228Q4752j0644P792k7129K1459j8780l9733
$$ y = [-7746, 13732, 18654, 36755, 41355, 110947, 112857, 100003, 53076, 6526, 25115, 81384, 114558, 117546, 29668, 3857, 82450, 94236, 76383, 93973, 69465, 28330, -14897, -31254, -12666, 6952, 15893, 31230, 52131, 60015, 35475, 25963, 1157, 20147, -14926, -8768, 29432, 14506, 40311, 44428, 53411, 81739, 11105, -58883, -59079, -3381, 58932, 74112, 62594, 93458, 85021, 23474, 5102, -30095, -23517, 12627, 46564, 11281, 61130, 116040, 154297, 162437, 158751, 132435, 113359, 51479, 101384, 181543, 198209, 161647, 103869, 84966, 48022, 12689, 43933, 46294, 75141, 124522, 174824, 175261, 152105, 99472, 78924, 89816, 45974, 62865, 99611, 163686, 175404, 150326, 163449, 158786, 134558, 219310, 208666, 216458, 189329, 210788, 192008, 152275]
7955A52275k2985m8261m7540M101M7937M8343m2927l0119K3693K5421J39n2744
7943E7333L2247L7377j9497K2854K4750m6742Q842P6115M6522n4499m1778l4940
7931A08584l5768m8062M0639O2416Q4500j9190m8690k189p0455J4768N3202p999
7919A31756r75R524n8207k6572k9129O131o786j9563j8233O225n2031O7254O3801
7906G3195K6432m0754j2418p359K28L0979l2062n1622P8666N0404K9658M202k0424
7893A29125P183R658Q028p6384n6432K6903K9511r977O451l7140m366j0071r909
7880A2580j645P0115K2022p1009q552L3998N6744M9839o0464o0783l931L420L8295
7867H0629l139j2562J8066n627k2673L333j6914m5083M3324K3959M6334p00L4075
$$ y = [152275, 129290, 81029, 33489, 37590, 85527, 133870, 90943, 60824, 84517, 109938, 110077, 57333, 89580, 126957, 107460, 130314, 155064, 108322, 117164, 193279, 239801, 185302, 143524, 108584, 72816, 24754, 65393, 127809, 212309, 193119, 144429, 142240, 71785, 86553, 139755, 131756, 130781, 140305, 82098, 55526, 26397, 32528, 25742, 6179, -12054, -5829, -57860, 9394, 73195, 99627, 58873, 46455, 39096, 39324, 70303, 38241, -13381, 65285, 115689, 145347, 149549, 129125, 136308, 145966, 153994, 77610, 21178, 48081, 77592, 67615, 74066, 36926, 32560, 22489, 12580, 10935, 81050, 103072, 32063, 23511, 57509, 114253, 164092, 103628, 42845, 38914, 42334, 80629, 77490, 64928, 82994, 77367, 54694, 58027, 41113, -3970, 39354, 63313, 109647, 108947, 143022]
7854A43022K5889n5785m145m703L6039m4615q1610J3358N2623k5996j8043n190
7842C0844K344M6109j3495j10547j6521N981K7531o662l3097L630J3731M09J3051
7829c6692L4208N2346j2122k0505J1721N460l2309n9771J4007O4682Q7666m7778
7817F0913m4434K5846r692m9822l7242Q3402O2582n9215m7681K5483Q2008K2648
7805A14796m9542K2368p1995l2882J7576L0599j2736k6840j3810K4525q949j0778
7793a7668L9389P5398l7206n412m9514P191P297k0732M0533J9908J3037O2220
7781A34441M4284o1549o4569k6596j5880n842P878K4019J1945N849l4493k4486
7769d999M66J7202K6111j9737M5229k135m2679O2445J1895j3480l7425j8080j5100
$$ y = [143022, 168911, 113126, 108981, 104278, 140317, 95702, 14092, 27450, 80073, 54077, 36034, 30844, 33188, 79297, 65802, -44745, -61266, -55285, -27754, -34416, -67513, -63883, -50152, -49743, -36692, -2484, 49862, 37740, 17235, 28956, 34416, 2107, -57664, -43657, 21025, 108691, 60913, 16479, 42325, 32633, -17189, -54431, 28971, 91553, 32338, -15343, 10140, 92148, 114796, 65254, 87622, 15627, -17255, 321, 30920, 18184, -8656, -22466, 2059, -6890, -17668, 21721, 97119, 59913, 54501, 4987, 12178, 19475, -1257, 39276, 59184, 72221, 134441, 178725, 117176, 52607, 26011, 10131, 4289, 12167, 36186, 48131, 53980, 19487, -4999, -4533, 12669, 38780, 19043, 64272, 62137, 19458, 81903, 93798, 80318, 42893, 24813, 9713]
7756I713l477J1598k4018k919N1104K9221O581m8206l87J2185q2079q9422N6125
7743g3981M4064O6432J8073K868k2340j0667J1632L4760K0596l2686m8383K067
7731A2435j3490j6237J302o1390O606J0839p303M9020L336R84n43L1102N1763
7718F8424J5313j2860n9919j9468k8902k3370n5235M7366M5899P7680r755n4435
7706i262K0737j0191l4961J5606k7290L6635o989j6033q281K8751J9637l1925
7694b3566j5122J7984q334k5759k7729j4576q349K1698J9935l7280m188J16394
7682A1108O2109K3184m4606q2315o6274j688q439Q995J5323K1250l6465K1692
7670g6126N7537l2408k7259M7072P0915O3504k0085m9893p4267l3837m717P1443
$$ y = [9713, 6236, 17834, -6184, -9103, 42001, 71222, 77803, 29597, 29210, 41395, -40684, -130106, -73981, -29917, 36515, 54588, 57456, 35116, 24449, 36081, 70841, 91437, 58751, 10368, 12435, -1055, -17292, -15990, -77380, -70774, -59935, -67238, -18218, -14882, -13898, -14441, 16661, 68424, 83737, 70877, 10958, -8510, -37412, -60782, -116017, -68651, -22752, 54928, 45173, -9262, 11475, 1284, -33677, -18071, -45361, -8726, -15715, -31748, -40029, -11278, 8359, -23566, -38688, -20704, -29038, -54797, -82526, -97102, -105451, -83753, -63818, -101098, -105286, 11108, 73217, 96401, 51795, -30520, -96794, -98482, -106921, -97926, -82603, -61353, -97818, -76126, -18589, -50997, -78256, -31184, 39731, 103235, 83150, 33257, -41010, -74847, -79564, -8121]
7658h121o118n5940r276p83j077k9176M1860O7001m5358o6390J3412J24869k3898
7645A005l7372j4626J9233N4013J3525n691n821J2779j0591k0786l2518j5954
7633d2804k5396N8894O0855l1328o4675k7612k4909K1812L5618P320J8768L5960
7621B2503j7333M6111K7672j6026o1984J9216K2291O764J8861M7701K2638l1067
7609A07347m5777j38l3635j0134L080J9285j2263m7589k8700M7622J8337M3536
7597F0971K8979o870n2202k6527M5544L1808o392l9679l6288K0426K4588l0171
7585A4187l8068j31R442N001L6476l1888r964j6758k0251m3882J4920m421N009
7572h0328N5401K1910J3761Q2050L042n1019n0760J6379M1179K1884n5422k1658
$$ y = [-8121, -14239, -70179, -79455, -80238, -81315, -110491, -68631, -1630, -46988, -113378, -99966, 24903, 1005, -36367, -50993, -31760, 22253, 35778, 30087, 24266, 37045, 26454, 5668, -26850, -42804, -68200, -9306, 51549, 20221, -44454, -72066, -96975, -75163, -39545, -32225, -13457, 22503, 5170, 51281, 78953, 62927, 943, 20159, 42450, 49214, 68075, 115776, 138414, 107347, 61570, 61432, 27797, 17663, 20743, 40028, 27765, -19824, -48524, -902, 17435, 60971, 89950, 83080, 30878, 4351, 49895, 81703, 75311, 35632, -656, 19770, 44358, 14187, -23881, -24012, -14570, -9569, 26907, -4981, -14945, -31703, -51954, -95836, -80916, -85337, -80328, -24927, -3017, 10744, 92794, 95836, 44817, -5943, 10436, 51615, 73499, 18077, -3581]
7560c581N648N4265J1586o3191K5376m9166n3940q384j102L6137M1689L9412J4120
7547D8869P952o7905r0765L673M7975j792J5291O2711J3852m4920N906J3933M4110
7534E8890O778n860O0912l7361k9556m1476l8924n6900j4785J0016L8435Q1582
7522C1751J04015k1160q252k3493m356k8597k4849l0348L565N814J050j1302k9160
7509c5322R21j4073J400K0768N5637o501J4341j585m485J6844n2711p1122J6746
7496e9142N8085L820L7533l678k2882o2906j6308Q805o572J3579J6892K8575k1461
7483b5660K2374k7092o0575j03218K3320J01945Q223k1298n7345K1117K2552L3827
7471f1830M8430K2386R209j5841j5244n0068K1245J3898M1875K43l9276M7257
$$ y = [-3581, 2067, 56332, 67918, 4727, 30103, -19063, -73003, -81387, -82489, -46352, -4663, 34749, 48869, 56821, -11084, -101849, -98176, -50201, -51993, -36702, 26009, 39861, -5059, 847, 14780, 58890, 65668, 59808, 120720, 83359, 53803, 12327, -26597, -83497, -98282, -88266, -49831, 31751, 135766, 114606, 106354, 82861, 78505, 49908, 25059, -5289, -1724, 4090, 5140, -6162, -35322, -34401, -48474, -47074, -26306, 29331, 22830, 37171, 35586, 31101, 47945, -4766, -75888, -59142, -1057, 2763, 40296, 36618, 13736, -49170, -65478, -56673, -63245, -49666, -32774, -4199, -25660, -3286, -30378, -90953, -194171, -170851, -68906, -60683, -81981, -139326, -118209, -95657, -61830, -13400, 8986, 18195, 2354, -12890, -62958, -41713, -27815, 14060, 14303, -24973, 22284]
7459B2284j4098p8045K5296J17245N1033l6252m5259o3778O3515k4476l9083j7514
7447c9132J1714k592Q051j1997j4569K6004L8902J6621k1086j6518K788J8026
7435A6212j5427M8925l2344j20019M2185P8953l5736k3047L8619j7550m6227Q312
7423e7144M3466J2150K4791J231n4921j7390P319Q944l2853k9596K1338L4394
7411c8271L6564K414J3632L0414J4239m5131M2421q871j299J110p0823o9656k4962
7398a18219P3109o857r700k3292M7340K2592O0748K066o552l7497K4562m7188
7386a8888j7678Q1635P2011o6079p6061R884j3236k6382k8669m6341N5518o46
7374g4932o1191J5254J9090M733K7118j5515K7161O1975L6030L7359j1974l1886
$$ y = [22284, 8186, -69859, -44563, 72682, 123715, 87463, 42204, -21574, 41941, 17465, -21618, -39132, -27418, -30010, -21959, -33956, -48525, -22521, 16381, 33002, 11916, -4602, -1814, 16212, 785, 49710, 17366, -102653, -60468, 18485, -17251, -40298, -1679, -19229, -65456, -57144, -13678, -1528, 23263, 24494, -30427, -47817, -40498, -31554, -64407, -94003, -72665, -38271, -1707, 707, 14339, 44753, 58992, 13861, 56282, 47411, 46112, 47222, -23601, -93257, -118219, -45110, -51967, -61667, -84959, -37619, -15027, 45721, 47787, 41235, 3738, 28300, -18888, -36566, 45069, 117080, 51001, -25060, -15176, -28412, -54794, -83463, -129804, -74286, -74932, -136123, -120869, -101779, -97046, -69928, -85443, -58282, 3693, 39723, 77082, 65108, 33222]
7362C3222k3896n1300q243L0951M0592O4345k0379p3088m654J6485n0791o02m9550
7349i6908L2019N3791M371P8984m7735o1757O833L8375o6103K712J00392J24700
7337A69674m2257n9400n3736o3193o5635L5368R0882j4229l350k6666L3630m4108
7325d3020k7892L0925j2591m1041j753J4370j1444K6259j401k995p250l0197P1395
7312c6635J5557n803J0671M5194J9383M5521q644n0860n8461m8808n273J7273
7300f0885J6066k3743j6091l6817p794P5780M4798M3420r991J6857M8110J0654
7288A00364j9501K061J3174l5481l5820o433n5827m1336J4823L1479k4278l7484
7276i4259N5012L7990k7100o2956J9958O6333L3695k4913l0286Q854O7507K5117
$$ y = [33222, 9326, -41974, -50217, -19266, 21326, 85671, 65292, -7796, -12450, 4035, -46756, -47358, -96908, -64889, -11098, -6727, 72257, 24522, -37235, -30402, 7973, -58130, -55418, 44974, 169674, 127417, 68017, 14281, -48912, -114547, -79179, 11703, -2526, -5876, -32542, 1088, -43020, -70912, -39987, -52578, -93619, -95372, -81002, -92446, -66187, -67588, -70583, -77833, -108030, -36635, -21078, -26881, -16210, 28984, 48367, 93888, 85244, 34384, -24077, -72885, -78158, -60885, -44819, -68562, -84653, -121470, -129264, -53484, -8686, 34734, 24743, 41600, 89710, 100364, 80863, 82924, 96098, 60617, 24797, 18364, -37463, -78799, -63976, -32497, -56775, -94259, -39247, -1257, -28357, -91313, -71355, -5022, 28673, 3760, -26526, -17672, 49835, 74952]
7264G4952l2429J9303K7511n1418k3709N7817J0464j2036k3249n019L9632J3039
7252I4858j2975m3436j9243j3756k9395J6213L2484j50j08230l4643q47P6129
7240d2991K6464J9463k0773J1787k6431o5903l1172L8197M3819K9703k8272l0125
7228g6234L7421Q4502L4273q8281k5140K3347J6714k8722P34J2355j4239J1856
7216a1414P320m2083M2085L4176k6053N735k0950L9379J0609o4596n4502P8940
7204a354P5223o2262o9990k1737j151M6351Q272J9923N2751j3580l0283p3328
7192g1165n7435j6073k1196Q0570O4828L5645k3619k9747j4519M339L1241M0780
7180B3649l3230l8076K7543l8506j1224K2825M870j3430n935J6746N0188L3830
$$ y = [74952, 42523, 61826, 89337, 37919, 14210, 72027, 82491, 70455, 47206, 42187, 81819, 94858, 81883, 38447, 19204, 5448, -23947, -7734, 24750, 24600, -83630, -118273, -119120, -42991, -16527, 2936, -17837, -6050, -32481, -98384, -129556, -91359, -47540, -17837, -46109, -76234, -38813, 45689, 79962, -8319, -33459, -10112, 6602, -22120, -21386, -9031, -23270, -11414, -4094, -46177, -4092, 30084, 4031, 9766, -11184, 28195, 38804, -25792, -80294, -1354, 73869, 11607, -58383, -80120, -81271, -34920, -26648, -6725, 46026, 32446, 2163, -71165, -128600, -144673, -165869, -85299, -20471, 15174, -8445, -38192, -52711, -48372, -17131, 23649, -9581, -47657, -20114, -58620, -69844, -47019, -42149, -55579, -61514, -44768, 5420, 39250]
7168C9250K6767j5648K364m976N698k4916k7331K9178L3146j0419J8499n8762
7156A2850r8932m8506K711K7453O8506N4413n0055k8468p616o339K4637N4593
7144E247P2417l443L7775J136j6341J7075K3233J8170K7118q3632k9532q8643
7132a9420m8963J8572L4233J3116J5742L2202j5711o847J9739Q440n9185k5719
7120c3801j0110j5672j612J3938J0968N3502N329m5838l352M0168N837L1139j1903
$$ y = [39250, 66017, 50369, 52733, 47757, 53455, 28539, 1208, 30386, 63532, 53113, 71612, 12850, -86082, -134588, -131877, -104424, -35918, 18495, -31560, -60028, -67644, -73983, -49346, 5247, 77664, 74221, 111996, 113132, 96791, 113866, 137099, 155269, 182387, 98755, 69223, -19420, -68383, -49811, -15578, -2462, 13280, 45482, 29771, 22924, 42663, 51103, -8082, -33801, -43911, -59583, -61195, -47257, -36289, 17213, 22542, -23296, -26648, 13520, 19357, 50496, 38593]
$$ [...]
##END NTUPLES=NMR SPECTRUM
##END=
