##TITLE=Analysis number 320053
Compound Code cc 48604
Book Reference 483/26/4
Project Code adrs
Chemist Name mattw
##JCAMPDX= 6.0         $$ Bruker NMR JCAMP-DX V2.0
##DATA TYPE= NMR SPECTRUM
##DATA CLASS= NTUPLES
##ORIGIN= Bruker BioSpin GmbH
##OWNER= nmr
$$ XWIN-NMR		Version 3.5
$$ Mon Jun 12 10:49:45 2006 GMT Daylight Time (UT+1h)  MAYBRIDGE\nmr@NMR_250MHZ
##.OBSERVE FREQUENCY= 250.131544655141
##.OBSERVE NUCLEUS= ^1H
##.ACQUISITION MODE= SIMULTANEOUS (DQD)
##.ACQUISITION SCHEME= undefined
##.AVERAGES= 16
##.DIGITISER RES= 18
##SPECTROMETER/DATA SYSTEM= dpx250
##.PULSE SEQUENCE= zg30
##.SOLVENT NAME= CDCl3
##.SHIFT REFERENCE= (INTERNAL, CDCl3, 0, 16.522)
##AUDIT TRAIL= $$ (NUMBER, WHEN, WHO, WHERE, WHAT)
$$ ##TITLE= Audit trail, XWIN-NMR		Version 3.5
$$ ##JCAMPDX= 5.01
$$ ##ORIGIN= Bruker BioSpin GmbH
$$ ##OWNER= nmr
$$ C:\u/data/dgb/nmr/ADRS/510/pdata/1/auditp.txt
$$ ##AUDIT TRAIL=  $$ (NUMBER, WHEN, WHO, WHERE, WHAT)
(   1,<2006-06-12 10:48:59.73 +100>,<MAYBRIDGE\nmr>,<NMR_250MHZ>,
      <created by zg, POWCHK disabled, PULCHK disabled
       configuration hash MD5:
       E2 DF 36 D8 04 B2 41 60 5A D7 A3 38 5A 4B D0 FE
       data hash MD5: 64K
       60 86 5D ED 05 29 9C AA EE FA AB 5E FC 27 18 1F>)
(   2,<2006-06-12 10:49:18.12 +100>,<MAYBRIDGE\nmr>,<NMR_250MHZ>,
      <Start of raw data processing
       ef LB = 0.3 FT_mod = 6 PKNL = 1 SI = 32K 
       data hash MD5: 32K
       D7 1A A5 B4 B4 0F 8E 93 7D DB DE 86 24 C3 88 AD>)
(   3,<2006-06-12 10:49:22.76 +100>,<MAYBRIDGE\nmr>,<NMR_250MHZ>,
      <apk 
       data hash MD5: 32K
       A1 65 1B 87 80 67 48 BA 21 43 6E 1A 50 D4 0D D9>)
(   4,<2006-06-12 10:49:24.28 +100>,<MAYBRIDGE\nmr>,<NMR_250MHZ>,
      <abs ABSG = 5 
       data hash MD5: 32K
       08 56 72 1D 95 EB 9D 5A 58 EF 83 61 B5 4E 5E E3>)
$$ ##END=
$$ 
$$ hash MD5
$$ CF 4A 81 CE A9 BA 6E 48 C5 7D EB C6 55 79 AC 18
##$RELAX= 
##$RELAX= 
##$RELAX= 
##$RELAX= 
##$RELAX= 
##$RELAX= 
##$RELAX= 
$$ Bruker specific parameters
$$ --------------------------
##$DU= <C:\u>
##$EXPNO= 510
##$NAME= <ADRS>
##$PROCNO= 1
##$TYPE= <nmr>
##$USER= <dgb>
##$AMP= (0..31)
100 100 100 100 100 100 100 100 100 100 100 100 100 100 100 100 100 100 
100 100 100 100 100 100 100 100 100 100 100 100 100 100 
##$AQSEQ= 0
##$AQ_mod= 3
##$AUNM= <au_zg>
##$AUTOPOS= <14 >
##$BF1= 250.13
##$BF2= 250.13
##$BF3= 250.13
##$BF4= 250.13
##$BF5= 500.13
##$BF6= 500.13
##$BF7= 500.13
##$BF8= 500.13
##$BYTORDA= 1
##$CFDGTYP= 0
##$CFRGTYP= 5
##$CHEMSTR= <none>
##$CNST= (0..31)
1 1 145 1 1 1 1 1 1 1 1 1 1 1 1 1 1 1 1 1 1 1 1 1 1 1 1 1 1 1 1 1 
##$CPDPRG= <>
##$CPDPRG1= <>
##$CPDPRG2= <>
##$CPDPRG3= <>
##$CPDPRG4= <mlev>
##$CPDPRG5= <mlev>
##$CPDPRG6= <mlev>
##$CPDPRG7= <mlev>
##$CPDPRG8= <mlev>
##$CPDPRGB= <>
##$CPDPRGT= <>
##$D= (0..31)
0 1 0 0 0 0 0 0 0 0.06 0 0 0 0 0 0 0.0002 0 0 0 0 0 0 0 0 0 0 0 0 0 0 
0 
##$DATE= 1150105737
##$DBL= (0..7)
120 120 120 120 120 120 120 120 
##$DBP= (0..7)
150 150 150 150 150 150 150 150 
##$DBP07= 0
##$DBPNAM0= <>
##$DBPNAM1= <>
$$ [...]
##$SUBNAM7= <"">
##$SUBNAM8= <"">
##$SUBNAM9= <"">
##$SW= 20.6930455092707
##$SWIBOX= (0..15)
0 0 3 0 0 0 0 0 0 0 0 0 0 0 0 0 
##$SW_h= 5175.983436853
##$TD= 65536
##$TD0= 1
##$TE= 296.16
##$TE2= 300
##$TE3= 300
##$TEG= 300
##$TL= (0..7)
0 120 120 120 120 120 120 120 
##$TP= (0..7)
150 150 150 150 150 150 150 150 
##$TP07= 0
##$TPNAME0= <>
##$TPNAME1= <>
##$TPNAME2= <>
##$TPNAME3= <>
##$TPNAME4= <>
##$TPNAME5= <>
##$TPNAME6= <>
##$TPNAME7= <>
##$TPOAL= (0..7)
0.5 0.5 0.5 0.5 0.5 0.5 0.5 0.5 
##$TPOFFS= (0..7)
0 0 0 0 0 0 0 0 
##$TUNHIN= 0
##$TUNHOUT= 0
##$TUNXOUT= 0
##$USERA1= <user>
##$USERA2= <user>
##$USERA3= <user>
##$USERA4= <user>
##$USERA5= <user>
##$V9= 5
##$VALIST= <valist>
##$VCLIST= <CCCCCCCCCCCCCCC>
##$VD= 0
##$VDLIST= <DDDDDDDDDDDDDDD>
##$VPLIST= <PPPPPPPPPPPPPPP>
##$VTLIST= <TTTTTTTTTTTTTTT>
##$WBST= 1024
##$WBSW= 4
##$XGAIN= (0..3)
0 0 0 0 
##$XL= 0
##$YL= 0
##$YMAX_a= 337190
##$YMIN_a= -525667
##$ZGOPTNS= <>
##$ZL1= 120
##$ZL2= 120
##$ZL3= 120
##$ZL4= 120
##$ABSF1= 16.522
##$ABSF2= -4.171173
##$ABSG= 5
##$ABSL= 3
##$ALPHA= 0
##$AQORDER= 0
##$ASSFAC= 0
##$ASSFACI= 0
##$ASSFACX= 0
##$ASSWID= 0
##$AUNMP= <proc_1d>
##$AZFE= 0.1
##$AZFW= 0.1
##$BCFW= 0
##$BC_mod= 0
##$BYTORDP= 0
##$COROFFS= 0
##$CY= 12.5
##$DATMOD= 1
##$DC= 0
##$DFILT= <>
##$DTYPP= 0
##$F1P= 14.0000005364418
##$F2P= -0.99999901652339
##$FCOR= 0.5
##$FTSIZE= 32768
##$FT_mod= 6
##$GAMMA= 0
##$GB= 0
##$INTBC= 1
##$INTSCL= 1
##$ISEN= 128
##$LB= 0.3
##$LEV0= 0
##$LPBIN= 0
##$MAXI= 10000
##$MC2= 0
##$MEAN= 0
##$ME_mod= 0
##$MI= 0
##$NCOEF= 0
##$NC_proc= -5
##$NLEV= 6
##$NOISF1= 0
##$NOISF2= 0
##$NSP= 0
##$NTH_PI= 0
##$NZP= 0
##$OFFSET= 16.522
##$PC= 1
##$PHC0= 167.306
##$PHC1= 6.162687
##$PH_mod= 1
##$PKNL= yes
##$PPARMOD= 0
##$PSCAL= 4
##$PSIGN= 0
##$REVERSE= no
##$SF= 250.13
##$SI= 32768
##$SIGF1= 0
##$SIGF2= 0
##$SINO= 400
##$SIOLD= 32768
##$SREGLST= <1H.CDCl3>
##$SSB= 0
##$STSI= 32768
##$STSR= 0
##$SW_p= 5175.98343685301
##$SYMM= 0
##$S_DEV= 0
##$TDeff= 65536
##$TDoff= 0
##$TI= <Analysis number 999999
Compound Code 99
Book Reference 9
Project Code 9>
##$TILT= no
##$TM1= 0
##$TM2= 0
##$TOPLEV= 0
##$USERP1= <user>
##$USERP2= <user>
##$USERP3= <user>
##$USERP4= <user>
##$USERP5= <user>
##$WDW= 1
##$XDIM= 32768
##$YMAX_p= 489786849
##$YMIN_p= -309230
$$ End of Bruker specific parameters
$$ ---------------------------------
##NTUPLES= NMR SPECTRUM
##VAR_NAME=  FREQUENCY,     SPECTRUM/REAL,   SPECTRUM/IMAG
##SYMBOL=    X,             R,               I
##VAR_TYPE=  INDEPENDENT,   DEPENDENT,       DEPENDENT
##VAR_FORM=  AFFN,          ASDF,            ASDF
##VAR_DIM=   32768,         32768,           32768
##UNITS=     HZ,            ARBITRARY UNITS, ARBITRARY UNITS
##FACTOR=    0.157963299565203, 1,           1
##FIRST=     4132.6476996994, 0,             0
##LAST=      -1043.33573715361, 0,           0
##MIN=       -1043.33573715361, -309230,     0
##MAX=       4132.6476996994, 489786849,     0
$$ Real data points
##PAGE= N=1
##DATA TABLE= (X++(R..R)), XYDATA
$$ [...]
18227D885172j42927j13775j19324j28553j28515j30999j45166j48837j28073
$$ 4885172 4742245 4628470 4509146 4380593 4252078 4121079 3975913 3827076 3699003
18218C699003j15670n7960j35978m7745o3700o6861j6274o3321r6195n3258m7291
$$ 3699003 3583333 3525373 3389395 3341650 3277950 3211089 3194815 3131494 3035299 2982041 2934750
18207B934750j47686m9974l2947q0576L5009j569m6024l1183p9917j45482q9724
$$ 2934750 2787064 2737090 2704143 2623567 2658576 2657007 2610983 2579800 2499883 2354401 2264677
18196B264677j1536k0694j6803l4871m3985j60834l1313k5841p6897l0745M7000
$$ 2264677 2253141 2232447 2215644 2180773 2136788 1975954 1944641 1918800 1841903 1811158 1858158
18185A858158K2374n1051q3423p7972k2896J52679L4740j9720L1665K7996l9267
$$ 1858158 1880532 1829481 1746058 1668086 1645190 1797869 1832609 1812889 1844554 1872550 1833283
18174A833283P549Q11M4320M6441r4576j95734j66967j39547n8406k1655J1638
$$ 1833283 1840832 1841643 1885963 1932404 1837828 1642094 1475127 1335580 1277174 1255519 1267157
18163A267157K8703k2107m5923q2204r255J7587n089K1828k3173o4495J5410J17619
$$ 1267157 1295860 1273753 1227830 1145626 1136371 1153958 1148869 1170697 1147524 1083029 1098439 1216058
18151A216058L2971j0328p5599o4005k2195Q3229M3137L8433Q5940j7528k93k1607
$$ 1216058 1249029 1238701 1163102 1099097 1076902 1160131 1203268 1241701 1327641 1310113 1309820 1288213
18139A288213P5634J09023J19190R4749M0846P3800J16840P8146J9963J26523
$$ 1288213 1363847 1472870 1592060 1686809 1727655 1801455 1918295 1996441 2016404 2142927
18129B142927K17741J22262J77902M05070M13896N62025P04683Q17775J191218
$$ 2142927 2360668 2482930 2660832 3065902 3479798 4041823 4746506 5564281 6755499
18120F755499J558442K210447L223637M747958O947487R841821J0827710O401848
$$ 6755499 8313941 10524388 13748025 18495983 25443470 35285291 46113001 52514849
18112E2514849K24244k372008l78239J428743k174617j2775517j2318452o962420
$$ 52514849 52739093 50367085 49988846 51417589 49242972 36467455 24149003 17186583
18104A7186583l718542k191226j528279j081641q11754p23055n87235m72754m89609
$$ 17186583 13468041 11276815 9748536 8666895 7855141 7132086 6544851 6072097 5582488
18095E582488l73354k64784k50974k74380k36147k36250k77650k10153k11077
$$ 5582488 5209134 4944350 4693376 4418996 4182849 3946599 3668949 3458796 3247719
18086C247719j50109j15574j70306r0279q1480p3998j07190q2324o6638j9353
$$ 3247719 3097610 2982036 2811730 2721451 2639971 2565973 2458783 2376459 2309821 2290468
18076B290468j8960j03077j41549j04758k4800n5681m2704l9230r923m2502p1018
$$ 2290468 2271508 2168431 2026882 1922124 1897324 1841643 1798939 1759709 1749786 1707284 1636266
18065A636266l3018m5266j12809m2901k4179k4772r6138l0152j10066n4677k9049
$$ 1636266 1603248 1557982 1445173 1402272 1378093 1353321 1257183 1227031 1116965 1062288 1033239
18054A033239p6048K7895M3896l3753p9713l6029q8862l0677R4999K7860J0889
$$ 1033239 957191 985086 1028982 995229 915516 879487 790625 759948 854947 882807 893696
18043H93696j0345r523Q9518R547m583r0985j1073M7423R526j1065j2409n6557
$$ 893696 883351 873828 963346 972893 968310 877325 866252 913675 923201 912136 899727 843170
18031H43170r6585O816L8524M0281k0842k1596r6942j41130o0535N8758J2091
$$ 843170 746585 753401 791925 832206 811364 789768 692826 551696 491161 549919 562010
18020E62010N1270p5478j01641o8418L537P4204J2783j5010n0830L3758k3126
$$ 562010 613280 537802 436161 367743 371280 445484 458267 443257 392427 426185 403059
18009D03059l0564r3293r1192j6702J2979K2204J2519O8153J02197K6643m768
$$ 403059 372495 279202 188010 171308 184287 206491 219010 287163 389360 416003 411235
17998D11235q4013P8992Q7265R558J01025O2673l5781m4382N2285j5305m7133
$$ 411235 327222 406214 493479 503037 604062 666735 630954 586572 638857 623552 576419
17987E76419k1854n08L0590L1674k3005n8116k9020k9931j6657j0160o5677q6492
$$ 576419 554565 554057 584647 616321 593316 535200 506180 476249 459592 449432 383755 297263
17975B97263m4082m0069L7279k4932L9527o2244Q111n4835N9470r7787p3850j8865
$$ 297263 253181 213112 250391 225459 264986 202742 210853 156018 215488 117701 43851 24986
17963B4986L8015K4485k5740p6967l4005J1740M1361J4614q16N9507P7563L3696
$$ 24986 63001 87486 61746 -15221 -49226 -37486 3875 18489 17673 77180 154743 188439
17951A88439l6566n8213l3418K3763L7722M8234L4673r827K78L95q871m0511K3314
$$ 188439 151873 93660 60242 84005 121727 169961 204634 194807 195085 195480 186609 146098 169412
17938A69412J4562L8755m5292J2739M144J3336O170n8193l8501J3676r162J5851
$$ 169412 183974 222729 177437 190176 194320 207656 213826 155633 117132 130808 121646 137497
17926A37497l3172k3303r771j4787m3516J0230m4748L436J372K7974n3599l1397
$$ 137497 104325 81022 71251 56464 12948 23178 -21570 -18134 -16762 11212 -42387 -73784
17914g3784K4147R0945J02170l8388k2798J6279o6306n355J5158j6350J6160o690
$$ -73784 -49637 41308 143478 105090 82292 98571 32265 26910 42068 25718 41878 35188
17902C5188k8345j8870J8366K5678M8968P5438J4487m5659M7266M9657J0389l102
$$ 35188 6843 -12027 6339 32017 80985 156423 170910 125251 172517 222174 232563 229461
17890B29461O5041k561k7523N1297m3663k870n2727l0361J5098k7344l5819p402
$$ 229461 294502 291941 264418 315715 272052 269182 216455 186094 201192 173848 138029 130627
17878A30627l1764J2937p2094J8590J6486J3410o887j9019M485j4221l1060p7481
$$ 130627 98863 111800 39706 58296 74782 88192 81305 62286 66771 52550 21490 -55991
17866e5991j9500M5585n7326j9131M1162N3950O0609M789L2747P8119M4161m1560
$$ -55991 -75491 -29906 -87232 -106363 -65201 -11251 49358 54147 86894 165013 209174 167614
17854A67614l8173j0787N6043Q6142P7822J21073Q446K5532k0113j1239J3998
$$ 167614 129441 118654 174697 260839 338661 459734 468180 493712 473599 462360 476358
17843D76358n3003l447k0254p2093j0921J04230P0613j0020p0732j14762L606
$$ 476358 423355 419908 399654 327561 316640 420870 491483 481463 410731 295969 299575
17832B99575O2738l1097j09734j302J16722J9542n8720K7109L1835J00427N7616
$$ 299575 362313 331216 221482 220180 336902 356444 297724 324833 356668 457095 514711
17821E14711l1946j1940N5644Q3475P060n8431m1668l4405p2146k1823p7624p9594
$$ 514711 482765 470825 526469 609944 617004 558573 516905 482500 410354 388531 310907 231313
17809B31313K8937L3720j9269M414J1370j2619k4253J4953J1754k1593m2644n9590
$$ 231313 260250 293970 274701 279115 290485 277866 253613 268566 280320 258727 216083 156493
17797A56493O5581J6450k5218p079K4346l0699K485L867j10109o0239P8049J9813
$$ 156493 222074 238524 213306 206227 230573 199874 202359 206226 96117 35878 113927 133740
17785A33740k3400K5600P8481J7388P2909J08804l4955J8890j5494k2745Q097
$$ 133740 110340 135940 214421 231809 304718 413522 378567 397457 381963 359218 367315
17774C67315O34O6268N9127K3381n5523o3925n3109K4706M2235r172j00654J8966
$$ 367315 367949 434217 493344 516725 461202 397277 344168 368874 411109 401937 301283 320249
17762C20249l8092o2598l2545k4323p2437k60K8732K2902k6781l8981j3985O7522
$$ 320249 282157 219559 187014 162691 90254 89994 118726 141628 114847 75866 61881 129403
17750A29403N0711M1614p6729k9429n717N682n2260j20299m4811p1224O5029N3358
$$ 129403 180114 221728 144999 115570 109853 115535 63275 -57024 -101835 -173059 -108030 -54672
17738e4672L1413k5855j4338P838k7959l4021O158k3446Q990N8769K1122N684
$$ -54672 -23259 -49114 -63452 -55614 -83573 -117594 -111436 -134882 -125892 -67123 -46001 -40317
17726d0317n2652m9152K2599P7844P7179p157l7308K212O798q0135l860Q9963
$$ -40317 -92969 -142121 -119522 -41678 35501 28344 -8964 -6752 46 -80089 -83949 6014
17714F014L1438m75j8971J8976L6971o1149r9695k5995O3780o4916l3981R950
$$ 6014 37452 36977 18006 36982 73953 12804 -86891 -112886 -49106 -114022 -148003 -138053
17702a38053O1259J50425Q2376n6515n1461l9804n3261j9366M4013L966Q565m9910
$$ -138053 -76794 73631 156007 99492 48031 8227 -45034 -64400 -20387 -16421 -7856 -57766
17690e7766L626l5435J5588K6143M8867P751j062j3356j9492K2186k6991o4698
$$ -57766 -54140 -89575 -73987 -47844 1023 8774 7712 -5644 -25136 -2950 -29941 -94639
17678i4639Q154K1251M1373m529L758Q3772q970j8044m7015n0540k0064m44J8721
$$ -94639 -86485 -65234 -23861 -28390 -24632 59140 50170 32126 -14889 -65429 -85493 -85937 -67216
17665f7216N031k6690p2333J8717J38462J0389m3388K819p644k7679l0424N7018
$$ -67216 -62185 -88875 -161208 -142491 -4029 6360 -37028 -34209 -41853 -69532 -99956 -42938
17653d2938k7228o2812l3361L5429L9386j9593J6846M4453k4962J7917K898R0853
$$ -42938 -70166 -132978 -166339 -130910 -91524 -111117 -94271 -49818 -74780 -56863 -53965 36888
17641C6888O1349n7779n8078j01785r382N6346r334r465K233k7654m9737Q015
$$ 36888 98237 40458 -17620 -119405 -128787 -72441 -81775 -91240 -89007 -116661 -166398 -158383
17629a58383J2088R56N8377M4196j3122J4275L375M1723N2528M9597q0090p4424
$$ -158383 -146295 -145339 -86962 -42766 -55888 -41613 -38238 3485 56013 105610 25520 -48904
17617d8904M856l1450r3211N196O6069O8864M695O6565j05946k9805L4389K3442
$$ -48904 -44048 -75498 -168709 -163513 -97444 -28580 -23885 42680 -63266 -93071 -58682 -35240
17605c5240o2874k586o4077L3241J01993J0283n7792J8474L1223m776j8386l6981
$$ -35240 -98114 -100700 -164777 -131536 -29543 -19260 -77052 -58578 -27355 -32131 -50517 -87498
17593h7498m443m539J2211L4366K7790l2001j6027m0487J7614N2085J0825L3660
$$ -87498 -91941 -96480 -84269 -49903 -22113 -54114 -70141 -110628 -93014 -40929 -30104 3556
17581C556L0739k7723o1709m5477M5951J9623j2675L3553L8196l6765n7581k1177
$$ 3556 34295 6572 -55137 -100614 -54663 -35040 -47715 -14162 24034 -12731 -70312 -91489
17569i1489L7904p730o7134j0124P4857J11847N5176k037j971k2731q6151j0262
$$ -91489 -53585 -61315 -128449 -138573 -63716 48131 103307 101270 99299 76568 -9583 -19845
17557a9845K4107l1810j0192L5669k4877q407L5528p8939K1499l1343j5435l5128
$$ -19845 4262 -27548 -37740 -2071 -26948 -35355 173 -78766 -57267 -88610 -104045 -139173
17545a39173m9622P6128P3543J0768k8628L2936m7105M287K4974J8473k3301j6357
$$ -139173 -188795 -112667 -39124 -28356 -56984 -24048 -71153 -66866 -41892 -23419 -46720 -63077
17533f3077m2449k0486N1830J15515k3527m7017L330n1083K7853R3268j9312o6795
$$ -63077 -105526 -126012 -74182 41333 17806 -29211 -25881 -76964 -49111 44157 24845 -41950
17521d1950M809L3703m0375k3927O3769K4269o8464k7936j2785k0225L5165O0857
$$ -41950 -37141 -3438 -43813 -67740 -3971 20298 -48166 -76102 -88887 -109112 -73947 -13090
17509a3090K385K5206K18o7881j5882k1477J3622R0464J02821o427o2821o8951
$$ -13090 -10705 14501 14719 -53162 -69044 -90521 -76899 13565 116386 109959 47138 -21813
17497b1813j0752o0741m548N8372r40l5953L5208L1058m3040m1155P603O5300
$$ -21813 -32565 -93306 -97854 -39482 -40422 -76375 -41167 -10109 -53149 -94304 -86701 -21401
17485b1401l1120L9065n0033j2301N4026l191j5442p9813k3193l9619K3581N2845
$$ -21401 -52521 -13456 -63489 -75790 -21764 -24955 -40397 -120210 -143403 -183022 -159441 -106596
17473a06596r973J3445o550J2107o36N120N7845L8029k8698O5825K6238l7904
$$ -106596 -116569 -103124 -109674 -97567 -98203 -93083 -35238 2791 -25907 39918 66156 28252
17461B8252j1688J0462j4462m6847K5696N1336j0348m1305r0254M0055j8923O7523
$$ 28252 16564 27026 12564 -34283 -8587 42749 32401 -8904 -99158 -59103 -78026 -10503
17449a0503N1128L1226J00420L107K8014k9587L496k3841k2694o8557p5719k434
$$ -10503 40625 71851 172271 175378 203392 173805 177301 153460 130766 62209 -13510 -15944
17437a5944P3282M5743J9683p3655j30869m4561P4759M0923k4670n0830j160J6354
$$ -15944 57338 103081 122764 49109 -81760 -126321 -51562 -10639 -35309 -86139 -87299 -70945
17425g0945M2381R7105m1320J0695n10P6160j4287m0334j01956j281N5418M7742
$$ -70945 -28564 68541 27221 37916 37406 113566 99279 58945 -43011 -44292 11126 58868
17413E8868P770N5600k6470p9563k3766m2634j1956k1936p9920m067k2167N5944
$$ 58868 66638 122238 95768 16205 -7561 -50195 -62151 -84087 -164007 -168074 -190241 -134297
17401a34297o821l613k9464M5807j3054L0197J4445N1209M4065p7318j7125K5124
$$ -134297 -141118 -144731 -174195 -128388 -141442 -111245 -96800 -45591 -1526 -78844 -95969 -70845
17389g0845l8730j0737j4348n730L3848N0539K3672p3532n501K015k4951P6955
$$ -70845 -109575 -120312 -134660 -140390 -106542 -56003 -32331 -105863 -111364 -109349 -134300 -57345
17377e7345m280k9652P4813j0831o7643K0919q083M4191N8336K7221m7388o0075
$$ -57345 -61625 -91277 -16464 -27295 -94938 -74019 -82102 -37911 20425 47646 258 -59817
17365e9817r01J9922M1048m6481q9313M4120L1905J3829P961k5673j3832q809
$$ -59817 -60718 -40796 252 -46229 -135542 -91422 -59517 -45688 -37727 -63400 -77232 -86041
17353h6041n2575n742K4552L5386M098J5410j4745O576Q1244J13926n4597j02316
$$ -86041 -138616 -144358 -119806 -84420 -80322 -64912 -79657 -73081 8163 122089 67492 -34824
17341c4824m4046Q4911j4699M953M0141Q5181j2661J577j5663m4571p20n3854
$$ -34824 -78870 6041 -8658 -3705 36436 121617 108956 110533 94870 50299 49579 -4275
17329d275q3378k8146M0928J36137N025J1502L3474K210l8353o6132o4439q2937
$$ -4275 -87653 -115799 -74871 61266 66291 77793 111267 113477 75124 8992 -55447 -138384
17317a38384j8257q273O7766N9731L0324j2521l8102M5579J2441n5230j17648
$$ -138384 -156641 -164914 -97148 -37417 -7093 -19614 -57716 -12137 304 -54926 -172574
17306a72574p0585R6919P8908L6842m724p0532P715M8378P9857j6257j23076N199
$$ -172574 -243159 -146240 -67332 -30490 -35214 -105746 -98031 -49653 30204 13947 -109129 -103930
17294a03930K6295K7030O3731N6675p7841m4183O3722m306n0696L4827N5762q211
$$ -103930 -77635 -50605 13126 69801 -8040 -52223 11499 7193 -43503 -8676 47086 38875
17282C8875k4898o0618o2260k1873L4506M9302p018l5250o303J4798k7535O5398
$$ 38875 13977 -46641 -108901 -130774 -96268 -46966 -53984 -89234 -95537 -80739 -108274 -42876
17270d2876N6460j3753o4463n3658J2545q821j0770J04318L2833J9413R6939j9930
$$ -42876 13584 -169 -64632 -118290 -105745 -114566 -125336 -21018 11815 31228 128167 108237
17258A08237l3704k1684k5893n9883R954P4291n9371J4094p183K5074P448q6831
$$ 108237 74533 52849 26956 -32927 -22973 51318 -8053 6041 -1142 23932 31380 -55451
17246e5451l2081l9832k1981J119N0917R9813k3395M2044K7956J1673m4831n9519
$$ -55451 -87532 -127364 -149345 -148226 -97309 2504 -20891 21153 49109 60782 15951 -43568
17234d3568m4820L0804M418M4252j7224K9239K9196N595l2360j9655j4463k2476
$$ -43568 -88388 -57584 -53166 -8914 -26138 3101 32297 37892 5532 -14123 -28586 -51062
17222e1062n2888L1529k2970M6420l318l8511O5836O7901k8413K0711M8874Q3473
$$ -51062 -103950 -72421 -95391 -48971 -52289 -90800 -24964 42937 14524 35235 84109 167582
17210A67582k5258j8886R226p1083j01764n3387l0837k4099K5469K7141P0526
$$ 167582 142324 123438 132664 61581 -40183 -93570 -124407 -148506 -123037 -95896 -25370
17199b5370l3074p052R946R9312L4280m7160m5747l8274J3792k4654J1772L7613
$$ -25370 -58444 -65496 -55550 43762 78042 30882 -14865 -53139 -39347 -64001 -52229 -14616
17187a4616j408N056r411j133l8803o5798m4117N2823M3217K3845M7635l3753
$$ -14616 -16024 -10968 -20379 -21512 -60315 -126113 -170230 -117407 -74190 -50345 -2710 -36463
17175c6463n1674J7029k8918M2825k3656n4638q973P6189M5253j1968L5321m8542
$$ -36463 -88137 -71108 -100026 -57201 -80857 -135495 -144468 -68279 -23026 -34994 327 -48215
17163d8215p2729K5060K6844K990o821j4196L8187J8938q6096M2334Q4436Q65
$$ -48215 -120944 -95884 -69040 -66050 -72871 -87067 -48880 -29942 -116038 -73704 10732 11597
17151A1597o4629p9027J1920J6223j9730L8568Q0693o5077p7391m7533N698Q9985
$$ 11597 -53032 -132059 -120139 -103916 -123646 -85078 -4385 -69462 -146853 -194386 -188688 -98703
17139i8703J03545N5686q7529j3294P2191K1289n7932k836J0154l8982o5616K4506
$$ -98703 4842 60528 -27001 -40295 31896 53185 -4747 -7583 2571 -36411 -102027 -77521
17127g7521N2964l1708o4059R081K9393N9767O777j5189R0404O2121n7262j1882
$$ -77521 -24557 -56265 -120324 -111243 -81850 -22083 -15306 -30495 59909 122030 64768 52886
17115E2886J9000J8925q7445n2820j3935J1672l1921q666L9415k2066j5817j3085
$$ 52886 71886 90811 3366 -49454 -63389 -51717 -83638 -92304 -52889 -74955 -90772 -103857
17103a03857K2216K69L3974M3033j5578L6570m5833q8734p3182N9109L7933J4228
$$ -103857 -81641 -81372 -47398 -4365 -19943 16627 -29206 -117940 -191122 -132013 -94080 -79852
17091g9852N2896j01967l0997k4255K4497J09872L3671J675K0076o8955l5567
$$ -79852 -26956 -128923 -159920 -184175 -159678 -49806 -16135 -14460 5616 -63339 -98906
17080i8906n5831j1588P6258O9299Q7648K5836K5569j07589k1997M6748j1676
$$ -98906 -154737 -166325 -90067 -20768 66880 92716 118285 10696 -11301 35447 23771
17069B3771j5044k8117k5267K066p6713k509O5897M3504l8937N6983l1047r8227
$$ 23771 8727 -19390 -44657 -42591 -119304 -121813 -55916 -12412 -51349 5634 -25413 -123640
17057a23640N2389O848l8389J9969l1153M7691J3286l7119M5325R383p7658J4661
$$ -123640 -71251 -64403 -102792 -82823 -113976 -66285 -52999 -90118 -44793 -35410 -113068 -98407
17045i8407J3594L8662L3326Q8875n257K6007r4390n8647J8871k2904L308J8873
$$ -98407 -84813 -46151 -12825 76050 70793 96800 2410 -56237 -37366 -60270 -56962 -38089
17033c8089L9465j17024p8150M4379l7617j7803R829k0005J331M669n8578Q6682
$$ -38089 1376 -115648 -193798 -149419 -187036 -204839 -195010 -215015 -213684 -209015 -267593 -180911
17021a80911m291K6812P9396P7027j5764n714n8535q4458K9104M8088M0120q6258
$$ -180911 -185202 -158390 -78994 -1967 -17731 -23445 -81980 -166438 -137334 -89246 -49126 -135384
17009a35384m5515J2757k188l2778N0880N1089l9000k7060P0266J1863l1566l7142
$$ -135384 -180899 -168142 -170330 -203108 -152228 -101139 -140139 -167199 -96933 -85070 -116636 -153778
16997a53778j8618k4921J052K0247O9677N2811n8711k6723r080O5537Q3488n5185
$$ -153778 -172396 -197317 -196265 -176018 -106341 -53530 -112241 -138964 -148044 -82507 981 -54204
16985e4204q9511J5830L5931N6724r719J094k1114k1263O2059O127p4428p4969
$$ -54204 -143715 -127885 -91954 -35230 -44949 -43855 -64969 -86232 -24173 -18046 -92474 -167443
16973a67443J10451L5397k4129Q4430J4136m8994l1342m8802o3043m5453M9565
$$ -167443 -56992 -21595 -45724 38706 52842 3848 -27494 -76296 -139339 -184792 -135227
16962a35227P8416R6451j3918p9918J3460J8939k0681l1295O3138M7449n341l703
$$ -135227 -56811 39640 25722 -54196 -40736 -21797 -42478 -73773 -10635 36814 31473 27770
16950B7770N338j0943k747J2431O9383p0543m907n008J0643n7548p720N3430O4734
$$ 27770 33108 22165 19418 31849 101232 30689 25782 20774 31417 -26131 -33851 19579 84313
16937H4313k7946m1176N1245r999J7790m6030n7802M0313Q3663m8028j14825j2445
$$ 84313 56367 15191 66436 56437 74227 28197 -29605 10708 94371 46343 -68482 -80927
16925h0927n968R9142M9052J0678K1820j9736j28204K7040M574K6245k8954J108
$$ -80927 -86895 12247 61299 71977 93797 74061 -54143 -27103 -22529 3716 -25238 -24130
16913b4130L7230m6380q4062J1402M9032L7295Q2609M0060o7495K4359M8601k2257
$$ -24130 13100 -33280 -117342 -105940 -56908 -19613 62996 103056 35561 59920 108521 86264
16901H6264p7987p0234m4674J0314K5465k6m022J920N4424P1855L273l2683L302
$$ 86264 8277 -61957 -106631 -96317 -70852 -70878 -74900 -72980 -18556 53299 56572 23889 27191
16888B7191m007l9015q2324m9341K3353N0527K0585l7750Q7J4677M6551j2119
$$ 27191 23184 -15831 -98155 -147496 -124143 -73616 -53031 -90781 -90694 -76017 -29466 -41585
16876d1585J9899Q892l9108p75Q0575L1058L8973j2368J5358n0759k4064p8190
$$ -41585 -21686 -12794 -51902 -52677 27898 58956 97929 85561 100919 50160 26096 -52094
16864e2094k0711o7612r996R5984n2863m6255P057M1231O131p3120K8396J7926
$$ -52094 -72805 -140417 -150413 -54429 -107292 -153547 -146490 -105259 -99128 -172248 -143852 -125926
16852a25926K1419M0278o0367p059J01534J3286p7571l8855M7434P5647M1968
$$ -125926 -104507 -64229 -124596 -131655 -30121 -16835 -94406 -133261 -85827 -10180 31788
16841C1788K4642O4415N58j08250p3835M4117j7879n9784J2528J8798m120K3896
$$ 31788 56430 120845 121403 13153 -60682 -16565 -34444 -94228 -81700 -62902 -67022 -43126
16829d3126j1964m4709p9149k1085O1357Q5587J8379o4335n0279k0147J8025K3056
$$ -43126 -55090 -99799 -178948 -200033 -138676 -53089 -34710 -99045 -149324 -169471 -151446 -128390
16817a28390L9008K219k8408J0024M1534m2260j32738J4824R2820J07534O8801
$$ -128390 -89382 -87163 -115571 -105547 -64013 -106273 -239011 -224187 -131367 -23833 44968
16806D4968m9145m8631j8945j007k3484l420K3799M5936N0944N105N2223n2961
$$ 44968 -4177 -52808 -71753 -72760 -96244 -99664 -75865 -29929 21015 26120 78343 25382
16794B5382l3135N617m1906J5786n0811j8152J6472R6845j925k5676l8858L5132
$$ 25382 -7753 -2136 -44042 -28256 -79067 -97219 -80747 16098 14173 -11503 -50361 -15229
16782a5229N8395K9212k8457M0315m7533j5339q1874M4954j6107q087L7833J8897
$$ -15229 43166 72378 43921 84236 36703 21364 -60510 -15556 -31663 -39750 -1917 16980
16770A6980J5657k8612j7427L7601R695N1086K8425L0046N8972k4631P995l6516
$$ 16980 32637 4025 -13402 24199 33894 84980 113405 143451 202423 177792 185787 149271
16758A49271o0838k0479j4105j1761k7235q2980k9561m0488J9114K6985O6616
$$ 149271 88433 67954 53849 42088 14853 -68127 -97688 -138176 -119062 -92077 -25461
16747b5461L1295M7191J3296l1153p2419o0937j4067Q9657O2108o2657P3327j7185
$$ -25461 5834 53025 66321 35168 -37251 -98188 -112255 -22598 39510 -23147 50180 32995
16735C2995J8274L1208j15685m3560l4060L3257J37500J4663n4687k6318p893
$$ 32995 51269 82477 -33208 -76768 -110828 -77571 59929 74592 19905 -6413 -14306
16724a4306K1598K4313j2009o6230p1323O0719K1982O8102J7456N764p4817p5856
$$ -14306 7292 31605 19596 -46634 -117957 -57238 -35256 32846 50302 56066 -18751 -94607
16712i4607J146Q7529j8670O7936P2597p1971p8266n7742L8124K4778j2513R253
$$ -94607 -93461 -5932 -24602 43334 115931 43960 -34306 -92048 -53924 -29146 -41659 -32406
16700c2406Q5j6110n789o7095j5270L7317K3595l1901q4564k9914L2049K071M6690
$$ -32406 -32321 -48431 -54220 -121315 -136585 -99268 -75673 -107574 -192138 -222052 -190003 -187932 -141242
16687a41242K5619k4449k7820l865M2851P6035O5190Q1907K8581j06644l1603
$$ -141242 -115623 -140072 -167892 -171757 -128906 -52871 12319 94226 122807 16163 -15440
16676a5440k9959o2364p9729M9921L3275P0842J9434K5529r1469q915l7970L5585
$$ -15440 -45399 -107763 -187492 -137571 -104296 -33454 -14020 11509 -79960 -88875 -126845 -91260
16664i1260K9406J0470l7531J1628L1916J3298K3341J0811o3872n1154K1571M7833
$$ -91260 -61854 -51384 -88915 -77287 -45371 -32073 -8732 2079 -61793 -112947 -91376 -43543
16652d3543L0055k0472l289k7674P8825o2056l0693j1884M8936O2380O2068r6390
$$ -43543 -13488 -33960 -37249 -64923 13902 -48154 -78847 -90731 -41795 20585 82653 -13737
16640a3737m7316n7887L0145K8833L805m8316n88J37449J2644m7924o2252L064
$$ -13737 -61053 -118940 -88795 -59962 -56157 -104473 -105061 32388 45032 -2892 -65144 -62080
16628f2080N2091l0203l023m2483l5334K0746O0323K7499m0045j966L079K3410
$$ -62080 -9989 -40192 -43215 -85698 -121032 -100286 -39963 -12464 -52509 -54475 -51396 -27986
16616b7986K2702l6943P704J5306P794n2244Q8658o285o9562n3473n6011P7201
$$ -27986 -5284 -42227 -34523 -19217 -11423 -63667 24991 18706 -50856 -104329 -160340 -83139
16604h3139O1104o824n9297r664m299J9147J29204O5275j8830n1154M5423o9513
$$ -83139 -22035 -28859 -88156 -97820 -102119 -82972 46232 111507 92677 41523 86946 17433
16592A7433n3380M805M5797m7789l1107j7187o91K0765N8879l861K9248l2041
$$ 17433 -35947 -31142 14655 -33134 -64241 -81428 -82119 -61354 -2475 -6336 22912 -9129
16580i129m1524l3340J7822Q056L3383M200j9830l7169n8119k7425j2958n8050
$$ -9129 -50653 -83993 -66171 -58115 -24732 -20532 -40362 -77531 -135650 -163075 -176033 -234083
16568b34083R7877L9530k3370Q692J5302M8344j6048L1533O4483o9006j0494N7261
$$ -234083 -136206 -96676 -120046 -111354 -96052 -47708 -63756 -32223 32260 -36746 -47240 10021
16556A0021k916n0943m7330k9422O5942J3166J9323O793L0948K0413o4168o156
$$ 10021 7105 -43838 -91168 -120590 -54648 -41482 -22159 -15366 15582 35995 -28173 -34329
16544c4329k8515P1962o49l1608L996l2212J0728m8408N1844M3972k9051j3441
$$ -34329 -62844 9118 8469 -23139 -19143 -51355 -40627 -89035 -37191 6781 -22270 -35711
16532c5711l6697N761R2717K2570k3400m7448m3173l6549O28N6739Q326L5071
$$ -35711 -72408 -66647 26070 48640 25240 -22208 -65381 -101930 -101302 -44563 -36237 -1166
16520a166k426J3505m5118m821N9485L1146k9069j211q0977m2744j5652R8527
$$ -1166 -3592 9913 -35205 -40026 19459 50605 21536 20325 -60652 -103396 -119048 -20521
16508b0521L6417k0602k3733K1057N7577j1860j8250l5128p8543M8015O7039N8259
$$ -20521 15896 -4706 -28439 -7382 50195 38335 20085 -15043 -93586 -45571 21468 79727
16496G9727m3723j00709j3577j07614J1383R2723L4951K4687J1234K5515L996
$$ 79727 36004 -64705 -78282 -185896 -174513 -81790 -46839 -22152 -10918 14597 18593
16485A8593o9964J2690K051J1837M6822l8824j9799l5183K7168q273m1659K9488
$$ 18593 -51371 -38681 -36630 -24793 22029 -16795 -36594 -71777 -44609 -52882 -94541 -65053
16473f5053L5534J6919q758p199k2911q1273k4776M3328O4131N3108J6141n5225
$$ -65053 -29519 -12600 -21358 -28557 -51468 -132741 -157517 -114189 -50058 3050 19191 -36034
16461c6034n1003j6873J4888m5123K1713P5401q974j6848O3987N6728p9290o4644
$$ -36034 -87037 -103910 -89022 -134145 -112432 -37031 -46005 -62853 1134 57862 -21428 -86072
16449h6072K8121M0716P1124P4481P2088o7503j41443K856N2162R989m1123q4577
$$ -86072 -57951 -17235 53889 128370 200458 132955 -8488 -5632 46530 56519 15396 -69181
16437f9181P0621k6740n9775M8414K2307n9121p5970M308Q5358L4889j4415N4161
$$ -69181 1440 -25300 -85075 -36661 -14354 -73475 -149445 -145137 -59779 -24890 -39305 14856
16425A4856J1716p1326j6990J852j2812K8540k5364m5300j3655L7876N2366l2343
$$ 14856 26572 -44754 -61744 -59892 -72704 -44164 -69528 -114828 -128483 -90607 -38241 -70584
16413g0584j9837l4788N5011n876J4342M1310n5579k1045M2561K3534J3999n820
$$ -70584 -90421 -125209 -70198 -76074 -61732 -20422 -76001 -97046 -54485 -30951 -16952 -22772
16401b2772Q971l7113n527J442K2321k180L5630O2440n077o6996k5402m3979J7712
$$ -22772 -13801 -50914 -56441 -54999 -32678 -34858 772 63212 58135 -8861 -34263 -78242 -60530
16388f0530L270J3824l6225o1922K4447K360j1003M509L3754R997n9096k7404
$$ -60530 -57260 -43436 -79661 -141583 -117136 -114776 -125779 -121270 -87516 -77519 -136615 -164019
16376a64019P7098L1336n9563L2868P0793R510m0261j6578m945J859o735n973
$$ -164019 -86921 -55585 -115148 -82280 -11487 -1977 -42238 -58816 -63761 -61902 -68637 -74610
16364g4610M2505J295k8814L4k3310j7346Q2898J3746n8229m8324m1319l6282
$$ -74610 -32105 -30810 -59624 -59590 -82900 -100246 -17348 -3602 -61831 -110155 -151474 -187756
16352a87756N5349P1452Q1938P892J8493l7788M2856p2936n8525M172M2309K9371
$$ -187756 -132407 -60955 20983 28875 47368 9580 52436 -20500 -79025 -74853 -32544 -3173
16340c173Q598k4531K2575L0730j1841l2432l649K9891J76o3255J810o10r878
$$ -3173 5425 -19106 3469 34199 22358 -10074 -13723 16168 16344 -46911 -45101 -45711 -55589
16327e5589M5454l3509o2684j7222O5452Q55N52L0157O2056l2079p7928K8398
$$ -55589 -10135 -43644 -106328 -123550 -58098 -57243 -56691 -26534 35522 3443 -74485 -46087
16315d6087J3080L883J073J4667k0866J9015M9021L047N688o3905R134J9357o2124
$$ -46087 -33007 -29124 -28051 -13384 -34250 -15235 33786 36833 42521 -21384 -12250 7107 -55017
16302e5017k0214j4837P0189L179o9420L1157K0414P2928n4033k3718L259l5982
$$ -55017 -75231 -90068 -19879 -16700 -86120 -54963 -34549 38379 -15654 -39372 -36113 -72095
16290g2095K9580j056J4024k1735k601M4949k9552m1231k8248L0816k7340R4008
$$ -72095 -42515 -43571 -29547 -51282 -53883 -8934 -38486 -79717 -107965 -77149 -104489 -10481
16278a0481L8172o6684m4214n4935q1357l7116J0134M4888N1012R9420L1709q6011
$$ -10481 27691 -38993 -83207 -138142 -219499 -256615 -246481 -201593 -150581 -51161 -19452 -105463
16266a05463Q697L5369l5072j0963M1007q405l1649L3010L0709l4404P2264M2111
$$ -105463 -96766 -61397 -96469 -107432 -66425 -74830 -106479 -73469 -42760 -77164 -4900 37211
16254C7211M563r3443o9538P8808J8352m3271L7983n4771p9533K6043j0088M8122
$$ 37211 41774 -51669 -121207 -42399 -24047 -67318 -29335 -84106 -163639 -137596 -147684 -99562
16242i9562J248k6537P7878L1827r4174o0439m7390M4403L3975Q258N4521O7364
$$ -99562 -98314 -124851 -46973 -15146 -109320 -169759 -217149 -172746 -138771 -130513 -75992 -8628
16230h628J7818m1737j06006R4170Q1609K1273n1293j1166M961Q256K706N3012
$$ -8628 9190 -32547 -138553 -44383 37226 58499 7206 -3960 1001 9257 11963 64975
16218F4975m4247l9104m3278o5770K8330O6244L6866q3685j2266M4678R5045P3740
$$ 64975 20728 -18376 -61654 -127424 -99094 -32850 4016 -79669 -91935 -47257 47788 121528
16206A21528M4900L8120n5827q1852M3908J0995l0871m8725j9284L1834O0473
$$ 121528 166428 204548 148721 66869 110777 121772 90901 42176 22892 54726 115199
16195A15199n2339j17372o5343J4127k9078L4418J02155M0017K5975N862L9396
$$ 115199 62860 -54512 -119855 -105728 -134806 -100388 1767 41784 67759 73621 113017
16184A13017J1789n3980p7416L4148p796r0320o5927L6471j3936l1656J9538M7647
$$ 113017 124806 70826 -6590 27558 19762 -70558 -136485 -100014 -113950 -145606 -126068 -78421
16172g8421Q3848L6103L7931M4965j4701K9839n5235k9271l3641o5324K1656K0132
$$ -78421 5427 41530 79461 124426 109725 139564 84329 55058 21417 -43907 -22251 -2119
16160b119L9704k2563m9487m978Q0749q353k1665L304L1468j4143k092M5058l2306
$$ -2119 37585 15022 -34465 -39443 41306 32953 11288 14592 46060 31917 29825 74883 42577
16147D2577m2685N2405M3418l9188p909m7386j5308k4971K5873M5165L7468j3662
$$ 42577 -108 52297 95715 56527 48618 1232 -14076 -39047 -13174 31991 69459 55797
16135E5797j6735M8440r3059n7590N1469l575m4034O4045L2430k3074r3600o5590
$$ 55797 39062 87502 -5557 -63147 -11678 -15253 -59287 4758 37188 14114 -79486 -145076
16123a45076R4624Q7412l5026p4104m5522J93J08109N6520k6136o8704J222N1810
$$ -145076 -50452 36960 1934 -72170 -117692 -117499 -9390 47130 20994 -47710 -46488 5322
16111E322N1248P766O61o3661N2531q073k7006k0229l9858q6456q064R7619J2718
$$ 5322 56570 64336 64997 1336 53867 45794 18788 -1441 -41299 -127755 -135819 -38200 -25482
16098b5482o0566K248P9738j5141r059j7345n3243L0483N5420O675p684p3324
$$ -25482 -86048 -83800 -4062 -19203 -28262 -45607 -98850 -68367 -12947 -6272 -13956 -87280
16086h7280k6661N1623Q1744R271K9397k0581q4061j8573q751L8537N2763n644
$$ -87280 -113941 -62318 19426 28697 58094 37513 -46548 -65121 -73872 -35335 17428 11784
16074A1784p9564l0220N2910K4844k3505m1794k6807N6677j0586m6606K6196M9895
$$ 11784 -67780 -98000 -45090 -20246 -43751 -85545 -112352 -55675 -66261 -112867 -86671 -36776
16062c6776k6182K1279O1808l0647L2895L6305j5423l0487o6764M0460K538Q477
$$ -36776 -62958 -41679 20129 -10518 22377 58682 43259 12772 -53992 -13532 -10994 -2517
16050b517O6882j2057p6570o8403L4540n6634r044O0419L7650r186n5032j4126
$$ -2517 64365 52308 -24262 -92665 -58125 -114759 -123803 -63384 -25734 -34920 -89952 -104078
16038a04078K0209M2205N7098m1034l4277N5643N3623l0616J8504p7149k2017
$$ -104078 -83869 -41664 15434 -25600 -59877 -4234 49389 18773 37277 -39872 -61889
16027f1889L4903k154o1779j446q959m6280j559M1399n5227M6000O2584L501L3709
$$ -61889 -26986 -29140 -90919 -92365 -101324 -147604 -149163 -107764 -162991 -116991 -54407 -50906 -17197
16014a7197m4929J0416M5444j512O590k4837j6319N6820M5540R8908n8635j01739
$$ -17197 -62126 -51710 -6266 -7778 -1188 -26025 -42344 14476 60016 158924 100289 -1450
16002a450L808M755J0392J3016l302R201n7026l7041O8333O3560k3634l0542l7052
$$ -1450 2358 7113 17505 30521 27219 36420 -20606 -57647 10686 74246 50612 20070 -16982
15989a6982m2107k3168m3627O9873J08019N3815n9758q3731m052Q984j4036j6970
$$ -16982 -59089 -82257 -125884 -56011 52008 105823 46065 -37666 -41718 -32734 -46770 -63740
15977f3740k6699K5395q888M8168J3243N6666R553m2691o8515N1817P1884l8446
$$ -63740 -90439 -65044 -73932 -25764 -12521 44145 53698 11007 -57508 -5691 66193 27747
15965B7747j2379n6604O099M0290K0307P6836L0600n2273l2278q497K88M2251
$$ 27747 15368 -41236 -35137 5153 25460 102296 132896 80623 48345 39848 40136 82387
15953H2387l8421K3072N978q224j5081l1248N4866N2218l3479q8322k8672q4277
$$ 82387 43966 67038 73016 64792 49711 18463 73329 125547 92068 3746 -24926 -109203
15941a09203K2947J32698J6480M5921L9656o0975m7846J2563j268n7921m1312
$$ -109203 -86256 46442 62922 108843 148499 87524 39678 52241 50973 -6948 -48260
15930d8260O3688L0956o7417J3719J0540m39P9485K0319k5975k4397n9620k751
$$ -48260 15428 46384 -21033 -7314 3226 2787 82272 102591 76616 52219 -7401 -10152
15918a0152M789K0726N061j12547j0027N9368P5063o538m2560o8655K6745J2979
$$ -10152 -5363 15363 20424 -92123 -102150 -42782 32281 25743 -16817 -85472 -58727 -45748
15906d5748J6702P9519M9413n1535n8859n8445n4429p4432j3980L7874J40217
$$ -45748 -29046 50473 99886 48351 -10508 -68953 -123382 -197814 -211794 -173920 -33703
15895c3703k3442M89K866L6141J539M218P869L3775K1535r818J0605K2013K4565
$$ -33703 -57145 -56656 -53790 -17649 -16110 -11892 -4023 29752 51287 41469 52074 74087 98652
15882I8652l1564K6357q1885o6565M3788L535o4700N7230O7545K9256l0038N4054
$$ 98652 67088 93445 11560 -55005 -11217 -7682 -72382 -15152 52393 81649 51611 105665
15870A05665L2206o1225q9119m5956J412j0040j1592K5673N4463m4548j0291N3580
$$ 105665 137871 76646 -12473 -58429 -57017 -67057 -78649 -52976 1487 -43061 -53352 228
15858B28q0862q092J23831n394q1179k098N2j34Q301K4982K7278K875m8262P0792
$$ 228 -80634 -88726 35105 29711 -51468 -53566 -53514 -53648 -45347 -20365 6913 9788 -38474 32318
15844C2318K6066o1640k2990n0315j9802Q1845M4575K6954j7881l4404j6847K5648
$$ 32318 58384 -3256 -26246 -76561 -96363 -14518 30057 57011 39130 4726 -12121 13527
15832A3527N6088N1366l3221m6893j8470O6514J7356q9105o8812k3773J831M2170
$$ 13527 69615 120981 87760 40867 22397 88911 106267 17162 -51650 -75423 -73592 -31422
15820c1422L465J0777P9806q777j4639K0894L6797M2246L8426k6700j05824o5187
$$ -31422 -27957 -17180 62626 53849 39210 60104 96901 139147 177573 150873 45049 -20138
15808b0138l2176k6701k6652k3181N7983n3671n0334N6957P2452n451r038J7856
$$ -20138 -52314 -79015 -105667 -128848 -70865 -124536 -174870 -117913 -45461 -50912 -59950 -42094
15796d2094J502K9050K1276p8556j0748J9739O4006O1877N9664m7021j05301M560
$$ -42094 -40592 -11542 9734 -68822 -79570 -59831 4175 66052 125716 78695 -26606 -22046
15784b2046M4805L9416Q1527l1608o5341l3111n8504N3673K0276K5155N4300j516
$$ -22046 22759 62175 143702 112094 46753 13642 -44862 8811 29087 54242 108542 107026
15772A07026m5404j0000O431N1109j4870o9176j3413J0319K9633p2p5976L427
$$ 107026 61622 51622 58053 109162 94292 25116 11703 22022 51655 51583 -24393 -20966
15760b0966m8223j6599M9626J209J5887L3954M4886M4826q1227o4400j13416M3477
$$ -20966 -69189 -85788 -36162 -34953 -19066 14888 59774 104600 23373 -41027 -154443 -110966
15748a10966N0369m8264k4779J17109P2225k4406O4849j2227p9035R200K4724
$$ -110966 -60597 -108861 -133640 -16531 55694 31288 96137 83910 4875 14075 38799
15737C8799m2660J3251k7304p4112K7128K7415J0896L642K4361k1725j5581L4546
$$ 38799 -3861 9390 -17914 -92026 -64898 -37483 -26587 -22945 1416 -20309 -35890 -1344
15725a344O539q3286O95J03685L8300N5498Q544K5776j407q0401j9958m7773l3833
$$ -1344 5195 -78091 -77396 26289 64589 120087 128631 154407 153000 72599 52641 4868 -28965
15712b8965L591p037K4391P95J0777o7097k7287J7656J477L2275J9871n4376j0969
$$ -28965 -25374 -32411 -8020 -7225 3552 -63545 -90832 -73176 -71699 -39424 -19553 -73929 -84898
15699h4898L9455O6415M9734l9536l8473r001N9750n991p4885p4956n2939K088
$$ -84898 -45443 20972 70706 31170 -7303 -16304 43446 37455 -37430 -112386 -165325 -163237
15687a63237O6644M1666l669J541j1086L973j9343k4108J3624N8503L9503o8318
$$ -163237 -96593 -54927 -58596 -57055 -68141 -64168 -83511 -107619 -93995 -35492 4011 -64307
15675f4307J5016K0557L1997k2235m8273P2175M0393k9971j4313P3528l4360j0305
$$ -64307 -49291 -28734 3263 -18972 -67245 4930 45323 15352 1039 74567 40207 29902
15663B9902P3217l4530l0793K2316k9801q195N185n4554q3537N1242L9909k4594
$$ 29902 103119 68589 37796 60112 30311 22116 27301 -27253 -110790 -59548 -19639 -44233
15651d4233O2877Q4166j4295j7245l7527Q97Q056m158k4660l5323o015l1297J0786
$$ -44233 18644 102810 88515 71270 33743 34640 42696 38538 13878 -21445 -27460 -58757 -47971
15638d7971r4596j7601R4996L0878L780n9482j4216P2098N0026M7741J5262m9223
$$ -47971 -142567 -160168 -65172 -34294 -30514 -89996 -104212 -32114 17912 65653 80915 31692
15626C1692j01506p5686M0402J01157O7880l5465m655R7504m5367j18863j9014
$$ 31692 -69814 -145500 -105098 -3941 63939 28474 23819 121323 75956 -42907 -61921
15615f1921K7190k6753J5725J1772L0724m3979q8102j0256P9760K7434k3916j6449
$$ -61921 -34731 -61484 -45759 -33987 -3263 -47242 -135344 -145600 -65840 -38406 -62322 -78771
15603g8771l2556O0817M7274q5600o4975l328O8337O6806n0290j2738N2301l2914
$$ -78771 -111327 -50510 -3236 -88836 -153811 -157139 -88802 -21996 -72286 -85024 -32723 -65637
15591f5637J8593K5596K8183N4689p666l8597l1475J945J7901L2331N1192J0132
$$ -65637 -47044 -21448 6735 61424 53758 15161 -16314 -14369 3532 35863 87055 97187
15579I7187m2087q7746j0655O9065o2638M3119K2717m0070j0549k3631O1296K1300
$$ 97187 55100 -32646 -43301 25764 -36874 6245 28962 -11108 -21657 -45288 16008 37308
15567C7308l951m6206K1495m6887p542o654k4570k6063o941R8810p815l8437m1443
$$ 37308 33357 -12849 8646 -38241 -45783 -52437 -77007 -103070 -110011 -11201 -19016 -57453 -98896
15554i8896P52M7852L7202q7132j00225O6373M5694K8526P4507M2263k2079L4292
$$ -98896 -98144 -50292 -13090 -100222 -200447 -134074 -88380 -59854 14653 56916 34837 69129
15542F9129j3551j4601l3612O298k56j06732j5939k0979l2613M9987l9767N42
$$ 69129 55578 40977 7365 13663 13407 -93325 -109264 -130243 -162856 -112869 -152636 -152094
15530a52094K853n1258M2978R7756J3069p2255K478K7234N4147n5466O407m8580
$$ -152094 -149241 -200499 -157521 -59765 -46696 -118951 -116473 -89239 -35092 -90558 -84151 -132731
15518a32731l448R6288J7574J2729j8600k4997J4104N857J1341K6039K4764l9262
$$ -132731 -136179 -39891 -22317 -9588 -28188 -53185 -39081 -33224 -21883 4156 28920 -10342
15506a0342J6365K0708J2981l1447l7342L6878L2803p5427o3283o4160R597J19205
$$ -10342 6023 26731 39712 8265 -29077 7801 40604 -34823 -98106 -162266 -152669 -33464
15494c3464M707P2485M3221J9532q1313j19320K0261L1420K2327O9672M4768l6832
$$ -33464 -28757 43728 86949 106481 25168 -94152 -73891 -42471 -20144 49528 94296 57464
15482E7464p9677m3294o578P4558P267j54L3555J2671J8946o4697K4395K3431
$$ 57464 -22213 -65507 -72085 2473 9740 9586 43141 55812 74758 10061 34456 57887
15470E7887j20952p1899Q7139N2785P084L5219J6328n3347l9238k9397L4244J04481
$$ 57887 -63065 -134964 -47825 4960 12044 47263 63591 10244 -28994 -58391 -24147 80334
15458H0334j4487Q629q5217q0176j9179P5146M7837M2279n4869k5038m9307K8310
$$ 80334 65847 74476 -10741 -90917 -110096 -34950 12887 55166 297 -24741 -74048 -45738
15446d5738O6947k3608j4661m6492m367R381n45l7951j1894K8645O4327K7380
$$ -45738 21209 -2399 -17060 -63552 -67919 -58538 -59083 -97034 -108928 -80283 -15956 11424
15434A1424m9900K9237R533m4380n570l9574q435n3542l1683O1434O1433o3714
$$ 11424 -38476 -9239 294 -44086 -49656 -89230 -97665 -151207 -182890 -121456 -60023 -123737
15422a23737j784N3538N9551n0450k6033M3216L3758K5895M3441K2307K6908J0240
$$ -123737 -125521 -71983 -12432 -62882 -88915 -45699 -11941 13954 57395 79702 106610 116850
15410A16850k5222k2907p6910m5071j3711L8649l6060K058j01408l2971Q8866
$$ 116850 91628 68721 -8189 -53260 -66971 -28322 -64382 -62324 -163732 -196703 -107837
15399a07837K6804n8407n294J5537R1812K69P104k8661n832j1853M2284L7852
$$ -107837 -81033 -139440 -144734 -129197 -37385 -37116 -30012 -58673 -64505 -76358 -34074 3778
15387C778M74q711j2606l3874m6756N569K0252o667Q547k8977k0070N3152J6992
$$ 3778 4252 -4459 -17065 -50939 -97695 -92126 -71874 -78541 -69994 -98971 -119041 -65889 -48897
15374d8897N437J7406j5348K784L965j7943m6559J2668k9055M5661m6604p3276
$$ -48897 -43460 -26054 -41402 -38618 -34653 -52596 -99155 -86487 -115542 -69881 -116485 -189761
15362a89761K9698O5941K5007J2620Q036k8483K0130k1012M9280k0035m2904L9627
$$ -189761 -160063 -94122 -69115 -56495 -48459 -76942 -56812 -77824 -28544 -48579 -91483 -51856
15350e1856O3943l0584j00942m9166M5237J22265J32405N842j12199l4515p522
$$ -51856 12087 -18497 -119439 -168605 -123368 -1103 131302 137144 24945 -9570 -17092
15339a7092M337J7447J0910m7606j8967R2368K1141m8057n2673K4567P676K1538
$$ -17092 -12755 4692 15602 -32004 -50971 41397 62538 14481 -38192 -13625 -5949 15589
15327A5589K7111M7969n5198r9223J1383K3211N0770N9877o7273j836o1850l587
$$ 15589 42700 90669 35471 -63752 -52369 -29158 21612 81489 14216 12380 -49470 -53057
15315e3057N3305j7744n645j3149R2378n0350n3589O250Q2292o6812o1517l958
$$ -53057 248 -17496 -23141 -36290 56088 5738 -47851 -41601 40691 -26121 -87638 -91596
15303i1596O7475J4968K339r176Q808j2714m7260o4250L7379N2200N8351j6136
$$ -91596 -24121 -9153 -6814 -15990 -7182 -19896 -67156 -131406 -94027 -41827 16524 388
15291C88K9192K0813m0559m7015K9282N5029p543n1540r750j934K0415M0118o2942
$$ 388 29580 50393 9834 -37181 -7899 47130 39587 -11953 -21703 -23637 -3222 36896 -26046
15278b6046o1850j834K8531J4077k9011l6463Q2017J2960J7879q516N4163J7003
$$ -26046 -87896 -89730 -61199 -47122 -76133 -112596 -30579 -17619 260 -8256 45907 62910
15266F2910l1586J5811L1432M2852M9489l8958K282r8637m3039l78p9571J3529
$$ 62910 31324 47135 78567 121419 170908 131950 134232 35595 -7444 -7822 -87393 -73864
15254g3864P4803k26m3493l5956l1625Q6422K8657P925n122l0676j4998l2150
$$ -73864 939 713 -42780 -78736 -110361 -23939 4718 12643 7521 -23155 -38153 -70303
15242g0303m3966M7781p559k0986K3317l7827N3099M7819Q1622n6969n9684l3946
$$ -70303 -114269 -66488 -74047 -95033 -71716 -109543 -56444 -8625 72997 16028 -43656 -77602
15230g7602M9305l7658j8409J37109N9820k1771p8877k9922Q169m9214M2650R059
$$ -77602 -28297 -65955 -84364 52745 112565 90794 11917 -18005 -9836 -59050 -16400 -7341
15218g341q508r070P3622N29p2483k4437l7158R604N4539J3072R352J1927j6075
$$ -7341 -15849 -24919 48703 49232 -23251 -47688 -84846 -75242 -20703 -7631 1721 13648 -2427
15205b427N5006Q504J1225p84j4525k4057K6530K3499m4516j134k2112J2435l8141
$$ -2427 52579 61083 72308 71524 56999 32942 59472 82971 38455 37321 15209 27644 -10497
15192a0497l9406l8535m7886l6540O6426L1963N0058K9954M750L6488M933K1579
$$ -10497 -49903 -88438 -136324 -172864 -106438 -74475 -24417 5537 10287 46775 51708 73287
15180G3287o1237m4267l4360m7414P1987N0636l1516K4601N4741P52j6430k0051
$$ 73287 12050 -32217 -66577 -113991 -42004 8632 -22884 1717 56458 57210 40780 20729
15168B0729j6655o9359n3263K5392j96K9088K6829n1546J8803L6561p58k5907
$$ 20729 4074 -65285 -118548 -93156 -93352 -64264 -37435 -88981 -70178 -33617 -34375 -60282
15156f0282J600R9687J2436r9539n0357J8723R3339J4377m5233o5416k8129j9607
$$ -60282 -58682 41005 53441 -46098 -96455 -77732 15607 29984 -15249 -80665 -108794 -128401
15144a28401O0676J01859J4202K1910n1114l5611L2706J5155m4289o2548j363
$$ -128401 -67725 34134 48336 70246 19132 -16479 16227 31382 -12907 -75455 -76818
15133g6818L0031L8817q028o5412m7900o0048j6138J05774J39487J11340j668
$$ -76818 -46787 -7970 -15998 -81410 -129310 -189358 -205496 -99722 39765 151105 149437
15122A49437k2215n3864m5088Q08n0996o194J3883l6662l7704O4081Q6963K6198
$$ 149437 127222 73358 28270 29078 -21918 -28112 -14229 -50891 -88595 -24514 62449 88647
15110H8647J465m568p638k3182n4752p033R711L627k7508k5253J4311L7715o9374
$$ 88647 90112 85544 77906 54724 -28 -7061 2650 6277 -21231 -46484 -32173 5542 -63832
15097f3832P825P33n968m846n349M0996k7543Q048J7270P798q227l3738M1575
$$ -63832 -56007 -55274 -61242 -66088 -71437 -30441 -57984 -49936 -32666 -24868 -33095 -66833 -25258
15084b5258M6425K859k9347m1059k3646m0321O8048Q5708n8154m5569N5894L2374
$$ -25258 21167 24026 -5321 -46380 -70026 -110347 -42299 43409 -14745 -60314 -4420 27954
15072B7954J3925m1891L5426K9595l631j7251o3328J2699n4767M6318Q931P0536
$$ 27954 41879 -12 35414 65009 61378 44127 -19201 -6502 -61269 -14951 -6020 64516
15060F4516J8317n0512k4052j10531k6621n8714n1537K8694K7629Q6740P9626
$$ 64516 82833 32321 8269 -102262 -128883 -187597 -239134 -210440 -182811 -96071 -16445
15049a6445N3890l9879l1864N1433N353l6962N0523m4916j4998K9558R8900J8241
$$ -16445 37445 -2434 -34298 17135 22488 -14474 36049 -8867 -23865 5693 104593 122834
15037A22834j3720n458K2820O28M578Q763k2133K9455r5106K2698K5716n730k7453
$$ 122834 109114 103656 126476 127104 131682 140445 118312 147767 52661 75359 101075 95345 67892
15024F7892R220q643l7735J7863J190n6526j4296R049l1232j6077L6295M7446
$$ 67892 77112 68469 30734 48597 49787 -6739 -21035 -11986 -43218 -59295 -23000 24446
15012B4446M1003K6417K840O2624p1427p6102L4904K3730n5017r250K0480J6202
$$ 24446 65449 91866 94706 157330 85903 9801 44705 68435 13418 4168 24648 40850
15000D0850J7288j2846k1281M193Q3j7444o8132L4540K2771j3153M573l129l6766
$$ 40850 58138 45292 24011 28204 28287 10843 -57289 -22749 22 -13131 -8558 -11687 -48453
14987d8453r518m5018O143O427R4572J0182q4741m2003K2562N3717L7516n9197
$$ -48453 -57971 -102989 -96846 -90419 4153 14335 -70406 -112409 -89847 -36130 1386 -57811
14975e7811j9527J23167k2301m4020n392M9360M0212n0997M2715L7924k473m0227
$$ -57811 -77338 45829 23528 -20492 -25884 23476 63688 12691 55406 93330 90857 50630
14963E0630J7801j1906k9735M0112L3509O3183k4073n7480j2031j1114L1340O04
$$ 50630 68431 56525 26790 66902 100411 163594 139521 82041 70010 58896 90236 90840
14951I0840o6083J7950j9327L2718m5234k6464k5118M1326O4281o6819m4071L0152
$$ 90840 24757 42707 23380 56098 10864 -15600 -40718 608 64889 -1930 -46001 -15849
14939a5849m976n5350q1062j2191M7172P0586O8981O5541n1527p9094J0629J2729
$$ -15849 -20825 -76175 -157237 -169428 -122256 -51670 17311 82852 31325 -47769 -37140 -24411
14927b4411J8241j5230K0357o1402n5131N6352M7198M4204k9083r462J3291J2316
$$ -24411 -6170 -21400 -1043 -62445 -117576 -61224 -14026 30178 1095 -8367 4924 17240
14915A7240M3112q2854n3827K566J2391n440J9143k6198o683l0870k1255P5359
$$ 17240 60352 -22502 -76329 -73763 -61372 -66812 -47669 -73867 -80550 -111420 -132675 -57316
14903e7316K590m8937O711O0023l3719J6685J05002m058j9414k1035n6508j3822
$$ -57316 -54726 -103663 -96952 -36929 -70648 -53963 51039 46981 27567 6532 -49976 -63798
14891f3798P3116M3759n4158l3557m8001O4252R0399M2262j0482o1570L8948j4815
$$ -63798 9318 53077 -1081 -34638 -82639 -18387 72012 114274 103792 42222 81170 66355
14879F6355j8547o4530r1905K862L6631k6760l1106Q8889N9235l9567p038M0659
$$ 66355 47808 -16722 -108627 -105765 -69134 -95894 -127000 -38111 21124 -18443 -25481 15178
14867A5178N4309n3858Q708j0354m9891k8374q681n414K2235K7712l329n8693
$$ 15178 69487 15629 24337 13983 -35908 -64282 -72963 -78377 -56142 -28430 -31759 -90452
14855i0452l3622k0683N0413O2566q7226l9566p7040K9784q246R2459K4893j2720
$$ -90452 -124074 -144757 -94344 -31778 -119004 -158570 -235610 -205826 -214072 -121613 -96720 -109440
14843a09440l694L5642M8853j5054p8288K0093M5173Q0131q329N8304M2841l7606
$$ -109440 -113134 -77492 -28639 -43693 -121981 -101888 -56715 23416 15087 73391 116232 78626
14831G8626k5321m5939m6677j2602k761M4374K5707K0594K7163J23120j978k4741
$$ 78626 53305 7366 -39311 -51913 -54674 -10300 15407 36001 63164 186284 184306 159565
14819A59565r3549R929l3563l1975j9960m3149j4837m960L9612L8038p957R449
$$ 159565 66016 75945 42382 10407 -9553 -52702 -67539 -72499 -32887 5151 -2806 6643
14807F643N8397L0934l9038r807P5740k9151j0278p0186o7172M1320L3700p7567
$$ 6643 65040 95974 56936 47129 122869 93718 83440 13254 -53918 -12598 21102 -56465
14795e6465m5666M0178L7990M5871k6035N091N6194l1275o6014j7347N2630L5344
$$ -56465 -102131 -61953 -23963 21908 -4127 964 57158 25883 -40131 -57478 -4848 30496
14783C0496k2660m5696R5869k6907m5583O4083O3222k4399k1690K7956n332k9588
$$ 30496 7836 -37860 58009 31102 -14481 49602 112824 88425 66735 94691 89359 59771
14771E9771J1751M1338P8667j3924j32707r6804N7742J05289M1585o7641j21268
$$ 59771 71522 112860 191527 177603 44896 -51908 5834 111123 152708 85067 -36201
14760c6201R274M9763n647j1522J4563j3613q748R989J14964j6703l1280J4639
$$ -36201 -26927 22836 17189 5667 20230 6617 -2131 7858 122822 106119 74839 89478
14748H9478M4163J3073L3575m2978m7285l4628M4574K0662M0927o9437K5265k043
$$ 89478 133641 146714 180289 137311 90026 55398 99972 120634 161561 92124 117389 115346
14736A15346p95j01019l4149N8817J1443l275k960K3379k8365m9939K4557L0278
$$ 115346 114551 13532 -20617 38200 49643 46368 43408 66787 38422 -11517 13040 43318
14724D3318L8884O5417n0469k0270j4112n5192J9833J1382O254k9619k6069M2974
$$ 43318 82202 147619 97150 76880 62768 7576 27409 38791 45045 15426 -10643 32331
14712C2331K7651L3951J2816M0706J8676q6821j0449j9012j1683L2168K8222K234
$$ 32331 59982 93933 106749 147455 166131 79310 68861 49849 38166 70334 98556 100790
14700A00790j1201n828m5706l5968M1677O4834L1147M1204J5405k5855j04332
$$ 100790 89589 83761 38055 2087 43764 108598 139745 180949 196354 170499 66167
14689F6167M3771J800l3610J3399P2681n8996m1376k1963N996O0345j23176o8034
$$ 66167 109938 111738 78128 91527 164208 105212 63836 41873 47869 108214 -14962 -82996
14677h2996L0658M3336O2461n714K5487M6527K7023m2449J0073K3405K5067p7613
$$ -82996 -52338 -9002 53459 47745 73232 119759 146782 104333 114406 137811 162878 85265
14665H5265j02592k9095M2138J6138j4143n6834l8285k3152O4349P4541M4000
$$ 85265 -17327 -46422 -4284 11854 -2289 -59123 -97408 -120560 -56211 18330 62330
14654F2330J23863L0149j16673j29675j06448P9525P5322O7536j6344K1324m0650
$$ 62330 186193 216342 99669 -30006 -136454 -56929 18393 85929 69585 90909 50259
14643E0259l9812l3208N8389K4805o3861j8015M8054k797p341N444j01600l5657
$$ 50259 10447 -22761 35628 60433 -3428 -21443 26611 23814 16473 21917 -79683 -115340
14631a15340N0560P4707M2950k8177n9254P1020P8600k1410o3907k6542K1053
$$ -115340 -64780 9927 52877 24700 -34554 36466 115066 93656 29749 3207 24260
14620B4260O2571m4750L6953K4394p9695q3175m8861O0646L3217n6364Q097k747
$$ 24260 86831 42081 79034 103428 23733 -59442 -108303 -47657 -14440 -70804 -62707 -65454
14608f5454p46q450K5464P4773k8893J5303j4310J8427n191M7663M6625m447j4668
$$ -65454 -66200 -74650 -49186 25587 -3306 11997 -2313 16114 10923 58586 105211 100764 86096
14595H6096j35915j1659P0092K8607r4242l119O0735M1036j5141p4177j3891J08118
$$ 86096 -49819 -61478 8614 37221 -57021 -60140 595 41631 26490 -47687 -61578 46540
14583D6540P3542m7014j22712O2176J15130M1871n8681o6919K9431O3700p0657
$$ 46540 120082 73068 -49644 12532 127662 169533 110852 43933 73364 137064 66407
14572F6407l4463l5773n4680R2930N4897o4540n2801l8084J6331O1437j5347k9497
$$ 66407 31944 -3829 -58509 34421 89318 24778 -28023 -66107 -49776 11661 -3686 -33183
14560c3183J6798N3406j8559j4928R570L3749j9204n724N448m0671K5107l4582
$$ -33183 -16385 37021 18462 3534 13104 46853 27649 21925 27373 -13298 11809 -22773
14548b2773p7269J9593J26397M3320k0402n5033O351L9748p46j01631l3741M472
$$ -22773 -100042 -80449 45948 89268 68866 13833 20184 59932 59186 -42445 -76186 -71714
14536g1714M6040o1309j1481N7680K310J24359k3275j07868r2390k5965P9008
$$ -71714 -25674 -86983 -98464 -40784 -38474 85885 62610 -45258 -137648 -163613 -84605
14525h4605R5516K2348j4769O945R8195l558n1008n4812L298M7032L1573R157
$$ -84605 10911 33259 18490 25435 123630 120072 69064 14252 17550 64582 96155 105312
14513A05312P445o334K8784j5862j5803j8550L2882R4347n627q0185K427k8020
$$ 105312 112757 106423 135207 119345 103542 84992 117874 212221 206594 126409 128836 100816
14501A00816J3381o538m305n9938n6878k071J9056k9968N4480m5995Q294k3984
$$ 100816 114197 107659 103354 43416 -13462 -15533 3523 -26445 28035 -17960 -9666 -33650
14489c3650N0645j1099J3211J746Q315M4333N2797J9892k5245k5242l892l4698
$$ -33650 16995 5896 19107 20853 29168 73501 126298 146190 120945 95703 91811 57113
14477E7113l1169j19048P7192J8548l2206J1938K4501R581L263p9599L63Q1130
$$ 57113 25944 -93104 -15912 2636 -29570 -17632 6869 16450 19713 -59886 -59523 21607
14465B1607M507k0729l2329j3661P2328L4279N2726j7244q8439n8578O299j3273
$$ 21607 26114 5385 -26944 -40605 31723 66002 118728 101484 13045 -45533 -39234 -52507
14453e2507m3276j0868Q4977k828L7755m3873j00472N1509L1517J3003J6603n9010
$$ -52507 -95783 -106651 -21674 -24502 13253 -30620 -131092 -79583 -48066 -35063 -18460 -77470
14441g7470N3891l785k0774n1006N9053O6185L8371q8141o7757M2292M7132O7827
$$ -77470 -23579 -27364 -48138 -99144 -40091 26094 64465 -23676 -91433 -49141 -2009 65818
14429F5818K4188L6282o1439n9326n7599R4583J4039k5936l8938L524o2315m0864
$$ 65818 90006 126288 64849 5523 -52076 42507 56546 30610 -8328 -4804 -67119 -107983
14417a07983L7394K8763J3872J3587K8496k951j8688n8926o0988j0115L1930L3969
$$ -107983 -70589 -41826 -27954 -14367 14129 11178 -7510 -66436 -127424 -137539 -105609 -71640
14405g1640J2288Q6045M3380n0792l6452N7756M0054k1529l1966K1464O0764N155
$$ -71640 -59352 26693 70073 19281 -17171 40585 80639 59110 27144 48608 109372 114527
14393A14527Q7722q4705m8858M9441L555L1516n1778l4103J224n9237m999N7964
$$ 114527 202249 117544 68686 118127 121682 153198 101420 67317 68541 9304 4305 62269
14381F2269j3691j2887o0891M078P7026M5235o2386l3175p897P7617O4570N5543
$$ 62269 48578 35691 -25200 -21122 55904 101139 38753 5578 -2319 75298 139868 195411
14369A95411q8731n4168N6604n292l7261l5858r098l3757N7255L2086l7604q5393
$$ 195411 106680 52512 109116 103824 66563 30705 21607 -12150 45105 77191 39587 -45806
14357d5806k9365n1489N8902K2035r137N27K1319K1805o090L6538k1111j5932
$$ -45806 -75171 -126660 -67758 -45723 -54860 -54333 -33014 -11209 -17299 19239 -1872 -17804
14345a7804l7577J11588N9469L2432j0840j3186m7746l8643q0772o7320l739N7208
$$ -17804 -55381 56207 115676 148108 137268 124082 76336 37693 -43079 -110399 -114138 -56930
14333e6930M6716R779J7498l9407l7593K8821L1372N5827K1379O7738j8599j08042
$$ -56930 -10214 -435 17063 -22344 -59937 -31116 256 56083 77462 145200 126601 18559
14321A8559j06197j3697L1958j5147J7266J7655J3928O929K0584n2174k1758O586
$$ 18559 -87638 -101335 -69377 -84524 -67258 -49603 -35675 -28746 -8162 -60336 -82094 -75508
14309g5508J3570O6632N6297K3670r7096J4824j6057J1703R487J7009o86o953
$$ -75508 -61938 4694 60991 84661 -12435 2389 -13668 -1965 7522 24531 23845 16892
14297A6892J0856n6629k1561j4114O8782J7927m7949N549P1983K5723O7968j4281
$$ 16892 27748 -28881 -50442 -64556 4226 22153 -25796 -20247 51736 77459 145427 131146
14285A31146n8251j3665M6853J6318m1763J6810M9624P606p7616k6782j0686N5556
$$ 131146 72895 59230 106083 122401 80638 97448 147072 154678 77062 50280 39594 95150
14273I5150J1783o6099p4139L8486m5211J3851M5798O1624n61r3682k4886K4909
$$ 95150 106933 40834 -33305 5181 -40030 -26179 19619 81243 80682 -13000 -37886 -12977
14261a2977o5448m7390M3248R2724M5887N5088q2219n312P3984J882n0200l2722
$$ -12977 -78425 -125815 -82567 10157 56044 111132 28913 23601 97585 99467 49267 16545
14249A6545k3896K4251m6721M7799j7824m4283L7873Q8032L9620j1481m4199N669
$$ 16545 -7351 16900 -29821 17978 154 -44129 -6256 81776 121396 109915 65716 71385
14237G1385L5861j3858k0477J14322k6727p8829J948N3124o4139j41132J1690
$$ 71385 107246 93388 72911 187233 160506 81677 83625 136749 72610 -68522 -56832
14226e6832P3693O6337K621q38L0229K8673n5473q6712m2378R115j4019n1298
$$ -56832 16861 83198 85819 84981 115210 143883 88410 1698 -40680 -31565 -45584 -96882
14214i6882K7758M9096N755Q4128K7878k9360l8490j6093Q2324M0225K3773k1691
$$ -96882 -69124 -20028 -14273 69855 97733 68373 29883 13790 96114 136339 160112 138421
14202A38421o371K0738p7819n6133O1699R0310o2506r3631l9848j3757L6400O8410
$$ 138421 132050 152788 74969 18836 80535 170845 108339 14708 -25140 -38897 -2497 65913
14190F5913m297l1599J2535p673m6936k342k7160K605l8397P2937K5046m1108
$$ 65913 61616 30017 42552 34879 -12057 -14399 -41559 -38954 -77351 -4414 20632 -20476
14178b0476L1311L5021l7911l7346l741p737K5472l8543L5496K2219n6021O3455
$$ -20476 10835 45856 7945 -29401 -33142 -40879 -15407 -53950 -18454 3765 -52256 11199
14166A1199m365L6045N0803j0058K9017j8838m4806q1769p9409L4342P4854O6930
$$ 11199 6834 42879 93682 83624 112641 93803 48997 -32772 -112181 -77839 -2985 63945
14154F3945m74J7330J936O942K3605k8941j6332o8744q8259N711Q3812n3235k9072
$$ 63945 63471 80801 82737 89679 113284 84343 68011 -733 -88992 -83281 531 -52704 -81776
14141h1776L4675J5560Q2881L0508m3143l6239j7837q185o06l79j1577R32K8723
$$ -81776 -47101 -31541 51340 81848 38705 2466 -15371 -23556 -24162 -24541 -36118 -35186 -6463
14128f463j4149l9369l8961L4994L8946k0472n8304M5412J18577m962k2563K4250
$$ -6463 -20612 -59981 -98942 -63948 -25002 -45474 -103778 -58366 60211 55249 32686 56936
14116E6936Q6756j00118K5742r0728n5752L9896L494k2564k218k4408R285R6315
$$ 56936 143692 43574 69316 -21412 -77164 -37268 -33774 -56338 -58556 -82964 -73679 22636
14104B2636p475N8410Q8932l1776p1083R544l7973m3050m3593l0648J12961N7462
$$ 22636 15161 73571 162503 130727 59644 69188 31215 -11835 -55428 -86076 26885 84347
14092H4347q5134L0862r3130k9917Q9478R9669J4349M5139m6044o6525q1396j139
$$ 84347 -787 30075 -63055 -92972 -3494 96175 110524 155663 109619 43094 -38302 -39441
14080c9441O5760o4028Q039J40115m0896r6982k8365L6058R1203K4416R669j5307
$$ -39441 26319 -37709 -29670 110445 69549 -27433 -55798 -19740 71463 95879 105548 90241
14068I0241j32082m5586j5736O8276N9421m3438k4124k7457L548K5092m5444L8861
$$ 90241 -41841 -87427 -103163 -34887 24534 -18904 -43028 -70485 -66937 -41845 -87289 -48428
14056d8428M0464p0917k4526m2500Q5203Q9438O402l2094p904j3079P802J2870
$$ -48428 -7964 -78881 -103407 -145907 -60704 28734 35136 3042 -4862 -17941 -10139 2731
14044B731M9769Q7370K575m5868q078l5227j0492k9729k280K942m1872L501m4893
$$ 2731 52500 139870 142445 96577 88499 53272 42780 13051 10771 13713 -28159 -24658 -69551
14031f9551n1166K5057P2677j4980K1792L0987O4915L8396m1068r7857J6297J12235
$$ -69551 -120717 -95660 -22983 -37963 -16171 14816 79731 118127 77059 -20798 -4501 107734
14019A07734P0133K9527m2354m2991K8898K0479n3150p4873r1827J04M5112M0681
$$ 107734 177867 207394 165040 122049 150947 171426 118276 43403 -48424 -48320 -3208 37473
14007C7473j3849k3010k399m4194N2796k0775m2928l2841k2232N484Q541P4043
$$ 37473 23624 614 -1785 -45979 6817 -13958 -56886 -89727 -111959 -106475 -97934 -23891
13995b3891O754P7263M6755M13k0452j5736L5800k5628J1744J5290r996P9640
$$ -23891 -17137 60126 106881 107294 86842 71106 106906 81278 93022 108312 98316 177956
13983A77956K0715m0722j11896q3340n5784L3088O3814k5048K8591R320K5054
$$ 177956 198671 157949 46053 -37287 -93071 -59983 3831 -21217 7374 16694 41748
13972D1748M0275o10o0378o5927m4760K4986R2482L7951J11o2420j9118J9924
$$ 41748 82023 81413 21035 -44892 -89652 -64666 27816 65767 65878 3458 -15660 4264
13960D264j4459k3711p518k3401O2459J07374N2613L0043m5615n2150J7493m266
$$ 4264 -10195 -33906 -41424 -64825 -2366 105008 157621 187664 142049 89899 107392 103126
13948A03126r705m3801m9986J0071J5270K5547J1537N6266K9472r568Q741J5365
$$ 103126 93421 49620 -366 9705 24975 50522 62059 118325 147797 138229 146970 162335
13936A62335k0446l7322k3665O7360N8787M995l0040m0366N4854L1685l1675L1414
$$ 162335 141889 104567 80902 148262 207049 212044 182004 141638 196492 228177 196502 227916
13924B27916q060j17366j13949o5805P3878L6656p5454q448M4390L9820l379k8861
$$ 227916 219856 102490 -11459 -77264 -3386 33270 -42184 -50632 -6242 33578 30199 1338
13912A338J569K1416n5429M8024K2856j893L0631J4361l7206M9240Q7329N4400
$$ 1338 2907 24323 -31106 16918 39774 37881 68512 82873 45667 94907 182236 236636
13900B36636N9699J4120p1723l2260o401l791q738J3236K5716J2371m5416j2393
$$ 236636 296335 310455 238732 206472 200071 196280 187542 200778 226494 238865 193449 181056
13888A81056j4199N1388k1385m6652p476k9696N3768j1393k6092l206j350n2691
$$ 181056 166857 218245 196860 150208 142732 113036 166804 155411 129319 126113 124763 72072
13876G2072j3282L9791K4343K6716J3718m570q720k8834P4399l8089n383Q908
$$ 72072 58790 98581 122924 149640 163358 158788 150068 121234 195633 157544 152161 161069
13864A61069l4987l2882K4584j2001l1164M2784m5707j10798k7570N6183P2801
$$ 161069 126082 93200 117784 105783 74619 117403 71696 -39102 -66672 -10489 62312
13853F2312N5225j4198N4208J8810n8536o8363L2121J1145l1123N8968q4023K3573
$$ 62312 117537 103339 157547 176357 117821 49458 81579 92724 61601 120569 36546 60119
13841F0119N0542k5972p113L230M996l4589j3103M6105M2587o1801p7606j6587
$$ 60119 110661 84689 77576 80806 85802 51213 38110 84215 126802 65001 -12605 -29192
13829b9192J8218J4051k971K3181m4655J3033J3184K7944M4264m5202K6491J2382
$$ -29192 -10974 3077 106 23287 -21368 -8335 4849 32793 77057 31855 58346 70728
13817G0728j1176n3648j481k5857m9443L4838P0959J33168L1750l3333r7159k4310
$$ 70728 59552 5904 4423 -21434 -70877 -36039 34920 168088 199838 166505 69346 45036
13805D5036l663L9100L1653L4517K5307n308k4871q2654j32518j3948N4503L2592
$$ 45036 41373 80473 112126 146643 171950 166642 141771 59117 -73401 -87349 -32846 -254
13793b54R0520M271M0250k2987q0240O3167o176j18794M6314L7589j1665L7832
$$ -254 90266 94537 134787 111800 31560 94727 88551 -30243 16071 53660 41995 79827
13781G9827M3502L8193K6761m0745K7508j6374j16169K8651R3100M3889J3460
$$ 79827 123329 161522 188283 147538 175046 158672 42503 71154 164254 208143 221603
13770B21603q1539r4920J7440K3849M6149M4278M1n0175k3682m5719o715m4391
$$ 221603 140064 45144 62584 86433 132582 176860 176901 126726 103044 57325 50610 6219
13758F219m8010O7493O5934p1145J3063N5155n5252l9378j6025M7216L781K7149
$$ 6219 -41791 25702 91636 20491 33554 88709 33457 -5921 -21946 25270 29051 56200
13746E6200Q8537L5383n8707Q690l4052p2441K332J9086l5354m6264R3906J0149
$$ 56200 144737 180120 121413 130103 96051 23610 25942 45028 9674 -36590 57316 67465
13734F7465K2256l2012k192J07499q135k9521k6281J6305K2558P1203R848o6078
$$ 67465 89721 57709 55517 163016 154881 125360 99079 115384 137942 209145 218993 152915
13722A52915n576L580p375n5294J4530J25452m55l5401K8372N4576P9482P8506
$$ 152915 147339 150919 143544 88250 102780 228232 227777 192376 220748 275324 354806 433312
13710D33312R0615P803l9438m2358J22283J11026M5117k7706r8561n8425k1564
$$ 433312 523927 531730 492292 449934 572217 683243 728360 700654 602093 543668 522104
13699E22104p2294p9484q6866n1529k176m5497q053l7869k9211K7447m9585q346
$$ 522104 449810 370326 283460 231931 229755 184258 176205 138336 109125 136572 86987 78641
13687G8641O5230R4707k8993k7665m8002j06414j7714K2724P748M653O5927k8468
$$ 78641 143871 238578 209585 181920 133918 27504 9790 32514 40262 44915 110842 82374
13675H2374L9610n2135j1383L4392K070L5179n9060o143N2572p5321o272K2594
$$ 82374 121984 69849 58466 92858 94928 130107 71047 64904 117476 42155 35883 58477
13663E8477k602r777P0337k455m7767j5118o7310O59K3843j8875J7353P2608N7524
$$ 58477 55875 46098 116435 113980 66213 51095 -16215 -15556 8287 -10588 6765 79373 136897
13650A36897L6941j1480O383k3807n320r9776j1595K5763l22L097K9542M6496
$$ 136897 173838 162358 168741 144934 139614 39838 28243 54006 53684 56781 86323 132819
13638A32819L2677Q613m5462k3609J5072j9685L2159Q190l1732m6707k0556j0008
$$ 132819 165496 174109 128647 105038 120110 100425 132584 140774 109042 62335 41779 31771
13626C1771j4753M3235J2536O6098P3972J3891p2917J9917J5978M0412M4446l0834
$$ 31771 17018 60253 72789 138887 212859 226750 153833 173750 189728 230140 274586 243752
13614B43752j14134n6959p6008M376M2390M2331J9752J9374j5723n6223N6232
$$ 243752 129618 72659 -3349 1027 43417 85748 105500 124874 109151 52928 109160
13603A09160R7497n3944q4935m3086k9992Q8516L0043n3608L9105J4942q0260
$$ 109160 206657 152713 67778 24692 -5300 83216 113259 59651 98756 113698 33438
13592C3438m6007L7527M6771J0448N337j2423O373J1535M7602J0231J9740l0463
$$ 33438 -12569 24958 71729 82177 87514 75091 81464 92999 140601 150832 170572 140109
13580A40109j2811J403q620j06364j201O0466L6474L7411j361n2427j6032M2775
$$ 140109 127298 128701 120081 13717 12516 72982 109456 146867 145506 93079 77047 119822
13568A19822j7172n5621k9281L4416O0210M4191N9645O851j6501m8581l9288K5003
$$ 119822 102650 47029 17748 52164 112374 156565 216210 223061 206560 157979 118691 143694
13556A43694R555n6793K881m6421R396J16255k5037n0075J5800Q3232L6274j0187
$$ 143694 153249 96456 99337 52916 62312 178567 153530 103455 119255 202487 238761 228574
13544B28574p0721k3675p973m4273R21K2970J5253m9386m6173M5271N2188o600
$$ 228574 157853 134178 126205 81932 82853 105823 121076 71690 25517 70788 122976 116376
13532A16376k0923J3690N1803L0552Q028k3445l0865j8914o711K886L453J5067
$$ 116376 95453 109143 160946 191498 199526 176081 145216 126302 119591 122477 125930 140997
13520A40997l6808L2502P592K711j6846o7983N7536P1500J0600k0014j7926M5995
$$ 140997 104189 136691 144283 146994 130148 62165 119701 191201 201801 181787 163861 209856
13508B09856K7867m5706p9090J7337n4483K0171L9077j658o2278j469O730m6960
$$ 209856 237723 192017 112927 130264 75781 95952 135029 133371 71093 69624 76354 29394
13496B9394O194Q2113J0639K3308K0352J053J6564M4605n4039j75239l4791M8258
$$ 29394 35588 117701 128340 151648 172000 173053 189617 234222 180183 4944 -29847 18411
13484A8411O6077M9384J183k1090l6771p1241K7926N3887M439L3680k3513K0879
$$ 18411 84488 133872 135055 113965 77194 5953 33879 87766 92205 125885 102372 123251
13472A23251J8620J7932j5539r197o7106j6994J2596M781Q4027M253j8558m3088
$$ 123251 141871 159803 144264 135067 67961 50967 63563 68344 152371 156624 138066 94978
13460I4978K3014L6304J4545J6475j9267O444L2329l1627o5825k2684k1525m2470
$$ 94978 117992 154296 168841 185316 166049 172493 204822 173195 107370 84686 63161 20691
13448B0691M0382Q5469k1603p6929j2795Q7171L0248J2505j35092k3164m963O3631
$$ 20691 61073 146542 124939 48010 35215 122386 152634 165139 30047 6883 1920 65551
13436F5551N7352M3885P402K1273j9530K1410m3281l0233L4172k2349K9036K2731
$$ 65551 122903 166788 174190 195463 175933 197343 154062 123829 158001 135652 164688 187419
13424A87419L0951q1596p9696J3511l4048j2026R0701M4700L411j00n4537L0949
$$ 187419 218370 136774 57078 70589 36541 24515 115216 159916 163327 163227 108690 139639
13412A39639o791m2998o2672n387J11936J01585L3300n6556m6221l1224L5732
$$ 139639 132848 89850 27178 21791 133727 235312 268612 212056 165835 134611 170343
13401A70343M5408L808o2711l6427M9884k7228M7272O2302l5046L235o7180l2995
$$ 170343 215751 219559 156848 120421 170305 143077 190349 252651 217605 220840 153660 120665
13389A20665M5494j4376L0187k6772o5228R57m2907K4494L5784P307j1838J5859
$$ 120665 166159 151783 181970 155198 89970 90927 48020 72514 108298 115605 103767 119626
13377A19626R494k4291K3090L0159j0750q8118k6342N622L4618M4673L0936L3159
$$ 119626 129120 104829 127919 158078 147328 59210 32868 38490 73108 117781 148717 181876
13365A81876k4153p4456j3779J04121o237r143O4490j2974m081K8953Q82N1278
$$ 181876 157723 83267 69488 173609 167372 158229 222719 209745 205664 234617 235499 286777
13353B86777j8993J1138J0127o5283K4396J9531n6098o3712j6333j5842J6858
$$ 286777 267784 278922 289049 223766 248162 267693 211595 147883 131550 115708 132566
13342A32566m9122L5841Q260q9447k602R3137O5149j1131j9073m2384K0720k235
$$ 132566 83444 119285 127545 38098 35496 128633 193782 182651 163578 121194 141914 139679
13330A39679m369n713K2982N8309j0423r2999L0347O8796L3458N6475q0947n8732
$$ 139679 135310 129597 152579 210888 200465 107466 137813 206609 240067 296542 215595 156863
13318A56863m7855J12030O1283n5803j7506L7718j1789R572K0958l554j7205j3155
$$ 156863 109008 221038 282321 226518 209012 246730 234941 244513 265471 261917 244712 231557
13306B31557l7499l9083n3467J1763j5591J5690O6242l3290l6302R968J26789
$$ 231557 194058 154975 101508 113271 97680 113370 179612 146322 110020 119988 246777
13295B46777O8948j11283q0457J1976Q6160n6804j4932N7694J5380L1914n7945
$$ 246777 315725 204442 123985 135961 222121 165317 150385 208079 223459 255373 197428
13284A97428j5271p048R831n72n147M960j8244k838J2966k3435j4755K2204O7017
$$ 197428 182157 175109 184940 184368 179221 184181 165937 163099 176065 152630 137875 160079 227096
13271B27096N8713J498n0908l6522n8808M9880K6936j8931l2983P2098m3276L1900
$$ 227096 285809 287307 236399 199877 141069 190949 217885 198954 165971 238069 194793 226693
13259B26693L4512r0106J7368m927q1824n8478O1912N5596k338m5004M764P057
$$ 226693 261205 171099 188467 183540 101716 43238 105150 160746 158408 113404 118168 125225
13247A25225J2773k7297K255R195m1659N0122L6304M1689M5529l9604j843p161
$$ 125225 137998 110701 112956 122151 80492 130614 166918 208607 254136 214532 212689 205528
13235B05528K9358k2335k1634K5705K0529p6615j1456J02911N5199j5893Q0348
$$ 205528 234886 212551 190917 216622 237151 160536 149080 251991 307190 291297 371645
13224C71645J8394m8294p2205r4000n3350L0010J8541O237k0543J2199P8183k5501
$$ 371645 390039 341745 269540 175540 122190 152200 170741 176978 156435 168634 246817 221316
13212B21316Q546L694j14161n0339l647L9219N8401k4617o4163P4532Q9170N0423
$$ 221316 229862 233556 119395 69056 65409 104628 163029 138412 74249 148781 237951 288374
13200B88374p210J7142P1811k146k9631K87K56k6088o1407j1245O4026P4281n2492
$$ 288374 281164 298306 370117 367971 338340 338627 338883 312795 251388 240143 304169 378450 325958
13187C25958j05124K7757P8080K0131M7861k8186m2367K4862j8716l4669o7831
$$ 325958 220834 248591 326671 346802 394663 366477 324110 348972 330256 295587 227756
13176B27756J039J16678L1327m8115o5526K4131m3608o9960n3056K4587P2496
$$ 227756 228795 345473 376800 328685 263159 287290 243682 173722 120666 145253 217749
13165B17749P032J1174l5055k2152J01269K0288M2126J13104O6623m582m3802
$$ 217749 224781 235955 200900 178748 280017 300305 342431 455535 522158 517576 473774
13154D73774N0680M433l096J4215L0704q0184P533O2475Q319j1109q513n3522
$$ 473774 524454 528887 525791 540006 570710 490526 498059 560534 568853 557744 549231 495709
13142D95709k0936p5694r4562m0717p9377l0131L3591O536O4730P6170J235j1843
$$ 495709 474773 399079 304517 263800 184423 154292 187883 194419 259149 335319 336554 324711
13130C24711J7835m6254q1136O5851J4914j223M6047L4243n1638K0894N8991l8130
$$ 324711 342546 296292 215156 281007 295921 294698 340745 374988 323350 344244 403235 365105
13118C65105n4617k0701J4473k6036n4696M6187N8580J5330l2577J04973N6210
$$ 365105 310488 289787 304260 278224 223528 269715 328295 343625 311048 416021 472231
13107D72231o2121L7474R781j371J4031j0906j00364l9368K6035m7060P593J02617
$$ 472231 410110 447584 457365 455994 470025 459119 358755 319387 345422 298362 305955 408572
13095D08572M4663J6847K3294l2856K062J3926N6315j058L935L4704J19948L0732
$$ 408572 453235 470082 493376 460520 462582 476508 532823 531765 535700 570404 690352 721084
13083G21084M0701M3220J9355P2683J22805J00543J66489L11313L08135L08195
$$ 721084 761785 805005 824360 897043 1019848 1120391 1286880 1598193 1906328 2214523
13073B214523K36071J03284N4225R6707J00591K9555j57564j60665j00997k64593
$$ 2214523 2450594 2553878 2608103 2704810 2805401 2834956 2677392 2516727 2415730 2151137
13063B151137k60880k53142k36346j69156q8948q6625m7233m4672n7450q1624
$$ 2151137 1890257 1637115 1400769 1231613 1142665 1056040 1008807 964135 906685 825061
13053H25061q4727n6222k5300J8871k6842M0808k3913l5688p0274k0171R091J1492
$$ 825061 740334 684112 658812 677683 650841 691649 667736 632048 561774 541603 550694 562186
13041E62186J2846j06473p9355l3699j2852J12527P4016k9966o0625M039N6832
$$ 562186 575032 468559 389204 355505 342653 455180 529196 499230 438605 442644 499476
13030D99476Q5048J4578q2686r7045L0905k8187p5366N6908J5223o3078j7674
$$ 499476 584524 599102 516416 419371 450276 422089 346723 403631 418854 355776 338102
13019C38102M9198k7333N8130M6586p5676l9699O4667J09093l7653j2596m5819
$$ 338102 387300 359967 418097 464683 389007 349308 413975 523068 485415 472819 427000
13008D27000m9832r997k7827J0213N7694R2115K0314N1453M9423J1145j01421
$$ 427000 377168 367171 339344 349557 407251 499366 519680 571133 620556 631701 530280
12997E30280j13604J5929M3596m8050k8170J2715J364M7252l0735n0006j1932
$$ 530280 416676 432605 476201 428151 399981 412696 414060 461312 430577 380571 368639
12986C68639l9792M0442O1072p6735k4202N4718M566q496K7705j9729K7948N3365
$$ 368639 328847 369289 430361 353626 329424 384142 388708 380212 407917 388188 416136 469501
12974D69501J0052J6698j22199J3148K7736j8765K6372O095N7806k7423K9607
$$ 469501 479553 496251 374052 387200 414936 396171 422543 428638 486444 459021 488628
12963D88628j0440O3595N8492m7728p3541m2129r553k9441j8654O768N4945L7910
$$ 488628 478188 541783 600275 552547 479006 436877 427324 397883 379229 385997 440942 478852
12951D78852N1641K9821j08596k3430m8153m4863k0638r115j8026J3534K6816
$$ 478852 530493 560314 451718 428288 380135 335272 314634 305519 287493 301027 327843
12940C27843R1766J13719M0126K9121j370m4465q7324O5561J3588m1482N289N9446
$$ 327843 419609 533328 573454 602575 601205 556740 469416 534977 548565 507083 512372 571818
12928E71818j1312p9208l7960j6710K0212K847J2047o44R99O1477J3241M5551
$$ 571818 560506 481298 443338 426628 446840 449687 461734 461090 462089 523566 536807 582358
12916E82358M8869k6440O3492j9989J8974L1937j545K5514k1506k9882K3723k4525
$$ 582358 631227 604787 668279 648290 667264 699201 697656 723170 701664 671782 695505 670980
12904F70980J8785O0162p0264J0818R3837P4087N7690J8926m9037J0194P4407
$$ 670980 689765 749927 679663 690481 784318 858405 916095 935021 885984 896178 970585
12893I70585J103q6484j1958m1875m918p308N203j5995q7124P7796Q6223L8212
$$ 970585 971688 885204 873246 831371 826453 819145 824348 808353 721229 799025 885248 923460
12881I23460P8161L8248Q0516J72345J49810Q2134J30777J36875N4408n6354j0957
$$ 923460 1001621 1039869 1120385 1292730 1442540 1524674 1655451 1792326 1846734 1790380 1779423
12870A779423j21654r4856j06775l8428o9213j06905r5101j08884K3808O5092
$$ 1779423 1657769 1562913 1456138 1417710 1348497 1241592 1146491 1037607 1061415 1126507
12860A126507N8708P0659m5007R463J30914J10664O5599O8813R0971M7518L4892
$$ 1126507 1185215 1255874 1210867 1220330 1351244 1461908 1527507 1596320 1687291 1734809 1769701
12849A769701J02878J09852L7575P0787M1095L6433J5363q554M1783l1225l7345
$$ 1769701 1872579 1982431 2020006 2090793 2131888 2168321 2183684 2175130 2216913 2185688 2148343
12838B148343p8826j22127j9435J8477l9122q4421O360P107n4839j10626q1249
$$ 2148343 2069517 1947390 1927955 1946432 1907310 1822889 1829249 1836356 1781517 1670891 1589642
12827A589642k8253j4292J0595l551L2972L7301M1735L2338R7666J52234R9152
$$ 1589642 1561389 1547097 1557692 1554141 1587113 1624414 1666149 1698487 1796153 1948387 2047539
12816B047539R6209K8262K4804N237o0663l6163j40516j45573j61299j49638q8656
$$ 2047539 2143748 2172010 2196814 2202051 2141388 2105225 1964709 1819136 1657837 1508199 1419543
12805A419543j85749k5353j7731m9331O384M5804O3438o174O931k4721l716k9424
$$ 1419543 1233794 1208441 1190710 1141379 1147763 1193567 1257005 1250831 1257762 1233041 1229325 1199901
12793A199901l8813M4135L0776j31438J1948N3718M7286L0328R0371J3192L3258
$$ 1199901 1161088 1205223 1235999 1104561 1116509 1170227 1217513 1247841 1338212 1351404 1384662
12782A384662J36311J2318K2296n9008M7983J10526j7412m959L4155o631k356
$$ 1384662 1520973 1533291 1555587 1496579 1544562 1655088 1637676 1632717 1666872 1660241 1657885
12771A657885j5092O5601K8249j4357m0844l7282n8105L459O7719J2904m8550
$$ 1657885 1642793 1708394 1736643 1722286 1681442 1644160 1586055 1589514 1657233 1670137 1621587
12760A621587L2961P0129J20465M7450k3917n3956j6564o8058n2356j5414Q4892
$$ 1621587 1654548 1724677 1845142 1892592 1868675 1814719 1798155 1730097 1677741 1662327 1747219
12749A747219L9043K665K0361k9830L2831L1910j5796m1124o9465O3236N974L2186
$$ 1747219 1786262 1788927 1809288 1779458 1812289 1844199 1828403 1787279 1717814 1781050 1787024 1819210
12737A819210M7746Q6945R2352l4053j19216l2678R5885N7259O9015M8943N5153
$$ 1819210 1866956 1953901 2046253 2012200 1892984 1860306 1956191 2013450 2082465 2131408 2186561
12726B186561J4653L9323K4557K4673l9689m3108q610O420J12733J10522J16021
$$ 2186561 2201214 2240537 2265094 2289767 2250078 2206970 2198360 2204780 2317513 2428035 2544056
12715B544056J54906N6801O4524P0804O6069L9015L3108J43908J07904Q7126J55346
$$ 2544056 2698962 2755763 2820287 2891091 2957160 2996175 3029283 3173191 3281095 3368221 3523567
12704C523567J26602Q7295Q2808N2313P6334J12158J50774J53931K34815L4431
$$ 3523567 3650169 3737464 3820272 3872585 3948919 4061077 4211851 4365782 4600597 4635028
12694D635028J73006L26200L09063K04374K10730K78873L74098L20144K99000
$$ 4635028 4808034 5134234 5443297 5647671 5858401 6137274 6511372 6831516 7130516
12685G130516M23505M45997N43008O31086P08881P81246Q88095J024361J051458
$$ 7130516 7554021 8000018 8543026 9174112 9882993 10664239 11552334 12576695 13628153
12676A3628153J200997J442257J718530J932292K250802K670154L038805L481997
$$ 13628153 14829150 16271407 17989937 19922229 22173031 24843185 27881990 31363987
12668C1363987M067539M595010N245569O037400P141917Q619129J0733531J3899338
$$ 31363987 35431526 40026536 45272105 51309505 58451422 67070551 77804082 91703420
12660I1703420J8441950K4612419L2052498L9637258M5987407M9739786N0300399
$$ 91703420 110145370 134757789 166810287 206447545 252434952 302174738 352475137
12653C52475137M7650074M1305243L0984693J6856586N15116j5646525k9563795
$$ 352475137 400125211 441430454 472415147 489271733 489786849 474140324 444576529
12646D44576529l9925919m6216757m8509890m7236880m2870390l6589969k9336310
$$ 444576529 404650610 358433853 309923963 262687083 219816693 183226724 153890414
12639A53890414k2082889j5983976j1775240r107045p479688o500665n802722
$$ 153890414 131807525 115823549 104048309 94941264 87461576 80960911 75158189
12632G5158189n349284m990618m753819m393807l985251l631476l288282k963971
$$ 75158189 69808905 64818287 60064468 55670661 51685410 48053934 44765652 41801681
12624D1801681k606893k298461j989557j692324j525663j369689j243392j131107
$$ 41801681 39194788 36896327 34906770 33214446 31688783 30319094 29075702 27944595
12616B7944595j018360r72450r63889q66246q89230r04080r58495q75512q16809
$$ 27944595 26926235 25953785 24989896 24123650 23234420 22330340 21371845 20496333 19679524
12607A9679524p44868o94172o90459o94434n64639o41186n69430n54100m35776
$$ 19679524 18934656 18240484 17550025 16855591 16290952 15649766 15080336 14526236 14090460
12598A4090460l70537m84156l97624m03769l47436l66759l12742l28670l18729
$$ 14090460 13719923 13235767 12838143 12434374 12086938 11720179 11407437 11078767 10760038
12589A0760038k68132k17282k15533k42550k03800k50198k69759k54407j92272
$$ 10760038 10491906 10274624 10059091 9816541 9612741 9362543 9092784 8838377 8646105
12580H646105j41785k10973k32768k38979j96548j54001j03272j01746j46779
$$ 8646105 8504320 8293347 8060579 7821600 7625052 7471051 7367779 7266033 7119254
12571G119254p1166n8997j66494k63288j44313j54811q7932j0879o4517k04865
$$ 7119254 7048088 6989091 6822597 6559309 6414996 6260185 6172253 6161374 6096857 5891992
12561E891992j27463n1562q8882p9492q0512n1943q0386r8014l017j27091l2274
$$ 5891992 5764529 5712967 5624085 5544593 5464081 5412138 5331752 5233738 5230721 5103630 5071356
12550E071356n410q4477q868j11328m001K1084q4383n0765l0838r5345p3291p0104
$$ 5071356 5065946 4981469 4972601 4861273 4857272 4878356 4793973 4743208 4712370 4617025 4543734 4473630
12538D473630n9303r983Q0928L7778L7535J05373Q818l9018L1372R1983N5301
$$ 4473630 4414327 4404344 4485272 4523050 4560585 4665958 4674776 4635758 4667130 4759113 4814414
12527D814414q1503o6877m7381p0817p0297n8718m9026K3246o0542N759L5392
$$ 4814414 4732911 4666034 4618653 4547836 4477539 4418821 4369795 4393041 4332499 4338258 4373650
12516D373650N1560L8100k2414J1807M2417n2851K761N1420K9175m8423m0563
$$ 4373650 4425210 4463310 4440896 4452703 4495120 4442269 4445030 4496450 4525625 4477202 4436639
12505D436639N873n8674o933o5215N6963J70242j930j0278l8747n9009o3665N6686
$$ 4436639 4442512 4383838 4376905 4311690 4368653 4538895 4536965 4526687 4487940 4428931 4365266 4421952
12493D421952L2008n648n410k0865l6105K9578Q7766O5173J2221J20303P0987
$$ 4421952 4453960 4448312 4442902 4422037 4385932 4415510 4503276 4568449 4580670 4700973 4771960
12482D771960P6694L6924R4186K7690P4034J04905O9675R4367N9273R1326R9771
$$ 4771960 4848654 4885578 4979764 5007454 5081488 5186393 5256068 5350435 5409708 5501034 5600805
12471E600805J72439K03218J65055J27329J04528J66646J93015J81196J93500
$$ 5600805 5773244 5976462 6141517 6268846 6373374 6540020 6733035 6914231 7107731
12462G107731J70999K21296K80031L51364L42481L43797L50619M27963M70612
$$ 7107731 7278730 7500026 7780057 8131421 8473902 8817699 9168318 9596281 10066893
12453A0066893N32110N94276O48537O96736Q25591P99000R61488J096331J101382
$$ 10066893 10599003 11193279 11841816 12538552 13364143 14163143 15124631 16220962 17322344
12444A7322344J296490J587654J727830J850619K228087K612570L094959L615805
$$ 17322344 18618834 20206488 21934318 23784937 26013024 28625594 31720553 35336358
12436C5336358M396600N272380O378127P824882R889347J2409908J5419616J8751309
$$ 35336358 39732958 45005338 51383465 59208347 69097694 81507602 96927218 115678527
12428A15678527K2048338K4589922K5039125K2567110J7332615J0899147M934779
$$ 115678527 137726865 162316787 187355912 209923022 227255637 238154784 243089563
12421B43089563n99844o464022j2814098j7825375j9417421j7604786j3698354
$$ 243089563 242489719 236025697 223211599 205386224 185968803 168364017 154665663
12414A54665663r430460n427140j760077J215192L695564N841225P526827Q884112
$$ 154665663 145235203 139808063 138047986 139263178 142958742 148799967 156326794 165210906
12406A65210906R942959J0827572J1582902J2075448J2472312J2818938J2967670
$$ 165210906 175153865 185981437 197564339 209639787 222112099 234931037 247898707
12399B47898707J2981668J2645628J1535217J0003813P866516N257487K213025
$$ 247898707 260880375 273526003 285061220 295065033 302931549 308189036 310402061
12392C10402061r63911l888622o542624q636336j0218575j1054875j1236417j1150217
$$ 310402061 309438150 305549528 299006904 290370568 280151993 269097118 257860701 246710484
12384B46710484j0748791j0361946r961060r440192r077759q495102p802951o815584
$$ 246710484 235961693 225599747 215638687 206198495 197120736 188625634 180822683 174007099
12376A74007099n503645l909188j838597Q30646L976823P460886J1215990J4702984
$$ 174007099 168503454 164594266 162755669 163586315 167563138 175024024 186240014 200942998
12368B00942998J7381957J8354344J6805784J2600969O651459M18656n464755
$$ 200942998 218324955 236679299 253485083 266086052 272737511 273156167 267691412
12361B67691412j1146663j6806203k1944357k4800774k4371155k1696946j8106800
$$ 267691412 256544749 239738546 217794189 192993415 168622260 146925314 128818514
12354A28818514j4740849j1972591r664372p980949o660241n720377m891524m260250
$$ 128818514 114077665 102105074 92440702 84459753 77799512 72079135 67187611 62927361
12346F2927361l767184l397217l205856k948239k742560k463627k272577k062697
$$ 62927361 59160177 55762960 52557104 49608865 46866305 44402678 42130101 40067404
12338D0067404j992063j800775j598370j495339j471127j221965j096431j008078
$$ 40067404 38075341 36274566 34676196 33180857 31709730 30487765 29391334 28383256
12330B8383256j023942q98615q96084r46029q11122p21897p07926p35033p82758
$$ 28383256 27359314 26460699 25564615 24618586 23807464 23085567 22377641 21642608 20859850
12321B0859850p04304o98771p15019o73038n66229n40372n15103m71716m69098
$$ 20859850 20155546 19456775 18741756 18068718 17502489 16962117 16447014 15975298 15506200
12312A5506200m90991m01720l80900m07123l06900l79422l55727l13426l53268
$$ 15506200 15015209 14613489 14232589 13825466 13518566 13139144 12783417 12469991 12116723
12303A2116723l75361k87009k69332l11198k15282j70774j98990k67836l07954
$$ 12116723 11741362 11454353 11185021 10873823 10658541 10487767 10288777 10020941 9712987
12294I712987k25033k19754l28739l57658k28266j88068j51760j19202j49897
$$ 9712987 9487954 9268200 8939461 8581803 8353537 8165469 8013709 7894507 7744610
12285G744610j82764j31495j71162j39205j26438r1517j46092j30734j51917j49513
$$ 7744610 7561846 7430351 7259189 7119984 6993546 6902029 6755937 6625203 6473286 6323773
12275F323773q1298j40155j28325q8569r4913o3269j10677j74318q5956q1580
$$ 6323773 6242475 6102320 5973995 5885426 5790513 5727244 5616567 5442249 5356293 5274713
12265E274713j77672j60162o9164j01833p3728n412r9060j30748M171o9239q8746
$$ 5274713 5097041 4936879 4867715 4765882 4692154 4686742 4587682 4456934 4461105 4391866 4303120
12254D303120j1207N267O927l1788q3511o4357o0198p7296p1325o0944n7218j31470
$$ 4303120 4291913 4297180 4304107 4272319 4188808 4124451 4064253 3986957 3915632 3854688 3797470 3666000
12242C666000r4507M2076j6391r4650k7867l2723Q29Q98j8357N9247J01176J38746
$$ 3666000 3571493 3613569 3597178 3502528 3474661 3441938 3442767 3443665 3425308 3484555 3585731 3724477
12230C724477J99072J77769K33195J48653J34187Q2158P6832n6646j19134k26831
$$ 3724477 3923549 4101318 4334513 4483166 4617353 4699511 4776343 4719697 4600563 4373732
12220D373732k81441k49936k41001l01520j68742k24600k22721j12491j39034
$$ 4373732 4092291 3842355 3601354 3299834 3131092 2906492 2683771 2571280 2432246
12211B432246o3646o6688j17953q3276l9007q4260j35942j06174o9454K2379J1612
$$ 2432246 2368600 2301912 2183959 2100683 2061676 1977416 1841474 1735300 1665846 1688225 1699837
12200A699837j6283n6884j46717j15867k4298j830O004K3871j4512n0282m3808
$$ 1699837 1683554 1626670 1479953 1364086 1339788 1337958 1343962 1367833 1353321 1303039 1259231
12189A259231l1526j0970J1224l671m32l8392j1297p151R059k6988m99o910j197
$$ 1259231 1227705 1216735 1227959 1224288 1223856 1185464 1174167 1167016 1176075 1149087 1148588 1141678 1140481
12176A140481n0479j1640O7563l6113j28839K7302l0971o5390n8080L6417J1394
$$ 1140481 1090002 1078362 1145925 1109812 980973 1008275 977304 911914 853834 890251 901645
12165I01645o9575N019P5985O67M7906L2635m5146l5416r9759m6978j0544j4743
$$ 901645 832070 837089 913074 913741 961647 994282 949136 913720 813961 766983 756439 741696
12153G41696J06396O2105n9785l8711r1012o9122J4084N9096J0960m0372l8962
$$ 741696 848092 910197 850412 811701 720689 651567 665651 724747 735707 695335 656373
12142F56373k7113k270Q4273L3357p4278j9971p207j1181q928j7595p4285m9090
$$ 656373 629260 626990 711263 744620 670342 650371 643164 631983 623055 605460 531175 482085
12130D82085l574l9539l2395p7058m1955J65374q199q85J7447Q253N3803j8692
$$ 482085 478511 438972 406577 329519 287564 452938 444739 443854 461301 469554 523357 504665
12118E04665r9076l8655l910o1451j1985J16333L355L9744j0929L8996L9698L2627
$$ 504665 405589 366934 363024 301573 289588 405921 409276 449020 438091 477087 516785 549412
12106E49412r956o8949n7593l8556o7348p6765n4813P0018J12453N1192q058K348
$$ 549412 539456 470507 412914 374358 307010 230245 175432 245450 357903 409095 401037 403385
12094D03385J7934o6563r9104O0256M5771k3782k2395k0273k2714M4835k2709
$$ 403385 421319 354756 255652 315908 361679 337897 315502 295229 272515 317350 294641
12083B94641m1666l4378J19988k355j35541q5252L0841K5560k005L9946J12761
$$ 294641 252975 218597 338585 336230 200689 115437 146278 171838 169833 209779 322540
12072C22540L2296j35896p8044M6957M0046m8764O4470K0966n4732O6608n9004
$$ 322540 354836 218940 140896 187853 227899 179135 243605 264571 209839 276447 217443
12061B17443j90439J3005J47046r911n0617L4586N773j5031R942m8419m1413J7656
$$ 217443 27004 40009 187055 177144 126527 161113 166886 151855 161797 113378 71965 89621
12049H9621Q4430J1110m6912k3987j7902n4515k1089n7421l1178R629O5384p301
$$ 89621 174051 185161 138249 114262 96360 41845 20756 -36665 -67843 -58214 7170 -131
12037a31l3230p0360n185J03135R3444L8037j11932n4652N3919R876O9617o8687
$$ -131 -33361 -103721 -108906 -5771 87673 125710 13778 -40874 13045 22921 92538 23851
12025B3851q1940P0226J13152l2112m7187N9013O8818J843J1308m673j2059O2557
$$ 23851 -58089 12137 125289 93177 45990 105003 173821 175664 186972 182299 170240 232797
12013B32797p5833m7495l7730M1171P5666n251J3387O1624n5898M878J9157r5165
$$ 232797 156964 109469 71739 112910 188576 183325 196712 258336 202438 207316 226473 131308
12001A31308J9190N8877k8475l3762p119K3116N4354k5723j3734m204k6611J4855
$$ 131308 150498 209375 180900 147138 140019 163135 217489 191766 178032 173828 147217 162072
11989A62072L1435L9539J5938J3631O5808O6808J8399j30121n8922O7432L5884
$$ 162072 193507 233046 248984 262615 328423 395231 413630 283509 224587 292019 327903
11978C27903m6047L9475J01658J23580J76785J35345P1170N6402M7766P3022J36764
$$ 327903 281856 321331 422989 546569 723354 858699 929869 986271 1034037 1107059 1243823
11967A243823J22585j1202m4592k7968q348K3698r6978j89556j31341l5579m9964
$$ 1243823 1366408 1355206 1310614 1282646 1274298 1297996 1201018 1011462 880121 844542 794578
11956G94578m6721K3771P3642j4541L1978k593M6724O7654O8405K1571R2315J33077
$$ 794578 747857 771628 845270 830729 862707 860114 906838 974492 1042897 1064468 1156783 1289860
11944A289860M5745N3086J04921Q9960L7764K3417M3322L9569J4971L602l5338
$$ 1289860 1335605 1388691 1493612 1583572 1621336 1644753 1688075 1727644 1742615 1746217 1710879
11933A710879r0997j05293j64088j06962m674o4801m9902j8155l3401n2689J3114
$$ 1710879 1619882 1514589 1350501 1243539 1238865 1174064 1124162 1106007 1072606 1019917 1033031
11922A033031l682l3689j4870l8763M9963L7252l2372p5475K9446O8495N2790
$$ 1033031 1029349 995660 980790 942027 991990 1029242 996870 921395 950841 1019336 1072126
11911A072126Q1326N8737P3620J07012P6194J7945j468p8600j79343q4328j51091
$$ 1072126 1153452 1212189 1285809 1392821 1469015 1486960 1485492 1406892 1227549 1143221 992130
11900I92130j77639m3245r1591j07770J745p7680m7224k1439j4809j3610q4758
$$ 992130 814491 771246 679655 571885 573630 495950 448726 427287 412478 398868 314110
11889C14110k4268k488m7490p4049j697Q7155J9345N4714o3566n5125n217P0438
$$ 314110 289842 287354 239864 165815 164118 251273 270618 325332 261766 206641 201424 271862
11877B71862n0316j5344j3737o169Q869j7419k9283k9763L0527l5041o2757Q3315
$$ 271862 221546 206202 192465 186296 195165 177746 148463 118700 149227 114186 51429 134744
11865A34744J15932j5130j06925p3003J0132R3665L2585j2815m7501q1096p3355
$$ 134744 250676 235546 128621 55618 65750 159415 192000 179185 131684 50588 -22767
11854b2767J0771J4110m282R9519K4435q0633j2933O8915l8026p2234J8270K39
$$ -22767 -11996 2114 -2168 97351 121786 41153 28220 97135 59109 -13125 5145 5384
11842E384M4398m719l6753K4808J00149k2792m0434p981m0607L779m8103k6765
$$ 5384 49782 45063 8310 33118 133267 110475 70041 62060 21453 25232 -22871 -49636
11830d9636N7009k781l2695M3224O0859L8226J1020m3057o7905o4515r7462m4753
$$ -49636 7373 4592 -28103 15121 75980 114206 125226 82169 14264 -50251 -147713 -192466
11818a92466R7813J25167O6661K9101n244n437j02498l2649J4735j1482K3325
$$ -192466 -94653 30514 97175 126276 121032 115595 13097 -19552 -4817 -16299 7026
11807G026K3460k0996k4610K844l7174M4157J2415L5986J2461p1662l353N2389
$$ 7026 30486 9490 -15120 -12276 -49450 -5293 7122 43108 55569 -16093 -19446 32943
11795C2943K7067L0072k4203k1828N8351K8625o8271p4082j8150K4416N9321M7213
$$ 32943 60010 90082 65879 44051 102402 131027 62756 -11326 -29476 -5060 54261 101474
11783A01474p6701j20333M9878k3850p8415J512q221L6527J19361N7565q787m3468
$$ 101474 24773 -95560 -45682 -69532 -147947 -146435 -154656 -118129 1232 58797 50010 6542
11771F542j0467m8531l1160J05526L1229m5285J2211j9826o8275m2337j7198M467
$$ 6542 -3925 -52456 -83616 21910 53139 7854 20065 239 -68036 -110373 -127571 -123104
11759a23104P5578M1869P1837k2438m3111K1245P613j02953J6364K0216K1868
$$ -123104 -47526 -5657 66180 43742 631 21876 29489 -73464 -57100 -36884 -15016
11748a5016n765j979O4035J1225Q092m4412l9608q500k8581M8194L0014K1950
$$ -15016 -20781 -22760 41275 52500 60592 16180 -23428 -31928 -60509 -12315 17699 39649
11736C9649P9483J0649m0805m2673K0086K6633Q029n3037l4779k1457M5036m1917
$$ 39649 119132 129781 88976 46303 66389 93022 101051 48014 13235 -8222 36814 -5103
11724e103j2280j6639K0177L0157o5906o144J26923N947k7155k7029J2312k2723
$$ -5103 -17383 -34022 -13845 16312 -49594 -55738 71185 77132 49977 22948 35260 12537
11712A2537O7274K7731p8699k7481Q5018m622n77l9725p3931m6200q7229j769
$$ 12537 79811 107542 28843 1362 86380 81758 81181 41456 -32475 -78675 -165904 -167673
11700a67673N9985j1885P594j69k4757n5761j7152K1051N025N9691J23481K642
$$ -167673 -107688 -119573 -111979 -112148 -136905 -192666 -209818 -188767 -183742 -124051 -570 2072
11688B072K625Q850L986j8065m1189n784P420J9716k3639l3203M9613O9461m839
$$ 2072 4697 13547 17533 -532 -41721 -47505 -40085 -20369 -44008 -77211 -27598 41863 37024
11675C7024n2141n1323m0123M144L4487K9756J0360k9301k0908M7386L5633k6715
$$ 37024 -15117 -66440 -106563 -102419 -67932 -38176 -27816 -57117 -78025 -30639 4994 -21721
11663b1721m5062J1753N2223L9843m7127J6538P7570K5832m1141n3790n8486l6264
$$ -21721 -66783 -55030 -2807 37036 -10091 6447 84017 109849 68708 14918 -43568 -79832
11651g9832N6423J12298M8972o1427k5992q469j08096j7418N9922P5035O834k1188
$$ -79832 -23409 88889 137861 76434 50442 41973 -66123 -83541 -23619 51416 58250 37062
11639C7062K6331n1452Q926M6528m4159l0836m8593N303k5642N8174k435n4300
$$ 37062 63393 11941 20867 67395 23236 -7600 -56193 -50890 -76532 -18358 -20793 -75093
11627g5093K5232N3170R3963n7409K6775l0823p2054l5298j9856O6418M1841m9281
$$ -75093 -49861 3309 97272 39863 66638 35815 -36239 -71537 -91393 -24975 16866 -32415
11615c2415o0799n1426p6559K8415J9356J20316O4310p2132q3926j5324J04678
$$ -32415 -93214 -144640 -221199 -192784 -173428 -53112 11198 -60934 -144860 -160184 -55506
11604e5506L5971K572K48k4306N5706L1580J6235j6550j00881L1692L4752L0830
$$ -55506 -19535 -16963 -16715 -41021 14685 46265 62500 45950 -54931 -23239 11513 42343
11592D2343M0051m5162p1100J20474J0643j28527j54132l1786L0482M4031J21704
$$ 42343 82394 37232 -33868 86606 97249 -31278 -185410 -217196 -186714 -142683 -20979
11581b0979N7862N5394o2450q6818J1906o325o029L5760M0978J01869R9683j9115
$$ -20979 36883 92277 29827 -56991 -45085 -51410 -57439 -21679 19299 121168 220851 201736
11569B01736j02476m5843L8757j1710o2910j11886n140N1141j1981j3016K3605
$$ 201736 99260 53417 92174 80464 17554 -94332 -99472 -48331 -60312 -73328 -49723
11558d9723M6919P4599O806l739r7964p1229M9907M1242m646N256K1848n9019
$$ -49723 -2804 71795 78601 74862 -23102 -94331 -44424 -3182 -7828 -2572 19276 -39743
11546c9743l0859K2522M9261O1250J2158j4075Q693N4988o3092k6350j28698O809
$$ -39743 -70602 -48080 1181 62431 74589 60514 69207 124195 61103 34753 -93945 -87136
11534h7136M2912J6728k705R283n5951p5244L3739L7035l3398l195P4434L3966
$$ -87136 -44224 -27496 -30201 -20918 -76869 -152113 -118374 -81339 -114737 -117932 -43498 -9532
11522i532K0683K9201N6279o0291O5556O9109j891p9748n686M0628k9794l5610
$$ -9532 11151 40352 96631 36340 101896 171005 169114 89366 83680 124308 94514 58904
11510E8904N6538k1020o9374k8169P081M767Q6067j2711j55908L4449J56988M4113
$$ 58904 115442 94422 25048 -3121 3960 8727 94794 82083 -73825 -39376 117612 161725
11498A61725k9390r2973p9193P888m860n482m7458N4907k5040l4003n6482M3823
$$ 161725 132335 39362 -39831 -31943 -36803 -42285 -89743 -34836 -59876 -93879 -150361 -106538
11486a06538Q7219l9725l9333K8560L7862J1199K6526Q060n6149l596j0533K0731
$$ -106538 -19319 -59044 -98377 -69817 -31955 -20756 5770 13830 -42319 -45915 -56448 -35717
11474c5717O7440m2023K7921O5225n6632k2248N2547m66L4658O4868n6580q762
$$ -35717 31723 -10300 17621 82846 26214 3966 56513 56047 90705 155573 98993 90231
11462I0231j7970j4134K6417l6816o986n9427n2199M9829J5934N7070j0663J7964
$$ 90231 72261 58127 84544 47728 40742 -18685 -70884 -21055 -5121 51949 41286 59250
11450E9250L2307P0959j1448L4734M4900r553p8885j5433j2377l1114L0780k5313
$$ 59250 91557 162516 151068 185802 230702 221149 142264 126831 114454 83340 114120 88807
11438H8807j07174j8771N8612M1480M5849J0002l0825M1525o7668l7726J6920
$$ 88807 -18367 -37138 21474 62954 108803 118805 87980 129505 61837 24111 41031
11427D1031L69j7836j0586Q946k7543r0344N3934L7218j0603J8221m3997j8129
$$ 41031 41400 23564 12978 21924 -5619 -95963 -42029 -4811 -15414 2807 -41190 -59319
11415e9319N1815j6988k5696M7904P5005j9886L388K9156O539p7833l8251j2756
$$ -59319 -7504 -24492 -50188 -2284 72721 52835 56223 85379 91918 14085 -24166 -36922
11403c6922o4323K8696Q1111P0207M8325N5475r345o8682j10267q2914J1630L4727
$$ -36922 -101245 -72549 8562 78769 127094 182569 173224 104542 -5725 -88639 -77009 -42282
11391d2282J1280n3920Q5619J279k4666N788R4080K77o4251j2301M3840M7483
$$ -42282 -31002 -84922 697 1976 -22690 -16902 77178 77455 13204 903 44743 92226
11379I2226L3922k0325l7051R1997p801q1560n1552L5021m3558l2756L0026N6983
$$ 92226 126148 105823 68772 160769 152968 71408 19856 54877 11319 -21437 8589 65572
11367F5572j2170N2423K4383o7833p5157n173k8558K2919Q1682J5294J8183j4633
$$ 65572 53402 105825 130208 62375 -12782 -17955 -46513 -23594 58088 73382 91565 76932
11355G6932K364k647M0895O7345m9915N873M0307J068m7806l0814R259K0785r3553
$$ 76932 79296 76649 117544 184889 134974 140847 181154 182222 134416 103602 112861 133646 40093
11342D0093j8479N922L047K001L7902J5949o52O5816P0409K5683k9035j32984
$$ 40093 21614 27536 30583 32584 70486 86435 85783 151599 222008 247691 218656 85672
11330H5672n0563M973R4749L3110m8820j8752Q083j2672k1598J2886K7304L8465
$$ 85672 35109 40082 134831 167941 119121 100369 108452 95780 74182 87068 114372 152837
11318A52837J19837q623n8646q8246n9229O312m20l5647L1357j9025Q979k740
$$ 152837 272674 264051 205405 117159 57930 64242 63822 28175 59532 40507 49486 46746
11306D6746K0505J0973L5409k1642K7076N806n5225l3177n3481n817P6450J2033
$$ 46746 67251 78224 113633 91991 119067 124873 69648 36471 -17010 -22827 53623 65656
11294F5656j0675K0110J3575k6091K2457O7097o5801l5874O7612L5494m4695p2317
$$ 65656 54981 75091 88666 62575 85032 152129 86328 50454 118066 153560 108865 36548
11282C6548k0729L5525k5653N208l5983N7001k297l2255k3175O1698M7621l2094
$$ 36548 15819 51344 25691 30899 -5084 51917 49620 17365 -5810 55888 103509 71415
11270G1415j8635l919K987k9359N2183j621J5187J8775L3354m8920p0187Q6956
$$ 71415 52780 48861 51848 22489 74672 73051 88238 107013 140367 91447 21260 108216
11258A08216n4736l2549j9946n4907K5354O7583l821Q7909k2382k2429j6944l776
$$ 108216 53480 20931 985 -53922 -28568 39015 35194 123103 100721 78292 61348 57572
11246E7572N0176L6422l2286m7131k6919R97j0263P1405O1488n785N3539K0167
$$ 57572 107748 144170 111884 64753 37834 38831 28568 99973 161461 155676 209215 229382
11234B29382n7495p8016j3763o038P371L5677O2571O2067k9351k1299j8007o6846
$$ 229382 171887 93871 80108 74070 81441 117118 179689 241756 212405 191106 173099 106253
11222A06253k4153K6413q595Q2610N2219K3806m1566k5077l651l6696M0838K2129
$$ 106253 82100 108513 99918 182528 234747 258553 216987 191910 188259 151563 192401 214530
11210B14530k3930L163q2383j02492Q2788J00306M661q474m5647L7498n7456J3139
$$ 214530 190600 193763 111380 8888 91676 191982 196643 188169 142522 180020 122564 135703
11198A35703m548k2838k698L7829l5801M0445l4926O3885M8004J8171n8565n440
$$ 135703 131155 108317 105619 143448 107647 148092 113166 177051 225055 243226 184661 179221
11186A79221k7263L1866o0984q0528O9807J51459J6984M276O702j26588o1326
$$ 179221 151958 183824 122840 42312 112119 263578 280562 284838 291540 164952 103626
11175A03626l1134m709k8223N617J2254l513K7979Q8101L357n5303K3929L7328
$$ 103626 72492 67783 39560 45177 57431 53918 81897 169998 173355 118052 141981 179309
11163A79309M1429o1503o8737j3088N7447L5095k9443K0660L6653p1217m4164
$$ 179309 220738 159235 90498 77410 134857 169952 140509 161169 197822 126605 82441
11152H2441K6436Q8664Q0973l4632j30712k4166N6912L6950n8497M706K3963M6528
$$ 82441 108877 197541 278514 243882 113170 89004 145916 182866 124369 129075 153038 199566
11140A99566L4241R838K2163K462k3130K453k0623l4131J9540M7511q786n3760
$$ 199566 233807 243645 265808 268270 245140 247593 226970 192839 212379 259890 251104 197344
11128A97344k331N0176M369j8153L7791N3921l6548n9976o4775o7589j0935L1461
$$ 197344 195013 245189 249558 231405 269196 323117 286569 226593 161818 94229 83294 114755
11116A14755K1503M6094J08708L9459L3386o1010j0564M4854k206k6066p8334
$$ 114755 136258 182352 291060 330519 363905 302895 292331 337185 334979 308913 230579
11105B30579l3j5532l8375R3561N0774q388r783n5055K2920J1699o2009M6789
$$ 230579 230546 215014 176639 270200 320974 312586 302803 247748 270668 282367 220358 267147
11093B67147K5160q89K4171L4357n4201o6921m1806k4852K483l1948K3685P2229
$$ 267147 292307 291418 315589 349946 295745 228824 187018 162166 164649 132701 156386 228615
11081B28615n0135r5019o2995N4711J18036J396M5532n5238l8074L6783R0642
$$ 228615 178480 83461 20466 75177 193213 194609 240141 184903 146829 183612 274254
11070B74254P5469l3183m5784n9777J8863O3360j4169p2288j3181K3n6010n5808
$$ 274254 349723 316540 270756 210979 229842 293202 279033 206745 193564 193587 137577 81769
11058H1769l4293R8408Q5939p038o6575M4204L7859k5108L6968Q9473j407l8070
$$ 81769 47476 145884 231823 224785 158210 202414 240273 215165 252133 341606 340199 302129
11046C02129l6833n1681n7695l7287K422K5637j639J9661K469N9259k6009n8060
$$ 302129 265296 213615 155920 118633 121055 146692 145053 164714 167183 226442 200433 142373
11034A42373R5737L386N385K4700q0164o0926J0628M2515P082J6987Q759l5837
$$ 142373 238110 241496 246881 271581 191417 130491 141119 183634 190716 207703 216462 180625
11022A80625j7082k3982j6896M0028J33441n618n9117N6414M9779k2003l8423
$$ 180625 163543 139561 122665 162693 296134 290516 231399 287813 337592 315589 277166
11011B77166m5497k9704l2560k9614l23K704R6437J0399o8686m2487j3222J8584
$$ 277166 231669 201965 169405 139791 139468 142172 238609 249008 180322 137835 124613 143197
10999A43197l7608J9129J9022L4211M1952R184n4397Q85R0566K4772n6259P4211
$$ 143197 105589 124718 143740 177951 219903 229087 174690 175575 266141 290913 234654 308865
10987C08865m3892q4837L4598J25444M5614j2401O5885J632m7953m2378J4349
$$ 308865 264973 180136 214734 340178 385792 373391 439276 440908 392955 350577 364926
10976C64926Q083l3666o1765q3969N7805M0717o4351k756O4355P8524K0863l588
$$ 364926 373009 339343 277578 193609 251414 292131 227780 225024 289379 367903 388766 385178
10964C85178K1910J7326J27707P6534J7938N8816p947K0138J18946J34255J08369
$$ 385178 407088 424414 552121 628655 646593 705409 697462 717600 836546 970801 1079170
10953A079170R6722J27145P039n9670P2854R711m6356l3692m5688k9928j901J3116
$$ 1079170 1175892 1303037 1310076 1250406 1323260 1332971 1286615 1252923 1207235 1177307 1175406 1188522
10941A188522l6855n7311l3366P7323n6146q729J50629N6989M4441k9907p465
$$ 1188522 1151667 1094356 1060990 1138313 1082167 1073438 1224067 1281056 1325497 1295590 1288125
10930A288125J106O9360J02914J6929M2293O048k4518L5453J48451J45091L7918
$$ 1288125 1289231 1358591 1461505 1478434 1520727 1526775 1502257 1537710 1686161 1831252 1869170
10919A869170k8739q0809o1883o3403r5165K9813l9275n5777q672n7853n6346
$$ 1869170 1840431 1759622 1697739 1634336 1539171 1568984 1529709 1473932 1465260 1407407 1351061
10908A351061j16677k2523j7794J7171L3145p506q8454m8418P5612R7413K6969
$$ 1351061 1234384 1211861 1194067 1211238 1244383 1236877 1148423 1100005 1175617 1273030 1299999
10897A299999O1975L1995k9102K284L4775K1037j100N7770O560k4212o5871r2661
$$ 1299999 1361974 1393969 1364867 1367151 1401926 1422963 1421863 1479633 1486193 1461981 1396110 1303449
10885A303449p5170o3869n7009r0141p7101q7485J5796q2431r5317j9410J2816
$$ 1303449 1228279 1164410 1107401 1017260 940159 852674 868470 786039 690722 671312 684128
10874F84128L0206l3820p5551p1992m2328M2033M5517m6895K9970M791K7012K3477
$$ 684128 714334 680514 604963 532971 490643 532676 578193 531298 561268 566059 593071 616548
10862F16548Q763K1141k8796q3028J2720L2992l9917l4202K5528M6668L9908n5163
$$ 616548 625311 646452 617656 534628 547348 580340 540423 506221 531749 578417 618325 563162
10850E63162l7411J9874m9230k0805l6797m6650Q619K876l8080K1594N8433Q3264
$$ 563162 525751 545625 496395 475590 438793 392143 400762 403638 365558 387152 445585 528849
10838E28849M0314o0860P3M8481K2695L2214q1831n909k0308m5597M3355J06947
$$ 528849 569163 508303 508376 556857 579552 611766 529935 524026 503718 458121 501476 608423
10826F08423P9924J559j25663q5612O2705M7470n4247q0937p4940P2724J06274
$$ 608423 688347 689906 564243 478631 541336 588806 534559 453622 378682 451406 557680
10815E57680o134k359j9688p2816j4689O5660K9040m4698j5720J6838J6127m4672
$$ 557680 551546 549187 529499 456683 441994 507654 536694 491996 476276 493114 509241 464569
10803D64569l9922N7122N6504K3784k1045J8899L0546K0838j10473J508K6907
$$ 464569 424647 481769 538273 562057 541012 559911 590457 611295 500822 502330 529237
10792E29237K6950K8191n599M5110L9889M4312K1044J1402m3435m0494p770J3982
$$ 529237 556187 584378 578779 623889 663778 708090 729134 740536 697101 656607 648837 662819
10780F62819J697J0647J6518j2322N4569K7312k3220n784J41392N0418o5017j1271
$$ 662819 664516 675163 691681 679359 733928 761240 738020 732236 873628 924046 859029 847758
10768H47758K1040M2133m5797J3340j4691o9105M716M2118N706n3413p8334p784
$$ 847758 868798 910931 865134 878474 863783 794678 799394 841512 847218 793805 715471 707687
10756G07687K1990N2335k8666L0350J5643l6428j9599k390Q0186R2675k2517q7871
$$ 707687 729677 782012 753346 783696 799339 762911 743312 740922 821108 913783 891266 803395
10744H03395o9925L014k2938R770J4279K9765j6402l2595Q5361M0636p1233K1138
$$ 803395 733470 736484 713546 723316 737595 767360 750958 718363 803724 844360 773127 794265
10732G94265O2383L3079l930J883M1742k5974k1892r787o489m398l7190k8383
$$ 794265 856648 889727 885797 887680 929422 903448 881556 871769 865280 860882 823692 795309
10720G95309Q6749Q136p8365j2950L2079L9829N451n1706j5876M8238j373L7747
$$ 795309 882058 890194 811829 798879 830958 870787 876238 824532 808656 856894 855521 893268
10708H93268Q2544L0658N3716Q622m5082j7698q93K764m1463P4504O9078l8991
$$ 893268 975812 1006470 1060186 1068808 1023726 1006028 1005135 1007899 966436 1040940 1110018 1071027
10696A071027j24765k1770O7461M9114N8311m3268l6492k7771O8813K9409R8417
$$ 1071027 946262 924492 991953 1041067 1099378 1056110 1019618 991847 1060660 1090069 1188486
10685A188486Q8200j9559n8327r416K1059J0360M2417P7216q040l5506k40P5389
$$ 1188486 1276686 1257127 1198800 1189384 1210443 1220803 1263220 1340436 1332396 1296890 1296650 1372039
10673A372039M3365N2191j2101o0765j446P3071K4922O3066P0256P4161O9631
$$ 1372039 1415404 1467595 1455494 1394729 1393283 1466354 1491276 1554342 1624598 1698759 1768390
10662A768390Q5818O3120K6309Q6812o509O1662Q1598P9511O6691p611p916k6205
$$ 1768390 1854208 1917328 1943637 2030449 2023940 2085602 2167200 2246711 2313402 2305791 2297875 2271670
10650B271670M3292k8209J5563J25427J55361J10905L9623J1437m1195O4631M6435
$$ 2271670 2314962 2286753 2302316 2427743 2583104 2694009 2733632 2745069 2703874 2768505 2814940
10639B814940O1029r868m4364k8714J9111L7400N9893L5833K8149j7390j4098
$$ 2814940 2875969 2866101 2821737 2793023 2812134 2849534 2909427 2945260 2973409 2956019 2941921
10628B941921n1767J2669N7703Q1729j0932O3894P8287J1374O6412K5884K8484
$$ 2941921 2890154 2902823 2960526 3042255 3031323 3095217 3173504 3184878 3251290 3277174 3305658
10617C305658j6851N0279L0132J28442P0414m181J6363L0071P0922J79450M6545
$$ 3305658 3288807 3339086 3369218 3497660 3568074 3563893 3580256 3610327 3681249 3860699 3907244
10606C907244M4334J16484L3094k1183P3947J41539P6720J01228J00436J35858
$$ 3907244 3951578 4068062 4101156 4079973 4153920 4295459 4372179 4473407 4573843 4709701
10596D709701J12529N5582Q5357O8944O6744J6369M9770J71083J27854J53825
$$ 4709701 4822230 4877812 4963169 5032113 5098857 5115226 5164996 5336079 5463933 5617758
10586E617758K38740J24811J14121J50079K51483K34120K70378K75301J33325
$$ 5617758 5856498 5981309 6095430 6245509 6496992 6731112 7001490 7276791 7410116
10577G410116J15846J53925L25945K94744J76532L10502M20968L57462L97497
$$ 7410116 7525962 7679887 8005832 8300576 8477108 8787610 9208578 9566040 9963537
10568I963537L81227L76334M54137N84534O20653P61740O87935O81250Q43352
$$ 9963537 10344764 10721098 11175235 11759769 12380422 13142162 13830097 14511347 15354699
10559A5354699R58076J014221J116425J265372J468887J680816J939381K120296
$$ 15354699 16312775 17326996 18443421 19708793 21177680 22858496 24797877 26918173
10551B6918173K406323K791279L205360L648670M344675N072134O002021P170760
$$ 26918173 29324496 32115775 35321135 38969805 43314480 48386614 54388635 61559395
10543F1559395Q591196J0329175J2338402J4535070J6957571J9124403K0342140
$$ 61559395 70150591 80479766 92818168 107353238 124310809 143435212 163777352
10536A63777352K0071925J8068341J4488707R975441N253423M35486m407560q901261
$$ 163777352 183849277 201917618 216406325 226381766 231635189 232070675 227663115 218761854
10528B18761854j2154696j3518497j2796128j0772718p864659m710021j582370
$$ 218761854 206607158 193088661 180292533 169519815 161655156 156945135 155362765
10521A55362765J403053L784324N785753P054296P649142P649168P367531P017977
$$ 155362765 156765818 160550142 166335895 173390191 181039333 188688501 196056032 203074009
10513B03074009O752615O854780O953231P509124Q367778R294081J0116976J0125161
$$ 203074009 209826624 216681404 223634635 231143759 239511537 248805618 258922594 269047755
10505B69047755Q994444P016077M155435J029753k172576n237859p681110r113330
$$ 269047755 278042199 285058276 289213711 290243464 288070888 282833029 275151919 266038589
10497B66038589r693767r419849q497938p660252p129437o813712o676592o760827
$$ 266038589 256344822 246924973 238427035 230766783 223637346 216823634 210147042 203386215
10489B03386215p112606p188257o987374o285211m884218l058617q26966J816998
$$ 203386215 196273609 189085352 182097978 175812767 170928549 167869932 167042966 168859964
10481A68859964M324420O722443Q888440J0343571J0754889R750673P405454M023987
$$ 168859964 173184384 179906827 188795267 199138838 209893727 219644400 227049854 231073841
10473B31073841R5060l913868p772465j1426352j4526421j6558477j6980386j6181406
$$ 231073841 231168901 227255033 219482568 208056216 193529795 176971318 159990932 143809526
10465A43809526j4673941j2732763j0902091r243276p880642o804487n828526
$$ 143809526 129135585 116402822 105500731 96257455 88376813 81572326 75743800
10458G5743800n199925m582035l960671l598169l308216l064992k736966k545235
$$ 75743800 70543875 65961840 62001169 58403000 55094784 52029792 49292826 46747591
10450D6747591k329681k144120k070168j818572j677459j564266j499302j318653
$$ 46747591 44417910 42273790 40203622 38385050 36707591 35143325 33644023 32325370
10442C2325370j227930j142208j073665r53207r34614r29858q87534q62944q57768
$$ 32325370 31097440 29955232 28881567 27928360 26993746 26063888 25176354 24313410 23455642
10433B3455642q29027p54274o96314p00005o17178o39993o59832m59971n22103
$$ 23455642 22626615 21872341 21176027 20476022 19858844 19218851 18559019 18099048 17576945
10424A7576945n07445n71775n20871m32009m15519l96996l95566m08362m03167
$$ 17576945 17069500 16497725 15976854 15544845 15129326 14732330 14336764 13928402 13525235
10415A3525235l52613k89674l38895m09524k76885k62979k86321k22966k68653
$$ 13525235 13172622 12882948 12544053 12134529 11857644 11594665 11308344 11085378 10816725
10406A0816725l09811k57098k96583k81456k19272j36164k03398j85643j82360
$$ 10816725 10506914 10249816 9953233 9671777 9452505 9316341 9112943 8927300 8744940
10397H744940k13047k60435j85399j20138j59852j53353j35076j80907k20626
$$ 8744940 8531893 8271458 8086059 7965921 7806069 7652716 7517640 7336733 7116107
10388G116107j72993j22840r5944n2845j03563j91445j61181n6894j10987j21499
$$ 7116107 6943114 6820274 6724330 6671485 6567922 6376477 6215296 6158402 6047415 5925916
10378E925916p6784j17042j56963j12793k3559j44372j10225j50725j35398q3929
$$ 5925916 5849132 5732090 5575127 5462334 5438775 5294403 5184178 5033453 4898055 4814126
10368D814126k984j11349p1423n3979n6442o3592n5105q100p1805r2929n4497
$$ 4814126 4811142 4699793 4628370 4574391 4517949 4454357 4399252 4391152 4319347 4226418 4171921
10357D171921m6352p4563j06623l4180j29951j81161m1098r9602n3840P716j01650
$$ 4171921 4125569 4051006 3944383 3910203 3780252 3599091 3557993 3458391 3404551 3412267 3310617
10346C310617n6367o7973j01764q4489n7393Q968k5485j22442p9938j07899j18891
$$ 3310617 3254250 3186277 3084513 3000024 2942631 2951599 2926114 2803672 2723734 2615835 2496944
10335B496944r2597q3782n3724k9428m7196l390J17272k7382j15357p8568m1132
$$ 2496944 2404347 2320565 2266841 2237413 2190217 2186827 2304099 2276717 2161360 2082792 2041660
10324B041660K580m8535j22755p5670M7147k42q9478r6158j4304K7k8207n1685
$$ 2041660 2044240 1995705 1872950 1797280 1844427 1844185 1754707 1658549 1644245 1644272 1616065 1564380
10312A564380N501k8743l0558N8616j13012o3257K128O6167q549r8853n1499j3740
$$ 1564380 1569881 1541138 1510580 1569196 1456184 1392927 1395055 1461222 1452673 1353820 1302321 1288581
10300A288581J2289l9824J241K1505m2653o3771k5414p863L493n7117P680M0631
$$ 1288581 1300870 1261046 1262287 1283792 1241139 1177368 1151954 1144091 1147584 1090467 1098147 1138778
10288A138778N9103l9655j3265N2628m0953n7704R396j6990K5936K6601l1882
$$ 1138778 1197881 1158226 1144961 1197589 1156636 1098932 1108328 1091338 1117274 1143875 1111993
10277A111993o2986n5939J3926J9954m0871k4240m4935j1171j9572j6762K290
$$ 1111993 1049007 993068 1006994 1026948 986077 961837 916902 905731 886159 869397 871687
10266H71687k0554J1569J2533M4837j1830m0479K5182n803n7504j09099m9134
$$ 871687 851133 862702 875235 920072 908242 867763 892945 887142 829638 720539 671405
10255F71405K6013P0418J29545j5329m4248j4390n7710l9798J4499J4182P8679
$$ 671405 697418 767836 897381 882052 837804 823414 765704 725906 740405 754587 833266
10244H33266M7095p5576r9295K1336m0212l9439K137k6513q9830l3944M868O3763
$$ 833266 880361 804785 705490 726826 686614 647175 649312 622799 532969 499025 503893 567656
10232E67656J3049m1265m6286l6685K570L6578j5948N3886M777j3008K0410O089
$$ 567656 580705 539440 493154 456469 459039 495617 479669 533555 538332 525324 545734 551823
10220E51823m2515o0401o0337k3965M1397l4339o1230m0226M5428Q4674o2527
$$ 551823 509308 448907 388570 364605 406002 371663 310433 270207 315635 400309 337782
10209C37782r2481n4126J39722M9965p9091m1087k739o2681P5772N3437M9316
$$ 337782 245301 191175 330897 380862 301771 260684 257945 195264 271036 324473 373789
10198C73789m4877o4194p9254m6431J1721M2048J9156O2878L2413k6597q5491
$$ 373789 328912 264718 185464 139033 150754 192802 211958 274836 307249 280652 195161
10187A95161q5490K7997P4606O8291n220k9301N604o991L1865P4426n8976r7015
$$ 195161 109671 137668 212274 280565 275345 246044 251648 244657 276522 350948 291972 194957
10175A94957j8856O1729L5370l9102N361O6357m7236m035Q7620J5515J4176o2016
$$ 194957 176101 237830 273200 234098 239459 305816 258580 254545 342165 357680 371856 309840
10163C09840l4403M945l0575n9640p0670l6571j0447k6910L9597N9521K4162j8361
$$ 309840 275437 280382 249807 190167 119497 82926 72479 45569 85166 144687 168849 150488
10151A50488K6524J3925k2949m3398L0402O0406Q679m1946q291M8485K2107l0754
$$ 150488 177012 190937 167988 124590 154992 215398 224077 182131 173840 222325 244432 213678
10139B13678o0167l6104j4202O3636N1621l3428p3906Q265Q4985K5067m5537n4112
$$ 213678 153511 117407 103205 166841 218462 185034 111128 119393 204378 229445 183908 129796
10127A29796M2258P6637N6507n9087j0258J10096P8669M3072r856L0491N3045
$$ 129796 172054 248691 305198 246111 235853 345949 424618 467690 457834 488325 541370
10116E41370K6383J00255J23604R3905J25717J85251J49540O6886r036o2014l0769
$$ 541370 567753 668008 791612 885517 1011234 1196485 1346025 1412911 1403875 1341861 1311092
10105A311092q0730o5721j44917j00372l7383n7523J4125M6948M9308j158K1195
$$ 1311092 1230362 1164641 1019724 919352 881969 824446 838571 885519 934827 933669 954864
10094I54864J4344P4118Q2667L7840q2966m4107P6920J40382J14561O4776l3356
$$ 954864 969208 1043326 1125993 1163833 1080867 1036760 1113680 1254062 1368623 1433399 1400043
10083A400043N2380J17364O7331P5600K234j7962k6462p0783q644m2284l6171
$$ 1400043 1452423 1569787 1637118 1712718 1714952 1696990 1670528 1599745 1591101 1548817 1512646
10072A512646j1193k7998r4804j5798j7537j07607L2735m2001M20j02192o1145
$$ 1512646 1501453 1473455 1378651 1362853 1345316 1237709 1270444 1228443 1228863 1126671 1065526
10061A065526r0273q4251K7590O0975N1328o1789J4875Q2296Q2508N9625P6262
$$ 1065526 975253 891002 918592 979567 1030895 969106 983981 1066277 1148785 1208410 1284672
10050A284672M693l7791n244J0865P050r6472j48415p1961q8590r9521n2683j2496
$$ 1284672 1289365 1251574 1246330 1257195 1264245 1167773 1019358 947397 858807 759286 706603 694107
10038F94107r7554j09731J3883K713k3285o4282o5533O316j5212k9659K341m6098
$$ 694107 596553 486822 500705 503418 480133 415851 350318 356634 341422 311763 314104 268006
10026B68006k8135K8212m4171k0196R1931k2245j31297l5350O0890N9139p4131
$$ 268006 239871 268083 223912 203716 295647 273402 142105 106755 167645 226784 152653
10015A52653o1751J1992q170J6425N8075j0699o7975N4357O784k923J8457O192
$$ 152653 90902 102894 94724 111149 169224 158525 90550 144907 151691 148768 167225 173417
10003A73417l0125j1784o2593O8918N9677n9300m7303q8826o4829K1630p611j586
$$ 173417 143292 131508 68915 137833 197510 138210 90907 2081 -62748 -41118 -48729 -50315
9991e0315P6681J6693J8734n365m3294r7574k8292J0005Q4683Q2245P67R15p0750
$$ -50315 26366 43059 61793 56428 13134 -84440 -112732 -102727 -18044 64201 64968 65883 -4867
9978d867l6489O0903K9725l4990m0325m6656J5724K1049O3731J04974L123k6683
$$ -4867 -41356 19547 49272 14282 -26043 -72699 -56975 -35926 27805 132779 135902 109219
9966A09219j14580o1195m8333p1166N6488L0295n5593R02q720M8722J06217K4997
$$ 109219 -5361 -66556 -114889 -186055 -129567 -99272 -154865 -153963 -162683 -113961 -7744 17253
9954A7253M5990N5024l1981r9047l390J2867l2429n5223P493J09858M3056K7709
$$ 17253 63243 118267 86286 -12761 -16151 -3284 -35713 -90936 -83443 26415 69471 97180
9942I7180L9727j1835J7431n9235r4475M8750j9784L080k9434P0520M9616k0431
$$ 97180 136907 125072 142503 83268 -11207 37543 17759 20839 -8595 61925 111541 91110
9930I1110l720J7579k6600m8118K2051l8914o6516N0652L8153n2417J8997O4609
$$ 91110 87390 104969 78369 30251 52302 13388 -53128 -2476 35677 -16740 2257 66866
9918F6866K4235j02309k7951N2035j144n6139n4642L7539l6422r4713K3248n095
$$ 66866 91101 -11208 -39159 12876 11732 -44407 -99049 -61510 -97932 -192645 -169397 -174492
9906a74492p247M8813Q1541P1577j03607N613M2727K2681N6867J4735n9819K3238
$$ -174492 -181739 -132926 -51385 20192 -83415 -77802 -35075 -12394 44473 59208 -611 22627
9894B2627J0502j6814o3736L8145J1477M8722k0957L2811J5249p7847n3319R8396
$$ 22627 33129 16315 -47421 -9276 2201 50923 29966 62777 78026 179 -53140 45256
9882D5256P5643J2283j20326j4676k4517P9428L5505K4142L6107k6426l7445m2723
$$ 45256 120899 133182 12856 -1820 -26337 53091 88596 112738 148845 122419 84974 42251
9870D2251L5309o9903o2816M081O423l736q652Q852N1293q391n9626j2715J5115
$$ 42251 77560 7657 -55159 -51078 -44655 -48391 -57043 -48191 3102 -5289 -64915 -77630 -62515
9857f2515J0939q195M8447P9095n322M6260O5737l2199P0694J05264J35868J63523
$$ -62515 -51576 -59771 -11324 67771 62449 108709 174446 142247 212941 318205 454073 617596
9845F17596K86705K95947J72917k1866O429l8615q8662K8238j05889l11794l51780
$$ 617596 904301 1200248 1373165 1351299 1357728 1319113 1230451 1258689 1152800 841006 489226
9834D89226q1816k8126l6943o8143j2890l3968J1342q3067m4241m613N1945j7686
$$ 489226 407410 379284 342341 274198 261308 227340 238682 155615 111374 106761 158706 141020
9822A41020l0542M4617L573l9908r567n1533j8461M8702L0891R133k1062o1589
$$ 141020 110478 155095 158668 118760 109193 57660 39199 87901 118792 127925 106863 45274
9810D5274L81J0483K5251o3516j5705M0651J1013m0404J9826O9343J3399L6350
$$ 45274 45655 56138 81389 17873 2168 42819 53832 13428 33254 102597 115996 152346
9798A52346k048n6209n5376j7533L0655j953l3544L5598l3570p9492q385K6242
$$ 152346 150298 94089 38713 21180 51835 49882 16338 51936 18366 -61126 -69511 -43269
9786d3269k4722J056J9342k8646p252L4411J09722k2421l772o8268j4671J12721
$$ -43269 -67991 -66935 -47593 -76239 -83491 -49080 60642 38221 34449 -33819 -48490 64231
9774F4231O2579n2410o6316l362Q5373L398n8762k4259M8340J4374p0054k9795
$$ 64231 126810 74400 8084 4722 90095 93493 34731 10472 58812 73186 3132 -26663
9762b6663j8127j6497n7132m148r500N245P2321J5830j14147p6318r612L9160
$$ -26663 -44790 -61287 -118419 -122567 -132067 -126822 -54501 -38671 -152818 -229136 -238748 -199588
9750a99588R7137J24501k6115j42826j1706R7153N7701N2915r3584K8918M6775
$$ -199588 -102451 22050 -4065 -146891 -158597 -61444 -3743 49172 -44412 -15494 31281
9739C1281j3722K9349l7432l6804j5016k4587J9635N5827L2189j4963j5958n2317
$$ 31281 17559 46908 9476 -27328 -42344 -66931 -47296 8531 40720 25757 9799 -42518
9727d2518K482P0389P041j19928m9744N6117K5308j0764l9348m7146O9231P9344
$$ -42518 -40036 30353 37394 -82534 -132278 -76161 -50853 -61617 -100965 -148111 -78880 464
9715D64O4086m6885n5234p7233j5981N9315M2339O921n9810m738J6325K8082J3937
$$ 464 64550 17665 -37569 -114802 -130783 -71468 -29129 -22208 -82018 -86756 -70431 -42349 -28412
9702b8412j6534O5401M7652m9311r2303j7660j9064K0934K1842j89p347L3512
$$ -28412 -44946 20455 68107 18796 -73507 -91167 -110231 -89297 -67455 -67644 -74991 -41479
9690d1479p673l0773P263n3772O6669P6690k1546k7747j5633K4569o9306j2526
$$ -41479 -49152 -79925 -72662 -126434 -59765 16925 -4621 -32368 -48001 -23432 -92738 -105264
9678a05264K5585L1841m9475J315M4025O3078J1562P724j3324p851n8879n0495
$$ -105264 -79679 -47838 -97313 -95998 -51973 11105 22667 30391 17067 9216 -49663 -100158
9666a00158L9444M3783m1773n3524K0025N5533J6901l2014j1876l3777K6443Q5025
$$ -100158 -60714 -16931 -58704 -112228 -92203 -36670 -19769 -51783 -63659 -97436 -70993 14032
9654A4032N1704M5866j1199q0300n0912K7965J9876l2047l969M5414j4550r8732
$$ 14032 65736 111602 100403 20103 -30809 -2844 17032 -15015 -18984 26430 11880 -86852
9642h6852l2346N1761L8254O2104j8186J1742j4886r5689l3928L1623M7557P1506
$$ -86852 -119198 -67437 -29183 32921 14735 26477 11591 -84098 -118026 -86403 -38846 32660
9630C2660m1802q503N7426L0866K4080j0344J262k2534p5431K4665L0150k6528
$$ 32660 -9142 -17645 39781 70647 94727 84383 85645 63111 -12320 12345 42495 15967
9618A5967n2642m6128n8327j7995P7883N2578n251n835K6440J33M2145K371k118
$$ 15967 -36675 -82803 -141130 -159125 -81242 -28664 -33915 -39750 -13310 -13177 28968 31339 29221
9605B9221n3157Q7111M3844m3797q2278J6705j6841k3174L675q6110N4974K4275
$$ 29221 -23936 63175 107019 63222 -19056 -2351 -19192 -42366 -38691 -124801 -69827 -45552
9593d5552k3443J13159k4463q3552l1201O4651m453L0406N976k2080O752k9955
$$ -45552 -68995 44164 19701 -63851 -95052 -30401 -34854 -4448 1528 -20552 -13800 -43755
9581d3755l2378K8304L298p1902l447O4053q7860q2272k2743R0071J21484N0231
$$ -43755 -76133 -47829 -44531 -116433 -119880 -55827 -143687 -225959 -248702 -158631 -37147 13084
9569A3084M7154k4824k1833j8853o3245q881K0673l7289l425L0154R911Q778o4396
$$ 13084 60238 35414 13581 -5272 -68517 -77398 -56725 -94014 -97439 -67285 -57374 -48596 -112992
9556a12992J128P8856J2303P6489M6701l9636p8469L2728O9025k7480l9683K3137
$$ -112992 -111864 -33008 -20705 55784 102485 62849 -15620 17108 86133 58653 18970 42107
9544D2107k4716k9979j6765L746P2199j0104j7046L7268R578l5384o1893N594
$$ 42107 17391 -12588 -29353 -25607 46592 36488 19442 56710 66288 30904 -30989 -25395
9532b5395K8291J8780l3051l4014O4447M4741o9078j17385Q75N9281k569K0993
$$ -25395 2896 21676 -11375 -45389 19058 63799 -5279 -122664 -121789 -62508 -65077 -44084
9520d4084n781r918Q5045k5328o9864K2014J9041j6860k0440R212J02157N0871
$$ -44084 -49865 -59783 25262 -66 -69930 -47916 -28875 -45735 -66175 -56963 45194 96065
9508I6065r297k0546J4919o7045k7182M5415p733k7146k0214O292P1796L4172
$$ 96065 86768 66222 81141 14096 -13086 32329 24596 -2550 -22764 -16472 55324 89496
9496H9496p0747j3402j0886k8235n0111o8980R9316O5113K369n7031k0679j1988
$$ 89496 18749 5347 -5539 -33774 -83885 -152865 -53549 11564 13933 -43098 -63777 -75765
9484g5765j1211Q1664J81r2931m3018M3882R6186O9135N2779r9868j6330o1037
$$ -75765 -86976 -5312 -5131 -98062 -141080 -97198 -1012 68123 120902 21034 4704 -56333
9472e6333m0833o8176M4124R3506J01800o6244j60609k68K1201M0845N9724L1310
$$ -56333 -97166 -165342 -121218 -27712 74088 7844 -152765 -153033 -131832 -90987 -31263 47
9460D7M6724m0576o2788n0738Q7963K3935m9636K6558O5690K4449L1225p611M5083
$$ 47 46771 6195 -56593 -107331 -19368 4567 -45069 -18511 47179 71628 102853 95242 140325
9447A40325M7303o0452p5586J9556P4331k2014q9388m7551M5274O9610K4968q1119
$$ 140325 187628 127176 51590 71146 145477 123463 34075 -13476 31798 101408 126376 45257
9435D5257L3759j6854k9932J9962l3810k4262l6054j5172K6590K0097M4025j3988
$$ 45257 79016 62162 32230 52192 18382 -5880 -41934 -57106 -30516 -10419 33606 19618
9423A9618P055J5440K9495o1073p8533J6050O6867M9006r987L004j3836p4401
$$ 19618 26673 42113 71608 10535 -67998 -51948 14919 63925 53938 56942 43106 -31295
9411c1295k623N3212L2744M8378M189r0991l634J29874R1365p6607o3062l2961
$$ -31295 -33918 19294 52038 100416 104605 13614 9980 139854 231219 154612 91550 58589
9399E8589K4298j0050r3877r701Q6807K0076p6683J9016P6925l5036m2737j14174
$$ 58589 82887 72837 -21040 -30741 56066 76142 -541 18475 95400 60364 17627 -96547
9387i6547J8166R4068L2486J4520J1769j5323j1792j0718O0720L6905P416N935
$$ -96547 -78381 15687 48173 62693 74462 59139 47347 36629 97349 134254 141670 147605
9375A47605N815j10866n1489n5724Q8501J13320j0263n6522K9667j0495q7890
$$ 147605 153420 42554 -8935 -64659 23842 137162 126899 70377 100044 89549 1659
9364A659p3206M9139O5632P2708N2973j9707j5942n3394J8076M1549q318j22794
$$ 1659 -71547 -22408 43224 115932 168905 149198 133256 79862 97938 139487 131169 8375
9352H375m6043P4903M5487k665m9872q073k5149P1R2304J2463k6118n0903j3184
$$ 8375 -37668 37235 82722 80057 30185 22112 -3037 -2966 89338 101801 75683 24780 11596
9339A1596Q6076N4893j9973K4026M9112P7687p605q2979m8393j3259n324N1915
$$ 11596 97672 152565 132592 156618 205730 283417 275812 192833 144440 131181 125857 177772
9327A77772P3242J7122L304J7809k920Q4324m2834M3341Q5418l4304j8991J7452
$$ 177772 251014 268136 271440 289249 286329 370653 327819 371160 456578 422274 403283 420735
9315D20735P9079O4978J2208o7211J4917P9904N2339L8786O9674P7049R8337N069
$$ 420735 499814 564792 577000 509789 524706 604610 656949 695735 765409 842458 940795 945864
9303I45864L0767P5530K18858J08566J8419k6518O9863K32172K04578J82357J86931
$$ 945864 976631 1052161 1271019 1379585 1398004 1371486 1441349 1673521 1878099 2060456 2247387
9292B247387K71367L57076L82030L77530L83170N64647N82225O52655P94793Q99918
$$ 2247387 2518754 2875830 3257860 3635390 4018560 4583207 5165432 5818087 6612880 7512798
9282G512798R26071Q38074Q41332O86704M57163J94952j06827l48913m96554p76610
$$ 7512798 8438869 9276943 10118275 10804979 11262142 11457094 11350267 11001354 10504800 9728190
9272I728190q91457q26750q14866p80344o86149n75412m76908l62080l32278l33779
$$ 9728190 8836733 8009983 7195117 6414773 5728624 5153212 4676304 4314224 3981946 3648167
9262C648167k07058k51399k12907j91653j80472j73604j46337j38687n8099j21200
$$ 3648167 3441109 3189710 2976803 2785150 2604678 2431074 2284737 2146050 2087951 1966751
9252A966751r3579j03127n4254j22815p1076p056J1300r0472j57613n4306j9776
$$ 1966751 1873172 1770045 1715791 1592976 1521900 1514844 1526144 1435672 1278059 1223753 1203977
9241A203977j10325q8261p7112p2334L8176K6300j0147o5336P825o700o7673l9980
$$ 1203977 1093652 1005391 928279 855945 894121 920421 910274 844938 852763 846063 778390 738410
9229G38410p6685m6239l7605Q926N3705L6022p1001k3145O3164J5296j10791M177
$$ 738410 661725 615486 577881 586807 640512 676534 605533 582388 645552 660848 550057 554234
9217E54234j7620P720p4781n480N7687l8508l0638n2813o0721L0360j7987l3462
$$ 554234 536614 544334 469553 464073 521760 483252 452614 399801 339080 369440 351453 317991
9205C17991K0021K3056M874j9689n1256m7678l7115k8552J5278L2432K3812n4174
$$ 317991 338012 361068 365942 346253 294997 247319 210204 181652 196930 229362 253174 199000
9193A99000q195O0459j2210k2733K6706Q582k1820n671j7023r943M2258r0581
$$ 199000 190805 251264 239054 216321 243027 251609 229789 224118 207095 197152 239410 148829
9181A48829k5566L6024O366l3701J125O4201p6106l7261J3088K0113l2600m3251
$$ 148829 123263 159287 165653 131952 133077 197278 121172 83911 96999 117112 84512 41261
9169D1261J4639O445R6504N6516O336J9571M1669k2144j4057l5177l4884m6430
$$ 41261 55900 62345 158849 215365 221701 241272 282941 260797 246740 211563 176679 130249
9157A30249K2856J5439j05240p8610q32M4358K9687N4074P7406j9215K912k5387
$$ 130249 153105 168544 63304 -15306 -16138 28220 57907 111981 189387 170172 173084 147697
9145A47697l9477r5836j2913R8969J3487P3470K3545L935l0523m2723k1683n7441
$$ 147697 108220 12384 -529 98440 111927 185397 208942 212877 182354 139631 117948 60507
9133F0507o0216L9244L5674O879M6058J7298l3513j3355j4579n536M7027L7339
$$ 60507 291 39535 75209 82088 128146 145444 111931 98576 83997 78461 125488 162827
9121A62827K7524J0606K0757j6322m0552M2248l2837p6659l7356k7751k8268j513
$$ 162827 190351 200957 221714 205392 164840 207088 174251 97592 60236 32485 4217 2704
9109B704j6669j0076L7376N5611M3987k4943k985J01221J01960n4605q3000R537
$$ 2704 -13965 -24041 13335 68946 112933 87990 85005 186226 288186 233581 150581 160118
9097A60118L184l3409k1341m965K937L0613m7284M597K0927m9156M4222L5963
$$ 160118 163302 129893 108552 103587 106524 137137 89853 94450 115377 66221 110443 146406
9085A46406P1043j50452j30422q938O4791J0470j6892o9323K7178L6453M0481
$$ 146406 217449 66997 -63425 -72363 -7572 2898 -13994 -83317 -56139 -19686 20795
9074B0795M4736J7707m4241k5566M9053o7840n2342O1994k5527P728P0103M3285
$$ 20795 65531 83238 38997 13431 62484 -5356 -57698 4296 -21231 -13503 56600 99885
9062I9885l6207J6059O2213n3798J6082l8031m904r2930q805L5576j9313m4085
$$ 99885 63678 79737 141950 88152 104234 66203 61299 -31631 -40436 -4860 -24173 -68258
9050f8258k5064n726l1088J05188r269M5243N4567Q5241o987p8633J6344R5700
$$ -68258 -93322 -99048 -130136 -24948 -34217 11026 65593 150834 143847 65214 81558 177258
9038A77258n9134j3002k8000M4894k6120l2538N5695O5932p1831k1037L695m4959
$$ 177258 118124 105122 77122 122016 95896 63358 119053 184985 113154 92117 95812 50853
9026E0853q7795n3254m092Q9742O3495N4996n9489n8762J1515m7574Q117Q3803
$$ 50853 -36942 -90196 -94288 -4546 58949 113945 54456 -4306 7209 -40365 -32248 51555
9014E1555K6098m3278L753M1908N7630o3087p3674L7044m5529k8597P5125J45255
$$ 51555 77653 34375 38128 80036 137666 74579 905 37949 -7580 -36177 38948 184203
9002A84203O7908j3467j6044o0915k9635l1187M2127l9515j12487o8568O832J1931
$$ 184203 252111 238644 222600 161685 132050 100863 142990 103475 -9012 -77580 -70748 -58817
8990e8817k001Q4346N1409m3523M5186j6591L117m2032j2124l2404P050k4017
$$ -58817 -60818 23528 74937 31414 76600 60009 63126 21094 8970 -23434 -16384 -40401
8978d0401j8384O0524M8227n415k3371K1718k9217r3502l4299j9573O2913L7093
$$ -40401 -58785 1739 49966 44551 21180 42898 13681 -79821 -114120 -133693 -70780 -33687
8966c3687k1374J3743N1026N426M1452o9789j6257j5567P8999n840o2342K2366
$$ -33687 -55061 -41318 9708 15134 56586 -13203 -29460 -45027 33972 28132 -34210 -11844
8954a1844m158j4689N8782L0598N4046n233J081Q6428J4739j4870n3172j24423
$$ -11844 -16002 -30691 28091 58689 112735 107502 108583 195011 209750 194880 141708 17285
8942A7285j06303o1362k6719J5939P120N1958L4000Q238l4055L0429P7193M7615
$$ 17285 -89018 -150380 -177099 -161160 -154040 -102082 -68082 -59844 -93899 -63470 13723 61338
8930F1338m9022p8925j8202j514L8935L3249J5625m1233n3230M4197K2637k4852
$$ 61338 12316 -66609 -84811 -86325 -47390 -14141 1484 -39749 -92979 -48782 -26145 -50997
8918e0997m6785M117L7823O1731O9403O0698j7083P647o8736P851k248k3318J3577
$$ -50997 -97782 -93665 -55842 5889 75292 135990 118907 126554 57818 65669 63421 40103 53680
8905E3680N1686k5173o6122K8046l7495M8469J3153q0337L5452N4043J5489m4318
$$ 53680 105366 80193 14071 42117 4622 53091 66244 -14093 21359 75402 90891 46573
8893D6573N9098J1958J1729j19339j37722o1866P0468m9605k7463J21574O5185
$$ 46573 105671 117629 129358 10019 -127703 -189569 -119101 -168706 -196169 -74595 -9410
8882i410Q987j6554n9462R234M8020J8345L1302P183P102O749O1598M678j9861
$$ -9410 -423 -16977 -76439 -67205 -19185 -840 30462 37645 44747 51496 113094 117772 97911
8869I7911n3894o1217L1899M7283k1790J03279R8219R3900R9131M8123M3783L9832
$$ 97911 44017 -17200 14699 61982 40192 143471 241690 335590 434721 482844 526627 566459
8857E66459K6346N5602R727p8271j58991j97722p6182k5925K2314l228k2140K2521
$$ 566459 592805 648407 658134 579863 420872 223150 146968 121043 143357 140129 117989 140510
8845A40510m9464k5242l7887q0916q7198M405L4701k9284k7439j0349L6207N905
$$ 140510 91046 65804 27917 -52999 -140197 -135792 -101091 -130375 -157814 -168163 -131956 -126051
8833a26051K5969l3967J0839K4442M7282Q9258Q3590k8975q4154l241N2112n5261
$$ -126051 -100082 -134049 -123210 -98768 -51486 37772 121362 92387 8233 4992 57104 1843
8821A843M972j7258K503k1731k8220L8495k7642j0093L2485K2717n0210q3826
$$ 1843 6815 -10443 -7940 -29671 -57891 -19396 -47038 -57131 -24646 -1929 -52139 -135965
8809a35965J9179J9752n7109Q9709J19644L5675q4670j05670n2734J9647m0254
$$ -135965 -116786 -97034 -154143 -64434 55210 90885 6215 -99455 -152189 -132542 -172796
8798a72796k4386j6272N8270K8743O0466J10005j3657p0297L5125o0688k7175
$$ -172796 -197182 -213454 -155184 -126441 -65975 44030 30373 -39924 -4799 -65487 -92662
8787i2662Q301K7203L8838J10444n1521K9564L5548p0211L3321j1656n6612n412
$$ -92662 -84361 -57158 -18320 92124 40603 70167 105715 35504 68825 57169 557 -4855
8775d855K3611j9661k064Q3023K9336n814k3271j9025K224l5744m5237k141N4298
$$ -4855 18756 -905 -2969 80054 109390 103576 80305 61280 63504 27760 -17477 -19618 34680
8762C4680M396n1038j4292J6507J593j5037j6098m7554O5852Q4830M4095l9901
$$ 34680 39076 -11962 -26254 -9747 -8154 -23191 -39289 -86843 -20991 63839 107934 68033
8750F8033J951k9365o7792k7301J9587P0049K9508R6120L9435j445k0655o7894
$$ 68033 69984 40619 -27173 -54474 -34887 35162 64670 160790 200225 198780 178125 110231
8738A10231k7088M958k2842q0642K9900l4617K5924P9004K0835N1259J5649n5264
$$ 110231 83143 88101 65259 -15383 14517 -20100 5824 84828 105663 156922 172571 117307
8726A17307l6769j2548M004N9506m4482M4877L8992l4932l5114n086J0259L9647
$$ 117307 80538 67990 71994 131500 87018 131895 170887 135955 100841 95755 106014 145661
8714A45661O9774L0857j8488m8164m2335l3843L9657J11536q5471o5404l4750
$$ 145661 215435 246292 227804 179640 137305 103462 143119 254655 169184 103780 69030
8703F9030K2502q8003P7710P0782J8725R9331l9148o735O4613K3547q9542q0990
$$ 69030 91532 3529 81239 152021 170746 270077 230929 224194 288807 312354 222812 141822
8691A41822k85p2135m6361K7831J04102K3374J7391j9455L3790Q7599J481L299
$$ 141822 141537 69402 23041 50872 154974 178348 195739 176284 210074 297673 299154 302453
8679C02453K8079N2795R8612k8103j8556n1421m2470l5928k6197k0644J0842J17268
$$ 302453 330532 383327 481939 453836 435280 383859 341389 305461 279264 258620 269462 386730
8667C86730P0020j5600K6566O9397k1585n8801r6205K239M2518m8855L3605R907
$$ 386730 456750 441150 467716 537113 515528 456727 360522 362761 405279 356424 390029 399936
8655C99936j087l4469J8026K9887N0397O4643P7338M0072P6858O3085Q4337N3461
$$ 399936 398849 364380 382406 412293 462690 527333 604671 644743 721601 784686 869023 922484
8643I22484k1762j2326P4870P0338L0838o2268j09240k1699l7797M1105L8140
$$ 922484 900722 888396 963266 1033604 1064442 1002174 892934 871235 833438 874543 912683
8632I12683o6390M6669l9961L1573L55j0156k0551R9197M696j9535J8532R6934
$$ 912683 846293 892962 853001 884574 884929 874773 854222 953419 958115 938580 957112 1054046
8620A054046J50319P6067O2703R7762K7685N5356M7479M9441L3405k676M9441
$$ 1054046 1204365 1280432 1343135 1440897 1468582 1523938 1571417 1620858 1654263 1651587 1701028
8609A701028P1893O8840O374j264p0553o2416r4308K0876J23418J36100J12311
$$ 1701028 1772921 1841761 1848135 1846871 1776318 1713902 1619594 1640470 1763888 1899988 2012299
8598B012299O1670j7292k8316l6757n9635m3155j50313j27316r3778j57898j50409
$$ 2012299 2073969 2056677 2028361 1991604 1931969 1888814 1738501 1611185 1517407 1359509 1209100
8587A209100q5898n3941q9663l8545o7174l5575j0339l2932j8521k6207j29061
$$ 1209100 1123202 1069261 979598 941053 873879 838304 827965 795033 776512 750305 621244
8576F21244m1940j1794J8063m5290m1465p6696l7489K8822k9386O9896J2989k2692
$$ 621244 579304 567510 585573 540283 498818 422122 384633 413455 384069 453965 466954 444262
8564D44262k4208J3713l2792k3846o4812M2533j1622l8957R7155J11471J04330
$$ 444262 420054 433767 400975 377129 312317 354850 343228 304271 401426 512897 617227
8553F17227J2882K0269m007p255l8826m2883l5044p5649j16440n5109n7653O187
$$ 617227 630109 650378 646371 639116 600290 557407 522363 446714 330274 275165 217512 223699
8541B23699M1085n08j3693M608p3938N192l8633o13J14128l5751k4001o4552L3628
$$ 223699 264784 264276 250583 255191 181253 186445 147812 147199 261327 225576 201575 137023 170651
8528A70651P8013p419j3885M0589k9932m7277m0888N8127R9418n827o572m892
$$ 170651 248664 241245 227360 267949 238017 190740 149852 207979 307397 301570 294998 290106
8516B90106m3602O3657q7273j26484k0422M1128n0378r4638l5362P1765J3510
$$ 290106 246504 310161 222888 96404 75982 117110 66732 -27906 -63268 8497 22007
8505B2007m1004J1156O1154M1735J6403p309l7936p6962o2047M8686L6872J32444
$$ 22007 -18997 -7841 53313 95048 111451 104142 66206 -10756 -72803 -24117 12755 145199
8493A45199M8331l0420j4048K9462K2574l3753J6177q1641j4075j1627J4087n4032
$$ 145199 193530 163110 149062 178524 201098 167345 183522 101881 87806 76179 90266 36234
8481C6234O041J4926P4925K9402N757l487k2063N14j299M3996n3393q2501L8823
$$ 36234 42275 57201 132126 161528 167285 163798 141735 142249 140950 184946 131553 49052 87875
8468H7875m6969l9704J8174J01149O3624j02045j5607o4439L1089R35J1910M8037
$$ 87875 40906 1202 19376 120525 184149 82104 66497 2058 33147 34082 45992 94029
8456I4029K5353L7196k0228p7322k7091r106L8901J5697J5182l9129L3789j5139
$$ 94029 119382 156578 136350 59028 31937 22831 61732 77429 92611 53482 87271 72132
8444G2132l8230j7485K6591o7533K662J10134K5599l6787K6146J9577K1704o6595
$$ 72132 33902 16417 43008 -24525 -21863 88271 113870 77083 103229 122806 144510 77915
8432G7915l3204J2554K331K2815k0949J6538j2909L4457O5889l0910l5857n304
$$ 77915 44711 57265 59596 82411 61462 78000 65091 99548 165437 134527 98670 93366
8420I3366M5991O3919q2583n0098Q4264l2650r9334m6548L2517L0186J0657m9701
$$ 93366 139357 203276 120693 70595 154859 122209 22875 -23673 8844 39030 49687 -14
8408a4m9779k643O0359M6019R6206M2386j00484n3954Q3162r881j9241k8571L002
$$ -14 -49793 -52436 7923 53942 150148 192534 92050 38096 121258 111377 92136 63565 66567
8395F6567k0007O044M8699n1030k0030P6738N5101M3119o2905o2847J5819M1675
$$ 66567 46560 52604 101303 50273 30243 106981 162082 205201 142296 79449 95268 136943
8383A36943p4682q3098M7709J23811j9208p3507j1718P3753J2022o3843L4109
$$ 136943 62261 -20837 26872 150683 131475 57968 46250 120003 132025 68182 102291
8372A02291L4536J9184l3880j6159j5361k0279p64n5351J2260L9268l9768O2145
$$ 102291 136827 156011 122131 105972 90611 70332 69568 14217 26477 65745 25977 88122
8360H8122M5943l19K4347N0571j7004q6053o3519m7070k4974P002L2051L1438
$$ 88122 134065 133746 158093 208664 191660 105607 42088 -4982 -29956 -22954 9097 40535
8348D0535L5230l0383l496l6227k9034L2295R2219M8516k6488r5158o2024O8183
$$ 40535 75765 45382 41886 5659 -23375 8920 101139 149655 123167 28009 -34015 34168
8336C4168J04035P1929m2722p5292m1461Q1195k7394o1977k926L9257L127j4493
$$ 34168 138203 210132 167410 92118 50657 131852 104458 42481 39555 78812 81939 67446
8324F7446N0272K9534p7112K7720k4520J2970L423n570q339l0487r935l9669k7513
$$ 67446 117718 147252 70140 97860 73340 86310 89733 84163 75824 45337 35402 -4267 -31780
8311c1780p6669L6368R8115K3039M8935j10054j7979O2031N2211K081o0636r026
$$ -31780 -108449 -72081 26034 49073 98008 -12046 -30025 32006 84217 86298 25662 16636
8299A6636o5312m5002O6252N2538J04972n604n8900j0766J5188j1043k3482n4205
$$ 16636 -48676 -93678 -27426 25112 130084 124480 65580 54814 70002 58959 35477 -18728
8287a8728K8586J2504m2546k7074L540Q055P6706N6271J6106m5660j24581O6553
$$ -18728 9858 22362 -20184 -47258 -43718 -35663 41043 97314 113420 67760 -56821 9732
8275I732N2171j30107n6373J06379Q1662j4900n4473M0473L1737o8215M6943J11478
$$ 9732 61903 -68204 -124577 -18198 63464 48564 -5909 34564 66301 -1914 45029 156507
8263A56507J8409j00418k2287N0184L4651j15727K2052j8285p0753l5912K212
$$ 156507 174916 74498 52211 102395 137046 21319 43371 25086 -45667 -81579 -79367
8252g9367r33M0981J4975J9288K4307L4806R7934j264j30071q3394J5652L6536
$$ -79367 -80300 -39319 -24344 -5056 19251 54057 151991 150727 20656 -62738 -47086 -10550
8240a0550k1789p6670L1266P3230O6674l7203j6157k3263L824q912J5620N0786
$$ -10550 -32339 -109009 -77743 -4513 62161 24958 8801 -14462 -10638 -19550 -3930 46856
8228D6856k4507k6458O327M5477L6151o6325j1652J6576M1340l3302L1688O0252
$$ 46856 22349 -4109 2218 47695 83846 17521 5869 22445 63785 30483 62171 122423
8216A22423j6990l3110j15133p5748K8165N32K4630M8981k3718K0467Q888M4291
$$ 122423 105433 72323 -42810 -118558 -90393 -89861 -65231 -16250 -39968 -19501 -10613 33678
8204C3678M7075m6008q1994j6933L0264n476j3262M2803K7001j8862m8976M2407
$$ 33678 80753 34745 -47249 -64182 -33918 -39394 -52656 -9853 17148 -1714 -50690 -8283
8192h283N5809o7530q9273j4779O4506N6374L4961n08j48645j33846M8158J29918
$$ -8283 47526 -20004 -109277 -124056 -59550 -3176 31785 31277 -117368 -251214 -203056 -73138
8180g3138N4224o7351o660k8350O762M3120j3970N6594J1727K7182m1366p345
$$ -73138 -18914 -86265 -92925 -121275 -114513 -71393 -85363 -28769 -17042 10140 -31226 -38571
8168c8571l000K6890j10187m6449L159J10973J24095O382N8491N5q3402j9507
$$ -38571 -41571 -14681 -124868 -171317 -168158 -57185 66910 73292 131783 131838 48436 28929
8156B8929J35676Q6619K0091P7145L4695R588q7149k6981N9598r6754n5311n261
$$ 28929 164605 251224 271315 348460 383155 392743 305594 278613 338211 241457 186146 180885
8144A80885m3676r5732J0055L6423n8303m8447j2496M5266l38j3962L0978M7942
$$ 180885 137209 41477 51532 87955 29652 -18795 -31291 13975 13637 -325 30653 78595
8132G8595Q296j4145J6823l6549j5110J2314L9813L8810o0119M9029J6790q226
$$ 78595 86891 72746 89569 53020 37910 50224 90037 128847 68728 117757 134547 126321
8120A26321J7258o9038r6127k788N9521R8246Q5784j4554N768J8816J4698q904
$$ 126321 143579 74541 -21586 -24374 35147 133393 219177 204623 210391 229207 243905 235001
8108B35001n0354o841n849M904q1151p8059k5120m4661j7793R8794J2057J6940
$$ 235001 184647 177806 171957 176861 95710 17651 -7469 -52130 -69923 28871 40928 57868
8096E7868P1366J0611n1206j01493o3750K1700K6573N8365O5871N7168j4661p6448
$$ 57868 129234 139845 88639 -12854 -76604 -54904 -28331 30034 95905 153073 138412 61964
8084F1964K195L6599M4070L8227m0565p994r782p455p3626j27771O435N1295Q1411
$$ 61964 64159 100758 144828 183055 142490 134496 124714 117259 43633 -84138 -77703 -26408 55003
8071E5003L6102k25L3331k8057J2974K5675l177o3195k2446O1953n49J2259J8849
$$ 55003 91105 90880 124211 96154 109128 134803 131626 68431 45985 107938 107389 119648 138497
8058A38497M5348J1555J9539j0909n6188K4017K4352K3200M3472J07101K4246
$$ 138497 183845 195400 214939 204030 147842 171859 196211 219411 262883 369984 394230
8047C94230R8570R5220k5579l937J01664J3437l8844N1036L1770k113J0174J872
$$ 394230 492800 588020 562441 558504 660168 673605 634761 685797 717567 715454 725628 727500
8035G27500k2860Q7559K7927p1746n2740J7132j356p8270l5014j8598Q74o449
$$ 727500 704640 792199 820126 748380 695640 712772 711416 633146 598132 579534 580408 573959
8023E73959p4512o4895n9499K7207R5155O3745o385l1244m9490n264Q2227Q3336
$$ 573959 499447 434552 375053 402260 497415 561160 554775 523531 474041 468777 551004 634340
8011F34340j7389J3743P9655J52118Q8205N0961P3126K16466K10153K16994J83773
$$ 634340 616951 630694 710349 862467 950672 1001633 1074759 1291225 1501378 1718372 1902145
8000A902145k859j7464M330K0067q6318j71806j53456r8234r5166M2534J23481
$$ 1902145 1899286 1881822 1886152 1906219 1819901 1648095 1494639 1396405 1301239 1343773 1467254
7989A467254Q2988l600P9284p1676j48327j31927j33736j51631j10468r1610j17371
$$ 1467254 1550242 1546642 1625926 1554250 1405923 1273996 1140260 988629 878161 786551 669180
7978F69180o1813p0565n2843M5281o986M8732J03668K2321L1895P9606K7749o8005
$$ 669180 607367 536802 483959 529240 522254 570986 674654 696975 728870 808476 836225 768220
7966G68220k7618j5075L9754J3007K9184J51381J76078J52567N1093M496P2739
$$ 768220 740602 725527 765281 778288 807472 958853 1134931 1287498 1338591 1343087 1415826
7955A415826J02135R699R2418O8142n0231n9853m2573k5084p8578o9007r7682
$$ 1415826 1517961 1527660 1620078 1688220 1637989 1578136 1535563 1510479 1431901 1362894 1265212
7944A265212n8757J8374k6902n5462j26408j82251o1210r1459o5081n2276j03301
$$ 1265212 1206455 1224829 1197927 1142465 1016057 833806 772596 681137 616056 563780 460479
7933D60479m2996j1307j0245L3594p6245p4070n1552N8808N4347Q2617L3873j0992
$$ 460479 417483 406176 395931 429525 353280 279210 227658 286466 340813 423430 457303 446311
7921D46311N573k9821P2041J13552l4855r96L1079j1234M1137P1299r5215o582
$$ 446311 451884 422063 494104 607656 572801 571805 602884 591650 632787 704086 608871 602289
7909F02289k0437j1512n0981j28513J457p5972o4606J1624o8607p2373K187Q3138
$$ 602289 581852 570340 519359 390846 392303 316331 251725 263349 194742 122369 124556 207694
7897B07694j5654q8576k1451O511p5358Q819l2418n7511Q1210J0000o409n0100
$$ 207694 192040 103464 82013 88524 13166 21985 -10433 -67944 13266 23266 16857 -33243
7885c3243L698R6763P7989m4594k9900K0710m9170l1158M322P9374M4699j10620
$$ -33243 -29545 67218 145207 100613 70713 91423 42253 11095 15417 94791 139490 28870
7873B8870L8547Q0919J1172l701j6989l7387j29153n0420J6875k3510J3126m212
$$ 28870 67417 148336 159508 155807 138818 101431 -27722 -78142 -61267 -84777 -71651 -75863
7861g5863l8681k0497Q04k904O246J21948N5724j8768o5052L0681L2072k9648
$$ -75863 -114544 -135041 -134237 -137141 -130895 -8947 46777 28009 -37043 -6362 25710 -3938
7849c938o6577j2841N6172J7143J0206K1350L0131k6499o5184n5031K8152Q2437
$$ -3938 -70515 -83356 -27184 -10041 165 21515 51646 25147 -40037 -95068 -66916 15521
7837A5521n0316n4739K0471O8818N185n5028L2355P8297n3225o6339K1746M1723
$$ 15521 -34795 -89534 -69063 -245 4940 -50088 -17733 60564 7339 -59000 -37254 4469
7825D469j3047m0228p906k770m5862k9404J02947R6390l2097k4367j4373k8689
$$ 4469 -8578 -48806 -56712 -59482 -105344 -134748 -31801 64589 32492 8125 -6248 -34937
7813c4937p2972J02464N2669K1661l4450l6039k9087J803M710K3206k789M2599
$$ -34937 -107909 -5445 47224 68885 34435 -1604 -30691 -28888 -24178 -972 -3761 38838
7801C8838K3443j27413n9829J8922p067o0412J1559K3971l232K3921K8417L2083
$$ 38838 62281 -65132 -124961 -106039 -113106 -173518 -161959 -137988 -141220 -117299 -88882 -56799
7789e6799Q9929J08294l813l9918j6493n5330o8394l2476j8591N8755K1645l9291
$$ -56799 33130 141424 137611 97693 81200 25870 -42524 -75000 -93591 -34836 -13191 -52482
7777e2482j0084J3614k6929K1029Q3842o520m4947n287m4578k8718j0279P919
$$ -52482 -62566 -48952 -75881 -54852 28990 22470 -22477 -27764 -72342 -101060 -111339 -103420
7765a03420P7643j8268k5906L4259j2370J07485L7911r572m8295J1103L9976k2760
$$ -103420 -25777 -44045 -69951 -35692 -48062 59423 97334 87762 39467 50570 90546 67786
7753F7786j9400l3527L59p5176J8131L6575n7880K902O4576k4113l2602K3779
$$ 67786 48386 14859 15218 -59958 -41827 -5252 -63132 -60230 4346 -19767 -52369 -28590
7741b8590j9066j14884N9481J17953Q294L1799q605k3325m4068N574R26n738j3441
$$ -28590 -47656 -162540 -103059 14894 23188 54987 46382 23057 -21011 -15437 -14511 -20249 -33690
7728c3690m8522o5812j0648K5526J14240M6659n2594q6969M952o030r778k38K5846
$$ -33690 -82212 -148024 -158672 -133146 -18906 27753 -24841 -111810 -106858 -112888 -122666 -122904 -97058
7715i7058Q1983P4292K1211l9501m8888r5567J8636J583r247O7946m1582m9469
$$ -97058 -15075 59217 80428 40927 -7961 -103528 -84892 -83309 -92556 -24610 -66192 -115661
7703a15661k1852N8029O6933R6142Q23l0464j2218l5099p1467o9266q6798l7767
$$ -115661 -137513 -79484 -12551 83591 84414 53950 41732 6633 -64834 -134100 -220898 -258665
7691b58665N6058J18632J9614l7434M3979P9647k0288k2971P8p3809k4131R5746
$$ -258665 -202607 -83975 -64361 -101795 -57816 21831 1543 -21428 -21350 -95159 -119290 -23544
7679b3544K5288j4300k2328M1441Q851m5475J3164j1482L244L3582O1501K8928
$$ -23544 1744 -12556 -34884 6557 15408 -30067 -16903 -28385 -25141 8441 69942 98870
7667I8870p2014j5639N340L9923o978K1544l6992p7495l3223P513N8154M9012
$$ 98870 26856 11217 16557 56480 49502 71046 34054 -43441 -76664 -69151 -10997 38015
7655C8015n0589P1671o3025m8010p17J9300O8632K8341n1253k8688L9460j8902
$$ 38015 -12574 59097 -3928 -51938 -52655 -33355 35277 63618 12365 -16323 23137 4235
7643D235k4265J2220j2831j0131O691l0427n593M9491L3219Q138n5411j1828L9766
$$ 4235 -20030 -7810 -20641 -30772 -24081 -54508 -60101 -10610 22609 30747 -24664 -36492 3274
7630C274J4094K5373J3290J2873m8022q5740k9496M463M4286Q0111q729j9484
$$ 3274 17368 42741 56031 68904 20882 -64858 -94354 -89891 -45605 34506 25777 6293
7618F293N759q5116j21300m1247J9902Q5964O7319K2585o0765R235P4745L8224
$$ 6293 12052 -73064 -194364 -235611 -215709 -129745 -62426 -39841 -100606 -91371 -16626 21598
7606B1598K6057N800K6533J7079k0040n3714k1986j97l5986k7147M759J9808L2373
$$ 21598 47655 53455 79988 97067 77027 23313 1327 1130 -34856 -62003 -57244 -37436 -5063
7593e063N1461L6291j6934o2662n4123J0652J0208k485O857K0912J9205K9481
$$ -5063 46398 82689 65755 3093 -51030 -40378 -30170 -32655 -25798 -4886 14319 43800
7581D3800Q429l7871K622k5432l9166m1405K9721J1848n43K4562M5953L0336k8092
$$ 43800 52229 14358 16980 -8452 -47618 -89023 -59302 -47454 -47997 -23435 22518 52854 24762
7568B4762m9819m7451N3692l2865J1722Q5975L6981n031j57527k5545Q9896M2515
$$ 24762 -25057 -72508 -18816 -51681 -39959 46016 82997 77966 -79561 -105106 -15210 27305
7556B7305m3134l3570O3220K4152K8312M927p5211K0852K4417N154k1129J3784
$$ 27305 -15829 -49399 13821 37973 66285 71212 -3999 16853 41270 46424 25295 39079
7544C9079P8391J4666n7323p627r5076o6789J25870n241m0912P2110J3208J0594
$$ 39079 117470 132136 74813 67186 -27890 -94679 31191 25950 -14962 57148 70356 80950
7532H0950j7311j04196O457J7694k8382J4141l5544j0200j1275J7878J3489J2618
$$ 80950 63639 -40557 -34100 -16406 -44788 -30647 -66191 -76391 -87666 -69788 -56299 -43681
7520d3681J817k484k0754q895J2004P7306J4944k1457J1804J6682J7415l293N6486
$$ -43681 -41864 -44348 -65102 -73997 -61993 15313 30257 8800 20604 37286 54701 51408 107894
7507A07894l4240o1988j9092M5224M3698K5272j01023r4004j4932L5194O1809
$$ 107894 73654 11666 -7426 37798 81496 106768 5745 -88259 -103191 -67997 -6188
7496f188m8241l6644K6189l481O5418j664j2217l8483O923j20839Q5252P3118
$$ -6188 -54429 -91073 -64884 -68365 -2947 -4611 -16828 -55311 -48388 -169227 -83975 -10857
7484a0857q5825r18O1113L15n3506J16517L8683j06167J7140K6770k9371q5420
$$ -10857 -96682 -97600 -36487 -36172 -89678 26839 65522 -40645 -23505 3265 -26106 -111526
7472a11526j020k0005K0801R906k3475R496j5604K888K3339P4224K3711J2936
$$ -111526 -112546 -132551 -111750 -101844 -125319 -115823 -131427 -128539 -105200 -30976 -7265 5671
7460E671n1928k8618P2740j3587q0457O0562J00301K107l7082l2244O309p7522
$$ 5671 -46257 -74875 -2135 -15722 -96179 -35617 64684 66791 29709 -2535 3774 -73748
7448g3748J9078K2980l630K3078o4899m1491o222M5770K2271K7267K993N1140
$$ -73748 -54670 -31690 -35320 -12242 -77141 -118632 -124854 -79084 -56813 -29546 -26553 24587
7436B4587J7643j7791q476j5257K0111k534r1899l7517o552K5040M4220L2821
$$ 24587 42230 24439 15963 706 20817 18283 -73616 -111133 -117685 -92645 -48425 -15604
7424a5604P6941O0351q0457M7860K1893n1045k8577j8929J0981n3130o846O274
$$ -15604 61337 121688 41231 89091 110984 59939 31362 12433 23414 -29716 -36562 -30288
7412c0288j05170P996J04257N6192Q2126O350j02147p3229m2594O6332R470K630
$$ -30288 -135458 -127462 -23205 32987 115113 121463 19316 -53913 -96507 -30175 -20705 -18075
7400a8075K4117M4530k8588M6638k2691r1959O4250J15057k0657j05695R158P855
$$ -18075 6042 50572 21984 68622 45931 -46028 18222 133279 112622 6927 16085 23940
7388B3940J0606J4392m0747K1657j668j5379l1530M5517N857j3804p1362j556
$$ 23940 34546 48938 8191 29848 28180 12801 -18729 26788 32645 18841 -52521 -54077
7376e4077K7307k2710Q5743L1793L3582j1497M1588m328j21303k5754j0329K291
$$ -54077 -26770 -49480 36263 68056 101638 90141 131729 127401 6098 -19656 -29985 -27694
7364b7694m6709P6245K7969m996j3605J352j6971K3552l0350m4522N1239N7787
$$ -27694 -74403 1842 29811 24815 11210 12562 -4409 19143 -11207 -55729 -4490 53297
7352E3297K4478q4398j6420r1740o7555M1791J25402J4659q639j9579k3248R279
$$ 53297 77775 -6623 -23043 -114783 -182338 -140547 -15145 -486 -9125 -28704 -51952 -42673
7340d2673M9615n185k2223o6347M691Q270K4975J18841L7576j1804O8986j5737
$$ -42673 6942 1757 -20466 -86813 -82122 -73852 -48877 69964 107540 95736 164722 148985
7328A48985n3995J0773k1814k0665L1556l5810m0021j2194k2146k7709k9823j9845
$$ 148985 94990 105763 83949 63284 94840 59030 19009 6815 -15331 -43040 -72863 -92708
7316i2708N630K4487P0862M2751q311l8629p5054p422K4647j3869K106R0419K9997
$$ -92708 -87078 -62591 8271 51022 42711 4082 -70972 -78394 -53747 -67616 -65510 24909 54906
7303E4906K6777j1540l5809j528p9955L2260Q1684P5022j3327l4063l4171j7366
$$ 54906 81683 70143 34334 32806 -47149 -14889 66795 141817 128490 94427 60256 42890
7291D2890j9620N928k7756q0608p9899L6963k3816k2310j9579r699K3592N2381
$$ 42890 23270 29198 1442 -79166 -159065 -122102 -145918 -168228 -187807 -197506 -173914 -121533
7279a21533M0988j7842J6533r42J2211L4583k4350Q077m3839N2580J259j896k6554
$$ -121533 -80545 -98387 -81854 -82796 -70585 -36002 -60352 -52275 -96114 -43534 -42275 -44171 -70725
7266g0725k0318K2695m8350l2456J6034L0887k4339j0305Q451J8608L5086N7648
$$ -70725 -91043 -68348 -116698 -149154 -133120 -102233 -126572 -136877 -128426 -109818 -74732 -17084
$$ [...]
##END NTUPLES=NMR SPECTRUM
##END=
