##TITLE=Analysis number 320419
Compound Code cc 48609
Book Reference 483/34
Project Code adrs
Chemist Name mattw
##JCAMPDX= 6.0         $$ Bruker NMR JCAMP-DX V2.0
##DATA TYPE= NMR SPECTRUM
##DATA CLASS= NTUPLES
##ORIGIN= Bruker BioSpin GmbH
##OWNER= nmr
$$ XWIN-NMR		Version 3.5
$$ Fri Jun 23 13:47:32 2006 GMT Daylight Time (UT+1h)  MAYBRIDGE\nmr@NMR_250MHZ
##.OBSERVE FREQUENCY= 250.131544655141
##.OBSERVE NUCLEUS= ^1H
##.ACQUISITION MODE= SIMULTANEOUS (DQD)
##.ACQUISITION SCHEME= undefined
##.AVERAGES= 16
##.DIGITISER RES= 18
##SPECTROMETER/DATA SYSTEM= dpx250
##.PULSE SEQUENCE= zg30
##.SOLVENT NAME= CDCl3
##.SHIFT REFERENCE= (INTERNAL, CDCl3, 0, 16.522)
##AUDIT TRAIL= $$ (NUMBER, WHEN, WHO, WHERE, WHAT)
$$ ##TITLE= Audit trail, XWIN-NMR		Version 3.5
$$ ##JCAMPDX= 5.01
$$ ##ORIGIN= Bruker BioSpin GmbH
$$ ##OWNER= nmr
$$ C:\u/data/dgb/nmr/ADRS/1370/pdata/1/auditp.txt
$$ ##AUDIT TRAIL=  $$ (NUMBER, WHEN, WHO, WHERE, WHAT)
(   1,<2006-06-23 13:47:00.90 +100>,<MAYBRIDGE\nmr>,<NMR_250MHZ>,
      <created by zg, POWCHK disabled, PULCHK disabled
       configuration hash MD5:
       E2 DF 36 D8 04 B2 41 60 5A D7 A3 38 5A 4B D0 FE
       data hash MD5: 64K
       2D AE 3D 47 1C 14 30 93 13 E0 10 26 BA 78 A2 D5>)
(   2,<2006-06-23 13:47:15.79 +100>,<MAYBRIDGE\nmr>,<NMR_250MHZ>,
      <Start of raw data processing
       ef LB = 0.3 FT_mod = 6 PKNL = 1 SI = 32K 
       data hash MD5: 32K
       48 D1 95 7D C8 BF 63 B4 02 90 80 53 79 68 0C 4C>)
(   3,<2006-06-23 13:47:17.68 +100>,<MAYBRIDGE\nmr>,<NMR_250MHZ>,
      <apk 
       data hash MD5: 32K
       3B 5D BE CB BD CF 22 12 9E 84 8B F5 72 19 F9 6C>)
(   4,<2006-06-23 13:47:18.42 +100>,<MAYBRIDGE\nmr>,<NMR_250MHZ>,
      <abs ABSG = 5 
       data hash MD5: 32K
       58 12 D8 D1 9B 75 6F DB A7 44 B0 E1 E6 6F BA 94>)
$$ ##END=
$$ 
$$ hash MD5
$$ E4 ED D8 38 40 A9 61 18 83 85 98 54 21 4E F9 56
##$RELAX= 
##$RELAX= 
##$RELAX= 
##$RELAX= 
##$RELAX= 
##$RELAX= 
##$RELAX= 
$$ Bruker specific parameters
$$ --------------------------
##$DU= <C:\u>
##$EXPNO= 1370
##$NAME= <ADRS>
##$PROCNO= 1
##$TYPE= <nmr>
##$USER= <dgb>
##$AMP= (0..31)
100 100 100 100 100 100 100 100 100 100 100 100 100 100 100 100 100 100 
100 100 100 100 100 100 100 100 100 100 100 100 100 100 
##$AQSEQ= 0
##$AQ_mod= 3
##$AUNM= <au_zg>
##$AUTOPOS= <36 >
##$BF1= 250.13
##$BF2= 250.13
##$BF3= 250.13
##$BF4= 250.13
##$BF5= 500.13
##$BF6= 500.13
##$BF7= 500.13
##$BF8= 500.13
##$BYTORDA= 1
##$CFDGTYP= 0
##$CFRGTYP= 5
##$CHEMSTR= <none>
##$CNST= (0..31)
1 1 145 1 1 1 1 1 1 1 1 1 1 1 1 1 1 1 1 1 1 1 1 1 1 1 1 1 1 1 1 1 
##$CPDPRG= <>
##$CPDPRG1= <>
##$CPDPRG2= <>
##$CPDPRG3= <>
##$CPDPRG4= <mlev>
##$CPDPRG5= <mlev>
##$CPDPRG6= <mlev>
##$CPDPRG7= <mlev>
##$CPDPRG8= <mlev>
##$CPDPRGB= <>
##$CPDPRGT= <>
##$D= (0..31)
0 1 0 0 0 0 0 0 0 0.06 0 0 0 0 0 0 0.0002 0 0 0 0 0 0 0 0 0 0 0 0 0 0 
0 
##$DATE= 1151066818
##$DBL= (0..7)
120 120 120 120 120 120 120 120 
##$DBP= (0..7)
150 150 150 150 150 150 150 150 
##$DBP07= 0
##$DBPNAM0= <>
##$DBPNAM1= <>
$$ [...]
##$SUBNAM7= <"">
##$SUBNAM8= <"">
##$SUBNAM9= <"">
##$SW= 20.6930455092707
##$SWIBOX= (0..15)
0 0 3 0 0 0 0 0 0 0 0 0 0 0 0 0 
##$SW_h= 5175.983436853
##$TD= 65536
##$TD0= 1
##$TE= 295.16
##$TE2= 300
##$TE3= 300
##$TEG= 300
##$TL= (0..7)
0 120 120 120 120 120 120 120 
##$TP= (0..7)
150 150 150 150 150 150 150 150 
##$TP07= 0
##$TPNAME0= <>
##$TPNAME1= <>
##$TPNAME2= <>
##$TPNAME3= <>
##$TPNAME4= <>
##$TPNAME5= <>
##$TPNAME6= <>
##$TPNAME7= <>
##$TPOAL= (0..7)
0.5 0.5 0.5 0.5 0.5 0.5 0.5 0.5 
##$TPOFFS= (0..7)
0 0 0 0 0 0 0 0 
##$TUNHIN= 0
##$TUNHOUT= 0
##$TUNXOUT= 0
##$USERA1= <user>
##$USERA2= <user>
##$USERA3= <user>
##$USERA4= <user>
##$USERA5= <user>
##$V9= 5
##$VALIST= <valist>
##$VCLIST= <CCCCCCCCCCCCCCC>
##$VD= 0
##$VDLIST= <DDDDDDDDDDDDDDD>
##$VPLIST= <PPPPPPPPPPPPPPP>
##$VTLIST= <TTTTTTTTTTTTTTT>
##$WBST= 1024
##$WBSW= 4
##$XGAIN= (0..3)
0 0 0 0 
##$XL= 0
##$YL= 0
##$YMAX_a= 313915
##$YMIN_a= -541191
##$ZGOPTNS= <>
##$ZL1= 120
##$ZL2= 120
##$ZL3= 120
##$ZL4= 120
##$ABSF1= 16.522
##$ABSF2= -4.171173
##$ABSG= 5
##$ABSL= 3
##$ALPHA= 0
##$AQORDER= 0
##$ASSFAC= 0
##$ASSFACI= 0
##$ASSFACX= 0
##$ASSWID= 0
##$AUNMP= <proc_1d>
##$AZFE= 0.1
##$AZFW= 0.1
##$BCFW= 0
##$BC_mod= 0
##$BYTORDP= 0
##$COROFFS= 0
##$CY= 12.5
##$DATMOD= 1
##$DC= 0
##$DFILT= <>
##$DTYPP= 0
##$F1P= 14.0000005364418
##$F2P= -0.99999901652339
##$FCOR= 0.5
##$FTSIZE= 32768
##$FT_mod= 6
##$GAMMA= 0
##$GB= 0
##$INTBC= 1
##$INTSCL= 1
##$ISEN= 128
##$LB= 0.3
##$LEV0= 0
##$LPBIN= 0
##$MAXI= 10000
##$MC2= 0
##$MEAN= 0
##$ME_mod= 0
##$MI= 0
##$NCOEF= 0
##$NC_proc= -5
##$NLEV= 6
##$NOISF1= 0
##$NOISF2= 0
##$NSP= 0
##$NTH_PI= 0
##$NZP= 0
##$OFFSET= 16.522
##$PC= 1
##$PHC0= 165.3254
##$PHC1= 15.68584
##$PH_mod= 1
##$PKNL= yes
##$PPARMOD= 0
##$PSCAL= 4
##$PSIGN= 0
##$REVERSE= no
##$SF= 250.13
##$SI= 32768
##$SIGF1= 0
##$SIGF2= 0
##$SINO= 400
##$SIOLD= 32768
##$SREGLST= <1H.CDCl3>
##$SSB= 0
##$STSI= 32768
##$STSR= 0
##$SW_p= 5175.98343685301
##$SYMM= 0
##$S_DEV= 0
##$TDeff= 65536
##$TDoff= 0
##$TI= <Analysis number 999999
Compound Code 99
Book Reference 9
Project Code 9>
##$TILT= no
##$TM1= 0
##$TM2= 0
##$TOPLEV= 0
##$USERP1= <user>
##$USERP2= <user>
##$USERP3= <user>
##$USERP4= <user>
##$USERP5= <user>
##$WDW= 1
##$XDIM= 32768
##$YMAX_p= 510491369
##$YMIN_p= -486950
$$ End of Bruker specific parameters
$$ ---------------------------------
##NTUPLES= NMR SPECTRUM
##VAR_NAME=  FREQUENCY,     SPECTRUM/REAL,   SPECTRUM/IMAG
##SYMBOL=    X,             R,               I
##VAR_TYPE=  INDEPENDENT,   DEPENDENT,       DEPENDENT
##VAR_FORM=  AFFN,          ASDF,            ASDF
##VAR_DIM=   32768,         32768,           32768
##UNITS=     HZ,            ARBITRARY UNITS, ARBITRARY UNITS
##FACTOR=    0.157963299565203, 1,           1
##FIRST=     4132.6476996994, 0,             0
##LAST=      -1043.33573715361, 0,           0
##MIN=       -1043.33573715361, -486950,     0
##MAX=       4132.6476996994, 510491369,     0
$$ Real data points
##PAGE= N=1
##DATA TABLE= (X++(R..R)), XYDATA
$$ [...]
17552A58536J1237J2304K898k3179J32839n30R1216O7533j7806m509R3173P201
17540E30913k8791l6302n9391j40075j47176k135J62424K02768p7854j30873p0
17529B73438M1437N3280n6o2288P1645J29184j31689j40896k11204K5381J62897
17518B11129P8486l0069j43143m8425K5875L2525k1756K8363K1287l600k3097
17507A27575M5012O4819J7001J2388L8313n1065J1643L2813K1026L7916N0270
17496D07711p2717l3949J9871j41325l9106o2194j38644L1558J20782R4083L3810
17485B19880K4205R8389j6440j10690M6092J27395j32942j87330K6663K00166
17475B95388m3021l1911p4552p7453n6982L3227J76571J62305o1317p4041P3196
$$ plain form
17552 158536 169773 182077 184975 161796 294635 294105 385321 452854 435048 430539 523712 530913
17540 530913 502122 465820 406429 266354 119178 117043 279467 482235 404381 273508 273438
17529 273438 314875 368155 368099 305811 377456 506640 374951 234055 22851 48232 211129
17518 211129 289615 259546 116403 67978 93853 126378 104622 132985 154272 150672 127575
17507 127575 172587 237406 254407 266795 305108 254043 265686 298499 319525 357441 407711
17496 407711 334994 301045 320916 179591 140485 78291 -60353 -28795 91987 186070 219880
17485 219880 244085 342474 326034 215344 261436 388831 255889 68559 95222 295388
17475 295388 252367 220456 145904 68451 11469 44696 221267 383572 322255 248214 321410
17464C21410O5937l8427j25520q2534M4094J20337M38M7454P2752n4953o4708
17453C06280L1864j04669m5486O2334M5295P5391J11364J81480J40238P3506P6571
17442I54168N5560Q4827j09794j71270j17745m678j29454j46190M8384n7644m6186
17431C59978n0409R5239j11429j19387j0524Q8646L4033K3991J13634p6476o927
17420C40369K27966P8869M4628j28272j91836j39084L1834P6264r653q9011J7397
17409B59471J43522J13323M5015J16806J79167o1529k90069p4680L2928L3423
17399D97377Q300R0900J22646J40357J46766k06781k73607P1753R4084p7711j42616
17388D71468r5354J08894Q2696P6776j0379N172K1215m2064o4681Q9744J16678
$$ plain form
17464 321410 387347 348920 223400 140866 184960 305297 305735 353189 425941 370988 306280
17453 306280 338144 233475 187989 250323 295618 371009 482373 663853 804091 877597 954168
17442 954168 1009728 1094555 984761 813491 695746 691068 561614 415424 463808 406164 359978
17431 359978 309569 404808 293379 173992 163468 252114 286147 310138 423772 347296 340369
17420 340369 568335 647204 691832 563560 371724 232640 264474 340738 331085 242074 259471
17409 259471 402993 516316 561331 678137 857304 795775 505706 431026 463954 497377
17399 497377 505677 596577 719223 859580 1006346 799565 525958 597711 691795 614084 471468
17388 471468 376114 485008 567704 644480 634101 639273 660488 618424 553743 643487 760165
17377G60165J21872j03163L7703O718q5070J6812K40607J30329L9091q5793m9587
17366A029684o5664l8805m0215J43947L8103K0379j2491j10451k6684K2738L1260
17355I91801J16693j01647j22890j67106J4243J91463K97230R3028o0725J3276
17345A265366J13740O9591p6562o9718J7485J33454O6270L8852N4255j9399L5909
17334A629243J2416J81620k354o9092N6216j49275J4216L6034M1498P8769R970
17323A839261m9982J06314J61104J10930M4951J42767J4471l2173K1118L4266
17313B393027Q6961J16866P9147J02595J02547K01872J4564j2386m5759R6844
17303C136278J07330Q1965J95250J78580J12983J0233J28164J89691J13247J32816
$$ plain form
17377 760165 882037 778874 816577 823295 738225 755037 995644 1125973 1165064 1079271 1029684
17366 1029684 964020 925215 885000 1028947 1067050 1087429 1074938 964487 937803 960541 991801
17355 991801 1108494 1006847 883957 716851 731094 922557 1219787 1312815 1252090 1265366
17345 1265366 1379106 1448697 1372135 1302417 1319902 1453356 1519626 1558478 1612733 1593334 1629243
17334 1629243 1641659 1823279 1820925 1751833 1808049 1658774 1672990 1709024 1750522 1829291 1839261
17323 1839261 1789279 1895593 2056697 2167627 2212578 2355345 2369816 2337643 2358761 2393027
17313 2393027 2479988 2596854 2676001 2778596 2881143 3083015 3097579 3085193 3039434 3136278
17303 3136278 3243608 3325573 3520823 3699403 3812386 3822619 3950783 4140474 4253721 4386537
17293D386537M6253J79110J74873R7697J45243M21778L60514O4913K95451L23767
17283F496136J46670K71852L87350L07334K41937J68806M00438M85455M45795
17274I351773L61041L66365N17219P35998O33668O95396P56446Q30344P90811
17265A5039061Q69718J048908J042526J099099J300529J306402J450289J552930
17257B4709462J842396J987112K147272K477791K545758K811944L230618L230982
17249D4983335L599617L869576M115522M197723M313043M359386M235872L819680
17241G7493754L237491K572263J815346J114594J80967p09633j628282k329029
17233H1747471k980616l353912l708968l901712l761062l623031l513405l276345
$$ plain form
17293 4386537 4432790 4611900 4786773 4884470 5029713 5451491 5812005 5876918 6172369 6496136
17283 6496136 6642806 6914658 7302008 7609342 7851279 8020085 8420523 8905978 9351773
17274 9351773 9712814 10079179 10596398 11332396 11966064 12661460 13417906 14248250 15039061
17265 15039061 15908779 16957687 18000213 19099312 20399841 21706243 23156532 24709462
17257 24709462 26551858 28538970 30686242 33164033 35709791 38521735 41752353 44983335
17249 44983335 48582952 52452528 56568050 60765773 65078816 69438202 73674074 77493754
17241 77493754 80731245 83303508 85118854 86233448 86414415 85704782 84076500 81747471
17233 81747471 78766855 75412943 71703975 67802263 64041201 60418170 56904765 53628420
17225E3628420l169429l045380k766047k461620k284025k108761j949810j820156
17217C4023192j613149j473878j326898j420583j360400j271182j062409j084549
17209B3410144r56093r59153r70863r01854p23777o15270o63261p63875o09845
17200A6246153n50411m55251n41234o26344l86762l65953m68095m12916m63485
17191A1975702m06271m69822l17797m43942l33419l51537l05814l23929k64463
17182H758708j28611l62438m41465k67251j76987k09697k64126k05952j66329
17173F535852k04992q6461o6604j29011r6169j21507j73528j21650k34601k65169
17163E036160k48154j64506j49232q7529m2720k04854j13909J5486n3504L6214
$$ plain form
17225 53628420 50458991 47413611 44647564 42185944 39901919 37793158 35843348 34023192
17217 34023192 32410043 30936165 29609267 28188684 26828284 25557102 24494693 23410144
17209 23410144 22454051 21494898 20524035 19622181 18898404 18283134 17619873 16855998 16246153
17200 16246153 15695742 15240491 14699257 14072913 13686151 13320198 12852103 12439187 11975702
17191 11975702 11569431 11099609 10781812 10337870 10004451 9652914 9347100 9023171 8758708
17182 8758708 8630097 8267659 7826194 7558943 7381956 7172259 6908133 6702181 6535852
17173 6535852 6330860 6244399 6177795 6048784 5952615 5831108 5657580 5535930 5301329 5036160
17163 5036160 4788006 4623500 4474268 4386739 4344019 4139165 4025256 4040742 3987238 4023452
17153D023452o6072k27071j16790o0559P30p7130j94145j58497j43668o0253k5770
17142B894227n5867Q346r6256j16930j4066M3292j20869j64939j01250P9646N0473
17131B405807m5576r0561j21885j33144n7470P675p5303p1322j7162j1154J7059
17120A806964J09433l9001r1984j60483k6746K6403M4283q6253j76701L6181L4581
17109A476677j05241r9126n3779m4904M4055l9646j43798o6205m5740r8181m4303
17098G79809K7324J8297M4272O8969n6539j46975m1452O8919q1441l1948J0831
17087F60066k5307K935L8912k0514p1723R0741Q4937k03896k02079O9092J50839
17076E74003M7057K5562N0891j19677j08661k2452L584P8219Q9549k9323j15432
$$ plain form
17153 4023452 3957380 3730309 3613519 3552960 3553690 3476560 3282415 3123918 2980250 2919997 2894227
17142 2894227 2838360 2846706 2750450 2633520 2619454 2662746 2541877 2376938 2275688 2355334 2405807
17131 2405807 2360231 2269670 2147785 2014641 1957171 1964846 1889543 1818221 1801059 1789905 1806964
17120 1806964 1916397 1877396 1785412 1624929 1598183 1624586 1668869 1582616 1405915 1442096 1476677
17109 1476677 1371436 1272310 1218531 1173627 1217682 1178036 1034238 968033 922293 824112 779809
17098 779809 807133 825430 869702 938671 882132 735157 693705 762624 681183 649235 660066
17087 660066 634759 637694 676606 656092 584369 675110 760047 556151 354072 423164 574003
17076 574003 621060 646622 697513 577836 469175 446723 450307 528526 618075 588752 473320
17065D73320j891k6108q7168j7353N7849J5301Q6328J5347O0785J1420n9328n8036
17053D70466K6593j3024m6924q9807o7363J6717N9703m1236p4289r4002K2203
17042A69037j1761L0910K4938m669P8148j2091j0806q893r6556n6689K4055Q8470
17030B14093k9679p0174m5293J4619k096r1479N8828R2380M7660K8542P083N0113
17018B74597j19800p9588P5140R6817p62j45613j5322k6270o3016K9966j4599
17007A1550m2785J18R5185q928N5580l8321k02283O95l907J14104J60211m8182
16995I3037M6189N9715j07726m0674K1061M0358j52854n1304J86865L9040l6098
16984I7609N8141l8596j50692p218J20657n5579k3826j8432N3599L3301l5311
$$ plain form
17065 473320 471429 445321 358153 340800 398649 413950 500278 515625 576410 587830 528502 470466
17053 470466 497059 484035 437111 347304 279941 296658 356361 315125 240836 146834 169037
17042 169037 157276 188186 213124 208455 286603 274512 263706 254813 158257 101568 125623 214093
17030 214093 184414 114240 68947 83566 81470 -10009 48819 141199 188859 217401 224484 274597
17018 274597 154797 75209 150349 247166 246404 100791 85469 59199 -3817 26149 11550
17007 11550 -31235 -31117 64068 55140 110720 72399 -129884 -129189 -133096 -18992 141219 93037
16995 93037 139226 198941 91215 50541 71602 111960 -40894 -92198 94667 133707 97609
16984 97609 155750 117154 -33538 -40756 79901 24322 496 -17936 35663 68964 33653
16973C3653l9904N9381M7926j1026m9404M3800P3478L0593L9691l6888P4675p9095
16961A86880j98948q329K6447O579m9904m4378L4824L0819n5836k70J86513J45258
16949B59655M2211q634k04690k11794M681m4303M699J52891J14995J7742k29652
16938a02199o0057J6813j03434o5183R4839k356R6722P2711j176j1235J2940L4926
16926a6689n2196J65489J06215j64574k19666j7269Q3443j885N2671l8263p1985
16915a74709J84077J05198M4083r5316r3323J32850J23323q519j08787r2371j8401
16904a895j30139J1412J62226J08742r590q8749m2976o1819n2822m6227O5332
16893h6505q659p0189N3860J43215p2170q9558m9380j09527q8745K01789Q9552
$$ plain form
16973 33653 -6251 53130 101056 90030 40626 84426 157904 188497 228188 191300 265975 186880
16961 186880 -12068 -20397 6050 12629 -37275 -81653 -46829 -16010 -71846 -72116 114397 259655
16949 259655 301866 293232 88542 -123252 -118571 -162874 -158175 -5284 109711 127453 -102199
16938 -102199 -162256 -145443 -248877 -314060 -219221 -221577 -124855 -52144 -53320 -64555 -51615 -16689
16926 -16689 -68885 96604 202819 38245 -181421 -198690 -115247 -117132 -64461 -102724 -174709
16915 -174709 9368 114566 158649 63333 -29990 102860 226183 217664 108877 16506 -1895
16904 -1895 -132034 -120622 41604 150346 140756 52007 9031 -52788 -105610 -151837 -86505
16893 -86505 -95164 -165353 -111493 31722 -40448 -130006 -179386 -288913 -377658 -175869 -86317
16882h6317r5266M2792L2532k0240j2626q1141k708L9149q8785J54521M165r0173
16870b04097j26314J353J3293R7224M3264J07019J79084l2887l4723j30590p2985
16859a60359P8143M7762p7343Q322R5692n6026k6431K5900P0846Q4645n7334j10124
16847g6307j58181J3573J04332J50509N2650k1060p8567o7027k3193K4370m1285
16836a20186N6706J28190K6095j30174k5264L8294l5659K748N3876O379p4500
16825g3495r9252m8110l9075J40402N5297J42739p187j40106j24426J14258N184
16814g3771J0502j2008P6405m398o2912n7447K5643O9906k4181n3344K7117K7578
16802e0910k08629p4471M3817K22876M1759r290j06379j1775N2402J53409O2345
$$ plain form
16882 -86317 -181583 -138791 -106259 -126499 -139125 -220266 -222974 -183825 -272610 -118089 -113924 -204097
16870 -204097 -330411 -329058 -315765 -218541 -175277 -68258 110826 77939 43216 -87374 -160359
16859 -160359 -82216 -34454 -111797 -103475 -7783 -63809 -90240 -64340 6506 91151 33817 -76307
16847 -76307 -234488 -220915 -116583 33926 86576 65516 -13051 -80078 -103271 -78901 -120186
16836 -120186 -63480 64710 90805 -39369 -64633 -26339 -61998 -59250 -5374 1005 -73495
16825 -73495 -172747 -220857 -259932 -119530 -64233 78506 71319 -68787 -193213 -78955 -73771
16814 -73771 -63269 -75277 1128 -3270 -66182 -123629 -97986 -28080 -52261 -105605 -78488 -50910
16802 -50910 -259539 -334010 -290193 -67317 -25558 -34848 -141227 -153002 -100600 52809 115154
16791A15154j2569m1218k02641n378Q3559j596k0555n2072P984n0132j26492m0465
16779c46421J50015M6570j383k6371n8668j1712J651k0861J7413R5517J34619
16768a9631L3256j13897j71342J2584Q155N6569j8222n7332M4428K5123m0020
16757b40329l2590Q3323P9542j01m9025K0500j45067L5042J32629P9207R3238
16746E6369l5872p7178k2564r2466O4623k735q4648n3365M4676J33626O4146j4289
16734a9677K3425k233j11873p2602j8023M671M437m4251m4396J04454p3196J3099
16722b36165J04283Q0090L4317o7202n2304j07652L9924J11107M368M6711j4395
16711e6918j7528k9114q5524q3033j3815J13493M7960o8885m0725n2742P6495
$$ plain form
16791 115154 102585 61367 -141274 -146652 -63093 -64689 -85244 -137316 -129332 -179464 -305956 -346421
16779 -346421 -196406 -149836 -151219 -177590 -236258 -247970 -246319 -267180 -249767 -154250 -19631
16768 -19631 13625 -100272 -271614 -259030 -250875 -194306 -212528 -269860 -225432 -200309 -240329
16757 -240329 -272919 -189596 -110054 -110155 -159180 -138680 -283747 -248705 -116076 -36869 56369
16746 56369 20497 -56681 -79245 -171711 -107088 -109823 -194471 -247836 -203160 -69534 -5388 -19677
16734 -19677 3748 1515 -110358 -182960 -200983 -196312 -191875 -236126 -280522 -176068 -249264 -236165
16722 -236165 -131882 -51792 -17475 -84677 -136981 -244633 -204709 -93602 -89234 -42523 -56918
16711 -56918 -74446 -103560 -189084 -272117 -285932 -172439 -124479 -193364 -234089 -286831 -210336
16700b10336l1592j304J68052M605l829O6134K395k03230n2229Q9397l1711l7522
16688b41170j8484O5061Q4498o2369m9375J01289K3378q1239O5063J71795j32854
16677g4407j17696N7233l0887K5393K3936P9676J81838k5923r2785r7081n5043
16666a25746J0433K8856p489J8183l8081O5123r3488r8625R4090J69111L368j60057
16654a34322j41510K0643j01714P7817J8071J46163L0366o1966O6336p775j01614
16643a89505J6975m1472n5005K5357R1911l9455j00156K0015K4354N8109k1881
16632b10753J32030j8918o6536R8364J2297k5909M935k2316L9662o607j17231
16621a80982J29278k4917n2037j55704j01296J30381J42202M4528r4780j07879
$$ plain form
16700 -210336 -241928 -243232 -75180 -70575 -74404 -8270 -5875 -209105 -261334 -171937 -203648 -241170
16688 -241170 -259654 -194593 -110095 -172464 -221839 -120550 -97172 -178411 -113348 58447 -74407
16677 -74407 -192103 -134870 -165757 -140364 -116428 -36752 145086 119163 26378 -70703 -125746
16666 -125746 -115313 -86457 -93946 -75763 -113844 -48721 -142209 -240834 -146744 22367 25735 -134322
16654 -134322 -275832 -255189 -356903 -279086 -261015 -114852 -84486 -146452 -80116 -87891 -189505
16643 -189505 -172530 -214002 -269007 -243650 -151739 -191194 -291350 -271335 -246981 -188872 -210753
16632 -210753 -78723 -97641 -164177 -65813 -53516 -79425 -74490 -96806 -57144 -63751 -180982
16621 -180982 -51704 -76621 -128658 -284362 -385658 -255277 -113075 -68547 -163327 -271206
16611b71206k091J19317P2736J53958N9825o7671j90130j31114k7281j15951n1969
16600d51577J56230J40224R114k5632J37254o6132K8517K15302O9342j49152o7123
16589c633M4424k7665J8312j67679j46244j36737M4116J01680L2595l6278r871
16578b86980O6239K7685N358J6336L8709j8774p3484j6902J14545J2954M937K881
16566a06496j28196k5129p3379R27j5860R5049J2341o1581K4771n3560j04436
16555d35549K9360J68565Q6852M0972j44409q5656J08722P3522k6720Q4039J1428
16544h8874j6355j6496R0807J03753P4560r9815k0268O84n159n510j09999J3519
16532g9153n2340j25137J20629N3760n7462o3404M6819Q8q7420n6255L0485O5044
$$ plain form
16611 -271206 -273297 -153980 -81244 72714 132539 64868 -125262 -256376 -283657 -399608 -451577
16600 -451577 -295347 -155123 -146009 -171641 -34387 -100519 -72002 143300 212642 63490 -3633
16589 -3633 40791 13126 31438 -136241 -282485 -419222 -375106 -273426 -240831 -277109 -286980
16578 -286980 -220741 -193056 -187698 -171362 -132653 -151427 -224911 -241813 -127268 -114314 -109377 -106496
16566 -106496 -234692 -259821 -333200 -332273 -348133 -253084 -240743 -302324 -277553 -331113 -435549
16555 -435549 -406189 -237624 -150772 -109800 -254209 -339865 -231143 -157621 -184341 -100302 -88874
16544 -88874 -105229 -121725 -30918 72835 147395 47580 27312 27996 22837 17327 -92672 -79153
16532 -79153 -131493 -256630 -136001 -82241 -139703 -203107 -156288 -156200 -243620 -299875 -269390 -204346
16520b04346j04692J5473J59732P4262m8111j31883P3483J83537O4402k3905M5373
16509A03325j09777j44961j49232j2895J76648J2100q6043l5094l413L6247j4935
16498b28030N9579M4319l8955K7983L7409k8048o9925m690n7176J01332O6121
16487i0081M8325m4208j15388r0849r826J43477O0166M5881k2114k4775P3276
16476b6116p4155p2876p4027L3718L3680J30491J04129J2053m9355j02222p6014
16465a60694l1765J3446N7015l5810l3914O5662j6242n8871n7009j9368J4105
16454b63445l6229M2838J56243J6316j11320L1075M503j07619q6703M7352J47033
16443a59956N7085K01024L4301l3185m8424j02735R8119R9811j22888o4913K1313
$$ plain form
16520 -204346 -309038 -293565 -133833 -59571 -107682 -239565 -166082 17455 81857 57952 103325
16509 103325 -6452 -151413 -300645 -313540 -136892 -124792 -210835 -245929 -249342 -213095 -228030
16498 -228030 -168451 -124132 -163087 -135104 -97695 -125743 -195668 -200358 -257534 -156202 -90081
16487 -90081 -41756 -85964 -201352 -292201 -302027 -158550 -98384 -52503 -74617 -99392 -26116
16476 -26116 -100271 -173147 -247174 -213456 -179776 -49285 54844 66897 17542 -84680 -160694
16465 -160694 -192459 -179013 -121998 -157808 -191722 -126060 -142302 -201173 -258182 -277550 -263445
16454 -263445 -299674 -256836 -100593 -84277 -195597 -164522 -160019 -267638 -354341 -306989 -159956
16443 -159956 -102871 98153 132454 99269 50845 -51890 46229 146040 23152 -41761 -20448
16432b0448n2294M1768l200j45894J5765L8654M658R0166Q6741J8610j12411k7427
16420f5312Q69k860P2224o9441k0376M2613M94K8993p6865j0043j6247j13690
16408b29641k5661M1317O7838J38962j12122j10616O031J4247J663k9579L6929
16397b00632K7144L4433K7911J5940K8522p2682o5930k4002O6508J06271L7940
16386a8577P5642N2232j56027r6842n2103L8221p9685O7825N8124k4519Q3373
16375e2336Q0526n2161j4983N8430j4774j28835j11888K2691m574J1844J19361
16364h6699J46189R3163j06240o8300O8186q9553j13326M0278Q2335L5828j10499
16353a08638o0899j7054K0935N1906r8194M1632P3017l0203Q8438m9845q4154
$$ plain form
16432 -20448 -72742 -30974 -34174 -180068 -164303 -125649 -120991 -30825 55916 74526 -37885 -65312
16420 -65312 -64443 -67303 4921 -64520 -84896 -42283 -41789 -12796 -89661 -99704 -115951 -229641
16408 -229641 -255302 -213985 -146147 -7185 -119307 -229923 -223892 -209645 -207982 -237561 -200632
16397 -200632 -173488 -139055 -111144 -95204 -66682 -139364 -205294 -229296 -162788 -56517 -18577
16386 -18577 57065 109297 -46730 -143572 -195675 -157454 -237139 -169314 -111190 -135709 -52336
16375 -52336 28190 -23971 -38954 19476 4702 -124133 -236021 -213330 -217904 -206060 -86699
16364 -86699 59490 152653 46413 -21887 46299 -43254 -156580 -116302 -33967 1861 -108638
16353 -108638 -169537 -186591 -165656 -113750 -211944 -170312 -97295 -127498 -39060 -88905 -173059
16342a73059K8670J41112m344r1974n6101L0942j20391j03483j020J2882K6798
16331c09968Q526Q7123m5167k2717J15399J73052j44596p5891q9883p498M6753
16320b64867q927K389O3456N5796N3814P351l7469j63778m8739J04894N6669J19744
16308e9667j892L3652p4169L184J83624K5226j1860q8082q2239j2981p1017k2829
16296a79050q5057J8739R9030L1505n3697J19214K6852N400p48n7704o1924k5626
16284a63066N6902P5262k9318j4082p6006K1138L7919J288o8226Q8458K7828p6098
16272a18001p2454m1467Q5683J40929O3804Q1844N7409j24181j46902Q5501l2365
16261b0200k88848m9638J24855m3844m6766N1123K51968M9940m1233o6779J0213
$$ plain form
16342 -173059 -144389 -3277 -7621 -99595 -155696 -124754 -245145 -348628 -349648 -336766 -309968
16331 -309968 -301442 -214319 -259486 -282203 -166804 6248 -138348 -214239 -304122 -311620 -264867
16320 -264867 -273794 -271405 -207949 -152153 -98339 -90988 -128457 -292235 -340974 -236080 -179411 -59667
16308 -59667 -61559 -27907 -102076 -98892 84732 109958 98098 10016 -72223 -85204 -156221 -179050
16296 -179050 -264107 -245368 -146338 -114833 -168530 -49316 -22464 -17064 -17812 -75516 -137440 -163066
16284 -163066 -106164 -30902 -60220 -74302 -150308 -129170 -91251 -89963 -158189 -69731 -41903 -118001
16272 -118001 -190455 -231922 -146239 -5310 58494 140338 197747 73566 -73336 12165 -20200
16261 -20200 -309048 -358686 -233831 -277675 -324441 -273318 -21350 28590 -12643 -79422 -69209
16250f9209j0887P7406O3458n2433m3306K2986n7573r7210j8433J45171L1559
16239h471j46918j13408K3700R1959R2228l5697l9277K8153J0396L017R60k3517
16227a16875k6092J10048q806K9713L955q4116q0378O0217J26507N6926l0016
16216D1083j00229l2342j53638K0277N7716L4084N751j0991o7179q3182O4773
16205b23877M4564n6259p0630L7712J9881n2006J1505O3912P0555k9874M4054
16194a40463P765k1524j04045q0280K0324O6607J11731J9234l9912J7515o6011
16183b09059M5152N7219J08416R1344p9758r8790j25372L4096R074j1371K6829
16172a52220L4859m5479j3357o729n0039O9225J00662N7583M308n7611l4257P9832
$$ plain form
16250 -69209 -80096 -2690 60768 8335 -34971 -11985 -69558 -166768 -185201 -40030 -8471
16239 -8471 -155389 -268797 -245097 -153138 -60910 -96607 -135884 -107731 -97335 -94318 -93358 -116875
16227 -116875 -142967 -32919 -41725 -12012 -8057 -92173 -172551 -112334 14173 71099 41083
16216 41083 -59146 -91488 -245126 -224849 -167133 -133049 -127298 -138289 -205468 -288650 -223877
16205 -223877 -179313 -235572 -306202 -268490 -248609 -300615 -289110 -225198 -154643 -184517 -140463
16194 -140463 -132698 -154222 -258267 -338547 -318223 -251616 -139885 -120651 -160563 -143048 -209059
16183 -209059 -163907 -106688 1728 93072 13314 -85476 -210848 -176752 -167678 -179049 -152220
16172 -152220 -117361 -162840 -176197 -182926 -232965 -163740 -63078 -5495 -1187 -58798 -93055 -13223
16160a3223o2851k9411r890n3501j00748k052J22745m9350m3742j00668j7389
16149c60080O6116l696K5052J32790K5102l0195r4933k4457j187P702o0278J08111
16137b09953J30142J2335q6562R914l3106J6212K4224K2016j115O0899P7450p0255
16125d7799j55103j42074L9124R498K5629j7936o3386O6857l2375M9956n2492
16114c20101r3606J16806L4737J31537K7293m815M5730N849m8242k8942j57582
16103b91336K1564J03913P9471j1115j17029j3612m4450J84871P7428k8265p2177
16092a10737n2041r0534l7805O5035J73981n9549j56707j12100L9186O0877P0046
16081b10348o0983M8459k6993k7207N8301K1061q889p1984N275L3685N5226k057
$$ plain form
16160 -13223 -76074 -105485 -115375 -168876 -269624 -271676 -148931 -198281 -242023 -342691 -360080
16149 -360080 -293964 -297660 -272608 -139818 -114716 -144911 -239844 -264301 -265488 -257786 -318064 -209953
16137 -209953 -79811 -67476 -154038 -144124 -177230 -161018 -136794 -114778 -115893 -54994 22456 -47799
16125 -47799 -202902 -344976 -305852 -296354 -270725 -288661 -352047 -285190 -317565 -267609 -320101
16114 -320101 -413707 -296901 -262164 -130627 -103334 -108149 -62419 -56570 -104812 -133754 -291336
16103 -291336 -269772 -165859 -86388 -97503 -214532 -228144 -272594 -87723 -10295 -38560 -110737
16092 -110737 -162778 -253312 -291117 -226082 -52101 -111650 -268357 -380457 -341271 -280394 -210348
16081 -210348 -271331 -222872 -249865 -277072 -218771 -197710 -206599 -278583 -273308 -239623 -184397 -186454
16069a86454N7760Q5944Q826j3580l2540m0777o7761m9838K7250R706r0931l5272
16057c27667Q1703j8584J848N1325q013J7931J9983L5934K0574n2006j14131k7065
16045c18168L2595J19258Q8342k3804K5180O8287l652j07698K7205m7588J04360
16034c5683K0794r4023L6666O4183m8245k6464M7277j54216N483J0364J11955
16023f1909L0680j7667L2153N9850M2209j52483o3494l8626n3721J810J6412p157
16011b11943j12109P2508P2327N4035j447J15784J3315Q993j31742m2637k9575
16000a92491O5802P772p2537J91202P6517j44795o8775n5597l4301j01738n7883
15989c86824J7135Q8409J75578J70434N5012l9819j27286l6358J37755j2858p4546
$$ plain form
16069 -186454 -128694 -42750 -33924 -47504 -80044 -120821 -188582 -238420 -211170 -201464 -292395 -327667
16057 -327667 -245964 -264548 -262700 -211375 -219388 -201457 -181474 -145540 -124966 -176972 -291103 -318168
16045 -318168 -285573 -166315 -77973 -101777 -76597 -8310 -11962 -119660 -92455 -140043 -35683
16034 -35683 -14889 -108912 -72246 -8063 -56308 -82772 -35495 -189711 -184228 -173864 -61909
16023 -61909 -31229 -48896 -16743 43107 85316 -67167 -130661 -169287 -223008 -221198 -204786 -211943
16011 -211943 -324052 -251544 -179217 -125182 -126629 -10845 2470 11463 -120279 -162916 -192491
16000 -192491 -126689 -118917 -191454 -252 76265 -68530 -137305 -192902 -227203 -328941 -386824
15989 -386824 -369689 -281280 -105702 64732 119744 79925 -47361 -83719 54036 41178 -33368
15978c3368n0704N7704O7671k797l3718j31325P9755J34256l6752j17292N0251
15967a6319q0705j74729j49047m937P7364J46143l2994J23886K1373R0151k5591
15956b5405J9859L0913L4469l0317r3663l2367N7910Q2374p8828p5566n1425J12172
15944d9874Q7049p0225q1446K5808j6100j27261L3264j07437P245K23100n285
15933h1162j39420K6191O4223O8576L3048p5921l2056p4997M0896k7609m9158
15922b47389N2031J27571J10105j02467P60n8990p6157j39119J01385j7638j58133
15911d08041n4020N7095Q1261N1373L5437L7535k15120p2470M9558J16465O2457
15900b58470M0417L9346k4480l7531k9092k2306R6985O4711J9453L0953n8711
$$ plain form
15978 -33368 -84072 -26368 41303 38506 4788 -126537 -46782 87474 50722 -66570 -16319
15967 -16319 -97024 -271753 -420800 -425737 -348373 -202230 -235224 -111338 -89965 186 -25405
15956 -25405 -5546 25367 59836 29519 -64144 -96511 -38601 43773 -35055 -110621 -162046 -49874
15944 -49874 37175 -33050 -114496 -88688 -104788 -232049 -198785 -306222 -298977 -75877 -81162
15933 -81162 -220582 -194391 -130168 -61592 -28544 -104465 -136521 -211518 -170622 -198231 -247389
15922 -247389 -195358 -67787 42318 -60149 -59389 -118379 -194536 -333655 -232270 -249908 -408041
15911 -408041 -462061 -404966 -323705 -272332 -236895 -199360 -414480 -486950 -437392 -320927 -258470
15900 -258470 -218053 -178707 -203187 -240718 -269810 -292116 -195131 -130420 -110967 -80014 -138725
15889a38725r936n7602m8232l0801l0598N1123N0233J6254K775j3987L6185j7838
15877a91149M3080O392P288P5103L3973L1486k5354J2341K4848K521k2584o1686
15865f3741n3607j0201m6042p7603N3607J2547p569k6826M9488P1634j3219n1269
15853a62801q1411J687N4549r604k4201j3944O4502J37087J4389q6213J7690l7926
15841a26196j83416L1711J44567Q1603r1884l7313j5027m6967k2150j65627M3072
15830c87627R6803p415N7296P2660L7099Q6392P9495J11975j04215l8828q7631
15819h3996n7960l0896N9404K098j39119k2195P5064o1273k7762O2347J00265
15808a24023l4399k5060M5994O8238L9914N247o2162R1447J6563r4745p5106R0403
$$ plain form
15889 -138725 -148661 -206263 -254495 -285296 -315894 -264771 -214538 -198284 -195509 -209496 -173311 -191149
15877 -191149 -148069 -141677 -134389 -59286 -25313 6173 -19181 -6840 18008 20529 -2055 -63741
15865 -63741 -117348 -127549 -173591 -251194 -197587 -185040 -192609 -219435 -169947 -98313 -111532 -162801
15853 -162801 -244212 -242525 -187976 -197580 -221781 -235725 -171223 -34136 -19747 -105960 -88270 -126196
15841 -126196 -309612 -277901 -133334 -51731 -143615 -180928 -195955 -242922 -265072 -430699 -387627
15830 -387627 -290824 -298239 -240943 -168283 -131184 -44792 34703 146678 42463 3635 -83996
15819 -83996 -141956 -172852 -113448 -111350 -250469 -272664 -197600 -258873 -286635 -224288 -124023
15808 -124023 -158422 -183482 -137488 -69250 -29336 -24089 -86251 5196 21759 -72986 -148092 -57689
15796e7689N8767J7604N5415j21200n3362l592j34220o6008J38276J28177j5503
15785e3335o3869k7961J36434n2761k9683j5909l0306O2823l6201K9497m688j0809
15773i6768J1922O4099J7538J0877q9914R001m8302j02416N4923J15477N9105
15762E542j2467q1854j2344Q5787j31563M5976L8131O6404p9267j8276j13322
15751b07253l3220J72903J15967j22309m9225J3326j5235O9690m895M2822l8375
15740e5804k2588m8400J9541j05645m2802J49770J6661l8046L2193J13707J8626
15729C7213o9403K2014O4274p7005j5509k1335n5527J4511o3324J11353J2714
15718d0024j31278l8523K8211J5421O6080O3224O4659j3412o2627L2035n1510
$$ plain form
15796 -57689 1078 18682 74097 -47103 -100465 -104057 -238277 -304285 -166009 -37832 -53335
15785 -53335 -117204 -145165 -8731 -61492 -91175 -107084 -137390 -74567 -110768 -81271 -85959 -96768
15773 -96768 -84846 -20747 -3209 7668 -82246 -73245 -121547 -223963 -169040 -53563 5542
15762 5542 -6925 -88779 -101123 -15336 -146899 -100923 -62792 3612 -75655 -93931 -207253
15751 -207253 -240473 -67570 48397 -73912 -123137 -109811 -125046 -55356 -60251 -17429 -55804
15740 -55804 -78392 -126792 -107251 -212896 -255698 -105928 -89267 -127313 -95120 18587 37213
15729 37213 -32190 -10176 54098 -22907 -38416 -59751 -115278 -100767 -164091 -52738 -40024
15718 -40024 -171302 -209825 -181614 -166193 -100113 -36889 27770 14358 -48269 -16234 -67744
15707f7744K9964l4366q8152o7460j5339J2238J64243J23721r5559j40531j58792
15696c37777L0616P7261M5448R5633l0639o9546R6110M1746k4839r1709l3163
15685b00859o8540J00177J16985K5512n0018r9916p6420j4893J59425J01482K6078
15674A9013M5879j65869K9532O0794O1938q0609m9326k3974R3291Q434p3784j53774
15662b28455k9759K5286k1553N2473l2948L0367K4015Q3688K00162n5899j69321
15651a21944N2631j23400j19570O6185M3272R6497J4688j2125K9210j06329m3483
15640b24368M0862P3476r3001j43133Q3530R443p0538o8774K8611J10222J80100
15629g3570O8908j8768j41772L6925N9689r1991j05488o9916M5840J12774j252
$$ plain form
15707 -67744 -37780 -72146 -160298 -227758 -243097 -230859 -66616 57105 -38454 -178985 -337777
15696 -337777 -307161 -229900 -184452 -88819 -119458 -189004 -92894 -51148 -75987 -167696 -200859
15685 -200859 -269399 -169222 -52237 -26725 -76743 -176659 -253079 -267972 -108547 -7065 19013
15674 19013 64892 -100977 -71445 -10651 51287 -29322 -78648 -102622 -9331 -897 -74681 -228455
15662 -228455 -258214 -232928 -254481 -202008 -234956 -204589 -180574 -96886 103276 47377 -121944
15651 -121944 -69313 -192713 -312283 -246098 -202826 -106329 -91641 -103766 -74556 -180885 -224368
15640 -224368 -183506 -110030 -203031 -346164 -262634 -253191 -323729 -392503 -363892 -253670 -73570
15629 -73570 -4662 -23430 -165202 -128277 -68588 -160579 -266067 -335983 -290143 -177369 -178621
15618a78621j4683j2918O5291j8840j3750P7632L9235o4269q2462O1557L0435
15607a11393q7069K9071K9240j9331N2418M4145Q8353j48241j55391l1330L9616
15596b69912J9302J00078R660l425k1549j8241J8625J9316j0860J05929l1101
15585h2178k268L1050j7386l7042o7277m1569q4021n0836L6046O7265L4990p0124
15573b83350M0949K7925M4528P5283o4528L3175r8230p3718J30222O6665l2292
15562a33371l688L4690j26437j16467N4615l186L7289P9296J51880J0605p4026
15551h8800L2538j06997n5671j7230R820n3649k6328K12748J38242l0564p903
15540F206K4079K2291j05469j10603M0358j0928k4535J9413o5211L2415Q079m8842
$$ plain form
15618 -178621 -193304 -206222 -140931 -159771 -173521 -95889 -56654 -120923 -203385 -141828 -111393
15607 -111393 -198462 -169391 -140151 -159482 -107064 -62919 25434 -122807 -278198 -309528 -269912
15596 -269912 -250610 -150532 -140872 -144297 -165846 -184087 -165462 -146146 -157006 -51077 -82178
15585 -82178 -84446 -53396 -70782 -107824 -175101 -216670 -300691 -351527 -315481 -248216 -213226 -283350
15573 -283350 -242401 -214476 -169948 -94665 -159193 -126018 -224248 -297966 -167744 -101079 -133371
15562 -133371 -137059 -102369 -228806 -345273 -290658 -293844 -256555 -177259 -25379 -14774 -88800
15551 -88800 -56262 -163259 -218930 -236160 -226340 -279989 -306317 -93569 44673 14109 6206
15540 6206 30285 52576 -52893 -163496 -123138 -134066 -158601 -139188 -204399 -171984 -163905 -212747
15528b12747R9545l7184K2511O1051J3603q8838j0606J7675l5261J1009P1506
15517h7736l5868j55750j5803J6774J70100k0983j28768o0578Q5122J42959o8449
15506a58980O257N6564L9590l2014k4400o9453n5332R621P893J36362P7778Q7073
15494H0959o5947q4201k7267l2290Q0018N8012j0260O909l349N536L5290q1844
15482c8434m2898q1582q8804l5748O9892l3707N4716J3392M6331R6701J04582
15471F4441o9334m6900j7936o7402j7747m2463M2367K1327o824l4598p044k0290
15459b02403O1662p2683n1710R8604O4733R6328J384j27012n0097p9449J1506
15448b49137P4873N69K5292Q421l0491j798p4811j24740J29129j392K8733j3743
$$ plain form
15528 -212747 -113202 -150386 -127875 -66824 -53221 -142059 -152665 -134990 -170251 -159242 -87736
15517 -87736 -123604 -279354 -295157 -278383 -108283 -129266 -258034 -318612 -233490 -90531 -158980
15506 -158980 -152723 -96159 -56569 -88583 -112983 -182436 -237768 -228147 -220254 -83892 -6114 80959
15494 80959 15012 -69189 -96456 -128746 -48728 9284 -976 5933 2584 8120 43410 -38434
15482 -38434 -81332 -162914 -251718 -287466 -217574 -251281 -196565 -183173 -136842 -40141 64441
15471 64441 -4893 -51793 -69729 -137131 -154878 -197341 -154974 -133647 -140471 -175069 -182113 -202403
15459 -202403 -140741 -213424 -265134 -166530 -101797 -5469 -4085 -131097 -181194 -260643 -249137
15448 -249137 -174264 -173695 -148403 -139982 -170473 -172271 -247082 -371822 -242693 -244085 -215352 -229095
15436b29095j9588J6105J5309M424o4922o4709R7308R7916j05958o5525M520Q8522
15424b25693P2815l3601j2581m3482J4705N5817O8617l4439J32742k7632m7400
15413h0132j05692M9152O5695J425M9809q2424p715O6352j02732n7069j8225n8491
15401b80047k7559Q196R3621J06333M5954q72j3671L5073k0511n4433Q4590j5262
15389c8588q218o3964j3481m0485K3074P5804j22809q6358P7803K1284O9980R1615
15377a4343M4309J13882p435o0116L3326K3040j98825K0227K8126o5841k13250
15366b96900K9533R0438J27493M7177l6064j8208r36L0676O7961O5850j329j68859
15354f3168m8708L3283M7626N1171j5657q2116j26479r9372n3381J50652P611
$$ plain form
15436 -229095 -248683 -232578 -217269 -212845 -277767 -342476 -245168 -147252 -253210 -318735 -314215 -225693
15424 -225693 -152878 -186479 -199060 -242542 -227837 -172020 -103403 -137842 -5100 -32732 -80132
15413 -80132 -185824 -136672 -70977 -69552 -19743 -102167 -109882 -43530 -146262 -203331 -221556 -280047
15401 -280047 -307606 -299410 -205789 -99456 -53502 -54374 -68045 -32972 -53483 -107916 -23326 -38588
15389 -38588 -46806 -110770 -124251 -164736 -141662 -65858 -188667 -275025 -197222 -175938 -105958 -14343
15377 -14343 29966 143848 136413 76297 109623 132663 -66162 -45935 -17809 -83650 -296900
15366 -296900 -267367 -176929 -49436 -2259 -38323 -56531 -57467 -26791 41170 107020 105691 -63168
15354 -63168 -111876 -78593 -30967 20204 4547 -77569 -204048 -303420 -356801 -206149 -198538
15343a98538q143J34648K323l9729n1710k1269k5767k0284L9964O671m9062J4052
15331b16844L5662P5649p5250l4396J62439J27231J6855j59811j03133J3937K6711
15320a30950J1555k9628j4432R1024m2568K0499o5032P0730k83L4901K5039l6469
15308f5614J48626L0271k3754k076q7785L3106P8811j1463q6858p8430l0463Q4259
15296a1370Q731p4964n7996N883O7477J8936J34852m6407k9241o4010o9191J16127
15284a173N7256k6793k2778J34552r8272o7724j7761k5152P6520O3664p5363q7408
15272i0432j3624k4468m1788J50828k5524j15915J0890L3909o956M8575j11760
15261a86265r5453l3265N2462O6630J84474r233p6531r9078J22486O3677o0401
$$ plain form
15343 -198538 -206681 -72033 -69710 -109439 -161149 -182418 -208185 -228469 -188505 -181834 -230896 -216844
15331 -216844 -181182 -105533 -180783 -215179 -52740 74491 91346 -68465 -171598 -157661 -130950
15320 -130950 -119395 -149023 -163455 -72431 -114999 -94500 -159532 -88802 -89085 -54184 -29145 -65614
15308 -65614 83012 113283 89529 87453 -332 32774 111585 100122 13264 -65166 -95629 -11370
15296 -11370 -2639 -77603 -135599 -129716 -62239 -43303 91549 45142 15901 -48109 -117300 -1173
15284 -1173 56083 29290 6512 141064 42792 -24932 -42693 -67845 8675 72339 -3024 -90432
15272 -90432 -104056 -128524 -170312 -19484 -45008 -160923 -150033 -116124 -123080 -74505 -186265
15261 -186265 -281718 -314983 -262521 -195891 -11417 -20650 -97181 -196259 -73773 -10096 -70497
15250g0497j15634J41301R3632P6959O033o725p0104m4652O7266l0039l2396N2138
15238F7282O4330m3829q0093m4297M5964L8237L838p8371j57018n9050J36015
15227a06992J10852M3986N7992n4296r5260R1218N7556l6603l8412k9376k9803
15216b9138r237m7981o3725m1163J43317L4950K8550R3458l4648j44810J24053
15205E3626N1695j68335o4765p0947l7138J7748J34326M989j0429j0682L1413
15194f8499q922K6875J13788n6433p9734j01702j25628j03528P3647M5199J29353
15183a55584N8688O1553Q298L185O3320j3219N4790K1416k1523j24247n1142K2343
15171g2122R6683L3562j05310j46828J1862n24J23381k3628k034O2868r4863j36372
$$ plain form
15250 -70497 -186131 -44830 48802 125761 131794 125069 54965 10313 77579 47540 15144 67282
15238 67282 131612 87783 7690 -36607 9357 47594 51432 -26939 -183957 -243007 -106992
15227 -106992 3860 47846 105838 51542 -43718 47500 105056 68453 30041 665 -29138
15216 -29138 -38375 -86356 -150081 -191244 -47927 -12977 15573 109031 74383 -70427 53626
15205 53626 105321 -63014 -127779 -198726 -235864 -218116 -83790 -78801 -89230 -99912 -68499
15194 -68499 -77421 -50546 63242 6809 -72925 -174627 -300255 -403783 -330136 -284937 -155584
15183 -155584 -96896 -35343 -27045 -23860 39460 26241 81031 102447 80924 -43323 -94465 -72122
15171 -72122 24561 58123 -47187 -194015 -182153 -182677 -59296 -82924 -84958 -22090 -116953 -253325
15159b53325J9833o8526j7786J50272J37952N233N8508j949L8349J15642j2129
15148A72074p7364M0346M8300J266j22518j39007r318N6040r861O7322o2528j4978
15136e0226M655r1346q4304Q3272j3496o1407O0018L4045L782P9953J47885N6287
15124A69118j42853M6019J24756j15521k1615k3617j17901r3619r6151o098n7276
15113c34758J43529J33958P6787K4517r57r6258J0992N0881L1039P160j27157
15102h0267o4075k2370O1206M1410j5339P1469m4964j4444j0189j42348O0732
15091a59179J70451J3549j07295o0460L0377O2224K0346m8687r5441p0237Q7715
15080a56637Q5984k3171l1387Q3291P4407K739p2637l8474J1944J09471m4537
$$ plain form
15159 -253325 -233492 -302018 -319804 -169532 -31580 -26347 32161 30212 68561 184203 172074
15148 172074 94710 135056 183356 184622 62104 -76903 -86221 -30181 -40042 27280 -35248 -50226
15136 -50226 -45571 -136917 -221221 -137949 -151445 -212852 -152834 -118789 -115007 -35054 112831 169118
15124 169118 26265 72284 197040 81519 59904 36287 -81614 -175233 -271384 -277482 -334758
15113 -334758 -191229 -57271 19516 44033 43076 -53182 -42190 8691 39730 46890 -80267
15102 -80267 -144342 -166712 -105506 -64096 -79435 -7966 -52930 -67374 -77563 -219911 -159179
15091 -159179 11272 24821 -82474 -142934 -112557 -50333 -29987 -78674 -174115 -244352 -156637
15080 -156637 -70653 -93824 -125211 -41920 32487 35226 -37411 -75885 -63941 45530 993
15069I93o4689q084m3382J7668O109O0194N5704l4538K1321j16179l9548P241
15057a37190K2049J6686o1176J01029k5720j13358k6869K1069N4247O9125O8196
15046a1912m0851j69598N6567O7852N5615Q8236M2685M9988n0604r6923j725p0105
15034h0775k8525O9633r6261k4880j7347m0114n8341J72166R1627o7387K7642
15023e2562J32246o9354r8084K0628L4560M6957K17985J58512n719p3042J72856
15012D84983K96324L61870L26420M1309k9118J47457p8475k14645k15449k57605
15002H63071k05981j79971J678O2219M7240o6547j95480j71918j03558j4736J24504
14991A60521P7182q4207k06430j02428M4400J34732J26833r2146K013J5804N3820
$$ plain form
15069 993 -63696 -71780 -115162 -97494 -91385 -31191 24513 -10025 11296 -104883 -144431 -137190
15057 -137190 -115141 -98455 -159631 -58602 -84322 -197680 -224549 -203480 -149233 -80108 -11912
15046 -11912 -52763 -222361 -165794 -97942 -42327 45909 88594 138582 87978 -8945 -10670 -80775
15034 -80775 -109300 -39667 -135928 -160808 -178155 -218269 -276610 -104444 -12817 -80204 -52562
15023 -52562 79684 10330 -87754 -67126 -32566 14391 232376 390888 385169 312127 484983
15012 484983 781307 1143177 1469597 1510906 1481788 1629245 1550770 1336125 1120676 863071
15002 863071 657090 477119 478797 541016 588256 521709 326229 154311 50753 36017 160521
14991 160521 237703 153496 -52934 -155362 -110962 23770 150603 58457 60470 76274 130094
14980A30094l3694j30204k21N0128J09332M681n0491n2526r3164M0003L7509J32222
14968A43669N2599n9260l5070j43058Q7657M8996l5411q350l5263o9875J2438
14957d0928J4335N7067J21631j08511j10755J6764l6321r251j5548k2748K6210
14946a08055J34316n6736o6400J51258J70376j42333p5231N0787Q3557o7658j95635
14935a21754j10235J41655O0717q6532O3690J58798o5685n120m7121l0333m3816
14924h5736j05390P5707J29635r5077j05799p0142m1356P9822J02799q037j16095
14913b39669o0614N1607P7945O2877O0557l1332n418L9418J856N723p8101p067
14901a22218o3678P1205O2093Q6224L5215j24760j08190O6428P4173p884J3515
$$ plain form
14980 130094 96400 -33804 -34025 16103 125435 130116 79625 27099 -66065 -26062 11447 143669
14968 143669 196268 137008 101938 -41120 46537 95533 60122 51772 16509 -53366 -40928
14957 -40928 -26593 30474 152105 43594 -67161 -50397 -86718 -95969 -111517 -134265 -108055
14946 -108055 26261 -30475 -96875 54383 224759 82426 7195 57982 141539 73881 -121754
14935 -121754 -231989 -90334 -29617 -116149 -52459 106339 40654 35534 -11587 -41920 -85736
14924 -85736 -191126 -115419 14216 -80861 -186660 -256802 -298158 -218336 -115537 -123574 -239669
14913 -239669 -300283 -248676 -170731 -107854 -47297 -78629 -84047 -44629 -42773 -37050 -115151 -122218
14901 -122218 -185896 -114691 -52598 33626 68841 -55919 -164109 -97681 -23508 -31392 -17877
14890a7877p2207l5844k3858R4932K9594J02097K0979m2491j96678j08794O601
14879b43546P0510J71880J42351n2074j50515L8407P2122P1026l0061M0317j5650
14868A14767j6424L5970l2995j59788J4408J34604M0164R65j20800j86062m9606
14857b24797K0962Q4211M8686p6939l3955p1820J3560P6455q166L8593O116J06458
14845b0636M6108M5120n4037m4822L1760j1809j22100l7684j59196K3640Q5845
14834b17811K1323K9925k2509J16942Q3583p8751o4993k3213K6221L5756n4249
14823a47776j43084J09989M1649j01071M200P672M8822Q1135Q8875M4441k6384
14812H468j29439K7935J84588J3253p0366k263k8529L636j5083m7996J557k2n8957
$$ plain form
14890 -17877 -90084 -125928 -149786 -54854 -25260 76837 97816 55325 -141353 -250147 -243546
14879 -243546 -173036 -1156 141195 89121 -61394 -22987 49135 120161 90100 130417 114767
14868 114767 98343 134313 101318 -58470 -44062 90542 130706 131671 10871 -175191 -224797
14857 -224797 -203835 -119624 -70938 -147877 -181832 -253652 -240092 -163637 -171803 -133210 -127094 -20636
14845 -20636 25472 70592 16555 -28267 3493 -8316 -130416 -168100 -327296 -303656 -217811
14834 -217811 -196488 -166563 -189072 -72130 11453 -67298 -132291 -155504 -129283 -93527 -147776
14823 -147776 -290860 -180871 -139222 -240293 -236093 -228421 -179599 -98464 -9589 34852 8468
14812 8468 -120971 -93036 91552 104805 34439 32176 3647 7283 -7800 -55796 -54239 -54261 -113218
14799a13218M6201r071R5935N5067p390M0097k0623k2129p6133l3651P6244M3060
14787G4389l7196o7434l3268j6831L3406Q1150m5118l7787q731m0151m1377l411
14775a42359K7154m3572m6600j7152P9903P5267J17748m1251m9514n2026o6063
14764a58465k1946K7198M1295r6078q8873R0866M6367J27677J25995J05338l8621
14753A60753k5089o7856l3003o4649M6408J06621j23432l1376L3190M0373K1535
14742F3475k07051o307K18091J9817n1654q9474m2286k9181R3785L3549l0890
14731b8126k807j6476m6070J5721K5522M3961p7449j05407j31498P055k202R1184
14719b26592R3540N0701L4808R3656k4117o7360L3504R5082j3390M9163L884j88682
$$ plain form
14799 -113218 -67017 -76088 19847 74914 67524 107621 86998 64869 -11264 -44915 31329 74389
14787 74389 37193 -30241 -63509 -80340 -46934 34216 -10902 -48689 -57420 -97571 -138948 -142359
14775 -142359 -115205 -158777 -205377 -222529 -142626 -67359 50389 9138 -40376 -92402 -158465
14764 -158465 -180411 -153213 -111918 -207996 -296869 -206003 -159636 -31959 94036 199374 160753
14753 160753 135664 67808 34805 -29844 16564 123185 -247 -31623 1567 41940 63475
14742 63475 -143576 -149883 68208 88025 36371 -53103 -95389 -124570 -30785 2764 -28126
14731 -28126 -30933 -47409 -93479 -77758 -52236 -8275 -85724 -191131 -322629 -315574 -317776 -226592
14719 -226592 -133052 -82351 -47543 46113 21996 -45364 -11860 83222 69832 118995 122879 -65803
14707f5803j29056Q5000J96853n64J8016J09637L0551n710q2323M0896n9650j03555
14695C4292o4638m1490m3666N7986N6277K8115j21988m4510N1766L8937k0682
14684f9601p3536l2110P4261L1190j23251o4981L6250l2519L4153m0704j4318
14673b75166J58049J30536o6339n8314k0524J7857K0578k83j09741j12444J46931
14662a68860J62445M9615n6393q6967k1721j3594M7416O3400M1902k4168m3592
14651e0517k4567j15299Q1037N3255q0237J2157P4448q608K6192K4494k8677J75102
14639A38780P1359j51522n5582n2828r5946M0774J3516k8423K7768R2387J11234
14628A11517J2197N5521J08193q5806j08920r0394M416m6977j1064N8460J0008
$$ plain form
14707 -65803 -194859 -109859 86994 86430 104446 214083 244634 238924 156601 197497 137847 34292
14695 34292 -30346 -71836 -115502 -57516 -1239 26876 -95112 -139622 -87856 -48919 -69601
14684 -69601 -143137 -175247 -100986 -69796 -193047 -258028 -221778 -254297 -220144 -260848 -275166
14673 -275166 -117117 13419 -52920 -111234 -131758 -113901 -93323 -93606 -203347 -315791 -168860
14662 -168860 -6415 43200 -13193 -100160 -121881 -135475 -88059 -24659 17243 -6925 -50517
14651 -50517 -75084 -190383 -109346 -56091 -136328 -124171 -49723 -58331 -32139 -7645 -36322 138780
14639 138780 210139 58617 3035 -49793 -145739 -104965 -91449 -119872 -92104 283 111517
14628 111517 123714 179235 287428 201622 92702 2308 6724 -40253 -51317 7143 17151
14617A7151l83K0027p0299Q9686J2494k9133n6774K0447J5589j01178p2121l3676
14605a88170Q374J1441l5097o553N5001R8031J30363j795j932j895r4533l766
14593c0531J2568N3580P5017n6086j54656M6864Q864O9697R7142K8450J2386K1154
14581A84449o1191m3557P6031j02927n4552M1395j4745L7741P5699R8117J03745
14570C40205q3841k13526j15209q571N5684R5571J7434k0919r1206m3176j56458
14559b24012P2086J74776M8743q6545q4122J38353J05347Q972N6499K0815m8990
14548A81922l9208n1490o6625r644J44268K2783n5725n526l7648q3538L405j5486
14536a2512K7904J26014j09738j31670L3160M1566n5175k2012M1519n920J4798
$$ plain form
14617 17151 16768 36795 -33504 56182 68676 39543 -17231 3216 18805 -82373 -154494 -188170
14605 -188170 -179796 -168355 -203452 -210005 -155004 -56973 73390 71595 69663 67768 -26765 -30531
14593 -30531 -17963 35617 110634 54548 -100108 -53244 -44380 25317 122459 150909 163295 184449
14581 184449 123258 79701 155732 52805 -1747 39648 24903 62644 138343 236460 340205
14570 340205 256364 42838 -72371 -80942 -25258 70313 87747 66828 -24378 -67554 -224012
14559 -224012 -151926 22850 71593 -14952 -99074 39279 144626 153598 210097 230912 181922
14548 181922 142714 91224 24599 14955 159223 182006 126281 120755 83107 -431 2974 -12512
14536 -12512 15392 141406 31668 -100002 -66842 -25276 -80451 -102463 -60944 -66864 -52066
14525e2066l2513r2703m4861J01166J19292N8441q4971K1015J19046l7678j5852
14514E8316J0835O7804j0403k2457r2271K0416J4015N4071L5220J00867l2271
14503B04142k01801J1660J37748N2556p1683J06899j2136p5281M5956l0884j18421
14492D8755j4200J48200k2304j85640j33328K8756P7283L6496O9438l4481j49878
14481a30903j8361j2118R3992L4724J21226N5777L028l8022j296n3927n0150k6046
14469b2076r590j8394Q7334n5074L0822O8307n6545J368q3664Q7371O9240o7239
14457C1860q0803j21782J00565J03435M6633L9769n0985q2763Q5787m6809m4287
14446a9380O331M2986L0834q4589M0068L8379n0498J2304r5108P9018J27332j05175
$$ plain form
14525 -52066 -84579 -177282 -222143 -120977 -1685 56756 -28215 -7200 111846 74168 58316
14514 58316 69151 136955 126552 104095 11824 32240 46255 100326 135546 236413 204142
14503 204142 2341 14001 151749 204305 132622 239521 227385 152104 198060 167176 48755
14492 48755 34555 182755 160451 -25189 -158517 -129761 -52478 -15982 53456 18975 -130903
14481 -130903 -149264 -161382 -67390 -32666 88560 144337 147365 109343 108047 54120 3970 -22076
14469 -22076 -31666 -50060 37274 -17800 13022 81329 24784 26152 -57512 29859 99099 31860
14457 31860 -48943 -170725 -70160 33275 79908 119677 68692 -14071 71716 24907 -19380
14446 -19380 -13049 29937 60771 -23818 16250 54629 4131 16435 -78673 345 127677 22502
14434B2502o8343n3194K4999J12495q374L4473R3412K6755J3825j38792j44797
14423h5039O4631J214J9473q841R392l2753r7899N2701J07656M0897k9564o4994
14411b3126m1772L2445O1508N2080q87N833k3416j28887j98397j7114J16835J84425
14399A9527M9827j325O4539N019l7974l3966M5066J7992L431j51227j9263m8237
14387h6591J3676M3666J05196P2575J4624J8224J22214P6006q2937o4253p837
14376B24563J58325J36700p7527o171J03157L9363J28360L36842L74790L13108
14366A731510K77978L53655K82130k0314k43180k12236j64298n12001k17684q5416
14356A190144k14819j07368j00050j64684j10472m7154q6554p5886L7618O1665
$$ plain form
14434 22502 -45841 -99035 -74036 38459 30085 64558 157970 184725 198550 59758 -85039
14423 -85039 -20408 -19194 279 -8562 830 -31923 -129822 -77121 30535 71432 41868 -23126
14411 -23126 -64898 -32453 29055 81135 80248 86081 62665 -66222 -264619 -281733 -164898 19527
14399 19527 69354 68029 132568 137587 99613 65647 110713 128705 132136 -19091 -38354 -86591
14387 -86591 -72915 -29249 75947 148522 163146 181370 303584 379590 296653 232400 224563
14376 224563 382888 519588 442061 435890 539047 578410 706770 1043612 1418402 1731510
14366 1731510 2009488 2363143 2645273 2624959 2381779 2169543 2005245 1493244 1275560 1190144
14356 1190144 975325 867957 767907 603223 492751 445597 359043 283157 320775 382440
14346C82440r1441n6812Q1855j4028m1721J14570k13j12282k5985k5805K9560
14335B40138q9200p6468r75O8131k9962j03921k714M512L904K1055J28799J6050
14323A79349p5003M734k7365L2083K6938l5786k1248M4403l645O9618o2408m0331
14311I1339R9055K5096j7938o0669L1020l9440l5715k2211J9120K5518L932L3819
14299A52926k3656p1358Q60l216j41396L2987R7807J91088l6621m0986j3087p9680
14287F5668R533j1481K161n1436R1330J21011O7198k79196m2120L6766N910q3916
14275f8572R4848J9227N3301K3363n8913J00166p5409M6470Q1162J51640k769
14264C64514Q0644J8879r9004N2303J1153O2375k5202L397j16177j12521Q9086
$$ plain form
14346 382440 290999 234187 316042 302014 260293 374863 374650 262368 236383 210578 240138
14335 240138 150938 74470 73495 141626 111664 7743 5029 9541 13445 34500 163299 179349
14323 179349 104346 109080 81715 113798 140736 104950 83702 128105 124460 194078 131670 91339
14311 91339 190394 215490 197552 136883 167903 128463 92748 70537 89657 115175 119107 152926
14299 152926 129270 57912 58772 55556 -85840 -52853 44954 236042 199421 158435 145348 65668
14287 65668 75201 63720 65881 14445 105775 226786 293984 14788 -27332 9434 15344 -68572
14275 -68572 26276 45503 98804 122167 63254 163420 88011 134481 215643 367283 364514
14264 364514 445158 464037 365033 417336 428489 490864 465662 469059 352882 240361 329447
14253C29447l8430p1918m7169P037r1429k1439J1654O1886R5108j9820Q0963P0587
14241C66477l1855k0998J05446n2522k9246n428m7666j1024m1942l7802j12789
14230H0651n9570j20358q7942p553N1925M2786J32252P8729J7315l3981J13709
14219B07963L8940R9044j07307j32479k7006J17436k3291O3929Q8606j1090q8336
14208B26409j83581j50637Q0537J72512J10359M0405p7854j49638j35851R7223
14198B9884K0319K5844l2655J4249M7406l0328l879l8561P2578M5484j22640O2600
14186I0301O3332k3693M0074N1387J85884J08595J9085l1475k9407k1984o3024
14175C89075r0468K1615J44624M4746j40066o5883J0495j01961J7734L1967m709
$$ plain form
14253 329447 291017 219099 171930 178967 87538 66099 77753 139639 234747 214927 295890 366477
14241 366477 334622 313624 419070 366548 337302 331874 284208 273184 231242 193440 80651
14230 80651 21081 -99277 -187219 -194772 -142847 -100061 32191 110920 128235 94254 207963
14219 207963 246903 345947 238640 106161 79155 196591 173300 237229 325835 314745 226409
14208 226409 42828 -107809 -27272 145240 255599 296004 218150 68512 -67339 29884
14198 29884 50203 76047 43392 57641 105047 74719 70840 32279 104857 150341 27701 90301
14186 90301 153633 129940 170014 221401 407285 515880 534965 503490 474083 452099 389075
14175 389075 298607 320222 464846 509592 369526 303643 314138 212177 229911 261878 257169
14164B57169o2540M5162J05886j2566O4050j22483m6545L2710l6369M6042N7148
14153C27664j211o6007p8669o8038L094l449R3968K3859N95q8179j11548j7795
14141A4284J77171J2177j1024j50349N6889J26705N4523L2915k4196n8715o5536
14130A64844n3360K8017P8547K4360R4709L3512m2708p2403j05972r0439J30778
14119A89885O0700m4495P6786K6516N2852P6066Q8992k00918j62303k818J58235
14108C19498q4681o3864J05677P947j64126l2974j4291j29021l6245J46687J21506
14097A76113K8294r1233o7113K8406k914J30023P3084j26138l7382j41218k3337
14086e3415J03668J04684n7208L9790N2523n679Q2821O7250l84K5965R3408k039
$$ plain form
14164 257169 194629 239791 345677 333111 397161 274678 228133 260843 224474 270516 327664
14153 327664 326453 260446 181777 113739 116833 113384 207352 231211 231806 143627 32079 14284
14141 14284 191455 203632 192608 42259 99148 225853 280376 313291 289095 230380 164844
14130 164844 111484 139501 218048 242408 337117 370629 327921 255518 149546 59107 189885
14119 189885 250585 206090 282876 309392 362244 438310 527302 326384 164081 161263 319498
14108 319498 234817 170953 276630 284577 120451 87477 73186 -55835 -92080 54607 176113
14097 176113 204407 113174 46061 74467 71553 201576 274660 148522 111140 -30078 -53415
14086 -53415 50253 154937 97729 137519 190042 184363 267184 334434 334050 360015 453423 451384
14074D51384j6550N6449N241k949m9531o6008k3311j0087N4999J57467J9324J7797
14062E94225n4864j84532r7685R9782R8512J58485M8882m6910m7922M4632l114
14051F09491K7943j6211q0007J34138J10555l2315o8791o6293r8928Q8230Q6822
14040F94634p1605j5652P5115J5878l5479P8975P9855P9883l7601l9709j657k0657
14028H01980k7215J10428M0699Q9667l4858n9445O006o8017l0450J02687r6887
14017H34595l2956o5727q870M5770M8268O7977l244m7634P3590n3544P177q5579
14005G79823k1241J48072J8026K1392K5482L1886O5988O7999O5770M6569m8753
13994A201013N2622R8297o0447J058N4994K3243O6749j5374N5271Q5271L4608
$$ plain form
14074 451384 434834 491283 496524 493575 444044 378036 354725 344638 399637 557104 576428 594225
14062 594225 539361 354829 257144 356926 455438 613923 662805 615895 567973 612605 609491
14051 609491 637434 621223 541216 675354 785909 753594 684803 618510 519582 607812 694634
14040 694634 623029 607377 682492 698370 662891 741866 821721 901604 864003 824294 822637 801980
14028 801980 774765 885193 925892 1015559 980701 921256 927262 859245 828795 931482 834595
14017 834595 801639 735912 727042 772812 821080 889057 885813 838179 911769 858225 865402 779823
14005 779823 758582 906654 924680 946072 971554 1003440 1069428 1137427 1203197 1249766 1201013
13994 1201013 1253635 1351932 1291485 1292543 1347537 1370780 1437529 1422155 1477426 1562697 1597305
13983A597305J58442R451q0388l7754J2940J45475M0097N4209J00822J78377J63436
13972B342412J68743L1208L8318J34181k5347J27830P8045J29596K86780K37631
13962C549397J88016J29290J56647J55780J92020J85447L68577L68491L12447
13953E606112L84216L22602M69928M78648M42311N70911O22281Q16636J055676
13944A0769321J077841J185385J526827J843257K018209K271448K573792K925069
13936B6191149L211506L483373M009842M804543N857236P289261R487768J2999634
13928G7334312J7321079K3458175L2067666M3613142N7168001O8302636P0292745
13921C89557756N9506370L7356747P197617k6575653n4990192p0227928p0209419
$$ plain form
13983 1597305 1755747 1765198 1684810 1647056 1659996 1805471 1845568 1899777 2000599 2178976 2342412
13972 2342412 2511155 2542363 2580681 2714862 2689515 2817345 2895390 3024986 3311766 3549397
13962 3549397 3737413 3866703 4023350 4179130 4371150 4556597 4925174 5293665 5606112
13953 5606112 5990328 6312930 6782858 7261506 7703817 8274728 8897009 9713645 10769321
13944 10769321 11847162 13032547 14559374 16402631 18420840 20692288 23266080 26191149
13936 26191149 29402655 32886028 36895870 41700413 47557649 54846910 64334678 77334312
13928 77334312 94655391 118113566 150181232 193794374 250962375 319265011 389557756
13921 389557756 449064126 486420873 493618490 467042837 412052645 341824717 271615298
13914B71615298n8708627m3178675l0298482k1262313j5301082j1339059q568350
13907H2958710o675327n193919l973700k994311k669582k667362k772067k747066
13899E3265376k778406k756179k751540k151953j757927j817013j843536j719885
13891C5688937j637314j577705j486169j372593j335440j324298j186531j112830
13883B4656057r96832q63400r57132q84972q25589o26905o15496p55467p62077
13874A7368187n89268n40676o39526o14134n29092n00675m60557m34880m46158
13865A2613221n50672m96183k59837l13306k35234l12664l92724k82425l70262
13856I399914k99687l45357l26890j73219m6354k65084l85284l04892k00314k15204
$$ plain form
13914 271615298 212906671 169727996 139429514 118167201 102866119 91527060 82958710
13907 82958710 76283383 71089464 67115764 64121453 61451871 58784509 56012442 53265376
13899 53265376 50486970 47730791 44979251 42827298 41069371 39252358 37408822 35688937
13891 35688937 34051623 32473918 30987749 29615156 28279716 26955418 25768887 24656057
13883 24656057 23659225 22795825 21838693 20953721 20128132 19501227 18885731 18130264 17368187
13874 17368187 16778919 16238243 15598717 14984583 14455491 13954816 13494259 13059379 12613221
13865 12613221 12062549 11566366 11306529 10993223 10757989 10445325 10052601 9770176 9399914
13856 9399914 9100227 8754870 8427980 8254761 8208407 7943323 7558039 7253147 7052833 6837629
13846F837629k10949j02061j26606j88594j79341j61714k6533p453n8440j68004
13836E607934j70538j50574r5491j88108k93440j27373O0945q8187n8150o3943
13826D433075p7885j14188p0201K6485O0809j25248j16713j88720q9500j95940
13816C541974j58168k919p2860j42876j01536j04963j78899r8191N7142j89345
13806B549359p0437r9635j4652j2325O8410Q8257l5966j37694j14259K5971k0551
13795B226478q0775j71006j48170p8761o3550m743q3438j37000p2549j16695j55453
13784A114338r9160Q876j14097J5060j01413n7705l1255j73714r1341K2552L0767
13773E22908J00203L1975l8908m9375r3008K8223O6654J42324J30471l6015j45719
$$ plain form
13846 6837629 6626680 6524619 6398013 6209419 6030078 5868364 5841831 5834378 5775938 5607934
13836 5607934 5437396 5286822 5191331 5003223 4709783 4582410 4643355 4555168 4497018 4433075
13826 4433075 4355190 4241002 4170801 4197286 4258095 4132847 4016134 3827414 3737914 3541974
13816 3541974 3383806 3380887 3308027 3165151 3063615 2958652 2779753 2681562 2738704 2549359
13806 2549359 2478922 2379287 2364635 2352310 2420720 2508977 2473011 2335317 2221058 2247029 2226478
13795 2226478 2145703 1974697 1826527 1747766 1684216 1679473 1596035 1459035 1386486 1269791 1114338
13784 1114338 1015178 1024054 909957 925017 823604 765899 734644 560930 469589 492141 522908
13773 522908 623111 655086 616178 566803 473795 502018 568672 710996 841467 805452 659733
13762F59733o3705M1572p0146j54011l3189N3462J24248J034l7623N4759l5351
13751E40783K3107K8592K2660o9639o5323N0873k1540N3127k04526r0312M6939
13740C14741P4260J72884j0221L0315l4392j32490q8406j8774J46991Q6495j30362
13729D11041j59679r0662L9641L8748r813K3250L3812L7507J18551l1344k2116
13718C88936j19464n7561Q994Q8294J1397m8473N2329N0208J28262o4217m8784
13707C89921q9978j4849K8027J11609L8224m4398l404P8590m6866k9472o2339
13696C55065k758J7957K1609j91654j14825m306K4513J29621N3934J5293j2219
13685B92230p2376n2024L8684Q9464J6743o1840j09930N9264M3041n5591J00020
$$ plain form
13762 659733 596028 637600 567454 413443 380254 433716 557964 558998 521375 576134 540783
13751 540783 563890 592482 615142 545503 480180 531053 509513 562640 358114 267802 314741
13740 314741 389001 561885 551664 581979 547587 415097 326691 307917 454908 541403 411041
13729 411041 251362 160700 200341 239089 229276 252526 286338 323845 442396 411052 388936
13718 388936 269472 211911 220905 309199 320596 272123 324452 374660 502922 438705 389921
13707 389921 299943 285094 313121 424730 462954 418556 415152 493742 446876 417404 355065
13696 355065 352307 370264 391873 200219 85394 81088 105601 235222 289156 304449 292230
13685 292230 219854 167830 206514 295978 312721 250881 140951 200215 243256 187665 287685
13674B87685O5231p6884j01228j88444O1125M7619J04316j726l1272k5607j4415
13663A26400m4267k1072J16222O5751l7539N5152j23982J6090m362K2123p649
13652A62867L6002O5774J5576J0626n9286p9387l6740j88922R1472L7333j7606
13641C7709R16k6173K1886P5927L3336N5206k3407q4797M4264l9056p6861j50343
13629a31393j389L0172Q5156M4838q838R1616m7219k0842J29519P9919n2577o1301
13617A37661j20785m2793M4657N2580J4377P1047O5860O8022j14127r8284m2638
13606C5577k4611J8172J16196j06928J2208Q9507l5654o0964N8548M2549m5220
13595I9380j12802p0340j1955k3189r360R166j1051l9976R0240P6358J6572J0468
$$ plain form
13674 287685 352916 276032 174804 -13640 47485 95104 199420 197694 166422 140815 126400
13663 126400 82133 61061 177283 243034 205495 260647 136665 152755 148393 170516 162867
13652 162867 198869 264643 280219 290845 231559 152172 115432 -73490 17982 55315 37709
13641 37709 38625 12452 34338 110265 143601 198807 175400 90603 134867 95811 18950 -131393
13629 -131393 -132782 -102610 -17454 27384 18546 110162 62943 42101 171620 251539 198962 137661
13617 137661 16876 -25917 18740 71320 85697 156744 222604 290626 176499 78215 35577
13606 35577 10966 29138 145334 38406 50614 140121 104467 43503 102051 144600 99380
13595 99380 -13422 -83762 -95717 -118906 -128266 -119100 -130151 -170127 -79887 -3529 13043 23511
13583B3511m9615m1036p2573n3049L1640k4258q723R6J3203O2773N211n6749P095
13570a62474O3869R5359l4009o2253K8579m6480L4893N4626L0164M482k7163n413
13558b5820m9238p7611J05730J03219p5460j11955P0821O4763N5915O706q8785
13547b1715J5807k4165j23787L2308K25718k5343p4331q1393p2625M2716O6483
13536d0327o6043K8413L9755r492R4479l2504m9288Q9862M4188p4769j41507R782
13524a07451P7876k453R3003j5o1855m4517J04241J40359m1747k899p4811m0785
13512C8946j26587K8486l1729r1387J08331J87408q213r8915M4329J1689p4102
13501a1744n8762n2567J23671J1204j9855J8430N8878J70299j9617r2175q9913
$$ plain form
13583 23511 -26104 -67140 -139713 -192762 -161122 -185380 -194103 -194007 -180804 -118031 -112820 -169569 -162474
13570 -162474 -98605 -3246 -37255 -99508 -70929 -117409 -82516 -27890 2274 6756 -20407 -25820
13558 -25820 -75058 -152669 -46939 56280 -19180 -131135 -60314 4449 60364 67070 -21715
13547 -21715 -5908 -30073 -153860 -121552 104166 78823 4492 -76901 -149526 -106810 -40327
13536 -40327 -106370 -77957 -38202 -47694 46785 14281 -35007 54855 99043 24274 -117233 -107451
13524 -107451 -29575 -32028 60975 60960 -895 -45412 58829 199188 157441 154542 79731 38946
13512 38946 -87641 -59155 -90884 -182271 -73940 113468 105255 6340 50669 62358 -11744
13501 -11744 -70506 -123073 598 11802 -8053 10377 69255 239554 219937 127762 37849
13490C7849j7296J7777J7511l3897j8055r4225K5954J46231Q1697l8980N0062
13479A74628J59574J77685J46141J15119J43100J54429L69248M32203L41501J32762
13469B346390J18860K6578j53173k89981l58472l09563l07199j79352j79267n3626
13459F61195k0436k07579j33350P208j10092P2370k4592j15391l7708N4834k4855
13448A21604K7793Q3939j35641m1694J9496J8462N3961J20855N8884r2813j44762
13437I0084r3124P0415N3485m4472L2672l1327M215J1639R6710O3962M4107j02594
13425A95772J5201m1092j60701p5794N9663J02570O6582J0172q482O2153o0576
13414A65468J2630K2412R9928j9236n3058p5344l9602O8973j8383j50307p1011
$$ plain form
13490 37849 20553 38330 55841 21944 3889 -90336 -64382 81849 163546 124566 174628
13479 174628 334202 511887 658028 773147 916247 1070676 1439924 1872127 2213628 2346390
13469 2346390 2465250 2491828 2338655 2048674 1690202 1380639 1073440 894088 714821 661195
13459 661195 640759 433180 299830 307038 196946 269316 244724 129333 91625 146459 121604
13448 121604 149397 233336 97695 56001 75497 93959 147920 268775 327659 234846 90084
13437 90084 -3040 67375 120860 76388 109060 77733 81948 93587 190297 254259 298366 195772
13425 195772 210973 169881 9180 -66614 -6951 95619 162201 172373 163891 226044 165468
13414 165468 178098 200510 300438 281202 228144 152800 113198 182171 163788 13481 -57530
13403e7530P9723K6056q6644Q71j0798k6427p9905L1528M9417n762j4833n0240
13391a44544k6438l7482O1534N4926P5644J7282j11361Q5343M8904j40113p4039
13380a90344N4702N7404j9236N2829m5348J9991J71494J04057p6014j56557J7923
13369i099j2870m4444j2602N425P9215j10956o1976J11948Q2603J48819M1268
13358B17331j04642o6125k05911J15569N5680o663l0241j0051m4747J08131N4117
13347H2448K618j4868o9635P6092r9135o2869k1829O76p2335k2885R6737K01510
13335I6525L3556j38532k7521p8223p7876Q5491J07690j4816k8553L5638J464
13324e157J3868j2514p2376k3733p191J5917P6878O7979k3032k6856m0966p0498
$$ plain form
13403 -57530 22193 48249 -38395 -37524 -48322 -74749 -154654 -123126 -73709 -79471 -94304 -144544
13391 -144544 -170982 -208464 -146930 -92004 -16360 922 -110439 -25096 23808 -116305 -190344
13380 -190344 -135642 -78238 -97474 -44645 -89993 -70002 101492 205549 129535 -27022 -9099
13369 -9099 -21969 -66413 -79015 -73590 5625 -105331 -167307 -55359 27244 176063 217331
13358 217331 112689 46564 -159347 -43778 11902 5239 -25002 -35053 -79800 28331 82448
13347 82448 85066 70198 563 76655 -22480 -85349 -107178 -106502 -178837 -201722 -104985 96525
13335 96525 130081 -8451 -35972 -114195 -192071 -106580 1110 -13706 -42259 -6621 -5157
13324 -5157 8711 -3803 -76179 -99912 -107103 -91186 -14308 53671 30639 3783 -37183 -107681
13312a07681R009J55750L5167N1536n1743q4866K2498J75785M1291j5468J3423
13301B44701p2262j2017j09901l9770j6081j26277j2337N4942j10720m9328P2774
13290a76276R6396O1527M3351R8541O481P260O1211m2845j48647k0103l3724j14837
13278a61665n0820l4151l5575R9191J45451O1523l2935O6531j8721P7612L0591
13267A47032m7762J3276o6822k5544q1832k2006j4519q6772k5969M0240R7725
13256g2953J08633k1906q1941N2546K5288r3268r5847J9931O2399Q6350j8465
13245b9233L4545j9434p7008n940N3364r9508q389O1927J4680M5540m2645j50410
13233b22511J2801J69964J85858l5449J9536k3284j2270l5257O9302l5052N4307
$$ plain form
13312 -107681 -98672 57078 92245 143781 92038 7172 29670 205455 246746 231278 244701
13301 244701 172439 160422 50521 10751 -5330 -131607 -143944 -89002 -199722 -249050 -176276
13290 -176276 -79880 -18353 24998 123539 130020 137280 198491 155646 6999 -13104 -46828 -161665
13278 -161665 -212485 -246636 -282211 -183020 -37569 23954 -8981 57550 38829 116441 147032
13267 147032 99270 112546 45724 20180 -61652 -83658 -98177 -184949 -210918 -170678 -72953
13256 -72953 35680 13774 -68167 -15621 9667 -83601 -179448 -159517 -97118 -10768 -29233
13245 -29233 5312 -14122 -91130 -97070 -43706 -143214 -151603 -89676 -74996 -29456 -72101 -222511
13233 -222511 -209710 -39746 146112 110663 130199 106915 94645 59388 128690 93638 147945
13222A47945N7000j38926r0339k0377K1728m1557K3126q0554R584P0549M0892
13211i29N055R642L2382l0762j45541n6626N9241P9756O865q5034K2744K00730
13199I7523J72068r0516j01714P800j22740k4827P4833L3504q6604l6213j0292
13188h7178m5200R9891J30483l677m478J5023q6256m9379n1577l6872J00791L2475
13176A4046l2542n0002J28206R4406O4873p0436r9679o8438R0610K2415J05072
13165A98531q908n563j25952J4100L4183k8649n0957l0602N7577M1672l8038n0039
13153G355J63063j218m5256M411l4593Q8136J23631k1542r796r9639j60008M606
13141A9150K0128r3343J6936m0864K4998J3949K4130N5770l1944o0898l1334R5043
$$ plain form
13222 147945 204945 66019 -24320 -44697 -22969 -64526 -41400 -121954 -112370 -41821 -929
13211 -929 4126 13768 46150 15388 -130153 -186779 -127538 -47782 -40917 -125951 -103207 97523
13199 97523 269591 179075 77361 85161 -37579 -62406 12427 45931 -40673 -76886 -87178
13188 -87178 -132378 -32487 97996 94319 89841 104864 18608 -30771 -82348 -119220 -18429 14046
13176 14046 -18496 -68498 59708 154114 218987 148551 48872 -19566 71044 93459 198531
13165 198531 189623 184060 58108 72208 106391 77742 26785 -3817 53760 95432 57394 7355
13153 7355 170418 169200 123944 128355 93762 181898 305529 283987 274191 174552 14544 19150
13141 19150 39278 -54065 -37129 -77993 -52995 -39046 -14916 40854 8910 -51988 -83322 11721
13129A1721M3591q2817l5187L7129j5243m9007N3476R1729R0362J54601P966k7304
13117B81017j02182l2402P3202Q837p7111q2319m3717J37530L8495n4076K3055
13106A70329j46339r5077O1336R855l8516N8558O5888j42879j96025R7575J08572
13095d6723Q4564J79654Q1306n6806j38090K6267J14334m3377k544Q8247l1351
13084B55481j32680m3666Q7531N8627o9612j07769j3343K6925l5003R473q7429
13073e1465K4171J16345P8556l2802N6360o1875L617r3295j46868l4290J04277
13062c7269P4157O4190N7534l0140j9089N877J2488N0447L0802O7377p8640l0418
13050A67316l9064P1821j14521J654K8573o6828j9580J7718j3308J6025R0109
$$ plain form
13129 11721 55312 -27505 -62692 -25563 -40806 -89813 -36337 55392 145754 300355 308321 281017
13117 281017 178835 146433 219635 228472 151361 69042 25325 162855 201350 147274 170329
13106 170329 23990 -71087 -9751 104 -38412 20146 86034 -56845 -252870 -155295 -46723
13095 -46723 37841 217495 298801 241995 103905 130172 244506 201129 198585 286832 255481
13084 255481 122801 79135 166666 225293 155681 47912 34569 61494 26491 35964 -51465
13073 -51465 -27294 89051 167607 134805 191165 129290 132907 39612 -107256 -141546 -37269
13062 -37269 36888 101078 158612 128472 109383 115260 127748 178195 208997 276374 197734 167316
13050 167316 128252 200073 85552 87206 115779 48951 29371 47089 33781 49806 139915
13039A39915l6993j01395l6020J88495J10495K4841M2586k6306j42810l4380j708
13028A26720N6018J7941J04322P0397r9040p9768Q899n4910L0178K278r6768j0569
13016G5698R564k6436R7016R3050q992m9068K8641k6701r2377m0768k7317O394
13004C8704r1294O1616J55202J28584o7444j11184Q8905N9206l4926K4572M4658
12993B96599m7884O759q6905L7650K7644q3721N815J10854l5599o8123m6288O9976
12981A86777K8842m0066R7635J22534K568r0681L4550p3384j53582q1438j05912
12970g2157J19439P8211j1035k2943k4246l5930l0355N0035K7994N5408N8431
12959A92852l3919j74489m5197J28047N7317J5836j2480j5259O8174Q7099Q7714
$$ plain form
13039 139915 102922 1527 -34493 154002 264497 289338 331924 305618 162808 128428 126720
13028 126720 182738 200679 305001 375398 276358 196590 205489 150579 180757 183035 86267 75698
13016 75698 85262 58826 155842 248892 239900 190832 219473 192772 100395 59627 32310 38704
13004 38704 -52590 9026 164228 292812 225368 114184 203089 262295 227369 251941 296599
12993 296599 248715 255474 168569 206219 233863 150142 155957 266811 231212 163089 116801 186777
12981 186777 215619 175553 273188 395722 398290 307609 342159 268775 115193 33755 -72157
12970 -72157 47282 125493 114458 91515 67269 31339 984 51019 79013 134421 192852
12959 192852 158933 -15556 -60753 67294 124611 140447 127967 112708 180882 267981 355695
12948C55695o7761l96j37152q1109Q1333j722m5608O0770M6321r9027l0055m8841
12936C2448P018P5903O5012j2509L1930q848n078n37j3990M6605N1433J8314l3386
12923B54315n0504L0798J02125j03369M9807J16293J32849k6683j19266J08726
12913D95091J91303L8423j2699j9587P8130K8889J12671N5221o1312P339J23832
12902A037301K6437j49251K3732j11533j94130K6203J14103m8838m6313Q6349
12892G64060J06373M7704J1919l7241M0316J8373r9441Q7779M1647j5194l0282
12881I36013N1497J51126R6338O5930K9527N689J36162N7124r6578r4915q6564
12870A251349r6539l0943P8312J5888J8476K543L665l7161o0071j41650m8338
$$ plain form
12948 355695 287934 287538 150386 69277 150610 148888 103280 164050 210371 111344 81289 32448
12936 32448 39466 115369 180381 167872 199802 190954 185876 185339 171349 217954 269387 287701 254315
12923 254315 203811 234609 336734 233365 283172 399465 532314 505631 386365 495091
12913 495091 686394 724817 712118 692531 770661 799550 912221 967442 906130 913469 1037301
12902 1037301 1063738 914487 938219 826686 632556 658759 772862 724024 677711 764060
12892 764060 870433 918137 930056 892815 933131 951504 852063 939842 981489 966295 936013
12881 936013 987510 1138636 1234974 1300904 1330431 1336120 1472282 1529406 1432828 1337913 1251349
12870 1251349 1154810 1123867 1202179 1218067 1236543 1239086 1242751 1205590 1145519 1003869 955531
12859I55531p8346k9000O548o2764K791O1792Q7084P6058o28l0943J6775R795
12847A014693r7297J5786J05920J17052M1623m0508q8112j93166j6805o1892j89048
12836F08246l9368m635L1319M6863K0326J6791M5288K4692j15490k09678O7155
12825D91509J17771n1212k2914j01392j45026l1732J13066K4295J00183J08009
12815F02557k2554m9880O6096L8861j31855q2740n723R904n6886M4065o0333j726
12803C49786J02065P3994M3600r6295r4680R6029M0008j252j31071J11617O6370
12792E60171O3118m3097p3227L3889N7496p9964Q6305J8918J5729P5354J08350
12781H23042k4993J97568J68646J55829R8905K39057L43013L24473J93998J42971
$$ plain form
12859 955531 877185 848185 854733 791969 794760 856552 943636 1019694 1019066 988123 1004898 1014693
12847 1014693 917396 933182 1039102 1156154 1197777 1157269 1069157 875991 859186 797294 608246
12836 608246 568878 564243 595562 642425 662751 679542 724830 749522 634032 424354 491509
12825 491509 609280 558068 535154 433762 288736 257004 370070 394365 494548 602557
12815 602557 580003 530123 596219 635080 503225 420485 414762 424666 367780 411845 351512 349786
12803 349786 451851 525845 569445 473150 378470 474499 514507 513255 382184 493801 560171
12792 560171 623289 580192 506965 540854 598350 518386 604691 623609 639338 714692 823042
12781 823042 798049 995617 1164263 1320092 1418997 1658054 2001067 2325540 2519538 2662509
12771B662509J3452l3943j27326k50620m02820l92228k69841l8545p7384j20249
12761I63005j06353j13412j04194j914O2966J44320n3200n2138n5879m5485M1597
12750F79313j5045l8776m5285P0780J7905J413j5349o158n0047j781J28322J16380
12738H41672K146J4838N964j27475j4676J01084m2311r9633j29253l7175l7579
12727D77602M2114R9494J1869p3875J766o3537l5045O7842M7234P2991n4391j2676
12715E81388O0244M0593Q9011q0019m2307K9108m5152k4891m345m4279o7807O432
12703D97976l7881P3143J20312o8907j8973l6122J40956O9895P284K6446j4877
12692G59252N1383j8990o2293n862J04644q7196j56999K3290P7650Q1156K8382
$$ plain form
12771 2662509 2675961 2642018 2514692 2264072 1861252 1469024 1199183 1160638 1083254 963005
12761 963005 856652 743240 639046 637132 700098 844418 791218 739080 683201 637716 679313
12750 679313 664268 625492 580207 650987 668892 670305 654956 648798 598751 596970 725292 841672
12738 841672 843818 858656 864620 737145 722469 823553 781242 681609 552356 515181 477602
12727 477602 519716 619210 631079 557204 558970 495433 460388 528230 575464 648455 594064 581388
12715 581388 641632 682225 771236 691217 648910 678018 632866 607975 603630 559351 491544 497976
12703 497976 460095 533238 653550 584643 565670 529548 670504 740399 747683 774129 759252
12692 759252 810635 791645 729352 723490 828134 740938 583939 607229 684879 766035 794417
12681G94417K6719N4928P591j876l9447L2461r9094J726L514p4028o7183L1911
12669F71639L1288J8456J3541J9096J576P1336M8961O7745l9534J96355j19252
12658I81207o9973j414j47575O8258O5714L6505L5522L8460L3328Q8850q3041
12647A045841n4341J5940m809R6476J4302M9501q615j03364n3955j06539k0667
12636H69770n1047m534P6062M9609k2367p6830M320k4189k7673Q4185K4927o7282
12624H34951J22900P6393K5478j25455j344q121l2547P0695Q7248j8815J8139
12613A049522J11244N0890m3219M2750O2154K910j9615l7309J2634Q5017J20671
12602A437649Q1581o1191j43138j09274q7772n3614P3219O0319O4248m1843M000
$$ plain form
12681 794417 821136 876064 883655 881779 842332 874793 775699 777425 780939 706911 639728 671639
12669 671639 702927 721383 734924 754020 755596 826932 875893 943638 904104 1100459 981207
12658 981207 911234 909820 762245 830503 896217 932722 968244 1006704 1040032 1128882 1045841
12647 1045841 991500 1007440 1002631 1099107 1113409 1162910 1154295 1050931 996976 890437 869770
12636 869770 818723 814189 890251 939860 917493 840663 844983 820794 793121 877306 902233 834951
12624 834951 957851 1034244 1059722 934267 932923 924802 892255 962950 1050198 1031383 1049522
12613 1049522 1160766 1211656 1168437 1211187 1273341 1276251 1256636 1219327 1231961 1316978 1437649
12602 1437649 1519230 1458039 1314901 1205627 1117855 1064241 1137460 1197779 1262027 1220184 1224184
12591A224184k4635J08953O2617L3504O0833R2541q9539P1467O8414J8059l5601
12580A590797N6218K9961j09023j20190Q398P2031J91538L0793M6524Q6699K0158
12569A903904l2156L6036Q1750m7589O316K9737m0489p5501o2742J15325J09512
12558B024103p8635J69312K30962Q6737m1284P0807J79493r0710r2251R9752J38315
12547B696601K9755m9477m3517M0173r7525P8136N1175N9756J1738J32601J38117
12536C047533R1857L2292o0153l9097l0570N7586J88951J35831J01100P3538j78131
12525C420737L491K95J71424J85072Q5561P9235J07981J02260J18890q2216P4612
12514D267342J50216J78381j9294N7075K38673J56189J8838O6710K97789L16156
$$ plain form
12591 1224184 1199549 1308502 1371119 1404623 1465456 1557997 1468458 1539925 1608339 1626398 1590797
12580 1590797 1647015 1676976 1567953 1447763 1456161 1528192 1719730 1750523 1797047 1883746 1903904
12569 1903904 1871748 1907784 1989534 1941945 1948261 1977998 1937509 1862008 1799266 1914591 2024103
12558 2024103 1945468 2114780 2345742 2432479 2391195 2462002 2641495 2550785 2458534 2558286 2696601
12547 2696601 2726356 2676879 2633362 2673535 2576010 2654146 2705321 2765077 2776815 2909416 3047533
12536 3047533 3139390 3171682 3111529 3072432 3041862 3099448 3288399 3424230 3525330 3598868 3420737
12525 3420737 3424228 3424523 3595947 3781019 3866580 3945815 4053796 4156056 4274946 4192730 4267342
12514 4267342 4417558 4595939 4576645 4633720 4872393 5028582 5047420 5114130 5411919 5728075
12504E728075K13432J88771K26262J86083J29586K09179J84708K87539K35124
12495G588759K52034K53209K60584L16544L54895N61413N43259M74520M33935
12486A1039152N30499N20976N19422N72544P52347Q77653R42864R15400J048084
12477A7718941J152491J331718J372074J579501J828719K029484K232724K492701
12469C1738353L040758L660674M093421M527312N322627O186350P216343Q289812
12461G4075650R483351J0664072J1521693J1982407J1739066J0763242Q821838
12454A49051319O095781K751513m59484l369566n339563o437547o710826o268258
12446A29313369n142666l818130k545238j149662L00609J615002K711544L862139
$$ plain form
12504 5728075 5941507 6130278 6356540 6542623 6672209 6881388 7066096 7353635 7588759
12495 7588759 7840793 8094002 8354586 8671130 9026025 9587438 10130697 10605217 11039152
12486 11039152 11569651 12090627 12610049 13182593 13934940 14812593 15755457 16670857 17718941
12477 17718941 18871432 20203150 21575224 23154725 24983444 27012928 29245652 31738353
12469 31738353 34779111 38439785 42533206 47060518 52383145 58569495 65785838 74075650
12461 74075650 83559001 94223073 105744766 117727173 129466239 140229481 149051319
12454 149051319 155147100 157898613 157439129 154069563 148730000 142292453 135581627 129313369
12446 129313369 124170703 120352573 117807335 116657673 116958282 118573284 121284828 125146967
12438A25146967M940961N971265O808137P787115Q632907R087433R438137R534029
12430A87346951R396919R036238Q425586P032195N560749L803750J810471l58997
12422B32053862k271542m052871n570068o796475p470990p905002q131338p998573
12414A81857003p604302o964496o289022n625227m774681l888341l076459k057746
12406A41576729q89218J88246J260578K318349L500204M424067N138079N777369
12398A63294403N886491N461937M345690K323861k8521k405132n028290p093941
12390A66756498q624340r752747j0086138r640235r067568q300181p441723o406054
12382I7437512n683614m743620m003646l548324l025389k631302k306545j806468
$$ plain form
12438 125146967 130087928 136059193 142867330 150654445 159287352 168374785 177812922 187346951
12430 187346951 196743870 205780108 214205694 221237889 226798638 230602388 232412859 232053862
12422 232053862 229782320 225729449 220159381 213362906 205891916 197986914 189855576 181857003
12414 181857003 174252701 167288205 160999183 155373956 150599275 146710934 143634475 141576729
12406 141576729 140687511 140875757 142136335 144454684 147954888 152378955 157517034 163294403
12398 163294403 169180894 174642831 178988521 181312382 181283861 178878729 173850439 166756498
12390 166756498 158132158 148379411 138293273 128653038 119585470 111285289 103843566 97437512
12382 97437512 91753898 87010278 83006632 79458308 76432919 73801617 71495072 69688604
12374F9688604j269157q54420l35642J12461P49987J724011K328089K641292K883721
12365G7668946L012250L485056M409266N942470Q469797J2600149J8475513K6782899
12357A60846346L8132606N1183443O2199207O7198481O3288140M7272562K0370584
12350E10491369j0630548l9507571o0681019o9085639o5059722n3106849l8785118
12343A73634903k6650750j8340023j2914111r254600o762287n197337m295142
12336I0220653l696951l680657l873537l740506l697550l812346l567883l275422
12328F0875801k920929k601588k318656k058643j985259j996287j868630j856910
12320D3268899j770653j830620j630673j480344j381299j142060j100280j153088
$$ plain form
12374 69688604 68419447 67565027 67229385 67341846 68091833 69815844 72143933 74785225 77668946
12365 77668946 80681196 84166252 88575518 94517988 102987785 115587934 134063447 160846346
12357 160846346 198978952 250162395 312361602 379560083 442848223 490120785 510491369
12350 510491369 499860821 460353250 399672231 330586592 265526870 212420021 173634903
12343 173634903 146984153 128644130 115730019 106475419 99713132 94515795 90220653
12336 90220653 86523702 82843045 78969508 75229002 71531452 67719106 64151223 60875801
12328 60875801 57954872 55353284 53034628 50975985 48990726 46994439 45125809 43268899
12320 43268899 41498246 39667626 38036953 36556609 35175310 34033250 32932970 31779882
12312C1779882j072580r34084r82549j037253q71210p07124p12999q70173n85727
12303B4006183p70918o66400q27604o64797p53587n79098n87407m49891n03742
12294A8202739m84071m51838m62937n11991m81505n29652m24242m34279m99956
12285A3922268l63385k61900k65717l77664m55261m66237l73430k72252l30133
12276A0756289j51936j45085k43710k45831j62511j9260j19092k18613k64277
12267I185974j87747j52317p1747j64976j81036l47967k61412j84850j71718n741
12257G456463l885p3905j50312k66931j69460l111j99588j93935m9862k20296
12247F125178j83081j25024j12072j58746j81488j46582j65929q0478o7636j90254
$$ plain form
12312 31779882 30707302 29773218 28790669 27753416 26882206 26175082 25462083 24591910 24006183
12303 24006183 23235265 22568865 21741261 21076464 20322877 19743779 19156372 18706481 18202739
12294 18202739 17718668 17266830 16803893 16291902 15810397 15280745 14856503 14422224 13922268
12285 13922268 13558883 13296983 13031266 12653602 12198341 11732104 11358674 11086422 10756289
12276 10756289 10604353 10459268 10215558 9969727 9807216 9787956 9668864 9450251 9185974
12267 9185974 8998227 8845910 8774163 8609187 8428151 8080184 7818772 7633922 7462204 7456463
12257 7456463 7452578 7378673 7228361 6961430 6791970 6788859 6589271 6395336 6345474 6125178
12247 6125178 5942097 5817073 5705001 5546255 5364767 5218185 5052256 4971778 4904142 4713888
12237D713888j53631M517J12453K5171j29832j19343J9653j57820j06644j28017
12227D080395j31116j3541j67615j94515j35395j6926k1877r3086j14244K3459
12217C215539Q440l1824j7090j10520j57050m3591o9362r7075p2476J7751Q046
12206B650788o2609n4521j2407J96242K39329J47296J77369K69060Q355K7708
12196C586610k9876k5340j49986l16102k99152k14840j39303M5172R2655j12460
12186B437378j72779l0817q4855o4504n5154N5667O4242P318Q5944j2888k08107
12175B021445k44318p7835L9719J4928l0427l9962J1593k6850M9713O4717o9400
12164A713323r8605j01919n6972n3940J4350j2244j78438q2278k3288o1771K6940
$$ plain form
12237 4713888 4560257 4564774 4677227 4702398 4572566 4453223 4472876 4315056 4208412 4080395
12227 4080395 3949279 3935738 3768123 3573608 3438213 3421287 3399410 3306324 3192080 3215539
12217 3215539 3223979 3192155 3175065 3064545 2907495 2863904 2794542 2697467 2624991 2642742 2650788
12206 2650788 2588179 2533658 2521251 2717493 2956822 3104118 3281487 3550547 3558902 3586610
12196 3586610 3556734 3531394 3381408 3065306 2766154 2551314 2412011 2457183 2549838 2437378
12186 2437378 2264599 2233782 2148927 2084423 2029269 2084936 2149178 2156496 2242440 2229552 2021445
12175 2021445 1777127 1699292 1739011 1753939 1723512 1683550 1695143 1668293 1718006 1782723 1713323
12164 1713323 1614718 1512799 1455827 1401887 1416237 1403993 1225555 1143277 1119989 1058218 1085158
12153A085158J13206K5119J5593j22534O1842M0975p0642o8622j0277K5478K1402
12142A116698j0048m513o2118L0302k3070O88n9072J16731M921o8127j00734J8023
12130I59681j8235J00746M3953j19425k9702q7989k4577n9122J00975L8047m7213
12119H57139o37J0506n420J376M469o1894L3111q7459r8425n047J10154P1988
12107H29861j27461m922J7235J29243R7476j87151j51422M5650N5097Q8522j9757
12096G72371j3325j17194R6113J21263k7693n3262M97k458L039M2026Q6493p584
12084I00286j69187j87659Q1858m3412K0286M8147R2772r4641k9964q5653p5444
12073D57389j5740J17807n8303p8340P2246N8060n2212R3502P0341R4918o1818
$$ plain form
12153 1085158 1198364 1223483 1239076 1116542 1178384 1219359 1148717 1080095 1069818 1095296 1116698
12142 1116698 1106650 1102137 1040019 1070321 1047251 1047939 988867 1105598 1110519 1042392 941658 959681
12130 959681 941446 1042192 1086145 966720 937018 849029 824452 765330 866305 904352 857139
12119 857139 856502 867008 861588 862964 867433 805539 838650 751191 652766 647719 757873 829861
12107 829861 702400 697478 714713 843956 941432 754281 602859 648509 703606 792128 772371
12096 772371 759046 641852 737965 859228 831535 778273 778770 776312 779351 821377 907870 900286
12084 900286 731099 543440 625298 581886 602172 650319 743091 648450 618486 532833 457389
12073 457389 441649 559456 501153 422813 495059 553119 500907 594409 664750 759668 697850
12062F97850K230p1663j31484l5199P7473P7959m4902p3144j93594n9826Q4053
12051C29753J7643K6608J63222Q822j73390j15931r9444j24197J04267R9500N4745
12040B91598k7306M9180l2719k9340J04017Q7487O9084J796p4708l0980O3091
12029D71200l6709k1970R6543j00530r71J09619m7038j11586j6354K3598j29700
12018B36102M9576P0659j9264Q1146k8815j19766k8779n7595O8046Q8094O0318
12007C99722P3381L3181J36402m6423M6806J12730J51315K5426j8954Q9187P9748
11996A082521M0094K935o8782P3311j3606j13120j84476l9146J1921p6129J81385
11985H96908n255j53216o9335r779J01138J02582O7148L7489k2486p6216n7093
$$ plain form
12062 697850 700080 628417 496933 461734 539207 617166 572264 499120 305526 245700 329753
12051 329753 347396 374004 537226 546048 372658 256727 157283 33086 137353 236853 291598
12040 291598 264292 313472 280753 251413 355430 442917 512001 513797 439089 408109 471200
12029 471200 434491 412521 509064 408534 407563 517182 470144 358558 342204 365802 236102
12018 236102 285678 356337 337073 418219 389404 269638 240859 183264 251310 339404 399722
12007 399722 473103 506284 642686 596263 643069 755799 907114 932540 913586 1002773 1082521
11996 1082521 1122615 1125550 1056768 1130079 1116473 1003353 818877 779731 791652 715523 896908
11985 896908 891653 738437 669102 659323 760461 863043 930191 967680 945194 868978 811885
11974H11885J51111J22976P3613M0153K6546N4204P3012K17315J8331p8746j09142
11963A401258j48046k8726q379N8508N7133L2178p9396o3230j23058J01776p0122
11952A129896j68029p2235M8871o4109k0780r360J5403j18503k210Q0007J31336
11941I50287O8011K06864P9679j1821P2765J08475Q180j01626j409j4542J0812
11930A375675K32427K66494L09348L46266K77562Q4683Q9529o7633k22188m07274
11920B284889l26304l15108l12562j07884k97582j67261l957r2336M6666J7150
11910G25711o1557o0178R2986J4401l0183o2635q1889K272P8022K9404j18807
11899E27547o70J1229j1832n2451k0200k1713j3300j5922p4352J0528m0741r2145
$$ plain form
11974 811885 962996 1085972 1159585 1199738 1226284 1280488 1353500 1570815 1589146 1510400 1401258
11963 1401258 1253212 1224486 1216107 1274615 1331748 1363926 1284530 1221300 1098242 1200018 1129896
11952 1129896 961867 889632 938503 874394 853614 844254 859657 741154 738944 818951 950287
11941 950287 1018298 1225162 1304841 1293020 1365785 1474260 1482440 1380814 1379405 1364863 1375675
11930 1375675 1608102 1874596 2183944 2530210 2807772 2892455 2981984 2914351 2692163 2284889
11920 2284889 1958585 1643477 1330915 1223031 925449 758188 754231 661895 708561 725711
11910 725711 664154 603976 696962 711363 681180 618545 536656 538928 616950 646354 527547
11899 527547 526877 538106 526274 473823 453623 431910 418610 402688 328336 338864 298123 205978
11887B05978o8257j166O2347K3695O3392Q3071l154j22141O1557j7143N9354j11058
11875B36475k04993j7053J67368P7765l8287J5183j8679M9110l9358j23873j75097
11864g1439m1233K62655N7019L0504O4156j47655k8965Q3794k9889N3360O5113
11853B97420L622l8562J5498Qn7161j7335J6991Q109o2307K7493o0335q6807J38615
11840A85249K7090O033k5115j6196l5162M49j19000l4400J16863O5075m6421l7823
11828H6642q903k9443K4792P0426K1094R3170p517j26493j99222N0687J88684
11817A63917l0615j33708m5338O8841P2919k9958q6052n1386J09827N4376K6006
11806A18829j62540r4172Q6171Q0280o514l5548J4443R1152Q1318R0230k10391
$$ plain form
11887 205978 137721 136555 198902 222597 285989 369060 365906 243765 305322 288179 347533 236475
11875 236475 31482 14429 181797 259562 221275 236458 217779 266889 227531 103658 -71439
11864 -71439 -112672 149983 207002 237506 301662 154007 125042 208836 178947 232307 297420
11853 297420 301042 262480 277978 277986 220825 203490 220481 228590 166283 193776 133441 46634 185249
11840 185249 212339 218372 193257 177061 141899 142348 23348 -11052 105811 170886 124465 86642
11828 86642 77739 48296 73088 143514 164608 257778 250261 123768 -75454 -24767 163917
11817 163917 133302 -406 -45744 23097 96016 66058 -19994 -71380 38447 92823 118829
11806 118829 -43711 -137883 -51712 28568 22054 -13494 949 92101 173419 263649 53258
11795E3258j71059n1930J18287J88337Q5279l3001j03880k1848j00766j82433
11785b19756p3695P6782K11726M6055m0039J4804O3435j16570N0368J54684J23282
11774B91076K8164p7228j07570j9172j5005K059M9668m2186p5853k4664j4129
11763d840Q539R0111r028j19099k993R0329M2153q8324J5721L5505J15272O9307
11751B42653k831J4970j09596j06334K7953P4528r0276q40Q4716K6131m4460j14897
11739A717N6913K4194j25060j04988l3424J4387O3987J44321P4199l2924m3032
11728D0290J4972n135R831L2443l5049p3348p1539J7927J08333J7826P375R476
11716G3402N9154k0582L3008K3741q1057J00663M7659r727p4187j9334j55417
$$ plain form
11795 53258 -117801 -169731 -51444 136893 222172 189171 85291 63443 -37323 -219756
11785 -219756 -293451 -216669 -4943 41112 1073 15877 79312 -37258 13110 167794 291076
11774 291076 319240 242012 134442 115270 100265 102324 151992 109806 33953 9289 -4840
11763 -4840 3699 93810 84782 -34317 -37310 53019 95172 6848 22569 58074 173346 242653
11751 242653 239822 254792 145196 38862 66815 141343 51067 50227 134943 161074 116614 1717
11739 1717 58630 82824 -42236 -147224 -180648 -166261 -102274 42047 116246 83322 40290
11728 40290 55262 50127 59958 92401 57352 -15996 -87535 -69608 38725 56551 63926 73402
11716 73402 132556 111974 144982 168723 87666 188329 235988 226261 152074 132740 -22677
11705b2677n4086J33442M2503J8713L477q6216j5986k7990P11Q5982J32188P6597
11693B86658j43117k5636L0385o8681n5242L0749P586M9023N7107Q9065K9039
11682B86936j7216l436j32940K2594M6804j05461j84833J3638m9742l9473K6073
11671a37056J06976j2694M3213n3782o6927p4086P4518J93641m8975k9528L4761
11660C0061j07066j40549o2716l9023J42941R0759L8061J16428n4742k3820Q1142
11649G1476n889K0087M6833m477k7213L8441K4043o6521j06602J2191N5852l0540
11637B7681j7945j1516O8843J9815q4366l9492L3879M1856N788O7258J96942K4517
11625C33260j04689l8572O2856o2648j70786l1527j23943j01968P6145J01572
$$ plain form
11705 -22677 -76763 56679 99182 117895 121372 35156 19170 -8820 -8109 77873 210061 286658
11693 286658 143541 117905 148290 79609 24367 55116 62702 111725 168832 257897 286936
11682 286936 269720 266284 133344 155938 202742 97281 -87552 -73914 -123656 -163129 -137056
11671 -137056 -30080 -42774 439 -53343 -120270 -194356 -119838 73803 24828 -4700 30061
11660 30061 -77005 -217554 -280270 -319293 -176352 -85593 -47532 68896 14154 -9666 71476
11649 71476 65587 85674 132507 128030 100817 139258 163301 96780 -9822 2369 58221 27681
11637 27681 9736 -1780 67063 86878 2512 -36980 -3101 38755 44543 111801 308743 333260
11625 333260 228571 189999 252855 190207 19421 -12106 -136049 -238017 -161872 -60300
11615f0300J05922Q727p4925l37j60126m8319P9538m1554J9627P2536J3359L0375
11603e5477Q7938J46480M3187m5351P6568o2848j32952l208J76778j4191r1675
11592A25249o0983p1477N5230k3063o7M6800L8742n8596q4656j03755o032j3044
11580a55652Q5053J46394L7949P0903L2499P70N117p5387M0492l8568K6888L6136
11568B12594l5850o6076l1801m114M111J62757l2770r9087j55587p0871K7244
11557h9450M3788j6467r1774J09872J37927R7297q4653j09161J9288N4097o3597
11546G167n3295l3568L858L0262j58292P2972J49819J03876R0269j11517k03714
11535a02163n3171O8742P9751Q4148k697n1432J5545k0899O0399j409r3245k1723
$$ plain form
11615 -60300 45622 54349 -20576 -20913 -181039 -229358 -149820 -191374 -171747 -99211 -85852 -55477
11603 -55477 32461 178941 222128 176777 253345 190497 57545 54337 231115 216924 125249
11592 125249 64266 -7211 48019 24956 24889 71689 110431 51835 -32821 -136576 -142608 -155652
11580 -155652 -70599 75795 113744 184647 217146 217916 223033 147646 188138 149570 176458 212594
11568 212594 176744 110668 78867 74753 78864 241621 208851 109764 -45823 -116694 -89450
11557 -89450 -45662 -62129 -153903 -44031 93896 191193 106540 -2621 16667 70764 7167
11546 7167 -46128 -79696 -75838 -45576 -203868 -130896 18923 122799 213068 101551 -102163
11535 -102163 -155334 -86592 -6841 77307 74610 23178 38723 17824 78223 76814 -16431 -38154
11523c8154N818L9639R2616J9645m6149j08598j02460J89669J1410j32051l8754
11512a07369O4843M139j9802m4522m9650J5476K9683n8350P0667K00115L1296
11501A36526n4341m2338O5337N3510j25568j23788j60948L9162J28556l0004q1902
11490a95798p3360J36849J9953P8467j3988m9563L1060M3745m1738l4046J1706
11479h6713K9556l6988M7898L6526Q3377J13603o8419k1335l1939L505Q6476K5639
11467A81186n0837j94379o0189k6187Q742M2681N4970P3m2874n1680r945J4408
11455a34031L0009L0955M6394k5616P0608J45920O0828j5018l9126n1335j0973
11444A08615Q287j1111q1903l2422l7542n4876k480J36281M9217n2759N2006J32254
$$ plain form
11523 -38154 -32336 7303 99919 119564 73415 -35183 -137643 52026 63436 -68615 -107369
11512 -107369 -42526 -38387 -58189 -102711 -152361 -136885 -107202 -165552 -94885 105230 136526
11501 136526 82185 39847 105184 158694 33126 -90662 -251610 -212448 -83892 -113896 -195798
11490 -195798 -269158 -132309 -112356 -33889 -47877 -97440 -66380 -22635 -64373 -98419 -86713
11479 -86713 -57157 -94145 -46247 -9721 73656 187259 118840 97505 65566 69071 155547 181186
11467 181186 130349 -64030 -124219 -150406 -141664 -98983 -44013 -43940 -86814 -138494 -148439 -134031
11455 -134031 -104022 -73067 -26673 -52289 18319 164239 225067 210049 170923 119588 108615
11444 108615 116902 105791 23888 -8534 -46076 -100952 -103432 32849 82066 29307 81313 213567
11432B13567r2031p629J12424p116j16190j38009J4972J35975q9474J09888L3449
11421A69826K2871P1402n8479p1030m0722q6030o2794k5637l238P3671r7775l8996
11409a46931M1749L9610K8028k3182m1996j2149L9893Q039K7123J21324o4314
11398A7194j21373q1388L4235n8692M4591L1296P0777J63132J39170P806M9266
11387B96014j7342L6212K2429O529n6423m0926l4248o2605m5635K2318j4178r8249
11375A3896k1214M9606j04867o9960P8344J24955J707n4443Q13K8002n771K8473
11363F9541l8078J039J4671N4804K0841o3449n9363L6655L6315J5336k7085R2146
11351A53373J07531j9214m3612k7673r6442p3393q7404J14779k3932j05139N0414
$$ plain form
11432 213567 121536 113907 226331 219215 103025 -34984 -20012 115963 26489 136377 169826
11421 169826 192697 264099 205620 134590 93868 7838 -54956 -80593 -83831 -10160 -107935 -146931
11409 -146931 -105182 -65572 -37544 -60726 -102722 -114871 -74978 -66939 -39816 81508 17194
11398 17194 -104179 -185567 -151332 -210024 -165433 -134137 -63360 99772 238942 246748 296014
11387 296014 278672 314884 337313 343842 287419 246493 212245 149640 104005 126323 112145 13896
11375 13896 -7318 42288 -62579 -132539 -54195 70760 72467 18024 18837 46839 41068 69541
11363 69541 31463 32502 47173 101977 122818 59369 6 36661 72976 88312 61227 153373
11351 153373 260904 241690 198078 170405 73963 570 -86834 27945 4013 -101126 -50712
11340e0712M7199J42330J8661K4682R326j8444j04982m374n4419O5805m5253j8889
11328A0930r8954m2084P2085J09231r4803r9029R689N1859O4264K7506L5489K6666
11316G2849N8534L197l8421J4395J01478j9827j54717j4809M8864M3665O3998
11305A79206K5619n6231N962k1251Q7419N6018l3974L364L8849n681n4909o1972
11293A62419m6963j2284J16989J03232R873m3314q1649Q0877j18225J4112k5975
11282A59092j05863J2106M448J83110l3850j40604J04796M4523r1485l0979l4177
11271G1117K5037J0358k3035K6113K9864m863M3037q7799l3814R3445R5160M2701
11259B87321O5434r5960j66740L1365K2158p8951L0077k4441o9695N176l6697
$$ plain form
11340 -50712 -3513 138817 157478 182160 191486 173042 68060 63686 9267 75072 29819 10930
11328 10930 -88024 -130108 -58023 51208 -43595 -142624 -132935 -81076 -16812 10694 46183 72849
11316 72849 131383 134580 96159 110554 212032 192205 37488 22679 71543 115208 179206
11305 179206 204825 148594 154556 133305 220724 276742 242768 246132 284981 279300 224391 162419
11293 162419 115456 103172 220161 323393 333266 289952 208303 289180 170955 185067 159092
11282 159092 53229 65335 69783 252893 219043 78439 183235 227758 136273 105294 71117
11271 71117 96154 106512 83477 109590 139454 134591 177628 89829 56015 149460 244620 287321
11259 287321 352755 256795 90055 121420 143578 64627 94704 70263 568 5744 -30953
11248c0953J12844N0606J7431r2635J0338p2134J0897m3570P6251l1590K094K4939
11236C4518J9538J99321Q8452n0571j25208m2438k8687p6006m7540m6152J07909
11225C3136J08580j4314j373L1367N4387O6408l33l7597M2910N0263l048j20126
11213B10260j16653J21336P1534N986r8658p9260q8104q820N4846J7654q5708
11202D413J47582M7713k05715N4563J2746Q0439K9889m069K6485O3599M716m1663
11190B20698o1153l0709p9740j36636Q3527Q8971M3702L2595n9161k8710P3743
11179A47127K6758p7253L624P6019N6696L7446N3596j25048r3460q0516K1704
11168D6693j22315j43634k2494J61438K29673l1069j29363j7837L1509J2162J77617
$$ plain form
11248 -30953 81891 132497 149928 57293 67631 -4503 6394 -37176 39075 7485 9579 34518
11236 34518 54056 253377 341829 291258 166050 123612 94925 18919 -28621 -74773 33136
11225 33136 141716 127402 126029 157396 211783 278191 277858 240261 283171 333434 330386 210260
11213 210260 93607 214943 286477 292463 193805 114545 26441 17621 72467 90121 4413
11202 4413 151995 199708 -6007 48556 61302 141741 171630 167561 194046 257645 262361 220698
11190 220698 159545 128836 49096 -87540 -4013 84958 128660 161255 102094 73384 147127
11179 147127 173885 96632 100256 176275 232971 270417 324013 198965 105505 24989 46693
11168 46693 -75622 -219256 -241750 -80312 149361 118292 -11071 -28908 2601 14763 192380
11157A92380K4569j00646j72424m7516M016k1106J17114K1055j6206n155m9193
11146e3112N5934O1020L1304j9856m413O1389Q4552j2937j62257m4865J28733
11135A25492J95683M384r2572j34315K9789P5561M5047J2337N427P930J9370o5474
11123B28659o6575K1770p1359p1965l5278k5607N3778j741O4444J1538J07254
11112B14918r2577m9884Q1266P0462J12086m4632r7535m3445O0239R1226O1414
11101C63538O6494M5327j35061m2876m030j27614j22103j0802M8336P9939J0151
11090A71299J4159O2146M5817L7387P6042Q0773p5436p1935M3811J18326r9687
11079D02702p1765J5401R6175M5070p9587J2175J63020P3304R299J9143k5553
$$ plain form
11157 192380 216949 116303 -56121 -103637 -99621 -120727 -3613 17442 1236 -3919 -53112
11146 -53112 2822 63842 95146 75290 70877 132266 216818 203881 41624 -3241 125492
11135 125492 321175 325559 232987 98672 128461 204022 249069 261406 266833 274763 294133 228659
11123 228659 162084 183854 112495 40530 5252 -20355 33423 31682 96126 107664 214918
11112 214918 122341 72457 153723 224185 336271 291639 194104 150659 210898 302124 363538
11101 363538 430032 475359 340298 297422 293392 165778 43675 32873 81209 161148 171299
11090 171299 185458 247604 293421 330808 406850 487623 412187 340252 384063 502389 402702
11079 402702 330937 346338 442513 487583 407996 420171 583191 656495 665794 684937 659384
11068F59384j8014o2792Q3821K9126O6398J55895L6044n1962k2431m3036Q5213
11057I17646R1259o2662J2141L5395q5194n1030Q80o7420q9548j4293N6452K5193
11045G68819q42N1851J47167J12116R4561P883m7639j51039m0579J30962R8226
11034A171486k7675j1543k1749J29831Q5051j4566j51940r5116R9640J87039m7201
11023A303257o0754p0474k8901j7596O533q2752n9530N642M458l26m830r031r3511
11010H92185m9742P3312j75J07982r9239J4138J37130J9297m7870p084j2442j25671
10998I01821j32121J1181J5449R0572l2281l382k4356o3722r8393j8073r653O1888
10986F98930L7213J8116L7666r7275o0343K6384L3899m0457m483O1703J0906l7423
$$ plain form
11068 659384 641370 578578 662399 691525 757923 913818 949862 897900 875469 832433 917646
11057 917646 1008905 946243 958384 993779 908585 857555 858435 791015 701467 687174 743626 768819
11045 768819 767977 819828 966995 1079111 1173672 1181555 1133916 982877 942298 1073260 1171486
11034 1171486 1143811 1132268 1110519 1240350 1325401 1310835 1158895 1063779 1163419 1350458 1303257
11023 1303257 1242503 1172029 1143128 1125532 1132065 1049313 989783 995425 999883 999557 994727 985696 892185
11010 892185 842443 915755 915580 1023562 924323 938461 1075591 1094888 1047018 1039934 1027492 901821
10998 901821 769700 780881 796330 886902 854621 851239 826883 763161 664768 646695 637042 698930
10986 698930 736143 754259 791925 694650 634307 660691 694590 654133 649650 711353 722259 684836
10974F84836j11383j15750o138J6215R8174N706k9920J46586k0499j44415K5307
10963E48719M8651j22381K768m3514L5269j00113m7228J01799K2851k002L9562
10952D84381k3554k5740L4949N6653L5771j3608p4686k4233p8522O968Q6974L5179
10940E00532k7029N8248l7599p0234K3959N2210R9155J2549j00533m6229L3013
10929D98042j61328j1704O7559j1251o3736O7548P5119k433j7818L6695K4469
10918E01162q9j1685Q9987l1132O1452L8198N3273j3201M6948j2625j3205q4366
10906F24717K3591k0672O9624J13929o7481q8328L9861J22798k3931p7132P2800
10895G89776p006P40K6311m9681O1326M8974O2664p7830j187j11j83093M6475
$$ plain form
10974 684836 573453 457703 451565 467780 565954 571660 541740 688326 667827 523412 548719
10963 548719 597370 474989 477757 434243 469512 369399 322171 423970 446821 444819 484381
10952 484381 460827 435087 470036 526689 562460 548852 474166 449933 371411 378379 465353 500532
10940 500532 473503 531751 494152 423918 447877 500087 599242 611791 511258 465029 498042
10929 498042 336714 325010 392569 381318 317582 385130 460249 457816 439998 476693 501162
10918 501162 501073 489388 579375 548243 609695 647893 701166 687965 734913 722288 709083 624717
10906 624717 648308 627636 697260 811189 743708 655380 695241 818039 794108 716976 789776
10895 789776 782770 783510 809821 760140 821466 870440 933104 855274 854087 853976 670883 717358
10883G17358J48459J69456j01193k188L0611R083n5577l2601j74574l8163J43403
10872H14074m4655q1491N4774k8418J08148O1521n1032J1131j6037M3173n6501
10861H14687j18725m6265P9546J14654J19435k224l955o927Q6512R6139O1607
10850A194484l7690m2315K1493o3327N1084o9008q052K9506p6495j14459P104
10839H92325m8399n481J45673J56693r349L1978l0912j34763j7652M3232J24710
10828A148055L1659o8686m4187O9711n931p071q6012j225K8927J12075N3722p7519
10816A153518n3972R1360P7934k9477j56748L361Q0758q9923M4446R1183N1635
10805A264075K0707J27736n6176j8433J0968m9864L2446M2217P5857N3439m84
$$ plain form
10883 717358 865817 1035273 934080 931892 962503 971586 916009 883408 708834 670671 814074
10872 814074 769419 687928 742702 714284 822432 883953 832921 844052 828015 871188 814687
10861 814687 695962 649697 729243 843897 963332 961108 957153 950226 1036738 1132877 1194484
10850 1194484 1156794 1114479 1135972 1072645 1123729 1054721 1046669 1076175 999680 885221 892325
10839 892325 843926 838445 984118 1140811 1131462 1163440 1132528 997765 980113 1023345 1148055
10828 1148055 1179714 1111028 1066841 1136552 1130621 1123550 1037538 1036313 1065240 1177315 1231037 1153518
10816 1153518 1099546 1190906 1268840 1239363 1082615 1085976 1166734 1076811 1121257 1212440 1264075
10805 1264075 1284782 1412518 1356342 1337909 1348877 1299013 1331459 1373676 1449533 1502972 1502488
10794A502488j2933L5268R9645M2836K6246j05690l6994n4683J39482J31412M3445
10783A810522q3871L5838Q6839n3956o7070L9028R9002O2666q2132j25490J0756
10772A732132J49806J46057P7052L3114l8561q4380l414N5777N9635P9412P5559
10761B282189J93485J2660j9576n6110r7842K2488O6203R2255P0037j871j05904
10750B458014Q4885J51971J62947N7342j1674K5379K2305P3463K4723J13660J13948
10739C276963j412K4006l5212M0491J14787J94363J57881J20322o6119J04201
10729C930271J91827k1672m1630K6206J35851J13303M4143J14447J20875R9993
10719D713614m915q8200l7761K0745J5365J82114J17860J43946K4862P0772J98738
$$ plain form
10794 1502488 1489555 1524823 1624468 1667304 1693550 1587860 1550866 1496183 1635665 1767077 1810522
10783 1810522 1726651 1762489 1849328 1795372 1728302 1767330 1866332 1928998 1846866 1721376 1732132
10772 1732132 1881938 2027995 2105047 2138161 2099600 2015220 2011806 2067583 2127218 2206630 2282189
10761 2282189 2475674 2488334 2468758 2412648 2314806 2337294 2403497 2495752 2565789 2563918 2458014
10750 2458014 2542899 2694870 2857817 2915159 2903485 2928864 2951169 3024632 3049355 3163015 3276963
10739 3276963 3275551 3299557 3264345 3304836 3419623 3613986 3771867 3892189 3826070 3930271
10729 3930271 4122098 4100426 4058796 4085002 4220853 4334156 4378299 4492746 4613621 4713614
10719 4713614 4708699 4620499 4582738 4603483 4618848 4800962 4918822 5062768 5087630 5158402 5357140
10708E357140J97607K02568K02223K02052K35035J42459Q7599K01291K29713O5080
10698G122767K09727K51910J18429J68222J99037J39474J10637K63863K47533
10689H831599L04529J18700K70480L81302K70049L11735M18512M23038M78588
10680A1808532M45979M00132M32148N46747N30013N77207N90038O46536Q26392
10671A6803724Q24754Q30051Q13111R22911Q99895J122707J111855J368801J475468
10662B6173277J386147J574588J797989K055636K187788K224836K408653K810219
10654D2619133L076672L290422L549115M073658M423972M566159M965403N522152
10646G6086686N611745N620523O004498O049344N799886N443623N001572M346037
$$ plain form
10708 5357140 5554747 5757315 5959538 6161590 6396625 6539084 6626683 6827974 7057687 7122767
10698 7122767 7332494 7584404 7702833 7871055 8070092 8209566 8320203 8584066 8831599
10689 8831599 9136128 9254828 9525308 9906610 10176659 10488394 10906906 11329944 11808532
10680 11808532 12254511 12654643 13086791 13633538 14163551 14740758 15330796 15977332 16803724
10671 16803724 17628478 18458529 19271640 20194551 21094446 22217153 23329008 24697809 26173277
10662 26173277 27559424 29134012 30932001 32987637 35175425 37400261 39808914 42619133
10654 42619133 45695805 48986227 52535342 56609000 61032972 65599131 70564534 76086686
10646 76086686 81698431 87318954 93323452 99372796 105172682 110616305 115617877 119963914
10638A19963914L612785K746335K010448J329462O19747K06466q6970l05972j98132
10629A29898083j1168N52782R32755J275325J683039K007771K265126K516052
10621A41119765K524169K533876K536448K716945K783784K916812L202239L432788
10613A63766826L489136L449440L109956K634835J834232R75343J16128o32548
10605A78743348j336650j985481k467571k916301l088729k778762k687411k553475
10597A58928968k386686k267891k267145k041550j903336j833359j615103j546058
10589A43067840j428623j105778p32945o01447n17121l98433l29332j35587m12996
10580A37405578p23194j167887j760692k208821k601335l169762l592992l889498
$$ plain form
10638 119963914 123576699 126323034 128333482 129662944 130282691 130489157 130402187 130096215 129898083
10629 129898083 129886915 130439697 131372452 132647777 134330816 136338587 138603713 141119765
10621 141119765 143643934 146177810 148714258 151431203 154214987 157131799 160334038 163766826
10613 163766826 167255962 170705402 173815358 176450193 178284425 179259768 179375896 178743348
10605 178743348 177406698 175421217 172953646 170037345 166948616 164169854 161482443 158928968
10597 158928968 156542282 154274391 152007246 149965696 148062360 146229001 144613898 143067840
10589 143067840 141639217 140533439 139800494 139199047 138681926 138283493 137954161 137818574 137405578
10580 137405578 136682384 135514497 133753805 131544984 128943649 125773887 122180895 118291397
10572A18291397m160454m306827m493500m502253m478496m285170m082693l910792
10564H4071212l614394l365951l255186l209788k844758k633824k531300k433741
10556F0182270k340530k207069k053533k007333j797631j690496j684957j582001
10548D4818720j464944j463919j517555j415043j278065j177106j047211r92825
10540C4462052j043931r72198j017908r02347q56490q89247p81066o77529n66622
10531B6754714o85226o50245p77512p66042n93946n17403o93577n93865o21369
10522B0855529n99280m82978m98814k59141l75384m20351m43233m61921m47352
10513A6867075l29818k80193l11333l60479m24801l70306k75892k44408l53099
$$ plain form
10572 118291397 114130943 109824116 105330616 100828363 96349867 92064697 87982004 84071212
10564 84071212 80456818 77090867 73835681 70625893 67781135 65147311 62616011 60182270
10556 60182270 57841740 55634671 53581138 51573805 49776174 48085678 46400721 44818720
10548 44818720 43353776 41889857 40372302 38957259 37679194 36502088 35454877 34462052
10540 34462052 33418121 32445923 31428015 30525668 29669178 28779931 27998865 27321336 26754714
10531 26754714 26069488 25419243 24641731 23875689 23281743 22764340 22070763 21476898 20855529
10522 20855529 20256249 19773271 19274457 19015316 18639932 18219581 17776348 17314427 16867075
10513 16867075 16537257 16257064 15945731 15585252 15160451 14790145 14514253 14269845 13916746
10504A3916746l80039l16045k70773k18757l87316l37785k93821k25919k80730
10495A1205561j51048j86636l38808j44963j67641k15156j22104p633k17142j97624
10485I456806l70932l79903r3715m4688j77773j01933L8735j83742j16460j68491
10475G857904j39427j30118j01711k34736r8720n126o1974m1420j71701j10032
10465F762939k65335l7618J2288j07451j20524J21213K2479q2958o9795j80996
10455F054242j57900q4325j72198j12181q1143j07562r3244j95964j09159p4528
10445D866038j66278k3812J1585n2699k9114N9562j7370j97356j25788n733N7531
10434D376566L6537j00344r3004J6405J2098j04167oK7680j71111j15581N2989
$$ plain form
10504 13916746 13536707 13220662 12949889 12731132 12343816 12006031 11712210 11486291 11205561
10495 11205561 11054513 10867877 10529069 10384106 10216465 10001309 9879205 9871572 9654430 9456806
10485 9456806 9085874 8705971 8612256 8567568 8389795 8287862 8326597 8142855 8026395 7857904
10475 7857904 7718477 7588359 7486648 7251912 7153192 7148066 7086092 7044672 6872971 6762939
10465 6762939 6497604 6459986 6472274 6364823 6244299 6365512 6387991 6305033 6235238 6054242
10455 6054242 5896342 5812017 5639819 5527638 5446495 5338933 5245689 5049725 4940566 4866038
10445 4866038 4699760 4675948 4687533 4634834 4605720 4665282 4647912 4450556 4324768 4319035 4376566
10434 4376566 4413103 4312759 4219755 4236160 4248258 4144091 4144085 4171765 4000654 3885073 3938062
10423C938062j63342J08517J80718l3187j86001j79578m2652l2036k4447l3263
10413C532791q5441L9174q6588p9096L5115j37963k45977j18977P9436k1816R672
10402B920330j5843M1704J51119p0627K8584m087j21093j19445P7948J5534o0880
10391B843244p0476q3256p7015j7750m0889r4566j64025k23049l9335J24496L0432
10380B187811n7877r7668Q2097J13880m8588m3319l7421p0039l6978m7804j0802
10369A933292m0601j50671k2718k2987q2965J9365K6515J0091o052q6095K6063
10358A603237J2325M6622M4140L7814R455n0142j798q5324M3474j2934j24673
10347A522196M6505M7828p2785N6710p5909K2821N1867k5361r5566k2001R6600
$$ plain form
10423 3938062 3774720 3883237 4063955 4030768 3844767 3665189 3622537 3590501 3566054 3532791
10413 3532791 3447350 3486524 3399936 3320840 3355955 3217992 2972015 2853038 2932474 2910658 2920330
10402 2920330 2904487 2946191 3097310 3026683 3055267 3051180 2930087 2810642 2888590 2904124 2843244
10391 2843244 2772768 2689512 2612497 2594747 2553858 2459292 2295267 2072218 2032883 2157379 2187811
10380 2187811 2129934 2032266 2114363 2228243 2179655 2136336 2098915 2028876 1991898 1944094 1933292
10369 1933292 1892691 1742020 1719302 1696315 1613350 1632715 1659230 1669321 1663269 1577174 1603237
10358 1603237 1615562 1662184 1706324 1744138 1753593 1703451 1701653 1616329 1659803 1646869 1522196
10347 1522196 1568701 1616529 1543744 1600454 1524545 1547366 1599233 1573872 1478306 1456305 1552905
10336A552905n0206q4388j07078q7414Q2457M8165k5534m1511j41484j36216J5829
10325A025525n0733J25862J43787k473j1908n1729Q45J03202K0951P1800m4619
10314A330510j31569R9828L90J7111M2554j3521j72368j33291Q4465K4589p4661
10303A074037r3687N8464n7417R2146J09927K4881q9243o5532L2582k1337o0726
10292A004095o7001L7244O0355o0321L6072o6176j44249M021P0191j0200M548
10281H68579j79736n7320J78844M981L7523P2515n5714j17887P4408M1361Q451
10270H76005n5379m825Q0672P9319r1526j05273L419K8931K2435L1198l6106j15055
10258G13815o4923q2492m2274O0498J51874o1864R45k2198j4320r0507M3723Q158
$$ plain form
10336 1552905 1502699 1418311 1311233 1223819 1306276 1354441 1328907 1287396 1145912 1009696 1025525
10325 1025525 974792 1100654 1244441 1241968 1230060 1178331 1179176 1282378 1303329 1375129 1330510
10314 1330510 1198941 1298769 1299159 1316270 1358824 1345303 1172935 1039644 1124109 1148698 1074037
10303 1074037 980350 1038814 981397 1073543 1183470 1208351 1119108 1053576 1086158 1064821 1004095
10292 1004095 937094 974338 1034693 974372 1010444 944268 800019 804040 874231 864031 868579
10281 868579 688843 631523 810367 815348 852871 925386 869672 751785 826193 867554 876005
10270 876005 820626 815801 896473 975792 884266 778993 782412 811343 833778 864976 828870 713815
10258 713815 648892 566400 524126 584624 736498 674634 675579 653381 639061 548554 592277 600435
10246F00435J9193J04661J47947K6158r5670n8022K3292L6713K4024L9605J5624
10235H83960q6314M2991q8033j42140J04679K10333J18249O882q3434M1901j16723
10224H92351j71726J36534l2925O2912Q7398J27121q8107p2497Q0651Q9725L2202
10213A143639r157q798P1406k7448k8308L8858Q9921Q9018k5763k72879r0747
10202I69742O4508K2778O3245r435j4370K1018J61642M2537j38753J6318K6998
10191A226228L4141N0273J6258O7441j63773m6113J03013J04862j1858K530j43566
10180A239436J07502L227n1714M1138N9712j61370o2222R8617L9659R7060M533
10169A415578o7866p7216o4578n3740m4575J56045j5350j23330l2511J3607J1125
$$ plain form
10246 600435 619628 724289 872236 898394 802724 744702 767994 804707 828731 868336 883960
10235 883960 797646 840637 752604 610464 715143 925476 1043725 1050607 967173 1009074 892351
10224 892351 720625 857159 824234 887146 974544 1101665 1013558 941061 1021712 1111437 1143639
10213 1143639 1134482 1125684 1197090 1169642 1141334 1180192 1270113 1359131 1333368 1060489 969742
10202 969742 1034250 1057028 1120273 1110838 1096468 1117486 1279128 1321665 1182912 1199230 1226228
10191 1226228 1260369 1310642 1326900 1394341 1230568 1184455 1287468 1392330 1380472 1383002 1239436
10180 1239436 1346938 1350165 1298451 1339589 1399301 1237931 1175709 1274326 1313985 1411045 1415578
10169 1415578 1347712 1270496 1205918 1152178 1107603 1263648 1248298 1124968 1092457 1106064 1117189
10158A117189O727P4376o839j9154J5084r2q7383R151Q3174J1402p9727j19794
10146A004114o4449K3m8535Q9301l1956j81533n5572O8915O6484J80890j3131
10135A014551o3416K9908k35251p9951J4212M7090J46342m6523j26689L9281K8871
10124G68425N7299J14586K5136o5092j65482r2558k1013o5484j74685P9773J50357
10113F11262L4818o7438l7692j13948J8183J13713n3488j00679j78551P230K13795
10102D47205L7740p1050j12480Q0932K53306J20331j31384j9344M645L1262n0437
10091E90726o6138o9076o3872l7228j2200m98N1638J7054O8603m0902P0196L5256
10079E43559N3680R9085r2044p7432p2223L5043L1991n4603o2178q4464r289P6302
$$ plain form
10158 1117189 1123916 1198292 1191453 1172299 1187383 1187291 1099908 1109059 1192233 1203635 1123908 1004114
10146 1004114 939665 939688 891153 980454 948498 766965 711393 780308 846792 1027682 1014551
10135 1014551 951135 981043 745792 665841 680053 727143 873485 826962 700273 739554 768425
10124 768425 825724 940310 965446 900354 734872 642314 621301 555817 381132 460905 611262
10113 611262 646080 578642 540950 427002 445185 558898 505410 404731 226180 233410 447205
10102 447205 484945 413895 301415 382347 635653 755984 624600 605256 609901 641163 590726
10091 590726 524588 455512 391640 354412 342212 341714 393352 410406 479009 438107 508303 543559
10079 543559 597239 696324 604280 526848 454625 489668 521659 467056 404878 320414 311125 387427
10067C87427P5372R939j43263m2058j2685j7349Q0713n8963l0448o0806Q8738
10056B76617j376Q32J39748N5080r9499M6199J37898R9833p1588l6640Q691j53597
10044D02198r1299P5146J2174n8287J5500k3003J06380L4039k9768M8351L4784
10033E26215j13784k1771n0350K5693P1804n8280j30510k7004O6442M5867m8561
10022B85761N1867n2046p3505k179P1171q0544r2356O817N2556J03367N6576M5861
10010C73346N200j57791q9818J11135K9186p2209q4172J41441M3538m9853L0066
9999B80069L8545l4920p820O529N3364J19223K6111m6407p5968l8726p7271m1408
9987B01321J01478K1019q4530q160k9272j6773J2047L9395J4402M1456N0179Q8112
$$ plain form
10067 387427 462799 472738 329475 287417 274732 257383 338096 279133 248685 187879 276617
10056 276617 275241 276073 415821 470901 371402 417601 555499 655332 583744 547104 555795 402198
10044 402198 310899 386045 398219 339932 355432 332429 438809 472848 443080 491431 526215
10033 526215 412431 390660 340310 366003 437807 379527 249017 222013 288455 334322 285761
10022 285761 337628 285582 212077 209898 281069 200525 108169 114986 167542 270909 327485 373346
10010 373346 378546 220755 130937 242072 271258 199049 114877 256318 299856 250003 280069
9999 280069 318614 283694 275874 282403 335767 454990 481101 434694 358726 320000 242729 201321
9987 201321 302799 323818 239288 231128 201856 185083 197130 236525 250927 292383 342562 430674
9975D30674O9488n8998j64465n3830L9725K295L9094K05821o4162j09572l4351
9964C01719O868o4538J19130J02466Q614J16345Q1305J21518R5931k9541J013
9953H60830L74972O17014P33343N59326L23605M5709j28974l90230o73005o38113
9943A684477m22042k36255q7455j35630k14936L4807l3112j30211p8738K4906
9933D05811r6550k825K5306L5176M6755J42759l0115p7270K9786M3983n7110j0261
9921D55445o2810m7931k9856K48j4020P1778J3209M6742M0103j1635j6283j22744
9909C22246j22488j3107J01536N3554R544r3105J00262l9189N966P1247J10360
9898E06826J44454q9822j03504o5780j68535j47216n5431K5573P9114P5500k5414
$$ plain form
9975 430674 500162 441164 276699 222869 262594 264889 303983 509804 445642 336070 301719
9964 301719 308587 244049 363179 465645 474259 590604 671909 793427 889358 859817 860830
9953 860830 1235802 1852816 2586159 3145485 3469090 3514799 3385825 2995595 2322590 1684477
9943 1684477 1262435 1026180 938725 803095 588159 622966 589854 459643 380905 405811
9933 405811 309261 306436 331742 366918 413673 556432 526317 449047 478833 522816 465706 455445
9921 455445 392635 344704 314848 315096 301076 372854 386063 432805 472908 461273 444990 322246
9909 322246 199758 186651 288187 341741 351285 258180 358442 319253 325219 396466 506826
9898 506826 651280 561458 457954 392174 223639 76423 20992 46565 125679 201179 175765
9887A75765k1176J28935j0470n3545j1914N3722J16353p662j72829j45712q0657
9876b9190J64242O7033R6628p611P3519P2457n0598n6945j72107N7852O4946m4612
9864B35614n5559p2645J08577O096p9126P7701L3924l3203j3647P2829K15478
9853D96039M8865p2702Q9742N2975p7384r3888l9084n5680M3536J02641o1387
9842D33673q0085p8400O269n1841r4228l5424J30102n5847n0637N560K0194O9508
9830B18844J6954j7487J6499N9173Q958m6651j05514n6132J17327K0965p0012
9819A62924L7452r9316k4369N355o232M3483j1054n9078J088Q3256R1664P6096
9807C01269N0363q8723r3877o3343r372k3513o5203L7M5696R9242n3554j68783
$$ plain form
9887 175765 154589 283524 273054 219509 207595 261317 377670 370008 197179 51467 -29190
9876 -29190 135052 202085 298713 291102 364621 437078 386480 329535 157428 215280 280226 235614
9864 235614 180055 107410 215987 222083 142957 220658 254582 221379 207732 280561 496039
9853 496039 544904 472202 561944 614919 537535 443647 404563 348883 392419 495060 433673
9842 433673 353588 275188 281457 229616 135388 99964 230066 174219 123582 129142 149336 218844
9830 218844 235798 218311 234810 293983 302941 256290 150776 94644 211971 232936 162924
9819 162924 200376 101060 76691 82046 75814 119297 108243 49165 50253 133509 225173 301269
9807 301269 351632 262909 169032 105689 96317 72804 7601 7638 53334 152576 99022 -69761
9795f9761K8167J00869P9880r4937m3288L6353K3688k9085P9195K3990q4841P8378
9783A28608l7071L2027L3688m6165J8553R6882P8049k4858L3444J0233n1857r6704
9771A74829p2264L3911L1829K4410J05911j3600o1755O7805k6122N3463q1485
9760B36932j69410o9652O1029N8804m3758P638R520p1584Q0053Q078p6644j0267
9748B0739k4343J3459L0591k9022J5308J11560j6820R0717N5319n9817j41433
9737F6258K0485J0461J6980k003O0420j4301n9766l4061l3796L3674R408K4917
9725I8676M8192p86K6483M4946j5662p2074n0319l2206n9935q346m9579M3890
9713b6720K46958R5572j12531j39210m7923L1554O0995R969q6914M8325J46136
$$ plain form
9795 -69761 -41594 59275 139155 44218 930 37283 60971 31886 111081 135071 50230 128608
9783 128608 91537 123564 157252 111087 129640 226522 304571 279713 313157 323390 271533 174829
9771 174829 102565 136476 168305 192715 298626 285026 223271 291076 264954 318417 236932
9760 236932 67522 -2130 58899 117703 73945 81583 91103 19519 99572 107650 31006 20739
9748 20739 -3604 9855 40446 11424 26732 138292 121472 212189 267508 207691 66258
9737 66258 86743 97204 114184 112181 172601 158300 98534 64473 30677 64351 73759 98676
9725 98676 146868 146082 172565 217511 201849 129775 79456 47250 -12685 -21031 -70610 -26720
9713 -26720 220238 315810 203279 64069 16146 47700 108695 118664 31750 80075 226211
9702B26211M1271k8730N1071J15187m6478K6638N3558p1657m9191o7223m4083
9691B06574j6248j6988n5723L3648N06N0470M0574L612o2744M0830p293q6443
9679A30775j60035p2483O7316R5357j7051k9175J33248m094N7306o1367j07143
9668C2654O5681M3439O011R674M2183j5285m7470N1790O091K0537J3309j67438
9656F1176K2428Q9802O4777j1683o0936k2123p0028k5801K46002N611r0029l1906
9644A77290p3319n1908O1207J26601j00141n1315J79309j21847o9349P4114r129
9633A41513Q4650K0245N7897L6531K4485K4170r9991j38422n742k166q412J28757
9621B63515J00330n9842m763q3169K0374J2366l1766r4273j4548M7999J54053
$$ plain form
9702 226211 267482 238752 289823 405010 358532 385170 438728 367071 317880 250657 206574
9691 206574 190326 173338 117615 151263 151769 202239 242813 246425 183681 224511 217218 130775
9679 130775 -29260 -101743 -34427 60930 43879 14704 147952 143858 201164 139797 32654
9668 32654 98335 141774 147785 157459 199642 184357 136887 188677 194768 215305 228614 61176
9656 61176 83604 173406 238183 226500 165564 143441 73413 47612 293614 299225 209196 177290
9644 177290 103971 52063 113270 239871 139730 88415 267724 145877 76528 150642 141513
9633 141513 226163 246408 304305 340836 365321 389491 289500 151078 145336 143170 134758 263515
9621 263515 363845 304003 299240 216071 236445 248811 217045 122772 108224 156223 310276
9610C10276j20394k20780r3219J52239R0218K2838q7240j72372l9724O4199P1419
9599b2540J38492P5396M9023M4329l2392n4933l4744K3277J08046P9855j34654
9588B39155n1946r148L0201q669k6729j14428L4730K1151n285J7398l5903k1618
9576F8909J03163J3094q0635L7711K6447O9594k639k39953o6743P4563J6972p088
9564A3395O6768R5451L4381N547m0029J85M8004J05924L9440m5775k6953P9076
9552C75414Q7605l2220r8642p1653j00493m29j42768L0154j8698P3285k713k1034
9540G7808k517J02273J61784m7945q2690J831L523j1099j24114m2854l0491R3251
9528I8760Q3801n1053p4646J812J82759K1405p5284k3437K314j4396N9380L2690
$$ plain form
9610 310276 189882 -30898 -124117 28122 118340 141178 53938 -118434 -158158 -93959 -22540
9599 -22540 115952 191348 240371 284700 252308 197375 162631 185908 293954 373809 239155
9588 239155 187209 178061 208262 199593 172864 58436 93166 114317 109032 126430 90527 68909
9576 68909 172072 185166 104531 142242 168689 238283 235644 -4309 -71052 3511 20483 13395
9564 13395 80163 175614 209995 215542 175513 175698 223702 329626 369066 323291 296338 375414
9552 375414 463019 430799 332157 260504 160011 159582 16814 46968 28270 101555 98842 77808
9540 77808 75291 177564 339348 291403 208713 210544 214067 202968 78854 36000 5509 98760
9528 98760 182561 131508 56862 58674 241433 262838 187554 164117 166431 152035 211415 244105
9516B44105o8473J16509J4767j26759j2086L2404j9637Q39L547O2326m2481j983
9504B03078r647J28339P75O3111M1948j42305k6033J18846n4645r3164J54186
9493C84489R834n5039m1386J49038P0496j62164K1370k1267N6064J80244l0582
9482E61097k52296J6395n3744j14651k9574O3178l3658N0230N5201N385O8926
9471C36489n5546j6670M9193r9222q8620L3641J22327j9463l432K0422m1838L9596
9459B76877q6632q3833M8486R8765J5324j51653j19041O2936j2413j2101j8273
9448A8442L6060J10338Q3814O6581o6869r423Q3621Q6830l1806j16351o4470k447
9436A94320J01073L1507q0037L9541o5729K8083P1589K2009j26036Q3605J20935
$$ plain form
9516 244105 175632 292141 306908 180149 168063 200467 180830 181669 185216 247542 205061 203078
9504 203078 193431 321770 322545 385656 427604 285299 259266 378112 323467 230303 384489
9493 384489 394323 339284 297898 446936 517432 355268 376638 355371 411435 591679 561097
9482 561097 308801 325196 271452 156801 127227 190405 156747 206977 262178 267563 336489
9471 336489 280943 264273 313466 214244 125624 159265 281592 262129 258697 279119 237281 276877
9459 276877 190245 106412 154898 253663 268987 117334 -1707 61229 48816 36715 18442
9448 18442 54502 164840 248654 315235 248366 238943 322564 409394 377588 261237 196767 194320
9436 194320 295393 326900 246863 286404 220675 248758 320347 342356 216320 299925 420860
9425D20860J4596j0390q8680m9731K542J0460j20930N8504J70274M8563K00980
9414F57048J15608j21007j13496k0084j7911q5107J0190O3892j0628j4109Q7295
9403E51691Q0070j02469k6505Q1771l16p439o8525m5477O7977P8297R174J1505
9391F29754j02805o8298N6586Q0154O9555o0176j19977j6460J45303P372k2577
9380E98431o8907j32707j6820L6915J28471J32753P7581P2449M0964q1340l269
9369G84521j03232L7437j7896r5003j1088P895n0660m4293J55306R5919q1025
9358F77881m9888O2406J0676j4992P5392K8884R1369M1563n524p6314O2310r518
9346H94245p8163R8983O4955N592R5387k8803o5468L4728M2719R1021R1990n308
$$ plain form
9425 420860 435456 425066 336386 286655 289197 299657 178727 237231 407505 456068 657048
9414 657048 772656 651649 538153 518069 500158 415051 425241 489133 478505 464396 551691
9403 551691 631761 529292 502787 584558 584242 576803 508278 462801 530778 609075 618249 629754
9391 629754 526949 458651 515237 595391 664946 604770 484793 468333 613636 621008 598431
9380 598431 529524 396817 379997 416912 545383 678136 755717 828166 869130 787790 784521
9369 784521 681289 718726 700830 605827 594739 602634 551974 507681 662987 758906 677881
9358 677881 627993 690399 701075 686083 761475 790359 881728 923291 917767 841453 903763 894245
9346 894245 816082 915065 980020 985612 1080999 1052196 986728 1021456 1064175 1155196 1247186 1241878
9334A241878j41655r7744M986P3938Q0318O647l9816J5656J3234P2905O9185M9972
9322A349504q637l8832j5120n110j874Q8513m5085L4511M1527Q9288j12389K9518
9310A405814R8733J1401J35985K10750P9496l0998j35229l5876J17094R1545l2527
9299A916188l2173Q8355N3127Q120L4435L7975k3678R7354J59755m2170j33373
9288B163915J263J71331J71885J63469P3040J5817J06139K8299l6205N7877Q4845
9277C001675L5607P1359r2121Q5157L6069p570J63078J52782L513l3505P0177
9266C486221m5701q1012J13899J55044J74925J66836j5105n0031K7932l0049o6729
9255C836230K2695P9712J21274p834N9384K9629q1455k9648q5549o0050n8775
$$ plain form
9334 1241878 1100223 1002479 1007465 1081403 1161721 1168368 1128552 1144208 1157442 1230347 1299532 1349504
9322 1349504 1340867 1302035 1286915 1281805 1279931 1368444 1323359 1357870 1399397 1488685 1376296 1405814
9310 1405814 1504547 1515948 1651933 1862683 1942179 1911181 1775952 1740076 1857170 1948715 1916188
9299 1916188 1884015 1972370 2025497 2033617 2068052 2106027 2082349 2179703 2339458 2297288 2163915
9288 2163915 2165178 2336509 2508394 2671863 2744903 2760720 2866859 2895158 2858953 2916830 3001675
9277 3001675 3037282 3108641 3016520 3101677 3137746 3130176 3293254 3446036 3449549 3416044 3486221
9266 3486221 3440520 3359508 3473407 3628451 3803376 3970212 3955107 3905076 3933008 3902959 3836230
9255 3836230 3858925 3938637 4059911 4052077 4111461 4141090 4059635 4029987 3944438 3884388 3825613
9244C825613K8534Q0174m515K7925n1363k1740Q3835j9230o4803j4865J39553
9233D009118p9164n9127P8669J3690m4827j36461p3668j29844j160j18726k2213
9222C436287o3686q4719o4685N8669l4271j17181j71662J10192Q8646r75j76442
9211B980173q1390J1079L8170J899j27498j10411j10414p1871k7654l9204M0654
9200B503533k8344Q696K9590o2649j2548m7269j046j16252j52540q3206o1197
9189A976768n4707M6464P9209M1567o123m2364N5263r4183n9289j10935r0401
9178A741269j5265r6014K1579k209O9174M7600m30j18872j64777N3079j82807
9167A352327q0938O1576o9555q7600Q4609L6830R185N3024R3594N2963j67858
$$ plain form
9244 3825613 3854147 3934321 3929806 3957731 3906368 3884628 3968463 3949233 3884430 3869565 4009118
9233 4009118 3929954 3870827 3949496 3963186 3918359 3781898 3708230 3578386 3577226 3458500 3436287
9222 3436287 3372601 3287882 3223197 3281866 3247595 3130414 2958752 3068944 3157590 3156615 2980173
9211 2980173 2898783 2909862 2948032 2949931 2822433 2712022 2601608 2529737 2502083 2462879 2503533
9200 2503533 2475189 2483885 2513475 2450826 2438278 2391009 2389963 2273711 2121171 2037965 1976768
9189 1976768 1922061 1968525 2047734 2089301 2083178 2040814 2096077 2001894 1942605 1831670 1741269
9178 1741269 1726004 1629990 1651569 1649360 1718534 1766134 1765704 1646832 1482055 1535134 1352327
9167 1352327 1271389 1332965 1263410 1175810 1260419 1297249 1306434 1359458 1453052 1506015 1338157
9156A338157j17989J6479M7555j14038j13703k2871L0738j04077j3106M3656k813
9145I87988k495j2157l6333p4823Q4536M8724L6621k5846o7047p7224J2949M2526
9133I17419n089J0303j2960k8191m9523q093k7463K2147M9989k4506N0065k8696
9121H65402m3013N0335q5030r4557J3487q5361P0543N6095n0309q6219j05339
9110E06034O3454L0789K3719o0277j5784N7629j4433O2265n6828K3223j4942k5958
9098E78891K7558j00789j27677j3939k514J07465J59948Q7368P4688m6202K4484
9087G69281q4248K3051N1513j16737o8879n3413J8955P4950J53432q2136J6992
9076G02761M1411n4087j50047n2814J8789j32870l5302k1370J07247J1140n8115
$$ plain form
9156 1338157 1220168 1236647 1284202 1170164 1056461 1033590 1064328 960251 947145 990801 987988
9145 987988 985493 973336 937003 862180 946716 995440 1032061 1006215 939168 861944 874893 917419
9133 917419 912330 922633 909673 881482 831959 823866 796403 818550 868539 844033 894098 865402
9121 865402 822389 872724 787694 693137 706624 621263 691806 747901 697592 611373 506034
9110 506034 569488 600277 623996 563719 547935 605564 591131 653396 596568 619791 604849 578891
9098 578891 606449 505660 377983 364044 361530 468995 628943 716311 790999 744797 769281
9087 769281 685033 708084 759597 642860 573981 520568 539523 614473 767905 685769 702761
9076 702761 744172 690085 540038 487224 506013 373143 337841 316471 423718 434858 376743
9065C76743k9167k7060r537O2667Q5722m345l7802m4792M3049l1220n847J32648
9053E11059N4928m5199o9913L1328j9129q2594j7540j13292k441R6153R7305o7094
9041C73571M5461j5716j46418O2456R6197j9979J8354j0152J5611q9612q2908
9030B46865m6235P2341J9685K2015j42123m0248J25780J16431q5294q0307P4122
9019B83032N4165n7032R4991Q925j9209j23834J2575J10111p0930j29620M3907
9008B07081M0029l4784J7234P1151K5962n1820m6506N4047q639j18068l0950J02535
8996B27272P6579M9176k021k9952k9531J60142m1622j70000m4349N3152L2019
8985B80865L4429J59657J04855n0934j13756n9745J1518P9056o1036j29341q9986
$$ plain form
9065 376743 347576 320516 310979 373646 459368 455023 417221 372429 415478 384258 378411 511059
9053 511059 565987 520788 450875 482203 463074 380480 362940 249648 247207 343360 440665 373571
9041 373571 419032 403316 256898 319354 415551 395572 413926 403774 419385 329773 246865
9030 246865 200630 272971 292656 314671 172548 132300 258080 374511 289217 208910 283032
9019 283032 337197 280165 375156 384081 364872 241038 253613 363724 292794 163174 207081
9008 207081 247110 212326 229560 300711 326673 274853 228347 282394 273755 155687 124737 227272
8996 227272 303851 353027 351006 321054 291523 451665 410043 240043 195694 248846 280865
8985 280865 315294 474951 579806 528872 415116 355371 366889 445945 384909 255568 165582
8974A65582l7866P6344O9276O353k1424m2386L6610K0427r3842P6193m9601O1588
8962B67254j3356j45628m1460k5774J06250K1424J9591j45218M6592R4835n1154
8951A33356K945o274N5476L7299R0389k5626n142N3344O1941o9885N837K5030
8939C58690q2006j34222o7171j6043n382P9754N2492J68554r5661j69854J26346
8928B15497J21156m5408j27644n7767j13363j26288J11407J17300R2520M0389
8918B27799J299r4114j74719J4059Q9605N6095o6064p1830R5505J06601Q0180
8907B64416O0345j5299j3206p4769j67070j46000J3714O9761Q1900N8354J09367
8896B41513q8569m3375L091q1387o948R0044L5240j02178p0766M5609J29931P6918
$$ plain form
8974 165582 127716 204060 273336 279689 258265 215879 252489 272916 179074 255267 205666 267254
8962 267254 253898 108270 66810 41036 147286 168710 188301 43083 89675 184510 133356
8951 133356 136301 130027 185503 222802 313191 287565 282423 335767 397708 327823 333660 358690
8939 358690 276684 142462 75291 59248 53866 133620 186112 354666 259005 89151 215497
8928 215497 336653 291245 163601 105834 -7529 -133817 -22410 94890 187410 227799
8918 227799 229098 134984 -39735 -25676 63929 120024 53960 -17870 77635 184236 264416
8907 264416 324761 309462 296256 221487 54417 -91583 -77869 -8108 73792 132146 241513
8896 241513 152944 109569 112660 31273 24325 114369 149609 47431 -23335 22274 152205 229123
8884B29123n1870j70850m6136K9347O4461N3362n9158J3779L4932L1222K2301
8873A50513K8604J2343j59400N9960J58870J05400J54332J86418l585l4117r2741
8862E66597j63846j02935J1687M5836p2142o1389M5792J0029n1689n9398m4564
8851A23978l0569M2698J06979j3403P3543K4010n4332M2199P7523j27438k5427
8840B39761q2914j10379l5439j13765L5421N7236l9898R6595M1048k9460P827
8829F6033k9334l3689Q1817P5237J4971N3166j02694j6669K3645J7515M7898p8886
8817A19010j48318l4140q1790O8970j8474l5199L2055N4503J75231R1415L1939
8806B55202p3763L3821q550j0755r8264M4164M757o7065j0148l4808j7017J23183
$$ plain form
8884 229123 177253 6403 -39733 -10386 54075 107437 48279 62058 96990 128212 150513
8873 150513 179117 191460 32060 92020 250890 356290 510622 697040 693455 659338 566597
8862 566597 402751 299816 311503 357339 285197 223808 269600 279629 227940 168542 123978
8851 123978 93409 136107 243086 229683 303226 327236 272904 315103 392626 265188 239761
8840 239761 156847 46468 11029 -102736 -67315 -10079 -49977 46618 87666 58206 66033
8829 66033 36699 3010 84827 160064 175035 228201 125507 108838 132483 149998 197896 119010
8817 119010 -29308 -63448 -145238 -76268 -94742 -129941 -97886 -43383 131848 223263 255202
8806 255202 181439 215260 206710 195955 97691 141855 146612 79547 69399 34591 17574 140757
8794A40757o5349k2154j2521m1345K0893J6841L8883m4346n3117m6091L2151R9206
8782F3808N5919l2967o4431M7410N6763P1681L339l3172j23515O7425j8918J23900
8770B17242R6938r6622q5371l1403l1997J0038l8782K6441l2724o6644Q935J79865
8758A55916J70368q3027o7253k694Q3854J8668M3452O3964j00808j90914r5218
8747c692p5280n8683J17023J88063J36474j80120p1624K1857k642L7710l1254
8736G7832p8471m665K5347M8397o8267p0404L0826O5471Q5361j3386r2976m000
8724A065r070j4647m4319P4578J09420M4941p2723K7059L640L3759K8169P4681
8712B56553j11960L9745J08439M4649R3381N817j33745j88211m8748o0763Q3377
$$ plain form
8794 140757 75408 53254 40733 -612 20281 37122 76005 31659 -21458 -67549 -35398 63808
8782 63808 119727 86760 22329 69739 126502 198183 201522 168350 44835 112260 93342 217242
8770 217242 314180 217558 132187 100784 68787 78825 40043 66484 33760 -32884 -23949 155916
8758 155916 326284 243257 176004 173310 257164 275832 319284 383248 282440 91526 -3692
8747 -3692 -78972 -137655 -20632 167431 303905 123785 52161 74018 71376 109086 77832
8736 77832 -639 -5304 20043 68440 173 -70231 -39405 26066 111427 98041 5065 1065
8724 1065 -8005 -22652 -66971 7607 117027 161968 89245 116304 119944 153703 181872 256553
8712 256553 144593 184338 292777 337426 430807 436624 302879 114668 65920 5157 88534
8701H8534R2258m1937n0957J0373J33185N0705j1808j04007N1120m864M7994r5651
8689A64945l9384k0972M7150j2536p9639J21028J86264j0073Q2923L1059N7003
8678E27768K8359j25581r7928r634K281m3759j30496j28871M1202R9156O6042
8667B28539N1941M9627k3435q3165l6485l9962R1266R8849J02388j15908n7666
8656B65989R2414Q9837n107l6295o2505m6996j14352m9035J13097J21752O6572
8645D35371l6245R3851K9811j36185q8233r2623p2883J26634N7279q3710K8845
8634B61912N1567l4327Q0604J90718q27L6967Q0422N9705J1961j2531M2845J02816
8622H71832L905J0046p4437J22401O4495j01346o6403N9014k9428m5675J13910
$$ plain form
8701 88534 180792 138855 87898 98271 231456 282161 270353 166346 217466 212602 260596 164945
8689 164945 125561 104589 151739 139203 59564 180592 366856 356783 439706 470765 527768
8678 527768 556127 430546 332618 322984 325265 281506 151010 22139 63341 162497 228539
8667 228539 280480 330107 306672 223507 187022 147060 238326 337175 439563 323655 265989
8656 265989 358403 448240 443133 406838 344333 297337 182985 133950 247047 368799 435371
8645 435371 399126 492977 522788 386603 298370 205747 132864 259498 316777 233067 261912
8634 261912 313479 279152 359756 550474 549647 586614 667036 726741 738702 726171 769016 871832
8622 871832 875737 885783 811346 933747 998242 896896 830493 889507 860079 814404 928314
8611I28314N1500j7174j24661q9776N5168P1552p1659p6477J26166J02550j525
8600I53978n5323k9286l3445J4085k9077l2178J3351J9170o6541p2752j95476
8589D86506m4895n9166q73m3291j19557K1573J10112M0321M54J031m9599l0528
8577C12088P2922P5962K582m3435k0000k8874j30867R36j3999l7456J19780j7519
8565B92120J5504m0162J6126M9692j6778k7868j9411j07894j16255l0263l8930
8554b4119M1188J21477R2415J7606k12262J2848J18989L5382J53716K400m8728
8543C10912j453j7025j12483j47191j59088Q9826J4197R412J20781R3517m4363
8532A57042M6614m7965Q003n8728l9791J888M9153O2791j00230K3108P431q8649
$$ plain form
8611 928314 979814 962640 837979 748203 803371 874923 803264 726787 852953 955503 953978
8600 953978 898655 869369 835924 850009 820932 788754 802105 821275 754734 681982 486506
8589 486506 441611 382445 381572 338281 218724 240297 350409 390730 391184 392215 342616 312088
8577 312088 385010 460972 463554 420119 400119 371245 240378 241314 227315 189859 309639 292120
8565 292120 307624 267462 283588 333280 316502 288634 269223 161329 45074 14811 -24119
8554 -24119 17069 138546 230961 248567 36305 49153 168142 203524 357240 359640 310912
8543 310912 309459 292434 179951 32760 -126328 -36502 -22305 -12893 107888 201405 157042
8532 157042 203656 155691 163694 104966 65175 67063 116216 179007 78777 101885 109316 20667
8520B0667J2188L8440N5052K9536j3221l9777q9946J4785l036j02504j3401j2077
8508a03294O4904P5762J2912j5716o0975Q1584L0953p8126n9958O1607k1960R5110
8496H2803M4489j1369M0223m2572q0259J6029k8535j05757j30431m6968J80182
8485h2165M4005J8416O8122L0107J638r5168j7233O3186N8598L9508k1714o0387
8473D6913l7322K7719O4153j34244l1427q7953N3479o3318M6655J90902r3950
8462a8393j59192j1558M0455M1420J9600n2231R06R044n7219m6523O4938P0625
8450i8128j04180o7962N618J18993r548k5136J46372J68289m3579j0601N9475
8439A39613Q4166k5623l6574p3493o8080M1785N5173p353o8703j29660J9718J56161
$$ plain form
8520 20667 32855 71295 126347 155883 142662 102885 12939 27724 24688 -77816 -91217 -103294
8508 -103294 -38390 37372 50284 34568 -26407 55177 86130 8004 -51954 9653 -12307 82803
8496 82803 127292 115923 156146 113574 33315 49344 20809 -84948 -215379 -262347 -82165
8485 -82165 -38160 -19744 48378 78485 80123 -15045 -32278 30908 89506 129014 107300 46913
8473 46913 9591 37310 101463 -32781 -64208 -152161 -98682 -162000 -115345 75557 -18393
8462 -18393 -177585 -189143 -148688 -107268 -87668 -139899 -138993 -129949 -187168 -233691 -168753 -98128
8450 -98128 -202308 -270270 -264652 -145659 -155207 -180343 -33971 134318 90739 80138 139613
8439 139613 223779 198156 161582 88089 20009 61794 116967 109614 40911 -88749 -69031 87130
8427H7130j76739r2885P1625R5452R4235J04597N5321l0453k0639O1756n2744
8416A96656M834L6073j6571j041p2687n0933N4418K0195j35394q9561O0615O7268
8404G3872m2949j03116m2691O2032L2120L5428J11900n7491j49898R261K1818
8393d9714K4257R7260r6964m4887K6054J9808J9689q004K6858Q0162l4324l5697
8381B4498m593M3799J09626j0585k9544j9483j46398J6375K5948l0912J16507
8370I5238j700J2858j4660k1836m5110j00226m8784J07791J59792M4517J5911
8359B03791j3787r8965p4688K7037K0226o3933k8561J457l8666K9632J36988R5357
8347A95888k05122P9400J24045K9344n9094j7364n3904R3371K7238m7852l0145
$$ plain form
8427 87130 -89609 -182494 -110869 -15417 78818 183415 238736 208283 187644 249400 196656
8416 196656 201490 237563 220992 219951 147264 96331 150749 170944 35550 -54011 6604 73872
8404 73872 30923 -72193 -114884 -52852 -20732 14696 126596 69105 -80793 -71532 -49714
8393 -49714 -25457 71803 -25161 -70048 -43994 -24186 -4497 -12501 14357 94519 60195 24498
8381 24498 19905 63704 173330 162745 133201 113718 -32680 -16305 9643 -21269 95238
8370 95238 93538 106396 91736 69900 24790 -75436 -124220 -16429 143363 187880 203791
8359 203791 190004 91039 16351 43388 63614 -319 -28880 -27423 -66089 -36457 100531 195888
8347 195888 -9234 70166 194211 223555 164461 147097 93193 186564 213802 165950 135805
8336A35805m3639m6309J0581N5974n156k0840j8060M025J1242K3010J13944L3396
8324B53973j57527n7816N9498q4082j39369k9502M8474L7631l4868P178N8530
8313c7880K21088K715N463L0411p7971p8330m4173R921O0096m802P1020k9775
8301A27783o9855M718q1733K9384r539J32078L4260j31826k40971Q7183J07778
8290a0740J9503N4417j9458j04771l2969J19451M2460J25238J4698k9946K1910
8279A99793M4136N1630m6821k2188N9110P7532J5460j17108j19496p8406j112
8268F2530J19689M0159K5029m4152p4834j56078j8822K5407n669l2255J2525m5740
8256i2211R5194j3330L9289J21524K878r1857L9730R996k6527o1568q3892m3869
$$ plain form
8336 135805 92166 45857 56438 112412 107256 86416 68356 72381 83623 106633 220577 253973
8324 253973 96446 38630 98128 14046 -125323 -154825 -106351 -68720 -103588 -96410 -37880
8313 -37880 183208 185923 191386 221797 143826 65496 21323 31244 91340 86538 157558 127783
8301 127783 57928 62646 -19087 10297 758 132836 167096 35270 -205701 -118518 -10740
8290 -10740 8763 63180 43722 -61049 -94018 25433 67893 193131 207829 177883 199793
8279 199793 243929 295559 248738 226550 285660 363192 378652 261544 142048 63642 62530
8268 62530 182219 222378 247407 203255 128421 -27657 -46479 -21072 -26741 -58996 -46471 -92211
8256 -92211 2983 -10347 28942 150466 153344 61487 101217 111213 84686 23118 -60774 -104643
8244a04643Q8145J13599J3068q2907K588K8903L8640q894L0663J45157p4693q4633
8232A04993J564M4839q2875r6100l7507J7646J8821m5040Q1017R1968m6771q0804
8220b8249n7796K5536K1189L1211j5358o1130p7143l1977M9175Q5616J16798j2193
8208D5679l3594N6306k4352n1366k0951N2123N6345M7777m417K9095P727l5162
8196A25210r25K8197K6532j977M0774K1496q3176j09506j01562K640R5937k1656
8184B1984j25544O7593K9686q777l3309K4073J03118J04110j35632j04433J26955
8173F9824J68418P6549J4210n4611p8579m3074m2228j43188k2354J0804J108K9351
8161a3770J32225J45208J59196m003j71812j6857j6700M968r4780k09509l9190
$$ plain form
8244 -104643 -16498 97101 110169 27262 29850 58753 97393 88499 119162 264319 189626 104993
8232 104993 106557 151396 68521 -27579 -65086 -47440 -28619 -73659 7358 99326 52555 -28249
8220 -28249 -86045 -60509 -39320 -8109 -23467 -84597 -161740 -193717 -144542 -58926 57872 45679
8208 45679 12085 68391 44039 -7327 -28278 23845 80190 127967 123550 152645 160372 125210
8196 125210 124285 152482 179014 177037 217811 239307 156131 46625 -54937 -52297 43640 21984
8184 21984 -103560 -35967 -6281 -15058 -48367 -24294 78824 182934 47302 -57131 69824
8173 69824 238242 314791 329001 274390 195811 152737 110509 -32679 -55033 -44229 -43121 -13770
8161 -13770 118455 263663 422859 418856 247044 230187 213487 218455 123675 -85834 -125024
8150a25024Q5046O5432N8192k9523M0767l8109m2418J61781K8684l9998l1306
8139A33524M2993j25239n4186J2698L1833j30952m1065k1545j4139J14866J62349
8128A11137N3796J0470n2000m7162n8076J3696J20058r4652Q188j2928M1248R6062
8116A89837o646M5170J7615k5527l7827j7905j03487n4944M5989J02939k9642
8105A25572Q022j12709k2639m7265j11940J3182K0320K1023J10324k3209J00623
8094H1304J23698N8825j80164p8338P204O7205L7534N155J808q0623R5014K8664
8082A67286k2001j17954o5492Q8385J36599O933P08o6674n1574J0470j6138k7573
8070D2975N8438M4094q5984j54584j681K07667Q3607j03838r3022J1115J7406
$$ plain form
8150 -125024 -39978 25454 83646 54123 94890 56781 14363 176144 204828 164830 133524
8139 133524 176517 51278 -2908 9790 41623 -89329 -130394 -151939 -166078 -51212 111137
8128 111137 164933 175403 123403 76241 18165 31861 151919 57267 65455 52527 93775 189837
8116 189837 183191 228361 245976 220449 182622 164717 61230 6286 52275 155214 125572
8105 125572 133594 20885 -1754 -49019 -160959 -147777 -127457 -106434 3890 -19319 81304
8094 81304 205002 263827 83663 5325 12529 79734 117268 122423 124231 43608 138622 167286
8082 167286 145285 27331 -38161 50224 186823 193756 194464 127790 76216 86686 70548 42975
8070 42975 101413 145507 59523 -95061 -96742 110925 194532 90694 -2328 8787 26193
8059B6193j37351J8313L7858j9396M0578J2999k6281J35157J61159k7335m4617
8048A77277N7289O2536o4009m6915L5204K4260j2673J54899J73355q8804j41288
8037C31131n1374j3551n6091J24040J30144J17083J8179m5180j42170p5115R4438
8026D31534L1093j21315m4207k7448k6284p320J02891l2871m4552J04582J94101
8015E60204p864K1341m7058K5012P0547J5347P4806K08567J21558K2726m7174
8004A018012m418J3395j10149j93082q1829K2356K2069o0334K3268K03748m3499
7993H09537o3325M2236j19918n8491n6807r2266j89224j3107J46766R5079K9931
7982E30411k8496r8104k6762j3294M4599P5387K53m7280J00369J81833j16826
$$ plain form
8059 26193 -111158 -92845 -54987 -74383 -33805 -20806 -47087 88070 249229 221894 177277
8048 177277 234566 297102 233093 186178 221382 245642 232969 387868 561223 472419 331131
8037 331131 279757 266206 210115 334155 464299 581382 599561 554381 412211 337096 431534
8026 431534 462627 341312 297105 269657 243373 236053 338944 306073 261521 366103 560204
8015 560204 552340 573681 526623 551635 622182 637529 712335 920902 1042460 1065186 1018012
8004 1018012 1013594 1026989 916840 723758 641929 664285 686354 626020 649288 853036 809537
7993 809537 746212 788448 668530 610039 553232 460966 271742 258635 405401 500480 530411
7982 530411 501915 403811 377049 363755 408354 483741 483994 436714 537083 718916 602090
7971F02090j46619N6636j9482J6713l0897O507R8713J48483N8136j408K7836M8310
7959H65018l5585J09735p2848r2350J2284k6699r8621L5212O9752K1807j38886
7948F48819o8154j98304j24742J0859J8896l2248r4613k9m7578J35351l4966k3134
7936A90157j3654R6877J6249p4375l1656j3421K2125j50312l7692J87499J49075
7925C40872P8275k4601o4884K1939R8396k2729N2775o0617j3963j36333L486P2401
7913C45017r037m1080j16814j37284M9548J66408O5034o8194m4460k2595j71135
7902A5408j7270J3928p2321Q697M12Q0790M0330r3661n265Q5989J31571J2621
7890B01229n3248Q0079j3667l7284j41182o1451M7307P8027O9770J6412j6352
$$ plain form
7971 602090 455471 512107 492625 509338 478441 484948 583661 732144 790280 788872 816708 865018
7959 865018 829433 939168 866320 773970 786254 759555 660934 696146 765898 787705 648819
7948 648819 580665 382361 257619 268478 287374 255126 160513 160484 112906 248257 213291 190157
7936 190157 176503 273380 289629 215254 183598 170177 192302 41990 4298 191797 340872
7925 340872 419147 394546 329662 351601 449997 427268 480043 419426 405463 269130 272616 345017
7913 345017 335980 294900 178086 40802 90350 256758 321792 253598 209138 186543 15408
7902 15408 -1862 12066 -60255 -51558 -51146 29644 69974 -23687 -28952 57037 188608 201229
7890 201229 147981 228060 214393 177109 35927 -25524 21783 99810 169580 185992 169640
7879A69640M0199o5119o8092k6634j8915L8829P2868r776l9847J20367J1809j07703
7867A17626J32662j6799l1427o2107l4870j74541o0429J32817j5059j2535J0612
7856a4050L245k6686j03289O7875L4423o0640j1091j5836N6916L5837L4762m7738
7844d6272J7882L5849R9924M0838q5021j58580M3181J02538J11l1192m9038J07674
7832G7894M200r4455m21j3069M8894Q0356R6710r7254m2225p5411o4974l6629
7820a16384k4464l3745j33016K1657l6805L5823J10972J43847N7751l5278J5306
7809E664m0127Q5285J2837P4265r3509j48678K314k9749J5328M3321P4433K0410
7797B1794j28297N7430J22571m7470j35694n378j8230N0520q1573O8538J5799
$$ plain form
7879 169640 209839 144720 76628 49994 31079 69908 142776 133000 93153 213520 225329 117626
7867 117626 250288 233489 202062 139955 105085 -69456 -129885 2932 -12127 -24662 -14050
7856 -14050 -10805 -37491 -140780 -72905 -38482 -99122 -110213 -126049 -69133 -33296 1466 -46272
7844 -46272 -28390 7459 107383 148221 63200 -95380 -52199 50339 50450 19258 -29780 77894
7832 77894 82094 -12361 -12782 -25851 23043 103399 200109 102855 60630 -14781 -79755 -116384
7820 -116384 -140848 -174593 -307609 -285952 -322757 -286934 -175962 -32115 25636 -9642 5664
7809 5664 -34463 50822 63659 137924 44415 -104263 -101949 -131698 -116370 -73049 1384 21794
7797 21794 -106503 -49073 73498 26028 -109666 -115044 -133274 -82754 -164327 -95789 -79990
7786g9990J2202O5342j2057j45721r3322p3281J14927Q8682K3742M1930Q3774
7775B6228J3421o3392j5089J10435L2550l2656j37761n1576R2890O4297N5986
7764I5333l1999m5683R8057J1895j01655q8439m9431R8767j5395J4423k6388n2122
7752i2637O8436j7091J2613J36549l9334o2569o2540n0420l3234K2024K8922J44695
7740E5414J98362j21465n5072J6159j34270q0373j12270l1151L9475O2029J73074
7729I912Q2J5751L3846K120q8622j07338o2598M3582J3601l300J22102k2890j6620
7716f0372J59787K2920j50938j9501o5776j06767J57940R2699j25981j25129J1036
7705b10082J05101K2943J70822M3982j47565j27831O1525J06110N5080O2532j1133
$$ plain form
7786 -79990 -67788 -2446 -14503 -160224 -253546 -326827 -211900 -123218 -99476 -57546 26228
7775 26228 39649 -23743 -38832 71603 104153 71497 -66264 -117840 -24950 39347 95333
7764 95333 63334 17651 115708 127603 25948 -62491 -111922 -13155 -28550 -14127 -40515 -92637
7752 -92637 -24201 -41292 -28679 107870 68536 5967 -56573 -106993 -140227 -118203 -89281 55414
7740 55414 253776 132311 77239 93398 -40872 -121245 -233515 -264666 -225191 -163162 9912
7729 9912 9994 25745 59591 61711 -26911 -134249 -196847 -153265 -139664 -142964 -20862 -43752 -60372
7716 -60372 99415 122335 -28603 -48104 -113880 -220647 -62707 29992 -95989 -221118 -210082
7705 -210082 -104981 -82038 88784 132766 -14799 -142630 -81105 25005 80085 142617 131484
7694A31484m0090n7440N0531R6737n3239j52295j10439M8012J23851j08852J7101
7683e4639P7459L5796m0157o0996q2119J43680J30482k7729n4744m1265p5038
7672d9270Q9986M1604l9493m4830l6693o895J46208K8953q1189l071K7284n1072
7660B1522n974J0874J0827j8134Q1228K1011j21412o7785K8259N3512Q094N289
7648B7311N3680j0202J13789L7052p6533r9758O2236l4519q26m3194J08290q304
7636A29022j15968j07205R1738O6563J22014N2397j35231q8749l3454O4701J40984
7625A86812L7130m6359L0366n2992j06477n2139P4308l0401p2054r0194R189l479
7613a16290j19478J07805P6038k5015o5795J5927N1244k7502L855J31831J15816
$$ plain form
7694 131484 91394 33954 84485 181222 127983 -24312 -134751 -86739 37112 -71740 -54639
7683 -54639 22820 58616 18459 -42537 -124656 19024 149506 121777 67033 25768 -49270
7672 -49270 40716 82320 42827 -2003 -38696 -45591 100617 129570 48381 45310 72594 21522
7660 21522 15548 26422 37249 19115 100343 121354 -58 -67843 -39584 13928 22022 27311
7648 27311 80991 70789 184578 221630 145097 45339 107575 73056 72230 29036 137326 129022
7636 129022 13054 -94151 -2413 64150 186164 238561 103330 14581 -18873 45828 186812
7625 186812 223942 177583 207949 154957 48480 -3659 70649 40248 -31806 -122000 -112811 -116290
7613 -116290 -235768 -127963 -51925 -76940 -142735 -126808 -75564 -103066 -99211 32620 148436
7602A48436m4746m9393j55n5054k8469k8089m0254N3435K4260P405p2073q0240
7590a64937l6651j1943J012J31504J51887J3136J6842q4221K0528m1927m2839
7579d7609j17583p379J30103K2015k6695j27337j3312J65993j5162L6184J4472
7568A3690r6065l1238M5637J98265J16352n7390j07357p4296p8210j23998K4978
7557a69632J30724Q0897j02065j19206o391j1821L2211P5632J716j2067J46145
7546D6143m4851l6088l2541j20673N7417J00958M881j22909k0544p2218n282J24637
7534a21070k159r3905R2288Q7900P9565O0574R0986m6417n6272p1501p035J6465
7522B9419j62559p5620l9094n3581J62843L1673p7919M4650j1950Q3195j633J03207
$$ plain form
7602 148436 103690 54297 54142 -912 -29381 -57470 -97724 -44289 -20029 -12624 -84697 -164937
7590 -164937 -201588 -213531 -212519 -81015 70872 84008 100850 16629 37157 -4770 -47609
7579 -47609 -165192 -172571 -42468 -20453 -47148 -174485 -187797 -21804 -36966 -782 13690
7568 13690 -82375 -113613 -67976 130289 246641 189251 81894 7598 -70612 -194610 -169632
7557 -169632 -38908 41989 -60076 -179282 -185673 -197494 -165283 -89651 -87935 -100002 46143
7546 46143 1292 -34796 -67337 -188010 -130593 -29635 -24754 -147663 -168207 -240425 -245707 -121070
7534 -121070 -123229 -217134 -124846 -36946 42619 103193 194179 147762 91490 19989 12954 29419
7522 29419 -133140 -208760 -247854 -301435 -138592 -106919 -184838 -140188 -152138 -68943 -70576 32631
7510C2631J17222l037k3863o3951K9017j7537j50477j2705N5610J03089m907o5016
7498c924J49479L1264j31686R50J12484K8768o9464q3324j34070p0089M7166M4204
7486g8242j0056j6532L7415j8028k0685K400N7837J03848O0067q2155j17315r6832
7474a78278M6550R4388K1765j4289K5005N9725J6965j12695l2784m3350j02228
7463b19226J2181K653P1598N9447P4616q1569j2120R9229J4343K8720P3508o1635
7451F1745P8362R501r3909o3431j33322p944m1260r1411N8697j4145K6353J18179
7439i2585l3327M702J23029N4703p4105l0876J49030O7963j31551m697P0636L0617
7427A33539j6434M6253L3684N9531j06890O9972N2488j74792j79008O3882k3950
$$ plain form
7510 32631 149853 146816 122953 59002 88019 70482 -79995 -92700 -37090 65999 61092 -3924
7498 -3924 145555 176819 45133 46083 158567 187335 117871 34547 -99523 -169612 -122446 -78242
7486 -78242 -88298 -104830 -67415 -85443 -106128 -103728 -45891 57957 118024 35869 -81446 -178278
7474 -178278 -131728 -37340 -15575 -29864 -4859 54866 71831 -40864 -73648 -116998 -219226
7463 -219226 -207045 -204392 -132794 -73347 1269 -80300 -92420 6809 21152 49872 123380 61745
7451 61745 140107 149608 55699 -7732 -141054 -148998 -190258 -281669 -222972 -237117 -210764 -92585
7439 -92585 -125912 -121210 1819 56522 -17583 -48459 100571 168534 36983 32286 102922 133539
7427 133539 117105 163358 197042 256573 149683 219655 272143 97351 -81657 -17775 -41725
7416d1725l9076l5644p7598r186K8531J07812J34923K9950M7844k9691l191r3932
7404A9017m839K2201j5548k8339l3176j78278p815J19919K1593O4975J67420l3408
7392A13722j36470O5145j03389K9260J20274K4673j6704l3610P7752P5015q2925
7381A32743n1842J881J04328O6897q4333j60850m1907q687k6149l7710Q2861J11874
7369H9106J36384o0820j94304J03433L8352l4553m1716q6912L0937o2284j1304
7358i3681n3788J2921J36616J02343K6666R176Q383l6628j5341J2192m2823n7087
7346H949o0273o3543L1556L4851J8535o6487n9845K3515m1723q9390J41301P5325
7334d7229M2286O5785k4264j22068m1827J17315M0184o0790O5014L0403q148k9702
$$ plain form
7416 -41725 -80801 -116445 -194043 -203229 -174698 -66886 68037 97987 145831 116140 112949 19017
7404 19017 14178 36379 20831 -7508 -40684 -218962 -226777 -106858 -85265 -20290 147130 113722
7392 113722 -22748 42397 -60992 -31732 88542 113215 96511 62901 140653 215668 132743
7381 132743 80901 82782 187110 254007 169674 8824 -33083 -41770 -67919 -105629 -22768 89106
7369 89106 225490 164670 -29634 73799 112151 77598 35882 -51030 -20093 -82377 -93681
7358 -93681 -147469 -134548 2068 104411 131077 140253 148636 112008 96667 108859 66036 8949
7346 8949 -51324 -114867 -83311 -48460 -29925 -96412 -156257 -132742 -174465 -263855 -122554 -47229
7334 -47229 -4943 60842 36578 -85490 -127317 -10002 30182 -30608 34406 64809 56661 26959
7322B6959K4621M3304m7686j07018m6464q301J20716N997J03949j3490j34773
7311c2186K8593j1890l8394J13190k1011k50292L3488j05611n5194K2168J11314
7300b05825J70895J38791J483j15000L2350O2126j61507j7185j6484m6328k6022
7289a82706L0834j4775P808J81265O863p1920L0480M6498M3310N9598K9945L6364
7277B03564n5369r3225n6082o076j641k7868r2225j8643k845O5764N1317R244
7265b4085p3842q1845R5622j3440K3646O6070m4487l2528J04472l4464O370P2943
7253F4432J1845K4273j8628o5687p5138p6897m1476J5317K5845N333K3340m6322
7241a53763n8294J4473M1500R868j5856O9862k5077K7247J627j8219N022P353
$$ plain form
7322 26959 51580 94884 47198 -59820 -106284 -114585 6131 12128 116077 102587 -32186
7311 -32186 -3593 -15483 -53877 59313 38302 -211990 -178502 -284113 -339307 -317139 -205825
7300 -205825 -34930 103861 105344 -9656 22694 84820 -76687 -93872 -110356 -156684 -182706
7289 -182706 -151872 -166647 -158839 22426 29289 -42631 -12151 34347 77657 137255 167200 203564
7277 203564 148195 54970 -1112 -7188 -8829 -36697 -128922 -147565 -150410 -84646 -33329 -24085
7265 -24085 -97927 -179772 -84150 -97590 -73944 -7874 -52361 -84889 19583 -14881 -8511 64432
7253 64432 76277 100550 81922 16235 -58903 -135800 -177276 -161959 -136114 -130781 -107441 -153763
7241 -153763 -212057 -197584 -156084 -146216 -162072 -92210 -117287 -90040 -88413 -106632 -101610 -94257
7229i4257o7509M4590J18604J4728p2116l1143J20500P0453k2385j62994l0652
7218a12181J74841J08360L7594q6182j92872K1849J27697J06047o8263j13711
7208C179j8088R802j7964O3625J12758M6088m673j25239p3329n1915M0094J91548
7196A75886O375j66493p4810R752j4279J33647o3374j02708J0956n0697R6355
7185c9390N3267j02775r3157k7669J88945J11768P420l0229n1774p5826j60961
7174b20381N648P1638l5677K2381J7630K7898J19576P4639n1366m8818K5969N7514
7162F6651L9433K8650m5836m5164P320j5796K5792L2527o3950N2479J02522M1597
7150B26225n9475j00053r8322J7772q2681J10333R9265n9897j05509q5649N0470
$$ plain form
7229 -94257 -161766 -117176 1428 16156 -55960 -87103 33397 103850 81465 -81529 -112181
7218 -112181 62660 171020 208614 122432 -70440 -48591 79106 185153 116890 3179
7208 3179 -14909 -5107 -23071 40554 153312 199400 194727 69488 -3841 -55756 -15662 175886
7196 175886 182261 15768 -59042 -49290 -63569 70078 6704 -96004 -85048 -135745 -39390
7185 -39390 13877 -88898 -182055 -209724 -20779 90989 98409 68180 16406 -59420 -220381
7174 -220381 -214733 -143095 -178772 -156391 -138761 -110863 8713 83352 31986 -16832 9137 66651
7162 66651 106084 134734 88898 43734 51054 35258 61050 93577 29627 82106 184628 226225
7150 226225 166750 66697 -31625 -13853 -96534 13799 113064 53167 -52342 -137991 -87521
7139h7521n4263P2238Q3767j35282l007Q1273J13579P5878P0886r1744m5219o1215
7127A9370L7343n9050j22708o7694J12142J16191l8510o1713p7426k7109n924
7116a75088J7103j34947q5110J08269Q4316j263P5467j7009Q1620O9473N1354
7105G4185p0116j06855N834N2553M1111K1002J1475l4127j6488r4398m8057J9895
7093a43986n0876p7051m8012M1846J52379P9832L2745j15927q1250P0964k9538
7082a68874K8128J9127N663M1507K9016K1562j0082K1789J579j23102k6173L541
7070a56319P5844M7152Q7056k1758K4144J31833R4846j03460j51484o8427j40476
$$ plain form
7139 -87521 -141784 -69546 14221 -121061 -124068 -42795 70784 146662 217548 125804 80585 19370
7127 19370 56713 -2337 -125045 -192739 -80597 35594 -2916 -64629 -142055 -169164 -175088
7116 -175088 -157985 -292932 -378042 -269773 -185457 -186720 -111253 -128262 -46642 22831 74185
7105 74185 4069 -102786 -96952 -44399 -3288 17714 29189 -4938 -21426 -115824 -163881 -143986
7093 -143986 -194862 -271913 -319925 -278079 -125700 -45868 -13123 -129050 -210300 -139336 -168874
7082 -168874 -140746 -121619 -115956 -74449 -45433 -23871 -33953 -12164 -10585 -133687 -159860 -156319
7070 -156319 -80475 -33323 53733 31975 56119 187952 282798 179338 27854 -40573 -181049
$$ [...]
##END NTUPLES=NMR SPECTRUM
##END=
