##TITLE=Analysis number 320559
Compound Code cc 49704
Book Reference 423/78/4
Project Code adrs
Chemist Name bruced
##JCAMPDX= 6.0         $$ Bruker NMR JCAMP-DX V2.0
##DATA TYPE= NMR SPECTRUM
##DATA CLASS= NTUPLES
##ORIGIN= Bruker BioSpin GmbH
##OWNER= nmr
$$ XWIN-NMR		Version 3.5
$$ Thu Jun 29 12:59:41 2006 GMT Daylight Time (UT+1h)  MAYBRIDGE\nmr@NMR_250MHZ
##.OBSERVE FREQUENCY= 250.131544655141
##.OBSERVE NUCLEUS= ^1H
##.ACQUISITION MODE= SIMULTANEOUS (DQD)
##.ACQUISITION SCHEME= undefined
##.AVERAGES= 16
##.DIGITISER RES= 18
##SPECTROMETER/DATA SYSTEM= dpx250
##.PULSE SEQUENCE= zg30
##.SOLVENT NAME= CDCl3
##.SHIFT REFERENCE= (INTERNAL, CDCl3, 0, 16.522)
##AUDIT TRAIL= $$ (NUMBER, WHEN, WHO, WHERE, WHAT)
$$ ##TITLE= Audit trail, XWIN-NMR		Version 3.5
$$ ##JCAMPDX= 5.01
$$ ##ORIGIN= Bruker BioSpin GmbH
$$ ##OWNER= nmr
$$ C:\u/data/dgb/nmr/ADRS/1860/pdata/1/auditp.txt
$$ ##AUDIT TRAIL=  $$ (NUMBER, WHEN, WHO, WHERE, WHAT)
(   1,<2006-06-29 12:59:17.65 +100>,<MAYBRIDGE\nmr>,<NMR_250MHZ>,
      <created by zg, POWCHK disabled, PULCHK disabled
       configuration hash MD5:
       E2 DF 36 D8 04 B2 41 60 5A D7 A3 38 5A 4B D0 FE
       data hash MD5: 64K
       AD 7A 63 D1 7D 00 18 6E 13 9A 08 2D A5 9F 00 D4>)
(   2,<2006-06-29 12:59:31.66 +100>,<MAYBRIDGE\nmr>,<NMR_250MHZ>,
      <Start of raw data processing
       ef LB = 0.3 FT_mod = 6 PKNL = 1 SI = 32K 
       data hash MD5: 32K
       06 78 64 F3 C4 31 57 C6 2C 8C 0E 52 6C 5E 6A F0>)
(   3,<2006-06-29 12:59:33.30 +100>,<MAYBRIDGE\nmr>,<NMR_250MHZ>,
      <apk 
       data hash MD5: 32K
       29 83 17 68 0D 90 3D 85 5E 12 4E 6B 2E 3F 8A EB>)
(   4,<2006-06-29 12:59:34.12 +100>,<MAYBRIDGE\nmr>,<NMR_250MHZ>,
      <abs ABSG = 5 
       data hash MD5: 32K
       18 58 5D 47 99 98 D3 AD 6B 95 A2 FA 5E DD 53 58>)
$$ ##END=
$$ 
$$ hash MD5
$$ 62 19 D8 EF 75 6A D6 1B 16 8D 9E 9C 59 68 6D 85
##$RELAX= 
##$RELAX= 
##$RELAX= 
##$RELAX= 
##$RELAX= 
##$RELAX= 
##$RELAX= 
$$ Bruker specific parameters
$$ --------------------------
##$DU= <C:\u>
##$EXPNO= 1860
##$NAME= <ADRS>
##$PROCNO= 1
##$TYPE= <nmr>
##$USER= <dgb>
##$AMP= (0..31)
100 100 100 100 100 100 100 100 100 100 100 100 100 100 100 100 100 100 
100 100 100 100 100 100 100 100 100 100 100 100 100 100 
##$AQSEQ= 0
##$AQ_mod= 3
##$AUNM= <au_zg>
##$AUTOPOS= <34 >
##$BF1= 250.13
##$BF2= 250.13
##$BF3= 250.13
##$BF4= 250.13
##$BF5= 500.13
##$BF6= 500.13
##$BF7= 500.13
##$BF8= 500.13
##$BYTORDA= 1
##$CFDGTYP= 0
##$CFRGTYP= 5
##$CHEMSTR= <none>
##$CNST= (0..31)
1 1 145 1 1 1 1 1 1 1 1 1 1 1 1 1 1 1 1 1 1 1 1 1 1 1 1 1 1 1 1 1 
##$CPDPRG= <>
##$CPDPRG1= <>
##$CPDPRG2= <>
##$CPDPRG3= <>
##$CPDPRG4= <mlev>
##$CPDPRG5= <mlev>
##$CPDPRG6= <mlev>
##$CPDPRG7= <mlev>
##$CPDPRG8= <mlev>
##$CPDPRGB= <>
##$CPDPRGT= <>
##$D= (0..31)
0 1 0 0 0 0 0 0 0 0.06 0 0 0 0 0 0 0.0002 0 0 0 0 0 0 0 0 0 0 0 0 0 0 
0 
##$DATE= 1151582356
##$DBL= (0..7)
120 120 120 120 120 120 120 120 
##$DBP= (0..7)
150 150 150 150 150 150 150 150 
##$DBP07= 0
##$DBPNAM0= <>
##$DBPNAM1= <>
$$ [...]
##$SUBNAM7= <"">
##$SUBNAM8= <"">
##$SUBNAM9= <"">
##$SW= 20.6930455092707
##$SWIBOX= (0..15)
0 0 3 0 0 0 0 0 0 0 0 0 0 0 0 0 
##$SW_h= 5175.983436853
##$TD= 65536
##$TD0= 1
##$TE= 296.16
##$TE2= 300
##$TE3= 300
##$TEG= 300
##$TL= (0..7)
0 120 120 120 120 120 120 120 
##$TP= (0..7)
150 150 150 150 150 150 150 150 
##$TP07= 0
##$TPNAME0= <>
##$TPNAME1= <>
##$TPNAME2= <>
##$TPNAME3= <>
##$TPNAME4= <>
##$TPNAME5= <>
##$TPNAME6= <>
##$TPNAME7= <>
##$TPOAL= (0..7)
0.5 0.5 0.5 0.5 0.5 0.5 0.5 0.5 
##$TPOFFS= (0..7)
0 0 0 0 0 0 0 0 
##$TUNHIN= 0
##$TUNHOUT= 0
##$TUNXOUT= 0
##$USERA1= <user>
##$USERA2= <user>
##$USERA3= <user>
##$USERA4= <user>
##$USERA5= <user>
##$V9= 5
##$VALIST= <valist>
##$VCLIST= <CCCCCCCCCCCCCCC>
##$VD= 0
##$VDLIST= <DDDDDDDDDDDDDDD>
##$VPLIST= <PPPPPPPPPPPPPPP>
##$VTLIST= <TTTTTTTTTTTTTTT>
##$WBST= 1024
##$WBSW= 4
##$XGAIN= (0..3)
0 0 0 0 
##$XL= 0
##$YL= 0
##$YMAX_a= 675421
##$YMIN_a= -779129
##$ZGOPTNS= <>
##$ZL1= 120
##$ZL2= 120
##$ZL3= 120
##$ZL4= 120
##$ABSF1= 16.522
##$ABSF2= -4.171173
##$ABSG= 5
##$ABSL= 3
##$ALPHA= 0
##$AQORDER= 0
##$ASSFAC= 0
##$ASSFACI= 0
##$ASSFACX= 0
##$ASSWID= 0
##$AUNMP= <proc_1d>
##$AZFE= 0.1
##$AZFW= 0.1
##$BCFW= 0
##$BC_mod= 0
##$BYTORDP= 0
##$COROFFS= 0
##$CY= 12.5
##$DATMOD= 1
##$DC= 0
##$DFILT= <>
##$DTYPP= 0
##$F1P= 14.0000005364418
##$F2P= -0.99999901652339
##$FCOR= 0.5
##$FTSIZE= 32768
##$FT_mod= 6
##$GAMMA= 0
##$GB= 0
##$INTBC= 1
##$INTSCL= 1
##$ISEN= 128
##$LB= 0.3
##$LEV0= 0
##$LPBIN= 0
##$MAXI= 10000
##$MC2= 0
##$MEAN= 0
##$ME_mod= 0
##$MI= 0
##$NCOEF= 0
##$NC_proc= -3
##$NLEV= 6
##$NOISF1= 0
##$NOISF2= 0
##$NSP= 0
##$NTH_PI= 0
##$NZP= 0
##$OFFSET= 16.522
##$PC= 1
##$PHC0= 169.537
##$PHC1= 6.212235
##$PH_mod= 1
##$PKNL= yes
##$PPARMOD= 0
##$PSCAL= 4
##$PSIGN= 0
##$REVERSE= no
##$SF= 250.13
##$SI= 32768
##$SIGF1= 0
##$SIGF2= 0
##$SINO= 400
##$SIOLD= 32768
##$SREGLST= <1H.CDCl3>
##$SSB= 0
##$STSI= 32768
##$STSR= 0
##$SW_p= 5175.98343685301
##$SYMM= 0
##$S_DEV= 0
##$TDeff= 65536
##$TDoff= 0
##$TI= <Analysis number 999999
Compound Code 99
Book Reference 9
Project Code 9>
##$TILT= no
##$TM1= 0
##$TM2= 0
##$TOPLEV= 0
##$USERP1= <user>
##$USERP2= <user>
##$USERP3= <user>
##$USERP4= <user>
##$USERP5= <user>
##$WDW= 1
##$XDIM= 32768
##$YMAX_p= 435258168
##$YMIN_p= -160448
$$ End of Bruker specific parameters
$$ ---------------------------------
##NTUPLES= NMR SPECTRUM
##VAR_NAME=  FREQUENCY,     SPECTRUM/REAL,   SPECTRUM/IMAG
##SYMBOL=    X,             R,               I
##VAR_TYPE=  INDEPENDENT,   DEPENDENT,       DEPENDENT
##VAR_FORM=  AFFN,          ASDF,            ASDF
##VAR_DIM=   32768,         32768,           32768
##UNITS=     HZ,            ARBITRARY UNITS, ARBITRARY UNITS
##FACTOR=    0.157963299565203, 1,           1
##FIRST=     4132.6476996994, 0,             0
##LAST=      -1043.33573715361, 0,           0
##MIN=       -1043.33573715361, -160448,     0
##MAX=       4132.6476996994, 435258168,     0
$$ Real data points
##PAGE= N=1
##DATA TABLE= (X++(R..R)), XYDATA
$$ [...]
16708B39146n114j192J5j0899K199J7998k3707j6205j273R797Q395K908m496k8740
$$ 239146 234032 232840 232855 221956 224155 242153 218446 202241 200968 210765 219160 222068 217572 188832
16694A88832j0960m9M692p459r919j6549j4122j027L619M245M079q782j2292J450
$$ 188832 177872 177823 182515 175056 165137 148588 134466 133439 137058 141303 145382 136600 124308 125758
16680A25758L247P934Q516J0670M731o340p868j4349K312m535l726n777o07L773
$$ 125758 129005 136939 145455 156125 160856 154516 146648 132299 134611 130076 126350 120573 119966 123739
16666A23739O149j160p303j3410l751j0448J360J2488J860j140k0693j8119j3448
$$ 123739 129888 128728 121425 108015 104264 93816 95176 107664 109524 108384 87691 69572 56124
16653E6124r544m527j958J8723j0767N934J6186j6920k3723j1682j2665k789O964
$$ 56124 46580 42053 40095 58818 48051 53985 70171 53251 29528 17846 5181 2392 9356
16640I356n545K336l94j1523O3m389L835K0916J0805j199J421J4743q675k2541
$$ 9356 3811 6147 5753 -5770 -5707 -10096 -6261 14655 25460 24261 25682 40425 31750 9209
16626I209r447Q523J0311p886j379J1173n104q101n631j1317M751J9386R009j027
$$ 9209 -238 8285 18596 10710 9331 20504 15400 7299 1668 -9649 -4898 14488 23497 22470
16612B2470K002L551K649k020k0660P811J1964J0035J1052j2414J832J1727l994
$$ 22470 24472 28023 30672 28652 7992 15803 27767 37802 48854 36440 38272 49999 46005
16599D6005N14J1541K614l927M51M897n793k4970o321M85J4832o520k0029N274
$$ 46005 46519 58060 60674 56747 57198 62095 56302 31332 25011 25496 40328 33808 13779 19053
16585A9053P552J2320m836j5501R416M181m562j1375K410l795p576J8065M294
$$ 19053 26605 38925 34089 18588 28004 32185 27623 16248 18658 14863 7287 25352 29646
16572B9646k096n677r358j4079k806M423J5258O473J166j0969q085M357q477j0582
$$ 29646 27550 21873 12515 -1564 -4370 53 15311 21784 22950 11981 3896 8253 -224 -10806
16558a0806M027J1436R62J855q727m042L25R515J8630J891j1352J1014J3398j0232
$$ -10806 -6779 4657 5619 7474 -1253 -5295 -4970 4545 23175 25066 13714 24728 38126 27894
16544B7894j558m832j3446P600J3100L777m15J823j5593j3036p999n46J0540N562
$$ 27894 26336 21504 8058 15658 28758 32535 32120 33943 18350 5314 -2685 -3231 7309 12871
16530A2871J078J0026Q146n817o253J5452p890p504N08J5491k025N352J0571P026
$$ 12871 13949 23975 32121 26304 20051 35503 27613 20109 20617 36108 34083 39435 50006 57032
16516E7032N92P80J315q299n885O72n015q608L52J1217L847j9312j1982j646k1415
$$ 57032 57624 58404 59719 51420 45535 46207 41192 32584 32936 44153 48000 28688 16706 15060 -6355
16501f355j1344M862J1197R843q038j3411k151Q866J4309L306j8440j1450J3080
$$ -6355 -17699 -12837 -1640 8203 165 -13246 -15397 -6531 7778 11084 -7356 -18806 -5726
16488e726P405l809j4043r212J1269J1084j8180o046J3077Q069j8800K999K6600
$$ -5726 1679 -2130 -16173 -25385 -14116 -3032 -21212 -27258 -14181 -6112 -24912 -21913 4687
16475D687K639j207r85P987R480J7278P250q307k437r599j059m277l654n781o94
$$ 4687 7326 6119 5134 13121 22601 39879 47129 38822 36385 26786 25727 21450 17796 12015 11321
16460A1321P351R167j571m100j354j0590n246j2226K2603J3777j3019n88K346
$$ 11321 18672 27839 26268 22168 20814 10224 4978 -7248 15355 29132 16113 15525 17871
16447A7871Q889M705J5825m81N446P273q54o03m202j2558N985O609j3285j45j192
$$ 17871 26760 31465 47290 46809 52255 59528 58674 58071 53869 41311 47296 53905 40620 40475 39283
16432C9283j5078L801O617n695l124m649J105p05k241o211J1089N134q015j854
$$ 39283 24205 28006 34623 28928 25804 21155 22260 21555 19314 13103 24192 29326 21311 19457
16418A9457J156r712N963N496M087J2317k347j2245J906O456R973R008j3055q566
$$ 19457 20613 10901 16864 22360 26447 38764 36417 24172 26078 32534 42507 51515 38460 29894
16404B9894l194J495j0849j7127J5754J3584J748L504l21o02L652Q324p014J657
$$ 29894 26700 28195 17346 219 15973 29557 31305 34809 34488 33886 37538 45862 38848 40505
16390D0505J4011Q798P627L468j1852p119l121J152j2055k275P874N162P761J1492
$$ 40505 54516 63314 70941 74409 62557 55438 52317 53469 41414 39139 47013 52175 59936 71428
16376G1428l300l970L899Q86l168K1823K3423J4308K6051L1395J8368J9529L8115
$$ 71428 68128 64158 68057 68943 65775 87598 111021 125329 151380 182775 201143 220672 258787
16363B58787L5240K9774K4463K7213M4929M0251M2006M2263K1684J8152O679P598
$$ 258787 294027 323801 348264 375477 420406 460657 502663 544926 566610 584762 591441 599039
16351E99039p399m229j1676j9072j4556j7114l9570l3227l8241n2988l9641k5369
$$ 599039 591640 587411 575735 556663 542107 524993 485423 452196 413955 360967 321326 295957
16339B95957l3923k3206l4839k4470J002L394m680J2703K1580K4184K2053J1687
$$ 295957 262034 238828 203989 179519 180521 183915 179235 191938 213518 237702 259755 271442
16327B71442L4279L9748M6141M9529M1822L7245L2072M3542L9336q872l562J9532
$$ 271442 305721 345469 391610 441139 482961 520206 552278 595820 635156 626284 622722 642254
16315F42254q58n058J0089q499m5163l5017n2905m7957m1602m2721l8528k8816
$$ 642254 641396 636338 646427 637928 592765 557748 504843 456886 415284 372563 334035 305219
16303C05219k5773l6189l1773l3543k7354j7463l588l290r697j5177j3811q094
$$ 305219 279446 243257 211484 177941 150587 133124 129536 126246 116549 101372 87561 79467
16291G9467J1747n597j0546j364R413l383j2335j8370m697J723p29r73K896J1
$$ 79467 91214 85617 75071 73707 83120 79737 67402 49032 44335 46058 45329 44356 47252 47263
16277D7263j498n220o045m408l732J6044j1228r013J2741P822J775k376o234K968
$$ 47263 45765 40545 34500 30092 26360 42404 31176 22163 34904 42726 44501 42125 35891 38859
16263C8859M262o724j4791j284P002l051j1459p20m180o445K785J1087L85N610
$$ 38859 43121 36397 21606 20322 27324 24273 12814 12094 7914 1469 4254 15341 15726 21336
16249B1336J218j4825l708O651m996J929J3779J3942j1537q154l659j0790N120
$$ 21336 22554 7729 4021 10672 5676 7605 21384 35326 23789 15635 11976 1186 6306
16236F306m227o864r18j751J5320k309j3407k52J0380l230j4812j872L8o84j010
$$ 6306 2079 -4785 -5703 -7454 7866 5557 -7850 -8102 2278 -952 -15764 -17636 -17598 -18282 -19292
16221a9292O989J0289P793K766J1908J1656j286j1164J796l361j4798p685j134
$$ -19292 -12303 -2014 5779 8545 20453 32109 30823 19659 21455 18094 3296 -4389 -5523
16208e523O558o88p130L737j201P255J1317n191r342P752J6316O461l458j644
$$ -5523 1035 347 -6783 -3046 -4247 3008 14325 9134 -208 7544 23860 30321 26863 25219
16194B5219j0845m254N290j9697p903m263j433J9188J8460n7j186k2850j5247
$$ 25219 14374 10120 15410 -4287 -12190 -16453 -17886 1302 19762 19705 18519 -4331 -19578
16181a9578M1O272M513J2636J3739j2598j1690M556l61m905j1389J2241j947P561
$$ -19578 -19537 -13265 -8752 3884 17623 5025 -6665 -2109 -2470 -7375 -18764 -6523 -8470 -909
16167i09J5500n90m157Q533j896m247K986K320J0759P720r036O286j162j0456
$$ -909 14591 14001 9844 18377 16481 12234 15220 17540 28299 36019 26983 33269 32107 21651
16153B1651j0464o562L400l842l793O33l015K914K156L41j384o688P010j377j0432
$$ 21651 11187 4625 8025 4183 390 1023 -1992 922 3078 3419 2035 -4653 2357 980 -9452
16138i452l447R393l676m356M729j901j6352J223o014O56M421R929O717R509l140
$$ -9452 -12899 -3506 -7182 -11538 -6809 -8710 -25062 -23839 -29853 -29197 -24776 -14847 -8130 1379 -1761
16123a761L267N376j781R041l924j5298k787j2614J71J7048J1892l560j2493p56
$$ -1761 1506 6882 5101 14142 10218 -5080 -7867 -20481 -20310 -3262 8630 5070 -7423 -8179
16109h179P091O097r881o552J135n47O281j1154m55K359N034Q095j4393j093P726
$$ -8179 -1088 5009 -4872 -11424 -10289 -10836 -4555 -15709 -16164 -13805 -8771 -676 -15069 -16162 -8436
16094h436J4618l198q209m007m788J859J5046j681J522N576k148R631j4272q67
$$ -8436 6182 2984 -5225 -9232 -14020 -12161 2885 1204 2726 8302 6154 15785 1513 646
16080F46k736l646j693q442J9766J5076n030N763J471R16j9J1553q749n384j3282
$$ 646 -2090 -5736 -7429 -15871 3895 18971 13941 19704 21175 22091 22072 33625 24876 19492 6210
16065F210J1123J4579M483O628k0688j7003j0283o084j149O222O107J0319K516
$$ 6210 17333 31912 36395 43023 22335 5332 -4951 -11035 -12184 -5962 145 10464 12980
16052A2980j0022r70m716K581Q004j979j1001q447q62n048M299R352J1873p825
$$ 12980 2958 1988 -2728 -147 7857 5878 -5123 -13570 -14432 -19480 -15181 -5829 6044 -1781
16038a781k089K4119R826j309l101M894J3609J4282j6740j0856j271j3140M11
$$ -1781 -3870 20249 30075 28766 25665 30559 44168 58450 41710 30854 29583 16443 16854
16025A6854j2761n683J5330R138L627J411p655j7260k106L556l897j2078J089
$$ 16854 4093 -1590 13740 22878 26505 27916 20261 3001 895 4451 554 -11524 -10435
16012a0435J6300J0172l692L559o832j1234n829j4003n680L881j946P576R199
$$ -10435 5865 16037 12345 15904 9072 -2162 -7991 -21994 -27674 -23793 -25739 -18163 -8964
15999h964L22j029Q294m729n594j2127R530o627q782R597R203Q547R813N683k133
$$ -8964 -8642 -9671 -1377 -6106 -11700 -23827 -14297 -20924 -29706 -20109 -10906 -2359 7454 13137 11004
15984A1004o847n162J2508M841n066q916N649O344j5557j3593P635J3529J0377
$$ 11004 4157 -1005 11503 16344 11278 2362 8011 14355 -1202 -14795 -7160 6369 16746
15971A6746j8J4386J6743q704j558J745p453o431M589p49j278l15r382l226o788
$$ 16746 16728 31114 47857 39153 37595 39340 31887 25456 30045 29296 28018 27703 18321 15095 8307
15956H307J0208J7286K113k926q129j1661R248q517j3569r429N994j0359R320
$$ 8307 18515 35801 37914 34988 26859 15198 24446 15929 2360 -7069 -1075 -11434 -2114
15943b114J4108k654q023l976k852L896j6294n204J094K1843k231l39M198J888
$$ -2114 11994 9340 1317 -2659 -5511 -1615 -17909 -23113 -22019 -176 -2407 -2746 1452 3340
15929C340k538J4953m111k8179J197P100p455K859O084J8124m130o307M590m948
$$ 3340 802 15755 11644 -16535 -15338 -8238 -15693 -12834 -6750 11374 7244 937 5527 579
15915E79o084J73K572m145P685j0440k618L325R620q326P615k685J607k934m73
$$ 579 -5505 -5332 -2760 -6905 780 -9660 -12278 -8953 667 -7659 -44 -2729 -1122 -4056 -4529
15900d529J0982K222K648J382q160J324p187o455J295N000o984j1085J0064J717
$$ -4529 6453 8675 11323 12705 4545 5869 -1318 -7773 -6478 -1478 -8462 -19547 -9483 -7766
15886g766o927J8248o033q472R706R190M138j0998l899O401p350N487J1458K3386
$$ -7766 -14693 3555 -2478 -10950 -1244 7946 12084 1086 -2813 3588 -3762 1725 13183 36569
15872C6569l890j1763o089j981m736k4201j0746L834K845O078l454r437J1572
$$ 36569 32679 20916 14827 12846 8110 -16091 -26837 -23003 -20158 -14080 -17534 -26971 -15399
15859a5399O199J343n418L835n685K135p18p543J0033J4815Q686K683j8271J0491
$$ -15399 -9200 -7857 -13275 -9440 -15125 -12990 -13708 -21251 -11218 3597 12283 14966 -3305 7186
15845G186J5263o727j1945j691p584L80n789q198n94K496R275J1069q337l65J789
$$ 7186 22449 15722 3777 2086 -5498 -5118 -10907 -19105 -19699 -17203 -7928 3141 -5196 -5561 -3772
15830c772J8258L533o137j3515p797m761n104N003j892O746J8034m255r115m876
$$ -3772 14486 18019 11882 -1633 -9430 -14191 -19295 -14292 -16184 -9438 8596 4341 -4774 -9650
15816i650J6561J2416p123n197k985K76N066N836R767n667j1469q812j1145p421
$$ -9650 6911 19327 12204 7007 4022 4298 9364 15200 24967 19300 7831 -981 -12126 -19547
15802a9547P844J1772K942O423J11j1577j1677O491j2467j2208R016J3181j0596
$$ -19547 -11703 69 3011 9434 9545 -2032 -13709 -7218 -19685 -31893 -22877 -9696 -20292
15789b0292j420P352l723L641J1562l970k1099o373K489J440O87R350J4540n966
$$ -20292 -21712 -14360 -18083 -14442 -2880 -6850 -27949 -34322 -31833 -30393 -29706 -20356 -5816 -11782
15775a1782p496m087j167O554K1194j1848k5567k34j701p724j154J2449K2481
$$ -11782 -19278 -23365 -24532 -17978 3216 -8632 -34199 -34433 -36134 -43858 -45012 -32563 -10082
15762a0082O895j3382J604J0013k730p535M500k723Q360J02n418l478J7933k183
$$ -10082 -3187 -16569 -14965 -4952 -7682 -15217 -10717 -13440 -5080 -4978 -10396 -13874 4059 1876
15748A876j1485L645L939L923j232m560p237p049K845M988p8p359m608M357R696
$$ 1876 -9609 -5964 -2025 1898 666 -3894 -11131 -18180 -15335 -10347 -10425 -17784 -22392 -18035 -8339
15733h339N458L170J076r879K725L736Q277k541L054j061L332j3426m809m2K704
$$ -8339 -2881 289 1365 -8514 -5789 -2053 6224 3683 6737 5676 9008 -4418 -9227 -9269 -6565
15718f565o681L139k167K318K537O921O0l550K472j0094k437J2075j2271k578
$$ -6565 -13246 -10107 -12274 -9956 -7419 -498 -438 -3988 -1516 -11610 -14047 -1972 -14243 -16821
15704a6821J1623L126J4617O136m600Q87p547K84n03j4009K403r158q541R165
$$ -16821 -5198 -2072 12545 18681 14081 14968 7421 7705 7202 -6807 -4404 -13562 -22103 -12938
15690a2938j271k47M373J0364R842n076q101p49L147n865r365N306O032j966l658
$$ -12938 -14209 -14456 -10083 281 10123 5047 -3054 -3803 -656 -6521 -15886 -10580 -4548 -6514 -10172
15675a0172R099j2746j1813J6069N188k954o074O422R200P965l207p550K726k440
$$ -10172 -1073 -13819 -25632 -9563 -4375 -7329 -13403 -6981 2219 10184 6977 -573 2153 -287
15661b87O126R424o588q982l664j5404N657M216j3989J4958J914j0705o435K903
$$ -287 5839 15263 8675 -307 -3971 -19375 -13718 -9502 -23491 -8533 -6619 -17324 -23759 -20856
15647b0856J6370K072j3126r848N382O183n370n761K178J3949K2392l086k474
$$ -20856 -4486 -2414 -15540 -25388 -20006 -13823 -19193 -24954 -22776 -8827 13565 10479 8005
15634H005P74j9591m196J2320j378j1726M421n757j242P406J0260K405l956J633
$$ 8005 8779 -10812 -15008 -2688 -4066 -15792 -11371 -17128 -18370 -10964 -704 1701 -2255 -622
15620f22Q705n194K360O550M08j2315p716M401n068p982k267P176N449q627K940
$$ -622 8083 2889 5249 11799 12207 -108 -7824 -3423 -8491 -16473 -18740 -11564 -6115 -14742 -11802
15605a1802N43K889J0889P154Q036j799r938j5149j3888m642R078l55J0328o269
$$ -11802 -11259 -8370 2519 9673 17709 15910 5972 -9177 -23065 -27707 -18629 -18984 -8656 -14925
15591a4925O575O66L185j023L005m032l537j112O850J1646q245r569j4610J2322
$$ -14925 -8350 -7684 -4499 -5522 -2517 -6549 -10086 -11198 -4348 7298 -947 -10516 -25126 -12804
15577a2804N909j444R504j3676o422n200Q323N333P607m086K228j1100L290M146
$$ -12804 -6895 -8339 1165 -12511 -18933 -24133 -15810 -10477 -2870 -6956 -4728 -15828 -12538 -8392
15563h392m352j920N382r345o968n841m339o81Q267K078N867M392R689n1N319
$$ -8392 -12744 -14664 -9282 -18627 -25595 -31436 -35775 -36456 -28189 -26111 -20244 -15852 -6163 -6214 -895
15548h95l388j2625r181n229k787N002J7620m314K393j293O883l006j9172j434
$$ -895 -4283 -16908 -26089 -31318 -34105 -29103 -11483 -15797 -13404 -14697 -7814 -10820 -29992 -31426
15534c1426J3950J4458k575K01M902k197n87j1463k588n448m387j42J2565J442
$$ -31426 -17476 -3018 -5593 -5392 -490 -2687 -3274 -14737 -17325 -22773 -27160 -27302 -14737 -13295
15520a3295o365k498Q025m333J130J3709J63j2854j912j1873Q839P176J7206O207
$$ -13295 -19660 -22158 -14133 -18466 -17336 -3627 -3464 -16318 -18230 -30103 -21264 -14088 3118 9325
15506I325m178j7054m908m203N884K040L704M181J217j372j0211n636m148k106
$$ 9325 5147 -11907 -16815 -21018 -15134 -13094 -9390 -5209 -3992 -5364 -15575 -21211 -25359 -27465
15492b7465N002J761K3420J3948O354q274j4013o700M989o141r008J2869J3104
$$ -27465 -22463 -20702 2718 16666 23020 14746 733 -5967 -978 -7119 -16127 -3258 9846
15479I846q201j4112M499n15n290l010k60k357P922Q325R144M995l332j697k786
$$ 9846 1645 -12467 -7968 -8483 -13773 -16783 -17043 -19400 -11478 -3153 5991 10986 7654 5957 3171
15464C171k4925L513J6196L597m043j6137o317M255J1664r68J102K302L777q27
$$ 3171 -21754 -18241 -2045 1552 -2491 -18628 -24945 -20690 -9026 -9994 -8892 -6590 -2813 -3640
15450c640L658q58K755j8981l192P70o107R091j0262L304J219P290J5470r771
$$ -3640 18 -840 1915 -17066 -20258 -19488 -25595 -16504 -26766 -23462 -22243 -14953 517 -9254
15436i254r761P246L234J6702o988j2619J3011L648j5491p981q2o153k75K183
$$ -9254 -19015 -11769 -8535 8167 1179 -11440 1571 5219 -10272 -18253 -18335 -24488 -24763 -22580
15422b2580K976N678M340J667n437J85j3354k809O466P581K043m705j5030J015
$$ -22580 -19604 -13926 -9586 -7919 -13356 -13171 -26525 -29334 -22868 -15287 -13244 -17949 -32979 -31964
15408c1964O429P829m898K428R635R44P13N067K1921M280l037l020k1830j5464
$$ -31964 -25535 -17706 -22604 -20176 -10541 -9597 -8884 -3817 18104 22384 19347 16327 -5503 -20967
15394b0967P352P550K544M123M820o514o32P174K459r577J1262O382L501q511
$$ -20967 -13615 -6065 -3521 602 5422 -1092 -1724 5450 7909 -1668 9594 15976 19477 10966
15380A0966o574N19J4150j1939n549J1136k898j7266Q358p945j6783L458K09m10
$$ 10966 4392 4911 19061 7122 1573 12709 9811 -7455 903 -7042 -23825 -20367 -20158 -20568
15366b0568l795l307P379J6529N88k741K395P142n492J0808J32J952n987j0411
$$ -20568 -24363 -27670 -20291 -3762 -3174 -5915 -3520 3622 -1870 8938 9070 11022 5035 -5376
15352e376n989K438J704J014N425O919J266k0410r231J4432J1182q773n324P555
$$ -5376 -11365 -8927 -7223 -6209 -784 6135 7401 -13009 -22240 -7808 3374 -5399 -10723 -3168
15338c168R393Q871r606j2882q446P946J981L76j1980M969J3242J0171J0966j1449
$$ -3168 6225 15096 5490 -7392 -15838 -7892 -5911 -5535 -17515 -12546 696 10867 21833 10384
15324A0384j3967n514Q122R586K290j2161q736N875J5723k920m93J947j077R4
$$ 10384 -3583 -9097 -975 8611 10901 -1260 -9996 -4121 11602 8682 8189 10136 9059 9153
15310I153R47N691j2235j447N077q632r035K665J483k849J4562q667Q02M714r39
$$ 9153 10100 15791 3556 2109 7186 -1446 -10481 -7816 -6333 -9182 5380 -3287 -2485 2229 1290
15295A290j0532P655J0889J704M028j0072n09K262J3723N28J038q330j0125m953
$$ 1290 -9242 -1587 9302 11006 15034 4962 4453 6715 20438 20966 22004 13674 3549 -1404
15281a404n325l824O338J2995J359P036m405l95l270j6491r868M606L305j4174
$$ -1404 -6729 -10553 -4215 8780 10139 17175 12770 12375 9105 -7386 -17254 -12648 -9343 -23517
15267b3517n016J897O288K7322O654K793N889o926k8502q78l321L78P88j499J2213
$$ -23517 -28533 -26636 -20348 6974 13628 16421 22310 15384 -13118 -13996 -17317 -16939 -16151 -17650 -5437
15252e437n217n94J3113N384m246j4545l778R060O099m113L03L84P050Q239j0622
$$ -5437 -10654 -11248 1865 7249 3003 -11542 -15320 -6260 -161 -4274 -3971 -3587 3463 11702 1080
15237A080J928J2987M565L57J955j6411J1734l680k5523m600N824J2497J56r902
$$ 1080 3008 15995 20560 20917 22872 6461 18195 14515 -11008 -15608 -9784 2713 2869 -7033
15223g033j3266O270Q153O437m612k849M500q519m840K564J7236R60j1948j0279
$$ -7033 -20299 -14029 -5876 561 -4051 -6900 -2400 -10919 -15759 -13195 4041 5001 -6947 -17226
15209a7226J3745k584o66N582j0069j7817N395M762n337M767J5067J2745j3150
$$ -17226 -3481 -6065 -6731 -1149 -11218 -29035 -23640 -18878 -24215 -19448 -4381 8364 -4786
15196d786q834m020k302K582O281j060o928O318k495j4999r711J2158J3598Q268
$$ -4786 -13620 -17640 -19942 -17360 -11079 -12139 -19067 -12749 -15244 -30243 -39954 -27796 -14198 -5930
15182e930J4271q336j6699m13O693m208L018Q960n733l94q571j4164Q847R589
$$ -5930 8341 5 -16694 -17107 -10414 -14622 -11604 -2644 -8377 -8771 -17342 -31506 -22659 -13070
15168a3070j132j2077J4697Q940m767j888M960j1696r593N819k419M388L93M684
$$ -13070 -14202 -26279 -11582 -2642 -7409 -9297 -4337 -16033 -25626 -19807 -22226 -17838 -17445 -12761
15154a2761M741Q402N410p400j4168j0607j825J0626J2111R330j457L492J1460
$$ -12761 -8020 382 5792 -1608 -15776 -26383 -28208 -17582 -5471 3859 2402 5894 17354
15141A7354L302k1623k5069k462o596Q458N109J551R981R549N238j1131O495m065
$$ 17354 20656 -967 -26036 -28498 -35094 -26636 -21527 -19976 -9995 -446 4792 -6339 156 -3909
15127c909j1754j876K67J165N188Q431M160l632l139R083o550n120K740J597l634
$$ -3909 -15663 -17539 -17272 -16107 -10919 -2488 1672 -1960 -5099 3984 -2566 -7686 -4946 -3349 -6983
15112f983n354P640r010j9427Q512K870n879j3473O387J0332K0739N307r302N179
$$ -6983 -12337 -4697 -13707 -33134 -24622 -21752 -27631 -41104 -34717 -24385 -3646 1661 -7641 -2462
15098b462n360M737K059q96j131L507N982q547m695N72J5509o444O74R377o136
$$ -2462 -7822 -3085 -1026 -1922 -3053 454 6436 -2111 -6806 -6234 9275 2831 3505 12882 6746
15083F746n293K324p413R421R021j0444K395M532j0869j3144n406N850K3013O642
$$ 6746 1453 3777 -3636 5785 14806 4362 6757 11289 420 -12724 -18130 -12280 10733 17375
15069A7375J0412j568j3477m306M697J0583j1741j0008j866l700n487j085j0997
$$ 17375 27787 26219 12742 8436 13133 23716 11975 1967 101 -3599 -9086 -10171 -21168
15056b1168q335J3113j647N578J2314R048p470j3217r895p302J1395J9997n883
$$ -21168 -29503 -16390 -18037 -12459 -145 8903 1433 -11784 -21679 -28981 -17586 2411 -3472
15043c472j2525O912L877J278J0182k752P446q330j8144L151J4818Q791j4132
$$ -3472 -15997 -9085 -5208 -3930 6252 3500 10946 2616 -15528 -12377 2441 11232 -2900
15030b900j2449k540n447N088Q999J5481J7098Q320p32J938p001k1770j0610M285
$$ -2900 -15349 -17889 -23336 -18248 -9249 6232 23330 31650 30918 32856 25855 4085 -6525 -2240
15016b240j2177P596Q217J223K05p6r949J070L163M463O265k085j0523j1124P2
$$ -2240 -14417 -6821 1396 2619 2824 2748 -7201 -6131 -2968 1495 7760 5675 -4848 -15972 -15900
15001a5900O259J147L868Q26k744l197m374n959J0337N804r893L543l559K292
$$ -15900 -9641 -8494 -4626 -3800 -6544 -9741 -14115 -20074 -9737 -3933 -13826 -10283 -13842 -11550
14987a1550J0011J905j865P001J1876n226M651K5237J9582J3267K800n916k9596
$$ -11550 -1539 366 -1499 5502 17378 12152 16803 42040 61622 74889 77689 71773 42177
14974D2177l1031k766L323N866j0286j9134r304jN742j891N49R036J1997L645
$$ 42177 11146 8380 11703 17569 7283 -11851 -21155 -21156 -15414 -17305 -16756 -7720 4277 7922
14960G922r807M483p289L458J1297r196J949L071j733r873L652Q188j1892j3817
$$ 7922 -1885 2598 -4691 -1233 10064 868 2817 5888 4155 -5718 -2066 6122 -5770 -19587
14946a9587N551Q195J5840r57j020J1506K262J453m530p179l512O306J0974N33
$$ -19587 -14036 -5841 9999 9042 8022 19528 21790 23243 18713 11534 8022 14328 25302 25835
14932B5835l159m873N892l421j1811m18m196p280k944j468R765N669j866o31M593
$$ 25835 22676 17803 23695 20274 8463 8045 3849 -3431 -6375 -7843 1922 7591 5725 5094 9687
14917I687L335M617M88p882k034q750L09j3812j6373J6089J1438O389l569k4427
$$ 9687 13022 17639 18127 10245 8211 -539 -230 -14042 -30415 -14326 -2888 3501 -68 -24495
14903b4495j1718O254R856q117J0965K2986L606n450l295N428O885m598Q618P029
$$ -24495 -36213 -29959 -20103 -28220 -17255 5731 9337 3887 592 6020 12905 8307 16925 23954
14889B3954J0684j2888j2719q774j892q156J214K457j526K605R412P78j3976l185
$$ 23954 34638 21750 9031 257 -1635 -9791 -8577 -6120 -7646 -5041 4371 5149 -8827 -12012
14875a2012l46p457o64n705J6141Q378j2139o169r223M662J3920o581N558N630
$$ -12012 -12358 -19815 -20479 -26184 -10043 -1665 -13804 -19973 -29196 -24534 -10614 -17195 -11637 -6007
14861f007P451J3923L803k1167j0027M991O934Q514J5040o263j2221J3715J1227
$$ -6007 1444 15367 19170 -1997 -12024 -7033 -99 8415 23455 17192 4971 18686 29913
14848B9913K377P050j3230j7169k648o440l313l305l481l120o70J423P943Q917
$$ 29913 32290 39340 26110 8941 6293 -147 -3460 -6765 -10246 -13366 -14036 -12613 -4670 4247
14834D247N602K226q572R490P551j2454O811K0287Q410l428j2063K170j277J5264
$$ 4247 9849 12075 3503 12993 20544 8090 14901 35188 43598 40170 28107 30277 29000 44264
14820D4264K5402K1291K4331M2854M4339M1036M4576L8396K3474J4030K3600O423
$$ 44264 69666 90957 115288 158142 202481 243517 288093 326489 349963 363993 387593 394016
14808C94016L007j9444l4505l8439m0488n7338m7057l1762j4996n622j3491j2352
$$ 394016 397023 377579 343074 304635 264147 206809 159752 127990 112994 107372 93881 81529
14796H1529n260j4855m318j8452N87k449q242L628L1n76m484q92r573k4414J2022
$$ 81529 76269 61414 57096 38644 39231 36782 28540 32168 32199 31623 27139 26247 16674 -7740 4282
14781D282K5699q90j2280p849j1517j1363Q54K074J776L418P102j449J2602K7625
$$ 4282 29981 29091 16811 8962 -2555 -13918 -13064 -10990 -9214 -5796 1306 -143 12459 40084
14767D0084R863j6935j0676j1038j799j0167j948J4557l711n044N003M676k258
$$ 40084 49947 33012 22336 11298 9499 -668 -2616 11941 8230 3186 8189 12865 10607
14754A0607k762q00j3416j4476R003K633J707r05J5849l818p302m878R794R635
$$ 10607 7845 7045 -6371 -20847 -11844 -9211 -7504 -8409 7440 3622 -3680 -8558 1236 10871
14740A0871L197m710r426K286J1923J889N308O970J48o371n902Q27k388r408k940
$$ 10871 14068 9358 -68 2218 14141 16030 21338 28308 28456 22085 16183 17010 14622 5214 2274
14725B274M63M584R980M062j8462o463q833J7723J0624r321j1129n564J001n639
$$ 2274 2737 7321 17301 21363 2901 -3562 -12395 5328 15952 6631 -4498 -10062 -9061 -14700
14711a4700K23J0854J81O005M93J2729j945J0309K385j0759n917N336L294o770
$$ -14700 -14477 -3623 -3442 2563 3056 15785 13840 24149 26534 15775 9858 15194 18488 11718
14697A1718n30J458q527j2901m359J606Q614q749P175j036P488Q722M535o950
$$ 11718 11188 12646 4119 -8782 -13141 -11535 -2921 -11670 -4495 -5531 1957 10679 15214 8264
14683H264l88M205j082k392K377M054J278q46j4116k273p213M63n092L839j263
$$ 8264 7876 12081 10999 8607 10984 15038 16316 15470 1354 -919 -8132 -7669 -12761 -8922 -10185
14668a0185N750J0386k102N478L768J032p346N321J3194R575j4171j5281q128
$$ -10185 -4435 5951 3849 9327 13095 14127 6781 12102 25296 34871 20700 5419 -2709
14655b709M717j350n099l446J0880R393R996l781L267m225M069K561q778l2387
$$ -2709 2008 658 -4441 -7887 2993 12386 22382 18601 21868 17643 21712 24273 15495 -16892
14641a6892j4333K0221J0200K0116k663k739J307k958M801J325O20p221j1236
$$ -16892 -31225 -11004 -804 19312 16649 13910 15217 12259 17060 18385 19005 11784 548
14628E48m6N95J085Q184P17k0202k0980K93P312P68N416R485O02j3749K228J0071
$$ 548 502 1097 2182 10366 11083 -9119 -30099 -29806 -22494 -21726 -16310 -6825 -6223 -19972 -17744 -7673
14612g673n806k417l545R096J2045l653j5500k460J0392j77p875J227n000Q342
$$ -7673 -13479 -15896 -19441 -10345 1700 -1953 -17453 -19913 -9521 -9698 -17573 -16346 -21346 -13004
14598a3004J4521j0492j1491m348n420R01J8377N110M169j2151N601J1010o212
$$ -13004 1517 -8975 -20466 -24814 -30234 -29333 -10956 -5846 -1677 -13828 -8227 2783 -3429
14585c429J0359K0001L513p735P546k801p543j5223j2530q359N966J8804L318
$$ -3429 6930 26931 30444 22709 30255 27454 19911 4688 -7842 -16201 -10235 8569 11887
14572A1887Q07p043j5697P095l36q51L855N43M192l564M209l946J1373R272o972
$$ 11887 12694 5651 -10046 -2951 -3287 -4138 -283 260 4452 888 5097 1151 12524 21796 14824
14557A4824M811R796o200k169O746R024l320k0067m399n418j528N327J182J5381
$$ 14824 19635 29431 23231 21062 27808 36832 33512 13445 9046 3628 2100 7427 8609 23990
14543B3990k450k1855n10Q304K19o434k460R248j2237j161J759L918m613j802
$$ 23990 21540 -315 -825 7479 7698 1264 -1196 8052 -4185 -5346 -3587 331 -4282 -6084
14529f084r467p22n174j081M818p122k022k414o892l406N170J0411J1627m75l414
$$ -6084 -15551 -16273 -21447 -22528 -17710 -24832 -26854 -29268 -36160 -39566 -34396 -23985 -12358 -12833 -16247
14514a6247Q736J4028J0193m340j2246P424r271j2739j2448K341O129m523O290
$$ -16247 -7511 6517 16710 12370 124 7548 -1723 -14462 -26910 -24569 -18440 -22963 -16673
14501a6673J2443Q1K102j1095n68m827L03M511Q430J164K715J0074J178j414n654
$$ -16673 -4230 -4149 -2047 -13142 -13710 -18537 -18234 -13723 -5293 -4129 -1414 8660 9838 8424 2770
14486B770j3126K308J627j5517R235j501l408j255J9724P575q24p222N099J5764
$$ 2770 -10356 -8048 -6421 -21938 -12703 -14204 -17612 -18867 857 8432 7608 386 5485 21249
14472B1249Q331j8310q216n323l367L662K14p989L608M281Q665k308M974r617
$$ 21249 29580 11270 3054 -2269 -5636 -1974 -1760 -9749 -6141 -1860 6805 4497 9471 -146
14458a46k1084J3318N366L072N837R11K871n933m143K86O0m751n029M673P375
$$ -146 -21230 -7912 -2546 526 6363 7274 10145 4212 69 355 415 -4336 -9365 -4692 2683
14443B683J2562L567n577j4453j0427M215Q4J2024q59N916L427j834m663R713
$$ 2683 15245 18812 13235 -1218 -11645 -7430 -7346 4678 3819 9735 13162 11328 6665 16378
14429A6378j1136j4717j5736k516J1866o025l477M025J85N09J781J138P444J473
$$ 16378 5242 -9475 -25211 -27727 -15861 -21886 -25363 -21338 -21153 -20644 -18863 -17725 -10281 -8808
14415h808l85n78p913o963J0509M799o396k855J1584J438J2164J1512j0332o736
$$ -8808 -9193 -9771 -17684 -24647 -14138 -9339 -15735 -18590 -7006 -5568 6596 18108 7776 1040
14401A040j7363J174P854J0925l069q696J6j0395j3845N877R645J695n35J1612
$$ 1040 -16323 -15149 -7295 3630 561 -8135 -8119 -18514 -32359 -26482 -16837 -15142 -15677 -4065
14387d065j151K949N4k787j2009k025j738P454n86J2008J9688j3768k3154j4871
$$ -4065 -5216 -2267 -2213 -5000 -17009 -19034 -20772 -13318 -13904 -1896 17792 4024 -19130 -34001
14373c4001q283K215N324j101J6634M805m237O039R863p837p610p863O809N127
$$ -34001 -42284 -40069 -34745 -35846 -19212 -14407 -18644 -12605 -2742 -10579 -18189 -26052 -19243 -14116
14359a4116J644j507r91P846p906J973m446l072N754L08n51J613L721j40O665
$$ -14116 -12472 -13979 -14970 -7124 -15030 -13057 -17503 -20575 -14821 -14513 -15064 -13451 -9730 -9870 -3205
14344c205L145Q295o995j8192k061j657Q533J0098N663J0206L7p569p605L323
$$ -3205 -60 8235 1240 -16952 -19013 -20670 -12137 -2039 3624 13830 13867 6298 -1307 2016
14330B016N528o886K356R8j1118l157m450O291J830j984k878J6453n831j5709
$$ 2016 7544 658 3014 3112 -8006 -11163 -15613 -9322 -7492 -9476 -12354 4099 -1732 -17441
14316a7441Q561P582Q86Q192Q230n798j3488o477p900N350k856j0046j896p590
$$ -17441 -8880 -1298 -412 7780 16010 10212 -3276 -9753 -17653 -12303 -15159 -25205 -27101 -34691
14302c4691Q181J8504O035j871Q756l034P777l77K666j6776n926O075J151k616
$$ -34691 -26510 -8006 -1971 -3842 4914 1880 9657 9280 11946 -4830 -10756 -4681 -3530 -6146
14288f146l201N308L959o872m320P625r906K872k993o484P211q68k75J5144K454
$$ -6146 -9347 -4039 -80 -6952 -11272 -3647 -13553 -10681 -13674 -20158 -12947 -13815 -14090 1054 3508
14273C508p74j0126m147J442J31j307n010j5274J2008J254p151K190J0079J4180
$$ 3508 2734 -7392 -11539 -10097 -9966 -11273 -16283 -31557 -19549 -18295 -25446 -23256 -13177 1003
14259A003J2831M976j6295n499L28K812L426l745k075k169o327m081r031j524
$$ 1003 13834 18810 2515 -2984 -2656 156 3582 -163 -2238 -4407 -10734 -14815 -23846 -25370
14245b5370K485P073J163J0874L063n781J3945J1134K3829J3581Q031k647j1774
$$ -25370 -22885 -15812 -14649 -3775 -712 -6493 7452 18586 42415 55996 64027 61380 49606
14232D9606j0683j9402j3934n464J0098m886L333M129M192L853O001J2899Q897
$$ 49606 38923 19521 5587 123 10221 5335 8668 12797 16989 20842 26843 39742 48639
14219D8639J0824J3842J3185J4041M84k8624j7391j0411r870K775q768p989m878
$$ 48639 59463 73305 86490 100531 101015 72391 55000 44589 34719 37494 28726 20737 15859
14206A5859k809J781J612J9026O666J6053J4838L968j0R175M034p672p909j2001
$$ 15859 13050 14831 16443 35469 42135 58188 73026 76994 76984 86159 90193 82521 74612 62611
14192F2611o720j842k7568q894j827K76J2731j3643k0640o921K531j1039M417
$$ 62611 55891 54049 26481 17587 15760 16036 28767 15124 -5516 -12437 -9906 -20945 -16528
14179a6528L8155K2927K5778Q172M638M722q131k0385k9585j4833R50J8028j4038
$$ -16528 21627 44554 70332 78504 83142 87864 79733 59348 29763 14930 15880 33908 19870
14166A9870j5222J316Q634J1664j477O795L86J986P929l924k031J1960j0j485
$$ 19870 4648 5964 14598 26262 24785 31580 31966 33952 41881 37957 35926 47886 47876 46391
14152D6391j916j307k0304l0464l559J5296N217j192M910j821p168j6924j2610
$$ 46391 44475 43168 22864 -7600 -11159 4137 9354 8162 13072 11251 4083 -12841 -25451
14139b5451l841j281J6406M071m482J1491M305l724k242l397L454K022J194L720
$$ -25451 -29292 -30573 -14167 -10096 -14578 -3087 1218 -2506 -4748 -8145 -4691 -2669 -1475 2245
14125B245N346R430l772j1826j2814j944k819N50q068j3744M571J3520N128K212
$$ 2245 7591 17021 13249 1423 -11391 -13335 -16154 -15604 -23672 -37416 -32845 -19325 -14197 -11985
14111a1985j607j2704p921n547o106Q544J825J2898J1739k096K634l090j0191
$$ -11985 -13592 -26296 -34217 -39764 -45870 -37326 -35501 -22603 -10864 -12960 -10326 -13416 -23607
14098b3607L57Q184N762M936j950n328p27N160N716o528p623N053k0561P249J2434
$$ -23607 -23250 -15066 -9304 -4368 -6318 -11646 -12373 -7213 -1497 -8025 -15648 -10595 -31156 -23907 -11473
14083a1473k478N299J5098q979M549R34j172j20K476l914n514q090J0347J4751
$$ -11473 -13951 -8652 6446 -2533 2016 2950 1778 1658 4134 220 -5294 -13384 -3037 11714
14069A1714q515j6495j49L082O750P004L609r738k1007J442N574R597R327q632
$$ 11714 3199 -13296 -13445 -10363 -3613 3391 7000 -2738 -23745 -22303 -16729 -7132 2195 -6437
14055f437o329J5162N932p577Q222m30P449M355o411q84Q918k312j062J2271M203
$$ -6437 -12766 2396 8328 751 8973 8543 15992 20347 13936 13052 21970 19658 18596 30867 35070
14040C5070o830q890Q229J6425J2709J255J4132J5131O107J1454P296K4583J9915
$$ 35070 28240 19350 27579 44004 56713 57968 72100 87231 93338 104792 112088 136671 156586
14027A56586K7505K4806Q005K0997L6856K4162J7155K5463K1645J6162R821J903
$$ 156586 184091 208897 216902 237899 274755 298917 316072 341535 363180 379342 389163 391066
14015C91066J0704J6213J1203r463J555J5863O404J625l773j0165k239J0530j0467
$$ 391066 401770 417983 429186 419723 421278 437141 443545 445170 441397 431232 428993 439523 429056
14002D29056o292l303K687k877j2484j51j4800o744n061J549n091k3893k6525
$$ 429056 422764 419461 422148 419271 406787 406636 391836 385092 380031 381580 376489 352596 326071
13989C26071k1037k4961k5076q69j7388l5731j6606l448p012k2587j7342o018
$$ 326071 305034 280073 254997 254128 236740 201009 184403 180955 173943 151356 134014 127996
13977A27996n547j2085j5714k659M228j4734j3883L801L609J3k8731j6747K389
$$ 127996 122449 110364 94650 91991 96219 81485 67602 71403 75012 75025 46294 29547 31936
13964C1936Q87j4985j906O596M296j246N78r667q031j486J3124O87m841J3198
$$ 31936 32823 17838 15932 22528 26824 25578 26156 16489 8458 6972 20096 20783 15942 29140
13950B9140J244L472j5044p770j0757L671J5586J5811k661p05q302p645K446J452
$$ 29140 30384 33856 18812 11042 285 3956 19542 35353 32692 31987 23685 16040 18486 19938
13936A9938n262M425J1310Q704j7109o346L565o59j725K824Q342N816j7299n316
$$ 19938 14676 19101 30411 39115 22006 15660 19225 18566 16841 19665 28007 33823 16524 11208
13922A1208p06O076J7036j4654p009O838P106R556J2159q773L850K0183q29j7408
$$ 11208 10502 16578 33614 18960 11951 18789 25895 35451 47610 38837 42687 62870 62041 44633
13908D4633j3785j649J5n319l993m172O427L036N310K796k291q568n908J113J3331
$$ 44633 30848 29199 29214 23895 19902 15730 22157 25193 30503 33299 31008 22440 16532 17645 30976
13893C0976J2393L696o083q648j5730l290J322l050o579m237q435Q501L369p369
$$ 30976 43369 47065 40982 32334 16604 13314 14636 11586 5007 770 -7665 836 4205 -3164
13879c164J975N645R849J797R73r814j483O362M358J3767p219l520j501r344j2542
$$ -3164 -1189 4456 14305 16102 17075 7261 5778 12140 16498 30265 23046 19526 18025 8681 -3861
13864c861J249J3514L355J9O286n398r351j1864k709j1262j7410J2122J6234Q112
$$ -3861 -2612 10902 14257 14276 20562 15164 5813 -6051 -8760 -20022 -37432 -25310 -9076 -964
13850i64N517k4918P21J1976K416J4930J3332j0969j3430M721L290k522k744j2220
$$ -964 4553 -20365 -19644 -7668 -5252 9678 23010 12041 -1389 3332 6622 4100 1356 -10864
13836a0864q538k817M754K022N913q431r421L855P434J3978M187j8400r903K695
$$ -10864 -19402 -22219 -17465 -15443 -9530 -17961 -27382 -23527 -16093 -2115 2072 -16328 -26231 -23536
13822b3536L835q553r430Q37k292L049K453M198K0425j522M265p525J1649O117
$$ -23536 -19701 -28254 -37684 -36847 -39139 -36090 -33637 -29439 -9014 -10536 -6271 -13796 -2147 3970
13808C970l107m568J104n453l351J344P572l600j2798r770R68O949o04Q650J503
$$ 3970 863 -3705 -2601 -8054 -11405 -10061 -2489 -6089 -18887 -28657 -27689 -20740 -21344 -12694 -11191
13793a1191M880O956j1574j2049K419L554j1617o401J4287J0213j1482N373O448
$$ -11191 -6311 645 -10929 -22978 -20559 -17005 -28622 -35023 -20736 -10523 -22005 -16632 -10184
13780a0184j6606q810J1962N628N086N777J1420N493N998j1524n563o918N004
$$ -10184 -26790 -35600 -23638 -18010 -12924 -7147 4273 9766 15764 4240 -1323 -8241 -3237
13767c237m554p647J5048L554j6233k0195p582j457J0597K9605P178j4961n950
$$ -3237 -7791 -15438 -390 3164 -13069 -33264 -40846 -42303 -31706 -2101 5077 -9884 -15834
13754a5834j508Q883J3246p951r202J1257Q021J671n447J472M823n867j3147r311
$$ -15834 -17342 -8459 4787 -3164 -12366 -1109 6912 8583 3136 4608 9431 3564 -9583 -18894
13740a8894J1931Q319J0688j3492l678O57j0501j83l08J2798L81M207K4142M080
$$ -18894 -6963 1356 12044 -1448 -5126 -4469 -14970 -15153 -15461 -2663 -2282 1925 26067 30147
13726C0147L123m193j6303k217q468p179p777j2978k011j241P123k235j814k192
$$ 30147 33270 29077 12774 10557 2089 -5090 -12867 -25845 -27856 -29097 -21974 -24209 -26023 -28215
13712b8215j159k31j9J0137N647L199M468R047J2696M003n384r390N327N364J138
$$ -28215 -29374 -29605 -29624 -19487 -13840 -10641 -6173 2874 15570 19573 14189 4799 10126 15490 16628
13697A6628q567r369o383j4049o57R229Q01R184O1q082p668j0607P972L869q308
$$ 16628 8061 -1308 -7691 -21740 -22397 -13168 -12367 -3183 -3122 -11204 -18872 -29479 -21507 -17638 -25946
13682b5946j6030L985J2598n097k3J5979j883J711n367N892K244j8435P71M618
$$ -25946 -41976 -37991 -25393 -30490 -30513 -14534 -16417 -14706 -20073 -14181 -11937 -30372 -29601 -24983
13668b4983K279p242J2405J7555J8302o607n134k825m481n370m890N949P816p824
$$ -24983 -22704 -29946 -17541 14 18316 11709 6575 3750 -731 -6101 -10991 -5042 2774 -5050
13654e050m62K1939P897J3452J4901p338M484j2299m358j532o872j01r712K198
$$ -5050 -5512 16427 24324 37776 52677 45339 49823 37524 33166 31634 24762 24661 14949 17147
13640A7147j7236m401K229k690J1009j0376O04J342K884O633J5074q390o483L852
$$ 17147 -89 -4490 -2261 -4951 6058 -4318 -3714 -2372 512 7145 22219 13829 7346 11198
13626A1198k747r832k11K911r71J5807J258j5420l575L119j235o151M339o344
$$ 11198 8451 -1381 -1592 1319 348 16155 17413 1993 -1582 1537 302 -5849 -1510 -7854
13612g854J0683J835q372j7010p950K0810J3115k177P58m036P479L201j6564p864
$$ -7854 2829 4664 -3708 -20718 -28668 -7858 5257 3080 3838 -198 7281 10482 -6082 -13946
13598a3946l613l413J035P298k699n561O034m708q057j774p93l550J6708J9411
$$ -13946 -17559 -20972 -19937 -12639 -15338 -20899 -14865 -19573 -27630 -29404 -30197 -33747 -17039 2372
13584B372O401m183r916q953j5084M887K494k504N433O358M018m239j035L29J3798
$$ 2372 8773 4590 -5326 -14279 -29363 -24476 -21982 -24486 -19053 -12695 -8677 -12916 -13951 -13622 176
13569A76J126j1065j8510j6745P493J4051N158l972J4640J4734M294o464r191
$$ 176 1302 -9763 -28273 -45018 -37525 -23474 -18316 -22288 -7648 7086 11380 4916 -4275
13556d275p369P765R0q934n530n503r004q093J8060J798k480j761k116R74J1937
$$ -4275 -11644 -3879 -3789 -12723 -18253 -23756 -32760 -40853 -22793 -20995 -23475 -25236 -27352 -26378 -14441
13541a4441O200O863k370n813R400J7058k163n147l277j9249q132P428l808L899
$$ -14441 -8241 -1378 -3748 -9561 -161 16897 14734 9587 6310 -12939 -21071 -13643 -17451 -13552
13527a3552j1279L994K1133P957j7505k1124n307J3244R521N663l244R101j0862
$$ -13552 -24831 -20837 296 8253 -9252 -30376 -35683 -22439 -12918 -7255 -10499 -1398 -12260
13514a2260j2367M109n174j621Q11l792J675P503J3974j5291j0651R336J0414
$$ -12260 -24627 -20518 -25692 -27313 -26502 -30294 -28619 -21116 -7142 -22433 -33084 -23748 -13334
13501a3334M481K611n356l801j3034r652p34J037J690J5024K948K912J4813J2835
$$ -13334 -8853 -6242 -11598 -15399 -28433 -38085 -38819 -37782 -36092 -21068 -18120 -15208 -395 12440
13487A2440n452p407p119j3069m17R765Q215J998l671j259L902J8602j5697k490
$$ 12440 6988 -419 -7538 -20607 -21024 -11259 -3044 -1046 -4717 -5976 -2074 16528 831 -1659
13473a659j636P483o988k4811M442J0359Q630L277N401M055n568o46p973q663
$$ -1659 -3295 4188 -2800 -27611 -23169 -12810 -4180 -903 4498 8553 2985 2339 -5634 -14297
13459a4297k239l782J0048J688j0351k038j5776L992J6579j223p678n047K060
$$ -14297 -16536 -20318 -10270 -8582 -18933 -20971 -36747 -32755 -16176 -17399 -25077 -30124 -28064
13446b8064K480n470L914R595N284q682N644J1086m818M201o853m514J878l277
$$ -28064 -25584 -31054 -27140 -17545 -12261 -20943 -15299 -4213 -9031 -4830 -11683 -16197 -14319 -17596
13432a7596k613o241j841l411M460O418k293p80p195J1947Q763Q69l697q040q81
$$ -17596 -20209 -26450 -28291 -31702 -27242 -20824 -23117 -23897 -31092 -19145 -10382 -9513 -13210 -21250 -22131
13417b2131m201k50o048J645Q808M407L287m786j3219p00K733j2740J1388J4625
$$ -22131 -26332 -26582 -32630 -30985 -22177 -17770 -14483 -19269 -32488 -33188 -30455 -43195 -31807 -17182
13403a7182r214O304K8591L488j3719K040N229J40j5609r673o367J911J0958p793
$$ -17182 -26396 -20092 8499 11987 -1732 308 5537 5677 -9932 -19605 -25972 -24061 -13103 -20896
13389b0896R27k307J4716J4469M97k159Q32l531j2113j0946J2065M034l233j2462
$$ -20896 -19969 -22276 -7560 6909 7406 5247 6079 2548 -9565 -20511 -8446 -4412 -7645 -20107
13375b0107K688N441k002j5893P104J9441j1327j9345R147k018k446r192j324
$$ -20107 -17419 -11978 -13980 -29873 -22769 -3328 -14655 -34000 -24853 -26871 -29317 -38509 -39833
13362c9833j892N360K984L634j0203J662N900J3117R068j4399n429K218R075Q746
$$ -39833 -41725 -36365 -33381 -29747 -39950 -38288 -32388 -19271 -10203 -24602 -30031 -27813 -18738 -9992
13348i992l027j4420R910Q003K0m260O501M640r588l230m256r87L339O544J303
$$ -9992 -13019 -27439 -17529 -9526 -9506 -13766 -7265 -2625 -12213 -15443 -19699 -20686 -17347 -10803 -9500
13333i500M179L255m266j4453j1892j0446J732K6034J4085o406m33R4J259Q703
$$ -9500 -5321 -2066 -6332 -20785 -32677 -43123 -41391 -15357 -1272 -7678 -8111 -8017 -6758 1945
13319A945p213o824l459l381J1355J1640R99l940m997j4458L392J6219j850r493
$$ 1945 -5268 -12092 -15551 -18932 -7577 4063 5062 1122 -3875 -18333 -14941 1278 -572 -10065
13305a0065j01Q444k373J664Q624M862j1267O559n350k1459o879J186l243N534
$$ -10065 -10166 -1722 -4095 -2431 6193 11055 -212 6347 997 -20462 -27341 -26155 -29398 -23864
13291b3864J0935k755k262o652j468J9361m202r734Pj8240r632L946P234M127
$$ -23864 -12929 -15684 -17946 -24598 -26066 -6705 -10907 -20641 -20634 -38874 -48506 -44560 -37326 -33199
13277c3199k466l076N616J3910R944N658J787j1087j7077R877k533M311J612O295
$$ -33199 -35665 -38741 -33125 -19215 -9271 -3613 -1826 -12913 -29990 -20113 -22646 -18335 -16723 -10428
13263a0428P484k878k198n460j1554k144M392J3976L580R370k745j0687N369J954
$$ -10428 -2944 -5822 -8020 -13480 -25034 -27178 -22786 -8810 -5230 4140 1395 -9292 -3923 -1969
13249a969o118J0993j5609L356P287j243p266M93J3876R5m967J140L750o336m32
$$ -1969 -8087 2906 -12703 -9347 -2060 -3303 -10569 -10076 3800 3895 -1072 68 3818 -2518 -2950
13234b950Q133p049j5563Q423J695K563J5452L93r626j4025K297n307L436q417
$$ -2950 5183 -1866 -17429 -9006 -7311 -4748 10704 11097 1471 -12554 -10257 -15564 -12128 -20545
13220b0545j3658J1794M693R691K920J542J707j9865k667R044N32M546Q992J8901
$$ -20545 -34203 -22409 -17716 -8025 -5105 -3563 -1856 -21721 -24388 -15344 -14812 -10266 -1274 17627
13206A7627P595p576k2054j6818O319l760P15j2014m441J514L267L146N149J5983
$$ 17627 25222 17646 -4408 -21226 -14907 -18667 -17952 -29966 -34407 -32893 -29626 -26480 -21331 -5348
13192e348P34j2581J850j0264N18Q598N504P672M770Q913m122j1693J1012k618
$$ -5348 -4614 -17195 -15345 -25609 -25091 -16493 -10989 -3317 1453 10366 6244 -5449 5563 2945
13178B945j7494j7792K587J1083Q700P091p491K76p97m673p237K677O028P125
$$ 2945 -14549 -32341 -29754 -18671 -9971 -2880 -10371 -10095 -10892 -15565 -22802 -20125 -14097 -6972
13164f972k078l446M127J262k727j147r701j2658Q165J9682K843n918p373r881
$$ -6972 -9050 -12496 -8369 -7107 -9834 -10981 -20682 -33340 -25175 -5493 -2650 -8568 -15941 -25822
13150b5822J750J4201o05r59M568J2443j659r230l169o868j103J0508j857J607
$$ -25822 -24072 -9871 -10476 -11435 -6867 5576 3917 -5313 -8482 -15350 -16453 -5945 -7802 -6195
13136f195j4859K968N18n578O130j0345l199J4390L861j994M052N722q400j7561
$$ -6195 -21054 -18086 -17568 -23146 -17016 -27361 -30560 -16170 -12309 -14303 -10251 -4529 -12929 -30490
13122c0490r660k098L436L37j5668L91K3563L0410o461j1942j764Q375m157q209
$$ -30490 -40150 -42248 -38812 -38475 -54143 -53752 -30189 221 -6240 -18182 -19946 -11571 -15728 -23937
13108b3937k15J0412P712J1386P412L499L311j5696j4306j425k857k493l14r336
$$ -23937 -24152 -13740 -6028 5358 12770 16269 19580 3884 -10422 -11847 -14704 -17197 -17511 -26847
13094b6847K814J279J2048Q386P001N95j664N042m235k3633j26J3246O062p066
$$ -26847 -24033 -22754 -10706 -2320 4681 5276 3612 8654 4419 -19214 -19340 -6094 -32 -7098
13080g098m096M43J0586j095Q825m513k084L305Q114Q472k376M927J352l913J1345
$$ -7098 -11194 -10751 -165 -1260 7565 3052 968 4273 12387 20859 18483 23410 24762 20849 32194
13065C2194j390J3021J4609M937p82J6413P200l3o813O926P167l500K14o246L078
$$ 32194 30804 43825 58434 63371 62589 79002 86202 86169 79356 86282 93449 89949 90163 83917 86995
13050H6995L529j781j0742M751l242N995m473Pl98l989r75R15N374J1009O822
$$ 86995 90524 88743 78001 82752 79510 85505 81032 81039 80641 76652 75677 76592 81966 92975 99797
13035I9797K710J711J1232Q436J6304J0191k828K6307K3534J0131J3540J8160
$$ 99797 102507 104218 115450 123886 140190 150381 147553 173860 197394 207525 221065 239225
13023B39225K3126J5846J7846J5011J0677L239j9741r041O057R98j8207k0872
$$ 239225 262351 278197 296043 311054 321731 324970 305229 296188 302245 303243 285036 264164
13011B64164j5211l7950j2733O600p849j2623l065O049j8045k35l734P510O104
$$ 264164 248953 211003 198270 204870 197021 184398 181333 187382 169337 169102 165368 172878 178982
12998A78982P916j79O026J7493J5752J2033M949N676K1028J6548K4806J7921J0363
$$ 178982 186898 186719 192745 210238 225990 238023 242972 248648 269676 286224 311030 328951 339314
12985C39314O544k5537j2456P236K9o864j1752k3860k2434l2207k7794j0533l709
$$ 339314 345858 320321 307865 315101 315130 308266 296514 272654 250220 218013 190219 179686 175977
12972A75977l200l522r312k0460j4369O451J3507m441j0746j4269m025L427J4601
$$ 175977 172777 169255 159943 139483 125114 131565 145072 140631 129885 115616 111591 115018 129619
12959A29619K544l077J735j0727j037J1134R380L672r922R74K1976j0629p196
$$ 129619 132163 129086 130821 120094 119057 130191 139571 143243 133321 134295 156271 145642 138446
12946A38446m03j1202j6101p865r633k0237r511J114l6j1287k1077q83k21l691
$$ 138446 138043 126841 110740 102875 93242 73005 63494 64608 64572 53285 32208 31325 31104 27413
12932B7413j2696j720r283k513J8824J182j1172k834j7511N154Q057N148J5784
$$ 27413 14717 12997 3714 1201 20025 21207 10035 7201 -10310 -5156 2901 8049 23833
12919B3833J3545n921l732r688K805J317j545N102q007k204k915K153J284N108
$$ 23833 37378 31457 27725 18037 20842 22159 20614 25716 17709 15505 12590 14743 16027 21135
12905B1135K85k3313n150N402j6719p889J2376J4634J1184l415L2l453K033j631
$$ 21135 21420 -1893 -7043 -1641 -18360 -26249 -13873 761 11945 8530 8562 5109 7142 5511
12891E511k413j123j1580p224R24K882l197j593J085J1488j0154P110K2555J3804
$$ 5511 3098 1975 -9605 -16829 -15905 -13023 -16220 -17813 -16728 -5240 -15394 -8284 14271 28075
12877B8075j3635j1500N663l857r625Q511J1422Q333L369L558Q466J8340j3421
$$ 28075 14440 2940 8603 4746 -4879 3632 15054 23387 26756 30314 38780 57120 43699
12864D3699l7079j1056J3745P405l789j3629k502n51K15l269r57j488J0295J4164
$$ 43699 6620 -4436 9309 16714 12925 -704 -3206 -3757 -3542 -6811 -7768 -9256 1039 15203
12850A5203j1863k629J3Q145p71Q422p662q530L178j969O862R808n302K821j4666
$$ 15203 3340 711 724 8869 8098 16520 8858 328 3506 1537 8399 18207 12905 15726 1060
12835A060j3977L453J2118r038m881M235J425J16K302l625o493l981j312M223
$$ 1060 -12917 -9464 2654 -6384 -11265 -7030 -5605 -5489 -3187 -6812 -13305 -17286 -18598 -14375
12821a4375J1694k41j4688p573j831J663R835L275O679N318J023j6816K237P188
$$ -14375 -2681 -2922 -17610 -25183 -27014 -25351 -15516 -12241 -5562 -244 779 -16037 -13800 -6612
12807f612M981j2686J1804K769M428m478j9453k443J0444l976O136K3349r998
$$ -6612 -1631 -14317 -2513 256 4684 206 -19247 -21690 -11246 -15222 -9086 14263 4265
12794D265j5054J990k049P513n258M57J523j938n948j6849o338L400M597J255
$$ 4265 -10789 -8799 -10848 -3335 -8593 -8136 -6613 -8551 -14499 -31348 -37686 -34286 -29689 -28434
12780b8434J380O055N744J2169O009j6746p959J779N711n823j453J1284j5697
$$ -28434 -27054 -20999 -15255 -3086 2923 -13823 -21782 -20003 -14292 -20115 -21568 -10284 -25981
12767b5981q676P718P953j0408p889k35K2229J4861J0908k824n157J811j0449
$$ -25981 -34657 -26939 -18986 -29394 -37283 -37518 -15289 -428 10480 7656 2499 4310 -6139
12754f139p419P705k564o111M254K7J713R511m037m890o819L768p743J340m317
$$ -6139 -13558 -5853 -8417 -14528 -10274 -10247 -8534 977 -3060 -7950 -14769 -11001 -18744 -17404 -21721
12739b1721Q200J0925J2850j826R34n594j815n208N290R152l340m374j6836p037
$$ -21721 -13521 -2596 10254 8428 9362 3768 1953 -3255 2035 11187 7847 3473 -13363 -20400
12725b0400L557M986l91l396P508o52J892j2859j0375k90R203n059J2815R219
$$ -20400 -16843 -11857 -12248 -15644 -8136 -8788 -6896 -19755 -30130 -30420 -21217 -26276 -13461 -4242
12711d242p563O41J8691q499p125J048q010J770n699j262N368N911k8j81r49j1582
$$ -4242 -11805 -11164 7527 -972 -8097 -7049 -15059 -13289 -18988 -20250 -14882 -8971 -8999 -9180 -10129 -21711
12695b1711J0270J6480l692k802J610M706K935J394p962k189k146k40j0814j1530
$$ -21711 -11441 5039 1347 -1455 155 4861 7796 9190 1228 -961 -3107 -3347 -14161 -25691
12681b5691J0143J0153n124M508n980k6021j1468P348R715R764J0983J7199j2399
$$ -25691 -15548 -5395 -10519 -6011 -11991 -38012 -49480 -42132 -32417 -22653 -11670 5529 -6870
12668f870p742l42k250j0535J556j0321O894J6583O513p674L770P924n405n165
$$ -6870 -14612 -14954 -17204 -27739 -26183 -36504 -29610 -13027 -6514 -14188 -10418 -2494 -7899 -13064
12654a3064r414K075m429Q694J1124K4476p252r441O75j999P26J792j0685j2180
$$ -13064 -22478 -20403 -24832 -16138 -5014 19462 12210 2769 3444 1445 2171 3963 -6722 -18902
12640a8902K728K921J86R471K765J1051Q724k950p475Q711J397J321j2568j2868
$$ -18902 -16174 -13253 -13067 -3596 -831 10220 18944 15994 8519 17230 18627 19948 7380 -5488
12626e488n350N466m449m89k071j0560k531Q390J0385n24J6517q70o892j1175
$$ -5488 -10838 -5372 -9821 -10310 -12381 -22941 -25472 -17082 -6697 -7221 9296 8426 1534 -9641
12612i641O39J131m546r415o967R094m969P66O063K0141J2573j4304j1810l87
$$ -9641 -9002 -7871 -12417 -21832 -28799 -19705 -24674 -23908 -17845 2296 14869 565 -11245 -11632
12598a1632J8205m35j4757r340n448k996N202M857P969O936q532m889N231R01
$$ -11632 6573 6138 -8619 -17959 -23407 -26403 -21201 -16344 -8375 -1439 -9971 -14860 -9629 -8728
12584h728O052O366O792N126j852j6603r322j5673o594j856R610p300R436Q325
$$ -8728 -2676 3690 10482 15608 13756 -2847 -12169 -27842 -34436 -36292 -26682 -33982 -24546 -16221
12570a6221o06Q798j382j0750j5294l268J1836O439Q772O871p232L342L745K565
$$ -16221 -16827 -8029 -9411 -20161 -35455 -38723 -26887 -20448 -11676 -4805 -12037 -8695 -4950 -2385
12556b385q439l078J5133j5918J897O332k568j781m919l153k054o035p430R467
$$ -2385 -10824 -13902 1231 -14687 -12790 -6458 -9026 -10807 -15726 -18879 -20933 -26968 -34398 -24931
12542b4931p53p123Q488J0269l078j7938J115J746q588R880J2865M693m425M632
$$ -24931 -25684 -32807 -24319 -14050 -17128 -35066 -33951 -32205 -40793 -30913 -18048 -13355 -17780 -13148
12528a3148p69l049o776O266J7249m224j742j045j1456J048p4n662L069M997p19
$$ -13148 -13917 -16966 -23742 -17476 -227 -4451 -6193 -7238 -18694 -17646 -17720 -23382 -20313 -15316 -16035
12513a6035K348P821p021N170P038r8p812J417o259J6999R08j3076r983j0476
$$ -16035 -13687 -5866 -12887 -7717 -679 -777 -8589 -7172 -13431 3568 4476 -8600 -18583 -29059
12499b9059M278R18J5782O933o614o998J970N679M438k709j7406q742M545K471
$$ -29059 -24781 -23863 -8081 -1148 -7762 -14760 -12790 -7111 -2673 -5382 -22788 -31530 -26985 -24514
12485b4514J3853K1106Q509R374n159j638r35j4218P768P800j6587o84L104l192
$$ -24514 -10661 10445 18954 28328 23169 21531 20596 6378 14146 21946 5359 4675 7779 4587
12471D587q491o616K1760J3514j8038j9721j0810m000j2587L0242K5466K015o199
$$ 4587 -3904 -10520 11240 24754 6716 -13005 -23815 -27815 -40402 -10160 15306 17321 11122
12458A1122j2569k482J334m848M642Q284k367L393k168n998o040J229P943k767
$$ 11122 -1447 -3929 -2595 -7443 -2801 5483 3116 6509 4341 -1657 -7697 -6468 1475 -1292
12444a292m921o176j3922k066L774N505J4247L601k566J797L230l625m505M752
$$ -1292 -6213 -12389 -26311 -28377 -24603 -19098 -4851 -1250 -3816 -2019 1211 -2414 -6919 -2167
12430b167O241m42k722J2528r354L385O629j016L055m646J119r48o475L164L101
$$ -2167 4074 3632 910 13438 4084 7469 14098 13082 16137 11491 12610 11662 5187 8351 11452
12415A1452O104o239n915K585M732P232j481o682r860r028K309k126m666N343
$$ 11452 17556 11317 5402 7987 12719 19951 18470 11788 1928 -7100 -4791 -6917 -11583 -6240
12401f240K058o086M670l439n63J2241K505l408j3929j2124N896n145l946O623
$$ -6240 -4182 -10268 -5598 -9037 -9600 2641 5146 1738 -12191 -24315 -18419 -23564 -27510 -20887
12387b0887J4535L983j0624l119P736l37j754J1229J9866P921j3259j3774j5473
$$ -20887 -6352 -2369 -12993 -16112 -8376 -8713 -10467 762 20628 28549 15290 1516 -13957
12374a3957j1986p227O065J6740J613j2697J973O011P98j1007n109O708N302N156
$$ -13957 -25943 -33170 -27105 -10365 -8752 -21449 -19476 -13465 -12667 -23674 -28783 -22075 -16773 -11617
12360a1617J591K969n245j0901M322k225k816N134O974K647m589j826R923j831
$$ -11617 -10026 -7057 -12302 -23203 -18881 -21106 -23922 -18788 -11814 -9167 -13756 -15582 -5659 -7490
12346g490m447j198J38J5036m012j2888j5241n32j0003J762J3322Q376m733m191
$$ -7490 -11937 -13135 -12997 2039 -1973 -14861 -30102 -30634 -40637 -38875 -25553 -17177 -21910 -26101
12332b6101N701P892m936j03J3001L473r895j0Q528j254J0859j1701j0547R920
$$ -26101 -20400 -12508 -17444 -17547 -4546 -1073 -10968 -10978 -2450 -3704 7155 -4546 -15093 -5173
12318e173N243P47p590p825R850M31o894Q423j0286L328J3196K421q02j7154k824
$$ -5173 70 817 -6773 -14598 -4748 -4317 -11211 -2788 -13074 -9746 3450 5871 5069 -12085 -14909
12303a4909J4747O034n630p275j3123P25L890J1857K242o875J2255k612j7104
$$ -14909 -162 5872 242 -7033 -20156 -19431 -15541 -3684 -1442 -8317 3938 1326 -15778
12290a5778l987j6938J684M500R130Q030J533m378Q460L595L612J0154j2470j3780
$$ -15778 -19765 -36703 -35019 -30519 -21389 -13359 -11826 -16204 -7744 -4149 -537 9617 -2853 -16633
12276a6633m372l910j4637M953K5734l116q649L556o44J93j3081K408P287K383
$$ -16633 -21005 -24915 -39552 -34599 -8865 -11981 -20630 -17074 -17718 -17525 -30606 -28198 -20911 -18528
12262a8528Q88M207K297l554r109r879J936P214M628j22k579m936J7901l825o02
$$ -18528 -17640 -13433 -11136 -14690 -23799 -33678 -31742 -24528 -19900 -20022 -22601 -27537 -9636 -13461 -14063
12247a4063k550j088j3129O283Q733M067o186j566M397m018j431j144m751j1297
$$ -14063 -16613 -17701 -30830 -24547 -15814 -11747 -17933 -19499 -15102 -19120 -20551 -21695 -26446 -37743
12233c7743k9m837J1937l324J360r425J1820Q028p268O3J158k36N142N421J874
$$ -37743 -37772 -42609 -30672 -33996 -32636 -42061 -30241 -22213 -29481 -29418 -28260 -28496 -23354 -17933 -16059
12218a6059k591J6083j561j8871p593l050n81N87N790l438J2046J400n146O315
$$ -16059 -18650 -2567 -4128 -22999 -30592 -33642 -34223 -33636 -27846 -31284 -19238 -17838 -22984 -16669
12204a6669m352j742N177n900P368O671k2j450N149P936l901q165P338J4961J0400
$$ -16669 -21021 -22763 -17586 -23486 -16118 -9447 -9469 -10919 -5770 2166 -1735 -9900 -2562 12399 22799
12189B2799n373p935p850m129J985J806P14K0950J4792M81M906j228L706K579
$$ 22799 17426 9491 1641 -2488 -503 1303 2017 22967 37759 38240 43146 41918 45624 48203
12175D8203P459q415o111J0429j0005q632j2002j0442r56q62K886J6453Q394m765
$$ 48203 55662 47247 41136 51565 41560 32928 20926 10484 9528 8666 11552 28005 36399 31634
12161C1634j5979J1917K0787N373j2438j1416p125r364N280J555o610M642O60
$$ 31634 15655 27572 48359 53732 41294 29878 22753 13389 18669 20224 13614 18256 18916
12148A8916p92O167O512K433j586K351L694K877m871j0606n8J2977P208R792j1614
$$ 18916 18124 24291 30803 33236 31650 34001 37695 40572 35701 25095 25037 38014 45222 55014 43400
12133D3400J085k350r334j3001J1143J3202L725n14o148j0427J1508n310r792
$$ 43400 44485 42135 32801 19800 30943 44145 47870 47356 41208 30781 42289 36979 27187
12120B7187J2897Q62o941L01P285j2662L492Q313q312j1360kO978j2447n655O770
$$ 27187 40084 40946 34005 34306 41591 28929 32421 40734 32422 21062 21060 28038 15591 9936 16706
12105A6706n740k0532k706J8320j834o548m888P311N816j3498j7153R841O670
$$ 16706 10966 -9566 -12272 6048 4214 -2334 -7222 89 5905 -7593 -24746 -14905 -8235
12092h235q472r696K600O880L88P363O384k92J5794N519l280L572j0246j243Q080
$$ -8235 -16707 -26403 -23803 -16923 -16535 -9172 -2788 -3080 12714 18233 14953 18525 8279 7036 15116
12077A5116m034j2625J2062K611K552O139R27J1929l681r046J968N427J683j3638
$$ 15116 11082 -1543 10519 13130 15682 21821 22748 34677 30996 21950 23918 29345 31028 17390
12063A7390l438J2086N645j0569o896m398P441Q769J3899J1281Q713N328j596
$$ 17390 13952 26038 31683 21114 14218 9820 17261 26030 39929 51210 59923 65251 63655
12050F3655O754O739R051M028j4362k3093j6198j5839m781P818R438j3387J37
$$ 63655 70409 77148 86199 90227 75865 52772 36574 20735 15954 23772 33210 19823 19960
12037A9960J0425P176M800n703j3287J1776J2573J8155M798o215k633p346j3053
$$ 19960 30385 37561 42361 36658 23371 35147 47720 65875 70673 64458 61825 54479 41426
12024D1426j2855P656K996j468O596L870M576o650q332j3744j167P049J259P395
$$ 41426 28571 36227 39223 37755 44351 48221 52797 46147 37815 24071 22904 29953 31212 38607
12010C8607J0172J3518R62O919m408l637K665J963J4019o726K159l143j6211j9837
$$ 38607 48779 62297 63259 70178 65770 62133 64798 66761 80780 74054 76213 73070 56859 37022
11996C7022j0175J761L168k943j850Q100m882j3853j680J2429K051k4148Q571
$$ 37022 26847 28608 31776 28833 26983 35083 30201 16348 14668 27097 29148 5000 13571
11983A3571L421K885R543N247k962q957m906l998o621L087l959n897l595K476
$$ 13571 16992 19877 29420 34667 31705 22748 17842 13844 7223 10310 6351 454 -3141 -665
11969f65j892P345j3684K739N992J7990j0j9015p869l092o828K017q160N484L774
$$ -665 -2557 4788 -8896 -6157 -165 17825 17815 -1200 -9069 -12161 -18989 -16972 -25132 -19648 -15874
11954a5874N315m966r733N520J737J1779j357n601P386J8569J398p793P69l001
$$ -15874 -10559 -15525 -25258 -19738 -18001 -6222 -7579 -13180 -5794 12775 14173 6380 7149 4148
11940D148K855J699q889l670r156Q488n48j4964K63k092l181L82n891j582J3368
$$ 4148 7003 8702 -187 -3857 -13013 -4525 -5073 -20037 -19774 -21866 -25047 -24665 -30556 -32138 -18770
11925a8770j582M24j603Q51m825k023L138Q27J0438n971l270L295N677o565l085
$$ -18770 -20352 -19928 -21531 -20680 -25505 -27528 -24390 -23563 -13125 -19096 -22366 -19071 -13394 -19959 -23044
11910b3044J035R02J0240J1905o451o968j1325m683M720K959P096L0j5888J0548
$$ -23044 -22009 -21107 -10867 1038 -5413 -12381 -23706 -28389 -23669 -20710 -13614 -13584 -29472 -18924
11896a8924J2405R668K07N287l781k961L132M23N63J595j952O26N033L110R735
$$ -18924 -6519 3149 3356 8643 4862 1901 5033 5456 6019 7614 5662 6288 11321 14431 24166
11881B4166P537j4117p139J3712k569K663q428j0359K197P966p855q910O633K2263
$$ 24166 31703 17586 10447 24159 21590 24253 15825 5466 7663 15629 7774 -1136 5497 27760
11867B7760K157j5431j3746n992R532J2025L825o705m422r096j3231l470N735
$$ 27760 29917 14486 740 -5252 4280 16305 20130 13425 9003 -93 -13324 -16794 -11059
11854a1059O897j342L507J7309m990j0322M854L852n263j934k048n566o390M685
$$ -11059 -4162 -5504 -1997 15312 10322 0 4854 8706 3443 1509 -539 -6105 -12495 -7810
11840g810L209J0937J139P3m473K5j1442j039J8068Q052n488N356J977M489j0113
$$ -7810 -4601 6336 7475 7548 3075 3100 -8342 -9381 8687 16739 11251 16607 18584 23073 12960
11825A2960j8165j8027r311k310R698J7450J3567j665p473n390j0374j6870J1160
$$ 12960 -5205 -23232 -32543 -34853 -25155 -7705 5862 4197 -3276 -8666 -19040 -35910 -24750
11812b4750K1838J8199q36k665K976q402j1786M820m044K484L416l837n359K639
$$ -24750 -2912 15287 14451 11786 14762 6360 -5426 -606 -4650 -2166 1250 -2587 -7946 -5307
11798e307P508J0596J448L61k350k230J740o037M375R97j5526j461Q65P337j21
$$ -5307 2201 12797 14245 14606 12256 10026 11766 5729 10104 11101 -4425 -5886 -5021 2316 2195
11783B195K82l879j684J776R215J4742J0355N06j486j1259j1120J667R239J2447
$$ 2195 2477 -1402 -3086 -1310 7905 22647 33002 33508 32022 20763 9643 11310 20549 32996
11769C2996J0937n620n035K907K6003L7103N4050P9396Q3442R8451N8483K0871
$$ 32996 43933 38313 33278 36185 62188 99291 153341 232737 316179 414630 473113 493984
11757D93984j4902m9763p4687q2813p4331m2269k6570k3536j9936j120l062P159
$$ 493984 479082 429319 354632 271819 197488 155219 128649 105113 85177 84057 80995 88154
11745H8154j383k348m677L61J9186R285j65m008N161l106o410J3836L1060K9068
$$ 88154 86771 84423 79746 80107 99293 108578 108413 104405 109566 106460 100050 113886 144946 174014
11731A74014L2152O8104Q9536J13271J20934J17244J01531J7557k6877n2457q5936
$$ 174014 206166 274270 363806 477077 598011 715255 816786 834343 807466 755009 669073
11720F69073j29011j26884r8710o6229m2333l3956j5211p12q109j3438j6409p314
$$ 669073 540062 413178 314468 248239 205906 171950 156739 156027 147918 134480 118071 110757
11708A10757P581J1997q001n825k225j388k2446l247N213M149J3314K3022K8614
$$ 110757 118338 130335 122334 116509 114284 112896 90450 87203 92416 96565 109879 132901 161515
11695A61515M4340N0694P3208P0223M7581K1742j9842o2681q3317p6475n6602
$$ 161515 205855 256549 329757 399980 447561 469303 449461 386780 303463 226988 170386
11684A70386j2180k2602k1880m950k1476j9835n835J540j028j3952M655P660q49
$$ 170386 158206 135604 113724 108774 87298 67463 61628 63168 62140 48188 52843 60503 59654
11671E9654j7973j2195K234O68j6183n590R118j643P288M905K590m260j3509k373
$$ 59654 41681 29486 31720 32388 16205 10615 19733 18090 25378 30283 32873 28613 15104 12731
11657A2731j3441j5211j972L586K803J7096K119j0871o07N646r21J3667k018p661
$$ 12731 -710 -15921 -17893 -14307 -11504 5592 7711 -3160 -3767 1879 958 14625 12607 4946
11643D946L894R53J0296M976m763j5522j3900n058L014N042L579P57J2053R373
$$ 4946 8840 9793 20089 25065 20302 4780 -9120 -14178 -11164 -6122 -2543 -1786 10267 19640
11629A9640l111k8297p417l817K291J0155M930Q31Q021R434P51j5971k6616j0468
$$ 19640 16529 -11768 -19185 -23002 -20711 -10556 -5626 -4795 3226 12660 13411 -2560 -29176 -39644
11615c9644J5085J9188Q599N327j0228n129Q014M108k633j1729j5309j7J695R067
$$ -39644 -24559 -5371 3228 8555 -1673 -6802 1212 5320 2687 -9042 -24351 -24368 -22673 -13606
11601a3606j398M569J7592k0176j5519Q112O263j0151R740J2453P350r079j099
$$ -13606 -15004 -10435 7157 -13019 -28538 -20426 -14163 -24314 -14574 -2121 5229 -3850 -4949
11588d949n936K279p278q873L631P619J5974j484j5686m135o586N275N042K460
$$ -4949 -10885 -8606 -15884 -24757 -21126 -13507 2467 983 -14703 -18838 -25424 -20149 -15107 -12647
11574a2647M224M62O050j1044o727k504k980J2111R789j1615k296o15Q671O07
$$ -12647 -8423 -7961 -1911 -12955 -19682 -22186 -25166 -13055 -3266 -14881 -17177 -17792 -9121 -8514
11560h514K209K494K802n533K169n333o733Q806N209j7396p750l508J405L59P55
$$ -8514 -6305 -3811 -1009 -6542 -4373 -9706 -16439 -7633 -2424 -19820 -27570 -31078 -29673 -29314 -28559
11545b8559J6189J4675N890M612K301j4824r270J69Q961R166k18K484J2235m457
$$ -28559 -12370 2305 8195 12807 15108 284 -8986 -8817 144 9310 9092 11576 23811 19354
11531A9354o867r605j1217k357L1Q157L594n004j1215l809N15P484l115n208L208
$$ 19354 12487 2882 -8335 -10692 -10661 -2504 1090 -3914 -15129 -18938 -18423 -10939 -14054 -19262 -16054
11516a6054O168m804J3372J3433J0296l935j9053j5034J1924J2l805m749J1739
$$ -16054 -9886 -14690 -1318 12115 22411 18476 -577 -15611 -3687 -3675 -7480 -12229 -490
11503d90q433k406M866J645M357r427j7036k2920j3091Q382J1116L972M740K330
$$ -490 -8923 -11329 -6463 -4818 -461 -9888 -26924 -49844 -62935 -54553 -43437 -39465 -34725 -32395
11489c2395J4638J1853n216j4427K180j031P072J1092p86l221O295r982K387Q468
$$ -32395 -17757 -5904 -11120 -25547 -23367 -24398 -17326 -6234 -7020 -10241 -3946 -13928 -11541 -3073
11475c073r9j779J7251p392j2541m226k333R690M910j5889p997M266R986K960
$$ -3073 -3172 -4951 12300 4908 -7633 -11859 -14192 -4502 408 -15481 -23478 -19212 -9226 -6266
11461f266k203O991j1530r045m410k625R170J0355J099J253J6495L08j4476j7349
$$ -6266 -8469 -1478 -13008 -22053 -26463 -29088 -19918 -9563 -8464 -7211 9284 9592 -4884 -22233
11447b2233m308J7401m23j610j6585l799Q13K276K4647O569K594j964Q25P047
$$ -22233 -26541 -9140 -9563 -11173 -27758 -31557 -30744 -28468 -3821 2748 5342 3378 4203 11250
11433A1250l714M921Q878j1102j0473q191r967j0241Q90J5431j902L064m441r048
$$ 11250 7536 12457 21335 10233 -240 -8431 -18398 -28639 -27749 -12318 -14220 -11156 -15597 -24645
11419b4645L312j842n00P381k171o944k274o143L779P372k810J551O819r480j5443
$$ -24645 -21333 -23175 -23675 -16294 -18465 -25409 -27683 -33826 -30047 -22675 -25485 -23934 -17115 -26595 -42038
11404d2038J0906l652N783N290J1022k669R589M383j08j250J750q991O97J8486
$$ -42038 -31132 -34784 -29001 -23711 -12689 -15358 -5769 -1386 -1494 -2744 -994 -9985 -9288 9198
11390I198J3588p014q430J1066l013l500K762O738n93m457j250P294j150q024
$$ 9198 22786 15772 7342 18408 15395 11895 14657 21395 20802 16345 15095 22389 21239 13215
11376A3215N630K316M356q562q907R859m08q046j2059l328k539j497J991K976
$$ 13215 18845 21161 25517 16955 8048 17907 17499 9453 -2606 -5934 -8473 -9970 -7979 -5003
11362e003j798m609Q084L29Q383j797O4l093j1930j0252Q270K647N121j0808L156
$$ -5003 -6801 -11410 -3326 -2997 5386 3589 3653 560 -11370 -21622 -13352 -10705 -5584 -16392 -13236
11347a3236j191r573o943J7087N614M067J1327j035m536n38j1478Q32J4564N125
$$ -13236 -14427 -24000 -30943 -13856 -8242 -4175 7152 6117 1581 1043 -10435 -9603 4961 10086
11333A0086o015j2152J6194p713q433P718O952j2319l08L582r13n574j392M219
$$ 10086 4071 -8081 8113 400 -8033 -315 6637 -5682 -5990 -2408 -3321 -8895 -10287 -6068
11319f068J5374k987j1325k449J4129J1096j5597k524J520o680M84J1058J7465
$$ -6068 9306 6319 -5006 -7455 6674 17770 2173 -351 1169 -5511 -5027 6031 23496
11306B3496j674j1861j9737j1891J4806O704k853L200j0440m439J223J0724J1918
$$ 23496 21822 9961 -9776 -21667 -6861 -157 -3010 190 -10250 -14689 -13466 -2742 9176
11293I176j1145q193p076K924j461Q091L18o341O573M33L140p60Q81k6471k539
$$ 9176 -1969 -10162 -17238 -14314 -15775 -7684 -7366 -13707 -7134 -6701 -3561 -4321 -3440 -29911 -32450
11278c2450J3964J307k330J133o08J283j1060J6038J5750K797K611K542M429q831
$$ -32450 -18486 -17179 -19509 -18376 -18984 -17701 -28761 -12723 3027 5824 8435 10977 15406 6575
11264F575j1869K962R04M243r1L833o721J6079J1752k477k1968M625L033m771
$$ 6575 -5294 -2332 -1428 2815 2724 6557 -164 15915 27667 25190 3222 7847 10880 6109
11250F109j186n96m230l285O534q00M55p540M583P444O479J803r219n053r26L304
$$ 6109 4923 4327 97 -3188 3346 2546 3001 -4539 44 7488 13967 15770 6551 1498 572 3876
11234C876q129J0415P374N987q263j7124Q155J2238j5950j1667J134o23J1133
$$ 3876 -4253 6162 13536 19523 11260 -5864 2291 14529 -1421 -13088 -11954 -12577 -1444
11221a444j155o293J0402K7829n925p347O165M361P008j0151j4366m904o222J3156
$$ -1444 -2599 -8892 1510 29339 23414 16067 22232 26593 33601 23450 9084 4180 -2042 11114
11207A1114o013n243K767l753J317P327L433P613j575m740l508K677o55k88j1189
$$ 11114 5101 -142 2625 -1128 189 7516 10949 18562 16987 12247 8739 11416 10761 10473 -716
11192g16P419K922j735J2746O735Q47j8279r840k417J3501P4K877M688J347o243
$$ -716 6703 9625 7890 20636 27371 28218 9939 99 -2318 11183 11257 14134 18822 20169 13926
11177A3926p25Q140P697l055M589N767j3945o838n22O85J1530J9893J1075q814
$$ 13926 13201 21341 29038 25983 30572 36339 22394 15556 15034 15719 27249 47142 58217 49403
11163D9403M246j842N16n760n957j7101j0443M127P501K149L336M196J0240q457
$$ 49403 53649 51807 52323 46563 40606 23505 13062 17189 24690 26839 30175 34371 44611 36154
11149C6154q917K115N142m872j1810j792M68P250O051J600j780J847L175j5358
$$ 36154 27237 29352 34494 29622 17812 16020 16488 23738 29789 31389 29609 31456 34631 19273
11135A9273r855j1214J3339J3174J3353J4704p098j1602j778L170J356k042l632
$$ 19273 9418 -1796 11543 24717 38070 52774 45676 34074 32296 35466 36822 34780 31148
11122C1148j584j0709N262M43P017k283j1779N829J0281n0n672Q330N034j0063
$$ 31148 29564 18855 24117 24560 31577 29294 17515 23344 33625 33575 27903 36233 41267 31204
11108C1204J95Q461L360J590n84j2430l34J3372j0676q55K594k125l096m037o533
$$ 31204 31399 39860 43220 44810 44226 31796 31462 44834 34158 33303 35897 33772 30676 26639 20106
11093B0106M675J0044J2510L639l276K654n288r125J1204J3780j137r197K250
$$ 20106 24781 34825 47335 50974 47698 50352 45064 35939 47143 60923 59786 50589 52839
11080E2839j2018j8994L880k50j4128M915P229J5219k265K12j1556r954k996l173
$$ 52839 40821 21827 25707 25457 11329 16244 23473 38692 36427 36639 25083 15129 12133 8960
11066H960J1028k760N874k223j2497L703J0554k295r05J3583j2494o285j3480
$$ 8960 19988 17228 23102 20879 8382 12085 22639 20344 19439 33022 20528 14243 763
11053G63R291N237M778K657J1570j0094n409K831o295N436J0588J3902J7930J0593
$$ 763 10054 15291 20069 22726 34296 24202 18793 21624 15329 20765 31353 45255 63185 73778
11039G3778m31j9684j5740K964N563J0354L351L393K502J40p161j6544k122p453
$$ 73778 73347 53663 37923 40887 46450 56804 60155 63548 66050 66190 59029 42485 40363 32910
11025C2910k3763j0279K1484K0574N798N833M188j9929J828J3526K878n062o309
$$ 32910 9147 -1132 20352 40926 46724 52557 56745 36816 38644 52170 55048 49986 43677
11012D3677M311Q511Q23N860m436j9762K152K1728R515J713k483q30n94L10R793
$$ 43677 47988 56499 57322 63182 58746 38984 41136 62864 72379 74092 71609 70779 70185 70495 80288
10997H0288J524J0092m442Q866Q503J0218r893j3482r85q616K847R738O712L17
$$ 80288 81812 91904 87462 96328 104831 115049 105156 91674 90689 82073 84920 94658 101370 101687
10983A01687M344j8428r000P50n669L660J9571O006p632o647o958K880J2653R507
$$ 101687 106031 87603 78603 79353 73684 77344 96915 102921 95289 88642 81684 84564 97217 106724
10969A06724j8619j3078J118J0476M402N734J6082J5142J0008J9152M56m943J382
$$ 106724 88105 75027 76145 86621 91023 96757 112839 127981 137989 157141 157597 152654 154036
10956A54036o028l360q498J7924P005K233O668k040K474m562j505j5651r532q096
$$ 154036 148008 144648 136150 154074 161079 163312 169980 167940 170414 165852 164347 148696 139164 131068
10942A31068J2090R889N509p378j3419j2979j0312j655k579p26R72L458R33O307
$$ 131068 143158 153047 158556 151178 137759 124780 114468 112813 110234 109508 110480 113938 114871 121178
10928A21178p896j5692j1255j1069j550J773K175K564J3048J6214n26j0722j165
$$ 121178 113282 97590 86335 75266 73716 75489 77664 80228 93276 109490 108964 98242 97077
10915I7077l825O109k65l600n996J0492p786m441K1381J3613O117j186j0447n871
$$ 97077 93252 99361 99096 95496 89500 99992 92206 87765 109146 122759 128876 127690 117243 111372
10901A11372k389J132Q576o419j4645j291q829Q699O214J8914J053j4614j5269
$$ 111372 108983 110115 118691 112272 97627 96336 87507 96206 102420 121334 122387 107773 92504
10888I2504L455j3689j3476j1077L279R030R875J1765o984k5586q555j0878k195
$$ 92504 95959 82270 68794 57717 60996 70026 79901 91666 84682 59096 50541 39663 37468
10875C7468O358k247K580P438J386J1281J9366O104q452k312j955l750J664j884
$$ 37468 43826 41579 44159 51597 52983 64264 83630 89734 81282 78970 77015 73265 74929 73045
10861G3045K241q767Q107L821o047j3168k266L609Q591p846m011n58j173o379
$$ 73045 75286 66519 74626 78447 72400 59232 56966 60575 69166 61320 57309 56751 55578 49199
10847D9199q395j4362O119K941j0064j1363o908L071J2121J3088J0879k452n371
$$ 49199 40804 26442 32561 35502 25438 14075 7167 10238 22359 35447 46326 43874 38503
10834C8503K104q8k769n119L106J485O187L980k095p325j6079p716R71p995L701
$$ 38503 40607 40519 37750 32631 35737 37222 43409 47389 45294 37969 21890 14174 15145 7150 10851
10819A0851k36r584q266m528l065M510N875M887R487O425O206q72O311R964J3710
$$ 10851 10615 1031 -7235 -11763 -14828 -10318 -4443 444 9931 16356 22562 21690 28001 37965 51675
10804E1675Q467Q854R932L957M82J6729M280J0008O553R17R455J5661K0635K4097
$$ 51675 60142 68996 78928 82885 83367 100096 104376 114384 120937 121854 131309 146970 167605 191702
10790A91702L959O26K2071L2226K2224L6080K9257M2233O6807Q2306J31274K26938
$$ 191702 195661 196287 218358 250584 272808 308888 338145 380378 447185 529491 660765 887703
10778H87703L49675M55880L86005K25318J56440O9752j16888j12096J00755J32016
$$ 887703 1237378 1693258 2079263 2304581 2461021 2530773 2413885 2301789 2402544 2534560
10768B534560J9573j4452j37041m19546n02538l52467k23543j32609r7767p4441
$$ 2534560 2554133 2539681 2402640 1983094 1480556 1128089 904546 771937 674170 599729
10758E99729n5051m0948m1474l2097k7922l2713k6874k171J838j7290J563j0200
$$ 599729 544678 503730 462256 430159 402237 369524 342650 340479 342317 325027 326590 316390
10746C16390l1300j2317q638q462J188j0303q072k1613j2766q454j2576J0506
$$ 316390 285090 272773 264135 255673 256861 246558 238486 216873 204107 195653 183077 193583
10734A93583J6822J0184j303J817L2830O649J6536K7834J077m1812n2464k4977
$$ 193583 210405 220589 219286 221103 253933 260582 277118 304952 306029 264217 211753 186776
10722A86776q690P551p03k590j1203p398q345j5009j9188o920J6314K1477j6925
$$ 186776 178086 185637 184934 182344 171141 163743 155398 140389 121201 114281 130595 152072 135147
10709A35147j4559j245N133n188m386N252P759J2087K142O372Q68j2627j3010
$$ 135147 120588 119343 124476 119288 114902 120154 127913 140000 142142 148514 149382 136755 123745
10696A23745j4228K782j037o138M4j0231l116k684m939o475n835p40J0407J1186
$$ 123745 109517 112299 111262 105124 105168 94937 91821 89137 84198 77723 71888 71148 81555 92741
10682I2741r983j096O371J1930J5743K026r148K621K08k0105m375n48o987k4183
$$ 92741 82758 81662 88033 99963 115706 117732 108584 111205 111413 91308 86933 86385 79398 55215
10668E5215m711J5711K18k2994k8307j3115J042L033n660j256O987p463j663j251
$$ 55215 50504 66215 66433 43439 15132 2017 3059 6092 432 -824 6163 -1300 -2963 -4214
10654d214J1648O842J5937P471J5576J5831K734j4563o951l677M582L819N445
$$ -4214 7434 14276 30213 37684 53260 69091 71825 57262 50311 46634 51216 55035 60480
10641F0480K7281K1837O738l549P154J4036J8160J8268M346P155K0458O136N338
$$ 60480 87761 109598 116336 112787 119941 133977 152137 170405 174751 181906 202364 208500 213838
10628B13838L4097N6613J8578P474J5417K0864P972J8624L2291K1795j452j0361
$$ 213838 247935 304548 323126 330600 346017 366881 374853 393477 425768 447563 446111 435750
10616D35750r609j9936m891r322k6994k3862R271M735l2296k1500j5240N257O542
$$ 435750 426141 406205 401314 391992 364998 341136 350407 355142 322846 301346 286106 291363 297905
10603B97905N843K4354k7j9535p409l0406l4079k9056j1216j9835k8211q251P786
$$ 297905 303748 328102 328075 308540 301131 270725 236646 207590 196374 176539 148328 140077 147863
10590A47863K36j287J792j7521j7734r919O269J0626J7142J1050M62K019N771
$$ 147863 148099 146812 148604 131083 113349 103430 109699 120325 137467 148517 148979 150998 156769
10577A56769M564O433R813j544O054j71o514Q646J8848J3382J9512J0261j62j979
$$ 156769 161333 167766 177579 176035 182089 181918 175404 184050 202898 216280 235792 246053 245891 243912
10563B43912R823j918j6881l1945k3553l4916k0542J9940J4779r764m0119m0000
$$ 243912 253735 251817 234936 202991 179438 144522 123980 143920 158699 148935 108816 68816
10551F8816l8871l1020k1317o344l411l794M792J3020r93J0126Q787J6730n207
$$ 68816 29945 -1075 -22392 -28736 -32147 -35941 -31149 -18129 -19122 -8996 -209 16521 11314
10538A1314P965M2198K6631O491L3021J7178K0549L2686N6715L6989L3982L0898
$$ 11314 19279 61477 88108 94599 127620 144798 165347 198033 254748 291737 325719 356617
10526C56617n221l8242m3370l6874m4023l0352k7009k9244m2954k5231k332J7417
$$ 356617 351396 313154 269784 232910 188887 158535 131526 102282 59328 34097 31765 49182
10514D9182M092J082l254j4317j4787j3583q04R766k12k8413o2078m9260l2232
$$ 49182 53274 54356 51102 36785 21998 8415 7611 17377 17165 -11248 -73326 -122586 -154818
10501a54818n630Q4935J44481J75118J41698J22435Q6889K7465L0747J34915J91924
$$ -154818 -160448 -75513 68968 244086 385784 508219 595108 622573 653320 788235 980159
10490I80159J94855J68735J03953M936m9188m5023l2459o3059m0873j2631j842
$$ 980159 1175014 1343749 1447702 1452638 1403450 1358427 1325968 1262909 1222036 1209405 1207563
10479A207563P062J1584j1164j8766P16j4468k2574l0983j7298j2401n276j0184
$$ 1207563 1214625 1226209 1215045 1196279 1196995 1182527 1159953 1128970 1111672 1099271 1093995 1083811
10467A083811j5825j7064k6591q000J8852J3486J3010J5534M481K4543K2051K9983
$$ 1083811 1067986 1050922 1024331 1016331 1035183 1048669 1061679 1077213 1081694 1106237 1128288 1158271
10455A158271M0453N4367L6416J583k5902k5629k1893M787Q788J6997N626j2367
$$ 1158271 1198724 1253091 1289507 1291090 1265188 1239559 1217666 1222453 1231241 1248238 1253864 1241497
10443A241497o674J2383J8446O229K9930L6000K8592K3825L5001K7910q665P32
$$ 1241497 1234823 1247206 1265652 1271881 1301811 1337811 1366403 1390228 1425229 1453139 1444474 1445206
10431A445206L0597J3827L546L6530N692J2252J4083L3956L8144M6172Q0488J19601
$$ 1445206 1475803 1489630 1493176 1529706 1535398 1547650 1561733 1595689 1633833 1680005 1760493 1880094
10419A880094J32452J14182J11131J12927J11051Q2839R5261J45400J66614J53224
$$ 1880094 2012546 2126728 2237859 2350786 2461837 2544676 2639937 2785337 2951951 3105175
10409C105175J63033J79226J52904J64019K44819K75360K82734L43046L82574
$$ 3105175 3268208 3447434 3600338 3764357 4009176 4284536 4567270 4910316 5292890
10400E292890L95009M56064N72133O55770P48596R05573J104552J192687J109620
$$ 5292890 5687899 6143963 6716096 7371866 8120462 9026035 10130587 11323274 12432894
10391A2432894J085974J185511J210599J201080J572238K081254K369775K648876
$$ 12432894 13518868 14704379 15914978 17116058 18688296 20769550 23139325 25788201
10383B5788201L024848L167108L296137M060765N360103P093496R779463J4321164
$$ 25788201 28813049 31980157 35276294 39337059 44697162 51790658 61570121 75891285
10375G5891285K2007799L5451155N6833192P9179211P5283257M2291773K6714255
$$ 75891285 97899084 133350239 190183431 269362642 344645899 386937672 413651927
10368D13651927K1442492j0107319l1510233O159145K7302436Q319720j852663
$$ 413651927 435094419 424987100 393476867 399636012 426938448 435258168 433405505
10361D33405505r978843n2346877r0930900p2136849m4144169k7796296j9133757
$$ 433405505 423426662 371079785 280148885 208012036 163867867 136071571 116937814
10354A16937814j4131370j0810439q540038o930683n628212m735633m255019m002717
$$ 116937814 102806444 91996005 83455967 76525284 70897072 66161439 61906420 57903703
10346E7903703l757383l381428l087111k967388k637050k105770j898356j861415
$$ 57903703 54146320 50764892 47677781 44710393 42073343 39967573 38069217 36207802
10338C6207802j747949j765647j959364j922664j649924j390805j274409j195255
$$ 36207802 34459853 32694206 30734842 28812178 27162254 25771449 24497040 23301785
10330B3301785j085820j006544r44535q54423p76604p41995p51968o86727o41134
$$ 23301785 22215965 21209421 20264886 19410463 18633859 17891864 17139896 16453169 15812035
10321A5812035o15887n33195m51862m31267m49890m15936l91388l91878m08348
$$ 15812035 15196148 14662953 14211091 13779824 13329934 12913998 12522610 12130732 11722384
10312A1722384l57817k95719k97318l21239l29795l49226l48826k88594j70134
$$ 11722384 11364567 11068848 10771530 10450291 10120496 9771270 9422444 9133850 8963716
10303H963716o0413l298n8171j08482r7438j68675k54890j88109j40601j67669
$$ 8963716 8903303 8900005 8841834 8733352 8635914 8467239 8212349 8024240 7883639 7715970
10293G715970k03252k78227m29241n14009m46710l68998l28424l03746k93984
$$ 7715970 7512718 7234491 6805250 6291241 5844531 5475533 5147109 4843363 4549379
10284D549379k60542k67337k64561k55386k38983k30143k09244j77058j49061
$$ 4549379 4288837 4021500 3756939 3501553 3262570 3032427 2823183 2646125 2497064
10275B497064j38154j47893j26964j19818j25509j24802j14208q8453o9577o1559
$$ 2497064 2358910 2211017 2084053 1964235 1838726 1713924 1599716 1511263 1441686 1380127
10265A380127q0998p7502r1716j21997p2824l7136n2618o0317m2259n5810o7613
$$ 1380127 1299129 1221627 1129911 1007914 935090 897954 845336 785019 742760 686950 619337
10254F19337m0080l2792k8580j6344k0208k9399k8113k249J6264P6600O8824K6720
$$ 619337 579257 546465 517885 501541 481333 451934 423821 421572 437836 514436 583260 609980
10242F09980J9509N7071P0992Q2909R8288Q5497N1927J4199J9405K7275L5504
$$ 609980 629489 686560 757552 840461 938749 1024246 1076173 1090372 1109777 1137052 1172556
10231A172556M3469R733K533j0489j0459j2662R808J4276J3479N595q383o205
$$ 1172556 1216025 1225758 1228291 1217802 1207343 1194681 1204489 1218765 1232244 1237839 1229456 1223251
10219A223251q157j0612k0444r433o967j9062l4797j857j7818k5805j2424k0967
$$ 1223251 1215094 1204482 1184038 1174605 1167638 1148576 1113779 1111922 1094104 1068299 1055875 1034908
10207A034908k5322j6402l498r09r138K911R06j3553l5839k9656j3205o012P674
$$ 1034908 1009586 993184 989686 988777 979639 982550 983456 969903 934064 904408 891203 885191 892865
10194H92865J3853O7J8778J0182m456l035j784J147J6137n560o019j4750l1064
$$ 892865 906718 906785 925563 935745 931289 928254 926470 927617 943754 938194 932175 917425 886361
10181H86361o3505m2160l8747n9499l8652P67L395k6240l4512l0349k7063m4984
$$ 886361 822856 780696 741949 682450 643798 644565 647960 621720 587208 556859 529796 484812
10169D84812j7933o139p373O258K614K3118K3608J1289n460Q309J6903O660j9587
$$ 484812 466879 460740 453367 459625 462239 485357 508965 520254 514794 523103 540006 546666 527079
10156E27079j4040o91j34J692j462q108q679p483j7669q152r837k0552j8379j2270
$$ 527079 513039 512348 512214 513906 512444 504336 495657 488174 470505 462353 452516 431964 413585 401315
10142D01315k793j1681j2851j7644l0679l4288j1360k5991m0088k0951k0035l4035
$$ 401315 398522 386841 373990 356346 325667 291379 280019 254028 213940 192989 172954 138919
10130A38919j8810j1706p742O580L398K1287J5320l179j240R798J2388p762j1564
$$ 138919 120109 108403 100661 107241 110639 131926 147246 144067 142827 152625 165013 157251 145687
10117A45687q113O957J2675M145k37r836p98J0092R248L555n80m628j6254j7682
$$ 145687 137574 144531 157206 161351 161114 151278 150480 160572 169820 173375 172795 168167 151913 134231
10103A34231l718m795J1167P109J1115j6162p352P310l090M931K1979K7872J0504
$$ 134231 130513 125718 136885 143994 155109 138947 131595 138905 135815 140746 162725 190597 201101
10090B01101M932J430J3631K1377K1383J4319J2235K7101k90l0621l3955q848
$$ 201101 206033 207463 221094 242471 263854 278173 290408 317509 317219 286598 252643 243795
10078B43795Q10l006p482J3542K499m977o232J648k189k864P244q832j6814j9116
$$ 243795 244605 241599 234117 247659 250158 245181 238949 240597 238408 235544 242788 233956 217142 198026
10064A98026k9160k9614j8203J3250P878r102m332r91p612k0296O64Q815J0439
$$ 198026 168866 139252 121049 134299 142177 133075 128743 127752 120140 99844 100508 109323 119762
10051A19762P720O372M163Q90J3795J2671Q293K915L358n166k187M29L056K2171
$$ 119762 127482 133854 138017 138907 152702 165373 173666 176581 179939 174773 172586 173015 176071 198242
10037A98242M1529N1497R0458J60608K70041K45250O3219L0790L0765j68097l42761
$$ 198242 239771 291268 381726 542334 812375 1057625 1120844 1151634 1182399 1014302 671541
10026F71541j84874q8980n4687l4542k6658k5436j2231j5010r642n266j2530r937
$$ 671541 486667 397687 343000 308458 281800 256364 244133 229123 219481 214215 201685 191748
10014A91748j9964j1705k292m224J1663Q617r140K822O95j1711n24j4996p503
$$ 191748 171784 160079 157787 153563 165226 173843 164703 167525 168220 156509 155985 140989 133486
10001A33486o876j0133m004q656l747O562N84j0480K308M451M089L764M241L249
$$ 133486 126610 116477 112473 103817 100070 106632 107216 96736 99044 103495 107584 111348 115589 118838
9987A18838J8333Q964o21L748N244L610J3469j1700J591m005M579O938J6972K2171
$$ 118838 137171 146135 145514 149262 154506 158116 171585 159885 161476 157471 162050 168988 185960 208131
9973B08131J6929N182R347J2069O72K0741N1425N4673R0398J16258J85641L21021
$$ 208131 225060 230242 239589 251658 252330 273071 324496 379169 469567 585825 771466 1092487
9961A092487M39003M27366K62757J73262J18212m9843j56914L1913J47358N7646
$$ 1092487 1531490 1958856 2221613 2394875 2513087 2463244 2306330 2338243 2485601 2543247
9951B543247j4645o7630k92362n01198l99031k59661j59866j11183p7977n6164
$$ 2543247 2528602 2460972 2168610 1667412 1268381 1008720 848854 737671 659694 603530
9941F03530l9517m4336m7893m6681k6232r742j0743k0090k2480k1432j6056j3594
$$ 603530 564013 519677 471784 425103 398871 389129 378386 358296 335816 314384 298328 284734
9929B84734j5770n708r326l844m6q674O616N457J085j033L012K76j2684j568N234
$$ 284734 268964 263256 253930 250086 250040 241366 247982 253439 254524 253491 256503 256779 244095 242527 247761
9914B47761r787j6578q968j831l705M78q861l0115j7257J6733n713j0374M669
$$ 247761 237974 221396 212428 210597 206892 207370 198509 168394 151137 167870 162157 151783 156452
9901A56452O957k692r723j83j0585R39O884L725R69N902k189j3699K235Q066j80
$$ 156452 163409 160717 150994 150811 140226 141165 148049 151774 152743 158645 156456 142757 144992 153058 152878
9886A52878q269l392j5137p871J41j1011k321j2947p305j481J1435K905L398q452
$$ 152878 144609 141217 126080 118209 118350 107339 105018 92071 84766 83285 94720 97625 101023 92571
9872I2571K544O762k700j1585O97J174M785p225k271R977J206Q116n207n959J34
$$ 92571 95115 101877 99177 87592 88289 89463 94248 87023 84752 94729 95935 104051 98844 92885 93019
9857I3019l654J5562J35j8204k1743m898L660k96R764o858M740J0550j0653J180
$$ 93019 89365 104927 105062 86858 65115 60217 63877 63581 73345 66487 71227 81777 71124 72304
9843G2304q511j767P674N749L55n056j5740J0958J8421J1090K123J052P600K3507
$$ 72304 63793 62026 69700 75449 75804 70748 55008 65966 84387 95477 97600 98652 106252 129759
9829A29759J8916O023J3686K515k38L032j4480j5901j8902r024J335K080n307
$$ 129759 148675 154698 168384 170899 170661 173693 159213 143312 124410 115386 116721 118801 113494
9816A13494k0126J904M074j6328N614N907J706O239j8596j983K881o874k391j6040
$$ 113494 93368 95272 99346 83018 88632 94539 96245 102484 83888 81905 84786 77912 75521 59481
9802E9481o215L043Q678J3486J2960j0980M965k375j3866q669J1902P297J4743
$$ 59481 53266 56309 64987 78473 91433 80453 85418 83043 69177 60508 72410 79707 94450
9789I4450Q509M386K002O154m179l509q644n630P410J6604r971n835o805n889
$$ 94450 102959 107345 109347 115501 111322 107813 99169 93539 100949 117553 107582 101747 94942 89053
9775H9053J46O087N692j1927J6919R554J1287j5070M060N731J5243K1608P962
$$ 89053 89199 95286 100978 89051 105970 115524 126811 111741 115801 121532 136775 158383 166345
9762A66345P937R41j602J7242q998k0803j4432J297r458J461Q382J897M641Q82
$$ 166345 174282 175223 173621 190863 181865 161062 146630 147927 138469 139930 148312 150209 154850 155732
9748A55732j00K670K49M381o286J2264M412j2982o41k725P175K506Q365j2028
$$ 155732 155632 158302 158551 162932 156646 168910 173322 160340 159699 156974 164149 166655 175020 162992
9734A62992j5478P792J093n535j0235l765J4235K622j8685j8765N966J491J748
$$ 162992 147514 155306 156399 150864 140629 136864 151099 153721 135036 116271 122237 123728 125476
9721A25476L846K122j5875R80Q229J1022J4676J104m15m515j136n260j6434N775
$$ 125476 129322 131444 115569 116549 124778 135800 150476 151580 151165 146650 145514 140254 123820 129595
9707A29595M599O230k248k114J459M047o32O500j4130m423K808k0554k5641O18
$$ 129595 134194 140424 138176 136062 137521 141568 140936 147436 133306 128883 131691 111137 85496 86114
9693H6114l438K574k456J3546O374O665q131N949q869L650k68j3061j2863K509
$$ 86114 82676 85250 82794 96340 102714 109379 101248 107197 98328 101978 101710 88649 75786 78295
9679G8295L106J5467J3584n061M588q637j6555l345J162K235j524j966J660L486
$$ 78295 81401 96868 110452 105391 109979 101342 84787 81442 82604 84839 83315 81349 83009 86495
9665H6495Q632m759K20r611n958r17J5201J2341K882l343n813q421l382R685K014
$$ 86495 95127 90368 90588 80977 75019 74102 89303 101644 104526 101183 95370 86949 83567 93252 95266
9650I5266j2896Q260j2559R23l186l204J0471J1133J47o766N972N009R077L933
$$ 95266 82370 90630 78071 78994 75808 72604 83075 94208 94355 87589 93561 98570 107647 111580
9636A11580k5405j3957m000K755j1072k438j2189K2055Q658j407M585j981r806
$$ 111580 86175 72218 68218 70973 59901 57463 45274 67329 75987 74580 79165 77184 67378
9623F7378q11K654K1636J551k30k394o379q4J974K5574R22o354M848P439q550
$$ 67378 66567 69221 90857 92408 92178 89784 83405 83321 85295 110869 111791 105437 110285 117724 109174
9608A09174j2J0380R94M854k6n79o983j3976k148P803n833j068r0l822J2870Q513
$$ 109174 109162 119542 120536 125390 125364 124785 117802 103826 101678 109481 103648 102580 102490 98668 111538 120051
9592A20051m476j1556k717J3111N674M516R247q940J9598J0230m560j9007j0125
$$ 120051 115575 104019 101302 114413 120087 124603 133850 124910 144508 154738 150178 131171 121046
9579A21046K973n691L787j0J2661J4297L139K643j646j678k794n808m688p48O020
$$ 121046 124019 118328 122115 122105 134766 149063 152202 154845 153199 151521 148727 142919 138231 137483 143503
9564A43503K788M011R306j0093M402J0255J1595J625q97J475J2567J2688M346
$$ 143503 146291 150302 159608 149515 153917 164172 175767 177392 176495 177970 190537 203225 207571
9551B07571k097J571J3511K852r984M005J7892p45p95Q607J9344L251J6786P171
$$ 207571 205474 207045 220556 223408 213424 217429 235321 234576 233781 242388 261732 264983 281769 288940
9537B88940r018J9165O766K0680K2372J4551K0485J5535K828J2385L1548L2491
$$ 288940 279922 299087 305853 326533 348905 363456 383941 399476 402304 414689 446237 478728
9525D78728J2948L5560M3167M0496M5708M2498M8771L2371L2587M8984O4054O4462
$$ 478728 491676 527236 570403 610899 656607 699105 747876 780247 812834 861818 925872 990334
9513I90334O5106Q7343P5360Q9187J00582J17080J28020J40976J50934J73662
$$ 990334 1055440 1142783 1218143 1307330 1407912 1524992 1653012 1793988 1944922 2118584
9503B118584J86531J92080K11199K14321K40043K28647K08541J87267J47990J25012
$$ 2118584 2305115 2497195 2708394 2922715 3162758 3391405 3599946 3787213 3935203 4060215
9493D060215P4321K3060l5855j07170j31379j56346j69986j87300k12127j99631
$$ 4060215 4134536 4157596 4121741 4014571 3883192 3726846 3556860 3369560 3157433 2957802
9483B957802j90973j68370j56167j67122j50304j26428j15667j05635r8668j09690
$$ 2957802 2766829 2598459 2442292 2275170 2124866 1998438 1882771 1777136 1678468 1568778
9473A568778q5606o1131n8929p3225p3056o6594o6888o2163l5175n1082l4213
$$ 1568778 1483172 1422041 1363112 1289887 1216831 1150237 1083349 1021186 986011 934929 900716
9462I00716k3648m1169m4755m1394m3862j8484j2371l2393m9202l0526k2195j0366
$$ 900716 877068 835899 791144 749750 705888 687404 675033 642640 593438 562912 540717 530351
9450E30351k446j2651j9566k7978l3675j7113m318l240k0512j2907r39p869j0180
$$ 530351 527905 515254 495688 467710 434035 416922 412604 409364 388852 375945 375006 367137 356957
9437C56957p712k4112j7368L057q191n942p507k0728j2203j0216r524O716Q795
$$ 356957 349245 325133 307765 310822 302631 296689 289182 268454 256251 246035 236511 243227 252022
9424B52022n060o276P899K576j0731k0294j0259j2027k0499p877l006n371k464
$$ 252022 246962 240686 248585 251161 240430 220136 209877 197850 177351 169474 166468 161097 158633
9411A58633j0501J653R067j1234j500r243P498j2071o898n644J130n716r228l86
$$ 158633 148132 149785 158852 147618 146118 136875 144373 132302 125404 119760 120890 115174 105946 105560
9397A05560K160k49m135o854q493q370M490N524r222j0830K9815Q161j1939k0590
$$ 105560 107720 107471 103336 96482 87989 79619 84109 89633 80411 69581 99396 107557 95618 75028
9383G5028p272J0434R055O737r30r520j730M657n524n980j0281n166m480J3334
$$ 75028 67756 78190 87245 93982 93052 83532 81802 86459 80935 74955 64674 59508 55028 68362
9369F8362j202l131L387p579o358J5938j099j2750j1002l150J1894L048l61m932
$$ 68362 67160 64029 67416 59837 53479 69417 68318 55568 44566 41416 53310 56358 55997 51065
9355E1065R46J3263j015o003Q166n163N721J3115l71O199k460j2198k1124J598
$$ 51065 52011 65274 64259 58256 66422 61259 66980 80095 79724 85923 83463 71265 50141 51739
9341E1739J957L804l203n328R331Q369L383Q424m688j3820J0849N994l711P716
$$ 51739 53696 57500 54297 48969 58300 66669 70052 78476 73788 59968 70817 76811 73100 80816
9327H0816Q686r043j2342o441J747O617p703p884j2150r460m151L733J6262Q757
$$ 80816 89502 80459 68117 61676 63423 70040 62337 54453 42303 32843 28692 32425 48687 57444
9313E7444r513m107J2255Q979J2942j1054l820k995m966Q165J1260O795o206j474
$$ 57444 47931 43824 56079 65058 78000 66946 63126 60131 55165 63330 74590 81385 75179 73705
9299G3705m93n516K385r230m452n484p668K716k884J1808j3447j2774o225R242
$$ 73705 73212 67696 70081 60851 56399 50915 43247 45963 43079 54887 41440 28666 22441 31683
9285C1683N881O063l464p809k2158M251q43l667M851J8107J0894K475j3219K147
$$ 31683 37564 43627 40163 32354 10196 14447 13604 9937 14788 32895 43789 46264 33045 35192
9271C5192J1453j703M229j4749p996J2764n619j2116M602P205M308k321o25p93
$$ 35192 46645 44942 49171 34422 26426 39190 33571 21455 26057 33262 37570 35249 34624 33831
9257C3831l982p60Q844R410l343j3321J0465m154j8250l643j217M737K4510P22
$$ 33831 29849 29089 37933 47343 44000 30679 41144 36990 18740 15097 13880 18617 43127 43849
9243D3849o263M675k036k1346m511l273J5730R663J1377J0054j3054K57M296L066
$$ 43849 37586 42261 40225 18879 14368 11095 26825 36488 47865 57919 44865 45122 49418 52484
9229E2484j7620k1068j737J4363O94J594J2740O252N273m614q892O088K619n268
$$ 52484 34864 13796 12059 26422 27116 28710 41450 47702 52975 48361 39469 45557 48176 42908
9215D2908l134Q46j784J494j1920P171J272l239J1628O632j3841p469j0008k2228
$$ 42908 39774 40620 38836 40330 28410 35581 36853 33614 45242 51874 38033 30564 20556 -1672
9201a672n147J4885P880r182J1529J1038P380n48P08L083j947P306K7602P218
$$ -1672 -6819 8066 15946 6764 18293 29331 36711 36163 36871 39954 38007 45313 72915 80133
9187H0133K319K911p293L641p280j6018L5J3978L994l212k165J3607P013N216
$$ 80133 82452 85363 78070 81711 74431 58413 58448 72426 76420 73208 71043 84650 91663 96879
9173I6879Q473l92M88o672j0383k390J2700N636P837M601P851l3j3274j2106O274
$$ 96879 105352 104960 105448 98776 88393 86003 98703 104339 112176 116777 124628 124595 111321 99215 105489
9158A05489n818j0493j6096j456q02J4482Q373k97N6m484n694R23r957Q260k3
$$ 105489 99671 89178 73082 71626 70824 85306 93679 93382 93438 88954 83260 84183 74226 82486 82463
9143H2463l2334L115J2696l355r888r572J0278J3931K326j5269n667k2461o571
$$ 82463 50129 53244 65940 62585 52697 43125 53403 67334 69660 54391 48724 26263 19692
9130A9692K0180L931K825N448p534j9258q113O860J35j330L080p251j959K1557
$$ 19692 39872 43803 46628 52076 44542 25284 17171 24031 24166 22836 25916 18665 16706 38263
9116C8263J2525r074p515P060k206k507j1232o76J490M74L204O158P014j0708
$$ 38263 50788 41714 34199 41259 39053 36546 25314 24638 26128 26602 29806 35964 42978 32270
9102C2270J789K778j5587M97L325o26Q666N433K619q597k3310j0829Q772K0651
$$ 32270 34059 36837 21250 21747 25072 24446 33112 38545 41164 32567 9257 -1572 7200 27851
9088B7851M349J0388j216J826M261k2911q64N903o03o252j0568M191R853p229
$$ 27851 32200 42588 41372 43198 47459 24548 23684 29587 28984 22732 12164 16355 26208 18979
9074A8979j2237l022M162J4433P428j0280p101J973J8413J1855n387j4143M888
$$ 18979 6742 3720 7882 22315 29743 19463 12362 14335 32748 44603 39216 25073 29961
9061B9961j407L514M608J0890J252O713O410P743J1311O083N433k3114j8957j4374
$$ 29961 28554 32068 36676 47566 48818 55531 61941 69684 80995 87078 92511 69397 50440 36066
9047C6066j5396j2295L80Q473m448o071j5052M222Q365R357J2539P414q896m135
$$ 36066 20670 8375 8755 17228 12780 6709 -8343 -4121 4244 13601 26140 33554 24658 20523
9033B0523j207k262k957j1850o509J6288J4627j5585p519Q140J3293q051q074
$$ 20523 19316 17054 14097 2247 -4262 12026 26653 11068 3549 11689 24982 16931 8857
9020H857J3894P929K983M938J1802L0751J0686p114j0041q925q289q025j1083
$$ 8857 22751 30680 33663 38601 50403 81154 91840 84726 74685 65760 57471 49446 38363
9007C8363J2535J7016o322j1231j1493O909L104j1395q525l655o641q055q109
$$ 38363 50898 67914 61592 50361 38868 45777 48881 37486 28961 25306 18665 10610 2501
8994B501L246K1284j061k978J1986p852j1728k944k016P283M263K149m065M953
$$ 2501 5747 27031 25970 22992 34978 27126 15398 12454 10438 17721 21984 24133 20068 25021
8980B5021R62q782m900n771N780j40L792J0672J753j2566q977R14p767N010K3326
$$ 25021 25983 17201 12301 6530 12310 12170 15962 26634 28387 15821 6844 7758 -9 5001 28327
8965B8327J411j2491R525Q678j953P74k1194L25m219M78L204P3M647N362K476
$$ 28327 29738 17247 26772 35450 33497 34271 13077 13402 9183 9661 12865 12938 17585 22947 25423
8950B5423j171j0202j0340Q852o81l845J1767k014j343M234J2761P535l493j963
$$ 25423 24252 14050 3710 12562 11881 8036 19803 17789 16446 20680 33441 40976 37483 35520
8936C5520r118j0361m020k430R677J2264l828j0030p327J428M608j0371q173J0280
$$ 35520 26402 16041 12021 9591 19268 31532 27704 17674 10347 11775 16383 6012 -2161 8119
8922H119Q537R999k861m90j418J044o137j5972q42O379n416J6373Q623l501k825
$$ 8119 16656 26655 23794 23304 21886 22930 16793 821 -21 6358 942 17315 25938 22437 19612
8907A9612L160Q218O684r742J990o92j1694m994j0847m591L948K904p370l698
$$ 19612 22772 30990 37674 27932 29922 29230 17536 12542 1695 -2896 1052 3956 -3414 -7112
8893g112J3446K428r78J6361k807k866n65O531l049N400K0745j948M625J9134
$$ -7112 6334 8762 7784 24145 21338 18472 17907 24438 21389 26789 47534 45586 50211 69345
8879F9345J6727L2023K9227N0261O9568L1126K906j159k2392n1926n2199l0279
$$ 69345 86072 118095 147322 197583 267151 298277 301183 300024 277632 225706 173507 143228
8867A43228j7000r325j7632j7842j1239n408k496o874q786q465j2979L369J636
$$ 143228 126228 116903 99271 81429 70190 64782 62286 55412 46626 38161 25182 28551 30187
8854C0187N970K84j269p398q320R292J161L073R247Q381j3091p448J4079M453
$$ 30187 36157 36441 35172 27774 19454 28746 29907 32980 42227 50608 37517 30069 44148 48601
8840D8601J1357j0867o816j3237q51J4575K981j8174j8028n707l903Q200R900
$$ 48601 59958 49091 42275 29038 28187 42762 45743 27569 9541 3834 -69 8131 18031
8827A8031N679l460J2885L942n170J0359J4745j1802j5153j5595L756N876p888
$$ 18031 23710 20250 33135 37077 31907 42266 57011 45209 30056 14461 18217 24093 16205
8814A6205r743m311m34O737K91r619n503j405L084L564P919Q788L663q277n186
$$ 16205 6462 2151 1717 8454 8745 -874 -6377 -7782 -4698 -1134 6785 15573 19236 10959 5773
8799E773k05J4626N378j0476l873O005j1251j6161L957K1511L525j609J920j0515
$$ 5773 5568 20194 25572 15096 11223 17228 5977 -10184 -6227 15284 18809 17200 19120 8605
8785H605Q137J2715j1022k4967j2814M861J2962K396Q628j2480M872K782Q94m010
$$ 8605 16742 29457 18435 -6532 -19346 -14485 -1523 873 9501 -2979 1893 4675 5569 1559
8771A559m929Q24J943M402O462N760L027o96N319J1654N268L303O017m406j0844
$$ 1559 -3370 -2546 -603 3799 10261 16021 19048 18352 23671 35325 40593 43896 49913 45507 34663
8756C4663j4051j552j980p876l112j470J2962J935j1301L139L416J2219O734o146
$$ 34663 20612 19060 17080 9204 6092 4622 17584 19519 8218 11357 14773 26992 33726 27580
8742B7580m881M724k942K879Q81j9974l406J3941m317l258m257k689J8674J3040
$$ 27580 22699 27423 24481 27360 28241 8267 4861 18802 14485 11227 6970 4281 22955 35995
8728C5995Q522j19j1909p434j4451L43K350J675j845j799R27p306l828R42m514
$$ 35995 44517 44398 32489 25055 10604 10947 13297 14972 13127 11328 12255 4949 1121 2063 -2451
8713b451M759q82k494j264J4252Q073r405p761j3061o406J1929n465Q802O593
$$ -2451 2308 1426 -1068 -2332 11920 19993 10588 2827 -10234 -16640 -4711 -10176 -1374 5219
8699E219J4195O847L91J162j0250j5976m326J6006j019p459L229O127J514p534
$$ 5219 19414 26261 26652 27814 17564 1588 -2738 13268 12249 4790 8019 14146 15660 8126
8685H126J027j0960j5833N666l294J182Q195K5484J959K273J1992j256j0351P785
$$ 8126 9153 -1807 -17640 -11974 -15268 -14086 -5891 19593 21552 23825 35817 34561 24210 31995
8671C1995j5090j1279Q512P489l904o880J1853J4702R626j0723j0445L488J0282
$$ 31995 16905 5626 14138 21627 17723 10843 22696 37398 47024 36301 25856 29344 39626
8658C9626n206l031K398r427q710M699M318M074q882J470J0468K765k839M436
$$ 39626 34420 31389 33787 24360 15650 20349 24667 28741 19859 21329 31797 34562 31723 36159
8644C6159j0140j289R741P119O841P564O481J5974n526j0611p04L5026L7018o572
$$ 36159 26019 24730 34471 41590 48431 55995 62476 78450 72924 62313 61609 96635 133653 127081
8630A27081J1648K8500P13l0402l2482k8505j7317L599j3602j2350L120J249n59
$$ 127081 138729 167229 167942 137540 105058 76553 59236 62835 49233 36883 40003 41252 40693
8617D0693j3556p068M982J0140L597o887J249J5148k38N631J699P001Q705R736
$$ 40693 27137 20069 25051 35191 38788 31901 33150 48298 48060 53691 55390 62391 71096 80832
8603H0832j586k933L089J7158M503o72K284K4072M303j435m539q387o610l17j027
$$ 80832 79246 76313 79402 96560 101063 100391 102675 126747 131050 129615 125076 116689 110079 109762 108735
8588A08735J2405j5835l1437k306j3666k351P249M074k214p787j6280M984M076
$$ 108735 121140 105305 73868 71562 57896 55545 62794 66868 64654 56867 40587 45571 49647
8575D9647k983j1070J075j526J3247K740j5543q317K2232J2359j2429j5570j1212
$$ 49647 46664 35594 36669 35143 48390 51130 35587 27270 49502 61861 49432 33862 22650
8562B2650k374K244q221J4912J0662j0302r902r201K1562J0842k443O813J8362
$$ 22650 20276 22520 14299 29211 39873 29571 19669 10468 32030 42872 40429 47242 65604
8549F5604l244q931r251J0642O020r271m732O171R988N665P387J1609j8654M405
$$ 65604 62360 53429 44178 54820 60840 51569 46837 53008 62996 68661 76048 87657 69003 73408
8535G3408M967r692j5698q118j7018l794R749L902l233L746k124q20r221j7148
$$ 73408 78375 68683 52985 44867 27849 24055 33804 37706 34473 38219 36095 35275 26054 8906
8521H906l896J4159j1973K968J3690M712R04o262q774j2022M954r115J4218J0189
$$ 8906 5010 19169 7196 10164 23854 28566 29470 23208 14434 2412 7366 -1749 12469 22658
8507B2658k436r270M815J9313J2256q067o277L875L028r078j1468l077O145O340
$$ 22658 20222 10952 15767 35080 47336 39269 32992 36867 39895 30817 19349 16272 22417 28757
8493B8757k911J1662P404j3008k4363p967m285K777J8726k992M21M336j0928m034
$$ 28757 25846 37508 44912 31904 7541 -426 -4711 -1934 16792 13800 14221 18557 7629 3595
8479C595n142J5005q662J7578J0350j664L42m597k645M390k605K53k2041o391
$$ 3595 -1547 13458 4796 22374 32724 31060 31402 26805 24160 28550 25945 26198 4157 -2234
8465b234J2141j974k359J4834p149p842m895o02n745j334M783J2253J748o026
$$ -2234 9907 7933 5574 20408 13259 5417 522 -80 -5825 -7159 -2376 9877 11625 5599
8451E599k468J0346K0870M812j7352j3613l106J0139p855r021J7796N025N62j5033
$$ 5599 3131 13477 34347 39159 21807 8194 5088 15227 7372 -1649 16147 21172 21734 6701
8437F701j1907K244K179M194o384J2176N442j4577J30N996k825j7636j4920J6788
$$ 6701 -5206 -2962 -783 3411 -2973 9203 14645 68 198 6194 3369 -14267 -29187 -12399
8423a2399K1590J9775J139n529r767l033O659R641n539k1190j9016J918P066K204
$$ -12399 9191 28966 30105 24576 14809 11776 18435 28076 22537 1347 -17669 -15751 -8685 -6481
8409f481Q655N410k516j1092N487R390K948l766R247N77l202p350K996n015n771
$$ -6481 2174 7584 5068 -6024 -537 8853 11801 8035 17282 17859 14657 7307 10303 5288 -483
8394d83j1372K512N46J5687J627l70m11M807K0463N213j6377p234M290L623o751
$$ -483 -11855 -9343 -8797 6890 8517 8147 7736 12543 33006 38219 21842 14608 18898 22521 15770
8379A5770k236p379j6802j0810J6070J5845L735J67Q0m162n832J350P942m250
$$ 15770 13534 6155 -10647 -21457 -5387 10458 14193 14360 14440 10278 4446 5796 13738 9488
8365I488j7890J8814J1390m774p822k047J19q664K448k539P36R638o956j0052
$$ 9488 -8402 10412 21802 17028 9206 7159 7278 -1386 1062 -1477 -741 8897 1941 -8111
8351h111J657J973m93J1368K1599j0611j7236O0M266l8K438Q027q993J101k671
$$ -8111 -6454 -4481 -4974 6394 27993 17382 146 206 4472 4434 6872 14899 5906 7007 4336
8336D336l180l181O90L760J1283k272k501O841r323L502J5833j6667O582M349
$$ 4336 1156 -2025 -1335 2425 13708 11436 8935 15776 6453 9955 25788 9121 15703 20052
8322B0052k183r716j2989J4217J5118j5003j190K703O173r946k950j758r71J2994
$$ 20052 17869 8153 -4836 9381 24499 9496 8306 11009 17182 7236 4286 2528 1557 14551
8308A4551R684P017K532j4003j0707p435l01J0609j2142j2290O00K681P594N143
$$ 14551 24235 31252 33784 19781 9074 1639 1338 11947 -195 -12485 -11885 -9204 -1610 3533
8294C533j1786k181N533p587J6523R6j2122q165J0548J3585J925j0597q160J7537
$$ 3533 -8253 -10434 -4901 -12488 4035 4131 -7991 -16156 -5608 7977 9902 -695 -8855 8682
8280H682M774j0900r875j0877l870L858K325J2115J699j6295L708J4249O283l990
$$ 8682 13456 2556 -7319 -18196 -22066 -18208 -15883 -3768 -2069 -18364 -14656 -407 5876 1886
8266A886K633q059k199L76J0868J7892Q898j944r543L493O594N336o188p641Q449
$$ 1886 4519 -3540 -5739 -5363 5505 23397 32295 30351 20808 24301 30895 36231 30043 22402 30851
8251C0851J537n877J551j826m687O857K649r376n006j9150n798O326p738J0720
$$ 30851 32388 26511 28062 26236 21549 28406 31055 21679 16673 -2477 -8275 -1949 -9687 1033
8237A033J5833o980M178o65O586Q674L348r382l664j0535j0700r997j5489J9744
$$ 1033 16866 9886 14064 13399 19985 28659 32007 22625 18961 8426 -2274 -12271 -27760 -8016
8223h016K0087P500N786q546o178M048l397J1747q824j61L008m903Q009L235M695
$$ -8016 12071 19571 25357 16811 10633 14681 11284 23031 14207 14046 17054 12151 20160 23395 28090
8208B8090J2458j8282n532R01m406M607J850J0140Q860l888j5132j8159n522Q012
$$ 28090 40548 22266 16734 17635 13229 17836 19686 29826 38686 34798 19666 1507 -4015 3997
8194C997K7160P353j4227j7033P05O754M208l205o557J451J1363j365J591p570
$$ 3997 31157 38510 24283 7250 7955 14709 18917 15712 9155 10606 21969 20604 22195 14625
8180A4625O784M468n926Q615R371l163j1367j2005k126j907k585K737M858O278
$$ 14625 21409 25877 19951 28566 37937 34774 23407 11402 9276 7369 4784 7521 12379 18657
8166A8657J0884k378m005l325J3294J5112j0502q195o325j917N147L365o398k384
$$ 18657 29541 27163 23158 19833 33127 48239 37737 29542 23217 21300 26447 29812 23414 21030
8152B1030n261Q878J571q788K576O662q876o32o665n233Q566R100P055j3254j407
$$ 21030 15769 24647 26218 17430 20006 26668 17792 17160 10495 5262 13828 22928 29983 16729 15322
8137A5322N924k68n25j799j0726o742l812J0518J5413J06N34O667k436j5161N64
$$ 15322 21246 20978 20453 18654 7928 1186 -2626 7892 23305 23411 23945 30612 28176 13015 13579
8122A3579p34J443J0116J3053j247k970J6484R675r180n87r13N355M376R544j3817
$$ 13579 12845 14288 24404 37457 36210 33240 49724 59399 50219 49632 48719 54074 58450 67994 54177
8107E4177k4431j6901j753k36P116Q243m199o519N079J844K295J1337J282L083
$$ 54177 29746 12845 11092 10856 17972 26215 22016 15497 20576 22420 24715 36052 37334 40417
8093D0417l704j2585k2551j6213J0592P713l690J3186J541M56K098p916K237P118
$$ 40417 36713 24128 1577 -14636 -4044 3669 -21 13165 14706 15162 17260 9344 11581 18699
8079A8699O27m308N894J3490J43k814n859K623p88M500N222J8855K5321J4419
$$ 18699 19326 15018 20912 34402 34545 31731 25872 28495 27707 32207 37429 56284 81605 96024
8065I6024J8363M228M61p264o081q043j9668j8303k0776k1549Q50Q296J290O939
$$ 96024 114387 118615 119076 111812 105731 97688 78020 59717 38941 17392 18242 26538 27828 34767
8051C4767M300J86o094j3573j2410J0909N145k026n366R22j7356r682p99K239
$$ 34767 39067 39253 33159 19586 7176 18085 23230 21204 15838 16760 -596 -10278 -11077 -8838
8037h838K6507K1143o784j5757j20k719R749O355k141j0371o80Q246R238j415
$$ -8838 17669 38812 32028 16271 16151 13432 23181 29536 27395 17024 16344 24590 33828 32413
8023C2413m80P749J5682N788K204M257o366n069k673p220l780k869j0924q051
$$ 32413 31933 39682 55364 61152 63356 67613 61247 56178 53505 46285 42505 39636 28712 20661
8009B0661k925p769J0190J8772K915m354j0155J900J1041k037J821m323j1919
$$ 20661 17736 9967 20157 38929 41844 37490 27335 29235 40276 38239 40060 35737 23818
7996B3818j562L5o114L186Q119j3806j588K679j704L812L032j360q68m027n969
$$ 23818 22256 22291 16177 19363 27482 13676 12088 14767 13063 16875 19907 18547 17679 13652 7683
7981G683Q814R628j332j5416J199L565L325o13m093J977Q068J4037o137p676j376
$$ 7683 16497 26125 24793 9377 10576 14141 17466 16853 12760 14737 22805 36842 30705 23029 21653
7966B1653R512l435J279J0530J1321J912j6098q005j4470j3878P082l995R729
$$ 21653 31165 27730 29009 39539 50860 52772 36674 28669 14199 321 7403 3408 13137
7953A3137N157l095M84o58N245K792J107K107J6122j316q299l04K2742o636j3621
$$ 13137 18294 15199 15683 15025 20270 23062 24169 26276 42398 41082 32783 32479 55221 48585 34964
7938C4964j2420o734p207R953J5681M620j0163p091R950l064M287n927j0651r51
$$ 34964 22544 15810 8603 18556 34237 38857 28694 21603 31553 28489 32776 26849 16198 15247
7924A5247J1805L201k789r340L943m73M312L542L424O886M37J166M554l679j7489
$$ 15247 27052 30253 27464 18124 22067 21594 25906 29448 32872 39758 40195 41361 45915 42236 24747
7909B4747j2181O295N94j957l177k724R256J2080K90p209j6142j3405q815J25
$$ 24747 12566 18861 19455 17498 14321 11597 20853 32933 33223 26014 9872 -3533 -12348 -12223
7895a2223j066K6147O447j1866K706L681K485J529k908j750K497m707l868l878
$$ -12223 -13289 12858 19305 7439 10145 13826 16311 17840 14932 13182 15679 10972 7104 3226
7881C226j73L004O163o565Q48N75P877k83r463J882J4010k627k799P506M597j1580
$$ 3226 3053 6057 12220 5655 6503 7078 14955 14672 5209 7091 21101 18474 15675 23181 27778 16198
7865A6198j3726j1487n673p604J8661Q274N000p243m293j7214p572K0448J1471
$$ 16198 2472 -9015 -14688 -22292 -3631 4643 9643 2400 -1893 -19107 -26679 -6231 5240
7852E240J3213m580R791p644j4724J4028J2176P231m389j6378l557k491O409J2621
$$ 5240 18453 13873 23664 16020 1296 15324 27500 34731 30342 13964 10407 7916 14325 26946
7838B6946k365j3184q927K867k910J0540m129r642k443j2257O49k969k436N805
$$ 26946 24581 11397 2470 5337 2427 12967 8838 -804 -3247 -15504 -14855 -17824 -20260 -14455
7824a4455l15Q883J4501l841m911j0262R865K231p251k48o67O3J3280J5940j9
$$ -14455 -14770 -5887 8614 4773 -138 -10400 -535 1696 -5555 -5803 -6470 -6407 6873 22813 22794
7809B2794j4568n454k151q616J1290K4253q939j9251k548k890j284j6130p437
$$ 22794 8226 2772 621 -7995 3295 27548 18609 -642 -3190 -6080 -7364 -23494 -30931
7796c0931J7119R789k922m229l67M088J0096J0011N997j3272p338p341n507J460
$$ -30931 -13812 -4023 -6945 -11174 -11541 -7453 2643 12654 18651 5379 -1959 -9300 -14807 -13347
7782a3347n013l817N711J0483n513l687p538o432J1204M435J1181J668j1943K949
$$ -13347 -18360 -22177 -16466 -5983 -11496 -15183 -22721 -29153 -17949 -13514 -2333 -665 -12608 -9659
7768i659J2056J6308j290j9314L454J724j518q764k446P043J175Q379q601n58
$$ -9659 2397 18705 17415 -1899 1555 3279 1761 -7003 -9449 -2406 -1231 7148 -1453 -2011
7754b011J4410l743q145l341l920R224J841l571n867k476J076o012j367J49M887
$$ -2011 12399 8656 511 -2830 -6750 2474 4315 744 -5123 -7599 -6523 -12535 -13902 -13753 -8866
7739h866N733n2j1684n917q312K310R075Q493L612j3279k781J3757J1286L246
$$ -8866 -3133 -3185 -14869 -20786 -29098 -26788 -17713 -9220 -5608 -18887 -21668 -7911 3375 6621
7725F621o367j0474r767O772J6621k283j4294J2015P625j4318P81q426K958J227
$$ 6621 254 -10220 -19987 -13215 3406 1123 -13171 -1156 6469 -7849 -7068 -15494 -12536 -11309
7711a1309l508R578N130o776K995O597l499o727p764Q446o503o799l637N945J3562
$$ -11309 -14817 -5239 -109 -6885 -3890 2707 -792 -7519 -15283 -6837 -13340 -20139 -23776 -17831 -4269
7696d269j609J846P276J219l686k204J6314J2578O94j0926o836M725J827j529
$$ -4269 -5878 -4032 3244 4463 777 -1427 14887 27465 28159 17233 10397 15122 16949 15420
7682A5420o145j7924j854J3579N932Q275j734L132k549j9952m038L79r044o937
$$ 15420 9275 -8649 -10503 3076 9008 17283 15549 18681 16132 -3820 -7858 -7479 -16523 -23460
7668b3460J2828J3814j425j0718K945k196j9967l709p90Q951J8220M705j325N170
$$ -23460 -10632 3182 1757 -8961 -6016 -8212 -28179 -31888 -32678 -23727 -5507 -802 -2127 3043
7654C043j2756o518R132p73j0584j537M888l84P900l750R320P000J715p06j0853
$$ 3043 -9713 -16231 -7099 -7872 -18456 -19993 -15105 -15489 -7589 -11339 -2019 4981 6696 5990 -4863
7639d863p382R653K501L364L408J2076N01j1763j7852l129J1398r791l339Q242
$$ -4863 -12245 -2592 -91 3273 6681 18757 19258 7495 -10357 -13486 -2088 -11879 -15218 -6976
7625f976P232j0545p221K43J2134p731j6543Q844K0964L751j9777j120J0282J914
$$ -6976 256 -10289 -17510 -17267 -5133 -12864 -29407 -20563 401 4152 -15625 -16745 -6463 -4549
7611d549j3571n142Q734L697j1112J1073J5697M178j1152R66q7J533m203m930
$$ -4549 -18120 -23262 -14528 -10831 -21943 -10870 4827 9005 -2147 -1181 -1268 265 -3938 -8868
7597h868O679o827p585J393L922n105O431M954M155k671L029M442Q199K07n242
$$ -8868 -2189 -9016 -16601 -15208 -11286 -16391 -9960 -5006 -851 -3522 -493 3949 12148 12355 7113
7582G113j1831k49j6347j1245J3403o97J956n154K932M602J0296j2510j1321m278
$$ 7113 -4718 -4967 -21314 -32559 -19156 -19853 -17897 -23051 -20119 -15517 -5221 -17731 -29052 -33330
7568c3330O095K3234L876m808k999P946l669j0085l572m92j75K496J1272q561
$$ -33330 -27235 -4001 -125 -4933 -7932 14 -3655 -13740 -17312 -17804 -17979 -15483 -4211 -12772
7554a2772n280k345q54L235J8677o375r505j245M893L4P036l984J524L995J4009
$$ -12772 -18052 -20397 -21251 -18016 661 -5714 -15219 -16464 -11571 -11537 -4501 -8485 -6961 -2966 11043
7539A1043o409o353q952n479K982j7188p503Q680L582M099R18o638J2148J1808
$$ 11043 4634 -1719 -10671 -16150 -13168 -30356 -37859 -29179 -25597 -21498 -20580 -27218 -15070 -3262
7525c262N446N062m637k1144K181P680N458J6639Q077O863j3273j8500n888m946
$$ -3262 2184 7246 2609 -18535 -16354 -8674 -3216 13423 21500 28363 15090 -3410 -9298 -14244
7511a4244j893O745N148j353j7075K82l131J1492J1492K846l878n020m002j399
$$ -14244 -16137 -9392 -4244 -5597 -22672 -22390 -25521 -14029 -2537 309 -3569 -8589 -12591 -13990
7497a3990Q036m023M661m88J034k236Q219N174j253j3437j335L775Q274m101L941
$$ -13990 -5954 -9977 -5316 -5804 -4770 -7006 1213 6387 5134 -8303 -9638 -5863 2411 -1690 2251
7482B251N911m388k11r873Q573P980j4609j9268J631J1595l053n153o807o775
$$ 2251 8162 3774 3563 -6310 2263 10243 -4366 -23634 -22003 -10408 -13461 -18614 -25421 -32196
7468c2196j253J4376N935R346l706j2824K15J855J9837O356k616l645r355P488
$$ -32196 -33449 -19073 -13138 -3792 -7498 -20322 -20107 -18252 1585 7941 5325 1680 -7675 -187
7454a87M8o666j306j2123o834J5100J92j2387J917K516m91N517N097p934q279
$$ -187 -139 -6805 -8111 -20234 -27068 -11968 -11776 -24163 -22246 -19730 -20221 -14704 -9607 -17541 -25820
7439b5820J866Q693L912K463J2458j562O649L2r872J265K17k74L634l240q726
$$ -25820 -23954 -15261 -11349 -8886 3572 2010 8659 8691 -1181 84 301 27 3661 421 -8305
7424h305l296J508L781J1442n145p046q153N765M940j2704k38j912r246M732O778
$$ -8305 -11601 -10093 -6312 5130 -15 -7061 -15214 -9449 -4509 -17213 -17451 -19363 -28609 -23877 -17099
7409a7099P799K804r350J1024N013l781j469k519J788k003j81J0102l548l782
$$ -17099 -9300 -6496 -15846 -4822 191 -3590 -5059 -7578 -5790 -7793 -7974 2128 -1420 -5202
7395e202M436O176o062n68J0868O730r049j256M804R307K979K761K161k466Q652
$$ -5202 -766 5410 -652 -1220 9648 16378 7329 6073 10877 20184 23163 25924 28085 25619 34271
7380C4271p704j2605J728M794j4728j9443p401m380K519J2300N276m351o75J0766
$$ 34271 26567 13962 15690 20484 5756 -13687 -21088 -25468 -22949 -10649 -5373 -9724 -10399 367
7366C67N412K963j6165r002K917R229N652L25n011N409P716q656j1132m715J1736
$$ 367 5779 8742 -7423 -16425 -13508 -4279 1373 1698 -3313 2096 9812 1156 -9976 -14691 -2955
7351b955J1495N554M78K62p105p931o159l267N543n326k0140n150j320R320O541
$$ -2955 8540 14094 14572 14834 7729 -202 -6361 -9628 -4085 -9411 -29551 -34701 -36021 -26701 -20160
7336b0160J0032K174J839n681J452m65R890q915P632m11r040k978l328L783n508
$$ -20160 -10128 -7954 -6115 -11796 -10344 -10809 -919 -9834 -2202 -2613 -11653 -14631 -17959 -14176 -19684
7321a9684R132Q462J0315J0781n437j6067o818k918q697o797O062P154j368J1058
$$ -19684 -10552 -2090 8225 19006 13569 -2498 -9316 -12234 -20931 -27728 -21666 -14512 -15880 -4822
7307d822P678l85j0342J643j20q451l120r06K0914k031k0658Q238J8369n259P89
$$ -4822 2856 2471 -7871 -6228 -6348 -14799 -17919 -18825 2089 58 -20600 -12362 6007 748 1537
7292A537Q964o631j4852J999P106N359N356J273J348J680M8n795j4019N42j2485
$$ 1537 10501 3870 -10982 -8983 -1877 3482 8838 10111 11459 13139 13187 7392 -6627 -6085 -18570
7277a8570R188R364j521J699l131r003K45k891R79P134J135J2047J5786j5759
$$ -18570 -9382 -18 -1539 160 -2971 -11974 -11729 -14620 -13641 -6507 -5372 6675 22461 6702
7263F702o65K573M114J66j4060J87M875R10n038J83J787N227M223o942k701j3332
$$ 6702 6037 8610 12724 12890 -1170 -983 3892 4802 -236 -53 1734 6961 11184 4242 1541 -11791
7247a1791l393Q72R354M581J1001J906j3906J0082l065q266k9j3722l346K747
$$ -11791 -15184 -14312 -4958 -377 10624 12530 -1376 8706 5641 -2625 -2654 -16376 -19722 -16975
7233a6975J7185P364n305J899n952N94n534j0637L826Q56o345J1554o27l272K672
$$ -16975 210 7574 2269 4168 -1784 -1190 -6724 -17361 -13535 -12679 -19024 -7470 -8097 -11369 -8697
7218h697J6308j477p130M056q493P747J1398j2120j4715J6319J3187k2983r532
$$ -8697 7611 6134 -996 3060 -5433 2314 13712 1592 -13123 3196 16383 -6600 -16132
7205a6132N856J2327Q03R098p467m287L209o108m638o569j920q766O444Q543J2424
$$ -16132 -10276 2051 2854 11952 4485 198 3407 -2701 -7339 -13908 -15828 -24594 -18150 -9607 2817
7190B817J820M923k159n847j0960j5823m953K205R884J6970K832L698j3096J599
$$ 2817 4637 9560 7401 1554 -9406 -25229 -30182 -27977 -18093 -1123 1709 5407 -7689 -6090
7176f090p040J170N159L326k002M723p972J814J0074O93k235J162k986p763n036
$$ -6090 -13130 -11960 -6801 -3475 -5477 -754 -8726 -6912 3162 3855 1620 2782 -204 -7967 -13003
7161a3003N630j2544Q00J7043N971J911j4100j4520r500R416J2884j0574l538
$$ -13003 -7373 -19917 -19117 -2074 3897 5808 -8292 -22812 -32312 -22896 -10012 -20586 -24124
7148b4124Q540m28O122r265o853k657K218J2413J346o188n550Q717j1640n65L650
$$ -24124 -15584 -16012 -9890 -19155 -26008 -28665 -26447 -14034 -12688 -18876 -24426 -15709 -27349 -27914 -24264
7133b4264K346R566J1282j226j091R932j459o590o621q994J1284K561L661J6300
$$ -24264 -21918 -12352 -1070 -2296 -3387 6545 5086 -1504 -8125 -17119 -5835 -3274 387 16687
7119A6687L270j2306j702N287r550p287N528k640m399J26j3730O353J0313k888
$$ 16687 19957 7651 5949 11236 1686 -5601 -73 -2713 -7112 -6986 -20716 -14363 -4050 -6938
7105f938L865Q669k372j431N333j295o278k642j1157l087n434J0892O831M289
$$ -6938 -3073 5596 3224 1793 7126 5831 -447 -3089 -14246 -17333 -22767 -11875 -5044 -755
7091g55J1373K477j3160j713j4096j179L981N192j1449n60n612J1184M964K1024
$$ -755 10618 13095 -65 -1778 -15874 -17053 -13072 -7880 -19329 -19889 -25501 -14317 -9353 11671
7077A1671n2j5367k623J0253M844K279j0675k293J1853O781k033M370j0874m974
$$ 11671 11619 -3748 -6371 3882 8726 11005 330 -1963 9890 16671 14638 19008 8134 3160
7063C160M317N890Q619j3640j2856R098N767O33p87j3610r938j5162l389k923
$$ 3160 7477 13367 21986 8346 -4510 4588 10355 10988 10201 -3409 -13347 -28509 -31898 -34821
7049c4821J7069J2355O189M574o02j4174M298J908n653K676J5716O206n971J618
$$ -34821 -17752 -5397 792 5366 4764 -9410 -5112 -3204 -8857 -6181 9535 15741 9770 11388
7035A1388r252k585l33k347o563J571q84n270J4709J0385q888r454l984j302k586
$$ 11388 2136 -449 -782 -3129 -9692 -8121 -9005 -14275 434 10819 1931 -7523 -11507 -12809 -15395
7020a5395M851J4779M088l80n05r873k0737m390O528m17N915J7886J7849j1470
$$ -15395 -10544 4235 8323 7943 7438 -2435 -23172 -27562 -21034 -21451 -15536 2350 20199 8729
7006H729N60O694j5779j4484n072J3091j28k40o180m871J3497N476M220k026J3777
$$ 8729 9289 15983 204 -14280 -19352 -6261 -6389 -6629 -12809 -17680 -4183 1293 5513 3487 17264
6991A7264j649j2437k827m91p82j920P24n07n303Q337o872q654P329N586k323
$$ 17264 15615 3178 351 -140 -922 -2842 -2118 -2625 -7928 409 -6463 -15117 -7788 -2202 -4525
6976d525Q933Q618J977j5114j6222j5126M155L3665L998q596j773l878j1541l601
$$ -4525 4408 13026 15003 -111 -16333 -31459 -27304 6361 10359 1763 -10 -3888 -15429 -19030
6962a9030J9206R892M958J332o31r375q986L99R26m593n756j1453K4870o245j1010
$$ -19030 176 10068 15026 16358 15727 6352 -2634 -2235 -1309 -5902 -11658 -23111 1759 -4486 -15496
6947a5496j58K583r66q25J467J296j711K225n54P352J1300l139j556O604Q370
$$ -15496 -15654 -13071 -14037 -14862 -13395 -12099 -13810 -11585 -12139 -4787 6513 3374 1818 8422 16792
6932A6792J362r255q927M388n904j4432j249P36q578k200P926j2917j0736k240
$$ 16792 18154 8899 -28 4360 -1544 -15976 -17225 -16489 -25067 -27267 -19341 -32258 -42994 -45234
6918d5234J2049K441J3612j801o341J2657R029R466Q30r083K51k593P316j4595
$$ -45234 -33185 -30744 -17132 -18933 -25274 -12617 -3588 5878 6708 -2375 -2124 -4717 2599 -11996
6904a1996j0493O491K3600j702n812l252M429r531J135O640o719M572L379j566
$$ -11996 -22489 -15998 7602 5900 88 -3164 1265 -8266 -7131 -491 -7210 -2638 741 -825
6890h25p975L282q7p77Q892J949l002j1490r337n553J1528J3583K561p822J456
$$ -825 -8800 -5518 -5605 -6382 2510 4459 1457 -10033 -19370 -24923 -13395 188 2749 -5073 -3617
6875c617J9578P995j6517k075N814q133n399M04P682O558O66n703m853O597L733
$$ -3617 15961 23956 7439 5364 11178 3045 -2354 -1950 5732 12290 12956 7253 2400 8997 12730
6860A2730P809m99p161j1060J541O747r486j0479o51L726J541K563o242J0618
$$ 12730 20539 20040 12879 1819 3360 10107 621 -9858 -10509 -6783 -5242 -2679 -8921 1697
6846A697J3401k113p63q106r785R415J1618P846p864j1043l448j5998j0380P394
$$ 1697 15098 12985 12222 4116 -5669 3746 15364 23210 15346 4303 855 -15143 -25523 -18129
6832a8129R864J4312l405r256m435J2651J6636J9959k804k2742p003J520M95p169
$$ -18129 -8265 6047 2642 -6614 -11049 1602 18238 38197 35393 12651 5648 7168 7663 494
6818D94j247N509m16J861l024p810J82J4873k559P55m10J609j2657r438J4094
$$ 494 -753 4756 4340 6201 3177 -4633 -4451 10422 7863 8618 8208 9817 -2840 -12278 1816
6803A816O507m720j0351N59m716N524p453l389j865K044M745n656Q544J1663K837
$$ 1816 8323 3603 -6748 -6189 -10905 -5381 -12834 -16223 -18088 -16044 -11299 -16955 -8411 3252 6089
6788F089p759k0529N719L731Q057J0811P683P514L839l070l851n855o41m175Q886
$$ 6089 -1670 -22199 -16480 -12749 -4692 6119 13802 21316 25155 22085 18234 12379 11738 7563 16449
6773A6449Q159K965j6214l277r423l832l978N050P396n032J045j0851P595J2300
$$ 16449 24608 27573 11359 8082 -1341 -5173 -9151 -4101 3295 -1737 -692 -11543 -3948 8352
6759H352p667p318O047Q030M479m923R523O873m840j9741j3238q228p276J1873
$$ 8352 685 -6633 -586 7444 11923 7000 16523 23396 18556 -1185 -14423 -22651 -29927 -18054
6745a8054k955p33J0932K24L54L552R633p58q206j6895J1498J136r060L559M885
$$ -18054 -21009 -21742 -10810 -10586 -10232 -6680 2953 2195 -6011 -22906 -11408 -10272 -19332 -15773 -10888
6730a0888J8027O139K930p719j2536L503m651J821K7474R61r792j1517l161J2565
$$ -10888 7139 13278 16208 8489 -4047 -544 -5195 -3374 24100 25061 15269 3752 591 13156
6716A3156R252m253r966j0944l442L604j1254K927J2286m235j7033r722n132K960
$$ 13156 22408 18155 8189 -2755 -6197 -2593 -13847 -10920 1366 -2869 -19902 -29624 -34756 -31796
6702c1796K477q417J4776K0121J2258P480M055l116j5154j5016j0344K736P285
$$ -31796 -29319 -37736 -22960 -2839 9419 16899 20954 17838 2684 -12332 -22676 -19940 -12655
6689a2655p881q27L715K501J1226J1080l233p824J536J6391Q32l778p819n706
$$ -12655 -20536 -21363 -17648 -15147 -3921 7159 3926 -3898 -2362 14029 14861 11083 3264 -2442
6675b442q081P503J0881k800r310p313J788J0142L386P698M452m859k1541q888
$$ -2442 -10523 -3020 7861 5061 -4249 -11562 -9774 368 3754 11452 15904 11045 -10496 -19384
6661a9384J2795J8718p540M420j203n161P478J0468O525j6607R479O062o100j7018
$$ -19384 -6589 12129 4589 9009 7806 2645 10123 20591 27116 10509 19988 26050 19950 2932
6647B932k645k531j873o048K393l59l526O470j843q342O986k48j2723q582J3844
$$ 2932 287 -2244 -4117 -10165 -7772 -8131 -11657 -5187 -7030 -15372 -8386 -8634 -21357 -29939 -16095
6632a6095J7234K467j1047k7012R282J061R349o054k285N374j432o085Q037R971
$$ -16095 1139 3606 -7441 -34453 -25171 -24110 -14761 -20815 -23100 -17726 -19158 -25243 -17206 -7235
6618g235j350m458m492j3351L037N120J1810J3178J3607J27K166k012j4927j1881
$$ -7235 -8585 -13043 -17535 -30886 -27849 -22729 -10919 2259 15866 15993 18159 16147 1220 -10661
6604a0661o468R695j04k818p162M143J1866L93p994m566m280O804k400j2295j739
$$ -10661 -17129 -7434 -7538 -10356 -17518 -13375 -1509 -1116 -9110 -13676 -17956 -11152 -13552 -25847 -27586
6589b7586p488J0629Q725K280R031J776J5708k281r172m524j487Q144M790L118
$$ -27586 -35074 -24445 -15720 -13440 -4409 -2633 13075 10794 1622 -2902 -4389 3755 8545 11663
6575A1663L359j2867j2741j078m889J1233m989L414l511m211l888J0757J2198
$$ 11663 15022 2155 -10586 -11664 -16553 -5320 -10309 -6895 -10406 -14617 -18505 -7748 4450
6562D450R184q890j8097J010J2113n449l854R280J006N428r913N547Q243q532
$$ 4450 13634 4744 -13353 -12343 -230 -5679 -9533 -253 753 6181 -3732 1815 10058 1526
6548A526o455q220m400L324M452O423l198N356r927K971J6089N774o51k3563k803
$$ 1526 -4929 -13149 -17549 -14225 -9773 -3350 -6548 -1192 -11119 -8148 7941 13715 13064 -10499 -13302
6533a3302J4885m335j7157k161K949J6919J2192o541p315O080J4361m335P207
$$ -13302 1583 -2752 -19909 -22070 -19121 -2202 9990 3449 -3866 2214 16575 12240 19447
6520A9447j7079n173j0189L773K714p685m480j393R736R114k096o974J602p770
$$ 19447 2368 -2805 -12994 -9221 -6507 -14192 -18672 -20065 -10329 -1215 -3311 -10285 -8683 -16453
6506a6453n893J661M326J0170k399j239k537o577L167R358J4714M718J651l063
$$ -16453 -22346 -20685 -16359 -6189 -8588 -9827 -12364 -18941 -15774 -6416 8298 13016 14667 11604
6492A1604l162P607L583l299r736m90k965m803k609O701M554q90j6018n186M523
$$ 11604 8442 16049 19632 16333 6597 6107 3142 -1661 -4270 2431 6985 6095 -9923 -15109 -10586
6477a0586l385M05K223J0399J0597j2798k2535O156Q231J1590R879N86r047j322
$$ -10586 -13971 -13566 -11343 -944 9653 -3145 -25680 -19524 -11293 297 10176 10762 1715 393
6463C93r396r119p473l799J0716O539O292m529M182J0887M115J3384Q886j0040
$$ 393 -9003 -18122 -25595 -29394 -18678 -12139 -5847 -10376 -6194 4693 8808 22192 31078 21038
6449B1038j5585P372J0521K211r60p852n092j1854j6532p930l245Q681J8280R475
$$ 21038 5453 12825 23346 25557 24597 16745 11653 -201 -16733 -24663 -27908 -19227 -947 8528
6435H528o140m83J0848q095M52J8428j262j6239p704k209k023n181R6m527n40
$$ 8528 2388 1905 12753 4658 5110 23538 22276 6037 -1667 -3876 -5899 -11080 -10984 -15511 -16051
6420a6051O853J73L299R170J5815m588p720j2789r230k606J0198J0742P781P122
$$ -16051 -9198 -9025 -5726 3444 19259 14671 6951 -5838 -15068 -17674 -7476 3266 11047 18169
6406A8169j478l197r445j3594j848K1442P343j4503r611J2364J934k877J732q010
$$ 18169 16691 13494 4049 -9545 -11393 10049 17392 2889 -6722 5642 7576 4699 6431 -1579
6392a579j43L253p789j0592k946n649n123j1173m651J8538J2151J9398M692j3025
$$ -1579 -1722 1531 -6258 -16850 -19796 -25445 -30568 -41741 -46392 -27854 -15703 3695 8387 -4638
6378d638j5208M543k392J1249L809N886o693r258J0855n368j3436J51J2320N816
$$ -4638 -19846 -15303 -17695 -6446 -2637 3249 -3444 -12702 -1847 -7215 -20651 -20500 -8180 -2364
6364b364L08M844p066r265L15J778N74J1182K909L42q99R53p10M792J782k590
$$ -2364 -2056 2788 -4278 -13543 -13228 -11450 -10876 306 3215 3557 2658 3611 2901 7693 9475 6885
6348F885l093j2002J0358R525j3758j7580p481J5122O678o808k261L269J790n
$$ 6885 3792 -8210 2148 11673 -2085 -19665 -27146 -12024 -5346 -12154 -14415 -11146 -9356 -9361
6334i361J336Q53p004j2841j369J6419O415o383N935O714J0763K279o327o545
$$ -9361 -8025 -7172 -14176 -27017 -28386 -11967 -5552 -11935 -6000 714 11477 13756 7429 884
6320H84q047n376M141k27J551J5491J3538p11o819q299j2798k454q675J716Q71
$$ 884 -7163 -12539 -8398 -8625 -7074 8417 21955 21244 14425 6126 -6672 -9126 -17801 -16085 -15214
6305a5214n090j0069J4452R857J7397R066j0708j1428j5714j514j545K417n153
$$ -15214 -20304 -30373 -15921 -6064 11333 20399 9691 -1737 -17451 -18965 -20510 -18093 -23246
6292b3246Q172J898K061P162M807p3P306r581p655o013N843o50Q169r332j3927
$$ -23246 -15074 -13176 -11115 -3953 854 781 8087 -1494 -9149 -15162 -9319 -9969 -1800 -11132 -25059
6277b5059P142J4691J684r368o766K355n590k495J5598M869Q974J612j0981N2
$$ -25059 -17917 -3226 -1542 -10910 -17676 -15321 -20911 -23406 -7808 -2939 6035 7647 -3334 -3282
6263c282m732j5951n520J6061J5202J36l925P655L814M988q819j2965p65P375
$$ -3282 -8014 -23965 -29485 -13424 1778 1914 -2011 5644 9458 14446 5627 -7338 -8103 -728
6249g28j319P892J4201m090o580p968j6730j7383j519K506l756J78J1545O125
$$ -728 -2047 5845 20046 15956 9376 1408 -15322 -32705 -34224 -31718 -35474 -35296 -23751 -17626
6235a7626j5371m374K508p962J0598J7360j1834q260Q279J9015O069M856m245
$$ -17626 -32997 -37371 -34863 -42825 -32227 -14867 -26701 -34961 -26682 -7667 -1598 3258 -987
6222i87m577j3951l79N396J898Q361J7154Q488p308j7096n535j39J0362L838K735
$$ -987 -5564 -19515 -19894 -14498 -12600 -4239 12915 21403 14095 -3001 -8536 -8675 1687 5525 8260
6207H260o049j7584o853J1902l133j490P686N897K463n407N289J4397p728k4175
$$ 8260 2211 -15373 -22226 -10324 -13457 -14947 -7261 -1364 1099 -4308 981 15378 7650 -16525
6193a6525M66J4702J2074N741J598J151N326p921m701Q994q766j5025j8768O836
$$ -16525 -16059 -1357 10717 16458 18056 19207 24533 16612 11911 20905 12139 -2886 -21654 -14818
6179a4818j110L660k19j3939P889P852l337K1082R273j2410j62O893q556j632
$$ -14818 -15928 -12268 -12487 -26426 -18537 -10685 -14022 7060 16333 3923 3761 10654 2098 466
6165D66J4062Q493o03j8115j9469K489J2227N409p97Q75M179n406j486p794O167
$$ 466 14528 23021 22418 4303 -15166 -12677 -450 4959 4162 5037 9216 3810 2324 -5470 697
6150F97o52L085J2335n054j0286Q377P611n444p411j2291r961k777J311J4263
$$ 697 45 3130 15465 10411 125 8502 16113 10669 3258 -9033 -18994 -21771 -20460 -6197
6136f197Q423P738K430j62l404o583q389R2q43N695N328j1782r261J309K289P06
$$ -6197 2226 9964 12394 12232 8828 2245 -6144 -6052 -6895 -1200 4128 -7654 -16915 -15606 -13317 -12611
6120a2611L808j3223J2201J861P829O250J089J845q184L102J953Q144o350k3102
$$ -12611 -8803 -22026 -9825 -7964 -135 6115 7204 9049 865 3967 5920 14064 7714 -15388
6106a5388N77J678q992P80j50p101k180l375O191J8447J6890K338N34j9281r214
$$ -15388 -14811 -13133 -22125 -21345 -21495 -28596 -30776 -34151 -27960 -9513 7377 9715 10249 -9032 -18246
6091a8246R411k655j1085J1308K841l001j5605M070J020o462m981J4156O900K647
$$ -18246 -8835 -11490 -22575 -11267 -8426 -11427 -27032 -22962 -21942 -28404 -33385 -19229 -12329 -9682
6077i682p830p640M093j4233m442J4917J345Q829p891M118P327J1479k244j0437
$$ -9682 -17512 -25152 -21059 -35292 -39734 -24817 -23472 -14643 -22534 -18416 -11089 390 -1854 -12291
6063a2291O267M341K1723J2670j2265j4292J147m264j0976J5806R031l905j534
$$ -12291 -6024 -1683 20040 32710 20445 6153 7300 3036 -7940 7866 16897 12992 11458
6050A1458n405o13k851j6065N262P613j1737K507O659k097K713j135J5500Q977
$$ 11458 6053 5440 2589 -13476 -8214 -601 -12338 -9831 -3172 -5269 -2556 -3691 11809 20786
6036B0786M03p381j886J982M895P517q948m343j988m163l240k240R824r064o348
$$ 20786 21189 13808 11922 13904 18799 26316 17368 13025 11037 6874 3634 1394 11218 2154 -4194
6021d194O839K084K923k652Q630Q086p318p043j3119k0796k296J5882L481o207
$$ -4194 2645 4729 7652 5000 13630 21716 14398 7355 -5764 -26560 -28856 -12974 -9493 -15700
6007a5700K486J450J5526k023q735k475m913O301J3826o632M270O030q058p738
$$ -15700 -13214 -11764 3762 1739 -6996 -9471 -14384 -8083 5743 -889 3381 9411 1353 -6385
5993f385Q252Q187K733O81j3840L42Q068o484k0942J117j45J0426L859j6894J437
$$ -6385 1867 10054 12787 13468 -372 -30 8038 1554 -19388 -18271 -18416 -7990 -4131 -21025 -19588
5978a9588N274P137l762p276L574J2916n646J928J4544M038j1340j214o010N574
$$ -19588 -14314 -7177 -10939 -18215 -14641 -1725 -7371 -5443 9101 13139 1799 585 -5425 149
5964A49j415q025k590K5747r47l541O095J383r321m416O35O78l21j7370N167q018
$$ 149 -1266 -9291 -11881 13866 12919 9378 15473 16856 7535 3119 3754 4432 4111 -13259 -8092 -16110
5948a6110o75O895m513r817J0138J6680J1103M974j4953j5284r693p388K615P309
$$ -16110 -16785 -9890 -14403 -24220 -14082 2598 13701 18675 3722 -11562 -21255 -28643 -26028 -18719
5934a8719p088j087M263J0884K058N72N225j9537j03J1723L917N731J035j326
$$ -18719 -25807 -26894 -22631 -11747 -9689 -9117 -3892 -23429 -23532 -11809 -7892 -2161 -1126 -2452
5920b452j401j894p20J5330m164j5867j4966O98J1214j471L766K900J380J9278
$$ -2452 -3853 -5747 -6467 8863 4699 -11168 -26134 -25436 -14222 -15693 -11927 -9027 -7647 11631
5906A1631Q637n816M221M376k242j217k0791j3582M481J2345M196m635k223R980
$$ 11631 20268 14452 18673 23049 20807 19590 -1201 -14783 -10302 2043 6239 1604 -619 9361
5892I361J8448q964j699Q624n970j1891p726q322j0129j0426k476J4131K9323
$$ 9361 27809 18845 17146 25770 19800 7909 183 -8139 -18268 -28694 -31170 -17039 12284
5879A2284j879l499R753J198O518q862r005r123M834l589r440M419M442k705r38
$$ 12284 10405 6906 16659 17857 24375 15513 6508 -2615 2219 -1370 -10810 -6391 -1949 -4654 -5592
5864e592K874L900P779L868q717j1433n268L289J3542q127k1111n960P836Q629
$$ -5592 -2718 1182 8961 12829 4112 -7321 -12589 -9300 4242 -3885 -24996 -30956 -23120 -14491
5850a4491j5172j1765K2394K2130q82j5981q288L519j476r721M030K075p518M885
$$ -14491 -29663 -41428 -19034 3096 2214 -13767 -22055 -18536 -20012 -29733 -25703 -23628 -31146 -26261
5836b6261J0192n208k670q077J0516M45J7843J2591k51n257j334m867r5p151j0736
$$ -26261 -16069 -21277 -23947 -32024 -21508 -21063 -3220 9371 9120 3863 2529 -2338 -2433 -9584 -20320
5821b0320J02L155K291J5377n57J632M180O656K704j0107k327R49Jr641J691R296
$$ -20320 -20218 -17063 -14772 605 48 1680 5860 12516 15220 5113 2786 3735 3736 -5905 -4214 5082
5805E082l788P520l909k0237m218M105J9873N567o577K795J3828l338o057k975
$$ 5082 1294 8814 4905 -15332 -19550 -15445 4428 9995 3418 6213 20041 16703 10646 7671
5791G671k750q981j6222q197p068J2995J2826l345J232r016j7513J7204K626J0766
$$ 7671 4921 -4060 -20282 -28479 -35547 -22552 -9726 -13071 -11839 -20855 -38368 -21164 -18538 -7772
5777g772J4877j0579j5409m423P068R257J3574J616R768m419o340n114L279j4991
$$ -7772 7105 -3474 -18883 -23306 -16238 -6981 6593 8209 17977 13558 7218 2104 5383 -9608
5763i608r424j647m990N538J4903k164p302l810l122O263k416n094l372J1231
$$ -9608 -19032 -20679 -25669 -20131 -5228 -7392 -14694 -18504 -21626 -15363 -17779 -22873 -26245 -15014
5749a5014J825l547J0014N33j2592l456R743n610M795J121o571o806j219Q700
$$ -15014 -13189 -16736 -6722 -6189 -18781 -22237 -12494 -18104 -13309 -12188 -18759 -25565 -26784 -18084
5735a8084k505J1373k41R08J2440j393o591m98N105P331r918j6793r534Q008J2553
$$ -18084 -20589 -9216 -9457 -8549 3891 2498 -4093 -4591 514 7845 -2073 -18866 -28400 -20392 -7839
5720g839K570m789N980j126J5246j859r302l645j5924k533J2947l254k297n877
$$ -7839 -5269 -10058 -4078 -5204 10042 8183 -1119 -4764 -20688 -23221 -10274 -13528 -15825 -21702
5706b1702P036J5700r899o346k358l54n31K356P93J3377k85k833J6955m472o477
$$ -21702 -14666 1034 -8865 -15211 -17569 -17923 -18454 -16098 -15305 -1928 -2213 -5046 11909 7437 960
5691I60J3278m74j0936j3542R278K2j0095k929M222j735P90K4695J521j4461l823
$$ 960 14238 13764 2828 -10714 -1436 -1414 -11509 -14438 -10216 -11951 -11161 13534 15055 594 -3229
5676c229k455m152J399o378J3583M298L748O627K990k476J4286n669P333k771
$$ -3229 -5684 -9836 -8437 -14815 -1232 3066 6814 13441 16431 13955 28241 22572 29905 27134
5662B7134j1278j144l481r743N872O391K989m469k0562P245J5100K795o818r746
$$ 27134 15856 14712 11231 1488 7360 13751 16740 12271 -8291 -1046 14054 16849 10031 285
5648B85J0716K578n971j6557L727R3n761N225q338O841J6476J0156M597J3793
$$ 285 11001 13579 7608 -8949 -5222 -5129 -10890 -5665 -14003 -7162 9314 19470 24067 37860
5634C7860m397j5479l006j1846J995n81m89m85K186O449K684n056J873p202r210
$$ 37860 33463 17984 14978 3132 5127 4546 4057 3572 5758 12207 14891 9835 11708 4506 -4704
5619d704j0932q13J5437M825R548m873k5397m168Q900R763m713o965o810N26O85
$$ -4704 -15636 -16449 -1012 3813 13361 8488 -16909 -21077 -12177 -2414 -7127 -14092 -20902 -20376 -19691
5604a9691J1613j653l885m53N373M070J9228P537o895j3452P917L517r477l452
$$ -19691 -8078 -9731 -13616 -14069 -8696 -4626 14602 22139 15244 1792 9709 13226 3749 297
5590B97n717K935M284O128Q93q124q796q403M934J1796N403J2253P580m484j5197
$$ 297 -5420 -2485 1799 7927 8820 696 -8100 -16503 -11569 227 5630 17883 25463 20979 5782
5575E782k611J29p167O848R378p714m871o642j0745r522J841J6120P046m780N159
$$ 5782 3171 3300 -3867 2981 12359 4645 -226 -6868 -17613 -27135 -25294 -9174 -2128 -6908 -1749
5560a749j1247o271J7991j0200p697J2622N303j3702m31J7475L555m700l478R203
$$ -1749 -12996 -19267 -1276 -11476 -19173 -6551 -1248 -14950 -15381 2094 5649 949 -2529 6674
5546F674m765k104j3349p817J4691Q554l169k221K965k754P399k514j5277m345
$$ 6674 1909 -195 -13544 -21361 -6670 1884 -1285 -3506 -541 -3295 4104 1590 -13687 -18032
5532a8032R750q197P408J1643J2644r516o916m825J0858K237p811j3163M035R196
$$ -18032 -8282 -16479 -9071 2572 15216 5700 -1216 -6041 4817 7054 -757 -13920 -9885 -689
5518f89J926p776o640J1986K1323m510j0413j1243J244Q129j0873p549q106Q234
$$ -689 1237 -6539 -13179 -1193 20130 15620 5207 -6036 -4792 3337 -7536 -15085 -23191 -14957
5504a4957R569J8161j1357j5878p460j499J1638K1276J0454p593j8704k797K2635
$$ -14957 -5388 12773 1416 -14462 -21922 -23421 -11783 9493 19947 12354 -6350 -9147 13488
5491A3488K428m722j6672j2542J0278J4503M205o367j479J8577j8342r660J3863
$$ 13488 15916 11194 -5478 -18020 -7742 6761 10966 4599 3120 21697 3355 -6305 7558
5478G558L853M578J1977q940j3688o718j1168q473L290m651K526k717R930K675
$$ 7558 11411 15989 27966 19026 5338 -1380 -12548 -21021 -17731 -22382 -19856 -22573 -12643 -9968
5464i968L596k1747J484K0149K069L246k048j849o82r17R016J1396j2759j2401
$$ -9968 -6372 -28119 -26635 -6486 -4417 -1171 -3219 -5068 -5750 -6667 2349 13745 986 -11415
5450a1415l905J0421j177n184P795m054M660P369M152R36j0109o781n446M37o074
$$ -11415 -15320 -4899 -6076 -11260 -3465 -7519 -2859 4510 8662 9598 -511 -7292 -12738 -12301 -18375
5435a8375m721J1508O413q167M016k661p323J973M638J5520O269l625j4303L565
$$ -18375 -23096 -11588 -5175 -13342 -9326 -11987 -19310 -17337 -12699 2821 9090 5465 -8838 -5273
5421e273k3100n19Q574N988J6251J0540o393j777M500r212l875K385L371j2959
$$ -5273 -28373 -28892 -20318 -14330 1921 12461 6068 4291 8791 -421 -4296 -1911 1460 -11499
5407a1499n649m746M205M860O308M614p731l612J3047j599k0797o662P582N240
$$ -11499 -17148 -21894 -17689 -12829 -6521 -1907 -9638 -13250 -203 -1802 -22599 -29261 -21679 -16439
5393a6439J5439L486j3112j6098M267Q403J768O207N621J3112j902o115k318j5551
$$ -16439 -1000 2486 -10626 -26724 -22457 -14054 -12286 -6079 -458 12654 10752 4637 2319 -13232
5379a3232N610R698n070k559l615P266p129n584N789l525l150J910k938L716N347
$$ -13232 -7622 2076 -2994 -5553 -9168 -1902 -9031 -14615 -8826 -12351 -15501 -13591 -16529 -12813 -7466
5364g466m462j1898R455r331n981J6161R099J4464r099j3318j0545P891J3031
$$ -7466 -11928 -23826 -14371 -23702 -29683 -13522 -4423 10041 942 -12376 -22921 -15030 -1999
5351a999k2256j4123O727O883P188J2108J0384J3840Q439m647J2044K795o004
$$ -1999 -24255 -38378 -31651 -24768 -17580 -5472 4912 18752 27191 22544 34588 37383 31379
5338C1379k115j7536j7275J588n64m410J0878J0963K04R476K808p228j3616j1290
$$ 31379 29264 11728 -5547 -3959 -4523 -8933 1945 12908 13112 22588 25396 18168 4552 -6738
5324f738j2241j551Q766J1746J294j2160j1029L272J2514L931l778q526J3080
$$ -6738 -18979 -20530 -11764 -18 1276 -10884 -21913 -18641 -6127 -2196 -5974 -14500 -1420
5311a420N104L941R304J0078j5492j0291j0946o030Q529P528J2872R472n457j5617
$$ -1420 3684 7625 16929 27007 11515 1224 -9722 -15752 -7223 305 13177 22649 17192 1575
5297A575p005k794J0940J3032M569q181o514j0609j7692M611J5912Q492n799r678
$$ 1575 -5430 -8224 2716 15748 20317 12136 5622 -4987 -22679 -18068 -2156 6336 537 -9141
5283i141l742K76l606j3225K901l989O777R179r926r91Q069R054k480J0323J3478
$$ -9141 -12883 -12607 -16213 -29438 -26537 -30526 -23749 -14570 -24496 -25487 -17418 -8364 -10844 -521 12957
5268A2957l624p040j2164o00J1536O41K968j530j0609j2561J2079N815O769O831
$$ 12957 9333 2293 -9871 -10471 1065 1706 4674 3144 -7465 -20026 -7947 -2132 4637 11468
5254A1468n026l559M616O651J896m731o139q821j4777k042Q078M624R853J089
$$ 11468 6442 2883 7499 14150 16046 11315 5176 -3645 -18422 -20464 -12386 -7762 2091 3180
5240C180Q807j1001j5692M262l345J2097J387j3489m960Q12jJ58m199Q526J3916
$$ 3180 11987 986 -14706 -10444 -13789 -1692 -305 -13794 -18754 -17942 -17943 -17785 -21984 -13458 458
5225D58R540p605j0233p519N975j215L546Q902L997N10l762j841M791j1046O53
$$ 458 9998 2393 -7840 -15359 -9384 -10599 -7053 1849 5846 6356 2594 753 5544 -5502 -4849
5210d849J102k23R68m474L878Q650J556r829k168O457j3136k245j591K27n588
$$ -4849 -3747 -3970 -3002 -7476 -3598 5052 6608 -3221 -5389 1068 -12068 -14313 -15904 -15677 -21265
5195b1265n603R938J1711K138N334J190j3889r567J629J560J7254N863J317N967
$$ -21265 -26868 -16930 -5219 -3081 2253 3443 -10446 -20013 -18384 -16824 430 6293 7610 13577
5181A3577j2042p738k495o383l719N008k55M122r89J217J1107M802n706K863j58
$$ 13577 1535 -6203 -8698 -15081 -18800 -13792 -14047 -9925 -10914 -9697 1410 6212 506 3369 3211
5166C211j0002j8800J2209J5881O002j4950n590j682L105j1017J447O966J2710
$$ 3211 -6791 -25591 -13382 2499 8501 -6449 -12039 -13721 -10616 -21633 -20186 -13220 -510
5153e10M837M111o67L036O398k833L102Q576o328j4639r277J4604R122j6418j0838
$$ -510 4327 8438 7771 10807 17205 14372 17474 26050 19722 5083 -4194 10410 19532 3114 -7724
5138g724J5633j745j9737M46N073n671Q35P589K442q188J6568P224j4184q998
$$ -7724 7909 6164 -13573 -13127 -8054 -13725 -12890 -5301 -2859 -11047 5521 12745 -1439 -10437
5124a0437N681O225m359J0776q686j7097R314J4341J208N275K651O79o854n319
$$ -10437 -4756 1469 -2890 7886 -800 -17897 -8583 5758 6966 12241 14892 15571 8717 3398
5110C398J476o67M014j73o411q900J6035O059j112P82o091n737Q082q172L252
$$ 3398 4874 4207 8221 8048 1637 -7263 8772 14831 13719 14501 8410 2673 10755 2583 5835
5095E835O644n556p365O642N953j2055k190k077l583M183j72j1601J596N040P511
$$ 5835 12479 6923 -442 6200 12153 98 -2092 -4169 -7752 -3569 -3741 -15342 -13746 -8706 -1195
5080a195J6026p249p403O525O480r601j297P257L363j3284p225m369R024K3724
$$ -1195 14831 7582 179 6704 13184 3583 2286 9543 12906 -378 -7603 -11972 -2948 20776
5066B0776J083j1148j6501L735J1649n332k247M48j2042K06P891m79p901M533
$$ 20776 21859 10711 -5790 -2055 9594 4262 2015 2463 -9579 -9373 -1482 -1961 -9862 -5329
5052e329J6081p991j2899L709P478J535p384r66l320m270J512p275J2684J5893
$$ -5329 10752 2761 -10138 -6429 1049 2584 -4800 -5766 -9086 -13356 -11844 -19119 -6435 9458
5038I458n876P183O543k300n756j6465r930K981J4316J6629j0546m285r620j751
$$ 9458 3582 10765 17308 15008 9252 -7213 -17143 -14162 154 16783 6237 1952 -7668 -9419
5024i419j2581J873J1570J0857R082J913n229K036o502j5269J0186l747m848k684
$$ -9419 -22000 -20127 -8557 2300 11382 13295 8066 10102 3600 -11669 -1483 -5230 -10078 -12762
5010a2762K39P34J0221J7687j1991o927R963K2735r769j4890l782n015Q749n7
$$ -12762 -12523 -11789 -1568 16119 4128 -2799 7164 29899 20130 5240 1458 -3557 5192 5135
4996E135q950K883J79p32j520L307K340j990r576o332N489P593m04n453q201Q025
$$ 5135 -3815 -932 -753 -1485 -3005 302 2642 652 -8924 -15256 -9767 -2174 -2578 -8031 -16232 -8207
4980h207k742M556l526k456N087J962p13l34K100Q88j342l842q122N305M988M144
$$ -8207 -10949 -6393 -9919 -12375 -7288 -5326 -6039 -6373 -4273 -3385 -4727 -8569 -16691 -11386 -6398 -2254
4964b254M25O523J5970j1101j2820J5204J2336p667j6417K516P292J1050M286
$$ -2254 -1829 4694 20664 9563 -3257 11947 24283 16616 199 2715 10007 21057 25343
4951B5343q818j1170m544j0061Q473l863j5156p405J7334J0150J0779m202r061
$$ 25343 16525 5355 811 -9250 -777 -4640 -19796 -27201 -9867 283 11062 6860 -2201
4938b201r97M033p296J267M013j4250N777J7833L638p832M01o053j4622l224K3691
$$ -2201 -3198 835 -6461 -5194 -1181 -15431 -9654 8179 11817 3985 4386 -1667 -16289 -19513 4178
4923D178J4960j1122o238j0352j67J8037o952M099J0006p579J811l066l709n716
$$ 4178 19138 8016 1778 -8574 -8741 9296 2344 6443 16449 8870 10681 7615 3906 -1810
4909a810j66N980m760n964P371L166R869J6275R53m63j4905j1336o987J0288n084
$$ -1810 -1976 4004 -756 -6720 651 3817 13686 29961 30914 30451 15546 4210 -2777 7511 2427
4894B427k4854n822J8947R579p28J0338J2602p940J208O327J309m256j0820N599
$$ 2427 -22427 -28249 -9302 277 -451 9887 22489 14549 15757 22084 23393 19137 8317 13916
4880A3916J280j7808L867O114O763j191r422p50m43J634m393o295l887m161J4965
$$ 13916 15196 -2612 1255 7369 14132 12941 3519 2769 2326 3960 -433 -6728 -10615 -14776 189
4865A89P19p500j117M23p892q595r86K351R249J0758J2694K012k384j5475l723
$$ 189 908 -6592 -7709 -7286 -15178 -23773 -24759 -22408 -13159 -2401 10293 12305 9921 -5554 -9277
4850i277l824J1269K899q018j437J841O620J319J3090r393p719p502o45N868p538
$$ -9277 -13101 -1832 1067 -6951 -8388 -6547 73 1392 14482 5089 -2630 -10132 -10777 -4909 -12447
4835a2447r150Q491J1224J3318J487n305j463m67n056M376n732J127l730M636
$$ -12447 -21597 -13106 -1882 11436 12923 7618 6155 5688 632 5008 -724 403 -3327 1309
4821A309K5496j897j7662j5281k270N11J1107N506l28j199J5426J859n516N997
$$ 1309 26805 24908 7246 -8035 -10305 -9794 1313 6819 6491 5292 20718 22577 17061 23058
4807B3058j0642n899o434p110R66J359j4786K816l150J1334K0492J900N388K167
$$ 23058 12416 6517 83 -7027 -6061 -4702 -19488 -16672 -19822 -8488 12004 13904 19292 21459
4793B1459j9823l843L854N519k996o940N529L4j4003r772k06p916K500J6791J4965
$$ 21459 1636 -2207 1647 7166 4170 -2770 2759 2793 -11210 -20982 -21188 -29104 -26604 -9813 5152
4778E152L057M65m104j6896q63R982p70L948Q958j0248j582J3676J014n495j2127
$$ 5152 8209 8674 4570 -12326 -13189 -3207 -3977 -29 8929 -1319 -2901 10775 11789 6294 -5833
4763e833R933l21j1552r73J3060O956j303n683k3380k919J626M939J4207J0666
$$ -5833 4100 3779 -7773 -8746 4314 11270 9967 4284 -19096 -22015 -20389 -15450 -1243 9423
4749I423q81n567M961N007j389m912L527N314L431J1601N614l4281j6830q265
$$ 9423 8542 2975 7936 12943 11554 6642 10169 15483 18914 30515 36129 1848 -14982 -23247
4735b3247j1763P100Q302N239N661J2011L586n771K728j840R110N491P81l406
$$ -23247 -35010 -27910 -19608 -14369 -8708 3303 6889 1118 3846 2006 11116 16607 17388 13982
4721A3982J2301o043j6985m961R125J386l79n244q820j5569n283J0790Q143n761
$$ 13982 26283 20240 3255 -1706 7419 8805 8426 3182 -5638 -21207 -26490 -15700 -7557 -13318
4707a3318o610J1742N369j00l680m21J718P002N629n050M785jj843n000j483L446
$$ -13318 -19928 -8186 -2817 -2917 -6597 -7018 -5300 1702 7331 2281 7066 7065 5222 222 -1261 2185
4691B185o031n273J1691N2j0141J2852O477k9605R675J155j6619O592N784o811
$$ 2185 -3846 -9119 2572 2624 -7517 5335 11812 -17793 -8118 -6963 -23582 -16990 -11206 -18017
4677a8017R843l582O111q94j911j83K355P051q441J0931O321j43m65p26j2536
$$ -18017 -8174 -11756 -5645 -6539 -8450 -8633 -6278 773 -7668 3263 9584 9441 8976 8250 -4286
4662d286l906Q08o655l894j548j169J2752O384J085j1126l596O965j3549J510
$$ -4286 -8192 -7384 -14039 -17933 -19481 -20650 -7898 -1514 -429 -11555 -15151 -8186 -21735 -20225
4648b0225J4955M942K282J0515M86j750j5992j0149M477l42k6330J251J7658Q931
$$ -20225 -5270 -328 1954 12469 12955 11205 -4787 -14936 -10459 -10801 -37131 -35880 -18222 -9291
4634i291J1350O397O193p975k236R803m875j8682J2465J5588J8546k961o039q469
$$ -9291 2059 8456 14649 6674 4438 14241 9366 -9316 3149 18737 37283 34322 28283 19814
4620A9814l104o350r435M262Q650r710p740j4113o550N596J7721m676p801M678
$$ 19814 16710 10360 925 5187 13837 4127 -3613 -17726 -24276 -18680 -959 -5635 -13436 -8758
4606h758N09K0957j80m660l802l851j4039n867K8928J8495R48o432j4375o458
$$ -8758 -8249 12708 12528 7868 4066 215 -13824 -19691 9237 27732 28680 22248 7873 1415
4592A415p571l686l594m243m30K508P722R437L028r036q865l422j826n321J1647
$$ 1415 -6156 -9842 -13436 -17679 -18109 -15601 -7879 1558 4586 -4450 -13315 -16737 -18563 -23884 -12237
4577a2237P498J112Q682O236K072k7994K762J1935n67q337P640j479j2827j1901
$$ -12237 -4739 -3627 5055 11291 13363 -14631 -11869 66 -501 -8838 -1198 -2677 -15504 -27405
4563b7405J9036J4029o174p928r498l992J6401J7709K952Q821m506j2385j5396
$$ -27405 -8369 5660 -514 -8442 -17940 -21932 -5531 12178 15130 23951 19445 7060 -8336
4550h336m456J1297J751j2450m461N721N445R425k521m311q930j5685J134J1621
$$ -8336 -12792 -1495 256 -12194 -16655 -10934 -5489 3936 1415 -2896 -11826 -27511 -26377 -14756
4536a4756m3O633R099l293N277o675P297J5391K987k95j7486j5010j2258m811
$$ -14756 -14799 -8166 933 -2360 2917 -3758 3539 18930 21917 21622 4136 -10874 -23132 -27943
4522b7943n110P769J0256K073j975O835j8550j2625k093J2026J4901K630J8488
$$ -27943 -33053 -25284 -15028 -12955 -14930 -8095 -26645 -39270 -41363 -29337 -14436 -11806 6682
4509F682N935k02j5436j945O699R264m3j615m713K452k106J949N052j0839o12
$$ 6682 12617 12415 -3021 -4966 1733 10997 10954 9339 4626 7078 4972 6921 11973 1134 522
4494E22m03P02p067j5184p786J0261J6564R845J572J1605j0107r376k2p097K532
$$ 522 119 821 -6246 -21430 -29216 -18955 -2391 7454 9026 20631 10524 1148 1126 -5971 -3439
4479c439K1353K319m75J5689N994j6757j5220r421j0406J2608l102o787O812O179
$$ -3439 17914 20233 19758 35447 41441 24684 9464 43 -10363 2245 -857 -7644 -832 5347
4465E347J685L625j573p45J82m025j0187j5979Q273P199j7272O140J9715J3725
$$ 5347 7032 10657 9084 8339 8521 4496 -5691 -21670 -13397 -6198 -23470 -17330 2385 16110
4451A6110j65j199q711k2589r70J1417P387m747j1605n014K317o917J6860O782
$$ 16110 15945 14746 6035 -16554 -17524 -6107 1280 -3467 -15072 -20086 -17769 -24686 -7826 -1044
4437a044k149j3027p475n911m768Q229J5247M959O535O360q321m689m673o906
$$ -1044 -3193 -16220 -23695 -29606 -34374 -26145 -10898 -5939 596 6956 -1365 -6054 -10727 -17633
4423a7633O811J0292k897j119P368o539m785r596j2535j7395Q166J5505R391J1464
$$ -17633 -10822 -530 -3427 -4546 2822 -3717 -8502 -18098 -30633 -48028 -39862 -24357 -14966 -3502
4409c502M159k145m232m449P835j320K7j199q727j1946R2M709r141N815N828m696
$$ -3502 657 -1488 -5720 -10169 -2334 -3654 -3627 -4826 -13553 -25499 -25407 -20698 -29839 -24024 -18196 -22892
4393b2892R800R87j0582q109J18L427J3052J1932J0123l929j4698J0990o012k1324
$$ -22892 -13092 -12105 -22687 -30796 -30678 -27251 -14199 -2267 7856 3927 -10771 219 -5793 -27117
4379b7117k208M841k297L959J2868J3079m923J645j018q563j8659M637P831L950
$$ -27117 -29325 -24484 -26781 -22822 -9954 3125 -1798 -153 -1171 -9734 -28393 -23756 -15925 -11975
4365a1975J7442n9r518m187M577j490q936J3690L633o393j1687j2712L081J005
$$ -11975 5467 5408 -4110 -8297 -3720 -5210 -14146 -456 3177 -3216 -14903 -27615 -24534 -23529
4351b3529o240P834J3026p793r373Q852O917J7622K096j4468p884R561J2372k068
$$ -23529 -29769 -21935 -8909 -16702 -26075 -17223 -10306 7316 9412 -5056 -12940 -3379 8993 6925
4337F925l913k73J3524n567p387o395Q842m125r251j4971k196K519r515K730R692
$$ 6925 3012 2739 16263 10696 3309 -3086 5756 1631 -7620 -22591 -24787 -22268 -31783 -29053 -19361
4322a9361J1757P954k195j2140r17J1032q489k305k516p447O96O553r36P801O648
$$ -19361 -7604 350 -1845 -13985 -14902 -3870 -12359 -14664 -17180 -24627 -23931 -17378 -18314 -10513 -3865
4307c865k257N410n971n270l616n52L805J607n616j309J3601O156j1585q038o993
$$ -3865 -6122 -712 -6683 -11953 -15569 -16121 -12316 -10709 -16325 -17634 -4033 2123 -9462 -17500 -24493
4292b4493L17Q802K0171J5864M810j8380m900J0672j0375q862n387K77M423K1845
$$ -24493 -24176 -15374 4797 20661 25471 7091 2191 12863 2488 -6374 -11761 -11484 -7061 14784
4278A4784l006j3475N19r404K625J4055m236j1980N25J0261K1308l312j0923j630
$$ 14784 11778 -1697 -1178 -10582 -7957 6098 1862 -10118 -9593 668 21976 18664 7741 6111
4264F111j1207j2480k638L736j728R687R181M120M278j1308r175P589N324R818
$$ 6111 -5096 -17576 -20214 -16478 -18206 -8519 662 4782 9060 -2248 -11423 -3834 1490 11308
4250A1308J2301k972k0710P491j4495j827L264q835J2808L301q207p06J1705M457
$$ 11308 23609 20637 -73 7418 -7077 -8904 -5640 -14475 -1667 1634 -6573 -7279 4426 8883
4236H883R222j0976m956k798j3138n848J6233J5973J174q153N931O277p543o546
$$ 8883 18105 7129 2173 -625 -13763 -19611 -3378 12595 13769 5616 11547 17824 10281 3735
4222C735n836L351J883J790K954O321j09P849M559j1774j1945O266p127Q613P416
$$ 3735 -2101 1250 3133 4923 7877 14198 14089 21938 26497 14723 2778 9044 1917 10530 17946
4207A7946m532j1538p902o464L805J8286m146J937m591j1535j2190K095P208M050
$$ 17946 13414 1876 -6026 -12490 -8685 9601 5455 7392 2801 -8734 -20924 -18829 -11621 -7571
4193g571J0211K1063j549k2523P478Q174j128K4j9072j8295n449N226J4712J3139
$$ -7571 2640 23703 22154 -369 7109 15283 14155 14179 -4893 -23188 -28637 -23411 -8699 4440
4179D440L350p646j4566L771L014P235J6290j142q5j975l85j291r726j5222N184
$$ 4440 7790 144 -14422 -10651 -7637 -402 15888 14746 14661 12686 12301 11010 1284 -13938 -8754
4164h754J1466N691j0520j2696r300l68j0520j813J0332R622l895L012J3130J4363
$$ -8754 2712 8403 -2117 -14813 -24113 -24481 -35001 -36814 -26482 -16860 -20755 -17743 -4613 9750
4150I750J800n849q219J2160m592q545P247p944l130J2409R242L371j911m636
$$ 9750 11550 5701 -2518 9642 5050 -3495 3752 -4192 -7322 5087 14329 17700 15789 11153
4136A1153k2l823r652n149p686m846J4576J3068O93o262N504P343k456j7051j0538
$$ 11153 11131 7308 -2344 -7493 -15179 -20025 -5449 7619 8312 2050 7554 14897 12441 -4610 -15148
4121a5148p80O946o861J3710k23r468j1256Q69J6063M703m216M644j387m44r483
$$ -15148 -15928 -8982 -15843 -2133 -2356 -11824 -23080 -22211 -6148 -1445 -5661 -1017 -2404 -2848 -12331
4106a2331P022O464m979l322o878R154N949j868n548l5J9102N884j4670j2301
$$ -12331 -5309 1155 -3824 -7146 -14024 -4870 1079 -789 -6337 -6372 12730 18614 3944 -8357
4092h357L969j3081j908r12J1312J070K614O051L980Q378n69q378R436L391j1990
$$ -8357 -4388 -17469 -19377 -20289 -8977 -7907 -5293 758 4738 13116 12547 4169 13605 16996 5006
4077E006J3147n662j4921R15N474O187n02j2760m567P735o243j4737j442N377
$$ 5006 18153 12491 -2430 -1515 3959 10146 9644 -3116 -7683 52 -6191 -20928 -22370 -16993
4063a6993N472j666j4310n10R001J2138P976M306J036K604R136J3886O535r021
$$ -16993 -11521 -13187 -27497 -28007 -19006 -6868 1108 5414 6450 9054 18190 32076 38611 29590
4049B9590j7355j74k125L117M597j124P76R268k0359K238O588K255l230j4896
$$ 29590 12235 12061 9936 13053 17650 16526 17302 26570 6211 8449 15037 17292 14062 -834
4035h34M282n015p269J091l34J922N379k358Q451O781r280N555n325n849j0883
$$ -834 3448 -1567 -8836 -7745 -8079 -6157 -778 -3136 5315 12096 2816 8371 3046 -2803 -13686
4020a3686l52M218N750q39k146K818J0141R707N823n479J958j1138l4q631m205
$$ -13686 -14038 -9820 -4070 -4909 -7055 -4237 5904 15611 21434 15955 17913 6775 6741 -1890 -6095
4005f095Q24n507M600P251Q363Q5j559J0902o075p383r142j3346R535O824Q246
$$ -6095 -5271 -10778 -6178 1073 9436 9521 7962 18864 12789 5406 -3736 -17082 -7547 -723 7523
3990G523l012l607o454m152J6794K054j656j468k3814m397M698O967K5735j32
$$ 7523 4511 904 -5550 -9702 7092 9146 7490 6022 -17792 -22189 -17491 -10524 15211 15079
3976A5079j3095o912l690L055J880j0913l408Q987N394l602m897K786R031J904
$$ 15079 1984 -4928 -8618 -5563 -3683 -14596 -18004 -9017 -3623 -7225 -12122 -9336 -305 1599
3962A599J2364K869o972r032j5096J114r880k014K2863J8702K126p234p126j3370
$$ 1599 13963 16832 9860 828 -14268 -13154 -23034 -25048 -2185 16517 18643 11409 4283 -9087
3948i087k614J7100j776j4609o423o161J1135Q927M282N788J945k313m79L034
$$ -9087 -11701 5399 3623 -10986 -17409 -23570 -12435 -3508 774 6562 8507 6194 5715 8749
3934H749M225q556n928j727n165J3022J90N46O293P000L28l131j2956r17J1889
$$ 8749 12974 4418 -1510 -3237 -8402 4620 4810 5356 11649 18649 18977 15846 2890 1973 13862
3919A3862N037j3149k609r513j2689J7440Q42P29J2241q772j1334j939j1013j1222
$$ 13862 18899 5750 3141 -6372 -19061 -1621 -779 -50 12191 3419 -7915 -9854 -20867 -32089
$$ [...]
##END NTUPLES=NMR SPECTRUM
##END=
