##TITLE=Analysis number 320113
Compound Code cc 55713
Book Reference 467/52
Project Code adrs
Chemist Name benw
##JCAMPDX= 6.0         $$ Bruker NMR JCAMP-DX V2.0
##DATA TYPE= NMR SPECTRUM
##DATA CLASS= NTUPLES
##ORIGIN= Bruker BioSpin GmbH
##OWNER= nmr
$$ XWIN-NMR		Version 3.5
$$ Wed Jun 14 09:32:38 2006 GMT Daylight Time (UT+1h)  MAYBRIDGE\nmr@NMR_250MHZ
##.OBSERVE FREQUENCY= 250.131544655141
##.OBSERVE NUCLEUS= ^1H
##.ACQUISITION MODE= SIMULTANEOUS (DQD)
##.ACQUISITION SCHEME= undefined
##.AVERAGES= 16
##.DIGITISER RES= 18
##SPECTROMETER/DATA SYSTEM= dpx250
##.PULSE SEQUENCE= zg30
##.SOLVENT NAME= CDCl3
##.SHIFT REFERENCE= (INTERNAL, CDCl3, 0, 16.4676)
##AUDIT TRAIL= $$ (NUMBER, WHEN, WHO, WHERE, WHAT)
$$ ##TITLE= Audit trail, XWIN-NMR		Version 3.5
$$ ##JCAMPDX= 5.01
$$ ##ORIGIN= Bruker BioSpin GmbH
$$ ##OWNER= nmr
$$ C:\u/data/dgb/nmr/ADRS/730/pdata/1/auditp.txt
$$ ##AUDIT TRAIL=  $$ (NUMBER, WHEN, WHO, WHERE, WHAT)
(   1,<2006-06-14 09:32:12.92 +100>,<MAYBRIDGE\nmr>,<NMR_250MHZ>,
      <created by zg, POWCHK disabled, PULCHK disabled
       configuration hash MD5:
       E2 DF 36 D8 04 B2 41 60 5A D7 A3 38 5A 4B D0 FE
       data hash MD5: 64K
       EE 8B E4 8B BF AD 7D 26 01 EE 21 0C 07 F6 B7 DC>)
(   2,<2006-06-14 09:32:27.29 +100>,<MAYBRIDGE\nmr>,<NMR_250MHZ>,
      <Start of raw data processing
       ef LB = 0.3 FT_mod = 6 PKNL = 1 SI = 32K 
       data hash MD5: 32K
       0B 6D 63 DB CC 0B 67 C6 8D E1 05 A2 FA 03 19 B3>)
(   3,<2006-06-14 09:32:29.04 +100>,<MAYBRIDGE\nmr>,<NMR_250MHZ>,
      <apk 
       data hash MD5: 32K
       CB 4A 85 04 B1 1E 63 14 F2 39 B8 32 D5 1B CF 0C>)
(   4,<2006-06-14 09:32:29.75 +100>,<MAYBRIDGE\nmr>,<NMR_250MHZ>,
      <abs ABSG = 5 
       data hash MD5: 32K
       EF DE 17 9D 54 80 CF 71 61 6A 35 00 11 E5 F0 26>)
$$ ##END=
$$ 
$$ hash MD5
$$ CF 6B D0 33 BA FD 8B 9C BD 50 E4 02 1A FB 85 A5
##$RELAX= 
##$RELAX= 
##$RELAX= 
##$RELAX= 
##$RELAX= 
##$RELAX= 
##$RELAX= 
$$ Bruker specific parameters
$$ --------------------------
##$DU= <C:\u>
##$EXPNO= 730
##$NAME= <ADRS>
##$PROCNO= 1
##$TYPE= <nmr>
##$USER= <dgb>
##$AMP= (0..31)
100 100 100 100 100 100 100 100 100 100 100 100 100 100 100 100 100 100 
100 100 100 100 100 100 100 100 100 100 100 100 100 100 
##$AQSEQ= 0
##$AQ_mod= 3
##$AUNM= <au_zg>
##$AUTOPOS= <5 >
##$BF1= 250.13
##$BF2= 250.13
##$BF3= 250.13
##$BF4= 250.13
##$BF5= 500.13
##$BF6= 500.13
##$BF7= 500.13
##$BF8= 500.13
##$BYTORDA= 1
##$CFDGTYP= 0
##$CFRGTYP= 5
##$CHEMSTR= <none>
##$CNST= (0..31)
1 1 145 1 1 1 1 1 1 1 1 1 1 1 1 1 1 1 1 1 1 1 1 1 1 1 1 1 1 1 1 1 
##$CPDPRG= <>
##$CPDPRG1= <>
##$CPDPRG2= <>
##$CPDPRG3= <>
##$CPDPRG4= <mlev>
##$CPDPRG5= <mlev>
##$CPDPRG6= <mlev>
##$CPDPRG7= <mlev>
##$CPDPRG8= <mlev>
##$CPDPRGB= <>
##$CPDPRGT= <>
##$D= (0..31)
0 1 0 0 0 0 0 0 0 0.06 0 0 0 0 0 0 0.0002 0 0 0 0 0 0 0 0 0 0 0 0 0 0 
0 
##$DATE= 1150273931
##$DBL= (0..7)
120 120 120 120 120 120 120 120 
##$DBP= (0..7)
150 150 150 150 150 150 150 150 
##$DBP07= 0
##$DBPNAM0= <>
##$DBPNAM1= <>
$$ [...]
##$SUBNAM7= <"">
##$SUBNAM8= <"">
##$SUBNAM9= <"">
##$SW= 20.6930455092707
##$SWIBOX= (0..15)
0 0 3 0 0 0 0 0 0 0 0 0 0 0 0 0 
##$SW_h= 5175.983436853
##$TD= 65536
##$TD0= 1
##$TE= 295.16
##$TE2= 300
##$TE3= 300
##$TEG= 300
##$TL= (0..7)
0 120 120 120 120 120 120 120 
##$TP= (0..7)
150 150 150 150 150 150 150 150 
##$TP07= 0
##$TPNAME0= <>
##$TPNAME1= <>
##$TPNAME2= <>
##$TPNAME3= <>
##$TPNAME4= <>
##$TPNAME5= <>
##$TPNAME6= <>
##$TPNAME7= <>
##$TPOAL= (0..7)
0.5 0.5 0.5 0.5 0.5 0.5 0.5 0.5 
##$TPOFFS= (0..7)
0 0 0 0 0 0 0 0 
##$TUNHIN= 0
##$TUNHOUT= 0
##$TUNXOUT= 0
##$USERA1= <user>
##$USERA2= <user>
##$USERA3= <user>
##$USERA4= <user>
##$USERA5= <user>
##$V9= 5
##$VALIST= <valist>
##$VCLIST= <CCCCCCCCCCCCCCC>
##$VD= 0
##$VDLIST= <DDDDDDDDDDDDDDD>
##$VPLIST= <PPPPPPPPPPPPPPP>
##$VTLIST= <TTTTTTTTTTTTTTT>
##$WBST= 1024
##$WBSW= 4
##$XGAIN= (0..3)
0 0 0 0 
##$XL= 0
##$YL= 0
##$YMAX_a= 521799
##$YMIN_a= -801226
##$ZGOPTNS= <>
##$ZL1= 120
##$ZL2= 120
##$ZL3= 120
##$ZL4= 120
##$ABSF1= 16.46756
##$ABSF2= -4.225613
##$ABSG= 5
##$ABSL= 3
##$ALPHA= 0
##$AQORDER= 0
##$ASSFAC= 0
##$ASSFACI= 0
##$ASSFACX= 0
##$ASSWID= 0
##$AUNMP= <proc_1d>
##$AZFE= 0.1
##$AZFW= 0.1
##$BCFW= 0
##$BC_mod= 0
##$BYTORDP= 0
##$COROFFS= 0
##$CY= 12.5
##$DATMOD= 1
##$DC= 0
##$DFILT= <>
##$DTYPP= 0
##$F1P= 14.0000005364418
##$F2P= -0.99999901652339
##$FCOR= 0.5
##$FTSIZE= 32768
##$FT_mod= 6
##$GAMMA= 0
##$GB= 0
##$INTBC= 1
##$INTSCL= 1
##$ISEN= 128
##$LB= 0.3
##$LEV0= 0
##$LPBIN= 0
##$MAXI= 10000
##$MC2= 0
##$MEAN= 0
##$ME_mod= 0
##$MI= 0
##$NCOEF= 0
##$NC_proc= -4
##$NLEV= 6
##$NOISF1= 0
##$NOISF2= 0
##$NSP= 0
##$NTH_PI= 0
##$NZP= 0
##$OFFSET= 16.46756
##$PC= 1
##$PHC0= 171.4468
##$PHC1= 6.837045
##$PH_mod= 1
##$PKNL= yes
##$PPARMOD= 0
##$PSCAL= 4
##$PSIGN= 0
##$REVERSE= no
##$SF= 250.130013615938
##$SI= 32768
##$SIGF1= 0
##$SIGF2= 0
##$SINO= 400
##$SIOLD= 32768
##$SREGLST= <1H.CDCl3>
##$SSB= 0
##$STSI= 32768
##$STSR= 0
##$SW_p= 5175.98343685301
##$SYMM= 0
##$S_DEV= 0
##$TDeff= 65536
##$TDoff= 0
##$TI= <Analysis number 999999
Compound Code 99
Book Reference 9
Project Code 9>
##$TILT= no
##$TM1= 0
##$TM2= 0
##$TOPLEV= 0
##$USERP1= <user>
##$USERP2= <user>
##$USERP3= <user>
##$USERP4= <user>
##$USERP5= <user>
##$WDW= 1
##$XDIM= 32768
##$YMAX_p= 314573569
##$YMIN_p= -129279
$$ End of Bruker specific parameters
$$ ---------------------------------
##NTUPLES= NMR SPECTRUM
##VAR_NAME=  FREQUENCY,     SPECTRUM/REAL,   SPECTRUM/IMAG
##SYMBOL=    X,             R,               I
##VAR_TYPE=  INDEPENDENT,   DEPENDENT,       DEPENDENT
##VAR_FORM=  AFFN,          ASDF,            ASDF
##VAR_DIM=   32768,         32768,           32768
##UNITS=     HZ,            ARBITRARY UNITS, ARBITRARY UNITS
##FACTOR=    0.157963299565203, 1,           1
##FIRST=     4119.03096061043, 0,            0
##LAST=      -1056.95247624258, 0,           0
##MIN=       -1056.95247624258, -129279,     0
##MAX=       4119.03096061043, 314573569,    0
$$ Real data points
##PAGE= N=1
##DATA TABLE= (X++(R..R)), XYDATA
$$ [...]
18045A9964209J763307J911738K073902K125597K236909K558625L100396L729552
18037C9464235M598502N600867O425615O733620O635611O183586M741743K956168
18029H3339947J641382N85516j64438J20649J113803K170939L211345M139076
18021I6158219M572019L837826K223339L01299j519468k966595m021612m759482
18013I3825545m579217l561050k473567j707625j231710j149469j567912j992477
18005G5562518k394075l129328l849209l877279l461561k983058k498867j787890
17997E1581251j105353o85999m01457k48970m91857j039263j259434j044876j017455
17988D4286587r59380m96280J96623O83250Q81772J016980R19610N67825L64332
$$ y = [19964209, 21727516, 23639254, 25713156, 27838753, 30075662, 32634287, 35734683, 39464235, 44062737, 49663604, 56089219, 62822839, 69458450, 75642036, 80383779, 83339947, 84981329, 85566845, 85402407, 85523056, 86636859, 88807798, 92019143, 96158219, 100730238, 104568064, 106791403, 107092702, 105573234, 102606639, 98585027, 93825545, 89246328, 85685278, 83211711, 81504086, 80272376, 79122907, 77554995, 75562518, 73168443, 70039115, 66189906, 62312627, 58851066, 55868008, 53369141, 51581251, 50475898, 49789899, 49388442, 49139472, 48647615, 47608352, 46348918, 45304042, 44286587, 43327207, 42830927, 43027550, 43710800, 44592572, 45609552, 46529162, 47096987, 47461319]
17979D7461319J66986l29505o83815n88710n16550o29184o61093n01538l89003
17970D3328907l23257j40857N9330J51235K69461L00591Q3124m20071q87714j262023
17960D1158726j568807j833859j912003j783661j599838j336129j162516j117741
17952B8844172j276224j428556j556089j703318j902969j922232j880718j768262
17944A5405804j587467j401496j191521r73984p69896o64102n82634m77633l86821
17935G370250l72633l65500k97049k72804k90718k81652k11612k03095k18043
17926D857144j88457j50771j67450j48193j19071j40650j34062j04440j09645
17917C594405j01663j00106r1266j05397r1491p4536m8851o5233p4349q2658p1039
$$ y = [47461319, 47628305, 47298800, 46614985, 46026275, 45509725, 44880541, 44219448, 43717910, 43328907, 43005650, 42864793, 42924123, 43075358, 43344819, 43645410, 43728534, 43308463, 42420749, 41158726, 39589919, 37756060, 35844057, 34060396, 32460558, 31124429, 29961913, 28844172, 27567948, 26139392, 24583303, 22879985, 20977016, 19054784, 17174066, 15405804, 13818337, 12416841, 11225320, 10251336, 9481440, 8817338, 8234704, 7757071, 7370250, 6997617, 6632117, 6335068, 6062264, 5771546, 5489894, 5278282, 5075187, 4857144, 4668687, 4517916, 4350466, 4202273, 4083202, 3942552, 3808490, 3704050, 3594405, 3492742, 3392636, 3301370, 3195973, 3104482, 3029946, 2981095, 2915862, 2841513, 2758855, 2687816]
17906B687816n3777k6261n2716p0935n0446k7929j7078l5737n5550n4805l6549
17895B206033m7418l7010n8071k0895k4839p1417n8004n4690m4702m4761k3303
17884A720923k6336n2858l7218m2619n0230m8186j5740p267j2814k2596k6097
17873A378962P004o718J1388j1882m7533j8794j2553l2005m6845k3786K0153J9051
17861A236442j1110l4404n3235l1174n356n976j5283l2989n0565m4472J3868J0035
17849I75781M635M444p195m363p583l7680l3685O437O498o020Q652k893j9864
17836H87164K3219p380k3034j1782J9720j4271n7051M617o099l6150k9071q558
17824G41324R660K4329M0742j2825j5145J4963k365j4359j8493J540n296J9582
$$ y = [2687816, 2634039, 2607778, 2555062, 2484127, 2433681, 2405752, 2388674, 2352937, 2297387, 2242582, 2206033, 2158615, 2121605, 2063534, 2042639, 2017800, 1946383, 1888379, 1833689, 1788987, 1744226, 1720923, 1694587, 1641729, 1604511, 1561892, 1511662, 1463476, 1447736, 1440469, 1427655, 1405059, 1378962, 1385966, 1379248, 1390636, 1378754, 1331221, 1312427, 1299874, 1267869, 1221024, 1197238, 1217391, 1236442, 1225332, 1190928, 1137693, 1106519, 1101163, 1095187, 1079904, 1046915, 996350, 951878, 965746, 975781, 980416, 984860, 977665, 973302, 965719, 928039, 894354, 900791, 907289, 901269, 909921, 907028, 887164, 910383, 903003, 879969, 868187, 887907, 873636, 816585, 821202, 815103, 778953, 749882, 741324, 750984, 775313, 816055, 803230, 788085, 803048, 800683, 786324, 767831, 769371, 764075, 783657]
17812G83657J1803K0897K855J1035o205l273Q016K3563J0808M588j4506R986J3231
17799H76455o670k2395j083j5248p486K926k7277l2700k2300r155m6077k8846
17787F60144m40J6111j2880m3431n5709k6847n042j5771M854k3117j0787K2121
17775E09206n946j5717k7048j4487K2793k6284j5675k7679L972j5725J9219J0400
17763D17029k879P329O388P134K6931J2867J8030j3026j9311j6897r153l6518
17751C97924N79M3729M302l564j3283k1580n68q875m3328j8104P810p971L7634
17738C74705l848k1685j4008l9209K0420K562J547J323k0637P185q328k5117K516
17725B77426O493K1463n351k2673j083m938K9478k2891l0341J0801l8051k1480
$$ y = [783657, 795460, 816357, 819212, 830247, 824042, 820769, 828785, 852348, 863156, 867744, 853238, 863224, 876455, 869785, 847390, 846307, 831059, 823573, 826499, 799222, 766522, 744222, 735067, 688990, 660144, 659704, 675815, 662935, 619504, 563795, 536948, 531906, 516135, 520989, 497872, 487085, 509206, 503260, 487543, 460495, 446008, 468801, 442517, 426842, 399163, 403135, 387410, 406629, 417029, 414150, 421479, 427867, 435001, 461932, 474799, 492829, 479803, 460492, 443595, 434442, 397924, 398503, 442232, 446534, 442970, 429687, 408107, 407539, 398664, 355336, 337232, 345042, 337071, 374705, 370857, 349172, 335164, 295955, 316375, 318937, 320484, 321807, 301170, 308355, 300027, 274910, 277426, 283919, 305382, 300031, 277358, 276275, 271337, 300815, 277924, 247583, 258384, 220333, 198853]
17713A98853K3591K7747j7191j3229J6163J9434n301l0189j2956K0100M165j1406
17701B19781j5859J7019J1416l0442l0935j5686L815J4273L4545K840n718q567
17689A96482k1881J0821K0785O995K466j4698j6872L0884K8027L0516L6192k713
17677C07004n916J5306J084k2382j5060O170N485J3705J9121J8881L620O5714
17665D12732P0491M2686M1910N3487L2830J7394L0360M1123P3502N4155P4928
17654I45598O8878J01629P5450N9075P3981M1406L3756J902m4272n3152k7430
17643A276821p3609q8568j10106p6697m2364n9885n9024o4072m4438j4207o606
17632F37245l6531l6721k1360j9052n6684l6548j3785j7809k6912j2024o181J4908
$$ y = [198853, 222444, 250191, 233000, 219771, 235934, 255368, 250067, 219878, 206922, 227022, 231187, 219781, 203922, 220941, 232357, 201915, 170980, 155294, 159109, 173382, 207927, 210767, 205049, 196482, 174601, 185422, 206207, 213202, 215668, 200970, 184098, 214982, 243009, 273525, 309717, 307004, 301088, 316394, 317478, 295096, 280036, 286206, 291691, 305396, 324517, 343398, 347018, 412732, 483223, 525909, 567819, 621306, 654136, 671530, 701890, 743013, 816515, 870670, 945598, 1014476, 1116105, 1191555, 1250630, 1324611, 1366017, 1399773, 1401675, 1357403, 1304251, 1276821, 1203212, 1114644, 1004538, 927841, 885477, 825592, 766568, 702496, 658058, 643851, 637245, 600714, 563993, 542633, 523581, 466897, 430349, 416564, 398755, 371843, 359819, 353638, 368546]
17620C68546K5336K3602N9189O8838L3343K5420J22j8704k1903n4098o5721l5048
17608D08922k3387k5184n9038p7382k3993J8106L8k1361m131J589K5468K249j0417
17595B11479j2259k9936k3218R71L12K4439R153k1955j3718k6085k328Q382M295
17582A29532j5701j1912K9244J9270j2360L798L1178K4869K5667J465P913L0321
17570B63284K2297J9593j9517j0834n01M510K455k7066l4015l0929k4988q111
17558A56178j0078j8732o269q61K9774K9965j0446k8602K472o602J1802K5017
17546A73618L7836J3718Q600j2345k285M6410M7864K0135j6065j394P43K9153
17534C45988R945K3210J3423J9614K2633L8275K6123l4989k6580n319J4011J3150
$$ y = [368546, 393882, 417484, 476673, 545511, 578854, 604274, 604396, 585692, 563789, 509691, 443970, 408922, 385535, 360351, 301313, 223931, 199938, 218044, 218082, 196721, 192590, 194179, 219647, 221896, 211479, 199220, 169284, 146066, 147037, 147349, 171788, 180941, 158986, 145268, 119183, 116855, 125237, 129532, 113831, 101919, 131163, 150433, 138073, 141871, 173049, 197918, 223585, 225050, 232963, 263284, 285581, 305174, 285657, 274823, 274322, 278832, 281287, 254221, 220206, 189277, 164289, 156178, 146100, 127368, 121099, 120238, 150012, 179977, 169531, 140929, 143401, 136799, 148601, 173618, 211454, 225172, 233772, 221427, 219142, 265552, 313416, 333551, 317486, 316092, 316835, 345988, 355933, 379143, 392566, 412180, 434813, 473088, 499211, 464222, 437642, 432323, 446334, 459484]
17522D59484j8102j8720k823J9400m885J9055J7808Q195J8159J1634l3489m6980
17510D28736j9810j8748l5223m0781l561j0691J6852N958j3582k2386o956p342
17498B72466J02n827j0946M9156L1149L8330O965m9520k7897J9173j8609j6054
17486B88488K5349K601J7285M9010L2663P51R659q382j704J4586N408k2555r615
17473D03544j7906K9516K1177k8065l1153j1355K2598J0174m7890k9301p077J4680
17461C28942p895J548J2485k6194m1835j0280n200p484j7363K4934o194k1015
17449B24449P236j0740K457Q635K1500J5550j687J0421j4994l9038m9383k1815
17437A52591k8678p021L515N571k939Q194p051j4977k2818j3913K676K290K858
$$ y = [459484, 441382, 422662, 419839, 439239, 434354, 453409, 471217, 479412, 497571, 509205, 475716, 428736, 408926, 390178, 354955, 314174, 310613, 299922, 316774, 322732, 309150, 286764, 279808, 272466, 272568, 266741, 255795, 304951, 336100, 374430, 381395, 331875, 303978, 323151, 304542, 288488, 313837, 316438, 333723, 382733, 415396, 416147, 425806, 417424, 415720, 430306, 435714, 413159, 403544, 385638, 415154, 436331, 408266, 377113, 365758, 388356, 398530, 350640, 321339, 314262, 328942, 321047, 322595, 335080, 308886, 267051, 256771, 251571, 244087, 226724, 251658, 245464, 224449, 231685, 220945, 223402, 232037, 253537, 269087, 267400, 277821, 262827, 223789, 174406, 152591, 123913, 116892, 120407, 125978, 123039, 131233, 124182, 109205, 86387, 72474, 75150, 77440, 80298]
17424H0298k0251k0123l1325m695J6698K0594m477k7941J3054J6273J3434l4766
17412A6773j7970J5926J517n011L011q07J7350P253J1236K106p098J2711Q136
17399F5133l1127j3255RJ3874K0430Q071L658j5217l3141q875j2569M342J7640
17386A8973K1182K7641J7251j2881l4884k1601K9122J0578Q514k480j0143q678
17374D2594j1935j4085J6725J182k3858R35K9015J476k5206K3132L1382J8966
17362I0323q426l5029k2046K368j4062j3198p541o06l251R76J2650R875J1643
17349B3676J4460J1150j51j8888K965r743Q724K3275j2056K8213j2355k5939l522
17336B9809o876j4779N457J5967J0754k645p414J3909J8952K1134k9274j7705
$$ y = [80298, 60047, 39924, 8599, 3904, 20602, 41196, 36719, 8778, 21832, 38105, 51539, 16773, -1197, 14729, 16246, 11235, 14246, 13439, 30789, 38042, 49278, 51384, 44286, 56997, 65133, 34006, 20751, 20760, 34634, 55064, 63135, 66793, 51576, 18435, 9560, -3009, 1333, 18973, 40155, 67796, 85047, 72166, 37282, 15681, 44803, 55381, 63895, 61415, 51272, 42594, 30659, 16574, 33299, 34481, 10623, 11558, 40573, 42049, 16843, 39975, 71357, 90323, 81897, 46868, 24822, 27190, 13128, -70, -7611, -8217, -11468, -10492, 2158, 12033, 23676, 38136, 49286, 49135, 30247, 33212, 23469, 32193, 55468, 43412, 71625, 59270, 33331, 29809, 22933, 8154, 13611, 29578, 40332, 37687, 30273, 44182, 63134, 84268, 54994, 37289]
17324C7289k4471k7948j6445Q421J8007K9421K6512K53m088j0624J237n971j3359
17311A8234K4560L775J2315j2801j4668l4689q889n550K6508P595k0036K1613
17299A7967n468J9578o693J2419J2962J5198r93q319r13k8524P382J4906J1493
17286F0995n116K394j5552j0668l208K043l542N050j8491j9424K84K7982O151
17273B8898k2690j6620J088K4560N548K5762n565j8827j9047j2900R22o137Q283
17260f725K0504J0883l2498j0866j1449K7765L4843J6503J47j7608k7998k7466
17248b3965J0340L000J2547P802J2492j7397o388k5824L1259L4046O419j346l248
17235C9737O323J6680l8897k3644n928j2115L497K521M0180N899J1436N537j7081
$$ y = [37289, 12818, -15130, -31575, -23154, -5147, 24274, 50786, 51039, 46951, 36327, 37564, 31593, 18234, 42794, 46569, 58884, 46083, 31415, -3274, -12163, -17713, 8795, 16390, -3646, 17967, 12499, 32077, 25384, 37803, 50765, 65963, 64970, 56651, 55738, 27214, 34596, 49502, 60995, 55879, 58273, 42721, 32053, 28845, 30888, 27346, 32396, 13905, -5519, -5235, 22747, 28898, 6208, -10412, -9324, 15236, 20784, 46546, 40981, 22154, 3107, -9793, -8871, -15008, -6725, 13779, 24662, -7836, -18702, -30151, -2386, 32457, 48960, 49107, 31499, 3501, -23965, -13625, -10625, 1922, 9724, 22216, 4819, -1569, -27393, 3866, 37912, 44331, 42985, 39737, 46060, 62740, 23843, 199, -5729, -17844, -14347, -11826, 28354, 34253, 45689, 51226, 34145]
17222C4145k964k21N6m0412n616J0853m151Q398k6555K637K4552J2870k6304k3262
17208c5974K937K9842J8045L012m016p494l062k0560j578R149p922J3316P682
17195C377j2252Q35P710N8052m866j1321l0788j8155l53M596j5491J4568q250
17182a2338j7661K3453M976m114P730k7253m2580J3775L0700J0351L4966l495
17170A8510n0348J701k5085R190K0768j373P422r210K9922K2532j0188l5731o555
17157b8445K8131K923N408o47J3156K0544l2103k4937L724N191K3513Q371j1048
17144A3781K1970L407N530l531l5230j6576J1673J7372r899k1364n716K4665j12
17131E970j9824P905J64R683L5013j8459k8978J2231J2501J3377K2739L0140j5743
$$ y = [34145, 31181, 30960, 31016, -9396, -15012, -4159, -8310, 88, -26467, -23830, 722, 13592, -12712, -35974, -33037, -3195, 14850, 17862, 13846, 6352, 3290, -17270, -18848, -9699, -17621, -4305, 3377, -8875, -8040, -330, 57722, 52856, 41535, 10747, -7408, -7761, -3165, -18656, -4088, -12338, -29999, -6546, -1570, -5684, 2046, -25207, -67787, -54012, -23312, -12961, 22005, 18510, -31838, -30137, -55222, -46032, -25264, -26637, -19215, -28425, 1497, 24029, 13841, -21890, -28445, -314, 2609, 8017, 7370, 20526, 41070, 8967, -15970, -12246, -7055, 16458, 24829, 13781, 35751, 39158, 44688, 41157, 5927, -10649, 1024, 18396, 8497, -12867, -18583, 6082, 5970, -13854, -5949, -5785, 3898, 38911, 20452, -8526, 3705, 16206, 29583, 52322, 82462, 66719]
17118F6719l7829M741J0091k191l8873p522K2055o121l729l9791j0552J0436j515
17105c4081k3930J074P388K1135K8655M55P316N756r26J5123R655N574O58q42
17091D3010j0152J23j6358j7652j1804j6221k0925Q117J0531J7247Q791k4521
17079b9814k6479j595K9447K9690o622j6764l0879N372N2651J1644j8530O746
17067D867N257Q496k17j0939o092j3443k2709r934k29J6576k499m894n081r736
17053e0577J248O197K0657Q038j3240J3424K4195j7938j7371J0960L9599J7410
17041D2602j9526p794L298j7093R962N671j8948l419q593M483k491j671J682J4737
17027B900n81J3517j1095P063q26p549N319j2187J4544n683M499M557l881p998
$$ y = [66719, 28890, 33631, 43722, 41531, 2658, -4864, 17191, 11070, 7341, -32450, -43002, -32566, -34081, -58011, -56937, -49549, -28414, 241, 696, 8012, 13768, 12842, 27965, 37620, 43194, 43852, 43010, 32858, 32981, 16623, -1029, -12833, -29054, -49979, -41862, -31331, -14084, -5293, -29814, -56293, -57888, -28441, 1249, -5373, -22137, -53016, -47644, 5007, 16651, -1879, 4867, 10124, 18620, 18403, 7464, 1372, -12071, -34780, -44714, -44943, -28367, -30866, -35760, -40841, -50577, -49329, -43132, -22475, -14437, -27677, -14253, 9942, -7996, -25367, -14407, 25192, 42602, 23076, 15282, 18580, 1487, 11449, 17120, -1828, -5247, -13840, -9357, -11848, -13519, -11837, 2900, 2319, 15836, 4741, 11804, 10978, 3429, 8748, -3439, 11105, 5422, 9921, 14478, 10597, 2599]
17013B599j3493n182j5597L4993P808j3293j3267K886J4510J3089k0361l2579
17001c7887K2278K3701N234M852k5353L1347Q165l0155l2740K120j0371J777P652
16988b9380J9160K1999r38k6405N777R427j2452L1967J7802j2902o182l0877Q926
16975d078P131k1102k8069L1198K2439j2372q259K1677K7389r595j1148q951j4411
16962h151J8822Q852j5639k0625k2374m811M040J9577P703N610p241m955R384
16949i808M262K3940J2337j2384j4894k5076j1837K090Q46J9473o772N709L6122
16936B4008K5876R060o670j1798j2693p641l315P685q691k5518P586K2610n470
16923A5029l2186J0626J3858k5688J0835K5002k2920m2543l2731J5619L6250K5307
$$ y = [2599, -10894, -16076, -31673, 3320, 11128, -2165, -15432, -12546, 1964, 15053, -5308, -37887, -15609, 8092, 13326, 18178, -7175, 24172, 32337, 2182, -30558, -28438, -38809, -37032, -29380, -10220, 11779, 10841, -15564, -9787, -360, -12812, 19155, 36957, 24055, 17873, -13004, -4078, 3053, -18049, -46118, -14920, 7519, -4853, -13112, 8565, 35954, 26359, 15211, 6260, -8151, 10671, 19523, 3884, -16741, -39115, -43926, -39886, -20309, -12606, -6996, -14237, -19192, -9808, -5546, 18394, 30731, 18347, 3453, -21623, -33460, -31370, -30524, -11051, -17823, -12114, 24008, 49884, 58944, 52274, 40476, 27783, 20142, 16827, 24512, 15821, -9697, -2111, 20499, 15029, -17157, -6531, 7327, -18361, -7526, 17476, -5444, -47987, -80718, -65099, -28849, -3542]
16911c542k580j1088j8708l772N1099j6748j9447j28L813J0299O3k3458l5388
16898f9585L5519L7403N867q006J422j2594N715J2143m470k5163o499q44k1452
16885e0544J4796K1399J5081M292Q724L4992j0062k0553j5351l7106j2152K0630
16873b5854k8087j332M6808L2782j5452k2742j6726j6913j1118K0129j5898p060
16861f1463M919J9232j0653L723J8320r030r037J3253j6065M411j0879J8783k786
16848c7272k1489J0411L6040K9887n117L311n920Q627j5104l0390n523K7446J4583
16835I490q125P417R487j5488l675j1293j9034K4483m799j3226L06k1576p15K5662
16821b1086J2478r856J8923P998j0813J0356O795p613k0270K876J7607r555k0848
$$ y = [-3542, -6122, -17210, -35918, -39690, 11409, -5339, -24786, -24914, -21101, -10802, -10739, -34197, -69585, -34066, 3337, 9204, 1198, 2620, -9974, -4259, 7884, 3414, -21749, -28248, -29092, -50544, -35748, -14349, 732, 5024, 13748, 48740, 38678, 18125, 2774, -34332, -46484, -25854, -53941, -55273, -8465, 24317, 8865, -13877, -30603, -47516, -58634, -38505, -54403, -61463, -56544, -37312, -47965, -44242, -25922, -34952, -43989, -30736, -46801, -42390, -53269, -34486, -37272, -58761, -48350, -12310, 17577, 12460, 15771, 9851, 18478, 3374, -27016, -32539, -5093, 9490, 1365, 8782, 18269, 2781, -894, -12187, -31221, -6738, -11537, -24763, -24457, -46033, -46748, -21086, -8608, -18464, 459, 8457, -2356, 8000, 14795, 7182, -13088, -10212, 7395, -2160, -23008]
16808b3008j4464q085Q359o156J0319J2035r12J6205K0891J0275J7535o452k879
16795C3663n937k4236k5292J832P91L282J1244k3161k8736J5923p096P582O0244
16782B0103J8862m352l586n618m4334j3769l199P691N359k1131j2908K971O478
16769d7433j0623J0046K4627J0859P455j95K9673M171k6471J3199M562J3120P224
16756D0214o984J1097j4155q152q789k5419J7233m279O325R25q674k4579o128
16743c1365R529L941q42J7221k3019K009P108l0616k6865l118J8336J3999Q964
16730c4718R019K310K1361j6435P356J6541Q989M885k3669j2570J3433o41K878
16717a261j5962k5244o819J4866N357L0091K2254k2027j4109j446L793j433l1042
$$ y = [-23008, -37472, -45557, -37198, -43354, -33035, -21000, -21912, -5707, 15184, 25459, 42994, 36542, 33663, 27726, 3490, -21802, -19970, -19179, -15897, -4653, -27814, -56550, -40627, -47723, -40141, 20103, 38965, 34613, 31027, 25409, -18925, -32694, -35893, -28202, -22843, -43974, -56882, -53911, -47433, -58056, -48010, -23383, -12524, -5069, -5264, 24409, 28580, 2109, 15308, 19870, 32990, 40214, 33230, 44327, 30172, 22020, 13231, -12188, 5045, 766, 7091, 8016, -658, -25237, -31365, -21836, -17895, -18737, -1516, -24535, -22526, -15418, -46034, -72899, -76017, -57681, -43682, -34718, -25699, -23389, -2028, -18463, -11107, 5434, 14423, 19308, -4361, -16931, -3498, -4139, -1261, -17223, -42467, -49286, -34420, -29063, 1028, 23282, 1255, -12854, -14300, -10507, -11940, -42982]
16704d2982q292K4860J2071J0881J2186Q271K0472k4008l6611n261J2842o209
16692b1780M492M151K9112p983j0099Q327N933M218J19j2477L946j165k4004j162
16678a8372J3889j5157k679J2501J125K943L3716q222j2977l496j5132M088J6692
16665H919m049J11p803j2281j8089M656O737J3350J7230j306j5842r8K2815k418
16651A1932l489J6117K492R172r178l5893O498M500l7992k1684J426J0306K2646
16638b3147N13K0562K16j1904J0647o867k9l101j0781l7687j0317j0643J4078
16625f8460M546J3072J0681j3159j9389R282L231K8580K3566k4900k5258j2112
16613g0320J7120N7299J6980m2140k2886K2541K2118k0480k5588J5026J3283o058
$$ y = [-42982, -51274, -26414, -14343, -3462, 8724, 16995, 37467, 13459, -23152, -28413, -15571, -21780, -17288, -13137, 15975, 7992, -2107, 6220, 12153, 16371, 16490, 4013, 7959, 6794, -17210, -18372, -4483, -19640, -22319, -9818, -8693, -5750, 27966, 19744, 6767, 3271, -11861, -7773, 8919, 4870, 4981, -2822, -15103, -33192, -28536, -21799, -8449, 8781, 7475, -8367, -8465, 14350, 11932, 8443, 24560, 27052, 36224, 27046, -8847, -2349, 2151, -35841, -57525, -56099, -45793, -23147, -22634, -2072, -1856, -13760, -3113, -9980, -10009, -13110, -23891, -61578, -71895, -82538, -68460, -63914, -50842, -40161, -53320, -72709, -63427, -60196, -31616, -8050, -32950, -58208, -70320, -53200, 4099, 21079, -21061, -43947, -21406, 712, -19768, -45356, -30330, -17047, -23105]
16601b3105k3310K11L6590l795j4445j1310j6879J5149J5358K7061q421j1266
16589a8162J6966P325j6226n624l6j8544J5416K2928L035l0902k1468r681K0061
16576c4912P1461J6811j7382l0494j6579j2723M857o08P566R241m658M064j3899
16563a7255p108j3000j0060K4346k2732k8587R547J369J1452k3104k635J9260
16551e8507L3136K3260j276M089q927j526J8198J9634j1179l0808j3477m576r82
16538c2941k803K0090L761m3106o294M4638L1694M5p031L986j8934p057J935j232
16524a3249q333J7674K5264m841l3946O808j3672o632j7526k576K6990l797j1725
16511c9561J0169P620M825j8829m0461n604O2963L1561m3342k3140O566J0356
$$ y = [-23105, -46415, -46204, -9614, -13409, -27854, -39164, -56043, -40894, -25536, 1525, -6896, -18162, -1196, 6129, -10097, -15721, -15757, -34301, -18885, 4043, 7078, -23824, -45292, -54973, -34912, 36549, 53360, 35978, 5484, -11095, -23818, -18961, -19569, -12003, -2762, -7420, -3356, -17255, -24363, -37363, -47423, -23077, -45809, -74396, -64849, -63480, -52028, -75132, -77767, -58507, -25371, -2111, -3387, 702, -8225, -9751, 8447, 28081, 16902, -13906, -27383, -31959, -32941, -35744, -15654, -11893, -54999, -61293, -16655, 15039, 15084, 8053, 12039, -6895, -13952, -12017, -13249, -21582, -3908, 21356, 16515, -17431, -10623, -24295, -30927, -48453, -51029, -24039, -27836, -39561, -29392, -21772, -16947, -35776, -76237, -81841, -18878, 12683, -30659, -53799, -47233, -36877]
16499c6877O020l3934p794J6522L5898J4421J1126L068l9866R436k440J652K0506
16486b262J7289k638J6814P696m2173k1709o02k2533J0229K9673R686k343p048
16473i921j1732n600j7477J3476L2167K4546m844m824l258j7095n324r287J508
16460a7665J6456q877k7191K740j8502M577K9353j4849k8521Q52k784o872j0888
16447h2171j2789M871J7709J1547J5086j0634n199R658J3447J7135L4682j1494
16435A848k2709K3104R336p363k940J1830J8315k3494o030K2005p297j4606j1238
16422i239n810j0851K1894M41J9441N035k499k6281l057m009j1834m650J2669
16409a8750L6891r430p446K7023j1475o120k0601n8812O837K7180K4645Q818m824
$$ y = [-36877, -30857, -64791, -72585, -56063, -20165, -5744, 5382, 8450, -31416, -21980, -24420, -22768, -2262, 15027, 12389, 29203, 36899, -5274, -26983, -27585, -50118, -39889, -10216, -530, -2873, -9921, -21653, -27253, -44730, -31254, 913, 25459, 20615, 15791, 12533, -4562, -9886, -19173, -17665, -1209, -10086, -37277, -34537, -53039, -48462, -19109, -33958, -62479, -61627, -64411, -71283, -82171, -94960, -90089, -72380, -60833, -45747, -56381, -61580, -51922, -38475, -21340, 13342, 1848, -20861, 2243, 11579, 4216, 1276, 13106, 31421, 7927, 1897, 23902, 16605, 1999, -9239, -15049, -25900, -4006, -3565, 15876, 20911, 18412, -7869, -10926, -14935, -26769, -31419, -18750, 18141, 8711, 1265, 28288, 16813, 10693, -9908, -68720, -61883, -34703, -10058, -1240, -6064]
16396f064M10J9561l5861k966K5765J6276N913k1134j4816q411k8802k3318k458
16383g5905L3627J6785j0961m5588J2191M4234L9972j4807L826j7093l420q443
16371b5582j2494m095J4999L627k2155K7160K3610j4448j5576q050j4757j7695
16359f5456O68n350J5450K1707J0977p898l2922J2050L0797j641o312m364j3874
16346d6168r147j6547l9719j7698M1324N8964M897j1999p119N136L663o252L895
16333c6770J431k352K1132j232K5190j37j8751J8956N733k5858l7595M0K6481
16320b3732J9943J8597N705k2470j0056k445k795j3997j0614j1094R988J1215
16308c1755O047M411j4948L088J427J0415L7405L9215j3451n1461k1111M529j2411
$$ y = [-6064, -5654, 13907, -21954, -24920, 845, 17121, 23034, 1900, -12916, -21327, -50129, -73447, -75905, -42278, -25493, -36454, -82042, -69851, -25617, 14355, -452, 3374, -13719, -17139, -25582, -38076, -42171, -27172, -23545, -45700, -18540, 5070, -9378, -24954, -33004, -47761, -65456, -64788, -70138, -54688, -32981, -22004, -29902, -62824, -50774, -19977, -21618, -27930, -32294, -46168, -55315, -71862, -111581, -129279, -87955, -28991, -24094, -36093, -43212, -38076, -34413, -40665, -36770, -35339, -37691, -16559, -17791, 7399, 7262, -11489, 7467, 13200, -12658, -50253, -50213, -23732, -3789, 14808, 20513, -1957, -12013, -14458, -17253, -31250, -41864, -52958, -42970, -31755, -25708, -21297, -36245, -33157, -31730, -21315, 16090, 55305, 41854, -9607, -30718, -26189, -38600]
16295c8600o919j2767K7917L838J355j0960O819k358J7742l979j9381l445K0557
16282b0181K7834K1778j2073k2106o266K9453j7205j0212j5485J921n437j2348
16270d0327J2755J0053J1027K2440l1153k4097k3012q028R094o451J4343J1942
16258d1414R146O613J661o152L90j3737N101K8552j1093K581J896j0096J259j2244
16244c7537L706r675K281J86o432J2111K051j1949L932J9511j28p336k799l2317
16230f4395j711K4158j4255p269J6071l97J2511J1100q51J2912j6878J3546J6289
16217H31R688J1470k888K1326j0472k3935j2305j2619k3111N957j2983O859k66
16204d2448k4341P29J6497p324k4890p2J3122K5544K0609j1471k0475M053J2370
$$ y = [-38600, -45519, -58286, -30369, -26531, -25176, -36136, -29317, -31675, -13933, -17912, -37293, -40738, -20181, 7653, 29431, 17358, -4748, -11014, 18439, 1234, -8978, -24463, -22542, -27979, -40327, -27572, -17519, -6492, 15948, -15205, -39302, -62314, -70342, -61248, -67699, -53356, -41414, -32268, -25655, -23994, -30146, -29756, -43493, -38392, -9840, -20933, -18352, -16456, -26552, -25293, -37537, -33831, -43506, -41225, -41039, -47471, -35360, -33309, -45258, -41326, -21815, -21943, -29279, -32078, -64395, -66106, -41948, -56203, -63472, -47401, -47798, -35287, -24187, -25038, -12126, -29004, -15458, 831, 10519, 21989, 19101, 40427, 29955, 6020, -6285, -18904, -42015, -36058, -49041, -42182, -42448, -66789, -66060, -49563, -56887, -81777, -81849, -68727, -43183, -22574, -34045, -54520, -50467, -38097]
16191c8097j8679n322L2573K2672K939P073j3655j6545l1984j6419J5450L9447
16179b0547J7274j3252q171N491J2160l503k0810j0669J6596J822k7867q024J0427
16166d9073M236n31J1547j2092q475M145J731K3420L4637n138r38j05j2755n71
16152i962j9843j1491k9154M880K4359O316r030L9014J78l2113k3207n481L729
16139f1805j667L2859K3358n710k0354j6133J8207j130N12l477p618j643N949
16126c8652K345J6122j269q394J8310J3312R215q329J4928O994j2648k8608o718
16113b3392L2900j987J389o72q805k6215q302K7701M39r301P484K5457M883j2607
16099H972Q738m653j4647k6394l3848J1753N3802J7145k7700j9421r500L1468
$$ y = [-38097, -56776, -62098, -29525, -6853, -3914, 3159, -10496, -27041, -59025, -75444, -59994, -20547, -3273, -16525, -24696, -19205, -7045, -10548, -31358, -42027, -25431, -23609, -51476, -59500, -49073, -44837, -45368, -33821, -45913, -54388, -50243, -48512, -25092, 9545, 4407, 3469, 3364, -9391, -9962, -29805, -41296, -70450, -65570, -41211, -34895, -43925, -4911, -4733, -36846, -60053, -65534, -61805, -63472, -30613, -7255, -12965, -33319, -49452, -31245, -32375, -31863, -35340, -42958, -44601, -38652, -36307, -20185, -21454, -29848, -11538, 1774, 10989, 2660, 17588, 24582, 11934, -16674, -23392, 9508, 7521, 8910, 8238, -567, -26782, -35084, -7383, -6944, -16245, -8761, 16696, 21579, 8972, 17710, 13057, -1590, -27984, -61832, -50079, 3723, 20868, -6832, -26253, -35753, -4285]
16087d285J7361R265r905m819j9098k1095M01K3523k8196j245M271L88l1221j1331
16073g5986J9489L2936J0753J8016o102l6687L4344m730p557J3435J8993l7652
16061b0748j8695k028Q529J1964J2673p454K1725k0358j1346N249J1478j7250
16049b6261J5741K752J8505o07j0645j8722O206n386m361K4369O072L601p034
16036D230q739P748K0232N450Q997l7719k9692J0419N9103R905l2780l1777J6095
16023A472k9180j2251J3405J9511m798l375k359l0843k7J5122J2354k23m3360
16010f4552J5611J0816J9434K8635K6493k076l3826o150L256k2398Q590j0401
15998b6568J7609Q383n320J1769r940m842m74l8806j5994J6024J3688n371K4332
$$ y = [-4285, 13076, 22341, 12436, 7617, -11481, -32576, -32175, -8652, -36848, -38093, -33822, -33434, -64655, -75986, -56497, -23561, -12808, 5208, -894, -37581, -3237, -7967, -15524, -2089, 16904, -20748, -39443, -41471, -32942, -20978, -8305, -15759, 5966, -14392, -25738, -20489, -9011, -26261, -10520, -7768, 10737, 10130, -515, -19237, -13031, -18417, -22778, 1591, 7663, 11264, 4230, -4509, 3239, 23471, 28921, 37918, 199, -29493, -19074, 40029, 49934, 17154, -14623, 1472, -27708, -39959, -26554, -7043, -11841, -15216, -17575, -48418, -48445, -33323, -20969, -21192, -64552, -48941, -38125, -18691, 9944, 36437, 34361, 535, -5615, -2359, -24757, -16167, -26568, -8959, -576, -5896, 5873, -4067, -8909, -9383, -48189, -64183, -48159, -34471, -39842, -15510]
15985a5510Q811P57n900m2301M304N8113J4429Q81R013N44l0975j8393k4518Q016
15971c2729n949L565J9172m806j006l541J1027j6008l0462J010J1909J5293J1666
15958b0859L357K1686J5120M983k727k2614m9449N214j4710J1948J1032O800J0175
15945b0044j3719L479K22J2985k2509n34J2943K305N85P460o40L473j0142J0142
15931a3994j8832M695L1975j8415k1577k0439l730m324m632J7255j103L740K4925
15918b4456j749O867R627K067l1841j0241Q60K382L538j0435J5571J0160j1221
15905c8871k9949J6739K6251K3738K1054j7648j8711m601P338J2672l059l9o352
15892a1438k7754R108j0846j8049J495Q015K0067K1018J2674n724j7198k0040
$$ y = [-15510, -6699, -5942, -11842, -54143, -49839, 8274, 22703, 23584, 32597, 33141, 2166, -16227, -40745, -32729, -38678, -35113, -15941, -20747, -21753, -25294, -14267, -30275, -60737, -59727, -47818, -32525, -20859, -17502, 4184, 19304, 24287, 21560, -1054, -50503, -45289, -59999, -48051, -37019, -30219, -20044, -33763, -30284, -30062, -17077, -39586, -40120, -27177, -24872, -24287, -16827, -17467, -13994, -24136, -13994, -32826, -28131, 3844, -14571, -36148, -56587, -60317, -64641, -69273, -52018, -53121, -49381, -24456, -26205, -19338, -9711, -7644, -39485, -49726, -48866, -46484, -42946, -53381, -37810, -27650, -38871, -68820, -52081, -25830, -2092, 18962, 1314, -17397, -21998, -14660, -1988, -5047, -5086, -11438, -39192, -30084, -40930, -58979, -57484, -49469, -29402, -8384, 4290, -1434, -18632, -38672]
15880c8672k5553K0922K4967j144j3035K1078j9668n648P842j0177J1107K3450
15868d531P570j7414j1157J4435j6457l8211q429K2194M0283l495k39k817K284
15855a5984l3271L5309O032l1776j136J9866K84j3870p422M087O246j5843k3988
15842g1466J7025N889o844l5025m734K0807K2841K5999J1735o973J5999j6974
15830b1721j0545K1357j2725l5645K9814J4215J6902j0482r695p531J7112q908
15818a7852r545L2315o570J356j1742j2586j5195k1760k4258j7067J6275p61J7396
15805f9994L2704P861K7546Q434j34j51j208j4246Q941Q850l5008r756k5050l3948
15791i5159p536k354j262L8891O247J1583J2867n172r174K3195N269J636l35Q930
$$ y = [-38672, -64225, -43303, -18336, -19480, -32515, -11437, -31105, -36753, -28911, -39088, -27981, -4531, 3039, -14375, -25532, -11097, -27554, -65765, -74194, -52000, -11717, -15212, -15451, -18268, -15984, -49255, -13946, -7914, -39690, -40826, -20960, -20676, -34546, -41968, -37881, -31635, -47478, -71466, -54441, -48552, -55396, -90421, -95155, -74348, -51507, -25508, -13773, -20746, -4747, -21721, -32266, -10909, -23634, -59279, -29465, -15250, 1652, -8830, -18525, -26056, -8944, -17852, -27397, 4918, -1652, -296, -12038, -24624, -39819, -61579, -85837, -102904, -86629, -87390, -69994, -37290, -29429, -1883, 6551, 6417, 6266, 5058, -9188, -247, 8603, -26405, -36161, -61211, -95159, -102695, -105049, -106311, -67420, -61173, -49590, -36723, -41895, -51069, -27874, -22605, -20969, -21304, -12374]
15777a2374j5356J763N851M60Q758J215j8445L2109K3675j6250j3203O397N399
15764I999j3227j5439k0650J0488l737M576k3226k0383p60j2666J7283R111k4267
15751h2898n901M2804P675n284K3915K252k0405J9118P712J916J7342k0080l2530
15738d4364j3466J4009j0048l0343K978K4095O333J9346L3810j0314n745J234
15726a2475o386k2409L0525L4539j0011j9305l1738q160j8932L524J2630j2772
15714f0970J2992l43K9204n284j6419j0432K2401j66k1699l037P811K485n737
15701d9194J7835K012J7515j3354L588j1066j086n981p833k745J685J4447L3759
15688d18j7620m4446j9860K1881J8889J6288o61k0500q246N530k210J6640K6511
$$ y = [-12374, -27730, -25967, -20116, -19656, -10898, -9683, -28128, 3981, 27656, 11406, -1797, 4600, 9999, -3228, -18667, -39317, -28829, -32566, -27990, -51216, -71599, -72359, -85025, -67742, -58631, -82898, -88799, -45995, -38320, -43604, -19689, -17437, -37842, -18724, -11012, -9096, 8246, -11834, -44364, -57830, -43821, -53869, -84212, -81234, -57139, -50806, -31460, 2350, -7964, -13709, -12475, -18861, -41270, -10745, 23794, 13783, -5522, -37260, -45420, -64352, -60828, -48198, -60970, -47978, -48321, -19117, -24401, -40820, -51252, -28851, -29017, -50716, -53753, -45942, -43457, -49194, -31359, -29347, -11832, -25186, -21598, -32664, -33750, -39731, -47564, -50309, -48624, -34177, -418, -18038, -62484, -82344, -60463, -41574, -25286, -25947, -46447, -54693, -49163, -51373, -34733, -8222]
15675h222J188j867J9479j1756l9291M813l868k5112O619r522K4899J7629J2290
15662a2721j4095m0372J1628J0615K1280L0810k071o519J135k526Q857k8609m1889
15649f4477k1561J4101K9089j4445P495K9902N666j0892K098j8723j7774M071
15637e5450L9501J1108r606j0919N923K0687J2344j5510j6124j4656J7034N111
15625a0557m4623k5613K583J2443j1089j133L6939J4239l565j6029P10J5915J3176
15612a6604j0823j3113j4505j538r243J0425J8349l583R450l934J0446k2950k123
15599d9746L7353L6537k179k5082m418J827O871k8870j6891M40l989q984j8606
15586g5737M920N966O941j905L210J7416k1707m874K8917Q586k0893j8713M2687
$$ y = [-8222, -7034, -8901, 10578, -1178, -40469, -35656, -39524, -64636, -58017, -67539, -42640, -25011, -12721, -26816, -67188, -55560, -44945, -23665, 7145, 5074, -1445, -310, -2836, 6021, -22588, -64477, -86038, -71937, -42848, -57293, -49798, -19896, -14230, -25122, -23024, -41747, -59521, -55450, -15949, -4841, -14447, -25366, -19443, 1244, 13588, -1922, -18046, -32702, -15668, -10557, -55180, -80793, -78210, -65767, -76856, -77989, -41050, -26811, -30376, -46405, -45695, -29780, -16604, -27427, -40540, -55045, -56583, -65826, -55401, -37052, -40635, -31185, -35119, -24673, -47623, -49746, -12393, 24144, 21965, -3117, -7535, -5708, 1163, -27707, -44598, -44158, -48147, -57131, -75737, -70817, -64851, -57910, -59815, -56605, -39189, -60896, -65770, -36853, -28267, -49160, -67873, -25186]
15573b5186K5709o91K7794N417m9935j7455J5334k937j4683j5221J1136n538J5755
15560c0501j0090K3095L3956j73j0194j221n589L683j8477l1237J9762J0721K9809
15547A3544l573k3091o11j5611j9251j3419j4284R953J9222L1995r899m362j97
15534b9584M7138M0787J7021J9800l0338j5609n345l0857k6960l761J1047L385
15522c276J169N417n497j4041k3686j5553K31K3815K6145O655o551K5023J3187
15509C3038j936l288m214J145J8445M630k2963l9087O115J3914k018j4768m36
15496a1423K0712j6529l5401j513J5354r99j0253p756j5973J4332K3514l979l933
15483c3847K1583k4153k7767J6973Q290m548q23K2567j330j2140l0924j7237l806
$$ y = [-25186, 523, -168, 27626, 33043, -16892, -34347, -19013, -21950, -36633, -51854, -40718, -46256, -30501, -40591, -17496, 16460, 16287, 6093, 4872, -717, 2966, -15511, -46748, -26986, -16265, 13544, 9971, -13120, -13731, -29342, -48593, -62012, -76296, -66343, -47121, -15126, -25025, -29387, -29584, 17554, 58341, 75362, 95162, 64824, 49215, 43870, 13013, -13947, -17708, -6661, -3276, -2107, 3310, -2187, -16228, -39914, -55467, -55236, -31421, -5276, 1379, -5172, 19851, 33038, 31102, 27814, 23600, 24745, 43190, 47820, 24857, -14230, -8115, 5799, 3781, -10987, -11423, 9289, -7240, -42641, -44154, -28800, -29799, -40052, -47808, -63781, -49449, -25935, -29914, -33847, -12264, -36417, -64184, -47211, -38921, -43469, -44292, -21725, -23055, -35195, -66119, -83356, -87162]
15470h7162K050K6507L4614P267R559j1947m2154N886L9379J1175J4916k272L22
15457H140l0430P793o881m055l543j3356K9323K8042o886k3387k306k553j4823
15444c4922k5560J052L6027L272j4393P472j0693k4181J0267K131O663K4798j353
15431a9420k0946l304j4004j4378n065j2406r749J958J5714p709J9146J4162L684
15418e2317r96j4945k342J7780j1765j0130p954j0230P814L0319N8567Q910o657
15405F054j6459l023K535j2130k2887m491R739o13R071r113j904k455j3789M136
15391e5329J9316L3341P704l7704l2177O022O092n743k9747Q178M9689j3578k4538
15378f8474r46k603l292J0356j2732O153j481K5986K4986k5505k2956k2178k222
$$ y = [-87162, -85112, -58605, -23991, -16724, -7165, -19112, -61266, -55380, -16001, -4826, 10090, 7818, 8140, -22290, -14497, -21378, -25433, -28976, -42332, -13009, 15033, 8147, -15240, -17546, -20099, -34922, -60482, -59430, -23403, -20131, -34524, -27052, -37745, -61926, -51659, -49528, -42865, -18067, -19420, -40366, -43670, -57674, -72052, -77117, -89523, -99272, -97314, -81600, -89309, -70163, -56001, -52317, -53313, -68258, -70600, -52820, -64585, -74715, -82669, -92899, -85085, -54766, 3801, 12711, 6054, -10405, -13428, -10893, -23023, -45910, -50401, -40662, -41275, -32204, -41317, -43221, -45676, -59465, -55329, -36013, -2672, 5032, -32672, -64849, -58827, -52735, -58478, -88225, -80047, -30358, -43936, -68474, -69420, -72023, -75315, -64959, -77691, -71538, -73019, -47033, -22047, -47552, -70508, -92686, -94908]
15365i4908P283P762j798Q508L202p790j2132Q686N979l906L1950L5619l0060
15352d1605j6152J3856J698K5336J1393k5712j7264N267p106k1553N470n963q298
15339h0633O472J7397R419j0673J3951k0072o791j943k245K3966J4635q144l5697
15326h0358l0439O40L1139K0103M69k48K0342P15p45Q057J0700k8543N730n754
15312d8192P234J0178J659q033n419L6268J4836q066O460J6902k2862O231j5050
15299g854k1115J7068r349K261j0548k6432J1018J413j7067n067L4454J1242m341
15286b4317R627j0751l471Q473J7153L91o347j0022N237M808L8103J2978k9890
15273A1972m2850k4616j413j0444j4428k500K025M918J8362K0958P494j2732J6924
$$ y = [-94908, -87625, -79863, -81661, -73153, -69951, -77741, -89873, -81187, -75208, -79114, -47164, -11545, -41605, -57757, -43901, -42203, -16867, -5474, -31186, -48450, -43183, -50289, -71842, -66372, -72335, -80633, -74161, -56764, -47345, -58018, -44067, -64139, -70930, -72873, -75118, -51152, -36517, -44661, -80358, -110797, -110157, -79018, -58915, -58446, -58694, -38352, -37637, -38382, -30325, -19625, -48168, -42438, -48192, -40958, -30780, -29121, -37154, -42573, -6305, 8531, 465, 6925, 23827, 965, 7196, -7854, -28969, -11901, -21250, -18989, -29537, -55969, -44951, -43538, -60605, -65672, -31218, -19976, -24317, -14690, -25441, -28912, -20439, -3286, -2895, -9242, -19264, -14027, -9219, 28884, 41862, 11972, -30878, -55494, -56907, -67351, -81779, -84279, -82254, -77336, -58974, -38016, -30522, -43254, -26330]
15260b6330K0739j8451j4577J0503O046L0902m826l2982j9476K5367J0729l06
15248a2662J427J022K0089n499k0451k1875n293O433m633k8841o650K6387K9283
15235b1263K1993K1093K089l1649j2107J2128K5329j6718k6764J2511j984j5186
15223c0528k5557K771J7600J8732K1718L445N104j7263l4354J213J18J3091R124
15210a4786J9967N798j1409J3130l560j2424j3780o749M817r054J942J449N717
15197a8942N145j5420Q491k2703J1996o061k3993j368o419J5502K3008P702K384
15184b0678k685K1223J1818j6113j3946m498l477P265J7595k4335r763l5971N995
15171f7570L702j8429j2221J7893J4068K0083j5081J1004k3159j7283J152l419
$$ y = [-26330, -5591, -24042, -38619, -28116, -22070, 8832, 4006, -28976, -48452, -23085, -12356, -12662, -11235, -10213, 9876, 4377, -16074, -37949, -43242, -36809, -41442, -70283, -76933, -50546, -21263, 730, 21823, 23912, -7737, -19844, -7716, 17613, 895, -25869, -13358, -15342, -30528, -56085, -53314, -35714, -16982, 4736, 8181, 13285, -3978, -38332, -37119, -37001, -23910, -14786, 5181, 10979, -430, 12700, 9140, -3284, -17064, -23813, -18996, -28050, -26108, -24659, -18942, -13797, -29217, -20726, -43429, -31433, -37494, -61487, -62855, -69274, -53772, -30764, -23062, -20678, -23363, -2140, 9678, -6435, -20381, -24879, -28356, -21091, -3496, -27831, -37594, -73565, -67570, -63868, -82297, -94518, -76625, -62557, -42474, -57555, -46551, -69710, -86993, -85841, -89260]
15159h9260j4941l632J8273K1293K7927L8318K6006j0796j3418k5311R364n615
15147b1792m0531J226K7606j0580L365k0438P300L1893j882J9670j7987J5867
15135f283l476l902o335J946L840n411p423J3987N995J3447j248k0369n237L3605
15121A3136n040j3799P471N508j5800J1129p295J938K786j0869l4957J0417R275
15108b6100L3381J632Q440j723N1l094j9117J3091J0636j8242j2753O255m168
15095a1711m321k4373k6015q967K8217K7562K5996M354j0429J1444K8558j4264
15083B6051m635j1731L00j4808k0804K9916L353j2297p555j9398J3177K3119P739
15070A2427j0198k5557R3l726j6539J6463J4472K484r704q468M186j3201J6659
$$ y = [-89260, -104201, -107833, -89560, -68267, -40340, -2022, 23984, 13188, -230, -25541, -16177, -21792, -62323, -61097, -33491, -44071, -40706, -61144, -53844, -21951, -23833, -4163, -22150, -6283, -9759, -13661, -19996, -18050, -14210, -19621, -27044, -13057, -7062, 6385, 5137, -15232, -20469, 13136, 8096, -5703, 1768, 7276, -8524, 2605, -4690, -2752, 34, -10835, -45792, -35375, -26100, 7281, 8913, 17353, 15630, 15681, 12587, -6530, 6561, 17197, -1045, -13798, -7543, -11711, -16032, -40405, -66420, -75387, -47170, -19608, 6388, 10742, 313, 11757, 40315, 26051, 21416, 9685, 9985, -4823, -25627, 4289, 7642, -4655, -12210, -31608, -18431, 4688, 12427, 2229, -23328, -23235, -26961, -43500, -27037, -12565, -10081, -19785, -28253, -24067, -37268, -20609]
15057b0609p470j4876K1032Q590J6069J3039k892l2923R633K0024J5176O440k4137
15044G096k8418L743N717m385m670p078p46K2447M035k9501q066L4462L2960J2613
15030D0209l6419L556k070J1466P232j9987K643l370j2434J7182J9764k9942k9346
15017c1516L7120L2904j2343n053Q219J2872J7348J2647q58L3516r171J0758J4678
15004A21121N820J5484R549J9821M1734L2521K2512K1880K8563N1552J1301J7367
14992C99225L9711O7888N0321L7080L3032P7189J07902J44251K35922L32718M21777
14981A947016N72335P97644J281033K132361L334253M484796M890064K540582
14973B1980084k67445o39232o48757k849476m402182l744278k441292j450376
$$ y = [-20609, -28079, -42955, -21923, -13333, 2736, 15775, 12883, -20040, -10407, 9617, 24793, 31233, 7096, -21322, -17579, -11862, -16247, -20917, -27995, -28741, -6294, -2259, -31760, -39826, -5364, 27596, 40209, 3790, 7346, 5276, 16742, 23974, 3987, 6630, 3260, -9174, 8008, 27772, -2170, -31516, 5604, 38508, 26165, 21112, 29331, 42203, 59551, 72198, 71340, 104856, 95685, 106443, 121121, 126941, 142425, 151974, 171795, 213529, 246050, 268562, 290442, 319005, 370557, 381858, 399225, 438936, 506824, 557145, 594225, 627257, 704446, 812348, 956599, 1192521, 1525239, 1947016, 2519351, 3316995, 4598028, 6730389, 10064642, 14549438, 19439502, 21980084, 21712639, 21073407, 20424650, 17575174, 13172992, 9428714, 6987422, 5537046]
14965E537046j001473p41431n60632m32300l37431k61884k02331k07160j65588
14956A626816j16608r9091r8817j10775q2573o0028o0457n4685m3724m0454n8171
14945H01433l8644m8309o5524n1638l5641j9088j0150j4207l5345l5785l3803
14934D13299k0240j3163l4164r534J1830j057j9449j1207j3497k9388j0739j1455
14922B51236J821J628M10l7568l0035J7951J013j5845j3631J5119J0537k6336
14910A76300k1129j4051j0544J1484O940J0646N180j4608l2089l5792j4876q35
14898F6626q452k0535p98k62l1085n935K1382O796O426P470r893j7304K1817J5447
14884E1700j815m1336q959K4773k8136k3352P16n308p858J0270J7462J6311m536
$$ y = [5537046, 4535573, 3794142, 3233510, 2801210, 2463779, 2201895, 1999564, 1792404, 1626816, 1510208, 1411117, 1312300, 1201525, 1118952, 1058924, 998467, 943782, 900058, 859604, 801433, 762789, 714480, 648956, 597318, 561677, 542589, 532439, 518232, 482887, 447102, 413299, 393059, 379896, 345732, 336198, 348028, 346971, 327522, 316315, 302818, 273430, 262691, 251236, 253057, 254685, 255095, 217527, 187492, 205443, 206456, 190611, 176980, 192099, 202636, 176300, 155171, 141120, 130576, 142060, 149000, 159646, 164826, 150218, 118129, 82337, 67461, 66626, 58174, 37639, 36841, 36579, 5494, -441, 20941, 27737, 34163, 41633, 31740, 14436, 36253, 51700, 49885, 8549, -410, 24363, -3773, -27125, -26409, -31717, -39575, -29305, -11843, 4468, -68]
14871f8n427P388J8538q319l4603l901R096J2085J5068K2018J6165m2065j4526
14858h551N933j1422J3363L2138j3r162n565k9235j3378M728j7451m1266K2503
14845e7378K7875J2048q846K3504L905J8449j339k563m718o238j3925l8962K1680
14832b6508K4382J1128k5101j9548k21n971j669j4296j2530j688k066J501J8945
14819e3642L9280J0380k5042J9175r519k5326M73L870K4299J6222k9956k5144
14807e4930j366O773J701m022K5115K7060m3983j7998J3216L3756L6962P745J808
14794C1837k9005j6552J9138J8P574J2278Q302k8332k5773p717O836J3771j0499
14781a8124j1253Q939J0931j9408j9674L0912M6381j0752r518j008j4753j3717
$$ y = [-68, -5495, 1893, 20431, 12112, -22491, -26392, -17296, -5211, 9857, 31875, 48040, 5975, -8551, -2618, -14040, -677, 31461, 31448, 22286, 16721, -12514, -25892, -21164, -38615, -79881, -57378, -29503, -17455, -26301, -2797, 1108, 19557, 18218, 15655, 10937, 4699, -9226, -48188, -26508, -2126, 9002, -16099, -35647, -35868, -41839, -43508, -57804, -70334, -72022, -74088, -72587, -53642, -14362, -3982, -29024, -9849, -19368, -44694, -44221, -40351, -16052, 170, -29786, -54930, -56296, -49523, -47822, -51844, -26729, 331, -43652, -61650, -48434, -14678, 22284, 30029, 31837, 2832, -13720, 5418, 5436, 13010, 25288, 33590, 5258, -20515, -28232, -21396, -7625, -18124, -29377, -20438, -9507, -28915, -48589, -17677, 28704, 17952, 8434, 7426, -7327, -21044]
14769b1044Q736j155j2853k138M06p894J5340J0246J9430M321m1673k5409j6980
14756g0667J3813L9935K885p674J074K6190K3419j7879o866q578P600J6154l2841
14743a3435j4384r565k6613O080M066J1936J7683j3055k1394K0009K2912j839
14731a7599k1575o071N642j2676J7065K3525L007J7918k709j3385J4658j7724
14719i924p340k2152r757J0437R508J7523j6938j4648k1346q50r859K9461K2671
14706b3214j4738R284J563n750j0329J6672L2234j1013j4363k1904k1013J3365
14694d9206L367K0587J3580j3876J2934K362l855R265L503L1418Q137j6324j1203
14681A0689j8794j5885j4292L009J8115l4936n178J5010K037K014k0873p714K5288
$$ y = [-21044, -12308, -13463, -26316, -28454, -28048, -35942, -20602, -10356, 9074, 13395, -28278, -53687, -70667, -56854, -16919, -14034, -21708, -20634, 5556, 28975, 11096, 4230, -4348, 3252, 19406, -13435, -27819, -37384, -63997, -57917, -53851, -41915, -24232, -37287, -58681, -38672, -15760, -17599, -39174, -45245, -39603, -52279, -35214, -11689, -8682, 9236, 6527, -6858, 7800, -9924, -17264, -39416, -49173, -38736, -29228, -11705, -28643, -43291, -64637, -65487, -75346, -45885, -23214, -37952, -28668, -27105, -32855, -43184, -26512, 5722, -5291, -19654, -41558, -62571, -49206, -45839, -25252, -11672, -25548, -12614, -10252, -14107, -4842, -1339, 30079, 38216, 21892, 10689, -8105, -23990, -38282, -35273, -17158, -52094, -57272, -42262, -40225, -38211, -59084, -66798, -41510]
14668d1510j293K1748K2196j123k8209o85J1368j7249l591j0963J2680J3692J9996
14655b943m659k9243j0289l581Q847j890L145J6350L8383J6087k3267J0524J2533
14642B9997O6j6704n432J967k2428n465K0825o432n527m411Q599L263j2099j8382
14628c2163j4967J4794r642j5829J483K3500J2096J5937J024k6284k6125R910
14616d6266l3423J9231M9760K6246L0867K0791j5220k7693j5216k1042l0329j1131
14604e3425K9354M9157J2481n1370m5396K0366K6417K6029M476p784k0603J5124
14592D826O920j0372J441M019j5594J4544J2307l874q397j4668O286j8083j1759
14579c2404j0399J2185k3729j350K4239J4236n861k328K6639J5835O791k3349
$$ y = [-41510, -42803, -21055, 1141, 18, -28191, -28876, -17508, -34757, -38348, -49311, -36631, -22939, -2943, -7602, -36845, -47134, -50715, -41868, -43758, -40613, -24263, 14120, 30207, 6940, 17464, 29997, 30063, 13359, 7927, 9894, -12534, -17999, 2826, -3606, -9133, -13544, -4945, -1682, -13781, -32163, -47130, -32336, -41978, -57807, -56324, -32824, -20728, -4791, -3767, -30051, -56176, -46266, -79689, -60458, -10698, 15548, 46415, 67206, 51986, 24293, 9077, -11965, -42294, -53425, -24071, 25086, 37567, -13803, -59199, -38833, -12416, 13613, 18089, 10305, -10298, 4826, 11746, 1374, 2815, 6834, -8760, 5784, 18091, 14217, 5820, -8848, -2562, -20645, -32404, -42803, -30618, -54347, -55697, -31458, -17222, -23083, -25411, 1228, 17063, 23854, 505]
14567E05p371N742K5238k596l4179n033k6975R275J4320n444K7305J5809J0148
14554B6744J2853m233n033J3969P570K966L311J872K1908J2129j9623k6228J9007
14541F7212Q582r550q832J3417m583k2939k0871j060J3567K0905l9700j4436j3118
14528a1406n807l492J102R312J0062n427m018P669p65Q808K0928n856j789K57
14514A9578J3872p834j8815Q358L1882j3430l2801q171M12k3215L885N060j9782
14501d1001j4535K7958L6707j1554q202j0317L315J4658k0098J7062j2775J1707
14489g075L52J3453l95l7507J790K0224j2061n737j232N126J7738Q818o89l5149
14475c2344k4663J3103J4198L884n791j5247K587M288R419J4483N804j5338n643
$$ y = [505, -6866, -1124, 24114, 21518, -12661, -17694, -44669, -35394, -21074, -26518, 787, 16596, 26744, 39597, 35364, 30331, 44300, 51870, 54836, 58147, 60019, 81927, 94056, 74433, 48205, 67212, 75794, 66244, 57412, 70829, 66246, 43307, 22436, 21376, 34943, 55848, 16148, 1712, -11406, -17213, -20705, -19603, -10291, -229, -5656, -9674, -2005, -2770, 6038, 26966, 21110, 19321, 19578, 33450, 25616, 6801, 15159, 47041, 33611, 810, -7361, -6949, -30164, -26279, -21219, -41001, -55536, -27578, 9129, -2425, -10627, -20944, -17629, -2971, -23069, -6007, -18782, -7075, -6723, 6730, 6335, -31172, -29382, -9158, -21219, -26956, -28188, -23062, -5324, 3494, 2805, -32344, -57007, -43904, -29706, -25822, -31613, -46860, -44273, -39985, -30566, -16083, -10279, -25617, -31260]
14462c1260j2873J8951O10k1232J4603M538J2634j7733p970k6839k8522J7615
14450g7478K4041K9498L0373j6439P49K947j0080n030K7025J5897k5288k0384
14438b4169j2369J5868M598j4494J7219k134k4157k863J130L2317J604r938j5994
14425c3382O040P034l993Q742J7994j7195k7885k40m897J3798j819j1954o616
14412e4373K7043M2273J8366K8078K9203J5336K907k2680j7069p367j0821l2304
14400A8592k4705k0861j0294P506J6311j5926M38r065k1746Q373L3781J4678K0072
14387A7154m0377J363J977K4101J4597k1586k5065J35Q294J3035N046l2896l889
14374c8111R310J747l0950j1568L3770k239J0423K777j8704q61J43L6931Q298
$$ y = [-31260, -44133, -25182, -24572, -45804, -31201, -26663, -14029, -31762, -39732, -66571, -95093, -77478, -53437, -23939, 6434, -10005, -9256, -6309, -16389, -21419, 5606, 21503, -3785, -24169, -36538, -20670, -16072, -30566, -13347, -15481, -39638, -42501, -41371, -9054, -7450, -17388, -33382, -27342, -20308, -24301, -15559, 2435, -14760, -42645, -42885, -47782, -33984, -35803, -47757, -54373, -27330, 14943, 33309, 61387, 90590, 105926, 108833, 86153, 69084, 61717, 50896, 18592, -6113, -26974, -37268, -29762, -13451, -29377, -28939, -38004, -59750, -51377, -17596, -2918, 17154, -23223, -21860, -19883, 4218, 18815, -2771, -27836, -27701, -19407, -6372, -1326, -34222, -38111, -28801, -27054, -58004, -69572, -35802, -38041, -27618, -24841, -43545, -44406, -44263, -7332, 966]
14361I66k960O130P471j017j1469j6616o546K6220m77k3468j5421k3469M288O795
14347d9573j7070J1268J0206L042J7942M099J2594o602q839J3935k6941q794R211
14334c5522p496j8808k9999O000L1901J2545J4654M899j0154j3385L350N729J5199
14321b1087j9312q071N63R406K7189O629j0664K337l217P646J5402j6072m0189
14308d9440j3368M2444K6287j7126n0435j2631K8449J3475k8204O041K3621M635
14296b6252l0026J1113k3547p251Q262m122L7184K9243L308J1353q859L920N653
14283I979K3806n41k2932j0364J936j7504l1374j0134N072P828J0474K505P772
14270b3477L237J5998O441p127K1697J0655K8229p692l9908m6443R51p186O778
$$ y = [966, -1994, 4136, 11607, 10590, -879, -17495, -24041, 2179, 1702, -21766, -37187, -60656, -56368, -49573, -66643, -55375, -45169, -42127, -24185, -20086, -7492, -14094, -22933, -8998, -35939, -44733, -35522, -43018, -61826, -91825, -85825, -53924, -41379, -26725, -21826, -31980, -45365, -42015, -36286, -21087, -40399, -48470, -47907, -38501, -11312, -4683, -15347, -13010, -16227, -8581, 6821, -9251, -49440, -62808, -20364, 5923, -11203, -61638, -74269, -45820, -32345, -60549, -54508, -30887, -26252, -56278, -45165, -68712, -75963, -67701, -71823, -34639, -5396, -2088, 9265, 406, 4326, 9979, 33785, 33244, 10312, -52, 1884, -15620, -46994, -57128, -52056, -44228, -33754, -31249, -23477, -20240, -4242, 2199, -4928, 16769, 27424, 55653, 47961, 8053, -38390, -37439, -44625, -37847]
14257c7847L688m73k530K627p79J2462R200R325K1576k0788j4926p214L1369p908
14243b218j0329J321K4403M5125M946p67O480M732O581N526l470K4750M5722N4749
14229B07551N092r991l179J9911O7645K0348K8167M9161O4903P1331J02132J57208
14217G80279J42805J72740J81855J55259J32758J34940J27945Q2791O3889O2085
14207B037346N4801L1414R2k4375l3214m3136q0404q9025j45357j67645j49794
14196A390703j42526j41419j22200j37951r1221p4901j01352j07985q0718l1270
14186C59160j0055j3062j3390k065k4877j2366R088l6593l5169O09R917l2861
14174A98336k2215m3473m1411m169k1556j5226k0209j0846R573M7961K5307j190
$$ y = [-37847, -34159, -34632, -37162, -34535, -35314, -22852, -13652, -4327, 17249, -3539, -18465, -25679, 5690, -2218, -12547, -11226, 13177, 58302, 63248, 62481, 68961, 73693, 80274, 85800, 82330, 107080, 152802, 207551, 212643, 202652, 199473, 219384, 287029, 307377, 335544, 384705, 449608, 520939, 623071, 780279, 923084, 1095824, 1277679, 1432938, 1565696, 1700636, 1828581, 1911372, 1975261, 2037346, 2092147, 2123561, 2123653, 2099278, 2066064, 2022928, 1942524, 1853499, 1708142, 1540497, 1390703, 1248177, 1106758, 984558, 846607, 755386, 680485, 579133, 471148, 390430, 359160, 349105, 336043, 322653, 320588, 295711, 283345, 292433, 255840, 220671, 221280, 231197, 198336, 176121, 132648, 91237, 87068, 65512, 50286, 30077, 19231, 28804, 76765, 102072, 100882]
14162A00882k7606k0099J8861p958k2593n068K4665j3490j1051l534k7058n461
14150D90J8059J5030o185j7530n550j2139j2714J00M190J0343J0997R480K6548
14137D1119P749j6440o105j382K1757j5126j0997P888L867j3466k0435j4862J1089
14124e344n370M127q820N102J6993K817J0692j4911j2658l4204n058L728j1697
14111e4603K5127J8623J610j6274j4478Q138M280j4319k4869O296K7228j832j0876
14098d5949k5553j1945K1497L7791o393J2072n015m5837k8777L0911M751L7076
14086b5371K8284j305j0213o395K4161M524k3971k8016k0427K8088M3542P884
14074B0785j6248l6900l3200J0741o94o528J2204L3329J1445j5266l883o680q829
$$ y = [100882, 73276, 53177, 72038, 64080, 41487, 36419, 61084, 47594, 36543, 33009, 5951, 490, 18549, 33579, 27394, 9864, 4314, -7825, -20539, -20439, -16249, -5906, 5091, 14571, 41119, 48868, 32428, 26323, 24941, 46698, 31572, 20575, 28463, 32330, 18864, -1571, -16433, -5344, -10714, -6587, -15407, -10305, 6688, 9505, 20197, 5286, -7372, -41576, -46634, -42906, -54603, -29476, -10853, -9243, -25517, -39995, -31857, -27577, -41896, -66765, -60469, -33241, -35073, -45949, -71502, -83447, -61950, -24159, -30552, -18480, -23495, -69332, -98109, -67198, -62447, -25371, 2913, 1608, -8605, -15000, 9161, 13685, -10286, -38302, -58729, -30641, 12901, 20785, 4537, -32363, -65563, -54822, -55516, -62044, -49840, -16511, -5066, -20332, -24215, -30895, -39724]
14061c9724J348O191J0061K3186k71n953k753j677K3561J2447J4040n968l4558
14048g0l3729j7890R607K1796q751j9236J6843Q985l168M987O592k2634l5882
14035g2550q808L5448M2646K1892M192k8889Q773j6181l1703p544p656k667l38
14022f3385R975L3444L3353J526L4349J566k0058l2089q695J8721K2061j158j2136
14009A7474j9237k6385K018J0412J0239K3863L924J706l1252j1271J0823o658
13997a4344m1009K0221P801j0125J2975J9197p771q358M859J3946k1722l4988
13985e9318k1821L5006K6132L297K6024K093k0042L7283L3828O42K4014L6700
13973A23838J3200j2332J0782L9454o081j4913j4573j4461J944k8352l6655j1548
$$ y = [-39724, -38376, -32185, -22124, 1062, 791, -5162, -7915, -9592, 13969, 26416, 40456, 34488, -70, -33799, -51689, -42082, -20286, -29037, -48273, -31430, -22445, -25613, -20626, -14034, -36668, -72550, -81358, -45910, -3264, 18628, 22820, -6069, 2704, -13477, -45180, -52724, -60380, -63047, -63385, -53410, -19966, 13387, 14913, 49262, 50828, 30770, -1319, -10014, 8707, 30768, 29610, 17474, -1763, -28148, -26130, -15718, -5479, 18384, 22308, 24014, -7238, -18509, -7686, -14344, -55353, -35132, -27331, -37456, -24481, -5284, -13055, -21413, -16554, -2608, -24330, -59318, -81139, -46133, -20001, -16704, 9320, 11413, -8629, 28654, 62482, 63124, 87138, 123838, 137038, 124706, 135488, 174942, 168861, 153948, 139375, 124914, 126858, 98506, 61851, 50303]
13961E0303J6594k1351j2275l072p472n2635k2953M496o844J0047L9063K8710
13949B2611l8341l4333N325L3503K1504r192j4959L149J1937M355Q895N146j0758
13936H842m824J0324J9469j5244j6680J5317L1174J7491K6589j6448k5899M649
13924E4760O410J2850J344L922k1508K0709n682J476k2476q01P995p396O58J7805
13910G0066J9463j9263j1401o558j6647l646o842j5406q070q744j4091m16L3342
13897A1787q979k2940p623K9242R194m754K2537l566L14m815k1270j5440K3879
13884G566J4294l3010q875J4219j0387j5070r121o502K9525J4248N957k8688k1824
13871d7668O181O975j029N6J1303R610K3118k5813j2714K1698p840O956j2275
$$ y = [50303, 66897, 45546, 33271, 30199, 22727, -29908, -52861, -48365, -55209, -45162, -6099, 22611, -15730, -50063, -44738, -11235, 10269, 1077, -13882, -10733, 1204, 5559, 14454, 19600, 8842, 4018, 14342, 33811, 18567, 1887, 17204, 48378, 65869, 92458, 76010, 50111, 54760, 61170, 74020, 75364, 79286, 57778, 78487, 72805, 74281, 51805, 51004, 58999, 51603, 52261, 70066, 89529, 70266, 58865, 52307, 35660, 32014, 25172, 9766, 1696, -7048, -21139, -21555, 11787, 2808, -20132, -27755, 1487, 10681, 5927, 28464, 24898, 25212, 20397, -873, -16313, 7566, 21860, -11150, -20025, -5806, -16193, -31263, -40384, -46886, -17361, -3113, 2844, -25844, -47668, -41487, -34512, -35541, -35485, -24182, -14572, 8546, -17267, -29981, -8283, -16123, -9167, -21442]
13858b1442J0166K5858J5625R073M052l4658K0524L1119o277k783k7244l7893
13846a3880k8875J2600J7217J8629N711j2710P874j2584o520J0827j3247k1129
13834c6087J0508K0921j947L277P982P78n828k9725K2404L5833P983j7269p860
13821A0970m558J934j7193J551L6510K2357j4418k5540j5724p350J2572j5861
13809a4750j4674J3454L982l5081n797Q063M2138o012o218r546K639k0202k611
13796d4615L970J8678J69R142j6903M1529M936j8895j5014K4004k2365j6599M814
13783b7149K4528K8491o954l089j1332k3528L264j869k8823n64m147k057M1797
13770a1432J7952R001O977K396k3780k6471m3L524j873J7146J3474O125j5746
$$ y = [-21442, -11276, 14582, 30207, 39280, 43332, 8674, 29198, 60317, 54040, 51257, 24013, -13880, -42755, -30155, -12938, 5691, 11402, -1308, 6566, -6018, -12538, -1711, -14958, -36087, -25579, -4658, -6605, -3328, 4654, 5432, -396, -30121, -7717, 28116, 36099, 18830, 10970, 6412, 8346, -8847, -7296, 29214, 51571, 37153, 11613, -4111, -11461, 1111, -14750, -29424, -15970, -11988, -47069, -52866, -44803, -2665, -8677, -14895, -24441, -21802, -42004, -44615, -40645, -21967, -21798, -12656, -29559, 11970, 16906, -1989, -17003, 7001, -15364, -31963, -27149, -2621, 25870, 18916, 15827, 4495, -19033, -15769, -17638, -46461, -47025, -51172, -53229, -11432, 6520, 15521, 22498, 24894, 1114, -25357, -25400, -21876, -23749, -6603, 6871, 12996, -2750]
13757b750J1644K0786j51J2672j4832p484J7976p136J2686P609j7790Q980m635
13744C7575o356j8921p529j6789r848J3183J3706P59K1861L8923j7503l8063M824
13731A5822K5911J3641j7964j6951J4862j167l074j1577j4430o349M486m251J8801
13718A7760J8742l7727O687K3363j0912j7248J2656j2184j775j0734l7929q129
13706e7430L6906J1907M346m709K2845r78j7817M324K3726J4244J1589o369l1811
13693A0773k148q672L622r191K905J7237J3789J2475N430j3820m1288k2144N728
13680b5304J5086M578k219n038J4324l1626j7070M5064K7624K1555j2068o258
13668B8648m119L0602o647ll8986K434J4681J0697j3904l1328O270K8612l201
$$ y = [-2750, 8894, 29680, 29529, 42201, 27369, 19885, 37861, 30725, 43411, 51020, 33230, 42210, 37575, 31219, 12298, 4769, -12020, -21868, -8685, 5021, 5780, 27641, 66564, 49061, 10998, 15822, 41733, 55374, 37410, 20459, 35321, 34154, 31080, 19503, 5073, -1276, 3210, -1041, 17760, 36502, -1225, 5462, 28825, 17913, 665, 13321, 1137, -638, -11372, -49301, -57430, -20524, -8617, -4271, -8980, 13865, 12887, -4930, -606, 23120, 37364, 48953, 42584, 10773, 8625, -47, 3575, -5616, -2711, 14526, 28315, 40790, 46220, 32400, -8888, -31032, -25304, -10218, -5640, -7859, -12897, 1427, -30199, -47269, -2205, 25419, 46974, 34906, 28648, 24529, 55131, 48484, 48481, 9495, 11929, 26610, 37307, 23403, -7925, -1655, 26957, 23756]
13655B3756J8933m929q842m183O413J5279K331j5623J6292R434k4102n105j2288
13642A7366n735k4997J6799K7072J7474o695r244n650j2828J8477P49J0683j185
13629D2286J730M2401L4741P166j3479m974j1263Q29k3469K6653K0011k297J1740
13616A32075J0466j6491M386j3290L272J3661L8922K4803O044l6009k7662k7022
13604A13155k0723K9693K3572k7105l3124l693J0765p747m728J3823O114M774
13592A04776P895j3663K866K002M5006J4266n9383l6114L6826M4639k0139k598
13580A26379L605O099j5963j0519L417p09J1467N94J683K553J5184n152M716J2386
13566A55740J4496j3088r733L1429K2256K1479J7825J5497K6630L1501L1773R56
$$ y = [23756, 42689, 37760, 28918, 24735, 31148, 46427, 48758, 33135, 49427, 58861, 34759, 29654, 17366, 11631, -13366, 3433, 30505, 47979, 41284, 32040, 26390, 13562, 32039, 32788, 43471, 42286, 44016, 86417, 121158, 128324, 114845, 109871, 98608, 99437, 75968, 102621, 122632, 120335, 132075, 142541, 126050, 130436, 117146, 120418, 134079, 173001, 197804, 203848, 167839, 140177, 113155, 92432, 122125, 145697, 118592, 85468, 81775, 92540, 84793, 80065, 93888, 100002, 104776, 112671, 99008, 101874, 103876, 148882, 163148, 103765, 67651, 104477, 149116, 128977, 126379, 129984, 136083, 120120, 109601, 113018, 112309, 123776, 124370, 126053, 128606, 143790, 138638, 143354, 155740, 170236, 157148, 147415, 178844, 201100, 222579, 240404, 255901, 282531, 314032, 345805, 346761]
13554C46761J6738K1520J7161J8772K496r953J3060J5823k1039p2205n3638j9074
13542B76422l3756j3387q1m074K484j5774j3729l2323m4928j5037L932L7352M0183
13529A87284j0385k233O114j5142j6724k417p217l22O470l129m3J6252K646J6617
13515A77771k9920l6103l7634o042K4201K813P324J3822P754J6854P212r727K746
13502A41071n274r409k940j5368j9842j0346Q184J2389J93K075j4379p296J3706
13489I2764K471m0065J5313J9939P772K3384L4814K9636R459j1452k8870j4198
13477A40967o799j1409K4163O02k3949l0473n90J6904k3933j3987m9568k4214
13465b286K7463K8303K7950K1783J4036n168j3424r833j3030J0801K6127J84j0395
$$ y = [346761, 363499, 385019, 402180, 420952, 423448, 413495, 426555, 442378, 421339, 349134, 295496, 276422, 242666, 229279, 229198, 225124, 227608, 211834, 198105, 165782, 120854, 105817, 109749, 147101, 187284, 176899, 174666, 180780, 165638, 148914, 146497, 139280, 138958, 145428, 142299, 142256, 158508, 161154, 177771, 147851, 111748, 74114, 68072, 92273, 95086, 102410, 116232, 123986, 140840, 148052, 138325, 141071, 135797, 126388, 123448, 108080, 88238, 77892, 86076, 98465, 98658, 100733, 86354, 79058, 92764, 95235, 55170, 70483, 90422, 98194, 121578, 156392, 186028, 195487, 184035, 155165, 140967, 134168, 122759, 146922, 147524, 123575, 93102, 92512, 109416, 85483, 71496, 21928, -2286, 25177, 53480, 81430, 103213, 117249, 112081, 98657, 88824, 75794, 86595, 112722, 112906, 102511]
13452A02511k1530j4567r05J2707j425k454k778r428l125J1071J2396j4677P206
13439G5002L0370O960k0811o479j3708j8612m463J4095r484j4113J0046p584p035
13426C4184J4505J7963J9315l5033l813K7115R477l853j5317N03k2523j6184r327
13413A7012N11K532J0494M015q513J3218K7987L2323K0231j1251m7873j7860j5985
13400B6841O783j9866j3691J3312L448K242Q274J5020j189l9281j7884J3971L4934
13387C2914R311q844k2157m5O587j7800j6354J6480J4459j3218p77R467M641J1896
13373B6560j0124l6187k402k3930j9265J3043M0531J3771J952M4422L5856p375
13361G6852l8463l0249K47K6526J4570m998n801K5685M4179J2074K1016L8565
$$ y = [102511, 80981, 66414, 65509, 78216, 76791, 74337, 71559, 62131, 59006, 70077, 82473, 67796, 75002, 105372, 112332, 91521, 85042, 71334, 52722, 48259, 62354, 52870, 38757, 48803, 41219, 34184, 48689, 66652, 85967, 50934, 47121, 74236, 83713, 79860, 64543, 65046, 42523, 26339, 17012, 17523, 20055, 30549, 34564, 26051, 39269, 67256, 99579, 119810, 108559, 60686, 42826, 26841, 33624, 13758, 67, 13379, 16827, 19069, 27343, 42363, 41174, 1893, -15991, -2020, 32914, 42225, 33381, 11224, 11179, 17766, -34, -16388, 92, 14551, 1333, 556, 10023, 14664, 26560, 16436, -19751, -22153, -46083, -65348, -52305, -11774, 1997, 3949, 48371, 84227, 76852, 38389, 8140, 8387, 34913, 49483, 44485, 38684, 64369, 108548, 120622, 141638, 180203]
13349A80203K0898M7890P2228L4323K0668J4245k9040m9045k7494k4830m7000
13338B13046k8946m6433l2861j2838L064j0814k2563j9808K1530J2517m129L342
13326G5107K107j5870O166K6083m511m5411m1909j5486K4287M1829J6013r944
13314E8461O699N184k5735j0516j2529j4222j7324J1649O891M136J0635L2344
13302E5673J1756k3500j9648j0386L805l3361j67q254j3906M472j1281M695L6252
13289c850P324n6013J0789J3695K5844L4772o003j2522o286n308J6553n497p612
13276E886J0925p503P341p41k5035P454J3944J9629P249J3108j8422j165j069
13263C1601M437J681k8256J8437j8563l2660j9322l702Q922J8310K8198K219n715
$$ y = [180203, 201101, 248991, 321219, 355542, 376210, 390455, 361415, 312370, 284876, 260046, 213046, 184100, 137667, 104806, 91968, 95032, 84218, 61655, 41847, 63377, 75894, 71765, 75107, 77214, 61344, 67510, 93593, 89082, 43671, 1762, -13724, 10563, 52392, 68405, 58461, 65160, 70344, 44609, 34093, 21564, 7342, -9982, 1667, 8558, 12694, 23329, 55673, 67429, 43929, 24281, 13895, 17700, -15661, -15828, -24082, -37988, -33516, -44797, -40102, -3850, 3474, -52539, -41750, -28055, -2211, 32561, 26558, 14036, 7750, 2442, 18995, 13498, 5886, 16811, 9308, 16649, 15908, -9127, -1673, 12271, 31900, 39149, 52257, 33835, 32670, 31601, 36038, 37719, 9463, 27900, 9337, -23323, -42645, -46347, -37425, -19115, 9083, 11302, 5587]
13250E587J5569J1462m995l1021O794K6176l4606k1058p510K2219K771N66L0428
13237B2382K5933j7624M268L6945j7694O756l127j9934k0126J4782K4997K8630
13225H6188k135k7412j3144J0161K5983n295K2324K17m2051l9724m625Q510R064
13212B8061Q557J3103l903j7516M632J6476o199l354o88K6790j6702j7634K6953
13199E8576K5517m035L858k9653R059J5330k4975l858J6547j0932p114J4214j2535
13186D9999k2652N178r277N170J3859r61j1044N166q831n411o5J9557r463o089
13172B5136K409j3645p39J2251J2544m156q927j3853Q373K0336K8757K9126j9518
13159G8094r855J8367j515J3422J7320L5342j5250k4415k905k2391n702J5005
$$ y = [5587, 21156, 32618, 27623, -3398, 3396, 29572, -5034, -26092, -33602, -11383, -8612, -8046, 22382, 48315, 30691, 34959, 71904, 54210, 60966, 57839, 37905, 17779, 32561, 57558, 86188, 84053, 56641, 43497, 53658, 79641, 74346, 96670, 96887, 54836, 15112, 10487, 18997, 28061, 36618, 49721, 45818, 28302, 32934, 49410, 43211, 39857, 39169, 65959, 49257, 31623, 58576, 84093, 80058, 83916, 54263, 63322, 78652, 53677, 49819, 66366, 55434, 48320, 62534, 49999, 27347, 32525, 23248, 28418, 42277, 41316, 30272, 35438, 26607, 21196, 21131, 40688, 31225, 25136, 27545, 13900, 13161, 25412, 37956, 33800, 24873, 11020, 19393, 39729, 68486, 97612, 78094, 68239, 86606, 85091, 98513, 115833, 151175, 135925, 111510, 108605, 86214, 80512, 95517]
13147I5517K2639L0489K8347P303K6756N9062O2305N5380N8637P6683J00884R3290
13135G17292J12786J36192J65979J46935J31906J52909J40189J03067M7294k2959
13125A831590p6955j08487j36141j56439j80370j98992j46433j20675j05891o5381
13115E35826p4881m1029n0862j9984l2470n0791m0630O545J4040j7247k0180j0016
13103A98321j7271k7091n674n706Q75J187r979r634j7584J3640m298k4858J4962
13090A06890k467o193L7130P648J6892K0168N912j6492O833j7045k9911p715J2183
13077A33833k5089j4816N473J47N367Q36K8669k2893k1681K2739K5752K6230N0592
13064B15159M1290O5015M9323R2784Q6261L1426K6457N289l3659n1569m3314k2902
$$ y = [95517, 118156, 148645, 176992, 184295, 211051, 270113, 332418, 387798, 446435, 523118, 624002, 717292, 830078, 966270, 1132249, 1279184, 1411090, 1563999, 1704188, 1807255, 1854549, 1831590, 1754635, 1646148, 1510007, 1353568, 1173198, 974206, 827773, 707098, 601207, 535826, 460945, 419916, 369054, 349070, 316600, 265809, 225179, 231724, 245764, 228517, 208337, 198321, 181050, 153959, 148285, 142579, 143454, 144641, 134662, 125028, 107444, 121084, 116786, 91928, 106890, 104423, 98230, 135360, 143008, 159900, 180068, 185980, 169488, 176321, 159276, 129365, 121650, 133833, 108744, 93928, 99401, 99548, 104915, 105751, 134420, 111527, 89846, 112585, 138337, 164567, 215159, 256449, 321464, 370787, 463571, 549832, 581258, 607715, 613004, 579345, 527776, 484462, 461560]
13052D61560m0434o1467o6562k7712l7546k5191n350k8842k0556M020K7304l4977
13040A44247l1218J0152k567k442k0770k8871k938J2407k869J20L628N845K9720
13027A14444K0340L08M786q429n518j1554m850K8302j7149l1992J294J4770k0683
13014H4069J1786o790m811l128K6889R126j451k944j4575Q852P704O487j8221
13001A02993k3681O950J2839P435j0320j2554P36J3449l703J476J6091J8641k1159
12988A09193l464k3786p961O389l870L6166J4015k728J7009n599K039N792L8840
12975A82035M9341Q2276K9193M2991O7460J07774J09580O9143P8885M8703O6752
12964I34133l6443m5389n9054p5815q2053n6119m7084j2232m9186k8199Q493k4869
$$ y = [461560, 421126, 359659, 293097, 265385, 227839, 202648, 197298, 168456, 147900, 151920, 179224, 144247, 113029, 123181, 120614, 118172, 97402, 68531, 65593, 78000, 75131, 75251, 78879, 84724, 114444, 134784, 135092, 139878, 131449, 125931, 114377, 109527, 137829, 120680, 88688, 89982, 104752, 84069, 95855, 89065, 84254, 81126, 108015, 117141, 115690, 112746, 98171, 107023, 114727, 121214, 102993, 79312, 86262, 99101, 106536, 96216, 83662, 84398, 97847, 94144, 95620, 111711, 130352, 109193, 105729, 81943, 73982, 80371, 76501, 112667, 126682, 123954, 140963, 135364, 137403, 143195, 182035, 231376, 313652, 342845, 385836, 453296, 561070, 670650, 739793, 818678, 867381, 934133, 897690, 852301, 793247, 717432, 635379, 579260, 532176, 519944, 470758, 442559, 451052, 426183]
12952D26183l2772K80q203m1613l2494m3183m9669k0256J4453J1912J4592j2755
12940B26475j3697k2051k7911k4718J8019L4566j8850l2480j4844J946N453j8986
12928A12922k2097j1030j5002k196j8962p0361k4640J0806k0556L1535J0539J2391
12916f651K5917M5494J6671P980k3532l0305J1791J3478j5125J1542J4014k350
12904F8924o763k412j0059j2591l985j5179j2718r714R349L7482j9962j5618l0070
12891b3316j2846K676P598L065J6876M232J7261j6716j6630J1263J3600k5406
12879a8343j3653J4837L4811J2528K793J6531R584k4635k0355J9688J3268K9390
12867G6444k4156o564L6624L1932M007l1247k2897j4379K4459K5960P643K9836
$$ y = [426183, 393411, 393691, 385488, 343875, 311381, 268198, 218529, 198273, 212726, 224638, 239230, 226475, 212778, 190727, 162816, 138098, 156117, 190683, 171833, 139353, 124509, 126455, 131908, 112922, 90825, 79795, 64793, 62597, 43635, -26726, -51366, -40560, -61116, -29581, -19042, -6651, 19266, 64760, 81431, 89411, 65879, 35574, 47365, 60843, 45718, 57260, 71274, 68924, 62161, 59749, 49690, 37099, 33114, 17935, 5217, -4497, 4852, 42334, 22372, 6754, -23316, -36162, -33486, -25888, -22823, -5947, -1715, 15546, -1170, -17800, -6537, 7063, -18343, -31996, -17159, 17652, 30180, 32973, 49504, 59088, 34453, 14098, 33786, 47054, 76444, 52288, 45724, 82348, 114280, 118287, 87040, 64143, 49764, 74223, 100183, 107826, 137662]
12855A37662N715q966K2283K955M68J1089Q150K6932j494j531J2570K1487K0370
12842B57690J0704M0769J3723K2739L2552N2649M5727L4999K9669N2402L9741
12831F33364L1739K0129O9791K2997m7826l3236M571j0883l8164l9887m646K3938
12819F31887K0491j3535j4531l7317j6524L2250J1158R261k9708p696n315m914
12807E75507j944k7237L37K938J4474q426J77M1997K2020m683l3451n098J0763
12794E87374K6126K0528J1466k5743l3859K4855K3205n903j3422K4383J3227K344
12782F54581q385j5508K6000L5407K8478L2829J4056k1348q518j5654n417L178
12770G19699j2414J3154K1329M0065L4331K2846O4518O7118P4286M7797O7229
$$ y = [137662, 143377, 134411, 156694, 159649, 160117, 171206, 179356, 206288, 204794, 203263, 215833, 237320, 257690, 268394, 309163, 322886, 345625, 378177, 430826, 476553, 511552, 541221, 593623, 633364, 665103, 685232, 755023, 778020, 730194, 696958, 701529, 690646, 652482, 612595, 607949, 631887, 652378, 638843, 624312, 586995, 570471, 602721, 613879, 623140, 593432, 585736, 580421, 575507, 573563, 546326, 546663, 549601, 564075, 555649, 555826, 597823, 619843, 615160, 581709, 576611, 587374, 613500, 634028, 645494, 619751, 585892, 610747, 633952, 628049, 614627, 639010, 652237, 654581, 646196, 630688, 656688, 692095, 720573, 753402, 767458, 746110, 737592, 721938, 716521, 719699, 707285, 720439, 741768, 781833, 816164, 839010, 903528, 970646, 1044932, 1092729, 1159958]
12759A159958O9379N0417O9123P6446Q6231J30143J09398J04808J00962J08126
12749B064991J44246J43789J76530J79108K13397K72959K78810L11139L27294
12740D112263L05285L08763L15429K72599K37729K49525K47930K66389L11426
12731F627338L56458M63602N28620N72602P11405Q20989R75683J150888J367019
12722A3574604J539284J803789K078258K417338K879133L529281M479706N903653
12714C8205046Q108563J1488165J5896458K0905154K5643084K9588358L2948734
12707A82783562L5102143L3771888K8156417K0170701J0930628j44047j1362649
12700B99408643j9807049k5720745l0192352l1948876k9927596k5993542k2135866
$$ y = [1159958, 1229337, 1279754, 1348877, 1425323, 1511554, 1641697, 1751095, 1855903, 1956865, 2064991, 2209237, 2353026, 2529556, 2708664, 2922061, 3195020, 3473830, 3784969, 4112263, 4417548, 4726311, 5041740, 5314339, 5552068, 5801593, 6049523, 6315912, 6627338, 6983796, 7447398, 7976018, 8548620, 9260025, 10081014, 11056697, 12207585, 13574604, 15113888, 16917677, 18995935, 21413273, 24292406, 27821687, 32301393, 38205046, 46313609, 57801774, 73698232, 94603386, 120246470, 149834828, 182783562, 217885705, 251657593, 279814010, 299984711, 310915339, 310771292, 299408643, 279601594, 253880849, 223688497, 191739621, 161812025, 135818483, 113682617]
12693A13682617j8642664j4891399j1336393q565761o650937n383127m508100
12686D3704236l859659l365607k978997k642802k364390k090049j823401j603575
12678B2975756j434713j248433j096483j020806r15395q15886p51159o56224n96342
12669A4440315n33807m84675l68746k84551k28509j54153o7219J7997J07199J08371
12659A2552222N0754J6445o0203k05166l31082m84158n63593n92410o21543o19191
12649I142075n74207n60049n12716m03325l69225l43047k66540k14977j93072
12640E704917j27883j33288j71455j33691j22513j40144j38022j38785r0734n9285
12630D449117p4407n4570k7621k6709l1291m4804o3973o8575p1437j34728j53928
$$ y = [113682617, 95039953, 80148554, 68812161, 60246400, 53595463, 48212336, 43704236, 39844577, 36478970, 33499973, 30857171, 28492781, 26402732, 24579331, 22975756, 21541043, 20292610, 19196127, 18175321, 17259926, 16444040, 15692881, 15036657, 14440315, 13906508, 13421833, 13053087, 12768536, 12540027, 12385874, 12318655, 12336652, 12443851, 12552222, 12602976, 12619421, 12559218, 12354052, 12022970, 11538812, 10975219, 10382809, 9761266, 9142075, 8567868, 8007819, 7495103, 7091778, 6722553, 6379506, 6112966, 5897989, 5704917, 5577034, 5443746, 5272291, 5138600, 5016087, 4875943, 4737921, 4599136, 4508402, 4449117, 4374710, 4320140, 4292519, 4265810, 4234519, 4189715, 4125742, 4057167, 3985730, 3851002, 3697074]
12619C697074j76794k57686k18117j93774j81776j66250j34125j23131j16355
12610B129066q9684o9251m2109m2234p0151o6454l0235m3433p5716p3464m5183
12599A481152k1261n2568m3306j6600J9174j9636J2543K4876O714J4280N0351
12588A455719O4477j7807k9000K0373J1556j2848K1579K6940N3201P4127N6265
12577A724582N9184O3062J6124j950J363M9698P3450J07241J48212K40376K30514
12566B711856J31311L4433L2187J7777o6038j18232j30568r7066j02073j08177
12556B305410j17040p5085l5732J1900Q1077N5562k47K6925M2849M6783J9084
12545B361486K562R288Q3994J14136O5281P3164L9890K6959J1627j64r882O2059
$$ y = [3697074, 3520280, 3262594, 3044477, 2850703, 2668927, 2502677, 2368552, 2245421, 2129066, 2039382, 1970131, 1928022, 1885788, 1815637, 1749183, 1718948, 1675515, 1599799, 1526335, 1481152, 1459891, 1407323, 1364017, 1347417, 1366591, 1346955, 1359498, 1384374, 1391088, 1405368, 1455719, 1520196, 1502389, 1473389, 1493762, 1505318, 1492470, 1514049, 1540989, 1594190, 1668317, 1724582, 1783766, 1846828, 1862952, 1861002, 1862365, 1912063, 1985513, 2092754, 2240966, 2481342, 2711856, 2843167, 2877600, 2909787, 2927564, 2861526, 2743294, 2612726, 2515660, 2413587, 2305410, 2188370, 2113285, 2077553, 2089453, 2170530, 2226092, 2225845, 2252770, 2295619, 2342402, 2361486, 2364048, 2373336, 2457330, 2571466, 2636747, 2709911, 2749801, 2776760, 2788387, 2788223, 2778341, 2840400]
12533B840400P0601J06644J53676J98853K40149L04228M29238N27191N15452L03816
12523E690248N8426l2059n9193k13244m26896m09269l22166k13281j41770j26068
12513C804728j06886k1730N9678J46361K26146K84791L06685L09585J95683K3941
12503E228982j31299j80239k60105l32768l63016l21562k63589k25019j85834
12494B965551j77577j73584j12713k0819K0735J7473L6243M8765J4090M7501J11210
12483B776875J41085J9025j22595j57066j44555j90686k56141k46200j86655q2662
12473A550425m1292p9345n1094m6546m6717m0078p0905o7701l7027k5514j5050
12462A029156k2016J8270Q87Q725J3817K2572R865R257K6568L5851L6836Q393
$$ y = [2840400, 2911001, 3017645, 3171321, 3370174, 3610323, 3914551, 4343789, 4870980, 5386432, 5690248, 5748674, 5716615, 5657422, 5444178, 5017282, 4608013, 4285847, 4072566, 3930796, 3804728, 3697842, 3676112, 3735790, 3882151, 4108297, 4393088, 4699773, 5009358, 5205041, 5228982, 5097683, 4917444, 4657339, 4324571, 3961555, 3639993, 3376404, 3151385, 2965551, 2787974, 2614390, 2501677, 2480858, 2501593, 2519066, 2555309, 2604074, 2618164, 2665665, 2776875, 2917960, 2936985, 2814390, 2657324, 2512769, 2322083, 2065942, 1819742, 1633087, 1550425, 1509133, 1429788, 1378694, 1332148, 1285431, 1245353, 1174448, 1106747, 1069720, 1044206, 1029156, 1007140, 1025410, 1026297, 1035022, 1048839, 1071411, 1081276, 1090533, 1117101, 1152952, 1189788, 1198181]
12450A198181k1231j4287K852j3850j4599k3285k3031q411m1581m0190k949j6105
12438I81514o86J5072m649l2926l4285k7331J477O7j8440k469J3458l5252j5250
12425H40300N212j077K50L1214L0115J6580K1046K2534K0152K5354p726n934k0929
12412I77091n298J0799r009j1919N890k8990K848O869j8536p449j2412j1266J8967
12399I17585L552N122M9956L0081q47o948M82n708j4465J0563L1092R127L2834
12386A062426M9077N9149M9049R4765P0758O7157M4373J00044J14704R3972J14032
12375A919506R8032J30530K28671K50341K57784L00923L75905M07934M16910M34445
12365D820981M32543L57827K67556K27581J45766K4784o1717n9547j5565m270
$$ y = [1198181, 1176950, 1162663, 1165515, 1151665, 1137066, 1113781, 1090750, 1082339, 1040758, 1000568, 997619, 981514, 980828, 995900, 991251, 958325, 924040, 896709, 898186, 898253, 879813, 877344, 890802, 855550, 840300, 845512, 844435, 844685, 875899, 906014, 922594, 943640, 966174, 986326, 1011680, 1003954, 998020, 977091, 971793, 982592, 973583, 961664, 967554, 938564, 941412, 948281, 929745, 922296, 909884, 898618, 917585, 921137, 926259, 976215, 1006296, 1005449, 998501, 998983, 993275, 978810, 989373, 1020465, 1029592, 1062426, 1111503, 1170652, 1219701, 1314466, 1385224, 1452381, 1496754, 1596798, 1711502, 1805474, 1919506, 2017538, 2148068, 2376739, 2627080, 2884864, 3185787, 3561692, 3969626, 4386536, 4820981, 5253524, 5611351, 5878907, 6106488, 6252254, 6277038, 6215321, 6155774, 6140209, 6135939]
12355F135939O4236J68066K59147L56925M35374N46396O22102P43697Q22359R62392
12345A1116633J187737J404015J626704J846440K078829K331511K626800K944306
12337B7162975L364061M010733N036504O629347R147913J2758319J7478305K2809426
12329A08397583K7926962L2109477L4979101L5539834L2267424K4965188J4902099
12322C11087668L485901p715022j7420090k5156231l0411535l2148480l0371844
12315A71350367k6760166k2695791j8484159j4352169j0732862p970571o145279
12308F4209370m989518m313201l931961l711051l598928l473872l289093l081975
12300C3819771k790279k499152k179597j922362j649834j402208j237446j120528
$$ y = [6135939, 6200175, 6368241, 6627388, 6984313, 7419687, 7966083, 8588185, 9331882, 10154241, 11116633, 12304370, 13708385, 15335089, 17181529, 19260358, 21591869, 24218669, 27162975, 30527036, 34537769, 39574273, 46203620, 55351533, 68109852, 85588157, 108397583, 136324545, 168434022, 203413123, 238952957, 271220381, 296185569, 311087668, 314573569, 306858547, 289438457, 264282226, 233870691, 201722211, 171350367, 144590201, 121894410, 103410251, 89058082, 78325220, 70354649, 64209370, 59219852, 54906651, 50974690, 47263639, 43664711, 40190839, 36901746, 33819771, 31029492, 28530340, 26350743, 24428381, 22778547, 21376339, 20138893, 19018365]
12292A9018365r99205r32463q76125p65867o89223o44332n92663n26886m77280
12283A2514321m04025l37643k72606k60228j49294p2919o8483o1567p9748n5048
12273A0752760j07393j67528k06894k35314k65783l27593l28921l30827l22111
12264H460396l17060l04532k83755k21870k17981k25757k39678k78238k73180
12255F098345k58080k62667k89169k87603k67111k44531k49480j97822j90410
12246C851472j53838j77345j15147j07244j11132p3151l1456j1658k90q6979j07332
12235B875900j06775j27488j51055j24277j18890j28248j13178r4365p4421p6980
12225A760223o1274o6192n6244l1795l3119k8497j1398J3051J1932O915l605J7869
$$ y = [19018365, 18019160, 17086697, 16210572, 15444705, 14755482, 14111150, 13518487, 12991601, 12514321, 12110296, 11772653, 11500047, 11239819, 11090525, 11017606, 10949123, 10887556, 10807808, 10752760, 10645367, 10477839, 10270945, 10035631, 9769848, 9442255, 9113334, 8782507, 8460396, 8143336, 7838804, 7555049, 7333179, 7115198, 6889441, 6649763, 6371525, 6098345, 5840265, 5577598, 5288429, 5000826, 4733715, 4489184, 4239704, 4041882, 3851472, 3697634, 3520289, 3405142, 3297898, 3186766, 3113615, 3082159, 3070501, 3070211, 2983232, 2875900, 2769125, 2641637, 2490582, 2366305, 2247415, 2119167, 2005989, 1911624, 1837203, 1760223, 1698949, 1632757, 1576513, 1544718, 1511599, 1483102, 1471704, 1484755, 1496687, 1503602, 1499997, 1517866]
12213A517866J1043l7224j3451r6o5414l8187n9192o8015m3575k1916m7694l0927
12201A103218p390m252j1874L84M399K0009J7766J0364k1191l5538k7699j5491
12189A032705m5093Q13j5259m655m3748l3011p57K2922J142k6552j5556j1560
12177H61391j7050l3042k8733R70l3468j0364L056K2716n252J2557n517N575K2320
12164G95159J1296J9904L3142K3716j1204l1987k0227j6924l1790m6562n3187
12153F71336k6641M85l490n704r168j7919J0598r920m716r50L9379J7206O478
12140F66974K207J4952J511j6924p87J5666J8540N421j9433j7952k4658k0675
12128F24842j7558P702j982l2854j5532J4989r80m7948k7204l817L900n274l309
$$ y = [1517866, 1528909, 1491685, 1478234, 1478138, 1412724, 1374537, 1315345, 1247330, 1203755, 1181839, 1134145, 1103218, 1095828, 1091576, 1079702, 1080086, 1084485, 1104494, 1122260, 1132624, 1111433, 1075895, 1048196, 1032705, 987612, 988425, 973166, 968511, 924763, 891752, 890995, 913917, 915059, 888507, 872951, 861391, 844341, 811299, 782566, 783536, 750068, 739704, 742760, 765476, 760224, 772781, 767264, 772839, 795159, 806455, 826359, 859501, 883217, 872013, 840026, 819799, 802875, 771085, 724523, 671336, 644695, 645180, 641690, 635986, 626818, 608899, 619497, 609577, 604861, 603911, 643290, 660496, 666974, 669181, 684133, 685644, 668720, 667933, 683599, 702139, 707560, 688127, 670175, 645517, 624842, 607284, 614986, 613004, 580150, 564618, 579607, 578627, 530679, 503475, 499658, 503558, 498284, 494975]
12115D94975k1294j42o0618j4825J3573K2048j6035j7868j2686k7658L6325J0598
12103D06393j9509l2989l0535r731k402p096r250q938j6446J7838o228k9743n596
12090B45768k2055k4003j3741J1945m26J8638j0449j3379j4758j1585K1807J6662
12078B04424K5970J809j6619k4195j9512K7777J2049j1223j095K1355J4791k083
12066B33448P021q054J6967k1347j8889j9336O76J6345J6893j4077o100l8579
12054A64968n603J569o97P395J215m371O093J4660J7792J404q637l5824k8454
12041A31510m804M243L555K1679j4194K3510K0409m4509J1756J2287p67r044J9880
12028A75511J1228n248k517q201m867k3698j076l623j2515R663K9405N809k7141
$$ y = [494975, 473681, 473539, 412921, 398096, 411669, 433717, 417682, 399814, 387128, 359470, 395795, 406393, 386884, 353895, 323360, 313629, 311227, 304131, 294881, 285943, 269497, 287335, 281107, 251364, 245768, 223713, 199710, 185969, 197914, 197488, 216126, 205677, 192298, 177540, 165955, 187762, 204424, 230394, 232203, 215584, 191389, 171877, 199654, 211703, 200480, 199385, 220740, 235531, 233448, 240469, 232415, 249382, 228035, 209146, 189810, 190486, 206831, 223724, 209647, 203547, 164968, 159365, 160934, 160237, 167632, 168847, 164476, 170569, 185229, 203021, 204425, 195788, 159964, 131510, 126706, 130949, 134504, 156183, 141989, 165499, 185908, 141399, 153155, 165442, 164675, 155631, 175511, 186739, 181491, 178974, 170773, 165906, 142208, 141132, 137509, 124994, 134657, 164062, 169871, 142730]
12015A42730p369J973L275J1119J3538m686P889J6539J5082l583k8244l439l713
12002A61111N76J5258k1683k8772r311P945n409L956K7779Q665l09k7185p052
11989A25569K6735r655m5071K907R40n608J0731O482P872j0910k5245j7288k3034
11976D4425J861K5607L8166j8127N81K783m735q938k45J0205J4066l2236j0222
11963F3191Q878J1726J0269O276j445K030L3272L0294K203l2867k1570j275k1854
11950H9128K3171M422n730l203M0027J7658J2368n666r90R94J0039p540j4408
11937A60270k3873o256k2105k9133q611O743j523J8259K9689L1630j2317l9961
11925A02812M02K5934L5757J9180m954J516K033j780J5861K1750L9852M5465O9170
$$ y = [142730, 135361, 137334, 140609, 151728, 165266, 160580, 168469, 185008, 200090, 196507, 168263, 164824, 161111, 161687, 176945, 155262, 126490, 117179, 125124, 119715, 123671, 151450, 160115, 159806, 132621, 125569, 152304, 142649, 97578, 100485, 101425, 95817, 106548, 113030, 120902, 109992, 84747, 67459, 44425, 46286, 71893, 110059, 91932, 92513, 95296, 90561, 81623, 81378, 91583, 105649, 73413, 63191, 72069, 83795, 94064, 100340, 98895, 100925, 134197, 164491, 166694, 133827, 112257, 110982, 89128, 112299, 116721, 110991, 107788, 147815, 165473, 177841, 172175, 171185, 172179, 182218, 174678, 160270, 136397, 130141, 108036, 78903, 70292, 77035, 75512, 93771, 123460, 155090, 142773, 102812, 103214, 129148, 164905, 184085, 179131, 180647, 182680, 180900, 196761, 218511, 258363, 303828, 372998]
11912C72998O7861L1265Q0665R0873J37444J77424J80924J86768J47835J15963
11902A590020P0486J8062k2541o5176j40396j38484j49389j49349j11585j14207
11892G87441j12356q3065n3716p7460n6863j7235J0562L127j4386k3683k6585
11881C35781n2723k9760k422j1422j6115l5398l8790k3375j966M992J9743q762
11869A39783J9050J2343K799R273J1855J4738J379j4852O396l5601m5910j6469
11857A04784J0763O069K677L0470o653j7256L456J1610k0983n923k7567j2381
11845G9066l641o119r511j1001k239L1180R960J0158j0481J659P560l29k1692
11832G4570j0336j4539k7517k278J3478O830K6017J8727Q759k4102k6786K637
$$ y = [372998, 440859, 472124, 552789, 643662, 781106, 958530, 1139454, 1326222, 1474057, 1590020, 1660506, 1678568, 1656027, 1590851, 1450455, 1311971, 1162582, 1013233, 901648, 787441, 675085, 592020, 538304, 460844, 403981, 386746, 397308, 400435, 386049, 362366, 335781, 283058, 253298, 250876, 239454, 223339, 187941, 149151, 125776, 123810, 128802, 148545, 139783, 158833, 171176, 173975, 183248, 195103, 209841, 211220, 196368, 202764, 167163, 121253, 104784, 115547, 121616, 124293, 154763, 148110, 130854, 134310, 145920, 124937, 119014, 91447, 79066, 75425, 69306, 59795, 48794, 46555, 77735, 87695, 97853, 87372, 89031, 96591, 96262, 74570, 64234, 49695, 22178, 19900, 33378, 40208, 66225, 84952, 93711, 69609, 42823, 45460]
11820D5460K086J5758J2730j4597k0494k4132J6931L07k843n440J516L146M436
11807C4864o231J7213O535p898k187K5743J5036j5707N949j5029n894L4529J7227
11794A04150j9943k2738j5670j2405J907N414N077R987J570p446j350N032K701
11781E6286P267K7279n315l3021J724L6195k2669j2089k275p781J6284L134k0033
11768D4986p889M1649J7760l3316Q411J9956j6510k6970j0042J8096M5489j3867
11756H7753j4539M1118j0468j1185j1499j4625o780j3700k2314q964K8331L8422
11744H1550Q8l1392J6266P663J5973K9974j7446n1588k3631k334J8296J4510K242
11731F0171L7741q079k4158k5081J045J3450r067k1981k914j914J1680j987J6849
$$ y = [45460, 47546, 63304, 76034, 61437, 40943, 16811, 33742, 34049, 31206, 25766, 27282, 30428, 34864, 28633, 45846, 52381, 44483, 42296, 68039, 83075, 67368, 73317, 58288, 52394, 86923, 104150, 84207, 61469, 45799, 33394, 35301, 40715, 45792, 55779, 57349, 49903, 48553, 53585, 56286, 63553, 90832, 85517, 52496, 54220, 90415, 67746, 55657, 53382, 45601, 61885, 65019, 44986, 37097, 78746, 96506, 63190, 71601, 91557, 75047, 48077, 38035, 56131, 101620, 87753, 73214, 114332, 103864, 92679, 81180, 66555, 59775, 46075, 23761, 14797, 43128, 81550, 81638, 50246, 66512, 74175, 90148, 120122, 102676, 51088, 27457, 25123, 43419, 57929, 60171, 97912, 89833, 65675, 40594, 41639, 55089, 46022, 24041, 21127, 19213, 30893, 28906, 45755]
11718D5755Q727j2869n497L0141o820k7819K0466J9754Q578k3387l446P105J2107
11705G2795l693L377J17K2832J6618j9375l5506K6715K7746L912j3149l6629m2770
11692B2990q279J2090J3565K0231k105j6731L295R507J0289q98J159J7050J3455
11679I5618o158k9227o059K08j5144J3901o182k534J0561p902m988k7922j6060
11666a888m029R553P945K6005J2521K7533j665m499K7471j6758q058j5679J088
11653E9540J5750J8281q938L618J0020N928k830K0028L1832k6707k8406j6663
11641H1453M466J4244K3857K9424j733k9591N529l2586k4625k3852k5742L0036
11629E0880M38N914j3005r751j636m549O454k1361k7364K2254L5897L4762L0619
$$ y = [45755, 54482, 41613, 36116, 66257, 59437, 31618, 52084, 71838, 80416, 57029, 53583, 60688, 72795, 69102, 72479, 72596, 95428, 112046, 92671, 57165, 83880, 111626, 115538, 102389, 65760, 22990, 14711, 26801, 40366, 60597, 58492, 41761, 45056, 54563, 64852, 63954, 65113, 82163, 95618, 89460, 60233, 54174, 54382, 39238, 53139, 46957, 44423, 54984, 47082, 42094, 14172, -1888, -5917, 3636, 11581, 37586, 50107, 77640, 75975, 71476, 98947, 82189, 74131, 58452, 59540, 75290, 93571, 84633, 88251, 98271, 104199, 101369, 121397, 153229, 126522, 98116, 81453, 85919, 100163, 124020, 153444, 151711, 122120, 127649, 95063, 70438, 46586, 20844, 50880, 51318, 57232, 44227, 34476, 32840, 28291, 34745, 13384, -13980, 8274, 44171, 78933, 109552]
11616A09552k6648l1368l2639J4114K7422R288J138K2365r758j8055l1879p482
11604B6050N840J5488N633j0954m73J5560Q824J2050J2039j8371j2916N18P192
11591F6480j037J4435J2602k084J1915j8442k6333O949j5017j9792j2238K3312
11579D0750J5641j4203O086L129K9046J9539q492j8231k2939j7720K6648R79R139
11566F9372k888Q313j4155m252j2707r381M365k27N702n767J820J9063J9864J9358
11552I8480P848l2900j2322m7J9603K3448k6049l0399J1252M1710n027m1964n748
11539D7885q645J4952L0036Q279J4362j6990j3398J512J6773J749p64Q589j7514
11526H6826k5187m858L319J5203J0893q079L5854N843j402j3378j6988O663j2581
$$ y = [109552, 82904, 51536, 18897, 33011, 60433, 69721, 70859, 93224, 83466, 65411, 33532, 26050, 31890, 47378, 53011, 42057, 41584, 57144, 65968, 78018, 90057, 71686, 58770, 59288, 66480, 65443, 79878, 92480, 90396, 102311, 83869, 57536, 64485, 49468, 29676, 17438, 40750, 56391, 42188, 48274, 51403, 80449, 99988, 91496, 73265, 50326, 32606, 59254, 60233, 69372, 66484, 74797, 60642, 56390, 43683, 34302, 38667, 38440, 44142, 38375, 40195, 59258, 79122, 98480, 106328, 73428, 61106, 61059, 80662, 104110, 78061, 47662, 58914, 100624, 95597, 53633, 47885, 39240, 54192, 84228, 92507, 106869, 89879, 76481, 77993, 94766, 96515, 95751, 104340, 86826, 61639, 56781, 60100, 75303, 86196, 78117, 113971, 119814, 118412, 105034, 88046, 94709, 82128]
11513H2128p195O973R48L5528J4561K88j2813j1705q675m270K2348j2181P477
11500A13412P204j0022j7574j3033n056O328Q387J7635P749K0879j2361k107j1010
11487A10431j8287j4472j4267j9L2971K7475K9056k6723m8284l162J5226J0477
11475A00422o280q820R358J3497K7235r659J3547J6570j3223J1552j0643P504
11463A51060J6127m0396l6097L720J6845K5464K6957J0443J2374J2479L480J2488
11451B14944M1917K8778j296R903L9276M2743K5017n528k2952j9221j4702Q773
11439C47652Q993j3176k2801M752n149R620J4093l2157l1372p741K8210M2821
11427C43745J9325K0137P574q256J2704Q286n241o368j0568k0852J6767L0151
$$ y = [82128, 74933, 81906, 82854, 118382, 132943, 133231, 120418, 108713, 100038, 95768, 118116, 105935, 113412, 120616, 110594, 93020, 79987, 74931, 81259, 89646, 107281, 115030, 135909, 123548, 121441, 110431, 92144, 77672, 63405, 63386, 96357, 123832, 152888, 126165, 77881, 74719, 89945, 100422, 94142, 85322, 94680, 108177, 135412, 125753, 139300, 155870, 142647, 154199, 143556, 151060, 167187, 126791, 90694, 94414, 111259, 136723, 163680, 174123, 186497, 198976, 202456, 214944, 256861, 285639, 284343, 294246, 333522, 376265, 401282, 395754, 372802, 353581, 338879, 347652, 356645, 343469, 320668, 325420, 320271, 329891, 343984, 311827, 280455, 272714, 300924, 343745, 363070, 383207, 390781, 382525, 395229, 403515, 398274, 391906, 381338, 360486, 377253, 407404]
11415D07404K8779J3097j033K4300R345L9318P423M2433Q8154L5868L4404M5406
11403G74898M7298J7049J5649L070j6269l7114l5791l5225k1205l7805k2396j2464
11391F39695k6869m1405k5473L729k5424n0551j969J2108l6688l5847j1475o367
11379C93464j4816J6988j108k0482p801m89j066l269J3823k2527j8573J7125J0425
11366C61694J691L253K7881r386p298J2936L0224L9577K346j3500j0339k1973
11354D17106j6101j0509j9942j4271k8793j7534k0190k2788k8523m9834j570m459
11342A82592j1216q226k9343j8373O437L2921K3595P294J3610O557j7722l5263
11330A52863k844l019O797q513k5212l487L1866Q782l6448l0017p182l3387l817
$$ y = [407404, 436183, 449280, 448247, 472547, 481892, 521210, 528633, 571066, 659220, 695088, 729492, 774898, 822196, 839245, 854894, 857964, 841695, 804581, 768790, 733565, 712360, 674555, 652159, 639695, 612826, 571421, 545948, 549677, 524253, 473702, 471733, 483841, 447153, 411306, 399831, 393464, 378648, 395636, 394528, 374046, 366245, 365756, 364690, 361421, 375244, 352717, 334144, 351269, 361694, 363385, 366638, 394519, 385133, 377835, 390771, 420995, 460572, 462918, 449418, 439079, 417106, 401005, 390496, 370554, 356283, 327490, 309956, 289766, 266978, 238455, 188621, 187051, 182592, 171376, 163150, 133807, 115434, 121871, 154792, 178387, 185681, 199291, 205848, 188126, 152863, 150019, 147000, 153797, 145284, 120072, 116585, 148451, 157233, 120785, 90768, 83586, 50199, 46382]
11317D6382M0422M686J7297J5972j3213j3268k1086l3461j6940L0445K3020n089
11305G5167L3020l3957j0449J2235J9755m526Q788j43j400L0374j0364j9238j5900
11292H3362j9118j96J5443L6097k2230P024j3842o273M132J153j7271J1535K6601
11279A06417o922p137k3683j8580q518J198O2763K1882j0239j6826K2306k1395
11267A01266j5196j8890k1384n837J3151k301j7178j0022J2754n764l6605M099
11255a907J4100J5832L115k786L0783j9792q818L4604J3729j5598k422J1287J1578
11242H3705J9456L753r638m5726j8346j9316m098K0506l489k79j5366P868Q755
11229B7785R792L1688J7113k5666J329J5048j0213J8491J8989k0544J5361j7448
$$ y = [46382, 86804, 91490, 108787, 124759, 111546, 98278, 77192, 43731, 26791, 57236, 80256, 75167, 108187, 74230, 63781, 76016, 95771, 91245, 100033, 99890, 98490, 128864, 118500, 99262, 83362, 64244, 64048, 79491, 115588, 93358, 100382, 86540, 80267, 84399, 85552, 68281, 79816, 106417, 99495, 92358, 68675, 50095, 41577, 42775, 105538, 127420, 117181, 100355, 122661, 101266, 86070, 67180, 45796, 39959, 53110, 50809, 33631, 23609, 36363, 30599, -6006, -1907, 12193, 28025, 31140, 28354, 59137, 39345, 30527, 65131, 78860, 63262, 60840, 72127, 83705, 103161, 106914, 97276, 51550, 33204, 13888, 9790, 30296, 26807, 26528, 11162, 19030, 27785, 37577, 69265, 86378, 60712, 62041, 77089, 66876, 85367, 104356, 83812, 99173, 81725]
11217H1725k0500o836j3822J8104N886l5817j035O1406n091m630M345J76J4923
11204I8834J1915k2174k7678j7447o559P567N696j2439j3654J2442K0899J0934
11192F8336J4436K989k5504j8497O812J5974J6893L848j5976m652k3279P300j3592
11179C5088k1263K3752M2370L8852J1743l9674l6482l1012k091J8232Q951j0777
11167C7689J4167L2310J5387l0986k9805j1153j006J9097n82j0213L813J9989
11155E8707R145N824R835j5643J4234j1632p108q66k0617l672N176j0119k773
11142C0491J3778n35q150j3610j6965O37M084j2247J1009J3308K1812R79k5181
11129A9410k0296K6937J34P66L8787J7913k7079l793m278J8916L797r916l150
$$ y = [81725, 61225, 54389, 40567, 58671, 64557, 28740, 27705, 89111, 84020, 79390, 83735, 83911, 98834, 110749, 88575, 60897, 43450, 36891, 44458, 50154, 37715, 24061, 36503, 57402, 68336, 82772, 85761, 60257, 41760, 48572, 64546, 81439, 85287, 69311, 64659, 41380, 48680, 35088, 13825, 37577, 79947, 118799, 130542, 90868, 54386, 23374, 21283, 39515, 48466, 37689, 51856, 84166, 99553, 68567, 38762, 27609, 26603, 45700, 45118, 34905, 38718, 58707, 67852, 73676, 83511, 67868, 82102, 70470, 63362, 62496, 41879, 38207, 43383, 33264, 30491, 44269, 43734, 35584, 21974, 5009, 5646, 9730, -2517, 8492, 21800, 43612, 44591, 19410, -886, 26051, 26185, 26951, 65738, 83651, 56572, 52779, 48501, 67417, 71214, 61298, 58148]
11116E8148J0486J1453P958J5384Q936j8251r882j39J246J2297m246L532J3194
11103A10116j9911k6694q799k5070k2629J8001L5437L2083J8441m891j5445j128
11091H9511K2026p918L606L5469n266n3126j8046J9044o017j56O849J1969M3690
11078A41635k1704j4782J5448J288j353O804J3555J0974q697Q907r24j60Q040
11065A59031n073k4470J9633J009L3461K8411J5711K524J7334N3081N9852L8313
11053C98817M0623J7245J7657m01j0993j3313k7970o969L5376l97j6396j2014
11041D21265R078P84P25J3542r14Q950R207M871J4137J7292M5142J4872R879j2009
11027E56821k3938P205J6361Q172K891J2953q836M796O1588L9508J0191K6663
$$ y = [58148, 68634, 80087, 88045, 103429, 112365, 94114, 84232, 84093, 85339, 97636, 93390, 96922, 110116, 90205, 63511, 54712, 29642, 7013, 25014, 60451, 92534, 110975, 106084, 90639, 89511, 111537, 103619, 107225, 142694, 137428, 84302, 66256, 85300, 79283, 79127, 85976, 97945, 141635, 119931, 105149, 120597, 121885, 120532, 127336, 140891, 151865, 143168, 152075, 151151, 150991, 159031, 153958, 129488, 149121, 150130, 183591, 212002, 227713, 230237, 247571, 300652, 360504, 398817, 439440, 456685, 474342, 473941, 462948, 449635, 421665, 414696, 450072, 449675, 433279, 421265, 430343, 431127, 431852, 445394, 444480, 453430, 462637, 467508, 481645, 498937, 544079, 558951, 568830, 556821, 532883, 540088, 556449, 564621, 567512, 580465, 571629, 576425, 638013, 677521, 687712, 714375]
11015G14375P9838J03592J01376Q1450O7806P486n663m765k1988o9000o5335m3742
11003I45430n8510o864j8261l6621j9770q299J2526Q499k3375l4770L218k4173
10991G39030o0619k0737J215k2092k4965o645l9403k192N954k1277k1121j3281
10979E13867P541J668l1211l9817n491K8956L6144K5084K9499K5967j5358M920
10967E81769K4580O359k4863l8629k9912m2993l0631l2967m4181j9488j0439l6239
10955C02366j5302J231J4605l8496j1656n571R345Q993n4723j3191J9171J2817
10943B29589L69k5008m1616J3365K5556j2445q540p232j3954K4753L0163k696
10931B12304k6394K7477Q23l9435k2566M116o088k4251l254Q811L5142N708l6239
$$ y = [714375, 794213, 897805, 999181, 1080631, 1148437, 1155923, 1150260, 1145495, 1123507, 1054507, 989172, 945430, 886920, 880056, 861795, 825174, 805404, 797105, 809631, 818130, 794755, 759985, 763203, 739030, 678411, 657674, 658889, 636797, 611832, 605187, 565784, 563592, 569546, 548269, 527148, 513867, 521408, 523076, 491865, 452048, 446557, 475513, 511657, 536741, 566240, 592207, 576849, 581769, 606349, 612708, 587845, 549216, 519304, 476311, 445680, 412713, 368532, 349044, 338605, 302366, 287064, 288295, 302900, 264404, 252748, 247177, 256522, 265515, 210792, 197601, 216772, 229589, 229958, 204950, 163334, 176699, 202255, 189810, 181270, 174038, 160084, 184837, 215000, 212304, 185910, 213387, 214210, 174775, 152209, 156325, 150237, 125986, 122732, 131543, 166685, 172393, 136154]
10918A36154p848J5837K7176J4912j6972q985j8431m955j3823L381j3128L157
10906A16475P784J4583M155K7997O091k1199J8611K9073J2118j4487l0065K1603
10894A92739J0498l875l0910j7130j0246L490Q535L879J2093j6388J3098J0503
10882A76286j1255q685p319J1454K8577J2732K0165R630J0796k2760l039J6100
10870B32682k33j3359L2070R486p728k3310K075J9143J963J2322J5968K436J7551
10857C01066M603m7527J0946K4758P26j2545M823l4894P409J5871Q907J3627J7202
10844C14972p648q202K0850k442j3440j6933L404J0348J7570K7393L8493N726
10832C90091j1511k0687L750K633K0413K9428m5419m3879Q40j4866J3644M347
$$ y = [136154, 128306, 144143, 171319, 186231, 169259, 160274, 141843, 136888, 123065, 126446, 113318, 116475, 124259, 138842, 142997, 170994, 177085, 155886, 174497, 203570, 215688, 201201, 171136, 192739, 203237, 199362, 168452, 151322, 141076, 144566, 153101, 156980, 169073, 152685, 165783, 176286, 165031, 156346, 149027, 160481, 189058, 201790, 221955, 231585, 242381, 219621, 216582, 232682, 232449, 219090, 251160, 260646, 252918, 229608, 231683, 250826, 252789, 265111, 281079, 283515, 301066, 305669, 258142, 269088, 293846, 294572, 282027, 286850, 251956, 259365, 275236, 284143, 297770, 314972, 307324, 299122, 319972, 317530, 304090, 287157, 290561, 300909, 318479, 345872, 384365, 390091, 378580, 357893, 361643, 364276, 384689, 414117, 368698, 324819, 325659, 310793, 324437, 328784]
10820C28784j537N222L784q06r717r39J5599N655J23Q749r603m287k7389j2030
10806C01608O034j8106j1542Q086L1289J3020k3150l6845j0010K0781K9895k2880
10794B88180l115K6996j7112r400q897P022k5360P791J6350j9518N57J4408L294
10781B81196J0503J0731j3141j7471P618J1551j0399l3471k1373L2256q680j5355
10769B33965M0642M7646L3492O310k5203l095j7237J8187Q779r122J2353M7728
10757C94445Q627M7J7441M2843K8994J100M37J2116K2654M1954L8313L0859j6003
10744F23827J51L307L636j0314M016O916M2425N2150K4045J6610M7653N3632K0930
10731H88984K3012K7002M1164M708J9159J7905L5624J8856J9833M7386Q1846O2875
$$ y = [328784, 327247, 332469, 336253, 335447, 325730, 324791, 340390, 346045, 346168, 354917, 345314, 341027, 313638, 301608, 307642, 289536, 277994, 286080, 317369, 330389, 307239, 270394, 260384, 281165, 311060, 288180, 285065, 312061, 294949, 285549, 276652, 283674, 258314, 266105, 282455, 262937, 263494, 277902, 281196, 291699, 302430, 289289, 271818, 279436, 290987, 280588, 247117, 225744, 258000, 249320, 233965, 274607, 322253, 355745, 362055, 336852, 333757, 316520, 334707, 343486, 334364, 346717, 394445, 403072, 403119, 420560, 463403, 492397, 493497, 493934, 506050, 528704, 570658, 608971, 639830, 623827, 623978, 627285, 630921, 620607, 624623, 631539, 673964, 726114, 750159, 766769, 814422, 868054, 888984, 911996, 938998, 980162, 984870, 1004029, 1021934, 1057558, 1076414, 1096247, 1143633, 1225479, 1288354]
10719A288354M2188O4899O2462N1970R2001J34725J31325J65362J11564L3837
10709B178687m433L547k6704n9458l9290L3179L8099K2623J8121L6158J7602P274
10697B225405K6580M6488L6220O5111M1661L2200O3679P9603M9610J0956l721
10686B673792k2126j2560K8800J5252k2751L0094Q0097Q8437J04996Q9555J30065
10675C183651J88836K12076J92259K34412K64455K45240K00104J85846J97485
10666E104364J80875J84833J95961K49126L31473M30159N22353O02271O57461
10657H458876O71976O59160O28473N80142N10395M79875M55695M23024M05595
10648A3273211L88934K32420J02658o544n8350j06279m4586M6828K01303M96502
$$ y = [1288354, 1330542, 1395441, 1457903, 1509873, 1601874, 1736599, 1867924, 2033286, 2144850, 2178687, 2174254, 2177801, 2151097, 2091639, 2052349, 2085528, 2123627, 2146250, 2164371, 2200529, 2218131, 2225405, 2251985, 2298473, 2334693, 2399804, 2441465, 2473665, 2537344, 2616947, 2666557, 2677513, 2673792, 2651666, 2639106, 2667906, 2683158, 2660407, 2690501, 2770598, 2859035, 2964031, 3053586, 3183651, 3372487, 3584563, 3776822, 4011234, 4275689, 4520929, 4721033, 4906879, 5104364, 5285239, 5470072, 5666033, 5915159, 6246632, 6676791, 7199144, 7801415, 8458876, 9130852, 9790012, 10418485, 10998627, 11509022, 11988897, 12444592, 12867616, 13273211, 13662145, 13894565, 13997223, 13990679, 13932329, 13826050, 13781464, 13828292, 14029595, 14526097]
10638A4526097Q13689J188196J629870K191474L040818M224316N661528P022146
10630D0298134P742686P314827N895393M152591K456852R30180j69672m91714
10622F8129277j5490Q42288J495863J660982J376430Q92967M93196L68440M08408
10613G5652361L59130L10779M13442P22473J100561J420574J884213K637101L447906
10604H7948540L826920L603865K980893K252997J650772J264413J213810J532235
10596A06274445K149102K839539L478446L865164M052756M665921O103931P969376
10588A41398680R706234J0819365J0403558P597986L528333O2621k719218n627862
10580A75169697p713724p841406o413279m668782l460212k862017k552105k070139
$$ y = [14526097, 15339786, 16527982, 18157852, 20349326, 23390144, 27614460, 33275988, 40298134, 48040820, 55355647, 61251040, 65403631, 67860483, 68790663, 68620991, 68129277, 68113787, 68956075, 70451938, 72112920, 73489350, 74382317, 74875513, 75243953, 75652361, 76011491, 76322270, 76735712, 77458185, 78558746, 79979320, 81863533, 84500634, 87948540, 91775460, 95379325, 98360218, 100613215, 102263987, 103528400, 104742210, 106274445, 108423547, 111263086, 114741532, 118606696, 122659452, 127325373, 133429304, 141398680, 151104914, 161924279, 172327837, 179925823, 183454156, 183516777, 180797559, 175169697, 167455973, 159614567, 153201288, 148532506, 145072294, 142210277, 139658172, 137588033]
10572A37588033j576148j369771j673862k285455k785973l198373l796157m439243
10564A16463051m692296m335619l537822k569824j892283j636024j526105j354161
10556I4918917r24209m44253j01118J95268M43321M76457Q4455n98306r61172
10547I3089360o97773J21474J275542K192246J874494Q6525k194374m138659n960728
10538H5648107p828414q877272q527039p209184n660745m368339l384464k629480
10530C7163170k076556j658472j273556r11851o35689m38128l76875l56047l20465
10521B9115531m16478n36844o00305p11446p87986q32469q39483r05366r81169
10512B2503985r99376r78773r81975r89616r30104q87144q16183o67338n66119
$$ y = [137588033, 136011885, 134642114, 132968252, 130682797, 127896824, 124698451, 120902294, 116463051, 111770755, 107435136, 103897314, 101327490, 99435207, 97799183, 96273078, 94918917, 93994708, 93550455, 93449337, 93644605, 94087926, 94564383, 94648838, 94050532, 93089360, 92391587, 92513061, 93788603, 95980849, 97855343, 97941868, 95747494, 91608835, 85648107, 77819693, 68942421, 60415382, 53206198, 47545453, 43177114, 39792650, 37163170, 35086614, 33428142, 32154586, 31242735, 30607046, 30168918, 29792043, 29435996, 29115531, 28699053, 28162209, 27561904, 26850458, 26062472, 25230003, 24390520, 23485154, 22503985, 21504609, 20525836, 19543861, 18554245, 17624141, 16736997, 15920814, 15253476, 14687357]
10503A4687357n34655m86740m80702n03819n07856n34975n25159m87740m98908
10494A0126803m50762l99012l67619l06017l00873k92809k40997j67850j79558
10485G421306j77079j35797j15884j24713r9983q7386o9810j11036r8913q9581
10475F311124j13765j36465j14205j02193j04994j25712r9312j08173p3681m6704
10465E285920k1825l4565J118J5844N2205N9814N1221j8464n7196j04926j49610
10454E079536j77393j79354j69091j36736j04330j32049r9358o7372m3483p3542
10444C896828j05223o1692n2150o6532p1652j00967j18513r1139p1421k9787q8500
10433C039252j34965p1490m3652o8048l5987l8661l6539j4274n664l0736m7409
$$ y = [14687357, 14152702, 13665962, 13185260, 12681441, 12173585, 11638610, 11113451, 10625711, 10126803, 9676041, 9277029, 8909410, 8603393, 8302520, 8009711, 7768714, 7600864, 7421306, 7244227, 7108430, 6992546, 6867833, 6767850, 6680464, 6610654, 6499618, 6400705, 6311124, 6197359, 6060894, 5946689, 5844496, 5739502, 5613790, 5514478, 5406305, 5332624, 5285920, 5264095, 5229530, 5230648, 5246492, 5298697, 5358511, 5409732, 5391268, 5334072, 5229146, 5079536, 4902143, 4722789, 4553698, 4416962, 4312632, 4180583, 4081225, 4013853, 3970370, 3896828, 3791605, 3729913, 3677763, 3611231, 3539579, 3438612, 3320099, 3228960, 3157539, 3127752, 3039252, 2904287, 2832797, 2789145, 2721097, 2685110, 2646449, 2609910, 2595636, 2589972, 2559236, 2511827]
10422B511827l7322l2652n0087l5180n3449m469o85J945k4108l8157k1528m2317
10410B173818l8724m4104o2750l3509m6788q7891n6599m1560l2208k6917j9020
10399A683748m0216n9317m3042k5614j4187m0268m0731j2255l350l3235n3487
10388A318046k4247j7703r203j6218j7547j7078j3004P453l4989k7437m7392k0084
10376A080597k4156j5120j4187r519K0699k1333k0491l1596j3581J4489p058J575
10364I60319k4830m7396l2276J9708O251n5256j1433J1439J4890j2905k7377j5292
10352G85842m7876m0993j4016l221J8791Q828l6580k0596J8908J977M1049J598
10340G13711m2950q7J796p250q094K2278O935R71J7145J3194P6598P0826P1988
$$ y = [2511827, 2474505, 2441853, 2391766, 2356586, 2303137, 2298668, 2297983, 2299928, 2275820, 2237663, 2216135, 2173818, 2135094, 2090990, 2028240, 1994731, 1947943, 1860052, 1803453, 1761893, 1729685, 1702768, 1683748, 1643532, 1584215, 1541173, 1515559, 1501372, 1461104, 1420373, 1408118, 1404768, 1371533, 1318046, 1293799, 1276096, 1266893, 1250675, 1233128, 1216050, 1203046, 1210499, 1175510, 1148073, 1100681, 1080597, 1056441, 1041321, 1027134, 1017615, 1038314, 1016981, 996490, 964894, 951313, 965802, 958744, 960319, 935489, 888093, 855817, 875525, 881776, 826520, 815087, 826526, 841416, 828511, 801134, 785842, 737966, 696973, 682957, 679736, 698527, 707355, 670775, 650179, 669087, 671064, 712113, 713711, 670761, 670674, 672470, 665220, 657126, 679404, 686339, 687310, 704455, 717649, 794247, 865073, 937061]
10327I37061O8489J16091J63930J47718J14984Q7226O4369L8215L6072j6001q2061
10316A676093j06265j01851j02031j39689j17288q8551j22320r9461n0700j2983
10306G34954k1045k0611k0251l5074l3088m011J0658Q051m5101k8507o467j2845
10294E26663k8928j8255K086k5Q620l221j8043l4078K000n870p058J1631j0687
10281D24835l6918j8510M0481J3909P761j8225j4294J504j3335Q573j4498o172
10269C75111J6161Q562n4783L001J2521k8435J866R439o524j9990j7059L111K2634
10256C25615L3970P593q210O07j1043N807j2216K5280O662k2477j7644K2218J6860
10243C73022m838m034q014k1411j2462R806k433p206O585K828Q425n899N63l4710
$$ y = [937061, 1005550, 1121641, 1285571, 1433289, 1548273, 1635499, 1699868, 1738083, 1774155, 1758154, 1676093, 1569828, 1467977, 1365946, 1226257, 1108969, 1020418, 898098, 798637, 747937, 734954, 713909, 693298, 673047, 637973, 604885, 600874, 611532, 619583, 574482, 545975, 539508, 526663, 497735, 479480, 481566, 481541, 490161, 486940, 468897, 434819, 436819, 430949, 423891, 435522, 424835, 387917, 369407, 409888, 423797, 431558, 413333, 399039, 400543, 387208, 395781, 381283, 375111, 391272, 399834, 345051, 348052, 360573, 332138, 334004, 343443, 336919, 316929, 299870, 302981, 325615, 359585, 367178, 358968, 359575, 348532, 354339, 342123, 367403, 374065, 351588, 333944, 356162, 373022, 368184, 364150, 356136, 334725, 322263, 332069, 329636, 322430, 329015, 331843, 340268, 334369, 334932, 300222]
10229C00222k5143Q564J7936R219P772j230L428K0199l935J159J1810o999N707
10216C48709K0243L2576K3298N031J975l406k1084K4060J9674k652K1267L6549
10204E06240M6795M7804O3466Q8637J45006J71302J40834J36168J58581J68632
10194A673465J18776P6961N4277j0186l0574j47940j98374j61239j39171j30529
10184A105466p7793p1942p2471l8181j1535J2735k7752l4276O570N447r830J6266
10172H02704L4474K640P075k795o714r363K7298r921j4596n901P233N663N2957
10159H90754Q396R328K1437L4994O8307Q0490O8563O0835J8771K2518k762o1695
10147A219936m4267n5766l6499l7304k6941l3996m9047l6598j6559j1360o9164
$$ y = [300222, 275079, 283643, 301579, 310798, 318570, 317340, 320768, 340967, 337032, 338191, 350001, 343002, 348709, 368952, 401528, 424826, 429857, 431832, 428426, 407342, 431402, 451076, 448424, 469691, 506240, 553035, 600839, 664305, 752942, 897948, 1069250, 1210084, 1346252, 1504833, 1673465, 1792241, 1869202, 1923479, 1913293, 1882719, 1734779, 1536405, 1375166, 1235995, 1105466, 1027673, 955731, 883260, 845079, 833544, 846279, 818527, 784251, 790821, 796268, 786438, 802704, 837178, 839818, 846893, 844098, 837384, 828021, 855319, 845398, 830802, 824901, 832134, 837797, 890754, 899150, 908478, 929915, 964909, 1033216, 1113706, 1182269, 1243104, 1261875, 1284393, 1281631, 1219936, 1175669, 1119903, 1083404, 1046100, 1019159, 985163, 936116, 899518, 882959, 871599, 802435]
10136H02435l8849L1043J6821j2611p172k8935k2455n319k7044j752J473j3039
10124F94596k1761L1443k7251j3251K2956K8117j4155N683q069K2012o820K048
10112G15548J4500k89j760j029l0260k7922j1955k8357l9668l9336m9284l3423
10100D66765m9193l1427K7242j613J5384L238j4283k8681r875r385N568J4696
10088C88436j921l3490l1523j7184k1399K55J6390M843r946j6236O169r717j364
10075B73313k623N228J4278j1076l2747k3472K8582M8110j5414k0653j6291j3272
10063B33963K0472J8602J5561o693k1992k9538l037J3957r317L190m442J1400
10051B42126J5638k6404K152J4498K0810J613j6014r224k0700m936J7373J2583
$$ y = [802435, 763586, 794629, 811450, 798839, 791667, 762732, 740277, 734958, 707914, 706162, 707635, 694596, 672835, 704278, 677027, 663776, 686732, 714849, 700694, 706377, 698308, 720320, 713500, 715548, 730048, 729759, 727999, 726970, 696710, 668788, 656833, 628476, 588808, 549472, 500188, 466765, 417572, 386145, 413387, 411774, 427158, 430396, 416113, 387432, 377557, 368172, 373740, 388436, 386515, 353025, 321502, 304318, 282919, 283174, 299564, 304407, 294461, 278225, 284394, 274677, 273313, 270690, 275918, 290196, 279120, 246373, 222901, 251483, 299593, 284179, 263526, 247235, 233963, 254435, 273037, 288598, 281905, 259913, 230375, 227338, 241295, 231978, 235168, 230726, 242126, 257764, 231360, 233512, 248010, 268820, 270433, 254419, 245195, 224495, 219559, 236932, 249515]
10039B49515j0210M421K5470j2677L80K1365J485r799k769k1446r047m070p716
10026B24902J4995L2132J7064j6345k0013k543k734j7650o262o201k2423k173
10014A92749J9935M5018k2531k8476P251J7735L386L7074Q564k5043j3449K2035
10002B64248J3622L2624K0639j8222j2196m2156Q42L247N990m667L3306L6068
9990C33345N529k8662N809M335k3079k0533j6371k6084p419K5732o007j3141J4048
9977B47502J6274r47J6046K817Q05K9131k7124k1440O951m131j5935J3297J9115
9964B82361L1402P317o504m8346r531Q131k3185Q763j683k0541K0497O071Q747
9951B63499J4731J6587j382K1496O657P424K4821N787L3363J9748K8416K5163
$$ y = [249515, 239305, 243726, 269196, 256519, 256899, 278264, 279749, 269950, 267181, 245735, 236688, 232618, 224902, 239897, 272029, 289093, 272748, 252735, 250192, 247458, 229808, 223546, 217345, 194922, 192749, 212684, 257702, 235171, 206695, 213946, 231681, 235067, 272141, 280705, 255662, 242213, 264248, 277870, 310494, 331133, 312911, 300715, 258559, 259401, 262648, 268638, 263971, 297277, 333345, 338874, 310212, 316021, 320356, 297277, 276744, 260373, 234289, 226870, 252602, 246595, 233454, 247502, 263776, 262829, 278875, 281692, 282497, 311628, 284504, 263064, 270015, 265884, 249949, 263246, 282361, 313763, 321080, 314576, 266230, 256699, 264830, 241645, 250408, 248725, 228184, 248681, 254752, 263499, 278230, 294817, 293435, 314931, 321588, 329012, 353833, 359620, 392983, 412731, 441147, 466310]
9939D66310K8109j4369l5918J9557j2644k4519k5636m0334k5906n509l5094P860
9927C01907L3889J7821j2761L025J6406K984M398K084j6088l0067p876j48L0694
9914C46268K3313J9661j6798j7248N2271M7912L5239M1154J9590L1599M2949L4945
9902F60855N6838N0307P2183J9058j6429K53K1760j264r140l445J7870K1365j4842
9889H75369m7157n8665m0454j3585n2709n2393n0136j4270j5948l1868m4642L283
9877D56825O612O717k037K3226K8845J8251k9849R809j6955k0005j5034l8741
9865D27664Q409K6993O413K0726K8056M8341M2583L6484N3738K8467K4726L3835
9853G86435K2660J6095J0228k7868k7435L5517L7716L4604J5180K6603J6915j8584
$$ y = [466310, 494419, 480050, 444132, 463689, 451045, 426526, 400890, 360556, 334650, 329141, 294047, 301907, 335796, 353617, 340856, 343881, 360287, 363271, 367669, 369753, 353665, 323598, 315722, 315574, 346268, 369581, 389242, 372444, 355196, 407467, 455379, 490618, 531772, 551362, 582961, 625910, 660855, 717693, 768000, 840183, 859241, 842812, 843065, 864825, 863561, 854421, 850976, 868846, 890211, 875369, 828212, 769547, 729093, 715508, 662799, 610406, 560270, 546000, 530052, 498184, 453542, 456825, 463437, 470154, 468117, 491343, 520188, 538439, 508590, 518399, 501444, 481439, 466405, 427664, 436073, 463066, 469479, 490205, 518261, 566602, 609185, 645669, 699407, 727874, 752600, 786435, 809095, 825190, 835418, 807550, 780115, 815632, 853348, 887952, 903132, 929735, 946650, 928066]
9841I28066k3312k6862l606r330m1571m2363m4261n70k1969K076j4782J135N319
9828G07970p106m288l9549m7438M77M4007p358m0043k23J4821K2211J4026R062
9815F66569l781j9975l0656Q305J5763q6o621j0633J4269J813j6041O207L5914
9802F61047J0846O3075R6604N9607N1975M7132J761m0408j9587j953l5574q6318
9790H08207n8046m2908j7328j8400k5803J6107m186j4452k7459k6954p462J0567
9778E91883o299l6891k6799l1526m795j2747k0975O888k95P598J2781l1589j3937
9765D33297k2061j6747r289K8834K3030J151K8712K0505J0146M6680J1923j804
9753E54377L7728J7874J3395l526j1103k7274k6236n0039j7536j5088j7608k9627
$$ y = [928066, 904754, 877892, 874286, 864956, 823385, 781022, 736761, 736191, 714222, 716298, 701516, 702651, 707970, 700864, 696576, 657027, 609589, 610066, 654073, 646715, 606672, 606449, 621270, 643481, 657507, 666569, 662788, 642813, 612157, 620462, 636225, 636139, 629518, 618885, 633154, 634967, 618926, 625133, 661047, 671893, 734968, 831572, 891179, 943154, 990286, 992047, 951639, 932052, 930099, 894525, 808207, 750161, 707253, 689925, 671525, 645722, 661829, 657643, 643191, 615732, 588778, 581316, 591883, 585584, 548693, 521894, 490368, 485573, 472826, 451851, 458739, 458444, 466042, 478823, 447234, 433297, 411236, 394489, 385200, 414034, 437064, 438215, 466927, 487432, 497578, 544258, 556181, 554377, 592105, 609979, 623374, 619848, 608745, 581471, 555235, 505196, 487660, 472572, 454964, 425337]
9741D25337n516r893J0082q00M841r56m265L8492K1435j0494l9723l5621J3156
9728D06075k1256J1656L950O293M222J2166J889j0143K315L7425J4131j4850k9370
9715D24503R849L8048L8314l51l0935r339r617p685n229n234J0798j0156M464
9702D47430o533k404p748K1804J1608M8166K6523q441l0467n095J0933O702J1938
9689E24416K0954J680N333J5334L68K048J000J2766O63j3502p206j0885j6230
9676E36739K111J6375K4393Q913k1616J907K628j4429J5981J6860K2703J9856
9664F32421p264k0461K8020K6835J4186L4420N434J2269j2544J9192L0240Q191
9652G70939j4574j1032K444m1419k6638l3453j4539M344o780j7020k352j305m882
$$ y = [425337, 419821, 409928, 420010, 419210, 424051, 423095, 418830, 457322, 478757, 468263, 428540, 392919, 406075, 384819, 396475, 400425, 406718, 410940, 423106, 424995, 414852, 417167, 454592, 468723, 453873, 424503, 434352, 472400, 510714, 510363, 479428, 470089, 460472, 452787, 447558, 442324, 453122, 442966, 447430, 440897, 438493, 430745, 452549, 464157, 512323, 538846, 530405, 499938, 494843, 505776, 512478, 524416, 545370, 547050, 552383, 567717, 568085, 570133, 571133, 583899, 584562, 571060, 563854, 552969, 536739, 538850, 555225, 579618, 588531, 566915, 568822, 571450, 557021, 573002, 589862, 612565, 632421, 625157, 604696, 632716, 659551, 673737, 708157, 713591, 725860, 713316, 732508, 762748, 770939, 756365, 745333, 747777, 706358, 679720, 646267, 631728, 636072, 629292, 612272, 609920, 608615, 603733]
9639F03733P652J321M206K7383k037q805j7579j4630r148J8240J7280p213j4015
9626F06388j1619j9267K76J3749Q850K9451P202k8200j8195K150J8442L5485K4054
9613F68766L9641K9241K8210J8697M0041K4666Q568j1289K7764l999k5686J2328
9601H56948J868j2370K0068M1549k5506l9538Q326N4957J6946J1145J4378K0280
9589I69051J8331M4558L9468O481L4216M1549O5878P8939P8915O8484J04555O7613
9577A618038O4916Q0507P7315P4587P4678P1289J34639K00332K79999L52679L44339
9566C373318K84520J80933J66363R9397l7878p6857q2172j2409K9035N0299P7458
9555D052007R3426J82995L08865L35621L66456L94105L52505L09737J92068P836
$$ y = [603733, 611385, 612706, 616912, 644295, 642258, 633453, 615874, 601244, 592096, 610336, 627616, 620403, 606388, 594769, 575502, 575778, 589527, 598377, 627828, 635030, 606830, 588635, 590785, 609227, 644712, 668766, 708407, 737648, 765858, 784555, 824596, 849262, 857830, 846541, 874305, 870306, 844620, 856948, 858816, 846446, 866514, 908063, 882557, 843019, 851345, 906302, 923248, 934393, 948771, 969051, 987382, 1031940, 1071408, 1077889, 1112105, 1153654, 1219532, 1298471, 1377386, 1445870, 1550425, 1618038, 1682954, 1763461, 1840776, 1915363, 1990041, 2061330, 2195969, 2396301, 2676300, 3028979, 3373318, 3657838, 3838771, 4005134, 4104531, 4066653, 3989796, 3907624, 3895215, 3924250, 3974549, 4052007, 4145433, 4328428, 4637293, 4972914, 5339370, 5733475, 6085980, 6395717, 6587785, 6595621]
9545F595621q5857j03890j32732j70844j51252j15340r4653l3499o106j7691K8793
9534E712550O5834J53398K37926L69186N53934P79546J053837J380496J548586
9525A1855293J461077J087473O43709K93386r3080o00244q77822r34533q62889
9516A1972370o94994n62452m55947l37737k48338j85556q1021J5778Q4833J27231
9506I634167K13747L18839M04703M61442N17638N93113O72969P93738Q75022Q54128
9496A5339506P67709O26613L89376J33089q3093j74180k28912j88555k5860K45938
9486A6801631N84328J033622J499589K026764K589664L280528M198495N347784
9478C7362405O619869P725511Q202133P440593N441661L133218J192481o38439
$$ y = [6595621, 6509764, 6405874, 6273142, 6102298, 5951046, 5835706, 5741053, 5707554, 5701448, 5683757, 5712550, 5778384, 5931782, 6169708, 6538894, 7092828, 7872374, 8926211, 10306707, 11855293, 13316370, 14403843, 15047552, 15340938, 15247858, 14647614, 13769792, 12835259, 11972370, 11277376, 10714924, 10258977, 9921240, 9672902, 9487346, 9406325, 9422103, 9506936, 9634167, 9847914, 10166753, 10571456, 11032898, 11550536, 12143649, 12816618, 13610356, 14485378, 15339506, 16107215, 16733828, 17123204, 17256293, 17173200, 16999020, 16770108, 16581553, 16555693, 16801631, 17385959, 18419581, 19919170, 21945934, 24535598, 27816126, 32014621, 37362405, 43982274, 51707785, 59909918, 67350511, 72792172, 75925390, 77117871, 76479432]
9470G6479432k344291l232939k845431j526175j18932R47354J562433K110458
9462G1031909K786943L438714L868784M400115N198509N889012N898391N007470
9454A07519847L675837K473796J314914l2605j426678k344022k617060k456863
9446A06107166k048942j370224m43111O65936J748446K696379L667984M670360
9438A15693994N890694P529009R709067J2544936J5588857J7083353J5249701
9431A99289611R972311L683229j922314p396762j2778170j6037515j5874063j3371340
9423A45564987j0190232p334216n239258l939884k975414k102016j378835p70026
9415A11635106M6611J009465J951972K762890L183162L111328K320472P91336
$$ y = [76479432, 74135141, 70902202, 68056771, 66530596, 66411664, 67359018, 68921451, 71031909, 73818852, 77257566, 81126350, 85526465, 90724974, 96613986, 102512377, 107519847, 111195684, 113669480, 114984394, 114951789, 113525111, 111181089, 108564029, 106107166, 104058224, 102688000, 102244889, 102910825, 104659271, 107355650, 111023634, 115693994, 121584688, 129113697, 138822764, 151367700, 166956557, 184039910, 199289611, 209261922, 212945151, 211022837, 203626075, 190847905, 174810390, 158936327, 145564987, 135374755, 128040539, 122801281, 118861397, 115885983, 113783967, 112405132, 111635106, 111681717, 112691182, 114643154, 117406044, 120589206, 123700534, 126021006, 126812342]
9407A26812342j046499k843288m472993n832438o512368o337734n583537m585200
9399H9598285l719232k998879k413295j881065j321444o97730J54769J310593
9391G8032002K431549K882401K156862L81689j722034l532418n089168o516927
9383F9023956p262483o998617o077847m965875l976376l172517k521122j927969
9375C2121150j473357j093303q38006o36058m77554l66198l85526n05158o68956
9366B5677034q83714j023176j085801j147333j154489j103529r83831q58588p77775
9357A6658798o93525n89293n35651m81622l88220l53655l32571k65106j92261
9348A2826894j32967q6922m5458L1650J34753J41912J76122J07232J6803j29887
$$ y = [126812342, 125765843, 122922555, 118449562, 112617124, 106104756, 99767022, 94183485, 89598285, 85879053, 82880174, 80466879, 78585814, 77264370, 76566640, 76721409, 78032002, 80463551, 83345952, 85502814, 85884503, 84162469, 80630051, 75540883, 69023956, 61761473, 54762856, 48685009, 43719134, 39742758, 36570241, 34049119, 32121150, 30647793, 29554490, 28716484, 28080426, 27602872, 27236674, 26851148, 26345990, 25677034, 24793320, 23770144, 22684343, 21537010, 20382521, 19278992, 18295161, 17436573, 16658798, 15965273, 15375980, 14840329, 14358707, 13970487, 13616832, 13284261, 13019155, 12826894, 12693927, 12607005, 12561547, 12593197, 12727950, 12869862, 13045984, 13153216, 13170019, 13040132]
9338A3040132l11097m26837n07253o45186o81791o32753n40097m20280l35664
9329H539174l04262k30843j76891j54395j20267j35519j23978j30464r2070r2188
9319F978297m8103m22J6364L4278N1804Q4245Q9223K7413l166m9836r2879j26794
9307F960424j48986j28088j12284j07597j09044r1912o8725n9953m7417o4644
9297F021774n0435j8601n8968m7778n5511n5437k8419j98K7598L6538K7588J9135
9285E817286O3183N5495J2837N0955M8369J7567O2801R1221O2330N2632P8438
9274F413114J00228R2370J16313J08040J01255J05622R8619J14715J32402J59768
9264G542446J63608J78464J88701J85718K15187K40581K02727K22008K52626K34943
$$ y = [13040132, 12729035, 12302198, 11794945, 11149759, 10467968, 9835215, 9295118, 8874838, 8539174, 8234912, 8004069, 7827178, 7672783, 7552516, 7416997, 7293019, 7162555, 7070485, 6978297, 6930194, 6929772, 6946136, 6980414, 7032218, 7116463, 7205686, 7233099, 7229933, 7180097, 7087218, 6960424, 6811438, 6683350, 6571066, 6463469, 6354425, 6262513, 6193788, 6133835, 6086418, 6021774, 5971339, 5952738, 5893770, 5845992, 5790481, 5735044, 5706625, 5706427, 5734025, 5770563, 5798151, 5817286, 5880469, 5935964, 5948801, 5999756, 6048125, 6065692, 6128493, 6219714, 6282044, 6334676, 6413114, 6513342, 6605712, 6722025, 6830065, 6931320, 7036942, 7135561, 7250276, 7382678, 7542446, 7706054, 7884518, 8073219, 8258937, 8474124, 8714705, 8917432, 9139440, 9392066, 9627009]
9254I627009K43540K84681L10800L10257L00123L36674L51071L55026M07056M14341
9244A2940578M32149M63039N17164N51228N61281N69280O21745O61057P05104
9235A8022625P56584Q20409Q53787R07772R75848J029154J090870J187259J286440
9226B6930748J393642J497809J576180J673100J811915K000601K109384K290438
9218D1283817K491861K717081K902420L074199L289297L480782L752837L983040
9210F6975334M175043M391685M535653M690784M754838M759085M629971M396121
9202A03308514M092246L658112L108483K429563J704111R08067L4806p77800j551403
9193A16914699k206321k839086l370565l735096m007584m142452m248214m295137
$$ y = [9627009, 9870549, 10155230, 10466030, 10776287, 11076410, 11413084, 11764155, 12119181, 12526237, 12940578, 13372727, 13835766, 14352930, 14904158, 15465439, 16034719, 16656464, 17317521, 18022625, 18779209, 19599618, 20453405, 21361177, 22337025, 23366179, 24457049, 25644308, 26930748, 28324390, 29822199, 31398379, 33071479, 34883394, 36883995, 38993379, 41283817, 43775678, 46492759, 49395179, 52469378, 55758675, 59239457, 62992294, 66975334, 71150377, 75542062, 80077715, 84768499, 89523337, 94282422, 98912393, 103308514, 107400760, 111058872, 114167355, 116596918, 118301029, 119209096, 119243902, 118466102, 116914699, 114708378, 111869292, 108498727, 104763631, 100756047, 96613595, 92365381, 88070244]
9185H8070244m236025m132354l978262l795451l635497l468643l268002l100914
9177E8455096k917624k729212k561401k443156k266216k132799j994111j859717
9169C9550860j733977j658765j600918j494099j405017j287988j241422j177552
9161B7951122j105947j043259r77677r27119r18892q40936p68329p28451p17102
9152A9923410o54185o36529o34479o01703n63853n33317m75936m57001m50025
9143A4916382m61338m37136l94125l93531l95056l77434l69580l42193k92617
9134A1453372k95298l07426k98957k90687k64394k87527k83995k55788k51595
9125H917705k73162k53873k13398k02463k20054k25080k29868j87995j52361j89828
$$ y = [88070244, 83834219, 79701865, 75723603, 71928152, 68292655, 64824012, 61556010, 58455096, 55537472, 52808260, 50246859, 47803703, 45537487, 43404688, 41410577, 39550860, 37816883, 36158118, 34557200, 33063101, 31658084, 30370096, 29128674, 27951122, 26845175, 25801916, 24824239, 23897120, 22978228, 22137292, 21368963, 20640512, 19923410, 19269225, 18632696, 17998217, 17396514, 16832661, 16299344, 15823408, 15366407, 14916382, 14455044, 14017908, 13623783, 13230252, 12835196, 12457762, 12088182, 11745989, 11453372, 11158074, 10850648, 10551691, 10261004, 9996610, 9709083, 9425088, 9169300, 8917705, 8644543, 8390670, 8177272, 7974809, 7754755, 7529675, 7299807, 7111812, 6959451, 6769623]
9115F769623j94667j62364j58385j57966j47132j37318j03282j21692j04929p7884
9105E404004n8833j06492j28635j18133j09709j10164r7637j14986j22581r8512
9095D338322j07643r2303q8757j08609r0707o4300m7763m4534m5204p8556n5528
9084C514418n0611m4546l6138m6142m4519l8388k1968l8284l0432k3592m0345
9073C099453l6444k4181J3739j3051l1485n0685n0631k1515O695K3913M5311K9212
9061B990331K8066J736J3077n038j7389k8352m6676m1498o2432m8251n8349n8023
9049B667202k8064k6611m6504p8666k3675j5510l5668k3395m5339n0257n0061
9038B243452j9811j319j3028l1157j2380K741j4039k4608k0859p382m742O244
$$ y = [6769623, 6574956, 6412592, 6254207, 6096241, 5949109, 5811791, 5708509, 5586817, 5481888, 5404004, 5345171, 5238679, 5110044, 4991911, 4882202, 4772038, 4674401, 4559415, 4436834, 4338322, 4230679, 4138376, 4049619, 3941010, 3850303, 3786003, 3738240, 3693706, 3648502, 3569946, 3514418, 3463807, 3419261, 3383123, 3336981, 3292462, 3254074, 3232106, 3193822, 3163390, 3139798, 3099453, 3063009, 3038828, 3052567, 3039516, 3008031, 2957346, 2906715, 2885200, 2891895, 2915808, 2961119, 2990331, 3018397, 3020133, 3033210, 3028172, 3010783, 2982431, 2935755, 2894257, 2831825, 2783574, 2725225, 2667202, 2639138, 2612527, 2566023, 2487357, 2463682, 2448172, 2412504, 2389109, 2343770, 2293513, 2243452, 2223641, 2222322, 2209294, 2178137, 2165757, 2168498, 2154459, 2129851, 2108992, 2101610, 2096868, 2103112]
9026B103112r621p517l686j8790l9443l4332J8060r319M613O0745L4717M4061
9014B142600J4133k8097J936j6001J941k935K697k07r931l4791j1073k1363M645
9001B043554p600m9585m6301n5468n3249k6559n2991p1460l5681j1424k2139k3072
8989A588025l1958L238L780j0935j4631l3117k8386n1180o5583m5744m499k516
8977A306494k0010K766j5032l1116k9165r93L6391K4902J3648L1328M4016L3814
8965A397043j2870o476R957K5254m148k1581k99J896l0579n874Q65m5810n2242
8952A255136j9605l2079k5802n0199m5631k9747l6379l0665k0990k6119k2100
8941I15820o369k0596l0659k6061j2266q060l977K3773J7575k5778j2662p703
$$ y = [2103112, 2093491, 2085974, 2082288, 2063498, 2024055, 1989723, 2007783, 1998464, 2003077, 2063822, 2098539, 2142600, 2156733, 2128636, 2130572, 2114571, 2116512, 2113577, 2116274, 2116067, 2106136, 2071345, 2060272, 2038909, 2043554, 2035954, 1986369, 1940068, 1884600, 1831351, 1804792, 1751801, 1680341, 1644660, 1633236, 1611097, 1588025, 1556067, 1559305, 1563085, 1552150, 1537519, 1504402, 1476016, 1424836, 1359253, 1313509, 1309010, 1306494, 1286484, 1289250, 1274218, 1243102, 1213937, 1212944, 1249335, 1274237, 1287885, 1319213, 1363229, 1397043, 1384173, 1377697, 1387654, 1412908, 1408760, 1387179, 1386880, 1388776, 1358197, 1352323, 1353188, 1307378, 1255136, 1235531, 1203452, 1177650, 1127451, 1081820, 1052073, 1015694, 985029, 964039, 937920, 915820, 909451, 888855, 858196, 832135, 819869, 811809, 807832, 831605, 849180, 823402, 810740, 803037]
8929H03037O362j9481o656j7468L4635K2709M863j5316q257L355N294Q270J3498
8916H34845k547j4438k6102k6505l7601R228K8930L942r304j7838j5402k1444
8904G05764j9681m573j1051k41L781j6024q906K8667j4688L447J8024j5767L8567
8891G07319J0004j134o303K5002J6853L8764L6163N39j324J0713L2445O9209L7869
8878I76119Q230L0613L3084J04268J12493J21495J01713J41299K03941K61674
8868B094929M09345O29740R56358J346565J667470J609568J024772K68252j67390
8859I839609m45976j053644j501972j421704j089518p67791n03283l63727k67906
8850B424088k42044j99603j33465j12268j03472r9729q3932r3478r2606o3275
$$ y = [803037, 809399, 789918, 783262, 765794, 800429, 823138, 828001, 812685, 804428, 807783, 813077, 821347, 834845, 832298, 817860, 791758, 765253, 727652, 736880, 765810, 769752, 760448, 742610, 727208, 705764, 686083, 681510, 670459, 670218, 673999, 657975, 649069, 677736, 663048, 666495, 684519, 668752, 707319, 717323, 716189, 709886, 734888, 751741, 790505, 826668, 827207, 825883, 836596, 869041, 938250, 976119, 984349, 1014962, 1048046, 1152314, 1264807, 1386302, 1488015, 1629314, 1833255, 2094929, 2504274, 3134014, 4090372, 5436937, 7104407, 8713975, 9738747, 10006999, 9839609, 9393633, 8339989, 6838017, 5416313, 4326795, 3559004, 3055721, 2691994, 2424088, 2182044, 1982441, 1848976, 1736708, 1633236, 1533507, 1449575, 1356097, 1263491, 1200216]
8840A200216o2791o0136n8615n0899k0203k1729m0504k3566j9312l1260l2748
8829G78453k2780J0746j5205j4959N184j6689l0343j0177R373p087m3952k5752
8817F16812J9831M925l0359k7297j0436J413J947k390r224K2646M404r463J2535
8804E95344n209l3572k2961k2890j6102J1764L0465l7638p335J9836J6374j3679
8792E14397j9551j8740k9329j2636J3417p37l6908l4682L2517L8261O00m109l1454
8779D11046k7623J380Q012R39J642K0085j1892j5612j3722J786j2872K5996K2118
8766D11283j2718j4008j0938L1235J1198j8137k98l442j3105k6912J573M0210
8754C95941J7n802j0321j218M146l208O655J7461j8639o143m39O066k370k0690
$$ y = [1200216, 1137425, 1077289, 1018674, 967775, 947572, 925843, 885339, 861773, 842461, 811201, 778453, 755673, 766419, 751214, 736255, 741439, 724750, 694407, 684230, 693603, 686516, 642564, 616812, 636643, 641568, 611209, 583912, 573476, 574889, 576836, 574446, 565222, 587868, 592272, 582809, 595344, 590135, 556563, 533602, 510712, 494610, 506374, 536839, 499201, 491866, 511702, 528076, 514397, 494846, 476106, 446777, 434141, 447558, 446821, 409913, 375231, 407748, 446009, 446609, 442500, 411046, 383423, 384803, 392815, 393754, 395396, 415481, 403589, 387977, 374255, 376041, 363169, 389165, 411283, 398565, 384557, 373619, 404854, 416052, 397915, 397617, 394175, 381070, 354158, 355731, 395941, 395958, 390156, 379835, 378617, 382763, 379555, 386210, 403671, 385032, 378889, 378450, 384516, 382146, 361456]
8740C61456j5898N822p920k469J4482J6757p431j585J8557k3589j0759l952l921
8727C39550L3459K4883m945j6462j5724k4050j913K1088K955p170L705Q81j910
8714C54347L092l8871l2793Q376j302j6636J044K6421M1340j3142k6135j762R322
8701C13301Q520J160Q076J8717j034J0748k777j5733q186j9532j3720J3717j6987
8688B96270j2894J3546K2762J0276j6932j71l893J607O33k5964J5192K7932k1842
8675C06522j8295k7342J3285K723j5364j8136J0909N0268J5752P753m969l2036
8663B91070j8881K6156K4485M507k1746o161K9841L0410k5944m171N913j1448
8651C24031k624K1525Q686o681R902M531q737j3759q808k5115l458J5686R554
$$ y = [361456, 345558, 351380, 343460, 340991, 355473, 372230, 364799, 363214, 381771, 358182, 347423, 343471, 339550, 373009, 397892, 392947, 376485, 360761, 336711, 334798, 355886, 358841, 351671, 355376, 356257, 354347, 357439, 318568, 285775, 294151, 292849, 276213, 277257, 303678, 345018, 331876, 305741, 303979, 313301, 321821, 322981, 331057, 349774, 348740, 359488, 356711, 340978, 332792, 313260, 299540, 313257, 296270, 283376, 296922, 319684, 329960, 313028, 312857, 308964, 310571, 311204, 285240, 300432, 328364, 306522, 288227, 260885, 274170, 276893, 261529, 243393, 254302, 304570, 320322, 328075, 323106, 291070, 272189, 298345, 322830, 327337, 305591, 299430, 329271, 359681, 333737, 329566, 335479, 324031, 321407, 342932, 351618, 344937, 354839, 359370, 350633, 336874, 328066, 302951, 299493, 315179, 324733]
8638C24733K4622j5484K773J2644J1841J1715J5207r99k1842k0201k3204P564
8626C29369q024N871l6033l1334q084J2988L623K4107J330r349K437L3754J0345
8613C31000J0217J6794J5306r325o244J1936K3103k2975l2408o228K7605K7808
8601C86589o281p192R216k0272k538J8818J0715N673J0888J3510J5906J8840L248
8588D57120J6372L217J2552M1873J8929j6344k0106J3823n712k7458n919n624
8576D82723n3010l7579J7263J4092j2738l0655m385r109k0400j3274j4282k0730
8564B97916R169J1044k0089j1208J1267l535J0390K0948N374O352o032J1069n291
8551C37374k0039l931o800Q01j569j5117J0376l258r70O055M917k5374J274O940
$$ y = [324733, 349355, 333871, 336644, 349288, 361129, 372844, 388051, 387052, 365210, 345009, 321805, 329369, 321345, 327216, 291183, 259849, 251765, 264753, 268376, 292483, 293813, 284464, 286901, 320655, 331000, 341217, 358011, 373317, 363992, 357748, 369684, 392787, 369812, 337404, 331176, 358781, 386589, 380308, 373116, 382332, 362060, 359522, 378340, 389055, 394728, 405616, 419126, 435032, 453872, 457120, 473492, 476709, 489261, 531134, 550063, 533719, 513613, 527436, 521724, 494266, 488347, 482723, 429713, 392134, 409397, 423489, 410751, 380096, 375711, 366602, 346202, 332928, 318646, 297916, 307085, 318129, 298040, 286832, 298099, 294564, 304954, 325902, 331276, 337628, 331596, 342665, 337374, 317335, 313404, 306604, 307405, 305836, 290719, 301095, 297837, 296867, 302922, 307839, 282465, 283739, 290679]
8537B90679k0887n030m31R531k378K401l236J3730N2307K1438j5723l9387k8641
8524B74373k897J2315N236J9750q129k7481R718J813j7867j989K1514k131k985
8511B81240k9521k2002j312j8144r301K6097J3243j0588j7149Q227J129L3756
8499B55675M7048j4280l1302l0507J5268o562N633O862k168J0692P725m268n79
8486B59237l959L4016j7019n997K1650Q235j8982M498m340l8610q446M693p633
8473B27343P557K3563r215p451J2737K570k2978k1376KJ2767L884K7790j247l7902
8459B18044j3709K837J0910M820k4188J8596j3028k849J3959j1545k9198N983
8447A80632J293k525K0530j8724k3617J5049J6614J4796J2022r793O794K6970
$$ y = [290679, 269792, 264762, 264331, 273862, 271484, 273885, 270649, 284379, 336686, 358124, 342401, 303014, 274373, 271476, 283791, 289027, 308777, 300648, 273167, 282885, 284698, 266831, 264842, 286356, 284225, 281240, 251719, 229717, 228405, 210261, 200960, 227057, 240300, 229712, 212563, 220790, 221919, 255675, 302723, 288443, 257141, 226634, 241902, 235340, 240973, 247835, 245667, 256359, 264084, 259816, 259237, 255278, 289294, 272275, 266278, 287928, 296163, 277181, 281679, 277339, 238729, 230283, 234976, 227343, 234900, 258463, 249248, 241797, 254534, 257104, 234126, 212750, 212752, 225519, 229403, 257193, 255946, 218044, 204335, 207172, 218082, 222902, 198714, 217310, 204282, 201433, 215392, 203847, 174649, 180632, 181925, 179400, 199930, 181206, 157589, 172638, 189252, 204048, 216070, 206277, 213071, 240041]
8435B40041j6923l462K1396j9342l3625J022L648L885L319N669K738q906l965
8422A95495J8480K9068k1917j2281M774J9772K5314l0408P530j6822j4847r792
8410A94366l474n577R660J0758M4385n182k1189P642j1752k7429K7337N253P289
8397B32087k1877j9956J2362J3452M713j778q042l57J6472j5401J2157l870l6992
8384A82970m6181J2611K2248Q735Q573k2092l83K6515M840P62J1364J3779J5400
8371B39141k7300k9794j9539P475M539r994J821r998n547j3109N2685O4779p46
8358B54413n0963k6255J7221l041j9842R611Q800K91J5439k5584j0219K703R525
8345A82099L411J9480l007k3831k1396n560j5753m445j2358J3199K0266j2622
$$ y = [240041, 223118, 219656, 241052, 221710, 188085, 189107, 192755, 196640, 199959, 205628, 208366, 199460, 195495, 213975, 243043, 221126, 208845, 213619, 233391, 258705, 228297, 235827, 219005, 204158, 194366, 190892, 185315, 194975, 205733, 250118, 244936, 223747, 231389, 219637, 192208, 219545, 224798, 232087, 210210, 190254, 202616, 216068, 220781, 219003, 210961, 210604, 227076, 211675, 223832, 219962, 182970, 136789, 149400, 171648, 180383, 188956, 166864, 166481, 192996, 197836, 198598, 209962, 223741, 239141, 211841, 182047, 162508, 169983, 174522, 164528, 166349, 156351, 150804, 137695, 190380, 255159, 254413, 203450, 177195, 194416, 191375, 171533, 181144, 189944, 190235, 205674, 180090, 169871, 172574, 182099, 185510, 204990, 201983, 178152, 156756, 151196, 135443, 130998, 118640, 131839, 152105, 139483]
8333A39483J2263K4430J1578j6780l8529O883K9431K0124k4761k3191J912k687
8321A40156r700j3018J2208k4989K0575M0398l942k2352k2686j785M77K1726O625
8308A43693R289j8006j5904o251j9988q693J6125R809Q421L8141K05j9458r754
8295A27629k0755j850n898K8384N087J483J026k2089l741J6512m911J9440N072
8282A45389k5349j771J71K598J2020j9799k2050J6779J5482m770N619n473N998
8269A24844N993p908j2999k3185k354J1910J0697K0686K667j114k9876m3130J2321
8256F8552K7438L425n355k6805q359K3896J1814P041j1588M959p0O906j3131j6503
8242G2220k562J8082J2006K0383m6576k1616K8957J0813j168J4839N371k46n022
$$ y = [139483, 151746, 176176, 187754, 170974, 132445, 139328, 168759, 188883, 164122, 140931, 142843, 140156, 130456, 117438, 129646, 104657, 125232, 165630, 161688, 139336, 116650, 114865, 115342, 137068, 143693, 152982, 134976, 119072, 112821, 92833, 84140, 100265, 110074, 118495, 156636, 156841, 137383, 127629, 106874, 105024, 99126, 127510, 132597, 134080, 135106, 113017, 109276, 125788, 120877, 140317, 145389, 120040, 118269, 118440, 121038, 133058, 113259, 91209, 107988, 123470, 118700, 124319, 118846, 124844, 130837, 122929, 109930, 86745, 84391, 96301, 106998, 127684, 130351, 129237, 99361, 56231, 68552, 95990, 99415, 94060, 67255, 58896, 82792, 94606, 101647, 90059, 95018, 94948, 101854, 88723, 72220, 69658, 87740, 99746, 120129, 73553, 51937, 80894, 91707, 90539, 105378, 110749, 110503, 105481]
8229A05481Q42K8797N28k2654O116j3109O6Q680n336q782j9473q935J6521J8488
8215A07230l285J686N955K7554j4852k3836j2385J2811J1285O766j1550j1615
8203I5764J8851K6107j4118l1192J1587l2748L271L9209l654J300O293o193k1278
8190I3199J850K4565j3607l6860J0504J1203K5194o094K323L7406K3107k905l4506
8177A35379m899j0898m6498M211J7004j1345l850P87p356j3705M464n915M726
8164F2105K6227K363j2898M596K7614K8780k6530j2631J7155M350k2205j1442
8152H7484o281p183q006j0632j709J6366J7965j1092M153L229j0518K1328J0203
8139A05307j4932J7598J9431q637m4938k489K9995j201k8979j8590J648K6151
$$ y = [105481, 106323, 135120, 135648, 112994, 119110, 106001, 106067, 114747, 109411, 100629, 81156, 72221, 88742, 107230, 103945, 105631, 111586, 139140, 124288, 100452, 88067, 100878, 112163, 118929, 107379, 95764, 114615, 140722, 126604, 95412, 106999, 74251, 77522, 116731, 113077, 114377, 120670, 114477, 93199, 95049, 119614, 106007, 69147, 79651, 90854, 116048, 109954, 112277, 149683, 172790, 169885, 135379, 130480, 119582, 73084, 77295, 94299, 82954, 79104, 79891, 72535, 58830, 63294, 57379, 62105, 88332, 90695, 77797, 82393, 110007, 138787, 112257, 99626, 116781, 121131, 98926, 87484, 81203, 74020, 66014, 55382, 53673, 70039, 88004, 76912, 81065, 84294, 73776, 95104, 105307, 90375, 107973, 127404, 118767, 73829, 71340, 101335, 100134, 71155, 52565, 54213, 80364]
8127H0364l473J2190r228k7290j0319L8108J8950j3701k0731p109j8918J0383
8115D9226L0941K7876R586j7397q992L046r815j6846K1301J5715j684k1881l5820
8102D5256Q799R193J8402o854k6242j1440J5519J5579q028k8944k4863j0981k83
8089d887J4247L9385M6420K2298j3798p008L217R997m231p285o915P511j6809
8076H2142r686K3166K0443K248k4927j7141N05j9657j9599K1078L9810L0967J2542
8063A41891K019J2293j0594J803j09j3550J624n623M407P011j2463l5504o636
8050H6569J1667O993J0710p276k3489J077K2670j3077k7363k0129J068J910R831
8037F1161Q018n67k526K5346K6013q802q878k0841k5061R296K2029K9643Q925
$$ y = [80364, 76891, 89081, 79853, 52563, 42244, 80352, 99302, 85601, 64870, 57761, 38843, 49226, 80167, 108043, 117629, 100232, 91240, 94286, 84471, 67625, 88926, 104641, 102957, 81076, 45256, 54055, 63248, 81650, 74796, 48554, 37114, 52633, 68212, 60184, 31240, 6377, -4604, -4887, 9360, 48745, 95165, 117463, 103665, 96657, 99874, 109871, 105640, 98355, 91440, 98951, 82142, 72456, 95622, 116065, 118313, 93386, 76245, 76750, 57093, 37494, 58572, 98382, 129349, 141891, 143910, 156203, 145609, 147412, 147303, 133753, 135377, 129754, 134161, 141172, 128709, 93205, 86569, 98236, 105229, 115939, 108663, 85174, 86251, 108921, 95844, 68481, 48352, 49420, 51330, 61161, 69179, 68612, 66086, 91432, 117445, 108643, 99765, 78924, 53863, 63159, 85188, 114831, 123756]
8024A23756j0763J2342J6492j3722j3415O609J4044J0345l3884k887q87q030k3813
8011G6187J0829n428k600J2434L6430J3722j402K29P87l1863M207O698j3368j0475
7997I6387Q593K7772L4840Q309m821R974m680k586J6855O272L271J7446k4133
7984A93499j6786R685k7194N029M623K722m669k8575j6617r152l0196K7236K2832
7971A32437k2343j3590K774o797K099L347K7227J6697K315r360L409J0956l2432
7958A16739j6649K6795J8004m848M320J3971K0997K365N838l367k507k3438k1770
7945A36450j8149k5498q73J4491Q165K8445r65p706J554K8517J0062j5326k8119
7932A31048M855k4854o704K365J6796K7934m358l4034k2569q075j7154o642O668
$$ y = [123756, 112993, 125335, 141827, 128105, 114690, 121299, 135343, 145688, 111804, 108917, 108030, 100000, 76187, 87016, 81588, 78988, 91422, 127852, 141574, 140172, 140401, 141188, 109325, 113532, 120230, 106862, 96387, 104980, 132752, 167592, 175901, 171080, 181054, 176374, 173788, 190643, 196915, 200186, 217632, 193499, 176713, 186398, 159204, 164233, 168856, 171578, 166909, 138334, 121717, 112565, 82369, 109605, 132437, 110094, 96504, 99278, 92481, 94580, 97927, 125154, 141851, 144166, 134806, 138215, 149171, 116739, 100090, 126885, 144889, 140041, 144361, 158332, 179329, 181694, 187532, 184165, 181658, 158220, 136450, 118301, 92803, 91930, 106421, 114586, 143031, 142066, 134360, 135914, 164431, 174493, 159167, 131048, 135903, 111049, 104345, 106710, 123506, 151440, 147082, 113048, 90479, 82404, 65250, 58608, 65276]
7919F5276j5094j1312K0726K2467J3439j2431M384k0141J0169J6005R487K5005
7907A27980m839l2751J0624L0552r086P975o903n2733j7562J1482J1601J9180
7895I5520J7383l1925j2136P414j6634K0056L448j6680q330j1697j3210K4842
7883E8051k326N618J3395J1982k7765k7255o176L2139N2162J6858l5566j9757
7871G1360k597K885j2199k8755j157K8203L5747J2789k3714k2236n252k1507M639
7858C8206L8325O383M403k0567K2130J5708l0359l1047k1023p898J4240j5678
7846A2823o039m236K6040J8484R714L388K187J2948M888j4923n767r267J1938
7833F2178k8793k2889N022R618q290J032J836J5293j1678P400N736l084J7316
$$ y = [65276, 50182, 38870, 59596, 82063, 95502, 83071, 87455, 67314, 77483, 93488, 102975, 127980, 123141, 90390, 101014, 131566, 122480, 130455, 123552, 70819, 53257, 64739, 76340, 95520, 112903, 80978, 68842, 76256, 59622, 79678, 83126, 66446, 58116, 46419, 33209, 58051, 55725, 61343, 74738, 86720, 58955, 31700, 25524, 57663, 109825, 126683, 91117, 71360, 68763, 71648, 59449, 30694, 29537, 57740, 93487, 106276, 82562, 60326, 55074, 33567, 38206, 76531, 82914, 87317, 66750, 88880, 104588, 74229, 43182, 22159, 14261, 28501, 12823, 6784, 2548, 28588, 47072, 56786, 60174, 62361, 75309, 80197, 65274, 59507, 50240, 62178, 33385, 10496, 15518, 25136, 16846, 17878, 19714, 35007, 23329, 30729, 36465, 33381, 50697]
7820E0697R116o254k1191J1491j843j6529L966J3851J9659p453J3613k3142J4224
7807F0205P850q216j2172l8934k0852K3491K2358l441Q292k354P884j0531L268
7794C6848K3961k4174k1783l754M821J5920J7039L260p627Q667L1409j5341o234
7781F3012k095n0343n911J9546k294k1712L0472J4889q201K603j5479L862K0973
7768D9322P934k6253K220L667J4181J0729k086m0487k2866L1816K4270j3631j8163
7755B0653j375M192j6635J2573J4549L040k7867n098j7149q692L2009J5758k7233
7742a275k9317K0376K3133k104J7137o57J251J3118J1851m332L2338J2196J859
7729I5574j4840O733K402l1812j0557j5059p974k7962k837J1038R065o883R720
$$ y = [50697, 59813, 53559, 32368, 43859, 42016, 25487, 29453, 43304, 62963, 55510, 69123, 45981, 60205, 68055, 59839, 47667, 8733, -12119, 11372, 33730, 30289, 38581, 36227, 44111, 33580, 36848, 60809, 36635, 14852, 11098, 15919, 31839, 48878, 52138, 44511, 53178, 84587, 69246, 63012, 60917, 10574, 4663, 24209, 21915, 203, 30675, 45564, 37363, 39966, 24487, 28349, 49322, 57256, 31003, 33223, 36890, 51071, 61800, 59714, 19227, -3639, 28177, 52447, 38816, 20653, 19278, 23470, 6835, 19408, 33957, 36997, 9130, 4032, -13117, -21809, 10200, 25958, -1275, -30592, -10216, 12917, 10813, 27950, 27293, 28544, 41662, 53513, 49181, 81519, 93715, 95574, 80734, 87467, 89869, 58057, 47500, 32441, 24467, -3495, -6332, 4706, 13771, 6888, 16608]
7716A6608J5745J7229p299K089n515k0654j5932J5329k788k1937m565P462J0801
7703F573J871k60j8363J67J9251J0681J6479j5000k6757J3614p47K480K6982M4070
7689H1041N154l0965L401q695j5297l6288K0112L5227J1490J1775j4047k1862
7677D1046k466K216L76l4645l167P241j8075O019K7454J8359J3907j9384l231
7664C5650p622J3852J1718j4688K944j6842J918K1085Q993o126Q706q834l2426
7651A8328N376J2445K1078l673r007r014l801j2794P265L3308J9281j6324l1182
7638C1286o009J2404J3081K5544K4617q198k5829m6410k2412K272q882K9780L170
7625B4414m0519J307K1312J3996K1340Q171k5309j7040K319k7227K85L345K126
$$ y = [16608, 32353, 49582, 42283, 44372, 38857, 18203, 2271, 17600, 14812, -7125, -11690, -4228, 6573, 8444, 8184, -10179, -10012, 9239, 19920, 36399, 21399, -5358, 8256, 7509, 9989, 36971, 81041, 86195, 55230, 58631, 49936, 34639, -1649, 18463, 53690, 65180, 76955, 62908, 41046, 38580, 40796, 41172, 6527, 3360, 10601, -7474, -1455, 25999, 44358, 58265, 38881, 35650, 28028, 41880, 53598, 38910, 41854, 25012, 26930, 48015, 57008, 50882, 59588, 50754, 18328, 23704, 36149, 57227, 53554, 44547, 35533, 31732, 18938, 26203, 59511, 78792, 62468, 31286, 25277, 37681, 50762, 76306, 100923, 92725, 66896, 20486, -1926, 346, -8536, 21244, 24414, -16105, -14798, 6514, 20510, 41850, 50021, 24712, 7672, 9991, -17236, -16951, -13606, -11480]
7612a1480j8269K0978R504j4213J3849K6266M4010m573k6446m168n851J4149j1089
7599C2667m1074n534J0223P935J0455K2082l411j7079k4614O515J4844o324l548
7586C137j0665J7704j6348J1273J3670O215J3923R194k4704k1536L3678J9633
7574E5174m2794l0222K1403j0710j0233J355L9765N317j5278J3965o636j6342
7562D764O415k1915J4205R796r386K3807J4794k5459o481j3904j2507J6027P637
7549G793L432K883k4698L0693K3940K389j2462k0818r16J8803k1153j1368j4822
7536a6304O045J3278l062j7838m040N288K1388o901j7729J4007L2092j6552l056
7523F616j3949l6777J1885M5483K8960M810j7074r922K1743k48j1285j0068J6309
$$ y = [-11480, -29749, -8771, 733, -13480, 369, 26635, 70645, 66072, 39626, 35458, 29607, 43756, 32667, -8407, -13941, -3718, 4217, 14672, 36754, 33343, 16264, -8350, -1835, 13009, 6685, 3137, -7528, 10176, -6172, 5101, 18771, 24986, 38909, 48103, 23399, 1863, 35541, 55174, 12380, -17842, 3561, -7149, -17382, -16027, 23738, 29055, 13777, 27742, 21106, 4764, 11179, -10736, 3469, 13265, 3879, 27686, 42480, 17021, 10540, -3364, -15871, 156, 7793, 11225, 14108, -10590, 20103, 44043, 46432, 33970, 13152, 12236, 31039, 9886, -1482, -16304, -10259, 3019, -43, -17881, -21921, -16633, 4755, -2146, -19875, -5868, 26224, 9672, 6616, -7333, -44110, -32225, 13258, 42218, 47028, 29954, 20032, 41775, 41527, 30242, 20174, 36483]
7510C6483K6473j4184k8028n760R761J8797K518K3534J1384R67o836k3804k8813
7497B2492j7528k5237j333J2885p144J2325J5037j1438p948J0514L3960m406q0
7484C2099j8413j7060J3499L500J8327K8265l2189l9311k3362O370J6688m062
7472a5649R803j657P73J52j788R908j6705k251R857J6684L4510j9656j3720Q457
7458A8718k4079j8988J6296M308J2563R311j4679J364K7395L0726m3177l9787
7446b0029j6655K6536o514N923K5709M978Q332j7697j3704j9408K9545K5059K0699
7433E2774M345k6136j7329M423L748m627J5332J0629k5502j64p901j9416R676
7420a48K9210j0860k050k0096j4640J3029p427k074q070J3234J0395K7368L0336
$$ y = [36483, 62956, 48772, 20744, 14984, 24745, 43542, 46060, 69594, 80978, 81945, 75109, 51305, 22492, 4964, -20273, -21606, -8721, -15865, -3540, 11497, 59, -7889, 2625, 36585, 32179, 32099, 13686, -3374, 10125, 13625, 31952, 60217, 28028, -11283, -34645, -28275, -11587, -15649, -5846, -7503, -6730, -6578, -8366, 1542, -15163, -17414, -7557, 9127, 43637, 23981, 10261, 18718, -5361, -24349, -8053, -3745, 8818, 18129, 3450, 4814, 32209, 62935, 19758, -20029, -36684, -10148, -16662, -10739, 14970, 19948, 28280, 10583, -3121, -22529, 7016, 32075, 52774, 57119, 30983, 13654, 18077, 21825, 17198, 32530, 43159, 17657, 17493, 9592, -9824, -148, 29062, 18202, 16152, -3944, -18584, -5555, -12982, -15056, -23126, -9892, 503, 27871, 58207]
7407E8207r618k754n653j6844L461R277j6922n77o700q837L7485O814J2389j9150
7393D0578k2924L937L850j1117l6720o305q20J7484N197k080j9296K859K5542
7380A85J268L881J8981j8023N587J4490j5723L527m36r157l256j3585K8112p213
7366H638m4954j7060Q119N261K1164J6864K0629O184j378l558q965l50R412J1855
7352C1861l5038L274J003k0319K8618J9705J608o010k9501k7511q099J0658J7313
7339a2438K0957L098K614j3604k4397k153R42L2920J8853J2332k345l401j0682
7326B2696P917j236k3041L019J4824J9419k1419j8796n811J8499J1776J1492k5638
7313A3701m0527j237R786Q270K0563l439r326P000j545r873j950R871Q789Q635
$$ y = [58207, 48589, 45835, 40182, 23338, 26799, 36076, 19154, 18577, 11877, 3040, 40525, 47339, 59728, 40578, 17654, 21591, 25441, 14324, -22396, -28701, -29521, -12037, -6840, -8920, -28216, -25357, 185, 1453, 5334, 24315, 6292, 11879, 26369, 10646, 14173, 13737, 4580, 1324, -12261, 15851, 8638, -36316, -53376, -45257, -39996, -18832, -1968, 18661, 24845, 23467, 19909, 10944, 10594, 20006, 31861, -3177, 97, 1100, -19219, 9399, 29104, 30712, 24702, -4799, -32310, -40409, -29751, -12438, 8519, 11617, 14231, 627, -23770, -25923, -24981, 7939, 26792, 39124, 36779, 33378, 22696, 30613, 29377, 6336, 9355, 24179, 43598, 22179, 3383, -2428, 16071, 27847, 39339, 13701, -26826, -28063, -18277, -10007, 10556, 7117, -2209, 4791, 3246, -6627, -8577, 1294, 10083, 18718]
7299A8718R608J1797K6636q419k9794l5854J3686K5099J4468k0519j4427j0863
7287A36J7523K6066O549j5841m074K3372J3758k5096k5365l507L8707J6886j3666
7274E5448j9464k7519M686o062j9061J9746Q601k2268r47J8456n650J01K2243
7261B8310l010k470n588K4939K4638k3196j8289K519j5276r125P520J6468r348
7248A8092p956J3369j9019l5659O003J0515J9096K9202j1287O084L763o567k7733
7235b097j2978R675O624R919q360j1753N347R228N307K1467J8964n3682j4092
7222a6431j3656J3646J9365q919k5665N623K4561j6435k420K240J2941J1822j947
7209D725K8391J1000j0265J5911l6308k7900Q118K3803K8226p063m2888j0985
$$ y = [18718, 28326, 40123, 66759, 58340, 28546, -7308, 6378, 31477, 45945, 25426, 10999, 136, 17659, 43725, 50274, 34433, 30359, 53731, 67489, 42393, 17028, 13521, 52228, 69114, 55448, 35984, 8465, 13151, 7089, -11972, 7774, 16375, -5893, -6840, 11616, 5966, 6067, 28310, 25300, 22830, 17242, 42181, 66819, 43623, 25334, 27853, 12577, 3452, 10972, 27440, 18092, 10136, 23505, 4486, -31173, -25170, -14655, 4441, 33643, 22356, 28440, 32203, 25636, -2097, -15075, -5400, 1224, 11143, 2783, -8970, -3623, 5605, 10912, 32379, 51343, -2339, -16431, -30087, -16441, 2924, -5995, -31660, -26037, -1476, -17911, -20331, -18091, -5150, 6672, 4725, 33116, 44116, 33851, 49762, 13454, -14446, -6328, 17475, 45701, 38638, -4250, -15235]
7197a5235l616M761j1801Q658L088J461l907j6886J9144j980K271J5966K1750
7184B3674K8057L714m5089j6681O135j2719J4081J6500k5716L637J0600k4912
7172a8719j6270L497m580l277J617K4572J6826K0073p824k5042L3865K0099q558
7159C6279j9524j1536L403L511K4883K1514K125n10n2948j5398J3259p851M336
7146A543j2697j5964n898P37j018n060J7560J2625j6579R331R00m862R543r251
7132a9090j5049J3311K3127Q757j0557M443k4767j8196K8877K1158J4971k307
7120B4678K1533L409j1322K1631l9971j5359P807o603j1671j6374J8485L0249
7108B6492R593l9579j3036k2475K7552L5102j0736k7615l6735m97K2132J7054
$$ y = [-15235, -18851, -14090, -25891, -17233, -14145, -12684, -16591, -33477, -14333, -16313, -14042, 1924, 23674, 51731, 55445, 10356, -6325, -190, -12909, 1172, 17672, -8044, -4407, 6193, -18719, -34989, -31492, -36072, -39349, -37732, -13160, 3666, 23739, 15915, -9127, 24738, 44837, 36279, 16755, 5219, 8622, 12133, 37016, 58530, 60655, 60145, 7197, -8201, 5058, -2793, 1543, -11154, -27118, -33016, -32279, -33297, -38357, -20797, -8172, -24751, -15420, -14520, -19382, -9839, -19090, -34139, -20828, 2299, 11056, 499, 4942, -19825, -38021, -9144, 12014, 26985, 24678, 46211, 49620, 38298, 59929, 19958, 4599, 12406, 5803, -5868, -22242, -3757, 26492, 36085, -3494, -16530, -39005, -11453, 23649, 12913, -14702, -51437, -51934, -29802, -12748]
7096a2748j2643P68k736J6618K6841l834o361k2256N612J7417J4930K0169j3191
7083B8586n692j2645m612J2349J1578J0922J954L1931j6994q407k836R744m0047
7070A5831k3200r410Q050K4876L484k0321k3184j657K3103K9012P209n951j0813
7057A7029p390m416q51o30L9116q603k3382o560Q786J1289M970j1217m1846P315
7043a6390J2678o848o73R104L782k6013m1060k0627K1195L5095J9043O709J6202
7030A2197l0818j3335J3689L2064j5683j3751j1913n941q368J8881N484L057M252
7017a0185J2483N068p835k5861k831R20l05Q642k993L6377M963n469Q394P491
7003B8859k6913J5736J0796Q608p50k1802k150J953K3102J6481q522k7605r156
$$ y = [-12748, -25391, -24623, -27359, -10741, 16100, 12266, 5905, -16351, -10739, 6678, 21608, 41777, 28586, 22894, 10249, 5637, 17986, 29564, 40486, 42440, 74371, 57377, 48970, 46134, 55878, 15831, -7369, -16779, -8729, 16147, 19631, -690, -23874, -25531, -2428, 26584, 33793, 27842, 17029, 9639, 5223, 4372, 3742, 42858, 34255, 10873, 4313, 13099, 24388, 29358, 18141, -23705, -16390, -3712, -10560, -11233, -2129, 1653, -24360, -65420, -86047, -64852, -29757, -10714, -4005, 12197, -18621, -31956, -18267, 13797, -1886, -15637, -27550, -33491, -41859, -22978, -17494, -14437, -10185, 2298, 7366, -469, -26330, -29161, -28241, -28546, -19904, -22897, 13480, 18443, 12974, 21368, 28859, 1946, 17682, 28478, 37086, 36336, 14534, 12384, 14337, 37439, 53920, 45398, 17793, 8637]
6990H637q91k3431o953l4038k2097J420J0651J5146L6924k961j2408j934j244
6977c3179J5249J4533J0735k3146p847R907J9073O166M605K3633j2619k2482j0455
6964e827j9798j2598j5101K043K6447k095k91J1843j968m066n463j2751J8223
6951b1402L8647j996k7948l1305J3002J5285j9129K0771N1252j9389M708J4487
6939C6983j5518l2109J9518J8799m7333j7687m473q655k59K5864J276l866K9324
6926A864M187J2743J196k1392N395n534k6146K9890Q598J1237L878k7830k0448
6913b2362j1258K5677K6786q441k576m930j7160j9129l2378K9730L9642J2074
6901A5675Q349j3183J364o677l7590K6437K0032Q510L2953r248k5717N894N126
$$ y = [8637, 7746, -15685, -22638, -56676, -78773, -77353, -66702, -51556, -14632, -17593, -30001, -31935, -33179, -17930, -3397, 7338, -15808, -23655, -13748, 5325, 11491, 16096, 39729, 27110, 4628, -5827, -25625, -38223, -53324, -51281, -24834, -26929, -27220, -15377, -17345, -21411, -26874, -39625, -21402, 17245, 15249, -12699, -44004, -31002, -15717, -34846, -14075, 37177, 17788, 22496, 36983, 21465, -10644, 8874, 27673, -19660, -37347, -41820, -50475, -50734, -24870, -23594, -27460, 1864, 6051, 18794, 19990, -1402, 3993, -1541, -27687, 2203, 10801, 22038, 25916, -1914, -22362, -33620, -7943, 18843, 10402, 7826, 2896, -14264, -33393, -65771, -36041, 3601, 15675, 24024, 10841, 12205, 5528, -32062, -5625, 14407, 22917, 55870, 46622, 20905, 26799, 31925]
6888C1925j0029o313M334j9451k350o12j2636N417j1666q331L4362p371j418K3445
6874A9306J0956j9666k2827k8769J5233J49l050j0724Q742N6322K2112N046k7594
6861B5236k5166k249j1585K369l854M790M2482j209j9895n893J1359o140P794
6848A8039O475R476j2117J6070k999l9222J8988J6555K0898L508p721n732r46
6835D1272j2004l777o01n380j6133j9268o291K8788P968Q512o332l5732k6433
6822d5411N808J4164K2561m450m756n399J6546J6481k3031n574l2386n181K8670
6809b1958O18k2256N951J9954l525k8062j234M2513L1639j5238k0157J8917K0022
6796B7184O415L217J428M471K3977K0867M8086O1975K9629l795P350k916l3236
$$ y = [31925, 21896, 15583, 19917, 466, -1884, -2496, -15132, -9715, -21381, -29712, 4650, -2721, -4139, 19306, 30262, 10596, -12231, -41000, -25767, -25618, -28668, -39392, -30650, 25672, 47784, 52830, 25236, 70, -2179, -13764, -11395, -15249, -10459, 32023, 30814, 10919, 5026, 16385, 10245, 18039, 24514, 33990, 21873, 37943, 34944, -4278, 14710, 31265, 52163, 55671, 47950, 42218, 41272, 29268, 25491, 24890, 19510, 3377, -15891, -22182, 6606, 14574, 23086, 16754, -18978, -45411, -39603, -25439, -2878, -7328, -12084, -17483, -937, 15544, -7487, -13061, -45447, -50628, -21958, -21340, -43596, -37645, -17691, -21216, -49278, -50512, -7999, 23640, 8402, -11755, 7162, 27184, 33599, 36816, 38244, 42715, 66692, 87559, 135645, 197620, 227249, 223454, 230804, 227888, 194652]
6783A94652l5333k1873l8553j0083J9649j7838l8826j8242m456J4455J6870k532
6771E7890j876J8611j0095l3911n105P849r121J848M6829M5284K2034K6226J0456
$$ y = [194652, 159319, 137446, 98893, 88810, 108459, 90621, 51795, 33553, 29097, 43552, 60422, 57890, 56014, 74625, 64530, 30619, 25514, 33363, 24242, 26090, 72919, 118203, 140237, 166463, 176919]
$$ [...]
##END NTUPLES=NMR SPECTRUM
##END=
