##TITLE=Analysis number 320171
Compound Code cc 60103
Book Reference 453/165
Project Code adrs
Chemist Name lesleyd
##JCAMPDX= 6.0         $$ Bruker NMR JCAMP-DX V2.0
##DATA TYPE= NMR SPECTRUM
##DATA CLASS= NTUPLES
##ORIGIN= Bruker BioSpin GmbH
##OWNER= nmr
$$ XWIN-NMR		Version 3.5
$$ Thu Jun 15 11:57:24 2006 GMT Daylight Time (UT+1h)  MAYBRIDGE\nmr@NMR_250MHZ
##.OBSERVE FREQUENCY= 250.131544655141
##.OBSERVE NUCLEUS= ^1H
##.ACQUISITION MODE= SIMULTANEOUS (DQD)
##.ACQUISITION SCHEME= undefined
##.AVERAGES= 16
##.DIGITISER RES= 18
##SPECTROMETER/DATA SYSTEM= dpx250
##.PULSE SEQUENCE= zg30
##.SOLVENT NAME= CDCl3
##.SHIFT REFERENCE= (INTERNAL, CDCl3, 0, 16.522)
##AUDIT TRAIL= $$ (NUMBER, WHEN, WHO, WHERE, WHAT)
$$ ##TITLE= Audit trail, XWIN-NMR		Version 3.5
$$ ##JCAMPDX= 5.01
$$ ##ORIGIN= Bruker BioSpin GmbH
$$ ##OWNER= nmr
$$ C:\u/data/dgb/nmr/ADRS/860/pdata/1/auditp.txt
$$ ##AUDIT TRAIL=  $$ (NUMBER, WHEN, WHO, WHERE, WHAT)
(   1,<2006-06-15 11:56:46.36 +100>,<MAYBRIDGE\nmr>,<NMR_250MHZ>,
      <created by zg, POWCHK disabled, PULCHK disabled
       configuration hash MD5:
       E2 DF 36 D8 04 B2 41 60 5A D7 A3 38 5A 4B D0 FE
       data hash MD5: 64K
       5E 27 16 05 CF 3D F8 A0 32 37 A5 77 64 5E 44 D2>)
(   2,<2006-06-15 11:57:02.00 +100>,<MAYBRIDGE\nmr>,<NMR_250MHZ>,
      <Start of raw data processing
       ef LB = 0.3 FT_mod = 6 PKNL = 1 SI = 32K 
       data hash MD5: 32K
       CD B7 B4 B8 C3 5F CA 75 83 7E 21 F5 CF 10 95 EE>)
(   3,<2006-06-15 11:57:03.70 +100>,<MAYBRIDGE\nmr>,<NMR_250MHZ>,
      <apk 
       data hash MD5: 32K
       DD D0 E3 07 A9 DE 69 6A 5D D2 A2 86 78 46 B0 27>)
(   4,<2006-06-15 11:57:05.15 +100>,<MAYBRIDGE\nmr>,<NMR_250MHZ>,
      <abs ABSG = 5 
       data hash MD5: 32K
       FD 49 88 AF 6D 1E BA 49 17 96 B7 2A 45 F8 CB 66>)
$$ ##END=
$$ 
$$ hash MD5
$$ 3D 3A 41 D4 6E 2D 9C FC BA 14 0B E5 16 F6 B8 82
##$RELAX= 
##$RELAX= 
##$RELAX= 
##$RELAX= 
##$RELAX= 
##$RELAX= 
##$RELAX= 
$$ Bruker specific parameters
$$ --------------------------
##$DU= <C:\u>
##$EXPNO= 860
##$NAME= <ADRS>
##$PROCNO= 1
##$TYPE= <nmr>
##$USER= <dgb>
##$AMP= (0..31)
100 100 100 100 100 100 100 100 100 100 100 100 100 100 100 100 100 100 
100 100 100 100 100 100 100 100 100 100 100 100 100 100 
##$AQSEQ= 0
##$AQ_mod= 3
##$AUNM= <au_zg>
##$AUTOPOS= <38 >
##$BF1= 250.13
##$BF2= 250.13
##$BF3= 250.13
##$BF4= 250.13
##$BF5= 500.13
##$BF6= 500.13
##$BF7= 500.13
##$BF8= 500.13
##$BYTORDA= 1
##$CFDGTYP= 0
##$CFRGTYP= 5
##$CHEMSTR= <none>
##$CNST= (0..31)
1 1 145 1 1 1 1 1 1 1 1 1 1 1 1 1 1 1 1 1 1 1 1 1 1 1 1 1 1 1 1 1 
##$CPDPRG= <>
##$CPDPRG1= <>
##$CPDPRG2= <>
##$CPDPRG3= <>
##$CPDPRG4= <mlev>
##$CPDPRG5= <mlev>
##$CPDPRG6= <mlev>
##$CPDPRG7= <mlev>
##$CPDPRG8= <mlev>
##$CPDPRGB= <>
##$CPDPRGT= <>
##$D= (0..31)
0 1 0 0 0 0 0 0 0 0.06 0 0 0 0 0 0 0.0002 0 0 0 0 0 0 0 0 0 0 0 0 0 0 
0 
##$DATE= 1150369004
##$DBL= (0..7)
120 120 120 120 120 120 120 120 
##$DBP= (0..7)
150 150 150 150 150 150 150 150 
##$DBP07= 0
##$DBPNAM0= <>
##$DBPNAM1= <>
$$ [...]
##$SUBNAM7= <"">
##$SUBNAM8= <"">
##$SUBNAM9= <"">
##$SW= 20.6930455092707
##$SWIBOX= (0..15)
0 0 3 0 0 0 0 0 0 0 0 0 0 0 0 0 
##$SW_h= 5175.983436853
##$TD= 65536
##$TD0= 1
##$TE= 295.16
##$TE2= 300
##$TE3= 300
##$TEG= 300
##$TL= (0..7)
0 120 120 120 120 120 120 120 
##$TP= (0..7)
150 150 150 150 150 150 150 150 
##$TP07= 0
##$TPNAME0= <>
##$TPNAME1= <>
##$TPNAME2= <>
##$TPNAME3= <>
##$TPNAME4= <>
##$TPNAME5= <>
##$TPNAME6= <>
##$TPNAME7= <>
##$TPOAL= (0..7)
0.5 0.5 0.5 0.5 0.5 0.5 0.5 0.5 
##$TPOFFS= (0..7)
0 0 0 0 0 0 0 0 
##$TUNHIN= 0
##$TUNHOUT= 0
##$TUNXOUT= 0
##$USERA1= <user>
##$USERA2= <user>
##$USERA3= <user>
##$USERA4= <user>
##$USERA5= <user>
##$V9= 5
##$VALIST= <valist>
##$VCLIST= <CCCCCCCCCCCCCCC>
##$VD= 0
##$VDLIST= <DDDDDDDDDDDDDDD>
##$VPLIST= <PPPPPPPPPPPPPPP>
##$VTLIST= <TTTTTTTTTTTTTTT>
##$WBST= 1024
##$WBSW= 4
##$XGAIN= (0..3)
0 0 0 0 
##$XL= 0
##$YL= 0
##$YMAX_a= 313904
##$YMIN_a= -549865
##$ZGOPTNS= <>
##$ZL1= 120
##$ZL2= 120
##$ZL3= 120
##$ZL4= 120
##$ABSF1= 16.522
##$ABSF2= -4.171173
##$ABSG= 5
##$ABSL= 3
##$ALPHA= 0
##$AQORDER= 0
##$ASSFAC= 0
##$ASSFACI= 0
##$ASSFACX= 0
##$ASSWID= 0
##$AUNMP= <proc_1d>
##$AZFE= 0.1
##$AZFW= 0.1
##$BCFW= 0
##$BC_mod= 0
##$BYTORDP= 0
##$COROFFS= 0
##$CY= 12.5
##$DATMOD= 1
##$DC= 0
##$DFILT= <>
##$DTYPP= 0
##$F1P= 14.0000005364418
##$F2P= -0.99999901652339
##$FCOR= 0.5
##$FTSIZE= 32768
##$FT_mod= 6
##$GAMMA= 0
##$GB= 0
##$INTBC= 1
##$INTSCL= 1
##$ISEN= 128
##$LB= 0.3
##$LEV0= 0
##$LPBIN= 0
##$MAXI= 10000
##$MC2= 0
##$MEAN= 0
##$ME_mod= 0
##$MI= 0
##$NCOEF= 0
##$NC_proc= -4
##$NLEV= 6
##$NOISF1= 0
##$NOISF2= 0
##$NSP= 0
##$NTH_PI= 0
##$NZP= 0
##$OFFSET= 16.522
##$PC= 1
##$PHC0= 171.0809
##$PHC1= 16.08887
##$PH_mod= 1
##$PKNL= yes
##$PPARMOD= 0
##$PSCAL= 4
##$PSIGN= 0
##$REVERSE= no
##$SF= 250.13
##$SI= 32768
##$SIGF1= 0
##$SIGF2= 0
##$SINO= 400
##$SIOLD= 32768
##$SREGLST= <1H.CDCl3>
##$SSB= 0
##$STSI= 32768
##$STSR= 0
##$SW_p= 5175.98343685301
##$SYMM= 0
##$S_DEV= 0
##$TDeff= 65536
##$TDoff= 0
##$TI= <Analysis number 999999
Compound Code 99
Book Reference 9
Project Code 9>
##$TILT= no
##$TM1= 0
##$TM2= 0
##$TOPLEV= 0
##$USERP1= <user>
##$USERP2= <user>
##$USERP3= <user>
##$USERP4= <user>
##$USERP5= <user>
##$WDW= 1
##$XDIM= 32768
##$YMAX_p= 291502048
##$YMIN_p= -398598
$$ End of Bruker specific parameters
$$ ---------------------------------
##NTUPLES= NMR SPECTRUM
##VAR_NAME=  FREQUENCY,     SPECTRUM/REAL,   SPECTRUM/IMAG
##SYMBOL=    X,             R,               I
##VAR_TYPE=  INDEPENDENT,   DEPENDENT,       DEPENDENT
##VAR_FORM=  AFFN,          ASDF,            ASDF
##VAR_DIM=   32768,         32768,           32768
##UNITS=     HZ,            ARBITRARY UNITS, ARBITRARY UNITS
##FACTOR=    0.157963299565203, 1,           1
##FIRST=     4132.6476996994, 0,             0
##LAST=      -1043.33573715361, 0,           0
##MIN=       -1043.33573715361, -398598,     0
##MAX=       4132.6476996994, 291502048,     0
$$ Real data points
##PAGE= N=1
##DATA TABLE= (X++(R..R)), XYDATA
$$ [...]
21854a01049K6920N1059l719k1538O1600P3615O838J4119o1969n2068K2794k8195
21842a1593J9772N4563j6594l5409k5243m0457L4906j7285K6697l172o2454o3749
21830a40018q112m1245O9871M4703M5208N3769m8364q8738K8025J03983R8258
21819A17340J6434r4796o4479K7191O0013m5612J5026N3208l3343k1340j3554
21808A6088O1093n064k4565m3554n1144L6026q855M1809O2133k1236K6246m6719
21796D2258L3109j05338p5116j3355j2587N3653P6371j8403k1028M3296l0191
21785b7331N45o4357O0711j8184K8294K9419j862M3966L9581J981m4397L3196
21773H1562j9028m2596L308q5561j46583J340O7656J14922M2190Q4601O1130p9801
$$ plain form
21854 -101049 -74129 -23070 -26789 -48327 13273 86888 93726 107845 45876 -6192 16602 -11593
21842 -11593 8179 62742 46148 10739 -14504 -54961 -20055 -37340 -10643 -13815 -76269 -140018
21830 -140018 -148130 -189375 -119504 -74801 -29593 24176 -24188 -112926 -84901 19082 117340
21819 117340 133774 38978 -25501 1690 61703 16091 31117 84325 50982 29642 16088
21808 16088 77181 72117 47552 3998 -47146 -11120 -19975 21834 83967 62731 88977 42258
21796 42258 75367 -29971 -105087 -118442 -131029 -77376 -1005 -19408 -40436 2860 -27331
21785 -27331 -26786 -91143 -30432 -48616 -20322 9097 7235 51201 90782 92763 48366 81562
21773 81562 62534 19938 23246 -62315 -208898 -207558 -139902 -24980 17210 101811 162941 83140
21761H3140j06102n484l3787N5120M3255j53938p6837M741J1962J3232J13557
21750e1141N3960l765M383O1959J4036K3137L541o5817L0807M4273o334o2069
21738D6970k1371R1237J2653m8652J7361j10219r2126P2413N3758L0904J8302
21727G1230j24897m9913M3422P8943J6082o8856l6822K8993R2223n762p3489j1565
21715d0411L5323K8477r573r1303o959M0646O1729K281j21134k296Q2383K9280
21703H443M1378k8418k239O309N8480m8035o8081j4773p583L394M0499j0062j1446
21690c2134k8443M2119j7040l1537Q780Q660P3754M1586p6840o6938m1427J6687
21678a02773j1489K9677N0031j6929L490N1264n0241j17699k4259M5262M5818
$$ plain form
21761 83140 -22962 -28446 -62233 -7113 36142 -117796 -194633 -189892 -177930 -164698 -51141
21750 -51141 2819 -946 3437 65396 79432 102569 106110 40293 71100 115373 109039 46970
21738 46970 25599 116836 129489 80837 98198 -12021 -104147 -31734 22024 52928 71230
21727 71230 -53667 -103580 -60158 18785 34867 -33989 -70811 -41818 50405 44643 -28846 -40411
21715 -40411 -5088 23389 13816 -77487 -84446 -43800 17929 20210 -100924 -103220 -20837 8443
21703 8443 49821 21403 19164 25473 83953 35918 -32163 -46936 -54519 -51125 -10626 -20688 -32134
21690 -32134 -60577 -18458 -35498 -67035 -58255 -49595 24159 65745 -11095 -78033 -119460 -102773
21678 -102773 -114262 -84585 -34554 -51483 -47993 3271 -46970 -164669 -188928 -143666 -97848
21667i7848O9396P8173P312r8712k7303R2406m245k4152K4952k815O098n514L2677
21654E0425l6637K8136O160O1983L1211m8817q9568k8155O3727P4281L7469J9802
21642A70017p2855j31373R0985q160P034l6105l7473k8280n4001J83Q5365k5758
21630d0421n3872M328M5874j194l2605M8424n8099O7061J2845m5884l0099l605
21618h7247k9577j6621k134J2310N1423L289K3380N4205M5958k4435K6480m6778
21606A0253l3161q5947q1749N1248L5020M9626K5473M5746R5421q323n5437O6319
21594A14489M9461m2531Q919j1626J3892k7242r2415l4813k4714J02444Q9668
21583A45532q153r3833p8345q1421J1057N3497j0768o6125J6125J61856J09976
$$ plain form
21667 -97848 -28452 49721 57033 -41679 -68982 23424 19179 -4973 19979 17164 23262 17748 50425
21654 50425 13788 41924 48084 110067 141278 92461 2893 -25262 38465 112746 150215 170017
21642 170017 97162 -34211 56774 48614 55648 19543 -17930 -46210 -100211 -100028 -14663 -40421
21630 -40421 -94293 -89965 -44091 -45285 -77890 -29466 -87565 -20504 -7659 -53543 -83642 -87247
21618 -87247 -116824 -133445 -135579 -123269 -71846 -68557 -45177 9028 54986 30551 57031 10253
21606 10253 -22908 -108855 -190604 -139356 -104336 -54710 -29237 16509 111930 103607 48170 114489
21594 114489 163950 121419 130338 118712 132604 105362 12947 -21866 -46580 55864 145532
21583 145532 137379 43546 -34799 -116220 -105163 -51666 -62434 -128559 -112434 49422 159398
21572A59398o3505p2275j8771N1390R216J1689J0969M2894p3873o5195R3012M0392
21560A25341K274j7439l3680q1839p2701J4405R503K7263R08o908m2851L0138
21548d5586M4389K9068m5275k1686j6962J6251R663N227K6367J1571p0479l7428
21536i4880K2150n297J1573R5896K8031o553R5634K5067n9324q5078k3079l31
21524C809l1789P4926m495j0960l2597l0014l2331p6521Q4146J6036l0782o0806
21512a31378O175O2599M6245M4359l4522k3017J9429n8908L0432M2827O8999m5803
21500B7437J7965J427K1416l2567n1515L8681l3889q6530M1087j0309K8471J22831
21488H4505N6401j115Q479n4920Q28o0463J4630l5362n3732j9061K7294K44M1748
$$ plain form
21572 159398 95893 23618 4847 56237 65453 77142 88111 131005 57132 -8063 84949 125341
21560 125341 127615 110176 76496 -5343 -78044 -63639 -54136 -26873 -25965 -32873 -75724 -45586
21548 -45586 -1197 27871 -17404 -39090 -56052 -39801 -30138 -24911 1456 13027 -57452 -94880
21536 -94880 -72730 -78027 -66454 29442 57473 50920 146554 171621 112297 27219 4140 3809
21524 3809 -27980 46946 42451 31491 -1106 -31120 -63451 -139972 -55826 -39790 -70572 -131378
21512 -131378 -125203 -62604 -16359 28000 -6522 -29539 -10110 -69018 -38586 4241 73240 27437
21500 27437 45402 46829 68245 35678 -15837 22844 -11045 -97575 -56488 -66797 -38326 84505
21488 84505 140906 139791 148270 93350 94178 33715 48345 12983 -40749 -59810 -32516 -32272 9476
21475I476M2230n2217J3972P6539O0591j02427j06765m7667J764N3207O887N8809
21463A4399J27907j3423n1908o7773N057M132Q246J2848n0101p3814r871j1049
21451a05350Q048k0114n7220n1140L0471O8788J05111N8083L2286n2927M9939
21440F5975l6777m6796M5621J2679p4986r296k9643l9829K9525k7122m4278o609
21428a61536K502R1781L4861l9610K6478P0066n990l1587J58l4055k1328m7000
21416a15260o0731R0875Q1242l608R241L4510k6154j75201L9266J34764K2999
21405C1943n3140o0537L186M7581Q5327K2647L169k1150n3846Q1130o0925m5967
21393b0582k6842l0792P512j03357N2211M6527r932o8858O2181K0720n4653j634
$$ plain form
21475 9476 51706 -511 13461 90000 150591 48164 -58601 -106268 -104504 -51297 -44410 14399
21463 14399 142306 128883 76975 9202 14259 18391 26637 39485 -10616 -84430 -94301 -105350
21451 -105350 -97302 -117416 -174636 -225776 -195305 -126517 -21406 36677 68963 16036 65975
21440 65975 29198 -17598 28023 40702 -34284 -43580 -73223 -113052 -83527 -110649 -154927 -161536
21428 -161536 -159034 -67253 -32392 -72002 -45524 24542 18552 -13035 -12877 -46932 -68260 -115260
21416 -115260 -175991 -85116 -3874 -7482 1759 36269 10115 -165086 -125820 8944 31943
21405 31943 -21197 -81734 -78548 -30967 54360 77007 80176 59026 5180 86310 25385 -20582
21393 -20582 -47424 -78216 -70704 -174061 -121850 -75323 -85255 -154113 -91932 -71212 -125865 -127499
21381a27499J08439l9083o1841o8735l2691J66384P6619k2741r7136j12184m1
21370b10509J12055P0254Q1799k3833r4221N2999N5378j1094j03419k420L5561
21359c7450o7017J756P7494n2397k8354L8920N9504L5431o6584l8560j239j273
21347g9769M409j2443Q1126K8856L6801q1223o1494P854j9934L6119j4783J00039
21335B5558J06654O9590k7940K3863o8817q3617r926L5350Q8850J5279j06549
21324F8295r1535J1741m7769r7250k096O509P2478J19701J39355N5353o8291j46618
21312A9873K1298J05880m319o6206o5655m6632O9N584P7287R7895r589p6697J6666
21299G5454m3368p3835P467R0869l2790j1836q163P0841R577n9586n0295L1393
$$ plain form
21381 -127499 -19060 -58143 -119984 -188719 -221410 -55026 21593 -1148 -98284 -210468 -210509
21370 -210509 -98454 -28200 53599 29766 -64455 -11456 43922 32828 -70591 -73011 -37450
21359 -37450 -104467 -102711 -25217 -77614 -105968 -67048 -7544 27887 -38697 -77257 -78496 -79769
21347 -79769 -75360 -87803 -6677 22179 58980 -22243 -83737 -75883 -95817 -59698 -74481 25558
21335 25558 132212 201802 173862 197725 128908 45291 35365 70715 159565 174844 68295
21324 68295 -23240 -11499 -59268 -156518 -158614 -152105 -79627 40074 179429 234782 166491 19873
21312 19873 41171 147051 142732 76526 10871 -35761 -35692 -30108 47179 145074 135485 58788 75454
21299 75454 32086 -41749 -34282 56587 23797 11961 3798 74639 84216 24630 -25665 5728
21287E728q2930p8337k8174J1580N6459P4619P3343p5106k9518J04141L2657j03697
21275c9235Q707N3717N1549l0128l3071L1085Q906j6768J6352L5237k324j05747
21263b1720n9675p329M8038K8672K1324m2485r0196N144N0553K8869Q090k1780
21251e2495L4451L7888m2477j338m9560k1521O7997J129p3837N0606L7929J5047
21239C819k9243r1506n6143L5645O5523Q7471J12324Q6405k7011q4768l0994O064
21227G7586J2743j0792m5991n6379j1771m1777j0282R626Q9928K4767j2176l7991
21215a2509r3806r5374M509R1421R8762n1178n5004N7128J24359M1242K2894Q617
21203A41061q2260j31310N913J13882n6962q6281M3702L4938j02274n0016N1738
$$ plain form
21287 5728 -77202 -155539 -183713 -172133 -115674 -41055 32288 -42818 -72336 31805 64462 -39235
21275 -39235 -30528 23189 74738 44610 11539 42624 51530 34762 51114 86351 84027 -21720
21263 -21720 -81395 -88724 -40686 -12014 9310 -33175 -123371 -118227 -67674 -38805 -30715 -52495
21251 -52495 -18044 19844 -22633 -23971 -73531 -95052 -27055 -25926 -99763 -49157 -11228 3819
21239 3819 -25424 -116930 -173073 -137428 -71905 15566 127890 214295 187284 102516 71522 77586
21227 77586 90329 79537 33546 -22833 -34604 -76381 -86663 -77037 12891 37658 25482 -12509
21215 -12509 -106315 -201689 -197180 -105759 -6997 -58175 -113179 -56051 68308 109550 132444 141061
21203 141061 58801 -72509 -66596 47286 -9676 -95957 -52255 -17317 -119591 -169607 -117869
21192a17869j4170O9460j8859j3238N4098M3470R6698k0038p2146O6630J8014
21181I2050K9854j6220j14088j10615l3857n4058p774O4046m827L931L5993M6785
21169f8780m2807O9227P6902K6718P2096P6231q2422o0952P476q12K661m0889
21157C4649l3724m0441P0603K81p6300R9966r989p1415n5522J6046N5035m798
21145a5609r82O4169j1349j02236l3847J9726K5347j6608k6666Q5776K1110p7788
21133f8957k4P7695Q0888n9680j5542N7091R305o8133n5833o121k624J5532N0947
21120A4544J3198j0326j6881M3194m6413n1109J8439M4960N371p0660k6085p382
21108h9150M4316L4329O7377Q576p2130m8169k4020j01267k0977J15794J03752
$$ plain form
21192 -117869 -132039 -62579 -81438 -94676 -40578 2892 99590 79552 7406 74036 92050
21181 92050 121904 105684 -8404 -119019 -152876 -206934 -214708 -150662 -155489 -151558 -115565 -68780
21169 -68780 -111587 -42360 34542 61260 133356 209587 127165 66213 73689 72877 75538 34649
21157 34649 925 -39516 31087 31368 -44932 55034 45045 -26370 -81892 -65846 -10811 -15609
21145 -15609 -16591 47578 36229 -66007 -99854 -80128 -54781 -71389 -98055 -12279 8831 -68957
21133 -68957 -68981 8714 89602 29922 14380 71471 80776 12643 -43190 -49311 -51935 -36403 14544
21120 14544 27742 17416 535 43729 -2684 -53793 -35354 9606 14977 -55683 -81768 -89150
21108 -89150 -44834 -10505 56872 65448 -6682 -54851 -78871 -180138 -201115 -85321 18431
21097A8431j1451k9390k3439L715J8199p3568K5901J09181J8404r0019j9809J8735
21085c5110O955n069L1464Q037r8984M5906N4172q7150j00246J8575M6961R0295
21073b4194L0886l580m370r5994k0252O4666P2218J4455o9963k0149m7342m5742
21061a49361O2400J00837l4642l8417M905m3280P512Q3694M0074m1680n2536R8723
21049C8229q9310n5408J6805O7717K8873J582m8203n6699M2177M9159j5550m0655
21037f1283m5586J84717L0948r8143K9410J02913K9275o7535l490p4733j13520
21026h7027k0714P4292o7237M8268m611l9630R5046O4580m6369m6288Q803o1012
21014h1899O7644O8953M8416K9790m1215p4770J347n19P3656m0399O443r2332
$$ plain form
21097 18431 6980 -22410 -45849 -42134 -23935 -97503 -71602 37579 55983 -34036 -53845 -35110
21085 -35110 -28155 -33224 -1760 6277 -92707 -46801 7371 -79779 -180025 -161450 -114489 -24194
21073 -24194 6692 3112 -1258 -97252 -117504 -52838 19380 33835 -36128 -56277 -103619 -149361
21061 -149361 -86961 13876 -20766 -59183 -54278 -97558 -90046 -6352 33722 -7958 -60494 38229
21049 38229 -51081 -106489 -89684 -21967 6906 8488 -39715 -96414 -54237 -5078 -20628 -61283
21037 -61283 -106869 77848 108796 10653 40063 142976 172251 104716 101226 26493 -87027
21026 -87027 -107741 -33449 -100686 -52418 -57029 -96659 -1613 62967 16598 -29690 -20887 -81899
21014 -81899 -14255 54698 103114 132904 91689 16919 18266 17747 91403 51004 57447 -34885
21002c4885k7658n0813P650L3729J7274N6710o496k2365J15270J0528l7411R867
20990G1400j4760k1164k3342o7376N012Q6162k3444o8309M8384J37324N6273o570
20978A79590j03924j09029m2039j1775R7844N5622L9617Q1101M76m3953J8654
20967A62184n5410J8887m6872l5390L7667J7464j11139L3359l2730k065K6813
20956A2768m7622p6129L2641L2383L5208L7696N4532n5514o8330L4590N021l0376
20944c3132o206k7702k6443l0680J4239P7893j2547k3013M864J27407O507m1351
20932B9836o0964m8883m7901k8777R1373n337m5148m3063J39767O2816J0378J1125
20920F5222L246n914k1091L4879L0688l7298o3481l852P1745o266o3559O1125
$$ plain form
21002 -34885 -62543 -113356 -105706 -71977 -54703 2007 -4489 -26854 88416 98944 61533 71400
20990 71400 56640 35476 12134 -55242 -50230 35932 12488 -55821 -7437 129887 186160 179590
20978 179590 75666 -33363 -75402 -87177 10667 66289 105906 187007 187483 143530 162184
20967 162184 106774 125661 78789 43399 81066 98530 -12609 20750 -11980 -14045 12768
20956 12768 -34854 -110983 -78342 -45959 -10751 26945 81477 25963 -42367 -7777 -2756 -33132
20944 -33132 -39338 -67040 -93483 -124163 -109924 -32031 -44578 -67591 -62727 64680 71187 29836
20932 29836 -31128 -80011 -127912 -156689 -65316 -70653 -115801 -158864 -19097 43719 54097 65222
20920 65222 68468 62554 41463 76342 107030 69732 6251 2399 74144 67878 4319 65444
20908F5444n0846o4917l8850o7113P447K813j1826P4676J39775O0433n9337j34465
20896g6766o0375n5911J3128O7938J04349L7231J3426k7775r294L4401k3992k2071
20884e711q6291L469Q383M105R118R7857P5518P847j0165m0200j0565J8954P1389
20871A43708o7901n4056n9499J915Q5861n2145k4231j753M0530M0830m6455o813
20859iL6129p9865q9772Q4491K7117O9193l6896K0673M3034K1121N280j6704n2886
20846C0906K5564j5367O603O0029o7176j50229L6919L6797l3168O4804l778q9176
20834i7272n1625j5852m2443K8790N3681R9498N9703k683o7761j1367K2794M8654
20822B4117n2506k3691L3125M4708K6087N9074m388q5999R501M113q7104k0017
$$ plain form
20908 65444 14598 -50319 -89169 -156282 -148835 -146022 -157848 -83172 56603 117036 57699 -76766
20896 -76766 -137141 -193052 -179924 -111986 -7637 29594 43020 15245 5951 40352 16360 -5711
20884 -5711 -92002 -88533 -80150 -76045 -66927 30930 106448 114295 104130 63930 53365 72319 143708
20871 143708 75807 21751 -37748 -35833 50028 -2117 -26348 -28101 12429 53259 6804 -9
20859 -9 36120 -43745 -133517 -49026 -21909 47284 10388 31061 74095 95216 100496 83792 30906
20846 30906 56470 41103 47706 107735 40559 -109670 -72751 -35954 -69122 -4318 -8096 -97272
20834 -97272 -148897 -164749 -207192 -178402 -124721 -25223 34480 31797 -35964 -47331 -24537 24117
20822 24117 -28389 -52080 -18955 25753 51840 110914 106526 20527 30028 34141 -52963 -72980
20810g2980Q1099N2814n1830m2286O1349k6437J6303m9612o2177M9929o82L8626
20798e884M8646J6147L9116r8250m9982l072L9785M8156J18794p2952o1273O2210
20786H1441L9453Q6106m8813m0296N909n9788n2913n2699L7509j061K187R580
20774F615l7812l3192N1602l0300m8115k54m4103N1282M2261K2192J7106M6374
20762D3656J370m6239J1319j3604m7462k0112j3818O8350N6076j8615m9036m0194
20750f8309J3874L4569P9792M3669N8772m0519r4809o5089M7552K2225j2532m9673
20738c0478k1270K3117L2479K0307l6251m4084k650M8102p1489k7330L8135L4181
20726c7231Q4j6509M629R1710P7806n2764r8597m701P192q5874j2137j3744J2494
$$ plain form
20810 -72980 8119 60933 9103 -33183 28166 1729 18032 -31580 -93757 -43828 -44510 -5884
20798 -5884 42762 58909 98025 -225 -50207 -53279 -13494 34662 153456 80504 19231 81441
20786 81441 120894 207000 158187 117891 123800 64012 11099 -41600 -4091 -5152 -2965 6615
20774 6615 -31197 -64389 -12787 -43087 -91202 -91456 -135559 -84277 -42016 -19824 -2718 43656
20762 43656 45026 -1213 10106 -3498 -50960 -71072 -84890 -16540 39536 20921 -28115 -68309
20750 -68309 -54435 -19866 59926 103595 162367 121848 27039 -38050 9502 31727 19195 -30478
20738 -30478 -51748 -28631 3848 24155 -12096 -56180 -58830 -10728 -82217 -109547 -71412 -37231
20726 -37231 -37147 -53656 -49027 42683 120489 67725 -30872 -35573 -28381 -114255 -126392 -140136 -127642
20713a27642J28184O7673m1715q1556p6326m24Q7684l2565l647O3075J23998l2263
20701G4476j15551l9257j3448M5880K7189M5648N2605l9055m1805J1885J8353
20690B6920l8450L4602O576r2893m2881L6723K4748J7827j6386J0481o8991k9526
20678a31250j1584R0016j7818l5587P6719l6067l9274M6568k1543l9236M4410
20667g4646k2216P8769q213N6824o628K8408Q7834k1264j60488j05991R2290P7674
20655B2353N6K4663L785o4544K86M7739o4488n7997l9024O249P9463L7340K7679
20642B3560K3148J6755k2912M3794J5176m6217m0233p81K1355n5687k2481Q6567
20630D2044p0762Q0650J00807K9677M3434j01060M5094M5072q4025J474j033l0658
$$ plain form
20713 -127642 542 68215 26500 -55056 -131382 -131806 -44122 -76687 -80334 -17259 106739 74476
20701 74476 -41075 -80332 -93780 -47900 -20711 24937 77542 38487 -3318 8567 26920
20690 26920 -11530 23072 29648 -63245 -106126 -69403 -44655 -26828 -43214 -32733 -101724 -131250
20678 -131250 -142834 -52818 -70636 -106223 -29504 -65571 -104845 -58277 -79820 -119056 -74646
20667 -74646 -96862 -18093 -26306 30518 23890 52298 140132 118868 -41620 -147611 -55321 22353
20655 22353 22409 47072 50857 -13687 -13401 34338 -30150 -88147 -127171 -120922 -41459 -4119 23560
20642 23560 46708 63463 40551 84345 99521 53304 13071 12290 33645 -22042 -44523 42044
20630 42044 -28718 51932 152739 182416 225850 124790 169884 214956 130931 132405 131372 100714
20618A00714m1337k3581n3712Q535P4352K7204n68k1282M1130k5007n0630n5269
20606a9451q741L874M5021M6596L1846k9121p4397J3155Q6468o0874p5503L9949
20594a178M3793l0831J155m3531P381J0134k9524L691J457q7992q7391J5186P2660
20581a24990k8455n9382Q6539O3362r7183n9085Q5534l4698K2349K4716J6916
20570a04377O187n638N7448J17450M9135N0171j6224j4919j18466j10361j4605
20559a04199J0515l4030j5684O8077O4974k5288K5955R412l9806L0787j2143l3211
20547e4641Q622N1835k5799p6221l6014j1989n0527L5647Q5939M7242j4368j9355
20535e9629J16146P5809M1651j7094j34678j8874O2772j2245j04240m2029k5920
$$ plain form
20618 100714 59377 35796 -17916 -9381 64971 92175 91607 70325 111455 86448 35818 -19451
20606 -19451 -28192 -24318 20703 67299 99145 70024 -4373 8782 95250 34376 -41127 -1178
20594 -1178 42615 11784 12939 -30592 -23211 -13077 -42601 -38910 -37453 -125445 -212836 -197650 -124990
20581 -124990 -153445 -212827 -126288 -62926 -160109 -219194 -133660 -168358 -146009 -121293 -104377
20570 -104377 -98190 -103828 -46380 71070 120205 170376 154152 139233 20767 -89594 -104199
20559 -104199 -93684 -127714 -143398 -75321 -10347 -35635 -9680 -268 -40074 -9287 -21430 -54641
20547 -54641 -46019 5816 -19983 -96204 -132218 -144207 -194734 -159087 -73148 -25906 -40274 -59629
20535 -59629 56517 132326 173977 156883 22205 3331 66103 53858 -50382 -92411 -118331
20524a18331k487l7867K4154J1178p0963k7358J07229L5706P749K5297j2048J2297
20512d5444P194J4480O3428p6989R145K9640J8703o535k6284p149O7930O1805
20500A09924j0788j19825n7620K0673M3087P052j756M5939k6994n4263j5997m2855
20488a03423J8312K6418P0619J39995j0396p7046r9830l6165J2758M456R551o66
20476d5417n6492P124J5221k3504K1938N5601j5369k3791k1979j8810j3472o6313
20464a85263j0481Q5857R9760R8490p6522l0505J4470m2189r278L2246J02205
20453G8790O2985j1417p3130r6794r512L1144n165n2108k2401L3989J0814N9520
20441F715p5907n9563M7113M1400n8785L6483l7826L0086P2904J4914J0658L0178
$$ plain form
20524 -118331 -120818 -158685 -134531 -123353 -194316 -221674 -114445 -78739 -70990 -45693 -57741 -45444
20512 -45444 -38250 -23770 39658 -37331 -28186 1454 20157 13622 -12662 -19811 48119 109924
20500 109924 99136 -20689 -78309 -57636 -14549 -7497 -9253 36686 9692 -44571 -60568 -103423
20488 -103423 -85111 -58693 11926 151921 141525 64479 -35351 -71516 -58758 -54302 -44751 -45417
20476 -45417 -101909 -94785 -79564 -103068 -81130 -25529 -40898 -64689 -86668 -105478 -118950 -185263
20464 -185263 -195744 -109887 -10127 88363 11841 -18664 -4194 -46383 -55661 -23415 78790
20453 78790 141775 130358 57228 -39566 -49078 -17934 -23099 -75207 -97608 -63619 -52805 6715
20441 6715 -69192 -128755 -81642 -40242 -99027 -62544 -100370 -70284 2620 17534 28192 58370
20429E8370m3810p7125l5018k0407k0024O9961k6632k817K325L0283P244l156
20417f0806n7119p0294J5174R2708L968M6717k8407J9072n3833P113R8305l9446
20405b6848j11900l6858Q7977O5466K5189k3070j9826P371o29P247j3168j2880
20393e1929L7410N705j8535M9491k4832r3451J1968l647m9805n5645l3384Q821
20381b17833j7986J12797J22690K9338k3406p406L4577J14753r850p6473r0885
20370b9684l8471j9027K8076Q2441J6723l7177k8598p7341L0365K7670j6626l0985
20358i2634L1775P4086R724n5140j6630M0633j9995L1493K6699p4718N815N7658
20346A8766O7403q2844m8500J28440N7680p7571l9302p5222k7767J13022M9111
$$ plain form
20429 58370 14560 -62565 -97583 -117990 -138014 -68053 -94685 -97502 -95177 -64894 -57650 -60806
20417 -60806 -117925 -188219 -173045 -80337 -76369 -29652 -58059 -38987 -92820 -85707 12598 -26848
20405 -26848 -138748 -175606 -87629 -22163 3026 -20044 -39870 -32499 -33128 -25881 -39049 -51929
20393 -51929 -14519 -8814 -27349 22142 -2690 -96141 -84173 -87820 -137625 -193270 -226654 -217833
20381 -217833 -235819 -123022 -332 29006 5600 -1806 32771 147524 137674 61201 -29684
20370 -29684 -68155 -87182 -59106 23335 40058 2881 -25717 -103058 -72693 -45023 -61649 -92634
20358 -92634 -60859 13227 22951 -32189 -48819 -8186 -28181 3312 30011 -44707 -38892 18766
20346 18766 86169 3325 -45175 83265 140945 63374 24072 -51150 -78917 34105 83216
20335H3216K9003m9256j0092k5702r1017M3380K8559j13105l0232M8033K2871
20324f4342Q1972k7406j6723k5355L1125m8330m5550M4885k7028N2620Q2892q3292
20312d4532j3762J0856k8656O9515m240M014K6781o9021n5888m4490K7716P3285
20300d8422j5052k9755j5859R4392l595n8746j9710k9988l4790P6504J915O4761
20288a8345O5967j4581l9998O4241j0373k6858K6308r551n236L2896J0031m9915
20276B4586l5290L0087l7027k4740L7350P6731n9611j72413p3958N2638L2436
20265a49211R4561L4303P5310l6088r056N7793m7586o1557M8915P8282l0392j6588
20253C8686j2367j29679j02313O1032L6479N5905m458K1557R8170j8507n5801
$$ plain form
20335 83216 112219 62963 52871 27169 -63848 -20468 8091 -105014 -135246 -87213 -64342
20324 -64342 17630 -9776 -26499 -51854 -20729 -69059 -114609 -69724 -96752 -44132 38760 -44532
20312 -44532 -58294 -47438 -76094 -6579 -10819 -6805 19976 -49045 -104933 -149423 -121707 -48422
20300 -48422 -63474 -93229 -109088 -14696 -18291 -77037 -96747 -126735 -161525 -85021 -83106 -18345
20288 -18345 47622 33041 -6957 57284 46911 20053 46361 36810 31574 64470 74501 24586
20276 24586 -10704 19383 -17644 -42384 -5034 71697 12086 -160327 -234285 -181647 -149211
20265 -149211 -54650 -20347 54963 18875 9819 67612 20026 -41531 7384 85666 55274 38686
20253 38686 26319 -103360 -205673 -144641 -108162 -52257 -56715 -35158 63012 44505 -11296
20242a1296j4585K3408N298q4060q4015j8061O8778j2136J1637O1955J36983J4161
20230I8067l0645k6126l809k0162j16045j52564L802R5609j4351J18007Q417n5705
20218i5505J01928L0331n1697J7360M0649k9692r7081l4428J5037P254m6225j9738
20206a61807L2684M738K2200J21610Q6077m3976j367J4381q1134r103j9069k7460
20194f2226l8271l8934J2399M0901J3368n463N0896p622n7750K3056j7670j1000
20182i8316N5355P2481J3685o4216j6466K2906o1661N0978N9455l8349o1775n6330
20170a22253M7488O0541M5165L377L608p2373P6049O6168k4280N118L061o1117
20158C0552k5659k9422o3754M7255Q5575o241o857L1753N672o5214K811P6306
$$ plain form
20242 -11296 -25881 -2473 2825 -81235 -165250 -183311 -114533 -126669 -115032 -53077 83906 98067
20230 98067 67422 41296 37487 17325 -98720 -251284 -247482 -151873 -166224 -48217 -39800 -95505
20218 -95505 6423 36754 -14943 2417 43066 13374 -83707 -118135 -103098 -95844 -142069 -161807
20206 -161807 -129123 -124385 -102185 19425 105502 61526 60159 74540 -6594 -15697 -34766 -62226
20194 -62226 -100497 -139431 -127032 -86131 -72763 -78226 -27330 -34952 -92702 -69646 -87316 -98316
20182 -98316 -42961 29520 43205 -21011 -37477 -14571 -76232 -25254 34201 -4148 -65923 -122253
20170 -122253 -74765 -14224 30941 34318 37926 -34447 41602 107770 83490 88608 91669 30552
20158 30552 4893 -24529 -88283 -41028 44547 38306 31449 63202 68874 3660 6471 82777
20146H2777l6296j1037o4630J79N7244J5608N9189p2904q5303O0619p1645o455
20134g2654m321n0579m8346O6484L2569N0581L0812p0725n924l3717k013o9311
20122a77144p2054R0330R0510Q157J02493N4321j12792q9010k3989O0720K2529
20111d5929P9815l4677k7237P63j0931k0345Q2788m2766j19934J42488n280r2651
20099i3896J29937n204j2704N9565k9370k7101k7579p9658K658K6854J3481M6152
20087C135Q323n2962O4035K448o9277J3301L6358N916R706M6707j8211l8783m8342
20074c7646M0559N9031r2924M2995J31246r2313m2689L8841Q5119K628k9232m0535
20062F5080R008j04415j29127q4230J03271K9071k696N3517K1063M6778L7050
$$ plain form
20146 82777 46481 35444 -29186 -29007 28237 43845 103034 30130 -55173 5446 -66199 -72654
20134 -72654 -76975 -127554 -175900 -109416 -76847 -26266 4546 -66179 -72103 -105820 -107833 -177144
20122 -177144 -249198 -158868 -68358 -60201 42292 96613 -16179 -105189 -129178 -68458 -45929
20111 -45929 33886 -791 -28028 -27265 -38196 -58541 24247 -18519 -138453 4035 -1245 -93896
20099 -93896 36041 30837 18133 77698 48328 21227 -6352 -86010 -83352 -56498 -43017 3135
20087 3135 11458 -41504 22531 24979 -44298 -30997 5361 11277 20983 67690 49479 10696 -37646
20074 -37646 2913 61944 -30980 12015 143261 50948 8259 47100 132219 134847 105615 65080
20062 65080 74088 -30327 -159454 -243684 -140413 -111342 -114038 -60521 -39458 7320 44370
20051D4370K689P578N932j04936p4258M5707K7432L3912Q904R912J6069l0369
20039g058j148M3334j3583J139J3845Q649n9145K6445M393p7294j4899L7565R729
20026b8028L7037R1894M9278n9698J2220K465q1804k5476J9204Q6972J4055j8361
20014I9758p3656r775J7529n8306r1124O1913l7188L7161R9703K602j03938l0781
20002h6102K415p5197Q0605R4078Q5433R4193Q248j18703o4233p190o3207J3850
19990c5810P228K9152j1918o684l534N5337L267L3556q6096n6974J03700l8995
19978g771m7055M9128O3482M2093o440q4050L6730K0093m2038m3599L374k339
19966a8392j2180K8395j9031M5561L4617m3383l9153j7132k952O9099R3463L635
$$ plain form
20051 44370 47059 54637 60569 -44367 -118625 -72918 -45486 -11574 -2670 7242 23311 -7058
20039 -7058 -8206 35128 21545 22684 36529 45178 -13967 12478 16871 -60423 -75322 -37757 -28028
20026 -28028 9009 100903 150181 90483 102703 105168 23364 -2112 17092 104064 118119 99758
20014 99758 26102 16327 33856 -24450 -115574 -53661 -90849 -53688 46015 48617 -55321 -86102
20002 -86102 -83687 -158884 -78279 15799 101232 195425 203673 84970 20737 13547 -49660 -35810
19990 -35810 -28582 570 -11348 -18032 -21566 33771 37038 70594 -15502 -72476 31224 -7771
19978 -7771 -54826 -5698 57784 99877 93437 9387 46117 66210 24172 -19427 -16053 -18392
19966 -18392 -30572 -2177 -21208 24353 58970 15587 -23566 -40698 -43650 25449 118912 122547
19954A22547k8891L8020J9564q1124r6193L2306n9299O7711p496p7184n6735O667
19942a20107J46947K11m7836k1223K0270J00063j0688m1391J4530J22875l782
19931A59869p8967l8687M5416R0358n7756k3801P2528J7358k0843o0845j5477
19920H9153L447K1310q0946j8904l9639l5565M0544J49373M3444j4724n4224k6646
19908G6623q985O637k6014n5049K137j3885l6782j18092p648l5686M2205J16380
19896e8159N6341o6096R173N3684J4085r8253n6356J38680R8910j2105k2673l3426
19884B3805p725P5311k4870J1675L7835J8920j8212n106j2084j11629l2140j8116
19872f2336M0440M4926k6646K2138k1568R793R5359K1265l243p9044O2127J1449
$$ plain form
19954 122547 93656 131676 151240 70116 -26077 6229 -53070 14641 7145 -70039 -126774 -120107
19942 -120107 26840 27051 -20785 -42008 -21738 78325 67637 26246 40776 163651 159869
19931 159869 80902 42215 87631 177989 120233 96432 168960 186318 165475 104630 89153
19920 89153 92600 113910 32964 14060 -25579 -61144 -20600 128773 172217 157493 103269 76623
19908 76623 67638 74275 48261 -6788 -4651 -18536 -55318 -173410 -181058 -216744 -174539 -58159
19896 -58159 -1818 -67914 -58741 -5057 9028 -89225 -145581 -6901 92009 79904 57231 23805
19884 23805 16080 91391 66521 78196 116031 134951 116739 111633 99549 -12080 -44220 -62336
19872 -62336 -21896 23030 -3616 18522 -3046 6747 102106 123371 120128 41084 103211 114660
19860A14660l8010m5927q0556j2852J20126L2629k9472m2950p0981J8742k4712
19849e9303k328j573m783N5823Q1798k8999m5198j2755L7833K726n6908L2312
19837a355j1873R33p0855k183P4310k7967n9433L1307L3774o097J3101J4199k0824
19824c2963L7193N6378j5655J1362n1172k6568M2473j11831N240J9401N1N4961
19812a1130N1789J9097J0340J1980k3009j05306k5048J19339k679r2449M4303
19801b773M3715j1244j8642K8849K9720N9875O2145r1738m0685m7356k7833k6933
19789d2900m7129o3313J15736M1055n0193Q2328P2027K8963L1051J698q9019l3015
19777D7289O1387J084q3365P9567L3045n4850l6796J3783J24625P655j03013q371
$$ plain form
19860 114660 76650 30723 -49833 -62685 57441 90070 60598 17648 -53333 -34591 -59303
19849 -59303 -61631 -63204 -67987 -12164 69634 40635 -4563 -17318 20515 23241 -33667 -1355
19837 -1355 -13228 -12295 -83150 -85333 -11023 -38990 -98423 -67116 -33342 -39439 -26338 -12139 -32963
19824 -32963 4230 60608 44953 56315 5143 -21425 21048 -90783 -85543 -66142 -66091 -11130
19812 -11130 40659 59756 70096 82076 59067 -46239 -71287 48052 45373 -47076 -2773
19801 -2773 40942 29698 11056 39905 69625 129500 191645 99907 59222 11866 -15967 -42900
19789 -42900 -90029 -153342 -37606 3449 -46744 35584 107611 136574 167625 169323 80304 47289
19777 47289 108676 109760 26395 105962 139007 84157 47361 61144 185769 193424 90411 82040
19765H2040K0625K5873J4382J0806j3244J30065J49405Q0965l4816J17633J66269
19754G50003Q2647O229q8533p4372j4961L5547j75007j86386j33168o5564J9367
19743A55802p785K4353n879o8625L6905K4793m2874N4545L0861k3831k059m6976
19731A29230j0598N0218M1884J2916J0049P3235m8362k3742p507K8727n2368q1204
19719A22478R761Q7178Q1776p9264r6792q3477m4121L9094L0036j1718O5116r558
19707A10509J5817L0028q1159q4605k2379J25364J40840k3828o1497k783Q079
19696A54386O172q2984l5098M3905P3654n4910r4991k9320J3779p2672k6815O0913
19684d3981P5828k7993J6814M9119k2487k6999k9392o0552M7865N7704J15761
$$ plain form
19765 82040 102665 128538 142920 153726 140482 270547 419952 500917 466101 583734 750003
19754 750003 832650 838879 750346 675974 661013 696560 521553 335167 201999 136435 155802
19743 155802 148017 172370 166491 97866 134771 159564 116690 171235 202096 178265 176206 129230
19731 129230 118632 168850 210734 223650 233699 306934 258572 234830 227323 256050 203682 122478
19719 122478 132239 219417 301193 221929 125137 41660 -2461 36633 66669 54951 120067 110509
19707 110509 126326 156354 75195 -9410 -31789 93575 234415 210587 149090 146307 154386
19696 154386 160558 77574 42476 86381 160035 105125 10134 -19186 -5407 -78079 -104894 -43981
19684 -43981 31847 3854 20668 69787 47300 20301 -9091 -69643 -21778 35926 151687
19673A51687q1327q5202O6783M4534r956o7404k9738N3066K4208m6954l1686j0547
19661b2536L1797l2000L8063J3143n5988M226M3296j8920j6735j0673k6849K3561
19649b9615M3444J15191P756J4763k72N0011J5011n3967j06540O3034j8699q0976
19637A9141k0336p3447O9688J09623O4225P3228j1430m8205j440K1777j21455
19626H1369k8278k712K7116m1084O0391j8000n8301R927N2241M1595l3690k4231
19614F6343q1996O2159L3631q9413m9505O1169J05039O0456p4951j9525K1537
19603I4944J6722j019L9718k6084l349k0394k1465m1030J1207M8629K7075j02132
19591B2822O4648Q1409L4536l2206q5752R0519N3717k9007j27931m1866P5573
$$ plain form
19673 151687 70360 -14842 51941 96475 86519 19115 -10623 42443 66651 19697 -11989 -22536
19661 -22536 9261 -22739 15324 28467 -27521 -23295 20001 1081 -15654 -26327 -53176 -29615
19649 -29615 13829 129020 136776 151539 151267 201278 216289 162322 55782 118816 100117 19141
19637 19141 -1195 -74642 -4954 104669 168894 242122 230692 182487 181047 202824 81369
19626 81369 53091 50379 77495 36411 96802 78802 20501 30428 82669 124264 90574 66343
19614 66343 -15653 46506 80137 -9276 -58781 2388 107427 167883 92932 73407 94944
19603 94944 111666 110647 150365 124281 120932 100538 79073 38043 49250 97879 124954 22822
19591 22822 87470 168879 203415 171209 85457 175976 229693 200686 72755 30889 106462
19580A06462L3977j5443n2520k8820M55M6215R904L928o0185l3352j5328K0948
19568A6241p324M5279P266Q9829K0786k6584j4968n4416k8134m124Q3644j6312
19556A11183j10350q0496M8243p626Q7726j2018K1223k5016O863l5332L8615O6094
19544A09109L1568l9029M253L9245J48074K5937j03596o1807m738N5040n7775
19533A46281r7956q4382L8544k8214j2549P4624m101J6547N646R603J2918l1862
19521D5099N7O5856N7270M8627r966p9521k1190J15896J49289p5777j24435r071
19509A62134Q5809k9323k8883m1036J82355L6060m772j8735j24561j02484j5811
19498A00753j9207j7484R1377R77m4083q7964o1048J05933J01847N7633L2834
$$ plain form
19580 106462 140439 124996 72476 43656 44111 90326 100230 104158 43973 10621 -4707 16241
19568 16241 8917 54196 61462 151291 172077 145493 130525 76109 47975 43851 127495 111183
19556 111183 833 -79663 -31420 -39046 48680 36662 57885 32869 39732 4400 43015 109109
19544 109109 140677 101648 105901 145146 293220 319157 215561 153754 149016 204056 146281
19533 146281 48325 -36057 2487 -25727 -38276 36348 32247 48794 54440 64043 76961 45099
19521 45099 45156 111012 168282 216909 206943 127422 106232 222128 371417 295640 171205 162134
19509 162134 247943 218620 189737 148701 331056 367116 362344 343609 219048 116564 100753
19498 100753 81546 64062 155439 156416 112333 24369 -36679 69254 171101 228734 261568
19487B61568K6554l0210J09732J43368J17197O6416K8634O0913J68258N9721q8242
19476I23909L2940J55817N0620o502q0038j51250j15366j90486j15797j23422
19466C80425n1770l3730k8776j03132K2223J2334K274P1194o3228n8623J4628
19455A63819m0651l5171N1572L930j9539Q876p871M4854J0964K27n181L4905N8893
19442B69627J58702R5900K3699L9262P0948J9594k0333l1173O3304N1100m6827
19431F93803j38159j05272k5446O590l9393j59104q4118L0031J28668n0824k5818
19420B30958l2146k1705M2457Q6020n0517Q0830J57586P6963O5725J5016q883
19409F42304j6895J7881k5282m2942R01Q7919k9740J6140J36347j3280j28381
$$ plain form
19487 261568 288122 257912 367644 511012 628209 694625 723259 784172 952430 1012151 923909
19476 923909 956849 1112666 1163286 1156784 1076746 925496 810130 619644 503847 380425
19466 380425 328655 294925 266149 163017 185240 197574 199848 271042 207814 149191 163819
19455 163819 123168 87997 139569 143499 123960 132836 124965 169819 180783 181010 175829 210734 269627
19442 269627 428329 524229 547928 587190 658138 677732 657399 626226 689530 740630 693803
19431 693803 555644 450372 424926 431516 392123 233019 148901 178932 307600 256776 230958
19420 230958 198812 177107 219564 305584 255067 335897 493483 570446 636171 651187 642304
19409 642304 625409 643290 618008 575066 575967 663886 634146 650286 786633 773353 644972
19398F44972q456o002r8252j4970J4859j8148n4603l3473l7490n5938K857l2146
19386C03210N9891J03715O3348O7365j2603R1606J67677R6237J49092J17654n550
19375A201642q4244j01683m8193p2629j05598l5470J49909J36786J03325L4774
19365A178619O3281r7573k29358j58165l1449m6102j44971j19589q2970j05594
19355B26129j17258m1016N3967P3508K5944m1556m3411L2013R7920O0037l5638
19344B90639k9104l8136k9765J7324o8860p3744O9827Q8699p916m6036r0161M7071
19332A29838J03189L8417l1136j06148l0130m2121J19399j991Q726L003J07917
19321B98963l4252j08948l8557m8478n7848M4460N7210Q9961k9853M9461q3630
$$ plain form
19398 644972 636516 630514 532262 517292 532151 514003 459400 425927 388437 332499 335356 303210
19386 303210 363101 466816 530164 597529 584926 676532 844209 940446 1089538 1207192 1201642
19375 1201642 1117398 1015715 967522 894893 789295 753825 903734 1040520 1143845 1178619
19365 1178619 1241900 1144327 914969 756804 725355 679253 534282 414693 331723 226129
19355 226129 108871 67855 121822 195330 221274 179718 136307 168320 266240 326277 290639
19344 290639 261535 223399 193634 210958 142098 68354 138181 226880 218964 172928 82767 129838
19332 129838 233027 271444 240308 134160 104030 61909 181308 179317 188043 191046 298963
19321 298963 264711 155763 117206 68728 10880 55340 112550 202511 172658 222119 138489
19310A38489J0640P716m5460J9608L3168O1304P8767m9002j9150o3136m4272p069
19298A21603k3567J068J2939j968m5044J0829M7023L9597R8172j09538j81762
19287c0648K5415N7516j0435J1608L3377L0672J22195N8814k9426j0088N2229
19276C11229k2391q6446p3324j095l206N5167K9440l1773j8726N6133k2616k2609
19264A69783k1081M6085O1826m8727k5752l4761R852N7929L4204n0778L648j3587
19252A88641K4371K0603r193O0920K7989P4539M1566L0994R7239P727k9911o4015
19240D71470j13991r9272o076P4441M1750m9648j02887o1236j4723n760N6755
19229A90823J2700M303M3761N5280J9680J4850K769j06375Q880j4695o1129q409
$$ plain form
19310 138489 149129 156845 111385 130993 164161 225465 304232 255230 236080 172944 128672 121603
19298 121603 98036 99104 112043 110075 65031 75860 122883 162480 260652 151114 -30648
19287 -30648 -5233 52283 41848 53456 86833 117505 239700 298514 269088 259000 311229
19276 311229 288838 202392 129068 127973 124767 179934 209374 177601 158875 215008 192392 169783
19264 169783 148702 194787 256613 207886 182134 147373 157225 215154 249358 198580 202228 188641
19252 188641 213012 233615 224422 285342 313331 387870 429436 460430 557669 565396 535485 471470
19240 471470 357479 258207 252131 326572 368322 318674 215787 154551 139828 134068 190823
19229 190823 203523 207826 251587 306867 326547 341397 344166 237791 246671 231976 170847 162438
19217A62438n7746n516Q6317R92m2739k8539K4900Q1597q5452m432J5345O7376
19205B14541M8411k9516j7913L9306K1523J6973L11J741k2891n4495j8813J9691
19193B18869p5676L8954j8729j17173r44O2537O9631j5399m8344m1088N4305M4380
19181A71323k9838O6054O5903Q6775P1645p6884r2539j2074O1024o6859n9146
19170A85384O6046Q6733m3968p9277L9432k3626j5128O5653l7115J916m0103o77
19158B05270N6103m7064m7967k1760M5562J4104k069J887N2535J11171j9575m4427
19146C03770K0574l2987m4955k9693J4594K3816n4731M7702J4789j1729m3015
19135B08135K4822k4278p3763M2166j2470o627J9462m2634N5340J7223P070J4463
$$ plain form
19217 162438 104692 99176 185493 186485 143746 115207 140107 221704 136252 131820 147165 214541
19205 214541 262952 233436 215523 254829 276352 293325 293636 295377 272486 217991 199178 218869
19193 218869 143193 182147 163418 46245 45301 107838 177469 162070 113726 72638 126943 171323
19181 171323 141485 207539 273442 360217 431862 354978 262439 250365 311389 244530 185384
19170 185384 251430 338163 294195 214918 254350 230724 215596 281249 244134 246050 205947 205270
19158 205270 261373 214309 166342 144582 190144 204248 202179 204066 256601 367772 348197 303770
19146 303770 324344 291357 246402 216709 231303 255119 200388 248090 262879 251150 208135
19135 208135 232957 208679 134916 177082 164612 157985 177447 134813 190153 207376 214446 228909
19123B28909m3406j8486K4472N660Q0587O2013L4024l7549k5621r7764L565n68
19111B15836L2695m9261L3757M8746q6189r985m7538j4873K7909L9433k9Q229
19099A98730P319k8670K7925k5631n5117J04214K1218n5801j4465O2304N0450
19088B92476N9701P3622N4145o3754o0210m024M2999l0505J0028o1072p9038j4005
19076B20363N746J9488j03927j923K7656P4312N0558m4143l582j1767j683L5495
19064B66593J7836N268j0109j04303j4601j3779K3230O2365k3363N5516L3517
19053B98170m9385j7887J8992m1487P2393P8427k1051j28627p1353N2056J29355
19042C19603L011m1279m8851j3227j3098M8996Q1241k6617J2412r887l3588J5821
$$ plain form
19123 228909 185503 167017 191489 197149 277736 339749 373773 336224 310603 212839 216404 215836
19111 215836 248531 199270 233027 281773 195584 185599 138061 123188 151097 190530 190501 198730
19099 198730 206049 177379 205304 179673 124556 228770 249988 194187 179722 242026 292476
19088 292476 352177 425799 479944 416190 355980 351956 394955 364450 374478 313406 234368 220363
19076 220363 226109 245597 141670 139747 167403 241715 292273 248130 244548 232781 231098 266593
19064 266593 284429 289697 279588 175285 160684 146905 170135 232500 209137 264653 298170
19053 298170 248785 230898 249890 208403 280796 359223 338172 209545 138192 190248 319603
19042 319603 322614 281335 232484 219257 206159 255155 336396 309779 322191 312304 278716 294537
19030B94537N1402J09926m687m8239k281o8357n4167l4292J673M7398O0227N9740
19018D12880M1586O5187r416m3850r5650n718m6667m2963O2609k2634j2818m3804
19006B58742k3082q650R3484M9572k4239m5692J8035L2696r3243q7363M818J32643
18994C07721N4962K3799R7630r932o0678K588l7166N3758p2154J1801K4236j8549
18982C78016Q8995R7895J7204l9228q906R864l6965L9722P2320p9106q0343J0194
18970D69662j6262r8772J0440O6864L6656O6559K4416L5086R4862m2o617P25l3779
18957F49798M1423j7407m6917l5479l5314o6909o920k0834k6075M5340L7415N2569
18945E70690L6715q8984K0607L2014n3587J2122P1473J08601N2517O838J4826
$$ plain form
19030 294537 345939 455865 451178 402939 400658 332301 278134 243842 245515 292913 353140 412880
19018 412880 454466 519653 510237 466387 370737 365019 318352 275389 337998 315364 302546 258742
19006 258742 235660 227010 320494 370066 345827 300135 318170 350866 257623 170260 175078 307721
18994 307721 362683 386482 484112 474180 413502 416090 378924 432682 360528 372329 396565 378016
18982 378016 467011 564906 582110 542882 533976 543840 506875 546597 618917 539811 459468 469662
18970 469662 453400 354628 365068 431932 468588 535147 559563 594649 689511 689469 682852 683577 649798
18957 649798 691221 673814 626897 591418 556104 489195 482275 461441 435366 480706 518121 570690
18945 570690 607405 518421 539028 571042 517455 529577 601050 709651 762168 769006 783832
18934G83832j32244o2163J1328O0639p732K581M1627J16348Q0761N8472K44590
18923A198039L26224M90063M95716K17595K70848N84286Q09917L92942j11768
18914D673862r3412J3253J55638P78j71816p43484o04328l26183j87815m26213
18904B290280n37829k67535p9278j86381j36537q8559n8993k1322N7793p203J9726
18893I84162n3509n5830p7978l0705l3977K8800p5675j2361J8409k5282J8771
18882F84825o850R9351o7997k3604Q0166O7587P507r4250M3302K6655p1889J715
18870G46518j343m5951K2803o0869M773L7701M1920J1253J556k532M9025J14078
18858I18932J20009K24267K47763M40973P18258R37374P19649L62719M72273P93964
$$ plain form
18934 783832 651588 589425 600753 661392 653660 656241 697868 814216 894977 953449 1198039
18923 1198039 1524263 2014326 2510042 2727637 2998485 3582771 4392688 4785630 4673862
18914 4673862 4580450 4593703 4749341 4750119 4578303 3834819 3230491 2904308 2716493 2290280
18904 2290280 1752451 1484916 1405638 1219257 1082720 994161 935168 913846 971639 964436 984162
18893 984162 930653 874823 796845 766140 732163 760963 685288 672927 691336 666054 684825
18882 684825 677975 777326 709329 685725 765891 833478 840985 746735 790037 816692 744803 746518
18870 746518 745175 699224 722027 661158 665931 703632 745552 756805 758361 755829 804854 918932
18858 918932 1038941 1263208 1510971 1951944 2670202 3607576 4327225 4689944 5162217 5956181
18848E956181P18125n81398q60894l29019J27992j4564j84923K86449L10773Q0160
18838E508882J39256O12107M97439n77041q27971m56046j99634o37867r66279
18829C092846n93632l31022k17275j01788m8730k6097o9747m4735p2244j08781
18819A478795o0037K442J0231o8701K5148k9406m3767n421m3092q3735n5825K8823
18807A155455L3976P3578K3142N6261K8188j40180J8169R3521K5837o3436l2611
18796A271900j3800N5402k4568p0452r4821j2008L007P0561J4110M7485j161q9452
18784A156203k8934P3818J00461R0359J4754J6566K6624j5593N2229J276L444
18773A491207P8958J87130J53386O4878J93474K65387J60715K15121K17020Q4248
$$ plain form
18848 5956181 6674306 6092908 5232014 4902995 5030987 5016423 4831500 5117949 5428722 5508882
18838 5508882 5648138 6260245 6757684 6180643 5352672 4896626 4696992 4059125 3092846
18829 3092846 2499214 2168192 1950917 1849129 1800399 1774302 1704555 1659820 1587576 1478795
18819 1478795 1418758 1421200 1431431 1362730 1387878 1358472 1314705 1309284 1266192 1182457 1126632 1155455
18807 1155455 1189431 1263009 1286151 1342412 1370600 1230420 1248589 1342110 1367947 1304511 1271900
18796 1271900 1258100 1313502 1288934 1218482 1123661 1111653 1114660 1185221 1199331 1246816 1245655 1156203
18784 1156203 1127269 1201087 1301548 1391907 1406661 1423227 1449851 1434258 1486487 1487763 1491207
18773 1491207 1570165 1757295 1910681 1975559 2169033 2434420 2595135 2810256 3027276 3111524
18763C111524m6301j12934K4367J6282m6308k6477J73160K03979K02353K48033
18753C747678K61555K80122L13571L32274K33347R6516L6926J2684J87795L19172
18743E821640J82699O7746K07289L39583L18115L58786M07581L42438M02071O25585
18733I073533P26601R03584J064572J436705K132790K948520M497594P869427
18725C0653326J3821905K1854080K8342144K5080908J6981374J8362356J7650959
18718A72747052R52761k3241614j8393461n655780j3918874r264170J0578884
18711A13804798K0121486J5060341J2492464J5987857Q190795j6458000k9858187
18704A39341554j6125253j6839966l0431255k1896847j1430671o594357m466479
$$ plain form
18763 3111524 3065223 2952289 2976656 2992938 2946630 2920153 3093313 3297292 3499645 3747678
18753 3747678 4009233 4289355 4602926 4935200 5168547 5265063 5301989 5314673 5502468 5821640
18743 5821640 6004339 6072085 6279374 6618957 6937072 7295858 7703439 8045877 8447948 9073533
18733 9073533 9800134 10703718 11768290 13204995 15337785 18286305 22783899 30653326
18725 30653326 44475231 66329311 94671455 119752363 136733737 155096093 172747052
18718 172747052 173699813 150458199 132064738 126408958 112490084 103225914 113804798
18711 113804798 133926284 148986625 161479089 177466946 185657741 169199741 139341554
18704 139341554 123216301 106376335 75945080 54048233 42617562 36023205 31556726
18697C1556726l100024k315341j868350j554692j269661j170003j213691r56029
18689A8108935q38915q63837q97500p71790n45805o86305o86765m90809m09464
18680A1917745m43089m58230l98631l54718m24282l54522l87510m73080m83475
18671H140208m02478k90110k27014j84802j22126j19448k25970j80802j79031
18662F208427k78087l03578l07471l43697k82292j37123j54002j40180r4216k05267
18652C962514k12577j34396j34630j54273j36817o3474n5748j56049j26252j5446
18642B772852q113p0935j22875n4704j7277q4395o1638q8120o0099j03331R066
18631B110431l0055j29405j29909m4847r7830q0154p2181l1847Q0331K1042j52213
$$ plain form
18697 31556726 28456702 26141361 24273011 22718319 21448658 20278655 19064964 18108935
18689 18108935 17270020 16406183 15508683 14736893 14191088 13504783 12818018 12327209 11917745
18680 11917745 11474656 11016426 10617795 10263077 9838795 9484273 9096763 8623683 8140208
18671 8140208 7737730 7447620 7220606 7035804 6913678 6794230 6568260 6387458 6208427
18662 6208427 5930340 5626762 5319291 4975594 4693302 4556179 4402177 4261997 4167781 3962514
18652 3962514 3749937 3615541 3480911 3326638 3189821 3126347 3070599 2914550 2788298 2772852
18642 2772852 2764739 2693804 2570929 2516225 2498948 2414553 2352915 2264795 2204696 2101365 2110431
18631 2110431 2080376 1950971 1821062 1776215 1678385 1598231 1526050 1494203 1574534 1595576 1443363
18620A443363p9329o3421o0998q3506r8686j62410j60016o4132l5975p0620m5225
18609E19045m6516o9162p3862n4572m0622n0571l0644n811K6816j1999P0576p7766
18597A54912j26729Q878L4691K519J4413J0291k4834K111L1981N446J4432P4442
18585B02553N3510j6035l716n0558J8297q9899o5333J16654N4024j5637m8586
18574A55274l1538n9224R2377P486m3258l8970M7607L9743k5317k9822j8044M149
18562A00463p3181r0279K4418J25434Q6572J00087J0172p7451J3223l7497n567
18551A76394R6194l2829q9203K2203P0403M0758K1035l9415J0818M3924J9402
18540C39684K8219n7623L6008L0429J4538K4333o2174j25296k7635L4427Q757
$$ plain form
18620 1443363 1364034 1300613 1239615 1156109 1057423 895013 734997 670865 634890 564270 519045
18609 519045 472529 403367 329505 274933 234311 183740 153096 147285 174101 162102 232678 154912
18597 154912 28183 37061 71752 74271 88684 98975 74141 76252 108233 113679 128111 202553
18585 202553 256063 240028 236312 185754 204051 114152 48819 165473 219497 203860 155274
18574 155274 123736 64512 156889 164375 121117 82147 129754 169497 144180 114358 96314 100463
18562 100463 27282 -62997 -38579 86855 173427 273514 283686 206235 219458 181961 176394
18551 176394 272588 239759 150556 172759 243162 283920 304955 265540 276358 320282 339684
18540 339684 367903 310280 346288 376717 391255 415588 353414 228118 200483 234910 243667
18529B43667o6587m9722M1386R197l8861l4808N3032k1007m0646N7949J7137J3146
18517A83883l7318n1874m9126N9449O6233J1054o5087l8606l1858j9340R1432
18506A18842K3859K4561n1371n7514R076J2342J9940J2088L7750J8690m0707q0853
18494D6703J5116M2961k6912M3749n7769J3667J2742J13593J42706r1253K206
18483B57509N0134L3988M235q1571p7165k3508J0645l1398j6146M6353n06r6033
18471G6537k9881R093N0103K7383N2653j9665k873M7954P9209o8401m4351j3635
18459A64126q1542m4257l3626j5157K531K0443K0584k0698N9874j2275m3390m0177
18447b3564k9306j8136K8473N1744j4734J09692j7019j6859l717L7396k1250j0877
$$ plain form
18529 243667 177080 127358 168744 177941 139080 104272 157304 136297 95651 153600 170737 183883
18517 183883 146565 94691 45565 105014 171247 182301 117214 78608 46750 27410 118842
18506 118842 142701 167262 115891 58377 67453 79795 99735 111823 149573 168263 127556 46703
18494 46703 61819 104780 77868 121617 63848 77515 90257 203850 346556 255303 257509
18483 257509 307643 341631 345866 264295 187130 163622 174267 142869 126723 173076 172570 76537
18471 76537 46656 55749 105852 133235 185888 166223 163350 211304 290513 222112 177761 164126
18459 164126 82584 38327 4701 -10456 -7925 12518 33102 12404 72278 60003 16613 -23564
18447 -23564 -52870 -71006 -42533 9211 -5523 104169 87150 70291 66574 103970 82720 71843
18435G1843N4438R826m6579l6974J784J1003l1965l7234k9282L8782O2990M9689
18423A18321k9280K3634m4395J4936p666p5698O4533J8375m4970j07089M9346
18412a9953k244m2484M7350N5118N0525l8963J01467K2875j04528q6676J8864
18401A351n3707l0703o1566M6287P0125R0364l0170n6160J0796K3352m2106j36336
18389a68473M9516P719L5878O4865K4723M8889J20381N1690r5431m9798L6707
18378A26666P9572l9166j51221r1517J7639O543N708L3206M8182l4691j9830l6395
18366e5304L2946K3072L4871J17151o6813q1848p4616L6724Q9822J7817n0797
18355B3025m7432K759O4720j7952j8071K5271m8650J7208L3470P3819j347o5155
$$ plain form
18435 71843 126281 136107 89528 52554 54338 65341 33376 -3858 -33140 5642 68632 118321
18423 118321 89041 112675 68280 83216 75550 -148 64385 82760 37790 -69299 -19953
18412 -19953 -22197 -64681 -17331 37787 88312 49349 150816 173691 69163 -17513 1351
18401 1351 -52356 -83059 -144625 -98338 -28213 62151 31981 -24179 -13383 9969 -32137 -168473
18389 -168473 -118957 -111238 -75360 -10495 14228 63117 183498 235188 139757 89959 126666
18378 126666 206238 167072 15851 -75666 -58027 -51484 -45776 -12570 35612 921 -18909 -55304
18366 -55304 -22358 714 35585 152736 85923 4075 -70541 -33817 56005 73822 23025
18355 23025 -24407 -21648 43072 25120 7049 32320 -16330 878 34348 108167 106820 41665
18343D1665j48481l7417L2362J9759K8663R544Q8472R542j2178J6996O3256M29
18331A12612r9833n9744O3406L1378K7798O4005m3573k3888j3057p7513l5434
18320e3843M5029N4808l1266j5205J5954N4834L459o2064Q0129Q9712j9315j0485
18308A51747K1189q4925o110j898K9475M2289K4094J8912J10379J89553J68469
18297F63174J25948N6461O0217J66660K53211Q4956j42562k27819r1460r9748
18287H49038n6188j11251J35485J55655J05213J32465Q1076J42553K56684J05925
18277A796655k46827k85808j12283o8960j26864l24629j77736j11639L3838j4321
18267C61426j5318K8296K6939L1300M7507j426l451K8584Q4361J47989K67657
$$ plain form
18343 41665 -106816 -144233 -111871 -92112 -63449 -53905 34567 44109 31931 48927 112183 112612
18331 112612 12779 -46965 16441 47819 75617 139622 96049 72161 59104 -18409 -53843
18320 -53843 -8814 45994 14728 -477 15477 70311 73770 11706 91835 181547 162232 151747
18308 151747 172936 88011 81901 80003 109478 151767 175861 194773 305152 494705 663174
18297 663174 789122 845583 905800 1072460 1325671 1410627 1268065 1040246 948786 849038
18287 849038 792850 681599 817084 972739 1077952 1210417 1291493 1434046 1690730 1796655
18277 1796655 1549828 1264020 1151737 1082777 955913 631284 453548 341909 375747 361426
18267 361426 346108 374404 401343 432643 480150 478724 475273 503857 588218 736207 1003864
18256A003864M33246N97318P73374N64369M67750K90121J73668J33546J33439
18247D570695K08086k88712k22664k23019k69845m98126m01950o88428o49499
18238A536538k98512j27736n5980j25566R729j00122j27813j45983p4072J07542
18228E98025K3391o2230J9250P9761m1547m6728J9484p8790j14473j4752p858
18217C73533k5699j19l7218j8166L7224N7000j8742j29443r1214k812R4404O5785
18205C04533j8354l9690k2679K3621O3880J3618K5534M8543N564K8812j05153
18194C28229r2453K8964J9171L6652l6894m5462J6641K2708Q2158O0071j7578
18183D02207k254K2151k3942m1363j5612j12975N1097K5361P7784R9739Q4230
$$ plain form
18256 1003864 1437110 2034428 2807802 3372171 3839921 4130042 4303710 4437256 4570695
18247 4570695 4778781 4490069 4267405 4044386 3774541 3276415 2874465 2186037 1536538
18238 1536538 1238026 1110290 1054310 928744 938473 838351 710538 564555 490483 598025
18228 598025 621416 559186 578436 658197 616650 569922 589406 510616 396143 381391 373533
18217 373533 347834 347715 310497 292331 329555 386555 367813 238370 147156 144344 238748 304533
18205 304533 286179 246489 223810 247431 311311 324929 350463 399006 404570 433382 328229
18194 328229 235776 264740 283911 320563 283669 238207 254848 277556 359714 419785 402207
18183 402207 399953 422104 398162 356799 341187 228212 279309 304670 382454 482193 566423
18172E66423R4151j1862rj1817Q128m9054n3050q2956r2477k8929O2917N0779
18160D52244Q0672J10121L2493l6035m1468p3196K0893l3159q2769m2689o200
18149C80907R2291J25894k6648p7230J0960K0515O0221L8309R0375L8515q2065
18138F72044M0832O4697J13785O1052m3673J5438J35777J51326N7754m32J58391
18127A426991J30316J87565K28650K36174L11891L93407M91722O27536Q98039
18118D932291J125577J663944K529145M121749P467588J3908500K1986650K5482839
18110H3218283J3073580m132976n493228K335773k338815k7423940k3917452j1673681
18102B3647544n904488l515014k228539j517024j167110q89761o06343m55122
$$ plain form
18172 566423 660574 648712 648703 636886 645014 595960 542910 459954 367477 338548 401465 452244
18160 452244 532916 643037 675530 639495 598027 524831 545724 512565 429796 387107 380907
18149 380907 473198 599092 572444 495214 506174 526689 586910 625219 715594 754109 672044
18138 672044 712876 777573 891358 952410 908737 924175 1059952 1211278 1269032 1268600 1426991
18127 1426991 1557307 1744872 1973522 2209696 2521587 2914994 3406716 4034252 4932291
18118 4932291 6057868 7721812 10250957 14372706 21840294 35748794 57735444 83218283
18110 83218283 96291863 92158887 86665659 89001432 86662617 59238677 35321225 23647544
18102 23647544 17743056 14228042 11999503 10482479 9315369 8425608 7819265 7364143
18094G364143m84010m30635m84660m59472k32144j59283l31427l30955k33641
18085D217916k42566k33590j52813j21638j50458j27425k38940j21540j11736
18076B717210o9118j15957k05840r5326q8325j19636j32725L4341L6233m418p4902
18065A881537j23455r8893k0137j3060m4175m3136M49J25779J76849J09130M5230
18054A996118Q26M6981N860j15616k03869j70953l7625p9280R347J31326Q5386
18043A668501k4001N7198J12788j48750k54664o6209j70475j63400j66851n0960
18033G93177k2784j01834n743L2869O433o267K4723o5370j01956K2568J8755p3321
18021E21250r2905o038q8986K2566N2165l3066j00310n1372n8031j5958K4577
$$ plain form
18094 7364143 6880133 6449498 5964838 5505366 5273222 5113939 4782512 4451557 4217916
18085 4217916 3975350 3741760 3588947 3467309 3316851 3189426 2950486 2828946 2717210
18076 2717210 2648092 2532135 2326295 2230969 2142644 2023008 1890283 1924624 1960857 1956439 1881537
18065 1881537 1758082 1659189 1639052 1625992 1581817 1538681 1539130 1664909 1841758 1950888 1996118
18054 1996118 1996944 2043925 2049785 1934169 1730300 1559347 1521722 1442442 1451789 1583115 1668501
18043 1668501 1644500 1701698 1814486 1665736 1411072 1344863 1174388 1010988 844137 793177
18033 793177 770393 668559 662816 695685 702118 695851 720574 655204 553248 575816 594571 521250
18021 521250 428345 422307 333321 355887 408052 374986 274676 223304 165273 149315 173892
18010A73892l4920j226N3300l7229l1796j5326J1706o1142l0681J0583J7873o2606
17998g572p8962r34O4049P7277L8808K3279R3732l7385j0501n319n7868j08468
17986i864l5528O2242M6159o2256m3367J08591l644L2232M3342k7292p225l666
17974I9724l429q605J7631m4930J5739l0705j0551O0634q4550n8294J1565p4492
17962a10263m2207N2847L3591j5984p0971O3635K1780k6074r230p041m3520M6728
17950a06709M8588N0002Q1364K9565j5890j03273j10200p1817J6763N8322O866
17939a16419N8039N7262k1458O1820K6901l526o3836r73M1869J2489O1898p146
17927A06920j3669L5924M9341k3759l2263p7628m8227o16N3288K1928o5300N736
$$ plain form
18010 173892 138972 137746 191046 153817 122021 106695 118401 57259 26578 37161 55034 -7572
17998 -7572 -86534 -87468 -23419 53858 92666 115945 209677 172292 161791 156472 98604 -9864
17986 -9864 -45392 16850 63009 753 -42614 65977 62333 94565 137907 110615 103390 99724
17974 99724 96295 87690 105321 60391 76130 45425 34874 95508 10958 -47336 -35771 -110263
17962 -110263 -152470 -99623 -66032 -82016 -152987 -89352 -67572 -93646 -102876 -109917 -153437 -106709
17950 -106709 -58121 -8119 73245 102810 86920 -16353 -126553 -198370 -181607 -123285 -116419
17939 -116419 -58380 -1118 -22576 39244 66145 62619 -1217 -2190 39679 52168 114066 106920
17927 106920 93251 129175 178516 154757 122494 44866 -3361 -3977 49311 71239 5939 11675
17915A1675j6746K7190L2321J0634m5730M9007N0078J4527J7975l0384n7361m9808
17903A3378O9983L54j03416J5725j0382N4245J10276K9185o0964j15128L6005
17892C9261M6529J4819N9192k9783o3315o9248J3393P5164m7125K7329Q8266J18378
17880B72860L5967J06318O1853L8985J59148J19316R1876N7291n6301j87417j54749
17869E45147q1144n0911J03254J24864O4687R5024R9472M7002k635o6293j72843
17858G05624j00725j31555j89650r4955p3521K1565K8493j7285j30020J8251l7667
17847a445j8010R3909k9759L49N1298j2162l5268r4637L3630l4246J0052Q2485
17835D6196K9171j0847l9413m5611l1242K8444m6444Q6128j9649L3909q6474r4311
$$ plain form
17915 11675 -5071 22119 54440 65074 19344 68351 118429 132956 150931 120547 63186 13378
17903 13378 83361 83715 -19701 -3976 -14358 39887 150163 179348 118384 3256 39261
17892 39261 85790 100609 159801 130018 66703 -2545 10848 86012 38887 66216 154482 272860
17880 272860 308827 415145 476998 515983 675131 794447 886323 943614 887313 699896 545147
17869 545147 464003 413092 516346 641210 705897 800921 900393 947395 944760 878467 705624
17858 705624 604899 473344 283694 188739 115218 136783 165276 147991 17971 36222 -1445
17847 -1445 -19455 74454 44695 45044 96342 84180 48912 -45725 -12095 -46341 -36289 46196
17835 46196 75367 64520 25107 -20504 -51746 -23302 -69746 16382 -3267 30642 -55832 -150143
17823a50143J4852M3327P5815l5492k9936m531R4701Q1918J3627r2458l6388L640
17811b1068O9932Q0989K841k0315J8004k7422n2011J9639k2341q3577m4611O0003
17799a9937P533j20921o0394P4236L9048R515J25199N699j21254n7051R3477Q8677
17787F3827K8204L4161j0096L9506r0056r4650L6345N8231J06268j2195J5464
17776A75009l3715j14374J5055M5254k5631q012R9647n446r7366l8153O1844J05188
17764A79300N4509k2832m3606J17260L8672n139P0312N5696m8696k7455J42489
17753E10510L7408P4510J88597N20934Q02396J050426J057739P59272N36950L62703
17743E901445j6519o58322o91557m51227p66256l30429L38899P92360P18484N77635
$$ plain form
17823 -150143 -135291 -91964 -16149 -51641 -81577 -86108 8593 90511 104138 11680 -24708 -21068
17811 -21068 48864 129853 132694 112379 130383 102961 50950 70589 48248 -35329 -79940 -19937
17799 -19937 -12404 -133325 -193719 -119483 -80435 -70920 54279 59978 -61276 -118327 -24850 63827
17787 63827 92031 126192 116096 155602 65546 -29104 7241 65472 171740 159545 175009
17776 175009 141294 26920 41975 87229 61598 53586 153233 147787 50421 12268 74112 179300
17764 179300 233809 210977 167371 284631 323303 318164 388476 444172 395476 368021 510510
17753 510510 547918 622428 811025 1331959 2134355 3184781 4242520 5001792 5538742 5901445
17743 5901445 5884926 5226604 4535047 4083820 3317564 2987135 3326034 4118394 4836878 5414513
17733E414513M45454K84094j55433q82167p87099o55729j105191p40122l99625
17724A418695j81236j60015j49125n3237N108j16378j16599n8443n7318m2127
17714D89325L0647R650n7804K5914M325M0297J6722k7424q8451r0319J555m0471
17702C13966q9507l2807L1222K3610k6204N9474m72n914J4641J7683m4866m8913
17690B11913j5948l5694J1474M3100J8068k1575k1602o7164P1195j0528o4894
17679A18345m2251M1543K5782o4451l2846J33020j7883o9557p137R163k6336p9560
17667a2168p3024M3309J07398O9481J197m5322j11943L1814Q9687L5467p5294
17656F0602J4900N9665n2097L2225k441o9735K8634O2396K2088o0382r4367j2414
$$ plain form
17733 5414513 5859967 6144061 5988628 5106461 4319362 3663633 2558442 1818320 1418695
17724 1418695 1237459 1077444 928319 875082 880190 763812 647213 588770 531452 489325
17714 489325 519972 529622 471818 497732 502057 542354 559076 531652 443201 352882 354437 313966
17702 313966 224459 191652 222874 246484 220280 279754 279282 273368 288009 305692 260826 211913
17690 211913 195965 160271 171745 214845 232913 211338 189736 122572 193767 183239 118345
17679 118345 76094 117637 143419 78968 46122 179142 161259 91702 84565 93728 67392 -12168
17667 -12168 -85192 -41883 65515 134996 136193 90871 -21072 10742 100429 135896 60602
17656 60602 75502 135167 83070 115295 112854 43119 71753 134149 156237 95855 1488 -10926
17644a0926K3571K5329M0824l8678J4762L0819n928k6657P0565L9555m8672N4377
17632A68941p8493l8938j4353N0020L0007l4240m5407l6882J9810M4142J4874
17621G9481j934N674m724l0156N5587M587m2353p6998q282M0252M1636M2821k4684
17608H0907m9222J1988m335n570L5494m228o530m4532P3658p1537j44889m0102
17596a68898L0951J11639K8410p048M3679L9011m880O925O9640j4227O3405K3816
17584B22423n7489j86153L1153Q174N023j02563L0289M8404P3470m3915p4888
17573d6072J9103L0949P5575L3713J988o4340J8759O028L2012l4091j4534j1985
17561D7105O7717K3687m4105R932Q3299J6838o2128J3560J6023l0255K5787k1217
$$ plain form
17644 -10926 12645 37974 78798 40120 54882 85701 79773 53116 123681 163236 114564 168941
17632 168941 90448 51510 37157 87177 117184 82944 37537 655 20465 64607 79481
17621 79481 77547 83221 78497 48341 103928 108515 66162 -10836 -19118 21134 62770 105591 80907
17608 80907 31685 43673 39338 33768 69262 65034 58504 13972 87630 16093 -128796 -168898
17596 -168898 -137947 -26308 2102 -4946 38733 77744 72864 79789 149429 135202 198607 222423
17584 222423 164934 -21219 9934 18108 23131 -79432 -49143 -739 72731 28816 -46072
17573 -46072 -26969 3980 79555 113268 115256 50916 69675 75703 107715 73624 59090 47105
17561 47105 114822 138509 94404 104336 187635 204473 142345 155905 171928 141673 167460 146243
17549A46243n4828K1125L9815N5213l8557j8166L8394J28104O2864k8237m2015
17538C09955q0834o016Q2187K2038l9552p7587l4009q1109l5976j1421M5415K6008
17526A19099M4048n0290p154N6731J5791k4142L3937m2521q1910R699j463j4563
17514E7262P7419K7502n4677p1179L5758J23510J13l9551r893O694k3896J277
17502A30339k6949j2470O9945O0787M7829n1779n087m6066N6267P3605N1580m1304
17490C06697j2235l1740N4163K2556o5537l0230N6757M4845N4365j22614L6838
17479C13865R9331m5686k924M2870j9788n3021J8964k6654N9381Q5060Q7579P3718
17467F32695M1680J6514k0274J06394J2832r6961l8544m3263j08512o1851P300
$$ plain form
17549 146243 91415 112540 152355 207568 169011 150845 189239 317343 380207 351970 309955
17538 309955 229121 223105 305292 327330 287778 210191 176182 95073 59097 47676 93091 119099
17526 119099 163147 112857 105703 162434 178225 154083 188020 145499 63589 73288 71825 57262
17514 57262 134681 162183 107506 36327 72085 195595 195708 156157 146264 152958 129062 130339
17502 130339 103390 90920 160865 221652 269481 217702 212615 166549 222816 296421 348001 306697
17490 306697 294462 262722 316885 339441 273904 243674 300431 345276 399641 277027 313865
17479 313865 413196 367510 364586 407456 387668 334647 353611 326957 386338 471398 558977 632695
17467 632695 674375 690889 670615 777009 789841 692880 654336 611073 502561 440710 448010
17456D48010J39860J24546P0699M4964j0338K4016j22688o1820o3194J0538J45356
17445G49949J73982J80099J30859j6743N7962K4160j47988k01178j44458r3104
17435G13540l2487j7658J20236N5129m0456R643L5726l013N3224L9465N774q0938
17423H58185j6227l2973R437M294L5890R3398L6728q66o1509L6076K8556m1412
17411I49577l0360o548K6515J41405J34729J19987O7776J8773l6298k0508N7067
17400A422115j9530j79750j18239m7785Q1131J32310K10384J24866J10681K24147
17390A940330L41982K48560J18198J0768M3132n9635k10047j55163j98565l11592
17380A767968j07324L8317J63803J61932K26811J16798O9701J01912J30540m1007
$$ plain form
17456 448010 587870 712416 783115 828079 817741 841757 719069 657249 594055 604593 749949
17445 749949 923931 1104030 1234889 1218146 1276108 1300268 1152280 951102 806644 713540
17435 713540 681053 663395 783631 838760 798304 807947 843673 840660 893884 933349 939123 858185
17423 858185 841958 808985 818422 822716 858606 952004 988732 987866 926357 962433 990989 949577
17411 949577 919217 912669 939184 1080589 1215318 1335305 1403081 1421854 1385556 1365048 1422115
17400 1422115 1402585 1222835 1104596 1056811 1137942 1270252 1480636 1605502 1716183 1940330
17390 1940330 2282312 2530872 2649070 2659838 2702970 2643335 2433288 2278125 2079560 1767968
17380 1767968 1660644 1698961 1862764 2024696 2251507 2368305 2438006 2539918 2670458 2629451
17370B629451k83750k95870k58968l00968k17459o8614J1761p6836p8456n4343
17360A005948K6715M5457O769p209j656n7564j0741J45470J2740j02207m8716
17349A015006J0098K3927M1209J07179R5116j7646n195k9474N6790P7125l2354
17338A341781J4099K3463J06998J42869J58364J07393K58092L40146K43453K03250
17328B939908K39632O0641j2174J27879J85543J97821K71666M16423L59714K35699
17318E022752J69308J66043K35228K12733J71127L45663N08160P67946J014060
17309H613020J306834J560066K006761K568083L880162O148546J0548181J8221232
17301E4852885K7362502L1155923K4038168J8796658J5569634N239405j2721849
$$ plain form
17370 2629451 2345701 2049831 1790863 1489895 1272436 1203822 1215583 1138747 1060291 1005948
17360 1005948 1032663 1078120 1084889 1077680 1076024 1018460 1007719 1153189 1165929 1063722 1015006
17349 1015006 1025104 1049031 1090240 1197419 1292535 1274889 1269694 1240220 1297010 1374135 1341781
17338 1341781 1355880 1379343 1486341 1629210 1787574 1894967 2153059 2493205 2736658 2939908
17328 2939908 3179540 3240181 3228007 3355886 3541429 3739250 4010916 4427339 4787053 5022752
17318 5022752 5192060 5358103 5593331 5806064 5977191 6322854 6831014 7598960 8613020
17309 8613020 9919854 11479920 13486681 16054764 19934926 26083472 36631653 54852885
17301 54852885 82215387 113371310 137409478 156206136 171775770 177015175 164293326
17294A64293326k2040839j1054956j7799636j4996112N670997K0582199K1982372
17287A46637351J5205679J3431453P037361o480536k5305898k1638001j8954727
17280A09932682l1017358k3031889j2230081o804332m404549l311120k474823
17273B6658530k035046j785982j715075j483582j151521r92727r14623o78224
17265A5901750n84731n36732m22321l80274n37786o74108o23213o37355q03147
17256A0702083o28124n10412l33449k96911j65922k00165k23958k86081l20034
17247G737027l31164l78321m05664m33007m05067k59321r7551j11935j65707k26184
17237D923106k39735j92078j18121j14945j16033q1464q0058j67033j75969j61649
$$ plain form
17294 164293326 142252487 131197531 113397895 98401783 104072780 124654979 146637351
17287 146637351 161843030 175274483 182311844 175831308 150525410 128887409 109932682
17280 109932682 78915324 55883435 43653354 36849022 32444473 29133353 26658530
17273 26658530 24623484 22837502 21122427 19638845 18487324 17494597 16579974 15901750
17265 15901750 15317019 14780287 14357966 13977692 13439906 12765798 12142585 11505230 10702083
17256 10702083 10073959 9563547 9230098 8933187 8767265 8567100 8343142 8057061 7737027
17247 7737027 7405863 7027542 6621878 6188871 5783804 5524483 5426932 5314997 5149290 4923106
17237 4923106 4683371 4491293 4373172 4258227 4142194 4060730 3980672 3813639 3637670 3476021
17227C476021j29747o6313j01055j28531p5060r9583j35025r256l7482r2939o4351
17216B536679j21347o1163r9649j14549r7759N148n5015r6058m4301j16912n9376
17205A675698M624J8154m8570j05102o9584q878p0240j02122j52671j48962p9299
17194I13048n3567m7616q9063p5183j28698n1084o2278n1341J4518J8856J804
17183C89396n7771K682l4005q7701l4977j07030j2646J20379k6337o1748L99L9734
17171A30375m8855J0018n7657k4406L4660J27792k4254r7566j1214P1340L6612
17160A46845j0166J0016m9113j00770K8055M7935R9970R7766n9391r0025l6374
17149H4748p121K3851J27935j1260m803m5250L0382R3135L6358p572L5688n1689
$$ plain form
17227 3476021 3346274 3279961 3178906 3050375 2975315 2875732 2740707 2731451 2693969 2601030 2536679
17216 2536679 2415332 2354169 2254520 2139971 2042212 2047360 1992345 1896287 1851986 1735074 1675698
17205 1675698 1680322 1698476 1649906 1544804 1475220 1466342 1396102 1293980 1141309 992347 913048
17194 913048 859481 811865 722802 647619 518921 467837 405559 354218 368736 387592 389396
17183 389396 331625 334307 300302 212601 177624 70594 57948 178327 151990 90242 90641 130375
17171 130375 81520 91538 33881 9475 44135 171927 147673 50107 38893 110233 146845
17160 146845 136679 146695 97582 -3188 24867 72802 172772 270538 211147 121122 84748
17149 84748 77627 101478 229413 218153 213350 168100 198482 291617 327975 320403 356091 304402
17137C04402o4742P8350J11687q014q9293l9402o4379n9830J418q2882o8886L4996
17125E3425J04782J1038j1216K2733R5m947l9633j2314J5404j9234o1918o831
17113E1384K4256J3950M363M2112k368L6444m3764q9367j09L7162L7133K6653
17101A37849L2979Q371n6920k1297l2430l7129o946L8558J1897k212M9829K8397
17089A50946k0740L2618K1956k7072o1789o054Q1037k5225K9161k9778n2643K1389
17077A13806Q2945l7001Q961L181k737j9510p0778n307O8914O9810m0986j34172
17065C7126l9407p588n1019N0866K7879r1240M5887M202n9210L1091N3978M9657
17053E2222K9725o8779p764k5522o1494J7605R7423N7476N0105O2173n5476j61582
$$ plain form
17137 304402 239660 318010 429697 421683 332390 292988 228609 168779 170197 87315 18429 53425
17125 53425 158207 169245 158029 180762 180857 175910 136277 123963 139367 120133 58215 51384
17113 51384 75640 89590 93953 136065 133697 170141 126377 37010 36901 74063 111196 137849
17101 137849 170828 179199 122279 100982 68552 31423 24477 63035 74932 72720 122549 150946
17089 150946 130206 162824 184780 157708 95919 89865 170902 145677 174838 145060 92417 113806
17077 113806 196751 159750 168711 171892 169155 149645 78867 73560 142474 212284 171298 37126
17065 37126 -2281 -9869 -60888 -10022 17857 -73383 -27496 -23294 -82504 -51413 2565 52222
17053 52222 81947 13168 5404 -20118 -81612 -64007 33416 90892 140997 203170 147694 -13888
17041a3888l8842L2707P2310N2689L0151l9725m7814j1963O8451L2918m947o0770
17029G1277K6646J70649P6875K18225L44521K11199J76789J82793L6638L2225
17019A547837j84422k34726j76702k04468k00430j32928r9452n7110q8664N0150
17009B19085o5771q3691n3219O4425L6212k1306k5832N5547J2124n5000j15075
16998c2501J28K1747N4498J38179N9321n4142j60145p2399M0956L2800q394M6976
16986F7024m7222k0771k4460J3543q191j5314L676l0415k2223o3492J914J34100
16974a1831J89137m809o1650k2089j8245l4369p1704l4013l8325K4158K3579O7423
16962G262J7285k6517j9757M5492r0763R892N7498P676L558k0649j03088m2615
$$ plain form
17041 -13888 -52730 -20023 52287 104976 135127 95402 47588 35625 104076 136994 132047 71277
17029 71277 97923 268572 345447 563672 908193 1119392 1296181 1478974 1515612 1547837
17019 1547837 1363415 1128689 951987 747519 547089 414161 314709 257599 168935 219085
17009 219085 153314 69623 16404 80829 117041 95735 69903 125450 137574 82574 -32501
16998 -32501 -32373 -10626 43872 182051 241372 187230 27085 -45314 -4358 28442 20048 67024
16986 67024 19802 -969 -25429 -11886 -20077 -35391 -31715 -62130 -84353 -147845 -145931 -11831
16974 -11831 177306 172497 110847 88758 70513 36144 -35560 -69573 -107898 -83740 -60161 7262
16962 7262 24547 -1970 -21727 23765 -66998 -57106 392 8068 11626 -9023 -112111 -154726
16950a54726K3368J7952N8963M1307l9921j4945l2852K9816K5819l671N1712n6098
16938e3276r2810J7046M0002N5696l4169m7195J5189N0613O4243J2869n4518N360
16926b0950M9659N972r1243L1985Q4793p9861O543J43846J00844K8029R639j652
16914B67604k8614k0371M6703p66j08545k1610m4606Q2220J40633K7712l0265
16903C10095k1414o0503l9075r3438O471N7750J1533k8132M070L783q0996k0404
16891D9740j28811j8768k8956R9019J0723M0477R2338j22089P262M5800j96J662
16879D8201k7550M1947R067p4099q4746K2918P7870M1375n6493j1953l3180n1902
16867i8545o2706M6165O2461M8959J6098M0970m6406j3884K6637M9506J9581o3199
$$ plain form
16950 -154726 -131358 -113406 -54443 -13136 -53057 -68002 -100854 -71038 -45219 -48890 2822 -53276
16938 -53276 -146086 -129040 -89038 -33342 -67511 -114706 -99517 -48904 15339 28208 -26310 -20950
16926 -20950 28709 34681 -56562 -24577 60216 -19645 -13102 130744 231588 259617 269256 267604
16914 267604 238990 218619 265322 264556 156011 134401 89795 172015 312648 340360 310095
16903 310095 288681 228178 189103 95665 102136 159886 171419 143287 147357 151140 70144 49740
16891 49740 -79071 -97839 -126795 -27776 -17053 23424 115762 -6327 935 46735 46539 48201
16879 48201 20651 62598 71665 -2434 -87180 -64262 13608 54983 -1510 -13463 -46643 -98545
16867 -98545 -161251 -115086 -52625 -3666 12432 53402 6996 -6888 19749 69255 88836 25637
16855B5637o4105j0077J9442M1360o7216M045M4792M9019j879j0641m1115l454
16843a4192L6972J5743m9156p7495o5737n0924P0422M3345M7561O7011J2298l0044
16831E804n0826r6633o1523k9874L4273Q4447K8225L907P1901P5334q706j74903
16819a18574L6632O2033k9971J15292N5312j45382o6813K8263M9946n0474o5464
16808a29200K1954l2314m0729Q3567Q8606O4978l0745m291j4665m2800k7133M3271
16796a9501k9138J4050O4365J4854r1427p7217K419J28675R7352O494p5228l9727
16784d029K130K8328N6311N4576o6738j26901j1787K1619N6228j13943m5893P18
16772a49381k134J11613R9246k53q2035l9443k4400r0305J14012O6178N2026j7492
$$ plain form
16855 25637 -38468 -48545 -29103 12257 -54959 -50914 -6122 42897 41018 30377 -10738 -14192
16843 -14192 22780 38523 -10633 -88128 -153865 -204789 -134367 -91022 -43461 23550 35848 5804
16831 5804 -45022 -141655 -203178 -233052 -198779 -114332 -86107 -82200 -10299 65035 56329 -118574
16819 -118574 -81942 -19909 -49880 65412 120724 -24658 -91471 -63208 -13262 -63736 -129200
16808 -129200 -107246 -139560 -180289 -96722 -8116 56862 26117 21826 7161 -35639 -62772 -19501
16796 -19501 -48639 -34589 29776 44630 -46797 -124014 -121595 7080 104432 110926 35698 -4029
16784 -4029 -1899 26429 82740 137316 70578 -56323 -68110 -46491 9737 -104206 -150099 -149381
16772 -149381 -151515 -39902 59344 59091 -22944 -62387 -86787 -177092 -63080 3098 55124 37632
16760C7632q922m6061k7325k4199K7894J3718J33219L8155j0231O316K0653m6678
16748A14171o0477J9485J26483N3071j30006p9322P906J02283j502o5019m4624
16737D2449m8218p008M8063M9784R967j6715l1165N8124L7776K6873J05653Q5014
16725C60597J5858k3258j3416M884R0416Q1831R3151J85629J85805J11579J4735
16714A107811L7939j9718l2470m9890r2005j06332r7272l6348R995J16208J81075
16703A018993J65129M5917r2226j87067j05921n51j67846j39798j03555k9099
16693D03976q3909j11041j00873J1262K6214l095l8764r3810J22520J43998N3031
16682C29509k3802l1210o7243N2724R9459O3524m0104k5620p909O0060j36614
$$ plain form
16760 37632 28710 -17351 -44676 -68875 -40981 -27263 105956 144111 133880 140196 160849 114171
16748 114171 53694 73179 199662 252733 122727 43405 51311 153594 152092 87073 42449
16737 42449 -5769 -12777 35286 85070 95037 78322 47157 105281 143057 169930 275583 360597
16725 360597 376455 353197 339781 344665 435081 516912 610063 795692 981497 1093076 1107811
16714 1107811 1145750 1126032 1093562 1043672 951667 845335 748063 711715 721710 837918 1018993
16703 1018993 1184122 1230039 1137813 950746 844825 844274 676428 536630 433075 403976
16693 403976 320067 209026 108153 119415 145629 142534 103770 9960 132480 276478 329509
16682 329509 305707 274497 207254 259978 359437 422961 382857 357237 349328 409388 272774
16671B72774q250k9844m0387M1595j7180O5392k894o8365K23Q7506l3775r0758
16659A76037l2403q7408j15082p8443k7004l1778N5345K2376j23660M6252K7878
16648a67890M6178M9832Q8930l9294J749r7521k7655O7734Q787L5063Q2869J7681
16636F6463K212K8413j01838m6764P882r79L2024N0309k2783m8019m4976L1685
16624d6371O8911R6786j0292P424k2661l1204l130N8346O5617P0014M2142l3318
16612B62264J6690m3098p323l2083J7965l4012r6619K967J02357J4482q204j1257
16600A84129k0429J13839R0790K0647R0596M9127M4867L0942m5226m0706Q56J4272
16588E33704m74m2058J786o3130l8547J9059N8264K0226L8386m2782p6459O8669
$$ plain form
16671 272774 264524 234680 194293 235888 218708 284100 281206 212841 213064 300570 266795 176037
16659 176037 143634 56226 -58856 -137299 -164303 -196081 -140736 -118360 -242020 -195768 -167890
16648 -167890 -121712 -71880 17050 -22244 -20495 -118016 -145671 -77937 -69150 -34087 48782 66463
16636 66463 68675 97088 -4750 -51514 -43632 -44611 -12587 37722 14939 -33080 -78056 -46371
16624 -46371 22540 119326 109034 116458 93797 62593 59463 117809 183426 253440 295582 262264
16612 262264 278954 235856 228533 196450 214415 180403 83784 86751 189108 203590 195386 184129
16600 184129 163700 277539 368329 388976 479572 528699 573566 604508 559282 518576 519432 533704
16588 533704 533230 491172 492958 429828 391281 410340 468604 488830 527216 484434 407975 476644
16576D76644J24669o0810j03259k4994k2437j5605M0147R1004j1067r2736L0295
16565D31851q3771n6563P6774J23913m8253q027n4861k0524Q6713J02925k4688
16554E25489j13553l8964k0958J9354J06662L3018k3877k4487O853l8168R9881
16543E31250J6641m358o4562k5685K506l2503m8000n8390J32182N7842K0954l613
16531E24264M1635k1974L7557L564K6186L6096J3139n163J1669K2217p0450j7160
16519F01580K1469O5701P3069m5831n255Q5212K2268P2069O757N0241J71334L8609
16507A157223M9715J68395J58211N5834L5538N3481J02992J73881J61701P1637
16497B188608J06775J13834J13653J89311K63044J90489K45514L35058M63970
$$ plain form
16576 476644 601313 540503 437244 412250 389813 374208 414355 505359 494292 401556 431851
16565 431851 348080 291517 368291 492204 443951 435924 381063 360539 447252 550177 525489
16554 525489 411936 372972 352014 371368 478030 511048 487171 462684 469537 431369 531250
16543 531250 547891 543533 478971 453286 455792 423289 375289 316899 449081 506923 527877 524264
16531 524264 565899 543925 581482 585046 611232 647328 660467 655304 666973 689190 618740 601580
16519 601580 623049 688750 761819 715988 710733 795945 818213 890282 897039 947280 1118614 1157223
16507 1157223 1206938 1375333 1533544 1589378 1624916 1678397 1781389 1955270 2116971 2188608
16497 2188608 2295383 2409217 2522870 2712181 2975225 3165714 3411228 3746286 4210256
16488D210256N47008O36192P69431R48222J206668J312038J509001J760484K042905
16479A4942205K658180L737212N744179R251628J5240681K3826783L2633991L8489055
16471A46523914M1206159M2007832L6496827K1511549L755767q850626k1459849
16464B61191573l6413467m1876638l7478140l3438355k8622186k0479955j2427740
16457E0455092p619383n175810l640884k737075k235118k005340j785072j604973
16449B3651437j472256j452544j435793j253250j026982r95218q50172p29639
16441A4435583p01674q02263p02597n71762m94196m74912m37987m45623l91181
16432I413388l77048m04174l06201l42054l09956k66159k41454j83166k03911
$$ plain form
16488 4210256 4757264 5393456 6162887 7111109 8317777 9629815 11138816 12899300 14942205
16479 14942205 17600385 21337597 27081776 36333404 51574085 75400868 108034859 146523914
16471 146523914 187730073 229737905 266234732 287746281 291502048 282651422 261191573
16464 261191573 224778106 182901468 145423328 111984973 83362787 62882832 50455092
16457 50455092 42835709 37659899 34019015 31281940 29046822 27041482 25256410 23651437
16449 23651437 22179181 20726637 19290844 18037594 17010612 16015394 15165222 14435583
16441 14435583 13733909 12931646 12229049 11657287 11163091 10688179 10250192 9804569 9413388
16432 9413388 9036340 8632166 8325965 7983911 7673955 7407796 7166342 6983176 6779265
16423F779265k62237k96919k48787j78893k01099k08131j27465j19025j62504
16414D974205j94760r9213j50260k10823k09418k74066k12950k02291p8538N2129
16404C394015l0568q2742q4874l0721j25901j52317j04088p5391p1161r9434r5984
16393B440834l7392o6115q0014l1502l7964J378k9518j01133q219N2343n7505
16382B045193J7358K4570j00295j62000j59122j30777m2364n4290j34445j08033
16372A195795j41151j7815j12764n5611j39743j02520K4117n9481j14979o3622
16362D12226j8252j10099l8813n5339p3375m5017j7306l5825K9901l008j3977
16351C1116J2211N7858l2840k443J7280n7686k7955q2481j8770P2680J23196J02142
$$ plain form
16423 6779265 6517028 6220109 5971322 5792429 5591330 5383199 5255734 5136709 4974205
16414 4974205 4779445 4680232 4529972 4319149 4109731 3835665 3622715 3420424 3341886 3394015
16404 3394015 3363447 3280705 3195831 3165110 3039209 2886892 2782804 2707413 2636252 2536818 2440834
16393 2440834 2403442 2337327 2257313 2225811 2187847 2189225 2159707 2058574 2050355 2102698 2045193
16382 2045193 2062551 2087121 1986826 1824826 1665704 1534927 1492563 1438273 1303828 1195795
16372 1195795 1054644 1036829 924065 868454 728711 626191 650308 590827 475848 412226
16362 412226 393974 283875 245062 189723 116348 71331 54025 18200 48101 45093 31116
16351 31116 43327 101185 68345 65902 83182 25496 -2459 -84940 -103710 -31030 92166 194308
16339A94308j6256n797r808L4790p3033k6566N9589j201L8876m8377n1121O3258
16327A58662L5635p1035r0392L0836J5975l0107j05575J2602J09719N6081l044
16316A19357L506j1142k2301J5951K2919o0273o8315N3332R4832P6951M6140q6997
16304A83960j0400Q7002n7815K0036q94m4343P4538K1823o6902q1916n6395J768
16292G0462Q3584L7092J4708l1148J8118k3989J3242j4953n47j02337n8557p877
16280b202N6920O3849K2942R863p755j09003j5205Q4097n1707q8539j8629j4364
16268f9733k9978J36790R4273r4583L0900L0137K2534p1964M5751L4382J4018
16257A42527j8331L1204K0129r8713k0078J04353M6955l5581p7528p6619q3833
$$ plain form
16339 194308 178052 172255 162447 197237 124204 97638 157227 156026 194902 146525 95404 158662
16327 158662 194297 123262 32870 63706 79681 49574 -56001 -43399 66320 122401 119357
16316 119357 122863 111721 89420 105371 128290 68017 -298 53034 147866 224817 270957 183960
16304 183960 173560 260562 202747 222783 221889 177546 252084 273907 207005 125089 68694 70462
16292 70462 154046 191138 205846 174698 192816 168827 182069 167116 166569 64232 5675 -2202
16280 -2202 54718 118567 141509 151372 143617 34614 19409 103506 51799 -36740 -55369 -69733
16268 -69733 -99711 37079 131352 36769 67669 97806 120340 48376 94127 128509 142527
16257 142527 124196 155400 175529 76816 56738 161091 208046 172465 94937 18318 -65515
16246f5515J3556O1510J6323m5144J1347M5567j5387J7810J1946m3397j0505l9159
16234d1048K167k7645l8379p3265O0688L6037l4780k7834K0811P2527P2972r363
16222A2888J2805l2917o0285k8017M5865j8288k351N3502K9804k3847k6066k2412
16210e9319p4943n7291J25327Q6750k4093o6541L1303k9531N5956n268p1281o2460
16198a51391M7792M3989J180K7204r518l1670r7750K7187J46902N5951o8207q9317
16186i7648m7969j8289R7288Q0145j12682p0704L2173J0774o645J14944J9168
16175E55K2242O9366o9944o283m4512K4094K4698K4584n1365o0270k7299l2887
16163a27021j1418J17332P0154j19806k4094o159K7234J14630N4601p149J7364
$$ plain form
16246 -65515 -51959 9551 25874 -19270 -7923 37644 22257 40067 52013 8616 -1889 -41048
16234 -41048 -38881 -66526 -104905 -178170 -117482 -81445 -116225 -144059 -123248 -50721 22251 12888
16222 12888 25693 -7224 -67509 -95526 -49661 -67949 -70300 -16798 13006 -10841 -36907 -59319
16210 -59319 -134262 -191553 -66226 20524 -3569 -70110 -38807 -68338 -12382 -17650 -88931 -151391
16198 -151391 -103599 -59610 -58430 -31226 -40744 -72414 -170164 -142977 3925 59876 -8331 -97648
16186 -97648 -145617 -163906 -66618 13527 -99155 -169859 -137686 -126912 -133557 -18613 555
16175 555 22797 92163 22219 15936 -28576 -4482 20216 44800 -6565 -66835 -94134 -127021
16163 -127021 -138439 -21107 49047 -70759 -94853 -101012 -73778 40852 95453 88304 105668
16152A05668p120p4053n2747q1221N2102R4570Q1985o4043K8349J08501Q0227
16141B72218k6582r2804l2641n2128j9205p0364n7359k4805j6848J1596Q0070
16130b8852j5312n5451L6368L6217J5364K4908K7742L0010J05219J55570J25039
16119D56822J51235n013N8541L0180J7566P2873M2201n7845q5665j00086j39706
16108D41103r0484l223o5818L9002k4357j10408l6349P2231O1504m4542L4186
16097B72845K8257N5297n9609J2412Q9384J3369K2717N4764n7945j07507q0888
16086B43096K1473Q8607J51290K3028K2722K953j2005l627L2914j9688j31991
16075D18772m6809K3634n107l6274n5181l5486n2948o3561o6851n3459M7530N8168
$$ plain form
16152 105668 98548 24495 -28252 -109473 -57371 37199 119184 55141 83490 191991 272218
16141 272218 245636 152832 120191 68063 48858 -21506 -78865 -103670 -120518 -108922 -28852
16130 -28852 -44164 -99615 -63247 -27030 -11666 13242 40984 70994 176213 331783 456822
16119 456822 608057 603044 661585 691765 709331 782204 824405 766560 680895 580809 441103
16108 441103 350619 347396 281578 320580 296223 185815 149466 221697 283201 238659 272845
16097 272845 301102 356399 296790 309202 398586 411955 434672 489436 431491 323984 243096
16086 243096 264569 353176 504466 527494 550216 553169 541164 537537 570451 550763 418772
16075 418772 371963 395597 390490 354216 299035 263549 210601 147040 80189 26730 74260 132428
16063A32428J3285n2034l8013N5835N1063K7416J8533p1739J24m2444K2918J5921
16051A33293l9529N786l2097J5931L557l1135l632R0602r710r1552Q963j8985
16039C1492k0651J9506N1278n1689J843L5265q5364j12042k4204N9395M7683N4035
16027F547m4506L4700p8934K9075n505l5270J7547q2643n0611j900L7390Q1191
16015i2919l6990k8358L2640l945q1342k5187M7596L3252k1700J2880O7298j1568
16003a08343k8943R8526J6609k0532J1190n992l9599J4227J8490n6667N6753j550
15991d5831m6320o6173K3974J12542R8838m8690r9822j01178n8314P2363J7242
15980a41369l7040j1191J00721J0525m1121K7062k7326O439m1409J24628Q5054
$$ plain form
16063 132428 145713 93679 55666 111501 162564 189980 208513 136774 136898 94454 117372 133293
16051 133293 93764 99550 67453 83384 86941 55806 52174 142776 133066 41514 50477 31492
16039 31492 10841 30347 81625 29936 31779 67044 -18320 -130362 -154566 -95171 -47488 6547
16027 6547 -37959 -3259 -82193 -53118 -58623 -93893 -76346 -158989 -209600 -211500 -174110 -92919
16015 -92919 -129909 -158267 -125627 -129572 -210914 -236101 -188505 -155253 -176953 -164073 -96775 -108343
16003 -108343 -137286 -38760 -22151 -42683 -31493 -37485 -77084 -62857 -44367 -101034 -44281 -45831
15991 -45831 -92151 -158324 -134350 -21808 77030 28340 -71482 -172660 -230974 -158611 -141369
15980 -141369 -178409 -189600 -88879 -78354 -119475 -92413 -119739 -113300 -154709 -30081 54973
15969E4973l0528l3384Q224Q689p1653q6630L2447J09566K2072o6821n6141J7921
15957i1265L34r0083J2685J21646M2076p0626p5841m3197k4002L1092P8880L9534
15945f8767j881M7589k8500k778m9911j8366N7064P7754Q2390O6578n8557k9494
15933G3121N0511K2180k3235n7058k1944m2545K4481R8167L3090m6848l7447N5208
15921A27681r4173n815k6694J4423K4342K5457J07216J65273J65417J38865K61020
15910I03012K65445J72496K44899L36365K92091J99837K81580M69743N33162N42697
15900D241327M80498L56458L48037J91377j36372k99375m29980n43817n73880
15891C634273p58290o34148n07902m06330k22415j02463j33259j24688p9810q5658
$$ plain form
15969 54973 24445 -8939 -715 7974 -63679 -150309 -117862 -8296 13776 -53045 -109186 -91265
15957 -91265 -90931 -181014 -168329 -46683 -4607 -75233 -151074 -194271 -218273 -187181 -108301 -68767
15945 -68767 -70648 -23059 -51559 -54337 -104248 -122614 -65550 12204 94594 161172 102615 73121
15933 73121 123632 145812 122577 65519 43575 1030 25511 123678 156768 109920 72473 127681
15921 127681 33508 27693 999 15422 39764 65221 172437 337710 503127 641992 903012
15910 903012 1168457 1340953 1585852 1922217 2214308 2414145 2695725 3165468 3698630 4241327
15900 4241327 4721825 5078283 5426320 5617697 5481325 5181950 4751970 4208153 3634273
15891 3634273 2875983 2241835 1733933 1327603 1105188 1002725 869466 744778 664968 579310
15881E79310j00108K7288j27565k9834m3802l3782p015M5786K1676K4871q6355
15870B70470o2722R9407M12q2649M191K5250K2460m4581n1280K503L4724K3749
15858B41934m6201k5083K0808j3484j28675j18960m0209K9490J8975P8363L2567
15847D9525L4220K441N4657M4234n4855j9277l0017p8093j7113M2561L3595n9783
15835B095K9237p1793n7208l8995n8274k5359Q6912J3716M1553n1696K0090R7999
15823a1723J7882o9302k0218K1791j825p6385J7616K8180l1712J9343M0004J10220
15811D3871J05537O3333L0665j3298m3974q2356n9766j40692n9339j4208K7975
15800a42252J0441J7855M0812J11381J10523q3491j63169o5291L2248J8403l7937
$$ plain form
15881 579310 479202 506490 378925 349091 305289 271507 264492 310278 331954 356825 270470
15870 270470 207748 307155 307567 224918 229109 254359 276819 232238 180958 183461 218185 241934
15858 241934 195733 170650 191458 177974 49299 -69661 -109870 -80380 -61405 16958 49525
15847 49525 83745 86186 140843 185077 130222 110945 80928 2835 -14278 28283 61878 2095
15835 2095 31332 -40461 -97669 -136664 -194938 -220297 -133385 -119669 -78116 -129812 -109722 -11723
15823 -11723 6159 -63143 -83361 -61570 -63395 -139780 -122164 -93984 -125696 -106353 -66349 43871
15811 43871 149408 212741 243406 230108 186134 103778 44012 -96680 -156019 -170227 -142252
15800 -142252 -131811 -113956 -73144 38237 148760 65269 -97900 -163191 -130943 -112540 -150477
15789a50477L3726N8584L5281J3839K4047n8752m7193L7929L2483L7520o8013
15778e1026O3494P4235o3323o4948l3921R4042L7414p7115m7666j2736l5340p6401
15766a93291J4678Q8836N4938j4648J4457N4216k4593K3804q7730j08003P643
15755a69693O3711J05174Q82o2999Q1545O8960J26900L7252n2902J13920M0404
15744C53154M2249J9117m7522q6794m4772j3253l4354j61524j24052m1772L3052
15733a06471n4246L3227J15122J20614K9620k0509J8229m4054P611j0868r7041
15722h766j19769q3336J18337L2516P6128J6648m7781j16876m6463M2438j5872
15711a52796n4549l2645J00754L4016o49K4303J1750N5721N0912l9034m9356J0014
$$ plain form
15789 -150477 -116751 -58167 -22886 -9047 15000 -43752 -90945 -53016 -20533 16987 -51026
15778 -51026 12468 86703 23380 -41568 -75489 18553 55967 -21148 -68814 -81550 -116890 -193291
15766 -193291 -178613 -89777 -34839 -49487 -35030 19186 -5407 18397 -69333 -177336 -169693
15755 -169693 -105982 -808 74 -62925 18620 87580 214480 251732 198830 312750 353154
15744 353154 395403 414520 366998 280204 235432 222179 187825 26301 -97751 -139523 -106471
15733 -106471 -160717 -127490 -12368 108246 137866 117357 135586 91532 99143 88275 -8766
15722 -8766 -128535 -211871 -93534 -61018 15110 31758 -16023 -132899 -179362 -136924 -152796
15711 -152796 -207345 -239990 -139236 -105220 -105869 -81566 -69816 -14095 36817 -2217 -51573 -41559
15699d1559J1062K1956n1149l5548r37J9285m5308l2829k5864K0044P76N1425
15687a08646p9245p5795k9982J41780J32492o794r9276k0269N8086M7125n5845
15676i6369J5809L2901J6174K6281P7351M8393j1694o8115o4516o6142k7947k2408
15664a40282Q8857J0993j51771k1526M6506l0991O1960Q5657k6035r4686L4202
15653a37116Q0701J1841q5278j16135j9393O5276R8348L4939l2204N5910o353
15642d9464k4971k9936l0589p4692P8258j5893l8566J4636K5900L1225P5269l5673
15630g4496n5105L5183P5608J4601k4002o241k6305p4768r4096k8548m4787J8625
15618b84331J20635N0569q2491J6030N4558l235j3992M499J59312K7542K9025
$$ plain form
15699 -41559 -30497 -8541 -59690 -95238 -96175 -76890 -122198 -155027 -180891 -160847 -160071 -108646
15687 -108646 -187891 -263686 -293668 -151888 -19396 -26190 -125466 -145735 -87649 -40524 -96369
15676 -96369 -80560 -47659 -31485 -5204 72147 120540 108846 40731 -23785 -89927 -117874 -140282
15664 -140282 -51425 -40432 -192203 -213729 -167223 -198214 -136254 -50597 -76632 -171318 -137116
15653 -137116 -56415 -44574 -129852 -245987 -265380 -200104 -101756 -66817 -99021 -43111 -49464
15642 -49464 -74435 -104371 -134960 -209652 -131394 -147287 -185853 -171217 -145317 -114092 -38823 -74496
15630 -74496 -129601 -94418 -18810 -4209 -28211 -34452 -60757 -135525 -229621 -258169 -302956 -284331
15618 -284331 -163696 -113127 -195618 -179588 -125030 -128265 -142257 -137758 21554 49096 78121
15607G8121j1944j9510O1644L0497p6958k926j22373j0622p5113L2746M9009k3186
15595i0615l6750l4944j6141j4946m6752Q1289K2648M9244m525J1521O6240k2591
15583c6322p4311M466L3789j6218o3518L3879m3902R5428J23862K6101j0151j2081
15571F1022l1850j24924k6256L1811N3468M7025M0387K7682r9072j57139J7517
15560a60329l862N015L8422Q2115O7148r0898j16042o43J04377N6298O2166K4895
15548F8662l4329o2641p9413r2301n2588J29188P2050M1106R115m9524K84m9841
15536a00232M7319L11l5351o2324p5012O0307L432p920L8075k9870l0025K7541
15524a63749P5292j600k5173R5796M099m0122k2942L8425K9244L9497j5646p9728
$$ plain form
15607 78121 66177 46667 108311 138808 61850 58924 -63449 -74071 -149184 -116438 -67429 -90615
15595 -90615 -127365 -162309 -178450 -193396 -240148 -158859 -136211 -86967 -91492 -79971 -13731 -36322
15583 -36322 -110633 -106167 -72378 -88596 -152114 -118235 -162137 -66709 57153 83254 73103 61022
15571 61022 29172 -95752 -122008 -90197 -36729 10296 50683 78365 -20707 -177846 -160329
15560 -160329 -164191 -159176 -120754 -38639 28509 -62389 -178431 -179074 -74697 -18399 43767 68662
15548 68662 34333 -28308 -107721 -200022 -252610 -123422 -51372 -10266 -1151 -50675 -50391 -100232
15536 -100232 -52913 -52602 -87953 -150277 -225289 -164982 -161550 -169470 -131395 -161265 -191290 -163749
15524 -163749 -88457 -90057 -115230 -19434 -15335 -55457 -78399 -39974 -10730 28767 13121 -66607
15512f6607p5160J751r708r1678K35M0581P3778j8266r120L3336N8467J0279P4572
15499B2460k4161q8981o8236n2295K255Q3564P7940o2617L1016O221N2116L5593
15487A4875k4321j25562m7672K7929K2932R599j0426O0886K3767n1534r3214L0683
15475a62058J42763L5690r8303O879n5902P362K8517j4258j9928M6255J2206o3040
15463a33817l0763O850O2017N9285n5341j10243k5989M0210J13123P8811l5483
15452c1340n2499J9790L5383m712n2170l0093O747p2350j5383l0339q2203P5143
15440b34026J05456L4808N740k108M4529o1444r9583L9005k4239N9358K4206K5474
15428h2824M434l2840n6674J8508P4232o8326l8486O1321K8000M5943j034j3244
$$ plain form
15512 -66607 -141767 -140016 -149724 -241402 -241167 -200586 -126808 -145074 -154194 -120858 -62391 -52112 22460
15499 22460 -1701 -90682 -158918 -211213 -208958 -125394 -47454 -110071 -79055 -72834 -20718 14875
15487 14875 -9446 -135008 -182680 -154751 -131819 -122220 -132646 -71760 -47993 -99527 -192741 -162058
15475 -162058 -19295 16395 -81908 -75029 -130931 -123569 -95052 -109310 -129238 -82983 -70777 -133817
15463 -133817 -164580 -157730 -95713 -36428 -91769 -202012 -228001 -187791 -74668 4143 -31340
15452 -31340 -83839 -64049 -28666 -33378 -85548 -115641 -108894 -181244 -196627 -226966 -309169 -234026
15440 -234026 -128570 -93762 -88022 -90130 -45601 -107045 -206628 -167623 -191862 -132504 -108298 -82824
15428 -82824 -78390 -111230 -167904 -149396 -75164 -143490 -181976 -120655 -92655 -46712 -47746 -60990
15416f0990L7564N7297l6653q8615k2950M0602n3271q6493M7504P42L4811j7147
15404a47599J7081M4311J5899R5166J1048l8033r3890j23456M4078L4886n0199
15393a90708q44M1544K6026J00717M6419P5416O502l3394m6503l1938j03981l1637
15381a42381j6681j3719N6842O8415L2998J13280n2445l6520m9320n0127M3566
15370d6092p503p3941K7923J14306R6615p8043n2732j4326J3158m9890k5505K9515
15358f6515N0236l3472q575l3178m7204P1203L2902K686k5497M2958m6337m2312
15346a03105l8060k3575L0423M4197M8369q008m965K0526L4366J8176K635j47548
15334a26569q5277K8012J6266L0838P4362L6644j759m2231m8406P3183j3667m9287
$$ plain form
15416 -60990 -23426 33871 -2782 -91397 -114347 -73745 -127016 -213509 -166005 -165263 -130452 -147599
15404 -147599 -130518 -86207 -70308 24858 35906 -2127 -96017 -219473 -175395 -140509 -190708
15393 -190708 -191552 -150008 -123982 -23265 23154 98570 105072 71678 25175 -6763 -110744 -142381
15381 -142381 -159062 -172781 -115939 -47524 -14526 98754 46309 9789 -39531 -89658 -46092
15370 -46092 -53595 -127536 -99613 14693 111308 33265 -19467 -33793 -20635 -70525 -96030 -66515
15358 -66515 -16279 -49751 -58326 -91504 -138708 -67505 -34603 -31917 -57414 -14456 -60793 -103105
15346 -103105 -141165 -164740 -134317 -90120 -41751 -49759 -54724 -34198 168 18344 20979 -126569
15334 -126569 -211846 -183834 -167568 -136730 -62368 -25724 -27483 -69714 -118120 -44937 -58604 -107891
15322a07891K6124J049N3862m67k7915m554J8642m0115J3075L8118p1610q1941
15310a83623O5643K5400j009j7385R0048N0581M6206r4891k4081J2291l2162p9600
15298a42582m8041M3637J5038P365K8199K925J15152m7055j15745n9706N8938
15287a41875O1088P29l5415R380O669n9516k1917j4803J480P6950R0330L6227
15275I327k5138P2121j06710j15919J671L8974k6760J1437R2456L6562k1050O3192
15263C0163N1524p1734r7818q7445M01M1512L6685K0771K4319K6103j7773J9156
15251b4136l7483q6221L2788o012J8223m9184K282m159J1114M1413O0621J2533
15239b8221l9228j159J2101L7324l0641l2150m0382P6387J6318J2266K0272p7902
$$ plain form
15322 -107891 -81767 -80718 -26856 -27323 -55238 -59792 -41150 -81265 -68190 -30072 -101682 -183623
15310 -183623 -117980 -92580 -93589 -110974 -20926 29655 75861 -19030 -43111 -30820 -62982 -142582
15298 -142582 -190623 -146986 -131948 -124583 -96384 -93459 21693 -25362 -141107 -200813 -141875
15287 -141875 -80787 -80058 -115473 -106093 -99424 -158940 -180857 -195660 -194180 -117230 -26900 9327
15275 9327 -15811 56310 -50400 -166319 -164648 -125674 -152434 -140997 -48541 -11979 -33029 30163
15263 30163 81687 9953 -87865 -175310 -174909 -133397 -96712 -75941 -51622 -25519 -43292 -24136
15251 -24136 -61619 -147840 -115052 -121064 -102841 -152025 -149743 -153902 -142788 -101375 -40754 -28221
15239 -28221 -67449 -68608 -56507 -19183 -49824 -81974 -122356 -45969 -29651 -17385 2887 -75015
15227g5015m4518l9862M6963N6716k2842L1298k1635m4053M0245J9410p6272J7415
15215a12150J20067J3134p6673k866M1085j7122L160J0576j09130K1501L6431
15204g1987m6564J8015k1847P1903k079o4030o2422O049P758j6393j1417K9673
15192a63341M1662J606l8477l963m286O1729k1183j6626K3623P0509J03254O2772
15180A17279o1995j07613q3033O3051L7961N4114n417K7306p0692j41296J7174
15169a53161K2550l6642J7133J05591K5428o6943n3182K6681M8982M117j01286
15158a60732j33855Q420J7016l479M1528R1421O0584O1157l6257p2948M215k2257
15146a45187j649K0922N812M378N4669P0024J03313p6197j77185j06711J30848
$$ plain form
15227 -75015 -119533 -159395 -112432 -55716 -78558 -47260 -68895 -112948 -72703 -53293 -129565 -112150
15215 -112150 7917 21051 -55622 -58488 -17403 -34525 -31365 -20789 -129919 -108418 -71987
15204 -71987 -118551 -100536 -122383 -50480 -52559 -116589 -179011 -172962 -165204 -181597 -193014 -163341
15192 -163341 -121679 -120073 -158550 -162513 -166799 -105070 -126253 -142879 -119256 -48747 54507 117279
15180 117279 55284 -52329 -135362 -72311 -34350 19764 14347 41653 -29039 -170335 -153161
15169 -153161 -130611 -167253 -150120 -44529 -19101 -86044 -139226 -112545 -63563 -59446 -160732
15158 -160732 -294587 -286167 -269151 -272630 -231102 -139681 -79097 -17940 -54197 -127145 -122930 -145187
15146 -145187 -146836 -125914 -120102 -115724 -61055 8969 112282 36085 -141100 -247811 -116963
15135a16963J06043l1619p4946n2645N7202O42P226Q0962M2815R6651m1018j7603
15123E6747n5505p7513l0510K2796M6372n5363N0272L008K2625Q9819K6361p9005
15111B0104n9562M6666P3351l6275O851q6036o247N7446M7298r3127l3165k8278
15099i0974L4713M6164n2419L2381M7749p18q6830o8002L5879l823l5050L7123
15087a03807P8680r6432p4372N7679M1490j7631m0229k3798k418m4794R3673N6481
15075g5478l4750n8992L0284L2488N7734K0200q80q4848l8222n2553N309L5766
15063a63942L5388l893K8943q011l6586j2978j4527N3034M3896P3705k9950k6813
15051f1734M3849K0066J4546L1983p192J0542n5271j0218R5546P974k4858K8163
$$ plain form
15135 -116963 -10920 -42539 -117485 -170130 -112928 -112286 -105060 -24098 18717 115368 74350 56747
15123 56747 1242 -76271 -106781 -83985 -37613 -92976 -42704 -39696 -17071 72748 99109 20104
15111 20104 -39458 7208 80559 44284 51135 -34901 -41148 16298 63596 -29531 -62696 -90974
15099 -90974 -56261 -10097 -62516 -30135 17614 16896 -69934 -137936 -102057 -105880 -140930 -103807
15087 -103807 -25127 -121559 -195931 -138252 -96762 -114393 -154622 -178420 -180838 -225632 -131959 -75478
15075 -75478 -110228 -169220 -138936 -106448 -48714 -28514 -29394 -114242 -152464 -205017 -199708 -163942
15063 -163942 -128554 -132447 -103504 -111515 -148101 -161079 -175606 -122572 -78676 -4971 -34921 -61734
15051 -61734 -17885 2181 16727 48710 41518 52060 -3211 -13429 82117 90091 65233 93396
15039I3396p1344r9876M9431J4138k9412k7911J9075L1922m3435N1579N0428q8635
15027e0644j19273l7409J10866J14723m433r0583j0091N6298M1574n2349k9931
15016g1252l2400o5696N636p442l0233L0376J30991J791m1733k7137j5445Q577
15004a13967m6760K5711L4717L3111k598m892L7171q462l3967K2363J9601J5423
14992b2549k0859l2153m2207Q7107O3145M398l4085n9413n0363j20057j1629L8448
14980b00217O1093m5119M1768L9980j7991O5173p045l8254Q8392M9469n1778q3790
14968i8319l3813n4831K1533N7003K2882K005K6835O3067M8777k1548n0355l9029
14956e5793J0228k436k1850k8226k0521Q012L1895k6968k3181N2199K3162m5147
$$ plain form
15039 93396 22052 -77824 -28393 -14255 -43667 -71578 -52503 -20581 -64016 -12437 37991 -50644
15027 -50644 -169917 -207326 -96460 18263 13830 -76753 -86844 -30546 11028 -41321 -71252
15016 -71252 -103652 -169348 -163712 -171154 -201387 -171011 -40020 -38229 -79962 -107099 -122544 -113967
15004 -113967 -160727 -135016 -100299 -67188 -69786 -74678 -37507 -45969 -79936 -57573 -37972 -22549
14992 -22549 -43408 -75561 -117768 -30661 32484 36882 2797 -56616 -106979 -227036 -238665 -200217
14980 -200217 -139124 -184243 -142475 -102495 -120486 -55313 -62358 -100612 -12220 37249 -14529 -98319
14968 -98319 -132132 -186963 -165430 -108427 -85545 -83540 -56705 6362 55139 33591 -16764 -55793
14956 -55793 -45565 -48001 -69851 -98077 -118598 -110586 -78691 -105659 -128840 -76641 -53479 -98626
14944i8626k7475p9926k3897L9791l141L5584J32925J5165j684n8142n61L3263
14932c6724L0277J5351o5753n7900j9033L9004N4387j5163K1866P5373k2039q0876
14920f1230j21007K4981K0692l3775M0548P6559l6716j54655J2274R5583P7021
14909e9725M4096j1777j526L3125K0560P1374p3477j73181o2002L8047M9869O909
14897a17708L447L6931O9458O2508r776j14166L9259J53m9839M508M7615j2240
14885c9850k9249K326J3047j5454k2004J6258j06101m5431j9625M8470K4448p4339
14873b47504n86R7284N186o1329M0212J2293m1853R721J08732j9881n626L0782
14861g2569k9245J07750K2306n1329j6264L2089k7646J0932M7923k8567O8K6584
$$ plain form
14944 -98626 -126101 -206027 -229924 -190133 -193274 -157690 -24765 -9600 -11284 -69426 -69987 -36724
14932 -36724 -6447 8904 -56849 -114749 -133782 -94778 -40391 -55554 -33688 41685 19646 -61230
14920 -61230 -182237 -157256 -136564 -170339 -129791 -53232 -89948 -244603 -232329 -136746 -59725
14909 -59725 -15629 -27406 -28932 4193 24753 96127 22650 -150531 -212533 -174486 -124617 -117708
14897 -117708 -114261 -77330 -7872 54636 44860 -69306 -30047 -29894 -79733 -75225 -27610 -39850
14885 -39850 -69099 -66773 -53726 -69180 -91184 -74926 -181027 -226458 -246083 -197613 -173165 -247504
14873 -247504 -248090 -150806 -145620 -206949 -166737 -154444 -196297 -186576 -77844 -97725 -103351 -72569
14861 -72569 -101814 5936 28242 -23087 -39351 -7262 -34908 -23976 23947 -4620 -4552 22032
14849B2032P404l2613k9170M6787j3492p2753j29668j5878P5985K6196J1531k2163
14837a25802l1242n0320m9180K8770J6659N5249O5185r808K7596k7797J2506P9163
14825i021q058l779q9380o275j1262k7255R261K8585J5425o3166P94n905l9407
14812b09443r2355J9697P7868J343J4068N6996n9139R087O3083L1436Q724j142
14800g9777J9559q081n5250k4023N2261q82j1975J12738j3388q7433J4829M3601
14788c7821K1344j6989n7215l126j7143j6805O2748P6393R05L3823J24676M1433
14776B12223n2644j08317r1891p3168Q52k6596l4529j1478R053J0991j6831m5236
14764b27571M0595J14491N4987K8158j8026r4267l771N5869n2198J3515M8713
$$ plain form
14849 22032 29436 -3177 -32347 14440 948 -71805 -201473 -217351 -141366 -115170 -103639 -125802
14837 -125802 -157044 -207364 -256544 -227774 -211115 -155866 -90681 -100489 -72893 -100690 -88184 -9021
14825 -9021 -17079 -20858 -110238 -116513 -127775 -155030 -145769 -117184 -101759 -164925 -164131 -170036 -209443
14812 -209443 -301798 -282101 -204233 -202890 -188822 -131826 -190965 -181878 -118795 -87359 -78635 -79777
14800 -79777 -60218 -68299 -123549 -147572 -95311 -96193 -108168 4570 -8818 -96251 -81422 -37821
14788 -37821 -16477 -33466 -90681 -93807 -110950 -127755 -65007 11386 12291 46114 170790 212223
14776 212223 159579 51262 -40629 -113797 -112945 -139541 -174070 -185548 -176495 -165504 -182335 -227571
14764 -227571 -186976 -72485 -17498 10660 -7366 -101633 -105404 -49535 -101733 -88218 -39505
14753c9505J7832l2258q5959Q4768J6593p1904M0167n3421P4459J7080k6667L4246
14741b4569o782k2391k7677o0513R3722J0650n755K6871n160j7545K851J5896
14729b0402N728m2510N962Q645n6957k1410n2350j4970j444M4376M2533P0942
14717c1857o267p7724L9366N2579J7503m360m3943K2376p329M2147l3043J11193
14705H0641k7404m1169k3848n1070O2770K5871n9967p5094p9176L4258j8321O2749
14693a09760J46407K6788l276M2707j6178o4574p6303m8301L2612l9466l5491
14682a44835L5201K9980k7426k9934n3231j6581Q7188R3537o0308j24822K2103
14671a89128Q9303l8160N0853L2950m9275n012Q2265N1794K9120j8058l5357p2241
$$ plain form
14753 -39505 -21673 -53931 -139890 -55122 -38529 -110433 -70266 -123687 -49228 -32148 -58815 -24569
14741 -24569 -31351 -53742 -81419 -141932 -48210 -37560 -43315 -16444 -21604 -39149 -36298 -20402
14729 -20402 -14674 -57184 -51222 -42577 -99534 -120944 -173294 -188264 -189708 -145332 -102799 -31857
14717 -31857 -38124 -115848 -76482 -23903 -6400 -10760 -54703 -32327 -39656 2491 -30552 80641
14705 80641 53237 12068 -11780 -62850 -80 25791 -34176 -109270 -188446 -154188 -172509 -109760
14693 -109760 36647 63435 60159 102866 86688 22114 -54189 -102490 -69878 -109344 -144835
14682 -144835 -109634 -79654 -107080 -137014 -190245 -206826 -119638 -26101 -86409 -211231 -189128
14671 -189128 -99825 -137985 -87132 -54182 -103457 -108469 -26204 25590 54710 36652 1295 -70946
14659g0946l9276J13318j5553m2408J18042J6907j07163m7050P4893J2328L0467
14648D3559J1035Q0452l053j3895o8688n972J14331K3458j26408l5581P727n5844
14636b8879k6878k2149m4388l004k1591l0056L952m2794m5246j2630N3896R8529
14624a21238O5551K6843K8274N9829K2751l6970l1154J1999p340j9407j0444n6442
14612f7748L7040Q4851L731k6466k0867L5256N1083n0100r1445j5764M7171R044
14600d214Q399J4479m5031m1252m0166P3943L0345J5801r414K1988l391p5494
14588e4007J6884n3112J3625j0838n7791K6144J13713M3424N2739m9605r7004
14577e5828j11771k3267J2838L2011M996Q6395N0753m6951j342P247m9814k1045
$$ plain form
14659 -70946 -110222 3096 -12457 -54865 63177 80084 -27079 -74129 764 13092 43559
14648 43559 54594 135046 131993 118098 49410 43438 157769 181227 54819 19238 26965 -28879
14636 -28879 -55757 -77906 -122294 -125298 -146889 -176945 -172993 -215787 -261033 -273663 -219767 -121238
14624 -121238 -55687 -28844 -570 59259 82010 45040 13886 25885 18545 -862 -11306 -67748
14612 -67748 -30708 54143 57874 31408 10541 45797 96880 46780 -44665 -60429 -13258 -4214
14600 -4214 4185 18664 -26367 -67619 -107785 -33842 -3497 12304 2890 24878 21487 -54007
14588 -54007 -37123 -90235 -76610 -87448 -145239 -119095 -5382 38042 90781 41176 -55828
14577 -55828 -167599 -190866 -178028 -146017 -141021 -54626 -3873 -50824 -52166 -44919 -94733 -115778
14565a15778L7564J0150j4138j09212L0312j8373p45O3934L0480k7005k243N8981
14553e6073K8496K8381p183m1458m2806j6638j9429N4946J07135m7808j19333
14542a31770P2858M1968m9516l4329L8364R97P0367j7425J81l2585k5935R0610
14530B3785J3858k9554K0883L1381m7212m477j8270p1544n3457j3708K5981L795
14518a18539q9230j1115m3742M897J8151j9525J29006O5745l7787J03168K728
14507C757j17066j3764M7285P9507L4035j00102r0398j6479l0581J15212Q6584
14496b010Q3892K5872O64N180k2120o8991N0192q511l7258n4206P592J2065q952
14483a6591k8572j1318J09396m6538l6320P9075N3959j5311N2158j8614j13492
$$ plain form
14565 -115778 -78214 -68064 -82202 -191414 -161102 -179475 -180220 -116286 -85806 -112811 -115054 -56073
14553 -56073 -27577 804 -6379 -47837 -90643 -107281 -126710 -71764 35371 -12437 -131770
14542 -131770 -58912 -16944 -66460 -100789 -62425 -61428 8939 -8486 -8305 -40890 -66825 23785
14530 23785 37643 8089 28972 60353 13141 8664 -9606 -81150 -134607 -148315 -122334 -118539
14518 -118539 -207769 -218884 -262626 -257729 -239578 -259103 -130097 -64352 -102139 1029 3757
14507 3757 -113309 -127073 -79788 -281 33754 -66348 -156746 -173225 -203806 -88594 -2010
14496 -2010 81882 107754 108418 113598 91478 22487 72679 64168 26910 -27296 -19704 -7639 -16591
14483 -16591 -45163 -56481 52915 6377 -29943 49132 103091 87780 139938 121324 7832
14472G832p436n7548m6924P2550J21428M6914p1927l4112q6174k7445Q8554O7770
14460G3482p9454o9507k0275Q4743m3550k1537m3786J5206M8036L7879k140q823
14448b9726q151O0661m4671p6985j5465M9667J6232R8433O1202k1460L783J0112
14436A03632q4367r9644K0790P3903O0562l6422q3315k2269P1144L3068k4365
14425A2717M1550k6966K2410p3232J5425J115o7856k3032L7335J8809l5371K2666
14413e4430K8378j0441K8301K3894l0673m3669L6520k4983k0944K6474o1921n2863
14401a56357O233P0319M9954j131m8822N690l0915K0153j3691q288k5212j0662
14389a42729p9744j5438R9628L1381O5341K8493k6447p6491k6774L4231L0382
$$ plain form
14472 7832 396 -57152 -104076 -31526 89902 136816 64889 30777 -55397 -82842 5712 73482
14460 73482 -5972 -75479 -95754 -11011 -54561 -76098 -119884 -104678 -56642 -18763 -20903 -29726
14448 -29726 -37877 22784 -21887 -98872 -114337 -64670 -48438 49995 111197 89737 93520 103632
14436 103632 19265 -80379 -59589 14314 74876 38454 -44861 -67130 4014 37082 12717
14425 12717 54267 27301 49711 -23521 -8096 -6981 -74837 -97869 -60534 -41725 -77096 -54430
14413 -54430 -26052 -36493 -8192 15702 -14971 -58640 -22120 -47103 -68047 -41573 -103494 -156357
14401 -156357 -150124 -79805 -29851 -30982 -79804 -74114 -105029 -84876 -98567 -106855 -132067 -142729
14389 -142729 -222473 -237911 -138283 -106902 -41561 -13068 -39515 -116006 -142780 -108549 -78167
14378g8167o909M436k7982J1425Q8427m7300o3968r932K6371j1270k4267P728
14366a31408K6110j2651L6516L4893o484j7317p463K6392Q105J38390M2685R30
14354A38698n6617j6127l3520j18169n3932o8449q9982O5718J33430n3380k537
14343a54867O5402N8369k257q0663m0146K3000l227p3500J4095J0265K7950O775
14331a48804J13513j7658M8576O1133l5609p8470j2457K9476l1229j5574N3098
14320c4005L2617M067j08990l7307m5O3281Q4106j096M8576J5453k1169m855J326
14307D1959k8642k5922j04631M9296P3621p5688n0805k039J117m0231N0079L2740
14295g9146n1329o7587P6953N1012k6118l2787N1725J1016p778N3741K2919o1960
$$ plain form
14378 -78167 -85076 -80640 -108622 -97197 -8770 -56070 -120038 -129970 -103599 -114869 -139136 -131408
14366 -131408 -105298 -117949 -81433 -46540 -53024 -70341 -77804 -51412 -43307 95083 137768 138698
14354 138698 82081 65954 32434 -85735 -139667 -208116 -298098 -232380 -98950 -152330 -154867
14343 -154867 -89465 -31096 -33353 -114016 -154162 -131162 -134389 -207889 -193794 -183529 -155579 -148804
14331 -148804 -35291 -52949 -4373 56760 21151 -57319 -69776 -40300 -71529 -87103 -34005
14320 -34005 -1388 2679 -106311 -143618 -143663 -80382 3724 2628 51204 66657 45488 40633 41959
14307 41959 13317 -12605 -117236 -67940 5681 -70007 -120812 -122851 -121734 -161965 -111886 -79146
14295 -79146 -130475 -198062 -121109 -70097 -96215 -129002 -77277 -66261 -74039 -20298 2621 -59339
14283e9339o7315M1816L1130L8796m6753L0790m601q7113O1826N3593r6662k3198
14271a27030J03917J16510K1468q3640P330P6261l7140K2392j8747n2174j23046
14260i3899K0726l4769N1257K5733M5855j1922p6773j6523N2182k0204r2739J5311
14248a35765N5846N0119M0916p868m607L8247L2091m5930o8027k4536m14L1112
14236c8816L0012m9747j1449l0928j10670l1240O8378J9905P1970P6817P1030
14225F5262j7981o9425o5735L2923o634n2497K325n504O720M29O9415j1627n8720
14212a11049K5263K2015j1049Q266k5135o6171p0843L2646R0767L1138j5208J3502
14200g5858P4478J3418l6291r308k9808J3844M0073K9977l0118k1485K6924q650
$$ plain form
14283 -59339 -126654 -84838 -53708 -14912 -61665 -30875 -35476 -122589 -60763 -7170 -103832 -127030
14271 -127030 -23113 93397 114865 31225 38555 114816 77676 100068 81321 29147 -93899
14260 -93899 -73173 -107942 -56685 -30952 14903 2981 -73792 -90315 -38133 -58337 -151076 -135765
14248 -135765 -79919 -29800 11116 3248 -1359 36888 68979 23049 -44978 -69514 -69928 -38816
14236 -38816 -8804 -58551 -70000 -100928 -211598 -242838 -174460 -154555 -82585 -5768 65262
14225 65262 47281 -22144 -87879 -54956 -61590 -114087 -111762 -117266 -110546 -110117 -40702 -52329 -111049
14212 -111049 -85786 -63771 -74820 -66554 -91689 -157860 -228703 -196057 -105290 -74152 -89360 -75858
14200 -75858 -1380 12038 -24253 -33561 -63369 -49525 -9452 20525 -9593 -31078 -4154 -12804
14188a2804k4105N2830m2301j3446M7423P3806J3120M3333l6812k1457Q6659q1599
14176H4647p3101K4425M0602j1224j1972j687k6999J4839j8061L3620j2752O7763
14164A10100O5872L5022Q1929R33k0233K4842l8186p2236N2655J63084K06425
14153F10207J34933R9193K30080L16585M45629N86950R63441J913214L700050
14144I000282N924112O597091K947720j349076j178901Q55775j017810p584804
14136A4194389n607372k625571j329245q22973o06182m72938l32603l04980k36428
14127A856097j26494k3586n9575j08803j50563j41982k8030j9556j8848m2060
14117A136600k2636m5243m1641m2114o2950j00498l2181q7981l3444M4084k6824
$$ plain form
14188 -12804 -36909 15921 -26380 -39826 7597 81403 94523 137856 101044 79587 166246 84647
14176 84647 11546 35971 76573 65349 53377 51690 24691 39530 21469 55089 42337 110100
14164 110100 175972 210994 292923 293856 273623 298465 260279 188043 240698 403782 610207
14153 610207 745140 844333 1074413 1390998 1836627 2423577 3387018 5300232 9000282
14144 9000282 14924394 21521485 24469205 23120129 21941228 22797003 21779193 14194389
14136 14194389 8587017 5961446 4632201 3809228 3203046 2730108 2397505 2092525 1856097
14127 1856097 1729603 1706017 1646442 1537639 1387076 1245094 1217064 1197508 1178660 1136600
14117 1136600 1113964 1068721 1027080 984966 922016 821518 789337 701356 667912 711996 685172
14106F85172o0247o0417N3948l8902n6557L1768o6006j26768K9492M9314N3923
14095D94720O962l5148k3521R831o3425p5299j3389J5309j0204k5855K0353l8552
14083B61782n2540P5820l9523J618j27979J9772M2662o1901k616q931O2439R4631
14071B65234M7279o1879q522j5322r5507L7725N8524j0557L7303q201l0235P078
14059B22920P127O3354l5489k9373N0932j9824n3253j03528n9420O9264Q4682
14048A97392M019N7551L0143Q2734p9304l6623K3649r222N037q7141k659o9232
14036A16344q4039j3895n0772o0581Q3730L4426r0705q833J04785P9628o6033
14025D4055n9090j5075k9546r8909J57051P7058n8482J929P1953N2896J2716K6079
$$ plain form
14106 685172 624925 564508 618456 579554 522997 554765 488759 361991 391483 440797 494720
14095 494720 501682 466534 443013 452844 389419 314120 300731 316040 305836 279981 300334 261782
14083 261782 209242 285062 245539 247157 119178 138950 181612 119711 117095 108164 170603 265234
14071 265234 312513 250634 242112 226790 131283 169008 227532 216975 254278 246077 215842 222920
14059 222920 230047 293401 257912 228539 279471 259647 206394 102866 43446 112710 197392
14048 197392 201411 258962 289105 371839 292535 255912 279561 270339 275376 188235 185576 116344
14036 116344 32305 18410 -32362 -92943 -9213 25213 -65492 -74325 30460 110088 44055
14025 44055 -15035 -30110 -59656 -158565 -1514 75544 17062 18991 90944 143840 156556 182635
14013A82635p275L2541L8706m5680q5356m1613l2588j7830J3636l1242N4723J8547
14001G9204o6970q9981r5756K758L2934J2488K7495L9905m003L5966J7952n8403
13989f6411O957J17423P5562Q498j2882J6391L2834M7451o1074r2347m8358L144
13977B7188j7695o5554L3268j670l9851q319N99m5078L8927k0288k2262K424J4187
13964a04124K9521q793j9105l6376P8936P8332J52084M4545l1371p1169L991M5303
13952A61774p9414j20056l4362l2986O1096J03201J3291N2630K4455r6394k6532
13941B6703O6068l4579J6504l9262m1471q7472n8712L9349J4590l4103o1537M5176
13929a48746Q7474N7098K4243m5101j8214l1572m1780M2261Q4640O04R214P4720
$$ plain form
14013 182635 175360 207901 246607 200927 115571 73958 41370 23540 37176 5934 60657 79204
14001 79204 12234 -77747 -173503 -170745 -137811 -125323 -97828 -57923 -61926 -25960 -8008 -66411
13989 -66411 -59454 57969 133531 142029 129147 145538 178372 225823 164749 72402 24044 27188
13977 27188 9493 -56061 -22793 -24463 -64314 -72633 -72034 -117112 -78185 -98473 -120735 -118311 -104124
13964 -104124 -74603 -83396 -102501 -138877 -59941 18391 170475 215020 183649 112480 116471 161774
13952 161774 82360 -37696 -72058 -105044 -43948 59253 72544 125174 149629 53235 26703
13941 26703 92771 58192 74696 35434 -6037 -93509 -152221 -112872 -98282 -132385 -193922 -148746
13929 -148746 -61272 -4174 20069 -25032 -43246 -74818 -116598 -74337 10303 10907 20121 94841
13917I4841r0440q9297J01551K0500K95k1882n1172P0709l2558m6684O4957P7946
13905I8766Q2318l2131j14498N979m5546k9000L1735j0059k0373N1223K6688O7038
13893A12140l7840n4605N9465m9279j13950k1352M9536r715m067J1546K101j69
13881e6189J03461J1912l8059K8116N1633J7620k1028j5965j1837o8906j9368
13870a8610j9538k6759M43O6080O7577J6703l6806n2385j8016n6823k6149j4j1309
13857a15606M6037M4969j2945K3506M4832K4011K2564L4075j995L386j5013j00723
13845b902k2627p8273m7492Q7037J04464J03458m2023j0021N953p043k8300k1426
13833D0805n9390J4606Q4919R776j29230L6838Q852n257m9045J1168K8137k091
$$ plain form
13917 94841 4401 -84896 16655 37155 37450 15568 -35604 35105 2547 -44137 20820 98766
13905 98766 181084 148953 34455 40434 -5112 -34112 -2377 -12436 -32809 18414 45102 112140
13893 112140 74300 19695 79160 29881 -84069 -105421 -55885 -65600 -69667 -58121 -56020 -56189
13881 -56189 47272 59184 21125 49241 100874 118494 97466 81501 69664 758 -18610
13870 -18610 -38148 -64907 -64464 1616 69193 85896 49090 -3295 -21311 -78134 -104283 -104297 -115606
13857 -115606 -69569 -24600 -37545 -14039 30793 54804 77368 111443 109448 112834 97821 -2902
13845 -2902 -25529 -103802 -151294 -64257 40207 143665 101642 91621 97574 90531 62231 40805
13833 40805 -18585 -3979 80940 90716 -38514 -1676 7176 1919 -47126 -35958 -7821 -9912
13821i912k192m8914K2049M9004N9887p450J5853n9741J2712P9667j1891k6903
13809G2169L6105p918j09096K3364m1133L3110P7912Q2515K387l7928j246N418
13797A35659n4583J7436L2053k1141Q691J0227J6980O9545K333q6111m250Q5553
13785B12392L5739p4416J9512R8285K5220p6975K2326P0946K0011P4359L6177
13774D63576j3731l4960o1526L6866l3525P61r4601q8895r584j6208O665k0244
13762A34594J9658k037k2100k9643j8623O8461K8932K224m3816l4822J5061J9270
13750A37159p1486l5736k9248j9792P1493M8251o6538N6354J00460N8842J0573
13739B60332R283q1763l8608J3216l6564k6870M4086O3283j04095n0206Q5658
$$ plain form
13821 -9912 -12104 -61018 -38969 10035 69922 62472 78325 18584 31296 110963 99072 72169
13809 72169 108274 100356 -8740 14624 -26509 6601 84513 167028 169415 131487 130241 135659
13797 135659 81076 98512 130565 109424 118115 128342 145322 214867 217200 131089 126839 212392
13785 212392 248131 173715 193227 291512 316732 239757 262083 333029 353040 427399 463576
13774 463576 449845 414885 353359 390225 356700 357461 262860 173965 164381 148173 154838 134594
13762 134594 154252 152215 130115 100472 81849 150310 179242 181466 137650 102828 117889 137159
13750 137159 65673 29937 689 -19103 52390 100641 34103 90457 190917 249759 260332
13739 260332 269615 187852 149244 162460 125896 99026 143112 206395 102300 52094 137752
13728A37752K861j35404p5401Q1415j5721L023K3767L2553o9445N2399J9345J8184
13716G5328m3327n5433q224O337J33776J22992L1892j00424o1184K3899M1035
13705A66667L9284l3544k4460R3019N8953n133j2447m7484K9308L8611j3975K5099
13693C13898r6058j33575j8593N0995l8968K2597M6736L0j2795l9577q613J1310
13681I7387M8060Q2602O3518L0937k3026q1036n4679K1639m3857o491m4111k4123
13669F6820j0505L93K4973J08521R0092O5575R0244Q1243Q9824Q9580P4185Q6625
13657H57570K8519j10163m9542p9203j3774o017m0720J6284k6255m0928k5461
13646E10310J498q133p9347m0228l5359j0441L923k5526R686M568P2956J10577
$$ plain form
13728 137752 140613 5209 -70192 11223 -4498 -1475 22292 54845 -14600 37799 57144 75328
13716 75328 32001 -23432 -31656 -25319 108457 231449 263341 162917 101733 125632 166667
13705 166667 205951 172407 147947 240966 299919 294786 282339 234855 264163 302774 288799 313898
13693 313898 217840 84265 65672 116667 77699 100296 147032 147062 134267 94690 86077 97387
13681 97387 145447 228049 291567 322504 299478 218442 163763 185402 141545 135054 90943 66820
13669 66820 56315 56708 81681 190202 280294 345869 436113 517356 607180 696760 770945 857570
13657 857570 886089 775926 726384 647181 633407 627390 586670 602954 576699 535771 510310
13646 510310 511808 503675 424328 384100 348741 338300 342223 316697 326383 330951 403907 514484
13634E14484J07112O8601R8049L3811r841k51k4498J16136O9872K095p7681K3462
13622I21351M1952n9578q8650n8253m2294O738K9597J06624P1608K4142J53852
13611A107089J25899Q2296L785M4117J63L6121q5488j12606j33860j46848n3624
13600H67044m3776l3233l4356M4757L4511L8744Q1050Q1655r668M7725k8123j31687
13588I14643j47244n9425j4432q8450l3918l5521k3414k1966J2738k7357n7644
13577D18010P0516J43135J11453J39369J10527M7979J28197R4421O389p9818j45120
13566A045058j04260l7583j24304j7370j6427k0020J2373N622R369O3205P7391
13555H93054L8977J2735P4068K3171K7756R0189m7932j58119n6660j33697q3284
$$ plain form
13634 514484 621596 690197 788246 822057 812216 811965 787467 903603 973475 975570 897889 921351
13622 921351 963303 903725 815075 756822 714528 721266 750863 857487 929095 953237 1107089
13611 1107089 1232988 1315284 1319069 1363186 1363349 1399470 1313982 1201376 1067516 920668 867044
13600 867044 823268 790035 755679 800436 834947 873691 954741 1036396 1026728 1074453 1046330 914643
13588 914643 767399 707974 693542 605092 571174 535653 512239 490273 503011 475654 418010
13577 418010 488526 631661 743114 882483 993010 1040989 1169186 1263607 1269996 1190178 1045058
13566 1045058 940798 903215 778911 761541 745114 725094 737467 743089 752458 815663 893054
13555 893054 932031 944766 1018834 1042005 1069761 1159950 1112018 953899 897239 763542 680258
13544F80258R171j3479k611k8673l920L3190Q1168J99534R6816K145j7578K2331
13532A058352R1347J12865J09632N3192k1723l9955o827Q1398O0953m0126j20303
13521A338805k4226M5861L6869O6052P4080Q4197m4503j12280j62706o2558n2381
13510A187210j28004k5281j3069j5718o7177j00792p3549p8871m4237O9522Q706
13499G18740p236k6130O4856J10717N9623J07014J70104J13771j8971J02627R5574
13488A490689m1210q6790j32919o8489q4437j0555M2198Q7435R5142J51592J35199
13477A577855Q9988p4139j24147j42383j49395j87731j01944n4459l0003O2312
13467H65954J10966O6106J41692L2506p8201j17508j14576L6074m7566r1287j66206
$$ plain form
13544 680258 689429 675950 673339 644666 640746 673936 755104 954638 1051454 1053599 1036021 1058352
13532 1058352 1149699 1262564 1372196 1425388 1403665 1363710 1356883 1438281 1499234 1459108 1338805
13521 1338805 1314579 1360440 1397309 1463361 1537441 1621638 1577135 1464855 1302149 1239591 1187210
13510 1187210 1059206 1033925 1020856 1005138 937961 837169 763620 684749 640512 710034 718740
13499 718740 711504 685374 750230 860947 920570 1027584 1197688 1311459 1292488 1395115 1490689
13488 1490689 1449479 1362689 1229770 1161281 1076844 1066289 1108487 1195922 1291064 1442656 1577855
13477 1577855 1667843 1593704 1469557 1327174 1177779 990048 888104 833645 803642 865954
13467 865954 976920 1043026 1184718 1217224 1139023 1021515 906939 943013 895447 804160 637954
13456F37954q0195l6567N8393L9711K3972L2888M9258R3871K9496n755o1073L4902
13444H16855J52184J23633L5456O0968N7473J03685k8927o7042k0491j7172r4550
13433A122072j17141o3633K0180q5102p2912o4919l2134J1221N0111O2233K1696
13422H51672k9766m5696n2738m9974r6429r2328l2594q799n6546K3111O7634J37899
13410F15446Q9139J10402M1286L6459J03243M3248m4182k09466j10779l4991m0244
13399E99561r6565j35405n5899O3613j09659J694J1260j0571j1554n0824n3577
13388A52074K0875l748M401P9291q411O0623J6126o7215K7288K9171j3055L6596
13376C34016j8237J2649n0128r6990j3027o2054K5328R2865p1416r7047M7105
$$ plain form
13456 637954 557759 521192 579585 619296 643268 676156 725414 819285 848781 843026 781953 816855
13444 816855 969039 1092672 1128128 1189096 1246569 1350254 1321327 1254285 1233794 1216622 1122072
13433 1122072 1004931 941298 961478 876376 803464 738545 706411 717632 767743 829976 851672
13422 851672 821906 776210 723472 673498 577069 484741 452147 443348 386802 409913 477547 615446
13410 615446 704585 814987 856273 892732 995975 1039223 995041 785575 674796 639805 599561
13399 599561 502996 367591 311692 375305 265646 267340 278600 268029 256475 205651 152074
13388 152074 172949 169201 173602 252893 244482 305105 321231 254016 281304 310475 297420 334016
13376 334016 315779 328428 278300 181310 168283 106229 131557 224422 153006 55959 103064
13365A03064O7557M8232J6429n7062j1160P417k4454l6325O0381P2136j5976p1294
13353A58945P4355N0255m2641L5025o4492m2070O1738R1577K4808j6588m9593
13342B81319j5359j54825n5958M0493J6167P7811N4518m6984K7066N5609q953
13331B70904m7649N041k3280o0216L0321j8227L8978n4567L4245J1356L0329K9764
13319B46999q3771l2719N1264r816L7821L3897k9485M3115J316M7004O4325R0712
13307D60662J20291J97717L0706Q5233n1980o2169j1994q6534j70886r3085m189
13296D13772q2890m727j7727L4043J2762N2219P5375N7254L0516q474j2346n7389
13284D92388k066J2391j3029O0626N8686l6244p7848k6001l8481J02381M0302
$$ plain form
13365 103064 170621 218853 235282 178220 167060 174477 150023 113698 174079 246215 230239 158945
13353 158945 233300 283555 240914 275939 211447 169377 231115 322692 347500 330912 281319
13342 281319 265960 111135 55177 95670 111837 189648 244166 197182 224248 279857 270904
13331 270904 223255 228296 205016 144800 175121 156894 195872 141305 175550 186906 217235 246999
13319 246999 163228 130509 181773 171957 209778 243675 214190 257305 258621 305625 369950 460662
13307 460662 580953 778670 809376 894609 842629 780460 768466 681932 511046 417961 413772
13296 413772 330882 326155 308428 342471 355233 407452 482827 540081 570597 562123 549777 492388
13284 492388 490322 502713 489684 550310 608996 572752 494904 468903 430422 532803 573105
13273E73105k2256m4398M5195K7036p1273l2R6114K1458J9883J0732M9319L802
13261G08685n6454m7204P2184L8775k5542n0704j5730J13565N7615j9637n9918
13250G15635K3999P7097m531N122O0942N9960j3129l4952L6081j3209P6055N5834
13238A044904J49643J62341P1634L3293J06247K87806O25894P06704Q06157Q49977
13228D844600O38141K54976J44490K257k98685l32450k66430L54511J168203K210482
13218H720095L782690N557217O423405N285684K885747P63463o38345k120096
13210C0659860m076301n666373n702189l998778k280856j254635o54371l37283
13202F689074k17875p2276J06160K35088M50261Q04284J370149K376536L705026
$$ plain form
13273 573105 550849 506451 551646 578682 507409 507377 603491 624949 644832 655564 704883 708685
13261 708685 652231 605027 677211 715986 690444 639740 624010 737575 795190 775553 715635
13250 715635 739634 816731 812200 817322 878264 938224 925095 890143 926224 913015 989070 1044904
13238 1044904 1194547 1356888 1428522 1461815 1568062 1855868 2481762 3188466 3994623 4844600
13228 4844600 5482741 5737717 5882207 5884464 5585779 5253329 4986899 5341410 6509613 8720095
13218 8720095 12502785 18060002 24483407 29769091 32654838 33418301 32779956 30659860
13210 30659860 26583559 20917186 15214997 11216219 8935363 7680728 7026357 6689074
13202 6689074 6471199 6398923 6505083 6740171 7190432 7994716 9364865 11741401 15446427
13193A5446427M825478M379845J867090l4453n1386N1026k354758m456391l527748
13184A6145130j717978o24959J03344P14835J269600K008270L491410N837423
13176B7227075R876001J5424489K0271462K0902031J5352651O386011K51285k549356
13168A13141649o665337j3949706j6885101j1146061j123633P341115J2086814
13161H2799740J0355798L733923j432407j650981k730244q562771j2014419p151299
13153F3347340K416011J1260786J6162225J3376139N170426q21629j160383l361967
13145A06388948j1195280j6237618j1920638l413475M483717J1811214J6809139
13138I6726007J5416823P454565k13167j849071k522052r016432j4773190j1253384
$$ plain form
13193 15446427 20271905 24651750 26518840 26484387 26433001 26484027 24129269 19672878 16145130
13184 16145130 14427152 13802193 13905537 14620372 15889972 17898242 21389652 27227075
13176 27227075 37103076 52527565 72799027 93701058 109053709 115439720 115691005 113141649
13168 113141649 106476312 92526606 75641505 64495444 63371811 70712926 82799740
13161 82799740 93155538 96889461 95457054 93806073 91075829 82513058 70498639 63347340
13153 63347340 65763351 77024137 93186362 106562501 111732927 110911298 109750915 106388948
13145 106388948 95193668 78956050 67035412 63621937 68105654 79916868 96726007
13138 96726007 112142830 119597395 119384228 117535157 115013105 105996673 91223483 79970099
13130G9970099m1038J1610740K0404329K2519942J7464846Q688261J100625m982049
13122A56735755j0801605j6560241j9476772j5178279k285784J0525004J6133794
13115A19091872J0478796m59108m587391k667310o820720j9735009k2762112j5468112
13107E7070906r244312n954463m133866k853406k107260j687108j397320j078191
13099B8614980r75277q78659o89492l86462m4198Q1476K50012M33578O16405R72549
13089B7994912J544276K341601L964361P096569J2261653J8499293K2122404J6966224
13081A12791293N564315p10672N28631j163991j1945071j5270339m550070R258461
13073I4502557J9885781K2326511J6799811Q231830R7344m705090j2618477j6492170
$$ plain form
13130 79970099 79929061 91539801 111944130 134464072 151928918 160617179 161717804 156735755
13122 156735755 145934150 129373909 109897137 94718858 92433074 102958078 119091872
13115 119091872 129570668 129111560 124524169 121856859 115036139 95301130 72539018 57070906
13107 57070906 47826594 41872131 37738265 34884859 32777599 31090491 29693171 28614980
13099 28614980 27639703 26761044 26071552 25685090 25640892 25722368 25972380 26405958 27022363 27994912
13089 27994912 29539188 31880789 35845150 42941719 55203372 73702665 95825069 112791293
13081 112791293 118355608 117644936 118173567 117009576 105064505 89794166 85244096 94502557
13073 94502557 114388338 136714849 153514660 161746490 161843834 157138744 144520267 128028097
13065A28028097k2621848j8541352n249299O505572J5140634J6553172P787670
13058A27602646j508877k474710l81445q134734j9767623j6397411p351419N55768
13050G2142195Q101392J5358503J8103507J0720827k85870l302400q03632n313263
13042A14721259j7891330j7207627o996744K725908J0594977J3639923P662862
13035A07249228q23939k368313L64690l634474j3913580j1947290k299521P326703
13027G9953504J5898458J9821118J4181755L758415k575570k919210p700007j8286155
13019A02132308k2533564j8564111j1341045o296329l644060k261995j364570
13012C6126634j020214p20023l04680L57186J584402K921762L154724J238189
$$ plain form
13065 128028097 105406249 86864897 81615598 88121170 103261804 119814976 127602646
13058 127602646 126093769 123619059 123237614 115102880 95335257 78937846 71586427 72142195
13050 72142195 80243587 95602090 113705597 124426424 124140554 120838154 120034522 114721259
13042 114721259 96829929 79622302 72625558 75351466 85946443 99586366 107249228
13035 107249228 106425289 104056976 104421666 100787192 86873612 74926322 72626801 79953504
13027 79953504 95851962 115673080 129854835 133613250 131037680 128118470 120418463 102132308
13019 102132308 79598744 61034633 49693588 43397259 39753199 37491204 36126634
13012 36126634 35106420 34386397 34081717 34438903 36023305 38945067 42099791 43337980
13004D3337980q76486j198435r17256k682223n269138n129198l590410k556902
12996B1117932j658101j056056o36680k69437L5961Q3102m2211M840O25864J448413
12986A9653627K656058M519624O199698N602969L421734J094319k61349j662490
12978D1224190m304105n388658o371584m988348l004874j645802p65686j10568
12970A4644565K84113M25512K09469l32485n47159m54414p75936j508207j501283
12961A0444175j193499p69965n47041l56803k52286k76456k74706k66938k56806
12952F249675k81455k84010j97768j38912k41793j33559j67628j80546n1296r8776
12942D473932q6604m7694j51780j58662j15434j42215j23417m5306j9497p1403
$$ plain form
13004 43337980 42461494 41263059 40345803 37663580 32394442 27265244 23674834 21117932
12996 21117932 19459831 18403775 17767095 17497658 17533619 17616721 17574510 17579350 18205214 19653627
12986 19653627 22309685 26829309 33029007 38631976 42053710 43148029 42886680 41224190
12978 41224190 36920085 31531427 25159843 20171495 17166621 15520819 14755133 14644565
12970 14644565 14928678 15354190 15563659 15231174 14684015 14229601 13453665 11945458 10444175
12961 10444175 9250676 8480711 7933670 7576867 7324581 7048125 6773419 6506481 6249675
12952 6249675 5968220 5684210 5486442 5347530 5105737 4972178 4804550 4624004 4572708 4473932
12942 4473932 4387328 4339634 4187854 4029192 3913758 3771543 3648126 3602820 3583323 3511920
12932C511920r1963j9007q1522m1460q2838o6608n6913n1169k5586M6221n4121
12921B986954r6333j16060j43144j37457j72554j25510j04325k3929m6744J8926
12911B039824L680k0132k1653n112j04886K0483N1144N7999n5117K2073N1946
12900B040249J1530j06651m9422m385J5535K042M5952J68020J33838l9756m2219
12889B174733J8858q9456j46704j30458j25871m1883p861L1097o8748q1140k9180
12878A503387o5591r8309m1177l1896o4081J5719K9062m0780J3184M1089p6028
12867A184579r061P8246n5727N4510k1931L867j5583o9668n0250l4008p2679P2672
12855A064967M7886l9170n1416K878L3272n7405K8275M0499o5889j17455o4274
$$ plain form
12932 3511920 3419957 3400950 3319428 3277968 3195130 3128522 3071609 3020440 2994854 3041075 2986954
12921 2986954 2890621 2774561 2631417 2493960 2321406 2195896 2091571 2067642 2020898 2039824
12911 2039824 2043504 2023372 2001719 1996607 1891721 1912204 1963348 2021347 1966230 1988303 2040249
12900 2040249 2051779 1945128 1895706 1891321 1906856 1908898 1954850 2122870 2256708 2216952 2174733
12889 2174733 2193591 2104135 1957431 1826973 1701102 1659219 1651358 1682455 1613707 1532567 1503387
12878 1503387 1437796 1339487 1298310 1266414 1202333 1218052 1247114 1206334 1219518 1260607 1184579
12867 1184579 1175518 1253764 1198037 1252547 1230616 1234483 1218900 1149232 1098982 1064974 992295 1064967
12855 1064967 1112853 1073683 1022267 1025145 1058417 1001012 1029287 1069786 1003897 886442 822168
12844H22168Q9607N3513o436P3539O4555n4078k9914O4953n5342l4174n0469m0313
12832H97609r624k9270q7705K8771O3112k7877m1652J1120k2809m5526N9099l1319
12820G63929q3471n801J02743k4144q2796P14N5185k7181O639p7148K5956L3232
12808F87857L7364N9322k2670L8336L7386P444K8365K2746J2030K180O1946K2036
12796I94342n560o7733m471J7148K0650p8848p006N151O3398K2309j00825L3122
12784H91677Q3976O236R8388L33476L55353O01376O98155N21119M22460L52007
12774D364223L74829R6822m47498o03267l55110m51955n67979l48110k08894p7061
12764A776000m5024j9161k0334j4198j4924R8384J60359J74323J83774J70730
$$ plain form
12844 822168 911775 965288 958852 1032391 1096946 1042868 1012954 1077907 1022565 988391 937922 897609
12832 897609 887985 858715 771010 799781 862893 835016 793364 804484 781675 736149 795248 763929
12820 763929 680458 674657 777400 753256 670460 671174 726359 699178 705817 628669 654625 687857
12808 687857 725221 784543 761873 800209 837595 845039 873404 896150 908180 910360 972306 994342
12796 994342 988782 921049 916578 933726 954376 875528 868522 873673 937071 959380 858555 891677
12784 891677 975653 981889 1080277 1413753 1769106 2370482 3068637 3589756 4012216 4364223
12774 4364223 4739052 4835874 4388376 3785109 3429999 2978044 2410065 2061955 1853061 1776000
12764 1776000 1730976 1711815 1691481 1677283 1662359 1760743 1921102 2095425 2279199 2449929
12754B449929J70879J29537J55458L33012M12608N88320O46098O56211O86020
12745F228072N36382L47687J52000k96657o15908o45801n27630o38212m74170
12736D065763j05872K6430l9409j72894j54439M2190j23825k12727k20360k22728
12726B882129j05100o7789j72866k53941j68946M8704J54861J39302J95361K28275
12716B879990K32157K98878M79908P00060R35008O90742L91616K82200R8074l83985
12706F604648o94196o63011q46648p15834m72296m03219k02691j58093j50808
12697B297852j98378m4406n873M4674J87543Q6578m1132j11742j85153j35665
12687A894298n8249r8493j7468K4059l0547k9164m1074j07271k7778M1171p4986
$$ plain form
12754 2449929 2620808 2750345 2905803 3238815 3651423 4239743 4885841 5542052 6228072
12745 6228072 6764454 7112141 7264141 6967484 6351576 5705775 5178145 4539933 4065763
12736 4065763 3959891 3986321 3946912 3774018 3619579 3661769 3537944 3325217 3104857 2882129
12726 2882129 2777029 2709240 2536374 2282433 2113487 2162191 2317052 2456354 2651715 2879990
12716 2879990 3112147 3411025 3890933 4590993 5526001 6216743 6608359 6890559 6988633 6604648
12706 6604648 5910452 5247441 4400793 3684959 3212663 2809444 2606753 2448660 2297852
12697 2297852 2099474 2055068 2049195 2093869 2281412 2367990 2326858 2215116 2029963 1894298
12687 1894298 1836049 1737556 1720088 1744147 1713600 1684436 1643362 1536091 1508313 1549484 1474498
12676A474498j2276m0195q351l6851o7612m2637q6220l1644J8731L5007M8079
12665A250529J6575J26913J40636J7718q4886k8457Q1967P542N8311K17510K30234
12654B034592J01004J15016J19287N9558o9949q5876j23180j62001k53413r8130
12644A636908j08018j15083m2263N4368k3298l3488q9347o4178R4093O6622K7980
12633A404296J05078J49482J2170P5494J65559J37329J84439K04091R4890m990
12623B527838J0680P440j2549L3652L8635J93344J25840N0667J35849J51578J27798
12612C390772l2018o5527Q5739J48024P7714m7633l8623L1004k9828o0061j84946
12601C274617k32588k17393k55839k55228j03917n8248o4716m2550n878M0265
$$ plain form
12676 1474498 1462222 1422027 1413676 1376825 1309213 1266576 1180356 1148712 1167443 1202450 1250529
12665 1250529 1267104 1394017 1534653 1552371 1467485 1439028 1520995 1528537 1586848 1804358 2034592
12654 2034592 2135596 2250612 2369899 2429457 2359508 2273632 2150452 1988451 1735038 1636908
12644 1636908 1528890 1413807 1371544 1425912 1402614 1369126 1279779 1215601 1309694 1376316 1404296
12633 1404296 1509374 1658856 1671026 1746520 1912079 2049408 2233847 2437938 2532828 2527838
12623 2527838 2538518 2545958 2533409 2567061 2605696 2799040 2924880 2975547 3111396 3262974 3390772
12612 3390772 3358754 3293227 3378966 3526990 3604704 3557071 3518448 3549452 3519624 3459563 3274617
12601 3274617 3042029 2824636 2568797 2313569 2209652 2151404 2086688 2044138 2038260 2078525
12591B078525L1712J974m1127r1615M6489J94900J42662j4110L7894K15403J0559
12580B613266o2115j35854n6782R5720K5859j26901j29166j8463Q580k6562j82671
12569B004911r7018j02677j32394L521j6212M817P8977l8926l8586L8997R0331
12558A795741K1349k142l0255m6026M7573m061N1653J17203J53854Q0856J80458
12547B366203K27270K69388N08554O71599Q24929J141206J532751K239340K934117
12538A2715357L161834K477869J160062k5062n73603j033610k144754k934507
12530A2803586k722895k050130j422257q46253o07348m76129l17830j81218k11054
12521C968472k70410k05421j03616q1780k63396k48153j63652r2340p6421l1063
$$ plain form
12591 2078525 2110237 2112211 2071084 1979469 2025958 2220858 2363520 2349410 2387304 2602707 2613266
12580 2613266 2551151 2415297 2358515 2454235 2480094 2353193 2224027 2205564 2214144 2187582 2004911
12569 2004911 1907893 1805216 1672822 1676343 1660131 1664948 1743925 1704999 1666413 1705410 1795741
12558 1795741 1817090 1814948 1784693 1738667 1786240 1782179 1833832 1951035 2104889 2185745 2366203
12547 2366203 2593473 2862861 3371415 4043014 4867943 6009149 7541900 9781240 12715357
12538 12715357 15877191 18355060 19515122 19490060 18916457 17882847 15738093 12803586
12530 12803586 10080691 8030561 6608304 5762051 5154703 4678574 4360744 4179526 3968472
12521 3968472 3698062 3492641 3389025 3307245 3043849 2795696 2632044 2539704 2463283 2432220
12511B432220O5246q352j32417j99650j40046L5152J4687m0074N6083n3978N203
12500B034074J1205p3413j03967q6191K7946K2038n8559q516P472k135J35946
12489A905900K0376K732K3598K5417J10474J34780Q8252Q3046J26118O3244J38797
12478B722734M51366O66872P61353M49966P3909K71049O99791O85147J90227K71153
12468G243567L03069J27805k1814m13690q08139q01147r43901j000274o07026
12459C078450m03831k50195k5768j11003l4742L6286J02229K01078K70262J35466
12449B998232J14783K38258L24482L15167M29111L43923J53320j35176o8562J19684
12439D833222O4502K3319L01172N60354O61659M94566L98746K74767j94353p24367
$$ plain form
12511 2432220 2497466 2489114 2356697 2157047 2017001 2052153 2066840 2026766 2082849 2028871 2034074
12500 2034074 2045279 1971866 1867899 1781708 1809654 1831692 1773133 1764617 1772089 1769954 1905900
12489 1905900 1926276 1929008 1952606 1978023 2088497 2223277 2311529 2394575 2520693 2583937 2722734
12478 2722734 3174100 3840972 4602325 5052291 5126200 5397249 6097040 6782187 6972414 7243567
12468 7243567 7546636 7674441 7652627 7238937 6430798 5629651 4685750 3685476 3078450
12459 3078450 2674619 2424424 2398656 2287653 2252911 2289197 2391426 2592504 2862766 2998232
12449 2998232 3113015 3351273 3675755 3990922 4420033 4763956 4917276 4782100 4713538 4833222
12439 4833222 4897724 4921043 5222215 5782569 6444228 6938794 7337540 7612307 7417954 6693587
12429F693587p40862n93555n11325o16165n70125m27616l29563j81441j00479
12420B622456k61806l04833j02454o5321L533J9277Q8867J16509R2684J11754
12410B320666R7721J60326K31312M17403N14061L92302L37105K93028L50918R2268
12400E207110m68026n99536l56487l17974n86679m86676l14157k87829k03438
12391A586308r9641p7670q5001j1231p2609n440q0269m528q8484p1373o9245l189
12379I17628l2525j11604k321l0213N0393N8181j9074K1821M4412P0616p4464
12368H92850j8680l3843k7061j11749j7966m4614m7174N8356Q2183J8531M7667
12357G98500J1416q8029j39859n2111p7183j38949L8541L3600O2102L4511M0678
$$ plain form
12429 6693587 5952725 5359170 4847845 4231680 3661555 3233939 2904376 2722935 2622456
12420 2622456 2360650 2055817 1953363 1888042 1891575 1910852 1999719 2116228 2208912 2320666
12410 2320666 2418387 2578713 2810025 3227428 3741489 4133791 4470896 4763924 5114842 5207110
12400 5207110 4739084 4139548 3783061 3465087 2878408 2391732 2077575 1789746 1586308
12391 1586308 1486667 1408997 1323996 1312765 1240156 1234716 1154447 1149919 1061435 990062 920817 917628
12379 917628 885103 773499 771178 740965 791358 849539 830465 852286 896698 967314 892850
12368 892850 874170 840327 813266 701517 683551 638937 591763 650119 732302 750833 798500
12357 798500 809916 721887 582028 529917 452734 313785 352326 385926 448028 482539 523217
12346E23217O6377K465o1774j07671p1030M5429J9151n3641l8548k9466P183j1125
12334B90567M8829L3274q5939l803P4148K5166n691P42n6081r4268K7938k2304
12322B32578K1272o3707O2332R3809N4331q1867o0166O3806o131k2490L4369j5471
12310C12665o9907m3911L356J8306K4136k8750N4900O3114m6569k3213q2465L451
12298A85113k7312Q6683J37980N7500m5212p8429j99465j6517L4102j3380j9501
12287A01562j3680J3762L475J57050o8083q2847q000J34694O3077j44581L1242
12276A87671M3756J2820k2883L7868J1805K880r7519M4319M0366o3465k1796m9422
12264A26400L9423O594K3969n8306j20424J5283K2542J41395J200k7563l9001
$$ plain form
12346 523217 589594 592059 530285 422614 351584 397013 416164 362523 323975 294509 301692 290567
12334 290567 339396 372670 286731 282928 357076 382242 376551 377293 321212 226944 254882 232578
12322 232578 253850 190143 252475 346284 400615 318748 258582 322388 316257 293767 328136 312665
12310 312665 242758 198847 202203 220509 244645 215895 270795 333909 287340 264127 181662 185113
12298 185113 157801 244484 382464 439964 394752 316323 116858 100341 134443 121063 101562
12287 101562 87882 101644 105119 262169 194086 111239 103239 237933 301010 156429 187671
12276 187671 231427 244247 221364 259232 271037 273917 176398 220717 261083 197618 175822 126400
12264 126400 165823 172417 196386 138080 17656 32939 55481 196876 198076 170513 131512
12253A31512q7817m0283L7154J2927P6169N7797m5424k2469q0002K4894J0693
12242G5151m392q6777k5006P7517O8467j2038M674J6082L6860k7368P3923l7571
12230A59522j6097m8848p414L9613k9960l2873K2756k9371n1300K1006P9076L0124
12218A36234O674o5335N108j4547J5871N0346J8244K7626q9446j08590Q6337R4074
12206A62596N9438j4738k0385j2007m2038n1426n2996J3694O597K695n7444K4350
12194A8336K2637j1645M9536K711j10060j5113J03554j1530j5901k1280j17540
12183a06295J7426R3909N2027R4909K7730k7747r0396l3720M1772M2583l4827
12172G7371n2410K1357N5028L1709o1149n106j2231O5659L0649m9110o5785k675
$$ plain form
12253 131512 43695 3412 40566 53493 129662 187459 142035 119566 39564 64458 75151
12242 75151 70759 -16018 -41024 36493 104960 92922 97596 113678 150538 123170 197093 159522
12230 159522 143425 94577 87163 126776 96816 63943 86699 57328 6028 27034 106110 136234
12218 136234 142908 77573 82681 68134 84005 134351 152595 180221 90775 -17815 68522 162596
12206 162596 222034 207296 186911 174904 132866 81440 28444 42138 48735 51430 -6014 18336
12194 18336 40973 29328 78864 81575 -28485 -43598 59956 48426 32525 11245 -106295
12183 -106295 -88869 5040 57067 151976 179706 151959 61563 27843 69615 112198 77371
12172 77371 24961 46318 101346 133055 71906 66800 54569 120228 150877 101767 35982 33307
12160C3307Q647L2579N3701P359N8445q4078n2136J3227J10347L6735O2124M195
12148B84452q1250n4818j6569j4904l9695J0486n9772l5936l9627J2201j5801
12137e1233o7704J3217M3770J0312r0460O316M7894j1718O2796P3718L6708K5754
12125I9370l4053p7399j8931N536O3295J3712M3269J58751N1504j80754n9202
12114F5098O2226p6911l1795P8441q9796l8417R0073m0788k5177K3040k7425K3390
12102A1959N2181k9751J3741N298k5346m378q996k7043M6820O7813j1700j14090
12090b3492J2399n3384q1639P1964P1612K8909m1495M9923j2800J4890r373j2706
12078A4808J4361Q2086J3431R571J321n9327q1644j6790Q7317P6885l6468m2590
$$ plain form
12160 33307 41954 74533 128234 135593 194038 109960 57824 71051 181398 218133 280257 284452
12148 284452 203202 148384 131815 116911 77216 87702 27930 -8006 -47633 -35432 -51233
12137 -51233 -118937 -105720 -61950 -51638 -142098 -135782 -87888 -99606 -36810 36908 73616 99370
12125 99370 65317 -12082 -31013 -25477 37818 51530 94799 253550 305054 124300 65098
12114 65098 127324 50413 18618 97059 7263 -31154 58919 18131 -7046 15994 -11431 11959
12102 11959 64140 34389 48130 53428 28082 23704 14708 -12335 34485 102298 90598 -23492
12090 -23492 -11093 -64477 -146116 -74152 -2540 26369 -15126 34797 21997 36887 27514 14808
12078 14808 29169 111255 124686 134257 135578 76251 -5393 -22183 65134 142019 105551 62961
12066F2961J0106o33J6799j1412p097L025J6208M5637j7195l417J4751r5724r9159
12053f5150q6169k7577J24397O1096o319M0033k2762m7099J20473R6538m9863
12042A37598k0760l0271P1499K44l77L6197K4946j500M4948j2931K3283j19952
12030A52924o0724q7191m0308M6545N6075M9170k49n9486m6586J2962J33772m6052
12018A10852j24008m8196j9929j4359j4603N1440K3629K7422K696N5853j3516
12007C7281n8672j7634L2744L8964j7563j16793L9717R5972k6581k6939J8663
11996h41Q8122J6796O2464J2084m1629J4847K9458L0591j2607j367J7672k4516
11984A91074J3678p575k1197J9467K3081j4933j36880o8693j02028P715R2809
$$ plain form
12066 62961 73067 72434 89233 77821 70724 73749 89957 135594 118399 114982 129733 34009 -65150
12053 -65150 -151319 -178896 -54499 6597 278 40311 17549 -29550 90923 187461 137598
12042 137598 116838 86567 158066 158310 157933 194130 219076 217576 262524 249593 272876 152924
12030 152924 92200 5009 -35299 11246 67321 116491 116242 56756 10170 23132 156904 110852
12018 110852 -13156 -61352 -81281 -95640 -110243 -58803 -35174 -7752 -5056 50797 37281
12007 37281 -21391 -39025 -6281 32683 15120 -101673 -61956 34016 7435 -19504 -841
11996 -841 87281 104077 166541 178625 136996 151843 181301 211892 199285 197918 215590 191074
11984 191074 204752 197177 175980 195447 218528 203595 66715 -1978 -104006 -96291 -3482
11973c482k1839n814J03931o785L569l3279k923L1181m6198o4371M9027K7232
11961C0249R0221j0232Q08j13947k3667n9870k5734P5415p9125n3806K4099N0344
11949i5245P9642M1887O0581Q5996n4775k2081K0430m5721p02R0760j2547j67710
11937a9485J5944P0165N5859j8675q9536o1522K5565L3088k5406r943K0801m0869
11925d4014j6172J30436J00841R337M0035r923k8534J2487M7352N0917l6543j26854
11913A29365j32096m4630m5267N1000K0465j7279n138J5722j7511N7570Q018L9789
11901F0008q693m5016Q486P7086m5687n8785J5976j3619j016J1826j03254J6761
11889h5927O1229l9275L1263L2765O2667J2690j6135o3121j06593p3166J28342
$$ plain form
11973 -3482 -25321 -31135 72796 66011 69580 36301 33378 64559 18361 -46010 3017 30249
11961 30249 120470 110238 111046 -2901 -26568 -86438 -112172 -36757 -115882 -169688 -145589 -95245
11949 -95245 -15603 26284 86865 172861 118086 96005 116435 70714 70012 160772 148225 -19485
11937 -19485 -3541 66624 122483 103808 14272 -47250 -21685 11403 -14003 -23946 -3145 -44014
11925 -44014 -60186 70250 171091 180428 220463 210540 182006 194493 241845 292762 256219 129365
11913 129365 -2731 -47361 -92628 -41628 -21163 -38442 -43580 -27858 -45369 12201 20219 60008
11901 60008 51315 6299 14785 91871 46184 -12601 3375 -10244 -11260 566 -102688 -85927
11889 -85927 -24698 -63973 -32710 55 62722 75412 59277 -3844 -110437 -183603 -55261
11878e5261J01449M7286m3536k9205m2853K7393L0676J5037R5996M0669q1031
11867A06620J8802K9656J22096J00814J6941l4265o1650K180o9539r8966k4022
11856A08667o4320J4275N1903L0792q7597p9638n6155J7171R8054J18667L4799
11845A86618p881J923j03237q8762M3327K8073n373r6778L594L8042K5310n1719
11833b6863q4695K5098r083l6058L1717J27787O6955k6275m6979M5366N3707r6267
11821B4410K8890l0554l0079k3065L965O0841Q7663L6349r3895o1955N8376R472
11809G0418j2413r417M0027J9455j6177j475n1994L3971n713N0696M1571j32499
11797B6450o971L6226L4141l1582J3790L7595m3722q1948L4859P302P954K1323
$$ plain form
11878 -55261 46188 93474 49938 20733 -22120 5273 35949 50986 146982 187651 106620
11867 106620 125422 155078 277174 377988 394929 360664 299014 301194 231655 132689 108667
11856 108667 44347 58622 110525 141317 53720 -25918 -82073 -64902 33152 151819 186618
11845 186618 178737 180660 77423 -11339 31988 60061 54688 -42090 -38496 -454 24856 -26863
11833 -26863 -111558 -86460 -95543 -131601 -99884 27903 94858 68583 21604 66970 120677 24410
11821 24410 53300 22746 -7333 -30398 -26433 34408 122071 158420 64525 2570 60946 70418
11809 70418 58005 48588 88615 108070 91893 90418 38424 72395 66682 117378 158949 26450
11797 26450 19479 55705 89846 58264 72054 109649 65927 -16021 18838 26140 34094 55417
11785E5417M4109l3645J084L2259L0515K7502l4695j27295j00606n0268R3427
11774f2196J03951k8100q2324m5239n9323N0068J77047j8803r20m5088k9720Q2782
11762D2135N2105J2611L5075J06132n2561o2106m9237k7143o5453r8310r619M365
11750a12006P266N7500M1896j012k2961O6137n406m2582j3166m192l8983j082
11738f8591N4448L4796O864q5167r4079p3965J0152O4465L3898K1584k5551J06614
11726a4532p2944k0515m683l4909J19651Q2568n617q1839l9997K0736J09744R1629
11714A49292o5117j79463J03975L7762q6819M314K5622j2739P815l7275J6001
11703c6632J8218r375l2624O9959P0806K0711r0690n7960N4931J9604n108o2701
$$ plain form
11785 55417 99526 65881 66965 99224 129739 157241 122546 -4749 -105355 -155623 -62196
11774 -62196 41755 13655 -68669 -113908 -173231 -123163 53884 35081 34161 -10927 -40647 42135
11762 42135 94240 106851 141926 248058 195497 133391 84154 57011 -8442 -106752 -116371 -112006
11750 -112006 -104740 -47240 -5344 -6356 -29317 36820 31414 -11168 -24334 -28526 -67509 -68591
11738 -68591 -14143 20653 27517 -57650 -151729 -225694 -215542 -151077 -117179 -95595 -121146 -14532
11726 -14532 -87476 -107991 -112674 -147583 -27932 54636 49019 -32820 -72817 -52081 57663 149292
11714 149292 84175 -95288 8687 46449 -40370 -36056 -10434 -23173 -15358 -52633 -36632
11703 -36632 -18414 -27789 -60413 9546 80352 101063 10373 -47587 7344 26948 21840 -40861
11691d0861p9820j7791r112R4469Q2636j13490k3784R1205n5872O5629J23047
11680A16256K755m9801o7646N44N9327N0994M4851n3504l9934o0852j3997L9365
11668B8358j12637k1599L0068M6904p8203k1032N4223J9440L8589K8767J3265
11657B6143k6262l5862n1797p8175l6720J15337K1137n348j9155q042O9589K1185
11645g970j7144L1441j554k634m7496o3400n5058l5631J16422L7580r6367j5383
11633a57194P6042m303Q13m9837p4269J24278K1481o0692j0091N8362j7932j14786
11621b08128k2768O6233Q2187M6520N6378k2694j20705p995R9793L6279R28O2740
11609F8768O3888o6825r7344m2081j270M5630j2337M7157P5292n9421n3302K0006
$$ plain form
11691 -40861 -120681 -138472 -147584 -53115 29521 -83969 -107753 -16548 -72420 -6791 116256
11680 116256 119011 69210 1564 2108 61435 112429 157280 103776 63842 2990 -11007 28358
11668 28358 -84279 -105878 -75810 -28906 -107109 -128141 -73918 -54478 -15889 12878 26143
11657 26143 -119 -35981 -87778 -165953 -202673 -87336 -66199 -71547 -90702 -98744 -29155 -7970
11645 -7970 -25114 6327 4773 2139 -45357 -108757 -163815 -199446 -83024 -45444 -141811 -157194
11633 -157194 -81152 -85455 -84642 -134479 -208748 -84470 -62989 -123681 -133772 -75410 -93342 -208128
11621 -208128 -230896 -164663 -82476 -35956 20422 -2272 -122977 -130972 -31179 5100 6028 68768
11609 68768 132656 65831 -31513 -73594 -74864 -29234 -41571 5586 80878 21457 -31845 -11839
11597a1839J6407K5002Q1656j2085j71771o9113K0788r583J493L5664l5519K2021
11585a06879N1787l0556n589K6205k7838l007J2588l239l8560L7566J2072J7336
11573e8114q1671n2365O3649P5607l432R998J04674k1356o9622m9527l4379p676
11561a24214N0237P4002N276o4764Q93J4345M186o5141N2757P2071K8171n6153
11549h334k8739J4694p1382m4993P3279K5443O7582N7051k8043j18324o6580k1523
11537a49869P8067Q2842J2870l9082m0615r210L8777O0559j1021M1184K3947N9422
11525A47871l941q5719n8405K6160J9331j7184l1881l1966k9590k0729n1211K4007
11513a13257Q7370o647m1916N4461R2978l321k6186q6633J6447j8003q8591j962
$$ plain form
11597 -11839 4568 29570 111226 99141 -72630 -141743 -120955 -130538 -129045 -93381 -128900 -106879
11585 -106879 -55092 -85648 -91237 -65032 -92870 -95877 -83289 -86528 -125088 -87522 -75450 -58114
11573 -58114 -139785 -192150 -128501 -52894 -56326 -46328 58346 36990 -32632 -82159 -116538 -124214
11561 -124214 -73977 25 5301 -59463 -58570 -44225 -40039 -105180 -52423 19648 47819 -8334
11549 -8334 -37073 -22379 -93761 -138754 -65475 -40032 27550 84601 56558 -61766 -128346 -149869
11537 -149869 -71802 11040 23910 -15172 -55787 -64997 -26220 34339 23318 64502 88449 147871
11525 147871 143930 58211 -194 25966 45297 28113 -3768 -35734 -65324 -86053 -137264 -113257
11513 -113257 -25887 -32534 -74450 -19989 72989 69668 43482 -43151 -26704 -44707 -133298 -135260
11501a35260J29055K3859J096N9100Q250k3852j7629O2469j8951j12332n9367
11490h3562L8673j9Q0927Q830o1838n771k8118r872M7498M2042j0101P996k1451
11477E234o6073L4416k5717m5037r525J4101k1048K911j4179J9720M3611P631
11465e3955K4171Q522q0902q9411M7471Q6874Q8018M8155m8955Q0401P4830l4478
11453A50741n3803r1697K2892J8386j29286m5942O0421J11111k4290J1619p1059
11442d0907k7295M9593N1420J25593o5777l8787j6452k4876J4154q719l1043L8018
11430B4922Q181j8456j20486M9598L7854o435L0961j8456K3037l0394r135k2550
11418e1359l3884L3691N1841L2291J4206l4398P5178j3142p8003J7262N0758J4085
$$ plain form
11501 -135260 -6205 17654 18750 77850 86100 62248 44619 107088 88137 -24195 -83562
11490 -83562 -44889 -44908 36019 44849 -16989 -22760 -50878 -60750 -13252 28790 18689 26685 5234
11477 5234 -60839 -26423 -52140 -97177 -106702 -92601 -113649 -110738 -124917 -105197 -61586 -53955
11465 -53955 -29784 -21262 -102164 -191575 -144104 -57230 30788 78943 29988 110389 185219 150741
11453 150741 96938 5241 28133 46519 -82767 -128709 -68288 42823 18533 30152 -40907
11442 -40907 -68202 -18609 32811 158404 92627 53840 37388 12512 26666 17947 -13096 24922
11430 24922 33103 14647 -105839 -56241 -18387 -24822 6139 -12317 10720 -19674 -28809 -51359
11418 -51359 -85243 -51552 289 32580 46786 12388 87566 74424 -3579 13683 64441 78526
11406G8526K4376k3507M575M1608M2765j7388r6115k5060K1933O3522k1621o5019
11394B8595l1876l0928P3306J3835m6435k484j4146M5170N4993k4238K3229M8582
11382A37603M3339L3149L641J9343n6126r6458Q4925j6184j7380p3700n2120N7502
11370F7534Q9001q0218k3223M5002q714m1777L5381M9159m2049L7283k0752K4284
11358A30911k0139L5416K17632Q0356l359q8144p9224n7881m1628n8913n7242
11347E7785j9096o740l1510l2579J831N517K5348L7377J9092n8056m328J72450
11335A67091J0247j6515j00839q4249j0499o7227r709M5699M8743N5932L2860
11324G1534p4555J0308l940P7319k5266k2990L7205N658P639o428K0966l7610
$$ plain form
11406 78526 102902 79395 83970 125578 168343 150955 54840 29780 51713 115235 93614 28595
11394 28595 -3281 -34209 39097 52932 6497 4013 -10133 35037 90030 65792 89021 137603
11382 137603 180942 214091 217732 237075 180949 84491 169416 153232 135852 62152 10032 67534
11370 67534 156535 76317 53094 98096 89382 47605 82986 132145 90096 127379 106627 130911
11358 130911 110772 146188 363820 444176 440817 352673 273449 215568 173940 115027 57785
11347 57785 38689 31949 439 -32140 -30309 -24792 556 37933 57025 -1031 -5359 167091
11335 167091 177338 160823 59984 -24265 -34764 -101991 -111700 -66001 -17258 38674 71534
11324 71534 -3021 7287 3347 80666 55400 32410 69615 75273 82912 76484 97450 59840
11312E9840q4248J2411J11991Q2854k8327k5087L4743m281n9742j22151l9454
11301f1451l877M5153R391Q9134K9495o9038P775N6647O1795P4745J37963k7551
11289C50181J9805l4462M6777l1916j02251j06877m6784k6019M2091J15657k0142
11278B06060p1434m651K4769n504L5697J1973p1158m2501m5103K8445L8754N8251
11266A63598N5455n064K1294N9103k805N878O3438j5707j47937p4118M4090n9171
11254A08054J2725o731J9476j7585K873P5843J89552J55479J07688P2700J3806
11243G33880N9639K0401n4314m4775j56385j66877p1019q681N5952J8105j29272
11232B56654j67748K74J2707L2641r1593j3941L5681J3782l1128n6387Q6450K988
$$ plain form
11312 59840 -24408 -11997 99994 182848 154521 129434 164177 159896 100154 -21997 -61451
11301 -61451 -65328 -20175 -10784 78350 107845 38807 46582 103229 165024 239769 377732 350181
11289 350181 369986 335524 382301 350385 248134 141257 94473 68454 110545 226202 206060
11278 206060 134626 129975 154744 149240 184937 196910 125752 83251 38148 66593 105347 163598
11266 163598 219053 213989 235283 294386 291581 297459 360897 345190 197253 123135 167225 108054
11254 108054 120779 114048 133524 115939 118812 194655 384207 539686 647374 720074 733880
11243 733880 793519 813920 759606 714831 558446 391569 320550 311869 367821 385926 256654
11232 256654 88906 89180 101887 134528 42935 28994 64675 78457 47329 -9058 77392 80380
11220H0380k6687p4066o2844j8102j6867K7463J10740j0634o7913Q4L7753r862
11208c0555m3504n0400N2193J52883P5879j0693M5956M6496L6870K4770N4458
11197C54353K1855J405j03679N8536l7390n0307k1594m7592r5401p203K3337j7553
11185G8767N6783L5010m9337J9592o0797J5899L4861l0522q4732n9703Q4788Q3861
11173A24470L7072j6920p4498j1799l499j7565l1885p6121l5078J5515M0722J6228
11161c3358J130J2559L1457O3476j00793K6890P539q410n7295n5958R1022j9032
11149d0773l940K3552R5252O3613j7932j5871O273M2351k269j4285l9307K2016
11137A18680j5607K6535M5217K099j9380P5751j3568n6312j3188M6732K8215j9051
$$ plain form
11220 80380 53693 -20373 -83217 -101319 -118186 -90723 20017 9383 -58530 -58446 -20693 -30555
11208 -30555 -74059 -124459 -72266 80617 156496 145803 191759 238255 275125 299895 354353
11197 354353 376208 377613 273934 332470 295080 244773 223179 175587 80186 72983 96320 78767
11185 78767 135550 170560 121223 140815 80018 95917 130778 100256 15524 -44179 40609 124470
11173 124470 161542 144622 70124 58325 54826 37261 5376 -70745 -105823 -90308 -49586 -33358
11161 -33358 -32228 -19669 11788 75264 -25529 1361 8900 490 -56805 -112763 -21741 -40773
11149 -40773 -44713 -21161 74091 137704 119772 103901 110174 152525 150256 135971 96664 118680
11137 118680 103073 129608 174825 176924 157544 233295 219727 163415 150227 196959 225174 206123
$$ [...]
##END NTUPLES=NMR SPECTRUM
##END=
