##TITLE=Analysis number 314067
Compound Code cc 13510
Book Reference 439/72/11
Project Code adrs
Chemist Name ronp
##JCAMPDX= 6.0         $$ Bruker NMR JCAMP-DX V2.0
##DATA TYPE= NMR SPECTRUM
##DATA CLASS= NTUPLES
##ORIGIN= Bruker BioSpin GmbH
##OWNER= NMR
$$ XWIN-NMR		Version 3.5
$$ Tue Oct  4 13:05:02 2005 GMT Daylight Time (UT+1h)  MAYBRIDGE\NMR@NMR_250MHZ
##.OBSERVE FREQUENCY= 250.131544655141
##.OBSERVE NUCLEUS= ^1H
##.ACQUISITION MODE= SIMULTANEOUS (DQD)
##.ACQUISITION SCHEME= undefined
##.AVERAGES= 16
##.DIGITISER RES= 18
##SPECTROMETER/DATA SYSTEM= dpx250
##.PULSE SEQUENCE= zg30
##.SOLVENT NAME= CDCl3
##.SHIFT REFERENCE= (INTERNAL, CDCl3, 0, 16.522)
##AUDIT TRAIL= $$ (NUMBER, WHEN, WHO, WHERE, WHAT)
$$ ##TITLE= Audit trail, XWIN-NMR		Version 3.5
$$ ##JCAMPDX= 5.01
$$ ##ORIGIN= Bruker BioSpin GmbH
$$ ##OWNER= NMR
$$ C:\u/data/dgb/nmr/ADRS/10420/pdata/1/auditp.txt
$$ ##AUDIT TRAIL=  $$ (NUMBER, WHEN, WHO, WHERE, WHAT)
(   1,<2005-10-04 13:04:43.65 +100>,<MAYBRIDGE\NMR>,<NMR_250MHZ>,
      <created by zg, POWCHK disabled, PULCHK disabled
       configuration hash MD5:
       62 19 C7 07 E1 42 D1 B7 37 6C 3D D0 77 39 F9 E6
       data hash MD5: 64K
       37 A0 25 FB 17 D8 96 C5 35 36 93 33 7E 89 87 16>)
(   2,<2005-10-04 13:04:54.35 +100>,<MAYBRIDGE\NMR>,<NMR_250MHZ>,
      <Start of raw data processing
       ef LB = 0.3 FT_mod = 6 PKNL = 1 SI = 32K 
       data hash MD5: 32K
       9C C8 50 8B 20 16 FE B3 19 FF D9 84 1E 5C 90 44>)
(   3,<2005-10-04 13:04:55.95 +100>,<MAYBRIDGE\NMR>,<NMR_250MHZ>,
      <apk 
       data hash MD5: 32K
       F6 5C 8E 5A D7 9D 52 9D 0A 2B E1 D5 D0 55 66 7F>)
(   4,<2005-10-04 13:04:56.65 +100>,<MAYBRIDGE\NMR>,<NMR_250MHZ>,
      <abs ABSG = 5 
       data hash MD5: 32K
       B0 4E 79 6F 0B 93 9C 00 0C 97 AE 0D 21 2A 71 11>)
$$ ##END=
$$ 
$$ hash MD5
$$ 04 CE D4 85 1E C2 19 F6 AE 18 93 B8 29 2F 0C A6
##$RELAX= 
##$RELAX= 
##$RELAX= 
##$RELAX= 
##$RELAX= 
##$RELAX= 
##$RELAX= 
$$ Bruker specific parameters
$$ --------------------------
##$DU= <C:\u>
##$EXPNO= 10420
##$NAME= <ADRS>
##$PROCNO= 1
##$TYPE= <nmr>
##$USER= <dgb>
##$AMP= (0..31)
100 100 100 100 100 100 100 100 100 100 100 100 100 100 100 100 100 100 
100 100 100 100 100 100 100 100 100 100 100 100 100 100 
##$AQSEQ= 0
##$AQ_mod= 3
##$AUNM= <au_zg>
##$AUTOPOS= <32 >
##$BF1= 250.13
##$BF2= 250.13
##$BF3= 250.13
##$BF4= 250.13
##$BF5= 500.13
##$BF6= 500.13
##$BF7= 500.13
##$BF8= 500.13
##$BYTORDA= 1
##$CFDGTYP= 0
##$CFRGTYP= 5
##$CHEMSTR= <none>
##$CNST= (0..31)
1 1 145 1 1 1 1 1 1 1 1 1 1 1 1 1 1 1 1 1 1 1 1 1 1 1 1 1 1 1 1 1 
##$CPDPRG= <>
##$CPDPRG1= <>
##$CPDPRG2= <>
##$CPDPRG3= <>
##$CPDPRG4= <mlev>
##$CPDPRG5= <mlev>
##$CPDPRG6= <mlev>
##$CPDPRG7= <mlev>
##$CPDPRG8= <mlev>
##$CPDPRGB= <>
##$CPDPRGT= <>
##$D= (0..31)
0 1 0 0 0 0 0 0 0 0.06 0 0 0 0 0 0 0.0002 0 0 0 0 0 0 0 0 0 0 0 0 0 0 
0 
##$DATE= 1128427482
##$DBL= (0..7)
120 120 120 120 120 120 120 120 
##$DBP= (0..7)
150 150 150 150 150 150 150 150 
##$DBP07= 0
##$DBPNAM0= <>
##$DBPNAM1= <>
$$ [...]
##$SUBNAM7= <"">
##$SUBNAM8= <"">
##$SUBNAM9= <"">
##$SW= 20.6930455092707
##$SWIBOX= (0..15)
0 0 3 0 0 0 0 0 0 0 0 0 0 0 0 0 
##$SW_h= 5175.983436853
##$TD= 65536
##$TD0= 1
##$TE= 296.16
##$TE2= 300
##$TE3= 300
##$TEG= 300
##$TL= (0..7)
0 120 120 120 120 120 120 120 
##$TP= (0..7)
150 150 150 150 150 150 150 150 
##$TP07= 0
##$TPNAME0= <>
##$TPNAME1= <>
##$TPNAME2= <>
##$TPNAME3= <>
##$TPNAME4= <>
##$TPNAME5= <>
##$TPNAME6= <>
##$TPNAME7= <>
##$TPOAL= (0..7)
0.5 0.5 0.5 0.5 0.5 0.5 0.5 0.5 
##$TPOFFS= (0..7)
0 0 0 0 0 0 0 0 
##$TUNHIN= 0
##$TUNHOUT= 0
##$TUNXOUT= 0
##$USERA1= <user>
##$USERA2= <user>
##$USERA3= <user>
##$USERA4= <user>
##$USERA5= <user>
##$V9= 5
##$VALIST= <valist>
##$VCLIST= <CCCCCCCCCCCCCCC>
##$VD= 0
##$VDLIST= <DDDDDDDDDDDDDDD>
##$VPLIST= <PPPPPPPPPPPPPPP>
##$VTLIST= <TTTTTTTTTTTTTTT>
##$WBST= 1024
##$WBSW= 4
##$XGAIN= (0..3)
0 0 0 0 
##$XL= 0
##$YL= 0
##$YMAX_a= 379072
##$YMIN_a= -428436
##$ZGOPTNS= <>
##$ZL1= 120
##$ZL2= 120
##$ZL3= 120
##$ZL4= 120
##$ABSF1= 16.522
##$ABSF2= -4.171173
##$ABSG= 5
##$ABSL= 3
##$ALPHA= 0
##$AQORDER= 0
##$ASSFAC= 0
##$ASSFACI= 0
##$ASSFACX= 0
##$ASSWID= 0
##$AUNMP= <proc_1d>
##$AZFE= 0.1
##$AZFW= 0.1
##$BCFW= 0
##$BC_mod= 0
##$BYTORDP= 0
##$COROFFS= 0
##$CY= 12.5
##$DATMOD= 1
##$DC= 0
##$DFILT= <>
##$DTYPP= 0
##$F1P= 14.0000005364418
##$F2P= -0.99999901652339
##$FCOR= 0.5
##$FTSIZE= 32768
##$FT_mod= 6
##$GAMMA= 0
##$GB= 0
##$INTBC= 1
##$INTSCL= 1
##$ISEN= 128
##$LB= 0.3
##$LEV0= 0
##$LPBIN= 0
##$MAXI= 10000
##$MC2= 0
##$MEAN= 0
##$ME_mod= 0
##$MI= 0
##$NCOEF= 0
##$NC_proc= -3
##$NLEV= 6
##$NOISF1= 0
##$NOISF2= 0
##$NSP= 0
##$NTH_PI= 0
##$NZP= 0
##$OFFSET= 16.522
##$PC= 1
##$PHC0= -61.46001
##$PHC1= 6.569883
##$PH_mod= 1
##$PKNL= yes
##$PPARMOD= 0
##$PSCAL= 4
##$PSIGN= 0
##$REVERSE= no
##$SF= 250.13
##$SI= 32768
##$SIGF1= 0
##$SIGF2= 0
##$SINO= 400
##$SIOLD= 32768
##$SREGLST= <1H.CDCl3>
##$SSB= 0
##$STSI= 32768
##$STSR= 0
##$SW_p= 5175.98343685301
##$SYMM= 0
##$S_DEV= 0
##$TDeff= 65536
##$TDoff= 0
##$TI= <Analysis number 999999
Compound Code 99
Book Reference 9
Project Code 9>
##$TILT= no
##$TM1= 0
##$TM2= 0
##$TOPLEV= 0
##$USERP1= <user>
##$USERP2= <user>
##$USERP3= <user>
##$USERP4= <user>
##$USERP5= <user>
##$WDW= 1
##$XDIM= 32768
##$YMAX_p= 554310855
##$YMIN_p= -331163
$$ End of Bruker specific parameters
$$ ---------------------------------
##NTUPLES= NMR SPECTRUM
##VAR_NAME=  FREQUENCY,     SPECTRUM/REAL,   SPECTRUM/IMAG
##SYMBOL=    X,             R,               I
##VAR_TYPE=  INDEPENDENT,   DEPENDENT,       DEPENDENT
##VAR_FORM=  AFFN,          ASDF,            ASDF
##VAR_DIM=   32768,         32768,           32768
##UNITS=     HZ,            ARBITRARY UNITS, ARBITRARY UNITS
##FACTOR=    0.157963299565203, 1,           1
##FIRST=     4132.6476996994, 0,             0
##LAST=      -1043.33573715361, 0,           0
##MIN=       -1043.33573715361, -331163,     0
##MAX=       4132.6476996994, 554310855,     0
$$ Real data points
##PAGE= N=1
##DATA TABLE= (X++(R..R)), XYDATA
$$ [...]
16945D091182J174599J802272K921595M835556P608970J0711125J3857540J3838954
16937F0841793J2024091P909701L57028m778331r831174j2192349j2085930j0662331
16929C1582498q653732o390965m419505k974856j991092j328976r48683p43922
16921D130767o02999m65442l78283l44705k95634j67544q9950l1898P833N3261
16911A815406Q7498Q0756N1686j0014n9369o6416r7854p3908m9827k633M8352
16900A723677Q4823J64717K05599K40498L00198L37429M18341N64208Q24452J335505
16890F199447K217472L647661N834849Q390952J1171527J1779289J0660850P972129
16882F7874176J481690k903865p624868j0274304j0492379r496627p857534n906092
$$ y = [4091182, 5265781, 7068053, 9989648, 14825204, 22434174, 33145299, 47002839, 60841793, 72865884, 80775585, 81132613, 76354282, 66523108, 54330759, 42244829, 31582498, 22928766, 16537801, 12118296, 9143440, 7152348, 5823372, 4874689, 4130767, 3527768, 3062326, 2684043, 2339338, 2043704, 1876160, 1786210, 1754312, 1762145, 1815406, 1902904, 1983660, 2035346, 2025332, 1965963, 1899547, 1801693, 1727785, 1677958, 1675325, 1723677, 1808500, 1973217, 2178816, 2419314, 2719512, 3056941, 3475282, 4039490, 4863942, 6199447, 8416919, 12064580, 17899429, 26290381, 37461908, 49241197, 59902047, 67874176, 69355866, 66452001, 58827133, 48552829, 38060450, 28563823, 20706289, 14800197]
16874A4800197m166948k812897j849572j277479r33214o67466n03059l97108k76199
16865A916255k20976j56746j47713j11674r9025o115N5013R5778J34317J47859
16855A606973J08179M1290o3243j33002j59001j79529j84484j57298q1011m0020
16845G58854j6059L570K0416l0887o2472l9611n2642q8558o5520n5995n1159k1324
16833B98613k7357l4027j0966j005j8076L370J2555l174j5280k2414p716k2701
16821A51822l434j4842j2631j1264L0117J1953J9937k1467K800J9265j4543k3582
16809A34131j7400l482j0759k5022J6295R450j0465J6780J0858j8258k8677j1024
16797F2427k6862j8265k2916K4853K7788O371l438l110J9132k591J1209j5645
$$ y = [14800197, 10633249, 7820352, 5970780, 4693301, 3760087, 3092621, 2589562, 2192454, 1916255, 1695279, 1538533, 1390820, 1279146, 1180121, 1174006, 1229019, 1324797, 1459114, 1606973, 1715152, 1756442, 1693199, 1560197, 1401196, 1221667, 1037183, 879885, 798874, 758854, 742795, 746365, 766781, 735894, 673422, 633811, 581169, 492611, 427091, 371096, 319937, 298613, 271256, 237229, 226263, 225258, 207182, 210552, 223107, 219933, 204653, 182239, 174523, 151822, 148388, 133546, 120915, 109651, 139768, 151721, 171658, 150191, 152991, 172256, 157713, 134131, 116731, 113249, 102490, 77468, 93763, 103213, 92748, 109528, 120386, 102128, 73451, 62427, 35565, 17300, -5616, 19237, 47025, 53396, 49958, 46848, 65980, 63389, 74598, 58953]
16785E8953L5817k800P285l601l5075m528k431k077R596J0091J1648j7589K1436
16772H6725o098n553j3598j7526J7118K6418l315j0106K1671J916q696k1691j9243
16759D8022J0849K0653p319J4957J5521L2378K1752j7609n992K0484k8626j6290
16747A08780J4844k4739J2779j4360m7859q221l5406l1246K769o936J6316p116
16735b0395j1496K5805J9936K2406k670j5612k3477l2775R178o418q466J3264
16723c0720J3422K1062J2096k949k72L825P622L7076q701k3128r138K4227J5932
16710F0354J4474k1618j6288L889N960r651j7281q646K8028J8503J239Q25R867
16697F9655J6035O903Q505m2636l2564J8604j5580j9976l1976j9317j3096Q519
$$ y = [58953, 94770, 91970, 99255, 95654, 60579, 56051, 53620, 51543, 61139, 71230, 82878, 65289, 86725, 80627, 75074, 61476, 43950, 61068, 87486, 84171, 74065, 95736, 97652, 88956, 67265, 48022, 58871, 79524, 72205, 87162, 102683, 135061, 156813, 139204, 133212, 153696, 125070, 108780, 123624, 98885, 111664, 97304, 49445, 41224, 5818, -25428, -22659, -29595, -13279, -20395, -31891, -6086, 13850, 36256, 33586, 17974, -5503, -38278, -29100, -35518, -43984, -30720, -17298, 3764, 15860, 12911, 12639, 16464, 24086, 61162, 52461, 29333, 20195, 44422, 60354, 74828, 53210, 36922, 40811, 46771, 37120, 19839, 11193, 39221, 57724, 58963, 59788, 69655, 85690, 92593, 101098, 58462, 25898, 44502, 28922, 8946, -23030, -42347, -55443, -46924]
16685d6924L0726L4096j0903L524L29j0807m742j7051n331M0184J3162l3346j0150
16672a7233K907K772k4603j9135j1436O818K0270J9268j2731K3661M0104J7628
16660D8290j8650j2350n935j6932k1282J550M970m810j2908J5612j82R946J8305
16647E624n166l76M107j927m819K497o873J9112J8028j2623j3784j8368l915j6169
16633c4652l143K4015K0528N711J2930k4805k2551p111J1996l287K987K1540K852
16620G010j6746R775Q662J326k9345l1534p93J9501k142L6414Q74R823K0360l0673
16606B512K5810j8383n821K6852r493p411j7569j3457J1632o077k6112K8197L245
16593f075M370L2182j132p162n388p007k3141j8353K3337j837Q42O735K4902q495
$$ y = [-46924, -16198, 17898, 6995, 10519, 10848, 41, -4701, -21752, -27083, 13101, 26263, -7083, -17233, -14326, -11554, -36157, -55292, -66728, -59910, -39640, -20372, -33103, -9442, 30662, 48290, 29640, 17290, 11355, -5577, -26859, -25309, -20339, -25149, -38057, -22445, -22627, -12681, 5624, 458, 82, 4189, 2262, -2557, -60, -6933, 12179, 30207, 17584, 3800, -14568, -18483, -34652, -37795, -13780, 6748, 12459, 25389, 584, -21967, -29078, -17082, -20369, -17382, 4158, 7010, -9736, 39, 8701, 10027, -19318, -50852, -51645, -32144, -34286, 2128, 3002, 12825, 33185, 2512, 28322, 9939, 4118, 30970, 21477, 14066, -3503, -16960, -5328, -11405, -37517, -9320, -6075, -1705, 30477, 29345, 22183, 16795, 9788, -13353, -31706, -8369, -10206, -9364, -2629, 22273, 13778]
16579A3778k8675k6479Q080L57k264J2469j9686j043j4810j636L986J3993o50
16566d2580m476Q276K9758m441N959P712k1135r082J8916J8176O861J0967P974
16553C2885m0739k5815p284R670M1170K1389r269J7555j0123q918j134l502L4867
16540E0752m100l0400Q910q265l9630q021J8357k8355J1805L9450K0718J3691
16528D4912j233q797k5351j0509m0377j6947L9196L5389J9798m51J2036k0307
16516B7359k890R103O61l3669l6414k661J9487J8898p57q409Q484L269j0795R741
16502A407k1316m55L388K0292K9139k3728k0186O928J3191k4099j1898j648J8409
16489a0576K6218k322r349Q467k0260j8326k3100M027J030K2923M0150q849r438
$$ y = [13778, -14897, -41376, -33296, -32939, -35203, -22734, -42420, -43463, -58273, -59909, -55923, -41930, -42580, -47056, -38780, -9022, -13463, -7504, 208, -20927, -30009, -11093, 7083, 13944, 24911, 32885, -7854, -33669, -40953, -31283, 9887, 31276, 22007, 39562, 29439, 20521, 19387, 15885, 50752, 46652, 16252, 25162, 16897, -22733, -30754, -12397, -40752, -28947, 10503, 31221, 44912, 43679, 34882, 9531, -978, -41355, -58302, -19106, 16283, 36081, 35630, 47666, 27359, 24469, 33572, 34233, 564, -35850, -38511, -19024, -126, -883, -9292, -808, 2461, -8334, 1407, -19909, -20364, -16976, 3316, 32455, 8727, -11459, -4531, 8660, -15439, -27337, -28985, -10576, 15642, 13320, 3971, 12438, -7822, -26148, -49248, -45221, -44191, -21268, 18882, 10033, 595]
16476E95k5500j149O130L2157L7845J5218l1534k4319K6518P036J3045k899k1067
16463C2076j7323o793l063k714J3070k3308O658K0437J4445r751l500J4323Q168
16450D2725O996J4156j2937l7648q961K7004J5205j5084j6529j3360K84l167L6298
16437C4982M1165M2756M4445L8584P7495O6427L8178J493l7629n0682n9533q5562
16425A52119m0281k2927q456j7546k8505l4543m728j9914r946K0382J1076N244
16413A975j1070p782o695j0248j1337k1356l899N0744j2429j9575P782p229P665
16400d3454K5918K7685n329k1480n568J1250k0041j7286m706j0301L5956O05J8140
16387h611J4008J6868K9718K9362L1757O3154M2728K3210M9022N0159J6255l1661
$$ y = [595, -24905, -26054, -19924, 12233, 50078, 65296, 33762, 9443, 35961, 42997, 56042, 53143, 32076, 14753, 7960, 4897, 2183, 15253, -8055, -1397, 19040, 33485, 23734, 20234, 34557, 42725, 49721, 63877, 50940, 13292, 4331, 31335, 46540, 31456, 14927, 1567, 1851, -1316, 34982, 76147, 118903, 163348, 201932, 279427, 345854, 384032, 385525, 347896, 297214, 237681, 152119, 111838, 88911, 80455, 62909, 34404, -139, -4867, -24781, -34727, -14345, -3269, 1975, -9095, -16877, -23572, -33820, -45157, -66513, -70412, -19668, -32097, -51672, -43890, -51119, -43454, -17536, 10149, 4820, -16660, -22228, -10978, -31019, -48305, -53011, -63312, -27356, -26751, -8611, 5397, 22265, 51983, 81345, 113102, 176256, 218984, 242194, 291216, 341375, 357630, 325969]
16375C25969o3932n3599m1593l4485k1576l2129l0005l8850l3069J6914N164j6651
16363a7842k3897L5630K3798K9338J337k1631r012K935N203q642r269J3357J629
16350B2934o323j4684J0002N028r639j899j4271p023J7542l1681k909q534K9736
16337a1721K9299j0048k4934K1012J8595k7247l2571k5174J7032K6727K2145O300
16325I415o020J2003k5597k0835J040R118m94N149L4180Q783j2457k339p028o340
16311a422J0150q286o095m834k0780J1556L5911M626j5622k183J6405m339j3763
16298A324K1376M039j6711m169L532j6523J9372l585k6860k7442J6044K9448q175
16285h330N873r221Q736M390N119r161k2734q780J2346M355K2780j2618P475J0541
$$ y = [325969, 262037, 208438, 166845, 132360, 110784, 78655, 48650, 9800, -23269, -6355, -1191, -17842, -41739, -6109, 17689, 47027, 48364, 26733, 17721, 20656, 25859, 17217, 7948, 21305, 22934, 16611, 1927, 11929, 16957, 7318, 5419, -8852, -15875, 1667, -30014, -32923, -41457, -11721, 17578, 7530, -17404, 3608, 22203, -5044, -37615, -62789, -45757, -19030, 3115, 9415, 3395, 15398, -10199, -31034, -29994, -20876, -21370, -16221, 17959, 26742, 14285, 11946, 4918, -1422, 8728, 442, -5653, -10487, -31267, -19711, 16200, 20826, 5204, 3021, 19426, 15087, 1324, 22700, 26739, 10028, 5859, 9391, -7132, 12240, 8655, -18205, -45647, -29603, -155, -8330, -2457, -11678, -2942, 1448, 6567, -2594, -25328, -34108, -21762, -17407, 5373, -7245, 230, 10771]
16271A0771j0854J5520J5476j5741j0683j0991J940j1016j7157N097j2926N790
16259c4774p453P099L3798l782N724j8474j9636L0457M7286J2667n3054n0473
16247e0615j5199J5432J1759J4381R4K9359k6806j1841J5254L1237J3924j9888
16235G091m1787q527J8089R193J881J2508r70j0636J458J5105j4972q898J0889
16222i576k9703j8334l1079k104M5624M2871P760K1580l8116l8018Q743Q282J6515
16209a5555R609L298N243M843j1634j6561l0158r61K9162K0853Q314K6442P852
16196D0747N99M53P132j1769k1127j2961j8577k0101K3094K0721j1797P113K6876
16183C0403K8548j3932j7969q795k7797R556K0461k0077j1725n803J5940o841
$$ y = [10771, -83, 15437, 30913, 15172, 4489, -6502, -4562, -15578, -32735, -27638, -40564, -34774, -42227, -35128, -1330, -5112, 612, -17862, -37498, -7041, 40245, 52912, -142, -50615, -65814, -50382, -38623, -24242, -24148, 5211, -21595, -33436, -18182, 13055, 26979, 7091, -34696, -43223, -25134, -15941, -14060, -1552, -2522, -13158, -11700, 3405, -11567, -20465, -9576, -39279, -57613, -88692, -90796, -45172, -2301, 5459, 27039, -11077, -49095, -40352, -32070, -15555, -5946, -2648, 2595, 7438, -4196, -20757, -50915, -51876, -22714, -1861, 6453, 32895, 40747, 41346, 41799, 48931, 37162, 16035, 3074, -15503, -35604, -12510, 8211, -3586, 3527, 30403, 58951, 45019, 27050, 18255, -9542, 14, 20475, 398, -11327, -17130, -1190, -8031]
16171h031k9782k651K0256J4006q317k3814K0419j2692j2934K1726M3007j654
16159A9539l120Q745k1126K396R563j7090j5112j1042j4785J2221o702K9878K3117
16146A6482j5562r56K461j2051j9125J8802K0271j3624P797K9656j6217p477k722
16133G735k946j0757J8309q92j3719p051k652q961M092K7377m449l2143j7036
16120d3093J1785j5440j0772L8335J339K650j1723q873K48l120o37R036k897J9280
16106a3882R718k5777o476K3497J1153l163L632M7239J3771l5533M789L095l6684
16093d621k7508j5571K6795j289o30r78J890p553K927M140J670Q732J9936J4507
16079B2447l5519l1694m240J7835L6020L432j8429j0193r124L0211O240j9953
$$ y = [-8031, -37813, -40464, -20208, -6202, -14519, -38333, -17914, -30606, -43540, -21814, 21193, 19539, 16419, 25164, 4038, 6434, 15997, -1093, -16205, -27247, -42032, -29811, -36513, -6635, 16482, 920, -36, 2425, -9626, -28751, -9949, 10322, -3302, 4495, 34151, 17934, 10457, 7735, 4789, -5968, 12341, 11449, -2270, -9321, -11973, -20934, -16842, 10535, 6086, -26057, -43093, -31308, -46748, -57520, -19185, -17846, -15196, -26919, -35792, -35544, -38664, -39301, -30265, -33162, -13882, -4164, -29941, -36417, -12920, -1767, -4930, -1298, 45941, 59712, 24179, 28968, 32063, -4621, -32129, -47700, -20905, -22194, -22824, -23802, -21912, -29465, -26538, -22398, -20728, -11996, 7940, 22447, -13072, -44766, -49006, -31171, 4849, 8281, -10148, -20341, -29465, 746, 6986, -12967]
16067a2967j3402J4012q668k2412J3617J8013J3901m2201j9336N874J5326M6913
16055H670R423n660k2902j1134K6833p557J99L660j3642m2081K9996K9085j2331
16042g441l4149M017J8691O012J626p255R369J2058J9915J545O850k5425J6580
16029B2393j4896k1850l3825J9159K8774r390J2770R016o960N236j2360J3774
16017A1841q633l3472J2534M4415J0019k9087l6897j8776p241K3236J7231j0143
16005b4973K3747J3173J0290N825j6556j4941j0468l1029N400K9257j4686j1072
15993c6033K4575N807n945j6098j0811K5338R884Q117o648J8004R686n505J7863
15980C8234j8076j8466l044l896q342r703K208j694L6728k7921k2500j1399o310
$$ y = [-12967, -26369, -12357, -21025, -43437, -29820, -11807, 2094, -40107, -59443, -53569, -38243, 8670, 18093, 12433, -10469, -21603, 5230, -2327, -2128, 1532, -12110, -54191, -24195, 4890, -7441, -41590, -37573, -18882, -12870, -11244, -18499, -9130, 2928, 22843, 24388, 31238, 5813, 22393, 7497, -14353, -48178, -29019, -245, -9635, 3135, 12151, 5191, 10427, -1933, 11841, 3208, -30264, -17730, 26685, 36704, 7617, -29280, -48056, -55297, -32061, -14830, -24973, -1226, 11947, 22237, 28062, 11506, -3435, -13903, -44932, -39532, -10275, -24961, -36033, -11458, -5651, -11596, -27694, -38505, -13167, -3283, 4834, -1814, 16190, 25876, 20371, 38234, 20158, 1692, -1352, -5248, -13590, -23293, -21085, -22779, 13949, -13972, -36472, -47871, -54181]
15967e4181M0662J1584j7604k932N708Q64J5284k21K6183K912k3126p631P325
15954D827J8231l672j7196k3756j233q716J7913J373j5356K7255K6675o660j0735
15941H950L466R826k0403M625p84j5376j0784j5510J9150Q958L812r151n330Q056
15927a0495J1466j0680k7353J4582j17J031J7628J2586k0822k0076J2171l589
15915b3668L122l216N663q761l123R535K0257k6835k5730J5867M7179j3212M211
15902A289K9081l8256k0204n326J0593J9406N74k9168j7984k411j3089J804K1852
15889d1839J322J756j972j399R249R622l2408o705J5886r879j5532O211Q48J9691
15875d5149J1851q471K4406K0201K042k110L614K0323P256m5944q397l476O054
$$ y = [-54181, -13519, -1935, -19539, -22471, -16763, -15899, -615, -836, 25347, 28259, 5133, -2498, 4827, 23058, 19386, 2190, -21566, -22799, -31515, -13602, -12229, -27585, -330, 26345, 19685, 8950, 12416, 22242, 1839, 6464, 5680, -9696, -20480, -35990, -16840, -7882, -4070, -13221, -18551, -10495, 971, -9709, -37062, -22480, -22597, -21566, -3938, 8648, -12174, -32250, -20079, -23668, -20546, -23762, -18099, -26860, -29983, -20448, -191, -27026, -52756, -36889, 10290, -2922, 1289, 30370, -7886, -28090, -33416, -22823, -3417, -2843, -32011, -49995, -52406, -65495, -63691, -41839, -40517, -38761, -40733, -42132, -32883, -23261, -55669, -62374, -46488, -56367, -71899, -65688, -64840, -45149, -33298, -41769, -17363, 2838, 4880, 2770, 6384, 26707, 33963, -11981, -20378, -23854, -17800]
15862a7800R019j936K4254L296J4118K38l1083l4208k1100k5118J0443L6641K2050
15849a1186L033j4294N657j990l787P234k8447l648P750K3046J3080j1856q542
15836b3950L539J2818J2391K1880J4121o597j4343p716p609J3116p258m0J491
15823A1843K6486k0516o663k683j7073J363J7714K52j0153j3495k0692k1400R915
15810d5102K4105Q471k503j0197j1232o647j0228M885J0168P33M044J1249J3661
15797h593J308J4816j4939J8001L164l1406J9008J971j5817J1244J3444J9119
15785C1320j0053p720j0590M202j813O530j5841k3768j9219L820L0406R328r961
15772a3359r43R467J0783k3551p998j0520Q742L8950k519j9283K1496M8322J3408
$$ y = [-17800, -8781, -10717, 13537, 16833, 30951, 31189, 106, -34102, -55202, -80320, -69877, -33236, -11186, -8153, -22447, -16790, -18780, -22567, -15333, -43780, -47428, -39678, -16632, -3552, -15408, -23950, -20411, -7593, 4798, 26678, 40799, 34202, 19859, 12143, 4534, 17650, 10392, 10352, 11843, 38329, 17813, 11150, 8467, -8606, -7243, 10471, 10723, 570, -12925, -33617, -55017, -45102, -20997, -12526, -15029, -25226, -36458, -43105, -53333, -48448, -38280, -37547, -33503, -22254, -8593, -7285, 7531, -7408, 10593, 13757, -17649, 1359, 3330, -12487, -1243, 12201, 31320, 21267, 13547, 2957, 7159, 5346, 11876, -3965, -27733, -46952, -43132, -12726, -3398, -13359, -14302, -4835, 5948, -17603, -25601, -36121, -27379, 11571, 9052, -10231, 11265, 59587, 72995]
15759G2995l7415j2161K9902q795l3287j5900l0018J3632K5825O364J3426J5950
15747D0518j4674q170q027j2591K094J0209j9300O71J9681J7757k912k8636k4956
15734b8336j3818J7780Q303j4951N310K0114L3642k2366k3651k7277J871n95k8828
15721g2802o799K8513J4223J4938K460O542N336J0827J4116k8792l0593j3479
15709e5510P26J5938L0596K0132O04k0259j4291o399k7223o138J5877O204N460
15696c4283j9387J464j1222m153J5016R679L1474J3630r400k2470j3328K3641
15684a9339K1599J1452j3k6058j9278k2750J623R235L5000J195N596j4101j9890
15671c5729m851L533L0095M4826j5526j0595J3426J36K893j4712n298J2975N231
$$ y = [72995, 35580, 23419, 53321, 44526, 11239, -4661, -34679, -21047, 4778, 11142, 24568, 40518, 25844, 17674, 9647, -2944, -850, 9359, -9941, -9270, 10411, 28168, 25256, -3380, -28336, -42154, -24374, -16071, -31022, -25712, -5598, 28044, 5678, -17973, -45250, -43379, -43974, -72802, -79601, -51088, -36865, -21927, -19467, -12925, -7589, 3238, 17354, -11438, -42031, -55510, -54784, -38846, -8250, 11882, 12486, -7773, -22064, -28463, -55686, -61824, -45947, -39743, -34283, -53670, -52206, -63428, -67581, -52565, -42886, -11412, 2218, -7182, -29652, -42980, -19339, 2260, 13712, 13699, -12359, -31637, -54387, -52764, -43529, -8529, -7334, -1738, -15839, -35729, -40580, -37047, -6952, 37874, 22348, 11753, 25179, 25315, 28208, 13496, 8198, 21173, 26404]
15658B6404k5893m379j39J497j6088J977l041M482J1730N070r299l692M450j7245
15644b4166l2826J5282M2430R84O841o716p346J2587J5008j2340j6824K138j0538
15631a5486J567J2538K6708p810j4279o968J4037k5228l849K8072j3908k004q19
15618g429L2905K5814J7138j7269l3784J5940P856j1240j1975n972j2665j1761
15606a2442J0146N413j2472o044O309J2482J3044j0424j8158J2089r180M54k0842
15593b9625j6091k374L4898K3075J3845r621k2725l4815L93J6246j750q896K4582
15580a2858L5501l0325l5925k7569L188K5672J0330L2223M27j8456l9695k5307
15568h2794j640L2142q80M5894J0972k901p88j8404q971j6689J4899r35m211K0268
$$ y = [26404, 511, -3868, -4007, -2510, -18598, -16621, -19662, -15180, -3450, 1620, -7679, -11371, -6921, -24166, -56992, -41710, 720, 1704, 8545, 1829, -5517, 7070, 22078, 9738, -7086, -4948, -15486, -13919, -1381, 25327, 17517, 3238, -3730, 10307, -14921, -18770, 9302, -4606, -6610, -7429, 25476, 51290, 68428, 51159, 17375, 33315, 41171, 29931, 17956, 11984, -681, -12442, -2296, 3117, -9355, -15399, -9090, 3392, 16436, 6012, -12146, -57, -9237, -8783, -29625, -45716, -48090, -13192, 9883, 23728, 14107, -8618, -43433, -43040, -26794, -28544, -37440, -12858, 22643, -7682, -43607, -71176, -67988, -42316, -31986, 237, 664, -17792, -57487, -82794, -84434, -52292, -53172, -7278, 3694, 793, 5, -18399, -27370, -44059, -29160, -30095, -34306, -14038]
15554a4038K5543l9813l1282p836K9527J9671p198K842j2988L35K5469L7562O081
15541C3875k2221k5912m614K5705l285R374R262N135K8127N865k1840J1000K3841
15528G4312j0623m6444n3480K911p53n951K9217R040o316k521k241K416K2102
15515A1669k9455L561J3211j6846N14J0459j7212j9194j7067J5237R136K0423
15503a5564L474O390M9681k278k4544k6616J6025J0507J879J827l0187j2960R118
15490a3248N761R558R462M841P515K340O437k913k8950r535J1550o45r966k3012
15476c0805L284J8398L8217J1285j3429l8734q848L0355P935k7342k504L2021
15464A9833K1734k0318k3693Q762k672l3555P503k8106Q083L6352Q723R344r679
$$ y = [-14038, 11505, -28308, -59590, -67426, -37899, -18228, -25426, -22584, -35572, -35237, -9768, 27794, 33875, 11654, -14258, -18872, 6833, 3548, 12922, 22184, 27319, 55446, 61311, 39471, 50471, 74312, 63689, 17245, -36235, -33324, -34077, -40028, -10811, -1771, -8087, -10608, -12849, -10433, 11669, -17786, -14225, -1014, -17860, -17346, -6887, -24099, -43293, -60360, -45123, -35987, -15564, -12090, -5700, 43981, 41703, 17159, -9457, 6568, 17075, 18954, 20781, -9406, -22366, -13248, -7487, 2071, 11533, 16374, 23889, 26229, 32666, 29753, 803, -8732, 2818, 2173, -7793, -30805, -27521, -9123, 29094, 40379, 26950, -11784, -20632, 9723, 17658, -9684, -12188, 19833, 41567, 21249, -2444, 6318, 3646, -29909, -22406, -50512, -42429, -6077, 2646, 11990, 2311]
15451B311m63j0575k1387j8829J274M642m034J490J2814M948J0293k1083m13M968
15437c4044L196K7296k641k3539j3369P330J0004K734J0714J8882K5317l64q787
15424B2729P88m777p557J1006K824Q654J0456l6679k5522L644K0244J4552j1378
15411H984j9658l3417j4291J8779J6965p217k6627k0458L9691O672l685K3613
15399a0649Q503K0817J8053m239k5239m165K6660q330m5312n560J3035N103o188
15386a7511P452r762k0980K825K398K3281L6742Q737l4885j537O267J140j7807
15373a3640q044j3565L107K45J7107L4225L1507O981k0480k2965k6719R601k504
15360e144M245Q372K723J543J4435N257j3502k6791k1153K6129j072j8465k0048
$$ y = [2311, 1848, -8727, -30114, -48943, -47669, -43027, -47061, -45571, -32757, -27809, -17516, -38599, -39012, -34044, -30848, -3552, -6193, -29732, -43101, -35771, -25767, -23033, -12319, 6563, 31880, 31516, 22729, 23517, 18740, 11183, 22189, 25013, 33667, 44123, 7444, -18078, -14434, 5810, 20362, 8984, -10674, -44091, -58382, -39603, -22638, -29855, -56482, -76940, -37249, -30577, -34262, -10649, -2146, 18671, 36724, 32485, 7246, 3081, 29741, 21411, -23901, -29461, -16426, -11323, -17511, -10059, -19821, -40801, -37976, -35578, -12297, 24445, 33182, -1703, -3240, 3027, 4167, -13640, -21684, -35249, -32142, -31897, -14790, 19435, 50942, 57923, 37443, 14478, -12241, -2640, -5144, -899, 7473, 10196, 11739, 26174, 31431, 17929, -8862, -30015, -3886, -4958, -23423, -43471]
15347d3471K0050J2372l7783J505P583K5234O311J9144N96Q93K0878k563n643
15334B5106k4612N393L113n6L3114K3322l8793k9177o530J0210j7324k5039m532
15321d5805q734L648J9571J5546j1710J911N962K2365J8594k136K946J1396P487
15308D1041M308m574k6604K7152L433k7390l3978k5626k807J9564J8485j3777
15296b0773j0843j1489m015K5603q08K5888k791k4366m763k4709L217J8301K6429
15283e119m936j3123j901J4979j3837j3841j931J1252K2258Q154j2927j8738Q930
15270b0780j2161J1539J7738o735j9448J6755K2563k1179j2531j539j4133j6506
15258e6417J677K9755Q836P544O087j3364J6340J5875k3639m2435k8630N3324
$$ y = [-43471, -23421, -11049, -48832, -47327, -39744, -14510, -8199, 10945, 11541, 12434, 33312, 30749, 25106, 494, 5887, 9000, 8944, 42058, 65380, 26587, -2590, -9120, 1090, -16234, -41273, -45805, -54539, -50891, -31320, -15774, -27484, -25573, -19611, 2754, 21348, 19212, 22158, 33554, 41041, 45349, 40775, 14171, 41323, 44756, 17366, -16612, -42238, -45045, -25481, -6996, -20773, -31616, -43105, -47120, -21517, -22325, 3563, 772, -23594, -28357, -53066, -49849, -31548, -5119, -10055, -23178, -25079, -10100, -23937, -37778, -39709, -28457, -6199, 1955, -10972, -29710, -20780, -32941, -21402, -3664, -10399, -29847, -13092, 9471, -11708, -24239, -25778, -39911, -56417, -54740, -24985, -16149, -8605, -2518, -15882, 458, 16333, -7306, -49741, -78371, -25047]
15246b5047J8001j0598J2137K993J4842k5448l933J6503K0294k058q616J8485
15234B7555j662k4280l736J8175N550r092k64L451O411l4361k1894M566P479o286
15220b8388r046L5267J9898q595k6428l0469M943J0711J5155J0439n722j2938
15208b5173p960Q10r851j4079K3944J3834k1144K0722K5251Q710m790j009l331
15195E934J975j1501l265k5788l835K9037P585j5626j1632k1726J7819J3493k3496
15182d1026k3388j3471K4369J6544m426k6067K4377K5754J8616K624k7078k5911
15170d9083J8141n878j234Q321M247J606k0770L3911K8456j0331m5721P55J9058
15157a8522L9847m4k9247p603L4173Q533k7904p809n891n190j571n982M9870K0226
$$ y = [-25047, -7046, -17644, -5507, -2514, 12328, -13120, -17053, -550, 19744, 17686, 9070, 27555, 25893, 1613, -2123, 16052, 21602, 12510, 12246, 15697, 22108, -12253, -34147, -29581, -22102, -28388, -37434, -2167, 17731, 9136, -17292, -47761, -42818, -32107, -16952, -6513, -12235, -25173, -33133, -32323, -42174, -56253, -32309, -18475, -39619, -18897, 6354, 15064, 10274, 9265, 5934, 7909, -3592, -6857, -32645, -36480, -7443, 142, -15484, -27116, -48842, -31023, -17530, -41026, -64414, -77885, -53516, -36972, -41398, -67465, -43088, -17334, 1282, 3906, -23172, -49083, -30942, -36820, -38054, -29733, -25486, -23880, -44650, -10739, 17717, 7386, -38335, -37580, -18522, 21325, 21281, -7966, -15569, 18604, 27137, -767, -8576, -14467, -19657, -21228, -27210, 22660, 42886]
15143D2886m2051l5860j4200j2642J2656J4724M287q242J0304k5205J4005R374
15131b9964r233q586j3379j4365K6054K5132K0114O166J3146M637j6592K225M765
15118A0120p565k3895j4518M9429L3663k6201j6549J2039o16P603k3242k3787
15106b3519j1915M577n372J0057K8452J0541K3975k098k1115l1642J357M851p505
15093a9356j8109r069Q138q201K6386N2972K48k3730l894Q816k7307m811K634
15080a5283J4651M336O889R602q989L4856J5089j7592l3375k2792j0737j0841
15068c4186P62K2129L6925k008j1472O873q312K77p236J572L654j2133j1408j5441
15054c0004K5927j6866j1881k786N008n765j0591O078L3215K6340j1517m3293
$$ y = [42886, 835, -35025, -49225, -61867, -49211, -34487, -30200, -38442, -28138, -53343, -39338, -29964, -39197, -47783, -61162, -75527, -49473, -24341, -4227, 1939, 15085, 19722, 3130, 5355, 10120, 2555, -21340, -35858, 13571, 47234, 21033, 4484, 16523, 15907, 23510, 268, -23519, -35434, -30857, -36229, -26172, 2280, 12821, 36796, 34698, 13583, -18059, -16702, -11851, -19356, -37465, -46534, -38396, -46597, -20211, 32761, 33009, 9279, 5385, 14201, -13106, -17917, -15283, -632, 3704, 10593, 20195, 11206, 46062, 61151, 43559, 10184, -12608, -23345, -34186, -33424, -11295, 25630, 23622, 12150, 19023, 10711, 10988, 3752, 5324, 8978, -3155, -14563, -30004, -4077, -20943, -32824, -35610, -30602, -36367, -46958, -40880, -7665, 18675, 7158, -36135]
15042c6135l4838K850J8111P047L363L7516K1041P454k7448k8297r169p080J4016
15029c1569k6824Q371J6789j3021k9609K711N6509L1724k1733q625j4314J7614
15017a1977M1995Q510j6586j2736j2354l0278j8570L1782L2950j9457k1090r402
15005c7213K8583j5929k6583J6410L8540J9968j4665J5129p054k6273j478k3210
14993c3775R634K730J7248J5962J4469q959O583l1146k239K1386K4754K2367j0907
14980D8107j6866K770k1080l3456n680k8381l757K4109K6199K9706J6094L4996
14968G2761J406j2185J7976r775k2018q314P689l4526j8141l6020k1331L5222
14956b7256L5963j4389J8251J8175l0299N69j8570K5273L3885J831j4443J2431
$$ y = [-36135, -70973, -68123, -50012, -42965, -39602, -2086, 18955, 26409, -1039, -29336, -38505, -45585, -31569, -58393, -50022, -33233, -46254, -75863, -73152, -16643, 15081, -6652, -15277, -29591, -11977, 30018, 38528, 21942, 9206, -3148, -33426, -51996, -20214, 12736, -6721, -27811, -37213, -8630, -24559, -51142, -34732, 3808, 23776, 9111, 24240, 17186, -9087, -10565, -33775, -24141, -21411, -4163, 11799, 26268, 17309, 23892, -7254, -9493, 11893, 36647, 59014, 48107, 31241, 34011, 12931, -20525, -26205, -54586, -58343, -34234, -8035, 21671, 37765, 72761, 74167, 61982, 79958, 70183, 48165, 39851, 47540, 13014, -5127, -41147, -62478, -27256, 8707, -5682, 12569, 30744, 445, 1014, -17556, 7717, 41602, 43433, 28990, 41421]
14944D1421K121k0137J8449R885l6948l7710K9476K0421j1194j0497l531K1859
14932B3615k9073J440M4602j0071j4000k1772J5196K2859m047N582j9949j9086
14920d704k7945J1448L0899O260r727k5651m312j4124L2671K2816J069L4886j4281
14907C9305o495J4865k1756M708J1806r579j1001K9903o445j5588o067k6801k5680
14894b8825n3p651l8229j7551L0760M6671p184l0702L4072J9510j4778P146K015
14881d799K0716Q419K5102j3079n47J0083J1508k2519l2060k0948r476K371r729
14868c4958r996K9755J7335k7193k2050J0698K1866n984j3535J9485M997j3876
14856b3456K6456J2991K7449k0322j1082L2627R639j1790r482m2856j9911l926
$$ y = [41421, 43542, 23405, 41854, 51739, 14791, -22919, 6557, 26978, 15784, 5287, 1756, 23615, -5458, -4018, 40584, 30513, 16513, -5259, 9937, 32796, 28749, 34331, 14382, -4704, -32649, -21201, 9698, 15958, 6231, -19420, -23732, -37856, -5185, 17631, 18700, 53586, 39305, 32810, 47675, 25919, 30627, 42433, 32854, 21853, 51756, 45311, 29723, 23656, -3145, -28825, -28878, -36529, -74758, -92309, -61549, -14878, -22062, -52764, -18692, 818, -13960, -6814, -4799, 15917, 24336, 49438, 36359, 35812, 45895, 57403, 34884, 2824, -18124, -27600, -25229, -34958, -44954, -15199, 2136, -25057, -47107, -36409, -14543, -20527, -34062, -14577, -9580, -23456, 3000, 15991, 43440, 23118, 12036, 44663, 54302, 42512, 33030, -9826, -29737, -33663]
14844c3663O102K1526M360J3061o894k0353j3466n367N71o126J9707K5001j6439
14831a1980j5614j6912J2172K8490R714k4244j069K9966J298j108N218l1047J9031
14818C915J3219k9070k579j2861J7136K5232J3951j6243k2092O883M8551L0200
14806G6242l1876k3411J0450k258k2347J281p76N829J2062j4320r293m023j0998
14793a3438k352Q049M4993j3722m6036l2394q949J0158L4663J2696j2241m4035
14781f2608j471K9283p81j0636K0022O73o275O206l244j6592Q296M1655o565J0592
14767H555L4895o27k0414j8086J2064M535m441j5390r634k5980J5268M2952j2785
14754A0912j8999j8379j9568m268Q602j996o618L744K1857J739O082J2685j899
$$ y = [-33663, -27561, -6035, -1675, 11386, 4492, -15861, -29327, -34694, -34123, -40249, -20542, 4459, -11980, -27594, -44506, -32334, -3844, 5870, -18374, -19443, 10523, 11821, 10713, 15931, -15116, 3915, 17134, -11936, -14515, -27376, -10240, 14992, 28943, 12700, -9392, -2509, 46042, 76242, 44366, 20955, 31405, 29147, 6800, 8081, 7305, 13134, 25196, 10876, 1583, -2440, -13438, -15790, -7741, 37252, 23530, -22506, -54900, -63849, -53691, -19028, -6332, -18573, -62608, -64079, -34796, -35577, -46213, -26191, -25518, -31793, -25587, -28831, -45423, -37127, 4528, -2037, 8555, 43450, 42823, 22409, 4323, 16387, 20922, 16481, 1091, -8543, -34523, -19255, 23697, 10912, -8087, -26466, -46034, -50302, -41700, -43696, -50314, -46570, -24713, -22974, -16892, -4207, -6106]
14741f106k6592l1074j1435K7458L7530J3085L6464l006j1918L698J1524q44p080
14728C1704k4799k8059K0453M0328Q409M495p356r505j0569j7392j13k0208n595
14715a8207j0541k866J8016K835P058j501r679O545Q224j6069M233L0037m578
14702A3507o4096J3366J5762M755P589K167J0211J1275m907j4042N0516K4647
14690G0750k4679l868o911j279P159O01J81m2060l5551j7491L4403J2891r452
14677a5306K1020k3294k9653j7266J3839N759K9366M7805j0445j9908p338K4837
14665A9416L9844J5660J6814j9437J1327j0494l6312j4997Q484j282m139J4856
14653C9740j6900j6598j9828P246j2119J8355L6326j4385j9443j4246l1709l031
$$ y = [-6106, -32698, -63772, -75207, -47749, -10219, 2866, 39330, 36324, 24406, 28104, 39628, 38784, 31704, 6905, -21154, -701, 39627, 48036, 52531, 45175, 35670, 25101, 7709, 7596, -12612, -18207, -28748, -31614, -13598, -10763, -3705, -5206, -14885, -8340, -116, -16185, -11952, 18085, 13507, -50589, -37223, -21461, -16706, -9117, -6950, 3261, 14536, 9629, -4413, 46103, 70750, 46071, 42203, 35292, 34013, 41172, 41773, 41954, -106, -35657, -53148, -18745, -5854, -15306, 5714, -17580, -47233, -64499, -50660, -44901, -15535, 32270, 21825, 1917, -5421, 19416, 59260, 74920, 91734, 72297, 83624, 73130, 36818, 21821, 30305, 29023, 24884, 39740, 22840, 6242, -13586, -6340, -18459, -104, 36222, 21837, 2394, -11852, -43561, -46592]
14641d6592K2793J8160Q0p171J5401J6663L367k2760M9068q007k5740K627r570
14628H319m699j8203R438L3143M593o536k4559J284l090K2929l875p006O696J5295
14614C3729p098o800m639K3218K5425j0542l6852m0431k06J0315J208l168n731
14601b1572J4224J2243Q262j9242n534p056j9836o551k2612L6486K4862K7076
14589B0750J2919j4933j2755j4362M747J6836n461K1252l8353J3904K504n061
14577A987O361K4876k0081j3157n140j5861q010J9895J0148j2789j970j3264J4601
14564a2404J0298k4693J1860M476J3863j7296Jp556j174J4165k672l588j6564
14551c1284K0448K5353O66R574K2282k0350n9401j2583J1298N917R240J3087J6145
$$ y = [-46592, -23799, -5639, -5559, -12730, 2671, 19334, 22701, -59, 49009, 41002, 15262, 17889, 8319, 3620, -14583, -5145, 27998, 32591, 26055, 1496, 2780, -310, 22619, 18744, 11738, 18434, 33729, 26631, 19831, 15192, 38410, 63835, 53293, 16441, -23990, -24196, -13881, -12673, -15841, -21572, -7348, 4895, 13157, -6085, -11619, -18675, -38511, -45062, -67674, -31188, -6326, 20750, 33669, 18736, 5981, -8381, -3634, 13202, 7741, 28993, -9360, 4544, 7048, 1987, 8348, 33224, 13143, -14, -5154, -21015, -29025, -9130, 1018, -11771, -13741, -27005, -12404, -2106, -26799, -14939, -10463, 3400, -13896, -13895, -21451, -22625, -8460, -11132, -14720, -31284, -10836, 14517, 15183, 24757, 47039, 26689, -32712, -45295, -33997, -28080, -18840, -5753, 10392]
14538A0392K4630K4288o39K7159K653k4962l9198k763O799k3496Q111M301l2581
14525a5306p872J5266N047r868K8470j3173j838L119p722l068J2855M154J1775
14512B1839k2595J0164R617K208o727k1500K2124Q187k1948j4422L623j0825M520
14499a5735k4264P704L4803L4522k6113l6527j1940n984J5182K6670J8089l297
14487A3110J4468p725m537j5642J1033j7133K4065K7537J3695l40m452l0194j0602
14474A3283M2924j0190k372K6979O09j5115J250j7880j8317p607J5163j1629O344
14461B3442L490l958N581r476n0746j5335J8104N624M8971J8077M386J1688m181
14448E5667j6734j1734n6325j6216K0464O884O346k0404J257q140L554J9359j3689
$$ y = [10392, 35022, 59310, 58671, 85830, 88483, 63521, 24323, 21560, 28359, 4863, 12974, 17275, -15306, -23178, -7912, -2865, -12733, 15737, 2564, 726, 3845, -3877, -6945, 5910, 10064, 21839, -756, 9408, 19025, 21233, 14506, -6994, 15130, 23317, 1369, -13053, -9430, -20255, -15735, -39999, -32295, 2508, 37030, 10917, -25610, -37550, -43534, -28352, -1682, 16407, 13110, 27578, 19853, 15316, -326, 10707, -6426, 17639, 45176, 58871, 58531, 54079, 23885, 13283, 56207, 46017, 43645, 70624, 71233, 56118, 57368, 39488, 21171, 13564, 28727, 17098, 23442, 26932, 22974, 28555, 19079, -31667, -47002, -28898, -23274, 25697, 43774, 48160, 59848, 55667, 38933, 27199, -29126, -45342, -24878, -17994, -11648, -32052, -30795, -38935, -35381, -16022, -29711]
14435b9711k09P554J3330O372J5405K0240j828m1386q60M9300l792k5021K286
14422A1680j4858j4973k5553l3142J0375K1418J4217j1729L6L2950J789L765k5633
14409b9658Q64O682L876L117K3491k646J3952K3337k1848j2258K4155M351k0317
14396A7098k2910j5168j1818k3684p18R73J8039L700J6917R647K7084L4064k7672
14383B5552k7835l4704l1834J3300L2017J980P45j1388j4498L5855p606j2178
14371c0594L0271n816k9981J4483K4977K0139Q396K207J7093Q531j0200k5259
14359B4247o338j6713M928Q318k0997l7695q885K9262k93L152K7116m144j7966
14346a6008q110k4714L602K99n152Q958J2145J3339K0521M33Q664J0931J3787
$$ y = [-29711, -29920, -22366, -9036, -2664, 12741, 32981, 31153, -10233, -11093, 38207, 34415, 9394, 11680, -3178, -18151, -43704, -76846, -66471, -45053, -30836, -42565, -42529, -9579, -7790, -4025, -29658, -28794, -22112, -18236, -15119, 8372, 5726, 19678, 43015, 21167, 8909, 33064, 37415, 17098, -5812, -20980, -32798, -56482, -57200, -56227, -38188, -34488, -17571, -7924, 19160, 53224, 25552, -2283, -36987, -68821, -55521, -23504, -21524, -20779, -32167, -46665, -10810, -18416, -30594, -323, -6139, -36120, -21637, 3340, 23479, 31875, 34082, 51175, 59706, 49506, 24247, 17909, 1196, 6124, 14442, -6555, -44250, -53135, -23873, -24166, -21014, 6102, 1958, -16008, -24118, -48832, -45230, -44931, -50083, -41125, -28980, -15641, 4880, 5313, 13977, 24908, 38695]
14333C8695o250k1417j1883L3199P289k0691J2938p710j6517K2202j4494k6756
14321a1395J05K8246p199k2127J8857N955O062q317l1219n655K3527n653j9051
14308b7864K3464J2417k6288M230J2604K9087n094l76R069r075l6432q492K747
14295b0003k2015J6915J5507K193k0158K3083J3944j8767j1979M626L519J641
14283a1494N636M738j8826q04O901k263J7040J3028l4541l276J5607k6192J2249
14270b2197M1510J2102p806Q558O024j0624n053o592K779J2711j1089j5019j2604
14257g300m271N105n58j7874j8827K0006K7794J407o843l873K8697Q179l2928
14244a286m4576J1673J1489L6186j9535k7424Q905J5470K6301L0213j6519k8407
$$ y = [38695, 32445, 11028, -855, 32344, 39633, 18942, 31880, 24170, 7653, 29855, 15361, -11395, -11290, 16956, 9757, -12370, 6487, 12442, 18504, 10187, -21032, -26687, -3160, -8813, -27864, -4400, 8017, -18271, -14041, -1437, 27650, 22556, 22180, 31249, 22174, -14258, -22750, -20003, -42018, -25103, -9596, -7403, -27561, -4478, 9466, -9301, -21280, -16654, -13135, -11494, -5858, -1120, -19946, -20750, -13849, -16112, 928, 13956, -20585, -23861, -8254, -34446, -22197, 19313, 31415, 23609, 32167, 38191, 27567, 22514, 15922, 18701, 31412, 20323, 5304, -7300, -11571, -6466, -7024, -24898, -43725, -23719, 4075, 5482, -1361, -5234, 23463, 31642, -1286, -45862, -34189, -22700, 13486, -6049, -33473, -24568, -9098, 17203, 47416, 30897, 2490]
14232B490l4674l4052k2901L4479K8778o21j3586n4J8744N006M695j2116n492
14219b9304K3004J6256p874j9000m53M1304P96m2130q490M33O191J6340Q991R480
14205A5544k499L756J5490o516k1944j5814K719j905N669k5994r545k061j1977
14192e5077l021J8263K6596N820k0715p863J5496K2195J4358n251p441J1767O486
14179B1613J3621Q43k7930q496Q406J3411o380J7528J1115k372k8150M855k0911
14166b847Q592m577j4153J2141p896n60j5885Q602J620J2639L5692J4536k1221
14153B6683o140l755J911K1899q489j7970r099Q308o489l215o293k4453l621K7413
14139c310p711K6786n323J001J7092J1542m6384j8336P80R504L5693J8288J253
$$ y = [2490, -32184, -66236, -89137, -54658, -25880, -26501, -40087, -40141, -21397, -16391, -11696, -23812, -29304, -6300, 9956, 2082, -16918, -17371, 23933, 24729, -17401, -25891, -25458, -19267, -2927, 6064, 15544, 13045, 16801, 32291, 25775, 3831, -11983, -9264, -11169, -5500, -31494, -41039, -43100, -55077, -58098, -39835, -13239, -7419, -28134, -35997, -20501, 1694, 16052, 10801, 3360, 15127, 21613, 35234, 36077, 8147, -349, 8057, 21468, 15088, 32616, 43731, 41359, 13209, 18064, -2847, 5745, 1168, -12985, -844, -8740, -9300, -25185, -16583, -14963, -2324, 33368, 47904, 26683, 20543, 16788, 18699, 40598, 32109, 14139, 5040, 13348, 6859, 3644, -2649, -27102, -30723, -3310, -11021, 15765, 10442, 11443, 28535, 40077, -6307, -24643, -23863, -14359, 21334, 39622, 40875]
14126D0875l2637l1965p90L872J6777q375O440n101J5359O838J8455j3149j5468
14113A131j3927j822J7159l732l4453p219L917K978L6408O279J247j3218j9274
14100b4526P270J8001l076n425K575K0102k62J4515J1543j9175j3011j1688j9902
14087b3059L97J7566P045K15j868J8158M317m704O771q349j5428M765O906n699
14073G033K169O048K754j5508k0767K6220R172L125j5491k51J8848j5674J1979
14060A9657k207k1277k2183K312J3326M107Q714K952K7916J3650l4561j5794L5686
14047C2298k9889k2460K2228K557p86k503J5367N83m145l2756j8258l4615j1231
14034h3610L666K7642L2312m671M193J3295J5233J5026P919k1630J8685k0115
$$ y = [40875, 8238, -23727, -24517, -20645, -3868, -12243, -5803, -10904, 4455, 11293, 29748, 16599, 1131, -12796, -14618, 2541, -1191, -35644, -42863, -38946, -35968, 440, 6719, 7966, -5252, -24526, -17256, 745, -2331, -7756, -5181, 14921, 14659, 29174, 40717, 21542, 8531, -3157, -23059, -22662, -5096, 1949, 2164, 296, 18454, 22771, 18067, 24838, 16489, 1061, 5826, 12732, 7033, 9202, 15250, 18004, 2496, -18271, 7949, 17121, 20246, 4755, 4504, 23352, 7678, 19657, 17450, -3827, -26010, -23698, -10372, -6265, 2449, 5401, 33317, 46967, 12406, -3388, 32298, 2409, -20051, 2177, 4734, 3948, 1445, 16812, 17395, 13250, -19506, -37764, -72379, -83610, -79944, -52302, -19990, -24661, -20468, -7173, 8060, 23086, 31005, 9375, 28060, 7945]
14022G945l5379J2731L260R005K8550j0307k8449j8022M739K1931P411j7775j4461
14009b8821l999j2866K6981J0667j5032p495J4718N571L800p292l2355K9465K0777
13996D119O473P619j6194j3310j953J4754l659k191m744j788O149j4012K2935
13983D198j0088l5436p097L5018j5455m224K5596j6104N572n250N180J7892O021
13970E823m642Q847J804J861j2714J6323K1036o465O036J3484j6091o7657k8196
13957f0551N381l450J6532K3803L3848R357J184j1849K071m0287l0506K8253K5978
13944b36L7498R714l7061j4499P460L8312p822j9947K8933j0341j8078Q166L710
13931B5809J270o506j9051j2887k2768N06J4084N051J2747l4365m895j0995M400
$$ y = [7945, -27434, -14703, -11443, -2438, 26112, 15805, -12644, -30666, -25927, -3996, 3415, -14360, -28821, -32820, -45686, -18705, -8038, -23070, -30565, -15847, -10276, -6476, -13768, -46123, -16658, 4119, 10592, 18211, 2017, -11293, -13246, 1508, -2151, -4342, -9086, -10874, -4725, -18737, 4198, -5890, -41326, -48423, -13405, -28860, -33084, -7488, -23592, -18020, -23270, -18090, -198, 5823, 1181, 10028, 11832, 13693, 979, 17302, 38338, 31873, 37909, 51393, 35302, -32355, -60551, -55170, -58620, -42088, -18285, 15563, 24920, 26104, 14255, 16326, -23961, -54467, -26214, -236, 37262, 46976, 9915, -4584, 2876, 41188, 33366, 13419, 42352, 32011, 13933, 22099, 25809, 27079, 20573, 1522, -11365, -34133, -33627, -19543, -14492, -1745, -36110, -41005, -52000, -47600]
13918d7600N4382R330J0077K9474n737l7359N878p504k1509K812j6549R526K5210
13905A0431J4768j6569J258K733J2095J6661k175j7089j5522J2625J1076j3194
13893A7098j084L130K5125L03q669L224J465n556J0292J0970o065J7020M1298
13880A08551N1101O7005P6521R9359K7748k9199n5849m5360k2335p4015o1383
13869A42144o83j0344j3653n205J8811J1144K9328J3187m861J4256J4048j0387
13857A97785k111L5250N932k6829r062M5610N9829M8409P2803N6456P788n5850
13845D36010m8209k1123m2010j4912j6443l2059Q714j9337m6518M063J6764l519
13833B21421l3378m8642k1599k5797R141J1700k8094P349O2077M9051K6405P0491
$$ y = [-47600, 6782, 16112, 26189, 55663, 49926, 12567, 18445, 10941, -10568, -7756, -24305, -14779, 10431, 25199, 8630, 9888, 12621, 24716, 41377, 39202, 22113, 6591, 19216, 30292, 17098, 16014, 19144, 44269, 44572, 35903, 39127, 40592, 35036, 45328, 56298, 50233, 67253, 108551, 159652, 226657, 303178, 402537, 430285, 401086, 345237, 299877, 277542, 203527, 142144, 141461, 131117, 117464, 112259, 131070, 142214, 171542, 184729, 179868, 194124, 208172, 197785, 195674, 230924, 236856, 210027, 200965, 246575, 306404, 354813, 427616, 484072, 491860, 436010, 387801, 366678, 324668, 309756, 293313, 261254, 269968, 250631, 204113, 208176, 224940, 221421, 188043, 139401, 117802, 92005, 101146, 112846, 84752, 92101, 154178, 203229, 229634, 300125]
13821C00125R9632N9396L7681l4090q0952p2997r8888r6173n0873o423p50p934
13809D7754j994q329l3960j5369k635l358K7517J6043n305R071R695J8584k0730
13796C6984m974j6477k1352J2948j1939j3075l2139l048K8753N1096K0609j5885
13784C1501n7828j9240J3348K4366J1410q73J8354J0570J0359M0071k0100l905
13772E8033K6141K3512j3263P387m278r73m1623q766M1247L7353M7968P4794O2793
13759C10325p9430n0852j8589m4159l3607k6679k5293J3214m542M5620k687k2079
13747F1242K0481k020M867m764j3842k5162j3788J284J3756J3680k5215o905L0193
13734E3807K7187k9423k0043J1528O639K180J8991J7530o779p724j5036L303r949
$$ y = [300125, 399757, 459153, 496834, 462744, 381792, 308795, 209907, 113734, 62861, 56438, 55688, 47754, 45760, 37431, 3471, -11898, -14533, -17891, 9626, 25669, 20364, 29435, 39130, 57714, 36984, 32010, 15533, -5819, 7129, -4810, -17885, -50024, -53072, -24319, 26777, 47386, 31501, -26327, -45567, -32219, -7853, 3557, 2684, 21038, 31608, 41967, 82038, 61938, 58033, 84174, 107686, 94423, 101810, 97532, 96559, 54936, 46170, 87417, 124770, 172738, 247532, 310325, 230895, 180043, 161454, 117295, 83688, 57009, 31716, 44930, 40388, 86008, 83321, 61242, 81723, 79703, 84570, 79806, 65964, 40802, 27014, 28298, 42054, 55734, 30519, 23614, 53807, 80994, 51571, 31528, 43056, 49695, 51875, 70866, 88396, 81617, 73893, 58857, 62160, 52211]
13721E2211R177P124j008l0344k352K6114Q815k1748n886k493k5714J0106M916
13708B8918M3021M633m3984R739j5124j6065j7740j2984K1900Q447j0105j3953
13696a3297K6165J0723J8764l77k2725j5761K6352K3693J0546l905o512m5789
13684G877J1843K6531l056Q063K178O812j4933j3162J8083J2265Q741j3717m603
13671E2922j024L2978J8730j8968k2170K5607J7792J3040P56P684J2739l3858
13659A06228m2608j0173J8494j3007j3522q290j4357J9759M412K0340j0133j2485
13647D4658K6310L0565k086m7448J748K2989O24m148k5958q3M8487N287M739p648
13633I8036J3219j5341k5041j3689J3611L9887K6014l9204J772L3915j0562k8806
$$ y = [52211, 61388, 68512, 67504, 37160, 34808, 60922, 69737, 47989, 42103, 39610, 13896, 24002, 28918, 71939, 76572, 32588, 42327, 27203, 11138, -6602, -19586, 2314, 10761, 656, -13297, 12868, 23591, 42355, 41978, 19253, 3492, 29844, 53537, 64083, 60178, 53666, 7877, 19720, 46251, 43195, 51258, 53436, 60248, 45315, 32153, 50236, 62501, 71242, 57525, 52922, 51898, 84876, 103606, 84638, 62468, 88075, 105867, 118907, 119663, 127347, 140086, 106228, 63620, 53447, 71941, 58934, 45412, 37122, 22765, 42524, 46936, 67276, 57143, 44658, 70968, 101533, 99447, 51999, 53747, 76736, 77360, 73212, 47254, 47171, 95658, 100945, 105684, 98036, 111255, 95914, 70873, 57184, 70795, 110682, 136696, 97492, 99264, 133179, 122617, 93811]
13621I3811J0626Q577j2478j2270p30Q761K3060l692K883L7132J0380L145R739
13608A78944k2875j7398l0499N546J3859j7471m0678l4945j0964J869j2765J2591
13596B5214n875J395K1520K0380M0918J4505k3098k7472J1695K1549J9622j766
13584A18587j3992k7926q760o099k7874j4097K5581M8725J2470m9069m0988m5508
13572b8950l8946n107L0042J3950L7255J047k4445p402J897J0089n4n25J9783
13559H634k1385j5659r118O666J1596p928K9504J7114j625K4703J0738k4261k0269
13546H710k2689m3537n6175k715J3505Q648l8871M3288L1174m542L5004K6059
13534b141K8775Q358N930J2693K1523O7184O7207N3236k5920l5822m1627o675
$$ y = [93811, 104437, 113014, 100536, 88266, 87536, 96297, 119357, 115665, 118548, 155680, 166060, 169205, 178944, 156069, 138671, 108172, 113718, 127577, 110106, 69428, 34483, 23519, 25388, 12623, 25214, 19339, 20734, 42254, 62634, 103552, 118057, 94959, 67487, 79182, 100731, 120353, 118587, 104595, 76669, 67909, 61810, 33936, 19839, 45420, 94145, 106615, 57546, 16558, -28950, -67896, -73003, -42961, -29011, 8244, 9291, -15154, -22556, -20659, -10570, -10624, -11149, 8634, -12751, -28410, -37528, -30862, -19266, -27194, 2310, 19424, 17799, 42502, 53240, 28979, 8710, -13979, -57516, -113691, -116406, -102901, -94253, -133124, -89836, -58662, -63204, -28200, -2141, 26634, 34992, 40922, 53615, 75138, 142322, 209529, 262765, 236845, 201023, 159396, 152721]
13522A52721n3873n1456j6889j3482q96J7621K2360p140k0718J0606M904J1453
13510E5211J7216l333J2278R62Q188J6297Q894J3602J5843J7214O715k4734r676
13497A34677M341L075R181L2716K643L755l871j4927j0628L5157L8972M0000Q517
13484B83608j5404P09j4271q82j048m05Q703K3004m665J0396M824q199k909j93
13470B83268K9072K2426M4979K2611P818J7628K7010P718J7646M7948J03852P9143
13458G11119Q4504J01821K51794M12057N55462L62699j9072k20811k40581k51512
13448A747480k52267k15985j68119n7883J0996K6325J1131P2702J56028J20597
13438A451005Q8284O1587Q0424J55536K62827K49584J01501M8749J49711K46082
$$ y = [152721, 98848, 47392, 30503, 17021, 16125, 33746, 56106, 48966, 28248, 38854, 43758, 55211, 72427, 69094, 81372, 82334, 90522, 106819, 115713, 129315, 145158, 162372, 169087, 144353, 134677, 139018, 142093, 151274, 183990, 186633, 190388, 186517, 171590, 160962, 196119, 235091, 275091, 283608, 268204, 268913, 254642, 253760, 252712, 252307, 261010, 284014, 279349, 289745, 294569, 286370, 283461, 283268, 312340, 334766, 379745, 402356, 410174, 427802, 454812, 462530, 480176, 528124, 631976, 711119, 795623, 897444, 1149238, 1561295, 2116757, 2479456, 2460384, 2239573, 1998992, 1747480, 1495213, 1279228, 1111109, 1053226, 1064222, 1090547, 1101678, 1174380, 1330408, 1451005, 1539289, 1600876, 1681300, 1836836, 2099663, 2349247, 2450748, 2499497, 2649208, 2895290]
13428B895290L45319N49795P03505O68368M90641L41912K69643M40622P85410
13419G490505J291413K125368L318057N088113Q248944J3958587K1084389K0947826
13411H3553202O007997q322980j1145618j1355841j2838432j1937854q451202
13404B5509272n120445k871661j245749K72691K027926M255774N240679K442435
13396C0510922o80159l57907J577254M244708P150680M857662j184591j719547
13388D4399022J326475M495446R348182J4437722J2982887M578678n011601j0162388
13380G6394423j1039330j0303018p633575k239101L150724J595202m555167n462866
13372C9907292l518601k370975q06206L482k437931l900963l157976k696944k496266
$$ y = [2895290, 3240609, 3790404, 4493909, 5162277, 5652918, 5994830, 6264473, 6705095, 7490505, 8781918, 10907286, 14225343, 19313456, 27562400, 41520987, 62605376, 83553202, 89561199, 81238219, 70092601, 58736760, 45898328, 33960474, 25509272, 20388827, 17517166, 16271417, 16544108, 18572034, 22827808, 28068487, 30510922, 29830763, 29472856, 31050110, 35294818, 42445498, 47303160, 46118569, 44399022, 45725497, 50220943, 59569125, 74006847, 86989734, 91568412, 86556811, 76394423, 65355093, 55052075, 47418500, 45179399, 48330123, 49925325, 45370158, 39907292, 36388691, 34017716, 33211510, 33214992, 30777061, 26876098, 23718122, 21021178, 18524912]
13363A8524912j526814k6997J634911L624512O651888J1705034J9110910K3561894
13355H3260250J3157262n583223j2779962j2532193j3802769j4181177j1149786
13348B6388402p289576m608450l048172k044611j423382j099245j003633q59552
13340E011781o64893n59045m60448l68994l18028l19434k40708j95107j71543
13331A713581j27650j08879q4447o4928l4515m4511p3307n9540n8025o7467n6321
13320I33991j4842k3150m4020j5823l0217m6319l7209J755Q156j2324m4028o016
13308F69954k532k1738k735j9612l6016k0276j1871l2067j3572k020k1934k2180
13296D63401j8985j3059K673J4948J7542l259j7363k9975k7638l860J2745K4426
$$ y = [18524912, 16998098, 16971101, 18606012, 22230524, 28882412, 40587446, 59698356, 83260250, 96417512, 90834289, 78054327, 65522134, 51719365, 37538188, 26388402, 19098826, 14490376, 11442204, 9397593, 7974211, 6874966, 5871333, 5011781, 4346888, 3787843, 3327395, 2958401, 2640373, 2320939, 2080231, 1885124, 1713581, 1585931, 1477052, 1392605, 1327677, 1293162, 1248651, 1175344, 1115804, 1057779, 990312, 933991, 919149, 895999, 851979, 836156, 805939, 759620, 722411, 724166, 732322, 719998, 675970, 669954, 667422, 645684, 642949, 623337, 587321, 567045, 555174, 523107, 509535, 507515, 485581, 463401, 444416, 431357, 434030, 448978, 466520, 463261, 445898, 415923, 388285, 384425, 397170, 421596]
13284D21596K3763k58l259j4045j2991p750k5898o683M070k5726m4470m0970J0244
13271B77623l115q772p267J9889M684J8170J4328K0542p518j7833j8250j323K0974
13258C12132N1539j5126k4732o590L797j0675o474J0028k319J1220p333k7134
13246B88333J4743J1888J9543K8028O276N1231R2183J8952k5187o4093l1128j9363
13234C91406l1415n0974k5401K4732M1617N6841N1348N5164J13814J67638R4243
13223H89013k3344p9532j12187j44670j17750q4388p8020n2047K720P454P68j3839
13211A94178K476J9594M5421m363Q825O625J4369l62R0727J13053M9560K8011
13199E68114O2815Q4450L6817L3338Q599o2942r6832r3703k4729p183k1512p3073
$$ y = [421596, 445359, 445101, 441842, 427797, 414806, 407056, 381158, 374475, 378545, 352819, 308349, 267379, 277623, 274508, 265736, 258469, 278358, 283042, 301212, 315540, 336082, 328564, 310731, 292481, 291158, 312132, 363671, 348545, 323813, 317223, 321020, 310345, 303871, 313899, 311580, 322800, 315467, 288333, 303076, 314964, 334507, 362535, 368811, 420042, 512225, 531177, 505990, 441897, 410769, 391406, 359991, 309017, 283616, 308348, 349965, 406806, 458154, 513318, 627132, 794770, 889013, 865669, 786137, 673950, 529280, 411530, 327142, 249122, 197075, 199795, 207249, 208017, 194178, 196654, 216248, 261669, 257306, 266131, 272756, 287125, 286763, 377490, 490543, 540103, 568114, 630929, 715379, 752196, 785534, 794133, 731191, 634359, 540656, 515927, 508744, 487232, 414159]
13187D14159n1192k3975n7956l8988k1073k0599J6683k3890n5685o956P882J5091
13175A53501M769K922L5824M5689N3054Q5936J36298J28704O4343o536j04909
13164E99595j34088q1404m9603p7212o1803n4338l5218j0340j8757J6769R121
13153A02722n5043l5225J7583J7940j8783k6164Q575J894m910j834n032j6800
13141a5077J5553J7127P874J86N675k7764j1568J421K8772J2033k9148m3840n963
13128d4719J6052K7758K9836J9951M669J3748K6081J7786J3992J6126M633R404
13116A55317k443k8028n095J9498k7025j8500p402j536K1544m0574q379L1993
13104H9370n323l2499j6542r741K7846J606j9418J5838J9848m018j9347j3607
$$ y = [414159, 362967, 338992, 281036, 242048, 220975, 200376, 217059, 193169, 137484, 130528, 138410, 153501, 158270, 161192, 197016, 242705, 295759, 381695, 517993, 646697, 711040, 704504, 599595, 465507, 384103, 334500, 257288, 195485, 141147, 105929, 95589, 76832, 93601, 102722, 47679, 12454, 30037, 47977, 29194, 3030, 11605, 13499, 8589, 6755, 1723, -15077, 476, 17603, 25477, 25663, 31338, 3574, -7994, -6573, 22199, 34232, 5084, -38756, -44719, -28667, -909, 28927, 48878, 53547, 67295, 93376, 111162, 125154, 141280, 145913, 155317, 152874, 124846, 119751, 139249, 112224, 93724, 86322, 84786, 106330, 65756, 57377, 89370, 84047, 51548, 35006, 25265, 53111, 54717, 35299, 51137, 70985, 66967, 47620, 34013]
13092C4013j3017J861K3008o336m4430l0433P533K0631J9847L8758K6741m0967
13080C7209r898n883K9109J6077M61j2914k379M354P632o938j4198l1643K0187
13067C1176j2893j4587j1832L8436K7398K17j4519R95J1764M491r623n598l2994
13054A2431l934J3555J9J203j7170k8644J9984K8102p891m0323m228Q880K764
13041a5252L6530M265q651p136K5584j5628Q332p585j196P461l0401P842P72J0837
13027A5774J1018o774K384j9148p25m268J3060M917n45K6833J4992k9410j5692
13014A2416p47J1873K4385j8705k7935K3187j3784j4651J5024J0376m305K4051
13002D1185Q841l0856J3236K648R912m1273k6142J9749K8150k1249j2590L0556
$$ y = [34013, 20996, 22857, 45865, 39529, -4901, -35334, -27801, -7170, 12677, 51435, 78176, 37209, 27311, 21428, 50537, 66614, 67075, 54161, 51782, 56136, 63768, 56830, 42632, 10989, 31176, 18283, 3696, -8136, 30300, 57698, 57915, 43396, 44391, 56155, 60646, 51023, 45425, 12431, 8497, 22052, 22071, 23274, 6104, -22540, -2556, 25546, 17655, -22668, -26896, -18016, -15252, 21278, 25543, 16892, 9756, 35340, 19712, 28044, 20459, 19263, 26724, -3677, 4165, 4937, 15774, 26792, 20018, 22402, 3254, 2529, -1739, 11321, 16238, 15693, 42526, 57518, 28108, 12416, 11669, 23542, 47927, 29222, 1287, 24474, 10690, -3961, 11063, 21439, 17134, 41185, 50026, 19170, 32406, 35054, 44966, 3693, -22449, -2700, 25450, 4201, -8389, 22167]
12990B2167L0251l458m428O62l366p341m1701j23Q920P710J2546R844j012N0J2192
12975D2913L2412k4953l6055J5368r195K2708L713j7857j6262j4344j0304m210
12963a6066J066L1638k663o131K691K6800n107j6675Q82P713L6053K0882m6759
12950C4324m7115M50L7193L5887L3968r818J2405O4151Q5850J03904Q2427K9511
12938D63137m9104p4281m9225m0776n8926l1687l614l2734k3318k7536N296J1230
12926H8462M2098J9468r540K2104J5087m753O693M0350J3195j2544J7929L3553
12914B72102N1325O4521L8759J8422j7124m5054o3849l9833j624j0420k2160J8364
12902B63429j0316k4489J0435m739j876n046l9123k9806j8421L579m4211n169
$$ y = [22167, 52418, 48960, 44532, 45194, 41828, 34487, -7214, -7337, 1583, 9293, 21839, 31683, 30671, 30721, 42913, 75325, 50372, 14317, 29685, 20490, 43198, 46911, 29054, 12792, -1552, -11856, -16066, -15000, 16638, 13975, 7844, 10535, 37335, 32228, 15553, 16435, 24148, 60201, 81083, 34324, -12791, -12341, 24852, 60739, 94707, 84889, 97294, 161445, 247295, 351199, 433626, 463137, 414033, 339752, 290527, 249751, 190825, 159138, 155524, 122790, 99472, 71936, 77232, 88462, 130560, 150028, 140488, 162592, 177679, 172926, 179619, 219969, 233164, 220620, 238549, 272102, 323427, 387948, 426707, 445129, 428005, 382951, 319102, 279269, 277645, 267225, 245065, 263429, 253113, 228624, 239059, 234320, 232444, 227398, 188275, 158469, 140048, 143627, 99416, 94247]
12890I4247o69k520O224L2946O9082R3499J20341Q4962o4216o7162n3451o9976
12878B43307p6231o5607m5565k0687j134J278K1714J1245L446Q843p619k4156
12866D8834k4507m1229j1238M2065J8834j0970n65j3200K196K3707r429k9990
12854e492k8891J4594K9796J184P78o926k8076J3851J2459Q702N786k8713j6905
12841b7853k447J9152K5839L678m5715n071J5925J1003K7111l066J140l433l4850
12828a8587j2845n894K8310L0576q203O438j7528l6838J2816J7154J9788j2829
12816B358j8314O477K4438M2k8778L952J7234j5360j9808J0910K8838J5168K0682
12803D7839m065l1836l9354L87r373J0872M4316m969m526j6488j2527k4538J0157
$$ y = [94247, 93578, 91058, 97282, 130228, 199310, 292809, 413150, 498112, 433896, 366734, 313283, 243307, 167076, 101469, 55904, 35217, 34083, 35361, 57075, 68320, 71766, 80609, 72990, 48834, 24327, -16902, -28140, 13925, 32759, 21789, 21224, 8024, 10220, 33927, 24498, -5492, -34383, -19789, 10007, 11191, 11969, 5043, -23033, -9182, 3277, 11979, 17765, -10948, -27853, -30300, -11148, 14691, 18369, -27346, -32417, -16492, -5489, 21622, 18556, 19696, 16263, -18587, -31432, -37326, -9016, 21560, 13357, 19795, 2267, -34571, -21755, -4601, 15187, 2358, -15956, -9479, 14959, 15001, -13777, -9825, 7409, -7951, -27759, -16849, 11989, 27157, 47839, 43774, 11938, -27416, -27029, -36402, -25530, 18786, 13817, 9291, -7197, -19724, -44262, -34105]
12790c4105L994J1096J1147M698j3575J3347k939N218j2939O477j5540K2671M1801
12777D1351N863k6476k4595k01L3172J3218K3029k5722M516K1777m2501p233K2588
12764C8786j4314k1787j942r367j4729J703n8j6680J8398J6115L1517p966k684
12751A6992R337J0167j5354K029J264j030q510R167K870P358j7005j4758k103
12738D24K8433K1848J1122q740q839k7440p468J0060K3863K7484k7947j7726j1266
12725A3808l1364j0923M0066J3732n344p523Q859j7641J2112M4874n59l9132j4095
12712F870r869j076m293K4126P148k5169j4653p110N431J8392L6086R985n2994
12699g126j7560J4449L6430J6425j1332r628j6891j0668J3910J4679j2192k3312
$$ y = [-34105, -30111, -19015, -7868, -3170, -16745, -3398, -6337, -1119, -14058, -7581, -23121, -450, 41351, 47214, 20738, -3857, -4058, 29114, 42332, 65361, 39639, 44155, 65932, 23431, 16198, 38786, 24472, 2685, 743, -8624, -23353, -21650, -21708, -38388, -19990, -3875, 27642, 19676, 16992, 26329, 36496, 21142, 23171, 24435, 23405, 14895, 24062, 26932, 34290, 17285, 2527, 424, 28857, 50705, 61827, 53087, 44248, 16808, 9340, 19400, 43263, 70747, 42800, 25074, 13808, -17556, -28479, 11587, 25319, 19975, 12452, 21311, 3670, 15782, 60656, 60097, 20965, 6870, -2999, -4075, -8368, 15758, 22906, -2263, -16916, -24026, -18595, -203, 35883, 45868, -7126, -24686, -10237, 26193, 42618, 31286, 21658, 4767, -5901, 8009, 22688, 10496, -12816]
12687a2816j0550M786k0382m991L5495L8694k703m1947k4590K6340K7054k0583
12675f193q09p021n706K7605L733j1512j1090m814j5462M42K0304J3994R192j7741
12661e078k1752n872O053L176k073L8052J0793l750Q639r104J8079n181J1325
12648D3307k0477j4568j9831k9614K044L7880P65j1960K8346n452j9114p85J4701
12635E242j832Q857J1958N790J7640J1305k8710l4340o604K2292j7790k1865K6212
12622a845J7942J437o289j6100J7048K6260l5690k3290J4357M751J4631k0716
12610g504j0266j199Q939J2221j2973l1212n609K3496j912J1940m45m461J5954
12597c031N902j0076N970M3242K2373l3233j7489j5387j8829q045r669J6806j1407
$$ y = [-12816, -23366, -18580, -38962, -43953, -8458, 30236, 27533, -14414, -39004, -12664, 14390, -6193, -7002, -14023, -19729, 7876, 11609, 97, -10993, -15807, -31269, -30827, -10523, 3471, 12663, -5078, -26830, -32702, -26649, -23473, -25546, 12506, 23299, 19549, 28188, 19084, 37163, 31982, 43307, 22830, 8262, -11569, -41183, -39139, -1259, -494, -12454, 15892, 10440, -8674, -9459, 5242, 3410, 12267, 24225, 30015, 47655, 58960, 30250, -4090, -10694, 11598, -6192, -28057, -1845, 16097, 17534, 11245, -4855, 12193, 38453, 2763, -20527, -6170, -1419, 13212, -7504, -17770, -18969, -10030, 2191, -10782, -41994, -47603, -24107, -26019, -14079, -14524, -18985, -3031, 2871, -7205, -1235, 42007, 64380, 31147, 13658, -1729, -20558, -28603, -38272, -21466, -32873]
12584c2873L2479j987J8618J6376j4946j0206m771k1533o419J3024N700N8N666
12571h14N466k5984l4788L5238J785Q256L338j5546j3707L6185J3415J6143J1163
12558D0150j2084r514n105m265K221m2148k4922J8410K8901L841J5161L5085q689
12545C7042J3871J8168n366m7349r692J2040j4561m151P367M709M251K4876L4398
12532G5603k0374k7279j7134r278j7197n879k463r321k042r576J0130K608K3561
12519h641K3096Q133j3276J65R121j318J8708J3272J3670j4254k397k2415p326
12506A6538J3894r934k0590j0697K8437K6037j128p532j3232J9386n202j4477
12494B1500m268L096L565M153o369J6730J5773P865J652k4073n813J6170k6610
$$ y = [-32873, -394, -2381, 16237, 32613, 17667, 7461, 2690, -18843, -25262, -12238, -6538, -6480, -814, 4652, -21332, -56120, -20882, -19097, -10841, -7503, -23049, -36756, -571, 12844, 28987, 40150, 28066, 18552, 13447, 9182, 11403, -30745, -55667, -37257, -8356, -4515, 10646, 45731, 37042, 50913, 69081, 63715, 16366, 6674, 18714, 4153, 2, 7369, 12078, 16329, 41205, 75603, 55229, 27950, 10816, 1538, -15659, -21538, -24001, -33322, -35364, -44940, -34810, -32202, -8641, 14455, 22588, 9312, 9477, 18598, 17280, 35988, 49260, 62930, 48676, 46279, 23864, 16538, 30432, 20498, -92, -10789, 17648, 43685, 42557, 35025, 21793, 41179, 35977, 21500, 17232, 20328, 23893, 28046, 21677, 38407, 54180, 62045, 63697, 39624, 33811, 49981, 23371]
12481B3371k8117Q414o06J7107j0048Q972L969P166J9017O707l399n641K1883
12468F8795J2133j8519k1152m805Q111Q942R022L7327l36J764j6723n818o779
12455G1962k6803j4687L7688K1411k0028j7401k493j6365j7989J4394k711j3025
12443A3953M965J2965J4069J6014J066p169j2426O998K2226N682J1670q557k1231
12430F0225n0461j9185j252n0J4513m294m1214j7506K3476K8185K3723K444j6768
12417A836p561J6998K2412O154k7249q603J6218J5822O135k4268J1979K5602K8845
12404H4320P566J2314R305R708K3287M008j1422j6726o240j5599n1062j3124J3436
12391D9771P607J1200m775l9230k932k862M822J5634k0455j7969J2924o527M6871
$$ y = [23371, -4746, 3668, 3062, 20169, 10121, 19093, 23062, 30228, 49245, 55952, 52553, 46912, 68795, 80928, 62409, 41257, 36452, 44563, 53505, 62527, 99854, 99518, 101282, 84559, 78741, 71962, 45159, 30472, 68160, 89571, 69543, 52142, 49649, 33284, 15295, 29689, 26978, 13953, 18918, 31883, 45952, 61966, 63032, 55863, 43437, 50435, 72661, 78343, 90013, 81456, 60225, 9764, -9421, -10673, -10723, 3790, -504, -41718, -59224, -35748, -7563, 16160, 18604, 1836, -5725, 11273, 33685, 39839, 12590, 3987, 20205, 36027, 42162, 17894, 29873, 55475, 84320, 91886, 104200, 113505, 123213, 146500, 150508, 139086, 122360, 116120, 100521, 49459, 36335, 49771, 57378, 68578, 63803, 24573, 21641, 18779, 23601, 39235, 18780, 811, 13735, 7208, 54079]
12378E4079o282k1493j944K5958J710j1402q613q85K5612j1179j8388K3239m938
12365D5474j3362K5735j0013j5154j6369l212K7086K8851P930J6604n28j8809
12353G4233l1354O664L7611J219l5725l4238l361r63q623K808J5872K3094R847
12340E7084k3442j9695r886n181j3714o319J339O607K9000m7P565r942j2975J2342
12326A2736l183M607K3499j560j1681j7336j3281L336p722J0425p194J3127K1291
12313B7064J2058j3476j4750P689J2980k1252l437L2785r840k5055j894K0507
12301B3379J0872l992q000p828K3162K3134M634j3018J980j0069l18k1212k0222
12288B502P390M779L0206j6309o176k1738K0670J3511O885N642l499J4187p110
$$ y = [54079, 47797, 26304, 24360, 50318, 52028, 40626, 32013, 31128, 56740, 45561, 27173, 50412, 45474, 32112, 57847, 47834, 32680, 16311, 13099, 40185, 69036, 76966, 93570, 93042, 74233, 42879, 49543, 87154, 88373, 52648, 18410, 15049, 14086, 5463, 8271, 24143, 47237, 57084, 33642, 13947, 4061, -1120, -14834, -21153, -19814, -13207, 15793, 15746, 23311, 13369, 394, 12736, 9553, 14160, 37659, 36099, 24418, 7082, -6199, -2863, -10585, -160, -7354, 5773, 27064, 39122, 25646, 10896, 18585, 31565, 10313, 6876, 39661, 29821, 4766, 2872, 23379, 34251, 30259, 22259, 14431, 37593, 60727, 65361, 52343, 54323, 44254, 43936, 22724, 2502, 9892, 14671, 44877, 28568, 22392, 654, 21324, 34835, 41720, 47362, 43863, 58050, 50940]
12275E0940m6604J7184Q465q288K0972K744j7947j672J0709K0586K508j6663k8511
12262A4423K765K6215j1109k0521J8297j042j9741j0246k1256j8538J43K6029
12250a4581Q918j9379J7744J4796K9589k5350j313K3416L2453j6145p468k9905
12238A2775j8236J8411J6326K097q462j0686j8650j1232K3118O771L1977J0963
12226E5172K51L866n085Q768M378K3874M087Q347r763j9140r450q859L10L7848
12212I4604J101m2265j2418L4892N3991J6387k9530J0776N0828K2007P2315J24095
12200C96783J12448N9446n1320o0090o3785m5506m5602q1813m2734n9085j4282
12189A04460M375m792J3243M5760K3757p578m404J2375M0281K9027R853Q258l072
$$ y = [50940, 4336, 21520, 29985, 21697, 42669, 45413, 27466, 25794, 36503, 57089, 59597, 42934, 14423, 17188, 43403, 32294, 11773, 30070, 29028, 9287, -959, -22215, -40753, -40610, -14581, -5663, -25042, -7298, 7498, 37087, 11737, 10424, 33840, 66293, 50148, 42680, 12775, -5461, 12950, 29276, 31373, 22911, 12225, -6425, -17657, 5461, 12232, 44209, 55172, 55423, 59289, 54204, 62972, 67350, 91224, 95311, 103658, 93895, 74755, 65305, 56446, 56756, 94604, 95705, 53440, 41022, 75914, 129905, 146292, 116762, 127538, 178366, 200373, 272688, 396783, 509231, 568677, 517357, 457267, 393482, 347976, 302374, 220561, 177827, 118742, 104460, 108835, 104043, 117286, 163046, 186803, 179225, 174821, 187196, 227477, 256504, 266357, 274615, 271543]
12176B71543N250K1680J7235K3396N8068N7907N5432K0402o0327p6889j6434k6960
12164C50303l4656q279k6442m1690q130J179O345j8218j9409l4586m112q321o717
12151A47267k518j4333o221M6537M9134K2573J9436P7438Q8252K4535j5633l5058
12139D01409n7236r9174n3327n2871k2145l927m6624k1076R905j7554J87j4810
12127B2757J3621J9547K9956K6637J1319k4598k7041J354P087j7412P523K0210
12115I0960J3029k198J0168N620k846l7311j2979j3299K3834J1273m6575k0546
12103A9130J7117J7586O285l1486J7884J4870J6280r244k8260J0293k5793j8973
12091E689K3411M1634j2553j9280Q224j4339l4630K8538K0195K6933K6251j0709
$$ y = [271543, 276793, 298473, 315708, 339104, 397172, 455079, 510511, 530913, 470586, 393697, 377263, 350303, 315647, 307368, 280926, 239236, 231106, 232285, 238630, 220412, 201003, 166417, 162305, 153984, 147267, 144749, 130416, 124195, 170732, 219866, 242439, 261875, 339313, 427565, 452100, 436467, 401409, 344173, 244999, 191672, 138801, 116656, 112729, 66105, 45029, 54934, 37380, 37567, 22757, 36378, 55925, 85881, 112518, 123837, 99239, 72198, 73552, 80639, 63227, 70750, 90960, 103989, 101791, 111959, 117579, 114733, 77422, 64443, 51144, 74978, 86251, 39676, 19130, 36247, 53833, 60118, 28632, 46516, 61386, 77666, 68422, 40162, 50455, 24662, 5689, 29100, 70734, 58181, 38901, 47125, 32786, -1844, 26694, 46889, 73822, 100073, 89364]
12079H9364j1794N273J0506K433Q685R23j2972p04k6004J6601K3260n044r139
12066I1388J3501K7454L09O199l2729J2590P97j1287j3871j0458J1206j2096q836
12053G4167p938J7871J5159K0613k4607J0825J7492j6260j2952k3141K0316J7615
12041A09160J3882m674j081R358N200J038l003k7455l1967N318N295o969J9836
12028I3938J5532J6420j3013j5263n857j4526K1722N1454J9121l3581j0490J9846
12016A45303M1725j7115k5739j0331J6014p473j8237K3914J8169k5773r092O231
12004A37596k0972j6374j6952Q673j8326Q56K0158K3784R289p986J892J1760k254
11991A31144J0553K5562m645R323k0090l5320J489j0348J1403R501l653k3023
$$ y = [89364, 77570, 82843, 93349, 95782, 104467, 105390, 92418, 91714, 65710, 82311, 105571, 100527, 91388, 104889, 132343, 132652, 138851, 106122, 118712, 119509, 108222, 94351, 83893, 95099, 83003, 74167, 66229, 84100, 99259, 119872, 95265, 106090, 123582, 107322, 94370, 71229, 91545, 109160, 123042, 118368, 117287, 126645, 131845, 132883, 129880, 102425, 70458, 75776, 81071, 74102, 93938, 109470, 125890, 112877, 97614, 91757, 77231, 98953, 150407, 169528, 135947, 125457, 145303, 187028, 169913, 144174, 133843, 149857, 142384, 124147, 148061, 166230, 140457, 131365, 137596, 116624, 100250, 83298, 91971, 73645, 74501, 94659, 118443, 127732, 119746, 121638, 133398, 131144, 141697, 167259, 162614, 171937, 151847, 116527, 118016, 107668, 119071, 128572, 124919, 101896]
11979A01896O032J5106o966j721K5637j8856j6888k2436j2951R156k048K1661
11967I7622L2434J8118J1144J138j7694k984K6920J0383l2136k1747m0879q8228
11955e909l4093j6467J8744M9246J9034O878J3591k6575N421Q308J8357J9260
11943G5795k842k4212o428l75J4800K295o417n712P960L6339L0776k193K482j7706
11929A04562k8472l2536l055o024j8325j6483J4683j118m0966k7256K0554K6836
11917g600M969L84L0201J5460j2251k7313j72K2134L0231p466q420J2939L458
11904E6554j887k5138J2326m3564l0506l302m0177l4690j4379L6993j063J9913
11892f8920K3827N0519J3160Q188K3379J6911J1948J1563N2957J06404J26800
$$ y = [101896, 107928, 123034, 116068, 114347, 139984, 121128, 104240, 81804, 68853, 78009, 75961, 97622, 130056, 148174, 159318, 160456, 142762, 139778, 166698, 177081, 144945, 123198, 82319, -5909, -40002, -56469, -37725, 11521, 30555, 37433, 51024, 24449, 29870, 38178, 56535, 75795, 72953, 48741, 42313, 41938, 56738, 59033, 52616, 46904, 54864, 91203, 121979, 119786, 122268, 104562, 76090, 43554, 40499, 34475, 16150, -333, 14350, 13232, -27734, -54990, -34436, -7600, -2631, -2247, 27954, 43414, 31163, 3850, 3678, 25812, 56043, 48577, 40157, 53096, 56554, 54667, 29529, 41855, -1709, -32215, -35517, -75694, -110384, -124763, -87770, -88833, -68920, -45093, 5426, 18586, 26774, 50153, 67064, 79012, 90575, 143532, 249936, 376736]
11881C76736P6742k5292n1490n7631m3436l7906p0343m0218l5537k9502K5346
11870H7469N266J007l74j2203k1429k9958J718L7353K3582j3488K1469L0199R174
11857A39785J3803L0k261n026j8960J2024O919Q881n133l3603o401K1121K4081
11844A55260K5695Q066K593M903J4761J6004K0423J5760k4017O866M1118L1246
11832C18678J8631j5788m4330K1384K1131J3400J8052k8095J697J9244L3165R709
11820C86878J0811Q575J7113M1575L6670L9285O2758M7641K8052J5937K6168O6487
11808G87950N2095Q2276J64290K63477M50925O05038L95961p4177k22932k27137
11798B277766k68471k91132k15493j19466n2597J7731Q1737J14331J60823K47720
$$ y = [376736, 453478, 428186, 376696, 319065, 275629, 237723, 167380, 127162, 91625, 62123, 87469, 92735, 93742, 93368, 81165, 59736, 29778, 31496, 68849, 92431, 78943, 100412, 130611, 139785, 153588, 153618, 151357, 146331, 127371, 139395, 146314, 155195, 150062, 116459, 110058, 131179, 155260, 180955, 189021, 191614, 196517, 211278, 227282, 247705, 263465, 239448, 246314, 287432, 318678, 337309, 321521, 277191, 298575, 319706, 333106, 351158, 323063, 324760, 344004, 377169, 386878, 397689, 406264, 423377, 464952, 501622, 540907, 603665, 651306, 679358, 695295, 721463, 787950, 840045, 922321, 1086611, 1350088, 1801013, 2406051, 2802012, 2727835, 2504903, 2277766, 2009295, 1718163, 1502670, 1383204, 1330607, 1348338, 1430075, 1544406, 1705229, 1952949]
11788A952949J96229R3340J27206K36272K85791L12315K76091K38409L22732N10875
11778D552209O50346Q96593J200363J397343J677301K166433K996888M638775
11770B0176251P754986J3422536K1701685K4730851R995123q449853j2315090
11763G7016489j1705549j3619322j3405676r801854n965796l215432j350181J46145
11755A8098824J897270M296305M798547R12401j300135L30217K689590N680394
11747C7403413P709406K832420l020892k439235k24553J707698O248931J3096132
11739F3313320J6066993J0657280P56349p608306j0474759j0123899q094689l422782
11731E1069507J237238j190556o093224n463162l399711k146948l00670p40984
$$ y = [1952949, 2149178, 2242518, 2369724, 2605996, 2891787, 3204102, 3480193, 3718602, 4041334, 4552209, 5202555, 6099148, 7299511, 8696854, 10374155, 12540588, 15537476, 20176251, 27931237, 41353773, 63055458, 87786309, 97781432, 89331579, 77016489, 65310940, 51691618, 38285942, 28484088, 22518292, 19302860, 17952679, 18098824, 19996094, 24292399, 29090946, 30003347, 28703212, 29033429, 31723019, 37403413, 45112819, 47945239, 44924347, 42485112, 42260559, 43968257, 50217188, 63313320, 79380313, 90037593, 90793942, 83185636, 72710877, 62586978, 54492289, 51069507, 52306745, 51116189, 45022965, 39559803, 36160092, 34013144, 33712474, 32971490]
11723C2971490l860982m032434k742416k576780k557044j524253n1382J398417
11715A7024616L068171N535359R772543J6580485K2450101J5566667k966695j1985722
11707G5045525j1655177j2550532j3523637j1099931p398858m593813k857396
11700A1366181j902353j454756j223220j080347q84002p03775n92072m48402l40131
11691B737123k98170k51757j99500j46910j55049j42671j24204n7562o8687o5948
11681A226665n7989q2522n9650m4254l6618l6158l2805q735l585k3125k7444n1433
11669G62347l5112j4365J1839l9007o8973j9088j5570j5110k2240k1029l2341
11658D91351j8430R397J9890k0121j443J8500l4917l2040j9317j8447q298J5004
$$ y = [32971490, 29110508, 25078074, 22335658, 19758878, 17201834, 15677581, 15626199, 17024616, 20092787, 25628146, 35400689, 51981174, 74431275, 89997942, 87031247, 75045525, 63390348, 50839816, 37316179, 26216248, 18817390, 14223577, 11366181, 9463828, 8009072, 6785852, 5705505, 4821503, 4117728, 3525656, 3077254, 2737123, 2438953, 2187196, 1987696, 1840786, 1685737, 1543066, 1418862, 1361300, 1292613, 1226665, 1168676, 1086154, 1026504, 982250, 945632, 909474, 876669, 867934, 864349, 841224, 813780, 762347, 727235, 712870, 724709, 685702, 616729, 597641, 582071, 566961, 544721, 523692, 491351, 472921, 482318, 502208, 482087, 480644, 499144, 464227, 432187, 412870, 394423, 386125, 401129]
11646D01129j2835j970J8545j8548n341J9631j5759m490n688O398P698l8258k1825
11633C28687O600j278K39r559k1176O941k889j4826%q91N969j1758o841l3613
11619B45605q12o341j3806j337o35J8085L2573j0250J1865J947k3526k9408m795
11606B19165l384N793L7970Q895j4967l403o129M7002N2166L5988M4095P0104
11594D93295K6434n1921o3169m0500l3063m823l223k6845p045K1442L7759J1204
11582C59545M175j573k842k67l2476l3432j7506k286j0468l9141j6610j7336q437
11569A81346L4955M1939N6707O7558P4073J30774R3187J00040R4229L3997J8013
11558I26818M8966J19105K31574M61906O80116N03530J76691j69410m37808m73455
$$ y = [401129, 388294, 386324, 404869, 386321, 380980, 400611, 384852, 380362, 374674, 381072, 388770, 350512, 328687, 335287, 334009, 334248, 324689, 303513, 310454, 307565, 292739, 292739, 291848, 297817, 286059, 279218, 245605, 244793, 238452, 224646, 223309, 222674, 240759, 273332, 263082, 274947, 276894, 253368, 223960, 219165, 215781, 221574, 259544, 268439, 253472, 250069, 243940, 290942, 343108, 379096, 423191, 493295, 519729, 467808, 404639, 364139, 331076, 326253, 323030, 296185, 289140, 310582, 348341, 359545, 363720, 362147, 359305, 359038, 326562, 293130, 275624, 273338, 262870, 223729, 207119, 189783, 181346, 216301, 258240, 314947, 382505, 456578, 587352, 680539, 780579, 874808, 908805, 926818, 975784, 1094889, 1326463, 1788369, 2468485, 2972015, 3148706, 2979296, 2541488, 2068033]
11548B068033m77356m60972l38802j55597r9631m9108J2148J9428Q664n884j4486
11537E06437J6346L1201J0424L9966K5019p884J915m4959k5320j8705o8395n1038
11525D15007n8550o194n450j3833l3688m6076p5486j7160j4774k8329m641j7831
11513I2995j0972L0424L2593K8223L8018N9594J00059P3586O2185K7802K195o7968
11501D68734q9212p8147l7860m2102m2293m6587k1055k400j9940l3915K2256j3312
11489F4167K121L9874K4804j0167P190l252l4929p006m82l4401J3707J4990l033
11476G3583L434J4468q275k838k1678R563k7423l2588j5046J2288J7862M1314
11464F4664J7347l9248l6122M3668M54l3263J8938L6678j0351k5065r499J822
$$ y = [2068033, 1590677, 1129705, 790903, 635306, 535675, 486567, 498715, 518143, 526807, 520923, 506437, 522783, 553984, 564408, 604374, 629393, 621509, 623424, 578465, 553145, 534440, 466045, 415007, 356457, 350263, 344813, 330980, 297292, 251216, 175730, 158570, 143796, 115467, 110826, 92995, 82023, 112447, 145040, 173263, 211281, 270875, 370934, 444520, 506705, 534507, 536702, 468734, 379522, 301375, 263515, 221413, 179120, 132533, 111478, 109078, 89138, 55223, 77479, 64167, 66288, 106162, 130966, 120799, 127989, 124737, 89808, 82802, 82320, 47919, 61626, 76616, 73583, 77017, 91485, 83210, 80372, 58694, 68257, 40834, 8246, -6800, 5488, 23350, 64664, 82011, 42763, 6641, 50309, 50763, 17500, 36438, 73116, 62765, 37700, 28201, 30023]
11452C0023M899N3492K1889M2584M6551J6560k8828n273k8559j3205k607J5596
11440A53122J485k4770j2614k187k6835L09l5340k8107K7055O579k681J8073o324
11427F7765k9071j6110j957K289n009j3233J8692j9597m797K6584L6740N304q520
11414E9080k0686p343j6184Q146j5080m85j638J5490J2474L5256J996k0494J5725
11401F6257L1514p094L1971L5148M5523L4649P85l0566j3569L80Q971k9946j3885
11388A60138K1348P378R117K9614L5817L4503L6179J4741K91j724j5789j6631
11376C14982l5278m0968m6819l2407P904K892j1015P6p365J9679M35n646j6323
11363A50147l0295k1174r608P856l321n097k8222P433L3009j866r096q055j0749
$$ y = [30023, 34922, 88414, 110303, 152887, 199438, 215998, 187170, 181897, 153338, 140133, 137526, 153122, 154607, 129837, 117223, 115036, 88201, 88510, 53170, 25063, 52118, 58697, 56016, 74089, 67765, 38694, 22584, 20627, 22916, 17907, 4674, 23366, 3769, -1028, 25556, 62296, 67600, 59080, 38394, 31051, 14867, 23013, 7933, 7448, 5810, 21300, 33774, 69030, 71026, 50532, 66257, 97771, 90677, 122648, 157796, 203319, 237968, 238753, 208187, 194618, 194998, 203969, 174023, 160138, 181486, 188864, 197981, 227595, 263412, 297915, 334094, 348835, 349126, 347402, 331613, 314982, 279704, 238736, 191917, 159510, 167414, 170306, 159291, 159367, 152002, 171681, 172116, 166470, 150147, 119852, 98678, 89070, 96926, 93605, 88508, 60286, 67719, 100728, 98862, 89766, 81711, 70962]
11350G0962O615k206o163J7700J8983L7594K0304j8357l015J8163j317M38N3967
11337B13668M8699J2347K665Q450M4020J0373L9107Q1296J20384J42864O2171
11326G86044l2665m2534k0437l6916k9266J1544j5811l9990j57786k49807k49604
11315g7228j88003o5932N840Q682L2081O2282Q2282P2738M8502L0739K8391M519
11303D4893R519K3226M2183Q1300J01409N0142r155l2596j9270k2176m424J6668
11291B81719k6158l4640j3333j9695j7324L131J0420m910P260P747l4343n787
11279A54087l386L994J1530M2229J7982N2752Q0916R9514P3338J2676n2013q3954
11267D09665p9749j04991m3195k9404n2777l6101r248k7886m3233n4689m4085
$$ y = [70962, 77577, 75371, 69208, 86908, 105891, 143485, 163789, 145432, 142417, 160580, 159263, 159701, 213668, 262367, 274714, 277379, 285829, 329849, 340222, 379329, 460625, 581009, 723873, 786044, 753379, 710845, 690408, 653492, 624226, 635770, 619959, 579969, 422183, 172376, -77228, -265231, -331163, -325323, -316641, -284560, -222278, -139996, -67258, -18756, 11983, 40374, 44893, 54412, 77638, 119821, 201121, 302530, 352672, 343517, 310921, 291651, 269475, 265051, 281719, 255561, 220921, 207588, 187893, 170569, 173700, 184120, 179210, 186470, 194217, 159874, 154087, 150701, 154695, 166225, 208454, 226436, 279188, 360104, 459618, 532956, 545632, 493619, 409665, 329916, 224925, 181730, 152326, 99549, 63448, 54200, 26314, -16919, -71608, -115693]
11256a15693k9985m2455j0742O3959O5068J06563J30070P6756K2670r761k9621
11245B26829j4237j0730j6360P200J0151k9911n507J8515L3541K8629j218n636
11233B41266q956j5561o363k242J8581k5671K4151J0739j2591j0450l658o78J8672
11220B27239K1281K0194j7020j6929J5054K5627N2793J9493j3715L4737L3724
11209D02478J6905K9371O2263P0369N5701J16914J82307J87435J98066R6890l3861
11198A384838j14091j43039j80793j28084r6508o6037k8297l0895r974M1439O7860
11187F96419Q3361N3769O9436P8999Q1763O8826Q2551J32491K00251L19712M97333
11176B364911Q37508J482027K609554L340331K386544P34892j042902j945677
$$ y = [-115693, -145678, -188133, -198875, -134916, -69848, 36715, 166785, 243541, 266211, 256450, 226829, 212592, 201862, 185502, 192702, 202853, 172942, 167435, 185950, 219491, 248120, 246902, 241266, 232310, 216749, 210386, 208144, 226725, 201054, 225205, 235944, 223353, 212903, 209245, 208567, 227239, 248520, 268714, 251694, 234765, 249819, 275446, 328239, 347732, 334017, 368754, 402478, 419383, 448754, 511017, 581386, 637087, 754001, 936308, 1123743, 1321809, 1418699, 1384838, 1270747, 1127708, 946915, 818831, 722323, 656286, 627989, 597094, 587120, 628559, 696419, 779780, 833549, 902985, 981984, 1063747, 1132573, 1215124, 1347615, 1547866, 1867578, 2364911, 3202419, 4684446, 7294000, 10634331, 13020875, 13755767, 12712865, 10767188]
11168A0767188j944959j823202j625197j138701o62795m09349k35428j07249l8326
11159B781982K3516K4361k4282J8404J05121J88169K28929K57032L31705L76313
11149D311250M02988L94171M41797M97820O32856R16519J231530J726593K251585
11140A2807109K655409K877986K800706K847521L392906M808584P507056J2136356
11132E1833633K0235943L4924222O3193606J09534835J38746877R6730180L9111559
11125E54310855l2199474q5036801q9235683q3234202p8155185o1149435l8461283
11118H6838792k2253814j3043368q153195n620555m640001m437602m185884l855394
11110B0648979l392914k825791k328124j821559j419044j132353r02699p58959
$$ y = [10767188, 8822229, 6999027, 5373830, 4235129, 3572334, 3162985, 2927557, 2820308, 2781982, 2805498, 2829859, 2805577, 2823981, 2929102, 3117271, 3346200, 3603232, 3934937, 4311250, 4714238, 5108409, 5550206, 6048026, 6680882, 7597401, 8828931, 10555524, 12807109, 15462518, 18340504, 21141210, 23988731, 27381637, 32190221, 39697277, 51833633, 72069576, 106993798, 170187404, 279722239, 418469116, 515199296, 554310855, 522111381, 437074580, 347838897, 264604695, 186449510, 125300075, 86838792, 64584978, 51541610, 43388415, 37767860, 33127859, 28690257, 24504373, 20648979, 17256065, 14430274, 12102150, 10280591, 8861547, 7729194, 6826495, 6067536]
11102F067536o15540m83106l77558k62261k38615k17655j82133j57261j75545
11093C357862k50614k69656j89840j71762j62554j36816j47832q4804p3317p3862
11083A796805o1876k8958o0481p8401p0304o2956o0176m3257p1295m3701k4664
11072A190736j1986l793j8110n239l9580l8634j3293k4429m8600m0392l3818O201
11060I19063j1509m1298l7059l0423r698m5150p9816p7039m5964k9881j8052j0607
11048D82567L6286K5526j371J386K320P167J3686j1946k5060j7115j4065k0646
11036D78735l030m425j6451j3070J162J329J6826J7191Q074j8787k5039m8745
11024C93770k9324K094j2193J7278K48J3180k1646m0864R435j4427k6897m049
$$ y = [6067536, 5451996, 4968890, 4591332, 4329071, 4090456, 3872801, 3690668, 3533407, 3357862, 3107248, 2837592, 2647752, 2475990, 2313436, 2176620, 2028788, 1943984, 1870667, 1796805, 1734929, 1705971, 1645490, 1567089, 1496785, 1433829, 1373653, 1330396, 1259101, 1215400, 1190736, 1178750, 1174957, 1156847, 1151608, 1112028, 1073394, 1060101, 1035672, 987072, 946680, 912862, 919063, 907554, 866256, 829197, 798774, 789076, 743926, 664110, 587071, 541107, 511226, 493174, 482567, 518853, 544379, 543008, 544394, 546714, 553881, 567567, 555621, 530561, 513446, 499381, 478735, 475705, 471280, 454829, 441759, 442921, 444250, 461076, 478267, 486341, 467554, 442515, 393770, 364446, 366540, 354347, 371625, 371873, 385053, 363407, 322543, 331978, 317551, 290654, 286605]
11012B86605j1655J8380J4873R955j2419n3764l8183l3576K2476L4145Q5952P7683
11000D00472N4336O5997Q1453N6058k8714p8081j9470l7116l6227k5913n4689
10989C78106k1086l737k0174l7484j5354j0293m0173K7140J9031p570q92j8446
10977B49068j2348p215J9130k7965j61R308K2161K3563J3651l968k7450k6661
10965B31113j3867j4565J8025o934o335K922r619K1088M7690L8732o40J0445L3559
10952C51614K5056m595M585M087J4262L524J8955N7600K8903J0891N4205P6303
10940F45390Q8117R4692L4593j02183j80297k31145j80506p1611K2841N7926N0672
10929B28489O1289J3266n2997j06775p9633m1734k6933m560q489j4767j8468k605
$$ y = [286605, 274950, 293330, 308203, 318158, 305739, 251975, 213792, 180216, 202692, 236837, 322789, 400472, 454808, 520805, 602258, 658316, 629602, 551521, 532051, 494935, 458708, 432795, 378106, 357020, 353283, 333109, 295625, 280271, 269978, 229805, 256945, 275976, 268406, 267514, 249068, 236720, 229505, 248635, 220670, 220509, 229817, 251978, 275541, 289192, 285224, 257774, 231113, 217246, 202681, 220706, 213772, 207437, 210359, 200740, 221828, 269518, 308250, 307610, 318055, 351614, 376670, 372075, 376660, 380747, 395009, 398533, 417488, 475088, 503991, 514882, 569087, 645390, 733507, 828199, 862792, 760609, 580312, 349167, 168661, 97050, 119891, 177817, 228489, 289778, 303044, 250047, 143272, 63639, 21905, -5028, -9588, -18077, -32844, -51312, -53917]
10917e3917l3101P98L8725N2384J6645K3761J592J7340K9984J6708r331J5692
10905A17280K6886L800L288r923k0064k6256k4491l464o217j9976j1244O972L3379
10892F9970j2885j4417p365N5281M6621k3975m3791l2699P121Q508j8636N291
10880C9024J7772M337K8582j3012n062n173j5010M1472K6581j2262l8316k6287
10868D2646K1763l0157j1779K2355L726j9021o007J9724j5100q603j4108k6391
10856b0952l080q162k0028J0990J5520L0080L1898L9175J2377j8385m7331K0834
10844D2936Q017k9372N117q854j8692L610M3544J6466J3970j3145k1153M6900
10832H9344K198k2366J2840K2245j1337K099l4642k4055Q808J9829q112J988k8033
$$ y = [-53917, -87018, -86220, -47495, 4889, 21534, 45295, 46887, 64227, 94211, 110919, 101588, 117280, 144166, 147966, 151254, 141331, 121267, 95011, 70520, 67056, 60839, 40863, 29619, 36591, 69970, 57085, 42668, 35303, 90584, 137205, 113230, 69439, 36740, 43861, 52369, 33733, 39024, 56796, 61133, 89715, 76703, 71641, 66468, 51458, 92930, 119511, 107249, 68933, 42646, 64409, 34252, 22473, 44828, 48554, 29533, 23526, 43250, 28150, 19547, 5439, -20952, -24032, -32194, -52222, -41232, -25712, 4368, 36266, 75441, 87818, 69433, 22102, 42936, 50953, 21581, 26698, 17844, -848, 2762, 46306, 62772, 76742, 63597, 42444, 89344, 91542, 69176, 82016, 104261, 92924, 95023, 60381, 36326, 45134, 64963, 56851, 58839, 30806]
10819C0806k200l5781j7672J5324Q094L842j0864j4817J876N13R254P354N77Q138
10805D444j7512q33J7802K7420J6922Q085j2257l4238M243J1192k1568M03q368
10792d265J4570m903n229R072J8361j846J0655l297j0979Q531j0774J0678j4335
10779A6239k672p024j7186L7087L0157O06j7605k3690J3595L794j3295J8645p459
10766C1192j832M238J5153K3481j5128j7891P77o057j0159M528L0442j0511l7590
10753A0643k0948p729J1841M188q609P705K2496K721K2541r07m823J029j5663
10740B4485K6681O708j4734K4608J5688k1649k6296j4403M3978l687J058J29m189
10727E8377m045J112p606L4825J9871n0889q115J4778j9922O247n19n61j3384
$$ y = [30806, 28606, -7175, -24847, -9523, -1429, 2413, -8451, -23268, -21392, -20879, -11625, -4271, -3694, 4444, -13068, -13901, 3901, 31321, 48243, 56328, 44071, 9833, 14076, 25268, 3700, 4103, -4265, 10305, 5402, 173, 9245, 27606, 25760, 36415, 33118, 22139, 30670, 19896, 30574, 16239, 13567, 6543, -10643, 26444, 56601, 57207, 39602, 15912, 29507, 33301, 20006, 38651, 31192, 29360, 33598, 48751, 72232, 57104, 39213, 39990, 33933, 23774, 28302, 58744, 48233, 10643, -10305, -18034, -6193, -2005, -10614, -2909, 19587, 22308, 44849, 43942, 39119, 40148, 24485, 51166, 57874, 43140, 67748, 83436, 61787, 35491, 21088, 65066, 61379, 62437, 62566, 58377, 54332, 55444, 47838, 82663, 102534, 51645, 43530, 58308, 38386, 44633, 44114, 43553, 30169]
10714C0169j843o152Q452J2558N672K7424J771R654J6405J5360J5154j4385R880
10701A30119M4200O5549J28571K26852L85483O14701O87976M45489J65439k36579
10691B657800m58388m51442m11393m10213k95356k09034j14631l3593l6935l8248
10681A98567k7667k3068l1389j3666m2421j6406K0675J117m0273k8077l584j458
10669g650l620l518J3218P523Q108K2749P796R289p058m177J2027j5734K0378
10656E9331R191k5354o864k8268j82j0424K0090J2262r73l988p364J3744K8447
10643E9648J7239k7523J1958j5666o364j2391J3831j3129j6581m0470j4685L0934
10631a3199J9793j1436j2500J6901J6417k232l1258J7531J5068k3136p579J0527
$$ y = [30169, 28326, 22174, 30626, 43184, 48856, 76280, 78051, 87705, 104110, 119470, 134624, 120239, 130119, 174319, 239868, 368439, 595291, 980774, 1595475, 2283451, 2728940, 2894379, 2657800, 2199412, 1747970, 1336577, 926364, 631008, 421974, 307343, 273750, 236815, 198567, 170900, 147832, 116443, 102777, 60356, 43950, 64625, 65742, 25469, -2608, -6192, -7650, -11270, -14788, -1570, 5953, 14061, 36810, 44606, 53895, 46837, 42660, 54687, 38953, 59331, 68522, 43168, 36304, 8036, 7854, -2570, 17520, 29782, 28809, 24821, 17457, 31201, 59648, 76887, 49364, 61322, 45656, 39292, 26901, 40732, 27603, 11022, -29448, -44133, -13199, 6594, -4842, -17342, -441, 15976, 13744, -17514, 17, 15085, -8051, -15630, -5103]
10619e103j9156m3571l3698K2427J3101L5091K2008p705K681o347M011L3668j9822
10606b415n8026j4702j208J4354L5521K0930j1780l9033J2687K8856P268O671
10594h77q190m329j0111n977J7265L9682l2274M893L5346J6005l010k5528k3822
10581i27j1915L746M59j4103J2623J691k1603k2909P23K6360K3632N952p764j6048
10567b0083k4275J4313n760J6877K3370m654k9235Q4l4216j9051L806L1725L0010
10554a7089q319n445R415K0360q179k4043J6170J8562N620K4718J0626j4973n628
10541B1795j0657N173J5606l2274l6112Q356J5391l567L195K3860j180q583K2439
10528B3442J2069k8990j4381J9761J9484K2974n549k2890k2569J0579R103J2562
$$ y = [-5103, -24259, -67830, -101528, -79101, -66000, -30909, -8901, -16606, -13925, -20272, -16261, 17407, -2415, -60441, -75143, -76351, -61997, -26476, -5546, -17326, -56359, -43672, -14816, -7548, -877, -9067, -13396, -23507, -29484, -12219, 27463, -4811, 82, 35428, 51433, 48423, 22895, -927, -12842, -9096, -8637, -22740, -10117, -8426, -30029, -52938, -52215, -25855, -2223, 3729, -4035, -20083, -44358, -30045, -35805, -18928, 4442, -212, -29447, -29363, -63579, -82630, -78824, -47099, -17089, -25408, -30853, -21438, -1078, -9257, -33300, -17130, 1432, 7052, 31770, 42396, 27423, 21795, 11138, 16311, 31917, -357, -36469, -28113, -12722, -16289, -13094, 10766, 9586, 1003, 23442, 35511, 6521, -7860, 11901, 31385, 54359, 48810, 25920, 3351, 13930, 23033, 35595]
10516C5595J8657Q61l2933n5645l2492N73J7775O599J5485K7843J7593j7005k0746
10503a7840P273j6887q851K2558j2561j1438J5198K663m6185j0661L8009J9501
10491a9221R330J6762K2010n140L1140K3324o470k0598j9622j5585j4179N297
10479G048k3974k6813K2043L8131N360J030q999n0823J7144K4283L2660P671m3731
10466A030j0102n128N269k5469j964N632J9714j9646l142M24K6395K4730K3327
10453D1070l0523l8961P986N864l15j1762q754k521L4174N1001l159j6277k570
10440B5253j6930j5816l022k1889J5011K1459L660o519R514L271R663K001j1747
10427A3909j5105J0606N966j0198J5382j7829j5419o045J2537N604J7035J174
$$ y = [35595, 54252, 55113, 22180, -33465, -65957, -65384, -47609, -41010, -25525, 2318, 19911, 2906, -17840, -10567, -27454, -36305, -13747, -26308, -37746, -22548, -19885, -66070, -76731, -38722, -19221, -9891, 6871, 28881, 23741, 54881, 78205, 71735, 51137, 31515, 15930, 1751, 7048, -16926, -43739, -21696, 16435, 21795, 22825, 13826, -36997, -19853, 4430, 37090, 44761, 1030, -9072, -14200, -8931, -34400, -36364, -30732, -11018, -30664, -33806, -33382, -6987, 17743, 41070, 10547, -28414, -20428, -14564, -14879, -26641, -35395, -37916, -3742, 47259, 44100, 27823, 25253, 8323, -7493, -10515, -32404, -17393, 4066, 7726, 1207, 10721, 13992, 23655, 25656, 13909, -1196, 9410, 15376, 5178, 20560, 2731, -12688, -18733, -6196, -592, 16443, 17617]
10415A7617k1523L0521N503J725l068k9570J2153j9228J5483m772l0600k1340
10403d7099K7564M9037l235j1361j0767k7597j2046p284J8550K7396n591q713
10391a1146K2005L3338J9778j985q147Q42l313l5699l4470p730N15j7456L4152
10378i316N5948O063q844m3180j4083j2388J8457N0634M860l3486k7333J0672
10366a996j0969k5K1549J2430J7312J1227l4745m2246r672N005j706K7872R550
10353C586K4107m1413j0308K0780k5844R393K1115O032j1613q711K3116K8695
10341C8935p500k5047j7732k9407J4416K0683p76J0366J4086J5911N755p935j2068
10328A9687K4806J9604N433k0117l3182j1728j786J209l7791j852N1339q216j7789
$$ y = [17617, -3906, 26615, 32118, 33843, 30775, 1205, 13358, -5870, 9613, 4841, -25759, -47099, -19535, 29502, 26267, 14906, 4139, -23458, -35504, -42788, -24238, 3158, -2433, -11146, 10859, 44197, 63975, 61990, 53843, 54685, 51372, 15673, -18797, -26527, -26012, -43468, -9316, 46632, 52695, 43851, 671, -13412, -25800, -7343, 43291, 48151, 14665, -12668, -1996, -12965, -12990, 8559, 20989, 38301, 49528, 14783, -27463, -37135, -32130, -33836, -5964, 3586, 27693, -13720, -24028, -3248, -29092, -19699, 1416, 7448, -4165, -12876, 10240, 38935, 31435, 6388, -11344, -40751, -26335, -5652, -6428, 3938, 18024, 33935, 39690, 31755, 19687, 44493, 64097, 69530, 49413, 16231, 4503, 2717, 3926, -33865, -35717, 15622, 7406, -10383]
10315a0383k7380l0119J3888K6139Q667o294l986k1195l568K0672J5556n315k3710
10302d7028K714M3683L2301q679j0214q2M457J6277M057j9474p677j8066Q107
10289C76J6468J5443k1914k3094Q77j1981j9578Q609K5785J2060l8761k4021J0666
10276d9065K0123O862J9087J9941J4646m04j4054M129N483P967k5884k2100k0629
10263c3898l491J5382j0291L044J5517p619m4619j0024K8289K8151M3605l446
10251B0600j7956k8405q020J6641J0924j0080k0561J0538Q377R686R087J325k3373
10238b1217K340J3049N801L2760k3048k5227M6345k158k8300K3563K0752N413
10226E0073q46k9097k6746j7285M738m285K705o884J6736K9015l208k438J5816
$$ y = [-10383, -37763, -67882, -53994, -27855, -19188, -25482, -29468, -50663, -54231, -33559, -18003, -23318, -47028, -44314, -631, 31670, 22991, 12777, 12695, 17152, 33429, 37486, 18012, 10335, -7731, 376, 16844, 32287, 10373, -12721, -11844, -23825, -43403, -34794, -9009, 3051, -35710, -59731, -49065, -28942, -22080, -2993, 16948, 31594, 31190, 17136, 21265, 26748, 34715, 8831, -13269, -33898, -37389, -22007, -32298, -29254, -13737, -21356, -65975, -75999, -47710, -19559, 24046, 20600, 2644, -25761, -33781, -17140, -6216, -16296, -36857, -26319, -17942, -8256, 831, 2156, -21217, -18877, -5828, -27, 32733, 9685, -15542, 30803, 28645, 345, 23908, 44660, 50073, 49227, 20130, -6616, -23901, -19163, -23448, -20743, -27627, -10891, 18124, 14916, 12478, 28294]
10213B8294K3669M3940O784n460P699n299j3815j7565j8310j3039o557j4698o273
10200I370m278k979k1993j3205M034o35k8055M864J3973J6453K1521m582J5190
10187I678M758J0290k9295k0430N356k74j1241J611K9138L3046N895k6744m4960
10174c3172j0405K730O057J9619R841k4970j493R061j0979l394K0706N520j214
10161a2093L029j0338O383j242n687k1188M112J2375q06N262Q209j7181j5684
10148d4849n000Q091M549J8849M280J6473q780j9926p460K538P716m315J0327
10135a7507k192K2415N740k388Q171m45j3947M233M660r853m890k3663j047L6183
10121E470K5862J4893p977J7174j5326n736k7373K624p312K0879l457j493k5156
$$ y = [28294, 51963, 95903, 102687, 97227, 104926, 99627, 85812, 68247, 49937, 36898, 30341, 15643, 9370, 5092, 2113, -19880, -33085, -29051, -29686, -57741, -52877, -38904, -22451, -930, -5512, 9678, 14436, 24726, -4569, -24999, -19643, -19917, -31158, -29547, -409, 32637, 38532, 11788, -33172, -43577, -40847, -34790, -15171, -5330, -30300, -31793, -22732, -33711, -37105, -16399, -10879, -12093, -9064, -19402, -13019, -14261, -19948, -41136, -37024, -24649, -25455, -20193, -11984, -29165, -44849, -49849, -41758, -37209, -18360, -14080, 2393, -6387, -26313, -33773, -31235, -23519, -27834, -17507, -19699, 2716, 8456, 6068, 14239, 13794, -153, 4080, 8740, -1113, -6003, -29666, -30713, 5470, 31332, 46225, 38248, 55422, 40096, 34360, 6987, 9611, 2299, 23178, 19721, 18228, -6928]
10108f928j0245m434L3367J4006l5777l1132J4509L323J8476P01j7840j0709L2817
10095A34K4588q485l235K512q792k2701R259J0767J5222k833l437L834o718o397
10081C718k4589o862K9089Q767k5400k4354J1889K7446j4553Q161j9444k0237
10069d6369K0397J0236o885J5051J481K6364q862l1143j9421j513J3704P234k2513
10056d2239J1286K2887P912M030k9677j5351j2392Q620K6032L068j2041p582J9978
10043a5469K912R546J882k5232l1462k916m457M2306L0233N207J8020l576j812
10030B5182K85j0731n133L016k3348l6949k3700J2643J1722o70M5138J107n512
10017f950k2158J619L885o77K703J2415J0715j1568K1663L6010K9099o023r069
$$ y = [-6928, -17173, -21607, 11760, 25766, -10011, -41143, -26634, -23311, -4835, -4134, -21974, -32683, 134, 24722, 16237, 13002, 15514, 6722, -15979, -6720, 4047, 19269, 16436, 12999, 16833, 10115, 3718, -20871, -27733, 1356, 10123, -15277, -39631, -27742, -296, -14849, -6688, -26132, -46369, -25972, -15736, -22621, -7570, -6089, 20275, 11413, -19730, -39151, -40664, -26960, -19726, -42239, -30953, -8066, -154, 3876, -25801, -41152, -53544, -44924, -18892, -15824, -27865, -35447, -15469, -12557, -3011, -1129, -26361, -57823, -60739, -65196, -22890, 7343, 12550, 30570, 26994, 25182, 25467, 14736, 9603, 12619, -10729, -47678, -71378, -58735, -47013, -47683, -2545, -1438, -6950, -29108, -27489, -23604, -24281, -21578, -9163, 1552, -10016, 11647, 47657, 76756, 70733, 61664]
10004F1664j4149j7039j0611j3657O815l1155J048L2771K2660J7116J0218J057
9992F6738q0427m7999K7534R996n0J9153P23k0250J3599r230k4261J891j2383
9979e4966J6402M6894J8644P427j2709n8863l7560M403R824J5720P380K2945l178
9966a7637K4230K4181J177j6165N031l53k4617j0491l100M689k0630N208J7306
9953a1171K3520j4874J0508Q116J7703k0963n334k8005j5098J5970J0918J2148
9941C438K2360J5091q058j5500k4475k7586J0834K7974Q717k131j0442J5584P876
9928B3682J8090p488k5301J3738M1268k1284k5015L0696k5101j5838J5654j5510
9916G591j6072L145j2344j8567p210L0340P406M2981J4769K2516l6864l5657Q202
$$ y = [61664, 47515, 30476, 19865, 6208, 13023, -18132, -17084, 15687, 38347, 55463, 65681, 66738, -13689, -61688, -34154, -24158, -24208, -5055, -4332, -24582, -10983, -20213, -44474, -42583, -54966, -38564, 8330, 26974, 34401, 21692, -37171, -74731, -70328, -60504, -44784, -37404, -14459, -17637, 6593, 30774, 31951, 15786, 20817, 20464, -4153, -14644, -17744, -13055, -33685, -28477, -11171, 12349, -2525, 7983, 16099, 33802, 12839, 7505, -20500, -35598, -19628, -8710, 3438, 25798, 40889, 32831, 17331, -7144, -34730, -23896, 4078, 12795, 10664, 222, 15806, 23682, 41772, 34284, 8983, 22721, 63989, 42705, 17690, 48386, 23285, 7447, 23101, 7591, -8481, -5336, -17680, -36247, -43457, -13117, -5711, 37270, 52039, 74555, 37691, 2034, 10236]
9903A0236J2941J9815n225k3185L8572P920j3168l2879L765R204j7323J8341R795
9890C8809O443k2862r43K5544j1405j5766l2497q708k1433P671j7893j618K5598
9877b9060K0795L779J500K0268N231P60K3103j3285l8172N08k4855p921M857m418
9863c6910L8961K6553Q427L1792J2872J7369J0700M4349P9507R2819O1788l5323
9851C52904q0154p2930m5973l2288k7711m1696n128p567j9863j7449J0497j0620
9839B022j7065N618m024L756L6212l061j9620m184k5254O713L09p717J4124J7151
9825D980J4728m90K6727j1139k2209R822O707J855k8526L068o142L554K250O901
9811A2086K0297j1622J2952j6546l498j3218J823J9588l925j9039J2858j1429
$$ y = [10236, 23177, 42992, 37767, 14582, 53154, 61074, 47906, 15027, 18792, 27996, 10673, 29014, 38809, 45252, 22390, 21447, 46991, 35586, 19820, -12677, -21385, -42818, -35147, -53040, -54658, -29060, -8265, -4486, -2986, 17282, 22513, 23273, 46376, 33091, -5081, -4573, -29428, -37349, -32492, -36910, 2051, 28604, 37031, 68823, 81695, 99064, 109764, 154113, 233620, 326439, 388227, 352904, 272750, 199820, 153847, 121559, 93848, 52152, 47024, 39457, 19594, 2145, 12642, 2022, -15043, -9425, -13449, -9693, 26519, 23458, 3838, -346, -25600, -18887, -18578, -26295, -12171, 4980, 19708, 19218, 45945, 34806, 12597, 22419, 29126, 30981, 2455, 5523, -619, 2935, 5185, 12086, 32383, 20761, 33713, 17167, 13669, 451, 2274, 21862, 17937, -1102, 11756, 327]
9799C27J5711k3352k4476N945J3536J1217o555o694K597J50L7773K9039K6740
9786H1958j2615k0963k9739k2083k0385p548L4680J4178j8675o192p686j6896
9774c1966J3136J8050r9J3912j356k6543J8719J9657m0171m4786p698j5510J6672
9761f7983Q567M769J6450L0629K7818N176l533P944k0394r148Q502N214J3894
9748B7905K061K5112l4149k9489J6636K358j5429m780J2477K2947R964k0279R14
9735A6248J6167K6338P621l3954l8374L577N902J157J7520n289k5271J3269K2505
9722B7416o007k1600l2436l4006Q257J2383J5491L1538J3798j5623l176k3128
9710b7093o105K9391P924k5812j6129M772M0644K4162J1703q155l0073O81O145
$$ y = [327, 16038, -7314, -31790, -25845, -12309, -1092, -7647, -14341, -11744, -11594, 26179, 55218, 81958, 69343, 48380, 18641, -3442, -23827, -31375, 3305, 17483, -1192, -7384, -15070, -31966, -18830, -780, -879, 13033, 11677, -14866, 3853, 23510, -16661, -61447, -69145, -84655, -67983, -59416, -54647, -38197, -7568, 20250, 25426, 21893, 29837, 9443, 295, 8797, 14011, 27905, 29966, 55078, 20929, -8560, 8076, 10434, -4995, -9775, 2702, 25649, 35613, 15334, 16248, 32415, 58753, 66374, 32420, -5954, -2377, 3525, 4682, 22202, 16913, -8358, 4911, 27416, 21409, -191, -32627, -66633, -58376, -45993, -30502, 1036, 14834, -789, -3965, -27093, -33198, -3807, 4117, -21695, -37824, -33052, 7592, 31754, 43457, 35302, 5229, 5910, 12055]
9697A2055j2997k112O891R026L496J5406j1581n1849k301K2580O113j3921L78
9684a8816M218j3458k9991K5137M8918j6201q022q180J3601K212J5274K2056M7420
9671H4168j5865l1699j4618j3826k5748m80J5647q200r319K7100J1808N626q118
9658A6476j5313R890K7924K8626m785k5165j0818K8252j8489n2578O452K0932
9646A1404K004M58J5460K6289j1692j7314Q920n884k6217k3178m07k5313J3134
9633c2336K8226J9881j0367K0750p084l3161J6047Q721r203K6805N660l9102L65
9620d798n00j3587l682O345P279j8837q979m774J9929J9695j0030K7q067L569
9606a6410J8616m7110q820M7555K3642q165p674J470r939j8647O893j6053q860
$$ y = [12055, -942, -3054, 3837, 12863, 16359, 31765, 20184, -31665, -33966, -11386, -5273, -19194, -18816, -14598, -28056, -58047, -32910, 16008, -193, -8215, -16395, -2794, -582, 14692, 36748, 84168, 68303, 36604, 21986, 8160, -17588, -18068, -2421, -10621, -19940, 7160, 18968, 24594, 16476, 1163, 11053, 38977, 67603, 62818, 37653, 26835, 55087, 36598, -15980, -9528, 11404, 13408, 13866, 29326, 55615, 43923, 26609, 35529, 29645, 3428, -19750, -20157, -45470, -32336, -4110, 15771, 5404, 26154, 19070, -14091, 1956, 10677, 1474, 28279, 33939, -5163, -4798, -5298, -18885, -22567, -16222, -8943, -27780, -36759, -41533, -21604, -1909, -11939, -11912, -19979, -16410, 2206, -44904, -53724, -6169, 17473, 9308, 1634, 3104, -6835, -25482, -18589, -34642, -43502]
9593d3502L4017J5489K3581k3627j4232J871K8428O435M258j8053j0714K2454
9581B6405J7985r669r76j542m5552j0146M6059J5052j7045j4361n971J7525J9637
9568C7401q913k111J5221j0955J4990l937l684p540m8737j2846K285j7492n830
9555e2148J9462K9768N0695j3275m9416k3556o091j4702k4290J4524M3819K2375
9543b835j5662j2590M244N091J5540n269K3109K2633K129l3154j4393k566J3592
9530a31j50k914n090L665j2423n491L568L3323Q872j6549l00M661l877K2156l923
9515B5397k6033J4053R880o867L6494m350j3009J248j0518q567k3838m0268K5580
9502b0798P396j8895m82Q080k4241M255J5789L5229J2293l7936J8555R69l0755
$$ y = [-43502, -9485, 6004, 29585, 5958, -8274, -6403, 22025, 28460, 32718, 14665, 3951, 26405, 44390, 34721, 33745, 32203, -13349, -23495, 22564, 37616, 20571, 6210, 239, 17764, 37401, 28488, 26377, 41598, 30643, 45633, 41696, 38012, 30472, -18265, -31111, -28826, -46318, -52148, -32686, -2918, 47777, 34502, -14914, -38470, -44561, -59263, -83553, -69029, -25210, -2835, -18497, -31087, -26843, -21752, -6212, -11481, 11628, 34261, 36390, 3236, -11157, -13723, -131, -281, -3195, -8285, -4620, -17043, -22534, -18966, 14357, 23229, 6680, 6380, 11041, 7164, 29320, 25397, -636, 13417, 23297, 16430, 52924, 48574, 35565, 36813, 26295, 17728, -6110, -46378, -20798, -13402, -32297, -32779, -24699, -48940, -44685, -28896, 6333, 18626, -19310, -755, 214, -30541]
9489c0541j6174n408l206k2619K6921M9391J0940J4581M0815l9081l2095J815
9477d661O563q383M731m309N515m73k1747p108k3204r742J8564K8130J5137K654
9463A667J2850P260N167m1488R399R388R538k1919k915J6124R759l2824k7418
9450d5412J1240n673o502J7823O523M342j545J4403j712n857R868O528J592j4773
9436i155k2491J6824Q759L3596K9447j1561j0718l4556R23N5658k67p443p185
9423D1831k3190j8663J3075q041r466M001O497k620j5488K4859j0633L923J921
9410H006R592J3230j3972M704k274p439P478J5167J1388j3306k2499k855j4892
9397g672j4409K4310J861k0924N756r18j560l398j0709J1480L2459K5908l510
$$ y = [-30541, -46715, -52123, -55329, -77948, -51027, -1636, 9304, 23885, 64700, 25619, -6476, -4661, 1902, -6481, -1750, -6059, -544, -1017, -22764, -29872, -53076, -62818, -44254, -16124, -987, 1667, 14517, 21777, 26944, -14544, -5145, 4243, 13781, -8138, -11053, 5071, 14830, -17994, -45412, -34172, -39845, -46347, -28524, -22001, -17659, -19204, -4801, -6513, -12370, -2502, 4026, 5618, -9155, -31646, -14822, -6063, 27533, 56980, 45419, 34701, 145, 1068, 56726, 56459, 49016, 41831, 18641, -22, 13053, 5012, -4454, -453, 6044, 3424, -12064, 12795, 2162, 6085, 8006, 17598, 30828, 16856, 21560, 19286, 11847, 19325, 34492, 45880, 32574, 10075, 7220, -7672, -22081, 2229, 4090, -16834, -11078, -11996, -13556, -16954, -27663, -16183, 16276, 42184, 38674]
9384C8674l9615j0542R219R660j890L6220r383q271j6729k38o997j8128K4597
9371F577L4494m748p543L269k9705j0089L0581K1023r268j4050j474j6094j3986
9358a1013k9902K2562K2285r91j598n356l941q996J1989L7974q122j986k1866
9345A039R419R913M117k2301k8186L3177L8817j1287o164j8245m996r37j5951
9332a1585j1740j5998K0325l538J9833J1445K962K6406L1980k5245k1682q211
9320A4952m923K9174P171k5624M15l304l669J379l53J6401m694p985k2103j9257
9306b2420j2831K3381J8234K9439K7744k5433k3438L351L3729J7950l3950m6169
9294a0413k634R150n63L282M304j5263J9127J8070N906j9539k0661l041J768K3287
$$ y = [38674, -941, -11483, -2264, 7396, 5506, 41726, 32343, 24072, 7343, 7105, 108, -18020, 6577, 41071, 36323, 28780, 32049, 2344, -7745, 22836, 43859, 34591, 20541, 19067, 2973, -11013, -40915, -18353, 3932, 2941, 1343, -4013, -7954, -16950, -4961, 33013, 24891, 22905, 1039, 10458, 20371, 24488, 2187, -25999, 7178, 45995, 34708, 28544, 10299, 5303, 4366, -11585, -23325, -39323, -18998, -22536, -2703, 8742, 11704, 38110, 70090, 44845, 23163, 14952, 10029, 39203, 46374, 20750, 21165, 17861, 14192, 15571, 15218, 31619, 26925, 18940, -3163, -22420, -35251, -11870, 6364, 35803, 63547, 38114, 14676, 18027, 51756, 69706, 35756, -10413, -13047, -3897, -4460, -1178, 3126, -12137, 6990, 25060, 30966, 11427, -9234, -12275, -10507, 12780]
9280A2780K6530L7428j3458r867k9459l9146r014n896O076M765J7201J4183O328
9267A8451N824J6635K393J2918k5789J2354K800k8313j1992M596k284r240J6967
9254A5320J0303j623P531J4939J4930q095j9535R956J0351j2874j7772j2942J0089
9241B0578r457n091n527j00k2984j0085J1015J8911o78L8900L477J0024k344l9387
9227G252k060J9893r97o603J3618J3417j263j7075j7658j5648l445j2060J0777
9214a1852J5435R659Q66k9462L396J3666K2208R351j3996k4309p912q543L3446
9201A1953J7904p804o303K308j0289k698N887N622L011k1125j1047k2514K3095
9188a2000J0618J2780J0827k1364K647K5436Q045k6766r199l2794J3530L8943
$$ y = [12780, 39310, 76738, 63280, 53413, 23954, -15192, -24206, -30102, -24026, -19261, -2060, 12123, 18451, 24275, 40910, 43303, 56221, 30432, 42786, 45586, 17273, 5281, 9877, 7593, -1647, 15320, 25623, 24000, 31531, 46470, 61400, 53305, 33770, 43726, 54077, 41203, 23431, 10489, 20578, 11121, 6030, 503, 403, -22581, -32666, -21651, -2740, -3418, 35482, 38959, 48983, 46639, 7252, 5192, 25085, 24088, 17485, 31103, 44520, 43257, 26182, 8524, -7124, -10569, -22629, -11852, 3583, 13242, 14108, -15354, -11958, 1708, 23916, 33267, 19271, -5038, -12950, -21493, 11953, 29857, 22053, 15750, 18058, 7769, 5071, 10958, 16580, 19591, -1534, -12581, -35095, -12000, -1382, 11398, 22225, 861, 3508, 28944, 36989, 10223, 1024, -31770, -18240, 20703]
9176B0703J0602K1751K480j5822k0449j6927N310K3427J5382l18k0524j8238j0850
9163c473L4568m182j4793J2648N454R359L533q303L6552m08l1973j3212J0226
9150C5996O020K5183k2949k397Q361J3694k627J0623O155k509j9792n1780J8081
9137B2059L1409J7831R612k4235j9253j4224Q402K9017J3907k4330m5351K1921
9125B6765k33M1402L6930k0732j7133l887N150L2580l922k6067O777j7214K6423
9112H6839J7730k9646Q080j5367p489j260P855J0989O088Q078J1735Q938r0r717
9098A02763o308M5138K3486K485J1903J4499L1493K2221K4695j3927K0717P2862
9086C52027M0221K7851L0738N0913P0291J21864J05545J78180K97305M44297O03005
$$ y = [20703, 31305, 53056, 55536, 39714, 19265, 2338, 7648, 31075, 46457, 46139, 25615, 7377, -3473, 31095, 26913, 12120, 24768, 30222, 39581, 43114, 34811, 71363, 70955, 38982, 25770, 35996, 42016, 67199, 44250, 41853, 50214, 63908, 61281, 71904, 78059, 75550, 55758, 3978, 22059, 53468, 71299, 80911, 56676, 37423, 23199, 31601, 60618, 74525, 50195, 4844, 26765, 26532, 67934, 104864, 84132, 66999, 63112, 68262, 100842, 96920, 70853, 77630, 60416, 86839, 104569, 74923, 83003, 67636, 60147, 58887, 66742, 77731, 83819, 91897, 103632, 112570, 112480, 102763, 96455, 141593, 165079, 167564, 179467, 193966, 225459, 247680, 272375, 258448, 279165, 352027, 392248, 420099, 450837, 501750, 572041, 693905, 799450, 977630, 1274935, 1719232, 2322237]
9075B322237J043500J801438L155946M991780L922808r99813k632275k043916
9067A1561705k395981k740876k108447j295947p87313n09895l72915k57498j76018
9058I16815j46531j28055j09359n8655k3396l5202m1633m4320k5277m0290m7777
9047B16320j7547j5065R849r247J5275j4879k6319l6066k3501j0596J9767Q77
9035A08868l2194N430J1722O77L37j2669l103O817K7394j6888j8624M806R330
9022I1903M098k201K25k4050J1422L0015j5875K8K1765r532k7958l829j4756r639
9008E1616K9679J0233M362m3613m3698J3922L9509R413k7380j6491M6075J6297
8996H9924k3749l7561o226O018j9760K954k3851j0334k4214J5602M7746L3382
$$ y = [2322237, 3365737, 5167175, 8323121, 13314901, 17237709, 16237896, 13605621, 11561705, 9165724, 6424848, 4316401, 3020454, 2233141, 1723246, 1350331, 1092833, 916815, 770284, 642229, 532870, 474215, 450819, 415617, 373984, 329664, 304387, 264097, 216320, 198773, 183708, 193557, 184310, 199585, 184706, 158387, 122321, 98820, 88224, 107991, 108868, 76674, 82104, 93826, 94503, 94840, 82171, 79068, 85885, 113279, 96391, 77767, 82573, 91903, 96001, 93800, 94025, 69975, 81397, 111412, 95537, 95565, 117330, 107798, 79840, 76011, 61255, 51616, 81295, 91528, 95890, 52277, 8579, 22501, 62010, 71423, 44043, 27552, 73627, 89924, 66175, 28614, 22388, 28406, 8646, 11600, -12251, -22585, -46799, -31197, 16549, 49931]
8984D9931m249P235j1230k3639n577n879Q324L9640J0141M627o336k648k0087
8971D0253k0866J294r149P910N339k5126J9099L2657n996k4258k2429M9259K7987
8958G5974j2140k9471J6836K2375n8861k4775L6396L1403K7479j6965m4631j3778
8946I842N195j9944J1459L674M958Q838o21O373r274J3795j3516n483k7573p193
8932a9470J6479q455J7379K4120Q844K762J6252k4693k5473n006Q037Q096L2133
8919E1005n164l0012j8912j7701M987K8818R218j2401l1324k695J0421K0835k981
8906D094n818J0235j5905R084K6103O165j779L6382K0725k1668q955k3580l2864
8893B219J581j3763K0007L0376L4258J6845K2203J2549M4110N8822J16940J59077
$$ y = [49931, 45682, 52917, 41687, 18048, 12471, 6592, 14916, 54556, 64697, 69324, 62988, 60340, 40253, 19387, 20681, 11532, 19442, 24781, -345, 18754, 51411, 45415, 21157, -1272, 47987, 75974, 63834, 34363, 51199, 73574, 14713, -10062, 26334, 57737, 85216, 68251, 23620, 9842, 15037, -4907, 6552, 10226, 15184, 24022, 23401, 29774, 20500, 34295, 20779, 15296, -12277, -19470, -2991, -11446, 5933, 30053, 38897, 41659, 57911, 33218, 7745, 2739, 10776, 18872, 51005, 45841, 15829, -3083, -20784, -15797, 13021, 22239, 9838, -21486, -24181, -13760, 7075, 4094, -1724, 8511, -7394, 1690, 27793, 33958, 32179, 68561, 89286, 67618, 58663, 35083, 2219, 3800, -9963, 10044, 40420, 74678, 91523, 113726, 126275, 170385, 229207, 346147, 505224]
8881E05224P2410p5673q6177m7368m9476k0023j2644P3577J58425O8517l047r3556
8869D90189o8483m3211q5550r2120m8109m1568k5872J700o609j6218P677P91m8892
8856B3725j955L7869M615j8930m7239n129R278R697k9754R581J9372q950J2561
8843A4741K2323J4210K0496k0139j1578n086r570l0782j3344J07J6288Q871l875
8830B662J8537K4279R396k751l0052j5780l1930J5646M1995l7040n8318J186M4937
8817a7233J5519P364K096j5544J4342P790r347n03l6540Q537j6575j8950J6144
8804d2900M9959J8451K138j6573N325J3215K948J0742j1289k922P225L605j3455
8791B6469j6327l0065l530K4098n269j6745J5240L3858j5934k387M746N810Q841
$$ y = [505224, 577634, 501961, 415784, 368416, 318940, 298917, 286273, 359850, 518275, 586792, 583745, 490189, 421706, 378495, 292945, 200825, 152716, 111148, 85276, 86976, 80367, 64149, 71826, 72617, 23725, 21770, 59639, 64254, 45324, -1915, -7044, 2234, 11931, -17823, -8242, 11130, 2180, 14741, 37064, 51274, 71770, 51631, 40053, 34967, 25397, -5385, -18729, -18622, -2334, 6537, 2662, 21199, 45478, 54874, 52123, 22071, 6291, -25639, -9993, 32002, -5038, -63356, -62170, -17233, -1714, 5650, 7746, -7798, 6544, 14334, 4987, 4484, -32056, -23519, -40094, -59044, -42900, 7059, 25510, 27648, 11075, 16400, 29615, 32563, 43305, 32016, 29094, 36319, 39924, 26469, 10142, -19923, -23453, 645, -4624, -21369, -6129, 27729, 11795, 9408, 14154, 19964, 28805]
8778B8805J6100J2878l676k5495j7535k8563R900J5942M838J6725J1304J6912
8766E8135j4416k6353k0591J4971l952K3824L5037j6498k9881p804r195K746O078
8753A2101N731J5391J1164j5599j7670J6203j2435J7469L0891K0445O590j9844
8741G0437j5902O518K8202J3663j5479o944J5801k1460k7394l4764j6716L6611
8729C2573L1834J7040Q461m028J482j2689J705j1135j2835k1977k5873L3817K7928
8716F6303j8650l2274K556R988P224K9616M538k584J8759M626k2484K845j0309
8703F0154K8584J9528j5389m631j0928m287L2837P068k192m443j8488K8189K6244
8690A42246P152Q425j8452P598k01m0194j0952J3215K2093Q901j1287N30j1609
$$ y = [28805, 44905, 57783, 54107, 28612, 11077, -17486, -7586, 8356, 13194, 29919, 41223, 58135, 43719, 17366, -3225, 11746, 7794, 31618, 66655, 50157, 20276, 12472, 3277, 6023, 12101, 17832, 33223, 44387, 28788, 11118, 27321, 14886, 32355, 63246, 83691, 90281, 70437, 54535, 61053, 89255, 102918, 87439, 80495, 96296, 74836, 47442, 12678, -4038, 32573, 64407, 81447, 89908, 85880, 87362, 74673, 76378, 65243, 52408, 30431, 4558, 38375, 66303, 47653, 15379, 17935, 27923, 35147, 64763, 69301, 66717, 85476, 90102, 67618, 70463, 60154, 88738, 108266, 92877, 88246, 77318, 73031, 105868, 112936, 110744, 106301, 87813, 116002, 142246, 149398, 157823, 139371, 146969, 146768, 106574, 95622, 108837, 130930, 139831, 128544, 129074, 117465]
8677A17465J2941j6107O181p324p491j5510k1746P261K8073L2946M0077J3169
8665A89935O072o949K553K4237K8444k3404j7423J0034M5868J7249J3713L3919
8653C24248j4603k7528J5569N567k3394j7672J9231J2569j2852k078j1031N576
8641B73602M6599L1401J0212r244o310L3072J1948K1194N6622L8685J1654L6974
8629E56409O6245J4482K6932K5427K1970j412J0956L9760j1524m0601J2284L6945
8617G57873j8063l0486j8288m1879p1226l4177J1263M6006P4927O9991j0864l0174
8605G04903m1912l3432k6830o5771n7660k3249j1225n1499n4449l5710l6542n4317
8593B12307p706K3589j6555k2719K2766k5339l1738L657P77j0108J5242k017k2169
$$ y = [117465, 130406, 114299, 120480, 113156, 105665, 90155, 68409, 75670, 103743, 136689, 176766, 189935, 196007, 189058, 191611, 215848, 244292, 220888, 203465, 213499, 259367, 276616, 290329, 324248, 309645, 282117, 297686, 303253, 279859, 262187, 281418, 293987, 281135, 279057, 268026, 273602, 320201, 351602, 361814, 352570, 346260, 379332, 391280, 412474, 469096, 507781, 519435, 556409, 622654, 637136, 664068, 689495, 711465, 710053, 721009, 760769, 749245, 708644, 720928, 757873, 739810, 709324, 691036, 649157, 577931, 543754, 555017, 601023, 675950, 745941, 735077, 704903, 662991, 629559, 602729, 536958, 479298, 456049, 444824, 393325, 338876, 303166, 266624, 212307, 204601, 228190, 211635, 188916, 211682, 186343, 154605, 158262, 159039, 148931, 164173, 162156, 139987]
8580A39987q742p940j0016q692P54j921L927k8497j5944j894o879k955q00q017
8566D2371K2484L6289j293N5049L4371l2040m0311j6209N693l0173j5375m044
8554E6812l4365K0403M2655o97k0581k3744L676j997k4334k069m35Q470J5412
8541C9206n164O120k86q611j6838K648K0099J2665o0k8575J268o571O958m920
8527A7939k7576l6330j0850M654L0165J5249K5952J5893l3725R979j6033j3754
8515a8437K7278L496L7055K0330l3695J8J5220j6674q297o327K4627J5961K4737
8502H5292j348k7219o585m535k450r142l851l7923l7523J4441K0947K2830J1273
8489B4207j2235Q678r794k1032L2571M931Q273J1790k952k414M379J0578J0451
$$ y = [139987, 131245, 123305, 113289, 104597, 105351, 103430, 107357, 78860, 62916, 61022, 54143, 51188, 50388, 42371, 64855, 101144, 99851, 154900, 189271, 157231, 116920, 100711, 106404, 76231, 60856, 56812, 22447, 42850, 85505, 84808, 64227, 40483, 44159, 42162, 17828, 15759, 15324, 23794, 39206, 34042, 40162, 39876, 31265, 14427, 17075, 37174, 49839, 49779, 21204, 22472, 15901, 22859, 17939, -9637, -45967, -56817, -52163, -21998, -6749, 19203, 35096, 1371, 11350, -4683, -18437, 8841, 12337, 49392, 69722, 36027, 36045, 51265, 34591, 26294, 19967, 44594, 60555, 85292, 83944, 56725, 50140, 45605, 43155, 34013, 30162, -7761, -45284, -30843, -9896, 12934, 24207, 11972, 20650, 10856, -10176, 22395, 27326, 35599, 47389, 44437, 42023, 46402, 56980, 67431]
8476F7431j9179k1726P194k736l5908j9649K6369J4514P116R540J8628L1304P900
8463I0798o456k4571l0142j5935P947J1618K6224k1110k5717m534j9757M3348
8451C1713j2255j3934N1350K6508L9547L4381J2903j7358j3079j1882k9201k3115
8439G5578j5308m354l2503k5223j7253L0142M8783L1983R012k9822l7317j5980
8427A7738j449J3825R822J979n595l4803O528J9294J5396P043n307k161q996k1918
8413A1396j7742J0692J6491J3377q897o906M411J9828k970N477J7446O8103R0982
8400B21688M8890k564m3389m3608k8682n745j4352k5821n694N878k4067r296j9703
8387E3535K6543O882k6677j3177P576j8973k239J1600j3247j2615j4293j3293
$$ y = [67431, 48252, 26526, 33720, 30984, -4924, -24573, 1796, 16310, 23426, 32966, 51594, 82898, 90798, 84342, 59771, 29629, 13694, 21641, 33259, 59483, 38373, 12656, 8122, -11635, 31713, 19458, 5524, 56874, 83382, 122929, 157310, 170213, 152855, 139776, 127894, 98693, 75578, 60270, 55916, 23413, -1810, -19063, 11079, 59862, 91845, 100857, 71035, 33718, 17738, 16289, 30114, 39936, 41915, 36320, 1517, 8045, 27339, 42735, 49778, 44471, 42310, 33314, 11396, -6346, 4346, 20837, 34214, 25317, 18411, 22822, 42650, 39680, 45157, 62603, 130706, 221688, 270578, 268014, 224625, 181017, 152335, 146590, 132238, 106417, 100723, 106601, 82534, 73238, 53535, 80078, 86960, 60283, 47106, 54682, 35709, 33470, 45070, 31823, 19208, 4915, -8378]
8375h378Q084L7847m278k1535j3362K1579L084p648Q316J0722j0145p568K6382
8362D3100k0112P963J535J331j89L4582N4712N0466J3588o7152p0277l4302j8623
8349c378N051M641Q474M746J4927K3371Q550K917l3430q35k2783Q76k0203K1325
8335A4249J8101J952o768l5083q778j8521M484K1934J4317j3056P363K0926n04
8322B0616j4427j1121j642J4788K3165K4574n502l3309k0094n546K7094M0668
8310E9264J8145k8630m9388j2936Q764K4723J4255r340j8501K1883K7129j7484
8298C7884l9576l103P701K116n82J7445K988J7307p065L163J7039l9142k4111
8285g936q098j8024K3014L7861M431k0044l6658j4097K5536K9240P575j0426j1340
$$ y = [-8378, -294, 37553, 33275, 11740, -1622, 19957, 23041, 15393, 23709, 34431, 24286, 16718, 43100, 22988, 30951, 32486, 33817, 33628, 68210, 122922, 173388, 186976, 119824, 49547, 15245, -3378, 1673, 6314, 14788, 19534, 34461, 57832, 66382, 69299, 35869, 35034, 12251, 13127, -7076, 14249, 32350, 34302, 27534, -7549, -16327, -34848, -30364, -8430, 5887, -7169, 194, 21120, 20616, 6189, -4932, -6574, 8214, 31379, 55953, 50451, 17142, -2952, -8498, 18596, 59264, 77409, 48779, -609, -13545, -4781, 19942, 34197, 24857, 6356, 28239, 55368, 37884, -1692, -4795, 2906, 5022, 4440, 21885, 24873, 42180, 35115, 38278, 55317, 16175, -7936, -16034, -34058, -11044, 26817, 31248, 11204, -25454, -39551, -14015, 15225, 22800, 12374, 1034]
8272A034l620O367l747M453K0722J7986j9097k70j3299r618j5794q73J8087J8903
8258B1234j0396l9460j3515J5196P203K0555M7649k2926k172J0925k7266k0507
8246a3480K3751Q20k2530j4695k2088J0587j183j0555K3364J1766J865J9058R739
8233A6419n128k5017j603j9871J3324J0937N067M182O917J9483m520m4878k2540
8220d7228J5554L8458J5807K2101K033q76j3543l4491m4725J235J1434K6229M0738
8207C2726J4313j0931J1917j8465l1708J7793J0742k3272q419J6665K4634K6238
8195F2233q685m5668l5517p1K1867Q095J8832K9453K6526k0601j1797k1234K846
8182B6279k4091J620j9011n765K4645N1058j8250n413j9338P339J4684J2556j6710
$$ y = [1034, -2586, 3781, 34, 4487, 25209, 43195, 24098, 23828, 10529, 911, -14883, -15756, 2331, 21234, 10838, -28622, -42137, -26941, -19738, 817, 48466, 25540, 23368, 34293, 7027, -13480, 10271, 11091, -11439, -26134, -48222, -37635, -38818, -49373, -26009, -14243, -12378, 6680, 16419, 11291, -13726, -15329, -35200, -21876, -10939, -5872, -1690, 5227, 24710, 20190, -24688, -47228, -31674, 6784, 22591, 44692, 46725, 45849, 32306, -2185, -46910, -45675, -34241, -8012, 32726, 47039, 36108, 48025, 29560, -2148, 15645, 26387, 3115, -5304, 11361, 35995, 62233, 53548, 7880, -27637, -27708, -5841, 2254, 21086, 50539, 77065, 56464, 44667, 23433, 26279, 2188, 3808, -15203, -20968, 3677, 54735, 36485, 31072, 11734, 19073, 33757, 46313, 29603]
8169B9603j9263j95M9462N6292M3613J1812N86k5421k2759j7421k1697m8635j9805
8156A6172k721Q209l635j6840r833K501j254J6680K2628k9010l0653n841L4410
8143H13K1792o919k6950j0805J0683R986O622j2526l1439L526K1538K709j1279
8130b2249m66P27P101K0690N3306M4628M0580K0895j4358k4505l4325n0388m285
8117C7351O429j4641n793Q108k738k680j7267j681J5381M896Q616k1187l1273
8104a6479m8523J4686R181P784r905P584M1765Q618o332J413J7547K5800M894
8091E8033k0203j1959m160k2724K2302P471m919J4828N044K1921j0224j7644n986
8078C1780L25j8239j8529N341J9127K2934l2749n320J1749L6939N09k4977q67
$$ y = [29603, 10340, 10145, 59607, 115899, 159512, 171324, 171910, 146489, 123730, 106309, 84612, 35977, 16172, 13451, 21660, 18025, 1185, -8648, -6147, -7401, 9279, 31907, 2897, -27756, -33597, 813, 22605, 15686, -11264, -22069, -11386, -1400, 5222, -7304, -38743, -35217, -13679, -10970, -22249, -22715, -21988, -14887, 5803, 59109, 103737, 144317, 165212, 150854, 126349, 92024, 41636, 37351, 43780, 29139, 23346, 31454, 28716, 26036, 8769, 7088, 22469, 27365, 35981, 14794, -16479, -65002, -50316, -41135, -33351, -43256, -35672, 6093, 14711, 8379, 9792, 27339, 53139, 58033, 37830, 25871, 21711, -1013, 21289, 28760, 23841, 38669, 43713, 65634, 55410, 37766, 31780, 32105, 13866, -4663, 678, 19805, 42739, 9990, 4670, 16419, 53358, 53867, 28890, 28023]
8065B8023Q21K8903N8359M3367L8380N414j0322K7209L7168k7647K7674K8838
8053B86187K6849k6766l5689n081k7078M357J2841J0184L5875J9551r015k4767
8041B67448o091k974j5130q361j941p021j9673k7691K2830K5711M068J5182o897
8028B39460l4250q321j1116O130J189N848L2518K5596K733L8260R3140P7578J19480
8015E88245J56931K00393J53890j4107j01727j24786j33787p7485p9839p3472
8005D94256k7101R031M1720R4212J25526L8320o2032q8121j19663j02542m9987
7994C53619l8380l5754o4873l5251J8773Q440j5194k6093p583K6953J3896r749
7982A88804q215Q789K0642j6943J1806J9928K2902L9383M1162O5485P2786O1125
$$ y = [28023, 28844, 57747, 116106, 159473, 197853, 203267, 192945, 220154, 257322, 229675, 257349, 286187, 313036, 286270, 250581, 245500, 218422, 222779, 235620, 245804, 281679, 301230, 292215, 267448, 261357, 258383, 243253, 234892, 232951, 225930, 206257, 178566, 201396, 227107, 231175, 246357, 239460, 205210, 196889, 185773, 191903, 193092, 198940, 231458, 257054, 259787, 298047, 391187, 468765, 588245, 745176, 945569, 1099459, 1085352, 983625, 858839, 725052, 647567, 567728, 494256, 467155, 476186, 517906, 612118, 737644, 775964, 713932, 625811, 506148, 403606, 353619, 315239, 279485, 214612, 179361, 198134, 206574, 191380, 165287, 157704, 184657, 198553, 188804, 180589, 189378, 210020, 193077, 204883, 224811, 247713, 287096, 328258, 393743, 466529, 527654]
7970E27654Q4784O3303L358k3333k8756n8474o1243j7181j5954M5142P1687L3747
7958F24734j8059n7857j02852m0951m4400o2710m2720l1769k8022m6383N377j3974
7946A40414l808n427l4496r755j9674r406N864L3277k972m1252L0555O748r1P98
7932I0775J8951M6141N3990K4899P279Q980M799n676M796o235k1092l4892j9190
7919A73525l5367l1320j2894K2522L0498j3146j5900k7859n9993J7459J1996P07
7907F0228j0388j2167l5173r449J6233j715r649L7686L668l274K380k9278j4907
7894e805N089K0495J5166R063n202j2279k6817k466q561N633L2664K9363J6492
7881G2835l5388k8261m202J3325O552l630o221O870J5907k5955K5138M713j571
$$ y = [527654, 612438, 675741, 679099, 655766, 627010, 568536, 507293, 490112, 474158, 519300, 590987, 624734, 606675, 548818, 445966, 405015, 360615, 297905, 255185, 223416, 195394, 149011, 154388, 140414, 136606, 131179, 96683, 86928, 67254, 57848, 63712, 96989, 94017, 52765, 83320, 90068, 89977, 90775, 109726, 155867, 209857, 234756, 242035, 251015, 255814, 250138, 254934, 248699, 227607, 192715, 173525, 138158, 106838, 93944, 116466, 146964, 133818, 117918, 90059, 30066, 47525, 59521, 60228, 49840, 37673, 2500, -6949, 9284, 7569, -2080, 35606, 39274, 36000, 38380, 9102, -5805, -716, 19779, 34945, 44008, 38806, 26527, -290, -2756, -11317, -5684, 26980, 56343, 72835, 37447, 9186, 4984, 18309, 24861, 21231, 15010, 21880, 37787, 11832, 36970, 41683, 40112]
7868D0112k695j4001M636j309J1133j3188m8033r756J0826J4992Q781J0824o170
7855F152k0229J7192L772o3k8993q814o89Q826K153j4175k323Q056j5883j2350
7841e7368L1417N887K6417J3562P996l481o169j1981j2799K203K1653L232j311
7828A9258O973j9990J0548K350M810J5392K7503j137j2245j2933m3906m2813j3315
7815e9505K6090j892N782n847J0315q281k0325K1853K2397r090J4263L7009R642
7802D2411k3531j0960j4726L1890n365j0212O104k2686k6647J887N299J6636O015
7789c885j8758L1600J6997k90o30k6072N754K5398Q898j3763k8904k8662M589
7776b7728P97k9234J1439K0957K7885j9495N068K6398J8961Q303m2961j424K3164
$$ y = [40112, 37417, 23416, 28052, 26743, 37876, 24688, -23345, -33101, -22275, -7283, 1498, 12322, 6152, -14077, 3115, 6887, 6824, -22169, -30983, -31672, -22846, -20693, -34868, -37191, -29135, -45018, -57368, -25951, -20064, 6353, 19915, 27911, 24430, 18261, 6280, -6519, -4316, 17337, 20569, 19258, 26231, 6241, 16789, 19139, 23949, 39341, 66844, 65707, 53462, 40529, -3377, -46190, -59505, -33415, -35307, -29525, -35372, -25057, -33338, -53663, -31810, -9413, -18503, -4240, 32769, 42411, 18880, 7920, -6806, 25084, 19719, 9507, 15611, -7075, -33722, -31835, -26536, -9900, -3885, -22643, 8957, 25954, 25664, 25034, -1038, 4716, 30114, 39012, 25249, -3655, -32317, -27728, -26931, -56165, -44726, -23769, 4116, -15379, -10311, 16087, 35048, 43351, 390, -1034, 22130]
7763B2130n868j2268j4456j9075N317J3723J1838j5114k0701J7850K456K68J6634
7750B734L4290O399k9837k1950K5885l919j0642Q885K6876j7931q201j4965R176
7737F800M6834J4516k1947l4509l2403J111j4082K5814L1049j7487r168P399m4940
7724d1013o035K2469m307Q6J3243N900l481q63l761O2j0405L6o303J5027K8074
7709H729L841l5848k9495K0493J4742J4520k8526j1796j9515p230O140J6378K2419
7696b5148J2347J2125k3957l0569K2716J9273K9185l7306l2132j0513m147K5168
7684d2958j6M181M0698J037n557K3106r641j0519K051q097J9915k763j1859l9811
7670d0233J0841j4795k1859J0226K4911J2729j8953Q212O80l588j6421J7487O2241
$$ y = [22130, 16262, 3994, -10462, -29537, -24220, -10497, 1341, -13773, -34474, -16624, -14168, -13900, 2734, 37024, 43423, 13586, -8364, 17521, 13602, 2960, 11845, 38721, 20790, 12589, -2376, 6800, 53634, 68150, 46203, 11694, -20709, -19598, -33680, -7866, 23183, 5696, -3472, 3927, -41013, -47048, -24579, -28886, -28800, -15557, -9657, -13138, -14001, -17762, -17700, -28105, -28069, -34372, -19345, 8729, 12570, -23278, -52773, -32280, -17538, -3018, -31544, -43340, -62855, -70085, -63945, -47567, -25148, -12801, -676, -24633, -55202, -32486, -13213, 15972, -21334, -53466, -63979, -68126, -42958, -42974, -38793, 1905, 2942, -2615, 20491, 10850, 331, 2382, -5715, 14200, 11437, -422, -40233, -29392, -44187, -66046, -55820, -30909, -18180, -37133, -28921, -28241, -31829, -48250, -30763, 31478]
7657C1478R462O39k1110j3627N610m556R224K464q177j6124L695N450j1741j2869
7643b0182j5161L4163l928m5960j4612N537J0196o246K4749J3736J000J9995P887
7630A1174j7541R41L1731J4241j0601k0533j3603J9495L1205j1573k403k6489
7618F044l948Q138J051r815j6156K984R600R04K3985K5236n464j6017K813p676
7604B1679j0789J4985p051k2576j0972M136l139j0723K3425j9276j8181Q868J3192
7591a6422j1247K3293J0275R107l1171J418j5415N712L9016K6389p890l4383j0568
7578a1886J8047J3887N738k2988j3882j4413J1580J257J172j8652j0613K119Q833
7565b9801j4500J6348M1212J7099k7777m4099L0895M1357l773k2961j0828j7043
$$ y = [31478, 40940, 41579, 20469, 6842, 12452, 7896, 17120, 19584, 11407, -4717, -1022, 4428, -7313, -20182, -35343, -1180, -5108, -51068, -65680, -60143, -49947, -56193, -31444, -17708, -16708, 3287, 11174, -6367, -5426, 26305, 40546, 29945, 9412, -4191, 15304, 46509, 34936, 32533, 6044, 2096, 10234, 11285, 1470, -14686, -11702, -2102, -1198, 22787, 48023, 42559, 26542, 29355, 21679, 10890, 25875, 18824, -3752, -14724, -10588, -13727, -24450, -1025, -20301, -38482, -29614, -16422, -27669, -4376, 5899, 15006, -16165, -14747, -30162, -24450, 14566, 40955, 33065, -1318, -11886, 6161, 20048, 25786, 2798, -11084, -25497, -13917, -12660, -11488, -30140, -40753, -38634, -29801, -44301, -27953, 13259, 30358, 2581, -41518, -10623, 30734, 26961, 4000, -6828, -23871]
7553b3871n164L7560k194j9465j8736R508M814K2776P503o155j7862r237L001
7540a7522M18J548P333N0834J3854m6824n3992Q147n829k1113k3443K9076L5577
7527b1936J3189Q839o208J4451j0957q458K1334J8237q14j9159q174p570J9517
7514A2291o952P358j6733P268J644L238m799l2861Q490M363P467q037P758q725
7500a8230k3109j599K3422r879j3578j114M003K0504K243K481j2073j1214J7634
7487b0509J8001p055J0593P488K7416k2960l0124l5846K0498R479P238r145m5639
7474g0565q371K3665L0310P737r493p370J4474N585J0584j0801r684O730R991
7461g208k5659l0545k180K6831L1605J2154J7303J4637r278k6236q709J7465M492
$$ y = [-23871, -29035, 8525, 6331, -13134, -31870, -22362, -17548, 5228, 12731, 6576, -11286, -20523, -17522, -17104, -15556, -8223, 42611, 56465, 9641, -44351, -36204, -42033, -63146, -86589, -57513, -21936, -8747, 92, -6116, 8335, -2622, -11080, 10254, 28491, 27677, 8518, 344, -7226, 12291, 5339, 12697, -4036, 3232, 4876, 8114, 3315, -29546, -21056, -16693, -9226, -17263, -9505, -18230, -41339, -42938, -19516, -29395, -42973, -44087, -40084, -19580, -17337, -14856, -26929, -38143, -20509, -2508, -9563, 1030, 8518, 35934, 12974, -17150, -52996, -32498, -23019, -15781, -24926, -70565, -78936, -55271, -24961, -17224, -26717, -34087, -19613, -14028, -3444, -14245, -23929, -17199, -7208, -32867, -63412, -65592, -38761, -7156, 4998, 22301, 36938, 27660, 1424, -7285, 10180, 14672]
7448A4672m819r300l989j723r142l039K443j9308J0892L4940k0801j5322J0790
7435a3706j4952J2881J1245K060J9564m791K624q259p032k3970q238R505J2713
7422a0356j3806N953L816k5530R998K0503J3733O696j7570k6171k6J1355L3804
7409A2399r913r098J2583j5603R921K8164j1328m3332j730K934J442J8756J2120
7396G315p133m982k6830r436J7027n429L4163R111k344n442l9099p404J6830O436
7382a7217L778p729j9864K976J3251j6474k5347K0000M6504o39k5531j2156J3916
7369b4532L392J3910K252j3992j9821j8696k087J0676K7523o513o775Q838o239
7356c2064L522M418k2137r992K2873J7940j9042J1720J5910k517p996l7221L233
$$ y = [14672, 9853, 553, -3436, -5159, -14301, -17340, -14897, -34205, -23313, 11627, -9174, -24496, -13706, -28658, -15777, -4532, -2472, 17092, 12301, 14925, 6666, -366, -24336, -32574, -23069, -10356, -24162, -18209, -14393, -39923, -29925, -9422, 4311, 11007, -6563, -32734, -32760, -21405, 12399, 2486, -6612, 5971, -9632, 289, 28453, 17125, -26207, -27937, -25003, -23561, -4805, 7315, 182, -4800, -31630, -41066, -24039, -29468, 4695, 13806, 11462, 6020, -33079, -40483, -23653, -17217, -13439, -21168, -41032, -38056, -24805, -41279, -66626, -46626, -122, -761, -26292, -38448, -24532, -21140, -7230, -4978, -18970, -38791, -57487, -59574, -48898, -21375, -27888, -34663, -25825, -32064, -28542, -24124, -46261, -56253, -33380, -15440, -34482, -22762, -6852, -9369, -17365, -54586, -51353]
7343e1353k2316L780L1341K2912l242J1812j8617j8890l1831K0564L6288N215
7331a4337J0642J3874j6675J9925L0487J269K0628p249k961j0826l1355k906J6329
7318B6845J4256K713l4294o161p091M586k0J8547J5117P765j2283J1937J1596
7305E3513k9735l1208l2398K8191M1272N617j5800k0508k8753j1299j592K7825
7293a4875p416k0184O56J588J5277o489n640M198M7456J9472o74k5629j7992N658
7279d594j0072J9319J3004l295p234j5325J4664M328M29k6118l1090K126R543
7266c4315N823J4470J0869j5592M174K616j3923R033m271K1653L4774j1365l6826
7253a2880j2678K0952p278O032r658o312J9333M4315m479n22j1224k0432K506
$$ y = [-51353, -73669, -69889, -38548, -15636, -18878, -7066, -25683, -44573, -76404, -55840, -19552, -14337, -3695, 10179, -6496, 13429, 43916, 45185, 65813, 58564, 55603, 44777, 13422, 10516, 26845, 41101, 43814, 9520, 3359, -3732, 854, 834, 19381, 34498, 42263, 29980, 41917, 53513, 23778, -7430, -39828, -11637, 29635, 35252, 19452, -1056, -29809, -41108, -42700, -14875, -22291, -42475, -41819, -40231, -24954, -31443, -37083, -32885, 14571, 34043, 33369, 7740, -10252, -4594, -14666, 4653, 17657, 14362, 7128, -8197, 6467, 10795, 11224, -14894, -45984, -43858, -34315, -28492, -14022, -3153, -18745, -14571, -11955, -25878, -16845, -21116, 537, 35311, 23946, -12880, -25558, -4606, -11884, -5852, -15510, -21822, -2489, 41826, 37347, 36825, 25601, 5169, 7675]
7240G675j1714J672k8957J1682K0124M40j2199R968K5364o827k8660K5019J5604
7227B9191j1326k6206j0183L0796J0631R144L286j1085j5509m5900k5432M0352
7215b2241K7549q247n492M743P817j0886l261P579n483q290k1377J6296m772L1549
7201E484M3569J8866l2147l3815p5j3887l719l780n075J9705j5341p777k553k667
7187c3212n137N09L3666K7267k7261l6895M53J5810N849J2944k910j3830J2420
7174a0327J9647L326j3801k989j675R429P17j9734R241J2746j4203P166K885R449
7160A1877L693n579r535L5815J9778k3048n2234k5066L1999N1940r460m7828j8410
7147c6058J7990L6652k007M865j3961k32q139k6196Q927N691m7020l4606K1368
$$ y = [7675, -4039, -2367, -31324, -19642, 482, 922, -11277, -1309, 24055, 17228, -11432, 13587, 29191, 17865, -8341, -18524, 12272, 22903, 32047, 35333, 24248, 8739, -37161, -62593, -22241, 5308, -2939, -8431, -3688, 4129, -6757, -10018, -2439, -7922, -16212, -37589, -21293, -26065, 5484, 49053, 67919, 35772, 1957, 1882, -12005, -15724, -19504, -24579, -4874, -20215, -27992, -30545, -33212, -38349, -37840, -4174, 23093, -4168, -41063, -40610, -24800, -18951, -6007, -8917, -22747, -10327, 9320, 12646, -1155, -4144, -5819, 3610, 4327, -15407, -6166, 6580, -7623, -457, 2428, 11877, 15570, 9991, 456, 36271, 56049, 33001, -19233, -44299, -12300, 39640, 30180, -17648, -36058, -18068, 18584, 16577, 21442, 7481, 7249, -890, -27086, -18159, -12468, -59488, -94094, -72726]
7134g2726M763k805k209M963M884K1563K1977J3304L6772J522l3005o508K059
7121e446k9041L1001J0488K726m8261l3163L2648L5176m681J5919K9735R039k243
7108D3897n648o856k2460k85r827N257q277J2372L7810J4338j4017j3316K4145
7095E7133j8588L613J1069m048k0700P000J9489P54m8899k4646j4925Q304N898
7082a8546m3447R94K2099K4458K4261l1281j6919K687k756L9681J7041o10J4772
7069C2434j041q673o641j9196O753k513P936O589j1220M740j9827j7671M0056
7056A1726l7330n5266m116K7518M782J441O061J9909K1502J2935j0351k5652J2068
7043a4773L1310J2948j1302o892n166j7675J7663J2586j8592p82K2360L3313N2
$$ y = [-72726, -67963, -70768, -72977, -68014, -63130, -41567, -19590, -6286, 30486, 32008, -997, -7505, -5446, -34487, -3486, 7002, 9728, -38533, -71696, -39048, -3872, -8553, 7366, 37101, 46140, 43897, 38249, 31393, 8933, 8648, -1179, 4078, -4199, 8173, 45983, 60321, 46304, 32988, 57133, 38545, 42158, 53227, 49179, 28479, 35479, 54968, 55722, 6823, -17823, -32748, -24444, -18546, -61993, -60999, -38900, -14442, 9819, -21462, -38381, -35694, -38450, 1231, 18272, 17662, 32434, 31393, 22720, 16079, -3117, 3636, 1123, 9059, 15648, 4428, 9168, -10659, -28330, 11726, -25604, -80870, -84986, -57468, -52686, -51245, -45184, -25275, -3773, 9162, -1189, -26841, -14773, 16537, 29485, 18183, 11291, 6125, -11550, 6113, 18699, 107, -675, 21685, 54998, 55050]
7030E5050j3661k7009k4150J2052K1597K2640k3799N283M399k8233M694K0661
7018B9524L015k756k0183o796M9j7583k9143K6159J4220j5478j5301n945P73J4220
7004b5225K2954J2991m1690o095J7404J9428p279j8719j9757q843k5277K208L322
6991g4578K6689M286K3o368P370M379q709K4827L0262J3621n588N80l0895j7931
6977c2032K5029J3819n130j2286m899L512J0470M005L0700J5876k6933l7787k4322
6964c9978m646m1027m951L4604K0487J6077K5898M683r189j5684o387K0361m537
6951d289k7248L4258r913p800l7879k2243j009K939L7955M2373o518Q818k2454
6938a3010j2711N3420J4505k140o047k3214p138L2954L2618k7143m0177K5073
$$ y = [55050, 41389, 14380, -9770, 2282, 23879, 46519, 22720, 28003, 32402, 4169, 8863, 29524, 32539, 29783, 9600, 2804, 2853, -14730, -43873, -17714, -3494, -18972, -34273, -40218, -39445, -25225, -2271, 10720, -30970, -37065, -19661, -233, -7512, -26231, -45988, -54831, -80108, -77900, -74578, -47889, -43603, -43580, -49948, -42578, -38199, -46908, -22081, 8181, 21802, 16214, 16794, -14101, -32032, -7003, 6816, 1686, -10600, -15499, -11987, -1517, 2488, 33188, 49064, 22131, -15656, -39978, -44624, -85651, -90602, -55998, -35511, -19434, 6464, 11147, 1958, -13726, -20113, 248, -4289, -31537, 2721, -7192, -14992, -52871, -75114, -76123, -73184, -35229, 7144, 626, 9444, -13010, -25721, 27699, 42204, 40064, 34017, 10803, 3665, 36619, 69237, 42094, 1917, 26990]
6926B6990J1283r473k4453M605L4182L0213n812k0658o831k4709J564j4868j9824
6913a7791J0149k3238m856K648K1700K0370N140J0978J5034j1911k8405J494K7353
6900B8665j1690j4669K294J2630J1729m55l268K9735L816m2323m1945j2135J2714
6887b4902L9600K7573P062R18K51j1344k4112L872k6255n10N789J2662Q660j3802
6873E462n517j6496n944j322p145J2247j8245k5368K4672M3035M347J7786j9825
6860G687M807K4079K1656k2177k2538m0619j66j0701m8423k038M2168J8561m4
6847b7748M3954L8521j6407N62n345k3194K0171Q988P275l2987k2058j0025j0613
6834b8906j5570K4626K5478L831m339P255J8308j417k3277J3641L1974m4611l5902
$$ y = [26990, 38273, 28800, 4347, 8952, 43134, 73347, 67535, 46877, 40046, 15337, 16901, 2033, -17791, -7642, -30880, -35736, -33088, -11388, 8982, 14122, 25100, 40134, 28223, -182, 1312, 28665, 16975, 2306, 4600, 17230, 28959, 28504, 25236, 54971, 58787, 16464, -25481, -37616, -24902, 14698, 42271, 49333, 50251, 50502, 39158, 15046, 18918, -7337, -7847, -2058, 10604, 19264, 5462, -55, -16551, -22495, -23817, -30962, -18715, -36960, -62328, -37656, 5379, 9726, 27512, 7687, 12494, 36573, 58229, 36052, 13514, -27105, -27271, -37972, -86395, -88433, -46265, -27704, -27748, 16206, 54727, 38320, 38882, 33537, 10343, 30514, 39502, 46777, 13790, -8268, -18293, -28906, -44476, -19850, 5628, 9459, 5120, 12375, 30683, 29266, 5989, 19630, 51604, 6993, -28909]
6821b8909k901L1580J7391J802j308k8769j433Q189N232l757k0303k3367K2106
6808b4447J5110o077L090P090K0616L0535l650j045l033M462k561J1581J69k959
6794D8881j4167q72K1690j2648k781k2749r237J2000J4591j5241l8457j8402o810
6781d4202k0475M593J9268r621j2976O275L69Q76L2025K0220J5433k4145j3597
6768b5957P465Q354j937M212K4355o457j5783j4144k4784r020O510j2469J4148
6755d5507J4896k7995j4438K1352K6834K157N089n95k6385R305N1174J1260r396
6742A7751j6159j3355o445K0487J1313K979r228J7066n043K047o173p023J7993
6729B6210K3811j1311K1030L2607p150k8382k7090k7719j0600J481l240j1483
$$ y = [-28909, -31810, -230, 17161, 18963, 17655, -11114, -12547, -4358, 874, -2883, -23186, -46553, -24447, -9337, -15414, -12324, -5234, 15382, 45917, 42267, 41222, 38189, 42651, 40090, 51671, 51840, 48881, 34714, 33842, 55532, 42884, 40103, 17354, 8117, 20117, 34708, 19467, -18990, -37392, -44202, -64677, -60084, -40816, -50437, -63413, -57138, -56769, -55893, -23868, -3648, 11785, -12360, -25957, -18492, -10138, -12075, -7863, 16492, 10035, -5748, -19892, -44676, -53696, -47186, -59655, -45507, -30611, -58606, -73044, -51692, -24858, -22701, -17612, -18207, -44592, -35287, 15887, 27147, 17751, 1592, -11763, -18208, 2279, 13592, 16571, 7343, 24409, 19366, 21413, 15240, 8217, 26210, 50021, 38710, 59740, 92347, 85197, 56815, 29725, 2006, -8594, -7113, -10353, -21836]
6717b1836L766R172j2863L2966M6689q510k6675k0355K696M462J3662k306P540
6704B8408r323j1305k524P711p408l527p760r813j6057j5266J9043K6384P684
6691F247Q817j0727j4862n833p833R651Q367L4632p032k3710N674j0297k4738
6678c1644J8919L4437Q431l472l3005o056R104L2653J6238R41N556o986k6490
6665A8626l8486j3877K3024J5866J3973K3685j8939m0712K2388N089j048k704
6653F885j2878L2k2271J6333K7103J8733R887j773k7815m0819j7150J2951L2503
6640A721k54j9014P328n810P638O101k1960J2801K8697j6472j5856j9683K7682
6627g081J5120M592Q502k9203j3793J0777K4292K1760j9682l498m856j2161j5824
$$ y = [-21836, -18070, -8898, -21761, 11205, 57894, 49384, 22709, 2354, 5050, 9512, 23174, 20868, 28408, 19085, 7780, 5256, 12967, 5559, 2032, -5728, -15541, -31598, -46864, -27821, -1437, 6247, 15064, 4337, -10525, -16358, -24191, -14540, -6173, 28459, 21427, -2283, 3391, -6906, -31644, -12725, 21712, 30143, 26671, -6334, -12390, -3286, 29367, 45605, 46546, 52102, 45116, 18626, -19860, -33737, -10713, 5153, 19126, 42811, 23872, -16840, 5548, 10637, 9589, 6885, -5993, -5961, -28232, -11899, 15204, 33937, 43824, 42051, 14236, -26583, -43733, -30782, 1721, 1467, -17547, -10219, -16029, -8391, -2290, -24250, -11449, 17248, 776, -15080, -34763, -7081, 8039, 12631, 21133, -8070, -21863, -11086, 13206, 34966, 15284, 11786, 6930, -5231, -21055]
6614b1055j1106K1108k014N879R465k427K0296K710K785l3814j0869j7905k9971
6601f6918K0477J5489K0626O187K3538L334j1973m835j8618j6636K1025k420l349
6588a4073R146K0513L2953j5638l3784J4291J6579p372k6855l4273K0222r033
6576b7324L1041K5431N715J450M958k6983j7918m0842n973J1536p083L1412J2863
6563a717J222J635L464K1706N336j8464j5957J2650Q842J0683j4073j911n525
6550G891J285m9J6835j370j4597k8290K1733L4734l979l7969L325k0450k8658
6537d9559J9609K5776J1863O67N517l1512k3239L4520j8118l34R106L057j1652
6524b4299n602p331k019K8374L060k1931n578K5137l8056J6663J5161l37k0516
$$ y = [-21055, -32161, -11053, -13067, -7188, 2277, -150, 20146, 22856, 25641, -8173, -19042, -36947, -66918, -46441, -30952, -10326, -4139, 19399, 22733, 10760, 5925, -12693, -29329, -8304, -10724, -14073, -4927, 15586, 48539, 32901, -883, 13408, 29987, 22615, -4240, -38513, -18291, -27324, 3717, 29148, 34863, 36313, 41271, 14288, -3630, -44472, -50445, -38909, -45992, -14580, -1717, -495, 1140, 4604, 26310, 31646, 13182, -2775, 9875, 18717, 29400, 15327, 13416, 7891, 9176, 9127, 25962, 24592, 9995, -18295, 3438, 38172, 34193, -3776, -451, -20901, -49559, -29950, -4174, 7689, 8356, 13873, -17639, -40878, -6358, -24476, -24810, -15704, -12647, -24299, -29901, -37232, -39251, -10877, -7817, -29748, -35326, -10189, -48245, -31582, -16421, -16758, -37274]
6511c7274j8268L3198J3088q770l0537K113O351j313q521k8957O761L0942M5947
6498D760K55J4123r204j814l2552N008J9296Q923O262M8223j4707l1341Q433j4028
6484A1637k2059L078j7906K9165L2695l3473j6619l0279o381K5891O843k3805
6472d1213M157J16j7925j2427K7507K3955O133m425q267O001K4654J6269J3673
6459C8208l294J4300J5855r189n2059l8351j068N4441L093j6348N062J6947j5818
6446A1779k2139J4182J5725R341l868l5684j0596K9529j0473j2997J0916j7847
6434b2132j1030k1998o129o182N703L5177K9004j5810m76j4035J3134K4177j8568
6421i165q546J3932j6845k5106l52J0645Q884k130J8024j2155o883M895K3405
$$ y = [-37274, -55542, -22344, -9256, -18026, -48563, -46450, -40099, -41412, -49933, -78890, -72129, -41187, 4760, 5015, 19138, 9934, 8120, -24432, -19424, -128, 8795, 15057, 63280, 48573, 17232, 25665, 11637, -10422, -7344, -25250, 3915, 36610, 3137, -13482, -43761, -50142, -24251, -17408, -41213, -37056, -36940, -54865, -67292, -39785, -15830, -9697, -14122, -22389, -16388, 8266, 24535, 38208, 34914, 49214, 65069, 55880, 3821, -34530, -35598, 18843, 21936, 5588, 10650, 27597, 11779, -10360, 3822, 19547, 28888, 25020, -10664, -21260, 8269, -2204, -15201, -4285, -22132, -33162, -55160, -61289, -67471, -61768, -26591, 2413, -13397, -13873, -27908, -14774, 9403, -9165, -17711, -3779, -20624, -45730, -46082, -35437, -26553, -28683, -10659, -22814, -29697, -24802, -1397]
6408a397N6527r849j4244j834m3197j5587J9641M080j6160j3680q277J7891K8759
6395B673J1560n512k692J1130j1335R869J0958k0346k890J6760J172j6312O339
6382A1374r632p957O547m89L797q385k0591j4653m208q89P452J7510j487K3134
6368A523P331j0529j2765O303K633O076j0831J936O262K10m833J1214l7599j5143
6354d8212K943k1164J844J5064J6155r317K2148J1656r343R091j326K345J2523
6341D407O949j7108L1203m267m6377l561O772j5672n444K2606Q935k3836j9063
6328e4456L1523K0479L349q605j2526o125J5030l182j0268J2108J4168l773K461
6315A83k133M435j1905o859K5600L474N786K757j0056k3527m6467R587K3059r621
$$ y = [-1397, 55130, 45281, 31037, 29203, -13994, -29581, -9940, -5860, -22020, -35700, -43977, -26086, 2673, 14233, 8721, 6029, 17159, 5824, 15693, 26651, 6305, 3415, 20175, 21347, 5035, 11374, 1742, -6215, 332, -157, 3640, -4745, -25336, -39989, -44197, -45086, -37634, -20124, -21611, 1523, 8854, -1675, -14440, -8137, -5504, 572, -10259, -8323, -2061, -1851, -6684, 4530, -33069, -48212, -45269, -66433, -64589, -49525, -33370, -42687, -20539, -8883, -18226, -9135, -10461, -8116, 4407, 11356, -5752, 25451, 21184, -25193, -28754, -21982, -37654, -43098, -20492, -11557, -35393, -54456, -22933, -2454, 895, -7710, -20236, -26361, -11331, -14513, -24781, -12673, 1495, -2278, 183, -1950, 2485, -9420, -16279, 9321, 12795, 18581, 21338, 11282, -12245, -58712, -49125, -26066, -35687]
6301c5687J935K3243J9666q024l0187J693J6985p749K2119M49o842J974Q016j26
6287G465p390m690Q319J6105k2349k159m373p79J0980j167k650R930K005n644
6273C603p850j6544p628k123j493K310j2506J4226R334J2742p11L5952n813M859
6259B8358j8895m3190K2183J4614j7477J4512R000J7206J1228j8415J1811k9493
6247A442k9571J5504N64m437J5419K3441Q464k6056j2462R98Q339j957k9564K2983
6233f893K1191q565q561k7661K3020N667j1737r271r996J9327J6166k4732P491
6220a4554L8346j4227k3506K8252J251j5601j2479j802p311k6140J5830K5410
6208f531R31N24L1523o925k4997j7977l7339j8053O525K1961L6316K1208Q234
$$ y = [-35687, -33752, -10509, 9157, 1133, -29054, -27361, -10376, -18125, 3994, 4443, -2399, -425, 7591, 7465, 75, -4615, 3704, 19809, -2540, -4699, -9072, -9851, 1129, -38, -2688, 7242, 9247, 3603, -4247, -20791, -28419, -30542, -32035, -29725, -42231, -28005, -18671, -5929, -6640, 29312, 23499, 28358, 9463, -33727, -11544, 3070, -14407, 105, 9105, 26311, 37539, 19124, 30935, 1442, -28129, -12625, -12061, -16498, -1079, 22362, 30826, 4770, -7692, -6694, 1645, -312, -29876, -6893, 14298, 5733, -2828, -30489, -7469, -1802, -13539, -22810, -32806, -13479, 2687, -22045, -14554, 23792, 9565, -13941, 14311, 15562, -39, -12518, -14320, -21631, -47771, -31941, -6531, -5600, -5076, 26447, 19522, -5475, -23452, -60791, -78844, -72319, -50358, -14042, 7166, 15400]
6195A5400l891j1613J0137m02j2966j0503K5199j6903k5543J5037J6741J3683
6183A4376r149k3112Q234J989J1322L321N759j0038l0609O958J2646j5036p124
6170c0463P807k6324J9057P605J2710P00j586O97l1623J8189K0215j434j0929
6157a5379l1378J9355P466O855J2255K3733o645j1998j5923k6412J1114P969k4576
6144d3564j7616M1328J4346J4079J1258p128k9506J7438k0067k4502J757K2778
6132a9399N583j4294J6446R282J9614M590k1212m0748R12J57M255j802J110r9
6118c5605L630J2479K6051J132P613j1283j7811M128j7977k915J715M909q913
6105c2847j1845O919K144q834M7483J0111q529n263M901j4758q120O415l0827
$$ y = [15400, 11509, -104, 10033, 9631, -3335, -13838, 11361, -5542, -31085, -16048, 693, 14376, 5227, -17885, -9651, -7662, 3660, 6981, 12740, 2702, -27907, -20949, -8303, -23339, -30463, -22656, -48980, -29923, -22318, -9608, -8908, -10494, -9797, -41420, -23231, -3016, -4450, -15379, -46757, -27402, -19936, -13081, -826, 22907, 16262, 4264, -11659, -38071, -26957, -18988, -43564, -61180, -19852, -5506, 8573, 19831, 12703, -16803, 635, -19432, -43934, -42177, -19399, -13816, -28110, -11664, -2382, 17232, 21822, 610, -40138, -39226, -39069, -34814, -36616, -35506, -35605, -31975, -19496, 6555, 7687, 15300, 4017, -13794, -9666, -27643, -30558, -28843, -23934, -32847, -44692, -37773, -35629, -44463, 3020, 13131, 4602, -661, 4240, -10518, -18638, -12223, -43050]
6092d3050Q831K0121K2301R731l957p817l917j8967o375O181J1488O989k5596
6079b4037n334K1396j9362l5909K3985L4803O080r469M704Q475k3042j1930K5944
6066c696J3970j2895j985J0293K1325K741n956l4213j4980j0496R391L4340l3802
6053b5963m0587j682P922q147K0977L0102J2691O664j7436J4704m549K503O682
6040C881j2567k464M494j2360J3440P452P275J7198R867r859j47n538k5039q542
6026a2909j4819j7110Q886K6359R541J4055J4900k371j0590k4569j641L4396j2273
6013A1855j709J2177K4666K3703l839l5198j8871J1447j5742j2010j8814J1748
6001a0587j5244k0596p814M897l460j1411o505J6564L1038J4673O54R742m735
$$ y = [-43050, -34219, -14098, 8203, 17934, 13977, 6160, 2243, -16724, -23099, -16918, -5430, 1559, -24037, -29371, -7975, -27337, -63246, -39261, -4458, 1622, -7847, -3143, 5332, -17710, -29640, -3696, 10274, -2621, -4606, 5687, 27012, 29753, 23797, -10416, -25396, -35892, -26501, 7839, -25963, -66550, -68232, -60310, -68457, -47480, -17378, -4687, 1977, -15459, -755, -5304, -2801, 3881, -8686, -11150, -6656, -19016, -5576, 1876, 9151, 26349, 36216, 26357, 26210, 20672, -4367, -12909, -27728, -44838, -35952, -9593, -52, 14003, 28903, 26532, 15942, -8627, -10268, 24128, 11855, 10146, 22323, 46989, 70692, 66853, 31655, 12784, 24231, 8489, -3521, -22335, -10587, -25831, -46427, -54241, -49344, -52804, -64215, -70720, -54156, -23118, -8445, -7791, 1951, -2784]
5988b784L4699n687r662O518r645j7662K0286N175n770J2088o676k944K1218J1904
5974E1058n4713j8662J2460o343j6007O79l171K4562L583J138k2877j2485m208
5961d4986J6411K1466O0000Q677j8487k1259r815j2781J8618J8191J5181m0833
5949A0383k5585l8463P098K7783L0354O534j7142j0956m127K863o925j739J2157
5936g765K3053j8829k2453P90K362K0123j8932l4024K0497k1172k412J529K6327
5923c0906J8438j6067p742n098K3519p361j1614M1952j46L354L2626J7100j9810
5910C8245j3058j2240j8940J6797N398l835L92J5319M928l784j1338j293j7534
5897i43j3931N75l736n470J4963l7229j5788L262L8154K6810K833j2628O925K5213
$$ y = [-2784, 31915, 26228, 16566, 23084, 13439, -4223, 16063, 21238, 15468, 27556, 20880, 17936, 39154, 51058, -3655, -22317, -9857, -16200, -32207, -31528, -34699, -10137, -6554, -5416, -28293, -40778, -44986, -28575, -7109, 52891, 61568, 43081, 21822, 12007, -774, 17844, 36035, 51216, 10383, -15202, -53665, -46567, -18784, 11570, 18104, 962, -9994, -14121, -11258, -18183, -19922, -7765, 15288, -3541, -25994, -25204, -22842, -2719, -21651, -55675, -35178, -56350, -58762, -57233, -30906, -12468, -28535, -36277, -41375, -17856, -25217, -36831, 5121, 4975, 8329, 40955, 58055, 38245, 25187, 12947, -5993, 10804, 16202, 12367, 12759, 28078, 33006, 29222, 17884, 16591, -943, -14874, -14299, -18035, -23505, -8542, -45771, -61559, -58297, -20143, 6667, 9500, -3128, 3797, 29010]
5883B9010k0112P037K2764l680l7476k1335r299K5702m092j636l809J407J1369
5870d150J638l9302Q505K1725r251K7464j3749J196o430q278k020l0485J3779
5857c9358M6546R583o476j2537l2140l290R291R419m732j5505J2808J6752J5774
5844F135N140k1471L5997J1387l9496k80j282k05j3149j5553J5396J7095m900
5831e186j6602m5146k890O748R56K4896J5640j6905k0476j7984J8435K1304P776
5818b9434L646L339L2730L4811q503l0623l4601J9145k00j3087J4216p38m73j5380
5804b5152L437J8508n285l9609R923K5236L420R065L057K4197K4776j622k7174
5791B2777l401m423J3783N92R733K8803j1599j7509r963l0957m8210r689L0706
$$ y = [29010, 8898, 15935, 38699, 35019, -2457, -23792, -33091, -7389, -11481, -13117, -16926, -15519, -4150, -2512, -41814, -33309, -11584, -20835, 6629, -7120, -5924, -12354, -20632, -22652, -53137, -39358, 7188, 16771, 10295, -2242, -34382, -37672, -28381, -18962, -23694, -39199, -26391, -9639, 6135, 11275, -10196, 25801, 37188, -2308, -2588, -3870, -4075, -17224, -32777, -17381, -286, -5186, -21788, -66934, -69824, -63076, -62120, -37224, -21584, -38489, -58965, -76949, -58514, -37210, -29434, -25788, -22449, 10281, 45092, 36589, 5966, -28635, -9490, -9690, -22777, -8561, -9299, -9772, -25152, -21715, -3207, -8492, -48101, -38178, -12942, -9522, -457, 2600, 26797, 51573, 49951, 22777, 19376, 14953, 28736, 29328, 39061, 67864, 56265, 38756, 28793, -2164, -50374, -60063, -29357]
5778b9357j6032j5376K9983k333J1926N417N59k112j4940M67M0999k985P943P554
5764B1713l529q665k109k678l169k391J6428Q753j0719l574J6780k914k2311N680
5750G295Q377j8630j315j5860p254k8872k038L7563J5554P466J9698J4672J8582
5737E5238M482k4856O99m155j5382l039K827m915j659L4541M005k7989l6650l2997
5723d9850m893m005J0029L3416K5779k29n365N871j5950q205l679j185k258P871
5709a2653J452k7165j2271L3830N668J2123O115j7716j1802K3564j0534j8252
5697b7641J744J9949K3104j0202O762P726l0368l0916j0231K118L033J2133K6209
5684f580R610j6624r378L829m637p699O686m40j3992l509Q23M882L262n755J4617
$$ y = [-29357, -45389, -60765, -30782, -33115, -21189, -15772, -15213, -17325, -32265, -31798, 9201, 6216, 14159, 21713, 18184, 9519, 7410, 4732, 1563, -828, 15600, 24353, 13634, 10060, 26840, 23926, 1615, 7295, 15672, -2958, -4273, -20133, -27387, -56259, -58297, -20734, -5180, 2286, 21984, 36656, 55238, 59720, 34864, 35563, 31408, 16026, 12987, 15814, 10899, 9240, 43781, 47786, 19797, -16853, -49850, -54743, -58748, -48719, -15303, 10476, 10247, 4882, 10753, -5197, -13402, -17081, -18266, -20524, -12653, -11201, -38366, -50637, -16807, -11139, 984, 7099, -10617, -22419, 1145, -9389, -27641, -25897, -5948, 17156, 6954, 13716, 21442, -8926, -39842, -50073, -47955, -44922, -32789, -6580, 3030, -13594, -22972, -19143, -23780, -31479, -24793, -25233, -39225, -42734, -41911, -37029, -33767, -39522, -24905]
5669b4905L0514L4022J4381j8277l1546k3508k60J5779P346Q020j5777k6770Q789
5656b2192q516q566m2190L64K1061M2913k2248l668K5613K1772J8842j9951q244
5643e010j8110m790M6330Q523q145k5777N243L283J6251q334j8997N801k137L121
5629b748l875j533L3527k1124k0825j7950K9173Q112j6251J040p933J4477j0228
5616a6138j6265r348j4970J4105K7458j348k1256j5863M528L0501L6438j2606
5604E236O780k0668l039j3216j2729K4392K3711o554j2390j3732k3961K6227L8243
5591A8300j3260l5896K9586J6834O599O835j804j6223k8160J2724K620K755q501
5578g591R584L200j7889J001J2921M880j4288k5794j9236J2837j2688j147J4664
$$ y = [-24905, 5609, 39631, 54012, 35735, 4189, -19319, -19579, -3800, 3546, 11566, -4211, -30981, -22192, -30708, -39274, -81464, -81100, -60039, -17126, -39374, -43042, -17429, 4343, 23185, 3234, -5010, -23120, -27910, 18420, 26943, 18798, -6979, -1736, 1547, 17798, 9464, -9533, -3732, -5869, -2748, -6623, -8156, 25371, 4247, -16578, -34528, -5355, 2757, -13494, -12454, -20387, -5910, -16138, -32403, -41751, -56721, -42616, -15158, -16506, -37762, -53625, -49097, -18596, 17842, 5236, 12016, -8652, -11691, -24907, -37636, -13244, 10467, 3913, -8477, -22209, -46170, -19943, 18300, 5040, -30856, -1270, 15564, 22163, 28998, 27194, 10971, -17189, -4465, -1845, 910, -7591, 1993, 5193, -12696, -11695, 1226, 6106, -8182, -33976, -53212, -40375, -53063, -54210, -39546]
5565c9546k8537n374J2501J8352J4315M108M52k0246M1009L4401k9496l3743O89
5552c1115k8390j6690R640J8491L2371K0191j6859R815K013j812K5888N786J0186
5539C9515p494k9358p600k5994k378M5260J9264j4612m545j1503j5667j1880P142
5526a9850J3890J4054J4749J2330l1568o720J25k599J4175k0296p925J1147j2223
5513b0711m283K1633j0044m693J0402K822p42L0482j9542Q317j0733j6384r154
5500b2630K9137r33j1899o644K2579K4998j7881K723l7034m149j6061j360n273
5487d4427K3334L552K7076Q726P63p327j0201Q387P759j8979k5820j6478L4585
5474i050R715K0970O953j9442j2400l7569k7237p293J6809L2568K678L880N628
$$ y = [-39546, -68083, -73457, -60956, -42604, -28289, -24181, -23729, -43975, -2966, 31435, 1939, -31804, -31115, -59505, -76195, -66555, -48064, -15693, 4498, -12361, -2546, -533, -2345, 23543, 29329, 39515, 32021, 2663, -4937, -30931, -33309, 11951, 31215, 16603, 12058, 555, -15112, -26992, -19850, -5960, 8094, 22843, 35173, 3605, -3115, -2990, -5589, 8586, -11710, -19635, -8488, -20711, -24994, -3361, -13405, -18098, -7696, -4874, -5616, 24866, 5324, 13641, 2908, -13476, -22630, 6507, 5574, -6325, -12969, 9610, 34608, 16727, 19450, -17584, -21733, -37794, -39154, -44427, -21093, -17541, 9535, 18261, 19024, 11697, 1496, 9883, 17642, -1337, -27157, -43635, -9050, 665, 21635, 28588, 9146, -3254, -40823, -68060, -75353, -58544, -25976, -23298, -19418, -13790]
5461a3790P756j1067J624j7261L495L5151K7282n887j2175M999k5121k3809r980
5448c8783J4220J9711j4656J1457M6078k0968k0561M323k8720k0557p430J1053
5436d4833M1120k3917K337O348j490J2071n184J7779K3878J0134l9450j1311r170
5423b1688j3630Q89J2420m941j1910J6743q600k8773L7920K1733k5020L259K650
5410a8948M314l924k6200O957R34P120O796O950R583O712l577r390O978J9859
5396A4164L7051M199l6455p955L00m231k3893m6762J897J5071J5135J289J0627
5383a9563M361L090p073j7171q903l507L408k627L0049O73R22J1554P566K5781
5369B8560K2067J9180N721j2510q288l0416j4699j2546O817j4614l2540K0671
$$ y = [-13790, -6034, -17101, -15477, -32738, -29243, 5908, 33190, 27303, 15128, 20127, -4994, -28803, -38783, -24563, -4852, -19508, -8051, 38027, 17059, -3502, 821, -27899, -48456, -55886, -44833, -3713, -27630, -25293, -18945, -20435, -8364, -13548, 4231, 28109, 38243, -1207, -12518, -21688, -35318, -34429, -22009, -26950, -38860, -22117, -30717, -59490, -21570, 163, -24857, -21598, -18948, -14634, -18558, -44758, -37801, -36867, -29747, -22951, -16001, -6418, 294, -3283, -12673, -5695, 14164, 51215, 55414, 18959, 11004, 11304, 7073, -16820, -63582, -61685, -46614, -31479, -30190, -19563, -15202, -12112, -19185, -36356, -45259, -48766, -45358, -47985, -17936, -17263, -16341, -4787, 2779, 28560, 50627, 69807, 75528, 63018, 54730, 24314, 9615, -2931, 3886, -10728, -43268, -22597]
5357b2597K455m500l108j0070j2280J3453J8223o853q187Q397M960r909j1434
5344d1450P977J5694R832r608m970j0052J9412j0630l2904O125J8317K65O736
5331b5256K2455J4805l320l787P179n592O764j7040j024k6944j6898M988K4648
5318a9022K3329k2426k7442Q781j4887n463J4163K4645M3545m05K199P594L342
5305C7953l9085L764J2514k1252k1653K798K4035K7115J4340J1448K2610m2507
5293C2080k0017J4749l8806k7769N205M186K8996r211J0859K0055l525m6357O44
5280b8911q363J0451J1504K8551j7092L117K7290n631o42O343j0711k7760J7849
5267E995N811J423K3002j999k164j4255M004k0614j8226P944R977j378K1k2876
$$ y = [-22597, -20142, -24642, -27750, -37820, -50100, -36647, -18424, -25277, -33464, -25067, -20107, -30016, -41450, -33473, -17779, -7947, -17555, -22525, -32577, -13165, -23795, -56699, -50574, -32257, -31992, -25256, -2801, 12004, 8684, 4897, 12076, 6484, 13248, -3792, -4816, -31760, -48658, -43670, -19022, 4307, -18119, -45561, -36780, -51667, -57130, -42967, -18322, 25223, 24818, 27017, 34611, 37953, -1132, 2632, 15146, -6106, -27759, -24961, -926, 26189, 40529, 51977, 74587, 32080, 12063, 26812, -11994, -39763, -34558, -30372, -1376, -10587, 272, 20327, 16802, -29555, -28911, -37274, -26823, -15319, 13232, -3860, -743, 26547, 20916, 20274, 26617, 15906, -11854, 5995, 11806, 13229, 36231, 34232, 32068, 17813, 21817, 1203, -17023, -9079, 898, -480, -459, -23335]
5253b3335O45j8537m717L8939K0095l29j7920j0963K3562j5873R508L5255j1110
5240B5220l9068k6913P30J1621J4769k620j0017R711o636q535j5261r32K2892
5227b5039k045j4724K00M7880L513l3482j7778L4714K643j2831j5096k490J6153
5214a8382J1405K931q803K5223K2915J3978L299j6388L961J1447K7532K0753j5066
5201H4805k9045m3099j0319j1360j3991Q539R586p286j4074L4810Q458p565k5323
5188a5864J3446k191Q295Q328j3476l929o425k2610j5883J0047K8845K4859j8043
5175d601k8362K6242j7731J4709n785P357q40M989j3468P501J2538J4258l0199
5162a3392J3449M1867Q948K785m117q663k4077j4230Q00j463k8508J4964o147
$$ y = [-23335, -22690, -41227, -45944, -7005, 13090, 12761, -5159, -16122, 7440, -8433, 1075, 36330, 25220, -13848, -40761, -40031, -28410, -13641, -16261, -26278, -16567, -23203, -31738, -46999, -47931, -25039, -27084, -41808, -41608, 6272, 9785, -23697, -41475, -6761, -4118, -16949, -32045, -34535, -18382, -6977, -4046, -12849, 12374, 35289, 49267, 52566, 36178, 40139, 51586, 79118, 99871, 84805, 55760, 12661, 2342, -9018, -23009, -14470, -4884, -12170, -26244, 8566, 17024, 9459, -15864, -2418, -4609, 3686, 12014, -1462, -5391, -11816, -34426, -50309, -40262, -11417, 13442, -4601, -32963, -6721, -24452, -9743, -15528, -8171, -9011, -4022, -17490, -9989, 2549, 16807, -13392, 57, 41924, 50872, 53657, 49540, 40877, 16800, 2570, 3370, 1907, -26601, -11637, -17784]
5149a7784n819o021J6420J5611J645n785j9010o662J8425K5392P96p806o081j8473
5135a5152J4535J5316j4251l2631l897K7603j4613j6901K3447L4933j544l8081
5123b1236j9716J2240K3K3806K2105k924j9042k245L986L1296J3955k744r471
5110C0033k6521k4856M482K3472J1522P169l4125j8920K6275J7259k3895N225
5098b880K472k8048j6985J9629K6936N5453O753m7000m1779m282K1334K9162J4486
5085C5251j5423K4037Q739k7347m7253k8808J3453L5293M21m5545L445N6035J8955
5072C1253k1793l2032m559J5179M1312K641l3914l0458J4278p190k9463K2607
5060c2139L3515Q869J2682K958j6489j9637k2974j6975m438J0402K4941L1247
$$ y = [-17784, -23603, -29624, -13204, 2407, 4052, -1733, -20743, -27405, -8980, 16412, 17208, 9402, 3321, -15152, -617, 14699, 448, -32183, -36080, -8477, -23090, -39991, -16544, 18389, 16845, -21236, -40952, -28712, -28689, -4883, 17222, 14298, -4744, -6989, -3003, 28293, 42248, 39504, 30033, 3512, -21344, -16862, 6610, 18132, 25301, -8824, -27744, -1469, 15790, -8105, -2880, -408, -28456, -45441, -25812, 1124, 56577, 63330, 16330, -25449, -29731, -8397, 20765, 35251, 19828, 43865, 52604, 25257, -21996, -50804, -37351, -2058, -1637, -47182, -43737, 12298, 31253, 9460, -22572, -27131, -11952, 29360, 32001, -1913, -32371, -18093, -25283, -54746, -32139, 1376, 10245, 22927, 25885, 9396, -10241, -33215, -50190, -54628, -44226, -19285, 11962]
5048A1962J4973k2636j9824N406k8236L393K8613r940j1973K1737N08p933l0795
5035d4745p962J3006J3251J812j4222j14j9458N93K0938J5056J8888j405O411
5022B049N39Q905M202O559q449k8160L3872J9979m118p103n436k6879k203L2400
5008B6157M070J3135K593k6794j9206j6942j5180J7232J2184j945K2589K722j7630
$$ y = [11962, 26935, 4299, -15525, -10119, -38355, -34962, -6349, -16289, -28262, -6525, -6017, -13950, -44745, -52707, -39701, -26450, -24638, -38860, -38974, -58432, -57839, -36901, -21845, -2957, -4362, 2049, 2588, 11493, 15695, 22254, 13805, -14355, 19517, 39496, 35378, 28275, 22839, -4040, -6243, 26157, 30227, 43362, 45955, 19161, -45, -16987, -32167, -14935, -2751, -4696, 17893, 20615, 2985]
$$ [...]
##END NTUPLES=NMR SPECTRUM
##END=
