##TITLE=Analysis number 315190
Compound Code cc 41504
Book Reference 456/72/3
Project Code adrs
Chemist Name anns
##JCAMPDX= 6.0         $$ Bruker NMR JCAMP-DX V2.0
##DATA TYPE= NMR SPECTRUM
##DATA CLASS= NTUPLES
##ORIGIN= Bruker BioSpin GmbH
##OWNER= NMR
$$ XWIN-NMR		Version 3.5
$$ Thu Nov 10 14:28:30 2005 GMT Standard Time (UT+0h)  MAYBRIDGE\NMR@NMR_250MHZ
##.OBSERVE FREQUENCY= 250.131544655141
##.OBSERVE NUCLEUS= ^1H
##.ACQUISITION MODE= SIMULTANEOUS (DQD)
##.ACQUISITION SCHEME= undefined
##.AVERAGES= 16
##.DIGITISER RES= 18
##SPECTROMETER/DATA SYSTEM= dpx250
##.PULSE SEQUENCE= zg30
##.SOLVENT NAME= CDCl3
##.SHIFT REFERENCE= (INTERNAL, CDCl3, 0, 16.522)
##AUDIT TRAIL= $$ (NUMBER, WHEN, WHO, WHERE, WHAT)
$$ ##TITLE= Audit trail, XWIN-NMR		Version 3.5
$$ ##JCAMPDX= 5.01
$$ ##ORIGIN= Bruker BioSpin GmbH
$$ ##OWNER= NMR
$$ C:\u/data/dgb/nmr/ADRS/12210/pdata/1/auditp.txt
$$ ##AUDIT TRAIL=  $$ (NUMBER, WHEN, WHO, WHERE, WHAT)
(   1,<2005-11-10 14:28:07.47 +000>,<MAYBRIDGE\NMR>,<NMR_250MHZ>,
      <created by zg, POWCHK disabled, PULCHK disabled
       configuration hash MD5:
       62 19 C7 07 E1 42 D1 B7 37 6C 3D D0 77 39 F9 E6
       data hash MD5: 64K
       90 3C 4C 4A B2 C3 2A 66 2F 83 A7 F7 89 75 38 EA>)
(   2,<2005-11-10 14:28:20.11 +000>,<MAYBRIDGE\NMR>,<NMR_250MHZ>,
      <Start of raw data processing
       ef LB = 0.3 FT_mod = 6 PKNL = 1 SI = 32K 
       data hash MD5: 32K
       A5 E2 1E DD 6D 8E 01 29 97 05 9D EF 05 48 CA 9C>)
(   3,<2005-11-10 14:28:22.14 +000>,<MAYBRIDGE\NMR>,<NMR_250MHZ>,
      <apk 
       data hash MD5: 32K
       F5 07 3A 56 D6 E3 A4 0F 60 2A E2 83 1B 49 C1 60>)
(   4,<2005-11-10 14:28:23.08 +000>,<MAYBRIDGE\NMR>,<NMR_250MHZ>,
      <abs ABSG = 5 
       data hash MD5: 32K
       6F A1 9B C8 D9 35 CC 6E 47 17 CF EE F5 D1 4B B4>)
$$ ##END=
$$ 
$$ hash MD5
$$ D0 96 3E F7 E3 B5 58 B9 14 D4 5C EC 07 5C D4 64
##$RELAX= 
##$RELAX= 
##$RELAX= 
##$RELAX= 
##$RELAX= 
##$RELAX= 
##$RELAX= 
$$ Bruker specific parameters
$$ --------------------------
##$DU= <C:\u>
##$EXPNO= 12210
##$NAME= <ADRS>
##$PROCNO= 1
##$TYPE= <nmr>
##$USER= <dgb>
##$AMP= (0..31)
100 100 100 100 100 100 100 100 100 100 100 100 100 100 100 100 100 100 
100 100 100 100 100 100 100 100 100 100 100 100 100 100 
##$AQSEQ= 0
##$AQ_mod= 3
##$AUNM= <au_zg>
##$AUTOPOS= <34 >
##$BF1= 250.13
##$BF2= 250.13
##$BF3= 250.13
##$BF4= 250.13
##$BF5= 500.13
##$BF6= 500.13
##$BF7= 500.13
##$BF8= 500.13
##$BYTORDA= 1
##$CFDGTYP= 0
##$CFRGTYP= 5
##$CHEMSTR= <none>
##$CNST= (0..31)
1 1 145 1 1 1 1 1 1 1 1 1 1 1 1 1 1 1 1 1 1 1 1 1 1 1 1 1 1 1 1 1 
##$CPDPRG= <>
##$CPDPRG1= <>
##$CPDPRG2= <>
##$CPDPRG3= <>
##$CPDPRG4= <mlev>
##$CPDPRG5= <mlev>
##$CPDPRG6= <mlev>
##$CPDPRG7= <mlev>
##$CPDPRG8= <mlev>
##$CPDPRGB= <>
##$CPDPRGT= <>
##$D= (0..31)
0 1 0 0 0 0 0 0 0 0.06 0 0 0 0 0 0 0.0002 0 0 0 0 0 0 0 0 0 0 0 0 0 0 
0 
##$DATE= 1131632886
##$DBL= (0..7)
120 120 120 120 120 120 120 120 
##$DBP= (0..7)
150 150 150 150 150 150 150 150 
##$DBP07= 0
##$DBPNAM0= <>
##$DBPNAM1= <>
$$ [...]
##$SUBNAM7= <"">
##$SUBNAM8= <"">
##$SUBNAM9= <"">
##$SW= 20.6930455092707
##$SWIBOX= (0..15)
0 0 3 0 0 0 0 0 0 0 0 0 0 0 0 0 
##$SW_h= 5175.983436853
##$TD= 65536
##$TD0= 1
##$TE= 295.16
##$TE2= 300
##$TE3= 300
##$TEG= 300
##$TL= (0..7)
0 120 120 120 120 120 120 120 
##$TP= (0..7)
150 150 150 150 150 150 150 150 
##$TP07= 0
##$TPNAME0= <>
##$TPNAME1= <>
##$TPNAME2= <>
##$TPNAME3= <>
##$TPNAME4= <>
##$TPNAME5= <>
##$TPNAME6= <>
##$TPNAME7= <>
##$TPOAL= (0..7)
0.5 0.5 0.5 0.5 0.5 0.5 0.5 0.5 
##$TPOFFS= (0..7)
0 0 0 0 0 0 0 0 
##$TUNHIN= 0
##$TUNHOUT= 0
##$TUNXOUT= 0
##$USERA1= <user>
##$USERA2= <user>
##$USERA3= <user>
##$USERA4= <user>
##$USERA5= <user>
##$V9= 5
##$VALIST= <valist>
##$VCLIST= <CCCCCCCCCCCCCCC>
##$VD= 0
##$VDLIST= <DDDDDDDDDDDDDDD>
##$VPLIST= <PPPPPPPPPPPPPPP>
##$VTLIST= <TTTTTTTTTTTTTTT>
##$WBST= 1024
##$WBSW= 4
##$XGAIN= (0..3)
0 0 0 0 
##$XL= 0
##$YL= 0
##$YMAX_a= 424456
##$YMIN_a= -476145
##$ZGOPTNS= <>
##$ZL1= 120
##$ZL2= 120
##$ZL3= 120
##$ZL4= 120
##$ABSF1= 16.522
##$ABSF2= -4.171173
##$ABSG= 5
##$ABSL= 3
##$ALPHA= 0
##$AQORDER= 0
##$ASSFAC= 0
##$ASSFACI= 0
##$ASSFACX= 0
##$ASSWID= 0
##$AUNMP= <proc_1d>
##$AZFE= 0.1
##$AZFW= 0.1
##$BCFW= 0
##$BC_mod= 0
##$BYTORDP= 0
##$COROFFS= 0
##$CY= 12.5
##$DATMOD= 1
##$DC= 0
##$DFILT= <>
##$DTYPP= 0
##$F1P= 14.0000005364418
##$F2P= -0.99999901652339
##$FCOR= 0.5
##$FTSIZE= 32768
##$FT_mod= 6
##$GAMMA= 0
##$GB= 0
##$INTBC= 1
##$INTSCL= 1
##$ISEN= 128
##$LB= 0.3
##$LEV0= 0
##$LPBIN= 0
##$MAXI= 10000
##$MC2= 0
##$MEAN= 0
##$ME_mod= 0
##$MI= 0
##$NCOEF= 0
##$NC_proc= -4
##$NLEV= 6
##$NOISF1= 0
##$NOISF2= 0
##$NSP= 0
##$NTH_PI= 0
##$NZP= 0
##$OFFSET= 16.522
##$PC= 1
##$PHC0= 75.60863
##$PHC1= 4.754678
##$PH_mod= 1
##$PKNL= yes
##$PPARMOD= 0
##$PSCAL= 4
##$PSIGN= 0
##$REVERSE= no
##$SF= 250.13
##$SI= 32768
##$SIGF1= 0
##$SIGF2= 0
##$SINO= 400
##$SIOLD= 32768
##$SREGLST= <1H.CDCl3>
##$SSB= 0
##$STSI= 32768
##$STSR= 0
##$SW_p= 5175.98343685301
##$SYMM= 0
##$S_DEV= 0
##$TDeff= 65536
##$TDoff= 0
##$TI= <Analysis number 999999
Compound Code 99
Book Reference 9
Project Code 9>
##$TILT= no
##$TM1= 0
##$TM2= 0
##$TOPLEV= 0
##$USERP1= <user>
##$USERP2= <user>
##$USERP3= <user>
##$USERP4= <user>
##$USERP5= <user>
##$WDW= 1
##$XDIM= 32768
##$YMAX_p= 281582194
##$YMIN_p= -258001
$$ End of Bruker specific parameters
$$ ---------------------------------
##NTUPLES= NMR SPECTRUM
##VAR_NAME=  FREQUENCY,     SPECTRUM/REAL,   SPECTRUM/IMAG
##SYMBOL=    X,             R,               I
##VAR_TYPE=  INDEPENDENT,   DEPENDENT,       DEPENDENT
##VAR_FORM=  AFFN,          ASDF,            ASDF
##VAR_DIM=   32768,         32768,           32768
##UNITS=     HZ,            ARBITRARY UNITS, ARBITRARY UNITS
##FACTOR=    0.157963299565203, 1,           1
##FIRST=     4132.6476996994, 0,             0
##LAST=      -1043.33573715361, 0,           0
##MIN=       -1043.33573715361, -258001,     0
##MAX=       4132.6476996994, 281582194,     0
$$ Real data points
##PAGE= N=1
##DATA TABLE= (X++(R..R)), XYDATA
$$ [...]
28380B1113k6495m601m8625j0039L7417N1969L1245k148k6346j4640k1954m1087
$$ 21113 -5382 -9983 -58608 -68647 -31230 20739 51984 49836 23490 8850 -13104 -54191
28368e4191l0775n920L804k8875n363R75K8318N4158O2830J7299l8005l5486m5125
$$ -54191 -84966 -90886 -87082 -115957 -121320 -120345 -92027 -37869 24961 42260 4255 -31231 -76356
28355g6356L6794N1323L5530q293M5905j2477J6533K2852k1230l8006J1305k7568
$$ -76356 -39562 11761 47291 38998 84903 72426 88959 111811 90581 52575 63880 36312
28343C6312l8991R216N942M2479J4678m4150J9755k3868J3354J2984J4883J8214
$$ 36312 -2679 6537 12479 54958 69636 25486 45241 21373 34727 47711 62594 80808
28331H0808m9764J8837O600l5262K2160J4377j5793k1558Q236L1590l6896j456
$$ 80808 31044 49881 56481 21219 43379 57756 41963 20405 28641 60231 23335 21879
28319B1879K5871j9519K8415R340j3847l8828j8491q1896k0081M6976L7183K3244
$$ 21879 47750 28231 56646 65986 52139 13311 -5180 -87076 -107157 -60181 -22998 246
28307B46k3203L0885K9161j9700n485k8881j7891J6044K0003L244L2994k6911
$$ 246 -22957 7928 37089 17389 11904 -16977 -34868 -18824 1179 4423 37417 10506
28295A0506m1599M8055k4673L068K887k8058K5234N0914N020n6312k3789N2005
$$ 10506 -31093 16962 -7711 -4643 -1756 -29814 -4580 46334 51354 -4958 -28747 23258
28283B3258k3057J6146L2848k139k1591K2594j2741k0295J5774K864n148J3399
$$ 23258 201 16347 49195 47056 25465 48059 35318 15023 30797 33661 28513 41912
28271D1912n5252q0676q524P0555P873L706J3123J365J3982J2478J8904k0283
$$ 41912 -13340 -94016 -102540 -31985 -24112 -20406 -7283 -5918 8064 20542 39446 19163
28259A9163o008K915J11J5873N286k2803n6932l2952M8571Q0031J54l2074q581
$$ 19163 13155 16070 16181 32054 37340 14537 -42395 -75347 -26776 53255 53409 21335 12754
28246A2754K2380n6527k7104l9969l6846O4501Q1624K1436m2973m2199k1678k255
$$ 12754 35134 -21393 -48497 -88466 -125312 -60811 20813 42249 -724 -42923 -64601 -66856
28234f6856O7757N4212L3946J0329j2933m4117k7212n0377o1610l7K1292K5475
$$ -66856 901 55113 89059 99388 86455 42338 15126 -35251 -96861 -96898 -75606 -50131
28222e0131J12930J9387q8617m8345o983L8915l3842l8092L3882l6971M5548J7917
$$ -50131 62799 82186 -6431 -54776 -61759 -22844 -56686 -94778 -60896 -97867 -52319 -34402
28210c4402J3020k0613m08L8300m3198r229L8675N4147l1604l6968l1986p7129
$$ -34402 -21382 -41995 -42403 -4103 -47301 -56530 -17855 36292 4688 -32280 -64266 -141395
28198a41395M3250O2069p859M5968O3240Q726l87o3582Q1466M0236m6559o7222
$$ -141395 -98145 -36076 -43935 2033 65273 73999 73612 10030 91496 131732 85173 17951
28186A7951K452K5968L0150M6765j8907m2580J5366q500m0060r160m3156L7235
$$ 17951 20403 46371 76521 123286 104379 61799 77165 68665 28605 19445 -23711 13524
28174A3524J1576m3391j2045P6727P1323q952k8259k4302l2591J1353m5324k3379
$$ 13524 25100 -18291 -30336 46391 117714 108762 80503 56201 23610 34963 -10361 -33740
28162c3740o519L1156j7665L0987j4518m7306k0417K0803K2613Q15R818K5939
$$ -33740 -40259 -9103 -26768 4219 -10299 -57605 -78022 -57219 -34606 -33791 -23973 1966
28150A966L2991j4120n5295j9576R3183j2412j4375R55K9483l9287n5305l8513
$$ 1966 34957 20837 -34458 -54034 39149 26737 12362 13317 42800 3513 -51792 -90305
28138i0305L9659L8039J5022O0579K812q0479l5547P842K2717M7373p355m357
$$ -90305 -50646 -12607 2415 62994 65806 -14673 -50220 -42378 -19661 27712 20357 16000
28126A6000M0266k1957l9341q346r956K8214M6601k393l1078l2112K191L2982
$$ 16000 56266 34309 -5032 -13378 -23334 4880 51481 49088 18010 -14102 -11911 21071
28114B1071L8662J0508l4172q510N8389K9043l8566m9087j7635j9506L7749L0200
$$ 21071 59733 70241 36069 27559 85948 114991 76425 27338 9703 -9803 27946 58146
28102E8146l785n4099k1801L1439K3563O22M618k4911j1877l3274K518L2174L6052
$$ 58146 54361 262 -21539 9900 33463 34085 38703 13792 1915 -31359 -28841 3333 39385
28089C9385l240L02N1709m755l7281n6731o8605j6203M1317R5532K9196J1963
$$ 39385 36145 36447 88156 83401 46120 -10611 -79216 -95419 -54102 41430 70626 82589
28077H2589J30p8376j6781m3126m0647L7362j5736J8037M9038J439N076L1441
$$ 82589 82719 4343 -12438 -55564 -96211 -58849 -74585 -56548 -7510 -6071 -995 30446
28065C0446q584o4516n7488N4711M6349K7578J2852l7353J4811J2272m3992n3508
$$ 30446 21862 -42654 -100142 -45431 918 28496 41348 3995 18806 31078 -12914 -66422
28053f6422J6063K8448M3035n8994J1168n50k6900k0203P5924K0485k4800j7572
$$ -66422 -50359 -21911 21124 -37870 -26702 -27252 -54152 -74355 1569 22054 -2746 -20318
28041b0318L5527j8385j7078L9770j351k8930K6772K1237J5704l7502j3211K7203
$$ -20318 15209 -3176 -20254 19516 18165 -10765 16007 37244 52948 15446 2235 29438
28029B9438J01224M897o4678L2938j7465m9407j1736o1751k5876O2014J02072
$$ 29438 130662 135559 70881 103819 86354 36947 25211 -36540 -62416 -402 101670
28018A01670k0056l7153n4929J8231R561m6253Q499J65K1589l1949j4188L1712
$$ 101670 81614 44461 -10468 7763 17324 -28929 -20430 -20265 1324 -30625 -44813 -13101
28006a3101k749m7698l9961K7031M1516m726j2869l4714M9183Q412j5310L8800
$$ -13101 -15850 -63548 -103509 -76478 -34962 -39688 -52557 -87271 -38088 -29676 -44986 -6186
27994f186K7700J594m624k0035k3316n98N0957j7531m9220j8785K0427K770n0822
$$ -6186 21514 23108 18484 -1551 -24867 -25465 25492 7961 -41259 -60044 -39617 -36847 -87669
27981h7669M4751N1579p224M3104L9289m2251K8300o841m3071o5490k6174P892
$$ -87669 -42918 8661 1437 44541 83830 41579 69879 63038 19967 -45523 -71697 -63805
27969f3805K942K9598L4136J4800l3859k0344L0320o8749M5705Q2388q771O240
$$ -63805 -60863 -31265 2871 17671 -16188 -36532 -6212 -74961 -29256 53132 44361 50601
27957E0601j948M119p6677m6495J0041k6863k174O5879K344n565L1396M552m7442
$$ 50601 48653 52772 -23905 -70400 -60359 -87222 -89396 -23517 -21173 -26738 4658 9210 -38232
27944c8232K2073K9745q793k0564K9573q545J0978K158R782J1916L7314l3664
$$ -38232 -16159 13586 4793 -15771 13802 5257 16235 18393 28175 40091 77405 43741
27932D3741j5312M4335M670q6147n7710Q131L8376J0164L221N6643j4603L5785
$$ 43741 28429 72764 77434 -8713 -66423 -58292 -19916 -9752 -6531 50112 35509 71294
27920G1294J6965M0556m8792r577m4131l8625l7761m975L3475K3365k1661M537
$$ 71294 88259 128815 80023 70446 26315 -12310 -50071 -55046 -21571 1794 -19867 -15330
27908a5330K1998r234R392O5185N5909k5675m6059Q051n7214L0144K3646k3096
$$ -15330 6668 -2566 6826 72011 127920 102245 56186 64237 7023 37167 60813 37717
27896C7717o064j0708Q33O581J3402K7061j5543J8287j2266n0683n9536j6623
$$ 37717 31653 20945 21778 28359 41761 68822 53279 71566 59300 8617 -50919 -67542
27884f7542N6725l493J1864m0092r4628K3484N1648R7201O189L6489m3123k6604
$$ -67542 -10817 -14310 -2446 -42538 -137166 -113682 -62034 35167 41356 77845 34722 8118
27872H118k377p144m31N2379L2252j2913m1600l7K0079m5787r278l5284p027N5172
$$ 8118 5741 -1403 -1834 50545 82797 69884 28284 28247 48326 2539 -6739 -42023 -49050 6122
27858F122M8260k8138l9218L03L6453J2582n2708n7862P347Q114j021j1602N5319
$$ 6122 54382 26244 -12974 -12671 23782 36364 -16344 -74206 -66859 -58745 -59766 -71368 -16049
27845a6049k7430j3325M9340Q8914K2348k5588m2726l9174r60J9906q12m1909
$$ -16049 -43479 -56804 -7464 81450 103798 78210 35484 -3690 -4650 15256 14444 -27465
27833b7465l7392K9786M737K5856J1686K1221J5625k1588l9508j7096R826l0840
$$ -27465 -64857 -35071 -30334 -4478 7208 28429 44054 22466 -17042 -34138 -24312 -55152
27821e5152J8488p209j9655O0647j6704K3333L1510k052m7069l9051M125J3212
$$ -55152 -36664 -43873 -63528 -2881 -19585 3748 35258 33206 -13863 -52914 -48789 -35577
27809c5577N183l9054M3875Q5642n2582m1055m2587j7635K1728L4446K3982P0060
$$ -35577 -30394 -69448 -25573 60069 7487 -33568 -76155 -93790 -72062 -37616 -13634 56426
27797E6426K0665n9153j3442k5020L763R6326J6763l2011j5786k6704l778p575
$$ 56426 77091 17938 4496 -20524 -16761 79565 96328 64317 48531 21827 18049 10474
27785A0474l7252O2556L0185J199r608m6541o991L5904j9992n4496P9778K6308
$$ 10474 -26778 35778 65963 67162 57554 11013 4022 39926 19934 -34562 45216 71524
27773G1524j03096k8802Q431l008K1247l5710O4788N3172k0086n345n88n0908
$$ 71524 -31572 -60374 -51943 -54951 -33704 -69414 -4626 48546 28460 23115 22527 -28381
27761b8381J5220N7023M2478Q252o8164n8759k2768M500j2650P4219N9452k4586
$$ -28381 -13161 43862 86340 94592 26428 -32331 -55099 -50599 -63249 10970 70422 45836
27749D5836m3251k2337j6568o1215j0301M4316L8800L6797k7536n4226K8885j2667
$$ 45836 2585 -19752 -36320 -97535 -107836 -63520 -24720 12077 -15459 -69685 -40800 -53467
27737e3467J6823O095q075J3996K6985n3338J4181Q0581O893m600J2693K8083
$$ -53467 -36644 -30549 -38624 -24628 2357 -50981 -36800 43781 50674 46074 58767 86850
27725H6850M2115o5748p5064k9339N774L2467J3r2711j6452L7204L2391k4700
$$ 86850 128965 63217 -11847 -41186 -35412 -2945 -2932 -95643 -112095 -74891 -42500 -67200
27713f7200o430M067L4866K2301l9530k9509j3771R464L7870O146J8734J4219
$$ -67200 -73630 -69563 -34697 -12396 -51926 -81435 -95206 -85742 -47872 -41726 -22992 -8773
27701h773K587l6649j0618J8778k2849L1875N808J8676K8930J4341J5637q961
$$ -8773 -6186 -42835 -53453 -34675 -57524 -25649 -19841 -1165 27765 42106 57743 48782
27689D8782k3109K2484K8014j8213N528r832K6350K1500k9945o2993P4677N2624
$$ 48782 25673 48157 76171 57958 63486 53654 80004 101504 71559 8566 83243 135867
27677A35867k3050p1280j0445k9648k8124R0543J7853k8925K1561l4343m122j0260
$$ 135867 112817 41537 31092 1444 -26680 63863 81716 52791 74352 40009 35887 25627
27665B5627n559N668m4069p488O870J1857J9912O319M9537o2390n8199m5082N6409
$$ 25627 20068 25736 -18333 -25821 -18951 -7094 12818 19137 68674 6284 -51915 -96997 -40588
27652d0588J057M1603J4259n1850l9352P724O2556K6006k7021m9111l4526N8977
$$ -40588 -39531 2072 16331 -35519 -74871 -67147 -4591 21415 -5606 -54717 -89243 -30266
27640c0266k5223n9966l1960K5314M3225P1418M1121n0310l1936k487j5763J4330
$$ -30266 -55489 -115455 -147415 -122101 -78876 -7458 33663 -16647 -48583 -51070 -66833 -52503
27628e2503J7510p759L2234J7192k9260j5302j1915O1265j3503J685j0415l3029
$$ -52503 -34993 -42752 -10518 6674 -22586 -37888 -49803 11462 -2041 -356 -10771 -43800
27616d3800l2247J5625r161K2253K2675K9008J6609j121n454p78k7611k4611k5902
$$ -43800 -76047 -60422 -69583 -47330 -24655 4353 20962 19841 14387 13609 -14002 -38613 -64515
27603f4515K8591O617L0281N2578n1865J296N2908L1186L0207m5733q471K6195
$$ -64515 -35924 -29307 974 53552 1687 2983 55891 87077 117284 71551 63080 89275
27591H9275j2050k7339k9467j9610j6769n8423L3793K9922L3690K1754M1332l5098
$$ 89275 77225 49886 20419 809 -15960 -74383 -40590 -10668 23022 44776 86108 51010
27579E1010n1388m1117k3000j990N5723L6460m009m0557M226k84L0273l4146j7705
$$ 51010 -378 -41495 -64495 -66485 -10762 25698 21689 -18868 -14642 -14926 15347 -18799 -36504
27566c6504k3723L3433N415K9170L6197M7212L2343L0614m4676l9298o411r548
$$ -36504 -60227 -26794 -21379 7791 43988 91200 123543 154157 109481 70183 63772 54224
27554E4224r2191q1613J1019q505M427M8660L6697J1956j419P233L0478j2431
$$ 54224 -37967 -119580 -108561 -117066 -112639 -63979 -27282 -15326 -16745 -9512 20966 8535
27542H535n8692M1461L1044Q386N9996n1895q686k598R512r888n5305K7492Q298
$$ 8535 -50157 -8696 22348 30734 90730 38835 30149 27551 37063 27175 -28130 -638 7660
27529G660m5457K315L1203M5760k4238n390n611m5492J7198J4528n3208k5638
$$ 7660 -37797 -35482 -4279 41481 17243 11853 6242 -39250 -22052 -7524 -60732 -86370
27517h6370R6157L4613M7150k5859j8078K6790l243p071K1234j1979m5398o6947
$$ -86370 9787 44400 91550 65691 47613 74403 71160 64089 85323 73344 27946 -39001
27505c9001l0815l820K4531r551j2007K6556L6985P2054M5262K8445p0456m473
$$ -39001 -69816 -73636 -49105 -58656 -70663 -44107 -7122 64932 110194 138639 68183 63710
27493F3710M9601l8232m2816K9433k4039n0687m6618N7737j8933l6387J3202K5152
$$ 63710 113311 75079 32263 61696 37657 -13030 -59648 -1911 -20844 -57231 -44029 -18877
27481a8877J6359l4118k2101M124l30J5577k3209O199p528K0671j3832k7916K9941
$$ -18877 -2518 -36636 -58737 -54613 -54943 -39366 -62575 -56376 -63904 -43233 -57065 -84981 -55040
27468e5040N6825K0537n8608l8852N777J8118M6257j0661l6526M6359l3761l1851
$$ -55040 1785 22322 -36286 -75138 -69361 -51243 -4986 -15647 -52173 -5814 -39575 -71426
27456g1426J3765N125k526l7410K0839N773k7209K7390j4676O28J3271M9317L6526
$$ -71426 -57661 -52536 -55062 -92472 -71633 -65860 -93069 -65679 -80355 -79727 -66456 -17139 19387
27443A9387O8081k2943q0544k7512J4928p101Q606L4284P1118l5281Q490l7078
$$ 19387 87468 64525 -16019 -43531 -28603 -35704 -27098 7186 78304 43023 51513 14435
27431A4435N681j9301p297j4007L904j7194j5986J2998n872J225K7437n1107Q1928
$$ 14435 20116 815 -6482 -20489 -16585 -33779 -49765 -36767 -42639 -41414 -13977 -65084 16844
27418A6844L3773j7372l498m2060p692N0068O0202l3908r5872R57K2251k5382
$$ 16844 50617 33245 29747 -12313 -20005 30063 90265 56357 -39515 -38558 -16307 -41689
27406d1689n0030q689L2926P1804l943n973l142L5519N7649k6891n0840j8605
$$ -41689 -91719 -100408 -67482 4322 379 -5594 -8736 26783 84432 57541 6701 -11904
27394a1904J650k5546j6512l6397m058K3938K9065L5453K4788K6164o757l0969
$$ -11904 -10254 -35800 -52312 -88709 -92767 -68829 -39764 -4311 20477 46641 39884 8915
27382H915K2849J7125n5135L4792J6167P470j4082m1472j5042M64j4199O489K0353
$$ 8915 31764 48889 -6246 28546 44713 52183 38101 -3371 -18413 -17949 -32148 -25659 -5306
27369e306J7492L2869J8993n0967o028K8475k5564j0642K7373L5820m4394k7919
$$ -5306 12186 45055 64048 13081 7053 35528 9964 -678 26695 62515 18121 -9798
27357i798o4343L3731J0737J9784r492k6477O3648M3643m2812p996P929l6783
$$ -9798 -74141 -40410 -29673 -9889 -19381 -45858 17790 61433 18621 10625 18554 -18229
27345a8229k3687P088J9354K6910m4049P528j0288k9762k942j9698R797L0912
$$ -18229 -41916 -34828 -15474 11436 -32613 -25085 -35373 -65135 -68077 -87775 -77978 -47066
27333d7066J6893L8992k3506J2824M8926J9419j5165M8884j5499k1704j5941q2887
$$ -47066 -30173 8819 -14687 -1863 47063 66482 51317 100201 84702 62998 47057 -35830
27321c5830K4004O4110k071m6922q2233m1293j7062j2259N0350K0639N8168J80
$$ -35830 -11826 52284 50213 3291 -78942 -120235 -137297 -149556 -99206 -78567 -20399 -20219
27309b0219l7639L5705K5393l4398J5085L0599m445l7665O1487M5778p0419l5713
$$ -20219 -57858 -22153 3240 -31158 -16073 14526 10081 -27584 33903 79681 9262 -26451
27297b6451j3405L602n276k3178L8019L853Q485M101r436N0527j2781m5248k073
$$ -26451 -39856 -36254 -41530 -64708 -26689 -22836 -14351 -10250 -19686 30841 18060 -27188 -29261
27284b9261o947L2514O8632N5830l1060l8240R755k5757m1580k9326J062M0327
$$ -29261 -36208 -3694 64938 120768 89708 51468 61223 35466 -6114 -35440 -34378 5949
27272E949K0425K5799K8951q08l2540j3278o169n9138P4406O8077o2708m3987
$$ 5949 26374 52173 81124 80316 47776 34498 28329 -30809 43597 111674 48966 4979
27260D979N598K7984K380q229J2424j3465j4991L9248n0834m1524m6932r587N3773
$$ 4979 10577 38561 40941 32712 45136 31671 16680 55928 5094 -36430 -83362 -92949 -39176
27247c9176N3842K2179M5727K017m8912l3037L1323L5296p353j0285L9814j986
$$ -39176 14666 36845 82572 84589 35677 2640 33963 69259 61906 51621 91435 89449
27235H9449q5333p0670L5969J5046J1617M070L1277K4841M134k3458l1017o2478
$$ 89449 4116 -66554 -30585 -15539 -3922 148 31425 56266 60400 36942 5925 -56553
27223e6553K1288M0170K7431M349k0600J3565l0694l3640K1121J7884p248J1522
$$ -56553 -35265 4905 32336 36685 16085 29650 -1044 -34684 -13563 4321 -2927 8595
27211H595l943J4665L8583o1192K0192K7085j5533k1527k6013j00117l809P3530
$$ 8595 4652 19317 57900 -3292 16900 43985 28452 6925 -19088 -119205 -123014 -49484
27199d9484J5901n379L994r747L6010j7187J4704M8308j7772Q371L7312l8008
$$ -49484 -33583 -38962 -34968 -44715 -8705 -25892 -11188 37120 19348 27719 65031 27023
27187B7023k3843m1309J427K4794N5742k486k9551k9337k7680N0543k627K6031
$$ 27023 3180 -38129 -36702 -11908 43834 41348 11797 -17540 -45220 5323 2696 28727
27175B8727l014l3290J1393l6612k809J3528J9119j118K5568M949m1673k6096
$$ 28727 25713 -7577 3816 -32796 -35605 -22077 -2958 -4076 21492 26441 -15232 -41328
27163d1328j503M521J7794r034m6877j0262K5175P49L6041J0399P696o4615n817
$$ -41328 -42831 -38310 -20516 -29550 -76427 -86689 -61514 -60765 -24724 -14325 -6629 -71244 -77061
27150g7061J6048J3509L2776J1346J2968k0422k1139l272K2204K9287K089j345
$$ -77061 -61013 -47504 -14728 -3382 9586 -10836 -31975 -35247 -13043 16244 18333 16988
27138A6988j1846J1383j7209l8415K1023L1983j0745l7273k6572k6614M4789j0492
$$ 16988 5142 16525 -684 -39099 -18076 13907 3162 -34111 -60683 -87297 -42508 -53000
27126e3000m5723J9967R1324N2769l1005j5092p0982R051O3819j0744R832j1730
$$ -53000 -98723 -78756 12568 65337 34332 19240 -51742 -42691 21128 10384 20216 8486
27114H486r190l1771n5233Q020M7838M259M480j912K2428k8279O6617L9336p2612
$$ 8486 -704 -32475 -87708 -79688 -31850 -27591 -23111 -25023 -2595 -30874 35743 75079 2467
27101B467j3940N18K688O292K0476k8806L5745j433j882k2474k4613J2299N2190
$$ 2467 -11473 -10955 -8267 -1975 18501 -10305 25440 24007 22125 -349 -24962 -12663 39527
27088C9527Q2432k3882m9133l019k1463k3143j9417O788q801n0607M5564J1121
$$ 39527 121959 98077 48944 45925 24462 1319 -18098 -11310 -20111 -70718 -25154 -14033
27076a4033K2893M9613m7822m0203l6692J1594L2997L0640N8573m7482M649L1761
$$ -14033 8860 58473 10651 -29552 -66244 -54650 -21653 8987 67560 20078 24727 56488
27064E6488R964J4801k3563m0256k5269o0558j5037J7206K3450L5780M9787n120
$$ 56488 66452 81253 57690 17434 -7835 -68393 -83430 -66224 -42774 -6994 42793 37673
27052C7673l1902j1583M7081K86j5174L8161K4627j4778n9035J7901K1166p2302
$$ 37673 5771 -5812 41269 41555 26381 64542 89169 74391 15356 33257 54423 -17879
27040a7879p1124J5846q344N0684L8567K4257k483o5824j6597L5965M4533j4855
$$ -17879 -89003 -73157 -81501 -30817 7750 32007 29524 -36300 -52897 -16932 27601 12746
27028A2746k5642k4298k5949L3052O4631M1109M7003k5262m7151m9227J2375l2569
$$ 12746 -12896 -37194 -63143 -30091 34540 75649 122652 97390 50239 1012 13387 -19182
27016a9182k9293K1840M3669k4460m1453k7413O911J3844p390k4760K6661J3000
$$ -19182 -48475 -26635 17034 -7426 -48879 -76292 -69381 -55537 -62927 -87687 -61026 -48026
27004d8026J4620J8328L5449j112k5828r53j2222Q387M6598r645k2793k9981K8511
$$ -48026 -33406 -15078 20371 19259 -6569 -7522 -19744 -11357 35241 25596 2803 -27178 1333
26991A333L730M0882j5706j05027J2754L4017k0552L0570o838m6128l9249k1810
$$ 1333 5063 45945 30239 -74788 -62034 -28017 -48569 -17999 -24837 -70965 -110214 -132024
26979a32024K2397K1576k1711L8180N8342N131k6330m7890N4088M5104j3711r5121
$$ -132024 -109627 -88051 -109762 -71582 -13240 -8109 -34439 -82329 -28241 16863 3152 -91969
26967i1969K4028k9068p0089P942O8981M4576l9375J9917k5130p363K0311L201
$$ -91969 -67941 -97009 -167098 -159156 -90175 -45599 -84974 -65057 -90187 -97550 -77239 -74038
26955g4038M4000K644M3630O6283L0532p4558n1707L095J6693k0176J0344O3804
$$ -74038 -30038 -27394 16236 82519 113051 38493 -13214 -10119 6574 -13602 -3258 60546
26943F0546j2187o2902m7018J1050L0506K554L585O7319M074n2608L0204J6575
$$ 60546 48359 -14543 -61561 -50511 -20005 -17451 -13866 53453 57527 4919 35123 51698
26931E1698p8065j8797J0871M2730j1770k314L8251k1348k6986R7167l914o1104
$$ 51698 -26367 -45164 -34293 8437 -3333 -5647 32604 11256 -15730 81437 77523 16419
26919A6419j0842l00P0013l63l8777l5924N98l548L3304l7548m0695Q071L7062
$$ 16419 5577 5277 75290 74927 36150 226 824 -2724 30580 -6968 -47663 -39592 -2530
26906b530J1980j5236M5321l251l8708l472J0070Q987L0216j1850l2374K2077
$$ -2530 9450 -5786 39535 36284 -2424 -5896 4174 13161 43377 31527 -847 21230
26894B1230j2042k486J5488q9920m8769L258R6122j3378J2685N7143j79j2960
$$ 21230 9188 6702 22190 -67730 -116499 -113241 -17119 -30497 -17812 39331 39152 26192
26882B6192l579R219J3742j2406j3851J0817k9592l1371J2268n5793J1310L7793
$$ 26192 22613 31832 45574 33168 19317 30134 542 -30829 -18561 -74354 -63044 -25251
26870b5251P0812j7210l3040R366l480m3122r637N0780N5753R284K2476k7374
$$ -25251 45561 28351 -4689 4677 1197 -41925 -51562 -782 54971 64255 86731 59357
26858E9357l1565k6518L4746j2402n5703N6796P631p375J7277K4926r068p7908
$$ 59357 27792 1274 36020 23618 -32085 24711 32342 24967 42244 67170 58102 -19806
26846a9806m0642J7133M1989P494k2877p659J3391K4872M0927M4461J9575l0139
$$ -19806 -60448 -43315 -1326 6168 -16709 -24368 -10977 13895 54822 99283 118858 88719
26834H8719n6059l6517L6349N7993k7386J4597J4469L0954n8477o6302j2100l1045
$$ 88719 32660 -3857 32492 90485 63099 77696 92165 123119 64642 -1660 -13760 -44805
26822d4805l0674N7417K8899J3441k9484k6703K5425m0694m5049L8418L4805J149
$$ -44805 -75479 -18062 10837 24278 -5206 -31909 -6484 -47178 -92227 -53809 -19004 -17855
26810a7855l0885m798k1304J2364j5397L9471O3170J1634m351j3145k4809J6634
$$ -17855 -48740 -53538 -74842 -62478 -77875 -38404 24766 36400 32049 18904 -5905 10729
26798A0729r185j0682N4585L9098j8859m8139n2031N9300j7984k8587L8610j0927
$$ 10729 1544 -9138 45447 84545 65686 17547 -34484 24816 6832 -21755 16855 5928
26786E928q1629M542K7337O1871q658P563Q379m7350j2416j7837m418L8980K9268
$$ 5928 -75701 -71159 -43822 18049 9391 16954 25333 -22017 -34433 -52270 -56688 -17708 11560
26773A1560M9946M7205m0614r194k5025m1803l6599M4966O93k7023k9005M6533
$$ 11560 61506 108711 68097 58903 33878 -7925 -44524 442 1135 -25888 -54893 -8360
26761h360K5052K165r1k734r056O78j3748K4008j0711l1148L823J9736j9746K6939
$$ -8360 16692 18857 18766 16032 6976 7654 -6094 17914 7203 -23945 -20122 -386 -20132 6807
26747F807k6485M8664N806K0792M213n6345o9475l911K5930L0539l7248j1144
$$ 6807 -19678 28986 34792 55584 59797 3452 -66023 -69934 -44004 -13465 -50713 -61857
26735f1857K8406K6663j519p399J6009L0040J4890L674k9212J945l529k8551N58
$$ -61857 -33451 -6788 -8307 -15706 303 30343 45233 48907 19695 21640 18111 -10440 -9882
26722i882l2285J4168j7621L1374L4715k8582L1358k0161p8160J6856P9624N5912
$$ -9882 -42167 -27999 -45620 -14246 20469 -8113 23245 3084 -75076 -58220 21404 77316
26710G7316r58J3482o911K2802l6619p8354K378M268n7751k5206L8650l9596l4290
$$ 77316 76358 89840 82929 105731 69112 -9242 -6864 -2596 -60347 -85553 -46903 -86499 -120789
26697a20789K1779Q0406J2031K3749J1867O523M0458N62n2610j11496n2028k657
$$ -120789 -99010 -18604 -6573 17176 29043 35566 76024 76586 23976 -87520 -139548 -142205
26685a42205n408j659M9146J3929N2097K5849k391k2046j6540J4068M4908q839
$$ -142205 -147613 -149272 -100126 -86197 -34100 -8251 -10642 -32688 -49228 -35160 9748 909
26673I09k5608n1159K5570k7407k2740N583J8402P7116O0400j8913l1041l7241
$$ 909 -24699 -75858 -50288 -77695 -100435 -94852 -76450 666 61066 42153 11112 -26129
26661b6129J8282N557k0494n2173L837K8748L8947K9019j5377L8504R9589j7451
$$ -26129 -7847 -2290 -22784 -74957 -71120 -42372 -3425 25594 10217 48721 148310 130859
26649A30859j6773j2253j3993k4751k01j7776l4223m6402L0678n7986k8056K0896
$$ 130859 114086 101833 87840 63089 62888 45112 10889 -35513 -4835 -62821 -90877 -69981
26637f9981J9755N489L2788k8996l7517j4045j9586Q883j0355K0838O8591M4077
$$ -69981 -50226 -44737 -11949 -40945 -78462 -92507 -112093 -103210 -113565 -92727 -24136 19941
26625A9941l1375r817J2624N5727M2010l4219l2856p873M6562K9125n727m6399
$$ 19941 -11434 -21251 -8627 47100 89110 54891 22035 14162 60724 89849 84122 37723
26613C7723J3158L1584j9365p1136p1599j4291N8203M5643P813k4405J3502M2234
$$ 37723 50881 82465 63100 -8036 -79635 -93926 -35723 9920 17733 -6672 6830 49064
26601D9064M0741K0396l1902R180n5563n5719k5129j0416M9615j5903o004J5519
$$ 49064 89805 110201 78299 87479 31916 -23803 -48932 -59348 -9733 -25636 -31640 -16121
26589a6121N942k3497n6328O4353J9q0388l401M3526N8483Q905j718L9035M3699
$$ -16121 -10179 -33676 -90004 -25651 -25632 -106020 -109421 -65895 -7412 1493 -225 38810 82509
26576H2509j0604M5222j664r7657m6477j2428M447k4502l7328M2507P8624J9887
$$ 82509 71905 117127 115463 17806 -28671 -41099 -36652 -61154 -98482 -55975 22649 42536
26564D2536k5181l8306q065k8257k5105N823O6209J5225n235k8574j2273p110
$$ 42536 17355 -20951 -29016 -57273 -82378 -76555 -10346 4879 -356 -28930 -41203 -48313
26552d8313J8260J4417K7487K2433r480j3999O987M3963k9217m3989j5076j0382
$$ -48313 -30053 -15636 11851 34284 24804 10805 17792 61755 32538 -11451 -26527 -36909
26540c6909K6385K2560m2511r3979L549J6752J7348L9544j3699m0457k0199K6360
$$ -36909 -10524 12036 -30475 -124454 -120905 -104153 -86805 -47261 -60960 -101417 -121616 -95256
26528i5256m127j8776N7117L183Q156R0938O1685l6028k2362n033J6021n8127
$$ -95256 -99383 -118159 -61042 -57859 -49703 41235 102920 66892 44530 39497 55518 -2609
26516b609J6278k4126k5194K7873O4263N2189k313K9159q282m6198n4710o9288
$$ -2609 13669 -10457 -35651 -7778 56485 108674 106361 135520 127238 81040 26330 -42958
26504d2958j568M6463l290r196L3174J1118l2595J1220l163k6955p793M0370p205
$$ -42958 -44526 1937 -1353 -10549 22625 33743 1148 12368 9205 -17750 -25543 14827 7622
26491G622k3933j9351K6064J3057K024P368L002P456k5843K451O521M749k1128
$$ 7622 -16311 -35662 -9598 3459 5483 12851 15853 23309 -2534 -83 6438 11187 -9941
26478i941O047P6014J5775n2890j8768O724L0904K8050J5393k6233m0889l7191
$$ -9941 -3894 72120 87895 35005 16237 22961 53865 81915 97308 71075 30186 -7005
26466g005k3213N465l4445k0047L9524P4604J1902n7132M5351P7447J006l8349
$$ -7005 -30218 -24753 -59198 -79245 -39721 34883 46785 -10347 35004 112451 113457 75108
26454G5108m1691M1844K561l0639O7976N1995k1253l3334k1716l232N9079K5352
$$ 75108 33417 75261 77822 47183 115159 167154 145901 112567 90851 87619 146698 172050
26442A72050p7149o9617l1832k3799m9165o104J4183O0308J0870j3988J491r512
$$ 172050 94901 25284 -6548 -30347 -79512 -85616 -71433 -11125 -255 -14243 -12752 -22264
26430b2264M7581k9292l331J3618l423N0313k575k7351m6690L6332Q504j5234
$$ -22264 25317 -3975 -7306 6312 2889 53202 50627 23276 -23414 12918 21422 6188
26418F188j7340k3568j5014j7883M501N7763P5456k1143k9760N8686J5954o5758
$$ 6188 -11152 -34720 -49734 -67617 -63116 -5353 70103 48960 19200 77886 93840 28082
26406B8082p4694J5403l1159o8021l0575P0552P7970J3822m1328q75J0716j8998
$$ 28082 -46612 -31209 -62368 -130389 -160964 -90412 -12442 1380 -39948 -40823 -30107 -49105
26394d9105O1235N9742o4488n9716k0113J3860M5586J6110M3069J4918L7334q409
$$ -49105 12130 71872 7384 -52332 -72445 -58585 -12999 3111 46180 61098 98432 90023
26382I0023J1355m7159n901m4852k6928k2460J2771l5300k4847N3375J3489j1394
$$ 90023 101378 54219 48318 3466 -23462 -45922 -33151 -68451 -93298 -39923 -26434 -37828
26370c7828N865m2214N0136l4892k6758J6491K2166j5293L283O1850k3211o0697
$$ -37828 -31963 -74177 -24041 -58933 -85691 -69200 -47034 -62327 -59044 2806 -20405 -81102
26358h1102o365l0590j9445L7432k2681K3866N4738J10115L9767j8098j8924k0742
$$ -81102 -87467 -118057 -137502 -100070 -122751 -98885 -44147 65968 105735 87637 68713 47971
26346D7971k0513j0363n6258j8322M2035N7032j4310l4957L7446O7410M8786R560
$$ 47971 27458 17095 -39163 -57485 -15450 41582 27272 -7685 29761 97171 145957 155517
26334A55517p3500l9797O779o90J3172j289K4698m2761k3668k54O8642P0833l0385
$$ 155517 82017 42220 48999 48309 61481 60192 84890 42129 18461 18207 86849 157682 127297
26321A27297o0013k2056k3344J4493L4383O800n7561k3537J5858K895J5212m6206
$$ 127297 67284 45228 21884 36377 70760 77560 19999 -3538 12320 15215 30427 -15779
26309a5779j402m6473p894q1541o370L5667N0118N0759q596o5552P7881O4519
$$ -15779 -17181 -63654 -71548 -153089 -159459 -123792 -73674 -22915 -31511 -97063 -19182 45337
26297D5337L1863l8757L8821J4900M3278J4872m522p2297m5165p076M2874M8476
$$ 45337 77200 38443 77264 92164 135442 150314 145792 73495 28330 21254 64128 112604
26285A12604N6923k2823j9534j7132K2484r455m7994l1619m7231k7031Q0408L4646
$$ 112604 169527 146704 127170 110038 132522 123067 75073 43454 -3777 -30808 49600 84246
26273H4246n5147l9008L6762l0637j9868J4058J0188N2631k5391Q855J5l9793
$$ 84246 29099 -9909 26853 -3784 -23652 -9594 594 53225 27834 36689 36704 -3089
26261c089k8490Q6346K3768m619p0983n11K4854o979j6987q76O2162K8621J3754
$$ -3089 -31579 54767 78535 73916 2933 2422 27276 20297 3310 2434 64596 93217 106971
26248A06971m0156q7937J6332J5294M847K842L2238M7839n7664n2972K8817P6304
$$ 106971 66815 -21122 -4790 10504 15351 18193 50431 98270 40606 -12366 16451 92755
26236I2755L1065k5475K5829l3016q3302K4794M9m2396j351O4800j208j1985O613
$$ 92755 123820 98345 124174 91158 7856 32650 32699 -9697 -11048 53752 52544 40559 47172
26223D7172L8425k27q0787n1024j7032o429O0307O9671m037J5077p572N082n1835
$$ 47172 85597 85370 4583 -46441 -63473 -69902 -9595 60076 56039 71116 63544 68626 16791
26210A6791j3282p201l2489k8434K3411P212j8373l0651O3297r309m5948n8679
$$ 16791 3509 -3692 -36181 -64615 -41204 -33992 -52365 -83016 -19719 -29028 -74976 -133655
26198a33655O2246K9977o5918K4592O8526M335K6760K8065j0855l6331o896L7346
$$ -133655 -71409 -41432 -107350 -82758 -14232 -9897 16863 44928 34073 -2258 -9154 28192
26186B8192J4232K7973k3883k935L4520j6745P929O8711J881l9224k2559m6737
$$ 28192 42424 70397 46514 43579 78099 61354 69283 137994 139875 100651 78092 31355
26174C1355k2796j3828O801l5734m5379L5527L1533L3647m2125q1534n6078L4417
$$ 31355 8559 -5269 1532 -34202 -79581 -44054 -12521 21126 -20999 -102533 -158611 -124194
26162a24194M4449K3086N3605K1430K5256k876l9235m3646K0800N4381K7019n9122
$$ -124194 -79745 -56659 -3054 18376 43632 40756 1521 -42125 -21325 33056 60075 953
26150I53j0915k0299n655L7793O7586J9812m4241m4929j3057N236L8324j1882
$$ 953 -9962 -30261 -35916 1877 69463 89275 45034 105 -12952 -7716 30608 18726
26138A8726k7580p5828o1673j3402L8257L019N9345K7631K3496J6105l2816J6960
$$ 18726 -8854 -84682 -146355 -159757 -121500 -118481 -59136 -31505 -8009 8096 -24720 -7760
26126g760k1401O8509k6948M285J9287k9400k9729l168R140p9995M812N7702N6258
$$ -7760 -29161 39348 12400 16685 35972 6572 -23157 -26325 -17185 -97180 -92368 -34666 21592
26113B1592K0760m8451J919k5498N0009M8194l3826k8504J2990k3110q2942m5776
$$ 21592 42352 -6099 -4180 -29678 20331 68525 34699 6195 19185 -3925 -86867 -132643
26101a32643J5788M0310M1671M9401r350Q460K8496k0617j7454K1296q443n270
$$ -132643 -116855 -76545 -34874 14527 5177 13637 42133 21516 4062 25358 16915 11645
26089A1645N2823K1355l7102l9584j1011j5957J1225k857k2442l5672n55N6897
$$ 11645 64468 85823 48721 9137 -1874 -17831 -6606 -9463 -31905 -67577 -68132 -11235
26077a1235J8372m9520l6074R757K520j3965M0877P9679j1171m512J1454K1558
$$ -11235 7137 -42383 -78457 -68700 -66180 -80145 -39268 40411 29240 24728 36182 57740
26065E7740L815p215l2403K2159l5602n6954l504J3143O4118r315j6694M7310
$$ 57740 61555 54340 21937 44096 8494 -48460 -51964 -38821 25297 15982 -712 46598
26053D6598N8207j9631m4041j07900l2027P0125L9603M263r8660q4973P057N4957
$$ 46598 104805 85174 41133 -66767 -98794 -28669 10934 15197 -83463 -168436 -161379 -106422
26041a06422Q3442M8194K033n5756N4580K9280J5260M7229j6527o6931m7606k5434
$$ -106422 -22980 25214 27247 -28509 26071 55351 70611 117840 101313 34382 -13224 -38658
26029c8658J6728L4056L1989m4758m4214K8916p088J1908p408k9344L986k6393
$$ -38658 -21930 12126 44115 -643 -44857 -15941 -23029 -11121 -18529 -47873 -43887 -70280
26017g0280L5502K0170J7783k4525k4034J9533N6352J6218J6152J6231j4559j6309
$$ -70280 -34778 -14608 3175 -21350 -45384 -25851 30501 46719 62871 79102 64543 48234
26005D8234k3918k5719J2392R58M2674p070N671K2724P903k2722j4724k0563l6237
$$ 48234 24316 -1403 10989 11947 54621 47551 53222 75946 83849 61127 46403 25840 -10397
25992a0397J2407m432N1106L0599K1966M153j558Q082l1380l3692n825J5052J6230
$$ -10397 2010 -2422 48684 79283 101249 105402 103844 111926 80546 46854 41029 56081 72311
25979G2311l8141l3061n869l544j3843m1649L313K8511J9072L651L2594L2348
$$ 72311 34170 1109 -4760 -8304 -22147 -63796 -60483 -31972 -12900 -9249 23345 55693
25967E5693l3006M155j2671K9494Q712J4368o2927l7092J9367l2627j170K3958
$$ 55693 22687 26842 14171 43665 52377 66745 3818 -33274 -13907 -46534 -47704 -23746
25955b3746j5754k3656j1998o754n556M5418K3942k8007L7439K8544L5334l694
$$ -23746 -39500 -63156 -75154 -81908 -87464 -42046 -18104 -46111 -8672 19872 55206 51512
25943E1512m4054k1012M4241L2528m6588o779j8884l2968K1900M6925k7658m8500
$$ 51512 7458 -13554 30687 63215 16627 9848 -9036 -42004 -20104 26821 -837 -49337
25931d9337M7346M4004m8491l2407j8928n2947M2274N2874M7527j6793J5567J9065
$$ -49337 -1991 42013 -6478 -38885 -57813 -110760 -68486 -15612 31915 15122 30689 49754
25919D9754q111N0121J7899p8157N433O8481k4177k0334l1991P995k3283j3283
$$ 49754 41643 91764 109663 31506 36939 105420 81243 60909 28918 36913 13630 347
25907C47l3541n1460k3655k9140M9399Q5688K373p2513m1531N002k4433M5110
$$ 347 -33194 -84654 -108309 -137449 -88050 -2362 11 -72502 -114033 -109031 -133464 -88354
25895h8354K8174K2444K9831m908n4903j7510N7005P965o839o739j595l3669m4407
$$ -88354 -60180 -37736 -7905 -12813 -67716 -85226 -28221 -20256 -27095 -33834 -35429 -69098 -113505
25882a13505Q820Q7138N8220M617R047j0258M015l0091j3163K8024j0506r09J3324
$$ -113505 -104685 -17547 40673 45290 54337 44079 48094 18003 4840 32864 22358 21449 34773
25869C4773l0448j9560n278L997K5031o8856l0552K9773M9469L6668N1342J2592
$$ 34773 4325 -15235 -20513 -16516 8515 -60341 -90893 -61120 -11651 25017 76359 88951
25857H8951m722j16487l6099J2752N4263K7469j079K0610m596p0438n2871J7380
$$ 88951 84229 -32258 -68357 -55605 -1342 26127 25048 45658 41062 -29376 -82247 -64867
25845f4867R4136L3436J7445r236k3213l4209j6236k1762j1527r822n9242N0560
$$ -64867 29269 62705 80150 70914 47701 13492 -2744 -24506 -36033 -45855 -105097 -54537
25833e4537K0627l2255R0816M0875m9626m940N9037N7570j3425o9545k7715j5611
$$ -54537 -33910 -66165 24651 65526 15900 10960 69997 127567 114142 44597 16882 1271
25821A271k5340k6220K2130N2442L2584P599N2787m7868q2145R755M0260M5905
$$ 1271 -24069 -50289 -28159 24283 56867 64466 117253 69385 -12760 -3005 37255 83160
25809H3160j8356M5867l5694o0879j2742J3722k132l9802J5566N5313n3036M762
$$ 83160 64804 110671 74977 14098 1356 15078 12946 -26856 -11290 44023 -9013 -4251
25797d251L1174j5902n9837m3350O703J9543N1592m8862j9252J00715J9571l7762
$$ -4251 26923 11021 -48816 -92166 -85463 -65920 -14328 -63190 -82442 18273 37844 82
25785H2J9420R199K7769j7688J4481l9086l8365K6685K7514j4825j655P64R628
$$ 82 19502 28701 56470 38782 53263 14177 -24188 2497 30011 15186 13531 14295 23923
25772B3923k9096j0364J143n4505M4080O6083N0628k4662k5645l6835n1666J3200
$$ 23923 -5173 -15537 -14394 -68899 -24819 41264 91892 67230 41585 4750 -46916 -33716
25760c3716Q727J7486k5061n3496p216j2537m296K7579J9486l1381J0686Q1157
$$ -33716 -24989 -7503 -32564 -86060 -93276 -105813 -110109 -82530 -63044 -94425 -83739 -2582
25748b582M0518R967j5946l3733j6799k9633j3740l7916M6769O6637M019k2242
$$ -2582 37936 47903 31957 -1776 -18575 -48208 -61948 -99864 -53095 13542 17561 -4681
25736d681m4434m7069j133L2981K1691r46J5207K6190Q852K8281n7428m3755l101
$$ -4681 -49115 -96184 -97317 -64336 -42645 -43591 -28384 -2194 6658 34939 -22489 -66244 -69345
25723f9345L3225N2028M6156N213J59M3591m341l3802J4763P948m778k2248K1073
$$ -69345 -36120 15908 62064 67277 67436 111027 106686 72884 87647 95595 90817 68569 89642
25710H9642j2379p5102k0232O882l961N7751r240l5523L8919L0785j7997m1070
$$ 89642 77263 2161 -18071 -11189 -15150 42601 33361 -2162 36757 67542 49545 8475
25698H475n1659J1520Q815K3416J7101j156R208p4401n5073K5442K8984m264L8403
$$ 8475 -43184 -31664 -22849 567 17668 16512 25720 -48681 -103754 -78312 -49328 -53592 -15189
25685a5189M2468l9702k362N6107J05K5063j2754K4442K5472q859m7829m78L3895
$$ -15189 27279 -12423 -14785 41322 41427 66490 53736 78178 103650 94791 46962 46484 80379
25672H0379K6627p6576n7044K5141k1265l8568n56k8490M1472M2423L4970l494
$$ 80379 107006 30430 -26614 -1473 -22738 -61306 -61862 -90352 -48880 -6457 28513 25019
25660B5019K8409l6194r8195l5980L353K0227k4987J0325L4234M2066M8611l4086
$$ 25019 53428 17234 -80961 -116941 -113588 -93361 -118348 -108023 -73789 -31723 16888 -17198
25648a7198l3910p305K2180J4258j7530m13M5363K0132j1810l7119o4351K3342
$$ -17198 -51108 -58413 -36233 -21975 -39505 -39918 5445 25577 13767 -23352 -87703 -64361
25636f4361N2500l821m6207K3888N0666L1248l5731n6506l2827k7885J5652K8687
$$ -64361 -11861 -15682 -61889 -38001 12665 43913 8182 -48324 -81151 -109036 -93384 -64697
25624f4697N4293J0426Q221k6009m9882m4496L2935J7804M5366R1718N3157m3867
$$ -64697 -10404 22 8243 -17766 -67648 -112144 -79209 -61405 -16039 75679 128836 84969
25612H4969o4399j6014K0744M6551k9786j8106k5298j2439K8372j3319n2563k0559
$$ 84969 20570 4556 25300 71851 42065 23959 -1339 -13778 14594 1275 -51288 -71847
25600g1847l2100P2864M8487l2456m1151O0756N4554J7994p0445q6146k7739k7543
$$ -71847 -103947 -31083 17404 -15052 -56203 4553 59107 77101 6656 -79490 -107229 -134772
25588a34772L9686P4101p444M50m0995L8921O0988l0156k558L837k1366L5308
$$ -134772 -95086 -20985 -28429 -27979 -68974 -30053 30935 779 -1779 2058 -19308 16000
25576A6000k164N010O3880K0538o5004j1272l4052l3718j1485O0933M377K450
$$ 16000 13836 18846 82726 103264 38260 26988 -7064 -40782 -52267 8666 13043 15493
25564A5493M829j1280j299K6784J4732l1953n5321K115k1335k4737k2229J8604
$$ 15493 20322 9042 7743 34527 49259 17306 -38015 -35900 -57235 -81972 -104201 -85597
25552h5597J4076o469M498K7370P5159M4935n4528k9499M3170j2134l0625k5940
$$ -85597 -71521 -77990 -73492 -46122 29037 73972 19444 -10055 33115 20981 -9644 -35584
25540c5584K7903j9218j6865J4915J6593k9277o1N3366L3913o7250j3205K1455
$$ -35584 -7681 -26899 -43764 -28849 -12256 -41533 -41594 11772 45685 -21565 -34770 -13315
25528a3315m55k5004j6850K1052J7414k3468J4916L4325J3189L3403o6428j7322
$$ -13315 -13770 -38774 -55624 -34572 -17158 -40626 -25710 8615 21804 55207 -11221 -28543
25516b8543j5134l2653M0603M7414p962n740M5148j3732R0749J6636j13450m1439
$$ -28543 -43677 -76330 -35727 11687 3725 -2015 43133 29401 120150 136786 23336 -18103
25504a8103j0650R347j8184J3926j8946m506L6213k3364J4164r075L5990J4393
$$ -18103 -28753 -19406 -37590 -23664 -42610 -47116 -10903 -34267 -20103 -29178 6812 21205
25492B1205k4882m396r449L3222J999p0204J5535L2593l5482o3884M135N3384
$$ 21205 -3677 -8073 -17522 15700 17699 -52505 -36970 -4377 -39859 -103743 -99608 -46224
25480d6224N6459M507o0289l7569j624O584J3375K9922p6035R113R0332N695l7580
$$ -46224 10235 14742 -45547 -83116 -84740 -78156 -64781 -34859 -110894 -101781 -11449 -5754 -43334
25467d3334K3599J7568Q2303M8757p3643p2839l0188L3955O4739o137m0714O463
$$ -43334 -19735 -2167 80136 128893 55250 -17589 -47777 -13822 50917 44780 4066 10529
25455A0529l9723o330Q3618M136K8235j4867K150M5686o4179p0855k2595j9290
$$ 10529 -29194 -35524 48094 52230 80465 65598 67748 113434 49255 -21600 -44195 -63485
25443f3485K2538K9593N5414L4498K0521M562j2084o0225j2025L490j041J2692
$$ -63485 -40947 -11354 44060 78558 99079 103641 91557 31332 19307 22797 21756 34448
25431C4448O9229q3545k9855J9703m5835q785O313N4102M2574n1991n1499O773
$$ 34448 103677 20132 -9723 9980 -35855 -44640 -38327 15775 58349 6358 -45141 -38368
25419c8368J0417k4349N1200l176m8355J2357r685p333K3817K5026L0970p804
$$ -38368 -27951 -52300 -1100 -4276 -52631 -40274 -49959 -57292 -33475 -8449 22521 14717
25407A4717p6541j7607M0363k7125J3545K3266J3362O104l391J5161N1433J4159
$$ 14717 -61824 -79431 -39068 -66193 -52648 -29382 -16020 -9916 -13307 1854 53287 67446
25395F7446l6507n2159j060N042R997l5805j660O4777O66J973n0640l760m150
$$ 67446 30939 -21220 -22280 -17238 -7241 -43046 -44706 20071 20737 22710 -27930 -31690 -35840
25382c5840K5596L4162N24M6556J3952n1203j0078K9899m0978p8375J3389J4516
$$ -35840 -10244 23918 24442 70998 84950 33747 23669 53568 12590 -65785 -52396 -37880
25370c7880m9763k3842K5899J5253N5169K9852K1012L6044r2209k2496r019K8739
$$ -37880 -87643 -111485 -85586 -70333 -15164 14688 35700 71744 -20465 -42961 -51980 -23241
25358b3241J178J9049M1965l4551k7817J4853j5305o4597L4940L2005K3776K6244
$$ -23241 -22063 -3014 38951 4400 -23417 -8564 -23869 -88466 -53526 -21521 2255 28499
25346B8499n3635l2740J1695m2141N582N7579J9472M8089P598J732r213K1324
$$ 28499 -25136 -57876 -46181 -88322 -82740 -25161 -5689 42400 49998 51730 42517 63841
25334F3841J2021k5210l8504J2606K7773p237r687J637j0672M386K2118j2155
$$ 63841 75862 50652 12148 24754 52527 45290 35603 37240 26568 30954 53072 40917
25322D0917j0690l8688l0498L736p663L1093K9068q883j2466j9467l3808r85k8936
$$ 40917 30227 -8461 -38959 -35223 -42886 -11793 17275 8392 -4074 -23541 -57349 -58334 -87270
25309h7270J5633q531l324L2295L3861n0570o9217M2535O3849J5888M5797j7187
$$ -87270 -71637 -80168 -83492 -51197 -17336 -67906 -137123 -94588 -30739 -14851 30946 13759
25297A3759j6513k1227m1221R476M3683j7789j7022J3879j2278J0801J4133J7602
$$ 13759 -2754 -23981 -65202 -55726 -12043 -29832 -46854 -32975 -45253 -34452 -20319 -2717
25285b717L1704k8856j1709K7054K545J8817j0566j5937J1269o8661j5438L0137
$$ -2717 28987 131 -11578 15476 18021 36838 26272 10335 21604 -47057 -62495 -32358
25273c2358Q856M915M0818L0835j0953l3822l3828k5249l2771l2925L0373M3397
$$ -32358 -23502 -18587 22231 53066 42113 8291 -25537 -50786 -83557 -116482 -86109 -42712
25261d2712Q449m887l4070J7460P3670j5855l6928P390J7751R3766l8558m7546
$$ -42712 -34263 -39150 -73220 -55760 17910 2055 -34873 -27483 -9732 84034 45476 -2070
25249b070n1705J4870j485k3334L8344L0017R12n936j5263j3898k6970m5432M0101
$$ -2070 -53775 -38905 -40390 -63724 -25380 4637 5549 -387 -15650 -29548 -56518 -101950 -61849
25236f1849K1899r014o7989j8448N2880R1058N3924K7544J4090M345J2040n0483
$$ -61849 -39950 -48964 -116953 -135401 -82521 8537 62461 90005 104095 108440 120480 69997
25224F9997r1511M9144Q3625l766j4612k5302m2315L6667p348m7097l3882J4727
$$ 69997 -21514 27630 111255 107489 92877 67575 25260 61927 54579 7482 -26400 -11673
25212a1673K4055R631j1208l9324o0980K0036k1437m2209k351K2005P5614k2075
$$ -11673 12382 22013 10805 -28519 -89499 -69463 -90900 -133109 -135460 -113455 -37841 -59916
25200e9916N907J1635m9799L224q246R5680L4620l3319l0876l5800K3092K6058
$$ -59916 -54009 -42374 -92173 -88949 -97195 -1515 33105 -214 -31090 -66890 -43798 -17740
25188a7740N1984m588j4252m4990o860J1919m082k8305j0947m0893P7698Q5087
$$ -17740 34244 29656 15404 -29586 -36446 -24527 -28609 -56914 -67861 -108754 -31056 54031
25176E4031R118o9184k9976L2787K682k0346J5947j0033k9079j117J123L5977
$$ 54031 63149 -6035 -36011 -3224 -542 -20888 -4941 -14974 -44053 -45170 -44047 -8070
25164h070k2401J6888K3707J629O5165K7318k8783j5751l0254N174K4307L2007
$$ -8070 -30471 -13583 10124 11753 76918 104236 75453 59702 29448 34622 58929 90936
25152I0936O842l0810m8024l5366l600k6407J1066l2232K8961L5547j7159L7034
$$ 90936 97778 66968 18944 -16422 -20022 -46429 -35363 -67595 -38634 -3087 -20246 16788
25140A6788J7739J3158j394j2057L4018L028j2806l4101Q979k9079l387k7038
$$ 16788 34527 47685 46291 34234 68252 71280 58474 24373 33352 4273 886 -26152
25128b6152o8616K7658J2591L8189M3831L6943N1241k6473j7857r769o5978o6691
$$ -26152 -94768 -67110 -54519 -16330 27501 64444 115685 89212 71355 61586 -4392 -71083
25116g1083K6990K1039J6525K3592R759n3516J2413J4119J2761Q143L7578N0315
$$ -71083 -44093 -23054 -6529 17063 26822 -26694 -14281 -162 12599 20742 58320 108635
25104A08635k0158j8595l9043j4591r8274k2794M7414j923k5768N8650K259J5776
$$ 108635 88477 69882 30839 16248 -82026 -104820 -57406 -59329 -85097 -26447 -24188 -8412
25092h412J856j4679P0158Q395J0446J118P849n0410N851k937o5849k0579L9074
$$ -8412 -6556 -21235 48923 57318 67764 68882 76731 26321 32172 29235 -36614 -57193 -18119
25079a8119l6909j1877K3527R178K4452K0822K6613K4648j1421r193M6381n116
$$ -18119 -55028 -66905 -43378 -34200 -9748 11074 37687 62335 50914 41721 88102 82986
25067H2986n4675l6281n944L0969q2385o1555J03454K7680l2496J9630L3151k1200
$$ 82986 28311 -7970 -13914 17055 -65330 -126885 -23431 4249 -28247 -8617 24534 3334
25055C334q992M035N2498J1397p0559L717N1806m4864O2890m162l7891r921J7503
$$ 3334 -5658 -1623 50875 62272 -8287 -4570 47236 2372 65262 61100 23209 13288 30791
25042C0791J3726J1012L4493l1762L561m0500l0795m9613L3785l7281j3504O0814
$$ 30791 44517 55529 90022 58260 61821 21321 -9474 -59087 -25302 -62583 -76087 -15273
25030a5273J2150M429M9031L1833l6999j03783n545P0764Q4144l5489j8573m9922
$$ -15273 -3123 1306 50337 82170 45171 -58612 -64157 6607 90751 55262 36689 -13233
25018a3233n9399J3624J7496M2526M5282j5699n4464j3002K7090J152L5023O0798
$$ -13233 -72632 -59008 -41512 1014 46296 30597 -23867 -36869 -9779 -8627 26396 87194
25006H7194j4074k6707n1658n1422k1431J8040j0353J5703J0024l291l9723p354
$$ 87194 73120 46413 -5245 -56667 -78098 -60058 -70411 -54708 -44684 -47975 -87698 -95052
24994i5052k7745O727N8308M8219M5392P66L3592J8865L0396l1144p5607l9324
$$ -95052 -122797 -116070 -57762 -9543 35849 36615 70207 89072 119468 88324 12717 -26607
24982b6607m6564O943j1161N7609K1665J0854Q7207j4874r7047O131O7145k0164
$$ -26607 -73171 -66228 -77389 -19780 1885 12739 99946 85072 -11975 -5844 61301 41137
24970D1137q5252l5027J7233L1785L0650M6920p254O0444l6927l6983n2559j3574
$$ 41137 -44115 -79142 -61909 -30124 526 47446 40192 100636 63709 26726 -25833 -39407
24958c9407k2480j2563j7525K6516m595m5936o1802J0044P9976j0169l3622j098
$$ -39407 -61887 -74450 -91975 -65459 -70054 -115990 -177792 -167748 -87772 -97941 -131563 -132661
24946a32661K8043L0196L1659J7269K1561J7225o745L9744l0180k8022N3486M740
$$ -132661 -104618 -74422 -42763 -25494 -3933 13292 6547 46291 16111 -11911 41575 46315
24934D6315l158J011k7791j5242l9194J6869J5047K8763k232l4081l5985M1289
$$ 46315 43157 44168 16377 1135 -38059 -21190 -6143 22620 20388 -13693 -49678 -8389
24922h389l2727K0269O668L0163L1438l8390o9582n9725L4442P3614j6153j3398
$$ -8389 -41116 -20847 -14179 15984 47422 9032 -60550 -120275 -85833 -12219 -28372 -41770
24910d1770J1595J8620K6131O8531K1646l2414p4471p8717n598L9633K2220N763
$$ -41770 -30175 -11555 14576 83107 104753 72339 -2132 -80849 -86447 -46814 -24594 -18831
24898a8831o688L3106N798m3638m0036J5861L9060N4405M4545n1688o0553n2421
$$ -18831 -25519 7587 13385 -30253 -70289 -54428 -15368 39037 83582 31894 -28659 -81080
24886h1080K025N997J30L7209j8429l515P301m4539k1922N7999M5622L7220N6886
$$ -81080 -79055 -73058 -72928 -35719 -54148 -57663 -50362 -94901 -116823 -58824 -13202 24018 80904
24873H0904K9380o8848j6499O907k2759l0845j1231m7028k8910L794K6311L4206
$$ 80904 110284 41436 24937 31844 9085 -21760 -32991 -80019 -108929 -105135 -78824 -44618
24861d4618k8656l8990r774j9763M6681k7102L0128N7058J2876Q138K859m4304
$$ -44618 -73274 -112264 -122038 -141801 -95120 -122222 -92094 -35036 -22160 -14022 -11163 -55467
24849e5467J1692K1457L4571j2068N197k6270K9054j791l3172n691L2356K0565
$$ -55467 -43775 -22318 12253 185 5382 -20888 8166 6375 -26797 -32488 -132 20433
24837B0433l6339j9630M707J1079J1558k1768J4821j5028j3727r764l8460p9373
$$ 20433 -15906 -35536 -30829 -19750 -8192 -29960 -15139 -30167 -43894 -53658 -92118 -171491
24825a71491L5324O9991M6101L5114N349J4046K5690m6639k3766l6108J6708j9671
$$ -171491 -136167 -66176 -20075 15039 20388 34434 60124 13485 -10281 -46389 -29681 -49352
24813d9352j532Q2692M4129p4507j7859j5591j1494j9181j8683M1190m105l797
$$ -49352 -50884 31808 75937 1430 -16429 -32020 -43514 -62695 -81378 -40188 -44293 -48090
24801d8090N2651L3127o0935j7419R528k3773j3792k4786L4943K2794l298J01496
$$ -48090 4561 37688 -23247 -40666 -31138 -54911 -68703 -93489 -58546 -35752 -39050 62446
24789F2446L5163M198J7954m2109q0609j8804J9957k5141J2266P9942k435n1764
$$ 62446 97609 101807 119761 77652 -2957 -21761 -1804 -26945 -14679 65263 62828 11064
24777A1064K142q539j4678j1320k4847k8074L1421O4792j1885N143O878K107r458
$$ 11064 13206 4667 -10011 -21331 -46178 -74252 -42831 21961 10076 15219 22097 24204 14746
24764A4746p893q490p800O858J3867k5078K5919L24j7543l2847n942J3340J4331
$$ 14746 6853 -1637 -9437 -2579 11288 -13790 12129 12453 -5090 -37937 -43879 -30539 -16208
24751a6208j5557M175J3144L1504l8127K1919Q019O55L0154l7000j8300p594K4637
$$ -16208 -31765 -27590 -14446 17058 -21069 850 8869 9524 39678 2678 -15622 -23216 1421
24738A421J0847n785K0818l4136m9325M398j9969n97j2042J5228O6888K5360K7507
$$ 1421 12268 6483 27301 -6835 -56160 -51762 -71731 -72328 -84370 -69142 -2254 23106 50613
24725E0613l1273j7106l7094j4624N5392k2944k3421r353k8880j423L2033K5112
$$ 50613 19340 2234 -34860 -49484 5908 -17036 -40457 -49810 -78690 -80113 -48080 -22968
24713b2968M671K2783K2803j2314M774J5924J7335j1719k8544l45J9410k5640
$$ -22968 -18297 4486 27289 14975 19749 35673 53008 41289 12745 12400 31810 6170
24701F170j4126K8297k2091l3514n003J0444l9458J5649P8468o807j0210o988
$$ 6170 -7956 20341 -1750 -35264 -40267 -29823 -69281 -53632 24836 18029 7819 831
24689H31K260l2094l0550m0916M1988N7269k2853P773O7127O3626k2029Q661j6772
$$ 831 3091 -29003 -59553 -100469 -58481 -1212 -24065 -16292 50835 114461 92432 101093 84321
24676H4321m1503q980M3977M727l0316o3646n5297k8657J4225l2491N0592N9582
$$ 84321 42818 33838 77815 82542 52226 -11420 -66717 -95374 -81149 -113640 -63048 -3466
24664c466O1556q0554n049J3841N3872N7223m501l7684k4569q953K0838l0371
$$ -3466 58090 -22464 -27513 -13672 40200 97423 92922 55238 30669 21716 42554 12183
24652A2183q3911J448k7938j2251n19J1422k0553L5576N0474M5194M608l6029
$$ 12183 -71728 -70280 -98218 -110469 -110988 -99566 -120119 -84543 -34069 11125 15733 -20296
24640b0296q243j0222J9011l6603k4469L6239M9301M1984J9435n0629K3685l235
$$ -20296 -28539 -38761 -19750 -56353 -80822 -44583 4718 46702 66137 15508 39193 35958
24628C5958l6236m5943m4858L7517K8039L2491k8773K3307K5555R6389k2066p6533
$$ 35958 -278 -46221 -91079 -53562 -25523 6968 -21805 1502 27057 123446 101380 24847
24616B4847m888J8736O1192k6858o575n5043k9552k8526K9436M8456q397o560
$$ 24847 19959 38695 99887 73029 66454 11411 -18141 -46667 -17231 31225 22828 16268
24604A6268Q613k9880j3315M1433M8087m2866j292q982k8260l7695m4354j6673
$$ 16268 24881 -4999 -18314 23119 71206 28340 27048 18066 -10194 -47889 -92243 -108916
24592a08916J09417M5620m4696J9385K0418l0293J5932K6020l1330q6538n570
$$ -108916 501 46121 1425 20810 41228 10935 26867 52887 21557 -64981 -70551
24581g0551M8574L99m0302L0794m824k5199K6120K785N083K570M0531K4199l4797
$$ -70551 -21977 -21578 -61880 -31086 -35910 -61109 -34989 -32204 -27121 -24551 15980 40179 5382
24568E382k1853K5862j2622K4085M7593J8605m0723l8075o6838l4242J8015K9487
$$ 5382 -16471 9391 -3231 20854 68447 87052 46329 8254 -58584 -92826 -74811 -45324
24556d5324P712K3585K7406k7261l9406j7517l894M7890O9715J9358k5691m0277
$$ -45324 -37612 -14027 13379 -13882 -53288 -70805 -74699 -26809 42906 62264 36573 -3704
24544c704k9265K2741k3958O5246j34n3856j1804M4893j6747M13N071P010J1115
$$ -3704 -32969 -10228 -34186 31060 30926 -22930 -34734 10159 -6588 -6175 -1104 5906 17021
24531A7021n9394j619o645j7166J7934L0361O97L5844J2849j7104j305M2038J1272
$$ 17021 -42373 -43992 -50637 -67803 -49869 -19508 -18811 17033 29882 12778 11473 53511 64783
24518F4783j827o99m2571l6736J3875k6330j5022j3147j8296K4484Q0975O7956
$$ 64783 62956 62257 19686 -17050 -3175 -29505 -44527 -57674 -75970 -51486 29489 97445
24506I7445J9062m3474k8605j4910J7892k8191n5883p3663M2364J01100j5370
$$ 97445 116507 73033 44428 29518 47410 19219 -36664 -110327 -67963 33137 17767
24495A7767J6345K1005q3697o2629k137P7643Q3566L9903l0434p5411J9104R462
$$ 17767 34112 55117 -28580 -91209 -93346 -15703 67863 107766 77332 1921 21025 30487
24483C0487J3186j9291l5710n9502k0892N0532J7599m486O3191j9443p566K6069
$$ 30487 43673 24382 -11328 -70830 -91722 -41190 -23591 -28077 35114 15671 8105 34174
24471C4174j3338n1411o83L6862K0677l0436p8967J9944O007L1142K6308K8321
$$ 34174 20836 -30575 -31258 5604 26281 -4155 -83122 -63178 -57171 -26029 279 28600
24459B8600J7639o6610j8550j0204J7642r491m4008j1971K9342Q692n796N4623
$$ 28600 46239 -20371 -38921 -49125 -31483 -40974 -84982 -96953 -67611 -58919 -64715 -10092
24447a0092L1970m1486l0284J3299J1091n5050J2797P7480K4164j703j6594J8614
$$ -10092 21878 -19608 -49892 -36593 -25502 -80552 -67755 9725 33889 32186 15592 34206
24435C4206m738j8381J792p1017j1076k0388l529K646m283J1781J4839l299l758
$$ 34206 29468 11087 12879 -58138 -69214 -89602 -93131 -90485 -94768 -82987 -68148 -71447 -75205
24422g5205j1742m1919L9206M0615J2625l6373J1057R3946M9600K8810j8487l7303
$$ -75205 -86947 -128866 -89660 -49045 -36420 -72793 -61736 32210 81810 110620 92133 54830
24410E4830J3830p5007l2357K4509l3165J4492l7468l7600K6901K4937P1762J9483
$$ 54830 68660 -6347 -38704 -14195 -47360 -32868 -70336 -107936 -81035 -56098 15664 35147
24398C5147j61j3265k3092R221j4906K765k4533j3239L6232J667k4413J1921L0637
$$ 35147 34986 21721 -1371 7850 -7056 -4291 -28824 -42063 -5831 -4164 -28577 -16656 13981
24385A3981L997L1426r424m38q640r9072j3620J4608J1466M9335j6727m1478N953
$$ 13981 17978 49404 39980 39542 30902 -68170 -81790 -67182 -55716 -6381 -23108 -64586 -58633
24372e8633k1635J6376j2054J681k4369J4540R2293M3962k8308l470m7555p1454
$$ -58633 -80268 -63892 -75946 -74265 -98634 -84094 8199 52161 23853 20383 -27172 -98626
24360i8626L9354L8872k6669K4910K2214m84k2846l1712l3643L8761M3170k298
$$ -98626 -59272 -20400 -47069 -22159 55 -429 -23275 -54987 -88630 -49869 -6699 -8997
24348h997l5996j5414j1358L0060L5661J8335K7475K9017o0138k4327L0647k3133
$$ -8997 -44993 -60407 -71765 -41705 -6044 12291 39766 68783 8645 -15682 14965 -8168
24336h168k5993l3209o249M8925K5991Q024l5286n0251J486K9953J2069m3296
$$ -8168 -34161 -67370 -73619 -24694 1297 9321 -25965 -76216 -74730 -44777 -32708 -76004
24324g6004l9113N1349R1188j652r341P877n411L8925j3022J842j0875k8214O995
$$ -76004 -115117 -63768 27420 25768 16427 24304 18893 57818 44796 46638 35763 7549 14544
24311A4544K1855M3791q300n2063j0100N7k3616k5214O326j4279J7911M8942L673
$$ 14544 36399 80190 71890 19827 9727 9784 -13832 -39046 -32720 -46999 -29088 19854 23527
24298B3527j9866n332n0785l8262L0688J3388p938K4340J4133n0158n307L1837
$$ 23527 3661 -1671 -52456 -90718 -60030 -46642 -54580 -30240 -16107 -66265 -71572 -39735
24286c9735M2222J4692m021P832l0505n8913N730l8766O3211O8959N0025m8875
$$ -39735 2487 17179 13158 20990 -9515 -68428 -62698 -101464 -38253 30706 80731 31856
24274C1856k6033J3296j02964j2451J10379O7103j9629m3947n5406m6933K1583
$$ 31856 5823 19119 -83845 -96296 14083 81186 61557 17610 -37796 -84729 -63146
24263f3146M420k7449J6624P222O5995P1034L67l5126J2521K653m6665m0149m1326
$$ -63146 -58726 -86175 -69551 -62329 3666 74700 75067 39941 52462 55115 8450 -31699 -73025
24250g3025J5397K5100J1807L1560L0741l541q965n9323l2373M8276M5777j0673
$$ -73025 -57628 -32528 -20721 10839 41580 38039 29074 -30249 -62622 -14346 31431 20758
24238B0758J4m733k8818j580m6942j4638J8831K4737m2776M2444Q4473L6574o8559
$$ 20758 20772 16039 -12779 -14359 -61301 -75939 -57108 -32371 -75147 -32703 51770 88344 19785
24225A9785m3480L4182k221k04M3495o069l9479l6761M0758q301K6803j0116K6536
$$ 19785 -23695 10487 8266 8062 51557 45488 6009 -30752 10006 1705 28508 18392 44928
24212D4928j0733j6474J8860Q4236n2262n8795k3676l0901m6782O9679J3438J2882
$$ 44928 34195 17721 36581 120817 68555 9760 -13916 -44817 -91599 -21920 -8482 4400
24200D400k4302n6841p358J3330L1227O9900j9357m950L90L5689j5346l0977m2768
$$ 4400 -19902 -76743 -84101 -70771 -39544 30356 10999 6049 6439 42128 26782 -4195 -46963
24187d6963j0502Q464L6336K4238k9256J4003K7035P2j0450L2308m311k1799Q628
$$ -46963 -57465 -49001 -12665 11573 -17683 -3680 23355 23427 12977 45285 40974 19175 27803
24174B7803M0037J1754o9301p8012L8475j5087K3810K5241n7978j7629R83M8242
$$ 27803 67840 79594 10293 -67719 -29244 -44331 -20521 4720 -53258 -70887 -69904 -21662
24162b1662N732r593j3277L8229j6214j6055J3857j4259k2185O910N85k5228r633
$$ -21662 -15930 -25523 -38800 -571 -16785 -32840 -18983 -33242 -55427 -48517 -47932 -73160 -82793
24149h2793M1201l73Q854J1509K5538o1079j1579J6786m565k4736n6969O066N4456
$$ -82793 -41592 -41965 -33111 -21602 3936 -57143 -68722 -51936 -56501 -81237 -138206 -132140 -77684
24136g7684N5102p574r135P4791J329n1211j7879K013l5912l2280O4646L3186
$$ -77684 -22582 -30156 -39291 35500 36829 -14382 -32261 -30248 -66160 -98440 -33794 -608
24124f08J3388q139p9310j251M0675j234K4170M1316j0199N4982j7633k3967j1789
$$ -608 12780 4641 -74669 -75920 -35245 -36479 -12309 29007 18808 73790 56157 32190 20401
24111B0401l2023K275N5628L2137j793l268j9644q5465j20070M2561J262K8967
$$ 20401 -11622 -9347 46281 78418 76625 73357 53713 -31752 -151822 -109261 -107999 -79032
24099g9032O1350J0816l9941j6336K9963M4013J2473J6321K6709L3237q7731n4662
$$ -79032 -17682 -6866 -46807 -63143 -33180 10833 23306 39627 66336 99573 11842 -42820
24087d2820l2175q33l0578j9335N8909K7165J1286K293K7613k2299j2482k1431
$$ -42820 -74995 -75828 -106406 -125741 -66832 -39667 -28381 -26088 1525 -20774 -33256 -54687
24075e4687n8373J7204L1496P049m4975K2655J2875L5996R2762L6390N318n9849
$$ -54687 -113060 -95856 -64360 -57311 -102286 -79631 -66756 -30760 62002 98392 103710 43861
24063D3861j0792m786m4818o751k6463l3105L7330K4177L6850j469P324k2938
$$ 43861 33069 28283 -16535 -23286 -49749 -82854 -45524 -21347 15503 14034 21358 -1580
24051a580J3195j4964m3806p903j3618j6167K3173M6108J4097K558K0462L493
$$ -1580 11615 -3349 -47155 -55058 -68676 -84843 -61670 -15562 -1465 1093 21555 25048
24039B5048n608k1492k7705l5828K1789q6K0653Q202n9634p6786M5967L5167N5655
$$ 25048 19440 -2052 -29757 -65585 -43796 -43882 -23229 -15027 -74661 -151447 -105480 -70313 -14658
24026a4658M368J0001L5701L505l8191j3708O082O6179L0147j6191j77k4013Q8603
$$ -14658 -10290 -289 35412 38917 726 -12982 -6900 59279 89426 73235 73058 49045 137648
24013A37648K7327P879K8960k693n3649n7984J381j6485l3387j3789K4031o647
$$ 137648 164975 172854 201814 199121 145472 87488 88869 72384 38997 25208 49239 42592
24001D2592j2343n2305k672L2360L3798k9605k4376j4951l3696K2849J4718O5096
$$ 42592 30249 -22056 -24728 7632 41430 11825 -12551 -27502 -61198 -38349 -23631 41465
23989D1465j4998o5110l3973M288Q1903K4277m2521l6647k3133j286N8208L7213
$$ 41465 26467 -38643 -72616 -68328 13575 37852 -4669 -41316 -64449 -65735 -7527 29686
23977B9686K2193m2648j7175K2136m1544K8983J5599j0800J4016J7569m76q0893
$$ 29686 51879 9231 -7944 14192 -27352 1631 17230 6430 20446 38015 37539 -43354
23965d3354l8592M598M1149J7740j3334L34J4941k0229J8864K4049m1132m2947
$$ -43354 -81946 -77348 -36199 -18459 -31793 -31459 -16518 -36747 -17883 6166 -34966 -77913
23953g7913k3251r735K1183K7204k5237K3053k2678O0460P0137j6745n2729k3619
$$ -77913 -101164 -110899 -89716 -62512 -87749 -64696 -87374 -26914 43223 26478 -26251 -49870
23941d9870l4410K2593J4717L3778K666n4109R311l0526j8192L2892q308J9660
$$ -49870 -84280 -61687 -46970 -13192 -10526 -64635 -55324 -85850 -104042 -71150 -79458 -59798
23929e9798o493k9385N5623K8961J0956K3409n868m8835j7162J3432L626L1406
$$ -59798 -66291 -95676 -40053 -11092 -136 23273 17405 -31430 -48592 -35160 -31534 -128
23917a28n404k7381j206N4439N9947J2397k5071o0259n4733N405j0184K2546P6812
$$ -128 -5532 -32913 -34119 20320 80267 92664 67593 7334 -47399 -41994 -52178 -29632 47180
23904D7180N7591k9786k9709q579j351l8705n0558o5906J6132M6069l2417k1101
$$ 47180 104771 74985 45276 36697 35346 -3359 -53917 -119823 -103691 -57622 -90039 -111140
23892a11140O8134O5018J2478k0742k7410J987N8497J6973K9681m4983m1631n0
$$ -111140 -43006 22012 34490 13748 -13662 -11675 46822 63795 93476 48493 6862 6812
23880F812j4183l7741j1636L1516K6174m127m4981q230M4193J0403j1846L0346
$$ 6812 -7371 -45112 -56748 -25232 942 -3185 -48166 -56396 -12203 -1800 -13646 16700
23868A6700m7030m545M5658L3964n80n6067j910l9996j7823n7910k2333O9956
$$ 16700 -30330 -34875 10783 44747 44167 -11900 -13810 -53806 -71629 -129539 -151872 -81916
23856h1916N0273L7201K4391J1206k2719n7528j318O9337L904L666j5685O2919
$$ -81916 -31643 5558 29949 41155 18436 -39092 -40410 28927 32831 36497 20812 83731
23844H3731j1427l6771N130J3435l4913k4759P519k4461J3500O223L823L251N706
$$ 83731 72304 35533 40663 54098 19185 -5574 1945 -22516 -9016 -2793 1030 4281 9987
23831I987j430M4391N5671m0053j7378k835l5857j3614k2328k9940J260k6912
$$ 9987 8557 52948 108619 68566 51188 48353 12496 -1118 -23446 -53386 -52126 -79038
23819g9038Q692J4207J8309L5384K9102K8613n75l4386m5254k3980O5381P8375
$$ -79038 -70346 -56139 -37830 -2446 26656 55269 54694 20308 -24946 -48926 16455 94830
23807I4830J513k6523L3050J2053n6474r4969j1407R3029j5428j8287L020k3769
$$ 94830 96343 69820 102870 114923 58449 -36520 -47927 45102 29674 11387 14407 -9362
23795i362m3780o6646O84N6014M3855J693j7607K7935j825L3125L9112k0449k0494
$$ -9362 -53142 -119788 -119104 -63090 -19235 -17542 -35149 -7214 -9039 24086 63198 42749 22255
23782B2255L5649n088n7062J2388N2197J8153o4397L4400O4344J868j2512Q643
$$ 22255 57904 52816 -4246 8142 60339 78492 14095 48495 112839 114707 102195 110838
23770A10838L3321J9068l0352k1912l8356J6776K3061l5426k0993N848Q35L9441
$$ 110838 144159 163227 132875 110963 72607 89383 112444 77018 56025 61873 62708 102149
23758A02149j4269r0522j08184o89K2053P0770M5425k5146k398k8668k337L7410
$$ 102149 87880 -2642 -110826 -111515 -89462 -18692 26733 1587 -811 -29479 -31816 5594
23746E594M665l0723r602l5600k466L3708l118J053j0312n317M1335j8729J9294
$$ 5594 10259 -20464 -30066 -65666 -68132 -34424 -37542 -36489 -46801 -52118 -10783 -29512 -10218
23733a0218L441M2278j7801m0147n676L7850j2318j2617j880k0861k5632Q325
$$ -10218 -6777 35501 17700 -22447 -28123 9727 -2591 -15208 -17088 -37949 -63581 -55256
23721e5256Q111j0762K9577L2318k2474o5265m031L4416l2430J983j9771K3794
$$ -55256 -47145 -57907 -28330 3988 -18486 -83751 -87782 -53366 -85796 -83813 -103584 -79790
23709g9790N8199Q764J0099n5147j5585K4694O9636L1952M4068j2886l8023q9005
$$ -79790 -21591 -12827 -2728 -57875 -73460 -48766 20870 52822 96890 84004 45981 -43024
23697d3024o1728J08K0354O8403J4328k7927M372O839K6899N0885L3097l5322
$$ -43024 -104752 -104644 -84290 -15887 -1559 -29486 -25114 -18275 8624 59509 92606 57284
23685E7284r6008m3853N3366M9353m7136O3253j6032n5355L3807O190j4477K2477
$$ 57284 -38724 -82577 -29211 20142 -26994 36259 20227 -35128 -1321 4869 -9608 12869
23673A2869N3456j7998l2112k9934l877k2719q901k4879j3056K6268r327L0589
$$ 12869 66325 48327 16215 -13719 -17596 -40315 -49216 -74095 -87151 -60883 -70210 -39621
23661c9621O4632r606M821m815j3255j0563j0764K6841j5914J8185q530m2595
$$ -39621 25011 15405 20226 15411 2156 -8407 -19171 7670 -8244 9941 1411 -41184
23649d1184l2276l328l0617n13R0767R8792K9769J9910k8752J8942k3692m9128
$$ -41184 -73460 -76788 -107405 -107918 -17151 81641 111410 131320 102568 121510 97818 48690
23637D8690l4043l6419r159N576N0117l727l410J8401L0375l3347k7504J3919
$$ 48690 14647 -21772 -30931 -25355 24762 21035 17625 36026 66401 33054 5550 19469
23625A9469k8137K7660O185K6303R878j0094p5787J0096j295K8776J01282Q277
$$ 19469 -8668 18992 25177 51480 61358 51264 -24523 -14427 -15722 13054 114336 122613
23613A22613p2754K7597r396l4630l999l9795L4050K3073k9217n1804j2511L5918
$$ 122613 49859 77456 68060 33430 29431 -10364 23686 46759 17542 -34262 -46773 -10855
23601a0855K5524j1903j7390j3474P539j3517k0556k0731l5094j0165J8390J056
$$ -10855 14669 2766 -14624 -28098 -20559 -34076 -54632 -75363 -110457 -120622 -102232 -101176
23589a01176M8607N2474J1570m3168J6728O469j6247L4150J3298Q778k7974j075
$$ -101176 -52569 -95 11475 -31693 -14965 -8496 -24743 9407 22705 31483 3509 2434
23577B434k1506l0543k0731R470k221N0687M1420J1386J2623k948n9187k8794
$$ 2434 -19072 -49615 -70346 -60876 -63097 -12410 29010 40396 53019 50071 -9116 -37910
23565c7910K5017L6898j8179m5346k2611K0200J3879k7785K4349l4972o594L4387
$$ -37910 -12893 24005 5826 -39520 -62131 -41931 -28052 -55837 -31488 -66460 -73054 -38667
23553c8667k8416K2887N9713K7220m9214K6283O42l904P392j3453O618k0575k1798
$$ -38667 -67083 -44196 15517 42737 -6477 19806 20448 16544 23936 10483 17101 -3474 -25272
23540b5272J7751n1838J1494N8837P2595J0930M0329J4086M7430m0710j02162
$$ -25272 -7521 -59359 -47865 10972 83567 94497 134826 148912 196342 155632 53470
23529E3470q6953p681j4986L8683M059l3552j3425J0881j7452N9702Q7037p236
$$ 53470 -33483 -41164 -56150 -17467 -13408 -46960 -60385 -49504 -66956 -7254 79783 72547
23517G2547J8867J142m2587J8131j4711m8871k9128p423j1904K0220L6969o423
$$ 72547 91414 92556 49969 68100 53389 4518 -24610 -32033 -43937 -23717 13252 6829
23505F829Q077j4503N781j4327M0759k2527j5173J8426n3982J9043L1755J2442
$$ 6829 14906 403 6184 -8143 32616 10089 -5084 13342 -40640 -21597 10158 22600
23493B2600k7091M5747k678o6394N1921l7051n3468k210M9927L4241L2400L5360
$$ 22600 -4491 41256 38578 -27816 24105 -12946 -66414 -68624 -18697 15544 47944 83304
23481H3304p0285N883k9774M9752M167L426P059j746n3474m5193L416n892J1628
$$ 83304 13019 18902 -10872 38880 43047 46473 53532 51786 -1688 -46881 -43465 -49357 -37729
23468c7729J8365l9908J5355O0002P3700J9302j5750j9389N840n7750k9406k4116
$$ -37729 -19364 -59272 -43917 16085 89785 109087 93337 73948 79788 22038 -7368 -31484
23456c1484M0101p812l8649j0658K8487M7722j6064J0465l4815J1995J5487n09
$$ -31484 8617 805 -37844 -48502 -20015 27707 11643 22108 -12707 -712 14775 14266
23444A4266n2616n6620P3828L1688k2126M849j3174k4679J2816J4913j8364M1894
$$ 14266 -38350 -94970 -21142 10546 -11580 -6731 -19905 -44584 -31768 -16855 -35219 6675
23432F675O0486k191p1099J2071L7263L69n3836R04N6466j1278n0692O882O4306
$$ 6675 67161 64970 -6129 5942 43205 43574 -10262 -9358 47108 35830 -14862 -7980 56326
23419E6326K7177o880m3046j5197k0314k7065J3275n231J1034K8089L6022L381
$$ 56326 83503 76623 33577 18380 -1934 -28999 -15724 -20955 -9921 18168 54190 57571
23407E7571o809K465j2018j1493J0547M075j0522q93r772M5665l8946q2678R019
$$ 57571 50762 53227 41209 29716 40263 44338 33816 32923 23151 68816 29870 -52808 -43789
23394d3789L2965M9801j3739l1984k5146l1746K1055K5876j7558j1341M6112P6679
$$ -43789 -10824 38977 25238 -6746 -31892 -63638 -42583 -16707 -34265 -45606 506 77185
23382G7185K1583j0606m5055j4832k3200k381r89m437k3111j3207j970k0266J2247
$$ 77185 98768 88162 43107 28275 5075 2694 1705 -2732 -25843 -39050 -41020 -61286 -49039
23369d9039K637N3459L6881j8531j2578k0545N298m5637o9036J471J4137L5086
$$ -49039 -46402 7057 43938 25407 12829 -7716 -2418 -48055 -117091 -115620 -101483 -66397
23357f6397L3918m24M0825J1181Q011J6772l9705l7304l7025m839K0926J9410
$$ -66397 -32479 -32903 7922 19103 27114 43886 4181 -33123 -70148 -74987 -54061 -34651
23345c4651Q0233O015l0329j5986k5297M318k0515K1130j9961o998J2432j6311
$$ -34651 45582 51597 21268 5282 -20015 -15697 -36212 -15082 -35043 -42041 -29609 -45920
23333d5920m1348j0126R9682K7453P679n815J1559l6975N94N2208k6435p0447
$$ -45920 -87268 -97394 2288 29741 37420 31605 43164 6189 6783 58991 32556 -37891
23321c7891O8778P3633m1656o7423j6448m5601L1421O3330L5914m3024o66O5422
$$ -37891 30887 104520 62864 -4559 -21007 -66608 -35187 28143 64057 21033 20367 85789
23309H5789r9K846j04593j5224L3341K6021O6146q954l8837N145J7380k8167J1321
$$ 85789 85690 88536 -16057 -31281 2060 28081 94227 85273 46436 51581 68961 40794 52115
23296E2115J2481k3185L5125o7259l8930J6269j987P4679O1930l2375k0149m2926
$$ 52115 64596 41411 76536 9277 -29653 -13384 -15371 59308 121238 88863 68714 25788
23284B5788m3689l4499M8392K8701k7238m6748O8877M9099J1901m9142J2033j4153
$$ 25788 -17901 -52400 -4008 24693 -2545 -49293 19584 68683 80584 31442 43475 29322
23272B9322j0097l1178m0802K882k1796O5231K4305k3510j108N155N0077J4705
$$ 29322 19225 -11953 -52755 -49873 -71669 -6438 17867 -5643 -6751 -1596 48481 63186
23260F3186o6303j2218J594l1859j5199k7426J246J1373M502j2906K4572L9366
$$ 63186 -3117 -15335 -13741 -45600 -60799 -88225 -86979 -75606 -71104 -84010 -59438 -20072
23248b0072K8056K5755L6515n526o2568K6404J3683k3943o4811n4554O5363K4513
$$ -20072 7984 33739 70254 64728 2160 28564 42247 18304 -46507 -101061 -35698 -11185
23236a1185n5701l4814J6859k537l1211k367L3727j2821J9043k6903J4199R0345
$$ -11185 -66886 -101700 -84841 -87378 -118589 -120956 -87229 -100050 -81007 -107910 -93711 -3366
23224c366L4315r551m518r573l9931k4984k1006l4002k2334M604M1418J7519o5456
$$ -3366 30949 21398 16880 7307 -32624 -57608 -78614 -112616 -134950 -130346 -88928 -71409 -136865
23211a36865N997J8060J5304K0764L0365o164n225R258N390M7091L8027p706r4089
$$ -136865 -130868 -112808 -97504 -76740 -46375 -52539 -57764 -48506 -43116 3975 42002 34296 -59793
23198e9793K9554R5446M847l7705m254k3592m5627K4920K7028M6083R986O372
$$ -59793 -30239 65207 70054 32349 28095 4503 -41124 -16204 10824 56907 66893 73265
23186G3265l5908p5479k7120L769R961k464m943n889j676n9328O1411P968M2081
$$ 73265 37357 -38122 -65242 -61473 -51512 -53976 -58919 -64808 -66484 -125812 -64401 -56433 -14352
23173a4352M6629K960n3269L1189K5799j8079j4842K1099j9686m389N122M3911
$$ -14352 32277 35237 -18032 13157 38956 20877 6035 27134 7448 3059 8181 52092
23161E2092L20q944j2602j87j9990K4430K2958j7463l3138Q884k632o330o0907
$$ 52092 52412 43468 30866 30679 10689 35119 58077 40614 7476 16360 13728 7398 -53509
23148e3509j0514N560O5404m3522n6486N092L2326J4028N6615M0604J6113M1976
$$ -53509 -64023 -58463 6941 -36581 -93067 -87975 -55649 -41621 14994 55598 71711 113687
23136A13687J6016m3438q9388k959M9846O3771J3456J1786j8316l0129j1941O7632
$$ 113687 129703 86265 -3123 -6082 43764 107535 120991 132777 114461 84332 72391 140023
23124A40023Q5140M6301J11354J65250J81777J81547K73654K36597J05384Q0401
$$ 140023 225163 271464 382818 548068 729845 911392 1185046 1421643 1527027 1607428
23114A607428p7714j88695k09293k65397j90263j35107j22761j38233r3130l0210
$$ 1607428 1529714 1341019 1131726 866329 676066 540959 418198 279965 186835 156625
23104A56625l0295p8017n2343N5286O0084n1799L8103K8276o1815m3655L6825
$$ 156625 126330 48313 -4030 51256 111340 59541 97644 125920 64105 20450 57275
23093E7275l2839J7648l501j8737J3818P4703K8742k1664q3349m165k7041k7513
$$ 57275 24436 42084 38583 19846 33664 108367 137109 115445 32096 27931 890 -26623
23081b6623J9951L6774m7805j5557N9603L5624K4424n606m303j9931j5098m1225
$$ -26623 -6672 30102 -17703 -33260 26343 61967 86391 80785 76482 56551 41453 228
23069B28o4204J1039L7727q581k3024L7313L6728K0761q5178R853M5014O1430
$$ 228 -63976 -52937 -15210 -23791 -46815 -9502 27226 47987 -37191 -27338 17676 79106
23057G9106Q548o7759p2354L1347N1692J0285n398J3376K4400m9761M3855N5726
$$ 79106 87654 19895 -52459 -21112 30580 40865 35467 48843 73243 23482 67337 123063
23045A23063m2583o9933O3533K0883k1719k5442m4547k7479O6413r888q3042J9148
$$ 123063 80480 10547 74080 94963 73244 47802 3255 -24224 42189 32301 -50741 -31593
23033c1593N5101J9836L410o0497m1359J06j1594K5694l04j4201K138l4176j001
$$ -31593 23508 43344 46754 -13743 -55102 -54996 -66590 -40896 -41200 -55401 -53263 -87439 -88440
23020h8440M5070Q1098K4109l611P327m3367L2742P7678l8662m8301J6396j207
$$ -88440 -43370 37728 61837 58226 65553 22186 54928 132606 93944 45643 62039 60832
23008F0832j1800k0546j4411N4879l3049j9039R683o606P254q979r31o8472j7228
$$ 60832 49032 28486 14075 68954 35905 16866 26549 19943 27197 18218 17287 -51185 -68413
22995f8413K1542L2869K8334l3779l412N7654M7758K7272N1108Q9633k2473j13716
$$ -68413 -46871 -14002 14332 -19447 -22859 34795 82553 109825 160933 250566 228093 114377
22983A14377j106Q458o4709j00393l776J9073P4816L9889n0175p7836j3330k5712
$$ 114377 113271 121729 57020 -43373 -47149 -28076 46740 86629 36454 -41382 -54712 -80424
22971h0424J0122l7660Q333N7950R159k9085K4615L2906J6557k2282j0757K796
$$ -80424 -70302 -107962 -99629 -41679 -32520 -61605 -36990 -4084 12473 -9809 -20566 -17770
22959a7770l0143L5416Q1987o22m2887l0243l699L9913k7180n3792m5623o710
$$ -17770 -47913 -12497 69490 68868 25981 -4262 -7961 31952 4772 -49020 -94643 -101353
22947a01353j4267N5995J4275L0101N2528J764n5349n7552J3115M6380k3975n4046
$$ -101353 -115620 -59625 -45350 -15249 37279 39043 -16306 -73858 -60743 -14363 -38338 -92384
22935i2384N4327N5243J9856l5964m5084M760L5754q74K2929J4882k2533j6787
$$ -92384 -38057 17186 37042 1078 -44006 -39246 -3492 -4366 18563 33445 10912 -5875
22923e875K9474O6966k1317j8940k628M6178m6589n0101J6987n135R89l0357J8406
$$ -5875 23599 90565 69248 50308 47680 93858 47269 -2832 14155 9020 10009 -20348 -1942
22910a942O670n331q173q150J4965k7307K4856Q606L5349J5005O023L4916J4274
$$ -1942 4728 -603 -8776 -16926 -1961 -29268 -4412 4194 39543 54548 60571 95487 109761
22897A09761o0999P707O8749p220L2466m5734n4911Q375M6737K5503k1676j7128
$$ 109761 48762 56469 125218 117998 150464 104730 49819 58194 104931 130434 108758 91630
22885I1630k1838N5669k0109o6983k9406R528j3147N7642o916n5859o8606N1285
$$ 91630 69792 125461 105352 38369 8963 18491 5344 62986 56070 211 -68395 -17110
22873a7110P7558j9843k8863J2279j1160j3672L9410M7391j3341j6625J9766K8883
$$ -17110 60448 40605 11742 24021 12861 -811 38599 85990 72649 56024 75790 104673
22861A04673k1023j6179K7097m5114l2921K1169p494J06j8114m2746J0433L0847
$$ 104673 83650 67471 94568 49454 16533 37702 30208 30314 12200 -30546 -20113 10734
22849A0734M846K5307L9962K6989l5754m2207k6369J4739q38o4242j8313M3619
$$ 10734 15580 40887 80849 107838 72084 29877 3508 18247 17409 -46833 -65146 -21527
22837b1527K2240q244m398k0912l6420K7381L6567N2903Q4435l6782j3897K6437
$$ -21527 713 -7531 -11929 -32841 -69261 -41880 -5313 47590 132025 95243 81346 107783
22825A07783J8269m3500n5575l4851P7047N3259M1676K6134p2029j4910k398J1097
$$ 107783 126052 82552 26977 -7874 69173 122432 164108 190242 118213 103303 100905 112002
22813A12002m0751j4589N303k2275q290N715n016L7083N0534n837o2725j0831
$$ 112002 71251 56662 61965 39690 31400 37115 32099 69182 119716 113879 51154 40323
22801D0323k9802J531J4552N6623r670l3917j6745j863n4435q8245m2544O2486
$$ 40323 10521 12052 26604 83227 73557 39640 22895 21032 -33403 -121648 -164192 -101706
22789a01706Q3482M0868K997k5520R996K96M4329J4302j1337n0071j3053L8254
$$ -101706 -18224 22644 25641 121 10117 10413 54742 69044 57707 7636 -5417 32837
22777C2837M4357j8552l5139M4708M1472J5429J9758N3637m876k5976l5414N7553
$$ 32837 77194 58642 23503 68211 109683 125112 144870 198507 193631 167655 132241 189794
22765A89794M7209k982m7679m3411K2252o5859j07151l0690o4262j1006P375o91
$$ 189794 237003 234021 186342 142931 165183 99324 -7827 -38517 -102779 -113785 -106410 -107101
22753a07101K5767R9995m6935L989L9977m1456p388P6050L0958j1571k8664l6516
$$ -107101 -81334 18661 -28274 -24285 15692 -25764 -33152 42898 73856 62285 33621 -2895
22741b895m5772K1708P8764L4579k8645k7449J654M7482M1696M0497J4755r04
$$ -2895 -48667 -26959 51805 86384 57739 30290 31944 79426 121122 161619 176374 175470
22729A75470n2629q847L8522j4623K308M4543o996n5617k951L0436r204q0915
$$ 175470 122841 113994 152516 137893 140201 184744 177748 122131 119180 149616 140412 59497
22717E9497l0690L8091M3650J0814j8181K0829J3220m2971R103L3890L8104n4796
$$ 59497 28807 66898 110548 121362 103181 124010 137230 94259 103362 137252 175356 120560
22705A20560p6536p5190m4111Q0747N3986J2874j421N1205P9213N2826K9700J2608
$$ 120560 44024 -31166 -75277 5470 59456 72330 70909 122114 201327 254153 283853 296461
22693B96461O531R460j7645r509J9481Q618O751K7041q0852j8531J9086M7972
$$ 296461 302992 312452 294807 285298 304779 313397 320148 347189 266337 247806 266892 314864
22681C14864J6552J9525o2715j4993L5847K7627J070K1091Q798m8964j9322K0486
$$ 314864 331416 350941 288226 273233 309080 336707 337777 358868 367666 318702 299380 319866
22669C19866R525j5131L221k1922j1379j5584J0908K5807j5844K4960Q349J7572
$$ 319866 329391 314260 317481 295559 284180 268596 279504 305311 289467 314427 322776 340348
22657C40348P2120P1792K6159N2126J03736J30918N5942K1648R2389K10132K64865
$$ 340348 412468 484260 510419 562545 666281 797199 853141 874789 967178 1177310 1442175
22646A442175K18507J73028J83673M9565o0679j61781j91909k19211j80155j99893
$$ 1442175 1660682 1833710 2017383 2066948 2006269 1844488 1652579 1433368 1253213 1053320
22636A053320q4087j2276J0292k7943m7194J1517Q66q401L3285M2131l52K4220
$$ 1053320 969233 956957 967249 939306 892112 903629 904495 896094 929379 971510 971158 995378
22624I95378P6658J7374k5651n6185M8228P8904P59k1863O3718Q2190L2020K0467
$$ 995378 1072036 1089410 1063759 1007574 1055802 1134706 1135465 1113602 1177320 1259510 1291530 1311997
22612A311997J44699J29841Q7896J17446P3622J02639J02934J30547J29074J03501
$$ 1311997 1456696 1586537 1674433 1791879 1865501 1968140 2071074 2201621 2330695 2434196
22602B434196J62457K08970J84669K07360K47136J73025K18983J97961K15752
$$ 2434196 2596653 2805623 2990292 3197652 3444788 3617813 3836796 4034757 4250509
22593D250509L92982M29459N37815O21036P47821R08175J092235J153930J322929
$$ 4250509 4643491 5072950 5610765 6231801 6979622 7887797 8980032 10133962 11456891
22584A1456891J591909J916543K475521L132887M025832N182568O708066R036965
$$ 11456891 13048800 14965343 17440864 20573751 24599583 29782151 36490217 45527182
22576D5527182J2343506J7368609K5200007L4211843M0100435M0967841L6511667
$$ 45527182 57870688 75239297 100439304 134651147 174751582 215719423 252231090
22569B52231090K3853209N497895j2141643k5512359l4362163l8313708l5847688
$$ 252231090 276084299 281582194 269440551 243928192 209566029 171252321 135404633
22562A35404633l0204362k4874390j9114199j3690850r740820p135625n393821
$$ 135404633 105200271 80325881 61211682 47520832 37780012 30644387 25250566
22555B5250566m132835l337896k648347k056290j587154j235243j041524p96591
$$ 25250566 21117731 17779835 15131488 13075198 11488044 10252801 9211277 8414686
22547H414686o61031n97450n81500n46270m39116m43434m54580m14343l51917
$$ 8414686 7753655 7156205 6574705 6028435 5589319 5145885 4691305 4276962 3925045
22538C925045k76066k25406k46796k50221k08456j74000j14545j28755j17945
$$ 3925045 3648979 3423573 3176777 2926556 2718100 2544100 2429555 2300800 2182855
22529B182855j25500j32851p4064j153k3337m9997r8442r8188k2816r0537J624
$$ 2182855 2057355 1924504 1850440 1849287 1825950 1775953 1677511 1579323 1556507 1465970 1467594
22518A467594l6409m8548j9440K7162n2988p9375q8195n668M0633j9204l5442
$$ 1467594 1431185 1382637 1363197 1390359 1337371 1257996 1169801 1164133 1204766 1185562 1150120
22507A150120k7605p8817l4359k4805K8603N8642O6369P5881L1814O8177J92036
$$ 1150120 1122515 1043698 1009339 984534 1013137 1071779 1138148 1214029 1245843 1314020 1506056
22496A506056J91846J99704J84083J43878J11704m6765j31821k48742k52062k84503
$$ 1506056 1697902 1897606 2081689 2225567 2337271 2290506 2158685 1909943 1657881 1373378
22486A373378j59153j10162j77380r4418m4826q1835j03298k1667j2871P783k2246
$$ 1373378 1214225 1104063 926683 832265 787439 705604 602306 580639 567768 575551 553305
22475E53305m9014N6996O7039n2550n0277l7558r3620l3985m8059l681K1084j2427
$$ 553305 504291 561287 628326 575776 525499 487941 394321 360336 312277 308596 329680 317253
22463C17253m0839L8468j0449J8519j9051n5026m904o354j2852j3539J5914N1716
$$ 317253 276414 314882 304433 322952 303901 248875 243971 237617 224765 211226 227140 278856
22451B78856L1523o3742o3740n0651R614K4579Q7904M4392K2866M7480J74513
$$ 278856 310379 246637 182897 132246 141860 166439 254343 298735 321601 369081 543594
22440E43594J02435l5569p6179j3224j2275m5382o86j9978J47j1344n1289l9089
$$ 543594 646029 610460 534281 521057 508782 463400 462714 442736 442883 431539 380250 341161
22428C41161J9561M5573o370j1644M3258J4193L3809M0277k1891M586J72885J47229
$$ 341161 360722 406295 399925 388281 431539 445732 479541 519818 497927 502513 675398 822627
22416H22627J47751R5620J31030J41217N8398m5719p9469j39329j57045q5061
$$ 822627 970378 1065998 1197028 1338245 1396643 1350924 1271455 1132126 975081 890020
22406H90020j92231j11931j08812l4523n5166k1704N9257m3872o1993j9724r2906
$$ 890020 697789 585858 477046 442523 387357 365653 424910 381038 319045 299321 206415
22395B06415k459l0189k3277j8810j5391N2663L9897p769K2809K7510j9966r944
$$ 206415 203956 173767 150490 131680 116289 168952 208849 201080 223889 251399 231433 221489
22383B21489J4983k2333m369J8874r7619l2344R255k0104n5488k9007l4194K0711
$$ 221489 236472 214139 209770 228644 131025 98681 107936 87832 32344 3337 -30857 -10146
22371a0146J1233j2302p680J6081M0356K8067o8655J3929M9242L2565p709l6137
$$ -10146 1087 -11215 -18895 -2814 37542 65609 -3046 10883 60125 92690 84981 48844
22359D8844l2448K6498P1885J3856m5118j9272K758K6696L9239k052q6034l6634
$$ 48844 16396 42894 114779 128635 83517 64245 67003 93699 132938 130886 44852 8218
22347H218k891N7948k1630J9633K5905j8917p4129j2655j8738L3222J4749L7964
$$ 8218 5327 63275 41645 61278 87183 68266 -5863 -18518 -37256 -4034 10715 48679
22335D8679j5l2954k722k4200N7632k7845J3699L6267P55K7014M2145p0540p5434
$$ 48679 48664 15710 12988 -11212 46420 18575 32274 68541 69296 96310 138455 67915 -7519
22322g519J0320N9902M6922J5538l2352L072n9818l3568O45M7115M938J1303j5497
$$ -7519 2801 62703 109625 125163 92811 95883 36065 2497 3142 50257 55195 66498 51001
22309E1001j2439r257o2L3614L0515m0286l354J1039k8922n6580j8742O0118k1906
$$ 51001 38562 29305 29243 62857 93372 53086 49732 60771 31849 -24731 -43473 16645 -5261
22296e261k8741K375k4963L0407N6605N6515L7581k6636o721N3029J2876l1142
$$ -5261 -34002 -31627 -56590 -26183 30422 86937 124518 97882 91161 144190 157066 125924
22284A25924k3692j7507M5905J2857m0206k2151q795M6593N4269j7397l4345j2309
$$ 125924 102232 84725 130630 143487 103281 81130 72335 118928 173197 155800 121455 109146
22272A09146M142j365K728l8754q7848q940j3185l2397M6187N5564p557n3488
$$ 109146 113288 111923 114651 75897 -11951 -20891 -34076 -66473 -20286 35278 27721 -25767
22260b5767j422j2770L5905J4215j8816m4662K1423K2051J5025l794j5678Q409
$$ -25767 -27189 -39959 -4054 10161 -8655 -53317 -31894 -9843 5182 1388 -14290 -5881
22248e881J74o93R8502K0422l0479m8284l1183n2938o6955P9221Q3254J808M38
$$ -5881 -5707 -6400 92102 112524 82045 33761 2578 -50360 -117315 -38094 45160 46968 47406
22235D7406j0087k7343K799n631j0093M353k6461j2863J8580j588p062j3401O793
$$ 47406 37319 9976 12775 7144 -2949 1404 -25057 -37920 -19340 -20928 -27990 -41391 -34598
22222c4598L4003j2605m149K9083j6503l6632J4653M9146N0137k9872k7909K789
$$ -34598 -595 -13200 -17349 11734 -4769 -41401 -26748 22398 72535 42663 14754 17543
22210A7543k9367L7035N2988l9567j8674N1899L9673l7197l4760n3912m6215K8435
$$ 17543 -11824 25211 78199 38632 19958 71857 111530 74333 39573 -14339 -60554 -32119
22198c2119M5217P464j1728q960L2952M499K2118j2328J3830r1156k2310M2988
$$ -32119 13098 20562 8834 -126 32826 37325 59443 47115 60945 -30211 -52521 -9533
22186i533Q425K967j5265q908n7606J0244K3845L977l2442L7807l3275K1414o143
$$ -9533 -1108 1859 -13406 -22314 -79920 -69676 -45831 -41854 -74296 -36489 -69764 -48350 -54493
22173e4493O953K4922J1476M3342P0440j4409k7888J2947O632K3592l7531m0362
$$ -54493 -47540 -22618 -11142 32200 102640 88231 60343 73290 79922 103514 65983 25621
22161B5621J0615J0796n3963l5840J7105L4102Q1532J1994j9238k7449q479N6499
$$ 25621 36236 47032 -6931 -42771 -25666 8436 89968 101962 82724 55275 46796 103295
22149A03295N3196m2323n8170o7073l4865M0545j7550n6057j5892L7669K1649
$$ 103295 156491 114168 55998 -11075 -45940 -5395 -22945 -79002 -94894 -57225 -35576
22138c5576N8665M2526k9554m4025J0529J7239n998n386O3082k4587J2547J1935
$$ -35576 23089 65615 36061 -7964 2565 19804 13806 8420 71502 46915 59462 71397
22126G1397l2874k4103m9718O709L405K2782J1758L2375O8629p3854O479K0347
$$ 71397 38523 14420 -35298 -28589 -25184 -2402 9356 41731 110360 36506 42985 63332
22114F3332M5042n2925o5506k7151Q5864M6033k8655o6308J1336k0870r781L712
$$ 63332 108374 55449 -10057 -37208 48656 94689 66034 -274 11062 -9808 -19589 -15877
22102a5877M3665K6954j5994j2757J0716L0898j6098j5888J219k2842j4993k1116
$$ -15877 27788 54742 38748 25991 36707 67605 51507 35619 36838 13996 -997 -22113
22090b2113k716k0379J0829j0182J7272k7584j182N2409M9753R563r0478k392
$$ -22113 -24829 -45208 -34379 -44561 -27289 -54873 -56055 -3646 46107 55670 -34808 -37200
22078c7200p577k3498J7265K4631K1677K0119N619k5420m5916R965J9483M004
$$ -37200 -44777 -68275 -51010 -26379 -4702 15417 21036 -4384 -50300 -40335 -20852 -16848
22066a6848L7037k0011l1317l3663M2935L1338L6098Q809K6335k4104l3224k5029
$$ -16848 20189 178 -31139 -64802 -21867 9471 45569 54378 80713 56609 23385 -1644
22054a644l9432K696M1587K4468j284K2734j6759k6347L4756j9550j3561J0357
$$ -1644 -41076 -38380 3207 27675 26391 49125 32366 6019 40775 21225 7664 18021
22042A8021L3845M3174K1358J6120Q467L5885J2831j3451l3581n5641q7608o3944
$$ 18021 51866 95040 116398 132518 140985 176870 189701 176250 142669 87028 -580 -64524
22030f4524O461J9595M3583m6236J6829M8194N4232R2251L0511N3024N3596R5250
$$ -64524 -58063 -38468 5115 -41121 -24292 23902 78134 170385 200896 253920 307516 402766
22018D02766R6812J61117K06224K02010J70250J77110N9674J6041j04610k70166
$$ 402766 499578 660695 866919 1068929 1239179 1416289 1475963 1492004 1387394 1117228
22008A117228k34771j31292j40727j41729p8738p4650n3783n0661k7047o2483
$$ 1117228 882457 751165 610438 468709 389971 315321 261538 210877 183830 121347
21998A21347M2249l6024n0309J4765l6026k2600l9092K9520j9150k4596N16O303
$$ 121347 163596 127572 77263 92028 56002 33402 -5690 23830 4680 -19916 -19400 -13097
21986a3097j7584K6158L9181m6975j071K8278K3891k6059L4973l3701j0748O0913
$$ -13097 -30681 -4523 34658 -12317 -13388 14890 38781 12722 47695 13994 3246 64159
21974F4159J5962L8004J0106O2798m5208j10919m8606L6936M4722L8410p3675
$$ 64159 80121 118125 128231 191029 145821 34902 -13704 23232 67954 106364 32689
21963C2689p1169l180j0232o5936L5310R3476K4556K1210p3799p7077l499J6349
$$ 32689 -38480 -41660 -51892 -117828 -82518 10958 35514 56724 -17075 -94152 -97651 -81302
21951h1302q532M3092K0054m2196k6687J7410M6223M0574O5480q240l8526K4547
$$ -81302 -89834 -46742 -26688 -68884 -95571 -78161 -31938 8636 74116 65876 27350 51897
21939E1897L093l5059o3404p2255k8704O1316K9576k6914K0029O5718L7898O8153
$$ 51897 54990 19931 -43473 -115728 -144432 -83116 -53540 -80454 -60425 5293 43191 111344
21927A11344K8415j197O549n0313q2135n4627P5354M9810K7356m4695j7417n85
$$ 111344 139759 138562 145111 94798 12663 -41964 33390 83200 110556 65861 48444 47859
21915D7859K5357k4605M482R664m6726L2182K7986o3798m3998O524m54M69J8933
$$ 47859 73216 48611 53093 62757 16031 48213 76199 12401 -31597 -25073 -25527 -25058 -6125
21902f125l3056l7308J7587L3997l5076N568r171R959J3838m1165J1661P9515
$$ -6125 -39181 -76489 -58902 -24905 -59981 -54413 -63584 -53625 -39787 -80952 -69291 10224
21890A0224J9602j2042j7184J6185M6470o8124j3190J0286l8209K9116M5600n3850
$$ 10224 29826 17784 600 16785 63255 -4869 -18059 -7773 -45982 -16866 28734 -25116
21878b5116p0066J1016J2510L9189k6393K9073k9926l0226J4686l5448l7074j7669
$$ -25116 -95182 -84166 -71656 -32467 -58860 -29787 -59713 -89939 -75253 -110701 -147775 -165444
21866a65444N6275L9078L8782K9764N3521K3140O1012o253m2567N612O4522n7688
$$ -165444 -109169 -70091 -31309 -1545 51976 75116 136128 129875 87308 92920 157442 99754
21854I9754p0685K2251K4224m6465k1981L9132N2763k4684q1358m6845K1363J1789
$$ 99754 29069 51320 75544 29079 7098 46230 98993 74309 -7049 -53894 -32531 -20742
21842b0742L7400j5755n9504j45L6068K5535L6548O632o3752K8939L2543p3249
$$ -20742 16658 903 -58601 -58746 -22678 2857 39405 46037 -17715 11224 43767 -29482
21830b9482j9321j0112P570L9769L9327K6008k4080j8748M2992J5642l9654q7435
$$ -29482 -48803 -58915 -51345 -11576 27751 53759 29679 10931 53923 69565 29911 -57524
21818e7524l5543n679Q0592L5758o2510m912M9848l112m6941j0894k470j4823
$$ -57524 -93067 -98746 -18154 17604 -44906 -49818 30 -3082 -50023 -60917 -63387 -78210
21806g8210L7736J3526L8050L6966r0460k4822P0510K277l2615J5681Q5167O781
$$ -78210 -40474 -26948 11102 48068 -42392 -67214 3296 5573 -27042 -11361 73806 80587
21794H0587l8682m8876k2537l9198P669M9751K982J0846J716n410N5088K9346
$$ 80587 41905 -6971 -29508 -68706 -61037 -11286 -8304 2542 4258 -1152 53936 83282
21782H3282l7293J8169l7097q208K1107l9943j2181J9631l2933K4732K0013J1796
$$ 83282 45989 64158 27061 18853 39960 17 -12164 7467 -25466 -734 19279 31075
21770C1075K8536j4272q1435l1685M5693K9893M5028k7976n231k7136Q289J2063
$$ 31075 59611 45339 -36096 -67781 -22088 7805 52833 24857 19626 -7510 779 12842
21758A2842K3475K5881J7872o9628l6984K4861J6148j2278l2388k1960j5072N1106
$$ 12842 36317 62198 80070 10442 -26542 -1681 14467 2189 -30199 -52159 -67231 -16125
21746a6125L0835J6363r514m8449l5176j3095K0912J9698L359j418k3560M3600
$$ -16125 14710 31073 21559 -26890 -62066 -75161 -54249 -34551 -31192 -32610 -56170 -12570
21734a2570j631Q241J0313k8315M3780j77K1283J0415n4220o4018k0693L7263
$$ -12570 -14201 -5960 4353 -23962 19818 19641 40924 51339 -2881 -66899 -87592 -50329
21722e0329l141J8124L6171j8561k1840j0018K9983m2433L003R2596j7050P5068
$$ -50329 -53470 -35346 825 -17736 -39576 -49594 -19611 -62044 -59041 33555 16505 91573
21710I1573J5768n0642l4646j1071j0575J4255q589Q986K2520k5755k8177k6520
$$ 91573 107341 56699 22053 10982 407 14662 6073 15059 37579 11824 -16353 -42873
21698d2873Q710L5783M0342N4067J4579m9361l9848K2119l838n5279J1096K7284
$$ -42873 -34163 1620 41962 96029 110608 61247 21399 43518 39680 -15599 -4503 22781
21686B2781q1459K8197J7365k1342K5958O9592j2761j1111o6276J0330r139J8884
$$ 22781 -58678 -30481 -13116 -34458 -8500 61092 48331 37220 -29056 -18726 -27865 -8981
21674h981O9865j5161k2950J9420O98l2347n4616k4719m6779L911K9345L0503
$$ -8981 60884 45723 22773 42193 42891 10544 -44072 -68791 -115570 -111659 -82314 -51811
21662e1811J5315k6024l5050n691j8674M7105r710J6501J2549J4536K8797J5020
$$ -51811 -36496 -62520 -97570 -103261 -121935 -74830 -84540 -68039 -55490 -40954 -12157 2863
21650B863j1810k5725m638n656j3304L0068K8712K2398n9884k8912j0052L0279
$$ 2863 -8947 -34672 -39310 -44966 -58270 -28202 510 22908 -36976 -65888 -75940 -45661
21638d5661N4860J3112K8883j0568N338l9402L394M2509l1825L6535O0822o829
$$ -45661 9199 22311 51194 40626 45964 6562 9956 52465 20640 57175 117997 111168
21626A11168q6793j85L0001m0080m4919n8234L4250k0983L107k1682K4767J1528
$$ 111168 24375 24190 54191 14111 -30808 -89042 -54792 -75775 -72668 -94350 -69583 -58055
21614e8055m886M758K9995R976K7771j173J6958Q395n450L8495P6232o2378q8025
$$ -58055 -62941 -58183 -28188 -18212 9559 8386 25344 33739 28289 66784 143016 80638 -7387
21601g387j4290m7374m823M6730J5363K5397j3701k7908l0886Q169L3768M1113
$$ -7387 -21677 -69051 -73874 -27144 -11781 13616 -85 -27993 -58879 -50710 -16942 24171
21589B4171q21k4913n7490k5850j6443N5187O4902K4139Q462j5472j1030k4914
$$ 24171 23350 -1563 -59053 -84903 -101346 -46159 18743 42882 51344 35872 24842 -72
21577g2L8184L4032k6286j9351K4619r984j1385k3524l2766n7159j252n995M6409
$$ -72 38112 72144 45858 26507 51126 41142 29757 6233 -26533 -83692 -84944 -90939 -44530
21564d4530J7655K646N5337L7977o8638l4116M9152j1129M539K9441J7616L8423
$$ -44530 -26875 -24229 31108 69085 447 -33669 15483 4354 8893 38334 55950 94373
21552I4373j7353j3193n8396j6814n2202L7081o131P1140j3737o9557k5808K3930
$$ 94373 77020 63827 5431 -11383 -63585 -26504 -32635 38505 24768 -44789 -70597 -46667
21540d6667J2017l4462k6126k472p314n436K6598j1895j7521p70L0032O0791M6037
$$ -46667 -34650 -69112 -95238 -97710 -105024 -110460 -83862 -95757 -113278 -114048 -84016 -23225 22812
21527B2812N824K0523J8469l3339j8835L3716K1619p5429J0120J7678J4059K3756
$$ 22812 28636 49159 67628 34289 15454 49170 70789 -4640 5480 23158 37217 60973
21515F0973p5138m6685N9648J7930l6502N1604M6749k0025m0909J4471O621m7449
$$ 60973 -14165 -60850 -1202 16728 -19774 31830 78579 58554 17645 32116 38737 -8712
21503h712p7430l2876J1433K1112N3053R2742j4320j0547m1609r314N5285k5918
$$ -8712 -86142 -119018 -107585 -86473 -33420 59322 45002 34455 -7154 -16468 38817 12899
21491A2899k4979K0751P177L6574j1059l8799J9217l2669k5108k022q29k0029
$$ 12899 -12080 8671 15848 52422 41363 2564 21781 -10888 -35996 -38018 -38847 -58876
21479e8876L747L6234j880J0363M8671O6594o0968m8418k5328L3295l841m0096
$$ -58876 -55129 -18895 -20775 -10412 38259 104853 43885 -4533 -29861 3434 -407 -40503
21467d0503O6177p968n0007k8646O1811M9064j2875L6347J4358P649m7790q5607
$$ -40503 25674 17706 -32301 -60947 864 49928 37053 73400 87758 95407 47617 -37990
21455c7990m6030k2301M2393L1365j4496l3275J8877M1242q310j1874J384M1642
$$ -37990 -84020 -106321 -63928 -32563 -47059 -80334 -61457 -20215 -28525 -40399 -39015 2627
21443B627j2735J1031M4602q885p1729l6640j4981K4398m2286K3214L7653M3373
$$ 2627 -10108 923 45525 36640 -35089 -71729 -86710 -62312 -104598 -81384 -43731 -358
21431c58J1869n59J2166m3819M777M155L2528k6540r994J3193O4376j2808o2480
$$ -358 11511 10952 23118 -20701 -15924 -11769 20759 -5781 -15775 -2582 61794 48986 -13494
21418a3494m456P250K2780j5199N9873K1431L055q612l8395j9639j7815O156J8594
$$ -13494 -17950 -10700 12080 -3119 56754 78185 81240 72628 34233 14594 -3221 2935 21529
21405B1529K3157k0563N187j0775j6515r6787o9539P21L8067J23482O7862j1987
$$ 21529 44686 24123 29310 18535 2020 -94767 -164306 -163585 -125518 -2036 65826 53839
21393E3839j1706l8259L152j6457k4345o843J0558o933j2407J7754O8170P38o9118
$$ 53839 42133 3874 7026 -9431 -33776 -40619 -30061 -36994 -49401 -31647 36523 37261 -31857
21380c1857m7956K1851L4446L1051P4652O0809l0292k1365j9208m0897n2994N5375
$$ -31857 -79813 -57962 -23516 7535 82187 142996 112704 91339 72131 31234 -21760 33615
21368C3615j0373m2709J0370J9746l779J6965j1361k5005o309P2646N6378o8110
$$ 33615 23242 -19467 -9097 10649 6870 23835 12474 -12531 -18840 53806 110184 42074
21356D2074n2463l8021J3100K4522L818L1785L7290o671k4812n126o721O0965
$$ 42074 -10389 -48410 -35310 -10788 -6970 24815 62105 55434 30622 25496 18775 79740
21344G9740K7842m7084j1154m6204r6998j101N7985o287L0926M0402l3263m5356
$$ 79740 107582 60498 49344 3140 -93858 -94959 -36974 -43261 -12335 28067 -5196 -50552
21332e0552j8967N6630K2515m705L6254J0624m8792j7080J2694o359L4741k023
$$ -50552 -69519 -12889 9626 4921 41175 51799 3007 -14073 -1379 -7738 27003 24980
21320B4980k1587m6888J6673N8428N4823j5695o0053K5713M583j0161l8374M1459
$$ 24980 3393 -43495 -26822 31606 86429 70734 10681 36394 40977 30816 -7558 33901
21308C3901l2119l0177k8742o43J3069n471j5802j333O7953M1215k1714n237p204
$$ 33901 1782 -28395 -57137 -57780 -44711 -50182 -65984 -67317 636 41851 20137 14900 7696
21295G696R182M4396k6490o1828K7034J1662L447j6725n5686k2734M1666l1987
$$ 7696 16878 61274 34784 -27044 -10 11652 15099 -1626 -57312 -80046 -38380 -70367
21283g0367N3203J2429L1503o768l4640L1410l4452K0767M6062L0687n175m3342
$$ -70367 -17164 -4735 26768 20000 -14640 16770 -17682 3085 49147 79834 74659 31317
21271C1317q2985n4L4675J4525k6722J8345J5107K9533M0099l4942n1037m8282
$$ 31317 -51668 -51722 -17047 -2522 -29244 -10899 4208 33741 73840 38898 -12139 -60421
21259f0421J4057O1235p702j7310m6630L1658K3633n4899k0103P0659J8826j7212
$$ -60421 -46364 14871 7169 -10141 -56771 -25113 -1480 -56379 -76482 -5823 13003 -4209
21247d209L4169N526p9467k8735k3633J7558N7195J210n7217l9038M4094N9208
$$ -4209 29960 35486 -43981 -72716 -96349 -78791 -21596 -20386 -77603 -116641 -72547 -13339
21235a3339m6329p224J7729J1870J5603j7101K2002j9431m3388L9110M2732M8698
$$ -13339 -59668 -66892 -49163 -37293 -21690 -38791 -16789 -36220 -79608 -40498 2234 50932
21223E0932K3577o3739l329N6975k7143O086N346R70m5839J0568J6053J8379J4866
$$ 50932 74509 10770 7441 64416 37273 43359 48705 49675 3836 14404 30457 48836 63702
21210F3702N3371L615l6198q2700m1632r959J2854j7793M5436J22857L7119j5947
$$ 63702 117073 120688 84490 1790 -39842 -49801 -36947 -54740 -9304 113553 150672 134725
21198A34725l8528l8795J8699m1954j7569J2008K550l9727k7165O862L469m2450
$$ 134725 96197 57402 76101 34147 16578 28586 31136 -8591 -35756 -28894 -25425 -67875
21186f7875K6393K1722k2549L108j8632L1044p133M3925M8503j4849j0385o6413
$$ -67875 -41482 -19760 -42309 -39201 -57833 -26789 -33922 10003 58506 43657 33272 -33141
21174c3141n097K1469m9138p5473M7641P7321K6368J5992J5192j9214m616j0929
$$ -33141 -38238 -16769 -65907 -141380 -93739 -16418 9950 25942 41134 21920 17304 6375
21162F375l8086j7990M3511K8309J2976M7286l303q695l3716o7644J3440L4558
$$ 6375 -31711 -49701 -6190 22119 35095 82381 79078 70383 36667 -30977 -17537 17021
21150A7021J7103l4340l5809J9693N3063m3699m3721J3717n4369n570k2922K4188
$$ 17021 34124 -216 -36025 -16332 36731 -6968 -50689 -36972 -91341 -96911 -119833 -95645
21138i5645N8300N0590K3164l9996K9710Q651k410n534N0934k6846j7014j0956
$$ -95645 -37345 13245 36409 -3587 26123 34774 32364 26830 77764 50918 33904 22948
21126B2948j10861K3485j0336J5621O6118j8631r838L1409p425J3797R315O4001
$$ 22948 -87913 -64428 -74764 -59143 6975 -11656 -21494 9915 2490 16287 25602 89603
21114H9603j8010j6664r224k1511n4585O636o819K7006K1760m8788l3562P2316
$$ 89603 71593 54929 45705 24194 -30391 -23755 -30574 -3568 18192 -30596 -64158 8158
21102H158L7763n9945K9894O1864m0001k1069K839J8834k9075N2755L1692o6071
$$ 8158 45921 -14024 15870 77734 37733 16664 19503 38337 9262 62017 93709 27638
21090B7638K9462N8267l2655j0114j5278l0109k2502J0370M862Q872M1479P1417
$$ 27638 57100 115367 82712 72598 57320 27211 4709 15079 19941 28813 70292 141709
21078A41709l9183q0412k4277j6425J8843m1788K624O2041K4064o8193J6315J0446
$$ 141709 102526 22114 -2163 -18588 255 -41533 -38909 23132 47196 -20997 -4682 5764
21066E764K9304K3194N833l2099N1m1360l0835M6055J243J1508q333l8754j0105
$$ 5764 35068 58262 64095 31996 32047 -9313 -40148 5907 7150 18658 10325 -28429 -38534
21053c8534k1142k9357O4325N2194k172M6383R044K8768P0193P783o004Q72k3245
$$ -38534 -59676 -89033 -24708 27486 25314 71697 80741 109509 179702 187485 181481 182353 159108
21040A59108L2809K3209J4646J778M6829M4832J1343K8750l6395k1473J7113L9571
$$ 159108 191917 215126 229772 231550 278379 323211 334554 363304 326909 305436 322549 362120
21028C62120K1577n1456L4069O8399M776J3273O0293m2415p6811l7021l7177j8095
$$ 362120 383697 332241 366310 434709 439485 452758 513051 470636 393825 356804 319627 301532
21016C01532p2309k0344j6089k8058l1160O437R454K5142K0527L1377m2094P721
$$ 301532 229223 208879 192790 164732 133572 140009 149463 174605 195132 226509 184415 192136
21004A92136L6335J0223n1888k2849J02101J0313l749P7625K0556K0810N4163
$$ 192136 228471 238694 186806 163957 266058 276371 272622 350247 370803 391613 445776
20993D45776r022k6286K350m7083l1614k8161o1697M3731O6352k5821o7814j6891
$$ 445776 436754 410468 412818 365735 334121 305960 244263 287994 354346 328525 260711 243820
20981B43820j3849L8838k8609p2915m9249l1058p5114l5988R806M128L5918j7633
$$ 243820 229971 268809 240200 167285 118036 86978 11864 -24124 -14318 -10190 25728 8095
20969H095J6826M3830K285j4077j2114n346j8721M790J3287L498o928K6825L5693
$$ 8095 24921 68751 71036 56959 44845 39499 20778 25568 38855 42353 35425 62250 97943
20956I7943j748j4353J9142l1730l8250n0122M4101O0768K0965m0964m5757l7737
$$ 97943 96195 81842 100984 69254 31004 -19118 24983 85751 106716 65752 19995 -17742
20944a7742l9296J0436N7175K5653k2739J1700k2028j9891J755j5060l4544q664
$$ -17742 -57038 -46602 10573 36226 13487 25187 3159 -16732 -14977 -30037 -64581 -73245
20932g3245K8967P784k2918J3238O2279N8625O511k0847N389J2665k2095j3849
$$ -73245 -44278 -36494 -59412 -46174 16105 74730 81241 60394 65783 78448 56353 42504
20920D2504N2490L9360l7203l8155j0130k41K0502J3388L5320m5979o0083l5444
$$ 42504 94994 134354 97151 58996 48866 48625 69127 82515 117835 71856 11773 -23671
20908b3671L1272J5161j0419P8422k1386m8581o3579m8615M4661O9377J0821K1204
$$ -23671 7601 22762 12343 90765 69379 20798 -42781 -91396 -46735 22642 33463 54667
20896E4667L3492k2093j750K5983J9667m4724k8716o193L4119L4349L0576J6000
$$ 54667 88159 66066 64316 90299 109966 65242 36526 30333 64452 98801 129377 145377
20884A45377J774l1849k3012m9595N6300J9077j3321j121j1715p7524l0085k7315
$$ 145377 147151 115302 92290 42695 98995 118072 104751 103630 91915 14391 -15694 -43009
20872d3009M2880r962M8978M2168n4862l350K2275l1155q3920M1142R0338j5575
$$ -43009 -129 -10091 38887 81055 26193 22843 45118 13963 -69957 -28815 61523 45948
20860D5948k3380m6767M4289O1489P916M66l9033l11N2733L5522n081m2549M140
$$ 45948 22568 -24199 20090 81579 89495 89961 50928 50617 103350 138872 133791 91242 95382
20847I5382k4904j6844j2096n5900n0867p739N6491k010j5191k8201k5716j1533
$$ 95382 70478 53634 41538 -14362 -65229 -72968 -16477 -18487 -33678 -61879 -87595 -99128
20835i9128J3410N1990K8644L9638K0008K3735j8570J4326l9593n4249L9684Q0355
$$ -99128 -85718 -33728 -5084 34554 54562 78297 59727 74053 34460 -19789 19895 100250
20823A00250K4865J7575j2921m1400J870l1806k4973J284n0093R524l490p3477
$$ 100250 125115 142690 129769 88369 90239 58433 33460 34744 -15349 -5825 -9315 -82792
20811h2792m3004M9692J08469O1234K0933o3543n3832p9633O741M8082K8921K7172
$$ -82792 -125796 -76104 32365 93599 114532 50989 -2843 -82476 -75735 -27653 1268 28440
20799B8440j3775r162l9073K2312O5654J9610M9030k8816l9731K9680P24N312
$$ 28440 14665 5503 -33570 -11258 54396 74006 123036 94220 54489 84169 84893 90205
20787I0205l6417L92P2414L242n3658J8240M2318J4515m7842o9384l4999l087
$$ 90205 53788 54180 126594 129836 76178 94418 136736 151251 103409 34025 -974 -4061
20775d061O24K7882k3412k7559j2850N497L9415O5077N4037J8027J8173J3465
$$ -4061 -3437 24445 1033 -26526 -39376 -33879 5536 70613 124650 142677 160850 174315
20763A74315N052K9148o6553j3658j7829Q479j1733k7518l8103q536K2184k9302
$$ 174315 179367 208515 141962 128304 110475 118954 107221 79703 41600 33064 55248 25946
20751B5946J246L7219P0416K0638n2906j8963p417p403L3857J7252n3119j4491
$$ 25946 27192 64411 134827 155465 102559 83596 76179 68776 102633 119885 66766 52275
20739E2275n8872l4494J2194N3183K4002n4493N4169L5649L5392O875M3010j5616
$$ 52275 -6597 -41091 -28897 24286 48288 -6205 47964 83613 119005 125880 168890 153274
20727A53274k2945K8553K3899J1347n9935k2499l729M814L6858L8637k1440j9445
$$ 153274 130329 158882 182781 194128 134193 111694 107965 112779 149637 188274 166834 147389
20715A47389o963m1656L9263O6887j143j03713n0177m852O6001M6993K1577L154
$$ 147389 140426 98770 138033 204920 203777 100064 49887 45035 111036 158029 179606 182760
20703A82760k5730k4568j4354K1109J6848M0511j5705n3039K5663k1930k9149
$$ 182760 157030 132462 118108 139217 156065 196576 180871 127832 153495 131565 102416
20692A02416M8120L7093k1661o0810l3760j6271o0510N7074N4713K3715M78j7930
$$ 102416 150536 187629 165968 105158 71398 55127 -5383 51691 106404 130119 130597 112667
20680A12667l9042n6426l2538L1874M7964P9302N4653m1990l1338l8445K742O280
$$ 112667 73625 17199 -15339 16535 64499 143801 198454 156464 125126 86681 89423 95703
20668I5703J7454M4795k5803K419k8726m9565n490l9268k6084M5163j063L6599
$$ 95703 113157 157952 132149 134568 105842 56277 50787 11519 -14565 30598 29535 66134
20656F6134j0886M8555k9765o052L27k1116Q322J3311K9938j9457k8469K6117
$$ 66134 55248 103803 74038 67986 68313 47197 55519 68830 98768 79311 50842 76959
20644G6959J2898K1694O1647K7798o1510n814L0498M1248J6051K6034j6330n9226
$$ 76959 89857 111551 173198 200996 139486 133672 164170 205418 221469 247503 231173 171947
20632A71947p9846j1802n6046l0537L1460M0247L1318j2362L0113j2079j7717
$$ 171947 92101 80299 24253 -6284 25176 65423 96741 84379 114492 102413 84696
20621H4696L3757K7249O0890l2940j2920L0433r616J8552j6844k0064P921p77
$$ 84696 118453 145702 206592 173652 160732 191165 181549 200101 183257 163193 171114 170337
20609A70337l9557O1338K3139k9559r2007m9445r089Q3624R0585m64j8080j6408
$$ 170337 130780 192118 215257 185698 93691 44246 35157 118781 209366 208902 190822 174414
20597A74414n497j7688j8993K9080K8413N0188J1047n599K3158l7556J8849K3047
$$ 174414 168917 151229 132236 161316 189729 239917 250964 245365 268523 230967 249816 272863
20585B72863j1119P6319o1144o6683k5878K4922R636j3505K103O580N5611K9887
$$ 272863 261744 338063 276919 210236 184358 209280 218916 205411 207514 214094 269705 299592
20573B99592n421o934j9410j8743L3419k1126p383k6530P933K2158R0264j2186
$$ 299592 294171 287237 267827 249084 282503 261377 253994 227464 235397 257555 347819 335633
20561C35633k6729k8574L7452j9005j3101Q720O330J9922j4724Q302M5251M935
$$ 335633 308904 280330 317782 298777 285676 294396 300726 320648 305924 314226 359477 364412
20549C64412j0734m1017K358k7810K5585k341L3241Q6871j767k37j8015p904N6764
$$ 364412 353678 312661 315019 287209 312794 310453 343694 430565 428798 428561 410546 402642 459406
20536D59406m419l471O8031N013o6673l9919N3774J22927L6439k1277Q6099K8378
$$ 459406 454987 451516 519547 524560 457887 417968 471742 594669 631108 609831 695930 724308
20524G24308l2415l1501K2572J06003M2992K5046K7901q834O1543J3291N114Q2318
$$ 724308 691893 660392 682964 788967 831959 857005 884906 876072 937615 950906 956020 1038338
20512A038338O3670P9189J17564R6294P7083J23111J00115J2033O3967J05996
$$ 1038338 1102008 1181197 1298761 1395055 1472138 1595249 1695364 1707397 1771364 1877360
20502A877360J33129J41928J33415J81019J81018J55387J54261J64466J17069
$$ 1877360 2010489 2152417 2285832 2466851 2647869 2803256 2957517 3121983 3239052
20493C239052J27960K26836K60120K56058L46285L47457K93846K68613M12252
$$ 3239052 3367012 3593848 3853968 4110026 4456311 4803768 5097614 5366227 5778479
20484E778479N40997O50832P79342R81576J297448J608199K031952K759272L705387
$$ 5778479 6319476 6970308 7749650 8731226 10028674 11636873 13668825 16428097 20133484
20475B0133484M986120O584392P584733O206603K957739P82593P51883J756240
$$ 20133484 25119604 31703996 39288729 45495332 48453071 49235664 49987547 51743787
20467E1743787K894393M881046P083536P515457N636146J607096k854415n529917
$$ 51743787 54638180 59519226 66602762 74118219 79754365 81361461 78507046 72977129
20459G2977129o040455n074564l511428j239016O29837m27769l084682m650275
$$ 72977129 66936674 61862110 58350682 57111666 57741503 57313734 54229052 49578777
20451D9578777m610350m270809m282594l491428j799448J63606K202479M312848
$$ 49578777 44968427 40697618 36415024 32923596 31124148 31287754 33490233 37803081
20443C7803081O219021O308881L682260P51912k91433N18007J728461L647688
$$ 37803081 44022102 50330983 54013243 54765155 54473722 54991729 56720190 60367878
20435F0367878O662424Q345859O495253K152528k307765n098257o419193o442916
$$ 60367878 67030302 75376161 81871414 84023942 81716177 76617920 70198727 63755811
20427F3755811m997280k721300l14290K7765k630892n202976n840458n624264
$$ 63755811 58758531 56037231 55722941 55750706 53119814 47916838 42076380 36452116
20419C6452116n848629n848483m873724l578545k607029k018489j581298j290274
$$ 36452116 30603487 24755004 19881280 16302735 13695706 11677217 10095919 8805645
20411H805645r38739p23607n68370m04831l70017l61677l11080l53479k98354
$$ 8805645 7866906 7143299 6574929 6170098 5800081 5438404 5127324 4773845 4475491
20402D475491l24157k84860j64923j66496j46840j61554j63455k07630j69291
$$ 4475491 4151334 3866474 3701551 3535055 3388215 3226661 3063206 2855576 2686285
20393B686285j84890j05639j02826o9568j11959j82720p0563l2171j6852j21987
$$ 2686285 2501395 2395756 2292930 2223362 2111403 1928683 1858120 1825949 1809097 1687110
20383A687110j49242m4806o039k9271J9003l066j14142o3093j00999j10335j0495
$$ 1687110 1537868 1493062 1487023 1457752 1476755 1473689 1359547 1296454 1195455 1085120 1074625
20372A074625K6695k3725p9624k1111o7000j1457O3241K9439M1747p5105n6032
$$ 1074625 1101320 1077595 997971 976860 909860 898403 961644 991083 1032830 957725 901693
20361I01693M8927K5393K9223M332n555q727J9050q687N3102K1491j6986q8645
$$ 901693 950620 976013 1005236 1009568 1004013 995286 1014336 1005649 1058751 1080242 1063256 974611
20349I74611o6296R596j106R409J1862m3651m7269m3866K6293J6165m8923q6237
$$ 974611 908315 917911 916805 926214 938076 894425 847156 803290 829583 845748 796825 710588
20337G10588J8351O088M3028M7292O8267j7497q0820o9759K6493M8082q592R541
$$ 710588 728939 735027 778055 825347 893614 876117 795297 725538 752031 800113 791521 801062
20325H01062l3601Q35o2996k1377N8468k9511n5595k1587N433K4212l9536m1750
$$ 801062 767461 768296 705300 683923 742391 712880 657285 635698 641131 665343 625807 584057
20313E84057m5415o0928j0111o3483j7076K5199o929O165j7301P096m3945j7091
$$ 584057 538642 477714 467603 404120 387044 412243 405314 411479 394178 401274 357329 340238
20301C40238m7101l1934j4422R514N9691R0334N9682l6219k2300K2090j3999n5234
$$ 340238 293137 261203 246781 256295 315986 406320 466002 429783 407483 429573 415574 360340
20289C60340O962l544J3537k0445m9741l7581J0546o184J4830k172j4125l2108
$$ 360340 367302 363758 377295 356850 307109 269528 280074 273890 288720 286548 272423 240315
20277B40315K1026N4722l6508n9503N8032K8164m3645p1645k2713K8006Q5415
$$ 240315 261341 316063 279555 220052 278084 306248 262603 190958 168245 196251 281666
20266B81666M2652p2628l4946r389L2213J7754l7477l8565N6392L203j538m8194
$$ 281666 324318 251690 216744 207355 239568 257322 219845 181280 237672 240875 239337 191143
20254A91143k5742P6418k4193k8673p02J0157K6191K3783r458K5954k0618l1629
$$ 191143 165401 241819 217626 188953 188251 198408 224599 248382 238924 264878 244260 212631
20242B12631j8319l6899K7517k0684j9843M8002M781L019m2768q5904k2568J6802
$$ 212631 194312 157413 184930 164246 144403 192405 197186 200205 157437 71533 48965 65767
20230F5767l7071j2179L1675N6975M2248M5482m9069N907J9243J7024N0243r138
$$ 65767 28696 16517 48192 105167 147415 192897 143828 149735 168978 186002 236245 227107
20218B27107l9237M6385O9565n6349p0812K062K217j9719l003m0813j0174K6899
$$ 227107 187870 234255 303820 247471 176659 178721 180938 161219 158216 117403 107229 134128
20206A34128L0092j447n5372j7448o6216j3917J1311j5224L5997M2218l8160j2346
$$ 134128 164220 162773 107401 89953 23737 9820 21131 5907 41904 84122 45962 33616
20194C3616N1614K0959L8194m0204n8697k2377K7443K146o1177K6915M1211l2307
$$ 33616 85230 106189 144383 104179 45482 23105 50548 52694 -8483 18432 59643 27336
20182B7336M3228P2608L2894K8236m155K63M659l3617J6790m547k6129m2821l8276
$$ 27336 70564 143172 176066 204302 200147 200410 205069 171452 188242 183695 157566 114745 76469
20169G6469l4676L2547m163P392J4247R1978k902l8904j7597M361n266k1940J6603
$$ 76469 41793 74340 70177 77569 91816 183794 180892 141988 124391 128752 123486 101546 118149
20156A18149J9015J3852M0502P993l9474n5643k885k6372j293K0559j6599K3056
$$ 118149 137164 151016 191518 199511 160037 104394 101509 75137 73844 94403 77804 100860
20144A00860q479K011J4845k597j2981M0534O064r9n639l4057n7886k9083M4683
$$ 100860 92381 94392 109237 106640 93659 134193 140257 140158 134519 100462 42576 13493 58176
20131E8176M8891l1430j7072P498O5401P715j4860N7767j1782m3685l8793j2336
$$ 58176 107067 75637 58565 66063 131464 139179 124319 182086 170304 126619 87826 75490
20119G5490K1317L8477j0371j3049o9n1826m4564L674K4613P4337N6082K5588
$$ 75490 96807 135284 124913 111864 111795 59969 15405 19079 43692 118029 174111 199699
20107A99699L2589l420m6438m0439k6024P627L7520L6155N2813L9565L5374M8808
$$ 199699 232288 228868 182430 141991 115967 123594 161114 197269 250082 289647 325021 373829
20095C73829R8567R8335J32372M0963K3976K6099o169l2301k7791j04725l7876
$$ 373829 472396 570731 703103 744066 768042 794141 787972 755671 727880 623155 585279
20084E85279N8157Q0939M3895M9411K2652l627m7449K1741k494l4080p1306l9284
$$ 585279 643436 724375 768270 817681 840333 836706 789257 810998 808504 774424 703118 663834
20072F63834k3842q4496r8323l6297m5184j26707p1983n6482o585K0734k1396
$$ 663834 639992 555496 457173 420876 375692 248985 177002 120520 113935 134669 113273
20061A13273K1999L0968J5731J1911J7735J6181K3879O195L0876O9120R385l6264
$$ 113273 135272 166240 181971 193882 211617 227798 251677 257872 288748 357868 367253 330989
20049C30989O6498l1083o3731k016O7145L1380p323J3601L3723N7169J12146J66947
$$ 330989 397487 366404 302673 300657 367802 399182 391859 405460 439183 496352 608498 775445
20037G75445N7602N0392L7290N2707N7543j2822k6570k6078m8307o584q6560n5447
$$ 775445 833047 883439 920729 973436 1030979 1018157 991587 965509 917202 910618 824058 768611
20025G68611j63j8153n8480m0617o4809j20956j03114o423N1646k831n8429l0301
$$ 768611 768448 750295 691815 651198 586389 465433 362319 355896 407542 404711 346282 315981
20013C15981J8944k7519k5009n8066m2511K9428m3506m065L5539l1838m6203R604
$$ 315981 334925 307406 282397 224331 181820 211248 167742 163677 199216 167378 121175 130779
20001A30779j1638R563j1106r161N2572J0909r233P4759l4251o3277p1617Q172
$$ 130779 119141 128704 117598 108437 161009 171918 162685 237444 203193 139916 68299 76471
19989G6471K8274M8319R881m5099k5228K2305k2406l2678k3096Q998L609N4645
$$ 76471 104745 153064 162945 117846 92618 114923 92517 59839 36743 45741 49350 103995
19977A03995K7239L2726J8593l3818m1495k5235Q582M7206N8191J2382k9809k4217
$$ 103995 131234 163960 182553 148735 107240 82005 90587 137793 195984 208366 178557 154340
19965A54340k0842K7174K9171L3782m3572k151P204N201O8736j6293m7157o376
$$ 154340 133498 160672 189843 223625 180053 177902 185106 190307 259043 242750 195593 189217
19953A89217j6602m8705P880Q774k6812J0210K8922k1430M0007J7676M62o4293
$$ 189217 172615 123910 131790 140564 113752 123962 152884 131454 171461 189137 189599 125306
19941A25306n2107K9161K1460M8909L7196l6060n7585k2404p0854j0283n012p777
$$ 125306 73199 102360 123820 172729 209925 173865 116280 93876 23022 12739 7727 -50
19929e0L9670L4685O9611N2754M6239j9245n7262p4454j2225K0768L0230K7139
$$ -50 39620 74305 143916 196670 242909 223664 166402 91948 79723 100491 130721 157860
19917A57860m4790n0170L9312P7464k2658k9472J2726N1181M8022m4552L0049
$$ 157860 113070 62900 102212 179676 157018 127546 140272 191453 239475 194923 224972
19906B24972N8627L3912O0756J8123l1828J0731N6243J8443K4143L2520N8764
$$ 224972 283599 317511 378267 396390 364562 375293 431536 449979 474122 506642 565406
19895E65406M0841L7909J997L6575L6551l0450n7897j03242j6315P1422L4199
$$ 565406 606247 644156 646153 682728 719279 688829 630932 527690 511375 582797 616996
19884F16996l3790j21142q5682m3516n4353l9462Q197L6302N2248Q1657O5389
$$ 616996 583206 462064 376382 332866 278513 239051 247248 283550 335798 417455 482844
19873D82844N077m0138j3513l4083K3755M6929M3248O2258j8340r941J940M0928
$$ 482844 487921 447783 434270 400187 423942 470871 514119 576377 558037 548096 550036 590964
19861E90964n67q9646j2989j3387N297M4771K4444m0604m0997O85n4667m4942
$$ 590964 590397 500751 487762 474375 479672 524443 548887 508283 467286 467971 413304 368362
19849C68362j0402l8004O168q077m9434K4850M5654k0208l9523m159M1065L9210
$$ 368362 357960 319956 326124 318047 268613 293463 339117 318909 279386 275227 316292 355502
19837C55502j9590M627o2450m7615k4123O6714j8638N672K6505M2821n9882j00647
$$ 355502 335912 340539 278089 230474 206351 273065 254427 260099 286604 329425 269543 168896
19825A68896K5747N9013K9692M1839K6194J4173n7099p8225k7751M248k4796L3689
$$ 168896 194643 253656 283348 325187 351381 365554 308455 230230 202479 206727 181931 215620
19813B15620N725m401L7225O9302O6664L0187O7341R787J82Q0278R6415K021O127
$$ 215620 221345 216944 254169 323471 390135 420322 487663 497450 497632 577910 674325 676346 682473
19800F82473q6310m7530K1590K3340k1634R8687N7943J15564R0293M5552n801
$$ 682473 596163 548633 570223 593563 571929 670616 728559 844123 934416 979968 974167
19789I74167p5512m7893m7984p4243o0765M731J2047j5275q981R969J384n4889
$$ 974167 898655 850762 802778 728535 667770 672501 684548 669273 660292 670261 671645 616756
19777F16756j4849K864O771n428n5605k4471J511l6300j4185p034Q446k0914k9091
$$ 616756 601907 604771 611542 606114 550509 526038 527549 491249 477064 470030 478476 457562 428471
19764D28471p1786l7041M2765R175K5507N2800L7629O7864k743O4342k9246p2420
$$ 428471 356685 319644 362409 371584 397091 449891 487520 555384 552641 616983 587737 515317
19752E15317J7019j3068M2099J13525J38315J29362J12432J19927P2181k7799
$$ 515317 532336 519268 561367 674892 813207 942569 1055001 1174928 1247109 1219310
19742A219310p0089m8660k8832o5547l8598N3935P6791K6355m2098j0216o5031
$$ 1219310 1149221 1100561 1071729 1006182 967584 1021519 1098310 1124665 1082567 1072351 1007320
19731A007320j22589j13316k7833m3614k7752n003j3623j04489n8962k4649r269
$$ 1007320 884731 771415 743582 699968 672216 667213 653590 549101 490139 465490 456221
19720D56221K6901K0533m7652M6951j3856p0854m1368k4696l0098l7145q480j8528
$$ 456221 483122 503655 456003 502954 489098 418244 376876 352180 322082 284937 276457 257929
19708B57929j3931q2070k6261P8618P0594j9478L9295N0037l9666j8891K2078
$$ 257929 243998 161928 135667 214285 284879 265401 304696 354733 315067 296176 318254
19697C18254K9526L9533J2110l4439M51P758K8643K4335k4584k7672k1093M1439
$$ 318254 347780 387313 399423 364984 365435 373193 401836 426171 401587 373915 352822 394261
19685C94261N6482O7029L7020j4060K4647j408m1655j3257j0837J070N4838r78
$$ 394261 450743 517772 554792 540732 565379 563971 522316 509059 498222 499292 554130 553152
19673E53152n7092n2983J2819L2083o8870k7961O7136Q9740J9115O925L2406J6312
$$ 553152 496060 443077 455896 487979 419109 391148 458284 548024 567139 574064 606470 622782
19661F22782P742M3689K8759K6993L461n5761J9836J7468L1592M5885M2980N3543
$$ 622782 630524 674213 702972 729965 733426 677665 697501 714969 746561 792446 835426 888969
19649H88969M0770m617Q642J4117k2458K5451P397m2476K7929O5915N3306O92
$$ 888969 929739 925122 933764 947881 925423 950874 958271 915795 943724 1009639 1062945 1063637
19637A063637k3915r505K0512L7225J7982N9577P1843N9185J0095R5364J0889
$$ 1063637 1039722 1030217 1050729 1087954 1105936 1165513 1237356 1296541 1306636 1402000 1412889
19626A412889M3379N6256J9437Q0158K4429N7092R3082N3171J12582J12136J14064
$$ 1412889 1456268 1512524 1531961 1612119 1636548 1693640 1786722 1839893 1952475 2064611 2178675
19615B178675J75788K23820J82639R6439J01028J48275J38975K18625K50428L17527
$$ 2178675 2354463 2578283 2760922 2857361 2958389 3106664 3245639 3464264 3714692 4032219
19605D032219L47948M14602M46969M68468N03575M93863N90741P50370Q21130
$$ 4032219 4380167 4794769 5241738 5710206 6213781 6707644 7298385 8048755 8869885
19596H869885R08008J175482J488104J899088K599256L450637M031344L948443
$$ 8869885 9777893 10953375 12441479 14340567 16939823 20390460 24421804 28370247
19588B8370247L657352L238619K913767L060929M148139O738549J0680890J6279123
$$ 28370247 32027599 35266218 38179985 41240914 45389053 52127602 62808492 79087615
19580G9087615K1861774K2421880J9248319J5811472R469638J64535q269393j1314977
$$ 79087615 100949389 123371269 142619588 158431060 167900698 168065233 159795840 148480863
19572A48480863j3750345j6836598j6082826j1116927o302007m332634l614554
$$ 148480863 134730518 117893920 101811094 90694167 84392160 80059526 76444972
19565G6444972l455589m518888o350218p810467p882962o987397o289980n164721
$$ 76444972 72989383 68470495 62120277 54309810 46426848 39439451 33149471 27984750
19557B7984750l798774k569689j723629j180795p74957n21457k97638r9068J37635
$$ 27984750 24185976 21616287 19892658 18711863 17936906 17415449 17117811 17018743 17156378
19548A7156378L64681N32470P84866J143985J633515K227199L021290M283136
$$ 17156378 17521059 18053529 18838395 19982380 21615895 23843094 26864384 31147520
19540C1147520O002571Q239674J0025081R985115Q478222O468292L841785J687659
$$ 31147520 37150091 45389765 55414846 65399961 73878183 80346475 84188260 85875919
19532H5875919J363737M007452Q732218J5039680K1007718K4707180K8797637
$$ 85875919 87239656 91247108 99979326 115019006 136026724 160733904 189531541
19525A89531541K9439733K0196204O662504m866641j5759824k6367142l1735664
$$ 189531541 218971274 239167478 245829982 240963341 225203517 198836375 167100711
19518A67100711k8353970k3496744j9474563j3962708r578398p093774o164060
$$ 167100711 138746741 115249997 95775434 81812726 72234328 65140554 58976494
19511E8976494o388670o807168o750803n886545n153516m448549l450028k482628
$$ 58976494 52587824 45780656 39029853 33143308 27989792 23541243 20091215 17608587
19503A7608587j775301j354349j222997j078654r80262q60325q17665q31728p76680
$$ 17608587 15833286 14478937 13255940 12177286 11197024 10336699 9519034 8687306 7910626
19494G910626p39288n52791m11341m58616l74134l10304k64806k65091j82104
$$ 7910626 7171338 6618547 6207206 5748590 5374456 5064152 4799346 4534255 4352151
19485D352151j40479j57726k03777k27158j83834r3835j42650j08783p4056n2754
$$ 4352151 4211672 4053946 3850169 3623011 3439177 3345342 3202692 3093909 3019853 2967099
19475B967099l3181n3596p1650r5508j02979j74869j93035j73705j20269l3754
$$ 2967099 2933918 2880322 2808672 2713164 2610185 2435316 2242281 2068576 1948307 1914553
19465A914553q6698r0318m296k0188J4261O26L6288N025j0473R262k9952j3570
$$ 1914553 1827855 1737537 1733241 1713053 1727314 1727940 1764228 1769253 1758780 1768042 1738090 1724520
19453A724520p972N9846O8281L6582L6063n320p8009n0821p1778o7070j6326l2332
$$ 1724520 1716548 1776394 1844675 1881257 1917320 1912000 1833991 1783170 1711392 1644322 1627996 1595664
19441A595664q3447p2245j6075n3762N6641L0157k1135m2590o2167r2700l3942
$$ 1595664 1512217 1439972 1423897 1370135 1426776 1456933 1435798 1393208 1331041 1238341 1204399
19430A204399l0874q748N7601J5596l5812m0038n3933m2222m8498k8641o7854
$$ 1204399 1173525 1164777 1222378 1237974 1202162 1162124 1108191 1065969 1017471 988830 920976
19419I20976p0336j0402J1266o0755j21600o0933j5800j2356j740q576J09226
$$ 920976 850640 840238 851504 790749 669149 608216 592416 580060 578320 569744 678970
19408F78970R8723M8278K2867O397m0478K0727o47j6549J4016O0300K4431J19105
$$ 678970 777693 825971 848838 855235 814757 835484 834837 818288 832304 892604 917035 1036140
19396A036140O7352N3904m540J5947j4024n5939n678j4059k1636n649m1984n2694
$$ 1036140 1103492 1157396 1152856 1168803 1154779 1098840 1093162 1079103 1057467 1051818 1009834 957140
19384I57140P8713k5227o4962l0581m8409j2695K1134J0181L39n1230o620K3426
$$ 957140 1035853 1010626 945664 915083 866674 853979 875113 885294 885633 834403 827783 851209
19372H51209K3916j3145J8274J5039L0317k9715k5946k0407Q8387O2300J5223
$$ 851209 875125 861980 880254 895293 925610 895895 869949 849542 937929 1000229 1015452
19361A015452L6266m8468J8258M9439L9436R095n454R2428Q6290J4232M471P474
$$ 1015452 1051718 1003250 1021508 1070947 1110383 1119478 1114024 1206452 1292742 1306974 1311445 1318919
19349A318919q843M1742M8452K0926M4434m5347N8508Q9804M7659M8737K6485
$$ 1318919 1310076 1351818 1400270 1421196 1465630 1420283 1478791 1568595 1616254 1664991 1691476
19338A691476J682O5424P8230L795K6963K0402N3152N1249N9336N2358L4794P0477
$$ 1691476 1693158 1758582 1836812 1840607 1867570 1887972 1941124 1992373 2051709 2104067 2138861 2209338
19326B209338O3676J02665J19676J24367J02167J74155K02785J84663K03797K28095
$$ 2209338 2273014 2375679 2495355 2619722 2721889 2896044 3098829 3283492 3487289 3715384
19316C715384K60378K31074K31272L28479M45515M70741M89307O22725O65836
$$ 3715384 3975762 4206836 4438108 4766587 5212102 5682843 6172150 6794875 7460711
19307G460711O45601N54381N43119N53839P45965R68856J222672J510348J890708
$$ 7460711 8106312 8660693 9203812 9757651 10503616 11472472 12695144 14205492 16096200
19298A6096200K344188K778438L486263M705308O480985Q034466P516727N110271
$$ 16096200 18440388 21218826 24705089 29410397 35891382 43925848 51442575 56552846
19290E6552846L553206M263053O469054R618636J5161521K4775534L6997487M4005990
$$ 56552846 60106052 64369105 70838159 80456795 95618316 120393850 157391337 201397327
19282B01397327L4380471J4737443J796138n130183j6785626l0586372l3655128
$$ 201397327 235777798 250515241 252311379 247181196 230395570 199809198 166154070
19275A66154070k7142675k1509919j6645456r549209k354769J492691l47546n296233
$$ 166154070 139011395 117501476 100856020 91306811 88952042 90444733 90097187 84800954
19267H4800954q553952r106018r078315r474354q689945o804373m840482l247899
$$ 84800954 76247002 67140984 58062669 48588315 39898370 33093997 28253515 25005616
19259B5005616k222777j592893j157698q26301o37107m48789k52459o9556J55152
$$ 25005616 22782839 21189946 20032248 19205947 18568840 18120051 17867592 17798036 17953188
19250A7953188L58046N98014R53778J460809J957511K712514L871076N679708
$$ 17953188 18311234 18909248 19863026 21323835 23281346 25993860 29864936 35544644
19242C5544644Q056035J0299897J0084965O252786J825962K60622J428786L371382
$$ 35544644 43600679 53900576 63985541 70238327 72064289 72324911 73753697 77125079
19234G7125079O577815J2324111J7262515J6656980J4415508J6558262J7699197
$$ 77125079 83702894 96027005 113289520 129946500 144362008 160920270 178619467
19227A78619467N805241j3223381k2827880k1723434j9955916k0943217j8520779
$$ 178619467 184424708 171201327 148373447 126650013 106694097 85750880 67230101
19220F7230101j2681951p236566l625374k518709l276276m127348m123325l653636
$$ 67230101 54548150 47311584 43686210 41167501 37891225 33763877 29640552 25986916
19212B5986916l579428l504888k841212k152230j572317j187036r23669p46865
$$ 25986916 22407488 18902600 16061388 13909158 12336841 11149805 10226136 9479271
19204I479271o51066o34373n85399n92273m82419m39756l99290l09730j91017
$$ 9479271 8828205 8193832 7608433 7016160 6533741 6093985 5694695 5384965 5193948
19195E193948k18861k32723j56627k67765l24095l47299k50216k40448j73395
$$ 5193948 4975087 4742364 4585737 4317972 3993877 3646578 3396362 3155914 2982519
19186B982519j62640j22329p8535p4882p5943r5507j06935q1131m4299j16468
$$ 2982519 2819879 2697550 2619015 2544133 2468190 2372683 2265748 2184617 2140318 2023850
19176B023850j23044l2351o2000q8641j28141p2137k9651m2947p2395n8419m4765
$$ 2023850 1900806 1868455 1806455 1717814 1589673 1517536 1487885 1444938 1372543 1314124 1269359
19165A269359o1836R711l3292R48m899P02J7717J5002k103n201J06603J11206
$$ 1269359 1207523 1217234 1183942 1184890 1179991 1180693 1198410 1213412 1211309 1206108 1312711 1423917
19153A423917N9260n9714p1876o2743j2407O925q2674n3098j619J3088o8133r0171
$$ 1423917 1483177 1423463 1351587 1288844 1276437 1283362 1200688 1147590 1145971 1159059 1090926 1000755
19141A000755K0329M576N168m9544k5231k552K5012j2579l306l4905l4246k6732
$$ 1000755 1021084 1025660 1030828 981284 956053 953501 978513 965934 962628 927723 893477 866745
19129H66745m2830j4390M3910k3777m9162l115J0809O7103j8428n0340k9821L3031
$$ 866745 823915 809525 853435 829658 780496 777381 788190 855293 836865 786525 756704 789735
19117G89735K2366K863l5732j9300N2949L0762j0412N6032P7197m8484N2960l0771
$$ 789735 812101 814964 779232 759932 812881 843643 833231 889263 966460 917976 970936 940165
19105I40165q3161m8747Q5295P7670O6853Q6802J0828l1206P65l6839j5196m1290
$$ 940165 857004 808257 893552 971222 1038075 1124877 1135705 1104499 1105264 1068425 1053229 1011939
19093A011939Q5624N8234k8057o1694j28271p5166k4617k1868J6652J2933M5483
$$ 1011939 1097563 1155797 1127740 1066046 937775 862609 837992 816124 832776 845709 891192
19082H91192O8134P5174l2443L6566O8671K6913M099m594r810Q6962R2833N0895
$$ 891192 959326 1034500 1002057 1038623 1107294 1134207 1138306 1133712 1123902 1210864 1303697 1354592
19070A354592J219L3936J11673J33048R8559J44378J62520N7025J19295J58093
$$ 1354592 1355811 1389747 1501420 1634468 1733027 1877405 2039925 2096950 2216245 2374338
19060B374338R5832K1566J09882J47979K14105J73793J10008j1106p8029p0401
$$ 2374338 2470170 2491736 2601618 2749597 2963702 3137495 3247503 3236397 3158368 3087967
19050C087967n5208m8942o4786p9020p993L2339P4964J07937J84375L90549O36267
$$ 3087967 3032759 2983817 2919031 2840011 2832018 2864357 2939321 3047258 3231633 3622182 4258449
19039D258449P71071N55669N3984l02901l52373k51354l20473k68437l8889J69376
$$ 4258449 5029520 5585189 5639173 5336272 4983899 4732545 4412072 4143635 4104746 4274122
19029D274122L34187K24910j5432j29475j86047q2398n8754j07884o1137J07897
$$ 4274122 4608309 4833219 4817787 4688312 4502265 4419867 4361113 4253229 4192092 4299989
19019D299989J92226J89155J65247K22863K71835L55805M36728N40660P39179
$$ 4299989 4492215 4681370 4846617 5069480 5341315 5697120 6133848 6674508 7413687
19010G413687Q28151O74726N47111O10368O90571P21607P95758J040815J122135
$$ 7413687 8241838 8916564 9463675 10074043 10764614 11486221 12281979 13322794 14444929
19001A4444929Q06514O06494P49311J161755J532956J844747K447401L318379
$$ 14444929 15251443 15857937 16607248 17769003 19301959 21146706 23594107 26912486
18993B6912486M489790O170594Q553953J2374179J7337739J9535957J3732125
$$ 26912486 31402276 37572870 46126823 58501002 75838741 95374698 109106823
18986A09106823O347876M944705R384131J1406292M935071j136417j70802P062127
$$ 109106823 115454699 120399404 129783535 141189827 146124898 144988481 144817679 151879806
18978A51879806J1618511O121791Q19631j311518o749004j5120535k0564679j8329203
$$ 151879806 163498317 169620108 170439739 169128221 162379217 147258682 126694003 108364800
18970A08364800j5563495j4470180j1097032o737771k988291M4378K877178O289000
$$ 108364800 92801305 78331125 67234093 60496322 57508031 57552409 60429587 66718587
18962F6718587J0784970J6846283K3109197K3638293J7932611J3499334Q350402
$$ 66718587 77503557 94349840 117459037 141097330 159029941 172529275 180879677
18955A80879677m58974p487656n750894R06403j302234q399004r292253l682324
$$ 180879677 180420703 172933047 167182153 168088556 166786322 158387318 149095065 145412741
18947A45412741J542206l773743j4110617j8470546j6698344j3977757j4327684
$$ 145412741 146954947 143181204 129070587 110600041 93901697 79923940 65596256
18940F5596256j3580180j0367494p276120n124641l693207k680869j972756j226753
$$ 65596256 52016076 41648582 34372462 29247821 25554614 22873745 20900989 19674236
18932A9674236q76298j081613j341318j309431j122850r62283q00601n85425m65807
$$ 19674236 18797938 17716325 16375007 15065576 13942726 12980443 12179842 11594417 11128610
18923A1128610o67096q22490q34055p63007p52772p28264n49904m25148l27123
$$ 11128610 10461514 9639024 8804969 8041962 7289190 6560926 6011022 5585874 5258751
18914E258751k54031j64600l6956o5473K704J19332K06348L44208M02673K58780
$$ 5258751 5004720 4840120 4803164 4737691 4740395 4859727 5066075 5410283 5812956 6071736
18904F071736l8833k94417l13117k67336k56521j25087K13618N82298O46279J90669
$$ 6071736 6032903 5738486 5425369 5158033 4901512 4776425 4990043 5572341 6218620 6409289
18894F409289l34411n81206n23411m42666n81557n58613m66447k84038j73762
$$ 6409289 6074878 5493672 4970261 4527595 3946038 3387425 2920978 2636940 2463178
18885B463178j27066j46219j76011j07319j15781l5041k0641p5732q0343n3104
$$ 2463178 2336112 2189893 2013882 1906563 1790782 1755741 1735100 1659368 1579025 1525921
18875A525921j8427k5629k0508o3730j5378k5151m9039M3308N1169k8562m790
$$ 1525921 1507494 1481865 1461357 1397627 1382249 1357098 1308059 1351367 1402536 1373974 1369184
18864A369184l1874l5048J08607M3889j0739o5256n6005l4783J6K0408R049O4255
$$ 1369184 1337310 1302262 1410869 1454758 1444019 1378763 1322758 1287975 1287991 1308399 1317448 1381703
18852A381703R2450K9744j279j483N551J7735J2953q2610r4058J3963m6160p7435
$$ 1381703 1474153 1503897 1502618 1501135 1506686 1524421 1537374 1454764 1360706 1374669 1328509 1251074
18840A251074j04652N3458J9548k1722o721m0461o0302K827P78k5247L2645L983
$$ 1251074 1146422 1199880 1219428 1197706 1190985 1150524 1090222 1093049 1093827 1068580 1101225 1105208
18828A105208j174k3439l2142J9885K1684Q5452r768K7545N1865J01730k1387
$$ 1105208 1104034 1080595 1048453 1068338 1090022 1175474 1165706 1193251 1245116 1346846 1325459
18817A325459R875J3922J7764J4671J6060J8240O1071M6990L9828J1801n8227
$$ 1325459 1335334 1349256 1367020 1381691 1397751 1415991 1477062 1524052 1563880 1575681 1517454
18806A517454o2537J6730K1631m1311j10085j2055L3744R933m1020n0616k3062
$$ 1517454 1454917 1471647 1493278 1451967 1341882 1329827 1363571 1373504 1332484 1281868 1258806
18795A258806k5188L231j9379o6403j13108p1955m4815l4901J9711q405j5113
$$ 1258806 1233618 1236849 1217470 1151067 1037959 966004 921189 886288 905999 897594 882481
18784H82481m887K9340N0143K2111m5073K0675L8355L3077J36732Q5067R2364
$$ 882481 877594 906934 957077 979188 934115 954790 993145 1026222 1162954 1248021 1340385
18773A340385R7619K7847q50N4681N6592J09312N3332Q0814J21858J84565N0506
$$ 1340385 1438004 1465851 1465001 1519682 1576274 1685586 1738918 1819732 1941590 2126155 2176661
18762B176661j00987j11561j66433j69920j65313j99624j57083j48444j17252
$$ 2176661 2075674 1964113 1797680 1627760 1462447 1262823 1105740 957296 840044
18753H40044k9729r859l1863K7222L2099N907J4406m9187m0043q2524m1115l4229
$$ 840044 810315 800456 768593 795815 827914 833821 848227 799040 758997 676473 635358 601129
18741F01129K9519P4038K9365O0269j7451j8213l516j6912l5876o2635m4393M3942
$$ 601129 630648 704686 734051 794320 776869 758656 755140 738228 702352 639717 595324 639266
18729F39266P0020N7473J05988P5613J11043J13607j155l6043O4073R875m671
$$ 639266 709286 766759 872747 948360 1059403 1173010 1171855 1135812 1199885 1209760 1205089
18718A205089l5914p3035L2220K249q797J1230N9289R025J08238J77546M352l8554
$$ 1205089 1169175 1096140 1128360 1130609 1121812 1133042 1192331 1201356 1309594 1487140 1491492 1452938
18706A452938l6979j14965j31897j99856j87949j04392m8578k0669j4954p516
$$ 1452938 1415959 1300994 1169097 969241 781292 676900 628322 607653 592699 585183
18696E85183l8952P07L969k7977M685O467K3027j0045L7945J1298n325K3031M5469
$$ 585183 546231 546938 550907 522930 527615 534082 557109 547064 585009 596307 590982 614013 659482
18683F59482k0718o9099K2839R75n9894n1396m0399j2826m8735L425M0234J4547
$$ 659482 638764 569665 592504 593479 533585 482189 441790 428964 380229 383654 423888 438435
18671D38435j6353k2396j5217j6721l064k3088o9294n1127M9686N7330L2859J5811
$$ 438435 422082 399686 384469 367748 364684 341596 272302 221175 270861 328191 361050 376861
18659C76861o9459j6957K7065k1323J933O6909K3709p035L9136n3592p6873k8583
$$ 376861 307402 290445 317510 296187 298120 365029 388738 381703 420839 367247 290374 261791
18647B61791J7230l9255l3579j0445L6753O5894j4332q2840m3870l6690N03J844
$$ 261791 279021 239766 206187 195742 232495 298389 284057 201217 157347 120657 121160 123004
18635A23004J5439L512L064K5475N0355L3133m9408p2723j9118O9535m1731J5935
$$ 123004 138443 141955 145019 170494 220849 253982 204574 131851 112733 182268 140537 156472
18623A56472N407O699J15k7903j6246J8995k8781K635M3861N9845L4383j136j2010
$$ 156472 161879 168578 168693 140790 124544 143539 114758 117393 161254 221099 255482 254346 242336
18610B42336L2676M8827O3436L5119m2274P964O1705J06731O6206J11888Q5948
$$ 242336 275012 323839 387275 422394 380120 388084 449789 556520 622726 734614 820562
18599H20562J25484N1044K9426J2696j6791n5485j45549r1544r3542j3959m2096
$$ 820562 946046 997090 1026516 1039212 1022421 966936 821387 729843 636301 622342 580246
18588E80246l5907q65l7743P392k2376j4998m0652l9605k0513o0027n5475j5578
$$ 580246 544339 543474 505731 513123 490747 475749 435097 395492 374979 314952 259477 243899
18576B43899K7702p969j7836j3457j0256N9238p474n1122k1909k3137J1233J7988
$$ 243899 271601 263632 245796 232339 222083 281321 273847 222725 200816 177679 188912 206900
18564B06900M4192O8300p264j9600O9101R125L348K1855K5650J2116P2870O7038
$$ 206900 251092 319392 312128 292528 361629 370754 374102 395957 421607 433723 506593 573631
18552E73631K0773q46L9930L7216J27094R1863K8717K2264o540l2938n8038j07943
$$ 573631 594404 593558 633488 670704 797798 889661 918378 940642 934102 901164 843126 735183
18540G35183k1076l3351m5628r2498j29387o8968j7252m5355O6466N9333K266
$$ 735183 714107 680756 635128 542630 413243 344275 327023 281668 348134 407467 409733
18529D09733n5190p2053r0671l8262N0919j8732J352K2063M6050K6114k2204L5252
$$ 409733 354543 282490 191819 153557 204476 185744 187096 209159 255209 281323 259119 294371
18517B94371L4986k5503K9669l2368K987k6473j4649k1197O130k291Q351N3937
$$ 294371 329357 303854 333523 301155 304142 277669 263020 241823 247953 245662 254013 307950
18505C07950N0265L3578L4223K1814l1915j2167L048k9555j3868M3392R0863J3343
$$ 307950 358215 391793 426016 447830 415915 403748 406796 377241 363373 406765 497628 510971
18493E10971K4604j1110j8997o257m2933l8406K6811O3013N4927p591P3414M4780
$$ 510971 535575 524465 505468 499211 456278 417872 444683 507696 562623 555032 628446 673226
18481F73226K9938N6441N0183O983M5855N4315K2175p344M08j4253n8230q4703
$$ 673226 703164 759605 809788 816771 862626 916941 939116 931772 932180 917927 859697 774994
18469G74994j6798k5957l0611N50J1198P987J0754k1514o701K9344l1009M803
$$ 774994 758196 732239 701628 702178 713376 721363 732117 710603 703902 733246 702237 707040
18457G07040Q4284K8501L3129M3328L7701M13m4977j458l7373m9197m6046L5817
$$ 707040 791324 819825 852954 896282 933983 934396 889419 887961 850588 801391 755345 791162
18445G91162Q0111N9573k1131p3556o440L3139o0498l7027K3291J2729m4321j20799
$$ 791162 871273 930846 909715 836159 829719 862858 802360 765333 788624 801353 757032 636233
18433F36233P2524J17011R3724N6523L9341J6461P5876J78709J17345N3483P7237
$$ 636233 708757 825768 919492 976015 1015356 1031817 1107693 1286402 1403747 1457230 1534467
18422A534467O7501P7801Q0031O1916m435n9791j08863j11671j08439j02207j27631
$$ 1534467 1601968 1679769 1759800 1821716 1817281 1757490 1648627 1536956 1428517 1326310 1198679
18411A198679l1113J0798m2564k4515K3545O1314o4224l7292j8696j2303q9957
$$ 1198679 1167566 1178364 1135800 1111285 1134830 1196144 1131920 1094628 1075932 1063629 973672
18400I73672m0966r523j9558p6474n6540L855M705l7070l3802l4996j5289J5603
$$ 973672 932706 923183 903625 827151 770611 774466 779171 742101 708299 673303 658014 673617
18388F73617R800m0954k0629j8520k2556l3631q189p418P563J8620O9918J9454
$$ 673617 683417 642463 621834 603314 580758 547127 538938 531520 539083 557703 627621 647075
18376F47075k9305M8524Q2089L8461P3346P5746M6114P9147O4150N6239r124O555
$$ 647075 617770 666294 748383 786844 860190 935936 982050 1061197 1125347 1181586 1172462 1179017
18364A179017O792j11587j01449p9267j03886p8536q1820J0494J7981m7490n4486
$$ 1179017 1185809 1074222 972773 893506 789620 711084 629264 639758 657739 610249 555763
18353E55763n8885l5179O6790J8839j6983j3515n4318k6422k1213j0236l9054
$$ 555763 496878 461699 528489 547328 530345 516830 462512 436090 414877 404641 365587
18342C65587m5203R619N1653J5965k2149K6702p6774m4951j1175k3215J1338L9867
$$ 365587 320384 330003 381656 397621 375472 402174 325400 280449 269274 246059 257397 297264
18330B97264K2782O625L3388k9811K2567q942k0812r349K3199j2055o5927K7622
$$ 297264 320046 326671 360059 330248 352815 343873 323061 313712 336911 324856 258929 286551
18318B86551O8758n1886k9607m129M7927P1937M3482l5952k5652J0031l9913Q7247
$$ 286551 355309 303423 273816 269687 317614 389551 433033 397081 371429 381460 341547 428794
18306D28794M7320j5062K0266P861k8323j6292K9712J9893O341l9272l6263o157
$$ 428794 476114 461052 481318 489179 460856 444564 474276 494169 500510 461238 424975 418818
18294D18818N018n44l7796j903J2397l2765K9624M9447J4494M7705L2420j2678
$$ 418818 423836 423292 385496 383593 395990 363225 392849 442296 456790 504495 536915 524237
18282E24237K8851O8158J00069k5546p493K8040J1242N4062j551j5015l014J3349
$$ 524237 553088 621246 721315 695769 688276 716316 727558 781620 780069 765054 762040 775389
18270G75389M7860L0076K0724K4361R7343J20929L0540K6983J07380P9792O6078
$$ 775389 823249 853325 874049 898410 995753 1116682 1147222 1174205 1281585 1361377 1427455
18259A427455J23689J31415J38644K09922L67182M30753N91681Q29570J163794
$$ 1427455 1551144 1682559 1821203 2031125 2398307 2829060 3420741 4250311 5414105
18250E414105J344335R57982Q7155n21983n21109n82111p37736p81910n83693
$$ 5414105 6758440 7716422 7803577 7281594 6760485 6178374 5440638 4658728 4075035
18241D075035k91126j09550j5221P9547J83024J78683K18687K82294M41822O42898
$$ 4075035 3783909 3674359 3659138 3738685 3921709 4100392 4319079 4601373 5043195 5686093
18231E686093Q04786R71715J303954J668054K405172L394724M881845P177973
$$ 5686093 6490879 7462594 8766548 10434602 12839774 16234498 21116343 28294316
18223B8294316R328859P966500K668783j800728l302212l790421n427521o363358
$$ 28294316 37623175 45589675 48258458 46457730 43155518 39365097 33937576 27574218
18215B7574218n231412l766737k785764j994867j340552q57381m94556j51933
$$ 27574218 22342806 18576069 15790305 13795438 12454886 11597505 11102949 10951016
18207A0951016K08801M49004O35537J022128J592417K197921L028747M072278
$$ 10951016 11159817 11608821 12244358 13266486 14858903 17056824 20085571 24157849
18199B4157849N681445Q062474J1156999J3342612J3406130J1955452Q110009
$$ 24157849 29839294 37901768 49058767 62401379 75807509 87762961 95872970
18192I5872970L088138l576393r479267j2158237j2422143j1150504j0252118
$$ 95872970 98961108 95384715 85905448 73747211 61325068 50174564 39922446
18185C9922446q331242n842652l952086k766317j812209j210264o77866k32585
$$ 39922446 31591204 25748552 21796466 19030149 17217940 16007676 15329810 15097225
18177A5097225R8118N87683J038683J574982K231947L256902M748240O951560
$$ 15097225 15195343 15783026 16821709 18396691 20628638 23885540 28633780 35585340
18169C5585340R970511J2980456J3526260J1516674P847967K666601k875668q440054
$$ 35585340 45555851 58536307 72062567 83579241 91427208 94093809 91218141 82778087
18161H2778087j1214880j2011898j1202723r770666q167550o062746m220940l004340
$$ 82778087 71563207 59551309 48348586 38577920 30410370 24347624 20126684 17122344
18153A7122344k191175j637986j235886q85169m44822k62501L4029M27259O82475
$$ 17122344 14931169 13293183 12057297 11172128 10727306 10464805 10498834 10926093 11608568
18144A1608568J059419J534035K185083L155351M156563N231861O515495O131158
$$ 11608568 12667987 14202022 16387105 19542456 23699019 28930880 35446375 41577533
18136D1577533J893718k815729m903136m617402m825817n440419m639328l337014
$$ 41577533 43471251 40655522 35752386 31134984 26309167 20868748 16229420 12892406
18128A2892406k292758j479394j027603o76736m31850l72764k10630o7036L2908
$$ 12892406 10599648 9120254 8092651 7415915 6984065 6611301 6400671 6333635 6366543
18119F366543J82527K81060L66607O55751R45748J187094J657598K368699L204860
$$ 6366543 6549070 6830130 7196737 7852488 8798236 9985330 11642928 14011627 17216487
18110A7216487M140159N270764P163519J1267114J7549407J8061735M361317p871703
$$ 17216487 21356646 26627410 33790929 45058043 62607450 80669185 85030502 77158799
18102G7158799j1307711q341245r778511j2988656j0007527o393210l999653k787091
$$ 77158799 65851088 57509843 47731332 34742676 24735149 18341939 14342286 11555195
18094A1555195j999564j551247j274868r23064p35256o09474n50778m42543k87809
$$ 11555195 9555631 8004384 6729516 5806452 5071196 4461722 3910944 3468401 3180592
18085C180592k18277j45892j53380n2453j53698k43883r4968j20871j03135j61292
$$ 3180592 2962315 2816423 2663043 2610590 2456892 2213009 2118041 1997170 1894035 1732743
18075A732743j13328n5008n4857q2943q1049M3691j1018m5037p7700q4767q225
$$ 1732743 1619415 1564407 1509550 1426607 1345558 1389249 1378231 1333194 1255494 1170727 1162502
18064A162502J0776o6304l2039L4375l0865j09632q3527k7969M2819J2860M4646
$$ 1162502 1173278 1106974 1074935 1109310 1078445 968813 885286 857317 900136 912996 957642
18053I57642L4731L3009K8182M1079K276j9694k5929r1913q0693n2461K177R0563
$$ 957642 992373 1025382 1053564 1094643 1096919 1077225 1051296 959383 878690 826229 828406 918969
18041I18969P9946Q2680K4204K365L2912p201q0669r0837l6523k5781m5504N213
$$ 918969 998915 1081595 1105799 1108164 1141076 1133875 1053206 962369 925846 900065 854561 859774
18029H59774j4758n1395k7581r1575n4859L070M7768p1732m1005j6970l6090k4514
$$ 859774 845016 793621 766040 674465 619606 622676 670444 598712 557707 540737 504647 480133
18017D80133J5852m3513k7093K5072K3596k5913M9881n088L8389M1609m898q791
$$ 480133 495985 452472 425379 450451 474047 448134 498015 492927 531316 572925 568027 559236
18005E59236J0042o8380j4914M0059k9690n8746k1504L0685O585p343j5865N9070
$$ 559236 569278 500898 485984 526043 496353 437607 416103 446788 453373 446030 430165 489235
17993D89235K8460p0798l6265K7891J8840l0943j1693j6036k0777N9344K3845
$$ 489235 517695 446897 410632 438523 457363 426420 414727 398691 377914 437258 461103
17982D61103J0336k0869J8882K2428Q268J1548L4278l7863q0656k2906j4158j7908
$$ 461103 471439 450570 469452 491880 500148 511696 545974 508111 427455 404549 390391 372483
17970C72483m0348Q46j3033j2832k9532l5805J9769k783o698n1571N346N9410
$$ 372483 332135 332981 319948 307116 277584 241779 261548 258765 252067 200496 205842 265252
17958B65252J6152m3889k7346k3651J00403K7410m6745m2790n1719N443N0756
$$ 265252 281404 237515 210169 186518 286921 314331 267586 224796 173077 178520 229276
17947B29276O5363N0842k7445j0072J4032j2192m9817q6038K298k5904m0030N1835
$$ 229276 294639 345481 318036 307964 321996 309804 259987 173949 176247 150343 110313 162148
17935A62148K0263q14J9183M7313J7028k7477l2774K796q053m6084J4521J09644
$$ 162148 182411 181597 200780 248093 265121 237644 204870 207666 199613 153529 168050 277694
17923B77694K2642m1539k7059j0418N021l850M8831J6405m9061l994J9924k7170
$$ 277694 300336 258797 231738 221320 226341 222491 271322 287727 238666 234672 254596 227426
17911B27426m9352N133j3884k7554l9104k3524M6191K4758P4832j9224p0798n9791
$$ 227426 178074 183207 169323 141769 102665 79141 125332 150090 224922 205698 134900 75109
17899G5109M030M7552Q0958P449K426m9521j1367r13k488j5392k8430K3456J8068
$$ 75109 79139 126691 207649 215098 217524 168003 156636 155723 153235 137843 109413 132869 150937
17886A50937j0812k2297R254k684k3725q715J0609j4388m7199j3334l121N4743
$$ 150937 140125 117828 127082 124398 100673 91958 102567 88179 40980 27646 24525 79268
17874G9268L1747m1946J0888M3417j3810n5970K0979K6246l0212O2689Q5398j3008
$$ 79268 111015 69069 79957 123374 109564 53594 74573 100819 70607 133296 218694 205686
17862B05686n2725J3904L1133R991m7742l4699m9515M450m9911J4749K3560k201
$$ 205686 152961 166865 197998 207989 160247 125548 76033 80483 30572 45321 68881 66680
17850F6680O143j4870k8015L101M2536L3115j3428L6369k3706j3474q933K2224
$$ 66680 72823 57953 29938 33039 75575 108690 95262 131631 107925 94451 85518 107742
17838A07742M2307J0827n8517m3046m0258L4528J0222j6068K7012J9986L2408
$$ 107742 150049 160876 102359 59313 19055 53583 63805 47737 74749 94735 127143
17827A27143J3490k8661l6621o095j1378K7818l6439k9633n0800k854L7747o501
$$ 127143 140633 111972 75351 69256 57878 85696 49257 19624 -31176 -34030 3717 -2784
17815b784m752P7332Q048o5206l1N0999k572k6207L87q975N7426K1768l8576k9096
$$ -2784 -7536 69796 77844 12638 12607 63606 61034 34827 35214 26239 83665 105433 66857 37761
17801C7761n135m9107k054k473K1040k5842k5306O7575N7437l8437n8936p4066
$$ 37761 32626 -16481 -18535 -21008 32 -25810 -51116 16459 73896 35459 -23477 -97543
17789i7543k3126Q6327K5848J6391j944k1086L9040j3854q922M5020N8035r574
$$ -97543 -120669 -34342 -8494 7897 5953 -15133 23907 10053 1131 46151 104186 94612
17777I4612r2716l9072k3519L1278K3817M0403N9485k1562n350l0186m939j697
$$ 94612 1896 -37176 -60695 -29417 -5600 34803 94288 72726 67376 37190 32251 30554
17765C0554L8376K2804j7930l5288m7320O7962N5199l8379O412K7503J8828l4971
$$ 30554 68930 91734 73804 38516 -8804 59158 114357 75978 82390 109893 128721 93750
17753I3750j4782L4926N9162M9992j9690j02384p6453o6091K89M4691l0292k2559
$$ 93750 78968 113894 173056 223048 203358 100974 24521 -41570 -41281 3410 -26882 -49441
17741d9441J1856m7548J576J3973J6533n556J1217J9474J0908L9912L5132j4806
$$ -49441 -37585 -85133 -83557 -69584 -53051 -58607 -47390 -27916 -17008 22904 58036 43230
17729D3230N376P279k4327k9775m8465R8191Q0146l7190p420m6662K820K5120
$$ 43230 48606 55885 31558 1783 -46682 51509 131655 94465 87045 40383 43203 68323
17717F8323K6334L1424m4336n8363l7624N0980K3570L7349L1888j4308j4618q344
$$ 68323 94657 126081 81745 23382 -14242 36738 60308 97657 129545 115237 100619 92275
17705I2275J6366N1535m0704l3777L4771O9522L2376J6656N2415n128m2886l9139
$$ 92275 108641 160176 119472 85695 120466 189988 222364 239020 291435 286307 243421 204282
17693B04282J6983k9732o337L928o4534j8507J8896O3081J4308j8481p0592n080
$$ 204282 221265 191533 185196 189124 124590 106083 124979 188060 202368 183887 113295 108215
17681A08215L4748O2908K8074M1374j6344l9621j6951L1930k3986J5532K0137
$$ 108215 142963 205871 233945 275319 258975 219354 202403 234333 210347 225879 246016
17670B46016K5486L4861N349J7848k246k7893N3398L1455n9760k9626j9504n7425
$$ 246016 271502 306363 311712 329560 327314 299421 352819 384274 324514 294888 275384 217959
17658B17959L442p457j8424L5218R506p2103Q64K6688L099J8642j2671p514P3769
$$ 217959 221401 213944 195520 230738 240244 168141 169005 195693 198792 217434 204763 197249 271018
17645B71018M3379M5877L1850K6472l8929r089l3432q8520p4325J070N3095M1563
$$ 271018 314397 360274 392124 418596 379667 370578 337146 248626 174301 175371 228466 270029
17633B70029j2937o0106m2568l1143k1721L5631n6443r2899K1750O5595L2779
$$ 270029 257092 196986 154418 123275 101554 137185 80742 -12157 9593 75188 107967
17622A07967j4404J6387L6011J9013l6978j3640K4803K5098J7465j0185J4791
$$ 107967 93563 109950 145961 164974 127996 114356 139159 164257 181722 171537 186328
17611A86328l6270n3174k2825J9093l0667j6511M0322K7906j2279p5372p8789
$$ 186328 150058 96884 74059 93152 62485 45974 86296 114202 101923 26551 -52238
17600e2238J0819O0679N2605n944l1810l5246j4290o1173L6133N8398J128M0K3144
$$ -52238 -41419 19260 71865 65921 34111 -1135 -15425 -76598 -40465 17933 19061 19101 42245
17587D2245m0639j8911J0738Q839O3219M8125m2389P52m2842j1045j6172J0310
$$ 42245 1606 -17305 -6567 2272 65491 113616 71227 71979 29137 18092 1920 12230
17575A2230O693j5747J9236K2759L63j7691L0807J0751l813q480L2316J3198j7183
$$ 12230 18923 3176 22412 45171 45534 27843 58650 69401 65588 57108 89424 102622 85439
17562H5439L721R562N4700K8488q7958l5584J4955J817K0063j3785J5990K4142
$$ 85439 89160 98722 153422 181910 93952 58368 73323 75140 95203 81418 97408 121550
17550A21550k4175k4928p652r603m8036P206R1469L4936L4451n745p0624o925
$$ 121550 97375 72447 64795 55192 7156 14362 105831 140767 175218 169473 98849 91924
17538I1924j2371m4631J2989J1619M231k4006n3914j8373j4978o9759L1417K7464
$$ 91924 79553 34922 47911 59530 63761 39755 -14159 -32532 -47510 -117269 -85852 -58388
17526e8388P079K2697k5650k7982j1054J7561L8143L0042M0177J4259J6798k6060
$$ -58388 -51309 -28612 -54262 -82244 -93298 -75737 -37594 -7552 32625 46884 63682 37622
17514C7622P03o3495k5122N8869O45N869L306r138K1539J488K3486k6265l3152
$$ 37622 38325 -25170 -50292 8577 9222 15091 18397 9259 30798 32286 55772 29507 -3645
17501c645k0535j7608J971k0119J3902M7607K1085K392k5062O018O7183O12j6939
$$ -3645 -24180 -41788 -39817 -59936 -46034 1573 22658 25050 -12 6006 73189 73801 56862
17488E6862l4527k0932J5530j5043k022K8191L4454j481j173l658j4952J4355
$$ 56862 22335 1403 16933 1890 -132 28059 62513 61032 59859 56201 41249 55604
17476E5604L4122j605o2967l2452M343K1j1764K4239r230j830J259l226k7594
$$ 55604 89726 88121 25154 -7298 -2955 -2934 -14698 9541 311 -1519 -260 -3486 -31080
17463c1080r254m2791L2701J03778J9634k5454l298k8990j4149L5348J7063J9350
$$ -31080 -40334 -83125 -50424 53354 72988 47534 44236 15246 1097 36445 53508 72858
17451G2858L4526l9455n3207L3690j7916m0430M5347J08833P9629J1552K0674
$$ 72858 107384 67929 14722 48412 30496 -9934 35413 144246 223875 235427 256101
17440B56101N2759M5038Q8024K0749k4389m4631n7409n7061j19036m6227L6107
$$ 256101 308860 353898 441922 462671 438282 393651 336242 279181 160145 113918 150025
17429A50025J0753m6964m1492K2038j8171j9861J9245L6883q382J1199q3606p6249
$$ 150025 160778 113814 72322 94360 76189 56328 75573 112456 104074 115273 31667 -44582
17417d4582J5905J07061L9303j1073p2104l2173m47j545J4824m9383L7662J4707
$$ -44582 -28677 78384 117687 106614 34510 2337 1890 345 15169 -34214 3448 18155
17405A8155J5120n279m8302J047M5208Q0808O82j1319q2507j727J6490j6320o7788
$$ 18155 33275 27996 -20306 -19259 25949 106757 107439 96120 13613 11886 28376 12056 -55732
17392e5732J6777O3766J2809O856k3351o9311k1324L0261O4729L0572L771n8591
$$ -55732 -38955 24811 37620 44476 21125 -48186 -69510 -39249 25480 56052 59823 1232
17380A232k0423R311n923L1022p8396J3376M4979M9700J2870j0067j3905k5155
$$ 1232 -19191 -9880 -15803 15219 -63177 -49801 -4822 44878 57748 47681 33776 8621
17368H621K8709k1371m4952j1422K0499k1672M2073j3254m1624J4993K5986M1161
$$ 8621 37330 15959 -28993 -40415 -19916 -41588 485 -12769 -54393 -39400 -13414 27747
17356B7747L2853K9072Q630l1706K6127n5275p0667J6709m645j0128j377k3262
$$ 27747 60600 89672 98302 66596 92723 37448 -33219 -16510 -21155 -31283 -32660 -55922
17344e5922L7679K0544k205M2340K8283k9745n1990l0890n5220Q991L8004J5543
$$ -55922 -18243 2301 96 42436 70719 40974 -11016 -41906 -97126 -88135 -50131 -34588
17332c4588M9482O9211k3659j0440j2597k9784m5452M445o456k1473J1261k2840
$$ -34588 14894 84105 60446 50006 37409 7625 -37827 -33382 -39838 -61311 -50050 -72890
17320g2890K1679K6946j3823k3948R197J8016J7416R374M0272l4245l4533J1746
$$ -72890 -51211 -24265 -38088 -62036 -52839 -34823 -17407 -8033 32239 -2006 -36539 -24793
17308b4793j4525q000q227o3931n985J18011Q1683o8323j25020k2940N3182o341
$$ -24793 -39318 -47318 -55545 -119476 -125461 -7450 74233 5910 -119110 -142050 -88868 -95209
17296i5209j2935N4668N1479k4877l968M6289l6051K7753M2498k3335l1961K4524
$$ -95209 -108144 -53476 -1997 -26874 -30842 15447 -20604 7149 49647 26312 -5649 18875
17284A8875J0761n3338j0554j2537O484M0269O1536R16L04n610n4502J1061M728
$$ 18875 29636 -23702 -34256 -46793 -40309 -40 61496 62412 62716 57106 2604 13665 18393
17271A8393o1654r304K2755k8211m4130J7963M1427O8550M9591j5997o1121k7358
$$ 18393 -43261 -52565 -29810 -58021 -102151 -84188 -42761 25789 75380 59383 -1738 -29096
17259b9096L6531J5217p542j0931M668j3774l1832M7536R631o3491k0989K8433
$$ -29096 7435 22652 15110 4179 8847 -4927 -36759 10777 20408 -43083 -64072 -35639
17247c5639Q988Q453K5252j0706M334o068j2546n1350Q3495N7265K3635n2997
$$ -35639 -26651 -18198 7054 -3652 682 -5386 -17932 -69282 14213 71478 95113 42116
17235D2116j9205n0175L5044M2906M5209l363l4456N264m1911M0q830j1394J2569
$$ 42116 22911 -27264 7780 50686 95895 92532 58076 63340 21429 21469 12639 1245 13814
17222A3814n502L7069K7784j0141j8759q053l8252j8598m9999K1892J6675K1245
$$ 13814 8312 45381 73165 63024 44265 36212 -2040 -20638 -70637 -48745 -32070 -10825
17210a0825o5339J126K4373M4363J1046L4425K1744J8999R069P512k7414l2932
$$ -10825 -76164 -75038 -50665 -6302 4744 39169 60913 79912 88981 96493 69079 36147
$$ [...]
##END NTUPLES=NMR SPECTRUM
##END=
