##TITLE=Analysis number 314971
Compound Code cc 41814
Book Reference 414/130/8
Project Code adrs
Chemist Name mattw
##JCAMPDX= 6.0         $$ Bruker NMR JCAMP-DX V2.0
##DATA TYPE= NMR SPECTRUM
##DATA CLASS= NTUPLES
##ORIGIN= Bruker BioSpin GmbH
##OWNER= NMR
$$ XWIN-NMR		Version 3.5
$$ Tue Nov  1 09:27:21 2005 GMT Standard Time (UT+0h)  MAYBRIDGE\NMR@NMR_250MHZ
##.OBSERVE FREQUENCY= 250.131544655141
##.OBSERVE NUCLEUS= ^1H
##.ACQUISITION MODE= SIMULTANEOUS (DQD)
##.ACQUISITION SCHEME= undefined
##.AVERAGES= 16
##.DIGITISER RES= 18
##SPECTROMETER/DATA SYSTEM= dpx250
##.PULSE SEQUENCE= zg30
##.SOLVENT NAME= CDCl3
##.SHIFT REFERENCE= (INTERNAL, CDCl3, 0, 16.4464)
##AUDIT TRAIL= $$ (NUMBER, WHEN, WHO, WHERE, WHAT)
$$ ##TITLE= Audit trail, XWIN-NMR		Version 3.5
$$ ##JCAMPDX= 5.01
$$ ##ORIGIN= Bruker BioSpin GmbH
$$ ##OWNER= NMR
$$ C:\u/data/dgb/nmr/ADRS/11700/pdata/1/auditp.txt
$$ ##AUDIT TRAIL=  $$ (NUMBER, WHEN, WHO, WHERE, WHAT)
(   1,<2005-11-01 09:26:59.47 +000>,<MAYBRIDGE\NMR>,<NMR_250MHZ>,
      <created by zg, POWCHK disabled, PULCHK disabled
       configuration hash MD5:
       62 19 C7 07 E1 42 D1 B7 37 6C 3D D0 77 39 F9 E6
       data hash MD5: 64K
       C2 31 27 C4 10 CD 7A B0 C0 DA 6F A5 A6 BF 99 6F>)
(   2,<2005-11-01 09:27:12.57 +000>,<MAYBRIDGE\NMR>,<NMR_250MHZ>,
      <Start of raw data processing
       ef LB = 0.3 FT_mod = 6 PKNL = 1 SI = 32K 
       data hash MD5: 32K
       B8 78 11 35 B0 04 12 41 F7 2F C5 FD 05 AD 24 D5>)
(   3,<2005-11-01 09:27:14.44 +000>,<MAYBRIDGE\NMR>,<NMR_250MHZ>,
      <apk 
       data hash MD5: 32K
       95 D1 28 8D 98 59 8B FA D0 88 0E EC C6 43 2D EA>)
(   4,<2005-11-01 09:27:15.10 +000>,<MAYBRIDGE\NMR>,<NMR_250MHZ>,
      <abs ABSG = 5 
       data hash MD5: 32K
       1A 78 A7 C6 29 A5 E2 73 59 22 D5 AE B2 AA 0E 9C>)
$$ ##END=
$$ 
$$ hash MD5
$$ 1F C5 2F B4 F1 45 0D 68 24 45 84 4A A0 0B 7D 08
##$RELAX= 
##$RELAX= 
##$RELAX= 
##$RELAX= 
##$RELAX= 
##$RELAX= 
##$RELAX= 
$$ Bruker specific parameters
$$ --------------------------
##$DU= <C:\u>
##$EXPNO= 11700
##$NAME= <ADRS>
##$PROCNO= 1
##$TYPE= <nmr>
##$USER= <dgb>
##$AMP= (0..31)
100 100 100 100 100 100 100 100 100 100 100 100 100 100 100 100 100 100 
100 100 100 100 100 100 100 100 100 100 100 100 100 100 
##$AQSEQ= 0
##$AQ_mod= 3
##$AUNM= <au_zg>
##$AUTOPOS= <4 >
##$BF1= 250.13
##$BF2= 250.13
##$BF3= 250.13
##$BF4= 250.13
##$BF5= 500.13
##$BF6= 500.13
##$BF7= 500.13
##$BF8= 500.13
##$BYTORDA= 1
##$CFDGTYP= 0
##$CFRGTYP= 5
##$CHEMSTR= <none>
##$CNST= (0..31)
1 1 145 1 1 1 1 1 1 1 1 1 1 1 1 1 1 1 1 1 1 1 1 1 1 1 1 1 1 1 1 1 
##$CPDPRG= <>
##$CPDPRG1= <>
##$CPDPRG2= <>
##$CPDPRG3= <>
##$CPDPRG4= <mlev>
##$CPDPRG5= <mlev>
##$CPDPRG6= <mlev>
##$CPDPRG7= <mlev>
##$CPDPRG8= <mlev>
##$CPDPRGB= <>
##$CPDPRGT= <>
##$D= (0..31)
0 1 0 0 0 0 0 0 0 0.06 0 0 0 0 0 0 0.0002 0 0 0 0 0 0 0 0 0 0 0 0 0 0 
0 
##$DATE= 1130837218
##$DBL= (0..7)
120 120 120 120 120 120 120 120 
##$DBP= (0..7)
150 150 150 150 150 150 150 150 
##$DBP07= 0
##$DBPNAM0= <>
##$DBPNAM1= <>
$$ [...]
##$SUBNAM8= <"">
##$SUBNAM9= <"">
##$SW= 20.6930455092707
##$SWIBOX= (0..15)
0 0 3 0 0 0 0 0 0 0 0 0 0 0 0 0 
##$SW_h= 5175.983436853
##$TD= 65536
##$TD0= 1
##$TE= 295.16
##$TE2= 300
##$TE3= 300
##$TEG= 300
##$TL= (0..7)
0 120 120 120 120 120 120 120 
##$TP= (0..7)
150 150 150 150 150 150 150 150 
##$TP07= 0
##$TPNAME0= <>
##$TPNAME1= <>
##$TPNAME2= <>
##$TPNAME3= <>
##$TPNAME4= <>
##$TPNAME5= <>
##$TPNAME6= <>
##$TPNAME7= <>
##$TPOAL= (0..7)
0.5 0.5 0.5 0.5 0.5 0.5 0.5 0.5 
##$TPOFFS= (0..7)
0 0 0 0 0 0 0 0 
##$TUNHIN= 0
##$TUNHOUT= 0
##$TUNXOUT= 0
##$USERA1= <user>
##$USERA2= <user>
##$USERA3= <user>
##$USERA4= <user>
##$USERA5= <user>
##$V9= 5
##$VALIST= <valist>
##$VCLIST= <CCCCCCCCCCCCCCC>
##$VD= 0
##$VDLIST= <DDDDDDDDDDDDDDD>
##$VPLIST= <PPPPPPPPPPPPPPP>
##$VTLIST= <TTTTTTTTTTTTTTT>
##$WBST= 1024
##$WBSW= 4
##$XGAIN= (0..3)
0 0 0 0 
##$XL= 0
##$YL= 0
##$YMAX_a= 607419
##$YMIN_a= -340554
##$ZGOPTNS= <>
##$ZL1= 120
##$ZL2= 120
##$ZL3= 120
##$ZL4= 120
##$ABSF1= 16.44642
##$ABSF2= -4.246752
##$ABSG= 5
##$ABSL= 3
##$ALPHA= 0
##$AQORDER= 0
##$ASSFAC= 0
##$ASSFACI= 0
##$ASSFACX= 0
##$ASSWID= 0
##$AUNMP= <proc_1d>
##$AZFE= 0.1
##$AZFW= 0.1
##$BCFW= 0
##$BC_mod= 0
##$BYTORDP= 0
##$COROFFS= 0
##$CY= 12.5
##$DATMOD= 1
##$DC= 0
##$DFILT= <>
##$DTYPP= 0
##$F1P= 14.0000005364418
##$F2P= -0.99999901652339
##$FCOR= 0.5
##$FTSIZE= 32768
##$FT_mod= 6
##$GAMMA= 0
##$GB= 0
##$INTBC= 1
##$INTSCL= 1
##$ISEN= 128
##$LB= 0.3
##$LEV0= 0
##$LPBIN= 0
##$MAXI= 10000
##$MC2= 0
##$MEAN= 0
##$ME_mod= 0
##$MI= 0
##$NCOEF= 0
##$NC_proc= -6
##$NLEV= 6
##$NOISF1= 0
##$NOISF2= 0
##$NSP= 0
##$NTH_PI= 0
##$NZP= 0
##$OFFSET= 16.44642
##$PC= 1
##$PHC0= 77.78823
##$PHC1= 0.06088134
##$PH_mod= 1
##$PKNL= yes
##$PPARMOD= 0
##$PSCAL= 4
##$PSIGN= 0
##$REVERSE= no
##$SF= 250.130018903845
##$SI= 32768
##$SIGF1= 0
##$SIGF2= 0
##$SINO= 400
##$SIOLD= 32768
##$SREGLST= <1H.CDCl3>
##$SSB= 0
##$STSI= 32768
##$STSR= 0
##$SW_p= 5175.98343685301
##$SYMM= 0
##$S_DEV= 0
##$TDeff= 65536
##$TDoff= 0
##$TI= <Analysis number 999999
Compound Code 99
Book Reference 9
Project Code 9>
##$TILT= no
##$TM1= 0
##$TM2= 0
##$TOPLEV= 0
##$USERP1= <user>
##$USERP2= <user>
##$USERP3= <user>
##$USERP4= <user>
##$USERP5= <user>
##$WDW= 1
##$XDIM= 32768
##$YMAX_p= 523941561
##$YMIN_p= -719420
$$ End of Bruker specific parameters
$$ ---------------------------------
##NTUPLES= NMR SPECTRUM
##VAR_NAME=  FREQUENCY,     SPECTRUM/REAL,   SPECTRUM/IMAG
##SYMBOL=    X,             R,               I
##VAR_TYPE=  INDEPENDENT,   DEPENDENT,       DEPENDENT
##VAR_FORM=  AFFN,          ASDF,            ASDF
##VAR_DIM=   32768,         32768,           32768
##UNITS=     HZ,            ARBITRARY UNITS, ARBITRARY UNITS
##FACTOR=    0.157963299565203, 1,           1
##FIRST=     4113.74351297655, 0,            0
##LAST=      -1062.23992387646, 0,           0
##MIN=       -1062.23992387646, -719420,     0
##MAX=       4113.74351297655, 523941561,    0
$$ Real data points
##PAGE= N=1
##DATA TABLE= (X++(R..R)), XYDATA
$$ [...]
25630d6376Q2183M1375Q9045J01024p0237j643j75357k1000K533Q7183N2423k8127
$$ -46376 35807 77182 166227 267251 197014 195371 20014 -986 1547 88730 141153 113026
25618A13026J09815O4535m5360k8352l9911n4580j49770k12536m8178J48689N4187
$$ 113026 222841 287376 242016 213664 173753 119173 -30597 -243133 -291311 -142622 -88435
25607h8435P5454k0092K1062q6389L1060k8286m1441P768P6390j9373J10701K4028
$$ -88435 -12981 -33073 -12011 -98400 -67340 -95626 -137067 -129299 -52909 -72282 38419 62447
25595F2447o2046L2832R5752J1203Q1826q511p2096N873p3570J4953k08781j85920
$$ 62447 401 33233 128985 140188 222014 213503 141407 147280 73710 88663 -120118 -306038
25583c06038J19115R2759q067k0145q3654j8826Q8046M8936l5870n7813N8210
$$ -306038 -186923 -94164 -102231 -122376 -206030 -224856 -136810 -87874 -123744 -181557 -123347
25572a23347J19502m6478j1694P7131J24212J12668P0447j19775j27219j73343
$$ -123347 -3845 -50323 -62017 15114 139326 251994 322441 202666 75447 -97896
25562i7896l6958m6708m0867r1872Q0426j6072J9116L0896J36741J17890R8364
$$ -97896 -134854 -181562 -222429 -314301 -233875 -249947 -230831 -199935 -63194 54696 153060
25551A53060k540j13164l0961J0137L9671P0565J6802n7261k11667l9143J35500
$$ 153060 150520 37356 6395 16532 56203 126768 143570 86309 -125358 -164501 -29001
25540b9001K27903P6169k5802M5720k2299j49514j86254J48946J37857o8227k40738
$$ -29001 198902 275071 249269 294989 272690 123176 -63078 85868 223725 155498 -85240
25529h5240M5123J03294J35535q9349j28834n980N9094P3216R4724L1792l2587
$$ -85240 -40117 63177 198712 109363 -19471 -25451 33643 106859 201583 233375 200788
25518B00788j34789K2908L5430Q2019k6537j52155n8916J30593J89598m6219p5911
$$ 200788 65999 88907 124337 206356 179819 27664 -31252 99341 288939 242720 166809
25507A66809r4284r7558J05413J24997o7056j22519n8186K0127m0918q9557o196
$$ 166809 72525 -25033 80380 205377 138321 15802 -42384 -22257 -63175 -152732 -158928
25496a58928J16759K4939J1412J8482M1294J728q6043K551N5575M1657l3223r0092
$$ -158928 -42169 -17230 -5818 12664 53958 55686 -30357 -27806 27769 69426 36203 -53889
25484e3889Q4788l7932N5737j1732k9543N4561l6137n0163L6961O9831k8064k5099
$$ -53889 30899 -7033 48704 36972 7429 61990 25853 -24310 12651 82482 54418 29319
25472B9319R1949J96213k87606k13339Q3808J94928N4674M6017o2508j52649p8958
$$ 29319 121268 317481 29875 -183464 -99656 95272 149946 195963 133455 -19194 -98152
25461i8152r2133J02280O4266J5075J3447l2671P7730J7870j5918L4630M9691
$$ -98152 -190285 -88005 -23739 -8664 4783 -27888 49842 67712 51794 86424 136115
25450A36115q2093O3441L0233L0127J0786O387r0556l0979k9377K0228J96017
$$ 136115 54022 117463 147696 177823 188609 194996 104440 73461 44084 64312 260329
25439B60329K0582j24202j06107j52218K4758M6172R4607J75522O9064q8953j58402
$$ 260329 280911 156709 50602 -101616 -76858 -30686 63921 239443 308507 219554 61152
25428F1152k8500m8139j06155M9564P7037Q3980M9089O615j7635k05724k4227
$$ 61152 32652 -15487 -121642 -72078 4959 88939 138028 144643 127008 -78716 -102943
25417a02943R5799K20861J00828j37324j8247j26914K5958J0826K7475l8809K3504
$$ -102943 -7144 213717 314545 177221 158974 32060 58018 68844 96319 57510 81014
25406H1014J59877m0006k1228r0732J74894J11574p4816q7328k36577j04912M2547
$$ 81014 240891 200885 179657 88925 263819 375393 300577 213249 -23328 -128240 -85693
25395h5693J02476O4460n6684K3813j0729n1838j12144k3655K06402K55747M1298
$$ -85693 16783 81243 24559 48372 37643 -14195 -126339 -149994 56408 312155 353453
25384C53453j7356j68800M8199M9962Q185P9991j14899q8928l3499q4015j25952
$$ 353453 336097 167297 215496 265458 273643 353634 238735 149807 116308 32293 -93659
25373i3659J9750J07285n6657P0136J31699Q4513p1917j65299j51321p6357J16547
$$ -93659 -73909 33376 -23281 46855 178554 263067 191150 25851 -125470 -201827 -85280
25362h5280q1362Q9949J72602p7353R0224j716j23955L4610L3631j88261n8389
$$ -85280 -166642 -76693 95909 18556 108780 107064 -16891 17719 51350 -136911 -195300
25351a95300J72669m7849R037N7671k6553P4895j2047K1378Q2885k2805q1064
$$ -195300 -22631 -70480 -61443 -3772 -30325 44570 32523 53901 136786 113981 32917
25340C2917m2949j5058m0595j05471o3777Q9619J46385P5096o844m4060m9827
$$ 32917 -10032 -25090 -65685 -171156 -234933 -145314 1071 76167 69323 25263 -24564
25329b4564k8018M6944J44519J5349L1911J56073q412j31512j84371L8269K57133
$$ -24564 -52582 -5638 138881 154230 186141 342214 333802 202290 17919 56188 313321
25318C13321Q5082J9275o7151j01188o008j54568r5141N0695M9565j68j59931
$$ 313321 398403 417678 350527 249339 243331 88763 -6378 44317 93882 93714 -66217
25307f6217J62066K45916M1475p4884m5499j63320q616j17142p0157M3654J61462
$$ -66217 95849 341765 383240 308356 262857 99537 90921 -26221 -96378 -52724 108738
25296A08738p2295O0633J56019K5703j41541m8369l1461j2624R8321l0133j19026
$$ 108738 36443 97076 253095 278798 137257 88888 57427 44803 143124 112991 -6035
25285f035Q8752M3205n0975k3681K5756K1704K7125J03194j7091j87220j6751
$$ -6035 82717 125922 74947 51266 77022 98726 125851 229045 211954 24734 7983
25274G983J45960o7152l5915l3054J73122J16458r3571j05366o3122m6344k8453
$$ 7983 153943 86791 50876 17822 190944 307402 213831 108465 45343 -1001 -29454
25263b9454J05482J08651j2822m0007j3998j54044m9688l7830J74259P4381j0363
$$ -29454 76028 184679 171857 131850 117852 -36192 -85880 -123710 50549 124930 114567
25252A14567p7141Q678J0470j9339Q582p4953o2241Q076O7391o4232L4980N9493
$$ 114567 37426 46104 56574 37235 45817 -29136 -91377 -83301 -15910 -80142 -45162 14331
25240A4331J42133k7816q4590l654N6892p2441P8303p8948j28839m7907N312K43158
$$ 14331 156464 128648 44058 40404 97296 24855 103158 24210 -104629 -152536 -147224 95934
25228I5934P6662j24845k20799J4114J20159N0718o2231M5171j13764M5227N0544
$$ 95934 172596 47751 -173048 -158934 -38775 11943 -50288 -5117 -118881 -73654 -23110
25217b3110o6231K2119J70012m5385l54075J22532K04896r2485p6520O0198K52474
$$ -23110 -89341 -67222 102790 57405 -296670 -174138 30758 -61727 -138247 -78049 174425
25206A74425q723J9451n5790o4002Q3479J74126j23172p8575r1697r1065j26725
$$ 174425 165702 185153 129363 65361 148840 322966 199794 121219 29522 -61543 -188268
25195a88268M2487o0652K1430J79730J60831k23383m2077N3350J42382J56625
$$ -188268 -145781 -206433 -185003 -5273 155558 -67825 -109902 -56552 85830 242455
25185B42455o2584L2207j75318q1102m1937L0680N5917J74339J81267r4671j25479
$$ 242455 179871 212078 36760 -44342 -86279 -55599 318 174657 355924 261253 135774
25174A35774k54189P7429K3691M5528J05751q7839o8871Q2218j6959J8264j4656
$$ 135774 -118415 -40986 -17295 28233 133984 46145 -22726 59492 42533 60797 46141
25163D6141k4337j6206q8996q5294J4747Q4674L4897J3301K1787l895j34249p2283
$$ 46141 21804 5598 -83398 -168692 -153945 -69271 -34374 -21073 714 -3181 -137430 -209713
25151b09713J71446n3152M4217J10288q7645o9696k1071m4169l8708p8920N3455
$$ -209713 -38267 -91419 -47202 63086 -24559 -94255 -115326 -159495 -198203 -277123 -223668
25140b23668o2343L3963N1036R9659P5124J4629L9896L6732o4201J32026J04494
$$ -223668 -286011 -252048 -201012 -101353 -26229 -11600 28296 65028 827 132853 237347
25129B37347j56608k73005k745k4638l3624M9649J04632J77412k6516q0153m952
$$ 237347 80739 -192266 -195011 -219649 -253273 -203624 -98992 78420 51904 -28249 -33201
25118c3201l3574L515N6075m7989J09478J18516J60878R850p9916j61044p3366
$$ -33201 -66775 -63260 -7185 -55174 54304 172820 333698 343548 263632 102588 29222
25107B9222k6860R8347O398q7795P0137n6253J12673P2195O9169j7935m9893K095
$$ 29222 2362 100709 107107 19312 89449 33196 145869 218064 287233 269298 219405 221500
25095B21500O4330k6760j68967l8776J06820j06248j6445J42821o015N8483q2977
$$ 221500 285830 259070 90103 51327 158147 51899 35454 178275 172260 230743 147766
25084A47766r4609J11820L5260Q268j48362k7305P2807j1446m6341r0311j32116
$$ 147766 53157 164977 200237 208505 60143 32838 105645 94199 47858 -42453 -174569
25073a74569m7222J58344J11152N161q8528q3332m5370L7429J30628Q733L7548
$$ -174569 -221791 -63447 47705 52866 -35662 -118994 -164364 -126935 3693 12426 49974
25062D9974r298q6564j49263m9049M6712J30875P5315p3112K04374J20046j11454
$$ 49974 40676 -45888 -195151 -244200 -197488 -66613 8702 -64410 139964 260010 148556
25051A48556r0101j9193j5865j09155l2535J21481J33290r969k8757J34597p9919
$$ 148556 58455 39262 23397 -85758 -118293 3188 136478 126509 97752 232349 152430
25040A52430l5841J32751J45703J0731J9331l4665q3595o5524o3648j03600q240
$$ 152430 116589 249340 395043 405774 425105 390440 306845 241321 177673 74073 65833
25029F5833M2496J93599J36102j64840j40037l1675p7610l3517j10787M6231J72999
$$ 65833 108329 301928 438030 273190 133153 101478 23868 -9649 -120436 -74205 98794
25018I8794p087o0266N2371J45175n1248n4797K6942Q7476j41487j41832K15635
$$ 98794 91707 31441 83812 228987 177739 122942 149884 237360 95873 -45959 169676
25007A69676M0152j75781q9690l9808R4621n1163k1040L34359r699k08509j71415
$$ 169676 209828 34047 -55643 -95451 -830 -51993 -73033 261326 251627 43118 -128297
24996a28297k9810K62963M8101j06583j32134O2498N8012N1206j76252r3748J06782
$$ -128297 -158107 104856 152957 46374 -85760 -23262 34750 85956 -90296 -184044 -77262
24985g7262l3784k0182J02005J10300o8795r2861L2556J38908L3962M6704n9854
$$ -77262 -111046 -131228 -29223 81077 12282 -80579 -48023 90885 124847 171551 111697
24974A11697M7622m5575J4865j04297j0978J253r7664k2513J878J61834R2098
$$ 111697 159319 113744 128609 24312 13334 14587 -83077 -105590 -103712 58122 150220
24963A50220R3616j844j78092M2006J82362r878j28179p623J9526j40110l9402
$$ 150220 243836 241992 63900 105906 288268 278390 150211 142588 162114 22004 -17398
24952a7398L0946l7250O5174R1782N6989N6999j63059j24386J7434J55296M9543
$$ -17398 13548 -23702 41472 133254 190243 247242 84183 -40203 -22769 132527 182070
24941A82070j04569q681j0360K2275j586p0646L397k6218m4545L7678L7089m764
$$ 182070 77501 68820 58460 80735 79149 8503 11900 -14318 -58863 -21185 15904 11140
24929A1140J6103j39132R8907L9475j7735k764J80300k3947j67053l4614Q5653
$$ 11140 27243 -111889 -12982 26493 8758 5994 186294 162347 -4706 -39320 46333
24918D6333N0211p1961j12907p3928J20376J18029j25374o2436L7512J75053L6714
$$ 46333 96544 24583 -88324 -162252 -41876 76153 -49221 -111657 -74145 100908 137622
24907A37622J13729j28390k07604q8305R331J14123J55740j12744j27345k2524
$$ 137622 251351 122961 -84643 -172948 -163617 -49494 106246 -6498 -133843 -156367
24897a56367l2629J6145J9827J49178P6892r5824L6006Q6796K3380r067j57895
$$ -156367 -188996 -172851 -153024 -3846 73046 -22778 13228 100024 123404 114337 -43558
24886d3558k1174R7414r5104j94349K6961O8126l4642P9332J11135P7064k34286
$$ -43558 -64732 32682 -62422 -256771 -229810 -161684 -196326 -116994 -5859 71205 -163081
24875a63081q8254J43530J47777J40818r0449j61798j39990o05P8988M5734k0774
$$ -163081 -251335 -107805 39972 180790 90341 -71457 -211447 -212052 -133064 -87330 -108104
24864a08104j4668O6685O723j2821J29490Q4791o9275J5079J02791j9345m2192
$$ -108104 -122772 -56087 -49364 -62185 67305 152096 82821 97900 200691 181346 139154
24853A39154N3293O8549j88970j89662o1385M5188q9451O8139J71104j29767q6981
$$ 139154 192447 260996 72026 -117636 -179021 -133833 -223284 -155145 15959 -113808 -200789
24842b00789J47910J70633j14458j85119J07383O6359N9890n8727o8759m5048
$$ -200789 -52879 117754 3296 -181823 -74440 -8081 51809 -6918 -75677 -120725
24832a20725k0039p3421K1558l1794M920K7806j11431Q5664O6131r68J06515Q1329
$$ -120725 -140764 -214185 -192627 -224421 -219501 -191695 -303126 -217462 -151331 -152299 -45784 35545
24820C5545m6721j05908R7362m806l3285k01544J02043P7237o8398p8454J72155
$$ 35545 -11176 -117084 -19722 -24528 -57813 -259357 -157314 -80077 -148475 -226929 -54774
24809e4774o5159l0769K75121J93597o807q0058k23j17562p4847N0595k0015n107
$$ -54774 -119933 -150702 124419 318016 311209 231151 230928 113366 38519 89114 69099 63992
24797F3992j26210j8923J79124J90483R7237j29395j51549j28691q3640P1316
$$ 63992 -62218 -81141 97983 288466 385703 256308 104759 -23932 -107572 -36256
24787c6256J55650j0149j3966J09886M0914n3970l9016m2798k6896J11882K8718
$$ -36256 119394 109245 95279 205165 246079 192109 153093 110295 83399 195281 223999
24776B23999j51867j22877m7700R1524Q7604J19486R4714J18142m466k44062j04745
$$ 223999 72132 -50745 -98445 -6921 80683 200169 294883 413025 408559 164497 59752
24765E9752K7693R7791l7368M8471J0768N8949K1698j81827k8283L3030j44900
$$ 59752 87445 185236 147868 196339 207107 266056 287754 105927 77644 110674 -34226
24754c4226p1858j57134J34211J78111k4403L5440Q4515M3904m2326K2427j63104
$$ -34226 -106084 -263218 -129007 49104 24701 60141 144656 188560 146234 168661 5557
24743E557k14355m2565Q7837Q5516L6555n5090n9138p5224j58293J21941J49180
$$ 5557 -208798 -251363 -163526 -78010 -41455 -96545 -155683 -230907 -389200 -267259 -118079
24732a18079j3179m8220M057J25139m5397j17086l0654J34449K00033o5415N8133
$$ -118079 -131258 -179478 -175421 -50282 -95679 -212765 -243419 -108970 91063 25648 83781
24721H3781j5258m2729j26701q8842M2921K32548J44896j69385o8442L7064j25425
$$ 83781 68523 25794 -100907 -189749 -146828 85720 230616 61231 -7211 29853 -95572
24710i5572Q2072M5598l5328m0344m549J13570R0092J5562q6707j7429J02j35188
$$ -95572 -13500 32098 -3230 -43574 -48123 65447 155539 171101 84394 66965 67067 -68121
24698f8121J14522O0815j39823j7742p3310j24966J54448L8552o4682M0679P7232
$$ -68121 46401 107216 -32607 -50349 -123659 -248625 -94177 -55625 -120307 -79628 -2396
24687b396J21234O7045L689O2473r0253m892j7826R3129j65815q6612J2781L2048
$$ -2396 118838 185883 189572 252045 161792 156900 139074 232203 66388 -20224 -7443 24605
24675B4605m8941k7805J00707O7023j8844k0969Q0736l208J9817J2314n7756M8966
$$ 24605 -24336 -52141 48566 115589 96745 75776 156512 153304 173121 185435 127679 176645
24663A76645L3266j10359n3693p5040J9917N2110r1914O9309K07097N4281r6692
$$ 176645 209911 99552 45859 -29181 -9264 42846 -49068 20241 227338 281619 184927
24652A84927k0817n6098o1799Q7989p1985O0598j21194j55742n8070M9462K5325
$$ 184927 164110 108012 46213 134202 62217 122815 1621 -154121 -212191 -162729 -137404
24641a37404N2808J49109J8828k0723j883N0057o2156r2494J7484m2179j24080
$$ -137404 -84596 64513 83341 62618 60735 110792 48636 -43858 -26374 -68553 -192633
24630a92633J0121l6772O436J85982J39381j25321r1921m0824R2702K29566J07007
$$ -192633 -182512 -219284 -212848 -26866 112515 -12806 -104727 -145551 -52849 176717 283724
24619B83724j589p0820l8671m6292q8895j1177p0614m5212j9295J21593j24052
$$ 283724 282135 211315 172644 126352 37457 26280 -44334 -89546 -108841 12752 -111300
24608a11300o1337K1730j678L6677Q041M0445r7481O577J05791K18150P581j10518
$$ -111300 -172637 -150907 -152585 -115908 -107867 -67422 -164903 -158326 -52535 165615 173196 62678
24596F2678l6729m8619j0903j8997K3006o0989j45395R7678k6056l0533p9540
$$ 62678 25949 -22670 -33573 -52570 -29564 -90553 -235948 -138270 -164326 -194859 -274399
24585b74399J04939R0450j25040J4074Q1390O8372R9847n6282l7767J29535l4108
$$ -274399 -169460 -79010 -204050 -189976 -108586 -40214 59633 3351 -34416 95119 61011
24574F1011j4766n2285j57837r5021p1845J44859J6319m5268Q0006J9655P3788
$$ 61011 46245 -6040 -163877 -258898 -330743 -185884 -169565 -214833 -134827 -115172 -41384
24563d1384L9179N5301P608L3526p6253j78292n7651n5666m9313q9850J47786
$$ -41384 -2205 53096 60704 94230 17977 -160315 -217966 -273632 -322945 -412795 -265009
24552b65009J60687J4104Q9346L8749q8142l3026P0045J23170J62924k2625q2294
$$ -265009 -104322 -90218 -872 37877 -50265 -83291 -13246 109924 272848 250223 167929
24541A67929j2684l1941R3641r2000q0698J2899k7237q5948k51119O651J30746
$$ 167929 155245 123304 216945 124945 44247 57146 29909 -56039 -307158 -300507 -169761
24530a69761k0893l9854N1913N017m2842N7230M9685J29792p883J3258L442M94
$$ -169761 -190654 -230508 -178595 -173578 -216420 -159190 -109505 20287 12404 25662 29104 29598
24518B9598O9678P1378r789n9235j61421o6718o7958R5546J29335k0123o9991
$$ 29598 99276 170654 160865 101630 -59791 -126509 -194467 -98921 30414 10291 -59700
24507e9700K4877N3678n4870j06329P3420R9579R0463O7671o9376K2885j65538
$$ -59700 -34823 18855 -36015 -142344 -68924 30655 121118 188789 119413 142298 -23240
24496b3240j27294M0604N1234M7463M738j9060j2475j38272J73626k7111J04195
$$ -23240 -150534 -109930 -58696 -11233 -6495 -25555 -38030 -176302 -2676 -29787 74408
24485G4408O3601L0963q6493O0342M6819m2440n6491n6914J5986P757r16m8465
$$ 74408 138009 168972 82479 142821 189640 147200 90709 33795 49781 57538 56622 8157
24473H157k1831n8344n2176j0863K0608o5934J9138k5404m0875J05137P6889L2253
$$ 8157 -13674 -72018 -124194 -135057 -114449 -180383 -161245 -186649 -227524 -122387 -45498 -13245
24461a3245J23798J34815o3331o3084q3215j86132p8498j13534J02429Q1960L2996
$$ -13245 110553 245368 182037 118953 35738 -150394 -228892 -342426 -239997 -158037 -125041
24450a25041J25493r358p5879K4817O3551N9568j21476J5944l9886j86627O5612
$$ -125041 452 -8906 -84785 -59968 3583 63151 -58325 -42381 -82267 -268894 -203282
24439b03282O9140J23375J34809l6040j19189l0062R7957k2959j91214N0497J20746
$$ -203282 -134142 -10767 124042 88002 -31187 -61249 36708 13749 -177465 -126968 -6222
24428f222k1135M7672Q8611R2713j40542r5268N2887J22050r2655k5570K969j06637
$$ -6222 -27357 20315 108926 201639 61097 -34171 18716 140766 48111 22541 25510 -81127
24416h1127l1673N5141O1961j28228q9800P8932O5782j19775n1567R3671k5801
$$ -81127 -112800 -57659 4302 -123926 -213726 -134794 -69012 -188787 -240354 -146683 -172484
24405a72484M5937J36176J3963q9078j57794P2336N1657J7460m669M7009M2260
$$ -172484 -126547 9629 23592 -65486 -223280 -150944 -99287 -81827 -86496 -39487 2773
24394B773R9455m6933j25872J10846J48501L3734o038l30844j24907M700R8836
$$ 2773 102228 55295 -70577 40269 188770 222504 216466 -114378 -239285 -234585 -135749
24383a35749J38305J7260o2229o1717P801p1267n9038P0145J45785J11962J33059
$$ -135749 2556 19816 -42413 -104130 -96329 -167596 -226634 -156489 -10704 101258 234317
24372B34317P4151j40763j2978J3819j31169l4077j33379J2627N6508Q9209o7314
$$ 234317 308468 167705 154727 168546 37377 3300 -130079 -117452 -60944 28265 -39049
24361c9049j15259m6297q504j6493L1147J51495J490l773o4717p958J5583J72915
$$ -39049 -154308 -200605 -209109 -225602 -194455 -42960 -41470 -45243 -109960 -117918 -102335 70580
24349G0580j3484R042n5491q8589p3232N0252O6373j6845j14292J14365k038p8512
$$ 70580 57096 66138 10647 -77942 -151174 -100922 -34549 -51394 -165686 -51321 -53359 -131871
24337a31871M4492L267N8219p9383j19346q3378p9162K8215J50071J59385O522
$$ -131871 -87379 -84112 -25893 -105276 -224622 -308000 -387162 -358947 -208876 -49491 -42969
24326d2969o4592K1868J80180J26176m2583j08436p5018p9381O1732J18196k8614
$$ -42969 -107561 -85693 94487 220663 178080 69644 -5374 -84755 -23023 95173 66559
24315F6559r2148m287O683k8125j08761J43643J28506N6801L4143l742J1669Q9176
$$ 66559 -25589 -29876 -23193 -51318 -160079 -16436 112070 168871 203014 199272 210941 300117
24303C00117N157r5097N9037o6635k07318q9257Q5360j1195n272j15899k06386
$$ 300117 305274 210177 269214 202579 -4739 -93996 -8636 -19831 -25103 -141002 -347388
24292c47388O574J17826J24258K6845j7635N7722R8492M3680o142J1119L7290
$$ -347388 -340814 -222988 -98730 -71885 -89520 -31798 66694 110374 104232 115351 152641
24281A52641l0401j65498k5770N3125m3013r3239M8851M6199J21905J00237q1276
$$ 152641 122240 -43258 -69028 -15903 -58916 -152155 -103304 -57105 64800 165037 83761
24270H3761j13646r377j69728p0150j8614J14409K17096J40821j0073j62515o2845
$$ 83761 -29885 -39262 -208990 -279140 -297754 -183345 33751 174572 164499 1984 -60861
24259f0861O6261o529L0434l3130l6667l9251J09282J36704O0642j71638o2531
$$ -60861 5400 -1129 29305 -3825 -40492 -79743 29539 166243 226885 55247 -7284
24248g284o715j9456O7208l4540o7594J4259J32362J47617n028l664j97495j04412
$$ -7284 -13999 -33455 33753 -787 -68381 -54122 78240 225857 220829 217165 19670 -84742
24236h4742K1245k7404o9585j9734P9959N2105j19940j66696J07501J64889q2075
$$ -84742 -63497 -90901 -160486 -180220 -100261 -48156 -168096 -334792 -227291 -62402 -144477
24225a44477n6391O1814J85498M1583m0895J33242P274j89861j52135K5322R846
$$ -144477 -200868 -139054 46444 88027 47132 180374 187648 -2213 -154348 -129026 -119180
24214a19180J04884l0197n9415K4055q0508L5226R0387j0337L3336Q7410j72607
$$ -119180 -14296 -44493 -103908 -79853 -160361 -125135 -34748 -45085 -11749 75661 -96946
24203i6946r4686M5342K3803J604M5249m0900r5713k4976l7728N0307k3636J17790
$$ -96946 -191632 -146290 -122487 -120883 -75634 -116534 -212247 -237223 -274951 -224644 -248280 -130490
24191a30490N3402j452K4415M7202L6182K5870L6130r5989l3708N6780j3753n7364
$$ -130490 -77088 -78540 -54125 -6923 29259 55129 91259 -4730 -38438 18342 4589 -52775
24179e2775o3218M3353K0137q7780m2996j6976r8368J49299J36058j075j03651
$$ -52775 -115993 -72640 -52503 -140283 -183279 -200255 -298623 -149324 -13266 -14341 -117992
24168a17992j57594O1309J4928L0245Q6237Q3181J9201j40921J4458J0084k1036
$$ -117992 -275586 -214277 -199349 -169104 -82867 314 19515 -121406 -106948 -96864 -117900
24157a17900j1256J2501J56481J60137j66937k05036j98388J04155J98162l1063
$$ -117900 -129156 -116655 39826 199963 33026 -172010 -370398 -266243 -68081 -99144
24147i9144k6920m6349Q1398O5919J61187j01877o0495P9186j10810k3454J27210
$$ -99144 -126064 -172413 -91015 -25096 136091 34214 -26281 52905 -57905 -81359 45851
24136D5851K41601r6987k08192m6015J77507K8449j2817j6135j49123j50405J5616
$$ 45851 287452 190465 -17727 -63742 113765 142214 129397 113262 -35861 -186266 -170650
24125a70650p4536J03785J03333K1201Q1163q1784J0542R8781o8994o5931r7836
$$ -170650 -245186 -141401 -38068 -16867 64296 -17488 -6946 91835 22841 -43090 -140926
24114a40926K5394p5407l0962Q6865j4942o9567l2131J16142P2083j36020J42304
$$ -140926 -115532 -190939 -221901 -135036 -149978 -219545 -251676 -135534 -63451 -199471 -57167
24103e7167J99282j4173j51345j46182o8773J33926J87634P0240k4095P9130J20581
$$ -57167 142115 127942 -23403 -169585 -238358 -104432 83202 153442 129347 208477 329058
24092C29058o5838n7675m5358n5241j49296j05957O0751l1098P7275N0769j33252
$$ 329058 263220 205545 160187 104946 -44350 -150307 -89556 -120654 -43379 7390 -125862
24081a25862M2996P8364L2069l3815j33794K2141l6048k8026J1666J34540L07820
$$ -125862 -82866 -4502 27567 -6248 -140042 -117901 -153949 -181975 -170309 -35769 272051
24070B72051n4323j71190r2790R805M7006J68166j8105j70138j05240N1633J26544
$$ 272051 217728 46538 -46252 -36447 10559 178725 160620 -9518 -114758 -63125 63419
24059F3419M0759Q3472K8499J6447J5030r0498o2807L443K9234K5345j07050K1199
$$ 63419 104178 187650 216149 232596 247626 157128 94321 97764 126998 152343 45293 66492
24047F6492J71489P1137M5563k45011j23132L2539O0586k0910q3461r2488M7283
$$ 66492 237981 309118 354681 109670 -13462 19077 79663 58753 -24708 -117196 -69913
24036f9913M3365m5711p8079j9410J28929J295j79500j6882J9407j28175m4439
$$ -69913 -26548 -72259 -150338 -169748 -40819 -39524 -219024 -235906 -216499 -344674 -389113
24025c89113J83468J07030k9175k9309J7710O4664k8143o6910m1039R2397o0164
$$ -389113 -205645 -98615 -127790 -157099 -139389 -74725 -102868 -169778 -210817 -118420 -178584
24014a78584l3799j5085K21652Q9712k2948K4720o6450J82799l0609k22043j84733
$$ -178584 -212383 -227468 -5816 83896 60948 85668 19218 202017 171408 -50635 -235368
24003b35368M3157J89379J4993j23809J48922Q8622j24852p1737J94941R6379
$$ -235368 -192211 -2832 12161 -111648 37274 125896 1044 -70693 124248 220627
23993B20627j92680j67025j63385L7052J8871J2716r8942q1422J25121J40968
$$ 220627 27947 -139078 -302463 -265411 -246540 -233824 -332766 -414188 -289067 -148099
23983a48099J81802p2811r7151Q0922J56236j48554r3617J1523J44641m7397r3821
$$ -148099 33703 -39108 -136259 -55337 100899 -47655 -141272 -129749 14892 -32505 -126326
23972a26326K5062J24508k8542L3978N8487Q58r6671j17725K481K9961L6525R599
$$ -126326 -101264 23244 -5298 28680 87167 88025 -8646 -126371 -123890 -93929 -57404 -47805
23960d7805M5712K9202q631k7839N3000J30791l495p772O1738j03720k37497l8044
$$ -47805 -2093 27109 18478 -9361 43639 174430 170935 163163 224901 121181 -116316 -154360
23948a54360j08865Q2908M4754K47361K1500r4780J88941l4096j64891j39253
$$ -154360 -263225 -180317 -135563 111798 133298 38518 227459 193363 28472 -110781
23938a10781p6940J607R5989q566j2031q4650n565O5873j3307k2547Q718m646
$$ -110781 -187721 -186114 -90125 -98691 -110722 -195372 -200937 -135064 -148371 -170918 -162200 -166846
23926a66846J9500K32773J30010N4711j10011q4271M344L8532K1637j14017m8723
$$ -166846 -147346 85427 215437 270148 160137 75866 80210 118742 140379 26362 -22361
23915b2361J30530j08408n7085J45361O4612j8768m5033j07354R3180J72328o2750
$$ -22361 108169 -239 -57324 88037 152649 133881 88848 -18506 74674 247002 184252
23904A84252j75879o6154l6052L5159J3962j5539L1197J20984L3779k5407M0158
$$ 184252 8373 -57781 -93833 -58674 -44712 -60251 -29054 91930 125709 100302 140460
23893A40460L179j42312J0090P9951P7311P1161J207l7151o4925K5760L3612j09414
$$ 140460 143639 1327 11417 91368 168679 239840 241047 203896 138971 164731 198343 88929
23881H8929O8601N0908K7307n0931n1594m1008p4848J22008L1507j35198o3845
$$ 88929 157530 208438 235745 184814 133220 92212 17364 139372 170879 35681 -28164
23870b8164j10886m8812L6196J39229J01545k51627J8402o8387M6111J27084O3443
$$ -28164 -139050 -187862 -151666 -12437 89108 -162519 -144117 -212504 -166393 -39309 24134
23859B4134Q8686o3917p0982M3022K7864J4583o9979k8476L321J9365p0579N8544
$$ 24134 112820 48903 -22079 20943 48807 63390 -6589 -35065 -31744 -12379 -82958 -24414
23847b4414K00643k5982j07155J7892M6965Q5351j95529j58385m8946n423K25458
$$ -24414 176229 150247 43092 60984 107949 193300 -2229 -160614 -209560 -214983 10475
23836A0475M2080j18201r3779J27064k6315m7704P9799K063Q1780Q2533p8194
$$ 10475 52555 -65646 -159425 -32361 -58676 -106380 -26581 -24518 57262 139795 61601
23825F1601m8743M134j21772l8049Q0784N4450M5429p0783j11582q3743n2592
$$ 61601 12858 16992 -104780 -142829 -62045 -7595 37834 -32949 -144531 -228274 -280866
23814b80866J81276J2573o1383L5069o438J2987J9310O3518K9102Q5566n0304
$$ -280866 -99590 -87017 -148400 -113331 -119769 -106782 -87472 -23954 5148 90714 40410
23803D0410n7429j44709j29985M6102J48195k6565j11534p9435m192J00082J04338
$$ 40410 -17019 -161728 -291713 -245611 -97416 -123981 -235515 -314950 -319142 -219060 -114722
23792a14722r0189Q1768J66251L7626j6621k22315j1100K07471k0562j29432K5989
$$ -114722 -204911 -123143 43108 80734 64113 -158202 -169302 38169 17607 -111825 -85836
23781h5836o5395J10949J56209R9092r0842k16947m5941O9882J13681Q8163j63175
$$ -85836 -151231 -40282 115927 215019 124177 -92770 -138711 -68829 44852 133015 -30160
23770c0160L5947q2177j02808j20652Q4133P2021k5123L4485O3322J29707O0137
$$ -30160 5787 -76390 -179198 -299850 -215717 -143696 -168819 -134334 -71012 58695 118832
23759A18832m9051n262M6317m5102k5135l1422l414k7515j07668N7546k9377j07666
$$ 118832 69781 64519 110836 65734 40599 9177 5763 -21752 -129420 -71874 -101251 -208917
23747b08917Q7099j8788L2924L8023P9526j77825l3409M2613m2707r662M6583
$$ -208917 -121818 -140606 -107682 -69659 9867 -167958 -201367 -158754 -201461 -211123 -164540
23736a64540m8306r8086N2138m5533k0199P0967J7162P6191O241J62321J74185
$$ -164540 -212846 -310932 -258794 -304327 -324526 -253559 -236397 -160206 -153965 8356 182541
23725A82541m1355r4160j12288j86321r4655J13086J82523J29408l0202k1347
$$ 182541 141186 47026 -65262 -251583 -346238 -233152 -50629 78779 48577 27230
23715B7230K1783j20947L1699m9113L0614O0002R155j09737n4615j43912Q6712
$$ 27230 49013 -71934 -40235 -89348 -58734 1268 10423 -99314 -153929 -297841 -211129
23704b11129J24650R5444N046k975p1552j66438N9085L8609R5018M0870k5939
$$ -211129 -86479 8965 14011 11036 -60516 -226954 -167869 -129260 -34242 6628 -19311
23693a9311J39684o2489j26095M24o2335p4744K0027K7319k2640j613Q996R233
$$ -19311 120373 57884 -68211 -67787 -130122 -204866 -184839 -157520 -180160 -181773 -172777 -163544
23681a63544Q115K7165J502L3948n1530n3612J07180O3344p7542r4607N9502L5389
$$ -163544 -155429 -128264 -126762 -92814 -144344 -197956 -90776 -27432 -104974 -199581 -140079 -104690
23669a04690L2859K2983m2968j03753P4631J3004R9525Q9742o7066j21159l3010
$$ -104690 -71831 -48848 -91816 -195569 -120938 -107934 -8409 81333 14267 -106892 -139902
23658a39902Q0201j5051m0742j547R4925O9452p2895j21151m3154r2208j0576
$$ -139902 -59701 -74752 -115494 -117041 -22116 47336 -25559 -146710 -189864 -282072 -292648
23647b92648r0938k5993J49734J05772J59573J5975o6680q115n3419k9972J04707
$$ -292648 -383586 -409579 -259845 -154073 5500 21475 -45205 -53320 -106739 -136711 -32004
23636c2004q007o9461L7335J43050O1814j33747j61080N6017Q4840P9134L8527
$$ -32004 -40011 -109472 -72137 70913 132727 -1020 -162100 -106083 -21243 57891 96418
23625I6418j46570q7310L4406j9634j4485J10912J20847M1368O8356o600L8693
$$ 96418 -50152 -137462 -103056 -122690 -137175 -26263 94584 135952 204308 197708 236401
23614B36401m8820j87675R917M7788M7956j11123j74217L333J09091J8911k8506
$$ 236401 187581 -94 9823 57611 105567 -5556 -179773 -176440 -67349 -48438 -76944
23603g6944J10315N4227N3266j29136j15021j5507O5198j7701M7163J40945Q4350
$$ -76944 33371 87598 140864 11728 -103293 -118800 -53602 -71303 -24140 116805 201155
23592B01155L646j99317q5902R0500J89153q9145j4627R0427l533M604j80431
$$ 201155 204801 5484 -80418 10082 199235 110090 95463 185890 182357 186961 6530
23581F530j22511q2644R3824j0483p0457l8805m6732J13471R8328P7490k0973
$$ 6530 -115981 -198625 -104801 -115284 -185741 -224546 -271278 -157807 -59479 18011 -2962
23570b962n0152j0077l0738P2424K13438J0003N2620J861j45959j28815q6956
$$ -2962 -53114 -63191 -93929 -21505 191933 201936 254556 256417 110458 -18357 -105313
23559a05313Q6570J62916k1022j04618j83554O62N0253o2190J07947R8656J7867
$$ -105313 -18743 144173 123151 18533 -165021 -164359 -114106 -176296 -68349 30307 48174
23548D8174J36300j1576l9684j334r6710l0296R2724O2470n9982j01972n0954
$$ 48174 184474 172898 133214 131880 35170 4874 97598 160068 100086 -1886 -52840
23537e2840j9831J00977j3136r8048j38429N3425J60548M7641q5688P0815J150
$$ -52840 -72671 28306 15170 -82878 -221307 -167882 -7334 40307 -45381 25434 26584
23526B6584p7743j25375j86430j06857K19389J28206p5375K1542J7799J44941
$$ 26584 -51159 -176534 -362964 -469821 -250432 -122226 -197601 -176059 -158260 -13319
23516a3319J14096n6032j8730q3540k22022k334Q1792O3724p8070O1217q0542
$$ -13319 100777 44745 26015 -57525 -279547 -281881 -200089 -136365 -214435 -153218 -233760
23505b33760o1729l4907J60908R1544j05061n4246J61218J02949J21512J6284
$$ -233760 -295489 -330396 -169488 -77944 -183005 -237251 -76033 26916 148428 164712
23495A64712k0263q0439j24320J15950Q2390l8333J5871J38837M8237m201j50106
$$ 164712 144449 64010 -60310 55640 138030 99697 115568 254405 302642 298441 148335
23484A48335k59672m3646J60472N5739J31381r1896k31452p508J42083J11210
$$ 148335 -111337 -154983 5489 61228 192609 100713 -130739 -138247 3836 115046
23474A15046o4741j53664q4696j20565R3854K98027L8706j91669j3729O6151J39668
$$ 115046 50305 -103359 -188055 -308620 -214766 83261 121967 -69702 -83431 -17280 122388
23463A22388n6652q4344q525l4947o2766p8899r6401R5304P2781J19933j58798
$$ 122388 65736 -18608 -27133 -62080 -124846 -203745 -300146 -204842 -132061 -12128 -170926
23452a70926K0178R7744O544k369j01839r0840j11915Q1244Q0834J38216Q7045
$$ -170926 -150748 -53004 -46460 -48829 -150668 -241508 -353423 -272179 -191345 -53129 33916
23441C3916p0923n1860j25349Q710R3375J38377K7483j16036Q5103J04167K7059
$$ 33916 -37007 -88867 -214216 -205506 -112131 26246 53729 -62307 22796 126963 154022
23430A54022l0483n4358p0863j18747J0206K4874l1229K8138N3721q6776J54240
$$ 154022 123539 69181 -1682 -120429 -110223 -85349 -116578 -88440 -34719 -121495 32745
23419C2745J32000O8899l9993j52653j14853J13091J92472o456O6953R7061j21548
$$ 32745 164745 233644 193651 40998 -73855 39236 231708 225252 292205 389266 267718
23408B67718j47232J06911m7865j00072M7433k7349n6217k6702j14530j0413l1572
$$ 267718 120486 227397 179532 79460 126893 99544 43327 16625 -97905 -108318 -139890
23397a39890J34911r8572j84028n8335J52120K66563j58339k22771J58226O9573
$$ -139890 -4979 -103551 -287579 -345914 -193794 72769 -85570 -308341 -150115 -80542
23387h0542l9245q4789q5310P9980l6872r4577l9697J60517J21658j39686k00107
$$ -80542 -119787 -204576 -289886 -209906 -246778 -341355 -381052 -220535 -98877 -238563 -438670
23376d38670M9811J32607R9687P2784L7104M8913Q852p3605O9224L8648j4552
$$ -438670 -388859 -256252 -156565 -83781 -46677 2236 11088 -62517 6707 45355 30803
23365C0803p42O8613L1340n6645j67136j78287J717J32977P8140k9292j9835M3594
$$ 30803 30061 98674 130014 73369 -93767 -272054 -270337 -137360 -59220 -88512 -108347 -64753
23353f4753J12595j05519n0520J2559k9471o2269l5769J38790J49220K3080o458
$$ -64753 47842 -57677 -108197 -95638 -125109 -187378 -223147 -84357 64863 87943 81485
23342H1485j62445j29179r2317K7813J14770R2534K5034q4825K0614R634J17945
$$ 81485 -80960 -210139 -302456 -274643 -159873 -67339 -42305 -127130 -106516 -96882 21063
23331B1063n9010j05167J74130J337j01869O446o0587J17716J73303l5639l2423
$$ 21063 -37947 -143114 31016 32353 -69516 -63070 -123657 -5941 167362 131723 99300
23320I9300n7107m957l3012j26717j57949o292J24440j59932q8406J07722K1516
$$ 99300 42193 37236 4224 -122493 -280442 -286734 -162294 -322226 -410632 -302910 -281394
23309b81394k034K4800p6909J15247Q5126l0339J948p0888o3478n5549k8973M4784
$$ -281394 -283428 -258628 -335537 -220290 -135164 -165503 -163555 -234443 -297921 -353470 -382443 -337659
23297c37659m7116o3660J96329J49275P3299j4054n1560j09752p7370P1095N6225
$$ -337659 -384775 -448435 -252106 -102831 -29532 -43586 -95146 -204898 -282268 -211173 -154948
23286a54948J33470J31416q6011p6591m4500l7729m7674J20170O4901o281j53311
$$ -154948 -21478 109938 23927 -52664 -97164 -134893 -182567 -62397 2504 -3777 -157088
23275a57088L1549j4252o3738q2451K1471l1270M3420O5198J7428o9014L6742
$$ -157088 -125539 -139791 -203529 -285980 -264509 -295779 -252359 -187161 -169733 -238747 -202005
23264b02005n3801P2104l126p7987p658Q3179J8816O899J28686n7905j69523L1762
$$ -202005 -255806 -183702 -186828 -264815 -272473 -189294 -170478 -163579 -34893 -92798 -262321 -230559
23252b30559K06079J9822j2707m6639j11518k2119j589N1189l8353l8432K1743
$$ -230559 -24480 -4658 -17365 -64004 -175522 -197641 -199230 -148041 -186394 -224826 -203083
23241b03083l1724N3719N8014M5450O1399m5856n1262r320p1944l2248j6295P1291
$$ -203083 -234807 -181088 -123074 -77624 -16225 -62081 -113343 -122663 -194607 -226855 -243150 -171859
23229a71859K3319M0696o249M0636Q7210R4944l2332l947l5747n1819N3437p1143
$$ -171859 -148540 -107844 -114093 -73457 13753 108697 76365 72418 36671 -15148 38289 -32854
23217c2854q9992N4551J76827O0707j49587k4096J60844O6260p5171j45642k08616
$$ -32854 -122846 -68295 108532 169239 19652 -4444 156400 222660 147489 1847 -206769
23206b06769N555o7394J18705M8115j10882o8286q0736J6969K66740K09730L9110
$$ -206769 -201214 -268608 -149903 -101788 -212670 -280956 -361692 -344723 -77983 131747 170857
23195A70857L4945M8939p5034L5570o0202j01420j79017n679J35149r1795l6736
$$ 170857 205802 254741 179707 215277 155075 53655 -125362 -131041 4108 -87687 -124423
23184a24423P2974j1941q7207j1783Q040J15595l1034j42811m5981J49506q3325
$$ -124423 -51449 -63390 -150597 -162380 -154340 -38745 -69779 -212590 -258571 -109065 -192390
23173a92390j04188J42386J74550o2310l6896J36813P1909J2616k6811p670k9979
$$ -192390 -296578 -154192 20358 -41952 -78848 57965 129874 142490 115679 108009 78030
23162G8030j48200P7295j8395L0275P9820P4035p1759j52538j21475J5667M6815
$$ 78030 -70170 7125 -11270 19005 98825 172860 101101 -51437 -172912 -157245 -110430
23151a10430j32404j65464n0597J91330K08508P5613j88272j38123p4798J6993
$$ -110430 -242834 -408298 -458895 -267565 -59057 16556 -171716 -309839 -384637 -367644
23141c67644J66540J85281q91j4190k3164p1012m0385J92166O8920j00879n0663
$$ -367644 -201104 -15823 -16714 -30904 -54068 -125080 -165465 26701 95621 -5258 -55921
23130e5921j90167o7642q175M413J35819J37297o1585j7031R7442J17102k203
$$ -55921 -246088 -313730 -321905 -317492 -181673 -44376 -105961 -122992 -25550 91552 89349
23119H9349j60701K8780K4697q1411n484o1891m2178J26639O1596j4291R1672
$$ 89349 -71352 -42572 -17875 -99286 -104770 -166661 -208839 -82200 -20604 -34895 56777
23108E6777n8688O5741L8638j49162j33103J5012N5494P1936j87165l0110J32855
$$ 56777 -1911 63830 102468 -46694 -179797 -164785 -109291 -37355 -224520 -254630 -121775
23097a21775J4747j10301P0539K1700j7368k0010k7427r8185k6139O6421K50338
$$ -121775 -107028 -217329 -146790 -125090 -142458 -162468 -189895 -288080 -314219 -247798 2540
23086B540J45139o7617j49355L8263j598N7563m7627j2594m2876m5490k8096m1930
$$ 2540 147679 80062 -69293 -31030 -32628 24935 -22692 -35286 -78162 -123652 -151748 -193678
23074a93678N4674J78413P2443l3336j36279O9167o3120j28411L5474P5285l0165
$$ -193678 -139004 39409 111852 78516 -57763 11404 -51716 -180127 -144653 -69368 -99533
23063i9533o4775p8338o1266J12254j2672n2113k1437Q945K2643L328r6747o1883
$$ -99533 -164308 -242646 -303912 -191658 -204330 -256443 -277880 -268935 -246292 -242964 -339711 -401594
23051d01594J27442P9460J60942n8442l60540j10063J27243J72289n2562K2939
$$ -401594 -274152 -194692 -33750 -92192 -452732 -562795 -435552 -263263 -315825 -292886
23041b92886R3961j23637m7638L2926O9162Q693J5319K7680l2531O0363O425L0421
$$ -292886 -198925 -322562 -370200 -337274 -268112 -259419 -244100 -216420 -248951 -188588 -182163 -151742
23029a51742P7478j25302j05441M4873M7705R6482R9357n6791l5219r8943j9496
$$ -151742 -74264 -199566 -305007 -260134 -212429 -115947 -16590 -73381 -108600 -207543 -227039
23018b27039q104P0712N5014K324j41705Q7046o136p0081J1331p2197M9630J36686
$$ -227039 -235143 -164431 -109417 -107093 -248798 -161752 -167888 -237969 -226638 -298835 -249205 -112519
23006a12519O8366J82893o0268q8986p9797n2535o0336J01651O5500Q543L499
$$ -112519 -44153 138740 78472 -10514 -90311 -142846 -203182 -101531 -36031 -27488 -23989
22995b3989N9706m3286j0515Q8393m9234j6341J8803J8143N6864j38543p427M2892
$$ -23989 35717 -7569 -18084 70309 21075 4734 23537 41680 98544 -39999 -47426 -4534
22983d534k0527j3410j10760k7467K01853O7104j683j14110j52837p277n4737
$$ -4534 -25061 -38471 -149231 -176698 25155 92259 90576 -23534 -176371 -183648 -238385
22972b38385L1311J1557J01512o1148N7150N6043j71574j6749L8734N7893Q0845
$$ -238385 -207074 -195517 -94005 -155153 -98003 -41960 -213534 -230283 -191549 -133656 -52811
22961e2811m3610m4869L5976J24276m3042j7133j112k8974O0199n6590R5530l8479
$$ -52811 -96421 -141290 -105314 18962 -24080 -41213 -42325 -71299 -11100 -67690 27840 -10639
22949a0639j85780p9683k2475J68550P6667L9789J34217l9125k26729r4087o3573
$$ -10639 -196419 -276102 -298577 -130027 -53360 -13571 120646 81521 -145208 -239295 -302868
22938c02868J46855J10724P447l6312K6251n0548j08079M9569Q7204Q2216M3656
$$ -302868 -156013 -45289 -37842 -74154 -47903 -98451 -206530 -156961 -69757 12459 56115
22927E6115j68821o3823O0024N6447p7815j3063J49712l4576nR9238r0951n2110
$$ 56115 -112706 -176529 -116505 -60058 -137873 -150936 -1224 -35800 -35805 63433 -27518 -79628
22915g9628j2014L9791L9752L0857K23144M9691j96427K9692O1090j15787j26849
$$ -79628 -91642 -51851 -12099 18758 241902 291593 95166 124858 185948 70161 -56688
22904e6688j87493O3250O0280J15849n4127n5231j24941J33965j09301k4164N3716
$$ -56688 -244181 -180931 -120651 -4802 -58929 -114160 -239101 -105136 -214437 -238601 -184885
22893a84885o5819q2848J03723J59054N5733o5204k1691J39736l1016n3147p9438
$$ -184885 -250704 -333552 -229829 -70775 -15042 -80246 -101937 37799 6783 -46364 -125802
22882a25802M6283P5519L5059p2479j24774o2555j13038J711J07263J55260k03085
$$ -125802 -79519 -4000 31059 -41420 -166194 -228749 -341787 -340076 -232813 -77553 -280638
22871b80638p7784R3772j3187j5630J19126l6098N4385O637n0422L7236j1059
$$ -280638 -358422 -264650 -277837 -293467 -174341 -210439 -156054 -149417 -199839 -162603 -173662
22860a73662j13583l1483k4806J47873n1622j44593j0213N9218J01780J01350
$$ -173662 -287245 -318728 -343534 -195661 -247283 -391876 -402089 -342871 -241091 -139741
22850a39741J2121O5691p5452p2404l102J72838K863j46402J3743j7457l6654
$$ -139741 -127620 -61929 -137381 -209785 -212887 -40049 -37186 -183588 -169845 -187302 -223956
22839b23956O8956l6109m6096R06J42400J24138P5168O565o927r9263l7991J6556
$$ -223956 -155000 -191109 -237205 -236299 -93899 30239 105407 111972 105045 5782 -32209 -15653
22827a5653N5257J9437j13994R10N3814n3322j67878O9563Q2440k9300P921j2363
$$ -15653 39604 59041 -54953 -54043 -229 -53551 -221429 -151866 -69426 -98726 -90805 -103168
22815a03168n2327R7620N6403r4734j16136J74118m8639j31255j55649O7976J35503
$$ -103168 -155495 -57875 -1472 -96206 -212342 -38224 -86863 -218118 -373767 -305791 -170288
22804a70288M0944N2644q5833j39908M1312J63019P4614j8122n5459n2972M4813
$$ -170288 -129344 -76700 -162533 -302441 -261129 -98110 -23496 -41618 -97077 -150049 -105236
22793a05236R7893l3114J44755o188n8239j49807j05290R4073m0892L7444j4039
$$ -105236 -7343 -40457 104298 98110 39871 -109936 -215226 -121153 -162045 -124601 -138640
22782a38640J32167L4134O7798j18711k09518j05012J31002R3928J32378J7652
$$ -138640 -6473 27661 95459 -23252 -232770 -337782 -206780 -112852 19526 37178
22772C7178K6115J6741O413j74383K7297J32693r6306r003o9933j06393Q4582
$$ 37178 63293 80034 86447 -87936 -60639 72054 -24252 -33255 -103188 -209581 -124999
22761a24999Q3618M3288j66084k5213P7573P7177O3600m717j85631j12467r6910
$$ -124999 -41381 1907 -164177 -189390 -111817 -34640 28960 24243 -161388 -273855 -370765
22750c70765O3474J93311K7316j02532o1968Q0691O7238q2919q678L9645m5129
$$ -370765 -307291 -113980 -86664 -189196 -251164 -170473 -103235 -186154 -194832 -155187 -200316
22739b00316j01964Q8357l4461j07955L6305N2360J62796J6064j00648K5443J13595
$$ -200316 -302280 -213923 -248384 -356339 -320034 -267674 -104878 -88814 -189462 -164019 -50424
22728e0424M6498M0175j2777m8426k1144Q7822n5332N687L3172J5879m4944k07988
$$ -50424 -3926 36249 23472 -24954 -46098 41724 -13608 -7921 25251 41130 -3814 -211802
22716b11802n5619N3126k6433J06936M6012j3332P0229k4541L6304M833L8107
$$ -211802 -267421 -214295 -240728 -133792 -87780 -101112 -30883 -55424 -19120 -14287 23820
22705B3820j97970J4841j56957O6371J99102J05103j74734k05132M786J29933
$$ 23820 -174150 -159309 -316266 -249895 -50793 54310 -120424 -325556 -320770 -190837
22695a90837r2359L337K080o1506L3237J11612P404J7686m9584N4615J5516O4811
$$ -190837 -283196 -279859 -277779 -339285 -306048 -194436 -187032 -169346 -218930 -164315 -148799 -83988
22683h3988J3072q6341J01905N4954j80941j05620N8625K20074K744q1976j52243
$$ -83988 -70916 -157257 -55352 -398 -181339 -286959 -228334 -8260 -5516 -87492 -239735
22672b39735q9738J714M5269J17692k0635K1577J43233J2690j2042R5178N0884
$$ -239735 -329473 -327759 -282490 -164798 -185433 -163856 -20623 -7933 -19975 75203 126087
22661A26087K1157r8408k8252L6370P564n5727L6224n5189m2330j19048P652O738
$$ 126087 147244 48836 20584 56954 64518 8791 45015 -10174 -52504 -171552 -163900 -157162
22649a57162p9841n1352K51112n2746j09199o6553J27023M9132J39215N6200o4934
$$ -157162 -237003 -288355 -37243 -89989 -199188 -265741 -138718 -89586 49629 105829 40895
22638D0895j64669j54562J0484l2031M8469J47564L2726j8624j02043P1572l0423
$$ 40895 -123774 -278336 -267852 -299883 -251414 -103850 -71124 -89748 -191791 -120219 -150642
22627a50642k531q4588N5788m8754j10253L8486J00077r828m876O6567l7850j88763
$$ -150642 -153173 -237761 -181973 -230727 -340980 -302494 -202417 -212245 -217121 -150554 -188404 -377167
22615c77167L0976J21370Q3027o1906r2902R1059P791r6564k2193J16642M6964
$$ -377167 -346191 -224821 -141794 -203700 -296602 -205543 -197752 -294316 -316509 -199867 -152903
22604a52903J4402m2221O1086J4022n3916m5404J02655K8572j12669k4258J90542
$$ -152903 -138501 -180722 -119636 -105614 -159530 -204934 -102279 -73707 -186376 -210634 -20092
22593b0092l8725l3986J3611j05528j50430P7992J9020J05020N1083O8413l6951
$$ -20092 -58817 -92803 -79192 -184720 -335150 -257158 -238138 -133118 -82035 -13622 -50573
22582e0573j2620p9906k05797M211Q6438n3996J50224R1295J00209k3705k9319
$$ -50573 -63193 -143099 -348896 -344685 -258247 -312243 -162019 -70724 29485 5780 -23539
22571b3539q6301p3744J999R8420j36162o9411J31526M8229n6484r7292j13812
$$ -23539 -109840 -183584 -181585 -83165 -219327 -288738 -157212 -108983 -165467 -262759 -376571
22560c76571m5912m6721R7146Q1431R6777j02048j62361q8297J3199J63531K77879
$$ -376571 -422483 -469204 -372058 -290627 -193850 -295898 -458259 -546556 -533357 -369826 -91947
22549i1947J46229k0710j64982N8217P378k1041r2006j28579O7040P5464R3310
$$ -91947 54282 33572 -131410 -73193 -65815 -86856 -178862 -307441 -240401 -164937 -71627
22538g1627n6732K1407M9125r3175r4588O6572j5587M9671M3175P9492P9879n5646
$$ -71627 -128359 -106952 -57827 -151002 -245590 -179018 -194605 -144934 -101759 -22267 57612 1966
22526A966j02254n7166j48697l8664J42715k5503k11564o6222K12516J84067J7284
$$ 1966 -100288 -157454 -306151 -344815 -202100 -227603 -439167 -505389 -292873 -108806 -91522
22515i1522q0401q9618m5178O1532K34211R8478m5183o1061j17719q9652m7216
$$ -91522 -171923 -261541 -306719 -245187 -10976 87502 42319 -18742 -136461 -226113 -273329
22504b73329M674J41539L7104m2056O7580K5571m8296r6272j27086O4725P7676
$$ -273329 -268655 -127116 -90012 -132068 -64488 -38917 -87213 -183485 -310571 -245846 -168170
22493a68170J85032J0140O1743j14042o9687J9507n183m7889j21336j3131R6883
$$ -168170 16862 27002 88745 -25297 -94984 -75477 -80660 -128549 -249885 -263016 -166133
22482a66133J0158M6946j8670l9433k5687n4154o9571L0146K0944J11400O4986
$$ -166133 -155975 -109029 -127699 -167132 -192819 -246973 -316544 -286398 -265454 -154054 -89068
22471h9068o2052k935N585m9301m3771Q2188Q179m6642j3405r3931j0518K8314
$$ -89068 -151120 -154055 -148470 -197771 -241542 -159354 -151175 -197817 -211222 -305153 -315671 -287357
22459b87357P5552p6579j03826p4661R8697M3186J10506P038j24497J8587J6807
$$ -287357 -211805 -288384 -392210 -466871 -368174 -324988 -214482 -207444 -331941 -313354 -296547
22448b96547L4383M0926P1975k8528l6733l3451j20561J97631R4449P8469j2385
$$ -296547 -262164 -221238 -149263 -177791 -214524 -247975 -368536 -170905 -76456 2013 -10372
22437a0372n7059N1360Q3573l498J514O5024R9392q532o5704k56181n0145P3050
$$ -10372 -67431 -16071 67502 64004 65518 130542 229934 221402 155698 -100483 -150628 -77578
22425g7578r7273N0239j9801j58723Q2995K776R5415J45781J72539l9977O9364
$$ -77578 -174851 -124612 -144413 -303136 -220141 -217365 -121950 23831 196370 156393 225757
22414B25757K7324l4529j33828k28190o9322k9424j5677J3392O0902j0473J1729
$$ 225757 253081 218552 84724 -143466 -212788 -242212 -257889 -244497 -183595 -194068 -182339
22403a82339q4949J18671R31J02079k9816k6769K786j883j81575J10076j52309
$$ -182339 -267288 -148617 -147686 -45607 -75423 -102192 -99406 -101289 -282864 -172788 -325097
22392c25097p3362q6740K10789J84537Q854r9655j19960j11929n0571K09293j8183
$$ -325097 -398459 -485199 -274410 -89873 -81019 -180674 -300634 -412563 -463134 -253841 -272024
22381b72024m3188N4657q3526L4940q4324P2369N6202J36609N7016L2501L3373
$$ -272024 -315212 -260555 -344081 -309141 -393465 -321096 -264894 -128285 -71269 -38768 -5395
22370e395L6030j30817j21767N6230n0426j03471Q0792o3357L6011K0189R223
$$ -5395 30635 -100182 -221949 -165719 -216145 -319616 -238824 -302181 -266170 -245981 -236758
22359b36758N8088Q7853k5690N6220P4486j19409r1440L4350L3722p8966j39720
$$ -236758 -178670 -90817 -116507 -60287 14199 -105210 -196650 -162300 -128578 -207544 -347264
22348c47264P1803N452J7803J3155N5893j2802L2301j03034m4687j8766M9368
$$ -347264 -275461 -270009 -252206 -239051 -183158 -195960 -163659 -266693 -311380 -330146 -280778
22337b80778R9723J030j61756K0808O8763J10941j22496j28097Q2508J45320L6253
$$ -280778 -181055 -180025 -341781 -320973 -252210 -141269 -263765 -391862 -309354 -164034 -127781
22326a27781q844J10309o8593K1990J05565p337R312Q272j86219o6563p6103l459
$$ -127781 -136625 -26316 -94909 -72919 32646 25309 34621 42893 -143326 -209889 -285992 -289451
22314b89451o4077J32931R5710J35861n0258k21730o6121J27292M3071j63194
$$ -289451 -353528 -220597 -124887 10974 -39284 -261014 -327135 -199843 -156772 -319966
22304c19966j12289l3993J62675P2852l0591p730Q0738O470J20266P8972j11124
$$ -319966 -432255 -466248 -303573 -230721 -261312 -269042 -188304 -181834 -61568 17404 -93720
22293i3720m1077k3547j73302R345l2874R341Q5440L9559j0317J1871j29100j31754
$$ -93720 -134797 -158344 -331646 -322301 -355175 -345834 -260394 -220835 -231152 -219281 -348381 -480135
22281d80135J14769J58188j44208J60642R8269l2831q1093J0345N2236R6888O1450
$$ -480135 -365366 -207178 -351386 -190744 -92475 -125306 -206399 -196054 -143818 -46930 14520
22270A4520j3848q6073K7502j0874j4077k8288k3071O1011q9149q88j26069q7312
$$ 14520 672 -85401 -57899 -68773 -82850 -111138 -134209 -73198 -162347 -163235 -289304 -376616
22258c76616J81189O0814N891m0254j21527j17320r628J98970M0912O7066J1609
$$ -376616 -195427 -134613 -128722 -168976 -290503 -407823 -417451 -218481 -177569 -110503 -98894
22247i8894k37M5624L1738j26848j10208q8760l1395J82924m1401o3011J04853
$$ -98894 -99131 -53507 -21769 -148617 -258825 -347585 -378980 -196056 -237457 -300468 -195615
22236a95615N8035n6408O2497R7964J42353R1792jp3701j87432n564Q1545j29974
$$ -195615 -137580 -193988 -131491 -33527 108826 200618 200617 126916 -60516 -66080 15465 -114509
22224a14509k06591N9008o7204q3666J36130J26240q2136L4531l2287L0891r548
$$ -114509 -321100 -262092 -329296 -412962 -276832 -150592 -232728 -198197 -230484 -199593 -209141
22213b09141L7204O688K5162m8521k9083J28095k3649R6563K7715M9722j22237
$$ -209141 -171937 -165249 -140087 -188608 -217691 -89596 -113245 -16682 11033 60755 -61482
22202f1482m6709l2598K5120j8701m0094p2690o4012R0267K062q90j5030J00428
$$ -61482 -108191 -140789 -115669 -134370 -174464 -247154 -311166 -220899 -218837 -219727 -234757 -134329
22190a34329Q2439j1225N8985o1180j24543j38406j13760P7811M6043K2580k7327
$$ -134329 -51890 -63115 -4130 -65310 -189853 -328259 -442019 -364208 -318165 -295585 -322912
22179c22912N3961J05348l2272P5276r5806j02899k0320m8249l8786m3867J17613
$$ -322912 -268951 -163603 -195875 -120599 -216405 -319304 -339624 -387873 -426659 -470526 -352913
22168c52913J60520p3834j95311j09108K16700J59742Q0324O345r6502M6120J3509
$$ -352913 -192393 -266227 -461538 -570646 -353946 -194204 -113880 -107535 -204037 -157917 -144408
22157a44408j19813P0627m1279q814M1341n2491J04559o7096R5073R0144m6188
$$ -144408 -264221 -193594 -234873 -243687 -202346 -254837 -150278 -217374 -122301 -32157 -78345
22146g8345K6350k4017k00540k3259J38070L809N4341j2715o3394j21368J0411
$$ -78345 -51995 -76012 -276552 -299811 -161741 -157932 -103591 -116306 -179700 -301068 -290657
22135b90657O4737l7650o0991M1779K049K1146L4024J40478Q0577k2912j57928
$$ -290657 -225920 -263570 -324561 -282782 -280733 -259587 -225563 -85085 -4508 -27420 -185348
22124a85348j08420P235J58633J84733J20396q7725l1375L2780q4170J6070L5895
$$ -185348 -293768 -286533 -127900 56833 177229 89504 58129 90909 6739 22809 58704
22113E8704J39601o3229m5564j3902P5334n4785o0816l7119j27293m1590J22249
$$ 58704 198305 135076 89512 75610 150944 96159 35343 -1776 -129069 -170659 -48410
22102d8410j5556j03242m8533M0902o8221j1136P9588J4051q238o2997j36892
$$ -48410 -63966 -167208 -215741 -174839 -243060 -254196 -174608 -160557 -168795 -231792 -368684
22091c68684J0876J11844k8249N8007Q3421m1360n0703R194J37874Q4645j77080
$$ -368684 -357808 -245964 -274213 -216206 -132785 -174145 -224848 -215654 -77780 6865 -170215
22080a70215l5955k5528n664q6955n7549L5255M2537O1315J26385N214R1877p0487
$$ -170215 -206170 -231698 -237362 -324317 -381866 -346611 -304074 -242759 -116374 -111160 -19283 -89770
22068h9770J19235k5451j77280j11647k41957K3536J85196J88989l0987p0756
$$ -89770 29465 4014 -173266 -284913 -526870 -503334 -318138 -129149 -160136 -230892
22058b30892J16768j0925j69283L1985J08668L2790q2700q3316J95537j1567J623
$$ -230892 -114124 -125049 -294332 -262347 -153679 -120889 -203589 -286905 -91368 -102935 -101312
22047a01312J40467j25771j25685M7393o0750m1726m0134K3576K2594r233m7829
$$ -101312 39155 -86616 -212301 -164908 -225658 -267384 -307518 -283942 -261348 -270581 -318410
22036c18410J06626R5675l5924K09818M9847k19513o3026K0224R7643R028o2117
$$ -318410 -211784 -116109 -152033 57785 107632 -111881 -174907 -154683 -57040 -48012 -110129
22025a10129k57687M1446j8865J11323J54533j07315p1800r0459k9194K6128Q4773
$$ -110129 -367816 -326370 -345235 -233912 -79379 -186694 -258494 -348953 -378147 -352019 -267246
22014b67246O317l8779j08499J1988q4654N0155J37670j1969n6395M9729L5196
$$ -267246 -260929 -299708 -408207 -396219 -480873 -430718 -293048 -305017 -361412 -311683 -276487
22003b76487J74216k5765m4329O0863l3000p3301N310J3624K613k751K5489q0967
$$ -276487 -102271 -128036 -172365 -111502 -144502 -217803 -212493 -198869 -196256 -199007 -173518 -254485
21991b54485p3169n7558K4360J07730J1445R8350l3103J5971N1901q4970k9542
$$ -254485 -327654 -385212 -360852 -253122 -241677 -143327 -176430 -160459 -108558 -193528 -223070
21980b23070k3689L364o0836j14394J3967J36844L7754k7069O6177j94523n8808
$$ -223070 -246759 -243395 -304231 -418625 -404658 -267814 -230060 -257129 -190952 -385475 -444283
21969d44283O7519R2361o0084k1974K2141L6178J11958N0231L3174J16994J28529
$$ -444283 -376764 -284403 -344487 -366461 -344320 -308142 -196184 -145953 -112779 4215 132744
21958A32744j34051q7638m8738j5692N6379j6987N5793l337l3024P4559J78223
$$ 132744 -1307 -88945 -137683 -153375 -96996 -113983 -58190 -61527 -94551 -19992 158231
21947A58231M6567m0442j40317n6870m889o8313j45911L4877M5022l697j69413
$$ 158231 204798 164356 24039 -32831 -37720 -106033 -251944 -217067 -172045 -175742 -345155
21936c45155J4045J18610L6466K469n9922k8523r5206q1550R5301J69907J32022
$$ -345155 -331110 -212500 -176034 -173565 -233487 -262010 -357216 -438766 -343465 -173558 -41536
21925d1536j36366k03525J52377K04551k2628n9084j14819k273P1588O8882j61947
$$ -41536 -177902 -381427 -229050 -24499 -47127 -106211 -221030 -223303 -151715 -82833 -244780
21914b44780j61544J06775J40605J73635N29l5944j78924k63082k1949K15092
$$ -244780 -406324 -299549 -158944 14691 15220 -20724 -199648 -462730 -484679 -269587
21904b69587K72657J27693p8095j13174j36769j0112M1145Q3445p1866j13194
$$ -269587 3070 130763 52668 -60506 -197275 -207387 -166242 -82797 -154663 -267857
21894b67857o5490k06868m2428J10587J01400J23337j5983l4919J057O3999J31107
$$ -267857 -333347 -540215 -582643 -472056 -370656 -247319 -263302 -298221 -297164 -233165 -102058
21883a02058P2997K481N810p5041p2663j27488P929J72613Q6414j37904k39089
$$ -102058 -29061 -26580 -20770 -95811 -168474 -295962 -288033 -115420 -29006 -166910 -405999
21872d05999j24661J40446J13742R3122j6575j35085l5980j145K3827J9956N4615
$$ -405999 -530660 -390214 -276472 -183350 -199925 -335010 -370990 -372135 -348308 -328352 -273737
21861b73737m4026j21057J40567K9918l5268N6010J04900p4313R9810l8724k19404
$$ -273737 -317763 -438820 -298253 -268335 -303603 -247593 -142693 -217006 -117196 -155920 -375324
21850c75324N4377M7693M0864K03923K2374l1848j45851m7697o9771L8904L9975
$$ -375324 -320947 -273254 -232390 -28467 -6093 -37941 -183792 -231489 -301260 -262356 -222381
21839b22381J19067R9345q0993j06871l6973l4908R6827Q6328q0619q9107Q3411
$$ -222381 -103314 -3969 -84962 -191833 -228806 -263714 -166887 -80559 -161178 -250285 -166874
21828a66874q1864j44246p370m8447J77576K0510r093R778j2887J09234R4420
$$ -166874 -248738 -392984 -400354 -448801 -271225 -250715 -259808 -250030 -262917 -153683 -59263
21817e9263n2539j11084N5307P3038q436r5322p7038J02375L213K8375L3737m9905
$$ -59263 -111802 -222886 -167579 -94541 -102977 -198299 -275337 -172962 -169749 -141374 -107637 -157542
21805a57542M1696m6085P9179R3092j1283j80795m9799K2589O8026K7j37225Q791
$$ -157542 -115846 -161931 -82752 10340 -943 -181738 -231537 -208948 -140922 -140895 -278120 -269329
21793b69329k1161J92373L7364r9009J0036P8229O4703J0863K3601l8258k01768
$$ -269329 -290490 -98117 -60753 -159762 -149726 -71497 -6794 4069 27670 -10588 -212356
21782b12356k199n5649n7443J43871P3342k9234J026j44384l8612J31086j89045
$$ -212356 -214555 -270204 -327647 -183776 -110434 -139668 -138642 -283026 -321638 -190552 -379597
21771c79597j19181q228N0423J9200J46768K10085J10018n5128j03076k51228
$$ -379597 -498778 -507006 -456583 -437383 -290615 -80530 29488 -25640 -128716 -379944
21761c79944K6564J11827m376m7923K9706l4982L9819p9448j37275J4243R3604
$$ -379944 -353380 -241553 -245929 -293852 -264146 -299128 -259309 -338757 -476032 -461789 -368185
21750c68185M3855m7129p3776P9997P9161k05678J06683O6838q7391l4390O6943
$$ -368185 -324330 -371459 -445235 -365238 -286077 -491755 -385072 -318234 -405625 -440015 -373072
21739c73072N985j984o2576J0111J07827R6780n8608j08049n7613m9991M7582
$$ -373072 -367087 -369071 -431647 -421536 -313709 -216929 -275537 -383586 -441199 -491190 -443608
21728d43608k419r1892m4846M0921k4271J2838N1750K39103K42145n7947N4403
$$ -443608 -446027 -537919 -582765 -541844 -566115 -553277 -501527 -262424 -20279 -78226 -23823
21717b3823J01403M7345j15489j96251Q8082N0557k8704N0556k2213O0554j62095
$$ -23823 77580 124925 9436 -186815 -98733 -48176 -76880 -26324 -48537 12017 -150078
21706a50078k79512o4329J23953J12582J02091j67750k1298M7648j38744k18491
$$ -150078 -429590 -493919 -369966 -257384 -155293 -323043 -344341 -296693 -435437 -653928
21696f53928R7545K54585j4602N85R4495N7163J4997N2018l1611r6340Q4923M2122
$$ -653928 -556383 -301798 -316400 -315815 -221320 -164157 -149160 -97142 -128753 -225093 -140170 -98048
21684i8048p15j23423k27325p6244M2232R5783K41862J7470j39071j31722L6083
$$ -98048 -98763 -222186 -449511 -525755 -483523 -387740 -145878 -128408 -267479 -399201 -363118
21673c63118Q8057K7909J5507K0371j31687r4056L0741J82793J16532O1047m7711
$$ -363118 -275061 -247152 -231645 -211274 -342961 -437017 -406276 -223483 -106951 -45904 -93615
21662i3615j55287K0330Q380j806j7191J8993J6509L1077Q177M9816m2574J879
$$ -93615 -248902 -228572 -220192 -221998 -239189 -220196 -203687 -172610 -164433 -114617 -157191 -155312
21650a55312Q4457L1823J01198O6335k9403j34925j11084j68296l7035o4785J69963
$$ -155312 -70855 -39032 62166 128501 99098 -35827 -146911 -315207 -352242 -417027 -247064
21639b47064K9891o6992q0071P3865J17551k8307l3497m2133p7259P5014N9351
$$ -247064 -217173 -284165 -364236 -290371 -172820 -201127 -234624 -276757 -354016 -279002 -219651
21628b19651O9329q0624r7611J00163J14900j34920k44961j24432P7981J46191
$$ -219651 -150322 -230946 -328557 -228394 -113494 -248414 -493375 -617807 -539826 -393635
21618c93635K32195l2193p7899o3702n2736P1105O2605J06251L9614p0419j26806
$$ -393635 -161440 -193633 -271532 -335234 -387970 -316865 -254260 -148009 -108395 -178814 -305620
21607c05620N5986R1865J55712L5606j90017k34175N2627K11009l4083j41772
$$ -305620 -249634 -157769 -2057 33549 -156468 -390643 -338016 -127007 -161090 -302862
21597c02862l7380P197n5404J05331K1945o3804p7821J9143M3317M7770J0426
$$ -302862 -340242 -333045 -388449 -283118 -261173 -324977 -402798 -383655 -340338 -292568 -282142
21586b82142q9558l3067k3669n2789Q551R1866J56976J36317N5996N2064O2515
$$ -282142 -371700 -404767 -428436 -481225 -472674 -380808 -223832 -87515 -31519 20545 83060
21575H3060m4339j07531p6982p9866L8672j7941J4964l9612q0737j14307J12420
$$ 83060 38721 -68810 -145792 -225658 -186986 -204927 -189963 -229575 -310312 -424619 -312199
21564c12199J38105j9870k5968l8930n7388j43852j93778J3838J88479K42361
$$ -312199 -174094 -193964 -219932 -258862 -316250 -460102 -653880 -640042 -451563 -209202
21554b09202N964p7223L8380N3837J05047Q8246j42712N804J5019k11022n7581
$$ -209202 -203238 -280461 -242081 -188244 -83197 5049 -137663 -131859 -116840 -327862 -385443
21543c85443J10351k3814j58721K40O0298N9390J6890k9688j13278J6387J01902
$$ -385443 -275092 -298906 -457627 -457387 -397089 -337699 -320809 -350497 -463775 -447388 -345486
21532c45486R6023m3248n5398J13995L9408m5696p2278j09107k5604R3796J30364
$$ -345486 -249463 -292711 -348109 -234114 -194706 -240402 -312680 -421787 -447391 -353595 -223231
21521b23231r243j7671J42260J21776q6054j77203j31357j46331M4893J54902
$$ -223231 -232474 -250145 -107885 13891 -72163 -249366 -380723 -527054 -482161 -327259
21511c27259J73477j23437j19125n0880Q5607K8490N9625n9522R8326J25386k1878
$$ -327259 -153782 -277219 -396344 -447224 -361617 -333127 -273502 -333024 -234698 -109312 -131190
21500a31190Q3616J11877n4558k33363J7079r1290J8537j3104p7334P6980J24241
$$ -131190 -47574 64303 9745 -223618 -206539 -297829 -279292 -292396 -369730 -292750 -168509
21489a68509p0136J40041l5451m6177m6413N8714J1627P6950J40898Q4595j65317
$$ -168509 -238645 -98604 -134055 -180232 -226645 -167931 -156304 -79354 61544 146139 -19178
21478a9178j01305j740j16207o5051J37244R157j20460l1507J85054Q3086k59767
$$ -19178 -120483 -122223 -238430 -303481 -166237 -157080 -277540 -309047 -123993 -40907 -300674
21467c00674n4919J04069L4356j54916N3040J38993J0242j16730N8006J30264
$$ -300674 -355593 -251524 -217168 -372084 -319044 -180051 -169809 -286539 -228533 -98269
21457i8269J26713p0795j1255j46705l2531O5204l0969j5651L551J89047M7391
$$ -98269 28444 -42351 -53606 -200311 -232842 -167638 -198607 -214258 -210707 -21660 25731
21446B5731Q0484J1869k04327j25894r9583K7982J27197m216j62122j48941J23349
$$ 25731 106215 118084 -86243 -212137 -311720 -283738 -156541 -160757 -322879 -471820 -348471
21435c48471J63589l5040j45758j1896R5795N4391J35697Q6591q0153J16592O4386
$$ -348471 -184882 -219922 -365680 -377576 -281781 -227390 -91693 -5102 -85255 31337 95723
21424I5723R6242j68161j93143j18124J9249N4508M7704J07107j30834j21909
$$ 95723 191965 23804 -169339 -287463 -268214 -213706 -166002 -58895 -189729 -311638
21414c11638r3787J46640l028J2337n4541N3649p2187L4928K5040K6199K2223
$$ -311638 -405425 -258785 -261813 -249476 -304017 -250368 -322555 -287627 -262587 -236388 -214165
21403b14165l8266Q9190J46151o4106j20342L2110l2029R9681j15920r0673l4847
$$ -214165 -252431 -163241 -17090 -81196 -201538 -169428 -201457 -101776 -217696 -308369 -343216
21392c43216q5485P7464N6744O8131m5279O9123J14033m9372n4297J09327j03505
$$ -343216 -428701 -351237 -294493 -226362 -271641 -202518 -88485 -137857 -192154 -82827 -186332
21381a86332k3230L0420L0998q3768J141k9740o882j2423M2195L4152K4473Q2739
$$ -186332 -209562 -179142 -148144 -231912 -230771 -260511 -267393 -279816 -237621 -203469 -178996 -96257
21369i6257O296j55741o1794p895J18576Q7504l1591o3539J0131R784k36773p6503
$$ -96257 -89961 -245702 -307496 -315391 -196815 -109311 -140902 -204441 -194310 -184526 -421299 -497802
21357d97802J21852N4824m9128L8683M2592R4565J09730j19365r4145J09063Q2947
$$ -497802 -375950 -321126 -370254 -331571 -288979 -194414 -84684 -204049 -298194 -189131 -106184
21346a06184m5317k5912r8562m0732Q9840j7570j35843j32103O1651K15909J08142
$$ -106184 -151501 -177413 -275975 -316707 -226867 -244437 -380280 -512383 -450732 -234823 -126681
21335a26681L7225M7927r4362r1390j39952L5294j0488P051J65200J02591M0527
$$ -126681 -89456 -41529 -135891 -227281 -367233 -331939 -342427 -335376 -170176 -67585 -27058
21324b7058k622o7308n9597p7906k03693J02522Q8443O5274K2416K7874P8895
$$ -27058 -29680 -96988 -156585 -234491 -438184 -335662 -247219 -181945 -159529 -131655 -52760
21313e2760o2022k2897j11825r7220Q5832J47312j04933p3918J0220J22886M7850
$$ -52760 -114782 -137679 -249504 -346724 -260892 -113580 -218513 -292431 -282211 -159325 -111475
21302a11475p4140Q626j52J70208j44920R618o6867p1986q142N1811L0685k986
$$ -111475 -185615 -176989 -177141 -6933 -151853 -142235 -209102 -281088 -289230 -237419 -206734 -209720
21290b09720K9418k1192j3370j56017q4083j7197P3986N6515l3246n4977J73341
$$ -209720 -180302 -201494 -214864 -370881 -454964 -472161 -398175 -341660 -374906 -429883 -256542
21279b56542J16664P8114J71351k16085j15275J01838j8290j07558P4340P9705
$$ -256542 -139878 -61764 109587 -106498 -221773 -119935 -138225 -245783 -171443 -91738
21269i1738j0728k8435o8932j34283M254J89650Q537m5878O0692M1741m8218j92141
$$ -91738 -102466 -130901 -199833 -334116 -329862 -140212 -131675 -177553 -116861 -75120 -123338 -315479
21257c15479q3590j37788j82563N6328J65315M7269k5985P6990J10398J00827
$$ -315479 -399069 -536857 -719420 -663092 -497777 -450508 -476493 -399503 -289105 -188278
21247a88278o4268P4009l8092j92816J45774M4998r1646L6534n6633r7325j4092
$$ -188278 -252546 -178537 -216629 -409445 -263671 -218673 -310319 -273785 -330418 -427743 -441835
21236d41835K6168K639m9458O1845J81756J08850M7363j70138q0928r3874J40437
$$ -441835 -415667 -413028 -462486 -400641 -218885 -110035 -62672 -232810 -313738 -407612 -267175
21225b67175q91N1826K56q9339m2675O9150Q0819J12329j33965j69631j08981
$$ -267175 -268066 -216240 -215984 -305323 -347998 -278848 -198029 -85700 -219665 -389296 -498277
21214d98277K0378R2343R6057J9423n1172j92R115q8032j35257K406P1226L741
$$ -498277 -477899 -385556 -289499 -270076 -321248 -321440 -312325 -400357 -535614 -533208 -461982 -458241
21202d58241J07704J0910N5503k2575L4363j49087j73240J18884Q9025R1481j13820
$$ -458241 -350537 -339627 -284124 -306699 -272336 -421423 -594663 -475779 -386754 -295273 -409093
21191d09093j59988k3751K3041M3619J22205K6786Q612J95660K8177j52580j69801
$$ -409093 -569081 -592832 -569791 -526172 -403967 -377181 -368569 -172909 -144732 -297312 -467113
21180d67113L3070J39138K10450K25189R382j63543j63550j78054r1963J03060
$$ -467113 -434043 -294905 -84455 140734 150116 -13427 -176977 -355031 -446994 -343934
21170c43934J88288O0958O1039m8954l2603Q388r1237o6273N9143q936k2531n943
$$ -343934 -155646 -94688 -33649 -82603 -115206 -106818 -198055 -264328 -205185 -214121 -236652 -242595
21158b42595l7476r2001j37263p2472N1374K24186n462j8044j19626j19975J8145
$$ -242595 -280071 -372072 -509335 -581807 -530433 -306247 -311709 -329753 -449379 -569354 -551209
21147e51209j276P4889P6912n6629R0243R4042M5569L3724N3983o8364n2018m276
$$ -551209 -552485 -477596 -400684 -457313 -367070 -273028 -227459 -193735 -139752 -208116 -260134 -264410
21135b64410r0718o2273J01253K7377P873P1352R5627j1865q4689r0973J17186
$$ -264410 -355128 -417401 -316148 -288771 -280898 -209546 -113919 -125784 -210473 -301446 -184260
21124a84260M6126j67492k33985M2976Q4509R0356J15284J21443m6584n8154M9533
$$ -184260 -138134 -305626 -539611 -496635 -412126 -321770 -206486 -85043 -131627 -189781 -140248
21113a40248L137Q4350j46218j44842J18247o7575r2166J56120l6798j46736L4259
$$ -140248 -137111 -52761 -198979 -343821 -225574 -293149 -385315 -229195 -265993 -412729 -378470
21102c78470P6524R315N6863j0441K11839J04536p9585j48675Q9271J42264k75026
$$ -378470 -301946 -292631 -235768 -246209 -34370 70166 -9419 -158094 -68823 73441 -201585
21091b01585k14338k1764J60228O9576l2177m9390O3137K06326R9622l7680Q713
$$ -201585 -415923 -437687 -277459 -207883 -240060 -289450 -226313 -19987 79635 41955 50668
21080E0668r3849p0677M3620R5235N3565j6148r3256M9312O5074n2380n9409N4234
$$ 50668 -43181 -113858 -70238 24997 78562 62414 -30842 18470 83544 31164 -28245 25989
21068B5989j11342M4237j38825o6210N469J56964O7865j07029j15982Q8201N4289
$$ 25989 -85353 -41116 -179941 -246151 -240682 -83718 -15853 -122882 -238864 -150663 -96374
21057i6374k2582J75171q1894r5715r5927j0015j17214Q5191J03164J11764j30980
$$ -96374 -118956 56215 -25679 -121394 -217321 -227336 -344550 -259359 -156195 -44431 -175411
21046a75411l17116j08711J13400J1516P6984N9684J3177Q1795J0133P4936J1789
$$ -175411 -492527 -601238 -487838 -476322 -399338 -339654 -326477 -244682 -234549 -159613 -147824
21035a47824l014o7757m2761J952n2973J07352J10631m9247q7769o4509L4352
$$ -147824 -150838 -218595 -261356 -259404 -312377 -205025 -94394 -143641 -231410 -295919 -261567
21024b61567j2641J49076J66610l9391j28293k4718l0574K4046K1959q8665o2225
$$ -261567 -274208 -125132 41478 2087 -126206 -150924 -181498 -157452 -135493 -224158 -286383
21013b86383R1949J5231R7606j9809r3785O8331M0140p1023m8337J8608J7529
$$ -286383 -194434 -179203 -81597 -101406 -195191 -126860 -86720 -157743 -206080 -187472 -169943
21002a69943J01896Q5789J15050p4361l2798j18568J31475K3382j6228k911K09367
$$ -169943 -68047 17742 132792 58431 25633 -92935 38540 61922 45694 42783 252150
20991B52150N6838j17868J76072O4868q0793L6495L07593P8337N1302K02969K90307
$$ 252150 308988 191120 367192 432060 351267 387762 695355 773692 824994 1027963 1318270
20980A318270K87117L47754K76449J43900j15104l5916N4426J65188R4109j99370
$$ 1318270 1605387 1953141 2229590 2373490 2258386 2222470 2276896 2442084 2536193 2336823
20970B336823k55727j24260m8311J12872P6283J46386J23594P9730J01206m0160
$$ 2336823 2081096 1956836 1908525 2021397 2097680 2244066 2367660 2447390 2548596 2508436
20960B508436L3934P5743n6601m12813l82383m35575k92317l89566j92003j69264
$$ 2508436 2542370 2618113 2561512 2148699 1766316 1330741 1038424 648858 456855 287591
20950B87591j90679r3590o3285j54510j47069J22859J29031J35019j8626k6376
$$ 287591 96912 3322 -59963 -214473 -361542 -238683 -109652 25367 6741 -19635
20940a9635n1967j26917j2414J0493p61M9390M9821j11167M2141J00443M36l6406
$$ -19635 -71602 -198519 -210933 -200440 -201201 -151811 -101990 -213157 -171016 -70573 -70137 -106543
20928a06543J52558l5661m5913j5631j6813r5207j50309Q2623J41593o9604j77078
$$ -106543 46015 10354 -35559 -51190 -68003 -163210 -313519 -230896 -89303 -158907 -335985
20917c35985M5933J1908K4817J01794J83028J87217k4127j36515j59987k14986
$$ -335985 -290052 -278144 -253327 -151533 31495 218712 194585 58070 -101917 -316903
20907c16903j37517N9734Q9962N8692N9980P853p4861J74149l8805l381M6665
$$ -316903 -454420 -394686 -304724 -246032 -186052 -178199 -253060 -78911 -117716 -121097 -74432
20896g4432L0692l8727N0381j28884n5642n6399P0359l5303L9413K1116l8091
$$ -74432 -43740 -82467 -32086 -160970 -216612 -273011 -202652 -237955 -198542 -177426 -215517
20885b15517j9409J5324M9009j1145k8369J2363n5837n956o9062k4809P541L5697
$$ -215517 -234926 -219602 -170593 -181738 -210107 -197744 -253581 -259537 -328599 -353408 -345867 -310170
20873c10170N3887N4390j2815l5976n3055k6994J38128Q1754P3681L7817P7012
$$ -310170 -256283 -201893 -214708 -250684 -303739 -330733 -192605 -110851 -37170 647 77659
20862G7659J66859q7254k18538k54945l7659n856j5316j33655P6789J68753R1988
$$ 77659 244518 157264 -61274 -316219 -353878 -359734 -375050 -508705 -431916 -263163 -171175
20851a71175J36590N2330j57816k81976J21448P4176n8053j3464M7111R6922R141
$$ -171175 -34585 17745 -140071 -422047 -300599 -226423 -284476 -297940 -250829 -153907 -144766
20840a44766M5059q8320j2216l1016l4295j27383Q006K98345R9126l8163j27086
$$ -144766 -99707 -188027 -200243 -231259 -265554 -392937 -384931 -86586 12540 -25623 -152709
20829a52709N7560N4745j49093n3344J50749N5267K3468K1654O0006j02249k08550
$$ -152709 -95149 -40404 -189497 -242841 -92092 -36825 -13357 8297 68303 -33946 -242496
20818b42496J40418J32295J67526q1531j39364j30653R297K34631J27236n5741
$$ -242496 -102078 30217 197743 116212 -23152 -153805 -144508 90123 217359 161618
20808A61618k05003p934K9349K35508K48791P3135m7965m7775J38472L48675L02234
$$ 161618 -43385 -51319 -21970 213538 462329 535464 487499 439724 578196 926871 1229105
20797A229105J84443J16425n9351l1884j58399j98280N7516Q9676o6201J80670
$$ 1229105 1413548 1529973 1470622 1438738 1280339 1082059 1139575 1229251 1163050 1343720
20787A343720J43589L27796J44201k12199l10600k68490j94851j71139j23305
$$ 1343720 1487309 1815105 1959306 1747107 1436507 1168017 973166 802027 678722
20778F78722k42198K3125J37303J8059R2226J54731J1596m6575P7114O7923P6969
$$ 678722 436524 459649 596952 615011 707237 861968 873564 826989 904103 972026 1048995
20767A048995K97685K26600J78051o4531l07837k42835j33133k93k7238J40983
$$ 1048995 1346680 1573280 1751331 1686800 1378963 1136128 1002995 1002702 975464 1116447
20757A116447J81914K41259K55184j7490k29219l73253k91214j59173j41636p3479
$$ 1116447 1298361 1539620 1794804 1777314 1548095 1174842 883628 724455 582819 509340
20747E09340K7690j25641j44826q5544m713j43374j68888N8248K0096k3428K373
$$ 509340 537030 411389 266563 181019 176306 32932 -135956 -77708 -57612 -81040 -78667
20736g8667O3632Q7297l1646k44665j86349j1758O9293J41469n6384m1696J32942
$$ -78667 -15035 72262 40616 -204049 -390398 -402156 -332863 -191394 -247778 -289474 -156532
20725a56532J16463O7869l7981j24770m869j0318j77636M5063N4577m6353N409
$$ -156532 -40069 27800 -10181 -134951 -139820 -150138 -327774 -282711 -228134 -274487 -269078
20714b69078P3592o2952j30677J20777Q9286o5272p9745j09254K581j3613J9218
$$ -269078 -195486 -258438 -389115 -268338 -179052 -244324 -324069 -433323 -430742 -444355 -425137
20703d25137Q1656N921K6657R5382R8468j5966p2986O4096k8076R468r1628r6344
$$ -425137 -343481 -337560 -310903 -215521 -117053 -133019 -206005 -141909 -169985 -160517 -252145 -348489
20691c48489M577N0762R2878J36030R4008k284o913r7739l5960o270J832o5151
$$ -348489 -343912 -293150 -200272 -64242 29766 27482 20569 -77170 -113130 -119400 -117568 -182719
20679a82719p9987p7436K2589O1748J89204N0495R2758K05661M8597M4820J91794
$$ -182719 -262706 -340142 -317553 -255805 -66601 -16106 76652 282313 330910 375730 567524
20668E67524Q9579q7362k56911n4606N4030N4969J44902Q2335k6395M2213M8902
$$ 567524 657103 569741 312830 258224 312254 367223 512125 594460 568065 610278 659180
20657F59180j0443K7312J0961J43442j21821k60711N0276M8283j8386j16354q5290
$$ 659180 648737 676049 687010 830452 708631 447920 498196 546479 528093 411739 326449
20646C26449j56806j90368L4194R593l4168m6933J05787q1790o4630K36312J37037
$$ 326449 169643 -20725 13469 23062 -11106 -58039 47748 -34042 -98672 137640 274677
20635B74677j82843m2053R1017p2787m4566O3940J4684J03499J57796k9611j34610
$$ 274677 91834 49781 140798 68011 23445 87385 102069 205568 363364 333753 199143
20624A99143k68431j58702J03817M7855L9195M7965Q8173O5596P7731J9757j07703
$$ 199143 -69288 -227990 -124173 -76318 -37123 10842 99015 164611 242342 262099 154396
20613A54396O445J58983J29205L2713J18099j1612j42107P017P4325O628j5651
$$ 154396 160841 319824 449029 481742 599841 588229 446122 453139 527464 534092 518441
20602E18441L1106Q1837n3054k48360j38878q7294K02047J63257M9487K5413K4134
$$ 518441 549547 631384 578330 329970 191092 103798 305845 469102 518589 544002 568136
20591E68136Q7000k880l6448m1741M9798q5696l1763n6961K1968l7464m4071M7945
$$ 568136 655136 652256 615808 574067 623865 538169 506406 449445 471413 433949 389878 437823
20579D37823O2061j71205j1291J46044K2122O3628J24422R2198m1980J293J0116
$$ 437823 499884 328679 317388 463432 485554 549182 673604 765802 723822 725115 735231
20568G35231N0973r1613j30112k25359j80540m9578p189j4666O929Q2954Q6371
$$ 735231 786204 694591 564479 339120 158580 109002 101813 87147 94076 177030 263401
20557B63401M4446j135K051j08994j12470m10J6660o0739j06984m5982J2984J28119
$$ 263401 307847 306712 308763 199769 87299 86889 103549 42810 -64174 -110156 -97172 30947
20545C0947o2476j02886k80030p1216K60566O8145K3141J29898m047k23434j634
$$ 30947 -31529 -134415 -414445 -485661 -225095 -156950 -133809 -3911 -7958 -231392 -233026
20534b33026M9548l3253R5436O4744J27068p3193r1342M2048M4744o200J2685
$$ -233026 -183478 -216731 -121295 -56551 70517 -2676 -94018 -51970 -7226 -13426 -741
20523g41N9800J56298O6815m0368j05196O0899J64643J11942l5176J8386n4600
$$ -741 59059 215357 282172 241804 136608 197507 362150 474092 438916 457302 402702
20512D02702N3878J83732J14465j0178J32243J31627J55509R1284Q5783K61513
$$ 402702 456580 640312 754777 744599 876842 1008469 1163978 1255262 1341045 1602558
20502A602558M71461M85587L73429K05868J26267L1044J3649J27460L95611J99933
$$ 1602558 2074019 2559606 2933035 3138903 3265170 3296214 3309863 3437323 3832934 4032867
20492D032867j87841l00131j15162J6898J72446K91139M80267L93688K35355j50851
$$ 4032867 3845026 3544895 3429733 3446631 3619077 3910216 4390483 4784171 5019526 4868675
20482D868675r2428q1093J90026P7352j31202k13733j80893l59968j70295j8944
$$ 4868675 4776247 4695154 4885180 4962532 4831330 4617597 4436704 4076736 3906441 3887497
20472C887497j48471k6974J26298J92171J5390P5740M2435P7199M86805L33322
$$ 3887497 3739026 3712052 3838350 4030521 4045911 4121651 4164086 4241285 4728090 5061412
20462E061412J29245J90869M04040L39269K82347M21904N87100O29924P23444
$$ 5061412 5190657 5381526 5785566 6124835 6407182 6829086 7416186 8046110 8769554
20453H769554Q10871P72112Q57206R54179Q82710N08574M90766P76616Q77141
$$ 8769554 9580425 10352537 11209743 12163922 13046632 13555206 14045972 14822588 15699729
20444A5699729R24507R68338R42847J128867J484926J651029J908705J999573
$$ 15699729 16624236 17592574 18535421 19664288 21149214 22800243 24708948 26708521
20436B6708521K085274K362413K739768K892807L007971L171777L791323M647559
$$ 26708521 28793795 31156208 33895976 36788783 39796754 42968531 46759854 51407413
20428E1407413N559240O915984Q596761J0676416J3726670J7566951K2712954
$$ 51407413 56966653 63882637 72479398 83155814 96882484 114449435 137162389
20421A37162389K9931885M0390427N4032613O7269785P0439725N2970584K0186103
$$ 137162389 167094274 207484701 261517314 328787099 399226824 452197408 472383511
20414D72383511m825176m188693J3176309K1926194N663376k6268980m7350027
$$ 472383511 467558335 463369642 476545951 498472145 504135521 477866541 430516514
20407D30516514m2721355j9785230P888336L3277532M9608037M5927880J9229847
$$ 430516514 387795159 368009929 375898265 409175797 458783834 504711714 523941561
20400E23941561j2767139k4280360j1402957M594943n81987l0234106o2858352
$$ 523941561 511174422 486894062 475491105 480086048 479504061 449269955 386411603
20393C86411603p4770943o5138798m8512937l4824831k5604552j9508039j5278117
$$ 386411603 311640660 246501862 197988925 163164094 137559542 118051503 102773386
20386A02773386j2118659r871627q344875p059562o105673n415376m614859m087613
$$ 102773386 90654727 80783100 72438225 65378663 59272990 53857614 49242755 45155142
20378D5155142l588348l136873k861361k663073k453239j968032j654549j731742
$$ 45155142 41566794 38429921 35568560 32905487 30452248 28484216 26829667 25097925
20370B5097925j504423j190424p14297q37912q92664r75759j060404p75663n43751
$$ 25097925 23593502 22403078 21688781 20850869 19958205 18982446 17922042 17146379 16602628
20361A6602628o05338n93144q23332j179497r29739p27951p00978m89340m36822
$$ 16602628 15997290 15404146 14580814 13401317 12471578 11743627 11042649 10553309 10116487
20352A0116487l30593k08957j77584m30257l72781m05017m42916l20010j31751
$$ 10116487 9785894 9576937 9399353 8969096 8596315 8191298 7748382 7428372 7296621
20343G296621j35216j85775j96800j65389j99529j42962j32655k15963k02348
$$ 7296621 7161405 6975630 6778830 6613441 6413912 6270950 6138295 5922332 5719984
20334E719984j29502J0892j51555j80679j31664o2219j86027j99415j09834j41623
$$ 5719984 5590482 5601374 5449819 5269140 5137476 5075257 4889230 4689815 4579981 4438358
20324D438358p1973Q4280N6942L3287J15695J32240J60147J88357Q0109Q4610
$$ 4438358 4366385 4450665 4507607 4540894 4656589 4788829 4948976 5137333 5217442 5302052
20314E302052K59490J34330j23351l1532j00505q1683j6j19967J27202K04090
$$ 5302052 5561542 5695872 5572521 5540989 5440484 5358801 5358785 5238818 5366020 5570110
20304E570110K86491K16836J22370k52592k79899k96050k92494j18219m9008K3129
$$ 5570110 5856601 6073437 6195807 5943215 5663316 5367266 5074772 4956553 4907545 4930674
20294D930674j55762L587J78406J49014J44082J85686K12190J42700K80428K66431
$$ 4930674 4774912 4778499 4956905 5105919 5250001 5435687 5647877 5790577 6071005 6337436
20284F337436N56198M82390L80915J25871k51767k51494M6615K36613J96734L05666
$$ 6337436 6893634 7376024 7756939 7882810 7631043 7379549 7426164 7662777 7859511 8165177
20274H165177O47875P06180N23300L63098L36467L36427K32938L79056J54847
$$ 8165177 8813052 9519232 10042532 10405630 10742097 11078524 11311462 11690518 11845365
20265A1845365Q8423J92492L12863L94048O88030R42940J005630J082661J009128
$$ 11845365 11933788 12126280 12439143 12833191 13521221 14464161 15469791 16552452 17561580
20256A7561580J029497J055354R37485R73672R60022J119986J437217K111961
$$ 17561580 18591077 19646431 20583916 21557588 22517610 23637596 25074813 27186774
20248B7186774K666626L074424L557564M268408N388266O676445P714314R679824
$$ 27186774 29853400 32927824 36485388 40753796 46142062 52818507 60532821 70212645
20240G0212645J2629413J6539726K2198964L0187709M0710531N2917507N9860434
$$ 70212645 82842058 99381784 121580748 151768457 192478988 245396495 305256929
20233C05256929M9310377J6368039k3114681m4862337m1366471k4653121o711349
$$ 305256929 354567306 370935345 347820664 302958327 261591856 236938735 230227386
20226B30227386R657320K6203989M1675154M8516718L4292656l306279m3904698
$$ 230227386 239884706 266088695 307763849 356280567 390573223 387266944 343362246
20219C43362246o2534802n6635346m1128031k7895039j8424451j1453427o371504
$$ 343362246 280827444 224192098 183064067 155169028 136744577 125291150 118919646
20212A18919646k260965R42916M190210Q327567J3734385K0729671L0378892M3203855
$$ 118919646 116658681 117601597 121791807 130119374 143853759 164583430 194962322 238166177
20204B38166177N5862539N8597334L9603581m5652l7749519n0633481m0045571
$$ 238166177 294028716 352626050 392229631 392183979 354434460 303800979 263755408
20197B63755408k1115578k989316J3731105L0418053M4118688M4775183K1183941
$$ 263755408 242639830 239650514 253381619 283799672 327918360 372693543 393877484
20190C93877484k0690148n5901264o5776430n5439942m0347655k8762474k1056477
$$ 393877484 373187336 317286072 251509642 196069700 155722045 126959571 105903094
20183A05903094j5772288j2126635r528872p586737o449245n690654m742643m027707
$$ 105903094 90130806 78004171 68475299 60888562 54439317 48748663 44006020 39978313
20175C9978313l307120k916891k513212k274530j946268j686819j459722j211401
$$ 39978313 36671193 33754302 31241090 28966560 27020292 25333473 23873751 22662350
20167B2662350j022080q38472r01542r85302j026186j292307j026217q24963p44311
$$ 22662350 21640270 20801798 19900256 18914954 17888768 16596461 15570244 14745281 14000970
20158A4000970m04515k52153j58192l61276n97489p02718r09016o27188m46224
$$ 14000970 13596455 13344302 13186110 12824834 12227345 11524627 10615611 9988423 9542199
20149I542199m58335m94675l12499j51746j70545m12748l86265j71385j66830
$$ 9542199 9083864 8589189 8276690 8124944 7954399 7541651 7155386 6984001 6817171
20140F817171l63506j85706k19993j18325m7526l1413m4532j60836k03774k73622
$$ 6817171 6453665 6267959 6047966 5929641 5882115 5850702 5806170 5645334 5441560 5167938
20130E167938j99909j59730j03149m9651k01432k55541l3877j05120n4350J69157
$$ 5167938 4968029 4808299 4705150 4655499 4454067 4198526 4164649 4059529 4005179 4174336
20120D174336J5493p1871r2862n212j3390n0472j46662q1593j00847j75034J07000
$$ 4174336 4189829 4117958 4025096 4019884 4006494 3956022 3809360 3727767 3626920 3451886 3558886
20109C558886m378k1739m9086k0490L9821l6316J520K0617M0783j34362j51549
$$ 3558886 3554508 3532769 3483683 3463193 3503014 3466698 3468218 3488835 3529618 3395256 3243707
20098C243707j03411q9226Q995J21466J7797j07865k4063M9494O0888n9161j77402
$$ 3243707 3140296 3051070 3060065 3181531 3199328 3091463 3067400 3116894 3177782 3118621 2941219
20087B941219j99538j01688R8365l9861K11748M4786m9815r6348j27434k1299
$$ 2941219 2741681 2639993 2738358 2698497 2910245 2955031 2905216 2808868 2681434 2660135
20077B660135j44808k80941k54689q9078K2228j7838M9382M4257J39998J02505
$$ 2660135 2515327 2234386 1979697 1890619 1912847 1895009 1944391 1988648 2128646 2231151
20067B231151n5250j86603p0614l3991p5639o9808r0693k4854J31286j03439K5612
$$ 2231151 2175901 1989298 1918684 1884693 1809054 1739246 1648553 1623699 1754985 1651546 1677158
20056A677158p408j27749n5667N6810N4637J31441Q0007p5727k22660j65892k04612
$$ 1677158 1669750 1542001 1486334 1543144 1597781 1729222 1809229 1733502 1510842 1344950 1140338
20045A140338j53920J40482N4387n5914j5830p6276J28555K0981k27899j2734
$$ 1140338 986418 1126900 1181287 1125373 1109543 1033267 1161822 1182803 954904 942170
20035I42170k08281p0864P37r9604K9428k8979J40298J22345n8502q7228J13610
$$ 942170 733889 663025 663762 564158 593586 564607 704905 827250 768748 681520 795130
20024G95130j25531M984M6421O4311n1933r2622L5489l9641J33874J245j06363
$$ 795130 669599 674583 721004 785315 733382 640760 676249 636608 770482 771727 665364
20013F65364j65288N3791Q0159O5481m4771L4513n9698j39317L9949N2115k1062
$$ 665364 500076 553867 634026 699507 654736 689249 629551 490234 530183 582298 561236
20002E61236r8845o7923j03927P2740J1640J06156K17611J46907j35877P6232
$$ 561236 462391 394468 290541 363281 374921 481077 698688 845595 709718 785950
19992G85950J0211j89525N285J72293n2926j09252m9329j3663q10p5995l1274
$$ 785950 796161 606636 611921 784214 731288 622036 572707 559044 558234 482239 450965
19981D50965K42652N6058J14069l3039q9352L6275n0230o9715j38754j12756k7620
$$ 450965 693617 749675 863744 830705 741353 777628 727398 657683 518929 406173 378553
19970C78553O5687Q1853O3003j08885j84607K07745K23039j30474k2738j03785
$$ 378553 444240 526093 589096 480211 295604 503349 726388 595914 573176 469391
19960D69391L6514j1217M7441J04716N137R3974J4434k18596l43108K8607J71699
$$ 469391 505905 494688 542129 646845 651982 745956 760390 541794 198686 227293 398992
19949C98992J31332J74483L4160j36740l4227P3208m3080k5821r46L1788L6930
$$ 398992 530324 704807 738967 602227 568000 641208 598128 572307 571361 603149 640079
19938F40079j55306j09566L1933M2959l5258j06750n5872n5075j5685J7898K01849
$$ 640079 484773 375207 407140 450099 414841 308091 252219 197144 181459 199357 401206
19927D01206J05213r8166m4832J03904p2303j3985J07701M0258M2870k5021L721
$$ 401206 506419 408253 363421 467325 395022 381037 488738 528996 571866 546845 550566
19916E50566p2468J00189k4479P0724J30550r6638q8569q2835N7743M8218Q6479
$$ 550566 478098 578287 553808 624532 755082 658444 569875 487040 544783 593001 679480
19905F79480O3284M2038r3921o4917j36676Q785R420O9110P4238n8422M6793q2653
$$ 679480 742764 784802 690881 625964 489288 498073 507493 576603 650841 592419 639212 556559
19893E56559j1178J49298p8973j06249o1423J20165J7281O3288M8815k22719o7802
$$ 556559 545381 694679 615706 509457 448034 568199 585480 648768 697583 474864 407062
19882D07062O7739j62997j17176k7513J95463O139j0312L6999J36260J02739k17822
$$ 407062 474801 311804 194628 167115 362578 368717 358405 395404 531664 634403 416581
19871D16581P6847o5945p9971Q9174J04192j07194O1052J44594J76453O2964j16057
$$ 416581 493428 427483 347512 436686 540878 433684 494736 639330 815783 878747 762690
19860G62690r7790M4115P2431n3952l6502J27524J70610J72181J33788K21665
$$ 762690 664900 709015 781446 727494 690992 818516 989126 1161307 1295095 1516760
19850A516760K33523L59862L40774K76214K04440M2848p7848k0728L0530O5506
$$ 1516760 1750283 2110145 2450919 2727133 2931573 2974421 2896573 2875845 2906375 2971881
19840B971881j44902r6141j96755j84204R5637J83738K69278J81975J94248j84306
$$ 2971881 2826979 2730838 2534083 2349879 2445516 2629254 2898532 3080507 3274755 3090449
19830C090449k48701j5792N4149o9852k10566k52297l96104l54413k84060l02533
$$ 3090449 2841748 2825956 2880105 2810253 2599687 2347390 1951286 1596873 1312813 1010280
19820A010280k20821p2889q2624j58762j54627p8753p9319J76933N5740k3084
$$ 1010280 789459 716570 633946 475184 320557 241804 162485 339418 395158 372074
19810C72074j11652k03225O377J92720Q9142n4903n1821P2505K8198J19856O5906
$$ 372074 260422 57197 63574 256294 345436 290533 238712 311217 339415 459271 525177
19799E25177Q3329r9262n0145o577J1981P725j02059k24124j04730p6840K8968
$$ 525177 608506 509244 459099 452522 464503 472228 370169 146045 41315 -35525 -6557
19788f557O5915L8861J96516O894K3964N9879J06789J29185q3857j12089r4403
$$ -6557 59358 98219 294735 301629 325593 385472 492261 621446 537589 425500 331097
19777C31097k7315J7853R0983K6113j8563k0673j28772o128R6246o5382p4359
$$ 331097 303782 321635 412618 438731 420168 399495 270723 264595 360841 295459 221100
19766B21100J00968n6826M123Q6136q0536J5025J56486n5881j07747j52676r9635
$$ 221100 322068 265242 269365 355501 274965 289990 446476 390595 282848 130172 30537
19755C0537j7357K7065L2647n432m4572L7736Q2733j7932J8602M3066J52315Q6912
$$ 30537 13180 40245 72892 67460 22888 60624 143357 125425 144027 187093 339408 426320
19743D26320j58915q6617p8758R0792R2946M3988q9482o4097O4023J93844k6366
$$ 426320 267405 180788 102030 192822 285768 329756 240274 176177 240200 434044 407678
19732D07678q3562j3588J313N2185q1808m6342o8241P2954k0268q4294M8197M7007
$$ 407678 324116 310528 311841 364026 282218 235876 167635 240589 220321 136027 184224 231231
19720B31231P3958q9353p2402J7504m3384l2536N0326N9615k668o5065j8036Q9739
$$ 231231 305189 215836 143434 160938 117554 85018 135344 194959 192291 127226 109190 198929
19708A98929N700O2191j56437o1186J2895Q927R9496J9099L0815o5779m2828Q282
$$ 198929 204629 266820 110383 49197 62092 71019 170515 189614 220429 154650 111822 120104
19696A20104j6472K0212j33018o5463j3139J89543K30995J30599k34835k509j09096
$$ 120104 103632 123844 -9174 -74637 -87776 101767 332762 463361 228526 226017 116921
19685A16921p2616M6079J3477m9714j9798J24946Q7267J36348J73375J27622j01726
$$ 116921 44305 90384 103861 54147 34349 159295 246562 382910 556285 683907 582181
19674E82181m8602o0831q5795J65182M2769J00061J02933O5567J01558K37380
$$ 582181 533579 472748 386953 552135 594904 694965 797898 863465 965023 1202403
19664A202403K82325L55588L3225N250J9808j55043j45185j1954J34034j5031
$$ 1202403 1484728 1840316 1873541 1878791 1898599 1743556 1598371 1586417 1720451 1705420
19654A705420p2464P1410K71922J11457j25684k60739j40707k33113j78275J4249
$$ 1705420 1632956 1704366 1976288 2087745 1962061 1701322 1560615 1327502 1149227 1163476
19644A163476j8473l21862j36017n1015K25J16636K10995J52885J26321K94462
$$ 1163476 1145003 823141 687124 636109 636334 752970 963965 1116850 1243171 1537633
19634A537633J44427R3331J12014N7967l137j33552j89169j30553P9334J12220
$$ 1537633 1682060 1775391 1887405 1945372 1942235 1808683 1619514 1488961 1568295 1680515
19624A680515L3745m7196J63231K07298N0795Q422k18975m10489m15351k13089
$$ 1680515 1714260 1667064 1830295 2037593 2088388 2096810 1877835 1467346 1051995 838906
19614H38906k45289q2490r5587k7980m0306J6287j19840j98063j79748l1975N7470
$$ 838906 593617 511127 415540 387560 347254 363541 243701 45638 -134110 -166085 -108615
19603a08615J23598J41753K9680M1104r804j65649J00020J10495L1800k4692l4553
$$ -108615 14983 156736 186416 227520 217716 52067 152087 262582 294382 269690 235137
19592B35137j41078n3517j5593M1517k1936J01970M6667q1980N8695P8067k6035
$$ 235137 94059 40542 24949 66466 44530 146500 193167 111187 169882 247949 221914
19581B21914J686M2098M6427r0540K5393J09822J17495k4708m3408k5248q3026
$$ 221914 223600 265698 312125 221585 246978 356800 474295 449587 406179 380931 297905
19570B97905m283q7078j7411N3080m2165p400q250q2962R499J16630j83l5620
$$ 297905 293622 206544 189133 242213 200048 192648 184398 101436 110935 227565 227382 191762
19558A91762l6198q065J08615M1829r14j45573j67543J34975N3269n1696q802
$$ 191762 155564 147499 256114 297943 297029 151456 -16087 118888 172157 120461 111659
19547A11659j43639j9327k8179J2550l4062j12252k30N0875Q0085k6991q1398
$$ 111659 -31980 -51307 -79486 -66936 -100998 -213250 -213480 -162605 -82520 -109511 -190909
19536a90909J64698J76941O551J40947P6262j42882j20687o8824n3989L2669O5559
$$ -190909 -26211 150730 157281 298228 374490 231608 110921 42097 -11892 20777 86336
19525H6336J0736Q5287M9001J08602J50329m8096M9411k1825J8050P2767N3133
$$ 86336 97072 182359 231360 339962 490291 442195 491606 469781 487831 560598 613731
19514F13731K29558K60187J03630J08640k0911k10828j95224j13266R4755R8752
$$ 613731 843289 1103476 1207106 1315746 1294835 1084007 888783 775517 870272 969024
19504I69024P1754Q7584J31288L51154J90987P4812k15765j71309k63156k90893
$$ 969024 1040778 1128362 1259650 1610804 1801791 1876603 1660838 1489529 1226373 935480
19494I35480J1509p7105j67890r6540J09186K64396P2957p1302L6654p2463j83586
$$ 935480 946989 869884 701994 605454 714640 979036 1051993 980691 1017345 944882 761296
19483G61296j70506o0558l1733O6832N575o8850m458o8873o4816j34504k8000
$$ 761296 590790 530232 498499 565331 570906 502056 497598 428725 363909 229405 201405
19472B01405M9483M9746n3944K1701q853J24739P4140K503J18503J85975K95807
$$ 201405 250888 300634 246690 268391 259538 384277 458417 460920 579423 765398 1061205
19461A061205J54900o7759J5671j03351r7987r1785o629P9352K12080J14511J36495
$$ 1061205 1216105 1148346 1164017 1060666 962679 870894 864265 943617 1155697 1270208 1406703
19450A406703J52966M0099l5761J00099j31571l12652k35196n187j151j16931
$$ 1406703 1559669 1599768 1564007 1664106 1532535 1219883 984687 979500 978349 861418
19440H61418j48164Q95K07661K10932O9258R3469l00149l36748k03281k34849
$$ 861418 713254 714149 921810 1132742 1202000 1295469 995320 658572 455291 220442
19430B20442q0513k8552q7770J7030L0768M7258J02026j06069L9251K71036J53171
$$ 220442 139929 111377 23607 40637 71405 118663 220689 114620 153871 424907 578078
19419E78078j39609l70013m8365J60349m2739r8235n0494n0715p4321N4752J1002
$$ 578078 438469 68456 20091 180440 137701 39466 -11028 -61743 -136064 -81312 -70310
19408g0310J46594J29493j12384n7541P4371J91826j57195l01911n8658Q3455
$$ -70310 76284 205777 93393 35852 110223 302049 144854 -157057 -215715 -132260
19398a32260J62897l866j37839k6705O0857j44497N4045R6913K920L1265K3732
$$ -132260 30637 26771 -111068 -137773 -76916 -221413 -167368 -70455 -67535 -36270 -12538
19387a2538L5789k5449k1117Q3015Q690m0840P2331N6832K6287k0542j16729q9681
$$ -12538 23251 -2198 -23315 59700 68390 27550 99881 156713 183000 162458 45729 -43952
19375d3952k167p6027P5417N7696k4190J0157k3827K3968J54783K4239l0290m4222
$$ -43952 -46119 -122146 -46729 10967 -13223 -3066 -26893 -2925 151858 176097 145807 101585
19363A01585Q242k6521k4526P6583K0562l3779q3038q5123J31295q9230J02496
$$ 101585 109827 83306 58780 135363 155925 122146 39108 -46015 85280 -3950 98546
19352I8546k3912L155K5602j6278K0489Q2043J11726r9403q924j66980m6038N9707
$$ 98546 74634 77789 103391 87113 107602 189645 301371 201968 193044 26064 -19974 39733
19340C9733K1121J13147j69217j0280J36612p6176K22908J75753j18996q8971
$$ 39733 60854 174001 4784 -5496 131116 54940 277848 453601 334605 245634
19330B45634P9337M2258N0656r3743j785m9090r6695O6530L5925J42911L1555
$$ 245634 324971 367229 417885 324142 322357 273267 176572 243102 279027 421938 453493
19319D53493K7062K8364n4k0462M5930N235K6506k0210p087K988J14318K54027
$$ 453493 480555 508919 508865 488403 534333 539568 566074 545864 538777 541765 656083 910110
19307I10110K54655J35217N9875j01782J39822J50721J37531J46925K74561J95102
$$ 910110 1164765 1299982 1359857 1258075 1397897 1548618 1686149 1833074 2107635 2302737
19297B302737K34861M41681M43939M00588L42953J50485K64984N68474N47427
$$ 2302737 2537598 2979279 3423218 3823806 4166759 4317244 4582228 5150702 5698129
19288E698129M47166K53114K61581K24288J6500j03767l13953l20791j53778j97049
$$ 5698129 6145295 6398409 6659990 6884278 6900778 6797011 6483058 6162267 6008489 5811440
19278E811440l29839l45410m08333n10844m04597l69461m50904l30066j74040
$$ 5811440 5481601 5136191 4727858 4217014 3812417 3442956 2992052 2661986 2487946
19269B487946n0945j99648l09677k09072j11994o0521J7615j06041j01041o282
$$ 2487946 2437001 2237353 1927676 1718604 1606610 1546089 1563704 1457663 1356622 1350340
19259A350340j11810j32250k6874L6169l7640q0513j10112p8573R247K2700N9318
$$ 1350340 1238530 1106280 1079406 1115575 1077935 997422 887310 808737 817984 840684 900002
19248I00002J6340M1295r4813L086R6520j45872r080M9315J39148M904j92083
$$ 900002 916342 957637 862824 865910 962430 816558 807478 856793 995941 1000845 808762
19237H08762j3891j11419k20447o8942j6839J63941j20137j2206L4534m7684J9574
$$ 808762 794871 683452 463005 394063 377224 541165 421028 408822 443356 395672 415246
19226D15246R1665Q4798l400R625k6191j18717j31859l1745j6392n9564N8461
$$ 415246 506911 591709 588309 597934 571743 453026 321167 289422 273030 213466 271927
19215B71927J25247K8433M590l0761j00378O4112M7017K41940K23643j05542j06707
$$ 271927 397174 425607 430197 399436 299058 363170 410187 652127 875770 770228 663521
19204F63521J7541j3017r410Q843l4559p5420j5475J11976O7668L4607J79316
$$ 663521 681062 668045 658635 667478 632919 557499 542024 654000 721668 756275 935591
19193I35591J061q8161j41133o916q4358o8658J70485J4427P5014J4189R4665
$$ 935591 936652 848491 707358 700442 616084 547426 717911 732338 807352 821541 916206
19182I16206r180r3628j42286P5880p2173j89336p9710Q7441m2977j43278j82746
$$ 916206 907026 813398 671112 746992 674819 485483 405773 493214 450237 306959 124213
19171A24213J44242K9870R9449K05472K39441o3442j38950j50564n8437J15624
$$ 124213 268455 298325 397774 603246 842687 779245 640295 489731 431294 546918
19161E46918k3679O7491J9235O9972r2723j54436J5763P1397J61218K07516l8527
$$ 546918 523239 590730 609965 679937 587214 432778 448541 519938 681156 888672 850145
19150H50145J9636l6526j32537p653J24584O6299m9233r2865j52395j94330k6827
$$ 850145 869781 833255 700718 693065 817649 883948 834715 741850 589455 395125 368298
19139C68298J23914j11157O5893M2679J11141J22421j29004Q3671L0432k00699
$$ 368298 492212 381055 446948 489627 600768 723189 594185 677856 708288 507589
19129E07589j67938q3933J97566J39798P7141Q0867k7007n5769n7943o3947J750
$$ 507589 339651 255718 453284 593082 670223 751090 724083 668314 610371 546424 548174
19118E48174N4577j10012L7403k12062L3980R0097j69209K2151K32653J25905
$$ 548174 602751 492739 530142 318080 352060 442157 272948 295099 527752 653657
19108F53657l0355m0948k4556j02335j6447j4218L5589m6446O2973J14605q154
$$ 653657 623302 582354 557798 455463 439016 424798 460387 413941 476914 591519 583365
19097E83365R0864l594O4113p9665j58677P633J18928J21456J20691j10930j05453
$$ 583365 674229 670635 734748 655083 496406 504039 622967 744423 865114 754184 648731
19086F48731J68260K59449P5318Q9445q6464r3844n136o1970n4343j33080K6025
$$ 648731 816991 1076440 1151758 1241203 1154739 1060895 1055759 993789 939446 806366 832391
19075H32391N7234j5772l2367J09979J15576R2752o0932j19055j63011Q9044R5544
$$ 832391 889625 873853 841486 951465 1067041 1159793 1098861 979806 816795 905839 1001383
19064A001383L2813J19066J00793l1391r7753J24430K33110q006j8470K9624J66905
$$ 1001383 1034196 1153262 1254055 1222664 1124911 1249341 1482451 1474445 1455975 1485599 1652504
19053A652504R7159r486M3311n3866J04991K16831J95665J28576J42042K41079
$$ 1652504 1749663 1740177 1783488 1729622 1834613 2051444 2247109 2375685 2517727 2758806
19043B758806J72590J73628J96221K86115K73720L47003L32000L82697K04041
$$ 2758806 2931396 3105024 3301245 3587360 3861080 4208083 4540083 4922780 5126821
19034E126821K64207K15849L93762L30657K84046K88206O96784P75515Q61342
$$ 5126821 5391028 5606877 6000639 6331296 6615342 6903548 7600332 8375847 9237189
19025I237189R02233Q64894P32112P77901Q35457P62624Q33576R60758J352067
$$ 9237189 10139422 11004316 11736428 12514329 13349786 14112410 14945986 15906744 17258811
19016A7258811J739034K207105L044962L562260L805148M337728N519044P125919
$$ 17258811 18997845 21204950 24249912 27812172 31617320 35955048 41474092 48600011
19008D8600011R249054J2800552J8070903K5948907L5029266L7990111K3231558
$$ 48600011 57849065 70649617 88720520 114669427 149698693 187688804 210920362
19001B10920362n624602k7713882k8128537j6609592m807902N205501J5135559
$$ 210920362 205295760 177581878 149453341 132843749 128035847 133241348 148376907
18994A48376907K7079856L9604670M4708871L2681111J0859731k385667o370058
$$ 148376907 175456763 215061433 259770304 292451415 303311146 300925479 294555421
18987B94555421j9393962l8333768m3807826l2854905j8865262p446750K313357
$$ 294555421 275161459 236827691 193019865 160164960 141299698 133852948 136166305
18980A36166305J1951387K2140005K8391740J9839276o131953l2303102l9149230
$$ 136166305 148117692 170257697 198649437 218488713 212356760 180053658 140904428
18973A40904428l0546267k0333672j3467091r247380o450230m627004k741485
$$ 140904428 110358161 90024489 76557398 67310018 60859788 56232784 53491299
18966E3491299j062994K0791O63800J327032K369672L677765N362864P695147
$$ 53491299 52428305 52449096 53112896 54439928 56809600 60487365 65850229 73545376
18958G3545376J0985162J5965194K3001342L3041475M2443077L9550922J4919938
$$ 73545376 84530538 100495732 123497074 156538549 198981626 238532548 253452486
18951B53452486j9217917l5922481k9173147j4445670j530542R821248K1812269
$$ 253452486 234234569 198312088 169138941 154693271 153162729 162983977 184796246
18944A84796246L5639534M8011220M7276350K7975985N617468l149942j0669569
$$ 184796246 220435780 268447000 315723350 343699335 349316803 346166861 335497292
18937C35497292l1567995n0796689m8881760l2740897j6801171m548558O267337
$$ 335497292 303929297 253132608 204250848 171509951 154708780 150160222 156427559
18930A56427559J7186769K7701915K9705910J1716815k0757144m3983672m3642403
$$ 156427559 173614328 201316243 231022153 242738968 221981824 177998152 134355749
18923A34355749l1458179k0995593j4406940j0327046p694069n923491m742303
$$ 134355749 102897570 81901977 67495037 57167991 49473922 43550431 38808128
18916C8808128l880635l333596l214029k957043k715068k144625j794080j391500
$$ 38808128 34927493 31593897 28379868 25422825 22707757 20563132 18769052 17377552
18908A7377552j271190j181830j126445r95679q79692p60349p01548o47734n51949
$$ 17377552 16106362 14924532 13798087 12802408 11922716 11162367 10460819 9813085 9261136
18899I261136m27955m98991m80551k17298j60588l27002l44578l22910k80081
$$ 9261136 8833181 8334190 7853639 7636341 7475753 7148751 6804173 6481263 6201182
18890F201182r9270k34189k24520j67030j89024j98292m4325J37254j3381j01340
$$ 6201182 6101912 5867723 5643203 5476173 5287149 5088857 5044532 5181786 5168405 5067065
18880E067065k26623k20029j07921p2369j04482j38694r6376j37804k13439L1842
$$ 5067065 4840442 4620413 4512492 4440123 4335641 4196947 4100571 3962767 3749328 3781170
18870C781170j25173j11436k0635p8946m2648N3280J9324n3282k24043j90510
$$ 3781170 3655997 3544561 3523926 3444980 3402332 3455612 3474936 3421654 3197611 3007101
18860C007101j07765k0586Q8655J6519j4351J2769j3634M7632j5241m2531j10007
$$ 3007101 2899336 2878750 2967405 2983924 2969573 2982342 2968708 3016340 3001099 2958568 2848561
18849B848561j70705j09683o5737j92337r2953j1744j02341P6243J23212M4269
$$ 2848561 2677856 2568173 2502436 2310099 2217146 2205402 2103061 2179304 2302516 2346785
18839B346785L599M0030Q7777O5230j04753j797J0056m2686k1143j629J84167
$$ 2346785 2350384 2390414 2478191 2543421 2438668 2436871 2446927 2404241 2383098 2381469 2565636
18828B565636K25534J57097K15550l3408L32l1867l8384j6670p0514O1778j09750
$$ 2565636 2791170 2948267 3163817 3130409 3130741 3098874 3060490 3043820 2973306 3035084 2925334
18817B925334k09429l00831k20213r7922Q997j30048o4454j20755n7378J8568
$$ 2925334 2715905 2415074 2194861 2096939 2105936 1975888 1911434 1790679 1733301 1751869
18807A751869o6076R068K35662l4338o2681K05227J27620j9620J2507j8819J35516
$$ 1751869 1685793 1694861 1930523 1896185 1833504 2038731 2166351 2146731 2159238 2140419 2275935
18796B275935J70746K07607k3258O2910r079j11872m3236r4109j77110k88567
$$ 2275935 2446681 2654288 2631030 2693940 2684861 2572989 2529753 2435644 2258534 1969967
18786A969967j56933j2006N289o6042o8199j91712p8422J628K6358K86662K11295
$$ 1969967 1813034 1801028 1806317 1740275 1672076 1480364 1401942 1403570 1429928 1716590 1927885
18775A927885J60793j13150k27957k4227J24493J41375r5413k23191q8820L6248
$$ 1927885 2088678 1975528 1747571 1723344 1847837 1989212 1893799 1670608 1581788 1618036
18765A618036J02021J54105K14958K7427j24789l78933k40790j04960n393o3067
$$ 1618036 1720057 1874162 2089120 2116547 1991758 1612825 1372035 1267075 1261682 1198615
18755A198615n2611M8609j76049j58934j44941J62745J66579R4888J08963J95607
$$ 1198615 1146004 1194613 1018564 859630 714689 877434 1044013 1138901 1247864 1443471
18745A443471L6170J27866p7855k8901L4265J1249m9980j63070k97280l24528
$$ 1443471 1479641 1607507 1529652 1500751 1535016 1546265 1496285 1333215 1035935 711407
18735G11407j86157m467j5107M709J5872J15203J29716j44405n3485K7943J14621
$$ 711407 525250 520783 505676 510385 526257 641460 771176 626771 573286 601229 715850
18724G15850J7634N309n0919j38936M9075l0470K7386K8341O9265Q5430j16785
$$ 715850 733484 738793 687874 548938 598013 567543 594929 623270 692535 777965 661180
18713F61180q289l0935M5417Q839j04691k9606K3473n1881K3156r7077o4160N3310
$$ 661180 652891 621956 667373 676212 571521 541915 565388 513507 536663 439586 375426 428736
18701D28736J03577R4017j28388p6242m9095k7895R0477L3461K8546n113j04495
$$ 428736 532313 626330 497942 421700 372605 344710 435187 468648 497194 492081 387586
18690C87586q1940j5163L740m6764M7005O991J10480j0876j07552L9862l0876
$$ 387586 305646 290483 294223 247459 294464 301455 411935 401059 293507 333369 302493
18679C02493j1722L2890N2295J70343J31042R9665J49035j20486k88065m7600
$$ 302493 290771 323661 375956 546299 677341 777006 926041 805555 517490 469890
18669D69890j26534m7448N9422J33330J35339K1906J42510J72232p7719q2706
$$ 469890 343356 295908 355330 488660 623999 645905 788415 960647 882928 800222
18659H00222j20450O146J13782m2904k0790j01869o2701j15474j69386N4525q664
$$ 800222 679772 685918 799700 756796 736006 634137 571436 455962 286576 341101 332437
18648C32437P8529K02394J05793j23162n6650o4742o0069J8634l6354J6634M2747
$$ 332437 410966 613360 719153 595991 539341 474599 414530 433164 396810 413444 456191
18637D56191K4616q4073k9813J74663J52994q8953k6373o5358J3986R8275j13532
$$ 456191 480807 396734 366921 541584 694578 605625 579252 513894 527880 626155 512623
18626E12623q4593Q3273Q0515J8735Q7491j79740P6646P4885L1333J17158p4073
$$ 512623 428030 511303 591818 610553 698044 518304 594950 669835 701168 818326 744253
18615G44253n1641n8073N9384R2960j35636n1720J0117p2519N849L1437N6160
$$ 744253 692612 634539 693923 786883 651247 599527 609644 537125 542974 574411 630571
18604F30571N5574m2682J2742K8055J24381L13902J26802O3710K8402J77882M01178
$$ 630571 686145 643463 656205 684260 808641 1122543 1249345 1313055 1341457 1519339 1920517
18593A920517M15242M13962M59960K15011J43108Q9558J70059K17928K73145J51714
$$ 1920517 2335759 2749721 3209681 3424692 3567800 3657358 3827417 4045345 4318490 4470204
18583D470204J45079o8316m16780o41725m78200l49579k04038R5904J68304K98045
$$ 4470204 4615283 4546967 4130187 3488462 3010262 2660683 2456645 2552549 2720853 3018898
18573C018898K11618R5905J07510l5698J80460L59843M05826K27674K45421K74859
$$ 3018898 3230516 3326421 3433931 3398233 3578693 3938536 4344362 4572036 4817457 5092316
18563E092316M37373P30478Q84533N44137j26409m18077n29593o49352k99370
$$ 5092316 5529689 6260167 7144700 7688837 7562428 7144351 6614758 5965406 5666036
18554E666036k16702l15602m47405n66031n30180j80112j58248k65165j89936
$$ 5666036 5449334 5133732 4686327 4120296 3590116 3410004 3251756 2986591 2796655
18545B796655k74528j83863j33284p2655r8858k46644k15848j81200L9238J04563
$$ 2796655 2522127 2338264 2204980 2132325 2033467 1786823 1570975 1389775 1429013 1533576
18535A533576J13912J12005P6214l7048M7044Q6155N5574Q7986J10042P9197J09290
$$ 1533576 1647488 1759493 1835707 1798659 1845703 1931858 1987432 2075418 2185460 2264657 2373947
18524B373947K50539L17435L53799M55945J74331n7560r1444o6017K8702K10525
$$ 2373947 2624486 2941921 3295720 3751665 3925996 3868436 3776992 3710975 3739677 3950202
18514C950202J84235L98027M28065K56713J32831k23211o18229l22293l54878
$$ 3950202 4134437 4532464 4960529 5217242 5350073 5126862 4508633 4186340 3831462
18505C831462m06041k03497p9303P1416J32379N2975j43354j3590k0347j28610
$$ 3831462 3425421 3221924 3142621 3214037 3346416 3399391 3256037 3242447 3222100 3093490
18495C093490l02796k65446m4687o3559K2656M5776P7450m0800j424l2962j94197
$$ 3093490 2790694 2525248 2480561 2417002 2439658 2485434 2562884 2522084 2520660 2487698 2293501
18484B293501k07743n8933p5711O8946K77039J63008K22012J26301m9327j01989
$$ 2293501 2085758 2026825 1951114 2020060 2297099 2460107 2682119 2808420 2759093 2657104
18474B657104J1188j19640k97038k32824o2469O2177J93225P1246J6043K91782
$$ 2657104 2668292 2548652 2251614 2018790 1956321 2018498 2211723 2282969 2299012 2590794
18464B590794J23466J8007J47215J80362q8476k71878k55922l603k6088k01369
$$ 2590794 2714260 2732267 2879482 3059844 2971368 2699490 2443568 2439965 2413877 2212508
18454B212508p0086J51838J59010J60314J96719N9806o4749o8901j77729M970
$$ 2212508 2142422 2294260 2453270 2613584 2810303 2870109 2805360 2736459 2558730 2563700
18444B563700J35446P7491J59228K58176K26394J11544o282l02102k28953K3684
$$ 2563700 2699146 2776637 2935865 3194041 3420435 3531979 3525697 3223595 2994642 3018326
18434C018326k7788P129j40097j37660J96435M33089M37649K44185J12099J25951
$$ 3018326 2990538 2997667 2857570 2719910 2916345 3349434 3787083 4031268 4143367 4269318
18424D269318j61484l20645j54758l5727K7110J4009J253m0633J42603L39213
$$ 4269318 4107834 3787189 3632431 3596704 3623814 3637823 3639076 3598443 3741046 4080259
18414D080259K57971P0469k41602m16374m97405m74877j45930n8401j98374j08713
$$ 4080259 4338230 4408699 4167097 3750723 3253318 2778441 2632511 2574110 2375736 2267023
18404B267023k3924j07943n2357O8419R4458P837j16211N1236J39502J07654J76046
$$ 2267023 2243099 2135156 2082799 2151218 2245676 2253513 2137302 2188538 2328040 2435694 2611740
18393B611740K97235J50729J69561K16370K93138K42816L67997K71068K1965j49563
$$ 2611740 2908975 3059704 3229265 3445635 3738773 3981589 4349586 4620654 4642619 4493056
18383D493056P8080o937j21940j39495j93794j97037j89712Q0284K09355L73349
$$ 4493056 4571136 4564199 4442259 4302764 4108970 3911933 3722221 3802505 4011860 4385209
18373D385209K84283J83413K76897K78880K15178O6720o1235K3114q7809M0376
$$ 4385209 4669492 4852905 5129802 5408682 5623860 5690580 5629345 5652459 5564650 5605026
18363E605026J60277L00959K72228R8283j63944k56742k75897j86413j43462r1943
$$ 5605026 5765303 6066262 6338490 6436773 6272829 6016087 5740190 5553777 5410315 5318372
18353E318372j46436k1225k4764J29884K17759L55041K72838L88227K95349N09235
$$ 5318372 5171936 5150711 5125947 5255831 5473590 5828631 6101469 6489696 6785045 7294280
18343G294280N58164O60418O66819P19385Q35273R34763J241619J353959J397211
$$ 7294280 7852444 8512862 9179681 9899066 10734339 11669102 12910721 14264680 15661891
18334A5661891J047867Q64411R91691J301008J303224J287975J515908J996836
$$ 15661891 16709758 17574169 18565860 19866868 21170092 22458067 23973975 25970811
18326B5970811K794842L731345M562089N408163O544992Q450736J1435042J5683499
$$ 25970811 28765653 32496998 37059087 42467250 49012242 57462978 68898020 84581519
18318H4581519K1827082L0762516M1644450M8452020L8508801J0493415j4482273
$$ 84581519 106408601 137171117 178815567 227267587 265776388 276269803 261787530
18311B61787530j4367337M051986J6682699N784397k3786526m6987951m6496638
$$ 261787530 247420193 251472179 268154878 273939275 250152749 203164798 156668160
18304A56668160l3387316k1850404j4612682j0380681p733996n770409l958348
$$ 156668160 123280844 101430440 86817758 76437077 68703081 62932672 58974324
18297E8974324k368407j200193k25854Q79698K179443L631448N317130Q035798
$$ 58974324 56605917 55405724 55179870 56059568 58239011 61870459 67187589 75223387
18289G5223387J1755551J6776044K3547725L2735072M2712688M4969310K8741528
$$ 75223387 86978938 103754982 127302707 160037779 202750467 247719777 276461305
18282B76461305J63894j6821508q493691R894574J5656826k151639l0983232m5504575
$$ 276461305 276625199 259803691 251310000 261204574 276861400 274709761 243726529 198221954
18274A98221954l8247027k3957702j2885868n303022R95717P345742J5023064
$$ 198221954 159974927 136017225 123131357 117828335 118824052 126169794 141192858
18267A41192858K4856207L5001910L7483297K2486780l551118j8039074r739140
$$ 141192858 166049065 201050975 238534272 261021052 257469934 239430860 229691720
18260B29691720O918124J1972994m768805l0929973m3913408l7480218k5635595
$$ 229691720 236609844 248582838 243814033 212884060 168970652 131490434 105854839
18253A05854839j7258554j1970403q623973o430167m590264l213668k308439j247498
$$ 105854839 88596285 76625882 68001909 61571742 56981478 53767810 51459371 50211873
18245E0211873l81502O58811J899054L139854M790765P224572J0786398J5717516
$$ 50211873 49830371 50489182 52388236 55528090 60318855 67543427 78329825 94047341
18237I4047341K2216789L0855230L8879936L5980112J5584489r134481j6213437
$$ 94047341 116264130 147119360 185999296 221979408 237563897 228429416 212215979
18230B12215979k821432J1711201Q997516j3337045l7101585m2606316l2815656
$$ 212215979 209394547 221105748 230103264 216766219 179664634 137058318 104242662
18223A04242662k1782494j4586965j0595562q214448o330517n019950l924968
$$ 104242662 82460168 67873203 57277641 49063193 42732676 37712726 33787758
18216C3787758l208351k894541k576072k374141k126494j856885j461788j232254
$$ 33787758 30579407 27684866 25108794 22734653 20608159 18751274 17289486 16057232
18208A6057232j043952q22039o68552p78100r72091p37067o63590o41257m50936
$$ 16057232 15013280 14191241 13522689 12744589 11772498 11035431 10371841 9730584 9279648
18199I279648l04109k34885j68685n7733l03077m29501m40269k12394l8433l3866
$$ 9279648 8975539 8740654 8571969 8514236 8211159 7781658 7341389 7128995 7090562 7056696
18189G056696k8787r8937j14388j31284j39625k58824q1513j18505L387p6217
$$ 7056696 7027909 6928972 6814584 6683300 6543675 6284851 6203338 6084833 6088220 6012003
18179F012003j31630J7782k2038o6163r9024n2965L5548m057k14344j55418j42137
$$ 6012003 5880373 5898155 5876117 5809954 5710930 5657965 5693513 5689456 5475112 5319694 5177557
18168E177557r2568j52384j01422l3486q2210p4368j70809K9301j9457j09547
$$ 5177557 5084989 4932605 4831183 4797697 4715487 4641119 4470310 4499611 4480154 4370607
18158D370607L0000n4826Q52L16997J70701l5678j20800p6016J4165N3410Q8928
$$ 4370607 4400607 4345781 4346633 4663630 4834331 4798653 4677853 4601837 4616002 4669412 4758340
18147D758340l2072P2959J16204L2426J54921J06051J34882J57217J45545P5165
$$ 4758340 4726268 4799227 4915431 4947857 5102778 5208829 5343711 5500928 5646473 5721638
18137E721638J03115J10257J345o556J00660L26308K79493K06241J41385J89374
$$ 5721638 5824753 5935010 5936355 5929799 6030459 6356767 6636260 6842501 6983886 7173260
18127G173260P4553J44041K91608L52172L50957M13601L60193P65514R66022J102262
$$ 7173260 7247813 7391854 7683462 8035634 8386591 8800192 9160385 9925899 10891921 11994183
18117A1994183J569162K025820K530552L105725L414475M492268O011789Q141126
$$ 11994183 13563345 15589165 18119717 21225442 24639917 29132185 35143974 43285100
18109D3285100J1320356J6604598K4685805L6694721M8587465M1856638M489446
$$ 43285100 54605456 71210054 95895859 132590580 181178045 223034683 227524129
18102B27524129l9614723n4400138m0579858k4476284j5034437r782428o815745
$$ 227524129 187909406 133509268 92929410 68453126 53418689 43636261 36820516
18095C6820516m826308l533466k422231k053311j988834j779706j557024j262361
$$ 36820516 31994208 28460742 26038511 23985200 21996366 20216660 18659636 17397275
18087A7397275r78765q05941n98247n45844l83720k00682j64398m9556J92765
$$ 17397275 16418510 15612569 15014322 14468478 14084758 13884076 13719678 13670122 13862887
18078A3862887L81863O03311O44412O97775O56544R34765J344772J886288K370067
$$ 13862887 14244750 14848061 15492473 16190248 16846792 17781557 19126329 21012617 23382684
18069B3382684K733798L501377M757368O240497Q377755J1505081J6152952K2539220
$$ 23382684 26116482 29617859 34375227 40615724 48993479 60498560 76651512 99190732
18061I9190732K8868843K8569184J4073376q803475k3174107k1256509j1596345
$$ 99190732 128059575 156628759 170702135 161898660 138724553 117468044 105871699
18054A05871699k161428N863188J4474650K3593994K7059079J5684586r140887
$$ 105871699 103710271 109573459 124048109 147642103 174701182 190385768 181244881
18047A81244881l0933534l4548366k6091818j7411102j1814513q372745o051369
$$ 181244881 150311347 115762981 89671163 72260061 60445548 52072803 46021434
18040D6021434m367662l268820k183114j514096j173685r93074o48874l92083
$$ 46021434 41653772 38384952 36201838 34687742 33514057 32520983 31872109 31480026
18032C1480026j86411j08308K25581N87717J216036J936622K405320K813177L352573
$$ 31480026 31293615 31185307 31410888 31998605 33214641 35151263 37556583 40369760 43722333
18023D3722333M174469N137632O392872Q466673J1097835J4957170K0812517K8942560
$$ 43722333 47896802 53034434 59427306 67893979 78991814 93948984 114761501 143704061
18015A43704061L8915686M5849051M0170617K1553617N954790N655020Q383300
$$ 143704061 182619747 228468798 268639415 290193032 296147822 301802842 310186142
18008C10186142j968690j5721191j4501483K873319K1958856K7802414J4245263
$$ 310186142 308217452 292496261 277994778 280868097 302826953 330629367 344874630
18001C44874630m836160j0574286q344941j9197220m1255487n2781680m5647196
$$ 344874630 340038470 329464184 321119243 301922023 260666536 207884856 162237660
17994A62237660l2247860k2022313j5622838j1443377q673892p038157n902329
$$ 162237660 129989800 107967487 92344649 80901272 72227380 65189223 59286894
17987E9286894n278485m516462m037792l267549k448961j776381j215243r23556
$$ 59286894 54008409 49491947 45454155 42186606 39737645 37961264 36746021 35822465
17979C5822465o42953k00346M35556Q53967J384739K060317K787446L702845M888195
$$ 35822465 35179512 34979166 35414722 36268689 37653428 39713745 42501191 46204036 51092231
17970E1092231O284109Q411912J1352576J5440758K1173187K9488130L7519336
$$ 51092231 57376340 65788252 77140828 92581586 113754773 143242903 180762239
17963A80762239L5870827J5927810j3860297l1218248k7384422j4028208j362856
$$ 180762239 216633066 232560876 218700579 187482331 160097909 146069701 144706845
17956A44706845R906561K1609949L3121136L6282674J9106809j5712805m4620413
$$ 144706845 154613406 176223355 209344491 245627165 264733974 249021169 204400756
17949B04400756m8774323l7186902k5291119j7298660j2509059r511328p135475
$$ 204400756 155626433 118439531 93148412 75849752 63340693 53829365 46693890
17942D6693890n416040m255892l304295k504169k499260k432129k269318j899955
$$ 46693890 41277850 37021958 33717663 31213494 28714234 26282105 24012787 22112832
17934B2112832j652519j350030j185649r64361p90647n36782P9369L27767J33812
$$ 22112832 20460313 19110283 17924634 16960273 16169626 15632844 15712213 16039980 16173792
17925A6173792J90466k4157l37121m09714l89074k39465k13603J68790M49453
$$ 16173792 16364258 16340101 16002980 15593266 15204192 14964727 14751124 14919914 15369367
17916A5369367O11493N72390P44749O99335P17385O95425O85899P06589P16411
$$ 15369367 15980860 16553250 17297999 17997334 18714719 19410144 20096043 20802632 21519043
17907B1519043O93745R53078J503221J887615K129079K205137K705920L166209
$$ 21519043 22212788 23165866 24669087 26556702 28685781 30890918 33596838 36763047
17899C6763047L587151M377534N297169O664062Q840098J2040611J6413164K2800625
$$ 36763047 40350198 44727732 50024901 56688963 65529061 77569672 93982836 116783461
17891A16783461L1781971M2643627N1083130M8155320L1742536J0844694q194814
$$ 116783461 148565432 191209059 242292189 290447509 322190045 333034739 324839925
17884C24839925k5787241l4888416k6997704q303256J1382094K7292753L1852849
$$ 324839925 299052684 264164268 237166564 228863308 240245402 267538155 299391004
17877B99391004K0737581J037731j7726460l4562804m7243494m7057474l6089163
$$ 299391004 320128585 321166316 303439856 268877052 221633558 174576084 138486921
17870A38486921k5022190j7256157j2166685q713193o393356m708771l564146
$$ 138486921 113464731 96208574 84041889 75328696 68935340 64226569 60662423
17863F0662423k899531k443968k110614k099035j871293j152111o83245O1718
$$ 60662423 57762892 55318924 53208310 51109275 49237982 48085871 47402626 47464344
17855D7464344J183822J971209K372478K948623L867651M935254O454336Q350811
$$ 47464344 48648166 50619375 52991853 55940476 59808127 64743381 71197717 79548528
17847G9548528J1059765J5367375K1215447K9639136M1300727N5565152O6468385
$$ 79548528 90608293 105975668 127191115 156830251 198130978 253696130 320164515
17840C20164515O2147394M0554481J3421434j1473134l5288897m9129902l9959704
$$ 320164515 382311909 422866390 436287824 424814690 389525793 340395891 300436187
17833C00436187j6087570R001026K8965374L5339193K3009376N36228k1145260
$$ 300436187 284348617 293349643 322315017 357654210 380663586 381199814 360054554
17826C60054554m0608634n5963544n7123771m5252149l2107964k2567154j6320149
$$ 360054554 319445920 263482376 206358605 161106456 128998492 106431338 90111189
17819I0111189j1953147r219988p240719o057146n523741n075081m554522m182458
$$ 90111189 78158042 68938054 61697335 55640189 50116448 45041367 40486845 36304387
17811C6304387l678951l132947k630254k157426j746662j553175j267474p85118
$$ 36304387 32625436 29492489 26862235 24704809 22958147 21404972 20137498 19352380
17803A9352380p89539r00901j007717j131236j172910j035425r58864p51843l87310
$$ 19352380 18562841 17661940 16654223 15522987 14350077 13314652 12355788 11603945 11216635
17794A1216635j31162j96194l14613k82874l51273p9644l62650m00105m91073
$$ 11216635 11085473 10889279 10574666 10291792 9940519 9860875 9498225 9098120 8607047
17785H607047l80346m05487m04967k15256k58654j66001j08081n5980j72530n0428
$$ 8607047 8226701 7821214 7416247 7200991 6942337 6776336 6668255 6612275 6439745 6389317
17775F389317n6159o7670j78061k33959p0675r4438j19233J5069M7731o4462J05166
$$ 6389317 6333158 6265488 6087427 5853468 5782793 5688355 5569122 5584191 5631922 5567460 5672626
17764E672626K23308J23371R3301J73607R1768K4365l2967j50642k96280m95623
$$ 5672626 5895934 6019305 6112606 6286213 6377981 6402346 6369379 6218737 5922457 5426834
17754E426834k94154j26004p1466j22448m5208k29132k28177L8844J81618J64360
$$ 5426834 5132680 5006676 4935210 4812762 4767554 4538422 4310245 4349089 4530707 4695067
17744D695067J19121l321j28825j4962m5593j68274r3918J2061p5404k94034j78190
$$ 4695067 4814188 4810867 4682042 4667080 4621487 4453213 4359295 4371356 4295952 4001918 3823728
17733C823728j60642k20496j56471r2909k06944n3168R1847n499m5677J7123j31671
$$ 3823728 3663086 3442590 3286119 3193210 2986266 2933098 3024945 3019446 2973769 2990892 2859221
17722B859221j61326p5345J49123J16745P9248J89542K78975M81899K23743Q4665
$$ 2859221 2697895 2622550 2771673 2888418 2967666 3157208 3436183 3918082 4141825 4226490
17712D226490N6354k19681n8042p8794K1612O0228j8660k13388k51634k95217
$$ 4226490 4282844 4063163 4005121 3926327 3947939 4008167 3989507 3776119 3524485 3229268
17702C229268j64724l11000j94814r7229j24584J35114J9767j00273p1549l8909
$$ 3229268 3064544 2753544 2558730 2461501 2336917 2472031 2491798 2391525 2319976 2281067
17692B281067j27587j26044j79384J3970J77463J02797L4145k42952j88999j67149
$$ 2281067 2153480 2027436 1848052 1862022 2039485 2142282 2176427 1933475 1744476 1577327
17682A577327o6657O5449p2558P1776j982m8812J02385J66141N3809j21387n8798
$$ 1577327 1510670 1576119 1503561 1575337 1573355 1524543 1626928 1793069 1846878 1725491 1666693
17671A666693L9987m8914J6924J24016R5411j3026J22360J25319O6089r5318j56400
$$ 1666693 1706680 1657766 1674690 1798706 1894117 1881091 2003451 2128770 2194859 2099541 1943141
17660A943141l3303n7815Q9307P8387K8950P6477j04723m9529q2980k4107k0160
$$ 1943141 1909838 1852023 1941330 2019717 2048667 2125144 2020421 1970892 1887912 1863805 1843645
17649A843645o2753j17306P5230P542J4560J2773j55509j24948J8883N1405L1525
$$ 1843645 1780892 1663586 1738816 1746358 1760918 1773691 1618182 1493234 1512117 1563522 1595047
17638A595047j4827P2459J0899O3772J40219L28479K18225j27037K205n3344m1184
$$ 1595047 1580220 1652679 1663578 1727350 1867569 2196048 2414273 2287236 2289441 2236097 2194913
17627B194913o1005k4531r2182j54257N6541O7186m2586k63423l3956K41377l2517
$$ 2194913 2133908 2109377 2017195 1862938 1919479 1986665 1944079 1680656 1646700 1888077 1855560
17616A855560J33365L2817j65388j30419j89706K00443j2021P5985Q0529Q0503
$$ 1855560 1988925 2021742 1856354 1725935 1536229 1736672 1724651 1800636 1881165 1961668
17606A961668J6218j26476o5460P8305p3580j26779k9282k39410O5855J05014
$$ 1961668 1977886 1851410 1785950 1864255 1790675 1663896 1634614 1395204 1461059 1566073
17596A566073J39913J00340N3529J4880K7302O4351j1760R3881n0630r5375q5324
$$ 1566073 1705986 1806326 1859855 1874735 1902037 1966388 1954628 2048509 1997879 1902504 1817180
17585A817180J96195J94290P7649M7986J03666M7413J20747k5128j16530P7473
$$ 1817180 2013375 2207665 2285314 2333300 2436966 2484379 2605126 2579998 2463468 2540941
17575B540941J54061L9041O0440j09823N9534J846k9897N4679k8388k4321j21251
$$ 2540941 2695002 2734043 2794483 2684660 2744194 2746040 2716143 2770822 2742434 2718113 2596862
17564B596862O036K53564N2549K9789m8984M494N9016M4950Q6039J02346J63712
$$ 2596862 2602898 2856462 2909011 2938800 2889816 2894310 2953326 2998276 3084315 3186661 3350373
17553C350373J85578R2306K10652J69990J19049J59847J10202Q7091K61351J91710
$$ 3350373 3535951 3628257 3838909 4008899 4127948 4287795 4397997 4485088 4746439 4938149
17543D938149L7705J11054N13970L43516J19964L79777N79174N44615N32879N80983
$$ 4938149 4975854 5086908 5600878 5944394 6064358 6444135 7023309 7567924 8100803 8681786
17533H681786Q15114J005067P70378M50530L87134L67811O48328R32186J134760
$$ 8681786 9496900 10501967 11272345 11722875 12110009 12477820 13126148 14058334 15193094
17524A5193094J181295J225005J230622J362998J742307K386592L029662L398245
$$ 15193094 16374389 17599394 18830016 20193014 21935321 24321913 27351575 30749820
17516C0749820M117141N231586O726053Q870519J2059190J6216099K2145441L0702621
$$ 30749820 34866961 40098547 46824600 55695119 67754309 83970408 106115849 136818470
17508A36818470M1107520M6487086L3723530L006591k2731773k3565945o228219
$$ 136818470 177925990 224413076 258136606 261143197 238411424 214845479 208617260
17501B08617260J4545598L0492154L0147609L904195l4172404n4626303m8140912
$$ 208617260 223162858 253655012 283802621 287706816 253534412 198908109 150767197
17494A50767197l3281721k2348384j5532286j1472537q624070o271150m598962
$$ 150767197 117485476 95137092 79604806 68132269 59508199 53237049 48638087
17487D8638087l228594k380015j952486j433856j274409j010563l83937j60126
$$ 48638087 45409493 43029478 41076992 39643136 38368727 37358164 36974227 36814101
17479C6814101L23034P85636J251091J599034J603430J519311J542683J781553
$$ 36814101 37137135 37922771 39173862 40772896 42376326 43895637 45438320 47219873
17471D7219873K865091M201705N773118P617917J0385636J3983435J8974754K5652945
$$ 47219873 50084964 54286669 60059787 67677704 78063340 92046775 111021529 136674474
17463A36674474L5397087M8916416O3242788O7269255M8234931R931226k3568052
$$ 136674474 172071561 220987977 284230765 351500020 399734951 409666177 386098125
17456C86098125l1358858j3156919J6304774L8829738L7967119Q044419l7026116
$$ 386098125 354739267 341582348 357887122 396716860 434683979 442728398 405702282
17449D05702282p0041393p6435042o1328014m2649224k9370124k1148840j5605500
$$ 405702282 335660889 259225847 197897833 155248609 125878485 104729645 89124145
17442H9124145j1620674q618763o560261n222469m150480l322752l187142l108488
$$ 89124145 77503471 68884708 62324447 57101978 52951498 49628746 46441604 43333116
17434D3333116k836645k403555j987134j707559r01753n25270k54684K10951K23852
$$ 43333116 40496471 38092916 36105782 34398223 33496470 32971200 32716516 32927467 33151319
17425C3151319J83240M77932J047810J755348K379404L365877M940955O881696
$$ 33151319 33334559 33812491 34860301 36615649 38995053 42360930 47301885 54183581
17417E4183581R497898J3068963J8204069K5170893L1461279K9261077J1785428
$$ 54183581 63681479 76750442 94954511 120125404 151586683 180847760 192633188
17410A92633188j0659958j9198942j0459768L900273J7053192K3070713J2759469
$$ 192633188 181973230 162774288 152314520 156214793 173267985 196338698 209098167
17403B09098167j2126378l3203306l5457944k5713664j6362504j0545930p181638
$$ 209098167 196971789 163768483 128310539 102596875 86234371 75688441 68506803
17396F8506803m454782k341012o15191Q22007K509345L972025N552693P354669
$$ 68506803 64052021 61711009 61095818 61917825 64427170 68399195 73951888 81306557
17388H1306557J0014019J3271734J7979426K5166251L5566652M9611214O4559822
$$ 81306557 91320576 104592310 122571736 147737987 183304639 232915853 297475675
17381B97475675P0300784N7434313L2855805R532899j1515794k6567656k1139416
$$ 297475675 367776459 425210772 458066577 467599476 456083682 429516026 408376610
17374D08376610K85119J1083169R33045j7273976l3476935m9881725o0938031
$$ 408376610 408661729 419744898 420677943 403403967 369927032 320045307 259107276
17367B59107276n6117323m1748529k8927332k0724652j5406029j1769512r082262
$$ 259107276 202989953 161241424 132314092 111589440 96183411 84413899 75331637
17360G5331637p175429n955632n190647m291480l584912k996766k727339k284082
$$ 75331637 68156208 62200576 57009929 52718449 49133537 46136771 43409432 41125350
17352D1125350j519993j174992q29379M0695M12533N46738P43010Q75030R52070
$$ 41125350 39605357 38430365 37600986 37641681 38054214 38600952 39343962 40218992 41171062
17343D1171062J576427K492933L477195M529646O054344P884516J0016135J3107481
$$ 41171062 42747489 45240422 48717617 53247263 59301607 67186123 77202258 90309739
17335I0309739J8044347K4931314L4810086M7581876N8440915N7348546M0800046
$$ 90309739 108354086 133285400 168095486 215677362 274118277 331466823 372266869
17328C72266869J9473481O93318j5919137k2114677q503170Q809005R341638m991885
$$ 372266869 391740350 392433668 376514531 354399854 345896684 354705689 364047327 359055442
17320C59055442k1241134l6457609n0799604n4069899m3872049l1041987k1915670
$$ 359055442 337814308 301356699 250557095 196487196 152615147 121573160 99657490
17313I9657490j5968908j2079492r489233p597184o153328n158585m383145l880100
$$ 99657490 83688582 71609090 62119857 54522673 48369345 43210760 38827615 34947515
17305C4947515l259607k746105k542539k302710k049159j773741j623621j278254
$$ 34947515 31687908 28941803 26399264 24096554 22047395 20273654 18650033 17371779
17297A7371779j105355j114534q77834q34881q52868q71435o69754n47544p54073
$$ 17371779 16266424 15151890 14274056 13439175 12586307 11714872 11045118 10497574 9743501
17288I743501n12414l03986l95250k55685k55314k31838l11325k28365l38635
$$ 9743501 9231087 8927101 8531851 8276166 8020852 7789014 7477689 7249324 6910689
17279F910689k59088j61147j7799q8227j85698j84700o8164o608j96012r2252
$$ 6910689 6651601 6490454 6472655 6384428 6198730 6014030 5945866 5939258 5743246 5650994
17269E650994M9131j72868l54331k26286o8377q8829J5029j21838k27814j49572
$$ 5650994 5700125 5527257 5172926 4946640 4878263 4789434 4804463 4682625 4454811 4305239
17259D305239m7972n6494j12855j02771J2504r3720n4105o8049n5847j62691j85901
$$ 4305239 4257267 4200773 4087918 3985147 3997651 3903931 3849826 3781777 3725930 3563239 3377338
17248C377338k6677m5511p1133j45016j1471n8291j03615N9134j23676N0891n1032
$$ 3377338 3350661 3305150 3234017 3089001 3077530 3019239 2915624 2974758 2851082 2901973 2850941
17237B850941p4909l980M6723n6930j74251j23229p0210M8385J41351q947n5857
$$ 2850941 2776032 2772052 2818775 2761845 2587594 2464365 2394155 2442540 2583891 2574944 2519087
17226B519087p2286j00018j31120j09603n8704r0902N8862J97320O2218j075j59255
$$ 2519087 2446801 2346783 2215663 2106060 2047356 1956454 2015316 2212636 2274854 2273779 2114524
17215B114524j08303P450j28484j89248o8605M2600j3346j54688M1954J68657
$$ 2114524 2006221 2013671 1885187 1695939 1627334 1669934 1656588 1501900 1543854 1712511
17205A712511j69777m1713L1950P8759Q9503o2063l8911R4250L5996J2300J9022
$$ 1712511 1542734 1501021 1532971 1611730 1701233 1639170 1600259 1694509 1730505 1742805 1761827
17194A761827l3481o4116o3997n2709j45269r2504p1473j16347Q494K3468J06541
$$ 1761827 1728346 1664230 1600233 1547524 1402255 1309751 1238278 1121931 1130425 1153893 1260434
17183A260434n894J4471j66523m640J15122J15922P9172j14214j67929p2600N5048
$$ 1260434 1254540 1269011 1102488 1097848 1212970 1328892 1408064 1293850 1125921 1053321 1108369
17172A108369N8012p4913j51163r6142j7733j01604J6438l221j83183p7495L9472
$$ 1108369 1166381 1091468 940305 844163 826430 724826 741264 738043 554860 477365 516837
17161E16837n4686n4949o1086j17354J43877P7625l5257m9028Q3026O4859m1008
$$ 516837 462151 407202 346116 228762 372639 450264 415007 365979 449005 513864 472856
17150D72856k1027Q8010K07226K94302j2451m3613M0531m7704k96231m6552j69467
$$ 472856 451829 539839 747065 1041367 1028916 985303 1025834 978130 681899 635347 465880
17139D65880j38555K13412P6030J16513k8129k1095J4475j54992n8537k0615j00961
$$ 465880 327325 540737 616767 733280 705151 684056 698531 543539 485002 464387 363426
17128C63426J69289K35351p2997j72890j64753P3709M0006k1029j6448k9140O7728
$$ 363426 532715 768066 695069 522179 357426 431135 471141 450112 433664 404524 472252
17117D72252M415j7011k1936j89166q7870m4654R2469N0441O027J92620J37513
$$ 472252 476667 459656 437720 248554 160684 116030 208499 258940 264967 457587 595100
17106E95100k6746k3908O927K413m3720P646K02821Q9926n7971j65246p8378K2934
$$ 595100 568354 544446 551373 553786 510066 517712 720533 810459 752488 587242 508864 531798
17094E31798p9102j10949O0054j088K4092J49480k7734l5805J47576J41893k23317
$$ 531798 452696 341747 401801 400713 424805 574285 546551 510746 658322 800215 576898
17083E76898j51897j978j21677o5004P2419R6759j62979J21655J09657N8121j64380
$$ 576898 425001 423023 301346 236342 308761 405520 242541 364196 473853 531974 367594
17072C67594J0232M4287L997j4616k1855L5968J8936k34824n3315J4751Q0158
$$ 367594 377826 422113 426110 411494 389639 425607 444543 209719 156404 171155 251313
17061B51313p6040j27075M1313J97420P5751j8724J67664Q2062r0317K8661J6308
$$ 251313 175273 48198 89511 286931 362682 343958 511622 593684 503367 532028 548336
17050E48336N993N2464j25044r4852L9247K7808m7759M5970P8791O3248m5201
$$ 548336 554329 606793 481749 386897 426144 453952 406193 452163 530954 594202 549001
17039E49001O125q0220k7179J25817q624j12302j24132j4778P699o8894m8494
$$ 549001 555126 474906 447727 573544 564920 452618 328486 313708 321407 252513 204019
17028B04019M3735O3624n9477k472m2631N3797J58115j83924j45386k421M1219
$$ 204019 247754 311378 251901 249429 206798 260595 418710 234786 89400 86979 128198
17017A28198R7959M2024p9503J15435L0360l495J18783m9618m5097o5374L7156
$$ 128198 226157 268181 188678 304113 334473 330978 449761 400143 355046 289672 326828
17006C26828J90963J68109O6487j83894j50043Q6604N4259J39631J8805P2628
$$ 326828 517791 685900 752387 568493 418450 505054 559313 698944 717749 790377
16996G90377O9875L7946J19633J79131K74318O4368j17863m3714j0154Q1513Q9515
$$ 790377 860252 898198 1017831 1196962 1471280 1535648 1417785 1374071 1363917 1445430 1534945
16985A534945J20610m6134j61788j77069k71748k24431k23947j67908n1963r2140
$$ 1534945 1655555 1609421 1447633 1270564 998816 774385 550438 382530 330567 238427
16975B38427n252J9759o0385K10894J03353k85365j72319K32088P3941n451j04942
$$ 238427 233175 252934 192549 403443 506796 221431 49112 281200 355141 349690 244748
16964B44748m2858J8919J62037J54726j29361o4953m2523p5616J67205J49890
$$ 244748 201890 220809 382846 537572 408211 343258 300735 225119 392324 542214
16954E42214J24169j07017N8826K47475J84460Q4766J53866K31262K91256L79691
$$ 542214 666383 559366 618192 865667 1050127 1134893 1288759 1520021 1811277 2190968
16944B190968L77059q0592k86371k44241L2268K2639Q1799K08976m400l22948
$$ 2190968 2568027 2487435 2201064 1956823 1989091 2011730 2093529 2302505 2298105 1975157
16934A975157k19237k06124k71300k32048r9890q5874j26943j20937l6996r5487
$$ 1975157 1755920 1549796 1278496 1046448 946558 860684 733741 612804 575808 480321
16924D80321p9143l4609q0918k2389R4635P8474J28638j6730j08581j06545L1116
$$ 480321 401178 366569 285651 263262 357897 436371 565009 548279 439698 333153 364269
16913C64269J82309J84358j1251j71458j62276O7341J03385J23818j7865l4234
$$ 364269 546578 730936 719685 548227 385951 453292 556677 680495 662630 628396
16903F28396J1538P5358O4515P1459J54343K98660J98070R0293l7637k02485m0913
$$ 628396 639934 715292 779807 851266 1005609 1304269 1502339 1592632 1554995 1352510 1311597
16892A311597J3640J02768K50868J21591q5662m831Q3950L23409K99341J08413
$$ 1311597 1325237 1428005 1678873 1800464 1714802 1709971 1793921 2117330 2416671 2525084
16882B525084J48862J6508k05056k5550o6981k6536J81737p0765r9015o5964l80198
$$ 2525084 2673946 2690454 2485398 2459848 2392867 2366331 2548068 2477303 2378288 2312324 1932126
16871A932126m02286k80193k88864l09313o6583J02778l9805j75018J84078m8014
$$ 1932126 1529840 1249647 960783 651470 584887 687665 647860 472842 656920 608906
16861F08906j17692n6005o3799j12148M1264J11369k7749J9452J13679N2380q7285
$$ 608906 491214 435209 371410 259262 300526 411895 384146 403598 517277 569657 482372
16850D82372L1226o9960j73305n681J01054r2581K8638N0201J37276N0584P6074
$$ 482372 513598 443638 270333 264652 365706 273125 301763 351964 489240 539824 615898
16839F15898J12931P570J12635J97411K15167K23987K84631L71607K42147q9026
$$ 615898 728829 736399 849034 1046445 1261612 1485599 1770230 2141837 2383984 2294958
16829B294958M9336o3930n232l672J37776k99629l00107k59353k30060l36665
$$ 2294958 2344294 2280364 2275132 2271460 2409236 2109607 1809500 1550147 1320087 983422
16819I83422k29579P0022k7905k65031p3305N6113n4050j76086n5950M6309k2085
$$ 983422 753843 823865 795960 530929 457624 513737 459687 283601 227651 273960 251875
16808B51875r4221M4232J8381M5067K2485m4318O4317M85q8788j25146Q9289J40279
$$ 251875 157654 201886 220267 265334 287819 243501 307818 308303 219515 94369 183658 323937
16796C23937Q0627r2147j91911O8812L0521L9446J6518J20944j9401q2290j3241
$$ 323937 404564 312417 120506 189318 219839 259285 275803 396747 377346 295056 281815
16785B81815o440O9122p37o0133r775n1635q5722l565J50390q4080k7467P0192
$$ 281815 275375 344497 343760 283627 273852 222217 136495 132930 283320 199240 171773 241965
16773B41965q158j27518j12409K3465Q9999l3379O276q9931J58110J13754j28205
$$ 241965 233807 106289 -6120 17345 107344 73965 80241 -9690 148420 262174 133969
16762A33969o1142q6938K1904O9464P9644O126J18061l2754j61701k10457n4026
$$ 133969 72827 -14111 7793 77257 156901 163027 281088 248334 86633 -123824 -177850
16751a77850J03102J18226p06J89886J27046R653p4808j58649j14645J001J9330
$$ -177850 -74748 43478 42772 232658 359704 369357 294549 135900 21255 22256 41586
16740D1586m4850k3603J13023l1522j07774q6930R3364J43065j79629J7636J830
$$ 41586 -3264 -26867 86156 54634 -53140 -140070 -46706 96359 -83270 -65634 -63804
16729f3804l8932j27948N073j5492J23215L1687n0821O1235P9534k3942P5050
$$ -63804 -102736 -230684 -225611 -241103 -117888 -86201 -137022 -75787 3747 -20195 54855
16718E4855J8658p4470j06494J81315k9411j5300K4442j028K7815m6514j0678
$$ 54855 73513 -957 -107451 73864 44453 29153 53595 52567 80382 33868 23190
16707B3190k30579j8184K33203J53960n1723J16552J1742K9367R9732o4445j4906
$$ 23190 -207389 -225573 7630 161590 109867 226419 238161 267528 367260 302815 287909
16696B87909M8994q1681l753k4194j07784M8780L4561r2090L5987N5685j07619
$$ 287909 336903 255222 251469 227275 119491 168271 202832 110742 146729 202414 94795
16685I4795j90125k5445N5030m489l2652L8324L872r4500j44235O1527J74205
$$ 94795 -95330 -120775 -65745 -70234 -102886 -64562 -60690 -155190 -299425 -237898 -63693
16674f3693p6437m8175k7856k2799J4279J28287J02063K4252L1559K9935N9327
$$ -63693 -140130 -188305 -216161 -238960 -224681 -96394 5669 29921 61480 91415 150742
16663A50742k2593j21191j2025M7029L1684m0777m1633M1419Q1422J5649j18983
$$ 150742 128149 6958 -5067 41962 73646 32869 -8764 32655 114077 129726 10743
16652A0743n286Q5742J23381K0741j51171Q8522q7652j68390L443R2112J32219
$$ 10743 5457 91199 214580 235321 84150 172672 85020 -83370 -79927 12185 144404
16641A44404Q2108J08040J23470p0218m2948m1442q4415p3528K6021J9167O3027
$$ 144404 226512 334552 458022 387804 344856 303414 218999 145471 171492 190659 253686
16630B53686k9270J16013l8679k4840j59214M068q4631j70684O6566j7076j19060
$$ 253686 224416 340429 301750 276910 117696 121764 37133 -133551 -66985 -84061 -203121
16619b03121J17411J39405J2096J7086J3355r3218k4775J23841o377j30606r1374
$$ -203121 -85710 53695 65791 82877 96232 3014 -21761 102080 95703 -34903 -126277
16608a26277n6298P4093M898Q148M019o3817J8848o2075Q0247O0262J8107J09579
$$ -126277 -182575 -108482 -103584 -95436 -91417 -155234 -136386 -198461 -118214 -57952 -39845 69734
16596F9734o5441p3451J14114J54670M7308l1309l4516n2323J5693K4427J10O8683
$$ 69734 4293 -69158 44956 199626 246934 215625 181109 128786 144479 168906 169016 237699
16584B37699m5906j45853r5834J43723J43300J54931o8921j93116L43J14814m8702
$$ 237699 191793 45940 -49894 93829 237129 392060 323139 130023 130366 245180 196478
16573A96478j25475j0581M7420j35162r4001r1043k5407o7559k27453L9168Q5455
$$ 196478 71003 60422 107842 -27320 -121321 -212364 -237771 -305330 -532783 -493615 -408160
16562d08160J37758k8559N646L8196M7379N2658J2577j8554n3934L1411n6707
$$ -408160 -270402 -298961 -293315 -255119 -207740 -155082 -142505 -161059 -214993 -183582 -240289
16551b40289J48830Q5374K4201j58622R142N6991J08553L3160k434l7167o4358
$$ -240289 -91459 -6085 18116 -140506 -131364 -74373 34180 67340 64906 27739 -36619
16540c6619J7730l5854J0094N0734P6815J10738J06151m5890j68299j58676M7702
$$ -36619 -18889 -54743 -44649 6085 82900 193638 299789 253899 85600 -73076 -25374
16529b5374r5644j18846J26849J2367p9486n6055Q877j5497j69468q5151J16326
$$ -25374 -121018 -239864 -113015 -100648 -180134 -236189 -227312 -242809 -412277 -497428 -381102
16518c81102M2866J7101R7427Q1963J59222J89901m9379j67565p0585J76957J26062
$$ -381102 -338236 -321135 -223708 -141745 17477 207378 157999 -9566 -80151 96806 222868
16507B22868J38928n7049j48988k13564j35824O5584O0526P3970K1978o4749r324
$$ 222868 361796 304747 155759 -57805 -193629 -128045 -67519 6451 28429 -36320 -45644
16496d5644o0426J03028J23078K1836L790p1838r3603o4659p4187l8923M9414
$$ -45644 -106070 -3042 120036 141872 145662 73824 -19779 -84438 -158625 -197548 -148134
16485a48134p5292j34644j2379J30966K47703j8317n679O3534J22599N3933j39990
$$ -148134 -223426 -358070 -370449 -239483 8220 -10097 -15776 47758 170357 224290 84300
16474H4300l0438l5920q9670K0655m0532p695r5465L6012R6446J17819m0095o5826
$$ 84300 53862 17942 -71728 -51073 -91605 -99300 -194765 -158753 -62307 55512 15417 -50409
16462e0409j28642J25786J70599Q8545j00397q2727j58106j45407o5252P1715
$$ -50409 -179051 -53265 117334 205879 105482 22755 -135351 -280758 -346010 -274295
16452b74295J66298N9282O9853M6094p5066q646R7416O5752j47143j04967R8512
$$ -274295 -107997 -48715 21138 67232 -7834 -16480 80936 146688 -455 -105422 -6910
16441f910R2216K0600Q3388q9400L9098M8912n8495l0770j60085P3292K5848L6670
$$ -6910 85306 105906 189294 99894 138992 187904 129409 98639 -61446 11846 37694 74364
16429G4364q7113j46532J4031J70948N7092p5487O7653J8523O6199J40664N7885
$$ 74364 -12749 -159281 -145250 25698 82790 7303 74956 93479 159678 300342 358227
16418C58227j23128P080m9997k14269P7296k1782j68108J53354o4022O0054n5969
$$ 358227 235099 242179 192182 -22087 55209 33427 -134681 18673 -45349 14705 -41264
16407d1264K175r4827p8816M9578J39142j1500N6070J07232j21536q0464m541
$$ -41264 -39089 -133916 -212732 -163154 -24012 -35512 20558 127790 6254 -74210 -78751
16396g8751J74127L026q1759j09960k4308K57328o893p7676J72218P6433j05550
$$ -78751 95376 98402 16643 -93317 -117625 139703 132810 55134 227352 303785 198235
16385A98235L7005j85492j02640Q356M4051j23968j7247j03833j765J21804J29784
$$ 198235 235240 49748 -52892 -44536 -485 -124453 -141700 -245533 -247298 -125494 4290
16374D290j94305j51313M2265J24602R4172Q2658O3668J3045m7726j48786j07039
$$ 4290 -190015 -341328 -299063 -174461 -80289 2369 66037 79082 31356 -117430 -224469
16363b24469j62877N9122K18210P4224L5601k05396l1123J51363N9072l4885Q0248
$$ -224469 -387346 -328224 -110014 -35790 -189 -205585 -236708 -85345 -26273 -61158 19090
16352A9090N2933l0433j13980j55265j20552L9407J52946L2977P491r7093N5640
$$ 19090 72023 41590 -72390 -227655 -348207 -308800 -155854 -122877 -115386 -212479 -156839
16341a56839l5732r7016J33391k6722j08635L5990J6464M1298J8475P0092j25649
$$ -156839 -192571 -289587 -156196 -182918 -291553 -255563 -239099 -197801 -179326 -109234 -234883
16330b34883M5457J32926J2577q8887n2117j13494J11814K44004j0089k667J10655
$$ -234883 -189426 -56500 -43923 -132810 -184927 -298421 -186607 57397 47308 44641 155296
16319A55296q2972j16693o4163j0593N0500R353J23603J43636j05371K2795q0316
$$ 155296 72324 -44369 -108532 -119125 -68625 -59272 64331 207967 102596 125391 45075
16308D5075j88500j06921L2590j8603J25057O5257J08121J9988j18195j99980
$$ 45075 -143425 -250346 -217756 -236359 -111302 -46045 62076 82064 -36131 -236111
16298b36111r8014J09360K8587p8137O526K42634O9447q7217J9028M2060L0729
$$ -236111 -334125 -224765 -196178 -274315 -267789 -25155 44292 -42925 -23897 18163 48892
16287D8892q0047q8766L6080l1211m5275k5160K5493Q9389N6465L1190j16849
$$ 48892 -31155 -119921 -83841 -115052 -160327 -185487 -159994 -70605 -14140 17050 -99799
16276i9799j9320L7123M0017M8003l027n8172J3122M1787O1919J5189j11598R5687
$$ -99799 -119119 -81996 -41979 6024 2997 -55175 -42053 -266 61653 76842 -34756 60931
16264F0931P0147j7282p3970n2316j9700M867L9578K1856O3011j0720n0589k0500
$$ 60931 131078 113796 39826 -12490 -32190 -27323 12255 34111 97122 86402 35813 15313
16252A5313n2016r436O6022j20481o1777Q8436r928j2856o9606N3875L766j62249
$$ 15313 -36703 -46139 19883 -100598 -162375 -73939 -83867 -96723 -166329 -112454 -108688 -270937
16240b70937N0270J27736R9731J4673Q692M6942O0253K7012J3240n9762l880o0779
$$ -270937 -220667 -92931 6800 21473 30165 77107 137360 164372 177612 117850 113970 53191
16228E3191L2906k3607O321M2242j0371N7561j68561j35779K5797j52972j7043
$$ 53191 86097 62490 68811 111053 100682 158243 -10318 -146097 -120300 -273272 -290315
16217b90315J60999r3039P513q1329O6400J27313M9635p542R790n6920M4201k929
$$ -290315 -129316 -222355 -214842 -296171 -229771 -102458 -52823 -60365 -50575 -107495 -63294 -66223
16205f6223O4359l2564p522M430K6949M8937K244J01381M3960p0463P2836j647
$$ -66223 -1864 -34428 -41950 -37520 -10571 38366 40610 141991 185951 115488 188324 186677
16193A86677Q3853j18419p0028J1583o7770k05469p0118K4733R5280P7521r5568
$$ 186677 270530 152111 82083 93666 25896 -179573 -249691 -224958 -129678 -52157 -147725
16182a47725J1373P3010Q5941q5919N247j12806j46315J48836J28185n9766j01722
$$ -147725 -136352 -63342 22599 -63320 -58073 -170879 -317194 -168358 -40173 -99939 -201661
16171b01661N1175o1577r6095L9173J54741J75145K6019j24068r515K3943r1427
$$ -201661 -150486 -212063 -308158 -268985 -114244 60901 86920 -37148 -46663 -22720 -114147
16160a14147R0798j09080L299N6778N9105K9803n5630o1382m5497J73943J27803
$$ -114147 -23349 -132429 -129130 -72352 -13247 16556 -39074 -100456 -145953 27990 155793
16149A55793q4458j7827j80687j15095K6247J4782J01411M8786p7411j4170J15897
$$ 155793 71335 53508 -127179 -242274 -216027 -201245 -99834 -51048 -128459 -142629 -26732
16138b6732J38507n1418j53690k9464j4526j53310k2871R7063M8297n3845M4107
$$ -26732 111775 60357 -93333 -122797 -137323 -290633 -313504 -216441 -168144 -221989 -177882
16127a77882J46j16960O5670Q6788O867J46835O7124L7936L299l7516n6886n6228
$$ -177882 -177736 -294696 -229026 -142238 -135371 11464 78588 116524 119823 82307 25421 -30807
16115c0807j31407j693P3890J30995k9490j87966o6852m7062k07122K8208J44485
$$ -30807 -162214 -163907 -90017 40978 11488 -176478 -243330 -290392 -497514 -469306 -324821
16104c24821Q6930J96090J27435o351j23661j05125P4421m7141o6634j1545O1389
$$ -324821 -237891 -41801 85634 79283 -44378 -149503 -75082 -122223 -188857 -200402 -139013
16093a39013P0576O8914q0255j49119n6605n0080Q4394R5641J11239J05348J0720
$$ -139013 -68437 477 -79778 -228897 -285502 -335582 -251188 -155547 -44308 61040 71760
16082G1760J4425m8981j7911K2030m9051P5646Q1900k2395J5313J584l9916n6259
$$ 71760 86185 37204 19293 41323 -7728 67918 149818 127423 142736 144320 104404 48145
16070D8145r8870j28820j9897r7224L3963J45845N1586l2171j03995r2552j08134
$$ 48145 -50725 -179545 -199442 -296666 -262703 -116858 -65272 -97443 -201438 -293990 -402124
16059d02124J30081J54292k8764J18894p1541j22144n3223J6459J68372N6492
$$ -402124 -272043 -117751 -146515 -27621 -99162 -221306 -274529 -258070 -89698 -33206
16049c3206o3968M8216j00871j74087j36287n672J95612L07002K1299k18173q4817
$$ -33206 -97174 -48958 -149829 -323916 -460203 -465875 -270263 36739 58038 -160135 -244952
16038b44952M2245R7968l5235J24291o4254k31767J11141K41257R2583j3738J0129
$$ -244952 -202707 -104739 -139974 -15683 -79937 -311704 -200563 40694 133277 119539 129668
16027A29668n4332m1189n4940k06081k8864J41525R4129p4501L4289J47955l2155
$$ 129668 75336 34147 -20793 -226874 -255738 -114213 -20084 -94585 -60296 87659 55504
16016E5504K0831M9414j10859m6503j28276q7732j30614N4749J18061L9489O6181
$$ 55504 76335 125749 14890 -31613 -159889 -247621 -378235 -323486 -205425 -165936 -99755
16005i9755J62331O3139q2011q3088N4019P5095L1718j47122j29310j4139q070
$$ -99755 62576 125715 43704 -39384 14635 89730 121448 -25674 -154984 -169123 -177193
15994a77193K0754M6096N3550J0310o327q9270l9357j6593n821R0017Q1322P71
$$ -177193 -156439 -110343 -56793 -46483 -52810 -142080 -181437 -198030 -203851 -113834 -32512 -31741
15982c1741j43760K089p1091n9046J23659O3649K17706p618N0121j25011r5857
$$ -31741 -175501 -173412 -244503 -303549 -179890 -116241 101465 93847 143968 18957 -76900
15971g6900J7886q814l3288l5944k7306j4380J49577J30396l1281j9337n0163
$$ -76900 -59014 -67828 -101116 -137060 -164366 -178746 -29169 101227 69946 50609 446
15960D46O2993J30447O882r2832j53r4594j49708o5970N012M8826Q1515J07179
$$ 446 63439 193886 200768 107936 107783 13189 -136519 -202489 -197477 -148651 -67136 40043
15948D0043n9784J352K9117l5825k8137q4723j02456R978k2313k3511L6448M2757
$$ 40043 -19741 -18389 10728 -25097 -53234 -137957 -240413 -230435 -252748 -276259 -239811 -197054
15936a97054l0540Q5896J03139o988o645J25032K0853j08360q5355n4498J05604
$$ -197054 -227594 -141698 -38559 -45547 -52192 72840 93693 -14667 -100022 -154520 -48916
15925d8916L486j06629Q5049N2600n5338J24387N4770j05290k2811J5327j36783
$$ -48916 -45430 -152059 -67010 -14410 -69748 54639 109409 4119 -18692 -3365 -140148
15914a40148j56730J44573J13947j78978j2450J01956P7422l0510j4310o9756
$$ -140148 -296878 -152305 -38358 -217336 -229786 -127830 -50408 -80918 -95228 -164984
15904a64984O731R2118n4477Q612o7764j9257j6081K2007P7867L0833N7659J12446
$$ -164984 -158253 -66135 -120612 -112000 -179764 -199021 -215102 -193095 -115228 -84395 -26736 85710
15892H5710o7806M9452j18412p6380J0174J03419P9569o1087J48488o4706j7166
$$ 85710 17904 67356 -51056 -127436 -117262 -13843 65726 4639 153127 88421 71255
15881G1255L9741j37352n2966J2224J04420m0036p6239M1740p4439J2807l5834
$$ 71255 110996 -26356 -79322 -67098 37322 -2714 -78953 -37213 -111652 -98845 -134679
15870a34679j58433N8889J04075J55977J60850l0651j55853l0520m2136j43886
$$ -134679 -293112 -234223 -130148 25829 186679 156028 175 -30345 -72481 -216367
15860b16367L1452K07896O041j02635o0640j15360K02669J88064n4858r2406k30748
$$ -216367 -184915 22981 29022 -73613 -134253 -249613 -46944 141120 86262 -6144 -236892
15849b36892j15972J34334Q8173J28727k8496o5674J53019M8975l977n1971j47626
$$ -236892 -352864 -218530 -130357 -1630 -30126 -95800 57219 106194 102217 50246 -97380
15838i7380p648m7850k352J55782k2382r2792j05364O9623J58711K6616j15554
$$ -97380 -105028 -152878 -155230 552 -21830 -114622 -219986 -150363 8348 34964 -80590
15827h0590n4665j0456p6031L1589O8683L7528j94725j85321j3477J71854J29323
$$ -80590 -135255 -145711 -221742 -190153 -121470 -83942 -278667 -463988 -477465 -305611 -176288
15816a76288k03945Q8555o8692Q3022R9815q0801K7111m5041q55R0832N6162n9582
$$ -176288 -380233 -291678 -360370 -277348 -177533 -258334 -231223 -276264 -277119 -186287 -130125 -189707
15804a89707k4432q0737o9313J23632J57418j073j99181r0315J45796P7113o0358
$$ -189707 -214139 -294876 -364189 -240557 -83139 -84212 -283393 -373708 -227912 -150799 -211157
15793b11157N1581J3719o6475k6527j82267K2969N1162J60379P7556l238j14763
$$ -211157 -159576 -145857 -212332 -238859 -421126 -398157 -346995 -186616 -109060 -112298 -227061
15782b27061q4148K3625j74286R089J54277O3364o1083J23675J32058n9374o4676
$$ -227061 -311209 -287584 -461870 -452781 -298504 -235140 -296223 -172548 -40490 -99864 -164540
15771a64540m7675K6516M8479O9030m0326M3876l4954p1892k5424J39634J97476
$$ -164540 -212215 -185699 -137220 -68190 -108516 -64640 -99594 -171486 -196910 -57276 140200
15760A40200R356p0787j73785p1328O2206j11901J1045J34012K2153o7591n2019
$$ 140200 149556 78769 -95016 -166344 -104138 -216039 -204994 -70982 -48829 -116420 -168439
15749a68439M9275J28783j5420p8934l8913m417q5568k9346O3026J44694o7091
$$ -168439 -119164 9619 -5801 -84735 -123648 -128065 -213633 -242979 -179953 -35259 -102350
15738a02350l005j80283p2535N3610R1057J2341j81213j3995M4807P7414P7265
$$ -102350 -105355 -285638 -358173 -304563 -213506 -201165 -382378 -396373 -351566 -274152 -196887
15727a96887o0869j24688O0685K8425N9803N520L8141j3812M6186K34455j40073
$$ -196887 -257756 -382444 -321759 -293334 -233531 -228011 -189870 -203682 -157496 76959 -63114
15716f3114p5565K9144J27506O5107k10038j86422Q0549K08050R1038j49255Q3333
$$ -63114 -138679 -109535 17971 83078 -126960 -313382 -232833 -24783 66255 -83000 333
$$ [...]
##END NTUPLES=NMR SPECTRUM
##END=
