##TITLE=Analysis number 313464
Compound Code cc 41904
Book Reference 437/34
Project Code adrs
Chemist Name wendyb
##JCAMPDX= 6.0         $$ Bruker NMR JCAMP-DX V2.0
##DATA TYPE= NMR SPECTRUM
##DATA CLASS= NTUPLES
##ORIGIN= Bruker BioSpin GmbH
##OWNER= NMR
$$ XWIN-NMR		Version 3.5
$$ Fri Sep  9 10:17:51 2005 GMT Daylight Time (UT+1h)  MAYBRIDGE\NMR@NMR_250MHZ
##.OBSERVE FREQUENCY= 250.131544655141
##.OBSERVE NUCLEUS= ^1H
##.ACQUISITION MODE= SIMULTANEOUS (DQD)
##.ACQUISITION SCHEME= undefined
##.AVERAGES= 16
##.DIGITISER RES= 18
##SPECTROMETER/DATA SYSTEM= dpx250
##.PULSE SEQUENCE= zg30
##.SOLVENT NAME= CDCl3
##.SHIFT REFERENCE= (INTERNAL, CDCl3, 0, 16.522)
##AUDIT TRAIL= $$ (NUMBER, WHEN, WHO, WHERE, WHAT)
$$ ##TITLE= Audit trail, XWIN-NMR		Version 3.5
$$ ##JCAMPDX= 5.01
$$ ##ORIGIN= Bruker BioSpin GmbH
$$ ##OWNER= NMR
$$ C:\u/data/dgb/nmr/ADRS/9150/pdata/1/auditp.txt
$$ ##AUDIT TRAIL=  $$ (NUMBER, WHEN, WHO, WHERE, WHAT)
(   1,<2005-09-09 10:17:32.61 +100>,<MAYBRIDGE\NMR>,<NMR_250MHZ>,
      <created by zg, POWCHK disabled, PULCHK disabled
       configuration hash MD5:
       62 19 C7 07 E1 42 D1 B7 37 6C 3D D0 77 39 F9 E6
       data hash MD5: 64K
       10 9A D7 0E C5 4A BA 09 29 AA 07 B1 25 B8 5B 78>)
(   2,<2005-09-09 10:17:43.85 +100>,<MAYBRIDGE\NMR>,<NMR_250MHZ>,
      <Start of raw data processing
       ef LB = 0.3 FT_mod = 6 PKNL = 1 SI = 32K 
       data hash MD5: 32K
       45 DB 05 5C 79 60 35 4B 85 CC A9 DA 1A 37 43 09>)
(   3,<2005-09-09 10:17:45.71 +100>,<MAYBRIDGE\NMR>,<NMR_250MHZ>,
      <apk 
       data hash MD5: 32K
       41 3A 2D DF B6 74 4B 1C 7A 5A 78 E4 FA C4 2B 35>)
(   4,<2005-09-09 10:17:46.44 +100>,<MAYBRIDGE\NMR>,<NMR_250MHZ>,
      <abs ABSG = 5 
       data hash MD5: 32K
       E7 F1 AC 74 72 BB 0E EB A4 85 EE 02 5E B3 2E 19>)
$$ ##END=
$$ 
$$ hash MD5
$$ 90 B3 C8 26 56 17 CB D4 E9 5F 9F C5 84 CE 1F D0
##$RELAX= 
##$RELAX= 
##$RELAX= 
##$RELAX= 
##$RELAX= 
##$RELAX= 
##$RELAX= 
$$ Bruker specific parameters
$$ --------------------------
##$DU= <C:\u>
##$EXPNO= 9150
##$NAME= <ADRS>
##$PROCNO= 1
##$TYPE= <nmr>
##$USER= <dgb>
##$AMP= (0..31)
100 100 100 100 100 100 100 100 100 100 100 100 100 100 100 100 100 100 
100 100 100 100 100 100 100 100 100 100 100 100 100 100 
##$AQSEQ= 0
##$AQ_mod= 3
##$AUNM= <au_zg>
##$AUTOPOS= <11 >
##$BF1= 250.13
##$BF2= 250.13
##$BF3= 250.13
##$BF4= 250.13
##$BF5= 500.13
##$BF6= 500.13
##$BF7= 500.13
##$BF8= 500.13
##$BYTORDA= 1
##$CFDGTYP= 0
##$CFRGTYP= 5
##$CHEMSTR= <none>
##$CNST= (0..31)
1 1 145 1 1 1 1 1 1 1 1 1 1 1 1 1 1 1 1 1 1 1 1 1 1 1 1 1 1 1 1 1 
##$CPDPRG= <>
##$CPDPRG1= <>
##$CPDPRG2= <>
##$CPDPRG3= <>
##$CPDPRG4= <mlev>
##$CPDPRG5= <mlev>
##$CPDPRG6= <mlev>
##$CPDPRG7= <mlev>
##$CPDPRG8= <mlev>
##$CPDPRGB= <>
##$CPDPRGT= <>
##$D= (0..31)
0 1 0 0 0 0 0 0 0 0.06 0 0 0 0 0 0 0.0002 0 0 0 0 0 0 0 0 0 0 0 0 0 0 
0 
##$DATE= 1126257451
##$DBL= (0..7)
120 120 120 120 120 120 120 120 
##$DBP= (0..7)
150 150 150 150 150 150 150 150 
##$DBP07= 0
##$DBPNAM0= <>
##$DBPNAM1= <>
$$ [...]
##$SUBNAM7= <"">
##$SUBNAM8= <"">
##$SUBNAM9= <"">
##$SW= 20.6930455092707
##$SWIBOX= (0..15)
0 0 3 0 0 0 0 0 0 0 0 0 0 0 0 0 
##$SW_h= 5175.983436853
##$TD= 65536
##$TD0= 1
##$TE= 296.16
##$TE2= 300
##$TE3= 300
##$TEG= 300
##$TL= (0..7)
0 120 120 120 120 120 120 120 
##$TP= (0..7)
150 150 150 150 150 150 150 150 
##$TP07= 0
##$TPNAME0= <>
##$TPNAME1= <>
##$TPNAME2= <>
##$TPNAME3= <>
##$TPNAME4= <>
##$TPNAME5= <>
##$TPNAME6= <>
##$TPNAME7= <>
##$TPOAL= (0..7)
0.5 0.5 0.5 0.5 0.5 0.5 0.5 0.5 
##$TPOFFS= (0..7)
0 0 0 0 0 0 0 0 
##$TUNHIN= 0
##$TUNHOUT= 0
##$TUNXOUT= 0
##$USERA1= <user>
##$USERA2= <user>
##$USERA3= <user>
##$USERA4= <user>
##$USERA5= <user>
##$V9= 5
##$VALIST= <valist>
##$VCLIST= <CCCCCCCCCCCCCCC>
##$VD= 0
##$VDLIST= <DDDDDDDDDDDDDDD>
##$VPLIST= <PPPPPPPPPPPPPPP>
##$VTLIST= <TTTTTTTTTTTTTTT>
##$WBST= 1024
##$WBSW= 4
##$XGAIN= (0..3)
0 0 0 0 
##$XL= 0
##$YL= 0
##$YMAX_a= 339984
##$YMIN_a= -541039
##$ZGOPTNS= <>
##$ZL1= 120
##$ZL2= 120
##$ZL3= 120
##$ZL4= 120
##$ABSF1= 16.522
##$ABSF2= -4.171173
##$ABSG= 5
##$ABSL= 3
##$ALPHA= 0
##$AQORDER= 0
##$ASSFAC= 0
##$ASSFACI= 0
##$ASSFACX= 0
##$ASSWID= 0
##$AUNMP= <proc_1d>
##$AZFE= 0.1
##$AZFW= 0.1
##$BCFW= 0
##$BC_mod= 0
##$BYTORDP= 0
##$COROFFS= 0
##$CY= 12.5
##$DATMOD= 1
##$DC= 0
##$DFILT= <>
##$DTYPP= 0
##$F1P= 14.0000005364418
##$F2P= -0.99999901652339
##$FCOR= 0.5
##$FTSIZE= 32768
##$FT_mod= 6
##$GAMMA= 0
##$GB= 0
##$INTBC= 1
##$INTSCL= 1
##$ISEN= 128
##$LB= 0.3
##$LEV0= 0
##$LPBIN= 0
##$MAXI= 10000
##$MC2= 0
##$MEAN= 0
##$ME_mod= 0
##$MI= 0
##$NCOEF= 0
##$NC_proc= -5
##$NLEV= 6
##$NOISF1= 0
##$NOISF2= 0
##$NSP= 0
##$NTH_PI= 0
##$NZP= 0
##$OFFSET= 16.522
##$PC= 1
##$PHC0= -82.38853
##$PHC1= 5.792053
##$PH_mod= 1
##$PKNL= yes
##$PPARMOD= 0
##$PSCAL= 4
##$PSIGN= 0
##$REVERSE= no
##$SF= 250.13
##$SI= 32768
##$SIGF1= 0
##$SIGF2= 0
##$SINO= 400
##$SIOLD= 32768
##$SREGLST= <1H.CDCl3>
##$SSB= 0
##$STSI= 32768
##$STSR= 0
##$SW_p= 5175.98343685301
##$SYMM= 0
##$S_DEV= 0
##$TDeff= 65536
##$TDoff= 0
##$TI= <Analysis number 999999
Compound Code 99
Book Reference 9
Project Code 9>
##$TILT= no
##$TM1= 0
##$TM2= 0
##$TOPLEV= 0
##$USERP1= <user>
##$USERP2= <user>
##$USERP3= <user>
##$USERP4= <user>
##$USERP5= <user>
##$WDW= 1
##$XDIM= 32768
##$YMAX_p= 396670673
##$YMIN_p= -381546
$$ End of Bruker specific parameters
$$ ---------------------------------
##NTUPLES= NMR SPECTRUM
##VAR_NAME=  FREQUENCY,     SPECTRUM/REAL,   SPECTRUM/IMAG
##SYMBOL=    X,             R,               I
##VAR_TYPE=  INDEPENDENT,   DEPENDENT,       DEPENDENT
##VAR_FORM=  AFFN,          ASDF,            ASDF
##VAR_DIM=   32768,         32768,           32768
##UNITS=     HZ,            ARBITRARY UNITS, ARBITRARY UNITS
##FACTOR=    0.157963299565203, 1,           1
##FIRST=     4132.6476996994, 0,             0
##LAST=      -1043.33573715361, 0,           0
##MIN=       -1043.33573715361, -381546,     0
##MAX=       4132.6476996994, 396670673,     0
$$ Real data points
##PAGE= N=1
##DATA TABLE= (X++(R..R)), XYDATA
$$ [...]
18593D3358636J0554042L553238p502879j2539766j0119761o987219m516324k782591
$$ 43358636 53912678 57465916 49963037 37423271 27303510 20316291 15799967 13017376
18585A3017376j827208j428721j146061q31508n04254j21431J30641K94210K70037
$$ 13017376 11190168 9761447 8615386 7783878 7279624 7158193 7288834 7583044 7853081
18576G853081P5798j8631O2740J61935K06779K38265L51492N68920P94503J000299
$$ 7853081 7928879 7910248 7972988 8134923 8341702 8579967 8931459 9500379 10294882 11295181
18566A1295181J137898J374885J879314L008346M915729Q189861J2838814J6016711
$$ 11295181 12433079 13807964 15687278 18695624 23611353 31801214 44640028 60656739
18558F0656739J3069904K744285q382451q494587j106968O948487J1621183Q910217
$$ 60656739 73726643 76470928 68088477 59593890 58486922 65435409 77056592 85966809
18550H5966809m16135o481250j858392M173707L746513l962385j1671604r568202
$$ 85966809 85550674 79069424 77211032 81384739 85131252 81168867 69497263 59929061
18542E9929061j903195N552415Q047727K705336r028312j5643523j3159617r042074
$$ 59929061 58025866 63578281 71626008 74331344 65303032 49659509 36499892 27457818
18534B7457818n901442l909975k752310k057029j658529j354977q79620n46673
$$ 27457818 21556376 17646401 14894091 12837062 11178533 9823556 8943936 8397263
18526H397263l41780j18781J54830K16869K44823K78131K37241O7220j92849k75588
$$ 8397263 8055483 7936702 8091532 8308401 8553224 8831355 9068596 9135816 8942967 8667379
18516H667379p2447K08507M48073Q30786J363005J984987K920059M615741P655090
$$ 8667379 8594932 8803439 9251512 10082298 11445303 13430290 16350349 20966090 28621180
18507B8621180J2402918J6308513J4165975L574917j0895569j5607116j1765371
$$ 28621180 41024098 57332611 71498586 75073503 64177934 48570818 36805447
18500C6805447p365949l775895p94214K139176O012552J1005582J4228342J0861408
$$ 36805447 29439498 25663603 24869389 27008565 33021117 44026699 58255041 69116449
18492F9116449m03407j2991404j5429593j1640678p949761n242399l418693k495350
$$ 69116449 68713042 55721638 40292045 28651367 20701606 15459207 12040514 9545164
18484I545164j859107j353539r70785p16630m76856l16123k43446j95141p5952
$$ 9545164 7686057 6332518 5361733 4645103 4168247 3852124 3608678 3413537 3337585
18475C337585r783n6957k9289L6579L226j55644l43756l61443j90504j77476j93087
$$ 3337585 3327802 3270845 3241556 3278135 3281361 3125717 2781961 2420518 2230014 2052538 1859451
18464A859451j69353j59432j45236j25645k15843j67389l8669K2911M3710m8639
$$ 1859451 1690098 1530666 1385430 1259785 1043942 876553 837884 860795 904505 855866
18454H55866o6613J2386m6176p1445o0352j0264N4316j10526n2798J09088J5920
$$ 855866 789253 801639 755463 684018 623666 613402 667718 557192 504394 613482 629402
18443F29402j0464M395r6537n9318r5093o271n5928L4738k5796m8100J65490K9792
$$ 629402 618938 623333 526796 467478 372385 366114 310186 344924 319128 271028 436518 466310
18431D66310l0577K6830o9637k0007o9168k5680J01264M5561M229j2811n8617
$$ 466310 435733 462563 392926 372919 303751 278071 379335 424896 429125 416314 357697
18420C57697m480P3049N7810l0472m188j05636o5405Q3596k1186j27396n141j538
$$ 357697 353217 426266 484076 453604 449416 343780 278375 361971 340785 213389 208248 206710
18408B06710l8075J7933M9711J72343K172J8767n3324K6453m7755r6821k3196
$$ 206710 168635 186568 236279 408622 410794 429561 376237 402690 354935 258114 234918
18397B34918n8507n4155p3361J02552j23347K9211Q8871j466K526K3300Q843m5926
$$ 234918 176411 122256 48895 151447 28100 57311 146182 144716 147242 170542 179385 133459
18385A33459p5212Q3589N3540J6911K2714j5635l4416J07871J1061l0692J0445
$$ 133459 58247 141836 195376 212287 235001 219366 184950 292821 303882 273190 283635
18374B83635O024m0366L1266J505j5707k5996K2316N9884L315j12560o5992l9526
$$ 283635 289659 249293 280559 282064 266357 240361 262677 322561 325876 213316 147324 107798
18362A07798Q0024R7514j483n6461j1081j38500o199o7470k7754J31995O3873
$$ 107798 187822 285336 283853 227392 216311 77811 71612 4142 -23612 108383 172256
18351A72256p3955j3451O0209L87o7327q4731p6467R601N2256J71316J07176L0274
$$ 172256 98301 84850 145059 145446 78119 -6612 -83079 -73478 -21222 150094 257270 287544
18339B87544l2245j24096K3522M8629J0227K8846m5435k5847L5069M332M5045
$$ 287544 255299 131203 154725 203354 213581 242427 196992 171145 206214 210546 255591
18328B55591L8759L0794p7671K8237j9131o4173J00806O0482j0259P3965L3396
$$ 255591 294350 325144 247473 275710 256579 192406 293212 353694 343435 417400 450796
18317D50796K1678l0498P6126J7083n8082K1719j5320J69246N2775j30977j20036
$$ 450796 472474 441976 518102 535185 477103 498822 483502 652748 705523 574546 454510
18306D54510m5082K2314k3991j47745l7293n1800O0075k9166j17007j2967k2791
$$ 454510 409428 431742 407751 260006 222713 170913 230988 201822 84815 71848 49057
18295D9057O3039O7328J1505k0414L5773p5311N197N5102J24146M8395J2536j8977
$$ 49057 112096 179424 190929 170515 206288 130977 136174 191276 315422 363817 376353 357376
18283C57376j13345j8318o2091r919o1562n4506O0834P0678j8960R3153J13089
$$ 357376 244031 225713 163622 153703 92141 37635 98469 169147 150187 243340 356429
18272C56429P5927R6262p0197j9370L6694K9538k27J29722R1799J18330P5229
$$ 356429 432356 528618 458421 439051 475745 505283 505056 634778 726577 844907 920136
18261I20136q9367r2596m2520j3142r4379o3849K1336m4951q4337p0440p0971
$$ 920136 830769 738173 695653 682511 588132 524283 545619 500668 416331 345891 274920
18250B74920J7056R3167M0063q836M0020M4895N9475K1782m4581p5315J7400O5536
$$ 274920 291976 385143 425206 416370 456390 501285 560760 582542 537961 462646 480046 545582
18238E45582j9810n0621j0848r3875n8949L4925k0435p504j939p364O2568q5284
$$ 545582 525772 475151 464303 370428 311479 346404 325969 318465 316526 309162 371730 286446
18226B86446p4167L5127J1799n5721J05768R7685M826Q3783k1970j03740l383
$$ 286446 212279 247406 259205 203484 309252 406937 411763 495546 473576 369836 366453
18215C66453N7726M523p573J312M6936M1442o3192l0354K9218m8831J4066P7090
$$ 366453 424179 428702 421129 422441 469377 510819 447627 417273 446491 397660 411726 488816
18203D88816J94384K01920K01015J7376l736J2387N7920m9656p9374O5767P9875
$$ 488816 683200 885120 1086135 1103511 1099775 1112162 1170082 1120426 1041052 1106819 1186694
18192A186694o4811n6214j47115j36834j17529n4779l6006o7909m7167l6317O5441
$$ 1186694 1121883 1065669 918554 781720 664191 609412 573406 505497 458330 422013 487454
18181D87454N7776K3904q44m2593r1085k9898l1866j9903M5500K2336l1512L0200
$$ 487454 545230 569134 568290 525697 434612 404714 372848 352945 398445 420781 389269 419469
18169D19469L9762L4201n5631l8919Q0063J09169O0522M9348N3396j8720l9729
$$ 419469 459231 493432 437801 398882 478945 588114 648636 697984 751380 732660 692931
18158F92931Q5568J93920K59155L82141L88627L13062o0719j97360j85102k708
$$ 692931 778499 972419 1231574 1613715 2002342 2315404 2254685 2057325 1872223 1869515
18148A869515k3982L7194J50023L08087L61466L33753K87657Q7730j97286l84029
$$ 1869515 1845533 1882727 2032750 2340837 2702303 3036056 3323713 3411443 3214157 2830128
18138B830128l99792k42668j88972j38774j23586p3020P5447Q4234R1631J57747
$$ 2830128 2430336 2187668 1998696 1859922 1736336 1663316 1738763 1822997 1914628 2072375
18128B072375J66357J92972K13131K60317L21921M28788M84957M88842O18281
$$ 2072375 2238732 2431704 2644835 2905152 3227073 3655861 4140818 4629660 5247941
18119E247941O37593Q38012R24332J193309J684368K712753M246339P080587J2399022
$$ 5247941 5885534 6723546 7647878 8841187 10525555 13238308 17484647 24565234 36964256
18110C6964256K3016177L9692154M7718256L1787602j3326248m9220078l9566871
$$ 36964256 59980433 99672587 147390843 179178445 165852197 116632119 77065248
18103G7065248k5183802j5876862r776850o332425m410465k979650j892673j057616
$$ 77065248 51881446 36004584 26227734 19895309 15484844 12505194 10612521 9554905
18095I554905n06319k39360j81175m47519r27453j188237j088435o84227n44803
$$ 9554905 9048586 8809226 8628051 8180532 7253079 6064842 4976407 4292180 3747377
18086C747377k41713j71135o1087n4938k26139j14968p0044R0834J91013K84168
$$ 3747377 3505664 3334529 3273442 3218504 2992365 2877397 2807353 2898187 3089200 3373368
18076C373368K21613K79952J75592L1255J1699j26655r2417j28236j72254j53365
$$ 3373368 3594981 3874933 4050525 4081780 4093479 3966824 3874407 3746171 3573917 3420552
18066C420552r4787M3851J72597J62332k0245o5738q2048m4856j39665j4927Q579
$$ 3420552 3325765 3369616 3542213 3704545 3684300 3618562 3536514 3491658 3351993 3337066 3345645
18055C345645j60044k26411k65725l18589q6926j2897O0360L14141N25075O65431
$$ 3345645 3185601 2959190 2693465 2374876 2287950 2275053 2335413 2649554 3174629 3840060
18045C840060N49921K48687j34689p00510p40259n00645k90946j58778r9942n5705
$$ 3840060 4389981 4638668 4503979 3803469 3063210 2562565 2271619 2112841 2012899 1957194
18035A957194P8359J32278L05673L59105L67195L80095R8162Q4036J82253K82456
$$ 1957194 2035553 2167831 2473504 2832609 3199804 3579899 3678061 3762097 3944350 4226806
18025D226806K32748J33602j22493l14479k89350j30226L6363J03748j06812j44193
$$ 4226806 4459554 4593156 4470663 4156184 3866834 3736608 3772971 3876719 3769907 3625714
18015C625714j35860k51722l59477l61936l35753l58648l34447k95182j21673
$$ 3625714 3489854 3238132 2878655 2516719 2180966 1822318 1487871 1192689 1071016
18006A071016j06987j57050j44347N8731O672m9855m171J23439J48851P8461p1029
$$ 1071016 964029 806979 662632 721363 728035 678180 674009 797448 946299 1024760 953731
17995I53731r1328j27035k0379l7468n4207J5327j3137j2914O4280J36780L1980
$$ 953731 862403 735368 714989 677521 623314 638641 625504 612590 676870 813650 845630
17984H45630J723l9125j57499k6018K1153o052m0016j40927l2512P05Q8284R6980
$$ 845630 847353 808228 650729 624711 645864 639812 599796 458869 426357 427062 515346 612326
17972F12326k1366J1877m2319L0136n7068P69M1373L0543L4976n4709L9147n7190
$$ 612326 590960 602837 560518 590654 533586 534355 575728 606271 641247 586538 625685 568495
17960E68495P84k0460m6192j24192l4250Q5266L5491j08612j15521l3740J09375
$$ 568495 569279 548819 502627 378435 344185 429451 464942 356330 240809 207069 316444
17949C16444N5922N8635J9830n6861Q7371L4518p7871P5240P6570j58346K5303
$$ 316444 372366 431001 450831 393970 481341 515859 437988 513228 589798 431452 456755
17938D56755J2703R3841P3116N8740k4861n3217n5836n7634k3138Q7903J2774
$$ 456755 469458 563299 636415 695155 670294 617077 561241 503607 480469 568372 581146
17927E81146n22l9336m5895m7285Q1151o823q6719l3014Q159l7393q1757o102
$$ 581146 580624 541288 495393 448108 529259 522436 435717 402703 410862 373469 291712 285610
17915B85610p7872k1221j5878J55195J17446K5092n2384j30045n3254N2822M3446
$$ 285610 207738 186517 170639 325834 443280 468372 415988 285943 232689 285511 328957
17904C28957O3289J00331O2295K3010o8751l1811N0984N8639J05039J7948P5600
$$ 328957 392246 492577 554872 577882 509131 477320 528304 586943 691982 709930 785530
17893G85530P7012K6534J503N4253J34434N8237R5818J18930P6229M9162J91880
$$ 785530 862542 889076 890579 944832 1079266 1137503 1233321 1352251 1428480 1477642 1669522
17882A669522J17804j7745M1497P5506o0699k11821j15370j12720o3063o3325
$$ 1669522 1787326 1769581 1811078 1886584 1825885 1614064 1498694 1385974 1322911 1259586
17872A259586n1614o3062j94901j24233j06099l9200J9169J50493P0774p907n8619
$$ 1259586 1207972 1144910 950009 825776 719677 680477 699646 850139 920913 913006 854387
17861H54387J18547K80557K20220O9832k1283k486q0140o299K11j80342q1944
$$ 854387 972934 1253491 1473711 1543543 1522260 1519774 1439634 1433335 1433546 1253204 1171260
17850A171260L5769R9822k5783j00441p9002N1030N4910Q0037J50998J60354J81899
$$ 1171260 1207029 1306851 1281068 1180627 1101625 1152655 1207565 1287602 1438600 1598954 1780853
17839A780853J91276J32019K56261J57646J45995K29692J52869J79219J57460
$$ 1780853 1972129 2104148 2360409 2518055 2664050 2893742 3046611 3225830 3383290
17830C383290R2730m1398o2382m6142R612K5009p1554r1356m4462J39069K03154
$$ 3383290 3476020 3434622 3372240 3326098 3335710 3360719 3289165 3197809 3153347 3292416 3495570
17819C495570J35997K30832J98123L49872L69632L45921M05036M87795O71079
$$ 3495570 3631567 3862399 4060522 4410394 4780026 5125947 5530983 6018778 6689857
17810F689857Q58255J178256J625068K295736L413566N322841P886381Q982750
$$ 6689857 7548112 8726368 10351436 12647172 16060738 21383579 29269960 38252710
17802C8252710P137153K810057J471931N768702J0621366J0605276L197817p035206
$$ 38252710 45389863 48199920 49671851 55440553 66061919 76667195 79865012 72829806
17794G2829806j0178353n836814j297652j031848n599328j0181242r706693p207435
$$ 72829806 62651453 56814639 55516987 54485139 48885811 38704569 28997876 21790441
17786B1790441m883888l171643k190211j491669j067042q10198m93897k54814
$$ 21790441 16906553 13734910 11544699 10053030 8985988 8175790 7681893 7427079
17778G427079j49872j50587p3426K1817J86854K76802K92294Q5813J10706K16014
$$ 7427079 7277207 7126620 7053194 7075011 7261865 7538667 7830961 7916774 8027480 8243494
17768H243494K59357M57974O20014O09111Q40591J145242J682826K425609L559423
$$ 8243494 8502851 8960825 9580839 10189950 11030541 12175783 13858609 16284218 19843641
17759A9843641N596838Q594959J1737031J3222838J1778281Q606644Q031734R571706
$$ 19843641 25440479 34035438 45772469 58995307 70773588 79380232 87411966 96983672
17751I6983672J2541669J3247456P702278p17425p328577j0852949r119340o322588
$$ 96983672 109525341 122772797 130475075 129757650 122429073 111576124 102456784 96134196
17743I6134196p827749j1049954j4380427j5373052j2035185q461820n849930
$$ 96134196 88306447 77256493 62876066 47503014 35467829 27006009 21156079
17736B1156079l987567k769887j939998j373187j034268o91422n11678l55984
$$ 21156079 17168512 14398625 12458627 11085440 10051172 9359750 8848072 8492088
17728H492088k20006l3231J05394J67805J26400q12O7313K21678K69388J69008
$$ 8492088 8272082 8238851 8344245 8512050 8638450 8637638 8704951 8926629 9196017 9365025
17718I365025L07993M87880O92082R72396J326562J632404K120500L149153M849945
$$ 9365025 9673018 10160898 10852980 11825376 13151938 14784342 16904842 20053995 24903940
17709B4903940P328080R062620Q283847N134602L663858Q014829J4761813J9022064
$$ 24903940 32232020 41294640 49578487 54713089 58376947 66391776 81153589 100175653
17701A00175653J7932076J2917188J0737671J3011963J3708662R304147J470417
$$ 100175653 118107729 131024917 141762588 154774551 168483213 177787360 179257777
17694A79257777o985058j0340343r975820j0552648j2731991j5230463j7702214
$$ 179257777 172272719 161932376 151956556 141403908 128671917 113441454 95739240
17687I5739240j8634694j6834850j3630083j0275251p335843n266710l808414
$$ 95739240 77104546 60269696 46639613 36364362 29028519 23761809 19953395
17680A9953395k791954k098821j620997j292683j065762q34997o22459n59416
$$ 19953395 17161441 15062620 13441623 12148940 11083178 10248181 9625722 9066306
17672I066306n32825k75071k48227k53458j35158K067l5240Q6626J97881K90452
$$ 9066306 8533481 8258410 8010183 7756725 7621567 7623634 7588394 7675020 7872901 8163353
17662H163353L12049K22306L47823M60477M91905N65274P08463R38775J231005
$$ 8163353 8475402 8697708 9045531 9506008 9997913 10563187 11271650 12210425 13441430
17653A3441430J659909K459555L670142N578122Q124383J1241417J4613339J6968076
$$ 13441430 15101339 17560894 21231036 26809158 34933541 46174958 60788297 77756373
17645G7756373J7313892J5027634J0519830O091318J966219j360594k773747m528442
$$ 77756373 95070265 110097899 120617729 126709047 128675266 127314672 124540925 120012483
17637A20012483p620648j0820454j4109583j5938246j5151352j2789883j0004237
$$ 120012483 112391835 101571381 87461798 71523552 56372200 43582317 33578080
17630C3578080p225022n301850l866507k833126k222752j762210j336195r53553
$$ 33578080 26353058 21051208 17184701 14351575 12128823 10366613 9030418 8076865
17622H076865p68297p83926m93020m29381l48153l06833l04127l13647k47811
$$ 8076865 7308568 6524642 6031622 5602241 5254088 4947255 4643128 4329481 4081670
17613D081670r5416n771M3313n684J3016o989R6652J82418K82726L51898P61154
$$ 4081670 3986254 3980483 4023796 4018112 4031128 4024139 4120791 4303209 4585935 4937833 5698987
17602E698987Q62447R13719R52567R10421R79063J247153J279457P79609n5996
$$ 5698987 6561434 7475153 8427720 9338141 10317204 11564357 12843814 13623423 13567427
17593A3567427q76731j519296j683516j515479j380240j047948p22955m67746
$$ 13567427 12690696 11171400 9487884 7972405 6592165 5544217 4821262 4353516
17585D353516n11372l60950l37621l57160j98218j38545j05015j13903r1713j21004
$$ 4353516 3842144 3481194 3143573 2786413 2588195 2449650 2344635 2230732 2139019 2018015
17575B018015q2893o0207j14230k61971j57680o8471n2083k2562J0615k1779j072
$$ 2018015 1935122 1874915 1760685 1498714 1341034 1272563 1220480 1197918 1208533 1186754 1185682
17564A185682P3014L2293n0663l5964J4901J95231P8529J23157K52341L61705
$$ 1185682 1258696 1290989 1240326 1204362 1219263 1414494 1493023 1616180 1868521 2230226
17554B230226L15843J87464K77177M91721Q10454J026253Q96298O51088K87353
$$ 2230226 2546069 2733533 3010710 3502431 4312885 5339138 6235436 6886524 7173877
17545G173877j30022o32357n95202n13951l85561m19030m62142m43350l44061
$$ 7173877 7043855 6411498 5816296 5302345 4916784 4497754 4035612 3592262 3248201
17536C248201l92814m13453l20984k89264k60105k50956j97236j59838j75522
$$ 3248201 2855387 2441934 2120950 1831686 1571581 1320625 1123389 963551 788029
17527G88029j25413o3482J3062j21257K9124K8651K2783n5367j5477l3280m4913
$$ 788029 662616 599134 612196 490939 520063 548714 571497 516130 500653 467373 422460
17516D22460J7624q3234j5840q6966L4916Q1775L4302j059o6210k690m5431q3751
$$ 422460 440084 356850 341010 254044 288960 370735 405037 403978 337768 335078 289647 205896
17504B05896M4895k6996l2121J5658J0283J1630J8532k9866m4870J8915K2823
$$ 205896 250791 223795 191674 207332 217615 229245 247777 217911 173041 191956 214779
17493B14779O493K1763l5295N6320P0659J0917m3532R939k3686J0157n2085n8880
$$ 214779 221272 243035 207740 264060 334719 345636 302104 312043 288357 298514 246429 187549
17481A87549J510k665k9950K8492R122m7221r1457r2233q931L2502J08168l5768
$$ 187549 189059 186394 156444 184936 194058 146837 55380 -36853 -45784 -13282 94886 59118
17469E9118p2639o9914J2674M2840R6106M4228L0359r3229j8226L707O7132L1849
$$ 59118 -13521 -83435 -70761 -27921 68185 112413 142772 49543 31317 35024 102156 134005
17457A34005q9186k2534P7191O4073l2555j1280o3531M8977J54676K9670l7872
$$ 134005 44819 22285 99476 163549 130994 119714 56183 105160 259836 289506 251634
17446B51634m8804J650O9032J44124K42851K57928J04651j98358j71304j99032
$$ 251634 202830 204480 273512 417636 660487 918415 1023066 824708 653404 454372
17436D54372r4180o120p3251p8154N3167o5819p9475l5652N437P7028l0876j1595
$$ 454372 360192 354072 280821 202667 255834 190015 110540 74888 80325 157353 126477 114882
17424A14882l2819n3990K567R2428L3245m0736j70707r1901L7898L2993o8346
$$ 114882 82063 28073 30640 123068 156313 115577 -55130 -147031 -109133 -76140 -144486
17413a44486r2265O3493N720M0678N1488J3771P602O747M9987K3992K8781K9536
$$ -144486 -236751 -173258 -167538 -126860 -75372 -61601 -53999 -47252 2735 26727 55508 85044
17401H5044n8436M7937j4808j27543j4982Q15N2361J33859J2996l3938n6135r031
$$ 85044 26608 74545 59737 -67806 -82788 -81973 -29612 104247 117243 83305 27170 18139
17389A8139m4727J3042k664J31M8890R8490O1697l8776k8953j697L2946o2617
$$ 18139 -26588 -13546 -16210 -16079 32811 131301 192998 154222 125269 123572 156518 93901
17377I3901p4684L5301k71j5696m5732J902l8003j11884m6143M3361O5925J30955
$$ 93901 19217 54518 54247 38551 -7181 -5279 -43282 -155166 -201309 -157948 -92023 38932
17365C8932P2651l8464o9762n2612j5251O135K9795l434k5984o654L2593K4878
$$ 38932 111583 73119 3357 -49255 -64506 -58371 -28576 -32010 -57994 -64648 -32055 -7177
17353g177n0089J4413J6814j06448N776P7281M3007o7359R591K8779j6862J842
$$ -7177 -57266 -42853 -26039 -132487 -126711 -49430 -6423 -73782 -64191 -35412 -52274 -50432
17341e0432m5459k6427N9864M8529J3402l6573k4890J6674J56411L5808j3167
$$ -50432 -95891 -122318 -62454 -13925 -523 -37096 -61986 -45312 111099 146907 133740
17330A33740N1575l5675J1304Q990m9256r326r3759l8860n9753O6347n395k3075
$$ 133740 185315 149640 160944 169934 120678 111352 17593 -21267 -81020 -14673 -20068 -43143
17318d3143l0771k8633j3671J13980L1905o8775m2757M168K7653N1286L4005o2762
$$ -43143 -73914 -102547 -116218 -2238 29667 -39108 -81865 -77697 -50044 1242 35247 -27515
17306b7515P218J6269m947o8416K456M8525J2019K1715O4636M629l4106m5452
$$ -27515 -20297 -4028 -8975 -77391 -74935 -26410 -14391 7324 71960 76589 42483 -2969
17294b969p8005N5268P1581K5213l0640O429L8093Q9642O415J4265j9955Q3984
$$ -2969 -80974 -25706 45875 71088 40448 46877 84970 174612 181027 195292 175337 259321
17282B59321O0566N0431l8972n1367l0607P5063Q1441L5804k256l6422j03152
$$ 259321 319887 370318 331346 279979 249372 324435 405876 441680 439424 403002 299850
17271B99850r0006l3095j00384j66792m8810J37660J02772J12935j25206j31326
$$ 299850 209844 176749 76365 -90427 -139237 -1577 101195 214130 88924 -42402
17261d2402p5981N4251N9596k1711j4062n8867m1896J27797J03888J31798O749
$$ -42402 -118383 -64132 -4536 -26247 -40309 -99176 -141072 -13275 90613 222411 229160
17250B29160p0971L8617L5631p7725p4488J7526j3251J38117p7064k9204m6480
$$ 229160 158189 196806 232437 154712 80224 97750 84499 222616 145552 116348 69868
17239F9868l0466K8569j4575N1430Q2220N2119O4167K3317P0994J22425Q4128
$$ 69868 39402 67971 53396 104826 187046 239165 303332 326649 397643 520068 604196
17228F04196P5142N5732l5628o9660r2516n0002k6502o5320k7154l9542r1127
$$ 604196 679338 735070 699442 629782 537266 487264 460762 395442 368288 328746 237619
17217B37619q8398q278p3570J9841M4817k471m7988L2923k874r4695j4894N6759
$$ 237619 149221 140943 67373 87214 132031 129560 81572 114495 111621 16926 2032 58791
17205E8791R3279k5501r7559m3511O3290L2537k6785K2453m3002J3873N2453N7319
$$ 58791 152070 126569 29010 -14501 48789 81326 54541 76994 33992 47865 100318 157637
17193A57637J72730J18742J9718J33628J35388k5263Q2196P2691K2541N265k0212
$$ 157637 330367 449109 468827 602455 737843 712580 794776 867467 890008 895273 875061
17182H75061O8439J326r4592r4930j36970j07039j00650o8933L775r6461o3450
$$ 875061 943500 944826 850234 755304 618334 511295 410645 341712 345487 249026 185576
17171A85576o2164o7065n6638K8322J01464J2355m2019q3330L4112L5147j24891
$$ 185576 123412 56347 -291 28031 129495 141850 99831 16501 50613 85760 -39131
17160c9131l8327K9264r3637J9681N0579R0911R1922j6006m4798L9451Q9387K75
$$ -39131 -77458 -48194 -141831 -122150 -71571 19340 111262 95256 50458 89909 179296 179571
17148A79571o3253m5318M1992K6742k0246j1478l3241p3792J31810N3825N5042
$$ 179571 116318 71000 112992 139734 119488 108010 74769 977 132787 186612 241654
17137B41654Q3447R0389J46199R9225J10654n0418l8017k830j05668m829j35433
$$ 241654 325101 415490 561689 660914 771568 721150 683133 680303 574635 569806 434373
17126D34373p4461n9687o3657j11123j32313k4030k2280j2639L1830k6725r4014
$$ 434373 359912 300225 236568 125445 -6868 -30898 -53178 -65817 -33987 -60712 -154726
17115a54726k7762k024L7813M4147O2718N4512o4724k8618R1278J07785P145L691
$$ -154726 -182488 -184512 -146699 -102552 -39834 14678 -50046 -78664 12614 120399 127544 131235
17103A31235q919K219n6564r1828K8749L6148O0668M9856p3611K4584K5440j43591
$$ 131235 122316 124535 67971 -23857 4892 41040 101708 151564 77953 102537 127977 -15614
17091a5614m6051Q5692N0850l8252r8596L0276j7911l9488r6197r3395K6150R3946
$$ -15614 -61665 24027 74877 36625 -61971 -31695 -49606 -89094 -185291 -278686 -252536 -158590
17079a58590M1868J0166k3154j5900L8312K9289j5997k7067j03231L4791K6155
$$ -158590 -116722 -106556 -129710 -145610 -107298 -78009 -94006 -121073 -224304 -189513 -163358
17068a63358M7248L7308l3450Q831p296q3345L2127k233L2602P0640Q684k3023
$$ -163358 -116110 -78802 -112252 -103421 -110717 -194062 -161935 -164168 -131566 -60926 -52242 -75265
17056g5265k3388L0935P855O449n2951m6568M3437L6220m2214K4858j9649n7998
$$ -75265 -98653 -67718 -59863 -53414 -106365 -152933 -109496 -73276 -115490 -90632 -110281 -168279
17044a68279J04923J8010K3520n6791N849R8457Q9932N1875m5433j13734L9996
$$ -168279 -63356 -45346 -21826 -78617 -72768 25689 115621 167496 122063 8329 48325
17033D8325J7708m7458n8219n0391J1097P0341M7674l5765J1505p4299P1974k8765
$$ 48325 66033 18575 -39644 -90035 -78938 -8597 39077 3312 14817 -59482 12492 -16273
17021a6273r5739M5233J1266m2255r5362Q4976J09759q9108j2272o463O8517n113
$$ -16273 -112012 -66779 -55513 -97768 -193130 -108154 1605 -87503 -99775 -106238 -37721 -42834
17009d2834n3259k1666r360L430M2220N7705J21203p7953j7595P5810R1403r508
$$ -42834 -96093 -117759 -127119 -123689 -81469 -23764 97439 19486 1891 77701 169104 159596
16997A59596K682j06342q0026o7100q1167n2639J2394P4046K3030j1110O3021
$$ 159596 162278 55936 -24090 -91190 -172357 -224996 -212602 -138556 -115526 -126636 -63615
16986f3615J8598l0629K2095M331K4952l0122N0652R6874L6045n1692p8920p4929
$$ -63615 -45017 -75646 -53551 -49220 -24268 -54390 -3738 93136 129181 77489 -1431 -76360
16974g6360j09223K4182M3278Q3745l5029k5573L5408K9995m7266o275n8652J7217
$$ -76360 -185583 -161401 -118123 -34378 -69407 -94980 -59572 -29577 -76843 -83118 -141770 -124553
16962a24553N9960L6369L3206M0696M4412p9445m9997j3094m8043J3829M3490
$$ -124553 -64593 -28224 4982 45678 90090 10645 -39352 -52446 -100489 -86660 -43170
16951d3170J5256R6874L3464L5209N963j430L846K0136K9671m2768j00447J1467
$$ -43170 -27914 68960 102424 137633 143596 142166 146012 166148 195819 153051 52604 64071
16939F4071J7373o3723m1331j4893m483J5156l2677O1706K9006l7788O1203M1517
$$ 64071 81444 17721 -23610 -38503 -42986 -27830 -60507 1199 30205 -7583 53620 95137
16927I5137N05o2796q4333j50117k7882L5613N2309M8120p2901j7749M7084J56542
$$ 95137 95642 32846 -51487 -201604 -229486 -193873 -141564 -93444 -166345 -184094 -137010 19532
16915A9532O8364p6314l8896n3009o0754m0134L1455Q6634P3703J02665N679q6198
$$ 19532 87896 11582 -27314 -80323 -141077 -181211 -149756 -63122 10581 113246 118925 32727
16903C2727j25606J1162P537j2627M0898n1405q2835R0059M9781l6371J1352P458
$$ 32727 -92879 -81717 -74180 -86807 -45909 -97314 -180149 -90090 -40309 -76680 -65328 -57870
16891e7870Q7475M677J0939l8255L5549L2829l9609j04558K7375P5259m9731p6091
$$ -57870 29605 34282 45221 6966 42515 75344 35735 -68823 -41448 33811 -15920 -92011
16879i2011J7055K147M804k117q504J08536r258j10516j5435K4709j2781L9000
$$ -92011 -74956 -72809 -68005 -70122 -78626 29910 20652 -89864 -105299 -80590 -93371 -54371
16867e4371O380M2794J4445M6472p9342l9461K7521L6203n7403o1121o2607j8939
$$ -54371 -47991 -5197 9248 55720 -23622 -63083 -35562 641 -56762 -117883 -180490 -199429
16855a99429N2574J3556K9653n1955q493O3490N4120p1287N8302n309R4532L3273
$$ -199429 -146855 -133299 -103646 -155601 -164094 -100604 -46484 -117771 -59469 -64778 29754 63027
16843F3027j04489r7588m9391L8468Q3R5813L9132j6346q5510L4227R0421J1093
$$ 63027 -41462 -139050 -188441 -149973 -149890 -54077 -14945 -31291 -116801 -82574 7847 18940
16831A8940r938m8900j52746J8586j5582M1603J4022n1160M6302M4593k9481n609
$$ 18940 9002 -39898 -192644 -174058 -189640 -148037 -134015 -185175 -138873 -94280 -123761 -129370
16819a29370k4431J4479J3248N8687j8448m0611j8587J2974P6976K5610l6717
$$ -129370 -153801 -139322 -126074 -67387 -85835 -126446 -145033 -132059 -55083 -29473 -66190
16808f6190P4337O3614l2283k7251l3489P1171n0400n776k1674n335l7035q7360
$$ -66190 8147 71761 39478 12227 -21262 49909 -491 -6267 -27941 -33276 -70311 -157671
16796a57671k8142p238P483J1482L6646N1708k0178j734k1342j6608L6109J21589
$$ -157671 -185813 -193051 -185568 -174086 -137440 -85732 -105910 -107644 -128986 -145594 -109485 12104
16784A2104m88m0950K307p9617p343l563J4203M2677Q9202M5484k4836m8602r7782
$$ 12104 11616 -29334 -27027 -106644 -113987 -117550 -103347 -60670 28532 74016 49180 578 -97204
16771i7204P879L9236K852L8241M454j1720j09706r3931P7178J17991n488q3918
$$ -97204 -89325 -50089 -47237 -8996 -4542 -16262 -125968 -219899 -142721 -24730 -30218 -114136
16759a14136L5699K2622J26062N3480j063j15808l5009l9743K4957J11776L2694
$$ -114136 -78437 -55815 70247 123727 122664 6856 -28153 -67896 -42939 68837 101531
16748A01531j8870j49758j4562N0814j03340L5591M8098m4191j1237J25573M1608
$$ 101531 82661 -67097 -81659 -30845 -134185 -98594 -50496 -94687 -105924 19649 61257
16737F1257N817K4938l3873m5460Q310N4125m9353L6331K5917K1974Q575j7727
$$ 61257 67074 92012 58139 12679 20989 75114 25761 62092 88009 109983 118558 100831
16725A00831L441p0874j1934J8732j123j0285o0664J5345M917K7189N9596n7312
$$ 100831 104272 33398 21464 40196 39073 28788 -31876 -16531 -11614 15575 75171 17859
16713A7859m5622K6543o2487r369J9611K8495N1562l8903L7756j9601k778m3915
$$ 17859 -27763 -1220 -63707 -73076 -53465 -24970 26592 -12311 25445 5844 3066 -40849
16701d0849o849j07004j0626Q0778Q8046m4394p6806j22089j1041J57088K7053
$$ -40849 -47698 -154702 -165328 -84550 3496 -40898 -117704 -239793 -250834 -93746 -66693
16690f6693n048j1239o3598L3400J32j285N8825J00925N0728k1519l6563p5718
$$ -66693 -71741 -82980 -146578 -113178 -113046 -114331 -55506 45419 96147 74628 38065 -37653
16678c7653n4090k3502J28339O3576k8903j28422J12409M2507o2196N91l3647
$$ -37653 -91743 -115245 13094 76670 47767 -80655 31754 74261 12065 12656 -20991
16667b0991m1185K1034O6315K8659P050k3608j0012k4142m2557K4995j5442Q831
$$ -20991 -62176 -41142 25173 53832 60882 37274 27262 3120 -39437 -14442 -29884 -21053
16655b1053j8432Q5806L7719M710j989Q214N2207m6196p1954q449J5131o1417
$$ -21053 -39485 46321 84040 88750 86761 94975 147182 100986 29032 20583 35714 -25703
16643b5703l2364O4995o7990O1976p098K4979n0646J7532K4661M1102R3530o8612
$$ -25703 -58067 6928 -61062 914 -6184 18795 -31851 -14319 10342 51444 144974 76362
16631G6362M3078K0528p2872n5635N0243j9595K1052o8970q0618j1268N9107P2102
$$ 76362 119440 139968 67096 11461 61704 42109 63161 -5809 -86427 -97695 -38588 33514
16619C3514r933j15545O0208j1961m7427K7238Q6877Q300n7151l6897j1642l36
$$ 33514 23581 -91964 -31756 -43717 -91144 -63906 22971 31271 -25880 -62777 -74419 -74755
16607g4755P799j9807J47634k8107o6668j5829O3307J35368m379p5969L4468K3392
$$ -74755 -66956 -86763 60871 32764 -33904 -49733 13574 148942 144563 68594 103062 126454
16595A26454o084l3015j597L5886j36255n8690P7712j9234P8687J09562p1007
$$ 126454 120370 87355 85758 121644 -14611 -73301 4411 -14823 63864 173426 102419
16584A02419j7235L9931M2902O6866L4733m2413n009l6108k1128k7448O3465P2140
$$ 102419 85184 125115 168017 234883 269616 227203 222194 186086 164958 137510 200975 273115
16572B73115m6879k8167P0983m6877n6998N600k6180o449L3098l2167q0637k7786
$$ 273115 226236 198069 269052 222175 165177 170777 144597 138148 171246 139079 58442 30656
16560C0656L4525O2149R6866L0214m8848j4909K6582l7914l7792l5668Q197L4317
$$ 30656 65181 127330 224196 254410 205562 190653 217235 179321 141529 105861 114058 148375
16548A48375K2285k3960p30r4478l8649J298N2303J13711K4231j30456j19902
$$ 148375 170660 146700 145970 51492 12843 14141 66444 180155 204386 73930 -45972
16537d5972l0035M9875J25311k2180j5440l67O510j0510P6706O7731r7819j04067
$$ -45972 -76007 -26132 99179 76999 61559 61192 67702 57192 133898 201629 103810 -257
16525b57K7315O2181J942o5533M3240r623K7122L0849k0513r3121l173K5601O2082
$$ -257 27058 89239 91181 25648 68888 59265 86387 117236 96723 3602 429 26030 88112
16512H8112k8446l208J1992N8950K9450j373j4655j2102j13m0182j00199L8988
$$ 88112 59666 56458 68450 127400 156850 155477 140822 128720 128607 88425 -11774 27214
16500B7214N5122O872l2314n9366J9805J24981n4067j14611n1047L8397l562n4157
$$ 27214 82336 89208 56894 -2472 17333 142314 88247 -26364 -77411 -39014 -42576 -96733
16488i6733l9833l6709n3143M1251N1465J02874L6731Q8627k8001o2312k4792
$$ -96733 -136566 -173275 -226418 -185167 -133702 -30828 5903 94530 66529 4217 -20575
16477b0575j1019J05777L8601l4879k5603n5890j11439r9728R3739p1665P5140
$$ -20575 -31594 74183 112784 77905 52302 -3588 -115027 -214755 -121016 -192681 -117541
16466a17541L3078M9027O7603M0813k6056l4335N7401O1287m4404n4484p9417
$$ -117541 -84463 -35436 32167 72980 46924 12589 69990 131277 86873 32389 -47028
16455d7028m0188n6455J01273P6271L5394N8015k6370o2226M0526R324n3661k8244
$$ -47028 -87216 -143671 -42398 33873 69267 127282 100912 38686 79212 88536 34875 6631
16443F631M2387j0603p7877L1288M6849l9214q6620R6961K7101m6735k9634n0043
$$ 6631 49018 38415 -39462 -8174 38675 -539 -87159 9802 36903 -9832 -39466 -89509
16431h9509O7902L3622p5980q0631J9984Q0350K1737k9839k9482J6758k15N7210
$$ -89509 -21607 12015 -63965 -144596 -124612 -44262 -22525 -52364 -81846 -65088 -65303 -8093
16419h093j16382K1162N5012j6465j23117L0482Q2295J111O1459l2892N2741l0527
$$ -8093 -124475 -103313 -48301 -64766 -187883 -157401 -75106 -73995 -12536 -45428 7313 -23214
16407b3214q8397P4288M9829M895k8949k6729k9771k7705J02725N9381j7596n6099
$$ -23214 -111611 -37323 12506 17401 -11548 -38277 -68048 -95753 6972 66353 48757 -7342
16395g342Q7693O996O0597O4683m8253j20675k2212M798l1194k8786P0605K8775
$$ -7342 80351 87347 147944 212627 164374 43699 21487 26285 -4909 -33695 36910 65685
16383F5685m1682n569q3492L9756O2481m3140q6869k3397L8720Q0097j6755l3091
$$ 65685 24003 18434 -65058 -25302 37179 -5961 -92830 -116227 -77507 2590 -14165 -47256
16371d7256m6287K2531K8941R7016O9381n6006M4936q791j5037n0122m487r5373
$$ -47256 -93543 -71012 -42071 54945 124326 68320 113256 104465 89428 39306 34819 -60554
16359f0554l9963M3990l6621k6661Q1904M571k9467o7606P090q3623q4619J06296
$$ -60554 -100517 -56527 -93148 -119809 -37905 -33334 -62801 -130407 -123317 -206940 -291559 -185263
16347a85263J10239N3278N9732m4502m2237N4438Q0479l6241j11466O3984O2905
$$ -185263 -75024 -21746 37986 -6516 -48753 5685 86164 49923 -61543 2441 65346
16336F5346q1471n2785O2061j8868q7829p2758Q539m5811j9116l2943J1656J68582
$$ 65346 -16125 -68910 -6849 -25717 -113546 -186304 -177765 -223576 -242692 -275635 -263979 -95397
16324i5397J25544Q365r7505p3890O5477J5072l3418p307j32359q6999N3691Q5729
$$ -95397 30147 38512 -58993 -132883 -67406 -52334 -85752 -93059 -225418 -312417 -258726 -172997
16312a72997M8341M8871L516k6373O9912j9196j33468m2611O9995N8953K7470
$$ -172997 -124656 -75785 -72269 -98642 -28730 -47926 -181394 -224005 -154010 -95057 -67587
16301f7587K9020j703M6901j0660k2001L8778q0290j8122k395m221M7215Q0963
$$ -67587 -38567 -40270 6631 -4029 -26030 12748 -67542 -85664 -88059 -92280 -45065 35898
16289C5898K5984K5165j2731p9868j11078J0004J51395P6985o4063p1387p4469
$$ 35898 61882 87047 74316 -5552 -116630 -106626 44769 121754 57691 -13696 -88165
16278h8165J8316o291r5511Q1214p551J6643k4904m8105L916L9795L2303j3135
$$ -88165 -69849 -76140 -171651 -90437 -97988 -81345 -106249 -154354 -150438 -110643 -78340 -91475
16266i1475L5633O0810J0842M12o8857m8007J7515p8894m3192j535K4507J32675
$$ -91475 -55842 4968 15810 16222 -52635 -100642 -83127 -162021 -205213 -206748 -182241 -49566
16254d9566K6458m3419n5891p894J9870J3404P222M833N2835N283j5172Q2479
$$ -49566 -23108 -66527 -122418 -130312 -110442 -97038 -89816 -84983 -32148 -26865 -42037 40442
16242D0442l3694r8699O3997J1406n3031Q79J03743m4087j20128k2845P1548O6567
$$ 40442 6748 -91951 -27954 -16548 -69579 -68700 35043 -9044 -129172 -152017 -80469 -13902
16230a3902j7342L6534j5754n9994n0815k8017m8128K3593N7805N2969O205o3470
$$ -13902 -31244 5290 -10464 -70458 -121273 -149290 -197418 -173825 -116020 -63051 -56846 -120316
16218a20316P6441M835p7861j7506n0383N7808M4866j3442k643q1794n5086Q4906
$$ -120316 -43875 -39040 -116901 -134407 -184790 -126982 -82116 -95558 -98201 -179995 -235081 -150175
16206a50175J01539L2921P9565m1796o9492k002o1162j8147p1534n0181N3L6023
$$ -150175 -48636 -15715 63850 22054 -47438 -49440 -110602 -128749 -200283 -250464 -250411 -214388
16194b14388J18425k9766J4395J9595n2072R943k925O6181O1961l5659j36214
$$ -214388 -95963 -125729 -111334 -91739 -143811 -133868 -136793 -70612 -8651 -44310 -180524
16183a80524K3750L6962k6498k153M0354K773k7136q94M7357J3900q9796m4262
$$ -180524 -156774 -119812 -146310 -148463 -108109 -105336 -132472 -133366 -86009 -72109 -161905 -206167
16171b06167K9499L9328m785K9060M9116M4398k6421P5146j1144J8589r2023m9918
$$ -206167 -176668 -137340 -142125 -113065 -63949 -19551 -45972 29174 18030 36619 -55404 -105322
16159a05322l5098k7821O2144L0214J3547k8473n386R9540M0574n1439K729Q490
$$ -105322 -140420 -168241 -106097 -75883 -62336 -90809 -96195 3345 43919 -7520 -4791 3699
16147C699o191j7310j9297n0156l4950Q7724j777k4562n2657p4827J7357L2496
$$ 3699 -2492 -19802 -39099 -89255 -124205 -36481 -38258 -62820 -115477 -190304 -172947 -140451
16135a40451L4404n113J8341j9833N370R451k4442k4943k2016L9539K543O1822
$$ -140451 -106047 -111160 -92819 -112652 -107282 -97831 -122273 -147216 -169232 -129693 -127150 -65328
16123f5328N2726k6435n3254o5968j3376P2985P6639J0126N2101J02736O15M440
$$ -65328 -12602 -39037 -92291 -158259 -171635 -98650 -22011 -11885 40216 142952 143567 148007
16111A48007j16031M9153Q9655p6443j06495q3732p9679k0199J10327L076j16096
$$ 148007 31976 81129 170784 94341 -12154 -95886 -175565 -195764 -85437 -82361 -198457
16100a98457P236N7794N1311O4326M011j3377m944J1999j9992k9806M7569J4658
$$ -198457 -191221 -133427 -82116 -17790 -13779 -27156 -32100 -20101 -40093 -69899 -22330 -7672
16088g672j4603j5015J0641K2912J8392p976j3055R8l4766p7573Q6767N8496k7299
$$ -7672 -22275 -37290 -26649 -3737 14655 6679 -6376 -6278 -41044 -118617 -31850 26646 -653
16075f53l0591P721m4152j8460M1511k063m6966k5093N1078J0199n9599M7560
$$ -653 -31244 -23523 -67675 -86135 -44624 -46687 -93653 -118746 -67668 -57469 -117068 -69508
16063f9508N4669l0485l9093P3538o4278p2865j4239j8966L1750O771n9178P1916
$$ -69508 -14839 -45324 -84417 -10879 -75157 -148022 -162261 -181227 -149477 -142706 -201884 -129968
16051a29968K245l924o1285M3124J5249R161j2827j8663L236K1477P4798J26970
$$ -129968 -127723 -131647 -192932 -149808 -134559 -125398 -138225 -156888 -153652 -132175 -57377 69593
16039F9593N1790q0512n0056l4333p310l001J7885J0953j3981j03318p5947R7347
$$ 69593 121383 40871 -9185 -43518 -50828 -53829 -35944 -24991 -38972 -142290 -218237 -120890
16027a20890K5671k3575L3867R7529L5112J4488l9204J7507l9085q7432r2605
$$ -120890 -95219 -118794 -84927 12602 47714 62202 22998 40505 1420 -86012 -178617
16016a78617K818m2610P3427K5312J8177J6916P6056o5833q5275L8662M4736L6201
$$ -178617 -175799 -218409 -144982 -119670 -101493 -84577 -8521 -74354 -159629 -120967 -76231 -40030
16004d0030l2838l013k7847P3152L4277l6634n1138j2359p2156O0543P7466l5707
$$ -40030 -72868 -75881 -103728 -30576 3701 -32933 -84071 -96430 -168586 -108043 -30577 -66284
15992f6284k1602J0065q892l2899L0247J0102k037K9957M5084J8452J3271J8596
$$ -66284 -87886 -77821 -86713 -119612 -89365 -79263 -81300 -51343 -6259 12193 25464 44060
15980D4060k301J6040K7484m2162q7293l8971J2724o869n43j624l1677L2648R0341
$$ 44060 41759 57799 85283 43121 -44172 -83143 -70419 -77288 -77831 -79455 -111132 -78484 11857
15967A1857O8647r3633r7088J15969O5090j722l4915k9711l7187J0132N9364L3534
$$ 11857 80504 -13129 -110217 5752 70842 69120 34205 4494 -32693 -22561 36803 70337
15955G0337n2787j4303N3586q049k3614L2344n8058k4112r3029n2458Q7193N2610
$$ 70337 17550 3247 56833 48784 25170 57514 -544 -24656 -117685 -170143 -82950 -30340
15943c0340J020K0259q5388l5811j5001K8411N7392J9119j09692J2729O785q888
$$ -30340 -29320 -9061 -94449 -130260 -145261 -116850 -59458 -40339 -150031 -137302 -130517 -139405
15931a39405L6339J41082K6720N119r923l7272o0133M2281N6552q4649j21088
$$ -139405 -103066 38016 64736 69855 59932 22660 -37473 4808 61360 -23289 -144377
15920a44377k2005N8062M1436P8326l6812k1783l8490J3756P365m0356M5857j11078
$$ -144377 -166382 -108320 -66884 11442 -25370 -47153 -85643 -71887 -64522 -104878 -59021 -170099
15908a70099q233P0463R3243Q6118M5109n1231j19495j09633n0554J1491J5464
$$ -170099 -178332 -107869 -14626 71492 116601 65370 -54125 -163758 -214312 -202821 -187357
15897a87357N4695P7838p956m3585L2927m5527j3834K7142j6424R0158J245K8965
$$ -187357 -132662 -54824 -62780 -106365 -73438 -118965 -132799 -105657 -122081 -31923 -30678 -1713
15885a713k4102j16453p5576k3257l8160N113J35638J47422o686o1534m9236R7134
$$ -1713 -25815 -142268 -217844 -241101 -279261 -274148 -138510 8912 2226 -59308 -108544 -11410
15873a1410k751q7618j23818r619Q5382Q7989L3100j4708j15541m3549j3892l8046
$$ -11410 -14161 -101779 -225597 -235216 -149834 -61845 -28745 -43453 -158994 -202543 -216435 -254481
15861b54481J9197P1215Q5488j1171k472O5968O7108k0281m7220L7241j8146K0237
$$ -254481 -235284 -164069 -78581 -89752 -92224 -26256 40852 20571 -26649 10592 -7554 12683
15849A2683J9079J4678l6273j64647O0967K2103k5901K0641P8861j5827m4743
$$ 12683 31762 46440 10167 -154480 -93513 -71410 -97311 -76670 2191 -13636 -58379
15838e8379m5237P5631r629N6845Q1390l4146m3196M1985k4620r3820M1965J4151
$$ -58379 -103616 -27985 -37614 19231 100621 66475 23279 65264 40644 -53176 -11211 2940
15826B940j3424J4926p6021k6052Q9504M692L1657k6225p9644l7403K5575J57231
$$ 2940 -10484 4442 -71579 -97631 -8127 -3435 28222 1997 -77647 -115050 -89475 67756
15814F7756N7702l3513j8092o8046n7677o3853K6654J2778K1080J7512q2096M9676
$$ 67756 125458 91945 73853 5807 -51870 -115723 -89069 -76291 -55211 -37699 -119795 -70119
15802g0119N6272L5892Q581P0763N3774j08602q0647o1731J04525J40110k2645
$$ -70119 -13847 22045 30626 101389 155163 46561 -34086 -95817 8708 148818 126173
15791A26173j73753n8415J06646o8461r1851J20142P9564j29280q7390P4516L4802
$$ 126173 -47580 -105995 651 -67810 -159661 -39519 40045 -89235 -176625 -102109 -67307
15780f7307m1972l0250J01735k3471K244J7855r2168o5348l9230J7146l5556n2308
$$ -67307 -109279 -139529 -37794 -61265 -59021 -41166 -133334 -198682 -237912 -220766 -256322 -308630
15768c08630P07N0732k9534m4171K4881P5772L3005J7403R3357m1494J0628M3524
$$ -308630 -307923 -257191 -286725 -330896 -306015 -230243 -197238 -179835 -86478 -127972 -117344 -73820
15756g3820j3958K406j2707l6261J428O882l1639q7878K8855J22895J5907j9248
$$ -73820 -87778 -85372 -98079 -134340 -132912 -126030 -157669 -245547 -216692 -93797 -77890 -97138
15744i7138M029R694L2788L3906j17597O5849p639j1280M8214k1064j02894J0176
$$ -97138 -93109 -83415 -50627 -16721 -134318 -68469 -76108 -87388 -39174 -60238 -163132 -152956
15732a52956Q1601J05588k0987q4558J8298R9961O9422k8655L0296K62j16249
$$ -152956 -71355 34233 13246 -71312 -53014 46947 116369 87714 118010 118272 2023
15721B023n1314m8705n4454M104k0157J3079O3439K1918Q432Q625k2888j979M5121
$$ 2023 -49291 -97996 -152450 -148346 -168503 -155424 -91985 -70067 -61635 -53010 -75898 -77877 -32756
15708c2756J6384M6531N1928k1645j19669o2585M3245N0356L2097K02m4657J9956
$$ -32756 -16372 30159 82087 60442 -59227 -121812 -78567 -28211 3886 4088 -40569 -20613
15696b0613m46K7325n2817p5463N5546R9400N8959J3704K4589n5452q2482M208
$$ -20613 -21059 6266 -46551 -122014 -66468 32932 91891 105595 130184 74732 -7750 -3542
15684c542j65088p7651M3137N0287J19103P1050J3141q9856k3330K8413k0105
$$ -3542 -168630 -246281 -203144 -152857 -33754 37296 50437 -39419 -62749 -34336 -54441
15673e4441N7734J0099j622L2320j19905j17008q890Q8552P3035N8850q3549N6848
$$ -54441 3293 13392 11770 44090 -75815 -192823 -201713 -113161 -40126 18724 -64825 -7977
15661g977j5094n8765Q5502j9608q1287m7116r1228j5527O5578p799N0509M7137
$$ -7977 -23071 -81836 3666 -15942 -97229 -144345 -235573 -251100 -185522 -193321 -142812 -95675
15649i5675o2239j3685J8971M2156j2699Q9302n6657j19672J0058O2984L780k1552
$$ -95675 -157914 -171599 -152628 -110472 -123171 -33869 -90526 -210198 -200140 -137156 -133376 -154928
15637a54928N7307K7295k0452L0096O8232Q7765J0362p0260m9258k2367l3468
$$ -154928 -97621 -70326 -90778 -60682 7550 95315 105677 35417 -13841 -36208 -69676
15626f9676o5663R160n2865M0344p639N4183J069n0787L887j3081j8792J02120
$$ -69676 -135339 -126179 -179044 -138700 -146339 -92156 -91087 -141874 -137987 -151068 -169860 -67740
15614f7740n0220p9612K6020N4505N6023R4914q526p2193M3276o946l7091q8614
$$ -67740 -117960 -197572 -171552 -117047 -61024 33890 25364 -46829 -3553 -10499 -47590 -136204
15602a36204R3199O7073j6608k7362m9095J0113N8693j2746j3582K4570O905N40
$$ -136204 -43005 24068 7460 -19902 -68997 -58884 -191 -12937 -26519 -1949 4956 5496
15590E496L2965o528k0295L5290j4110L0687L6688m2401j25454j2441M3591l5019
$$ 5496 38461 31933 11638 46928 32818 63505 100193 57792 -67662 -80103 -36512 -71531
15578g1531p9553J13011P5069L2679l8146L689k0482K2660p2243n5589l0981l7877
$$ -71531 -151084 -38073 36996 69675 31529 35218 14736 37396 -34847 -90436 -121417 -159294
15566a59294L4217N5616k3847J5643p1095j112M9508p8438l7200N7003J27477
$$ -159294 -125077 -69461 -93308 -77665 -148760 -149872 -100364 -178802 -216002 -158999 -31522
15555c1522M061l8033K6712J08270m6928j05353j0360K6884J12437O6798n4256
$$ -31522 -27461 -65494 -38782 69488 22560 -82793 -93153 -66269 46168 112966 58710
15544E8710k9927p152j03403j7073L8393L5123q1738o2212j1289Q2219O691P9421
$$ 58710 28783 21631 -81772 -98845 -60452 -25329 -107067 -169279 -180568 -98349 -91658 -12237
15532a2237K1723j0406q1131N5119n563l9265Q3855M7930n0132m0624L1744m7600
$$ -12237 9486 -920 -82051 -26932 -32495 -71760 12095 60025 9893 -30731 1013 -46587
15520d6587k1318M1521m9429K4592p20O7570J8670j53163J7847N8033j6624p1659
$$ -46587 -67905 -26384 -75813 -51221 -51941 15629 34299 -118864 -101017 -42984 -59608 -131267
15508a31267K1340J17339p0115M561J19017K8706o0344j64687K658O5218N2373
$$ -131267 -109927 7412 -62703 -58142 60875 89581 29237 -135450 -132792 -67574 -15201
15497a5201L3159k7281k3552j2296K581j890J2237q034P8154J8159j62668K2652
$$ -15201 17958 -9323 -32875 -45171 -42590 -44480 -32243 -40277 37877 56036 -106632 -83980
15485h3980R192q492O8829R0104j36703J0679J33676N6383m7649q7694J0365L800
$$ -83980 -74788 -83280 -14451 75653 -61050 -50371 83305 139688 92039 4345 14710 18510
15473A8510q5353j5403j8251q4350N6286J8700K6281n6105m9601o5909J4941M3918
$$ 18510 -66843 -82246 -100497 -184847 -128561 -109861 -83580 -139685 -189286 -255195 -240254 -196336
15461a96336P9197P7250j0923p0132j1461K2619k1300j1935P590L5688R7923N8903
$$ -196336 -117139 -39889 -50812 -120944 -132405 -109786 -131086 -143021 -135431 -99743 -1820 57083
15449E7083Q1695p8553p2496L963l2633J5993j4849q930M1278J4405k7899l8547
$$ 57083 138778 60225 -12271 -8308 -40941 -24948 -39797 -48727 -7449 6956 -20943 -59490
15437e9490j1820L9418n0061r2695N8108O3637N1783l1102k0832J5471K179l8921
$$ -59490 -71310 -31892 -81953 -174648 -116540 -52903 -1120 -32222 -53054 -37583 -35404 -74325
15425g4325r345p2485l5890K0589P2770O6188m9010q6498N0335K7580L0972j6498
$$ -74325 -83670 -156155 -192045 -171456 -98686 -32498 -81508 -168006 -117671 -90091 -59119 -75617
15413g5617m3909l9773N3804K438l9334j29800n7617N3625N4675K9389P9840M9985
$$ -75617 -119526 -159299 -105495 -103057 -142391 -272191 -329808 -276183 -221508 -192119 -112279 -62294
15401f2294j13828J6742J5756K8078J14570Q4445o2982o3712J3214K2940l461
$$ -62294 -176122 -159380 -143624 -115546 -976 83469 20487 -43225 -30011 -7071 -10532
15390a0532k7848R220l7044M4940M7067n6088k4258K9606p6118j33711P1115R585
$$ -10532 -38380 -29160 -66204 -21264 25803 -30285 -54543 -24937 -101055 -234766 -163651 -154066
15378a54066j9572M4718l993o3859o9927j03976j0871O6267N3808R6982J01728
$$ -154066 -173638 -128920 -132913 -196772 -266699 -370675 -381546 -315279 -261471 -164489 -62761
15367f2761J5104J15503K6288j43353o2180l5812K3914N0984J15604M272p1282
$$ -62761 -47657 67846 94134 -49219 -111399 -147211 -123297 -72313 43291 47563 -23719
15356b3719N265P6775N3192k6355O26j2563m9959k7359o4077p5082k0270m3104
$$ -23719 -18454 58321 111513 85158 85784 73221 23262 -4097 -68174 -143256 -163526 -206630
15344b06630K347P6626n9879J0928N4206l1697n222J02316j599l6083K2770p7315
$$ -206630 -204283 -127657 -187536 -176608 -122402 -154099 -159321 -57005 -58604 -94687 -71917 -149232
15332a49232m3247R0630J63066n2632j06723n3251J320R078P0205K3051l3871
$$ -149232 -192479 -101849 61217 8585 -98138 -151389 -150069 -140991 -70786 -47735 -81606
15321h1606l734J3467L1410m7348l952o3637l0203k110l3912R9090J02468Q3379
$$ -81606 -85340 -71873 -40463 -87811 -91763 -155400 -185603 -187713 -221625 -122535 -20067 63312
15309F3312m5296q2449j17846M3493J77786M2800p596j8782j17756O4806J02397
$$ 63312 18016 -64433 -182279 -138786 39000 81800 74204 55422 -62334 2472 104869
15298A04869L5512n7525j36187o7612k6299k2135o7508j4332J61877Q002j01518
$$ 104869 140381 82856 -53331 -120943 -147242 -169377 -236885 -251217 -89340 -81338 -182856
15287a82856l6491P734k4041k6083O2536M6917J1853J68170N1103q4089n0603
$$ -182856 -219347 -211613 -235654 -261737 -199201 -152284 -140431 27739 78842 -5247 -55850
15276e5850q1141j7060Q8513o0395k1886P6921Q6366n9172J628q485N308P2460
$$ -55850 -136991 -154051 -65538 -125933 -147819 -70898 15468 -43704 -42076 -50561 -45253 27207
15264B7207Q181N5007j45066n5277M1086l4808l7907K6413O7720P3380K6098O4366
$$ 27207 35388 90395 -54671 -109948 -68862 -103670 -141577 -115164 -47444 25936 52034 116400
15252A16400n5543n9344n8057j06145K4657J5137k7976m1377n3094M3092M3643
$$ 116400 60857 1513 -56544 -162689 -138032 -122895 -150871 -192248 -245342 -202250 -158607
15241a58607j3216L4750O3470K3852M0413m5088j33435k5291P725L1055j8673
$$ -158607 -171823 -137073 -73603 -49751 -9338 -54426 -187861 -213152 -205427 -174372 -193045
15230a93045L5235L8733P2197M9519r2795m8611N3344J15789o0440p3594k4297
$$ -193045 -157810 -119077 -46880 2639 -90156 -138767 -85423 30366 -30074 -103668 -127965
15219a27965j8288k5649j1291R8460K2928l5397J1096M4875k1935l1080O4980
$$ -127965 -146253 -171902 -183193 -84733 -61805 -97202 -86106 -41231 -63166 -94246 -29266
15208b9266j2217n7443K0237j33679O131Q4913R4298M9935j6643j8076r4288O0701
$$ -29266 -41483 -98926 -78689 -212368 -206237 -121324 -27026 22909 6266 -11810 -106098 -45397
15196d5397P0722p0175R7P2806l1739j04500q6465L5458M2110m015l67R957J2758
$$ -45397 25325 -44850 -44753 28053 -3686 -108186 -194651 -159193 -117083 -121098 -121465 -111508 -98750
15183i8750K752q8756r657P8446J2727L3450Q2125o3361k2698P3429M206L0916
$$ -98750 -95998 -184754 -194411 -115965 -103238 -69788 12337 -51024 -73722 -293 3913 34829
15171C4829m0094k5754p1475n5772L6540P1605m0421j20937l4300j3814R8815
$$ 34829 -5265 -31019 -102494 -158266 -121726 -50121 -90542 -211479 -245779 -259593 -160778
15160a60778O6162O7489J00106j3117q6989q246J12277L0549p1990k9491O7207
$$ -160778 -94616 -27127 72979 59862 -27127 -35373 76904 107453 35463 5972 73179
15149G3179j8489j01704K884P2448K5069k9924L530m5915l4826L2823J0604K860
$$ 73179 54690 -47014 -44130 28318 53387 23463 26993 -18922 -53748 -20925 -10321 -7461
15137g461M2453J5168M5806p0562q2617N7213L4882o14j2027n9657r1460J08933
$$ -7461 34992 50160 95966 25404 -57213 0 34882 34268 22241 -37416 -128876 -19943
15125a9943M3016p7674j28155M5043L4615K7607L8062P7946M9918J00166Q51j06815
$$ -19943 23073 -54601 -182756 -137713 -103098 -75491 -37429 40517 90435 190601 191452 84637
15113H4637j05783q3938J3343J01797R3400q8167K1617r566q4032J3841k0897
$$ 84637 -21146 -105084 -91741 10056 103456 15289 36906 27340 -56692 -42851 -63748
15102f3748L2465J50203q446l3000l3882J5135J275P4033P9865r3438j01606o646
$$ -63748 -31283 118920 110474 77474 43592 58727 60002 134035 213900 120462 18856 12210
15090A2210K2064l6774L1511j798L9932k5249k3353m6576O9105m6260l0038J8899
$$ 12210 34274 -2500 29011 27213 67145 41896 18543 -28033 41072 -5188 -35226 -16327
15078a6327m7061O4911m806J7748m1008l9013l2964N90l8038n6745K6984J64782
$$ -16327 -63388 1523 -3283 14465 -26543 -65556 -98520 -97930 -135968 -192713 -165729 -947
15066i47O4222P4247p757o5202M2350k2222r0460N2741P496k2534j5265P508p9816
$$ -947 63275 137522 129765 64563 106913 84691 -5769 46972 54468 31934 16669 24177 -55639
15053e5639q452O6934P8114O7687p3703r1417n1014j0447L5590R446j05148M3360
$$ -55639 -64091 2843 80957 148644 74941 -16476 -67490 -77937 -42347 -32901 -138049 -94689
15041i4689P5555k8915j27828K8135N9581j3006k51N7899L4767j0736m3103j7510
$$ -94689 -19134 -48049 -175877 -147742 -88161 -101167 -101418 -43519 -8752 -19488 -62591 -80101
15029h0101R2957M3351p7184r8288l0489P9489J19440N2785m1766J2950M764L3700
$$ -80101 12856 56207 -20977 -119265 -149754 -70265 49175 101960 60194 73144 77908 111608
15017A11608j9823m7551Q414l9379k2101R3439k4745k7842o6763K3904n0847o1584
$$ 111608 91785 44234 52648 13269 -8832 84607 59862 32020 -34743 -10839 -61686 -123270
15005a23270K0626N2751O1933r440o8548k5868P4015M7761p3788o1530P109P6166
$$ -123270 -102644 -49893 12040 2600 -65948 -91816 -17801 29960 -43828 -105358 -98249 -22083
14993b2083j9728K5507N9368M8423n602p5633m9113n4113J08819n747m6100Q669
$$ -22083 -41811 -16304 43064 91487 85885 10252 -38861 -92974 15845 10098 -36002 -27333
14981b7333k1454k9797l2581o958K7662L9646R9693J57326J2928J2053l1575p2991
$$ -27333 -48787 -78584 -111165 -118123 -90461 -50815 48878 206204 219132 231185 199610 126619
14969A26619j17207q0319R2713P8744j4720q363M4630l2397o4276M0199M6838
$$ 126619 9412 -70907 21806 100550 85830 77467 122097 89700 25424 65623 112461
14958A12461M8385j7496m0592l5797K0778L6436m3033q638n5868l189M1691J16283
$$ 112461 160846 143350 102758 66961 87739 124175 81142 72504 16636 13447 55138 171421
14946A71421j1955l6053m6678o3435L6810K7201L7922j5476n3102q8960m0970
$$ 171421 159466 123413 76735 13300 50110 77311 115233 99757 46655 -42305 -83275
14935h3275K8304J64173J37065J05607m5467K2411Q1913J3763m3927o2949j03964
$$ -83275 -54971 109202 246267 351874 306407 328818 410731 424494 380567 317618 213654
14924B13654j02723L3454J73144Q1197l6339l4187q4338o7301n5159n9850j3939
$$ 213654 110931 144385 317529 398726 362387 328200 243862 176561 121402 61552 47613
14913D7613j8775L6729L5105K5338j197K5218L7775p7833l2211l0703o9842j2079
$$ 47613 28838 65567 100672 126010 124813 150031 187806 109973 77762 47059 -22783 -34862
14901c4862M6190Q83o2202K0019O0981J14920J17553O392M2564n1631j34522o4341
$$ -34862 11328 12211 -49991 -29972 31009 145929 263482 269874 312438 260807 126285 61944
14889F1944N498N4101n583l6218L3569o925k9278l6852j4112m1124j4806o2100
$$ 61944 67442 121543 115960 79742 113311 106386 77108 40256 26144 -14980 -29786 -91886
14877i1886K1461J053M4766j0188o5991j13041N0057n253O6800K9330J9197J3191
$$ -91886 -70425 -69372 -24606 -34794 -100785 -213826 -163769 -169022 -102222 -72892 -53695 -40504
14865d0504N6655l3109l7733P0506J03932l1251k3879K0634L156n2092j4308r602
$$ -40504 16151 -16958 -54691 15815 119747 88496 64617 85251 88407 36315 22007 12405
14853A2405R3841Q8175j14316o0903J4941K8378Q0065j1377m4753j29137j1420
$$ 12405 106246 194421 80105 19202 34143 62521 142586 131209 86456 -42681 -54101
14842e4101P8664n3666J4860J32361l3041p2012Q2190L7254j4052N4193r741j01710
$$ -54101 24563 -29103 -14243 118118 85077 13065 95255 132509 118457 172650 162909 61199
14830F1199J0802M916q724M5510N1275n4811q9878l5326l2515L5213M2087K0028
$$ 61199 72001 76917 68193 113703 164978 110167 20289 -15037 -47552 -12339 29748 49776
14818D9776K1350n2431j010n8022j8288N70k4017m7805J07169M1414J6611p330
$$ 49776 71126 18695 17685 -40337 -58625 -58055 -82072 -129877 -22708 18706 35317 27987
14806B7987o6938p3103P4903J33511j5324k146P4372j4936l9256l992P2674L2572
$$ 27987 -38951 -112054 -37151 96360 81036 78890 153262 138326 99070 95078 167752 200324
14794B00324P0158o4369k1888m3804N600q496m8310k2334M0961Q5764M6970j6416
$$ 200324 270482 206113 184225 140421 146021 137525 89215 66881 107842 193606 240576 224160
14782B24160j68723n151P1263k53l5342Q8769j8090l2488L4156j4987n9535l0888
$$ 224160 55437 50286 121549 121296 85954 174723 156633 124145 158301 143314 83779 52891
14770E2891l0411o9052N5097K2586n2037O2597L239K481Q2311J8193k2798q821
$$ 52891 22480 -46572 8525 31111 -20926 41671 44910 47391 129702 147895 125097 116276
14758A16276n8275j9255Q3981M1773k8828J0925j03679M4816K8928p6065k2769
$$ 116276 58001 38746 122727 164500 135672 146597 42918 87734 116662 40597 17828
14747A7828j9849P72N7005J10691O5978n5001K8921O282n3446j12670o163P2521
$$ 17828 -2021 -1249 55756 166447 232425 177424 206345 212627 159181 46511 40348 112869
14735A12869Q1251q8406l7322Q0671J39884L3219j34614j47668n7811N0633J23193
$$ 112869 194120 105714 68392 149063 288947 322166 187552 39884 -17927 32706 155899
14724A55899j9665m0921J31302P7453l1589k2510m9104j8238m7442j5318J08482
$$ 155899 136234 95313 226615 304068 272479 249969 200865 182627 135185 119867 228349
14713B28349K5709J0775l2241k2240k2436o4830m934j7021J2017J30516n102M2890
$$ 228349 254058 264833 232592 210352 187916 123086 118152 101131 113148 243664 238562 281452
14701B81452P3487K0821o7187j35775O2606m2635o0389J1386J65728N6230n9689
$$ 281452 354939 375760 308573 172798 235404 192769 132380 143766 309494 365724 306035
14690C06035o2519L24K1372j17267n8476M6351N3503j2726n4024J616n4740J548
$$ 306035 243516 243840 265212 147945 89469 135820 189323 176597 122573 124189 69449 70997
14678G0997K1256J6141M6455P2583L0654k0884p563l3941n7445j308O3921N9060
$$ 70997 92253 108394 154849 227432 258086 237202 229639 195698 138253 136945 200866 259926
14666B59926L9098K3109k5353m8600n337M9789m6582l5120j3591K0896J18528
$$ 259926 299024 322133 296780 248180 242843 292632 246050 210930 197339 218235 336763
14655C36763m2523k4830k0196M6360p9761l7554M2685L0679j04022q6312l2559
$$ 336763 294240 269410 249214 295574 215813 178259 220944 251623 147601 61289 28730
14644B8730K9014J38612J16431j829l2093m5543p7772o0931M3130R1103J7760
$$ 28730 57744 196356 312787 310958 278865 233322 155550 94619 137749 228852 246612
14633B46612R46R553R5290k6752k5832l2686l7376K4914j0412p5271J01659n4804
$$ 246612 247558 257111 352401 325649 299817 267131 229755 254669 244257 168986 270645 215841
14621B15841j660K9161K7581k5178k9406m0711l0470N9761m0576L0959Q5679r918
$$ 215841 214181 243342 270923 245745 216339 175628 145158 204919 164343 195302 280981 271063
14609B71063n8553M18K7156m5074j4486q555K0545K3335L6750j1318l8375L4827
$$ 271063 212510 212928 240084 195010 180524 171969 192514 215849 252599 241281 202906 237733
14597B37733M2666o8603o1598P2166L2074K4115j08767l3799N0736j09424j10736
$$ 237733 280399 211796 150198 222364 254438 278553 169786 135987 186723 77299 -33437
14586c3437P2617r826n4925P4074N2849P4857P6841N764O0777P919j04023k453
$$ -33437 39180 29354 -25571 48503 101352 176209 253050 258814 319591 327510 223487 221034
14574B21034M137j04468p9659l1053j2642K2896J48743K7619q4446j4287J31473
$$ 221034 225171 120703 41044 9991 -2651 20245 168988 196607 112161 97874 229347
14563B29347r192q7027Q2200p3874n0081J1775O74n393J6417m1943j2762J2334
$$ 229347 220155 133128 215328 141454 91373 103148 103822 98429 114846 72903 60141 72475
14551G2475L7910N8648n4762L8901Q6460J5959P5266M5780K2520r5595m5566j10781
$$ 72475 110385 169033 114271 153172 239632 255591 330857 376637 399157 303562 257996 147215
14539A47215K0132j4140K132n248p195N5777O0624P584P3697k5059q2728J862
$$ 147215 167347 153207 155339 150091 142896 198673 259297 266881 340578 315519 232791 234653
14527B34653j32375k9264O8073j6813J9788J35791K6224K2206k3868j06186p6277
$$ 234653 102278 73014 141087 124274 144062 279853 306077 328283 304415 198229 121952
14516A21952j3870j6409k87N8108j520N1746L6630l3118p706j1298K534m8258
$$ 121952 108082 91673 91386 149494 147974 199720 236350 203232 195526 184228 186762 138504
14504A38504K0717O4288N579l0002o3055M485J9432O1803r150p763p9458p3601
$$ 138504 159221 223509 229088 199086 136031 140516 159948 221751 212601 204838 125380 51779
14492E1779k1031K5727m3742R902K4794r1865l2302N6166J13828J7820k6109k5597
$$ 51779 30748 56475 12733 22635 47429 -44436 -76738 -20572 93256 111076 84967 59370
14480E9370O508n6538K4791M3958P4130K1689J2355K206o4923k4531L0249q8144
$$ 59370 65878 9340 34131 78089 152219 173908 186263 188469 123546 99015 129264 41120
14468D1120Q8623L7319p0807k0715M1846o7404j01952N3725J7050l382M666K3588
$$ 41120 129743 167062 96255 75540 117386 49982 -51970 1755 18805 15423 20089 43677
14456D3677J0131J02903L9961j4400j03834J1094N3239J8885j7639l2030j5554
$$ 43677 53808 156711 196672 182272 78438 89532 142771 161656 144017 111987 96433
14445I6433m3173J02611L0128j29577L0038J35273l7393j16823J9425L9427J7849
$$ 96433 53260 155871 185999 56422 86460 221733 184340 67517 86942 126369 144218
14434A44218l6592R784L0973l1805L0196p9843O0372J7864o3830o8884o169O4937
$$ 144218 107626 117410 148383 116578 146774 66931 127303 145167 81337 12453 6284 71221
14422G1221J0251K7699O1983L7684k3459L6255K7003K0606j01241k5297j8208
$$ 71221 81472 109171 171154 208838 185379 221634 248637 269243 168002 142705 124497
14411A24497m5250q1464L6253M5898k4701N8287N3005n9460j9276O7327o0989
$$ 124497 79247 -2217 34036 79934 55233 113520 166525 107065 87789 155116 94127
14400I4127j20284K4432K9437j0184j1191J4109K0834l8709J7351M8249l9072
$$ 94127 -26157 -1725 27712 17528 6337 20446 41280 2571 19922 68171 29099
14389B9099m5293J3624N8357k2563k6445l8741k3648J53179N6540p1949K865j300
$$ 29099 -16194 -2570 55787 33224 6779 -31962 -55610 97569 154109 82160 85025 83725
14377H3725N9709K8926k3044J3311j8104j4517L676L1364j1590n9865l3653M0875
$$ 83725 143434 172360 149316 162627 144523 130006 133682 165046 153456 93591 59938 100813
14365A00813O0889N8960J5055j11589k3060K8344o498P604p8304o6159L2235M3876
$$ 100813 161702 220662 235717 124128 101068 129412 122914 130518 52214 -13945 18290 62166
14353F2166K9811R831O5655M2168L1589l4960k4468j00042N9567J5731j0698P469
$$ 62166 91977 101808 167463 209631 241220 206260 181792 81750 141317 157048 146350 153819
14341A53819n5927j5584k3885K1387l2513n5211l7631O63N9474M6499L4998N0753
$$ 153819 97892 82308 58423 79810 47297 -7914 -45545 -44882 14592 61091 96089 146842
14329A46842k6413m0464l6612N2426m0867p4103K3599J7848Q2452J4987r9079
$$ 146842 120429 79965 43353 95779 54912 -19191 4408 22256 104708 119695 20616
14318B0616n7369j9192N7545k683J0758K0474P6496J7753n215k4478p4292j8138
$$ 20616 -36753 -55945 1600 -1083 9675 30149 106645 124398 119183 94705 20413 2275
14306B275m636N1402j9826k9202K2780j6621O1393k1977l3636Q7676P3783k4637
$$ 2275 -2361 49041 29215 13 22793 6172 67565 45588 11952 99628 173411 148774
14294A48774m6160J602J8834k5791j310J1426J8278j1235m0768K1324L7148l2030
$$ 148774 102614 104216 123050 97259 95949 107375 125653 114418 73650 94974 132122 100092
14282A00092o748K1222m9649J4783l19m2489J0304Q967j16529r6216n9315j4739
$$ 100092 93344 114566 64917 79700 79381 36892 47196 56163 -60366 -156582 -215897 -230636
14270b30636K4922M2309J9525p296J10717M6951R926m5150m4868o104P8167j13125
$$ -230636 -205714 -163405 -143880 -151176 -40459 6492 16418 -28732 -73600 -79704 -1537 -114662
14258a14662M6323R1632Q635p4417L6931K5303M9709J00967j5151j42400o0968
$$ -114662 -68339 23293 31928 -42489 -5558 19745 69454 170421 155270 12870 -48098
14247d8098o1843P031J09814R4582P442k7613p2763l802l2193R003K8847l6882
$$ -48098 -109941 -102910 6904 101486 108928 81315 8552 4750 -27443 -18440 10407 -26475
14235b6475K1781J05768q393j00180k5036M4255Q0376L0429q0118o4962q491l0907
$$ -26475 -4694 101074 92681 -7499 -32535 11720 92096 122525 42407 -22555 -31046 -61953
14223f1953m2491K9180N1442P0630j3517j182j3716K7345M8337n391L7939L934
$$ -61953 -104444 -75264 -23822 46808 33291 32109 18393 45738 94075 88684 126623 130557
14211A30557r9857M3299J4461n7851j4514k4950O9109M5567J5581J1264l8244
$$ 130557 30700 73999 88460 30609 16095 -8855 60254 105821 121402 132666 94422
14200I4422p7347P34r1805r290N9077J02552J208l9357o5077l0867p0171k87M3681
$$ 94422 17075 17809 -73996 -83286 -24209 78343 79551 40194 -24883 -55750 -125921 -126208 -82527
14187h2527O3816L9565k5348K8392K8918L5673m3423q2009L5676j4571l813K4533
$$ -82527 -18711 20854 -4494 23898 52816 88489 45066 -36943 -1267 -15838 -19651 4882
14175D882l1954n1873N0345M701l2755r431J3293K2633J11048K501r661o5448
$$ 4882 -27072 -78945 -28600 -23899 -56654 -66085 -52792 -30159 80889 83390 73729 8281
14163H281j1588O9384l5052K1615r8796J1021p471q309J4450L5576K3746J310
$$ 8281 -3307 66077 31025 52640 -46156 -35135 -42606 -50915 -36465 -889 22857 24167
14151B4167K6789K6357K552K310n5307N2919j5159k5549N1690m6870P033q2805
$$ 24167 50956 77313 79865 82175 26868 79787 64628 39079 90769 43899 50932 -31873
14139c1873p5402O4469l1916J7070m8654j9360N1985R1K4900K2809J3177l8636
$$ -31873 -107275 -42806 -74722 -57652 -106306 -125666 -73681 -73590 -48690 -25881 -12704 -51340
14127e1340r341Q469L5754J29500L9627k9788p5461q212K967O4245k3223j5745
$$ -51340 -60681 -52212 -16458 113042 152669 122881 47420 39208 42175 106420 83197 67452
14115F7452j55220P13N9649Q7597J0742R8342O7068K8120j08815o3593L701Q7933
$$ 67452 -87768 -87055 -27406 60191 70933 169275 236343 264463 155648 92055 95756 183689
14103A83689m646m3903l2740l1509M207m4157o3539m2167P5914J7818k7492J2629
$$ 183689 179043 135140 102400 70891 75098 30941 -32598 -74765 1149 18967 -8525 4104
14091D104J003m287M2729j2253P2250N7961k0913l9461k6749M8480O1070L6301
$$ 4104 5107 820 43549 31296 103546 161507 140594 101133 74384 122864 183934 220235
14079B20235o3516n900r995k3318m5560o382p8196K3862P6510K616o1420q6581
$$ 220235 156719 150819 140824 117506 71946 65564 -12632 11230 87740 90356 28936 -57645
14067e7645R511O3157j0867n4327p5135Q1848J03316m3949o0333L679m2149k7530
$$ -57645 -48134 15023 4156 -50171 -125306 -43458 59858 15909 -44424 -40745 -82894 -110424
14055a10424J17540Q9389m769N4250L784p7497j5971J1584k3058l0879O6923K0692
$$ -110424 7116 96505 91736 145986 149770 72273 56302 67886 44828 13949 80872 101564
14043A01564R140Q4941o2439p5587R3592n328m6114L803l3051l6570n434J8217
$$ 101564 110704 195645 133206 57619 151211 145883 99769 103572 70521 33951 28517 46734
14031D6734O36n3293m8212K1615J5185k6020Q7882J9255J0909j51428m1101J59171
$$ 46734 47370 -5923 -54135 -32520 -17335 -43355 44527 63782 74691 -76737 -117838 41333
14019D1333O0497N1230L4585j22585o6772M1085m085J4639K736j0972K141k1794
$$ 41333 101830 153060 187645 65060 -1712 39373 35288 49927 52663 41691 43832 22038
14007B2038P6362O306L296k786k0798K4817K7030J8453O990L2452p915l5040k1695
$$ 22038 98400 104706 108002 105216 84418 109235 136265 154718 161708 194160 186245 151205 129510
13994A29510L5034J13370n8693j4028j43155l7567N2087J15512j2135N9328n4309
$$ 129510 164544 277914 219221 205193 62038 24471 76558 192070 179935 239263 184954
13983A84954j0825k226J23186l7691n4311K6383p5364J2082k3520P2736L7894
$$ 184954 174129 171903 295089 257398 203087 229470 154106 166188 142668 215404 253298
13972B53298K9716l1904n8755J1558M6344O2373m6165M766K9299P203Q4814N8706
$$ 253298 283014 251110 192355 203913 250257 312630 266465 271231 300530 307733 392547 451253
13960D51253l4150m3075m4472M1570R0195q517k0175J0248N0422K3802N1625Q6951
$$ 451253 417103 374028 329556 371126 461321 452804 432629 442877 493299 517101 568726 655677
13948F55677K7153l441j3403J09346J57144Q2694O868J05051O6364J49190K23258
$$ 655677 682830 679389 665986 775332 932476 1015170 1022038 1127089 1193453 1342643 1565901
13937A565901o292J03317K55683K25906K88374L86625L04138M42579N76040P30450
$$ 1565901 1559609 1662926 1918609 2144515 2432889 2819514 3123652 3566231 4142271 4872721
13927D872721R22837J044124J341588J696142J835570J869132J610562J194538
$$ 4872721 5795558 6839682 8181270 9877412 11712982 13582114 15192676 16387214
13919A6387214O80682j43162q16823j285663j559561j801639j815629j553342
$$ 16387214 17067896 16924734 16107911 14822248 13262687 11461048 9645419 8092077
13911H092077j274245j084514q57077o28085o36433n19110l57765l07664k41610
$$ 8092077 6817832 5733318 4876241 4248156 3611723 3092613 2734848 2427184 2185574
13902B185574k71301k00880k53327k40312r6468l5099j16636o3251k193j07571
$$ 2185574 1914273 1713393 1460066 1219754 1123286 1088187 971551 908300 906107 798536
13892G98536j79086p7610Q8756l2726k9786N0594m3445l4771K4642j5746n8796
$$ 798536 619450 541840 630596 597870 568084 618678 575233 540462 565104 549358 490562
13881D90562r1231j42146j2769K7079k0188L9206N5642L0314l7364n6266J3274
$$ 490562 399331 257185 244416 271495 251307 290513 346155 376469 339105 282839 296113
13870B96113M0860k2011p9111k9731P6030P5770L135n1542l0498r1818j0981M508
$$ 296113 336973 314962 235851 206120 282150 357920 361055 309513 279015 187197 176216 180724
13858A80724j6230m5587n8639j1033R841P5597q592N4844R1967j6477n6552o0958
$$ 180724 164494 118907 60268 49235 59076 134673 126081 180925 272892 256415 199863 138905
13846A38905n9402l8876Q2608K1495L0602L4817k2583r4342j32499l0383O7975
$$ 138905 79503 40627 123235 144730 175332 210149 187566 93224 -39275 -69658 -1683
13835a683J61517M8582m9963j9800k8118j3003m4218K6986L7970l5393r5788k8726
$$ -1683 159834 208416 158453 138653 110535 97532 53314 80300 118270 82877 -12911 -41637
13823d1637M7925l0825O8795M4925Q155R5072N5070j5618l5097j8923q6410j02531
$$ -41637 6288 -24537 44258 89183 97338 192410 247480 231862 196765 177842 91432 -11099
13811a1099k9067R8353R6371M7193L0509m628j24880j27458J7455Q7501O8168
$$ -11099 -40166 58187 154558 201751 232260 227632 102752 -24706 -7251 80250 148418
13800A48418J35331J28545J33979J34315J56389J81349J19854l7074k02252q4061
$$ 148418 283749 412294 546273 680588 836977 1018326 1138180 1101106 898854 814793
13790H14793q0717k08855j94379Q022n9687o3076N7251Q5191j24300o4780o4276
$$ 814793 734076 525221 330842 338864 279177 216101 273352 358543 234243 169463 105187
13779A05187j6857J01549K0701j133K4238M1776j609M4954L7579R022N3611J11750
$$ 105187 88330 189879 210580 209447 233685 275461 273852 318806 356385 365407 419018 530768
13767E30768P0926l8750K8146J23383P2735K33239L86234L24326K02225K3925
$$ 530768 601694 562944 591090 714473 787208 1020447 1406681 1731007 1933232 1957157
13757A957157j70200k49478k89789k26638q0968j34849j25987j68920j57459M9342
$$ 1957157 1786957 1537479 1247690 1021052 940084 805235 679248 510328 352869 402211
13747D02211P1821m9762J0085n7409n5601j8618q8453k1072M2978N5245j0602
$$ 402211 474032 424270 434355 376946 321345 302727 214274 193202 236180 291425 280823
13736B80823o1386J1198m2016p437P8113M9027Q4480M8377P63L9770J58260J79850
$$ 280823 219437 230635 188619 181182 259295 308322 392802 441179 441942 481712 639972 819822
13724H19822J27915l8359K125p1650j61934j49546j91257k712J2784l5313l9575
$$ 819822 947737 909378 911503 839853 677919 528373 337116 334404 347188 311875 272300
13713B72300p341O057n3675L8950j5458q7966o5984N1059K7379r748K9866P5337
$$ 272300 264959 271016 217341 256291 240833 152867 86883 137942 165321 155573 185439 260776
13701B60776n8328j01759L8852L3471j07407N0707j2528K6957K3709m1268j3014
$$ 260776 202448 100689 139541 173012 65605 116312 103784 130741 154450 113182 100168
13690A00168q865p7254N1682M8121K3358N1859m3892k9869p947K1982p9715m3306
$$ 100168 91303 14049 65731 113852 137210 189069 145177 115308 107361 129343 49628 6322
13678F322n8305k8445K4207N5150k0691K2370K3429R3359P8026m9814o674L3965
$$ 6322 -51983 -80428 -56221 -1071 -21762 608 24037 117396 195422 145608 138934 172899
13666A72899L4701k2567P827Q4566l5214p7375r284l399K1668K2216l2848m6447
$$ 172899 207600 185033 192860 277426 242212 164837 155553 152154 173822 196038 163190 116743
13654A16743q7800J5609J16907J6640R2367M717l0206j09385r5002O2686N718
$$ 116743 28943 44552 161459 178099 270466 275183 244977 135592 40590 103276 108994
13643A08994o578K6119j4262n2013M4560J0344P622K781q413m8833L2433L5364
$$ 108994 102416 128535 114273 62260 106820 117164 124786 127567 119154 70321 102754 138118
13631A38118J472r161M866K4468o9292m5064l1089P2378O9316p1900j8286M1216
$$ 138118 139590 130429 135295 159763 90471 45407 14318 86696 156012 84112 65826 107042
13619A07042M3187P1952j6756o1514n3245J2839m2279L6329J9462J25770Q6707
$$ 107042 150229 222181 205425 143911 90666 103505 61226 97555 117017 242787 329494
13608C29494K3334p5783J23822R0584l7032j1687J0560q2475l1229l9354r6029
$$ 329494 352828 277045 400867 491451 454419 442732 453292 370817 339588 300234 204205
13597B04205n3535J032j7784O4616o309o3813N0284N1738M5068O0412M0217K857
$$ 204205 150670 151702 133918 198534 192225 128412 178696 230434 275502 335914 376131 378988
13585C78988M1045L9760j9700n5002n9099J6165j31527p1116L3100O5619J6346
$$ 378988 420033 459793 440093 385091 325992 342157 210630 139514 172614 238233 254579
13574B54579M1074M2168L779j4747R4328J22268m9166M3582K1758m9885o1227
$$ 254579 295653 337821 341600 326853 421181 543449 494283 537865 559623 509738 448511
13563D48511P5352P9775J8174N1816P3474J38011J44291P9584J14629O8199o034
$$ 448511 523863 603638 621812 673628 747102 885113 1029404 1108988 1223617 1291816 1285782
13552A285782m6849q4835o3996o5139n8168q6087j31518p040j665o6005o6269
$$ 1285782 1238933 1154098 1090102 1024963 966795 880708 749190 742150 740485 674480 608211
13541F08211P3945J06047J55655K05762J47009N4196K5193J23124J05158j46531
$$ 608211 682156 788203 943858 1149620 1296629 1350825 1376018 1499142 1604300 1457769
13531A457769j85552q4847l0576O8559k923O5955J96778J96417P9035o7630M0519
$$ 1457769 1272217 1187370 1156794 1225353 1222430 1288385 1485163 1681580 1760615 1692985 1733504
13520A733504N3859o9635j1246J0134j9843q2943j00708j86300j85521j6362P4512
$$ 1733504 1787363 1717728 1706482 1716616 1696773 1613830 1513122 1326822 1141301 1124939 1199451
13509A199451L5666J54262J70218K04360J30393Q6584R1778J07785J41763P7474
$$ 1199451 1235117 1389379 1559597 1763957 1894350 1980934 2072712 2180497 2322260 2399734
13499B399734n5572j74315k10939k31860j20218j34729j99725j91170l6583J6438
$$ 2399734 2344162 2169847 1958908 1727048 1606830 1472101 1272376 1081206 1044623 1061061
13489A061061N1604o4543n7776O3811L0905M4515M9664k457O2903M3099j5770
$$ 1061061 1112665 1048122 990346 1054157 1085062 1129577 1179241 1176784 1239687 1282786 1267016
13478A267016o7726q8996p2820l8960J37399J22177j3426N9735J43279L4237J03279
$$ 1267016 1199290 1110294 1037474 998514 1135913 1258090 1244664 1304399 1447678 1481915 1585194
13467A585194J31607J41889P8170o9394j27032k21139k38668k63065k02287k2279
$$ 1585194 1716801 1858690 1936860 1867466 1740434 1519295 1280627 1017562 815275 792996
13457G92996J28865k0265j20954j56514J7001J31478J0523j15053j44J11768Q1326
$$ 792996 921861 901596 780642 624128 641129 772607 783130 668077 667933 779701 861027
13446H61027K8031O3362J77000J67340Q6309N6705m9287j30378j17159p8280p5380
$$ 861027 889058 952420 1129420 1296760 1383069 1439774 1390487 1260109 1142950 1064670 989290
13435I89290o5029q6660J4748J13342r829q116k489L5931j31475l4578R3144K3645
$$ 989290 924261 837601 852349 965691 955862 947746 945257 981188 849713 815135 908279 931924
13423I31924p5027m53R8170O3727l3804J152J13841J21386J49052J54424L50037
$$ 931924 856897 856444 954614 1018341 984537 985689 1099530 1220916 1369968 1524392 1874429
13412A874429K43699J91613K26185J38017L7952j20765r3572q7213R99n6887r3287
$$ 1874429 2118128 2309741 2535926 2673943 2711895 2591130 2497558 2410345 2411344 2354457 2261170
13401B261170N169P9030J22652o0514m038j28741k00070k6843j22848p8613Q204
$$ 2261170 2266339 2345369 2468021 2407507 2403469 2274728 2074658 2047815 1924967 1846354 1854558
13390A854558L8135l7426K4123P975k680P8042K31804K18398P6403J95943J17894
$$ 1854558 1892693 1855267 1879390 1887365 1884685 1962727 2194531 2412929 2489332 2685275 2803169
13379B803169J93649K57697J82301J65603J62233J38919J79487K46296K45800
$$ 2803169 2996818 3254515 3436816 3602419 3764652 3903571 4083058 4329354 4575154
13370D575154L67636M55913L16877K13411J48788Q7887J79148K69988L95104M13412
$$ 4575154 4942790 5398703 5715580 5928991 6077779 6165666 6344814 6614802 7009906 7423318
13360G423318M53337N35777P59636R42537J221599J374095J637426K122772K694010
$$ 7423318 7876655 8412432 9172068 10114605 11336204 12710299 14347725 16470497 19164507
13351A9164507L375007M414355O135954Q796674J3168787J9314706K6579144L1756170
$$ 19164507 22539514 26953869 33089823 41886497 55055284 74369990 100949134 132705304
13343A32705304L0052822J8615125N19898j6994252k7560765k8655611k3978082
$$ 132705304 162758126 181373251 181893149 164898897 137338132 108682521 84704439
13336H4704439j7916625j2931847r025147o159719m321095l042796k275201j946531
$$ 84704439 66787814 53855967 44830820 38671101 34350006 31307210 29032009 27085478
13328B7085478j694235j361695r71355n59782m1022M70060J116148J560453K024911
$$ 27085478 25391243 24029548 23058193 22498411 22457389 22927449 24043597 25604050 27628961
13319B7628961K581351L347987M397363N729901P511276J0039943J4121708K0838637
$$ 27628961 30210312 33558299 37955662 43685563 51196839 61236782 75358490 96197127
13311I6197127L1284728M5542928O0054973O6520756N5743654K5740918j2720705
$$ 96197127 127481855 173024783 233079756 299600512 355344166 381085084 368364379
13304C68364379m5874626o2109122o0897813m9272069l5709781k5025541j7390291
$$ 368364379 322489753 260380631 199482818 150210749 114500968 89475427 72085136
13297G2085136j2427356r195746o916973n304963m280110l407047k817098k013262
$$ 72085136 59657780 50462034 43545061 38240098 33959988 30552941 27735843 25722581
13289B5722581j194843m84124K71789Q70860J341259J665409K185206K475342
$$ 25722581 24527738 24043614 24315403 25186263 26527522 28192931 30378137 32853479
13281C2853479K514378L017398L760506N283222P992069J2131340J7956411K5082070
$$ 32853479 35367857 38385255 42145761 47428983 55421052 67552392 85508803 110590873
13273A10590873L1102212L1864675K3178194N489320j4187559k8638519l3453812
$$ 110590873 141693085 173557760 196735954 202225274 188037715 159399196 125945384
13266A25945384k9660729k2692795j6352428j1554608q302017o116142m735107
$$ 125945384 96284655 73591860 57239432 45684824 37382807 31266665 26531558
13259B6531558l747741k847905k069281j632548j239756j028897r52841q76353
$$ 26531558 22783817 19935912 17866631 16234083 14994327 13965430 13012589 12136236
13251A2136236q97675q76064o36005m06447k49923q331L43139P45493Q27292M57732
$$ 12136236 11238561 10362497 9726492 9320045 9070122 9061791 9404930 10150423 10977715 11435447
13241A1435447k20585r25806j348335j346064j136639q07828o43351m00238k00708
$$ 11435447 11214862 10289056 8940721 7594657 6458018 5650190 5006839 4606601 4405893
13232D405893j44734j82186j18489j52352j37475o3120j3119L6361P022Q8821
$$ 4405893 4261159 4078973 3960484 3808132 3670657 3607537 3594418 3630779 3637801 3726622
13222C726622K09559J45205o1779k33532j98636l17930l04706k91947k50801k13415
$$ 3726622 3936181 4081386 4019607 3786075 3587439 3269509 2964803 2672856 2422055 2208640
13212B208640m0845q7410j01841K4216p7653j42002o8602K2858l9425j22708p8645
$$ 2208640 2167795 2080385 1978544 2002760 1925107 1783105 1714503 1737361 1697936 1575228 1496583
13201A496583o8548j8107p4592o8660k8640J0359J12239M9172P03l6558J0694
$$ 1496583 1428035 1409928 1335336 1266676 1238036 1248395 1360634 1409806 1410509 1373951 1384645
13190A384645J60768k5880j52563j17910N1128q6034p7282k3402Q001J5366M3855
$$ 1384645 1545413 1519533 1366970 1249060 1300188 1214154 1136872 1113470 1121471 1136837 1180692
13179A180692K5538K9518k4889n3034M3920L9057P261j11379n2063l4530n4878
$$ 1180692 1206230 1235748 1210859 1157825 1201745 1240802 1248063 1136684 1084621 1050091 995213
13168I95213N341n6215q8304J2282k2648L5059N7841L3378k9086Q5435K2052M20
$$ 995213 1000554 944339 856035 868317 845669 880728 938569 971947 942861 1028296 1050348 1050768
13156A050768l2330N6301m5533j19828j29431n9977m1878j4451L9623K734K0726
$$ 1050768 1018438 1074739 1029206 909378 779947 719970 678092 663641 703264 705998 726724
13145G26724m22l7326n9055L7497k901M4956M3645Q904L0468N6085K4129m6877
$$ 726724 726302 688976 629921 667418 664517 709473 753118 762022 792490 848575 872704 825827
13133H25827k8510J11n0869q276o7941j31041k9620J36136K1233k9563j1800o844
$$ 825827 797317 797428 746559 738283 670342 539301 509681 645817 667050 637487 625687 618843
13121F18843o95N0832N186j2672N5445j07212j00933j3507j6514k3776j6814q5516
$$ 618843 618148 668980 674166 661494 716939 609727 508794 495287 478773 454997 438183 352667
13109C52667r299Q4148J24922L2199n2036K2515O6688p502m8865k0010j1879q81
$$ 352667 343368 427516 552438 584637 532601 555116 621804 614302 565437 545427 533548 532667
13097E32667M830r0167p0080P1101N6503j32254P364N6357l2161j5404o4436n2145
$$ 532667 537497 447330 377250 448351 504854 372600 379964 436321 404160 388756 324320 272175
13085B72175J0440R2643q884n6165O1291R248j48473j28279P111J07805P5049
$$ 272175 282615 375258 366374 310209 371500 380748 232275 103996 111107 218912 293961
13074B93961J3768J7329j03440k895O4525K7536j3683n6781J3001L7959o1292
$$ 293961 307729 325058 221618 218723 283248 310784 297101 240320 253321 291280 229988
13063B29988j21915J0148M0622K8782l4228K2917J71833k5877m086k0929P385
$$ 229988 108073 118221 158843 187625 153397 176314 348147 322270 318184 297255 304640
13052C04640o1103m5807p5115K745J15490N3775M1907n100q1335p0208R7308J8416
$$ 304640 243537 197730 122615 125360 240850 294625 336532 331432 250097 179889 277197 295613
13040B95613j8592L4999M9025m9569j20302J4527K0572Q3038O3818p45o7663o1563
$$ 295613 277021 312020 361045 311476 191174 205701 226273 309311 373129 372384 304721 243158
13028B43158m423O063l3060n7512N5950N7580l4306j12893l7781J55500j0541
$$ 243158 238735 244798 211738 154226 210176 267756 233450 120557 82776 238276 227735
13017B27735o9264M8487K2522L3012o1677n7043K5493o8411j52867M434J04339
$$ 227735 158471 206958 229480 262492 200815 143772 169265 100854 -52013 -47579 56760
13006E6760O0762R4807J49076Q6777J5772j4561q9610k2648l5921l2852L6382
$$ 56760 117522 212329 361405 448182 463954 449393 359783 337135 301214 268362 304744
12995C04744M5054k4897n4835O6727K9841O6525o5228P836K2962K8690J34795
$$ 304744 349798 324901 270066 336793 366634 433159 367931 375767 398729 427419 562214
12984E62214K39299J49996R554P2832R4638K42880K61734J69827N8001j33355
$$ 562214 801513 951509 961063 1033895 1128533 1371413 1633147 1802974 1860975 1727620
12974A727620j43041k45004q7535j01583j42452p3758o7581j7458O7303k0830
$$ 1727620 1584579 1339575 1252040 1150457 1008005 934247 866666 849208 916511 895681
12964H95681p6729K3928M8881J06511J67196N9954k1700Q3142J30569N1424m43
$$ 895681 818952 842880 891761 998272 1165468 1225422 1203722 1286864 1417433 1468857 1468414
12953A468414N8223J63236Q9561J8008J5790j0447r808K2195J7710N446j8753
$$ 1468414 1526637 1689873 1779434 1797442 1813232 1802785 1792977 1815172 1832882 1838328 1819575
12942A819575j01333p9402n8531j5278J4564q4051M736o5094j46910j23349r9756
$$ 1819575 1718242 1638840 1580309 1565031 1579595 1495544 1500280 1435186 1288276 1164927 1065171
12931A065171p4361m3254m833n140p6434J1737j5017N3993J72613J21912P7806
$$ 1065171 990810 947556 942723 937583 861149 872886 857869 911862 1084475 1206387 1284193
12920A284193J92533K94883J29178m0578j03104o1441k81729l12873k46734j08439
$$ 1284193 1476726 1771609 1900787 1860209 1757105 1695664 1413935 1101062 854328 745889
12910G45889k6952n2149m6367k5010p7938q4922l162P0602M7852o9307q9871j14332
$$ 745889 718937 666788 620421 595411 517473 432551 429389 499991 547843 478536 388665 274333
12898B74333k296J5011o7765j4869n1196j6458J20656P4319K8229Q781P2827O9568
$$ 274333 272037 287048 219283 204414 153218 136760 257416 331735 359964 368745 441572 511140
12886E11140J02564K27302J35727R0272J24808N3954m2745j29727j58561j17513
$$ 511140 613704 841006 976733 1067005 1191813 1245767 1203022 1073295 914734 797221
12876G97221n1249j04573o8097q6615o4232q5801n0747O755O6115J1923q0919
$$ 797221 745972 641399 573302 486687 422455 336654 285907 292662 358777 370700 289781
12865B89781j4438M1266q4725n8110N9849J04598J17556J532J887O7257P8034
$$ 289781 275343 316609 231884 173774 233623 338221 455777 457309 459196 526453 604487
12854F04487P6007L0287M0934J03288J31032K50111K44423K73330K57027L5218
$$ 604487 680494 710781 751715 855003 986035 1236146 1480569 1753899 2010926 2046144
12844B046144j98283k27150j81516j85319j96299k05200k14715p6139J0482K5388
$$ 2046144 1847861 1620711 1439195 1253876 1057577 852377 637662 561523 572005 597393
12834E97393L2989n5061j7628o8570n4446j9948O3313M5683j7168M6708L5741
$$ 597393 630382 575321 557693 489123 434677 414729 478042 523725 506557 553265 589006
12823E89006K9513m8855k1878J02481J6663O706k4774n3841j140J84472J54115
$$ 589006 618519 569664 547786 650267 666930 673636 648862 595021 593881 778353 932468
12812I32468J39212J52627J6418p720p4341k28618r1084j2943k6499o0788l6256
$$ 932468 1071680 1224307 1240725 1233005 1158664 930046 838962 826019 799520 738732 702476
12801G02476k0489L3324m5706l6697M5257n2208l9908l6502M7388q326n7574J7748
$$ 702476 681987 715311 669605 632908 678165 625957 586049 549547 596935 588609 531035 548783
12789E48783J3220P1232K2054p1737O807L8638M0168N363j0027j356k5874r685
$$ 548783 562003 633235 655289 583552 590359 628997 669165 674528 664501 663145 637271 627586
12777F27586M5026J5499k1988p291j8347J7618J7576M6351P0037j0553q890k6808
$$ 627586 672612 688111 666123 658832 640485 658103 675679 722030 792067 781514 772624 745816
12765G45816M3302J17324J33997K33707J81307Q4982J08781R7215N1451o2631
$$ 745816 789118 906442 1040439 1274146 1455453 1540435 1649216 1746431 1797882 1735251
12755A735251j26346j58939k47554j50815o6142o6836R2908j1312q5709k7281
$$ 1735251 1608905 1449966 1202412 1051597 985455 918619 1011527 1000215 914506 887225
12745H87225K1785r0003k5227O962p011R1486n1509n7116p1732L7066J87136R9025
$$ 887225 909010 819007 793780 800742 793731 885217 833708 776592 704860 741926 929062 1028087
12733A028087P7881J32333J20634K59747K33705J46613J43557J54745J13466l1401
$$ 1028087 1105968 1238301 1358935 1618682 1852387 1999000 2142557 2297302 2410768 2379367
12723B379367m8922j84610k59840j84914j76963r6584M1859J59002P0389J75670
$$ 2379367 2330445 2145835 1885995 1701081 1524118 1427534 1469393 1628395 1698784 1874454
12713A874454L43042L45471K92359J57543N1646n8021k08704l41074k78829j67536
$$ 1874454 2217496 2562967 2855326 3012869 3064515 3006494 2797790 2456716 2177887 2010351
12703B010351j88135q8062n192j251K7810N6201Q3842J13785J48650K96937L32855
$$ 2010351 1822216 1734154 1728962 1727711 1755521 1811722 1895564 2009349 2157999 2454936 2787791
12692B787791J30537j853n9340n2155k6854K8286R6359J81292L21504M11008M20247
$$ 2787791 2918328 2916475 2857135 2804980 2778126 2806412 2902771 3084063 3405567 3816575 4236822
12681D236822M17445M10843L63339K90958J98874J10006m2724l15026n38793n76723
$$ 4236822 4654267 5065110 5428449 5719407 5918281 6028287 5985563 5670537 5131744 4555021
12671D555021m02009l44777l75495l68290j39561r4078j5319M6447r674K7434
$$ 4555021 4153012 3808235 3432740 3064450 2924889 2830811 2815492 2861939 2852265 2879699
12661B879699Q3921J23837J09723R9576L7517Q4942J93686J19038J66217J69856
$$ 2879699 2963620 3087457 3197180 3296756 3334273 3419215 3612901 3731939 3898156 4068012
12651D068012K14804L15644L70561L73703M26905L84648L03909K7133j70164j90247
$$ 4068012 4282816 4598460 4969021 5342724 5769629 6154277 6458186 6485319 6315155 6124908
12641F124908l37417k66589k70535k22307r8200j24763j34424k46026k00600l3897
$$ 6124908 5787491 5520902 5250367 5028060 4929860 4805097 4670673 4424647 4224047 4190150
12631D190150J3039r4228r5298q9369P510j07950j22827j78644q2064l589k2919
$$ 4190150 4203189 4108961 4013663 3924294 3931804 3823854 3701027 3522383 3440319 3436730 3413811
12620C413811q1698l4553k0056N2676m6118L0045J10093J00964q3863l0089M0644
$$ 3413811 3332113 3297560 3277504 3330180 3284062 3314107 3424200 3525164 3441301 3411212 3451856
12609C451856J17542N8035L5605N8533N1905M1684K8087P7806J7445l574M6993
$$ 3451856 3569398 3627433 3663038 3721571 3773476 3815160 3843247 3921053 3938498 3934924 3981917
12598C981917K3326j2860k6540j17348j61437n4210K9651n5547j90348q5540j0959
$$ 3981917 4005243 3992383 3965843 3848495 3687058 3632848 3662499 3606952 3416604 3331064 3320105
12587C320105l2175k475J5933n134K2660O0559Q8796J64309J08655R3423J69543
$$ 3320105 3287930 3285455 3301388 3296254 3318914 3379473 3468269 3632578 3741233 3834656 4004199
12576D004199J50096Q6347J26873J19779K16147K82801K92418M46308L24118K09652
$$ 4004199 4154295 4240642 4367515 4487294 4703441 4986242 5278660 5724968 6049086 6258738
12566F258738K48024K63065L16311L68441M40379L78365L00202K92694L28019
$$ 6258738 6506762 6769827 7086138 7454579 7894958 8273323 8573525 8866219 9194238
12557I194238L17189L01992K52282L19608L23275M27432O32425Q28072J119421
$$ 9194238 9511427 9813419 10065701 10385309 10708584 11136016 11768441 12596513 13715934
12548A3715934J277515J525478J764769J924097K197373K493352K836954L128480
$$ 13715934 14993449 16518927 18283696 20207793 22405166 24898518 27735472 30863952
12540C0863952L649292M590261N794947P612033J0207331J3999272J9494949K6811166
$$ 30863952 34513244 39103505 44898452 52510485 62717816 76717088 96212037 123023203
12532A23023203L5951262M5518861N1411650M7332444K9166960J009337k5361079
$$ 123023203 158974465 204493326 255904976 303237420 332404380 333413717 308052638
12525C08052638l9984084m2076311l6844752k8763600k0506077j3546734p597518
$$ 308052638 268068554 225992243 189147491 160383891 139877814 126331080 118733562
12518A18733562l023855N40062L338689N744186Q215967J0499880J2300188J3181538
$$ 118733562 115709707 116249769 119588458 125332644 133548611 144048491 156348679 169530217
12510A69530217J2998675J2256513J1325457J0874882J1298643J2441994J4245817
$$ 169530217 182528892 194785405 206110862 216985744 228284387 240726381 254972198
12503B54972198J6027409J6955228J6345355J3597070Q710435K437273m329790
$$ 254972198 270999607 287954835 304300190 317897260 326607695 329044968 324715178
12496C24715178j0188888j4010123j5494148j5350781j4019221j2167622j0214164
$$ 324715178 314526290 300516167 285022019 269671238 255652017 243484395 233270231
12489B33270231q614210q023191q546073r778839j1369528j2650146j3265781
$$ 233270231 224656021 216632830 208086757 198307918 186938390 174288244 161022463
12482A61022463j2712146j1243034r045589o228595l080045Q02397N518498J1485996
$$ 161022463 148310317 137067283 128021694 121793099 118713054 119515451 125033949 136519945
12474A36519945J8872068K7753478L6949955M3882541M3815921L2415225R340839
$$ 136519945 155392013 183145491 220095446 263977987 307793908 340209133 349549972
12467C49549972j8576993m0321760m8688764m6136547l8615616l0340749k2922788
$$ 349549972 330972979 290651219 241962455 195825908 157210292 126869543 103946755
12460A03946755j7059807j2553534r393048p542009o382456n864571n458423m941379
$$ 103946755 86886948 74333414 64940366 57398357 51015901 45151330 39692907 34751528
12452C4751528m306463l673484l123041k620377k278226j709519j424705j297310
$$ 34751528 30445065 26771581 23648540 21028163 18749937 17040418 15615713 14318403
12444A4318403r94204r65626r72618q02253o49252o01966m29525l87823j94486
$$ 14318403 13324199 12358573 11385955 10583702 9934450 9332484 8902959 8515136 8320650
12435H320650k18564l27578k49206j56031j22126k44479l73867l96269m36596
$$ 8320650 8102086 7774508 7525302 7369271 7247145 7002666 6628799 6232530 5795934
12426E795934n41924l64324r2529j60393j74449j35098j58485n9775k8548r2195
$$ 5795934 5254010 4889686 4797157 4636764 4462315 4327217 4168732 4108957 4080409 3988214
12416C988214j38190n7016q4416m2851r9739m630l1110J5487M875m8598j52506
$$ 3988214 3850024 3793008 3708592 3665741 3566002 3561372 3530262 3545749 3550624 3502026 3349520
12405C349520j18189j1130n4889j43810j11868n1145p4019m9363r6702m4796j16057
$$ 3349520 3231331 3220201 3165312 3021502 2909634 2858489 2784470 2735107 2638405 2593609 2477552
12394B477552l5286n8067o3882l5492j8518n3359j32097o2891J07385P8881J58417
$$ 2477552 2442266 2384199 2320317 2284825 2266307 2212948 2080851 2017960 2125345 2204226 2362643
12383B362643J43368N2213J18959J49595J70732J04266k7713j40478j48033q7783
$$ 2362643 2506011 2558224 2677183 2826778 2997510 3101776 3074063 2933585 2785552 2697769
12373B697769j07494j21616j61952r5858j57749r8894j15307q3580p3054Q162
$$ 2697769 2590275 2468659 2306707 2210849 2053100 1954206 1838899 1755319 1682265 1690427
12363A690427l4713K1789M5470l9987k3710M9310J31846J41340J16001Q4617L4432
$$ 1690427 1655714 1677503 1722973 1682986 1659276 1708586 1840432 1981772 2097773 2182390 2216822
12352B216822J7741n0122m1831J1779O0182R0799J23946r8156m2916j51369k05850
$$ 2216822 2234563 2184441 2142610 2154389 2214571 2305370 2429316 2331160 2288244 2136875 1931025
12341A931025j30117p0228j84086m2217j87963j43303n9761j34923r5805M1887
$$ 1931025 1800908 1730680 1546594 1504377 1316414 1173111 1113350 978427 882622 924509
12331I24509L5584p431r802q9806r4773j2693O1015J2516k4006k7819K4881O2617
$$ 924509 960093 952662 942860 853054 758281 745588 806603 819119 795113 767294 792175 854792
12319H54792P0122J31526J61284J46672K7511p6960j37513n1613L2077j2753l478
$$ 854792 924914 1056440 1217724 1364396 1391907 1314947 1177434 1125821 1157898 1145145 1141667
12308A141667j08186l3592J29565K31214K51527K40082J82484J40368M2621M515
$$ 1141667 1033481 999889 1129454 1360668 1612195 1852277 2034761 2175129 2217750 2222265
12298B222265m9659Q731p0615k25672k76748j00202q8622j54387k05190j96484
$$ 2222265 2172606 2181337 2110722 1885050 1608302 1508100 1419478 1265091 1059901 863417
12288H63417j03328p5804J0862K8645n8560P3898r332l5356K00860J55801K7597
$$ 863417 760089 684285 695147 723792 665232 739130 729798 694442 895302 1051103 1078700
12277A078700N5636K1899O0950J60093R5622l7049J78344K78655J60970m388N8652
$$ 1078700 1134336 1156235 1217185 1377278 1472900 1435851 1614195 1892850 2053820 2049432 2108084
12266B108084R3021J4794l5631j87505k95870k39165j70444j39108j12983r118
$$ 2108084 2201105 2215899 2180268 1992763 1696893 1457728 1287284 1148176 1035193 1026075
12256A026075j14711j61498j46947L4435n1651p2924l4890Q0489m201M9347L7880
$$ 1026075 911364 749866 602919 637354 585703 512779 477889 558378 554177 603524 641404
12245F41404K2303N46L6416Q9257N1600J58278P9157L9255M8896j07331m4668
$$ 641404 663707 664253 700669 789926 841526 999804 1078961 1118216 1167112 1059781 1015113
12234A015113r61K2726J3497j53252j81062o2153p6512j23343j4887M0988j49566
$$ 1015113 1014152 1036878 1050375 897123 716061 653908 577396 454053 439166 480154 330588
12223C30588j13437N2348J275l6174k3241N4231K3096p721O2050M2247l3882j35310
$$ 330588 217151 269499 270774 234600 211359 265590 288686 280965 343015 385262 351380 216070
12211B16070J17116J01666m6731n8110o6453n4276r0690n2774J9854o9650l5896
$$ 216070 333186 434852 388121 330011 263558 209282 118592 65818 85672 16022 -19874
12200a9874L7204k4965j30834K9991J5345O847Q8689R2967J03971n2863K5331
$$ -19874 17330 -7635 -138469 -108478 -93133 -86286 2403 95370 199341 146478 171809
12189A71809Q2336N561o1477J0186O0315P418j14152p6104m8556M8585K0635l8468
$$ 171809 254145 259706 198229 208415 268730 276148 161996 85892 37336 85921 106556 68088
12177F8088M3356R67l1383O8616k0650p1094o1468l91P8514R8557l329K6334M3559
$$ 68088 111444 112411 81028 149644 128994 57900 -3568 -3959 74555 173112 169783 196117 239676
12164B39676K0858m4928p4072m7717J9648J38872J55685j434k1543j3871N7822
$$ 239676 260534 215606 141534 93817 113465 252337 408022 406588 385045 371174 428996
12153D28996l5098j40824q0248R221n527J6180M5874o125M378j2121p0910L8599
$$ 428996 393898 253074 172826 182047 176520 192700 238574 232449 236827 224706 153796 192395
12141A92395N1218O105k3087L1397Q6106m6777k8164L1850k4269p4141q3292L6431
$$ 192395 243613 249718 226631 258028 344134 297357 269193 301043 276774 202633 119341 155772
12129A55772J14036K6088o254l7683L6637N4355P1849l5137j6025r3713m8342
$$ 155772 269808 295896 289642 251959 288596 342951 414800 379663 363638 269925 221583
12118B21583J7484O8086N4151n9895P1724L1592l4127m403m3530j04755M6415
$$ 221583 239067 307153 361304 301409 373133 404725 370598 366195 322665 217910 264325
12107B64325j1004r0775k8725L7045K3614p9803o7227L3575J6511n5737N4377
$$ 264325 253321 162546 133821 170866 194480 114677 47450 81025 97536 41799 96176
12096I6176L7744M3261M8020j7634R058n4944o2572M0396J52058l2064R642P9771
$$ 96176 133920 177181 225201 207567 216625 161681 99109 139505 291563 259499 269141 348912
12084C48912M8574k7982j5048J18577P7709K464J07705J71565J53508J15614K39998
$$ 348912 397486 369504 354456 473033 550742 553206 660911 832476 985984 1101598 1341596
12073A341596K31091J50163J08679r2772j76548j83677k37310j90882m5419k172
$$ 1341596 1572687 1722850 1831529 1738757 1562209 1378532 1141222 950340 904921 902749
12063I02749j37332j08500J78446P4093j4844j7991o770J20595J31959j6858N8645
$$ 902749 765417 656917 835363 909456 894612 876621 869851 990446 1122405 1105547 1164192
12052A164192O4835p5485P5908R9816J17233J23279J00360J5809j2485Q0366J7029
$$ 1164192 1229027 1153542 1229450 1329266 1446499 1569778 1670138 1685947 1673462 1753828 1770857
12041A770857o3346j26091j05212p7771j8389L6928k2616j6832L4289K0565p3414
$$ 1770857 1707511 1581420 1476208 1398437 1380048 1416976 1394360 1377528 1411817 1432382 1358968
12030A358968q8522m4553r9875p9851l1833n2480J0214P1848O9525J0973l8657
$$ 1358968 1270446 1225893 1126018 1046167 1014334 961854 972068 1043916 1113441 1124414 1085757
12019A085757J5776L39834K92225K09429J44641J01850J93438N8673r7479k96737
$$ 1085757 1101533 1441367 1733592 1943021 2087662 2189512 2382950 2441623 2344144 2047407
12009B047407k64285k64378k62650k14654j51848j64674m6030n8356l4678l2606
$$ 2047407 1783122 1518744 1256094 1041440 889592 724918 678888 620532 585854 553248
11999E53248J8292J3887J4684j2640j7589O592k2589l2932M2421L8339J3545O7822
$$ 553248 571540 585427 600111 587471 569882 576474 553885 520953 563374 601713 615258 683080
11987F83080J02507N5796O2688O2088j3773p3242r872q2784j53643j30101p1190
$$ 683080 785587 841383 904071 966159 952386 879144 869272 786488 632845 502744 431554
11976D31554L8927R418o1035r7942l9785J8654P4167N1891l2589r6266p638N376
$$ 431554 470481 479899 418864 320922 281137 299791 373958 425849 393260 296994 289356 294732
11964B94732J19571j3997L9712K893K3004q9126k7968N4385K02015R5863J5126
$$ 294732 414303 400306 440018 442911 465915 376789 348821 403206 605221 701084 716210
11953G16210o9412l0612q6260m3199m6887j70015j58963J3940J07902J0672l9546
$$ 716210 646798 616186 529926 486727 439840 269825 110862 124802 232704 243376 203830
11942B03830j6653r4377k6448j9244n384P7328J10580j1813q9361l4304N2892
$$ 203830 187177 92800 66352 47108 41724 119052 229632 217819 128458 94154 147046
11931A47046q573n6424p7095l2592J2556J09814K7642N2411k1178j1346L1467
$$ 147046 138473 82049 4954 -27638 -15082 94732 122374 174785 153607 142261 173728
11920A73728O1810L7815L0115o3438K3583P2078j28403j26887p6075l5358m8429
$$ 173728 235538 273353 303468 240030 263613 335691 207288 80401 4326 -31032 -79461
11909g9461o9171J14382J04172n8450k415K5241p932K8580O7990J8745m1886k8783
$$ -79461 -148632 -34250 69922 11472 9057 34298 26366 54946 122936 141681 99795 71012
11897G1012k5281L1601o2452K7926M0317m805o3974m004m517O6759M6477N1978
$$ 71012 45731 77332 14880 42806 83123 78318 14344 10340 5823 72582 119059 171037
11885A71037q458M9423M74n6687q3073n6347R183o1863m925J4111j0454N0308
$$ 171037 162579 212002 212476 155789 72716 16369 25552 -36311 -41236 -27125 -37579 12729
11873A2729j857m1973O979m0005j9721N001M8075m8729N5821J09876o6862j12536
$$ 12729 10872 -31101 -24122 -64127 -83848 -78847 -30772 -79501 -23680 86196 19334 -93202
11861i3202q0060P423n8719l3720R9981J23328J01206J24408R8640l0502o6098
$$ -93202 -173262 -165839 -224558 -258278 -158297 -34969 66237 190645 289285 258783 192685
11850A92685j37868q7159k377L5949O1751J1453m7389l0253L2470L1380l1428
$$ 192685 54817 -32342 -34719 1230 62981 74434 27045 -3208 29262 60642 29214
11839B9214k5838m7223p249R3232P3014R942k0585k4781m7144q3344P5540J8641
$$ 29214 3376 -43847 -51096 42136 115150 125092 104507 79726 32582 -50762 24778 43419
11827D3419Q4230J0925J5724n7315j05997q9804j2006Q6437K6105L8944P6628
$$ 43419 127649 138574 154298 96983 -9014 -98818 -110824 -24387 1718 40662 117290
11816A17290n3108k6841q5077o3643O3604P5369o19r89j520K6317o9004Q903J09304
$$ 117290 64182 37341 -47736 -111379 -47775 27594 26975 25986 24466 50783 -18221 -9318 99986
11803I9986M6363K5282M578r7806p5079k0212J1444J05237o951n0595L1344L0080
$$ 99986 146349 171631 176209 78403 3324 -16888 -5444 99793 92842 42247 73591 103671
11791A03671J07602N7742m5374q0263k8131m4432n6919p6953k9197j8468J3251
$$ 103671 211273 269015 223641 143378 115247 70815 13896 -63057 -92254 -110722 -97471
11780i7471R5064N2712k7329r2675o2113R2064N4319N8260n490m1848J13168n9986
$$ -97471 -2407 50305 22976 -69699 -131812 -39748 14571 72831 67341 25493 138661 78675
11768G8675o2690J7979p773J278O2997Q435j7533l3600Q410j3188M0099L3971
$$ 78675 15985 33964 26191 27469 90466 98901 81368 47768 56178 42990 83089 117060
11756A17060o4016m4333M2450O205L9274j14934o5691P9971J3176M4099P1626
$$ 117060 53044 8711 51161 57366 96640 -18294 -83985 -4014 9162 53261 124887
11745A24887l8839p9028p5040o31L9182J7833k3000J4146P2024M2660J4794l0907
$$ 124887 86048 7020 -68020 -68651 -29469 -11636 -34636 -20490 51534 94194 108988 78081
11733G8081r0318k5780L8087J689O8932l8507J5095M0589k6787l8110p0696m5391
$$ 78081 -12237 -38017 70 1759 70691 32184 47279 87868 61081 22971 -47725 -93116
11721i3116Q6290R4375M6020k168L7123n0553k5406q4946j7968M5387k0215N9998
$$ -93116 -6826 87549 133569 131401 168524 117971 92565 7619 -10349 35038 14823 74821
11709G4821N1070j0684o8598l1799j5583j36570O5447J20532L3259o4760q411
$$ 74821 125891 115207 46609 14810 -773 -137343 -71896 48636 81895 17135 8724
11698H724P117q006L473l1706J3985J06962P3977J8432l1178J512j3473k6525
$$ 8724 15841 7835 11308 -20398 -6413 100549 174526 192958 161780 163292 149819 123294
11686A23294l3352J9610q7880l9237K3925N0479l2716p1461r4383K8940J55277
$$ 123294 89942 109552 21672 -17565 6360 56839 24123 -47338 -141721 -112781 42496
11675D2496N9506J4011j2068L5139P2512m9366j29840j8728L3348Q135k4815n335
$$ 42496 102002 116013 103945 139084 211596 162230 32390 13662 47010 55145 30330 24995
11663B4995j0950K5899m7900M735k1070k5686M4022j023K1243P5430p1644m0947
$$ 24995 14045 39944 -7956 -3221 -24291 -49977 -5955 -6978 14265 89695 18051 -22896
11651b2896p5681k1047N3785M4503J28361O8437n9047j06410m0005O0890J02117
$$ -22896 -98577 -119624 -65839 -21336 107025 175462 116415 10005 -30000 30890 133007
11640A33007M2106N1923o2627m3018l5428n7467k8215P2580J2032M625K4268R9754
$$ 133007 175113 227036 164409 121391 85963 28496 281 72861 84893 89518 113786 213540
11628B13540j1710j7518k7530n2938q767J3754N2022p4304j16687j7267Q4484
$$ 213540 201830 184312 156782 103844 95077 108831 160853 86549 -30138 -47405 37079
11617C7079L0515j09718l242L2632k3717k0O423N0487P2337J41882k6596r2598
$$ 37079 67594 -42124 -45366 -12734 -36451 -36471 -30048 20439 92776 234658 208062 115464
11605A15464P6286J3472j5939O845K27105K81627K69727K01753O7249j09333j87437
$$ 115464 191750 205222 189283 196128 423233 704860 974587 1176340 1243589 1134256 946819
11594I46819j22644j60567j55174j7848m6531q2037m8875q0542O070N006L1104
$$ 946819 824175 663608 508434 490586 444055 362018 313143 232601 238671 243677 274781
11583B74781k8675p5780p1744Q2081M0849K2814J04973J3951o708J7105O8336
$$ 274781 246106 170326 98582 180663 221512 244326 349299 363250 356542 373647 441983
11572D41983J3191n6043M8477J13016N9868J30585K32865L31930L17974L15315
$$ 441983 455174 399131 447608 560624 620492 751077 983942 1315872 1633846 1949161
11562A949161J02751o0803k40595l63838k46540j99874j57615j91104j40018j19657
$$ 1949161 2051912 1991109 1750514 1386676 1140136 940262 782647 591543 451525 331868
11552C31868k7055L09q5688P418R9451l838k9030k4643O9417j8778K1211K5953
$$ 331868 304813 305122 219434 226852 326303 322465 293435 268792 338209 319431 340642 366595
11540C66595k052m0634j3724l7263J01972k4750m9707P6787L1248Q5466L0630
$$ 366595 364543 323909 310185 272922 374894 350144 300437 377224 408472 493938 524568
11529E24568R7340J38257K33335L4355k7431j79204k20337j05255k0169j3146
$$ 524568 621908 760165 993500 1027855 1000424 821220 600883 495628 475459 462313
11519D62313n8371j21230j5913J5822L8604o4768p291n3405l1269o5513n3128
$$ 462313 403942 282712 266799 282621 321225 256457 249166 195761 164492 98979 45851
11508D5851k304M3722j5095m8205j5230Q339O0316J22349l9026m8005R1592J1679
$$ 45851 43547 87269 72174 23969 8739 17078 77394 199743 160717 112712 204304 215983
11496B15983j37645r2354k6634N9067L0177N4170N7273J11167O4765k275O0652
$$ 215983 78338 -14016 -40650 18417 48594 102764 160037 271204 335969 333694 394346
11485C94346o3117j54052j98422k6320J7643Q1560J22217m902M4811K5254p8636
$$ 394346 331229 177177 -21245 -47565 -29922 51638 173855 168953 213764 239018 160382
11474A60382l3525k0765l3531p1284K5217P8825L5331n7308n254P9025N8320j7792
$$ 160382 126857 106092 72561 1277 26494 105319 140650 83342 78088 157113 215433 197641
11462A97641L284k8049l0242l3280m9863O3546N4194j5519R2801L175j30423L0643
$$ 197641 200925 172876 142634 109354 59491 123037 177231 161712 254513 257688 127265 157908
11450A57908M0504p3430n2854L0055j2097M3757K2810J6857N3205L2922m2271
$$ 157908 198412 124982 72128 102183 90086 133843 156653 173510 226715 259637 217366
11439B17366o8552q7760j8483P2120O9099m5309p2185K6833M3282j2142l9401
$$ 217366 148814 61054 42571 114691 183790 138481 66296 93129 136411 124269 84868
11428H4868m595N2137K7521O3143K8732n0413j01504P8587N4281l3240m7330J3547
$$ 84868 80273 132410 159931 223074 251806 201393 99889 178476 232757 199517 152187 165734
11416A65734m2305k6984N9044J13140Q6448j07840m0493Q6365J5504j8468J07446
$$ 165734 123429 96445 155489 268629 355077 247237 206744 293109 308613 290145 397591
11405C97591Q1354K6180k8361L9329N1365j06692j15588j16229J7369N6025j4825
$$ 397591 478945 505125 476764 516093 567458 460766 345178 228949 246318 302343 287518
11394B87518J5716J7075k8594l414m9600k7586m7342J9001K0999L7810l8248l5445
$$ 287518 303234 320309 291715 288301 238701 211115 163773 182774 203773 241583 203335 167890
11382A67890j8804N923n5866J9114Q4184o318k3219J8046N6351k3839n3409k678
$$ 167890 149086 155009 99143 118257 202441 196123 172904 190950 247301 223462 170053 167375
11370A67375O4468j2859m4238J9877J6178k1905m4666k7976L7865J7786L157O5699
$$ 167375 231843 218984 174746 194623 210801 188896 144230 116254 154119 171905 175062 240761
11358B40761N0609L4643J1840J8452K8127n0209m6718j6009j6271L8272J3674
$$ 240761 291370 326013 337853 356305 384432 334223 287505 271496 255225 293497 307171
11347C07171k6599k4788Q2689J0135o8791q1656O82J06206N9984K4730L1472j04609
$$ 307171 280572 255784 338473 348608 279817 198161 198843 305049 365033 389763 421235 316626
11335C16626r1581j13250l940Q8155N2765L4939M7025P4646K736k583l8244q2972
$$ 316626 225045 111795 107855 196010 248775 283714 330739 405385 408121 405538 367294 284322
11323B84322j6328O324k9905O3120K8903k3728r9172l88N0857L4865j1374N685
$$ 284322 267994 274318 244413 307533 336436 312708 213536 213148 264005 298870 287496 293181
11311B93181P8767l0530J3835J00317L8009m7263m3533N3917M8774M2436M9544
$$ 293181 371948 341418 355253 455570 493579 446316 402783 456700 505474 547910 597454
11300E97454L5514k2573j30971k7344K3250Q4158K02063K1117n0219l6132K3962
$$ 597454 632968 610395 479424 452080 475330 559488 761551 782668 732449 696317 720279
11289G20279n8355p0682o2438O236K2975Q643k4205l7637K1410L9625K1997j15439
$$ 720279 661924 591242 528804 535040 558015 566658 542453 504816 526226 565851 587848 472409
11277D72409m5920J05928M0211p3738m4179O1145k1623K6950J22323P7195o022
$$ 472409 426489 532417 572628 498890 454711 515856 494233 521183 643506 720701 714679
11266G14679k0257m9117K7466R449j4772K4107n2355k6687K7603O2718M786R3952
$$ 714679 694422 645305 672771 682220 667448 691555 639200 612513 640116 702834 707620 801572
11254H01572m617o6751m1713n925M3206J10535Q4344n8609J7754J13357K7781
$$ 801572 796955 730204 688491 682566 725772 836307 920651 862042 879796 993153 1020934
11243A020934L8304K5759L0950J655p762j04741L52P1729N2496J17479m5529O6644
$$ 1020934 1059238 1084997 1115947 1117602 1109840 1005099 1005451 1077180 1129676 1247155 1201626 1268270
11231A268270J50514K8923p8213k6831N6941J29169J3436L2177J00024Q7650N764
$$ 1268270 1418784 1447707 1369494 1342663 1399604 1528773 1542209 1574386 1674410 1762060 1767824
11220A767824r113P8496J55827N2188J10376J31128P6103M2895J66157J16749
$$ 1767824 1758711 1837207 1993034 2045222 2155598 2286726 2362829 2405724 2571881 2688630
11210B688630J10121J85279K33930K20049L70332L56759M11125N12341M35797
$$ 2688630 2798751 2984030 3217960 3438009 3808341 4165100 4576225 5088566 5524363
11201E524363N87523P59569R41725J220292J412909J322746J261775J186151J340579
$$ 5524363 6111886 6871455 7813180 9033472 10446381 11769127 13030902 14217053 15557632
11192A5557632J696252K204594K839659L817348N353498P823247J1709210J7871196
$$ 15557632 17253884 19458478 22298137 26115485 31468983 39292230 51001440 68872636
11184F8872636K6651256L6098207L9998572L0356727N771484k2133417l6394055
$$ 68872636 95523892 131622099 171620671 201977398 207748882 185615465 149221410
11177A49221410l5027059k7447269j9682799j3545195r285872o319463m013189
$$ 149221410 114194351 86747082 67064283 53519088 44233216 37913753 33900564
11170C3900564k376018j564656j519583j564694j275775o93795k35064L86125
$$ 33900564 31524546 29959890 28440307 26875613 25599838 24906043 24670979 25057104
11162B5057104R74284J423233J768839J941777K018207K244596K879470L935140
$$ 25057104 26031388 27454621 29223460 31165237 33183444 35428040 38307510 42242650
11154D2242650N374485P580983J1146420J7048076K6750464M1538139O0049301
$$ 42242650 47617135 55198118 66344538 83392614 110143078 151681217 211730518
11147B11730518P4321728P0907619L9710808j0638046n5421258p3340294o5447927
$$ 211730518 286052246 356959865 396670673 386032627 330611369 257271075 191823148
11140A91823148m9258049l4627292k3981395j6766460j1897789q456875o062019
$$ 191823148 142565099 107937807 83956412 67189952 55292163 46835288 40773269
11133D0773269m328304l167879k346906j683218j488324j291844q81037l52187
$$ 40773269 36444965 33277086 30930180 29246962 27758638 26466794 25585757 25233570
11125B5233570K06180R26794J088634J011621Q62186N94146J043477J984018L560960
$$ 25233570 25439750 26366544 27455178 28466799 29328985 29923131 30966608 32950626 36511586
11116C6511586N828875R159190J4168667K1420801L0024912L5901615L1356677
$$ 36511586 42340461 51499651 65668318 87089119 117114031 153015646 184372323
11109A84372323J2128805j4655723l2953814l5371137k8932760k1187778j4772269
$$ 184372323 196501128 181845405 148891591 113520454 84587694 63399916 48627647
11102D8627647j0361727p241613n144076l776379k892884k227417j789509j397713
$$ 48627647 38265920 31024307 25880231 22103852 19210968 16983551 15194042 13796329
11094A3796329j297498j303569j405445j283617r98811p62436p12192n08297m78557
$$ 13796329 12498831 11195262 9789817 8506200 7507389 6744953 6032761 5524464 5045907
11085E045907m12822l77111l09909k87807k08959k83502k22053j67227j4518j37698
$$ 5045907 4633085 4255974 3946065 3658258 3449299 3165797 2943744 2776517 2761999 2624301
11075B624301j07029j26884j04021O1292K9100r5187o3726J4831k3676J2331L7943
$$ 2624301 2517272 2390388 2286367 2347659 2376759 2281572 2217846 2232677 2209001 2221332 2259275
11064B259275k9186r1140k52808k29143l8700k6922r1574j0765q8812n9379P6863
$$ 2259275 2230089 2138949 1886141 1656998 1618298 1591376 1499802 1489037 1400225 1340846 1417709
11053A417709k4771J1230n7463j27622J439j8532k6921q6263k2707M1724M920
$$ 1417709 1392938 1404168 1346705 1219083 1220522 1201990 1175069 1088806 1066099 1107823 1112743
11042A112743m7577n7744m3571m2297m8843Q1209J37792O2112P915M9557K0723
$$ 1112743 1065166 1007422 963851 921554 872711 953920 1091712 1153824 1161739 1211296 1232019
11031A232019l548o2224j5643K0001n3085o0963l9893o058j56788o6838J23806
$$ 1232019 1228471 1166247 1150604 1170605 1117520 1056557 1016664 1010606 853818 786980 910786
11020I10786J50482L3843P7357P6429L5370j15486j32894j19817P530M5497k9722
$$ 910786 1061268 1095111 1172468 1248897 1284267 1168781 1035887 916070 923600 969097 939375
11009I39375m4017Q6742Q4714L6622K4929l7873P2243J12189p7590p8832m6853
$$ 939375 895358 982100 1066814 1103436 1128365 1090492 1162735 1274924 1197334 1118502 1071649
10998A071649m2505O3841o2238j09612J56434J55226M9170j08567r3865o1509
$$ 1071649 1029144 1092985 1030747 921135 1077569 1232795 1281965 1173398 1079533 1018024
10988A018024r9136M2977M2307q1082J3475k176O0353L0127l0964l225N128M2100
$$ 1018024 918888 961865 1004172 923090 936565 934389 994742 1024869 993905 990680 995808 1037908
10976A037908L3783p1092L6908L4761J6454P0463j6476P379m7237M38l56l9911
$$ 1037908 1071691 1000599 1037507 1072268 1088722 1159185 1142709 1150088 1102851 1103289 1102933 1063022
10964A063022K8113o9838M576M8457k7367Q7211N7404Q5291J28377O9678n4756
$$ 1063022 1091135 1021297 1025873 1074330 1046963 1134174 1191578 1276869 1405246 1474924 1420168
10953A420168q361P0612J75020K81592L26006M54110P77163R53729J142940J447400
$$ 1420168 1411807 1482419 1657439 1939031 2265037 2719147 3496310 4450039 5592979 7040379
10943G040379J146767L65181o01167j301791j321061j016411p33204l81685j69152
$$ 7040379 8187146 8552327 7951160 6649369 5328308 4311897 3578693 3197008 3027856
10934C027856j57860j27427O6036K9776j4392j88879l12157p3709L1182l6086
$$ 3027856 2869996 2742569 2808605 2838381 2823989 2635110 2322953 2249244 2280426 2244340
10924B244340k955R1046J85485K31619M14915N29844O37894P54545P32235L59508
$$ 2244340 2241385 2332431 2517916 2749535 3164450 3694294 4332188 5086733 5818968 6178476
10914F178476K19084L52157O74754P65504N71508O3063m47399n89005n40238l44045
$$ 6178476 6397560 6749717 7424471 8189975 8761483 8824546 8377147 7788142 7247904 6903859
10904F903859l27768o70833j040626r58858o09549l83971m04243j97447o6073
$$ 6903859 6576091 5905258 4864632 3905774 3296225 2912254 2508011 2310564 2244491
10895B244491l0589M8715P7804J37377J51265P2518j7747o3397r2762K1858O2339
$$ 2244491 2213902 2262617 2340421 2477798 2629063 2701581 2683834 2620437 2527675 2549533 2611872
10884B611872J38600K33171N00888Q35107J105239J351917J084507K47674p18857
$$ 2611872 2750472 2983643 3484531 4319638 5424877 6776794 7861301 8108975 7390118
10875G390118j207652j110279r69098o85642n56508m07673k47730j44923j56458
$$ 7390118 6182466 5072187 4103089 3417447 2860939 2453266 2205536 2060613 1904155
10866A904155j18643J6823o4152O490l162j0832m0617L916P2754J12141R9843
$$ 1904155 1785512 1802335 1738183 1744673 1741511 1730679 1690062 1693978 1766732 1878873 1978716
10855A978716k7673J06854J59584L6983j08462r5639n8272j0343p6693m2094n0032
$$ 1978716 1951043 2057897 2217481 2254464 2146002 2050363 1992091 1981748 1905055 1862961 1812929
10844A812929m244M766O8863q510r1182q1044L1043J6060Q0384k1021M256Q7572
$$ 1812929 1808685 1813451 1882314 1873804 1782622 1701578 1732621 1748681 1829065 1808044 1812300 1899872
10832A899872l6438k6169K8280P0045q135J4334j0116l7393K1231P9019O7370
$$ 1899872 1863434 1837265 1865545 1935590 1927455 1941789 1931673 1894280 1915511 1994530 2061900
10821B061900m2888j30251o2933K2858R8707J16213L6952p2431m4675J805J63354
$$ 2061900 2019012 1888761 1825828 1848686 1947393 2063606 2100558 2028127 1983452 1985257 2148611
10810B148611J94418R3208R3826K2677P0732K080j3929n1411R9888J06962J03256
$$ 2148611 2343029 2436237 2530063 2552740 2623472 2625552 2611623 2560212 2660100 2767062 2870318
10799B870318R7001P8870P0748L3806K5036J13185L4744J18653J62708R2286j2375
$$ 2870318 2967319 3046189 3116937 3150743 3175779 3288964 3323708 3442361 3605069 3697355 3684980
10788C684980J03542K25485J15582J07454J71025K26301J29085Q2204J51462J65455
$$ 3684980 3788522 4014007 4129589 4237043 4408068 4634369 4763454 4845658 4997120 5162575
10778E162575K27859K88172K73113K80183L57042L47527K76659K66269L75152
$$ 5162575 5390434 5678606 5951719 6231902 6588944 6936471 7213130 7479399 7854551
10769G854551N18371M59501N61667O00961N86646P17184Q54443J023215J146985
$$ 7854551 8372922 8832423 9394090 9995051 10581697 11298881 12153324 13176539 14323524
10760A4323524J346945J538353J848558K018449K027122K206372K561452K927222
$$ 14323524 15670469 17208822 19057380 21075829 23102951 25309323 27870775 30797997
10752C0797997L420181L937418M747808N847615P232357R058017J1639309J4893037
$$ 30797997 34218178 38155596 42903404 48751019 55983376 65041393 76680702 91573739
10744I1573739J9381712K4944319L0953018L6188556L8091721L3295045K0654487
$$ 91573739 110955451 135899770 166852788 203041344 241133065 274428110 295082597
10737B95082597K874725j4125675k5595862l0227458k9339623k5324947k0153331
$$ 295082597 297957322 283831647 258235785 228008327 198668704 173343757 153190426
10730A53190426j4778805r639988m844487l94276M029465Q058168J1724052J4082656
$$ 153190426 138411621 128771633 123927146 123532870 127562335 135620503 147344555 161427211
10722A61427211J4407944J2500318Q620743L655680m53012k214578j158229K458089
$$ 161427211 175835155 188335473 196956216 200611896 200158884 197944306 196786077 199244166
10714A99244166P943732J4045998J9595412K3488799K4214163K0303062J1643556
$$ 199244166 207187898 221233896 240829308 264318107 288532270 308835332 320478888
10707C20478888j95339j1898281k0285057k3637852k2384060j8288475j2855680
$$ 320478888 320283549 308385268 288100211 264462359 242078299 223789824 210934144
10700B10934144p137639k493119m60618j211460m057946q101353j1651763j3689177
$$ 210934144 203796505 201303386 200842768 199631308 195573362 187472009 175820246 162131069
10692A62131069j3826503j2204317r433123o034241k362138J249087N199404R576088
$$ 162131069 148304566 136100249 126667126 120632885 118270747 119519834 124719238 134295326
10684A34295326J4150483J9015384K3485772K6084731K5064087J8733842O952028
$$ 134295326 148445809 167461193 190946965 217031696 242095783 260829625 267781653
10677B67781653p875173k1132610k9035061l1086378k9062968k5111540k0812082
$$ 267781653 259906480 238773870 209738809 178652431 149589463 124477923 103665841
10670A03665841j6829361j3544992j0819312q688982o872591n636370m755550
$$ 103665841 86836480 73291488 62472176 53783194 46910603 41274233 36518683
10663C6518683l958712l426895k928044k555050k217065j899585j535665j419133
$$ 36518683 32559971 29133076 26205032 23649982 21432917 19533332 17997667 16578534
10655A6578534j200326j070268q74331q44437q41817p03987o27322n09408n01529
$$ 16578534 15378208 14307940 13433609 12589172 11747355 11043368 10416046 9906638 9405109
10646I405109m67297l83633l04211k59545l38466l11259l02285k75450k07055
$$ 9405109 8937812 8554179 8249968 7990423 7651957 7340698 7038413 6762963 6555908
10637F555908q1369k29231k67294j24688k15516k93392k02979p6917q0277j2355
$$ 6555908 6474539 6245308 5978014 5853326 5637810 5344418 5141439 5064522 4984245 4971890
10627D971890q6453j22285O0631m650j7024L1186R758K4119J6955O3571P4141
$$ 4971890 4885437 4763152 4823783 4819133 4802109 4833295 4843053 4867172 4884127 4947698 5021839
10616E021839Q6949J36289J83710K22467K17453J89686L29142M99318M99485L63622
$$ 5021839 5108788 5245077 5428787 5651254 5868707 6058393 6387535 6886853 7386338 7749960
10606G749960M48172M22598M36945K98170K54147L3967j19648k18885k16276l64046
$$ 7749960 8198132 8620730 9057675 9355845 9609992 9643959 9524311 9305426 9089150 8725104
10596H725104m48599l20510k68237j49154q2701P1861M9761J15028J52334J02307
$$ 8725104 8276505 7955995 7687758 7538604 7455903 7527764 7577525 7692553 7844887 7947194
10586G947194J70530J39834J23147J72681J53359M2607K05360K75251K19206L26664
$$ 7947194 8117724 8257558 8380705 8553386 8706745 8749352 8954712 9229963 9449169 9775833
10576I775833K53100L03033K37513J18803Q1057M0785j11993j40509k09557l51051
$$ 9775833 10028933 10331966 10569479 10688282 10769339 10810124 10698131 10557622 10348065 9997014
10566I997014k73511l16529l63246k19926q6903j22119k32256k14278k14187k55399
$$ 9997014 9723503 9406974 9043728 8823802 8736899 8614780 8382524 8168246 7954059 7698660
10556G698660k99245j98966q5048k01290j79387O1716R4585M2527J02824L27574
$$ 7698660 7399415 7200449 7115401 6914111 6734724 6796440 6891025 6933552 7036376 7363950
10546G363950K94930O1866K224J9042o6093j67610j93140l63231m76322m78114
$$ 7363950 7658880 7720746 7722970 7742012 7675919 7508309 7315169 6951938 6475616 5997502
10536E997502m33560m31346l99336m43363l56746l22313k70397k45445k24726
$$ 5997502 5563942 5132596 4733260 4289897 3933151 3610838 3340441 3094996 2870270
10527B870270j56525k27989k33711k14871r3018j0516j39926r0980q7980n2352
$$ 2870270 2713745 2485756 2252045 2037174 1944156 1933640 1793714 1702734 1614754 1562402
10517A562402p6590r0418m7990J8743k8237P6664k915q2653r5163o0436k1764
$$ 1562402 1485812 1395394 1347404 1366147 1337910 1414574 1411659 1329006 1233843 1173407 1151643
10506A151643l0452k8688r2589l8942N0585Q9712m6949l5363n4054l9361n5116
$$ 1151643 1121191 1092503 999914 960972 1011557 1101269 1054320 1018957 964903 925542 870426
10495H70426k1110K5750O5080L4018M778l5911j4181k2888l8416j6289l8363n9205
$$ 870426 849316 875066 940146 974164 978942 943031 928850 905962 867546 851257 812894 753689
10483G53689p914p8713m3716k3803j9307M4800R4595j7415q7984j520k3956j192
$$ 753689 745775 667062 623346 599543 580236 625036 719631 702216 614232 612712 588756 587564
10471E87564m1395l6122Q7335J4466J886m541j2125L4728j37082M4889M817L729
$$ 587564 546169 510047 597382 611848 613734 609193 597068 631796 494714 539603 544420 548149
10459E48149M7875K4606M8910J2928q00k9782l2667m6242M3864q0198q2448K7294
$$ 548149 596024 620630 669540 682468 681668 651886 619219 572977 616841 536643 454195 481489
10447D81489J40916R2644J69408K01245Q6463J62040K04265m9612l4763j25682
$$ 481489 622405 715049 884457 1085702 1172165 1334205 1538470 1488858 1454095 1328413
10437A328413l7929j5005q3883l09448j89174o9822p1272o0986n2846n9327j4141
$$ 1328413 1290484 1275479 1191596 882148 692974 623152 551880 490894 438048 378721 364580
10426C64580k9303k9466M8871M5072l41P05j08640j67055r1988J1660O8853O2477
$$ 364580 335277 305811 354682 399754 399413 400118 291478 124423 32435 44095 112948 175425
10414A75425m2937n8023O746N4466K6997N0823l3384P570k213O3015O7097j7369
$$ 175425 132488 74465 81211 135677 162674 213497 180113 187683 185470 248485 315582 298213
10402B98213r3108K7487j7118j07009R560O0747J7370J7589Q9893l7335j17366
$$ 298213 205105 232592 215474 108465 118025 178772 196142 213731 303624 266289 148923
10391A48923J7706R5579L3177l5382n4244k7498N0052J7245l5194J7223n9245
$$ 148923 166629 262208 295385 260003 205759 178261 228313 245558 210364 227587 168342
10380A68342J8854q885O2504N5445m5371N753j05462j2460j4841l3964K6192k0459
$$ 168342 187196 178311 240815 296260 250889 256642 151180 138720 123879 89915 116107 95648
10368I5648m0757P8704J6187K1587P0331N211k1559J8171l6542q9076q9072P4354
$$ 95648 54891 133595 149782 171369 241700 246911 225352 243523 206981 117905 28833 103187
10356A03187J13670o254l8085l0910J9454k7973M6089k5493P8595m4688m4300
$$ 103187 216857 210603 172518 141608 161062 133089 179178 153685 232280 187592 143292
10345A43292m4747Q6215N8680O4714L3443j3316l0259q6523j2765K7889j8459
$$ 143292 98545 184760 243440 308154 341597 328281 298022 211499 198734 226623 208164
10334B08164K7125J804Q5627R5177R837n6709p28p4779K7828J1998K0825J40594
$$ 208164 235289 237093 322720 417897 427734 371025 370297 295518 323346 335344 356169 496763
10322D96763R4330J04702O2563K2880P8794R9736J83255K60502M6765L7191K4953
$$ 496763 591093 695795 758358 781238 860032 959768 1143023 1403525 1450290 1487481 1512434
10311A512434J46796p0822j53674j35135j60465j60740j44236k528p5117N775
$$ 1512434 1659230 1588408 1434734 1299599 1139134 978394 834158 831630 756513 762288
10301G62288j7052P689N4432R6952J16919J25040Q5760K2079Q811p1242N844J7186
$$ 762288 745236 752925 807357 904309 1021228 1146268 1232028 1254107 1262918 1191676 1197520 1214706
10289A214706L8303J22821N1693Q3440J10628P7738l674l5704m576J7754j41891
$$ 1214706 1253009 1375830 1427523 1510963 1621591 1699329 1695655 1659951 1655375 1673129 1531238
10278A531238j27078j1245j4648q0277L4217r274n2574m2876l5959M0297j11556
$$ 1531238 1404160 1392915 1378267 1297990 1332207 1322933 1270359 1227483 1191524 1231821 1120265
10267A120265k11844n3592O6025n6903m5497J53101R7111L3728j4700Q8900O2452
$$ 1120265 908421 854829 920854 863951 818454 971555 1068666 1102394 1087694 1176594 1239046
10256A239046J14614J82091J70389N7263q6034j44616j65756j83490j64832r3241
$$ 1239046 1353660 1535751 1706140 1763403 1677369 1532753 1366997 1183507 1018675 925434
10246I25434k8380j50403r0025m9857m3422n3256p9792l7433K3334m5156n3793
$$ 925434 897054 746651 656626 606769 563347 510091 430299 392866 416200 371044 317251
10235C17251l5403k344j6239M8693j7420l9011n787J6150K6612M0218O6413j0773
$$ 317251 281848 279504 263265 311958 294538 255527 249740 265890 292502 332720 399133 388360
10223C88360m1603Q840M387k9832j87081n4178j2984Q9939l318j8847l7961p1229
$$ 388360 346757 355597 359984 330152 143071 88893 75909 165848 162530 143683 105722 34493
10211C4493Q4844j7396Q1877m7741k5060M5737k1721M9446l0782q6105L1320P6867
$$ 34493 119337 101941 183818 136077 111017 156754 135033 184479 153697 67592 98912 175779
10199A75779K8776L4562q8318K4324r4780k1958O9540J18593k1934j25614m0380
$$ 175779 204555 239117 150799 175123 80343 58385 127925 246518 224584 98970 58590
10188E8590Q6605N5506j4949m8944p936k206M3858J5805J6451o9662O1500J4345
$$ 58590 145195 200701 185752 136808 128872 126666 170524 186329 202780 133118 194618 208963
10176B08963L3874N0010k1932n8571R796M5242k7901p0910l6710l5849K1310M0432
$$ 208963 242837 292847 270915 212344 222140 267382 239481 168571 131861 96012 117322 157754
10164A57754N8404m5327l2234P5118J9399K2913r267l8334o7476r4308J2919O5777
$$ 157754 216158 170831 138597 213715 233114 256027 246760 208426 140950 46642 59561 125338
10152A25338j1783K2729K973K5128N1943J85481k2321j05753p0368l7471n6549
$$ 125338 113555 136284 139257 164385 216328 401809 379488 273735 203367 165896 109347
10141A09347m5535J0102O277Q2745J39458J0678l7230m5898Q3030k1233l0415
$$ 109347 63812 73914 80191 162936 302394 313072 275842 229944 312974 291741 261326
10130B61326l1002p2971m914L0633l6165J6444N1203Q118J3837m1156J8805l6723
$$ 261326 230324 157353 152439 183072 146907 163351 214554 222672 236509 195353 214158 177435
10118A77435n5899Q0304R7738m4457l3710l2949K251q0004Q096O792K8816l9546
$$ 177435 121536 201840 299578 255121 221411 188462 190713 110709 118805 125597 154413 114867
10106A14867J5808N6555m7520j00670O1109P9940m9231m1938p349M6837L0235
$$ 114867 130675 187230 139710 39040 100149 180089 130858 88920 81571 128408 158643
10095A58643P3981j4952n9396n9554n622O3412k6096q8350R246k8771m9098P7438
$$ 158643 232624 217672 158276 98722 93100 156512 130416 42066 51312 22541 -26557 50881
10083E0881l2319Q016q981Q1099M5549L0657m6737m7570n8206k1381M71p593n9090
$$ 50881 18562 26578 17597 98696 144245 174902 128165 80595 22389 1008 1479 -6114 -65204
10070f5204K4528m2389J16737N8760m9586q133o254Q8778L6055P097P571l3519
$$ -65204 -40676 -83065 33672 92432 42846 34713 28459 117237 153292 160389 167960 134441
10058A34441q3240r156l1623l4200N4668j6532m364N3059L3922o139K7253k4807
$$ 134441 51201 42045 10422 -23778 30890 14358 9994 63053 96975 90836 118089 93282
10046I3282k8110M5230N9783K4414K6352q3862L109N9064L5017L8045r5412q4614
$$ 93282 65172 110402 170185 194599 220951 137089 140198 199262 234279 272324 176912 92298
10034I2298l4214Q3645o212j9774l2404p4292o879J19668K9212p8538L0055K3508
$$ 92298 58084 141729 135517 115743 83339 9047 2168 121836 151048 72510 102565 126073
10022A26073n8343k5609k8338O3994j1208o7231j11767L6209R5880L2645R3387
$$ 126073 67730 42121 13783 77777 66569 -662 -112429 -76220 19660 52305 145692
10011A45692l5160n5507k9091n194P3892k5887n5406K8926L1113m9520n0931J4943
$$ 145692 110532 55025 25934 20740 94632 68745 13339 42265 73378 23858 -27073 -12130
9999a2130J19572j951n2540N9239m3783r6659J9560P9184J0611j19759P74N9694
$$ -12130 107442 105491 52951 112190 68407 -28252 -8692 70492 81103 -38656 -37882 21812
9987B1812r156K8724P3585n5615r7841Q4482O0143j07217M4262M9650o7307l7491
$$ 21812 12656 41380 114965 59350 -38491 45991 106134 -1083 43179 92829 25522 -11969
9975a1969M1461j3271l9235M1311L710r8114O388K07160n7343J3713J04m082K8853
$$ -11969 29492 16221 -23014 18297 22007 -76107 -69719 137441 80098 93811 93915 89833 118686
9962A18686l4613p8122K0094l2724k3035L7363K3163k7951j2271p765j7368M8356
$$ 118686 84073 5951 26045 -6679 -29714 7649 30812 2861 -9410 -17175 -34543 13813
9950A3813L332j4464M0054Q5342k2006K4701l7927j01264m7077m698Q7772k0819
$$ 13813 17145 2681 42735 128077 106071 130772 92845 -8419 -55496 -60194 27578 6759
9938F759L3522Q4619m4237M257k8508Q050N403n2093L7610M6686n5270j7433N9355
$$ 6759 40281 124900 80663 84920 56412 64462 69865 17772 55382 102068 46798 29365 88720
9925H8720M9156N5203M0493l065j07691m9590p571K5705O9646K0061k2041M326
$$ 88720 137876 193079 233572 230507 122816 73226 65655 91360 161006 181067 159026 163352
9913A63352L572m9450l1793o9341R9829J39233k494l2163r1207j15077J1710j8502
$$ 163352 166924 117474 85681 16340 116169 255402 252908 220745 129538 14461 26171 7669
9901G669N3793J2615o2663K9062N6324J4459o1241P74L1045j37733j41R6809M3823
$$ 7669 61462 74077 11414 40476 96800 111259 50018 50792 81837 -55896 -56037 40772 84595
9888H4595K2424j4880R3308L469k787J0512N1611k9874q3459n360N5151J08949
$$ 84595 107019 92139 185447 188916 186129 196641 248252 218378 134919 129559 184710 293659
9876B93659m7998j84254o0667Q1258j1211m0973m45Q7159k5063q4751L034o2891
$$ 293659 245661 61407 740 81998 70787 29814 29369 116528 91465 6714 9748 -53143
9864e3143k9793l4173P0705J33536L6469l1725o7088j7291j1339M9059p447J6481
$$ -53143 -82936 -117109 -46404 87132 123601 91876 24788 7497 -3842 45217 37770 54251
9852E4251J567j2678o1952Q8370M3472l4732L9869P5503L7728p0595p9450k2582
$$ 54251 55818 43140 -18812 69558 113030 78298 118167 193670 231398 160803 81353 58771
9840E8771l3014p7578P0376J7926m6898Q040N6769J27404M3299j0443r4447j18182
$$ 58771 25757 -51821 18555 36481 -10417 -2377 54392 181796 225095 214652 120205 2023
9828B023O8568M3708k5578k1855J6275L0583o502j0457r6737m4368P1271N7076
$$ 2023 70591 114299 88721 66866 83141 113724 107222 96765 28 -44340 26931 84007
9816H4007M5029J5078o8805j8177J27143J8864j4642m7378o8794M5515J9674L0058
$$ 84007 129036 144114 75309 57132 184275 203139 188497 141119 72325 117840 137514 167572
9804A67572J4868m4177l2492l8442L6159O2007p4254M1456P4718L6288L6595o2833
$$ 167572 182440 138263 105771 67329 103488 165495 91241 132697 207415 243703 280298 217465
9792B17465p4987j08543k6161p5214m4237K5771O2404N2910j1545q7187K482J7661
$$ 217465 142478 33935 7774 -67440 -111677 -85906 -23502 29408 17863 -69324 -66842 -49181
9780d9181j4311J18658Q9422q668k55q647R699M83j10830q2094K7043M4834O6323
$$ -49181 -63492 55166 144588 135920 135665 127018 136717 137200 26370 -55724 -28681 16153 82476
9767H2476k4155j9089N8433N191j626L6203n1257m9605M7852M0898l6365K3163
$$ 82476 58321 39232 97665 102856 101230 137433 86176 36571 84423 125321 88956 112119
9755A12119k808J9804p1812q0111N4462Q6005L0202K5764n0217q7101m6065l5594
$$ 112119 109311 129115 57303 -22808 31654 117659 147861 173625 123408 36307 -9758 -45352
9743d5352m9755L0429k477l0911R7242J00418k0024N026K2285Q0256N3014l5841
$$ -45352 -95107 -64678 -67155 -98066 -824 99594 79570 84596 106881 187137 240151 204310
9731B04310m1818r191L8490n1254M8760q580l898m4835o4215j25717j0671O9934
$$ 204310 162492 153301 191791 140537 189297 180717 176819 131984 67769 -57948 -68619 1315
9719A315L2650O081J0196O9989j3681R410N3053n5068R4674P4590r0906n9935
$$ 1315 33965 40046 50242 120231 106550 115960 169013 113945 208619 283209 192303 132368
9707A32368l5052N2941J1877o944m754p4380j453J01050K672N390k8974o7003
$$ 132368 97316 150257 162134 155190 150436 76056 74603 175653 178325 183715 154741 87738
9695H7738n3812k3160J2392M0791J00028J8940Q034j3853n0580m3860O0018j2975
$$ 87738 33926 10766 23158 63949 163977 182917 190951 177098 126518 82658 142676 129701
9683A29701k7261J2919k8696k2705M5982P3792K671L7493N6650k4716l3292q337
$$ 129701 102440 115359 86663 63958 109940 183732 186403 223896 280546 255830 222538 214201
9671B14201j3142q7840J5032q191n1475L1104L6736J18812L7605O025p352M604
$$ 214201 201059 113219 128251 120060 68585 99689 136425 255237 292842 298867 291515 296119
9659B96119l5178k2428l7608J6212n3478j8860Q8190J25904O7122j09448n8677
$$ 296119 260941 238513 200905 217117 163639 144779 232969 358873 425995 316547 257870
9648B57870P688l9864K3682K2078o94j3242j6331j03367m8868K17k941j4233K9712
$$ 257870 265558 225694 249376 271454 270760 257518 241187 137820 88952 89169 86228 71995 101707
9635A01707M3156J0696L0412N8448J88J2868K2024j8301n0162o0150K5R4606N3744
$$ 101707 144863 155559 185971 244419 244607 257475 279499 261198 211036 150886 150911 245517 299261
9622B99261P2000j9492k0978q6616j8807Q4573J4426j17703l6553K0222M0195
$$ 299261 371261 351769 330791 244175 225368 309941 324367 206664 170111 190333 230528
9611B30528n4017m0150P9168O1058K3016j09007n1715o8719l2620J20883R17o242
$$ 230528 176511 136361 215529 276587 299603 190596 138881 70162 37542 158425 159342 153100
9599A53100k4346J07297N8829O428L1968m1982q1684q872R9632j8362q0961j9143
$$ 153100 128754 236051 294880 301308 333276 291294 209610 200738 300370 282008 201047 181904
9587A81904L8658j9590J6830J5579o1240j6768R869J21294K9075L6412n0074k2186
$$ 181904 220562 200972 217802 233381 172141 155373 165242 286536 315611 352023 301949 279763
9575B79763O1838k36j24146J134J26384N0207n0097r175J10752M8159l250M8190
$$ 279763 341601 341365 217219 218353 344737 394944 344847 335672 446424 494583 491333 539523
9563E39523k7640N1954K1325o6827q9507o8110J9352k0694K3602J01308K5061
$$ 539523 511883 563837 585162 518335 428828 360718 380070 359376 382978 484286 509347
9552E09347P20L382q755M5313k3179N223N23P4403J0057m3230k3938m1054n694
$$ 509347 510067 513449 504694 550007 526828 532051 532574 606977 617034 573804 549866 508812 503118
9539E03118P2735K7213Q6983K0897J1151N6445q2719o8850N6412J6825J9500Q5135
$$ 503118 575853 603066 690049 710946 722097 778542 695823 626973 683385 700210 719710 804845
9527H04845P4243m7278j27703J3989k136r207L7723j8884j222J268L8415M4155
$$ 804845 879088 831810 704107 718096 715960 706753 744476 725592 724370 725638 764053 808208
9515H08208o6939L9709J2704J02412M925k2820n730K2550j0451N9929K5408N6034
$$ 808208 741269 780978 793682 896094 901019 878199 872469 895019 884568 944497 969905 1025939
9503A025939R1865L2722L328n8275m1914n8606k0989O0725J33161K0372M471o8382
$$ 1025939 1117804 1150526 1153854 1095579 1053665 995059 974070 1034795 1167956 1188328 1192799 1124417
9491A124417l8640m4007m4708O9051L8821n9005L761K1154M2388J18013J22368
$$ 1124417 1085777 1041770 997062 1066113 1104934 1045929 1049690 1070844 1113232 1231245 1353613
9480A353613P0682l5702j44394N1569P1770K4984n1608L9968J13633P4831r025
$$ 1353613 1424295 1388593 1244199 1295768 1367538 1392522 1340914 1380882 1494515 1569346 1560321
9469A560321N4312R3820K6905l2074J7829Q2675K2781M3896k1794j806J42548
$$ 1560321 1614633 1708453 1735358 1703284 1721113 1803788 1826569 1870465 1848671 1846865 1989413
9458A989413n777Q0532L0930M9629K6950J41708R1147M0953L4598N053L8724J715
$$ 1989413 1983636 2064168 2095098 2144727 2171677 2313385 2404532 2445485 2480083 2485136 2523860 2525575
9446B525575P197J23023J54719J04733J27170Q4172k3556l1290J21876J38052
$$ 2525575 2532772 2655795 2810514 2915247 3042417 3126589 3103033 3071743 3193619 3331671
9436C331671J88802J65426J6694L9186K56597J56801N9311Q1188J48427J03401
$$ 3331671 3520473 3685899 3702593 3741779 3998376 4155177 4214488 4295676 4444103 4547504
9426D547504N5650R5138J73703J92407K06918J37455J87518J65181J45443K72375
$$ 4547504 4603154 4698292 4871995 5064402 5271320 5408775 5596293 5761474 5906917 6179292
9416F179292K85293J47517K27488K92711K24162J88665K68958K88063K46354L11201
$$ 6179292 6464585 6612102 6839590 7132301 7356463 7545128 7814086 8102149 8348503 8659704
9406H659704K89473K35219K66444K89089K93307L08676L46241M18978L95902L85256
$$ 8659704 8949177 9184396 9450840 9739929 10033236 10341912 10688153 11107131 11503033 11888289
9396A1888289L28420L76676L60813L67772L30197K73943K90905L09295K68135
$$ 11888289 12216709 12593385 12954198 13321970 13652167 13926110 14217015 14526310 14794445
9387A4794445K91635K44508J50837K64342L03465J87782R4187J08173J6231P5345
$$ 14794445 15086080 15330588 15481425 15745767 16049232 16237014 16331201 16439374 16455605 16530950
9377A6530950k3765m1465J633o0477j96995k39424k14701k37664j34248k61646
$$ 16530950 16507185 16465720 16467353 16406876 16209881 15970457 15755756 15518092 15383844 15122198
9367A5122198l87825l44555l13923l41305k80666k47869k65238m08803l99807
$$ 15122198 14734373 14389818 14075895 13734590 13453924 13206055 12940817 12532014 12132207
9358A2132207l69591l70721l11717l03447m09032m11936l87045k62011k41818
$$ 12132207 11762616 11391895 11080178 10776731 10367699 9955763 9568718 9306707 9064889
9349I064889l92478l55436j84873j43008j73246k79144k14660k60328k62327k47902
$$ 9064889 8672411 8316975 8132102 7989094 7815848 7536704 7322044 7061716 6799389 6551487
9339F551487k27974j66254j02571j43280k61771j28706r7705j58111k91721l05430
$$ 6551487 6323513 6157259 6054688 5911408 5649637 5520931 5423226 5265115 4973394 4667964
9329D667964j37239o5717l8193j31825j20150j36382j74794n8145j40827r0631
$$ 4667964 4530725 4465008 4426815 4294990 4174840 4038458 3863664 3805519 3664692 3574061
9319C574061p8602j16567j20715l3141o1114j43249j13175r050m3421n8989j30092
$$ 3574061 3495459 3378892 3258177 3225036 3163922 3020673 2907498 2898448 2855027 2796038 2665946
9308B665946j04750r8583j8277j2408j24615k7527k4876p0551J5912q803o2948
$$ 2665946 2561196 2462613 2444336 2431928 2307313 2279786 2254910 2184359 2200271 2191468 2128520
9297B128520j23029o1019m2399L3332m7138m9666q5344J7757N7523m9182j15747
$$ 2128520 2005491 1944472 1902073 1935405 1888267 1838601 1753257 1771014 1828537 1779355 1663608
9286A663608j11842l3638m5626N68k4052l7319k2559q895m7043l072m9605j4392
$$ 1663608 1551766 1518128 1472502 1473070 1449018 1411699 1389140 1380245 1333202 1330130 1280525 1266133
9274A266133J9025L927l3016j3754p151L6384k3132J7962m3015j8521m8246N573
$$ 1266133 1285158 1289085 1256069 1242315 1235164 1271548 1248416 1266378 1223363 1204842 1156596 1162169
9262A162169p0162n702k4346k8495n1865p8840N1357N7738q814k5293K0212l0887
$$ 1162169 1092007 1086305 1061959 1033464 981599 902759 954116 1011854 1003040 977747 997959 967072
9250I67072j7619j3893o259j3533j2638m326j22377l9949L2885M0931L4181j30540
$$ 967072 949453 935560 929301 915768 903130 898804 776427 736478 769363 810294 844475 713935
9238G13935m6074N9239j793k3439p6839j9968R913Q5668K4335m825L7648K3793
$$ 713935 667861 727100 725307 701868 625029 605061 614974 700642 724977 720152 757800 781593
9226G81593M569j20466n4199p9853O1612L6605j17716j880L7826M542N3150J6421
$$ 781593 786162 665696 611497 531644 593256 629861 512145 510265 548091 552633 605783 622204
9214F22204o5680j07148P7085P1855K0799l1054m0367m7465q8007k6385J0130
$$ 622204 556524 449376 526461 598316 619115 588061 547694 500229 412222 385837 395967
9203C95967J8417P291N7936K7527p5452k541k8120K9174p4140J9860k322r2344
$$ 395967 414384 421675 479611 507138 431686 429145 401025 430199 356059 375919 373597 281253
9191B81253j7389J3450K894R655j1451l7322n2923j318K6968n905P6774k4703
$$ 281253 263864 277314 280208 289863 278412 241090 188167 186849 213817 207912 284686 259983
9179B59983O549L2033q2977n4406o0794R1981J08570j33636r2383P2637R2602
$$ 259983 266532 298565 215588 161182 100388 192369 300939 167303 74920 147557 240159
9168B40159M1815P7586l9885k9394r0048P4600N9854L764n7733j8521q8262o2661
$$ 240159 281974 359560 319675 290281 200233 274833 334687 338451 280718 262197 173935 111274
9156A11274K5190N6735O9082q6171O9115M6003j3439n2694j1561m1962k8737N2620
$$ 111274 136464 193199 262281 176110 245225 291228 277789 225095 213534 171572 142835 195455
9144A95455Q6940n8765K4575J8479J4969k5398j398P6522M7932p9703k5348m53
$$ 195455 282395 223630 248205 266684 281653 256255 254857 331379 379311 299608 274260 273807
9132B73807o3756j03969K6924o028m1071P4828J60793o8694j06080m688K3788
$$ 273807 210051 106082 133006 126978 85907 160735 321528 252834 146754 142066 165854
9121A65854J2993j4983L3437O654O404L6423o6865L0984L0539q2514L714N8106
$$ 165854 178847 163864 197301 203955 210359 246782 179917 210901 241440 158926 162640 220746
9109B20746L6387o7598l8838k924o1930j0650L586J3455p6J14568J03026j35305
$$ 220746 257133 189535 150697 147773 85843 75193 78779 92234 92158 206726 309752 174447
9097A74447j11194L0191J6660O3995N1931m3828j26241o0476L2841J11027o9530
$$ 174447 63253 93444 110104 174099 226030 182202 55961 -4515 28326 139353 69823
9086F9823n8048N3760P2913j1550m300K0591j986l9013o6707n7024N7720J35651
$$ 69823 11775 65535 138448 126898 122598 143189 141203 102190 35483 -21541 36179 171830
9074A71830N1786J0175l1734j15164j13047j1021L8359N3119K7293K1946m4914
$$ 171830 223616 233791 202057 86893 -26154 -37175 1184 54303 81596 103542 58628
9063E8628m7912p5088m2565J25113K2634K4166K0183J5854o4057p5931q363l2317
$$ 58628 10716 -64372 -106937 18176 40810 64976 85159 101013 36956 -38975 -47338 -79655
9051g9655J4358K0523n336J17600N3626j56923r8142O4783K2632J34646P543p4109
$$ -79655 -65297 -44774 -50110 67490 121116 -35807 -133949 -69166 -46534 88112 95655 21546
9039B1546K6640M2792M0081k3322N1087Q3059o7215m2066L3705J5323L4256J7909
$$ 21546 48186 90978 131059 107737 158824 241883 174668 132602 166307 181630 215886 233795
9027B33795m6684m7614m2539l494K9885p5467p0577N5228k5266L1401k962K2121
$$ 233795 187111 139497 96958 93464 123349 47882 -22695 32533 7267 38668 35706 57827
9015E7827M9372O403p1855j7946L0588L6984N04k4342J2169R1005K5512m668n1962
$$ 57827 107199 113602 41747 23801 54389 91373 91877 67535 79704 170709 196221 191553 139591
9002A39591l8334R2022L7106j10418j19676N2645l664n5999K8588J4139J6968
$$ 139591 101257 193279 230385 119967 291 52936 49272 -6727 21861 36000 52968
8991E2968k1933o674R735P1731k6756K1647N5608Q529r389m0897q0083j0784j7475
$$ 52968 31035 24361 34096 105827 79071 100718 156326 164855 155466 114569 34486 23702 6227
8978F227M4493m1268P460m0142J12722M1800k5340l3395r56k1045j9664n9167
$$ 6227 50720 9452 16912 -23230 89492 131292 105952 72557 71601 50556 30892 -28275
8966b8275L9336L1679j9303M8548q7210j27482K5046P7655J01902J02474r556
$$ -28275 11061 42740 23437 71985 -15225 -142707 -117661 -40006 61896 164370 154814
8955A54814p1906p5868p7928N8739k4747K7737J08121M9064J01973Q5864r8859
$$ 154814 82908 7040 -70888 -12149 -36896 -9159 98962 148026 249999 335863 237004
8944B37004r8906q4886O0663j9991j09231o1831R29R0217M6839R634p7232l4725
$$ 237004 138098 53212 113875 93884 -15347 -77178 -76249 13968 60807 70441 -6791 -41516
8932d1516M0935P492j7774r415Q183o8617l3347l6687M3405J20326O6451o0836
$$ -41516 -581 6911 -10863 -20278 -12095 -80712 -114059 -150746 -107341 12985 79436 18600
8920A8600L8234q728o4021o563R0434P7187q4993m7079l7843n7960k2642P0389
$$ 18600 56834 48106 -15915 -22478 67956 145143 60150 13071 -24772 -82732 -105374 -34985
8908c4985p423J2522N5973P2157J8478j278q766o6239l7734L955k8720N7658J1256
$$ -34985 -42408 -29886 26087 98244 116722 115444 106678 40439 2705 6660 -22060 35598 46854
8895D6854j15440n525N2899L7320l9311O160J4901j4841R0316j9573o9522L4499
$$ 46854 -68586 -74111 -21212 16108 -23203 -17043 -2142 -16983 73333 53760 -15762 18737
8883A8737n673L7181J2686n3172M1816M7604O172R6K7584K0159j9787j7250k0343
$$ 18737 13064 50245 62931 9759 51575 99179 105351 105447 133031 153190 133403 116153 95810
8870I5810J596n1018k4451k3743K1148l1622l5216k5355K3393q705Q9227k7619
$$ 95810 97406 46388 21937 -1806 19342 -12280 -47496 -72851 -49458 -58163 31064 3445
8858C445J7037L6772K5290m582k3105j6826m0553o6560k643J5281L7041q188j8211
$$ 3445 20482 57254 82544 77962 54857 38031 -2522 -69082 -71725 -56444 -19403 -27591 -45802
8845d5802K3492j6733Q6218J6498k8503o6477o3372P5735K026r8388J3542R1396
$$ -45802 -22310 -39043 47175 63673 35170 -31307 -94679 -18944 -16918 -115306 -101764 -10368
8833a0368L6600m7572p1330j7179M8499N5445o009L5216q933j2031l8702l4607
$$ -10368 26232 -21340 -92670 -109849 -61350 -5905 -11914 23302 14369 2338 -36364 -70971
8821g0971q098K4046M8825j1136N0636L3324o873j5790K3730O878M6210l8366
$$ -70971 -79069 -55023 -6198 -17334 33302 66626 59753 43963 67693 74571 120781 82415
8809H2415o2331m0899J6015n165K9303K415N3102l403p625m2968L1725J29431
$$ 82415 20084 -20815 -4800 -9965 19338 21753 74855 71452 63827 20859 52584 182015
8797A82015J11196m7390j08419n8124l0571m8576o8657q931Q2930K716L5722K3728
$$ 182015 293211 245821 137402 79278 48707 131 -68526 -77457 5473 8189 43911 67639
8785F7639p7918o1886L9763m5728m6122M4572j1518N4963r710l7559N2521O68
$$ 67639 -10279 -72165 -32402 -78130 -124252 -79680 -91198 -36235 -45945 -83504 -30983 -30315
8773c0315q819k8542K6224M5074J09446m2223r2088j58284l7234P3911J04345
$$ -30315 -39134 -67676 -41452 3622 113068 70845 -21243 -179527 -216761 -142850 -38505
8762c8505q2141l250J9957L2700J33613J9135n3267r174j9838o6722l6377k4729
$$ -38505 -120646 -123896 -103939 -71239 62374 81509 28242 19068 -770 -67492 -103869 -128598
8750a28598k7914L7998J2832L2981O4753k4067O8291J9407j03923k6015M149j8247
$$ -128598 -156512 -118514 -105682 -72701 -7948 -32015 36276 55683 -48240 -74255 -70106 -88353
8738h8353M8075r4051k116N4097J01697N894m7619p8792n4784j7007m688K9326
$$ -88353 -40278 -134329 -136445 -82348 19349 25243 -22376 -101168 -155952 -172959 -177647 -148321
8726a48321r555O0004O4239n8123j4489L2653L2051j9160j7937L1369q8449r5442
$$ -148321 -157876 -97872 -33633 -91756 -106245 -73592 -41541 -60701 -78638 -47269 -135718 -231160
8714b31160O0210P4156J5333R7377K2000r4560n4996M7022L4296L9003N9301o581
$$ -231160 -170950 -96794 -81461 15916 37916 -56644 -111640 -64618 -30322 8681 67982 61401
8702F1401o9411r8605M328J11711k5779q8595q612Q1231j4648j3307P02L4140
$$ 61401 -8010 -106615 -102287 9424 -16355 -104950 -113562 -32331 -46979 -60286 -59584 -25444
8690b5444K412J2843K5856k0347o3873p6441m7278m3143n1043k0379O5974J2212
$$ -25444 -23032 -10189 15667 -4680 -68553 -144994 -192272 -235415 -286458 -306837 -240863 -228651
8678b28651K4520k1393k9114J46847P3724R1196L9503L077o9665M7201N9290j26795
$$ -228651 -204131 -225524 -254638 -107791 -34067 57129 96632 99709 30044 77245 136535 9740
8666I740n0221K8708O6958K2664J5422l8162m4343o4503m5670N1439l7170P3567
$$ 9740 -40481 -11773 55185 77849 93271 55109 10766 -53737 -99407 -47968 -85138 -11571
8654a1571k4673L9304M3287p4937q2598K9307P3363K7448j0607j09581o9429L7944
$$ -11571 -36244 3060 46347 -28590 -111188 -81881 -8518 18930 8323 -101258 -170687 -132743
8642a32743P332Q6768N7596P6082k3901k6586K3324k5774J814o6565L7283O533
$$ -132743 -125411 -38643 18953 95035 71134 44548 67872 42098 43912 -22653 14630 21163
8630B1163L2249j3690K4099p5894l4388o440o2049P322R8070L5973j7285J3156
$$ 21163 53412 39722 63821 -12073 -46461 -52901 -114950 -107628 -9558 26415 9130 22286
8618B2286M2607L4615K5085r80j23938q5982K1243L0168p417j7793l5331J3715
$$ 22286 64893 99508 124593 123613 -325 -86307 -65064 -34896 -42313 -60106 -95437 -81722
8606h1722o0798P9664Q4657n6116O683k1857p8114M5675J20913l6327p3724M5579
$$ -81722 -142520 -62856 21801 -34315 -27632 -49489 -127603 -81928 38985 2658 -71066 -25487
8594b5487N9073k2918p7778j9259J29792R4598j9068J3233q1217o9558l3569m150
$$ -25487 33586 10668 -67110 -86369 43423 138021 118953 132186 50969 -18589 -52158 -56308
8582e6308p1151M3850j1819K5176J26160l5540K0648L0676K4730l0485k518l6727
$$ -56308 -127459 -83609 -95428 -70252 55908 20368 41016 71692 96422 65937 63419 26692
8570B6692P8122n4713n0100n6885j02188O7383Q2063n9555J09206M3214r8110
$$ 26692 104814 50101 1 -56884 -159072 -91689 -9626 -69181 40025 83239 -14871
8559a4871o9518p1708j4888J58766M8566m9093j7565O254M5703N9814n7871n3110
$$ -14871 -84389 -156097 -170985 -12219 36347 -12746 -30311 -24057 21646 81460 23589 -29521
8547b9521r1587L74K0293n3394j08555K8609J8484J11400N1438J0166l4529k5767
$$ -29521 -121108 -120734 -100441 -153835 -262390 -233781 -215297 -103897 -52459 -42293 -76822 -102589
8535a02589P0817o1140P2850K5775j00400N4979P5465K6026m0055j27703k3700
$$ -102589 -31772 -92912 -20062 5713 -94687 -39708 35757 61783 21728 -105975 -129675
8524a29675L8304O5178O386Q5407J18115o513q4953j5453j8708p6792k51m6573
$$ -129675 -91371 -26193 -19807 65600 183715 177202 92249 76796 58088 -18704 -18955 -65528
8512f5528j1628M5269N6462J4326m1253k0979n2474o1717R0149J10897L0393K5299
$$ -65528 -77156 -31887 24575 38901 -2352 -23331 -75805 -137522 -47373 63524 93917 119216
8500A19216p3412j30310J19654O4511J5098n4073J9453L4184K8195l9052m6887
$$ 119216 45804 -84506 35148 99659 114757 60684 80137 114321 142516 103464 56577
8489E6577o3546l2556N9666O2400n4471N1892o792p5948k349N1198K8533m7596
$$ 56577 -6969 -39525 20141 82541 28070 79962 73170 -2778 -5127 46071 74604 27008
8477B7008L8362p4633l972J9481m3813j23023L4440L5972j3050p9246N367L9476
$$ 27008 65370 -9263 -13235 6246 -37567 -160590 -126150 -90178 -103228 -182474 -177107 -137631
8465a37631o9425m204R6785m5321O1063R6807L819m1124j9543P2181m972k6032
$$ -137631 -207056 -211260 -114475 -159796 -98733 -1926 1893 -39231 -58774 13407 8435 -17597
8453a7597K8799N055m9856N7752N9242M0305L2541m3067Q739R4243N5389q1105
$$ -17597 11202 16257 -33599 24153 83395 123700 156241 113174 121913 216156 271545 190440
8441A90440j42309n7235m4893k1444Q0921k3616l7947L8089l1818l1247M9191
$$ 190440 48131 -9104 -53997 -75441 5480 -18136 -56083 -17994 -49812 -81059 -31868
8430c1868M5409m4403k9751J0921J5157m5724O9133R1073P316q3805n5787K3464
$$ -31868 13541 -30862 -60613 -49692 -34535 -80259 -11126 79947 87263 3458 -52329 -28865
8418b8865J5781R9617O0698l5243q7506o02n515J7873m915n1504K5131R6038m0869
$$ -28865 -13084 86533 147231 111988 24482 23880 18365 36238 31323 -20181 4950 100988 60119
8405F0119j17321M2755O3733m9522m5387k9448N547K548m2924j15730P4659Q4589
$$ 60119 -57202 -14447 49286 -236 -45623 -75071 -69524 -66976 -109900 -225630 -150971 -66382
8393f6382P762J3462l2600J3004K9231J7431R8006k0696O801L3270N6005J0630
$$ -66382 -58620 -45158 -77758 -64754 -35523 -18092 79914 59218 66019 99289 155294 165924
8381A65924N9328r056q6923k3203Q7100o8494o3888M188l8273k0348M7339J25985
$$ 165924 225252 216196 129273 106070 193170 124676 60788 64976 26703 6355 53694 179679
8369A79679R488j64565n3533N5516J6099m4841J8944P0695K4728q1378j6525l0722
$$ 179679 189167 24602 -28931 26585 42684 -2157 16787 87482 112210 30832 14307 -16415
8357a6415L0987K8389m3418L6291R8303R501M494L1072k6630o8645M3319r0266
$$ -16415 14572 42961 -457 35834 134137 143638 148132 179204 152574 83929 127248 36982
8345C6982m4835q865P4886o472p025L0498K5411n8225L104Q8861Q880j43743p8060
$$ 36982 -7853 -16718 58168 51696 44671 75169 100580 42355 45459 134320 143200 -543 -78603
8332g8603J9246j4617J5068J06268o0268q8069m785p679m745K4892n2385p9675
$$ -78603 -59357 -73974 -58906 47362 -12906 -100975 -105760 -113439 -118184 -93292 -145677 -225352
8320b25352j3403J891k4718m9258j1914M2610J14690l3947K1284R4676J8321O7343
$$ -225352 -238755 -236864 -261582 -310840 -322754 -280144 -165454 -199401 -178117 -83441 -65120 2223
8308B223L278j17090M6556R7627N1423m141o8760m3947j1660K6592k2472k3343
$$ 2223 5501 -111589 -65033 32594 84017 79876 11116 -32831 -44491 -17899 -40371 -63714
8296f3714k6067M1999M4981M9345k8678l110R770k7486j24225n5878J5361O6359
$$ -63714 -89781 -47782 -2801 46544 17866 14756 24526 -2960 -127185 -183063 -167702 -101343
8284a01343L7354j0954J05397J9862p0226p7691k6197J935P523j0557K6595M3835
$$ -101343 -63989 -74943 30454 50316 -19910 -97601 -123798 -121863 -114340 -124897 -98302 -54467
8272e4467O3857m9969M6032J5885k2722l8112k4110m9074j6708K5891L197J5814
$$ -54467 9390 -40579 5453 21338 -1384 -39496 -63606 -112680 -129388 -103497 -100300 -84486
8260h4486L8914k7480l1882M4430J00005m1068l2067N8209K4338o5049J3961k2331
$$ -84486 -45572 -73052 -104934 -60504 39501 -1567 -33634 24575 48913 -16136 -2175 -24506
8248b4506o6921m1192J45778L6022M559J7445lL6258J9221K0611J134N3486l8362
$$ -24506 -91427 -132619 13159 49181 53740 71185 71182 107440 126661 147272 148406 201892 163530
8235A63530Q0260r7260q3808n4087P277n5528N942k6461k0467N4146J5300m9458
$$ 163530 243790 146530 62722 8635 15912 -39616 -33674 -60135 -80602 -26456 -11156 -60614
8223f0614O2922r043J7990q6496p6848P6894L3762p2169j6759K5388l8799L8028
$$ -60614 2308 -6735 11255 -75241 -152089 -75195 -41433 -113602 -130361 -104973 -143772 -105744
8211a05744p28j6491n6451j4752N7873M2210L3228k757L0824L6934K7757p2343
$$ -105744 -106472 -122963 -179414 -194166 -136293 -94083 -60855 -63612 -32788 4146 31903 -40440
8199d0440k7736j1834p044l0130M7299P9344q603N3653J17787j01481k6477k8985
$$ -40440 -68176 -80010 -87054 -117184 -69885 9459 856 54509 172296 70815 44338 15353
8187A5353J5723R7395L2528k0001Q588j07020o1415M8276q6374j9793R4512n0683
$$ 15353 31076 128471 160999 140998 149586 42566 -18849 29427 -56947 -76740 17772 -32911
8175c2911l7307M017l4241j5557O9359N0144O926r0688J4580R6083m5759j27750
$$ -32911 -70218 -66201 -100442 -115999 -46640 3504 10430 -80258 -65678 30405 -15354 -143104
8163a43104M0573q986R673O4984J7680Q7415n28k8302l8636O4680r3673p6814
$$ -143104 -102531 -111517 -101844 -36860 -19180 68235 67707 39405 769 65449 -28224 -105038
8151a05038m0551L5972O1920Q6156R3266m653l6899n1019j5640q5239K7130K5812
$$ -105038 -145589 -109617 -47697 38459 131725 127072 90173 39154 23514 -61725 -34595 -8783
8139h783p1358l8187m057R5863K0867m0734K1408J1719m5215P2812J86148j6746
$$ -8783 -80141 -118328 -122385 -26522 -5655 -46389 -24981 -13262 -58477 14335 200483 183737
8127A83737p4216j29930J1266L2426P954k4094L9991K9020R789L4935K4917j54158
$$ 183737 109521 -20409 -9143 23283 31237 7143 47134 76154 85943 120878 145795 -8363
8115h363M0M248R918l0112n4727j1190P9916p1937j09624k0250Q6876P8515m6848
$$ -8363 -8323 -4075 5843 -24269 -78996 -90186 -10270 -82207 -191831 -212081 -125205 -46690 -93538
$$ [...]
##END NTUPLES=NMR SPECTRUM
##END=
