##TITLE=Analysis number 313463
Compound Code cc 42046
Book Reference 437/42
Project Code adrs
Chemist Name wendyb
##JCAMPDX= 6.0         $$ Bruker NMR JCAMP-DX V2.0
##DATA TYPE= NMR SPECTRUM
##DATA CLASS= NTUPLES
##ORIGIN= Bruker BioSpin GmbH
##OWNER= NMR
$$ XWIN-NMR		Version 3.5
$$ Fri Sep  9 10:10:05 2005 GMT Daylight Time (UT+1h)  MAYBRIDGE\NMR@NMR_250MHZ
##.OBSERVE FREQUENCY= 250.131544655141
##.OBSERVE NUCLEUS= ^1H
##.ACQUISITION MODE= SIMULTANEOUS (DQD)
##.ACQUISITION SCHEME= undefined
##.AVERAGES= 16
##.DIGITISER RES= 18
##SPECTROMETER/DATA SYSTEM= dpx250
##.PULSE SEQUENCE= zg30
##.SOLVENT NAME= CDCl3
##.SHIFT REFERENCE= (INTERNAL, CDCl3, 0, 16.522)
##AUDIT TRAIL= $$ (NUMBER, WHEN, WHO, WHERE, WHAT)
$$ ##TITLE= Audit trail, XWIN-NMR		Version 3.5
$$ ##JCAMPDX= 5.01
$$ ##ORIGIN= Bruker BioSpin GmbH
$$ ##OWNER= NMR
$$ C:\u/data/dgb/nmr/ADRS/9140/pdata/1/auditp.txt
$$ ##AUDIT TRAIL=  $$ (NUMBER, WHEN, WHO, WHERE, WHAT)
(   1,<2005-09-09 10:09:44.10 +100>,<MAYBRIDGE\NMR>,<NMR_250MHZ>,
      <created by zg, POWCHK disabled, PULCHK disabled
       configuration hash MD5:
       62 19 C7 07 E1 42 D1 B7 37 6C 3D D0 77 39 F9 E6
       data hash MD5: 64K
       63 0F 9D AD FB 4F E5 6D FF 88 82 DA D8 3E 38 60>)
(   2,<2005-09-09 10:09:56.30 +100>,<MAYBRIDGE\NMR>,<NMR_250MHZ>,
      <Start of raw data processing
       ef LB = 0.3 FT_mod = 6 PKNL = 1 SI = 32K 
       data hash MD5: 32K
       86 FE 9A 65 36 8F 67 0F F2 6A 22 82 0A 97 D4 A6>)
(   3,<2005-09-09 10:09:58.33 +100>,<MAYBRIDGE\NMR>,<NMR_250MHZ>,
      <apk 
       data hash MD5: 32K
       E1 83 D0 76 6D CF B9 F4 A7 C0 B6 28 99 03 90 93>)
(   4,<2005-09-09 10:09:59.14 +100>,<MAYBRIDGE\NMR>,<NMR_250MHZ>,
      <abs ABSG = 5 
       data hash MD5: 32K
       FF 52 4D 82 56 0B 56 A0 52 5E 69 55 8C A5 35 02>)
$$ ##END=
$$ 
$$ hash MD5
$$ C7 99 54 D2 A7 80 5C 1C DD FD 9A 90 85 90 C0 D8
##$RELAX= 
##$RELAX= 
##$RELAX= 
##$RELAX= 
##$RELAX= 
##$RELAX= 
##$RELAX= 
$$ Bruker specific parameters
$$ --------------------------
##$DU= <C:\u>
##$EXPNO= 9140
##$NAME= <ADRS>
##$PROCNO= 1
##$TYPE= <nmr>
##$USER= <dgb>
##$AMP= (0..31)
100 100 100 100 100 100 100 100 100 100 100 100 100 100 100 100 100 100 
100 100 100 100 100 100 100 100 100 100 100 100 100 100 
##$AQSEQ= 0
##$AQ_mod= 3
##$AUNM= <au_zg>
##$AUTOPOS= <10 >
##$BF1= 250.13
##$BF2= 250.13
##$BF3= 250.13
##$BF4= 250.13
##$BF5= 500.13
##$BF6= 500.13
##$BF7= 500.13
##$BF8= 500.13
##$BYTORDA= 1
##$CFDGTYP= 0
##$CFRGTYP= 5
##$CHEMSTR= <none>
##$CNST= (0..31)
1 1 145 1 1 1 1 1 1 1 1 1 1 1 1 1 1 1 1 1 1 1 1 1 1 1 1 1 1 1 1 1 
##$CPDPRG= <>
##$CPDPRG1= <>
##$CPDPRG2= <>
##$CPDPRG3= <>
##$CPDPRG4= <mlev>
##$CPDPRG5= <mlev>
##$CPDPRG6= <mlev>
##$CPDPRG7= <mlev>
##$CPDPRG8= <mlev>
##$CPDPRGB= <>
##$CPDPRGT= <>
##$D= (0..31)
0 1 0 0 0 0 0 0 0 0.06 0 0 0 0 0 0 0.0002 0 0 0 0 0 0 0 0 0 0 0 0 0 0 
0 
##$DATE= 1126256983
##$DBL= (0..7)
120 120 120 120 120 120 120 120 
##$DBP= (0..7)
150 150 150 150 150 150 150 150 
##$DBP07= 0
##$DBPNAM0= <>
##$DBPNAM1= <>
$$ [...]
##$SUBNAM7= <"">
##$SUBNAM8= <"">
##$SUBNAM9= <"">
##$SW= 20.6930455092707
##$SWIBOX= (0..15)
0 0 3 0 0 0 0 0 0 0 0 0 0 0 0 0 
##$SW_h= 5175.983436853
##$TD= 65536
##$TD0= 1
##$TE= 296.16
##$TE2= 300
##$TE3= 300
##$TEG= 300
##$TL= (0..7)
0 120 120 120 120 120 120 120 
##$TP= (0..7)
150 150 150 150 150 150 150 150 
##$TP07= 0
##$TPNAME0= <>
##$TPNAME1= <>
##$TPNAME2= <>
##$TPNAME3= <>
##$TPNAME4= <>
##$TPNAME5= <>
##$TPNAME6= <>
##$TPNAME7= <>
##$TPOAL= (0..7)
0.5 0.5 0.5 0.5 0.5 0.5 0.5 0.5 
##$TPOFFS= (0..7)
0 0 0 0 0 0 0 0 
##$TUNHIN= 0
##$TUNHOUT= 0
##$TUNXOUT= 0
##$USERA1= <user>
##$USERA2= <user>
##$USERA3= <user>
##$USERA4= <user>
##$USERA5= <user>
##$V9= 5
##$VALIST= <valist>
##$VCLIST= <CCCCCCCCCCCCCCC>
##$VD= 0
##$VDLIST= <DDDDDDDDDDDDDDD>
##$VPLIST= <PPPPPPPPPPPPPPP>
##$VTLIST= <TTTTTTTTTTTTTTT>
##$WBST= 1024
##$WBSW= 4
##$XGAIN= (0..3)
0 0 0 0 
##$XL= 0
##$YL= 0
##$YMAX_a= 577823
##$YMIN_a= -862610
##$ZGOPTNS= <>
##$ZL1= 120
##$ZL2= 120
##$ZL3= 120
##$ZL4= 120
##$ABSF1= 16.522
##$ABSF2= -4.171173
##$ABSG= 5
##$ABSL= 3
##$ALPHA= 0
##$AQORDER= 0
##$ASSFAC= 0
##$ASSFACI= 0
##$ASSFACX= 0
##$ASSWID= 0
##$AUNMP= <proc_1d>
##$AZFE= 0.1
##$AZFW= 0.1
##$BCFW= 0
##$BC_mod= 0
##$BYTORDP= 0
##$COROFFS= 0
##$CY= 12.5
##$DATMOD= 1
##$DC= 0
##$DFILT= <>
##$DTYPP= 0
##$F1P= 14.0000005364418
##$F2P= -0.99999901652339
##$FCOR= 0.5
##$FTSIZE= 32768
##$FT_mod= 6
##$GAMMA= 0
##$GB= 0
##$INTBC= 1
##$INTSCL= 1
##$ISEN= 128
##$LB= 0.3
##$LEV0= 0
##$LPBIN= 0
##$MAXI= 10000
##$MC2= 0
##$MEAN= 0
##$ME_mod= 0
##$MI= 0
##$NCOEF= 0
##$NC_proc= -3
##$NLEV= 6
##$NOISF1= 0
##$NOISF2= 0
##$NSP= 0
##$NTH_PI= 0
##$NZP= 0
##$OFFSET= 16.522
##$PC= 1
##$PHC0= -81.89809
##$PHC1= 4.012265
##$PH_mod= 1
##$PKNL= yes
##$PPARMOD= 0
##$PSCAL= 4
##$PSIGN= 0
##$REVERSE= no
##$SF= 250.13
##$SI= 32768
##$SIGF1= 0
##$SIGF2= 0
##$SINO= 400
##$SIOLD= 32768
##$SREGLST= <1H.CDCl3>
##$SSB= 0
##$STSI= 32768
##$STSR= 0
##$SW_p= 5175.98343685301
##$SYMM= 0
##$S_DEV= 0
##$TDeff= 65536
##$TDoff= 0
##$TI= <Analysis number 999999
Compound Code 99
Book Reference 9
Project Code 9>
##$TILT= no
##$TM1= 0
##$TM2= 0
##$TOPLEV= 0
##$USERP1= <user>
##$USERP2= <user>
##$USERP3= <user>
##$USERP4= <user>
##$USERP5= <user>
##$WDW= 1
##$XDIM= 32768
##$YMAX_p= 432507472
##$YMIN_p= -721198
$$ End of Bruker specific parameters
$$ ---------------------------------
##NTUPLES= NMR SPECTRUM
##VAR_NAME=  FREQUENCY,     SPECTRUM/REAL,   SPECTRUM/IMAG
##SYMBOL=    X,             R,               I
##VAR_TYPE=  INDEPENDENT,   DEPENDENT,       DEPENDENT
##VAR_FORM=  AFFN,          ASDF,            ASDF
##VAR_DIM=   32768,         32768,           32768
##UNITS=     HZ,            ARBITRARY UNITS, ARBITRARY UNITS
##FACTOR=    0.157963299565203, 1,           1
##FIRST=     4132.6476996994, 0,             0
##LAST=      -1043.33573715361, 0,           0
##MIN=       -1043.33573715361, -721198,     0
##MAX=       4132.6476996994, 432507472,     0
$$ Real data points
##PAGE= N=1
##DATA TABLE= (X++(R..R)), XYDATA
$$ [...]
16365b6244k537m55N060J9442M437M05l216k856J2768o09j5879k435N171O670
16351b78O903K027K603j7082j4085j3213m977M719J1554J5655n038o600R428N612
16337b772N626K490l259p85l302O677J6235q40K486r870j1853J038Q261r151j0719
16322i738O817j0511n826m124J6703P819N891j3845P80K018J1296P12J739o513
16308C218j2490L594K9588j594j3756k2902k898N948L917M433k527N64j0218l056
16294a8179Q408j1704K28R697J0451j094l51J1227N583j2949j0687J0427M216
16281E273n276J911l38N79J440l440j5462N154N192K080o803O322J3534q516j1644
16266i994K398L387K013j4878m721N697P16J620J4824P832q383j1445q28J4645
$$ y = [-26244, -28781, -29236, -24176, -4734, -297, 108, -3108, -5964, 6804, 6195, -9684, -12119, -6948, -278, 6625, 8652, 11255, -5827, -19912, -33125, -38102, -33383, -21829, -6174, -11212, -17812, -8384, -2772, 2854, 5344, 2085, 1300, -2002, 4675, 20910, 20070, 22556, 12686, 833, 1871, 10132, 981, -9738, -2921, -13432, -19258, -23382, -6679, 1140, 7031, -6814, -6034, -4016, 7280, 7992, 9731, 3218, -9272, -5678, 23910, 22316, 8560, -14342, -17240, -11292, -7375, -2942, -5469, -4905, -15123, -18179, -9771, -21475, -21247, -11550, -1099, -2193, -2544, 8683, 14266, 1317, -9370, 1057, 5273, -3, 1908, 1570, 2149, 3589, 149, -15313, -10159, -4967, -2887, -9690, -3368, 10166, 1650, -9994, -7596, -4209, -2196, -17074, -21795, -16098, -15382, -13762, 1062, 8894, 511, -10934, -11762, 2883]
16252B883K308r411l673R25K303L21L319j0662R252k243j6175p727K637M531J2949
16237h463J938m385o926k519J3587P688p425L119M815p385n004q714p90K749r845
16222b7560j546p65J126J603q705j285K7130J2377r823l654K450M962n667k5684
16208c5041o476P316J5199J0655J665J215N392k735j6120j412P676K282j0414
16195b0798q753L199J4635n390n372O864M540o566j826p161J3P344J621J0098
16181g552l039n09j341J538j401j5186q83N47L194l167Q717M038O160r987j3177
16166c2048R487r30l163L395K780r343o823K286q21J0576p259K020n82Q979P138
16151a4308J6521J1828n919r247k695N488j687j434q600l607j1336J4377L269
$$ y = [2883, 5191, -4220, -7893, -6968, -4665, -4344, -1025, -11687, -2435, -4678, -20853, -28580, -25943, -21412, -8463, -6525, -10910, -17836, -20355, -6768, 920, -6505, -3386, 1429, -5956, -10960, -19674, -20464, -17715, -27560, -29106, -29871, -28745, -27142, -35847, -37132, -10002, 2375, -7448, -11102, -8652, -3690, -9357, -35041, -41517, -34201, -19002, -8347, -6682, -5467, -75, -2810, -18930, -20342, -12666, -10384, -20798, -29551, -26352, -11717, -17107, -22479, -15615, -11075, -17641, -19467, -26628, -26615, -19271, -17650, -7552, -10591, -11100, -12441, -10903, -12304, -27490, -28373, -27826, -24632, -27799, -19082, -15044, -8884, -18871, -32048, -22561, -23491, -26654, -23259, -20479, -29822, -36645, -34359, -35180, -24604, -31863, -29843, -30425, -21446, -14308, 2213, 14041, 8122, -1125, -3820, 1668, -19, -1453, -10053, -13660, -24996, -10619, -7350]
16138g350J381j0649j4028p87J1804r598O274j3087o748J217k642k109K0803L317
16124b2202J43l46j025l700M298r049M322K0182J4663q57j150j277j4262O289
16110c971k722j1969L554N435p223L945O483K135j795L243O967m720o922j0072
16096a7632l338M353J205l933o583j260o92O44K829J5707O737J2051Q748j216
16082A7620n753j482j2512J50P296J470j32k555J6112j272j7106k2237m678K5157
16068G8K250j4066R921J1516K0012j7381j5127k1857j0333J4742J8287p852q634
16055a8444J738m946k333J5653J1767p781j3678N243R878L020K945o851m407o51
16041h847j744m240N130j4754j1228K659R080J4250K352k130J1024J3036j5944
$$ y = [-7350, -5969, -16618, -30646, -31433, -19629, -29227, -22953, -36040, -42788, -41571, -44213, -46322, -25519, -22202, -22059, -22405, -23430, -27130, -22832, -31881, -27559, -7377, 7286, 6429, 5279, 4002, -10260, -3971, -6693, -18662, -15108, -9673, -16896, -12951, -6468, -4333, -6128, -2885, 4082, -638, -7560, -17632, -20970, -16617, -15412, -19345, -25928, -27188, -27880, -27236, -24407, -8700, -1963, 10088, 18836, 17620, 11867, 10385, -2127, -1977, 5319, 6789, 6657, 4102, 20214, 18942, 1836, -20401, -25079, 78, 2328, -11738, -1817, 9699, 29711, 12330, -2797, -24654, -34987, -20245, -1958, -9810, -18444, -16706, -21652, -23985, -8332, 3435, -4346, -18024, -12781, -2903, 117, 3062, -3789, -8196, -8847, -10591, -14831, -9701, -24455, -35683, -33024, -23944, -9694, -7342, -9472, 1552, 14588, -1356]
16028a356k1204m855K000P506R448O288p654j0014j911J1686J3367j17j301j2601
16014a0718n962L744R059J1029J2316m043j3014n092m284o438N185J2280r315
16001e253M770K826J268L722n689m934j2546j0269k305j0166n282J2613J6229
15988a5016N941M468N797R911K008m155j6318r688k222r382M886L301N1k664M108
15973a8974O789o82j2201n665O781P597O164j2868o492J2760q92P479J0165m248
15959d287J759q587q423n970m666L397P176J4463J2221K135j2130j8370o730O110
15945b1902J1503M168n088J0417j0131j401N498l944j0945m302R437J5380J1192
15932I882q524r690p976N971m09j631O31J705L789J396j0802l663M611j0031l670
$$ y = [-1356, -22560, -27415, -25415, -17909, -8461, -2173, -9827, -19841, -21752, -10066, 3301, 3184, 1883, -10718, -16680, -12936, -3877, 7152, 19468, 15425, 2411, -2681, -6965, -13403, -8218, 4062, -5253, -483, 2343, 3611, 7333, 1644, -3290, -15836, -26105, -28410, -38576, -43858, -31245, -15016, -9075, -4607, 1190, 11101, 13109, 8954, -7364, -17052, -19274, -28656, -23770, -20469, -20418, -23082, -18974, -12185, -12867, -25068, -30733, -23952, -16355, -10191, -23059, -29551, -16791, -17683, -10204, -39, -4287, -2528, -11115, -19538, -25508, -30174, -26777, -19601, -5138, 7083, 9218, -2912, -21282, -28012, -21902, -10399, -6231, -11319, -902, -11033, -12434, -6936, -10880, -21825, -26127, -16690, -1310, 9882, 1358, -8332, -16308, -10337, -10746, -12377, -11746, -10041, -6252, -4856, -15658, -19321, -14710, -24741, -28411]
15917b8411K403P752R023L058K488q441J23L993N465p970L792L236J088p755p235
15902a7391k041q038J0202Q136K681J436j69N159M844J3321n768j5032K7J6903
15888A4270k520l350p778k979k1236k87J0376Q603o67p54j0256n380L184P632
15874a1142m252o703M914R227O77j9150K377K343M831J2067J1043m405r60J161
15860B028n750Q437J959k116p888L831r76j2730k165N510m85J3514j2863r101
15846a8795l270J1865Q125m9J8088n543j4569j5357O94N511O999l193m336N778
15832h052N793M935j1281j4284n593J135Q339J1867J1427m468p30q607j773k594
15818a3886J586J5420J0036N514r460j2419o319o231N487O696m727o860L864o169
$$ y = [-28411, -26008, -18256, -9233, -6175, -3687, -12128, -12005, -8012, -2547, -10517, -6725, -3489, -2401, -10156, -17391, -19432, -27470, -17268, -9132, -6451, -5015, -5184, -25, 4819, 18140, 12372, -2660, -2633, 14270, 11750, 8400, 622, -2357, -23593, -23880, -13504, -4901, -5568, -6322, -16578, -21958, -18774, -11142, -15394, -22097, -17183, -7956, -7279, -26429, -24052, -21709, -16878, -4811, 6232, 1827, 867, 2028, -3722, 4715, 6674, 4558, -3330, 501, -475, -13205, -15370, -9860, -10345, 3169, -9694, -18795, -22065, -10200, -2075, -2124, 15964, 10421, -4148, -19505, -18811, -13300, -6301, -9494, -13830, -8052, -2259, 2676, -8605, -22889, -28482, -27347, -19008, -7141, 4286, -182, -912, -9519, -11292, -13886, -12300, 3120, 13156, 18670, 9210, -3209, -9528, -15759, -10272, -3576, -8303, -15163, -11299, -17468]
15804a7468R860Q732M361k401N353n054m495o307n880N2R91m372j9381r03R593
15789b7319K455R224Q712J695M79m664m434m062N585O809K551M913j3050O336
15775d770Q148L469M556l101o719j0743J1620J2264n399m494M618O469j5245j0967
15761a0294o7k016o855n056O184N154p048j6745O039J0247K730j549O810K347
15747a0119Q869l089R52k627K533M623L391Q56j0441q260K262Q796Q841q274J398
15732b89q232r458p807P518Q033J771L739J2754J834k129n042O705o394m631R867
15717H239J0376O726q015j5144L870J5148K913k911k264j5658j2133J24j792J655
15703h866l711k438Q867M838J930J072o624L510r22k085j660L456L588o635K42
$$ y = [-17468, -7608, 1124, 5485, 3084, 8437, 3383, -1112, -7419, -13299, -13247, -12256, -16628, -36009, -36912, -27319, -24864, -15640, -6928, -5233, -4754, -9418, -13852, -17914, -12329, -5520, -2969, 1944, -11106, -4770, 3378, 6847, 11403, 8302, 1583, -9160, 2460, 14724, 9325, 4831, 9449, 15918, 673, -10294, -10361, -12377, -19232, -24288, -18104, -12950, -19998, -36743, -30704, -20457, -17727, -19276, -12466, -10119, -1250, -4339, -3387, -6014, -3481, 1142, 4533, 5389, -5052, -13312, -11050, -2254, 6587, -1687, -289, -8521, -17979, -25786, -18268, -10235, -8464, -4725, 8029, 9863, 7734, 2692, 9397, 3003, -1628, 8239, 18615, 25341, 17326, 2182, 6052, 21200, 24113, 21202, 18938, 3280, -8853, -8729, -10521, -8866, -12577, -15015, -6148, -1310, 620, 1692, -4932, -1422, -2344, -4429, -6089, -2633, 955, -5680, -5438]
15688e438l105o893Q908O801q661J952k828M83m471J839r863m979J734p16M572
15673b0665l077j2124J3156k004j0974m387K29J0825J4558J9510l261j920n808
15660e942p425N761N522N826k814k216J072O719K59o893j28J969Q68k605p899
15645g926r447r561q90J559J2912Q235L555j1896k837j702O251O093j0084o813
15631b2551Q771J008O230R637L804j5852L611P790n767O758j343J711P184j0498
15617D93j0844l444M360K991L45Jp341J244k856O664o029K752J533k225o181M606
15601a3931L848j9183L056J9266K463j6560m376O53k455N7J1503L728K601j6302
15587b5632m74m557o888M434J7603k486N517J2185R28p165J1j2420j8293J976
$$ y = [-5438, -8543, -15436, -6528, 273, -8388, -6436, -9264, -8781, -13252, -11413, -21276, -26255, -24521, -25237, -20665, -23742, -35866, -22710, -24714, -35688, -40075, -39846, -29021, -14463, 5047, 1786, -134, -5942, -13367, -7606, -2084, 3742, 928, -1288, -216, 6503, 6762, -131, -259, 1710, 2578, -27, -7926, -17373, -26934, -27824, -26265, -13353, -5118, -1563, -13459, -16296, -17998, -11747, -5654, -15738, -22551, -13780, -12772, -6542, 3095, 6899, -8953, -5342, 2448, -3319, 3439, 2096, 3807, 10991, 493, -10351, -13795, -9435, -6444, -6099, -6098, -13439, -12195, -15051, -8387, -14416, -11664, -10131, -12356, -18537, -13931, -10083, -29266, -26210, -6944, -4481, -21041, -25417, -24764, -27219, -27162, -15659, -11931, -9330, -25632, -26106, -30663, -37551, -33117, -15514, -18000, -12483, -298, 630, -6535, -6524, -18944, -37237, -35261]
15573c5261J1687J1897m70N986J0918l197l205q285N420Q387P568J0362J072q001
15559A4878O72l199j2098l097M019J2566J4190j12n140o123K260q603j8428r42
15545i157P468M867o421M923j2484p450J1415J367J839j2286n698O596n47k851
15531a8419l746j751L20k364k137J5566O884n531j1692j47J1956K721o550k359
15517a7249o031r055J2496M13Q796J930M678o190j1125J4345J0336P270q023p307
15503d716o815l169j0590J445R425K0225j357l996k088j2908n473R390r142o405
15489b6174p3J8946O436O47M047p982K568N874L186J575j3737L365O020j167j0654
15474g123k770j153O538j921n391J0K184QO19Q062Q491j6322k809j129j824J8292
$$ y = [-35261, -23574, -11677, -12147, -6161, 4757, 1560, -1645, -9930, -4510, 3877, 11445, 21807, 22879, 14878, 15550, 12351, 253, -2844, 1175, 13741, 27931, 27819, 22679, 16556, 18816, 10213, -8215, -9157, -1689, 3178, -3243, 1680, -10804, -18254, -6839, -5472, -3633, -15919, -21617, -15021, -15568, -18419, -22165, -23916, -23596, -25960, -28097, -12531, -5647, -11178, -22870, -23017, -11061, -8340, -14890, -17249, -23280, -32335, -19839, -19426, -10630, -8700, -4022, -10212, -21337, -6992, 3344, 10614, 2591, -4716, -11531, -14700, -25290, -23845, -14420, 5805, 4448, 452, -1636, -14544, -20017, -10627, -19769, -26174, -26247, -7301, -865, -218, 3829, -4153, -1585, 4289, 7475, 9050, -4687, -1322, 4698, 3531, -7123, -9893, -11046, -4508, -6429, -11820, -11810, -9626, -9618, -8999, -937, 7554, -8768, -11577, -12706, -14530, 3762]
15458C762p278j1870J2008O399k211J1576l769O86o87o850j1698o370J0936O280
15444I14L887r686l337l044r840K140J7762K3343p899j8818r601q535M616R93
15430a7105P298n896l035k059N360J5317O197j0104j5826m136L751J377k832n391
15416b7084K391l876J1M788M949k591J537j0079j755R361L263l422J4260P728
15402e19q983K164o85J0056j882j4567k0512l094M815j457M152J5053O322L821
15388e316J900R375j191j917Q610j757j3118n12r37j802K323R550j809j5005R147
15373b459R992R98n025n341r144j1847j1236J0816j7k921M20L2j983j069m999
15358c3783J1267L862J1330j1535j9895m141Q425R711k677M834R866J480p793
$$ y = [3762, -3516, -15386, -3378, 3021, 810, 12386, 8617, 9303, 8616, 1766, -9932, -16302, -5366, 914, 4801, -4885, -8222, -11266, -21106, -18966, -1204, 22139, 14240, -4578, -14179, -22714, -18098, -17105, -9807, -15703, -18738, -20797, -15437, -120, 6077, -4027, -19853, -23989, -20238, -18861, -21693, -27084, -24693, -28569, -28558, -23770, -18821, -21412, -19875, -29954, -31709, -22348, -19085, -22507, -8247, -519, -9502, -7338, -8023, 2033, 151, -14416, -34928, -38022, -33207, -34664, -30512, -15459, -9137, -5316, -3416, 5959, 4768, 2851, 11461, 9704, -3414, -3926, -4863, -6665, -4342, 5208, 3399, -11606, -2459, 7533, 8531, 3506, -1835, -10979, -22826, -34062, -23246, -23263, -26184, -25764, -25732, -27715, -28784, -33783, -22516, -18654, -7324, -18859, -38754, -42895, -34470, -24759, -27436, -22602, -12736, -11256, -19049]
15345a9049Q452o756j1791J2895J1507O933Q642k875j1388k0503Q273J4581J0793
15332I714L932j8256n927m285q890M951k619k184P676O459Q098J2758j565M234
15318A4096l884p903o31j0884p691L444K280J0597j2371N7R575J3361m901O4j739
15303C470m717n509o151R61M059j347M24J85r835J710Q528K7804J810k9099j8237
15288b5944p447N121J3343n417j0236R299P039m909l129K474j603J211J092N156
15274a3950Q403L931O375j0313k1192j270J1023J6211N6j825k51R756r94R20n787
15259A093K17j4387j4027J2966m8o998P861Q40o636K707Q237j617l787n571q379
15244b7529j1105K271J1379J0748Q439O835Q051P64m092P848k811n954n937o852
$$ y = [-19049, -10597, -17353, -29144, -16249, -4742, 2191, 10833, 7958, -3430, -23933, -15660, -1079, 9714, 13646, -4610, -10537, -14822, -23712, -18761, -21380, -23564, -15888, -9429, -1331, 11427, 9862, 14096, 10212, 2309, 1678, -9206, -16897, -13453, -11173, -576, -12947, -12890, -3315, 10046, 5145, 5209, 3470, -1247, -6756, -12907, -11946, -7887, -9234, -8810, -8625, -18460, -16750, -8222, 19582, 21392, -7707, -25944, -33391, -28270, -14927, -20344, -30580, -21281, -14242, -19151, -22280, -19806, -21409, -20198, -19106, -13950, -5547, -1616, 4759, -5554, -26746, -28016, -16993, -782, -726, -2551, -2802, 6954, 5960, 6880, 1093, 1310, -13077, -27104, -14138, -14186, -21184, -13323, -12483, -19119, -16412, -8175, -9792, -13579, -19150, -27529, -38634, -36363, -24984, -14236, -5797, 1038, 9089, 9853, 5761, 13609, 10798, 4844, -1093, -7945]
15230g945N435q48j5186m572J1543j4913o354l074P765J0749n889r07j3085j514
15216c8795J5570L260k488q293J0443J7639L528m881L551p898M735J2332J329
15203A0032j0522p197O307j691q202r871m101k604J7541O692j2645p426l580J0565
15189a6702L157K845R540P794r045m357r663j0847r898N092P004N969n830J0039
15175a4902Q881l837k938Q650m168j0195K05J6980K718j4692M424P416m46l128
15161e032n486k0199l73M086J5952J5929k635j1265M02J0032o711p943k055O119
15147i179J1319M461j5013j1827M727P937N335O598j715r184j1730k262J833n8
15133a8758J896O652J3806j601o328M558n94L500J92o847M122J54K6N446J8464
$$ y = [-7945, -2510, -3358, -18544, -23116, -11573, -26486, -32840, -35914, -28149, -17400, -23289, -24196, -37281, -38795, -23225, -19965, -22453, -30746, -20303, -2664, 864, -4017, -466, -8364, -3629, 8703, 10032, -490, -7687, -1380, -3071, -11273, -21144, -25245, -27849, -10308, -3616, -16261, -23687, -27267, -16702, -13545, -10700, -1160, 6634, -2411, -6768, -16431, -27278, -37176, -32084, -25080, -19111, -24941, -14902, -6021, -9858, -12796, -4146, -8314, -18509, -18304, -1324, 1394, -13298, -8874, -1458, -1904, -5032, -10518, -30717, -31090, -27004, -11052, 4877, 2242, -9023, -8621, 1411, -5300, -13243, -15298, -9179, 2140, 6601, -8412, -20239, -15512, -7575, -2240, 4358, 2643, -6541, -18271, -20533, -18700, -18758, -16862, -10210, 3596, 1995, -4333, 225, -369, 3131, 3323, -3524, 598, 752, 778, 6224, 24688]
15118B4688J6504q046r499j749k74k93j3767p247j436q599J0952R963k224J576
15104A0549M741R128o522j4167K96l556j8768n561l190J3319O333n74p527o480
15090b1979m218O627J9104j862n145P695O859J487N024r57j6174l297R781j0236
15076g291o55J651J3563J889L697o722J0390j3644k381L450J890J281M092j7873
15062f663o049J4218n169l815j7974o771J6415K2441P884j3596k622J1999L481
15049A3779j3896j2024n360Q174J0337L281n429l991L454J882R07j3191j1998
15036b4075K0999m834j5380n181R471Q099N448N618O284N25j3395q43j1500R350
15022i414K0719J372K898j7533k818P130K759o698j0631J59R997L16q266k954
$$ y = [24688, 41192, 33146, 23647, 21898, 21624, 21331, 7564, 317, -1119, -9718, 1234, 11197, 8973, 10549, 15290, 24418, 17896, 3729, 4025, 469, -18299, -23860, -27050, -13731, -7398, -7972, -15499, -21979, -26197, -19570, -466, -2328, -7473, 222, 7081, 8568, 13592, 12635, -3539, -6836, 2945, -7291, -7946, -6295, 7268, 9157, 12854, 6132, 16522, 2878, 497, 3947, 5837, 7118, 11210, -6663, -12712, 1506, -3663, -7478, -25452, -32223, -15808, 6633, 14517, 921, -1701, 10298, 13779, -117, -12141, -17501, -9327, 1010, 4291, -1138, -5129, -1675, 207, 1114, -12077, -24075, -3076, -7910, -23290, -28471, -19000, -10901, -5453, 165, 6449, 6974, -6421, -7264, -18764, -9414, 11305, 12677, 15575, -1958, -4776, 2354, 5113, -1585, -12216, -12057, -2060, -1744, -10010, -12964]
15008a2964o845K511M206j737l040k891j067m924K483J2959K2321n034j9424R81
14994a2465L905k283L849l384N278p597q798P026J8275M239K316n307j0762r822
14980a5530n567J1011m813j1514J1353K1120q282J062M510k815l809O781l33O39
14966C813N442m431j481K349O42K214l96p263q895l414L054r643R219M434L400
14951i56l32k348L342K725j2238o939j306m080j581K699J2523J2381n960n749
14937g819j4755K766Q855L438J0530J1378J976o232p919j3093P471L337m046l159
14923g272n768L529k114K691Q471J1883m239K584J1155j1059k0874j333O052k756
14909i050p958J1721R540j6985j6927L882L22M305M338M916J6317K501n828k24
$$ y = [-12964, -19809, -17298, -13092, -14829, -17869, -20760, -21827, -26751, -24268, -11309, 11012, 5978, -13446, -12465, -8560, -10843, -6994, -10378, -5100, -12697, -21495, -14469, 3806, 8045, 10361, 5054, -5708, -15530, -21097, -10086, -14899, -26413, -15060, 6060, -2222, -1160, 3350, 535, -3274, 3507, 3174, 3813, 9255, 4824, 3343, 5692, 6334, 8548, 8152, 889, -8006, -11420, -8366, -18009, -8790, -4356, -956, -1288, -3636, -294, 2431, -9807, -16746, -18052, -22132, -23713, -21014, -8491, 3890, -2070, -7819, -22574, -19808, -10953, -7515, 3015, 14393, 16369, 10137, 2218, -10875, -3404, -67, -4113, -7272, -13040, -9511, -11625, -8934, -463, 11420, 7181, 9765, 20920, 9861, -11013, -12346, -6294, -9050, -17008, -5287, 4253, -12732, -29659, -25777, -25455, -21150, -16812, -11896, 4421, 6922, 1094, 870]
14895H70J2423R404J4869j6534q612M82r90k381m057L123J1j6269l697O860J0707
14880F209k992L431m406m429p242q436M425p881j0173J1140K698o134L663P155
14866a2972J2358J3216K98j7649q083J1113J5724q806j7116J4538m21q520O325
14853EK1837N818N15j628l358j7769l37L930m977Q349P492N316m705k4962m37
14838d911R039p603j0761k3343M789J1204O024P198P257O843n478K987J0189m2
14824A3392n259j4756p958Q36j488L41j2171l317R508J0604J9534L985j4029K795
14810B017N357N383N466m633j581k041j3988o839N4P988P519J0739p569k826K983
14795H029J271K0228m021j4005j965n796j161O333m599o314m809j7420m048N008
$$ y = [870, 13293, 22697, 37566, 21032, 12420, 12902, 11912, 9531, 5474, 8597, 8608, -7661, -11358, -4498, 6209, 3217, 6648, 2242, -2187, -9429, -17865, -13440, -21321, -31494, -20354, -17656, -23790, -20127, -12972, -614, 12602, 12900, -4749, -12832, -1719, 14005, 5199, -11917, 2621, 2200, -6320, 5, 21842, 27660, 28175, 26547, 23189, 5420, 5083, 9013, 4036, 12385, 19877, 25193, 20488, -4474, -4911, 4128, -3475, -14236, -37579, -32790, -21586, -15562, -8364, -1107, 5736, 258, 3245, 13434, 13392, 8133, -6623, -14581, -13745, -15233, -14892, -27063, -30380, -20872, -10268, 9266, 13251, -778, 2017, 7374, 12757, 18223, 13590, 12009, 9968, -4020, -10859, -10805, -2817, 4702, 15441, 7872, 5046, 8029, 9300, 29528, 25507, 11502, 9537, 3741, 2580, 8913, 4314, -2000, -6809, -24229, -28277, -23269]
14781b3269J5073N969l07P131l866m389o063K007J0394o048j3794j13O232K287
14767h756P488l371L850Q535j58M779n482o893j3895q423R705N257J1272R280
14753A3188q180o413j2957K129j31J2501R55p294J539J2056J438m936l536j0527
14739a0168m56J0211j929K295M975J541P918K818N073m615Q241m14q718q631j0665
14724b524n508q021n975K57N561j1822J0393J2379P68n965q91J1261Q619k090
14710F442Q553j312n122m231m080J098J541j3618L634o65p384R714P108J0622
14696A2300k127q129O013j3545j680Q095L60o158K359j997P841n305o48p954Q233
14681b342K721K625r159k552k733J2059Q907q385j0425K324J614l087R937M084
$$ y = [-23269, -8196, -2227, -2534, 4597, 731, -3658, -9721, -7714, 2680, -3368, -17162, -17275, -11043, -8756, -1268, -4639, -789, 7746, 7588, 12367, 6885, -8, -13903, -22326, -12621, -7364, 3908, 13188, 5008, -1405, -14362, -12233, -12364, 137, 1092, -6202, -4663, 7393, 8831, 3895, 359, -10168, -10624, -413, -2342, -47, 4928, 6469, 14387, 17205, 22278, 17663, 25904, 25490, 16772, 8141, -2524, -8032, -16053, -22028, -21771, -16210, -28032, -17639, -5260, -4492, -10457, -11348, -87, 8532, 6442, 14995, 13683, 8561, 4330, 250, 1348, 2889, -10729, -7095, -7760, -15144, -5430, 1678, 12300, 10173, 2044, 8057, -5488, -7168, 927, 1287, -4871, -2512, -4509, 3332, -1973, -2621, -10575, -2342, 379, 3004, -6155, -8707, -11440, 619, 9526, 1141, -9284, -6960, -5346, -8433, 1504, 5588]
14667E588l427k019M541J469j567J4967r357r667K587q94r908R801M489K965p428
14652B140l083J4232o342r084o068Q763O008p942j2887O459N995q454o470J4675
14638b058M203l958j636Q510M788L914j5441p899J1695o4p463n215r459o280k177
14623b8540O252J352J0364J1368L967m182r307r26J2961J415j8999q178L605j260
14609b0108J2230J0706O705J0619J085j2700j3513l910M172N636L708J3777L138
14596B1545k537K499J0762P424j02p680j7405j1916k593J1565r07K769J2692m431
14582B1685j8757m185l550j429M289N707J118o585J427J496m873P510J894k0341
14568a4594J651j55m608J9196P649q244o342k50k93m56P372J6116P61o251n853
$$ y = [5588, 2161, 142, 4683, 6152, 4585, 19552, 10195, 528, 3115, 2221, -7687, 2114, 6603, 9568, 2140, -943, 13289, 6947, -2137, -8205, 558, 6566, -1376, -14263, -7804, -1809, -10263, -16733, -2058, 2145, -1813, -3449, 5061, 9849, 13763, -1678, -9577, 2118, 2054, -5409, -10624, -20083, -26363, -28540, -22288, -20936, -10572, 796, 4763, 581, -8726, -9652, 3309, 4724, -14275, -22453, -18848, -20108, -7878, 2828, 9533, 20152, 21237, 8537, -4976, -8886, -4714, 922, 4630, 18407, 21545, 19008, 21507, 32269, 39693, 39591, 31911, 14506, 2590, -3, 11562, 10655, 13424, 26116, 21685, 2928, -1257, -4807, -6236, -1947, 3760, 4878, -1707, -280, 1216, -3657, 3853, 5747, -14594, -12943, -13098, -17706, 1490, 9139, 895, -5447, -5697, -5990, -6446, 926, 17042, 17803, 11552, 5699]
14553E699r504L86m698j3395L739Q659K185Q03J2836M296k629J5620J1307P942
14539D3246R81j6252j3250M761p723r304l59J6936j001j560M651r36l818o970
14525I402P547j5136m974Q708n252p688q531N829J2679M817O413p639n057m390
14511c272r519J5962J1112J774m522j0656p141o186j0506M590K1863N768K154
14498A1421l13l472l32j871o361K425P119r29P940l630k077k285K114j700r250
14483a201O172P233J760O255R84k373p800l438l549J5336J0937l971j9821J061
14469G585j4492j324J1662L936R926j1616j1638L292j050r70k3758l986N500p35
14455b7668O361J1832J3907n766L990J903j0476M405J3753n39p567j2064k643
$$ y = [5699, -3805, -3419, -8117, -21512, -17773, -9114, -6929, -6126, 6710, 11006, 8377, 23997, 35304, 43246, 44227, 27975, 14725, 19486, 11763, 2459, 2100, 19036, 18035, 16475, 21126, 20190, 16372, 9402, 16949, 1813, -3161, 5547, 295, -7393, -15924, -10095, 2584, 7401, 13814, 6175, 1118, -3272, -12791, 3171, 14283, 16057, 11535, 879, -6262, -12448, -22954, -18364, 3499, 9267, 11421, 11108, 7636, 7304, 5433, -928, 1497, 8616, 7687, 15627, 11997, 9920, 7635, 9749, 8049, -1201, 4971, 12204, 13964, 20219, 21203, 18830, 11030, 7592, 4043, 19379, 30316, 26345, 6524, 7585, -6907, -8231, 3431, 7367, 17293, 5677, -5961, -2669, -3719, -4689, -28447, -32433, -26933, -27668, -21307, -9475, 4432, -1334, 2656, 4559, -5917, -1512, 12241, 11702, 4135, -7929, -10572]
14442a0572J6771Q296j6971L559n293Q320R31J2269L544j7766j6826l254J0851
14429f141J966m93p034m361L528R836L928k310o303L584m186n444N672N500N472
14414C214o03O162Q429J818o587J074N529o915R64K895j1035k249O253j246q880
14399a177j845N201Q642r474n59k55p344L288M026P262r322R865K625O73k579
14384I027Q618l29j0755j57R326N694K000m234j568R50jj8789J3142l500j1203
14369a779N874J0206P192l824k1330L055l468j554M980N943J000r339n850p063
14355a5957R219J3434n447l831j2209J5350l37J430k024Q82q109p155J0294J3698
14341I238r707M444R574J2939N912j5892q597Q932N578J704R1L112l068l701j045
$$ y = [-10572, 6199, 14495, -2476, 1083, -4210, 4110, 5041, 17310, 20854, 3088, -13738, -16992, -6141, -4175, -4668, -11702, -16063, -12535, -2699, 1229, -1081, -7384, -3800, -7986, -13430, -7758, -2258, 3214, 2611, 8773, 17202, 19020, 12433, 13507, 19036, 12121, 13085, 15980, 4945, 2696, 8949, 7703, -1177, -3022, 2179, 10821, 1347, 788, 533, -6811, -3523, 503, 7765, -1557, 8308, 10933, 11606, 9027, 17645, 17316, 6561, 6404, 15730, 21424, 23424, 19190, 17622, 18572, 18571, -218, 12924, 9424, -1779, 4095, 14301, 21493, 17669, -3661, -606, -4074, -5628, -648, 5295, 6295, -3044, -8894, -15957, -6738, 6696, 1249, -2582, -14791, 559, 222, 1652, -372, 510, -7599, -14754, -4460, 9238, -469, 3975, 13549, 26488, 32400, 16508, 7911, 16843, 22421, 24125, 24216, 27328, 24260, 20559, 19514]
14326A9514q046j7814j5472J1929J5099O789J573Q432O188j1499q930N885P788
14313B1436L175j5650j1489K467j023O324J4021k987p865p955R00R638J182J143
14299A3317l160O59j0330p907M250N230j253K496J3048Q238N903K151p187q822
14285A6633j6543p200M27k969n227L140K721l64J4777m8r06J1201M540j6102l833
14270B47O604J4595k480j5152m000j9m573K841O330O255K018j4995K475L024P454
14255A0624J5622J33r415j8008k461N980n485N13m185n391q436Q394J6427K751
14241G063n653n012O680P474j992k893L263l790j1661N834j803L733J311n806
14227c252J034N490P691P12l588k231l675j647m771J8361O251o851P513K605n718
$$ y = [19514, 11468, -6346, -21818, -9889, 5210, 11999, 13572, 22004, 28192, 16693, 7763, 13648, 21436, 24611, 8961, -2528, -61, -1084, 5240, 19261, 16274, 8409, 454, 1354, 10992, 12174, 13317, 10157, 10816, 486, -7421, -3171, 2059, 806, 3302, 16350, 24588, 30491, 32642, 25455, 16633, 90, -7110, -6683, -9652, -14879, -11739, -9018, -9382, 5395, 5347, 4441, 15642, 20182, 4080, 247, 6851, 21446, 18966, 3814, -186, -205, -4778, -1937, 4393, 10648, 12666, -2329, 146, 3170, 10624, 26246, 26379, 16964, -1044, -3505, 2475, -3010, -2497, -6682, -12073, -20509, -12115, 4312, 7063, 1410, -3602, 3078, 10552, 8560, 5667, 8930, 5140, -6521, -687, -2490, 1243, 2554, -3252, -2218, 3272, 10963, 11675, 8087, 5856, 2181, 534, -4237, 14124, 20375, 13524, 21037, 23642, 17924]
14212A7924j610m586k503k141k499P189J3551m79j3160q068J187l115N556N493
14198A2739J1047N419j4906o15J5949j2800j093k790J3419J700j7752o709R366
14185A2974J851l616P244M708k699j0346q454m281J0153Q914m576Q068j2375j7440
14171i875M840J1459J9945k014l007j2570j3311J1068o599J398J7362L367L59
14158B2422r378l103l017r817J0262p4r141k20N558O608j1895o070K831J6953
14144A1919o413j0523Q544P664o862K88N18R553J4790k672p354o764r572p005
14130c889l406K905j714j4186j337P709R798J1028Q329m390k564J3413j566o842
14116A3288J567n858j6055k455J0704P591J6658P65k1003j8777n907K267J3618
$$ y = [17924, 16314, 11728, 9225, 7084, 4585, 11774, 25325, 24846, 11686, 3618, 4805, 1690, 7246, 12739, 23786, 29205, 14299, 13684, 29633, 16833, 15740, 12950, 26369, 28069, 10317, 3608, 12974, 14825, 11209, 18453, 23161, 20462, 10116, 1662, -2619, 7534, 16448, 11872, 19940, 7565, -9875, -5035, 6424, 26369, 24355, 21348, 8778, -4533, 6535, -64, 1334, 18696, 22063, 22422, 13044, 9941, 6924, -2893, 7369, 7295, -1846, -2066, 3492, 10100, -1795, -7865, -5034, 11919, 5506, -5017, 3527, 11191, 4329, 4617, 5135, 14688, 29478, 26806, 19452, 12688, 3116, -3889, -7295, -4390, -6104, -20290, -21627, -13918, -4120, 6908, 15237, 10847, 8283, 21696, 20130, 13288, 14855, 8997, -7058, -9513, 1191, 8782, 25440, 26205, 5202, -13575, -19482, -17215, -3597]
14103c597J0111l495Q899K605j3864J696O919q325O988q53K489K308n895L666
14089I652j1251Q833Q534o191q381j0557k791K1982m952j462m151n994P096N250
14075E617N148m860J255N763N001n803R567N466j742M10o20J2420K869l303J1552
14060D8740k863K767j6507l703N549O555m365j3778j270n049Q903J459j3186L179
14046A6431n300m326l470l679O258j571M80j3703K470R486M344J4608R426j0505
14032B0949j867J0667j127j5997J641J5651l543q108o705j6323l744P31M758N015
14018A998j0435J4354J6719K300n320j102l577m031o56O37J6702K723r118k319
14004A8875K66K15R18L084J876L973k116J414J4356J0622j8620m094j0027k296
$$ y = [-3597, 6514, 3019, 11918, 14523, 659, 2355, 9274, 949, 7937, 7084, 9573, 11881, 5986, 9652, -1599, 7234, 15768, 9577, 1196, -9361, -12152, 9830, 4878, 3416, -735, -6729, 367, 5617, 10765, 5905, 7160, 12923, 17924, 12121, 21688, 27154, 25412, 25822, 25202, 37622, 40491, 37188, 48740, 45877, 48644, 32137, 28434, 33983, 40538, 36173, 22395, 21125, 16076, 24979, 26438, 13252, 16431, 11131, 6805, 3335, -344, 5914, 4343, 4823, -8880, -6410, 3076, 7420, 22028, 31454, 20949, 19082, 29749, 28622, 12625, 14266, 29917, 26374, 18266, 11561, -4762, -8506, -7775, -3017, 1998, -8437, 5917, 22636, 24936, 19616, 18514, 14937, 10906, 10250, 10887, 27589, 30312, 21194, 18875, 19141, 19356, 20274, 23358, 25234, 29207, 27091, 28505, 42861, 53483, 34863, 30769, 20742, 18446]
13990A8446r182J259M683n889O941m188k502K7536N004j5740j0470l457j772r640
13976A029J2969k213p375j882N94J0913o95k414J058j4906j437R764L766n434
13962C737m475O782j822Q0R877l406j578J7p438q374O085K3365L726m268q960
13947A3348O243J4475O505j4904q197J6632J0856m553j8929L269J852P752J0023
13934D4372O320L682l208l285k917j5819k9113n009J7266J2996O556j0778r589
13921A1474M836R061j4073O668K3958Q985r776n122k649j1648j4550P289J4267
13908B8720r507j0564R587M610p875R981J447O90J658j276j4781N74N265Q744
13894B7273j911n247p634k105O142K641R025L449l340j4105m099n554L946L140
$$ y = [18446, 9264, 10523, 15206, 9317, 16258, 12070, 9568, 37104, 42108, 26368, 15898, 12441, 10669, 1029, 13998, 11785, 4410, 2528, 3122, 14035, 13340, 10926, 11984, -2922, -4359, 5405, 9171, 3737, -738, 6044, 4222, 4302, 14179, 10773, 9195, 9212, 1774, -6600, -515, 22850, 26576, 22308, 13348, 19591, 34066, 40571, 25667, 17470, 34102, 44958, 40405, 21476, 24745, 26597, 34349, 44372, 50692, 54374, 51166, 47881, 44964, 29145, 32, -4977, 12289, 25285, 31841, 21063, 11474, 16310, 25371, 11298, 17966, 41924, 50909, 41133, 36011, 33362, 21714, 7164, 14453, 28720, 19213, 8649, 18236, 22846, 14971, 24952, 26399, 27089, 28747, 27471, 12690, 13264, 18529, 27273, 25362, 20115, 12481, 10376, 16518, 19159, 28184, 31633, 28293, 14188, 10089, 4535, 8481, 11621]
13880A1621m244o02J2443J524N554J8n793r668k155l798l044J2251N846L530r293
13865A4190L861O701l846j753p486l649P497q44O973o681K556n665J0036K1640
13851D3530P143l678N1O024J273p945r228k096K016M885k203j7454m557J8168
13837C5929j4720j2275K856n01j1217P406J8661q835m306P94J1649P311k791p388
13823B2573N6J0026m754M873Q42p894P473o437j3485Q490L940j1880j4296j8840
13809a9313N798O142J1322K2397N239K838j768q619l792R677M883p537J4894J5988
13795E8149j2389p461j1045k0693k691J1935J46M114J0990j361N19k274n015l203
13781A9721n932J9784q229m661p778J7553K1047J012p093r905j2525K745p59J169
$$ y = [11621, 7377, 6775, 19218, 20742, 26296, 26314, 20521, 10853, 8698, 4900, 1856, 14107, 19953, 23483, 14190, 18051, 24752, 20906, 19153, 11667, 8018, 15515, 14671, 21644, 14963, 17519, 11854, 21890, 43530, 50673, 46995, 47046, 53070, 54343, 46398, 37170, 35074, 37090, 41975, 39772, 22318, 17761, 35929, 21209, 8934, 11790, 11289, 72, 7478, 26139, 17304, 12998, 13792, 25441, 32752, 29961, 22573, 22629, 32655, 27901, 32774, 33616, 25722, 33195, 26758, 13273, 21763, 25703, 13823, -473, -19313, -13515, -7373, 3949, 26346, 31585, 34423, 32655, 24036, 20244, 29921, 34804, 27267, 42161, 58149, 45760, 38299, 27254, 6561, 3870, 15805, 15951, 20065, 31055, 29694, 30213, 27939, 22924, 19721, 13789, 33573, 25344, 20683, 12905, 30458, 51505, 52517, 45424, 35519, 22994, 25739, 24980, 26149]
13767B6149K701k682j241k292n034K858J3838L681o618p040m542m012k041P96
13753A4521J827n523J11K047K702J543R572L095P694M405J967P26l583o981K208
13738C6331p99j332L37l23l279K24K960l909O17o518p84R775M356j377n153j2017
13722A9109P746O063j436n955R816J4928L914p054r029k11o487L671R169J605
13708D5849JJ0457O448j0622j3169j2231j204J0553j987j2064R547J2955m045
13695D0488j559m583R11k829L136J6014O551j3246j108O571J7206K116k6323j1174
13681C2171p605R65o813J3233J5292j35j6206K159l921M187P973k341L33j705
13667C7587p017m795J1626O158L11M327J251J3038n909m393L28k420K78J5286
$$ y = [26149, 28850, 26168, 24927, 22635, 17601, 20459, 34297, 37978, 31360, 24320, 19778, 15766, 13725, 14521, 16348, 10825, 10936, 12983, 15685, 17228, 26800, 29895, 37589, 41994, 43961, 44687, 41104, 34123, 36331, 35532, 34200, 34537, 34214, 30935, 31159, 34119, 30210, 30827, 24309, 23525, 33300, 37656, 36279, 31126, 19109, 26855, 32918, 31482, 25527, 35343, 50271, 54185, 47131, 38102, 37891, 31404, 35075, 44244, 45849, 45850, 56307, 62755, 52133, 38964, 26733, 25529, 36082, 34095, 22031, 31578, 44533, 40488, 38929, 34346, 35257, 32428, 35564, 51578, 58129, 44883, 43775, 50346, 67552, 69668, 43345, 32171, 24566, 25531, 18718, 31951, 47243, 47108, 30902, 33061, 29140, 33327, 41300, 38959, 39292, 37587, 30570, 25775, 37401, 43559, 43870, 48197, 49448, 62486, 56577, 52184, 52512, 50092, 50370, 65656]
13653F5656M254l540j0429j3873j4290o733N242J5242J7662p40l362r47j823M319
13639E6638l1527J587J5690l555j340O795J1807l465j2901j2630M386P283Q67
13626C9635J740K410K191r060J0024j04R35L579l559m34j309J3017K77M299P781
13611G1422R03k156m201o671p045j899j116J2513J5051J1204M125K6396M2221
13598A60747L0783L0377K6850L7526L3898k6156n6047k3439k5053k9331k6373
13587A33782k4620J76J54p587k672j3314k073L689l398J0704M909m532j3737j320
13573H0161J7911J4145M656K954J0954M68J9970K3407K0918K9799M6258O8399
13561C40000Q6062Q6608O5540J6656l9718p1942r0143p2246m3894n1063l7743
$$ y = [65656, 69910, 66370, 55941, 42068, 27778, 21045, 26287, 41529, 59191, 58451, 55089, 54142, 52319, 56638, 25111, 26698, 42388, 38833, 37493, 44288, 56095, 52630, 39729, 27099, 31485, 38768, 39635, 41375, 43785, 45976, 36916, 46940, 46836, 47771, 51350, 47791, 47357, 46048, 59065, 59342, 63641, 71422, 72325, 70169, 65968, 59297, 52252, 50353, 49237, 61750, 76801, 88005, 92130, 118526, 160747, 191530, 221907, 248757, 286283, 320181, 294025, 237978, 214539, 189486, 160155, 133782, 109162, 109338, 109492, 101905, 99233, 85919, 83846, 87535, 84137, 94841, 99750, 95218, 81481, 80161, 98072, 112217, 116873, 119827, 130781, 131249, 151219, 174626, 195544, 225343, 271601, 340000, 426062, 512670, 578210, 594866, 555148, 483206, 393063, 320817, 276923, 225860, 188117]
13550A88117k0676n369j4426m211j0953l10k2111q350m37Q123L666K617r614o224
13536I9842m466m832J5371l61q158P998K0620K8576J4013J4465K6674M0821M1833
13523B92396K8088R458j0963j6498l7550m9755m9098j8846j9274j3957J347J612
13511A16960N040l751j3562n952q391k0607m857j4917q609R597J2087j715l705
13498E7618M472O130K642l232j501K968J3145p469j0153o021O911J0432j108k44
13484G4590p97l481m653p017M739N087j8457k081O971q72m497j307J2390Q513
13470F9128J0698l949j0554L531k110m992j0212p9J0259J2902P409k348o013j5097
13456E8573j4708l443j414m101L26N350k926L168r09J9657O750q204j3002J0991
$$ y = [188117, 167441, 162072, 147646, 143435, 132482, 132172, 110061, 101711, 101274, 109397, 113063, 115680, 106066, 99842, 95376, 90544, 105915, 105554, 97396, 105394, 126014, 154590, 168603, 183068, 209742, 250563, 292396, 320484, 329942, 318979, 302481, 264931, 215176, 166078, 147232, 127958, 114001, 115348, 116960, 122000, 118249, 104687, 98735, 90344, 69737, 64880, 49963, 41354, 50951, 63038, 61323, 57618, 62090, 68220, 70862, 67630, 66129, 69097, 82242, 74773, 64620, 58599, 65510, 75942, 74834, 74590, 73793, 70312, 65659, 58642, 63381, 68468, 50011, 47930, 54901, 54029, 49532, 48225, 60615, 69128, 79826, 75877, 65323, 68854, 66744, 61752, 51540, 51461, 61720, 74622, 82031, 79683, 73670, 58573, 43865, 40422, 39008, 34907, 35233, 40583, 37657, 40825, 39916, 59573, 66323, 58119, 45117, 56108]
13442E6108k676m451n292O790j344o227M834N008k754q365M881M416K973J1175
13428F5076J2785k916l012N22n87K316L616r639J853J12J120q288m889J775j185
13413E8659M739J7720k663j3394l37K281r875k433n378J4480M991O092M911J99
13399G9992p471o531J3655J6069n261j3373k625P480J5385N480j1364p207Q33
13386H5062O98o747r169m533R234k475o339l711k860N111R25p045n196L782m865
13371E1872P784N530J2382K321P559J969M748j652k486j383Q363N121j65l692
13357I8271j3922k3103j3042o432n216Q973m477L601l037p511j5928J155M872
13344B4204L331K754L616o002j4195K1642L5922L8760L8794L5109L3585R746j2028
$$ y = [56108, 53432, 48981, 43689, 50479, 49135, 42908, 47742, 52750, 49996, 41631, 46512, 50928, 53901, 65076, 77861, 74945, 71933, 72455, 71868, 74184, 77800, 68161, 70014, 70126, 71246, 62958, 58069, 59844, 58659, 63398, 81118, 78455, 65061, 64724, 67005, 57130, 54697, 49319, 63799, 68790, 74882, 79793, 79992, 72521, 65990, 79645, 95714, 90453, 77080, 74455, 81935, 97320, 102800, 91436, 84229, 85062, 85760, 79013, 69844, 65311, 74545, 72070, 65731, 62020, 59160, 64271, 65196, 58151, 52955, 56737, 51872, 59656, 65186, 77568, 79889, 87448, 89417, 94165, 92513, 90027, 88644, 97007, 102128, 101963, 98271, 84349, 61246, 48204, 41772, 36556, 45529, 41052, 44653, 41616, 34105, 18177, 19332, 24204, 27535, 30289, 33905, 27903, 13708, 35350, 71272, 110032, 148826, 183935, 217520, 227266, 215238]
13331B15238k700j3351k3592p531k316q925j7616l406R112n508k487Q08q018j9496
13317A10212j1481k454J197j1763N172R310K359j574P067j9944L613J0415o242
13304I5887R442J7732L7982O7627R3703O9466L4942N360j3568l0002k7384j8763
13292C42424k2578k0353k5933k247p74j5830j6395q082J972n920K449J1264M406
13279B44403O002P973N677L562k164K002k880J410J8217K5611L1116K5024R408
13266C75361Q603n789k646N127j3060l961p445k6500j0428k989q734j1959r400
13253B86180j1405m344j2504l738N587l764j022o09M065R089r82P702Q260K313
13239B84828L604q90k870m084J0105K3190K1739K6314J4313L765J275k0878k8257
$$ y = [215238, 212538, 199187, 175595, 168064, 165748, 156823, 139207, 135801, 144913, 139405, 136918, 137726, 129708, 110212, 98731, 96277, 97474, 85711, 90883, 100193, 102552, 100978, 108045, 88101, 91714, 102129, 95887, 105329, 123061, 161043, 228670, 322373, 391839, 426781, 432141, 418573, 388571, 361187, 342424, 319846, 299493, 273560, 271313, 270539, 254709, 238314, 230232, 232204, 226284, 228733, 239997, 244403, 250405, 258378, 264055, 267617, 265453, 267455, 264575, 265985, 284202, 309813, 340929, 365953, 375361, 383964, 378175, 375529, 380656, 367596, 363635, 356190, 329690, 319262, 316273, 307539, 295580, 286180, 274775, 270431, 257927, 254189, 259776, 256012, 254990, 254381, 258446, 267535, 266553, 274255, 282515, 284828, 288432, 287542, 284672, 280588, 290693, 313883, 335622, 361936, 376249, 380014, 381289, 360411, 332154]
13226C32154k3275j1018j6466m542O908j06M244J8857O823m815N728n02m556P400
13212C16834J1416M589N208j599J9547P541O984J5281J938M921N960J2885J2003
13199D23508R585J3347J5995K3496J2186J7308J7867k7L315J2038J3670K1795
13187E84083J7976K0831L954K2221K7605K4387L3997L4026L7640L1747L2653L9526
13175I10646N0687M5345O0344P5095Q5391P7238Q8071J20280J14124J26514J50628
13164A904363J70806J90607K31929K94395L60368M49294N68964P05476Q78354
13155E754556J102704J394187J780509K351779L352489M940792P180836R479970
13147C7337822J0241389P545109J547958m694488q237024q717522p471797n804032
$$ y = [332154, 308879, 297861, 281395, 276853, 283761, 283655, 287899, 306756, 313579, 308764, 314492, 313990, 309434, 316834, 328250, 332839, 338047, 336448, 355995, 363536, 370520, 385801, 387739, 392660, 398620, 411505, 423508, 433093, 446440, 462435, 485931, 498117, 515425, 533292, 533265, 536580, 548618, 562288, 584083, 602059, 622890, 626844, 649065, 676670, 701057, 735054, 769080, 806720, 838467, 871120, 910646, 961333, 1006678, 1067022, 1142117, 1227508, 1304746, 1392817, 1513097, 1627221, 1753735, 1904363, 2075169, 2265776, 2497705, 2792100, 3152468, 3601762, 4170726, 4876202, 5754556, 6857260, 8251447, 10031956, 12383735, 15736224, 20677016, 27857852, 37337822, 47579211, 55124320, 56672278, 51977790, 43740766, 35023244, 27551447, 21747415]
13139B1747415m274345l118611k274888j656649j193836q24788n28908l04895
13131G570495k19498k39694k44042j73113o4658R9067K56386M27462O27012Q71630
13121H911047J165030J540806J986273K525186L251174M317066O059330Q936276
13113C8692188J3324014J8573379K1828487J8739107P790577o327442j6555883
13106I6064427j9788953j7817249j3939402j0213742p331767n310217l911841
13099A7751256k946930k256820j732897j350421j038768p86417n77394l80880
13091F680729j97117j8859J62193K88623K96518K60008L09533M94737P57356J063497
13081A0097218J456376J983078K782079M049519N988637Q476826J0470521R930008
$$ y = [21747415, 17473070, 14354459, 12079571, 10422922, 9229086, 8404298, 7875390, 7570495, 7350997, 7111303, 6867261, 6694148, 6629490, 6728557, 6984943, 7412405, 8039417, 8911047, 10076077, 11616883, 13603156, 16128342, 19379516, 23696582, 29755912, 38692188, 52016202, 70589581, 92418068, 111157175, 118947752, 112620310, 96064427, 76275474, 58458225, 44518823, 34305081, 26973314, 21663097, 17751256, 14804326, 12547506, 10814609, 9464188, 8425420, 7639003, 7061609, 6680729, 6483612, 6464753, 6626946, 6915569, 7212087, 7472095, 7781628, 8276365, 9033721, 10097218, 11553594, 13536672, 16318751, 20368270, 26356907, 34833733, 45304254, 55234262]
13073E5234262N413884j614334p447986r827604r325782p571684n701545m177290
13065A4981921l062223k285105j740063j370336j081775q52942o72973n53641
13057C362863m58518l71446l02565k39159k07846j60990j29853j27334j17820
13048A247332r3585q3919o4201n4000o0715m3196l4644m7887l6228k5733k4517
13037F78707k9577l8149k9464k0598j8507k1599k2328j3775r515k4333j8086l5673
13025C97103j8955j6279m379m393K852j8670k0685r687k0875m785j759o192L098
13012B76394k955k559j0257r096J1100o490p895j0328n020j917o89N186N125J4540
12998B55139J3828l458j4175p686o195K526j2149k1552q581p553J3534L7518L9833
$$ y = [55234262, 60648146, 59033812, 51585826, 41758222, 32432440, 24860756, 19159211, 14981921, 11919698, 9634593, 7894530, 6524194, 5442419, 4589477, 3916504, 3362863, 2904345, 2532899, 2230334, 1991175, 1783329, 1622339, 1492486, 1365152, 1247332, 1153747, 1069828, 1005627, 951627, 890912, 847716, 813072, 765185, 728957, 703224, 678707, 649130, 610981, 581517, 560919, 542412, 520813, 498485, 484710, 475195, 450862, 432776, 397103, 378148, 361869, 357490, 353097, 355949, 337279, 316594, 306907, 286032, 281247, 279488, 273296, 276394, 273439, 270880, 260623, 251527, 262627, 256137, 248242, 237914, 232894, 230977, 230288, 235474, 240599, 255139, 268967, 265509, 251334, 243648, 237453, 239979, 227830, 206278, 197697, 190144, 203678, 241196, 281029]
12985B81029P0845Q7632P5843O6250L8885o50k1781m6139n1922o9793n4402l6973
12973C38824j8345r260o963k1175n292O212J2722P014O277K2088J8062J3222J9291
12960C82677J6900j188j537J47l2K3233P028R611K6009K7465J8194J8851K2028
12947E49386O880k0921l6191j6461k0915j7939j8838j9867k906k8786k8057j7902
12935C27483k1954l2713k2236r851j1472q925J490L497J2826L8339L4745K9183
12923C40412N2674M0541N622k4014j2958M894p80R007O460O723J656n533J0632
12910D35336K4627N2394P1905P2968Q1127Q7674P9603P0920L9328L714k4130p3631
12898I21835p5792j03650j22041j15133r5881p6855o8689l9293k8149l2223m8703
$$ y = [281029, 351874, 439506, 515349, 581599, 620484, 619834, 598053, 551914, 499992, 430199, 375797, 338824, 320479, 311219, 304256, 283081, 277789, 284001, 296723, 303737, 310014, 332102, 350164, 363386, 382677, 399577, 398389, 396852, 396999, 396967, 420200, 427228, 436839, 462848, 490313, 508507, 527358, 549386, 556266, 535345, 499154, 482693, 461778, 443839, 425001, 405134, 402228, 373442, 345385, 327483, 305529, 272816, 250580, 240729, 229257, 220332, 221822, 225319, 238145, 276484, 311229, 340412, 393086, 433627, 439249, 415235, 402277, 407171, 406391, 415398, 421858, 428581, 430237, 424704, 435336, 459963, 512357, 584262, 657230, 738357, 826031, 905634, 976554, 1015882, 1019596, 995466, 921835, 846043, 742393, 620352, 505219, 409338, 332483, 263794, 224501, 196352, 164129, 115426]
12887A15426k3725j7761k1367n188O229K5527N8413M7157K4091J2970L084m285
12875B20571j5734j08K083l388j68n012q681m754Q693l04q713r188M610Q245l420
12860A84732k432J5783j1621r450q612j35M289r962N438K944m302P168k117K969
12846A74692J6511r8o475j0119p519L936j8880q759Q557q713j1893J194N410o324
12832A31520K083j3297M891m442o236R772J0133j238m534J0777J1275Q491K604
12819A61799r533r690L06J1623K398O895r307l467Q527o017k698L905J372Q46
12805A56959k294J643l449n112r158k355J9414O724j2445j0296n86r4l366N371
12791A40956N079q800j1186M939P769R684P078L981j5802r23M384l618m655r648
$$ y = [115426, 91701, 73940, 52573, 47385, 53614, 79141, 137554, 184711, 208802, 221772, 224856, 220571, 204837, 204729, 206812, 203424, 203256, 198244, 189563, 184809, 193502, 193198, 184485, 175297, 179907, 188152, 184732, 182300, 198083, 186462, 177012, 168400, 168265, 172554, 162592, 168030, 170974, 166672, 173840, 171723, 174692, 191203, 191105, 184630, 174511, 166992, 170928, 152048, 143289, 151846, 143133, 131240, 132434, 137844, 131520, 133603, 120306, 125197, 120755, 114519, 124291, 134424, 133186, 128652, 139429, 150704, 159195, 161799, 152266, 142576, 142882, 154505, 156903, 163798, 154491, 151024, 159551, 153534, 150836, 154741, 156113, 156959, 154665, 156308, 152859, 147747, 138589, 136234, 155648, 162372, 149927, 139631, 139045, 138951, 135585, 140956, 146035, 137235, 126049, 130988, 138757, 148441, 155519, 159500, 143698, 142775, 147159, 143541, 138886, 129238]
12777A29238J071P547J2949q341O106R494m244R648J5505M758K970L36r985J719
12763A78771J530k727K005R901q77L10p131q21J1569j4869q586M365Q482P11q200
12748A74433l93J2083Q64p674j904q193L07j896P334r734j0676Q822J4584r160
12734A68797M267O561j1712l630l183j4448k1005n435R041K6705M6743O4007O8119
12721C34827M1513J3942m710m979k1130j4098j6349j4125k0129k8895k6185m91
12709B39191R46j1471k746M678m10J0745J7340N920Q788K5145L4404M0853K5050
12696C98433K8294L6412M3664P1055P4913P8827O2242M3231N321m5510p6427p5669
12684F44786o2713n9726l5170j5743j3806j3855J5857K4918N1144O5757Q9465
$$ y = [129238, 130309, 137856, 150805, 142464, 148570, 158064, 153820, 163468, 178973, 183731, 186701, 187037, 177052, 178771, 180301, 177574, 179579, 189480, 188603, 188913, 181782, 180961, 192530, 177661, 169075, 173440, 181922, 182633, 174433, 174040, 186123, 186987, 179313, 177409, 169216, 169523, 167627, 174961, 165227, 154551, 163373, 177957, 168797, 173064, 179625, 167913, 164283, 161100, 146652, 125647, 120212, 129253, 155958, 202701, 266708, 334827, 376340, 390282, 385572, 380593, 359463, 345365, 329016, 314891, 294762, 265867, 239682, 239191, 240137, 228666, 225920, 230598, 230188, 240933, 258273, 264193, 272981, 298126, 332530, 373383, 398433, 426727, 463139, 506803, 577858, 652771, 731598, 793840, 837071, 842392, 796882, 720455, 644786, 582073, 522347, 487177, 471434, 457628, 443773, 459630, 484548, 535692, 601449, 690914]
12673F90914R6259P7595O7241O0582M6178K7081J3260L1562K4240L1417M8651
12662A214980M6252K6612L0765J8884L390J6371L3492O9623Q9864N4569J6862
12651A621664l0015o2477q4319q4885p7951m9743j4173j9282l0049j9245j2414
12640A137111m304j9663k6585l8721n6603n3976m1472j7859j5964p338j5827q400
12628H30399j3523k8605k8404j8194j0224j660p43J9525L9516L4839M4602M8458
12616I15986L9696M662j5211l2977l1922m1252k0762l443Q75L358J3861K3998
12604H56869K6982K9090M447K708m721k592J6236K0755J6443K8679J7968K1544
12592A034408K3547K5143O163J7858L0560K2272P594K3761N2827L3496J6869M1112
$$ y = [690914, 787173, 864768, 932009, 992591, 1038769, 1065850, 1079110, 1110672, 1134912, 1166329, 1214980, 1261232, 1287844, 1318609, 1337493, 1340883, 1357254, 1390746, 1460369, 1550233, 1604802, 1621664, 1591649, 1529172, 1444853, 1359968, 1282017, 1232274, 1218101, 1198819, 1168770, 1149525, 1137111, 1132807, 1113144, 1086559, 1047838, 991235, 937259, 895787, 877928, 861964, 854626, 838799, 830399, 816876, 788271, 759867, 741673, 731449, 729789, 729046, 748571, 788087, 822926, 867528, 915986, 955682, 960344, 945133, 912156, 880234, 838982, 818220, 814777, 815652, 819010, 832871, 856869, 883851, 912941, 917388, 920096, 915375, 912783, 929019, 949774, 966217, 994896, 1012864, 1034408, 1057955, 1083098, 1089261, 1107119, 1137679, 1159951, 1167545, 1191306, 1244133, 1277629, 1294498, 1335610]
12580A335610L4156J6450M1853L6058K6617L7950M3069N1607N9359N5156O2335
12569A800220P6173P8558P4090O8376Q3763R0991R1442J29430J35798J38595J49542
12558B916978J71291K01677K27671K62219K73124L36609L83153M30493N09574
12549E712789N75510O37755P35281Q63137R97352J203814J508091J928664K482480
12540A6644873L204212M228668N717360P802919J0520378J3621161J5961910J5394608
12532I3096089J0111534J208648p288333j2213771j3247147j1819936r442175
12525E0404909p005406m882106l116144j658505m39017O49709J627511K554597
12517C8135548L373850L993580M399252M563760M536247M448651M409418M460609
$$ y = [1335610, 1369766, 1386216, 1428069, 1464127, 1490744, 1528694, 1571763, 1623370, 1682729, 1737885, 1800220, 1876393, 1954951, 2029041, 2097417, 2181180, 2272171, 2363613, 2493043, 2628841, 2767436, 2916978, 3088269, 3289946, 3517617, 3779836, 4052960, 4389569, 4772722, 5203215, 5712789, 6288299, 6926054, 7661335, 8524472, 9521824, 10725638, 12233729, 14162393, 16644873, 19849085, 24077753, 29795113, 37598032, 48118410, 61739571, 77701481, 93096089, 103207623, 104416271, 97127938, 84914167, 71667020, 59847084, 50404909, 43399503, 38517397, 35401253, 33742748, 33303731, 33953440, 35580951, 38135548, 41509398, 45502978, 49902230, 54465990, 59002237, 63450888, 67860306, 72320915]
12509G2320915M647662M927496N149175N173383M863922M123434K957335J471363
12501A05634685o3359j445951k465521l052527l198107k970771k476260j747105
12493H8215084q58701L35088K068844M620262P960844J1591618J4740732J6980257
12485A45654028J7978905J7017212J3622258Q281322K129937l973179r216386
12478A91494097j2287518j2358774r873183o104803k604070j574127m719226j0839314
12470A31133082j6290486j8410925j7412503j4858561j2040744r542700p515672
12463C5061491n932977m722052l774675l022336k412448j938467j568812j296499
12455A0393225j101738r65502q40021p18362o17719n38769m66670m21637l65955
$$ y = [72320915, 76968577, 81896073, 87045248, 92218631, 97082553, 101205987, 104163322, 105634685, 105571326, 104125375, 101659854, 98607327, 95409220, 92438449, 89962189, 88215084, 87356383, 87691471, 89760315, 94380577, 102341421, 113933039, 128673771, 145654028, 163632933, 180650145, 194272403, 202553725, 204683662, 200710483, 191494097, 179206579, 166847805, 156974622, 150869819, 148265749, 146691622, 141972396, 131133082, 114842596, 96431671, 79019168, 64160607, 52119863, 42577163, 35061491, 29128514, 24406462, 20631787, 17609451, 15197003, 13258536, 11689724, 10393225, 9291487, 8325985, 7485964, 6767602, 6149883, 5611114, 5144444, 4722807, 4356852]
12446D356852l12226k67844k37096k32632j99925j72816j52158j58574j34399
12437B489182j22721j24731j14264j15215j04949r7963r0921p9978q2683n4977
12427A500780n5799o5154o2056m3936n5283n2869m1305l2888m4836l6583k0376
12416I89695m5072m1041k5640j3644k5384l1873j7241m581j3709r030O185j4832
12404G53833k5485j9356l5049m0694l6636k4506o22L816j8126j6716k607j3531
12392E24321j871q400j9699k2202j1881r597n092Q63Q36q159j7550o386O089j2068
12378D09204m2068o1420n0156l4919k2631K08J6823R013R740K1059K1538J4785
12366B91176J2031K1129J3962J1643J6978J2376L09L621k673j5449k9777k6245
$$ y = [4356852, 4044626, 3776782, 3539686, 3307054, 3107129, 2934313, 2782155, 2623581, 2489182, 2366461, 2241730, 2127466, 2012251, 1907302, 1809339, 1718418, 1638440, 1555757, 1500780, 1444981, 1379827, 1317771, 1273835, 1218552, 1165683, 1124378, 1091490, 1046654, 1010071, 989695, 944623, 903582, 877942, 864298, 838914, 807041, 789800, 785219, 771510, 762480, 768665, 753833, 728348, 708992, 673943, 633249, 596613, 572107, 571485, 575301, 557175, 540459, 537852, 524321, 522450, 514050, 494351, 472149, 460268, 450671, 445579, 446442, 447278, 439119, 421569, 415183, 421272, 409204, 367136, 305716, 255560, 220641, 198010, 198218, 215041, 224054, 233794, 254853, 276391, 291176, 303207, 324336, 338298, 349941, 366919, 379295, 379604, 383225, 380552, 365103, 335326, 309081]
12354C09081k8786l9348m0722m1778n2506n3630l2957l8128m8628n1200l8237
12343a56839k7192j874K2913M2211M3406K3783L2666O667J0028j7671l7988j2438
12331g2328k3863m7046n6633o8632o6480o0028n1911m4089j7320j6076j8292K099
12319e40599K913L027j6302l7028P802L7358L2471L9874K0633K3436K6198K4904
12307c75313J5569J2495J1486M269J6787J3489j4154k0377j4649k0820l4526k9826
12295d35570j8196J960K2943N6579R0806Q2885P5315Q3287M9643L3530K4476J8258
12283H5916K1058L3914M7529M7875N1563L9109J3379O318N143L645o641n265j1539
12270C32004M8r665m87j5465l6030k7608j2015j5635n578j5334j0774L121m614
$$ y = [309081, 280295, 240947, 200225, 158447, 105941, 52311, 19354, -18774, -67402, -118602, -156839, -184031, -185905, -162992, -120781, -77375, -53592, -20926, -14259, -4231, -21902, -59890, -72328, -96191, -143237, -199870, -268502, -334982, -395010, -446921, -491010, -508330, -524406, -542698, -540599, -537686, -534659, -550961, -587989, -580187, -542829, -510358, -470484, -449851, -426415, -400217, -375313, -359744, -347249, -335763, -331494, -314707, -301218, -315372, -335749, -350398, -371218, -405744, -435570, -453766, -451806, -428863, -372284, -281478, -198593, -123278, -39991, 9652, 43182, 67658, 85916, 106974, 140888, 188417, 236292, 287855, 326964, 340343, 346661, 351804, 355449, 348808, 343543, 332004, 332052, 322387, 321900, 306435, 270405, 242797, 230782, 215147, 209569, 194235, 183461, 186582, 181968]
12257A81968k386k391o649m606L95J0835Q539j9532q440j8287j5252N843j698
12244A28339j0094j594N126o514J5284J0619K253n107r883r020q821m481k984
12231A03123M247L345M905K693n85k585m052j3304j259j236m678R725p264n441
12217H7634o524j0853N630J2383M099j627j9353K579J586n49j2793M29K4555K477
12203H9673M678N72j7271k2780K537Q076j2002p029j032R928J764M754R480n098
12189F6250q228l577J2903J7125r897j6400J1099P48j2432P95J1893M729J0405
12176H5413k903k2291P1J525o473j5939r708K934q15o826o371j1936r35K485O463
12161A4694P014p864K614P67N959p13J223J4337L389O70k153m184l968l446m546
$$ y = [181968, 179582, 177191, 170542, 165936, 166331, 177166, 185705, 166173, 157733, 139446, 124194, 130037, 128339, 118245, 116651, 121777, 115263, 130547, 141166, 143419, 138312, 128429, 119409, 110588, 106107, 103123, 107370, 110715, 115620, 118313, 117728, 115143, 111091, 97787, 96528, 95292, 90614, 100339, 93075, 87634, 81110, 70257, 75887, 88270, 92369, 90742, 71389, 73968, 75554, 75005, 62212, 62641, 87196, 89673, 94351, 94923, 77652, 54872, 57409, 65485, 53483, 46454, 45422, 55350, 57114, 61868, 71348, 66250, 58022, 54445, 67348, 84473, 74576, 58176, 69275, 70023, 57591, 58386, 70279, 75008, 85413, 82510, 60219, 60290, 61815, 55342, 39403, 29695, 32629, 31814, 24988, 18617, 6681, 5746, 8231, 14694, 21708, 13844, 16458, 17225, 23184, 22471, 23694, 38031, 41420, 42090, 39937, 35753, 31785, 28339, 23793]
12146B3793l67p31p60j219M215L499L105L85q531p820N389J1927P921r61m898
12131C4947l697k498K160N416J2317N668q229j3946J65J4602L570k616k291J170
12117D6738r802k22R446M687o290j9597k171Q482J0675P267n012K674J0013m066
12103E2822n054j211j1428j0684J986k186K010J654K92P081O121J0544L307o348
12089D8906J9077K9945J7825J8393J1412M336J5635M5594L8847M4544O8837Q1290
12077D44641P0500N5623J9614j9318l4767m5353l3125l8829m0176j6174J0727
12066C73363J2166K2456L2067M7509Q4898J12334J18248J17822J18625J00225
12056A139713P3179L7408o246m1601n2872p1347p6560p2209q3236n7125n2695
$$ y = [23793, 23426, 22695, 21935, 20716, 24931, 28430, 31535, 31920, 23389, 15569, 20958, 32885, 40806, 39845, 34947, 31250, 28752, 30912, 36328, 48645, 54313, 46084, 32138, 32303, 46905, 50475, 47859, 45568, 46738, 36936, 36714, 46160, 50847, 44557, 24960, 22789, 31271, 41946, 49213, 44201, 46875, 56888, 52822, 47768, 46557, 35129, 24445, 26431, 24245, 26255, 27909, 28201, 35282, 41403, 51947, 55254, 48906, 67983, 97928, 115753, 134146, 145558, 149894, 165529, 211123, 249970, 294514, 363351, 444641, 515141, 570764, 590378, 571060, 536293, 490940, 457815, 418986, 378810, 362636, 373363, 385529, 407985, 440052, 487561, 572459, 684793, 803041, 920863, 1039488, 1139713, 1212892, 1250300, 1244054, 1202453, 1149581, 1078234, 1001674, 929465, 846229, 789104, 736409]
12045G36409n1796o5009m5652k5888l5487k6354k2877k6389k5689k1028l3965
12034C56275k6209j4414j0667j8965j4188j9959j7504q960j2352P366J6669J9261
12022B56353J9386L9287M8520N8763P6073N6615K1319k0079m3588p1474p1504
12011C69671p3898o1635m4086m3460k9753j1982j93M48m460n285J0128L671o24
11998A08542j967j2693j6241J22N787o845o539j2898r82N82J6784q856J8113J5072
11984I7981O11M938j626K232J396k103n969J999o33P599k152J1197J1000J7910
11970A44380J6852L2984J8662M0168N0081M7243M8943K6587M3068P7705Q4772
11959F31445J00835J52844K08756K78163L83306M92440N54184O05192N93691N06608
$$ y = [736409, 684613, 619604, 573952, 548064, 512577, 486223, 463346, 436957, 411268, 390240, 356275, 330066, 315652, 304985, 286020, 271832, 251873, 234369, 225409, 213057, 220423, 237092, 256353, 275739, 315026, 363546, 422309, 498382, 554997, 576316, 556237, 512649, 441175, 369671, 295773, 234138, 190052, 146592, 116839, 104857, 104664, 105112, 100652, 95367, 105495, 109166, 108542, 106575, 93882, 77641, 77763, 83550, 76705, 70166, 57268, 56286, 56868, 73652, 64796, 82909, 97981, 98592, 103530, 101904, 104136, 105532, 103429, 97460, 99459, 98826, 106425, 104273, 115470, 126470, 144380, 161232, 194216, 212878, 253046, 303127, 350370, 399313, 425900, 468968, 546673, 631445, 732280, 885124, 1093880, 1372043, 1755349, 2247789, 2801973, 3407165, 4000856, 4507464]
11949D507464L75164K11341Q0k04248l87312n26419n86907n90212n42745m68864
11939A787342l91126k97014k09168j52176r5810r7922o3257m8921m3753n8153
11929C30042n1707k9770k4586p675k5063l8191k0393r873o249Q129n924l7759
11917H0981j8322j1121j2837K623J0490k209k184L669n89o629Q68l37j7754n366
11903B1283Q298J6947O636L043k068q920j2607j913j849j4036Q69N825J5741K603
11889C9852r108M50J0614k614n868l197n317K622j0678O472P983P105N97k1543
11875A7370j3975m042j948J3733J894K201N831m434L709O533Q834r174j5082Q253
11861A9703k679j2634K0677K3837R522j3895k4765J468q228o821m085M397J1305
$$ y = [4507464, 4882628, 5093969, 5094049, 4889801, 4502489, 3976070, 3389163, 2798951, 2256206, 1787342, 1396216, 1099202, 890034, 737858, 642048, 544126, 480869, 431948, 388195, 330042, 278335, 248565, 223979, 216304, 191241, 153050, 132657, 122784, 116535, 124664, 118740, 80981, 62659, 51538, 38701, 41324, 51814, 49605, 47421, 51090, 50501, 43872, 44740, 44403, 26649, 21283, 29581, 46528, 53164, 56207, 54139, 45219, 32612, 30699, 28850, 14814, 15683, 21508, 37249, 39852, 30744, 31194, 41808, 39194, 33326, 30129, 24812, 27434, 16756, 23228, 31211, 38316, 38913, 17370, 3395, -647, -2595, 11138, 13032, 15233, 21064, 16630, 20339, 26872, 35706, 26532, 11450, 19703, 17024, 4390, 25067, 48904, 58426, 44531, 19766, 21234, 13006, 6185, 2100, 6497, 17802]
11848A7802J260k045P563P01J2048l485l403k807o74n006J1922K295N014o772
11834C4413K333m848j6371o655n144p173Q901P821q855J69Q231K293k50L495j1825
11819F535O679J3535N63Q032o7l669j200j089n200L163j1727M496j378j6039M838
11804G472J3266L849m217N229K390K399L041O806j451j0143j4082q265J996j2029
11790c739k338M637J2381J1698j0984j6158K470J5315O374N056L038k373N357
11777C0734j3169l323k295j889O36o289J7749j135j4171q653l074M733N502k721
11763B635l778j600L984m963j234m105N653J8981p641l881J1167N739k651J9307
11749C7613n860r582o297k12J6109O937r357n011K442J0555J1462j1813j1608
$$ y = [17802, 19062, 17017, 24580, 25281, 37329, 33844, 30441, 27634, 26960, 21954, 33876, 36171, 41185, 34413, 36746, 31898, 15527, 8872, 3728, -3445, 5456, 13277, 4422, 4591, 12822, 15115, 14865, 18360, 6535, 13214, 26749, 27312, 35344, 35277, 31608, 30408, 29319, 24119, 27282, 15555, 20051, 18673, 2634, 7472, 20738, 24587, 20370, 25599, 27989, 30388, 33429, 40235, 38784, 28641, 14559, 6294, 8290, -3739, -6077, -1440, 10941, 22639, 11655, -4503, -2033, 13282, 19656, 24712, 27750, 25377, 30734, 17565, 14242, 11947, 10058, 10694, 4405, 22154, 21019, 6848, -1805, -4879, -146, 5356, 2635, -1143, -2743, 1241, -3722, -4956, -9061, -3408, 15573, 7932, 4051, 15218, 20957, 18306, 37613, 31753, 22171, 15874, 15662, 31771, 38708, 29351, 24340, 26782, 37337, 48799, 36986, 25378]
11736B5378J6808p573r13m534n749j6291r7K570Q602P159O126o720Q54Q428K083
11721C6131p965j5288J306J1766l156J155m631P084J0397l333Q689j665M313l789
11707D1014O187M47K51L526l585n309m963J0412J093m37j0794L397k358j5960
11693B2921K697J2195p103N129m954j7988J865K405k933n692J7887J1943K337
11680D0709k1130m684N045k771J86J0564k814o125M573R217J10M92M85n62p572
11665B5723Q694J0499j0737p130j344Q028L133k482J0143q604p989J6585J1689
11652E6208j0541p378m540K592K280m458r257p166R289P943l340k676L213l551
11638B8618L245Q699j156j1478k851L623O010P89j3206j2264r815N109J4167J0071
$$ y = [25378, 42186, 34613, 33700, 29166, 23417, 7126, 7029, 9599, 18201, 25360, 31486, 24766, 25620, 34048, 36131, 28166, 12878, 14184, 25950, 22794, 23949, 19318, 26402, 36799, 33466, 42155, 40490, 44803, 41014, 47201, 47648, 47899, 51425, 47840, 42531, 37568, 47980, 49073, 48636, 37842, 41239, 38881, 22921, 25618, 37813, 30710, 35839, 30885, 12897, 14762, 17167, 14234, 8542, 26429, 38372, 40709, 19579, 14895, 19940, 17169, 17355, 27919, 25105, 18980, 23553, 32770, 32880, 33372, 33857, 33295, 25723, 34417, 44916, 34179, 27049, 25705, 33733, 36866, 34384, 44527, 35923, 27934, 44519, 56208, 45667, 38289, 33749, 36341, 38621, 34163, 24906, 17740, 27029, 34972, 31632, 28956, 32169, 28618, 31863, 40562, 39406, 27928, 25077, 28700, 34710, 35499, 22293, 10029, 214, 5323, 19490, 29561]
11624B9561p241q252J102J446j362J0171J0410k304r99l788J04O687R744l968
11610D1311j2063K563n177n01J5675j071m890j6399j2535m38l27J7722J3791J1141
11596D8802Q516k347j3772k78M90J2431r886J072O656n173k864l952r801P08J4560
11581D5162j234j0065o75l940j213K690j585Q086m62q315L709k015q896q81K734
11566B3100M271J0158p17M325j118j2930J1192N835Q122N091j545j718O106m251
11552E5921J833j009j2525O694J4255m971j7591K472j122M903J8008K58j5183
11539E1943q483p683M618m672o451k98J2261J1919N546k415l6q577M610J8679
11525G0961J6106J0453M181p502k0736k0830j3356J7793M689Q02J111j4545p253
$$ y = [29561, 22320, 14068, 15170, 16616, 15254, 25425, 35835, 33531, 32532, 28744, 28848, 35535, 45279, 41311, 29248, 31811, 26634, 26133, 41808, 40737, 35847, 19448, 6913, 6475, 6148, 23870, 37661, 48802, 57318, 54971, 41199, 40921, 41411, 53842, 43956, 45028, 51684, 46511, 43647, 39695, 29894, 30602, 45162, 43928, 33863, 33188, 29248, 28035, 30725, 29140, 37226, 36764, 28449, 32158, 30143, 21247, 20366, 23100, 27371, 37529, 36812, 41137, 40019, 27089, 38281, 44116, 52238, 57329, 55784, 54066, 60172, 55921, 57754, 56745, 44220, 50914, 65169, 60198, 42607, 45079, 43957, 48860, 66868, 67126, 51943, 43460, 35777, 40395, 35723, 29272, 28974, 41235, 53154, 58700, 56285, 56249, 47672, 52282, 70961, 87067, 97520, 101701, 94199, 73463, 52633, 39277, 57070, 61759, 62561, 63672, 49127, 41874]
11512D1874r321Q597q622j3696j971J3505q257j381P937J1996J2208N823j934
11499E6758K54o719Q23j4506J3340K1322k313j0016p397K8107K0177Q459l498
11486A04791n176L875l467J1769K7932J9621J5628L8718O1214N2520J0792r425
11474C28792k4570l4417l6051l6612l5336k8174j1497q547l169M58n8p620P103
11461A10302o68j2769J2215M501p732Q470J8731N299N338R677N93j212K421J3601
11447A68767K9769M1680L5374M7748P8525J14429J00319N9575j1001p2577r7342
11436D95266r3337p3207n0865m1821l2608l8896q760L57o512j1593m807r595j4893
11423A08729k3638l77K0585J9370J4742M910j6127j2304K132N416J5163O082J5991
$$ y = [41874, 32553, 41150, 32528, 18832, 16861, 30366, 22109, 20728, 28665, 40661, 52869, 58692, 56758, 57012, 50293, 51116, 36610, 49950, 71272, 68959, 58943, 51546, 79653, 99830, 108289, 104791, 99615, 103490, 100023, 111792, 139724, 159345, 174973, 213691, 274905, 327425, 338217, 328792, 304222, 269805, 233754, 197142, 161806, 133632, 122135, 113588, 110419, 110877, 110819, 103199, 110302, 109634, 96865, 109080, 113581, 105849, 114319, 133050, 138349, 143687, 153364, 153957, 152745, 155166, 168767, 198536, 240216, 275590, 323338, 401863, 516292, 616611, 676186, 665185, 592608, 495266, 401929, 328722, 277857, 236036, 203428, 164532, 155772, 156129, 149617, 138024, 133217, 123622, 108729, 85091, 84714, 105299, 124669, 139411, 144321, 128194, 115890, 118022, 123438, 138601, 144683, 160674]
11410A60674J1454O042K5700M2160M0396K2619K5613J5210j7076l5713n3643m1838
11398B01598k9807j6205j7866j8227o083O9M19j4008j2998j462R28j2416p648
11385F6294K134M025J271M827M925p745j7249J2914J6255n363k85k366N157r310
11371G5484l916O042j93L501J0285P654r675j8896R21J6596N638o795J031R098
11357I6775p405j859m80J00L745R284j517l219n47n296M408K121p553L455o324
11342H5688j4282Q12J3196J6005o553j6031m568M704J0766o142O06M818J051l085
11328H6985j5556l605K517K428o357j173M741L511j1134q122J3355K1478L745
11315I2813P605N521J1205M67j0607L18K157j2277j2944K875j430n940N370J376
$$ y = [160674, 172128, 178170, 203870, 246030, 286426, 309045, 334658, 349868, 332792, 297079, 243436, 201598, 171791, 155586, 137720, 119493, 113410, 113479, 113898, 99890, 86892, 85430, 86358, 73942, 66294, 68428, 72453, 73724, 78551, 83476, 75731, 58482, 71396, 87651, 82288, 82003, 79637, 84794, 75484, 71568, 77610, 77417, 80918, 91203, 98857, 89182, 70286, 71207, 87803, 93441, 86646, 87677, 96775, 89370, 87511, 87031, 87131, 90876, 100160, 98643, 95424, 94877, 89581, 93989, 96110, 88557, 92012, 85688, 71406, 72218, 85414, 101419, 94866, 78835, 74267, 78971, 89737, 83595, 84201, 89019, 90070, 86985, 71429, 67824, 70341, 72769, 66412, 65239, 69980, 73491, 62357, 54235, 67590, 89068, 92813, 100418, 105939, 117144, 117611, 107004, 107322, 109479, 97202, 84258, 87133, 85703, 79763, 85133, 86509]
11301H6509M759K018M38J1550m933k508N007R373o300j5489n300N31l040N81l438
11286G9758J0859J1715j3265J0491J1779n3L778L931j503P885K834L168j127n594
11272A24656r791m534p497j298M293J406j1047L210p722n438M869o810j6461q611
11258E9225j0691j0739K817J308J5200J1141K2828N9519O3782L2589R638K649
11246B59266j2343j2893m785N015N618j506l309j0010j5517j1050q079m011k839
11233A83557j0467p891k431l610o70m978j1425k631Q445M360n516k032M551O233
11219A55495K451J0586K9506M9853Q0098Q4939N1912J0211j0600j9155l5864k4209
11207C85223k3081j2360m865j0377J093l20j5281j5545j4277o213o628N06K832
$$ y = [86509, 91268, 93286, 93724, 105274, 100341, 97833, 102840, 112213, 105913, 90424, 85124, 85655, 82615, 83196, 79758, 90617, 102332, 89067, 99558, 111337, 111284, 115062, 118993, 117490, 125375, 128209, 131377, 130250, 124656, 114865, 110331, 102834, 101536, 105829, 107235, 96188, 99398, 91676, 86238, 91107, 84297, 67836, 59225, 48534, 37795, 40612, 41920, 57120, 68261, 91089, 150608, 214390, 246979, 256617, 259266, 246923, 234030, 229245, 234260, 239878, 238372, 235063, 225053, 209536, 198486, 190407, 186396, 183557, 173090, 165199, 162768, 159158, 158488, 153510, 142085, 139454, 147899, 152259, 146743, 144711, 149262, 155495, 157946, 168532, 198038, 247891, 327989, 412928, 464840, 475051, 464451, 445296, 409432, 385223, 362142, 349782, 344917, 334540, 335633, 335313, 320032, 304487, 290210, 283997, 277369, 277875, 280707]
11194B80707K265o250J6089K143J7308p609j264R056M690K3724L1200J0085K6573
11181D08717J6997o761r612J66J666j2435j9952j3413j0206m283J0831J6043Q749
11168C86507l839j699k0343j2096j2125p095j0177m704N894J323J1492J3286J2065
11155C58489P962J1498O979R226K642Q938P755J4895J1620J4205K7226J7257r254
11142D89438k7182k1416r101r844M719Q593K2345J9909m58K4477L3248K1088K9463
11129E85279K9969M1618N2955M4469N0926N3027L4634Q998k1j9328k9607j8292
11117H34627k2942j7760l092M444J3181J6145J0983K5715L2427J8610L1311K9695
11105I73344J7847K2528J6611Q437J3666J6551M3752N5197M9204N2932O9076N3964
$$ y = [280707, 282972, 276722, 292811, 294954, 312262, 304653, 303389, 312445, 317135, 340859, 372059, 382144, 408717, 425714, 418953, 409341, 409507, 411173, 398738, 378786, 365373, 355167, 350884, 361715, 377758, 386507, 382668, 380969, 360626, 348530, 336405, 329310, 319133, 314429, 320323, 321646, 333138, 346424, 358489, 366451, 377949, 384928, 394154, 396796, 405734, 413489, 428384, 440004, 454209, 481435, 498692, 489438, 462256, 440840, 431739, 421895, 426614, 435207, 457552, 477461, 477003, 501480, 534728, 555816, 585279, 615248, 656866, 709821, 754290, 805216, 858243, 892877, 901875, 901854, 882526, 852919, 834627, 811685, 793925, 790833, 795277, 808458, 824603, 835586, 861301, 893728, 912338, 943649, 973344, 991191, 1013719, 1030330, 1038767, 1052433, 1068984, 1112736, 1167933, 1217137, 1270069, 1339145, 1393109]
11093A393109L8169M5377M2130J7380L7733M2116M3737M6102P7585R1345J06327
11082A981110J26265J45374J72877J99074K27135K95568L69578M03156M15260
11073D335397M48610N21960O45906Q38191J070595J374470J821039K506663L627658
11064A7190489N444137Q020894J0800278J1763842Q171683L21333o956665r952814
11056D4803177r433116p649098n848619m318218l118756k226869j554866j016714
11048I636921n99389l15327j73647k27803l09109k82743j43039O3074K59477M14089
11038H322504N21212N79706O95806R30877J285965J717005K247702K995501M151878
11029B3448156O133806R467102J4570514K0635109K3788400J8565455M298512
$$ y = [1393109, 1431278, 1476655, 1518785, 1536165, 1573898, 1616014, 1659751, 1705853, 1783438, 1874783, 1981110, 2107375, 2252749, 2425626, 2624700, 2851835, 3147403, 3516981, 3920137, 4335397, 4784007, 5305967, 5951873, 6790064, 7860659, 9235129, 11056168, 13562831, 17190489, 22634626, 30655520, 41455798, 53219640, 61391323, 61712656, 54755991, 44803177, 35370061, 27720963, 21872344, 17554126, 14435370, 12208501, 10653635, 9636921, 9037532, 8722205, 8548558, 8320755, 8011646, 7728903, 7585864, 7648938, 7908415, 8322504, 8843716, 9423422, 10119228, 11050105, 12336070, 14053075, 16300777, 19296278, 23448156, 29581962, 39049064, 53619578, 74254687, 98043087, 116608542, 120907054]
11022A20907054j1359709j9752649j9964523j6438573j2519775r252411o726106
11015B4893308m846134l484838k492689j796799j308283r50875p19194o28006
11007H666490n66444m55904k70274l7831J45111J75630O8723R511J20287L41848
10997H197147O01784Q81237J268875J794906K596555L863924N769438Q280039
10989C3253905J0360189R710062M509894l142770q473721r683876q408294o574293
10981B1551096m941867l640160k666221j951864j426585j047414p65153o06459
10973D505373n04183m16100l87943m01510l50535k83414k51295k02862j53117
10964A554414j40896j13177r5933p6284p2149o1088o4520o1931m3385j8204j5409
$$ y = [120907054, 109547345, 89794696, 69830173, 53391600, 40871825, 31619414, 24893308, 20047174, 16562336, 14069647, 12272848, 10964565, 10013690, 9294496, 8666490, 8100046, 7644142, 7373868, 7336037, 7481148, 7656778, 7725501, 7735012, 7855299, 8197147, 8798931, 9680168, 10949043, 12743949, 15340504, 19204428, 24973866, 33253905, 43614094, 53324156, 57834050, 54691280, 46217559, 36533683, 28125389, 21551096, 16609229, 12969069, 10302848, 8350984, 6924399, 5876985, 5111832, 4505373, 4001190, 3585090, 3197147, 2795637, 2445102, 2161688, 1910393, 1707531, 1554414, 1413518, 1300341, 1204408, 1128124, 1055975, 994887, 930367, 868436, 825051, 806847, 791438]
10953G91438l2816l0451l3563m8755k8523j0246q405n368j5465l0864m8176k5711
10941D73095J119J1085J0676K605M486l800j7713r724r226J468j6383n495J182
10928D43375j0661j2811p653j8961j1548j331j0107o272k946j3703o595J37k626
10915C38298J1244J7874J4284L936K940N729j4992j4583p536J266j4662j9606
10903C24192j7493J8139N7887Q0610R9895J55190J98034K67289L69962M83134
10893B036839N13542K83857j34863m44210m82823l92420k83835j98995j24050
10884G73042r3600p9379p0419n3205k7643l742O558n081o513j5182o544k2234
10872C96058k0157j6756J801J2750K0458L4388M5881O5548O1278L8165J0474O240
$$ y = [791438, 758622, 728171, 694608, 645853, 617330, 607084, 598679, 593311, 577846, 546982, 498806, 473095, 474214, 485299, 495975, 498580, 503066, 499266, 481553, 471829, 462603, 464071, 447688, 442193, 443375, 432714, 419903, 412250, 393289, 381741, 380410, 370303, 364031, 361085, 347382, 340787, 340924, 338298, 349542, 367416, 381700, 385636, 388576, 394305, 379313, 364730, 357194, 358460, 343798, 324192, 306699, 324838, 382725, 463335, 563230, 718420, 916454, 1183743, 1553705, 2036839, 2550381, 2834238, 2699375, 2255165, 1772342, 1379922, 1096087, 897092, 773042, 679442, 600063, 529644, 476439, 448796, 445054, 451612, 446531, 440018, 424836, 418292, 396058, 375901, 359145, 360946, 373696, 394154, 428542, 474423, 539971, 601249, 639414, 649888, 656128]
10860F56128k438k0279k8533k1922L318O734N805P768r885R23l042j0614j1789
10847E72174r296N005M733j9967j9858j1765o288j0066l603O207J3693J1773K1119
10834E53861M4398O6283Q4497P3978M0032L5111K4823K5265J1623J5302J720j2184
10822I64709l208N252K1685P913j3264k4115m1491l7403k6459l1068j9237L226
10810H06540L680P610Q441q963O40r105j9680M747j7566m515k0408l4795r817
10797G06809K2617M9675O5847N0225J9310K0625J5750l119L07K0818R460p455
10785I70869k1147r375j0464Q342O597M340J527K0748J9994J8576J6430K2856
10773A049293J1208N195J9858Q605P885K5302N4174N4068N2666M8752M3634L3735
$$ y = [656128, 653690, 633411, 604878, 582956, 586274, 593008, 598813, 606581, 596696, 597619, 594577, 583963, 572174, 562878, 567883, 572616, 552649, 532791, 521026, 514738, 504672, 501069, 507276, 520969, 532742, 553861, 598259, 664542, 749039, 823017, 863049, 898160, 922983, 948248, 959871, 975173, 976893, 964709, 961501, 966753, 988438, 996351, 983087, 958972, 917481, 880078, 853619, 822551, 803314, 806540, 810220, 817830, 826271, 817308, 817948, 808843, 789163, 793910, 776344, 771829, 751421, 716626, 706809, 729426, 779101, 844948, 895173, 914483, 935108, 950858, 947739, 948046, 968864, 978324, 970869, 949722, 940347, 929883, 938225, 944822, 949162, 950689, 971437, 991431, 1010007, 1026437, 1049293, 1060501, 1065696, 1085554, 1094159, 1102044, 1127346, 1181520, 1235588, 1288254, 1337006, 1380640, 1414375]
10761A414375L2367J8363J7685L6375M1146N1759M4135M4463L4490M7523M5565
10750A828246N5425N6203O0786M9780O2358P4679R0943R7635R8391J04356J07157
10739B685959J06066J32750J46906J60620J81000K15733J98613K31499K59574
10730D318720L01789K92822L45695L98569M44322N10574N98447O70623P27541
10721H609102Q05018R54332J148437J362002J647545J997581K439337K984343
10713B1947697L686330M559821N661718O959601Q331222R489737R806742Q598466
10705G9041334N581785J359681k835444n894375p424538p601721o889697n706212
10697D9630813m342378k986287j679404m27235P84397J915731K921820L648707
$$ y = [1414375, 1446742, 1465105, 1482790, 1519165, 1560311, 1612070, 1656205, 1700668, 1735158, 1782681, 1828246, 1883671, 1939874, 2000660, 2050440, 2112798, 2187477, 2278420, 2376055, 2474446, 2578802, 2685959, 2792025, 2924775, 3071681, 3232301, 3413301, 3629034, 3827647, 4059146, 4318720, 4620509, 4913331, 5259026, 5657595, 6101917, 6612491, 7210938, 7881561, 8609102, 9414120, 10368452, 11516889, 12878891, 14526436, 16524017, 18963354, 21947697, 25634027, 30193848, 35855566, 42815167, 51146389, 60636126, 70442868, 79041334, 84623119, 85982800, 83147356, 77252981, 69828443, 62226722, 55337025, 49630813, 45288435, 42302148, 40622744, 40195509, 40979906, 42895637, 45817457, 49466164]
10689D9466164L912886L607192K741225J543854M16450k45707j55571O79285J995551
10680F3961329L532131M980297O032770O311936N423692L309695L65635k667650
10672I1249835m978963o103639o075129n193822l819299k273356q95559J174K0066
10663F1931308q29434k088210l194717l836039l917532l538438k809806j900285
10655C9816847q89075J63761J283866K420468L606344M785570N834764O428895
10647F3451440O230720M827966K153143j295472m572441o883614p909953p842393
10639D8159396p129039o166886n170522m277639l507684k876928k337753j898298
10631A4794647j571195j400866j349696j267742j080918q74231p02994n84520
$$ y = [49466164, 53379050, 56986242, 59727467, 61271321, 61687771, 61442064, 61286493, 61965778, 63961329, 67493460, 72473757, 78506527, 84818463, 90242155, 93551850, 93917485, 91249835, 86270872, 80167233, 74092104, 68898282, 65078983, 62805627, 61910068, 61911242, 61931308, 61101874, 59013664, 55818947, 51982908, 48065376, 44526938, 41717132, 39816847, 38927772, 39091533, 40375399, 42795867, 46402211, 51187781, 57022545, 63451440, 69682160, 74510126, 76663269, 75367797, 70795356, 63911742, 56001789, 48159396, 41030357, 34863471, 29692949, 25415310, 21907626, 19030698, 16692945, 14794647, 13223452, 11822586, 10472890, 9205148, 8124230, 7249999, 6547005, 5962485]
10623E962485n03629m24712l58330l25930k90929k61823k48530k09478j91135
10614C147989j64380j47641j26328j09946q4190q1423q4940o3380l3555p766L322
10603B247762J2259J6372l173l7776q4583r8085r2342r7395j24021r9590o0314
10592A579114n4974n9170n5701m8457l8758l6279k8176k8496k7164j4701j2204
10581A175034L536J0774O241j5742j2302j6263j8847l4023k2648j9666R646J5482
10569A081222J2626J6434M3715N2737N1024J7931j6882n3121o0898o1018l5956
10558A047814l39J9053j0680j8204k8943k9723j4446j6854j6690o944J141P583
10546I32768J7060K1585J3694K6931j1646P427J0716J8714K8151K9607L3977L2117
$$ y = [5962485, 5458856, 5034144, 4675814, 4349884, 4058955, 3797132, 3548602, 3339124, 3147989, 2983609, 2835968, 2709640, 2599694, 2515504, 2434081, 2349141, 2285761, 2252206, 2244440, 2247762, 2260021, 2276393, 2273220, 2235444, 2150861, 2052776, 1960434, 1863039, 1739018, 1639428, 1579114, 1524140, 1464970, 1409269, 1360812, 1322054, 1285775, 1257599, 1229103, 1201939, 1187238, 1175034, 1178570, 1189344, 1195585, 1179843, 1167541, 1151278, 1132431, 1098408, 1075760, 1056094, 1065740, 1081222, 1093848, 1110282, 1153997, 1206734, 1257758, 1275689, 1258807, 1205686, 1144788, 1083770, 1047814, 1047475, 1066528, 1055848, 1037644, 1008701, 978978, 964532, 947678, 930988, 924044, 925185, 932768, 949828, 971413, 985107, 1012038, 1000392, 1007819, 1018535, 1037249, 1065400, 1095007, 1128984, 1161101]
10534A161101J7995J8891K6846M8325J3141R896Q690O742J9867M1985L3349J3467
10522A420295o117j2895k3688j8085J245M200L1660P1260J08025J31112J38935
10511A845947J53788J13907R6442J03634J29111J52534J69321J84592J87183K04729
10501C341188K52873L22615L89684M19056M36305N06078O50917Q65359J121682
10492H305757J308041J274561R80173Q23688J056764J564916K169294K890020
10484B0373214L808576N053762O622269Q656521J1712187J7187543K7501344M5924977
10476A46840393P4263272J01234659R0534448J9634700o0176125r0457133p9740983
10469B02133231n8166845m0000014k7165942j8599694j3085022r505234p012205
$$ y = [1161101, 1179096, 1197987, 1224833, 1273158, 1286299, 1296195, 1304885, 1311627, 1331494, 1373479, 1406828, 1420295, 1414178, 1401283, 1377595, 1359510, 1360755, 1364955, 1396615, 1467875, 1575900, 1707012, 1845947, 1999735, 2113642, 2210084, 2313718, 2442829, 2595363, 2764684, 2949276, 3136459, 3341188, 3594061, 3916676, 4306360, 4725416, 5161721, 5667799, 6318716, 7184075, 8305757, 9613798, 10888359, 11868532, 12692220, 13748984, 15313900, 17483194, 20373214, 24181790, 29235552, 35857821, 44514342, 56226529, 73414072, 100915416, 146840393, 221103665, 322338324, 412872772, 432507472, 372331347, 281874214, 202133231, 143966386, 103966372, 76800430, 58200736, 45115714, 35610480, 28598275]
10462B8598275n216504l873426k854671k162166j603220j164357r37486r89952
10454I796493j113264j084009r33471p90469o59943n25435m05014l20085k73362
10445C691441k65883k53794k25791j75895j51592j14398j22468j45106j45430
10436B091084j26838j09427r6890p9315p6772p3634p3949r0575j02465p9580q6809
10425A094830p8110p1898m1188r748k3513j6188l7351n9824m6270k4014j1178
10414F75548r605r399j5048k0592r921o753k3542k7733l4083k5586k5572k6516
10402D41198p199j0635J828M123J156Q506k185k3454m0780m7509l4604j2106j1190
10389B67149J4236J5873N88j7068k1982j8579N10l313J0448J5208J4009L893p371
$$ y = [28598275, 23381771, 19508345, 16653674, 14491508, 12888288, 11723931, 10786445, 9796493, 8683229, 7599220, 6665749, 5875280, 5215337, 4689902, 4284888, 3964803, 3691441, 3425558, 3171764, 2945973, 2770078, 2618486, 2504088, 2381620, 2236514, 2091084, 1964246, 1854819, 1757929, 1678614, 1601842, 1528208, 1454259, 1363684, 1261219, 1181639, 1094830, 1016720, 944822, 903634, 893886, 870373, 854185, 816834, 757010, 710740, 686726, 675548, 665943, 656544, 641496, 620904, 610983, 604230, 580688, 552955, 518872, 493286, 467714, 441198, 433999, 423364, 425192, 429315, 430471, 438977, 436792, 413338, 372558, 325049, 290445, 278339, 267149, 281385, 297258, 297846, 280778, 258796, 240217, 240727, 237414, 247862, 263070, 277079, 280972, 273601]
10376B73601l0238k6871k4675j0482J130K010Q078J7431J5532q115k0885j1652
10364A84864n100J0747O869j911j1781j3704q72o820J5742J9726j675N693J5466
10351B17244K1038M5087K9824O129r103l0983k7510k9807o514L389p847j4887
10339A96060Q78j877N162n393k544j6327k9711j1076k054k5598k4676l3314q197
10326D1333J1140J526J5474K5379K3163J5958o2648j63991k44432k19094r1418
10315f47610L1447P8095N9712L3837L4264L7327L4433J9531J2468J3055J3719
10304b79722j0212m235J5626L892J798J6518P964j1967k9177l6839j1672k1978
10292c60004p325k0094k0397k7590m8427o6982q2936q7443J2155K51279M57226
$$ y = [273601, 243363, 216492, 191817, 181335, 182465, 184475, 192553, 209984, 225516, 217401, 196516, 184864, 179764, 190511, 197380, 195469, 183688, 169984, 169112, 162292, 178034, 197760, 196085, 201778, 217244, 238282, 283369, 313193, 319322, 310219, 279236, 251726, 221919, 215405, 218794, 210947, 196060, 196938, 195061, 200223, 194830, 192286, 175959, 146248, 135172, 133118, 107520, 82844, 49530, 41333, 52473, 53999, 69473, 94852, 118015, 133973, 71325, -92666, -337098, -556192, -647610, -616163, -538068, -478356, -444519, -410255, -372928, -338495, -318964, -306496, -293441, -279722, -289934, -294169, -278543, -274651, -272853, -256335, -248371, -260338, -289515, -326354, -338026, -360004, -367329, -387423, -407820, -435410, -483837, -550819, -633755, -721198, -709043, -457764, -538]
10281e38M36449K62280J15873K3630k1403m2748o8272q0876m4576k7958l7979
10270E13882l5098l1040k4342O440J1554K7216K7671J5984q05o876j1492j1290
10258D81804q042M399M206J8446K4457K2906K3291R872j1782k1745k1983p123
10246E18706r432k0606k4266j3529j8869j6542j6461j0112o090j4028k0156j5415
10234C33200k7250k2374j3071j0832m399M035O417N914K1590L9787M0823K6592
10222D00432J2443J8697K836j628q751l9558m2293l6158m6242m0687j5948j6134
10210A87009j3422j5255j5959j0547j4411q236p131k905r720k1849r892J3738
10198G1420J6141J8915J5430J326j5934r763k284P207M852j036j8736J620O459
$$ y = [-538, 435911, 698191, 814064, 837694, 816291, 773543, 705271, 624395, 579819, 551861, 513882, 478784, 447744, 423402, 429842, 441396, 468612, 496283, 512267, 511462, 504586, 493094, 481804, 473762, 478161, 482367, 500813, 525270, 548176, 571467, 581339, 569557, 547812, 525829, 518706, 509274, 488668, 464402, 450873, 432004, 415462, 399001, 388889, 382799, 368771, 348615, 333200, 305950, 283576, 270505, 259673, 255274, 259309, 265726, 271640, 293230, 333017, 373840, 400432, 412875, 431572, 434408, 432780, 424029, 384471, 342178, 306020, 259778, 219091, 203143, 187009, 173587, 158332, 142373, 131826, 117415, 109179, 102048, 99143, 89423, 67574, 57682, 71420, 87561, 106476, 121906, 123232, 107298, 97535, 95251, 102458, 107310, 106274, 87538, 89158, 95617]
10185I5617L001L854J295L135J9274N5779L1241j4899j4630J294j958j4904j3261
10172A54838N972R838j376J2042O535J2963P683j383J225J760j7849j7108L834
10159A78974O195J4823K2039K4132J7612L3272M0952M7598O5231O3466P3225R3625
10147F81144Q5261R8331R2046J00730J07098J34420J78740K43393L27501M36596
10137B485260N79655Q06283J182807J830246K792757L954546M694919L858339
10129B2184812J058029k224646m046855m137231l390923k486765j750359j216647
10121C989415q82672o51673m64987l29141k55294k00660j60256j14558q3120q3906
10111G63148p9443p9675p8262o7535m8310m6891m5430l7676l5534k6890j4596
$$ y = [95617, 98618, 102472, 103767, 106902, 126176, 181955, 213196, 198297, 183667, 184961, 183003, 168099, 154838, 160810, 170648, 169272, 181314, 187849, 200812, 208495, 207112, 208337, 210097, 192248, 175140, 178974, 185169, 199992, 222031, 246163, 263775, 297047, 337999, 385597, 450828, 514294, 587519, 681144, 766405, 864736, 956782, 1057512, 1164610, 1299030, 1477770, 1721163, 2048664, 2485260, 3064915, 3871198, 5054005, 6884251, 9677008, 13631554, 18326473, 22184812, 23242841, 21018195, 16971340, 12834109, 9443186, 6956421, 5206062, 3989415, 3106743, 2455070, 1990083, 1660942, 1405648, 1204988, 1044732, 930174, 847054, 763148, 683705, 604030, 525768, 458233, 409923, 363032, 317602, 279926, 244392, 217502, 202906]
10100B02906m93j1204j7382j7145r270q512j885J031q302k3527p597J889j2630
10087H7879m653r418j7603j0130Q1J138J3150R475R958N418j2981k483m034o478
10073E9319p722K731L271j3092j209K1014J4983N605J5404R822J963K486J7945
10060A32520L1010L6409L3724M5273N4324O5333Q8725J51887K55902M02646N11113
10049A808866M05151P727l47215m65755l98991k82504j98101j32249q6656n7372
10039B52901n8259o6088n8142m3895k9543n344O556P579J3199Q490Q868j4763
10027B1559j9684k317M755l41j1002O073J1190j4395j4809j4219j2319M154M822
10014c6533M002L110l205r577q035P344J4356L1635K3345J3131R424M984j9759
$$ y = [202906, 202413, 191209, 173827, 156682, 147412, 138900, 137015, 138046, 129744, 106217, 98620, 100509, 87879, 83226, 73808, 56205, 46075, 46156, 47294, 60444, 69919, 79877, 85295, 72314, 69831, 65797, 59319, 51597, 54328, 57599, 44507, 43298, 64312, 79295, 84900, 100304, 110126, 112089, 114575, 132520, 163530, 199939, 233663, 278936, 333260, 398593, 487318, 639205, 895107, 1297753, 1808866, 2214017, 2221744, 1874529, 1408774, 1009783, 727279, 529178, 396929, 310273, 252901, 194642, 128554, 70412, 26517, -3026, -8370, -1814, 5765, 18964, 27454, 36322, 21559, 1875, -442, 4313, 3972, -7030, -957, 10233, -4162, -18971, -33190, -45509, -41355, -36533, -32531, -29421, -32626, -42203, -50238, -42894, -28538, 3097, 26442, 39573, 48997, 53981, 34222]
10001C4222q731j7526k879Q808R73j4644K165M047J2218K3417J016k493K361p822
9987C5132k355J902r663j300m488o282j0603K672J0289L908j3351j0135j968o159
9973a2401p025j3413r024J438P115J3748M938m541l422n402Q744m650j259O512
9959a8642j682q119q064K314j613M788k056p392k094l32n797j7133j0990L851
9945g2961M08p645j16n59J308R011J9236K0439K0336J7181O631J628j0708k477
9931A712P084q457p427j5420J179K3185J2237J3074J3526j1019q023j3062j0806
9918b217J1281o175j1000p906j913r057O650J1022K148L213k132N766R070M302
9904A3052o141o203n381j1699r424O967Q505m383m461l744P638n240M257K06M443
$$ y = [34222, 25491, 7965, 5086, 13894, 14867, 223, 2388, 6435, 18653, 42070, 43086, 40593, 42954, 35132, 32777, 34679, 25016, 23716, 19228, 12946, 2343, 5015, 15304, 19212, 5861, -4274, -6242, -12401, -19426, -32839, -41863, -40425, -33310, -19562, -14624, -19165, -22587, -27989, -19245, -23895, -25154, -18642, -20324, -28443, -36507, -34193, -35806, -31018, -33074, -40466, -42560, -42892, -48689, -65822, -76812, -72961, -72553, -80198, -80314, -80873, -79565, -70554, -51318, -30879, -10543, 6638, 13269, 14897, 4189, 1712, 8796, 339, -7088, -22508, -21329, 1856, 14093, 27167, 40693, 29674, 21651, 8589, -2217, 9064, 2889, -8111, -16017, -17930, -26987, -20337, -9315, -7167, -3954, -6086, -320, 8750, 13052, 6911, 708, -4673, -16372, -25796, -18829, -10324, -14707, -19168, -22912, -15274, -20514, -16257, -16051, -11608]
9889a1608J4135J0617q5J635j1945j1461q59q727o731J2659J5538k497n669O791
9875A793J1825L363k2656n958N682N866p281P749m481p648Q444K404m422J826
9861c494J422r520q364M37J2374K75n612N928M194R527j1278p314L137j2677O151
9846a4814N501P782M578J433r237o077K25P730J994L886j529q064m43L819O414
9831C198N734q41q526j425m331L734m490j4653l72J2096N933J2869J411j331o742
9816B264j3393n280p797r144j07m426j775m07J2502L785M294K449L93L84J6207
9801e1P430j2613L629J0570k1656l631K084K521r587j5746k28J2152O924K230
9787a5972o035l120J2838J1988K44j0624p278k288K779J421j7378J0289J4366
$$ y = [-11608, 2527, 13144, 13059, 14694, 2749, -8712, -9571, -18298, -25029, -12370, 3168, 671, -4998, 1793, 13618, 16981, -5675, -11633, -5951, -85, -7366, 383, -4098, -11746, -3302, -898, -5320, -3494, -2072, -11592, -19956, -19519, -7145, -6870, -12482, -6554, -2360, 7167, -4111, -11425, -8288, -20965, -14814, -9313, -1531, 3047, 4480, -4757, -10834, -10609, -2879, -885, 3001, 1472, -6592, -7035, -3216, 3198, 8932, 8091, -435, -1860, -6191, -2457, -6947, -21600, -21972, -9876, -3943, 8926, 10337, 9006, 2264, -11129, -16409, -24206, -33350, -33457, -37883, -39658, -40065, -27563, -23778, -19484, -17035, -16642, -16258, -51, 7379, -5234, -1605, 8965, -12691, -16322, -14238, -11717, -21304, -37050, -37278, -25126, -18202, -15972, -22007, -25127, -12289, -301, -57, -10681, -17959, -20247, -17468, -16047, -33425, -23136, -8770]
9774h770K483l949L215P773Q616K880j0803j8481j6202m327J1051J7101m180j2399
9760b5992k879o46L27L181J2826J3441r19m710R78o490J1236L443n217j301j1290
9745a4012n304L913j0738j579P461J1339K422J159j5199L19r887L136J3878j865
9731a4957k11k819j2678N510L45M984O141l422J0565K10M789J004J0399l479J2728
9716A9109l853o658N626M044J1821K231j1110j620J6255J1045L386K2885k0j0880
9702F2261j6341r662p665l539M567j1619j8377L335q133O147o194k117o714q246
9688b2297K179m357r556J75J6948J3690R421r558j5122J459M188l965N553J1005
9674b37l654R79p557K376J902q559l841k0855l036R673L299Q571M631l051J334
$$ y = [-8770, -6287, -10236, -7021, 752, 9368, 12248, 1445, -17036, -33238, -37565, -26514, -9413, -13593, -25992, -28871, -29517, -29190, -26009, -13183, 258, -661, -5371, -4393, -10883, 353, 3796, -1421, -2722, -14012, -19316, -15403, -26141, -27720, -20259, -8920, -6498, -5339, -20538, -20219, -30106, -26970, -13092, -14957, -15168, -17987, -30665, -25155, -24810, -19826, -13685, -17107, -6542, -6332, -1543, -539, 9860, 6381, 19109, 15256, 8598, 14224, 18268, 30089, 32320, 21210, 19590, 35845, 46890, 50276, 73161, 73141, 62261, 45920, 36258, 28593, 25054, 29621, 18002, -375, 2960, -5173, 974, -5220, -7337, -14051, -22297, -20118, -24475, -34031, -33856, -16908, -3218, 6203, -3355, -18477, -17018, -12830, -16795, -11242, -237, -3891, -2912, -10469, -8093, -6191, -14750, -18591, -39446, -42482, -32809, -29510, -20939, -16308, -19359, -18025]
9659a8025K475k236M171J1775J1872j795r378n005j0531k468o941J179J6803N242
9645b862j3846m539J4649J1638r870j1014m331K2890Q518j1358N005j825q541
9632e486P813q35j3995j1786P145Q566M840K0984o55k3252m902N421K750M507
9618A115j2993M08M754q64M330J164M905J972n518p000J2605J3667j5032j0442
9604f929j1911L733j78m237j0208R687J115L515K2354Q425J1610q93k1275j2099
9590g291l647J1906K1379k116o053j1192j8500r038O57J7520O33J418O534R668
9576A1878m040L962L86J1149K160L295j3344n493m69m893j1944K449J4177p185
9562B088N725j2226M976J603j6370Q77L305J589n308J4300M149n064J287j154
$$ y = [-18025, -15550, -17786, -13615, -1840, 10032, 8237, -1141, -6146, -16677, -19145, -26086, -24907, -8104, -2862, -16708, -21247, -6598, 5040, -4830, -15844, -20175, 2715, 11233, -125, 4880, 3055, -5486, 2327, 1492, -12503, -24289, -17144, -8578, -3738, 17246, 16591, -6661, -11563, -6142, -3392, 1115, -11878, -11470, -6716, -7580, -3250, -2086, 2819, 4791, -727, -7727, 4878, 18545, 3513, -6929, -18840, -15107, -15285, -19522, -29730, -20043, -18928, -15413, 6941, 15366, 26976, 26083, 4808, -7291, -10938, 968, 22347, 20231, 14178, 2986, -15514, -24552, -23895, -6375, -5742, -4324, 2210, 11878, 7838, 11800, 12186, 23335, 25495, 28790, 15446, 9953, 9484, 4591, -7353, -4904, 9273, 2088, 7813, -4413, 563, 2166, -14204, -13327, -10022, -8433, -13741, 559, 4708, -356, 931, -223]
9548b23k564m501l806P364R804R744L952j2930j1233J4207J7568p742n101k508
9534A2031l905j4007j8673k634L699j922J929o62J9488K2046L738n452P456j5656
9520G476j1213Q236J288k605P754P488q052M633j562R78k0721l475m330N770J2774
9505D439R975M405N347P506K932j4256q101N445Q47j054J0021m622P43Q603j6103
9490A6127n283j1463m292N918J2964Q280q900r128J0323P844K112l2j0338Q591
9476B2723K0459J0023o7j1638m457j2482n162M5P451J0764k34j5924j3530r921
9462a950n136n142M937J066K685J258m830L273L061l558m488M598M796N130j706
9447C994l680Q277K278K340N814M022m341l450J4805K653M360j9552k887J75N324
$$ y = [-223, -2787, -7288, -11094, -3730, 6074, 15818, 19770, 6840, -4393, 9814, 27382, 19640, 14539, 12031, 8126, -5881, -24554, -27188, -23489, -25411, -23482, -24144, -4656, 17390, 21128, 15676, 23132, 7476, -3737, 4499, 5787, 3182, 10936, 18424, 10372, 15005, 13443, 14421, -6300, -9775, -14105, -8335, 4439, 14414, 18819, 24166, 31672, 34604, 20348, 12247, 17692, 18539, 17485, 27506, 22884, 23627, 32230, 16127, 10844, -619, -4911, 1007, 13971, 22251, 13351, 4223, 14546, 22390, 24502, 24470, 14132, 22723, 43182, 53205, 53138, 41500, 37043, 24561, 19399, 19444, 26895, 37659, 37425, 21501, 7971, -1950, -7086, -12228, -7291, -6225, -3540, -2282, -7112, -3839, -778, -4336, -8824, -4226, 570, 5700, 3994, 314, 8591, 10869, 13209, 19023, 23045, 18704, 15254, 30059, 32712, 37072, 17520, 14633, 14808, 20132]
9432B0132o61J752l274n345l663J3522J0231p569L143m089L582J0354j0927l398
9418B3790l250O633J761r099M812j2105r979O799J9293P404k536J0006k760o220
9404C4549n087o796K121l64m737J726O217o643k204q299K125Q025M560k894R296
9389C1595J143j0900p761J627r174O093Q366N34J28n647l71l175M248J5282O888
9374C8876j2304j1869k606p719o158l590M519j64p2k11l608Q616K753J9603p649
9359A8417J813j7968L710J2024K902k294m727J0107M376P908j2612o569j5299
9346A788J8050J383J2359J1665J2910J1138p369j3310n086r435K543K0715p464
9333D9887o860j0215j7658M742J0391M687J4283j490p16o557O410Q004l850p655
$$ y = [20132, 19471, 21223, 17949, 12604, 8941, 22463, 32694, 25125, 28268, 24179, 27761, 38115, 27188, 23790, 20540, 27173, 28934, 19835, 24647, 12542, 2563, 9362, 28655, 36059, 33523, 43529, 40769, 34549, 29462, 22666, 24787, 24423, 19686, 21412, 27629, 20986, 18782, 10483, 12608, 20633, 25193, 22299, 31595, 32738, 21838, 14077, 15704, 6530, 12623, 20989, 21523, 21651, 16004, 15633, 12458, 16706, 31988, 38876, 26572, 14703, 12097, 4378, -1780, -5370, -851, -1015, -1087, -1298, -4906, 3710, 6463, 26066, 18417, 20230, 2262, 5972, 17996, 20898, 18604, 13877, 23984, 28360, 36268, 23656, 17087, 1788, 19838, 21221, 33580, 45245, 58155, 69293, 61924, 48614, 43528, 34093, 36636, 57351, 49887, 43027, 32812, 15154, 19896, 30287, 34974, 49257, 47767, 47051, 40494, 46904, 54908, 51058, 43403]
9319D3403J246J413Q552O767q60k940k0474J484J1626O430J3721q007j6430j7836
9305B8095n542K432J988r397R273P161k995j1138N42J1396J0813K903r529J1704
9291D7706L557n85q7Q992O55R125m766j1296m652r699p346K1339J3987m628q361
9276E3941p527q021o987k258R931P003J13m599j1121j221M488o099k782P047K286
9261C4194l440k739L826J2476K507l027L292O947Q580j546J1857O416p92n220
9247G3331o430j0050j1915p072K607p954K820J6220R869K928N327j022R445M443
9233H2547R720k540j0782j0879l751j2151k4690K3858J4191l096j0922j128J6374
9220F6751M453l262j6347j5069k724J202r741N016P881Q5J9347m596J1253M312
$$ y = [43403, 44649, 46062, 54614, 61381, 60521, 57581, 37107, 38591, 50217, 56647, 70368, 62361, 45931, 28095, 22553, 24985, 26973, 17576, 26849, 34010, 31015, 19877, 20419, 31815, 42628, 45531, 36002, 47706, 51263, 50678, 50591, 59583, 60238, 69363, 64597, 53301, 48649, 38950, 31604, 52943, 66930, 62302, 53941, 46414, 38393, 31406, 29148, 39079, 46082, 46195, 41596, 30475, 29254, 33742, 27643, 24861, 31908, 34194, 30754, 28015, 31841, 44317, 46824, 43797, 47089, 54036, 62616, 61070, 72927, 79343, 78551, 73331, 66901, 56851, 44936, 37864, 40471, 32517, 35337, 51557, 61426, 64354, 69681, 68659, 78104, 82547, 92267, 89727, 78945, 68066, 64315, 52164, 27474, 51332, 65523, 62427, 51505, 50377, 66751, 71204, 67942, 51595, 36526, 33802, 35004, 25263, 30279, 38160, 38245, 57592, 52996, 64249, 68561]
9206F8561J523n175J0546j47Q908n787j1348K829O696l054n423M900J857j1733
9192F3153j1476N989R120R243L591j2163m976O279J5493R685p64q567n879N349
9178H4077n541p029L586R851j76q434p952j118n642n354j489O211J2576j522P58
9163G2802N293k561q023J55K0537R000q766P177l942o917O833K144R749r097k2990
9148G1394j3080Q501J2743J2522j646M782J628O951j0462m983K1605P568k671
9135A14852L888j06p943j2693J823M973J0995N133p442j934J4483J4001j2177
9122A27853n411k0510K104N402N507Q488K1867l104j0092j4444l913j2241n375
9109I6131J4708M764J169J0339j1823j6585N519J5650L46J436L576L628J0391
$$ y = [68561, 70084, 64909, 75455, 75308, 84216, 78429, 67081, 69910, 76606, 73552, 68129, 73029, 74886, 63153, 51677, 57666, 66786, 76029, 79620, 67457, 62481, 68760, 84253, 93938, 93174, 84607, 78728, 84077, 78536, 71507, 75093, 84944, 84768, 76334, 68382, 67264, 61622, 56268, 54779, 60990, 73566, 72044, 72802, 78095, 75534, 67511, 67666, 88203, 97203, 88437, 95614, 91672, 84755, 91588, 93732, 103481, 94384, 71394, 58314, 66815, 79558, 92080, 90434, 95216, 96844, 103795, 93333, 88350, 109955, 117523, 114852, 118740, 118634, 110691, 97998, 99821, 104794, 115789, 120922, 113480, 111546, 126029, 140030, 127853, 122442, 101932, 104036, 109438, 114945, 123433, 145300, 142196, 132104, 117660, 113747, 101506, 96131, 110839, 115603, 116772, 127111, 115288, 98703, 104222, 119872, 120218, 121654, 125230, 128858, 139249]
9096A39249o404k465J567j084J684j9046j0056k57J328J0039K695M942K29j996
9082A20425M763J779n218j7041P266J6352j9727k5120k083O727J0103J2452K0440
9069A31118N526L363J4297R448o672O629N564p609j0916l717j62j7031O603R717
9055A46158K825j6705j508J0919R246K807J261J595p346j0623m968n173M714K647
9041A35849L962J1194N785k399m316j174K200J0460L995m059j419n362N665J2039
9027A72420k875J0522M373K485k147j989J389J4860O512J146J690l051K33n294
9013B00274m931k652k187j1055n437P018j924k515M767O301Q421K507l929j2773
8999A81885N305K5591k803j6795Q011R760j0141L704J0495P183k514N308J556
$$ y = [139249, 132845, 130380, 131947, 130863, 132547, 113501, 103445, 103188, 104516, 114555, 117250, 122192, 122421, 120425, 125188, 126967, 121749, 104708, 111974, 128326, 108599, 83479, 81396, 88123, 98226, 110678, 131118, 136644, 140007, 154304, 163752, 157080, 163709, 169273, 161664, 150748, 147031, 146869, 129838, 136441, 146158, 148983, 132278, 130770, 141689, 150935, 153742, 155003, 156598, 149252, 138629, 133661, 128488, 133202, 135849, 139811, 151005, 156790, 154391, 150075, 148901, 151101, 161561, 165556, 161497, 160078, 154716, 160381, 172420, 169545, 180067, 184440, 186925, 184778, 182789, 184178, 199038, 205550, 206696, 208386, 205335, 205568, 200274, 195343, 192691, 190504, 179449, 174012, 181030, 179106, 176591, 181358, 187659, 196080, 198587, 194658, 181885, 187190, 212781, 209978, 193183, 201194, 210954, 200813, 204517, 215012, 222195, 219681, 224989, 226545]
8986B26545l945n835R526R860m036r137L313J3213P562J232j442j3145j2677l60
8972B20674J1813k59J9540J7599j074j203l524m191J579R55k264n493j895J3215
8958B65472l817j0857J2623K2573K3584o497k0938m876J7616Q878k457k946J2765
8945C11123J4925j3575q981j0012P75J5115l402l173R726J1694J456M920J7510
8932C48101O352P80j778Q84J3008P063m644j0577p492M783O618N270J4656m426
8918C78598K319L347J1084K769K842R825Q20p124O814O327q871J526O568L335
8904D20179j0844M436J6353R933J3131O839J562l694P667m746O980Q063m7J0081
8890D85893K0793M668m39J2414N944r232K861J4759K0352n211p536R928P756M305
$$ y = [226545, 222600, 216765, 226291, 236151, 232115, 222978, 226291, 239504, 247066, 248298, 246856, 233711, 221034, 220674, 232487, 232228, 251768, 269367, 268293, 267090, 263566, 259375, 260954, 261909, 259645, 254152, 252257, 265472, 261655, 250798, 263421, 285994, 309578, 303081, 282143, 277267, 294883, 303761, 301304, 298358, 311123, 326048, 312473, 303492, 293480, 294255, 309370, 305968, 302795, 312521, 324215, 325671, 330591, 348101, 354453, 355233, 353455, 354339, 367347, 374410, 369766, 359189, 351697, 356480, 363098, 368368, 383024, 378598, 380917, 384264, 395348, 398117, 400959, 410784, 411604, 404480, 411294, 417621, 408750, 410276, 416844, 420179, 409335, 413771, 430124, 440057, 453188, 460027, 461589, 457895, 465562, 460816, 467796, 475859, 475812, 485893, 506686, 511354, 510915, 523329, 529273, 520041, 522902, 537661, 558013, 552802, 545266, 555194, 562950, 567255]
8876E67255J6259J4002k671j2022Q388J4091K4840J4404o667p958p903R151Q448
8863F39617J0944R279R058R529J097Q809P042J786n780J4620K6995K0567J3970
8850G67533N278n674l697j5927K2295J6382L915L833j131M648N065M573L549K2339
8836H32981K6215P780J4547J7650J1542P320M085Q510N272J3145N721J8020J7058
8823I89846J3047J4149q30P269M461N357M312R496K1480M1898J5159P822J5934
8810A149400J3218O441J1716J4242K7753J9363O345N10R954K8890K8525K5521
8798A341878J8933K5233J6103N132J2202P847K7660L4409J6128K0295K4534K7949
8786A578303K5715K4487J6418J7271K2122L0871L6209L1178L3796L8298K2357
$$ y = [567255, 583514, 597516, 594845, 582823, 591211, 605302, 630142, 644546, 637879, 629921, 622018, 631169, 639617, 650561, 659840, 668898, 678427, 679524, 688333, 695375, 697161, 691381, 706001, 732996, 753563, 767533, 772811, 767137, 763440, 747513, 769808, 786190, 790105, 793938, 792807, 797455, 802520, 807093, 810642, 832981, 859196, 866976, 881523, 899173, 910715, 918035, 922120, 930630, 935902, 949047, 954768, 972788, 989846, 1002893, 1017042, 1016212, 1023481, 1027942, 1033299, 1037611, 1047107, 1068587, 1110485, 1125644, 1133466, 1149400, 1162618, 1169059, 1180775, 1195017, 1222770, 1242133, 1248478, 1248988, 1258942, 1287832, 1316357, 1341878, 1360811, 1386044, 1402147, 1407279, 1419481, 1427328, 1454988, 1489397, 1505525, 1525820, 1550354, 1578303, 1604018, 1628505, 1644923, 1662194, 1684316, 1715187, 1751396, 1782574, 1816370, 1854668, 1877025]
8775A877025K2547M1635K4995K5770K8241K8532M5115O0213M3317K9357L9607
8764B266354K4734M1085N1255L8254M2675N1268M9938M6244M4917L3994M1559
8753B732277M2039M8304M5476M5107N5969O9261O3510N7309O4739P0435N8026
8742C352452N9789O3552O8183P0420O0988P9390Q5334O0783O8752Q4255R2411
8731D146309R6202Q4093P3692R9976R7040R4923R8679R8570J02474R1826Q8973
8720E172757Q6754R1388R5918J09289J15663J17612J18739J11561J07661J19975
8710F247317J27551J12417J09152J11093J22605J16968J24770J17411J14121J17735
8700G421140J14672J05871J05130J23069J09644J14261R8744R2159R4485Q4541
$$ y = [1877025, 1899572, 1941207, 1966202, 1991972, 2020213, 2048745, 2093860, 2154073, 2197390, 2226747, 2266354, 2291088, 2332173, 2383428, 2421682, 2464357, 2515625, 2565563, 2611807, 2656724, 2690718, 2732277, 2774316, 2822620, 2868096, 2913203, 2969172, 3038433, 3101943, 3159252, 3223991, 3294426, 3352452, 3412241, 3475793, 3543976, 3614396, 3675384, 3754774, 3840108, 3900891, 3969643, 4053898, 4146309, 4242511, 4326604, 4400296, 4500272, 4597312, 4692235, 4790914, 4889484, 4991958, 5083784, 5172757, 5259511, 5350899, 5446817, 5556106, 5671769, 5789381, 5908120, 6019681, 6127342, 6247317, 6374868, 6487285, 6596437, 6707530, 6830135, 6947103, 7071873, 7189284, 7303405, 7421140, 7535812, 7641683, 7746813, 7869882, 7979526, 8093787, 8192531, 8284690, 8379175, 8463716]
8690H463716P9167P3839P0382P4569P7737O4981N6877L4899K9333L3459K5034
8679I083993K7755J7622o566j0201j1391k1711k4140l0340m5300n2872n3517n8057
8667H815275o6149p6416o0676o7076q5559q6299r1052j10076j01950j00132j09102
8656G860788j15701j33929j17430j01966j04741j15036j20944j23332j22115j11955
8646F693639j20861j34758j12303j17061j29217j24160j13652j15710j11086r5666
8636E519165j01137r6022q9647j08786j01560r3510j03773r5387r5626j04899
8626D528818r3425r7907j10189p3647p5747j00121p9637o6173q3198p6540p8219
8615C594015p3010o8688o2034o5630o3892o5093p3815o3902n5913m6462n4968
$$ y = [8463716, 8542883, 8616722, 8687104, 8761673, 8839410, 8904391, 8961268, 8996167, 9025500, 9058959, 9083993, 9111748, 9129370, 9122804, 9112603, 9101212, 9079501, 9055361, 9025021, 8979721, 8926849, 8873332, 8815275, 8749126, 8672710, 8612034, 8544958, 8459399, 8373100, 8282048, 8171972, 8070022, 7969890, 7860788, 7745087, 7611158, 7493728, 7391762, 7287021, 7171985, 7051041, 6927709, 6805594, 6693639, 6572778, 6438020, 6325717, 6208656, 6079439, 5955279, 5841627, 5725917, 5614831, 5519165, 5418028, 5322006, 5232359, 5123573, 5022013, 4928503, 4824730, 4729343, 4633717, 4528818, 4435393, 4337486, 4227297, 4153650, 4077903, 3977782, 3898145, 3831972, 3748774, 3672234, 3594015, 3521005, 3452317, 3390283, 3324653, 3260761, 3195668, 3121853, 3057951, 3002038, 2955576, 2900608]
8604B900608o9915m7789m6391n3558n3801n6730n0120k9536l9634m4360m3087
8593B365687l2188m1485m8132m3437l7387k7595k8305m2221m3396l7714k8227
8582A955600l0398l5930l2546j3447k1252l8819l8903j7267k4586l9492l8608
8571A624352m1414l5479j6415l6680k0116q464j4040l2310k3533j8821j3866l4554
8559A328660k8891j7151j9848k1741r789m105j4511k3198k3044k5299k4542j3654
8547A102887r383k2365j3411l098j7685j4440j1432k4774l0182j7423o846M962
8535I36810p485p380K956o927k0133j9283j7984n003l2293k1309j3073l134r611
8522G76151j0133R965m972k5419j7288k905m132j0975r479o770j2935l890m896
$$ y = [2900608, 2830693, 2782904, 2736513, 2682955, 2629154, 2572424, 2522304, 2492768, 2453134, 2408774, 2365687, 2333499, 2292014, 2243882, 2200445, 2163058, 2135463, 2107158, 2064937, 2021541, 1983827, 1955600, 1925202, 1889272, 1856726, 1843279, 1822027, 1783208, 1744305, 1727038, 1702452, 1662960, 1624352, 1582938, 1547459, 1531044, 1494364, 1474248, 1465784, 1451744, 1419434, 1395901, 1377080, 1363214, 1328660, 1299769, 1282618, 1262770, 1241029, 1231240, 1227135, 1212624, 1189426, 1166382, 1141083, 1116541, 1102887, 1093504, 1071139, 1057728, 1054630, 1036945, 1022505, 1011073, 986299, 956117, 938694, 931848, 936810, 929325, 921945, 924901, 917974, 897841, 878558, 860574, 855571, 823278, 801969, 788896, 785762, 776151, 766018, 775983, 771011, 745592, 728304, 725399, 721267, 710292, 700813, 694043, 681108, 677218, 672322]
8509F72322l693l1289j5787k284n800j0505j3338j4308L66J668j4251j6424o53
8496E46024P105p574j2438o275k158n141p886p223N76k343j9568L640O685j1243
8482D82181k0051p045j1659Q20J0652m324J4924k310r073l563j5027j0510K997
8469D28012K8763J4357j4182j0261j2652j5830n75l458m831q519j164j998Q444
8456D06106j0385j9340K76L481q460j902J5840M210j9517j4537q445n28l852L044
8442C45991j2623m038j3509K874P445K234J368r257j1557J2987j531j5748N677
8429C10313J0988j3991r306m931N754J7819l516j1998j0231j1904k589J2806J9091
8416C08305n0k440m279j3923q592J066r779j6028j9222p826O514J6180P341L828
$$ y = [672322, 668629, 637340, 621553, 619269, 613469, 602964, 589626, 575318, 575684, 577352, 563101, 546677, 546024, 553129, 545555, 533117, 526842, 524684, 519543, 511657, 504434, 505010, 502667, 483099, 486739, 493424, 482181, 462130, 455085, 443426, 444246, 454898, 450574, 465498, 463188, 454115, 450552, 435525, 425015, 428012, 456775, 471132, 456950, 446689, 434037, 418207, 417632, 414174, 409343, 400824, 399660, 397662, 406106, 395721, 376381, 376657, 380138, 371678, 369776, 385616, 389826, 370309, 355772, 347327, 346799, 342947, 345991, 333368, 329330, 315821, 318695, 326140, 328374, 329742, 320485, 308928, 321915, 320384, 304636, 310313, 321301, 307310, 298004, 293073, 298827, 316646, 313130, 301132, 290901, 278997, 276408, 289214, 308305, 308255, 305815, 301536, 287613, 279021, 280087, 270308, 254280, 235058, 227232, 233746, 249926, 257267, 261095]
8402B61095K204o723j3166O3K278O842J098K947K436l314j2246r63j5108L396
8388B30839J6178O249p086k8691j3447l324R629K6190Q246j0997j5975m745Q688
8375B21754N643n717j0319p499j94j460n476K916n577R04k278L356K524l6503
8361A62074j5325k108O590J4389K103J102q633J3551R588M780p82j7183r938o421
8347A53787k8O40k555n289J1667P398j3278j4255J593J6393n910r139J4375P983
8333A63382k710J969p101l481K745p200j7244L630P154m631M677N707J8555J6960
8319A82412Q099j1185r764n274k121k622j1219k39J892R27M629k3703j6161o295
8305A09376P766Q801j4097M808P390O712o345k310o308j0727k353J375p704p910
$$ y = [261095, 263299, 256576, 243410, 243473, 245751, 252593, 253691, 256638, 259074, 255760, 243514, 242551, 227443, 230839, 247017, 253266, 246180, 217489, 204042, 200718, 210347, 236537, 244783, 233786, 217811, 213066, 221754, 227397, 221680, 211361, 203862, 203668, 202208, 196732, 199648, 194071, 194975, 192697, 196053, 198577, 162074, 146749, 144641, 151231, 165620, 167723, 168825, 160192, 173743, 183331, 188111, 187329, 170146, 160208, 153787, 153759, 154399, 151844, 146555, 158222, 165620, 152342, 138087, 139680, 156073, 150163, 141024, 155399, 163382, 160672, 162641, 155540, 152059, 154804, 147604, 130360, 133990, 141144, 136513, 141190, 146897, 165452, 182412, 190511, 179326, 169562, 164288, 162167, 159545, 148326, 148087, 149979, 150906, 155535, 131832, 115671, 109376, 117142, 125943, 111846, 116654, 124044, 130756, 124411, 122101, 115793, 105066, 102713, 104088, 96384, 88474]
8291H8474K503K137k815J4542J8404j691m012J8614J4916M827n081j3657o987
8278A30174M577N339L174j6070r798L167L445j6058j5161p637J0768Q376q185
8265I6111j3571j1523R882M979m401n351j9924O458N721J696O589n396L570J6235
8251I1075o72M273j510k78j3775n475K0848J5740J4174Q038M004o688R27j4052
8237A16629J285M53j5300O44p249j1107j538j879K653q644j9625J1299J350K508
8223G1479j443l92j36J889L699N755O005j3834L847J873p402k642Q383M79l411
8208G4149q820j377N039M079K121l874Q42K415M049Q112R280o931p01r354j8135
8193F0894k1788n574J0441N720j5630j3167J671O612J7729J1527L491j5745K208
$$ y = [88474, 90977, 93114, 90299, 104841, 123245, 121554, 117542, 136156, 151072, 155899, 150818, 137161, 130174, 134751, 140090, 143264, 127194, 117396, 120563, 124008, 107950, 92789, 85152, 95920, 104296, 96111, 82540, 71017, 80899, 85878, 81477, 76126, 56202, 62660, 68381, 70077, 76666, 71270, 74840, 91075, 90403, 94676, 93166, 92888, 79113, 73638, 94486, 110226, 124400, 132438, 136442, 129754, 130681, 116629, 117914, 118367, 103067, 103711, 96462, 85355, 83817, 81938, 84591, 75947, 56322, 67621, 68971, 71479, 70036, 69644, 69508, 71397, 75096, 80851, 86856, 73022, 76869, 78742, 71340, 68698, 77081, 77560, 74149, 65329, 63952, 68991, 73070, 75191, 71317, 72159, 74574, 78623, 86735, 96015, 89084, 88383, 79029, 60894, 39106, 33532, 43973, 49693, 34063, 20896, 22567, 29179, 46908, 58435, 61926, 46181, 48389]
8180D8389K2939J7777j2427m898j95q868r628M755J3755J867p645L538K296M856
8166G6511p585n856p249J389M00N561l454m9J031q150K993L778p2j607N28r786
8150D8383k2413L310J6565Q9n380M421J0990K311j1049j383N355n190j874j889
8136D2246P077O383J386q164j571m965J648J5048k242r221r076o774M599O912
8122D3286P283R322O41l581l208j2689N607J759j3834J224J2490p829j4943j0918
8108A4610R205J0200p08m878J2558N823N633j3256M768N152j1996M125j1007J1575
8094D1804Q255m411o596r392j333j555j0424j3119O472J7113J3148m893j0978
8081B4091J1217R4O076q70r956J0784M846L428k187q121J251L52o425K790J4803
$$ y = [48389, 71328, 89105, 76678, 71780, 71585, 62717, 53089, 57844, 71599, 73466, 65821, 69359, 71655, 76511, 68926, 63070, 55821, 57210, 57610, 63171, 59717, 59668, 60699, 52549, 55542, 59320, 59248, 57641, 58169, 48383, 25970, 29280, 45845, 45934, 40554, 44975, 55965, 58276, 47227, 45844, 51199, 46009, 44135, 42246, 49323, 55706, 57092, 48928, 47357, 42392, 44040, 59088, 56846, 47625, 38549, 31775, 36374, 43286, 50569, 59891, 60532, 56951, 53743, 41054, 46661, 48420, 34586, 35810, 48300, 40471, 25528, 14610, 23815, 34015, 33307, 28429, 40987, 46810, 52443, 39187, 43955, 49107, 37111, 41236, 30229, 41804, 50059, 45648, 39052, 29660, 28327, 26772, 16348, 3229, 9701, 26814, 39962, 35069, 24091, 35308, 35402, 41478, 40608, 30652, 41436, 46282, 49710, 47523, 39402, 40653, 41005, 34580, 37370, 52173]
8066E2173p755J679J0545j05J2930r711k7161j2283J6587O41j5911k818L624j237
8052B1198n242J2055j995J005P177j937Q178N154J934j381m043O412l990N856
8038E0381N380m160r040j0745l728p059O003J8221l84j297k553l263o661j2374
8024A8721O299M135m975M246Q647l227j0775k566M864J0689k971k195J0794N172
8010D6858q973J0555O614k048j572O061L73m317k9k349r879j867N539m010r45
7995D0011p147m153J529L403O762O232m130j0962p430l905O079M264P116R913
7981D7582p697q531m246K837Q002O740j8196o54Q383N444J3752J1051j1037j1827
7967D1603j789r21j314q551N694O862j215n582p065j0776J2523M376j225k811
$$ y = [52173, 44418, 46097, 56642, 56537, 69467, 59756, 32595, 20312, 36899, 37540, 21629, 18811, 22435, 21198, 15956, 28011, 26016, 27021, 34198, 32261, 40439, 45593, 47527, 46146, 42103, 48515, 44525, 50381, 55761, 51601, 42561, 31816, 28088, 21029, 27032, 45253, 44869, 43572, 41019, 37756, 31095, 18721, 25020, 29155, 24180, 28426, 37073, 33846, 23071, 20505, 25369, 36058, 33087, 30892, 41686, 46858, 37885, 48440, 55054, 53006, 51434, 57495, 57868, 53551, 53522, 51173, 41294, 39427, 44966, 40956, 40011, 32864, 28711, 30240, 33643, 40405, 46637, 42507, 31545, 24115, 20210, 26289, 30553, 37669, 47582, 39885, 31354, 27108, 29945, 37947, 44687, 26491, 25837, 34220, 39664, 53416, 64467, 53430, 41603, 39814, 38893, 37579, 29028, 34722, 41584, 40369, 34787, 27722, 16946, 29469, 33845, 32620, 29809]
7953B9809J4877P775R653O631n516l831j815n047O16n076N498P000M080J1184
7939G5838n961j0484q038j1309j337p783Q979J2641l762j8661P634J1739j4624
7926C4872q100O333O2q716J0244N277L806j154j925j9635M992J7612N139q049
7912D0758j319j5659m748N254J2523P644m022j613k663O098J5687M114l980r853
7898D8221q977j1901j6960l685Q513L210L342K987N384j696n505l352N276J0561
7884C5418M278L831j39p880j0555r561L860Q761J0806J5685K393M534L167j5327
7870D9271o920j5149O450J68K778q916q161l415J362m016k755O473L56j4673M623
7855G476O988J5324P265r529p018q746p079p276q158P332K1047o0j8121o671J1019
$$ y = [29809, 44686, 52461, 62114, 68745, 63229, 59398, 57583, 52536, 53152, 48076, 53574, 60574, 64654, 75838, 69877, 59393, 51355, 40046, 38709, 30926, 39905, 52546, 48784, 30123, 37757, 49496, 34872, 26772, 33105, 33167, 24451, 34695, 39972, 43778, 42624, 40699, 21064, 26056, 43668, 48807, 40758, 39439, 23780, 19032, 24286, 36809, 44453, 40431, 38818, 36155, 42253, 57940, 62054, 58074, 48221, 39244, 27343, 10383, 6698, 15211, 18421, 21763, 24750, 30134, 28438, 22933, 19581, 24857, 35418, 39696, 43527, 43388, 35508, 24953, 15392, 19252, 28013, 38819, 54504, 56897, 61431, 64598, 49271, 42351, 27202, 33652, 33820, 36598, 27682, 19521, 16106, 17468, 13452, 10697, 17170, 17526, 2853, 7476, 14464, 29788, 37053, 27524, 20506, 11760, 4681, -2595, -10753, -3421, 17626, 17566, -555, -7226, 3793]
7840C793J8299j092K6J3686k310j6041j9273j1120n502L01Q034J3441J4708R535
7826B6485N057K927p964r328n501R296O417Q61k467j124q363j367k091m476j3140
7811d778m636L565Q280N504J031n605j3669J0182J1843Q514J2585K847m872L388
7797C4179j380j4736j6778l072j547j0033J2357J3882J806K709P545n496o528
7784A2908j2649P445R050p418J0357j1321j0308J926J2615p04J1861K64j607j246
7770B1173j0157p780J581m639p378R99J074k364M363J3062N475n102k006J227
7756I528l747O6K607J229o942K060M436j34m952P36O834p575P289j0683p652K010
7740d890N151J2637R983L478N552j7447k6262K324O698J4349J0034l542m103j5758
$$ y = [3793, 22092, 21000, 21026, 34712, 32402, 16361, -2912, -14032, -19534, -19233, -11199, 2242, 16950, 26485, 31542, 34469, 26505, 17177, 11676, 20972, 27389, 28250, 25783, 24659, 16296, 14929, 12838, 8362, -4778, -9414, -5849, 2431, 7935, 8966, 3361, -10308, -126, 11717, 20231, 32816, 35663, 30791, 34179, 32799, 18063, 1285, -1787, -3334, -13367, -1010, 12872, 14678, 17387, 24932, 19436, 12908, 259, 7704, 16754, 9336, 19693, 8372, -1936, -10, 12605, 11901, 23762, 24026, 22419, 21173, 11016, 3236, 4817, 178, -7200, -6201, -5127, -7491, -3128, 9934, 15409, 10307, 8301, 9528, 5781, 5847, 8454, 9683, 2741, 4801, 9237, 9103, 4151, 4887, 11721, 4146, 11435, 752, -6900, -4890, 261, 12898, 22881, 26359, 31911, 14464, -11798, -9474, -2776, 11573, 21607, 18065, 13962, -1796]
7726a796r598m420O435N884N059o578r180L610q690m566J0873l203R35r803L483
7711b1555L976K996l780Q416J0390k001n641r720m603o57J4910J2875Q265L201
7697A7072L415m102O935q956k1568j3746M287l941n767Q972m163R191j339m263
7683a7973P026l688M06J0132j4267m538N640J969L015J375J0196J0595M135J843
7669A5866p744p068j641j0520j279J7357J9557R532j7263j2946J0294m770j9366
7656i991M837oj7050J524J2748Q63Q379R688r52n809j4598j3961J3025J3604o530
7641d229p715J720l491j984l00k326j286n369J849J5036P885k130j0536j1611
7627b4487m295O130P031O909J1509j157N83j4102k60n473L492o265M248J8504
$$ y = [-1796, -11394, -15814, -9379, -3495, 1564, -5014, -14194, -10584, -19274, -23840, -12967, -16170, -15235, -25038, -21555, -17579, -14583, -18363, -9947, 443, -1558, -7199, -16919, -21522, -22179, -7269, 5606, 13871, 17072, 20487, 16385, 23320, 14364, -7204, -20950, -16663, -20604, -26371, -17399, -21562, -12371, -13710, -17973, -10947, -14635, -14229, -4097, -18364, -22902, -17262, -15293, -12278, -10903, -707, 9888, 14023, 15866, 8122, 1054, -587, -11107, -12386, 4971, 24528, 34060, 16797, 3851, 14145, 9375, -9991, -5154, -5160, -22210, -20686, -7938, -7075, 1304, 10992, 10040, 4231, -10367, -24328, -11303, 2301, -4229, -11944, -10224, -13715, -15699, -15999, -18325, -19611, -24980, -23131, -8095, -210, -2340, -12876, -24487, -28782, -22652, -15621, -8712, 2797, 1640, 2223, -11879, -12139, -17612, -14120, -20385, -16137, 2367]
7613B367m958M119P87P994j3778j3831N581K141J985N550m37P741p443j244O968
7598C542J542M60J815q097J1306K709J552Q921j363p102r275m651j002M682j3639
7583h600m446J872k952j919K2394L075m839j7834M545K030k050j101J3569j790
7569A954l058K698m089R70Q523p282O712l696q401n029O808k237n020j3804J1583
7554a3368J3524J7911r444q199q742J446Q350K629j1181q251K638J2681R620o953
7540B661q891j714N385o909j2578N01M832j1588n230Q736K26k83J9036O527j2389
7525a1678r847p590M081K585J167P822o64m77J3679J0048j680k3127J411P478
7511f792L303J4431J0071r140p440l829o450j0445o70l992j7898O278P573K038
$$ y = [2367, -2591, 1528, 2315, 10309, -3469, -17300, -11719, -9578, -7593, -2043, -2480, 5261, -2182, -3426, 3542, 5084, 5544, 7359, -738, 10568, 13277, 14829, 23750, 22387, 15285, 6010, 1359, 357, 5039, -8600, -13046, -11174, -14126, -16045, 6349, 9424, 4585, -13249, -8704, -6674, -8724, -9825, 3744, 1954, -1104, 1594, -2495, -1525, 6998, -284, 6428, 2732, -5669, -10698, -3890, -6127, -11147, -24951, -13368, 156, 18067, 8623, 424, -8318, -6872, 1478, 4107, -7074, -15325, -12687, -6, 9614, 2661, -6230, -7944, -2559, -9468, -22046, -21545, -16713, -28301, -33531, -24795, -24569, -24852, -5816, 711, -11678, -21525, -29115, -25034, -22449, -21282, -13460, -14124, -14601, -922, 9126, 7446, -15681, -14270, -6792, -3489, 10942, 21013, 11873, 4433, 604, -5846, -16291, -16961, -20953, -38851, -32573, -25000, -22962]
7497b2962P36O229J406J295J4923M07k727j010L953m607j209l415j0319M060m655
7482a7895Q312J2588J3570j3248j0409O834J0230j0470j3509J0069O992K205O681
7469A1950K98j3317N817j0398k0347l12N961J602M579Q890J3760Q737l711l48
7455A3161N84p929q352o226k767J0748Q225L637j312n352j5674j3817J1176J7896
7441C998Q791p295j91r021o15P984K800J895m282n487j80n119p860L006M730k6459
7425c3305k857J6548J2747R19j0743l338M581J2267J0389K794l303o762k0662
7412b0725m519J7195J2151k738k336k994q693p384K185L601J851m998N65k599
7398a9438R579R550q758l249J849J2972M249p092P287l568L044o605K798J17p766
$$ y = [-22962, -22226, -15997, -14591, -13296, 1627, 2034, -693, -1703, 2250, -2357, -3566, -6981, -17300, -13240, -17895, -9583, 3005, 16575, 3327, -7082, -248, 9982, -488, -13997, -3928, 3064, 5269, 11950, 12248, -1069, 4748, -5650, -25997, -26309, -20348, -18746, -14167, -5277, 8483, 17220, 13509, 13161, 13745, 5816, -2536, -8762, -11529, -781, 7444, 11081, 9769, 4417, -11257, -25074, -13898, 3998, 12789, 5494, 5303, -3718, -4333, 3651, 6451, 8346, 4064, -1423, -1603, -6722, -14582, -11576, -6846, -33305, -36162, -19614, -6867, -5948, -16691, -20029, -15448, -3181, 7208, 10002, 6699, -63, -20725, -25244, -8049, 4102, 1364, -972, -3966, -12659, -20043, -17858, -14257, -12406, -17404, -16839, -19438, -9859, -309, -9067, -12316, -10467, 2505, 6754, -338, 6949, 3381, 6425, -180, 2618, 2735, -5031]
7383e031J720K12o092m626M36k777J1219R67o067L207J1145p261M291Q237N72
7368A0152j16k577j267j0060p852k589P59J0420K50J0977j81n583M072j158j3698
7353h451K103Q980J1717p674j864J0242j037j516m135K670j76j4635L375L050
7339B649P354n646n736P276K968l718r047n497K54M444j141r649j0347k766P903
7324b0699l507J7474N641M876j651o005j88o296O835J6959L12j2783q255j312
7310h599J5370N699N623j2734o690O001L030r407m43J0133r358j0333R75L892
7296f841k065p697M025M967j063o90j476J316k292l421J3148P2o204k242j498
7281a1961j54j653N348n611p660J1675K573N66J062j6377r593M6L225P165K411
$$ y = [-5031, -3311, -3099, -9191, -13817, -13381, -16158, -4939, -3972, -10039, -6832, 4313, -2948, 1343, 9580, 10152, 10036, 7459, 6192, -3868, -11720, -14309, -13550, -3130, -2880, 8097, 7916, 2333, 6405, 5247, -8451, -6348, 2632, 14349, 6675, 4811, 15053, 14016, 12500, 8365, 11035, 10859, -3776, -401, 2649, 10003, 4357, -1379, 5897, 8865, 5147, -3900, -9397, -9143, -4699, -5840, -15489, -25836, -28602, -20699, -24206, -6732, -1091, 3785, 2134, -3871, -4059, -10355, -3520, 13439, 13751, 968, -7287, -8599, 6771, 12470, 18093, 5359, -1331, 4670, 7700, -1707, -2150, 7983, -1375, -11708, -10733, -6841, -8906, -16603, -12578, -7611, -8674, -9364, -10840, -9524, -11816, -15237, -2089, -2017, -8221, -10463, -11961, -12115, -13768, -8420, -14031, -21691, -10016, -7443, -6877, -5815, -22192, -31785, -31739, -28514, -21349, -18938]
7266a8938j016L134J564m637k76m563L657O542J7059q38J006k191m715o680j039
7251a1931O076J529J587J6181j5153m043n325O143p36k418J4326K467J090r672
7237A21j8220m762N482N465N306J2285q113o667J0733J5372O431p925o102k507
7223F899R15n008Q14j6381M02r341N184Q703J2112L268j7835J828p622m353L013
7208a7402J6906P674Q902L905p055p699m622q164j7085J5089L85K894L45P001
7194A074l5J0259K07k903k112R545j591j1494n42j573P317J3715q846j5088l752
7179e819R488J9787j2005j5479O27Q926K98j0848j4506k195K612J941n560j785
7165b4518J0339J214p739o864K384j588O765J2434J501P279J2858j4577j2845
$$ y = [-18938, -19954, -16820, -15256, -19893, -20169, -24732, -21075, -14533, 2526, 1688, 2694, 503, -4212, -10892, -11931, -5855, -4326, -2739, 13442, -1711, -5754, -11079, -4936, -5672, -8090, 6236, 8703, 9793, 121, -18099, -22861, -17379, -11914, -6608, 5677, -2436, -9103, 1630, 17002, 23433, 15508, 9406, 6899, 7814, 2806, 3620, -12761, -12359, -21700, -16516, -7813, 4299, 7567, -10268, -8440, -16062, -20415, -17402, -496, 7178, 16080, 19985, 12930, 5231, 609, -7555, -24640, -9551, -9166, -6272, -5927, 1074, 1039, 11298, 11505, 8602, 6490, 16035, 14444, 2950, 2408, 835, 8152, 21867, 13021, -2067, -5819, 3669, 23456, 11451, -4028, -3401, 5525, 5823, -5025, -19531, -21726, -19114, -17173, -22733, -24518, -14179, -12965, -20704, -27568, -25184, -26772, -20007, -7573, -6072, 1207, 14065, -512, -13357]
7152a3357j0443j0357O230J8945Q338Q793N662j9574q893k679N29j120j5729L142
7138c0513P077J3127J636N404j4820j587j471M832M283R13m489O489k320R315
7124b124O512o190m588m57L077L716N282j860l355j5923r875J2514J1636J2746
7110A1111p615p817M105P61j1292n017K584O373K152r466N339L527k860J209m782
7095a1688Q935j991r245M111l253q849m806k93J1626J3968j0127j784j3738j4466
7081d1600O587J0626J4045O26q832m71J2153Q103m363k632j3555r941J2832R760
7067f662N865k434q708L026J1617J047N424M969J8393j3055k7404r072J502J110
7053a4382J974o218Q207R643o0q44o394p246j805l364j0055q22P050m13J0831
$$ y = [-13357, -23800, -34157, -27927, -8982, -644, 8149, 13811, -5763, -14656, -17335, -16806, -17926, -33655, -30513, -23436, -10309, -8673, -3269, -18089, -19676, -21147, -16315, -12032, -11119, -15608, -9119, -11439, -2124, 4388, -1802, -6390, -6847, -3770, -54, 5228, 3368, 13, -15910, -25785, -13271, -1635, 11111, 3496, -4321, -216, 545, -10747, -15764, -13180, -6807, -4655, -14121, -8782, -5255, -8115, -6906, -11688, -2753, -4744, -13989, -9878, -13131, -21980, -26786, -27079, -15453, -1485, -11612, -13396, -27134, -41600, -35013, -24387, -10342, -9716, -18548, -19019, -6866, 1237, -3126, -5758, -19313, -29254, -16422, -6662, -797, -3231, -11939, -8913, 2704, 3751, 9175, 14144, 32537, 19482, -7922, -16994, -15492, -14382, -12408, -18626, -10419, -776, -836, -1680, -8074, -15320, -17125, -20489, -30544, -31366, -24316, -24729, -13898]
7038a3898J5218K365j7876q577k13J76M406J761p151J046N521j565n425n895P659
7023b2448N112L649P193n295j3583l02n3N088Q054L170o510J426K197K1647P639
7008A6984N923p226q700j5366m412L598n271m359j998j0628j494K906J2778N157
6994a2108J752r332j1692l061R022K049N734J5638j3796l712Q321J488k369R942
6980b124j072P792j0120p909j382k819M394Q165k24p52K721M111j3521K106L789
6965f845K798j0278l644M808l619J2751J3089j0070j0330Q231q733P054K706j0265
6951a2347m638Q429M178j330o568J730o221R268j237J2551P209J0276j3303p528
6937D69m457k144P03L100j93N43j467N13j381K666L229M29m002p666L966n265
$$ y = [-13898, 1320, 3685, -14191, -22768, -22981, -22805, -18399, -16638, -23789, -22743, -17222, -18787, -24212, -30107, -22448, -17336, -13687, -6494, -11789, -25372, -25674, -25727, -20639, -12585, -9415, -15925, -14499, -12302, 9345, 16984, 22907, 15681, 6981, -8385, -12797, -9199, -14470, -18829, -20827, -31455, -32949, -30043, -17265, -12108, -10356, -19688, -31380, -34441, -25419, -23370, -17636, -1998, -15794, -19506, -11185, -9697, -12066, -2124, -3196, 4596, -5524, -13433, -14815, -17634, -13240, -5075, -5299, -6051, -3330, 781, -12740, -10634, -6845, -4047, -14325, -17969, -13161, -16780, -4029, 9060, -1010, -11340, -3109, -11842, -4788, -2082, -12347, -16985, -8556, -4378, -5708, -12276, -10546, -16767, -7499, -8736, 3815, 11024, 21300, 7997, 469, -3988, -6132, -5429, -2329, -2522, -1979, -3446, -2933, -4314, -1648, 1581, 2010, -1992, -9658, -5692, -10957]
6921a0957r275m896K801N661N808J667p384m818k963L875k807l406M687J014k606
6906b3599J5774J7764m087p727j2404r467M494J1616J1913J4197j0381o103p4
6893A916o043o044j168J2009J1386J1935l452j9339l049J657N463j4051r220r385
6879b7385J3393J508j0062M0m780J990j064M737N717j0585n55l946n849Q032l798
6864c2607N36n103k32P156K959Q922K2727l534j4048k432m77o990q299j1771Q526
6849c4667J6389J8335N06o70k732o863K072R782p431k687K511J300l548j527n140
6834a4370J437n158q592K100Q432K065k326M269J757K186K111K312o982L197j868
6819i430J2406J4198j9178m326O269r564p712L393K861J5429Q574k064q021K322
$$ y = [-10957, -20232, -25128, -22327, -16666, -10858, -9191, -16575, -21393, -24356, -20481, -23288, -26694, -22007, -20993, -23599, -7825, 9939, 5852, -1875, -14279, -23746, -19252, -7636, 4277, 18474, 8093, 1990, 1916, -4127, -10171, -11339, 670, 12056, 23991, 20539, 1200, -1849, -192, 5271, -8780, -18000, -27385, -13992, -12484, -22546, -22506, -27286, -25296, -26360, -21623, -15906, -26491, -27046, -30992, -36841, -28809, -32607, -32071, -37174, -37406, -30250, -27291, -18369, 4358, 824, -13224, -15656, -16133, -23123, -31422, -43193, -34667, -18278, 57, 563, -107, -2839, -9702, -7630, 2152, -5279, -7966, -5455, -4155, -7703, -9230, -14370, -12933, -18091, -26683, -24583, -16151, -14086, -16412, -12143, -10386, -8200, -6089, -3777, -10759, -7562, -9430, 2976, 17174, -2004, -6330, -61, -9625, -17337, -13944, -11083, 4346, 12920, 10856, 2835, 5157]
6805E157j2170q420L264J1939l141o902L939Q370L417M974j0688j6347j0288K491
6791b4405n594J5460R275k838j3421j091Q01p909K2934L789n160J586R50L189
6777b434m509j1625O330p145j0394m799J1324n285n683N406J3626M304J0024J901
6763A041n101r96K970k659o543q174M536J5727l916K284q572Q159K188R35j238
6748F41j5873O243J2812n431m282N577J0169P261r582p441m180J8097o551k2016
6734a4556q336K712m344j121j91L300J4016J1254p574o411O56j3664j072O49o571
6719c1253J2456J6398p026N846R800J241n765j0241q551M30P379M701L991q698
6705i292j0044J3471Q326p376l72J166N313j583l99k884J184l943j6612M03J3790
$$ y = [5157, -7013, -15433, -12169, -230, -3371, -10273, -6334, 2036, 5453, 10427, -261, -16608, -26896, -24405, -29999, -14539, -5264, -8102, -21523, -22614, -21813, -29722, -6788, -2999, -8159, -6573, -5623, -2434, -6943, -18568, -12238, -19383, -29777, -34576, -23252, -28537, -34220, -28814, -15188, -10884, -860, 1041, -4060, -5056, -2086, -4745, -11288, -19462, -14926, 801, -3115, -831, -9403, -1244, 944, 1879, 641, -15232, -8989, 3823, -1608, -5890, -313, 9856, 17117, 7535, 94, -4086, 14011, 7460, -14556, -22892, -20180, -24524, -25645, -25836, -22536, -8520, 2734, -4840, -11251, -10595, -24259, -25331, -24682, -31253, -18797, -2399, -9425, -3579, 6221, 7462, 1697, -8544, -17095, -16665, -9286, -4585, -594, -9292, -19336, -5865, 2461, -4915, -5287, -4121, 1192, -391, -790, -3674, -2490, -6433, -23045, -22642, -8852]
6690h852P369j2521J2337j897k492L792n305o286j812r27J0462J6887j0394j540
6676a179R905j4143j8666r144Q303J8662p181R48L836l069m284l006P27J4983
6662c308Q104L06l725M955N796j2860q065q633k542N077J1517J226n498j1361
6648a9011j860P153N706l533j3747l369J7173M293L722J1022j8313r944J851K6443
6634G586L124j0240j9962j2393N039J0408J1950j0154p587L015J9637M987P79
6621F189l877o691L967N348J009J560K338q270k478K107m074j0571r397K690P983
6606a2167J1588K29R228k239q166p450m899k684P624M614J0133q345J687n43l389
6591d779j780O171L954p653Q699Q56j2421l745N49r239n225P524k10j7811o519
$$ y = [-8852, -1483, -14004, -1667, -3564, -6056, -2264, -7569, -13855, -15667, -16594, -6132, 10755, 361, -1179, 8726, -5417, -24083, -33227, -24924, -6262, -13443, -12495, -8659, -11728, -16012, -19018, -18291, -3308, 4796, 5102, 1377, 6332, 12128, -732, -8797, -17430, -19972, -14895, -3378, -2152, -7650, -19011, -20871, -13718, -8012, -11545, -25292, -28661, -11488, -7195, -3473, 7549, -10764, -20708, -18857, 7586, 10710, 470, -19492, -31885, -26846, -16438, -4488, -14642, -22229, -19214, 423, 5410, 6189, 2312, -4379, -412, 4936, 5945, 7505, 9843, 1573, -905, 1202, -2872, -13443, -22840, -20150, -12167, -579, -350, 8878, 6639, -1527, -8977, -13876, -16560, -8936, -4322, 5811, -2534, -847, -1390, -4779, -6559, -388, 3566, -4087, 4612, 5468, -6953, -10698, -10149, -19388, -24613, -17089, -17299, -35110, -41629]
6576d1629K0262K690K116P30J2870R01m35j0530m616Q65J0446P844n06K250n513
6561b255J806N07q570M602K0240Q06j0752l953j0584K871L893l993K885L651J298
6546B452K231N926p051j2977p685O391j120j1509r062L199K1185P773j1124p92
6532a2163M529N681J016n753p527o552M390Kp188J3923L972l644N237o308L439
6517f946J0999L979J0938q978m679j1748q927L000j882P868N852p584K99J792
6503f017l144N963j0857j1780L188K02j2644P111J5647J3442o219J4165Q678j0659
6489G076j2145P62Q213L849n487J931o464j82P580k131q891M220J0036J044l140
6474F271j0482j1611J3188O251r365k986o707R106O514j8444j8203j7333J6573
$$ y = [-41629, -21367, -18677, -16561, -15831, -2961, -2060, -2495, -13025, -17641, -16776, -6330, 1514, 1008, 3258, -2255, -449, 58, -8512, -3910, 16330, 17136, 6384, 2431, -8153, -5282, -1389, -5382, -2497, 1154, 2452, 4683, 10609, 3558, -9419, -17104, -10713, -11833, -23342, -32404, -29205, -8020, -247, -11371, -12163, -7634, -1953, -937, -6690, -14217, -20769, -16379, -16377, -23565, -9642, -5670, -9314, -4077, -10385, -6946, 4053, 8032, 18970, 9992, 5313, -6435, -15362, -12362, -14244, -6376, -524, -8108, -7809, -6017, -9161, -3198, -14055, -25835, -22647, -22445, -35089, -27978, -12331, 1111, -5108, 9057, 17735, 7076, -5069, -4307, 3906, 7755, 2268, 4199, -2265, -2447, 5133, 3002, -5889, -1669, 8367, 9411, 6271, -4211, -15822, -2634, 3617, -5748, -8734, -15441, -6335, 179, -18265, -36468, -53801, -37228]
6461c7228J4616p512K577O841P441P397o425q389J4108Q680k948r483j915O575
6447e665J2893J5495O543j2387j0396l415K949L680m120p294j9875j185K565J49
6433b0063J1477J0814P978k811j1047j0340l471l771K647M944M16R354m712L966
6419d619k922o87L8k785K965J0162M2q06l49j0313j182J0219Q302m437m194N443
6403D877o681r273o135m492J2489K0201j884j1865J0002J6508P157k0945k1291
6390a1332r777j2043J259J036o40O93J4478L247R834O71j790r099m708N052j5810
6375b8929r31P250P413J3055J1937r252j4049p163J178Q25P406M498L602O928
6361C768K550L047L276l271m990j4475o931l81J4098K196o505j2941j415J0450
$$ y = [-37228, -22612, -30124, -27547, -20706, -13265, -5868, -12293, -20682, -6574, 2106, -842, -10325, -12240, -5665, 7228, 22723, 29266, 16879, 6483, 3068, 6017, 9697, 5577, -1717, -21592, -22777, -20212, -20063, -8586, 2228, 10206, 7395, -3652, -13992, -17463, -21234, -18587, -13643, -13227, -3873, -8585, -4619, -7541, -8228, -8190, -10975, -8010, 2152, 2194, 1388, 1039, -9274, -10456, -237, 8065, 3628, -566, 4877, -1804, -11077, -17212, -21704, -9215, 10986, 9102, -2763, 7239, 23747, 30904, 9959, -11332, -21109, -33152, -31893, -30857, -31497, -30804, -16326, -13079, -3245, -2574, -4364, -13463, -18171, -13119, -28929, -29860, -22610, -15197, -2142, 9795, 543, -13506, -20669, -19491, -18666, -11260, -6762, -3160, 3768, 6318, 9365, 12641, 9370, 4380, -10095, -17026, -17407, -3309, -1113, -7618, -20559, -21974, -11524]
6347a1524l652M141N696n063J012p309k895K514K829L022Q210M596J807j936j3202
6332a1754L588L480l527k101Q096J949R901J5597k788k1386j6356J730J9967J1631
6318A8027R445n046r04k270l624j2449j6515j4329r235L763K768k736O953l119
6304b9271j0610n276J178N246L721N831N292J0776K576R238m604L944m542n503
6290a2004J1702P855L883k9678j0986K6106L066k209J2671L733j6224q351M985
6277e451j684l53J309m253m513P363Q283P56m790j1258P050m732n966N624L276
6262i339N303l612M649K475o527p589P918l228l677J424k31J4812J3069j3132
6248B315j1802L826J5149L689m18J5828q68k2712q551K236M228j1752o186M402
$$ y = [-11524, -15176, -11035, -5339, -10402, -9390, -16699, -19594, -17080, -14251, -11229, -3019, 1577, 3384, 1448, -11754, -8166, -4686, -8213, -10314, -2218, -269, 9632, 25229, 22441, 1055, -15301, -13571, 6396, 18027, 27472, 22426, 21522, 19252, 15628, 3179, -13336, -27665, -36900, -33137, -30369, -33105, -26152, -29271, -39881, -45157, -43979, -38733, -35012, -29181, -23889, -13113, -10537, -1299, -5903, -1959, -6501, -12004, -302, 7553, 11436, -18242, -29228, -3122, -56, -2265, 10406, 14139, -2085, -10436, -5451, -7135, -7488, -6179, -10432, -14945, -7582, 701, 1457, -3333, -14591, -7541, -12273, -18239, -12615, -9339, -4036, -7648, -2999, -524, -7051, -14640, -6722, -9950, -13627, -12203, -12434, 2378, 15447, 2315, -9487, -5661, 9488, 13177, 12759, 28587, 27719, 5007, -3544, -1308, 2920, -8832, -15018, -10616]
6234a0616l986L537J944j3965j626J5353N255L081q81m871R44q891m509P672Q709
6219b850n244J3879M873p957j1211j5880J236J3033m165J1393J2407K691m108
6206H097m45J786l391n955j3194l28L343n97j661N894j451J761j085q44k693j713
6190a2476n943M701j31L932Q035J630j6753j4355j1049J66J3073J5587J0789O371
6176C577j765k928m007N810p439p631R442J4506j6487k1126R542P62J0612R562
6162B430m513j523j193k165n649m608j4253j1871k250O868L891R444R347Q759
6148g286K783m534K103p43j209N095p830r214n891J7853J5739K9m769O396K763
6133A1285j2106j1611m145j4570p505L956J432Q967J1823r28k663J2447J3747
$$ y = [-10616, -14602, -11065, -9121, -23086, -24712, -9359, -4104, -1023, -1904, -6775, -5831, -14722, -19231, -11559, -2850, -8094, 5785, 10658, 2701, -8510, -24390, -23154, -10121, -14286, -2893, 9514, 12205, 8097, 7652, 9438, 6047, 92, -13102, -13430, -10087, -10684, -12345, -6451, -7902, -6141, -7226, -8070, -10763, -12476, -18419, -13718, -13849, -9917, -1882, -252, -17005, -31360, -42409, -42243, -29170, -13583, -2794, 3577, 1812, -1116, -5123, 687, -6752, -14383, -4941, 9565, -6922, -28048, -18506, -17744, -7132, 2430, -2083, -3606, -4799, -6964, -12613, -17221, -31474, -43345, -45595, -38727, -34836, -25392, -16045, -7286, -4503, -9037, -6934, -7677, -8886, -3791, -11621, -20835, -26726, -8873, 6866, 6895, 2126, 8522, 11285, -821, -12432, -16577, -31147, -38652, -34696, -33264, -24297, -12474, -13402, -16065, -3618, 10129]
6120A0129n222j580r331j3516L785J7962K672L728J0088j8155r488Q027r20o342
6106h163n385n569R725O494j069n411j4170M10q33M707K4300R125q377n404k645
6091b265o303l966n253Q504R812P385m025k0319j1300J2290J3752O039m048N173
6077E476l421k423L965k076j9979r690P962l560q009J1375N669K048n815L919
6063a4559j319m958J0979J223K962k358O62q304k143O53j598j2253L261N270R721
6048a2761j69R251O045m558P9Q842P907m479l570n710O730J249n403j3881k706
6033a3134M109j172o26j650p999N935M582R325j0610j5056J3229J8011J0852l379
6019A2417j5352n529l47P580N661r00N047r350m688l956q333Q406J2312L390m840
$$ y = [10129, 4907, 3327, -6004, -19520, -15735, 2227, 4899, 8627, 18715, 560, -8928, -901, -1821, -8163, -13548, -19117, -9392, -2898, -3967, -9378, -23548, -23138, -23971, -19264, 5036, 14161, 5784, 380, -2265, -8568, -12534, -17787, -9283, 529, 7914, 3889, -16430, -27730, -15440, -1688, 4351, 303, 5476, 2055, -368, 3597, 1521, -18458, -28148, -20186, -23746, -31755, -20380, -14711, -12663, -18478, -14559, -15878, -20836, -9857, -8634, -5672, -8030, -7368, -15672, -17815, -17162, -18760, -31013, -27752, -22482, -12761, -12930, -3679, 2366, -2192, -2113, 6729, 14636, 10157, 6587, 877, 7607, 8856, 3453, -10428, -13134, -9025, -10197, -10823, -12473, -20472, -14537, -9955, -630, -11240, -26296, -13067, 4944, 15796, 12417, -2935, -8464, -8811, -1231, 4430, 3530, 8577, -773, -5461, -9417, -17750, -9344, 2968, 6358, 1518]
6004A518q372p088J0372Q647r66J1970J313j0268j1899j853l297j3470J3766Q967
5990f60j8425n543N827l499j231J4912J6753j485J339L540q27l997p149J83N594
5975E332K931l400k048k55j1308K10k733J501J130m078L709P616n864k414J8766
5960I095P975k5720j5508M045j905q507m997J6810J3644l965K061p81m25P079
5946a099j85k432l963M364N894O771r068Q69P659m202r959k062j0403j4465Q508
5931b3773M127o875m155J2024P235j0797J038k419N220Q282K005l34J515Q18n758
5916a1847O681n66P846P611N23M657j4604j193R400K017j0367k510N808J5390
5902A8846Q573l380j2560o862k429M00j675n053O003K911l634k447j135m06q868
$$ y = [1518, -6854, -13942, -3570, 5077, 4111, 16081, 17394, 7126, -4773, -6626, -9923, -23393, -9627, -660, -19085, -24628, -18801, -22300, -23531, -8619, 8134, 6649, 7988, 11528, 10701, 6704, -445, -262, 5332, 8263, 4863, 2815, 2560, -8748, -8538, -11271, -9770, -8640, -12718, -9009, -1393, -7257, -9671, 9095, 17070, -8650, -24158, -20113, -22018, -30525, -35522, -18712, -5068, -9033, -6972, -7753, -8178, -1099, -1284, -3716, -7679, -3315, 2579, 9350, 282, 1151, 8810, 4608, -5351, -7413, -17816, -32281, -23773, -19646, -26521, -30676, -18652, -11417, -22214, -21176, -23595, -18375, -10093, -8088, -8422, -6907, -6089, -11847, -5166, -5732, 2114, 9725, 10248, 14905, 301, -892, 8508, 10525, 158, -2352, 3456, 18846, 27419, 24039, 11479, 4617, 2188, 2588, 913, -4140, 1863, 4774, 1140, -1307, -2442, -2848, -11716]
5887a1716q466M009R279n285k284J00L542J3553R420N588J8731L276k1827r513
5873H407M890K087P862R243M234j9812k7708j1265O733K2285J051j7085j1020
5860b0098J3173J3789k329J1210l076r864j510P042l919k22m993q404L678J105
5846d418l035L837P816N659p990j6403j902K828K023J4926O165j4257l719J972
5832f498j606j2461k889J2737L615J2082R31r281n31l78M767o26J556o479q883
5817a3944J467Q786R274K910L937L67m587j1614n322M803p8j5676r95k706R182
5802a4196J5497l473j1274K997n234k050o485o699J2964K1168J1612q222q035
5789a430r837L158N082R196m390J46J245n550j0820J5596J5596j430p392o842
$$ y = [-11716, -20182, -16173, -6894, -12179, -14463, -14363, -10821, 2732, 12152, 17740, 36471, 39747, 17920, 8407, 13297, 15384, 23246, 32489, 36723, 16911, -10797, -22062, -15329, 6956, 8007, -9078, -20098, -6925, 6864, 4535, 15745, 12669, 2805, 1295, 8337, 4418, 4196, -797, -9201, -5523, -4418, -7453, -3616, 4200, 9859, 1869, -14534, -16436, -13608, -11585, 3341, 9506, -4751, -8470, -6498, -8104, -20565, -23454, -10717, -7102, 4980, 5911, -3370, -3901, -4279, 488, -138, 1418, -5061, -13944, -12477, -3691, 5583, 8493, 12430, 12797, 8210, -3404, -8726, -3923, -4001, -19677, -20672, -23378, -14196, 1301, -2172, -13446, -10449, -15683, -17733, -24218, -30917, -17953, 3215, 14827, 6605, -1430, -11267, -8109, -3027, 6169, 1779, 1925, 3170, -2380, -13200, 2396, 17992, 16562, 9170, 2328]
5775B328L763J512m136p613j8189k905J0632j0412Q8N853j241J7575M974r997
5761g768k751O381Q396j2545L782J620J980n010J0529J5541N573j0664k0838L009
5747b765K701J555K174n774k4358j962P417J0866P28m416M54N573J4100L523m792
5732E024k800J2470K093n587q106o122j846j041M723q367j3194L517J2207O482
5718e47P35J0259j3876M228J1471o617j0790m49j215N439n148M108N521o827K185
5703a523J0455j1025L13J5084n48j9625J533K121k005n037L665P467K545P165
5689A0585q152P728M723p502O87j7093m986O26o621J4441K0497r001j9297O069
5675g296J5516k252n754j861l950k690L4k208N719R109K550k457N350j5626j4388
$$ y = [2328, 6091, 7603, 3467, -4146, -22335, -25240, -14608, -25020, -24932, -19079, -20320, -2745, 2229, -7768, -10519, -4138, 4258, -8287, -4505, -2885, -905, -5915, 4614, 20155, 25728, 15064, -5774, -2765, -64, 1491, 3665, -2109, -26467, -28429, -21012, -10146, -9418, -13834, -13380, -7807, 6293, 9816, 5024, 2224, 14694, 16787, 11200, 3094, -3028, -4874, -5915, -1192, -9559, -22753, -19236, -7029, -547, 188, 10447, -3429, 799, 12270, 5653, -5137, -5586, -6801, -1362, -6510, -2402, 3119, -3708, -1523, 8932, -2093, -1780, 13304, 12756, -6869, -5336, -3215, -5220, -10257, -6592, 875, 3420, 10585, 2433, 10161, 14884, 7382, 8069, -9024, -14010, -13384, -20005, -5564, 14933, 5932, -13365, -7296, 8220, 5968, 214, -1647, -5597, -8287, -8253, -10461, -4742, 4367, 6917, 4460, 9810, -5816, -20204]
5660b0204K617O231k268m233M554N826j3746O67k856J2509o935Q561J0190n471
5646d558O890P501k949P802K19j0793L711L836j5601p980n681L089p82j102J4834
5631a564J63o819P859N481L130q88j3471j3421m208P557M90l608M543N623m411
5616a3544P69M783J4670j0768q399N920j0730j5712L704N037N222J018L311M023
5602a0696M399J2430J0819K296o223K302n269j0084M702m070j590m64l383K100
5588b731M77L127J383j692n059N697J6755M832r465j7699k0232k115J0961K079
5574a3682M573L056m541K505N582J441J055m759M519P50l379K928m327o494R868
5559i05R21n373q368q180J912m133M089J0026P609L440Q88O738J2246L55o910
$$ y = [-20204, -17587, -11356, -13624, -17857, -13303, -7477, -21223, -20556, -23412, -10903, -17838, -9277, 913, -4558, 2332, 9833, 6884, 14686, 14905, 4112, 7823, 11659, -3942, -11922, -17603, -14514, -15296, -16398, -1564, -1401, -8220, -361, 5120, 8250, 7362, -6109, -19530, -23738, -16181, -15691, -19299, -14756, -9133, -13544, -12775, -7992, 6678, -4090, -12489, -6569, -17299, -33011, -29307, -24270, -19048, -18030, -14719, -10696, -6297, 6133, 16952, 19248, 13025, 15327, 10058, -26, 4676, 606, -984, -1448, -4831, -2731, -2254, 873, 2256, 564, -4495, 1202, 17957, 22789, 13324, -4375, -24607, -26722, -15761, -13682, -9109, -6053, -10594, -8089, -2507, -1066, -11, -4770, -251, 499, -2880, 48, -4279, -10773, -905, 16, -5357, -13725, -21905, -19993, -24126, -20037, -10011, -2402, 1038, 1926, 8664, 20910, 21265, 14355]
5544A4355j0094j6046m132L371J2767j071r133m871p73k475l164M387K155P897
5530f827Q085J920J0503r51j1438m540J1377J093j3317o62J7418J8469K189j0253
5516B3066m231J66o38n965J920P6o689l821j843m168j6210L981j921o69r953n855
5500c2754O53J6592J5710J800m35q898L35r463P968Q094n946p014K526K593k36
5485h475O828J6158k819j545j0553k40o927n816N789m400j498J3742j0168m363
5471a4287N913K983r36m617p561m174J14P158O250Q512p576N77J6578k394k593
5456C947m704J0655O078j2511j3254k173L820J0802J4029N350N465n180j3828
5443H496l165l102Q17K238n809j1068K147L199O115j9611j1570M793J5542O54
$$ y = [14355, 4261, -11785, -15917, -12546, 221, -850, -9983, -14854, -15627, -18102, -21266, -16879, -14724, -6827, 1258, 3178, 13681, 12730, 1292, -3248, 8129, 9222, -4095, -4757, 12661, 31130, 33319, 23066, 18835, 19001, 18363, 12398, 14318, 14394, 7705, 3884, 2041, -2127, -18337, -14356, -16277, -16946, -26899, -32754, -32101, -15509, 201, 2001, 1566, -7332, -6997, -16460, -8492, -398, -6344, -13358, -10832, -8239, -8475, -1647, 14511, 11692, 10147, -406, -646, -7573, -13389, -7600, -12000, -13498, 244, -9924, -14287, -8374, -5391, -6327, -10944, -18505, -22679, -22565, -15407, -9157, -645, -8221, -7644, 8934, 6540, 3947, -757, 9898, 15976, 3465, -9789, -11962, -8142, 2660, 16689, 22039, 27504, 22324, 8496, 5331, 2229, 3046, 5284, -525, -11593, -9446, -6247, -132, -19743, -31313, -26520, -10978, -10324]
5429a0324L836N118k963J306k895O891m657l066J634j033n425K810J3304J212
5415E748o048r162K953n593n622P892P992m43j1928k686J0618O613L555R72J984
5400F845p150j1354M162l191j129j1599N593P594r51j0586o967O485J3877J5202
5386F831P64o413j2610R46N4Q13J808J2342l887j6080L23N055L347l813q251q139
5370b6910J306J1936J699p1j128j365O453L217j249j8108m181L020N875Q673M715
5355f118M206j111m245O497J352n933j8252k809N75R814N806j3392J1790J5066
5341C246r997m923J541j3140o904R538J0756R922K0794j799j0730j1475j1532
5328a4703J1219O394j3049K361M698M858O415K586n199p668L164q816P49P592
$$ y = [-10324, -6488, -1370, -4333, -3027, -5922, 969, -3688, -6754, -5120, -6153, -11578, -8768, 4536, 5748, -300, -9462, -6509, -12102, -17724, -9832, -1840, -2283, -14211, -16897, -6279, 334, 3889, 4861, 6845, -305, -11659, -7497, -10688, -11817, -23416, -17823, -10229, -11180, -21766, -28733, -22248, -8371, 6831, 7595, 1182, -11428, -10482, -10428, -9615, -7807, 4535, 648, -15432, -15109, -10054, -6707, -10520, -18771, -26910, -25604, -13668, -11969, -12040, -13168, -14533, -8080, -4863, -6112, -24220, -28401, -25381, -19506, -10833, -6118, -1912, -3023, -7268, -771, 581, -5352, -23604, -26413, -25838, -16024, -10218, -23610, -11820, 3246, -6751, -11674, -10133, -23273, -30177, -20639, -9883, 39, 20833, 19034, 8304, -3171, -14703, -3484, 2910, -10139, -7778, -3080, 1778, 8193, 10779, 5580, -2088, 1076, -7740, -6991, 601]
5314F01K83N093J432n452q429J283k759j2382K583O132P883j508k424q887j596
5299a8147l196P869J0661J6036M557q96j6694j7665R094O565m449J1777R284r994
5285D802r606P65K621l116J819O799j614J278r247j6185J742Q71K487M06J8261
5270B083n42q937o717q561J831O696Q89j0587m349j907J6277N911j0962Q266j248
5255a1857j947Q371m265J339N862O523Q263r053j2476J1581O975l59n318j0710
5241g071p912J867O840o384M381p4N962J237N784m202l003L342R396J6092j1527
5226A4728j2905l73l217R953J0031m612m69m089j4445n317k876o664l343M649
5212a8949P165j598j609J2259P066n852j0521K694R625j0592k5493l276J3896
$$ y = [601, 884, 5977, 7409, 1957, -6472, -5189, -7948, -20330, -17747, -11615, -3732, -5240, -7664, -16551, -18147, -21343, -13474, -2813, 13223, 17780, 16884, 190, -17475, -8381, -1816, -6265, 5512, 14796, 4802, -4804, -4039, -1418, -4534, -2715, 4084, 2470, 3748, -5499, -21684, -19942, -19071, -16584, -16178, 2083, 1541, -7396, -14113, -22674, -20843, -14147, -13258, -23845, -28194, -30101, -13824, -7913, -18875, -10609, -11857, -13804, -5433, -9698, -8359, -2497, 4026, 12289, 3236, -9240, 2341, 9316, 8957, 3639, -7071, -14983, -13116, -6276, -12660, -8279, -8353, -2391, -1154, 4630, 428, -2575, 767, 10163, 26255, 14728, 1823, 1450, -1767, 8186, 18217, 13605, 13136, 9047, -5398, -10715, -13591, -20255, -23598, -18949, -11784, -13382, -14991, -2732, 4334, -1518, -12039, -9345, 280, -10312, -35805, -39081, -25185]
5199b5185J3321R538o380J2083J0930j719j7988j7207j9854P71J2171L103N686
5186b0730O597Q102k971K623O534p162j4514j0968J1325J054j114p045o440O419
5172b8290O551J565M744R756P225q539M51J1096k860l226m703q351N214q637M324
5157a3680K949N468Q565Q73r83m440k054N144l845l522N2J1969l148l265p775
5142g692M586m089j6597o761J4173J3236Q40J541j221m395J142o275j054l70j2795
5127b5731P352J2658k836P582O541j3933k209J0380J929j8471j0055l584J0066
5114b0311m811P938M099k679K610N343K849J4751n751r5J0420N003Q287o668m958
5099A6027o39p291j9295r050j0777J2189J8084J3219n150j1053r685O271m014
$$ y = [-25185, -11864, -2326, -8706, 3377, 14307, 12588, -5400, -22607, -42461, -41690, -29519, -26416, -20730, -14133, -6031, -9002, -6379, 155, -7007, -21521, -32489, -21164, -20110, -21224, -28269, -34709, -28290, -21739, -20174, -15430, -5674, 1551, -6988, -6537, 4559, 1699, -1527, -6230, -14581, -9367, -18004, -13680, -10731, -5263, 3302, 4175, 3192, -1248, -3302, 1842, -2003, -5525, -5473, 6496, 3348, 83, -7692, -3106, -7195, -23792, -30553, -16380, -3144, -2304, -763, -1984, -6379, -5237, -11512, -12566, -12936, -25731, -18379, -5721, -8557, -975, 5566, -8367, -10576, -196, 1733, -16738, -26793, -30377, -20311, -25122, -17184, -13085, -15764, -13154, -7811, -4962, 9789, 4038, 3943, 14363, 19366, 27653, 20985, 16027, 15388, 8097, -11198, -20248, -31025, -18836, -752, 12467, 7317, -3736, -13421, -7150, -11164]
5086a1164P038O391J3077j1722l461K436j2103j1220j750O143P775j752n025q154
5072b3491k86L978J6388J1358k195q691J240m246J673p707r752N790R411j1161
5058a7691p193J0716J3817m974k227L425P018J86R017J3191l044r192j5676p554
5044a0181Q976M698R256L063j013n834q238l484k639R542K912j2006j4158p178
5030b6284j61M012J1110M477O947k800O329J0309k253l986o286L007J5813O238
5016B6472j2700j2743m156r886o817N025K895m473O004M164q796Q496M457P428
5002E370l933j5793p218J0809P089j362j0640k064R143K411L185N536K361p000
4988b106j7060N342Q956R575j5452p816q407L888Q293j303j094P81N410q523l39
$$ y = [-11164, -4126, 2265, 15342, 3620, 159, 2595, -9508, -20728, -22478, -16335, -8560, -10312, -15337, -23491, -23777, -19799, -3411, 7947, 5752, -2939, -1699, -5945, -4272, -11979, -21731, -15941, -6530, -17691, -24884, -14168, -351, -5325, -7552, -4127, 2891, 3077, 12094, 25285, 22241, 13049, -2627, -10181, -1205, 3493, 12749, 15812, 14799, 8965, 727, -2757, -5396, 4146, 7058, -4948, -19106, -26284, -26445, -22433, -11323, -6846, 101, -2699, 3630, 13939, 11686, 7700, 1414, 4421, 20234, 26472, 13772, 1029, -3127, -13013, -19830, -14805, -11910, -16383, -10379, -6215, -15011, -6515, -2058, 5370, 1437, -14356, -21574, -10765, -3676, -5038, -15678, -17742, -8599, -6188, -3003, 2533, 4894, -2106, -19166, -13824, -4868, 4707, -10745, -18561, -26968, -23080, -14787, -16090, -17184, -16403, -10993, -19516, -19855]
4973a9855J9234J4175M399j98q100q801k845L49J0616r27L8O02K11K862j994j2546
4957b780p964L163L866O066Q70l709o971l588J0361Q35N832K451j0806q795J763
4942i406J5173J533j742J929l449K061r001K306P932p11J614J1320j543k187j1918
4927C911o286j3800k106O879J8221m229L394J240q651k874O761K1306J2965K89
4913C7020k0904j0410j6357m999J6682K510m096J398K736K780L202k872J6733
4900B3423J3961j2601p210p87j7515p099J0444J841l490p103l884o123n272j594
4886b3009l27N017J1447j615o362o51n69j449Q389R978M18j237j1123o86Q093
4871c686l744q363L057j0488j882n7j1211l851O20K393P025l585n327J4558K810
$$ y = [-19855, -621, 13554, 17953, 17755, 9655, 854, -1991, -1642, 8974, 8047, 8085, 8687, 8898, 11760, 9766, -2780, -10744, -7581, -3715, 2351, 3221, -488, -7459, -11047, -686, 149, 5981, 8432, -2374, -11169, -9406, 5767, 7300, 5558, 7487, 4038, 6099, -2902, -596, 7336, 6625, 8239, 19559, 18016, 15829, 3911, -2375, -16175, -18281, -11402, 6819, 2590, 5984, 7224, -1427, -4301, 2460, 23766, 36731, 37020, 16116, 5706, -10651, -15650, 1032, 3542, -554, 844, 3580, 6360, 9562, 6690, 23423, 37384, 24783, 17573, 16786, -729, -7828, 2616, 4457, 967, -6136, -10020, -16143, -21415, -23009, -23336, -18319, -6872, -8487, -14849, -15500, -16069, -17518, -9129, 849, 1267, 30, -11093, -11779, -3686, -7430, -15793, -12736, -23224, -25106, -25163, -36374, -40225, -39605, -37212, -30187, -33772, -39099, -24541, -21731]
4856b1731P294J1905j305J241n406M472J1560j049j3445m419K155o013j4876N096
4842b4521K0811P986j893J255P259O326k83m019j2859j1783P415j1187o479J0274
4828a1698J4726j893j0934n885k371M091O051n010O19J025P031n458J6473Q561
4814A5328o470n4m441j2095p864j345L660Q53P851O225m496J405n170j499l725
4799a1837m131P006J1093j3255J3850k869n285J1450o040j0926j0380P020J0622
4786c682J0198J216L061j053l487j1204j198j4085J1399J3593N433q917n437J0069
4772E906J503l858J045N731o134o577L617J116L184J175O099M863o769n484j3753
4757h336n385J1594J0762n480n7J2779J020j0756j3101J37m820N726l450J903
$$ y = [-21731, -14437, -2532, -3837, -2596, -8002, -3530, 8030, 6981, -6464, -10883, -8728, -14741, -29617, -24521, -3710, 4276, 2383, 3638, 10897, 17223, 16940, 12921, 62, -11721, -4306, -15493, -21972, -11698, 3028, 1135, -9799, -15684, -18055, -13964, -7913, -12923, -12304, -11279, -4248, -9706, 6767, 15328, 8858, 8804, 4363, -7732, -15596, -16941, -13281, -12428, -4577, 1648, -2848, -1443, -6613, -8112, -11837, -15968, -8962, 2131, -11124, 2726, -143, -5428, 6022, -18, -10944, -21324, -14304, -3682, 6516, 7732, 10793, 9740, 6253, -4951, -6149, -20234, -8835, 4758, 10191, 1274, -4163, 5906, 7409, 3551, 4596, 10327, 4193, -2384, 1233, 2349, 5533, 6708, 12807, 17670, 10901, 5417, -8336, -13721, -2127, 8635, 3155, 3098, 15877, 16897, 6141, -6960, -6823, -11643, -5917, -9367, -7464]
4743g464J2187k165M260n28k62M374L530J1388P044j5302k2892m568N610o662
4729a1450p260J4099k52q146J223j414l933Q545k821q732J488L2Q249k219O036
4714f555l598l13r311j3279J3843J3730J348j827r399j0046Q067q40j352n089
4700b4621J0567J1623Q393k056L6J005J380o521k978k0198j0757Q249J3550J0986
4686a342N029j1757l471n731J5573O852o707O179l834j3537q972K1937M591p118
4672b308j063j095N615M832l18L916j0445j8072l629N947J7859l97N0p792q766
4657a5666J9852K656n144o040Q015J1327Q131n542j5970p084K930J2826p360j2303
4643i372l332k110L316n89J1575R888R0j1555o128k145N330K99J1901J0406q681
$$ y = [-7464, 4723, 2558, 6818, 6290, 6028, 10402, 13932, 25320, 32364, 17062, -5830, -10398, -4788, -11450, -18710, -4611, -4863, -13009, -11786, -13200, -17133, -8588, -11409, -20141, -18653, -18621, -10372, -12591, -6555, -10153, -10466, -19777, -33056, -19213, -5483, -4135, -5962, -15361, -25407, -17340, -18180, -19532, -24621, -14054, -2431, 5962, 3906, 3942, 4947, 6327, -194, -3172, -23370, -34127, -25878, -12328, -1342, 3687, -8070, -11541, -17272, -1699, 5153, -1554, 4625, 791, -12746, -21718, 219, 4810, -2308, -3371, -4466, 1149, 5981, 5663, 9579, -866, -18938, -22567, -16620, 1239, 842, 892, -6900, -15666, 4186, 6842, 1698, -4342, 3673, 15000, 23131, 17589, 1619, -5465, -2535, 10291, 2931, -9372, -12704, -14814, -11498, -12087, -512, 9376, 9466, -2089, -8217, -10362, -5032, -4733, 7168, 17574, 8893]
4628H893M92L48L58Q203K802j2351q630l130l162N428N685j1341m211M631R81
4613e004J272J0743J1469o429j974K042Q352q775r781J884j12o914l126J0855
4599D502L029o742N767m587r199k2675p287P309J7824J0162M090J514L650j770
4585E587j0668M447j339O8k32J679R704J0127O587j9753m131p305M849O183j513
4570D290j0791o769r269K2O613K365K5722k422j8484j096n307J891K886m434Q17
4555a3966R744J1732k36J4626J918j6384r655Q091r723j7495j3722p556M518N990
4541c2118P579J3187J0493m695K060P357n125n883K935k25N656j7185m469R249
4527a1184K0424J2855k398R411Q177n785k1719j1038K221J390J2217L726P13k990
$$ y = [8893, 9385, 9733, 10091, 18294, 21096, 8745, 115, -3015, -6177, -749, 4936, -6405, -10616, -5985, -5004, -3732, 7011, 18480, 12051, 10077, 12119, 20471, 11696, 1915, 3799, 3687, -3227, -6353, 4502, 7531, 789, 6556, 1969, -7230, -29905, -37192, -29883, -12059, -1897, 2193, 3707, 7357, 5587, -5081, -634, -1973, -1905, -2137, -458, 9246, 19373, 25960, 6207, 2076, -5229, -380, 5803, 4290, -6501, -13270, -22539, -22517, -15904, -13539, 12183, 9761, -8723, -9819, -15126, -13235, -10349, -14783, -13966, -4222, 7510, 7274, 21900, 23818, 7434, -2221, 5870, -3853, -21348, -35070, -42626, -38108, -32118, -24539, -11352, -859, -5554, -3494, 3863, -1262, -7145, -4210, -4435, 1221, -15964, -20433, -11184, 9240, 22095, 19697, 29108, 37285, 31500, 9781, -1257, 964, 2354, 14571, 18297, 19010, 16020]
4513A6020j7119j2203K75J0862N185n294q423j8171l454Q424k540P0J3189K139
4499a1040M591J832k151n84O505j1395m928J821k516J2170J2452m492j0433N739
4485b429q357L452l41r093m636J2254K330j0628L84Q75k052R024K762o069J520
4470a1004r01k507j132O011J3256R932k833q709m48o091N082r61j0559N987l853
4455h730L994o751k240K727M682n181M643J1358N24q352K179J223R801N234l216
4440A1895l911K996L500Q582K896r594n065M680j3080j108M617M489P61P233j3919
4425D972j2927K941K275P318j2692P6J1740J4508J4295j273j8785l957j0264j608
4411c381p352J378p67R39M432M897Q115p30j3459J1103J2j486J04j534k653j2283
$$ y = [16020, -1099, -13302, -13027, -2165, 3020, -2274, -10697, -28868, -32322, -23898, -26438, -26368, -13179, -11040, -6449, -4617, -6768, -7352, -847, -12242, -17170, -15349, -17865, -5695, 6757, 2265, -8168, -2429, -10786, -7334, -7675, -16768, -21404, -9150, -6820, -17448, -17064, -16189, -18241, -9217, -6455, -12524, -11004, -11905, -14412, -15544, -9533, 3723, 13655, 10822, 2113, 1665, -4426, 656, -305, -10864, -4877, -8730, -4736, -11487, -13727, -11000, -6318, -11499, -6856, 4502, 5026, -3326, -1147, 76, 9877, 15111, 11895, 7984, 10980, 14480, 23062, 25958, 16364, 11299, 15979, 2899, 1791, 6408, 10897, 11658, 18891, 4972, -7955, -5014, -2739, 4579, -8113, -8037, 3703, 18211, 32506, 31233, 12448, 8491, -1773, -3381, -10733, -9355, -10122, -9183, -4751, 146, 8261, 7531, -5928, 5175, 5187, 3701, 3805, 2271, -382, -12665]
4395a2665M09M863J0016J939q884J6978k394n301O642K559L693M371p400j0969
4381C857K490l934j6066j0183Q576J3777m008p931o152J342J007p658k182J351
4367b5714N280Q721N591P565m696j4624R094k222p00J1714J1136P94R21l269l002
4352F589j1285j50L096l588M887J30J742m808l316R014Q645K82Q871j7799k2775
4337b0465J037o333m926L586r97M806L696R091P802J2550J663p642N396j3009
4323c745p997N958J5405R029p002r281j006n527l407Q907J028p957J0220J5535
4309B0160r286j6062n949J4330j386j627q201M236O240p385q288j4142n516R429
4295b3447J2370P601r49L49Q358l463j664m073M571J1627P608j4203o926K800
$$ y = [-12665, -12256, -7393, 2623, 4562, -4322, 12656, 10262, 4961, 11603, 14162, 17855, 22226, 14826, 3857, 6347, 2413, -13653, -23836, -15260, -1483, -5491, -13422, -19574, -18232, -17225, -24883, -27065, -25714, -20434, -11713, -6122, 1443, -3253, -17877, -8783, -11005, -11705, 9, 11145, 11939, 12860, 9591, 6589, -4696, -4846, -1750, -5338, -451, -321, 1421, -3387, -6703, 2311, 10956, 11238, 20109, 2310, -20465, -19428, -25761, -30687, -27101, -28098, -23292, -19596, -10505, -2703, 9847, 11510, 3868, 9264, -3745, -11742, -5784, 9621, 18650, 11648, 2367, 1361, -4166, -7573, 1334, 2362, -5595, 4625, 20160, 10874, -5188, -11137, 3193, 1807, 180, -8021, -3785, 2455, -4930, -13218, -27360, -32876, -23447, -11077, -3476, -4425, -4076, 4282, 819, -845, -4918, -347, 11280, 18888, 4685, -2241, 559]
4281E59J1956o05r594j2379M560P182J2188j1543j2259p191K607M554R796J0623
4267A0454M091m900K031p476l235j1362o032K6418p667j7384Q43J9536J1045J045
4253A7407j1596m122k74p178k167j40o944K213K159p102j4696N760J8526k00q286
4238a6640k695J4581K166q94Q627J560j255n084o27l940q517J375o489N496J2198
4223a38j448r069L989p47N732k829j9410n129J2009J0757L617o871N093j327l645
4208i416J766q644Q541L784N420M280O056J1653n795j3620j4319l79N81P307K2920
4193B0135M459j5716l374l22R354n891j2585J708p744Q837R632O803j4075j8121
4179a6900k823j330N007J784O370K795R656Q81L987j496k0754P951K7157O674
$$ y = [559, 12515, 11910, 2316, -10063, -5503, 1679, 13867, 2324, -9935, -17126, -14519, -9965, -169, 10454, 14545, 9645, 11676, 4200, 965, -10397, -16429, 9989, 2322, -15062, -14219, 5317, 16362, 17407, 5811, 1689, 1415, -5763, -7930, -8070, -15014, -12801, -10642, -17744, -32440, -26680, -8154, -8354, -16640, -19335, -4754, -2588, -3482, 5145, 6705, 5450, 366, -261, -4201, -12718, -11343, -17832, -12336, -138, -1586, -10655, -6666, -7413, -1681, -4510, -23920, -29049, -17040, -6283, -2666, -9537, -4444, -5771, -9416, -7650, -16294, -7753, -3969, 1451, 5731, 11787, 23440, 17645, 4025, -10294, -10673, -10092, -2785, 20135, 24594, 8878, 5504, 5182, 14536, 8645, -3940, -2232, -9976, -1139, 8493, 15296, 1221, -16900, -19723, -21053, -16046, -14262, -7892, -5097, 4559, 5440, 9427, 7931, -12823, -4872, 22285, 28959]
4165B8959k7195j378J0094j502j600m233N36K372n681o901o41J2781q134j3913
4151a6436R928J2224M668m856k2554j0804j540O002o403Q690J1995O015O17j094
4137c548j0192m051J2944j312p578m541j518J6026J9299n68o778k0200r435O555
4123a4897J304O481k082K316K0153O397p157q203p88l17L280K283k198J5859R448
4108C1879j4955j5408J483J0981j292n596J234r397j1038O207R587J2258j224
4095A4719l715N285O079k847j3980J4740J88k979o148K98L477k611j0282j6178
4081a3954L620N436L015J0563O696r629n501j2859M551m792j18J0766j3434r996
$$ y = [28959, 1764, 386, 10480, 8978, 7378, 3145, 3681, 6053, 372, -6529, -7170, 5611, -2523, -16436, -6508, 5716, 10384, 5528, -17026, -27830, -29370, -23368, -29771, -21081, -9086, -3071, -2454, -3548, -13740, -17791, -4847, -6159, -13737, -18278, -19796, -3770, 15529, 14961, 8183, -12017, -21452, -14897, -13593, -7112, -9194, -6878, 13275, 19672, 12515, 4312, 3524, 3207, 6487, 8770, 6572, 22431, 31879, 16924, 1516, 2999, 13980, 12688, 7092, 8326, -1071, -12109, -5902, 3685, 15943, 14719, 11004, 16289, 22368, 19521, 5541, 20281, 20469, 17490, 11342, 11640, 15117, 12506, 2224, -13954, -10334, -4898, -1883, 8680, 15376, 5747, 246, -12613, -8062, -12854, -12972, -2206, -15640, -25636]
$$ [...]
##END NTUPLES=NMR SPECTRUM
##END=
