##TITLE=Analysis number 316027
Compound Code cc 42303
Book Reference 449/54
Project Code adrs
Chemist Name davee
##JCAMPDX= 6.0         $$ Bruker NMR JCAMP-DX V2.0
##DATA TYPE= NMR SPECTRUM
##DATA CLASS= NTUPLES
##ORIGIN= Bruker BioSpin GmbH
##OWNER= NMR
$$ XWIN-NMR		Version 3.5
$$ Tue Dec 13 15:20:17 2005 GMT Standard Time (UT+0h)  MAYBRIDGE\NMR@NMR_250MHZ
##.OBSERVE FREQUENCY= 250.131544655141
##.OBSERVE NUCLEUS= ^1H
##.ACQUISITION MODE= SIMULTANEOUS (DQD)
##.ACQUISITION SCHEME= undefined
##.AVERAGES= 16
##.DIGITISER RES= 18
##SPECTROMETER/DATA SYSTEM= dpx250
##.PULSE SEQUENCE= zg30
##.SOLVENT NAME= CDCl3
##.SHIFT REFERENCE= (INTERNAL, CDCl3, 0, 16.522)
##AUDIT TRAIL= $$ (NUMBER, WHEN, WHO, WHERE, WHAT)
$$ ##TITLE= Audit trail, XWIN-NMR		Version 3.5
$$ ##JCAMPDX= 5.01
$$ ##ORIGIN= Bruker BioSpin GmbH
$$ ##OWNER= NMR
$$ C:\u/data/dgb/nmr/ADRS/13810/pdata/1/auditp.txt
$$ ##AUDIT TRAIL=  $$ (NUMBER, WHEN, WHO, WHERE, WHAT)
(   1,<2005-12-13 15:19:47.22 +000>,<MAYBRIDGE\NMR>,<NMR_250MHZ>,
      <created by zg, POWCHK disabled, PULCHK disabled
       configuration hash MD5:
       62 19 C7 07 E1 42 D1 B7 37 6C 3D D0 77 39 F9 E6
       data hash MD5: 64K
       CA 90 42 A9 94 E4 BF 34 3F 5C 92 B7 39 11 35 CD>)
(   2,<2005-12-13 15:20:05.89 +000>,<MAYBRIDGE\NMR>,<NMR_250MHZ>,
      <Start of raw data processing
       ef LB = 0.3 FT_mod = 6 PKNL = 1 SI = 32K 
       data hash MD5: 32K
       AD D2 CB E0 1E 03 E6 3A B5 50 AB A9 E3 2A E7 EA>)
(   3,<2005-12-13 15:20:08.11 +000>,<MAYBRIDGE\NMR>,<NMR_250MHZ>,
      <apk 
       data hash MD5: 32K
       C7 F0 10 06 21 E2 AB 85 62 B7 4E A0 08 CA 37 FA>)
(   4,<2005-12-13 15:20:08.81 +000>,<MAYBRIDGE\NMR>,<NMR_250MHZ>,
      <abs ABSG = 5 
       data hash MD5: 32K
       5E 76 2C BB 16 5C 66 52 8F 5B EC B5 AC 01 C2 5C>)
$$ ##END=
$$ 
$$ hash MD5
$$ B4 72 46 BA 9F C9 2E FA 26 4E 06 7B 93 05 FF BB
##$RELAX= 
##$RELAX= 
##$RELAX= 
##$RELAX= 
##$RELAX= 
##$RELAX= 
##$RELAX= 
$$ Bruker specific parameters
$$ --------------------------
##$DU= <C:\u>
##$EXPNO= 13810
##$NAME= <ADRS>
##$PROCNO= 1
##$TYPE= <nmr>
##$USER= <dgb>
##$AMP= (0..31)
100 100 100 100 100 100 100 100 100 100 100 100 100 100 100 100 100 100 
100 100 100 100 100 100 100 100 100 100 100 100 100 100 
##$AQSEQ= 0
##$AQ_mod= 3
##$AUNM= <au_zg>
##$AUTOPOS= <52 >
##$BF1= 250.13
##$BF2= 250.13
##$BF3= 250.13
##$BF4= 250.13
##$BF5= 500.13
##$BF6= 500.13
##$BF7= 500.13
##$BF8= 500.13
##$BYTORDA= 1
##$CFDGTYP= 0
##$CFRGTYP= 5
##$CHEMSTR= <none>
##$CNST= (0..31)
1 1 145 1 1 1 1 1 1 1 1 1 1 1 1 1 1 1 1 1 1 1 1 1 1 1 1 1 1 1 1 1 
##$CPDPRG= <>
##$CPDPRG1= <>
##$CPDPRG2= <>
##$CPDPRG3= <>
##$CPDPRG4= <mlev>
##$CPDPRG5= <mlev>
##$CPDPRG6= <mlev>
##$CPDPRG7= <mlev>
##$CPDPRG8= <mlev>
##$CPDPRGB= <>
##$CPDPRGT= <>
##$D= (0..31)
0 1 0 0 0 0 0 0 0 0.06 0 0 0 0 0 0 0.0002 0 0 0 0 0 0 0 0 0 0 0 0 0 0 
0 
##$DATE= 1134487185
##$DBL= (0..7)
120 120 120 120 120 120 120 120 
##$DBP= (0..7)
150 150 150 150 150 150 150 150 
##$DBP07= 0
##$DBPNAM0= <>
##$DBPNAM1= <>
$$ [...]
##$SUBNAM6= <"">
##$SUBNAM7= <"">
##$SUBNAM8= <"">
##$SUBNAM9= <"">
##$SW= 20.6930455092707
##$SWIBOX= (0..15)
0 0 3 0 0 0 0 0 0 0 0 0 0 0 0 0 
##$SW_h= 5175.983436853
##$TD= 65536
##$TD0= 1
##$TE= 294.16
##$TE2= 300
##$TE3= 300
##$TEG= 300
##$TL= (0..7)
0 120 120 120 120 120 120 120 
##$TP= (0..7)
150 150 150 150 150 150 150 150 
##$TP07= 0
##$TPNAME0= <>
##$TPNAME1= <>
##$TPNAME2= <>
##$TPNAME3= <>
##$TPNAME4= <>
##$TPNAME5= <>
##$TPNAME6= <>
##$TPNAME7= <>
##$TPOAL= (0..7)
0.5 0.5 0.5 0.5 0.5 0.5 0.5 0.5 
##$TPOFFS= (0..7)
0 0 0 0 0 0 0 0 
##$TUNHIN= 0
##$TUNHOUT= 0
##$TUNXOUT= 0
##$USERA1= <user>
##$USERA2= <user>
##$USERA3= <user>
##$USERA4= <user>
##$USERA5= <user>
##$V9= 5
##$VALIST= <valist>
##$VCLIST= <CCCCCCCCCCCCCCC>
##$VD= 0
##$VDLIST= <DDDDDDDDDDDDDDD>
##$VPLIST= <PPPPPPPPPPPPPPP>
##$VTLIST= <TTTTTTTTTTTTTTT>
##$WBST= 1024
##$WBSW= 4
##$XGAIN= (0..3)
0 0 0 0 
##$XL= 0
##$YL= 0
##$YMAX_a= 362984
##$YMIN_a= -446574
##$ZGOPTNS= <>
##$ZL1= 120
##$ZL2= 120
##$ZL3= 120
##$ZL4= 120
##$ABSF1= 16.522
##$ABSF2= -4.171173
##$ABSG= 5
##$ABSL= 3
##$ALPHA= 0
##$AQORDER= 0
##$ASSFAC= 0
##$ASSFACI= 0
##$ASSFACX= 0
##$ASSWID= 0
##$AUNMP= <proc_1d>
##$AZFE= 0.1
##$AZFW= 0.1
##$BCFW= 0
##$BC_mod= 0
##$BYTORDP= 0
##$COROFFS= 0
##$CY= 12.5
##$DATMOD= 1
##$DC= 0
##$DFILT= <>
##$DTYPP= 0
##$F1P= 14.0000005364418
##$F2P= -0.99999901652339
##$FCOR= 0.5
##$FTSIZE= 32768
##$FT_mod= 6
##$GAMMA= 0
##$GB= 0
##$INTBC= 1
##$INTSCL= 1
##$ISEN= 128
##$LB= 0.3
##$LEV0= 0
##$LPBIN= 0
##$MAXI= 10000
##$MC2= 0
##$MEAN= 0
##$ME_mod= 0
##$MI= 0
##$NCOEF= 0
##$NC_proc= -4
##$NLEV= 6
##$NOISF1= 0
##$NOISF2= 0
##$NSP= 0
##$NTH_PI= 0
##$NZP= 0
##$OFFSET= 16.522
##$PC= 1
##$PHC0= 91.63669
##$PHC1= 0
##$PH_mod= 1
##$PKNL= yes
##$PPARMOD= 0
##$PSCAL= 4
##$PSIGN= 0
##$REVERSE= no
##$SF= 250.13
##$SI= 32768
##$SIGF1= 0
##$SIGF2= 0
##$SINO= 400
##$SIOLD= 32768
##$SREGLST= <1H.CDCl3>
##$SSB= 0
##$STSI= 32768
##$STSR= 0
##$SW_p= 5175.98343685301
##$SYMM= 0
##$S_DEV= 0
##$TDeff= 65536
##$TDoff= 0
##$TI= <Analysis number 999999
Compound Code 99
Book Reference 9
Project Code 9>
##$TILT= no
##$TM1= 0
##$TM2= 0
##$TOPLEV= 0
##$USERP1= <user>
##$USERP2= <user>
##$USERP3= <user>
##$USERP4= <user>
##$USERP5= <user>
##$WDW= 1
##$XDIM= 32768
##$YMAX_p= 304454072
##$YMIN_p= -513117
$$ End of Bruker specific parameters
$$ ---------------------------------
##NTUPLES= NMR SPECTRUM
##VAR_NAME=  FREQUENCY,     SPECTRUM/REAL,   SPECTRUM/IMAG
##SYMBOL=    X,             R,               I
##VAR_TYPE=  INDEPENDENT,   DEPENDENT,       DEPENDENT
##VAR_FORM=  AFFN,          ASDF,            ASDF
##VAR_DIM=   32768,         32768,           32768
##UNITS=     HZ,            ARBITRARY UNITS, ARBITRARY UNITS
##FACTOR=    0.157963299565203, 1,           1
##FIRST=     4132.6476996994, 0,             0
##LAST=      -1043.33573715361, 0,           0
##MIN=       -1043.33573715361, -513117,     0
##MAX=       4132.6476996994, 304454072,     0
$$ Real data points
##PAGE= N=1
##DATA TABLE= (X++(R..R)), XYDATA
$$ [...]
23888A59421q5870j11470r84q6080J07514P4887J3830m1703r4492j3555k7336
23877a05838o8298j43035m8353J27986J22757M8159J45889j8259q4697m9859p9505
23866a53053P3565n1809q5259n11J27902J01628l8417Q7612J28062m5304m8495
23855I5921L1039O9969k424j8475l444j25761m6758j3085L9079J53289l4553j21986
23843B2811j07933O5649M2796K4993j1506m6307Q491j2748o364J9569J38957P9725
23831B18133j34574j24032l4562n872m9817J30170Q469N754p5677m5449N0297
23820e7160R3930N032L582k9733J3607j66883q0664P6556Q2713R2987J3754M193
23808E1914l6975O4754J10916q7202k9479n8056o2363m0591l4650M8772j7370
$$ plain form
23888 159421 73551 -37919 -38903 -124983 -17469 57418 71248 29545 -64947 -78502 -105838
23877 -105838 -174136 -317171 -365524 -237538 -114781 -66622 79267 61008 -23689 -73548 -153053
23866 -153053 -79488 -131297 -216556 -217067 -89165 12463 -25954 61658 189720 144416 95921
23855 95921 126960 196929 194505 176030 172586 46825 67 -13018 26061 179350 144797 22811
23843 22811 -85122 -19473 23323 48316 36810 -9497 -1006 -13754 -20118 -549 138408 218133
23831 218133 83559 -40473 -75035 -80907 -130724 -554 7915 13669 -62008 -107457 -57160
23820 -57160 36770 41802 45384 15651 29258 -137625 -218289 -141733 -59020 33967 47721 51914
23808 51914 14939 79693 190609 103407 73928 15872 -46491 -87082 -121732 -72960 -90330
23797i0330k0362L7097K9363l0479K0099Q3842o3473p6401p312m7092K2408J47458
23785D818n978N1501Q1251j10484k6841J9445r37j9400k4570q3732K572K4012
23773h8343J8756O7536l0874j2359J27594J58760p9525p3061o8145m5132q8442
23762a13235k0250N7771M1336q7238J11562O0833p9251k9499N9191K7131L0507
23751E8858m1378m7267R5508Q9759j48526l2649N9577N5272K2818Q314l7734j35934
23739e3382q2455K6038J1439m9082J11527P3664K529K5303j6910j543n7649j3474
23727b3995k1182M6078M8127r8802k5661J65000j4797j01606j3902M166J39604
23716A03030K6470K6228q7781K9398J491j79765j5479j7622J9078K9677R0811
$$ plain form
23797 -90330 -110692 -73595 -44232 -74711 -54612 29230 -34243 -110644 -117956 -165048 -142640 4818
23785 4818 -1160 50341 131592 21108 -5733 13712 12775 -6625 -31195 -114927 -112355 -88343
23773 -88343 -69587 -2051 -32925 -45284 82310 241070 161545 88484 20339 -24793 -113235
23762 -113235 -133485 -75714 -34378 -121616 -10054 50779 -28472 -57971 1220 28351 58858
23751 58858 17480 -29787 65721 155480 6954 -25695 33882 89154 111972 120286 82552 -53382
23739 -53382 -135837 -109799 -98360 -147442 -35915 37749 40278 65581 48671 47128 -10521 -23995
23727 -23995 -45177 901 49028 -49774 -75435 89565 74768 -26838 -40740 -36574 103030
23716 103030 129500 155728 67947 97345 98836 -80929 -96408 -114030 -94952 -65275 25536
23705B5536J6269n5424M7198l6264n3233M0342p8102r0060n7652K0699O7648J43164
23693i879N3215p1187m5183K3092K6122o5564K5083R5690r073l5142j9222k9049
23681f1097q5491J06686r3421o1594O6661J18742P3340J284J7101L1549K5864
23670A39624n4768o5383L8029K9141n6525P998J2616j60157l2504O5427p2942
23659a49444j49870K1496J13435Q3391J44471o2639p6832j2714p3843r6065N4054
23648b04560L5050J18093o4247K4059j0759M1510N8346N0442l1053M3171l2909
23637B7143j5425k2675J2584O9562k744r5125R9144J1531O3863O0052K9058K2814
23625B59782r3495j36439j4904L3105l0024M6985N0318n4805J4548k4159Q2399
$$ plain form
23705 25536 41805 -13619 33579 -2685 -55918 -15576 -93678 -183738 -241390 -220691 -153043 -9879
23693 -9879 43336 -27851 -73034 -49942 -23820 -89384 -64301 31389 22316 -12826 -32048 -61097
23681 -61097 -146588 -39902 -133323 -194917 -128256 -9514 63826 65110 82211 113760 139624
23670 139624 84856 19473 57502 86643 30118 38116 50732 -109425 -141929 -76502 -149444
23659 -149444 -299314 -277818 -164383 -80992 63479 840 -75992 -88706 -162549 -258614 -204560
23648 -204560 -169510 -51417 -115664 -91605 -102364 -60854 -2508 47934 16881 60052 27143
23637 27143 11718 -10957 1627 71189 68445 -26680 72464 83995 147858 207910 236968 259782
23625 259782 166287 29848 14944 48049 18025 65010 115328 60523 75071 50912 133311
23614A33311K1124r3286n3658q7862O1198Q6995K9313m7496p6448o4676P551k8237
23602a12171P0380m4968o6204O2541P8404o5907o144l2434Q2321J9710k8505k0807
23590f3784J3660n6761L9898M3846J57721p86q7527o4938J2781J055M3317M0227
23578G8709o9896k8509J00020M7291o9748p1963Q686N700k9119K4056o6360j1872
23566h3005m1230L5127J82517J93042k4245j11966m5463j8935k6079J17283k03930
23555b6884n9409n3266j300J09047j0221J3671q270p671q0831K2933J9843L6193
23543d6165k8230L896J70222N6681j35462j04156j11128J06601N0731J10586J1407
23532H4983l83p3300M1561j1960M0489K870l655n6840o3802J9401J9849k5720
$$ plain form
23614 133311 154435 61149 7491 -80371 -19173 67822 97135 49639 -26809 -91485 -83934 -112171
23602 -112171 -41791 -86759 -152963 -90422 -12018 -77925 -84069 -116503 -34182 -14472 -42977 -63784
23590 -63784 -50124 -106885 -66987 -23141 134580 133794 46267 -18671 -5890 -4835 38482 78709
23578 78709 8813 -19696 80324 127615 57867 -14096 -5410 290 -28829 -4773 -71133 -83005
23566 -83005 -124235 -89108 93409 286451 262206 150240 104777 85842 59763 177046 -26884
23555 -26884 -86293 -139559 -140859 -31812 -42033 -28362 -36632 -44303 -125134 -102201 -82358 -46165
23543 -46165 -74395 -70499 99723 156404 20942 -83214 -194342 -87741 -37010 73576 84983
23532 84983 84600 11300 52861 40901 81390 84260 80605 23765 -40037 -20636 -787 -26507
23520b6507j41236M3744J59755k156P298j1993k7256M3204r8356j05289J34426
23509b4366L5656O5297m586J4598M3984K232j02529L7602j7890l8605M663k098
23497A3958J5421J9443k2405k7672M1394j6164O406L2677R4179j1625K0548N8212
23485B24372k3j30834j05857r915J0952l6378M7328P3368j6086q3903p7055o9482
23473a73513N8927J01702J11441K1848k3749n7318q0997j08813o7968L7906J08136
23462g2398m5995j2783L7436j3186n7953N4273J39753J1189m1220O3518j07755
23451d5121J54188J90370k6864k27810j79561O646K5171J15937k4714m9862O6369
23440D749l4266o4098l6773M5863N6881n0439K429O5813k8479p6938j19301K9227
$$ plain form
23520 -26507 -167743 -123999 35756 33600 40898 28905 1649 44853 -53503 -158792 -24366
23509 -24366 11290 76587 72001 86599 130583 132815 30286 67888 49998 11393 16056 13958
23497 13958 29379 48822 26417 -1255 40139 23975 30381 63058 157237 145612 166160 224372
23485 224372 224349 93515 -12342 -22257 -11305 -47683 -355 73013 56927 -26976 -104031 -173513
23473 -173513 -114586 -12884 98557 120405 96656 39338 -41659 -150472 -218440 -180534 -72398
23462 -72398 -118393 -131176 -93740 -106926 -164879 -110606 29147 40336 -884 62634 -45121
23451 -45121 109067 299437 272573 44763 -134798 -128152 -102981 12956 -11758 -61620 4749
23440 4749 -29517 -93615 -130388 -84525 -27644 -78083 -75654 -9841 -38320 -115258 -234559 -205332
23428b05332M499j4138N2690k602J16788R1750J49839R593l6535m2817L8410J5979
23416A78124j64209j44698q0960j0886J1973K06948P4340n2505J01116Q3990K4036
23405B27269k10527j86515p302R7925J1917J31829k1634J3215J2892l0568O194
23394D4695p985r3811q2111M3448J40666O400p9617m9125L1276J05687Q5985j1174
23382A34334j16574j45257j104N2253k5928J0799O8842J1820j27394J1695P7035
23371d9479J69719J0016j09732j6629J48521N4807K0838q1214j7538m9178o9133
23360A0998L047l6942n3138P2660j9908N148J61079M4266j75530j6138R3940J19347
23348B08829j9698q0810Q132p703j77575p4866N2033l750m7323q34K3875J2563
$$ plain form
23428 -205332 -200833 -214971 -162281 -164883 -48095 43655 193494 203087 166552 123735 162145 178124
23416 178124 13915 -130783 -211743 -222629 -210656 -3708 70632 18127 119243 203233 227269
23405 227269 16742 -169773 -177075 -79150 -67233 64596 42962 56177 69069 38501 44695
23394 44695 36710 -57101 -139212 -95764 44902 51302 -28315 -77440 -46164 59523 145508 134334
23382 134334 17760 -127497 -128601 -76348 -102276 -91477 -22635 -10815 -138209 -126514 -49479
23371 -49479 120240 130256 20524 3895 152416 207223 228061 146847 129309 80131 10998
23360 10998 14045 -22897 -76035 -3375 -23283 -18135 142944 187210 11680 -4458 89482 208829
23348 208829 189131 108321 116453 108750 -68825 -143691 -91658 -95408 -142731 -143565 -119690 -107127
23336a07127P2131L144j5127J8121j43391J05195P8214k3553k6131M0831l1715
23325b9408o3355J6399L2714n6630j5667O5621O8327m8600k0363j8981L5871N7561
23313B3489P8304M2422j27545q5577m8599R7336J60988n0417p7091J31450J70931
23302C15691p8861r3522p4550l6755j40718p5421j48062k8908J13137R8869J39217
23291i883M3208k285K481n6515K7109p4595m5989J32712J41198K485M2277m9484
23279A52719q4890o7318j0306L3448l6054q4495k449m4672N4774L0438K1975j5309
23267e2139R8394M0613K3562M6108q4031j64145j7729L736n188O3412l038l6200
23255h6645M4369P364Q5326L9236R6676K47J2472r6456j10761N4399K3986M2476
$$ plain form
23336 -107127 -34996 -31852 -46979 -28858 -172249 -67054 11160 -12393 -38524 2307 -29408
23325 -29408 -92763 -76364 -43650 -100280 -115947 -50326 18001 -30599 -50962 -69943 -34072 23489
23313 23489 101793 144215 16670 -68907 -117506 -20170 140818 90401 13310 144760 315691
23302 315691 236830 143308 68758 32003 -108715 -184136 -332198 -361106 -247969 -149100 -9883
23291 -9883 33325 31040 33521 -22994 4115 -70480 -116469 16243 157441 159926 202203 152719
23279 152719 67829 511 -9795 23653 -12401 -96896 -99345 -144017 -89243 -58805 -36830 -52139
23267 -52139 46255 86868 110430 156538 72507 -91638 -109367 -105631 -110819 -47407 -50445 -86645
23255 -86645 -42276 -34912 50414 89650 186326 186573 199045 102589 -8172 46227 70213 112689
23243A12689J6384m6785r3260j2801N1631l3044m9186p1777j16674M6449O6822
23232a29552m7924J04928L5495O5723J338p1017N786p2112P9881N4637R6070q0443
23220D2810p9878J0763q4700k6478J02892R4520m0190K3593L0877n3104j10921
23209h9816o9620J49283J89695J12386l6411j12020l3594l8524l6866p6258q6640
23198a28385O7519K12277M6180q3308j30179J16358P3035L1885o9388n9172k5502
23187E1320J4480P7141j4170j6641j64711o7320J92824R3933m4612M7070j17401
23176E1913r6294n2787O3802L6405k268P4693L2761K9281p4304j41528p9602N167
23164a52761j6488J09140N8637p7871k657J41590J2810j5035L6744j49980p7637
$$ plain form
23243 112689 129073 82288 -10972 -23773 27858 -5186 -54372 -126149 -242823 -196374 -129552
23232 -129552 -177476 -72548 -37053 28670 30008 -41009 -35223 -107335 -27454 27183 123253 42810
23220 42810 -37068 -26305 -111005 -137483 -34591 59929 19739 43332 74209 21105 -89816
23209 -89816 -159436 -10153 179542 291928 255517 143497 109903 71379 34513 -41745 -128385
23198 -128385 -60866 151411 197591 114283 -15896 100462 173497 205382 135994 76822 51320
23187 51320 65800 142941 128771 112130 -52581 -119901 72923 166856 122244 169314 51913
23176 51913 -44381 -97168 -33366 3039 771 75464 108225 137506 63202 -78326 -157928 -152761
23164 -152761 -169249 -60109 -1472 -79343 -82000 59590 72400 57365 94109 -55871 -133508
23153a33508j9289k397Q4417P163M4874m554P0078R8087R4333J39140k3421j05303
23141B49620k07374j21573K7223o886P123Q3784r0162j64553M4681J02023J00924
23130B4830P435r8110n9973l9246Q028n475J2641o2364P0682K326k4246O8819
23118i4653J21968O0485r7742k9070N4479q815m4895r936o1472J19796J25649
23107A35794p5317q2886R189P0436j09567o4272J8800J27353L966k2172J7339
23096B8663p5059m81L0539j6473j0141L9655l3951j0912P4322p8961o3999J27226
23084A0428j4751m3083k5579O7782L7141k0182j5492o8919K1912Q7475m7257n4923
23072f5448M0356K3958N1037k7369j31101j5739J10267q357K419L2142n5901p7382
$$ plain form
23153 -133508 -152797 -155194 -70777 -63614 -18740 -23294 46784 144871 239204 378344 354923 249620
23141 249620 42246 -79327 -52104 -58990 -51867 31917 -58245 -222798 -178117 -76094 24830
23130 24830 32265 -65845 -125818 -165064 -157036 -162511 -149870 -212234 -141552 -139226 -163472 -94653
23118 -94653 27315 87800 -9942 -39012 15467 6652 -38243 -48179 -109651 10145 135794
23107 135794 60477 -22409 -13220 57216 -52351 -116623 -97823 29530 33496 11324 28663
23096 28663 -46396 -46877 -16338 -32811 -42952 -3297 -37248 -48160 26162 -52799 -116798 10428
23084 10428 -4323 -47406 -72985 -5203 31938 11756 -3736 -72655 -50743 36732 -10525 -65448
23072 -65448 -25092 -1134 49903 22534 -108567 -124306 -14039 -22396 -19977 12165 -43736 -121118
23060a21118m9246L9333j9025j6985q9324R9584Q8235O4850p0765j52516j63536
23049c90513n7286J82725J4794O2437N5960K6907J5750J03915o8816r8628j6089
23038a68844J34502J11606J82249J9955j15040l7775J810q0893j54449k1767M8694
23027g9952J12861P9808K3186n2284j73851J10832J03169l5083K4019n0239Q1541
23016A44007J6281m7143j02374o8991L7378k3836p0195J0545L7715J01630j219
23005C3798q6562r1841J10216o378l7092j7664R6966K34253L2392L3417j17542
22994A83963n7671L9060r278j49441m0949N6786O31J8715q8211j39292J5079J15459
22982e5149k5301L6878j19597k678J46238J84700j03966q0592m2271L8646j05571
$$ plain form
23060 -121118 -170364 -131031 -150056 -167041 -256365 -156781 -68546 -3696 -74461 -226977 -390513
23049 -390513 -447799 -265074 -250280 -187843 -131883 -104976 -89226 14689 -54127 -152755 -168844
23038 -168844 -34342 77264 259513 279468 164428 126653 128463 47570 -106879 -128646 -79952
23027 -79952 32909 112717 135903 83619 -90232 20600 123769 88686 112705 62466 144007
23016 144007 160288 113145 10771 -58220 -20842 -44678 -114873 -104328 -66613 35017 33798
23005 33798 -52764 -144605 -34389 -40767 -77859 -95523 1443 235696 268088 301505 183963
22994 183963 126292 165352 156074 6633 -34316 22470 23101 41816 -46395 -185687 -170608 -55149
22982 -55149 -80450 -43572 -163169 -165847 -19609 165091 61125 -19467 -61738 -23092 -128663
22971a28663j7551J09545K8004l8640J3919l2846j9612j08503m4045R8576P3120
22960f6696n361M9987M0344J9237L3404M720r2165p7942N2989N2253q8158K9996
22948d7392J03451j4139j39244k11189K0272J06282O3252J875k5061k5426K8039
22937a39280l541L3451K0701q0662j8595M9258j32976Q0605K7946N1484J09668
22926a941J09900o4015m6122l9172M4045J7156r1873k3566K6032J4368K4091j27699
22914a58796m2071P7366J46748R5989J87873K8807j08087o2129j45828j12432
22904i2560N3230J5573N1699m981J9723P294P75q412N320L8632R3990K838j51780
22891C1341j04037R015N1165J0493j61785Q0145J50396L7914j5324J4350M1374
$$ plain form
22971 -128663 -146214 -36669 -8665 -47305 -33386 -66232 -85844 -194347 -238392 -139816 -66696
22960 -66696 -72057 -22070 18274 37511 70915 75635 -16530 -94472 -41483 10770 -77388 -47392
22948 -47392 56059 41920 -97324 -308513 -288241 -181959 -118707 -116832 -141893 -167319 -139280
22937 -139280 -142821 -109370 -88669 -169331 -187926 -138668 -271644 -191039 -163093 -111609 -1941
22926 -1941 107959 43944 -2178 -41350 2695 19851 -72022 -95588 -69556 -55188 -31097 -158796
22914 -158796 -200867 -123501 23247 119236 307109 335916 227829 165700 19872 -92560
22904 -92560 -39330 -23757 27942 22961 42684 49978 50753 42341 47661 86293 180283 183121 31341
22891 31341 -72696 -63681 -12516 -2023 -163808 -83663 66733 104647 89323 103673 145047
22880A45047P947Q7631j04563r9014L75p9739N2829j15925N2572Q3703L4514q1326
22868a5949j18331q7816o9958N2437J11897L6028k536L7832J4548J26136j5003
22857F9285k6315L5498j46845m1653M7798L4848Q2768N4932m7198k6822j8352
22846A7944J5383L3349m1935k7306N5425j16628n951J16452j36691j79327o822
22835b76107J23335o343l2468J39406J57423N1026L8852j05408j14576Q9670J4368
22824G9178J6551l4817j7420k3891K946J214p6477l1674l9761j2882M0170J65968
22812F9105N1526o6842p607J09206N7818q9305j12033K947n8590q3171N2168J26153
22800E1375M49Q233j01000n8995r7808n1900Q9711J85445P6790n5061j6800r1582
$$ plain form
22880 145047 152994 240625 136062 37048 37423 -42316 10513 -105412 -52840 30863 65377 -15949
22868 -15949 -134280 -222096 -292054 -239617 -127720 -91692 -94228 -56396 -41848 84288 69285
22857 69285 42970 78468 -68377 -110030 -62232 -27384 55384 110316 63118 36296 17944
22846 17944 33327 66676 24741 -2565 52860 -63768 -69719 46733 -89958 -269285 -276107
22835 -276107 -152772 -159115 -191583 -52177 105246 156272 195124 89716 -24860 64810 79178
22824 79178 95729 60912 43492 19601 22547 23761 -52716 -84390 -124151 -137033 -96863 69105
22812 69105 120631 53789 46182 155388 213206 123901 11868 14815 -43775 -126946 -74778 51375
22800 51375 51824 60057 -40943 -99938 -197746 -249646 -159935 25510 102300 47239 30439 -61143
22788f1143j30074Q4998P4519m7845Q002K4098l1644l0290p319Q0667j27321k914
22776a66266M0192j9429k748k7439M6652l9057l9219M9120J20819K6277o1814
22765g2912l1719P994M9733M9666N2785l2039k1046k91J12517j06368j25345q2465
22753a99490O6252P3752J04061j17406n7953L3511J16697J16472O4162j17473
22743H2585m2104J4782J9259M0988j00490l0714n9477J31742P7018l353j7984
22732A12252L146p6526p2789l1267k9175L0053j4289l8065N0450j8260J20405
22721C5935K0254n8507j3314m8748J24054R578J209J7112p673n0119O6912j56286
22709e9593j00577J10810M7043j43017j5031P411L2962J45990J21986K3388m2642
$$ plain form
22788 -61143 -191217 -106219 -31700 -79545 -71543 -47445 -79089 -109379 -116698 -36031 -163352 -166266
22776 -166266 -126074 -145503 -148251 -175690 -129038 -168095 -207314 -158194 -37375 -11098 -72912
22765 -72912 -104631 -96637 -46904 2762 55547 23508 2462 2171 114688 8320 -117025 -199490
22753 -199490 -133238 -59486 44575 -72831 -130784 -97273 19424 135896 200058 82585
22743 82585 40481 55263 74522 115510 15020 -15694 -75171 56571 133589 130236 112252
22732 112252 115398 38872 -33917 -65184 -94359 -64306 -78595 -116660 -66210 -84470 35935
22721 35935 56189 -2318 -15632 -64380 59674 69252 70461 87573 79900 29781 96693 -59593
22709 -59593 -160170 -49360 -2317 -145334 -160365 -152954 -119992 25998 147984 171372 128730
22698A28730j52992p1539J3095R8674J02180p9808j16846j30137P371J87043L4541
22687B0312O561L8300n2386j18085N1687K0717q7926N916J05001j2856J3120j5210
22675b4849K8207J8591Q7060n5829j75715j7738j93466J31028J15661o8788p9437
22664b35275j2722J10044M5276P3969n134J04271J27637J42237k0181j57940r5971
22653G6211m2964j45500k9718J42585N6943o1248j4614m0517K5144L4357j2501
22642a1822j69160o0315o4140N3679J75653L302K5210Q8133l1505p4637r08K5453
22630d1057k4518N6921m319n942L7015K4930j8721L6603P1118J16467K19P210
22618B55926P568l9648j04837j00923k7301j797o9508j9235r3902j63025N2712
$$ plain form
22698 128730 -24262 -95801 -82706 15968 118148 38340 -78506 -208643 -201272 -14229 20312
22687 20312 26873 65173 12787 -105298 -53611 -32894 -120820 -114904 -9903 -22759 -9639 -24849
22675 -24849 3358 21949 109009 53180 -122535 -140273 -333739 -202711 -87050 -155838 -235275
22664 -235275 -247997 -137953 -92677 -18708 -23842 80429 208066 350303 330122 172182 76211
22653 76211 33247 -112253 -141971 614 57557 -3691 -18305 -58822 -33678 679 -11822
22642 -11822 -180982 -241297 -305437 -251758 -76105 -72803 -47593 40540 9035 -65602 -66510 -41057
22630 -41057 -65575 -8654 -12973 -18915 18100 43030 24309 60912 132030 248497 248716 255926
22618 255926 263494 223846 119009 18086 -9215 -11012 -80520 -99755 -193657 -356682 -303970
22607c03970R4492J57192R8877j23145r6077j6298k8999Q3601J31862K4758J2702
22596C4995m4281j10212j2589K3433K1482K9620j04290n0206l0732J99657J192
22585d1931q244K6403l3481K0985P215m7524o2325Q7918J43025Q8102m0746P7767
22573B17164M6778j92147j67546J05061N4441O7081R7835j21651j18568K9049
22563A7497J6433M6680P7073j7254q9122j48531J2873J28940K4273l3479r4547
22552e9164j23753N7381J85302N4580r8356j46250k8501P1776M2855j4723p544
22541f6397J187l7229j9215m5384m0047J5497J16729O8593J7291L6744j4745k5160
22529G864K2940m4079J8566J45824l0049q9736k0471j14345j21430J29916P5332
$$ plain form
22607 -303970 -209478 -52286 46591 -76554 -172631 -188929 -217928 -134327 -2465 22293 34995
22596 34995 -9286 -119498 -132087 -108654 -87172 -57552 -161842 -212048 -242780 -43123 -41931
22585 -41931 -50175 -23772 -57253 -36268 -29053 -76577 -138902 -50984 92041 180143 139397 217164
22573 217164 263942 71795 -95751 9310 63751 130832 228667 107016 -11552 17497
22563 17497 33930 80610 157683 140429 51307 -97224 -84351 44589 68862 35383 -59164
22552 -59164 -182917 -125536 59766 114346 15990 -130260 -158761 -86985 -44130 -58853 -66397
22541 -66397 -65210 -102439 -121654 -167038 -207085 -191588 -74859 -6266 11025 47769 33024 7864
22529 7864 30804 -13275 5291 151115 121066 31330 10859 -103486 -224916 -95000 -19668
22518a9668K2811j42166q7352O4142K3435P8412L2816r4691o600R1663n7971J3832
22506h1337r718K3024p564Q3825J08000M547q6397n5044j81355L136P7364P5216
22494d6303m1251r207K2420M1998J15612k1808O969j05760O8030M595n3589p73
22482a9067J21735M3266j6146j10423j18002m6846n3417j8277P7665J39440Q94
22471H22j30748J8471j6412J31328j3586K8523K6699p5185l8682k7676j04603
22460b01049n6666R1473R1247l9552Q514J01906K4952k3103p5181k1657M2305
22449e6811M5818K6133r80k446r6734K8563J01984L7906l5109m4839o1551K262
22437e5804K5348q7024M3854J00670k8325j3184L4125O4287p2088P932l5955P334
$$ plain form
22518 -19668 3143 -139023 -226375 -162233 -138798 -60386 -27570 -122261 -128861 -37198 -95169 -81337
22506 -81337 -91055 -68031 -75595 8230 116230 120777 34380 -20664 -202019 -198883 -121519 -46303
22494 -46303 -87554 -96761 -74341 -32343 83269 61461 68430 -37330 30700 35295 -18294 -19067
22482 -19067 102668 145934 129788 19365 -98637 -145483 -198900 -217177 -139512 -72 822
22471 822 -129926 -111455 -127867 3461 -10125 18398 45097 -30088 -68770 -96446 -201049
22460 -201049 -257715 -166242 -74995 -114547 -106033 -4127 20825 -2278 -77459 -99116 -56811
22449 -56811 -10993 15140 14160 11714 -85020 -56457 45527 83433 48324 3485 -58066 -55804
22437 -55804 -30456 -117480 -73626 27044 -1281 -14465 19660 83947 11859 19791 -16164 -8830
22425h830j4019P3760k905l9458j09107n0495J33956J56101q5388q9492M4700
22414H823l3191J1023o030N23k7319R3906k5765j85446q6839O270k8388P9524
22402a92909J34106K1527p222J42921J15813q6222p1569j18178Q4503O5437m2740
22391D5467M239k9808L729k5533j745l118K2262q257n2574m1853o2459p0914R1784
22378a28780Q4066k3089L0883J19073R7535j17610j02552j4555M8025l9992j10197
22367a57193k7942J02825K8773j80720K8594k6978j0651R5142O4181J8647L3181
22356c2141M471k5295K6993J10794k208j1978M0560M2134j49071k47985k8567
22345b72293J10129N7805j29352j04639K4590O0941J48646n42N435Q1545L9677
$$ plain form
22425 -8830 -22849 50911 48006 8548 -100559 -151054 -17098 139003 53615 -35877 8823
22414 8823 -24368 -13345 -19375 -18852 -46171 47735 21970 -163476 -250315 -244045 -272433 -192909
22402 -192909 -58803 -37276 -44498 98423 214236 128014 56445 -61733 22770 88207 45467
22391 45467 49706 19898 23627 -1906 -3651 -6769 15493 7236 -45338 -87191 -149650 -220564 -128780
22378 -128780 -44714 -67803 -36920 82153 179688 62078 -40474 -55029 -7004 -46996 -157193
22367 -157193 -185135 -82310 -53537 -234257 -205663 -232641 -243292 -148150 -83969 -65322 -32141
22356 -32141 -27670 -52965 -25972 84822 82614 70636 111196 153330 4259 -243726 -272293
22345 -272293 -162164 -104359 -233711 -338350 -313760 -252819 -104173 -104715 -99280 -17735 21942
22334B1942L1996N2751l694J2932r8514j59986o5023J3320J23000J83604p2133
22323D0195m6214J1191m8626l6510j7090K5595J20277M3241q5402j822j45122
22312a40287Q1450P2978L6225j5245P3305J1681j07977j70442m7680J28142M7610
22301c0240m2396M3973j41656o840J05328o7262J5076M1719N0247O3328m2831
22290a1554Q3062o2800k4325J0890N8870j7054n6932l6862j6698K8748P7525l2572
22278B98o2772K9061M812n5176J14m8604k2763q346K7864K4742k5461m2227n0106
22265b28564Q3274J49496m0833k868o8574n4817J33658P2591j04316K5162R2600
22254E6809k1780m6700R6588J29555P8706l4745j61380m1108p7655n215Q0491
$$ plain form
22334 21942 53938 106689 102995 115927 17413 -142573 -207596 -194276 -71276 112328 40195
22323 40195 -6019 5172 -43454 -79964 -97054 -71459 48818 92059 6657 4835 -140287
22312 -140287 -58837 14141 50366 35121 108426 120107 12130 -158312 -205992 -77850 -30240
22301 -30240 -72636 -28663 -170319 -177159 -71831 -139093 -124017 -82298 -32051 31277 -11554
22290 -11554 71508 8708 -15617 -4727 54143 37089 -19843 -56705 -73403 -44655 32870 298
22278 298 -62474 -33413 -28601 -83777 -83663 -132267 -155030 -163376 -135512 -110770 -136231 -178458 -228564
22265 -228564 -145290 4206 -36627 -39495 -108069 -162886 -29228 43363 -60953 -35791 56809
22254 56809 35029 -11671 84917 214472 293178 258433 97053 55945 -21710 -26925 53566
22243E3566M6030m0006k7973m5780l6933p1673j7509O3715M6523K6375Q2106J9268
22231I7709O071n9869m1627J380n3969o541k3053j0518n4174k888k6529n2373
22219b26381L7443K0856Q839N3437Q360O8768K7420p1662L9108q201J520O0737
22207B0244Q3636j84121r5290J2640N476K0217R5896l8928L5696Q4481L825J7212
22195F0984K5436m9875J6310m7945J854J68131o565r7253K1775j75259M7098J48119
22183A12810K3468M0927j24622m6795J6150m8798M1846L8183J1251l1895N3938
22172H6463J1664n5329m9955n1955l1849q1431K0292P4276K1876Q7342L018M0681
22160G5093m505q7757p5452p3829K8692N1836P189J8611j8493p3165p9227J26381
$$ plain form
22243 53566 99596 59590 31617 -14163 -51096 -122769 -140278 -76563 -30040 -3665 78441 97709
22231 97709 103780 43911 2284 3664 -50305 -56846 -79899 -90417 -144591 -147479 -174008 -226381
22219 -226381 -188938 -168082 -159243 -105806 -97446 -28678 -1258 -72920 -33812 -42013 -40493 20244
22207 20244 103880 -80241 -175531 -162891 -157415 -137198 -41302 -80230 -44534 39947 43772 60984
22195 60984 86420 36545 52855 4910 6764 174895 168330 71077 92852 -82407 -35309 112810
22183 112810 136278 177205 52583 5788 21938 -26860 14986 53169 64420 32525 86463
22172 86463 98127 42798 -7157 -59112 -90961 -172392 -152100 -77824 -55948 31394 34412 75093
22160 75093 70588 -17169 -92621 -166450 -137758 -85922 -78733 -60122 -78615 -151780 -231007 -104626
22148a04626J883k02213J3913J57254L6017K8819j0153P6621Q0868o3792q0173
22137f5582J48445J26675j24437p8692o9732J643O6473L951m1595M8862o6243
22126e0232l1804J5875n9389o2454R907J05764R5067K9010j33233j20506Q4878
22115a17117J58367j7078k22071j04284N8975M6190J24486J44070N5559o2611
22105F4486j10106n1009l5750P7595J10050L0853j00039l0099M0721J28743n086
22094A20359j31974l2705m4008l4716L1336J35925N1237r0318j38403J28877J1604
22083G214J9094P1000n1906p6175j05701k1665J42191O9320J23340j09744o0943
22072F025j3590k7847Q8643j4740j52760K5074J02628J26750L9216M4766K604
$$ plain form
22148 -104626 -102743 -304956 -291043 -133789 -97772 -68953 -79106 -2485 78383 14591 -65582
22137 -65582 82863 209538 85101 6409 -63323 -61680 4793 8744 -32851 16011 -50232
22126 -50232 -82036 -66161 -125550 -188004 -178097 -72333 22734 51744 -81489 -201995 -117117
22115 -117117 41250 24172 -197899 -302183 -243208 -197018 -72532 71538 127097 64486
22105 64486 -45620 -96629 -132379 -54784 55266 86119 -13920 -44019 -3298 125445 120359
22094 120359 -11615 -44320 -88328 -123044 -91708 44217 95454 5136 -133267 -4390 7214
22083 7214 26308 97308 45402 -30773 -136474 -158139 -15948 53372 176712 66968 6025
22072 6025 -7565 -35412 53231 38491 -114269 -89195 13433 140183 179399 224165 226769
22061B26769p8996j72657N756K701r1144J791L3062J23515O9763j372k2981o2636
22049C3571p77J4193l8352j6505J08146P7057m7718j81207p8113N0902q823N6752
22037c0874J34319N4384N7214r3076j11620j43139k6808K7955Q8065R1631L79
22026D8430j26782r0139M1879R4072K7853N9535M7384q429j0790L2153K9614j01486
22014D3294J4855N2700K7219N2679l7835N803Q8980j7605j22866k8236l780R4732
22002A69940j0988k5234j98842o3556Q8867J28486J22106M712o3839p942o5373
21991G8337k6730o7690r0036l6838Q7963q091Q275J2978N4270P33L4108J4489
21979F1768l9153n9479R2544K3729j12606j38880n0358M2935J14044l1047J8766
$$ plain form
22061 226769 147773 -24884 -19128 -16427 -107571 -105780 -72718 50797 120560 119188 96207 33571
22049 33571 32794 46987 8635 -7870 100276 177333 129615 -51592 -129705 -78803 -87626 -30874
22037 -30874 103445 157829 215043 121967 10347 -132792 -159600 -131645 -43580 48051 48430
22026 48430 -78352 -168491 -126612 -32540 -4687 54848 102232 93803 83013 115166 144780 43294
22014 43294 58149 110849 138068 190747 152912 158715 247695 230090 107224 78988 75208 169940
22002 169940 158952 133718 -65124 -128680 -39813 88673 210779 215491 151652 143710 78337
21991 78337 51607 -16083 -106119 -142957 -54994 -63085 -54810 -41832 12438 13171 47279 61768
21979 61768 22615 -36864 55680 79409 -33197 -172077 -222435 -179500 -65456 -96503 -77737
21968g7737P7114J19895j5781r5661j06206L7150M0696J04378J0503p4151m4321
21957b4121j00425k8595K5071O4406o1198k9572J43513M9538o8228m9095r3547
21946a72253N2670J30712P6618m5936j21711l5846M9365k7356Q6624Q1580l6145
21935C8322l9530L4391n7851j0632N5003n431N229o6140o2979Q3408O7308K4285
21923F5383m5362p5581K6156q2837o612l3184o6318J27500J90082L7377m2833
21912I3771m4028p4225Q8219n2005O3335L4325q9823l2670L7010L7947o2409R5388
21900I4835O9741m4535l0494j8685j15143k8281L0097m217p2010k15064q6556
21889d20312J11928K80314L9760m6309K6121R800O270j9594n7037L0960J4276
$$ plain form
21968 -77737 -623 119272 103491 7830 -98376 -61226 -20530 83848 94351 20200 -24121
21957 -24121 -124546 -153141 -128070 -63664 -124862 -154434 -10921 38617 -29611 -78706 -172253
21946 -172253 -119583 11129 87747 41811 -79900 -115746 -66381 -93737 -7113 74467 38322
21935 38322 -1208 33183 -24668 -35300 19703 14272 19501 -46639 -109618 -26210 41098 65383
21923 65383 20021 -55560 -29404 -112241 -118853 -152037 -218355 -90855 99227 136604 93771
21912 93771 49743 -24482 63737 11732 75067 109392 19569 -13101 23909 61856 -553 94835
21900 94835 164576 120041 89547 70862 -44281 -72562 -42465 -46682 -118692 -333756 -420312
21889 -420312 -308384 -28070 11690 -34619 -8498 1302 7572 -12022 -69059 -38099 -23823
21878b3823n9065j03054m6638q7776J04496J834j6872R1189L8433R4935L148M5471
21866D2278l87j04090N3873K6624j9737n2686l0971K7826P2896J8171P1117O6241
21854A71155p9771j49157l1795K8570K0658N6676k2332p551r6048j1225L3940
21843h6880j7140M0937Q6987l4154n8838q681M6602l7171m0394J2594N4451N9041
21831A7354p839K4001j00175o4524J00475O4518R5259p1466j61802L8301J3454
21820e2444r3475M1220Q6356p3113N9031M073n4482o5839k0026K8215q7121J2149
21808b15456J5022m1045O8344K0840Q0592O9858J40454P1105l1146j08809j42340
21797g2581O3869P5808j9872r0769j6515O4287l2579l6675L8334Q4748K5249m5644
$$ plain form
21878 -23823 -82888 -185942 -232580 -320356 -215860 -214026 -230898 -139709 -101276 -6341 -3193 42278
21866 42278 41891 -62199 -8326 18298 -1439 -54125 -85096 -57270 15626 33797 104914 171155
21854 171155 91384 -57773 -89568 -60998 -40340 16336 -5996 -13547 -109595 -120820 -86880
21843 -86880 -104020 -63083 23904 -10250 -69088 -77769 -31167 -68338 -108732 -96138 -41687 17354
21831 17354 9515 33516 -66659 -131183 -30708 33810 129069 57603 -104199 -65898 -52444
21820 -52444 -145919 -104699 -18343 -91456 -32425 -28352 -82834 -148673 -168699 -140484 -227605 -215456
21808 -215456 -200434 -241479 -173135 -152295 -71703 -1845 138609 209714 178568 69759 -72581
21797 -72581 -8712 67096 47224 -43545 -60060 4227 -28352 -65027 -26693 58055 83304 37660
21785C7660j4730j13280r1655l3730J5174N0510L0392j1038N8003j5417j13361
21774b01472M0901J05088n0090j60016P4613J70921l2984Q2117r5199n3484L1888
21763h7717L3059n5994K8237P1502M7841q0971j0584Q4390r717j4742l0054j6867
21751d1617J0133L0597L337J08358r638J8249p9605j38740l0673J00800l5393
21740f4192K9328J03759q5732j02759q8929k6119L2079L5542j3995N3125J49575
21729B1682N3653K3290L2113q4944N558k9339n3307m577o0172o7803J47306P1555
21717E5015P8686j08969j1626K8131q6691m9178K626M1421Q2025j28355r9998
21706a96913L2173J22106J4550L9206P5127j12027p3754M7463q0075l6211J09616
$$ plain form
21785 37660 22930 -90350 -182005 -215735 -200561 -150051 -119659 -130697 -72694 -88111 -201472
21774 -201472 -160571 -55483 -105573 -265589 -190976 -20055 -53039 29078 -66121 -119605 -87717
21763 -87717 -54658 -110652 -82415 -10913 36928 -44043 -54627 29763 20046 5304 -24750 -41617
21751 -41617 -31484 -887 2450 110808 101170 119419 39814 -98926 -129599 -28799 -64192
21740 -64192 -34864 68895 -16837 -119596 -208525 -234644 -202565 -167023 -181018 -127893 21682
21729 21682 75335 98625 130738 45794 51352 22013 -31294 -35871 -96043 -163846 -16540 55015
21717 55015 133701 24732 13106 41237 -45454 -94632 -92006 -50585 31440 -96915 -196913
21706 -196913 -164740 -42634 -28084 11122 86249 -25778 -99532 -52069 -132144 -168355 -58739
21695e8739L1643m704n7454j04118p551Q2474j8604J06170p5587j1119M7358Q086
21683f2145P0104N5968L9280m2494n1267j03937K1955K1859j9941n282j477O8762
21671h615R4470o7814j19051j6595J8784j5174L7416O1602J2424j342R7609j6325
21659G7389P814N1434j71578j67883l9866P011J04200J04387j8706p9253J5932
21648a09119J7267j9220q8042P5877J68592k0427Q2369k4392o5765N2312r721
21637E9731p2731j59750p943M6902J2715j2549J800K7959k2628L3452J24421K4781
21625E6160j01782l328J8006N9252j6030j836m4213l5837l6415r0890P170M5508
21613a44235K3845J35879M7482m118R121p2580j5063K9717n1083n8630q7983J0461
$$ plain form
21695 -58739 -27096 -31800 -89254 -193372 -200923 -118449 -137053 -30883 -106470 -117589 -70231 -62145
21683 -62145 7959 63927 103207 60713 9446 -94491 -72536 -50677 -70618 -75900 -77377 -8615
21671 -8615 85855 18041 -101010 -117605 -98821 -113995 -76579 -14977 -2553 -3895 93714 77389
21659 77389 85203 136637 -34941 -202824 -242690 -235679 -131479 -27092 -45798 -125051 -109119
21648 -109119 -91852 -111072 -199114 -123237 45355 24928 107297 82905 17140 69452 59731
21637 59731 -13000 -172750 -180693 -133791 -121076 -133625 -131825 -103866 -126494 -93042 31379 56160
21625 56160 -45622 -48950 -30944 28308 12278 10442 -33771 -69608 -106023 -196913 -189743 -144235
21613 -144235 -120390 15489 62971 58853 67974 -4606 -19669 10048 -41035 -99665 -187648 -177187
21601a77187P8105n4288j2816j8558J2552K43303J60737j30231j1585K7135r4500
21590B2667p3202P96L4893k3420O0358Q704j02673j8882M5594R1044j26746L7194
21578d3673J31754j26667q0746M362P0685N1722j00663m269Q2439M5679k1632
21567H991J0343N9104j09979J39l3252l0311j19026P676K6885L3981J23309l1493
21555e3633m4128J7323K634M5825p8369L6728J00573R1061o1306m6571q3427P5066
21543A776L9661j4300Q457J1582m0422K0217o7853j17794j3849J77836Q8203o855
21531H6659p2790O556J4824j5697J09054j0782j14485p7919P0638q1055j48675
21520b33672O7553J21642J14262o0901n9261k7478J23453N1233J5672p7700j5753
$$ plain form
21601 -177187 -99082 -153370 -166186 -184744 -172192 71111 231848 101617 90032 117167 22667
21590 22667 -50535 -49739 -14846 -38266 22092 30796 -71877 -90759 -45165 45879 -80867 -43673
21578 -43673 88081 -38586 -119332 -114970 -44285 7437 -93226 -97495 -15056 30623 8991
21567 8991 19334 78438 -31541 -31402 -64654 -94965 -213991 -206315 -179430 -145449 -22140 -53633
21555 -53633 -97761 -80438 -77804 -31979 -110348 -73620 26953 118014 56708 10137 -73290 1776
21543 1776 41437 27137 35594 47176 6754 26971 -40882 -158676 -172525 5311 93514 86659
21531 86659 13869 20425 35249 19552 128606 117824 3339 -74580 -3942 -84997 -233672
21520 -233672 -166119 -44477 69785 8884 -50377 -77855 45598 96831 112503 34803 19050
21509A9050r5923l6155L17Q3647K3503j19296k9335J32742Q1649O8633j4967r427
21497A04438n6527k13805n9354J15853Q7234J11952m7245O03Q8652J5198l3033
21486A13966k2487j5652m9316J64638o5407r5301O2568L7892n2884j17232o4844
21475a04059J02886R8719l7470J9191j29049L5535M0545n3201M4349M8647m962
21464F1131l060J1978p8804l815R3351J6443N8420J03092K4201j68287o7291K5680
21452G3039l9269p307m843n6973n5615n729Q1450R1738n9469L1591m284r2358
21440d8029K4887P8896M7537r1060p4528R4748m339n5235p3256j09173J4450q06
21428a95908j7538J3818M8808n3664J55001K1580K116p22J7688M5632j0911L2752
$$ plain form
21509 19050 -76873 -113028 -112711 -29064 -5561 -124857 -154192 -21450 60199 128832 113865 104438
21497 104438 47911 -165894 -225248 -109395 -22161 89791 42546 43149 131801 146999 113966
21486 113966 91479 75827 26511 191149 125742 30441 93009 130901 78017 -39215 -104059
21475 -104059 -1173 97546 60076 79267 -49782 -14247 26298 -26903 17446 66093 61131
21464 61131 58071 70049 -8755 -12570 80781 97224 155644 258736 282937 114650 47359 73039
21452 73039 33770 26463 21620 -35353 -90968 -96697 -15247 76491 17022 48613 44329 -48029
21440 -48029 -23142 55754 103291 12231 -62297 32451 28112 -27123 -100379 -209552 -195102 -195908
21428 -195908 -213446 -199628 -150820 -204484 -49483 -27903 -25787 -26509 -8821 36811 25900 58652
21416E8652L8398n757j29481j6745O5155p8235m7093m3606P5501J57827J8058
21405I2674m7538L0649j68637o9851Q9873J79170J34384q4194j10549J7385q1192
21394a7826j1430J1428k6149P4491J3124n4197l2287P1336J38994L4645r4061
21383A08068j8756Q8700n3446j57752j10557P0588n3843m5023j8643M7137L3541
21372a09986J08720K05351K2434l7951J7918l1264j11287j27664j1191J4846o320
21361f6394n2633J159R0453Q2097o502L8148l9636l94l644Q643k6126j10082l6930
21348a21841R8138o94O5590l5714l4086Q5951j35068m3964J53865M8316l7931
21337D2562j36088n3114P124K3956q0048n2009L5810K2090M5609R1672Q2264Q6298
$$ plain form
21416 58652 97050 91293 -38188 -54933 10222 -68013 -115106 -158712 -83211 74616 92674
21405 92674 45136 75785 -92852 -162703 -72830 106340 240724 156530 45981 63366 -17826
21394 -17826 -29256 -17828 -43977 30514 43638 -10559 -42846 28490 167484 202129 108068
21383 108068 89312 178012 124566 -33186 -143743 -73155 -126998 -172021 -190664 -143527 -109986
21372 -109986 -1266 204085 226519 188568 206486 175222 63935 -63729 -74920 -60074 -66394
21361 -66394 -119027 -117868 -27415 54682 48180 86328 46692 46298 42654 51297 25171 -84911 -121841
21348 -121841 -23703 -24397 41193 5479 -28607 57344 -77724 -121688 32177 80493 42562
21337 42562 -93526 -146640 -139516 -115560 -195608 -247617 -211807 -189717 -144108 -52436 29828 116126
21325A16126O3572J391j55767q5392N7280O0325r286l6657r6164q035L4553q8871
21313a46925K5181J49855J76861J7948J96l3315j14969k9347K144J5560L0858
21302I4047o2364j9590r267j1457K2277m1608L69J18269N6233o0977r0003j5772
21290a9843j52855j20181K8850P3039O7161J13966N9134M7482m7892k2277j27121
21279a00537m3135J17364K0448J3891J2958R1946j22471k5520j7132J1136r3535
21268a34587P590O6918N0903o1664M4211J03396J0348j6062k9978n0122J28115
21257A19068O027m3501j44159J07023l2136j96755l1841J50327L2551P75O2543
21246B9922o0893j9516K7258m4405K0171N7293M6860l1901M3816o9323m2703k4112
$$ plain form
21325 116126 179698 181089 25322 -60070 -2790 57535 48249 11592 -84572 -92607 -58054 -146925
21313 -146925 -121744 28111 204972 222920 223116 189801 74832 45485 47629 63189 94047
21302 94047 31683 12093 2826 -8631 13646 -27962 -27593 90676 146909 85932 -4071 -19843
21290 -19843 -172698 -292879 -264029 -190990 -123829 -9863 49271 96753 48861 26584 -100537
21279 -100537 -143672 -26308 -5860 8031 20989 112935 -9536 -35056 -52188 -41052 -134587
21268 -134587 -126997 -60079 -9176 -70840 -26629 76767 87115 71053 41075 -9047 119068
21257 119068 125095 81594 -62565 44458 12322 -184433 -216274 -65947 -33396 -32621 29922
21246 29922 -30971 -50487 -23229 -67634 -47463 9830 56690 24789 68605 -718 -43421 -67533
21234f7533m3102J5244J00404R1872k5492p7656l4949K06552M6756K9730m7948
21223A93878R5179J002j47249j50990n3895m7459j87129l6157J55718P616M8069
21212a21417Q6553n5833l5564N3851k8236r2746M2871l5558q237M3400Q8132j5576
21200g8360j2103M5315K4413Q008m3162j17337O7896Q3010L8474R7157k9166q4190
21188d5J1900p6473j21170R1202J03699l3225J09755k9005k25282q1929L5750
21177b14823R3965N6883L9135Q0412p6531j61734O3388J18254L4245l8479j5670
21166b0955k2381N3360J12347l573k9632p0402Q2575O5769l4764r6509p1232l7842
21154g3239N378N9983N0j7565J8890L4667p3480k4428k2354J01280L7315p7457
$$ plain form
21234 -67533 -110635 -95391 5013 96885 71393 -6263 -41212 165340 212096 241826 193878
21223 193878 289057 290059 142810 -8180 -62075 -109534 -296663 -332820 -177102 -169486 -121417
21212 -121417 -34864 -90697 -126261 -72410 -100646 -193392 -150521 -186079 -194316 -150916 -62784 -78360
21200 -78360 -90463 -45148 -20735 -12727 -55889 -173226 -105330 -22320 16154 113311 84145 -45
21188 -45 11855 -64618 -185788 -94586 9113 -24112 85643 56638 -168644 -250573 -214823
21177 -214823 -120858 -63975 -24840 55572 -20959 -182693 -119305 -1051 33194 -5285 -20955
21166 -20955 -43336 10024 122371 118798 89166 18764 101339 167108 132344 35835 -35397 -73239
21154 -73239 -67861 -7878 -7828 -25393 -6503 28164 -45316 -69744 -92098 9182 46497 -30960
21142c0960Q2524j3851j10748L117O3443J0023o5456o3575j40865r742J72045
21131a04045k2364k4447M7125O4065P092j445m3730l6093L9987J37585K1213l744
21119H1199r0816Q3972J80670N5668j77132o2060R4766J5266j35294p058P2486
21108A11667R1809j33008k34562K1299O9399O3669J7089j84636P331J29071K1598
21097a9274J09976J5013r7331j24662p6866n416R6815R2957p3508q3771J2899
21086a53168L3046J43880j4184K0482K130q1800k2020o4009L3793J34355J35394
21075A67899j3913p7626M737o2653n1286J20120Q6370m0761o4627m9269R7439
21064A16430M595j93757q0786O9398P5764P404R4735J05990j23155j43674M6604
$$ plain form
21142 -30960 51564 37713 -73035 -69918 -6475 3548 -61908 -125483 -266348 -276090 -104045
21131 -104045 -126409 -150856 -103731 -39666 -32574 -34019 -77749 -113842 -73855 63730 84943 81199
21119 81199 -9617 74355 255025 310693 133561 71501 166267 181533 46239 39181 111667
21108 111667 203476 70468 -164094 -142795 -73396 -9727 7362 -177274 -169943 -40872 -19274
21097 -19274 90702 105715 8384 -116278 -193144 -198560 -101745 -8788 -82296 -166067 -153168
21086 -153168 -120122 23758 9574 30056 32186 -49614 -71634 -135643 -101850 32505 167899
21075 167899 153986 76360 81097 18444 -32842 87278 173648 132887 68260 18991 116430
21064 116430 121025 -72732 -153518 -84120 -8356 -952 93783 199773 76618 -67056 -20452
21053b0452K296m4560j5218l4620k247N3396J04457o6296n9912M6762N4833m970
21041A3469j7590J03600O0077M108m2502N6790q7376o8569j25524m7684o395m7693
21029b05289m9624J8806K23476m1224M1528O0793j429o419l6184n3216J01644
21018E2862J085j74814l8251P8442J37343k924k9496j8070L3843L8933k0564L9424
21006I7813K9435l9688n6939K6970Q1484l1580l1378r5218L3088J2105L5174j735
20994E9531K7705J588p6636r092Q0836R8361m0616j19482o7533P9529P1647K3637
20982A29475o085l45K1708L9584J2398k7902l4928j8257n9374M8468L1644J50617
20970B87003n1958j04186M0574N1897q5354P2096k7730j47041j06913N0099O1202
$$ plain form
21053 -20452 -18156 -62716 -77934 -112554 -114801 -61405 43052 -23244 -83156 -36394 18439 13469
21041 13469 -4121 99479 159556 163664 121162 177952 90576 22007 -103517 -151201 -157596 -205289
21029 -205289 -254913 -236107 -12631 -53855 -12327 48466 47037 40618 4434 -48782 52862
21018 52862 53947 -120867 -159118 -80676 56667 53743 24247 6177 40020 78953 58389 97813
21006 97813 127248 87560 30621 57591 139075 107495 76117 -19101 13987 26092 61266 59531
20994 59531 87236 88824 12188 3096 83932 182293 141677 22195 -45338 34191 105838 129475
20982 129475 123390 123045 144753 184337 196735 168833 133905 115648 56274 104742 136386 287003
20970 287003 235045 130859 171433 223330 137976 210072 182342 35301 -71612 -21513 39689
20959C9689M0506J48232j16708k20557p7531j15937N9047J86663N5452Q3214o2553
20948A9517m3854O3638k3433n0451o8631P1024M9978K8266L2351K3465j6335L830
20936H9365k4095l880m0277j15848l8133M7483l9836L2016J00806P8103n8361
20925B7343P903J21630K3530q9392k3724m0816K6433P1442m2996P6785l7250j05842
20913A5046r1640p633N7803O4438Q919k9498K7397L2876M8151J17031l6160j02453
20901A04277l6335O9996J15315Q3586k5999j28971n9953j46264j0723j5524n704
20890e6299J9649N1859P4362r4848r5359o3071L5613M4740j3163K8286L1838j30136
20878a66529O3521O2538r8719o1558Q0075N8170J09647P7830j36894l655P3928
$$ plain form
20959 39689 80195 228427 111719 -108838 -186369 -302306 -243259 -56596 -1144 82070 19517
20948 19517 -24337 39301 15868 -34583 -103214 -32190 17788 46054 78405 101870 85535 89365
20936 89365 65270 61390 21113 -94735 -132868 -85385 -125221 -93205 7601 85704 27343
20925 27343 35246 156876 180406 91014 67290 26474 52907 124349 81353 158138 120888 15046
20913 15046 -76594 -84227 -26424 38014 46933 17435 44832 77708 125859 242890 206730 104277
20901 104277 67942 137938 253253 336839 310840 181869 121916 -24348 -35071 -50595 -56299
20890 -56299 -36650 15209 89571 -5277 -100636 -163707 -128094 -83354 -96517 -68231 -36393 -166529
20878 -166529 -103008 -40470 -139189 -200747 -120672 -62502 47145 124975 -11919 -15574 58354
20867E8354k0722l24O548j09422k4123J06409L7346R879K9277L1797j49550p7238
20855a01769J26035O3733K8391l3767r076l1172O9575p438m5484J01460n6831
20844A03657L0387K1802o6882n6666O1837J4005n1970j55381K4864J2705o5419
20833a27061n8682N1937O0859O0815P8479q224j57199n9786N9927N7525Q9183
20822D7773L1756J9332k6547l1875M349J2883m7114k321n4532Q7887R5054m3770
20810I2875q9116j5827k9236K6704q0141q1480K162J32345P9590l3259K3323q074
20798A9866N5376p489n7459K1829K3524O5915K0722q8760J4575j7854n6837J30046
20786A23454N5589j20218j6774l540K5732J7532n6918m9687m469j7305Q7166J5410
$$ plain form
20867 58354 37632 37308 43856 -65566 -89689 16720 54066 63945 93222 125019 -24531 -101769
20855 -101769 24266 87999 116390 82623 73547 42375 111950 104512 59028 160488 103657
20844 103657 134044 155846 88964 32298 94135 108140 56170 -99211 -74347 -61642 -127061
20833 -127061 -185743 -133806 -72947 -12132 66347 58123 -99076 -158862 -98935 -41410 47773
20822 47773 79529 98861 72314 40439 44788 57671 10557 8236 -46296 41591 136645 92875
20810 92875 3759 -12068 -41304 -14600 -94741 -176221 -174059 -41714 37876 4617 27940 19866
20798 19866 75242 67753 10294 32123 55647 121562 142284 53524 68099 50245 -6592 123454
20786 123454 179043 58825 42051 38511 64243 81775 24857 -24830 -29299 -46604 40562 55972
20774E5972J7785j1593q3425Q690M6023N1152j19689n1534Q925L1642O6499j0843
20762I604j27347q0619J68473J40714R2362l1171O1017J180r0326l6183k2542
20751H5162P5189k6826m631m1211K6128o0258L6350M3536q2081m4340O9366J23580
20739A99964R1106q2293p4296j58798o3902P0904J164O669q3499O4710O4135r5079
20727e9215o9256N6522J33846K0978j23549n3622M7089M7519r074k4466J00467
20716F7239k4419l584Q56M2888j40245L6739Q359j23280L867j4952J14675J64279
20704A32422j3568j17250j17489j01389J73960J11024K9061j5592k0428Q2591
20694A43342j0366r3660o8485m059J19817R7095l2161l8578j10949j4482q5668
$$ plain form
20774 55972 73757 62164 -21261 -12571 33452 84604 -35085 -86619 -77694 -46052 20447 9604
20762 9604 -117743 -198362 -29889 110825 203187 172016 233033 234213 143887 107704 85162
20751 85162 160351 133525 128894 87683 113811 53553 89903 133439 51358 7018 76384 199964
20739 199964 291070 208777 134481 -24317 -88219 -17315 -16151 -9482 -92981 -28271 35864 -59215
20727 -59215 -128471 -71949 61897 82875 -40674 -94296 -47207 312 -8762 -33228 67239
20716 67239 42820 39236 40092 82980 -57265 -20526 -12167 -135447 -131580 -146532 -31857 132422
20704 132422 118854 1604 -115885 -217274 -43314 67710 96771 81179 60751 143342
20694 143342 132976 39316 -29169 -33228 86589 183684 151523 112945 1996 -12486 -98154
20683i8154J6822J48298Q8076o6236O0406L2496j30299m616M886Q620j89779j08322
20671b37802J44202J86383P8193L0289l199K9193p4771j09464K1824O2669m7399
20660H0118k9463J48806n4142J0222p9562j67159K1981P29k6117l3246N5776J30781
20648E8724J42689n4183m4113k1434j04342j08916J7530M1094q1778p6059n1395
20637b82183J28118J16383n4526J6236L2259J01244J2526k9068k0334L2831n9395
20626e909q4001K8404p2436M3697J70411M4270k9246M4263n4339j3836r8922O4542
20614C6898J7083J9502k7822l8970J6369K4921M1585o2632l6396p1527J16847
20603C5858M5043m8570r3216L9523m5898j8001q9869K3680N362l915k4387m5499
$$ plain form
20683 -98154 -81332 66966 155042 88806 149212 181708 51409 46793 51679 60299 -129480 -237802
20671 -237802 -93600 92783 170976 201265 198066 227259 152488 43024 64848 127517 80118
20660 80118 50655 199461 145319 155541 75979 -91180 -69199 -68470 -94587 -127833 -72057 58724
20648 58724 201413 147230 103117 81683 -22659 -131575 -114045 -72951 -154729 -230788 -282183
20637 -282183 -154065 -37682 -92208 -75972 -43713 57531 70057 40989 20655 53486 -5909
20626 -5909 -89910 -61506 -133942 -90245 80166 124436 95190 139453 85114 71278 -27644 36898
20614 36898 53981 73483 45661 6691 23060 47981 89566 26934 -9462 -80989 35858
20603 35858 80901 32331 -60885 -21362 -67260 -85261 -175130 -151450 -146088 -150003 -174390 -219889
20591b19889P465M8765P7931N3051O5961q606O9099N7514K3289q6206l0023l7759
20579B0592O2160m2828j6210j09739q7088l5475J08839J32527O8236K799o9311
20568C4502o3721J1977J5051p0636M1026l654L5567P3891J05586J1777p7514o8412
20556D5440o802L0352j6657k557N5338L1207j4754j26362O5135o7599o6253N7644
20544a5868J8422j587o5103M6817n4201J5015L4679N680O7071O2435p2876K2896
20532F3380O8213M7763L8j33266r0376K7761k6148l3798J6329O6971M2960j5435
20520C4392K1533l4283L8684O763Q076P893o1065O6332m2975k1466o7927P776
20508c6267J6524P7882R1005j16536p5984k1971J4146l2823m4999p7979Q297J22980
$$ plain form
20591 -219889 -212424 -163659 -85728 -32677 33284 24678 93777 151291 174580 88374 58351 20592
20579 20592 82752 39924 23714 -86025 -173113 -208588 -99749 32778 101014 103813 34502
20568 34502 -29219 -17242 -2191 -72827 -31801 -35455 112 74003 179589 191366 113852 45440
20556 45440 38638 68990 52333 49776 105114 136321 121567 -4795 60340 -7259 -73512 -15868
20544 -15868 2554 967 -64136 -17319 -71520 -56505 -21826 -16146 50925 113360 40484 63380
20532 63380 131593 179356 179394 46128 -44248 -16487 -42635 -76433 -60104 6867 49827 34392
20520 34392 55925 21642 60326 67089 75165 83058 21993 88325 45350 23884 -44043 -36267
20508 -36267 -19743 58139 149144 32608 -43376 -65347 -51201 -84024 -129023 -207002 -198705 -75725
20496g5725J04958M3489L3699L6730k8633l0615l9849k945J7822R0210M5686m1243
20484A53584j61987l3680j07698j25234N143M3992j30O0368J74481J18532o7949
20473E9422O9365M9677r7375n6342J19804J17822j90221j79447j9567j2965L5829
20462a03998J02446N1945N6406j4417j07459n1670L9471P6295Q6097K6980r6413
20451F5683m2894J19564M974j6249q6733q5746m3081R919j7566J9182K1725O4010
20439A2788L9622P8413N066p4383j9772R565j0223J7857O5330l8718j4788q2335
20427a1578j18598p5206J09323r446l3452n425J9977R5487Q4489R706k5322L7964
20415G7919j706j1659M3209J4212L644j7405j30895m8845J1320j3540R3532P9933
$$ plain form
20496 -75725 29233 72722 106421 143151 114518 83903 44054 41109 58931 149141 194827 153584
20484 153584 -8403 -42083 -149781 -275015 -269872 -225880 -226010 -165642 8839 127371 59422
20473 59422 128787 178464 81089 24747 144551 262373 72152 -107295 -126862 -139827 -103998
20462 -103998 -1552 50393 106799 92382 -15077 -66747 -27276 49019 135116 162096 65683
20451 65683 22789 142353 147327 131078 44345 -41401 -84482 -74563 -92129 -72947 -51222 12788
20439 12788 52410 130823 135889 61506 41734 51299 41076 58933 124263 85545 70757 -11578
20427 -11578 -130176 -205382 -96059 -105505 -138957 -144382 -124405 -28918 55571 65277 39955 77919
20415 77919 76213 64554 107763 121975 125619 108214 -22681 -71526 -60206 -73746 19786 99719
20403I9719L0639m9518j2466M2274N3375j6834P058l0891o6721n7162o4006n815
20391g0348J7575J6591J38980R8983p6004k9329j35766R3416l0659M49q4874j3066
20379g4052P5236K6922P594J9544k5834j164k89k2142O9809N962q8487j7397R8867
20366G4569J16518J1409j66920p0685K6926N5516N6134K5560k0529j423Q6272
20355A93347o578j03494p5468K4439Q6604o052q3953j35225r9629P6345P4892
20344e4772P0894K3056j0118k1436P443p13Q4776J16582r3895p5071j12722p6848
20332a42824Q9173L4614J57346K6552k5929k54O4396l8452r0050O8221J1825J4962
20320A69580k7373o2452r1146j4028L3108P8728K2010j0890j05348J1423o6909
$$ plain form
20403 99719 130358 80840 68374 110648 164023 147189 154247 123356 56635 -527 -64533 -70348
20391 -70348 -52773 -36182 102798 201781 125777 96448 -39318 54098 23439 23888 -60986 -74052
20379 -74052 1184 28106 35700 55244 29410 28246 27957 5815 75624 81586 -6901 -24298 74569
20366 74569 191087 202496 35576 -35109 -8183 47333 103467 129027 108498 107075 193347
20355 193347 186769 83275 7807 32246 118850 112798 28845 -106380 -206009 -129664 -54772
20344 -54772 16122 39178 29060 7624 15067 14354 99130 215712 121817 46746 -65976 -142824
20332 -142824 -53651 -19037 138309 164861 138932 138678 203074 164622 74572 142793 154618 169580
20320 169580 142207 79755 -11391 -25419 7689 86417 108427 97537 -7811 3612 -63297
20309f3297n674l6560O292J09184L4672m8512J6960L3189J58333J18881j00990
20298B22478n0243R578l2037M1900r2028m7776N7349N8737j36701L4568k8793
20287C7032k5531k6525n9548L1899Q6325J00092o7442j03222k923J04736M4397
20276A19290P6577l3128O6632N2183k12323q8496k0136m8771J67037Q9531m2058
20265A26338l3235M379m8242r81q4598J9148O2523O6037l9645Q8869R4356K6703
20253B81652o2952j24677j14410J27661j47454r1147Q439L2161N8327k975K8643
20242f732J1990J2501J0443p6733n407Q576P1293l561j05940K4082m850O4292
20230d6P7322K8957o2861j30261o4533K9093J8660j9527q5676p319J10177J70682
$$ plain form
20309 -63297 -68971 -105531 -99239 9945 44617 -3895 13065 46254 204587 323468 222478
20298 222478 172235 181813 149776 191676 99648 51872 109221 167958 31257 65825 37032
20287 37032 11501 -15024 -74572 -42673 43652 143744 76302 -26920 -29843 74893 119290
20276 119290 195867 162739 229371 281554 69231 -19265 -39401 -88172 78865 168396 126338
20265 126338 93103 97482 49240 48259 -36339 -17191 45332 111369 71724 160593 254949 281652
20253 281652 218700 94023 -20387 107274 -40180 -131327 -122888 -90727 -32400 -35375 -6732
20242 -6732 5258 17759 28202 -48531 -53938 -45362 25931 22370 -83570 -59488 -64338 -46
20230 -46 77276 106233 43372 -86889 -151422 -122329 -103669 -123196 -208872 -216191 -106014 64668
20218F4668J24386p2482j06360l3032N6863o7726j05111m452j919J42986L6244
20207C4065o6405n0592Q360j27780o0812K5490Q1280P9352J01649N8166j09432
20196b6659j25693Q2049l2057n5833l0702L4883N5077m61M7556J11733j7173P0704
20184A13424M0409J2965K5898k5794l0759o0647o9347L7282R163L655L5783Q314
20172A00346P5631J1962o3639o8457j44646n5741R0306J41958K235n1258Q283
20161D6980M5691j0267O7356j4052l8167j5188K7083J0049M1119j8663R3050K2585
20149B57576K2094N295r2696R4085j08484m2962R4829M1922n5434o8867p3281
20138G4077N351O8684O5112N9735j62420j91611J39097Q2131r6474k2688P3747
$$ plain form
20218 64668 189054 116572 10212 -22820 34043 -33683 -138794 -143246 -145165 -2179 34065
20207 34065 -32340 -82932 -74572 -202352 -263164 -237674 -156394 -77042 24607 82773 -26659
20196 -26659 -152352 -70303 -102360 -158193 -188895 -154012 -98935 -99396 -51840 59893 42720 113424
20184 113424 153833 166798 192696 166902 136143 75496 6149 43431 52594 56249 92032 100346
20172 100346 175977 187939 124300 55843 -88803 -144544 -54238 87720 89955 38697 46980
20161 46980 92671 82404 149760 135708 97541 82353 109436 119485 160604 141941 234991 257576
20149 257576 279670 284965 192269 286354 177870 134908 229737 271659 216225 147358 74077
20138 74077 79428 148112 213224 272959 110539 -81072 58025 140156 43682 20994 94741
20127I4741n6343M223J1939N2272l9926o5595k9916M5769l5449j43237l6592J10273
20115h7841J14924m3740O8775o1379J6537K23718p6069r2231k5989N6659J18643
20104B12007M5956q7645k314N2658q1420k17l7505j34556p2626j0216O2880j4907
20092f7905M1193J04665P1803q8286p8960O8024j8396J21258n2850k8915o8732
20081B899j1006J25007l3790j15081R9776P2626L3858j03122j25977J30447J58190
20070B33827k05742j16975J6627J40517O9138M6797m2352j17703q4881R1554J38130
20059A68937P2581l7344J2995j08717j8298L6610M7593j9540n1042M5395n0937
20048I8233k9144m7152k5841o7691J14855J82464m0207q6346L0926R3085r7525
$$ plain form
20127 94741 38398 42621 54560 106832 66906 1311 -28605 17164 -18285 -161522 -198114 -87841
20115 -87841 27083 -16657 52118 -9261 7276 230994 154925 62694 36705 93364 212007
20104 212007 257963 170318 168004 220662 139242 139025 101520 -33036 -105662 -115878 -52998 -67905
20092 -67905 -26712 77953 149756 61470 -17490 50534 32138 153396 100546 71631 2899
20081 2899 -8107 116900 83110 -31971 67805 140431 174289 71167 -54810 75637 233827
20070 233827 28085 -88890 -72263 68254 137392 184189 141837 24134 -60747 30807 168937
20059 168937 241518 204174 217169 108452 90154 126764 174357 154817 103775 149170 98233
20048 98233 69089 21937 -3904 -71595 43260 225724 185517 99171 130097 223182 125657
20037A25657j14982m5822n2694L3395K7114K7672L7211N1259J28897n1157q9208
20026G7342j00217p2397J49421L8595J863p5033P258L5099K5292j4111r709j05372
20014d1969j00214j0747L0561Q2524J10332j482l5374R438n988L9757R8364j21850
20002E3352q6858n9036k7259N4586O2605n5002O7684J8042R9953N5653m26J7317
19990B00611j7659q3200k0309r774n1557p7932M0740O6545r6702O2898J5409J7974
19978D7044k7750J24814P6537m1192j73356N637j18250J2960L8922j40847j07797
19967c03278k5517P0525P0743j626N0862q0289K26370O8850k2819K6451M8017
19956A28289j2233m3547o357O1468m321l8977o8525k9848J96763r139r0488R8800
$$ plain form
20037 125657 10675 -35147 -87841 -54446 -27332 340 37551 88810 217707 166550 77342
20026 77342 -22875 -95272 54149 92744 94607 19574 26832 61931 87223 73112 63403 -41969
20014 -41969 -142183 -152930 -122369 -39845 70487 69005 33631 43069 37081 76838 175202 53352
20002 53352 -33506 -92542 -119801 -65215 -2610 -57612 10072 28114 128067 183720 183294 200611
19990 200611 182952 99752 79443 69669 18112 -59820 -19080 47465 -49237 13661 29070 47044
19978 47044 19294 144108 220645 179453 6097 11734 -106516 -93556 -54634 -195481 -303278
19967 -303278 -328795 -258270 -187527 -189153 -138291 -218580 7790 76640 53821 80272 128289
19956 128289 116056 72509 66152 127620 123299 84322 15797 -14051 182712 173573 83085 181885
19944A81885P880p8088o2900P8823J77950J2185j11433j22727n3701K5918N8882
19933A14674N0646l51M3337n5264l7286Q92j460J3893O9512N4627j55166j07099
19921i045K4148j2529j755o5443N6433n3433m2467k4618R8385J18370P6024N0877
19909B14947p9414p3007j6652j6950j0397J80475N0762j08748L8098M5769J1511
19898B36394q4374q8503k2585j8730N6468j7628J06798J9845M8191P334J08841
19887C52051J7543J9654p028L0515r236o9013p5077m8379N6479R5459N8991M595
19875D26554j2534P9583R421N3704M2762J13789N5859m2160l5833J00227Q7628
19864H79000r4578k186k5800j17515n6211K9433O422j17684q1327m4107j10935
$$ plain form
19944 181885 189765 111677 48777 127600 305550 317735 206302 83575 29874 55792 114674
19933 114674 165320 164969 208306 153042 115756 116648 115188 129081 198593 253220 98054 -9045
19921 -9045 15103 2574 819 -64624 -8191 -61624 -104091 -128709 -30324 88046 164070 214947
19909 214947 135533 62526 45874 28924 18527 199002 249764 141016 179114 224883 236394
19898 236394 152020 63517 40932 22202 78670 61042 167840 187685 235876 243210 352051
19887 352051 369594 389248 382220 412735 403499 334486 259409 211030 267509 362968 421959 426554
19875 426554 414020 493603 503024 556728 599490 713279 769138 726978 691145 791372 879000
19864 879000 784422 782236 756436 638921 582710 612143 618565 500881 419554 375447 264512
19853B64512N2877Q6012M438n9831m3346r1688n7996O2879p5047K3755J8105j3501
19841A71169j1284j3293L7849M0710r6676P6157J72648J95128P3190J4252J238
19830F61088l1946P5917o2815l4081M7887m2340R0070N4479J8284M4969p7225
19819G44287j55890L422J8983N0448m4567q4813Q7481l448o0805K1470M3596J3971
19807F34135j43816j92048m3321N5433M370p9733o5531m3398k6452L7195R504
19796A46338o5318j35808j26018K134k376P1665N4670P0792Q9021j5322K0720
19785A10498K5660M5857o7661M7006j1367p5807q9818k7445L9050K4785N4890
19774G5648P4860J59665J9416j31294p215P9429j14278q8182l6311N6816M2791
$$ plain form
19853 264512 317389 403401 407839 348008 304662 212974 154978 217857 142810 166565 184670 171169
19841 171169 159885 146592 184441 225151 128475 204632 377280 572408 645598 659850 661088
19830 661088 629142 705059 642244 608163 656050 613710 703780 758259 776543 821512 744287
19819 744287 588397 591819 610802 661250 616683 531870 619351 615903 555098 576568 620164 634135
19807 634135 490319 298271 254950 310383 314753 235020 169489 126091 99639 136834 146338
19796 146338 81020 -54788 -180806 -178672 -181048 -109383 -54713 16079 105100 89778 110498
19785 110498 136158 182015 114354 161360 149993 74186 -15632 -43077 -4027 20758 75648
19774 75648 150508 310173 329589 198295 191080 270509 156231 68049 31738 88554 131345
19763A31345m550P7791O7911r5693m387l9953n5060R1494K3500K7431Q3420j03836
19751A99413j12148J57866J61911j1631J9560o1300l1699J9450L8695l7975r4033
19740B48109P369j6173q1426q037J44820O9813r05N2929J20792M907l5570j34981
19728C71647P7621m7066M231P1776P0575r3266q9569j2150M9181P3149P6849K7753
19716E80731k0855L2998j57639j31552J6967J41625l5015j26400L55J54878L9729
19705D95822l3690n5703P2080r3115o413R738j18287o4841N0145P2954L4932K7613
19693C91235J00535J52833j2993n5559l4790L1426O5526m7832p6544L5103J5750
19682E64690J7948K7410q2235j0338K0542l4670j80997q1897J8193L0658j12131
$$ plain form
19763 131345 126795 204586 272497 176804 172417 132464 77404 168898 192398 219829 303249 199413
19751 199413 87265 245131 407042 395411 414971 353671 321972 341422 380117 342142 248109
19740 248109 255478 239305 157879 149842 294662 364475 363570 416499 537291 542198 506628 371647
19728 371647 449268 402202 406433 478209 548784 455518 365949 353799 402980 476129 552978 580731
19716 580731 559876 592874 435235 303683 320650 462275 427260 300860 301215 456093 495822
19705 495822 462132 406429 478509 385394 378981 388719 270432 205591 255736 328690 363622 391235
19693 391235 491770 644603 631610 576051 541261 572687 638213 590381 513837 548940 564690
19682 564690 582638 610048 527813 517475 538017 503347 322350 240453 258646 289304 177173
19671A77173n0007M339Q9439n411N5848p8860Q262q2658k1446K7072P12N0834
19659A75297o9293J7698R5179M4606n5219K54025o9274j30878O222o2051L38m654
19647B01996j23282q9763j8789J27875M7740l6087O1238O6647n2998n3397M6602
19636A77782P408M9486P688n0011l860m9679M9846q7940n4059J5562q1790k8259
19624d7826Q1852M6931k6547O0394P1588Q2866M3422m5369j10560m1528J90038
19613C05261j1244j86279r920N7331K1432m0898j2786O5369M6435J02304k0094
19602C16911j24710m7188n2976L0113K6253L3218M2899L3045L7988k3521P9142
19591C51174Q2563j40573j35657k8356J10884m8040k13088M9005J37003Q7343
$$ plain form
19671 177173 127166 131505 220944 215533 271381 192521 200783 118125 96679 123751 124463 175297
19659 175297 106004 123702 218881 263487 208268 462293 393019 262141 268363 206312 206650 201996
19647 201996 78714 -11049 -29838 98037 145777 109690 170928 237575 184577 131180 177782
19636 177782 185190 234676 242364 192353 188493 138814 188660 100720 46661 62223 -19567 -47826
19624 -47826 34026 80957 54410 114804 186392 269258 312680 267311 156751 115223 305261
19613 305261 294017 107738 97818 155149 176581 135683 122897 188266 234701 337005 316911
19602 316911 192201 145013 92037 122150 148403 181621 224520 257565 295553 272032 351174
19591 351174 433737 293164 157507 129151 240035 191995 -21093 27912 164915 252258
19581B52258K434j7205L9124L2128M4642j05759p8701N8480J4124m1084n8414
19570A42027J31587K7977j06885j50555l184M4160l0156O4505N8087m6837L037
19559A33763M7595J7818m986J0005K6610N6895N1379J867j37694l1401J1451M3193
19547B26495Q3252k7236j12783q9642o6114J0499QJ71247o844q3520M4020J49467
19535B98849P1201j28562j17228Q6852r681j11915O54L1189j10567J54874J59014
19524C24680N941r2981n6365K9573p2294J0552J09812J15544n57k03J5004r2933
19512B95773j58581J511K5966m3401L7221j24952o0212K8360Q1135K3242L1693
19501A37755J3118n4871l4117o0708J61790J89207M4856j70995L9542O1516J15790
$$ plain form
19581 252258 254692 237487 276611 308739 353381 247622 168921 227401 241525 200441 142027
19570 142027 273614 301591 194706 44151 40967 85127 54971 119476 177563 130726 133763
19559 133763 181358 199176 194190 204195 230805 287700 339079 340946 203252 171851 183302 226495
19547 226495 309747 282511 169728 80086 13972 24471 24479 195726 188882 105362 149382 298849
19535 298849 370050 241488 124260 211112 201431 89516 90170 121359 10792 165666 324680
19524 324680 330621 237640 181275 210848 138554 149106 258918 374462 373905 373702 388706 295773
19512 295773 137192 138703 164669 121268 158489 33537 -26675 1685 82820 106062 137755
19501 137755 150873 96002 61885 1177 162967 352174 397030 226035 265577 327093 442883
19490D42883R0451J9053M9844r9356p6613J21581j9967j47143k0116J3988J9719
19479C94324j34518n6970Q4739P6787J09012k6223j4850J0051k3390j02905M0156
19468C56213K8144n4398m7024k575M9104J36329J93092R7020o3302j03961J0808
19457E99450j15441m0646J81895K15169l1344q2893l6215r4390j3213O2852k4902
19446F20322Q7849Q5686K8829R8334K4774k9520m2517Q9795n8186j46330M3153
19435H02189L3706R9223l3048l4288N4655J00492j7054N5411o2949j1014m8666
19424I38657j15864o2467N0501J01461L9774n1944J51005J61195J34062J02995
19414A449375P9659j55407n8818M7010O6524J2469l2423K2425M9913N7328R6694
$$ plain form
19490 442883 533334 552387 602231 502875 426262 547843 527876 380733 360617 374605 394324
19479 394324 259806 202836 287575 364362 473374 447151 432301 442352 418962 316057 356213
19468 356213 384357 329959 282935 280360 329464 465793 658885 755905 692603 588642 599450
19457 599450 484009 443363 625258 840427 809083 726190 689975 595585 582372 645224 620322
19446 620322 708171 793857 822686 921020 945794 916274 873757 963552 905366 759036 802189
19435 802189 835895 935118 902070 867782 922437 1022929 1005875 1061286 998337 987323 938657
19424 938657 822793 760326 810827 912288 952062 900118 1051123 1212318 1346380 1449375
19414 1449375 1529034 1373627 1314809 1361819 1428343 1440812 1408389 1430814 1480727 1538055 1634749
19403A634749N6620N0834O8046R4459J34893K39277J71192K37105L29597L77684
19393C394456M04652O65008R50596J294251J650650J596235R65739K89390j49172
19384A1061805l81335l94844k74937J09397O65316J214241J875911K889458M278150
19375B1043162O683872J0408307J5019696J7707630J4442919P589419J094935
19368I3989940k491949m200837l387582J703890P525780J1130015Q064672J203258
19360A13537187l776354n340488p660898j1134463j0911521q141524n021036k020304
19352E9530599j1163L90165j040077l566161n722150o600855o583481o135616
19344C0261261m933700l365959j758513q35170O2990P68546J744032L062304M291147
$$ plain form
19403 1634749 1691369 1742203 1810249 1904708 2039601 2278878 2450070 2687175 3016772 3394456
19393 3394456 3799108 4464116 5414712 6708963 8359613 9955848 10921587 11210977 11061805
19384 11061805 10680470 10285626 10010689 10120086 10785402 11999643 13875554 16765012 21043162
19375 21043162 27727034 38135341 53155037 70862667 85305586 92895005 93989940
19368 93989940 91497991 87297154 83909572 85613462 93139242 104269257 112333929 113537187
19360 113537187 109760833 104420345 96759447 85624984 74713463 66571939 61550903 59530599
19352 59530599 59519436 59909601 58869524 55303363 49581213 42980358 36396877 30261261
19344 30261261 25327561 21961602 20203089 19367919 19430909 20199455 21943487 25005791 29296938
19335B9296938M651906L292568J012843n58567j195894j162077k02520J998207
19327C7133404N380284R248621J2782754J4440751J4494313J4536184J2649202
19320A20665513N907193k683270q000155q869814q948482r248712o893336j227505
19312H0701432N775089J1339004J0978808L504339n203366r458874j0129453j1299343
19304G6207636j2264082j1264070r261552p290718o198317n583849m357043l087130
19296A6900875k235830j665345j234274r71997j035175q53063n07713n20694m63731
19287G413053m68343m68201m71659l58248k70171k48112j28602Q8748L6955J03068
19277E228488L79411M33665K14401q086q6187k6867J49000J36676K26093K60192
$$ plain form
19335 29296938 33948844 37241412 38254255 37695688 36499794 35337717 35135197 37133404
19327 37133404 42513688 51762309 64545063 78985814 93480127 108016311 120665513
19320 120665513 126572706 123889436 115889281 107019467 98070985 88822273 81928937 80701432
19312 80701432 86476521 97815525 108794333 112298672 107095306 97636432 87506979 76207636
19304 76207636 63943554 52679484 43417932 36127214 29928897 24345048 19988005 16900875
19296 16900875 14665045 12999700 11765426 10793429 9758254 8905191 8397478 7876784 7413053
19287 7413053 6944710 6476509 6004850 5646602 5376431 5128319 4999717 5088465 5125420 5228488
19277 5228488 5607899 6041564 6255965 6247879 6161692 6134825 6283825 6420501 6646594 6906786
19267F906786M67683P53176R27740O09378K4049r4158p540L48138P52626O94894
19257A1382772M13464L14857L19157l4385n92179n62336j90403J67137N64490
19248A1782574J122021K188010L491034N001433P135327R507765J2357980J4904315
19240F7490459J2362128M091357m223742q054565q955120r755880q136304l635323
19232D1183010J421365N328407N822604M121919L412562N202839O992172O998380
19224H0483258O005425J506116m393436q401921q952527q244234p519907n156982
19216D5325792k294864L48394L146720N904933P313602N874799K070281j743582
19208F5946075l356272k896915r19583L082669Q840268J3349502J2853923P700598
$$ plain form
19267 6906786 7374469 8127645 9055385 9664763 9688812 9594654 9587114 9935252 10687878 11382772
19257 11382772 11796236 12111093 12430250 12395865 11803686 11241350 11050947 11218084 11782574
19248 11782574 12904595 15092605 18583639 23585072 30720399 40228164 52586144 67490459
19240 67490459 79852587 83943944 79720202 71665637 62710517 52954637 44818333 41183010
19232 41183010 42604375 47932782 53755386 57877305 61289867 66492706 73484878 80483258
19224 80483258 86488683 87994799 83601363 75199442 66246915 58002681 50482774 45325792
19216 45325792 43030928 43379322 46526042 52430975 59744577 65619376 67689657 65946075
19208 65946075 62589803 59692888 58773305 61855974 70696242 84045744 96899667 104600265
19200A04600265R51691n384236r613165j0985759r316321o113339k745758r00272
19192F0493106j139469k122311k035372r55743Q84399K069917J251537j59028
19184E8287036l8318J249970K268385M578220R594070J2404431O727694k569319
19176I2502169q402054r277785r689556r693865o309288l330364l064604m229385
19168C8505268m998837m894213m740382m355484l366311k350473j594763j099363
19160A1105442p15662m85881k7209M27990N64875L60765J81249K87737N68679
19151A2267985L54731k98250q59954j024666j160483j350351j318318q41117n60563
19142E209014k51316j85373k75273p8609r7478j31788l42672l42351l40731k84070
$$ plain form
19200 104600265 105551956 100167720 90554555 79568796 70252475 64139136 61393378 60493106
19192 60493106 59353637 57231326 55195954 54240211 55124610 57194527 58446064 58287036
19184 58287036 58248718 59498688 61767073 66345293 75939363 88343794 95071488 92502169
19176 92502169 84100115 74822330 65132774 55438909 49129621 45799257 42734653 38505268
19168 38505268 33506431 28612218 23871836 19516352 16150041 13799568 12204805 11105442
19160 11105442 10389780 9903899 9876690 10304680 10869555 11230320 11411569 11699306 12267985
19151 12267985 12622716 12324466 11464512 10439846 9279363 7929012 6610694 5769577 5209014
19142 5209014 4957698 4772325 4497052 4418443 4320965 4189177 3846505 3504154 3163423 2879353
19132B879353l19057k89671k45410j50897j17288o4530o7992p9207j10235J10291
19122A545357J1872j46224j02337J64235O3211n2140j03131q8349p5729M0673
19112A257438L9735J559P099j8473P0L6786O298n2826K0606q2156j33690j86728
19100H95718r8710Q618j24321l4935N1326o885m7762j3839P4421N5594K585J04950
19088H66760J09024o19M9734k1420j41739j11039O5051J44641J00385k2602J1546
19077A049722N3141k9151n556R1874N1554J75544J24301J02201R5786o2297p0442
19066A576677k1097r5587j11358k6071o0148o1246J06309j53495j05984j4431
19056A033569m2113q3203j60066R1626K02565P6533O3717m6979M2929j0259m6710
$$ plain form
19132 2879353 2560296 2270625 2025215 1874318 1757030 1692500 1624508 1545301 1435066 1545357
19122 1545357 1557229 1411005 1308668 1472903 1536114 1483974 1380843 1292494 1216765 1257438
19112 1257438 1297173 1298732 1305831 1287358 1287428 1324214 1330512 1277686 1298292 1216136 1082446 895718
19100 895718 797008 805626 681305 646370 697696 690811 643049 629210 703631 759225 761810 866760
19088 866760 975784 975165 1024899 1003479 861740 750701 815752 960393 1060778 1038176 1049722
19077 1049722 1102863 1073712 1068156 1160030 1211584 1387128 1511429 1613630 1709416 1647119 1576677
19066 1576677 1555580 1459993 1348635 1322564 1262416 1201170 1307479 1153984 1048000 1033569
19056 1033569 991456 908253 748187 839813 1042378 1118911 1182628 1135649 1178578 1168319 1121609
19045A121609j26668j82447J5290J06088q7516l4229Q6566J18696J04606M4275
19035A166270j03502j54953j99518m8098L0943Q5316M4992P5701J73070K38344
19025A308565O4524n2512n8837j15442p747P14J1708J05083j3474j75044j08791
19014I58747k887q0171k1597l2751r0322P7166J2444q1091j34235J1369M9560
19003F66232l6689j11763j02970J32146Q7239o7619r2854J15759J25090R4215
18993H08786q6565k2656j54036q5673p027K0771m0691p0957l9997N1267Q8525
18982D61747O6341n1962m5845J5201m4686o4012k7985P1469L4498J9134m7812
18971C86088o0100p5285n081N3637j07682R3477J69667j7635j29830L370K1420
$$ plain form
19045 1121609 994941 812494 827784 933872 846356 812127 898693 1017389 1121995 1166270
19035 1166270 1062768 907815 708297 660199 691142 776458 821450 897151 1070221 1308565
19025 1308565 1373089 1320577 1261740 1146298 1138551 1139265 1150973 1256056 1242582 1067538 958747
19014 958747 955860 875689 854092 821341 731019 808185 820629 739538 605303 616672 666232
19003 666232 629543 517780 414810 546956 634195 566576 473722 589481 714571 808786
18993 808786 722221 699565 545529 459856 452829 473600 432909 361952 321955 373222 461747
18982 461747 528088 476126 430281 445482 400796 336784 308799 380268 414766 433900 386088
18971 386088 325988 250703 245622 299259 191577 285054 454721 437086 307256 310626 332046
18960C32046k4427q0513l253J55615k2585j30037n3781N5002Q9058n1431j19138
18949A46556O292J6642J62952L1853j60842k4844J42999k5379j36560j3171M1850
18938A88348j15915o8435K5918J36907J03847J27487j1050j934j4179Q3391k4080
18927D30305J6353O4973m7871r2389l162l2877j35269k0128M9655j38894l4539
18916E6157Q1196O5365j1136Q199K0228q2942j6135n5386R5819J0930j3805J06529
18904B65019m8109M9747j7923p7716j8360n6943Q22J02884J09856K6885j7752
18893C18410J184j05536O1610J45556M1942r2235j35351r3078M885J19590J6232
18882B83209N2927O0397K1583r3966M929L6493M5118o2061L6079M7181j31558
$$ plain form
18960 332046 307619 227106 223853 379468 356883 226846 173065 228067 317125 265694 146556
18949 146556 152848 169490 332442 364295 203453 178609 321608 296229 159669 146498 188348
18938 188348 72433 3998 29916 166823 270670 398157 387107 385173 370994 454385 430305
18927 430305 446658 511631 463760 371371 368209 335332 200063 179935 229590 90696 56157
18916 56157 137353 202718 191582 199781 220009 137067 120932 65546 161365 172295 158490 265019
18904 265019 216910 266657 248734 171018 152658 95715 96537 199421 309277 336162 318410
18893 318410 319594 214058 275668 421224 463166 370931 235580 142502 147387 266977 283209
18882 283209 336136 396533 418116 324150 329079 365572 410690 348629 384708 431889 300331
18871C00331j33417J00722J40193n407p5840j3563P4717M255J21246J22523n2850
18860E82910N9401p3448P241J32704M5734p353L2812k0014j29j40046n9495J6667
18848E76984J14037J05154J57114k7704q0712j55736j44036k4006m75J04367K8061
18837F53048k4650o7387J4782R19L9315J6565j18129j2464L1818O5306l3227k0028
18825E45868K9779k7557j5925K6703P0930M3343M9420l5457O3335L3550J26275
18814I10264L7351l5561P0343o0097j230L8210L0842O312L2969J2483l594N8938
18802A097230j22087j11734O6893N6988j13756m4119m990p487P4743l7432q7604
18791G66645j3687P6638m5516L5313Q654j40365j01506k7144K3540N0422N4848
$$ plain form
18871 300331 166914 267636 407829 402422 326582 313019 387736 391991 513237 635760 582910
18860 582910 642311 568863 576104 708808 754542 747189 780001 759987 759858 619812 560317 576984
18848 576984 691021 796175 953289 925585 844873 689137 545101 521095 520620 624987 653048
18837 653048 628398 561011 575793 576712 616027 632592 514463 501999 533817 599123 565896 545868
18825 545868 575647 548090 532165 558868 629798 673141 722561 687104 750439 783989 910264
18814 910264 947615 912054 982397 922300 921070 959280 990122 996434 1029403 1041886 1038292 1097230
18802 1097230 975143 863409 930302 987290 873534 829415 824425 816938 891681 854249 766645
18791 766645 752958 829596 784080 819393 828047 687682 586176 559032 582572 632994 687842
18780F87842j9797J3334L565o8045o8361m7478L6302J7883j2465j3633m637P970
18768E32480J21123Q616J87363K80592J59111Q351l2030j10659k17670k60688
18758F76589m7909m8982j0417j36019m8942j21121Q9069J32801k6306J176k4987
18747D34952j904n7266j13278l9732N9578J00896J34873o4045Q1610J17618n0893
18736F02409j01503q7648n8851n766R4049M275P435m1643J6112N4364R782M1924
18724E34939K04075M1566M2021m833L0233j7539m8689j66586m7592p848o8143
18713D91604J6835J6393J57682R2693J00877J59182Q6357J1206K0942J58137N1265
18702A363173j48383r8735o3888K8474P2459j6243N6152J9233r7257J1056Q1823
$$ plain form
18780 687842 668045 681379 684944 616899 548538 501060 537362 555245 542780 529147 524510 532480
18768 532480 653603 662219 849582 1130174 1289285 1297636 1265606 1154947 937277 676589
18758 676589 628680 579698 569281 433262 384320 263199 352268 485069 458763 459939 434952
18747 434952 433048 375782 262504 222772 282350 383246 518119 454074 535684 653302 602409
18736 602409 500906 413258 354407 348641 442690 446965 454400 412757 428869 483233 493015 534939
18724 534939 739014 780580 822601 817768 848001 830462 781773 615187 567595 559747 491604
18713 491604 508439 524832 682514 775207 876084 1035266 1121623 1132829 1153771 1311908 1363173
18702 1363173 1214790 1116055 1052167 1080641 1153100 1136857 1193009 1212242 1114985 1126041 1207864
18691A207864J45630P5022K18k8048L9312K08444R8206J33123N3332J20943J78854
18680B232900J51727J62942J42801N31390O70046J008030J176687Q45205L96135
18671G317863N8093m7367M7763K38901Q89281J753160K309208J582726K34928
18662A4384556p26528j118342j309853j221460p14718J43374Q63366Q76180Q3667
18653A1260242p15191q91225r61775j181065r34644m27882J85310L86326R44218
18644G664314J389463R42836J66177l09366o41993q20857r68497p33991m52286
18635F235800k72518j35977j2812K75167M63315N05534Q36092J194172J644441
18626A0733214K146517K636593K973403L667222M785732O423882P027381N576739
$$ plain form
18691 1207864 1353494 1428516 1428734 1400686 1439998 1648442 1746648 1879771 1933103 2054046 2232900
18680 2232900 2384627 2547569 2690370 3221760 3891806 4899836 6076523 6921728 7317863
18671 7317863 7375956 7328589 7376352 7615253 8504534 10257694 12566902 14149628 14384556
18662 14384556 13658028 12539686 11229833 10008373 9293655 9437029 10300395 11176575 11260242
18653 11260242 10545051 9653826 8692051 7510986 6576342 6148460 6333770 6720096 7664314
18644 7664314 9053777 9996613 10162790 9853424 9211431 8390574 7422077 6688086 6235800
18635 6235800 5963282 5827305 5814493 6089660 6552975 7058509 7894601 9088773 10733214
18626 10733214 12879731 15516324 18489727 22156949 26942681 33366563 40393944 45970683
18618D5970683L513664K482174K778820J844143j461279m710152n900122o053209
18610C8464722o105300n649957m339667k581006j280363l37415N13975J336440
18602B0021429K279533L492148M132919L101546K027206J917327K319488J223726
18594D0515322m57140j425670j463983j317465n94574J143302L548673O408985
18586D6357450R358669R646979P020470M270171L140285K554204K762158N985189
18578I1095575J2334149J8338040K2657547K3755138K1765320K1969649K6958700
18571B38874118K7990478J1950867j0497328k2307110k2120477k0307355j8277520
18564A85305673r954761k99122Q026327J4324390J5009511J1899463J1567182
$$ plain form
18618 45970683 49484347 51966521 54745341 56589484 55128205 50418053 44517931 38464722
18610 38464722 32359422 26709465 22369798 19788792 18508429 18171014 18684989 20021429
18602 20021429 22300962 25793110 29926029 33027575 35054781 36972108 39291596 40515322
18594 40515322 40058182 38632512 37168529 35851064 35256490 36399792 39948465 46357450
18586 46357450 55716119 65363098 72383568 76653739 79794024 82348228 85110386 91095575
18578 91095575 103429724 121767764 144425311 168180449 189945769 211915418 238874118
18571 238874118 266864596 278815463 268318135 246011025 223890548 203583193 185305673
18564 185305673 175350912 175051790 183078117 197402507 212412018 224311481 235878663
18557B35878663J6753988J9935746J5896918J0561099N427658k704612j5059167
18550B86690293k3905124k6013058k3733106j9418489j4579190j1733427j0914818
18543A56393081q769795o818402p511084r148863p941981m231636j111744p17035
18535A10142541p6732K796383P288874R622193R585435J1437079J3877643J0567983
18527A75241399M03523q582137j3203426j5337596j5663426j2558428p922292
18520A02377617m219787j685899q40950j580142k075375r67645J736867O721488
18512I9466174J3659488J8965964J7732177R732840P7657n814810q359111j1366628
18504A34093751j4599975j4787310j2229684j0719582j0915770j0125852p921566
$$ plain form
18557 235878663 252632651 272568397 288465315 299026414 304454072 301749460 286690293
18550 286690293 262785169 236772111 213039005 193620516 179041326 167307899 156393081
18543 156393081 147623286 140804884 133293800 124144937 116202956 111971320 110859576 110142541
18535 110142541 110065809 112862192 120151066 129773259 139358694 150795773 164673416 175241399
18527 175241399 175644922 167062785 153859359 138521763 122858337 110299909 102377617
18520 102377617 98157830 96471931 95630981 94050839 91975464 91007819 92744686 99466174
18512 99466174 113125662 132091626 149823803 159556643 159634300 153819490 145460379 134093751
18504 134093751 119493776 104706466 92476782 81757200 70841430 60715578 52794012
18497E2794012o049488m854893l563885k487753k069470k030759k643162k984438
18489B6110164k755830k441535k224763j767405j183849o08320L2873N85380J438746
18480A7185461K277510K515206J422203R1255q15757r91084p66139l84946P55987
18471B1289696K582239M374692N032450L407936J529327J004569P46022j208416
18463C8758515l584482m320394m119394l771235l455702k260877m39588J429180
18455A8236023L015911L740928K488726L9995k046622l182594l629666l974352
18447A4688349l346738k483853j641887j035560o57239m71030l85292l36021k97772
18438D032957k86253l26918m12694l34619j28468p9021j36941j15931r6378m420
$$ plain form
18497 52794012 46744524 41889631 38325746 35837993 33768523 31737764 29094602 26110164
18489 26110164 23354334 20912799 18688036 16920631 15736782 15128462 15161335 15746715 17185461
18480 17185461 19462971 21978177 23400380 23491635 22675878 21684794 20918655 20533709 21289696
18471 21289696 23871935 28246627 33279077 36687013 38216340 39220909 39966931 38758515
18463 38758515 35174033 30853639 26734245 22963010 19507308 17246431 16806843 18236023
18455 18236023 21251934 24992862 27481588 27521583 25474961 22292367 18662701 14688349
18447 14688349 11341611 8857758 7215871 6180311 5523072 5052042 4666750 4330729 4032957
18438 4032957 3746704 3419786 3007092 2672473 2544005 2464984 2328043 2212112 2115734 2111314
18428B111314p7262n8840j33642j37582j54127r9522p7688M8856r9387n3686p1783
18417A196651n2772m3090l802J03536Q3584K2234J28838n9905r6068j80685j3580
18406A084941R1067M2320o8889j71231j10039R5924O9631o5504m1863p345n8066
18395H60946j8156j14860l1869j38053m8921N7835J96481l0988k7924j05261K2446
18384F21676J31528M0561k6673N9683R6158o6624k09770j25880l7541k1991Q7112
18373E48239J3453K7550J3138P387M9461J16440l9794j27604p4004m3045p0753
18362D20468M2941Q2676j00198M8916J39127o9070p8326n9704r277n7863j14443
18351B45247O3834N1762K5087r486p986n1216l7179m5378P175j3955j11076j1723
$$ plain form
18428 2111314 2034052 1975212 1841570 1703988 1549861 1450339 1372651 1421507 1322120 1268434 1196651
18417 1196651 1143879 1100789 1096987 1200523 1284107 1306341 1435179 1375274 1279206 1098521 1084941
18406 1084941 1176008 1218328 1149439 978208 868169 964093 1033724 968220 926357 919012 860946
18395 860946 842790 727930 696061 558008 509087 566922 763403 732415 704491 599230 621676
18384 621676 753204 793765 767092 826775 922933 856309 646539 520659 483118 461127 548239
18373 548239 561692 589242 602380 609767 659228 775668 735874 608270 534266 491221 420468
18362 420468 463409 546085 445887 494803 633930 564860 486534 426830 417553 359690 245247
18351 245247 309081 360843 385930 376444 368458 317242 280063 234685 241860 227905 116829 105106
18339A05106M7974J51590M6782m2757J27522P6124p2905j03538n2468n9895l5385
18328A88150O8070J43879m3788J1534j0057K547k4748l7729m7662q5428O0376
18317B25144J00050k5113k100j06353l9707m7461M8284R1855K20076j33543j42978
18306A88154q817p3587p0462L5887j0274o068P4131K1432m4787n183o650M1412
18294A35188j1667r2933K3915N3376j06590P8766P0059K5793m149m3137m1183
18283H7438O2325L7042o7957L6180K5542M1475m5490Q05N5969O1802p6003N9269
18271B78397N2580k17656M3090J24853O2433o3342p5784M616R123n6465k19977
18260e8132j17761J52808M1321J63542J47346o6894p4466l2643r1404J0791M9724
$$ plain form
18339 105106 153080 304670 351452 308695 436217 512341 439436 335898 283430 223535 188150
18328 188150 256220 400099 356311 367845 357788 360335 335587 297858 250196 164768 225144
18317 225144 325194 300081 297981 191628 151921 104460 152744 244599 464675 331132 188154
18306 188154 179337 105750 35288 71175 60901 54833 128964 150396 105609 100426 93776 135188
18294 135188 123521 30588 54503 107879 1289 80055 150114 175907 171758 128621 87438
18283 87438 149763 186805 118848 155028 180570 222045 176555 177360 233329 295131 219128 278397
18271 278397 330977 113321 156411 281264 343697 280355 204571 209187 218310 161845 -58132
18260 -58132 -175893 -23085 18236 181778 329124 262230 187764 155121 63717 74508 124232
18249A24232J1074k4214K6948L6453M2859n266k7017q8798j07357O7632K05900
18238B62446N08j12599n8099N1336N746R774J49859R7880j58845r5771J00299
18227B52534J6910k2719q4037R5395P4877q3487o6559k9136O740J1586r4067l1449
18215D6588R9352M045n4150k8924N5342N5346j18576o9759N1879J42277M2561
18204B25981o0298o2398J11487j0531j33876k8671P0654N262k7499J29406P077
18193B26594j24888n4736P4531o8184p1889j5216P8585o297l3404P9286R3203
18182A77585K3056j6458p064o3744R5155j19466j03360P2762O1175j4461k8541
18171G6639M8391M8720M2820K8316L3332J10904k7026n837L6164n195k7355J73030
$$ plain form
18249 124232 135306 111092 138040 174493 217352 212086 185069 96271 -11086 56546 262446
18238 262446 262954 150355 92256 143592 149338 159112 308971 406851 248006 152235 252534
18227 252534 269444 246725 162688 258083 332960 249473 182914 153778 160518 172104 78037 46588
18215 46588 145940 149985 95835 66911 122253 177599 59023 -10736 41143 183420 225981
18204 225981 165683 103285 214772 204241 70365 41694 112348 117610 90111 219517 226594
18193 226594 101706 46970 121501 53317 -18572 -33788 44797 38500 5096 84382 177585
18182 177585 200641 184183 177119 113375 208530 89064 -14296 58466 119641 105180 76639
18171 76639 125030 173750 216570 244886 278218 389122 362096 356259 392423 387228 359873 532903
18159E32903O9976m9509j31035N6941J20955R6560k0783q5704r8137N7060r2416
18148D56811n6404J75344J58947j2872P4331N4592J5022J690M1978l3192o5319
18137H10928n7027J6561K22610R3125J81701J03806L7534J18674L3576P3452J53204
18126A788144J10899K12037K29229L00854M18664M05455M31524M70967O34762
18117E002535Q91956J201647J419972J861911K723359M149712O334488J0085408
18109C3670988J6863344K8293113M2823574M3319969J6682069j0970832k3127480
18102A47554745k3192620l0230310l1130512k0913209j2327309p311289m487111
18095A7962385k951251k225883j706405j396271j026164p83908p25810p05100
$$ plain form
18159 532903 602879 553370 422335 479276 600231 696791 676008 590304 492167 549227 456811
18148 456811 400407 575751 734698 721826 796157 850749 865771 867461 909439 876247 810928
18137 810928 753901 770462 993072 1086197 1267898 1371704 1409238 1527912 1561488 1634940 1788144
18126 1788144 1899043 2111080 2340309 2641163 3059827 3465282 3896806 4367773 5002535
18117 5002535 5894491 7096138 8516110 10378021 13101380 17251092 23585580 33670988
18109 33670988 50534332 78827445 121651019 164970988 181653057 170682225 147554745
18102 147554745 124362125 94131815 63001303 42088094 29760785 22449496 17962385
18095 17962385 15011134 12785251 11078846 9682575 8656411 7872503 7146693 6441593
18087F441593n77715n42984l55671k39899l60145l53032m09060m09788k81728
18078B911571l06906k14166j40648o5924j10105j11279j89580j31122j15568j06245
18068A420028q1837m8307j56365n3416K4051k0047k7754r1995j10725o8084O9757
18057H55306M4336J36436K4957k457j39114j34262J91411J12182p7739J03048
18047A114104J23499Q8335M6922Q3316J40740q8412K4790n3446j01129o9882k4086
18036A284751k780j15347j42077R742n3811q3481j55957q4668m4180n0425q7095
18025D74672j5088Q9222m8443j40538p7602m290J15461K7679o030J1267M7779
18014D74089K0467J2311N3475O1342q02J2622R3978N2774m0775o0048J3986j6193
$$ plain form
18087 6441593 5863878 5320894 4965223 4725324 4365179 4012147 3603087 3193299 2911571
18078 2911571 2604665 2390499 2249851 2183927 2073822 1962543 1772963 1641841 1526273 1420028
18068 1420028 1338191 1289884 1133519 1080103 1104154 1084107 1056353 964358 853633 785549 855306
18057 855306 899642 1036078 1061035 1058578 919464 785202 976613 1088795 1011056 1114104
18047 1114104 1237603 1325938 1372860 1456176 1596916 1508504 1533294 1479848 1378719 1308837 1284751
18036 1284751 1281971 1166624 1024547 1034289 980478 896997 741040 656372 612192 561767 474672
18025 474672 459584 548806 500363 359825 282223 277933 393394 421073 415043 426310 474089
18014 474089 494556 506867 560342 621684 620882 633504 727482 780256 739481 679433 693419 677226
18002F77226j5006j9934O4767Q2168N4345N9524m9510J4051P944K2080l9593p7829
17990G80233k8907r0l7012j26307j24902p5758k1256J06933p3187k07272J662
17979A94137J06433Q855N2074J9483L6483q1077j29964r4714k00363P1238K6153
17968H738l9566M1418R8307O2482M0868P6339K8400m8129r1498Q326Q776K7095
17956B21556o5231J22193R6678J1206j31045n5162N6115O8850O738q7540j6380
17945B27978P2739m2314J6319Q563Q979q0491k9574P851o5713l6911m7996K1188
17933F0618k5072n047L1846r3208m9733N4490l0258j7388P6941L5021J08289n6003
17921I0496j95896l0838J57252J25498Q838k2850K8769l3458o1773N3662j19810
$$ plain form
18002 677226 662220 642286 707053 789221 843566 903090 853580 867631 875575 897655 858062 780233
17990 780233 751326 751236 714224 587917 463015 387257 366001 472934 399747 192475 194137
17979 194137 300570 309425 361499 380982 417465 336388 206424 111710 -88653 -17415 8738
17968 8738 -30828 10590 108897 171379 212247 288586 316986 268857 177359 185685 194461 221556
17956 221556 156325 278518 375196 386402 255357 200195 256310 325160 331898 244358 227978
17945 227978 300717 258403 274722 283285 292264 211773 182199 190050 124337 87426 39430 60618
17933 60618 35546 30499 62345 -30863 -80596 -26106 -56364 -73752 3189 38210 146499 90496
17921 90496 -105400 -136238 21014 146512 155350 132500 161269 127811 66038 119700 -110
17910a10m7228Q1940L0074j822l3803R2760M860j70115J031N4966k387j15228
17898a05062k537O9687R1617Q4298p2508n3603j46355k5310Q389p1327J35577
17887h7134J54556l801P235O6243P2609j8455j27713k05555k3586O1514M0488
17876f3599r679j0455k776P8790R8255J40908P3871j21909n6277Q065q7975n098
17864D2121m5248k9111O0812l1967l0187j9037N4226J17546q3095Q0J615p9974
17852d2219m4057j2435Q6239J15712K1114q941l8956j31454n3219J08556j7642
17841a7302l5251N3030K6003n4120j23347J4159p861p3987n7071l0769M2606O9075
17829a94835L6274J52374j25521j9439O4004k1835Q0557n5421L3744M6035K859
$$ plain form
17910 -110 -47338 34602 64676 62854 29051 121811 126671 -43444 -42413 12553 10166 -105062
17898 -105062 -107599 -37912 53705 138003 65495 11892 -134463 -159773 -151384 -222711 -87134
17887 -87134 67422 63621 70856 137099 209708 191253 63540 -142015 -165601 -104087 -63599
17876 -63599 -73278 -83733 -86509 -7719 90536 231444 305315 183406 127129 135194 47219 42121
17864 42121 -3127 -32238 28574 -3393 -33580 -52617 1609 119155 36060 36140 37755 -42219
17852 -42219 -86276 -98711 -12472 103240 124354 115413 76457 -54997 -108216 340 -17302
17841 -17302 -52553 477 26480 -27640 -150987 -136828 -144689 -218676 -275747 -306516 -263910 -194835
17829 -194835 -158561 -6187 -131708 -151147 -87143 -108978 -28421 -83842 -50098 -4063 -1204
17818a204o15Q6881P4352K1449j24258r3973p1647Q2197k2976l9554p647o6994
17806a63989m5400J7346N7021K6222k5474j20913N208p040J36059J23951P4052
17795G7043n3504l3313n7337k1396R3527o0404J3099o47r3375j19706q029P7928
17783a86114Q5863L1813N0950L5231j3271o4421P7893l1189m4134M803J3168k0272
17771e9680k6578K8951K7593l1356m2600J5034Q5283J4254l1632j07233l9197
17760a67161J35809J03881K499P724J8869Q5088R224j12643o2502P6119o0788
17749C6119j13305j8110Q0315J1097o441P0230N5480J6967q3537Q2831O5901r7100
17737A00447j2767J14058n3217l0726j329Q335J1866m2698n3946p694l2892j32530
$$ plain form
17818 -1204 -1819 85062 159414 180863 56605 -37368 -109015 -26818 -49794 -89348 -96995 -163989
17806 -163989 -209389 -192043 -135022 -108800 -134274 -255187 -249979 -257019 -120960 2991 77043
17795 77043 23539 -9774 -67111 -88507 5020 -55384 -42285 -42932 -136307 -256013 -264042 -186114
17783 -186114 -100251 -68438 -17488 17743 4472 -59949 17944 -13245 -57379 -52576 -39408 -59680
17771 -59680 -86258 -57307 -29714 -61070 -103670 -88636 -3353 10901 -20731 -127964 -167161
17760 -167161 -31352 72529 75028 82752 101621 186709 195933 83290 20788 96907 36119
17749 36119 -77186 -95296 -14981 -3884 -10325 59905 115385 132352 48815 131646 197547 100447
17737 100447 87680 201738 148521 117795 116466 124801 136667 93969 40023 32329 -563 -133093
17725a33093M9353m7284p0781J21894J28160J03714j28260j40802j09833J35877
17715i1055J06342l5311k9667j5002m678N7808J14713j0192J3744J8905M1599
17704A67206r8474J16005O8012N4998j19021j96058o582M9717K7298j10127j3272
17693f0298R573r1088p7725k8295J3404R7624R1319k3029k7765L8488O4261M0412
17681D6881j06887o7329j554J53025R6614q4011p7968j62603q1339O6749Q9904
17670a28518Q4617P1332R6765m4111L1172K9326Q90k2188o2729m9070k4287m6914
17658f3715O6648J7870n2810k692l3471M7784j59946j0294J07573J13818K8255
17647E9020j6588L7694l0477k692P5104p5859P885J06953K07476j05173p9114
$$ plain form
17725 -133093 -83740 -131024 -201805 -79911 48249 151963 23703 -117099 -226932 -91055
17715 -91055 15287 -20024 -49691 -64693 -69371 -11563 103150 92958 106702 125607 167206
17704 167206 68732 184737 252749 307747 188726 -7332 -13914 35803 63101 -47026 -60298
17693 -60298 -50725 -141813 -219538 -247833 -234429 -136805 -45486 -68515 -96280 -57792 6469 46881
17681 46881 -60006 -127335 -128889 24136 120750 36739 -41229 -203832 -285171 -218422 -128518
17670 -128518 -43901 27431 124196 80085 111257 140583 141473 119285 56556 7486 -16801 -63715
17658 -63715 2933 20803 -32007 -34699 -68170 -20386 -180332 -190626 -83053 30765 59020
17647 59020 42432 80126 49649 46957 122061 46202 54087 161040 368516 263343 184229
17636A84229o4876j08556n9007j8489J944n2068P8127L2368j6832N91J42780J7843
17624A38054k2524j6904m2751j08004Q632J50340k950n3245n8568R8408K4875
17613A15363O03L5138j8206k7812n5977n9125j6490k9334l0230m2046l6648J30486
17601c4278L6334r519K6324O5501p7515L2249O2946p5697k3459j2639L9806j0868
17589A9185k3694k0052O7985L8074k8821n0117l0342p6302J1614R7784k0330K9092
17577A4076r122M1458J0518M1075p2141p67j42853l1474O0123Q0081n2581j14571
17565a76178l5880R1647P5142Q3990j09186R848L7248K0751l7537K1214Q0698
17554F1757L248p0060l1962m1578M737k6861O8575L8903J4333r0516o698K9538
$$ plain form
17636 184229 119353 10797 -48210 -66699 -64755 -116823 -38696 -6328 -23160 -22569 120211 138054
17624 138054 115530 98626 55875 -52129 -43497 106843 103893 50648 -7920 90488 115363
17613 115363 115966 151104 132898 105086 49109 -10016 -26506 -55840 -86070 -128116 -164764 -34278
17601 -34278 2056 -7463 18861 84362 6847 39096 102042 26345 2886 -9753 30053 19185
17589 19185 -4509 -24561 43424 81498 52677 2560 -27782 -104084 -92470 5314 -15016 14076
17577 14076 4954 46412 56930 98005 25864 25097 -117756 -149230 -89107 -9026 -61607 -176178
17565 -176178 -212058 -120411 -45269 38721 -70465 -60617 -23369 -2618 -40155 -18941 61757
17554 61757 65005 -5055 -37017 -78595 -73858 -100719 -32144 6759 21092 -69424 -76122 -46584
17542d6584L1487P572M3001n264r2882j00497M0735J77754l8668k3327q5916p9541
17530a72130N1479P2172K222j8860j59582R4637L3982N527M2209k0843O788j18788
17518a81187l134J31799l1300K2777l7353n2392o2135J32231Q8617k370p2229
17507f6676n2063Q3636p195M0646k8510j90703k5181R7623J742r7089O7055R1145
17495h5570m9259M8465j402l4706L8263P8866K817L2642n7594r1838K6105N3566
17483c9645j7356J7790j6126J13720n0386j39410l2691O8661L6227P638o4098
17472a15676m0802j2202R8983J02397M8961J6481l7178n7112l5144j29799N2964
17461a08127R0116o0317N4235O5078j4024r0494L7154j5248M244M4843R7877R0432
$$ plain form
17542 -46584 -15097 -7525 35476 30212 -62670 -163167 -122432 55322 16654 -6673 -92589 -172130
17530 -172130 -120651 -48479 -46257 -65117 -224699 -130062 -96080 -90553 -48344 -69187 -62399 -181187
17518 -181187 -184321 -52522 -83822 -61045 -98398 -150790 -212925 -80694 7923 5553 -66676
17507 -66676 -118739 -35103 -42298 -1652 -30162 -220865 -246046 -148423 -146681 -243770 -176715 -85570
17495 -85570 -134829 -86364 -87766 -122472 -84209 -5343 -2526 30116 -27478 -119316 -93211 -39645
17483 -39645 -57001 -39211 -55337 58383 7997 -131413 -164104 -95443 -59216 -51578 -115676
17472 -115676 -156478 -168680 -69697 32700 81661 98142 60964 3852 -31292 -161091 -108127
17461 -108127 -18011 -78328 -24093 40985 26961 -63533 -26379 -41627 -37383 7460 105337 195769
17449A95769l0812K9647Q3268j37246K1655k4016p0608j8183J82793M68621J23861
17438H24749O3728l8885n6850j30180k26619j56799P8086j1367k14501p2736j86675
17427a28049j3973J40246Q5817N7944J8169j83448j23067K2780n5509N0977J22042
17416f071J13396Q2395q1299k48367j88538K3218K62432O2658r1250R612P8045
17405A6231Q0640p324m7781K1131M5317p235n3182q2967j28468r7796J94318P5881
17393H765o2310L6007J51890l4130o4250j33023K8846M9686N53q1451j3896N0095
17381f3218J00580R959m9661O2442q5438j10703K9288J30393L1060K396j1486
17370D5612j37007p8488K665M9537Q6856M7009P8748L0783q6951r8216N7550O8532
$$ plain form
17449 195769 164957 194604 277872 140626 162281 138265 67657 49474 232267 700888 824749
17438 824749 888477 849592 792742 662562 435943 279144 357230 345863 131362 58626 -128049
17427 -128049 -142022 -1776 84041 141985 160154 -23294 -146361 -123581 -179090 -128113 -6071
17416 -6071 107325 189720 108421 -139946 -328484 -305266 -42834 19824 -71426 -61814 16231
17405 16231 96871 89547 41766 62897 108214 100979 47797 -35170 -163638 -261434 -67116 8765
17393 8765 -53545 -17538 134352 100222 35972 -97051 -68205 -18519 -17966 -99417 -113313 -63218
17381 -63218 37362 47321 -2340 60102 -25336 -136039 -106751 23642 54702 57098 45612
17370 45612 -91395 -169883 -167218 -117681 -30825 16184 94932 125715 38764 -59452 -1902 66630
17358F6630O4615q4516k162L6473K1279l6016j1246p9659p7049M477M5086P3771
17346B1683J7469j64085p9191N5615j0264N421q466Q2449R7228J15085j1628M4471
17334A65787o9932p7141p8500k8358m7317L7898R3967Q3316o3100j14076K731
17323i4725P1189J1674J1002l3336M887p68j532r261j4420M3680r048j04246k6810
17310a51714O5339K57790R1310N0290m6195r4749o637m4915n3672K7288J0009
17299A04144l4401M7527q0504j99173K4513J00878P1301o194m8253m9214j10114
17288a79490P2515K4601L841P4499L3287k27167p7408J02144J89401M0002M8859
17277A05084O1203l4088p4281j23168j1329J3826L4122j4252o0115P1053L561
$$ plain form
17358 66630 131245 46729 44567 81040 102319 66303 55057 -24602 -101651 -97174 -52088 21683
17346 21683 39152 -124933 -204124 -148509 -158773 -153352 -161818 -79369 17859 132944 121316 165787
17334 165787 95855 18714 -59786 -88144 -135461 -97563 -3596 79720 16620 -97456 -94725
17323 -94725 -23536 -11862 -860 -34196 -29309 -30077 -31609 -40870 -55290 -11610 -20658 -124904 -151714
17310 -151714 -86375 171415 262725 313015 266820 172071 165434 120519 66847 94135 104144
17299 104144 69743 117270 36766 -162407 -137894 -37016 34285 28091 -20162 -69376 -179490
17288 -179490 -106975 -82374 -78533 -4034 29253 -197914 -275322 -173178 16223 56225 105084
17277 105084 166287 132199 57918 -65250 -76579 -62753 -28631 -42883 -102998 -31945 -28384
17266b8384p6137L9679n2811j23418J546O8092J42750N0192M1125J8326m4466
17255C6494j09386p6710n3064R318L0196O6740O0024J39876O9027N5118o8440
17244A59193P6125k8533k34019r136P6435n5204n5838j4621k6570j4980l4828
17233a61976J08856K11906m9588r3930j4501o751j17951R6767p6960j53828L1283
17222b26673O0987n822O3337L1601q4055K5129O4644Q8435N1739j25552j0876
17211f7106K675m7448J3944k0198o3632P2544k5170j8849m154L0268J22972j543
17199e697q793M087M0362p1083n9304N1316O1893r0883L2548k7416q6933k26526
17187c86429R9601R3719k9949J17272J11569l991k6882Q02n0481r4053j3035p7636
$$ plain form
17266 -28384 -104521 -64842 -117653 -241071 -239525 -171433 -28683 21509 62634 80960 36494
17255 36494 -72892 -149602 -202666 -193348 -163152 -96412 -36388 103488 172515 227633 159193
17244 159193 235318 206785 -27234 -36370 40065 -15139 -70977 -85598 -112168 -127148 -161976
17233 -161976 -53120 158786 109198 15268 767 -5984 -123935 -27168 -104128 -257956 -226673
17222 -226673 -165686 -171508 -108171 -76570 -160625 -135496 -70852 17583 69322 -56230 -67106
17211 -67106 -64431 -111879 -97935 -118133 -181765 -109221 -134391 -153240 -157394 -127126 -4154 -5697
17199 -5697 -14490 -10403 29959 -41124 -100428 -49112 12781 -78102 -45554 -72970 -159903 -386429
17187 -386429 -286828 -193109 -223058 -105786 5783 1792 -25090 -24288 -74769 -168822 -181857 -259493
17175b59493Q9731J10912J197K4198o0983L6672k2238p0646J6865k6800l1022
17164a91607K2260j8047L5888J36165R964m3696L5130M5113K385q5290j29799
17153a81534J38P3892m5234J4697k013l4777L2403K6181J28914R2303N5253O366
17141A66589r0334K0311o162j38910K2063j15347m2206k0749n2386K8540M0820
17130a87771k0098p8815J0926J34478R0645j6552j04864q512J70419J31373p2950
17119D8279r6367N793M6187r5154j41699J03827O969q890J31327M3332N8508n7586
17107D4526N88N8570j11994l5598L7763P5354J15091q7272n2696o462O693l5373
17095I190J13021l5707k7570J5855k282N6962J51525N7624j55684p7981J07860
$$ plain form
17175 -259493 -169762 -58850 -57653 -33455 -94438 -57766 -80004 -150650 -133785 -160585 -191607
17164 -191607 -169347 -187394 -151506 -15341 -5377 -49073 -13943 31170 33555 -51735 -181534
17153 -181534 -181396 -107504 -152738 -138041 -140054 -174831 -142428 -116247 12667 104970 160223 166589
17141 166589 76255 96566 90404 -48506 -26443 -141790 -183996 -204745 -257131 -228591 -187771
17130 -187771 -207869 -286684 -275758 -141280 -50635 -67187 -172051 -180563 -10144 121229 48279
17119 48279 -48088 -42295 3892 -91262 -232961 -129134 -122165 -131055 272 43604 102112 44526
17107 44526 45114 103684 -8310 -43908 -6145 69209 184300 97028 44332 37870 44563 9190
17095 9190 122211 86504 58934 74789 72507 129469 280994 338618 182934 104953 212813
17084B12813n431r7865j8348P4608Q0906o7592j89917m8622J2834M245P5764J04374
17072A37769P169j48653j21127J40440J13128j10531N3177Q4068l9749p3354k4520
17061A7817m9250l07r3683L4191Q4209M8682p157j6747L1162p8566j24069L7659
17049a16059J1245J04964K791m4654o8571r463J9236J31041Q6269q4044n103N7895
17037H5547R448j3605o9511L5587j273K9239N8936j46712k3141m3310j0966Q9120
17025f41M9344n7788J04280q2944j84591m8537n0601j06995K4594N4356j2938
17014c12461J7048J50232J63829K0033J18533L4993j2644R5337n6728n0019n260
17003A62893K3534k6899m125j03531K0087K0110p5323k3438n6838N4853k1916
$$ plain form
17084 212813 207382 109517 91169 165777 246683 179091 -10826 -59448 -46614 -42369 33395 137769
17072 137769 144938 -3715 -124842 15598 128726 18195 71372 155440 115691 42337 17817
17061 17817 -31433 -31740 -125423 -91232 -7023 41659 34502 17755 48917 -29649 -153718 -116059
17049 -116059 -104814 150 2941 -41713 -110284 -119747 -100511 30530 116799 32755 27652 85547
17037 85547 94995 81390 11879 47466 46193 75432 134368 -12344 -35485 -78795 -89761 -641
17025 -641 48703 -9085 95195 12251 -172340 -220877 -271478 -378473 -353879 -299523 -312461
17014 -312461 -295413 -145181 18648 38681 157214 192207 179563 274900 218172 168153 162893
17003 162893 186427 159528 155403 51872 71959 92069 16746 -6692 -63530 -8677 -30593
16992c0593q8547O5134K6569k8286k1367O8862J01662r0513K0476p6580n5746
16981a08929R108J3321J14669N9490o4801j83171m767L2492L9357R3280O5890
16970F5939n9197m1378l8540O922K8578M6251j1556K6350M9347n4843N9517N463
16958H2853j7830m416Q6501M7159r7372p3097p8566N6059J17823j45312p6974
16947a03172M6760Q9127k3873j03799j34641N3074N8038K3967J5029L4199m1200
16936h6491K4460Q5507K8989N0800K0761L0878O617j03267j13129M5597J12319
16925A03041r9690n1239l5295k1647o9354m0394q43p0664L5536N5736Q7604J3615
16913i3594m6835j6554L7271j32234M823P8613J19982M7603j962o1144J34351
$$ plain form
16992 -30593 -119140 -54006 -27437 -55723 -77090 -8228 93434 2921 23397 -53183 -108929
16981 -108929 -99821 -86500 28169 87659 22858 -160313 -165080 -132588 -93231 49 65939
16970 65939 6742 -34636 -73176 -66254 -37676 8575 -2981 23369 72716 17873 77390 82853
16958 82853 65023 60607 147108 194267 96895 23798 -54768 1291 119114 -26198 -103172
16947 -103172 -56412 32715 8842 -94957 -229598 -176524 -118486 -94519 -79490 -45291 -86491
16936 -86491 -62031 23476 52465 103265 124026 154904 161521 58254 -54875 -9278 103041
16925 103041 3351 -47888 -83183 -104830 -174184 -214578 -215421 -286085 -250549 -194813 -107209 -93594
16913 -93594 -140429 -156983 -119712 -251946 -247123 -168510 -48528 -925 -2887 -64031 70320
16902G0320O4799j3257j26633k321j2502q1850m6262J96612m70O612o3643q3118
16890i1713k40k8387K2417L8557j4891l5016m1691K3704K061O0751m3067q1520
16878a89035m7019J09174J40647J46737m1538k00436L5920J08880j1163m7953
16868D214L9518n8013k4010M5965J5420O8845r5929K8297L7029O0725p9260l9568
16856C233l4017O1990P9898j02677l3389l2438m7059O1594J17102O9024J8666
16845A61927j34185j21833L6207J20001P8376l7929P1864n2162k19010q0922J7487
16834a60179K7063M528K3398L803J7248J14919K0160m6172K2773n2640o8298j10742
16822b04139o2178J02193n422j5431J7581n2988l9447M4289J7866L2669o1559
$$ plain form
16902 70320 135119 121862 -4771 -7092 -19594 -101444 -147706 48906 48436 55048 -8595 -91713
16890 -91713 -91953 -120340 -97923 -59366 -74257 -109273 -150964 -127260 -125199 -64448 -107515 -189035
16878 -189035 -236054 -126880 13767 160504 118966 -81470 -45550 63330 52167 4214
16868 4214 43732 -14281 -38291 7674 23094 91939 -3990 24307 61336 122061 42801 3233
16856 3233 -30784 31206 111104 8427 -24962 -57400 -104459 -42865 74237 143261 161927
16845 161927 27742 -94091 -57884 62117 140493 102564 174428 122266 -96744 -177666 -160179
16834 -160179 -133116 -128588 -105190 -101387 -84139 30780 50940 4768 27541 -25099 -93397 -204139
16822 -204139 -266317 -164124 -169546 -184977 -167396 -220384 -259831 -215542 -197676 -165007 -226566
16811b26566Q9093J23224l1346m9136q6688j68760J07753N4779q661O2897L201
16800a30210J00656L7428l9435k4006q9719l9713Q19Q577J33689m5747j38455
16789b26116k5469J41903J40805Q562L3933r6579j19729k9161k9937L8805J0673
16778a52310M8775Q870j2592o482Q0416L765j37865j8503L6137J18589K3670k4321
16766c1851n0552L5861M0534K6342Q4683n9908r3387Q026N3773k1405N3642O3381
16754A09139m3853k308o4886M9672n5313j2724M7602M0432l3952J2651Q0254p1005
16742E5709M7934r5665j30317o0033l5321J4282J45850N5363m6018L2134L3230
16731A7148P1416K9776o0158j678m7086m8426q7285k0959j38J6688m3131N515
$$ plain form
16811 -226566 -137473 -14249 -45595 -94731 -181419 -350179 -242426 -187647 -196308 -133411 -130210
16800 -130210 -29554 7874 -31561 -55567 -145286 -184999 -184180 -175603 -41914 -87661 -226116
16789 -226116 -251585 -109682 31123 39685 73618 -22961 -142690 -171851 -201788 -162983 -152310
16778 -152310 -103535 -94665 -107257 -113739 -33323 -29558 -167423 -185926 -149789 -31200 -7530 -31851
16766 -31851 -82403 -46542 -6008 20334 105017 45109 -48278 -40252 13521 -7884 45758 109139
16754 109139 65286 62978 -1908 47764 -7549 -20273 27329 67761 33809 46460 126714 55709
16742 55709 103643 7978 -122339 -182372 -217693 -203411 -57561 -2198 -48216 -16082 17148
16731 17148 88564 118340 58182 56504 9418 -39008 -126293 -147252 -147390 -130702 -173833 -168318
16719a68318K4409N3950L9297j60880l8635M9807R4928L2057r0785K6109K7741
16708a10320J9250q4698o517M5257L4990q6647l196J44211J33671O4946K2434
16697A73381N9276K9374m0734m1978n8321p6844j9488K2455L5342l7415j66273
16686a21225m3796O7247J28842O132J5523O1499m1957n0357J09717O642k3011
16675A15256j31813j89829j0805K3128J8929Q5769P0029M7066L1004Q3064n068
16664A36730r6481j03211r8818r643p2647l6132R3400N9661N0497N5385J32793
16653A11534J3043o9493J13253o2171j95754j2751J7046m076P5305P6677j22999
16642f0386p5400j33924l7702J02684N5989J2523n8908Q302r4827K0628N0103
$$ plain form
16719 -168318 -143909 -89959 -50662 -211542 -250177 -200370 -105442 -73385 -164170 -138061 -110320
16708 -110320 -91070 -175768 -182285 -137028 -102038 -188685 -191881 -47670 86001 150947 173381
16697 173381 232657 262031 221297 179319 120998 44154 24666 47121 82463 45048 -121225
16686 -121225 -165021 -97774 31068 37200 52723 114222 72265 21908 131625 138267 115256
16675 115256 -16557 -206386 -217191 -194063 -175134 -89365 -19336 27730 58734 141798 136730
16664 136730 40249 -62962 -161780 -171423 -244070 -280202 -186802 -127141 -76644 -21259 111534
16653 111534 124577 55084 168337 106166 -89588 -102339 -85293 -89369 -14064 62613 -60386
16642 -60386 -135786 -269710 -307412 -204728 -148739 -136216 -195124 -186822 -281649 -261021 -210918
16631b10918O6610l2052J2752j5104L9452q785J34873L5908K2480J1607Q5457
16620A42280N2945L3426j22773p3591n3975n7826J3052l1671J00863J18392O0923
16609A82045J5057j16350m3769P5021K05587l5342j13119q9473l079j07581l9055
16598g0058l4927L7893K4555J8192L8185N8985J11355O3857r3023l4024l9560
16587H1430k0855p6551j1410k5862Q106O31J21410j16692j7455Q7827K3592r3602
16575c9431N079o683n3236L5416p3111N8266J27416j3082K9166j9710q7774k24639
16563b62323j08429P8608K2925N5107J9059J37589J19467M7528j15138m8681M6059
16552h229O442J9472p4955Q8240j4028m2264j0635m5400j1148M0489M374J0192
$$ plain form
16631 -210918 -144308 -176360 -163608 -178712 -139260 -148045 -13172 22736 45216 56823 142280
16620 142280 195225 228651 105878 32287 -21688 -79514 -66462 -98133 2730 121122 182045
16609 182045 197102 80752 36983 112004 317591 282249 169130 79657 76578 -31003 -70058
16598 -70058 -104985 -67092 -42537 -24345 13840 72825 184180 248037 155014 120990 81430
16587 81430 60575 -15976 -27386 -53248 -45142 -44511 76899 -39793 -57248 30579 54171 -39431
16575 -39431 -34352 -41035 -94271 -58855 -131966 -73700 53716 40634 69800 50090 -37684 -262323
16563 -262323 -370752 -292144 -269219 -214112 -195053 -57464 62003 109531 -5607 -54288 -8229
16552 -8229 -1787 17685 -57270 30970 16942 -25322 -35957 -81357 -92505 -52016 -47642 -37450
16540c7450M7080k9238Q28O2166j05401j17769l7961n028R1440K1381q7712j7776
16528b15440K7550k0575j22565J4649R7124N3171J5034N5496K0882j30673K4680
16517a80667J60760K6346K5806K3914j0809Q5510n4402j8494j6807m6999n1991
16506e7833p7619q1594J21810N1774L6418J12702j00625N6235K5774m3211k8895
16495A4936q8553P9339N0432N4171R2448l433r1613j61262p7347M936P7323J228
16483d7395m1506Q2840L263j6952L74k7107o1785r6024m3498l596M7407J11536
16471i2443O0511J1527O096L5431j8802j4931J5141J15942L310m1033N2943j15046
16459A8646j18586n542l7019l0865o217J94060J29397p202j06644J784K9259R5000
$$ plain form
16540 -37450 9630 -19608 -18780 43386 -62015 -179784 -217745 -222773 -131333 -109952 -197664 -215440
16528 -215440 -187890 -208465 -331030 -316381 -219257 -166086 -151052 -95556 -74674 -205347 -180667
16517 -180667 -19907 6439 32245 56159 45350 130860 76458 57964 41157 -5842 -57833
16506 -57833 -135452 -217046 -95236 -43462 -7044 105658 5033 61268 87042 43831 14936
16495 14936 -73617 5722 56154 110325 202773 199340 107727 -53535 -130882 -125946 -48623 -47395
16483 -47395 -88901 -6061 -2798 -19750 -19376 -46483 -108268 -204292 -247790 -251386 -203979 -92443
16471 -92443 -31932 -20405 -14309 21122 2320 -12611 2530 118472 121782 80749 133692 18646
16459 18646 -99940 -105482 -142501 -173366 -179583 14477 143874 136672 30028 31812 61071 156071
16447A56071n6479m5991J26052j6627L5567P0057r8359j09870j4120p2994K8484
16436A791o7125N4190l9320j21555o9017k7436K4106R7467J63379K0088k7634
16425H934o5377j38418r139O5723Q5528R8655Q9351N3027q6501N005L2078j35012
16413C854p2786M843k2367k2221K128P7430j7322Q9966o5142q2723N7112M9096
16401A868R7885P8314M1793n154o7880j03355l670n0374L0880n57q3478R1383
16389B7655M519p119r9914p288k4442j24844J1870J70901R6931k7888j5978j11063
16377a06660J2979N9923N2463J3762J12542J6176p9143j11674P2019J05971k9837
16366A18521p8613j17937k0374M2578K2514n1307k386O0257L5312M748O5445J20071
$$ plain form
16447 156071 99592 53601 179653 163026 198593 268650 170291 60421 46301 -26693 1791
16436 1791 -65334 -11144 -50464 -172019 -241036 -268472 -244366 -146899 16480 36568 8934
16425 8934 -56443 -194861 -204000 -138277 -52749 45906 135257 188284 101783 106788 138866 3854
16413 3854 -68932 -64089 -86456 -108677 -106549 -29119 -46441 43525 -21617 -104340 -47228 1868
16401 1868 99753 178067 219860 214706 146826 43471 39801 -10573 20307 19750 -63728 27655
16389 27655 32174 25055 -74859 -82147 -106589 -231433 -219563 -48662 48269 20381 4403 -106660
16377 -106660 -93681 -33758 18705 32467 145009 161185 82042 -29632 42387 148358 118521
16366 118521 39908 -78029 -98403 -55825 -33311 -84618 -87004 -26747 8565 13313 78758 198829
16354A98829j19024j34745N8268J6246k1151M1045L9475o074j09987o2846J5869
16343h4095K7897J55430L3570K5803J41343j7272j22068j12266n5781r0343J3483
16332h4299j7393q1031J4229K4091J03440k8630R8470o4604o8888l9794J45876
16321A467Q2052M9135j4098k2151j15846k0803L6923j2071k6514M7864K8943P6973
16309A11874L0539K0427o3409l9990N6116J03580j22053o1215j1053l5548O773
16298c959M9898J4299q5188Q7619R0714L3471R858o3271r3601q3467O8558q458
16286A6473j27309L1874n4807l7170R2431o627K0654N9733J4043l7754j00416
16275a28875M6291J38904N2884J1235P7962k0651o0106n1001N6031o0700k22472
$$ plain form
16354 198829 79805 -54940 3328 19574 -1577 39468 78943 72869 -37118 -99964 -84095
16343 -84095 -56198 99232 132802 158605 299948 282676 160608 48342 -7439 -97782 -84299
16332 -84299 -101692 -182723 -168494 -144403 -40963 -69593 28877 -35727 -104615 -144409 1467
16321 1467 83519 132654 118556 96405 -19441 -40244 -3321 -15392 -41906 5958 34901 111874
16309 111874 142413 162840 99431 59441 115557 219137 97084 35869 24816 -10732 -3959
16298 -3959 45939 60238 -24950 62669 153383 186854 196712 133441 39840 -43627 24931 16473
16286 16473 -110836 -78962 -133769 -170939 -78508 -85135 -64481 -4748 9295 -28459 -128875
16275 -128875 -82584 56320 109204 120439 198401 177750 117644 66643 122674 61974 -160498
16264a60498j01585J07966J40970K536j08900n5861K02874P7430J3673r8833n3357
16253c3585k4465M2052k529J3595N2692j12342M79M3596r491R7723R7171j9123
16241A45773p7739l2988n0788j07025O7738J20943k1697p0334J07919J4026p6752
16230A9076n3297K2509j2103P6091J04374O1899K0595j8578j5023j3484o1200
16219A30859j70264k18232J13761R4219J1258K4587J25662p3297k1406K9688N1537
16208I8372R0716j9176M0879Q154j3935l4602r0274k6624r991p3877j077Q6645
16196E5210q647N1890p1230o6836J13856j12776r5324J30187J38655K9633N032
16185A69650j60210j48458J3115J07072k3099n798P2145m7771J48J3514j4043
$$ plain form
16264 -160498 -262083 -154117 -13147 -10611 -119511 -175372 27502 104932 118605 19772 -33585
16253 -33585 -58050 -15998 -18527 -4932 47760 -64582 -64103 -20507 -29998 67725 164896 145773
16241 145773 68034 35046 -15742 -122767 -55029 65914 44217 -26117 81802 95828 19076
16230 19076 -34221 -11712 -23815 52276 156650 218549 239144 220566 205543 192059 130859
16219 130859 -39405 -257637 -143876 -49657 -38399 -13812 111850 38553 17147 46835 98372
16208 98372 189088 169912 210791 218945 205010 170408 80134 53510 43519 -30358 -31435 55210
16196 55210 46563 98453 27223 -39613 74243 -38533 -133857 -3670 134985 164618 169650
16185 169650 9440 -139018 -125903 -18831 -41930 -47728 24417 -23354 -23206 -9692 -23735
16174b3735L5287L4774M3515R0307k5062j07077o0811j00769K0583J18246N4028
16163G9286j3842K68j8359j23526j60049R3795J51729O5027K1033O82j5225o4367
16151A6452J02358n1999L0397m6331p9537p0379M9763K5974p2731j6138O9218
16140d2953m9703J7174M0624K9216j8756o8335m1454n820P5117r687r557J2101
16128g2033r9491K6809p110j3725N1437P4661O361j25701j6420Q6994O0559k7288
16116e4947n6227k6240L7208Q8040P1514J7052R7399J4069k1349m0558j29078
16105c117q2270j5909J9821o2595j4097l2396K4237J76472P8027K3356m5738j9492
16093D6299j8452M9315K3063k9288p7626j17487p0519R9259K9853Q6876N5953
$$ plain form
16174 -23735 11552 46326 89841 180148 155086 48009 -12802 -113571 -92988 25258 79286
16163 79286 65444 65712 47353 -76173 -236222 -142427 9302 74329 95362 96044 80819 16452
16151 16452 118810 66811 97208 50877 -28660 -99039 -49276 -23302 -96033 -112171 -42953
16140 -42953 -92656 -75482 -34858 -5642 -24398 -92733 -134187 -140007 -64890 -74577 -84134 -72033
16128 -72033 -171524 -144715 -151825 -165550 -114113 -39452 -33091 -158792 -175212 -88218 -27659 -54947
16116 -54947 -111174 -137414 -100206 -12166 59348 76400 173799 187868 166519 125961 -3117
16105 -3117 -85387 -101296 -81475 -144070 -158167 -190563 -166326 10146 88173 111529 65791 46299
16093 46299 27847 77162 100225 70937 -6689 -124176 -194695 -95436 -65583 21293 77246
16082G7246p3547N1980j16786j04335J5350L548O7806J57183P0769j05136o429
16071C7649J04361N4126j3227J122j04561j28649l0882j31666K2065J15594K9959
16060d4109k6454m2997N4635K4843M7061m5061n8352k3152N0743J06006M8355
16049I1518J5957n6759j11336r6369L0288N0903J74389J66286O4277p4011k01661
16038E3482L2275K3235J5590L2993k786q3232n0950N5985n294k773P1918n6683
16026H3760k05138o6912M954J09857O7336n3014n8027q661k6179N057P6139J6990
16014e3838j6071O2213O5962m500K2563J06164J3942r225m4277l2953N6941K8417
16002A95338j7466l2910P67l8036p985n4696J862M428n2900P76k2125k9552L6364
$$ plain form
16082 77246 3699 55679 -61107 -165442 -150092 -146544 -78738 78445 149214 44078 37649
16071 37649 142010 196136 182909 184031 79470 -49179 -80061 -211727 -189662 -74068 -44109
16060 -44109 -70563 -113560 -58925 -34082 12979 -32082 -90434 -113586 -62843 43163 91518
16049 91518 107475 50716 -60620 -156989 -126701 -75798 98591 264877 329154 255143 53482
16038 53482 85757 108992 124582 157575 154789 71557 20607 76592 71298 68525 140443 83760
16026 83760 -121378 -188290 -183336 -73479 -6143 -59157 -117184 -125845 -152024 -146967 -70828 -53838
16014 -53838 -69909 -7696 58266 53766 76329 182493 196435 187210 142933 109980 166921 195338
16002 195338 177872 144962 145729 107693 99708 45012 46874 51302 -1598 -822 -22947 -52499 -16135
15989a6135o4516K229J86230K813o1906N3280L2120l7695o5390J2578r4574k3121
15977g4087K4125j7471J30552J01809k8817j42265j7604M6692k9023J0350P0372
15966G4633J880j34800n5449K9090Q4440L3162p3931j2535K4036O7571J09597
15955A47694K1349L4604N4855q6779m7876K0605m9454J6806m6327O4569P5364
15944B05410j09406j71098P6197k3126O6727K8648N416o4842K0227r338k6618
15933a803l5439l3795O2560L7330O8175K7481n0409l5085j59201j05014J3225
15922b11975J07111l2415m5047K1257N1522P4582J0140L9853l7900M7351q6453
15911f1974j20188N7880L6589P7886L4955p4451n704L0811P0788K1536r7550j04968
$$ plain form
15989 -16135 -80651 -78422 107808 110621 48715 101995 134115 96420 31030 43608 -50966 -74087
15977 -74087 -49962 -67433 63119 164928 136111 -6154 -23758 22934 -6089 4261 74633
15966 74633 76513 -58287 -113736 -84646 -206 32956 -40975 -53510 -29474 38097 147694
15955 147694 169043 203647 258502 171723 123847 144452 94998 111804 65477 130046 205410
15944 205410 96004 -75094 1103 -22023 44704 73352 78768 13926 34153 24815 -1803
15933 -1803 -37242 -71037 -8477 28853 97028 124509 74100 39015 -120186 -225200 -211975
15922 -211975 -104864 -137279 -182326 -161069 -109547 -34965 -24825 15028 -22872 24479 -61974
15911 -61974 -182162 -124282 -87693 -9807 25148 -49303 -55007 -24196 46592 68128 -29422 -134390
15899a34390m1910k7379J6430K1332J4457Q848j5973R5944M0512o6812q0362k5287
15887a94590o922m9447J6376P0739J23237L7743o0630k0099O2706J32422o7880
15876D3655J7752n2360o3330k5290r56K8327l2295K1708r0342J13390J06592j59481
15864i2630o8827L5326J89768J3281n1958R7914o8808J7706k9844j51793L0506
15853g9359j0562Q4268p7429n8215L2508O3663P0756L3689k324k4364M0856J08248
15841A81735l9077j71199q4547k0446M272j8062m363J03313J19137J40764o7104
15830A44423R4613j28554k10866o6259M7518L5343K3839J16059P0565n4820j43384
15819g1523R1281O2654n4599q4107J7440O9556N8964N9695O6276k1845j04564
$$ plain form
15899 -134390 -176300 -203679 -187249 -165917 -151460 -142612 -158585 -62641 -22129 -88941 -169303 -194590
15887 -194590 -201512 -250959 -234583 -163844 -40607 -2864 -63494 -83593 -20887 111535 43655
15876 43655 61407 9047 -54283 -79573 -80529 -52202 -84497 -62789 -153131 -39741 66851 -92630
15864 -92630 -161457 -126131 63637 76918 24960 122874 54066 71772 41928 -109865 -79359
15853 -79359 -89921 -5653 -83082 -141297 -108789 -45126 25630 59319 56995 32631 73487 181735
15841 181735 142658 -28541 -113088 -133534 -129262 -147324 -151687 -48374 70763 211527 144423
15830 144423 239036 110482 -100384 -166643 -119125 -83782 -59943 56116 126681 71861 -71523
15819 -71523 19758 82412 27813 -56294 -38854 30702 89666 149361 215637 193792 89228
15808H9228m2672o8201o1191l1784j7663P0067k6240J37333N318l1578M1768M6847
15796A11232p0006r8283k4287J55621N5417m011q7844n2816J77082k608q3428
15785G6069K9008m6120j34979m8960N4699L1950R8900O8237P0610q5086j64665
15774e0337l1572j177j644r2460N8029K03161J15743l3865r2649k0951N7825p3531
15762C6572J6462k3208o5124k156J0162j7581L7204m1324Q391q2272l0782P2584
15750h1072l4906j35692q7505K58479N9631j0990r196M3934l4459o8948k9719
15739a30443M0751J36838m0488o3157K6627J32417N8875n9516l4515l1000n6772
15728b0383j05024J0889K3176j8681L9948K6541K7990R9219L1485m8429k1145
$$ plain form
15808 89228 46556 -21645 -82836 -114620 -132283 -62216 -88456 48877 54195 22617 64385 111232
15796 111232 41226 -57057 -81344 74277 129694 125683 37839 -14977 162105 159497 76069
15785 76069 105077 58957 -76022 -124982 -70283 -38333 60567 128804 199414 114328 -50337
15774 -50337 -81909 -83086 -84730 -177190 -119161 84000 199743 165878 73229 52278 110103 36572
15762 36572 53034 29826 -35298 -37454 -27292 -44873 -7669 -48993 -40602 -122874 -153656 -81072
15750 -81072 -115978 -251670 -339175 -80696 -21065 -32055 -41251 2683 -31776 -100724 -130443
15739 -130443 -89692 47146 6658 -56499 -29872 102545 161420 101904 67389 36389 -20383
15728 -20383 -125407 -114518 -91342 -110023 -70075 -43534 -15544 83675 115160 66731 45586
15717D5586l7816j2584n684L2308m4986o5498K7992J13312K8792o3771j2700M6165
15705E1116R6778J05753j2320j17447o2956j01901J20418P7236j00398m1375o2291
15694d7387O1548L3039m917J46336R4797j3080n7832r8396r7473J0235m19J1734
15682C8185q7326k9930p250J2801J00597l5064r881J27560M651K3530N450m8352
15670I4971j97550j13046L9863K715k7164K9740R2611K5496n2012M5112l1124
15659i0388l8850k3901K14000L9310o2752k3420n9515l4727n851J25302k816p7969
15647d1577Q8799J9224P8934N0051j05260L524n8853n1128K6707m4767n6735n333
15635i6414K584J43170Q2495p9319q4860q1255r40K1859O5387K8756L0625m7739
$$ plain form
15717 45586 7770 -4814 -10498 21810 -23176 -88674 -60682 52630 81422 17651 4951 51116
15705 51116 147894 253647 241327 123880 60924 -40977 79441 156677 56279 14904 -47387
15694 -47387 14161 47200 42283 188619 283416 270336 212504 114108 16635 26870 26451 38185
15682 38185 -49141 -79071 -86321 -73520 27077 -7987 -17868 109692 114343 137873 143323 94971
15670 94971 -102579 -215625 -175762 -173047 -200211 -170471 -77860 -52364 -104376 -59264 -90388
15659 -90388 -129238 -153139 60861 100171 37419 13999 -45516 -80243 -86094 39208 36392 -41577
15647 -41577 47222 66446 145380 195431 90171 93695 34842 -16286 10421 -34346 -91081 -96414
15635 -96414 -93830 49340 131835 52516 -32344 -113599 -114539 -92680 -27293 1463 32088 -15651
15623a5651O7117R8191J7413o851k3832p523J8710n4617j05024O4224J49280l2379
15611A69058m1618r1135m6613N4691P8980k1035j03510R5450l8874O240M3730
15600A05364l0091j5243R7362l267j29M8210m6213j6205j4230P1147L3903p0408
15588A60200j30749K718r3669o1327N4931L7052O6297R4775m1332j4413O8331
15577A42814M7351o829o8496n6167Q5860Q3584J6918k00332m4254q245k5645K4055
15565i386m8924j32695L5198M4861j2856q767J18380J77567O7871j11278j48602
15554b8631m2380J45167J82434J11506p5609j47280p0746k6682N0841J38235M0394
15543B77249l7023K7540k5576j61505l9416J2942j5525R8244o1000n8346Q738
$$ plain form
15623 -15651 51466 149657 167070 160219 136387 128864 147574 92957 -12067 52157 201437 169058
15611 169058 127440 36305 -10308 44383 123363 102328 -1182 94268 55394 61634 105364
15600 105364 75273 60030 157392 154125 153996 202206 155993 139788 125558 196705 230608 160200
15588 160200 29451 32169 -61500 -122827 -67896 -30844 35453 130228 88896 74483 142814
15577 142814 190165 183336 114840 58673 144533 228117 245035 44703 449 -7796 -33441 -9386
15565 -9386 -58310 -191005 -155807 -110946 -123802 -132569 -14189 163378 231249 119971 -28631
15554 -28631 -71011 74156 256590 368096 292487 145207 74461 47779 98620 236855 277249
15543 277249 240226 267766 242190 80685 41269 54211 38686 136930 75930 17584 26322
15532B6322Q8128N2070J8924q9933K654p6399n4577L9695J30979q3290N056m4528
15520A5101j4797o2418L1634l2802j18334J3734J02708J16500K6561K4073p426
15509I4534n2971K9199L481M4226q270q026p1319o9390m4417Q5324J6792N0038
15497F9201K3369k6031N101j45k890n714R016M0300j8281j66671n8251M8046M4423
15484c8527j3639N1673J13004N4292j19018j47264K9993O4411J07035r9195k5480
15473b2715M6900n7519P688M190O4543O6248R767L3898q7005o7644N8421j00737
15461d3965k184R1903R8469K616l7481M8120m1321p5622J19010o5700k38115q7057
15449b31327L1410R7097m8697m2801J5068k6688M9557J63121K2459j7633N5712
$$ plain form
15532 26322 114450 166520 185444 95511 98165 21766 -32811 6884 137863 54573 59629 15101
15520 15101 304 -62114 -30480 -63282 -181616 -167882 -65174 51326 77887 101960 94534
15509 94534 41563 70762 74243 118469 110199 102173 30854 -38536 -82953 2371 19163 69201
15497 69201 92570 66539 71640 71495 68605 62891 71907 112207 93926 -72745 -130996 -82950 -38527
15484 -38527 -52166 -493 112511 166803 47785 -99479 -69486 -5075 101960 2765 -22715
15473 -22715 24185 -33334 -25646 -21456 43087 109335 119102 153000 65995 -1649 56772 -43965
15461 -43965 -46149 45754 144223 146839 109358 157478 116157 40535 159545 93845 -144270 -231327
15449 -231327 -199917 -102820 -151517 -194318 -179250 -205938 -156381 6740 29199 11566 67278
15438F7278K672p3144j00276j2831Q134K2584r7552p9327P9443o385j5625J5267
15426a89762m1412O8918J32060Q4415m8681K3893L0006l6468q0982K2568K2145
15415a3300N5170j668J18390j118j12399j9557Q207O1419R0226L4935P0606k7583
15403B63328n606p4411j15504o0546j5949k029L8249M0114o046J3388O5097q4761
15391E5324r1845m8712k045k4070o8222k6878Q4814m1018N7755m5561m1709j3013
15379b05180K9930N1419n0478P2703R9170J96860M432l6249j22171k6483O2301
15368G6254J08409J2105J0374Q1689N659r6407j17112K699m2767o6596M9234n9559
15356c6018j08746Q828O387P4058K4869Q405R5163O5672j0077k393N72J0301J26113
$$ plain form
15438 67278 69950 -3194 -103470 -116301 -108167 -85583 -183135 -262462 -183019 -189404 -205029 -189762
15426 -189762 -231174 -162256 -30196 54219 5538 29431 59437 22969 -58013 -35445 -13300
15415 -13300 41870 40202 158592 157474 45075 25518 33725 95144 185370 220305 290911 263328
15403 263328 257722 183311 67807 7261 -8688 -10717 27532 67646 61600 74988 140085 55324
15391 55324 -36521 -85233 -87278 -111348 -179570 -206448 -121634 -162652 -104897 -150458 -192167 -205180
15379 -205180 -175250 -123831 -174309 -101606 -2436 194424 198856 162607 40436 13953 76254
15368 76254 184663 196768 207142 288831 294490 198083 80971 83670 40903 -25693 23541 -36018
15356 -36018 -144764 -135936 -129549 -55491 -30622 -22217 72946 138618 128541 126148 126720 137021 263134
15343B63134k6719J4061L9384o7941n7482n1248L9775r6645Q8930N5480M5374
15332B46103K1548o2258j49220k4554l4841o5236M8301N7744J18025N6487M0720
15321B52819m1534l6451o4788K6761m8420k9247M765q8950J0148j10334O1870
15310f3361L3803n9955L6721K9537r1004r9611n2469j3051J00671J52716J10626
15299H4623j4879j0771o282p2315J4794K595k3090J20994J06411R742L1562n4556
15287A88828o9494k5468r0267m9839J7344Q7140N6046j855l8801L5490R679o3650
15275E5153j12161m8247l2912J01420R2858K3149j0717j0284M7547j2043j49335
15264e5572m5433R1181N067p54O5210N8874j26688q3000Q1453R0332n7626n579
$$ plain form
15343 263134 236415 250476 289860 221919 164437 113189 152964 56319 145249 200729 246103
15332 246103 267651 205393 56173 31619 -3222 -68458 -20157 37587 155612 212099 252819
15321 252819 211285 174834 110046 136807 88387 59140 63905 -25045 -14897 -125231 -63361
15310 -63361 -29558 -89513 -52792 -23255 -114259 -213870 -266339 -279390 -178719 -26003 84623
15299 84623 69744 58973 52691 -19624 -4830 -2235 -25325 95669 202080 211822 243384 188828
15287 188828 119334 93866 3599 -46240 -28896 58244 114290 112435 73634 109124 118803 55153
15275 55153 -57008 -105255 -138167 -36747 56111 79260 68543 58259 105806 93763 -55572
15264 -55572 -101005 -9824 -4757 -5511 59699 118573 -8115 -91115 -9662 80670 23044 17465
15252A7465j281P547j17313o93J61797P6902p1970m5769j0440k0917m8298o6629
15240a19599l4107k0114k2064M2872J47185M9089K4923K8323p3039j59065L586
15229a32010R8077P0208K5773j28187P9502N4419k2809j13432r1650Q8943M9609
15218b1557L4429J4954k9184L8599L7149J1185j07423q2122m4141P5706J06263
15207C3858o174p5715L4543O2964J069j0971M0273k5455R0406K9351k3565l9480
15195A11104l8589k1334l4630k8043J2175Q6084K8216j17656j04917L6079j65977
15184b37488J01346L3326J2362l1132l5594M7427J62407j3808l7917l4303M5812
15173A2438O3053r5918j03936j01297L1846J60268O9202K0262p2449K2832O5971
$$ plain form
15252 17465 16184 23731 -93582 -94275 67522 144424 72454 26685 16245 -4672 -52970 -119599
15240 -119599 -153706 -173820 -195884 -153012 -5827 43262 68185 96508 23469 -135596 -132010
15229 -132010 -33933 36275 62048 -66139 13363 67782 44973 -68459 -160109 -71166 -21557
15218 -21557 12872 27826 -1358 37241 74390 85575 -21848 -103970 -148111 -72405 33858
15207 33858 27684 -48031 -13488 49476 50545 39574 79847 54392 144798 174149 150584 111104
15195 111104 72515 51181 16551 -11492 683 86767 114983 -2673 -107590 -71511 -237488
15184 -237488 -136142 -102816 -90454 -121586 -157180 -109753 52654 38846 929 -33374 12438
15173 12438 75491 -20427 -124363 -225660 -193814 -33546 35656 55918 -16531 6301 72272
15162G2272k36O1721m6605k15134o9047J50462N9958k3738O0323K6179K8489j30652
15150b6008l0214N2626J09453P3373j34561n3634P8055j1514k9021L398k5304
15139F649m1025L6986J2186M0224o1866r1375Q9777N9327R5755k0339j14408K0323
15127C2214J09622O7914p711j21212l1917j23514q4386M7986M1560k8378J5199
15116h2623N5132K6883n5204M9471P4509M2407M5478m2357j0479K7837P3759q0588
15104A24225p4213j90329j52916J36830L2814K1640M9119J21418o6786l2036N7355
15093B7121n178j6966J78j2899j25464M3738P9878o6978o2794Q7841Q1192k3785
15081E884L2169n1585j23813k510Q120L7094p3317P961j9281K4235R5876R5958
$$ plain form
15162 72272 72036 133757 87152 -127982 -197029 -46567 13391 -10347 49976 76155 104644 -26008
15150 -26008 -56222 -3596 105857 179230 44669 -8965 69090 57576 28555 31953 6649
15139 6649 -34376 2610 14796 55020 -6846 -98221 -8444 50883 146638 126299 11891 32214
15127 32214 141836 209750 202039 80827 48910 -74604 -158990 -111004 -69444 -97822 -82623
15116 -82623 -27491 -608 -55812 -6341 68168 110575 156053 113696 103217 131054 204813 124225
15104 124225 50012 -140317 -293233 -156403 -123589 -101949 -52830 68588 1802 -30234 27121
15093 27121 21943 4977 5155 -7744 -133208 -89470 -9592 -76570 -139364 -51523 29669 5884
15081 5884 38053 -13532 -137345 -139855 -131735 -94641 -167958 -159997 -179278 -155043 -59167 36791
15069C6791r292q6706J10708j797o3167n3031N1631L7332M6072o8716l6655j4879
15057e1709R1550L7232j7706p1672k4448J26959L9770o1643j3686N256k3724J6337
15045E2516J8821O0084m7721p1296L575K7829k7281O8553M2787o8340l0p2173
15033a2676r2328L8867J47288J33028K1140k8146j33971n6008l034j9105Q9369
15022H4424k959Q2081J6248j2085p3853Q4315o4332q2171J35587Q5726j561M1839
15010B93259m0437r5238J21243R0551J11580K30752L88869L46845K07161M0353
15000A694938j53845k66304k65873j90623l40197k19468N1545L9591J9402n6162
14990C13004o8213r3272l6675P5391J12923j142j83562j67170J1611M5333L0972
$$ plain form
15069 36791 27499 -59207 51501 49704 -13463 -66494 -14863 22469 68541 -175 -36830 -51709
15057 -51709 39841 77073 59367 -12305 -36753 90206 129976 68333 54647 59903 36179 52516
15045 52516 71337 131421 83700 12404 15979 43808 16527 85080 127867 59527 59497 -12676
15033 -12676 -105004 -66137 81151 214179 235319 207173 73202 17194 14160 -4945 84424
15022 84424 81465 163546 179794 167709 93856 178171 113839 31668 167255 252981 251420 293259
15010 293259 252822 157584 278827 369378 480958 711710 1100579 1447424 1654585 1694938
15000 1694938 1541093 1274789 1008916 818293 478096 258628 310173 349764 369166 313004
14990 313004 244791 151519 114844 190235 303158 302016 118454 -48716 -37105 8228 39200
14979C9200N5009M4032j33251m6060k8358P4341K2743j8914J3591p255j8387O9718
14967F6409o863J1055M6151J4913j27661j65530l7666P0331L2612K5265J7328
14956e3656J04122l5444j2118k4680O7476p6214P3395J84172O2335j25788n1952
14945A11648o4926l6413Q3209J7560J5919j8186j08141j5644J4837q075N0513
14934D2301k6449p4230R707N5311j857n6705O1104l7205j0508N9387j4367j6963
14922a0474J4666j2780M9124J12316o4656O6759n2933j15892L715O8451P0038
14911A28334p8801m4325n8631K1961J0149j13137n4056l994j5171L1781O2688
14900a13202p8172J603k5448n477K7977J41281M4967L1277N7569j06296j3899
$$ plain form
14979 39200 94209 138241 4990 -41070 -69428 4913 27656 8742 22333 15078 -3309 66409
14967 66409 59546 70601 116752 131665 4004 -161526 -199192 -128861 -96249 -70984 -53656
14956 -53656 50466 15022 2904 -21776 45700 -30514 42881 227053 289388 163600 111648
14945 111648 46722 10309 93518 111078 126997 108811 670 -14974 -137 -8212 42301
14934 42301 15852 -58378 -48671 6640 4783 -51922 9182 -28023 -38531 20856 6489 -10474
14922 -10474 4192 -8588 40536 152852 88196 154955 102022 -13870 -10155 58296 128334
14911 128334 49533 5208 -53423 -31462 -21313 -134450 -188506 -192500 -207671 -175890 -113202
14900 -113202 -191374 -189771 -215219 -220696 -192719 -51438 -6471 24806 82375 -23921 -37820
14889c7820l701o3049j6358R0943N0344j10630o7889L0525J47398K17044J18905
14878C55712o6085m4727q8424j06166O905M3484K0956m0671L3610j11594k5456
14867b2456J8514r3307l6003J31683q5815m7285n0985R6861k3062J4300K5066
14856g2489Q4991L0759L9037m6729q7697R6219q4065q8071O6136R5119j30240
14845i7030r1843n8907R0101P6687L75K4615J605J1081K4352P9836l0514n5233
14833b4875Q7170j9136j00766j4391j6258O3519m4589p1552N3391P3961m6864
14822f0390P6009O9858o2459r3325q9792k2631J04103k6089m6539J3563R6986
14811d0706K6505R708m4073j81089K5518P5733J60903j5580j03783Q5664P0116
$$ plain form
14889 -37820 -41521 -104570 -120928 -29985 20359 -90271 -158160 -127635 19763 236807 355712
14878 355712 289627 244900 156476 50310 57215 100699 121655 80984 114594 3000 -22456
14867 -22456 -3942 -97249 -133252 -1569 -87384 -134669 -185654 -88793 -111855 -97555 -72489
14856 -72489 12502 43261 82298 35569 -52128 44091 -39974 -128045 -61909 33210 -97030
14845 -97030 -188873 -247780 -157679 -80992 -80617 -56002 -54397 -43316 -18964 60872 30358 -24875
14833 -24875 62295 43159 -57607 -71998 -88256 -24737 -69326 -140878 -87487 -13526 -60390
14822 -60390 15619 85477 23018 -70307 -160099 -182730 -78627 -104716 -151255 -137692 -40706
14811 -40706 -14201 -4493 -48566 -229655 -204137 -128404 32499 16919 -86864 -1200 68916
14800F8916J28114N1101P048p6987r6870r0219P0569m112O565J9066m4306q3024
14788d4139n061j4856j04949J17088R9972J3062K0607j2883N4730Q0151l6962
14777A66760R285N1559K3934j21734j61974j05000Q356K8151k6299Q0246R9262
14766E2546k567o1694J47896o141j8254J27473p116k5413j02443L8815j6527p459
14754A19116N8187j47868j36983l4368M541O9194Q469j6154R7999n5555K5224
14743h198M4734q5222m1271L1424J19483j3158l6491J9171O9119q8708k9908l3795
14731e2820l1437O0418O6892j00436P4007R2881l6498O3886O161p7824L7075j51274
14719d8969j11904J37022K19622l0403p3659R2204k4019q1597K8455M9829J536
$$ plain form
14800 68916 197030 248131 255179 178192 81322 -8897 61672 57560 64125 83191 38885 -44139
14788 -44139 -49200 -64056 -169005 -51917 48055 61117 81724 68841 123571 203722 166760
14777 166760 176045 227604 251538 129804 -32170 -137170 -128814 -100663 -126962 -46716 52546
14766 52546 49979 -11715 136181 130040 111786 239259 232143 206730 104287 143102 126575 119116
14754 119116 177303 29435 -107548 -141916 -137375 -68181 -59712 -75866 22133 -33422 -8198
14743 -8198 36536 -48686 -89957 -58533 60950 47792 11301 30472 99591 10883 -19025 -52820
14731 -52820 -84257 -23839 43053 -57383 16624 109505 73007 136893 143054 65230 102305 -48969
14719 -48969 -160873 -23851 195771 165368 91709 183913 159894 78297 106752 156581 158117
14708A58117k1052l6084r3535j1396M981l2448k9063M1981L9571M5216R5977O2755
14696B25020j15034j73979j249J0660O0183m1063l6092R6298J19644J17957k7721
14685B34624p5014l1431p9031k7238N1074l933r7557j6547N9851K0575K5693P9705
14673A40771j8242m4462k3830m1117J099J12491k6966j07728j3627j45326q1651
14662b48588P1816K3591k781n8432J4546J51992J0712j36164P5160J51185J02134
14651A55171q5124M2563J6824m4066q8174M355O9373p356j8200k1017J05501M7501
14639A77351Q137j70192K0539o8268L5143j6743j577J09887m0746j1003l5740
14628F788P2216N5861p1156q2300n2362m6755L9017R3560k0172j05153j08918
$$ plain form
14708 158117 137065 100981 7446 -3950 1031 -31417 -60480 -18499 21072 66288 162265 225020
14696 225020 109986 -63993 -65242 -54582 5601 -35462 -71554 24744 144388 262345 234624
14685 234624 159610 128179 49148 21910 72984 69051 -28506 -45053 14798 35373 61066 140771
14673 140771 122529 78067 54237 13120 14219 126710 99744 -7984 -21611 -166937 -248588
14662 -248588 -176772 -153181 -155962 -214394 -199848 -47856 -37144 -173308 -98148 53037 155171
14651 155171 70047 112610 129434 85368 -2806 1549 70922 63566 45366 24349 129850 177351
14639 177351 185488 15296 35835 -32433 2710 -14033 -15610 94277 53531 42528 6788
14628 6788 79004 134865 63709 -18591 -70953 -117708 -78691 14869 -5303 -110456 -219374
14617b19374N9538K26160j3824k4905M0215J1169J571j18352L9747n2113J2679
14606c7489Q8066J4054P4580K9201j00529J00513k5889j37121j06168N3716Q112
14595c8954l4482j5596K4634l228Q864K7075N9318M129K4495J624k8995o2310
14583c3426m5203J2712O0037L0131n3647L2986P4128r0747J056Q8898L9444J7532
14571A33901m814P7781J2759q678J2358p7171q1354q098O5815r175k1657l5717
14559E5950O512m8780j31111N3989k5496o7544R8698J17680O72j13858k588K9370
14547b6506l2153J1868L4738L9656m9957q8529k9885m7731m0455m0157Q2472q3475
14535b70114K9458P8405j0745J4717l7166N4283K22504J08209J6716q0517o7394
$$ plain form
14617 -219374 -159836 66324 52500 27595 67810 78979 80550 -37802 1945 -50168 -37489
14606 -37489 50577 64631 139211 168412 67883 168396 142507 5386 -100782 -47066 -38954
14595 -38954 -73436 -89032 -64398 -67626 -58762 -31687 27631 31760 56255 57879 28884 -33426
14583 -33426 -78629 -65917 -5880 24251 -29396 3590 77718 -13029 -11973 76925 116369 133901
14571 133901 129087 206868 219627 210949 223307 146136 64782 56684 122499 113324 91667 55950
14559 55950 62462 13682 -117429 -63440 -88936 -156480 -57782 59898 60570 -53288 -55876 -26506
14547 -26506 -58659 -46791 -12053 27603 -22354 -110883 -140768 -188499 -228954 -269111 -186639 -270114
14535 -270114 -240656 -162251 -172996 -158279 -195445 -141162 81342 189551 206267 125750 58356
14524E8356J4963L0930N1883N8993k9830M5071j5636j8625o1120p268l1245k7972
14512F8500K7248p5985m0431O3467m8823m3708j4369n03J4545J14890K0245m412
14500H0664K9986J7622o3059p0494k2733L9203M1951m2058l0585R136j858J9689
14488G464r9631l5708J27842p1457q6492q9097O1146l4133L0989R558O8672J25296
14476A4449M6601r7706k3010J363J819P1788P1377L6253l8628R734j31409k1631
14464e9000N6268M4413N2639N127K4879k6344n6228J6935N4003j06224r8900r7005
14452a89437o2145J26996J63559j1178o2243k296J97167k6259j2212P5585J5081
14441B12618j36602j185R6186m7503R661r4669k5216J02141k626m1111L3377N4132
$$ plain form
14524 58356 73319 104249 156132 215125 185295 230366 214730 196105 134985 127717 96472 68500
14512 68500 95748 19763 -20668 42799 -6024 -49732 -64101 -64604 -50059 64831 85076 80664
14500 80664 110650 128272 65213 -5281 -28014 11189 53140 11082 -19503 -10367 -12225 7464
14488 7464 -92167 -127875 -33 -71490 -157982 -247079 -185933 -220066 -189077 -179519 -110847 14449
14476 14449 61050 -36656 -59666 -58303 -56484 15304 86681 122934 84306 94040 -37369 -59000
14464 -59000 -2732 41681 94320 99447 124326 97982 41754 58689 112692 6468 -92432 -189437
14452 -189437 -251582 -124586 38973 27795 -34448 -36744 160423 134164 121952 197537 212618
14441 212618 76016 74831 171017 123514 133175 38506 13290 115431 112805 71694 105071 159203
14429A59203k5476m4915m4768M0977K5510q3091O2927l6063n2884J28327N7812
14418A87559Q160l0635m3308j11841q4977j4898k8379J2147P0888j0545J3047
14407c2782L3291K9420n1446O3785k9510j9207m3332K5853J73995J40398n0503
14396B39962j23763J2425n2973k3373j11295R7472P949o7170n907n7737n2505
14385a36915Q9913L0711M5675j5721j11476K542J63939J24681r0777j45391M0476
14374b343O4422P0212r0696o9095j26773M1920K9506N3731o173k9557N5036j4588
14362b4398j2985P1126N0840K683r4719l412k8713J28532l1814L5069R0311N9853
14350B42373k2934k9959j1635j5267j02833K6865m2462m3524o6873J5670o3653
$$ plain form
14429 159203 133727 88812 44044 85021 110531 27440 90367 54304 1420 129747 187559
14418 187559 195719 165084 121776 9935 -75042 -89940 -118319 -106172 -35284 -45829 -32782
14407 -32782 509 29929 -21517 42268 12758 -6449 -49781 -23928 150067 290465 239962
14396 239962 116199 128624 75651 52278 -59017 38455 46404 -20766 -26673 -84410 -136915
14385 -136915 -47002 -16291 29384 13663 -97813 -95271 68668 193349 102572 -42819 -2343
14374 -2343 62079 132291 41595 -27500 -154273 -112353 -82847 -29116 -35289 -64846 -9810 -24398
14362 -24398 -37383 33743 84583 87266 -7453 -10865 -39578 88954 57140 92209 182520 242373
14350 242373 219439 189480 177845 162578 59745 86610 44148 624 -66249 -50579 -114232
14339a14232N5170K6662n5772N3372J49382p2708j74336L280l3413M092N0917
14328a07586K8145m761k6374J2618L6392m6334R8933M7707j3313l2909L9538o7193
14316c5137j00655k7328L3977P7553J35505J9952J7707J6158j16258p8712p9029
14305a36267M5530J28065O8446Q7690J10170q053j19946k63835r133L1767O7839
14294B273J06555m0612N225K9302N4815l054m5224j1287q1809p1367l6802J30409
14282C8424M5977m237k0671M1347m7279k9604j3054K5864J90434o8585j63626
14271e010k4691O8444r9051j03126Q3915J9449M9502J53184K8621l6656k6354
14260A08227P3212k8646p8624M5938K1390k7909J4624j7616L7917q6723k39099
$$ plain form
14339 -114232 -59062 -32400 -88172 -34800 114582 41874 -132462 -129182 -162595 -158503 -107586
14328 -107586 -79441 -84202 -110576 -97958 -61566 -107900 -8967 38740 25427 -7482 32056 -35137
14316 -35137 -135792 -163120 -129143 -51590 83915 103867 121574 137732 21474 -57238 -136267
14305 -136267 -90737 37328 105774 193464 303634 295581 175635 -88200 -97333 -65566 2273
14294 2273 108828 68216 73441 102743 157558 154504 109280 97993 16184 -55183 -91985 38424
14282 38424 84401 80164 59493 100840 53561 23957 10903 36767 227201 158616 -5010
14271 -5010 -29701 38743 -60308 -163434 -79519 -60070 -10568 142616 171237 134581 108227
14260 108227 181439 152793 74169 120107 141497 113588 128212 110596 148513 61790 -177309
14249a77309j7881Q016J07830J21836J08025M0633k4149j856j16400r1464p2266
14238a14985l6455p9791O1061J25147R4147r4449L8180M6843K4694O5530m2482
14227H7440p6257j32934n1733O7952k3361N3484N4772N8698N4353p5824O1463
14216G8053P6572j13999r8631J30025Q1040J482j42897j93946O6731Q8132k8922
14205e6360J50842J56576m4163r5277q2167L3223L7110m070J5067L7972q4073
14194F4680o8326J788q242J12787j4535p9382M8687m8863n0634Q333j638q8487
14182a23832N6951j0942L1056R3620J06049l572k9722n0486k0941o4899L773m4968
14170e7913L8996P1640J3548j10026M838J7161p8598j54766K556p4632m9301J63932
$$ plain form
14249 -177309 -195190 -187174 -79344 42492 150517 191150 167001 165145 48745 -42719 -114985
14238 -114985 -151440 -231231 -170170 -45023 49124 -45325 -7145 39698 64392 129922 87440
14227 87440 11183 -121751 -173484 -105532 -128893 -75409 -20637 38061 92414 16590 78053
14216 78053 154625 40626 -58005 72020 153060 154542 11645 -182301 -115570 -27438 -56360
14205 -56360 94482 251058 206895 111618 29451 62674 99784 95714 110781 148753 64680
14194 64680 -3646 -1858 -10100 102687 88152 8770 57457 8594 -42040 -33707 -35345 -123832
14182 -123832 -66881 -77823 -46767 46853 152902 149330 119608 69122 48181 -16718 -12945 -57913
14170 -57913 -18917 52723 66271 -43755 -38917 -21756 -100354 -255120 -252564 -327196 -376497 -212565
14158b12565O1753J7976J6919m7877m5039P1874J011r42K2594R3752J742N2159
14146C3357j8235R8462k6374j01088P5886l537l0910J5924p2400J52803K5374
14135A49262q2203J9656l9275J48023K6049j40930n8553j7116o3672k4207j7114
14124a00080N126r077q0186m9544O067Q4859J80417j6362K6717K9153J30773k2467
14112A85396j85141j13773N3324J44121N0119o6499l6058K759m7469o95P0978
14101E7062L2558M8512Q4239n8852j05069o5957l9284m0396K0465J6284R2088
14090D1650K0998k1445Q3621q9417o8056J27167j8820j02731j7318q278R4595
14079D1966m4306l2951p7805j83875O8681J23968Q0415o3574P3576R0751j4353
$$ plain form
14158 -212565 -150812 -132836 -115917 -163794 -208833 -136959 -135948 -136890 -114296 -20544 -18802 33357
14146 33357 15122 113584 87210 -13878 62008 58471 27561 43485 -28915 123888 149262
14135 149262 67059 86715 47440 195463 221512 80582 22029 4913 -58759 -82966 -100080
14124 -100080 -94954 -104031 -184217 -233761 -227694 -142835 37582 21220 47937 77090 207863 185396
14112 185396 255 -113518 -60194 83927 134046 67547 31489 34248 -13221 -13916 57062
14101 57062 89620 138132 222371 163519 58450 -7507 -46791 -87187 -66722 -50438 41650
14090 41650 62648 41203 124824 35407 -32649 94518 75698 -27033 -44351 -52629 41966
14079 41966 -2340 -35291 -113096 -296971 -228290 -104322 -23907 -87481 -13905 76846 62493
14068F2493P3932l6750P17j22431J1605M9312N3637R391J7030j6804n2481m3427
14056F224L6368l0391n6893n6093M6773k6973j0006J14056k0607l4247j19935
14045a51724m7873k699J06694j7373j07301N6288O6745K5932R9928R3434j7935
14034A04116j20778o3922N1495j90Q581p5445j13953N8172P6460o3930l399J75974
14022C3181j3539j66319n9775R8726O7553n933K3307P3952R1004P3676k42533
14011b6700j6020P5802O9876M6509K2178n2655j42357J8303j4755L2418P4396
14000H6995m5225m9134j03076L689k3344R4770N3473m2981j00427j6284k7160
13989a68704J04394J84158P0183j2412O3383Q454L8732j8825P4064n020j46652
$$ plain form
14068 62493 136425 99675 100392 -22039 -10434 38878 92515 101906 118936 102132 49651 6224
14056 6224 42592 12201 -44692 -100785 -54012 -80985 -90991 23065 2458 -31789 -151724
14045 -151724 -199597 -202296 -95602 -112975 -220276 -163988 -97243 -71311 28617 122051 104116
14034 104116 -16662 -80584 -29089 -29279 -20698 -96143 -210096 -151924 -75464 -139394 -142793 33181
14022 33181 19642 -146677 -206452 -107726 -40173 -46106 -22799 51153 142157 215833 -26700
14011 -26700 -42720 33082 102958 149467 171645 118990 -23367 -5064 -19819 12599 86995
14000 86995 41770 -7364 -110440 -106751 -130095 -35325 18148 -24833 -125260 -141544 -168704
13989 -168704 -64310 119848 190031 177619 241002 249456 288188 269363 343427 338407 191755
13978A91755j58126j00371Q9393J18294L8370j12062r7933L3715N3520J17548
13968A74103K8880k5754n562L1586j17926l319j00647n7787J4019J7896J04549
13957F0038L6851j08861k5240J074j62258q9377N0766K740j5683R5419Q1720J4736
13945e8075j61713o9085j4377k8707N8121j1517J3463P9254p4880l744L590M742
13933b62928O8217Q8825N8698O6077P2581k702K1924o9685p3807J1590J3585N9283
13921E1658j19742l9947L5719l8959N2942J38301M4366p2174J5362m1817j3802
13910A1907O7116l1391j56823J64033J83385r8032q0695m846K7099K3133r8745
13899F141K4797r787n4747j13522K9979J4086q7269J3093J03886O8020M9120k1075
$$ plain form
13978 191755 33629 -66742 22651 140945 179315 67253 -30680 3035 56555 174103
13968 174103 202983 177229 171667 203253 85327 82008 -18639 -76426 -62407 -44511 60038
13957 60038 96889 -11972 -37212 -36138 -198396 -287773 -237007 -234267 -249950 -154531 -72811 -58075
13945 -58075 -219788 -288873 -303250 -331957 -273836 -285353 -271890 -192636 -267516 -271260 -267670 -262928
13933 -262928 -194711 -105886 -47188 18889 91470 88768 110692 41007 -32800 -21210 -7625 51658
13921 51658 -68084 -108031 -72312 -111271 -58329 79972 124338 52164 67526 25709 11907
13910 11907 79023 47632 -109191 54842 238227 140195 59500 54654 81753 104886 6141
13899 6141 30938 21151 -33596 -147118 -117139 -103053 -190322 -177229 -73343 -5323 43797 22722
13887B2722J5344K7918K3756p0465r0053j78466m3279J4062Q0261P6347J41724
13876A9871J21078k4616j11055J6137P5314K6231j460q7974R2510N8767j49633
13865C5170r5407M5102M0442l2238O8491m2293N440j563j8703L8967J01364P1082
13853B15854m1635m2520o1133q4230k0180L4298J32538l8088j1195n1589l4232
13842b112o3703p8990o4189N1631J31667Q3881k6961q1015o6713n867P2869K7630
13830b1872K4175R1866L7555n3218p6172M4069M4211l3951j40580L6307P0510
13819B2900n4581J7266Q5125J08384m9055o5137J03161M3448M4020Q315N2589
13808C16435j2084p2315j08340j5034P8674r6287q9699n1973O6314J65564M0611
$$ plain form
13887 22722 38066 65984 89740 19275 -70778 -249244 -292523 -278461 -198200 -121853 19871
13876 19871 140949 116333 5278 21415 96729 122960 121500 33526 126036 184803 35170
13865 35170 -60237 -15135 25307 -6931 61560 19267 24707 23144 4441 43408 144772 215854
13853 215854 174219 131699 70566 -13664 -33844 454 132992 94904 83709 32120 -2112
13842 -2112 -65815 -144805 -208994 -157363 -25696 58185 31224 -49791 -116504 -122371 -49502 -21872
13830 -21872 2303 94169 131724 78506 2334 46403 90614 56663 -83917 -47610 22900
13819 22900 -31681 -14415 70710 179094 130039 64902 168063 211511 255531 263846 316435
13808 316435 304351 232036 123696 108662 187336 91049 1350 -50623 15691 181255 221866
13797B21866j3016n8344j74021P4146j0958r3568k8227J8402k6903O0192J71595
13786A41164K1260p5625q6939J08893J26166p2472O9345L810q82j0248k1722m3551
13774A59199n7805K5909K5240q5594j9095j7165M7844J12853m6414j10483j33203
13763i8714P6738R6981j9863r6685j78717j05133O5959J27304M1265L6446Q7316
13752C2897Q7748k5068l6355j29291J2071K7219j5270R424n716q7594O8658P5459
13740A4182R5039l713q8827n1559L3766J0229Q7440l1004l8241K6391L5538m6744
13728D2497Q4992R144j3255k5928L9378l0412j30015K5004L3092p933M9223K5824
13716A01611l7089o0970j17356N3391J45978N8707n4689J743J76860l9380l8549
$$ plain form
13797 221866 208850 150506 -23515 50631 39673 -53895 -82122 -63720 -90623 -30431 141164
13786 141164 162424 86799 -140 108753 234919 162447 231792 235602 234720 224472 202750 159199
13774 159199 101394 127303 152543 66949 47854 30689 78533 191386 144972 34489 -98714
13763 -98714 -21976 75005 55142 -41543 -220260 -325393 -259434 -132130 -90865 -54419 32897
13752 32897 120645 95577 59222 -70069 -57998 -30779 -46049 -36625 -42341 -129935 -61277 14182
13740 14182 109221 105508 16681 -34878 -1112 9117 96557 65553 27312 53703 89241 42497
13728 42497 127489 136633 123378 97450 136828 106416 -23599 1405 34497 26564 75787 101611
13716 101611 64522 3552 -113804 -60413 85565 144272 89583 91326 268186 228806 190257
13705A90257O6136j67945q6131j0498R9931J75311j213q0225q1905J9782l1656
13694I1844j7120k1636q2789M3603O1325o7793q464Q0080j77432K4089N5126m6277
13682f5444j57422J9650K40352O7205J2143R661m58p3133L8459N621p7389k7109
13670g864M5889M9997j4622J6642M9904P7444o1396j46150J2447L7565Q866l8583
13658C0139j33783Q39M3876N3058N0607O0330L0353N0710K4666P3926q6195j47433
13646E1093l104J27071L3922N78q0019r3390L0273J9763j01249o1245N0141J56340
13634A30174K36720m1592j62754q8493J4440L5057L560l5106J29192K079j90650
13623C2627m4555r7779q3823k2800L6806R8352j0218L3761j0970K03723K0440
$$ plain form
13705 190257 256393 88448 2317 -8181 91750 267061 265848 185623 103718 123500 91844
13694 91844 74724 53088 -29701 13902 75227 7434 -1030 79050 -98382 -74293 -19167 -65444
13682 -65444 -222866 -203216 37136 104341 116484 126145 125687 52554 91013 96634 19245 -7864
13670 -7864 38025 88022 73400 90042 139946 217390 155994 9844 22291 59856 68722 30139
13658 30139 -103644 -102805 -58929 -5871 44736 105066 135419 186129 210795 284721 198526 51093
13646 51093 47989 175060 208982 209560 129541 36151 66424 86187 -15062 -76307 -26166 130174
13634 130174 366894 325302 162548 74055 88495 123552 127112 92006 221198 223277 32627
13623 32627 -11928 -109707 -193530 -216330 -179524 -81172 -91390 -57629 -68599 135124 155564
13612A55564q9069M0376J9940k6973K4909j7752j22856L401P2753J13523m3975
13601A29841j8114m2347K7393j34908q9141o9586J11276O4912M2651k003j04085
13590h4111p1981j9975K1671J20524O2967R3725J5485j5408m5649j12788n3326
13579h8866Q580m3758M8021L8983L3065R89J71228l6684j38445j28216m0372Q4547
13567i0928p8586O9909J99326Q669q5918j26314L0925K9310J10186L4894j12224
13556a0751q8237M7970R7094R39p056p8047J26414J13187o5792p2903N6514q2857
13544C6475q356L916j8860j03635p2056O9045O8580P3241J36340J0119j01450
13533I3359r8088M1865O0519Q7483N5138L0592N9120k03405j42868j2387K4883
$$ plain form
13612 155564 66495 106871 126811 99838 124747 106995 -15861 -12460 60293 173816 129841
13601 129841 111727 69380 96773 -38135 -127276 -196862 -85586 -20674 21977 19974 -84111
13590 -84111 -156092 -176067 -154396 -33872 29095 122820 138305 122897 77248 -35540 -88866
13579 -88866 -80286 -124044 -76023 -37040 -3975 -2986 168242 131558 -6887 -135103 -175475 -90928
13567 -90928 -169514 -99605 99721 108390 22472 -103842 -72917 -43607 66579 101473 -10751
13556 -10751 -98988 -51018 46076 47015 39959 -38088 88326 201513 135721 62818 119332 36475
13544 36475 28119 32035 13175 -90460 -162516 -93471 -24891 48350 184690 194809 93359
13533 93359 -4729 37136 97655 185138 240276 270868 329988 126583 -16285 -28672 -3789
13522c789P5922j7648j07848L5772k0849k6009K9653P1891j10685M50N0740j5414
13510c7814M1900m1694J3382r2088N1801O9182n1465j2892q450j29080O5223J8894
13498a13101J14587J88354r2935j4500n9080o8482k4636l5278N0950M2835J35541
13487A24255j7421j24800p5165m0434k0774L3645J6055L8728O062P8154M3125
13476F1430k167k5720q0249P749J40233N3748L9629m1421q4378j11174k9419o2806
13464a34545q5000J30428N1392j6280J819M7663J4710R5117O3104k22157m4108
13453i7857M0249l068N489R3035L0020n8740j4049K450J20744l389J0227M7080
13441A72191M7355p557j33860K5707k8753j25050j37315l2953J28461R0292L0260
$$ plain form
13522 -3789 72133 54485 -53363 -17591 -38440 -64449 -34796 37095 -73590 -73140 -22400 -37814
13510 -37814 4086 -37608 -24226 -116314 -64513 4669 -46796 -59688 -68138 -197218 -131995 -113101
13498 -113101 1486 189840 96905 82405 23325 -45157 -69793 -105071 -54121 -11286 124255
13487 124255 106834 -17966 -93131 -133565 -154339 -120694 -104639 -65911 -59849 18305 61430
13476 61430 59263 33543 -46706 -38957 101276 155024 194653 153232 68854 -42320 -71739 -134545
13464 -134545 -219545 -89117 -37725 -54005 -52186 -4523 10187 105304 168408 -53749 -97857
13453 -97857 -57608 -60676 -55187 37848 67868 9128 -4921 -2471 118273 114884 125111 172191
13441 172191 219546 211989 78129 103836 75083 -49967 -187282 -220235 -91774 -1482 28778
13430B8778N2200K4857q5891j07038j6914K4202M3510K9948L3902K817K915j6959
13418A6327l6273p3874p0865J9290m5972n9387J44799j3915N6261J08250m8609
13407c968q9327L6347J38497j09117m0835K2684m3525m5638K0595J12480N7481
13396E5674o5511j6081q0707N3116L1205j6884o560O119R7360J6106l8463j7070
13384A8304m8197q7707j8962J9477N4578k5850O9066N3094K813r1056m1605K5070
13372g0975J2018L095O6869J92697R0539o8393j42935m3249K3196p1436p6349
13361h4923J6342J03069J45261J8283m673J3368p5536q3639K4324K0811L5038
13350A27725r4226j05080r920q3584Q0088N3130J13877L2834Q0110k3092j15589
$$ plain form
13430 28778 80978 105835 19944 -87094 -104008 -79806 -36296 -6348 27554 30371 33286 16327
13418 16327 -19946 -93820 -164685 -145395 -191367 -250754 -105955 -119870 -63609 44641 -3968
13407 -3968 -93295 -56948 81549 -27568 -68403 -45719 -89244 -134882 -114287 -1807 55674
13396 55674 -9837 -25918 -106625 -53509 -22304 -39188 -45748 -39629 57731 73837 35374 18304
13384 18304 -29893 -117600 -136562 -117085 -62507 -88357 -19291 33803 36616 -54440 -96045 -70975
13372 -70975 -58957 -55862 11007 203704 294243 225850 82915 39666 62862 -8574 -84923
13361 -84923 -68581 34488 179749 198032 193359 206727 131191 47552 71876 92687 127725
13350 127725 33499 -71581 -81501 -165085 -84997 -31867 82010 114844 194954 171862 56273
13339E6273r3288R0723N3174j5924J2781n001j02129r9174O6738J07068j6864
13328E4377l6989o2953J66473m0563j7754J76475L716r2527j64652R364J71921
13317A66888q8416j5658K8168J2964J7615N5468j1262j0051l0329o0283J5012
13306H0116q4594r7907q0820m3675l046R863Q9768R3049L8369p166k2575k8299
13294e6917O7409k4443r6121j08543n1883n146J42285Q3858L6493o328r918K6914
13282b340O494j7738p4013o0790p7080Q2671K2178K3831L4163M4011n6801O0476
13270a4938k0153r9398p8799J30093J36817P4541K61q9652j62128q9414L6115
13259a76655J64541P7217j7612K0644R53m0863k6759p7022j8109L5334l8169p9101
$$ plain form
13339 56273 -37015 53708 106882 90958 103739 98738 -3391 -102565 -35827 71241 54377
13328 54377 17388 -45565 120908 80345 62591 239066 242782 150255 -14397 -5033 166888
13317 166888 78472 62814 90982 103946 121561 177029 165767 155716 125387 65104 80116
13306 80116 -4478 -102385 -183205 -226880 -229926 -220063 -130295 -37246 1123 -6043 -28618 -56917
13294 -56917 10492 -13951 -110072 -218615 -270498 -275644 -133359 -49501 -13008 -19336 -29254 -2340
13282 -2340 4154 -13584 -87597 -148387 -225467 -142796 -120618 -96787 -62624 -18613 -75414 -14938
13270 -14938 -35091 -134489 -213288 -83195 53622 128163 128424 38772 -123356 -212770 -176655
13259 -176655 -12114 65103 47491 68135 69088 28225 1466 -75556 -93665 -58331 -96500 -175601
13247a75601O3437J41241M1704Q9557L0296o5621m3870j6435k4983p2012n6248
13236h8535m5788M9903J9502l5734k9809J08263O1747o73r4689j28482p2992J45800
13224a11487J89737O2221m0627j66646k1487L8344m5690K7099j15728L0199J2391
13213a41674k053L4673M8054L4824r229O0625L9216j9078n0920q0064L0329K7503
13201b7794k696m9628o8881p1111Q5890J25603j0235q7794m2853J08642J20988
13190H0131K8683m12j0949j7042M7909M2661p820j12132j7425K6928j094n8146
13178A292q7303J580q061M2431R9874M6496q3788J11126J58821L3020j2780o3225
13166B39483k1670m8207r0041J6359n9963j00382O9406j5780q6889N1790O1274
$$ plain form
13247 -175601 -112164 29077 70781 160338 190634 125013 81143 64708 39725 -32287 -88535
13236 -88535 -134323 -84420 -64918 -100652 -130461 -22198 39549 38876 -55813 -184295 -257287 -111487
13224 -111487 78250 140471 99844 -66802 -88289 -49945 -95635 -68536 -184264 -154065 -141674
13213 -141674 -143727 -109054 -61000 -26176 -35405 25220 64436 45358 -5562 -85626 -55297 -27794
13201 -27794 -30490 -80118 -148999 -220110 -134220 -8617 -18852 -106646 -149499 -40857 80131
13190 80131 108814 108402 97453 80411 128320 170981 163161 51029 33604 60532 59438 1292
13178 1292 -86011 -84431 -92492 -50061 49813 96309 12521 123647 282468 315488 302708 239483
13166 239483 217813 169606 79565 95924 35961 -64421 4985 -10795 -97684 -45894 15380
13155A5380k0606j42199r4631J08517J31779P3155q6243j68559m1649m1488J7028
13144b49516N3794K4350R5163M2533R5824J32276j1991n1758l2411J2447l5173
13133G5538q1339O9684P1875J60769P5042k12580j01068M9916q7177n3667r6273
13122a29280r6634J22360Q5671J4502J58979J9097j18187o0853n9746N8288M016
$$ plain form
13155 15380 -5226 -147425 -242056 -133539 -1760 71395 -14848 -183407 -225056 -266544 -249516
13144 -249516 -195722 -171372 -76209 -33676 62148 194424 182433 130675 98264 110711 75538
13133 75538 -5801 63883 135758 296527 371569 158989 57921 107837 20660 -33007 -129280
13122 -129280 -225914 -103554 -17883 -3381 155598 174695 56508 -4345 -64091 -5803 -1787
$$ [...]
##END NTUPLES=NMR SPECTRUM
##END=
