##TITLE=Analysis number 318483
Compound Code cc 42363
Book Reference 449/88
Project Code adrs
Chemist Name davee
##JCAMPDX= 6.0         $$ Bruker NMR JCAMP-DX V2.0
##DATA TYPE= NMR SPECTRUM
##DATA CLASS= NTUPLES
##ORIGIN= Bruker BioSpin GmbH
##OWNER= nmr
$$ XWIN-NMR		Version 3.5
$$ Thu Mar 30 09:25:57 2006 GMT Daylight Time (UT+1h)  MAYBRIDGE\nmr@NMR_250MHZ
##.OBSERVE FREQUENCY= 250.131544655141
##.OBSERVE NUCLEUS= ^1H
##.ACQUISITION MODE= SIMULTANEOUS (DQD)
##.ACQUISITION SCHEME= undefined
##.AVERAGES= 16
##.DIGITISER RES= 18
##SPECTROMETER/DATA SYSTEM= dpx250
##.PULSE SEQUENCE= zg30
##.SOLVENT NAME= DMSO
##.SHIFT REFERENCE= (INTERNAL, DMSO, 0, 16.522)
##AUDIT TRAIL= $$ (NUMBER, WHEN, WHO, WHERE, WHAT)
$$ ##TITLE= Audit trail, XWIN-NMR		Version 3.5
$$ ##JCAMPDX= 5.01
$$ ##ORIGIN= Bruker BioSpin GmbH
$$ ##OWNER= nmr
$$ C:\u/data/dgb/nmr/ADRS/1840/pdata/1/auditp.txt
$$ ##AUDIT TRAIL=  $$ (NUMBER, WHEN, WHO, WHERE, WHAT)
(   1,<2006-03-30 09:25:26.34 +100>,<MAYBRIDGE\nmr>,<NMR_250MHZ>,
      <created by zg, POWCHK disabled, PULCHK disabled
       configuration hash MD5:
       84 BC 41 DB A1 6E 1D 46 DA 25 12 A5 C1 ED C5 3A
       data hash MD5: 64K
       5F 7B 88 0F D9 02 5A 0A 82 B9 CB 61 4E D4 05 14>)
(   2,<2006-03-30 09:25:44.67 +100>,<MAYBRIDGE\nmr>,<NMR_250MHZ>,
      <Start of raw data processing
       ef LB = 0.3 FT_mod = 6 PKNL = 1 SI = 32K 
       data hash MD5: 32K
       C3 45 2D 13 92 60 26 74 16 85 42 B4 1D BB 33 34>)
(   3,<2006-03-30 09:25:46.75 +100>,<MAYBRIDGE\nmr>,<NMR_250MHZ>,
      <apk 
       data hash MD5: 32K
       AD 71 0C 52 E0 42 76 FB 24 2D 90 12 EA 9E 71 00>)
(   4,<2006-03-30 09:25:47.55 +100>,<MAYBRIDGE\nmr>,<NMR_250MHZ>,
      <abs ABSG = 5 
       data hash MD5: 32K
       4C CA EF 20 A8 D5 79 8F 82 E8 CD 89 4C 5A 96 49>)
$$ ##END=
$$ 
$$ hash MD5
$$ 91 3A 03 E9 E4 F5 D9 4D 20 2F BE 2E 00 A6 FD 2B
##$RELAX= 
##$RELAX= 
##$RELAX= 
##$RELAX= 
##$RELAX= 
##$RELAX= 
##$RELAX= 
$$ Bruker specific parameters
$$ --------------------------
##$DU= <C:\u>
##$EXPNO= 1840
##$NAME= <ADRS>
##$PROCNO= 1
##$TYPE= <nmr>
##$USER= <dgb>
##$AMP= (0..31)
100 100 100 100 100 100 100 100 100 100 100 100 100 100 100 100 100 100 
100 100 100 100 100 100 100 100 100 100 100 100 100 100 
##$AQSEQ= 0
##$AQ_mod= 3
##$AUNM= <au_zg>
##$AUTOPOS= <9 >
##$BF1= 250.13
##$BF2= 250.13
##$BF3= 250.13
##$BF4= 250.13
##$BF5= 500.13
##$BF6= 500.13
##$BF7= 500.13
##$BF8= 500.13
##$BYTORDA= 1
##$CFDGTYP= 0
##$CFRGTYP= 5
##$CHEMSTR= <none>
##$CNST= (0..31)
1 1 145 1 1 1 1 1 1 1 1 1 1 1 1 1 1 1 1 1 1 1 1 1 1 1 1 1 1 1 1 1 
##$CPDPRG= <>
##$CPDPRG1= <>
##$CPDPRG2= <>
##$CPDPRG3= <>
##$CPDPRG4= <mlev>
##$CPDPRG5= <mlev>
##$CPDPRG6= <mlev>
##$CPDPRG7= <mlev>
##$CPDPRG8= <mlev>
##$CPDPRGB= <>
##$CPDPRGT= <>
##$D= (0..31)
0 1 0 0 0 0 0 0 0 0.06 0 0 0 0 0 0 0.0002 0 0 0 0 0 0 0 0 0 0 0 0 0 0 
0 
##$DATE= 1143707124
##$DBL= (0..7)
120 120 120 120 120 120 120 120 
##$DBP= (0..7)
150 150 150 150 150 150 150 150 
##$DBP07= 0
##$DBPNAM0= <>
##$DBPNAM1= <>
$$ [...]
##$SUBNAM6= <"">
##$SUBNAM7= <"">
##$SUBNAM8= <"">
##$SUBNAM9= <"">
##$SW= 20.6930455092707
##$SWIBOX= (0..15)
0 0 3 0 0 0 0 0 0 0 0 0 0 0 0 0 
##$SW_h= 5175.983436853
##$TD= 65536
##$TD0= 1
##$TE= 294.16
##$TE2= 300
##$TE3= 300
##$TEG= 300
##$TL= (0..7)
0 120 120 120 120 120 120 120 
##$TP= (0..7)
150 150 150 150 150 150 150 150 
##$TP07= 0
##$TPNAME0= <>
##$TPNAME1= <>
##$TPNAME2= <>
##$TPNAME3= <>
##$TPNAME4= <>
##$TPNAME5= <>
##$TPNAME6= <>
##$TPNAME7= <>
##$TPOAL= (0..7)
0.5 0.5 0.5 0.5 0.5 0.5 0.5 0.5 
##$TPOFFS= (0..7)
0 0 0 0 0 0 0 0 
##$TUNHIN= 0
##$TUNHOUT= 0
##$TUNXOUT= 0
##$USERA1= <user>
##$USERA2= <user>
##$USERA3= <user>
##$USERA4= <user>
##$USERA5= <user>
##$V9= 5
##$VALIST= <valist>
##$VCLIST= <CCCCCCCCCCCCCCC>
##$VD= 0
##$VDLIST= <DDDDDDDDDDDDDDD>
##$VPLIST= <PPPPPPPPPPPPPPP>
##$VTLIST= <TTTTTTTTTTTTTTT>
##$WBST= 1024
##$WBSW= 4
##$XGAIN= (0..3)
0 0 0 0 
##$XL= 0
##$YL= 0
##$YMAX_a= 316967
##$YMIN_a= -477879
##$ZGOPTNS= <>
##$ZL1= 120
##$ZL2= 120
##$ZL3= 120
##$ZL4= 120
##$ABSF1= 16.522
##$ABSF2= -4.171173
##$ABSG= 5
##$ABSL= 3
##$ALPHA= 0
##$AQORDER= 0
##$ASSFAC= 0
##$ASSFACI= 0
##$ASSFACX= 0
##$ASSWID= 0
##$AUNMP= <proc_1d>
##$AZFE= 0.1
##$AZFW= 0.1
##$BCFW= 0
##$BC_mod= 0
##$BYTORDP= 0
##$COROFFS= 0
##$CY= 12.5
##$DATMOD= 1
##$DC= 0
##$DFILT= <>
##$DTYPP= 0
##$F1P= 14.0000005364418
##$F2P= -0.99999901652339
##$FCOR= 0.5
##$FTSIZE= 32768
##$FT_mod= 6
##$GAMMA= 0
##$GB= 0
##$INTBC= 1
##$INTSCL= 1
##$ISEN= 128
##$LB= 0.3
##$LEV0= 0
##$LPBIN= 0
##$MAXI= 10000
##$MC2= 0
##$MEAN= 0
##$ME_mod= 0
##$MI= 0
##$NCOEF= 0
##$NC_proc= -5
##$NLEV= 6
##$NOISF1= 0
##$NOISF2= 0
##$NSP= 0
##$NTH_PI= 0
##$NZP= 0
##$OFFSET= 16.522
##$PC= 1
##$PHC0= 165.398
##$PHC1= 3.712016
##$PH_mod= 1
##$PKNL= yes
##$PPARMOD= 0
##$PSCAL= 4
##$PSIGN= 0
##$REVERSE= no
##$SF= 250.13
##$SI= 32768
##$SIGF1= 0
##$SIGF2= 0
##$SINO= 400
##$SIOLD= 32768
##$SREGLST= <1H.DMSO>
##$SSB= 0
##$STSI= 32768
##$STSR= 0
##$SW_p= 5175.98343685301
##$SYMM= 0
##$S_DEV= 0
##$TDeff= 65536
##$TDoff= 0
##$TI= <Analysis number 999999
Compound Code 99
Book Reference 9
Project Code 9>
##$TILT= no
##$TM1= 0
##$TM2= 0
##$TOPLEV= 0
##$USERP1= <user>
##$USERP2= <user>
##$USERP3= <user>
##$USERP4= <user>
##$USERP5= <user>
##$WDW= 1
##$XDIM= 32768
##$YMAX_p= 463553321
##$YMIN_p= -731351
$$ End of Bruker specific parameters
$$ ---------------------------------
##NTUPLES= NMR SPECTRUM
##VAR_NAME=  FREQUENCY,     SPECTRUM/REAL,   SPECTRUM/IMAG
##SYMBOL=    X,             R,               I
##VAR_TYPE=  INDEPENDENT,   DEPENDENT,       DEPENDENT
##VAR_FORM=  AFFN,          ASDF,            ASDF
##VAR_DIM=   32768,         32768,           32768
##UNITS=     HZ,            ARBITRARY UNITS, ARBITRARY UNITS
##FACTOR=    0.157963299565203, 1,           1
##FIRST=     4132.6476996994, 0,             0
##LAST=      -1043.33573715361, 0,           0
##MIN=       -1043.33573715361, -731351,     0
##MAX=       4132.6476996994, 463553321,     0
$$ Real data points
##PAGE= N=1
##DATA TABLE= (X++(R..R)), XYDATA
$$ [...]
20879 2216943 2205333 2185638 2376188 2585394 2652976 2615186 2424054 2294093 2249875 2179284
20869 2179284 2144644 2263101 2427335 2474870 2548247 2442582 2445766 2478922 2237310 2337823
20859 2337823 2603889 2556743 2480040 2551248 2578713 2616786 2507329 2390819 2375463 2451291 2475487
20848 2475487 2522194 2601460 2720984 2841121 2866364 2928723 2950952 2999093 2993741 2902470 2892153
20837 2892153 3004730 2953004 3014145 3089262 2951785 3039403 2985501 2946647 3124008 3237154
20827 3237154 3108160 3134955 3097752 3071329 3108547 2996400 2877437 2976437 3286609 3452763
20817 3452763 3327773 3266564 3273708 3303654 3355802 3557212 3572250 3631621 3657093 3680880 3757648
20806 3757648 3762042 3936066 4044608 3949547 3943841 4175533 4186261 3992691 3993443 4155859 4208786
20795 4208786 4059908 4169905 4171035 4195276 4093383 4127308 4173385 4120211 4277249 4434310
20785 4434310 4435526 4483333 4413638 4420139 4420821 4257219 4260367 4229622 4290072 4342266 4416615 4507371
20773 4507371 4440708 4486262 4602338 4527854 4606379 4841249 4831448 4672398 4793589 4925204
20763 4925204 4990896 5111878 5146947 5106478 5151523 5119377 5306598 5371236 5272432 5308858 5289908
20752 5289908 5260991 5478334 5746362 5886379 5900720 5867247 5763794 5943462 5973942 6056300
20742 6056300 6216604 6299975 6324355 6413796 6513038 6523970 6455881 6589135 6756928 6853156 6877803
20731 6877803 6837069 6724866 6755003 6950142 7167083 7251772 7300443 7309176 7108751 7006490
20721 7006490 7269670 7467952 7665184 7690663 7681172 7781464 7848570 7746151 7776354 7988072
20711 7988072 8175992 8268884 8214370 8317748 8448951 8575267 8510173 8491229 8757825 8847358
20701 8847358 8803647 8976230 9031862 9242262 9362369 9365449 9444248 9794078 9930103 9899338
20691 9899338 9801877 10045284 10288741 10473176 10589159 10681814 10654381 10563526 10603423 10817554
20681 10817554 11028548 11195660 11451085 11686232 11661375 11649131 11945731 12245505 12339096 12435969
20671 12435969 12544862 12615539 12624873 12779776 12961592 13123704 13413771 13692174 13868418 14086485
20661 14086485 14436047 14682924 14751781 14713274 14722455 15032501 15302730 15507725 15657056 15961953
20651 15961953 16068023 16069854 16099955 16264313 16401819 16506139 16877343 17164307 17429967 17589313
20641 17589313 17911338 18215241 18514829 18560692 18623008 18786692 19190997 19481081 19692841 19733585
20631 19733585 19957623 20177077 20435636 20784286 21122745 21473492 21887401 22094052 22296444
20622 22296444 22427090 22420621 22562234 22834375 23164657 23434078 23573864 23834495 24304409 24596073
20612 24596073 24752147 25160361 25556171 26027408 26164583 26274385 26553289 26768630 27009266
20603 27009266 27437478 27819880 28091568 28241374 28589550 28806248 29135703 29456505 29695326
20594 29695326 29928756 30214857 30316337 30781414 31015686 31162528 31449344 31642641 31774921
20585 31774921 32024196 32254990 32442230 32737855 32853239 33158099 33607067 33840798 33961749
20576 33961749 34215635 34369059 34475288 34590730 34688890 34901580 35228588 35371434 35374416 35418452
20566 35418452 35577406 35723046 35854383 35829578 35820267 35808770 35899739 35850499 35950079 36075943
20556 36075943 35962547 35734184 35655531 35735833 35853796 36012503 35917436 35730084 35661326 35669528
20546 35669528 35495556 35378518 35195422 34990576 34754278 34681654 34487567 34511847 34489357 34262886
20536 34262886 33958349 33825435 33619489 33467065 33346675 33235349 32886453 32485853 32185961
20527 32185961 31998099 32034893 31879253 31528390 31171005 30927111 30787774 30585250 30250015
20518 30250015 29863397 29599118 29381625 29102366 28866523 28609964 28157612 27789988 27439243
20509 27439243 27116814 26988706 26588234 26247452 25971094 26039512 25967014 25740229 25247710 24869814
20499 24869814 24380455 24116314 23981653 23845104 23361743 22943801 22929767 22793482 22610214
20490 22610214 22454349 22177901 21927136 21548956 21212673 20859242 20567571 20420458 20236274
20481 20236274 19974815 19582938 19206185 18944846 18757191 18664866 18482377 18201956 17953270
20472 17953270 17822946 17714134 17506897 17247460 16997149 16790153 16641944 16454381 16375597
20463 16375597 16211979 16029936 15716546 15453413 15233546 15038747 14739449 14440156 14256558
20454 14256558 14139474 14019409 13939895 13881907 13717167 13567003 13371890 13211988 12961774 12764517
20444 12764517 12627895 12399140 12236819 12008388 11853177 11924225 11801318 11634432 11628432 11689881
20434 11689881 11516244 11277614 10995609 10782238 10692855 10637627 10694472 10645146 10485060 10308254
20424 10308254 10130759 9972802 9923353 9766970 9575027 9537434 9401686 9182624 9159300 9164438
20414 9164438 9222196 9289194 9239872 9217654 9079817 8878533 8727767 8487107 8410728 8256070
20404 8256070 8253339 8114365 7940872 7969252 7856343 7795743 7823463 7729261 7552741 7496528 7496857
20393 7496857 7330495 7158948 7054194 7093505 7207606 7128381 6881623 6853272 6969767 6786872
20383 6786872 6591074 6526022 6446426 6172682 6084888 6180901 6032871 6043060 6076287 6068354 6030957
20372 6030957 5948505 5889354 5819879 5678533 5827328 5863831 5858400 5852427 5665380 5462123 5299506
20361 5299506 5324362 5257634 5185251 5111178 5012054 5002287 5084698 5122194 4977261 4964779 5086083
20350 5086083 4917455 4851576 4851665 4767713 4628635 4484197 4393310 4492637 4489304 4397681 4406662 4616782
20338 4616782 4582516 4519057 4399772 4330767 4170054 4112510 4221629 4243024 4248886 4167767 4203800
20327 4203800 4331254 4191960 4060749 4129027 4124053 4089409 4019880 3934616 3882152 3833759 3851584
20316 3851584 3738707 3585349 3471346 3528176 3625035 3582982 3652602 3722377 3710276 3583196
20306 3583196 3393600 3314031 3376366 3387563 3349937 3313975 3406261 3425675 3448041 3404032 3325686
20295 3325686 3338039 3291223 3239545 3140372 2970188 2887891 2824284 2834268 2860114 2955836 3030561
20284 3030561 3034979 2930403 2898214 2729711 2595357 2706497 2881117 2843964 2773491 2599918
20274 2599918 2485919 2506941 2478643 2583631 2736705 2777109 2792922 2711699 2534048 2463751
20264 2463751 2443475 2340772 2246997 2155227 2118725 2240240 2399650 2308847 2291108 2190658
20254 2190658 1997827 1985097 2061798 2241018 2351227 2273474 2109302 2191584 2235547 2175373
20244 2175373 2166984 2136850 2088714 2140520 2184740 2193389 2127682 2073180 1997649 2059747 2208340
20233 2208340 2202260 2164548 2010440 1973413 1991780 1973852 1975996 1989312 2008465 1967666 1939016
20222 1939016 1939118 1774660 1689753 1682640 1777199 1776805 1552486 1510079 1641040 1643640 1632901 1541434
20210 1541434 1465231 1590275 1664580 1709351 1759635 1860708 1861910 1751217 1436625 1400603 1380969
20199 1380969 1561350 1590039 1687285 1794159 1890409 1772236 1663183 1724524 1860150 1701066
20189 1701066 1526377 1524241 1560012 1562630 1398546 1398806 1265948 1192566 1198066 1245485 1338111 1261677
20177 1261677 1128129 1235361 1307199 1305579 1470589 1414269 1187673 1183663 1267265 1244935 1421188
20166 1421188 1585805 1698192 1829460 1739213 1605590 1523464 1404512 1361306 1298207 1394512
20156 1394512 1355398 1376639 1385291 1378098 1264215 1216135 1084119 1098222 1005212 985433 1049864
20145 1049864 1302401 1380976 1287825 1436454 1405797 1168966 993042 1017824 1130466 1256122
20135 1256122 1420188 1309270 1089400 1067044 1090077 1005843 1053694 1039067 906926 1094056
20125 1094056 1176407 1264905 1151154 1115199 1041473 1141124 1164047 1041203 1041659 1136136 1130613
20114 1130613 979072 1046554 1098861 1173962 1259870 1201139 1005149 893372 747706 582402
20104 582402 604748 646330 747408 816731 1005780 1043608 926533 797988 802748 766132 833320
20093 833320 941636 1082273 1069921 1019623 1071232 1113287 1040713 1128912 1065490 1005628 1086404
20082 1086404 1069080 1048110 1132630 1019674 975761 998244 1002804 888416 853671 981924 1057707
20071 1057707 950832 862392 874742 827162 916163 802353 851011 936277 931648 971689 1003407
20060 1003407 1082356 1086256 957490 755168 595472 539107 713597 726557 836256 755958
20050 755958 448174 427828 521445 670569 883453 895110 799797 721317 704013 772209 805197
20039 805197 760525 764860 674572 736515 701605 684066 626941 648502 621764 596314 579170 528907
20027 528907 606612 639321 758687 803669 782372 772354 570636 456307 470804 510977 606153
20016 606153 565504 437613 416890 543103 658037 764519 814851 711099 601398 465891
20006 465891 490631 497498 449476 416839 432525 392402 424719 484344 506980 447776 536221 574853
19994 574853 529885 504967 506838 269030 173162 327901 371941 198222 222201 332528 203016
19983 203016 251872 443820 442232 522107 494246 400960 456615 441331 314319 281143 428284
19972 428284 662854 727999 549484 466733 443992 381818 380059 385866 305595 316203 222741
19961 222741 263240 320532 353531 443808 316870 254973 279523 210378 222121 403102 397388
19950 397388 342445 471983 642347 488468 326709 384759 535648 634997 553041 594914
19940 594914 558323 446725 434965 376825 193136 252908 331472 434478 516070 378671 398273
19929 398273 292107 356929 470437 532968 640667 750758 612669 645729 702468 436952
19919 436952 404346 319477 323764 478032 526627 528575 431276 367152 415020 236798 224257
19908 224257 292900 266572 388991 428268 444319 413016 299181 225083 318016 399603 447535
19897 447535 416785 283933 366244 491350 479728 418069 398658 560223 602269 636309 510249
19886 510249 527651 314280 235709 259183 223791 223474 329796 363361 170257 157594 164345
19875 164345 -78376 35639 95579 -27834 55703 161816 318914 443740 470812 424092
19865 424092 376751 270571 205159 123275 309249 300893 110853 174400 284792 393683 406880
19854 406880 418735 448160 534315 522313 359237 284761 352361 342808 293275 190537 93987
19843 93987 45610 84701 116770 140030 208041 122007 113194 93673 85280 267853 246746 320364
19831 320364 275882 251267 275173 248245 305927 390603 383027 367512 309485 232717 299614 488157
19819 488157 642392 559085 526207 344647 316377 509685 585778 596256 397781 241287
19809 241287 388014 397311 497194 593580 575387 603898 512101 354394 299884 409582 581228
19798 581228 748725 769319 781912 626122 730887 701502 593818 656610 743246 631943
19788 631943 522032 564812 632014 724448 811685 667924 701939 690613 675887 625336 482201
19777 482201 292734 295532 197972 249158 297811 246783 426441 449025 508462 607271 504400
19766 504400 568349 773613 893300 912515 927215 697028 558999 496124 642077 763409
19756 763409 733118 668120 490663 471434 485603 359616 294363 180412 299425 344886 382658
19745 382658 486739 654059 679549 681678 562336 438647 370590 390062 485796 527674 235502
19734 235502 160863 307747 372319 393078 191586 150987 317760 359066 189409 -46904
19724 -46904 44 270104 317692 394042 329860 54041 20225 134023 268460 202302 180575
19713 180575 190979 248154 223190 313454 521550 315020 28757 49547 167087 249833 229579
19702 229579 210895 389561 334218 115413 314154 336894 211630 197282 161384 202901 342297
19691 342297 368327 322839 323765 242389 84740 34401 139355 154693 219881 399190 532956
19680 532956 584951 482735 308431 80161 165492 235384 199954 102967 29355 74969 -68952
19669 -68952 29200 158552 101505 135787 181057 53250 102483 65598 34083 -44179 -117845
19658 -117845 -21421 201970 240548 146703 75425 191973 294342 229762 290444 258783 208904
19647 208904 245219 348802 433546 472701 476492 359735 278997 384676 430702 377128 457750
19636 457750 427053 438627 453207 433724 283276 287823 380743 339495 253741 315033 339595
19625 339595 318100 402304 372891 241342 249446 348118 407378 304349 303551 266583 273689 230693
19613 230693 307162 376192 386065 139842 92049 198964 145385 170736 213382 181380 -13474
19602 -13474 25975 160189 135695 62482 251984 360552 376924 185839 144540 214253 137864
19591 137864 8692 30191 54124 -86484 -119051 -2844 125348 314135 460659 394092
19581 394092 232962 78811 78852 58084 260083 217613 146675 47920 264224 444297 411202
19570 411202 427234 567084 467585 392307 410149 300501 189195 258603 286820 433636 441410
19559 441410 501764 412029 333840 347206 258507 367033 529942 673386 401408 381651 411117
19548 411117 465276 246124 113509 195840 189242 96084 191456 170423 156157 117498 54417
19537 54417 -11121 323133 418739 346626 424959 687546 677660 532712 477881 308406 129760
19526 129760 157803 134169 284877 435053 493990 382859 446733 699718 676866 460851
19516 460851 486599 630931 738056 698252 773136 787678 661933 658168 659812 756212 801953
19505 801953 590362 374380 450317 562906 540720 382655 318905 404324 488855 578588 590643
19494 590643 664606 747294 694080 593611 486049 470665 520177 504402 569205 631585 587188
19483 587188 522360 473529 653415 731733 649026 596044 609315 575852 806127 777323 761287
19472 761287 641166 713869 852930 889369 772965 828796 903444 842827 687914 636142 620454
19461 620454 525083 509426 603605 725987 748150 765744 684174 845434 885161 808150 659448
19450 659448 656878 715315 682255 815020 931026 864347 789652 839040 986076 1083164 974571
19439 974571 1056914 1039105 1079817 1161646 1082802 1078021 1022906 959735 865181 873519 949619 1159218
19427 1159218 1219458 1215495 1209995 1125175 1112494 1262249 1240003 1227225 1309439 1275781 1306653
19416 1306653 1421106 1451672 1596761 1679085 1808816 1952434 1825901 1819526 1636310 1701595
19406 1701595 1807365 1604933 1518676 1746517 1978351 2028887 2005600 1930956 1814040 1851259
19396 1851259 1859783 2100448 2183864 2089936 1990352 1823930 1704110 1560646 1670056 1872060
19386 1872060 1865809 1880439 1866626 1859306 1854759 1819739 1960659 1795537 1500484 1409829 1605340
19375 1605340 1598207 1732817 1775369 1730368 1608396 1637330 1671537 1634962 1752077 1705511 1530385
19364 1530385 1742809 1907626 2005458 2109529 2149969 2240839 2441397 2393531 2385794 2193511
19354 2193511 1975427 1970300 1967518 1905099 1846196 2097154 2281055 2238838 2062482 2073276 2274600
19343 2274600 2350430 2513697 2558130 2565724 2893835 3081262 3263867 3593242 3754716 4032770
19333 4032770 4166558 4228908 4393193 4533038 4830253 5315518 5815628 6612447 7429339 8265356
19323 8265356 8900415 9291008 9170706 9109000 9088035 9334856 9605253 9502344 9248395 9066873
19313 9066873 9071427 9266455 9775388 10884547 12371499 14107256 16294060 19193890 22976019
19304 22976019 27640316 32717938 37336255 41015966 44189672 47854508 53480826 61750809
19296 61750809 71128581 78590708 80911676 78348195 73006512 67726016 64356130 63089152
19288 63089152 63250968 62893770 61346000 59075521 57015350 56363178 56944331 58248473 59596062
19279 59596062 60879261 62612708 65666099 70841503 78760574 89807053 102242200 111780298
19271 111780298 113507299 107204798 95958021 84422183 76435220 73246818 73830337 76246803
19263 76246803 77581286 75916762 71015459 64319319 58105712 54319869 53566217 55245458
19255 55245458 58147152 61727564 66890240 75253871 87049294 99162747 106688106 107371841
19247 107371841 101931876 94260834 88878508 86169995 83156389 78566330 73279142 68775938
19239 68775938 67189411 69106607 74693444 83821126 94945583 103522761 104956086 98271884
19231 98271884 85724298 71352896 58329843 47655799 39243294 32702865 27880759
19224 27880759 24713595 22760008 21702508 21386460 21121018 21074837 21079279 21257075 21007283
19215 21007283 20295619 19516374 18571687 17856667 17254366 16913476 16476881 15919159 15214081
19206 15214081 14366366 13444772 12743447 12085266 11546205 11190417 11019954 10734195 10445816
19197 10445816 9765944 8728037 7851835 7248493 6745286 6246951 6024902 5795530 5442170
19188 5442170 5096900 4799099 4614289 4468710 4447167 4244987 3941303 3871058 3851645 3815159
19178 3815159 3910537 3863086 3633011 3471808 3379626 3407609 3541729 3666307 3864403 3798880
19168 3798880 3915003 3974677 3965941 3761835 3513523 3492694 3501683 3610180 3768630 3848163 3952167
19157 3952167 3807172 3553809 3452502 3499921 3704041 4074009 4220368 4274335 4236429 4269912
19147 4269912 4246713 4296893 4490739 4681133 4870178 5044509 4978552 5022699 5189823 5573865
19137 5573865 6097518 6373550 6453866 6449007 6374614 6176586 5847108 5467060 4928423 4447995
19127 4447995 4175186 3922196 3886572 3850043 3727177 3913915 4053696 4101492 4305018 4571631
19117 4571631 4925620 5392288 5909129 6301191 6196711 5802728 5505799 5125132 4526968
19108 4526968 4140465 3871913 3701906 3656237 3554659 3699006 3982652 4304524 4620565 4951115
19098 4951115 4995659 5077277 5083509 4939187 4556831 4275599 4027284 3835904 3919512 3812703
19088 3812703 3625268 3633496 3584417 3652601 3769984 3832920 3951289 4149166 4199902 4298710 4446310
19077 4446310 4930428 4987562 4748112 4754821 4534433 4155139 3808199 3364473 3158046 3025414
19067 3025414 2886040 2780664 2463355 2426825 2275439 2003474 2034837 2139230 2085525 2125418
19057 2125418 2213631 2259376 2199745 2054197 2151872 2225098 2191705 2082296 1860934 1766137 1664249
19046 1664249 1709651 1700034 1636686 1491090 1504232 1600274 1477343 1534067 1606465 1787506 2050401
19035 2050401 2233018 2170101 2127409 2080973 2100223 2106151 2183135 2312142 2413072 2549686 2696751
19024 2696751 2612680 2329146 2087671 1950256 1722128 1623773 1774117 1868446 1819454 1756227
19014 1756227 1722566 1684814 1678615 1483166 1504364 1422267 1319773 1570469 1736745 1701562 1640933
19003 1640933 1654166 1626693 1522588 1284361 1250781 1373769 1411350 1471863 1414741 1311430
18993 1311430 1429084 1629693 1519755 1348547 1261526 1422717 1736550 2091268 2150691 2261538
18983 2261538 2493334 2626791 2648495 2811815 2763422 2733165 2647946 2760981 2854334 2920990
18973 2920990 2905371 3086387 3258773 3270202 3002259 2691603 2418285 2327645 2371616 2353781
18963 2353781 2263546 2149258 2125647 2161026 2230061 2310107 2306830 2508501 2438829 2185924 2032008
18952 2032008 2032302 2153553 2144074 2020140 1968777 2076526 2059465 2196406 2444787 2740568 3030489
18941 3030489 3197739 3296371 3534192 3714285 3684264 3790363 3684638 3766933 4043875 4393644
18931 4393644 4928509 5056097 5168888 5223326 5266261 5380270 5531506 5777540 6207387 6888977
18921 6888977 7598592 8209084 8675595 9279698 9925485 10844574 12521056 14533698 16387215
18912 16387215 17937542 19050351 19489514 19635217 20240761 22064814 24985232 29026322
18904 29026322 34062199 39457112 45351228 52321300 61197746 71986504 82961054 90051663
18896 90051663 91401932 87669355 80686197 73598310 68926948 67199345 68558320 73242969
18888 73242969 80819366 88918985 94433083 96069106 93844884 88760560 82296927 75362617
18880 75362617 67979505 60406382 53401521 48057449 45322794 44948129 45652871 46323615
18872 46323615 45912524 44263357 41628220 38818078 36453505 34909647 34226135 34598212
18864 34598212 36570107 40241633 45497548 51805422 58102664 63968423 68368415 71245734
18856 71245734 72941914 74823867 78184071 83346911 89314619 94653099 99108518 103824976
18848 103824976 110702428 121261846 131663341 136109120 133041330 122752964 109285340
18841 109285340 99139881 95965949 100402839 110294412 120335750 124154490 118820325 105072009
18833 105072009 86563424 68332534 53581020 42739882 34949658 29511510 25754720
18826 25754720 23086200 21135396 19823004 19362629 19271306 19420735 19578559 19245419 18113625
18817 18113625 16246097 14249661 12402050 10781367 9703973 8830861 7947419 7426785
18809 7426785 7013427 6717505 6263037 5994527 5940903 5972577 5801661 5591213 5411171 4979653
18799 4979653 4526756 4136748 3777198 3584537 3501253 3521360 3527468 3405367 3323144 3164928
18789 3164928 3090550 3054613 2939241 3083460 3060179 2911738 2806258 2540989 2238178 2141569
18779 2141569 2409890 2678976 2668513 2658390 2777066 2642704 2458131 2311079 2234152 2209328
18769 2209328 2183653 2102410 2195641 2197943 2281645 2131722 1968739 1909824 1817925 1645059 1570972
18758 1570972 1514457 1542765 1520237 1589958 1628238 1665192 1742222 1708121 1659699 1604428 1764422
18747 1764422 1750744 1708325 1624442 1632733 1707937 1693045 1605336 1538724 1602794 1468206 1367988
18736 1367988 1288332 1348384 1349339 1406533 1535173 1460136 1340725 1380808 1295157 1292016 1201967
18725 1201967 1128883 1099849 1084325 1224222 1259199 1309843 1285700 1277255 1339126 1274419 1284554
18714 1284554 1276756 1422465 1272964 1092746 1147220 1321464 1356982 1635305 1690475 1679593
18704 1679593 1740242 1797533 1881999 1828687 1749179 1695736 1640411 1656612 1797976 1690039 1633554
18693 1633554 1697889 1874202 1835098 1847208 1927851 1888520 2030839 1956273 1885656 1873586 1980717
18682 1980717 2025927 1997770 2258516 2470566 2676832 2774421 2775334 2887061 3005916 3141268
18672 3141268 3224992 3201237 3394364 3718449 3981660 4631272 5075684 5531340 5944264 6195895
18662 6195895 6282432 6160986 5914724 6013988 6265692 6381389 6554991 6827401 7039148 7047979
18652 7047979 7136990 7109294 7036068 7090122 7232049 7304983 7673585 8291846 9149919 10389913
18642 10389913 12231149 14727911 18184024 23126823 29453420 35799681 40244060 41523609
18634 41523609 40196467 37570526 35581808 35082660 36146673 38710444 42233994 46120604
18626 46120604 49490866 52496439 55921638 60099379 65673471 73116615 81425455 87113942
18618 87113942 88191987 85177208 79250773 73493526 69907342 68576724 68982981 71219086
18610 71219086 75879623 82763725 90075485 97313295 104923312 114420360 127410781 143792198
18602 143792198 160325652 173111817 179329936 179645957 176543396 172108339 167509524 163052128
18594 163052128 158349098 153365634 149145232 146958131 148447730 154431485 164801000 178721266
18586 178721266 195375273 212961803 229820560 246213328 262626672 279007593 294309500
18579 294309500 305424963 309167955 304427547 292297766 275038298 256673760 240082970
18572 240082970 226609710 215923925 207075395 198147503 188783171 180409133 174440756 172166355
18564 172166355 173121202 177642237 186591946 200752726 218359838 230278055 228091550 211640283
18556 211640283 186279367 161070894 142118274 128877000 118643868 109448099 102138471
18549 102138471 98289303 98115394 100681051 104849751 108988878 112261120 115516991 120064129
18541 120064129 127770562 139188903 151705963 162440970 170635693 177217234 183159634
18534 183159634 187848193 190095335 188253595 182454083 175693240 170262166 166385128 161762626
18526 161762626 152497248 137788242 119187159 100759348 86341098 77236009 73056663
18519 73056663 73009277 75979520 79636651 80608596 77076942 69463309 59879051 50759007
18511 50759007 43925974 39749361 37717423 37279601 38331815 39824759 40355415 39132413
18503 39132413 36084239 32143217 28571130 26077088 24417322 23536055 23527652 24006119 25070789
18494 25070789 26999297 29971484 34275721 39830998 46154350 51608980 54608033 54813815
18486 54813815 53541070 52647485 52972243 53479480 52126033 48280522 42517612 36443508
18478 36443508 31493940 27860159 24807833 21928017 19398727 17391991 15813193 14637359
18470 14637359 13667264 13050549 12718478 12449410 12455097 12693363 12755714 12945137 13106990 13398106
18460 13398106 13679499 14159502 14656329 15065218 14834384 14201818 13697859 13460893 13675172
18451 13675172 14158129 14997943 16001390 16151430 16024934 15780759 15570582 15964664 16605292
18442 16605292 17697938 18897359 19975971 20246041 19268698 17431286 15064474 12961365
18434 12961365 11541333 11014884 10989557 10968712 10794839 10145215 9194647 8278354 7326883
18425 7326883 6480197 6109700 5815314 5348570 4920856 4715870 4541167 4530288 4513189 4581564
18415 4581564 4592311 4609922 4560213 4461676 4191713 4084070 4012548 3892464 3955490 3889259 3739308
18404 3739308 3705420 3584711 3542938 3529606 3392758 3161231 2977747 2855993 2729725 2756291
18394 2756291 2743644 2680600 2444560 2172116 2191663 2341028 2560286 2663422 2646947 2449290
18384 2449290 2518583 2806295 2743949 2568370 2458113 2594798 2591602 2534485 2665361 2731222
18374 2731222 2662107 2642558 2645122 2738130 2941770 3159784 3165330 3123909 2992493 2721617 2664707
18363 2664707 2620704 2557838 2310282 2277591 2074356 1840159 1790866 1855749 1830017 1809374 1925498
18352 1925498 1911102 1843216 1848418 1884388 1783246 1562118 1393093 1466647 1669277 1777909
18342 1777909 1739561 1809269 1807911 1804570 1754746 1912500 1943868 1795298 1789931 1670741 1619190
18331 1619190 1707977 1438282 1476788 1491602 1441830 1446981 1516546 1516500 1448135 1452502 1518886 1472764
18319 1472764 1426486 1420024 1460065 1593448 1581143 1606225 1545993 1363781 1199685 1244856 1204949
18308 1204949 1081596 997631 1047417 1079220 1168664 1122631 1228875 1341715 1292191 1168005
18298 1168005 1235451 1092703 1149950 1222345 1194601 975486 1005021 908639 950467 1018737 976252
18287 976252 863378 885023 907785 914499 1048081 1155014 926856 886036 900625 888250 907992
18276 907992 1000105 1005120 1221021 1249569 1222504 1190207 1170313 1118461 1036984 979226 836861
18265 836861 828154 709325 541375 355621 440485 613220 830057 791316 864249 1027190
18255 1027190 1066448 849330 730556 684532 621821 743280 651978 452485 569382 609821
18245 609821 527801 677356 740873 702030 713624 906295 840937 835851 727494 527504 568027
18234 568027 665049 690245 720748 679675 649687 613404 577939 547259 578112 586123 438609
18223 438609 347844 400020 567546 443929 210899 327544 380468 255001 405742 507006
18213 507006 587803 485994 448959 473188 517528 421835 414761 438706 518425 635687 588930
18202 588930 323734 349331 490156 409331 427672 640490 593760 408557 487526 575666 494528
18191 494528 475452 487790 398889 508347 508067 363534 225556 259008 404134 395105 478243
18180 478243 469822 481227 494925 542001 563886 409508 438221 552044 647775 715925 800597
18169 800597 760152 612630 525032 594968 611371 697099 585747 345835 359161 542828 549417
18158 549417 605700 780926 880235 826674 734217 677898 743139 673351 568118 609651 554765
18147 554765 399478 395821 324015 464107 512263 496017 508581 613890 700096 564675 484993
18136 484993 611660 638575 581067 605986 486294 361510 256883 517589 771512 771593 784793
18125 784793 693898 679989 763521 813876 866901 973066 1000588 1031742 1126948 1177262 1215592
18114 1215592 1232200 1339608 1345451 1281552 1149496 1012206 973297 977595 907435 888456 1019145
18103 1019145 1206554 1234678 1107529 982477 916713 855147 942811 868250 716270 532985
18093 532985 490577 403154 212469 371576 474694 527952 662391 700939 656307 618566 630025
18082 630025 650520 805842 753642 810842 853883 850210 882221 1052371 1186281 1128924 1198122
18071 1198122 1310498 1384996 1641153 1520292 1251037 1237798 1393317 1365986 1287406 1292282
18061 1292282 1286021 1214586 1198214 1206870 1185097 1118545 1086128 1069569 988963 892992 943353 1008400
18049 1008400 968298 819631 871036 969379 1045418 1089309 1210045 1112279 965010 975744 1043137
18038 1043137 949825 891417 966713 984106 908881 877496 867683 877567 886278 898056 966373 888838
18026 888838 825264 889560 935713 939981 812713 792915 890493 760991 834716 827564 736973
18015 736973 752496 669822 702339 775129 1002772 1006252 855554 630946 575918 664757 706604
18004 706604 669673 637117 535336 659534 689076 641236 554417 440595 450920 431560 340509
17993 340509 288719 453362 465936 421339 601601 641656 642000 705356 531684 408502 492234
17982 492234 592851 637606 494612 364829 369021 399832 262462 167151 405449 497641 328895
17971 328895 292567 346810 356217 212819 99614 120127 204029 231321 236958 267186 198040
17960 198040 265325 355495 501915 512185 495907 375725 379482 547372 430344 324676 413528
17949 413528 440673 363084 144898 154642 270384 179445 286799 476778 533865 592327 344639
17938 344639 338623 366120 404425 454629 362028 240418 195983 388347 394030 266238 295115
17927 295115 247980 196962 82291 180762 305799 352860 489482 543115 376495 193603
17917 193603 188374 270775 289516 214799 102086 197023 148468 132441 221526 232981 135644
17906 135644 168014 117189 -62868 -201324 41454 4767 -63393 -42345 -10149 58575 94708
17895 94708 162506 216191 236663 248758 249096 124921 8451 -99216 50541 269086 52712
17884 52712 -116972 -83033 -71735 83385 128248 -17561 48633 100161 70513 207599 123753
17873 123753 -24298 -40471 98201 218186 165272 146244 155062 112249 278515 265435 238099
17862 238099 416718 506855 469328 554849 548549 415026 394864 517082 496197 298650 235735
17851 235735 191090 332591 318030 181031 -48276 -23446 -24006 -38474 21843 19183 -7615
17840 -7615 8717 242173 284718 323601 426825 454651 402380 436467 276928 329603 410214
17829 410214 420106 471676 501383 418052 213082 67793 42707 33069 93579 144792 245482
17818 245482 194526 107358 2997 -99861 -149340 -95438 -171849 -279723 -209566 -27536 136304
17807 136304 149641 161536 145911 165104 65207 82617 26718 45063 -33571 -170830 -183196
17796 -183196 -50822 173287 103543 120952 123696 195831 151642 182978 206741 51510 -53133
17785 -53133 127127 274423 131386 -11720 188756 177737 45476 -89962 -76511 -39537
17775 -39537 72379 65960 14560 139543 180721 137908 135779 90468 45669 54717 -1242 136185
17763 136185 131725 37514 118689 143317 55059 -86568 -79813 -34 105480 164127 141516
17752 141516 112956 90560 87598 100933 221868 273435 348745 270881 130453 98200 49276
17741 49276 98613 158830 130020 175465 134677 -69486 -245982 -206093 -90745 -327518 -293633
17730 -293633 -223551 -322513 -241036 -190325 -216237 -55642 7686 105 28906 218300 268179
17719 268179 279231 433140 552585 415519 339384 346871 410240 244471 35720 8865 -100560
17708 -100560 -81172 59868 55478 97995 71000 63548 -18809 -167198 -90181 -20021 -49322
17697 -49322 13569 90676 230111 228526 173753 233932 314794 196240 87921 13348 119251
17686 119251 109497 36097 90538 124840 121638 151876 47172 17761 73280 128962 170410 65798
17674 65798 279759 295665 74933 37225 43745 103982 63502 124301 273785 213880 89674
17663 89674 124886 49041 -47349 -52191 -28768 977 77161 103489 228576 254676 177583 205435
17651 205435 286125 316883 151352 115375 75297 65635 85536 17425 79428 11902 -7674
17640 -7674 104550 176450 12804 -57489 104851 276931 189424 275797 403386 178313 144714
17629 144714 33129 132721 163939 111513 89432 164191 107106 -49105 -182246 -201589 -48431
17618 -48431 63385 85429 68452 257242 349749 385897 172168 -35677 140347 15923
17608 15923 -42184 -97269 17470 -49080 -148164 -65583 140861 212834 83450 53391 -63788
17597 -63788 -96170 54466 42342 78283 -22967 -59577 6480 60875 -46727 -33893 85089
17586 85089 122895 83503 6462 -137673 -135579 -131009 -175076 -306020 -283997 -225701 -144271 19356
17574 19356 224210 191736 247200 277740 345635 158729 34268 53107 170907 170393 304538
17563 304538 386124 152120 -64556 -129150 -13082 75155 -51779 -39892 69366 -71486
17553 -71486 -59905 -29085 69073 147745 104920 72717 40064 -74408 -103391 -113269 -73036 -23899
17541 -23899 38401 213814 249450 181082 122263 197618 236416 67896 36297 98462 278527
17530 278527 445761 454804 442167 428160 351740 230698 246895 349613 318685 52715 -15469
17519 -15469 126404 168218 78250 148474 127618 199263 261084 230535 123124 70062 105785
17508 105785 171558 186974 135601 107911 56211 1874 90993 -34568 -34094 -71392 -159379 -40625
17496 -40625 11027 -2722 -166842 -151542 48477 112894 28559 205555 356224 217121 326
17485 326 -36759 -14945 160929 142075 -70402 -44385 -102581 -93417 -146706 -311232 -385202 -359071
17473 -359071 -112162 114533 56757 44728 32902 -128414 -72640 114487 31262 -119051
17463 -119051 -111037 -22397 -114067 -99923 -51791 -67224 -103149 -22648 24963 180300 66151
17452 66151 -50719 20840 80 7002 197034 148080 172312 314201 169025 56580 66911
17441 66911 192572 165567 255054 243779 190616 113754 26861 -45881 -45772 57561 159657
17430 159657 303975 200153 -8041 -41436 93983 117264 150814 191158 126758 -82737
17420 -82737 -37703 12805 153245 321691 179739 73973 -49323 28038 4518 -96160
17410 -96160 -123352 -171088 -178952 -151029 -130718 -53532 126208 253569 224216 290155 325560
17399 325560 346594 285782 301888 256004 67023 -11780 46507 94719 124372 240337 142028
17388 142028 62790 122694 111903 196493 248386 256585 270336 227742 371697 140685 -65176
17377 -65176 -133299 -264755 -341735 -428511 -292429 -36554 -45887 -81340 -72179 -99049 -106649 -122511
17365 -122511 -79952 -40667 -19458 -35618 133014 188927 88419 192154 403005 287216
17355 287216 61202 16568 67188 187767 217809 183329 125252 168233 41104 -102084 -251380
17344 -251380 -146814 -183934 -243468 -88803 28791 22603 -1647 -23472 16978 63812 -15162
17333 -15162 -54041 -62180 4560 -7227 10284 -41570 -11261 27478 -11932 -10078 17868 -84830
17321 -84830 -29003 381 -165162 -203979 -291904 -283226 -210012 -104293 -64324 -47256 62301
17310 62301 179085 13012 -234128 -16873 73627 -67160 -24004 -137755 -266364 -300777
17300 -300777 -277237 -121918 -79769 -44280 15864 -49230 -56734 -46588 22727 18633 158819
17289 158819 177404 197074 154163 86812 67371 148695 159308 -9007 65270 130117 70823
17278 70823 135563 97325 26681 35505 -5623 -15705 -119407 -261548 -215465 -122052 -46713
17267 -46713 -62876 -2362 73396 111055 86508 -2836 -95737 -167510 -281785 -270270 -167442
17256 -167442 -68490 42517 28749 -25915 -118466 37834 -1828 -144212 -61500 -150251 -134971
17245 -134971 -121957 -36891 12137 -213956 -442268 -417404 -348671 -248617 -74260 -3286 -30591
17234 -30591 158457 75771 -97534 -15220 79754 53885 -106358 -106908 -42056 -114130 -99269
17223 -99269 -137262 -171322 -137460 -14701 118260 132718 190010 141684 54181 21791 -148992
17212 -148992 -126485 -118327 -28510 -52433 -85006 55981 -3413 -64408 -124088 16 128414
17201 128414 182684 238463 282738 218013 173998 216753 133765 233204 220872 171002 47646
17190 47646 -78988 -136754 -30749 38070 18911 -149394 -155595 -47581 -6145 -92021 -114470
17179 -114470 10412 -966 -69926 47236 -4169 -71444 -168328 -381888 -468767 -471193 -333280
17168 -333280 -235992 -222886 -215900 -285592 -83984 145381 -4467 -119840 -288355 -280946 -113859
17157 -113859 10089 17941 27302 -114334 -71948 101361 60204 -109461 -226916 -253759 -296316
17146 -296316 -388607 -430296 -330949 -364332 -484161 -474999 -252389 -108421 49538 139392 99645
17135 99645 132766 16360 -9640 73999 144997 147558 11155 -56338 -270481 -321862 -309275
17124 -309275 -108693 -72292 -229158 -207321 -246925 -274270 -282854 -165477 -140102 -191056 -244266
17113 -244266 -152853 16653 138277 -41077 -149334 -167132 -337826 -343860 -292841 -323211 -321973
17102 -321973 -292245 -187538 -167566 -140084 -162191 -162967 -194856 -109845 -123107 -83314 156348
17091 156348 84360 99834 40984 -39613 15692 39053 -56749 -50634 63719 113042 8593
17080 8593 119393 -50854 -261029 -231094 -189440 -70132 100609 117385 47167 223416 184090
17069 184090 25693 11829 91019 30355 -101289 -203151 -148362 -71993 -18231 6815 46953
17058 46953 10697 -21638 -144963 -266813 -241904 -260185 -248480 -209718 -150509 -187723 -151466
17047 -151466 -268545 -181994 22506 -7250 -92832 -61388 -229082 -154127 -244721 -242606 -280334
17036 -280334 -285953 -228194 -38834 57861 136112 74553 -17990 -255641 -131021 -124065 -231348
17025 -231348 -262858 -198572 -75947 69204 216585 128388 -44214 -212965 -491059 -731351
17015 -731351 -590443 -459412 -480013 -373421 -330896 -117503 -193819 -266637 -256979 -298984 -220732
17004 -220732 -54421 -110993 -90688 -237395 -161160 -55869 -105306 -17486 159816 10559
16994 10559 -52869 -188175 -147331 -47703 8325 -139023 -252415 -182757 -6151 261136 292748
16983 292748 200710 62236 99250 89515 104762 12937 134567 314774 368454 255693 84387
16972 84387 -64534 -194995 -32667 328514 257993 97486 -34941 -106110 49256 178676
16962 178676 171245 123982 94822 105082 76010 24037 -74360 -35654 -5992 -57589 -184389
16951 -184389 -312600 -421289 -499817 -356630 -270789 -273757 -173542 868 -74443 -108221 -304133
16940 -304133 -560215 -370849 -76969 49738 94652 -9278 -60291 -75577 -128832 -300238
16930 -300238 -216738 -4017 -11440 98204 68357 -36910 -173328 -121182 -31768 -147707 -53063
16919 -53063 23062 -56591 -94755 28755 -23486 -128135 -107868 -31552 -3793 -162785 -74253
16908 -74253 -168966 -256925 -175908 -236873 -325494 -309726 -388011 -268519 -132076 -21536 2153
16897 2153 -131635 -55356 -31031 16419 63478 113405 155584 199695 269431 140953 154212
16886 154212 120643 -169152 -180470 -181449 -68042 28509 196918 129190 -61008 -78816 -160380
16875 -160380 -245878 -172337 -91935 -147257 -171943 -218656 -130219 -74356 93632 98973 -85806
16864 -85806 -114466 -80455 -162038 -131422 -56245 -144522 -89779 -51628 63092 36306 -66171
16853 -66171 -92349 -46001 25088 245379 251213 98874 124697 -115493 -208170 -167591 -183732
16842 -183732 -74700 -29783 107939 -21646 -113942 62237 38441 -56710 -42636 -58000 -141051
16831 -141051 -64018 -142733 -149914 -214930 -234650 -102626 53673 69291 6187 103127 166679
16820 166679 161533 107797 45296 -1996 -46594 -83528 -55517 5734 4524 59354 32427 31527
16808 31527 -114185 -178647 36303 28718 -104049 -198092 -60487 38803 57976 -226632 -316613
16797 -316613 -164536 -188117 -16551 226925 -30160 -188336 -247612 -98816 52974 2337
16787 2337 -224309 -219039 -226171 -343051 -266343 -153336 -119085 -50032 -91013 -128377 13780
16776 13780 151403 56381 52602 79538 -103067 -54952 -118641 -85758 -175758 -266031 -208031
16765 -208031 -53842 43657 65284 -94014 -96371 -106583 -97859 -64982 -4083 37152 -10441
16754 -10441 42550 -10703 -34317 -56779 -225284 -353729 -204890 -218197 -117370 -139657 -104413
16743 -104413 -35286 108264 109795 -28354 -45816 -22624 -60068 -188744 -205427 -96780 36801
16732 36801 147688 246367 12080 -200093 -170994 -108208 -166661 -114291 -174649 111373 220148
16721 220148 137457 163347 18860 -20611 -36278 -126313 -265584 -331467 -364524 -263211 -94161
16710 -94161 -147817 -99753 -142176 -73463 19149 -66853 651 -50748 -122812 47411 182195
16699 182195 117641 152314 109448 37055 -107830 -138014 6778 52343 322320 369087 255246
16688 255246 268223 271123 134470 77206 112930 78664 80146 69651 -101745 43772 305184
16677 305184 354233 90911 -67500 -55355 -142372 3640 129891 55985 41900 -67099
16667 -67099 -73117 -20110 46334 -81648 -160829 -399515 -171623 -51468 -59497 -46383 50591
16656 50591 51537 -111370 -65089 -117377 -135277 -151222 -184448 -146189 -115647 -165788 -300129 -224848
16644 -224848 -232430 -412999 -351243 -109548 -39316 -99922 -75467 -67929 3767 30389 50428
16633 50428 -24296 -89567 -196902 -218840 -205946 -161603 -29675 15736 -139376 -187054 -158415
16622 -158415 -85243 -164795 -130959 -67045 19678 112345 140760 -55048 -158417 -179387 -200841
16611 -200841 -116492 -109915 -218762 -329998 -215128 -263273 -190699 38634 -40025 -202876 -270074
16600 -270074 -153511 27999 -69054 -8798 -63475 -58712 -126555 -96132 -28855 22979 -44657
16589 -44657 -200414 -348433 -315800 -207014 -170968 -108203 -117163 -219153 -106264 -164293 -204084
16578 -204084 -123681 -250554 -285465 -37349 -31842 -84432 -56885 -3874 -93339 -118199 134441
16567 134441 322847 186853 41894 27309 20743 98029 139953 110282 159074 246902 168759
16556 168759 -1880 -111955 -10916 166934 -203793 -397672 -335511 -277963 -151997 20704
16546 20704 -20163 64325 1841 -42942 90973 215458 266508 221672 271055 199688 169380
16535 169380 216751 270268 188455 4274 -132742 -104313 53705 189652 172376 -5712
16525 -5712 42829 72684 28510 -1601 172874 297695 274603 196373 321070 205606 4579
16514 4579 -106653 -49955 18404 200370 173052 48787 109306 46657 -59648 -6620 27948
16503 27948 111138 180 -285149 -358032 -181000 61271 79960 38006 -32681 59857 -127019
16492 -127019 -152635 -232278 -135710 -67796 -152370 -268283 -274701 -288631 -230749 -229058 -402310
16481 -402310 -433107 -120276 58790 -16399 -128139 -126485 -92814 -154698 -292842 -383849 -354977
16470 -354977 -262779 -151686 -273124 -245070 -256159 -373223 -260024 -238504 -220971 -184274 -219632
16459 -219632 -197570 -143814 -145596 -164585 -277161 -246628 -168962 -306771 -439705 -409696 -312959
16448 -312959 -128287 -21383 -30385 30975 -189726 -364385 -186349 -84904 -165257 -182265
16438 -182265 -48038 44471 108856 75453 16051 -34044 -126605 -138992 -88110 47842 173171
16427 173171 54234 32815 -16048 -129305 -232224 -296325 -165642 -226464 -270188 -209514 -229289
16416 -229289 -62034 19238 8568 9175 -57813 1043 34187 -117987 -93659 -70015 -138091
16405 -138091 -79212 -135621 -182251 -125150 -177282 -196167 -111276 3769 -10298 -31633 -4264
16394 -4264 36236 -44108 -48593 -48327 -280941 -387365 -243349 -147270 -141470 11689 1165 -168119
16382 -168119 -65549 212833 264967 65248 136669 287517 201534 193692 179791 96229 -11302
16371 -11302 42245 79692 238578 220176 212762 142532 -39913 70944 115792 28450 -94877
16360 -94877 -128245 -143362 -19240 88498 174849 119367 115080 327341 434850 428550 192128
16349 192128 23104 -64517 -188727 -283834 -428517 -497337 -167376 27811 73027 9436
16339 9436 -46316 -251705 -167235 -60883 -2250 -10301 24037 -16626 24152 5106 -18595 -210854
16327 -210854 -346015 -345969 -202603 -246642 -259863 -315046 -226216 -161152 -183256 -14386 -39344
16316 -39344 -27796 12493 -108420 -102225 -29982 -136708 -242772 -270891 -310390 -272311 -107932
16305 -107932 -37 -150139 -118677 -104036 -65145 -69837 66591 -6283 116957 299783 263755
16294 263755 127562 248268 146149 125914 134623 34921 132203 130996 96975 -34053 -305485
16283 -305485 -307293 -63750 -45090 -325527 -218636 56530 197820 57442 -115734 -186506
16273 -186506 -29453 -168313 -109311 -10596 -100453 -216438 -129824 -15906 -57773 -113702 -233051
16262 -233051 -256145 -193324 -98081 22846 -37735 -121505 -291409 -150920 -198041 -284302 -376042
16251 -376042 -360645 -204233 -157176 -188154 -176037 -115485 3716 -45279 -47585 -142311 -315165
16240 -315165 -379510 -131643 98188 -38589 -29016 -67584 -87269 -139186 -45201 -113660 -17346
16229 -17346 -221499 -331936 -316814 -348285 -319743 -247506 -225121 -233902 -202400 -248139 -313731
16218 -313731 -309580 -283187 -195829 -115594 -169937 -93359 -106397 -211520 -169207 -145279 -237568
16207 -237568 -44891 139124 29414 18135 105731 63999 -2676 -69583 -180909 -243997 -111837
16196 -111837 130474 26775 -123434 -214351 -308939 -283396 -194364 25802 118432 58990 123036
16185 123036 241360 201179 119030 164199 93294 12753 -19095 -160262 -237300 -152899 -108166
16174 -108166 3249 -11698 -38804 36483 110829 92070 64941 86157 -124756 -254786 -214380
16163 -214380 -68410 -48353 -206817 -148895 -217004 -214330 -87420 6099 16694 -98676 -249972
16152 -249972 -273734 -149599 45156 72466 81420 -268 26871 71295 194343 141144 151440
16141 151440 132203 45579 14997 4058 202417 245657 174389 181009 292024 20572 42200
16130 42200 58047 117528 134130 48271 54360 17333 48005 105155 414404 361890 201802
16119 201802 57260 -157367 -247393 -175741 -68979 191491 369436 374421 258224 159376
16109 159376 -36542 -131417 -56984 -81657 -196791 -103410 113431 251188 380700 306052
16099 306052 165065 170892 53228 -220766 -256815 -207514 -221457 -359876 -278516 -186820 94849
16088 94849 168609 141379 100510 26999 -33283 -201643 -277011 -311806 -217794 -13435 137897
16077 137897 7042 -152229 -192931 -204310 -166436 -60085 8347 45317 38726 168917 21034
16066 21034 -241126 -177411 44893 97624 50463 -64779 -24396 184960 113260 77450 60057
16055 60057 -121786 -216293 -284430 -235112 -173206 -210625 -83469 16923 -13540 -54768 77070
16044 77070 96314 134542 58074 -81304 -143721 -76502 74203 250983 253193 87816 71893
16033 71893 66878 35019 -40021 -34001 -40632 118565 107887 62766 -65562 -166109 -163287 -131412
16021 -131412 -127032 -211008 -279835 -264066 -311627 -259033 -241514 -200463 -117312 -3338 -15533
16010 -15533 -145493 -85771 -89796 -76483 -135779 -93658 -191937 -99713 -70517 -16802 79924 -155076
15998 -155076 -330617 -229469 -130877 -1066 45054 23653 -24433 -136720 -225856 -178045 -245709
15987 -245709 -306964 -255170 -123444 -4336 40813 59599 14055 -49590 -92488 -276199 -281152
15976 -281152 -256070 -197794 -170333 -189240 -150136 -267374 -236811 -134371 -106552 -69241 20163
15965 20163 33312 -92006 -228725 -365874 -448041 -390543 -310159 -248180 -204043 -177102 -146973
15954 -146973 -238911 -284693 -276409 -85302 -24317 32990 74401 41084 -101278 -147072 -119477
15943 -119477 -100980 -289467 -238699 -58458 -67272 13326 141565 296902 159527 -58566
15933 -58566 -125796 -173666 -75028 292357 372435 194396 34762 198523 130466 -112807 -240997
15922 -240997 -198687 -215143 -143597 28912 43246 15628 -60444 -64039 -76692 -182878 -68026
15911 -68026 27792 -62200 -200438 -199035 -215553 -73012 88021 -302773 -439437 -282860 -90133
15900 -90133 -10693 -30358 -216720 -188188 -269862 -101193 -26040 -16853 -169518 -316212 -220976
15889 -220976 -114356 -232325 -401507 -185328 216674 171168 38953 -39927 -99706 -88057
15879 -88057 -70259 -173091 -126579 -185544 -204191 -222794 -180400 -31501 129619 88291 40118
15868 40118 68903 137082 73471 -73969 -33693 89106 55066 -106370 -132073 -142825 -13728
15857 -13728 135607 49137 -5499 -123824 -88976 -141856 -101293 -114800 -83159 -155018 -269359
15846 -269359 -259381 -245930 -213983 -243257 -104940 -18775 -63460 -218954 -402463 -252212 -43599
15835 -43599 -42765 -49538 46707 64258 -173767 -214638 -167859 -162275 -146213 -97841 52711 138068
15823 138068 36637 -82215 -235 98058 58089 134774 47015 -90407 -87353 -90884 -74450
15812 -74450 -11585 -37370 -61302 173164 395359 241729 176444 100171 113004 141410 -76457
15801 -76457 -269974 -198817 -213853 -316811 -209814 -142629 -145944 -13221 284706 229242 153256
15790 153256 180193 40634 -57687 -36462 94976 164349 97869 -81292 -142013 -60412 -40447
15779 -40447 93186 -41165 -106070 -261291 -385445 -338181 -233050 -245351 -334710 -290121 -74854
15768 -74854 -164128 -236549 -27366 142031 110013 48244 -13162 -80062 162246 198802 78919
15757 78919 76419 226171 317497 286968 209516 47062 -8705 -97154 -84395 -17016 110997
15746 110997 287453 172244 170781 210917 100148 -65376 -67391 -87961 -100362 -13773 -128491
15735 -128491 -235186 -298527 -152601 -57422 16555 27001 -88042 -185264 -214252 -235153 -211212
15724 -211212 -65000 26881 15923 -37910 -52579 -176848 -189187 -109407 -88231 -266126 -323282
15713 -323282 -254927 -269664 -240763 -144536 11712 80446 76028 -75896 -106735 -154419 -89524
15702 -89524 -44447 154828 225018 181691 77641 170604 188860 129011 140240 205260 282994
15691 282994 182124 22402 -55355 62958 81532 175725 136007 86943 -62569 -224832
15681 -224832 -354219 -355627 -232775 -165593 47283 11943 -192726 -54482 4277 -183524
15671 -183524 -184138 -62717 -52757 73580 169750 -51274 -112887 -98686 47337 85158 -52697
15660 -52697 -257687 -227889 -28116 -103006 -114534 -139652 -97823 158275 229604 184477 146727
15649 146727 312600 340663 237109 116416 196980 259241 117435 -31091 -52160 -117391
15639 -117391 -282908 -257922 -151663 30028 90939 14146 120647 137484 -69321 -220761
15629 -220761 -134250 -15005 -43837 -13894 65926 -135608 -275017 -233181 -133239 -103515 -72688
15618 -72688 -114659 -167166 -140852 -134457 -225309 -431048 -344110 -216182 -95928 -134528 -299753
15607 -299753 -228792 -81266 6452 -144549 -332210 -240762 -166804 2064 220121 290123
15597 290123 403595 255397 31425 -168572 -189950 -174779 -25079 126581 46186 -189436
15587 -189436 -301388 -228207 -87430 149750 139860 -241 -117721 -203216 -162659 -308866
15577 -308866 -172535 -62260 -104947 -102093 37815 80086 191962 87102 -88264 -164798
15567 -164798 -167285 -82578 24589 110204 6156 -63028 -105845 -67688 -97048 -197790 -175771
15556 -175771 -106739 -105095 -9428 -61061 -115340 -296200 -308592 -235684 -208821 -204294 -135225 -2755
15544 -2755 123588 157737 82843 183056 344874 247673 74065 1933 -19862 -27118 -40157
15533 -40157 -7703 -24731 -2635 -125097 -86577 20545 94047 244149 261534 16749 49066
15522 49066 160667 84185 82384 -70430 -92853 -125653 -15182 138008 163227 -53041 -36605
15511 -36605 20517 -25460 -102268 -188538 -296798 -185827 -183869 -37474 -104506 -108840 -154889
15500 -154889 -117418 54682 223385 361318 177235 8053 -15587 -66263 -195724 -181098
15490 -181098 -50224 -133539 -121946 -147806 -198847 -304098 -220632 -182097 -299361 -214032 80967
15479 80967 108344 140258 181149 137882 69241 48073 46642 26922 -23330 -145527 -174965 -73770
15467 -73770 -132352 -230657 -146520 -4786 -20156 -153426 -144385 -166756 -177228 -300167 -256008
15456 -256008 -113600 -258236 -411900 -242061 -265250 -440227 -345440 -240308 -24487 73108
15446 73108 -4484 -40891 32236 -52256 -120569 -249194 -307334 -230053 -190984 -197853 -126154 -14845
15434 -14845 -99455 -217551 -63256 26548 -110915 -142771 -234695 -223732 -160018 -434 -61593
15423 -61593 -135176 -121117 -106678 148313 208838 133975 12699 -89063 -349406 -335001 -280244
15412 -280244 -436793 -362884 -301354 -178500 -83777 -25033 -139130 -379913 -403152 -324880 -81877
15401 -81877 -8915 -36936 -204370 -119525 -44704 -93682 53973 351439 249980 136492 196810
15390 196810 275269 391558 384660 292576 182237 72089 -136911 -185968 -50065 -83258 -62467
15379 -62467 -102919 -160636 -243374 -218009 -204927 -304799 -509513 -392655 -106291 -17706 -87029
15368 -87029 -174390 -185864 -38977 144879 117344 -17785 -143027 -331589 -168041 -142682
15358 -142682 -57483 102203 60220 -23983 -117643 -160768 -137610 48408 21022 -186967 -223477
15347 -223477 -119997 -28828 -59747 -141323 -25684 99388 43625 -115672 -262593 -199581
15337 -199581 -36789 6329 -38951 12996 31479 -22743 -32592 -190932 -227746 -203200 -223610
15326 -223610 -230421 -120322 36743 103826 122594 174292 250837 229612 52520 -140310 -268309
15315 -268309 -230888 -172560 -189567 -123755 -112065 -36064 -136742 -68605 -73820 -177637 -140904
15304 -140904 205558 300202 111518 -38071 -142354 -41460 -82920 -221941 -330224 -198505
15294 -198505 -105553 -220710 -368161 -444375 -370558 -291255 -316340 -355316 -260675 -181220 -19523
15283 -19523 -49775 -227360 -157158 5572 -67923 -213106 -96153 -132733 -261237 -315590 -168832
15272 -168832 -119299 -110669 -65265 -128516 -50080 -80767 -22499 -112064 -162467 -109491 -178583 -210075
15260 -210075 -152370 -86466 -153348 -277418 -315665 -154634 -11978 -1101 -234994 -311259 -288170
15249 -288170 -161845 -194133 -228308 -169933 -174229 -94159 -118883 -328771 -484008 -213249 -137321
15238 -137321 -374935 -466995 -355001 -215713 -131640 -100460 -56060 -11666 72977 20853 -210779
15227 -210779 -190911 -243362 -186540 -170958 -273059 -222115 -201175 -153118 -97405 15220 -21936
15216 -21936 -260657 -365522 -141020 -74922 53216 162370 -242930 -326872 -59845 -82626
15206 -82626 -205627 -221078 -174265 -29350 -73345 -45981 -152853 -261976 -175359 -254380 -293530
15195 -293530 -386523 -370638 -156377 95469 196433 1745 -127180 -101112 -69082 -90747
15185 -90747 -147059 -200791 -115366 70905 109450 40938 -113209 -69971 54336 8832 -39271
15174 -39271 -174331 -199886 -43998 -147970 -304246 -222955 -252214 -181996 -61259 28478 178267
15163 178267 147353 41926 6412 -108887 -142048 -65421 -2491 82459 -97802 -172798 -173159
15152 -173159 -214187 -86040 -114737 -129041 -187258 -28921 67808 -182078 -187329 50941 83280
15141 83280 -213700 -416784 -309112 -246860 -259310 -267405 -286714 -275894 -272564 -91334 98983
15130 98983 140457 130909 -35835 -24620 14252 126702 127435 6666 -97794 -102371 -89430 -188880
15118 -188880 -213551 -288677 -247614 -98224 -46119 -125945 -303991 -373422 -423989 -545203 -527572
15107 -527572 -414986 -458706 -238782 25578 68851 -2210 9827 -127944 -280362 -351054
15097 -351054 -325829 -344306 -262796 -170397 -132557 -128618 -212894 -319733 -301807 -278460 -214718
15086 -214718 -51913 25028 9292 217543 119434 -105924 -100663 -128099 -354714 -381495 -14331
15075 -14331 52839 -101853 -184500 -187545 -56908 -88956 -162745 -191942 -376850 -296939 -129727
15064 -129727 -72728 -119146 -134342 -154393 5743 28733 -99548 -67289 136444 16806 -134863
15053 -134863 -124714 -137473 19849 -22922 -247303 -286854 -192418 -137126 -123224 112403 153848
15042 153848 57922 -3460 -122238 -261695 -206000 -194403 -133384 3235 105693 51556 65557
15031 65557 67406 -11385 63721 50117 -141247 -153569 -181858 -100548 90057 21341 -11699
15020 -11699 -19740 -62213 -153535 -149740 -179774 -199570 -113459 -60552 -44377 94823 108561 -112582
15008 -112582 -118525 -226076 -10856 102457 -127749 -135061 -18958 -81245 -95037 -107860 25424
14997 25424 76613 57343 -12923 -168682 -249846 -257349 -295808 -324988 -185493 -334834 -328660
14986 -328660 -406974 -461091 -305507 -182420 -99605 -227183 -459860 -383595 -385860 -265695 -163062
14975 -163062 -226569 -160340 -128684 -217934 -113565 -44957 64042 17769 -159867 -340748 -279166
14964 -279166 -246309 -175241 -167604 -157305 8961 181706 124537 156771 23578 3492 477
14953 477 -20868 -25262 -1636 43129 11057 -121345 -97021 -64061 -59241 2796 66469 -38247
14941 -38247 -272597 -202998 -40588 -38916 125976 54924 -65361 -130638 -46110 171880 92235
14930 92235 -49730 -113953 -60238 -73630 -149389 -198552 -229754 -116324 -239284 -177997 -82780
14919 -82780 -73115 -56814 -193528 -311480 -165956 -28559 -119413 -252058 -202910 -218396 -203996
14908 -203996 -166475 -141428 99589 272444 182427 13408 -211492 -117640 -208450 -348841
14898 -348841 -299197 -195486 -154545 -99989 55607 174906 107365 -16967 -145556 -81078
14888 -81078 -87702 -70168 110314 95546 62153 99245 162044 174899 53774 -117978 -216877
14877 -216877 -331504 -310164 -156635 -110715 16709 -139742 -267502 -346993 -293340 -195590
14867 -195590 -218155 -8590 152706 96031 115272 233503 249437 77352 1587 -129936
14857 -129936 -164973 -128301 -145649 -267659 -251019 -183856 -72599 15468 28146 75771 10530
14846 10530 -95041 -159254 -236484 -183871 -107773 -2897 -157864 -292632 -467756 -322926
14836 -322926 -172937 -155063 -169005 -97538 -26461 -73503 60127 178490 360795 274214 75140
14825 75140 -114826 -273974 -159206 2059 141575 81611 84051 8071 215434 345297
14815 345297 325604 230755 255042 116282 56865 -107651 -92564 5261 -24783 4404 90676
14804 90676 27115 -131135 -115656 -6475 -186390 -189534 50722 -26742 -50081 80635 32708
14793 32708 -143734 -253485 -227686 -182668 -194357 -172117 -172481 -113248 -13893 -8033 -26829 122621
14781 122621 119677 237939 219692 7443 82372 118099 119623 77590 89718 29542 -28111
14770 -28111 263903 455289 385293 410261 453715 340275 359220 508843 733087 944728
14760 944728 1127229 1200516 1480489 1730558 1766062 1474387 1290992 1137285 1006844 776728
14750 776728 546134 387057 407421 394616 242632 161310 33080 -6411 -134072 -213119
14740 -213119 -60101 -105703 -181829 -242948 -216759 31000 108238 50875 160601 121756 90633
14729 90633 24524 -154370 -154477 -259210 -348917 -121609 30963 100080 187593 318463 328047
14718 328047 197895 39941 14551 145088 151386 -3748 -120194 -118684 -44760 -10556 -114467
14707 -114467 -57477 -201350 -149371 -87173 48940 157786 12976 -155442 -90815 -69743
14697 -69743 -99169 -168770 -288507 -238155 -128647 -55550 -11606 -49912 78759 170202 191938
14686 191938 90374 56172 96354 155550 140182 250920 190809 116313 69945 201401 180658
14675 180658 -39377 -217821 -261215 -242237 -221392 -74775 -138192 -303153 -295016 -152965 30299
14664 30299 36775 -114150 -72727 -31676 -59823 -40642 79582 29557 27586 131616 146163
14653 146163 75864 277288 307459 197448 88618 124796 25429 37756 213534 309690 83607
14642 83607 -60766 -78801 123912 215172 246406 231875 208470 206394 229403 280551 170950
14631 170950 161872 66039 20526 -32968 -16029 152800 234327 253663 220204 185426 122610
14620 122610 92367 52289 117533 103508 -17629 -39880 -77423 19816 14356 24538 125255
14609 125255 241244 264729 146293 54565 54856 119943 196031 143624 -65416 76622 209596
14598 209596 93042 241561 257097 118706 -68190 -202292 -219375 -144343 92759 85308
14588 85308 57304 86124 92154 138053 132626 34756 -169517 -301965 -268125 -340530 -147961
14577 -147961 -143316 -215776 -112197 -75957 -104906 -122398 -30414 -41932 -131807 -176091 -174230 -139295
14565 -139295 -53515 88273 -25872 -120056 -104762 -88470 -133844 -131601 74683 120901 58981
14554 58981 182349 218751 154480 156452 99539 136046 229777 238645 131695 -22232 -192835
14543 -192835 -143129 -29588 227480 381057 274615 87430 -79710 -175397 -68732 -23143
14533 -23143 -86319 -61370 47513 103687 2344 -134013 -134814 -129018 -2594 58193 13946
14522 13946 48807 359 169640 306323 276216 76058 -147468 -164389 -228430 -244111 23368
14511 23368 87059 -105310 -97205 -151782 -137402 -200580 -124103 -49638 -47337 -205434 -234608 -130677
14499 -130677 -110401 78474 111334 60018 59715 284563 289763 165785 226968 253401 7399
14488 7399 -83314 136695 193987 175720 155812 178777 187383 202093 136259 212724 260181 66063
14476 66063 -6094 -552 91862 152479 264210 257756 -4592 44817 38803 -79479 -110846 -45562
14464 -45562 -17591 6504 59615 71463 -79084 32439 228284 298865 382437 288230 163557
14453 163557 45711 53966 11193 -23790 13044 82916 78763 -100951 -264710 -149238 -13038
14442 -13038 -6399 -38012 -1279 -68807 -221706 -200524 -49484 -51843 56359 79832 267416
14431 267416 288968 395245 318076 220343 245673 141408 -22727 -110049 -297775 -222232 -157291
14420 -157291 -134803 -72132 -79181 -166123 -323187 -350139 -450231 -556490 -395843 -278804 -199316
14409 -199316 -146434 -208330 -120712 -67000 -19315 172195 282917 232104 154696 99289 -1933
14398 -1933 114205 299890 424013 117549 -155965 -176891 -127205 -229922 -123209 147414
14388 147414 189349 305603 354936 152930 64793 107754 206022 206718 156214 62070 -88377
14377 -88377 -20606 32989 -55626 -170491 -17362 150924 131121 65913 74702 136173 96634
14366 96634 -4096 -244954 -306265 -506083 -434747 -228383 -153793 -61866 62643 36247 183304
14355 183304 182920 199119 152554 8492 95898 166242 59125 -146762 -200485 -79348 -71808
14344 -71808 -268989 -254828 -333431 -164401 80908 47336 -86373 -75175 -21273 -77498 -108900
14333 -108900 -36288 -58355 -213672 -339195 -162096 -82608 -83418 20000 -13237 -110773 -232578
14322 -232578 -159614 135034 276018 461753 317351 91097 34714 -236184 -303619 -228068
14312 -228068 2424 -32942 -227300 -238894 -165504 -29680 11027 -39304 92817 100568 -6988
14301 -6988 -187284 -304042 -118182 -137621 -211133 -252713 -186662 -204569 -327389 -314623 -258342
14290 -258342 -141992 -65776 36399 18532 -191714 -190508 -148034 -150893 -138212 -88832 -154830
14279 -154830 -187484 7065 4236 -40445 -200739 -148904 -159833 -105375 -126492 93412 47747
14268 47747 51673 153864 174521 106085 -18930 -114121 -56000 21269 169327 237294 416392
14257 416392 468185 326897 308091 441957 499807 594584 682308 646381 558316 241389 39774
14246 39774 -11313 112237 290012 273051 103492 260657 470150 263559 -111475 -166460
14236 -166460 -208271 -128150 -32301 29384 104842 265374 295458 271959 258928 268891 229754
14225 229754 385557 486627 403418 356644 247127 334841 381024 483062 464526 140298
14215 140298 -2397 21676 -82512 -54559 -47186 -76755 -104050 -2120 -11211 193226 279658
14204 279658 208451 216317 308853 258084 189194 87963 -36547 -197606 -188473 -91109 -87633
14193 -87633 -147031 -37320 -11112 -34542 -50441 -85797 -44006 13397 -47663 -125528 -83606
14182 -83606 14942 -3361 7494 47728 -152097 -171583 -224802 -230761 -95463 44836 -11747
14171 -11747 -9882 15350 193281 268186 202739 30343 -43501 -76619 -202678 -142468 93266
14160 93266 103726 130320 64742 29301 40598 35542 86228 69407 181137 222998 256822 347012
14148 347012 405416 297169 144212 189197 212776 190839 253197 348679 198730 123274 113306
14137 113306 268143 330638 317082 251911 169070 131037 70259 37573 39937 120222 64245
14126 64245 21473 91713 -14029 -11191 -4595 179686 487260 620858 578861 580382 481329
14115 481329 516932 538619 573625 767809 864447 974757 1075095 1177773 1188494 1231467 1392297
14104 1392297 1469229 1540219 1782923 1857333 1829357 1944806 1938475 1886036 1831585 1625322 1547714
14093 1547714 1414328 1253265 1397450 1416788 1294006 1056365 806692 742495 834999 936441
14083 936441 948426 1022767 950080 917210 942736 1014929 1000777 1000267 1114007 1161593 1247597 1491822
14071 1491822 1451591 1354006 1456545 1606810 1668180 1732664 1781188 1615075 1656576 1714246 1535079
14060 1535079 1336242 1205870 1199528 1214481 1103714 980413 1029555 1117746 1040639 1005444 880228
14049 880228 624109 457431 249063 284179 439559 529467 412914 292527 254072 359598
14039 359598 392720 311927 290218 213429 194135 226927 275202 105989 208892 155140 -38521
14028 -38521 43617 186606 258276 364854 351820 306819 257118 213898 237146 213102 152824
14017 152824 149072 230575 272489 209508 186620 258840 481675 453542 381954 190645 -98724
14006 -98724 -108550 -29308 -167018 -363237 -229748 68507 108887 -1417 -44868 44088 63610
13995 63610 100853 270660 266648 213639 320018 193242 -82755 -108773 -146285 -150313 -90964
13984 -90964 -146606 -38136 -7735 -142724 -319398 -129730 136663 220474 118028 -16329
13974 -16329 -78190 -82304 -146582 -76252 256474 373134 127301 72623 183803 326147 372076
13963 372076 196653 19335 106466 259930 447468 398447 542491 606004 525576 572558
13953 572558 679177 733454 750060 609818 509869 438470 467727 503968 628303 808218 829212
13942 829212 800532 931151 891869 714236 714644 777063 926058 951602 836038 680615 706214
13931 706214 729107 536625 463629 491513 582552 682909 596974 365112 293500 113628 154119
13920 154119 237754 228454 201104 265316 272314 251860 309674 406132 403733 267030 221277 319870
13908 319870 256801 255564 321845 453876 443942 281742 197543 74553 -8518 -64312 -38959
13897 -38959 26961 173169 238680 317272 329379 264545 246815 304346 316883 229684 83010
13886 83010 -24011 -69021 -187840 -322776 -210397 -7699 149160 42342 63743 -50749
13876 -50749 -137381 -82867 -2007 23265 98112 226084 274064 314484 283932 277377 204926 108664
13864 108664 150252 86400 -60675 -96076 9148 -66909 -40204 9839 58811 -55138 -63872
13853 -63872 -4154 41150 4387 6406 -16259 35470 100954 -51572 -263073 -253294 -28944
13842 -28944 2656 -6114 -39213 -43150 48980 170166 56800 17028 -195604 -212240 -109948
13831 -109948 94414 269687 123023 20964 -44786 85576 164009 176586 155980 249672
13821 249672 192087 204294 201194 100711 58088 155527 173013 169146 225723 275470 226456 85051
13809 85051 74160 183965 242183 300486 400885 380090 429451 215909 154975 203209 228721
13798 228721 171440 171560 295804 311403 64345 101662 141853 -314 -87820 42886 147540
13787 147540 152909 119255 57400 248649 445571 481445 462810 383017 398805 296621 411544
13776 411544 569220 557053 453778 461831 479533 470271 317975 43054 133980 266360 33471
13765 33471 -5953 -835 6171 69880 101809 112681 254925 285556 354991 262718 293545 369230
13753 369230 342185 253993 168516 174851 185944 174914 349089 457291 597813 519154 662941
13742 662941 629734 522669 500964 513859 391929 497525 641573 650304 585768 519749 672966
13731 672966 773046 807372 786883 867676 780782 638096 491069 495802 538545 594369 706165
13720 706165 676481 719305 642446 509498 402444 441441 520259 380175 411114 592380 773424
13709 773424 833813 832635 737248 744528 743213 821393 835727 865472 927895 1021197 1097947 1024122
13697 1024122 938431 861283 943508 945566 960188 1103275 1247188 1238458 1083821 1197903 1410571
13686 1410571 1623947 1753719 1714944 1718523 1774893 1847126 1922189 2050982 2319804 2641209
13676 2641209 2846164 3166683 3581614 3962989 4363473 4747186 5349342 6008831 6582231
13667 6582231 7298577 7997685 8867143 10005476 11471732 13050079 14835879 17185340 20006130
13658 20006130 23074056 26212729 29333026 32185025 34120637 34832035 34445662 33037671
13650 33037671 30755375 27737300 24611179 21657165 19072115 16828774 14805450 12978840
13642 12978840 11435760 10271549 9133027 8221015 7583451 6979807 6223316 5668582 5330646
13633 5330646 5166576 4764197 4253574 3970134 3786732 3540844 3131157 2786429 2574993
13624 2574993 2553161 2458634 2397142 2220652 2244500 2277916 2270808 2378340 2361196 2484173 2512510
13613 2512510 2400110 2253679 2215868 2268458 2141790 1929838 1728594 1676729 1762421 1638061
13603 1638061 1621051 1670946 1662059 1551806 1543451 1656628 1602465 1639157 1752639 1660144 1556246
13592 1556246 1525089 1463122 1332512 1326928 1439025 1526589 1527893 1539496 1515480 1563297 1599973
13581 1599973 1673304 1820208 1874464 1845069 1749417 1643740 1568081 1524938 1586163 1610098 1748855
13570 1748855 1910733 1875964 1959946 1893311 1934210 1831377 1874170 1881206 1922908 1972622 1906102
13559 1906102 1903593 2031675 2228919 2300104 2427291 2789819 2778913 2645103 2644261 2772131 2697817
13548 2697817 2799300 2976300 3052123 3236487 3442871 3692504 3854715 3797464 3957454 4373087
13538 4373087 4379935 4282775 4379464 4570603 4776344 5113730 5251392 5205895 5259758 5595505
13528 5595505 5945371 6271689 6745609 7108786 7471072 7823987 7980914 8344908 8798357
13519 8798357 9229527 9798662 10465590 10950658 11685626 12499745 13427356 14549656 15727558
13510 15727558 17081482 18400671 19871825 21628778 23779514 26054297 28459397 31436262
13502 31436262 34958949 38884777 43391561 48511947 54118466 60792091 68891001 78507370
13494 78507370 89730862 103289703 119315054 137966692 159435416 182511079 205674230
13487 205674230 226922104 243179534 251665267 251006937 241432468 224722930 203741061
13480 203741061 181263425 159390446 139445780 121925637 106635479 93618216 82753549
13473 82753549 73574768 65840284 59237205 53629236 48611243 44186571 40309058 36922455
13465 36922455 33782055 30917544 28519449 26325890 24377421 22733592 21117968 19673420
13457 19673420 18433366 17227825 16240517 15321610 14421402 13654529 12767063 12190734 11689794
13448 11689794 11133460 10706187 10199103 9864522 9387876 8777924 8316358 8163663 7989551
13439 7989551 7607846 7250468 6870682 6513782 6136101 5966473 5799239 5530951 5304619
13430 5304619 5003987 4787397 4491611 4288844 3967229 3857264 3787601 3683762 3498370 3162515
13420 3162515 3149177 3180310 3019330 2870158 2701052 2657915 2700185 2546980 2504148 2537474
13410 2537474 2311115 2065782 1991431 2021574 2065302 1982477 1874982 1815257 1715176 1845180
13400 1845180 1779905 1615520 1809991 1853198 1734765 1637077 1692977 1592239 1573569 1479086
13390 1479086 1587571 1600840 1595175 1583322 1602504 1402374 1270906 1312347 1130267 1091621 1105758
13379 1105758 1146113 980918 977354 1041408 1031282 939879 935273 906233 819505 746318 764620
13368 764620 673425 512835 551069 614120 662778 509545 361517 351361 542255 537186 434343
13357 434343 238257 109107 287937 489150 600147 586492 518660 609402 686509 638617
13347 638617 519915 515990 575272 672866 625776 679001 579227 418999 441753 406984 422509
13336 422509 526492 487044 619842 575675 677309 771538 693442 672474 508150 357523
13326 357523 355327 377011 401190 352501 342301 190156 449607 547653 590104 700242 648109
13315 648109 569451 571492 582407 523590 332887 190646 312485 419471 371504 439859 386968
13304 386968 361170 426004 385689 380466 372275 514160 365857 77501 100355 304945 370748
13293 370748 362051 342559 384605 362108 456293 375640 338651 283044 358121 375682 489333
13282 489333 455373 501464 386593 294004 407782 368317 349744 342336 366646 348331 359729
13271 359729 489519 620364 565920 596572 528477 579752 427958 411755 293235 249465 325088
13260 325088 303607 210528 42997 199275 370691 283800 321775 395106 600029 580028 529534
13249 529534 338015 153138 225182 252469 313211 234770 193272 287531 340218 361262 354747
13238 354747 434570 443296 293602 237544 82920 87406 206944 339680 403239 362473 186997
13227 186997 153171 183553 204839 146947 85325 164342 127315 191062 190424 118734 288514 357340
13215 357340 610245 572009 325959 191322 314338 438486 415785 411900 257667 217254
13205 217254 284636 247668 180423 262256 216869 224697 398964 465564 443679 549346 653030
13194 653030 619409 573651 584031 645017 674182 826322 755004 736112 692483 530488 509675
13183 509675 534337 516323 383286 310629 350357 412757 601197 352622 233937 269666 414101
13172 414101 738302 728477 532555 192944 160236 212727 267528 290419 500032 589420 560642
13161 560642 477208 400732 370435 351365 325129 369132 329928 268255 306335 354343 327589
13150 327589 359974 227155 253360 415282 324409 228287 327033 227028 168078 302273 418018
13139 418018 486600 412415 392724 420911 291195 223563 98216 88334 212723 259779 175226
13128 175226 171027 184951 78275 63332 -34867 34873 81469 139460 229846 88596 104677
13117 104677 154757 193512 175609 198306 96314 55445 -97409 -166678 12636 -22156 -115862
13106 -115862 -208734 -244342 -72617 135190 -30784 -138225 -116670 -189957 -80773 37816
13096 37816 41955 168103 237571 189735 230218 203608 -23106 -137716 -142123 -134562 -108744 16586
13084 16586 89190 69829 22026 -87171 -3278 -23409 -67368 -34702 -4996 -90910 -35640
13073 -35640 48626 169050 135447 -159402 -157726 -7398 76891 237765 299728 257001 57099
13062 57099 -148264 -92884 122320 234360 223239 118163 70878 -169545 -233688 -7082
13052 -7082 57302 -38921 -179640 -298047 -224648 22018 69198 218194 201379 177675 215271
13041 215271 225921 225226 119438 172235 164164 407591 576788 499119 479196 633204 732878
13030 732878 746795 745900 787062 714006 777376 1048916 1067216 879320 941211 1113033 1111305
13019 1111305 1026987 1061799 1029510 874927 722640 671183 587566 573671 472202 491272 462542
13008 462542 368530 326766 361984 346805 454469 445023 366010 314081 97141 85318 129318
12997 129318 101211 220754 249406 175648 71074 -27639 -43428 -63431 102846 54816 86211
12986 86211 -9842 105957 -58842 -154674 -152282 -120176 -118644 58561 70932 46914 144978
12975 144978 136136 57134 125611 211237 48572 12367 86871 78637 5573 -68539 53828
12964 53828 102650 151496 76720 -28486 103127 16268 -27609 -47520 165754 165020 83889
12953 83889 94921 142863 3434 -81214 -152752 -105798 27275 143553 298544 355464 195391
12942 195391 188080 178386 315170 377134 385602 438355 545299 501509 433726 280590 279579 217059
12930 217059 265432 262682 421087 431639 196951 377549 514947 551598 631829 519307 284391
12919 284391 209106 169235 200378 231617 263783 268942 220218 11996 -32090 176477 359067
12908 359067 341722 390361 490636 365824 259227 323986 443594 513838 567183 493210 414300
12897 414300 432675 343061 285343 271808 133732 149818 89208 67118 164712 278035 274907
12886 274907 141897 132167 130417 137400 268362 261668 231572 313658 203824 289213 291139 251278
12874 251278 90107 -148275 -105200 96088 266040 276607 412424 534781 570127 472200
12864 472200 222013 96559 110040 201952 334277 142380 -40746 -78384 122108 183796
12854 183796 89240 36177 -27665 32561 213897 289034 93775 1796 -121079 -172077 -271079
12843 -271079 -154251 -170160 -272360 -299704 -58864 -2101 9797 -267164 -321492 -152813
12833 -152813 26324 38085 170968 196469 152578 215259 254610 287463 158310 24649 78262
12822 78262 46429 23658 15746 -50278 -86052 -75621 -132954 -167868 -198704 122746 394384
12811 394384 260653 113800 -88279 -141268 -166026 -98856 34795 130814 331525 409933
12801 409933 265067 23412 -48863 -4390 -80428 -34257 -63913 15935 35498 -39813 8668
12790 8668 198847 166666 26631 -20778 85056 149996 167451 184388 178575 129926 133121 20973
12778 20973 69070 34968 29699 34531 94414 163879 33483 -30339 78433 60450 250188
12767 250188 215495 36812 -39165 -94126 -204113 -169639 -196188 82384 148633 180152 196232
12756 196232 164952 183388 80606 52723 44719 9151 59786 240782 285765 172212 208636
12745 208636 138289 66139 -145881 -282053 -250272 -97088 -25284 57543 133886 219881 273348
12734 273348 199979 149884 -60361 -128477 27879 72537 92494 56173 -26819 41231 131692
12723 131692 89805 102104 17026 -87691 -163523 -79198 7304 118025 105424 73062 9971
12712 9971 94144 324151 437007 233712 68262 201480 284459 305869 242687 115109 -18530
12701 -18530 -95098 53726 280892 218396 59099 -2098 204466 238374 158926 79686 30981
12690 30981 -96159 -112512 -87121 -241565 -157364 -69735 -32349 -87638 -72938 63391 123350
12679 123350 185166 153576 141278 8761 -82779 -140814 -31009 -137077 -191315 -231074 -267127
12668 -267127 51623 426875 353669 227499 276123 143266 138716 205175 39530 57271 278310
12657 278310 328054 175165 94885 150690 189767 328634 490145 456271 324261 140824
12647 140824 192749 172447 11641 -184822 -93657 -33469 45899 23133 89871 -49995 -85821
12636 -85821 -129319 -29893 47667 110949 154572 324869 200459 259347 313151 317494 224018
12625 224018 132596 61114 43763 -60399 -105059 -70312 -125900 -203024 -304373 -370097 -362418
12614 -362418 -272033 -218203 -182134 -154856 -145754 -156804 -58394 -78289 -112274 -155991 -94151 73123
12602 73123 -24282 14403 97004 48079 -195532 -284261 -103373 105725 66558 946 -90658
12591 -90658 -71375 66061 -15991 -16156 84391 86582 133720 182011 241631 27993 -154539
12580 -154539 -69656 -167164 -150803 -146316 -71291 -35798 22282 -3135 18062 42741 -7761 31865
12568 31865 90195 173770 126973 110025 231814 283838 312305 182052 -76371 -254801 -123692
12557 -123692 -73677 -70962 14533 173207 244377 178397 99227 78226 26410 -17797 -13682 -84188
12545 -84188 -70465 -106674 -159821 -164786 -139347 -311706 -69948 110097 -49820 -290168 -365474
12534 -365474 -384255 -312370 -270655 -274072 -252516 -65505 75006 108536 47672 -21200 -171211
12523 -171211 -136655 -36084 -64807 -185173 -124069 -59243 -108845 -87476 43378 -112948 -203230
12512 -203230 6320 36625 166463 194447 129777 -7738 -4377 -52556 4438 117042 157964
12501 157964 136274 155293 249158 225836 1289 -129303 47959 19266 -104716 -28094 -40251
12490 -40251 60178 169176 178075 318696 94856 8348 89035 206545 105850 93533 134808
12479 134808 79520 269 145968 276142 343840 269864 152409 162233 101538 181136 338551
12468 338551 125511 -61727 -115062 58549 269264 313282 420210 366906 74773 -43718
12458 -43718 -57051 111767 85268 -145475 -48149 3618 -149035 -255388 -145326 -56852 1222
12447 1222 101098 98866 139919 2697 -119610 -111423 -210261 -248612 -135735 -69946 -44340 -26427
12435 -26427 1852 -232415 -353870 -253491 -68927 8762 73406 168942 150492 119802 19769
12424 19769 122964 192189 214520 195207 181434 116133 -55405 102249 217624 234126 83387
12413 83387 -28545 18967 101417 181236 84845 -13104 -79056 -94104 -108577 -29557 -39939
12402 -39939 -54910 -121147 -145941 -55320 -10594 48148 82567 90658 35062 66991 41709 -58437
12390 -58437 -342420 -524644 -376288 -50646 111123 276810 208947 -192828 -171206 -87343
12380 -87343 -126678 -10112 77050 157218 240168 128325 61222 31760 94985 237901 139780
12369 139780 130884 199558 195922 130796 46865 77801 -6997 31279 -92124 -87682 -76506 -46551
12357 -46551 -26458 -6451 -3408 42839 94103 83005 152510 63696 -19069 -131168 -157759 -81940
12345 -81940 -50011 -2574 -22817 26400 134228 111332 33683 72665 153137 341830 470200
12334 470200 309736 133884 4676 -140965 -75545 -12307 -81658 -55447 -158261 -128256
12324 -128256 22888 48762 88185 136880 46469 127243 229810 60052 -118953 -41202 106966
12313 106966 110491 253093 308219 137054 230391 208378 125096 137729 49419 37756 161653
12302 161653 248954 320369 35114 -145350 -210710 -184839 -87946 29281 137530 204926 309888
12291 309888 462291 384566 338551 207760 269591 274709 202830 200764 147015 -85565 -74857
12280 -74857 52912 83237 100117 56328 153721 146420 192640 147098 214974 129876 252675
12269 252675 215089 19486 45442 26562 -133388 -223046 -89223 -56442 65611 -151606
12259 -151606 -38197 11610 70610 108149 -58183 -105844 54416 -39280 -144826 -52791 -125907
12248 -125907 -268174 -192336 58734 121486 123340 30551 73674 256784 192922 50786 3396
12237 3396 -125112 -88702 -169015 -63520 131241 21454 -64180 -140949 -55444 62120 246291
12226 246291 241959 246357 240057 179337 168155 156162 -6048 -247342 -273379 -178644 -174586 -245639
12214 -245639 -61317 109840 105855 148452 42320 -25430 76928 101316 104367 202211 200407
12203 200407 193191 47833 123244 147201 143396 78235 -102155 -161118 15280 124801 186659
12192 186659 379137 407947 246944 199063 254009 234804 191708 196725 182448 41558 -14142
12181 -14142 -177848 -164604 35217 49883 134644 291095 205579 108744 41297 8015 90831
12170 90831 216348 436263 549675 597992 800954 787972 638200 519858 419365 342314
12160 342314 373147 391488 403538 367412 437662 398177 269229 241492 218324 349212 452479
12149 452479 456843 372660 426109 247334 -28549 -188153 -129483 84664 86555 8530 -88380
12138 -88380 -158361 -116486 8353 140480 203811 80778 -3191 -12426 -12041 63860 64019 -66702
12126 -66702 -35156 57525 150563 167449 143975 182719 141777 327491 384398 364468 474164
12115 474164 499719 405042 380580 194942 146266 247891 179839 220681 150594 71851 184714
12104 184714 271268 287424 299657 301387 144722 65539 53813 85127 211698 245583 221425
12093 221425 229457 254141 382052 514762 415963 489128 406342 472847 431885 171858 110552
12082 110552 2108 -75717 -65766 147104 381275 472476 314654 225179 326655 367671 316723
12071 316723 155961 342202 454043 555448 503410 502786 480010 539163 472068 653870 736042
12060 736042 864305 946302 1047714 1071041 1204884 1334216 1268460 1126941 1138032 1027199
12050 1027199 1075335 1137712 1038094 933093 1024471 1103319 1131857 1232251 1185592 1033678 974281
12039 974281 968407 929963 1013982 783655 870674 745092 719272 737977 891447 963008 1046741
12028 1046741 1184005 1129349 976456 867168 987156 1018349 1039810 1030414 1116925 1203101 1249835
12017 1249835 1367585 1275798 1349881 1409491 1576336 1703557 1591482 1399735 1278199 1251880
12007 1251880 1233186 1225861 1365427 1600699 1651127 1692582 1497551 1425380 1613993 1727180
11997 1727180 1657930 1818533 1947543 1922505 1995627 2137911 2223598 2344016 2614841 2737075
11987 2737075 2676603 2740762 2873662 2837064 2924717 3106131 3253890 3382220 3385470 3420062 3611435
11976 3611435 3705044 3787733 4186075 4344409 4408369 4484958 4625871 5034628 5268070 5583239
11966 5583239 5951225 6312307 6676344 6909296 7222272 7621667 8241551 9034922 9533604
11957 9533604 10191204 10988508 11819198 12921506 14137454 15408955 16822231 18554440 20621184
11948 20621184 22977075 25932559 29360693 33374478 38052891 43712439 50723276 59468153
11940 59468153 70438045 84210583 101955822 125352176 156509071 197652137 250008522
11933 250008522 312565535 378481188 433597318 463553321 460774591 426283305 369380957
11926 369380957 304813726 245159390 196018410 157845054 128982346 106998832 90026403
11919 90026403 76681787 65996764 57639253 50752516 44844524 40014426 35934613 32303729
11911 32303729 29079596 26622484 24431222 22278884 20454634 18939106 17611598 16361360
11903 16361360 15270879 14257945 13218861 12260122 11458550 10791858 10279874 9823620 9325236
11894 9325236 8806175 8404785 7958270 7548033 7168271 6813913 6496828 6007704 5565448
11885 5565448 5295933 5031825 4860156 4612441 4446111 4173538 3983041 3712398 3624795 3463752
11875 3463752 3278125 2960791 2667525 2606057 2742825 2733909 2605115 2567690 2455528 2316147
11865 2316147 2179370 2114216 2104325 2261051 2174143 2047284 1993151 1791112 1761511 1643271
11855 1643271 1667707 1731403 1529422 1571531 1656379 1884802 1803105 1757025 1624772 1447388
11845 1447388 1342535 1216372 1276804 1168838 1141301 1240946 1280255 1288851 1286867 1241129 1183944
11834 1183944 1203800 1217814 1178061 1110304 1058281 1075948 891074 824829 764876 628164 699233
11823 699233 760346 871521 904717 689340 757940 578078 430299 370998 286911 324334 487368
11812 487368 310814 187371 123506 92473 117727 116922 95215 -121348 -300351 -218477 -87753
11801 -87753 51133 177679 363609 453059 495742 482307 470480 478419 444537 494663 555089
11790 555089 509443 370869 334811 170987 127745 133728 146310 432613 541193 542222 569979
11779 569979 684622 755086 622744 538824 606672 611619 566536 516204 662450 744223 717811
11768 717811 622413 521441 392818 352200 394789 298205 415270 413568 424413 450512 402468
11757 402468 366249 354730 526939 620213 538416 380607 341617 347967 433849 385309 256788
11746 256788 155365 196510 372869 320262 471256 396387 184112 86654 210883 182235
11736 182235 219853 318171 451507 438117 291311 169093 320593 495309 503683 382025
11726 382025 306174 269556 280640 286199 199539 59630 149146 273210 341376 250595 92919
11715 92919 200672 371366 504630 490614 465087 638427 795700 586093 345823 117412
11705 117412 -74760 -68991 104475 96813 23935 99833 248293 154543 71540 103048 174946
11694 174946 200930 195594 186872 111178 134250 302275 261989 275569 257873 390688 513024
11683 513024 561983 482727 330014 273510 251530 124075 66362 122249 176077 133804 208313
11672 208313 345829 525458 509864 425129 374845 367790 419109 497912 437595 320711 219992
11661 219992 197366 144464 257658 436629 350404 259498 401775 631617 612544 524664 592300
11650 592300 446457 393992 417824 511080 552842 492609 377769 562521 735530 840168
11640 840168 937147 916183 807488 723603 875806 997073 911394 853651 723916 554450
11630 554450 628493 775476 827066 762899 711261 593583 581179 637275 591968 369490 323761
11619 323761 304157 529291 725159 628647 616442 539770 366940 276709 412501 551720
11609 551720 277790 294355 355152 273462 111125 2723 -55734 38671 230934 244147 220680
11598 220680 328467 157646 -75188 -98825 -134406 -88232 -244382 -52653 127527 298743
11588 298743 178711 37107 45959 181370 -54457 -175954 -78352 120670 179808 118987
11578 118987 117147 155172 281438 239584 237108 325297 238717 -31013 -17607 152233 189522
11567 189522 114751 82606 -42421 -99488 -89105 74523 81948 45315 117652 165722 173530
11556 173530 178491 -7426 -93806 -59389 -107242 -216257 -19441 174257 77193 -37761 10322
11545 10322 227669 208286 31572 121890 271727 184280 77703 46594 -126706 -72769 -43407
11534 -43407 -75345 -79497 -22381 -78462 -232231 -205135 -83835 -195797 -59307 44706 -106617
11523 -106617 -50867 31953 118633 119474 147687 169595 20460 -130354 -269614 -236706 -158507
11512 -158507 -90841 -2111 30320 91223 67337 -160473 -138100 -2606 -34971 74287 164228
11501 164228 154026 59745 -58046 -29403 134732 -15670 -146909 -2701 -82074 -63715
11491 -63715 -22164 -32695 -123954 15856 29462 126143 45167 60236 -14398 -217411 -244807
11480 -244807 -160517 -98750 -127582 79287 447 -75817 -134925 -50143 -51451 -79238 -334651
11469 -334651 -396924 -295372 2843 35740 64996 -3399 -92687 -66550 -66682 -7822 63466
11458 63466 222001 25773 -216982 -243553 -9732 24108 59454 -11818 -54492 22446 -35174
11447 -35174 -104541 6264 86079 102722 -6054 -65776 -115759 -236105 -199226 -90998 81305
11436 81305 64569 61317 27987 111341 162623 60251 152437 5470 -102923 10376 -48288
11425 -48288 -10085 -17706 7535 48646 72139 72154 138912 83979 73235 33397 -108558 -184203
11413 -184203 -250333 -206961 -185820 -95755 71464 112453 158132 128968 86183 162570 202412
11402 202412 17260 49659 65609 8518 -56192 -22745 71399 -7077 81334 30537 -36466
11391 -36466 -149919 -131578 -190438 -276608 -197019 -79400 -74253 -79024 -44099 -79166 -283730
11380 -283730 -234480 -288490 -159968 53431 -38281 21914 47696 -83220 -94742 -89548 -173072
11369 -173072 -31262 64557 150136 206878 253202 133555 37695 26680 18218 61891 13471
11358 13471 -25203 165162 208009 153434 63327 75293 106863 73959 233639 126298 -101453
11347 -101453 -195137 -243809 -164621 -72881 109742 121648 129424 139895 81680 42685 -34473
11336 -34473 -11820 139744 131281 85395 96333 -62610 -313956 -326040 -205243 129355 106867
11325 106867 57350 84424 21682 -59758 49059 434 -175522 -103665 -64778 -224856 -144942
11314 -144942 -11808 29778 65771 97879 133628 100470 129308 274527 128088 -2887 117085
11303 117085 107317 100445 216765 162077 252293 236126 213030 256527 65092 -67100 -15275
11292 -15275 110204 256594 132762 71769 90633 106253 81567 46786 108954 65566 64966
11281 64966 130813 180006 -33342 -46785 -95394 -76204 -109013 -143126 -83687 -165189 -140931
11270 -140931 17695 37032 71677 -32280 -111161 -46969 -64292 81645 245347 187892 175527
11259 175527 50981 -137674 -325129 -121205 -40018 -99203 -111953 19721 5631 -28034
11249 -28034 -46840 -109224 37172 133215 31027 138229 165126 180617 158508 157982 220984
11238 220984 131294 141860 -7956 -111383 -169690 56111 65237 2913 72812 -34519 -142421
11227 -142421 -27308 121133 104387 160465 152783 127866 128098 -93003 -140680 86501 100085
11216 100085 54575 131534 91168 187222 198364 220284 197775 171245 288001 364031 304969
11205 304969 269498 116311 -964 -199503 -352673 -232709 -190025 -82089 99759 142539
11195 142539 155270 305911 616433 720481 526274 332111 314411 289652 92345 31966
11185 31966 88218 223564 333897 355486 89821 56511 181532 303647 202766 83484
11175 83484 74736 94008 -17115 27600 160208 171204 213518 142742 -51554 -73186 43146
11164 43146 60183 76167 204643 148745 122094 225085 229903 220160 47700 -38876 29669
11153 29669 222210 234096 249011 210813 83527 102445 55156 100183 124336 83072 165897
11142 165897 294469 159360 86043 91975 198708 147907 92777 -6297 83471 134676 97615
11131 97615 174888 227409 -18028 -88225 -26925 51466 192912 204968 200391 86335 -114973
11120 -114973 -142478 70137 78887 -99547 -137463 93642 253333 345261 148353 -114597
11110 -114597 -245316 -172737 -76048 40511 -71667 -136951 -186032 -14544 41092 94437 54639
11099 54639 97321 164315 85826 144258 176664 313560 265926 187365 119791 -88539 -21060
11088 -21060 -40946 -106049 -97634 -123707 -259274 -273832 -170373 -278174 -317439 -318836 -208924
11077 -208924 -192522 -193549 -29554 -26202 78623 203446 86069 -124789 -125442 10719 69760
11066 69760 -62806 90541 254387 164373 152516 168060 120529 220701 270066 122925 284759
11055 284759 350436 85615 -43419 -3172 -175583 -81248 -40074 17103 41303 -12796 -25881
11044 -25881 -156306 -76880 49056 201771 172003 326278 482540 561010 641014 738669 652990
11033 652990 613913 671059 591821 452527 398657 551850 769507 1004972 1329292 1380610
11023 1380610 1328815 1381447 1379082 1371599 1174913 1040183 963890 906382 1127094 1303061 1435831
11012 1435831 1599290 1485535 1210455 1205767 1219909 1168382 1142089 1107974 1108407 1252294 1406081
11001 1406081 1413539 1297530 1166165 1085428 1094774 965329 811921 794728 675771 598568 637993
10990 637993 820434 845428 608407 410595 268253 260595 267397 265901 355331 461346 450971
10979 450971 510989 457707 450143 574857 351723 198168 -41692 -64350 142768 290496
10969 290496 187770 161189 12381 18978 24644 5619 37341 -50105 -30661 25160 151874
10958 151874 279984 122053 -43300 -153144 12060 159017 268493 217585 44481 -35622
10948 -35622 39374 -23451 -35509 191610 174499 175139 398151 600937 622908 568516 515540
10937 515540 518677 300675 99309 69856 235352 271313 99218 151908 438358 326365
10927 326365 65480 -11120 -29834 50606 298759 314738 171786 147767 107025 112817 157458
10916 157458 -69693 -51363 19539 4900 -88716 -145643 63220 108959 -15929 -48124 114937
10905 114937 237601 345061 196601 188401 197194 79880 172021 98558 -29704 -100696 -64551
10894 -64551 21829 -80904 -123562 -28265 -100000 -91722 -1517 -107680 -19665 3242 15223
10883 15223 38956 -69500 -298955 -51468 152644 174121 177407 134960 -3701 93170 240146
10872 240146 244854 58306 -61805 -233030 -286836 -163975 -36988 -38683 -86268 113511 192375
10861 192375 202804 223442 293299 236142 32698 -75360 -55886 133885 99734 270340 396713
10850 396713 247327 100282 7124 209913 271033 356861 414994 412695 162661 62178 105849
10839 105849 177712 272387 280111 238543 125621 234919 343131 194402 -22743 34541 187260
10828 187260 208932 103850 -23873 23130 93506 135649 161969 266902 252221 295841 398093
10817 398093 270159 383694 363405 318687 177689 108168 162490 269172 384618 374774 329943
10806 329943 195191 231309 258222 210764 180014 206859 127733 -53138 -109339 -34658 -93644
10795 -93644 -156321 -113173 -113500 -163861 -110006 139624 470661 410684 224178 79984 -67203
10784 -67203 -7865 -16047 54200 150411 198761 448429 546634 333672 164781 34395 39365
10773 39365 92555 95769 87680 244225 461807 497280 547230 457887 418870 497052 600095
10762 600095 688698 770391 664647 527492 536299 440877 484387 489785 540606 681689 835524
10751 835524 743136 681049 471114 451162 597537 508627 449608 520776 487097 422695 369117
10740 369117 392852 647562 918812 958874 1021057 1034860 1037027 923387 724835 912516 1213207
10729 1213207 1337583 1234839 1146174 1144384 1324393 1456439 1465513 1370987 1588726 1804483
10719 1804483 1937116 2030351 2209223 2290454 2367138 2625172 2992960 3259847 3548918 3943364
10709 3943364 4400687 4770155 5185080 5751233 6391841 7114308 8070428 9083063 10370107
10700 10370107 11929406 13859072 16573160 19869663 23916960 29065695 35424998 43260225
10692 43260225 52819290 63269585 72236931 76890132 75607278 69169925 59607087 49619190
10684 49619190 41058310 33906181 27994246 23361402 19930358 16993515 14707188 12916431
10676 12916431 11428075 10306826 9369555 8382692 7633645 7212929 6566536 6184544 5623421
10667 5623421 5101444 4576567 4248290 3993483 3760275 3726141 3605538 3486114 3404546 3522191
10657 3522191 3404578 3078815 2944820 2805575 2863074 2856697 2782023 2829025 2847596 2899806 3253502
10646 3253502 3525758 3667813 3749028 3835692 3691115 3366043 3253330 3316757 3378715 3181924
10636 3181924 3064793 2969942 2862677 3036095 3250715 3491220 4003272 4252376 4355760 4831836
10626 4831836 5543573 6289104 7145183 7741065 8279111 8791955 9198208 9772658 10717849
10617 10717849 11757201 13239007 15545847 18587670 22700778 28035970 35088340 44468058
10609 44468058 55861685 69193792 82310888 92393358 97715699 98042929 95433206 92648500
10601 92648500 92047680 95656521 104360986 119618398 141506589 168174486 193481552 209948555
10593 209948555 213439801 204954516 189497567 174377168 165299050 164587674 173181252 192055375
10585 192055375 220528409 254034078 283062529 296976166 291018942 267942288 236111346
10578 236111346 205701970 183069866 170201039 167269678 173387676 186827217 203281445
10571 203281445 215826102 217360255 205606893 183604594 157138575 132914089 114770709
10564 114770709 103339193 97621108 96668242 98842052 102105599 103346480 100212717 91771356
10556 91771356 79501488 65818908 53006383 42663782 34619825 28640147 24304765
10549 24304765 20820828 17907912 15745984 14006991 12686953 11465308 10454268 9617339
10541 9617339 8863889 8283026 7717679 6935667 6450058 5929395 5488768 5061337 4787463
10532 4787463 4716843 4410091 4195828 3845562 3577820 3597902 3468340 3265054 3133650 2917369
10522 2917369 2715775 2561448 2365894 2148775 1901908 1788915 1727489 1667118 1406783 1135676
10512 1135676 1172592 1188699 1203007 1085030 1014196 934175 931051 838960 858021 915021 1008371
10501 1008371 920436 820950 884079 877289 648660 751301 851871 734129 556297 579976
10491 579976 482017 467376 384550 357486 346459 526186 608599 586379 568812 509643 505479
10480 505479 451033 381710 306903 219012 278016 307027 229017 295291 275684 250951 263541
10469 263541 429512 437968 325664 395742 421440 377964 411066 255239 -64950 -24152 1513
10458 1513 33761 54495 -25686 697 -28406 862 4903 67698 -6200 23222 2485 -177845
10446 -177845 -36278 297162 514527 454460 160340 26503 105793 181084 100747 185170
10436 185170 96938 118545 307491 425253 324038 256957 294505 305867 324883 424029 413898
10425 413898 374518 243087 207563 254816 495193 473640 387403 327508 260179 189563 -40621
10414 -40621 17859 74291 171443 104408 240550 319610 242872 229481 149331 61448 64395 335488
10402 335488 526507 479822 435340 368991 339660 210488 259208 379596 469559 407211 421108
10391 421108 472104 352139 324622 387669 401237 424374 226727 30658 5284 82838 206087
10380 206087 241892 372173 303849 438094 462935 484021 573138 404703 270592 164732
10370 164732 48659 -39694 41468 323907 432342 223580 102491 165198 162528 171463 208293
10359 208293 243227 262239 311712 212954 48955 -136866 32649 116336 86733 12761 64500
10348 64500 74448 90151 70831 64582 -2435 32184 104078 341888 413268 548545 670359
10337 670359 514834 238288 -12078 -116369 -135202 -203103 -51659 25267 16859 45397 -113549
10326 -113549 -176780 -73250 -35830 86508 271222 239050 230422 261163 224987 149599 108993
10315 108993 91862 38760 15200 49826 92378 43108 -41664 -86681 9750 98713 257937
10304 257937 266047 297543 287579 157837 166424 165768 164792 63409 35945 99689 208399 187110
10292 187110 129809 105257 159246 108227 60261 22945 88033 -18476 -131127 3380 126360
10281 126360 244147 379867 286136 177414 257327 378542 424871 360406 182482 10681
10271 10681 -73203 -157499 -166207 -63614 -187072 -310488 -185867 52073 120783 163279 299010
10260 299010 263794 174475 186465 -35923 -63498 21983 -130506 -312688 -174382 -72296
10250 -72296 -29299 -70201 -190374 -152402 -179233 -238486 -23403 -45103 -47174 76475 44802
10239 44802 54566 160437 173740 210243 337658 429665 460721 379066 285665 312521 308656 198628
10227 198628 109997 151246 154790 168714 119935 -65724 -58126 74473 183688 114191 142131
10216 142131 147010 225684 109493 212882 282496 248551 221628 273116 283668 274821 210770
10205 210770 107299 221901 289138 99968 5234 -42345 -5878 -12944 -59731 -59124 -62748 -113504
10193 -113504 62905 65860 34973 -3560 78926 105035 13961 63041 134429 -6855 12722
10182 12722 -60972 -4269 187315 333413 405931 364724 327222 253196 51962 78033 265994
10171 265994 539237 736942 619267 540851 489097 304472 165253 242410 413235 417630
10161 417630 526315 715556 813525 948727 1160579 1213873 1173289 1120327 886611 856006
10151 856006 1002940 1200006 1336812 1403343 1569981 1849852 2002273 2023055 1683270 1352012
10141 1352012 1258425 1115025 1024091 959854 968755 948467 1056652 1183890 1167571 1068810 919423
10130 919423 724477 558309 462852 490417 544991 555995 591629 502931 596678 548440 303864
10119 303864 153999 197622 311667 308603 235414 81437 183259 84348 -69810 37932
10109 37932 96778 39227 -53238 8720 -4609 -109959 -60469 123801 171353 197960 128651
10098 128651 -15892 -224295 -118617 -76008 -119453 -163156 -241566 -134333 -147325 -166557 -2063
10087 -2063 43927 -19435 28394 -28631 -120837 -147211 -69417 5088 -89344 -214414 -166192 -124997
10075 -124997 -15619 56145 101832 292555 223563 87212 -23177 -81222 -70436 40581
10065 40581 140809 121921 32436 -79970 -62294 38556 113818 86707 -444 6051 -16940
10054 -16940 -22924 -4255 91860 193216 278067 238764 118631 146177 176499 133102 96811
10043 96811 -15121 -97134 -58826 -261365 -232771 -129974 -3615 71855 125370 124104 181523
10032 181523 177143 69753 -106913 -119455 -213729 -281713 -339645 -276613 -47652 25677 -34361
10021 -34361 -15924 21908 59165 -102241 -458275 -561583 -462027 -343522 -289710 -340906 -232466
10010 -232466 -139883 -31235 -171434 -127078 -65491 -202319 -318194 -206841 -67502 -68717
10000 -68717 -78617 13228 76023 -67134 -126702 -95767 -32568 40405 -138626 30289 225669
9989 225669 248056 271540 201020 155969 201626 234376 64977 -28537 110894 122899 85208
9978 85208 44738 -22848 14227 133812 161557 162817 19327 -139546 -107340 -23904 85091
9967 85091 10815 -172717 -279940 -86600 100927 59015 -42532 -33456 22828 162933 134643
9956 134643 91133 48755 -67411 -186440 -348102 -205765 -74927 6030 64659 41555 -40355
9945 -40355 -11830 -5662 59835 -29543 -181588 -194140 -148831 -103869 27227 56467 -47107
9934 -47107 -214340 -339814 -163238 -175930 -129334 -18307 -161571 -238510 -147988 16166 49639
9923 49639 175641 176531 169853 193239 153229 -5532 -58631 40514 32913 75620 201846 315788
9911 315788 181790 252698 190265 110058 118779 184101 113584 226534 233486 220247 130051 -39922
9899 -39922 -161148 -8502 -3729 -60138 -2637 14581 133520 224379 321536 250842 225690
9888 225690 104852 114501 18210 -64506 -82948 56150 -49231 -147079 -88591 7892 -90977
9877 -90977 -95241 -217766 -289735 -352718 -228859 -184828 -180016 -131427 29765 60307 -137693
9866 -137693 -146839 -11508 -5737 -20862 103423 221357 120767 37315 -69867 -188441 -199857
9855 -199857 -173497 844 10413 -47329 -165120 -344675 -228612 -66496 -79712 -137314 -145771
9844 -145771 -267569 -321949 -326247 -132094 -35606 -100635 -224411 -203377 -182338 -158158 -159626
9833 -159626 -72397 16321 135323 351027 384643 32599 -122326 -224465 -150145 56158
9823 56158 163150 92335 35371 21084 -41402 95014 189224 219643 185007 190574 123198 -223831
9811 -223831 -300048 -333561 -384604 -202669 -101905 -128789 -103707 -91456 -61957 -3027 -65906
9800 -65906 -102473 29065 42826 -155017 -130493 -38698 -310 -35201 -82101 -25979 -57692
9789 -57692 101005 272168 106593 174812 85348 -30713 -40529 -114332 -154819 -35881 172174
9778 172174 99724 -203978 -276818 -282251 -364724 -249902 -178989 -369583 -348036 -191991 -80015
9767 -80015 15729 88733 16267 -31520 -107185 -121704 -156928 -187278 21736 124414 -82557
9756 -82557 -273087 -249734 -228207 -78236 101203 246871 332907 280176 201287 -17419 -92543
9745 -92543 74648 155434 5897 -277770 -362405 -209631 -76085 -66259 -63793 99741 41797
9734 41797 -2236 -226699 -230242 10742 175501 65998 -27705 28693 26822 -37461 -150641
9723 -150641 -65084 -54619 -48893 -50518 103273 67600 16894 187102 54168 79256 99708
9712 99708 143440 156200 165735 93385 41213 -37089 50137 120933 254646 270251 238040 206811
9700 206811 145886 64219 -58925 -192137 -215403 -60536 119253 156099 70008 -66140 -34541
9689 -34541 -69927 -193169 -114396 56584 164880 128869 169376 324359 421434 389699 226056
9678 226056 241744 249908 136970 -166352 -325684 -439213 -338462 -174000 -12118 -102925
9668 -102925 -78787 -96294 -153015 -138355 -120873 -316131 -252433 -159060 -40361 238486 196020
9657 196020 348212 206026 73961 96120 179414 138121 162928 265307 272241 381463 843649
9646 843649 1313849 1721763 1874073 1759948 1277818 867176 592378 410830 382763 194283
9636 194283 167244 279277 188350 -153922 -49639 31306 51001 75965 150896 130794 117376
9625 117376 172174 167721 4507 -115784 -221663 -196111 -169030 -149702 31730 47235 99128
9614 99128 -30300 -64089 62159 141209 198439 208229 211405 278128 267109 282735 225428 215363
9602 215363 159994 84562 -17680 -15319 -58588 -78953 -123450 -105306 -153561 -208071 -94490
9591 -94490 76370 68015 -14316 87410 27376 -252072 -323456 -240490 -167439 -121978 45249
9580 45249 163664 217485 264404 326384 246664 74934 -14727 71870 115785 19843 -179225
9569 -179225 -242329 -196918 -226311 -173203 -137206 -138547 -270141 -111848 -23940 200349 224115
9558 224115 184961 131837 -76793 -103932 -112883 -70603 41584 -41914 -134400 -163562 -161842 -72853
9546 -72853 78278 39961 -248006 -308931 -150695 -162421 -180884 -127506 -22971 57819 69701
9535 69701 60731 162513 104970 195886 208967 204650 71995 -36795 5017 90888 123471 40698
9523 40698 80710 218191 237499 215292 160637 130701 -2278 2641 -183241 -100376 83756
9512 83756 30362 -2405 16876 73707 83470 76486 -29739 -52673 -41931 -88482 -59865 43821
9500 43821 59217 -91724 -136194 76967 145109 203611 163318 11705 35180 93960 266710
9489 266710 209319 296785 323045 112989 -72085 -205840 -170764 -9500 -12357 63755 197458
9478 197458 217627 24310 22062 67247 12797 -69632 -97649 -58925 -52534 83415 -20320
9467 -20320 -59650 75025 137921 125376 -105931 -162960 -41202 -5112 -102353 -258396 -176840
9456 -176840 -183127 -120425 -166311 -188573 -159086 -255781 -324424 -273426 -44390 136179 193699
9445 193699 7852 -94383 -198032 -99155 -183026 -100850 23106 43812 135341 198472 89270
9434 89270 87743 37411 -169111 -176103 -52832 87785 86764 140162 163282 74194 18407 48321
9422 48321 173269 148136 252940 205859 151117 195666 165286 -65307 -22784 10141 63296
9411 63296 -7119 -179439 -167223 -21541 69387 2359 115654 161100 -133366 -134733 -77078
9400 -77078 -64456 -38340 2312 44651 79863 -33509 84465 336814 251888 137510 47244
9389 47244 -37435 -84781 -89795 -131728 -170917 -133019 36818 53736 37455 28466 142691 199703
9377 199703 142714 255609 188023 39768 -52762 -82194 -12600 27256 114262 156411 92788
9366 92788 -102874 -100548 -59614 -22799 83012 -59318 -122958 -16930 23408 -149061 -206616
9355 -206616 -233627 -251115 -285550 -15854 108969 80885 67230 45703 70393 -29876 -68205
9344 -68205 1295 60615 84772 68045 -5562 -108836 -18838 10346 93172 157970 103235 52804
9332 52804 -160092 -88949 -24199 -160175 -199623 -96271 -152886 -165033 -5809 103456 20003
9321 20003 -213171 -288382 -94236 41130 102233 27334 50395 5192 -115549 -62505 -86735
9310 -86735 -29122 -108566 -32369 -24202 -82801 -309379 -305906 -269746 -420204 -348713 -259451 -198071
9298 -198071 -127698 14664 195493 236547 113937 52710 -32258 -59314 67904 114141 254384
9287 254384 416204 425668 292437 -6643 -324805 -298670 -250480 -227696 -256335 -137603 -55787
9276 -55787 -81097 -126324 -197880 -146839 -24587 43035 11963 -121443 -171374 -162325 -33122
9265 -33122 90477 47932 -12191 -258708 -444585 -496306 -430830 -269582 -286330 -335243 -213285
9254 -213285 -136904 -141236 -169001 -164834 -54083 -151961 -132329 -129724 -51291 168150 65075 -132783
9242 -132783 -200004 -31478 55189 148722 150351 124242 179031 181416 177790 73280 116961 129958
9230 129958 149776 69433 58397 71904 16512 59731 235971 260737 53690 -59073 -296612
9219 -296612 -449384 -399944 -308824 -235482 -45109 -122382 -170267 -267111 -491148 -454763 -358364
9208 -358364 -262797 -234717 -115895 49231 -206005 -319352 -275171 -353979 -344310 -312632 -179394
9197 -179394 42932 160690 28962 -160314 -389820 -267222 -36104 51337 2161 -108405
9187 -108405 -185886 -95987 -93715 -163372 -120615 -80792 -184183 -122987 -73271 111473 240901
9176 240901 97573 -6363 -38551 17564 270867 409142 277722 108555 213777 154755
9166 154755 18786 -3608 -72318 -32197 17363 82466 57119 -133407 -93785 64022 152864
9155 152864 45899 -34608 -28456 14965 36172 84488 75962 66734 2533 29236 25769 -118706
9143 -118706 -197755 -96445 40779 115898 983 -81931 -49151 -286258 -357597 -194101 121446
9132 121446 282658 203125 74135 35390 -101440 8892 60099 34318 106530 225260 269842
9121 269842 276422 198975 104665 32518 -21457 -100795 -221737 -135903 -119975 -116217 -106358 33639
9109 33639 203977 240573 105747 -85629 -43605 -30310 6054 66782 44039 2996 185969
9098 185969 167916 -599 -156485 -129283 20767 115389 106193 137278 75064 68030 199949
9087 199949 145348 143142 199160 121601 74246 -18210 -156477 -263788 -251941 -228579 -83506
9076 -83506 -190826 -208165 -150664 -9928 42180 -114311 -77304 2042 154210 126073 54355
9065 54355 7255 92237 31405 145430 103557 32187 -156892 -105634 -89492 -244396 -142652
9054 -142652 -24680 62734 62713 -109566 -223846 -271478 -398419 -284563 -235055 -48696 122042
9043 122042 -180653 -395055 -326365 -110616 15548 -1790 -128113 -239367 -188407 -50390
9033 -50390 74500 70957 -72917 -10798 94766 194468 -48849 -161890 -166648 -43155 -44869
9022 -44869 -190660 -171034 5171 -26499 18514 -11421 -35552 -58683 -41206 -85321 -226710
9011 -226710 -421870 -84869 83184 8101 -62580 -112594 -105936 -37370 -109310 -156955 -160490
9000 -160490 -103296 55353 6735 -74874 -172322 -328731 -346599 -399884 -307647 -99247 123621
8989 123621 192539 125681 90815 125722 46772 16288 88548 -1601 48706 231049 262844
8978 262844 151106 -27561 -195764 -190100 -103228 -37738 82061 -16260 -158194 -232657 -185919
8967 -185919 -36249 295 -170648 -209172 -127563 -37562 30739 22779 -47689 -137829 -263067
8956 -263067 -230658 -84876 -18447 27194 -34514 -125921 -84985 -27880 40245 194305 166362
8945 166362 106970 119400 253219 372940 322722 177536 177909 29352 147477 304698 70069
8934 70069 -81234 -38951 -65627 21303 25005 34478 34956 43343 -37327 -100267 -196393 -110261 88648
8921 88648 89087 144684 -64125 4733 184168 253191 150136 196975 142145 -14661 -168023
8910 -168023 -223662 -249728 -87422 70324 77676 11120 -175288 -364868 -348832 -413179 -389282
8899 -389282 -396083 -333511 -190549 -80464 -102494 -50466 -63283 15692 164514 298741 233838
8888 233838 167038 5611 -74529 29959 78811 18343 103827 142079 -25683 -110931 6379
8877 6379 96527 39552 40735 110102 216032 256268 226947 205557 212212 172294 27481 -72289
8865 -72289 -146564 -132339 42708 150908 194247 76462 -6943 141365 122903 -31343 10923
8854 10923 31930 120946 51003 -48125 -113895 -130253 -194953 -143792 -146055 -112541 -91657 -129308
8842 -129308 -266177 -316002 -229657 -183811 -16117 -69207 -120890 -39807 44421 116177 163825
8831 163825 4038 -18680 54546 85302 -70009 -113251 -2795 74657 128414 70986 21696
8820 21696 64523 119918 -104947 -129477 84806 19429 6794 -157417 -241042 -211077 -191630
8809 -191630 -74011 -93855 -70232 109703 -60817 -250700 -303024 -108352 11387 -19302
8799 -19302 -107306 -31757 117123 7513 40809 136304 188095 -57688 -58062 -37656 -3767 -119462
8787 -119462 -72370 -53864 -229609 -273251 -98237 -87547 -179230 -86624 -6450 117417 -21510
8776 -21510 -114269 -189556 -155170 -50274 99510 72894 66374 77879 396991 480144 239867
8765 239867 44766 104173 163563 183753 237642 162455 23252 53647 74430 -8570 19220
8754 19220 -11538 -160324 140077 172015 83866 -80263 -140829 -140123 -136455 -283066 -203603 -173644
8742 -173644 -33629 154365 13515 -156750 -323711 -332596 -223421 -184851 -164549 -173535 -263083
8731 -263083 -230929 -136118 -204465 15148 85036 99793 72018 90086 -99548 -133017 -89491
8720 -89491 89534 43497 -7435 81417 132913 -71607 -126215 -47918 39491 22121 -52227
8709 -52227 17765 67980 87836 48980 175220 -11459 -148840 -195658 -114302 -74978 64471
8698 64471 68895 -61403 -73145 -68210 -35483 36347 83902 159400 223026 129096 11779 41764
8686 41764 19951 39586 97462 122984 103316 161028 39031 62983 144437 198425 123290 107280
8674 107280 268149 264777 112139 8494 -85476 1323 73406 133132 253096 219307 196315
8663 196315 88431 103185 29084 -56336 -119500 -159089 -102270 -127054 -71927 -44636 69176
8652 69176 265214 201154 -18974 -20422 -20202 26326 54154 40940 12140 7306 885 44772
8640 44772 201625 166078 107498 31005 71445 141275 72022 29361 -65500 -114485 -81766 177436
8628 177436 268550 76811 109152 -80341 -118937 -186653 -256391 -78816 -74957 -100566 159105
8617 159105 152532 83390 -121812 -230767 -133599 -77423 5671 -54916 -105372 -172076 -77098
8606 -77098 11326 -35856 -102306 -192887 -324891 -409585 -271284 -190031 -145889 -166543 -64787
8595 -64787 126041 198881 232350 331730 410672 231179 116495 85478 133947 136898 217755
8584 217755 239222 211520 191820 306121 146255 -31205 25543 128228 179847 198769 176117
8573 176117 85375 -25780 -124459 -104946 90586 177540 154735 282638 305059 250348 238504
8562 238504 200268 175262 148192 79999 95037 157111 169750 182220 58632 116363 174364
8551 174364 252495 346577 322275 334278 428000 378607 168724 -29034 145500 246480 183320
8540 183320 228677 186475 178844 232699 267314 258550 169150 -11227 -8278 -21692 34507 138675
8528 138675 275345 211042 52877 -122156 -260085 -165630 -24620 -1342 77162 136084 118575
8517 118575 -74921 -85220 -53781 19429 72332 42161 -47118 -185214 -204280 -135587 -100204
8506 -100204 -78876 -95449 -117640 -57081 -92544 -103346 8203 127507 8181 -171387 -80017
8495 -80017 -29642 -67893 -30504 94864 154075 67841 86433 49078 -53649 -123784 46645
8484 46645 153822 181187 155567 275288 279082 220298 142135 103351 144874 197902 129226 16968
8472 16968 -66826 -104553 -88470 111785 229465 109251 -90348 -58426 -26169 37678 252885
8461 252885 124377 11414 -86869 -150150 92135 130539 -66222 -137519 -178879 -147807 -90033
8450 -90033 -220129 -201895 -163432 -232037 -148044 -67422 -88362 -82455 -34928 -99118 136661 173774
8438 173774 225171 234181 245818 178864 209857 286572 300642 368137 196195 94216 19740
8427 19740 -55808 20957 261641 216078 29646 -54479 125113 244979 224696 212847 64173
8416 64173 45804 136277 35984 -43487 -259884 -86646 45711 -44903 -175623 -172485 -108283
8405 -108283 -130531 -105188 -95690 -165776 -215916 -147117 -155063 -177461 -139245 -42985 15145 68787
8393 68787 86896 235590 191791 42190 40549 161623 35307 -72492 -17320 -57469 -43608
8382 -43608 87690 40577 -229198 -292250 -105060 136274 284545 233192 75964 -125497
8372 -125497 -327165 -220634 11658 148700 180374 142030 47302 9081 103906 212684 174463
8361 174463 201342 204098 193231 182541 46002 49708 28266 -98000 -291679 -318830 -252358
8350 -252358 -108917 -24429 52591 155790 274809 178372 125412 155503 171856 91060 -28599
8339 -28599 -87307 -55902 -52751 16266 101521 11219 -102251 -29864 147684 222115 235007 396396
8327 396396 353389 146083 -35572 22813 85641 -53119 -83742 -92949 -121649 -255678 -295862
8316 -295862 -310644 -194413 -171740 -110327 -34792 88181 181309 209698 284360 242076 41407
8305 41407 20102 149396 208463 239613 248954 212069 -467 -181440 -173999 -96172 11232
8294 11232 23939 35753 116609 256416 59246 60017 297271 476894 335407 190585 298102
8283 298102 281765 197699 237766 187857 61034 28840 166833 228009 340921 319636 141667
8272 141667 -44258 -89982 -115520 8669 -23914 -45147 -17639 -18080 175182 206564 224758
8261 224758 130779 -20544 9177 8042 -24716 141872 340283 403255 405120 465018 523196
8250 523196 507794 411193 115096 134780 253851 318678 373158 311477 347709 473977 373182
8239 373182 200612 183309 192444 265534 300305 326796 228206 356741 327574 258385 206591
8228 206591 120634 -5309 -109334 -251579 -206766 -132242 -20620 4646 96276 179609 128970
8217 128970 95197 76214 -83088 -235140 -200924 -2630 20972 90199 -45558 -207101 -94772
8206 -94772 -30335 -183626 -122126 116687 171857 126989 192321 223600 80876 -27024 111888
8195 111888 128295 18979 68241 83304 36375 -109614 -228619 -125621 85349 32202 16607
8184 16607 -96816 -224126 -287128 -289546 -315346 -192152 -153471 -203257 -147615 45216 163849
8173 163849 129532 30773 -9140 -26304 -31439 -44874 -171624 -141223 38289 194963 290994
8162 290994 365444 228735 216257 120226 42171 42212 99956 133188 105671 95930 57532 133729
8150 133729 195470 188636 177171 331802 298546 256153 309285 244709 194998 228427 155855 42549
8138 42549 -48490 -89161 -66019 -170874 -206198 -28048 -9171 -251522 -326938 -201690 -158704
8127 -158704 -226262 -260386 -372990 -244010 -99787 -114742 -282996 -263384 -227719 -192550 -217773
8116 -217773 -131712 -29450 -2426 53424 148140 64394 -36367 55668 180612 147452 186510
8105 186510 -1797 -254732 -278593 -442027 -477385 -273863 -72525 -144390 -264472 -329770
8095 -329770 -193462 -251945 -154344 -88072 90976 84001 -123507 -90139 -41759 -179547 -288543
8084 -288543 -369415 -382901 -263719 -290544 -223211 -209264 -74092 -39190 -104563 -206208 -200112
8073 -200112 -161863 -163878 -35274 152651 282157 250424 106442 33125 -8979 -23884 -146729
8062 -146729 -184135 -225925 -174714 -208118 -243635 -238177 -243704 -157006 5288 -631 -122791 -116171
8050 -116171 -172360 -118379 -71776 -141111 -222505 -111613 -27861 25349 35177 20834 163797
8039 163797 302304 311777 423305 341168 219669 194704 138411 164270 -70724 -53220 -82176
8028 -82176 -243291 -204304 -46847 -78224 18841 9055 51718 118245 50438 92483 36733 111200
8016 111200 65168 21658 -91838 1774 68378 17271 114336 182477 151035 -25916 -4522
8005 -4522 -59670 133469 152268 76651 -99422 -46782 104806 4761 -75951 -152233 -169095
7994 -169095 -174020 -141200 -198168 -283423 -88847 -63483 -25276 -10469 7245 -32075 -85696 -217795
7982 -217795 -262961 -196830 -126094 -53386 -17454 32740 47100 112257 24988 20060 -67698 -250224
7970 -250224 -276887 -174248 -208833 -151575 -122736 -41742 -10444 -88931 -10446 -152335 -172963
7959 -172963 -212151 -121399 -129257 -66947 34830 -68605 -64570 58472 -177565 -263042 -180623
7948 -180623 36611 157740 153610 10351 -51753 -119410 -196687 -144473 -14031 109434 33160
7937 33160 107525 90059 28167 -51346 -77113 -149907 -188097 -64038 -28875 -6525 108486
7926 108486 -39701 -203011 -89774 -45914 66037 6725 -95238 -142061 35321 93797
7916 93797 -6576 -15308 -42488 32872 61726 25453 -29534 -59088 -41793 -192564 -95553 -72735
7904 -72735 -75677 7641 197388 164617 93719 74968 -3356 -2084 -161330 -191727 -193900 -222252
7892 -222252 -100066 -114852 34109 49018 -72143 -106929 -134127 -129135 -79265 -231512 -175458
7881 -175458 -29734 -67784 65735 66395 93586 -69 -145882 -295073 -262465 -236736 -94759
7870 -94759 27584 -140915 -240459 -254042 -304295 -177893 20366 -94622 -245601 -136742
7860 -136742 -173926 -58378 22987 -44307 5230 131223 86144 -41155 2782 -5651 -113425
7849 -113425 -98253 -89126 9677 -26936 3399 -38581 -102421 -215919 -281620 -236956 -14184
7838 -14184 106060 -7243 -229678 -320705 -125282 87601 41894 -30127 -68391 -86623 -84512
7827 -84512 -125460 -147276 -280015 -284718 -201867 -134829 -45042 -61007 -112807 17390 3672 -69046
7815 -69046 -70126 -137219 74311 12675 25540 -87829 -166570 -49304 55209 15657 78562
7804 78562 168025 233639 261616 66628 11730 21711 -56951 -343888 -409770 -315796 -288855 -333087
7792 -333087 -378037 -403805 -359227 -114322 -159240 -62746 159745 50780 2449 99134 80390
7781 80390 56633 75912 72254 -133395 -201197 -93547 5105 6136 -146489 -193037 -132664 -66891
7769 -66891 6381 -48740 -30652 -34872 -203608 -83859 12007 27408 134599 121993 63657
7758 63657 101187 71932 20474 53543 91871 3606 -20209 62314 -58486 -79808 22601
7747 22601 -74682 -314367 -229022 -142756 -133017 130344 228170 253587 127979 15933 -37511
7736 -37511 -178581 -245066 -288702 -182281 -35004 357 -28472 -93739 3003 -88908 -126756
7725 -126756 -77259 -151169 -232064 -164842 -113945 -128153 -6330 74052 -25687 -42436 6835
7714 6835 104641 89583 -52541 -67220 -114033 -57047 -82457 -11514 84130 29781 244938 297027
7702 297027 66808 -114622 -129953 -9890 -6132 90467 50402 -14218 -34270 -89294 -166477
7691 -166477 -209054 -148012 697 -20993 34507 177144 137906 79821 157375 55685 -84077
7680 -84077 -83256 -93409 -95710 -197238 -197870 42681 60098 -203695 -363132 -366188 -154095 -147276
7668 -147276 -178539 -84408 -10342 119279 58928 -162854 -168538 -64486 -112672 -218757 -113959
7657 -113959 25660 -152776 -159843 121499 209068 90938 13470 -112603 -80067 -24873 -2603
7646 -2603 60338 42901 -50109 -205604 -158039 -116288 -95946 -198477 -299926 -212824 -105859
7635 -105859 -278320 -368497 -272953 -247721 -70750 60780 39064 134375 159028 119085 25516
7624 25516 74271 61562 -34198 -61176 -197630 -93369 -56762 -93721 -30486 -122375 -114694 -24479
7612 -24479 80887 -44211 -343045 -594701 -503194 -191470 -16223 -11504 -89500 -178818 -333553
7601 -333553 -241933 -86156 -78346 -100903 -231001 -290089 -255816 -281936 -367039 -299668 -207322
7590 -207322 -335522 -384968 -123684 -15479 122796 31841 -56233 -103116 -163257 -122126 -159600
7579 -159600 -311333 -392683 -178045 -76954 -106896 -100789 -227304 -77723 43891 -106967
7569 -106967 -94522 88752 159289 23707 -37866 39487 124271 104216 218261 269155 -35145
7558 -35145 -205734 37363 148960 -36378 -283999 -416497 -353550 -309993 -177011 -174560 -259882
7547 -259882 -132683 16374 -144372 -271182 -159937 134218 144773 63024 -125587 -145703
7537 -145703 -108807 -67670 104266 141908 -28611 30594 98315 221552 223314 223453 137927 -68870
7525 -68870 -139427 -196022 -196266 -279975 -337154 -226659 -119817 86140 -1879 -127695 -268214
7514 -268214 -226658 -214981 -200973 -211009 29482 136054 146884 -36293 -188319 -108585 -36318
7503 -36318 -37914 -43446 -206847 -269243 -250798 -168120 -12217 -105887 26697 155212 -35211
7492 -35211 30018 222589 283073 90283 -81378 -36913 88892 121267 15918 -45736 -181870
7481 -181870 -34263 103872 112938 47759 31191 -66604 -173145 -369394 -419805 -383161 -244613
7470 -244613 -169727 -172494 -287314 -419165 -339855 -234964 -332715 -293376 -241375 -154109 -179496
7459 -179496 -101928 -83244 -175321 -134626 -62565 125 5034 -56416 -164202 28287 132598
7448 132598 134668 -54286 -240161 -171992 -67548 -64391 -56592 14745 57691 111395 41882 24051
7436 24051 24531 41739 115501 165144 140246 -20975 -93997 43642 101886 167148 247267 210540
7424 210540 38394 -89175 -32734 56927 -7206 117337 -53573 -3366 27775 -126098 -23547
7413 -23547 131507 257157 125931 -14834 -145299 -158195 -268222 -316061 -129040 8708
7403 8708 95980 -45293 -47609 -145240 -29497 135497 87025 -131799 -203566 -292049 -142388
7392 -142388 155173 -10299 -47840 -98287 -145416 -143968 -195450 -241487 -129987 35211 126019
7381 126019 147833 48434 109401 284275 415981 309126 189704 183389 58382 79876 76304
7370 76304 -51243 -204398 -84355 38842 47246 46138 75826 87576 96849 -89658 -115043
7359 -115043 83802 -43867 -107400 -40486 -50865 -69138 -158588 -261817 -42517 143526 68313
7348 68313 -116372 -136261 -179736 -7493 61081 115057 282981 203965 125152 245603 146848
7337 146848 136839 147235 228544 68403 -66191 -84141 -65409 -76290 -149115 -57835 -4742
7326 -4742 3795 89760 98661 155982 -11434 -29077 -13233 -13125 -93417 -63076 19348 -16689 -39895
7313 -39895 -103390 -135060 -74207 -134344 -127360 -59660 -174804 -214976 -144302 -8735 -119383
7302 -119383 -96053 -63546 -33284 -172747 -87626 51816 -128118 -128900 -31034 98276 312044
7291 312044 274530 81488 -45480 14595 22020 -118632 -123822 68301 97007 21531 60240
7280 60240 146797 144688 50888 8632 -25345 -172132 -218536 -96421 -29580 -100918 -132780 -78354
7268 -78354 -11477 -61216 -122585 -77263 -29503 192021 237628 161095 -4745 -28457 -77922
7257 -77922 75686 139380 74975 -41765 42832 252761 274294 129072 112443 -2128 166
7246 166 -10203 -116643 -204115 -237910 -44489 -89286 -95258 -36326 -129934 -211778 -219246 -90242
7234 -90242 72149 -89358 -47777 85643 134653 89188 104011 37825 -98400 -177164 -247710
7223 -247710 -303702 -384148 -462195 -368378 -281875 -35277 -22154 -8865 53729 106559 141691
7212 141691 112978 17548 -39556 -68644 -201662 -144737 -70410 15134 -38748 -26316 -85102
7201 -85102 -106619 -191551 -330103 -326659 -192739 -75326 -137564 -68927 -6697 -120419 -217120
7190 -217120 -214841 -227152 -200272 -148120 -4582 221669 276709 252466 253896 217172 137624 81625
7178 81625 42721 4896 -17668 -164795 -230817 -135708 24380 -79242 -84711 49511 74237
7167 74237 153988 216042 269602 171895 9702 -95351 -180887 -182164 -134630 8496 177486
7156 177486 123423 -46620 -292958 -237592 -100918 124189 88256 125504 123548 52789 3925
7145 3925 62518 48830 -69711 35911 215831 312584 331245 247667 74637 20562 81195
7134 81195 88394 65924 19631 -50774 -97524 -212689 -178290 -223760 -164814 -182913 -324130 -273683
7122 -273683 -283114 -359684 -239620 -122342 -40046 -11896 -22462 38269 91346 36008 56502
7111 56502 -73128 -50036 47912 40262 57506 70435 156552 200282 316675 158400 45621
7100 45621 -117328 -164332 -204993 -87980 -131627 -114314 -211308 -174425 -226570 -272531 -297207
7089 -297207 -100671 27179 29118 -159537 -305563 -109885 -199630 -421009 -371469 -179540
7079 -179540 -149219 -249456 -179514 -96451 33940 21299 -48854 -45265 47882 70342 -34817
7068 -34817 -117228 -132187 -64002 -164105 -314154 -257867 -91670 19416 9195 -188618 -97993
7057 -97993 -57596 -30603 -111657 -205102 -192512 -258147 -253620 -134062 -72209 -116828 -172526 -201654
7045 -201654 -212794 -179217 -318943 -375094 -248375 -300984 -123956 -72089 -356055 -514295 -374903
7034 -374903 -262753 -200527 -39671 -69710 -54246 68334 -54621 -117494 -130281 -77472 -28712
7023 -28712 -29103 37508 -11682 -87531 45790 58490 -59745 16034 174413 186170 232623 72847
7011 72847 -87012 -51453 24713 -177955 -184838 70215 235862 154328 288910 358042 136444
7000 136444 -139815 -98923 -119297 -68423 -186634 -199593 -132822 -35605 41698 -64411 -163858
6989 -163858 -77764 -55779 71147 137993 32151 -51646 -58660 104049 175829 37069 -35732
6978 -35732 -53463 43322 16522 -232221 -148535 -148685 39861 44807 -110075 -69077 -167515 -215669
6966 -215669 -299964 -360327 -371735 -299439 -84249 -106811 -92730 35692 56778 31502 -77829
6955 -77829 -65335 -87586 83908 151282 44762 76088 -2905 -91235 -241180 -296620 -337100
6944 -337100 -214765 -81734 21671 58988 -98278 -110417 -142569 -131303 -95107 -16897 -47824
6933 -47824 -20412 59721 22980 -85135 -6686 63096 -100859 -252463 -215589 -18113 82776
6922 82776 82565 156451 122990 -27164 -185319 -283742 -237569 -92052 57342 -55398 -31913
6911 -31913 43759 -71176 -35404 112894 84202 -23598 -88272 -144797 -120947 -244704 -279145
6900 -279145 -95004 -57722 -136752 -51205 59971 -19378 -124489 -120130 -137761 -50920 97683
6889 97683 38349 -247413 -269069 -189746 -55508 -47229 -95920 -152852 -276267 -329417 -168495
6878 -168495 -116279 -180561 -95624 -93387 -29709 43987 44787 -42077 -42120 -114415 -239847 -213577 -247644
6865 -247644 -240108 -220687 -294086 -301682 -320554 -371010 -274933 -207241 -379426 -260068 -43254
6854 -43254 43922 80735 179312 176452 130346 83953 146080 109949 -202132 -111979 178664 318806
6842 318806 87052 -11929 119275 73250 80196 95294 -83397 -22377 -197757 -155396 -104729
6831 -104729 19868 121886 44407 10214 17024 -57005 20045 64545 -76630 -22581 20961
6820 20961 21946 -3171 -43901 -159099 -127261 -85617 39828 275063 167784 -16586 -100994
6809 -100994 -17920 127159 61251 -23264 17060 86881 -62782 -265346 -233530 -87868 -158468
6798 -158468 -1676 -25589 7931 166550 127076 53429 11756 25948 63706 -13548 -50882
6787 -50882 104093 291499 274519 177552 125447 105500 168757 121990 156349 232873 268396
6776 268396 268996 167803 26323 9570 -28757 -85938 -206464 -220709 34613 239953 186554
6765 186554 -17236 -36313 285 120202 142176 35914 37346 35205 114188 144696 133017
6754 133017 296648 198887 -30330 -179268 -119705 -33558 77612 242787 -4534 -328011
6744 -328011 -403261 -340425 -234186 -163839 -97242 -21949 -13521 101058 70465 845 -179654
6733 -179654 -114012 -57834 -168365 -194323 -278333 -104147 81071 148611 101237 144769 21187
6722 21187 -211503 -358784 -178651 -35854 -29306 33756 -95841 -261633 -213632 -95383 81519
6711 81519 199003 289924 415512 311945 87189 -13245 72329 123785 72669 -77928 -115566
6700 -115566 5550 188567 270938 179354 135309 -3233 -4777 -115352 -280798 -293628 -128122
6689 -128122 -44059 -959 74937 51625 -24704 -47692 55526 -97923 -172549 -77423 154114
6678 154114 221834 174970 229013 285323 231975 100801 12206 49565 11117 28944 114311
6667 114311 110053 82064 192579 311364 340149 253570 174432 93520 148200 137186 307910
6656 307910 390700 279699 172745 71866 142094 245318 154043 86665 107920 18522 17046
6645 17046 35643 136474 178889 184481 147723 -1349 -18814 -95159 -57984 3940 82038 202547
6633 202547 281944 194211 208567 207288 41109 -175111 -387990 -246304 -109752 -49649 196004
6622 196004 187736 153597 52949 46341 151995 127936 -15725 -58997 -167855 -124878 50957
6611 50957 -62280 -182911 -95880 35689 -55621 -211643 -168897 -101158 118879 189005 185150
6600 185150 67938 34286 96182 152931 114316 3801 -13820 -47243 -117345 -50224 57749
6589 57749 143313 145633 160119 -86926 -196479 -218639 -374827 -249569 -145228 -51440 91453
6578 91453 -16780 -28811 -99366 -219195 -154610 93989 213642 215311 51626 48160 -101220
6567 -101220 -205330 -312203 -219360 -163497 -1050 -76595 -77386 -36328 -142971 -164906 -230862
6556 -230862 -193439 -101142 -203859 -358374 -219202 68602 42579 13843 -45647 -130121 -179292
6545 -179292 -69959 16449 -42973 75268 66805 -121483 -177148 -141212 25820 118682 -20732
6534 -20732 -108263 -69300 -5449 -32230 -161215 -58521 -43810 -80425 -151883 -234189 -76539
6523 -76539 55981 220644 219294 2811 -130373 -223833 -114234 -190187 -186697 -197745 -147625
6512 -147625 -71593 -13860 -110773 -97031 -84472 -22312 40889 -94733 -186656 -124554 -85474
6501 -85474 36009 -26132 -164774 -152648 -169932 -292776 -280204 -63157 47108 -125151 -274016
6490 -274016 -182086 -62294 -244204 -234941 -162780 -78893 28435 6892 -41975 -70670 47974
6479 47974 85322 8447 6632 -45833 -65607 13580 -25218 -178452 -96925 221022 225882 95253
6467 95253 274663 276968 387027 171578 42189 4991 40833 137622 51458 -17462 -144900
6456 -144900 -304481 -211117 -113108 -68888 97485 170829 347170 324233 332202 158143 101587
6445 101587 329656 198310 81267 230233 238330 117298 15988 -119266 37713 84442
6435 84442 -52175 -262305 -298013 -228774 -197537 -48971 46007 168675 101976 41993 -163705
6424 -163705 -146981 -35162 55769 99285 -138931 -253554 -141240 -57598 76064 71942 -48064
6413 -48064 -112539 -174478 -148365 -28752 -9463 18409 -12267 -149360 -158162 -100731 -37898 -118529
6401 -118529 -45468 10217 -37270 -113075 -130485 -87812 -71475 -16183 253633 392131 442526
6390 442526 245619 185759 305954 219193 98725 42455 75810 149068 -125716 -330718 -314627
6379 -314627 -414678 -388218 -266796 -261929 -304622 -93604 85042 -127766 -86798 -70935 -16522
6368 -16522 88126 -10575 -176219 -299081 -57766 75375 21193 -13406 229226 332776
6358 332776 279975 110354 121758 14249 153798 271998 111910 52996 -19456 -116020 -286311
6347 -286311 -194824 -123246 -178167 -155936 -66484 40555 107695 222649 286147 256401 1105
6336 1105 -238280 -261998 -245970 -245631 14594 139051 -35499 -270624 -216416 -134780 -227943
6325 -227943 -175804 -222865 -252877 -179938 -229699 -217885 -166728 -180163 -376429 -491856 -387737
6314 -387737 -112109 9497 5555 -156899 -246763 -219146 -98969 -130586 -273245 -274908 -332921
6303 -332921 -245204 -39886 -114501 -188295 -31737 54971 -19415 -162742 -277657 -151665 -8569
6292 -8569 -18672 -104413 -90706 -117106 -223497 -216398 -152388 -58195 55340 63323 -54061 -61104
6280 -61104 -104688 -156550 -257349 -365247 -515429 -434380 -243337 -224410 -212827 -106057 -93953
6269 -93953 -98660 198979 398394 253888 233566 301504 162286 7165 -27533 -18075 -45706
6258 -45706 -134792 -74920 15425 -74021 -141177 -246973 -324839 -245265 -148300 -98468 -74048 -185773
6246 -185773 36697 93556 -8358 -193136 -252867 -373458 -309340 -193210 -96834 -141293 -223259
6235 -223259 -184495 -91435 -62053 -72115 -176314 33034 204821 161196 71170 61694 -51533
6224 -51533 -48473 -3923 -254959 -259864 -190537 11525 164175 246047 304929 264516 373052
6213 373052 408202 412951 300334 369973 369203 205950 -52270 -240767 -298227 -272142 -53565
6202 -53565 115285 -56118 -249099 -288493 -92989 48567 38029 18379 51894 163216 296720
6191 296720 217120 174621 370902 261918 138753 14991 35752 72241 85066 -108249 -182065
6180 -182065 -94443 -79570 -54032 -118459 -172639 -128471 7960 209415 219876 204906 14656
6169 14656 30671 -112250 -80795 -12165 108035 53156 -111162 -140584 -258663 -264611 -301186
6158 -301186 -151749 -5958 -40363 -89784 -132626 -41097 -121207 -212048 -214183 -89758 -66132
6147 -66132 -130005 -133065 -76302 -32015 -52714 -149443 -17934 73493 137764 165965 76138 134693
6135 134693 -1610 -133426 -259574 -163644 -126546 -92482 -98530 -8500 -153497 -237846 -175019
6124 -175019 -162258 -27761 -234196 -380242 -325308 -138109 -59767 148554 129203 38684 -17842
6113 -17842 -61237 -318019 -620723 -590930 -394584 -280703 -279192 -130431 -67833 -81444 -152459
6102 -152459 -95787 34430 5633 -270688 -214778 -145055 -207135 -320916 -317892 -288363 -113752
6091 -113752 -5899 -48578 -191679 -309868 -295695 -274853 -311579 -230283 -152387 -57092 -7803
6080 -7803 -1441 40140 -85780 474 249128 252866 177227 85448 -55181 -69426 -97587 -72548
6068 -72548 -14986 84140 126320 192289 340220 351403 106561 108196 170117 156631 102214 -126193
6056 -126193 -45178 -38535 -74975 -108606 131218 257171 47091 122540 64338 -9770 -100547
6045 -100547 -129882 -91327 8827 10825 92696 152782 97367 -88429 -113373 -110715 -272026
6034 -272026 -256995 -122923 -83288 -202732 -191849 -166961 -68759 -30229 4569 -100644 -174241
6023 -174241 -167005 -139290 -12141 143731 249907 345992 379591 312684 133131 37685 -128179
6012 -128179 -141362 -91048 -232326 -416616 -271371 -37612 -1400 -84643 -2265 94413 -32709
6001 -32709 72731 96982 22447 -9841 160609 286498 297100 217460 201776 42288 -20922
5990 -20922 60079 129028 28859 -93686 -166099 -202687 -400313 -319867 -93242 164515 243434
5979 243434 207568 130444 -44005 81493 31870 61507 -63605 -132867 -101767 -93742 -38855
5968 -38855 -73812 -295087 -382480 -246601 -122262 45089 215142 47489 -98429 -81823
5958 -81823 61206 -38519 -171712 -205955 -320073 -310056 -150133 -133090 -150069 26733 69785
5947 69785 -151341 -146122 -85116 -24404 -15376 72809 237837 196729 65967 -38944 -118407
5936 -118407 -31048 251296 19224 -180453 -186792 67494 3641 37574 197884 190857 269127
5925 269127 349004 324284 268885 74413 -103106 -162830 -83744 -5721 152742 167485 240984
5914 240984 270968 144455 133320 122502 121719 16574 -95035 -42838 -64593 -118391 -78982
5903 -78982 38143 6831 -79620 21386 81403 48040 76632 309479 253871 112243 71913
5892 71913 -56549 -61499 -3170 10926 -90795 -161022 -257628 -94266 19375 -35812 -226381
5881 -226381 -349303 -366557 -351810 -314807 -105604 -25812 79388 69340 5821 49565 88060
5870 88060 172025 35842 21699 5337 -40980 -130150 -363212 -471133 -281011 -251815 -358950
5859 -358950 -345782 -267151 -176719 -262246 -313594 -281550 -102076 6902 87273 -72878 -258375
5848 -258375 -259129 -171852 -76840 29847 3515 81535 98187 18462 48724 85257 284576 94375
5836 94375 59059 148358 218399 82207 -53919 -86487 203225 183563 137177 -40115 -238780
5825 -238780 -217790 -152902 -126217 -36302 10762 95363 109200 79457 34985 -163571 -204301
5814 -204301 -80449 -48660 26413 -128142 -45871 -106682 -259232 -165187 -77053 142740 110215
5803 110215 158232 214962 211695 47973 -24627 -30149 -28727 -51443 -4499 -10844 -11350 -76511 -208866
5790 -208866 -157598 -19301 -111113 -34414 -95008 -239735 -247978 -264381 -149733 -118281 -119348
5779 -119348 -98618 64128 35058 115204 160282 66526 100345 172633 172169 84320 23004 51401
5767 51401 5834 121736 76574 -19767 -28633 150509 319514 318571 260016 236359 316046 248022
5755 248022 106022 66467 250904 242572 319020 277119 328371 317872 151680 125348 110052
5744 110052 -74229 -94404 65150 282606 377138 414489 308374 289799 226674 238247 180154
5733 180154 75111 106987 197315 159708 194731 77861 16841 -140658 -191748 -88141 66659
5722 66659 101591 170173 93499 -44636 -70485 -196782 -45638 13551 70464 53283 98790
5711 98790 248309 342538 255757 82504 -45831 -80734 -123057 -187394 -119242 24627 -33891
5700 -33891 -144890 -58651 -84755 -67643 132496 240959 96378 -20451 124061 144804 188857
5689 188857 233445 4744 142279 51866 -45161 -144980 -130790 58437 144141 152498 112146
5678 112146 69620 127092 51222 -140119 3062 135887 5038 75310 92844 -85636 -199674
5667 -199674 -167135 -224034 -333845 -248699 1841 -22664 -151826 -48454 -2687 118005 142124
5656 142124 31949 23595 119929 102053 63538 -63921 21901 154341 103818 -25562 109816
5645 109816 172613 64732 -50210 -132007 -121489 -9891 56294 91942 160305 120459 119088
5634 119088 131747 -30406 -15061 -23727 -21180 -147151 -120794 33405 62435 232144 235511
5623 235511 94864 -90638 -392331 -367598 -249393 -76396 14591 89949 203038 166411
5613 166411 149840 169528 235573 258713 167547 -7180 11638 36410 -32112 39910 -51074
5602 -51074 -105587 20493 10071 -77866 -42170 -101396 15402 130091 144708 -21068 -93302
5591 -93302 -93483 -70078 -39797 -39151 12368 -24214 -222832 -210756 -157528 -153374 -234984 -254302 -300419
5578 -300419 -224764 -280111 -148456 46951 204893 258505 97026 133236 194660 251873 372468
5567 372468 263971 232896 49700 10474 87409 26374 51236 66307 137724 249153 428440
5556 428440 411843 360771 274309 361405 185430 -117634 -142530 -100424 -40499 55740 47782
5545 47782 155341 95312 -34479 -105828 -29593 -33672 -174201 -76830 120906 82346 -14482
5534 -14482 -71952 -91332 -106736 -54863 27430 102326 39640 -9935 30416 -13356 -26139 35445
5522 35445 133607 51930 -118445 -66960 121330 124105 -99807 -312670 -155436 -91704 -186235
5511 -186235 -318375 -337555 -231555 -49593 9170 -9012 92144 -71533 -252116 -273112
5501 -273112 -174918 -168794 6085 132185 31759 -68357 11055 -33003 -74225 -64043 35122
5490 35122 102824 39202 -9905 34655 226679 172036 -12532 -209128 -254809 -81461 -11112
5479 -11112 -77539 -163784 -81976 23642 2809 150608 147956 -308 9472 44336 -20490 -62039
5467 -62039 -24982 590 69634 168333 131353 156809 114795 29297 12780 -57067 -77807 -124763
5455 -124763 -85733 -66126 -41982 -120102 -157904 -243438 -286368 -27508 188409 78570 -134163
5444 -134163 -394661 -370869 -231281 -105664 -60707 -201001 -219250 -218453 -382784 -342923 -154920
5433 -154920 -5002 -59230 -76159 84484 175511 37871 5479 -102498 -59030 -56164 -192100
5422 -192100 -207116 -113751 74738 237780 106919 77020 71533 150725 114444 134538 230548
5411 230548 146965 275144 359794 200687 19651 -35200 83295 44631 -10048 -69816 -56645
5400 -56645 -66739 13591 -101269 -295779 -40785 183872 28657 52759 116518 129356 81186
5389 81186 2604 -130665 -149666 53921 67817 111314 97826 60264 47809 -102725 -86119
5378 -86119 904 109071 33250 -64969 11966 131826 50141 -94941 -150300 -65479 21013
5367 21013 148094 172612 90367 42651 -72611 -58016 -71495 -227154 -299148 -285306 -255359
5356 -255359 -263977 -142419 -165918 -143701 -246163 -94659 50883 -1377 -28068 118122 68383
5345 68383 -99535 -144245 -81336 3023 -55716 -180727 -278417 -307474 -383264 -251218 -122481
5334 -122481 -105958 -293334 -320855 -138994 -103770 27081 9259 -159196 -158217 -104331 -26352
5323 -26352 -67110 -154962 -159742 -7831 7407 -83414 -103416 -147554 -191401 -189119 -134733 -128971
5311 -128971 -128766 38474 47608 47869 1819 -66351 62330 170924 131146 70113 203117 89762
5299 89762 -231926 -244182 -137185 -184948 -212363 -223135 -366067 -279332 -52436 12427 -21591
5288 -21591 33533 114008 116343 -112482 -109297 31060 80510 2168 -127389 -24903 -21775 5171
5276 5171 -25593 42779 78918 105109 177513 90314 -68105 -69044 -130029 -83976 -88788 -147638
5264 -147638 2322 11262 -67648 -174243 -295007 -310750 -68346 57453 142059 29415 -109361
5253 -109361 -82372 -52869 -130584 -111476 -34743 -20412 -108679 -229708 -35509 89026 58488
5242 58488 154727 66086 -172905 -119695 90633 179889 192464 151915 66139 80186 -36894
5231 -36894 167059 200921 30490 135134 223467 412599 333004 137158 61838 45067 -19762
5220 -19762 -16808 -55508 -136279 -50362 -35780 -54004 -136791 -150555 -47000 -79849 -40319 -18425
5208 -18425 42135 -108445 -113377 -32385 51274 80350 12786 -94138 -336344 -263005 -143338
5197 -143338 -122784 -44176 -168520 -125464 -90801 -35284 -45216 63051 17807 -44907 -136320
5186 -136320 -123904 -160059 -278031 -183222 -217459 -148847 -173023 -292079 -203026 -135781 -174801
5175 -174801 133142 54653 -306812 -293696 -67811 -35101 95800 -13909 2405 -9248 20862
5164 20862 103571 -49397 -167114 -161582 -306923 -296227 -180183 -171811 -10317 -35648 -27071
5153 -27071 -9082 -182924 -266011 -141698 -333884 -369690 -194212 -263452 -257362 -209596 -251379
5142 -251379 -157316 -72228 -86472 90229 263983 223258 285328 202205 -26305 -225899 -87809
5131 -87809 33319 -75812 -181165 -33786 102833 101139 239803 233478 99369 11675 102520
5120 102520 7844 -52159 -54176 -201511 -342096 -189489 -46533 -73325 -60616 47323 136768
5109 136768 -78931 -87876 247161 182509 90319 -15110 -98830 -79636 -67844 -20874 -55078
5098 -55078 -52963 120574 191419 88846 -157359 -123907 -33927 -132919 48497 22189 -137001
5087 -137001 -112202 -25209 59156 86817 131251 80629 123764 33786 -48654 -76266 35972
5076 35972 -32514 -56870 15272 169517 263064 204632 -113263 -118917 64134 133205 101815
5065 101815 48411 105767 -17674 -241269 -375593 -341691 -236392 -46419 39744 189527
5055 189527 102743 74337 21684 31626 136147 289081 292942 270773 189848 -3341 -27619
5044 -27619 -23823 -33113 -30219 -13557 45391 45717 88833 16938 812 117031 278480 370085
5032 370085 205678 91718 -14909 122146 108611 200458 204154 7093 -56125 -139681 -131665
5021 -131665 -186036 -157847 -158820 -192619 -185591 -242351 -221821 -363440 -368368 -358115 -246658 -171107
5009 -171107 -71575 -198815 -131770 144125 216450 -8458 -34479 92400 114949 236984 100432
4998 100432 -41872 -98911 -2570 -9786 -31346 -102033 -164396 -75219 52783 151817 47593
4987 47593 -19959 54001 -30778 -168685 -131243 -158651 -183046 -104893 -154442 -114364 -139231 -76330
4975 -76330 -131224 -203313 -100699 -40929 19854 -39795 -123175 -108945 -124240 40732 110182
4964 110182 201452 196522 16029 22997 121566 88200 26589 68952 -32770 -17341 106362
4953 106362 212560 202933 91265 -136281 -111314 33046 70467 93971 -221 1505 159619
4942 159619 262321 184413 121951 116424 11289 -11738 79527 5442 61808 76993 123608
4931 123608 191073 197473 206735 115974 31769 225883 168209 -53174 -75045 118137 119731 10384
4919 10384 -30762 66281 34435 25828 100707 201141 79357 -46977 189336 187907 67952
4908 67952 50913 -147263 -261389 -29671 144348 222315 150675 73162 54895 94759 -81748
4897 -81748 -167536 -90862 -50885 -19628 6155 83093 181052 121861 35821 -34706 -29552 -41376
4885 -41376 46601 -69034 -231515 -176647 2347 -88516 -134170 -96528 -96659 61724 31168
4874 31168 -27077 -23184 -114074 -217040 -160958 6676 27124 -78193 -64532 -59800 -28618 -65768
4862 -65768 -134201 -120014 -145402 -85492 -120945 -124552 -117882 -85119 -15996 136358 39007 -144494
4850 -144494 -231555 -118449 -158439 -208363 -201807 -329471 -449033 -466693 -300600 -165781 -41676
4839 -41676 39333 9589 -52149 -188255 70458 385783 251923 157630 92049 52833 -19178
4828 -19178 -93945 -129052 13100 -101006 -309794 -177842 -54031 -38903 22166 -11203 -171379
4817 -171379 -205477 -178752 -140751 -143179 6254 49076 2370 -92581 -33054 172778 354575
4806 354575 316413 27235 -75478 -128221 -37888 89149 23265 -57300 -164385 -123825 -60650
4795 -60650 -90470 -57532 -81400 -124335 -283711 -333082 -170394 64530 90506 126746 162965
4784 162965 104843 52889 -86423 -45913 -49699 -118114 -146475 -155425 -85510 -59496 4143 -31609
4772 -31609 -133254 -360648 -282330 -82030 110217 229018 -8809 -127924 -74535 80560
4762 80560 149411 66525 -89751 -190096 -66602 70668 22750 94675 -33040 -132467 -172013
4751 -172013 -72108 152011 154133 37241 16045 27585 263727 282670 161939 7176 7371
4740 7371 18354 131010 60665 -100231 -159990 -137781 -133128 -169288 -115711 1349 172284
4729 172284 176033 163578 76794 122706 156520 54677 -89703 -169653 -298818 -325646 -264528
4718 -264528 -281214 -337625 -326204 -181575 -26761 89421 189500 6252 -43394 -30349 -159771
4707 -159771 -273351 -279874 -235324 -69397 -234399 -225400 38086 -6561 -48992 -15077 -95035
4696 -95035 -123665 -131645 -90706 1592 -45644 29357 -79422 -118458 -37125 -3427 -121150 -178904
4684 -178904 -104959 -94486 -159397 -176009 -135857 58264 -42830 -159486 69052 162647 294240
4673 294240 328399 305267 283952 245663 157276 71558 63176 165370 24471 -111783 -5176
4662 -5176 14263 60947 147827 225 -9487 32513 -84690 -173111 -120508 -119262 -37832 188044
4650 188044 223330 16017 78398 27635 -71852 -102007 -60101 36686 -8472 -59870 -61120 64968
4638 64968 -11305 -171285 -113389 107328 347240 170917 -100944 -231864 -30005 -2009
4628 -2009 -40241 -21260 44795 107367 105609 -75180 -292002 -369181 -292579 -334781 -161741 -146165
4616 -146165 -222545 -99433 -122134 -142631 -104334 -53192 -117979 -163315 -100192 -17483 -145177
4605 -145177 -186292 -138991 5030 168906 130608 116605 276397 285339 308081 432132 400725
4594 400725 202219 -5888 -73353 94173 141749 68984 16221 193680 324833 236904 86709
4583 86709 100230 107896 60129 97779 57224 41810 -6863 -39960 -239170 -267827 -282482 -271732
4571 -271732 -81051 -47064 -9483 124850 99457 22524 -33304 23804 73812 -33146 -207446
4560 -207446 -182019 -160534 -121593 -55411 -77661 -107294 -225594 -245625 -203783 -176916 -106055
4549 -106055 -48759 -90990 -164662 -357205 -244074 -12043 -75791 -218365 -212468 -260450 -239040
4538 -239040 -57233 96750 -42007 -161969 -104931 -125085 -170239 -84127 -85228 -59802 -87930
4527 -87930 -59163 20172 33766 -52928 -115904 -61896 -132895 -122782 -18521 35808 2764 37122
4515 37122 282703 325385 134292 158764 185127 147754 -27554 -14538 86171 48853 -69949
4504 -69949 -14975 36480 79042 41655 115743 65577 -1204 -57006 -197020 -215091 -178764 -220537
4492 -220537 -238567 -207394 -111469 -106074 -9584 88274 223444 155873 83037 121670 224645
4481 224645 420221 292045 117586 192140 229072 23352 -2211 -16592 -20585 -32160 51130
4470 51130 108354 29399 182654 249369 116371 117264 50036 160116 132308 15570 -64136
4459 -64136 14525 80231 -15492 -9883 -187154 -105606 -11568 59850 77982 111595 102535 74765
4447 74765 -111241 -51614 129763 111107 -52474 -13765 72042 -12332 35489 96874 -60772
4436 -60772 -2329 -28840 -44544 92482 17074 -93792 -159206 35717 343399 223049 117802
4425 117802 4686 80121 -44573 -52615 47676 70366 5646 -73027 68873 177150 79651
4414 79651 86364 129033 110377 -16345 -120521 -9481 -77924 -121824 -110967 -84338 73413
4403 73413 178623 219659 33242 -50871 -1283 -177030 -346073 -73001 119381 117507 76448
4392 76448 -39674 -172754 -168257 -73947 88291 42390 -55526 -128312 -49139 32550 67584
4381 67584 120178 12991 -110525 -70938 34834 36943 -142830 -222078 -283205 -232715 -276403
4370 -276403 -324012 -223648 -94165 -106622 -183138 5929 218914 297728 212520 13136 -136387
4359 -136387 -344696 -406921 -397550 -436739 -404520 -260573 -82115 -6261 -93814 -157502 -126739
4348 -126739 36226 78684 33250 59291 273498 456896 338146 107892 78552 217280
4338 217280 129792 -84096 -188527 -163394 -89179 -8444 -20521 -114237 -189581 -201007 -85308
4327 -85308 -112622 -64221 -203709 -247371 -309106 -206266 52952 175422 215045 215572 252361
4316 252361 175261 135973 88465 109525 79112 6558 75985 18936 -83048 -177961 -75849
4305 -75849 -63872 -81731 72771 158975 289453 279125 53083 43649 -2725 -56148 -11145
4294 -11145 72095 133481 209015 243623 145674 109625 171156 19788 -37894 -39803 -45955 34380
4282 34380 89251 -89493 -229816 -254800 -212578 -133307 -165201 -43477 57533 99137 98032
4271 98032 -32605 -108070 106726 217216 177145 138658 139965 261639 185165 222406 185309
4260 185309 29537 -5975 -38246 -127400 -50875 164410 25619 -73388 61082 106716 25663
4249 25663 -52932 -41884 -39227 -51797 -52572 121451 217336 127084 12721 -6471 -32200 -99319
4237 -99319 -230807 -343656 -315327 -302913 -115050 -17719 -39282 -56562 -203853 -167979 38597
4226 38597 34204 -92121 -14911 85905 -28743 -126109 -177478 -21225 22204 -20158 27731
4215 27731 4033 95838 290243 179748 -44040 -189260 -49692 -44292 -128169 -148437 -44047
4204 -44047 -13171 -31030 -31385 -4422 -35136 42377 -96831 -63451 -118336 -16534 28729 62752
4192 62752 156484 179499 165805 210487 79972 41254 26455 -2373 -47938 -196957 -60305
4181 -60305 128195 -42319 -201266 -258995 -169791 -57307 -28701 -42279 99839 214237 191699
4170 191699 44879 -32983 -123563 -1716 90660 211441 183260 44090 -25242 10149 189639
4159 189639 276845 -29033 -188012 -169683 101 233252 420618 258378 56655 93801
4149 93801 -20985 -93010 13089 245783 289310 129001 -43088 48761 -36420 -60568 -104034
4138 -104034 -162260 33206 239201 238912 143206 221125 240983 221568 216997 131267 53868 -56558
4126 -56558 -200161 -252076 -224248 -78275 69965 93739 61367 -27524 -11922 38083 -26001
4115 -26001 -83387 -83947 -57127 -62695 79797 134538 68480 87760 258473 202058 47651 -176692
4103 -176692 -288453 -271256 -189693 -219967 -345391 -281208 -288141 -169289 -109063 -69751 77944
4092 77944 -20288 -20470 99905 86648 73265 141726 237982 203529 178883 22302 -45559 64162
4080 64162 95490 72340 -76517 -122915 -52019 -94901 -164097 -315868 -301470 -131088 -262747
4069 -262747 -132462 -22474 29800 -40437 -138321 -319186 -306026 -7669 145056 95370 153335
4058 153335 91338 95541 35388 12780 14827 -126088 -131250 -93771 -245372 -369602 -402010 -397787
4046 -397787 -423816 -356754 -174987 29853 -22602 64380 102007 -10781 154826 224935 191313
4035 191313 127394 42527 14052 -90251 -111201 -3543 201607 27964 -94212 20393
4025 20393 72486 62870 133214 -63781 -255972 -185528 -19765 94654 182796 229315 325412
4014 325412 225962 137256 -16935 50594 14036 93985 67341 -2246 -220362 -353538 -195589
4003 -195589 67380 153561 107405 80470 125789 37936 113107 63358 106378 26091 -103853
3992 -103853 -33331 -178841 -192121 -139454 -52555 -111733 -121243 -137941 -158264 -125657 -308159
3981 -308159 -273715 -275566 -262645 -152122 28442 80909 92112 172393 181114 132019 -39156
3970 -39156 -28219 142600 81392 -44706 -188849 -154748 -60454 -98647 -242823 -199491 -97294
3959 -97294 -25556 38729 16538 189962 219313 182822 130522 106704 261320 400855 240070
3948 240070 104197 -18380 41530 200587 211419 326192 272144 129687 82242 139925 324769
3937 324769 336111 165740 228309 324554 349923 211359 51904 88026 228529 243149 224503
3926 224503 408556 223170 104460 235610 337613 351024 243394 207326 166997 148366
3916 148366 78055 79963 131047 203975 140648 75446 195960 141879 70599 -104659 -264136
3905 -264136 -246395 -38688 33160 -128930 -147923 90216 158097 122064 40382 -62712 -23151
3894 -23151 -110579 5135 94810 -48591 -104503 -103262 -36639 -103613 -185697 -184950 -172100 -109449
3882 -109449 170955 231112 217324 128424 -82017 -168945 -93681 2067 176861 290198 126970
3871 126970 -32119 -70030 -43399 18103 -29575 -71665 37114 176089 150314 185085 199318
3860 199318 111920 -21208 -13731 -8624 -7524 82292 -105558 -383460 -289181 -146711 -171359
3849 -171359 -26298 27859 38480 13573 37134 -15783 -197540 -272744 -138068 -67858 -91683
3838 -91683 -130177 -41264 4433 -80305 -40426 -113296 -31513 27336 64427 323959 219249
3827 219249 153443 281735 251596 201256 46166 10520 -52965 20033 102155 138539 126682
3816 126682 85424 33161 -50920 -70755 -127606 -183439 -217399 -103593 94808 350748 459709
3805 459709 389519 270275 59146 -152298 -229239 -107139 112712 129008 59155 8713 14128
3794 14128 -21034 47162 -123840 26900 45227 29587 20869 -54217 -35258 109233 156879
3783 156879 205017 274099 54149 -48014 -166426 -225502 -243256 -99257 -145992 -255052 -183031
3772 -183031 -199997 -181154 -35562 32921 125114 178645 157215 110777 163842 158245 128044 -6122
3760 -6122 -110967 58386 66680 138261 208175 112106 -28930 -496 -59520 -21365 216215
3749 216215 216615 142651 5167 -153297 -107165 -52866 47659 94118 -104553 -151575 -94261
3738 -94261 31204 165238 182188 316982 407529 200059 -2118 -117700 -123706 19294 19869
3727 19869 68877 86581 165711 53287 -38943 92337 10338 -187905 -76580 41725 137084
3716 137084 101864 -6337 99916 152318 113245 103377 -1427 -27690 -15224 -22570 -110159
3705 -110159 20604 163920 221436 243510 349792 317573 261184 290148 339537 296422 140313
3694 140313 148407 39197 -26855 -62653 -36933 87821 280109 413943 100650 114157 183063
3683 183063 140889 54418 -130569 -130660 -89527 -125347 -197514 23961 72305 -76444 -28496 -6740
3671 -6740 76226 239204 217736 129049 124151 160501 250657 351796 202692 134707 138643 173662
3659 173662 179237 125374 -81207 -255329 -314884 -311428 -268509 -199044 -127447 -110156 -112417 -107533
3647 -107533 2291 -32653 12226 129891 178831 159312 202592 308334 370782 312407 353721
3636 353721 135405 -103271 -206478 -177491 -222432 -136641 8345 -78929 -86592 69636 239145
3625 239145 148450 109897 -17415 -94363 -449 106733 2798 -85885 648 142276 11880
3614 11880 -95005 -8460 -84700 -140239 -366 -45677 -137147 -42581 23 -67878 -82439
3603 -82439 -32765 -15827 -41941 42997 23657 63636 106235 192525 221151 265840 122557 61436
3591 61436 -134958 -238008 -3621 14104 42480 -37967 -129569 3525 -13315 -32389 -102789
3580 -102789 -115248 -58725 -68884 -64122 29168 -8848 -114314 45259 227960 241067 61444
3569 61444 57718 116705 83062 -113349 -26970 -10163 -181466 -30001 -33600 -74063 -87029 65328
3557 65328 -10226 -93750 -95438 -23919 -92724 -125124 -123312 13450 2778 -105601 -121090 -147066
3545 -147066 -96780 40820 141658 50499 -55589 -16846 -10526 -113525 -187647 -147978 -92725
3534 -92725 -47576 -27270 -12042 -25198 11290 -32119 -23798 -49856 21025 90040 228660 -9202
3522 -9202 -225520 -355809 -306058 -150845 -94625 -28136 47852 56760 -53243 30422 151610
3511 151610 48230 -198514 -51439 147420 419234 407147 242948 301077 262541 88650
3501 88650 -76553 -120025 -24191 -60066 -276996 -315357 -239697 -193403 -274149 -87777 46445
3490 46445 -18227 -114042 -87448 -228277 -98366 41016 -82731 -74388 -122441 -101245 74412
3479 74412 91161 90222 57439 -73379 -119820 -117254 47891 103794 -81245 -162093 -114725 -89320
3467 -89320 -79447 -54037 -88094 -59177 -12607 81315 182375 56621 192949 291545 244505
3456 244505 127437 142393 166747 71232 47018 12545 25658 -25630 -208968 -364575 -299710
3445 -299710 -179099 -43165 73013 53556 89451 64162 85032 47223 -124329 -1200 211375
3434 211375 340823 132957 -113762 -49509 67472 -60096 -14975 189028 273172 62681
3424 62681 -139910 -242099 -216278 53064 85031 32634 -78289 37877 131869 -7749 -140034
3413 -140034 -222719 -212251 -200585 -218760 -72112 13671 55983 195269 400634 257266 143963
3402 143963 37069 71561 59706 255915 247929 138769 130722 39855 52703 107795 -51220
3391 -51220 -18156 194744 230514 51177 62892 137645 102352 134873 211454 117842 -2280
3380 -2280 97512 291310 297757 195726 40293 52518 149929 230528 296799 231798 52545
3369 52545 -184560 -175847 -195059 -182389 -301347 -242103 -35185 70267 55826 86568 58640
3358 58640 97406 117255 80359 55667 42253 148981 237857 134972 -4867 -10007 -76817
3347 -76817 -96464 -74199 -179582 -120076 -60696 -116862 -136653 101857 223497 134251 15335
3336 15335 201364 175869 89924 -25763 -73061 67484 -78351 -326258 -251331 -78531 -126453
3325 -126453 -98863 -64583 -149591 -38843 189258 166603 164765 38180 76924 114263 124000
3314 124000 112293 71654 52972 -56077 101646 283393 270009 276511 193451 135543 -26319
3303 -26319 -148371 -137869 -208228 -318009 -267681 -18811 46783 2251 99722 14224 -173026
3292 -173026 -175010 -71854 56346 25724 111328 70899 116959 219859 163668 127592 54403
3281 54403 101343 247513 222044 281103 273119 269291 235068 76645 -12725 40034 15824 -84656
3269 -84656 -55717 129133 82061 -23256 -153186 -258882 -213941 -104848 -41651 -131827 -32660
3258 -32660 -8473 -82758 -253784 -195915 -97070 22789 -45285 -143404 -144522 -19549 3434
3247 3434 -138786 -157448 -55560 17752 -29992 -103861 -72431 -22770 17674 34412 -196670
3236 -196670 -336438 -254313 -16340 30822 -47135 -44641 113947 113248 146715 168027 129716 -7229
3224 -7229 -28765 -38004 26643 -58564 -124412 -212380 -188022 -59218 98742 83442 121331 156710
3212 156710 84243 112503 151488 11988 91851 -7574 -175722 -280461 -146482 -73360 -1532
3201 -1532 25215 -15940 110604 320074 294528 177972 99038 -65643 -15579 184635 105129
3190 105129 48788 -122314 -174082 -267585 -357908 -340374 -196363 116717 339313 303058 169734
3179 169734 41473 60468 131890 132166 123745 -34432 -129451 -37300 31004 -17822 -88923 48849
3167 48849 48438 128999 104925 -62456 151 -7187 -86843 77251 200560 267344 393893 304248
3155 304248 114054 93300 58898 -6702 -7502 -23483 -1296 50016 85743 139063 139380 202974
3143 202974 203745 205510 64759 -8660 30116 23811 84782 44692 71178 -103449 -148845 -184209
3131 -184209 -39885 130080 211393 151254 64852 -139662 -20068 97574 342983 286821
3121 286821 151113 -59875 -116314 -53574 36734 -79160 -197369 -135811 58529 228506
3111 228506 111215 -6056 3477 43210 96094 59336 17404 -125518 -166156 -183757 -171804
3100 -171804 -92100 -14678 23914 51771 -89776 -164620 -40345 147244 56276 -43557 -53379
3089 -53379 20474 66027 -41183 -224638 -298167 18170 206651 92866 -7712 80001 253381
3078 253381 208055 637 -33932 129981 158058 -24039 42984 141558 112898 -52840 -2929
3067 -2929 53716 48335 120558 226954 100962 -216305 -279474 -185547 -68590 116454 272580
3056 272580 305898 120162 -5868 127288 32879 -53828 -43933 -57089 27232 -76672 -200496
3045 -200496 -270303 -275578 -382402 -197861 -47456 71558 78949 -92122 12842 100521 -2395
3034 -2395 -146601 -38803 9844 133575 225963 269308 315602 209819 145996 178114 181601
3023 181601 -4048 -65823 -170714 -202159 95057 281333 186556 -32332 -162908 -270375
3013 -270375 -493069 -387808 -237063 -246625 -112448 183553 265215 323693 274737 167705 109404
3002 109404 162368 206374 265102 90143 -77250 -202065 -153685 -138103 -23165 -10684 -63157
2991 -63157 -25856 -222016 -386090 -56505 26227 -18609 -128348 -67649 -72706 -139879 -64197
2980 -64197 11466 -142166 -17670 -6365 157378 14055 -143321 -194755 -200561 -256639 -129365
2969 -129365 -46078 -140873 -277222 -157629 -17017 40797 72769 95867 69254 28881 -8447
2958 -8447 135174 208661 221031 85307 -29510 -108491 -56783 -53017 -114641 -60217 115670
2947 115670 73724 -67610 -58362 -56850 -35109 -97909 -168065 -163963 -119628 33608 -64244 -338099
2935 -338099 -171143 35494 21838 43364 -97099 22206 80949 95191 96770 -48924 -132546
2924 -132546 -84228 -44187 -164448 -111543 196345 319153 330979 391011 553211 599401 438685
2913 438685 429666 196089 116769 1118 22974 42376 2060 -13618 70411 62649 -2716 -106854
2901 -106854 -143280 -81068 47416 15487 -101661 -75351 -168560 -277557 -106674 -612 5867
2890 5867 -6902 -148404 -97936 -3123 -13507 230565 127192 37404 74567 219041 112536
2879 112536 35440 118336 302462 346488 299154 198920 148348 98593 150054 183824 142510
2868 142510 134800 274014 409238 290368 106611 -63245 -226477 -319300 -345107 -202800
2858 -202800 -21906 -3730 -138678 -122222 -3078 78874 106764 -66273 -87485 -16876 -160454
2847 -160454 -154340 -8407 24513 44206 129567 -809 -97431 -74970 -104883 69313 -92692
2836 -92692 -111455 79953 102830 -112958 -254762 -156170 -18608 -74121 -84570 -9142 -15221
2825 -15221 30129 35480 -44894 -114936 -57341 96967 80869 -66254 -132447 84487 139872
2814 139872 64325 10083 110202 86260 -76119 -251682 -153461 -126781 -254859 -140595 -3784
2803 -3784 -21126 57994 207433 307217 191372 252217 336660 286548 156155 21655 -148305
2792 -148305 -94408 49499 17645 257420 196226 82244 85062 240375 298449 135371 66648
2781 66648 135969 127385 80851 90841 63328 14156 145843 156535 92489 70729 98740 108911
2769 108911 -25840 -176816 -282585 -261394 -297488 -265069 -192875 775 135680 147576 283140
2758 283140 343831 319576 324576 219614 134608 43373 -49493 27309 146606 12219 -84434
2747 -84434 -2681 -1771 -204188 -118054 84400 154570 -20187 -100693 -88447 -284607 -187228
2736 -187228 120773 238386 128583 -96406 -108427 -98997 25023 100106 134300 141755 116937
2725 116937 130212 225410 217098 223493 208744 155126 119996 -44083 -75850 -42363 -98396 -110348
2713 -110348 50189 151763 100949 -15452 38733 268772 247604 27269 -45107 -122509 -7656
2702 -7656 147762 290380 208014 57737 41348 -2781 -97013 -105120 -2822 -79054 -229071
2691 -229071 -198862 -96903 -43891 29683 17375 95834 69551 145577 176755 152988 147619 -26852
2679 -26852 -105318 -28637 27221 -80133 -240318 -155737 -39854 85533 -14150 -63393 182978
2668 182978 351508 198768 186436 252677 242950 140645 -728 -27151 191740 75576 -113559
2657 -113559 -114195 7895 188298 128552 163997 244607 255245 205291 198990 273984 218934 179159
2645 179159 322795 310201 291273 253077 301617 389830 144933 -1352 -69936 -237824 -62678
2634 -62678 60826 199716 303721 194006 70994 515 9410 78623 156448 251857 308384
2623 308384 144785 54915 -36269 -112447 -34567 19650 -113771 -323654 -402563 -369157 -20366
2612 -20366 -29064 -142982 -95520 -79875 59063 159373 134192 103288 71009 -3647 121992
2601 121992 162672 125063 108072 174099 131692 12413 -248089 -390694 -266194 -135742 -7629
$$ [...]
##END NTUPLES=NMR SPECTRUM
##END=
