##TITLE=Analysis number 314645
Compound Code cc 42401
Project Code adrs
Chemist Name ugmt
##JCAMPDX= 6.0         $$ Bruker NMR JCAMP-DX V2.0
##DATA TYPE= NMR SPECTRUM
##DATA CLASS= NTUPLES
##ORIGIN= Bruker BioSpin GmbH
##OWNER= NMR
$$ XWIN-NMR		Version 3.5
$$ Mon Oct 24 08:46:14 2005 GMT Daylight Time (UT+1h)  MAYBRIDGE\NMR@NMR_250MHZ
##.OBSERVE FREQUENCY= 250.131544655141
##.OBSERVE NUCLEUS= ^1H
##.ACQUISITION MODE= SIMULTANEOUS (DQD)
##.ACQUISITION SCHEME= undefined
##.AVERAGES= 16
##.DIGITISER RES= 18
##SPECTROMETER/DATA SYSTEM= dpx250
##.PULSE SEQUENCE= zg30
##.SOLVENT NAME= DMSO
##.SHIFT REFERENCE= (INTERNAL, DMSO, 0, 16.522)
##AUDIT TRAIL= $$ (NUMBER, WHEN, WHO, WHERE, WHAT)
$$ ##TITLE= Audit trail, XWIN-NMR		Version 3.5
$$ ##JCAMPDX= 5.01
$$ ##ORIGIN= Bruker BioSpin GmbH
$$ ##OWNER= NMR
$$ C:\u/data/dgb/nmr/ADRS/11240/pdata/1/auditp.txt
$$ ##AUDIT TRAIL=  $$ (NUMBER, WHEN, WHO, WHERE, WHAT)
(   1,<2005-10-24 08:45:38.74 +100>,<MAYBRIDGE\NMR>,<NMR_250MHZ>,
      <created by zg, POWCHK disabled, PULCHK disabled
       configuration hash MD5:
       62 19 C7 07 E1 42 D1 B7 37 6C 3D D0 77 39 F9 E6
       data hash MD5: 64K
       33 C7 2E 9A 51 F6 FA FB 7B F0 06 FB D6 E7 7D E1>)
(   2,<2005-10-24 08:45:55.72 +100>,<MAYBRIDGE\NMR>,<NMR_250MHZ>,
      <Start of raw data processing
       ef LB = 0.3 FT_mod = 6 PKNL = 1 SI = 32K 
       data hash MD5: 32K
       8C 99 B9 C4 D0 69 2C 9C 44 16 DB 57 26 A1 18 2C>)
(   3,<2005-10-24 08:46:01.35 +100>,<MAYBRIDGE\NMR>,<NMR_250MHZ>,
      <apk 
       data hash MD5: 32K
       EA 2C 90 92 0B 77 6F A3 8A 2F C5 EE 67 C7 2D E7>)
(   4,<2005-10-24 08:46:02.99 +100>,<MAYBRIDGE\NMR>,<NMR_250MHZ>,
      <abs ABSG = 5 
       data hash MD5: 32K
       70 1C 07 82 23 AF 17 A6 D7 69 29 53 C6 A9 90 FD>)
$$ ##END=
$$ 
$$ hash MD5
$$ 3B D2 70 15 CA 6E C1 29 87 59 91 0E 92 8C 29 94
##$RELAX= 
##$RELAX= 
##$RELAX= 
##$RELAX= 
##$RELAX= 
##$RELAX= 
##$RELAX= 
$$ Bruker specific parameters
$$ --------------------------
##$DU= <C:\u>
##$EXPNO= 11240
##$NAME= <ADRS>
##$PROCNO= 1
##$TYPE= <nmr>
##$USER= <dgb>
##$AMP= (0..31)
100 100 100 100 100 100 100 100 100 100 100 100 100 100 100 100 100 100 
100 100 100 100 100 100 100 100 100 100 100 100 100 100 
##$AQSEQ= 0
##$AQ_mod= 3
##$AUNM= <au_zg>
##$AUTOPOS= <3 >
##$BF1= 250.13
##$BF2= 250.13
##$BF3= 250.13
##$BF4= 250.13
##$BF5= 500.13
##$BF6= 500.13
##$BF7= 500.13
##$BF8= 500.13
##$BYTORDA= 1
##$CFDGTYP= 0
##$CFRGTYP= 5
##$CHEMSTR= <none>
##$CNST= (0..31)
1 1 145 1 1 1 1 1 1 1 1 1 1 1 1 1 1 1 1 1 1 1 1 1 1 1 1 1 1 1 1 1 
##$CPDPRG= <>
##$CPDPRG1= <>
##$CPDPRG2= <>
##$CPDPRG3= <>
##$CPDPRG4= <mlev>
##$CPDPRG5= <mlev>
##$CPDPRG6= <mlev>
##$CPDPRG7= <mlev>
##$CPDPRG8= <mlev>
##$CPDPRGB= <>
##$CPDPRGT= <>
##$D= (0..31)
0 1 0 0 0 0 0 0 0 0.06 0 0 0 0 0 0 0.0002 0 0 0 0 0 0 0 0 0 0 0 0 0 0 
0 
##$DATE= 1130139937
##$DBL= (0..7)
120 120 120 120 120 120 120 120 
##$DBP= (0..7)
150 150 150 150 150 150 150 150 
##$DBP07= 0
##$DBPNAM0= <>
##$DBPNAM1= <>
##$DBPNAM2= <>
##$DBPNAM3= <>
$$ [...]
##$SUBNAM7= <"">
##$SUBNAM8= <"">
##$SUBNAM9= <"">
##$SW= 20.6930455092707
##$SWIBOX= (0..15)
0 0 3 0 0 0 0 0 0 0 0 0 0 0 0 0 
##$SW_h= 5175.983436853
##$TD= 65536
##$TD0= 1
##$TE= 296.16
##$TE2= 300
##$TE3= 300
##$TEG= 300
##$TL= (0..7)
0 120 120 120 120 120 120 120 
##$TP= (0..7)
150 150 150 150 150 150 150 150 
##$TP07= 0
##$TPNAME0= <>
##$TPNAME1= <>
##$TPNAME2= <>
##$TPNAME3= <>
##$TPNAME4= <>
##$TPNAME5= <>
##$TPNAME6= <>
##$TPNAME7= <>
##$TPOAL= (0..7)
0.5 0.5 0.5 0.5 0.5 0.5 0.5 0.5 
##$TPOFFS= (0..7)
0 0 0 0 0 0 0 0 
##$TUNHIN= 0
##$TUNHOUT= 0
##$TUNXOUT= 0
##$USERA1= <user>
##$USERA2= <user>
##$USERA3= <user>
##$USERA4= <user>
##$USERA5= <user>
##$V9= 5
##$VALIST= <valist>
##$VCLIST= <CCCCCCCCCCCCCCC>
##$VD= 0
##$VDLIST= <DDDDDDDDDDDDDDD>
##$VPLIST= <PPPPPPPPPPPPPPP>
##$VTLIST= <TTTTTTTTTTTTTTT>
##$WBST= 1024
##$WBSW= 4
##$XGAIN= (0..3)
0 0 0 0 
##$XL= 0
##$YL= 0
##$YMAX_a= 402646
##$YMIN_a= -569575
##$ZGOPTNS= <>
##$ZL1= 120
##$ZL2= 120
##$ZL3= 120
##$ZL4= 120
##$ABSF1= 16.522
##$ABSF2= -4.171173
##$ABSG= 5
##$ABSL= 3
##$ALPHA= 0
##$AQORDER= 0
##$ASSFAC= 0
##$ASSFACI= 0
##$ASSFACX= 0
##$ASSWID= 0
##$AUNMP= <proc_1d>
##$AZFE= 0.1
##$AZFW= 0.1
##$BCFW= 0
##$BC_mod= 0
##$BYTORDP= 0
##$COROFFS= 0
##$CY= 12.5
##$DATMOD= 1
##$DC= 0
##$DFILT= <>
##$DTYPP= 0
##$F1P= 14.0000005364418
##$F2P= -0.99999901652339
##$FCOR= 0.5
##$FTSIZE= 32768
##$FT_mod= 6
##$GAMMA= 0
##$GB= 0
##$INTBC= 1
##$INTSCL= 1
##$ISEN= 128
##$LB= 0.3
##$LEV0= 0
##$LPBIN= 0
##$MAXI= 10000
##$MC2= 0
##$MEAN= 0
##$ME_mod= 0
##$MI= 0
##$NCOEF= 0
##$NC_proc= -4
##$NLEV= 6
##$NOISF1= 0
##$NOISF2= 0
##$NSP= 0
##$NTH_PI= 0
##$NZP= 0
##$OFFSET= 16.522
##$PC= 1
##$PHC0= -81.34869
##$PHC1= 5.78777
##$PH_mod= 1
##$PKNL= yes
##$PPARMOD= 0
##$PSCAL= 4
##$PSIGN= 0
##$REVERSE= no
##$SF= 250.13
##$SI= 32768
##$SIGF1= 0
##$SIGF2= 0
##$SINO= 400
##$SIOLD= 32768
##$SREGLST= <1H.DMSO>
##$SSB= 0
##$STSI= 32768
##$STSR= 0
##$SW_p= 5175.98343685301
##$SYMM= 0
##$S_DEV= 0
##$TDeff= 65536
##$TDoff= 0
##$TI= <Analysis number 999999
Compound Code 99
Book Reference 9
Project Code 9>
##$TILT= no
##$TM1= 0
##$TM2= 0
##$TOPLEV= 0
##$USERP1= <user>
##$USERP2= <user>
##$USERP3= <user>
##$USERP4= <user>
##$USERP5= <user>
##$WDW= 1
##$XDIM= 32768
##$YMAX_p= 344366403
##$YMIN_p= -180968
$$ End of Bruker specific parameters
$$ ---------------------------------
##NTUPLES= NMR SPECTRUM
##VAR_NAME=  FREQUENCY,     SPECTRUM/REAL,   SPECTRUM/IMAG
##SYMBOL=    X,             R,               I
##VAR_TYPE=  INDEPENDENT,   DEPENDENT,       DEPENDENT
##VAR_FORM=  AFFN,          ASDF,            ASDF
##VAR_DIM=   32768,         32768,           32768
##UNITS=     HZ,            ARBITRARY UNITS, ARBITRARY UNITS
##FACTOR=    0.157963299565203, 1,           1
##FIRST=     4132.6476996994, 0,             0
##LAST=      -1043.33573715361, 0,           0
##MIN=       -1043.33573715361, -180968,     0
##MAX=       4132.6476996994, 344366403,     0
$$ Real data points
##PAGE= N=1
##DATA TABLE= (X++(R..R)), XYDATA
$$ [...]
14196B24016k1221m780j3980n4238j4223M0276Q4404J7878k7917K5316K1149n377
14184B71303k5276l2009n6545J5807N743Q070M0533M169N854J7756m1474k3229
14172A90702k6698J0467J7068l9556q423m910k2240r321L9473M7532n0063l2255
14160A11776R892M475k2504J0220K6855K0300n2250l8410J3954m4451K0047l2101
14148B7803k1803J6730K7605K6994K9530M2407n5322j8874L0688m6540j052K6661
14136H4827K8893J47k2079k8599j3764l240j1087K2188O1110L073p978P043k3730
14123I6804j229O1371l586l1095k2827j5630j1719k6487K6371K2043J5509K9696
14111A39221k637j854L339l4410l2671P631m4834k5252k4823K1104M0576Q008
$$ plain form
14196 224016 202795 198015 184035 129797 115574 155850 240254 258132 230215 255531 276680 271303
14184 271303 246027 214018 157473 173280 179023 187093 227626 231795 237649 255405 213931 190702
14172 190702 164004 174471 191539 151983 143560 138650 116410 107089 146562 194094 144031 111776
14160 111776 121668 126143 103639 113859 140714 161014 108764 70354 84308 39857 59904 27803
14148 27803 6000 22730 50335 77329 106859 149266 93944 75070 105758 59218 58166 84827
14136 84827 113720 113867 91788 63189 49425 46185 35098 57286 118396 121469 113491 120534 96804
14123 96804 95575 156946 153360 122265 99438 83808 72089 45602 71973 94016 109525 139221
14111 139221 136584 134730 138069 103659 70988 78619 33785 8533 -16290 4814 45390 53398
14099E3398j1108J1754J9196K5692L133n1706j175K3152l1318O389K6418M636
14087G8461K4156M6844l540L819J4604l1794j5914J4413q252j6798Q036L524M0565
14074A58124L3240r272p1189Q501L801L2699N1332R021J5739J1780K9525q894
14062B64407J3035l7425m8750M555j3620L5410M5345j9778m967j9372O53L871
14050B23364o0245q311L3976K3778n6578r443J8886J7230K7450K2870j8328K928
14038B17577r586l4511J1043N0666l6930p0356j5334O2576L4432l4996m2206l4885
14026I7490r17N385N7213K6516l7116l0118m7764j8940N1046L2868k6902K9262
14014A38023l21j9584n69J8258j9376l0345J0922j3200m9609k2372N6687J2479
$$ plain form
14099 53398 42290 54044 73240 98932 102065 50359 49184 72336 41018 47407 73825 78461
14087 78461 102617 149461 145921 149740 164344 132550 116636 131049 122797 105999 114035 117559 158124
14074 158124 191364 182092 110903 119404 123205 155904 207236 216257 231996 243776 273301 264407
14062 264407 277442 240017 191267 195822 182202 217612 262957 243179 238212 218840 219493 223364
14050 223364 163119 154808 188784 212562 155984 146541 165427 182657 210107 232977 214649 217577
14038 217577 207991 173480 184523 235189 198259 127903 112569 175145 209577 174581 132375 97490
14026 97490 96573 101958 159171 185687 148571 118453 70689 51749 102795 135663 108761 138023
14014 138023 137702 118118 117549 135807 116431 86086 97008 83808 34199 11827 68514 80993
14002H0993l3325J9638J4112k9428l7038k8923M0181K438J8588K9924J0373L439
13990I0972J3716K7986J666K2374L0476k3751k3790j5753M604j9910n758J1200
13978A14032j6978J235L8671j1590k2198L5274L6031n3793l4513O830n5905n763
13966C1333O8769j6352l1469J6724M8244P3674k0788n7504p049n174j6302m3499
13954D0607K2132m599j0498J368R504K6215J1634n934m624m5928J3120K1861l8435
13941C6423j434L0916r486m3691J7846K6579K814J548J1558r833k6759O91J9959
13928E7131L5985j2525k4814k011K1229L0435p167K0913o461J0160J229k1715
13916A02389j5047q436l131K441L0110L5473K1626p487J6921J1804K906l4616
$$ plain form
14002 80993 47668 67306 81418 51990 14952 -13971 26210 28648 47236 77160 87533 90972
13990 90972 104688 132674 134340 156714 187190 163439 139649 123896 128500 108590 102832 114032
13978 114032 97054 98289 136960 125370 103172 138446 174477 120684 86171 93001 37096 31333
13966 31333 100102 83750 52281 69005 117249 190923 170135 112631 105582 100408 84106 40607
13954 40607 62739 58140 47642 49010 58514 84729 96363 90429 85805 39877 52997 74858 36423
13941 36423 34989 65905 56419 12728 30574 57153 59967 61515 73073 63240 36481 37172 57131
13928 57131 93116 80591 55777 53766 74995 105430 98263 119176 112715 122875 124104 102389
13916 102389 87342 78906 75775 78216 108326 143799 165425 157938 174859 186663 189569 154953
13904A54953L6828K3621m3097l3352j6064k114K5811J9027Q266K7896N5996N376
13892B63147l0204L595K916m5983k8961M1927r52k3523j6208l4822K6587J4801
13880A72320M2055k1717R841J613L984N150k3578K3510M5634p584l5653p5916
13868A39659k7876m503j8359J8315N4196M9894k1802l2208k2021K0901k9692l3113
13856I3391n183L5903M855p998r251J7004l6467K2934J4368J8381k2737n0918
13844G4282L917K8687M246J4580K8433l059m7565L581L2839J361j6656k2454M863
13831A07055L4493O607k0074K2621j1817m5591m4504k806J4335l0992k4555L9928
13819D4700J6484N038M106j144j5726l3121k5540O992p964M2127M494R220K3591
$$ plain form
13904 154953 191781 215402 172305 138953 122889 120775 146586 165613 173879 201775 257771 263147
13892 263147 232943 236538 239454 193471 164510 206437 205485 181962 165754 130932 157519 172320
13880 172320 214375 192658 202499 204112 208096 213246 189668 213178 258812 251228 215575 139659
13868 139659 111783 107280 88921 107236 161432 211326 189524 157316 135295 156196 126504 93391
13856 93391 88208 124111 128966 120968 111717 128721 92254 115188 129556 147937 125200 74282
13844 74282 78199 106886 111132 125712 154145 151086 103521 107102 139941 141302 124646 102192 107055
13831 107055 141548 148155 128081 150702 138885 93294 48790 45984 60319 29327 4772 44700
13819 44700 61184 66222 70328 69184 53458 20337 -5203 1789 -6175 35952 40446 49666 73257
13806G3257J2987j6846J4205J4061l948k0311j2565J9770M483n6495l6540j3511
13794b1453L7758J7194m074K3240O3530j3501p2720l0546O5420J9230k6017j0099
13782D7962J5717O2102j5640L55M739l5626n390m7J2915k2881o46L3073J2798
13769A09431M2629k9525n6127J388J5927o848k1553Q998J3593r502L1312N4292
13757A54015k9712n6165p1274n1463N491N2417N6300r527N179l512l6471o643
13745H635K0265M4819J3345L9063K8760l6177n6273m0886J9164O1945K8964m0061
13733I1563l1112j1287l4594O566j1191L337Q158L9302k4916j2653N3436j3957
13721F2652Q216q194l8943m499o037m4922N3210K4041j2537l2518j1439J9963
$$ plain form
13806 73257 86244 69398 83603 97664 93716 73405 60840 80610 85093 28598 -7942 -21453
13794 -21453 16305 33499 29425 52665 116195 102694 29974 -572 64848 84078 58061 47962
13782 47962 63679 125781 110141 110496 115235 79609 74219 74172 87087 64206 63560 96633 109431
13769 109431 152060 122535 66408 67796 83723 76875 55322 64320 77913 68411 99723 154015
13757 154015 124303 68138 -3136 -54599 -49108 3309 59609 50082 55261 51749 15278 8635
13745 8635 28900 73719 87064 126127 154887 118710 62437 21551 40715 102660 131624 91563
13733 91563 60451 49164 14570 21136 9945 13282 21440 60742 35826 23173 76609 62652
13721 62652 70868 62674 23731 19232 13195 -31727 21483 45524 32987 469 -10970 8993
13709H993Q200m19K9216j557m2843J4970L7982K8311k7660k8460k1821L4394L8829
13696G8135M4074K1662j3437p410j8064m2660k0809M9311O7871l40k2828j7722
13684A17783K8289o0k942k5500k4417j7124J9445M619l4164j069P498O034J1862
13671I0254J2913k472J9311J3819n360k774k757j2140K3076K9985k1555k5111
13659A17189M0425K9403k8569n778Q114r034J1647n0741m3348J5424O627l1550
13647E9809K961O3909L131n4252j9958k7636P032J1865j137K7971L2804k4057
13635H2442J525m310j3927n36K7264K5250j7156q120M562J5346M381J5503L5571
13622A67795j2650o942J6898l4533j1349j13N0869K1132n5594l1129L1738L751
$$ plain form
13709 8993 17193 16774 45990 44433 1590 16560 54542 82853 55193 26733 4912 39306 78135
13696 78135 122209 143871 130434 123024 104960 62300 41491 90802 158673 158333 135505 117783
13684 117783 146072 146012 143070 117570 93153 76029 95474 100093 65929 64860 72358 78392 90254
13671 90254 103167 100695 120006 133825 128465 125691 122934 110794 133870 163855 142300 117189
13659 117189 157614 187017 158448 152670 160784 151750 163397 112656 69308 84732 91359 59809
13647 59809 62770 126679 129810 75558 55600 27964 34996 46861 45724 73695 106499 82442
13635 82442 83967 79657 65730 65194 92458 117708 100552 92432 96994 112340 116721 132224 167795
13622 167795 155145 148203 165101 130568 119219 119106 169975 191107 135513 104384 136122 139873
13610A39873n557o025l1395k7679M5416K7818q478J9920l1304l88P864K523L1439
13597A64027O011J8584l9643l4920O740k7225m191K5302r665L1912L9824J2976
13585A89732k4263j8564j1317K188K8999j002k4426R997r608n5017l4023l600
13573D9096L4193L0850L2695m680p276K3159n3857k7278k767J4394M983L168K5866
13560A22546J7669L238q119M7022J2070n0157m7266K8731K4706K2191n042N666
13548A73255m6899k9161J0530R357l904l5023m8735J8050J9919k2855l3471L8575
13536D9638K5515Q7470K9398j7226o9048R983O326N910l812l8999J4527N8909
13524A58591k9628j3824k2557L7110M4346L6284j5554n0440O068o6749j0274P0495
$$ plain form
13610 139873 134316 128291 96896 69217 114633 142451 133973 153893 122589 122201 130065 132588 164027
13597 164027 170038 188622 148979 114059 120799 93574 89383 114685 105020 136932 176756 189732
13585 189732 165469 146905 135588 137776 166775 165773 141347 151344 141736 86719 52696 49096
13573 49096 83289 114139 146834 142154 134878 158037 104180 76902 74135 88529 93512 96680 122546
13560 122546 140215 143453 135334 182356 194426 144269 97003 125734 150440 172631 167589 173255
13548 173255 126356 97195 107725 117082 113178 78155 29420 47470 67389 44534 11063 49638
13536 49638 75153 162623 192021 174795 105747 115730 122056 127966 124154 85155 99682 158591
13524 158591 128963 115139 92582 129692 174038 210322 194768 144328 150396 83647 73373 143868
13512A43868j4515l7471j0597P4682K2928K1829m0351k9846k6686o575J1460K0294
13500A29020K327N5836k408l7827l9052k0339L4274l551k6682L7153j4983j9744
13488I4024l3801j8697J5800l956j7177L2299K6837N325j5612J4718j115k470
13476I6175j9151k9047m2527K5940L6350J983o1382L3937J9553p505K979R409
13464F6714K1734K9107J2018M3981o886j3089M06P905L4836M2217p7071p6721
13452H5151l578L170K0865R329K5110L7118J1405p1984k7370K0217j2913l1733
13440F4787j2832j6956K2566N4526K7103J0806k0027R637p117o607M2553r753
13428A58686l6467J715j224j0125k1844j4285Q217Q796L9775J2123L516j6674
$$ plain form
13512 143868 129353 91882 81285 155967 178895 200724 160373 130527 103841 97266 108726 129020
13500 129020 131347 187183 184775 146948 107896 87557 121831 118280 91598 128751 113768 94024
13488 94024 60223 41526 57326 53370 36193 68492 95329 100654 85042 99760 98645 96175
13476 96175 77024 47977 5450 31390 67740 69723 8341 42278 61831 54326 57305 66714
13464 66714 88448 117555 129573 173554 166668 153579 153985 161890 196726 238943 161872 85151
13452 85151 81573 84743 105608 114937 140047 177165 188570 116586 89216 109433 96520 64787
13440 64787 51955 34999 57565 112091 139194 150000 129973 139610 132493 125886 168439 158686
13428 158686 122219 123934 122710 112585 90741 76456 84673 93469 133244 145367 148883 132209
13416A32209n45n916J8832J5957l8914j0601K2756J902k5110K4330K2436k6961
13404A30375K608j8869P767M1217l3818M9635J9515n7899m8319J4349K1390K5822
13392A53773k541O46L1516j1638n6893j0151j2685j8455p726R935K3111O289J3630
13379A18811n2261L247N5251L6193M8082J2728k1543j4926L258n6656N989M0915
13367A79088R119j8779L3864J0872j6060K0739l3877k4580o3685m7264L5592O8638
13355A53667N7493j8454P06J8031K1970J0289p746m4410n3905K057M2021K6134
13343B07853N821J239O301J5529K2078l9905o1454L7318M2252k8222P50j5126
13331A94434J5393N621j9550J727J4783j4497N772J4105J4341M047r055J9775
$$ plain form
13416 132209 131664 125748 144580 160537 121623 111022 133778 135680 110570 134900 157336 130375
13404 130375 132983 114114 121881 163098 129280 178915 198430 140531 92212 106561 127951 153773
13392 153773 151232 151878 183394 171756 114863 104712 92027 73572 65846 75781 98892 105181 118811
13379 118811 66550 69797 125048 161241 209323 222051 200508 185582 188840 132184 138173 179088
13367 179088 188207 169428 203292 214164 198104 218843 184966 160386 96701 49437 85029 153667
13355 153667 211160 192706 193412 211443 233413 243702 235956 191546 137641 139698 181719 207853
13343 207853 213674 214913 221214 236743 258821 218916 157462 194780 237032 208810 209560 194434
13331 194434 209827 215448 195898 197625 212408 197911 203683 217788 232129 236176 227121 246896
13319B46896J9964O396j1127r3J5047M489J7435j4619n992l4787J9509p158L2696
13306B88656L9873m188k3209j5646J0116K8426k5472p096l061P552K5278o549
13294C14680L8233J557j090P1307Q9166k7065n2852J9618N8067j1455O261K000
13282E08427r327J3963j0715M3418P9715K6089M971M2631O8925N9259M8337L5715
13270I11408O2015N5978O1819R7541J27760J51595J20867J41578J42595J60882
13260B034038J77411K09667J95704K30061K45808K67357K43378K53959K25809
13251D083192K50274K24460J88376K11460K00141J70570K01912J65966J56653
13242E853004J75137J90878K39182K92753K60538K90725L15999L85142M44340
$$ plain form
13319 246896 266860 273256 262129 262036 277083 281572 299007 284388 278396 243609 263118 255960 288656
13306 288656 328529 324341 301132 285486 295602 324028 298556 291460 288399 295951 321229 314680
13294 314680 352913 354470 353380 424687 513853 486788 433936 453554 511621 500166 506427 508427
13282 508427 499100 513063 502348 545766 625481 651570 656541 699172 768097 827356 875693 911408
13270 911408 973423 1029401 1091220 1188761 1316521 1468116 1588983 1730561 1873156 2034038
13260 2034038 2211449 2421116 2616820 2846881 3092689 3360046 3603424 3857383 4083192
13251 4083192 4333466 4557926 4746302 4957762 5157903 5328473 5530385 5696351 5853004
13242 5853004 6028141 6219019 6458201 6750954 7011492 7302217 7618216 8003358 8447698
13233H447698L90674L58158L50333K74416J74758R3774L2344m0225j13686k03248
13223I764996k30617j85540k19588j94425j37628j36321q1161p6634r5294q4443
13213H323345j491O9452k1864o3364n4594p0501j27968j35943r7228j51394k17593
13202G450857r2319j34706j67501j82159j20932m3005k9166L000N1897R2107L7740
13191F865813J26293J31775J42201J19558J63565J83120J80128J66701K36118
13182H315272J86742J94933K30173J94150J90434K39300K40904K84576K90422
13173A0366906L55983M63717M92036N12580N52249N98184N82671N65798N01296
13164A4991420M38972L66660K51675J22302j6r1625j23344j55789j92124j60150
$$ plain form
13233 8447698 8838372 9196530 9546863 9821279 9996037 10089811 10122155 10081930 9968244 9764996
13223 9764996 9534379 9348839 9129251 8934826 8797198 8660877 8579716 8503082 8407788 8323345
13213 8323345 8321854 8391306 8369442 8306078 8251484 8180983 8053015 7917072 7819844 7668450 7450857
13202 7450857 7358538 7223832 7056331 6874172 6753240 6710235 6681069 6684069 6735966 6828073 6865813
13191 6865813 6992106 7123881 7266082 7385640 7549205 7732325 7912453 8079154 8315272
13182 8315272 8502014 8696947 8927120 9121270 9311704 9551004 9791908 10076484 10366906
13173 10366906 10722889 11186606 11678642 12191222 12743471 13341655 13924326 14490124 14991420
13164 14991420 15430392 15797052 16048727 16171029 16171013 16079388 15956044 15800255 15608131 15447981
13154A5447981o7619k3329J0246J17840K07661K16708K75297K59781L07802K96371
13144A7048739J97263P0819p8558j76605k49548l56629m32682m87925n42402n54347
13134A4438125m92946m79609m77620m06108m13664l45452k77991k29748k01561
13125A1113426k32058k52831k01062j98261k33363k49300k58928l00147k78406
13116H909070k84944k39866k15064j67713j75973j29858j04412p7326j207K9021
13106G541728N1837K8202N8168Q1019R2437J92296J83859K05602J96441J77812
13096H809401J42453Q4487M3202K1195J6119O9243Q6418N1729J07463J24641J34703
13085I691054K03697K15146L12247L10583L01801K54726K70705K42506J27005
$$ plain form
13154 15447981 15380362 15357033 15367279 15485119 15692780 15909488 16184785 16444566 16752368 17048739
13144 17048739 17246002 17316821 17238263 17061658 16812110 16455481 16022799 15534874 14992472 14438125
13134 14438125 13945179 13465570 12987950 12581842 12168178 11822726 11544735 11314987 11113426
13125 11113426 10881368 10628537 10427475 10229214 9995851 9746551 9487623 9187476 8909070
13116 8909070 8624126 8384260 8169196 8001483 7825510 7695652 7591240 7513914 7512707 7541728
13106 7541728 7593565 7621767 7679935 7760954 7853391 8045687 8229546 8435148 8631589 8809401
13096 8809401 8951854 9036341 9079543 9100738 9116857 9186100 9272518 9324247 9431710 9556351 9691054
13085 9691054 9894751 10109897 10422144 10732727 11034528 11289254 11559959 11802465 11929470
13076A1929470J30478O0723r9805j80040k53640l45159l35290l76563m05456l45057
13066I779661l16750k90773k97012k23417j91277k30162j95015j95642j67271
13057G672342j70937k02048k45566k84572k94121k82536k83194l22883l22653
13048E263832k87434k63333k91391l08989k67164j94167k22956k03273k15869
13039C009256j90343j72608j53825j43936j70216j05728n5459j05233j14803j01100
13029A696005r8558o5588q7495p4451m8357o4634o8520l8864l5653l3180o23n238
13017A074844m0748j05709l5984M7629l5217q8782j0967M665m7716o5415J140
13006F97740j6070k1854k5665k5108K2994o360k8229o6345k227K4677k8851m3222
$$ plain form
13076 11929470 12059948 12120671 12020866 11840826 11587186 11242027 10906737 10530174 10124718 9779661
13066 9779661 9462911 9172138 8875126 8651709 8460432 8230270 8035255 7839613 7672342
13057 7672342 7501405 7299357 7053791 6769219 6475098 6192562 5909368 5586485 5263832
13048 5263832 4976398 4713065 4421674 4112685 3845521 3651354 3428398 3225125 3009256
13039 3009256 2818913 2646305 2492480 2348544 2178328 2072600 2017141 1911908 1797105 1696005
13029 1696005 1597447 1531859 1444364 1369913 1321556 1256922 1188402 1149538 1113885 1080705 1080082 1074844
13017 1074844 1034096 928387 892403 940032 904815 816033 805066 809731 762015 696600 697740
13006 697740 681670 659816 634151 609043 632037 625677 597448 531103 528876 553553 524702 481480
12994D81480M4159O926l2315k3453o1982K6475n834K0181J6083j309M513J3317
12982D88241j2258k8423K4068j958l1753n8461K0732K7419j4899n1513k2904J7197
12970C55488Q311K6219k8540j6707P642L573L2253j3671p336J4572m6996k7124
12958C07684M1398K3598j7989L5114M2656l3236n9240m5435R65J3266J7261L3323
12946C59365J0648M8198L280m1044j2506k0461j1675K3730j1566o1591J8194k021
12934C02551J0840k5121q627K5218K4909n450k5270k0330l742j2776k8592L7618
12922B71228N0037O199k7936m9348M5317J8606J367m7557k752m901m0582l067
12910B16611M652j3672L2670K2307r298P368m1747j097K4648N6463j1552j9524
$$ plain form
12994 481480 525639 532565 500250 476797 414815 441290 435456 455637 471720 470411 474924 488241
12982 488241 475983 447560 471628 469670 437917 379456 400188 427607 412708 361195 338291 355488
12970 355488 363799 390018 361478 344771 352413 355986 388239 374568 367232 381804 334808 307684
12958 307684 349082 372680 354691 389805 432461 399225 339985 294550 295515 308781 326042 359365
12946 359365 370013 418211 421491 380447 367941 347480 335805 359535 347969 286378 304572 302551
12934 302551 313391 288270 279643 304861 329770 324320 299050 278720 274978 262202 233610 271228
12922 271228 321265 327464 299528 250180 295497 314103 315470 267913 265161 260260 219678 216611
12910 216611 221263 207591 240261 262568 253270 260638 218891 217794 242442 298905 287353 267829
12898B67829J9162L8985L0675m2572l4841r247Q409J5918J9547k4116o090k7698
12886B55961k8314p671Q636K386j6983J2631K4924M3700k9676p336l8855k0328
12874A99075m373J1214O472J7273j1531k0110N638R685J7286M1303J8685l7660
12862B52957p711J263k720J140R863j5955j4435j9266k6187k679P2517M2489N632
12849B96908N535L5676J0899k9580n0487l1998n439j6365q985K0850n654k3809
12837A97551j8818K3741j5655Q859P0277K6846m7516j0038J0047J3068j7201j7678
12825B23483p302M0016N5418J6143k9424k9810L070K9096J156J7881j033L7586
12813C56280L4357m9062m3120k3535J8418P492J2562m3594K918k8683l3170N157
$$ plain form
12898 267829 286991 325976 356651 314079 279238 269991 278400 294318 313865 289749 283659 255961
12886 255961 227647 219976 228612 230998 214015 226646 251570 295270 265594 258258 219403 199075
12874 199075 194702 205916 212388 229661 218130 198020 203658 213343 230629 271932 290617 252957
12862 252957 245246 246509 243789 244929 254792 238837 224402 205136 178949 176270 248787 291276 296908
12849 296908 302443 338119 349018 319438 268951 236953 231514 215149 206164 227014 221360 197551
12837 197551 178733 202474 186819 195678 265955 292801 245285 235247 245294 258362 241161 223483
12825 223483 216181 256197 311615 327758 298334 268524 271594 300690 301846 319727 318694 356280
12813 356280 390637 341575 298455 274920 293338 300830 313392 269798 272716 244033 210863 216020
12801B16020K5799K6079J6511L3393M167j913J1218l8062p1070p249M2853O4793
12789C22539J6750q610k5681m5653n065K9409k4709J6270k2406j871L7174K9294
12777C17441k718l1753P559N3405j45O437l7076J082j8932L0571K4233j5096l280
12764C31728j2329k4892J1960m151j0879k5169K977M4840O1886l638l21O424J4223
12751C92659M650j1977o4067k0475m7793R370N2783M1357l3892l8430o2666J9323
12739B40842L4458L7529M5868p0197q1158L8678P9295K4088k4605Q166K5445o629
12727C51780R465M2612J291L0396n4961k1603j1659l2814K2225k468L423J517
12715C39204k3682j6196j8044L9931O2110J4553l7031m8993k0544M870O0389K6960
$$ plain form
12801 216020 241819 267898 284409 317802 321969 320056 331274 293212 222142 214893 257746 322539
12789 322539 339289 330679 304998 259345 254280 283689 258980 275250 252844 250973 288147 317441
12777 317441 314723 282970 290529 343934 343789 350226 313150 314232 295300 325871 350104 335008 331728
12764 331728 319399 294507 306467 302316 291437 266268 269245 314085 375971 372333 372012 378436 392659
12751 392659 397309 385332 321265 300790 252997 262367 315150 356507 322615 284185 221519 240842
12739 240842 275300 312829 358697 288500 207342 246020 325315 349403 324798 332964 358409 351780
12727 351780 361245 403857 405148 435544 380583 358980 347321 314507 336732 334264 337687 339204
12715 339204 315522 299326 281282 321213 383323 397876 360845 311852 291308 296178 356567 383527
12703C83527n731J6441m3582K5405L7810K9962n5588o1303j1194M2827J8228k5797
12691C51005r772M331K9192O809J9144M3666j3540m913k0064k0189k2118k542
12679C61009n37J016O3900k1482m7984k026K7466r557J2357j4548k5031r165n403
12666C30015J5645n858N389J2241m4244k3623j1967M1320N1264J6899o434n0401
12654C30246l1653k159M133L2142M4324N188K9671P636q624p0620K4799J3737
12642C78820J4252j566j976l1662q020O14K5099M9278K3314j8877l3615l315K242
12629C94588n692J1191j6433j043k58m43Q549K941J8576l619o078j9087j8069
12616C65123J8292q4m3260J3885J6584K7307J1639j7769O169l307J0452l1033
$$ plain form
12703 383527 377796 394237 350655 376060 413870 443832 388244 326941 315747 358574 376802 351005
12691 351005 341233 345564 374756 381565 400709 444375 430835 425922 405858 385669 363551 361009
12679 361009 360472 361488 425388 403906 355922 353896 381362 371805 384162 369614 344583 335418 330015
12666 330015 345660 339802 345191 357432 313188 289565 277598 318918 370182 387081 380647 330246
12654 330246 298593 296434 300567 332709 377033 382221 411892 419528 410904 340284 365083 378820
12642 378820 393072 391506 389530 357868 349848 350462 375561 424839 448153 429276 395661 392346 394588
12629 394588 388896 400087 383654 382611 382353 381910 390459 393400 411976 408357 402279 383192 365123
12616 365123 383415 383331 340071 353956 370540 397847 409486 391717 397886 394579 405031 373998
12604C73998J798L2500j3986k0083K765k99M258K5503p253m8265n040R775J5345
12591C71016k9419n2758K6230J6197L185M1371L6880k7127p5165j7028K8972P6555
12579C98909O1416n530k5366K9084J8698m2560k9628M45k4318k9109m5859j8625
12567B87557K2330K4390J0503K4349K999j5003j2468M445J7987K3730P159l138
12555C94840j0148k7503k3386l384o563j3703N0290N4764J0245K8864K845j1310
12543D45851k3138n852l0376m978l9145K4840J2818m3227j1824K7079K041q587
12531C45502Q477O6550M805J5919n543K1600q156p5262k1245K3848r901J2636
12519C79230j2890l0804o496M8079J9308k474Q5939K4320o8296p4669l5653M2801
$$ plain form
12604 373998 375796 408296 394310 374227 376992 376693 380951 406454 399201 350936 345896 355671 371016
12591 371016 341597 288839 315069 331266 334451 375822 412702 385575 310410 293382 322354 398909
12579 398909 460325 454795 429429 458513 477211 434651 405023 405468 381150 352041 306182 287557
12567 287557 309887 334277 344780 369129 372128 357125 344657 349102 367089 390819 397978 394840
12555 394840 384692 357189 333803 330419 323856 310153 360443 415207 425452 454316 457161 445851
12543 445851 422713 416861 386485 381507 342362 367202 380020 336793 324969 352048 354089 345502
12531 345502 353979 420529 425334 441253 435710 457310 449154 373892 352647 376495 366594 379230
12519 379230 366340 335536 329040 377119 396427 393953 479892 504212 435916 361247 325594 368395
12507C68395L7986L520J8270M5185o30J2079p49o745J397l7051k6639J9409P660
12494D42087J9546j46n058o0347J2299M2681J5012p824j6971O943J7691J4543
12482D80456j9200n621j2344L4969L7811q46k3964k6419J9421O830J0680m2583
12470D59190m6883P084r163L1693J2834K7688J0627J0825m61j572l3917k0911
12458D47034K3096O868j6344j2022J6527L4744J7860m7556j3235j2882j2858M6990
12446D78222K6246m9805K292j9424M5202J4566k2066K4835j2410j2364L3024O434
12434E14752j4884l1893R260L931k9603K9427J0128J0992O203J603K2151R748
12422E41815J4489M9640P769o1815N604M2605j7094l8573l4989L501J1290M4139
$$ plain form
12507 368395 406381 409901 428171 473356 472726 484805 484056 477311 478708 441657 415018 434427 442087
12494 442087 461633 461487 456429 396082 408381 451062 466074 458250 441279 448222 465913 480456
12482 480456 461256 455635 443291 478260 516071 515225 491261 464842 484263 491093 501773 459190
12470 459190 412307 419391 410228 441921 454755 482443 493070 503895 503434 501862 467945 447034
12458 447034 470130 476998 460654 448632 465159 499903 517763 470207 456972 444090 431232 478222
12446 478222 504468 454663 456955 437531 482733 497299 475233 500068 487658 475294 508318 514752
12434 514752 499868 467975 477235 481166 451563 480990 491118 502110 508313 509916 532067 541815
12422 541815 556304 605944 613713 551898 557502 600107 583013 544440 509451 512952 524242 568381
12410E68381k1256j8528J0786L1761K7278m605n2379o1633J251k2254Q1431P1591
12398F11824j5051j2594J9962l2851m2080p572L0406j335k9154J2011J7406J3786
12386E64758M3228J2038Q930j0691k3516L5735j0988n6296k0319K1814L277J5887
12374E83857j6343o618J5886k6611p998J7642M4750J8310j753K0164J7620L816
12362F62722k4620k7093l0322j8647N8981K9932m0303R363L150P20n855l956R8940
12349G13012P1172o593l5321J1068j4918k320o3564j8971L8995N8965m177l8783
12337G08565l525N509N311N0202J4126j9517l9197k8710j4657L8073R594J3571
12325G39345P758o562l7735j4911O706r819L0605j172k5883J876J4515K6258J6414
$$ plain form
12410 568381 547125 528597 539383 571144 598422 593817 541438 479805 481056 458802 540233 611824
12398 611824 596773 584179 604141 571290 529210 521638 552044 550709 521555 533566 550972 564758
12386 564758 607986 620024 628954 618263 594747 630482 619494 563198 542879 564693 567970 583857
12374 583857 567514 560896 576782 550171 542173 559815 604565 622875 621122 641286 658906 662722
12362 662722 638102 611009 580687 562040 621021 650953 610650 620013 623163 623883 618028 614072 713012
12349 713012 784184 777591 742270 753338 738420 736100 672536 653565 692560 751525 747348 708565
12337 708565 705040 710549 715860 766062 780188 760671 721474 692764 678107 716180 725774 739345
12325 739345 747103 740541 702806 687895 694601 684782 715387 714215 688332 690208 704723 730981 747395
12312G47395p985m511n6436l3970j8306R1221j866j3613L2275M51m089p315q099
12299G15152l188J9119K2629o7450l4920l349J0418Q379J5261M9017J4362j0922
12287G34508J9874K8507r59J0728m2388j4099K7710R632k3344J5423J9747O517
12275G91856l2374m8663j444q209J7488k4377n0127k4019q886J2993L4690O5140
12263G24068K4418r606N3408j7942j9928n911M1229M6919j1176K2146k875j9892
12251H24858j0419l4701j0347O405K952K3061R330l4981L12L6149Q3731P749p824
12238H96275l4633l4327k3457J7647K1270j4220k525L7272j1876k7619j0778M1905
12226H54934J078k3322N8234J1755j0633L0503j8331o1312p102N4867J423j5031
$$ plain form
12312 747395 739410 734899 678463 644493 626187 717408 715542 701929 734204 734655 730566 723251 715152
12299 715152 711964 731083 753712 686262 651342 647993 658411 666790 682051 731068 745430 734508
12287 734508 754382 782889 781930 792658 750270 736171 763881 773513 750169 765592 785339 791856
12275 791856 759482 710819 709375 701166 718654 694277 644150 620131 611245 624238 658928 724068
12263 724068 748486 738880 792288 774346 754418 748507 789736 836655 825479 847625 844750 824858
12251 824858 814439 779738 769391 775796 778748 801809 811139 776158 776470 812619 896350 904099 896275
12238 896275 861642 827315 803858 821505 842775 828555 826030 863302 851426 823807 813029 854934
12226 854934 856012 832690 890924 902679 892046 922549 904218 842906 835804 890671 892094 877063
12214H77063l1508j195j506j0281j6883J0315j6453K6800J7112J0742k0149J3266
12202H57323k2430j2743K5912K1328M499K9355N532L0666O731k6840k4325k8669
12190H66339K025K9997r544p4341j3145N0858L4107K9832j2486n306r331L1551
12178I20556M4670L5971m1292L562l919K3494k9287l9565L415J3814o249M3317
12166I68487M4212k2902o0974K5453N1519L4967j4985k8897R345L4637K2860l2778
12154A030944j4383j439K5309o867l5153j8641L8236R720q6129j1521N9869J4052
12142A003997k5284N47M7052L6627K7864k2950n0597j7169L0813M021K4974J4521
12130A074416n0224L241J8203M1141l7266m1844j7504J1550m2757k779K3340J9898
$$ plain form
12214 877063 845555 844360 842854 832573 815690 826005 809552 836352 853464 864206 844057 857323
12202 857323 834893 822150 848062 869390 873889 903244 908776 939442 946173 919333 895008 866339
12190 866339 868364 898361 888817 814476 801331 852189 886296 916128 903642 898336 889005 920556
12178 920556 965226 1001197 959905 963467 959548 983042 953755 914190 917605 931419 925170 968487
12166 968487 1012699 989797 928823 954276 1005795 1040762 1025777 996880 1006225 1040862 1063722 1030944
12154 1030944 1016561 1015122 1040431 1033564 998411 979770 1018006 1027726 941597 930076 989945 1003997
12142 1003997 978713 979260 1026312 1062939 1090803 1067853 1017256 1000087 1030900 1034921 1059895 1074416
12130 1074416 1024192 1027433 1045636 1086777 1049511 1007667 990163 1001713 958956 956177 979517 999415
12118I99415M0875o877l0705q944J2627M8179M0922p784k3459J1915J3060J1871
12106A101095J8079k6429k1138k6352J4364J3462L6930J192j6451J7537J3565
12095A125854j899k7536O528J6598k0965K2931L9352q068k2544j1313L602k9990
12083A092550m801R978K8753K5192L4210K21j6022m275K0953j0121M9899j1073
12071A215464k1400k7387k596l6933n556j027K6558J2586p037l0355Q19L0183
12059A153319j792R268K5081K3900j759J734j2485R759J4100k8612n1295K6286
12047A167504K1690j3680k2374l4527L0071N5109n0560O151K7512k0522l8810
12036A127564L6623K1729r83j0399j3255K9940n019l8375K298O8753M6649m2649
$$ plain form
12118 999415 1040290 1033413 1002708 993764 1006391 1054570 1095492 1087708 1064249 1076164 1089224 1101095
12106 1101095 1119174 1092745 1071607 1045255 1059619 1073081 1110011 1111203 1094752 1112289 1125854
12095 1125854 1123955 1096419 1102947 1119545 1098580 1121511 1160863 1152795 1130251 1118938 1122540 1092550
12083 1092550 1087749 1097727 1126480 1151672 1185882 1186103 1170081 1165806 1186759 1176638 1226537 1215464
12071 1215464 1194064 1166677 1164081 1127148 1121592 1120565 1147123 1159709 1152672 1122317 1123136 1153319
12059 1153319 1151527 1160795 1185876 1209776 1208017 1209751 1197266 1207025 1221125 1192513 1141218 1167504
12047 1167504 1189194 1175514 1153140 1118613 1148684 1203793 1153233 1159384 1186896 1166374 1127564
12036 1127564 1164187 1185916 1184933 1174534 1161279 1191219 1186200 1147825 1150123 1218876 1265525 1222876
12024A222876k7295J1258K4417J1268p02K6121k0413l9769l7296J6674K5l649
12012A183515M5020O1759J6517o581l4178j8289j7478j1861k4423m3652J831M8054
12000A200234K8181M4468p326m7885J0901J6261M3166o845o373j190j9514l177
11988A250901j136J6428j0922L3455k1604o7129j5284L3567L7480J9320j6629
11977A258447M0143M901N931L1837n9803m1640q646j8853J9387L8007K4857m179
11965A290389J3658k5333j6521L7088R633m7871o3893j2523L4005K5702o691j491
11953A236152K7599J7353n501J009K3828J736Q131j6674l6474l1726L0929K3647
11941A280009p269J2546j9863j4509K1967M4866Q373m77j3850L7043M8568N6203
$$ plain form
12024 1222876 1195581 1206839 1231256 1242524 1241822 1267943 1247530 1207761 1170465 1187139 1187164 1183515
12012 1183515 1228535 1290294 1306811 1300230 1266052 1247763 1230285 1218424 1194001 1150349 1152180 1200234
12000 1200234 1228415 1272883 1265557 1217672 1228573 1244834 1288000 1281155 1274782 1273592 1254078 1250901
11988 1250901 1249765 1266193 1255271 1288726 1267122 1199993 1184709 1218276 1255756 1275076 1258447
11977 1258447 1298590 1303491 1309422 1341259 1281456 1239816 1231170 1212317 1231704 1269711 1294568 1290389
11965 1290389 1304047 1278714 1262193 1299281 1308914 1261043 1197150 1184627 1218632 1244334 1237643 1236152
11953 1236152 1263751 1281104 1275603 1276612 1300440 1302176 1310307 1293633 1257159 1225433 1256362 1280009
11941 1280009 1272740 1285286 1265423 1250914 1272881 1317747 1326120 1325643 1311793 1348836 1397404 1453607
11929A453607k6172q1138n9883m817K1685n4k5921k7231J183k052P011o337k8109
11916A221772L1295L9039K6279K3575m4707j5828N5551N107j6411k150Q975K294
11904A334791l71m3893M8584M2917k6119j4509K4406k3535m4517J6620L45J5737
11892A330456l5441L119L0103j4990K0694j9398J0444q503m3597j5897k4137j6758
11880A216095k7255k9231K626L0992R856q575k5439o916M742K1053k5857L0488
11868A192579P9303K0385p2790j3008K7618N490L0874J9963j3296L4484j3563
11857A298039j8098o1024k0193M4221M8491m1833K8999L1042k2371k1385k5629
11846A240259P000R937L138l183J4515j101k7892N2986j1796j3543j479O842j7794
$$ plain form
11929 1453607 1427435 1346297 1286414 1281597 1303282 1303228 1277307 1250076 1251259 1249207 1256218 1249881 1221772
11916 1221772 1253067 1292106 1318385 1341960 1297253 1281425 1336976 1342083 1325672 1323522 1332497 1334791
11904 1334791 1334420 1290527 1339111 1382028 1355909 1341400 1365806 1342271 1297754 1314374 1314719 1330456
11892 1330456 1295015 1298134 1328237 1313247 1333941 1314543 1324987 1316484 1272887 1256990 1232853 1216095
11880 1216095 1188840 1159609 1162235 1193227 1203083 1194508 1169069 1162153 1166895 1187948 1162091 1192579
11868 1192579 1271882 1292267 1219477 1206469 1234087 1239577 1270451 1290414 1277118 1311602 1298039
11857 1298039 1279941 1218917 1198724 1242945 1291436 1249603 1278602 1309644 1287273 1265888 1240259
11846 1240259 1247259 1257196 1260334 1257151 1271666 1270565 1242673 1295659 1283863 1270320 1268841 1275683 1257889
11833A257889j0162p058J8811r731k5400O039K9506L4399j0121K700N8062k2831
11821A322103k4525J3470J254K2312L3955n5203O190J6586o002O142k641j4607
11809A319034m776M5183J1193Q1148K8714M7666M7906j7350q6094o2957j4881
11798A394786Q862m7287M661l2335n8292K7118N6370K4113m4679m2953j5921k355
11786A272088L5613k0179J5637J686J4044j3289q433L9622K6680M1901J2540k0057
11774A397853l9953j7343M4354M3561P3007K4647J951o860j9631k862L7532M3810
11762A580066J8336J2479J5037j3448q053L1647p70P7732P2963L4244N1515P2492
11750A944240Q2468N8553j6427O8575P1433M5944J00411J19311J30789J66436
$$ plain form
11833 1257889 1247727 1240669 1259480 1249749 1224349 1230388 1259894 1294293 1284172 1286872 1344934 1322103
11821 1322103 1297578 1311048 1312302 1334614 1368569 1313366 1319556 1336142 1330140 1336282 1333641 1319034
11809 1319034 1314258 1359441 1370634 1451782 1480496 1528162 1576068 1558718 1472624 1409667 1394786
11798 1394786 1403648 1356361 1361022 1328687 1270395 1297513 1353883 1377996 1333317 1290364 1274443 1272088
11786 1272088 1307701 1287522 1303159 1304845 1318889 1305600 1297167 1336789 1363469 1405370 1417910 1397853
11774 1397853 1357900 1340557 1384911 1428472 1501479 1526126 1528077 1521217 1501586 1498724 1536256 1580066
11762 1580066 1598402 1610881 1625918 1612470 1604417 1636064 1635294 1713026 1785989 1820233 1871748 1944240
11750 1944240 2026708 2085261 2068834 2137409 2208842 2254786 2355197 2474508 2605297 2771733
11740B771733J77385J79270J75471K19098K40160K45849J91779J94122K47801
11731D642668K19551J86051J58524J29819J03623J02934O8014N192o8845o1795
11721E485736m4430k2768l2702j44L376J08546J42790J29005J54432J51503J75463
11710F250807J56692J38215R5781R604l3008j00093j55466j69889j86108k44964
11700E761571k90865k62299k49375k57112j91537k05344j83743j28748j52508
11691C840040j63760j42198p8865o8169r3636o8399n0932p1508l6321k8588m7484
11680B990180l7286L3184N9666K1724K2362P761P215J8272N6981J23081J44431
11669C447571J24214R6319J29941K34247K24640K02507K32812K81420L25154L16906
$$ plain form
11740 2771733 2949118 3128388 3303859 3522957 3763117 4008966 4200745 4394867 4642668
11731 4642668 4862219 5048270 5206794 5336613 5440236 5543170 5611184 5616376 5547531 5485736
11721 5485736 5441306 5418538 5385836 5385692 5389068 5497614 5640404 5769409 5923841 6075344 6250807
11710 6250807 6407499 6545714 6641495 6651099 6618091 6517998 6362532 6192643 6006535 5761571
11700 5761571 5470706 5208407 4959032 4701920 4510383 4305039 4121296 3992548 3840040
11691 3840040 3676280 3534082 3455217 3387048 3293412 3225013 3174081 3102573 3066252 3037664 2990180
11680 2990180 2952894 2986078 3045744 3067468 3089830 3097591 3104806 3123078 3180059 3303140 3447571
11669 3447571 3571785 3668104 3798045 4032292 4256932 4459439 4692251 4973671 5298825 5615731
11659E615731L38035L73091L56227L78752L34423K91887K61914K52957K34584
11650H437601K33946J75398J69028J64700J18498J61426J57372J46267J99436
11641I963672J71772J52822J40269J11148J10114J38099L6063L0920M078q3120
11631A0775837p5105q1711j19156j88248j62763j65991j29719r8691j59535j85466
11621I409452j76496j96791k46048k68935l19302l36061l16795l64016l81180
11612F803828l36508k67539k83930l29713k81450k40973k39304j73175j68724
11603D482512j52047j14141j23465j98188j72144j08774r4310o0827q9389j18125
11593C251102o4007j9397n8954J0147M1378j2485l2134J3193j597N6645J33998
$$ plain form
11659 5615731 5953766 6326857 6683084 7061836 7396259 7688146 7950060 8203017 8437601
11650 8437601 8671547 8846945 9015973 9180673 9299171 9460597 9617969 9764236 9963672
11641 9963672 10135444 10288266 10428535 10539683 10649797 10787896 10823959 10854879 10858957 10775837
11631 10775837 10700732 10619021 10499865 10311617 10148854 9982863 9853144 9754453 9594918 9409452
11621 9409452 9232956 9036165 8790117 8521182 8201880 7865819 7549024 7185008 6803828
11612 6803828 6467320 6199781 5915851 5586138 5304688 5063715 4824411 4651236 4482512
11603 4482512 4330465 4216324 4092859 3894671 3722527 3613753 3519443 3458616 3369227 3251102
11593 3251102 3187095 3167698 3108744 3118891 3160269 3147784 3115650 3128843 3127246 3183891 3317889
11582C317889Q7454Q3568Q3471O7191R9255K40104K03543J91777K10660K44153
11572D829065L40799L03246K47509K59496K31358J80475J64285J14997J654l3776
11562F639108o9770l1690p6517r8465j01734l8983L628K7871J0257N1742P1993
11551F387440K7624N6114J06708J17086O2794j6798l9796o8273j28943j52094
11541F351862k33592k38746k35552k21660k16086j90131k16585k47840k21372
11532D330298j87479j72921j50637r6722j32726p1661j69537j26644n2846p4015
11522C095110j7873k4645n9497p2623n7219p0782l9223k6308j4712L3636n599
11511B740265L0474M264k0287M7635M0273L1482O6945R6314J04606R3062N4463
$$ plain form
11582 3317889 3405343 3488911 3572382 3639573 3738828 3978932 4182475 4374252 4584912 4829065
11572 4829065 5169864 5473110 5720619 5980115 6211473 6391948 6556233 6671230 6672884 6639108
11562 6639108 6569338 6537648 6461131 6362666 6260932 6221949 6225577 6253448 6263705 6315447 6387440
11551 6387440 6415064 6471178 6577886 6694972 6757766 6740968 6701172 6632899 6503956 6351862
11541 6351862 6118270 5879524 5643972 5422312 5206226 5016095 4799510 4551670 4330298
11532 4330298 4142819 3969898 3819261 3722539 3589813 3518152 3348615 3221971 3169125 3095110
11522 3095110 3077237 3052592 2993095 2920472 2863253 2792471 2753248 2726940 2712228 2745864 2740265
11511 2740265 2770739 2775003 2754716 2802351 2842624 2874106 2941051 3037365 3141971 3235033 3289496
11500C289496P5463J13031J45837J81909J62174J83258J97615J75582J47593J64017
11490D835975J74077J10414P5962R845k1678p354k2047j01184j23343j38634o5188
11479D726845q3918j02757p3718l0826p2390l2179J368M6025O3387J24747J48347
11468D714931J27058J10316J33305J75203K54569K40906J91120J64899J6552k0221
11458F108638m6360p3016j03446j73333j46669j37615k07797k36003j90019j57518
11448D636862j64770j08030r6422m7578o0578o9750p7422p8808p0116l512O1532
11437C921408O6442Q5117J20219J12466R0546J47891J89390J54429K08488K91589
11427E387985J99329K43405K52153K40797K42194K37072J62515N7345L747L9112
$$ plain form
11500 3289496 3364959 3477990 3623827 3805736 3967910 4151168 4348783 4524365 4671958 4835975
11490 4835975 5010052 5120466 5196428 5206273 5184595 5177241 5155194 5054010 4930667 4792033 4726845
11479 4726845 4642927 4540170 4466452 4435626 4363236 4331057 4332425 4378450 4441837 4566584 4714931
11468 4714931 4841989 4952305 5085610 5260813 5515382 5756288 5947408 6112307 6128859 6108638
11458 6108638 6062278 5989262 5885816 5712483 5565814 5428199 5220402 4984399 4794380 4636862
11448 4636862 4472092 4364062 4267640 4220062 4159484 4089734 4012312 3933504 3863388 3859876 3921408
11437 3921408 3987850 4072967 4193186 4305652 4396198 4544089 4733479 4887908 5096396 5387985
11427 5387985 5587314 5830719 6082872 6323669 6565863 6802935 6965450 7022795 7026542 7065654
11417G065654O3065O0694O683J525O1614R0502J07229Q9765J46150J88861K91123
11406H172865K94593K78281K72779L00323L41601L69397L88584L90448L78355
11397A1187226M05350M01243M01127M01210M10432L50786L06055K20369J95103
11388A4278901J86364J59378J71598K27692K60704K16386L22165L76550M14547
11379A6614285M36397M05856L02006K61205K38621J45084K2419l7045j39723j79507
11369A8069598k50031l19341l99928l77428l61730l12685k73017k42945k36097
11360A5296396j72351k05064k71714k60383k93803l75202l49905l80363m21630
11351A2565981m17553l92468l67672l42758l31758l74703l05993l01050k56940
$$ plain form
11417 7065654 7128719 7189413 7196096 7197621 7259235 7349737 7456966 7546731 7692881 7881742 8172865
11406 8172865 8467458 8745739 9018518 9318841 9660442 10029839 10418423 10808871 11187226
11397 11187226 11592576 11993819 12394946 12796156 13206588 13557374 13863429 14083798 14278901
11388 14278901 14465265 14624643 14796241 15023933 15284637 15501023 15823188 16199738 16614285
11379 16614285 17050682 17456538 17758544 18019749 18258370 18403454 18425873 18388828 18249105 18069598
11369 18069598 17819567 17500226 17100298 16722870 16361140 16048455 15775438 15532493 15296396
11360 15296396 15124045 14918981 14647267 14386884 14093081 13717879 13367974 12987611 12565981
11351 12565981 12148428 11755960 11388288 11045530 10713772 10339069 10033076 9732026 9475086
11342I475086k24654j92825j54065j54038l9189l1722q6140n6274l0666j58342
11332H347171j79959j78860j92412j22269j21009j18216j27675j27729o2760k193
11322G114089O3782J02800J21294J81098K71999L36577M16244M52130N82336O35858
11312A0278207P42691P80786Q24425R32723J026279R82300R15465R16547Q69907
11303A8269330Q76640Q68090Q45105Q56483R10575R00504R68940J048460J084584
11294B6628711J061518J055703J002849R83656Q93434P72898N75263M30666L18740
11285C3723438J47363O3310j7080k25091k64648k97177l80170l33734k95609k87471
11275C1833131l33802k99829l09116l56583m17710m98045n44481o79662p78222
$$ plain form
11342 9475086 9250432 9057607 8903542 8749504 8710315 8678593 8592453 8536179 8505513 8347171
11332 8347171 8167212 7988352 7795940 7673671 7552662 7434446 7306771 7179042 7116282 7114089
11322 7114089 7177871 7280671 7401965 7583063 7855062 8191639 8607883 9060013 9642349 10278207
11312 10278207 11020898 11801684 12626109 13558832 14585111 15567411 16482876 17399423 18269330
11303 18269330 19145970 20014060 20859165 21715648 22626223 23526727 24495667 25544127 26628711
11294 26628711 27690229 28745932 29748781 30732437 31625871 32398769 32974032 33404698 33723438
11285 33723438 33870801 33934111 33917031 33691940 33427292 33130115 32749945 32416211 32120602 31833131
11275 31833131 31499329 31199500 30890384 30533801 30116091 29618046 29073565 28393903 27615681
11266B7615681q14044r11747j008265j016230j070690j109263j117011j128598
11258A9439833j138474j130973j188111j155396j064072r81392r45765r00208
11250A0935442q42778o81533n93540n78868n14006m53550m24617l69629l22562
11241F154359k82206k92887k43152j60729j53669j60152j35724j18529q7008l4782
11231D485521M276J38j5869k145P3917Q2497R2534J28889K14288L03661L35096
11220E702803L94189M50862N37978O22052P55814Q46121Q61810R84442J003125
11211A2159196J087160J109257J014183Q50069O80168M90326K82751J46144J0860
11202A7830114o9063n9041r1768p9185j0760Q8924J70805K62341M53312N21793
$$ plain form
11266 27615681 26801637 25889890 24881625 23865395 22794705 21685442 20568431 19439833
11258 19439833 18301359 17170386 15982275 14826879 13762807 12781415 11835650 10935442
11250 10935442 10092664 9411131 8817591 8238723 7724717 7271167 6846550 6476921 6154359
11241 6154359 5872153 5579266 5336114 5175385 5021716 4861564 4725840 4607311 4520303 4485521
11231 4485521 4489797 4489935 4474066 4471921 4545838 4628335 4720869 4849758 5064046 5367707 5702803
11220 5702803 6096992 6547854 7085832 7707884 8463698 9309819 10171629 11156071 12159196
11211 12159196 13246356 14355613 15369796 16219865 16900033 17390359 17673110 17819254 17830114
11202 17830114 17761051 17702010 17610242 17531057 17520297 17609221 17780026 18042367 18495679 19017472
11192A9017472O77044Q36397R47046J071825J208667J369977J412019J342883
11184B7883330J257090J025243P26071L78207m2173m06765p00332r34406j123173
11175B8063092j194170j163983j108565j029238r14289q22160p28418n81965m67779
11166B0052525l62164k88670r1902j8226O2605J81699J80786J11548M7571q7295
11156A9788477k20997m28604o18134p93000r50632j047632j073311j069937j038674
11147A2547556r29684r06358q23331p05581o46236n58611n41831m96969l84431
11138F554524l34852l28322k44385k05513j62765j11154j00756l6872L7093K5190
11128E092188Q9655J73542K62277K63387L15144L37518K85306K68150K04956J57828
$$ plain form
11192 19017472 19694516 20530913 21477959 22549784 23758451 25128428 26540447 27883330
11184 27883330 29140420 30165663 30891734 31269941 31227768 30821003 30120671 29186265 28063092
11175 28063092 26868922 25704939 24596374 23567136 22652847 21830687 21102269 20520304 20052525
11166 20052525 19690361 19401691 19309789 19291563 19354168 19535867 19716653 19828201 19875772 19788477
11156 19788477 19567480 19138876 18520742 17727742 16777110 15729478 14656167 13586230 12547556
11147 12547556 11617872 10711514 9888183 9182602 8536366 7977755 7435924 6938955 6554524
11138 6554524 6219672 5891350 5646965 5441452 5278687 5167533 5066777 5029905 5066998 5092188
11128 5092188 5181843 5355385 5617662 5881049 6196193 6533711 6819017 7087167 7292123 7449951
11118G449951P3270K4552m3312j15618q4494p5075p5562l5687l2950N7423J19049
11107G261547J04676J38508K93945K94194L65110M31707N38212O09007O13940
11098A0650846N96057N58560M13891L48635J79482m3241j66248l01561m82562
11089A1753859n05064n12912n12755m35786m06404m18921k93857k19345k06310
11080H242505j61061j40078q4005k1877Q1402J55865J10856R8546R1503K2052
11070H395708Q032n7970j94987k30310l18618m40720m96574m51096m05339l91046
11060E417080m15498l88991l56488l26518k33182k07468j64119j79286k16046
11051B929484j68776j58640j56961j19154j49622r9788r8043p9468o1369l3885
$$ plain form
11118 7449951 7523221 7547773 7504461 7388843 7304349 7229274 7153712 7118025 7085075 7142498 7261547
11107 7261547 7366223 7504731 7798676 8092870 8457980 8889687 9427899 10036906 10650846
11098 10650846 11246903 11805463 12219354 12567989 12747471 12704230 12537982 12236421 11753859
11089 11753859 11248795 10735883 10223128 9787342 9380938 8962017 8668160 8448815 8242505
11080 8242505 8081444 7941366 7857361 7835484 7916886 8072751 8183607 8282153 8373656 8395708
11070 8395708 8403740 8345770 8150783 7920473 7601855 7161135 6664561 6213465 5808126 5417080
11060 5417080 5001582 4612591 4256103 3929585 3696403 3488935 3324816 3145530 2929484
11051 2929484 2760708 2602068 2445107 2325953 2176331 2076543 1978500 1899032 1837663 1803778
11041A803778m4514l3714R820m8100p9155n4178J3860q378m1026n7796l6823j9006
11029A404768j2756l6494l796j2597J1530r063l3254m3274l3336m2152n2292j2667
11017A124617m3647k4153j6756l8443o8544J056K1339K8750K1478m0810p4040
11006H90847m3148J0102k8650k6016M204K3789M4508j9018n1320k1542n5425j7893
10994G10438J2494k6127k8236l1984L1308N5082k5393n3188K384J4511j2072L40
10982F49557L041j2211k2775K5217k5361n4993j5903K1801J961L2356N0022J2578
10970F65290J5119j1280q360k8894n210j8264K619j2525r486n2754L520L1707
10958E71482L640k445L9701K8299k8969K6634l9020l9490r620K2851L3794J449
$$ plain form
11041 1803778 1759264 1725550 1735370 1687270 1608115 1553937 1567797 1559419 1518393 1460597 1423774 1404768
11029 1404768 1392012 1355518 1351722 1339125 1350655 1341592 1308338 1265064 1231728 1189576 1137284 1124617
11017 1124617 1080970 1056817 1040061 1001618 933074 934130 955469 984219 1005697 964887 890847
11006 890847 847699 857801 829151 803135 807339 831128 875636 856618 805298 783756 728331 710438
10994 710438 722932 696805 668569 636585 667893 722975 697582 644394 646778 661289 649217 649557
10982 649557 652598 640387 617612 642829 617468 562475 546572 568373 570334 602690 652712 665290
10970 665290 680409 669129 660769 631875 626665 608401 611020 598495 589009 536255 539775 571482
10958 571482 575122 572677 612378 640677 611708 638342 599322 559832 550212 573063 606857 608306
10946F08306o62j8716J2050l2107J8580O753j1307J3870j3033j3381j3418l6980
10934E19955j6839p528L4299J8089M623j9868M783j5020k5569M3478L4728j6067
10922E59064L6316m7457n3746n910P228k3643K0980J9528K4727J3341L742L3176
10910E87346L0454O436j4691p570J9075k9562k2922k4572J3629k7552k8553l071
10898D98447L4448k148J8050L3741K2964j1340J3539m6647k9280J5227K7344q594
10886E65751k120r149k7945N6271M282q316l4100j1404J6870L5915N248q46K937
10873E93394J9853k5780P131N0109N4642Q178J5193J1618J7680N0647N7187P1897
10861I31749K6942J6310j8456j336P1984O1415O2613Q2584M7386J29749J32348
$$ plain form
10946 608306 607644 588928 600978 568871 587451 594204 582897 596767 583734 570353 556935 519955
10934 519955 503116 495588 529887 547976 552599 532731 537514 522494 496925 540403 575131 559064
10922 559064 595380 547923 494177 488267 495495 471852 492832 512360 537087 550428 554170 587346
10910 587346 617800 624236 609545 601975 621050 591488 568566 543994 557623 530071 501518 498447
10898 498447 532895 530747 548797 582538 605502 594162 607701 561054 531774 547001 574345 565751
10886 565751 563631 554482 526537 582808 587090 578774 544674 533270 550140 586055 591303 590457 593394
10873 593394 613247 587467 594598 644707 699349 707527 722720 734338 752018 802665 859852 931749
10861 931749 958691 975001 956545 955209 1027193 1088608 1151221 1233805 1281191 1410940 1543288
10850A543288J47025J78898K03795K37222L01555L22657L36802M69128N22538
10841D262908N38591N75626M99742N26784M54767K76270J73048K0607j23586k09355
10831F995402k81783k62850k31689j84785p5803j7593N9479J07033K09865K85719
10821F602995L98330M92058N22002M88137L28597J42843p3952k78891l97376m53656
10811G771087n63425o12547o05221n33238m51928m14681l88627l00318k50746
10802C650356k52651k18216k09696j25288j16339j35546j29430j25596r3953j02376
10792B141265k8288l871m3783n0628k6930K5505K3252J318P2154N3027K3304N7444
10780B243769J29309J85338J33211J20019J48371J86118J96289K39519K55477
$$ plain form
10850 1543288 1690313 1869211 2073006 2310228 2611783 2934440 3271242 3740370 4262908
10841 4262908 4801499 5377125 5876867 6403651 6858418 7134688 7307736 7328343 7204757 6995402
10831 6995402 6713619 6450769 6219080 6034295 5958492 5940899 6000378 6107411 6317276 6602995
10821 6602995 7001325 7493383 8015385 8503522 8832119 8974962 8901010 8622119 8224743 7771087
10811 7771087 7207662 6595115 5989894 5456656 5004728 4590047 4201420 3901102 3650356
10802 3650356 3397705 3179489 2969793 2844505 2728166 2592620 2463190 2337594 2243641 2141265
10792 2141265 2112977 2109106 2065323 2014695 1987765 2013270 2036522 2037840 2109994 2163021 2186325 2243769
10780 2243769 2373078 2558416 2691627 2811646 2960017 3146135 3342424 3581943 3837420
10771C837420L05266L23920L41298M33819N29296N69736O48580O95164Q20016
10762H504515R33971R92606J108380J225227J388651J478817J444785J425984
10754A8502936J341912J153620Q66825N31292J59188j33266l79626n22730o22869
10745B0897282o39480m82216l15417j79213K3787K39376M16346N83041P96785
10736B1340291R05047Q92015Q35279O61067M50428M5910l61014p30908j050004
10727B2988111j279710j324528j314698j270497j151186j057544q59666p18206
10719A4012076n53898m99159m31172k94763k48007j71178q8790l9323K6835J0651
10709A1723272O5936J02390J24811J84495J81222K11780K82545L64370M41691
$$ plain form
10771 3837420 4142686 4466606 4807904 5241723 5771019 6340755 6989335 7684499 8504515
10762 8504515 9438486 10431092 11539472 12764699 14153350 15632167 17076952 18502936
10754 18502936 19844848 20998468 21865293 22396585 22555773 22422507 22042881 21520151 20897282
10745 20897282 20257802 19775586 19460169 19280956 19304743 19544119 19960465 20543506 21340291
10736 21340291 22245338 23137353 23972632 24633699 25084127 25130037 24769023 24038115 22988111
10727 22988111 21708401 20383873 19069175 17798678 16647492 15589948 14730282 14012076
10719 14012076 13458178 12959019 12527847 12233084 11985077 11813899 11725109 11685786 11712621 11723272
10709 11723272 11789208 11891598 12016409 12200904 12382126 12593906 12876451 13240821 13682512
10700A3682512M97179M80111N60789O78308P34561P72660Q30293R53691R93860
10691B0183964J015176J051674J054391J063309J070654R75896Q72135Q51437
10683B8138636P75229P16270O59529N38821N10009M57322L39598K36717J53422
10674C2525553J11358o8767j86967k40741l06019l97872m20989l98377l56885
10665C0260294l22171l17379l49567m21387m18341l57036l13401l85721m78224
10656B6897067n29362n93666o71722p13593q20968q87110q91715r21118q44116
10647B0023697q25970q37144p77584o79329n91168m84580l82796l26571k70006
10638A4848549j72350j58448r1180l6661K1645J07890J26911J21290J56340K44818
$$ plain form
10700 13682512 14179691 14659802 15220591 15898899 16633460 17406120 18236413 19190104 20183964
10691 20183964 21199140 22250814 23305205 24368514 25439168 26415064 27287199 28138636
10683 28138636 28913865 29630135 30289664 30828485 31338494 31795816 32135414 32372131 32525553
10674 32525553 32636911 32568144 32381177 32140436 31834417 31436545 31015556 30617179 30260294
10665 30260294 29938123 29620744 29271177 28849790 28431449 28074413 27761012 27375291 26897067
10656 26897067 26367705 25774039 25102317 24388724 23567756 22680646 21788931 20867813 20023697
10647 20023697 19197727 18360583 17582999 16903670 16312502 15827922 15445126 15118555 14848549
10638 14848549 14676199 14517751 14426571 14389910 14411555 14519445 14646356 14767646 14923986 15168804
10628A5168804K46430L44514N03871O21002P86343R64123J249502J593500K068520
10619B3546609K535948K805334K780188K276413J419566M62411k21659k78342
10611C5326468M2736P89538J738307K913241M134082M933894M778883L436608
10603E8093757J162143j164619k698058k887782j863262l38081J417552L309472
10595E5031122M919474N783012N187867K811717p10747m134829o197147o107176
10587E6583293m586248k775389r94942O99149K023908K593629K094213K95031
10579E5932644k172327m364989n410461n127653l993531k727979j551494o64975
10571B9919235j8113J79685j07149q36275j825346k619190l010348k848481k354904
$$ plain form
10628 15168804 15415234 15759748 16263619 16884621 17670964 18635087 19884589 21478089 23546609
10619 23546609 26082557 28887891 31668079 33944492 35364058 35826469 35604810 35326468
10611 35326468 35369204 36158742 37897049 40810290 44944372 49878266 54657149 58093757
10603 58093757 59255900 58091281 55393223 52505441 50642179 50304098 51721650 55031122
10595 55031122 59950596 65733608 70921475 73733192 73022445 68887616 62690469 56583293
10587 56583293 51997045 49221656 48226714 48925863 50949771 53543400 55637613 55932644
10579 55932644 53760317 49395328 43984867 38857214 34863683 32135704 30584210 29919235
10571 29919235 29901122 30080807 29973658 29137383 27312037 24692847 21682499 18834018 16479114
10562A6479114j887868j474709j065985q78738p70356n95547n03960m69980m27845
10553H404126l13916l31763l30792k85792k07747j84819j61454j23245j08681
10544F355917p5393p5886o9920p8764j1847k485K5517M9082M0635J4843M2321
10533F214020L6665M9380N5686o361l3209q968j3087o7140n0509j1547r77n6786
10521F107167r9110p0782j2333l475m2165n0051j20823j67422j34546j12384j58177
10510E135899j53828j68781j93349j60302j24434j31037j16531j36581j39099
10501C811957j65884j06004j68612j28112r8223j04043q1521j19808p8329r4542
10491B666879j42788j52618j38195r4945o8861j63760r4007q8022p6490l5312
$$ plain form
10562 16479114 14591246 13116537 12050552 11171814 10401458 9805911 9301951 8831971 8404126
10553 8404126 8090210 7758447 7427655 7141863 6934116 6749297 6587843 6464598 6355917
10544 6355917 6280524 6204638 6134718 6055954 6044107 6041622 6067139 6116221 6156856 6171699 6214020
10533 6214020 6250685 6300065 6355751 6349390 6316181 6307213 6294126 6226986 6176477 6164930 6163953 6107167
10521 6107167 6008057 5937275 5924942 5921467 5879302 5829251 5708428 5541006 5406460 5294076 5135899
10510 5135899 4982071 4813290 4619941 4459639 4335205 4204168 4087637 3951056 3811957
10501 3811957 3646073 3540069 3371457 3243345 3145122 3041079 2959558 2839750 2761421 2666879
10491 2666879 2524091 2371473 2233278 2138333 2069472 1905712 1811705 1723683 1647193 1611881
10481A611881l1332n0654j01030q3669k8853J2372m8063k5110m2896q2483j5955
10470A114208j247J7962J8912p0655j7782l1023o017p201p9238o3303k7608o5573
10458G81435j4803j7832l3382l0100K1395L8795k0979n6134j9294K4480j6561
10447F57020k9062l2309J1437k1049m96k9142l5371K724J3799l7139k0660q120
10435D71632M1689K7647m804j865p9499k0375j5866K4646r7o1476j5201j7337
10423C49094Q236O8270K7543n3389o3996j6176m911R556k2888l4742K6844J7589
10411C11030n4824k0544P312L9085L5766J1943J513l903K6152n7022K0518O5636
10399C82662m077k5394m6625l917j3266q9J0465k356k87j917j7582k8916J44J1441
$$ plain form
10481 1611881 1580549 1529895 1428865 1345196 1316343 1328715 1280652 1255542 1212646 1130163 1114208
10470 1114208 1112961 1130923 1149835 1079180 1061398 1030375 1024358 1017157 937919 874616 847008 781435
10458 781435 766632 748800 715418 685318 706713 745508 724529 668395 649101 673581 657020
10447 657020 627958 595649 607086 586037 585541 556399 521028 523752 537551 500412 479752 471632
10435 471632 513321 540968 536164 534299 454800 434425 418559 443205 443108 381632 366431 349094
10423 349094 357330 425600 453143 399754 335758 319582 314671 324227 301339 266597 293441 311030
10411 311030 256206 235662 242974 282059 317825 329768 331281 327378 353530 296508 317026 382662
10399 382662 378585 353191 306566 302649 289383 289294 299759 297403 297116 295199 277617 248701 248845 260286
10385B60286j1869j1419j9947p661M5754L9860L2765l2434k1614N758j4241n3978
10373B11260J1357L9992Q060k5541L048R347J3765L4408k5582l4443r696l4194
10361B01781q637k1313N1248K7354k7998Q198K4752L1014j1110m8196k239k1749
10349B03105K4280K5741Q842K7956m309j688j8268o4129k0174J6565K763l0814
10337A69870j7928j37n514J2989K4343M3475j1372K3774J33K0285l5476m5836
10325A78606p638P938j9492J3671j274r144J7439J4718L2444P783k037j1848K9463
10312B50629j1123j9642j0908J3210L1780K3045N3822K7399m1267n2376j2781
10301B51788p033j2591o852L7396N1018J3600K0455K4647n7514k9534k2863j9616
$$ plain form
10385 260286 248417 236998 217051 209390 255144 295004 327769 295335 273721 279479 265238 211260
10373 211260 222617 262609 270669 245128 248176 257523 271288 305696 280114 245671 235975 201781
10361 201781 193144 171831 223079 250433 222435 230633 255385 286399 275289 227093 224854 203105
10349 203105 227385 253126 261968 289924 285615 283927 265659 201530 181356 197921 200684 169870
10337 169870 151942 151805 146291 159280 183623 227098 215726 239500 239633 259918 224442 178606
10325 178606 170968 178906 159414 173085 171811 162667 180106 194824 227268 235051 233014 221166 250629
10312 250629 239506 219864 208956 222166 253946 276991 330813 358212 316945 264569 251788
10301 251788 244755 232164 225312 262708 313726 327326 347781 372428 314914 285380 262517 242901
10289B42901K306R1794O7924n5976o1958P999N780L7607L0429L77l6618n4214
10277B78351r504L1052M4091J0795m9572l1343Q188J8131P528n9536P747P1570
10265C27498k1405o7119J7199J2150k9496J1733J2418N223j3984n6266l6755O1042
10253B22238O7005L9734o318q3667l7457K6217j2348p41K2076K7334L5211M0002
10241C39286o3429r084L3585n1255n3301M2822k61L9377M064j1944L0507O7518
10229C67885l4384j8171m1478K6568Q2217M3188o722m2896j7505j4399k8950m2446
10217B72907l7221K2536N4062L871l2543Q498j9987k6066k5333Q506q077l6777
10205A84376k9303M4237K8320M7338k3154O847l6021n0518l8156j853L3079N5461
$$ plain form
10289 242901 245207 337001 404925 348949 286991 294990 300770 338377 368806 369183 332565 278351
10277 278351 268847 299899 343990 354785 305213 273870 282058 300189 307717 248181 255928 327498
10265 327498 306093 238974 256173 268323 238827 250560 262978 268201 254217 197951 161196 222238
10253 222238 289243 328977 322659 238992 201535 227752 215404 214663 236739 264073 299284 339286
10241 339286 275857 266773 300358 249103 195802 238624 238363 277740 281804 269860 300367 367885
10229 367885 333501 315330 273852 300420 382637 425825 419103 376207 358702 344303 315353 272907
10217 272907 235686 258222 312284 316155 283612 292110 272123 246057 220724 229230 221153 184376
10205 184376 155073 199310 227630 274968 251814 258661 222640 172122 133966 132113 165192 220653
10193B20653l6337K0813O1575k9642k4279p25K1548L3314j4217j1909Q155M6855
10181B95804L9919M946k5205j3336J8542k0990m859N9190L1425k4569K4834K3981
10169D09682P3662N2633k3595m0703Q712j8090k6550l6733J2925N202K6608L2401
10157D76154N4707L0066J5678R160l1005o9407l0723q447j743l7795J4434O086
10145D27165k1195P1246N183o6180k3926J5135k0757j7013j9747m7724m3416r429
10133B49342M3933J8428n021l1149l6323K2011K9362p6319k1702p788M9633o278
10121B28129k8890R879n0046M312l634M02Q568j1132J977m4833l2440L619K2292
10108A08203K0966M705l0836k4168N516M7410M472j1260K065m17N907N8367Q768
$$ plain form
10193 220653 184316 205129 266704 237062 212783 212058 233606 266920 252703 240794 248949 295804
10181 295804 335723 340669 315464 302128 320670 299680 294821 354011 385436 360867 385701 409682
10169 409682 483344 535977 512382 471679 480391 462301 435751 399018 411943 417145 443753 476154
10157 476154 530861 560927 576605 585765 554760 485353 454630 446183 444440 406645 421079 427165
10145 427165 405970 477216 482399 416219 392293 407428 386671 369658 349911 302187 258771 249342
10133 249342 293275 311703 306682 275533 239210 261221 290583 214264 192562 184774 234407 228129
10121 228129 199239 209118 159072 163384 159750 160152 168720 157588 159565 114732 82292 85911 108203
10108 108203 129169 133874 103038 78870 84386 131796 136268 125008 127073 126656 132563 190930 199698
10095A99698l4531J4996M9119J0193m1146l4379K9547N9656L1571K3517J9145
10084C27386K2680L116k1960k8649n1413p787J0239M087j6532l3548k6323J2604
10072A93900n589j0355J0060j2493l1878Q117k8076l4365j1946N6196n495j4269
10060A13807p260O313k8507j4118J8654j365J5540M5116O428j0166k074l5703
10048A06665j1286p193M2005j3530m5537J2905k9017K3406M1260R159k6134l1721
10036G0982J2551K8734M4639L2661m908l5830m6946K0600n072o0626L383K8295
10024H8463M2228J7846m9038M083J5050n2743M9978j443K5082n3103l2563R17
10012E4757j546k625K4853Q56o681L0954k840j9839m3607K5912P3605J1187j8211
$$ plain form
10095 199698 165167 180163 229282 239475 198329 163950 193497 253153 284724 308241 327386
10084 327386 350066 353182 331222 302573 251160 243373 253612 257699 241167 207619 181296 193900
10072 193900 188311 177956 188016 175523 143645 151762 123686 89321 77375 133571 128076 113807
10060 113807 106547 112860 84353 70235 88889 87524 103064 148180 154608 144442 142368 106665
10048 106665 95379 88186 130191 116661 71124 84029 55012 78418 119678 128837 102703 70982
10036 70982 83533 112267 156906 189567 184659 148829 101883 122483 117411 56785 60168 88463
10024 88463 130691 148537 99499 103582 118632 65889 115867 114424 139506 86403 53840 54757
10012 54757 53211 50586 75439 76295 69614 100568 97728 77889 34282 60194 133799 144986 126775
9999A26775m4323J7553l6995k8312J3459j5196q562J026j4172l8171n71j3661
9987d1150O8651K5408J5289O9257J6779l5508K0209j1777n1544Q841M1012o333
9975A19134P027j2123K602M889p882n0717l7216k3288j0686O1809J2484q050J117
9962E9100m3021k200L9417J4977j8096K3619o0277p381J3411L2657L0645K7043
9950A09894k5672m0624p1004l0650K1705P8012L1291k8676j6975J0656j0336p1
9938B7550M7384O7204M3178R7767J04862N6074J557n4852j01885j29250l8850
9927A20739n240K8124l1526Q55K5677R666m253m3636l0369k38l6145P079P635
9914D8368J6727M0818j0029j057j3829k7463l6497k5668M0379m0725k6339j5639
$$ plain form
9999 126775 82452 100005 63010 34698 48157 32961 24399 25425 11253 -26918 -27489 -41150
9987 -41150 27501 52909 68198 137455 154234 118726 138935 127158 75614 84455 125467 119134
9975 119134 126161 114038 116640 121529 113647 62930 25714 2426 -8260 53549 66033 57983 59100
9962 59100 16079 13879 53296 68273 50177 73796 13519 6138 19549 52206 82851 109894
9950 109894 84222 43598 -27406 -58056 -36351 41661 72952 44276 27301 37957 27621 27550
9938 27550 74934 142138 185316 283083 387945 444019 445576 390724 288839 159589 120739
9927 120739 115499 143623 112097 112952 138629 148295 144042 100406 70037 69799 33654 40733 48368
9914 48368 65095 105913 95884 94827 80998 53535 17038 -8630 31749 -8976 -35315 -50954
9902e0954K4522N1405N0871n109Q148l1313K2619K6337r431k2929n050j5948J2091
9889E5259L0249j855P525K0417j3367l0880N3328j1667n5406j1157M1755k0033
9877F4168J5924R798K3439k7743J081J4862n1123l8159l7471n4233k1344P4294
9865b6507K7919k386K6773L735J3904L1616K0270l3000n9621P3916m567j2538
9853E9514O991n7462l5661n406J254M1460N406L2476j1972k3671k7209K5034K4704
9840C5458J5591K2803n0324l7345K18K5435l621J7670k6421n376p436K0626N0491
9827E7769N343k2803k2008L1844r636P953L62Q21j2937J9960J8216m8149R647
9814C6382L5374k1553n7833O284k871m20k0070M3164P3586J0015K0441l0239m2931
$$ plain form
9902 -50954 -26432 24973 75844 70735 78883 47570 70189 96526 87095 64166 59116 43168 55259
9889 55259 85508 83653 91178 111595 98228 67348 120676 109009 53603 42446 84201 64168
9877 64168 80092 89890 113329 85586 86667 101529 50406 12247 -25224 -79457 -100801 -26507
9865 -26507 1412 -974 25799 29534 43438 75054 95324 62324 2703 76619 72052 59514
9853 59514 66505 9043 -26618 -32024 -30770 10690 16096 48572 36600 12929 -14280 10754 35458
9840 35458 51049 73852 23528 -13817 -13599 11836 8215 25885 -536 -5912 -13348 7278 57769
9827 57769 63112 40309 18301 50145 40509 48462 48824 49645 36708 56668 74884 26735 36382
9814 36382 71756 50203 -7630 -1346 -4217 -4637 -24707 18457 92043 102058 122499 92260 49329
9801D9329k0679j2790Q182j3264m0800K7185L2165j0461j0959j4576Q585j685
9789B32K0593K5180M0707p5779j6389N9462J1983j2861j0591q012O133R159j8281
9776C1536m4044J2145K949M736J2965k575M570N5123N8060J647k0491R340J6600
9763A42561j4062l4167r4766J4369O3272K9391J2699J9551n858p6215o5569k0357
9751b9151K0365O1140j1123M607j8080q535P885k1953k0421L1618K1500N3570
9739I1422l3381j6806K3711o177l3286p063J0466R810k1843o299j1120j2482K0325
9726G277J1935O190M4422O3445j482k8914k1465l6735l251L6572J641m4850m7649
9713a2864J0665K3676k0515p68O976k720L5111j505K8270r078m9436Q029K4461
$$ plain form
9801 49329 28650 15860 24042 10778 -30022 -2837 29328 18867 7908 -6668 1917 232
9789 232 20825 46005 86712 10933 -5456 54006 65989 53128 42537 34525 40658 49817 31536
9776 31536 -12508 -363 2586 7322 20287 17712 22282 77405 135465 137112 116621 125961 142561
9763 142561 128499 94332 -434 13935 77207 106598 119297 138848 132990 56775 -8794 -29151
9751 -29151 -8786 52354 41231 45838 27758 19223 27108 5155 -15266 16352 37852 91422
9739 91422 58041 41235 64946 58769 25483 18420 28886 38696 16853 10554 -566 -13048 7277
9726 7277 19212 25402 69824 133269 131787 102873 81408 44673 41422 77994 79635 34785 -12864
9713 -12864 -2199 21477 962 194 7170 4450 39561 38056 66326 57248 7812 15841 40302
9700D0302J0986J1287K756J690j6606J9959L2860k3184l4013j6820M4935O9173
9688A43325l0855j7448J357o524n1244j6436K3475L314l1745j9785L4248N832
9676C7514j8650L1001M6276J9923K9421O610M601O904j0752j4681K4670K6700
9664A89537M8414P8021P7749N0655M1366J08356J81941K09821M28123O92197J069776
9653C175956J582279J843909J186049J43869r78093j930910j661384r50965m95668
9644A915042k77267k13242k21708j27420r1808r9699p3404p6008o5623l6941p9469
9633E52453p4402m7316p4190n6673j4571L295J076J2597q5276l1999P4999J9134
9621B79127m1485j1064l3959P874J237k7254r265m7532n5058J6535M4903k0637
$$ plain form
9700 40302 51288 62575 65331 67021 50415 70374 103234 80050 46037 29217 74152 143325
9688 143325 112470 95022 96379 89855 38611 22175 45650 48964 17219 -2566 31682 37514
9676 37514 18864 49865 96141 116064 145485 152095 156696 163600 152848 138167 162837 189537
9664 189537 237951 315972 393721 444376 485742 594098 776039 985860 1413983 2106180 3175956
9653 3175956 4758235 6602144 7788193 7932062 6953969 5023059 3361675 2410710 1915042
9644 1915042 1637775 1424533 1202825 1075405 983597 883898 810494 734486 668863 631922 552453
9633 552453 478051 430735 356545 299872 285301 288596 289672 302269 216993 184994 259993 279127
9621 279127 237642 226578 192619 200493 201730 174476 165211 117679 62621 79156 124059 103422
9609A03422k9192k8314N2869j6848m6937L8945j2797k8192K7103L7050l0059k2937
9597D4113k5987L2651N904j4369k4829m523L279j1942l7178n855J9422L5566M0780
9584E7032m998r153l1710J1551O386K7315K6917m4367m0662J4284O210o171L888
9571A6522K4967M9351L3483j8075l2936l6202q569l9952m0805K9977K5776L2070
9559C5607M918k3685j2885J2196j4934K3608l6185J4998J7308k6624L8383P1556
9547A04261K4647k2932l8632n5283m3616J3K0695J2546J0942k8505P302k6383
9535c4945j4208p618K9864K296J0680N6293Q299k0961J6238l0715n025l248J8008
9522B4958M6871J5815k5675j4643l5232o609N4695M351q994J3351l1039j1429
$$ plain form
9609 103422 74230 45916 98785 81937 35000 73945 61148 32956 60059 97109 67050 44113
9597 44113 18126 50777 56681 42312 17483 12960 16239 4297 -32881 -38736 -19314 16252 57032
9584 57032 52034 42881 11171 22722 29108 56423 83340 38973 -1689 12595 18805 12634 16522
9571 16522 41489 90840 124323 106248 73312 37110 28541 -11411 -52216 -22239 3537 35607
9559 35607 40525 16840 3955 16151 1217 24825 -11360 3638 20946 -5678 32705 104261
9547 104261 128908 105976 67344 12061 -31555 -31542 -10847 1699 12641 -15864 -8562 -34945
9535 -34945 -49153 -56771 -26907 -24611 -13931 42362 50661 29700 45938 15223 10198 6950 24958
9522 24958 71829 87644 61969 47326 12094 5485 60180 64531 55537 68888 37849 26420
9510B6420n0793J24j806L5740L6739J9980O47l0751L4102J7825m2803l514M616
9497D6526J1067j921J6423N8601J6059k8531l4271m3474q702O5904k4478n3378
9485A9825l4675K8416j0632p857j2477L6073O7749k9885l3105p37O0630P122o2716
9472B7731m5537J1286L6186j6897q214j5722j6262m600N2384P3850k8784l6995
9460B8426J4309j354l6611J0056M7770K7419k839j6404o629m913o1704j6045k2628
9447d1147J5262J7327k5057l2j3717N6148N1890j2360j8211p043j4141j9004L5810
9434B5725K1048k7023M834M1469Q877L664Q160j0702k8829j6922j2870k2521K3746
9421A8656L2276k597q657L489k774l2905j1253P0948R4980m0871p6552j8797K1753
$$ plain form
9510 26420 -24373 -24249 -26055 9685 46424 66404 67051 36300 70402 88227 45424 41910 46526
9497 46526 57593 55672 72095 130696 146755 118224 83953 40479 31777 97681 73203 19825
9485 19825 -14850 13566 2934 -4923 -17400 18673 86422 56537 23432 22695 83325 90447 27731
9472 27731 -17806 -6520 29666 12769 4555 -11167 -27429 -32029 20355 94205 65421 28426
9460 28426 42735 41381 4770 14826 62596 90015 87176 70772 64143 59230 -2474 -18519 -41147
9447 -41147 -25885 -8558 -33615 -33647 -47364 8784 60674 48314 30103 23060 8919 -10085 25725
9434 25725 46773 19750 24584 66053 74930 78594 86754 76052 47223 30301 17431 -5090 18656
9421 18656 50932 48335 39678 43167 40393 7488 -3765 67183 162163 121292 44740 25943 47696
9408D7696L3274k972m8214l6604j0314J4556K4918K0761K2343k3777j2062L697
9396C3302K0821K9585k9683m6228K9578j6542l8360L1634J7679J9245L8478n5353
9384C4156k7364K6817q159n428k2879K3815L5268j0093J8421m255j8327k3020
9372A8952r989M0638O3562k3436j6003J1807M1046K4605M366J0100o01N8321P0665
9359B94033K1192R240K9132J6082L7648M501k5862J3075J4304k5611r407l3533
9347C44794k7860K6363k3842n8174r3366j2178m9925j0394m3753m0695p96k9442
9335a9268k9516J4832L5242J9379J2944n0572l673m4249O9J0044j6259m1086j397
9322a13510r724m59L0460j3053r693J1939J4769O539j2999m2687n248L165k6325
$$ plain form
9408 47696 80970 77998 29784 -6820 -17134 -2578 22340 43101 65444 41667 29605 33302
9396 33302 54123 83708 54025 7797 37375 20833 -17527 14107 31786 51031 89509 34156
9384 34156 6792 33609 25450 20022 -2857 20958 56226 46133 64554 60299 41972 18952
9372 18952 8963 49601 113163 89727 73724 85531 126577 151182 155548 165648 165047 223368 294033
9359 294033 315225 324465 353597 369679 407327 411828 385966 399041 413345 387734 378327 344794
9347 344794 316934 343297 319455 261281 167915 155737 105812 95418 51665 10970 10174 -19268
9335 -19268 -48784 -33952 1290 20669 33613 -16959 -20632 -64881 -64812 -54768 -71027 -112113 -113510
9322 -113510 -123234 -123693 -93233 -106286 -115979 -104040 -89271 -82732 -95731 -138418 -143666 -140501 -166826
9309a66826j4142M4777M8454L0098P8341j1540k878M1483J3348l9877k0894J2554
9297A2898O027J173K0311M882P825J7346J626k2312j5235K4530j4715j9874J4413
9284C8895j7191j4718m549J9652K0689N307J4280J8661M5441M712M482P598K118
9271A45377j631K9382j7937N3626O1255J2385M2454J02507J29407J03310N4026
9260G14161J04919J11446J10437J13052J22683Q4024Q9220R6601N0309L0982k4505
9249A603329k4670k8100j6192n1878o9223p8841n4797o5653p1928k4528m3125
9238A074394n4409k8162p4211k0821K674k3758m0620m4419l831n0200m5567q963
9226F82107K6337M0300K4419l4387Q101J7413l2155K3648L6480n263L2057K2368
$$ plain form
9309 -166826 -180968 -136191 -87737 -57639 20702 9162 6284 47767 61115 21238 344 12898
9297 12898 18925 20098 40409 45291 53116 70462 72088 49776 34541 59071 44356 24482 38895
9284 38895 21704 6986 2437 22089 42778 48085 62365 81026 126467 131179 135661 143259 145377
9271 145377 143746 173128 155191 208817 270072 282457 324911 427418 556825 660135 714161
9260 714161 819080 930526 1040963 1154015 1276698 1360722 1449942 1546543 1596852 1627834 1603329
9249 1603329 1578659 1550559 1534367 1482489 1413266 1334425 1279628 1213975 1142047 1117519 1074394
9238 1074394 1019985 991823 917612 896791 899465 875707 835087 790668 786837 736637 691070 682107
9226 682107 708444 748744 773163 738776 746877 764290 732135 755783 792263 787000 819057 841425
9214H41425K0523K812M4863N8227O0878R8329M6000J2551L7444N0373O5416L5883
9202A374724L5667Q4216N3344Q979J6449Q708K9440l1947n3221m8367o4269q2119
9190A331604r6098j06026n9772q343m0250n1191r4849m9875l0200m0827o3109
9179F91064l5273k4674p7692r6776j0088m0025l912r423k3871p374m0731m5686
9167B75539l1406O066k5963j2316j593P033m625j58J7361r519j943J989n752Q878
9153B23591n613k707n1001j7003J1071j1601P442K4885K833J4613J7989L898K2703
9140B41100K8424J9841J7713K5493Q047j3238l638k058L2935J3568p050K2129
9128C83266K7775l776o1349J0485o799L3440M1874J3965j6934j9638N795L7909
$$ plain form
9214 841425 861948 864760 909623 967850 1028728 1127057 1173057 1185608 1223052 1273425 1338841 1374724
9202 1374724 1410391 1494607 1547951 1556930 1573379 1582087 1611527 1579580 1526359 1477992 1413723 1331604
9190 1331604 1235506 1129480 1069708 1061365 1021115 969924 875075 825200 795000 754173 691064
9179 691064 655791 631117 553425 456649 446561 406536 402624 393201 369330 361956 321225 275539
9167 275539 244133 250199 224236 211920 210327 217360 212735 212577 229938 220419 218476 220465 214713 223591
9153 223591 217978 215271 164270 147267 158338 146737 154179 179064 181897 196510 214499 218397 241100
9140 241100 269524 289365 307078 332571 340618 327380 323742 321684 354619 368187 361137 383266
9128 383266 411041 407265 345916 356401 349602 383042 424916 438881 421947 402309 408104 446013
9116D46013k3482N8615M6019M848m8649n1329L6858M6800k2010p1664l6349k8700
9104C56970L7449P078N1474K9263m6617k485Q790l1421L1081J1981m6846l0054
9092C76663M306J3526N173k37O4219k1041n300K7965j2329l2472k6266J9794M4078
9079D58079k9800k1914J8189N0003O3341L2164o1176J991o636J1623J45J823n661
9066E12171K9555j2168k5485L7L6858J4623p975K204k1312J7022J02747M8782
9054F97059K1523K0327L6789J5353m470J8969m2426o0631N6839L5727n122k1661
9042G68276j5317n1993l1513m4396j56K6309n090k332n1938n551k6504j769J6750
9029E74776J9967L502o212K2460o034j9706P072M0422l9751l2567L5382L6223
$$ plain form
9116 446013 422531 481146 527165 532013 483364 432035 468893 515693 493683 422019 385670 356970
9104 356970 394419 401497 452971 482234 435617 433132 441922 410501 441582 453563 406717 376663
9092 376663 380969 394495 399668 399431 463650 442609 437309 465274 452945 420473 394207 414001 458079
9079 458079 428279 406365 424554 474557 537898 570062 508886 510877 504241 515864 516009 517832 512171
9066 512171 541726 529558 504073 504110 540968 555591 547616 549820 528508 545530 648277 697059
9054 697059 718582 738909 775698 791051 786581 805550 763124 702493 759332 795059 789937 768276
9042 768276 752959 700966 669453 625057 624901 651210 646120 643788 591850 586299 559795 558026 574776
9029 574776 594743 598245 592033 614493 608459 588753 595825 636247 596496 563929 599311 635534
9017F35534j5240q427J6021k154J2470K5357K455j1506K337Q3153O1108K2365
9005H23473R7739J4879n3091k8849M0119k9356Q006M3996N8728P4634N5820K7037
8993A133135j1662K8813N6193L8229K1832N8225p395j6326p0254l7707m7716m1674
8981A103693l2735q8497p1393n5868n4280p657m0798m2934p618K9614k7874j5384
8969F88269K7623J2112N8330n921L0222J07350N1980J5034L0148J9610L3896L9427
8957A108080M8522J06672N0108K8571M0554J6638N6658O4984Q7300Q1097M8063
8946A737247J4178J8686K4099R363N3487P0217M6925O8891Q446L778J5435J7751
8934B088503N6899R4611R7799L0284N3184M9996L3021j0854l5353m0265P604J5256
$$ plain form
9017 635534 620294 611867 627888 625734 638204 663561 666016 654510 656847 740000 801108 823473
9005 823473 921212 936091 883000 854151 894270 864914 872920 916916 975644 1050278 1106098 1133135
8993 1133135 1121473 1150286 1206479 1244708 1266540 1324765 1317370 1301044 1230790 1193083 1145367 1103693
8981 1103693 1070958 982461 911068 855200 800920 793263 752465 709531 701913 731527 703653 688269
8969 688269 715892 728004 786334 780413 810635 917985 969965 984999 1015147 1034757 1068653 1108080
8957 1108080 1156602 1263274 1313382 1341953 1382507 1399145 1455803 1520787 1608087 1689184 1737247
8946 1737247 1751425 1770111 1794210 1803573 1857060 1927277 1974202 2043093 2051539 2055317 2070752 2088503
8934 2088503 2145402 2240013 2337812 2368096 2421280 2471276 2504297 2493443 2458090 2417825 2425429 2440685
8922B440685J7249N4756Q8066R0240J25105J67215J79765J33663J00290J40218
8912C537252J95220J79119K19334J91743K00946K33377K52693K79945L09765K78543
8902E877937K68410L09581L72953L49121L72083M11183M63922N30028N51985N27121
8892A0034324O32986P09337P64392P95791Q76289R67632J092102J218415J328030
8883A8419298J486444J675904J835632K062499K334467K674336K973788L286064
8875C6748432L713795M271763M863900N553990O353932P313707Q388565R662191
8867H6870275J1155415J2897251J4887534J7117870J9484171K1932229K4188115
8860B08532860K5881529K6553980K5656494K2860634J8217664J1911927M751315
$$ plain form
8922 2440685 2457934 2512690 2600756 2690996 2816101 2983316 3163081 3296744 3397034 3537252
8912 3537252 3732472 3911591 4130925 4322668 4523614 4756991 5009684 5289629 5599394 5877937
8902 5877937 6146347 6455928 6828881 7178002 7550085 7961268 8425190 8955218 9507203 10034324
8892 10034324 10667310 11376647 12141039 12936830 13813119 14780751 15872853 17091268 18419298
8883 18419298 19905742 21581646 23417278 25479777 27814244 30488580 33462368 36748432
8875 36748432 40462227 44733990 49597890 55151880 61505812 68819519 77208084 86870275
8867 86870275 98025690 110922941 125810475 142928345 162412516 184344745 208532860
8860 208532860 234414389 260968369 286624863 309485497 327703161 339615088 344366403
8853C44366403k382782q500792j2975203j5831498j7176436j7197720j6594086
8846B53707886j5591672j4347090j3082132j1972965j0974642r999437r147396
8839A68592552q411418p700816p013929o342602n691222n092074m502284l893178
8831A19945029l327168k824464k295311j873610j379012q94156m99842m0253M71476
8822A07282689J011645J548858K070815K628161L296278M076746M896155N732202
8814A32543549O645104P757551Q882292J0113452J1607473J3192926J4810075
8807B05552422J6365832J7751108J8755973J9069434J8282519J6137939J2392162
8800C24307389P177505J031279n512251j1562927j6278290j9396166k0935586
$$ plain form
8853 344366403 341983621 333482829 320507626 304676128 287499692 270301972 253707886
8846 253707886 238116214 223769124 210686992 198714027 187739385 177739948 168592552
8839 168592552 160181134 152480318 145466389 139123787 133432565 128340491 123838207 119945029
8831 119945029 116617861 113793397 111498086 109624476 108245464 107351308 106851466 106811213 107282689
8822 107282689 108294334 109843192 111914007 114542168 117838446 121915192 126811347 132543549
8814 132543549 139188653 146946204 155828496 165941948 177549421 190742347 205552422
8807 205552422 221918254 239669362 258425335 277494769 295777288 311915227 324307389
8800 324307389 331484894 332516173 327003922 315440995 299162705 279766539 258830953
8793B58830953k1034646k0187054j8800375j7138908j5517444j4073318j2713940
8786A39365268j1470636j0442305r544141q698301p992362p283892o606879o035186
8778G1291566n448640m987551m546520m170197l753271l365807l077558k815722
8770C9126300k592541k351296k215256j999650j788557j699863j641257j463637
8762B3374243j341203j257275j182789j046158r70776r24360q10254p44988p51257
8753A4345183o86207n86834n89087n68894m65435m69998m44355m06673l63374
8744I764326l07681l16274l49172k75473k48631k61544k15025k17187j70319j05742
8734G297278j61495j66297j22316j30737j65132j73309k01029j76889j57974j56297
$$ plain form
8793 258830953 237796307 217609253 198808878 181669970 166152526 152079208 139365268
8786 139365268 127894632 117452327 107908186 99209885 91217523 83933631 77326752 71291566
8778 71291566 65842926 60855375 56308855 52138658 48385387 45019580 41942022 39126300
8770 39126300 36533759 34182463 31967207 29967557 28179000 26479137 24837880 23374243
8762 23374243 22033040 20775765 19592976 18546818 17576042 16651682 15841428 15096440 14345183
8753 14345183 13658976 13072142 12483055 11914161 11448726 10978728 10534373 10127700 9764326
8744 9764326 9456645 9140371 8791199 8515726 8267095 8005551 7790526 7573339 7403020 7297278
8734 7297278 7135783 6969486 6847170 6716433 6551301 6377992 6176963 6000074 5842100 5685803
8724E685803j85873k27592j91349j75522j65342j48962j42581j35568j11561m5354
8714D156099p9952j18932r6373j20008p5888l2538n7610q2200r7154m0812l5590
8703C319042l8043m4180n2662k9921m502j4685q7990q2529j4814l4446k550K4243
8691B936963m3608m0562J2431j710k6650l142j5382k4j916J7831L8414j3591k4524
8678B834530m3697j5675j4842m9818J556k5170p5994j03941j47457j56097r9062
8667B104333r7629p1114n1021q1545n8311m9548m0622k3397j3300k1260m4842
8656A551744n3215n5625k2174J8485j446K114o366k7767k8363l2223r205R310
8644A345269K2674k0623m4882k6976l011n3520n51K4614J1084o6444j5873k0046
$$ plain form
8724 5685803 5499930 5272338 5080989 4905467 4740125 4591163 4448582 4313014 4201453 4156099
8714 4156099 4076147 3957215 3860842 3740834 3664946 3632408 3574798 3492598 3395444 3354632 3319042
8703 3319042 3280999 3236819 3184157 3154236 3149734 3135049 3047059 2964530 2949716 2915270 2912720 2936963
8691 2936963 2893355 2852793 2865224 2863514 2836864 2833722 2818340 2818316 2816400 2834231 2872645 2859054 2834530
8678 2834530 2790833 2775158 2760316 2710498 2712054 2686884 2610890 2506949 2359492 2203395 2104333
8667 2104333 2006704 1935590 1884569 1803024 1744713 1695165 1654543 1631146 1617846 1596586 1551744
8656 1551744 1498529 1442904 1420730 1439215 1437769 1439883 1433517 1405750 1377387 1345164 1335959 1345269
8644 1345269 1367943 1347320 1302438 1275462 1272451 1218931 1218380 1242994 1254078 1187634 1171761 1151715
8632A151715K2808N3435k9044o3352k1222q532l9261m318l6965k0207M1573L5582
8620A082212m4306q9290l5574O649J0624l1785J0889M963k3362n3279l7023O817
8608H07535r035l6487M680K9854N2555K6094J2281j7778k6433j644J05284Q770
8596I55676o3345J328J0376n596K537k1688j7151K5098K1820j1625L1362J8711
8584I47503N8864L0607j7959r229o163K7405R7349M594p0204p7839k1127p0000
8572H93801l4373K2662m6896q9216j00963l7073J7766M144O3286o463l4001O171
8560F58845J1026k9288N668N931O481p1608l1128M150K6747K7790j8941j4606
8548E81067k174O3K1124L6817n1671j7724L0477j3451k8303L0789M8687O502m6565
$$ plain form
8632 1151715 1174523 1227958 1198914 1135562 1114340 1105808 1066547 1062229 1025264 1005057 1046630 1082212
8620 1082212 1037906 948616 913042 919691 930315 898530 909419 914382 891020 837741 800718 807535
8608 807535 798500 762013 766693 796547 849102 875196 887477 869699 843266 841622 946906 955676
8596 955676 892331 893659 904035 898439 900976 879288 862137 887235 909055 897430 928792 947503
8584 947503 1006367 1036974 1019015 1009786 1003623 1031028 1128377 1132971 1062767 984928 963801 893801
8572 893801 859428 882090 835194 745978 645015 607942 625708 629852 693138 686675 652674 658845
8560 658845 669871 640583 646251 652182 658663 587055 555927 560077 586824 614614 595673 581067
8548 581067 578893 578956 600080 636897 585226 567502 597979 584528 556225 587014 635701 642203 595638
8535E95638J4084K2784O004j1279K3457J5157N035n583j3312o8117k3152L6219
8523E96935K9057l4374n3287j7929O595k0243L8395L7694P765L463m3409m9367
8511E01295K2245L5715L657o8949l9232L6538L0885M6525m128k0721j0502J6964
8499E50292k7380l8536l40L5758N5042K8151k4103j4312o770L3969P797p24k1313
8486E77531L1383l7302p8325M988R723K8676K8463o958L3414M4176n062l3820
8474E96887n783N2437Q388J5959K7266J4125M1039Q5246N3244O9319J2273L3700
8462A004100J30506Q8409L2496Q0456J07449J14351O3658P2698J11381J12144
8452A917648O5413M2574j8533J0032l6715l4474j9019j5706p0332j07755o8125
$$ plain form
8535 595638 609722 632506 638510 627231 650688 665845 670880 665297 651985 583868 560716 596935
8523 596935 625992 591618 538331 520402 526997 506754 545149 582843 590608 594071 550662 501295
8511 501295 523540 559255 562912 493963 454731 491269 522154 568679 564551 543830 533328 550292
8499 550292 522912 484376 484036 519794 574836 602987 578884 564572 557802 591771 599568 598844 577531
8486 577531 608914 571612 493287 498275 507998 536674 565137 558179 591593 635769 630707 596887
8474 596887 591104 643541 651929 667888 695154 709279 750318 835564 888808 958127 970400 1004100
8462 1004100 1134606 1223015 1255511 1335967 1443416 1557767 1621425 1694123 1805504 1917648
8452 1917648 1983061 2025635 2007102 2017134 1980419 1945945 1926926 1911220 1840888 1733133 1665008
8441A665008j4260n9594m9096n8584n6418q3872j26443k8230P566J895J6301J1208
8429A225481k1006K5786K564n3984n7686l3045r765m529J353r168L1999R821R946
8416A117767N042o723Q507M8057L4925L8717M7152L4513L3888N7605L0280N1911
8404A501641M9101Q4760P7226R9444Q8255N5826O6430O5132k289r097N0482M5463
8392B172374N4651J41106J82091K89920M05698L89876J61679j37956m43922n63144
8382B652373m57524k68456k35653j76348j21819q4404p4711m9267m2993m2009
8372A099189o5368q1301k9209m9760n6779J504J5013M0736k7620m9308n0302m6712
8360G00083l1467j5126j9231m2224n5000k1298M914K963m2664k3529L0852P5048
$$ plain form
8441 1665008 1650748 1591154 1542058 1483474 1427056 1343184 1216741 1188511 1196077 1197972 1214273 1225481
8429 1225481 1204475 1230261 1232825 1178841 1121155 1088110 1078345 1073816 1075169 1066001 1098000 1107821 1117767
8416 1117767 1122809 1116086 1124593 1172650 1207575 1246292 1293444 1327957 1361845 1419450 1449730 1501641
8404 1501641 1550742 1635502 1712728 1812172 1900427 1956253 2022683 2087815 2085526 2076429 2126911 2172374
8392 2172374 2227025 2368131 2550222 2840142 3245840 3635716 3797395 3659439 3215517 2652373
8382 2652373 2194849 1926393 1690740 1514392 1392573 1308169 1233458 1184191 1141198 1099189
8372 1099189 1033821 952520 923311 873551 816772 818276 833289 874025 846405 797097 746795 700083
8360 700083 668616 653490 634259 592035 537035 515737 520651 523614 480950 457421 488273 563321
8348E63321K3281q4859m9546N7236N7944K0388j0088l0662M414N4997M717q526
8336F02617j6028k7266j1329J3921L3502N873p938l5088l8263m8702p9326K3510
8324D15483K4178K1380L925k0363j7159k4581J8401k4756k9547J2169K9335p129
8312D01336p0765p4319J8871J4064n677P8191j8595p115j8410j1159K7899N320
8300C39641m247j4191L2617k7370j0732k9540m1138j5990p035M8593M2621k136
8288C11093k8113o7222J3864J968R658l2399J2674J6531j603k2143k905J790K6790
8275B39983L7397L3898j7284n1451k0707J3091k1853J3516Q948k298j5033M0676
8263B58883K2331J1160r447j513Q728l3798L0081O7756k2086o4199l523n0200
$$ plain form
8348 563321 586602 501743 452197 509433 567377 587765 577677 547015 551429 606426 611143 602617
8336 602617 586589 559323 547994 561915 595417 601290 593352 558264 520001 471299 391973 415483
8324 415483 439661 461041 464966 444603 427444 402863 421264 396508 366961 379130 408465 401336
8312 401336 330571 256252 275123 289187 283510 361701 343106 335991 317581 306422 334321 339641
8300 339641 335394 321203 353820 326450 315718 286178 245040 229050 222015 270608 313229 311093
8288 311093 282980 215758 229622 231590 241248 208849 221523 238054 236451 214308 211403 213193 239983
8275 239983 277380 311278 293994 242543 221836 234927 213074 226590 235538 233240 218207 258883
8263 258883 281214 292374 282927 281414 290142 256344 286425 354181 332095 267896 264373 214173
8251B14173m8714Q034j0217M1283M967O681k2251p128n0114K6671J1838L8860
8239B14083j1793l6927k3599K2426r176K1666O388r079l2723O864j4545M0249
8227A73834N8740L072k6565m2692J5142o930r36Q215n2764m964J5576Q7792M8948
8214B76468j6941n6938j6472K0395l85k785J1770p695o6681K7850J7285k2252
8202A63619j2162q975n483J6042J6121K5736K3685k8925j3576r474N581k1401
8190A50788j419M966K9212L5669J9048o12J2669j0l5638k9157n2406q054L9238
8177A64294P004o7479o844L1353K0533J5420l6393l7496n838R487j4093j099L545
8164H2394o567K2806J5993J8217J3549k5477k8672m473O537M7096O1398M904J5719
$$ plain form
8251 214173 165459 173493 163276 204559 209526 216207 193956 186828 136714 163385 175223 214083
8239 214083 202290 165363 141764 164190 155014 176680 183068 173989 141266 148130 133585 173834
8227 173834 232574 235646 209081 166389 181531 174601 173665 181880 129116 124152 139728 227520 276468
8214 276468 259527 202589 186117 206512 206127 203342 215112 207417 140736 168586 185871 163619
8202 163619 151457 142482 136999 153041 169162 194898 218583 189658 176082 166608 172189 150788
8190 150788 149369 154335 183547 219216 238264 237652 250321 250311 214673 185516 133110 125056 164294
8177 164294 171298 103819 96975 128328 148861 164281 127888 90392 84554 94041 79948 78849 82394
8164 82394 75827 98633 114626 132843 146392 120915 92243 87770 94307 141403 202801 207705 223424
8151B23424j8643l1902j577K48k0153K0466N6579K3638l6569q158k3232j02615
8139H1506m9226J2384L8744j551L511M5892j8824J8836L3043l1237N989R432L7596
8126A86095l714l1833J5742L5508K9371k6504m3770J739m8511m2872M5305J7449
8114A34005J4852J7398J5914j483j3216j7823j064k0489j8678J3313L6186L4279
8102A93194j5021n5734l236p984m901L8660j3948K1474j3186J9732k827L160j4228
8089A45155r672L9502R931K1411l1611l0039O024j5073m140J122p4236j3004L3807
8076G9177J4387L9156j5270J2378m6569J0583R306K2793n846j6886P784k5805
8064H5188j2173J4344K5978K0511l3573k9832J5101L9482P9845l058m5839o1940
$$ plain form
8151 223424 204781 172879 171302 171550 151397 171863 228442 252080 215511 207353 184121 81506
8139 81506 32280 44664 83408 81857 85368 131260 112436 131272 164315 133078 139067 148499 186095
8126 186095 182381 150548 166290 201798 231169 204665 160895 162634 114123 71251 116556 134005
8114 134005 148857 166255 182169 180686 167470 149647 148583 128094 109416 122729 158915 193194
8102 193194 178173 122439 119203 111219 106318 144978 131030 152504 139318 159050 156223 159383 145155
8089 145155 135483 174985 184916 206327 174716 144677 150701 135628 131488 132610 58374 45370 79177
8076 79177 93564 132720 117450 129828 83259 93842 103148 125941 120095 103209 110993 85188
8064 85188 73015 87359 113337 133848 100275 70443 85544 125026 204871 201813 155974 94034
8052I4034k0506M5494K1293l1862k3323m9253l485J9698K5046j9374J8969k1401
8040E5330K768J2952P779K3134o313K2722j563J003o863j8294M468L1526L4915
8027A63564L897k1516L823l5872k4679K9844K5900j483k5885M493J8957j1554
8015A29489j3950k3433K2003N2678n406j1355K8661j3428l8300n7453m821R500
8003G4185J2935K5031j8069j0808L2666M5154J0738m149k8913j4237K6487m853
7991A46167j8089m7905M2417O3857j4603m911P193j712J6032R830k7705l4359
7979A36212l7658k7604R334K8438P13L802L9606k8617K2382K1486k897j2137k6658
7966A26402K57m599N248j0402l5583l3296m582J6926K9523J9057N3242M4142r042
$$ plain form
8052 94034 73528 119022 140315 108453 85130 35877 32392 52090 77136 57762 76731 55330
8040 55330 58098 71050 78829 101963 95650 118372 116809 117812 110949 92655 97123 128649 163564
8027 163564 167461 145945 149768 113896 89217 119061 144961 143478 117593 122086 141043 129489
8015 129489 115539 92106 114109 166787 161381 150026 178687 165259 126959 69506 64685 74185
8003 74185 87120 112151 94082 83274 115940 161094 171832 167683 138770 124533 151020 146167
7991 146167 128078 80173 122590 186447 171844 166933 174126 172414 188446 198276 170571 136212
7979 136212 98554 70950 80284 108722 109435 113237 152843 124226 146608 168094 165197 153060 126402
7966 126402 126659 122060 127308 116906 81323 48027 43445 60371 89894 108951 162193 206335 197293
7953A97293p705J4651J6019k2566K217m7335k7605q172K6589P842K0491l1478
7941A40241l823l6607k0023j6939K9015O4992N397n8570m8344K8091M751r705
7929G8476J3032j7733M9019K9284j5705J9643L1882j2569j1387k5159k5634n625
7917A07524k754J8081K899P230j0085m0614Q716K6545o098R413l8801J9910K002
7904A03968j985N1j6998O131N140l9298K9234M6111L6960m1101j0740o152K5188
7891A36509j0465o273j3695l1100l4038k0659O3016L4309k2493j6205p924N489
7879G6471M68j6607J125J7064O438M425R605m235K047O0971j1214n1680K114J5668
7865A12660L8509M3030n2329n4256n497J6361j4363j4105J0192l9161m4825J086
$$ plain form
7953 197293 189588 204239 220258 197692 199909 152574 124969 116797 143386 151228 171719 140241
7941 140241 136418 99811 79788 62849 91864 156856 162253 103683 55339 83430 88181 78476
7929 78476 91508 73775 122794 152078 136373 156016 187898 175329 163942 138783 113149 107524
7917 107524 104770 122851 125750 132980 122895 82281 90997 117542 111444 120857 82056 101966 103968
7904 103968 101983 102034 85036 91167 96307 57009 86243 132354 169314 128213 117473 111321 136509
7891 136509 126044 119771 106076 74976 40938 20279 83295 117604 95111 78906 70982 76471
7879 76471 76939 60332 61457 78521 84959 89384 98989 94754 96801 157772 146558 94878 96992 112660
7865 112660 151169 194199 141870 87614 82117 98478 84115 70010 80202 41041 -3784 -2698
7853b698N2124L2540J9443l6180k6824K878k7420L1416J9671j2892k9752K8896
7841E1202M3660O886k0334k1810R959N1779J1151J86k0448k3771P266K5033o360
7828A14399k8591j7946K7159k0227J4935L200K0112k5876m3938j3579K5627L07
7816E5582p810J1615Q411L2040L0871N1482k0420m8257j0941p774j2346l9147
7804D3306k1252O49J6303k2759j4878M8169K5099N77l0649j4308N991K5671o0
7791F1859k9823N03J0525q958L0535K3906j8914J8129L2119j0202M2715K0432
7779A72826o2221j3349j9614l7564J6284O6490j0942j2237j6392n1515n5857K2034
7767b057J2377N2343J2522k0158K7812q491k0375L9106N5022P872k3366l9234
$$ plain form
7853 -2698 49426 81966 101409 65229 38405 41283 13863 45279 64950 52058 22306 51202
7841 51202 94862 101748 81414 59604 69563 121342 132493 132679 112231 88460 95726 120759 114399
7828 114399 85808 67862 95021 74794 89729 92929 113041 87165 43227 29648 55275 55582
7816 55582 47772 59387 67798 99838 130709 182191 161771 113514 102573 94799 82453 43306
7804 43306 22054 22703 39006 16247 1369 49538 74637 75214 44565 30257 36248 61919 61859
7791 61859 32036 32539 43064 34106 64641 88547 69633 87762 119881 109679 152394 172826
7779 172826 110605 97256 77642 40078 56362 122852 111910 99673 83281 31766 -24091 -2057
7767 -2057 10320 62663 75185 55027 82839 74348 53973 93079 148101 155973 132607 93373
7755I3373P580j9317j6260j1210p5247J264N8011N5162m3476j6482K5370p53K7519
7742H5534J2381n4065r563M4720P014k3331k7961L648O2121l9J687k1125L3356
7729A14377K341l1388n3170k7588J8235L616o15k88n317j9673j0108L4051M4184
7716F8657O113k2313p101j3524k848l646K3989M0889P0381l7578k4096P028o8740
7703C7211j4599q4997Q5P1386k3166J8083N0764J3974k8058L4686J465k5373p698
7690D3763J1922O028J0314j063j1894k7298l2687L4375K59n3157K6513K6140K0363
7677E3578J602L7402j1019J4409K970j3870m247J6108l5480N255m047J8566K5484
7664A06711J1191j5400l1535n909k927m3276L5445J5861l0581k465J5243K0816
$$ plain form
7755 93373 100953 81636 65376 54166 -21081 -19817 38194 93356 49880 33398 58768 58015 85534
7742 85534 97915 43850 34287 79007 86021 62690 34729 38377 100498 100459 102146 81021 114377
7729 114377 116718 85330 32160 4572 22807 26423 25808 25520 20203 530 -9578 24473 68657
7716 68657 74770 52457 45356 31832 28984 25338 49327 90216 160597 123019 98923 105951 37211
7703 37211 22612 -62385 -62300 9086 -14080 4003 54767 68741 40683 75369 76834 51461 43763
7690 43763 55685 61713 72027 70964 59070 31772 -915 33460 33719 -19438 7075 33215 53578
7677 53578 55180 92582 81563 95972 98942 85072 80825 96933 61453 66708 62661 81227 106711
7664 106711 117902 102502 70967 65058 62131 18855 54300 70161 39580 37115 52358 73174
7652G3174J9133J8680J5383K7193r969m70l5260l9964k6566j0781j544J8340O786
7639E4135K5148K804k755n2860l7160K4981J5318m723K3549J3068k1581l0219
7627I705J4140L4326L6570n607M557m1867o3590p593L1300K016K936j2908j8029
7614a4044K089M3506N1547k0799n6511o312N2239M34o280Q743J6653p640o3805
7601a80n037J9000J8799r834P566L5804l3450l1382R557j6335J513N2276K2447
7588G0744N5k1059k418J9322M587k9386q818n4566l9256J2231K1896N522K4407
7575C261j4248l2232K7266L2747L7735j4440j3177j1215k1337r542L0842J2995
7563B8655L5335l865Q763J3619k5484Q117n3216o0127J2569K5060J75K7936K991
$$ plain form
7652 73174 92307 110987 126370 153563 143594 143124 107864 67900 41334 30553 29009 47349 54135
7639 54135 79283 82087 79332 26472 -10688 14293 29611 24888 48437 61505 39924 9705
7627 9705 23845 58171 94741 89134 93691 51824 -11766 -19359 11941 13957 16893 3985 -14044
7614 -14044 -11955 31551 83098 62299 5788 -524 51715 52149 45869 54612 71265 63625 -180
7601 -180 -5217 13783 32582 22748 30314 66118 32668 1286 10843 -5492 -3979 48297 70744
7588 70744 70799 49740 47322 66644 71231 41845 33027 -21539 -60795 -48564 -26668 -21146 3261
7575 3261 -10987 -43219 -15953 16794 54529 40089 26912 15697 -5640 -15182 15660 28655
7563 28655 63990 60125 68888 82507 57023 65140 11924 -48203 -35634 -10574 -10399 17537 20528
7550B0528k332O2495r868l690J022n1182J3182N4337K2134l5131l225p920k4451
7537C5899J1708K8512J7827m5850n5384k2211K4467L3421K2922M1466l7421l7243
7525A8113K8142J9927q124J7693j696l8527k5723J3215M939j9254k5713K6133
7513I125K0037l4419j892o225L2668J7292P634M379L088R85J493l924K8378L8367
7499A16986j4996m0664J8268L6111k2342l3337n6178L2949K1667j4790l8212j9701
7487a4239M9307J5775o68L3286K4404l9149M180k8785o8607p594J2353N9563K8539
7474F8365o616k3490N56k0877J7208n415m2758J3736K4372R44l7416l9820L0996
7461b0215N0926J159m773J8383j9551j8607r621l7105O3037K7649j8173M0455
$$ plain form
7550 20528 18196 80691 70823 67133 68155 16973 30155 84492 106626 71495 68270 60350 35899
7537 35899 47607 76119 93946 48096 -7288 -29499 -5032 28389 51311 92777 55356 18113
7525 18113 46255 66182 58058 75751 74055 35528 9805 23020 27959 8705 -17008 9125
7513 9125 29162 -5257 -7149 -13374 19294 36586 44220 48599 51687 52672 54165 50241 78619 116986
7499 116986 101990 61326 79594 115705 93363 60026 3848 36797 58464 43674 5462 -14239
7487 -14239 35068 50843 50175 83461 107865 68716 72896 44111 -24496 -32090 -19737 39826 68365
7474 68365 61749 38259 38815 17938 35146 29731 -13027 709 25081 26025 -11391 -51211 -20215
7461 -20215 30711 31870 27097 45480 25929 7322 -2299 -39404 23633 51282 33109 73564
7449G3564l0339j9814m907J7128k4006k7687m0343J4699M6385K3117j8797Q665
7437A7665O49J6521k7360j8548O447R919L4832K2086k8247j7367L6212j0492k6940
7424A5377k0263o7568k3362P3288M7894m907K7623K3492j667n117M4772k8585
7412H0977j7259K1754k9059k4172K4298m819p646k677L0222k1202k9275J8538
7400C9680J4036m2454j1520K5617J1360K1060L5739M986K0964N423k5099l3044
7388F6748k3474j9413J1485K7320j138J4661r590k6278j1749j3579k52m693L7479
7375D7527M3759L0456m2199k4271m982J01265R799l1815l635l6772k9100O521
7363F6553J2507k3206K6180j5717j5218N443J1942l1533j6851M5466P460k8365
$$ plain form
7449 73564 43225 23411 18504 35632 11626 -16061 -56404 -41705 4680 27797 9000 17665
7437 17665 18314 34835 7475 -11073 -4626 5293 40125 62211 33964 16597 52809 42317 15377
7424 15377 -4886 -72454 -95816 -22528 25366 20459 48082 71574 69907 64790 109562 80977
7412 80977 63718 85472 56413 32241 56539 51720 44074 41397 71619 50417 21142 39680
7400 39680 53716 11262 -258 25359 36719 57779 93518 98504 119468 124891 99792 66748
7388 66748 43274 23861 35346 62666 61528 76189 66599 40321 28572 14993 14741 10048 47527
7375 47527 91286 121742 79543 55272 50290 151555 161354 129539 125904 89132 60032 66553
7363 66553 79060 55854 82034 66317 51099 56542 68484 36951 20100 65566 73026 44661
7351D4661j907k0321K0994J6465o8407q6203j0117j0377N4895P649K2165N5298
7339B4795J4461l6230l561R899j3252R310j5812J864K178O630j4709j1094M2315
7326A6794P5592N0594k2030k6613k521q055q617P190m5473j1605K2309k1644j6635
7313I286m114m4811j7084L0852K2239L1943K5305O462k8865J3063K3294j836J6008
7300H1742m7385l0748R996k0118N085J4784l786O340M8198K8415l0762k9173J5577
7287D8165J1431k5284n7415k3642N7584N0404P047M904k1359m9902j7441J5556
7275D8K4244K8174k7764p832k3510l5568L0162L4299K3061O742J261J1967m903
7262F0381k6990M739J4826L9877P4907j2546n1801p5952n262N2451p857l207Q970
$$ plain form
7351 44661 42754 22433 43427 59892 -8515 -94718 -104835 -115212 -60317 -52668 -30503 24795
7339 24795 39256 3026 -535 9364 -3888 5422 -10390 -8526 -6348 282 -14427 -25521 16794
7326 16794 92386 142980 120950 94337 91816 83761 75144 82334 36861 25256 47565 25921 9286
7313 9286 5172 -39639 -56723 -25871 -3632 28311 53616 60078 31213 44276 67570 65734 81742
7300 81742 34357 3609 13605 -6513 -1428 13356 9570 15910 64108 92523 61761 32588 48165
7287 48165 59596 34312 -23103 -46745 10839 61243 68290 73194 51835 1933 -15508 48
7275 48 24292 52466 24702 16870 -6640 -42208 -12046 22253 45314 52056 53317 65284 60381
7262 60381 33391 38130 52956 92833 167740 155194 103393 27441 22179 74630 66773 63566 72536
7249G2536n5833m7312j8559M7207K9093J1218j513p281n5211j5569l6851L7809
7237d0266N4153k3500K3967O5022J8607k7215j4594K4842r178L156j3615m090
7225E7289J9436k3529k1066J5214k7816m6651l6140K9245l4225K5604Q1510J3535
7213E2406l9890K0695p89n0677N55K182K570l947l2970K4635J5992K3502p56m4132
7199c0624K4066K0774J9026r235O952j0555o5968K1282q934M6879J5796m2818
7187a3359l3598N364O1590k217j457L9704l0448m1928L914N694K4439j328l9327
7174b2957k0341K389J5678q229k2986Q802M5332N868n733J4467K365j734k1133
7161h212K791J2862P472m9919j1395M0049J2856Q24K9067M28j5477l7517L8433
$$ plain form
7249 72536 16703 -30609 -49168 -1961 27132 38350 36837 29556 -25655 -41224 -78075 -40266
7237 -40266 13887 -9613 14354 79376 97983 70768 56174 81016 71838 74994 61379 57289
7225 57289 76725 53196 32130 47344 19528 -27123 -63263 -34018 -68243 -42639 38871 52406
7213 52406 12516 33211 32422 -18255 -17700 -15518 -12948 -16895 -49865 -25230 -9238 14264 13508 -30624
7199 -30624 -6558 14216 33242 24007 30959 20404 -45564 -24282 -33216 13663 29459 -13359
7187 -13359 -46957 -41593 19997 17780 16323 56027 25579 -16349 -12435 -6741 17698 16370 -22957
7174 -22957 -43298 -40909 -25231 -33460 -56446 -47644 -2312 3556 -2177 12290 14655 12921 -8212
7161 -8212 -5421 7441 14913 -35006 -46401 -6352 6504 7328 36395 36823 21346 -16171 22262
7148B2262J5878k0343J8933M787J5560q4185l0478R666O747R013L4025M9187R002
7135F0054J6776q59l2694o9833J0197K6189K2645M7656J3357m4534K5923k3079
7123E1798m4657k2838o939j6958J5J3863m1467L4362O0644k0173r9n769l0307
7110b8525l3075j1877L0691N6141J6801J7940l6871Q226J9384n1140m1267M1430
7098a2142K9880M3901j1609j1527J4590j530k040j17j4281K792P495j1836J152
7085C4728Q264L2197j3509l1601m1277j3604L5971K9911J92j6419J4609j384j0807
7072B7271O075N7992j7311K0560L8319J0525k1002o9849m2661J4505J3426j4881
7060B2969J0561l325o05m752K0275j860l1491j7241J9988K286K751j0727j2645
$$ plain form
7148 22262 38140 17797 36730 41517 57077 -27108 -57586 -47920 -41173 -32160 1865 51052 60054
7135 60054 76830 75971 43277 -26556 -16359 9830 32475 80131 93488 48954 74877 51798
7123 51798 7141 -15697 -22636 -39594 -39579 -25716 -67183 -32821 27823 7650 7551 1782 -28525
7110 -28525 -61600 -73477 -42786 13355 30156 48096 11225 19451 38835 -12305 -53572 -12142
7098 -12142 17738 61639 50030 38503 53093 51563 49523 49406 35125 37917 45412 33576 34728
7085 34728 42992 75189 61680 30079 -11198 -24802 11169 41080 41272 24853 39462 38078 27271
7072 27271 33346 91338 74027 94587 132906 143431 122429 52580 9919 24424 37850 22969
7060 22969 33530 30205 29600 24848 45123 43263 11772 -5469 14519 16805 19556 8829 -3816
7047c816P6834L4229k0355j6522l9136m736n943k6109J7405N7249K2165k519n9373
7034B9373j7625L2814j3053J1730j1057J750R061K0222L4861k9982o5940j9150
7022a6996J3442k5948N229M5590K8789J1194k9183O137K8185k062j9705p10o657
7009C7305q0445k4859N3445K7122K3009k2957m152J7358K9603J3601M936j9718
6997E4248n0372j4224m633j5277K5972J3526l3610j7008j80l695K3708J9520l669
6984e694j0469j2524K4018J0308L999R533j8465p026O569J2426L6994n040l6525
6971H104o656K895k0403l0945l2266j0057K9013M8046p268n263p643j1178o371
6958d9992r998j5520l076K0353l0917j7541M2533L6182J9797M1372J892P934k3834
$$ plain form
7047 -3816 73018 107247 86892 70370 31234 26498 20555 -5554 11851 69100 91265 88746 29373
7034 29373 11748 44562 31509 43239 32182 33932 42993 63215 98076 68094 2154 -16996
7022 -16996 -3554 -29502 -24273 21317 50106 61300 32117 38254 66439 64377 44672 43962 37305
7009 37305 -43140 -67999 -14554 12568 35577 12620 8468 25826 55429 69030 73966 54248
6997 54248 3876 -10348 -14981 -30258 -4286 9240 -24370 -41378 -41558 -45253 -21545 -2025 -5694
6984 -5694 -16163 -28687 -4669 5639 9638 19171 706 -6320 249 12675 49669 44629 8104
6971 8104 1448 4343 -16060 -47005 -79271 -89328 -60315 -12269 -19537 -24800 -32443 -43621 -49992
6958 -49992 -59990 -75510 -78586 -58233 -89150 -106691 -64158 -27976 -8179 33193 35085 43019 19185
6945A9185l5546P872J1172P618k5820n695L4265q282J4888k6941o4635k0837K8865
6932f3891M0371L6205j8478l7867n5352j9535L1402N0936P756k1098J8216L0218
6920a117Q993K6109k3699j8554J7315j1703M456j5227m921J7068k4389k2816L9832
6907h653N6243j1004n5628O748L9172N01p370j884p672n1774k6417K0214K2142
6894b5382L4998M1949j3470j6354L2871q455m1621m7993l371M9774j0813J2880
6882E013L4833k1376p0900k453M8995N812R261K9152o808j1112K1057O807j0937
6869C7344j2926n648J4743k0582j4169J9076m3171n372N0700j2619l1866j3226
6857c7716J9545K3338N5200l8606l7021J0074N748K1317n7589k806N9750M0723
$$ plain form
6945 19185 -16361 -8489 2683 10301 -15519 -21214 13051 4769 19657 -7284 -71919 -92756 -63891
6932 -63891 -23520 12685 -5793 -43660 -99012 -118547 -87145 -36209 -28453 -49551 -31335 -1117
6920 -1117 7876 33985 10286 -8268 9047 -2656 1800 -13427 -18348 -1280 -25669 -48485 -8653
6907 -8653 47590 36586 -19042 -12294 26878 27379 20009 18125 10453 -41321 -67738 -47524 -25382
6894 -25382 9616 51565 38095 21741 54612 46157 4536 -43457 -46828 2946 -7867 5013
6882 5013 39846 18470 -52430 -54883 -5888 -76 9185 38337 31529 20417 41474 48281 37344
6869 37344 24418 18770 33513 12931 -1238 17838 -25333 -30705 19995 7376 -24490 -37716
6857 -37716 -18171 5167 60367 21761 -15260 -5186 562 21879 -35710 -38516 21234 61957
6845F1957J5262l4305l4816K6290p429m4575l4672J1582R233M1466K993K21m240
6832H967O812J2545L7635k0704j7141k2622k1015O461J9015P976l677j3384L120
6819C988k1439k60K1955J1602R580k7589L8673O1729n4169k5431R576m5898O595
6806a1088j9743m279L667M9120J2350j6548K4777l4714k224p638p878R550Q412
6793C764J3855l2898k8664R607j6848j3707k5669M5499J1363J4054o476l468j4046
6780d3634N1365L8300r543j8248k4189j9884J6249Q516j8295K3771N0812J8611
6768G3831n1945l8149j1278K6490K0870k1458j5729R042n5275j101K6725M4981
6756G004M3647n2687l7394j5247L4889K2154Q091J0939J626j7710M41l5960m1729
$$ plain form
6845 61957 77219 42914 8098 34388 26959 -17616 -52288 -40706 -31473 9993 12986 13207 8967
6832 8967 15779 28324 65959 45255 28114 5492 -15523 -9062 9953 17929 14252 868 3988
6819 3988 -17451 -17711 4244 15846 25426 -2163 36510 98239 44070 18639 28215 -17683 -11088
6806 -11088 -30831 -35110 -31443 17677 30027 13479 38256 3542 1318 -6320 -14198 -4648 3764
6793 3764 17619 -15279 -43943 -34336 -51184 -64891 -90560 -45061 -33698 -19644 -26120 -29588 -43634
6780 -43634 7731 46031 36488 18240 -5949 -25833 -9584 -1068 -19363 4408 55220 73831
6768 73831 21886 -16263 -27541 -1051 19819 -1639 -17368 -8326 -63601 -64702 -37977 7004
6756 7004 50651 -2036 -39430 -54677 -19788 2366 10457 21396 23022 5312 5753 -30207 -71936
6743g1936R096Q9674N8520n223m8796l2999J5443j257k7545P722J6274N013j2162
6730A824q892O7820K302j1631k913k9253l1888J6529j1598K2554K4909J1363l2854
6717A8272j3951K177K2629J0543m056J275j1775m7608N387J2377q106n465K068
6704a6233K048L2994j0963j4898l3202P353J7493k3536n531k688n5049J6573L1694
6691e3945m248K1695L4636P564l6105m6038M4381Q7353L3851j9916j1699o2891
6679e362J6361K6278l3078J6358j024k2618l6703m4501M0857K4091l2740J7005
6667c5076K351k362k2361P570K1336J2800j4906O036J7054N488j2248J6O4986
6654E0684K908m0401K0115O670O928N5064n381n1347n175j2137l2309j419O437
$$ plain form
6743 -71936 -62840 26834 85354 80131 31335 -1664 13779 12522 -15023 -7301 8973 13986 1824
6730 1824 -7068 60752 63054 51423 48510 19257 -12631 3898 -7700 14854 39763 51126 18272
6717 18272 4321 6498 29127 39670 35614 36889 25114 -22494 -17107 -4730 -12836 -18301 -16233
6704 -16233 -14185 18809 7846 -7052 -40254 -32901 -15408 -38944 -44475 -47163 -102212 -85639 -53945
6691 -53945 -58193 -36498 -1862 5702 -30403 -76441 -32060 55293 89144 69228 57529 -5362
6679 -5362 10999 37277 4199 20557 19533 -3085 -39788 -84289 -43432 -19341 -52081 -35076
6667 -35076 -32725 -35087 -57448 -49878 -28542 -15742 -30648 -24612 -7558 -2070 -14318 -14302 50684
6654 50684 53592 13191 33306 39976 46904 101968 96587 45240 40065 27928 -4381 -5800 637
6641F37K9174m548J6221M174o000k0602l4428N8269J5129j7799j8043o622J3279
6628B8841O065j5744m8538K0944M4612K1124K1697m2225m1102k4323k815O79L53
6615c0432O540r822q270P4037j2551j7847J2695P947p5188R987l2416m6837K11
6602a21946M1854P3598L7058j9485m0257M0632o148l5725m8736n47J4805M2856
6590b2041J4034J60j2724K1743K8612M2369p92N456j324J199l1252J8906M160
6577F8506N281k8073j8561j5679k4783l0834l8398j9516L6085O1908K6153j9384
6565B705m1799K3224J1651q220m4784J5244n4083L0760L6338Q253J8525L0792
6553B8606J1036J8607o4522j4157M679k9740p644L4084K7786m1077J1109N9032
$$ plain form
6641 637 29811 25263 41484 45658 39658 19056 -15372 42897 58026 40227 22184 15562 28841
6628 28841 34906 19162 -29376 -8432 36180 57304 79001 36776 -4326 -28649 -31464 -30785 -30432
6615 -30432 -23892 -33714 -41984 32053 19502 1655 14350 22297 -52891 -42904 -75320 -122157 -121946
6602 -121946 -80092 -6494 30564 11079 -29178 11454 5306 -30419 -79155 -79702 -64897 -22041
6590 -22041 -8007 -7847 -20571 1172 29784 72153 71361 76817 75493 76692 45440 64346 68506
6577 68506 73787 45714 27153 11474 -13309 -44143 -82541 -102057 -65972 -4064 22089 2705
6565 2705 -39094 -15870 -4219 -12439 -57223 -41979 -96062 -65302 -28964 -20711 -2186 28606
6553 28606 39642 58249 -6273 -20430 -15751 -45491 -53135 -19051 8735 -32342 -21233 37799
6541C7799k0115J3087l1330k019J8473N3386m3525k6135k6388m991j5344J7219
6529b9883l436M122j436m0115N5920N5977J6105k2391l9118n2192l6166j9036
6517a11649O1843K1502j2502K4473O708J4075K854J9825j6085J9039j5838M0954
6505E5199K6805l6918k749K2505l5228l6245o651L100L1917M1257K1189l6676
6493D7505l7177k4770l7923m8467M4456O7468J880J6471P592L4744L378k7097
6481D8060k7550O29k7127l0203L0186l484n359k5362K8254P919l0713m1329o19
6468g6698L3848R355M2889L8147k4791r226M293j1718n7385K413N0859l7827k0248
6455e6089K1314J4796q761J1499N9150L5113l5616K50M878J11J5591n992p328
$$ plain form
6541 37799 17684 30771 -559 -2578 15895 69281 25756 -379 -26767 -31758 -47102 -29883
6529 -29883 -33319 -29197 -30633 -70748 -14828 41149 57254 34863 -4255 -56447 -92613 -111649
6517 -111649 -49806 -28304 -40806 -16333 -9625 4450 7304 27129 11044 30083 14245 55199
6505 55199 82004 45086 42337 64842 29614 -6631 -13282 -10182 21735 62992 84181 47505
6493 47505 10328 -14442 -52365 -100832 -56376 11092 12972 29443 37035 71779 75157 48060
6481 48060 20510 21139 -5988 -36191 -6005 -9489 -14848 -40210 -11956 -4037 -34750 -76079 -76698
6468 -76698 -42850 -33495 9394 47541 22750 13524 17817 6099 -51286 -48873 1986 -35841 -56089
6455 -56089 -34775 -19979 -28740 -17241 41909 77022 41406 41656 46534 46645 62236 56244 48916
6442D8916J8989k0538j2000L1887k6854j3715m8222k9608k2456j8143p557L1244
6430f8057M8031J0706l4894K0431K8413J0491N915n589J6609J5558k9707k7468
6418i561l1035J0058k353l4223m050J8018N8845K8586l7335j8956L449m6292m3570
6405a08419J1361L2604L1621O996j066o563j6147L626K9200k4991m6168J8458
6393f9488M7724j1127R162m301O0631J8914j5702R201q816k2873m937k629J3132
6380A8891j7157J1925r830l1952J0262q127k7441l4008j3504m408L4318K1056
6368d9975k7896j934k9579J9195L7829R040K0508j2180L2503L299n1093P724J767
6355d0792m2336Q824M0671k6913J8689N997j1895M4895N7757K1898j7378n0313
$$ plain form
6442 48916 67905 47367 35367 67254 40400 26685 -21537 -51145 -73601 -91744 -99301 -68057
6430 -68057 -20026 -9320 -44214 -23783 4630 15121 21036 15447 32056 47614 17907 -9561
6418 -9561 -40596 -30538 -32891 -67114 -71164 -53146 5699 34285 -3050 -22006 -18557 -64849 -108419
6405 -108419 -97058 -64454 -32833 -25837 -26903 -33466 -49613 -45987 -16787 -41778 -87946 -69488
6393 -69488 -21764 -32891 -23729 -28030 32601 51515 35813 45014 36198 13325 8388 5759 18891
6380 18891 1734 13659 3829 -28123 -17861 -25988 -53429 -87437 -100941 -105349 -71031 -49975
6368 -49975 -77871 -79805 -109384 -90189 -52360 -43320 -22812 -34992 -2489 810 -50283 -42559 -40792
6355 -40792 -83128 -74304 -33633 -60546 -41857 -35860 -47755 -2860 54897 76795 59417 9104
6343I104l9159O115M3253K7984K1243k7829o049l9294q351o411j5139L6591K7489
6330B9547o648l0848j2442r526j0398L056K4571K6902q029j0018J3148j1781k4082
6317b6548j3666j3437J2628L0876M06j8417j7281O176O5553l5l6535O8884J4697
6304G3301l1671l1509J8717R361m87Q008R419l0241m7149n760K4892j2540J8191
6291B532K218k6610l1961m23L8537K769j055M8711j0749l0389P667l0036j4157
6278d2946P117M1292L5104l0559l8073p802k4876J080M2550L2560j0920j3025
6266h498l0317n188l0824K4430L2098k2787j3839L8635N324J0280L4306J0260
6254D3880r634l9939j7144K1636N1445n054L788j2429j7015l4467n0302j4339
$$ plain form
6343 9104 -30055 -23940 19313 47297 68540 40711 34662 -4632 -12983 -19394 -34533 2058 29547
6330 29547 22899 -7949 -20391 -29917 -40315 -37259 -12688 14214 6185 -3833 9315 -2466 -26548
6317 -26548 -40214 -53651 -41023 -10147 -9741 -28158 -45439 -39263 26290 26255 -10280 58604 73301
6304 73301 41630 10121 28838 38199 37712 45720 55139 24898 -22251 -28011 -3119 -15659 2532
6291 2532 4750 -21860 -53821 -54244 -15707 -12938 -13993 34718 23969 -6420 1247 -28789 -42946
6278 -42946 -35829 5463 40567 10008 -28065 -35867 -60743 -59663 -17113 15447 4527 -8498
6266 -8498 -38815 -44003 -74827 -50397 -18299 -41086 -54925 -16290 -10966 -686 33620 43880
6254 43880 34246 -5693 -22837 -1201 50244 45190 48978 36549 19534 -14933 -65235 -79574
6242g9574N5705J0788L2956j3225O51l1059n1794K8777N408J4017l5163K6159
6230c6354k3449l7213J3745O1859O4353J1400k1654k9590j0688k3599k0577j0952
6218f2719L391N3100n48L4744l279J0133J6840K6645L23k219J9198l0673j2739
6205E2197l9613j7395j6898l2997N723N3434N179j0422m1130k5252n197J5039
6193e7332K2618O167k0065n5728M5518N8145l3953k1173K0120R68J6370J9610
6181A265R654m5106m1619J2029J4788N8352J9502J6937L1547j1825l9193j6299
6169A0032o06K1766j5468j9473L2864m308k0412k4977k6020o620k9249j6209M4463
6156e4217K6065L2128K3198q693J658M725K2281k8943l2282L8798J5393l1473
$$ plain form
6242 -79574 -23869 -13081 19875 6650 7301 -23758 -75552 -46775 -41367 -27350 -62513 -36354
6230 -36354 -59803 -97016 -83271 -21412 42941 54341 32687 3097 -7591 -31190 -51767 -62719
6218 -62719 -59328 -6228 -6776 27968 24689 34822 51662 78307 78630 76411 95609 64936 52197
6205 52197 12584 -4811 -21709 -54706 -48983 4451 9630 -792 -41922 -67174 -72371 -57332
6193 -57332 -34714 -28547 -48612 -104340 -58822 -677 -34630 -55803 -35683 -34715 -18345 1265
6181 1265 10919 -34187 -75806 -63777 -48989 9363 28865 45802 77349 65524 26331 10032
6169 10032 9426 31192 15724 -3749 29115 24807 4395 -20582 -46602 -53222 -82471 -98680 -54217
6156 -54217 -28152 3976 27174 18481 20139 24864 47145 18202 -14080 24718 40111 8638
6144H638j2500n088J4164L6222J9311o251J0720l6693o1373K0680L0031L2970
6132E0831l2967n3864j9376M498J3058M7817n027k3238K0912K011J3131K6057
6120D3843J2439k9978j7902m2933j625J6105K5695P767P996m8874n3145J2660
6108f7952L9221N3381K937l4993N457K3986J0494M3628P629l6073k0353L0958
6096E8320q562l6686k9409J4850J2897m6650O048Q485j8825J9446J2108o430m604
6083a9012L5645O669k4274m6947l3649K5157l0365J6372l224q05L5304M0335j2127
6070a0921J4827n119k5947j2672k3306K6937K8205N50O426M259j9778K4823L2219
6057D0503l4959l1448l1485L0960j0219L6741M1255K9226j9982l5050k7353K6444
$$ plain form
6144 8638 -3862 -8950 5214 41436 60747 54496 65216 28523 -32850 -12170 17861 50831
6132 50831 17864 -36000 -55376 -50878 -37820 9997 4970 -18268 2644 4655 17786 43843
6120 43843 56282 26304 8402 -34531 -36156 -20051 5644 13411 21407 -27467 -80612 -67952
6108 -67952 -28731 24650 27587 -7406 -1949 22037 32531 76159 83788 47715 27362 58320
6096 58320 49758 13072 -16337 -1487 11410 -35240 -29192 -20707 -39532 -20086 -7978 -14408 -19012
6083 -19012 16633 23302 -972 -47919 -81568 -56411 -86776 -70404 -73628 -74433 -39129 1206 -10921
6070 -10921 3906 -1213 -27160 -39832 -63138 -36201 -7996 -7446 -1020 3239 -16539 8284 40503
6057 40503 5544 -25904 -57389 -26429 -36648 93 41348 70574 50592 15542 -11811 14633
6045A4633K867K861M1360j5771K5902K4053k0052J28K331J299o5600l1240J2269
6032d960K533k9261l1230l1286L0679N7354J2462o187p843l251P18l921J3079
6019a114j7479p202k5495M364J5143K8523J134Q582j643K6435j6440K4683K8859
6006F8350R958l0029j9948l7275n074N2038L760k9638j5756N497m9400j5022m8889
5993a11428Q790M0752q054J5338M3810K7008Q105j612K782k5173j9346m7365J9820
5980d6573N8265K9950K2692K0958m0407k1122L918L3497n492j3766J4627j1301
5968D5246o911k6723K6144M0705p070m8838K729J9413j896j7685Q845J666k5088
5955A0537r268K37m6332k2098K9085Q537K0294L2545P674K7341m45l4320n9889
$$ plain form
6045 14633 17500 20361 61721 45950 71852 95905 75853 75981 78312 79611 14011 -17229 -4960
6032 -4960 -2427 -31688 -62918 -94204 -63525 -6171 6291 104 -7739 -10990 -10272 -14193 -1114
6019 -1114 -18593 -25795 -51290 -46926 -31783 -3260 -2126 6456 4813 31248 14808 39491 68350
6006 68350 78308 48279 28331 -8944 -14018 38020 41780 12142 -3614 1883 -47517 -62539 -111428
5993 -111428 -102638 -61886 -69940 -54602 -10792 16216 24321 22709 25491 318 -19028 -66393 -46573
5980 -46573 11692 41642 64334 85292 44885 23763 27681 61178 55686 41920 56547 45246
5968 45246 38335 11612 37756 78461 71391 22553 25282 44695 42799 25114 33959 35625 10537
5955 10537 1269 1506 -44826 -66924 -37839 -29302 -9008 23537 31211 58552 58107 23787 -36102
5942c6102k1673k5695L1191k2032K4108J3140L067k0371K7539J2756j1308k278
5930b7658j134K9056K6141k0692J9670q797k9681j2209K1600k9146k9750m322
5918f6922P533K7837J3885K0638J0928j2871L0449N8941N9113k3825n2023n0147
5906B3536j2715n399l1366M573k7855J116J5033J6128m260J7861j2611j7094Q003
5893b5050j6368o82l0730l2454j5507R018L0247L4799O572j8158k106M744K6727
5880b8948N3991j717m7107l0804J4664K9893M1167j5432k5098l0423k4537m0669
5868a05020l948M7929K4257k4674K3095p07N485L4848p089m9101k0648K1829j1967
5855f5711k360O0502J053J9819J870J5873Q68l1519m177N6584m9088l8739M6416
$$ plain form
5942 -36102 -57775 -83470 -52279 -74311 -50203 -37063 -33996 -54367 -26828 -14072 -25380 -27658
5930 -27658 -28792 264 26405 5713 25383 16586 -13095 -25304 -3704 -32850 -62600 -66922
5918 -66922 -59389 -31552 -17667 2971 13899 1028 31477 90418 149531 125706 73683 23536
5906 23536 10821 5422 -25944 -21371 -49226 -48110 -33077 -16949 -21209 -3348 -15959 -33053 -25050
5893 -25050 -41418 -42100 -72830 -105284 -120791 -111773 -81526 -46727 -40155 -58313 -60419 -55675 -28948
5880 -28948 25043 23326 -23781 -54585 -39921 -10028 31139 15707 -9391 -39814 -64351 -105020
5868 -105020 -108968 -61039 -36782 -61456 -38361 -39068 -33583 1265 -5824 -54925 -75573 -53744 -65711
5855 -65711 -68071 -7569 -6516 13303 15173 31046 31914 395 -3782 52802 3714 -35025 11391
5842A1391k2250k2440J9329M097K4881j4711j7632J176M411J8196J6616O756l9443
5829i623j9714j0692J5764m7389m418J2205J3169M400L121k3951k1236J4886L4909
5816c8569L5787l0399j5996K4036J2416k3286K2005J4884r957j5905J4859N4966
5804D4841M4377m8507j9640j5695K3605m2383j8716j9876J903r875m0580k0172
5792a20718M5993O3806k5022k0123R225J4746L3267K1756K5651J3554o5265n1992
5780e5122K1043K3004j2973j1619k5642O763L0380N749L549p311k4471Q067O0686
5767B2103n663k5413m1358j2130l342k081q523m582L6090L5043m5449k7091o315
5754h8711K9434L3655k0441k3415K303O4713J8667n641k999m2228m1545j2678
$$ plain form
5842 11391 -10859 -33299 -13970 -9873 15008 297 -17335 -16159 -11748 6448 23064 29820 -9623
5829 -9623 -29337 -40029 -24265 -71654 -76072 -63867 -50698 -46298 -43177 -67128 -88364 -73478 -38569
5816 -38569 -2782 -33181 -49177 -25141 -12725 -36011 -14006 878 -9079 -24984 -10125 44841
5804 44841 89218 40711 21071 5376 28981 -13402 -32118 -51994 -50091 -59966 -100546 -120718
5792 -120718 -74725 -10919 -35941 -56064 -46839 -32093 1174 22930 48581 62135 -3130 -55122
5780 -55122 -34079 -11075 -24048 -35667 -61309 -54546 -24166 -18417 -14868 -22179 -46650 -38583 22103
5767 22103 16440 -8973 -50331 -62461 -65803 -67884 -76407 -80989 -44899 -9856 -55305 -82396 -88711
5754 -88711 -59277 -25622 -46063 -69478 -67175 -2462 16205 10564 7565 -34663 -76208 -88886
5742h8886J1902N3706O137m6809k7530j0794q921K3127Q634O7955N4382k2798
5730B0105J7561K7124p924l7364o867j5590j794P178k3430l557n0913k6686K027
5717a00130k3456L1076L5338J2425l888k9304K4496M0515L051J0630m2200m1982
5705h3429l7789N288P4128M2103k3109l6028j8622k2975n803M5698L5940j7219
5693d1817J0785L6981N1003R126m8632n0303L4082L7071L385m1766k521l6386
5681c8992K11J6953j6789j3445L3159K3497m6807K764M2296K6067j4723l9644
5669b5453j7405J9085J0330j4364K8011r447n2128J6954J0897K5507M9187K5717
5657F6891o811n7691l2200k2957o392j7331K9008K9622j7489M44J5813K1345J2123
$$ plain form
5742 -88886 -76984 -23278 -17141 -63950 -91480 -102274 -111195 -88068 -79434 -11479 42903 20105
5730 20105 37666 64790 56866 19502 12635 -2955 -4749 2429 -21001 -24558 -75471 -102157 -100130
5717 -100130 -123586 -92510 -57172 -44747 -48635 -77939 -53443 -12928 -9877 753 -41447 -83429
5705 -83429 -121218 -115930 -41802 301 -22808 -58836 -77458 -100433 -106236 -60538 -24598 -41817
5693 -41817 -31032 5949 56952 66078 17446 -32857 1225 38296 41681 -85 -2606 -38992
5681 -38992 -38781 -21828 -38617 -52062 -18903 4594 -42213 -39449 2847 28914 14191 -25453
5669 -25453 -42858 -23773 -13443 -27807 204 -9243 -61371 -44417 -33520 -8013 41174 66891
5657 66891 60080 2389 -29811 -52768 -59160 -76491 -47483 -17861 -35350 -34906 -19093 2252 14375
5644A4375J4694j3150j9303J8640L1754J324j7894k5192n7131m0008K4349r911
5632g7453O3456N8314l251l6179J3695M180L4329j2411j1302k0859j6713l462
5620g656k7227k5637Q664l024O760O421k2718L1905J8160L4664j4961j2692j5596
5607b2937Q308N1582J2473n5976J4949j0593m3709P4330J6366p4185K7878k5707
5595b7221k4871l11J8602Q798l1461q2341K6613M4446J8426J0568Q7855R610n8632
5582H1n3326j9649J6272o436K2267J9331L7063P1803J5394p5689m9339k7026l7815
5569h7069L2707K7857q490m252L0794j1845l918N0926m351n5703m143K7713M8236
5556C8462j1843k1471k5296M1670k5697k8922J013M0891L9632l5884l3809M222
$$ plain form
5644 14375 29069 15919 -3384 15256 47010 48334 30440 5248 -51883 -91891 -67542 -77453
5632 -77453 -13997 44317 41066 4887 18582 22762 57091 44680 33378 12519 -4194 -7656
5620 -7656 -34883 -60520 -51856 -54880 -48120 -41699 -64417 -32512 -14352 20312 5351 -7341 -22937
5607 -22937 -14629 36953 49426 -6550 8399 -2194 -45903 28427 44793 -29392 -1514 -27221
5595 -27221 -52092 -52403 -33801 -25003 -56464 -138805 -112192 -67746 -49320 -38752 49103 58713 81
5582 81 -53245 -72894 -56622 -63058 -40791 -21460 15603 87406 102800 27111 -22228 -49254 -87069
5569 -87069 -54362 -26505 -34995 -39247 -8453 -20298 -24216 26710 22359 -33344 -37487 -9774 38462
5556 38462 26619 5148 -20148 21522 -4175 -33097 -32084 8807 48439 12555 -21254 -17032
5544a7032j0902m3466k8860J717L3630L3264L1074K4599k5436j8457j2722j5249
5532d7840J2575J7921l7971j3922J7795R420M8172j3396j869J807j560J683n571
5519a2756Q508J5063m2319j4977P759J9835M0019Q809n4330j1395M0694R913l1254
5506a6431n5426k0851N311K6835L0462J0866J5071J1508k1089J320m755J333q414
5493b4260J9615L1855l490P637M5437l2033n3740j6327K3568J2131k8121l7225
5481e4953k2649P764J8890l7351m715N3280l3123L8463J4846j1173k5836J0952
5469d5605o903J8767L9613j0183J3935J2036j8672J9174K3391o55n336l3569m187
5456A806O3767J5451l7286l2942j2802j6049J2331p858P259O279J9306l7236L3397
$$ plain form
5544 -17032 -27934 -71400 -100260 -98543 -64913 -31649 -575 24024 -1412 -19869 -32591 -47840
5532 -47840 -35265 -17344 -55315 -69237 -51442 -42022 6150 -7246 -9115 -7308 -8868 -7185 -12756
5519 -12756 -4248 10815 -31504 -46481 -38722 -18887 21132 29941 -24389 -35784 4910 14823 -16431
5506 -16431 -71857 -92708 -87397 -60562 -30100 -19234 -4163 7345 -13744 -12424 -17179 -15846 -24260
5493 -24260 -4645 27210 23720 31357 76794 44761 -8979 -25306 -1738 10393 -17728 -54953
5481 -54953 -77602 -69838 -50948 -88299 -93014 -39734 -72857 -34394 -19548 -30721 -56557 -45605
5469 -45605 -52508 -33741 5872 -4311 9624 21660 2988 22162 45553 44898 39562 5993 1806
5456 1806 65573 81024 43738 10796 -2006 -18055 -5724 -13582 -6323 -44 19262 -17974 15423
5443A5423j446o9528K0075L6090k2930j0956K2823l964k2654J9937k7190k1304
5431f5624J046J4480k8160k3994K8565J1553J0561j8458l138K2763K7101j2667
5419c5972j3872K8667k1622J0469k2748J8070K8250k2331m566K4481r653l705
5407b4532J1381P315L2121L6197N4250j1752j00113o4397K6004L4022K2133J0656
5395C3285r928O694P165n764o6898N450K5243J59O359Q238p796j0178j1168L65
5381a8774J4905K0508L7144N727l1741k6435j432n3867o6807P6457L7306o292
5369a3301J3931K7471j922m1016O9925L2809o621q80m8777m4383j0182j5509j0898
5356d9353J8395M2585q776K155Q899o3014K2684M2925J4642k4838M0995K0081
$$ plain form
5443 15423 13977 -55551 -35476 614 -22316 -33272 -10449 -14413 -37067 -17130 -44320 -65624
5431 -65624 -64578 -50098 -78258 -102252 -73687 -62134 -51573 -70031 -73169 -50406 -23305 -35972
5419 -35972 -49844 -21177 -42799 -32330 -55078 -37008 -8758 -31089 -35655 -11174 -20827 -24532
5407 -24532 -13151 -5836 26285 62482 116732 104980 4867 -59530 -33526 496 22629 33285
5395 33285 23357 30051 37216 31452 -35446 -29996 -4753 -4594 1765 10003 2207 -7971 -19139 -18774
5381 -18774 -3869 16639 53783 59510 27769 1334 -98 -53965 -120772 -44315 -7009 -13301
5369 -13301 630 28101 26179 -14837 55088 87897 81276 80396 31619 -12764 -22946 -38455 -49353
5356 -49353 -30958 11627 2851 5006 13905 -49109 -26425 16500 31142 6304 47299 67380
5344F7380l6841J275J7035j0149q1566Q261N6435M3142m1356k090k5574O171q560
5331f437n0834q779L4625J8901J8138K4618L1856K9172L965l1756p1841l9934
5319d8306k1473J426j4390P3432N5043l1400k1080k3715o026K4032J6374q484
5307d567l3225m1277j6056N5795O711J1456K7926K2722p459J9282N8568m832l7470
5294E7574k0281J5013k1591l4462o797J4835m831k6708k6722K8736N0089j9124
5282E731l8534P639l165k1044k6905J9913K0718L1637p2534J9263J7848Q545L1517
5269F29L2698L1771q668j591q818n4725n4579j325m635K7843N1029k7940m8526
5256f6837J623l1909N8798K1609K2271k0627R241N332J1062l6998j1807L1442
$$ plain form
5344 67380 30539 31814 48849 38700 -42866 -34605 21830 64972 23616 21526 -4048 2123 -6437
5331 -6437 -57271 -66050 -31425 -12524 5614 30232 62088 91260 95225 63469 -8372 -48306
5319 -48306 -69779 -68353 -82743 -9311 45732 14332 -6748 -30463 -36489 -12457 3917 -4567
5307 -4567 -37792 -79069 -95125 -39330 -32619 -21163 6763 29485 22026 41308 99876 95044 57574
5294 57574 37293 52306 30715 -3747 -10544 4291 -540 -27248 -53970 -25234 24855 5731
5282 5731 -32803 -25164 -28329 -49373 -76278 -56365 -35647 -4010 -76544 -57281 -39433 -30888 629
5269 629 33327 65098 56430 54839 46021 -8704 -63283 -64608 -69243 -41400 9629 -18311 -66837
5256 -66837 -65214 -97123 -38325 -16716 5555 -15072 -5831 -499 10563 -26435 -38242 -6800
5244f800k4242j0145l9704N203m547K0908K4242m500J9576k8476l4497k024L3749
5231e1257j7440k530k0108K2836M2745L1148N2008j873M010J6614r13n3389l5688
5218a3837K4441m605k3381N1743J7230m678J3137k4024k426l0230o208k04p1009
5205g4051l7002K4147L6422L2871m8368o884K5527L4844K0342l4751k2401m2233
5193i1537j3344k024O0311J9445N478m7029k2733J2756L7673m401j219K8704j4483
5180c2403l8386J6248j2285J7371K7230J2599N8490J3894o9517n553J5293K6823
5168B9804j0037K826Q169j2942k0443k8431J7338J7581k3403l0177K1662K3062
5156d991m923M9056j0543q4240l210N2928M7685O495J7010R646j8949m1776l4515
$$ plain form
5244 -6800 -31042 -41187 -80891 -75688 -80235 -59327 -35085 -39585 -20009 -48485 -82982 -85006 -51257
5231 -51257 -68697 -71227 -91335 -68499 -25754 5394 57402 55529 59539 76153 75240 21851 -13837
5218 -13837 10604 5999 -17382 34361 51591 46913 60050 36026 33600 3370 -2838 -3042 -74051
5205 -74051 -111053 -86906 -50484 -17613 -65981 -72865 -47338 -12494 7848 -26903 -49304 -91537
5193 -91537 -104881 -106905 -46594 -27149 -21671 -68700 -91433 -78677 -41004 -45405 -46624 -17920 -32403
5180 -32403 -70789 -54541 -66826 -49455 -22225 -9626 48864 62758 -6759 -12312 2981 29804
5168 29804 19767 22593 30762 17820 -2623 -31054 -13716 3865 -19538 -49715 -28053 -4991
5156 -4991 -9914 39142 28599 -55641 -58851 -5923 41762 48257 65267 74913 55964 14188 -20327
5143b0327N111J547K8929K3074K5941l994l9M345k2581m3053j4256j0072l9315
5130f4690k409P0443M65K624j5550k8331K3543Q275l1054j4009j2191P764J5157
5117c9963J7862K3315L7120J3737M689o1523l1617N04M5910O1470k2990j155J5870
5104F3229j3448n327k0642J0943l1432m7878l7007j57O613k578J3852O8791K1740
5091B6699j7921l6337j3860R839K2836j2287j7268l0260l934K8269j3355L9346
5079a8233Q1597l630l7847k7431K926O176M3960j7794K799j0199l4460k9438l8061
5066g9635n123K0862J4282O888N7123L6605N679n8376j996J8460l9854j7391k5134
5053f7610L1017L2637n0964J3692N099J7645K4423P742J916J6828n5383N098P942
$$ plain form
5143 -20327 -15216 -13669 15260 38334 64275 60281 60242 64587 42006 -1047 -15303 -25375 -64690
5130 -64690 -67099 3344 3809 6433 -9117 -37448 -13905 -5630 -36684 -50693 -62884 -55120 -39963
5117 -39963 -22101 1214 38334 52071 56760 -4763 -36380 -35876 10034 71504 48514 47359 63229
5104 63229 49781 44454 23812 34755 3323 -44555 -81562 -81719 -75106 -77684 -63832 4959 26699
5091 26699 8778 -27559 -41419 -31580 -8744 -21031 -38299 -68559 -72493 -44224 -57579 -18233
5079 -18233 63364 59734 21887 -5544 -2618 3558 47518 29724 32523 22324 -12136 -41574 -79635
5066 -79635 -84758 -63896 -49614 -42726 14397 51002 56681 -1695 -3691 14769 -25085 -42476 -67610
5053 -67610 -36593 -3956 -54920 -41228 -36129 -18484 5939 13681 15597 32425 -22958 -17860 -9918
5040i918l2439j4271O105M0155N9305K9671r007p1667m4505l316P386L352M205
5027c4944m4712k1442K1153O5201L3030n5908j9832N51j3594L6501L9751l2448
5015b6693L1849K1408r020m0504k0365N0343N4387k0115l9059O7309o478l7363
5003B5699k207N992k4456n1948L30K9736L7632j7029K4176q385o1781m3658J8045
4990f7854K7656l1862m738n345N807L6970O3373k5614j6803k4310l5564J3754
4978f4530o1020m1926O5046N2279M133R139o657q4364M3561R758j9667K9231P2619
4965G602Q735k6574J760L7021n8896l0868K9638K9172J8136L458L872L616l6496
4952i824l7931K719M0828L7649j016k376J353n9544l8130M5799l4655p4389L8618
$$ plain form
5040 -9918 -42357 -56628 -50523 -10368 48937 78608 69601 -2066 -46571 -49887 -42501 -39149 -34944
5027 -34944 -79656 -101098 -79945 -14744 18286 -37622 -57454 -56903 -70497 -33996 5755 -26693
5015 -26693 5156 26564 17544 -22960 -43325 7018 61405 41290 2231 69540 63062 25699
5003 25699 23492 29484 5028 -46920 -46590 -16854 20778 3749 27925 19540 -42241 -85899 -67854
4990 -67854 -40198 -72060 -76798 -82143 -76336 -39366 24007 -1607 -18410 -42720 -78284 -64530
4978 -64530 -125550 -167476 -102430 -50151 -46018 -36879 -43536 -127900 -84339 -74581 -94248 -65017 7602
4965 7602 16337 -10237 -8477 28544 -30352 -61220 -31582 -2410 15726 19184 23056 26672 -9824
4952 -9824 -47755 -45036 -4208 33441 32425 30049 31402 -28142 -66272 -20473 -55128 -129517 -90899
4939i0899Q896J8877J8635N510k7013j793L7765n266l9720P106R264l7166P889
4926h7915L2345J446J4455K4116k0861q441j815K3244N9735k7714k8188j3615
4914c3208J7497m202o309k4193m3474k5027N736K5826K65M560N6104M1566q603
4901F538l6291j1634L176L0754l5533k3849K0966K185k5609N307L4612m2806m650
4888g6834L4752O6744J6781r9200K4150K9415M34L794L9720l1384k0130n937j5239
4875c2934l8227J9758k052J3378n066k4591M049J6243M253J9085k5341j8289K5421
4862d4313L0325k4225q413j6720K0270J4488l1694L606L2325M0862J4094m730
4850B5875Q714n9290O728k2461O044j4575n5296K9585q609M2675J9514o993n247
$$ plain form
4939 -90899 -82003 -63126 -44491 -38981 -65994 -67787 -30022 -35288 -75008 -67902 -58638 -95804 -87915
4926 -87915 -55570 -54124 -39669 -15553 -36414 -44855 -46670 -23426 36309 8595 -19593 -33208
4914 -33208 -15711 -19913 -26222 -50415 -93889 -118916 -113180 -87354 -87089 -82529 -26425 15141 6538
4901 6538 -29753 -41387 -38211 -7457 -42990 -66839 -45873 -43688 -69297 -63990 -29378 -72184 -76834
4888 -76834 -42082 24662 41443 -57757 -33607 -4192 -3758 36 39756 8372 -11758 -17695 -32934
4875 -32934 -71161 -51403 -53455 -40077 -45143 -69734 -65685 -49442 -45189 -26104 -51445 -69734 -44313
4862 -44313 -13988 -38213 -46626 -63346 -43076 -28588 -60282 -56676 -24351 16511 30605 25875
4850 25875 34589 -24701 -17973 -40434 -34390 -48965 -104261 -74676 -83285 -40610 -21096 -28089 -33336
4837c3336K7910J0948Q82o18k3512M467j4842K1914n984K9349M7341K2106o850
4824G9775l3787m6159k5681M078l6936m2898J4325j4242N8697L0680N9289K744
4812D9885k7022l9946L258K5960K3263m2353k1220J7211L3933j7637L1920l081
4800C4171m4277k5817l2838K4896O530R84P392j8032j8406N3235O0166l0465q1777
4787f4238j9433J9625K1750n1971J1779N4430J3861j8633J0530J7318l7972k6031
4775f8985o442L1229J605j5108l0896L0361R714j9356q343Q30R928K3372j9294
4762f1385J9025L0067k6572M5644J2774j6045k8404L001K392K6684R433L0776
4750D7390L2688l4009k7717J5533P039j348l0823P908l2914L0176k5821k6224
$$ plain form
4837 -33336 -5426 5522 6404 5786 -17726 -13259 -28101 -6187 -12171 17178 64519 86625 79775
4824 79775 45988 -171 -25852 -21774 -58710 -101608 -87283 -101525 -42828 -12148 47141 49885
4812 49885 22863 -17083 -13825 12135 35398 -6955 -28175 -10964 22969 5332 37252 34171
4800 34171 -10106 -35923 -68761 -43865 -37335 -36351 -28959 -46991 -65397 -12162 48004 17539 -64238
4787 -64238 -83671 -64046 -42296 -94267 -82488 -28058 -14197 -32830 -22300 -4982 -42954 -68985
4775 -68985 -75427 -44198 -42593 -57701 -88597 -58236 -48522 -67878 -76221 -75391 -65463 -42091 -61385
4762 -61385 -42360 -12293 -38865 6779 19553 3508 -24896 -21895 -19503 7181 16614 47390
4750 47390 80078 46069 18352 33885 40924 39576 8753 16661 -16253 13923 -11898 -38122
4738c8122k282K6703J3203J3429K9075J2409m107k9455m3234n3802Q771J0697
4726e6715l0948K2816N2320k3445j2745M112j7884j4890R399J8067J8216q519
4714d0216N606N2747J4118k3015L9191l4451j3220J9160L7852K3985o1548o0109
4702c9900K883L8696J4555L2336J9138k6939j3608l7123n9555q649k2669k717
4690a03552l0980M753J3793n565L2614N9514l469K8494j6828J5728p06J1110L6561
4677D1467K2985N34l7535n9197l423J5031n159n1318k585k4095J2117J8647L1372
4664d1159J4324L0823l6917m949L1629k2249l8481L184k370K2819M6611j9044
4652a5779q986M386J8832M5494r205k5982J8202r447J9181j9700k9371L0241R281
$$ plain form
4738 -38122 -40404 -13701 -498 12931 42006 54415 50308 20853 -22381 -76183 -67412 -56715
4726 -56715 -87663 -64847 -12527 -35972 -48717 -44605 -62489 -77379 -67980 -49913 -31697 -40216
4714 -40216 -34610 18137 32255 9240 48431 13980 760 19920 57772 81757 20209 -39900
4702 -39900 -37017 1679 16234 48570 67708 40769 27161 -9962 -69517 -78166 -100835 -103552
4690 -103552 -134532 -129779 -115986 -121551 -88937 -29423 -32892 -4398 -21226 -5498 -6204 4906 41467
4677 41467 64452 64986 27451 -31746 -35169 -20138 -25297 -76615 -79200 -103295 -91178 -72531 -41159
4664 -41159 -26835 3988 -32929 -37878 -6249 -28498 -66979 -63795 -66165 -43346 3265 -15779
4652 -15779 -24765 -20379 -1547 43947 34742 8760 26962 17515 36696 16996 -12375 17866 27147
4639B7147j9133l6139J2679k3139k0842L3927K563N4432L8290q6335l0868J375
4627d6043P874r653J479L35j3123J1019J9970K4109P844m8166K0097J2929r515
4614b0844O260J6976k4445J8816m950j4397K127j833J6686j3276L407l8374n639
4601e9486N6692N3308K0631l4926o174j5229m7924j5834J3888N1740R485o118
4589B0053l6465m3333q210l0799L6266Q9489J223l9437L0342j3598j5477M1467
4577C1521l011j7435P77j1302K1497m3134m5634K9175k678l338l5339m193M4999
4564c8095L0903L662K5877O982k3041K0879L1152J2009J8208n6366n8116j512
4552b7458k7633m0630M845m050j176O5003O1185n301k7376o781j1365L2209N165
$$ plain form
4639 27147 8014 -28125 -15446 -38585 -59427 -25500 -22937 31495 69785 -16550 -47418 -46043
4627 -46043 -38169 -47822 -46343 -46008 -59131 -48112 -28142 -4033 3811 -44355 -24258 -11329 -20844
4614 -20844 -14584 2392 -22053 -3237 -8187 -22584 -20457 -22290 -5604 -18880 -15473 -53847 -59486
4601 -59486 -2794 50514 71145 36219 30045 14816 -33108 -48942 -35054 16686 26171 20053
4589 20053 -16412 -59745 -67955 -98754 -62488 27001 28224 -11213 19129 5531 -9946 31521
4577 31521 28510 11075 11852 550 22047 -21087 -66721 -37546 -40224 -43562 -78901 -83094 -38095
4564 -38095 -7192 -3530 22347 29329 6288 27167 58319 70328 88536 32170 -25946 -27458
4552 -27458 -55091 -95721 -90876 -94926 -96102 -31099 30086 24785 -2591 -9372 -20737 11472 16637
4539A6637m6502k0552j3428J4160J6812k9429l4348L1260L0685J5059l491K5745
4527B608j8655J8665L100k6138q567j26K8935M7588k1977k8843j4834l448m126
4514b5818K7099J2985j9239M788N878k4535m6552r249M1193J270j87m6860N475
4501g3752L3052J5109K1639k9953M360J8974k7497j8951J3933K5259K076J2589
4489c162L558J0432M913n0792o262M3876J2171j0403m0612o975j6262q828J6856
4476e1490J3539r810M3309R375m0222M0220N1848J2839n8755m0868J2496K1360
4464C841j3187J1937k2661Q640K1586l46o9920l5606K5163J7261J3963m635M436
4451c9528k0585O172m291k0978N738L2164m85N539P619J7802K9974j5503j1903
$$ plain form
4539 16637 -29865 -50417 -63845 -49685 -32873 -62302 -96650 -65390 -34705 -19646 -23137 2608
4527 2608 -16047 2618 5718 -20420 -28987 -29113 -178 47410 25433 -3410 -18244 -21692 -25818
4514 -25818 1281 14266 -4973 -185 5693 -18842 -65394 -74643 -33450 -32180 -32367 -79227 -73752
4501 -73752 -40700 -25591 -3952 -33905 -29545 -10571 -38068 -57019 -43086 -17827 -15751 -3162
4489 -3162 396 10828 15741 -35051 -41313 2563 14734 4331 -36281 -43256 -59518 -68346 -51490
4476 -51490 -37951 -47761 -4452 4923 -35299 4921 56769 69608 10853 -30015 -17519 3841
4464 3841 -9346 2591 -20070 -11430 10156 9810 -60110 -95716 -70553 -53292 -39329 -43964 -39528
4451 -39528 -60113 -53941 -58232 -79210 -73472 -41308 -41793 -36254 -28635 -10833 19141 3638 -8265
4438h265k1522r820J7878l1547k6789M1954O0749L173q460k3849j3003N416J8206
4425D121K4004K1351O282J46o6151j7212o583l7557k2546K8924l580K5101K6674
4412a7026k2904P159K3690l0955m2732k5199N9459M5084k6640m5731M947K9917
4400d0931L11L693Q896j0136J0551l8839r901k6684J8270J2050N1218J3752j3141
4387b0891l2116q313k7795P908L7797M2773M7340K143l790j1652j6491k9007M3203
4374C1109J4645j4365J0537K9534j5755l9574n6568o6712k4168L8627O1833j2266
4362d3123R246l7537J6744L3340J3139j8229m4439K2636m0664q366L6706J5001
4350d5546N3689m487m1355J187N9005j9632l8362r723j5728j0162J2266J6312
$$ plain form
4438 -8265 -29787 -39607 -21729 -53276 -80065 -38111 22638 25811 17351 -6498 -19501 -14085 4121
4425 4121 28125 49476 55758 55904 -10247 -27459 -34042 -71599 -94145 -65221 -68801 -43700 -17026
4412 -17026 -39930 -32771 -9081 -40036 -82768 -107967 -48508 -3424 -30064 -75795 -70848 -40931
4400 -40931 -40620 -36927 -28031 -38167 -27616 -66455 -76356 -103040 -84770 -72720 -21502 -7750 -20891
4387 -20891 -53007 -61320 -89115 -81207 -43410 -637 46703 48846 45056 33404 16913 -12094 31109
4374 31109 45754 31389 41926 71460 55705 16131 -40437 -107149 -131317 -92690 -30857 -43123
4362 -43123 -33877 -71414 -54670 -21330 -8191 -26420 -70859 -48223 -88887 -97253 -60547 -45546
4350 -45546 8143 3656 -37699 -36512 22493 2861 -35501 -45224 -60952 -71114 -58848 -42536
4338d2536K5199j5674l157L9919k884l0659j6505k4043r016M6239K4289j6530
4326b5358j2196J1056L1982o779J2682J1909k8957k8345k296L818N839l1039k0801
4313g8485O835P6399j2825l3729J8184j3449N233N6660L9042k260N386o3198n7144
4300e3351o0049L3920L9459r40K0866q205o895m688j464Q527m1240k2906K7090
4287f9876K423k7832K8614L8079M2473j5510m7680j214L5024J3566l4172j8605
4275e4710M0994K4592k2115k1813j8494j7080L985M1572M2272k016m2524p648
4263c2985O9675N1189p919m2539m4779J4489j8972J8051N7656R139j6321o8814
4251a2130n1596K8022J3318K5420m003j5152l0951j9603R656O3206O870q307q4122
$$ plain form
4338 -42536 -17337 -33011 -36168 3751 867 -29792 -46297 -70340 -79356 -33117 -8828 -25358
4326 -25358 -37554 -26498 5484 -1295 11387 23296 -5661 -34006 -36302 -32484 -26645 -57684 -78485
4313 -78485 -71650 4749 -8076 -41805 -23621 -37070 -31837 24823 63865 61605 66991 3793 -53351
4300 -53351 -113400 -79480 -40021 -40961 -20095 -28300 -35195 -39883 -41347 -32820 -74060 -96966 -69876
4287 -69876 -67453 -95285 -66671 -28592 13881 -1629 -49309 -50523 -15499 -1933 -36105 -54710
4275 -54710 -13716 10876 -11239 -33052 -51546 -68626 -64641 -23069 19203 17187 -25337 -32985
4263 -32985 36690 87879 79960 37421 -7358 7131 -11841 6210 63866 73005 56684 -12130
4251 -12130 -63726 -35704 -22386 3034 -969 -16121 -47072 -66675 -57019 6187 13057 4750 -79372
4238g9372l0077M3742Q85K1992K5176j4140j020J5640j552J3625l0700l3690Q006
4225f1485L4027m0783p253L9352L1395O0771J4931p6047k9601M594L4918j4375
4213i556k3310k0937k2427J3481K7164M1192O8971l5650k723O2159j0376k7151
4201F0837l1523k1564Q00M762j020K153K3399j0310L252J3773K6440k2976m0870
4188G153Q138j0106p932K4762l3606m6608M22j0729k1375K5865k0444m7361K1578
4175a10243O5312N1536L2557L483n1645j1559K3934p0227P763K0057Q301k3059
4163e3790L1828M9703K0434m8903k5124Q460l4292m2375K3372K1403L6447K1919
4151I082J4904j2795O413P256j6538l3546j0338l0207l499J7154L4590K2975l7550
$$ plain form
4238 -79372 -109449 -65707 -64822 -42830 -17654 -31794 -32814 -17174 -18726 -5101 -35801 -69491 -61485
4225 -61485 -27458 -68241 -75494 -36142 -4747 56024 70955 -5092 -34693 -30099 4819 -9556
4213 -9556 -32866 -53803 -76230 -62749 -35585 5607 74578 38928 36205 98364 87988 60837
4201 60837 29314 7750 8550 13312 12292 14445 37844 27534 30786 44559 70999 48023 7153
4188 7153 15291 5185 -2747 22015 -11591 -58199 -57777 -68506 -89881 -64016 -84460 -131821 -110243
4175 -110243 -44931 6605 39162 42645 -9000 -20559 3375 -66852 -59089 -39032 -30731 -53790
4163 -53790 -21962 27741 48175 -728 -25852 -17392 -51684 -94059 -70687 -49284 -12837 9082
4151 9082 23986 11191 17604 24860 8322 -25224 -35562 -65769 -69268 -52114 -17524 5451 -32099
4138c2099K9740K9492o1330J0493J4477j2423O190L668m2875K0772J4303j362
4126b0954K1075K2157k4361M1960k6718j3377K6937k1571n9394l0411M3108R0837
4114D9288j7006m1979j9665J3522q945l9412n0182p350M2758J2880K7987M672
4102c3432J8790j1578l1254J5822N5133k9376j1292Q847l161j7855j8340L4543
4090b3153j3760k9939N4603J6023j407J9238p140l2841N097O453P495j3912K0435
4077G192K5282J2306k0138J5681O949K398l2996l4072m5389L1858P2945k905j5086
4064B4025K9673J278l6030M284J6294j1845m448l7534k2481J0554j0915n2652
4052h9797k827L1111M4001K4047l8854m4545k6019N9439O3157j0146k2001l529
$$ plain form
4138 -32099 -2359 27133 -34197 -23704 -9227 -21650 -15460 -11792 -54667 -33895 -19592 -20954
4126 -20954 121 22278 -2083 39877 13159 -218 26719 5148 -54246 -84657 -41549 49288
4114 49288 32282 -9697 -29362 -15840 -24785 -64197 -114379 -121729 -78971 -66091 -38104 -33432
4102 -33432 -14642 -26220 -57474 -41652 13481 -15895 -27187 -18340 -21501 -39356 -57696 -23153
4090 -23153 -36913 -66852 -12249 3774 2367 21605 14465 -18376 -13279 -6826 669 -13243 7192
4077 7192 32474 44780 24642 40323 47272 49670 16674 -17398 -62787 -30929 42016 39111 24025
4064 24025 53698 54976 18946 23230 39524 27679 23231 -14303 -36784 -26230 -37145 -89797
4052 -89797 -92624 -61513 -17512 6535 -32319 -76864 -102883 -43444 19713 9567 -12434 -15963
4040a5963J7117k5211j6417L1776l700k2791L2305J4829M0873l6247K2065R44
4028C9580k363l6170r173J837K484K8661n72L3503J2322m4527j0530K5175J7177
4015E7404m8421l2894k857l4701o014O540J2022N0337J8909k9731j3654M704k8002
4002d6358l1009K2165L9118M3812K0675l4164K9230o7015k6546k322J4282M18
3990c7714N2056k456j1938q6140J212O2056L4688O58j1528K076n450K1548k4873
3977e805k863L4791M3968j0193l5001o431q555n150j0428k5725J6297j6804l867
3964c5766J468L498j64k7031J4965J1780r555K0411k3915L5449K8160J6820M0073
3951G6193J9196m594k2996k1808o2288O039J5907M805k7724q478j6459j3850J5957
$$ plain form
4040 -15963 1154 -24057 -40474 -8698 -12398 -35189 -2884 11945 52818 16571 38636 39580
4028 39580 37217 1047 -8126 -6289 -3805 24856 24284 57787 70109 25582 15052 40227 57404
4015 57404 8983 -23911 -26768 -61469 -67483 -60943 -48921 1416 20325 -9406 -23060 -18356 -46358
4002 -46358 -77367 -55202 -16084 27728 48403 14239 43469 -23546 -50092 -52414 -38132 -37714
3990 -37714 14342 11886 -52 -86192 -84980 -22924 11764 12422 894 2970 -2480 19068 -5805
3977 -5805 -8668 26123 70091 59898 24897 18466 9911 4761 -5667 -31392 -15095 -31899 -35766
3964 -35766 -34298 -30800 -30964 -57995 -43030 -31250 -40805 -20394 -44309 -8860 19300 36120 76193
3951 76193 95389 90795 67799 45991 -16297 -10258 5649 10454 -17270 -25748 -42207 -56057 -40100
3938d0100J4055Q487N585n6725R465K1111K5374J3363L6978L421N632k4750k8879
3925f983k8818j9006K4760k6741k4357P033L9052K1400p88l9263m013j1634J0870
3912e8488Q3402K3101o771k0048K3801M2853o0651j3869j9671m5128o918o683
3900f5070J2619K6052L7826M3589J5583r427j8690m4874o624m442o061K4466L2821
3887C7768k6929o8638m8789N9184K0199K0935k5853j7246j3374R658K9334p385
3875c1136n629O8156l96j3754P678q912k0615n4454k0588m4892k7584M5284M8647
3862e8195M2151l073L1531L1889n87n4501L8497N1756j1972l0790l7974J1893
3850A0625J9376M590l1970m938k9352K04K41J7785J614m9100J9595R550k49J2624
$$ plain form
3938 -40100 -26045 -17558 -11973 -68698 -59233 -38122 -12748 615 37593 41014 46646 21896 -6983
3925 -6983 -35801 -54807 -30047 -56788 -81145 -74112 -35060 -13660 -14448 -53711 -57724 -69358 -58488
3912 -58488 24914 48015 41244 21196 44997 87850 27199 13330 -6341 -51469 -58387 -65070
3900 -65070 -52451 -26399 11427 55016 70599 61172 42482 -2392 -9016 -13458 -19519 4947 37768
3887 37768 10839 -57799 -106588 -47404 -27205 -6270 -32123 -49369 -62743 -53085 -23751 -31136
3875 -31136 -36765 31391 30995 17241 24919 16007 -4608 -59062 -79650 -124542 -152126 -106842 -58195
3862 -58195 -16044 -19117 12414 44303 43716 -10785 27712 79468 67496 36706 -1268 10625
3850 10625 30001 34591 2621 -2317 -31669 -31465 -31224 -13439 -11825 -60925 -41330 -31780 -32029 -19405
3836a9405J9987l7121r103M2035n168j8933N513J4675J0566J479m2964O415j3656
3823d5680K2794k1254r151l4136j9762l100K4600L5386M4842K3095K8280n6411
3811a0497j6857j2898j8905K9338L3975l2081k1849j8251q111j0707N4699M252
3799b7892n4194J0656K4645M2716K3602j2797k3278l0359L1422L2115J1200q6374
3787e8538k5218K5127N5414k641l1948o661J1406j7861O10r375M2084J8190l9495
3774c8906l2937n5044j2505M8667N8947N894k9483K210M4312L5927q166o5005
3762d6089l0299L0309o558P794R71K4494j963l0313k9795K1166L1939M467K1101
3749b776l677m455l4131q732P2311j0101l266m132Q903J5355k2783K754j7073
$$ plain form
3836 -19405 582 -36539 -45642 -3607 -8775 -27708 -22195 -7520 3046 4525 -38439 -32024 -45680
3823 -45680 -22886 -44140 -53291 -87427 -107189 -110289 -85689 -50303 -5461 17634 45914 -10497
3811 -10497 -27354 -40252 -59157 -29819 4156 -27925 -49774 -68025 -76136 -86843 -32144 -27892
3799 -27892 -82086 -71430 -46785 -4069 19533 6736 -16542 -46901 -15479 16636 27836 -58538
3787 -58538 -83756 -58629 -3215 -5856 -37804 -44465 -33059 -50920 -50310 -59685 -17601 589 -38906
3774 -38906 -71843 -126887 -139392 -90725 -31778 -25884 -55367 -53157 -8845 27082 18916 -46089
3762 -46089 -76388 -46079 -52637 -44843 -43872 -19378 -21341 -51654 -81449 -60283 -28344 -23877 -2776
3749 -2776 -6453 -10908 -45039 -53771 18540 8439 5173 1041 9944 25299 2516 5270 -11803
3736a1803L8692L2576l3081j6897M0627k1815o1586o5868m288K527M9113M2823
3724h980J1783L2877l5375l6576j8611K7030N835j5017K4280M991J6771j6170
3712g162J3435N3809R614J370m4361p4089j6232j8961j0105m92M9110K0548l10
3699b3826j8658k6907P307L640J9114J645j3580O08M762K3643j376j3154q271
3686d5053J9292J5626K0217k9219l6782L3309P3615p954l4168m6869o1166K054
3674i7098M3104l762M771l5238L5896L9128m119M929l5527j5422l2767J6547J5199
3661f4359k7188L3922L7932L008n445l3751J9997N3702L0167p697o55J405j5084
3648B5954J5594j4144j8376L902j6802k8037n835J3183J6522k2210J3691J5168
$$ plain form
3736 -11803 26889 59465 26384 9487 50114 28299 -33287 -99155 -103443 -100916 -51803 -8980
3724 -8980 2803 35680 305 -36271 -54882 -27852 -22017 -37034 -12754 -7763 9008 -7162
3712 -7162 6273 60082 69696 71066 26705 -47384 -63616 -82577 -92682 -93174 -44064 -23516 -23826
3699 -23826 -42484 -69391 -62084 -58444 -39330 -37685 -51265 -50657 -45895 -22252 -23628 -36782 -45053
3686 -45053 -25761 -10135 10082 -19137 -55919 -22610 51005 43051 8883 -37986 -99152 -97098
3674 -97098 -53994 -57756 -52985 -88223 -52327 -13199 -17318 -12389 -47916 -63338 -96105 -79558 -64359
3661 -64359 -91547 -57625 -19693 -16685 -22130 -55881 -35884 17818 47985 40288 39633 41038 25954
3648 25954 41548 27404 9028 12930 -3872 -31909 -37744 -24561 -8039 -30249 -16558 -1390
3636a390j6744J1563R735k1827K5056J1365L2819m0736q105k5783k874J2325j0870
3623b5466L8915k7229j0503m922r046J4654K2400M819p907m3270M1870L533J5615
3610A3463M870l8046m595l5167k9748L71L5769P82j2387L8881J6041P69l7486
3597d6483Q597K5301O0548K5467l6725j7881O978K0613J9209k3525J774l4134
3585I739K3097L0236l931K864j5315k6692m4882m1520k8469j487M2400K3933M1293
3572A1266p133o0888J9885K2641K5290J6963l5128l2313N531J8954q711l5111
3560e8754M680Q363J6218K7076l3470m478K7135P326k2746J4206K2607L5601k4455
3547A9309r834R897l055k1853K501J0280J7117q021L9467L875l980r601l7613
$$ plain form
3636 -1390 -18134 -6571 3164 -18663 6393 17758 50577 9841 1736 -24047 -26921 -14596 -25466
3623 -25466 13449 -13780 -24283 -29205 -38251 -23597 -1197 3622 -4285 -47555 -5685 -2152 13463
3610 13463 18333 -19713 -24308 -59475 -89223 -88852 -53083 -52301 -64688 -25807 -9766 -8997 -46483
3597 -46483 -37886 -12585 47963 73430 36705 18824 25802 46415 65624 42099 43873 9739
3585 9739 32836 63072 59141 62005 46690 19998 -24884 -66404 -94873 -96360 -53960 -30027 11266
3572 11266 4133 -56755 -36870 -14229 11061 28024 -7104 -39417 -33886 -14932 -23643 -58754
3560 -58754 -54074 -45711 -29493 -2417 -35887 -40365 -13230 -5904 -28650 -14444 8163 43764 19309
3547 19309 9475 19372 16317 -5536 -3035 7245 24362 16341 55808 59683 55703 46102 8489
3534H489n4037j5302j839l2609K0471L4177K9085k4472J3654L9690L3282l0469
3522B0120J2533J8900l579j7314j9580p886j3735n106J486n0684o6537j3970M6238
3509i9114M0332N6001J9911Q713j1299Q775J1608n284j6349p819L7723J7514R111
3496F9823o6054J4515k7927l7024o983j796L6668N211K6694Q03j3837j9930O535
3483a3302k400L6288J4468J6881L8061J0272k3512k9861j3861j2653q598k9448
3471a7665m56K3623J0700j9354K1767q277o6620n757N9816K6209Q208k2687l4881
3458b5374l6627k2117m020p386Q4367M3919m5802o040L5694L5530K6523m3233
3446C5434j1967K0367J5106j7366j765O024k3516m7661j8307n696k6K7549m924
$$ plain form
3534 8489 -45548 -60850 -62689 -95298 -74827 -40650 -11565 -36037 -22383 17307 50589 20120
3522 20120 32653 51553 47974 30660 11080 3194 -10541 -15647 -14161 -64845 -131382 -145352 -99114
3509 -99114 -58782 -2781 17130 25843 14544 23319 34927 29643 13294 5475 43198 60712 69823
3496 69823 3769 18284 -9643 -46667 -53650 -55446 -18778 -13567 13127 13930 93 -19837 -13302
3483 -13302 -15702 20586 35054 51935 89996 100268 76756 46895 33034 20381 11783 -17665
3471 -17665 -18121 5502 16202 -3152 18615 10338 -56282 -62039 -2223 23986 32194 9507 -25374
3458 -25374 -62001 -84118 -88138 -95524 -11157 32762 -13040 -19080 16614 52144 78667 35434
3446 35434 23467 43834 58940 41574 39809 45833 22317 -25344 -43651 -49347 -49373 -21824 -26748
3433b6748j343j8167j1173k2610J6697O2772K9062M295j2282j9561j7727j9565
3421c6350L9141K1116K1623J1123j0260n4543p054M5693M1163l7823n1709m5321
3409f3201K4141L3592O633J4686n0469m1990p201K2959M6847O8930K5390n4170
3397B6147n5154J8306Q1930J1738j4998l679k7970k4683p0937l8181K0641K4804
3385e2036J6818K3233M706M838O58J7934J2772r798K4368M4323j7980m4089k1498
3372D249J4478l144k0136J8877J0097j6809l3800J9180K2457j2237k4588m2878
3360f4254j2043k977M3223j4163K9437L4586R664O713o3524o9230j5368N6229
3348f1707M4811k7902LP463J5228m4159J5323L4612M866j7168l4790l9855N1357
$$ plain form
3433 -26748 -28091 -46258 -57431 -80041 -63344 -572 28490 32785 20503 942 -16785 -36350
3421 -36350 2791 23907 45530 56653 46393 -8150 -15204 30489 71652 33829 -17880 -63201
3409 -63201 -39060 -5468 1165 15851 -34618 -76608 -83809 -60850 -14003 54927 80317 26147
3397 26147 -29007 -10701 71229 82967 67969 64290 36320 11637 -59300 -97481 -76840 -52036
3385 -52036 -35218 -11985 -7279 -2441 -1783 16151 28923 19125 43493 87816 69836 25747 4249
3372 4249 18727 15583 -4553 14324 24421 7612 -26188 -7008 15449 3212 -21376 -64254
3360 -64254 -76297 -79274 -36051 -50214 -20777 13809 23473 30186 -33338 -102568 -117936 -61707
3348 -61707 -16896 -44798 -44795 -37332 -22104 -66263 -50940 -16328 -11462 -28630 -63420 -103275 -51918
3335e1918j9295K5842J8311N2551o12M9785l992m4520k8644j784q723o925L6724
3322A6800J0365k3524k5007J1765P467M4117K9799k1959j02340M602K6099j8657
3310d0473j008L6161P4388M6174n559j5261j1094j7452k7703n2538j5016j2010
3298d1391M141J0506J3946Q446j8258K5983M0266j9104o1975j6370M4301K9440
3286A9931j8605K7788K0826r847m4827J1052l5364j5342K0698P136o747j5395
3274c8696J9365M47m581J8163J3217j2797J9068J2701M2744N1252j6606n8228
3262D6049n5990j2701O7804K184k8298m0051l7526K5765O0116m405k3788l4875
3250c5716k9219L6749P8214J7081m6323j4982m3069k1759m823k8873J9920L7796
$$ plain form
3335 -51918 -71213 -45371 -27060 25491 24879 74664 70672 26152 -2492 -4276 -12999 -19924 16800
3322 16800 27165 3641 -21366 -9601 -2134 41983 71782 49823 -52517 -47915 -21816 -40473
3310 -40473 -41481 -5320 69068 115242 109683 94422 83328 65876 38173 -14365 -29381 -41391
3298 -41391 -37250 -26744 -12798 -4352 -22610 3373 43639 24535 -37440 -53810 -9509 19931
3286 19931 1326 29114 49940 40093 -4734 6318 -29046 -44388 -23690 -16554 -23301 -38696
3274 -38696 -19331 -18884 -23465 -5302 7915 -4882 14186 26887 69631 120883 104277 46049
3262 46049 -9941 -22642 45162 47346 19048 -21003 -58529 -32764 27352 22947 -841 -35716
3250 -35716 -64935 -28186 50028 67109 20786 5804 -37265 -59024 -63847 -92720 -72800 -35004
3238c5004O442p274L4217J5351j9010o141K5097J6483K7710J310j4665M086J0146
3225E8748l5626k9464j1376M523K7300J0726K0243L4393j5308k1545m1485J7781
3213A8910L622N5730L079m5092j1435J7689n2730r971J7429m7r849L188p232k8492
3199d5201k4733L387Q302Q1239K4129J0194K6031p71k2558k9157j2536r318l1997
3186b2989k3592m850j3208J294L8689L393j4486k8180M002K8880M0117K66j14
3173I222j2427o155J7150M476p314l2048p248L250p829P757l484P736N834K9479
3159H399k0717K07m924M3242J1185L018l797K6199k0963l0556j9181K0884M3947
3146E6943m8594m8555k219k952N296o538L5500J4647Q22R198l6107j5276N8683
$$ plain form
3238 -35004 -28562 -35836 -1619 13732 -5278 -11419 13678 30161 57871 59181 44516 48602 58748
3225 58748 23122 -6342 -17718 -13195 14105 24831 45074 79467 64159 42614 1129 18910
3213 18910 22532 78262 81341 36249 24814 42503 -10227 -20198 -2769 -2816 -12665 -9477 -16709 -45201
3199 -45201 -69934 -66547 -58245 22994 47123 57317 83348 82577 60019 30862 18326 9008 -22989
3186 -22989 -46581 -51431 -64639 -63345 -24656 -21263 -35749 -63929 -59927 -31047 9070 9336 9222
3173 9222 -3205 -9360 7790 12266 4952 -27096 -34344 -31094 -38923 -31166 -34650 -26914 -21080 8399
3159 8399 -12318 -12111 -17035 26207 37392 40410 36613 62812 41849 11293 -7888 12996 56943
3146 56943 8349 -40206 -42425 -45377 -40081 -46619 -11119 3528 4350 13548 -22559 -37835 20848
3133B0848J7795R577J0653m3451k6352K7947k8293j2090j1278K6262J1711N775
3121I104j1387J374L2051l9953m5798k9724j7117K0155R326J908Q636M2969K1160
3108B704l6471j2661N6133J3994J6761k5546l2829j8543L121M0505P66m235p2834
3095f9135M580J9684K741j9907j5728M998K6368N5223K6805k0237J1269J844k0689
3082G816m148R609j6194j3138k3793J1176j3644K426j3856k0785J5044M6561J4050
3069A124Q21O227l6886n158O2502L5787j8905J4557k4029l8621K7334j393O085
3056B9445J0358J6561K247K834l0775k0602k5469q969J6308J6199j379r366J418
3043a190L6349k7690k9010J1553M2487J7985j4042m4068P719K58K2043j8494j8511
$$ plain form
3133 20848 38643 48220 58873 15422 -10930 17017 -11276 -23366 -34644 -8382 3329 9104
3121 9104 -2283 -909 31142 -8811 -54609 -84333 -101450 -81295 -71969 -70061 -61425 -18456 2704
3108 2704 -33767 -46428 9705 23699 40460 14914 -17915 -36458 -33337 7168 7934 3699 -69135
3095 -69135 -64555 -44871 -42130 -62037 -77765 -72767 -46399 8824 35629 15392 26661 28505 7816
3082 7816 3668 13277 -2917 -16055 -39848 -28672 -42316 -39890 -53746 -74531 -59487 -12926 1124
3069 1124 1945 8172 -28714 -33872 28630 64417 45512 60069 36040 -2581 24753 23360 29445
3056 29445 39803 56364 58611 61445 30670 10068 -15401 -24370 -8062 8137 6758 -2608 -1190
3043 -1190 35159 7469 -21541 -9988 32499 50484 36442 -7626 93 351 22394 3900 -14611
3030a4611k6922K3109J09683O8065n8002n8190m2061o9371j5755N5907P502M009
$$ plain form
3030 -14611 -41533 -18424 91259 159324 101322 43132 1071 -68300 -84055 -28148 -20646 -16637
$$ [...]
##END NTUPLES=NMR SPECTRUM
##END=
