##TITLE=Analysis number 316813
Compound Code cc 43106
Book Reference 414/160/2
Project Code adrs
Chemist Name mattw
##JCAMPDX= 6.0         $$ Bruker NMR JCAMP-DX V2.0
##DATA TYPE= NMR SPECTRUM
##DATA CLASS= NTUPLES
##ORIGIN= Bruker BioSpin GmbH
##OWNER= nmr
$$ XWIN-NMR		Version 3.5
$$ Fri Jan 27 09:34:49 2006 GMT Standard Time (UT+0h)  MAYBRIDGE\nmr@NMR_250MHZ
##.OBSERVE FREQUENCY= 250.131544655141
##.OBSERVE NUCLEUS= ^1H
##.ACQUISITION MODE= SIMULTANEOUS (DQD)
##.ACQUISITION SCHEME= undefined
##.AVERAGES= 16
##.DIGITISER RES= 18
##SPECTROMETER/DATA SYSTEM= dpx250
##.PULSE SEQUENCE= zg30
##.SOLVENT NAME= CDCl3
##.SHIFT REFERENCE= (INTERNAL, CDCl3, 0, 16.522)
##AUDIT TRAIL= $$ (NUMBER, WHEN, WHO, WHERE, WHAT)
$$ ##TITLE= Audit trail, XWIN-NMR		Version 3.5
$$ ##JCAMPDX= 5.01
$$ ##ORIGIN= Bruker BioSpin GmbH
$$ ##OWNER= nmr
$$ C:\u/data/dgb/nmr/ADRS/15240/pdata/1/auditp.txt
$$ ##AUDIT TRAIL=  $$ (NUMBER, WHEN, WHO, WHERE, WHAT)
(   1,<2006-01-27 09:34:27.46 +000>,<MAYBRIDGE\nmr>,<NMR_250MHZ>,
      <created by zg, POWCHK disabled, PULCHK disabled
       configuration hash MD5:
       62 19 C7 07 E1 42 D1 B7 37 6C 3D D0 77 39 F9 E6
       data hash MD5: 64K
       3D A2 A8 B5 81 64 D9 69 82 6D 04 52 BC 28 3C B6>)
(   2,<2006-01-27 09:34:38.62 +000>,<MAYBRIDGE\nmr>,<NMR_250MHZ>,
      <Start of raw data processing
       ef LB = 0.3 FT_mod = 6 PKNL = 1 SI = 32K 
       data hash MD5: 32K
       CA A2 A1 97 DA 4C 52 A8 61 52 8C F1 26 FD D9 D4>)
(   3,<2006-01-27 09:34:40.46 +000>,<MAYBRIDGE\nmr>,<NMR_250MHZ>,
      <apk 
       data hash MD5: 32K
       EA 5D 27 B5 A7 16 6A 4E B6 77 66 25 83 BE A8 F1>)
(   4,<2006-01-27 09:34:41.29 +000>,<MAYBRIDGE\nmr>,<NMR_250MHZ>,
      <abs ABSG = 5 
       data hash MD5: 32K
       3C DA 29 0F 1F 14 FC 52 12 D8 0C 6E B5 DF 47 17>)
$$ ##END=
$$ 
$$ hash MD5
$$ 89 9C 0F 16 A9 B6 FB E6 74 10 87 4F 54 21 14 0C
##$RELAX= 
##$RELAX= 
##$RELAX= 
##$RELAX= 
##$RELAX= 
##$RELAX= 
##$RELAX= 
$$ Bruker specific parameters
$$ --------------------------
##$DU= <C:\u>
##$EXPNO= 15240
##$NAME= <ADRS>
##$PROCNO= 1
##$TYPE= <nmr>
##$USER= <dgb>
##$AMP= (0..31)
100 100 100 100 100 100 100 100 100 100 100 100 100 100 100 100 100 100 
100 100 100 100 100 100 100 100 100 100 100 100 100 100 
##$AQSEQ= 0
##$AQ_mod= 3
##$AUNM= <au_zg>
##$AUTOPOS= <40 >
##$BF1= 250.13
##$BF2= 250.13
##$BF3= 250.13
##$BF4= 250.13
##$BF5= 500.13
##$BF6= 500.13
##$BF7= 500.13
##$BF8= 500.13
##$BYTORDA= 1
##$CFDGTYP= 0
##$CFRGTYP= 5
##$CHEMSTR= <none>
##$CNST= (0..31)
1 1 145 1 1 1 1 1 1 1 1 1 1 1 1 1 1 1 1 1 1 1 1 1 1 1 1 1 1 1 1 1 
##$CPDPRG= <>
##$CPDPRG1= <>
##$CPDPRG2= <>
##$CPDPRG3= <>
##$CPDPRG4= <mlev>
##$CPDPRG5= <mlev>
##$CPDPRG6= <mlev>
##$CPDPRG7= <mlev>
##$CPDPRG8= <mlev>
##$CPDPRGB= <>
##$CPDPRGT= <>
##$D= (0..31)
0 1 0 0 0 0 0 0 0 0.06 0 0 0 0 0 0 0.0002 0 0 0 0 0 0 0 0 0 0 0 0 0 0 
0 
##$DATE= 1138354465
##$DBL= (0..7)
120 120 120 120 120 120 120 120 
##$DBP= (0..7)
150 150 150 150 150 150 150 150 
##$DBP07= 0
##$DBPNAM0= <>
##$DBPNAM1= <>
$$ [...]
##$SUBNAM7= <"">
##$SUBNAM8= <"">
##$SUBNAM9= <"">
##$SW= 20.6930455092707
##$SWIBOX= (0..15)
0 0 3 0 0 0 0 0 0 0 0 0 0 0 0 0 
##$SW_h= 5175.983436853
##$TD= 65536
##$TD0= 1
##$TE= 294.16
##$TE2= 300
##$TE3= 300
##$TEG= 300
##$TL= (0..7)
0 120 120 120 120 120 120 120 
##$TP= (0..7)
150 150 150 150 150 150 150 150 
##$TP07= 0
##$TPNAME0= <>
##$TPNAME1= <>
##$TPNAME2= <>
##$TPNAME3= <>
##$TPNAME4= <>
##$TPNAME5= <>
##$TPNAME6= <>
##$TPNAME7= <>
##$TPOAL= (0..7)
0.5 0.5 0.5 0.5 0.5 0.5 0.5 0.5 
##$TPOFFS= (0..7)
0 0 0 0 0 0 0 0 
##$TUNHIN= 0
##$TUNHOUT= 0
##$TUNXOUT= 0
##$USERA1= <user>
##$USERA2= <user>
##$USERA3= <user>
##$USERA4= <user>
##$USERA5= <user>
##$V9= 5
##$VALIST= <valist>
##$VCLIST= <CCCCCCCCCCCCCCC>
##$VD= 0
##$VDLIST= <DDDDDDDDDDDDDDD>
##$VPLIST= <PPPPPPPPPPPPPPP>
##$VTLIST= <TTTTTTTTTTTTTTT>
##$WBST= 1024
##$WBSW= 4
##$XGAIN= (0..3)
0 0 0 0 
##$XL= 0
##$YL= 0
##$YMAX_a= 451948
##$YMIN_a= -613311
##$ZGOPTNS= <>
##$ZL1= 120
##$ZL2= 120
##$ZL3= 120
##$ZL4= 120
##$ABSF1= 16.522
##$ABSF2= -4.171173
##$ABSG= 5
##$ABSL= 3
##$ALPHA= 0
##$AQORDER= 0
##$ASSFAC= 0
##$ASSFACI= 0
##$ASSFACX= 0
##$ASSWID= 0
##$AUNMP= <proc_1d>
##$AZFE= 0.1
##$AZFW= 0.1
##$BCFW= 0
##$BC_mod= 0
##$BYTORDP= 0
##$COROFFS= 0
##$CY= 12.5
##$DATMOD= 1
##$DC= 0
##$DFILT= <>
##$DTYPP= 0
##$F1P= 14.0000005364418
##$F2P= -0.99999901652339
##$FCOR= 0.5
##$FTSIZE= 32768
##$FT_mod= 6
##$GAMMA= 0
##$GB= 0
##$INTBC= 1
##$INTSCL= 1
##$ISEN= 128
##$LB= 0.3
##$LEV0= 0
##$LPBIN= 0
##$MAXI= 10000
##$MC2= 0
##$MEAN= 0
##$ME_mod= 0
##$MI= 0
##$NCOEF= 0
##$NC_proc= -4
##$NLEV= 6
##$NOISF1= 0
##$NOISF2= 0
##$NSP= 0
##$NTH_PI= 0
##$NZP= 0
##$OFFSET= 16.522
##$PC= 1
##$PHC0= -111.0153
##$PHC1= 8.177272
##$PH_mod= 1
##$PKNL= yes
##$PPARMOD= 0
##$PSCAL= 4
##$PSIGN= 0
##$REVERSE= no
##$SF= 250.13
##$SI= 32768
##$SIGF1= 0
##$SIGF2= 0
##$SINO= 400
##$SIOLD= 32768
##$SREGLST= <1H.CDCl3>
##$SSB= 0
##$STSI= 32768
##$STSR= 0
##$SW_p= 5175.98343685301
##$SYMM= 0
##$S_DEV= 0
##$TDeff= 65536
##$TDoff= 0
##$TI= <Analysis number 999999
Compound Code 99
Book Reference 9
Project Code 9>
##$TILT= no
##$TM1= 0
##$TM2= 0
##$TOPLEV= 0
##$USERP1= <user>
##$USERP2= <user>
##$USERP3= <user>
##$USERP4= <user>
##$USERP5= <user>
##$WDW= 1
##$XDIM= 32768
##$YMAX_p= 350403799
##$YMIN_p= -309225
$$ End of Bruker specific parameters
$$ ---------------------------------
##NTUPLES= NMR SPECTRUM
##VAR_NAME=  FREQUENCY,     SPECTRUM/REAL,   SPECTRUM/IMAG
##SYMBOL=    X,             R,               I
##VAR_TYPE=  INDEPENDENT,   DEPENDENT,       DEPENDENT
##VAR_FORM=  AFFN,          ASDF,            ASDF
##VAR_DIM=   32768,         32768,           32768
##UNITS=     HZ,            ARBITRARY UNITS, ARBITRARY UNITS
##FACTOR=    0.157963299565203, 1,           1
##FIRST=     4132.6476996994, 0,             0
##LAST=      -1043.33573715361, 0,           0
##MIN=       -1043.33573715361, -309225,     0
##MAX=       4132.6476996994, 350403799,     0
$$ Real data points
##PAGE= N=1
##DATA TABLE= (X++(R..R)), XYDATA
$$ [...]
18141B11554O6706P6636J43387M2538N0104M2345J918n3499m3339J2398Q6361
18130F37109J10215O9335L8577k1850J90855J82970J22973J86429K26085K86595
18120B029293L02549K98591L47536N81301P91151R19846J142102J503132J836269
18111I751770K846625M549176P988013J4724577K8662675N0939569M4736125K361495
18103A66560025l7049142n2299896l0160569j5660023r002147n571132l655211
18096A3161905k492016j865973j427908j003713q27966o62290m50938m68553m60044
18087C502504k44571k18655l01704l02672k57163j47479o0172j43813j78498j04719
18077A543058q3711j71848k28658q6706n7228n6683n9843M6869o3834q014r7107
$$ y = [211554, 278260, 354896, 498283, 540821, 590925, 633270, 635188, 581689, 538350, 550748, 637109, 747324, 816659, 855236, 833386, 1024241, 1207211, 1330184, 1516613, 1742698, 2029293, 2331842, 2630433, 2977969, 3559270, 4350421, 5270267, 6412369, 7915501, 9751770, 12598395, 17147571, 25135584, 39860161, 68522836, 119462405, 164198530, 166560025, 129510883, 77210987, 47050418, 31390395, 22388248, 16817116, 13161905, 10669889, 8803916, 7376008, 6372295, 5544329, 4882039, 4431101, 3962548, 3502504, 3257933, 3039278, 2737574, 2434902, 2177739, 2030260, 1970088, 1826275, 1647777, 1543058, 1459347, 1287499, 1058841, 972135, 914907, 858224, 798381, 845250, 781416, 773402, 676295]
18066F76295K535K6776o0910k6708o1521l5591q1704n0719l3871N174q732p7416
18054B73608k6271k0365n7855O9994L5412o687J6293n349o932O1048R310P206
18042C49412l6359q4706m540l7321q5392k7K5370R2880P853m5699K2315K0216
18030B24002n9675M6936O5806m4737p5971K1628J2624p437l7551L272K4568o7904
18018A05561p2023J9417k6192L1198M8905L3227K9823j01878q2534J4199P9885
18007G9588K2174L6049k3642k1098O2080J0814m1205o4506j5201K1921M6019N0129
17995A63122o2378n4509k3245k3364o204O4M9098k9852N2046K4757m6111q5976
17983d2552J580N8835P4736K670m9940q9201N5256O5230J56576J8872o6858o4180
$$ y = [676295, 678830, 705606, 644696, 617988, 556467, 520876, 439172, 388453, 354582, 359756, 351024, 273608, 247337, 226972, 169117, 239111, 274523, 267836, 284129, 278780, 271848, 332896, 342206, 349412, 313053, 228347, 223807, 186486, 101094, 101067, 126437, 219317, 227170, 181471, 203786, 224002, 164327, 211263, 277069, 232332, 156361, 177989, 190613, 183176, 145625, 148897, 173465, 105561, 33538, 52955, 26763, 57961, 106866, 140093, 169916, 68038, -14496, -297, 79588, 101762, 137811, 114169, 93071, 155151, 165965, 124760, 60254, 45053, 66974, 112993, 163122, 100744, 46235, 22990, -374, -6578, -6514, 42584, 12732, 64778, 89535, 43424, -42552, -40972, 17863, 92599, 95269, 45329, -43872, 11384, 76614, 233190, 252062, 185204, 121024]
17971A21024N8889m3226n3435n1854Q414J6377J8140k8374n4891L7882l0601k7301
17959b8956J6100L7036m6547j3018L9573L9293N1007O3580n3127m3945l8913N9651
17947H1734J03112m8283m8258L3265j5276n0320n684K9857P396q06j5018k1827
17935D9892m9298M7372M1623O4201M7732k6625q2297n0556M0483o0210j9516q1323
17923g8522k3055L7887q2567o1100K8158k8695l7984r009M6368K7710P2307l5622
17911a44124m4441R35R7484J12223O896N8886M4022J5997n8245j02473k433L869
17899a1404j01392Q4610J46708M3603p1638j27149m006K289j8694O6717O0105
17888F9749J4169R8703R3481k8663k5998R801j8514k0359M9485N9092L0193n5363
$$ y = [121024, 179913, 136687, 83252, 31398, 39812, 56189, 74329, 45955, -8936, 28946, -1655, -28956, -12856, 24180, -22367, -35385, 4188, 43481, 94488, 158068, 104941, 60996, 22083, 81734, 184846, 136563, 88305, 121570, 106294, 55974, 50290, 80147, 87543, 86737, 71719, 49892, 594, 47966, 89589, 153790, 201522, 174897, 92600, 42044, 82527, 22317, 2801, -78522, -101577, -63690, -146257, -207357, -179199, -207894, -245878, -254887, -208519, -180809, -108502, -144124, -188565, -187630, -90146, 22077, 28973, 87859, 131881, 147878, 89633, -12840, -15273, -11404, -112796, -28186, 118522, 162125, 90487, -36662, -40668, -38379, -57073, 9644, 69749, 83918, 182621, 276102, 247439, 221441, 231242, 212728, 192369, 241854, 300946, 331139, 275776]
17876B75776o3293q325N9803J9461N7412O2489k2558j25345p6014r0036j01730
17865a2360n9646O0579J58799K6554k06m3055k2855J1804k1053J9175j0898K3560
17853A30398j1970n953m5232n8573K4840K0439o7692n3238k4980m583M9559K8419
17841a8566L4710l9809j3431j0212j4020P5603J0478L8266l3465m2639L7602l0097
17829e580q5265o3540j6861M5389o00P3393J03646n5079j09592r688J8659M3749
17817f1369M6120J6081P3585n2522L322K2167M4347l9629q8627Q6063P1952N6050
17805A77540l3889p1597n5077L1529K9953p2673n8880m8280l0093P3066M3086
17794a5315j4468P473k7456M4066k2287K4378j218P218k6918O2397J9956J02288
$$ y = [275776, 212483, 204158, 263961, 283422, 340834, 403323, 380765, 255420, 179406, 89370, -12360, -72006, -11427, 147372, 173926, 173720, 130665, 107810, 119614, 98561, 117736, 106838, 130398, 118428, 112475, 67243, 8670, 33510, 53949, -13743, -66981, -91961, -96544, -46985, -18566, 16144, -23665, -37096, -47308, -61328, 14275, 24753, 63019, 29554, -13085, 24517, -5580, -90845, -154385, -171246, -125857, -126457, -53064, 50582, -4497, -114089, -123777, -105118, -61369, -15249, 832, 74417, 21895, 25217, 47384, 91731, 52102, -36525, 49538, 121490, 177540, 143651, 72054, 16977, 48506, 78459, 5786, -53094, -101374, -131467, -58401, -15315, -29783, -22310, -49766, -5700, -27987, -3609, -4827, 2391, -24527, 37870, 57826, 160114]
17782A60114p9553n8959j7247j4841M7873j5119K0897j8498p2658n2844L9073
17771f1762J0185j5448N2772N1674o4916k6517L621Q5706L4532K955k8644J4740
17759E8898M7933o444K8549R0882l2449o8760m3957k3669J7614j24376q0275P0444
17747f5610R6277L6534m0035J7619j3041J8373J5527l0130P7592N2079n421q7513
17735G2251n2794M906n5807K5049O2863k1169j8543p044j259m5129q5829M7384
17723g5121P6772L1858k4383q262P1862m3842N4757k0274r2411K3600J2154m5185
17711c8475K6413M7962n7001l3453L8617l8633N960m467M4337L894K1405O845
17699B3404N9093l861k0532j6700o7475o2517p4730Q0283L0449M3603P2527N8396
$$ y = [160114, 80561, 21602, 4355, -10486, 37387, 22268, 43165, 24667, -47991, -100835, -61762, -51577, -67025, -14253, 37421, -27495, -54012, -50391, 35315, 69847, 72802, 44158, 58898, 106831, 100387, 128936, 219818, 187369, 118609, 74652, 50983, 68597, -55779, -136054, -65610, 30667, 67201, 27166, 44785, 31744, 50117, 65644, 35514, 113106, 165185, 159764, 72251, 19457, 24363, -31444, -6395, 56468, 35299, 16756, 9712, 8453, -36676, -122505, -75121, 1651, 33509, 9126, 864, 72726, 28884, 83641, 63367, -29044, -5444, 6710, -38475, -12062, 35900, -21101, -54554, -15937, -54570, -48610, -53077, -8740, -4846, 16559, 23404, 82497, 78636, 58104, 41404, -26071, -88588, -163318, -83035, -52586, -8983, 63544, 121940]
17687A21940n0911j18414P1300Q2282O1496j15083p3998k4788K183N300k3126
17676f1819k5960J8796J42881N9437r7576j23918O2255L5241k0482o3251L1360
17665d3036P8548L986l3626n8829J5403Q2700L7438J214R1040k3515o9014j22559
17653d0250J5241L9298n4733q0075L8341l9974M9530L2946p144L6618M5023n6206
17641b1385L9865R2224R248j4132q4378N203l7409n5558L9849O7283P5504M3145
17629A59459r5488q2764P758j423P502N5364P9553o4387m6289j36452m3332J03659
17617e6840M8357k3722l8465j6713m8765J01719M8052p0111p6051M0065J0517
17606h1957p2163J1866m8370j5725J48649R0200K5436j9084J1192j721k2043r8553
$$ y = [121940, 71029, -47385, 23915, 106197, 167693, 52610, -21388, -46176, -43993, -38693, -61819, -87779, -68983, 73898, 133335, 35759, -88159, -25904, 9337, -11145, -74396, -43036, 35512, 39498, 5872, -52957, -37554, 45146, 82584, 83798, 174838, 151323, 82309, -40250, -25009, 14289, -40444, -120519, -82178, -122152, -72622, -39676, -46820, -10202, 34821, -21385, 18480, 110704, 119952, 105820, 21442, 26645, -10764, -66322, -26473, 40810, 116314, 159459, 63971, -18793, -11035, -12458, -4956, 50408, 129961, 65574, 19285, -117167, -160499, -56840, -8483, -32205, -70670, -87383, -136148, -34429, 13623, -56488, -132539, -92474, -81957, -154120, -142254, -190624, -206349, -57700, 32500, 57936, 38852, 50044, 48323, 26280, -72273]
17594g2273K430M6296K7409j6689J8623j9523M0758k3744P5992O2688J5781l9235
17582A18513k9998M196k0881j18406J311M1626q6138p2303l3082J71330K15366
17571A91534M0829k9932p9601j03670o6111J0770M5210N3904j4529R765M4473
17560A02642j0583o6185l7535n7562m4425Q5263k1667q491j8379J7387M7865L1776
17548B0106L4243L3284r035j7446m6357N250J23002m4425o3918k6000J5634r3137
17536f8799l3519o948k148M781M438P1897j837j6225J1003J05785M6109n3150
17524F1387n530p6065p0722Q2448o6617l9286o7546m686R1024o365l2096J11386
17512b2668J1009l590M6539J2861l5958n7580L5735P1083j9570K3470k6847n4064
$$ y = [-72273, -69843, -23547, 3862, -12827, 5796, -13727, 27031, 3287, 79279, 141967, 157748, 118513, 88515, 92711, 71830, -46576, -45265, -3639, -89777, -162080, -195162, -23832, 191534, 232363, 202431, 122830, 19160, -46951, -36181, 9029, 62933, 48404, 58169, 102642, 92059, 25874, -11661, -69223, -113648, -28385, -50052, -58543, -76922, -59535, -11670, 20106, 54349, 87633, 78598, 61152, 14795, 20045, 143047, 98622, 34704, 8704, 24338, -68799, -102318, -109266, -111414, -106633, -102195, -30298, -32135, -48360, -37357, 68428, 114537, 61387, 55857, -20208, -90930, -8482, -75099, -114385, -181931, -186617, -95593, -101958, -134054, -22668, -11659, -15249, 31290, 44151, 8193, -49387, -13652, 57431, 37861, 61331, 34484, -19580]
17500a9580o4533n0410n7833m2222M526J6347j7939M1598Q6445R0100o1766l9494
17488a14761L4041J6308P1514n7825m5112M8647J6885J7529J2485q684M377m1954
17476d6550l4883P76N588j1430j9161l0616J18722O0419M9797K1192k349m7101
17464F4404o2713m8918J1064J5293q88N3756K4371J726Q085K0742j00664m327
17452a8069P8654l2024j6470K1084n0381n0448M5922O8686Q8460L1809L281P6033
17440B46537J95574L41799M5879j67650k42420k49939k17663m667N4535j1950
17430i965q0031L115q035J94r660P2897J1366r479L3202N895N7110o9741l3594
17417c6726J7161K8512P6786n3828k4528n4835j3514L2022K6101p9607p3031o895
$$ y = [-19580, -84113, -134523, -192356, -234578, -230052, -213705, -231644, -190046, -103601, -13501, -75267, -114761, -80720, -64412, 7102, -50723, -95835, -47188, -30303, -12774, -289, -8973, -4596, -46550, -81433, -80657, -75069, -86499, -105660, -136276, -17554, 42865, 92662, 113854, 111505, 64404, 1691, -47227, -36163, -20870, -21758, 31998, 56369, 58095, 66180, 86922, -13742, -18069, 60585, 28561, 12091, 33175, -17206, -67654, -21732, 46954, 135414, 167223, 170504, 246537, 442111, 783910, 829789, 662139, 419719, 169780, -47883, -52550, 1985, -9965, -89996, -86881, -94916, -94722, -104382, -31485, -20119, -29598, 3604, 9499, 66609, -3132, -36726, -19565, 8947, 85733, 31905, 7377, -47458, -60972, -28950, -2849, -82456, -155487, -162382]
17405a62382q299O6684N2692N3301L5118l2454N8702J8819j4866k1060l1364K0421
17393C5312L8139M3454r5368r9225L4850N5298k2101n8071J58907P5288m9269
17382A17214p2108m8258o0166j3173O8914J10193N038o1467j3741J07784L9027
17371A79257N8l7771j10211l3673l5949j9371N1234L3573J8859N2609J2884k1438
17359I0061j00490q4783P8317M5547p9655p2591k729k252l1099L7180J6845p2952
17347a78601R4712P0473k4195k4754j4849J1821l8953j06101L4832L2452K9116
17336a14047k514O8347Q3540J1793r128q5944K6427Q2502O7077K9964k7289m8151
17324H2577J8493j6108j16745n5551J31113k6763n1078m9375k2352O0995N0235
$$ y = [-162382, -170681, -103997, -51305, 1996, 37114, 4660, 63362, 82181, 67315, 46255, 14891, 35312, 73451, 116905, 21537, -77688, -42838, 12460, -9641, -67712, 91195, 166483, 117214, 45106, -3152, -63318, -76491, -7577, 102616, 107654, 46187, 32446, 140230, 179257, 179315, 141544, 31333, -2340, -38289, -57660, -6426, 27147, 46006, 98615, 111499, 90061, -10429, -95212, -16895, 28652, -51003, -123594, -126323, -128575, -159674, -122494, -105649, -178601, -83889, -13416, -37611, -62365, -77214, -65393, -104346, -210447, -175615, -143163, -114047, -116561, -48214, 35326, 47119, 37991, -47953, -21526, 60976, 128053, 158017, 130728, 82577, 101070, 84962, -31783, -87334, 43779, 17016, -34062, -83437, -105789, -44794, 5441]
17313E441Q6802L8098l523n6014L4794J4283M9931n2868j40417l3772R5143K958
17301D0856o2816n300N5062R9069J39167R6924J44807R7622n2404n387p7695j08217
17289C61688j50150j1526L3976Q7817P3204M2639R6643m5913j20200q9730j39341
17278A39107L87j4334n0939N7879k056r5241l7771O8187N2597q126j16432o499
17266a3241Q3291O0851j5393j7887J29419J36534Q8315l0356j18682j00190R833
17255B12494n3245q9793k0951O2836J35460J53990J7768k698l5202j09303r0929
17244A80427j51500j0336O1753o9639k6115N266r4870Q5406l152j8465J3317J9549
17232h359J03405l532j20046j8750Q3517n6644l6261Q7948L6594j6364R3176R666
$$ y = [5441, 92243, 130341, 126818, 70804, 105598, 119881, 169812, 116944, -23473, -57245, 37898, 40856, -21960, -27260, 27802, 126871, 266038, 362962, 507769, 605391, 552987, 547600, 469905, 361688, 211538, 200012, 233988, 321805, 395009, 437648, 534291, 488378, 368178, 278448, 139107, 139494, 125160, 74221, 132100, 130044, 34803, -2968, 65219, 117816, 109690, -6742, -13241, 70050, 130901, 115508, 97621, 227040, 363574, 451889, 421533, 302851, 202661, 212494, 159249, 69456, 48505, 111341, 246801, 400791, 418559, 415861, 380659, 271356, 180427, 28927, 18591, 80344, 10705, -15410, -10144, -105014, -19608, -22760, -41225, -27908, -8359, 95046, 91514, -28532, -47282, 36235, -20409, -56670, 31278, 67872, 51508, 144684, 154350]
17220A54350o7804l1146O2550R0911P614P092O8273m8811j30938n7196l9105k1716
17208e926J3204l5213q510O7120J9272L6795J9451o3183q372J1176O0750j68q9178
17195A7218n0404m9422O5598J35886j9023m1001j00291p2315L8889N5884p9369
17184i8350Q050J5234m3474P47M1206o006k9663J2152M0663M8504P2339q8430
17172b7028l8616M7168P7047M1128K3399k8367m2700n4463l0287q2449J5831J2429
17160h6908N753R3968k8858n3871K033J65751P420j15741k320k4635m1531J5119
17148f3820j3029K9314J11984L8130n0708K6523k7436k8691k3307J2015j4155
17137c180j0065k0354n3425j216P3516j8537l0622O3812m8792J584N7950P1945
$$ y = [154350, 86546, 55400, 117950, 208861, 216475, 223567, 291840, 243029, 112091, 54895, 15790, -5926, 7278, -27935, -36445, 30675, 49947, 86742, 106193, 43010, 34638, 45814, 106564, 106396, 17218, -33186, -82608, -17010, 118876, 99853, 58852, -41439, -113754, -74865, -18981, -98350, -90300, -75066, -118540, -117793, -76587, -82593, -112256, -100104, -59441, -10937, 61402, -27028, -65644, -18476, 58571, 99699, 123098, 94731, 52031, -2432, -32719, -115168, -99337, -86908, -81155, 12813, -16045, -69916, -67883, 97868, 105288, -10453, -12773, -37408, -78939, -63820, -76849, -47535, 64449, 102579, 51871, 78394, 50958, 22267, -1040, 10975, -3180, -13245, -33599, -87024, -88240, -14724, -33261, -63883, -71, -48863, -47279, 10671, 82616]
17125H2616M1241n6567j0522l2995O590M98j6934j2693n4528J564l6893N0193
17113c8430R1512m8410Q267J449j5264J9676L0599K9825k7268K6382J0655N4007
17101A43000J5219j8801n6230n9633j6169M2060O85J3810L8738l177L0264j22842
17089F924m5088l8661l2555N8651N3065P4253P083N275L0811j4331N516K9N6216
17076A67188n6167j7687L8362P2293J12387J47040J44771J35780o105l8150J7291
17065G17003J4549J3191j1341r3197L069J3918O1258J44889q367k4825O3751l0479
17053H63419n7487n5844k72151j34994r4845k5061j9780o4801o051j4161n3945
17042F4299P0557K384L857l1326j07377m9226N5598O2348p2678M3782R4593M4206
$$ y = [82616, 123857, 67290, 56768, 23773, 30363, 30861, 13927, 1234, -53294, -51730, -88623, -38430, 53082, 4672, 12939, 14388, -876, 18800, 49399, 79224, 51956, 78338, 88993, 143000, 158219, 139418, 83188, 23555, 7386, 49446, 50131, 63941, 102679, 99502, 129766, 6924, -38164, -76825, -109380, -50729, 2336, 76589, 83672, 88947, 119758, 105427, 110943, 110972, 167188, 111021, 93334, 131696, 203989, 316376, 463416, 608187, 743967, 737862, 699712, 717003, 731552, 744743, 733402, 640205, 643274, 657192, 718450, 863339, 854972, 830147, 893898, 863419, 805932, 750088, 477937, 342943, 248098, 223037, 203257, 138456, 132405, 118244, 64299, 134856, 137240, 141097, 109771, 2394, -46832, 8766, 71114, -1564, 42218, 136811, 181017]
17030A81017k0046j01810N6841L5057m0687p4942m5766K7999L3290m1717p480
17019A756J9022j6962K8411K2977j9570j6663J3188M2071j5573L0387q6325j6737
17007a4018K4512j9849k0983N0273j7627J0258N6649Q5404k1754p0046l4682J09919
16995A38056Q5945O596p8676j13208M7370L1214k4751j230P4710M502j1859j4122
16983A44547j1082K9041j8155p4540M2427P8693m3360p052M0519m2871j9273k1913
16971I6981N8723j7364l5663o0888q5734M0045J9889K9780R6945K1989j7239p0517
16959G6947q595k3943l961K1834K5451L985k8091o5653N589J32725J00695L642
16947B40625j8655l9337o598o272L606o6742j10794R9206l8292m0565j2863L1453
$$ y = [181017, 160971, 59161, 116002, 151059, 110372, 35430, -10336, 17663, 50953, 9236, 1756, 20778, 3816, 32227, 55204, 35634, 18971, 32159, 74230, 58657, 89044, 2719, -14018, 10494, -9355, -30338, 19935, 2308, 12566, 69215, 154619, 132865, 62819, 28137, 138056, 224001, 230597, 151921, 38713, 86083, 117297, 92546, 91316, 166026, 170528, 158669, 144547, 133465, 162506, 144351, 69811, 112238, 190931, 147571, 140519, 181038, 138167, 118894, 96981, 155704, 138340, 102677, 41789, -43945, -3900, 15989, 45769, 142714, 164703, 147464, 76947, 68352, 44409, 40448, 62282, 87733, 91718, 63627, -2026, 3563, 136288, 236983, 240625, 221970, 182633, 176035, 169763, 173369, 106627, -4167, 95039, 56747, 16182, 3319, 34772]
16935C4772N7280j25000l4715M0169K8417l2713l4372m1301L0720R3109J00534
16924A16900m0615p1666K2111P3996O2820j5755o4534k6230l744j5422l833m186
16912B9842k1806P307J0747M4027L0344J0449N9390n779K5323L3636q2347m9805
16900I1328k9093p2948k7850O7406K6192p074j5932L3695N9301l0961k3413N1396
16888A22047m5877l22L7213l9196k4676L7540J45162J3879M0312O28m7976l8345
16876B00389N8060k1328j1335R342k1220n8104J8755N5331L6936m1203j31522
16865I4101j2076K4797j4659J8559P7287O0793r0544l2138K0949k005j8696j1069
16853A15299K3178m1402p3771j33N0372K0341J10766Q8295P832j25901r2139m9069
$$ y = [34772, 92052, -32948, -67663, -27494, 923, -31790, -66162, -107463, -76743, 16366, 116900, 76285, 4619, 26730, 100726, 163546, 147791, 83257, 57027, 53283, 37861, 34028, 29842, 8036, 15343, 26090, 70117, 100461, 110910, 170300, 164521, 189844, 223480, 141133, 91328, 62235, -10713, -38563, 28843, 55035, 47961, 32029, 65724, 125025, 94064, 70651, 122047, 76170, 75848, 113061, 73865, 49189, 86729, 231891, 245770, 286082, 286710, 238734, 200389, 258449, 237121, 225786, 235128, 213908, 155804, 174559, 229890, 266826, 225623, 94101, 82025, 106822, 92163, 110722, 188009, 248802, 158258, 126120, 147069, 145064, 126368, 115299, 138477, 97075, 23304, 23171, 73543, 93884, 204650, 292945, 300777, 174876, 82737, 33668]
16841C3668N8083J25902Q7165M2735l8989n4249J00947Q8536m2264k8047J3677
16830C87164o2798J5264M6014R635o6731p855P110O1652k3049K056l6874N5449
16818C87037P1918r1688m9750K1344M4832k3993P0467J20056L9316k212N8298
16807F45625P2809m8630m1035M8332J11555J30205k5291J3502P9295J0617K6978
16796A023962m6000K3481k402l2490O3445J55411P3427R4456J68365J08568L5611
16785A665834J23916P9250K91912L61361M08907L93839M02486N98353O24038Q14193
16775E764089J055210J306773J793188K657365M099561O617413J1153351J8445648
16767E2892598K4933919K0603065M195269j3608009k1292887j6522954q793571
$$ y = [33668, 91751, 217653, 304818, 347553, 308564, 254315, 355262, 443798, 401534, 373487, 387164, 324366, 339630, 385644, 395279, 328548, 320693, 327803, 389455, 366406, 368462, 331588, 387037, 458955, 367267, 317517, 338861, 383693, 359700, 430167, 550223, 589539, 587327, 645625, 718434, 669804, 628769, 677101, 788656, 918861, 893570, 907072, 986367, 996984, 1023962, 977962, 1001443, 999041, 966551, 1029996, 1185407, 1258834, 1353290, 1521655, 1630223, 1665834, 1789750, 1869000, 2160912, 2522273, 2931180, 3325019, 3727505, 4325858, 4949896, 5764089, 6819299, 8126072, 9919260, 12576625, 16676186, 23293599, 34446950, 52892598, 77826517, 98429582, 102624851, 89016842, 67723955, 51201001, 42407430]
16760D2407430k549170K754104R156142J7623909K4456274J9318439R02703j8630390
16752I5439441k6823684k1526387j3392042p911903m883011l088282k065088j337595
16744A4411449q59934m82998k42071J63074P08444J266739K230280L663132O286916
16735B7145031J0984017J8263331K3819286J8403568J910225j4681810k0674189
16728F5169459j5350317p828277k071709L156403R638688J7996693K4099343J7600460
16720A12410743j514664k0198599k6718314k0642724j2700153p701652m941202
16713A7993435l325322k354400j715051j329275j046774p49747p64746o90960
16705F017160n54113n54958n86938m86607l09897l41962k50043j69966j22184
$$ y = [42407430, 39858260, 42612364, 51768506, 69392415, 93848689, 113167128, 114069831, 95439441, 68615757, 47089370, 33697328, 25785425, 20902414, 17814132, 15749044, 14411449, 13551515, 13068517, 12826446, 12989520, 13697964, 14964703, 17194983, 20858115, 27145031, 38129048, 56392379, 80211665, 98615233, 100525458, 85843648, 65169459, 49819142, 41990865, 39919156, 43075559, 52714247, 70710940, 94810283, 112410743, 110896079, 90697480, 63979166, 43336442, 30636289, 22934637, 17993435, 14668113, 12313713, 10598662, 9269387, 8222613, 7472866, 6708120, 6017160, 5463047, 4908089, 4321151, 3834544, 3524647, 3182685, 2932642, 2762676, 2640492]
16696B640492k02645p9147q9528o7553n1526j62366k15746q2087n1931j73549
16686A464414j67410q2120o8178j7958J46139M3216p1371l8703J5000k3853m7121
16675A152055o7934k2407q6063j30416o0370L3823P7161M9714j3241m3514k5762
16664H63046j53592K2069L6888j26474n6605M6129n432k979l9857p0718O9675
16653E82150N2473o5648k1399L0093R1108J9685m1886j5435j3442l9749L1181
16642F09131L1176m0397r3759j7192J8266m3639j2211n4725N4685P957J07043
16631E66335r745q5241n4602j2203k6651M1804J01951j41L4565Q3331m1914j24541
16619D72948o890R641P0834k5359K933K0767k444j7142N4263q188j6604N666O6922
$$ y = [2640492, 2437847, 2358700, 2269172, 2201619, 2150093, 1987727, 1771981, 1689894, 1637963, 1464414, 1297004, 1214884, 1146706, 1128748, 1274887, 1318103, 1246732, 1208029, 1223029, 1199176, 1152055, 1084121, 1061714, 975651, 845235, 784865, 818688, 895849, 945563, 932322, 888808, 863046, 709454, 731523, 768411, 641937, 585332, 631461, 626029, 623050, 583193, 512475, 582150, 634623, 568975, 547576, 577669, 668777, 688462, 646576, 631141, 617699, 577950, 609131, 640307, 599910, 506151, 488959, 507225, 463586, 451375, 396650, 451335, 459292, 566335, 556590, 471349, 416747, 404544, 377893, 419697, 521648, 521507, 556072, 639403, 597489, 472948, 466058, 475699, 546533, 521174, 524107, 544874, 542430, 525288, 579551, 571363, 554759, 560425, 627347]
16606F27347J22599J37595L0596k8543j046n8682q4078K2364R1441P1201O9544
16595A000338K3370O4162J00707M5176J21087J07474R3820p440O2305J02858K7554
16584A741411P0447P4622J07483K63709K21926J79763J86150K01393K59098M35361
16574C741363N03454O25552Q36698R30592R62936J171143J305333J617605K155183
16565A3849859K741530L812167N686558R061907J4540575K1675279K7222462K6563902
16557A25154239J8768201R758041M471895P18750o682704j5561185j8373023j1488615
16549A06765599J174005J2091787J5101387R747837K636004j600607m872991j1460072
16541A29582949k0050211k4677926k2395474j6674418j1105890p250716m803590
$$ y = [627347, 749946, 887541, 918137, 889594, 888548, 829866, 745788, 768152, 859593, 930794, 1000338, 1023708, 1087870, 1188577, 1233753, 1354840, 1462314, 1556134, 1548694, 1610999, 1713857, 1741411, 1811858, 1886480, 1993963, 2257672, 2479598, 2659361, 2845511, 3046904, 3306002, 3741363, 4244817, 4870369, 5707067, 6637659, 7600595, 8771738, 10077071, 11694676, 13849859, 16591389, 20403556, 26090114, 35152021, 49692596, 71367875, 98590337, 125154239, 143922440, 153680481, 158152376, 158871126, 152188422, 136627237, 118254214, 106765599, 107939604, 120031391, 135132778, 144880615, 147516619, 145916012, 141043021, 129582949, 109532738, 84854812, 62459338, 45784920, 34679030, 27428314, 22624724]
16534B2624724l323574k496986j985769j641594j424204j198787r87761j036806
16526H529243q94437p07510o30032n77766m91368l64041k76684k68989l11830
16517D006586k18375j84798k09193k14482l19385k72029j35773j56178j54388
16508B141985q7502j55322j18522o1894j20053p8167r0435j12552j16163k0526
16498A180849L371p9707j05031q1575r066j82048m1434J0011J324J1873n392l2604
16486F70571j4751M599M7153n1969m4854k5569j0614j7338j206o7221n5992k1051
16474D11758M5499j23824n0412L4047L6369l193j4409L2471m9881L9852Q7470
16463D45747j9401m1020o8025M0003M8275m1729M496l9494R799l6654j09066j03206
$$ y = [22624724, 19301150, 16804164, 14818395, 13176801, 11752597, 10553810, 9566049, 8529243, 7634806, 6927296, 6297264, 5719498, 5228130, 4864089, 4587405, 4318416, 4006586, 3788211, 3603413, 3394220, 3179738, 2860353, 2588324, 2452551, 2296373, 2141985, 2054483, 1899161, 1780639, 1718745, 1598692, 1520525, 1430090, 1317538, 1201375, 1180849, 1184220, 1104513, 999482, 917907, 908841, 726793, 685359, 695370, 696694, 708567, 703175, 670571, 655820, 660419, 707572, 655603, 610749, 585180, 574566, 557228, 556022, 488801, 432809, 411758, 457257, 333433, 283021, 317068, 353437, 350244, 335835, 368306, 318425, 358277, 445747, 426346, 385326, 317301, 357304, 405579, 363850, 368346, 328852, 338651, 301997, 192931, 89725]
16451H9725n7684Q3078O5626j8951j2943O9309Q4652k2847j4817l9686n1669l9995
16439A33798K5816l0999q9998m110J4492J2283J6263p1336j05918L8754J32451
16428G1496N0679L1834J3749J999j5177P9554j612p7580m896j8150K0510M9294
16416B01700P089J08877Q9050j2878r6515j11329k6658L8946P435o5151l3692
16405A06874K7606R5413o9924r5153R448J7668O674N4758l8994l7270l0274l8585
16393H241M7514P7235R8545k6766j24433m2981j3475J8944n30K2385N132j8164
16381E1647j0229Q7218L2012M1663O2964k0199j02301m6849M1140j7373k8848
16370I0845k7056J18851J4593q3102l0022L8241K8209k8966m4956o908k8687j6334
$$ y = [89725, 32041, 115119, 180745, 161794, 148851, 218160, 302812, 279965, 265148, 225462, 173793, 133798, 159614, 128615, 38617, 34507, 48999, 61282, 77545, 6209, -99709, -60955, 71496, 122175, 154009, 167758, 169757, 154580, 234134, 232522, 154942, 150046, 131896, 152406, 201700, 208789, 317666, 406716, 393838, 297323, 185994, 159336, 198282, 205717, 140566, 106874, 134480, 229893, 159969, 64816, 74264, 91932, 98606, 153364, 114370, 77100, 46826, 8241, 55755, 132990, 231535, 204769, 80336, 37355, 23880, 42824, 42294, 64679, 69811, 51647, 41418, 128636, 160648, 202311, 265275, 245076, 142775, 95926, 137066, 119693, 90845, 63789, 182640, 197233, 114131, 84109, 122350, 150559, 121593, 76637, 69729, 41042, 24708]
16358B4708K1101J5026n5684N2527o4962q6053j7120R0784O6738N1232o3464j05732
16346g0899j7651N4647J15809L7033m7553r9573p2672O7436N7931L1703J9292
16335G5503j3950P9258j1496J1497r244K8281O4469M0081r4484j1327j09952o5614
16323a6978M3951l2948K7849R3287L9879o100L8630j3964o1940J4666k0039j09806
16311c513j09457J9403J15926Q4367K8876j2811l8808M198J2046j8019P6453l2179
16299A26482q126j1983P9389n7151P1180M3930q0766q5630l286N6034Q295q413
16287A29955P8086m4955k7567J6923k3616l6572p2064j5363l8733K380N1816L4953
16275E5243j3526o7845Q7588M9215o5573L2691M6606K8192l0326n3717M16p271
$$ y = [24708, 45809, 60835, 5151, 57678, -7284, -93337, -110457, -19673, 47065, 98297, 34833, -70899, -88550, -33903, 81906, 118939, 71386, -28187, -100859, -33423, 24508, 56211, 75503, 61553, 140811, 129315, 140812, 131568, 159849, 224318, 264399, 169915, 158588, 48636, -16978, 26973, -5975, 21874, 115161, 155040, 148940, 187570, 173606, 111666, 126332, 106293, -3513, -112970, -93567, 22359, 106726, 135602, 122791, 83983, 88181, 100227, 82208, 158661, 126482, 118356, 106373, 185762, 128611, 199791, 243721, 162955, 77325, 74039, 130073, 138368, 129955, 208041, 163086, 135519, 152442, 128826, 92254, 20190, 4827, -33906, -31526, 20290, 55243, 41717, -26128, 61460, 110675, 45102, 77793, 124399, 152591, 122265, 68548, 68964, 61693]
16263F1693L4654L0355p936p2461k2648n332R7243O2389p1929j0087k0340j3429
16251F2172K6507Q0803p4454k5935L5470N9508n9418l5410Q520N2148N1206K8009
16239B09126m7537k3178K8155M0091K3834L8754J21091P2209N7093n533j21732
16228C92373j65142j8594P9819O5679n668K4390J08218P9755k58n6177K8p8131
16216D26292l5186p6601n5643o0982j09544j6808j0155K6329P9083N5788k2425
16205B00148M0782J32428j5402N882m9894Q919J36840J47160j7954l0057p169
16194E51683j17691q0833q9209N4536M6745R4262Q0817K6542l2245l8766j06998
16183C88843j15023j19859k8892k2636N4984m3517j16556M1389l5393n9636k2350
$$ y = [61693, 96347, 126702, 118766, 46305, 23657, 18325, 115568, 177957, 106028, 95941, 75601, 62172, 88679, 169482, 95028, 69093, 104563, 164071, 104653, 69243, 77763, 129911, 181117, 209126, 161589, 138411, 166566, 206657, 230491, 269245, 390336, 462545, 519638, 514105, 392373, 227231, 208637, 288456, 354135, 348467, 372857, 481075, 560830, 560572, 504395, 504423, 426292, 391106, 314505, 258862, 197880, 88336, 71528, 61373, 87702, 166785, 222573, 200148, 240930, 373358, 357956, 363838, 313944, 322863, 459703, 606863, 588909, 558852, 551683, 433992, 353159, 263950, 318486, 365231, 459493, 540310, 566852, 534607, 495841, 388843, 273820, 153961, 125069, 102433, 157417, 113900, -2656, 38733, 3340, -56296, -78646]
16172g8646K7239M2626J1700L1622J1126n1179n438k3671n4500R6796Q9524R7037
16160A94236O8251p203m1623Q108j4896p4502k2587m9084q2760l4148P1546O2767
16148G8105R999l4037r767O546l7230n887J8250O6675j7778p900o106O3653p108
16135A17415o9803k7448R257p9132N2268N2324k1917q9873l282J4409k9900m0455
16123a16137Q0016M3227n6006J7024q2905J7823J3288m9150J22564j2699l1073
16112e4028j195K1193J5064J1722O453l7544k1795R909J0557Q930n6796q4133
16100a71663j2183M7952J15259R9954k2881k4171l0320M9924K6490j9218k995
16089E6148o640M5266J413k4563n5620j4848M1407k8472O185n3688J8524J12107
$$ y = [-78646, -51407, -8781, 2919, 34541, 45667, -5512, -10950, -34621, -89121, 7675, 97199, 194236, 262487, 255284, 213661, 221769, 206873, 132371, 109784, 60700, -22060, -56208, 15338, 78105, 88104, 54067, 44300, 50846, 13616, 7729, 25979, 92654, 74876, 66976, 60870, 124523, 117415, 47612, 20164, 29421, -49711, 2557, 54881, 32964, -56909, -60191, -45782, -75682, -116137, -36121, 7106, -48900, -31876, -114781, -96958, -83670, -132820, -10256, -22955, -54028, -55223, -34030, -18966, -7244, -791, -38335, -60130, -50221, -39664, -30734, -87530, -171663, -183846, -135894, -20635, 79319, 56438, 32267, 1947, 51871, 78361, 59143, 56148, 49508, 94774, 96187, 71624, 16004, 1156, 42563, 14091, 20276, -33412, -14888, 97219]
16077I7219J7392n8851k3385l2908m1316N0575r698k4468J4056L8346j2422j17821
16065a03281q0736K4195O3968R658P504M6047J0219J1399p597O025J8135J1399
16053A6935L1113k6727n1293M5625J54490Q5235l9423j07443o076J31185J89914
16042D23535J28008J66902J50972R9225M959l6132r818j13858j54529j05147O215
16031E60332J01304J18893Q5483L1498k545j17553j70122j11612m8184j66789
16021B80705j35144L7633n6790p8767r7040p3642l074P5534n174n4601R50M0971
16009f8439P9067P3766N3545o563k0092J1338M7003J5912l6819n8189o6304J7528
15997D1753L9862j5511n4151j65218l0738P1856J8357j6823R5828R0266j8842
$$ y = [97219, 114611, 55760, 32375, -533, -41849, 8726, -972, -25440, -11384, 26962, 14540, -103281, -184017, -159822, -95854, -86196, -78692, -32645, -22426, -11027, -18624, -12599, 5536, 16935, 48048, 21321, -29972, 15653, 170143, 255378, 215955, 108512, 102436, 233621, 423535, 551543, 718445, 869417, 968642, 973601, 937469, 927651, 813793, 659264, 554117, 560332, 661636, 780529, 866012, 897510, 894965, 777412, 607290, 495678, 447494, 280705, 145561, 183194, 126404, 47637, -49403, -123045, -126119, -50585, -55759, -110360, -109410, -68439, 10628, 84394, 137939, 131376, 111284, 122622, 169625, 185537, 148718, 90529, 24225, 41753, 81615, 66104, 11953, -153265, -184003, -112147, -93790, -110613, -14785, 75481, 56639]
15986E6639M511K3719K2773j0744q0032M8942M8643l4809n5943j4283q3499l6707
15974a10790M8742J22258k3231j40774J0540R4826k3451N4684J4994j2411k7796
15963G591J8346J29897m3909p0475p9550k43Q161K2972J6O483n6785l4431J07798
15950A5871J23894k0074J3743q1383n5445j4963J5133O7349j1713M6875p2564
15939B6723p8037q255M0444Q6863O0434j6700L0057N5564r1745m7856K4563m4358
15927C7697l620q6092K0532J05907J7725o9080J3489J6743j03980q7500J7076
15916a21103P5276n064J9334O4366L9188j2443k0425r185o2443l7825J5225M4441
15904a0658m6329Q3375J77836j5223j35517j1738o52j1084q4368R0634N9557p8786
$$ y = [56639, 61150, 84869, 107642, 96898, 16866, 65808, 114451, 79642, 23699, 9416, -74083, -110790, -62048, 60210, 36979, -103795, -93255, 1571, -21880, 32804, 47798, 35387, 7591, 25937, 155834, 111925, 41450, -38100, -38343, -30182, -7210, -7194, -711, -57496, -91927, 15871, 139765, 119691, 133434, 52051, -3394, -18357, -3224, 64125, 52412, 99287, 26723, -51314, -59569, -19125, 67738, 128172, 111472, 141529, 197093, 105348, 57492, 82055, 37697, 34077, -52015, -31483, 74424, 92149, 23069, 36558, 53301, -50679, -138179, -121103, -45827, -50891, -31557, 32809, 71997, 59554, 39129, 29944, -32499, -70324, -55099, -10658, -56987, 26388, 204224, 189001, 53484, 41746, 41094, 30010, -54358, 36276, 95833, 17047]
15892A7047K834p895M6148P596L9368N2813j0904l0974J6923n7186p9868O6729
15880F2631q526j316J6076Q0853p1979n3639m731j7253J12162J48772q7110r5698
15868H0242L4097J23673J04510q3825j61079j33899j31173K4940J47266Q7395
15858I2147N8849m770q1682r0709M8689l3930k9986l0374l5585J4611O7812k0406
15846d5334l2940P2427K250m3884J0105N603m0422n8742L3192l0898k0637J23140
15834b6140l452l1618N8404P6272K5271K529l5428j6080o1487k5841p4587k708
15822a14865p067J1687L7382L9010J9889m6061K6237l59n8737p2336L1832R182
15810a24206L2559Q141l2801q1587j5422k715P8878J9465m3869j9870m5932k1073
$$ y = [17047, 19881, 11986, 58134, 65730, 105098, 157911, 147007, 116033, 132956, 75770, -4098, 62631, 54105, 52789, 68865, 149718, 77739, 24100, 19369, 2116, 114278, 263050, 175940, 80242, 114339, 238012, 342522, 258697, 97618, -36281, -167454, -142514, 4752, 92147, 150996, 146226, 64544, -26165, 22524, -11406, -41392, -71766, -107351, -92740, -24928, -45334, -78274, -5847, -3597, -47481, -37376, -31773, -72195, -130937, -97745, -128643, -149280, -26140, -29592, -61210, -2806, 73466, 98737, 101266, 65838, 49758, -11729, -37570, -112157, -114865, -121932, -110245, -72863, -33853, -13964, -60025, -33788, -34147, -92884, -165220, -133388, -124206, -91647, -83506, -116307, -197894, -213316, -216031, -137153, -117688, -161557, -181427, -227359, -248432]
15798b48432J04209M0501O8999N4205l5274k8766q3724K1603K2495k7270p541
15787a18995J39610N3106l286m8398q4k2378j7756k5048m2405K78j951O7199j6959
15774c7067K0307K8828j5383n8593n6725M3323K5097N147l6171l8942M261N7583
15762e8335J20685k3839p5642J2130J3259M0982Q7894O6870j38939r795m466j9924
15750A0880n323J6395j7103N412K0779p9290l700K1223J5654M6626O8149k9102
15738G0600o429l8966o6980N7913Q9584k2582j9532k9220n7195j26160k6621l5973
15726b11561Q8522k0324N5604P5611l2836o5658Q4471K6319M7395N1718M5869
15715A45130j1020j49796j47579M5110J09634J7710L8959J1187m226m1636j3175
$$ y = [-248432, -144223, -103722, -34723, 19482, -15792, -44558, -128282, -106679, -84184, -111454, -118995, 20615, 73721, 70435, 22037, 21953, -425, -18181, -43229, -85634, -85356, -87307, -20108, -37067, -16760, 12068, -3315, -61908, -118633, -75310, -50213, -45066, -81237, -120179, -115918, -58335, 62350, 38511, -37131, -25001, -11742, 29240, 117134, 184004, 45065, 35270, 30804, 10880, 5557, 21952, 4849, 10261, 31040, -48250, -51950, -30727, -15073, 31553, 99702, 70600, 64171, 25205, -41775, 16138, 105722, 83140, 63608, 34388, -22807, -148967, -175588, -211561, -123039, -143363, -87759, -12148, -44984, -110642, -26171, 148, 47543, 99261, 145130, 134110, -15686, -163265, -118155, -8521, 9189, 48148, 59335, 55109, 13473, 298]
15704B98p464J5063J6928L1558n5677J5297Q5557K4516m6586m8164k9782k843
15692a299M766k8858k1287N8867n5111o9463q897M9414o8871q4965K7545R5575
15680a02584k2258J02975J37251M0074P466k9360j1881l62r4507J8706k2268Q9997
15668A13249K6204q1258O559p0723p0295k224R8516M4025l7764k0143r8029J05940
15656A4057O3621l7274J0649J0179L3109r7698r0217M0951J05021R531N3674n3303
15644F2300J00323L7856M1597M1480j33036j03373n9333j7571L6214R9968k8123
15633G8302J948k1166p1264k2047q3342k3575P2024o959l9712j3638j474L9836
15621i1067J41310K7257K0093n7606j17057J0432L8225n9942n7995O833M6277
$$ y = [298, -7166, 7897, 24825, 56383, 706, 16003, 101560, 126076, 79490, 31326, 1544, -1299, 3467, -25391, -46678, 12189, -42922, -112385, -121282, -71868, -140739, -225704, -198159, -102584, -124842, -21867, 115384, 155458, 162924, 133564, 121683, 121321, 26814, 45520, 23252, 113249, 139453, 58195, 64754, -5969, -76264, -78488, 20028, 64053, 26289, 6146, -91883, 14057, 77678, 40404, 51053, 61232, 94341, -3357, -93574, -52623, 52398, 61929, 115603, 62300, 162623, 200479, 242076, 283556, 150520, 47147, -12186, -29757, 6457, 106425, 78302, 80250, 59084, -12180, -34227, -117569, -141144, -69120, -76079, -115791, -129429, -130903, -91067, 50243, 77500, 97593, 39987, -77070, -66638, -28413, -88355, -146350, -139517, -93240]
15610i3240N1256J77826J8212j1954l9669q3546k0391m6414L3943K6900m7674
15599c4751k0363M3487n0918j2600O529k530M3344m6273k0252K2678R2109M6598
15587F7058k4803o9522j8105N4782n8331K1325M0788l1814l706l882k9822l5643
15575i1675K9136P986l3240J8981M9217o2777M786k7700J2515l6397k5717J3222
15563a41663K9869o1197O4579J18392M1387l0828o6057l6249P254L307l5000J12165
15551E959J9567K9506O1398K1599o4264q7988j23425r5451R821N000L7357O7845
15539a13076J12483j7298j611O3642O6563N4590J1499r4274j56894N168L0705
15528c8503J8819j2820j7873J4875P0128p575p7803M307O2846J9364o8188m2773
$$ y = [-93240, -41984, 135842, 154054, 142100, 102431, 18885, -1506, -47920, -13977, 12923, -34751, -55114, -11627, -62545, -75145, -68616, -71146, -27802, -74075, -94327, -71649, 20460, 67058, 42255, -27267, -45372, 9410, -48921, -27596, 13192, -18622, -22328, -26210, -56032, -91675, -62539, -54553, -87793, -68812, -19595, -82372, -77586, -105286, -92771, -129168, -154885, -141663, -111794, -172991, -108412, 9980, 51367, 20539, -45518, -81767, -74513, -71206, -106206, 5959, 25526, 55032, 116430, 138029, 73765, -14223, -137648, -233099, -223278, -218278, -180921, -113076, -593, -17891, -19502, 44140, 110703, 165293, 176792, 82518, -74376, -69208, -38503, -19684, -32504, -50377, -35502, 34626, 27051, -50752, -46445, 16401, 35765, -32423, -75196]
15516g5196o0729N899J01006M0069j6556o3363J2582L0334M2560J1633n1055p5343
15504i8159k6339P825J8918M8563J08349L004p51J5046p1104j17091j2397m154
15492a28290O5722J0569j6073O7596M2030j9406J9290N6065J04861M9387j0508
15481B41243q9517j27158j9692k6568l4339r645K6590k0212l5043M302R2083O1840
15469F3884R255J309p3438p1068p9331L2389j9103N9573O8159L8602q5977m5032
15457a00778p3085m2936P5768O3575Q157r394k8451P377R9198j0139m3948L448
15445e1208j0795N8985N046N3451O7411m848j1181m9204n8168l5359n2044Q6452
15433a462J15277M7025k4502p5138l534j02211M8577K1725n2895o8537j2134J7824
$$ y = [-75196, -135925, -130026, -29020, 11049, -5507, -68870, -56288, -25954, 16606, 28239, -22816, -98159, -124498, -116673, -97755, -49192, 59157, 62161, 61410, 76456, 5352, -111739, -124136, -128290, -62568, -51999, -68072, -476, 41554, 22148, 41438, 97503, 202364, 251751, 241243, 151726, 24568, 4876, -21692, -56031, -65676, -39086, -59298, -94341, -90039, 2044, 63884, 73139, 74448, 1010, -70058, -149389, -117000, -136103, -76530, -8371, 30231, -55746, -100778, -173863, -216799, -141031, -77456, -69299, -78693, -107144, -99767, -569, -10708, -54656, -51208, -62003, -3018, 2028, 55479, 122890, 118042, 106861, 57657, -511, -35870, -87914, -1462, 113815, 160840, 136338, 61200, 57666, -44545, 4032, 25757, -27138, -95675, -107809, -89985]
15421h9985O0103n311O8984M6392m2581m4662R852N7054k8367o0842M011j5358
15409d0710p426n6566l841M6323j7386J8550L3591K911L4861q433n5402k4431
15397g7959R047N4074k8956n6770L5339l9746J4571M4065n7079m209J05129k0563
15385b3057o6061N8289J9823M4902L9733j12624p4771o1826M5619J28868Q5576
15374H4471p9548j5042M4517m3136j2238P5613K9495r5458o8383Q5550O2544j06341
15362c7956l0562N1074N4072o5633J7480O2916q4664r463J28798n7704n0335l2247
15350e4224R376O2275J8732j7478L2340K2492j12486r6293J9829M5796j5938J20383
15338C4804Q4142r908p1007j31942j4387Q5793J46295K2591l5140l6999L4032
$$ y = [-89985, -29882, -35193, 33791, 80183, 37602, -7060, 2792, 59846, 31479, -29363, -25352, -40710, -48136, -104702, -108543, -62220, -79606, -61056, -27465, -24554, 10307, 1874, -53528, -77959, -68912, -14838, -43794, -100564, -65225, -104971, -90400, -46335, -103414, -107623, -2494, -23057, -89118, -30829, -11006, 33896, 73629, -38995, -113766, -175592, -129973, -1105, 84471, 4923, -10119, 34398, -8738, -20976, 54637, 84132, -11326, -79709, 5841, 68385, -37956, -68518, -17444, 36628, -29005, -11525, 51391, -33273, -42736, 86062, 28358, -21977, -54224, -44848, 17427, 36159, 18681, 51021, 73513, -38973, -135266, -115437, -69641, -85579, 34804, 118946, 109038, 38031, -93911, -108298, -22505, 123790, 146381, 111241, 74242, 108274]
15327A08274p5963j05723m0925N3620N4905M3501k812o5458L4979L9360k4625
15316A9133o6163K0044O6097m2000k1796N4405k5439J9080j2439p3391m229o1022
15304a27720o097Q0552l8081l2004n490k4907p0093Q3521J51433o3190m9847M1776
15292f0147j9063k2867k8686O5948Q5971P115n1430J6346K0829m4814N8708J6340
15280D4250r7817J9141K3001P766N3390L4665Q5246l2194j75593j02684O330P4822
15268e9677J15682O2811k4304j8902o4983j8332N1469m0233J7120M787j2479k6788
15256a3829m8666j6224M1740p484N0368n317J354n700n5099M1237p1530r365N3644
15243d4871Q2852J1946M5915l7671l0357n8460o4599q717K215K3999P6539P6157
$$ y = [108274, 32311, -73412, -114337, -60717, -5812, 37689, 34877, -30581, 4398, 43758, 19133, -47030, -26986, 39111, -2889, -24685, 29720, 4281, 23361, 10922, -62469, -66698, -127720, -133817, -53265, -91346, -123350, -128840, -153747, -223840, -140319, 11114, -52076, -101923, -60147, -79210, -102077, -130763, -64815, 21156, 28271, -23159, -6813, 14016, -30798, 27910, 44250, -53567, -34426, -11425, -3659, 49731, 84396, 169642, 137448, -38145, -140829, -134499, -59677, 56005, 118816, 94512, 75610, 10627, -7705, 43764, 3531, 20651, 25438, 12959, -13829, -62495, -78719, -36979, -44463, 5905, 588, 1942, -3758, -58857, -17620, -89150, -98515, -44871, 37981, 49927, 95842, 58171, 27814, -30646, -95245, -103962, -101747, -77748, -1209, 74948]
15231G4948O6066m1191q0393q2892J18988N6702n3829p1760m8277J1974L3376
15220a6288j7082l0958K4365L9567p986J9044o8041n4946N9673J2185n9751J4489
15208h5729j9720j5667N3439m94K4693L8055O7025k6591N9262m950k4294j27489
15196f2460n4588J76239L7054n2333l9398K2455o0958M0056L9217q1956l3253
15185f9925J4648r3185J4917P5216P7522n432J8099j7042q0854l4596L7101j2262
15173g5793J7892K2945j5589n4050n1687r6674K6558J46479N9320K7049N6989
15162F3439q5826k8695P4481O8068k7299j24647n2816R2791K3519K9828o4456
15151c1613L5572l038j10073k0040M7371N9833O0620j9885p5666p9288k7136K9042
$$ y = [74948, 141014, 99823, 19430, -63462, 55526, 112228, 58399, -13361, -61638, -49664, -16288, -33370, -64328, -39963, -396, -8382, 10662, -57379, -112325, -52652, -40467, -100218, -85729, -105449, -121116, -67677, -68171, -43478, -5423, 61602, 35011, 94273, 89323, 65029, -62460, -117048, 59191, 96245, 43912, 4514, 26969, -33989, 6067, 45284, -36672, -69925, -55277, -148462, -133545, -58329, 19193, 13761, 31860, 14818, -66036, -100632, -63531, -75793, -57901, -34956, -50545, -104595, -156282, -252956, -226398, -79919, -20599, 6450, 63439, -22387, -51082, 23399, 91467, 64168, -60479, -113295, -20504, 3015, 32843, -31613, 3959, 921, -109152, -129192, -81821, -21988, 38632, 18747, -56919, -136207, -163343, -134301]
15139a34301j4897P8675J4957M7381K8737J6582J4578l9623n9496J0508M703M6880
15127A4684j1429L1027R268l11n3122j8320m2374K9342R4894N7067j25640l1772
15115d6686L8837j6040M9359o5894o9538L9846L6829M1598n3516n1213k952o5032
15103a64402q6599J01581J16964L7811K7111p4320p5794R262J29826j9816K8726
15092C0350q707l1002j296K0587L258J9045P6111o9654m6857J03151Q7605o1751
15080A20840m4404k2007o6150K7891N5961j750k8836l1007m7779q272Q955O1272
15068B4714M1625p4621m0972l1556J0536M340m930q2839j0286N5661k2097N2839
15056g7586M0091k7710l4904M1549n0539m8228N3074L0641N5576J2755o3966N8709
$$ y = [-134301, -149198, -70523, -55566, -8185, 20552, 37134, 51712, 12089, -47407, -36899, -32196, 14684, 3255, 34282, 43550, 43239, -9883, -28203, -70577, -41235, 53659, 110726, -14914, -46686, -7849, -23889, 25470, -40424, -109962, -70116, -33287, 8311, -45205, -96418, -99370, -164402, -251001, -149420, -32456, 5355, 32466, -41854, -117648, -108386, 21440, 1624, 30350, 21643, -9359, -10655, 9932, 13190, 32235, 108346, 38692, -8165, 94986, 182591, 120840, 76436, 54429, -11721, 16170, 72131, 70381, 41545, 10538, -37241, -45513, -36558, 24714, 66339, -8282, -49254, -80810, -70274, -65934, -70864, -153703, -163989, -108328, -130425, -77586, -37495, -65205, -100109, -58560, -109099, -157327, -104253, -73612, -18036, -5281, -69247, -10538]
15044a0538O9009k1795N139m306m2624j6666k8181K2520r6681l9816L0699O5993
15032f7247K0274q15k4440j2928N7884J6669k6975j2355l0050o3698k981n4053
15020b00715M0620o073j9529O9152n7636p6487M4128N0239L1726J35633O0806
15009G1864o2657k0066M3306J3323l5120K9441K4885J5337j551m196n2636j3488
14997H442K2940m9859J7563Q7515M2572q034q875K1656j2227p5989m6862p331
14985h489j4480j6394m9631J2215r900j0132l9247l9737K4251j0758k8533P4585
14973a16250K7189O444j4395j1567q0718L353M5150O2754J09311J8467L2354p8160
14961C932l4124M1749n5237k1698K2999P2274K9078l5096m4920O0705L8393q724
$$ y = [-10538, 58471, 36676, 41815, 37509, -5115, -21781, -49962, -27442, -124123, -163939, -133240, -67247, -46973, -47788, -72228, -85156, -27272, -10603, -37578, -49933, -79983, -143681, -146662, -200715, -160095, -166168, -185697, -116545, -174181, -250668, -206540, -156301, -124575, 11058, 71864, 9207, -10859, 32447, 45770, 10650, 40091, 64976, 80313, 78762, 74566, 21930, 8442, 31382, -18477, -914, 86601, 129173, 121139, 112264, 133920, 121693, 45704, -1158, -8489, -22969, -39363, -88994, -76779, -86679, -96811, -136058, -175795, -151544, -162302, -190835, -116250, -89061, -82617, -97012, -108579, -189297, -185944, -140794, -78040, 31271, 49738, 82092, 3932, -30192, 11557, -43680, -65378, -42379, 29895, 58973, 23877, -21043, 39662, 78055, 69331]
14949F9331M540Q749n5523j8374M1438j6525j18217l0536n073j3164l4886N0320
14937a17920O3351K3483j5174n0491l8852m0411L530P9411j6273l6466j2010J09223
14925d8599N9127N1458m8227O8596N3132M763o1270j36503m2017k467L3415R497
14913e9095M1536N4968L0477p851j33638o5902L0039J6257N8540O9806J4831p3934
14901b3966o2184p9438K3333O9784J9949k4090J6894J146K8345p0625r4985N9932
14889a35905K6219J2656L8256K3193M1226L2093N249l874Q733j2484l3881L6062
14877C7543j630l7582m9685k2918k6057P3773N2907K4525Q279J0618P3076n0626
14865I2223j28686n5864J13251P7793l5267j4136O6025K1552r1503j03220p2714
$$ y = [69331, 73871, 82620, 27097, 8723, 50161, 33636, -84581, -115117, -120190, -133354, -168240, -117920, -54569, -31086, -46260, -96751, -135603, -176014, -172484, -93073, -109346, -145812, -157822, -48599, 10528, 61986, 13759, 82355, 135487, 140250, 78980, -57523, -99540, -102007, -68592, -59095, -17559, 37409, 67886, 60035, -73603, -139505, -109466, -93209, -34669, 35137, 49968, -23966, -86150, -165588, -142255, -72471, -52522, -76612, -59718, -58572, -30227, -100852, -195837, -135905, -109686, -97030, -58774, -35581, 5645, 37738, 42987, 39113, 47846, 35362, 1481, 37543, 35913, -1669, -51354, -74272, -100329, -26556, 26351, 50876, 59155, 69773, 142849, 92223, -36463, -92327, 20924, 98717, 63450, 49314, 115339, 136891, 45388, -57832, -130546]
14854a30546p3289k853J1703J7061L8193R5791k421L1637O9840q610n2693O2239
14842E6052r604k7535q6887K9826O7969m5112m9386l0189o995L8609n0122K404
14830a10970j754m7804J2240R8467o7271j1247P7129O7893L1366M5208P5125M9772
14818B18154o8902j22777o4149k7654k3066l1333K8834j5784N0268K0306Q9767
14807E3664O3450q7509o4412l5388n7429M1134M6235Q3802K7164p2466j29293
14796a31048J7233R2598q084m3434J294M449p1707r3509R2529j5925q403N139
14784a58868M4808r6365j6173J47410M2206r226k8330O8478R4012K6786n5012
14773E9726q5180o2992N0553K459k0795J16446k696l3609q6846m5813j2424K9964
$$ y = [-130546, -203835, -206688, -194985, -177924, -139731, -43940, -46361, -14724, 55116, 46506, -6187, 56052, 46448, 18913, -67974, -38148, 29821, -15291, -64677, -94866, -101861, -63252, -113374, -110970, -112724, -160528, -148288, -49821, -117092, -128339, -51210, 16683, 48049, 93257, 168382, 218154, 149252, 26475, -37674, -65328, -88394, -119727, -90893, -106677, -56409, -36103, 53664, 117114, 29605, -34807, -70195, -127624, -86490, -40255, 43547, 70711, -1755, -131048, -113815, -21217, -29301, -72735, -71441, -66992, -138699, -232208, -139679, -155604, -164007, -158868, -114060, -210425, -226598, -79188, -36982, -46208, -74538, -6060, 87952, 114738, 59726, -25454, -88446, -37893, -35434, -56229, 60217, 57521, 23912, -62934, -108747, -121171, -91207]
14761i1207M2769K9741j6544m9257j975M8312N6697K5067j4705o8015N730m933
14749c8320j0649J1335L822K5954L1864K4048K47m3437n8803n664K6773n586P9123
14736D0707L4994J9520m6800K9365j7937L3540O26j07417j986L1247J7698Q930
14724D2487n0599j1303q1368o6253k6290J9305O3878L2416L1414Q873K0259l1140
14712d8321J61788L6860j5884r0635l6953o246n8014q7818l4817M1345L120R1406
14700d4169O0358m5701p1445m9198m0209Q3451J54293O2990o3357N578j9817J1461
14688D4235m170n7496N6427J3782n4886l79L734R9709J02694j33958j77828q479
14676a16615M5826j0653k5321Q0260N5073j6288j4864m6120m2105m3332M1282
$$ y = [-91207, -48438, -18697, -35241, -84498, -86473, -38161, 18536, 43603, 28898, -39117, -33387, -38320, -48969, -37634, -33812, -7858, 24006, 48054, 48301, 4864, -53939, -59603, -32830, -38416, 40707, 75701, 95221, 48421, 77786, 59849, 93389, 94015, -13402, -15388, 15859, 33557, 42487, -8112, -19415, -100783, -167036, -193326, -174021, -110143, -77727, -46313, -37440, -17181, -48321, 113467, 150327, 134443, 43808, 6855, 609, -57405, -145223, -180040, -138695, -135575, -44169, 16189, -29512, -100957, -150155, -190364, -106913, 47380, 110370, 47013, 52591, 32774, 44235, 40065, -17431, 38996, 52778, -2108, -2487, 1247, 100956, 203650, 69692, -108136, -116615, -70789, -81442, -106763, -26503, 28570, 12282, -2582, -48702, -90807, -134139, -92857]
14665i2857J04952k7905K5735n5891P2501k8424r6281j0865m3178k5756M5035
14654a32934o5952m1835P7803k121P5692J10655o6748L8179K4455k9098m8100
14643f0004n458k8216Q8750J18782l1232l5024J9419k6820j10065k2440O7493
14632b4815k6274P487M3512J7609l102j26219m2561J88921R2180j07141o1727
14621d2130l1990O9996p59j16955m7262K555J19182N5265J4974o5762j37598J2700
14609a67784P1458P69J8856m3639m0023R0135Q6411k5836k3334K7063P2443N9621
14597A26140q7700k5118M427m3408r2937o3367M0107L0438k1601M625k2374m1766
14585a92534Q1583L719r401o512O963k5485k1035l5696L6153M7823M5791K3934
$$ y = [-92857, 12095, -15810, 9925, -45966, 26535, -1889, -98170, -109035, -152213, -177969, -132934, -198886, -240721, -162918, -165039, -89347, 21308, -45440, -7261, 17194, -11904, -60004, -65462, -93678, -4928, 113854, 82622, 47598, 67017, 40197, -69868, -92308, -24815, -51089, -43602, -90, 17519, 14417, -111802, -154363, 34558, 126738, 19597, -42130, -74120, -4124, -4883, -121838, -169100, -166545, -47363, 7902, 22876, -42886, -180484, -167784, -96326, -95557, -76701, -120340, -160363, -70228, 16183, -9653, -32987, -5924, 66519, 126140, 38440, 13322, 17749, -25659, -118596, -181963, -141856, -111418, -133019, -128394, -150768, -192534, -110951, -107232, -116633, -123145, -116182, -141667, -162702, -198398, -162245, -114422, -68631, -44697]
14573d4697L3891l4461N2892M8191o9283q952o2496j4690K3922K6234o7600j35704
14561b52753K2496J7487o688J03614M2819k3145K7792j4157M3596J3769k3428
14550d8598n47q8924q0285n0693Q8823J35241J12357m415J6719q0146l1232L3114
14538A414J1342O299m9388M2033N228J7418J5369N792O1260N1301r4227l1095
14526D2746m2891M471M602m2948M930m8116k3469J11449Q8398O484n4818m2766
14514H072L7060O0427N657j9615n1063l0310N1000N672r0140J7373o9481n2013
14502a27361R3530J55425n6789p5659k8476j20135q9543K0023O4520J3764P6587
14491g4114P4923k3798n2728L0124Q098J12472l6679p9844N9692r736K1863K5778
$$ y = [-44697, -10806, -45267, 7625, 55816, -13467, -22419, -84915, -99605, -75683, -49449, -117049, -252753, -230257, -212770, -219458, -115844, -73025, -96170, -68378, -82535, -38939, -25170, -48598, -49145, -138069, -218354, -269047, -180224, -44983, 67374, 62959, 79678, -468, -31700, 1414, 12756, 19055, -30333, 11700, 16928, 34346, 49715, 55507, 116767, 168068, 73841, 42746, -145, 4326, 8928, -34020, -29090, -77206, -100675, 10774, 99172, 105656, 50838, 8072, 45132, 105559, 111216, 91601, 40538, 10228, 61228, 66900, -23240, -5867, -75348, -127361, -33831, 121594, 64805, -10854, -39330, -159465, -249008, -228985, -164465, -150701, -74114, 809, -22989, -75717, -45593, -37495, 74977, 38298, -41546, 18146, 8410, 30273, 56051]
14479E6051n4750k3070P7730K3836m2876l5880l7250l7187N5248P8989p4235n6108
14467f9502p7298n1894Q3169J8458L7583o8052n0937N4015N2018P0565m2102N846
14455c8131m8359k8518j1451J10862R7598L3504J2438k3653o6495o7960r312K3369
14443a6108j14488l1632j0748Q4869M7273K136r098Q490O2556j31911j8557O2710
14431f4508R729O3417N5089O765m4325J0271l5824j6390k2772M9152j1752j128
14419b276R5295N8893L7067j18299j9351o2546j415Q821R2531k8524r4628j28938
14407a63370o2498O3326M9585K9138K6535P8033K4345p293l342M4574k2176q475
14395D8382K698O1907J5132r2184n1992K6601L2058p0752k7004L0419j0332n3657
$$ y = [56051, 1301, -21769, 55961, 79797, 36921, 1041, -36209, -73396, -18148, 60841, -13394, -69502, -146800, -198694, -115525, -97067, -59484, -127536, -178473, -124458, -72440, -1875, -43977, -38131, -86490, -115008, -126459, -15597, 82001, 115505, 127943, 104290, 37795, -30165, -39477, -16108, -130596, -162228, -172976, -88107, -40834, -38698, -47796, -39306, 23250, -108661, -127218, -64508, -54779, 8638, 63727, 70492, 26167, 36438, 614, -15776, -38548, 10604, -1148, -2276, 93019, 151912, 188979, 70680, 51329, -11217, -12632, -3811, 88720, 60196, -34432, -163370, -225868, -162542, -112957, -83819, -57284, 20749, 45094, 37801, 34459, 79033, 56857, 48382, 51080, 112987, 128119, 35935, -16057, 10544, 42602, -28150, -55154, -24735, -35067, -88724]
14383h8724K2894Q6450q8674q0434N0976P3035J940K188R6892j3758j42638M0124
14371c9729Q1241j9388J00754K5455j19619o4402J6108l8167J1776j844K5601
14360b2214J04395l377o2767l0754N0264Q863m6352q5143l2659k8318j2901Q388
14348a52575M520L7706M094n6039K3214M1802O1619l744K1595K9796o4034m1018
14336i3064J7888j1702L546q241K6052l8460R324L5708m6267O2248m719j1340
14324e9027O7236N8510K6749o8334M0603K9068J0341j11788n5447J1234p9121
14313a29976k1134R6865j4923J6317O9341l4507k8431n7165j1287J7373L589o9374
14301a63312j264K6105k4701k7626o033O0095Q8948k0572n3964O2432O4115l8913
$$ y = [-88724, -65830, 20620, -68054, -148488, -97512, -24477, -22537, -20349, 76543, 62785, -79853, -39729, 41512, 22124, 122878, 148333, 28714, -35688, -19580, -57747, -45971, -47815, -22214, 82181, 78804, 16037, -14717, 35547, 44410, -1942, -87085, -119744, -148062, -160963, -152575, -148055, -110349, -106255, -162294, -139080, -97278, -35659, -39403, -17808, 11988, -52046, -93064, -75176, -86878, -83332, -91573, -65521, -103981, -94657, -58949, -105216, -42968, -47687, -59027, 8209, 66719, 93468, 25134, 65737, 94805, 105146, -6642, -62089, -50855, -129976, -151110, -54245, -69168, -52851, 16490, -18017, -46448, -103613, -114900, -97527, -93938, -163312, -164576, -138471, -163172, -190798, -196831, -136736, -47788, -68360, -122324, -59892, 4223, -34690]
14289c4690j8876k1924p41R0419n0852j285P2540k1015N232M9947l1127q8375
14277e0747l1072R1536j10439j25496j1103R0858M7381K8573P2279n9621k7894
14266h5745k993N0277j8866P14l4776j8487M0025P6262o3909j1456K0572m0265
14254h8647k9337P5943M9857P938P072j17699j18021N4018P3122M6714J4148j20400
14242a45292q448L0138N084M1728O0832O0692j15281m768O0788m6105l0175N4605
14230c6202J6562j2296K8577o131r0820L8646k5457j8966M6317k1434m4147J20024
14218e327J13247j32354j08385N1438l0702J2618N5087l0833l585q916L0051M3875
14206a3786p609l4597l2524J5299R4206M474j1168L9074l3193o308M8043m3843
$$ y = [-34690, -53566, -75490, -76231, 14188, -36664, -37949, 34591, 13576, 18808, 68755, 37628, -50747, -81819, 9717, -100722, -226218, -237321, -146463, -99082, -70509, 1770, -57851, -85745, -88738, -38461, -57327, -56613, -91389, -109876, -69851, 6411, -57498, -68954, -48382, -88647, -117984, -42041, 7816, 15754, 22826, -94873, -212894, -158876, -85754, -39040, -24892, -145292, -153740, -123602, -118518, -76790, -15958, 44734, -70547, -75315, -14527, -60632, -90807, -36202, -19640, -31936, -3359, -9490, -100310, -61664, -87121, -106087, -59770, -81204, -125351, -5327, 107920, -24434, -132819, -81381, -112083, -99465, -44378, -75211, -78796, -87712, -57661, -13786, -21395, -55992, -88516, -73217, 20989, 25463, 14295, 53369, 20176, 13868, 61911, 18068]
14194A8068p2441M0119k0969r361l9768l9960O1679l1202J1601k7981k0587L9594
14182i1208P440K3015J1727K5648L9814K9130o3659p129j5297J8087K0913L6125
14170C4606m4055n8004j1903n1592L2602k213N775k4946N4666J03786K908j7599
14158B4031M0015j2667o8271k2066m0851Q1670l1025k636K8703k4873k55P3664
14146D5439R976j19696N8364l3413P5153L5051j49758J3412K1527L9101j4155
14135a8999j5024r2350j37034k9422L3528P1699l0921K816J21597Q6220N6454
14124D8564n5274J7156p245J1110M9098N5465p7749o78l2386r6982l911P2689
14112b0143Q1872n0310n3844J7304j2551L5907L2228L6405Q834l6030J5017J00765
$$ y = [18068, -54373, -14254, -35223, -44584, -84352, -124312, -62633, -93835, -82234, -110215, -130802, -91208, -83768, -60753, -49026, -23378, 16436, 45566, -18093, -25222, -40519, -22432, -1519, 34606, -9449, -67453, -79356, -130948, -98346, -100559, -94784, -119730, -65064, 38722, 41630, 24031, 64046, 51379, -16892, -38958, -79809, 1861, -29164, -31800, -3097, -27970, -28225, 45439, 55415, -64281, -5917, -39330, 35823, 70874, -78884, -65472, -43945, -4844, -18999, -34023, -126373, -263407, -292829, -259301, -187602, -218523, -215707, -94110, -7890, 48564, -6710, 10446, 3201, 14311, 63409, 118874, 41125, 40447, 8061, -88921, -92832, -20143, 61729, 11419, -42425, -25121, -37672, -1765, 30463, 66868, 75702, 39672, 54689, 155454]
14100A55454L9855j7865j04042m7481m8187N235k436K3000M5635K9260l6434k6110
14088A5884o728j2045K8068P0625r6866j3083O2038J4519l6285j3943q6548m8791
14076a23155k9435p913j9090J4619Q2491J17043p9849p2507M2401Q3907K4334
14065C2846l1513l7292N7312P3538l4055n2826o3700m9439K9208P6700J4580n0755
14053c5396O6722j776N1266j6657N839R177o3407k0020n397l2252L833K5101o4845
14040g7812m7208m8071J1268M9435N1750k2330M3016Q0452O337l8772n8069L8940
14028a1064K7023n818k2155k2728M4593N3904K1938n3505M557j320L5110o1546
14016H989j12680J6358l1145O527M5303K0686j9248K0810J9733J2043l7862o6070
$$ y = [155454, 195309, 177444, 73402, 25921, -22266, -17031, -19467, 3533, 49168, 78428, 41994, 15884, 9156, -2889, 25179, 95804, -1062, -14145, 47893, 62412, 26127, 12184, -74364, -123155, -152590, -160503, -179593, -164974, -82483, 34560, -45289, -117796, -75395, 8512, 32846, 1333, -35959, 21353, 94891, 60836, 8010, -55690, -105129, -75921, 779, 15359, -35396, 31326, 29550, 80816, 64159, 69998, 79175, 15768, -4252, -9649, -41901, -38068, -12967, -77812, -125020, -173091, -161823, -112388, -60638, -82968, -39952, 40500, 46837, 8065, -50004, -11064, 15959, 10141, -12014, -34742, 9851, 63755, 85693, 32188, 36745, 35425, 70535, 8989, -103691, -87333, -118478, -111951, -66648, -45962, -65210, -44400, -24667, -12624, -50486, -116556]
14004a16556m0158q2313R7773P4945L3269k9264o2178p6956Q4446J4360l3864
13993a36496L7532k9617p8453K509N4880K4952J06087J8592J7203L9748n2903
13982D034m1848l309l2534L4607j03064j5853O1948J1092m4338J13895L3821k6920
13970h469K9475J3886m9471j31040j17426L0706Q6933N0819L417r809n4477J0612
13958a44844J61124N9991O1625K5846J4216o6367q9092k4563p2703L0867L0921
13947a2979K2629K9209R344r849n4373j629J01085j18929j04897Q8660M4653J5966
13935H890k2288J8110r914l8879k1696k3003l9090O5521O918p2825M4353O746
13923g7157J6689K21N7075J4237m1385j26134l9149q1356O5708N410O4717J08710
$$ y = [-116556, -156714, -239027, -141254, -66309, -33040, -62304, -124482, -201438, -116992, -102632, -136496, -98964, -128581, -207034, -204525, -149645, -124693, -18606, -14, 17189, 56937, 4034, -37814, -41123, -73657, -39050, -142114, -157967, -96019, -84927, -129265, -15370, 18451, -8469, 21006, 34892, -14579, -145619, -263045, -232339, -145406, -94587, -91170, -100979, -155456, -144844, 16280, 76271, 137896, 163742, 177958, 111591, 22499, -2064, -74767, -43900, -12979, 9650, 38859, 48203, 38354, -16019, -17648, 83437, -35492, -140389, -51729, -7076, 8890, -13398, 4712, -5202, -44081, -65777, -88780, -127870, -62349, -55431, -128256, -83903, -77157, -60468, -60247, -3172, 11065, -30320, -156454, -195603, -276959, -211251, -205841, -141124, -32414]
13911c2414R011N4116r1312l9837j9275k7592O1385N8910j6826R3008L5078m7337
13899C6915r3104M700J928o8382j3924R6936j3604l8636L3047R8372L3689L872
13887H1809J8155j0330k5472q0537m9646J11693Q3352l0558K8126q5777o7333
13876b6518l799N184n5838l1020N5856r5532j7955Q6474j3093j9082j9117O7519
13864f6921O6575j2828K4876j7015J6797l1001M9577l1003j7027l471J9616M6035
13852D4210j0694M9556p1590p9107j6758R0677L9101m7520l780j9020p511K0354
13840a2082K651P3617L3121j429R895J5385k1876j27048j54078J45002Q0726L7834
13828H1718N0167j2173p7289n1783k3096J9317o0216l8148O2527j6348P5772P3668
$$ y = [-32414, -23403, 30713, -60599, -100436, -119711, -147303, -85918, -27008, -43834, 49174, 84252, 36915, -56189, -51489, -49561, -117943, -131867, -34931, -48535, -87171, -54124, 44248, 77937, 81809, 99964, 89634, 64162, -16375, -66021, 45672, 129024, 98466, 126592, 40815, -26518, -30317, -25133, -80971, -111991, -56135, -151667, -169622, -83148, -96241, -115323, -134440, -66921, -346, -13174, 11702, -5313, 11484, -19517, 30060, -943, -17970, -21441, -1825, 44210, 33516, 83072, 11482, -67625, -84383, 6294, 45395, -2125, -5905, -24925, -32436, -12082, -9431, 64186, 97307, 95878, 105773, 121158, 99282, -27766, -181844, -36842, 43884, 81718, 131885, 119712, 42423, -9360, -32456, -13139, -73355, -111503, -48976, -65324, 10448, 84116]
13816H4116n676q2345n7125j4640J7279N1662o364J5385O3995N2810q8422n1509
13804b0834n2423O1749P38m2154n614J0174j4105m2688R0722M4645j39180o7177
13792a76147N8894O902J2690K8284O3017k4682m9110n8218k4446J5794M9135Q1716
13780a6171L8632P7844J2505L2545j1430j9187n1210n8324m5380O7099M7198r8233
13768b4112m1376M6866k8954p9641J4055P0744J6712j7892J5242M5985l3612P3015
13756E7032M2722q2568k9485p0303j02646J2480J4310K407J4316L5547L1368Q549
13744f6271l8760J4063J30253J8365p8522j5157J2549j2170P5617j4220j8145
13733G602k4675r7961j9323K6367j5025m713n6624R2693J00919N0280P3319r8209
$$ y = [84116, 78440, -3905, -61030, -75670, -58391, -6729, -13093, 2292, 66287, 119097, 30675, -20834, -73257, -11508, -10770, -52924, -58538, -48364, -62469, -105157, -14435, 30210, -108970, -176147, -117253, -110351, -97661, -69377, -6360, -31042, -80152, -138370, -162816, -147022, -97887, -16171, 22461, 100305, 112810, 145355, 133925, 114738, 63528, 5204, -40176, 26923, 74121, -24112, -65488, -18622, -47576, -127217, -113162, -42418, -25706, -43598, -28356, 17629, -15983, 57032, 99754, 17186, -12299, -82602, -185248, -172768, -158458, -156051, -141735, -106188, -74820, -66271, -105031, -90968, 39285, 57650, -20872, -36029, -23480, -35650, 39967, 25747, 7602, -17073, -115034, -134357, -107990, -123015, -127728, -184352, -91659, 9260, 59540, 132859, 34650]
13721C4650o3310N7621k0869r7900K7101l0179q5140j135J7759L3751m377m9052
13709a81080J412N9199K1776L1409l0337M8475K380L6025p0268j9717P364o336
13697i9698K9484Q4178R4111M652m3537o590r884n5842j0569R11K6537K5802J6502
13684E6057k8789K5219j11394M4347O855K1678q426K6236k6483Q3368j6589r8101
13672b6022j6734K1231m7260J6211O522p7877R9832N7307l9327q7643r946j512
13660a05218N314M7178k3694j837r006j9204k8354N1049N3247K0183Q3545o3305
13648I898n3146o9486l2894l4597L0183K3196o7750O104Q1560N7078N8539J0780
13636A9465l7660m5069k775K8342o089K5980k664O0390j06630k1064J1363j8360
$$ y = [34650, -28660, 28961, 8092, -89808, -62707, -92886, -178026, -179161, -161402, -127651, -132028, -181080, -179668, -120469, -98693, -67284, -97621, -49146, -46766, -10741, -81009, -100726, -93362, -99698, -70214, 13964, 108075, 112727, 69190, 62600, 52716, -3126, -13695, -12784, 13753, 39555, 56057, 27268, 52487, -58907, -14560, -7705, 13973, 5547, 31783, 5300, 88668, 72079, -26022, -42756, -21525, -68785, -52574, -46052, -123929, -24097, 33210, -6117, -93760, -103706, -105218, -99904, -52726, -76420, -78257, -87263, -106467, -134821, -83772, -30525, -10342, 73203, 9898, -43248, -112734, -145628, -180225, -150042, -126846, -194596, -188492, -106932, -49854, 8685, 19465, -18195, -63264, -66039, -37697, -43786, -17806, -20470, 39920, -66710, -87774, -76411, -94771]
13624i4771K0329O6543J0492k991R2873j2481m1818r4303j8880R0439M9751k4935
13612D0248k1089K4335L0996p1784K1134Q960M6850M6135m5587j15945M7568J00101
13600A11922L5354M9200J4348o2808o530n4357j18476m372L8086j8691j6337L7889
13588E228J9774l8299j2039k7903m4183L2318Q3486l9113k9925O9300n910R754
13576B2488j0924q1172J5694R2833p1051j4582J9625J4296K950k9514M5821P978
13564A4442K9988j3652r6737j878q453K2979L7488O3611k1505K106o2105o9877
13552a03593K496O0587M8369Q692n2774o2212J3578O631j02875j4580K4786N6464
13540a14431J5951K7126R868L1060K2016N5324q872p2448q3282K1624k547O7524
$$ y = [-94771, -74442, -7899, 2593, -398, 92475, 79994, 38176, -56127, -75007, 15432, 65183, 40248, 19159, 43494, 74490, 2706, 23840, 32800, 79650, 125785, 80198, -35747, 11821, 111922, 147276, 196476, 210824, 148016, 141486, 87129, -31347, -35719, 2367, -16324, -32661, 5228, 25002, -13297, -25336, -53239, -97422, -65104, 18382, -20731, -50656, 18644, 12734, 22488, 11564, -69608, -53914, 38919, -32132, -46714, -27089, -12793, -9843, -39357, 6464, 14442, 44430, 30778, -65959, -67837, -76290, -53311, -15823, 47788, 26283, 28389, -33716, -103593, -101097, -40510, 7859, 16551, -36223, -98435, -84857, -78226, -181101, -195681, -170895, -114431, -98480, -71354, -61486, -30426, -8410, 46914, 38042, -34406, -117688, -96064, -98611, -31087]
13528c1087O0354k4545n143R6389O9470l7397J8364o4790J4572L7251o4106j35098
13516f5766R668K2894J8947J44574o253q2119P20m1726o9847n2703J11806J4814
13504E009J8029Q8611J4549j50189r3428L1153L9395L9959K3817K461l4835k1060
13492c6529j3189j702K2113o2283L0689Q2930M3431m9939j8609R5748M2711q871
13480A26500m4814m4360L23j17397R2537k8120m8271n8812L668P4528L3113K7149
13468A6044j7838l2036m4704m2443O9782K6457O7896Q6842K7921J6594l8983j50034
13456a4502m3761P0864k0407n5377j5707J2259n4581K2972R5033L6341l8114J9991
13444A5011J7772J2257j8141p6817m2211L5887j9970j9218p017N7706K2344k2121
$$ y = [-31087, 29267, 4722, -421, 95968, 165438, 128041, 146405, 81615, 96187, 133438, 69332, -65766, -56098, -33204, -14257, 130317, 124064, 41945, 42665, 939, -68908, -121611, -9805, 5009, 23038, 111649, 126198, -23991, -117419, -86266, -46871, -6912, 16905, 19366, -15469, -36529, -49718, -51420, -29307, -91590, -60901, 22029, 65460, 15521, -3088, 92660, 135371, 126500, 81686, 37326, 37649, -79748, 12789, -15331, -63602, -122414, -118746, -44218, -11105, 16044, -1794, -33830, -78534, -120977, -51195, -24738, 43158, 130000, 157921, 174515, 135532, -14502, -58263, 12601, -7806, -63183, -78890, -66631, -121212, -98240, -3207, 33134, -4980, 15011, 32783, 45040, 26899, -49918, -92129, -56242, -76212, -95430, -102447, -44741, -22397, -44518]
13432d4518J06327N0702k5560q3668j6468M898K8727K4732O736l7607k3190l778
13420a2667Q735L340k5162n3135K466m8902p0911J05654J26539j280l6179j3795
13408a5297P897O0757O9014q991R820n9949p0505m4070J8923L1019J2327k7398
13396a6453L1130L3527j02096j03449M3862J12373Q8745L682r374k6080l0090
13385B5777n4443n436J16146l3426j5962J0n9402n2827o463n741K5350k2206o6191
13372a54814n680N1204j1363p5766r684J66216N0305M3265K408K0001k8816L332
13360E0608K9945k9197j7169p183r1058k6791l065L217K5261k7044M6883J12526
13348F6933l7810p8870p7216q573J3674O9348j2915q4939n9961Q5279N4901P4084
$$ y = [-44518, 61809, 112511, 86951, 3283, -13185, -8287, 20440, 45172, 51908, 14301, -8889, -12667, -3932, -592, -25754, -78889, -76423, -125325, -196236, -90582, 35957, 34677, -1502, -15297, -7400, 53357, 122371, 113380, 123200, 63251, -7254, -51324, -32401, -1382, 10945, -16453, 14677, 48204, -53892, -157341, -113479, -1106, 87639, 91321, 81947, 55867, 25777, -28666, -34102, 82044, 48618, 32656, 32666, -26736, -79563, -86026, -91767, -66417, -88623, -154814, -160494, -109290, -120653, -196419, -206103, -39887, 10418, 53683, 56091, 76092, 47276, 50608, 80553, 51356, 34187, 27004, -64054, -90845, -93910, -90693, -65432, -92476, -45593, 66933, 29123, -49747, -126963, -135536, -121862, -52514, -65429, -150368, -210329, -125050, -70149, 3935]
13336C935J112q418j6615r902K2178j5024m4444l0935k251l292O4912L6605j2852
13323a4991q5656l6134l2521J05624J6305l5948k8668J4606P1622N5386K5725
13312E5350k5122J8596K1015O458q5766m8460J06789L0388m9095O5032o6609r4616
13300f6040K9556M221n0872K0561P0384Q2542j4647k1286m3034k9951M6817k8054
13288A97j7253o2163l2274M5972M9437N6960m7707j12814j1589R3469K3549M5670
13276C1454J0462N6157O2325K0270o5935q0875l4740q777j3995K1711N1370Q873
13264E8300j7085l5186n0736n6223M3584j3340K1981P2742p7004N371l4408o3275
13252a45279M212O8128N9857p638k552O0480J2752m7557m00K8225M9864k9608
$$ y = [3935, 5047, -3371, -19986, -29888, -7710, -22734, -67178, -98113, -100364, -103656, -38744, -2139, -14991, -100647, -136781, -169302, -63678, -47373, -83321, -111989, -97383, -25761, 29625, 55350, 30228, 48824, 69839, 76297, -9469, -57929, 48860, 79248, 30153, 95185, 28576, -66040, -36484, -32263, -83135, -62574, 7810, 90352, 75705, 54419, 11385, -18566, 28251, 197, -17056, -79219, -111493, -65521, -16084, 40876, -6831, -119645, -131234, -37765, -14216, 31454, 41916, 98073, 160398, 180668, 114733, 33858, -882, -9659, -23654, -1943, 49427, 58300, 41215, 6029, -44707, -100930, -57346, -70686, -48705, 24037, -52967, -47596, -82004, -145279, -141067, -72939, -13082, -20720, -23272, 37208, 49960, 2403, 2003, 30228, 80092, 50484]
13240E0484O5282k5535k0643N2261J8338K2437j7809l5470J6021n0746q0753p0324
13228g6457k4606j9140J18595o638L591p388K2453l052n61N0762L5008k1381j89050
13215a17864j08550J07376Q1390q689o45n1568J4283J07188o644n1218o7928K6036
13203g6833M5546N8567o0260j2624K5405J15620O5647o0571r5572J1236m348n8307
13191d6494K2286o827q8592J30600J34695m8283j12694J7116Q0324q1534j7206
13180a6609K5943R6961Q9075o7285n3549M7641J5203J4297k4052K4472k6875j16516
13168H706K2830r5784J4777J4468m187j7664m393k6615q173M939J1201Q765j3574
13155h4704O770L3630O5911pm5255m8507K4574M7572N7056n6527r9221l5234k1691
$$ y = [50484, 115766, 90231, 69588, 121849, 140187, 162624, 144815, 109345, 125366, 74620, -6133, -76457, -101063, -120203, -1608, -8246, -4655, -12043, 10410, 7358, 6797, 57559, 92567, 71186, -117864, -226414, -119038, -37648, -46337, -46982, -98550, -84267, 22921, 16277, -34941, -102869, -76833, -31287, 27280, -32980, -45604, -20199, 95421, 161068, 100497, 4925, 16161, 11813, -46494, -24208, -31035, -119627, 10973, 145668, 97385, -15309, 1807, 82131, 597, -16609, 9334, 106295, 195370, 128085, 74536, 122177, 137380, 151677, 127625, 152097, 125222, 8706, 31536, -64248, -49471, -35003, -39190, -56854, -61247, -87862, -96035, -91096, -79895, -71130, -84704, -77934, -44304, 21607, 21600, -23655, -72162, -47588, -16, 57040, 513, -98708, -133942, -155633]
13142a55633O659J04139N4491L0325p1549k5444J21633n340n1062l3210l0503
13131e5494n0552N2018J17851J0859J33169J46875N9782O2115P4742J53708L22715
13120A027788K83234J62245J7603k00944k50919j71513m3979j78206j51286j52121
13110C41902j14621l7983P8795Q0989J31479L2687r8142n8146P765R807J17683
13099D92215Q4323N1443J34895R4379J06641N0497O3103J86292K15029J51391
13089A630208J8870j3040l9117o3683j48907j90441m4760p0296j87110p5479M989
13078H21234j1972k0022l6993j49110q0617n9016j6888k5653p6779n0541O5095
13067C58738M411L3454p356K8351J724J04707J88049K39026J98444K68673K24128
$$ y = [-155633, -148974, -44835, 9656, 39981, -31568, -57012, 64621, 59281, 8219, -24991, -55494, -106046, -54028, 63823, 74682, 207851, 354726, 414508, 476623, 551365, 705073, 1027788, 1311022, 1473267, 1490870, 1289926, 1039007, 867494, 823515, 645309, 494023, 341902, 227281, 189298, 268093, 349082, 480561, 513248, 415106, 356960, 364725, 374532, 492215, 576538, 627981, 762876, 857255, 963896, 1014393, 1077496, 1263788, 1478817, 1630208, 1649078, 1636038, 1596921, 1533238, 1384331, 1193890, 1149130, 1078834, 891724, 816245, 821234, 809262, 789240, 752247, 603137, 522520, 463504, 446616, 420963, 344184, 293643, 358738, 363149, 396603, 389247, 417598, 419322, 524029, 712078, 951104, 1149548, 1418221, 1642349]
13056A642349N0951j27555k05851k20056k19197k11123j18319o4492o6667l224
13046D56816Q543m4649K987l5717j17365m1393n8245n7872l1099N5537K0101m7507
13034A10137k3648R3172j1848n8835J5857k4641j22690o0793N6338K2114L0341
13023B5504P4306L3541k1604j5578J9290J1314K9717k1569K7155o1986L0455M1328
13011A71873L4316l2364r892O872j03616n1423K9694o373M5975J06611L2308n403
12999B18578m1801q0969k645O055q449O1442L0306q0655o3132m0297N803P4763
12987G8999K2384j26215l7056P0794M3787J00094p2832K671Q5925J5465n653q670
12975A69693m5449l2735Q410M1016m4504J9106k8668o5271j4100M6380O7336J3641
$$ y = [1642349, 1693300, 1565745, 1359894, 1139838, 920641, 709518, 591199, 526707, 460040, 456816, 465359, 420710, 423697, 387980, 270615, 229222, 170977, 113105, 82006, 137543, 157644, 110137, 86489, 179661, 167813, 108978, 124835, 100194, -22496, -83289, -26951, -4837, 25504, 99810, 133351, 111747, 96169, 115459, 126773, 156490, 134921, 162076, 100090, 130545, 171873, 206189, 173825, 163933, 170805, 67189, 15766, 45460, 39087, 85062, 191673, 223981, 218578, 176777, 95808, 93163, 99218, 90769, 152211, 182517, 101862, 38730, -1567, 4236, 78999, 101383, -24832, -61888, 8906, 52693, 152787, 79955, 82626, 168551, 184016, 178363, 169693, 124244, 91509, 99919, 140935, 96431, 115537, 86869, 21598, 7498, 53878, 121214, 134855]
12963A34855l301K0159l0756m9232j455k4013k2024O808k0059J0847q7259N949
12951e9481l834q336J73128O8596j21567k4654P6381J2576m7614N4055L8029K7368
12939A84647J9827o5279k7245K6157o1258j11230K4418J8226R8825N2350m366
12928A55072j02007J0016N7202M0448j2984l1884q990k41n0242L926L1431J4864
12916A06611n9427K1997m8428m087J2336k7125J05182J01480L3482M75n5303o0761
12904A26432J6915n0209p7467P4219J71254Q8500O083r008p2769k6270P512P119
12892B62311p389N41k4832P567j0464L2762O8503J7680o173j00135k9661Q2815
12880B93525L5801n8916j648M9836L2498J359j25494j10193o023j9820l4527k7584
$$ y = [134855, 131554, 151713, 120957, 71725, 70270, 46257, 24233, 31041, 10982, 21829, -65430, -59481, -63315, -71651, 101477, 170073, 48506, 23852, 100233, 112809, 65195, 119250, 157279, 184647, 204474, 139195, 111950, 138107, 76849, -34381, -9963, 8263, 107088, 159438, 155072, 53065, 63081, 120283, 160731, 147747, 115863, 106873, 106632, 56390, 60316, 91747, 106611, 47184, 69181, 20753, 16666, 29002, 1877, 107059, 208539, 242021, 242496, 187193, 126432, 143347, 93138, 15671, 89890, 261144, 349644, 355727, 346719, 273950, 247680, 255192, 262311, 254922, 255463, 230631, 238198, 227734, 260496, 328999, 346679, 340506, 240371, 210710, 293525, 329326, 270410, 268762, 318598, 351096, 352455, 226961, 116768, 110745, 90925, 56398, 28814]
12868B8814K8382J60284J46844M1488l2423p430p7945K4794O8303j3756m937J1771
12856C74189l3417j1785p4714J10843M8161n1781k9387o6812k7865o2750j411
12845A73271j9732r428N6129J32994K7906j18851j074R729n1604j21850k6453
12834E1037k317j847J7842J2146n5357l3499L8356Q7983J06625O6875P3519J19251
12822D80614K03038J18958m157j63159k11831j99389q3916j3854q913L3137L1599
12811A82127J7419l6084j02277m3938j2294J01808r70o5446K5829J31149J1052
12800B08375n4674n505M8770R1127J12612J12780J28422J63901K3617j2652J0711
12789H27484r34j6197j0245l8253n4697q4373l0440l9855j14783N4925q191j2210
$$ y = [28814, 57196, 217480, 364324, 405812, 373389, 365959, 288014, 312808, 381111, 367355, 362418, 374189, 340772, 328987, 254273, 365116, 413277, 361496, 332109, 265297, 237432, 174682, 173271, 153539, 144111, 200240, 333234, 361140, 242289, 241215, 250944, 199340, 77490, 51037, 48720, 46873, 64715, 76861, 21504, -11995, 26361, 114344, 220969, 287844, 361363, 480614, 683652, 802610, 798453, 635294, 423463, 224074, 140158, 126304, 117391, 150528, 182127, 199546, 163462, 61185, 17247, 4953, 106761, 105791, 40345, 66174, 197323, 208375, 153701, 148196, 196966, 288093, 400705, 513485, 641907, 805808, 829425, 816773, 827484, 826550, 810353, 800108, 761855, 707158, 622785, 592345, 552490, 437707, 492632, 484441, 472231]
12777D72231l2392k3419k5107Q240l0804K9512P9120M6973R8082p1299n2298O9365
12765E68204Q7875N7208L9350l9845r9472K5051P6810M2692p19Q222L4117K3185
12753H22678O9267J10557q8532o3999L7119L250k9803J0980l3942k9159P7070
12742H85486m1549n381K3811k8737o607m1644P166J05680J39820J21617L7729
12731A197391k3976L4283M6605L9714n1107m3372O8827M2580N2750j7476q9459
12720A256760P9937O8708J27422J58228J8116q5728M1139J17809J01282R0500
12710A974173R5604R9267Q9760M0783R1509J02670Q1484J41391J75852J25485
12700C017978J37671L4889M4156J39587J91500K87835L31593L89960M20094M90243
$$ y = [472231, 439839, 416420, 391313, 399553, 368749, 398261, 477381, 524354, 622436, 551137, 498839, 568204, 656079, 713287, 752637, 712792, 613320, 638371, 715181, 757873, 757154, 765376, 799493, 822678, 891945, 1002502, 913970, 849971, 887090, 890340, 860537, 871517, 837575, 808416, 885486, 843937, 838556, 862367, 833630, 827023, 785379, 792545, 898225, 1038045, 1159662, 1197391, 1173415, 1207698, 1254303, 1294017, 1242910, 1199538, 1268365, 1310945, 1363695, 1346219, 1256760, 1336697, 1405405, 1532827, 1691055, 1709171, 1623443, 1664582, 1782391, 1883673, 1974173, 2069777, 2169044, 2258804, 2299587, 2391096, 2493766, 2575250, 2716641, 2892493, 3017978, 3155649, 3190538, 3234694, 3374281, 3565781, 3853616, 4185209, 4575169, 4995263, 5485506]
12690E485506M90869O07735Q30682R62811J065087J202568J312102J487731J702027
12681A5147118K218678K675231L395824M429913O055385Q406366J1863980J6841683
12673G1034178K3999688L3177130M2392101M6203419L7390976J4411727j3621698
12666B54987521l4232099m0849780l6879897k8855566k0920961j4368254r178951
12659F9702013n250605k060330O63212L146011N345894P155828P684586O336695
12651I2723304M188321L102937M827092R629485J5502795K0176035K2340241K1978313
12643A94468523K1387964K2933015K7703428L2077011K8865114J2716663j2003490
12636C28148228l2653559l9865449l4430105k3928481j4388769p511968l444124
$$ y = [5485506, 5976375, 6584110, 7414792, 8377603, 9442690, 10645258, 11957360, 13445091, 15147118, 17365796, 20041027, 23436851, 27866764, 33922149, 42328515, 54192495, 71034178, 95033866, 128210996, 170603097, 216806516, 254197492, 268609219, 254987521, 220755422, 179905642, 143025745, 114170179, 93249218, 78880964, 69702013, 64451408, 62391078, 63054290, 66200301, 71546195, 78702023, 86386609, 92723304, 96911625, 100014562, 104841654, 114471139, 129973934, 150149969, 172490210, 194468523, 215856487, 238789502, 266492930, 298569941, 327435055, 340151718, 328148228, 295494669, 255629220, 221199115, 197270634, 182881865, 175369897, 171925773]
12629A71925773k342952m068634p870743j1893421j3683563j1746481p248563
12622A13071416l150175j567426l099909n484374o546656n461531l136097k13603
12614H4411645L383552Q480372J5386669K4703484L6389859M8026916N4433047
12607B75215544M8860087K6328168q441058m0909529n7249707n5661137m4636633
12600A43505735l3042939k3984023j7136385j2198893q797654o690562n192862
12593C6462417l970409l164426k401785j931560j748491j701844j684278j537025
12585A8322599j439538j295183j157472j058252r03135q04229q79300p42494o05744
12576I437252o38709o39090n35132m54909k68727k81821l00124k07295k65515
$$ y = [171925773, 169582821, 165514187, 157643444, 145750023, 132066460, 120319979, 113071416, 109921241, 108353815, 105253906, 99769532, 93222876, 87761345, 84625248, 84411645, 87795197, 96275569, 111662238, 136365722, 172755581, 220782497, 275215544, 324075631, 350403799, 341962741, 301053212, 243803505, 188142368, 143505735, 110462796, 86478773, 69342388, 57143495, 48345841, 41655279, 36462417, 32492008, 29327582, 26925797, 24994237, 23245746, 21543902, 19859624, 18322599, 16883061, 15587878, 14430406, 13372154, 12469019, 11664790, 10785490, 10042996, 9437252, 8798543, 8159453, 7624321, 7169412, 6900685, 6618864, 6318740, 6111445, 5845930]
12567E845930k92120k50096r5889j73831k82856k31305j45072l27924k71544k16908
12557C558385k14417p6889m5442j35406j44976j21476j97653j28024j11873j0434
12547B371795J2583k6232o5405n9758K1943J8967j05407j8306L3856O00o5996
12536B118640O184j00358m7687J5665j79977j49615m8102j25973j15239r965o3971
12525A299602q6727O8876K0130O0201M8026k0978j33372r2454r1314n14N5450
12514A126926Q0252M4623j06640m3195m4399J4280L5470l5360n5002l1017k8676
12503I57262k4013p3495j7029P9411N0951R570j426O922N6814M5155K0649n6507
12491A054264M1504Q9735J16940J02995K79917J43429P5516J08618J54575K5101
$$ y = [5845930, 5553810, 5303714, 5207825, 5033994, 4751138, 4519833, 4374761, 4046837, 3775293, 3558385, 3343968, 3267079, 3221637, 3086231, 2941255, 2819779, 2622126, 2494102, 2382229, 2371795, 2384378, 2358146, 2292741, 2232983, 2254926, 2273893, 2168486, 2150180, 2184036, 2184636, 2118640, 2124824, 2024466, 1976779, 1992444, 1812467, 1662852, 1614750, 1488777, 1373538, 1363573, 1299602, 1212875, 1281751, 1301881, 1362082, 1410108, 1389130, 1255758, 1163304, 1071990, 1071476, 1126926, 1207178, 1251801, 1145161, 1101966, 1057567, 1071847, 1107317, 1071957, 1016955, 985938, 957262, 933249, 859754, 842725, 922136, 973087, 982657, 981231, 988153, 1044967, 1090122, 1110771, 1054264, 1095768, 1185503, 1302443, 1405438, 1685355, 1828784, 1904300, 2012918, 2167493, 2192594]
12481B192594k09599k72487j53447j70709k18838m9851K6646j9930j06203r4026
12471I24150O3845q55o4093K6562m0391o2256n0151j2815l8958j1836q9068n4480
12459E89654L2523k592l3954p9007r6077Q916J6653J4278J70887J2398M7886K0019
12447G01584K2229L138p8682n0312m7082k9538N0158o0160l7199K1905L0314M3481
12435E69836j0768l5362j6008l1865L3891k986n4648k105n9369O372N7557n9800
12423C94745m7519M6544N3279J60510J40149q9398l7222O4434M8171j85l6446
12412F97062o8775j60781j06150M4220N7354l3070N909Q3569J1614k8553j4224
12401D88175M1473N330p6258Q2657K8994j9699k7575p7831K5790p940o6637j9070
$$ y = [2192594, 1982995, 1710508, 1557061, 1386352, 1167514, 1117663, 1144309, 1124379, 1018176, 924150, 987995, 987140, 923047, 949609, 909218, 846962, 796811, 783996, 745038, 733202, 644134, 589654, 622177, 619585, 585631, 506624, 410547, 419463, 436116, 450394, 621281, 633679, 681565, 701584, 723813, 726951, 648269, 597957, 550875, 521337, 571495, 511335, 474136, 496041, 526355, 569836, 559068, 523706, 507698, 475833, 509724, 506738, 452090, 449985, 390616, 396988, 454545, 394745, 347226, 393770, 447049, 607559, 747708, 658310, 621088, 685522, 733693, 733508, 697062, 628287, 467506, 361356, 405576, 462930, 429860, 435769, 519338, 530952, 502399, 488175, 529648, 534978, 458720, 541377, 570371, 550672, 523097, 445266, 471056, 463116, 396479, 377409]
12389C77409M1170J1743p464P2155P278j6168M1096m6479n9357N0250r021J362
12377D63974k5792k6143L6380K9118L3042K8056M0499j15534p3311J266J22675
12366E14230O1678n4869M3694L1715k7630M27j2439N3613j3944k7364n0585K8613
12354E47139K7047L5593N7309j17515j10015N5881k1304k6614J1114L4595q9482
12343D03748l1578L8792k2057j6246N1815J6666l9243l4244J7813L6354P4983
12332D96803L0083k3013p1961l7440N1567M3156j54093q1311N19L3736J007K0855
12320C09908k7141m838L0323P4233M1764M849l4038M5101K0116L0883L7299o6189
12308D62270r727P4950J2583N848j5621p290K4850q0097m5359k5321k2349j8278
$$ y = [377409, 418579, 430322, 422858, 495013, 502291, 486123, 527219, 480740, 421383, 471633, 462612, 463974, 438182, 412039, 448419, 477537, 510579, 538635, 579134, 463600, 390289, 391555, 514230, 575908, 521039, 564733, 596448, 568818, 569245, 556806, 610419, 596475, 569111, 518526, 547139, 574186, 609779, 667088, 549573, 439558, 495439, 474135, 447521, 458635, 493230, 403748, 372170, 410962, 388905, 372659, 424474, 441140, 401897, 367653, 385466, 421820, 496803, 526886, 503873, 431912, 394472, 446039, 489195, 335102, 253791, 254310, 288046, 289053, 309908, 282767, 277929, 308252, 382485, 424249, 429098, 395060, 440161, 460277, 491160, 528459, 462270, 452543, 527493, 540076, 545924, 530303, 523013, 547863, 467766, 422407, 397086, 374737, 356459]
12296C56459j5323Q3021P6706J6214O1746J28249K21449L18510K42873J63191
12286A653095J24800J41086l445k8615j68296k47440k08620j25524m2290o6471
12276A028280l6767j16628o4560r2371o9098M123Q1080k9210l8378K636R6285
12265G65392j04486p6684N832N9843j2509J7434J19302J19177L3908l4399l0567
12254H62243J17462O3952l489J2259k4335j6566N843J9544l7628l8379J1582n592
12242I66896L6187m8893l6297K0863m2115M7635J30054R1311R396n7380M0582
12231A158239k5214J1982J48822J50569Q2490P2503M520J5724m0296N4857L5729
12220A669925o5140L2489K0703M2759O6095J29071k9844j7668M7212J16195J59712
$$ y = [356459, 341136, 424157, 500863, 517077, 578823, 707072, 928521, 1247031, 1489904, 1653095, 1777895, 1918981, 1915536, 1886921, 1718625, 1471185, 1262565, 1137041, 1094751, 1028280, 991513, 874885, 810325, 717954, 648856, 652979, 734059, 704849, 666471, 669107, 765392, 660906, 584222, 590054, 649897, 637388, 654822, 774124, 893301, 927209, 892810, 862243, 979705, 1043657, 1040168, 1052427, 1028092, 1011526, 1017369, 1036913, 999285, 960906, 972488, 966896, 1003083, 954190, 917893, 938756, 896641, 944276, 1074330, 1165641, 1175037, 1117657, 1158239, 1133025, 1145007, 1293829, 1444398, 1526888, 1599391, 1603911, 1619635, 1579339, 1634196, 1669925, 1604785, 1637274, 1657977, 1700736, 1766831, 1895902, 1866058, 1848390, 1895602, 2011797, 2171509]
12209B171509J32722M2587J5241J18759J20392J42587R2322Q6232J20321K09353
12199C252025K63313K01513K29055J89090R6888K8452N9969K03703L09130J96104
12189E029242K73065M01718L34887M11251N24546O29347P42667Q06894J008578
12180A0162195J190204J405142J852544K227773K650086L345797M102976M950092
12172C1886809O159334Q025898J1001177J5842323K2903606L2971081M4678105
12165A73468333N4457094N5571767M1768111J4060383j7671634m1054880m9812373
12158B30786801m6242998l6551872k6177008j7471854j0489814n031756n55041
12151H8266458K992422M790856M382945J888884l90858m63745K124580O557445
$$ y = [2171509, 2304231, 2346818, 2362059, 2480818, 2601210, 2743797, 2836119, 2922351, 3042672, 3252025, 3515338, 3716851, 3945906, 4134996, 4231884, 4260336, 4320305, 4524008, 4833138, 5029242, 5302307, 5704025, 6038912, 6450163, 6974709, 7604056, 8346723, 9153617, 10162195, 11352399, 12757541, 14610085, 16837858, 19487944, 22833741, 26936717, 31886809, 38046143, 46072041, 57073218, 72915541, 95819147, 128790228, 173468333, 227925427, 283497194, 325265305, 339325688, 321654054, 280599174, 230786801, 184543803, 147991931, 121814923, 104343069, 93853255, 88821499, 88266458, 91258880, 96049736, 100432681, 102321565, 101930707, 101466962, 103591542, 110148987]
12143A10148987J1519287J5201582J5980198J2671693O252438L05590j215662
12136A70864113L378556J3047038K4294258L3178229L5740755K9304115J4536703
12129C24343767l242332j6896316k2869383k3230376k2453488k2857105k4048487
12122A88746280k4039602k1767610j7278495j2051478p206077l906843l022136
12115I9474039m511587o938142q226479p451722m880878j871665J147263M063198
12107G0804027P697621J2402399J8626610K6143060L3785351L8876930L5915942
12100B44251940K0489846m511313k8416677m1242630m1093726l3985060k5620368
12093H9872012j8598148j3326158r627088p150439n691412m616492l863271l266954
$$ y = [110148987, 121668274, 136869856, 152850054, 165521747, 171774185, 172079775, 170864113, 174242669, 187289707, 211583965, 244762194, 280502949, 309807064, 324343767, 321101435, 304205119, 281335736, 258105360, 235651872, 212794767, 188746280, 164706678, 142939068, 125660573, 113609095, 106403018, 102496175, 99474039, 94962452, 88024310, 79797831, 72346109, 67465231, 65593566, 66740829, 70804027, 78501648, 90904047, 109530657, 135673717, 169459068, 208335998, 244251940, 264741786, 260230473, 231813796, 190571166, 149477440, 115492380, 89872012, 71273864, 57947706, 48320618, 41170179, 35478767, 30862275, 26999004, 23732050]
12085B3732050k622183k280842j876664j592521j359185j095399r64578q88759
12077A1051919p33760o55020o64839o79746m47368m49640l78471m40746m15920
12068F186409l33829l34935k83116k22159j85126j69726j78323k58945j70173
12059D050077j69356k69199k57217j95025j45993j54156j29511j14176r6785k5352
12049B493307n0371j3691K5281j22314m2245O671n8101n3854q9248j24893j7491
12038A953051P945o4869j06800o1062r4584m9122m3534m2669k9462j4545q410
12027A445939l0144r9980l4258n4246l0482l5877J2506M9747L1440k121K147m1060
12015A213611k0373j743J6627l3922O149K1388p4396r1363P4883J7066J7819j13220
$$ y = [23732050, 21109867, 18829025, 16952361, 15359840, 14000655, 12905256, 11940678, 11051919, 10318159, 9663139, 8998300, 8318554, 7871186, 7421546, 7043075, 6602329, 6186409, 5852580, 5517645, 5234529, 5012370, 4827244, 4657518, 4479195, 4220250, 4050077, 3880721, 3611522, 3354305, 3159280, 3013287, 2859131, 2729620, 2615444, 2518659, 2493307, 2442936, 2429245, 2454526, 2332212, 2289967, 2296638, 2238537, 2184683, 2095435, 1970542, 1953051, 1960996, 1896127, 1789327, 1728265, 1633681, 1584559, 1541025, 1498356, 1468894, 1454349, 1445939, 1415795, 1315815, 1281557, 1227311, 1196829, 1160952, 1173458, 1223205, 1254645, 1252524, 1254671, 1213611, 1193238, 1191495, 1208122, 1174200, 1180349, 1201737, 1127341, 1035978, 1110861, 1127927, 1145746, 1032526]
12003A032526l1173M9478N0260Q946j2432j6979j4587j3064J7270o6358o0838
11992I43049p68l1585j1917N5412M0515q4974o0380R244m0662j13193j297J6106
11980G19550J04991R9914O2361O5187L0585M2698n729K6358L9908n8092p5621
11969A052110j04111l2976J7474k0172n2045p2332j7812m773L6493J9475j06644
11958G14687p1484n3508j3816J6550p2726q057M5036q8967J3283M4767J5444j00612
11946D40597j9497O6601O5984L1794J28065J18927P382l3634l8816j37646o3077
11935E66680j23761r847l1881K1275J14158q819r0912L677K8884K5454M4837p3552
11923D66193k4721o3893j4789K5864J1104j08764j2288J73542O3104o9121Q453
$$ y = [1032526, 1001353, 1050831, 1101091, 1110037, 1097605, 1080626, 1066039, 1052975, 1070245, 1003887, 943049, 942281, 910696, 898779, 954191, 994706, 909732, 849352, 858596, 817934, 704741, 703444, 719550, 824541, 924455, 986816, 1052003, 1082588, 1125286, 1119557, 1145915, 1185823, 1127731, 1052110, 947999, 915023, 932497, 912325, 860280, 787948, 770136, 765363, 801856, 821331, 714687, 643203, 589695, 575879, 592429, 519703, 511646, 556682, 467715, 480998, 525765, 541209, 440597, 421100, 487701, 553685, 585479, 713544, 832471, 839853, 806219, 767403, 629757, 566680, 442919, 433072, 401191, 422466, 536624, 527805, 436893, 440570, 469454, 494908, 539745, 466193, 441472, 377579, 362790, 388654, 399758, 290994, 278706, 452248, 515352, 446231, 454684]
11912D54684J2201R921P4934j1546l9229p1m3962K8648J9875k7036l2722k2530
11900D23167J4103j1666o4622k1882k0151p2688N6559N7081O6923q077j1294N8082
11888D65535J0358p9116q6552k871j0415m500K2276P9155M2428m6911j01960L7876
11876C25303L3890q8759Q6602j8153r5294m2506P1723J35334J3639j01583P629
11865C27825N3408m1540j21755m9056j0139R436Q4872m6313j9716o010O7210Q2764
11853C30986M3805L6274l5185o743j4416k5440m673P147n9173j9122M3252K04
11841B96916O7332R8343p6690r5352k3453o0688j7755n958k4616J54994Q0073
11830C93146P4676j02636q0905m9000O1371J1798J2788K5840l9701j25658K4059
$$ y = [454684, 466885, 476806, 551740, 540194, 500965, 500894, 456932, 485580, 505455, 478419, 445697, 423167, 437270, 425604, 360982, 339100, 318949, 246261, 302820, 359901, 426824, 418747, 407453, 465535, 475893, 396777, 310225, 307354, 296939, 292439, 314715, 393870, 436298, 389387, 287427, 325303, 359193, 270434, 357036, 338883, 243589, 201083, 272806, 408140, 421779, 320196, 327825, 381233, 339693, 217938, 168882, 158743, 168179, 253051, 206738, 187022, 181012, 248222, 330986, 374791, 411065, 375880, 369137, 354721, 329281, 324608, 331755, 272582, 253460, 296712, 296916, 364248, 462591, 385901, 290549, 267096, 206408, 188653, 182695, 158079, 313073, 393146, 467822, 365186, 284281, 235281, 296652, 308450, 321238, 347078, 307377, 181719, 205778]
11819B05778Q6855P186k0899M0515J0827j08546J6147k8021K585J71340L6602
11808D20369p0024J5127n8360r1196R9340q21j01683K3362J0332m3948m5237K199
11796A59460K865j0676j0097J625j1144K1094L7200J16100J9445k024q1200p945
11784B34703K5142j68163j0063J11689K9199m8259J7829J8949Q7503k8629p0979
11773A98921J8825L2133m3669k9761K9323m0040r6936n5690L4552Q3236M3971
11762A74865p5045j50282J7109N8463m1363M9707J36097M2929o6269L874m06P4349
11750B24028n0177n4963K6432K2693j3441L0543P5246L4553j23460m7230K5794
11739A50018L0562n602P8414L4654J20273N0101O4127J31887J56312J19882J57332
$$ y = [205778, 292633, 299819, 278920, 319435, 330262, 221716, 237863, 209842, 212427, 383767, 420369, 350345, 365472, 307112, 215916, 315256, 314435, 212752, 236114, 246446, 202498, 157261, 159460, 162325, 151649, 141552, 143177, 132033, 153127, 190327, 306427, 325872, 323848, 242648, 234703, 259845, 91682, 81619, 193308, 222507, 174248, 192077, 211026, 298529, 269900, 198921, 217746, 249879, 206210, 176449, 205772, 165732, 68796, 13106, 47658, 130894, 174865, 99820, -50462, -33353, 25110, -16253, 33454, 169551, 212480, 146211, 150085, 149679, 224028, 173851, 118888, 145320, 168013, 154572, 185115, 260361, 294914, 171454, 124224, 150018, 180580, 174978, 253392, 288046, 408319, 458420, 522547, 654434, 810746, 930628, 1087960]
11728A087960J71760K47122K03460K7973k15904j50304j27230j80691j11756j41833
11718H10557j29325m3753m0522k855L210N0769j1759M6050k4087M5216O0442K7362
11706G91305L1688R8728O8211P35N3424N8788O2326M0657O9066J52072J19474
11695A546474Q3659K6540o9912j2492j3735p2697j23615r9216p1559q7036j3423
11684A092988p3336p8167p2142p7964j00880j24515K3017L1852o1225m9098l339
11673E07191r6835k7537J26792J00892N0130Q9235J03699J92165J54633J59225
11663A359590J08625L217j15560j84095j72094j72255j51091j45410n9647k6494
11653D44786j09825k3528L9158k9840n6884j5085Q006j5947Q002j7343q650m366
$$ y = [1087960, 1259720, 1506842, 1710302, 1738275, 1522371, 1372067, 1244837, 1064146, 952390, 810557, 681232, 637479, 596957, 594102, 597312, 648081, 636322, 682372, 658285, 703501, 763943, 791305, 822993, 921721, 989932, 990667, 1044091, 1102879, 1165205, 1205862, 1274928, 1427000, 1546474, 1630133, 1656673, 1586761, 1574269, 1560534, 1487837, 1364222, 1265006, 1193447, 1106411, 1092988, 1019652, 941485, 869343, 791379, 690499, 565984, 589001, 620853, 559628, 510530, 507191, 410356, 382819, 509611, 610503, 660633, 749868, 853567, 1045732, 1200365, 1359590, 1468215, 1471432, 1355872, 1171777, 999683, 827428, 676337, 530927, 471280, 444786, 334961, 311433, 350591, 320751, 263867, 248782, 256788, 240841, 248843, 231500, 222850, 218484]
11641B18484J2338q141n9417L105j1398r484P6418o9437k08914P231J26033l6571
11629D0247J787K6166m0613j03594j3651L9775J33493N8971m8903k6856L5340
11618A02162L7067k4097O107M009l2242j29946M1211O5956O4527R709O5787j2801
11606A97449j86n2632k3212j7197K3361L9551K5971j9346p4129M5324O7821m6228
11594A66547M4995k4453k2208o6489k9257L4137R1804O9286j25233l1699q494
11583I8936j0908k0962m9704p3815m4481J40417L8911J6485k292k9211M642j16417
11571d8399J0340P4058Q0434M3941K0255n9493m3765O4071M2103j7789l8640j7742
11559A09374m2234p3808K9682R4914K4872j2318n5928k8635r6846L7922J06989
$$ y = [218484, 230822, 222681, 163264, 166369, 154971, 145487, 221905, 152468, -56446, -49215, 76818, 40247, 42034, 68200, 27587, -76007, -89658, -49883, 83610, 142581, 93678, 66822, 102162, 139229, 115132, 121239, 125248, 93006, -36940, 4271, 70227, 134754, 144463, 210250, 197449, 197263, 144631, 121419, 104222, 127583, 167134, 193105, 173759, 99630, 144954, 212775, 166547, 211542, 187089, 164881, 98392, 69135, 103272, 195076, 264362, 139129, 107430, 98936, 88028, 67066, 17362, -56453, -100934, 39483, 78394, 94879, 92587, 63376, 68018, -48399, -38059, 35999, 116433, 160374, 180629, 121136, 77371, 141442, 183545, 165756, 127116, 109374, 67140, -6668, 23014, 117928, 142800, 130482, 74554, 45919, -50927, -13005, 93984]
11548I3984L6723N1780L7453j1422n3193j458J7145j5172P419k1567p28o168k8037
11535A06759r4496n0156Q3270Q4118n6168J7528l0565n2901r0370O7988J61974
11524A46981O5171N485q4337j00357O275l107k4147o2362j6862N1807J4328q416
11512i541j0721r976M9811P5937R0928L8070p3903q3912k9819L286j2957P1546
11500I8749L4559n657l9375L3374K8873m6907k6247R2591m8810M1927m2138L3609
11488A54548j469q8106o3788r139N5826M6576j871o6132l4469M0681o4749j9677
11476e1769J7425R4222O4782j28200k793r110M7066M4943Q1267J39802l5450m3706
11464B18479j08472p4765K997l5955K054n1276L1252N0664M2898K9629l7103j1933
$$ y = [93984, 130707, 182487, 219940, 208518, 155325, 153867, 171012, 155840, 163259, 141692, 140964, 134796, 106759, 12263, -37893, 45377, 129495, 73327, 90855, 60290, 7389, -82981, -14993, 146981, 212152, 217637, 133300, 32943, 39218, 36111, 11964, -50398, -67260, -15453, -1125, -9541, -20262, -30238, 19573, 95510, 186438, 224508, 150605, 66693, 36874, 40160, 27203, 98749, 133308, 127651, 88276, 121650, 150523, 103616, 77369, 169960, 121150, 163077, 120939, 154548, 153079, 64973, 1185, -7954, 47872, 94448, 92577, 26445, -8024, 32657, -32092, -51769, -34344, 59878, 124660, -3540, -6333, -15443, 31623, 76566, 157833, 297635, 262185, 218479, 110007, 35242, 38239, 2284, 4338, -46938, -15686, 34978, 77876, 107505, 70402, 58469]
11452E8469P9994L2725j9988j09135O7649l1561k5656J3672J8860l3044J9393
11441G1378N685k6017O1420L9708L5446k0696P6875J1953j62943m0144L974P586
11429F4225r517K9122J5559j6060K2113J6891J5661q309k6130l7519o3377J150
11417C809L5797L7465k5938K2067n5566P3851J15018L7266j7766j5071j17598
11406I3334q7738Q4285R72J264j8492R013m7704n7270Q0392O363K5244J1876N653
11393A07192l7733m633O9619p2109k1931J0383j7361J3724L1482J9683l8776N0198
11381A09738k2133J9313m3437q4277M1890q958m8673k9585K3852P458N9567J8030
11369D2785j28678K9803P7590J18528O6060j115p8497j8370o1126j8342J8626
$$ y = [58469, 138463, 171188, 151200, 42065, 109714, 78153, 52497, 66169, 85029, 51985, 71378, 77063, 51046, 112466, 152174, 187620, 166924, 243799, 255752, 92809, 52665, 56639, 64225, 54708, 83830, 99389, 83329, 105442, 122333, 137994, 129685, 103555, 66036, 2659, 3809, 39606, 77071, 51133, 73200, 17634, 91485, 206503, 243769, 226003, 210932, 93334, 5596, 89881, 90853, 92117, 73625, 82638, 34934, -22336, 58056, 64419, 89663, 101539, 107192, 69459, 64826, 134445, 62336, 40405, 50788, 33427, 47151, 78633, 98316, 59540, 109738, 87605, 106918, 63481, -20796, 21094, 12136, -36537, -66122, -42270, -34812, 24755, 42785, -85893, -56090, 21500, 140028, 206088, 204973, 126476, 108106, 46980, 28638, 47264]
11358D7264m106j3359Q8597O6965k1683n6597k1113J0786m6566k7368j3157J4899
11346B4562L1794J192N7165L974n2945l3365q109j5268m1004J0032N386J8279
11334A693l3535J3355J33576M7686L7987l4706l6829j12022n1237r112m372L6468
11322a1048j2321L5345P1187j4599J4809k2558M7895M1690K8473k1168m6822L4279
11310A45162j3380j21873n8592j03043m290O4783j2597j4891K7562R357O2197
11299a9605K9422l1183n585J27543Q3621J3144q498q3415j37689P274M0153l816
11287A1366N3752L4784o4892l8658Q5165J8759m0411K3095n3532o6993O8397M3629
11275G4461l0303N8930J05623J7163j1902n9634p4422p1334J8992R7215R2085
$$ y = [47264, 43158, 29799, 118396, 185361, 163678, 107081, 85968, 96754, 50188, 22820, 9663, 24562, 56356, 57548, 114713, 118687, 65742, 32377, 24268, 9000, -32004, -21972, -16586, 1693, -31842, -18487, 115089, 162775, 200762, 166056, 129227, 17205, -34032, -43144, -47516, -11048, -23369, 11976, 83163, 68564, 83373, 60815, 108710, 150400, 178873, 157705, 110883, 145162, 131782, 9909, -48683, -151726, -156016, -91233, -103830, -118721, -91159, -81802, -19605, 9817, -21366, -26951, 100592, 184213, 197357, 188859, 105444, -32245, -24971, 15182, 11366, 65118, 99902, 35010, -3648, 81517, 100276, 59865, 82960, 29428, -37565, 30832, 74461, 44158, 103088, 208711, 225874, 213972, 154338, 79916, 8582, 27574, 124789, 216874]
11264B16874j7377j37933l8368R9284M3406j6613q7744k9581n8610n449O3025
11253C0914J4133M3235n8517K4155J01004K76k2650n6699j12011p181R954L5679
11241B292M1762j4911q237M5653k8682J3330j5460K6351j5025L8200K3071n2467
11229E5877k0284n2220k8239L7865k1251J3740J3521n661L0914K0687P1837p048
11217A09738p4937o8335N3561l851O7370m2137j4130l0672P146k0543L8046P4757
11205I6013N3765P2227q6980q5851l8669q4231m4185k062N4644R8764Q714J5324
11193E7473L2815J4697k4382J8142k3525l7610j9265p4777m9375M8498k2634j6625
11181i6568n8980O7737M0883J39161l1826l4506k6120j9647J2995O5966L0006
$$ y = [216874, 199497, 61564, 23196, 122480, 165886, 149273, 61529, 31948, -26662, -32111, 30914, 45047, 88282, 29765, 53920, 154924, 155200, 132550, 75851, -36160, -43341, -33387, 2292, 44054, 29143, 20906, 66559, 37877, 51207, 35747, 62098, 47073, 85273, 108344, 55877, 35593, -16627, -44866, -7001, -28252, -14512, -991, -6652, 24262, 44949, 116786, 109738, 34801, -33534, 20027, 16176, 83546, 41409, 27279, -3393, 3753, -16790, 21256, 96013, 149778, 222005, 135025, 49174, 10505, -73726, -117911, -119973, -65329, 33435, 42149, 57473, 90288, 104985, 80603, 98745, 75220, 37610, 18345, -56432, -105807, -57309, -79943, -96568, -155548, -87811, -46928, 92233, 60407, 25901, -219, -19866, -6871, 59095, 89101]
11170H9101o4766L8524M8648p056l1942m6351l8130M0239J9047R725L0934k0244
11158F7729o3697o4581P6066M8938J2134L9400l817k7373j1135k8664j10084M0024
11146b5060M9037K4165Q5137k5543k7228p1448n0542N0380J5403l7251M2352O0769
11134I0171N4724l5053p8278l0183Q8548J12605m8066j06462K6687j8302k5775
11123C0616N3209l075m7346k3380O341O5829k2459N4283K0673K1828M9175m6341
11111A59353k9258N0874n7535j0796l3322m6019K0006o0912m0008L3340N3876
11100C9599k5307L274P7700m7001R3379Q984n3146j9356p913J7373L5485l8740
11088H4331L113L8540J3426m6781m3091m0085j844K786L8939m935K1036J3775
$$ y = [89101, 24335, 62859, 111507, 104451, 72509, 26158, -11972, 28267, 47314, 57039, 87973, 67729, 4032, -60549, 15517, 64455, 76589, 115989, 112172, 84799, 73664, 45000, -65084, -25060, 23977, 48142, 133279, 107736, 80508, 9060, -41482, 8898, 24301, -12950, 29402, 90171, 144895, 109842, 31564, 1381, 89929, 202534, 154468, 48006, 74693, 56391, 30616, 83825, 80750, 33404, 10024, 16365, 82194, 59735, 114018, 134691, 156519, 205694, 159353, 130095, 180969, 123434, 112638, 79316, 33297, 53303, -7609, -47617, -14277, 39599, 14292, 17566, 95266, 48265, 141644, 150628, 97482, 78126, 70213, 87586, 123071, 84331, 87444, 125984, 139410, 92629, 49538, 9453, 7609, 10395, 49334, 44399, 65435, 79210]
11076G9210k9391K1069J9406l0487N8943j15210r2817O736N7635L0312M0641j7699
11064B8348o0660P4336M3002N7906n9106j5520o6126k0687P4511N3492K0568n0966
11052G9098N5002k4661o3675L6934K3351J8179l503m9175r5575n4441M5834J2050
11040b0582n7616j5197Q3698P9772j8234k1078r0712o023Q8712O958j2578m517
11028A2603P5613j8817j8629k0718P2104j8621p9242k8009K9225R8010K4419N4450
11016A82388o2069q0987o7627k4922O5074n7643N839o598j7807Q3892J4943k2801
11004A1682K055M6908Q0059L2028o5223J0953K6619M088m3884M832m53n718M3723
10991A47669p1589n5330o0690n0477N2176J1125J7789P0092j0350o8932k5716
$$ y = [79210, 49819, 70888, 90294, 59807, 118750, 3540, -89277, -82541, -24906, 5406, 46047, 28348, -32312, 42024, 85026, 142932, 83826, 68306, 2180, -18507, 56004, 109496, 130064, 79098, 134100, 109439, 45764, 82698, 106049, 124228, 120725, 71550, -24025, -78466, -32632, -20582, -78198, -93395, -9697, 70075, 51841, 30763, -59949, -65972, 22740, 29698, 17120, 12603, 88216, 69399, 50770, 30052, 102156, 83535, 4293, -23716, 5509, 103519, 127938, 182388, 120319, 39332, -28295, -53217, 11857, -45786, -39947, -46545, -64352, 19540, 34483, 11682, 13737, 60645, 140704, 172732, 107509, 118462, 145081, 149169, 105285, 110117, 109664, 103946, 147669, 76080, 20750, -39940, -90417, -38241, -27116, -9327, 60765, 50415, -18517, -44233]
10980d4233m487J12219O879o4236N3642N7647k2488l5164L8582q222k3669j6969
10968D9501k6560M1270L5701K3594j06016p6050P2426P8807l4258o2274N5688
10957E1829M035m8370o1884R180M0898J5543n7244l7278P569K1424J05782P1856
10945A23340q79n0720j08393j28879j0343j3952P3218R7788O8866q798k6641o4000
10933d9393L7676J19842N7129r5146p9470N5255O190n3598J3274P9191K2409n9783
10921E3576m6950O0693L7449j84K2602k8311k7366j2851k9717K5770j6577J01534
10909A39668j0962p2447m2796m796r3054p7840P0720J47515O4698m013N7384m6232
10897A27845N243m1220o9915n0639P8998k3200o9104R2528N2807M1728n4126m943
$$ y = [-44233, -48720, 63499, 70378, 6142, 59784, 117431, 94943, 59779, 98361, 90139, 66470, 49501, 22941, 64211, 99912, 123506, 17490, -58560, 13866, 92673, 58415, -3859, 51829, 55864, 7494, -54390, -45210, -4312, 11231, -46013, -83291, -75722, -54298, 51484, 123340, 122461, 71741, -36652, -165531, -175874, -189826, -116608, -18820, 50046, 41248, 14607, -49393, -11717, 108125, 165254, 70108, -9362, 45893, 52083, -1515, 11759, 90950, 113359, 53576, 6626, 67319, 104768, 104584, 127186, 98875, 71509, 58658, 28941, 54711, 38134, 139668, 128706, 56259, 13463, 8667, -84387, -162227, -91507, 56008, 120706, 116693, 174077, 127845, 133088, 91868, 21953, -28686, 50312, 27112, -41992, 50536, 103343, 145071, 90945, 86002]
10885H6002J6689l2224q7934o9010o048r1752L0524J00388l5847m1888J3669j0707
10873a28138j3601O8211j4882L1582M2021K1200r087k6677K7274J50280J9333
10862A67516m7912m5588j36276k114P8766Q6082J2285m6023j21109p1231J5506
10851a10098R6483L7507l5188j04077K3658J10777K2385L0580K3811p7132k6423
10840g717K8352P6160K3488k0268O6597k6000m8921M3328k3241k8946o0946M0462
10828F2348J0702P0935j7234L715J0962l7567j25657k7958P3862J9562l8886n6949
10816e2165J1826O1176m6095j263l599L9461j5938N2329l8122q2301M163M3462
10804b7066K2542L759M075j0698m3k0606m147p542k8967K9461m8857r0352P2511
$$ y = [86002, 102691, 70467, -17467, -86477, -92525, -184277, -153753, -53365, -89212, -131100, -117431, -128138, -141739, -73528, -88410, -56828, -14807, 6393, -2694, -29371, -2097, 148183, 167516, 119604, 74016, -62260, -64374, 14392, 100474, 112759, 66736, -54373, -125604, -110098, -13615, 23892, -11296, -115373, -91715, 19062, 41447, 72027, 95838, 18706, -7717, 20635, 96795, 120283, 100015, 166612, 140612, 91691, 135019, 111778, 82832, 21886, 62348, 73050, 143985, 126751, 130466, 141428, 103861, -21796, -49754, 24108, 43670, 4784, -52165, -40339, 20837, -25258, -26521, -30120, 9341, -6597, 45732, 7610, -74691, -70528, -27066, -4524, -765, 3310, -7388, -7431, -28037, -32184, -39726, -68693, -39232, -88089, -178441, -105930]
10791a05930J25626Q2199j15771j26887l6637O0872O7255J695K6175k5625M6693
10780c35J49437J8862q8388o3750J2184M7393m215l1373j5427j4550M545L8541
10768E2924O1186M0179j13910q4933M338J05485J02625q8492j49783m8215O2934
10757e5662j1702l4071p8090J4329J56348k5857j20778L0122N4744q31k1701K1121
10745g2028J3806K7817J02063j880J0256j9823l0493m9679O2292l7870n0701Q7035
10733D0795P114j0866r2196P581L8717q703n0437m6354r6531L2347Q1505L5307
10721f1721L3368J6783n4481M7081L8332N5478l2712l5490Q117P439m2150J2774
10709g182K6303m0868k8260q142M9740L7402j1874k6897p5359N6679K5367O53
$$ y = [-105930, 19696, 101895, -13876, -140763, -177400, -116528, -49273, -47578, -21403, -47028, -335, 149102, 167964, 79576, 15826, 28010, 75403, 71188, 39815, 24388, 9838, 14383, 52924, 114110, 154289, 40379, -44554, -40216, 65269, 167894, 79402, -70381, -118596, -55662, -67364, -101435, -179525, -165196, -8848, -34705, -155483, -125361, -70617, -71448, -93149, -72028, -58222, -30405, 71658, 69778, 80034, 60211, 29718, -19961, 42331, 4461, -46240, 40795, 47909, 37043, -55153, -47572, -8855, -17558, -67995, -114349, -210880, -178533, -97028, -61721, -28353, -11570, -66051, -18970, 19362, 74840, 42128, 6638, 14755, 22194, -19956, -7182, 19121, -21747, -50007, -58149, -8409, 28993, 17119, -9778, -85137, -28458, -3091, -2438]
10697b438R79k7025O550J7405o730K3745O8128n9208n4875n394m1595K1003L8408
10684b1047O6264Q789N139M9058l8062j49699o1100m616L1732N9243R6961O071
10672D8733m4155J1284k2496k4336j5847P606J0931L0145P1752J04373L277j08218
10660G3049o2851k4282N9691L6370L975p6419r279j8550J7469N3061Q9767j35529
10648F472j06622O9721m7639M571L7951o0960k632P9815P0466J4743o7627k7616
10636b9357O2390L9337J1602j785K5328m0271j190K8928K8375q1654p2274N8134
10624B7563L8681l7132p7465O4596Q058k294q52j62O1545n1044J09284M2252o6326
10611A16704K0383N5185n197j06809l2152m3912n934o001m2532M6460j5212P5063
$$ y = [-2438, -1459, -28484, -21934, -4529, -11259, 12486, 80614, 21406, -33469, -38863, -80458, -59455, -21047, 45217, 54006, 59145, 108203, 70141, -79558, -140658, -145274, -113542, -54299, 42662, 48733, 4578, 15862, -6634, -30970, -46817, -39211, -28280, 1865, 73617, 177990, 181267, 73049, 10198, -14084, 45607, 81977, 85952, 9533, 254, -18296, -827, 52234, 142001, 6472, -100150, -30429, -78068, -73497, -35546, -96506, -99138, -19323, 51143, 65886, -1741, -29357, 33033, 72370, 83972, 82187, 107515, 67244, 66054, 94982, 123357, 41703, -30571, 27563, 66244, 29112, -48353, 16243, 24301, 22007, 21155, 20993, 82538, 31494, 140778, 183030, 116704, 137087, 192272, 187075, 80266, 48114, 4202, -1732, -7733, -50265, -3805, -19017, 56046]
10599E6046N7391K4585p6748k8784r8368L2952K2800m7044L1147K6978o387l0998
10587c6430l7920R900O7395N0940k3182j08141P4362l3868m0560k2297L093l1441
10575a28149M6334J08426l4294j5809j5309K5325P4293k4348k2948p8008K3175
10564d1312J07629J4977l4365J27Q6060O7650K6442j19301j58141l6563O9556
10553a7241O8861l7571p8529N7559R2238J1603j8229l7113p4552o8489j9239L7171
10541h3531R0215R1141J6636j503P216P2887n4757j36105k892P6407k2995J6336
10529F9055P5325p4024j02860P769R2295P5024J786n5404O2772k7694m1651M9056
10517A31449o0210N1990M4274n8407k8339o1602j6213L7273J3438k4775L6913
$$ y = [56046, 113437, 138022, 61274, 32490, -65878, -32926, -10126, -57170, -26023, 955, -5432, -36430, -74350, -64450, 2945, 53885, 30703, -77438, -3076, -36944, -77504, -99801, -96708, -128149, -81815, 26611, -7683, -23492, -38801, -13476, 60817, 36469, 13521, -64487, -41312, 66317, 81294, 46929, 47056, 133116, 200766, 227208, 107907, -50234, -86797, -17241, 51620, 14049, -64480, -6921, 85317, 96920, 78691, 41578, -32974, -101463, -120702, -83531, 6684, 97825, 114461, 112958, 120174, 193061, 138304, 2199, -693, 75714, 52719, 69055, 144380, 70356, -32504, -24735, 67560, 142584, 144370, 88966, 151738, 124044, 82393, 131449, 71239, 123229, 167503, 109096, 80757, 19155, 2942, 40215, 53653, 28878, 65791]
10506F5791m3080r1025k4929J53259M1641o9714J3225L476j08062l5669K7391
10495f7696J278L7646J00296M3555N8255p890j32884L0155N8093l7674j22552
10484c9418p415N0519J00750m3814n1580J756R737j03016k1844N4858M5941M6423
10472D2897r0998j3412N0119M0495j3188L8965J23585m8748m8673L824l562r6560
10460a5256k254l5718r041N945M5072J04170m4977j19956Q0822O2225K4194J1713
10448A06939L2055m735o3732j3578m8902L307Q26J21729M2753p3740l9301p5825
10436a2204k4930M3303L0298K178p020N7267o5657m3491j2438L3410N27j0958
10424i715k8564R1634l2085l251J7417L5443M4393r9693r1404o0247K2655M4304
$$ y = [65791, 22711, -68314, -93243, 60016, 101657, 31943, 45168, 48644, -59418, -95087, -67696, -66418, -28772, 71524, 115079, 173334, 165444, 32560, 62715, 120808, 83134, -39418, -46833, 3686, 104436, 60622, 9042, 10798, 20535, -82481, -104325, -49467, -3526, 42897, -48101, -61513, -11394, 29101, 15913, 54878, 178463, 129715, 81042, 84866, 81304, -15256, -17510, -53228, -62269, -56324, -11252, 92918, 47941, -72015, 8807, 71032, 95226, 106939, 138994, 134259, 70527, 56949, 8047, 11354, 12180, 133909, 176662, 102922, 63621, -12204, -37134, 6169, 36467, 38645, 31625, 88892, 23235, -20256, -32694, 716, 1243, -9715, -38279, 53355, 21270, 18019, 35436, 70879, 115272, 15579, -75825, -136072, -113417, -69113]
10412f9113o3546k1461M7547Q5165M2112M6565K7898q2047k0116l7131j2702N1848
10400d981P4301N181k9027o483M0420j3622o1789o6786M8460M7110j22493p2998
10388a62707K4811L9631L0190J4309m8k7193J1154N6511n2773L8674M6292j283
10376A7568l5696j495M2718Q1982N6423q2572j3782J2262j6967p6362k8394O5317
10364B1002K7209m4974n6450J2185j1892J7532J00187l7381j4813Q1108M2529
10353A36242l0062m9987j3646j073L1501n1661j20511K4418P1696l5553K1923
10342a6713J06131J9065o0977r354M331l862L448l1055j7556j2915N2395L2634
10330F5572M3533r673q5957p6149J1912M6303j02911M7182P9114q2240n6177O9342
$$ y = [-69113, -132659, -154120, -106573, -21408, 20704, 67269, 95167, 13120, -6996, -44127, -56829, -4981, 69320, 74501, 45474, 38991, 79411, 65789, 4000, -62786, -14326, 32784, -89709, -162707, -137896, -98265, -68075, -53766, -53814, -81007, -69853, -13342, -66115, -27441, 18851, 17568, -18128, -19623, 23095, 105077, 161500, 78928, 65146, 77408, 60441, -15921, -44315, 21002, 48211, 3237, -53213, -41028, -52920, -35388, 64799, 27418, 12605, 93713, 136242, 106180, 56193, 42547, 41474, 72975, 21314, -99197, -74779, -3083, -38636, -16713, 89418, 108483, 47506, 38152, 42483, 38621, 42069, 11014, -6542, -19457, 32938, 65572, 109105, 99432, 13475, -62674, -50762, -4459, -107370, -60188, 18926, -63314, -119491, -50149]
10318e0149N580J5308j4857J5367o213k4199m7416r273j9738P5802P8827j0671
10306H368k9636O3263L3826n1056l3474n0163l0784K4234O7006J9209P7748l3158
10294F5383o1805J7319P9460K6612J5232j1664q439o8680j01838K2133L7363o3947
10282e2871J3361O4812K7147j3934L6138J2453n4760k7651k2850L321M812n044
10270a5066K6596J8148N7567J6963l9169N563n982L3589J8085q028n9838o2805
10258a4377K2634p041L309J9318m5826p1240N013n4265m8319L3717N3063O3004
10246d1010M4937P3349o8823M4718N6799j00457k9413P33J8808P2376p3769p4420
10234g6172O3958J7804M4781k4006j085k4141K3924N5556k1948J3547K5372q0740
$$ y = [-50149, -44569, -29261, -44118, -28751, -34964, -59163, -106579, -115852, -135590, -59788, 19039, 8368, -21268, 41995, 75821, 24765, -8709, -58872, -89656, -65422, 1584, 20793, 98541, 65383, 3578, 20897, 100357, 126969, 142201, 130537, 122098, 53418, -48420, -26287, 11076, -52871, -39510, 25302, 52449, 38515, 74653, 87106, 32346, 4695, -18155, -14834, -10022, -15066, 11530, 29678, 87245, 104208, 65039, 70602, 64620, 98209, 116294, 108266, 48428, -14377, 8257, 1216, 4525, 23843, -21983, -93223, -88210, -142475, -190794, -157077, -104014, -41010, 3927, 77276, 8453, 53171, 109970, 9513, -19900, -19167, -359, 72017, -1752, -76172, -12214, 5590, 50371, 26365, 25280, 1139, 25063, 80619, 58671, 72218, 97590, 16850]
10222A6850j30441L6067O3796K7316j7696o2400L7169j2247K4131N4856N2181
10211H9582j281l4456J7723O3904p8779j8257N6065k711j36169l9561L8439Q6498
10199D0997N2466j3489K4437p5319n3901l3559J0596O2155N3604l5789K1148j06198
10187e2852J0906k5878L6718m719r1792L7300P0726J74423n5200j16946r6998
10176a14312j0347K4272j6594n3511K6415R4068O3578k8195l4405N1510L2578
10165C5057J00344q085p8320K6969p6054j8870q2604m9434K1577P5457J26169
10154G2206Q5136J6817j11173j0505r2644n403N4246P1633k2902l7095j1413J1114
10142B0017m6344m9422l0238O092l6749M3276J7238M7781k587Q5375K8767p1276
$$ y = [16850, -113591, -77524, -13728, 13588, -4108, -66508, -29339, -41586, -17455, 37401, 89582, 88301, 53845, 71568, 135472, 56693, 38436, 94501, 91790, -44379, -83940, -45501, 40997, 93463, 79974, 104411, 29092, -24809, -58368, -47772, 14383, 67987, 32198, 53346, -52852, -41946, -67824, -31106, -35825, -127617, -90317, -19591, 154832, 99632, -17314, -114312, -124659, -100387, -116981, -170492, -144077, -50009, 13569, -14626, -49031, 2479, 35057, 135401, 127316, 48996, 75965, -89, -18959, -101563, -150997, -129420, -53963, 72206, 157342, 174159, 62986, 52481, -40163, -45566, 8680, 80313, 57411, 20316, 8903, 20017, -26327, -75749, -105987, -99895, -136644, -93368, -76130, -28349, -30936, 54439, 83206, 11930]
10130A1930J8068M0266M0751O5561p4333k1376j6578j59349p2049R6955L8425
10119c1729M9733L9957o8853K3245N4392k4179j8304M1070R3152J3497k40L053
10107A74794j0953L0497m9439j30088O9743l6602p8158J8422K1254k679M9566
10096E6357l7838q3460J791j3693L7795P6495K1750n662M1943n3016l8924l1447
10084b7909l2802J0976l2677L5710J12867Q6695l8466j26841j19220m5352N6105
10073a20914N0703J5628j329j02139l1109L2699K9323J659k5782L0360J6434k207
10061a06674k2239J3889k0286l2394M4478O6652J03734L9290k2711K4704J94K9152
10049A17789M5709j31432o9882j36476P67Q5943K6567l5926J344N2295M9441N2483
$$ y = [11930, 29998, 70264, 111015, 176576, 102243, 80867, 64289, -95060, -167109, -70154, -31729, 18004, 57961, -10892, 12353, 66745, 42566, 24262, 65332, 158484, 171981, 171741, 174794, 163841, 194338, 144899, 14811, 84554, 47952, -30206, -11784, 9470, 6791, 56357, 18519, -64941, -63150, -76843, -39048, 37447, 59197, 53535, 95478, 42462, 3538, -27909, -60711, -49735, -82412, -46702, 66165, 152860, 114394, -12447, -131667, -177019, -120914, -70211, -54583, -55912, -158051, -189160, -156461, -127138, -125479, -151261, -120901, -104467, -106674, -128913, -115024, -135310, -167704, -123226, -56574, 47160, 86450, 63739, 88443, 88637, 117789, 163498, 32066, -37816, -174292, -173525, -87582, -61015, -96941, -95597, -43302, 6139, 58622]
10037E8622n357n0266l7070p3492L02L039R1902J38984n3021j03669l3336o3699
10025a27061j1949K5720J020P067J2865n0665P0488J5062m4260P2816K1355j119
10013h661m582M0735j29208m0772N4716L9662p1734K874K4962Q1469L4375n2629
10001b8793o1095J13081M6434o8739o029O0600R1049K076j12079J5100k0844j05472
9989g4711k7136l4673P7287K7209R6222J1395J2545m6101m9990L3677j7409J6394
9977B4709P4519P9077p2823q3680k0353m0434J3123j2258L7937n0395m1536M1419
9965e0695O8374k9038J5046l0407k3751j9086n1512J4157j568p724P6082K6589
9953a3533L4727j4470l9846K5607O1332k1706m2790N1527m4576l4180O2034j9228
$$ y = [58622, 53265, 2999, -34071, -107563, -107261, -104222, -12320, 126664, 73643, -30026, -63362, -127061, -139010, -113290, -112270, -105203, -92338, -143003, -72515, -57453, -101713, -28897, -7542, -8661, -13243, 27492, -101716, -142488, -87772, -48110, -119844, -116970, -92008, -10539, 23836, -28793, -89888, 23193, 69627, 888, -5141, 55459, 146508, 148584, 36505, 51605, 30761, -74711, -101847, -136520, -59233, -32024, 64198, 75593, 88138, 42037, -7953, 25724, 8315, 24709, 99228, 178305, 105482, 21802, 1449, -38985, -25862, -38120, -183, -50578, -92114, -50695, 17679, -11359, 3687, -26720, -50471, -69557, -121069, -106912, -108480, -116204, -40122, -13533, 21194, 6724, -33122, -7515, 53817, 32111, -10679, 40848, -3728, -37908, 24126, 4898]
9941D898k4547k2693j4608n7507l2854K9984O4096M8657M6037L8841l3530q906
9929C7868j7479n4570k1514l8346J12245R3500o3754j20209J7649L4554M0720
9918B0664J7552o5774m459K0496p2351O302O6140n1736J9617P3551k2159j5925
9906h082N4378m8885k4843L1368L0314q8052J3282N1688J6242l3047K9097j2323
9894A1137m910M7543M1635k6554J7304J7672o2572k6023q8006o7373R587Q42L0740
9881i8978R1050M9144o8557J2616P1808m4011p6745l4385n411K5088M5750M2223
9869I592M1270M6330M9618n6909k3561P709n9237p1733n2707P0020P2192J4858
9857D7442m996o1777k6142n9032L1822O1245K2141K2996m8678k9947N5838k3825
$$ y = [4898, -19649, -42342, -56950, -114457, -147311, -117327, -53231, -4574, 41463, 80304, 46774, 37868, 20389, -34181, -55695, -94041, 18204, 111704, 47950, -72259, -54610, -20056, 20664, 38216, -27558, -32017, -11521, -83872, -77570, -11430, -63166, -43549, 30002, 7843, -8082, 46296, -2589, -27432, 3936, 34250, -53802, -40520, 11168, 27410, -5637, 23460, 11137, 6227, 53770, 95405, 68851, 86155, 103827, 41255, 15232, -72774, -140147, -130560, -129718, -98978, -7928, 41216, -27341, -14725, 57083, 13072, -63673, -98058, -103469, -78381, -32631, 9592, 50862, 97192, 146810, 89901, 66340, 74049, 14812, -56921, -109628, -39608, 32584, 47442, 42446, -19331, -45473, -104505, -72683, -11438, 10703, 33699, -14979, -44926, 10912, -12913]
9845a2913M1653J34844N3318o8386r1379j5284J3694p857j6754j2987J6448K5616
9833F0013l541m4643M689M0322M916k4815L4662k2129P4732O4128m4004o3817
9821H0513o890P258q1671m6490l9434q366o344P7669P4588M400N4247n1144o9109
9808a0773P2265P7422k6972r8518j18711J0786n542L1756l9290o2656K5997N1242
9796i2994J3940M7360M4827l5239l2845R159M2938M9824K9856j08859M3731J8663
9784C0361k2774j2171r6749o1605O8061M2727O0229P7247l6147o3828m219q3368
9772a02236n1681N5825N0349K8629Q6683p7366L328n2358n9947N4375k0221P5178
9760i442n576q8003K105K4730J00299M2789J0536l536j9970r7509M6519K6216
$$ y = [-12913, 28740, 163584, 216902, 148516, 57137, 41853, 55547, 47690, 30936, 17949, 34397, 60013, 56472, 11829, 16518, 56840, 61756, 36941, 71603, 49474, 124206, 188334, 144330, 80513, 73623, 80881, -790, -47280, -86714, -95080, -101424, -23755, 50833, 55233, 109480, 58336, -10773, 61492, 138914, 111942, 13424, -105287, -94501, -100043, -68287, -107577, -170233, -144236, -92994, -79054, -31694, 13133, -22106, -54951, -45792, -2854, 46970, 76826, -32033, 11698, 30361, 7587, -4584, -101333, -162938, -94877, -52150, 8079, 85326, 49179, -14649, -18868, -102236, -153917, -98092, -47743, -19114, 67569, -9797, -6469, -58827, -118774, -64399, -84620, -9442, -15018, -103021, -100916, -76186, 24113, 66902, 77438, 73902, 53932, -43577, 2942, 29158]
9748B9158M2031j4693m6146m2793r9780P0441M6170P6350P9954K1200o0682l4304
9736F6906L3948m6418r415p879L8213o544j15906j0839J23173M5405q5376r2054
9724f6786q464j4746M5201K9528q2368n3893J8566N2842P164P1284N4358O4360
9712A17046K4310K7342J6281J4567k103J0134o1578p8789N226P3279j4215j08234
9700B3266j2057N1938L239k5354m0859Q957j7289q4076k9338O6110P1311q7090
9688g1242j27369J25920J15462L6169K6981r8660m1825P2068L0916m5030j6422
9677F968m6442K2831N2125J7591L2177n7968n0271l4047L097Q4428N8180n1959
9665C6710L7065L2985j11548j07754J5267l8949j179Q8139J10574l7795k2550
$$ y = [29158, 71189, 56496, 10350, -32443, -132223, -61782, -15612, 60738, 140692, 161892, 101210, 66906, 100854, 54436, 45021, 37142, 75355, 68811, -47095, -57934, 65239, 110644, 25268, -66786, -75250, -89996, -44795, -15267, -97635, -151528, -132962, -80120, -72956, -1672, 52686, 117046, 141356, 168698, 184979, 199546, 197443, 207577, 145999, 67210, 72436, 145715, 131500, 23266, 11209, 63147, 66386, 41032, 173, 9130, -8159, -92235, -121573, -55463, 15848, -71242, -198611, -72691, 42771, 78940, 105921, 7261, -34564, 37504, 68420, 23390, 6968, -39474, -16643, 35482, 53073, 85250, 27282, -22989, -57036, -53939, 30489, 88669, 36710, 73775, 106760, -4788, -112542, -97275, -136224, -137403, -49264, 61310, 23515, 965]
9654I65k8965n179o344K7376L9362k4460m6157L8465Q0263n4609o5726l940P1625
9641B2676K9678j293j5576K6193K261p7173J8805L7644K6190l4380r9111p3054
9629a37140R4108Q3891K6473l0905l8631l4079O7090K9309k4208o0882K7251M2391
9617D4668J7528m8316j041K1899o2619k7574k5979J2853K4994n1127l718L8722
9605e9710Q721k9816J3136k7676L98L7338n3224k0712k5281O1926N8314J3923
9593b2663j2081N9578R0935K1692j6137Q613k4910L818K6494L1572n2290n0055
9581F4566M3251o1165n2079L9242O9540K612j4752L6737J7187j1830m6499n7296
9569B9514o3450o1246P6838L4572l2n968j6222j06944n6760k9193K4293J6718
$$ y = [965, -28000, -33179, -39523, -12147, 27215, 2755, -43402, -4937, 75326, 20717, -45009, -48949, 22676, 52354, 51061, 35485, 61678, 63939, -13234, 5571, 43215, 69405, 35025, -64086, -137140, -43032, 40859, 67332, 36427, -2204, -36283, 30807, 60116, 35908, -24974, 2277, 44668, 62196, 13880, 12839, 34738, -27881, -55455, -81434, -68581, -43587, -94714, -98432, -59710, -50989, -80805, -67669, -95345, -94947, -57609, -110833, -131545, -156826, -94900, -36586, -22663, -34744, 24834, 115769, 137461, 121324, 129937, 105027, 108845, 135339, 166911, 114621, 64566, 107817, 46652, -5427, 33815, 103355, 105967, 91215, 127952, 145139, 133309, 86810, 29514, -33936, -95182, -18344, 16228, 16196, 10228, -5994, -112938, -169698, -198891, -174598, -157880]
9557a57880j4870L1805j5732k545M6639L8216J05048j1565r8453o1574n5389L0642
9545a65658O3933M3716M7563O1523J0272l0643j7662K2597P0681n022l683K1945
9533A19562q6374k9701M7273J5067J3970l3973o7376K3045O0643j0069q3816m8338
9521h0087Q904N4686n4648q7120L1121R0555Q6739M6277l1575m4079j2406J228
9509I595Q8030n436p1719o3226O0236K3254r2293n1830K3150J4280q4813j6631
9497a67403K4287Q3922M8258j2821k9089k5824l4787j44711R19J05911R8005K1930
9485c1403m4334K9132n2809j0572L2891L3100L8452J31716k9064o3218j00195
9474f6304k6785K6025o337n4901J1053M4652K4279o8339n9992M3487J10104Q201
$$ y = [-157880, -172750, -140945, -156677, -159222, -112583, -74367, 30681, 19116, -79337, -140911, -196300, -165658, -101725, -58009, -10446, 51077, 61349, 30706, 13044, 35641, 106322, 101300, 97617, 119562, 33188, 3487, 50760, 65827, 79797, 45824, -21552, 1493, 62136, 52067, -31749, -80087, -71183, -16497, -71145, -158265, -127144, -36589, 50150, 96427, 64852, 20773, 8367, 9595, 97625, 92189, 20470, -42756, 17480, 40734, -51559, -103389, -80239, -65959, -150772, -167403, -143116, -59194, -10936, -23757, -52846, -78670, -113457, -258168, -257249, -151338, -53333, -31403, -75737, -46605, -99414, -109986, -77095, -43995, -5543, 126173, 97109, 33891, -66304, -93089, -67064, -73401, -128302, -117249, -72597, -48318, -116657, -176649, -133162, -23058, -14857]
9462a4857l4789r1097J244J19528J0873M5785J9242m7162j2357m5751k2432L4729
9450c7044K9012O1752O2161k9321p4529r3593m6432L6106N878q8910J20009J06490
9438E1579L1175K3194J828o1461j08613J4801P1689K3761K2656l1794j3176J5516
9426D1155L2187r773q6821o4384j37154l5805M4252J9265K5556k786L5020k7886
9414a67174Q8425k633j15487N3760J56014m7674k8488r062r743N7229N8779m2314
9402h368L9613Q7402M4059j1588j11872m5832J39L575L5276k4640j8235M3369
9390C2898m7645N6686Q2883n9370r2769m4049J5848M7566r857j5319P1488j1892
9378B6468j3979L2831K9608N0844M9991N5127m0314o4906j1890k9599k4529k2918
$$ y = [-14857, -49646, -140743, -139499, -19971, -9098, 36687, 55929, 8767, -3590, -49341, -71773, -37044, -8032, 53720, 115881, 86560, 12031, -81562, -127994, -91888, -86010, -174920, -54911, 51579, 82754, 105948, 107776, 46315, -62298, -47497, 24192, 47953, 70609, 38815, 25639, 41155, 73342, 63569, -23252, -87636, -224790, -260595, -216343, -197078, -171522, -174308, -139288, -167174, -78749, -81382, -196869, -143109, 12905, -34769, -63257, -72319, -82062, -24833, 33946, -8368, 31245, 118647, 162706, 151118, 39246, -6586, -6447, -2872, 32404, 7764, -10471, 32898, -14747, 41939, 124822, 65452, -27317, -71366, -55518, -7952, -17809, -33128, 38360, 26468, 12489, 45320, 74928, 125772, 175763, 230890, 190576, 125670, 113780, 84181, 59652, 36734]
9366C6734q4936q2292J6461j3109m0782Q7122N895O1049P1730L5709m9201p2664
9354b8284o6899o05P6948P5818j5828O08l1157o8777k9356n4572J1616J21078
9342i410M4344K9518J0046m5059k1062p188L7181J3532M092K2208k8443j7594
9330C2165K2308n917p3779J2251o7865J5007M0986J21719O0617q951n3822j15982
9318b1263l0516O8822N8486r3106p2489O7258Q4074M1310p9390p7104L879J59807
9306A09768P3473q6382n1061j5916k6582m8070O5220R5711l2033j6796O8621k9885
9294A06068Q626q349j8248l5216o0552k8500M2304k696j1527k9244M6506J9972
9282B9144n3174l8754K6308o283J8932O5337Q1973R9012L3300r8397p4533p6003
$$ y = [36734, -48202, -130494, -114033, -127142, -167924, -80802, -74907, -13858, 57872, 93581, 44380, -28284, -95183, -95788, -18840, 56978, 41150, 41758, 10601, -58176, -87532, -142104, -130488, -9410, 34934, 64452, 74498, 29439, 8377, 1189, 38370, 51902, 55994, 78202, 49759, 32165, 54473, 48556, -25223, -12972, -80837, -65830, -24844, 96875, 157492, 148541, 94719, -21263, -51779, 17043, 75529, -17577, -90066, -22808, 61266, 102576, 23186, -53918, -50039, 109768, 183241, 96859, 45798, 29882, 3300, -44770, 20450, 116161, 84128, 67332, 135953, 106068, 114694, 106345, 88097, 52881, -7671, -36171, 6133, 3437, -8090, -37334, 9172, 29144, -24030, -62784, -36476, -42759, -23827, 41510, 123483, 222495, 255795, 157398, 82865, 6862]
9270F862j6384J1849P259n4103m7752M5960J64682R2268j03863p6367L2951j7845
9258D5517l5508L262k6529M2458O0575R4298O845r2723j8448k5291k0116L4034
9246F8374M3677P0297K1342q2043m976l3373k6237k1384q940O2920q087k6552
9234E5018j9408L1609P5344l4104p7407N3561L6096m5635l2037N380Q3142O8985
9222B00544Q97p5885k6270m371N3587l4590m5749R6165J08963n4787m4756L8841
9210B12589K2922K3567M7161J33895l858l9183P7451O5802O1419l55N4330N5431
9198G11171O8736O4165J10829J40806K22892K80491K78726L75573N06063O59411
9188C418863P92468J008055J343968J936716K800513L701183M366531M027363
$$ y = [6862, -9522, 2327, 9586, -44517, -92269, -46309, 118373, 210641, 106778, 30411, 63362, 45517, 10009, 13271, -13258, 29200, 89775, 184073, 190918, 98195, 79747, 54456, 34340, 68374, 112051, 182348, 203690, 121647, 116671, 83298, 57061, 35677, 26737, 89657, 81570, 55018, 35610, 67219, 142563, 108459, 31052, 84613, 120709, 75074, 43037, 48417, 131559, 200544, 201441, 125556, 99286, 94915, 148502, 113912, 68163, 164328, 273291, 218504, 173748, 212589, 235511, 259078, 306239, 440134, 436276, 397093, 474544, 540346, 601765, 601410, 655740, 711171, 779907, 844072, 954901, 1095707, 1318599, 1599090, 1877816, 2253389, 2759452, 3418863, 4211331, 5219386, 6563354, 8500070, 11300583, 15001766, 19368297, 23395660]
9180B3395660J861308j102796l461070m242096l729966k810380k090069j466100
9172F354491j170045q74889o42478n24231l91282l70070k71547k15947k15235
9163A678767k03375j26974p1771o4900n2262j59481j34578q9050o5093L7908k8255
9152G20936j11887m9418q9339j8737J9150j4632j2431k136K9398O0517j34306
9141C97115k2776P557q7740n2399M6428K7706J2781K7153j35032O731l311p5095
9129A49118L5786Q212p180K8820j0302p541q7175K7607K4279m3679l7678m8O521
9116H6740n1363j9915n3152N9594k7535l5944l5985J381J9972j3724Q0756K6066
9104C6891N6016L9390J9241m021Nj1226j07598l6915k936l8762K3455L086M8588
$$ y = [23395660, 25256968, 24154172, 20693102, 16451006, 12721040, 9910660, 7820591, 6354491, 5184446, 4309557, 3667079, 3142848, 2751566, 2381496, 2109949, 1894002, 1678767, 1475392, 1348418, 1276647, 1211747, 1159485, 1000004, 865426, 776376, 711283, 749191, 720936, 609049, 559631, 470292, 451555, 470705, 456073, 443642, 441506, 470904, 531421, 397115, 374339, 381896, 294156, 241757, 288185, 315891, 328672, 355825, 220793, 227524, 224213, 149118, 184904, 193116, 185936, 214756, 204454, 196913, 109738, 137345, 161624, 117945, 80267, 80219, 86740, 35377, 15462, -37690, 21904, -5631, -41575, -77560, -76179, -56207, -69931, 10825, 36891, 92907, 132297, 151538, 147517, 147522, 136296, 28698, -8217, -11153, -49915, -26460, -23374, 25214]
9091B5214k2033q5973J1515k4218R311O6925M8138O791O2331L3579N5080j219
9079A85441r0350N988l3476p8449m9161P299M0007K4880R986k3940M7656M5559
9067I1440p446J06626L2667j53448r0598m9579N0785J00064N1113q517P999n6979
9055G4127m7123J3376K7993k5361k3978n5565q0790n061J2061N6296O6697L8304
9043E0976r4870N940P8431l6720n0972M7869Q9153j6582k9422N8609Q8217m0156
9031A50473j9711m3153p9860M5583l902k4165J1177l5650j00357N4186R5756N517
9019E5894L8501M2389l3360J1056k3929q7461n2398k3850J46O5313J2550l9050
9007c4199m2728N6505k8278R7629O9925r8881J746M0794L5672J2181L1976m2101
$$ y = [25214, 3181, -82792, -71277, -95495, -86184, -19259, 28879, 35670, 98001, 131580, 186660, 185441, 95091, 101079, 67603, -10846, -60007, -52708, -12701, 12179, 22165, -1775, 45881, 91440, 83994, 190620, 223287, 69839, -20759, -70338, -19553, 80511, 131624, 123107, 131106, 74127, 27004, 40380, 68373, 43012, 19034, -36531, -117321, -122382, -110321, -54025, 12672, 50976, -43894, -37954, 40477, 3757, -47215, 654, 89807, 73225, 43803, 102412, 190629, 150473, 130762, 87609, 7749, 53332, 49430, 25265, 36442, 792, -99565, -45379, 50377, 55894, 94395, 136784, 103424, 114480, 90551, 3090, -49308, -73158, -73012, -7699, 4851, -34199, -76927, -20422, -48700, 48929, 118854, 19973, 21719, 62513, 98185, 110366, 142342, 100241]
8995A00241q4836j8874M2289m8702j557R2796n3548q5723k5720l4788M6094M7602
8983b4726K1951J03138m5763p5280K9714J13919M6721p1552q3434o2221m705L3927
8971a8311O2955J2404m2243m7523K572m254L1965N7238J05491o8138r2780j2709
8959a3333L0784k1191j4654o495k6574J0683p1074p311J3930k2895K5563N3192
8947d9375k6864L6242l391l729j0788P3477Q038K4338L4288n0229j6938k3358
8935h289K9195L9905o3588n2829L7797k4553p5338o2043k7062r063P479K6872
8923a81517j1255Q7249J25329m0220j2772L0758M1556l842q5279n9396J26798
8912A7409K3385n9171l6412N8063M3278M2r0919N4369K1997j14515n2453K9733
$$ y = [100241, 15405, -3469, 38820, -9882, -11439, 81357, 27809, -57914, -83634, -118422, -72328, -24726, -2775, 100363, 54600, -20680, 9034, 122953, 169674, 98122, 14688, -47533, -52238, -18311, 44644, 57048, 14805, -32718, -30146, -34400, -2435, 54803, 160294, 92156, -624, -13333, 17451, -3740, -18394, -24889, -51463, -40780, -111854, -119165, -105235, -128130, -102567, -49375, -76239, -39997, -43388, -47117, -57905, 15572, 23610, 47948, 82236, 32007, 15069, -8289, 20906, 60811, -2777, -55606, -17809, -42362, -117700, -179743, -206805, -215868, -208389, -181517, -192772, -105523, 19806, -20414, -33186, -2428, 39128, 35286, -49993, -109389, 17409, 40794, -18377, -54789, 3274, 46552, 46594, -44325, 10044, 32041, -82474, -134927, -105194]
8900a05194L4314L0297N68l0184R467O9516L0596L2970j04630J9941K0764L0587
8888C9012n0952k9057N5945Q0916k0589q2379p9358M9875Q5466l0011l559Q425
8876B3734j20339l7429J6475l8520k1377Q8838R4874Q1021K5024j24N949N7139
8864A75265p3386n2740M3691k8381l77j7986K764L5642j2073k9882M6867l365
8852H6039K724n8408M3023k1595p2730j6444J8144j9923k6143l9428N3737M2248
8840h756j1437j2020M0547n02R617q734N39m5145m3259k0167M9619j0421M7660
8827a2459J8378O8996k1999r3384k8515J5185j0091n0521K3231K2939R1349j585
8815B1524K1514N1468p3973o8148K3230L8225j8325M409N2241j1690j4581n8516
$$ y = [-105194, -70880, -40583, -40015, -70199, -60732, 8784, 39380, 72350, -32280, -12339, 8425, 39012, -11940, -40997, 14948, 95864, 75275, -7104, -86462, -36587, 48879, 18868, 15309, 23734, -96605, -134034, -117559, -156079, -177456, -88618, 6256, 87277, 112301, 112177, 118126, 175265, 101879, 49139, 92830, 64449, 64072, 46086, 48850, 84492, 72419, 42537, 89404, 86039, 88763, 30355, 73378, 51783, -20947, -37391, -19247, -39170, -65313, -104741, -51004, -8756, -20193, -32213, 8334, 7832, 17449, 8715, 9254, -35891, -79150, -99317, -49698, -60119, -12459, 5919, 74915, 52916, -40468, -68983, -53798, -63889, -114410, -91179, -68240, 23109, 21524, 43038, 94506, 20533, -47615, -24385, 13840, -4485, -76, 52165, 40475, 25894, -32622]
8803c2622q9905K052l156M4595O1591J5106J4793k8398k3614M8474m3082n401
8791c9567M757L5929j893k7916J8319P193k1582q1813k2595L7253J2815k0920
8779a00020Q392q7754M0734J207j2463K3489n743l9625Q1988O7829j0065N1630
8767A9599L5635L4912J174j7700K9339j2896n2930m1940R638N833o3541n3942
8755a06819N9069L3402L1823M6681k0702j5342M3758M1436K2639n1062p5712n7332
8743d8161J9077j3900r89N8872J6947j3380R044n8465J4684j1216J8551J0287
8731A351M233L4559L1295j9561J7564j1676J0814p795L7107r126l6696p9825M8381
8718B0625P0905o279n7729o0139L2660J7557O670J7520l7875l39l4003l6964K426
$$ y = [-32622, -122527, -120475, -123631, -79036, -17445, -2339, 12454, -15944, -39558, 8916, -34166, -39567, -34810, 1119, -774, -28690, -10371, -3178, -24760, -106573, -129168, -91915, -79100, -100020, -91628, -179382, -138648, -137441, -149904, -126415, -132158, -171783, -89795, -21966, -32031, 19599, 55234, 90146, 91320, 73620, 102959, 90063, 37133, -4807, 4831, 10664, -52877, -106819, -47750, -14348, 17475, 64156, 43454, 28112, 71870, 113306, 135945, 84883, 9171, -48161, -29084, -42984, -43973, 14899, 31846, 18466, 27510, -30955, -16271, -27487, -8936, 1351, 5584, 40143, 71438, 51877, 69441, 57765, 68579, 60784, 97891, 88765, 52069, -27756, 20625, 91530, 85251, 27522, -32617, 43, 17600, 24270, 41790, 3915, 3576, -30427, -67391, -64965]
8705f4965M2040k3888k8042K0654j8033o3702n864O8224J01468o4743p4329Q1539
8693b9641N3264l6150J9698q0012j7515P7458O6658M4603o6133J5990K6859M1349
8681A16428J9049k4068k028k9422o9170o380J9012J9934P4714J4391l6363k9371
8669F6726p6267j35152K4546J13284l2441j2808j4241r7669Q5648L9100J02308
8658F3034O4379j5033m5624j7483M5695o5108o9360J8424N6287P2695O3J4328
8646A22297q799l7887p2051k5198J975k2438m2625J8935J00133L8796J23922j0859
8634A86201l5564k5762r1635l5556l4562n1136N8903Q325K1074K8185K1915K4716
8622G5104m5638J5252N7771K446P9893N1292J4794l6412n9083n4387q3867P9031
$$ y = [-64965, -22925, -46813, -74855, -54201, -72234, -135936, -141800, -73576, 27892, -36851, -111180, -29641, 23623, -12527, 7171, -72841, -90356, -12898, 53760, 98363, 32230, 48220, 75079, 116428, 135477, 111409, 109381, 79959, 10789, 4409, 23421, 43355, 118069, 132460, 96097, 66726, -9541, -144693, -120147, -6863, -39304, -52112, -66353, -164022, -78374, -39274, 63034, 127413, 112380, 66756, 49273, 94968, 29860, -39500, -21076, 35211, 107906, 107969, 122297, 113498, 75611, 3560, -21638, -19663, -42101, -84726, -65791, 34342, 73138, 197060, 186201, 150637, 124875, 33240, -2316, -36878, -88014, -29111, -20786, 288, 28473, 50388, 75104, 29466, 44718, 102489, 104935, 184828, 236120, 250914, 214502, 155419, 101032, 17165, 96196]
8610I6196j8326j06570n288O9988k8603P0799n9327p9725K9388P2997P2574J7845
8598A31948j2531K3312k4683k8794m9288p623o0632K7991R2855j9439n9785M0925
8586E4256O8356M8665r3599m6707j4880J5016J0452M7227P2199L7879k2979l9809
8574A36076k4811O1657J2760M382P055j24648j20672J3289L5132O6332j1770j37797
8562h3015r0857o1929J967N2986O3154J0400L7078N4014l531P7857M6366p0207
8550C4283l2774R7191J1213j9351j40410r049L2490J7392p5092r8954M8065R3530
8538d1466J2217M4032M3400l5791r7252p213O2153J4952K5183L4332r680J491
8526D6358J5074l7745r4398o1363O6492O7958k8344K7116L3291n0304n3018M0576
$$ y = [96196, 77870, -28700, -33988, 36000, 7397, 78196, 18869, -60856, -31468, 41529, 114103, 131948, 119417, 142729, 118046, 89252, 39964, 32341, -28291, -300, 92555, 73116, 13331, 54256, 122612, 171277, 77678, 30971, 16091, 31107, 41559, 88786, 160985, 198864, 175885, 136076, 111265, 172922, 185682, 190064, 197119, 72471, -48201, -34912, 220, 66552, 54782, -83015, -173872, -235801, -233834, -180848, -117694, -107294, -70216, -16202, -19733, 58124, 104490, 34283, 1509, 98700, 109913, 90562, -49848, -58897, -26407, -9015, -84107, -183061, -134996, -41466, -29249, 14783, 58183, 22392, -74860, -82073, -19920, -4968, 20215, 54547, 44867, 46358, 61432, 23687, -70711, -132074, -65582, 2376, -25968, 1148, 34439, -15865, -68883, -28307]
8514b8307k2038k8831L2280N2351K5045J259l7790j15720J1221P4241M0296l5270
8502c1263P982J4191p7418k7241L6687k6818m2204l3917j066J20477J12623R8301
8490A50334k0042j30357q5960K1911J9320K3516L8539M1767j6500l6640m2601
8479c6713p7746p0078O0949P6952l1759N2562K5358l8955l9950M4690n3046k0749
8467a08485L7226L9890l0324l5019p1467m4819K7681k3927O1310J14319O9198
8456C5583j2221j8907k6532l3465R1934o732k1890N1164M7900J7257q1613J691
8444D4169J0359K8372k3141J1879m7190j26598M9461J00591N2644L7944J4739
8433A53229l8805k4412q0066m9810l3694n0838Q572K8049m9551J3381L7879J02421
$$ y = [-28307, -50345, -79176, -46896, 5455, 30500, 31759, -6031, -121751, -110530, -36289, 4007, -31263, -23281, -9090, -86508, -113749, -77062, -103880, -146084, -180001, -181067, -60590, 52033, 150334, 130292, -65, -86025, -64114, -44794, -21278, 17261, 59028, 42528, 5888, -36713, -114459, -184537, -123588, -46636, -78395, -25833, -475, -39430, -79380, -34690, -87736, -108485, -71259, -31369, -61693, -96712, -168179, -212998, -185317, -209244, -147934, -33615, 35583, 23362, 4455, -22077, -55542, 36392, 29660, 7770, 58934, 106834, 124091, 42478, 44169, 54528, 82900, 59759, 71638, 24448, -102150, -52689, 47902, 100546, 138490, 153229, 114424, 90012, 9946, -39864, -73558, -124396, -115824, -87775, -137326, -123945, -86066, 16355]
8421A6355l3659n4105n0683l359P8396Q9027m70m7115J07330L001p1537j36680
8409a03499k9448J2108P4893J9227K5852K0528j7219k1160J1500q8754J4391L2214
8397d9367M9237N1701M5190m5733m8743m032L4549k078K226K7956j4423j6821
8385B9662j7571L1334N8903o8698j09609k5773J51367N731j09783p8710K1349
8374a11798J8175m2890K4658j0698R0340Q0476q283l6728o9401K2970P2974q803
8362B0992k5218l111J9823O3033J0409r3499L720m7481J14952L3808r2213j07933
8350a02718K9404K1363K0780l1236r6931J1364J09418N0416n5245r6578L9450
8339a00513Q3278O7721j1391p4943k2758J6353m5714J3820L4225n2406m1158R2220
$$ y = [16355, -17304, -71409, -122092, -125451, -47055, 41972, 41502, -5613, 101717, 104718, 33181, -103499, -132947, -120839, -45946, -26719, -867, 19661, 2442, -18718, -7218, -95972, -81581, -49367, -130, 51571, 96761, 51028, 2285, -1747, 32802, 30724, 32950, 60906, 46483, 29662, 12091, 43425, 102328, 33630, -75979, -101752, 49615, 55346, -54437, -133147, -111798, -93623, -136513, -111855, -122553, -32213, 48263, 39980, 3252, -66149, -43179, 29795, 20992, -4226, -7337, 12486, 75519, 85928, -7571, -3851, -51332, 63620, 97428, 5215, -102718, -73314, -51951, -31171, -62407, -159338, -147974, -38556, 11860, -43385, -139963, -100513, -17235, 50486, 39095, -35848, -58606, -42253, -87967, -74147, -39922, -92328, -133486, -41266]
8327d1266J6740n4661Q5313L4340k9567j02194Q3507J577L9180K7880o3551J5445
8315A2743N8786r9140m9285K3314N956K7430P6945Q0332M9264j11513j01297K9551
8303C086M4276j9936j822N402N8632P6062n215m9645j0700M7735k9696k2500k3345
8290G2334r6605l0337l4358O326R6894l3121k9342L6339J4521J4694O2247K7609
8278A07201o5070o4940j999L4863P4754M2840m3870o9114J00274k3316K247J9305
8266A13175q1351J4932J3156r236j2795l1553m7219m581m9290K6588Q8041Q1061
8254A00928K584L1345k5484k7585M586j18764m2469J265l9958n8645M9680q28
8242a23345J5228O410p212K8047J5227R5818O4368n8709j12143k3420K0056j939
$$ y = [-41266, -24526, -79187, 6126, 40466, 10899, -91295, -7788, -6211, 32969, 60849, -2702, 12743, 71529, -27611, -76896, -53582, -47626, -20196, 56749, 137081, 186345, 74832, -26465, 3086, 47362, 27426, 25604, 31006, 89638, 165700, 160485, 110840, 100140, 147875, 118179, 95679, 72334, -24271, -54608, -88966, -82640, 14254, -18867, -48209, -11870, 2651, 17345, 79592, 107201, 42131, -22809, -24808, 10055, 84809, 127649, 83779, 14665, 114939, 91623, 93870, 113175, 31824, 46756, 59912, 50676, 37881, 6328, -40891, -45472, -94762, -68174, 19867, 100928, 103512, 134857, 109373, 81788, 86374, -32390, -74859, -73594, -113552, -172197, -122517, -123345, -108117, -101707, -108919, -80872, -65645, 30173, 94541, 35832, -76311, -99731, -79675, -81614]
8230h1614m1585O2477J9636P6340O4286O0786j3779l3778o998q2781p1183J8317
8218b9876q051K0842O3611Q2661p081m1448l512K2299K3989K9909j7568k3466
8206A12309p5730k1485o3962N851M7965j8689K584L0654M0625O3583n28K2058
8194A45235r976o1793l9431k6156O7316K6569J9866M7810N0116m6628o4900m6274
8182F1754J9490m2895q7465k697l662L5768q663k5386R525l4168j3552k9657j6193
8169a37801L061J37440J08604l8241l4278L6072Q033L192l777L5322R0384r960
8157A98051m1072l7620p0641Q1621p5566n2784j4571K7179Q8131k8541l758m6440
8145B3989P6735M4497l335r5841r2016l6006N279J9896N1128j7048M1609r837
$$ y = [-81614, -123199, -60722, -41086, 35254, 99540, 160326, 146547, 112769, 105771, 22990, -48193, -29876, -37927, -17085, 46526, 129187, 122106, 80658, 77146, 99445, 123434, 153343, 135775, 112309, 36579, 15094, -48868, -43017, 4948, -13741, -11157, 19497, 60122, 123705, 123177, 145235, 135259, 73466, 34035, 7879, 75195, 101764, 121630, 169440, 219556, 172928, 108028, 61754, 81244, 38349, -49116, -51813, -55475, -19707, -28370, -53756, -44231, -78399, -91951, -121608, -137801, -134740, 2700, 111304, 73063, 38785, 74857, 82890, 86082, 82305, 117627, 208011, 198051, 156979, 119359, 48718, 130339, 54773, 1989, -12582, 14597, 102728, 74187, 70429, 23989, 100724, 145221, 141886, 46045, -45971, -81977, -76698, -56802, -5674, -22722, 18887, 9050]
8133I050k5230k0584n1506j5714Q5835O3777P721j9322j7427L8066m4773r8341
8121h8448k5710M5638Q1558K9773J0440J7516L952o4317j4977n881k3413K4431
8109i438n46J5067J4389L3336M532L182k5247n4410l5496K1191P8882Q1410J1432
8096A38284J2302r5388q8146M0834J0548l3109l803j5440l5394j2455Q2386M5263
8084D5882l555j8773M0752O5016M6217L7123q3617l8369n9790j4078q2662p653
8072g3507J09682m741j8748P298J9981o4432m9406P6435R207k9861l7438J3007
8060d2523q772j4856o3748O3841R714j0170N8669j6544l0138M1431j2482L8089
8048A2511o495L8437m4702n6872K4385k1990J7732P722L2380L6089M3820j5683
$$ y = [9050, -16180, -36764, -88270, -103984, -18149, 45628, 53349, 34027, 16600, 54666, 9893, -88448, -114158, -68520, 13038, 42811, 53251, 70767, 74719, 10402, -4575, -10456, -33869, -9438, -9984, 5083, 19472, 52808, 57340, 60522, 35275, -19135, -54631, -33440, 45442, 126852, 138284, 150586, 55198, -32948, 7886, 18434, -14675, -18478, -33918, -69312, -81767, 619, 45882, 42327, 23554, 64306, 129322, 175539, 212662, 129045, 90676, 30886, 16808, -65854, -73507, 36175, 31434, 12686, 19984, 39965, -24467, -73873, 2562, 11769, -18092, -55530, -42523, -51295, -66151, -129899, -66058, -56344, -66514, -7845, -24389, -54527, -13096, -25578, 12511, 6016, 44453, -249, -57121, -32736, -54726, -36994, -29272, 3108, 39197, 83017, 67334]
8036F7334o9860j4269O8249N3862L0087l8184j4837j9556j8424r202O144M4924
8024H6268j4818o0550r66m2080o1615k2751N0352O9520j7916o0047J4597m469
8012f4475n949J1999M2046M5742J904L1669n205l6108J9351M664J1677j3778l3389
7999A0148k8332J1371J9410j3586n1583O0675p953K7148J43793K5051p8646K2432
7987A39928o421q2052p1531j3500N6524J0622Q473l4420l3744k5506k961L1449
7975b3139R763P4138K0099K3946l4398q7553m7674J4180J20041N7395k4760m7519
7963E4519P3458k1203p5576q7598J8796O8171j7236n2659o0871K166O6454m8828
7951h0407k547O4186p446J9055k2802O0748M6444J8766J6920r901K5954m1498
$$ y = [67334, -2526, -16795, 51454, 105316, 135403, 97219, 82382, 62826, 44402, 35200, 41344, 86268, 71450, 10900, 9934, -32146, -93761, -116512, -66160, 3360, -14556, -74603, -60006, -64475, -70424, -58425, -16379, 29363, 31267, 62936, 57731, 21623, 40974, 45638, 57315, 43537, 10148, -18184, -6813, 12597, -989, -52572, 8103, 150, 27298, 171091, 196142, 117496, 139928, 133507, 51455, -20076, -33576, 22948, 33570, 42043, 7623, -26121, -51627, -54588, -23139, -13376, 60762, 80861, 104807, 70409, -17144, -64818, -50638, 69403, 126798, 102038, 54519, 127977, 106774, 31198, -56400, -37604, 30567, 13331, -39328, -100199, -98033, -31579, -80407, -82954, -18768, -26214, -7159, -29961, 30787, 77231, 95997, 112917, 103016, 128970, 87472]
7939H7472P0994o3025m5097j6981j23245l5155M4523M8227O8165n6055j3859K3151
7927a0885N692k0215K942r369l3213k5227l9727N2659O1153k1227r3403j6094
7915a46914N9858O2724k6377p4540j8219J012M0263P7296Q7245k6417K3015J3943
7903G2889L5228k2934m3991n2202j253l3094n696K8553M9260p054K3118n9184
7891a6360k6743j4012L6566P5299J05741Q638n9727o135n6519j6480O3020K1891
7879A15179M5831m582k657m3194j15241n2868M2129j4349n49p0808k2212J56998
7867C3677R6659M8327k5618r8487m6201O590J17581M584l1978q2647O867L2918
7855F2272k4297j04081l0424J15748O9647k3890o3567J5743P805J170l7306l4514
$$ y = [87472, 158466, 95441, 50344, 33363, -89882, -125037, -80514, -32287, 35878, -20177, -34036, -10885, -5193, -25408, -22466, -31835, -65048, -90275, -130002, -77343, -16190, -37417, -130820, -146914, -87056, -24332, -50709, -125249, -143468, -142456, -102193, -24897, 62348, 35931, 58946, 72889, 108117, 85183, 41192, -11010, -12263, -45357, -51053, -22500, 26760, 19706, 42824, -16360, -43103, -57115, -20549, 54750, 160491, 169129, 109402, 103267, 46748, 30268, 93288, 115179, 161010, 156428, 153771, 110577, -4664, -57532, -15403, -29752, -30301, -101109, -123321, 33677, 130336, 178663, 153045, 54558, 8357, 14947, 132528, 137112, 105134, 22487, 29354, 62272, 37975, -66106, -96530, 19218, 88865, 64975, 1408, 17151, 24956, 26126, -11180, -45694]
7843d5694K9052Q0455l1728m9097O5863m4170J9695j907j7214Q5871J5031j2698
7831I3459L9218l3913m8978j8759K1812M0578k530r324J4282O6197O92n8094n4606
7818E0034q01n0037Q334M0723l4236j05549n8911O9630P5182m2372n2732P5731
7806b5004Q607M343M1689J7243q6046J4595J0828P469j090O3899l9627r3849p938
7793h4881Q7443M6681K2009R5022K6755n4342o2329J1218O182m6017J0692K5551
7781H3984L056O962M7064N811n5558m5249k6520J3525n953Q522K9004r270O4155
7768A19533m7901m2345j2226K0486j2763L036P392o458j6401j0619n6558o668
7756f1492J4630L2412p3302k8080K7289J1159K1630q13O919m499K2817Q5213o7550
$$ y = [-45694, -16642, 63813, 32085, -17012, 48851, 4681, 24376, 22469, 5255, 91126, 106157, 93459, 132677, 98764, 49786, 31027, 52839, 93417, 90887, 81563, 95845, 162042, 162734, 104640, 50034, 49233, -804, 7530, 48253, 14017, -91532, -150443, -80813, -5631, -48003, -100735, -25004, -16397, -12054, 29635, 46878, -39168, -24573, -13745, -6276, -7366, 56533, 16906, -76943, -84881, 2562, 49243, 71252, 166274, 193029, 138687, 76358, 87576, 93758, 47741, 58433, 83984, 87040, 94002, 141066, 146877, 91319, 46070, 19550, 33075, 27122, 35644, 64648, 55378, 119533, 71632, 29287, 17061, 37547, 24784, 27820, 35212, 28754, 12353, 1734, -54824, -61492, -46862, -14450, -87752, -115832, -88543, -77384, -55754, -56567, -49648, -54147, -31330, 53883, -13667]
7743a3667p1549n0048M8783O0910k636J0348N8279M0732l898n7390j0544J5267
7731B4587o2844k9452k4085R993J9630l4881l439J0912P081J34763J5813m6006
7719B2072r209n8820r9798o0701N5270j4134k6854J01645j7906n9416m9335J0076
7707b07110J0421N1575M6095M1241O6707O0270J8620N720j16092l5399L8358n1735
7695g1329N487L0143K3300M0690j135j8942l247j1541k4327r478J6248k2665q5917
7682a32713N6243J15083N8505l3130o4445j31814q2557Q8373k6629r7354J4318
7671b36120J00029N2409R0154J19063J929p0931n1937r354J5579N3798j2020J9654
7659G2253k5641j8964j8214n5649n0580L0302o8343q9596j9230J44290J49655
$$ y = [-13667, -85216, -135264, -86481, -25571, -28207, -17859, 40420, 81152, 77254, 19864, 9320, 24587, -38257, -67709, -91794, -81801, -62171, -97052, -100491, -89579, -82498, 52265, 68078, 22072, 12863, -45957, -145755, -206456, -151186, -165320, -192174, -90529, -108435, -167851, -217186, -207110, -196689, -145114, -99019, -57778, 8929, 69199, 87819, 93539, -22553, -57952, -19594, -71329, -65842, -35699, -12399, 28291, 27156, 8214, 4967, -6574, -30901, -40379, -24131, -46796, -132713, -76470, 38613, 97118, 63988, -457, -132271, -214828, -126455, -153084, -250438, -236120, -136091, -83682, 6472, 125535, 127464, 56533, 4596, -4758, 10821, 64619, 52599, 72253, 46612, 27648, 9434, -46215, -96795, -66493, -134836, -224432, -243662, -99372, 50283]
7648E0283P94m3796P422J23o909J4593m1857o42M6570j7453r2525L7278J5149
7635c0970p421j531l7400L3526Q6345J4524k6619O943J3816j7351o8466k2561
7623e7165p5575N9725O6889O5635k4569m5860M0417K9440k0985p9575P0237Q4681
7611A13295L5665k1746j06985j45711p1455K0822J52008Q7357q6687r9276n2754
7600a75467J30687l3948m3562L7853N9544J4255M6896p801o0139R954l3357q1128
7588a36213o2914M4028P0267L7936Q6283P4385p1090o5028M357J6328J7937M8211
7576F4487p978L4320j646l0044r3382R963L0095M284m7749P983P239m245J6900
7563i773J5372L2278l9682K5440J091K3922K4693p0664L967J3295J3582K7413
$$ y = [50283, 51077, 7281, 14703, 14826, 7917, 22510, -19347, -19989, 26581, 9128, -83397, -46119, -30970, -38391, -39922, -77322, -43796, 42549, 57073, 30454, 37397, 51213, 33862, -34604, -57165, -132740, -73015, -6126, 59509, 34940, -10920, 29497, 58937, 37952, -41623, 28614, 113295, 148960, 127214, 20229, -125482, -196937, -176115, -24107, 63250, -23437, -122713, -175467, -44780, -78728, -122290, -84437, -24893, -10638, 36258, 28457, -31682, -21728, -55085, -136213, -199127, -155099, -84832, -46896, 39387, 113772, 42682, -22346, -17989, -1661, 16276, 64487, 56509, 90829, 89183, 59139, -34243, -24280, 5815, 10099, -37650, -29667, -22428, -26673, -9773, 5599, 37877, -1805, 23635, 24726, 48648, 73341, 2677, 6644, 19939, 33521, 60934]
7551F0934k0812l5653l6010r1514M1182N2026M2162P233m6846l7085j8137K0018
7539f2502J3248O0370Q4196j5394m7509r7152K748k1389K9967J04388K912j43660
7527h9777l7431q650j0771l1267N930N603P9347R4521K8553Q868l5179o4223j852
7514e6328r844L5884N6056K4606m5505q8012R449J8767k0635J3453j090M0936
7502b2263k7436L4445O6905m009k1560l3231k4912j667P2860L3655M1168k303
7490A11652J6122n0816J6396p2793k8275j5366j9500j00461M9178Q7841p701j3055
7478b6778J2993L1651l7036l4081j5453P3060O1857J1312L616l7716L5332J3660
7466I2417O070M6772M197n8754l9094j6328n5249k9538O7282M9919K5076j4658
$$ y = [60934, 40122, 4469, -31541, -123055, -81873, -29847, 12315, 19548, -27298, -64383, -82520, -62502, -49254, 11116, 95312, 79918, 32409, -64743, -61995, -83384, -53417, 50971, 53883, -89777, -127208, -135858, -146629, -177896, -171966, -166363, -87016, 7505, 36058, 44926, 9747, -54476, -56328, -66172, -30288, 25768, 50374, 4869, -83143, -73694, -54927, -75562, -62109, -63199, -22263, -49699, -15254, 51651, 47642, 26082, -7149, -32061, -33728, 39132, 72787, 113955, 111652, 127774, 76958, 93354, 20561, -7714, -23080, -42580, -143041, -93863, -6022, -13723, -26778, -13785, 17866, -19170, -53251, -68704, 4356, 66213, 77525, 81141, 43425, 78757, 92417, 98487, 145259, 149456, 90702, 51608, 35280, -19969, -49507, 17775, 67694, 92770, 78112]
7454G8112j02577m8209K161J6613m904r5358Q612j0654L7370K0236J259N0383
7442d6956l9215m2486Q3767P3093O0783n5814k3513n3250M6864J5401k2988o209
7430a0523J0322l8018M7272j814q377L7781m0994N4726J8848j48213K5339O6254
7418A2603N5235J3942l4152j00825j4499O8355Q7256j3634o4644j5036n6976m5800
7406a08175M383Q5099q019l0016j7204M9193R6357K797n3527j2488p631m5118
7394d4349O2220L2199q6132J3585M0030m0552o7411l7927l402N275j6592K1505
7382a21551M7727K7881m9868J14823Q2363J770l2731j04815n2111k0948M5199
7371f2261K5109M3785p744j5881j8260J5028J13005J6029q5131L4264K7263P30
$$ y = [78112, -24465, -72674, -70513, -53900, -58804, -154162, -145550, -156204, -118834, -98598, -97339, -46956, -86171, -128657, -44890, 28203, 88986, 33172, 9659, -43591, 3273, 18674, -4314, -10523, -201, -38219, 9053, 7239, -1138, 36643, -4351, 50375, 69223, -78990, -53651, 12603, 67838, 81780, 47628, -53197, -67696, 659, 87915, 74281, 9637, -5399, -62375, -108175, -103792, -18693, -26712, -56728, -73932, -24739, 71618, 74415, 20888, 8400, 769, -44349, 17871, 50070, -36062, -22477, 17553, -22999, -90410, -128337, -131739, -126464, -143056, -121551, -73824, -45943, -95811, 19012, 101375, 103145, 70414, -34401, -86512, -107460, -62261, -37152, 6633, -1111, -16992, -35252, -20224, 92781, 108810, 23679, 57943, 85206, 85936]
7359H5936L6966o2931q7210l1059J3199J12732m2697k4916o4056l6304N2671K6025
7347b1644L0716o5356L0870M3124k0966M9831j5802l0874o8416m3232m4472l837
7335a60058N3146R1572K6181m5830j15811q923o7799p763N538Q8771O4684K8672
7323d7620j3717l6790N4439J8124m1076k1957J8062K4852O1872k3030m4384P530
7311d3695r268m975M6858J01726O6391p7937j15201p640l7865j2528o3627p7722
7299b35483Q9000L5461L9761J2787J2950N985l1768m0546L6704J63344l9820k6342
7287B2033l4413n9778k2437M589J7886M1655J2693j00970K1266M4573M5776M3036
7275C5909J8433M6132o8196m9874o3565J1741J8398J9182K674o5522m279R1311
$$ y = [85936, 122902, 59971, -27239, -58298, -45099, 67633, 24936, 20, -64036, -100340, -47669, -21644, 9072, -56284, -25414, 17710, -3256, 46575, 30773, -101, -68517, -111749, -156221, -160058, -106912, -15340, 10841, -34989, -150800, -159723, -227522, -235285, -229747, -140976, -76292, -47620, -61337, -98127, -43688, -25564, -66640, -88597, -70535, -45683, 16189, -6841, -51225, -43695, -52963, -57938, -11080, 90646, 157037, 79100, -36101, -43741, -81606, -94134, -157761, -235483, -146483, -111022, -71261, -58474, -45524, -39539, -71307, -111853, -75149, 88195, 48375, 22033, -12380, -72158, -94595, -90006, -72120, -30465, -17772, -118742, -97476, -52903, -7127, 35909, 54342, 100474, 32278, -17596, -81161, -69420, -51022, -31840, -29166, -94688, -98967, -7656]
7263g656k8574L1763l3362J4302J3533l5431L5295O4289N8361l7281l9822p8190
7251d2773m6445N5728N9406j25726k5978J4024M6575j4052Q7161L4922m8555q0930
7239h6643M5280K7101J13273q1040o4681l3114L0866O6899N4942r9887J5506J05470
7227I3972k4591J2063N7232j4886k0800K0555l103m5937K6775l6198k1800o180
7215C7102l5747J7623N1914j9122k9097K9728k6950n6309O524n3264m4161o6540
7203a88299N290M1052P3027M5833M0271L956J339O1220O2880L3364j14713m4150
7191B1070n7473l271L991M436N8532J0805o1822Q893J3032k6196K146l2807l3054
7178i1718j596M1108O3478j9885k1362n5247q285L8093J5448q800l9180n1585
$$ y = [-7656, -36230, -4467, -37829, -23527, -9994, -45425, -10130, 54159, 112520, 75239, 35417, -42773, -89218, -33490, 25916, -99810, -125788, -111764, -65189, -79241, 7920, 42842, -5713, -86643, -41363, -14262, 99011, 17971, -46710, -79824, -48958, 17941, 72883, -27004, -11498, 93972, 69381, 81444, 138676, 123790, 102990, 123545, 120442, 74505, 101280, 65082, 43282, 37102, 1355, 18978, 70892, 51770, 22673, 52401, 25451, -30858, -24334, -77598, -121759, -188299, -183009, -141957, -68930, -23097, 17174, 21130, 22469, 83689, 146569, 179933, 65220, 21070, -36403, -39674, -35683, -31247, 27285, 38090, -23732, -14839, -1807, -28003, -25857, -58664, -91718, -93314, -52206, 11272, -8613, -29975, -85222, -93507, -55414, -39966, -48766, -87946, -139531]
7166a39531K7333L3937P3657k2931r673q031r4770p6427O0771Q9289L4648M1683
7154I955o0811m6686N807J3611k5293Q0848R0009m4882K872K8062M4362m2858
7142E4996m0990q2987n1047J5220j8518N6909N8085O993l0725n3873K4100K8089
7130c3748l4061K0684l5410L3828O7236K1114o1301J5848M6888n315j05186J5790
7118e3633K8292O6539N3406j1391M2565K4129p4861k0984M3218L7279P4566k2677
7106A86448n9557L8218o2579j04804r3993j1646P6906j3221m4742M5333N2150
7095H513L5741m5804n2333l2512j6986J02984O2916j7192p6874o2314K5416j1705
7083h0150m6805K0403K2405J0869L4308j30549q3979Q9250Q7399m3033j0918Q7863
$$ y = [-139531, -112198, -78261, -4604, -27535, -37208, -45239, -140009, -216436, -155665, -66376, -31728, 9955, -50856, -97542, -91735, -78124, -103417, -22569, 67440, 22558, 25430, 53492, 97854, 54996, 14006, -68981, -120028, -104808, -123326, -66417, -8332, -1339, -32064, -85937, -61837, -33748, -67809, -47125, -82535, -48707, 18529, 39643, -21658, -5810, 41078, 35763, -69423, -53633, -25341, 41198, 94604, 83213, 125778, 149907, 75046, 54062, 97280, 134559, 209125, 186448, 126891, 165109, 102530, -2274, -96267, -107913, -31007, -44228, -88970, -43637, 8513, 44254, -1550, -53883, -86395, -103381, -397, 62519, 45327, -31547, -93861, -68445, -80150, -126955, -106552, -84147, -73278, -38970, -169519, -253498, -164248, -76849, -119882, -130800, -42937]
$$ [...]
##END NTUPLES=NMR SPECTRUM
##END=
