##TITLE=Analysis number 317313
Compound Code cc 43304
Book Reference 414/178/3
Project Code adrs
Chemist Name mattw
##JCAMPDX= 6.0         $$ Bruker NMR JCAMP-DX V2.0
##DATA TYPE= NMR SPECTRUM
##DATA CLASS= NTUPLES
##ORIGIN= Bruker BioSpin GmbH
##OWNER= nmr
$$ XWIN-NMR		Version 3.5
$$ Thu Feb 16 09:14:24 2006 GMT Standard Time (UT+0h)  MAYBRIDGE\nmr@NMR_250MHZ
##.OBSERVE FREQUENCY= 250.131544655141
##.OBSERVE NUCLEUS= ^1H
##.ACQUISITION MODE= SIMULTANEOUS (DQD)
##.ACQUISITION SCHEME= undefined
##.AVERAGES= 16
##.DIGITISER RES= 18
##SPECTROMETER/DATA SYSTEM= dpx250
##.PULSE SEQUENCE= zg30
##.SOLVENT NAME= CDCl3
##.SHIFT REFERENCE= (INTERNAL, CDCl3, 0, 16.522)
##AUDIT TRAIL= $$ (NUMBER, WHEN, WHO, WHERE, WHAT)
$$ ##TITLE= Audit trail, XWIN-NMR		Version 3.5
$$ ##JCAMPDX= 5.01
$$ ##ORIGIN= Bruker BioSpin GmbH
$$ ##OWNER= nmr
$$ C:\u/data/dgb/nmr/ADRS/16110/pdata/1/auditp.txt
$$ ##AUDIT TRAIL=  $$ (NUMBER, WHEN, WHO, WHERE, WHAT)
(   1,<2006-02-16 09:13:51.46 +000>,<MAYBRIDGE\nmr>,<NMR_250MHZ>,
      <created by zg, POWCHK disabled, PULCHK disabled
       configuration hash MD5:
       84 BC 41 DB A1 6E 1D 46 DA 25 12 A5 C1 ED C5 3A
       data hash MD5: 64K
       51 34 9A 74 4B 1D 03 E5 25 4D 04 7E 47 9B EE 2B>)
(   2,<2006-02-16 09:14:08.37 +000>,<MAYBRIDGE\nmr>,<NMR_250MHZ>,
      <Start of raw data processing
       ef LB = 0.3 FT_mod = 6 PKNL = 1 SI = 32K 
       data hash MD5: 32K
       D9 03 81 25 24 D7 0E 8B FE 2B 9B 3F E2 6C F7 2F>)
(   3,<2006-02-16 09:14:10.47 +000>,<MAYBRIDGE\nmr>,<NMR_250MHZ>,
      <apk 
       data hash MD5: 32K
       C5 CE 8A 5B 96 3B F4 94 1B 58 25 B8 03 C9 C4 38>)
(   4,<2006-02-16 09:14:11.37 +000>,<MAYBRIDGE\nmr>,<NMR_250MHZ>,
      <abs ABSG = 5 
       data hash MD5: 32K
       32 38 AC FB 3E 35 71 8E 09 71 48 E7 DC 7E BB A8>)
$$ ##END=
$$ 
$$ hash MD5
$$ 5B 43 F9 8E 64 77 67 97 74 0B 7C ED 37 E2 16 5C
##$RELAX= 
##$RELAX= 
##$RELAX= 
##$RELAX= 
##$RELAX= 
##$RELAX= 
##$RELAX= 
$$ Bruker specific parameters
$$ --------------------------
##$DU= <C:\u>
##$EXPNO= 16110
##$NAME= <ADRS>
##$PROCNO= 1
##$TYPE= <nmr>
##$USER= <dgb>
##$AMP= (0..31)
100 100 100 100 100 100 100 100 100 100 100 100 100 100 100 100 100 100 
100 100 100 100 100 100 100 100 100 100 100 100 100 100 
##$AQSEQ= 0
##$AQ_mod= 3
##$AUNM= <au_zg>
##$AUTOPOS= <1 >
##$BF1= 250.13
##$BF2= 250.13
##$BF3= 250.13
##$BF4= 250.13
##$BF5= 500.13
##$BF6= 500.13
##$BF7= 500.13
##$BF8= 500.13
##$BYTORDA= 1
##$CFDGTYP= 0
##$CFRGTYP= 5
##$CHEMSTR= <none>
##$CNST= (0..31)
1 1 145 1 1 1 1 1 1 1 1 1 1 1 1 1 1 1 1 1 1 1 1 1 1 1 1 1 1 1 1 1 
##$CPDPRG= <>
##$CPDPRG1= <>
##$CPDPRG2= <>
##$CPDPRG3= <>
##$CPDPRG4= <mlev>
##$CPDPRG5= <mlev>
##$CPDPRG6= <mlev>
##$CPDPRG7= <mlev>
##$CPDPRG8= <mlev>
##$CPDPRGB= <>
##$CPDPRGT= <>
##$D= (0..31)
0 1 0 0 0 0 0 0 0 0.06 0 0 0 0 0 0 0.0002 0 0 0 0 0 0 0 0 0 0 0 0 0 0 
0 
##$DATE= 1140081229
##$DBL= (0..7)
120 120 120 120 120 120 120 120 
##$DBP= (0..7)
150 150 150 150 150 150 150 150 
##$DBP07= 0
##$DBPNAM0= <>
##$DBPNAM1= <>
$$ [...]
##$SUBNAM7= <"">
##$SUBNAM8= <"">
##$SUBNAM9= <"">
##$SW= 20.6930455092707
##$SWIBOX= (0..15)
0 0 3 0 0 0 0 0 0 0 0 0 0 0 0 0 
##$SW_h= 5175.983436853
##$TD= 65536
##$TD0= 1
##$TE= 293.16
##$TE2= 300
##$TE3= 300
##$TEG= 300
##$TL= (0..7)
0 120 120 120 120 120 120 120 
##$TP= (0..7)
150 150 150 150 150 150 150 150 
##$TP07= 0
##$TPNAME0= <>
##$TPNAME1= <>
##$TPNAME2= <>
##$TPNAME3= <>
##$TPNAME4= <>
##$TPNAME5= <>
##$TPNAME6= <>
##$TPNAME7= <>
##$TPOAL= (0..7)
0.5 0.5 0.5 0.5 0.5 0.5 0.5 0.5 
##$TPOFFS= (0..7)
0 0 0 0 0 0 0 0 
##$TUNHIN= 0
##$TUNHOUT= 0
##$TUNXOUT= 0
##$USERA1= <user>
##$USERA2= <user>
##$USERA3= <user>
##$USERA4= <user>
##$USERA5= <user>
##$V9= 5
##$VALIST= <valist>
##$VCLIST= <CCCCCCCCCCCCCCC>
##$VD= 0
##$VDLIST= <DDDDDDDDDDDDDDD>
##$VPLIST= <PPPPPPPPPPPPPPP>
##$VTLIST= <TTTTTTTTTTTTTTT>
##$WBST= 1024
##$WBSW= 4
##$XGAIN= (0..3)
0 0 0 0 
##$XL= 0
##$YL= 0
##$YMAX_a= 267153
##$YMIN_a= -374464
##$ZGOPTNS= <>
##$ZL1= 120
##$ZL2= 120
##$ZL3= 120
##$ZL4= 120
##$ABSF1= 16.522
##$ABSF2= -4.171173
##$ABSG= 5
##$ABSL= 3
##$ALPHA= 0
##$AQORDER= 0
##$ASSFAC= 0
##$ASSFACI= 0
##$ASSFACX= 0
##$ASSWID= 0
##$AUNMP= <proc_1d>
##$AZFE= 0.1
##$AZFW= 0.1
##$BCFW= 0
##$BC_mod= 0
##$BYTORDP= 0
##$COROFFS= 0
##$CY= 12.5
##$DATMOD= 1
##$DC= 0
##$DFILT= <>
##$DTYPP= 0
##$F1P= 14.0000005364418
##$F2P= -0.99999901652339
##$FCOR= 0.5
##$FTSIZE= 32768
##$FT_mod= 6
##$GAMMA= 0
##$GB= 0
##$INTBC= 1
##$INTSCL= 1
##$ISEN= 128
##$LB= 0.3
##$LEV0= 0
##$LPBIN= 0
##$MAXI= 10000
##$MC2= 0
##$MEAN= 0
##$ME_mod= 0
##$MI= 0
##$NCOEF= 0
##$NC_proc= -4
##$NLEV= 6
##$NOISF1= 0
##$NOISF2= 0
##$NSP= 0
##$NTH_PI= 0
##$NZP= 0
##$OFFSET= 16.522
##$PC= 1
##$PHC0= 100.9505
##$PHC1= 4.924945
##$PH_mod= 1
##$PKNL= yes
##$PPARMOD= 0
##$PSCAL= 4
##$PSIGN= 0
##$REVERSE= no
##$SF= 250.13
##$SI= 32768
##$SIGF1= 0
##$SIGF2= 0
##$SINO= 400
##$SIOLD= 32768
##$SREGLST= <1H.CDCl3>
##$SSB= 0
##$STSI= 32768
##$STSR= 0
##$SW_p= 5175.98343685301
##$SYMM= 0
##$S_DEV= 0
##$TDeff= 65536
##$TDoff= 0
##$TI= <Analysis number 999999
Compound Code 99
Book Reference 9
Project Code 9>
##$TILT= no
##$TM1= 0
##$TM2= 0
##$TOPLEV= 0
##$USERP1= <user>
##$USERP2= <user>
##$USERP3= <user>
##$USERP4= <user>
##$USERP5= <user>
##$WDW= 1
##$XDIM= 32768
##$YMAX_p= 330111350
##$YMIN_p= -141613
$$ End of Bruker specific parameters
$$ ---------------------------------
##NTUPLES= NMR SPECTRUM
##VAR_NAME=  FREQUENCY,     SPECTRUM/REAL,   SPECTRUM/IMAG
##SYMBOL=    X,             R,               I
##VAR_TYPE=  INDEPENDENT,   DEPENDENT,       DEPENDENT
##VAR_FORM=  AFFN,          ASDF,            ASDF
##VAR_DIM=   32768,         32768,           32768
##UNITS=     HZ,            ARBITRARY UNITS, ARBITRARY UNITS
##FACTOR=    0.157963299565203, 1,           1
##FIRST=     4132.6476996994, 0,             0
##LAST=      -1043.33573715361, 0,           0
##MIN=       -1043.33573715361, -141613,     0
##MAX=       4132.6476996994, 330111350,     0
$$ Real data points
##PAGE= N=1
##DATA TABLE= (X++(R..R)), XYDATA
$$ [...]
20470d405Q38l644K2596L323j1079M0j5030l997j4901j2913Q921j764k1396Q959
20456d4452M413j4678j8262J1355K1033K9009p115n617n427k640m018j1650J3295
20443c4754j0941j0678j067P700o16j795K1941J243j1489O914j2173J6725M8137
20430A9147K824j0177j3060r367J9201p074k5143J4363L154J1557r725m910K263
20417f947M738r662L2173J1299j0990L972m148r300J0920J9822j591k1858j1633
20404F795k0964R559n985m902K68r334l154Q900J6969m4492p929r57o191K6755
20390c4662M872Q88j0867J3981N184j810j4503l866o895P245J9371J7295j6983
20377b0750k8926j9469J8210J8462J8922L85P595r08j3807L677K0473J7098N208
$$ y = [-4405, -3567, -7211, 15385, 18708, 7629, 7669, -7361, -11358, -26259, -39172, -30251, -32015, -53411, -44452, -40039, -54717, -72979, -61624, -40591, -11582, -18697, -24314, -29741, -32381, -36399, -48049, -34754, -45695, -56373, -57440, -49740, -50356, -52151, -30210, -28967, -40456, -33542, -45715, -28990, 19147, 21971, 11794, -1266, -10633, 8568, 1494, -23649, -9286, -6132, 5425, -4300, -9210, -6947, -2209, -11871, 20302, 31601, 20611, 24583, 20435, 11135, 22055, 41877, 40286, 18428, 6795, -14169, -4610, -10595, -15497, -15229, -24563, -27717, -18817, -1848, -46340, -54269, -55226, -61417, -34662, -29790, -28902, -39769, -25788, -20604, -22414, -36917, -40783, -47678, -40433, -21062, -3767, -20750, -49676, -69145, -50935, -32473, -13551, -13166, -5571, -6479, -20286, -16609, 3864, 20962, 26170]
20364B6170m0475l0025m786m728j9679K5080M4654j7013k9958j1427J7569j6378
20352f0996J5400M9048j0931k7236k1890m041K2212O820k4125J4318l909N850
20340c9480J6654O573r900Q695L1720j7492J066J9022K096p393m5967j7411K0029
20327c1788J0152Q561J7820m456j0426l393n130J6580L554o140J1487J4202p380
20314A3643r349k2493j522j4734J1647K1490O498j1696o076j173j5501N225K514
20301b1527j0793K36j3294j2262J3056J04m508K0820K1763J5607k3798j0444j3198
20288c8238j0634P130J3000r059j2785J5869L2400O06j1623j8668m3234L860J7991
20275e3385K9143J4808Q351n331q237j4964p560N492J1430K491K522J7648K098
$$ y = [26170, -14305, -44330, -49116, -53844, -73523, -48443, -3789, -20802, -50760, -62187, -44618, -60996, -45596, 3452, -7479, -34715, -56605, -60646, -38434, -31614, -55739, -41421, -45330, -39480, -22826, -16253, -26153, -17458, 14262, -3230, -2164, 16858, 18954, 11561, -34406, -51817, -31788, -21636, -13075, 4745, 289, -10137, -13530, -18660, -2080, 1474, -4666, 6821, 21023, 13643, 4294, -18199, -19721, -34455, -22808, -1318, 5180, -6516, -12592, -13765, -29266, -24041, -21527, -32320, -32084, -45378, -57640, -44584, -44480, -48988, -28168, -6405, 9202, -14596, -25040, -38238, -48872, -41742, -28742, -37801, -50586, -34717, -2317, -1711, -13334, -32002, -75236, -71376, -53385, -24242, -9434, -1083, -6414, -14651, -29615, -37175, -31683, -20253, -17762, -15240, 2408, 4506]
20262D506J277l6056k4852j9437R282l474j8937J8781J2849p813n244l999J2075
20249f1042P180j7914m951J9661K1429L2875L285m289l383l6223j3163r086J257
20236f4364n423L0229K0608q034o743k952K1548j165k023p97l4643m87J9197M636
20222c0413P242J0885J0533Q928p414j9330k485j5676l1715M0128K3201j7662
20210b3778n462L557K47q119P369R106l265J3030J8590L290j4258m810n738N10
20196i731P154j0609J2158L0835j4905m489k8687J5799J5772l3126k1457j5226
20184e6512q18k2273l019Q401L9370M2558L665N336k2467r980j1084n730m711
20171c7264r813L1494M673k5477k174n010l1370o96J8556O333K8301R001K017
$$ y = [4506, 5783, -30273, -55125, -74562, -65280, -68754, -87691, -68910, -56061, -63874, -69118, -73117, -61042, -53862, -71776, -76727, -57066, -35637, -2762, 523, -3766, -7149, -43372, -56535, -65621, -64364, -69787, -39558, -18950, -26984, -33727, -36679, -15131, -16296, -18319, -19116, -53759, -54246, -35049, -30413, -23171, -12286, -1753, 7175, -239, -19569, -22054, -37730, -69445, -29317, -6116, -23778, -29240, -25683, -25436, -33555, -26186, -17080, -20345, -7315, 11275, 14565, 307, -4503, -10241, -9731, -2577, -13186, -1028, 29807, 14902, 10413, -18274, -2475, 13297, -19829, -41286, -56512, -57330, -79603, -82622, -74221, -34851, 7707, 11372, 16708, -5759, -15739, -26823, -32553, -37264, -47077, -15583, -10910, -36387, -38561, -43571, -74941, -75637, -57081, -50748, -22447, -13446, -11429]
20158a1429K1074n877K0075k1191o3660K0755K0326r596j24J2713J8743J2249
20146A4058j88j9613n493N833J1719N458l687o779r445K4757o655j0853n916l6482
20132d3286P896L1271R964k9947j3010m472J7356K3860J1562K2484K0727n035
20120D9370l6669k8304r806J2078K6847N21N115k2761p138j5944P366J0528J1462
20107B665L0757K4569J0097j7943k6445k045J5118j1256j5752j0128j4402O517
20095h248q407M619P307K1966j0136l5442l926J7396j5583j9287p777j4405K9176
20082d2747j043q562J4012J8392l5675l0768L7553L3642j2647n583j0112m246
20070d7784K2010K5516j4029r444j54r571l0088n01L8419K5271j6275k8707q103
$$ y = [-11429, 9645, 3768, 23843, 2652, -61008, -40253, -19927, -29523, -29647, -16934, 1809, 14058, 13870, -5743, -11236, -5403, 6316, 11774, 8087, 1308, -8137, 16620, 9965, -888, -6804, -43286, -35390, -4119, 5845, -24102, -37112, -41584, -24228, -368, 11194, 33678, 54405, 49370, 12701, -15603, -25409, -13331, 13516, 14037, 19152, -3609, -10747, -26691, -19325, -8797, 2665, 33422, 57991, 68088, 50145, 23700, 21655, 36773, 25517, 9765, -363, -14765, -8248, -16655, -12036, -4729, 17237, 7101, -28341, -32267, -14871, -30454, -49741, -57518, -71923, -42747, -43790, -52352, -38340, -19948, -55623, -86391, -48838, -15196, -27843, -33426, -43538, -47784, -25774, -258, -14287, -23731, -23885, -33456, -63544, -64045, -25626, -355, -16630, -45337, -53440]
20057e3440K3746K0570j9734J539J3871J6300k4359k3586L098K945j3005k9369
20045h1424K396K5652K419K1377R96r477m895l505o699L183L9091K798l315j4059
20031b5462k079J2910J3974k2325N037J6670J4277j145r483k2419m2169L0434
20019c1780L960r041P507J5701O390R382O334q768j5412k4333p587L1151J0579
20006e917q86K0149K4860J1231J5320J1446j8012q570k3115J2762p823r989O9
19993B1525K5117M521j0822k7083j4006L7040J577O571J9068k403r235k3270o504
19980B2096J4709j3704m728j707j3704K8917R202M341j3844m4648o776k03k4766
19967d4815J1531L6436l048P907j4859j2483j2149J5481J620j3841q284J5009
$$ y = [-53440, -29694, -9124, -28858, -27319, -13448, 2852, -21507, -45093, -41995, -39050, -52055, -81424, -79028, -53376, -50957, -29580, -28584, -38061, -42956, -46461, -53160, -49977, -10886, -8088, -11403, -25462, -27541, -14631, -657, -22982, -17945, -1275, 13002, 11857, 2374, -20045, -62214, -31780, -27820, -36861, -29354, -13653, -7263, 2119, 8453, -315, -15727, -40060, -47647, -16496, -5917, -6803, 13346, 38206, 49437, 64757, 76203, 58191, 49621, 26506, 39268, 31445, 21456, 21525, 46642, 51163, 40341, 13258, -748, 36292, 37869, 44440, 63508, 61105, 51870, 28600, 22096, 36805, 23101, 18373, 16666, 2962, 31879, 41081, 45422, 31578, -13070, -19846, -20049, -44815, -33284, 3152, 104, 8011, -6848, -19331, -31480, -15999, -14379, -28220, -36504, -21495]
19955b1495J2114j1088j871j4837K473n089N563K4937J4647K1267l9898M630j4498
19942b3145l396R870K6808L9063J2352k7817l3522l2052j0359J7086K9088j408
19930B568j1169j5055R501J7197J5627L524j4004q928l0728J3032J3747J6620
19918A1932n052n823n0081k1604L6369K204j5332o125o252J6876J0356K5085J5577
19905H130j5634r222p120K172k388j6793o529l8856R278J7741J4195j202j1911
19892e8139N980Q751K5803J527j5169O790p423j2567J9486M5834L9291R279j4140
19879E5303N728J1057j4112q926J8512j6356q45j9112J2737J4727L300K4067P190
19866I3270R781m386N452j1682k6796j8252k0296J1724L3303k1846n981l114p308
$$ y = [-21495, -9381, -20469, -22340, -37177, -34704, -39793, -34230, -9293, 5354, 26621, -13277, -8647, -23145, -26541, -16671, 10137, 49200, 61552, 33735, 213, -31839, -42198, -25112, 3976, 2568, -8601, -23656, -14155, 3042, 18669, 22193, 8189, -739, -31467, -18435, -4688, 11932, 6880, 1057, -49024, -70628, -34259, -32055, -47387, -53512, -59764, -42888, -32532, -7447, 8130, -7504, -16726, -23846, -21674, -24062, -40855, -47384, -86240, -76962, -59221, -45026, -46228, -58139, -52159, -43408, -17605, -16078, -31247, -24457, -31880, -44447, -24961, 20873, 60164, 69443, 55303, 61031, 72088, 57976, 49050, 67562, 51206, 50361, 31249, 43986, 58713, 62013, 86080, 93270, 103051, 98665, 104117, 92435, 65639, 47387, 27091, 38815, 72118, 50272, 44291, 41177, 33869]
19853C3869j3275l540L2214M879m5091j6302J8671j1199j9794k5849j3783m460
19841f3660J4656l721J3262J4077J9163K8116L1171J996k5988R377K9474J9423
19829H7346L7261J3708p591L2530P883k8112k1570O485M3144N4577L7114O928
19817B69703p163p180J870l468k4798r356j5278j1298l6298k4333k4678r157j1331
19804H7235m3348l0606Q476K1908N711j6290j6045J4583L808l618J6739L1489
19792H0042r524j3782O223l7538p153l868K013R653j9878J0642J9722n309m923
19779B6320j9632k5976K482o903K377J8572K5593q776j1633k041K3632J954R047
19766C5016k0342j6519j9747l6253k349P951K3190j4931K413Q590L250O788R965
$$ y = [33869, 20594, 17054, 49268, 54147, 9056, -7246, 11425, 226, -19568, -45417, -59200, -63660, -49004, -52725, -39463, -25386, -6223, 21893, 53064, 55060, 29072, 38449, 67923, 87346, 124607, 138315, 130724, 163254, 171137, 143025, 121455, 127940, 171084, 225661, 262775, 269703, 262540, 255360, 257230, 253762, 228964, 219608, 204330, 193032, 156734, 132401, 107723, 98566, 87235, 43887, 13281, 21757, 43665, 49376, 33086, 17041, 31624, 35432, 31814, 48553, 80042, 70518, 56736, 62959, 25421, 18268, 14400, 16413, 26066, 6188, 16830, 36552, 31243, 26320, 6688, -19288, -16806, -23709, -21332, -2760, 22833, 14057, 2424, 383, 24015, 25969, 35016, 14674, -1845, -21592, -57845, -60194, -52243, -29053, -43984, -41571, -32981, -29731, -22943, -12978]
19753a2978L3779k4012l3049L749N811j4858j988J1024N776m603k9069n575L0155
19740c5838L8038J1606Q602k029l105O660j2060l2263l029J7183L792O481J2416
19727A6454l031l3628k3246J0365J3898j1425j3290p18J6397K141j0719L0264
19715f538J0081j7839k139k3820k0664J6101J3304K7759O306p270Q757Q453K7058
19702C9549k1871k6699p062r032j2458j2531J0850Q057L706J0903M172P697j9240
19689b3959l8497N156j7321q685J001K2670n810k6992J0006J9945K6523j2412
19677d8375J4087K2506r613O951J4840k0412j1411L2667K6584r040p233l1299
19665a9748n044J1338P915j16p396l6181J1756M0834j9571k971K064r085j686
$$ y = [-12978, 20801, -3211, -36260, -32511, -26700, -41558, -43546, -32522, -26746, -31349, -60418, -65993, -35838, 2200, 13806, 22408, 20379, 17274, 23934, 11874, -20389, -23418, -6235, -2443, 4038, 16454, 13423, -20205, -43451, -33086, -19188, -30613, -43903, -44621, -28224, -26083, -36802, -6538, 3543, -14296, -16435, -40255, -60919, -44818, -31514, -3755, 2551, -4719, 4038, 12491, 39549, 17678, -9021, -16083, -25115, -37573, -50104, -39254, -31197, -27491, -16588, -12416, -4719, -23959, -62456, -57300, -74621, -83306, -82305, -59635, -65445, -92437, -82431, -62486, -35963, -48375, -34288, -11782, -21395, -14444, 396, -20016, -31427, 1240, 27824, 18784, 11551, -19748, -24792, -13454, -5539, -5655, -13051, -49232, -37476, 3358, -16213, -19184, -17120, -26205, -27891]
19652b7891n902M664L1876P946J95k9753k979J9022J0059k4152j3214j1783J9804
19639b2108J905P775J2664q092j7461K338K0544R231J0434q600j6163j6007K6971
19626C431k469J9996q788j9061n131J2386k8343l9150J8165J3848N38K1901J170
19613a1507Q272n3j8057J6025L0582K0629m0107j0821k416J2751M8945K7998J6518
19600I8759N773k8720j2751l0704j3841L2308K8825j0864o125L2786M3017J8846
19588A57309M8573R1139M7588Q9276O6329P0422r628o0396p7910p7240j9125l5264
19576B91073L0002P5165P1260Q2502M2093o228k1977m8401m0493n5072k8234k9502
19564C62188k1256l8763n9281o2687o2638k9381m3396j1163n967j5907K540L3486
$$ y = [-27891, -33793, -29129, 2747, 10693, 10888, -18865, -21844, -2822, 7237, -16915, -30129, -41912, -22108, -20203, -12428, 236, -7856, -25317, -22979, -2435, 6796, 17230, 8630, -7533, -23540, 3431, 962, 20958, 12170, -6891, -12022, 364, -27979, -67129, -48964, -35116, -34578, -12677, -11507, -3235, -3288, -21345, -5320, 25262, 45891, 5784, -5037, -7453, 5298, 54243, 82241, 98759, 104532, 75812, 63061, 32357, 18516, 50824, 79649, 68785, 62660, 95446, 138463, 157309, 205882, 297021, 344609, 433885, 500214, 570636, 561008, 500612, 422702, 345462, 326337, 291073, 321075, 396240, 467500, 550002, 592095, 585867, 563890, 515489, 474996, 419924, 391690, 362188, 340932, 302169, 242888, 180201, 117563, 88182, 44786, 33623, 27656, 11749, 14289, 47775]
19552D7775J0745l6334l589n326m922K108J6145L1850N2024K9372J3564M5460
19540A98872J5983k5441l9017k3111J7250O2935K6789M5948P3276J16936J56192
19529F26612R5972J8256k2322l2107m2795n4480m9403k5241N94J4073J0570K153
19517E41882j5576o3576o7556n7063m7123n6250k5635l1823j4011l7118o4776
19506F1375O69m538k7m265N086K2656l75j9460k0854l1162k0830O387K0219J7215
19492C2096L7931K2674k064J6j4511l0691j0192L1965j0478L0511O005m7309k6864
19479A9089J0022J4549Q268L662j1538k6147J2444L7623K0291J4816L349r485
19467I6943l3002j0577k2246K916k5463J3799K3548k0015k0243J6068J8802J5491
$$ y = [47775, 58520, 22186, 18597, 13271, 8349, 10457, 26602, 58452, 110476, 139848, 153412, 198872, 214855, 189414, 150397, 127286, 144536, 207471, 234260, 280208, 353484, 470420, 626612, 722584, 740840, 718518, 686411, 643616, 589136, 539733, 514492, 515086, 529159, 539729, 541882, 526306, 462730, 395174, 338111, 290988, 234738, 209103, 177280, 163269, 126151, 61375, 62044, 57506, 57479, 53214, 58300, 80956, 80581, 61121, 40267, 9105, -11725, -5338, 14881, 32096, 70027, 92701, 90637, 90653, 76142, 45451, 35259, 67224, 56746, 87257, 93262, 45953, 19089, 29111, 43660, 51928, 55590, 44052, 17905, 30349, 67972, 88263, 103079, 106428, 96943, 63941, 53364, 31118, 34034, 8571, 22370, 45918, 25903, 5660, 21728, 40530, 56021]
19455E6021N593j2859o683N1524K1979P542P918j7261k0686j5365l643R542l069
19442H0553k3876J2969J4287j8330j3015L0743J5296j6624k0118P494k8127j6316
19430B4936j5744j3682l1813L8949L0626O081J271L015R219J4850J4349j978m4671
19417C5408k1846J227K256K8224J949J0898J3376J3018M475n040n661j4263j1211
19404E2810j2673L0769L932r467R118j3971Q6l075J0266q744j2014O210J4854
19391F8101J6396N435j3826j1275k666r423L140L4648Q123l2527R294M4081M290
19378A23791l9298k2382o506M235K0397o248m6646j5J0063j687J0009L1628R378
19365H6719j9413l3108k4966j0541J7369P467K942n14P760J6422j6503k8207j2556
$$ y = [56021, 61614, 48755, 42072, 93596, 115575, 123117, 131035, 113774, 93088, 77723, 74080, 83622, 80553, 56677, 69646, 83933, 65603, 52588, 83331, 98627, 82003, 61885, 69379, 41252, 24936, 9192, -4490, -36303, 2646, 33272, 39353, 40624, 43639, 52858, 67708, 82057, 80079, 35408, 13562, 14789, 17045, 45269, 47218, 58116, 71492, 84510, 88985, 83945, 78284, 64021, 52810, 40137, 70906, 74838, 65371, 74489, 60518, 60604, 57529, 67795, 59051, 47037, 53247, 68101, 84497, 89932, 76106, 64831, 62165, 52742, 55882, 90530, 98653, 66126, 75420, 119501, 123791, 84493, 62111, 55605, 59840, 80237, 73989, 27343, 27328, 37391, 35704, 45713, 77341, 86719, 67306, 34198, 9232, -1309, 16060, 23527, 26469, 25955, 33715, 50137, 33634, 5427, -7129]
19352g129L3658L1965J1869o02p840k9750r98j895J8305K6088l0181k5014J7022
19339C5498J3778j9633p118K4736P508j2569k8910m290K1891K6222P53j2356J1677
19326E7187o531K1358K717P696J2135j156K1037P383j5169P952K046k2276j6385
19313G7994o110K5009L0804k4580m6377j2417M18L9214K7991n86j23K2225K0338
19300A53800m0609j1295q151j855q06K5599L2100K1354Q500j1327n044Q785n061
19287A65990j3174R25j3596j4835J2515J0963N614J6027M675N89q689j8427k1124
19274A27453J4335K4145J9976K981K7344j1809k5179j7051l5191K6337m123n8689
19262I0529o7439k979J3040Q098j603m847k3336r579J0444J1717o833j71J3759
$$ y = [-7129, 26529, 58494, 70363, 69761, 61921, 32171, 31173, 29278, 47583, 73671, 43490, 18476, 35498, 49276, 29643, 22525, 47261, 54769, 42200, 13290, 9000, 30891, 57113, 57866, 45510, 57187, 50656, 72014, 74731, 82427, 94562, 93406, 114443, 121826, 106657, 114609, 116655, 94379, 77994, 71884, 96893, 127697, 103117, 56740, 44323, 44741, 83955, 111946, 111360, 111237, 133462, 153800, 113191, 101896, 93745, 91890, 91084, 116683, 148783, 170137, 178637, 167310, 162266, 171051, 165990, 152816, 153741, 140145, 125310, 137825, 148788, 154402, 170429, 175104, 175693, 167004, 148577, 127453, 141788, 165933, 185909, 188890, 216234, 204425, 179246, 162195, 127004, 153341, 149218, 90529, 23090, 20111, 33151, 41249, 39646, 34799, 11463, 1884, 12328, 24045, 17212, 17041, 30800]
19249C0800M2571K9619L9899K5460J29L3923L9179M0441N9066O7253R5713P6339
19237E80392J8619K8444K5553M7273O0431K6235L1304k7863o6894o3616k5468
19226F34410l4547n6853n8687k7463l6188l0682r039j5064l7486o9366j5981j5178
19214B27876n187j7028k2573j4755j8400k6742j0201m202K3772O427k7550j0723
19202A00714n331J7107K6878J2516M5917L1473J7310l1067l3104m3752l1476m4314
19190F2871J2242K879J0433J8931J2057r408j5496l1521l331J1167N587q202j1440
19177E6769q670K2083J7367J0894J2925L3554K4385j3667k0450J5681J7045J9186
19165A87102r261J0413m052j1044P48J2910j6884J6546J2327P149J5726j268l3832
$$ y = [30800, 73371, 102990, 142889, 168349, 168478, 202401, 241580, 282021, 341087, 408340, 504053, 580392, 599011, 627455, 653008, 700281, 760712, 786947, 818251, 790388, 723494, 659878, 634410, 599863, 543010, 484323, 456860, 420672, 389990, 380951, 365887, 328401, 259035, 243054, 227876, 222689, 205661, 183088, 168333, 149933, 123191, 112990, 108788, 132560, 138987, 111437, 100714, 95383, 112490, 139368, 151884, 197801, 229274, 246584, 215517, 182413, 138661, 107185, 62871, 75113, 77992, 88425, 107356, 119413, 110005, 94509, 62988, 59657, 70824, 76411, 68209, 56769, 48099, 70182, 87549, 98443, 111368, 144922, 169307, 155640, 135190, 150871, 167916, 187102, 177841, 188254, 184202, 173158, 173906, 186816, 169932, 186478, 198805, 205954, 221680, 220412, 186580]
19152A86580n09J1519k781k2446J2841L8256L2408L5741r604n6929m436j2991
19140B07649j9904l2587k8935n240L306P4594M5177j3049j4348M586L158J3191
19128B37598J1097L3732K2469K7368k196j6793j1113L0006N3544L1690J6455L0531
19116D64388M8644J6709r61m09J2796N5535Q7383O3911N9909O9182N4314O1945
19104I93346P2070M5370N3736K7760N3282J40298J87296K10072K51295L43616
19094B378141L97632L57624L05297K54869K28641K85944L81963N29451P05943
19085E825505R67492J404655J991330K782165L563257M005911L599598K394881
19077B6534794R43555n775O10502K973559P229358J3602094K0983089K7518478
$$ y = [186580, 186071, 197590, 194809, 172363, 185204, 223460, 255868, 291609, 282005, 225076, 220640, 207649, 187745, 155158, 126223, 120983, 124289, 198883, 244060, 231011, 216663, 221249, 224407, 237598, 248695, 282427, 304896, 332264, 330068, 313275, 302162, 332168, 385712, 417402, 433857, 464388, 513032, 529741, 528780, 528371, 541167, 596702, 684085, 747996, 807905, 877087, 931401, 993346, 1065416, 1110786, 1164522, 1192282, 1245564, 1385862, 1573158, 1783230, 2034525, 2378141, 2775773, 3133397, 3438694, 3693563, 3922204, 4208148, 4590111, 5119562, 5825505, 6792997, 8197652, 10188982, 12971147, 16534404, 20540315, 24139913, 26534794, 27478349, 27472574, 28083076, 31056635, 38285993, 51888087, 72871176, 100389654]
19069A00389654K9690110K4130853J3249566l90953j1448187j7417504k0249368
19062A17954171k0810494j8189673j2997654o770011j016819K366523K249551
19055F2785594p42699m997903q446004r412071q436078o508059m525712l037210
19047A6679858k022090j324566q37503m44834j89340k6717l1567n8049q2427j43071
19037A1519694m7163K11587N33876J043262J887884L081560M853343P010606R004068
19028C9098717R758126Q084433M332286k19256l265332k707018J332884P749709
19020F4164549J5060987K1659761K5444224K5913216K2685725J4571349J803430
19013A91303241j2918369k6655266l2700796k9998816k3055478j4679985p702206
$$ y = [100389654, 130079764, 154210617, 167460183, 167069230, 155621043, 138203539, 117954171, 97143677, 78954004, 65956350, 59186339, 58169520, 60536043, 62785594, 62042895, 57044992, 48598988, 39186917, 30750839, 24242780, 19717068, 16679858, 14657768, 13333202, 12495699, 12050865, 11861525, 11834808, 11803241, 11745192, 11662765, 11519694, 11472531, 11684118, 12217994, 13261256, 15149140, 18230700, 23084043, 30094649, 39098717, 48856843, 56941276, 61273562, 61054306, 57788974, 55081956, 56414840, 64164549, 79225536, 100885297, 126329521, 152242737, 174928462, 189499811, 191303241, 178384872, 151729606, 119028810, 89029994, 65974516, 51294531, 43592325]
19006D3592325l204922r71043p05577j845338l564383m847378m964626m336576
18998A9152482l392646k448204j804955j318726r45302o99220n69407m87964m48122
18989G037936m28859m88850n27325n33669n28867m46095l55182l02434k71070
18980C155585k61157k51209k02428j90845j86200j31133o6105r2403j32354p4753
18970A566998r7358q7766k9481k647p3647l3514j4688l3399k1723k6240j3146
18959A133389j2870l0364L016M323j7194k6883j5592j4351k2115j2007m5308l7209
18947I06835j9218J0957K5573r163Q774K8701K4233j4085n6476m2258o1449l1938
18935G70486o950k6022k0023L7257L104j0717j2562l5121j6778l4708l126k8575
$$ y = [43592325, 40387403, 39416360, 38710783, 36865445, 33301062, 28453684, 23489058, 19152482, 15759836, 13311632, 11506677, 10187951, 9242649, 8543429, 7974022, 7486058, 7037936, 6609077, 6120227, 5592902, 5059233, 4530366, 4084271, 3729089, 3426655, 3155585, 2894428, 2643219, 2440791, 2249946, 2063746, 1932613, 1866508, 1774105, 1641751, 1566998, 1469640, 1381874, 1352393, 1349746, 1276099, 1242585, 1227897, 1194498, 1172775, 1146535, 1133389, 1120519, 1090155, 1093171, 1097494, 1080300, 1053417, 1037825, 1023474, 1001359, 989352, 944044, 906835, 887617, 898574, 924147, 914984, 923758, 952459, 976692, 962607, 906131, 863873, 802424, 770486, 763536, 737514, 717491, 754748, 757852, 747135, 734573, 699452, 682674, 647966, 644840, 616265]
18923F16265o7764j0176j3563J3404j2933J658j715J235L0130N3973L9156J4724
18911F64394L9273R465L9738J917l2654k5692m6510n006j7401J5005k2899j6431
18899F03199j1088n913r968k0624l894J9479K5427L2074J8655J1786j0893R558
18887F57798o969K077N006k3398R923N408j8830L4960K4461J1620P105J5854L1056
18874G56071L5870j1624m5010l6869l8022n0049n0743n0620n0560j0361K129j3052
18862D37160m4307J126J3737K2726r310k2791j1412k4080n1267l9638k489J534
18850B70989q532q388o225J1617K5315p22J2960M4254J6517L0177L9611J2128
18838D39701J7145K1719J4191l154k9966P140K8696L1400L9327L7539K0895K0732
$$ y = [616265, 548501, 538325, 524762, 538166, 525233, 526891, 525176, 526411, 556541, 610514, 649670, 664394, 703667, 713132, 752870, 754787, 722133, 696441, 649931, 644925, 627524, 642529, 619630, 603199, 592111, 586198, 576230, 555606, 551712, 571191, 596618, 628692, 647347, 659133, 648240, 657798, 650829, 652906, 657912, 634514, 644437, 649845, 631015, 665975, 690436, 702056, 709161, 725015, 756071, 791941, 780317, 735307, 698438, 660416, 610367, 559624, 509004, 458444, 448083, 450212, 437160, 392853, 393979, 407716, 430442, 421132, 398341, 386929, 362849, 311582, 271944, 269455, 270989, 262457, 254069, 247844, 259461, 284776, 284054, 297014, 341268, 357785, 387962, 427573, 439701, 456846, 478565, 492756, 489602, 459636, 466776, 495472, 526872, 566199, 603738, 624633, 645365]
18826F45365L2159o182J557m063J8330j2968k3375l2050k4181k2860n1783n4423
18814D65526n9841m5086l5117l1571J4051j0040L101j4015K500j5040Q970L1816
18802C15254n357J0991K130j2323k8013J7482J1572j0964j674Q371J3157j1864
18790C08762j6011l307J2869J9435J4840K1696R078J3684m829l965l8680j3032
18778C20540j8349j6978L3276L9800K6060k6490l9578j7901m067K597J0293K0853
18766C30056O6057J01395R7752N6187l857m9711m9448k8502k1785J3431J8137
18755E29712J1263k523R670L3310L3380L0370N4833L2708o54N5233j1532j2050
18743G63720N6446J02558O1839Q0668O4905P1244O4514L0989N0465Q6077J33300
$$ y = [645365, 677524, 671342, 672899, 668836, 687166, 674198, 650823, 618773, 594592, 571732, 519949, 465526, 405685, 360599, 325482, 293911, 307962, 297922, 301023, 287008, 289508, 274468, 283438, 315254, 309897, 320888, 323018, 310695, 282682, 300164, 311736, 300772, 299098, 307469, 320626, 308762, 292751, 289444, 302313, 321748, 336588, 358284, 367362, 381046, 376217, 372252, 333572, 320540, 302191, 285213, 318489, 358289, 384349, 357859, 318281, 300380, 296313, 298910, 309203, 330056, 396113, 497508, 595260, 651447, 647590, 597879, 548431, 519929, 498144, 511575, 529712, 540975, 538452, 548122, 581432, 614812, 645182, 700015, 732723, 732069, 787302, 775770, 763720, 820166, 922724, 984563, 1065231, 1130136, 1201380, 1265894, 1296883, 1347348, 1433425, 1566725]
18732A566725J66482J88391K17512K31857K84503K93536L30426L70240L77560
18723D027232L58113L21158K84499K56445K24824J56258J9951m4854j15290k11943
18713E276393k47657l16846k91815l23486l51144l46985l50758l34841k73549
18704B439312k48792k45280k08954j65536j36656r4179q1306q9554q9694n7358
18694A022003o2452m2028j2864l6477m5077l7346k6987o530K871l0321l3391k2821
18682F68580k5758m9951n8308P201K0771M465j1443q600lL0541K6162R047k441
18669F10263l3435J9113J3491l0572k3095j1631r687O659P479K3465L2551L1533
18657F36134p495P35J5820M6567M6776O1276M1100M2723O5044R9250Q1995Q0295
$$ y = [1566725, 1733207, 1921598, 2139110, 2370967, 2655470, 2949006, 3279432, 3649672, 4027232, 4385345, 4706503, 4991002, 5247447, 5472271, 5628529, 5648480, 5603626, 5488336, 5276393, 5028736, 4711890, 4420075, 4096589, 3745445, 3398460, 3047702, 2712861, 2439312, 2190520, 1945240, 1736286, 1570750, 1434094, 1339915, 1258609, 1169055, 1079361, 1022003, 959551, 917523, 904659, 868182, 823105, 785759, 758772, 752242, 755113, 724792, 691401, 668580, 642822, 592871, 534563, 541764, 562535, 567000, 555557, 546957, 546954, 577495, 603657, 612704, 610263, 576828, 595941, 609432, 578860, 555765, 544134, 534447, 541106, 548585, 572050, 604601, 636134, 628639, 629374, 645194, 691761, 738537, 799813, 840913, 883636, 948680, 1047930, 1129925, 1210220]
18645A210220M4839k4100K217p552K2347N4496K3307N5848O2881Q4366P5057M4140
18633A648066K0171K5990O7528P2662P1428R9779J04595Q9650P8304Q6229Q6307
18622B450709R6859J16787J42482J62560J94601J66446J41017J39377J54161J69944
18612C934943J63538K08278K41835K64999L02020L16822L35011M43378N63663
18603F774487O45673Q10964J002839J249943J582540K010654K673992L553108
18595B0304200M784175O377025Q078846R457376J0045896R547722Q161368O638036
18587H3394644N785891O046239O897599P168485N998129L236263m59637l746717
18579A14320896n798759o237900n572761n033282n520998o968798q836078j0084461
$$ y = [1210220, 1255059, 1230959, 1233176, 1225624, 1247971, 1302467, 1325774, 1381622, 1444503, 1528869, 1603926, 1648066, 1668237, 1694227, 1761755, 1834417, 1905845, 2005624, 2110219, 2199869, 2278173, 2364402, 2450709, 2547568, 2664355, 2806837, 2969397, 3163998, 3330444, 3471461, 3610838, 3764999, 3934943, 4098481, 4306759, 4548594, 4813593, 5115613, 5432435, 5767446, 6210824, 6774487, 7420160, 8231124, 9233963, 10483906, 12066446, 14077100, 16751092, 20304200, 25088375, 31465400, 39544246, 49001622, 59047518, 68595240, 76756608, 83394644, 89180535, 95226774, 102124373, 109292858, 115290987, 118527250, 118067613, 114320896, 108522137, 102284237, 96711476, 91678194, 86157196, 79188398, 70352320, 60267859]
18571F0267859j0062411r092275p500704n853242m467886l404832k677596k089181
18563A5119732j714261j369317j134382r16371p35176o30049n83642n38001m46716
18554G051817l74246l25563k86804k53750k37787j93243j38921j91807k18368
18545D831328k73745l20167l05290k72071k50632k01887j68361j79412j63091
18536B696672j54417j40203q1894o9858o7952j27052j01602q3198j02379q2685
18526A685432o8497n8958l7240m0818j269K841k5250j1172L692k1386j8709M455
18514A413121L7437N1160M1642M0123L8792K3841j945K8421N5922L0437n3297
18503A705654o6925o6624r2479r2377m3917J6930J4792P8779J40737Q3567K3205
$$ y = [60267859, 50205448, 41113173, 33612469, 27759227, 23291341, 19886509, 17208913, 15119732, 13405471, 12036154, 10901772, 9985401, 9250225, 8620176, 8036534, 7498533, 7051817, 6677571, 6352008, 6065204, 5811454, 5573667, 5380424, 5241503, 5049696, 4831328, 4557583, 4237416, 3932126, 3660055, 3409423, 3207536, 3039175, 2859763, 2696672, 2542255, 2402052, 2320158, 2250300, 2182348, 2055296, 1953694, 1870496, 1768117, 1685432, 1616935, 1557977, 1520737, 1479919, 1478650, 1481491, 1456241, 1445069, 1448761, 1427375, 1408666, 1413121, 1450558, 1501718, 1543360, 1583483, 1622275, 1646116, 1644171, 1672592, 1728514, 1758951, 1705654, 1638729, 1572105, 1479626, 1387249, 1343332, 1360262, 1375054, 1453833, 1594570, 1678137, 1701342]
18492A701342K249r1519j31384j54584j31386q3959o3725l2822l8095k7786k6909
18481I21422l8023p843J7540j9399j6552K1587O3547Q6932O8084O4153L5549J6952
18469A213949L9108J5937J4341N8300O1558K9452l0137o3798q5268q1512k0176
18458A151754j984j8487l8711q8256q0398q9302m5872q2159o0761k1123k8346
18447E96355m5313o6794n9634J0051J0177J4100Q083n59r344J4830M0773M254
18435E16979j0828j1971j5057j0810j7733k8235O546J7452N393k0190r335K3975
18423D46186L8727O420l837k4541K188K4350m658l4740j2895J2635J0412K8340
18411D88587P044P283n941p869P764j2925R549J9670L4870O290J4454M686j6589
$$ y = [1701342, 1703591, 1612072, 1480688, 1326104, 1194718, 1110759, 1047034, 1014212, 976117, 948331, 921422, 883399, 875556, 893096, 873697, 857145, 878732, 942279, 1029211, 1097295, 1161448, 1196997, 1213949, 1253057, 1268994, 1283335, 1341635, 1403193, 1432645, 1402508, 1338710, 1253442, 1171930, 1151754, 1149770, 1131283, 1092572, 1004316, 923918, 834616, 788744, 706585, 645824, 624701, 596355, 551042, 484248, 424614, 434665, 444842, 458942, 467025, 466466, 457122, 471952, 512725, 516979, 506151, 494180, 479123, 468313, 450580, 422345, 428891, 446343, 451736, 431546, 422211, 446186, 484913, 491333, 487496, 462955, 465143, 489493, 484835, 450095, 437200, 449835, 460247, 488587, 495631, 502914, 496973, 489104, 496868, 483943, 493492, 513162, 548032, 554322, 568776, 573462, 556873]
18398E56873k6132q82K4304L7064J9942J8691j434O251L6202K6260l998l6256
18386F56885m5970k9158r630J3753N815j4745j337J5730K7751O927m8690o615
18374E70716K563J3093L771k5347k0356j430N792j1750k2017n623k59J2487K145
18361E23785l0616J2332O969L922N87l0928k1094n775p163L811K8679K7929L0768
18348E43206J3746L4609o126J0017K0156L160K8403L0489K3518J1094J3836L4014
18336G60122O217j3418N549m0026j6550k0632l1970P385k0932j4378L2613K0292
18324F74272k109o783p927J197J7779J781j1168m4329K408K4145J8700K52j6775
18311F51443o368R320j7338N428J0792k77k256M919J3153O244P569j8885m7637
$$ y = [556873, 530741, 529859, 554163, 591227, 611169, 629860, 628426, 634677, 670879, 697139, 693141, 656885, 610915, 581757, 572127, 585880, 591695, 576950, 575613, 591343, 619094, 626021, 577331, 570716, 573279, 586372, 590143, 564796, 544440, 543010, 548802, 537052, 515035, 509412, 509153, 521640, 523785, 493169, 505501, 512470, 516392, 516979, 486051, 464957, 459182, 452019, 455830, 484509, 512438, 543206, 556952, 591561, 585435, 595452, 615608, 618768, 647171, 677660, 701178, 712272, 726108, 760122, 766339, 752921, 758470, 718444, 701894, 681262, 649292, 656677, 635745, 621367, 653980, 674272, 672163, 665380, 657453, 658650, 676429, 678210, 667042, 622713, 625121, 649266, 667966, 668218, 651443, 645075, 654395, 637057, 642485, 653277, 653000, 650744, 655663, 668816, 675060, 682629, 663744, 616107]
18298F16107m4150j3069j7637k4884j5987q715K6824L9636j1365o602K2722L3072
18286E95952L8804M385J6391m627O473j1849k8553k1930k1853k9436k804J625
18274E42578R676L1079J4353j8966L101k819m080p304R91N57k2297J5898J1437
18261E74204J663m0309L627K9778j0191j5080j2132j7881m8409q227m519j0187
18249D42337M252K753L101L007l4631l7780P459J1788P724J5564L2239M1748k305
18236D97256j3115J8093N351J4838L151j3417p926O273j0855p341R377J4680r395
18223E06970K368L380R224l3985k8475J7002M7903O9627N632l4361p423l952k1951
18210E31959j8673L3373J4071k1705j8923k1107j9454j1670O817J3016J0791N447
$$ y = [616107, 571957, 558888, 541251, 516367, 500380, 491665, 518489, 558125, 546760, 540158, 562880, 595952, 634756, 639141, 655532, 650905, 657378, 645529, 616976, 595046, 573193, 543757, 540953, 542578, 552254, 583333, 597686, 578720, 581821, 579002, 574922, 567618, 568609, 569166, 546869, 562767, 574204, 575867, 535558, 539185, 568963, 558772, 543692, 531560, 513679, 465270, 457043, 452524, 442337, 446589, 449342, 452443, 455450, 420819, 383039, 390498, 402286, 410010, 425574, 457813, 499561, 497256, 484141, 502234, 507585, 522423, 525574, 512157, 504231, 510504, 499649, 492308, 501685, 516365, 506970, 509338, 512718, 521942, 487957, 459482, 476484, 524387, 594014, 599646, 565285, 557862, 553910, 531959, 513286, 546659, 560730, 539025, 520102, 498995, 479541, 467871, 474688, 487704, 498495, 503942]
18198E03942K208P477O400P854m741R813J880M2682K6738J5358L8096L517k720
18185F58504K8644M7076K8394N1234Q4894N8226M7335K3155N0166O4885O0464
18174A202977P6332R7921N8767O2513J15719J42628J29850J31485J80469J90648
18164B389309K18000K73367L52595L96377M00748M40714N02834O30755P79445
18155F384144J025885J379747J693841J934708K119835K350891K680836K861315
18147B2431202L057623L428125M328900O264072Q385034J0156257J1938440J3290612
18139H3280265J4759136J5286078J3420286J0624737O104619J891334k958676
18132A42407779p838650r613497j0035131j1203690j1832607j0394647p602753
$$ y = [503942, 506150, 513627, 520027, 527881, 523140, 532953, 534833, 577515, 604253, 619611, 657707, 661224, 658504, 687148, 734224, 762618, 813852, 898746, 956972, 1004307, 1027462, 1077628, 1142513, 1202977, 1279309, 1377230, 1435997, 1498510, 1614229, 1756857, 1886707, 2018192, 2198661, 2389309, 2607309, 2880676, 3233271, 3629648, 4030396, 4471110, 4973944, 5604699, 6384144, 7410029, 8789776, 10483617, 12418325, 14538160, 16889051, 19569887, 22431202, 25488825, 28916950, 33245850, 39509922, 47894956, 58051213, 69989653, 83280265, 98039401, 113325479, 126745765, 137370502, 143475121, 145366455, 142407779, 134569129, 124955632, 114920501, 103716811, 91884204, 81489557, 73886804]
18125G3886804n815518n164214m855484m806530m757987n126007n131379m698477
18117C3531208m205158l837318l427440k624378j696511q18199q6557O97354J824146
18108A9357147L964992Q232118J4009081J3707918O937626m013507j3503857j0073565
18100C8617953l503875K41344K080815L293248L803616L978592M034665M180293
18092E6726651M675769N322557O992114R278923J0646572J0275361R087033Q025556
18084A21030536O674817L417340j116343n975473q535130j1275908j3449814j2883238
18076G7886787j1345902r947695r043929p477930n357902l898739l194778k851435
18068B4768477k799133k609393k300457k072581j919839j752886j450774j120497
$$ y = [73886804, 68071286, 62907072, 58051588, 53245058, 48487071, 43361064, 38229685, 33531208, 29326050, 25488732, 22061292, 19436914, 17740403, 16922204, 16835647, 17533001, 19357147, 23322139, 31554257, 45563338, 59271256, 66208882, 62195375, 48691518, 38617953, 35114078, 35355422, 37436237, 40729485, 44533101, 48511693, 52546358, 56726651, 61402420, 66724977, 73717091, 82996014, 93642586, 103917947, 113004980, 121030536, 127705353, 131122693, 130006350, 124030877, 115495747, 104219839, 90770025, 77886787, 66540885, 56593190, 47549261, 40071331, 34713429, 30814690, 27619912, 24768477, 21969344, 19359951, 17059494, 14986913, 13067074, 11314188, 9863414, 8742917]
18060H742917q46781p10033o04666m88631m53496m36624l96504l31167k95139
18051D179876k79689k81619k48384k40424k31224j67190j50458j23477j16076
18042B341335j06362o7432o8919n8307n4203o9903k4123k7635n6393p0496n2788
18031A684774k4656l4166k1211k1606l1638j3780k8923l7058l3317o655j8433
18020A413331l4698l7802k1959j6367k1616p215J0744J0901j3873j0145k5254
18009A246047j0812j7371l5736k4857P86q922N196j3027K9590K5337J9675K957
17997A218863l2764j5415k5432m1888l3690k4998k788k078p51j3708k581K300
17985A025070k0307l8948n3570k9889j6548Q918K9945L5091k0702n1209j0541
$$ y = [8742917, 7896136, 7186103, 6581437, 6092806, 5639310, 5202686, 4806182, 4475015, 4179876, 3900187, 3618568, 3370184, 3129760, 2898536, 2731346, 2580888, 2457411, 2341335, 2234973, 2167541, 2098622, 2040315, 1986112, 1916209, 1892086, 1864451, 1808058, 1737562, 1684774, 1660118, 1625952, 1604741, 1583135, 1551497, 1537717, 1508794, 1471736, 1438419, 1431764, 1413331, 1378633, 1340831, 1318872, 1302505, 1280889, 1273674, 1284418, 1295319, 1281446, 1271301, 1246047, 1235235, 1217864, 1182128, 1157271, 1158057, 1149135, 1154331, 1141304, 1170894, 1196231, 1215906, 1218863, 1186099, 1170684, 1145252, 1103364, 1069674, 1044676, 1041888, 1039810, 1039059, 1025351, 1022770, 1025070, 1004763, 965815, 912245, 882356, 865808, 874726, 904671, 939762, 919060, 867851, 857310]
17974H57310M2330N0295K1823K5652K2061K7070K5269n93L5562J4527n767K2748
17962A138287k7819l6576n0529j4403J2546n9671o0490l1934l5032l3745k7874
17951G72760L1681J0024K2393K7378J1908j3601K1888K006J8830L020K8610L7888
17939I74785K4364O723J5857L7172N2814O3760P3226J05858R0956Q6457P8623
17928A610595J16190J31542J83820K05009J57238Q2592M2296N2803O9414J09930
17918B761429R0492L4396k2007q7587r5209q1484j8209J5596P4740O5606J5862
17907B753625j7992L5650M6318M8869O5298R3093J31511J51172R2191Q7004J15206
17896C601945J17307J64986K08009K03445K75560L44307L32896L12474L56439
$$ y = [857310, 899640, 949935, 971758, 997410, 1019471, 1046541, 1071810, 1071217, 1106779, 1121306, 1115539, 1138287, 1110468, 1073892, 1023363, 1008960, 1021506, 961835, 901345, 869411, 834379, 800634, 772760, 804441, 814465, 836858, 864236, 876144, 862543, 884431, 886437, 905267, 908287, 936897, 974785, 999149, 1005872, 1021729, 1058901, 1111715, 1175475, 1248701, 1354559, 1445515, 1531972, 1610595, 1726785, 1858327, 2042147, 2247156, 2404394, 2486986, 2529282, 2582085, 2651499, 2761429, 2851921, 2886317, 2864310, 2776723, 2681514, 2600030, 2581821, 2597417, 2672157, 2737763, 2753625, 2735633, 2771283, 2817601, 2866470, 2931768, 3024861, 3156372, 3307544, 3399735, 3486739, 3601945, 3719252, 3884238, 4092247, 4295692, 4571252, 4915559, 5248455, 5560929, 5917368]
17887E917368M89878O37155Q01989J030640J366214J834948K552451L580345N243154
17878B3454142P794041J1161546J4265922J4934863J1808556O234202J938275
17871I1591547K668521Q066019J3542883J4509232R346055n7010q994097j3405739
17863A17267411j1620233n916077j395493j875278o985238j2994727j5702785
17856F0777580j4144406j0661192p445249n192782l730480k763382k137858j681696
17848A3020535j380221j135396r25313p94788o12648m77607l21792k59372k76808
17839F836590k63353k73849k34178j54142o8457l3266o5774j43115j62152j35721
17829E302583r3514J8415P8078J04347J55627K32913L84768N37292O61015Q25106
$$ y = [5917368, 6407246, 7044401, 7846390, 8877030, 10243244, 12078192, 14630643, 18210988, 23454142, 31248183, 42409729, 56675651, 71610514, 83419070, 89653272, 91591547, 94260068, 102326087, 115868970, 130378202, 139724257, 139667247, 130673150, 117267411, 105647178, 99731101, 98335608, 96460330, 89475092, 76480365, 60777580, 46633174, 35971982, 28526733, 23333951, 19603471, 16840089, 14702231, 13020535, 11640314, 10504918, 9579605, 8784817, 8172169, 7694562, 7372770, 7113398, 6836590, 6573237, 6299388, 6065210, 5911068, 5842611, 5809345, 5743571, 5600456, 5438304, 5302583, 5209069, 5227484, 5305562, 5409909, 5565536, 5798449, 6183217, 6720509, 7381524, 8206630]
17819H206630R36164J070819J173956J197623J076540P98747M69186J27939q0469
17810A4977135k24030m11834o32714q77788j075176j183947j183078j141010r99475
17801G248083q54380p31486n89531m40290l88872l62821k83156k40637k12490
17792C144420j50230j31100j24995r0296o5248m4779o2394p0240p5865l9244r831
17781B280198n3736r3989o5324p4307m8813l4480o0524o9205q333j1431R016K2846
17769A791918N7021N8036N7256L1808n8729j01940q8829j13862j12470q2267m1489
17758A396453k0044K920N673J848J0884L8502m107j8109r594k3354J3025J8446
17746A412543L1310M2046K4415k2037l3751q8666j02396n0127l7045J52j1960
$$ y = [8206630, 9142794, 10213613, 11387569, 12585192, 13661732, 14460479, 14929665, 15057604, 14977135, 14753105, 14341271, 13708557, 12830769, 11755593, 10571646, 9388568, 8247558, 7248083, 6393703, 5662217, 5072686, 4632396, 4243524, 3880703, 3597547, 3356910, 3144420, 2994190, 2863090, 2738095, 2647799, 2582551, 2537772, 2475378, 2405138, 2329273, 2290029, 2280198, 2226462, 2132473, 2067149, 1992842, 1944029, 1909549, 1849025, 1779820, 1771487, 1760056, 1769072, 1791918, 1848939, 1906975, 1964231, 1996039, 1937310, 1835370, 1746541, 1632679, 1520209, 1437942, 1396453, 1376409, 1379329, 1385002, 1386850, 1397734, 1436236, 1432129, 1414020, 1404426, 1381072, 1394097, 1412543, 1443853, 1485899, 1510314, 1488277, 1454526, 1365860, 1263464, 1213337, 1176292, 1176444, 1164484]
17735A164484q062l1021o4370n0748j7359j5834n4022o4599l7606J1849j8819
17724H13893l1575j0980J1338P132j2299j2313n987Q397K2924J0372P246J428
17712H09576J6609j8669k9575J7240R626J7312Q982J4276q783J727K948J3427
17700H54696L5517k659k3413n0681n3220l0349k9457L405O5107J3872J9379j7992
17688G84205m430j0441R181L7727j1583J2690P777k8700P329m716j4411l243J680
17675G83065N423j2245j5751Q733J3451L6728J3082l7913m7849k6523k7368j1346
17663F81487j5539l5063k7235j095j232l2853j8529Q945M316r130j7044J6433
17651E53461N823L5173M344j8970O667L6420K159r643L022j0542M4272N9702P2674
$$ y = [1164484, 1156422, 1125401, 1061031, 1010283, 992924, 977090, 923068, 858469, 820863, 832712, 813893, 782318, 771338, 782676, 789808, 777509, 765196, 759209, 767606, 790530, 800902, 808148, 809576, 826185, 807516, 777941, 795181, 804807, 822119, 831101, 845377, 836594, 838321, 841269, 854696, 890213, 887554, 864141, 813460, 760240, 729891, 700434, 703839, 768946, 782818, 802197, 784205, 779775, 769334, 778515, 816242, 804659, 817349, 825126, 796426, 803755, 799039, 784628, 781385, 783065, 788488, 776243, 760492, 769225, 782676, 819404, 832486, 794573, 746724, 720201, 692833, 681487, 665948, 630885, 603650, 602555, 601323, 568470, 549941, 558886, 563202, 554072, 537028, 553461, 559284, 594457, 598801, 579831, 586498, 622918, 625077, 615434, 618456, 607914, 652186, 711888, 784562]
17638G84562L5687N834L2081M2797J9491L7710O0045O1284L3931J6539K9603k331
17626A157233L2727N6804K0575J6077J1251k5019j1332l3931o4068m5319n1482
17615A063516m5214l3963m0693m9576m6350k3766l1184k1151j1791r989K3506
17604G73345K5258L0968O998r736j4960J03L9089L5538J9537K1159J1301J2720
17592I51320k0735J2495N7189P9539N3449Q2569Q2203Q1558Q1935J13619R6828
17581A671969P9425J09043J37520J48823J24775Q0298J9349L1219R2866J54816
17571B650103K25826L00148L35415K65158J35436J14268J32458J91825L22131
17562D672768M78301N42950N73344N58583N95951P76911J200345J788289K622349
$$ y = [784562, 820249, 826083, 858164, 900961, 920452, 958162, 1018207, 1079491, 1113422, 1129961, 1159564, 1157233, 1189960, 1246764, 1267339, 1283416, 1294667, 1269648, 1258316, 1224385, 1160317, 1114998, 1063516, 1018302, 984339, 943646, 894070, 847720, 823954, 792770, 771619, 759828, 749839, 773345, 798603, 829571, 836569, 826833, 811873, 811976, 851065, 886603, 906140, 927299, 938600, 951320, 930585, 943080, 1000269, 1079808, 1133257, 1215826, 1298029, 1379587, 1461522, 1575141, 1671969, 1751394, 1860437, 1997957, 2146780, 2271555, 2351853, 2371202, 2402421, 2495287, 2650103, 2875929, 3176077, 3511492, 3776650, 3912086, 4026354, 4158812, 4350637, 4672768, 5151069, 5694019, 6267363, 6825946, 7421897, 8198808, 9399153, 11187442, 13809791]
17553A3809791L961310O091499R338465J3233294J5899152J4493488Q270669n1498
17545H5046170n545816m172220L463551J3910331K2201413K2882274J3088098
17538A50873801l405791j8576184k3843092j8556969q482190O14951N114838L330717
17530H7070081l328616j1086944j5260683j4312511j0702364p234508m868116
17523B0276339l383242k476810j845168j405187j073663q52580p12808o45023
17515G881858o33364o09511n39609m54699l14038k44973j79158j51161j61767
17506D593578k25328l05715l50900l00683k45394j79049p0642o9399j02059j81172
17496B563237k19588k12318j80715j11447p3308o4701o1366q0650p3017n1571
$$ y = [13809791, 17771101, 23862600, 33201065, 46434359, 62333511, 76826999, 85097668, 85046170, 79500354, 75328134, 78791685, 92702016, 114903429, 137785703, 150873801, 147468010, 128891826, 105048734, 86491765, 78009575, 78624526, 83739364, 87070081, 83741465, 72654521, 57393838, 43081327, 32378963, 25144455, 20276339, 16893097, 14416287, 12571119, 11165932, 10092269, 9239689, 8526881, 7881858, 7248494, 6638983, 6099374, 5644675, 5330637, 5085664, 4906506, 4755345, 4593578, 4368250, 4062535, 3711635, 3410952, 3165558, 2986509, 2915867, 2846468, 2744409, 2563237, 2343649, 2131331, 1950616, 1839169, 1765861, 1701160, 1639794, 1559144, 1486127, 1434556]
17486A434556m7923n0492p9562n1555p2499k319j4990k1075r743k2269m8559l8660
17474I74910j9089q920m5354l9213o513J5121j9822R51l9506k5328l345m299o699
17461G72894J2246o463L5463J2258l0321k6636m9442k1712m31q894Q275R324r894
17448F96667l2754j6767j477q023K4267M7233J30k1731K4605J06036Q4750J698
17436I04634o2294q3382l9565o156L319k4216k6242m920M999k604K3635k2684
17424F64524J3726M2685J8093N001j8756k4429k5311j6646j9030K4377K0715J6245
17412G01194m3413n9059m1382m4920j2504J6275M8685K3929j4110k5035J5660
17401E65320J0587m62n4615l4283K627K0243K2068N35K3745j7628l7286l1852
$$ y = [1434556, 1386633, 1336141, 1256579, 1205024, 1132525, 1130206, 1115216, 1094141, 1084398, 1062129, 1013570, 974910, 955821, 946901, 901547, 862334, 855821, 870942, 851120, 852071, 812565, 787237, 783892, 779593, 772894, 785140, 778677, 814140, 826398, 796077, 769441, 719999, 698287, 697856, 688962, 697237, 706561, 696667, 663913, 647146, 645669, 637646, 661913, 709146, 709276, 687545, 712150, 818186, 902936, 904634, 842340, 758958, 719393, 713237, 716556, 692340, 666098, 661178, 666177, 663573, 687208, 664524, 678250, 720935, 739028, 744029, 725273, 700844, 675533, 658887, 639857, 664234, 684949, 701194, 657781, 598722, 557340, 512420, 499916, 516191, 564876, 588805, 574695, 549660, 565320, 575907, 575445, 520830, 486547, 489174, 509417, 531485, 532020, 555765, 538137, 500851, 468999]
17389D68999m0237P923K3473J3494P04k1883o199l6957n903K4065n66j1671J562
17376D16804k0074n912M118m933l84o37j7952k9702k0216K5397M558j1616q633
17363C30818o473J0338L4771j1389j8857k2129k6801K0869L4856m880L896J0035
17351C55054J1476m7816l7514J6149j0860P507n820j075o080J9335m48k5621k3335
17338B50952j7450Q967N862j5084J2946J3503R261n005l7274k6932j4314l12J1778
17325A96898j95k4604J197K2963J8269k4301l5900l054J8607L2476K2830L2660
17313B57846j5185K8679O412j662j7067k1377j4479o944L81M2476O737P35L166
17300B69718j5454m130k9516J2064J5713j7674m180J0293K4556K0765k000k7131
$$ y = [468999, 428762, 436685, 460158, 473652, 474356, 452473, 446274, 409317, 403414, 427479, 426913, 415242, 416804, 396730, 390818, 394936, 390003, 389619, 388982, 371030, 341328, 321112, 346509, 351067, 339451, 330818, 324345, 334683, 369454, 358065, 339208, 317079, 290278, 311147, 346003, 341123, 345019, 355054, 366530, 318714, 281200, 297349, 286489, 293996, 288176, 287101, 281021, 300356, 299908, 274287, 250952, 233502, 242469, 248331, 233247, 246193, 259696, 268957, 263952, 226678, 199746, 185432, 185120, 196898, 196703, 172099, 173296, 196259, 214528, 190227, 154327, 151273, 169880, 202356, 225186, 257846, 242661, 271340, 277752, 276090, 259023, 237646, 223167, 216223, 216604, 259080, 265817, 266552, 269718, 254264, 250134, 220618, 232682, 248395, 230721, 226541, 236834, 261390, 282155, 280155, 253024]
17288B53024r871J716q222p686J3482J9999J1070N645k2561p380J373K4722J792
17275B77103R102J2015L2175O8290P3138O2524N1695M3305j2482L1933O7169O8538
17263G84505O8833L9528O146l7552o3776p1342l2555m840l0986m3150o1777p8731
17251D74303p5699m3018m7315k6307n103o910J6479Q950j8624l340j133n420j6087
17238B50776l9187j0581o92L5245J2220l4411j0094m437j7753l5397r495J5133
17226A51327L522J9738j0476l5556O473l933k3855k1067K2653M1555K0467n702
17214A65146m896k4073k3686J7876O564k0192q175L4681K2817J4349n866k4216
17202A50329k2699k670K038l969J3650k5361j5292j803K709J9757m580J4740m397
$$ y = [253024, 243153, 244869, 236647, 228961, 242443, 262442, 273512, 279157, 256596, 249216, 250589, 275311, 277103, 286205, 298220, 330395, 398685, 471823, 534347, 586042, 629347, 616865, 648798, 715967, 784505, 853338, 892866, 899012, 861460, 797684, 726342, 693787, 688947, 657961, 614811, 553034, 474303, 398604, 355586, 308271, 281964, 276861, 269951, 286430, 295380, 276756, 273416, 272283, 266863, 250776, 211589, 201008, 200316, 235561, 247781, 213370, 203276, 198839, 181086, 145689, 136194, 151327, 154849, 174587, 164111, 128555, 135028, 131095, 107240, 86173, 108826, 150381, 170848, 165146, 160250, 136177, 112491, 130367, 136931, 116739, 108564, 143245, 166062, 180411, 174545, 150329, 127630, 124960, 126998, 123029, 136679, 111318, 96026, 94223, 96932, 116689, 112109, 126849, 122452]
17189A22452n668l742J0392k4677J9250K139J7675K1014K962j8177k2482k1277
17177I9861j7030K8939L7017K0546j6160j4627l1695k8610r203K3971P80K5328
17165A19117K2115p420k1524K463J5352r499l0470m2540p06J0914J233k743J4061
17152G0353P069j4991p711k0500j4156L0024J2622q926j832J5747M839p334J5438
17139H0642j0101j6371J0387k873J678N005j1072M37J2536J7770m056M278n06
17126H7754O20M778L471j279Q545k857k1772P061J468j7792k3398J0094Q641J2946
17112G8280J0664Q735j5828K6123J9367O163Q819J1936K4673k1459n747K6849
17100A78575j1965m741j5930J3051R469j5146k2557R825J7827k029n965k6855
$$ y = [122452, 116784, 113042, 123434, 98757, 118007, 120146, 137821, 158835, 161797, 143620, 121138, 99861, 82831, 111770, 148787, 169333, 153173, 138546, 106851, 78241, 69038, 93009, 93789, 119117, 141232, 133812, 112288, 114751, 130103, 120604, 90134, 47594, 46888, 57802, 59035, 56292, 70353, 77422, 62431, 54720, 34220, 20064, 50088, 62710, 53784, 51952, 67699, 72538, 65204, 80642, 70541, 54170, 64557, 61684, 63362, 68367, 57295, 57732, 70268, 88038, 83982, 88260, 87754, 88374, 93152, 96623, 95344, 103889, 101032, 79260, 86321, 87789, 69997, 46599, 56693, 65334, 78280, 88944, 97679, 81851, 107974, 127341, 133504, 142323, 154259, 178932, 157473, 151726, 178575, 166610, 161869, 145939, 158990, 168459, 153313, 130756, 140581, 158408, 156379, 150414, 123559]
17088A23559r928k5567K700K2751J338j5251l0672J2334K0970j844n368K7570
17076A22592K2383M12k2128K1536K9374P697r100k0016n235J9973M647p911l1390
17063A32834Q451j0273l0212k445J5782L0945L4010J1932P49l597L93J5041m278
17050A99332k4665j475k783k6740Q362Q151J295P814j8246k5075j0125k2821j6879
17037G6145k6666n25J3254p986P631L0244J0435K2944J8542J8192Q927j8928n2363
17024I9846j7189R321J2448n697K7l384q199J6771O976J7408J0270P832m30l0926
17010A15074k0877m4728j9998J0663r432j2723J0744K8451k8235l5991K2116J8953
16998C4017J8471O116j9521J155J3038l2719J8989J1195j050k768O450Q322k390
$$ y = [123559, 113631, 88064, 90764, 113515, 114853, 99602, 68930, 81264, 102234, 100390, 95022, 122592, 144975, 145387, 123259, 144795, 174169, 181866, 172766, 152750, 147515, 167488, 172135, 164224, 132834, 141285, 131012, 100800, 98355, 114137, 145082, 179092, 191024, 191773, 188176, 188569, 203610, 199332, 174667, 173192, 170409, 143669, 152031, 160182, 161477, 169291, 151045, 125970, 115845, 93024, 76145, 49479, 48954, 62208, 54222, 61853, 92097, 102532, 125476, 144018, 162210, 171137, 152209, 99846, 82657, 91978, 104426, 98729, 98756, 95372, 87173, 103944, 110920, 128328, 138598, 146430, 146000, 115074, 94197, 49469, 29471, 40134, 30702, 17979, 28723, 57174, 28939, -7052, 15064, 34017, 52488, 58604, 39083, 40238, 53276, 20557, 39546, 50741, 49691, 46923, 53373, 61695, 59305]
16985E9305K218K180k1527j615J4966O694R182m739l3257r345K7414O591J1649
16972F9716l1117j8559J0000n21j7923R4K473J6913J0034j7428J0984L8841M1008
16959A14515P747k7735j8693j0164J6058r881l1519K3036N7276O3146P2219P2663
16947C28668P7192O6991J5153k449n107M997K8864R3902Q3141O9459M9142m9299
16935G60654j17279q7338p0828q558o359J0783L93j3354m7346o7952p7951l7882
16923B36983k3147l8077k3711N718m438l4117L304l114j6663l806n189j3084K4509
16910A05168j1502N347j5954o275j2755j0107q589L4776j2096l264n913l4818
16898B4018P052k337R396K3574J2398J1296K553m3621k6531J3772r506q776P380
$$ y = [59305, 61523, 63703, 42176, 40561, 55527, 62221, 71403, 66664, 33407, 24062, 51476, 58067, 69716, 38599, 20040, 30040, 29519, 11596, 11690, 14163, 31076, 41110, 23682, 34666, 73507, 114515, 122262, 94527, 75834, 65670, 81728, 71847, 40328, 63364, 120640, 183786, 256005, 328668, 405860, 472851, 488004, 485555, 480448, 485445, 514309, 608211, 691352, 760811, 809953, 760654, 643375, 556037, 485209, 476651, 470292, 481075, 481468, 468114, 420768, 352816, 274865, 236983, 213836, 175759, 152048, 157766, 153328, 119211, 122515, 119401, 102738, 98932, 93743, 80659, 105168, 93666, 99013, 83059, 76784, 64029, 53922, 45333, 80109, 68013, 64749, 58836, 24018, 31070, 28733, 38129, 61703, 74101, 85397, 87950, 44329, 17798, 31570, 22064, 13288, 20668]
16885B0668L2290K2654k073l0109j511J0729r600J4283J9612Q348l2006j8300
16873C4985N86j7609M0510Q953j8198j707M115J537M805k2469N552K1105j603
16860F0562P164j8023R306R452j5739J06k456j1198K0082L476j7929j3155j689
16847B9959j0385j928L5003J860J7100L077k3774o686M936j2187l3491R921J8828
16834C2233j1849k8513M163P789L3271K1692P228l0774l5906J2962j2345l9328
16822c9377l158J076K7046J7785r357r163P194Q622N778K202K779N912l1062l3834
16808d7557L545L2086O821P10k388j1753J2172M0956J5699l5471j6276P658L0385
16795C6587J8493K1239j4011j6593q535j0595j8208L613R058R6K0922K167p440
$$ y = [20668, 52958, 75612, 73539, 43430, 41919, 52648, 43048, 57331, 76943, 85291, 53285, 34985, 35571, 17962, 58472, 67425, 49227, 47520, 51635, 53172, 57977, 35508, 41060, 62165, 60562, 67726, 49703, 59009, 68461, 52722, 52828, 50372, 39174, 59256, 62732, 44803, 31648, 29959, 19574, 17646, 52649, 54509, 71609, 74686, 50912, 44226, 49162, 36975, 3484, 13405, 32233, 20384, -8129, -3966, 3823, 37094, 58786, 66014, 35240, -666, 12296, -49, -39377, -42535, -41459, -14413, 3372, -5985, -15148, -7954, 668, 6446, 8648, 11427, 17339, -13723, -47557, -44012, -11926, -5105, -4395, -6783, -18536, -6364, 34592, 50291, 14820, -1456, 6202, 36587, 55080, 76319, 62308, 45715, 37180, 26585, 8377, 11990, 21048, 21144, 42066, 44233, 36793]
16782C6793j907p278k0297j7002l594M254p17J1912r846J4498n749J7937R118
16769B8122j4668L903k0956k469l911J526j4272N272J8345J9641j4483j9512J5967
16756B505M477L6638J6419j1783q802K6671j4677j7861M338N200n5379m4277p048
16743f3579q158J9590J6371J8162j3898J8099J2656P276J0804P338k4957l810
16731d106k0683j3950K1203L682J4617J4051o156O883q596j4419K257K1352O67
16718A6802l3960r301k4294q68K3978P759L952J6421o62l2479k793L18K584O257
16704b6286L0058J8129j487k69K0619J891l3340r33l909l840O956l6R273J3013
16690B9839m567j7222K851N559m7968p256J1756L757r243q738J9987J4134J0010
$$ y = [36793, 34886, 27608, 7311, -9691, -13285, -9031, -9748, 2164, -7682, 6816, 1067, 19004, 28122, 13454, 17357, -3599, -6068, -9979, -8453, -22725, -17453, 892, 20533, 6050, -13462, 2505, 6982, 43620, 60039, 48256, 39454, 66125, 51448, 33587, 37925, 43125, -12254, -56531, -63579, -71737, -52147, -35776, -17614, -31512, -13413, -757, 6519, 17323, 24661, -296, -4106, -24789, -38739, -17536, -13854, 763, 14814, 8658, 15541, 6945, -7474, -5217, 16135, 16802, -17158, -26459, -50753, -51621, -27643, -19884, -15932, 489, -173, -32652, -35445, -35127, -32543, -26286, 3772, 21901, 20414, 20145, 40764, 42655, 9315, 8382, 4473, 633, 7589, 7553, 16826, 29839, 25272, 8050, 10901, 16460, -31508, -38764, -27008, -23251, -32494, -41232, -21245, -7111, 2899]
16677B899J7413R299O844k2092m4826l6529L9937N9413q472j6680R833p454l001
16664F584P945J8911j5247j1459J5283J1671J5188m813P920J8558r890j9715J2333
16651E3269p199R138o585l8004r198m130K9905Q52P915k983j0686k0108j6o912
16637d742Q927m154J0718Q818N693n729k9742o318M9776k8667m6781r85N628n851
16623d3409J4199J9961K1256J8217j7368j9933j412K1927n469l3745k2473J113
16611d7136j1964o409J9083L7546J6570k818k6135j5190Q033K2638n898j3905
16599b5585r368k9539P735K9574J4962N864J0958L772p339j2475o720L1391J1775
16586B5005j6597k6440l0714k4774K6486L1797j0082P223J9443J7312l3833m5968
$$ y = [2899, 20312, 29611, 36455, 14363, -30463, -66992, -27055, 32358, 23886, 7206, 17039, 9585, 6584, 14529, 33440, 18193, 6734, 22017, 33688, 48876, 44063, 51983, 70541, 60651, 40936, 53269, 46070, 55208, 48623, 10619, 1421, -2709, 27196, 28048, 35963, 32980, 22294, 2186, 2170, -4742, 4185, 31, 10749, 19567, 25260, 19531, -10211, -16529, 33247, 4580, -42201, -43186, -37558, -43409, -29210, -9249, 12007, 30224, 12856, -7077, -8489, 13438, 7969, -25776, -48249, -47136, -59100, -65509, -46426, -8880, 7690, 4872, -21263, -36453, -28420, -5782, -11680, -25585, -34953, -64492, -56757, -27183, -12221, -6357, 4601, 8373, 1034, -11441, -18161, 13230, 25005, 8408, -18032, -48746, -73520, -47034, -15237, -25319, -18096, 1347, 18659, -15174, -61142]
16574f1142J5402K8937N573M346L2495Q516m1083m5247J4671K907j4762J5960
16562c3427K2384j3617l46q868k1928r65L0928J2810J8588J6732J9934l1759p584
16549B882K2455J2166R361K573j7309k122j9522j0069N006m653l413p731k3199
16536c3575K330L042J439O424J0925J5904j9675q104L3038K1181o619k8340j2673
16523a4703k2599J5147K9051N627j2455K044J0589J797j1845j9158J9166J94j5487
16510a2632j4181K452n074k4459M778M8350Q952n79r156k5198n752K3206K5325
16497A6032O325K631k1155j4601j2977q34L7797J496Q832j9836J8030J0632J2767
16484D5139m2416m1054r241P096L6193P561j6200p486J4187J6124N253k8606k2647
$$ y = [-61142, -45740, -16803, -11230, -6884, 25611, 34127, -6956, -52203, -37532, -34625, -49387, -33427, -11043, -24660, -25006, -33874, -55802, -56767, -25839, -13029, 5559, 22291, 42225, 10466, 2882, 25337, 37503, 46864, 49437, 32128, 30006, 10484, 415, 5421, 768, -2645, -10376, -33575, -31245, -28203, -26764, -20340, -9415, 6489, -13186, -21290, 11748, 32929, 26310, -2030, -14703, -37302, -22155, 6896, 12523, 68, 2112, 12701, 14498, 2653, -16505, 2661, 2855, -12632, -26813, -24361, -29435, -53894, -49116, -766, 8186, 7607, -1549, -26747, -32499, -9293, 16032, 22357, 24988, 3833, -10768, -23745, -24579, 13218, 14714, 23546, 3710, 21740, 32372, 45139, 2723, -38331, -47572, -40476, -4283, 3278, -12922, -20408, -6221, 9903, 15156, -13450, -36097]
16471c6097P058K8159j848j8712j795Q647L647J2685j0845R911j714k2327r262
16458c2493J2021o559j7370O825J4639l969l215J1444L763l979J0019k0220J7580
16445a1514N621o627K3563K3974l2994l3846K805J3337L3822P414l3481j5102
16433b3028k1225k13J9215q454J140J2099P737j4781j5567o635J598J8969j586
16420c0731o044J2422O102p47Q152K922Q465j2734j0116J7602j1606k2558Q483
16407c0388l640O884N619P933P747Q010L195k2266j968K0023j186K2645J496k6999
16393b895j712K5947P576M55m0657k1978L892R756o715m113L1099K0389o466l364
16379A1214K8924K7389j9831k2328j2541J1134L361K188j882J1062k6225j8750
$$ y = [-36097, -29039, -880, -2728, -21440, -23235, -14588, -10941, 1744, -9101, 810, -904, -23231, -32493, -20472, -27031, -44401, -37576, -22937, -26906, -30121, -18677, -14914, -18893, -8874, -29094, -11514, -5893, -12520, 11043, 35017, 2023, -31823, -29018, -15681, 18141, 25555, -7926, -23028, -44253, -44466, -25251, -33705, -32565, -20466, -12729, -27510, -43077, -49712, -48114, -29145, -30731, -36775, -24353, -18251, -18998, -10846, -7924, 541, -12193, -22309, -4707, -16313, -38871, -30388, -34028, -27144, -21525, -13592, -5845, 2165, 5360, -16906, -18874, 1149, -37, 22608, 24104, -2895, -4607, 21340, 28916, 29371, -11286, -33264, -29372, -19616, -26331, -30444, 655, 21044, 14578, 11214, 40138, 67527, 47696, 25368, 12827, 23961, 27322, 29510, 27628, 38690, 12465, -6285]
16367f285q327Q146r393Q898O056R027K6536q950n690R735m094q163K494J3600
16353C3590j6928k3652K568Q721J5234J3020j562l1590K525J7643L323p574m830
16340A0488l135L4364K6584k284j6946j6571M562k3256j9721J5666K1592j0745
16328B0598l0851p195N010K6469K4559p284k232j1141j0286L4274P58j0658k9136
16315B885l0372N578J5772K2259n344L504K2185J8403jk7207l3042J778K0648
16302A7046L0927q009l5425n437K2816K7669L0516j9434k2299O346j9427k0866
16290D423K0514K4023q252K519l5552k1338k2836J7411J2726K057n637j738R826
16277a854k8143j5654j1842P46K0014Q987J4240O433n644m989r532J896K3158
$$ y = [-6285, -14612, -6466, -15859, -6961, -905, 8122, 34658, 25708, 20018, 29753, 25659, 17496, 19990, 33590, 16662, -6990, -4422, 4299, 19533, 32553, 30991, -599, 1926, 19569, 22892, 15318, 10488, 7353, 41717, 68301, 66017, 49071, 32500, 37062, 13806, -5915, 9751, 31343, 20598, -10253, -17448, -12438, 14031, 38590, 31306, 29074, 17933, 7647, 41921, 42679, 32021, 2885, -27487, -21909, -6137, 16122, 10778, 14282, 36467, 54870, 54869, 27662, -5380, -3602, 17046, 47973, 39964, 4539, -898, 21918, 49587, 80103, 60669, 38370, 44716, 25289, 4423, 24937, 48960, 40708, 43227, 7675, -13663, -36499, -19088, -6362, -4305, -9942, -11680, -1854, -29997, -45651, -57493, -56747, -36733, -27746, -13506, -7073, -12717, -17706, -27238, -25342, -2184]
16264b184k44J4509R416m703j4830j3358k0272j8226l811K3064K1386j1681j8760
16251c9694m1549q329L2049K8734k979M218J8636J5015K2634L42k1766q318L9503
16238C8496J877l4176j5007M142k53j0890P8k3635M27n878L3550K6884J055m773
16224A1897l234J1210j4277r722j5059l47O646K5771o279j0107q825j3927p242
16211c3495p886K5447J5297p110m859L113J2421k1544o067J9837L1243m889q451
16198A3057J7214M206o291R308J3487r659o445j5441j104k2813k1527p221j497
16185c4726J5232O145j7780Q264M0308K7132k6480k0589n075j7317J2928K3056
16173A1098J1828P313k152j5731J0427j5028j076J6709J1673j0362m337Q345j913
$$ y = [-2184, -2428, 12081, 21497, 16794, 1964, -11394, -31666, -49892, -53703, -30639, -9253, -20934, -39694, -81243, -89572, -57523, -28789, -31768, -27550, -8914, 6101, 28735, 29077, 7311, -1007, 38496, 40373, 6197, -8810, -4668, -4921, -15811, -15733, -39368, -38941, -44819, -11269, 15615, 16670, 11897, 8663, 19873, 5596, -4126, -19185, -19532, -12886, 12885, 6606, -3501, -12326, -26253, -33495, -41381, -15934, -637, -7747, -12606, -9493, 2928, -18616, -24683, -4846, 26397, 21508, 13057, 30271, 34477, 28186, 37494, 50981, 41322, 34877, 19436, 18332, -4481, -26008, -33229, -34726, -19494, -13349, -31129, -22865, 17443, 44575, 18095, -2494, -7569, -24886, -11958, 11098, 22926, 30239, 28087, 12356, 22783, 7755, 6679, 23388, 35061, 24699, 20362, 28707, 26794]
16160B6794r722J2691j9556j6515q725m432R18R633N363L6156J9376J6233k34
16147F7980o596J8489p523k0936j8549j1839l135r296J9007J5782j0596K715J602
16134C7105K869K427j1627O217j9057N010J4957k608n286k6165l2614k0839L7445
16121a2166L2834J4481j3369K2362l297j4248k2360p890K959k974N404n04j6771
16108a5539j3882Q470p791n547J3037k137P772K5549Q5J147N848j0446j5075J4699
16094F190J746j0273P170K7502j7608j7011n063j2337K127k459q768J3678j0945
16081b6051j0072k089O742J0524Q601q161k2799n184J3789J7713J7248R501j0283
16068e21J9965m874l0679J1696J3560l651k5237l324K662K0343K4950l984K8490
$$ y = [26794, 17072, 29763, 10207, -6308, -15033, -19465, -18547, -8914, -3551, 32605, 51981, 68214, 67980, 61384, 79873, 72350, 51414, 32865, 21026, 17891, 8595, 27602, 43384, 32788, 35503, 37105, 39974, 42401, 30774, 36991, 17934, 22944, 37901, 35293, 30007, 3842, -28772, -49611, -12166, 20668, 35149, 21780, 44142, 40845, 26597, 4237, -3653, -694, -3668, 1736, 1232, -15539, -29421, -20951, -28742, -34289, -21252, -23389, -15617, 9932, 10017, 11164, 17012, 6566, -8509, 6190, 7936, -2337, 4833, 32335, 14727, -2284, -7347, -19684, -17557, -20016, -28784, -15106, -26051, -36123, -38212, -31470, -20946, -12345, -20506, -43305, -48489, -34700, -16987, 261, 9762, -521, 19444, 14570, -16109, -4413, 9147, 5496, -19741, -23065, -20403, -60, 24890, 20906, 49396]
16055D9396k220p152p515L886r792j3311J7840N117k3450p299m866J1130P761
16042A9525j4229j0679K0689q622j5366L7215L0727N29k6141K4818p529q175N49
16029D3311L621j0316R95j0823j2317J7857j1030P043R186M0164j1007j3808r510
16016D3366k5611j6375J4255k4408j6316j2345j2630K2189L9953J0912p347j9419
16004c776k9289L302Q783J3367N590K3339J3848j8478k1225J676J2140k777l1535
15991b5035k4063J5887j731k180K9402n136l293L284N582R721J2982o247K263
15978A1436O471K9199O466m6157k7413K9178L6269j5695p089J1895l242l503j0735
15965A7080n098J213M04p231k75J0262j0696m964K663J6299Q072J17j7436k3285
$$ y = [49396, 47176, 40024, 32509, 36395, 26603, 13292, 31132, 36249, 12799, 5500, 634, 11764, 19525, 5296, -5383, 15306, 6684, -8682, 28533, 59260, 59789, 33648, 58466, 50937, 42762, 43311, 46932, 36616, 37611, 26788, 14471, 32328, 21298, 28341, 37527, 77691, 66684, 52876, 43366, 17755, 1380, 15635, -8773, -25089, -37434, -50064, -27875, 12078, 22990, 15643, -3776, -33065, -29763, -20980, -7613, -2023, 21316, 35164, 16686, -4539, -2863, 9277, 6500, -25035, -49098, -33211, -34942, -37122, -7720, -12856, -16149, -12865, -7283, 2438, 15420, 9173, 11436, 17907, 47106, 53572, 7415, -19998, 9180, 45449, 29754, 22665, 34560, 31318, 27815, 17080, 11982, 13195, 13599, 6368, 6093, 16355, 5659, 695, 3358, 19657, 27729, 27846, 10410, -12875]
15951a2875l6862K3892K1845j0750j0458j6191j4833J0073R154j1061j7422L9123
15939b6365N9120p007m4621q027M0714L3229P750k7572j163l1223n451q4j8465
15926b9165p831Q702K2118M24k4903N154J6172K9768j3714k3637O760J2176J2259
15913A4283J7142M29K5585P064k4208p638Q500m072J493j0809k7187l3390K887
15900b9921J978J1942L8650Q412k5496k0359P769R894r860k0244J4598K4002J0408
15887B1773L2941j652k6519j6186k1186k665p586J8868J5641R741j6574P237K4153
15874C7986r086J5268J5590k6212j8997j1124K1400J9912L768o482n996l1146
15862D881k2612K5665r637j4156L259J6652n309p098j3401j7549K061K7461j1926
$$ y = [-12875, -49737, -25845, -4000, -14750, -25208, -41399, -56232, -46159, -37005, -48066, -65488, -26365, 32755, 25748, -18873, -26900, 13814, 47043, 54793, 27221, 26058, -5165, -10616, -10700, -29165, -36996, -28294, -6176, -5752, -30655, -25501, -9329, 20439, 6725, -16912, -10152, 2024, 14283, 31425, 31854, 57439, 64503, 40295, 32657, 41157, 37085, 38578, 27769, 582, -32808, -29921, -27943, -16001, 22649, 31061, 5565, -14794, -7025, 2869, -6991, -27235, -12637, 11365, 21773, 54714, 53062, 26543, 10357, -10829, -13494, -21080, -2212, 13429, 23170, 6596, 13833, 37986, 28900, 44168, 59758, 33546, 14549, 3425, 24825, 44737, 48505, 42023, 36027, 4881, -17731, 7934, -1703, -15859, -12600, 4052, -1257, -8355, -21756, -39305, -37244, -9783, -21709]
15849b1709p553j5458P526L7792J2700j0457N482O704j2907j0547J1941K0103
15837B3617j3655R317J5395J2325k9297j7467R600m175J0938l0193o921M2456
15825B1940J7273j7889j532K4355J3906l165k1141L706k1550k6137r171P672L8934
15812B7201j1194l459M095M498J5750m1291k9740n124n35J7978J4058J8727j3098
15799b134m700J4585M3053J9703l327j2464Q417r517j6167j6662J8748j275k157
15786C6103R391J5718k468j2798L169N87R391K403j9603K121j8410k6547K0494
15773A9551N524j0700q263O287O624J3430Q74J709J813j9276k9830j5062K2203
15760e116J2394J0158J8678O604J647K4861q892k3567j7043q774K4042k0068k3274
$$ y = [-21709, -29262, -44720, -37194, 598, 13298, 2841, 8323, 15027, 2120, -8427, 3514, 23617, 9962, 19279, 34674, 46999, 17702, 235, 9835, 5660, 16598, -13595, -20516, 21940, 39213, 21324, 19792, 44147, 58053, 54888, 33747, 37453, 15903, -10234, -19405, -11733, 27201, 16007, 12548, 16643, 21141, 36891, -4400, -34140, -39264, -39799, -21821, -7763, 10964, -2134, -6834, 7751, 50804, 70507, 67180, 54716, 63133, 53616, 37449, 20787, 39535, 38260, 36103, 45494, 61212, 58744, 45946, 49115, 49702, 59093, 61496, 41893, 44014, 25604, -943, 19551, 25075, 14375, 6112, 12399, 19023, 32453, 33327, 35036, 36849, 17573, -12257, -27319, -5116, 7278, 17436, 36114, 42718, 44365, 69226, 60334, 36767, 19724, 10950, 34992, 14924, -8350]
15747h350j2238j8671j548o954N298K4339Q629J471K7799M4109j0420l0851j4345
15734H268j2274N330L425R273J2617J7569j9702l0474M505J7037p151j9725J186
15721a0116K9826o793j239K0025N623K773j1008l2216q93P53q729k4104K0965
15708a5133R489J5851j3317K7460O906j7664K0832L3029j3271j9459j2800j1649
15696A0274K0704M959k3494j8355K7019K8273J3759l8297l610P572q655k7851
15684g702J63J9031J376n797q110R083j5944J9034M556J6078K8860r216l0483
15671B0929k6256k3146K7594M1324j5113p313J0030k6382j646j211k2856j0701
15659c4747l8966J0551M7842Q618J7306J8662l620J7584K7884j776k0212j6494
$$ y = [-8350, -20588, -39259, -40807, -47761, -42463, -18124, -9495, -8024, 19775, 63884, 53464, 22613, 8268, -4006, 1324, 4749, 14022, 26639, 44208, 24506, -5968, -1463, 15574, 8423, -11302, -10116, 19710, 12917, 11678, 31703, 37326, 40099, 29091, -3125, -4018, -3265, -11994, -36098, -15133, -5644, 10207, -3110, 24350, 31256, 13592, 34424, 67453, 54182, 34723, 21923, 10274, 30978, 35937, 12443, -5912, 21107, 49380, 63139, 24842, 21232, 28804, 20149, -7702, -7539, 11492, 12868, 7071, -1039, 8044, -7900, 11134, 15690, 31768, 60628, 51412, 20929, -5327, -28473, -879, 40445, 25332, 18019, 28049, 1667, 21, -1190, -24046, -34747, -73713, -63162, -15320, -6702, 10604, 29266, 25646, 43230, 71114, 69338, 49126, 32632]
15647C2632l565P967j7456P242K6802O005J2714J0703o282J2145j035N666j6399
15634G7139j6844j6906k5763N28O705k336p473J2021P296J2105J5375j1717k0944
15621B9186K869m675J858p595k2073r523l816J1501K8513m413J5983J0617P321
15608E5753j267j1254k5966L2484L295k5525r095l555K4861J4795j6680m0045
15596b199l4359L7063L8982N62k8281J3968K2094P964L113J2871o459n036R474
15583F9757j1662K3300J2860p174l3238l4436j2746J9977K537k8750j190K84K5144
15570B4663K0762K4533j8394o47J5698j9713k3994o094J371L849K5394j0442M620
15557D1606o271k1440p144J8428k18n790k0219J2418L978k1252j5750J6273K1804
$$ y = [32632, 29067, 37034, 19578, 26820, 53622, 59627, 72341, 83044, 76762, 88907, 87872, 93538, 77139, 60295, 43389, 17626, 18154, 24859, 22523, 15050, 27071, 34367, 46472, 61847, 50130, 29186, 32055, 27380, 29238, 21643, -430, -9953, -13769, -2268, 26245, 21832, 37815, 48432, 55753, 54486, 43232, 17266, 49750, 53045, 27520, 18425, 14870, 39731, 54526, 37846, -2199, -36558, 505, 39487, 40049, 11768, 25736, 47830, 55794, 58907, 71778, 65319, 60283, 69757, 58095, 81395, 94255, 87081, 53843, 19407, 6661, 26638, 29175, 425, -765, -481, 24663, 45425, 69958, 51564, 50917, 66615, 46902, 22908, 16814, 18185, 22034, 47428, 36986, 41606, 35335, 13895, 6751, 25179, 24961, 19171, -1048, 11370, 15348, -5904, -21654, -5381, 16423]
15544A6423O019J4984K3895p241k0271k6176M355p799K36j0358k443K5082L740
15531B0446O085k91o072k8530j3798J9071j3103q92J2350K4599j9533L5051M506
15518C9889l0864j6398q145L31K859M881P866j8236r936K6939L5748K0370j280
15505E4024j8376Q210l562j1035J0336k418j8201j0115k2763J8744k5667r482
15493c0305J5797P183J2137k73m3557k2468J2968N8057J6256k6020l0683m1939
15481g2847K7865M2412j5306k9515N067L7190J8201L462J1145n429J0930k480
15469C0695j7319J4364L6279Q33j8163m376j6213k4937J2056j9173m919M341J7248
15456A0716R670j2346N234L0174J7751m6196l7475O852p034k077K4113K0610l1670
$$ y = [16423, 22442, 37426, 61321, 54080, 33809, 7633, 11988, 4189, 4425, -5933, -8376, 16706, 20446, 26531, 26240, 20168, -8362, -22160, -3089, -16192, -17084, -4734, 19865, 332, 35383, 39889, 9025, -7373, -15518, -15187, -12328, -7447, 419, -17817, -27753, -814, 34934, 55304, 54024, 35648, 43858, 40296, 29261, 39597, 37179, 18978, 8863, -13900, 4844, -20823, -30305, -14508, -7325, 4812, 4539, -39018, -61486, -48518, 9539, 25795, -225, -30908, -72847, -44982, -2570, -17876, -47391, -42324, -5134, 13067, 16529, 27674, 22245, 33175, 30695, 13376, 27740, 64019, 64852, 46689, 42313, 26100, 1163, 13219, -5954, -10873, -6532, 10716, 20386, 8040, 13274, 43448, 61199, 15003, -22472, -15620, -22654, -24731, -618, 19992, -11678]
15443a1678J627J2951J7848L353O566J0636j9727k049P823j023j40k8754j1410
15430a3977k8430q630m553N671L3294M2568m987j2951M062J6015L40Q372j5398
15417B1396j2210j8828R807K0187j142J0485L12j7343j884K7516r052n743P102
15404C0603j7362k7458j3581K0872K795n693L756J0249J8926j2757j236l30k4246
15391a5462r509J5014r798K3715L8370j5691j5579j414J337J400k3060K7413J2945
15378B9681l434j3846J3652O337j297r809k9654l318K5246J9914q726p01J9047
15365D3092Q723n179k3134M432j085k5445K9369M1155m169j3314J2023K2120J8086
15352A06674k0759k7034J3741j0882l6682l6448j1228P535J1331m609q891l1294
$$ y = [-11678, -10051, 2900, 20748, 24101, 30667, 41303, 21576, 19527, 27350, 26327, 26187, -2567, -13977, -42407, -51037, -55590, -49919, -16625, 25943, 20956, 8005, 12067, 28082, 28422, 36794, 21396, 9186, -9642, 165, 20352, 19210, 29695, 30007, 12664, 10780, 38296, 29244, 23501, 30603, 13241, -14217, -27798, -6926, -4131, -9824, -6068, 4181, 23107, 10350, 9114, 8784, -15462, -24971, -9957, -19755, 3960, 42330, 26639, 11060, 9646, 10983, 12383, -10677, 16736, 29681, 26247, 12401, 26053, 32390, 31093, 21284, -8370, -11688, 13558, 33472, 24746, 24045, 43092, 51815, 46636, 23502, 27934, 26849, 1404, 30773, 71928, 67759, 54445, 66468, 88588, 106674, 85915, 58881, 72622, 61740, 25058, -11390, -22618, -15083, -3752, -8361, -17252, -48546]
15340d8546J186K2011k868q601K4147M570R367M0829j2853j5022j4749k1502l1243
15327e3274j5298n957R336M4011M1875M8601R728L1096K6018N7790J6366j4236
15315A96056L0548K8002r674j2988k6212L0224M4540K2523N1661M6876M6602Q0954
15303E29112R2561J23996J68516J67858J39294J87889J69823R6884L0705N571
15293A712209k9425p9107j16657j47450j80976j87179j39609j07154j32984r9800
15283D91868r1104n4940j3558k3617k1724j9862k0819k4123l7440r066j496n171
15271A68948m002M909N72l3231q213j5082j7416Q554p204K5863o38J6069j1476
15258A27653j8468M123j4181j5184r607P562L2707m327M277o758r290K7116m783
$$ y = [-48546, -47360, -25349, -28217, -36818, -12671, -8101, 1266, 42095, 29242, 14220, -529, -22031, -53274, -68572, -74529, -65193, -21182, 20693, 69294, 79022, 110118, 136136, 193926, 210292, 196056, 226604, 254606, 244932, 231944, 205732, 235956, 280496, 303019, 354680, 401556, 448158, 529112, 621673, 745669, 914185, 1082043, 1221337, 1409226, 1579049, 1675933, 1706638, 1712209, 1682784, 1603677, 1487020, 1339570, 1158594, 971415, 831806, 724652, 591668, 491868, 400764, 345824, 332266, 308649, 286925, 267063, 246244, 222121, 184681, 175615, 174119, 168948, 164946, 169855, 170427, 137196, 128983, 113901, 96485, 105039, 97835, 123698, 123060, 139129, 127653, 109185, 113308, 99127, 83943, 74336, 81898, 114605, 110278, 114555, 107797, 98507, 125623, 120840]
15245A20840k958Q689J0773j54k4760j3934j0798J5835Q508j0272J2067J3102
15233A26938L264j1772M766m96J5981l6329k5310P260K7495L130j3633j5114M35
15220H6615j2021l929j8925p651R515k226o482j9278R957j543k050j6654k0659
15207e331J3851K3487J303J6859k8179l82L7009K5985p776k4144j0420n195J0855
15194D7922J0902l4980l987O458J405J8643J1874K5407k223N791J5169K3814K1042
15181A47237l9568r333K7696m350o832Q634n88q172k2413k858k0341m8657k4450
15168c995J8956R260K1308L0221q503j8288k2026j4581L4120M1367J966k8602
15156F1203n447K002J0038r186o533N3007J2426k2502l1404Q324L1602R630j2313
$$ y = [120840, 117882, 126571, 137344, 137190, 112430, 98496, 87698, 103533, 112041, 101769, 113836, 126938, 130202, 118430, 123196, 122700, 138681, 102352, 77042, 84302, 111797, 114927, 101294, 86180, 86615, 74594, 70665, 51740, 44089, 53604, 51378, 44896, 25618, 35575, 34032, 31982, 15328, -5331, 8520, 32007, 33310, 50169, 21990, 21608, 58617, 84602, 76826, 52682, 42262, 37067, 47922, 58824, 23844, 19857, 26315, 27720, 46363, 58237, 83644, 81421, 87212, 102381, 126195, 147237, 107669, 98336, 126032, 121682, 114850, 123484, 122896, 114724, 92311, 89453, 69112, 20455, -3995, 14961, 24221, 45529, 75750, 67247, 48959, 26933, 12352, 46472, 87839, 89805, 61203, 55756, 57758, 67796, 58610, 52077, 105084, 117510, 95008, 63604, 71928, 103530, 113160, 100847]
15143A00847m87K2550J7814K0206O408p071j2687j8076l851m217k8690j9926P231
15130H0051K3840O373P552k8932L271J2140J0412J0393J2681J0831J4700J412
15118A64724K5460J7115N497J8704J1010L7145K3806J0350J6713J3436k4970J077
15106C20067m1098k3820j2686k3435m0736o026J122j2544j2179j1423k8392k4170
15094H4680K879J246J1076L108J230J5085K72j6905O690J5028K6686K0041r033
15081A62083J9466J6550K5732l783J0961J0488k6249o444K479j541O320m7J3296
15068B29311J060k3310k7684Q236n397q453K6604j7810k8075o975k3138j8005
15056A06364n81L712K734j723l7947j2115k2362l9638j2961j2696l5991l1311
$$ y = [100847, 100360, 122910, 140724, 160930, 167338, 160267, 147580, 129504, 125653, 121436, 92746, 72820, 80051, 103891, 110264, 117816, 88884, 92155, 104295, 114707, 125100, 137781, 148612, 163312, 164724, 190184, 207299, 212796, 231500, 242510, 279655, 303461, 313811, 330524, 343960, 318990, 320067, 278969, 255149, 242463, 219028, 178292, 172266, 173388, 160844, 148665, 137242, 108850, 84680, 87559, 88805, 99881, 102989, 104219, 119304, 119576, 102671, 109361, 124389, 151075, 171116, 162083, 181549, 198099, 223831, 220048, 231009, 241497, 215248, 208804, 211283, 209742, 216062, 216015, 229311, 230371, 207061, 179377, 187613, 182216, 173763, 200367, 182557, 154482, 147507, 124369, 106364, 105783, 109495, 112229, 110506, 72559, 60444, 38082, -1556, -14517, -27213, -63204, -94515]
15044i4515q540K8967O080K8276J1859L3665N6707K2858O409K1700M822o975J4913
15031A26226L4192N9186P914j8707p369p32k2708l8026j5643q333K4402k879k1679
15018A15844L1047L9803R105J4279K7338J0038q543K9022L0992K6439J8250J2767
15006C56381k1544m719j515k7519O022j5199m2843q126M340O456k0299K3180L4796
14993B89411N1687M3981M5870K5647l7729J0440n306l1955n5377l1393m7477p8098
14981A79701n6269n7913o723j4280p862J2478l4041k4247L9348O2359K4249m475
14969A12325K160m460k972j809n498J3078o522r702J0448k011K4625J1774J2543
14956A53979R684M2144M6642M1101K9057K0699J4829K9737P2042P9879Q9160K16998
$$ y = [-94515, -103055, -74088, -68008, -39732, -27873, 5792, 62499, 85357, 91766, 113466, 118288, 111313, 126226, 160418, 219604, 227518, 208811, 201442, 200710, 178002, 139976, 124333, 116000, 140402, 137523, 115844, 146891, 186694, 195799, 210078, 237416, 247454, 238911, 267933, 298925, 325364, 343614, 356381, 334837, 330118, 328603, 301084, 307106, 291907, 249064, 240938, 245278, 251734, 231435, 254615, 289411, 341098, 385079, 430949, 456596, 418867, 429307, 424001, 392046, 336669, 305276, 257799, 179701, 123432, 65519, 58796, 44516, 36654, 49132, 15091, -9156, 30192, 92551, 116800, 112325, 114485, 110025, 107053, 105244, 99746, 112824, 106302, 96600, 107048, 105037, 129662, 141436, 153979, 163663, 205807, 252449, 293550, 322607, 343306, 358135, 387872, 459914, 539793, 628953, 845951]
14944H45951K68832K94737K48281P8145l1706r4767j55107j54546j59159j77710
14934I62951j08406j07317q1166l0617j1669J315k7748j1866Q853J4940j290J9042
14922F27022N2873L3174j3991k4984K4470K9144M869L4506M3473J8437L0551M3010
14910I02554M6757M7050L2455L1838P5742R7058M2185L4018L8990P7802J00171
14899A526620Q4193P2265O8362J05798J30576J26536J01932R2717J23458J39454
14889B571911J29428J69858J66962K38866L14369L49032M11356M84054N72344
14880E408180O71666Q40180J031425J216410J462932J761032K077913K334475
14872A6804213K707426L132228L696787M550887N950180Q228214J1659396J6285665
$$ y = [845951, 1114783, 1409520, 1657801, 1735946, 1704240, 1609473, 1454366, 1299820, 1140661, 962951, 854545, 747228, 666062, 635445, 623776, 625091, 597343, 585477, 594330, 609270, 607980, 627022, 679895, 713069, 699078, 674094, 698564, 727708, 732577, 767083, 810556, 828993, 859544, 902554, 949311, 996361, 1028816, 1060654, 1136396, 1233454, 1275639, 1309657, 1348647, 1426449, 1526620, 1610813, 1683078, 1751440, 1857238, 1987814, 2114350, 2216282, 2308999, 2432457, 2571911, 2701339, 2871197, 3038159, 3277025, 3591394, 3940426, 4351782, 4835836, 5408180, 6079846, 6920026, 7951451, 9167861, 10630793, 12391825, 14469738, 16804213, 19511639, 22643867, 26340654, 30891541, 36841721, 45069935, 56729331, 73014996]
14864G3014996K1655086K7063076L1594222L4451434L5378641L4051643L0312879
14857B87521977K3799359J4797101L992913p329313j7529474k5499632l0707326
14850B49045605l3467162l3938092l2363998k8950807k4294897j9086685j4252765
14843F2691199j0392946p712652n968827m846999m071045l515200l119013k750403
14835B0314114k387057k055620j734154j413313j145549j026374q74879p62110
14827H915058o97632o41207n64279n48620n45402m83076m68038m18044l91477
14818D157283l33509k90768k48103k32674k08560j89089j71868j40609j05731
14809B236372j12173r4586o6039o0915n1837n7321n9589n9351n3481l6464o2317
$$ y = [73014996, 94670082, 121733158, 153327380, 187778814, 223157455, 257209098, 287521977, 311321336, 326118437, 330111350, 322782037, 305252563, 279752931, 249045605, 215578443, 181640351, 149276353, 120325546, 96030649, 76943964, 62691199, 52298253, 44585601, 38616774, 33769775, 29698730, 26183530, 23064517, 20314114, 17927057, 15871437, 14137283, 12723970, 11578421, 10552047, 9677168, 8915058, 8217426, 7576219, 7011940, 6463320, 5917918, 5434842, 4966804, 4548760, 4157283, 3823774, 3533006, 3284903, 3052229, 2843669, 2654580, 2482712, 2342103, 2236372, 2124199, 2029613, 1963574, 1902659, 1850822, 1793501, 1733912, 1674561, 1621080, 1584616, 1522299]
14798A522299o4809j7356l5698m9935k7104k9551n0456m9745l5234l1880m1381
14787A089150q6351p735m182k6434k2123j5202j8572k3448r420q090J703q868
14775H60428M20k731J3439K124o74J5109k327l5261o0255p5069n704K3482j5508
14762G17473k7555k2218m955r813k490Q530L0682j223j7303r287M168J3352L3843
14749G13204L0177r405M2363N1065R170l1301K7035L1647K3607M1425Q5004P6158
14737A090149O2270P1705J11612P5415O1100n4j3661Q392n2378j00514j16174
14726A197862j15406j36657j12293q3414p4761j1771j353M677J5961J8182J9462
14715G20489K3240j6066k3655m0552o0347l9040k5672p3015n6254m7899n2537
$$ y = [1522299, 1457490, 1440134, 1404436, 1354501, 1327397, 1297846, 1247390, 1197645, 1162411, 1130531, 1089150, 1002799, 995064, 990882, 964448, 942325, 927123, 908551, 885103, 875683, 867593, 869296, 860428, 860848, 858117, 871556, 873680, 873006, 888115, 885788, 850527, 790272, 715203, 709499, 732981, 717473, 689918, 667700, 662745, 652932, 650442, 658972, 689654, 688431, 671128, 661841, 666009, 679361, 713204, 743381, 733976, 776339, 827404, 836574, 805273, 832308, 863955, 887562, 928987, 1013991, 1090149, 1152419, 1224124, 1335736, 1411151, 1472251, 1472197, 1458536, 1466928, 1414550, 1314036, 1197862, 1082456, 945799, 833506, 750092, 675331, 663560, 662207, 666884, 682845, 701027, 720489, 743729, 727663, 704008, 663456, 603109, 564069, 538397, 465382, 409128, 361229, 308692]
14704C08692j5168O090l560l947K0996J8243J7685o711R39n516M978k9145J8975
14691C32551j3869l0602k0518j5976p857J5135O405n542K6964J710j7719j3300
14679B57382J9518K7595J1868K1163K2740K6356L2171M1100L4548K5747K4743
14668E44931J6597J0890J465J8406O920r729J703j3025j2158k2624J2600k6080
14656E29896m2759k6634j4101j0480k5298q228j1782l7912l2372p878l1111J691
14644B83032J3575j6942k3078R610J2715o049l0633k8124o332k3844k2990k5594
14632A35346K194M536K1922n258l6164o278K2189j637o59J0053K1619M8064J2627
14619B28554J9247M0990K6697K0163o806N195l121j8058k3353J242P360k8869
$$ y = [308692, 293524, 299614, 296054, 292107, 313103, 331346, 349031, 342320, 343259, 337743, 342721, 313576, 332551, 318682, 288080, 267562, 251586, 243729, 258864, 265269, 259727, 286691, 288401, 270682, 257382, 276900, 304495, 316363, 337526, 360266, 386622, 418793, 459893, 494441, 520188, 544931, 561528, 572418, 573883, 592289, 599209, 589480, 591183, 578158, 566000, 543376, 555976, 529896, 487137, 460503, 446402, 435922, 410624, 402396, 390614, 352702, 320330, 312452, 281341, 283032, 296607, 279665, 256587, 266197, 278912, 272863, 242230, 214106, 207774, 183930, 160940, 135346, 137540, 142076, 163998, 158740, 122576, 116298, 138487, 136850, 136191, 146244, 167863, 215927, 228554, 247801, 288791, 315488, 335651, 328845, 334040, 330919, 312861, 289508, 290750, 298110, 269241]
14607B69241k7885L526k7374q099R783j2418j6280P632M5290j1970j7800r853
14595B03793l997p485M658N973K0806J9845q139l0270J0738M4544r07j3303n1677
14582A94579j1726j9151J3760J267J3739J0686J4676N52j5116K505K1221L1078
14570B58070L9270K0118L1288k608j4411J2527K0103M869K6249K6874O529j2814
14558D16064J936N0139M0365j8070j0315k3651Q12J3726P668K3048L6716J6215
14546E54653j9234o829Q762P53J880O937l0446j6784l0315l985K534j8612k299
14533D47015Q602k0674l5438m8581k5494p302N642k6881l1819k784j0160l3571
14521B18555k3782K3680J8628j7834K0020K7713L469k1859l9485j0995L644j916
$$ y = [269241, 241356, 244882, 217508, 209409, 219192, 206774, 190494, 198126, 243416, 231446, 213646, 203793, 199796, 192311, 196969, 202942, 223748, 243593, 235454, 205184, 215922, 260466, 259559, 246256, 194579, 182853, 163702, 177462, 178729, 192468, 203154, 217830, 218382, 203266, 205771, 226992, 258070, 297340, 317458, 348746, 346138, 331727, 344254, 364357, 369226, 395475, 422349, 428878, 416064, 418000, 468139, 508504, 490434, 480119, 456468, 457280, 471006, 478674, 501722, 538438, 554653, 535419, 528590, 537352, 538105, 539985, 546922, 516476, 499692, 469377, 465392, 467926, 449314, 447015, 455617, 434943, 399505, 350924, 325430, 318128, 323770, 296889, 265070, 262286, 252126, 218555, 194773, 218453, 237081, 219247, 239267, 266980, 270449, 248590, 209105, 198110, 201754, 199838]
14509A99838j793J3743J4458J4580M8153L5533j3100m9507k5612N452j490J9833
14497B60088q261R514R085O984J050M81J1484J4093M548k2463o658J0979j1235
14484B79689o235j4587k6209j7454J8528J3594j6953J7878k5673k7967O616J9480
14472B20707k1101k6308N293J1665J2311M3687J8238j3315k2520K418J2934J0731
14460B54740J052r777n083k2889K385K5748J4667j0473j508P586l08j4443J0037
14447B51734k962j9178J9616O0634j5301k5453r243K2109K8639P043l5458k4852
14435B57328r096q08J890K5767J3327k8491m750J214M6044J8294L01J8701K9902
14422C69623K6677P4785Q4507Q7293J43612J52817J57582K01249J72368J22829
$$ y = [199838, 198045, 211788, 226246, 240826, 288979, 324512, 311412, 261905, 236293, 241745, 240255, 260088, 251827, 261341, 270426, 277410, 278460, 278941, 290425, 304518, 309066, 286603, 279945, 290924, 279689, 273454, 258867, 232658, 215204, 233732, 247326, 230373, 248251, 222578, 194611, 201227, 220707, 199606, 173298, 178591, 190256, 202567, 246254, 264492, 251177, 228657, 231075, 244009, 254740, 255792, 246015, 240932, 218043, 220428, 246176, 260843, 250370, 248862, 256448, 256140, 241697, 251734, 248772, 229594, 249210, 309844, 294543, 269090, 259847, 281956, 310595, 317638, 282180, 257328, 248232, 247424, 249314, 275081, 288408, 259917, 255167, 256381, 302425, 320719, 321020, 339721, 369623, 396300, 471085, 555592, 642885, 786497, 939314, 1096896, 1298145, 1470513, 1593342]
14412A593342J00743J15771N4311j2900p5084j13321j45976j60729j93340j98719
14402I64098j54596j23279j14571r4440o8229n1248k7195o3287q998j5913j2453
14391B29889j0136L123k0234k8194J7008k1578k0171j0646p730j3627J1332j671
14379A27365J0903J0883k5982K530R741J4053J32M631m898R275n470N675J1025
14366A69863j5031r037L516L3175J0431o457j7855j0180L2111l2445m6984l528
14354A07579J1086j5604m6994k0629R403J5919J7275L3781q300k7038l0194j5172
14342C1112K906P674J361R867l867m266j9871O070R010k2671j240Q238j15o533
14328A7675R367J7567j7657L190J6356k437o100K358K6769J950j59k0066j2055
$$ y = [1593342, 1694085, 1809856, 1864167, 1851267, 1776183, 1662862, 1516886, 1356157, 1162817, 964098, 809502, 686223, 571652, 477212, 408983, 357735, 330540, 267253, 258255, 242342, 229889, 219753, 222876, 202642, 174448, 191456, 169878, 149707, 139061, 131331, 117704, 129036, 127365, 138268, 149151, 123169, 125699, 135440, 149493, 149625, 154256, 149358, 158633, 153163, 158838, 169863, 154832, 145795, 149311, 182486, 192917, 186460, 168605, 158425, 190536, 158091, 111107, 107579, 118665, 103061, 56067, 35438, 44841, 60760, 78035, 111816, 103516, 76478, 46284, 31112, 34018, 41692, 43053, 52920, 49053, 44787, 24916, 30986, 39996, 17325, 16085, 24323, 24208, 17675, 27042, 44609, 26952, 30142, 46498, 44061, 37961, 40319, 67088, 69038, 68879, 48813, 36758]
14315C6758L329L788J0607N618K4114r363k9117J0683J8910P981o289j2416j5746
14302D8857L149N521J6029l367k3824k1903J1024J126J4915j6864P375P587J45
14289D9770n493j6938j1761J5033J1773K91K7611L3881k1989k7849j1164p393
14277C5772q13Q938k761j7048M101n945k16J8933L3587L723j8804K469J3720m505
14263G1151k3581n078J728r313k770j1633q191j0869J2957J467j996J5136P198
14250C6206j79K7704m274l7435p846J2059k2163N21q857n486j8001L1233Q276
14237A1758J2027O801k1185q39j2092j0588J490j909J9286K8648j1186O98K3621
14224D6530j7190k5907Q873J7557N01Q828J4508L9404L6900L1798j8500K628J7954
$$ y = [36758, 40087, 43875, 54482, 60100, 84214, 74851, 45734, 56417, 75327, 83308, 77019, 64603, 48857, 52006, 57527, 73556, 70189, 46365, 24462, 35486, 36612, 51527, 34663, 42038, 49625, 49770, 44277, 27339, 15578, 30611, 42384, 42675, 70286, 104167, 82178, 54329, 43165, 35772, 34959, 43897, 41136, 24088, 28189, 22244, 22028, 40961, 74548, 78271, 59467, 61936, 75656, 71151, 47570, 42492, 44220, 34907, 32137, 20504, 12313, 1444, 14401, 15868, 13872, 29008, 36206, 36027, 63731, 59457, 22022, 14176, 26235, 4072, 4593, -4264, -9750, -27751, 3482, 11758, 23785, 30586, 9401, 8562, -3530, -14118, -12628, -14537, 4749, 33397, 22211, 22909, 46530, 29340, 3433, 12306, 29863, 30364, 39192, 53700, 93104, 130004, 161802, 143302, 145930, 163884]
14211A63884M7598J8158K0752N695J0593q619k0636m6520k5061k3240j4352j2995
14199A15257j1340J237k1002j2960r731P588j9725K1296k776N190N302q237K127
14186G2226J9976P599j9167k7346k3669Q955k6553j2482K8035N3242o0m86j3028
14173F7242j5796P686J3896K0489k730l0974j0503J5149j2764k3352j365J7768
14161D4746J9182K3226q297j3176J1530J4503J6546O003Q168L1358J2275J2309
14149A78373N7990L3727K3362L1728J8177J2882J0222r403K3394L8747J8625J0246
14137D48070j3044j368M3497j1415n3418k6825j3882k948j2416n6199n4098j64
14125B45790j0003k7928m8084n4110j1442l495J333m542j6880J4260K0923j7296
$$ y = [163884, 211482, 229640, 250392, 256087, 266680, 258061, 237425, 190905, 165844, 142604, 128252, 115257, 103917, 105154, 84152, 71192, 61461, 69049, 49324, 70620, 67844, 73034, 78336, 70099, 72226, 92202, 99801, 80634, 53288, 29619, 38574, 12021, -461, 27574, 80816, 80756, 80270, 67242, 51446, 59132, 73028, 93517, 90787, 59813, 49310, 64459, 51695, 28343, 26978, 44746, 63928, 87154, 78857, 65681, 77211, 91714, 108260, 114263, 122431, 153789, 166064, 178373, 236363, 270090, 293452, 325180, 343357, 356239, 366461, 357058, 380452, 419199, 437824, 448070, 435026, 433658, 477155, 465740, 412322, 385497, 371615, 368667, 356251, 300052, 245954, 245790, 235787, 207859, 159775, 105665, 94223, 90728, 92061, 87519, 70639, 84899, 105822, 88526]
14113H8526p865k1688k440j0906j5121k3172k1732j1803j155M183M443J5001L0976
14100B7247j3697J6767m025r325m278O941j8566j8987q974K1989J8093N132j9791
14087a474q176J0805j373j2999P635N393q131K0241K2228k9175l2716K5270K9209
14074B6737l5337K126j050K9404L6292m428p022n320k5052l4299j4935J6834K4774
14061H724r275j1773K0077L05L15k855j2715j4846j4002J5439K7475J3855l3938
14048a3214k7047J6669L6608j2364j5793J0357J5853J1680j7572R27j0733k07
14036d836L030J9489J573p463k8249k024J2352j5021O883J7245J6312k5137k4451
14023c0297J3491J2724P015o783j3449N997o436J0920J8102k144m945k0350L1264
$$ y = [88526, 80661, 58973, 56533, 45627, 30506, 7334, -14398, -26201, -27356, -23173, -18730, -3729, 27247, 13550, 30317, 26292, 16967, 12689, 19630, 1064, -17923, -26897, -4908, 13185, 18317, -1474, -9650, 1155, -218, -13217, -5582, -189, -8320, 11921, 34149, 4974, -27742, -2472, 26737, -8600, -6474, -7524, 21880, 58172, 53744, 46722, 41402, 16350, -17949, -32884, -16050, 8724, -551, -12324, 7753, 8058, 8373, 5518, -7197, -22043, -36045, -20606, 6869, 20724, -13214, -40261, -23592, 13016, 652, -15141, -4784, 11069, 22749, 5177, 6104, -4629, -4836, -1806, 17683, 19256, 11793, -16456, -18480, -6128, -21149, -14266, 2979, 19291, -5846, -30297, -16806, -4082, 2933, -3850, -17299, -11302, -17738, -6818, 11284, 9140, 4195, -16155, 15109]
14010A5109K6012k9339r498j7032m020K8553O030j3301J096J0803r150p619L792
13997A436J8242j7832R841J0572j8708q231J8956K3575j6908k0802J2224L2592
13985D4957J6065k2061J857j3143N912k386k9158O965N222j7014j2161K5374O669
13972A7098k1555J1521j8202K9580J9452l6647p797p906j133Q282l472O500q235
13959a2514l1181K1784L4163j9699j5040j5150J203O962J1585L862K4749r658
13947A066l8829Q829o254O965J3973J2514k4072o469J1133Q668K4018M920j6482
13934b0j6232K8888L702j6592L3110j7199p627J7766r957n542L440k9378k395
13921a8036R001K0570J5358K2682J4658l1403j8897K4132k9557j6863Q373J930
$$ y = [15109, 41121, 11782, 2284, -14748, -18768, 9785, 15815, 2514, 3610, 14413, 5263, -2356, 1436, 19678, 1846, 11687, 22259, 3551, -4680, 14276, 37851, 20943, 141, 12365, 44957, 61022, 38961, 40818, 27675, 33587, 31201, 2043, 9008, 14230, -2784, -14945, 10429, 17098, -4457, 7064, -11138, 18442, 37894, 1247, -6550, -14456, -15589, -7307, -10779, -4279, -12514, -43695, -21911, 12252, -7447, -22487, -37637, -36434, -29472, -17887, -14025, 10724, 1066, -37763, -28934, -35188, -28223, -14250, -1736, -25808, -32277, -21144, -12476, 11542, 16462, -20, -16252, 12636, 16338, -254, 32856, 15657, 8030, 25796, 15839, 10297, 13737, -15641, -18036, -9035, 11535, 26893, 49575, 64233, 32830, 13933, 38065, 8508, -8355, 18, 1948]
13909A948r839k685k7734K9842K5740p393k940J730j9706j8922M641R016L264
13896a3038J4609J4559J1930j3546J5551j2061j7382j8031k736K088j151j5631
13884c4839q517L703J6602J0198M764J4615N312p469j0799j6538j0745j1765p651
13871e3129J2198J1068Q301K5833j7876j3889L367K5168M534O08o3n249m603J90
13857c542K6622M775O69J0190k1935j4313k38P389k571J2019k3740J862j8146
13844b0959k807P737N082k563J2221J3841L651L698N334j4118j0179L554M693
13831I185N584J035j3667m669M683j4614n936K858J1558J0424J1001m584k7805
13818a4947M382J7811J7681L862j5237O971k728k9767j2855P332O490P620J3813
$$ y = [1948, -7891, -10576, -38310, -8468, 17272, 9879, 6939, 8669, -11037, -29959, -25318, -16302, -13038, 1571, 16130, 28060, 14514, 30065, 18004, 622, -17409, -20145, -18057, -19208, -34839, -43356, -39653, -23051, -12853, -8089, 6526, 11838, 4369, -6430, -22968, -33713, -45478, -53129, -40931, -29863, -21562, 4271, -13605, -27494, -24127, 1041, 5575, 6183, 6120, 871, -3732, -3542, 23080, 27855, 28524, 38714, 16779, 2466, 2228, 9617, 7046, 19065, -4675, -2813, -20959, -23766, -16029, -10947, -13510, -1289, 12552, 16203, 19901, 25235, 11117, 938, 4492, 9185, 14769, 15804, 2137, -2532, 2151, -12463, -18399, -15541, -3983, 6441, 17442, 12858, -14947, -10565, 7246, 24927, 28789, 13552, 20523, 17795, -11972, -24827, -17495, -11005, -3385, 10428]
13805A0428K0246J8694n311n409k1416j9657J8948J7213p515k7451j7939L3565
13793A4396K8709r32m195N024j057M216k2390k0275j7046l217p463j3052j965
13780c9247J3927K9029R113L140q504m2400q769L7501L4990J9099j7053k9531
13768A295J0153J8764M938r936k1329m473K4159j8763j0912k6619j4701J8673
13756b8751N0188K6730j129j175K0684m292k8265l1177m420j4886N124K751k540
13743a1158J3781J1533J553j374j9064K3375J5158J4313k3020m253O673j7632
13731I885R350l2272o324k4512j5128J7727M0781J7018k9126m200J6245J7485
13719A6929k0426l121k6299J3939J1127k9359P81J962J0790l844m898K2494L2544
$$ y = [10428, 30674, 49368, 44057, 38648, 17232, -2425, 16523, 33736, 26221, -1230, -19169, 14396, 43105, 42173, 37978, 43002, 41945, 46161, 23771, 3496, -13550, -16767, -24230, -37282, -39247, -25320, 3709, 12822, 15962, 7458, -34942, -43711, -6210, 28780, 47879, 30826, 1295, 11448, 30212, 35150, 25214, 3885, -588, 23571, 4808, -6104, -32723, -47424, -28751, 21437, 48167, 47038, 45863, 66547, 62255, 33990, 2813, -1607, -16493, -11369, -8618, -11158, 2623, 14156, 15709, 14335, -4729, 18646, 33804, 48117, 25097, 20844, 27517, 9885, 19235, -13037, -19361, -43873, -59001, -41274, -493, 16525, -12601, -16801, -556, 16929, -3497, -6618, -32917, -18978, -7851, -37210, -36429, -34467, -23677, -27521, -32419, -9925, 22619]
13706B2619m711M902J4485J7201l9257k8042q924k066l94q654O777J2605R778
13693c681O752K2286r171j9402n729K4799L410j8792k1075l6487k5376P481r62
13680g5947J1721K4814J8374J5234r336m738j9968R777L7739N993l1205q418J2932
13667a3028K1696Q071N309k2357m911R317K5155J3226n155n690M366J7088N4n2878
13653B63j7794L676k27j4090J7704N477j8340m254n066K628R237r788k8954Q211
13639e1317J1297K2212J5079J0314O421K574l845Q412j4168j7141R788J4637M158
13626A8421j955r183j9858J508J7913J3886K536J9142p115j952j7293q013l5387
13613b7350l3221m526j274K835K600M3067J2689l335l847l3411j7776J0002K443
$$ y = [22619, 17908, 22810, 37295, 54496, 15239, -12803, -21727, -23793, -24187, -32841, -26064, -13459, -3681, 3071, 25357, 16186, -3216, -8945, 15854, 19264, 472, -20603, -57090, -82466, -74985, -75947, -64226, -39412, -21038, -5804, -15140, -19878, -39846, -30069, 7670, 13663, -17542, -25960, -13028, 8668, 16739, 22048, -309, -5220, 4097, 29252, 42478, 37323, 31633, 35999, 53087, 53141, 263, -17531, -13855, -14082, -28172, -10468, -4991, -23331, -27585, -32651, -30023, -20786, -30574, -59528, -51317, -40020, -17808, -2729, 7585, 14006, 16580, 12735, 21147, 6979, -10162, -374, 14263, 18421, 16466, 7283, -12575, -11067, 6846, 20732, 23268, 42410, 35295, 33343, 16050, 8037, -27350, -60571, -65097, -66371, -63536, -60936, -17869, -5180, -8515, -12362, -45773, -63549, -53547, -51104]
13600e1104q606O521L0196K0206O621j1202r745k1575J1633K8021K895q247O230
13587A844K3918m260j5019n597R252J4195J787n912R777j6401j3965k430P738
13574D927q619o725O779j355J3266R859k4960k8420J8134J2998o589j5572L640
13561b2637J9554J096k2116N676l628J7917J2556j865k963j9205j1538j1366l313
13548d1832J0849o683j35J7640l835Q813q970k3587l547K0295M8923K704j6355
13535D280k2575n428J8184n933M825J7377j1160O466K232k6007R620P466k27K7655
13521B6775j883k4831o209O099Q187k4036r083j0119m732m400K1349K815K3674
13508C606N481j1960j486K4664q631k3306J8052Q680O39j40k3097L293o516l679
$$ y = [-51104, -59710, -53189, -22993, -2787, 3834, -7368, -17113, -38688, -27055, 966, 3861, -4386, 1844, 25762, 21502, 6483, 886, 10138, 24333, 26120, 20208, 29985, 13584, -381, -2811, 4927, -3692, -10417, -3638, -4993, 8273, 18132, -6828, -35248, -17114, -4116, -10705, -26277, -22637, -3083, -1987, -24103, -18427, -22055, -4138, 8418, 6553, 3590, -15615, -27153, -38519, -41832, -30983, -37666, -37801, -20161, -23996, -15183, -24153, -47740, -51287, -30992, 17931, 20635, 4280, -18295, -23723, -5539, -11472, -6647, 10730, -430, 6036, 8268, -17739, -8119, -653, -880, 26775, 24892, 61, -6148, -49, 8138, -15898, -24981, -35100, -39832, -44232, -22883, -20068, 3606, 9087, -2873, -4359, 20305, 11674, -11632, 6420, 15100, 15739, 15599, -7498, -4205, -10721, -14400]
13494a4400q784O715k9160N69K6046R358j2477k7068J7028K4249P524j8085p328
13481b5813R591p522p764r077m309k640L3287J0993R423P385J4186j8715k6915
13468a7890O744k0374j4388J5862Q090r666j665n736l2172K0337O984K2452O08
13455b0814k78l725n119O76p893L4257k7866R705K0408J3269J0411q690m079k945
13441G317j5589r244J7024p120j0019o257L0966J5634m593j2055k6337M819o871
13428b2325m663M774j7090K6502J9984N310l877J082M2005k3065l7170j2015R924
13415a0624q198m850j4754n565N515K5537J0428k6101o353j031l211j3799k0705
13402g3711K0904K3810k4775j0482L6156J9350K833k397K2940J3418R383q200
$$ y = [-14400, -23184, -16469, -45629, -45060, -19014, -9656, -22133, -49201, -32173, -7924, -400, -18485, -25813, -16222, -23744, -31508, -40585, -44894, -47534, -14247, -3254, 6169, 13554, 27740, 9025, -17890, -11146, -31520, -45908, -30046, -21956, -31622, -33287, -39023, -71195, -50858, -43874, -21422, -20814, -21092, -24817, -29936, -29260, -37153, -2896, -30762, -21057, -649, 12620, 23031, 14341, 10262, 7317, -8272, -17516, -492, -7612, -17631, -23888, 7078, 22712, 18119, 6064, -20273, -15454, -22325, -26988, -22214, -39304, -12802, 7182, 12492, 8615, 9697, 51702, 28637, -8533, -20548, -10624, -18822, -23672, -38426, -43991, -38476, -12939, -2511, -28612, -34965, -35996, -39207, -53006, -73711, -52807, -28997, -53772, -64254, -28098, -8748, -5915, -8312, 14628, 28046, 37429, 29229]
13390B9229L790j993j4032R939j2651j7382J369L3339R254J4989l4214l5248q702
13377b2313l989N07q834m56L5392J3705K1230J4329l2723l2102J9285N356n724
13364C663J0039j427j9318j84j0764J2331p68J2767K1773l5979k0294K470j5745
13351d1436J2602Q643n611k169o51K720k537j3521R308R659j6647p010K8754J4131
13337c765m602j5927j2960L1220M0380r105j3301j8119j8433J8288K2030j0031
13325E675K1233k67k7765j3990l8027N782K48l201k0855J0214J4956J4584k675
13312c4088K5024k903j8781P047J2182P920k2283O665N457n375K3678K6149j5780
13299A4912j1603j3606k6064n947M3015j379J2403j7300L57L880l14J0425K980
$$ y = [29229, 33019, 31026, 16994, 26933, 14282, -3100, -1731, 31608, 40862, 55851, 21637, -13611, -22313, -26302, -25795, -34629, -35085, 307, 14012, 35242, 49571, 16848, -15254, 4031, 9387, 3663, 13702, 12275, -7043, -7227, -17991, -5660, -6428, 6339, 28112, -7867, -28161, -25691, -41436, -28834, -20191, -25802, -27971, -28622, -25902, -28439, -41960, -32652, -22993, -39640, -46650, -17896, -3765, -8367, -24294, -37254, -6034, 34346, 25241, 11940, -6179, -24612, -6324, 15706, 5675, 26908, 26641, -1124, -15114, -53141, -47359, -47111, -50312, -71167, -60953, -45997, -31413, -34088, -9064, -11967, -30748, -23701, -11519, -3599, -25882, -19217, -13760, -19135, 4543, 30692, 14912, 3309, -10297, -36361, -42308, 707, -672, 11731, -5569, -5212, -1332, -1646, 8779, 11759]
13286A1759L895K3765N258l5349m8833p01K074L2451J5264l950l3188k5212J3039
13273c9728K6245K1744L301l4680k5984M71K6821J3512j4241j1033j9431J0474
13261d2529j954q164K520l696J5781J3717J0006N589l146K4170J9026o782k4138
13248D00K555Q598k5536P522j9051k8069J6694J1090j2317M511J8117K143L203
13235a0140J036l9227p220J181n295L383J3163m041L0942L2690O268r177k0076
13222f513L486j0261j3193J5548o361k0468J3800K2887n935k8569R456L0080k237
13209A720R244J2406p297l557j4804j0548k3238K2227j5534j8613L865K3047j0793
13196c1875J36q456j5079J4989J4993M255N53q434J0256K6064K5500k9065o512
$$ y = [11759, 15654, 39419, 44677, 9328, -39505, -40206, -38132, -5681, 9583, 5633, -27555, -52767, -39728, -13483, 8261, 11562, -23118, -49102, -48631, -21810, -8298, -22539, -33572, -53003, -42529, -44483, -52647, -50127, -53823, -38042, -24325, -14319, -8730, -11876, 12294, 31320, 24538, 400, 2955, 11553, -13983, -6461, -25512, -53581, -36887, -25797, -38114, -33603, -15486, -13343, -10140, -9104, -48331, -55551, -54370, -59665, -56282, -43119, -47160, -16218, 16472, 22740, 13563, -6513, -3027, -13288, -26481, -10933, -17294, -37762, -23962, -1075, -7010, -35579, -26123, 3957, 1720, 10964, 23370, 16073, 12516, -2288, -12836, -36074, -13847, -29381, -47994, -44129, -21082, -31875, -31739, -40195, -55274, -40285, -25292, -21037, -20484, -28918, -18662, 7402, 32902, 3837, -2675]
13183b675J6867j1026j0079O604j0872K1006N299L974j2992j111j9384j4849k3551
13170e2789O056J0521K6782j840j8511q240j908K1122K2423k1635k7415R221p264
13157d3477j0335K1348J079K4564K0932M435j5875j8334N035K7929K6100o512
13145C6889k3304j4868k3260j0507k0148m823l49L0106J1749M802n727o40J8124
13132a956K862N634J5000p007k8564j4099o881K7002n491j6587j9865j1024K0598
13119d0378K2129J8900J5528l7913j2746N1714K5521n969r131r400k0591j1578
13107a3914j3472Q370l305j8639J5059M336K5479m0443k2468J3669J3205M059
13095b8064j4617k9664l552R659o489K8852K2165k4380j4758L4848L3663j4918
$$ y = [-2675, 14192, 3166, -6913, -309, -11181, 9825, 15124, 19098, 6106, 4995, -14389, -29238, -52789, -46733, -36212, -9430, -11270, -29781, -38021, -39929, -18807, 3616, -18019, -45434, -36213, -43477, -53812, -32464, -31385, -6821, 14111, 18546, 2671, -15663, -10628, 17301, 43401, 36889, 13585, -1283, -24543, -35050, -55198, -60021, -60370, -30264, -18515, -13713, -19440, -20080, -1956, 906, 6540, 21540, 14533, -14031, -28130, -35011, -8009, -13500, -30087, -49952, -60976, -40378, -18249, 651, 16179, -21734, -34480, 17234, 42755, 36786, 27655, 18255, -2336, -13914, -27386, -19016, -22321, -40960, -25901, -21565, 3914, -36529, -58997, -45328, -32123, -28064, -42681, -72345, -75897, -66238, -72727, -43875, -21710, -46090, -60848, -26000, 7663, -7255]
13083g255n0248j7J3182J0617K1784k6302j9116K0234L699O201K233R10j233m111
13069b9422R472J5674J7654O299j6280n62j340j8191m0455J2667J9544j5819J3944
13056b6815N821J7633R438j4821q550J825J0620k7670j1956n118l43N6893Q550
13043A5507j2731j7680K773Q294J6144j2935j9217R094r083J4918M0221j094l8263
13030d052m3414k6216Q484J6519K0159M647J1335j3668o326Q744l888j181j251
13017c0108K598J915Q6k2674l354K0209M1441J9934m1974j5970K5172k258K3905
13004A8922k7401n124J7219j1201j3826J8201k8517l1749j858M9053J2784J0845
12992G348n216j8217J6260j2490r458K981l317k9664j4347N9927M5066n1184l5204
$$ y = [-7255, -57503, -57520, -44338, -33721, -11937, -38239, -57355, -37121, -33422, -27221, -24988, -24078, -25311, -29422, -19950, -4276, 13378, 19677, 3397, 2835, 1495, -16696, -57151, -44484, -24940, -40759, -26815, -20994, -3361, 6077, -8744, -17294, -15469, -4849, -32519, -44475, -49593, -49936, 6957, 15507, 2776, -14904, -12131, -3837, 12307, -628, -19845, -10751, -19834, -4916, 35305, 34211, -4052, -47466, -73682, -65198, -48679, -28520, -23873, -12538, -26206, -32532, -23788, -27676, -28857, -30108, -27510, -25595, -25509, -48183, -51537, -31328, 10113, 30047, -11927, -27897, -2725, -4983, 18922, -8479, -13603, 3616, -7585, -21411, -3210, -31727, -63476, -65334, -16281, -3497, 7348, 2132, -16085, 175, -12315, -21773, -18792, -22109, -51773, -66120, -6193, 38873, -12311, -47515]
12979d7515J5J2747j3500j1282k799r3J4115M843K758R297K2012P924N414P543
12965A1479j4545j8997n647j7174k3775N317K1026K798k813J6981K5722j7306
12953a6934k2734L0325J7737j2778j6656J5990j1088J56K0905q783k3133J7388
12941i605o017p964P871K231n852L524J2512R637O925o924m273K0893p395J96
12927A5759l154j9736J8134K7192k4731k953j5342n439p871P835K5465j9500M323
12914a8J0258L836J3643j2821j8212J3885J139J560r722Q250R0q551R80Q822n433
12899G706L796j4468j5211Q806L2696R80j9988o711m05k2145M16K2510J0531J1132
12885A9645M079r384J2480j7959r729J2594k6248n233n230N017j0924O396K897
$$ y = [-47515, -47500, -34753, -48253, -59535, -62334, -62427, -48312, -43469, -40711, -31414, -9402, -1478, 3936, 11479, -3066, -22063, -27710, -44884, -68659, -63342, -42316, -39518, -42331, -25350, 372, -16934, -39668, -9343, 8394, -4384, -21040, -5050, -16138, -15982, 4923, -3860, -26993, -9605, -15622, -23586, -15715, -13484, -19336, -15812, -3300, 6337, 13262, 6338, 2065, 22958, 15563, 15759, 12605, -7131, 11003, 38195, 13464, 10511, -4831, -10270, -18141, -10306, 15159, -4341, -18, 10240, 14076, 27719, 14898, -3314, 10571, 11710, 13270, 3548, 11798, 11888, 3337, 4317, 13139, 7706, 11502, -2966, -18177, -9371, 23325, 24305, 4317, -2394, -2799, -24944, -24528, -2018, 8513, 19645, 23724, 14340, 26820, 8861, -868, 11726, -14522, -19755, -24985, -19968, -30892, -24496, -21599]
12872b1599J7689J301Q039J0925j496k7528N843K1044J623j3501r150J9192L071
12859A5453L1529L8842M3111L1153K4973M1432K2120K0228L1779M3767K9235K6818
12847D00440J2073L2419J7688J0496m8139l8874j6272m7677m6986n1544j0950
12836B12674k5971l1441k9721L13m6069l3585O57n630J4660j3859N221j015J8109
12823F4343k1289r303k0163j9148O784k883N658j2744j4005K4713J8041J5808
12811C5812M737j339r38K596P800q601M111l215R238P487K690L3069J0483j2764
12797I1166k4173q473j4697l2597q890M457P119k215m359L9195J8256R708M2302
12784A16799L6872k3857k351M1257M8374J4841J8720J3276L097j9479m2039m2892
$$ y = [-21599, -3910, -2609, 5430, 16355, 14859, -12669, -6826, 14218, 15841, 2340, -6810, 12382, 15453, 46982, 85824, 128935, 160088, 185061, 226493, 248613, 268841, 300620, 344387, 373622, 400440, 412513, 444932, 462620, 473116, 424977, 386103, 369831, 322154, 275168, 223624, 212674, 186703, 155262, 125541, 125854, 79785, 46200, 46857, 41227, 55887, 42028, 47249, 46234, 64343, 43054, 33751, 13588, -5560, 1224, -1659, 3999, -8745, -22750, 1963, 20004, 35812, 40549, 39210, 38272, 40868, 48668, 40067, 44178, 40963, 50201, 57688, 60378, 93447, 103930, 91166, 66993, 58520, 43823, 11226, 2336, 6793, 13912, 11697, 7338, 46533, 64789, 74497, 116799, 153671, 129814, 127463, 168720, 217094, 231935, 250655, 263931, 267028, 247549, 205510, 162618]
12772A62618l0043J3711Q187p513k0792r143r082l0561q329K2412J6491J6866
12760A24822j7599k6689m3002k0374j2260j5312J6225L0925o886k2047L847k3471
12748a1821k9995j3795L6294J7560P037L335j0299K617O393k4038J0499J1006
12736D793J2861j982j5348k3395l0806j815L3998K8647o150j7735j0522K742J2184
12723a2528J6900j3081K0964K1346J759j2465l870O213k1845M25K5438l0794k5727
12710b7265O802J5476k3043J1690J8687J3430k416J301j9602k0939k2022K3117
12698b4784K3486j7882J2092J2393K343o214l4906n426K5022n946l6402K3556
12686c2668J5008J1779k0020j1273j5610J116K2928J9284j9533J8630J8119l2593
$$ y = [162618, 132575, 146286, 154473, 146960, 126168, 117025, 107943, 77382, 69053, 91465, 107956, 124822, 107223, 80534, 37532, 17158, 4898, -10414, 5811, 36736, 29850, 7803, 11650, -11821, -41816, -55611, -19317, -1757, 5280, 8615, -1684, 933, 7326, -16712, -6213, 4793, 17654, 15672, 324, -23071, -53877, -55692, -21694, 6953, 803, -16932, -27454, -24712, -12528, 4372, -8709, 12255, 33601, 35360, 22895, 19025, 25238, 3393, 3818, 29256, -1538, -27265, -20463, -4987, -28030, -16340, 2347, 15777, 13361, 14662, -4940, -25879, -47901, -24784, -1298, -19180, -7088, 5305, 7648, 1434, -33472, -38898, -13876, -19822, -56224, -32668, -17660, -5881, -25901, -37174, -52784, -51668, -28740, -9456, -28989, -10359, 7760, -24833]
12674b4833k159M0506K1001O337p84k4154P785k2971l0762N766l447K0362j5868
12661b3221k1930J680L2452J534k4382o656K340J7837J9066q166j975J6081n135
12648d75j5764j6305O814r8l1392R856K5190J0603j6465r07L2201N204l0297m23
12634b2258L0128J8858j4582m608j3434J4211n99j650J8384N049K9888L0986k9617
12621F0756m6818k6371Q955N072j6027K0992J3608j608j9209q240K0487O034j5855
12608A776j715j5419k0367r401J9197J5173n412n222r528l150K3792J5730j5190
12595i736k7278J2057m015L8870K6579j4918n737k6922p907K0636k178n657P013
12582H07k927Q9p19k5330j5579K657N425J1322J4686K933M675K4007j1033k699
$$ y = [-24833, -26992, 13514, 34515, 40852, 40068, 15914, 23699, 728, -30034, -24268, -27715, -7353, -23221, -45151, -43471, -11019, -9485, -33867, -40523, -38183, -20346, -1280, -9446, -11421, 4660, -475, -16239, -32544, -25730, -25828, -57220, -47364, -22174, -11571, -28036, -28943, 3258, 8462, -21835, -22258, 7870, 26728, 12146, 7538, -5896, 8315, 7716, 6066, 24450, 29499, 59387, 90373, 60756, 13938, -12433, -3478, 1594, -14433, 6559, 20167, 18559, -650, -8890, 11597, 17631, 1776, 61, -15358, -35725, -45126, -25929, -10756, -16168, -21390, -30918, -34068, -10276, 5454, -9736, -37014, -24957, -28972, 9898, 36477, 21559, 15822, -11100, -19007, 1629, -549, -6206, 807, -2120, -2031, -2750, -28080, -43659, -41002, -35577, -24255, -9569, -6636, -1961, 22046, 11013, 8314]
12568H314m102o584O196K2233J0478L3786r149l2975j8446j2483j9531l575J3442
12555a2396k1340N837K5101k0044j5296p338o198K953L4857J9302l0678k1622
12543d6862N490J444L305K6383M8889k5533k487r325j0718l8073L237J0039j2798
12530d7009J3976J6735L0363j536k5514k0606j0016j7422L4406M1285m561o07
12518I494j0832J4776K7264k487k0767j851p324m9145j5160J3933J6211K4728
12506a160N993m6792l659O785J0199m500j0298k984K5201l4977j5271J7511n052
12493e9004k1014L6484L1992O197J2146k2853j1835n864L0161K1753l761q660
12481E742m0577k5156L561j2452J3276J2296O202P705j703j3489k077O257J3382
$$ y = [8314, 4212, -2372, 3824, 26057, 36535, 70321, 61172, 28197, 9751, -2732, -22263, -25838, -12396, -33736, -27899, -2798, -22842, -38138, -45476, -51674, -48721, -13864, 5438, -25240, -46862, -41372, -39928, -36623, -10240, 38649, 13116, 10629, 1304, -9414, -47487, -44250, -34211, -47009, -33033, -16298, 14065, 12529, -12985, -33591, -43607, -61029, -26623, 14662, 10101, 9494, -1338, 13438, 40702, 38215, 17448, 15597, 8273, -40872, -56032, -42099, -25888, -1160, 4833, -41959, -45618, -38833, -28634, -33134, -43432, -46416, -21215, -56192, -71463, -53952, -59004, -80018, -43534, -11542, -5345, 6801, -16052, -27887, -33751, -3590, 18163, 14402, 5742, -34835, -59991, -56430, -68882, -55606, -43310, -37108, -29403, -31106, -44595, -46672, -40415, -27033]
12468b7033P533r218M671j9111j3014Q501n410J3490K929J4672J0627J9849L756
12455A2242j468k7618p52J3133q235k0279k667L3073K1902k7072p428K603J6874
12442D308K3403k0867j6818j6042O12M1431J829j8869l301k635J1084Q051J3638
12429B5824M301k812j2281n633P321j8344l9734j1379p847q055K3649L928O90
12416d0372n686j4956M160L0525J9279k0638K5550J546o75M512K7505K35j4521
12403A6464R012j2141j9753J0373K9905j3207l4529l3351k5042L2565K2498m341
12391b1547k0710k409J5127J7651J254J7451r481J0774Q819n989j1648R374k030
12378F636j0119j0769J8504Q675P772j1704l691k1766j5475q048R152K976J0863
$$ y = [-27033, -19500, -28718, -24047, -43158, -56172, -47671, -53081, -39591, -36662, -21990, -11363, 8486, 12242, 10774, -16844, -17596, -4463, -12698, -32977, -35644, -2571, 19331, -7741, -15169, -12566, 4308, 27711, 6844, -9974, -26016, -25404, 16027, 17856, -1013, -4314, -6949, 4135, 12186, 25824, 30125, 27313, 15032, 9399, 16720, -1624, -41358, -52737, -60584, -68639, -44990, -41062, -40372, -46058, -61014, -56854, -26329, -7050, -27688, -2138, -592, -1267, 3245, 30750, 30985, 16464, 25476, 13335, -6418, 3955, 33860, 20653, -13876, -47227, -72269, -39704, -17206, -21547, -42257, -44666, -29539, -11888, -10634, 6817, -2664, 8110, 16929, 10940, -708, 8666, 6636, -3483, -14252, 4252, 12927, 20699, 8995, 5304, -16462, -31937, -39985, -30833, -27857, -16994]
12365a6994J6055K1583r046r206m763K340J1194p209j207k26j7549K2905P031
12352A4908L952K5668K088j3509j914p199l0135j1389L538K9782K859j8186K3791
12339B4254J1822J386q227m210k9061L947K9693P923j3770r712l0726k5318j119
12326d3118J8079k0123K8078K9234J2389n1956k1823J9965J1677J4574J8240J3068
12314B8284j2866l479j1999j9541K2795O865K849j7618k2209J0485K546J5312
12302A424J228j4847k6686j530J5248J9698k257N791j6168K208j3242J9343p751
12289a7541j1160J1395j2879J6233L4693Q768N5R280J9079k235J3640j3256l0650
12276B5422j2355Q033K4542R154N533K2111J5742P93k737k6213j8781o897p209
$$ y = [-16994, -939, 20644, 11598, 2392, -2371, -31, 11163, 3954, 2747, 2521, -15028, 7877, 14908, 18860, 44528, 46616, 33107, 31193, 23994, -6141, -17530, -13992, 15790, 18649, 463, 24254, 36076, 37462, 29235, 25025, -4036, -89, 29604, 37527, 23757, 14045, -16681, -41999, -43118, -25039, -45162, -17084, 12150, 24539, -27417, -49240, -29275, -17598, -3024, 15216, 28284, 15418, 11939, -60, -19601, 3194, 10059, 12908, -4710, -26919, -16434, -13888, 1424, 2652, -12195, -38881, -40411, -25163, -5465, -7722, -1931, -18099, -15891, -29133, -9790, -17541, -28701, -17306, -30185, -13952, 20741, 29509, 29564, 38844, 57923, 55688, 69328, 56072, 25422, 13067, 21100, 45642, 54796, 60329, 82440, 98182, 98975, 96238, 70025, 51244, 44347, 37138]
12263C7138r260k5543n40R038L92J1042J1489j971L393j4430L108j4116j2830
12250c090j2339J5463J6916O130r450p008j047j4183r324J4149j849N751j3680
12237a3561J5243J6901N507k0442m1728j2416m190J5312K629R227M8505M512j7804
12224G695n774J420J3230q404p161L568k0040j783K207l138K8426N8805K7194
12211I6245l7735n8234O123P045k777j3483l691R192j1720l250O311N274j3215
12198a3915n348P501j8621J8371K0906J4024r892q563J413K9394J94M478J40j4490
12184B5592K7264J261P263K1133j0669J3510J5817j8427j6367k637L0854k6382
12172F8212J1014J4994j4334j1100j6052K1160J8515r608j6700l9164j4080J0936
$$ y = [37138, 27878, 2335, 1795, 10833, 11225, 22267, 33756, 31785, 35178, 20748, 23856, 9740, -3090, -15429, 34, 16950, 23080, 13630, 6622, 5575, -8608, -17932, -3783, -5632, 119, -13561, 1682, 18583, 24090, 3648, -38080, -50496, -54686, -39374, -36745, -27518, 20987, 25499, 7695, 1921, 3341, 16571, 8167, 1006, 4574, -15466, -17249, -15042, -18180, 10246, 69051, 96245, 58510, 276, 6399, 13444, 10667, -2816, -6507, 2685, -9035, -12285, -5974, -700, -13915, -19263, -11762, -30383, -12012, 8894, 22918, 13026, 4463, 5876, 35270, 35464, 39942, 40082, 25592, 52856, 54117, 61380, 82513, 71844, 85354, 101171, 82744, 66377, 63740, 94594, 68212, 79226, 94220, 79886, 68786, 52734, 73894, 92409, 82801, 66101, 26937, 12857, 23793]
12160B3793L1570L600k696j474k7586J92J9L885k2621j4913l121J203l444N660
12146e933j456n723J3628K3354k318O283J8838k0902m0958k6538Q313k2307k1160
12133g6879M1551L3710J4932q822j3722j6876j4356R320Q560j1112K3980R789
12121G5j507j5375J582J2027J3652j9733J1113l851K0870L5344j019k7379k7935
12108b136K148m806l0506k50j2740l860l970K3574K5687L325j1284M0593l719
12095B2056o359L2405l685k8126o764Q573j1472k475m17J3002J6089o223P117
12082C3721J0046M758j9645j3618n865j0268J7871k0807k7808n329L2584K1626
12070A7266K957l586Q11J7594j8853l3407k1397M961l593J8552K3874k0489k5664
$$ y = [23793, 55363, 58963, 56267, 54793, 27207, 27399, 27418, 31303, 8682, -6231, -9352, -8149, -11593, -5933, -7389, -13112, 516, 23870, 21552, 27835, 46673, 25771, -15187, -41725, -33412, -55719, -76879, -35328, -1618, 13314, 4492, -9230, -26106, -40462, -31142, -22582, -33694, -9714, 75, -1432, -16807, -15225, -3198, 10454, -9279, 1834, -2017, 18853, 54197, 53178, 25799, -2136, 12, -4794, -35300, -35550, -48290, -52150, -56120, -32546, -6859, -3534, -14818, 25775, 22056, 15697, 48102, 44417, 16291, 9527, 18100, 6628, 4153, 3736, 16738, 32827, 26604, 33721, 43767, 48525, 28880, 15262, 9397, -871, 17000, -3807, -31615, -36944, -4360, 17266, 20223, 16637, 17448, 35042, 16189, -17218, -38615, -33654, -37247, -18695, 5179, -15310, -40974]
12057d0974K037N452K9788m367j1438j9055j1235J7164J8651P658k4827L4324
12045C178k8311p131L733m87J2272R450J2563L956m543K6934q808j2994p059k9702
12031b6949p582k3746m860M0875m76N417L914l226L5343j2408L145j401k827J4445
12017A9664R825J2024o846j317o319n395j7244l1104Q709k8863l800K5309r936
12004c5293q656J7966L941j881J5870l1474R360K3628K788P360K667J2721k0487
11991a490j1142j913n48K629o177k078J24j6747p070K9269K0655M0K353J4597
11977B2502Q408j3854M751J3086M76j8207M474j4006k2541p830Q32N571L590K2795
11963A0047Q042j645J1310j7277l255j1646j7168j4073K3162N3799L2031O091
$$ y = [-40974, -38937, -33485, -3697, -8064, -19502, -38557, -49792, -32628, -13977, -6319, -31146, 3178, -25133, -32264, -28531, -29018, -16746, -7296, 5267, 9223, 4680, 31614, 22806, 9812, 2753, -26949, -34531, -58277, -63137, -22262, -22738, -17321, -13407, -16633, 18710, 6302, 9447, 8046, 5219, 19664, 29489, 41513, 34667, 33350, 27031, 21636, 4392, -26712, -18003, -46866, -50666, -25357, -35293, -43949, -25983, -22042, -23923, -8053, -39527, -30167, -6539, -3751, 3609, 6276, 18997, -1490, -12632, -14545, -15093, -12464, -18641, -20719, -20595, -37342, -44412, -15143, 5512, 5552, 7905, 22502, 30910, 17056, 21807, 34893, 35369, 17162, 21636, 7630, -14911, -22741, -21909, -16338, -12748, 10047, 18089, 16444, 27754, 10477, 7222, -4424, -21592, -35665, -12503, 41296, 73327, 79418]
11951G9418M593J4101r656L2514P2421O9399M2410M6522n834m8793o9544m1363
11939A86188m0257l2038l1398k7733m836j5992k2349J0200K1510j287j2791q956
11927B0261L141m416j3343j8646n047j9808J0826J2587J7576N270K439j707K1189
11914C0322J3607j776R316L0228K015K850L4551N9313Q3837J41645J65410J31705
11902G03023J2798r2628j65693j53270p5470l0687k7329m2597l5805n4115l3220
11891E007J5316k865j0370J6624J5736J7527O502r783K413j4938m084m1868l190
11878g973J1305j5655k7932J3510K8314M121j7448K5937L8596j9784j0441L577
11866B6127J0092M4198O4579N3257N5423L9533p358m5030m9793l1585Q140k1163
$$ y = [79418, 84011, 98112, 88456, 120970, 193391, 262790, 305200, 351722, 345888, 297095, 227551, 186188, 145931, 113893, 82495, 54762, 49926, 33934, 11585, 21785, 43295, 42008, 29217, 20261, 23402, 18986, 5643, -13003, -18050, -37858, -27032, -14445, 3131, 8401, 10840, 9133, 30322, 43929, 42153, 51469, 81697, 83712, 86562, 121113, 180426, 264263, 405908, 571318, 703023, 715821, 623193, 457500, 304230, 228760, 198073, 170744, 128147, 92342, 38227, 5007, 20323, 17458, 7088, 23712, 39448, 56975, 63477, 53694, 56107, 41169, 37085, -4783, -7973, 3332, -12323, -40255, -26745, 1569, 5690, -11758, 14179, 52775, 32991, 22550, 26127, 36219, 80417, 144996, 198253, 253676, 293209, 285851, 240821, 191028, 159443, 167583, 146420]
11854A46420m0055j9902j7867k8577j7359j1362J0385p502O573j1421j0630J9955
11842A8658K4784m310l2818r623L790j5233l1374j5635O277L8356L1195L2281
11830D6348J0218m2178l6714k3324K3595K9204K1028J6332L818q408q653j3733
11818A7533l417n828q508j986L3073l386M733J2314J0844j1983o998m0202O991
11805C180K0320j9328j2994L3740O259N33O360L387J897j7356k725J4701J0591
11792D8565k6391j8360j8385p00q755k1340k7855R717K3800J9861J2139P063j5534
11779a6175k3404M1854L1343j5032o69k8899j8788L3976J2929l052j7478J5153
11767A1758R651j180j1049J0525K5042R671J42K1732k3076k5916L6216J1581j9782
$$ y = [146420, 106365, 86463, 68596, 40019, 22660, 11298, 21683, 14181, 20754, 9333, -1297, 18658, 43442, 39132, 6314, -3309, 481, -14752, -46126, -61761, -55484, -17128, 14067, 46348, 56566, 14388, -22326, -45650, -22055, 7149, 28177, 44509, 48327, 39919, 31266, 17533, 14116, 8288, -220, -2206, 30867, 27481, 32214, 44528, 55372, 43389, 36391, -3811, 3180, 23500, 4172, -8822, 24918, 31177, 31710, 38070, 41457, 43354, 25998, 23273, 37974, 48565, 22174, 3814, -14571, -15271, -24026, -45366, -73221, -63504, -39704, -19843, -7704, -641, -16175, -39579, 2275, 33618, 18586, 17917, -10982, -29770, 4206, 17135, 14083, -3395, 11758, 21409, 20229, 9180, 19705, 44747, 54418, 54560, 76292, 53216, 27300, 63516, 75097, 55315]
11754E5315k9163j4J2047K0563j6648j089k8624p428P686k7662k2470J0133K2216
11741e138K1146M954n889r494K812K2437Q189j0253J2078m778P600l555j0501
11728B9608j700J5993l236j1231N497M888N206o594k0974j5360J973j0150M703
11715a377J8406m801M4412L8694j056n79J3759j8840j1858Q692k4112k2793N368
11702D3915P014n812r52m401N718m271m3326j8974l924M3289m448k0317j2904
11689a9393M971J9945L881L5089k378M53K735k3670l555j171j2667J9985J7071
11676D1296p147R141N203k3036k7573L666J4473j9926N577K5486J0853j2955j5991
11663I067N886Q780J511k1985j221j305j2279K1306K5536Q201O460k6396k1201
$$ y = [55315, 26152, 26138, 38185, 58748, 42100, 41011, 12387, 4959, 12645, -15017, -37487, -27354, -5138, 16008, 20962, 15073, 5579, 8391, 30828, 39017, 28764, 40842, 36064, 43664, 40109, 29608, 27908, 43901, 40665, 29434, 34931, 39819, 45025, 38431, 17457, 2097, 4070, -6080, -1377, 17029, 12228, 56640, 95334, 94278, 93699, 107458, 88618, 76760, 85452, 61340, 38547, 43915, 50929, 45117, 44165, 39764, 45482, 41211, -2115, -21089, -25013, 18276, 13828, -6489, -19393, -14422, 5523, 9404, 44493, 42115, 42568, 45303, 21633, 18078, 16907, 4240, 24225, 41296, 34149, 43290, 48493, 25457, -2116, 1550, 16023, -3903, 1674, 27160, 38013, 25058, 9067, 14953, 23733, 25244, 3259, 2038, 733, -11546, 9760, 35296, 43497, 49957, 23561, 2360]
11650B360k277j1341K2684N1140J9000R552K4187k2715m5280l6081k0633k276
11638a1680L6409J243o868j6942O32J9879j4515j0233k9464q785m628K1920M981
11625a8051L438r104P718j3794J5352p875L2370K640j7578J5996L8595K8157j6118
11612F1746k2124l2554j6578k9651j8719K3341K3499L387J7390Q521O479m683
11600B0054j4759M285j2777q410j4014J3857J0288K2377j2249j9717J1457p983
11588g591j8854l7240Q584L0393l906L1070K1547j4453l349k73K3889J4930J0181
11575E4928M0802R11j7689J8597R520j2614l7890n3340j250j5199r506J6979J691
11562d060J6516j2573J3708J4523j6172M995K2427N464K466k6089j1854j5023
$$ y = [2360, 83, -11258, 11426, 62566, 81566, 91118, 115305, 92590, 47310, 11229, -9404, -11680, 24729, 25972, 19104, 2162, 2794, 22673, 8158, -2075, -31539, -40324, -44952, -23032, -18051, -14613, -23717, -15999, -29793, -14441, -22316, 10054, 12694, -4884, 11112, 49707, 77864, 61746, 39622, 7068, -9510, -39161, -57880, -34539, -11040, -7653, 9737, 18258, 24737, 20054, 5295, 9580, -3197, -11607, -25621, -11764, -1476, 20901, 8652, -11065, 392, -7591, -26445, -63685, -55101, -24708, -28614, 2456, 24003, 9550, 6201, 5928, 29817, 44747, 54928, 95730, 96641, 78952, 97549, 107069, 94455, 56565, 3225, 1975, -13224, -22730, -5751, -4060, 12456, -117, 13591, 28114, 11942, 16937, 39364, 44828, 47294, 21205, 9351, -5672]
11550e672M955P344k0457k1869Q113q926K001r498K4907K0038K6153K5953k8697
11537B4345j4837m179j1030q923P753k704J7656m391M136J0198N907K1973r279
11524C6625k5421J830J2001K8574k3412m760k6884p680K833J073O976J5658j2428
11511D985l275J557J5862Q073M8979O275k2688j9125k417j7595k2793j6069l1543
11498d9774m996L4027K5506p657j086K801M779J8136l1547k7907J5430K3212K4203
11485B5127M481n0894j7436J201o676O543L9998J907Q292n933q57r952L589M319
11471C709q029K5067J3581k7105j3295p071L64l103J6776j941k8942K883J7862
11458i244K8142L898J6164k012n00J3221L3119Q222l5638k9198l5762k3216p860
$$ y = [-5672, -717, 6627, -13830, -35699, -27586, -36512, -34511, -44009, -19102, 936, 27089, 53042, 24345, 9508, 5329, -5701, -14624, -6871, -9575, 8081, 3690, 7826, 18024, 23931, 45904, 36625, 11204, 13034, 25035, 53609, 30197, 25437, -1447, -9127, -6294, -5221, 1755, 17413, 4985, 1710, 3267, 19129, 27202, 76181, 82456, 59768, 40643, 38226, 20631, -2162, -18231, -49774, -54770, -20743, 4763, -2894, -3980, -1179, 3600, 21736, -9811, -37718, -22288, 924, 25127, 29608, -21286, -38722, -37521, -44197, -37654, 2344, 4251, 12543, 6610, 5753, -4199, -610, 3709, -4320, 20747, 34328, 7223, -6072, -13143, -12779, -15882, 894, -1047, -29989, -27106, -9244, 18898, 22796, 38960, 36948, 36448, 49669, 82788, 91010, 55372, 26174, -9588, -32804, -40664]
11445d0664K2536K5421j1530k1524J6037R741o19r65k0625K9369r515k335P592
11432B919j4865n751O442J0434N922o196J586O011m729p760J3495J3485j6867
11419D126m6440n719q004K4924K3399J2791j8190l2044k2514Q233K7327K7863
11407d248K2845j2506l3919j118M978O724M2014K6375j6468J7910P6688M5186
11395A74461M95m96m574q068L260o810n4394j8667j0178k6360l3291j6170N347
11382D555o722N08l668L335k1677k1518m751J6437j099j9885j0230K4961n731
11369d5485R143K2216L6708o284l6103j5624J2357K4144J4928l806J2840J5931
11357D0965K145k2805o470j9683j5251n330K6596m501j3929k506j0582J221K5999
$$ y = [-40664, -18128, 7293, -4237, -25761, -9724, 17, -602, -1567, -22192, 7177, -2338, -4673, 2919, -11946, -17697, -11255, -821, 5101, -1095, 491, 6502, 1773, -5987, 7508, 20993, 4126, -42314, -48033, -56037, -31113, -7714, 5077, -13113, -45157, -67671, -59438, -32111, -4248, 18597, 6091, -27828, -28946, -23968, -17244, 24770, 51145, 34677, 52587, 129275, 174461, 174956, 174460, 169886, 161818, 165078, 158268, 103874, 85207, 75029, 48669, 15378, -792, 4555, -2167, -1659, -5327, -1992, -23669, -45187, -49938, -33501, -34600, -54485, -64715, -39754, -45485, -36342, -14126, 22582, 16298, -19805, -35429, -23072, 1072, 16000, 12194, 25034, 40965, 43110, 20305, 13835, -5848, -21099, -26429, 167, -4334, -18263, -20769, -31351, -30130, -4131]
11344d131L0655J1078o1j2906j4952l2574j1148J443J3122K0255l052n894J1267
11331C102l8677q920J5251L4547J0889j798k0463j4034j7683k0749O788J7138
11319c4609L1066P954k7371j2995J6255j2204j3456K7805K5311m193J5669j3694
11307E538l3663M487K512j9664L412L1158P636n79O271P130n04j8256K8580R835
11293C3893j4474L074R631J4626o100K0543j2786j4952N970l8393L814J4675j9269
11280B52l409L892j706L952L4390J3895k7613k2641k0327K172L751K1775L6824
11267D5207m9166l0232L9566K734K4362J013N845O574j7940j2205j1316J0964
11255A5406M991p826j2896n131q586o457L2058P261R265j825j5160J1985J3101
$$ y = [-4131, 26524, 37602, 37541, 24635, 9683, -22891, -34039, -32596, -19474, 781, -2271, -8165, 3102, -35575, -44495, -29244, 5303, 16192, 14394, -6069, -20103, -37786, -58535, -51747, -34609, -3543, 4411, -22960, -35955, -19700, -31904, -45360, -17555, 7756, 3563, 19232, 5538, -28125, -23638, -21126, -40790, -37378, -6220, 1416, 837, 7108, 14238, 13734, -4522, 24058, 33893, 19419, 22493, 32124, 46750, 40650, 61193, 48407, 33455, 39425, 1032, 4846, 19521, 252, -3157, 735, -971, 2981, 37371, 51266, 23653, 1012, -19315, -17143, -13392, 8383, 45207, -3959, -34191, 5375, 8109, 32471, 33484, 39329, 45903, 27963, 15758, 4442, 15406, 20397, 12571, -325, -5456, -14042, -20499, 11559, 18820, 28085, 26260, 11100, 23085, 36186]
11242C6186q496r011M834j5987J317l761j8989Q246J4259J2459j4683k1893l6235
11229e1754P719J6967r03o01L4028K6222k894q979k8689P149M096O248J7921J1559
11215C8089l452k358k5272J2822k086j6287P149Q755o244j2384P923J8245J8281
11202D3181j9526l402P514j8242K467N55M114N723J1294j1298l104L522n83r745
11188A2470l6038o007l228O087n682q074n412J0943k766j1811m218K2772O07O342
11174b4015N550K9881j3913J5890K1434O868j9972n885K0054J075J546j0765j4980
11161A2768l6726N541O752r209p494K7101N353j2992l66L724J6774j5727J2541
11148H040J4928K473K3055j38k5602L047m210O602n957j2356k790J3855o416m93
$$ y = [36186, 27690, 18679, 23513, 7526, 8843, 5082, -13907, -5661, 8598, 21057, 6374, -15519, -51754, -44035, -27068, -27971, -28572, 5456, 31678, 28784, 19805, -8884, -1735, 2361, 8609, 26530, 38089, 34637, 32279, 7007, 19829, 17743, 1456, 8605, 17360, 11116, -1268, 6655, 24900, 43181, 23655, 20253, 27767, 9525, 11992, 12547, 16661, 22384, 33678, 22380, 19276, 22798, 22215, 12470, -23568, -29575, -32803, -26716, -32398, -40472, -45884, -34941, -37707, -49518, -53736, -30964, -30357, -24015, -18465, 11416, -2497, 13393, 34827, 41695, 21723, 15838, 35892, 36967, 38513, 27748, 12768, -23958, -18417, -11665, -20874, -28368, -1267, 4086, -8906, -9272, -5548, 11226, -4501, 8040, 22968, 25441, 48496, 48358, 22756, 25803, 21593, 28195, 22238, 9882, 7092, 20947, 14531, 14038]
11134A4038J2099R670j3363q149K3237N0983k6643k9204k3767j2460J8906J3085
11122B8432K2523J768R164j4634l6196k0153M316L4903Q425k0687K5328l746J8531
11109E7974Q835K3440k1254j4503j5726M171n894J0885J9598l532q252k2437n762
11096B7543j0650p885J0147J1903K3580k073j2389J440n56R867K536j6492j9953
11083A7018K606K0415o765k6897j015j0778R427p12k6230j2480K850L1546J1298
11070A0283j1671M9281M578l2215j4447J9198K0705j0241L603L207j7685L191
11058B7787n886J3145J3489O263j9012p587K4175j547k1403P144o910r75P645
11045C6328J84j7786j8357J0615L688L981l206j0563k545J8873q697J0571J8224
$$ y = [14038, 26137, 35807, 22444, 14295, 37532, 88515, 61872, 32668, 8901, -3559, 15347, 28432, 50955, 52723, 61887, 47253, 11057, -9096, -4780, 30123, 38548, 17861, 43189, 39443, 57974, 66809, 90249, 68995, 54492, 38766, 42937, 37043, 47928, 67526, 63994, 55742, 33305, 27543, 16893, 9008, 19155, 31058, 54638, 52565, 40176, 41616, 41060, 50927, 53463, 36971, 17018, 19624, 40039, 33274, 6377, 5362, -5416, 4011, 3299, -22931, -35411, -32561, -1015, 10283, -1388, 47893, 52471, 20256, 5809, 25007, 45712, 35471, 39074, 42281, 24596, 27787, 21901, 35046, 48535, 54798, 35786, 28199, 52374, 50827, 29424, 36568, 29658, 28683, 36328, 36512, 18726, 369, 10984, 14672, 18653, 15447, 4884, 2339, 21212, 12515, 23086, 41310]
11032D1310k087j0180k3966N726M3742k8671j5896j1521j3180J1454M4566j668
11020C9629j3872o518K2106l647k4799p145J7236j41N124K964m855J7316j0737
11007C2661l8483J395j2649J9852L437K2095M367l235j1293l3293P972J2242L205
10994H273J3152r670j7547N901K1848j5176P413r800k5789J7343j015Q117L6611
10981C9661j4901k6508m486Q690J6457J2673j3071j8484L0994j2269Q45P562K6848
10968E4011j5702m7062n143K0868r130j0800K0704K0010K423K002J4659j341J4589
10955F0088J5294J1864k6922k6363l044J0070J8760M370p256r917k2179k2455
10943B310L3131K2913p695j8124o847J6344l54j442J2114K5676K2018K1206m898
$$ y = [41310, 39223, 29043, 5077, 10803, 54545, 25874, 9978, -1543, -14723, -3269, 41297, 39629, 25757, 19239, 41345, 37698, 12899, 5754, 22990, 22849, 27973, 30937, 26082, 43398, 32661, -5822, -4427, -17076, 2776, 6213, 28308, 32675, 29440, 18147, -15146, -7174, 5068, 8273, 21425, 11755, -5792, 109, 21957, 6781, 14194, 4394, -21395, -4052, -5067, 3050, 39661, 24760, -1748, -6234, 2456, 18913, 31586, 18515, 31, 31025, 18756, 19601, 27163, 54011, 38309, -8753, -13896, 6972, -2158, -12958, 7746, 27756, 30179, 32181, 46840, 45499, 60088, 75382, 87246, 60324, 33961, 30917, 40987, 59747, 64117, 56861, 46944, 24765, 2310, 35441, 58354, 50659, 32535, 25688, 42032, 41678, 40236, 52350, 78026, 100044, 121250, 116352]
10930A16352j3085k2324J2617l0291N69K7913n922j8904r768m358k1025Q296J3573
10917E3643N458m069K569K2023M427P995j5865k8913j5149J8080J4834R238j5664
10904E8607j0197k97j049p348j0155K579K7665L754k1272j1140l023J9272j5841
10891C1555Q974Q38P146n390k8919r732J7363o080n189l3067K7136K4717j088
10878B8264p976P468L5517q298Q353O818j9405r015j3650J947J6768L746r430
10865D1107J4644J568P408k1135k9157j4266L0996K9466j2876m206N103J6799
10853F5451R733J055K189N854j4773j5277J3212k8269k2142k9720o256j2779r050
10840d0772L3048M1201Q780Q843L435j3989k139Q810K886J7670J8658Q910N365
$$ y = [116352, 103267, 80943, 93560, 63269, 63838, 91751, 85829, 66925, 57157, 52799, 31774, 40070, 53643, 59101, 55032, 57601, 79624, 84051, 92046, 76181, 47268, 32119, 50199, 65033, 74271, 58607, 48410, 48113, 47064, 39716, 29561, 32140, 59805, 63559, 42287, 31147, 28124, 47396, 31555, 40529, 41367, 48513, 43123, 14204, 4472, 21835, 15755, 10566, -22501, 4635, 29352, 28264, 20288, 27756, 63273, 54975, 63328, 70146, 50741, 41726, 28076, 30023, 46791, 50537, 41107, 55751, 57319, 64727, 43592, 14435, 169, 31165, 60631, 47755, 43549, 48652, 65451, 75184, 76239, 78428, 84282, 69509, 54232, 67444, 39175, 17033, -12687, -18943, -31722, -40772, -7724, 33477, 42257, 51100, 54535, 40546, 38407, 47217, 50103, 67773, 86431, 95341, 100706]
10827A00706j7351l4906J860K075j3244j1923P925j2601j6631L5915M515KP544
10814E3886j268j4199L6467Q360l6133j0910J9225K3290M749j6343k1005k986
10802D3133Q335k1068J5640K5516j2536p500J1517K779n541k0584J6797K8103
10790H4591J4206k5499Q401q669l731j9962m0405J643N4124J0604K2675K0965
10778A18943k1609n001j5646L5536J6137j0938k4950K73m7N752p788k4777J1712
10765G7597R545O273K0999p893m499L084n479l2778L111P558N79k988P243J4992
10751I7344j4522j2735K6157K6295j6185j4374m898j6946J2324J6524J7732k8216
10739H8500R426j1006j4894J5309J1963K0237j4083m0510o390K5824o18l2366
$$ y = [100706, 83355, 48449, 50309, 52384, 39140, 27217, 35142, 22541, 5910, 41825, 46340, 46342, 53886, 52618, 38419, 74886, 83246, 47113, 36203, 55428, 78718, 83467, 67124, 46119, 43133, 51468, 30400, 46040, 71556, 59020, 51520, 63037, 65816, 60275, 39691, 56488, 84591, 98797, 73298, 81699, 73030, 69299, 49337, 8932, 10575, 64699, 75303, 97978, 118943, 97334, 92333, 76687, 112223, 128360, 117422, 92472, 92745, 92698, 98450, 90662, 65885, 77597, 87142, 93415, 114414, 106521, 102022, 105106, 99627, 66849, 69960, 77518, 78097, 75109, 82352, 97344, 82822, 70087, 96244, 122539, 106354, 91980, 87082, 70136, 82460, 98984, 116716, 88500, 97926, 86920, 72026, 87335, 99298, 119535, 105452, 64942, 58552, 84376, 83758, 51392]
10727E1392L0069N5430J2830k4852q865O04j1058M206k020n082P313J0980l437
10714A17510K7699M2181k9942m6168k7806k2064j406M1337J5934k5030k3393K8303
10702I7155J5281r748J3O408k6259q0L2825J8006m5597m217M7110N149n114j9993
10688A10939l416l730O306q258m632J127R636J0367J0298k0548J8081O271j1774
10675A20667j025m260j699j5722J2701K1087r663j2195j3498k1080M201L2581
10663A12095p533j5927J8747M0973j8963O432l005j3973k7580j635K8323J11J0849
10650A28914J1781j4159J1229j801j2980n935k0450K0094j1121l3853o063J0847
10638G6503K3468O69J934L2373L3116r16J3162J1066j1741k3338j2328j600j8224
$$ y = [51392, 81461, 136891, 149721, 124869, 116004, 116608, 105550, 109756, 107736, 102654, 109967, 120947, 117510, 145209, 187390, 157448, 111280, 83474, 61410, 60004, 101341, 117275, 92245, 68852, 97155, 112436, 102688, 102701, 109109, 82850, 82770, 115595, 133601, 88004, 83787, 130897, 136046, 130932, 110939, 107523, 103793, 110099, 101841, 97209, 98336, 107972, 118339, 128637, 108089, 126170, 132441, 120667, 119642, 115382, 113683, 97961, 110662, 131749, 122086, 109891, 96393, 75313, 79514, 112095, 104562, 88635, 107382, 148355, 129392, 135824, 132819, 118846, 91266, 89631, 117954, 118065, 128914, 140695, 126536, 137765, 135964, 122984, 117049, 96599, 116693, 105572, 71719, 65656, 76503, 99971, 100640, 102574, 134947, 168063, 167147, 180309, 191375, 179634, 156296, 143968, 142368, 124144]
10625A24144J9887M1972n097Q151r022k5953J162J1146L065p106k5979p170K1874
10612A51074J1515j0454k2450l2921J6090J9831j6059j6359O750R106P358L8349
10600A61830Q037O754l7196K075p858J2373J7870m044L219Q01j340Q525J2286
10587A83332j5964Q011O235k5536j5246M220j497K935M504L7860O548k9609j2680
10574A53113K5659K4453J6397l5379l0771K1901R54m776j0106P369L897j4709
10562A58002J463Q332j9766j355L395P864K8817J6940j1002q984k4330j4056J4568
10549A59888L5410K2031J056p968k6872j4579J879M3161J8372M705m008j0959
10537B22116j6895J2055J8903J10r906j627K8326J9571k6196j2346n910L990J6968
$$ y = [124144, 144031, 186003, 180906, 189057, 180035, 154082, 155244, 166390, 169455, 162349, 136370, 129200, 151074, 162589, 152135, 129685, 96764, 112854, 132685, 116626, 100267, 107017, 116123, 123481, 161830, 169867, 176621, 139425, 141500, 133642, 146015, 163885, 159841, 163060, 163861, 162521, 171046, 183332, 167368, 175379, 181614, 156078, 140832, 145052, 143555, 146490, 150994, 188854, 195402, 165793, 153113, 178772, 203225, 219622, 184243, 153472, 175373, 176327, 171551, 161445, 168814, 172711, 158002, 159465, 167797, 148031, 146676, 150071, 157935, 186752, 203692, 192690, 183706, 159376, 145320, 159888, 195298, 217329, 218385, 210417, 183545, 168966, 170845, 214006, 232378, 237083, 233075, 222116, 205221, 217276, 236179, 236289, 226383, 224756, 253082, 272653, 246457, 234111, 228201, 232191, 249159]
10524B49159m11J9500l8613J7611K9052j8686k1576j6009j3935O821L4326K5280
10512B72519k1153j9422P909k611K784P932m293j7555L430L6594J6746J3318j5638
10499B80560J473j8252r853q728R259o029q150P864r18m77j5044k9908J9465L3665
10485B54927K6669j2687r718J0144q980k723L2899Q088K8507q578l4116j8640
10473B65792k9992k6143N430P015N1309J7640j1339J0534j07J5307Q063k867k4392
10460B86250j2504J1187J315P188J261J224O851P774Q330K3394N1934K1238j424
10447D14018J6467N2808O3891M8193q414k5246j2095J3674J0135k730j2090l9558
10435E19053n5844o9925m1630k0690M132K4127j4451J75j6123J2148K5117J0621
$$ y = [249159, 248748, 268248, 229635, 247246, 276298, 257612, 236036, 220027, 206092, 212913, 247239, 272519, 251366, 231944, 239853, 237242, 240026, 247958, 243665, 226110, 229540, 266134, 282880, 296198, 280560, 282033, 263781, 253928, 245200, 254459, 248430, 240280, 248144, 247226, 246749, 231705, 201797, 221262, 254927, 281596, 268909, 259191, 269335, 260355, 257632, 290531, 298619, 327126, 318548, 284432, 265792, 235800, 209657, 215087, 222102, 273411, 291051, 279712, 290246, 290139, 305446, 313509, 310642, 286250, 273746, 284933, 286248, 293436, 294697, 295921, 302772, 310546, 318876, 342270, 394204, 415442, 414018, 430485, 483293, 547184, 595377, 586963, 561717, 549622, 563296, 573431, 570701, 558611, 519053, 463209, 393284, 351654, 330964, 335096, 359223, 344772, 344947, 328824, 340972, 366089, 376710]
10423C76710o414K5202j4682k5165J4925Q60k1393l3265J2717J9707k499k3838
10411C22865m980J7043j3422K8291J0340O894k2157o143O6j0522k9728L9415M0830
10398C78792L0858r230k8694Q3J4851J807j5074p123L924N260k420J2694k9322
10385C56406m9165L0393L8588J388k0098J468J3015J1462j8932o270J4672J2557
10373C85484J8295K6239K0675L892l4741j7289k9200k2590L967J8226L0371J0331
10361D13660l3912J2933j4972k612J5128K4325L4529k6395l7519Q129M1644J5254
10349D50192j0381R57q636k1745l2215j425K3186Q87K2152K0895m293l772O544
10336D42346K6910J3725J4569m6079l8753k4424N309l95J0097o634r63J0532K6998
$$ y = [376710, 370296, 395498, 380816, 355651, 370576, 371436, 350043, 316778, 329495, 349202, 346703, 322865, 317885, 334928, 321506, 349797, 360137, 367031, 344874, 338731, 338797, 328275, 298547, 337962, 378792, 409650, 400420, 371726, 371809, 386660, 388467, 373393, 366270, 370194, 375454, 373034, 385728, 356406, 307241, 337634, 376222, 377610, 357512, 358980, 371995, 383457, 364525, 358255, 372927, 385484, 403779, 430018, 450693, 454585, 419844, 402555, 373355, 350765, 354732, 372958, 403329, 413660, 379748, 392681, 377709, 375097, 390225, 414550, 449079, 422684, 385165, 393294, 434938, 450192, 439811, 440768, 432132, 410387, 378172, 376747, 399933, 400820, 422972, 443867, 439574, 435802, 442346, 469256, 482981, 497550, 451471, 412718, 388294, 393603, 393208, 403305, 396671, 395708, 406240, 433238]
10323D33238P030O82k5800J679J4133K3616J0801m024l1450j6054L4037J162j9920
10310D29130J8047K6938j4800j1462j7235J136K7915j2918k3878J4481K1871l645
10298D55580L048j6133j8949O778j660L027j3013k1895N770L684J081n293p506
10285C94519Q011Q297o559K2313J056J2448J5223L3772m787k3338j78J9463n38
10272D79702r242J002l09l7714j4632p184l022N958j8072P954O850M882P012K0570
10258D43755Q334L0831M215K8731K8614J8558J4500P794j712j1815o1563n1154
10246D59088M931o659l637l6423l765K929q049J5625P362l7449J550j3426L931
10233C86008L048J4220n669j0712j1005J2270J079K1049K1741j7111J7877K8256
$$ y = [433238, 440268, 440950, 415150, 416829, 430962, 454578, 465379, 461355, 429905, 413851, 447888, 449050, 429130, 447177, 474115, 459315, 447853, 430618, 431754, 459669, 446751, 422873, 437354, 459225, 455580, 458628, 442495, 423546, 430324, 428664, 431691, 418678, 396783, 402553, 406237, 407318, 402025, 394519, 402530, 410827, 404268, 426581, 427637, 440085, 455308, 489080, 484293, 460955, 460777, 480240, 479702, 470460, 471462, 471153, 433439, 418807, 411623, 408601, 414559, 396487, 404441, 411291, 416173, 423185, 443755, 452089, 482920, 487135, 515866, 544480, 563038, 577538, 585332, 583620, 571805, 510242, 459088, 464019, 457360, 453723, 417300, 413535, 416464, 408415, 424040, 431402, 393953, 395503, 382077, 386008, 389056, 403276, 397607, 386895, 375890, 388160, 389239, 410288, 432029, 414918, 432795, 461051]
10221D61051K0185K4256L5316L8894L5214O3378Q6185M4482M2373M8715M7462
10210I47511Q897l234n9646o7038p2561o6926m1835n0072m2465l3014k8292k1662
10198D69663J0766k5437n7286m5198q25K6912m231j4015K1950o885k777M533k3886
10185C53284j7942m236j9198o848P329L2046J8756J1222J039N48K2626P29l4212
10172C65143j2847p436j3302l889N887l724j6258o72n845r89j2917j8240J8042
10159B92953K2030J0490p253l405K7005J0730M884J6228o13j9682r273q859j4752
10146C20483K579L556L1257j6842m2554n010j23Q240L915L73L696M19k057j4584
10132B93348k2563q777j6276J2895K0316n267J424J6137K1447J4692J0300K4348
$$ y = [461051, 481236, 505492, 540808, 579702, 614916, 678294, 764479, 808961, 851334, 900049, 947511, 956408, 953174, 893528, 826490, 753929, 687003, 645168, 595096, 552631, 519617, 491325, 469663, 480429, 454992, 397706, 352508, 351683, 378595, 374364, 360349, 382299, 375414, 372637, 377170, 353284, 335342, 331106, 311908, 305060, 312389, 344435, 363191, 374413, 375452, 376000, 398626, 399355, 365143, 352296, 344860, 331558, 327669, 333556, 329832, 313574, 312902, 307057, 306068, 293151, 274911, 292953, 314983, 325473, 318220, 314815, 341820, 352550, 357434, 373662, 373049, 353367, 344094, 335235, 320483, 323062, 326618, 357875, 341033, 298479, 293469, 293346, 301586, 305501, 305874, 309570, 309989, 307932, 293348, 270785, 262008, 245732, 258627, 278943, 273676, 275100, 291237, 312684, 327376, 337676, 362024]
10120C62024J3455j7515o495l8837P394J2791J1183O7806N0219L0714M9069J22383
10108F64191J69472K10868J77623J52962R0581k3374j19911j41177j21461j17919
10098I41855r7837j15258j12694o5626o1318j6849q277J5888k3364k3091p754
10087D25675j594o595j0385k3580l9923j3897r586K959j6061K090j4265j3321
10075B81517k1954j6404l896J1684R464r609L213k554J0334j7801m3047j7752
10063A83195J0076J4299q93m92J1312j8777K7754N382k0675k603K611J057j7905
10050A94341l4309j8012K1639J0351L1892o09k4466l4900L1251K2220k7295K047
10038A74150J7155N992k7491j0065o03j4553J04j2279P936J6181J2805j3146j3591
$$ y = [362024, 375479, 357964, 351469, 312632, 320026, 332817, 344000, 411806, 462025, 492739, 541808, 664191, 833663, 1044531, 1222154, 1375116, 1465697, 1442323, 1322412, 1181235, 1059774, 941855, 844018, 728760, 616066, 550440, 489122, 472273, 463996, 479884, 456520, 433429, 425675, 424081, 417486, 407101, 383521, 343598, 329701, 320115, 323074, 307013, 309103, 294838, 281517, 259563, 243159, 239263, 250947, 260411, 250802, 254015, 251461, 261795, 243994, 200947, 183195, 193271, 207570, 206677, 206185, 217497, 198720, 226474, 231856, 211181, 208578, 211189, 212246, 194341, 160032, 142020, 163659, 174010, 205902, 205293, 180827, 145927, 177178, 199398, 172103, 174150, 191305, 197297, 169806, 159741, 159138, 144585, 144689, 132410, 140346, 156527, 169332, 156186, 142595]
10025A42595O702l630j7124j2527J2794L026R405J3883r168m4020M309M0204Q192
10012A54641l169R510j582n785K0792o312j1691j4196q401j8996K5857N0555M526
9999A95749j6435l7262M244L4597R910j0476l915K534j0178J7549j5416j8506
9987A52395K4788N5j9952N347J2521K5035r624P782j6835o765J0106k9123j8696
9974A37034p180k736j1940J5985L1249k4754m4289J907K2020L769p105j0984J3297
9961A16273K3388R844k5494p667J9520K766k0842N613k5813J1138J0861J5689
9949A35276p843L035K2437K0050p304l0454j7669J1960p337k9830r918K3394K1980
9936A27777o248M658m939q552j2145k3958j2385M331R130Q92k0398J7079P190
$$ y = [142595, 149297, 145667, 128543, 116016, 128810, 131836, 141241, 155124, 145956, 101936, 106245, 146449, 154641, 151472, 160982, 159400, 153615, 174407, 168095, 156404, 142208, 133807, 114811, 140668, 191223, 195749, 179314, 142052, 146296, 180893, 190803, 180327, 176412, 178946, 168768, 186317, 170901, 152395, 177183, 177238, 157286, 162633, 175154, 200189, 190565, 198347, 181512, 174747, 184853, 155730, 137034, 129854, 127118, 115178, 131163, 162412, 137658, 93369, 95276, 117296, 121065, 113960, 102976, 116273, 139661, 149505, 124011, 116344, 135864, 138630, 117788, 123401, 97588, 108726, 119587, 135276, 127433, 130468, 152905, 172955, 165651, 135197, 117528, 129488, 122151, 92321, 82403, 105797, 127777, 121529, 126187, 121248, 112696, 100551, 76593, 64208, 68539, 77669, 78561, 58163, 75242, 82432]
9923H2432r379N082Q555J5392K0418P013o402L29K7982l309j7537N644m846J76
9909A31550k2219R434L070J9058k2268j8529l3214k2279M986K3929J4153Q352
9897I6023J6873K7204k522n222J1162j5477j8033j1806n39j8143j709O591k0911
9884F3491j5444M717J3732Q220J1472Q148j3108j4468J5759K6540J4023n394N672
9871A23360j5197j4034K2563K6696M0365O867k7288r855k8888P798K8464N655
9859A66506K3499k1043q177j6589l1672j5546l759k5223M2185K4704j6745k8526
9847H9614j4870j3395j5740N546k0423k1273L588m178j334N624L2297J8104j4897
9834D8663J4088J6648J0629o095r911K159o823k3723j313K9082N6152M198n0694
$$ y = [82432, 73053, 78135, 86690, 102082, 122500, 129513, 123111, 123440, 151422, 148113, 130576, 136220, 131374, 131550, 109331, 118765, 121835, 140893, 118625, 100096, 66882, 44603, 49589, 73518, 87671, 96023, 112896, 140100, 137578, 132356, 143518, 128041, 110008, 98202, 97663, 79520, 77811, 84402, 63491, 48047, 52764, 66496, 74716, 86188, 94336, 81228, 66760, 82519, 109059, 123082, 117688, 123360, 108163, 94129, 116692, 143388, 183753, 190620, 163332, 153477, 124589, 132387, 160851, 166506, 190005, 168962, 160785, 144196, 112524, 96978, 93219, 67996, 110181, 134885, 118140, 89614, 74744, 61349, 45609, 51155, 30732, 9459, 13047, 8869, 7535, 13159, 45456, 63560, 48663, 62751, 79399, 90028, 83933, 74022, 76181, 69358, 45635, 44322, 73404, 129556, 133754, 83060]
9821H3060k8051J0228k842J8106J3075K041j785j2999O721L3398M772k01L0837
9808A56360j8797m5502j3431k3223R679R056j5505n11K8737J5061j6191l9890
9796D5843l477J5500J9700r08l1941j8413J3145j2389J0005J2727K9865j788q928
9783F8941J7449q310l3553q602l117J5085J2035P449Q301J3407J8033Q462n841
9770A09739k1108j2976j279j9868p494K0792j0422p969k8563q558J113Q567N769
9757B7743O879l224o860p980j499j4851M622J1157k273J4079r571J19K3764j8845
9743B3260K363J6390Q335p018k1548K9828N446j7675P586j0577j2685j0488j1780
9730A437K1872J7184M905J7029k0167M490J6901n590l8864j905k103J6118k3053
$$ y = [83060, 55009, 65237, 62395, 80501, 93576, 95617, 93832, 80833, 87554, 120952, 125724, 125523, 156360, 137563, 92061, 78630, 55407, 65086, 74142, 58637, 58126, 86863, 101924, 85733, 45843, 42366, 57866, 77566, 76658, 44717, 26304, 39449, 27060, 37065, 49792, 79657, 77869, 68941, 86390, 78080, 44527, 35925, 32808, 47893, 59928, 67377, 75678, 89085, 107118, 115580, 109739, 88631, 75655, 74376, 54508, 47014, 67806, 57384, 49415, 20852, 12294, 13407, 21974, 27743, 34622, 31398, 24538, 16558, 15059, 208, 4830, 15987, 13714, 27793, 18222, 18341, 42105, 23260, 25623, 42013, 50348, 43330, 21782, 51610, 57056, 39381, 46967, 36390, 23705, 13217, 1437, 23309, 40493, 45398, 62427, 42260, 46750, 63651, 58061, 19197, 17292, 15189, 31307, 8254]
9717H254k8695m854K0695M9847M830n725q818j7200q984K4024L991j3422j9373
9704D570L0630L4900k142k091Q821j0369k8954j9461j3589R609m159J1355J4091
9691C3211j8171J6294K3523J7361j9467l6563J5572l501j1091n19p286j304m88
9678G571K318P524J7666L456k6652J6222K0801L302K247n174L090j9722P862J1370
9664E1881j05j1603n821j4541J7929k873l468R815R128p2N25k1051k5828r098
9650e182p793K3724J7885J6610L7045k7268K1293m028k0538P905j9682q593J951
9637C3329K527k394k3822r765n13K6644J5002j143l8266l5460j2238O449J9310
9624b0340J6238L936j4068K2672J7970r508M908M304j7861M43m86N671J2652J6658
$$ y = [8254, -20441, -25295, -4600, 45247, 50077, 44352, 35534, 18334, 9350, 33374, 37365, 23943, 4570, 35200, 70100, 67958, 65867, 74688, 64319, 35365, 15904, 2315, 11924, 7765, 19120, 33211, 15040, 31334, 54857, 72218, 52751, 16188, 31760, 28259, 17168, 16649, 9363, 8059, 7571, 9889, 17413, 35079, 38535, 11883, 28105, 48906, 52208, 54455, 49281, 52371, 32649, 40511, 51881, 51776, 40173, 34352, 19811, 37740, 34867, 31399, 41214, 50342, 50270, 50795, 29744, 3916, -5182, -12975, 10749, 28634, 45244, 82289, 55021, 76314, 72286, 51748, 59653, 39971, 31378, 33329, 35856, 33462, 9640, -125, -638, 26006, 41008, 39865, 1599, -33861, -46099, -39650, -20340, -4102, -166, -14234, 8438, 26408, 16900, 21808, 26112, 8251, 8694, 8208, 13879, 26531, 43189]
9610D3189L3327k3541l8895j6206j8100J2343J0147R85N466j7002j764J4862j0661
9597e850l773Q597l1823j4852K3020K0861J6459j8366P460O515n554J5914N302
9584B3910M175q942k5819k6660J9061P681j5800J2009M4952K429o4896P622K5024
9571D746P795O468K8271k2866j3723k1855j282O085L5078J9420j190j4229k0775
9558A1943n168K2398K2275k7895J96K6164K1518n597j0129j1863l5457j7802j3950
9545b3367m878R586J3876R042o046L007R438M163K5596O975j4006J564j6354M974
9531B3570j1188l4004j3130j302K9269J7824k5271p154k992J038j5639k683J7144
9518b4518L092K341J2852Q519l399l0619j0937p95l0661q530M0856J6978N583
$$ y = [43189, 76516, 52975, 14080, -2126, -20226, -7883, 2264, 3249, 8715, -8287, -10051, 4811, -5850, -9623, -1026, -32849, -47701, -24681, -3820, 12639, -5727, 1733, 8248, 2694, 18608, 23910, 28085, 19143, -6676, -33336, -14275, -6594, -22394, -10385, 34567, 36996, -27900, -20278, 4746, 12541, 19009, 47280, 24414, 10691, -11164, -12446, -6361, 28717, 48137, 46947, 32718, 11943, 6775, 29173, 51448, 23553, 23749, 49913, 71431, 65834, 55705, 43842, 8385, -9417, -23367, -28245, -18659, -4783, 4259, -1787, 1220, 10658, 14821, 40417, 47392, 33386, 34950, 18596, 23570, 12382, -21622, -34752, -36054, -6785, 11039, -14232, -21386, -24378, -23340, -38979, -41662, -24518, -21426, -19085, -6233, 2286, -1113, -31732, -42669, -43464, -74125, -82655, -41799, -24821, -19238]
9505a9238R74q265n651k98J5196J1593R365j3873j8594k109J8860K5364j0181
9492C143J3056L1532j384n080k1421p063J6252j6954p992J7770K5219Q287j1881
9479D3484l3871j2111l2805o685J76M5261K7359n761j1874j0845J1508R149l493
9466A9492k7877j4881L268J3913K5646j2725r470n470K5052K4249j2617k9448
9454h68m429j3896j0088J6411N367Q042p586J018J6553p250k1673J9572J0649
9441A1822J9904l17j121J1242m207N652j5088m0612M225j257M655K1234J1947
9428B8079J2969k581j969o788J86j142j1765l8484j0439K2325J4337p654J0074
9415G148N465J3061J723p63J9250L0329L0709j6413k2426m465l747k1112J3958
$$ y = [-19238, -18264, -26529, -32180, -32478, -17282, -5689, 3676, -10197, -28791, -30900, -12040, 13324, 3143, 16199, 47731, 46347, 41267, 19846, 12783, 29035, 12081, 4089, 21859, 47078, 55365, 43484, 9613, -2498, -35303, -41988, -41812, 3449, 30808, 25047, 13173, 2328, 13836, 22985, 19492, -8385, -23266, -19998, -6085, 19561, 6836, -2634, -8104, 16948, 41197, 28580, -868, -5297, -19193, -29281, -12870, -7503, 539, -7047, -6029, 10524, 3274, -18399, 1173, 11822, 31726, 31409, 30288, 41530, 37323, 42975, 27887, -12725, -8500, -9757, -5102, 16132, 28079, 41048, 38467, 36498, 29710, 29896, 28754, 16989, -21495, -31934, -9609, 4728, -2926, 7148, 12613, 25674, 27397, 26634, 45884, 76213, 106922, 90509, 68083, 63618, 59871, 38759, 52717]
9402E2717m27J012J1249o245r852j1871K7990j0897m3519l427P109J422j3563
9389A698r671J5987J6912j4883J2746K9749j4289j4118j0554J598k568p193K4792
9376C0206K4768j4292k8281k3329K1255J2650j7184p325J9265j113m55J4556N10
9363C1231j24k5277l0080J757J3858K1380J4117K5035j2242J154r552m2155Q260
9350b638O058j4752j4783J6807M5103R613k7190j5684l800R267K6959l063m3397
9337a1500J974K4259Q849j8632R610J1049l683k0872j1527J9940Q741l1645q993
9324b2430J602m331J1296j1302j6550j0127L0255m89r219R046K3972K2082k1163
9311B642p595K1249J5937j7810m980L834J832J4985J4648j3324l1596l4923M068
$$ y = [52717, 52290, 53302, 64551, 58306, 48454, 36583, 64573, 53676, 10157, 6730, 13839, 15261, 1698, -7973, 8014, 24926, 10043, 22789, 52538, 38249, 24131, 13577, 15175, 12607, 5414, 30206, 54974, 40682, 12401, -10928, 10327, 22977, 5793, -1532, 17733, 16620, 16165, 30721, 31231, 31107, 5830, -24250, -22493, -8635, 12745, 26862, 51897, 39655, 40809, 31257, -10898, -2638, 3420, -11332, -26115, -9308, 35795, 45408, 18218, 2534, -1266, 8001, 34960, 31897, -11500, -9526, 14733, 23582, 4950, 14560, 25609, 21926, 1054, -10473, 9467, 18208, -13437, -22430, -20828, -25159, -13863, -25165, -41715, -51842, -21587, -22076, -31295, -22249, 1723, 23805, 2642, -4953, 16296, 32233, 14423, 9443, 13277, 15109, 30094, 44742, 31418, -178, -35101, -31033]
9298c1033n831n404J411M2665J8414j4204k2287k8823k228p169J7749J0728Q220
9285a7792J8055J0779K3473J3553q87l296J510l2048J4598N458j1911j7983J6003
9272A9512N982M712P318l77q182K4964L0369Q779j4912j8906j2563k1176k6683
9259a163O029K0459j3398j5029k5461J4934K3569j3314R125o03M389J2837n779
9246A6595k3518K8374P635k9888l1610K6558M3118J132p542o241j5983K958J5455
9233B7043K1770j1938r336k6965K1708L4548j5849j1291q740P130O653j6915j0969
9220F849J1768J4769k6372k6543k2877R523L412J1334K2922N782L0035L6639j0966
9207F6275r623J1190k7214o286r250j2577N11J3715O342n449k1177m1496J9121
$$ y = [-31033, -36864, -42268, -40857, 1808, 20222, 6018, -16269, -45092, -47320, -54489, -36740, -26012, -17792, 263, 11042, 34515, 48068, 47181, 43885, 45395, 13347, 27945, 33403, 21492, 3509, 19512, 25494, 30206, 37524, 37147, 28965, 53929, 84298, 93077, 78165, 59259, 46696, 25520, -1163, 4866, 25325, 11927, -3102, -28563, -13629, 9940, -3374, 5751, 5148, 9537, 22374, 16595, -6923, 21451, 29086, -802, -32412, -5854, 37264, 38396, 30854, 24613, 8630, 11588, 27043, 48813, 36875, 27539, 574, 22282, 56830, 40981, 29690, 20950, 28080, 34733, 17818, 6849, 18617, 33386, 7014, -19529, -42406, -32883, -29471, -18137, 4785, 10567, 40602, 77241, 66275, 56652, 67842, 40628, 34342, 25092, 12515, 13026, 26741, 33083, 27634, 6457, -35039, -15918]
9194a5918J4278k8056P145R491L3109K0937K587r582l660k447K77l0841j8734
9181b1414k474N116K063P036R450j3017Q694k339m242l114K6598q076J4646K3027
9167D1954N791l8010j3626n273R31n810q131L6720r58k6440N701l359k0051j0730
9153d1291k157M484K0294J8066M3119L18k5865l2193J5383k615j5048q171l907
9140b9583K6979K8482q604k344l4761J0051K476J7400K081k1802j646O816j3470
9127a7925L250J6562k2584j7756K1642J0969J5388J995j1310R220K5040n626J7010
9114D5875j0454j5432l5355k7195K2788K2805j186J4957K2069rr777R716J9690
9101E8492K086p002N003j2040j0209o943J6263J4151j3861k4095j6697J3294P386
$$ y = [-15918, -1640, -29696, -22551, -13060, 20049, 40986, 43573, 33991, 30331, 27884, 28161, -2680, -21414, -23888, -18772, -16709, -9673, -223, -13240, -4546, -6885, -11127, -14241, 12357, 4281, 18927, 41954, 47745, 9735, -3891, -9164, -8233, -14043, -22174, 14546, 13588, -12852, -7151, -10510, -30561, -41291, -43448, -38964, -18670, -604, 42515, 42833, 16968, -15225, 158, -2457, -17505, -25676, -29583, -2604, 25878, 17274, 14930, -19831, -9780, -7304, 10096, 12177, -9625, -11271, -4455, -17925, -14675, 1887, -20697, -38453, -16811, -5842, 9546, 11541, 231, 9451, 34491, 28865, 45875, 35421, 19989, -15366, -42561, -19773, 3032, 1846, 16803, 38872, 38863, 29086, 38802, 58492, 60578, 53576, 58579, 46539, 36330, 29387, 45650, 59801, 45940, 21845, 5148, 18442, 25828]
9088B5828L491J399M205m416o975K98j7617k558K0182K2217K1287k8252j6628
9075B2461j4096j0263K125J3912K6334j9152J2059L0671J0495j3987K247j5556
9063D7250M232r926J324Q924o691L4352M0823J4918j3953J1426M7318J6072k3673
9050A72396j7116m3360j929k3116j2620k5454J4102K22L1556K9464j1678j8107
9038I4360J1318J7706q559l3081J0159K8788j7077o90k9561j3530J2527J569K4309
9025I8238K6112j3734j7802O550n924J4274K681p107r517j6399o774l556J8808
9012H5850K4282j3921m840J4835L1069K2182o237K3092J5492j7655l5773M341
9000A42717p024J2037k6502j2163q106j5721j7488j234J0632J2233l1328k1754
$$ y = [25828, 29319, 30718, 34923, 30507, 23532, 23830, 6213, 3655, 23837, 46054, 67341, 39089, 22461, 8365, -1898, 227, 14139, 40473, 21321, 33380, 64051, 74546, 60559, 62806, 47250, 51482, 41556, 42880, 51804, 45113, 79465, 120288, 135206, 121253, 132679, 179997, 196069, 172396, 155280, 111920, 109991, 86875, 74255, 48801, 62903, 63125, 94681, 124145, 112467, 94360, 105678, 123384, 114825, 81744, 91903, 120691, 103614, 102924, 73363, 59833, 72360, 73929, 98238, 124350, 110616, 92814, 99364, 93440, 107714, 110395, 103288, 93771, 77372, 70598, 67042, 85850, 110132, 96211, 91371, 106206, 137275, 159457, 153220, 176312, 191804, 174149, 138376, 142717, 135693, 147730, 121228, 109065, 100959, 85238, 67750, 66516, 77148, 89381, 58053, 36299]
8988C6299m562K3275J1223j0164n558J5075j266j1558k9342Q526J6866J4091K699
8975F5604K0087j2967k7996K7684L992K5K4414L48l0999r553M447K4836M574p651
8961H6845j1520L734o733J689j1302k141J242J6349j3931Q695L4214j7374l2821
8948E6946k3200l081P680K0700n170q517J8849K7698P038q424j4725k8311k5211
8935B2272J1272l686l115K2810R842m456j3957m302n724R608L265l3308J810N687
8921A8018K8557J7557J659j7814N04j451j182j3758k1106J1775J5106m245j4662
8908A8958K0016k6818k1075J8215j7514j7403n977L1423M7352n600k764l165m0746
8895e098K195N64j1338j3311K2362L8956N806o650m7696r738q804j903M6494K8086
$$ y = [36299, 31737, 55012, 66235, 56071, 50513, 65588, 64322, 52764, 23422, 31948, 48814, 62905, 65604, 85691, 72724, 44728, 72412, 76404, 76429, 100843, 101191, 70192, 60639, 65086, 89922, 94496, 86845, 75325, 79059, 72326, 74015, 62713, 60572, 61814, 78163, 64232, 72927, 107141, 89767, 56946, 33746, 30665, 38345, 59045, 53875, 45358, 64207, 91905, 98943, 90519, 75794, 47483, 22272, 33544, 29858, 26743, 49553, 59395, 54939, 40982, 36680, 30956, 40564, 43829, 10521, 12331, 18018, 46575, 64132, 65791, 47977, 48481, 47030, 45848, 32090, 10984, 22759, 37865, 33620, 18958, 38974, 12156, -8919, 9296, -8218, -25621, -31598, -175, 47177, 41577, 38813, 35648, -5098, -2903, -2339, -13677, -26988, -4626, 34330, 40136, 33486, -14210, -23948, -32752, -34655, 11839, 39925]
8881C9925k8863j6911j4213R323K4155J2597k321p1k3253M10J5088o863P522K7687
8867D4212k3641l1499o003K8155k454k7009M192j5065j7783R648r983j4338M5231
8854a6337L5425j3327l131j4026J1062K6886N729k6513m8014j3673P418L3019
8842a5482L7848j6507L235J1808k0801o810L953K3665k9547J0827J6456k468m103
$$ y = [39925, 11062, -5849, -20062, -10739, 13416, 26013, 23692, 23621, 368, 778, 15866, 9003, 16525, 44212, 20571, -10928, -16931, 11224, 8770, -18239, -14047, -29112, -46895, -37247, -47230, -61568, -16337, 19088, 5761, 2630, -11396, -334, 26552, 32281, 5768, -42246, -55919, -48501, -15482, 22366, 5859, 9094, 20902, 101, -6709, -2756, 20909, -8638, 2189, 18645, 16177, 12074]
$$ [...]
##END NTUPLES=NMR SPECTRUM
##END=
