##TITLE=Analysis number 317687
Compound Code cc 43309
Book Reference 414/188/2
Project Code adrs
Chemist Name mattw
##JCAMPDX= 6.0         $$ Bruker NMR JCAMP-DX V2.0
##DATA TYPE= NMR SPECTRUM
##DATA CLASS= NTUPLES
##ORIGIN= Bruker BioSpin GmbH
##OWNER= nmr
$$ XWIN-NMR		Version 3.5
$$ Wed Mar  1 08:47:33 2006 GMT Standard Time (UT+0h)  MAYBRIDGE\nmr@NMR_250MHZ
##.OBSERVE FREQUENCY= 250.131544655141
##.OBSERVE NUCLEUS= ^1H
##.ACQUISITION MODE= SIMULTANEOUS (DQD)
##.ACQUISITION SCHEME= undefined
##.AVERAGES= 16
##.DIGITISER RES= 18
##SPECTROMETER/DATA SYSTEM= dpx250
##.PULSE SEQUENCE= zg30
##.SOLVENT NAME= CDCl3
##.SHIFT REFERENCE= (INTERNAL, CDCl3, 0, 16.522)
##AUDIT TRAIL= $$ (NUMBER, WHEN, WHO, WHERE, WHAT)
$$ ##TITLE= Audit trail, XWIN-NMR		Version 3.5
$$ ##JCAMPDX= 5.01
$$ ##ORIGIN= Bruker BioSpin GmbH
$$ ##OWNER= nmr
$$ C:\u/data/dgb/nmr/ADRS/17140/pdata/1/auditp.txt
$$ ##AUDIT TRAIL=  $$ (NUMBER, WHEN, WHO, WHERE, WHAT)
(   1,<2006-03-01 08:46:36.65 +000>,<MAYBRIDGE\nmr>,<NMR_250MHZ>,
      <created by zg, POWCHK disabled, PULCHK disabled
       configuration hash MD5:
       84 BC 41 DB A1 6E 1D 46 DA 25 12 A5 C1 ED C5 3A
       data hash MD5: 64K
       B4 44 94 9B 2B 95 2B 44 5A 90 3E 2B 67 AA 2A 8E>)
(   2,<2006-03-01 08:47:01.69 +000>,<MAYBRIDGE\nmr>,<NMR_250MHZ>,
      <Start of raw data processing
       ef LB = 0.3 FT_mod = 6 PKNL = 1 SI = 32K 
       data hash MD5: 32K
       48 99 1A 7B 81 73 65 89 8B 95 1B 3F DB 62 5A 96>)
(   3,<2006-03-01 08:47:05.34 +000>,<MAYBRIDGE\nmr>,<NMR_250MHZ>,
      <apk 
       data hash MD5: 32K
       83 A6 CD DC 85 5A B4 ED A0 37 29 70 74 C7 89 D8>)
(   4,<2006-03-01 08:47:07.09 +000>,<MAYBRIDGE\nmr>,<NMR_250MHZ>,
      <abs ABSG = 5 
       data hash MD5: 32K
       78 BE 41 2D D0 B4 72 DD 69 6D D1 F9 5D 02 AE E8>)
$$ ##END=
$$ 
$$ hash MD5
$$ 6B BA 44 A5 3C 8A 72 2A E0 8D A4 F1 A7 5F 38 D1
##$RELAX= 
##$RELAX= 
##$RELAX= 
##$RELAX= 
##$RELAX= 
##$RELAX= 
##$RELAX= 
$$ Bruker specific parameters
$$ --------------------------
##$DU= <C:\u>
##$EXPNO= 17140
##$NAME= <ADRS>
##$PROCNO= 1
##$TYPE= <nmr>
##$USER= <dgb>
##$AMP= (0..31)
100 100 100 100 100 100 100 100 100 100 100 100 100 100 100 100 100 100 
100 100 100 100 100 100 100 100 100 100 100 100 100 100 
##$AQSEQ= 0
##$AQ_mod= 3
##$AUNM= <au_zg>
##$AUTOPOS= <4 >
##$BF1= 250.13
##$BF2= 250.13
##$BF3= 250.13
##$BF4= 250.13
##$BF5= 500.13
##$BF6= 500.13
##$BF7= 500.13
##$BF8= 500.13
##$BYTORDA= 1
##$CFDGTYP= 0
##$CFRGTYP= 5
##$CHEMSTR= <none>
##$CNST= (0..31)
1 1 145 1 1 1 1 1 1 1 1 1 1 1 1 1 1 1 1 1 1 1 1 1 1 1 1 1 1 1 1 1 
##$CPDPRG= <>
##$CPDPRG1= <>
##$CPDPRG2= <>
##$CPDPRG3= <>
##$CPDPRG4= <mlev>
##$CPDPRG5= <mlev>
##$CPDPRG6= <mlev>
##$CPDPRG7= <mlev>
##$CPDPRG8= <mlev>
##$CPDPRGB= <>
##$CPDPRGT= <>
##$D= (0..31)
0 1 0 0 0 0 0 0 0 0.06 0 0 0 0 0 0 0.0002 0 0 0 0 0 0 0 0 0 0 0 0 0 0 
0 
##$DATE= 1141202793
##$DBL= (0..7)
120 120 120 120 120 120 120 120 
##$DBP= (0..7)
150 150 150 150 150 150 150 150 
##$DBP07= 0
##$DBPNAM0= <>
##$DBPNAM1= <>
$$ [...]
##$SUBNAM7= <"">
##$SUBNAM8= <"">
##$SUBNAM9= <"">
##$SW= 20.6930455092707
##$SWIBOX= (0..15)
0 0 3 0 0 0 0 0 0 0 0 0 0 0 0 0 
##$SW_h= 5175.983436853
##$TD= 65536
##$TD0= 1
##$TE= 293.16
##$TE2= 300
##$TE3= 300
##$TEG= 300
##$TL= (0..7)
0 120 120 120 120 120 120 120 
##$TP= (0..7)
150 150 150 150 150 150 150 150 
##$TP07= 0
##$TPNAME0= <>
##$TPNAME1= <>
##$TPNAME2= <>
##$TPNAME3= <>
##$TPNAME4= <>
##$TPNAME5= <>
##$TPNAME6= <>
##$TPNAME7= <>
##$TPOAL= (0..7)
0.5 0.5 0.5 0.5 0.5 0.5 0.5 0.5 
##$TPOFFS= (0..7)
0 0 0 0 0 0 0 0 
##$TUNHIN= 0
##$TUNHOUT= 0
##$TUNXOUT= 0
##$USERA1= <user>
##$USERA2= <user>
##$USERA3= <user>
##$USERA4= <user>
##$USERA5= <user>
##$V9= 5
##$VALIST= <valist>
##$VCLIST= <CCCCCCCCCCCCCCC>
##$VD= 0
##$VDLIST= <DDDDDDDDDDDDDDD>
##$VPLIST= <PPPPPPPPPPPPPPP>
##$VTLIST= <TTTTTTTTTTTTTTT>
##$WBST= 1024
##$WBSW= 4
##$XGAIN= (0..3)
0 0 0 0 
##$XL= 0
##$YL= 0
##$YMAX_a= 432593
##$YMIN_a= -556578
##$ZGOPTNS= <>
##$ZL1= 120
##$ZL2= 120
##$ZL3= 120
##$ZL4= 120
##$ABSF1= 16.522
##$ABSF2= -4.171173
##$ABSG= 5
##$ABSL= 3
##$ALPHA= 0
##$AQORDER= 0
##$ASSFAC= 0
##$ASSFACI= 0
##$ASSFACX= 0
##$ASSWID= 0
##$AUNMP= <proc_1d>
##$AZFE= 0.1
##$AZFW= 0.1
##$BCFW= 0
##$BC_mod= 0
##$BYTORDP= 0
##$COROFFS= 0
##$CY= 12.5
##$DATMOD= 1
##$DC= 0
##$DFILT= <>
##$DTYPP= 0
##$F1P= 14.0000005364418
##$F2P= -0.99999901652339
##$FCOR= 0.5
##$FTSIZE= 32768
##$FT_mod= 6
##$GAMMA= 0
##$GB= 0
##$INTBC= 1
##$INTSCL= 1
##$ISEN= 128
##$LB= 0.3
##$LEV0= 0
##$LPBIN= 0
##$MAXI= 10000
##$MC2= 0
##$MEAN= 0
##$ME_mod= 0
##$MI= 0
##$NCOEF= 0
##$NC_proc= -4
##$NLEV= 6
##$NOISF1= 0
##$NOISF2= 0
##$NSP= 0
##$NTH_PI= 0
##$NZP= 0
##$OFFSET= 16.522
##$PC= 1
##$PHC0= -108.7074
##$PHC1= -2.080498
##$PH_mod= 1
##$PKNL= yes
##$PPARMOD= 0
##$PSCAL= 4
##$PSIGN= 0
##$REVERSE= no
##$SF= 250.13
##$SI= 32768
##$SIGF1= 0
##$SIGF2= 0
##$SINO= 400
##$SIOLD= 32768
##$SREGLST= <1H.CDCl3>
##$SSB= 0
##$STSI= 32768
##$STSR= 0
##$SW_p= 5175.98343685301
##$SYMM= 0
##$S_DEV= 0
##$TDeff= 65536
##$TDoff= 0
##$TI= <Analysis number 999999
Compound Code 99
Book Reference 9
Project Code 9>
##$TILT= no
##$TM1= 0
##$TM2= 0
##$TOPLEV= 0
##$USERP1= <user>
##$USERP2= <user>
##$USERP3= <user>
##$USERP4= <user>
##$USERP5= <user>
##$WDW= 1
##$XDIM= 32768
##$YMAX_p= 326371075
##$YMIN_p= -312095
$$ End of Bruker specific parameters
$$ ---------------------------------
##NTUPLES= NMR SPECTRUM
##VAR_NAME=  FREQUENCY,     SPECTRUM/REAL,   SPECTRUM/IMAG
##SYMBOL=    X,             R,               I
##VAR_TYPE=  INDEPENDENT,   DEPENDENT,       DEPENDENT
##VAR_FORM=  AFFN,          ASDF,            ASDF
##VAR_DIM=   32768,         32768,           32768
##UNITS=     HZ,            ARBITRARY UNITS, ARBITRARY UNITS
##FACTOR=    0.157963299565203, 1,           1
##FIRST=     4132.6476996994, 0,             0
##LAST=      -1043.33573715361, 0,           0
##MIN=       -1043.33573715361, -312095,     0
##MAX=       4132.6476996994, 326371075,     0
$$ Real data points
##PAGE= N=1
##DATA TABLE= (X++(R..R)), XYDATA
$$ [...]
20059A5302Q961l6013K5296l3397j8344J0464Q82M7174M048l2366j1414n0715
20047g0122l6766R223K776J3181L9322M3400L3157k5781m0679M0332j5471k0223
20035b7651K4555J4747Q527Q58P748j4830L8349J10897J4938l2790r9801j9373
20023B6174J1414k9152m9081Q2260P4748j1017o418L0435j9969k7238J4621k1741
20011G5036n4269m8714O3847J2111k5690L1187j5006n173M4167j9525o2786M4079
19999C9264K7346p3020k3686j0089p945O9998O2767K9951n069p6477r8132J6578
19987d8514J523K3022N5968K0345j6914L3226N0302p8782r9743O0803P6377n486
19975G2127n9711m3123J0869l3696l5351N357J0368J05606p8969n9718O7400k2953
$$ plain form
20059 15302 24263 -11750 13546 -19851 -38195 -27731 -26849 20325 24373 -7993 -19407 -70122
20047 -70122 -106888 -97665 -94889 -81708 -42386 1014 34171 8390 -32289 8043 -7428 -27651
20035 -27651 -3096 11651 20178 21036 28784 13954 52303 163200 178138 145348 45547 26174
20023 26174 37588 8436 -40645 41615 116363 105346 98928 129363 109394 82156 96777 75036
20011 75036 20767 -27947 35900 48011 22321 53508 38502 33329 77496 57971 -4815 39264
19999 39264 66610 -6410 -30096 -40185 -48130 21868 84635 114586 109517 33040 -65092 -48514
19987 -48514 -46991 -23969 31999 52344 35430 68656 118958 40176 -59567 1236 77613 72127
19975 72127 12416 -30707 -19838 -53534 -88885 -83528 -73160 32446 -46523 -106241 -38841 -61794
19963f1794m0834k1147M8524K4140J729P3557L1374p1763j2155L7170k1433j6074
19951b8706R564J9257l788M5559m0621K175P7695P261R316k2933m6513j27002
19939i8736n3750N1927R5546O5942J1910J1146k9214m3449o2049r4706O198L6060
19927a03175M1802K1268K6487m8464m5698j2959L8113M8848O8158J1401n6578
19916a0797o4563J9053O8966N7465n805j6081J4753k2735p483L47J0412M0199
19904H3731j10035o3114o018O4123p1495K6954j7933j9033K8626O5756M2657j7678
19892F541O637K9855l8759o0002K2912M4698Q0481K991p380k056q6366j7483n604
19879b3535m0345K4575K2218K3656M4230j8368L4283K7822j2661L1843K1200q424
$$ plain form
19963 -61794 -102628 -123775 -75251 -51111 -49382 24175 55549 -16214 -28369 8801 -12632 -28706
19951 -28706 -19142 115 -3673 41886 1265 3440 81135 88396 97712 74779 28266 -98736
19939 -98736 -152486 -100559 -5013 60929 72839 83985 54771 11322 -50727 -145433 -139235 -103175
19927 -103175 -61373 -40105 -13618 -62082 -107780 -120739 -82626 -33778 34380 45781 -10797
19916 -10797 -75360 -56307 12659 70124 64319 48238 62991 40256 32773 33120 43532 83731
19904 83731 -26304 -89418 -95436 -31313 -102808 -75854 -93787 -112820 -84194 -18438 24219 6541
19892 6541 13178 43033 4274 -55728 -32816 11882 92363 95354 87974 85918 -448 -17931 -23535
19879 -23535 -63880 -39305 -17087 6569 50799 32431 66714 94536 81875 113718 134918 126494
19867A26494o396q572m5862p1801J9602R315j2916J1145j4345p3298o4813j7605
19855a49052K8530K4300O4898j50R4265M3094j51367o0940J13823N440k5736r617
19843b2512O7445RP226J0745l7978l1564j6072K5487J0555Q1014K1646o9232m9350
19830b581K0391M7225j845m0158O0502j8095j6906j5466q63K2101o8896k9082
19818d3673L8019J7169o6567j171P8432M6673q1337j15822j9271O2411N6707N1053
19806B2623n1473k5732r757p263L9615Q870j2465M1701K3350P6551P2764J0406
19794A89190l217n5118j3941j511k199N5957k3749j7122L1254p4911r5402k6272
19782c7041L7681k2962l3685k2025L2076L0120O3352J1623q469p6453L4294l5909
$$ plain form
19867 126494 120098 111526 65664 -6137 13465 22780 9864 21009 6664 -66634 -131447 -149052
19855 -149052 -120522 -96222 -31324 -31474 62791 105885 -45482 -106422 7401 12841 -12895 -22512
19843 -22512 44933 44942 52168 62913 24935 -6629 -22701 2786 13341 94355 116001 46769 -2581
19830 -2581 17810 65035 63190 23032 83534 65439 48533 33067 32204 54305 -14591 -43673
19818 -43673 -5654 11515 -55052 -56223 22209 68882 -12455 -128277 -147548 -85137 -28430 22623
19806 22623 -28850 -54582 -64339 -71602 -31987 -23117 -35582 6119 29469 106020 178784 189190
19794 189190 185973 130855 116914 115403 113204 169161 145412 128290 159544 84633 -10769 -37041
19782 -37041 640 -22322 -56007 -78032 -45956 -15836 47516 59139 50670 -25783 8511 -27398
19770b7398M2166m1964l4841J5999r139M8689q151L3699q457m2450j517J2390
19758b0974K9910K1713L0403K5944K9315j124k997q0543m078R545q4647j0928
19746e8461l248K3901m293j6235J5212L0626L7723R282l7039L574m5567J2286
19734c2239R8249M4940K3427N2392J40q2194p9691k8627j5664L8874l828J096
19722A6875L39o2454L1844O0308K090P8649M0050p3831n9811o3071o73L4772J9831
19709B4918k5416k3519j3270L1008N427J726N6662k6687p1946L748J5508M4259
19697B2418m3453o8401j4639M449Q6342N4711N178o3329p2635M3013M6354j9300
19685a9292K6316m812o2185K2469R2527J2239L5840k5734j0517l3558p4450k7206
$$ plain form
19770 -27398 14768 -27196 -62037 -46038 -55177 -6488 -14639 19060 10603 -31847 -33364 -20974
19758 -20974 8936 30649 61052 86996 116311 115187 112190 31647 27569 37114 -47533 -58461
19746 -58461 -61709 -37808 -42101 -58336 -43124 -12498 25225 34507 -2532 1042 -44525 -32239
19734 -32239 66010 110950 134377 186769 186909 104715 25024 -3603 -19267 19607 15779 16875
19722 16875 17214 -45240 -13396 46912 49002 127651 167701 93870 34059 -29012 -29685 5087 24918
19709 24918 -498 -24017 -37287 -6279 -852 874 57536 30849 -41097 -37349 -21841 22418
19697 22418 -21035 -89436 -104075 -99626 -13284 41427 46605 -16724 -89359 -46346 8 -19292
19685 -19292 7024 2212 -59973 -37504 55023 67262 103102 77368 66851 33293 -41157 -68363
19673f8363n94J3350j9574L6065O0119j2881N952k2802o594j3409N3720P4233
19661I9222K9455L825o781k137k3578k2784q5815o9409M790M6987L2198K2150
19649B8123O6056k6185N583o3793N6941N5866K1361K556m7487k2190L5054K2366
19637A34251K8247o9392j1540P394O087l9357j24641k960p913l2157O0761K0956
19625c0264P920J825j4586N6913K073l3492K4736M7208j3083n9804L5018k5548
19613a084j7470J2750M183K4742K3784o1713j2817L4509Q8038m022Q102K6852
19601A25854j1652l2710L4567n453q0874l7821J9437K8968m7101r2104L689M4070
19589e1130R5539l4947k4617J2513L7082o374L3545N2669q290l4938o0740R759
$$ plain form
19673 -68363 -68957 -55607 -75181 -39116 21003 8122 14074 -8728 -15322 -28731 24989 99222
19661 99222 128677 132502 125721 123584 100006 77222 -8593 -78002 -73212 -26225 5973 28123
19649 28123 94179 67994 73577 9784 66725 122591 143952 146508 99021 76831 111885 134251
19637 134251 162498 93106 81566 88960 95047 55690 -68951 -71911 -79824 -111981 -51220 -30264
19625 -30264 -22344 -20519 -35105 21808 23881 -9611 15125 62333 49250 -10554 24464 -1084
19613 -1084 -18554 -5804 -1621 23121 46905 -14808 -27625 6884 94922 90900 99002 125854
19601 125854 114202 81492 116059 110606 29732 -8089 11348 40316 -6785 -98889 -95200 -51130
19589 -51130 44409 9462 -15155 -2642 34440 28066 61611 114280 105990 71052 10312 20071
19577B0071K4788n3623m9399p345Q7858N4678k4154p3700k6768P3761R8931k6768
19565I8330q4099m0817N1695Q5193j6130r2406j3501K6320N8243l3015q9932k5308
19553g5427P295P9529L2837l2272N5006J4383Q078k4171j5564o9952K9728n2261
19541d2791m7374r1N3054k6321q103N599k5926m2859J39390J16443k0635n6993
19529D3393q064j1416o4513j0433M1556M0086L2221l9384n5372q1646m6747Q2839
19517g7480N3465N3181P9749m9427k8678K6740J4023L999j4279l8976j3509p0628
19505f1820l2343M0809P0904P8079K8303n5322m4383N75n1409R758n5210o1523
19493a33582L3278J8512K6183K4014l3136O0530R9802m0802p5483n2752J5248
$$ plain form
19577 20071 44859 -8764 -58163 -65508 22350 77028 52874 -20826 -47594 26167 125098 98330
19565 98330 14231 -26586 25109 110302 94172 1766 -11735 14585 72828 39813 -50119 -75427
19553 -75427 -68132 11397 44234 11962 66968 81351 89429 65258 49694 -20258 9470 -42791
19541 -42791 -90165 -90256 -37202 -63523 -71626 -66027 -91953 -134812 4578 121021 100386 43393
19529 43393 35329 23913 -40600 -51033 -9477 30609 62830 23446 -31926 -113572 -160319 -77480
19517 -77480 -24015 29166 108915 59488 30810 57550 71573 75572 61293 22317 8808 -61820
19505 -61820 -94163 -53354 17550 95629 123932 68610 24227 24802 -26607 -16849 -72059 -133582
19493 -133582 -100304 -81792 -55609 -31595 -64731 -4201 95601 54799 -20684 -73436 -58188
19482e8188O1735K5414m3461l9322P4187J5257L3728j4750o4805K0960l4651k9183
19470e3079N8000M9237j8714L9144K0475j2985k1784j415p1391K1212J24912k7058
19458A06554o3996n6974J8458l5008p6013R7697M8947J0705L7902Q226J4069m2269
19446F8298r3165o4089L2935q369l3109N1441o656j2640K4167K245N4736L4011
19434D9805P355L9275j3895m7769m742L4520J643l0073o3299m4554r532R6659
19422A5393P483n9576M3354R847K8325k2009K4748m272R3522N3975k4841k1032
19410A44917p1420J3993M7432o4984p7013k6787L1308n3062q749P2240L2274J4962
19398E5111m6296m540k3286K1692N815Q1658M7219m4526j03877n9030K6797k3047
$$ plain form
19482 -58188 3547 28961 -14500 -53822 20365 35622 69350 54600 -10205 10755 -23896 -53079
19470 -53079 4921 54158 35444 74588 95063 82078 60294 58879 -12512 8700 133612 106554
19458 106554 42558 -14416 4042 -30966 -106979 -9282 39665 50370 88272 96498 110567 68298
19446 68298 -24867 -88956 -56021 -64390 -97499 -46058 -52714 -65354 -41187 -38942 15794 49805
19434 49805 57160 96435 82540 34771 30029 64549 66192 36119 -27180 -71734 -81266 15393
19422 15393 22876 -36700 6654 16501 44826 22817 47565 43293 136815 190790 165949 144917
19410 144917 73497 87490 134922 69938 -7075 -33862 -2554 -55616 -64365 7875 40149 55111
19398 55111 8815 4275 -19011 2681 8496 90154 137373 92847 -11030 -70060 -43263 -66310
19386f6310m191N9116M8498L3905j9814n2815o029M4896J8912m7039J6146Q9902
19374A15177m258m3002K2669J6105q078m2203n0573j02050L0554Q5400l0509k420
19362a3188R2951L6325m0367m0157O7428L0923J8703p0846q3029L3523J2227k0746
19350B3747Q741K880p39m4184P1913J4772l3636K6417L1133p382q3974o1494r082
19337f0888O6354p06n248l8330l1366J952K9002J3892K8975M6463n713n5243J7465
19324F609M7526m1499K6249L3085r3471k6086M3139k0178l7215J1245K2519M2745
19312A4668m002L0480l046j0023k8133j6556L6528M957k7324J2829l5331N7086
19300C2133O2827R062K4028j1394l7130J7852j7082l0742l7272m3130j9675J8398
$$ plain form
19386 -66310 -70501 -11385 37113 71018 51204 -1611 -7640 37256 56168 9129 25275 115177
19374 115177 110919 67917 90586 106691 98613 56410 5837 -96213 -65659 19741 -10768 -13188
19362 -13188 79763 116088 75721 35564 102992 133915 152618 81772 -1257 32266 44493 23747
19350 23747 32488 35368 34629 -9555 62358 77130 43494 69911 101044 93662 9688 -51806 -60888
19337 -60888 5466 4760 -488 -38818 -70184 -68232 -39230 -25338 3637 50100 44387 -10856 6609
19324 6609 54135 12636 38885 71970 -21501 -47587 -4448 -24626 -61841 -50596 -28077 14668
19312 14668 10666 41146 38100 28077 -56 -16612 19916 24873 -2451 10378 -24953 32133
19300 32133 94960 104022 128050 116656 79526 97378 80296 49554 12282 -30848 -50523 -32125
19288c2125K4287j229M1172M7284K5826J8714p4685q7O668k9669L5375j1169n5816
19275e454k4044O6063J03753L4462n775n2564K3720q656j29868o495L5240M2718
19263G3100k0525N078K1570J9561J8485o5014n2699K3796k734m5884q653L3295
19251f24L5773L0933j6725M9506j0679n0226K716O9674l599m3170m099J6330k1346
19238E4464r3748J5682P0473L9394k477K9392K0642L3357p3068l4562j1376L45
19226D8518k3165n2777P845J6246J91o3323M1431j7497K895M4946M6117L3920
19214H5347M29L2711Q040l2810J2865n611o0897M105O4026j3393l6247Q18l0938
19201B8445o9013M0181J2086p173M5794P0181k8668L699p6794j1988p2352l4149
$$ plain form
19288 -32125 -7838 -9067 32105 79389 105215 123929 49244 49157 55825 26156 61531 50362 -5454
19275 -5454 -29498 36565 140318 174780 169005 116441 140161 131505 1637 -4858 30382 73100
19263 73100 52575 57653 79223 98784 117269 52255 -444 23352 20618 -25266 -33919 -624
19251 -624 35149 66082 49357 98863 88184 37958 40674 110348 106749 63579 59480 75810 54464
19238 54464 -39284 -23602 46871 86265 83788 113180 133822 167179 94111 59549 48173 48518
19226 48518 25353 -27424 -19579 -3333 -3142 -66465 -25034 -42531 -39636 5310 51427 85347
19214 85347 85776 118487 126527 93717 106582 100971 40074 44179 108205 94812 58565 59383 28445
19201 28445 -40568 -387 11699 4526 50320 120501 91833 95532 18738 6750 -65602 -99751
19189i9751L5570J01099P1957K5238j0055m7912N176k7030L1122j457m1577o5420
19177b3040L566L3101N8092K2922m5649n8078k0933L7997k5871L0224J1756L1873
19165E5960J2721k396K3763K6836K5443k0625k7592r3393j7296r570K2647N8891
19153E5389N7144L9441P68L1048m0158n9793M6462K1022n2436l9016Q618N3537
19141A22026p719L2081k4166m5273L462N6182O6565n3741j04929l4299O7678L5880
19129A13747q766N842q5136N0182L8721M3503l805N8008L0995L1052j5464N4297
19117C13176O7381P8110N9455n458M1275O9972J3931l0329k4857J9097R1862J6566
19105G10181K5893o1800n0513r0635p1491j14894q447N6978l0603o2523p2638
$$ plain form
19189 -99751 -64181 36918 108875 134113 124058 76146 81322 54292 85414 83957 42380 -23040
19177 -23040 -19474 13627 71719 94641 48992 -9086 -30019 7978 -17893 12331 24087 55960
19165 55960 68681 66285 90048 116884 142327 121702 94110 717 -16579 -26149 -3502 55389
19153 55389 112533 151974 152742 183790 143632 83839 130301 151323 98887 59871 68489 122026
19141 122026 114307 146388 122222 76949 80411 136593 203158 149417 44488 10189 77867 113747
19129 113747 104981 110823 25687 75869 114590 158093 154288 212296 243291 274343 258879 313176
19117 313176 380557 458667 518122 512664 553939 623911 637842 607513 582656 601753 693615 710181
19105 710181 736074 674274 623761 533126 461635 346741 338294 395272 364669 302146 229508
19094B29508K1937l3569m2474k5877M007J9837O967o1575k4846l5870Q3529L3283
19082A74857o306j01863q9031K3302K4917M1686n9423m2539O3277K5979J4832
19071F9688J8835l8034L39Q0256p241m9336j7215p295n1871L323l0770J13J1883
19058a7325N1024O3572q0188k0333L3892N9718N9785l3169m7073o5927J279k8231
19046b2976n128L5385K4010K0723O779l0311l4779K4082K1857l1422j335O8418
19034G5303M1074j8262l3091j3165P5235m2051l7935P7923P4197j0266O565l3300
19022A62227j7269O2449P2873J0384k9368k8449Q53r2718q5357n8321L0503j723
19010B6084n387K090N3507q995N1162k6724q4821p190J199K8745J5560J0893j6876
$$ plain form
19094 229508 251445 217876 175402 149525 153532 173369 180336 118761 93915 58045 141574 174857
19082 174857 168551 66688 -22343 959 25876 67562 8139 -34400 28877 54856 69688
19071 69688 88523 50489 50828 131084 123843 74507 57292 49997 -1874 1449 -29321 -29208 -17325
19058 -17325 33699 97271 17083 -3250 30642 90360 150145 116976 69903 3976 5255 -22976
19046 -22976 -28104 7281 31291 52014 58793 28482 -6297 17785 39642 8220 6885 75303
19034 75303 116377 98115 65024 51859 127094 85043 47108 125031 199228 188962 195527 162227
19022 162227 144958 207407 280280 290664 261296 232847 233700 140982 55625 -2696 27807 26084
19010 26084 20697 22787 76294 67299 118461 91737 6916 -274 925 29670 45230 56123 39247
18997C9247M8990J4121j0313O8495P0145m6802j00144k6621K0472P918r952L7948
18985A13504Q07l019J6936j6582k4138k7711N107J7520K4317J4908j6124M8786
18973A54311L4571k4309r9398l4015M0502Q5623k37k8367K910K2084K964q920
18961A47719o8425n9429K2146Q9198j233k8784P97k8474K0154k8279J8065n549
18949G7906j4207M785k4348J573P2519o6778n0473l0657l119K2707Q9632L2679
18937A12219m9555M1220L9004M241L3969K8070m348J1171j08506R43q833o109
18925I3486n7385J098J0517P023q57j8054N6729L5675m4368j5790K1059k2908
18913F6225O0910q7348j14459k1772k8409R4284L6961J3120O3279K6338L7300
$$ plain form
18997 39247 88237 102358 92045 160540 230685 183883 83739 57118 77590 85508 75556 113504
18985 113504 114311 111292 128228 111646 87508 59797 64904 82424 106741 121649 105525 154311
18973 154311 188882 164573 65175 31160 71662 157285 157048 128681 131591 153675 156639 147719
18961 147719 79294 19865 42011 131209 129976 101192 101989 73515 93669 65390 83455 77906
18949 77906 63699 68484 44136 45709 118228 51450 977 -29680 -32799 -10092 79540 112219
18937 112219 62664 103884 142888 147129 181098 209168 204820 215991 107485 108428 99595 93486
18925 93486 36101 37199 47716 54739 53882 35828 92557 128232 83864 68074 89133 66225
18913 66225 127135 39787 -74672 -96444 -124853 -30569 6392 19512 82791 109129 146429
18902A46429K0229J653m6427n4908k0848m2419j8826M3943k911N397n065m3192
18890a6945J6999P2204K8429O832J9330J5429l421p5985q220r4552J5656J04731
18878H0487M1121J8340K9816o2845k7357k3849m99P7170P4524N3455N635o1426
18866B04572j8073r231M2014K1374P897n3157K5180L298n2026l6835m6899K3975
18854A12089M0023j1030N890O8117P9516m9309m7062J0951N555l5135J7373Q049
18842B05027L3116j2865l5643j0332q394r02m5904k6117j9501O4888J3474k4738
18830A32109L4403R2344M623l8042m9233n9249k7880P4573l2907j04086n2723
18819b6068M3223R4748L0322P6449J4696m1134l4782j4586J9396M5760k7978n3799
$$ plain form
18902 146429 166658 168311 121884 66976 46128 3709 -15117 28826 25915 31312 26247 -16945
18890 -16945 54 72258 100687 107519 126849 142278 138857 62872 54652 -39900 -24244 80487
18878 80487 121608 139948 169764 106919 79562 55713 55214 132384 206908 260363 265998 204572
18866 204572 186499 177268 219282 240656 248553 195396 220576 223874 171848 135013 88114 112089
18854 112089 152112 141082 146972 215089 294605 245296 198234 209185 214740 179605 196978 205027
18842 205027 238143 225278 189635 179303 170909 170007 124103 97986 78485 143373 156847 132109
18830 132109 166512 258856 263479 225437 176204 116955 89075 163648 130741 26655 -26068
18819 -26068 17155 111903 142225 218674 233370 192236 157454 142868 162264 208024 180046 126247
18807A26247O9582M5997o5688j3733K0692q3492n9781L410Q1404M9935j4929Q692
18795A68336J6239L0725J03097l106j8751J4051j3606J16565J39408p865k1576
18784E23517l8965q957N7248j8563l337L930M9372P6968k0887J5935n523r436
18772F21302K5555M0271m0587j9302M1193J40831R2479M6026J15263K9167k5520
18761A066678j17097k49627k00241n382k5561j6667n1729q4039n504m9085k6316
18750B35430L9436J0789m6808N7774L4719k592o958j1711M686O4562M6864j9754
18738D06437n349K6595L8511o572N949O519M4728J3150N8096Q9975N9918P1491
18726H09448J8147r1032j01682P507N440J4819N6862O785j11778l6185L7400n5098
$$ plain form
18807 126247 195829 241826 176138 162405 183097 99605 39824 43234 124638 174573 159644 168336
18795 168336 184575 215300 318397 315291 296540 310591 296985 413550 552958 545093 523517
18784 523517 484552 475595 532843 514280 510943 514873 564245 641213 620326 636261 630738 621302
18772 621302 646857 687128 646541 627239 668432 809263 901742 947768 1063031 1092198 1066678
18761 1066678 949581 699954 499713 494331 468770 452103 400374 316335 310831 261746 235430
18750 235430 274866 285655 238847 296621 331340 328748 321790 310079 314765 379327 426191 406437
18738 406437 401088 427683 466194 459622 465571 472090 516818 529968 588064 678039 737957 809448
18726 809448 827595 736563 634881 642388 647828 662647 719509 726294 614516 578331 615731 560633
18714E60633J3385k5282q0541J4414k2672p4975K5675J2399o3651k3016J990j2848
18702C25511m3508Q372M3360n0097j2037m9521J3728k7745m6161N8691K6473K5961
18690B73027J2383k2764O0065Q325o2543n7268m0399L1022J5878O4890p3489L9752
18678B48879L9481J154k832N6109l6489p5664n7826K0314K7613K6765l2904N8220
18666B72820P7113P4160m4968K5117M4161j1858j7266L3804q3919n9143k6896
18655B83125j2125M9408J13889M4227K737P3713L0212j4101K8870j045k3785L3663
18643F08788J0668O2220L0499L6187N0535O4703J33100M5275N3404J65116J33270
18632A393765R8945N0701J347P332k5446j02551j07407q8609q2243j09009q8318
$$ plain form
18714 560633 574018 548736 468195 482609 459937 384962 410637 423036 359385 336369 338359 325511
18702 325511 282003 290375 333735 283638 271601 222080 235808 208063 161902 220593 247066 273027
18690 273027 285410 262646 322711 331036 268493 211225 170826 201848 217726 282616 209127 248879
18678 248879 288360 289514 286682 342791 306302 230638 172812 193126 220739 247504 214600 272820
18666 272820 349933 424093 379125 404242 448403 436545 419279 453083 369164 310021 283125
18655 283125 271000 320408 434297 478524 481261 554974 585186 571085 599955 598910 575125 608788
18643 608788 619456 681676 712175 748362 798897 863600 996700 1041975 1095379 1260495 1393765
18632 1393765 1492710 1543411 1544758 1552090 1526644 1424093 1316686 1228077 1145834 1036825 948507
18621I48507j35682k1632o6558P053L43o1219k331l7167n5891L5257l7743k3007
18609E49930J205M5865L7233M7981l2456j08373L1390J09661o441j38816o9572
18598D67607l5438R7322O5481m1123n3024m119l7232J8301N0510O6420Q688L2511
18586F35904k4750l7321k9901j23916o2736n1020Q084Q4910P4023l097N4431P360
18574E31971M202L2661n0357k7514n649K0378k1530P1978M2386j02682J2320K7679
18562E35843m1813K7621K1584P0257m0922n2566N1012M9798M9534O206p591m9255
18550F19708Q992L277k925M0054R965J6654J9201j0453R948O0179O7801l377N8333
18537H97357L1591J0221l2521l9051k7875M4390P2938O4881J248N3447L2903o5774
$$ plain form
18621 948507 812825 791193 724635 731688 732031 670812 668481 631314 575423 610680 572937 549930
18609 549930 551135 597000 634233 682214 649758 541385 572775 682436 675995 537179 467607
18598 467607 432169 529491 594972 553849 500825 496706 459474 477775 528285 594705 603393 635904
18586 635904 611154 573833 543932 420016 357280 306260 314344 399254 473277 470180 524611 531971
18574 531971 536173 568834 518477 490963 485314 505692 484162 556140 598526 495844 508164 535843
18562 535843 494030 521651 543235 613492 572570 520004 571016 620814 670348 676554 668963 619708
18550 619708 628700 631977 629052 669106 679071 695725 714926 704473 714421 774600 842401 839024 897357
18537 897357 928948 939169 906648 867597 839722 884112 957050 1021931 1023179 1076626 1109529 1043755
18525A043755M4840Q3769J24932O1445J0375L9557N4676N6890J54343Q3750J38187
18514A896519O6763O6932J03264J11613Q1808M5314N4058P9045J05184N9801r318
18503B660983R7690J09815N7047J46471J83037J08239J13222R2758J20903J29101
18493C819266R8202K00376K31958K42701K01678K53123L60283L03211L01768L01012
18483F313578L94601N93513N59457O45829Q88771J077797J309942J537920J978913
18474A5300321K500339L239617M260330N460391O846373Q121594Q960875R081800
18466F3771640Q417987P300924O487894O171189O357735O654079O177494M356815
18458A15695757J603728j475221m147447n492898n858459n637150n640450o439332
$$ plain form
18525 1043755 1088595 1172364 1297296 1358741 1369116 1408673 1463349 1520239 1674582 1758332 1896519
18514 1896519 1963282 2030214 2133478 2245091 2326899 2372213 2426271 2505316 2610500 2670301 2660983
18503 2660983 2758673 2868488 2925535 3072006 3255043 3363282 3476504 3569262 3690165 3819266
18493 3819266 3917468 4117844 4349802 4592503 4794181 5047304 5407587 5710798 6012566 6313578
18483 6313578 6708179 7301692 7861149 8506978 9395749 10473546 11783488 13321408 15300321
18474 15300321 17800660 21040277 25300607 30760998 37607371 45728965 54689840 63771640
18466 63771640 72189627 79490551 85978445 92149634 98507369 105161448 111338942 115695757
18458 115695757 117299485 115824264 111676817 106183919 100325460 94688310 89047860 82608528
18450H2608528p548922q644660r202199q950823q130340o848289n515757m394555
18442B3372983l427158k609861k020215j679030j419203j154089r22977q16741
18434I323709p14919n76507n18607m08546l76547m20988l87238l09964k02182
18425E408211j15930j29291k05635k95721k69288k32001k08555j73964j56157
18416C621669k12208k01121j97320j14335j03258j67525r0362m6667m1083j30577
18406B317213j29345j37533o1065n2152j16186j65158n7690k1053j36479n1407
18396A389145q005j312j8356m9479m2341J1127L545j7488o0981n2897p461k4295
18384A121202K0673P8036R0076L2894O6136M2816o899K1817o1548j5192M7723
$$ plain form
18450 82608528 75059606 66414946 57212747 48261924 40131584 33283295 27767538 23372983
18442 23372983 19945825 17335964 15315749 13636719 12217516 11063427 10140450 9323709
18434 9323709 8608790 8032283 7513676 7105130 6728583 6307595 5920357 5610393 5408211
18425 5408211 5292281 5162990 4957355 4661634 4392346 4160345 3951790 3777826 3621669
18416 3621669 3409461 3208340 3011020 2896685 2793427 2625902 2535540 2488873 2447790 2317213
18406 2317213 2187868 2050335 1989270 1937118 1820932 1655774 1598084 1577031 1440552 1389145
18396 1389145 1381140 1379828 1361472 1311993 1269652 1280779 1284324 1266836 1205855 1152958 1145497 1121202
18384 1121202 1141875 1219911 1309987 1342881 1409017 1451833 1444934 1466751 1405203 1390011 1437734
18373A437734O5097N2515M6396q363k289O7495J64981Q9652k4154k1190M7392
18362A915266K9974P6962J07640L8066l1296L225N0558P0408J13963J05059n4246
18351B425579q6676r5001p0883j09645o5457r9812m0773J8790j32625j50894j20996
18340A471607r5076k311l7854k9327m6791K526L502O6542N1689Q3786M6903O4411
18328A579607Q7443j4794M0702K9348O0626k8515L345J49831R6647Q3402J55148
18317B242790J55395R523r868N6828J09117J71241K24721J84930K39845K29309
18307C613831K82182K90633L79943M05266L85468M88098N84680O07215P83525
18298G820841J048162J132212J340983J511244J639271J756715J831131K013088
$$ plain form
18373 1437734 1502831 1555346 1601742 1593379 1591090 1658585 1823566 1913218 1889064 1867874 1915266
18362 1915266 1945240 2022202 2129842 2167908 2136612 2139837 2190395 2260803 2374766 2479825 2425579
18351 2425579 2338903 2243902 2173019 2063374 1997917 1898105 1857332 1876122 1743497 1592603 1471607
18340 1471607 1376531 1374220 1336366 1307039 1260248 1262774 1266276 1332818 1384507 1468293 1515196 1579607
18328 1579607 1667050 1652256 1692958 1722306 1782932 1754417 1757762 1907593 2004240 2087642 2242790
18317 2242790 2398185 2407708 2397840 2454668 2563785 2735026 2959747 3144677 3384522 3613831
18307 3613831 3896013 4186646 4566589 4971855 5357323 5845421 6430101 7037316 7820841
18298 7820841 8869003 10001215 11342198 12853442 14492713 16249428 18080559 20093647
18290B0093647K281839K447043K936471L769148M611352N728919O716849P597603
18282E6182871Q158874Q359784Q055963P047295N330209L163797J038169j126537
18274I6210425l111504m568996n351670n689281n598900n231105m699995m078105
18266E7880869l683045l515694l491068l505586l445834l436239l348683l095698
18258C0359022k780933k465411j967631j431597j068744o87205l29359j33967
18250A9494175J79196N05465Q43657J237787J714675K315561K829969L269253
18242C2389738L574576L873215M071460M136151M007627L976007M229246M751484
18234F5009504N577391O657574P659463Q555157R053905Q798067P770157O057280
$$ plain form
18290 20093647 22375486 24822529 27759000 31528148 36139500 41868419 48585268 56182871
18282 56182871 64341745 72701529 80757492 87804787 93134996 96298793 97336962 96210425
18274 96210425 93098921 88529925 83178255 77488974 71890074 66658969 61958974 57880869
18266 57880869 54197824 50682130 47191062 43685476 40239642 36803403 33454720 30359022
18258 30359022 27578089 25112678 23145047 21713450 20644706 19957501 19628142 19494175
18250 19494175 19673371 20178836 21022493 22260280 23974955 26290516 29120485 32389738
18242 32389738 35964314 39837529 43908989 48045140 52052767 56028774 60258020 65009504
18234 65009504 70586895 77244469 84903932 93459089 102512994 111311061 119081218 125138498
18226A25138498L606867N35130k741615n766786q182649r747267j0368925j0240155
18218H2233098r594111q595044p363487o091927m905119m107093l576097l271308
18210C4728912k975747k840765k711868k609618k408918k190393j868186j481125
18202A5642292j310394j119775j038773q22999o46141o53373o47592o73925n23247
18193H206073m11509l78871m23243m21601k22734k18943l68553l31055k01574
18184E227990k45445k60709j47963j69082j15425j75898j20676j53313j30437
18175C709042j28330j02577p5980n0945o5884o0665p8654o8655o6953q3057j03035
18164B824307n9385k8903k9602r7504m2604K1210l7511l5984q4953j697k8646
$$ plain form
18226 125138498 128745365 129280495 126538880 120772094 112589445 102842178 92473253 82233098
18218 82233098 72638987 64043943 56680456 50588529 45683410 41576317 38000220 34728912
18210 34728912 31753165 28912400 26200532 23590914 21181996 18991603 17123417 15642292
18202 15642292 14331898 13212123 12173350 11350351 10704210 10050837 9403245 8729320 8206073
18193 8206073 7794564 7415693 6992450 6570849 6348115 6129172 5760619 5429564 5227990
18184 5227990 4982545 4721836 4573873 4404791 4289366 4113468 3992792 3839479 3709042
18175 3709042 3580712 3478135 3402155 3351210 3285326 3224661 3146007 3077352 3010399 2927342 2824307
18164 2824307 2764922 2736019 2706417 2608913 2566309 2587519 2550008 2514024 2429071 2427374 2398728
18153B398728J3799m5108Q299J3811j3750n3929q7603q1597M5614K338m9962m2007
18141B108633m9160j7685J4178K0278N3361K5992l5037k2285k2851l7639l4546
18130B003239L0105J26446R3056P5258R6972J40166J24418J09082O3003J22743
18120B984488K37264L29250L91088L66910M88260O20135R04208J218836J752845
18111I293284K656055M108118O600730J2395218K4868263L9821762K0644566q724155
18103A11663841j6982311k8354189k5708750j4140551p458538m437849k897435
18096A1684218j910408j325615r94825q73327o95004n04453n40551m93512l55301
18087C991222k17040j69075j53485j32727j80641k07607k75788k21058m9936r413
$$ plain form
18153 2398728 2412527 2367419 2375718 2389529 2375779 2321850 2234247 2152650 2198264 2200602 2150640 2108633
18141 2108633 2059473 2041788 2055966 2076244 2129605 2155597 2120560 2098275 2075424 2037785 2003239
18130 2003239 2033344 2159790 2252846 2328104 2425076 2565242 2689660 2798742 2861745 2984488
18120 2984488 3221752 3551002 3942090 4309000 4797260 5417395 6321603 7540439 9293284
18111 9293284 11949339 16057457 22658187 35053405 59921668 99743430 120387996 111663841
18103 111663841 94681530 66327341 40618591 26478040 19019502 14581653 11684218
18096 11684218 9773810 8448195 7453370 6580043 5885039 5380586 4840035 4346523 3991222
18087 3991222 3774182 3605107 3451622 3318895 3138254 2930647 2654859 2433801 2383865 2374452
18077B374452j82341j28966j56362j04667q9379p8134k6155q3837Q923l2431k0587
18066A480516j2325j8111J2784O2697l3929o4055j69129k6147R5193n3867p8420
18055A195207m7251k2244j6525J8332M9786j0249N1236L6712l4133r2557n1690
18044A076624N042M1908M3002j17216q7179n4758k6874k5062L0602J0937J3990
18033I11016j3830o4148m9900l8529M2862L3810L12k9182J4309L973j7750Q0158
18021H73101O544L7688k8417J709N3871k734P113M948O452j2325j0473K8763L1781
18008I98021O4535O4829k4211n9845m9054j8857j5897R651L662m254L5817o874
17996I97523K2170q186j951j3774l8322k0863L7376L6o344J6003k4566k9773j4243
$$ plain form
18077 2374452 2192111 2063145 1906783 1802116 1712737 1634603 1608448 1524611 1533534 1501103 1480516
18066 1480516 1468191 1450080 1462864 1525561 1491632 1427577 1258448 1232301 1327494 1273627 1195207
18055 1195207 1147956 1125712 1109187 1127519 1177305 1167056 1218292 1255004 1220871 1128314 1076624
18044 1076624 1081666 1123574 1166576 1049360 962181 907423 880549 855487 886089 897026 911016
18033 911016 897186 833038 783138 744609 787471 821281 821593 792411 806720 810693 792943 873101
18021 873101 879645 917333 888916 890625 944496 941762 948875 953823 960275 947950 937477 966240 998021
18008 998021 1062556 1127385 1103174 1043329 994275 975418 959521 969172 972834 968580 1004397 997523
17996 997523 1019693 1011507 1009556 995782 957460 936597 973973 974009 967665 983668 959102 929329 915086
17983I15086M9219P2158J4444n2413K909N0442O1544O1754R2306O8696K1297L2848
17971A390290k4009R125M634j9276l4093q5638N0329P3093K2086J59080J26818
17960A672439J09380M0387M9953Q1761P5811k0802O4949L9568J00580J67053J24493
17949B505572J96811K10169J95672K34303K28662K40950K98934M47840M64728
17940E023641M25650N10348N03740N32535N10827N78785N96800P39026R44307
17931A0365659J203178J483194J826434K181834K462219K697893K864942K978595
17923B8063948L106365L353800L988428N054630O608756Q545048J0414291J2066233
17915H1201499J3211770J3782367J3204455J1045529P568588L439779q76775m819807
$$ plain form
17983 915086 964305 1036463 1050907 998494 1001403 1051845 1113389 1175143 1267449 1336145 1357442 1390290
17971 1390290 1366281 1375406 1380040 1360764 1326671 1241033 1291362 1364455 1386541 1545621 1672439
17960 1672439 1781819 1822206 1872159 1953920 2029731 2008929 2073878 2113446 2214026 2381079 2505572
17949 2505572 2702383 2912552 3108224 3342527 3571189 3812139 4111073 4558913 5023641
17940 5023641 5449291 5959639 6463379 6995914 7506741 8085526 8682326 9421352 10365659
17931 10365659 11568837 13052031 14878465 17060299 19522518 22220411 25085353 28063948
17923 28063948 31170313 34524113 38512541 43567171 50175927 58720975 69135266 81201499
17915 81201499 94413269 108195636 121400091 132445620 140014208 143453987 142577212 137757405
17907A37757405p992628r940708j0890190j0676178r700435q292622o721293n294227
17899F8249124m355026m118065m170682m370316m564861m686007m529929m166812
17891C3287426l786371l197002k553989j936603j426949j077091p22429m26090
17883A8160902k14740J4507L04417P09100J233671J862494K407636K915962L435122
17874C0829071L800436L954848M007744L893763L656600L616838L893943M563488
17866F2216731N457670O503476P464769P898486P494455O368627M662211K265118
17858A10331543p55185l900360o784253q837002r889500j0107230r584628q673152
17850E1800233p295566n838160m473435l455597k721414k290950k204692k135865
$$ plain form
17907 137757405 129764777 119824069 108933879 98257701 88557266 80264644 73543351 68249124
17899 68249124 63894098 59776033 55605351 51235035 46670174 41984167 37454238 33287426
17891 33287426 29501055 26304053 23750064 21813461 20386512 19309421 18586992 18160902
17883 18160902 17946162 17960669 18265086 18974186 20207857 22070351 24477987 27393949 30829071
17874 30829071 34629507 38584355 42592099 46485862 50142462 53759300 57653243 62216731
17866 62216731 67674401 74177877 81642646 89541132 97035587 103404214 108066425 110331543
17858 110331543 109576358 105675998 98891745 90054743 80165243 70058013 60473385 51800233
17850 51800233 44504667 38666507 34193072 30737475 28016061 25725111 23520419 21384554
17842B1384554k093839j938551j698396j581556j434972j208509j013520r22358
17834I492853p94798o13338n27346m96300n00670m36583l36158l66028k87472
17825E134160k10563k09698k49011k00479j71898p8603l1229n6751o4113m1427
17815C820388J8713N9640N6443J6652N824m3105J8618J50422J35253J07134l1735
17804D314247r8126l2346k2028P0075N4169N087J03071J51583P0378J33491K08150
17793D957751L08819M63237N58591O58836O58709L97628J15709L8194P4255L28569
17783H560298L70892K48676j9778n4745j35983j38213J06089M16095O03406P85662
17773A0742399J149229J593359K167321L092662M448471O588296R699679J3491592
$$ plain form
17842 21384554 19290715 17352164 15653768 14072212 12637240 11428731 10415211 9492853
17834 9492853 8698055 8084717 7557371 7061071 6560401 6123818 5787660 5421632 5134160
17825 5134160 4923597 4713899 4464888 4264409 4092511 4013908 3982679 3925928 3861815 3820388
17815 3820388 3839101 3898741 3955184 3971836 3977660 3934555 3953173 4103595 4238848 4345982 4314247
17804 4314247 4216121 4183775 4161747 4231822 4285991 4291078 4394149 4545732 4616110 4749601 4957751
17793 4957751 5266570 5729807 6288398 6947234 7605943 8003571 8119280 8157474 8231729 8560298
17783 8560298 8931190 9179866 9160088 9105343 8969360 8831147 8937236 9353331 9956737 10742399
17773 10742399 11891628 13484987 15652308 18744970 23193441 29781737 39481416 52973008
17765E2973008J5836673J3533970P661651K920510K095237N740891J2100258J5760478
17757A28622676J3039383M852202n687836j2883105j3747318r284778l271642
17750A01639582j241871n054603j0380419j4214655j5210278j3228363r841536
17743C2467857o835343m749398l476570k599074j930522j593352j224434r22115
17735I137049q02451o57388m89486m37908m58853l73487l09077k48487k32773
17726E127139k20086j20772m8651j52883k42229j79890j47032k18966j71458j36213
17716C488959p5171r5877k11210k07871r9180p2716j40025r7793l5909j9767q6057
17705B347383n0633M137r2663j67109j66478j04513j35198j02660k6238j5151
$$ plain form
17765 52973008 68809681 82343651 90005302 92925812 95021049 100761940 112862198 128622676
17757 128622676 141662059 146514261 140826425 127943320 114196002 104911224 101639582
17750 101639582 100397711 95343108 84962689 70748034 55537756 42309393 32467857
17743 32467857 25632514 20883116 17406546 14807472 12876950 11283598 10059164 9137049
17735 9137049 8334598 7677210 7187724 6749816 6290963 5917476 5608399 5359912 5127139
17726 5127139 4907053 4786281 4737630 4584747 4342518 4162628 4015596 3796630 3625172 3488959
17716 3488959 3413788 3317911 3106701 2898830 2799650 2726934 2586909 2489116 2453207 2433440 2347383
17705 2347383 2296750 2300887 2208224 2041115 1874637 1770124 1634926 1532266 1506028 1490877
17695A490877q5124j11985j41138j42380j01985o4879o1663J414j929l5872m7867
17684F97469j1269l7892l0418k408J7412p7092l0228j6816J0230j6731n5181m6400
17672D00676K3734M5788l4101p724O1994J0327j9024p9501n3596L3427M3820Q0308
17660E06128M8812k3688L0529j2763J5876K2909k7113k6209m9558n0111J6258
17649D51070M0150R954R133j3967l7558M723j9514N449k5842n6135L1072N448
17637D03983j2254n82l8222o1391J584R4735j1818k7257J9716n9078k6084O3542
17625C46874N9014j3813p6952m4988N4674K5930j24332l1194q438j2107M1262
17614B15930J7880n048n2547L5029N994n2164Q43m110m6691l4753J2314L919J0493
$$ plain form
17695 1490877 1405753 1293768 1152630 1010250 908265 843386 781723 783137 781208 745336 697469
17684 697469 686200 648308 617890 615482 632894 555802 525574 508758 518988 502257 447076 400676
17672 400676 424410 470198 436097 428373 490367 500694 481670 402169 348573 382000 425820 506128
17660 506128 554940 531252 561781 549018 564894 587803 560690 534481 484923 434812 451070
17649 451070 491220 501174 510307 496340 458782 463505 443991 449440 423598 367463 398535 403983
17637 403983 391729 391147 352925 291534 293118 387853 376035 348778 368494 309416 283332 346874
17625 346874 405888 392075 315123 270135 324809 350739 226407 195213 186775 174668 215930
17614 215930 233810 228762 176215 211244 217238 165074 165917 161807 115116 80363 92677 96596 107089
17601A07089R1175K2856J0057K7246M4403J7262K1874J01545J9174J5875p7931
17590D00625n8229L5134R916k1917K1093Q7926K2476j361j8233m33O806M1566
17578E25369M9437k7164m3594N5451J7598p62o464R034J092J4398L8413M4970
17566F77778l1366J2526P2863j786J219J5627j3421P760P6314L9881N4634k840
17554I09189O4370O363r176J7376K001K4361M0574J15948P1584j8438O3229P510
17542A294891N1832M7285N9607J17497J05653J19208J25214Q5548J04566K19300
17532B330601J47748J98679K92553L22044K99376J44834J62644J58148K17328
17523D273955L53111N21733N93371O71667P38032P36277Q64996J197335J728409
$$ plain form
17601 107089 198264 221120 231177 258423 302826 320088 341962 443507 462681 478556 400625
17590 400625 342396 377530 387446 365529 386622 474548 497024 495663 477430 476997 483803 525369
17578 525369 574806 547642 504048 559499 577097 576335 569871 578905 579997 594395 632808 677778
17566 677778 646412 658938 731801 730015 731234 746861 733440 741200 817514 857395 912029 909189
17554 909189 973559 979922 970746 988122 990123 1014484 1055058 1171006 1242590 1224152 1287381 1294891
17542 1294891 1346723 1394008 1453615 1571112 1676765 1795973 1921187 2006735 2111301 2330601
17532 2330601 2478349 2677028 2969581 3291625 3591001 3735835 3898479 4056627 4273955
17523 4273955 4627066 5148799 5742170 6413837 7151869 7888146 8753142 9950477 11678886
17514A1678886K523368L451767N028375P436090J0904807J4447095J5552313J1719543
17506H2742244M831173q68371l196675m27477P243456J6476048K1588449J7244428
17498A45633275M107311r442419j8251605j9716059j4280886n779523J123995
17491H3394089K679884j504828p504437j2050381j3709979j2317304r400737o527120
17483B3059187m457560l103303k264169j696004j279120r19742q54849p43013
17475G741427n44639m55738n04355n71039m48243l40325k40968k04959j35951
17466D295210j70427k69860k27842k73610k62688k69781k37346j41049k08075
17457B234532j30475q8368j39388j63389j10919p5748j05609j43033r5736p5412
$$ plain form
17514 11678886 14202254 17654021 22682396 30118486 41023293 55470388 71022701 82742244
17506 82742244 87573417 86705046 83508371 83080894 90324350 106800398 128388847 145633275
17498 145633275 149740586 140298167 122046562 102330503 88049617 82270094 83394089
17491 83394089 86073973 84569145 77064708 65014327 51304348 38987044 29586307 23059187
17483 23059187 18601627 15498324 13234155 11538151 10259031 9339289 8484440 7741427
17475 7741427 7196788 6741050 6236695 5665656 5217413 4877088 4636120 4431161 4295210
17466 4295210 4124783 3854923 3627081 3353471 3090783 2821002 2583656 2442607 2234532
17457 2234532 2104057 2015689 1876301 1712912 1601993 1526245 1420636 1277603 1181867 1106455
17447A106455o0385J6831n8935p8936k3483L9345Q7769J97729J86210o6843j48585
17436A197172j53859j47645q6419p8561q8280j18291l7818n2725l2045K7574O6639
17425D95742N9822J8563l4028n5748L5526J30492J01712p804r9387j2619j9568
17414F12703J3149J9347q1033j9971R8599L5908l3130l2110L5174k2111O0504
17403F87029n6643q2281o512p663m9292l2999q794k3711o6386J6989q2949p4785
17391B12003l8518R557L8775M6774r189n197n808j2709K658n2745O4703J5601
17379B65905m37L2199j2973m5855J1009Q0766k3967M9820L3745j2605K2955N3033
17367D53595J10072N1218p7238k8647L4052j3617m2399l6538k0027j06688l7909
$$ plain form
17447 1106455 1046070 1062901 1003966 925030 901547 940892 1028661 1226390 1412600 1345757 1197172
17436 1197172 1043313 895668 809249 730688 642408 524117 486299 433574 401529 429103 495742
17425 495742 555564 574127 540099 484351 519877 650369 752081 744277 644890 632271 612703
17414 612703 625852 645199 564166 544195 642794 678702 645572 613462 648636 626525 687029
17403 687029 630386 548105 541593 533930 484638 451639 442845 419134 352748 369737 286788 212003
17391 212003 173485 183042 221817 268591 259402 254205 248397 235688 238346 185601 250304 265905
17379 265905 265468 297667 284694 238839 249848 330614 306647 356467 390212 377607 400562 453595
17367 453595 563667 614885 537647 509000 543052 529435 487036 450498 430471 323783 285874
17356B85874R3932J0006j6728N7406K2817k5940j5135m0148m3989q9664j13018
17345A25413q8943k6726M0732O0732k9710m7232k1464l7457K6958P2889j4572
17334F0620k2262k9049K9785q031q9051l1874Q7831N7481J6734n7610j5674J9416
17322A8316J6623j8938n7415K8286R3744J7918p2978j3970j5308q8577k9018Q349
17310a12968R3138R8876j8181j1423p0639o3293L7114Q3985n3400m9270M163j3147
17298g5045J5822n795l7665L1097M1283o343O974k252J5000k5532k9556J0126
17286f1886m4517Q7824P5054m0815j5113M6110k5619k804J2205j1717k2422o9030
17274g2730o1187L4281J35991N5974J9329q6357o2883L1782P7948L9765q9522
$$ plain form
17356 285874 379806 389812 373084 430490 453307 427367 412232 372084 328095 238431 125413
17345 125413 36470 9744 50476 111208 81498 34266 12802 -24655 2303 75192 60620
17334 60620 38358 9309 39094 31063 -57988 -89862 -2031 55450 72184 14574 -1100 18316
17322 18316 34939 16001 -41414 -13128 80616 98534 25556 11586 -3722 -92299 -121317 -112968
17310 -112968 -19830 79046 60865 49442 -21197 -84490 -47376 36609 -16791 -66061 -61898 -75045
17298 -75045 -59223 -65018 -102683 -71586 -30303 -36646 -29672 -31924 -16924 -42456 -72012 -61886
17286 -61886 -106403 -18579 56475 15660 547 46657 21038 18234 30439 18722 -3700 -72730
17274 -72730 -133917 -99636 36355 92329 111658 25301 -37582 -5800 72148 111913 22391
17263B2391r6937O3879L779q633K5867k1198j12006k2249N2256N6347J8532L8247
17251B0275j789k2554Q361J1311K6418m0937m1889L5937j7265K224K8681L0868
17239C9641k7395n2475n8453R5714p981q914J3917k2823R741m8890o5199K6635
17227a06482K6590n25J12236r636k9511j2396o2780j15835j4487M7339l35J2820
17215a53002L5737R7810R4425L3606r760n950j2904j5039N845o730l4180l959
17203B5899R418J9210j3054j0174p116j5787r1649J2582J9760O6530O341J3941
17191C5901r520M3777N6896n2558m3666O083J225l0868J6226n6948L0731P1909
17179F9188o9725m2129J7174J4019k3321p715L5818P0235K1678K5835n5992n8367
$$ plain form
17263 22391 -74546 -10667 -6888 -15521 10346 -10852 -122858 -145107 -92851 -36504 -17972 20275
17251 20275 18486 -4068 4293 15604 42022 1085 -40804 -4867 -22132 -19908 8773 39641
17239 39641 12246 -40229 -98682 -2968 -10949 -19863 -5946 -28769 -19028 -67918 -133117 -106482
17227 -106482 -79892 -80417 31819 22183 -7328 -19724 -82504 -198339 -212826 -165487 -165822 -153002
17215 -153002 -117265 -19455 74970 108576 98816 92866 79962 64923 70768 64038 29858 25899
17203 25899 35317 54527 41473 31299 24183 8396 -83253 -70671 -50911 15619 21960 35901
17191 35901 26381 70158 127054 74496 30830 36913 38138 7270 23496 -33452 -2721 69188
17179 69188 -537 -42666 -25492 -11473 -34794 -42509 -6691 63544 85222 111057 55065 -3302
17167c302l6829j3178O3335J20148R0826N3405O8149O0201L5622R538J2698q131
17155D52482N0551P4543J24374J06079j2644r1227j07261N139j4579o934j6400
17144E64123q7289p6151n2042j12614r0483L3640M0108j2279o8428J0027O7684
17133B16296l801n8490l8417K2506m1928k3241l2811q0040k3001K5994J1051K1124
17121d758l3622L2077Q4867j363j37345n0654P6167j4074J2877K3020L6497K8503
17109E2192R722n5437m2233j7763L7847K8068k2076j904M3711L9259l883q895
17097E8608l286o0982J0785o717L154j5788j7720j925l7002l4238O5851J28m5317
17084h4449j6945n4744k420N6251q002J6114j3783M4826K9939k0340r0554L0393
$$ plain form
17167 -3302 -40131 -53309 10026 130174 221000 274405 342554 402755 438377 447915 460613 452482
17155 452482 503033 577576 701950 808029 795385 704158 596897 602036 587457 580523 564123
17144 564123 476834 400683 348641 236027 145544 179184 219292 207013 138585 148612 216296
17133 216296 212495 154005 115588 138094 96166 72925 40114 -39926 -62927 -36933 -25882 -4758
17121 -4758 -38380 -6303 78564 77201 -60144 -110798 -34631 -48705 -35828 -12808 23689 52192
17109 52192 61914 6477 -35756 -53519 -15672 12396 -9680 -11584 32127 71386 67503 58608
17097 58608 55322 -5660 5125 -1592 1562 -14226 -31946 -33871 -70873 -105111 -39260 -39132 -84449
17084 -84449 -101394 -156138 -158558 -102307 -110309 -94195 -107978 -63152 -33213 -53553 -144107 -113714
17072a13714Q8722j4319j7684J3575N328k2236J7361P8464k6018m1291o6919l3042
17060a31773R2083O6383j6320p0168J4948j9154j6624L2459L0712P5137L9812
17049I7495j300M7931n805m1828p9643n9548Q563O6208J5424n3588K0456q059
17037F306L663m6682n278R22M172L3602P5328q7593k6070N3359N8750J6339m4875
17024D1943m7020J3395p1675k7386M6029K2883J12554O93l4621m417M4147J4793
17012A11318n8458j06333j5712M8818L8636l0052L0788N9047j6363n4437L541
17001A0793J2957K5254k4201m687n4892o5325o7889Q6579P4643K6853K750J7885
16989D0720M2708o2520n7800l2288Q397M0943M878k626j9567M8446M3292k3952
$$ plain form
17072 -113714 -24992 -39311 -56995 -43420 -38092 -60328 -42967 35497 9479 -31812 -98731 -131773
17060 -131773 -39690 26693 10373 -59795 -44847 -64001 -80625 -48166 -17454 57683 97495
17049 97495 96195 144126 138321 96493 16850 -42698 -34135 32073 47497 -6091 14365 6306
17037 6306 9969 -36713 -41991 -41069 -36897 -3295 72033 -15560 -41630 11729 70479 86818 41943
17024 41943 -5077 8318 -63357 -90743 -44714 -21831 90723 91416 56795 52378 96525 111318
17012 111318 52860 -53473 -69185 -20367 18269 -11783 19005 78052 61689 7252 10793
17001 10793 23750 49004 24803 20116 -34776 -100101 -167990 -81411 -6768 20085 22835 40720
16989 40720 83428 20908 -36892 -69180 -60783 -19840 -14962 -17588 -37155 11291 54583 30631
16977C0631l183N4543J5956m0774k6622m1833l2235n5882k2764J0619N6639j2020
16965f6925o3351J7572M2432L8264k0360l2442O1133N4560R968m4191j02972n0214
16953a56526R2422J24432J509L3048K0702r9880l3764J6106O502K8544J5831K0008
16941F8934k0602n5928m7364Q02P5640K1481j0174j6119r257J7814l7157p5519
16929h7449K5307L0613M2172J7095q632n098P263j249M1352L4020j9688l3414
16917D2292Q800q995j8948N5471K6340K9618j7259l7204M5190J15397J1430R949
16905B62081P7345J1198K7451M1036O3471J03485J12473K7264J2174M3749p3638
16894G08089j22257j21864k1115J0775m4214j06533l3209K0688l4181q2969j07543
$$ plain form
16977 30631 27448 81991 97947 57173 30551 -11282 -43517 -99399 -122163 -111544 -54905 -66925
16965 -66925 -130276 -112704 -70272 -32008 -52368 -84810 -23677 30883 40851 -3340 -106312 -156526
16953 -156526 -64104 60328 61837 94885 115587 15707 -18057 -1951 4551 33095 48926 68934
16941 68934 48332 -7596 -54960 -54158 21482 42963 32789 16670 7413 25227 -11930 -87449
16929 -87449 -62142 -31529 10643 27738 19106 14008 21271 20022 61374 95394 75706 42292
16917 42292 51092 42097 23149 78620 104960 134578 117319 80115 125305 240702 252132 262081
16905 262081 339426 350624 378075 419111 482582 586067 698540 725804 737978 781727 708089
16894 708089 585832 463968 442853 453628 409414 302881 269672 290360 256179 173210 65667
16883F5667J1247J0104M719P199k2334Q61r312K4430Q5358o1720M272o929o0718
16870E2844p5027j07597l064J110O7610K9650O810k7395J5364M8100N4676j3336
16858D9745j8733o8255k082N8066k5934j7669l5432k2412J8635j2142j8550L6007
16846e8756J9499K319m8170m8459O1855O8648J0769k8586o9702N2886P9566l1891
16834I978n5807j8924K7087K3950k6677l3511O2680J7390P8605j6781j07004o9494
16822a08508P0984J23638p334j32261p3109N3035M4580R42Q9514O8243m5159j05590
16810b1025k3015P903k0550M4811O8299M3885l2778j3852k7169m5803L0624K4260
16798C5590j0873m3133J4222l9593j8231J1723N9893M6464J8426J366j831j13837
$$ plain form
16883 65667 76914 87018 91737 98936 76602 77463 68151 92581 177939 116219 120491 113562 52844
16870 52844 -22183 -129780 -132844 -131734 -64124 -34474 -27664 -55059 -39695 8405 63081 49745
16858 49745 31012 -37243 -39325 18741 -7193 -24862 -60294 -82706 -64071 -76213 -94763 -58756
16846 -58756 -39257 -36938 -85108 -133567 -71712 -3064 7705 -20881 -90583 -37697 41869 9978
16834 9978 -45829 -64753 -37666 -13716 -40393 -73904 -11224 6166 84771 67990 -39014 -108508
16822 -108508 -37524 86114 78780 -53481 -126590 -73555 -28975 -28033 61481 129724 84565 -21025
16810 -21025 -44040 -36137 -56687 -11876 56423 100308 67530 53678 26509 -19294 11330 35590
16798 35590 24717 -18416 -4194 -43787 -62018 -50295 9598 56062 74488 75854 74023 -39814
16786c9814j35458k4660Q9984O0626j6427k8159O501K1881O0862M4699j067k3668
16774A5300q6214j4715N161k7963j271j9261N8450L4739N5115J7349m8369m985
16762a6664O0674q4139N3071M5266q4663K8516K953M899q3485O077L6751l2624
16750f3368n4554K0282J2123k3404N5691K7100J1072L6669m727l583j08655k2684
16738a18038O778N6617Q8628q54j9246l4298m618L4337o9608l6639Q3271K2032
16726H362n1287J6166K9045k3722m5630N1487j75m2204m0870j7092M5099R7006
16714B6185M7149l3559n5920n0686L496q633J654N2762L9315l0099J0824j8783
16702a6295m2419k8581K3943M0695n8543m089l1520k1591R1431J7983K7914M5572
$$ plain form
16786 -39814 -175272 -199932 -109948 -49322 -65749 -93908 -87407 -65526 -4664 40035 38968 15300
16774 15300 -70914 -85629 -80468 -108431 -109702 -128963 -70513 -35774 19341 36690 -11679 -16664
16762 -16664 44010 -40129 12942 58208 -26455 2061 5014 9913 -73572 -67495 -30744 -63368
16750 -63368 -117922 -97640 -85517 -108921 -53230 -26130 -15058 21611 16884 13301 -95354 -118038
16738 -118038 -111260 -54643 33985 33131 13885 -20413 -25031 9306 -60302 -96941 -13670 8362
16726 8362 -42925 -26759 2286 -21436 -67066 -15579 -15754 -57958 -98828 -115920 -70821 26185
16714 26185 73334 39775 -16145 -66831 -63335 -71968 -70314 -17552 21763 -8336 2488 -16295
16702 -16295 -58714 -87295 -63352 -22657 -81200 -85289 -116809 -138400 -46969 -28986 -1072 44500
16690D4500j976k8870l913k3527Q2240N3635m7603r6567J0956J9010p9697Q510
16678f3302j7226k063j7999K5631M4222p175L4356J820J0835Q88k0048m5337n1893
16665a07291J7600N1268K0856N9305K2561q127M2956j5344n6930K588j1704l7824
16653b0086M3968M052p9161j1213p024m5112M1379K0556O0508l3484l4742N6054
16641d305j8476k3069l3056M918L9448K3478k4434l6193L1587o820l5897K6992
16629e5827K3839l08M7283n6018m0099p909Q3795j0194M1599l9557j3804k1886
16617d9086l2682L6922J4389n9546K0801J06850K6283q9042J6893L1333M768n2974
16605b5091M0781O5310m7499k6157k6018O72j1034l2726Q18K3239M5026M5652
$$ plain form
16690 44500 42524 13654 9741 -13786 68454 122089 74486 -22081 -11125 7885 -71812 -63302
16678 -63302 -80528 -82591 -100590 -74959 -30737 -37912 -3556 -1736 9099 9987 -10061 -55398 -107291
16665 -107291 -89691 -38423 -17567 41738 64299 56172 99128 83784 26854 29442 17738 -20086
16653 -20086 23882 27934 -51227 -62440 -69464 -114576 -73197 -52641 7867 -25617 -60359 -4305
16641 -4305 -22781 -45850 -78906 -73988 -34540 -11062 -35496 -71689 -40102 -46922 -82819 -55827
16629 -55827 -31988 -32296 14987 -41031 -81130 -89039 -5244 -15438 26161 -13396 -27200 -49086
16617 -49086 -81768 -44846 -30457 -90003 -69202 37648 63931 -25111 -8218 23115 27883 -25091
16605 -25091 15690 81000 33501 7344 -18674 -18002 -29036 -61762 -60944 -37705 7321 52973
16593E2973j6939p9690Q045Q0214J6496R134n7142l971n5727p5308N2804J8286
16581e0825o0533n4001P6654Q0240k6102j0964L1212N9002L8685j9084l4435J3586
16569D3435O1117o2784m1269m1975n5368N4133N2418M8653k7968l5246m8824n7237
16557a10915Q094j8177N3380K9023L702N348k3760L5287N700q065j0540L5798
16545D875l1038K4585M5581j7896m2325m8112M7027j3845l7275N6267J95386l2811
16533A50419l2988j08992p8241L1779J9941L1024l4556n3008r904J35431P4921
16522A25826q994l8530n2436o1004k7039K6990l3317K417M6640o4241L3019J26443
16510G5774M0434r4228n9867j0634L0255N8099N8938l8607J1378J2717N638j1289
$$ plain form
16593 52973 36034 -43656 -35611 44603 61099 70233 13091 9120 -46607 -121915 -69111 -50825
16581 -50825 -111358 -165359 -88705 -8465 -34567 -45531 -14319 44683 83368 64284 29849 43435
16569 43435 104552 41768 499 -41476 -96844 -42711 9707 58360 30392 -4854 -53678 -110915
16557 -110915 -102821 -120998 -67618 -38595 -34893 -29545 -53305 -18018 -12318 -20383 -30923 4875
16545 4875 -26163 -1578 44003 26107 -16218 -64330 -17303 -31148 -68423 -12156 183230 150419
16533 150419 117431 8439 -69802 -38023 -18082 12942 -21614 -74622 -84526 50905 125826
16522 125826 116832 78302 25866 -35138 -62177 -35187 -68504 -66087 -19447 -83688 -50669 75774
16510 75774 116208 21980 -37887 -48521 -18266 39833 98771 60164 71542 84259 89897 78608
16498G8608l4320j7193M5413M5101m7226n4365m8912P396n490n4464M4979J06918
16486F6445l4848k3389o2928M5979J0701J0402K673j3469n487l0229n115k6249
16474f5514J946o0705k401P9096O2592p8160J7824J5993m3268j5074l313M6919
16462d4065N5320q5886o4052j5488m618P9918N5488P484l3862M6343j6223k3560
16450d3201k189O9429j1841K5866M0117o2202m6906K7716k9822j18154R276J20812
16438b1099K1759J8464n7054l2294o4144R0760N0746L1418n3683k5480N2511k9519
16426a7615n031N0018Q172p293p4709l9647M8455j388K9552o81j6722p9460L7179
16413f9170N1216l3874K4396O1310j5087j5863r2789N0112O0010n2818r3884j5946
$$ plain form
16498 78608 44288 27095 72508 117609 70383 16018 -32894 -25498 -30988 -85452 -40473 66445
16486 66445 31597 8208 -54720 -8741 1960 12362 15035 1566 -3921 -34150 -39265 -65514
16474 -65514 -63568 -124273 -126674 -47578 15014 -63146 -45322 -29329 -72597 -87671 -90984 -44065
16462 -44065 11255 -74631 -138683 -154171 -158789 -78871 -23383 -15899 -49761 -3418 -19641 -43201
16450 -43201 -45390 24039 12198 38064 78181 15979 -30927 -3211 -33033 -151187 -141911 -21099
16438 -21099 660 19124 -37930 -70224 -134368 -43608 7138 38556 -15127 -40607 11904 -17615
16426 -17615 -22646 27372 35544 28251 -46458 -86105 -37650 -39038 -9486 -10167 -26889 -106349 -69170
16413 -69170 -17954 -51828 -27432 33878 18791 2928 -89861 -39749 20261 -32557 -126441 -142387
16401a42387L8397n0397N0376J27142L5597k0532l0135L7902P088m8889l8867
16390c4705l8350L0557k1589M531R9009Q967j19012l0067l4502J0330Q1966J20227
16378G7362k5486l1012m8618O6432j7961l4029K7254J2820J6925J461L0831m5646
16366C0333n6809L583M1229J2402j0271o6322L7249M1824j2670k9542m5564j8451
16354g3009L2966J7464k238K4068L202k3766l6877k8501R663K8987j4191o6555
16342a28787J8108L4088O2483j9324j9797k5726l133J1104J18255l2757K719n5561
16330c8328o3069N4590J396n310M8842k9121k4569J4030N9916J5454J1325n8225
16318a3069j2318L462j3942l9196j9955K4544M8573L4190J4759J6775k2455K2358
$$ plain form
16401 -142387 -103990 -154387 -104011 23131 58728 38196 8061 45963 53051 4162 -34705
16390 -34705 -73055 -42498 -64087 -59556 39453 48420 -70592 -100659 -135161 -124831 -42865 77362
16378 77362 51876 20864 -27754 38678 20717 -13312 13942 26762 43687 45148 75979 30333
16366 30333 -26476 -22893 18336 30738 20467 -45855 -8606 33218 20548 -8994 -54558 -73009
16354 -73009 -40043 -22579 -24817 -749 2453 -21313 -58190 -86691 -77028 -48041 -62232 -128787
16342 -128787 -110679 -76591 -14108 -33432 -53229 -78955 -82088 -70984 47271 14514 17233 -38328
16330 -38328 -101397 -46807 -45411 -50721 -1879 -31000 -55569 -41539 18377 33831 45156 -13069
16318 -13069 -25387 -21925 -35867 -75063 -95018 -70474 -21901 12289 27048 43823 21368 43726
16306D3726M8883L3081n8652K7191L0370j6735k9289o46m5846k0896m9514m3767
16294h2094M444M3957P7900M4804o5489K9754k086l4927j4216l3031J3592O5185
16282D7793o277K8731N4816P693p4220J582r624l5196p0745N618n4287j9167O2699
16269f0584K6140R0613l814j3484N425J5239l2748r6363k03J2571k2052m9076
16257a28336j7612J0263N5928L7957J3088J8485j1795L3488N7923n2910j0853
16246E626j3013k5014p614l4568r065r143j2053q158p673L5758j1909K6467J2021
16233e8338J7739L0782K750k2291n5500K4770M4829o6326k1450m5585k3318L7681
16221a34257P9748p191j864j9996M5628Q6594m062r5031l6784Q1311m0181l5678
$$ plain form
16306 43726 92609 125690 67038 94229 124599 107864 78575 77929 32083 11187 -38327 -82094
16294 -82094 -77650 -33693 44207 89011 23522 53276 51190 16263 2047 -30984 -17392 47793
16282 47793 41516 70247 125063 132756 58536 60118 50494 15298 -55447 -49829 -104116 -123283 -60584
16269 -60584 -34444 56169 52355 38871 44296 59535 26787 -69576 -69779 -57208 -79260 -128336
16257 -128336 -145948 -135685 -79757 -41800 -28712 -10227 -22022 11466 69389 16479 5626
16246 5626 -7387 -32401 -40015 -74583 -83648 -92791 -104844 -113002 -120675 -84917 -96826 -70359 -58338
16233 -58338 -40599 -9817 -7067 -29358 -84858 -60088 -15259 -81585 -103035 -148620 -171938 -134257
16221 -134257 -54509 -61700 -63564 -83560 -37932 48662 44600 -50431 -87215 -5904 -46085 -81763
16209h1763Q665L2544O6047n4452l6491N2335Q725J4251q80O541J1179M086l7478
16196f691o724k7163K2253k5583k0636L3853O1459J5233j58142j07829J01165
16185a18805N5710M5467N2123M5063M199J9049J6092j9121n3125M7514j4286o2070
16173A7810P85J0497J4165k4083K046j5065j8024J623j4395R1640J5461m200n924
16160G2336p368m0429l2713K4100o189N1923P079k7427l5232J1494j773p6143
16148f0342o3185L3112k3851K6713L1833N2397Q3773J2332j680n142r4974k4180
16136c3194L0938j6815m9416m1378k3206M0266P8773M0305n899L5588L9027Q7137
16124A82126M3144m9978n9290k986m340k2728n5906o726J19188J4964r7037l7315
$$ plain form
16209 -81763 -73098 -40554 25493 -28959 -65450 -13115 -4390 9861 8981 15522 26701 30787 -6691
16196 -6691 -13415 -40578 -18325 -43908 -64544 -30691 30768 46001 -112141 -219970 -118805
16185 -118805 -63095 -17628 34495 79558 83757 102806 118898 99777 46652 94166 79880 17810
16173 17810 18595 29092 43257 19174 21220 6155 -11869 -10246 -24641 66999 82460 78260 72336
16160 72336 64968 24539 -8174 15926 9737 61660 68739 41312 6080 17574 15801 -60342
16148 -60342 -123527 -90415 -114266 -87553 -55720 -3323 80450 92782 91102 85960 -9014 -33194
16136 -33194 -2256 -19071 -68487 -109865 -133071 -92805 -14032 26273 20374 55962 94989 182126
16124 182126 225270 175292 116002 113016 108676 85948 30042 23316 142504 157468 60431 23116
16112B3116L4230K7252J2451j4114m0840o680J4580m2265k6681k5458o0629n5869
16100a60907J1923M3270N568J5135N5615M0982L8899O955q2641j2573K9225M2375
16088C3826R029m1392k3058j6371k8072M0649J17295j2180q6924M6073K7896J3608
16076H0379M0846P751K5487O4498j33288l1227L1769J8192l4633p1201j5926k9387
16064d6740p994M4747M347K6672k1326l8645j784O7003n5793j4317Q9779r719
16052C6230L4429p115m8581O026r285n3697K5327J391j1197m8654P7796Q2120
16040H4790m2049o3950l8414O9330p84M5737K1260K000j7645K9819M6365P214
16028A43673k6087l940j22835l8016O2496m0786r5457N275k5238J1514N3868N8354
$$ plain form
16112 23116 57346 84598 97049 82935 42095 35415 49995 7730 -18951 -44409 -105038 -160907
16100 -160907 -148984 -105714 -100146 -85011 -29396 11586 50485 57440 -25201 -37774 -8549 33826
16088 33826 42855 1463 -21595 -37966 -66038 -25389 91906 79726 -7198 38875 66771 80379
16076 80379 121225 128976 154463 218961 85673 54446 86215 104407 69774 -1427 -17353 -46740
16064 -46740 -54734 -9987 -5640 21032 -294 -38939 -40723 26280 -29513 -43830 45949 36230
16052 36230 70659 63544 14963 20989 11704 -41993 -16666 -15275 -26472 -75126 2670 84790
16040 84790 42741 -21209 -59623 9707 8923 54660 75920 77920 60275 90094 136459 143673
16028 143673 117586 113646 -9189 -47205 15291 -25495 -120952 -115677 -140915 -129401 -75533 -17179
16016a7179O2890J3989m2061k272k1867k7668l9955K3021k1504K4556M8406k6549
16004b6193j4185J984K810K6818L8429M5005j8027m6139K9402J3556j5551m843
15992C3066p1155J0003J0652J27431K3736o1217k8943K3719k3434k1012K7052
15981D9898k7007L4727l5888j8202R6148J07391J814j02100m7554k7710k8936
15970B581K0246m6848l2952L4655J1759J2546M8265l5870k9406L2455J5128k6729
15958E830l3547M5572N112k3964k5740K4703N7174k3047k6717m2002L2086k5363
15946b9903l0276O4803O5062n443N4281k9490j4923J982L9462p985j02355R082
15934A4297J2306L5019o1162q3160N4714M6052L9318M3055n7363m0990L865O993
$$ plain form
16016 -17179 45711 59700 17639 15367 -6500 -34168 -74123 -51102 -72606 -48050 356 -26193
16004 -26193 -40378 -38394 -35584 -8766 29663 74668 56641 10502 39904 53460 37909 33066
15992 33066 -38089 -28086 -17434 109997 133733 72516 43573 67292 43858 22846 49898
15981 49898 22891 57618 21730 3528 99676 207067 208881 106781 59227 31517 2581
15970 2581 22827 -24021 -56973 -22318 -10559 1987 50252 14382 -15024 17431 32559 5830
15958 5830 -27717 17855 22967 -997 -26737 -2034 55140 32093 5376 -36626 -4540 -29903
15946 -29903 -60179 4624 69686 64243 118524 89034 74111 76093 115555 107570 5215 14297
15934 14297 26603 61622 460 -82700 -27986 18066 57384 100439 43076 2086 5951 12944
15922A2944K6516J1237n8771m6254j6146M5362Q616M9179L004K4377L4205m9196
15910D5073q296K0145K8380M0285p6706l6886O3759p2619j06700P7878M4081K4525
15898D2919J4258K9767j8627J7397P535m4064O4208N1852k9909r049k9699j5916
15886H0672M3067l1906n6168N7329K9264m6006M018m5392j03942K571L7110J2596
15874a6787l2815L3271M154n2056N9182n426j12138m0045L2682O0776J7881M97
15862e0824L2025N2978j5053k6906K426p760P121M0269O4340J9371J1405o8232
15850F1160l6063k617r4555j2144M1217M4096n0221q313r073M2806M0783J7723
15838C4799L575J6053J0458m391q471j5343J4554j9821k2634K6467N215k5244
$$ plain form
15922 12944 39460 50697 -8074 -54328 -70474 -25112 -16496 32683 35687 60064 94269 45073
15910 45073 36777 56922 85302 125587 48881 11995 75754 3135 -103565 -25687 18394 42919
15898 42919 57177 86944 68317 85714 93249 49185 113393 165245 135336 126287 96588 80672
15886 80672 123739 91833 35665 92994 122258 76252 80270 34878 -69064 -66493 -29383 -16787
15874 -16787 -49602 -16331 -12177 -64233 -5051 -10477 -122615 -162660 -129978 -69202 -51321 -50824
15862 -50824 -18799 34179 19126 -7780 -5354 -13114 -5993 34276 98616 117987 129392 61160
15850 61160 25097 22480 -72075 -84219 -43002 1094 -49127 -57440 -66513 -23707 17076 34799
15838 34799 38374 54427 64885 60494 52023 36680 51234 31413 8779 35246 40461 15217
15826A5217O5569L3572N0432p0113j00868M2844R2261M0660q8124q0699J0328
15815A1079K4882J8754J0991J4290k3074K5148K46P191j5152j5280n502K5857
15803G9430K4172P885O101j35043o9958k2536N0270Q8723L0216k2353J5884P408
15791F0199n727k7093k2430L7332J1923j2982J1564J679j2270K2616p349j9612
15779C7850n6463l005J6376L2280k113l2863O0118o147K0108l6912j6598p170
15767E461r316O3399K3663M7443l9444K6719Q2902k3855o6851o1866J6353J9253
15755H3861n3866j20430k87R5488N4129q921J6850j9285k4873m0257r453O4602
15743C7558K1139M5541k777l9102q3847L1498N8618J8926M5429L4810L7618n5101
$$ plain form
15826 15217 80786 114358 164790 94677 -6191 36653 128914 169574 81450 751 11079
15815 11079 35961 54715 65706 79996 56922 82070 82316 89507 74355 59075 53573 79430
15803 79430 103602 111487 117588 -17455 -87413 -109949 -59679 29044 59260 36907 52791 60199
15791 60199 54472 27379 4949 42281 54204 41222 52786 54465 42195 64811 57462 37850
15779 37850 -18613 -21618 -5242 27038 24925 -7938 52180 46033 66141 29229 12631 5461
15767 5461 -3855 59544 83207 130650 91206 117925 200827 176972 110121 48255 64608 83861
15755 83861 29995 -90435 -90722 4766 58895 49974 66824 47539 22666 -17591 -27044 37558
15743 37558 58697 104238 101461 62359 -21488 10010 68628 87554 132983 167793 205411 150310
15731A50310o3070j4544O2920p993K7957K2482r4106o4863n065K2838L3518l407
15719F6977q8540q032N6443L6830N6377j7813M663l4354l2486J2551N6664q125
15707A01155M3341j9295l1278n0197j51795m2125O0705l5567J8409L9812l710
15696g0545K8987N9078J7750k4061K8629j2707K8241m3692q7957N7776J8560l9914
15684c9855J889m2545J1985K0092N9075R991l7871N968L3231M5457m0994p6281
15672d9858O5500J1543p856j500Q7249L9314p107m8014l4078J5826K2388j5307
15660G8100K1998J3279l0320n4975N3683J5979j7272r214k0806j3920J109L9744
15648G7385J0835k296R578k3911N6197O948l2686j7899J7277K4452j0596Q2292
$$ plain form
15731 150310 87240 72696 135616 127623 155580 178062 83956 19093 14028 36866 70384 66977
15719 66977 -21563 -29595 26848 63678 120055 102242 106905 72551 40065 52616 109280 101155
15707 101155 144496 125201 93923 43726 -108069 -150194 -89489 -125056 -106647 -66835 -70545
15696 -70545 -41558 17520 35270 11209 39838 27131 55372 11680 -76277 -18501 59 -39855
15684 -39855 -37966 -80511 -68526 -48434 10641 20632 -17239 -11271 21960 67417 26423 -49858
15672 -49858 15642 27185 19329 17829 105078 144392 137285 89271 55193 71019 93407 78100
15660 78100 100098 113377 83057 28082 81765 97744 80472 71258 50452 36532 37641 77385
15648 77385 88220 85924 95502 71591 127788 134736 102050 84151 101428 125880 115284 197576
15636A97576l7172p6305n9467J8251N8146m7755k6096J3134l6736M3385Q4344
15625A31305O4974N6559j12024j13441m0783P318n1511j7488Q8451K7370k1434
15614A9296O225J3543J3594o12r2141j9125k2228N3366K4236P5591O2441J1382
15602A45568m254j8870m606r6559r7782M6458J7190K5053Q3022O6366K6766k9500
15590A58852o0163m0501j3880k2612q350j8834O1214K2222k1183m9146o2115Q8736
15578C4240O1606n658R1872n098n7504M009m7020R795J6054o3266l4772O9700
15566G3958K1000k6431k9887k811M7895K3205q4535k6481m2062L8497Q0292L0229
15554A02869j5674N040r5046j8735K5126R6018j3925j8121J4381p181j2451n256
$$ plain form
15636 197576 160404 84099 24632 42883 101029 53274 27178 40312 3576 46961 131305
15625 131305 196279 252838 140814 27373 -13410 -6092 -57603 -75091 13360 40730 19296
15614 19296 25521 39064 52658 52046 -40095 -59220 -81448 -28082 -3846 71745 134186 145568
15602 145568 141314 122444 117838 21279 -76503 -30045 -12855 12198 95220 161586 188352 158852
15590 158852 98689 58188 44308 21696 13346 -5488 55726 77948 56765 7619 -54496 34240
15578 34240 95846 90188 182060 176962 119458 123467 76447 86242 102296 39030 4258 73958
15566 73958 94958 68527 38640 35829 83724 106929 22394 -4087 -46149 -7652 72640 102869
15554 102869 87195 92235 -2811 -21546 3580 99598 85673 67552 81933 74752 62301 57045
15542E7045l9681L7088l7337k3680N2634J06161K035K477k6630m4334m2621k5183
15530A7974k3500K8568O4114L2593k579Q614K885L900k7826k9688K5753K7471
15518A28279j2586p655m672J0804K1166m0775k6203Q5219J09825n648r0726k1123
15506A45905r3139o4337R363Q9250N5537m499m7365o913M4419m7099m6429M1665
15494G6358K3257M7141K2755k2955l9473n4820l8750l7003r229R6345K1374p4267
15482A0733j4492L6177P3202J8920k2935K4986q2848J129K1136l5726n0105M9219
15470B9396L2702j5340j917N433K4405L2092m5037N3356o071q805P688m090n0964
15457E2848o1545l1896K4034R0244J3664p1521q8911j2940L7206M8867K2694o9460
$$ plain form
15542 57045 17364 54452 17115 -6565 46069 152230 154265 156742 130112 85778 43157 17974
15530 17974 -5526 23042 87156 119749 117170 125784 128669 132569 104743 75055 100808 128279
15518 128279 115693 108038 103366 114170 135336 94561 68358 153577 263402 257754 167028 145905
15506 145905 52766 -11571 -2208 87042 142579 138080 90715 83802 128221 81122 34693 76358
15494 76358 99615 146756 169511 146556 107083 52263 13513 -23490 -32719 63626 85000 10733
15482 10733 -3759 32418 105620 124540 101605 126591 43743 44872 66008 30282 -19823 29396
15470 29396 62098 46758 44841 50274 74679 106771 61734 115090 109019 100214 107902 103812 52848
15457 52848 -8697 -40593 -16559 73685 87349 15828 -73083 -86023 -48817 50 22744 -46716
15445d6716j7021J9723L5958N7110J7714k3675O6834K1072m6397k6043r8869J325
15433c8985L0220M7588N6517k1416K6078J363O3512P367j24097o1010l633R9503
15421H3007p246p8864m3018O1780O5128n798k2476j1660P6265N6798k4596K3209
15409A72529K6143L8595n1381m9612r3712l1541P9198K9046r543k7383L6895l5114
15397H4120l1989o194m8084r06L6353N726J9825O267J5808J7964r599K5635Q3915
15384A98841m7854j2476p9065r136K1867k8570k9277j6644L3324J8159j0905k9803
15372H461J5405L971j1401N2107L1126n7616j898J2549m812P39J454N9387J5135
15359A24607L170q1283q2249j120k521K6328N1157L1148N4823P990L3938P997
$$ plain form
15445 -46716 -63737 -44014 -8056 49054 66768 43093 109927 130999 84602 58559 -40310 -38985
15433 -38985 -8765 38823 95340 73924 100002 101365 164877 172244 48147 -12863 -16496 83007
15421 83007 75761 -3103 -46121 15659 80787 74989 52513 40853 117118 173916 149320 172529
15409 172529 198672 237267 185886 136274 42562 11021 90219 119265 109722 82339 119234 84120
15397 84120 52131 45937 -2147 -3053 33300 39026 58851 65118 80926 98890 89291 114926 198841
15384 198841 150987 138511 59446 50310 72177 43607 14330 -2314 31010 49169 38264 8461
15372 8461 23866 27837 16436 68543 99669 42053 40155 52704 47892 48631 50085 109472 124607
15359 124607 127777 46494 -35755 -36875 -39396 -13068 38089 69237 124060 132050 165988 173985
15347A73985J0966P0448J755l7669m990R765O5973m8923o5834n1794p3567M0009
15335I0124K4645j8702l170n537o342n1251K6559N5445L7303L3069m2856k9784
15323A09503q0536K264J16581o2552p4508k2490O3415L2796o8490n6910k1449
15312f2376Q8106J8786L669L3085J7798L5774m0380k5424l9411M7329Q2677J03391
15300B63024L0339q3542p1031m2078k106J9658q6790O343R2056l6188m2786n5140
15288h241O9831J5362r348j485k4478O2080O2550M3860l3652n0837p6406o6086
15276a6850J5229M1500M3585N0024J9018Nn1293q9289k8174J13008K6079j8963
15264A03879o4428m4013O1318N2783K880l4528m780K6512J3318K5791p5192L8231
$$ plain form
15347 173985 184951 255399 257154 219485 214495 224260 290233 241310 175476 123682 50115 90124
15335 90124 114769 96067 92897 87360 81018 29767 56326 111771 149074 182143 139287 109503
15323 109503 28967 31231 147812 85260 10752 -11738 51677 84473 15983 -40927 -62376
15312 -62376 25730 44516 48185 81270 99068 134842 94462 69038 29627 76956 159633 263024
15300 263024 293363 209821 138790 96712 94606 114264 27474 33817 125873 89685 46899 -8241
15288 -8241 61590 76952 67604 66119 41641 103721 166271 210131 176479 125642 49236 -16850
15276 -16850 -1621 39879 83464 133488 152506 152511 101218 11929 -16245 96763 122842 103879
15264 103879 39451 -4562 56756 109539 112419 77891 73111 99623 112941 138732 63540 101771
15252A01771j9029l5729N5328O298m7824j2016O1136K7730l8028n6661L4369j6263
15240F1082k3800M9363N478j5621P4943K9605m9396J1021J0501N933k4671n0385
15228H4053k172O3103M3762K3246l7o0608l411K1792m0095J7012P6764K3850q0910
15215A66349p2603L5512j12523j00924J01558N1111K2520L526P4319K7229o237
15204A89837n7057k7106K9404k2251J6067j5707l4965k4890O3918L3245q785K738
15192A44448L6443m4269L4636j0927l868N6706N200r591m3278j16219j0528J4284
15180E3037P8321Q2225n0870n3144l8234Q357L8418M8007Q298p910l1195M2816
15168A78126J8354q054j0413o961J8290o103L2621J8316L9377m7450k9707m4791
$$ plain form
15252 101771 82742 47013 102341 108639 60815 48799 109935 137665 99637 42976 77345 61082
15240 61082 37282 86645 92123 76502 151445 181050 131654 142675 153176 159109 134438 84053
15228 84053 81881 144984 188746 211992 211955 151347 147936 169728 129633 146645 223409 247259 166349
15215 166349 93746 129258 16735 -84189 17369 68480 91000 94526 168845 196074 189837
15204 189837 132780 105674 135078 112827 128894 113187 78222 53332 117250 150495 141710 144448
15192 144448 180891 136622 171258 160331 156463 213169 218369 208778 165500 49281 38753 53037
15180 53037 131358 213583 162713 109569 71335 79692 118110 166117 174415 166505 135310 178126
15168 178126 196480 188426 178013 171052 189342 183239 215860 234176 273553 226103 196396 151605
15156A51605M2243M659o3814j3055N0892M7254n1550l5190N757L1217l7166j9113
15144A13739Q7p216R503j7277N8013m34M9953P2195j3284l8198q152k2352O7597
15131B64174Q1264K464l6998N113L0500J8772K2423L634J2711O6811K932l6444
15119D37356L0604R0538J7023R1741J22198J89739K03814J16012J37808J82407
15109A619240J05502P4730M2596o3417l4153o3331j26444j05284j66884k37364
15099A045191j93914j11847r0229m3064j1157q2527l2845n035k4213l9412k4429
15088C86519p8755l8209m4148k855M2295J6811K0870m2004J8678M895j4446j07691
15076A61960k2173M7729k1791O640k764j03856M5577M7186O4891Q0756J6167l5750
$$ plain form
15156 151605 193848 198507 134693 121638 172530 219784 168234 133044 138801 170018 132852 113739
15144 113739 113826 106610 116113 98836 156849 156415 206368 278563 265279 227081 218929 196577 264174
15131 264174 345438 347902 310904 316017 346517 365289 387712 391346 404057 470868 473800 437356
15119 437356 467960 558498 575521 667262 789460 979199 1183013 1299025 1436833 1619240
15109 1619240 1724742 1799472 1842068 1778651 1744498 1681167 1554723 1449439 1282555 1045191
15099 1045191 851277 739430 649201 606137 594980 512453 479608 474573 450360 410948 386519
15088 386519 307764 269555 225407 222552 264847 281658 302528 260524 279202 284097 269651 161960
15076 161960 139787 187516 165725 172365 169601 65745 111322 158508 223399 304155 320322 284572
15064B84572l1284k2505m0931k9536p5069j6491P1414Q1959O6866L9713N5292
15053C84000m1866q3396j446J6063j8550q1223o140L6259k1497n342J0819M856
15041A92537L2248l2011K9850k8333N5244l5588M4848Q328r340j9547j5493k9106
15029A93637o1635j2196J6008Q7932K5722K8863m5455M3231L3208L6562k6356
15018C19521l2081k089M0935P8471m0626j08625N8379J4788l3022J3614K7386
15007C36651N0074j5195n2439L864N905J0168m1869m491J0395k8148K2786J4478
14995C12179j3940J2367q1654p8004K5756k8275K2577L3944j2174l644N8980J4237
14983B62349o5596J9001j7022l3180k9892J6393M6990j5040K6394J9804k008p803
$$ plain form
15064 284572 253288 230783 189852 160316 85247 68756 140170 222129 288995 328708 384000
15053 384000 342134 258738 257292 273355 254805 173582 167442 203701 182204 176862 187681 192537
15041 192537 224785 192774 222624 194291 249535 213947 258795 267123 257783 238236 222743 193637
15029 193637 132002 119806 135814 223746 249468 278331 232876 276107 309315 345877 319521
15018 319521 287440 285351 326286 404757 364131 255506 313885 328673 295651 309265 336651
15007 336651 386725 371530 319091 322955 328860 339028 297159 292668 303063 274915 297701 312179
14995 312179 298239 310606 228952 150948 176704 148429 171006 204950 192776 189132 248112 262349
14983 262349 196753 215754 198732 165552 135660 152053 199043 184003 210397 230201 228193 220390
14971B20390M8864n601j6476m0340n7544O0876N2230P1458j571k4562m0494n5586
14959B11644L0654L5220k480J5449J8128N1226M5107K237o395j1584M720m8867
14947C45059M0415J6475r9230n698K678J8021O0152J4541o3813l5957k8215l8200
14935B26228m2798P4270Q661K5456J0181J7486j7721K1647Q4171N5575J0626m0589
14923D33193q0302j9978M0745J1873Q618j4740M2393M3415K3381K5437j2329j0302
14911D91404R914L0455k3108k2165K341k2561q1773k3070M0384L6480n1620k5261
14899C61420j03756j2877K6642l5861K6710O9643J8015r498L909j00420N0154
14888B94081N0821q8750o809J06728R3425L1076l8180p1688n8986N4908L4185
$$ plain form
14971 220390 269254 263653 247177 206837 149293 210169 262399 333857 332286 307724 267230 211644
14959 211644 242298 277518 275038 290487 308615 359841 404948 407185 400790 389206 393926 345059
14947 345059 385474 401949 302719 297021 299699 317720 377872 392413 328600 292643 264428 226228
14935 226228 183430 257700 266361 291817 301998 319484 301763 323410 407581 463156 473782 433193
14923 433193 352891 332913 373658 385531 394149 379409 421802 465217 488598 514035 501706 491404
14911 491404 501318 531773 508665 486500 488841 466280 384507 361437 401821 438301 386681 361420
14899 361420 257664 244787 271429 235568 262278 331921 349936 340438 344347 243927 294081
14888 294081 344902 256152 249343 356071 449496 480572 442392 370704 311718 366626 400811
14877D00811O905K0429k2801J9594n9347k9567K0978N2506O428J7305J1061K9617
14865D73919N2362m0900j6699q7809m4938M345o0861K958N9861M7028m7544m2884
14853B98838m1020L2043O2252P1883K6465J3887o094L3546n251k1440j3492l2990
14841D18627o6864M1425q064M5005N5240q76J5457Q989j9830o299j5896L0718
14829D97632K1776K4510N5588K9510N4899O1323R998l4104J7018O5801j1632j8428
14817G73891k9401k4279o3953n3605l7058O910R054l9248l9805o4118J08464Q1365
14805F28217J9562O7233k7751k6499R5896j2020l0062J9623K1445O1366m37o156
14793H10417L393N9756J0461p0768n7365R9799M0676j8928o1495j00152q8353
$$ plain form
14877 400811 407716 428145 405344 424938 365591 336024 357002 409508 415936 433241 444302 473919
14865 473919 526281 485381 468682 380873 335935 340280 279419 282377 342238 389266 341722 298838
14853 298838 257818 289861 352113 423996 450461 464348 458254 491800 486549 465109 451617 418627
14841 418627 351763 393188 385124 430129 485369 484493 499950 508939 489109 482810 466914 497632
14829 497632 519408 543918 599506 629016 683915 745238 755236 721132 738150 803951 792319 773891
14817 773891 744490 720211 656258 602653 565595 572505 581559 542311 502506 438388 546852 628217
14805 628217 647779 715012 687261 660762 756658 744638 714576 734199 755644 817010 816573 810417
14793 810417 813810 873566 884027 813259 755894 855693 896369 877441 815946 715794 627441
14782F27441p3066M1983K1343m096J7689M1944R6864R1897K0804o3142j5979P6524
14770H80206L1583L7235O5589k5545p1051R919k5380j0132O3645M8769n383J8827
14758A018282J3888O62P0296k450N638L2521k4133n832Q3659N3025M1432O057
14746A293045k7604M9466K0927K3995k036N1553q336J1837P8523N0267q984K6254
14734A558907L1962K8900M2747K612m7927M4713M1549J040K3736J06760J14922
14723A949921Q2503P9514L4814R0550L5079J33178P0220M8543J27970J27764J77898
14712B957954J72649R8469J08476J62898J96478K29394K63063L85901M27664M29811
14702E432757M27055M41514N12550N66488N84515O16964N90723N55257O08889
$$ plain form
14782 627441 554375 596358 617701 613605 631294 673238 770102 861999 882803 819661 803682 880206
14770 880206 911789 949024 1014613 989068 918017 927936 902556 892424 956069 1004838 999455 1018282
14758 1018282 1032170 1032832 1103128 1100678 1106316 1138837 1114704 1108872 1192531 1245556 1286988 1293045
14746 1293045 1265441 1314907 1335834 1359829 1357793 1409346 1401010 1412847 1491370 1541637 1532653 1558907
14734 1558907 1590869 1619769 1662516 1665128 1617201 1661914 1703463 1704503 1728239 1834999 1949921
14723 1949921 2032424 2111938 2146752 2237302 2272381 2405559 2475779 2524322 2652292 2780056 2957954
14712 2957954 3130603 3229072 3337548 3500446 3696924 3926318 4189381 4575282 5002946 5432757
14702 5432757 5859812 6301326 6813876 7380364 7964879 8581843 9172566 9727823 10336712
14693A0336712P88457R31320J078857J234324J581108J927742K317447K624026
14685B2819993L178240L831246M633029N958156P783969J0434566J3880954J8080984
14677I0601137K2769297K7442719L1277039L3710568L3976677L1582515K6519951
14670B97879903J8981189R509983r15756j1231341k0178974k7065376l1565739
14663B35413889l3281632l2466400k9771103k5858587k1410101j7088048j3227314
14656F2310704j0072462p788823o144918n025773m184410l509716l013755k623665
14648A9947182k239500j917894j735211j516867j217204j081565r44246q62393
14640H432302o48474n78934n73293n25877m28349l98757k69565l64267l54381
$$ plain form
14693 10336712 11125169 12056489 13135346 14369670 15950778 17878520 20195967 22819993
14685 22819993 25998233 29829479 34462508 40420664 48204633 58639199 72520153 90601137
14677 90601137 113370434 140813153 172090192 205800760 239777437 271359952 297879903
14670 297879903 316861092 326371075 325455319 314223978 294045004 266979628 235413889
14663 235413889 202132257 169665857 139894754 114036167 92626066 75538018 62310704
14656 62310704 52238242 44449419 38304501 33278728 29094318 25584602 22570847 19947182
14648 19947182 17707682 15789788 14054577 12537710 11320506 10238941 9294695 8432302
14640 8432302 7783828 7204894 6631601 6105724 5677375 5278618 5009053 4644786 4290405
14631D290405k65618j95360j84483k36502k54032k04209j78799j76680j49797
14622B444925j01716j67271j44952r4587n8603o2756j01556j21572p4533j28246
14612A389133p9684j62835j09922p1190q0857r4738K627l1238n1088l5637o7686
14601F06885r4203J1169K5415j6602l0590K7686L5076o193j164L6200M1536l2999
14589F02216j26880p8532M8374J4888l8464o8333j5364O503J632J233L9249P1701
14577D58223K142n9633q478q346K3490j0525n5049l533M3328p092J2082j0782
14565C75827P709N192n144n4824m1900J41999N0548J3787k7023p913N5609M594
14553E18461j8513r847j5720l9332K226M880k3701j00383k3264M1804N3808L8772
$$ plain form
14631 4290405 4024787 3829427 3644944 3408442 3154410 2950201 2771402 2594722 2444925
14622 2444925 2343209 2175938 2030986 1936399 1877796 1815040 1713484 1591912 1517379 1389133
14612 1389133 1309449 1146614 1036692 965502 884645 789907 792534 761296 710208 674571 606885
14601 606885 512682 523851 549266 532664 502074 529760 564836 558643 557479 593679 635215 602216
14589 602216 475336 396804 445178 460066 421602 353269 337905 344408 346040 347273 386522 458223
14577 458223 460365 400732 392254 383908 407398 396873 341824 338291 381619 374527 386609 375827
14565 375827 383536 388728 383584 328760 286860 428859 479407 493194 466171 458258 513867 518461
14553 518461 499948 490101 474381 435049 437275 442155 418454 318071 294807 336611 390419 429191
14541D29191J5360K5K8435K1514k6094J4971l7423o0498n1382J8287K7833l945
14529C76274N661K973J3474M9687o5329j39694j4541M2847l0528n6030k3944l1180
14517A29670O744l8049o628n0807N4300N9224O6914M8502P3142l9614L4197J15356
14505D52951L8459K6020o5338k2200O3839P0385k358M4179J30057J46100R3073
14494I75167Q975P8392J38642J55680J27839m118L9998R2758N0608n1668l2491
14483A579782j9485j14913j45115o0916o5748j44970k0765m2971m9046m0094L0485
14472I06244J6505r8008r6556k4814m5493K2655k5839l3505k7841k6825p1788
14461D94735M1815J05014Q5142q185J0004P0714j8304m8000j8714O040L1482j0626
$$ plain form
14541 429191 444551 444576 473011 494525 468431 483402 445979 385481 334099 352386 380219 376274
14529 376274 381935 384908 398382 448069 382740 243046 228505 271352 240824 184794 160850 129670
14517 129670 136414 98365 91737 40930 95230 154454 221368 269870 343012 303398 337595 452951
14505 452951 491410 517430 452092 429892 493731 564116 561758 605937 735994 882094 975167
14494 975167 984142 1062534 1201176 1356856 1484695 1480577 1520575 1613333 1663941 1612273 1579782
14483 1579782 1560297 1445384 1300269 1239353 1173605 1028635 1007870 964899 915853 875759 906244
14472 906244 922749 824741 728185 703371 657878 680533 654694 621189 593348 566523 494735
14461 494735 536550 641564 726706 718521 728525 799239 780935 732935 714221 720261 751743 741117
14449G41117m0910L8963N3520J6005K2350L5454Q0831K391j3726n9383n6985J9853
14437H39480O8198R167n0626Q7838O6355K0622N5045m6115l4609Q1734l7204k9626
14425A030259j6115m7752K8118N0302k8715K5510J6004M31k6334j6067J4998L8094
14413A068733m6486k8027L1761N1164p5812J3824J0543K356J9482N3297j7049
14402A083786k1856L068J4074N4723l0274k9487l3656m0844K209o3820k9051l229
14390I05643L6426N3713O0410K8173L461j33006J4535R619R057R062R691O495
14378A013279M5281l9576m3975N6956j4892n4881m5768n8j6181Q016N178m829
14366I08550O9435k822l4360m5833l5620J137L7413k6899r2522J5992N3560J2675
$$ plain form
14449 741117 700207 739170 792690 808695 831045 866499 947330 949721 935995 876612 819627 839480
14437 839480 907678 916845 866219 954057 1020412 1041034 1096079 1049964 1015355 1097089 1059885 1030259
14425 1030259 1014144 966392 994510 1044812 1016097 1041607 1057611 1058042 1031708 1015641 1030639 1068733
14413 1068733 1022247 994220 1025981 1077145 1001333 1015157 1025700 1028056 1047538 1100835 1083786
14402 1083786 1061930 1064998 1079072 1133795 1103521 1074034 1040378 999534 1001743 937923 908872 905643
14390 905643 942069 995782 1056192 1084365 1087826 954820 969355 978974 988031 997093 1006784 1013279
14378 1013279 1058560 1018984 975009 1031965 1017073 962192 916424 916366 900185 908201 913379 908550
14366 908550 977985 975163 940803 894970 859350 860487 897900 871001 778479 794471 848031 860706
14354H60706l0917K3515L2395l3175l8517K1621J4687q170m6120o9421k0259m3470
14342F62875m0834r847l4138K9999K2006L1178L5414O6306k3088q6389L7545N2854
14330G43881Q0523j0172p3898k4077K7142L1509L3597p4448n392j1552l898K9584
14318G42799l6558o1349m1587K8569Q6671J9126J0236K4622R386p7067n9105P2045
14306G17788M9o647J7147O6826m961o7075K6339K7453m8796l5319M4732M1103
14294G78639k6820p5149j9782K070n8371L3528M8173p280j0456K508o9k1833n467
14281F39691P819J4688k3105n5958J9333K527k3784l3622P3607K6878K0114m4236
14269F23952l5517K9469j1830m6646L4127n298J2437l8159L2381N5083j6814j7582
$$ plain form
14354 860706 829789 853304 885699 852524 814007 835628 850315 842145 796025 726604 706345 662875
14342 662875 622041 612194 578056 608055 630061 661239 696653 762959 739871 653482 691027 743881
14330 743881 824404 814232 740334 716257 743399 774908 808505 734057 728665 717113 713215 742799
14318 742799 706241 644892 603305 631874 718545 737671 747907 772529 781915 704848 645743 717788
14306 717788 717837 711190 728337 795163 790202 723127 749466 776919 728123 692804 737536 778639
14294 778639 751819 676670 656888 658958 600587 634115 682288 675008 664552 667060 666991 645158 639691
14281 639691 647510 662198 639093 583135 602468 604995 581211 547589 621196 648074 668188 623952
14269 623952 588435 617904 606074 559428 593555 588257 600694 562535 594916 649999 633185 615603
14257F15603K7343R073N4272L978m7915M7237k3157m1251n3283l8866J6058M3973
14245F13065K2035j4329N0916R1898N8091O7445J5318k9876M3793J06173K8272
14234A052801N0270N1833J17334K11340J99394J36598J29508J59397J29264J13691
14224B351430Q4323K8767o4524j03029j69291j65551j58081j56965j71455j12416
14214A363208o8909j13206j36953m7066N9268r5519r4986L3723J2303J691m8637
14203H64917k6487M0403K8886Q158P1671K1754L6601k0753q4205l9289O4044P0305
14191A036005l5430j2952l26M8500l920j1660m3270q643O588l9194l5240M6058
14179I46516J6389o0630O9108M6089N9091K4994J29929m2305n3234Q1314K0729
$$ plain form
14257 615603 642946 652019 706291 710269 662354 709591 686434 645183 591900 553034 569092 613065
14245 613065 635100 620771 671687 763585 821676 889121 904439 874563 918356 1024529 1052801
14234 1052801 1103071 1154904 1272238 1483578 1682972 1819570 1949078 2108475 2237739 2351430
14224 2351430 2435753 2464520 2399996 2296967 2127676 1962125 1804044 1647079 1475624 1363208
14214 1363208 1294299 1181093 1044140 997074 1056342 960823 865837 899560 911863 913554 864917
14203 864917 838430 878833 907719 915877 987548 1009302 1045903 1025150 940945 901656 965700 1036005
14191 1036005 1000575 987623 987297 1035797 1031877 1020217 976947 968304 974892 935698 900458 946516
14179 946516 962905 902275 971383 1017472 1076563 1101557 1231486 1189181 1135947 1217261 1237990
14168A237990j02213n8147J5111k7113J462O6844L5290q3292K6260m18l0811r249
14156A071714N3420J6038m341j4613k3536j6793L5074O6423m3227P2409R0587
14145A303155Q3576l7213R7238J2222N2042k3074l0951J8450L4168M6927j8072
14134A538468L4212N3773M0028R652J0962K4167Q9786M9868M3360J9770K6213
14123A940259K2848R2811M1526l9258L5804P3250K5892K0168O7321M2400j3508
14112B309513j7039L2305K5627M3979J37576J78701J9632K4538j704L9777J49467
14101B942372J03253J31450O7775N1728N9314J14348Q8802O1926J51442J23227
14091C895637R0893J81137J64312K02317J61380J85037J99255J66475O5848K10358
$$ plain form
14168 1237990 1135777 1077630 1092741 1065628 1067090 1133934 1169224 1085932 1112192 1111774 1080963 1071714
14156 1071714 1125134 1141172 1136831 1122218 1098682 1081889 1116963 1183386 1140159 1212568 1303155
14145 1303155 1386731 1349518 1446756 1458978 1511020 1487946 1456995 1475445 1509613 1556540 1538468
14134 1538468 1572680 1626453 1666481 1676133 1687095 1711262 1801048 1850916 1894276 1914046 1940259
14123 1940259 1963107 2055918 2097444 2058186 2093990 2167240 2193132 2213300 2280621 2323021 2309513
14112 2309513 2292474 2324779 2350406 2394385 2531961 2710662 2730294 2754832 2753128 2792905 2942372
14101 2942372 3045625 3177075 3244850 3296578 3355892 3470240 3559042 3620968 3772410 3895637
14091 3895637 3986530 4167667 4331979 4534296 4695676 4880713 5079968 5246443 5312291 5522649
14081E522649K95080K45203K60970K74349K94380L86972M02276M34378M37198
14072H553455M59834M57200N69829N98944O85350Q33464R31563J118827J312053
14063A5520519J446310J636415J891474K124796K487127K912720L413642L944011
14055C5377014M665563N612466O679413Q070350R923237J1851691J4077300J6403869
14047A12660903J8528824K0032010K0690635K0183666J8439164J5354143J1099162
14040B36988507N826347J5189n704301j0913945j5331196j8456078k0233613k0728502
14032A51462408k0027641j8481061j6466886j4198667j1855036r826421q141233
14025E2465463o706746n586581m776163m011858l423245l013678k488042k180509
$$ plain form
14081 5522649 5817729 6062932 6323902 6598251 6892631 7279603 7681879 8116257 8553455
14072 8553455 9013289 9470489 10040318 10639262 11324612 12158076 13089639 14208466 15520519
14063 15520519 16966829 18603244 20494718 22619514 25106641 28019361 31433003 35377014
14055 35377014 40042577 45655043 52334456 60404806 70328043 82179734 96257034 112660903
14047 112660903 131189727 151221737 171912372 192096038 210535202 225889345 236988507
14040 236988507 242814854 242830043 237125742 226211797 210880601 192424523 172190910 151462408
14032 151462408 131434767 112953706 96486820 82288153 70433117 60606696 52465463
14025 52465463 45758717 40172136 35395973 31384115 27960870 24947192 22459150 20278641
14017B0278641j931341j678524j510594j234436j102719r56827q73596q16505
14009A0174099o52454o28835o01809o21071m80006m08989m00923l49513l41250
14000E689249l72822k88564k61523l41263k97044k65283k23493k05305j41570
13991C292382j38260j36076j49242j66182j54262p3021j20606k20164j09321k7643
13981A997605j13142q6356j07783q2228q1382j37585n8434k8705m5006r470p503
13970A240011m3203o9440q7086j4563L8945j1613j11288o8183n8270k5377m069
13959G85864o4800m0496J9738o2509k6012O981l1476Q600R532k6056k5911p318
13947E46137P013Q8331J1076r9272n7512m8808q0373R864j4483j9697j7704l9590
$$ plain form
14017 20278641 18347300 16668776 15158182 13923746 12821027 11864200 10990604 10174099
14009 10174099 9521645 8892810 8291001 7669930 7189924 6780935 6380012 6030499 5689249
14000 5689249 5316427 5027863 4766340 4425077 4128033 3862750 3639257 3433952 3292382
13991 3292382 3154122 3018046 2868804 2702622 2548360 2475339 2354733 2134569 2025248 1997605
13981 1997605 1884463 1798107 1690324 1608096 1526714 1389129 1330695 1301990 1256984 1247514 1240011
13970 1240011 1196808 1127368 1040282 1025719 1064664 1053051 941763 873580 815310 789933 785864
13959 785864 721064 680568 700306 637797 611785 618766 587290 595890 605422 579366 553455 546137
13947 546137 553150 641481 652557 553285 495773 446965 366592 376456 361973 342276 324572 284982
13935B84982J591L0616L4570O1704n3843l8343k3292l7092l084K904n2956p2964
13923A34793j1725L0933O8307L7945o9663m9456O5280q035k4832M2369L5463n1286
13911B00093l4250n0683q3279M3350J6959k9454m3177o3257R835L7478j5472k4712
13899c6569m2041m1532l8624N9376k3010m1609m0837k6971K9557j931j6225p9929
13887c00345J0821J9544m2115N6555k8943M8438L9549J2704J344j1007J25080
13876f8375R6769Q0777r119m2051p5457m2738k7206o857j7826n0382M4452l0324
13864a48337l097J7493O2331J36572j407o2749n1735j2066p946k4896r6821O1199
13852a31459J12040K5526n1084j8801M8270J2536L2946j222L4482l5103M208m3426
$$ plain form
13935 284982 286573 317189 351759 413463 359620 321277 297985 260893 257809 260713 207757 134793
13923 134793 123068 154001 222308 260253 190590 141134 206414 198379 173547 215916 251379 200093
13911 200093 165843 115160 31881 75231 92190 62736 19559 -43698 -33863 3615 -11857 -36569
13899 -36569 -78610 -120142 -158766 -99390 -122400 -164009 -204846 -231817 -202260 -204191 -220416 -300345
13887 -300345 -289524 -269980 -312095 -255540 -284483 -236045 -196496 -183792 -182448 -193455 -68375
13876 -68375 28394 109171 100052 58001 -17456 -60194 -87400 -94257 -112083 -162465 -118013 -148337
13864 -148337 -151434 -133941 -71610 64962 63555 806 -50929 -62995 -70941 -95837 -192658 -131459
13852 -131459 -19419 6107 -44977 -63778 -15508 -2972 29974 28752 63234 28131 32339 -11087
13840a1087K2r122m5223J3364M8054k40j3378Q226n5950j1678M4381m687j9275
13827e6593L6981O8106k5334k6076m5189o2011k0625J05655K5610l1855j1230
13816d2561m3801P0263j6822n8789N5970O8833O752n1646p348K7917J8037M382
13804C1187J9930L5925l910k0711j6465J7079P475j1591m7018p2095O199l1968
13792h5963l6846k7388m711L360k7602r479M7809M1592l6778L36l3093o2067M226
13779b26604Q1219K5583M6506Q4061M856R076p9210M6431k3543l7992L7077K8378
13767d162P14L497q0409o2558L5161M3837n817k4633n5679K2131J02502l3399
13755e8815l5474m4119k806R977o2758J120L6956P2731O2768M8983l3494m6005
$$ plain form
13840 -11087 -11065 -20187 -65410 -52046 -3992 -4232 -17610 -9384 -65334 -77012 -32631 -37318 -56593
13827 -56593 -19612 48494 23160 -2916 -48105 -110116 -130741 -25086 524 -31331 -42561
13816 -42561 -86362 -16099 -32921 -91710 -35740 33093 39845 -11801 -19149 8768 26805 31187
13804 31187 51117 87042 83132 62421 45956 63035 70510 58919 11901 -60194 -53995 -85963
13792 -85963 -122809 -150197 -154908 -151548 -179150 -188629 -140820 -99228 -136006 -135670 -168763 -230830 -226604
13779 -226604 -145385 -119802 -73296 10765 15621 24697 -54513 -8082 -31625 -69617 -32540 -4162
13767 -4162 -3448 49 -80360 -142918 -107757 -63920 -69737 -94370 -150049 -127918 -25416 -58815
13755 -58815 -94289 -138408 -141214 -131237 -193995 -192875 -155919 -83188 -20420 28563 -4931 -50936
13743e0936j4273K3091l1713p110M5588p5071N775L5937L0536K5595o6414j01612
13731a80607p4876N9818Q9741Q7278O90K7442r958l5987l6993q369j8924j6227
13719a16972K9867n0326J2456q466o7976K093J10876N1154R666J7058k1059p7079
13707a08708m3224N7527k7212o8804Q065R608P2041P4373R120k754l5285M2721
13695a2532m3401k5321j3290o1672o6938j3369Q2835R864J4928j0685l7039N3505
13683a23115Q2965l3277q3612J0678M4739K2594Q3915o065k5334k159r7495J6521
13671a09645P233l177K0134l2490N7112L5768K1871q7477m6906j2096M4829N4318
13659e0526j9488M5303K0730l7270N410k1190J346K4556J2165r259n5269j414
$$ plain form
13743 -50936 -65209 -42118 -73831 -80941 -35353 -110424 -104649 -68712 -38176 -12581 -78995 -180607
13731 -180607 -255483 -195665 -105924 -18646 -17956 9486 -472 -36459 -73452 -81821 -100745 -116972
13719 -116972 -87105 -137431 -124975 -133441 -201417 -199324 -88448 -37294 -27628 -10570 -31629 -108708
13707 -108708 -151932 -94405 -121617 -190421 -182356 -172748 -100707 -26334 -17214 -19968 -55253 -12532
13695 -12532 -55933 -81254 -94544 -156216 -223154 -236523 -153688 -143824 -128896 -139581 -176620 -123115
13683 -123115 -40150 -73427 -157039 -146361 -101622 -79028 4887 -1178 -26512 -28671 -126166 -109645
13671 -109645 -102412 -105589 -85455 -117945 -60833 -25065 -3194 -90671 -137577 -149673 -104844 -50526
13659 -50526 -70014 -24711 -3981 -41251 -35841 -57031 -55685 -31129 -18964 -28223 -83492 -84906
13647h4906j921q833O0176l9715l4396n0743j3628J1321j2804L0611J9731N7738
13635f7369J23582M9154j40120m7795k370N6128R089n6404N2294j9421J4419m5090
13623g3903j1220L001l6308k4145K5806l3616O7883J22954L177l6997l3502k9625
13611e6495k8877M317j9341j7897Q4496L8404M30M6507O3621j8863K3849J5960
13599A36111L6338J03937R3114P4430M2143O6131J24138R8433Q7502J08078R9792
13588A070147P1501J2103J3716n2017p7184r0755j25815n0776J5584r5265j04433
13577E86806j40375j40566l3159N150o0850r8690o5554K9777K2182J6058L6469
13566A57248n1756m2092p7301m4922J3592Q466J20977j8645k6830n1757j6537
$$ plain form
13647 -84906 -86827 -95660 -35484 -75199 -109595 -160338 -173966 -162645 -175449 -144838 -125107 -67369
13635 -67369 56213 105367 -34753 -82548 -84918 -28790 -19701 -76105 -23811 -43232 -28813 -73903
13623 -73903 -85123 -82122 -118430 -142575 -116769 -150385 -82502 40452 43629 6632 -26870 -56495
13611 -56495 -85372 -81055 -100396 -118293 -33797 4607 5037 51544 115165 96302 120151 136111
13599 136111 172449 276386 369500 443930 486073 552204 676342 774775 862277 970355 1070147
13588 1070147 1141648 1153751 1167467 1115450 1038266 947511 821696 770920 786504 691239 586806
13577 586806 446431 305865 272706 277856 217006 118316 52762 82539 104721 120779 157248
13566 157248 105492 63400 -13901 -58823 -45231 -36765 84212 65567 38737 -13020 -29557
13555b9557o792l283j8505n912J1704J2974L7168K7351L918k725l5463q1861l6371
13542a27354M7700J21884J5010l6136R129k6669L5146k531p1381n4264N2087K7721
13530i658K2977k7582o1803K06J4606L5421L0480k359k7564l9829j02701l604
13518a71410K4224O2031J5521m1640N3281N4902K1203N656K4800k9050r650l6545
13506b6677n3400m3045L519k8938K8867m3376l2950L2362L5761P384j146K9340
13494i2299K3188n6526q9701M9099J09412j576l9952R3381J9832L7723j691o1136
13482a0246o1623l7523L1702l0134K206M2194j5417k0512O548J1360M0918M4841
13470D314n2847q881K95l3960n4360m5614L1723J826J1056N3395n196o9674r5330
$$ plain form
13555 -29557 -36349 -39632 -58137 -64049 -52345 -39371 -2203 25148 29066 26341 -9122 -90983 -127354
13542 -127354 -79654 42230 57240 21104 30233 3564 38710 36179 -35202 -89466 -37379 -9658
13530 -9658 13319 -14263 -76066 -75860 -61254 -25833 4647 2288 -25276 -65105 -167806 -171410
13518 -171410 -147186 -85155 -69634 -111274 -57993 -3091 18112 23768 48568 19518 9868 -26677
13506 -26677 -80077 -123122 -119603 -148541 -119674 -163050 -196000 -163638 -127877 -120493 -121639 -92299
13494 -92299 -69111 -125637 -215338 -166239 -56827 -58403 -98355 -4974 14858 52581 50890 -10246
13482 -10246 -71869 -109392 -77690 -107824 -105618 -63424 -78841 -99353 -92805 -81445 -40527 4314
13470 4314 -48533 -57414 -57119 -91079 -145439 -191053 -159330 -157504 -146448 -93053 -98249 -167923 -263253
13457b63253j1277M7195N5637O9769M4319j8634O1648k8807J5233J6053p3093
13446h5210m6583p913o1184K5998J8311L1177N1424k1860p802L1835K5208r836
13434e6435l8790k1943o456L3425P806Q1639J8311n5313j3382J8027l231p3553
13422a09895M1896J5564o7199M092M2637M0854k8956o7406r7L4816P6041R5092
13410G7439L4133j3194n6648j9425n7289m2448q866M296L6736M8437K3009O0788
13398H6968j3238p7858p6411L891p0078P974J11280P5015k8436j2798l1730k0073
13386d5494K8938l9301o0482l6458M4222j312N4440M9054j4168k7380l8625k2899
13374a09465l8776N9447L6417J0843j386Q227M9179j761o0679j15915M2087P4619
$$ plain form
13457 -263253 -274530 -227335 -171698 -101929 -57610 -76244 -14596 -43403 -28170 -12117 -85210
13446 -85210 -131793 -139706 -200890 -174892 -156581 -125404 -73980 -95840 -103642 -71807 -46599 -56435
13434 -56435 -95225 -117168 -123624 -90199 -82393 -754 17557 -37756 -51138 -33111 -36342 -109895
13422 -109895 -67999 -52435 -119634 -115542 -72905 -32051 -61007 -128413 -128510 -93694 -17653 77439
13410 77439 111572 98378 41730 22305 -34984 -77432 -86298 -82002 -45266 3171 26180 86968
13398 86968 73730 -4128 -80539 -76648 -146726 -138752 -27472 47543 19107 6309 -25421 -45494
13386 -45494 -16556 -55857 -116339 -152797 -108575 -109887 -55447 -6393 -20561 -47941 -86566 -109465
13374 -109465 -148241 -88794 -52377 -41534 -42920 -34693 14486 12725 -47954 -163869 -121782 -47163
13362d7163O0318K2354l5330j9901N741j9269K0344Q7358L9956n3903j04702m5401
13350h9598j5302O2770N2277N7450M9243j8902l9903M034l3991n3094J6367k6184
13338c4833L5921Q935m6251l6073j3705J2658J077q093J1690j3479J121O0452
13326b0580N7377J4106n8031m636M3689k459o6977k3914M1037m142j7806O1058
13314A8722J9728j8754J1825q548o5381K5759k6662l9737L8785R968N0900M7352
13302F3957Q564K5096k254j9282p5707N497p175l6667O5593P4683r06j44325j1582
13289e4508P158m0128p2928n7413Q5236P5162j6811l3976J4359P8455J0306N3775
13277D8687J2292n7323p276J6108P43l7427L3251L7745k4048k9150K999J5769
$$ plain form
13362 -47163 13155 35509 179 -19722 -13981 -33250 -12906 74452 114408 60505 -44197 -89598
13350 -89598 -104900 -42130 10147 67597 116840 97938 58035 62069 28078 -25016 -8649 -34833
13338 -34833 1088 10023 -36228 -72301 -86006 -73348 -72271 -80364 -68674 -82153 -81032 -20580
13326 -20580 36797 50903 -7128 -11764 31925 29466 -37511 -61425 -20388 -24530 -42336 18722
13314 18722 38450 19696 31521 22973 -42408 -16649 -43311 -83048 -44263 -34295 16605 63957
13302 63957 72521 97617 95363 76081 374 5871 -1304 -37971 27622 102305 101399 -42926 -54508
13289 -54508 -47350 -87478 -160406 -217819 -132583 -57421 -74232 -108208 -93849 -15394 -5088 48687
13277 48687 60979 3656 -3620 12488 13231 -24196 9055 46800 22752 -6398 -3399 12370
13265A2370m0599N5604O7281O897r8973p7885M815L7407L3924Q632o2797l738
13253e7062r0977J082M3849j5755O288N8241R1351K5839p947l6041q6362o8355
13241a35849O6456J9355J6267o2230K5072J0752M6648L6431m3156P756m008k1874
13229c8380N0009J0284n2486r1191R159J9127k5372J4224K1348M4274n571k1486
13217f6061J4117n7j1366p21q810m2802o4238P7137Q8559J0828o0818J700K5738
13204c6794J4673l0082k2713k7702J9525L4457L4555J9502k7637k6413l567j6081
13192f8277K1805j4191M277K4574K1940N6366n8380l965R427K870j5183J8417
13180c20k0825m6843o1976o018O6567P1047L0890m2583m9411m4226L7459K4385
$$ plain form
13265 12370 -28229 27375 94656 101553 2580 -75305 -70490 -33083 841 9473 -53324 -57062
13253 -57062 -148039 -146957 -103108 -118863 -112575 -54334 37017 62856 54909 18868 -67494 -135849
13241 -135849 -69393 -50038 -33771 -96001 -70929 -60177 -13529 22902 -20254 -12498 -16506 -38380
13229 -38380 11629 21913 -30573 -121764 -112605 -93478 -118850 -104626 -83278 -39004 -44575 -66061
13217 -66061 -51944 -52001 -63367 -64088 -72898 -115700 -179938 -102801 -14242 -3414 -64232 -62532 -36794
13204 -36794 -22121 -52203 -74916 -102618 -83093 -48636 -14081 5421 -22216 -48629 -52196 -68277
13192 -68277 -46472 -60663 -56386 -31812 -9872 46494 -11886 -15851 -6424 -3554 -18737 -320
13180 -320 -21145 -67988 -129964 -135982 -69415 1632 32522 -10061 -59472 -103698 -66239 -41854
13168d1854M646M7259J9656m4086K2217k2386l0031O3253J7358k7875n3602m3211
13156h8656R7928M4231m1321o3914j0469P6534K9653o801J6201O1993m2890p4713
13144b224J829K1408O9451J0902K272n3174q3327l7107j2325J00636m800p365
13132F176q6795n7858J1512L2570L3818K4865R5805N9122J7866j937m7777o7307
13120B0060K5003K3984j4163m9254K2346J4389n6742j0827k6858m1195j1115m431
13108a08803J9200k3103m2456R1461K9295j6846L8811R9844R7620M2801j6911
13097B10913q4374j6607L9938L5526j29639p7369j3371j3398k2902K9187R8559
13086E6463P3676m2563k7553l8526o6522l4067j4335K2203j3498l7043k5051l661
$$ plain form
13168 -41854 -37208 10051 29707 -14379 7838 -14548 -44579 18674 36032 8157 -45445 -88656
13156 -88656 9272 53503 12182 -51732 -62201 14333 43986 37185 53386 115379 72489 -2224
13144 -2224 -395 21013 90464 101366 103638 50464 -32863 -69970 -82295 18341 13541 6176
13132 6176 -80619 -138477 -126965 -94395 -60577 -35712 60093 119215 137081 135144 87367 20060
13120 20060 45063 69047 54884 5630 27976 42365 -14377 -25204 -52062 -93257 -104372 -108803
13108 -108803 -89603 -112706 -155162 -63701 -34406 -51252 -12441 87403 185023 227824 210913
13097 210913 126539 109932 149870 185396 55757 -21612 -34983 -48381 -71283 -42096 56463
13086 56463 130139 87576 60023 21497 -45025 -79092 -93427 -71224 -84722 -121765 -146816 -150477
13074a50477J4924O063l2460O136N1134J9435M784K0859K9973j4141q735K8987
13062b3518R0380m1289k1751N6289N6294l1293l6805J2604K7405m6060q6806j0212
13050e4762N3143K5775J0416l3287p6621J1675j7725n315N931j4688M0533L5591
13038a9334k3708k5442j5040M7363o620j2415P2209j2658L8763K8916j7905L259
13026E7388k886j2277N639L0666o4042j2363l4608n0654J4673P850J9516J4133
13014b6965R2487O0041l2959n9716n1055j3364n4847J4860J446k4175O7956K0009
13002f282j0923k1827j7198r976M0282O315n0697m1852O381O0198M5828L019k8191
12989b4923J1693m496m2535l000M3149K2294M436P6385M3168n0117o2638L592
$$ plain form
13074 -150477 -135553 -129490 -161950 -155814 -104680 -85245 -80461 -59602 -29629 -43770 -52505 -23518
13062 -23518 66862 25573 3822 60111 116405 85112 48307 60911 88316 42256 -44550 -54762
13050 -54762 -1619 24156 34572 1285 -75336 -63661 -81386 -86701 -80770 -95458 -54925 -19334
13038 -19334 -43042 -68484 -83524 -36161 -42781 -55196 17013 4355 43118 72034 54129 57388
13026 57388 54502 42225 47864 78530 14488 2125 -32483 -83137 -68464 -60614 -41098 -26965
13014 -26965 65522 125563 92604 32888 -18167 -31531 -86378 -71518 -70072 -94247 -26291 -6282
13002 -6282 -17205 -39032 -56230 -66206 -25924 -19609 -70306 -112158 -105777 -45579 249 3268 -24923
12989 -24923 -13230 -17726 -60261 -63261 -20112 2182 6618 83003 126171 76054 13416 17008
12977A7008j0894n2656j0789p533N8912P0464K1191o0633l4711l9363j124p565
12965e7693K802M4762l8399p143k7126m826j0634M4321O297p0891M7873L2198
12953c8459m1095p0367K1701L1830N8621j3261M5361J00319L7085k1373L9369
12942A49731K3489k4131m3029j03074o05J5008J7615J3544R603r2348l9895K9056
12930d5036k8795q409K3317J6531l7857K9431N6348j8417o119q533J2364O6843
12918E1668P557J1730r867J9860M8068l5099k826j0189m5103K3776m2054O259
12906B3780M1405K4617k3836m6241N652k689J4295J0026L0204K5419l822L5657
12894A34467p9095o4792M7282Q7696R6798P6172q5700n1725N2353P3221p3l1443
$$ plain form
12977 17008 6114 -46542 -57331 -64864 -5952 64512 85703 25070 -9641 -49004 -50128 -57693
12965 -57693 -54891 -10129 -48528 -55671 -82797 -87623 -98257 -53936 -47639 -118530 -70657 -38459
12953 -38459 -79554 -149921 -128220 -96390 -37769 -51030 -5669 94650 131735 110362 149731
12942 149731 173220 149089 106060 2986 2381 17389 35004 48548 58151 -34197 -74092 -45036
12930 -45036 -73831 -82240 -58923 -42392 -80249 -50818 5530 -12887 -19006 -27539 -15175 51668
12918 51668 59225 70955 61088 80948 129016 93917 91091 80902 35799 59575 17521 23780
12906 23780 65185 89802 65966 19725 25377 22688 36983 47009 77213 102632 98810 134467
12894 134467 55372 -9420 37862 125558 222356 298528 212828 161103 213456 286677 286604 255161
12882B55161m5391n2554r930M9495K4688L6055k902m1891m0268P282K8695k7327
12870A81113j23762k7469M5777k7027n0500k0447K6057l0613k1880J4778O0147
12859B6174j9645m8541M7760j0699p3140k0554K3621L764j353J8861j1514m7068
12847a12334M4590K4485R060L7756j303M1268k1565n0706q4731K9517L2495j3782
12835f5250j5624j6594L9092K2819O816J0466Q3219N0173L182L909L7424m0205
12823A19427J6080J17908j6788j03864j13360M7502L0173K4039l786K0815k2569
12812A15577K4604K9406o6743j0226k0517L958K5198o9516N0489K7965J4708j840
12800A23063j11787k7452J42404j0062j1891o4018j3912J9790R920j0790l2694
$$ plain form
12882 255161 209770 157216 147286 196781 221469 257524 254622 212731 172463 179745 208440 181113
12870 181113 57351 29882 75659 48632 -1868 -22315 3742 -26871 -48751 -33973 26174
12859 26174 6529 -42012 5748 -4951 -78091 -98645 -75024 -71260 -72613 -53752 -65266 -112334
12847 -112334 -67744 -43259 -34199 3557 2254 43522 21957 -28749 -113480 -83963 -51468 -65250
12835 -65250 -80874 -97468 -58376 -35557 -28741 -18275 64944 115117 118299 122208 159632 119427
12823 119427 135507 253415 236627 132763 19403 66905 97078 121117 117331 138146 115577
12812 115577 140181 169587 102844 92618 72101 76059 101257 31741 82230 110195 124903 123063
12800 123063 11276 -16176 126228 116166 104275 40257 26345 46135 56055 45265 12571
12789A2571L020J6545k1610l1487k3936O60N2801O684p3438j2637J6470K3078
12777c1279R7741M297K181K0245j2142O118j3223m0362L9671j577m3938p0684
12765d2952M6196j2881m789n6882J5161P9935L5100n9709p9144K7130M0743L6034
12753B3942j9850K025J4364J8499M2303L0435q1537p3415p299m2872l4784J481
12741a26708P5362L8970R3164l2110l2613j7051n939P2701Q0893J3623o5813r959
12729H4520J0341J0818n9585K70L1387M1784j9843q269R726m9452k8461m0920
12717a7684l8399J3605M6110p506K0668P6699L758j7532l4863J0828Q9358K5453
12705A70495j44927q6537k3907M2310K9596J1494J0588O9135l5277M8036K4316
$$ plain form
12789 12571 15591 32136 10526 -20961 -44897 -44237 8564 15248 -58190 -70827 -54357 -31279
12777 -31279 66462 70759 72940 93185 81043 87161 73938 33576 73247 71670 27732 -42952
12765 -42952 3244 -9637 -14426 -71308 -56147 23788 58888 -821 -79965 -52835 -12092 23942
12753 23942 4092 6117 20481 38980 81283 111718 30181 -43234 -50533 -93405 -128189 -126708
12741 -126708 -51346 -12376 80788 48678 16065 -986 -6925 65776 146669 160292 94479 84520
12729 84520 94861 105679 46094 46364 77751 119535 99692 91423 101149 51697 23236 -17684
12717 -17684 -56083 -42478 3632 -3874 16794 93493 97251 79719 44856 55684 145042 170495
12705 170495 25568 -60969 -84876 -42566 -12970 -1476 9112 78247 42970 91006 115322
12694A15322l3378J375P2528k6822l0088o1003L9403L0793L3789o327k4762P365
12682A18195M7590k7719n9252J8238L8419L6401R080o5622o9309N7709K7673J7309
12670A48712k9900L4745q3926r407N8257k0465m4357K2116N8062k2547L8924m860
12658A45354n3784M037m3095M7618J13247P8713j15769m6668J22348O3189j1793
12647C03397k2585K2789J7981p7688p2928r056j524N2486N24J6842j6022L0820
12635B45036k615P420L0359Q8357O1458N3542j1635J5933o7466p0219O67P5257
12623D26094J5032n3606m4229k9857n3614j8888N1000P165K036J0407J1500L862
12611C26902M524k9538r730P5892j05653n4790p3992o7707K050L1072N0980L2786
$$ plain form
12694 115322 81944 83319 155847 129025 98937 37934 77337 108130 141919 135592 110830 118195
12682 118195 165785 138066 78814 97052 135471 171872 180952 115330 46021 103730 131403 148712
12670 148712 118812 153557 69631 60224 118481 98016 53659 75775 133837 111290 150214 145354
12658 145354 91570 95607 52512 100130 213377 292090 176321 129653 252001 315190 303397
12647 303397 280812 303601 321582 243894 170966 161910 160386 212872 213396 230238 214216 245036
12635 245036 242421 249841 280200 368557 430015 483557 471922 487855 420389 350170 350837 426094
12623 426094 441126 387520 343291 313434 259820 240932 291932 299097 301133 311540 323040 326902
12611 326902 331426 301888 292158 368050 262397 207607 133615 65908 67958 99030 150010 182796
12599A82796N3195j599J3259J8666J3083J1543J00987j9124k4853l8785J6382
12588C25550Q9369N7161J6162m7702l7299j7973j46340o9492m3285N076K4410
12577A55637L2977k1269j0385n9904j4673M4577M4026j3716n1519k4393L3478
12566A14836J2146j24383j05217K0096N7082K9177P744k0234R183l981O3650L9872
12554I9971o4j8524p3159k5484J0223M4825p094p713N5994J2461k5843q7673k0264
12541d2344j2403M5639J00665o171n7695m5546L182N8186O7054K4748K0286j8343
12529A37258m7030J0369K0011m9333O789k5719l167n191O417q417n2064K504N1911
12516D4338j793P679M259M3283J0077K2967n4952j0808N5394J6954J8081k006
$$ plain form
12599 182796 235991 234392 247651 266317 279400 290943 391930 372806 347953 309168 325550
12588 325550 414919 472080 488242 440540 403241 385268 238928 169436 126151 131227 155637
12577 155637 188614 167345 156960 97056 82383 126960 170986 157270 105751 81358 114836
12566 114836 126982 2599 -102618 -82522 -25440 3737 11481 -8753 430 -3551 60099 99971
12554 99971 99907 81383 8224 -17260 -7037 37788 30694 22981 78975 91436 65593 -22080 -42344
12541 -42344 -54747 -9108 91557 85386 27691 -17855 -14673 43513 110567 135315 155601 137258
12529 137258 90228 100597 120608 71275 78064 52345 49178 43987 50404 41987 -10077 -7573 44338
12516 44338 42545 50224 54483 97766 107843 130810 75858 65050 120444 137398 155479 153473
12504A53473M209m0337q48J0699o2348j7740L1985M5648o1570L824N2502L4358
12492A53855o3508j521m8974j17982l7764J3209P2214K4836M865m5999Q4769M0251
12480G8251k5208Q614L4332k6081K4834n8518J1632O6187L4090p758l6172k3739
12468H0464M3058J2759l3675J4610J753n6038p465l3477j0061m0640K6740O5633
12456F3661j0619r890m6868j8000K7625L9098K4441P824P3002R3809q4916m8598
12444A10569j0239k6148M5137M3512L1647N2944L9244l3405o9494k1603k9868
12433A32296N5712J8902r5850o2928O44m4732K2251L4343k7542L274L2080L6307
12421A04757j3301R841k9284p221p2028P9584m8417o9318N6864O5214J0009N591
$$ plain form
12504 153473 157682 117345 116497 127196 64848 47108 79093 124741 63171 66995 119497 153855
12492 153855 90347 88826 39852 -78130 -115894 -102685 -30471 -5635 -770 -46769 38000 78251
12480 78251 53043 61657 95989 69908 94742 36224 47856 114043 148133 140375 104203 80464
12468 80464 123522 136281 102606 117216 118969 62931 55466 21989 11928 -28712 -1972 63661
12456 63661 53042 43152 -3716 -21716 5909 45007 69448 77272 150274 244083 159167 110569
12444 110569 100330 74182 119319 162831 194478 247422 286666 253261 183767 162164 132296
12433 132296 188008 206910 111060 48132 48776 4044 26295 60638 33096 36370 68450 104757
12421 104757 91456 101297 72013 64792 -7236 72348 23931 -45387 11477 76691 86700 92291
12409I2291m3821k960k9641K266O9455O5590p03l0911O1242M3787n2845p7329
12397I6421p1519J319M2778L4384M1589O794q3003n2466K0940J07515M1996m1388
12385A45360j6926J7748m9701k9290P5551O5610N81n4530p8786K6452L3327K0447
12373A55843Q525k1777o0933J3817J6827O001k8388L0577M4723R559l1041m839
12361A38894k9738J2413M3477k3795r718m4241m4723l924K3749Q4480L6292k0423
12349A62743P6241K0767J2662l6514l1237L9568p4499l0634j8461j9825j9446
12338H1365L0281n3539j3672j4325k3855m767j6692L7322L3901P6833O0241K2372
12326B15465O6843l565o6643o1501J0513M1799k7581m1920M326R011M9926k1622
$$ plain form
12409 92291 48470 45510 15869 18135 87590 153180 152477 121566 182808 226595 173750 96421
12397 96421 24902 26221 68999 103383 144972 151766 68763 16297 37237 144752 186748 145360
12385 145360 128434 146182 96481 67191 142742 208352 208933 154403 75617 102069 135396 155843
12373 155843 164368 142591 81658 95475 112302 118303 89915 120492 165215 174774 143733 138894
12361 138894 109156 121569 165046 141251 131533 87292 42569 38645 62394 146874 183166 162743
12349 162743 238984 259751 272413 235899 204662 244230 169731 139097 120636 100811 81365
12338 81365 111646 58107 44435 30110 6255 1488 -15204 22118 56019 132852 193093 215465
12326 215465 282308 278743 212100 150599 161112 202911 175330 133410 137736 146747 196673 175051
12314A75051j8337j1991l6011J8061N4769L2970m540o3386p1571l206m180l3159
12302C4470o5141l0364l2898J01869R4342J9040m429m7277K6347N7879O3284m6689
12290A70433l4989k7072k1378M5653R649k6856j013J3691n0101N455M6129M0811
12278A70412L1425k2496P166Q1628k4126l5244n0564j9966K9205L3683j8440K9019
12266B11702m4098p80P7912p576K0680J4368k1785n3773M815p444j9201L905J9
12253A78744N8602o4846K3073J9469o3843L8080J4413J0545L6466Q801o0425m3895
12241A55184O0365J19337j2727K2814l4502p3969k6878k8919P0538L4699l0863
12230B55079l2903j6201K430j3691k9170k2656O6695K5545l7344l5124N1877L8664
$$ plain form
12314 175051 156714 144723 108712 126773 181542 214512 209972 146586 75015 71809 67629 34470
12302 34470 -30671 -61035 -93933 7936 102278 121318 116889 69612 95959 153838 217122 170433
12290 170433 135444 108372 86994 132647 142296 115440 114427 128118 78017 83472 129601 170412
12278 170412 201837 179341 186507 268135 244009 208765 158201 138235 167440 201123 182683 211702
12266 211702 167604 166824 244736 237160 257840 272208 250423 196650 201465 194021 174820 178725 178744
12253 178744 237346 172500 195573 215042 151199 189279 203692 214237 250703 259504 199079 155184
12241 155184 215549 334886 322159 344973 310471 236502 209624 180705 251243 285942 255079
12230 255079 222176 205975 208405 194714 165544 142888 209583 235128 197784 162660 214537 253201
12218B53201J8617o3786L2076j2880n6234L5204N3181K0314k5045K4743l6348
12207B43043m738l2705m0860j8334L5611K9370K0595N2267n8191m2698J7504J20885
12195C21749M8020n773l1001l2005k2252k9970m6690m0597N1707J6763L0618n0413
12183B10156r55l3678K4563k8770J0982P3773Q7086j17282o6902J103L6855O4984
12171B61915Q739P1986j4388n5130n5069j9244K3058K705K7003J3785J5664j4240
12159B66784M6447R7320l4623k4868j5944k0221J5894L146O0645R3737L7518q3241
12147D42594o1593L4409m6160n9138r6918l782L7284j4229O37K4360L6154O2504
12135C56122J1991q9831j0109k6055l5210M7176N7637l2570k8157J05402J8522
$$ plain form
12218 253201 271818 208032 240108 227228 170994 206198 259379 279693 254648 279391 243043
12207 243043 238305 205600 164740 146406 182017 211387 231982 284249 226058 183360 200864 321749
12195 321749 369769 363996 332995 300990 278738 248768 202078 161481 213188 229951 260569 210156
12183 210156 209201 175523 200086 171316 182298 256071 343157 225875 158973 160076 196931 261915
12171 261915 270654 342640 328252 273122 218053 198809 221867 224572 251575 265360 281024 266784
12159 266784 313231 410551 375928 351060 335116 314895 330789 333935 394580 488317 525835 442594
12147 442594 381001 415410 369250 310112 213194 209412 246696 232467 233104 257464 293618 356122
12135 356122 368113 278282 268173 242118 206908 254084 311721 279151 250994 356396 374918
12124C74918n8524n3743K8575N0407M836j8805q79l4704k7235m1971O0001L5841
12112C18717n8936O2582K1377n5592M9166J03932J962q5134m0281o9379k4438
12101B23976k198R757O3628J1416k4006l2020L0321K097j528M6011N3134k5489
12089C55099m21n814R530N9448L5807k6745k8679j3886k5235n9278m5980J0943
12077B64789K1106R0253l6664j4936N313p4018q0937Q3694J11102K5301k5058
12066C69945m6218p9673j2536M1285K135j634k5761l5793j4702R0026K1659K2669
12054C31402O8251j9754k9579J2620Q1002r670j09784O23m3972m0900P5227M9324
12042C64790o0453j8197l3469l1348J4570K9850M8563m3237p0084K2550J0698
$$ plain form
12124 374918 316394 262651 291226 341633 346469 327664 326785 292081 264846 222875 282876 318717
12112 318717 259781 322363 343740 288148 337314 441246 443208 358074 317793 248414 223976
12101 223976 221778 231535 295163 306579 282573 250553 280874 282971 281443 327454 380588 355099
12089 355099 354678 348864 358394 417842 453649 426904 398225 384339 359104 299826 253846 264789
12077 264789 285895 376148 339484 324548 329861 255843 174906 258600 369702 395003 369945
12066 369945 323727 244054 231518 272803 274938 273304 247543 211750 197048 287074 308733 331402
12054 331402 399653 379899 350320 362940 443942 434272 324488 325111 281139 240239 315466 364790
12042 364790 304337 286140 252671 221323 235893 265743 314306 271069 200985 223535 234233
12031B34233Q6920J44097M7909n6929l4984J3190j5118n5018J1748l3331k4997
12020C17720m3367N9341J5603j7373l5297o694J6662K7287M8147P4596n5305k0963
12008C80357R349j4220q2598K2055K0809P413P6923p1777j41696p433R8619J5194
11996C12995k949j733J3133L215j3739j8650J1742K3751J7627L3192L2058J5100
11984D25742M1244l960K0678r7017o5909P8280R2472L1208k4493j26028l0603
11973C41614J3073J7039L1632Q2008N628m2365R99O109n8754j6397p189j3078
11961C60319O2087K4136q23k2304J3564K9449L8194o8680L0808J15052k5274m7473
11949E09055j4980M994k7029q0640N2002Q0643K1833M154L5577R67o3777p5380
$$ plain form
12031 234233 321153 465250 513159 456230 421246 434436 419318 364300 376048 342717 317720
12020 317720 274353 333694 349297 331924 296627 289933 306595 333882 382029 456625 401320 380357
12008 380357 389706 375486 292888 314943 335752 343165 420088 348311 206615 199182 297801 312995
11996 312995 310046 308313 321446 324661 310922 292272 304014 327765 345392 378584 410642 425742
11984 425742 466986 463026 483704 386687 320778 399058 491530 522738 498245 372217 341614
11973 341614 354687 371726 403358 485366 490994 448629 449628 455737 396983 380586 373397 360319
11961 360319 422406 446542 445719 423415 436979 466428 504622 435942 466750 581802 556528 509055
11949 509055 494075 499069 472040 391400 443402 524045 545878 550032 585609 586576 522799 447419
11937D47419j8390j4297M6407P6917M8176k7802m666j6156n2825J2388j6191k2104
11925D58876O2692L4606l8736m4199M4145M8351M8766L779L449L3035O131o2472
11913E98423L4138J5719n2906N6206K4343l9355K1465r7797k6316Q0068R5226
11902G09214k6153J5775n5782p2629k3605J7228q530J7149L6480N9785n0167l4272
11890E84493O1649l801k9317j4904l5657M6763P3575J6450o2238Q568L1642k1743
11878F55480l287l1581P5222M2682L6951M9008j6666n3307n8574K6558N1258L729
11866G77473l1382J4082m4997k3253J03314L8904j8512n4391r070l4340K2707
11855G40535j8267j9353J5371k6802N2971K9562R8146L9317j6189L2480J440q781
$$ plain form
11937 447419 429029 414732 461139 538056 586232 558430 553764 537608 484783 497171 480980 458876
11925 458876 521568 556174 517438 473239 517384 565735 614501 618280 621729 654764 660895 598423
11913 598423 632561 648280 595374 651580 675923 636568 658033 560236 533920 613988 709214
11902 709214 683061 698836 643054 570425 546820 564048 555518 572667 609147 668932 618765 584493
11890 584493 646142 642341 613024 598120 562463 609226 682801 699251 637013 645581 677223 655480
11878 655480 652193 620612 695834 738516 775467 824475 807809 754502 695928 722486 773744 777473
11866 777473 746091 760173 715176 691923 795237 834141 815629 761238 752168 717828 740535
11855 740535 722268 702915 718286 691484 744455 774017 872163 911480 895291 927771 929211 920430
11843I20430j4426n7943l6324j9128L8543K8029J5149K8219l46L9142k3964o0691
11831H56690k7122p493M9158L5878n257M6421l3057j307L9633k1153j9150m6519
11819H66722J0781L4968j5652q515M0285k5092k9736l2096J933P3140P0902M1302
11807A028942L6700L5727Q923m0535p0821O6181J5901L395o294n3062k9875k3590
11795I71592J7335M2620O5558J1913M3849l232j2533M0914P4914L50o9877m6119
11783A137284M1904Q8132M7989J4275Q6022l7519m1230l5685j0278k9392M685
11772A266187K8309L848J9364j7101q3277P238K3610m5883L7219J0368Q4870O7849
11760A402601K0332M3383L6860J2314p446L1230J6681l6351m0039M7528O2050
$$ plain form
11843 920430 906004 848061 811737 792609 831152 859181 874330 902549 902203 941345 917381 856690
11831 856690 829568 822075 871233 907111 901854 948275 915218 913911 953544 932391 913241 866722
11819 866722 877503 912471 896819 888304 928589 903497 873761 841665 843598 916738 987640 1028942
11807 1028942 1065642 1101369 1110292 1069757 998936 1065117 1081018 1084413 1078119 1025057 995182 971592
11795 971592 988927 1031547 1097105 1109018 1152867 1149635 1137102 1178016 1252930 1253280 1183403 1137284
11783 1137284 1179188 1267320 1315309 1329584 1415606 1378087 1336857 1301172 1290894 1261502 1266187
11772 1266187 1294496 1298344 1317708 1300607 1217330 1224568 1248178 1202295 1239514 1249882 1334752 1402601
11760 1402601 1422933 1466316 1503176 1515490 1508044 1539274 1555955 1519604 1479565 1527093 1589143
11749A589143l1541P2524r964q2058M378J2723L132R2830L1697k1546J0873L0869
11737A703060J3699J6865j8288J3178M6247L0312n949K7873O2203J8797O7772
11726A975769k0520m078J03919L7815o0130l8355L7430K9725j5012K6775J308
11715B074646Q3600N6316N5791l069j11044L0959R3724n822J1438K4818O0195
11704B371552R5540K2077m8553n4410P3164L9523j4944m5855q082O0534K841O5771
11692B559158N8114M8757L7462P9590K4770J316m6047L1557M5433L9279N1894
11681B931283J6845q391K7100J6075k2513O9516R3632l3432O3119P8313N9244
11670C290791K6913N5915P386N8455N9662K2001L1509L3383R7722L9734L134Q2067
$$ plain form
11749 1589143 1557602 1630126 1620162 1538104 1542482 1555205 1558337 1651167 1682864 1661318 1672191 1703060
11737 1703060 1716759 1733624 1715336 1728514 1774761 1805073 1799124 1826997 1889200 1907997 1975769
11726 1975769 1955249 1951171 2055090 2092905 2032775 1994420 2031850 2061575 2046563 2073338 2074646
11715 2074646 2158246 2214562 2270353 2267284 2156240 2187199 2280923 2275101 2286539 2311357 2371552
11704 2371552 2467092 2489169 2440616 2386206 2459370 2498893 2483949 2438094 2430012 2490546 2493387 2559158
11692 2559158 2617272 2666029 2703491 2783081 2807851 2809167 2763120 2794677 2840110 2879389 2931283
11681 2931283 2948128 2939737 2966837 2982912 2960399 3029915 3123547 3090115 3153234 3231547 3290791
11670 3290791 3317704 3373619 3381005 3439460 3499122 3521123 3552632 3586015 3683737 3723471 3726605 3808672
11658C808672P922k601j6807o381J9119J12663N7184O4007P5006K7365N1302K4055
11646D221506K2802J00372J06414O6629O8120M0402N5293P0006J8929m278J2397
11635D778592J07142J48565J27015J11109O7230Q3093L2298O1746M7306L990O1630
11624E629716J22349J06875J16756J8362O8N7021J35105J64536R3551m0482K9494
11613F433351J43208J55663J53398N3618R4459J24499J31646R8708N7330l231
11603G442649N5778M4923R3394J75974Q8664R3280J39449J09595R6985P6509R8602
11592H515802J30043K28459J04847N0883J28774P8455J07201J34836R1878J08189
11582I679367J24211J25467J16359J47439J56613J10265J40771J46443P1812O8417
$$ plain form
11658 3808672 3816594 3813993 3797186 3790805 3809924 3922587 3979771 4043778 4118784 4146149 4197451 4221506
11646 4221506 4244308 4344680 4451094 4517723 4585843 4626245 4681538 4751544 4770473 4766195 4778592
11635 4778592 4885734 5034299 5161314 5272423 5339653 5422746 5455044 5516790 5564096 5568086 5629716
11624 5629716 5752065 5858940 5975696 5994058 5994126 6051147 6186252 6350788 6444339 6403857 6433351
11613 6433351 6576559 6732222 6885620 6939238 7033697 7158196 7289842 7388550 7445880 7442649
11603 7442649 7498427 7543350 7636744 7812718 7901382 7994662 8134111 8243706 8340691 8417200 8515802
11592 8515802 8645845 8874304 8979151 9030034 9158808 9237263 9344464 9479300 9571178 9679367
11582 9679367 9803578 9929045 10045404 10192843 10349456 10459721 10600492 10746935 10818747 10887164
11572A0887164J41759J12193J58792R3770P1889J11276J13372R6643J48852O6825
11562A2002535O9013J29933J01992M5657J16064J12434N6094L8535q832N5589
11552A2719014R0040J32883R8732j17884l7882P0301J51733N7452K581L0876P2614
11541A3270460J6698Q9394L0362J01404P8472p8025l9507p847M7386J7365n4381
11530A3471781m416k5935o9823q5779j19164o6580n9745p4698j07183r6256p9225
11519A2682977j09589m143k9277l9227q9454j33678j40635j29082j08712j11112
11509A1788068n7939j92157j95490j24818m9329o6264r9607j61077n8652p1657
11499A0711078j42556j49163k27884j65835k5423m4937j07247o8391j75211q0571
$$ plain form
11572 10887164 11028923 11141116 11299908 11393678 11465567 11576843 11690215 11786858 11935710 12002535
11562 12002535 12071548 12201481 12303473 12349130 12465194 12577628 12633722 12672257 12663425 12719014
11552 12719014 12809054 12941937 13040669 12922785 12884903 12955204 13106937 13164389 13166970 13197846 13270460
11541 13270460 13287158 13376552 13406914 13508318 13586790 13508765 13469258 13461411 13508797 13526162 13471781
11530 13471781 13467365 13441430 13371607 13285828 13166664 13100084 13040339 12965641 12858458 12762202 12682977
11519 12682977 12573388 12569245 12539968 12500741 12411287 12277609 12136974 12007892 11899180 11788068
11509 11788068 11730129 11537972 11342482 11217664 11168335 11102071 11002464 10841387 10782735 10711078
11499 10711078 10568522 10419359 10191475 10025640 10000217 9955280 9848033 9779642 9604431 9523860
11489I523860r6097j72024j20461j24452r2693j34811r1737j25261j21486j22532
11479H322306j33431o2609o3600j28947j38460j83447j27590l3410q8193j37070
11469G225549j18314j26298q1834n2111j05907o7819j10035j03595j06972j14690
11459F237974j32174n2741L1135r5486j03665j11980m2094q1448j28278j02824
11449E418419j16584j38952k2224q7765j28727m5686L8777n6072l3383l4914o7895
11438D724994m6416m3009p9821j66272m9039m501l1102j18015o0350J3308L9443
11427D179220p7396k3583k9297o8557r4346j00478j03888q2655n6366k5537j5611
11416C501506M1697o0866l950j185q8138m7007L8975r3469l1118n2655j02969
$$ plain form
11489 9523860 9427763 9255739 9135278 9010826 8918133 8783322 8691585 8566324 8444838 8322306
11479 8322306 8188875 8126266 8062666 7933719 7795259 7611812 7484222 7450812 7362619 7225549
11469 7225549 7107235 6980937 6899103 6846992 6741085 6673266 6563231 6459636 6352664 6237974
11459 6237974 6105800 6053059 6084194 5988708 5885043 5773063 5730969 5649521 5521243 5418419
11449 5418419 5301835 5162883 5140659 5052894 4924167 4878481 4917258 4861186 4827803 4792889 4724994
11438 4724994 4678578 4635569 4555748 4389476 4340437 4335936 4304834 4186819 4126469 4139777 4179220
11427 4179220 4101824 4078241 4048944 3980387 3886041 3785563 3681675 3599020 3542654 3517117 3501506
11416 3501506 3543203 3482337 3478387 3477202 3389064 3342057 3381032 3287563 3256445 3203790 3100821
11405C100821r8578q3598j8124K2578j15646q5127L6228j3080m1118p7675k8516
11394B598165m6021m4378j3262k772m6556j6578m5626p7414j3n6874l7972o9773
11382B140926L6274J6591j0536K1027k2339M61j7174l4937j3189p264k0918R011
11370B097933k3045k8842k0200m6185j8396M7558R081M666r1374o9380J1739m6359
11358A827196n2509K3629j1338r2455l2673j5663j7084n17O8756R072j08136l0333
11346A567945P1216j1926j25121K3405J0646m0616K0518M6596l6939m8480l5966
11335A441278k6736o2296K0997r692K3749l2897L898K594p0595N9973N7870k3682
11323A384461q8328m3028M2199j9586J769M1869k3423r2814k8934l2695j5155
$$ plain form
11405 3100821 3002243 2918645 2900521 2923099 2807453 2722326 2758554 2745474 2704356 2626681 2598165
11394 2598165 2552144 2507766 2494504 2491732 2445176 2428598 2382972 2305558 2305545 2248671 2210699 2140926
11382 2140926 2177200 2193791 2183255 2204282 2181943 2182404 2165230 2130293 2117104 2109840 2088922 2097933
11370 2097933 2074888 2046046 2025846 1979661 1961265 2008823 2017904 2022570 1931196 1861816 1873555 1827196
11358 1827196 1774687 1798316 1786978 1694523 1661850 1646187 1629103 1628586 1697342 1706414 1598278 1567945
11346 1567945 1639161 1627235 1502114 1525519 1536165 1495549 1516067 1562663 1525724 1477244 1441278
11335 1441278 1414542 1352246 1373243 1363551 1387300 1354403 1358301 1360895 1290300 1350273 1408143 1384461
11323 1384461 1296133 1253105 1295304 1275718 1277487 1319356 1295933 1203119 1174185 1141490 1126335
11312A126335K026K9183l8802o263N3407l3006k0514O3599L0958l4813n7279j5800
11300A099031n3515k095L8362J6759l6592L3073L0821l2288p159r9912j2535Q897
11288I82847J9371J7606M0775n2885J6986O1835j3828p0524m8875n6669n0448
11277H46191M7924q380j469J3720j7593p4654n0267m4366j0425M7151l4158o0187
11265F53487O8268K8715k206o7965q3708O1370J7151L3956l944o743L025K1956
11253G23362m3074o4739M2382L912M0315O5358k6095l0120n6321l6254L7695N8836
11241G15257j2683o4707k6407r613j6876K9272M895M9868Q6666l9165n6856J2645
11229F72296r851n5565k276K2277o3014K3435L2021K9086p649m8407J1770J512
$$ plain form
11312 1126335 1128361 1157544 1118742 1112479 1165886 1132880 1112366 1175965 1206923 1172110 1114831 1099031
11300 1099031 1045516 1043421 1081783 1098542 1061950 1095023 1125844 1093556 1086397 986485 973950 982847
11288 982847 1002218 1019824 1060599 1007714 1024700 1086535 1072707 1002183 953308 896639 846191
11277 846191 894115 885735 884266 897986 880393 805739 755472 711106 700681 747832 713674 653487
11265 653487 721755 750470 748264 680299 596591 657961 675112 709068 705124 698381 701406 723362
11253 723362 680288 615549 657931 661843 702158 767516 741421 711301 654980 618726 656421 715257
11241 715257 702574 637867 611460 601847 584971 614243 619138 669006 755672 716507 659651 672296
11229 672296 662445 606880 604604 626881 563867 587302 619323 648409 640760 592353 604123 605635
11217F05635p9756N4049J8136j05368j12945J4333M8967R9490P2332M5919j5394
11206F45398L5483M0018N0908K1350K01k6736l0737o1430j07402l5762J2640P050
11194E50981K5498j4085m4761o7422L3288J2846Q58m5940l96J5960K4561N1110
11182E42498j1889m4223K8437k2008L155Q6968L5185m1303r2742p3511j3272L5282
11170D32577k5852n9033p9483P666Q2437O9152r047O755M284M9442K7349n9713
11158D46534m9418m0071Q722k2680m8491L062K4461J2796R4704l866l6350n9023
11146C30380J7478O2047p240n12Q1982J5262j6042o7965l8473L1414o4156o7080
11134B77095M1403l209l2591J5410L9389M932n9870o8583P795M1962K3300j0713
$$ plain form
11217 605635 525879 579928 598064 492696 379751 394084 443051 542541 614873 660792 645398
11206 645398 680881 720899 771807 793157 793358 766622 735885 674455 567053 531291 543931 550981
11194 550981 576479 562394 517633 450211 483499 496345 497203 451263 450867 466827 491388 542498
11182 542498 530609 486386 514823 492815 495970 582938 618123 576820 484078 410567 397295 432577
11170 432577 406725 347692 268209 275875 358312 427464 418417 425172 429456 478898 506247 446534
11158 446534 397116 357045 365767 343087 294596 297658 322119 334915 429619 425753 389403 330380
11146 330380 347858 409905 402665 402153 484135 499397 483355 415390 376917 408331 344175 277095
11134 277095 318498 315289 282698 298108 337497 342429 282559 213976 221771 263733 287033 276320
11122B76320n8492O1959J14499K1181o6581K8865P1826k6712j28920r3230K4399
11111B25114L3772M4623M5253O6358n971p5459k2312p850l7229N7688k9727j02166
11099A92094k7968K0990L2913J8526K2104J6682j8806K9939N5844n1312J1466
11088C02472m5403m7100o3700K0411J8865R0592R4312j9440j03750m8401n406
11077A93452R246R407Q0324M0835K9q0852p8567K1559P5883M6946J3768q3311
11065B48719k7888o106J4313M4660M5983q175m3083m3703J1516j4673j3449N5983
11053B64097l4647m7249j5659K3078N6327K0483k2181q7574r5946L9160M6709
11042A46598n082L0023L285k0142P6162J5644n5792l6560r258J6874j8772K9084
$$ plain form
11122 276320 217828 279787 394286 415467 348886 377751 449577 422865 293945 200715 225114
11111 225114 258886 303509 348762 415120 409149 333690 311378 303528 266299 323987 294260 192094
11099 192094 164126 185116 218029 236555 258659 275341 256535 286474 342318 291006 302472
11088 302472 257069 209969 146269 166680 185545 276137 370449 351009 247259 198858 193452
11077 193452 202698 212105 292429 333264 333293 252441 173874 195433 271316 318262 332030 248719
11065 248719 220831 214725 229038 273698 319681 311506 268423 224720 236236 221563 208114 264097
11053 264097 229450 182201 166542 189620 245947 266430 244249 156675 60729 99889 146598
11042 146598 141516 171539 174824 154682 230844 246488 190696 154136 144878 161752 142980 172064
11030A72064J0366J088J3465R899L9555J2431M0379r9806m9864N253o8843l4317
11018E1670J15326L4886m0555k8122o465J7541O7094L1713q815o776K110K8294
11006B57901K0406m6628k8501M0267p5826K3374K0435l367n7049n033K1346N0472
10994B17797l9267o376k6378L8038N715o6334M3750J633J9992K5468j3984K6107
10982B26161p4704l4129M6546k0911k4761j6686P948M7709j9759j579j2961p1249
10970E1625o1038K8291K6810O9458O7831L6945M9622L7095q9354m1782K6340Q977
10958B10820j9166k6721k5005K7239K2745k892L6680L6792l0643r539q892N0297
10946B61715K3104m6925j5712l8764P598m2275K5626K7081k2884j06228l7630
$$ plain form
11030 172064 182430 183518 196983 206882 246437 258868 299247 199441 149577 154830 85987 51670
11018 51670 166996 201882 161327 133205 126740 144281 211375 243088 234273 227497 229607 257901
11006 257901 278307 231679 203178 243445 167619 190993 211428 208061 151012 145979 167325 217797
10994 217797 178530 172154 145776 183814 189529 123195 166945 168578 188570 214038 200054 226161
10982 226161 151457 117328 163874 142963 118202 101516 109464 157173 137414 135835 122874 51625
10970 51625 -9413 18878 45688 115146 182977 219922 269544 306639 217285 175503 201843 210820
10958 210820 191654 164933 139928 167167 189912 187020 223700 260492 229849 220310 211418 261715
10946 261715 284819 237894 222182 183418 191016 148741 174367 201448 178564 72336 34706
10935C4706L5324k7947m9259M4404N0918P169K8605J4700K6537j0141J2035r500
10923A57551j38018l1241J0597M8679K3413o2667l1835Q3920M0302k3002J2847
10912I0546J2008N172k0522N3360L4242K4386O949L7362J6142m6426q5626P028
10900A34621K3351k446o2827K927P370p5059j7214m381J8526J5808l8300k9536
10888b7160R6228L4949m5715L845l2171N3071O7264M8680J7601l5468p8393k7314
10876G5417K3034K4635R706P282o046j0035n585k4529M7881N7368l6309K070R7361
10863B62250n6669j14840q9948n9911J0308K31L2502N7521M7101r175J1531j9448
10851G1453O7766l4399K9946O308K9429L336r114r9515p8905N1094R0811L378
$$ plain form
10935 34706 70030 42083 -7176 37228 88146 95315 123920 138620 165157 155016 167051 157551
10923 157551 19533 -11708 -1111 47568 70981 8314 -23521 60399 100701 77699 90546
10912 90546 102554 107726 87204 140564 174806 199192 206141 243503 259645 213219 127593 134621
10900 134621 157972 155526 92699 95626 102996 27937 10723 6342 24868 40676 2376 -27160
10888 -27160 69068 104017 58302 62147 29976 83047 150311 198991 216592 181124 102731 75417
10876 75417 98451 123086 132792 140074 134028 123993 118408 93879 141760 199128 162819 164889 262250
10863 262250 205581 90741 793 -59118 -48810 -48579 -16077 41444 88545 79370 90901 71453
10851 71453 139219 104820 134766 141074 170503 173839 164725 65210 -13695 37399 128210 131588
10839A31588m8739l5716K8927k676n1254J2821P5777k8251k5815J7166o2907p143
10827C778O1505L1576L5316O481j7997J046r956L6482O0758o8644j40317M153
10815D181K8982J5233o172L1091n0946K8444L428l0008l4786O44M0097j5359j0408
10802D421J2849N3428J6470p820m9143r123k8866J5774L4955l5245K944M0321
10790E0965O8337L1815m9548k0439j6554m0215l321J12443Q543n9281k6226j4948
10778D1571m551m0513K2221J9931L5717m3133J9973o620O05J4338n909p216l0955
10765A5459o1453R147R4982L5559j6930J9062M799p1922k8939Nj1368J545L098
10752f956L3979K0361K5210k809k3015j15649K3204p420N0794P4635L5817l98
$$ plain form
10839 131588 82849 47133 76060 73384 22130 34951 110728 82477 56662 73828 10921 3778
10827 3778 65283 96859 132175 138656 120659 121705 111749 148231 208989 140345 28 4181
10815 4181 33163 48396 42224 73315 22369 50813 54241 24233 -10553 -9909 30188 14829 4421
10802 4421 17270 70698 87168 79348 30205 21082 -7784 7990 42945 7700 10644 50965
10790 50965 119302 151117 101569 81130 64576 24361 21040 133483 142026 82745 56519 41571
10778 41571 37020 -3493 18728 38659 74376 31243 51216 44596 45201 59539 53630 46414 15459
10765 15459 -45994 -36847 58135 93694 76764 95826 100625 28703 -236 -231 -11599 -10054 -6956
10752 -6956 27023 47384 72594 69785 46770 -68879 -45675 -53095 -2301 72334 108151 107753
10740A07753J0016M5302l0066q1440k444j1739p9314O3771O0350L0786J4827n8301
10728F9501q5160q204L4981J4938L3368L7901j2323l1280j3204p7n104M447m448
10715C5336q985J0627L7597M4678O582n9528k9930K5256K3555L8509j8280j3591
10703I1826J4097n9633n498L1018P7399L1402p4018m3425J699O966m7643M717
10691B8907j6327j2243r619l8845j2323N4698J04101n864p9859K0194r369J5767
10679C9218L6925Q799m6405m9486J3296J1074k0985r412L8510R976r482M0970
10667F2998j5852k080m4321m8600P5184N8335p5570l8761L1971k6151k6658J3376
10655c6129K8618K4493K8717m6324O65J2482o339j6416Q1784o5p3931L5735Q7932
$$ plain form
10740 107753 117769 163071 133005 51565 49121 37382 -41932 21839 82189 112975 127802 69501
10728 69501 -15659 -23863 11118 26056 59424 97325 85002 53722 40518 40441 35337 39784 35336
10715 35336 26351 36978 74575 119253 125835 66307 36377 61633 85188 123697 105417 91826
10703 91826 105923 46290 40792 71810 149209 180611 106593 63168 64867 71833 24190 28907
10691 28907 12580 337 -9282 -48127 -60450 -5752 98349 92485 12626 32820 23451 39218
10679 39218 76143 84942 38537 -10949 2347 13421 -7564 -16976 21534 31510 22028 62998
10667 62998 47146 45066 745 -47855 27329 85664 10094 -28667 3304 -22847 -49505 -36129
10655 -36129 -7511 16982 45699 -625 40 12522 6183 -10233 71551 71486 -2445 33290 121222
10642A21222K9018l8161n0475n0412J0361l4483N4505K6423P925J1569l4189M7965
10630A01268M9567k9511L183r3646l6250o793k0565N2718N2396j0989l5601j2685
10618A3092K8929j3137k502R7737L5296m5276l2514K8430k6766k9768R5850P9574
10606B28945k062n7727k9407L1067k9328r5193m1233k4133J04630m8999m0569
10595d009L9730o8928j8457R8386K1418m7439O3698Q8558m4596r7582L2732n5700
10583G811p0239j07064M3428J71402O0269j1174j4966l7638l0784P9102O3734
10572A53881n5197o9676q3976p0884R504N3781o415K6237Q6060R82P5788J7401
10560A37486n446n5706m5353q8706J4750J17194M5140r6331p2685l0389M8392
$$ plain form
10642 121222 150240 112079 61604 11192 21553 -12930 41575 67998 75923 87492 53303 101268
10630 101268 150835 121324 124507 30861 -5389 -12182 -32747 19971 72367 61378 25777 13092
10618 13092 42021 28884 26382 124119 159415 114139 81625 110055 83289 53521 149371 228945
10606 228945 226883 169156 139749 170816 141488 46295 5062 -19071 85559 36560 -4009
10595 -4009 35721 -33207 -51664 46722 68140 20701 84399 172957 128361 30779 63511 7811
10583 7811 -62428 -169492 -126064 45338 105607 94433 79467 41829 11045 90147 153881
10572 153881 98684 29008 -54968 -125852 -116348 -62567 -68982 -42745 43315 44297 120085 137486
10560 137486 132040 76334 30981 -57725 -42975 74219 119359 23028 -49657 -80046 -31654
10549c1654K2834N125L1970j2308J9584j3925l6192m4023M1704N7224j6007L2418
10537E6750N2904K1327p0295q2143K7315p375l0886K4178N1506k8710J6321N0305
10525H1197N9382p421m6940K5140L6157j0761o0781k9087k4414m3446j7165p5431
10513a13570N3205M8985J303J0776Q2319q694m5711L9695M4818J5889p0855O088
10501F4248K357R48k7495j4971L1518j7698p4550m5585m9482K4264K9951O528
10489f9967L2247l1740o736J06493J1814o082L930J9136K4590j235J6682l8353
10477F0779l3038J8626l219k0639L745m1724l5217o7045L1260l1284M129L527
10465a10100K7571L8920M4255j8215l331P4555L706l8993l363J8003m8787l2545
$$ plain form
10549 -31654 -8820 -3695 28275 15967 35551 21626 -14566 -58589 -16885 40339 24332 56750
10537 56750 109654 130981 60686 -21457 5858 -1517 -32403 -8225 43281 14571 30892 81197
10525 81197 140579 133158 86218 111358 147515 136754 75973 46886 22472 -20974 -38139 -113570
10513 -113570 -60365 -11380 -10077 699 83018 74324 28613 68308 113126 129015 58160 64248
10501 64248 66605 67553 40058 25087 56605 38907 -35643 -81228 -130710 -106446 -76495 -69967
10489 -69967 -37720 -69460 -76196 30297 42111 36029 39959 59095 83685 82450 99132 60779
10477 60779 27741 46367 43148 22509 26254 -15470 -50687 -117732 -86472 -117756 -113627 -110100
10465 -110100 -82529 -43609 646 -17569 -20900 53655 57361 18368 15005 33008 -15779 -48324
10453d8324P8054P1308j2513J6064k0917m7514k1064k0371p4309K5288J5565P4469
10441C5736K6418q4602r5653P2111Q0284j3989P8217L2155K2019q1896o2464k5442
10429a7106L2983l5108p6595k3932l003P5926N4358J702j7114j9092l0933O0608
10417B694N1677n957j8487K9481r539m1865q3575K4319j5398P5569Q1472o8084
10405B2307l1293L8123O3781m0612j4916P0365l8522l6122n92q496L5742L4153
10393I3918k8041o6575m8826l0049j6249m042J138J0035R954M5734k1580n0317
10381a04900l73K1721o996N8306J11398N595j03782m6723R624j9627M6362O585
10369b2810J5403m044K1632M167n8718K4506j4013k7862O4304L5753o2062j2669
$$ plain form
10453 -48324 29730 101038 88525 104589 83672 36158 15094 -5277 -79586 -54298 -38733 35736
10441 35736 62154 -22448 -118101 -45990 34294 20305 98522 130677 152696 70800 8336 -17106
10429 -17106 15877 -19231 -95826 -119758 -122761 -46835 7523 9225 -7889 -26981 -57914 2694
10417 2694 54371 48414 29927 59408 49869 8004 -75571 -51252 -66650 8919 90391 22307
10405 22307 -8986 29137 92918 52306 37390 107755 69233 33111 32519 24023 59765 93918
10393 93918 65877 -698 -49524 -79573 -95822 -99864 -98726 -88691 -78737 -33003 -54583 -104900
10381 -104900 -105273 -83552 -90548 -32242 79156 84751 -19031 -65754 -56130 -75757 -29395 -22810
10369 -22810 -7407 -11451 10181 14348 -44370 -19864 -33877 -61739 2565 38318 -23744 -36413
10357c6413N0633K563J4646l044o6504o1649R300K6655Q2495R605K6716O8496
10345A23499q160m1278j617P810k070l0136k6509P161L3076M497R077L3000O4948
10332A73298k0043l5805n0393l6132m5508n948n662K0465P7805R6511M6299K9693
10320B44580J7192J4207q3171K0135l4451q4973j1663n2216M146L7627M1214m4779
10308F7848o5797o4095M1749M9685l328N6818k3263j02202L0889N7457k0207j6788
10296H766L3892j3599j7548k4358m608M9315O4791j6176n9732r291K2899J1062
10284D5413J729j30141M1271O6953J2741R920o823j2059k4316K0763O592q999
10272B3044l4720Q7370R7768m989p7398L22m90m7562M929l5986k6938l6096J5109
$$ plain form
10357 -36413 14220 16783 31429 28385 -38119 -99768 -90468 -63813 18682 28287 55003 123499
10345 123499 115339 74061 72444 80254 78184 48048 21539 28700 61776 66273 75350 108350 173298
10332 173298 153255 117450 67057 30925 -14583 -20531 -26193 -5728 72077 168588 214887 244580
10320 244580 261772 275979 192808 212943 178492 93519 81856 29640 33786 71413 112627 67848
10308 67848 2051 -62044 -20295 29390 26062 82880 59617 -42585 -11696 45761 25554 8766
10296 8766 42658 29059 11511 -12847 -17455 31860 96651 80475 20743 11452 34351 45413
10284 45413 47142 -82999 -41728 25225 37966 47886 41063 29004 4688 25451 32043 23044
10272 23044 -11676 75694 173462 168473 91075 91397 90907 43345 48274 12288 -14650 -50746 -35637
10259c5637L7606J3670J02704P3052j2408l7335l3761L3600j7352L6945R7192
10248B58276L1288m2916l00p3816r5884M4012m3664j00071R593J8582l5359n1006
10236h1265K2102j5626N582k4990j5810P4929Q2703O3499k8203n5270n6691m8844
10224g7884n5162M6511L2622Q2318P639L122M0483J0661k5022K947M9246k3659
10212I3822j20937L3951K0223l2910J7630m3547K3685K6042L5798K8903O300m968
10200H3992l9165L9138k1622J4338J629m665l2820l2567J0740j16091J8648O9065
10188i380K4293m4630o7895o5370l768J76194J11044K8276n2655l7175K1921n0246
10176C0609n6798m9968m8459L2597N0976k0117k4087k390p461P6785J516K2291
$$ plain form
10259 -35637 1969 15639 118343 191395 178987 141652 107891 141491 124139 161084 258276
10248 258276 289564 246648 246348 172532 76648 120660 76996 -23075 -13482 5100 -30259 -81265
10236 -81265 -59163 -74789 -69207 -94197 -110007 -35078 47625 111124 82921 27651 -29040 -77884
10224 -77884 -133046 -86535 -53913 28405 36044 39166 79649 90310 65288 68235 117481 93822
10212 93822 -27115 6836 27059 -5851 11779 -31768 -8083 17959 53757 82660 88960 83992
10200 83992 44827 83965 62343 76681 78310 73645 40825 8258 18998 -97093 -78445 -9380
10188 -9380 14913 -29717 -97612 -162982 -166750 9444 120488 148764 96109 58934 80855 30609
10176 30609 -26189 -76157 -124616 -92019 -41043 -61160 -85247 -87637 -95098 -18313 -16797 5494
10164E494M1212M5305o6665l0863o20o2275m5322m1402P6280R2640K3607M7257
10152H4648k2986Q797L2335o6550k2861K0309K0188J337J13303k460M8401M1355
10140B55816K7676Q1672O4633P2615Q7063K0219j48872j12304J4680J872p8681
10129B86389j03740J9890M401p7365m2628j1626n2786j7056n775j6770L2023M8677
10117F3634P2273j6588k3739J2329n3000p7438O0996M7676l4633p9778L1461J5886
10105A9079o9721O840M3149P437L5871l9505J7276L3198k3827o06l0793j4856
10093a6458j6769j0208Q974N9297j0424k6388o1937J6583o0896N4900L3406L516
10081b6404k2586j9059R4233L3466r893M321R3263j1619p1214l1995q71K7921
$$ plain form
10164 5494 46706 92011 25346 -5517 -6137 -68412 -113734 -155136 -78856 13784 37391 84648
10152 84648 61662 70459 102794 36244 13383 33692 53880 55217 168520 166060 214461 255816
10140 255816 283492 365164 429797 502412 589475 609694 460822 348518 363198 365070 286389
10129 286389 182649 202539 206940 129575 86947 75321 22535 5479 -296 -17066 14957 63634
10117 63634 135907 119319 95580 107909 54909 -22529 38467 86143 51510 -28268 3193 19079
10105 19079 -50642 -43802 -653 6784 42655 3150 20426 53624 29797 29191 -1602 -16458
10093 -16458 -33227 -43435 -34461 24836 14412 -11976 -73913 -57330 -118226 -63326 -29920 -26404
10081 -26404 -48990 -68049 26184 59650 49757 54078 147341 135722 64508 32513 31642 59563
10069E9563K9065K0946j7654m8566M3303L5201l4996k2873J5599J8357k818M8914
10057A44041N2196k1370k0236o5310k1938l6002l5429R9497J4878m0414m6168
10046B3745N5169J2648p439m3566m4091M2614j1433j8955K643J6837M5529M2725
10034A16426k6555q8190J1892K0426J8980n9466o6533m6953q836K1009L6544K2220
10022d9036Q54K5764j6235k0791O0823O3938k7436Q2340l0094n6821j09418K2757
10010e3355M1180P9826M6956k8325m0012k9577p845j3188p949k5823p1242k6811
9998a36165J29228P2633p3888m878J3587J3256l0691K8751K3728J3733k1538l5111
9986g355p1282J6099k2454q0574k6422J27251K0773K9764j4278K5954J9316J4676
$$ plain form
10069 59563 88628 109574 91920 43354 86657 121858 86862 63989 79588 97945 95127 144041
10057 144041 196237 174867 154631 89321 67383 31381 -4048 95449 110327 69913 23745
10046 23745 78914 91562 84123 40557 -3534 39080 27647 8692 11335 28172 73701 116426
10034 116426 89871 1681 13573 33999 52979 -6487 -73020 -119973 -128809 -107800 -71256 -49036
10022 -49036 -48182 -22418 -38653 -59444 1379 65317 37881 120221 90127 33306 -76112 -53355
10010 -53355 -12175 67651 114607 86282 46270 16693 8848 -4340 -12289 -38112 -109354 -136165
9998 -136165 -6937 65696 -8192 -13070 517 13773 -16918 11833 35561 49294 27756 -7355
9986 -7355 -78637 -62538 -84992 -165566 -191988 -64737 -43964 -14200 -28478 -2524 16792 31468
9974C1468M9201K7809J3847k3180k0765m9508m7237l3014L0468O8254J0045M881
9962F2269k7403m3665m2247J9503O2904l2067L2563K1483K6493l5524k4142j8367
9950A800P5842O541k8308j8107L1326J2304L5893L6663O2826M135k1570P203M109
9937B10657j1296M1103N2305R524Q5541K08030L19528L25293N37871R35626J599945
9926D314127J820833R66585l00085j094243j520152j405806r63028o27089l38472
9917H52670j23029j51871j81048r0803j29316q0803J1918k5827M0040L1426k3416
9906A29941l8445K7415o1348J7813M2968J5630p4036j38256j3876J8801l199k571
9894g9163N1556O6530K6900J2967M5239K1292q012K8864J15858n1100n9642j08923
$$ plain form
9974 31468 80669 108478 122325 99145 78380 28872 -18365 -51379 -20911 47343 57388 62269
9962 62269 34866 -8799 -51046 -31543 31361 -706 31857 53340 79833 44309 20167 1800
9950 1800 77642 84183 55875 37768 69094 81398 117291 153954 216780 220915 199345 206548 210657
9937 210657 199361 240464 292769 302293 387834 595864 915392 1240685 1778556 2714182 4314127
9926 4314127 6134960 7101545 6801460 5707217 4187065 2781259 1818231 1191142 852670
9917 852670 729641 577770 396722 305919 176603 95800 107718 81891 121931 153357 129941
9906 129941 91496 118911 57563 75376 118344 133974 59938 -78318 -92194 -73393 -76592 -79163
9894 -79163 -27607 38923 65823 78790 124029 145321 137309 166173 282031 230931 171289 62366
9882F2366j7277m6496j1182o142J4093L6085O361j1763J1624n8530J690p3773
9870i2944N374R6044L2071j7671q321m2959m1333O0846L6355Q1949J37782P2123
9858C19316N4126Q114p6447j31125j00406M4663L6356o1990k5994j7748j4278
9847C4587k0710k1547L2918O1852O3712J1129L2924J09150K02144J22568l7359
9836E91368p8488j86425j16744j08037L0827J053j8421q4861l4834K7496n2580
9825b9646J5008N7130p9726j02990m0051O6107J62181k2134l8801R356K8614m5837
9813b0789L7962L9255n5676n7739j878N158k0092R686Q5088Q7744o065o6215p7589
9800d1150N9686L2468j4850O245o9385K4310P6085l9415l1609k5094R286r8703
$$ plain form
9882 62366 45089 -1407 -12589 -18731 -4638 31447 37808 26045 37669 -20861 -19171 -92944
9870 -92944 -87570 8474 40545 22874 14553 -28406 -69739 -8893 27462 109411 247193 319316
9858 319316 373442 381556 305109 173984 73578 118241 154597 92607 66613 48865 34587
9847 34587 13877 -7670 25248 87100 150812 161941 194865 304015 506159 628727 591368
9836 591368 512880 326455 209711 101674 132501 133554 115133 30272 -4562 22934 -29646
9825 -29646 -14638 42492 -37234 -140224 -180275 -114168 48013 25879 -12922 -3566 25048 -20789
9813 -20789 17173 56428 752 -56987 -58865 -53707 -73799 -64113 20975 108719 102654 36439 -41150
9800 -41150 18536 51004 36154 42399 -26986 -2676 73409 33994 2385 -22709 -13423 -112126
9788a12126J6772P0291l361l7269J9537O5005L3862r25o4914n5599l4008m0808
9776a43543k3486j5544J0426M3867R9854Q0646j1543K7831n0118l5161J6167M055
9764C451o833M8150p833j8475L7750k2268q099J169m1130L5958M467K1740k74
9751D7773j1475J4466J0570j0167l1589l5694l7530P708P18n526N6785R53k1703
9738a4711j1946J8140O8915O7406L9383o9748r4181K143k031l0065L9612P8974
9726I1891r012o5937m8308p837O0681L0590l9006K455l0300J0911j6098m0572
9714f0542L0263N7919M8458J3596n6497n0776L28j856j6930O8493M5636Q390q9181
9701b699p4380l0741J416N8486N1710j9567K148J822N7473k4926p763K6896k3468
$$ plain form
9788 -112126 -95354 -25063 -28424 -65693 -46156 18849 52711 51786 -13128 -68727 -102735 -143543
9776 -143543 -167029 -182573 -172147 -128280 -28426 52220 40677 68508 18390 -16771 -604 3451
9764 3451 -3382 44768 36935 18460 56210 33942 25843 27012 -14118 21840 26307 48047 47773
9751 47773 36298 50764 61334 51167 19578 -16116 -53646 -45938 -45220 -50746 6039 6992 -14711
9738 -14711 -26657 -8517 60398 127804 167187 97439 3258 5401 3370 -26695 12917 91891
9726 91891 82879 16942 -31366 -39203 21478 52068 13062 15517 -14783 -3872 -19970 -60542
9714 -60542 -30279 27640 76098 89694 33197 -17579 -17251 -19107 -36037 32456 78092 86482 -2699
9701 -2699 -77079 -107820 -106404 -47918 3792 -15775 -13627 -11805 45668 20742 12979 39875 16407
9688A6407l0486L2922Q816o2836n4581j03296L8534P5147P0484N1825M4265k168
9676H5033j2147j47995j0010O3072M0408J8223J7411k2482o53l2077l3303K7565
9664f955J4164J2515l557m5397l7310O845N078k6033K3402n7475J0166J08651
9652D094R8108L2490j1812p3672m0871K5047j7980k2476n7877L110K5877P81N860
9639b9321j080M5313k4330k7426l4585M53l622P0669L9900N968K0706r146n294
9626D8205n5420o751L2274N6780o2406j16230k0759P7477O5707L881o2518q1344
9614a21104M2838N4503L3459m3881L1223M2360l4730m0568M4057M3682j7345n3262
9602a8768O2628O3995o4442p1398M0514N6012M525O409O688K3434j392l3108L1419
$$ plain form
9688 16407 -14079 18843 27659 -35177 -89758 -193054 -154520 -79373 -8889 42936 87201 85033
9676 85033 72886 -75109 -85119 -22047 18361 36584 53995 31513 30860 -1217 -34520 -6955
9664 -6955 7209 19724 16167 -29230 -66540 -59695 -54617 -80650 -57248 -114723 -104557 4094
9652 4094 102202 134692 122880 49208 8337 33384 15404 -7072 -64949 -61839 -35962 -35181 -29321
9639 -29321 -30401 14912 -9418 -36844 -71429 -70976 -74598 -3929 35971 41939 62645 53499 48205
9626 48205 -7215 -13966 18308 75088 12682 -103548 -124307 -46830 18877 22758 -39760 -121104
9614 -121104 -78266 -23763 9696 -34185 -2962 39398 4668 -35900 8157 51839 34494 -18768
9602 -18768 43860 107855 43413 -27985 12529 68541 73066 79475 86163 109597 108205 75097 106516
9589A06516k9798q8291p4342P3988M2635n7602k2863m1938q1481J9935N0131P4606
9577b8504L2915O823J5029k0010k9046p3946J8345o5233M2773R3892J3804j0785
9565c943j7262k0772m8622j4164L6570O6464L8j09301n9283Q1004k2046K5645
9553h5672M6457M8824r248k3029J7159K8108l4598o487k968k7924L2367N2106
9541C5095k2331j8324m6674o4703J6677L450L7598K9749m4722j9407K1134k455
9529g4913L110l5135M3395P8166O0823J0254q6463o5459k6211j7067L6731M1741
9517c1028L3374k6326j2929m7437M4554N8480L7593m5499n3767o466M2273O1542
9505E4364M5099j9606r1056j30256r37K6993L3990M9918N9300N0318j7009k6885
$$ plain form
9589 106516 76718 -11573 -85915 -11927 30708 -26894 -49757 -91695 -173176 -153241 -103110 -28504
9577 -28504 4411 11234 26263 6253 -22793 -96739 -78394 -143627 -100854 -6962 6842 -3943
9565 -3943 -21205 -41977 -90599 -104763 -68193 -1729 -1691 -110992 -170275 -89271 -111317 -85672
9553 -85672 -39215 9609 361 -22668 -5509 22599 -11999 -18486 -21454 -49378 -17011 35095
9541 35095 12764 -5560 -52234 -116937 -100260 -96810 -59212 -29463 -74185 -93592 -72458 -74913
9529 -74913 -71803 -106938 -63543 14623 75446 85700 -763 -66222 -92433 -109500 -72769 -31028
9517 -31028 2346 -23980 -36909 -84346 -39792 18688 56281 10782 -42985 -49451 -7178 54364
9505 54364 99463 79857 -11199 -141455 -142392 -115399 -81409 -31491 27809 78127 61118 34233
9493C4233k2520j0766O3112J1172l8884N184R0729K6786r7906j4247k5439n4146
9481c2692k8546K5722R6504k477o9434k5745o197K2140m8390k4110j7721K3630
9469h7316l3676M1841N4843N4450m9676m8044K9807N3692m8793K17K5720m2010
9457d8945J0554L7669m0006j0916L0979r5632m989q728K509J29347O7306l0895
9445C8253o8402n7215k9497J078j5313P092M4787K5888J2612J1016j7467k1092
9433f8260Q442M5461K6315K518M5648j7637k6404j0562J7403K2979j5746m273
9421B5884n0692N8789K5032o4323o5645l9772O1793P8221J6289l3232p7843M7318
9409a8181K0443o2607P507K8947L1692K7923m5477l7560P0070l615k4775j8033
$$ plain form
9493 34233 11713 947 64059 75231 36347 41531 132260 159046 61140 46893 21454 -32692
9481 -32692 -61238 -35516 60988 58511 -10923 -36668 -42865 -20725 -69115 -93225 -110946 -87316
9469 -87316 -120992 -79151 -24308 30142 -19534 -67578 -37771 15921 -32872 -32655 -6935 -48945
9457 -48945 -38391 -722 -40728 -51644 -20665 -116297 -121286 -130014 -127505 1842 69148 38253
9445 38253 -30149 -87364 -116861 -115783 -131096 -124004 -79217 -53329 -40717 -29701 -47168 -68260
9433 -68260 -59818 -14357 11958 14476 60124 42487 16083 5521 22924 45903 30157 25884
9421 25884 -24808 33981 59013 -5310 -70955 -110727 -48934 29287 45576 12344 -65499 -18181
9409 -18181 2262 -60345 -52838 -23891 7801 35724 -9753 -47313 22757 19142 -5633 -23666
9397b3666l0040j3297P23N5737j4357j8410k4450P6386K2680M643J11051l1672
9385A15328o2766k7535q178k4466K883l388l5223O317K8965L3889N5728l6103
9373D5451l9439P6410J4412l1275j3795r169J0464m1903m9472j6762r7172O5008
9361h7242P7062r655N9199N5978m5357r6644M3907L6859k3258q8530o2095k542
9349a42318J9001K7383L5823N7028k7505k1615N1383O41l2364L9625M831m4479
9337c2566O253k0215L9442J14193J7128p8698p4523m1722m3405j7955M9558M8183
9325c4327M7752Q16k953k1804p4471L7601L6278j9241l0434n5401k0376M330P5715
9312e6515m2285m0542N93N9676L6685K1300P9341m644n3213k2803l6390j5512
$$ plain form
9397 -23666 -53706 -67003 -66280 -10543 -24900 -43310 -67760 8626 31306 35949 147000 115328
9385 115328 52562 25027 16849 -7617 -4734 -8122 -43345 -37028 -8063 25826 81554 45451
9373 45451 6012 82422 96834 65559 51764 42595 53059 11156 -38316 -55078 -152250 -87242
9361 -87242 -10180 -19835 39364 95342 49985 -46659 -2752 34107 10849 -77681 -139776 -142318
9349 -142318 -123317 -95934 -60111 -3083 -30588 -52203 -820 -179 -32543 7082 11913 -32566
9337 -32566 -26313 -46528 -7086 107107 124235 45537 -28986 -70708 -114113 -132068 -82510 -34327
9325 -34327 13425 14241 11288 -10516 -84987 -47386 -11108 -30349 -60783 -116184 -136560 -132230 -56515
9312 -56515 -98800 -139342 -138749 -79073 -42388 -21088 58253 53609 396 -22407 -58797 -74309
9300g4309K2410O725L2973l5285m2740n1588P4581O9674O9011k080n3534j4163
9288A675J0527K383J591p2114N4175P9001l0512j370K102j8837m016n1086l5131
9275f1612N5979j5714o7741K7203O4945r931r766J2523L032k4311m0184K8706
9263c6871o308M3703J7832N4830p05p618o0340M4579K8915K1337P3668J3505r4934
9250I1593r1494L4079R288K0236p0027j0271J8370K7983q4594l8735O9343M3600
9238A9371l8464l4525j7379n5989K6246M2610P6420K1474l3462q84L9240k4026
9226B0632n7420l1097R0276R4105j3727p3314k8782j9795K5199K667j4575l3315
9214c9146p624Q310N0642l0148o75J31115N9865n3442o6138n3984L0323l2147
$$ plain form
9300 -74309 -51899 -45174 -12201 -47486 -90226 -141814 -67233 2441 71452 69372 15838 1675
9288 1675 12202 14585 16176 -55938 -1763 77238 46726 45356 47458 28621 24605 -26481 -61612
9275 -61612 -5633 -21347 -89088 -61885 3060 -6871 -16637 -4114 -1082 -25393 -65577 -36871
9263 -36871 -43179 524 18356 73186 72481 64863 4523 49102 78017 99354 173022 186527 91593
9250 91593 99 34178 43466 63702 -6325 -16596 1774 29757 -54837 -93572 -24229 19371
9238 19371 -19093 -53618 -70997 -126986 -100740 -58130 18290 39764 6302 5418 44658 20632
9226 20632 -36788 -67885 22391 116496 102769 29455 673 -19122 6077 8744 -5831 -39146
9214 -39146 -46770 -38460 12182 -17966 -18641 112474 172339 118897 52759 -1225 29098 -3049
9202c049M521L1642J1473N241j5356K7769L7359j9083k3432m429o4848j3939K4790
9189a341P3291Q1466m2451q9165k5982N8862L1890m097l5352K2645J8926J8097
9177A06789m0580m5812l5607l1256N8228M0512J4215N7607l119l8842q934p1362
9165A839l393R397P895K3628o3842r685L895J6328N6865O105l2942m9496K6784
9152f622L3618n3094m543L8217N1442j1851o7698P032n6334J3468O103N1418l5945
9139c4789J06727j3003q781k3107p562m7932r1447N4985J377m8502K3705P591
9127h0738J8190N9928k0926p07o7334k2733k2094O1538O7238M6586n5737o7552
$$ plain form
9202 -3049 1472 33114 44587 49828 34472 62241 99600 80517 57085 52656 -12192 -26131 -1341
9189 -1341 71950 153416 110965 21800 -4182 54680 86570 82473 47121 69766 88692 106789
9177 106789 66209 20397 -15210 -46466 11762 52274 66489 124096 120977 82135 73201 1839
9165 1839 -1554 7843 15738 39366 -24476 -34161 -30266 -13938 42927 49032 16090 -33406 -6622
9152 -6622 26996 -26098 -30641 7576 59018 47167 -20531 -13499 -69833 -56365 -50262 1156 -34789
9139 -34789 71938 58935 50154 27047 19485 -28447 -119894 -64909 -63532 -112034 -88329 -80738
9127 -80738 -62548 -2620 -23546 -24253 -91587 -114320 -136414 -74876 -7638 38948 -16789 -84341
$$ [...]
##END NTUPLES=NMR SPECTRUM
##END=
