##TITLE=Analysis number 318897
Compound Code cc 44508
Book Reference 464/36
Project Code adrs
Chemist Name chrisr
##JCAMPDX= 6.0         $$ Bruker NMR JCAMP-DX V2.0
##DATA TYPE= NMR SPECTRUM
##DATA CLASS= NTUPLES
##ORIGIN= Bruker BioSpin GmbH
##OWNER= nmr
$$ XWIN-NMR		Version 3.5
$$ Mon Apr 24 11:56:49 2006 GMT Daylight Time (UT+1h)  MAYBRIDGE\nmr@NMR_250MHZ
##.OBSERVE FREQUENCY= 250.131544655141
##.OBSERVE NUCLEUS= ^1H
##.ACQUISITION MODE= SIMULTANEOUS (DQD)
##.ACQUISITION SCHEME= undefined
##.AVERAGES= 16
##.DIGITISER RES= 18
##SPECTROMETER/DATA SYSTEM= dpx250
##.PULSE SEQUENCE= zg30
##.SOLVENT NAME= CDCl3
##.SHIFT REFERENCE= (INTERNAL, CDCl3, 0, 16.4388)
##AUDIT TRAIL= $$ (NUMBER, WHEN, WHO, WHERE, WHAT)
$$ ##TITLE= Audit trail, XWIN-NMR		Version 3.5
$$ ##JCAMPDX= 5.01
$$ ##ORIGIN= Bruker BioSpin GmbH
$$ ##OWNER= nmr
$$ C:\u/data/dgb/nmr/ADRS/2830/pdata/1/auditp.txt
$$ ##AUDIT TRAIL=  $$ (NUMBER, WHEN, WHO, WHERE, WHAT)
(   1,<2006-04-24 11:56:21.00 +100>,<MAYBRIDGE\nmr>,<NMR_250MHZ>,
      <created by zg, POWCHK disabled, PULCHK disabled
       configuration hash MD5:
       84 BC 41 DB A1 6E 1D 46 DA 25 12 A5 C1 ED C5 3A
       data hash MD5: 64K
       D4 15 2B FE A6 32 4E 77 3A 34 3F BA 96 D6 43 55>)
(   2,<2006-04-24 11:56:32.67 +100>,<MAYBRIDGE\nmr>,<NMR_250MHZ>,
      <Start of raw data processing
       ef LB = 0.3 FT_mod = 6 PKNL = 1 SI = 32K 
       data hash MD5: 32K
       DD 14 6A C7 93 2D CD 82 E7 BC B5 28 CE FE EE 3C>)
(   3,<2006-04-24 11:56:34.33 +100>,<MAYBRIDGE\nmr>,<NMR_250MHZ>,
      <apk 
       data hash MD5: 32K
       42 28 44 79 D8 20 D8 C7 A1 DD C6 44 BE AA 67 F2>)
(   4,<2006-04-24 11:56:35.09 +100>,<MAYBRIDGE\nmr>,<NMR_250MHZ>,
      <abs ABSG = 5 
       data hash MD5: 32K
       D9 18 1C 36 7A 2F 87 80 74 DC 3A 4B CC C5 E2 DE>)
$$ ##END=
$$ 
$$ hash MD5
$$ FF D8 CA 1C 4F A0 CD 2C EC 69 41 C0 31 3E EE 8C
##$RELAX= 
##$RELAX= 
##$RELAX= 
##$RELAX= 
##$RELAX= 
##$RELAX= 
##$RELAX= 
$$ Bruker specific parameters
$$ --------------------------
##$DU= <C:\u>
##$EXPNO= 2830
##$NAME= <ADRS>
##$PROCNO= 1
##$TYPE= <nmr>
##$USER= <dgb>
##$AMP= (0..31)
100 100 100 100 100 100 100 100 100 100 100 100 100 100 100 100 100 100 
100 100 100 100 100 100 100 100 100 100 100 100 100 100 
##$AQSEQ= 0
##$AQ_mod= 3
##$AUNM= <au_zg>
##$AUTOPOS= <19 >
##$BF1= 250.13
##$BF2= 250.13
##$BF3= 250.13
##$BF4= 250.13
##$BF5= 500.13
##$BF6= 500.13
##$BF7= 500.13
##$BF8= 500.13
##$BYTORDA= 1
##$CFDGTYP= 0
##$CFRGTYP= 5
##$CHEMSTR= <none>
##$CNST= (0..31)
1 1 145 1 1 1 1 1 1 1 1 1 1 1 1 1 1 1 1 1 1 1 1 1 1 1 1 1 1 1 1 1 
##$CPDPRG= <>
##$CPDPRG1= <>
##$CPDPRG2= <>
##$CPDPRG3= <>
##$CPDPRG4= <mlev>
##$CPDPRG5= <mlev>
##$CPDPRG6= <mlev>
##$CPDPRG7= <mlev>
##$CPDPRG8= <mlev>
##$CPDPRGB= <>
##$CPDPRGT= <>
##$D= (0..31)
0 1 0 0 0 0 0 0 0 0.06 0 0 0 0 0 0 0.0002 0 0 0 0 0 0 0 0 0 0 0 0 0 0 
0 
##$DATE= 1145876180
##$DBL= (0..7)
120 120 120 120 120 120 120 120 
##$DBP= (0..7)
150 150 150 150 150 150 150 150 
##$DBP07= 0
##$DBPNAM0= <>
##$DBPNAM1= <>
$$ [...]
##$SUBNAM7= <"">
##$SUBNAM8= <"">
##$SUBNAM9= <"">
##$SW= 20.6930455092707
##$SWIBOX= (0..15)
0 0 3 0 0 0 0 0 0 0 0 0 0 0 0 0 
##$SW_h= 5175.983436853
##$TD= 65536
##$TD0= 1
##$TE= 295.16
##$TE2= 300
##$TE3= 300
##$TEG= 300
##$TL= (0..7)
0 120 120 120 120 120 120 120 
##$TP= (0..7)
150 150 150 150 150 150 150 150 
##$TP07= 0
##$TPNAME0= <>
##$TPNAME1= <>
##$TPNAME2= <>
##$TPNAME3= <>
##$TPNAME4= <>
##$TPNAME5= <>
##$TPNAME6= <>
##$TPNAME7= <>
##$TPOAL= (0..7)
0.5 0.5 0.5 0.5 0.5 0.5 0.5 0.5 
##$TPOFFS= (0..7)
0 0 0 0 0 0 0 0 
##$TUNHIN= 0
##$TUNHOUT= 0
##$TUNXOUT= 0
##$USERA1= <user>
##$USERA2= <user>
##$USERA3= <user>
##$USERA4= <user>
##$USERA5= <user>
##$V9= 5
##$VALIST= <valist>
##$VCLIST= <CCCCCCCCCCCCCCC>
##$VD= 0
##$VDLIST= <DDDDDDDDDDDDDDD>
##$VPLIST= <PPPPPPPPPPPPPPP>
##$VTLIST= <TTTTTTTTTTTTTTT>
##$WBST= 1024
##$WBSW= 4
##$XGAIN= (0..3)
0 0 0 0 
##$XL= 0
##$YL= 0
##$YMAX_a= 502795
##$YMIN_a= -529943
##$ZGOPTNS= <>
##$ZL1= 120
##$ZL2= 120
##$ZL3= 120
##$ZL4= 120
##$ABSF1= 16.43876
##$ABSF2= -4.254412
##$ABSG= 5
##$ABSL= 3
##$ALPHA= 0
##$AQORDER= 0
##$ASSFAC= 0
##$ASSFACI= 0
##$ASSFACX= 0
##$ASSWID= 0
##$AUNMP= <proc_1d>
##$AZFE= 0.1
##$AZFW= 0.1
##$BCFW= 0
##$BC_mod= 0
##$BYTORDP= 0
##$COROFFS= 0
##$CY= 12.5
##$DATMOD= 1
##$DC= 0
##$DFILT= <>
##$DTYPP= 0
##$F1P= 14.0000005364418
##$F2P= -0.99999901652339
##$FCOR= 0.5
##$FTSIZE= 32768
##$FT_mod= 6
##$GAMMA= 0
##$GB= 0
##$INTBC= 1
##$INTSCL= 1
##$ISEN= 128
##$LB= 0.3
##$LEV0= 0
##$LPBIN= 0
##$MAXI= 10000
##$MC2= 0
##$MEAN= 0
##$ME_mod= 0
##$MI= 0
##$NCOEF= 0
##$NC_proc= -4
##$NLEV= 6
##$NOISF1= 0
##$NOISF2= 0
##$NSP= 0
##$NTH_PI= 0
##$NZP= 0
##$OFFSET= 16.43876
##$PC= 1
##$PHC0= 165.6688
##$PHC1= 8.593331
##$PH_mod= 1
##$PKNL= yes
##$PPARMOD= 0
##$PSCAL= 4
##$PSIGN= 0
##$REVERSE= no
##$SF= 250.130020818475
##$SI= 32768
##$SIGF1= 0
##$SIGF2= 0
##$SINO= 400
##$SIOLD= 32768
##$SREGLST= <1H.CDCl3>
##$SSB= 0
##$STSI= 32768
##$STSR= 0
##$SW_p= 5175.98343685301
##$SYMM= 0
##$S_DEV= 0
##$TDeff= 65536
##$TDoff= 0
##$TI= <Analysis number 999999
Compound Code 99
Book Reference 9
Project Code 9>
##$TILT= no
##$TM1= 0
##$TM2= 0
##$TOPLEV= 0
##$USERP1= <user>
##$USERP2= <user>
##$USERP3= <user>
##$USERP4= <user>
##$USERP5= <user>
##$WDW= 1
##$XDIM= 32768
##$YMAX_p= 498811662
##$YMIN_p= -251665
$$ End of Bruker specific parameters
$$ ---------------------------------
##NTUPLES= NMR SPECTRUM
##VAR_NAME=  FREQUENCY,     SPECTRUM/REAL,   SPECTRUM/IMAG
##SYMBOL=    X,             R,               I
##VAR_TYPE=  INDEPENDENT,   DEPENDENT,       DEPENDENT
##VAR_FORM=  AFFN,          ASDF,            ASDF
##VAR_DIM=   32768,         32768,           32768
##UNITS=     HZ,            ARBITRARY UNITS, ARBITRARY UNITS
##FACTOR=    0.157963299565203, 1,           1
##FIRST=     4111.82757048997, 0,            0
##LAST=      -1064.15586636304, 0,           0
##MIN=       -1064.15586636304, -251665,     0
##MAX=       4111.82757048997, 498811662,    0
$$ Real data points
##PAGE= N=1
##DATA TABLE= (X++(R..R)), XYDATA
$$ [...]
19138H2513R504J5439N122k772l5070Q076R733l7009M3028J1360j3060K1077n609
$$ 82513 92017 107456 112578 109806 74736 82812 92545 55536 98564 109924 96864 117941 112332
19125A12332k2529K3035l6739M983K5757o1778q905R369j0719n7258J3302Q321
$$ 112332 89803 112838 76099 81082 106839 45061 36156 45525 34806 -22452 -9150 -829
19113h29k138O1148j8398N2814k1068k4762M013N326N954L6386j2419M2936L5225
$$ -829 -2967 58181 39783 92597 71529 46767 50780 56106 62060 98446 86027 128963 164188
19100A64188K1154J6456N2172k2306m1965k193L8787M5394q573n6149P566K3860
$$ 164188 185342 201798 253970 231664 189699 187506 226293 271687 263114 206965 214531 238391
19088B38391n0931N4960M7699j893k269N9480J5795o666k4734n0529o0510m245
$$ 238391 187460 242420 290119 288226 285957 345437 361232 354566 329832 279303 218793 214548
19076B14548J1500O0466j2247J3147K4664J2506l3600n9526o7072j7375J5666
$$ 214548 226048 286514 274267 287414 312078 324584 290984 231458 164386 147011 162677
19065A62677M9988J2833l7717l7445j4549o1710j4476N2492L5986K0973J1715
$$ 162677 212665 225498 187781 150336 135787 74077 59601 112093 148079 169052 180767
19054A80767M5731j4559L4992L3114M9685p69r503K7808J8469K2199L3721O0606
$$ 180767 226498 211939 246931 280045 329730 328961 319458 347266 365735 387934 421655 482261
19042D82261J4391k4138k0947n7147n372j885q4242j22635k7496O8284M1365P7067
$$ 482261 496652 472514 451567 394420 389048 387163 302921 180286 152790 221074 262439 339506
19030C39506J07887p225k4582n1753j6264j05054m9637j1877M659j80851o521
$$ 339506 447393 440168 415586 363833 347569 242515 192878 181001 185660 4809 -1712
19019a712N4370O955J0464N793K028L4267m2725l8333K141m8853j7699L5193l2630
$$ -1712 52658 59613 70077 75870 77898 112165 69440 31107 33248 -15605 -33304 1889 -30741
19006c0741j8620P4519O6931K0089J57633j6448p4978j7075m8987o7404o5311
$$ -30741 -49361 25158 92089 112178 269811 253363 178385 161310 112323 44919 -20392
18995b0392l1477j398J7941M5536L0804M9946L3542K2299L9726M5093l634r775
$$ -20392 -51869 -53267 -35326 10210 41014 90960 124502 146801 186527 231620 227986 218211
18983B18211J4098j0630j254J9756L004j25009q2633K1731K1388P372L1270M5890
$$ 218211 232309 221679 220425 240181 243185 118176 35543 57274 78662 86034 117304 163194
18971A63194p3124j7108k212N1358P4788p195R893M115l6132j1483K1862L0415
$$ 163194 90070 72962 70750 122108 196896 189701 199594 203709 167577 156094 177956 208371
18959B08371n5979o1522l3858m5153L5957N0447R7P4810k672l1445L2040o052
$$ 208371 152392 90870 57012 11859 47816 98263 98360 173170 170498 139053 171093 165041
18947A65041m4511j4514J8033Q49K5972M366j3786k1432k3421J18030M0834l8790
$$ 165041 120530 106016 124049 124898 150870 155236 141450 120018 96597 214627 255461 216671
18935B16671L0513M5641J5804o2651j27823j9465M2066j6402k0662m045M702l2600
$$ 216671 247184 292825 308629 245978 118155 98690 140756 124354 103692 99647 104349 71749
18923G1749l9021L1128k0652J7455k0002J3964O5269k0655J349N3021N4008p260
$$ 71749 32728 63856 43204 60659 40657 54621 119890 99235 100584 153605 207613 200353
18911B00353l7803o0240n1389N2031K7814L4136K787l5414m6450K9379M3141J1902
$$ 200353 162550 102310 50921 102952 130766 164902 167689 132275 85825 115204 158345 170247
18899A70247k378o1889q9465J3312N2308Q2829L0833l6011o2106m4010P3597N7977
$$ 170247 167869 105980 16515 29827 82135 164964 195797 159786 97680 53670 127267 185244
18887A85244r901m6684o6867K4749N6369J1254M697j210L8680k7293l9560J7354
$$ 185244 175343 128659 61792 86541 142910 154164 158861 157651 196331 169038 129478 146832
18875A46832P4956j3900k6067n364L5765N9037M601j2842m7410q6449j8474k389
$$ 146832 221788 207888 181821 176457 212222 271259 275860 263018 215608 129159 110685 108296
18863A08296K5595O5059o959O1992M945l3755P840K0741l51L4782M7273o165p2271
$$ 108296 133891 198950 191991 253983 258928 225173 233013 253754 253403 288185 335458 329293 257022
18850B57022O731O5295O06j7990m5925L41J4400Q662L1896L9202L8745M1513K7626
$$ 257022 263753 329048 329654 311664 265739 266080 280480 289142 321038 360240 398985 440498 468124
18837D68124n4562q604N2268M5144q031k3198M0614N5966L1599J08438J29283
$$ 468124 413562 404958 457226 502370 494339 471141 511755 567721 599320 707758 837041
18826H37041J07873P1038m2219k5823M6387M6112O6978p485k9726p6268q6206
$$ 837041 944914 1015952 973733 947910 994297 1040409 1107387 1099902 1070176 993908 907702
18815I07702m1946n6270L1961K4323J7628Q3456l6924n4770L3524m549o5277l1128
$$ 907702 865756 809486 841447 865770 883398 966854 929930 875160 908684 904135 838858 807730
18803H07730o6M5711L3492k2416o2050K8028k2218m7748K8969n6199m5933J5139
$$ 807730 807664 853375 886867 864451 802401 830429 808211 760463 789432 733233 687300 702439
18791G02439N5445J01243J03891j2063j0304N3177J39436J7406M3889O3136M0585
$$ 702439 757884 859127 963018 950955 940651 993828 1133264 1150670 1194559 1257695 1298280
18780A298280L4033P7264J83677J48717J63826N9964r2204k20753k52080k04155
$$ 1298280 1332313 1409577 1593254 1741971 1905797 1965761 1873557 1652804 1400724 1196569
18770A196569r4483l6154N6217J07674P9977J37849J32662O9871J08097k5462
$$ 1196569 1102086 1065932 1122149 1229823 1309800 1447649 1580311 1650182 1758279 1732817
18760A732817k41183j15632P780L9225J44415P1760N5184m7613m1228L7854P528
$$ 1732817 1491634 1376002 1383782 1423007 1567422 1639182 1694366 1646753 1605525 1643379 1650907
18749A650907r463J5761K6178P4855N8578N8379L8550Q6868J8427K1193p9039
$$ 1650907 1641444 1657205 1683383 1758238 1816816 1875195 1913745 2000613 2019040 2040233 1961194
18738A961194m6129l8201O0037N1713K7712J97697K77199J89189J88345J10118
$$ 1961194 1915065 1876864 1936901 1988614 2016326 2214023 2491222 2680411 2868756 2978874
18728B978874J94807L17950L22295L07445K66452K57109L18246K33143L25556
$$ 2978874 3173681 3491631 3813926 4121371 4387823 4644932 4963178 5196321 5521877
18719E521877L82113M65794O83482R18870J328123J798512K646070L665900M781107
$$ 5521877 5903990 6369784 7053266 7972136 9300259 11098771 13744841 17410741 22191848
18710B2191848N858917O860278O971952O550498N817606M024388J863252Q73711
$$ 22191848 28050765 34911043 41882995 48433493 54251099 58275487 60138739 61012450
18702F1012450O68802O77072K320197N553535Q555966J0351125J0385052R303491
$$ 61012450 61681252 62358324 64678521 70232056 78788022 89139147 99524199 108827690
18694A08827690O424677J939920j098864l653335o422733p515761p014469m986641
$$ 108827690 115252367 117192287 116093423 112440088 106017355 98501594 91487125 86500484
18686H6500484l042581j578334j55446n20035j845249l230800m805697o333387
$$ 86500484 83457903 81879569 81724123 81204088 79358839 76128039 71322342 64988955
18678F4988955q070149q188946p053424o041205m619272l148360k278755j785863
$$ 64988955 56918806 48729860 41676436 35635231 31015959 27867599 25588844 23802981
18670B3802981j495889j246973j019921q18689p55908p44626p50392o40749n76474
$$ 23802981 22307092 21060119 20040198 19221509 18465601 17720975 16970583 16329834 15753360
18661A5753360n83134n63123n31223m72388n17772m29187k69969l06268l18618
$$ 15753360 15170226 14607103 14075880 13603492 13085720 12656533 12386564 12080296 11761678
18652A1761678l17917l72709l14031l15465l79104l20349k74025l35144k44191
$$ 11761678 11443761 11071052 10757021 10441556 10062452 9742103 9468078 9132934 8888743
18643H888743k45998l04813k24666q7943j46977k31601j35442j11778j78730j68056
$$ 8888743 8642745 8337932 8113266 8025323 7878346 7646745 7511303 7399525 7220795 7052739
18633G052739j44985j49646j26151j38157j34604k0876q6995j06287r8285m6381
$$ 7052739 6907754 6758108 6631957 6493800 6359196 6338320 6251325 6145038 6046753 6000372
18623F000372J2035k9632m0026m1523J5904k5486k0721l8276L3110O9630l063
$$ 6000372 6012407 5982775 5942749 5901226 5917130 5891644 5870923 5832647 5865757 5935387 5932324
18612E932324Q541R8880K01172K62240J80651K22835K75828M36016P20197J020706
$$ 5932324 5940865 6039745 6240917 6503157 6683808 6906643 7182471 7618487 8338684 9359390
18602I359390J567439K550647L809777N067538N847383N606057L791164R11995
$$ 9359390 10926829 13477476 17287253 22354791 28202174 33808231 37599395 38511390
18594C8511390k305520m148912l774610j718574J202545M279834P298526R522987
$$ 38511390 36205870 32056958 28282348 26563774 27766319 32046153 39344679 48867666
18586D8867666R637995O860262J377531n027689r523431r935550p227159l864977
$$ 48867666 58505661 65365923 66743454 61715765 52192334 42256784 35029625 31164648
18578C1164648p84288J680822L206090L353891K003731o97471l780676n606209
$$ 31164648 30380360 32061182 35267272 38621163 40624894 39927423 36146747 30540538
18570C0540538n354363l882042k403156j400484r12739o11429l81037k44134p7988
$$ 30540538 25186175 21304133 18900977 17500493 16587754 15976325 15595288 15351154 15273166
18561A5273166J1508J58595L91368P35528J403464K350122L719542N259126O531241
$$ 15273166 15284674 15443269 15834637 16570165 17973629 20323751 24043293 29302419 35833660
18552C5833660O987724N666466K856466m84374m028547n110815l775168j037403
$$ 35833660 42821384 48487850 51344316 50859942 46831395 41720580 37945412 36908009
18544C6908009K774517O737886J0170114J2092630J1258011P200666M15129o569048
$$ 36908009 39682526 46420412 56590526 68683156 79941167 87141833 87556962 80987914
18536H0987914j1046975j2029634r457868n692396j639374J889535L974852M508945
$$ 80987914 69940939 57911305 48453437 42761041 41121667 43011202 46986054 51494999
18528E1494999L042256k25690m260426p295707p729161o453709m430683k881435
$$ 51494999 54537255 54311565 50051139 42755432 35026271 28572562 24141879 21260444
18520B1260444k005750j394013j073638r21626o83147n89848o81814o29040n05578
$$ 21260444 19254694 17860681 16787043 15865417 15182270 14592422 13910608 13281568 12775990
18511A2775990n02236m56296m17104m01396l32988l67947k99718k92227k52046
$$ 12775990 12273754 11817458 11400354 10998958 10665970 10298023 9998305 9706078 9454032
18502I454032k52393k62573l11232l63621k40040k11286k44817k14734q2179j03874
$$ 9454032 9201639 8939066 8627834 8264213 8024173 7812887 7568070 7353336 7271157 7167283
18492G167283j03559N2260o064j10733q9085o5671n4584o4186p5294r1165o4751
$$ 7167283 7063724 7115984 7109920 6999187 6910102 6844431 6789847 6725661 6650367 6559202 6494451
18481F494451j19448j15587k33821k26068j36114j52978j46864j48986r3603K326
$$ 6494451 6375003 6259416 6025595 5799527 5663413 5510435 5363571 5214585 5120982 5123308
18471E123308m2714K8810P7671m8594p7332n6703m3545l7513p2263r5859j8872
$$ 5123308 5080594 5109404 5187075 5138481 5061149 5004446 4960901 4923388 4851125 4755266 4736394
18460D736394j12816q2012j47449j52675j13505p2100j27742r2437o9344n4359
$$ 4736394 4623578 4541566 4394117 4241442 4127937 4055837 3928095 3835658 3766314 3711955
18450C711955K1731Q4945r08j51125j10549p3133j50330r3791n2956j6243j8312
$$ 3711955 3733686 3818631 3817723 3666598 3556049 3482916 3332586 3238795 3185839 3169596 3151284
18439C151284K5794L0395l2850m5268j38061q6701N508m4874l0478J404J2162
$$ 3151284 3177078 3207473 3174623 3129355 2991294 2904593 2910101 2865227 2834749 2836153 2848315
18428B848315J5532j03376l4187l125P1002l5482k7475m018l1047m2840k1934
$$ 2848315 2863847 2760471 2726284 2723159 2794161 2758679 2731204 2727186 2696139 2653299 2631365
18417B631365K701m0598M6704R7003M6630Q345k5508J9953J5756m4072J4469L9812
$$ 2631365 2634066 2593468 2640172 2737175 2783805 2792150 2766642 2786595 2802351 2758279 2772748 2812560
18405B812560J06201J01483J24207J52419O3293l5256j1486q3565k03915j43227
$$ 2812560 2918761 3020244 3144451 3296870 3360163 3324907 3313421 3229856 3025941 2882714
18395B882714l3366k4494k3911J6728o3171m6027q1018m7099k5643n2939J2099
$$ 2882714 2849348 2824854 2800943 2817671 2754500 2708473 2627455 2580356 2554713 2501774 2513873
18384B513873K2985l9099l1317k975N6393O4954M811L0260j14581j27586M009
$$ 2513873 2536858 2497759 2466442 2463467 2519860 2584814 2589625 2619885 2505304 2377718 2381727
18373B381727L9316L5521O3017N2316N7034M1164p5580r6114o5298K4948O3683
$$ 2381727 2421043 2456564 2519581 2571897 2628931 2670095 2594515 2498401 2433103 2458051 2521734
18362B521734N9684L5224K408K1662N8370N1861N8775O4523P0360J21863J42736
$$ 2521734 2581418 2616642 2619050 2640712 2699082 2750943 2809718 2874241 2944601 3066464 3209200
18351C209200Q2767J50689K63970L20517L49946K53132P4156j21634j36288j61417
$$ 3209200 3291967 3442656 3706626 4027143 4377089 4630221 4704377 4582743 4446455 4285038
18341D285038p9534o0344J5233P0151Q7261P6009J47251J60864K29836K47221
$$ 4285038 4205504 4145160 4160393 4230544 4317805 4393814 4541065 4701929 4931765 5178986
18331E178986K79492M93090O67716J092822J616302K553775L706245M957448N929012
$$ 5178986 5458478 5951568 6619284 7712106 9328408 11882183 15588428 20545876 26474888
18322B6474888O032062N189874L237490P32649j028421k338654m059425n937287
$$ 26474888 32506950 37696824 40934314 41666963 40638542 38299888 34240463 28303176
18314B8303176o178628m818979l104441j874107j241365q62452n81593l56410
$$ 28303176 22124548 17305569 14201128 12327021 11085656 10223204 9641611 9285201
18306I285201k46996k79779k19216j95570j86759K21O7561O548J09286J96657
$$ 9285201 9038205 8758426 8539210 8343640 8156881 8157102 8224663 8231211 8340497 8537154
18296H537154J37558P5181K8958j8868p4938j64333j17387J23921K70696L52845
$$ 8537154 8674712 8749893 8778851 8759983 8685045 8520712 8403325 8527246 8797942 9150787
18286I150787M69516N90661O79364J039150J517221K140348L168486M852452P184506
$$ 9150787 9620303 10210964 10890328 11929478 13446699 15587047 18755533 23607985 30792491
18277C0792491J0098874J3199172J5587582J5876533J3686579R281499L052265
$$ 30792491 40891365 54090537 69678119 85554652 99241231 108522730 111574995
18270A11574995l044583p298600j0976128j4672529j6043564j3360406r145781
$$ 111574995 108530412 101231812 90255684 75583155 59539591 46179185 37033404
18263C7033404n716606l592113k333786j716864j262723r21934o25972k98360
$$ 37033404 31316798 27724685 25390899 23674035 22411312 21489378 20863406 20565046
18255B0565046o1392R6869M12534O79527Q24006J187697J706722K481327L751529
$$ 20565046 20503654 20600523 21013057 21692584 22516590 23704287 25411009 27892336 31643865
18246C1643865O302937J0209807J3853755J3922368J0492008M660475n676187
$$ 31643865 37946802 48156609 62010364 75932732 86424740 91085215 85409028
18239H5409028j0059567j068220J0021967J5736681J3884963Q252175l238411
$$ 85409028 75349461 74281241 84303208 100039889 113924852 122177027 118938616
18232A18938616j6372000j3083818p59434P863008J0994483J0487470P586599
$$ 118938616 102566616 89482798 88723364 96586372 107580855 118068325 125654924
18225A25654924M232253N550286J0937249J5409634J5066635R370950L667387
$$ 125654924 129887177 135437463 146374712 161784346 176850981 186221931 189889318
18218A89889318l367011j6191437j8818473n686078Q888885J7917525J9782068
$$ 189889318 186522307 170330870 151512397 145826319 154715204 172632729 192414797
18211A92414797J6360803L620899j1981301j4390901j2898496j6072990j8497057
$$ 192414797 208775600 212396499 200415198 186024297 173125801 157052811 138555754
18204A38555754j5375602r269117o06429R124634J7637148K1198067J6769694
$$ 138555754 123180152 113911035 113304606 122429240 140066388 161264455 178034149
18197A78034149O833094q753432k4404854k3694101j1802835j353288K992956
$$ 178034149 184867243 176113811 151708957 128014856 116212021 114858733 117851689
18190A17851689J892055l655800j3696514j8585708j3932935q218660n037053
$$ 117851689 119743744 116087944 102391430 83805722 69872787 61654127 56617074
18183E6617074l442903k501710j863180j511991j177604o30121j5269Q65860J817385
$$ 56617074 53174171 50672461 48809281 47297290 46119686 45489565 45474296 46340156 48157541
18174D8157541K741285L685194M571964N474836O812805R597870J3828883J8104101
$$ 48157541 50898826 54584020 59155984 64630820 71443625 81041495 94870378 112974479
18166A12974479J7992882J3130554L871218j0635951j5528756n229466N574924
$$ 112974479 130967361 144097915 147969133 137333182 121804426 116574960 122149884
18159A22149884Q998721N256111k633277j3941792k3400543k0474062j1812377
$$ 122149884 131148605 136404716 133771439 119829647 96429104 75955042 64142665
18152F4142665n756375k746191j720356j853007k584847l482896l809847l421178
$$ 64142665 58386290 55640099 53919743 52066736 49481889 45998993 42189146 38767968
18144C8767968k708672j949482j530476j306274j135380j081385j012432r91297
$$ 38767968 36059296 34109814 32579338 31273064 30137684 29056299 28043867 27052570
18136B7052570q85270p24628o48369o52829o68886o78629n77314n58048n05645
$$ 27052570 26167300 25442672 24794303 24141474 23472588 22793959 22216645 21658597 21152952
18127B1152952n72757n64550m25109m41108m81682l62664k07518j68637j63725
$$ 21152952 20580195 20015645 19590536 19149428 18667746 18305082 18097564 17928927 17765202
18118A7765202n494J0091N4417J27007L87934O98971J199988K031815L453082
$$ 17765202 17759708 17769799 17824216 17951223 18339157 19038128 20238116 22269931 25723013
18109B5723013N978683J0335054J6030767J8375418J3449988P167551p813721
$$ 25723013 31701696 42036750 58067517 76442935 89892923 97060474 89246753
18102H9246753k5912149k0134317j0148297n286579l181730k074097j495596j135972
$$ 89246753 63334604 43200287 33051990 27765411 24583681 22509584 21013988 19878016
18094A9878016r86165q71524p21571o70879n94811m37939l52715l23560k87306
$$ 19878016 18891851 18020327 17298756 16627877 16033066 15595127 15242412 14918852 14631546
18085A4631546k05864l23083l45922l19519l69850l69890l65813k77310k61034
$$ 14631546 14425682 14102599 13756677 13437158 13067308 12697418 12331605 12054295 11793261
18076A1793261k06524j17536o6161J3446j48186j81578k93719l85429k79166k83695
$$ 11793261 11586737 11469201 11403040 11416486 11268300 11086722 10793003 10407574 10128408 9844713
18066I844713k44830j20176j60873k33778k77711k05944k13218k18234k70063
$$ 9844713 9599883 9479707 9318834 9085056 8807345 8601401 8388183 8169949 7899886
18057G899886k74312k07943k02449j91595j93586n6315o8969q9872j08544o0618
$$ 7899886 7625574 7417631 7215182 7023587 6830001 6773686 6704717 6614845 6506301 6445683
18047F445683r8457k3589r1831p8855L113Q8623K9756q3827n4259K7443p0404
$$ 6445683 6347226 6323637 6231806 6152951 6156064 6244687 6274443 6190616 6136357 6163800 6093396
18036F093396q4884k5556q4860o6434j26306j10279q6139q6636j07644j67774
$$ 6093396 6008512 5982956 5898096 5831662 5705356 5595077 5508938 5422302 5314658 5146884
18026E146884m9161n4528q1258j00394j34368j74126j00536j47278l8054l7477
$$ 5146884 5097723 5043195 4961937 4861543 4727175 4553049 4452513 4305235 4267181 4229704
18016D229704m5441r1502q2615n7968n1003o7597j12280j09765m2543l1280j9172
$$ 4229704 4184263 4092761 4010146 3952178 3901175 3833578 3721298 3611533 3568990 3537710 3518538
18005C518538m2887r3874m5659k2458j753O7299K9144l6747J373j596q6809r2411
$$ 3518538 3475651 3381777 3336118 3313660 3311907 3379206 3408350 3371603 3372976 3371380 3284571 3192160
17993C192160n8816q9002p2792o2730m7519m1809m3795q1341P895L7296k9553
$$ 3192160 3133344 3044342 2971550 2908820 2861301 2819492 2775697 2694356 2702251 2739547 2709994
17982B709994R9728J50496P8417N2623J4985n5188p4083p7013k6282j3332n6135
$$ 2709994 2809722 2960218 3038635 3091258 3106243 3051055 2976972 2899959 2873677 2860345 2804210
17971B804210j1231l543n1762l1537J3097N2748J7456P3874M3391l7645o1141
$$ 2804210 2792979 2789436 2737674 2706137 2719234 2771982 2789438 2863312 2906703 2869058 2807917
17960B807917j24768o1059l8828k4903j8347J81j59737j0872j6687o1252j4618
$$ 2807917 2683149 2622090 2583262 2558359 2540012 2540193 2380456 2369584 2352897 2291645 2277027
17949B277027P4296L1109R533M2750L9902L2978M1502M8420J8037o0111o9542
$$ 2277027 2351323 2382432 2391965 2434715 2474617 2507595 2549097 2597517 2615554 2555443 2485901
17938B485901j35189j26477p4412l8745l9032m5198n08l7368j3375L02P5163J53380
$$ 2485901 2350712 2224235 2149823 2111078 2072046 2026848 2026340 1988972 1975597 1975899 2051062 2204442
17926B204442J20992R6022j3267o5440N2925M7954p0832q8953k7914P052q569
$$ 2204442 2325434 2421456 2408189 2342749 2395674 2443628 2372796 2283843 2255929 2262981 2254412
17915B254412l4502l8279j08938L4491K5643j2746k6896Q564L3922O6024j2797
$$ 2254412 2219910 2181631 2072693 2107184 2132827 2120081 2093185 2101749 2135671 2201695 2188898
17904B188898n1108P8893J34610J44504J47108J5082q7823k22518k9430J48362
$$ 2188898 2137790 2216683 2351293 2495797 2642905 2657987 2570164 2347646 2318216 2466578
17894B466578J00056Q2507J50894J93705K16469J48738P0734N2195J35222J99869
$$ 2466578 2566634 2649141 2800035 2993740 3210209 3358947 3429681 3481876 3617098 3816967
17884C816967J85945K51506M26332N58733O50808R43464J289745J817715K799465
$$ 3816967 4002912 4254418 4680750 5239483 5890291 6833755 8123500 9941215 12740680
17875A2740680M304639P036523J1741107J7597227K0285034J5771584Q267077
$$ 12740680 17045319 24081842 35822949 53420176 73705210 89476794 97743871
17868I7743871o610644k4668206k2528520j2594382o651658l808402k347542j516472
$$ 97743871 91133227 66465021 43936501 31342119 24690461 20882059 18534517 17018045
17860A7018045q68622n86912l71843M7654M44091P81439J510705K649174M261976
$$ 17018045 16149423 15562511 15190668 15238322 15682413 16463852 17974557 20623731 24885707
17851B4885707O930889J1434500J6455036J7634357J2923124N701078r099573
$$ 24885707 31816596 43251096 59706132 77340489 90263613 95964691 86865118
17844H6865118k1661264j5323947n185278K521619R344408J4127537J3083788
$$ 86865118 65203854 49879907 44694629 47216248 56560656 70688193 83771981
17837H3771981P944353p95242j6500733k1697020j3767378p349229m157410k554337
$$ 83771981 91716334 90921092 74420359 52723339 38955961 31606732 27449322 24894985
17829B4894985j723413j334809j065047q38516n72336k27846J31934N43604J303613
$$ 24894985 23171572 21836763 20771716 19933200 19360864 19133018 19264952 19808556 21112169
17820B1112169K530430M401497P571889J1767734J4458482J1834663O580424k939094
$$ 21112169 23642599 28044096 35615985 47383719 61842201 73676864 80257288 77318194
17812G7318194j7629973j8687393j0846014n745064l251858k031013j516340j340617
$$ 77318194 59688221 41000828 30154814 24409750 21157892 19126879 17610539 16269922
17804A6269922j102313r38423o88178n22384m28075m12826l41244l29346k99816
$$ 16269922 15167609 14229186 13541008 13018624 12590549 12177723 11836479 11507133 11207317
17795A1207317l65258l75973l71993k89880k61572l35103l37246k66996k46775
$$ 11207317 10842059 10466086 10094093 9804213 9542641 9207538 8870292 8603296 8356521
17786H356521k20582j87632j22773j52242l44772l93789k21250j29127j70931
$$ 8356521 8135939 7948307 7825534 7673292 7328520 6934731 6713481 6584354 6413423
17777F413423j74634j75411j01337j02790k37111j34888j44595j49681j42547
$$ 6413423 6238789 6063378 5962041 5859251 5622140 5487252 5342657 5192976 5050429
17768E050429q8153r5341j22685r2134p4627j66521j15564j01751m2801o9091
$$ 5050429 4962276 4866935 4744250 4652116 4577489 4410968 4295404 4193653 4150852 4081761
17758D081761m8642o4025L0791J48165J1178l5896q2069j05974n8262r6577l9252
$$ 4081761 4033119 3969094 3999885 4148050 4159228 4123332 4041263 3935289 3877027 3780450 3741198
17747C741198K6033n7823L5663Q13r8387o2091j39115j93771j63482j22278o7028
$$ 3741198 3767231 3709408 3745071 3745884 3647497 3585406 3446291 3252520 3089038 2966760 2899732
17736B899732p3684p2201n2936l3592m6014K1053q2647n6035J5524m0988j7235
$$ 2899732 2826048 2753847 2700911 2667319 2621305 2642358 2559711 2503676 2519200 2478212 2460977
17725B460977K2857O0055Q0824J15960O6224n6780k9904o789K5340M8365J34129
$$ 2460977 2483834 2543889 2624713 2740673 2806897 2750117 2720213 2713424 2738764 2787129 2921258
17714B921258J64210O5410K2529l9752r5414r2855l5610Q2004L3569m5317q0011
$$ 2921258 3085468 3150878 3173407 3133655 3038241 2945386 2909776 2991780 3025349 2980032 2900021
17703B900021j05357j56743j41899j26331r4528l4744K1485j05046j3083n089
$$ 2900021 2794664 2637921 2496022 2369691 2275163 2240419 2261904 2156858 2143775 2138686
17693B138686r6328L3448J12202J23523J6026l3030r6317j23428n9857m3797M5972
$$ 2138686 2042358 2075806 2188008 2311531 2327557 2294527 2198210 2074782 2014925 1971128 2017100
17682B017100k7806j04092j01799p3435k0301k7852j4232q4223j04750n4586j9992
$$ 2017100 1989294 1885202 1783403 1709968 1689667 1661815 1647583 1563360 1458610 1404024 1384032
17671A384032K4944j3309m2855k4566l9084L6967J689k5245o0805M5369L4853
$$ 1384032 1408976 1395667 1352812 1328246 1289162 1326129 1327818 1302573 1241768 1287137 1321990
17660A321990q2891j41354L2631J34704P8951m4288p3628n0458q7650j78j0961
$$ 1321990 1239099 1097745 1130376 1265080 1344031 1299743 1226115 1175657 1088007 1087829 1076868
17649A076868n9202n4975Q732j818j4566r460N7617J2403J6695p7226n4953l4544
$$ 1076868 1017666 962691 971423 969605 955039 945579 1003196 1015599 1032294 955068 900115 865571
17637H65571P500m1569R3948K490p6932n0007n6500J8566O8068l6472p5139k4866
$$ 865571 873071 831502 925450 927940 851008 801001 744501 763067 831135 794663 719524 694658
17625F94658J4949L0760j0233o0663m5463j6328J045O9339J0541k0589K2111J1544
$$ 694658 709607 740367 730134 669471 624008 607680 608725 678064 688605 668016 690127 701671
17613G01671k1197n1580p0994k2390J6712L8787O7073J18229Q5402L7625Q201
$$ 701671 680474 628894 557900 535510 552222 591009 658082 776311 861713 899338 907539
17602I07539J5211J0317q6888n2862L4829J07437O4285K3029N3638l3111j45499
$$ 907539 922750 933067 846179 793317 828146 935583 999868 1022897 1076535 1043424 897925
17591H97925r5924o7461J5465k5102l1295n8028l845l3737j04365j3641l450L7660
$$ 897925 802001 734540 750005 724903 693608 635580 631735 597998 493633 479992 476542 514202
17579E14202J0218O6311J6372m0935o4747L8638J17381J09801N1974P3923K9757
$$ 514202 524420 590731 607103 566168 501421 540059 657440 767241 819215 893138 922895
17568I22895m4971p465n459o9426j0921J7116m498J6806j20292j48488r8423o9329
$$ 922895 877924 870459 865000 795574 784653 801769 797271 814077 693785 545297 446874 377545
17556C77545L792P3494K1720J5054j2554K867j9602p3546N1354m7826j0628k5430
$$ 377545 381337 454831 476551 491605 479051 481918 462316 388770 440124 392298 381670 356240
17544C56240m6284M3540L7494N768k8846J1565L9052O6588J916j2234L122m3606
$$ 356240 309956 353496 390990 396758 367912 379477 418529 485117 487033 474799 477921 434315
17532D34315n1837n9989n2902n4523o651j005K0467N8089k0536L4909L9651k5247
$$ 434315 382478 322489 269587 215064 208413 207408 227875 285964 265428 300337 339988 314741
17520C14741j6333L3865k2292p9426j4836j1757J0090k9062J0891m3603k2391
$$ 314741 298408 332273 309981 230555 215719 203962 214052 184990 195881 152278 129887
17509A29887L8450L3444l7418j6465n8415K9662J2857m1108L7912M9076M2379
$$ 129887 168337 201781 164363 147898 89483 119145 132002 90894 128806 177882 220261
17498B20261q490k8663J657j4392m34m2208n9152m4629M5495J33440M6529K1168
$$ 220261 211771 183108 184765 170373 169939 127731 68579 23950 69445 202885 249414 270582
17486B70582l0788n6408l0555k3383k9994l6800l2710Q483J2503N006j528J4846
$$ 270582 239794 183386 152831 129448 99454 62654 29944 38427 50930 55936 54408 69254
17474F9254L3914K3918M5130M7099l4318q3351k0272k2059M8436O0488L1289l1664
$$ 69254 103168 127086 172216 219315 184997 101646 81374 59315 107751 168239 199528 167864
17462A67864l6070o8666j7755L4111M13l6201R518j3098j2389L6440M7979R074
$$ 167864 131794 63128 45373 79484 79897 43696 53214 40116 27727 64167 112146 121220
17450A21220P494K5282j8037o1464n7156L6798P0323L2955L7660R6599J08900
$$ 121220 128714 153996 135959 74495 17339 54137 124460 157415 195075 291674 400574
17439D00574J11836P2446l0997j29363j38863q9790m7561J4662R259J3288J2590
$$ 400574 512410 584856 553859 424496 285633 195843 148282 162944 172203 185491 198081
17428A98081o2157O176M9516J7112n912l9568K0073l3887j9398k8290k2198j9365
$$ 198081 135924 142100 191616 208728 202816 163248 183321 149434 130036 101746 79548 60183
17416F0183J7006J8073p288j4148R6075N6402j2143m0710n7040K3700k4351M1604
$$ 60183 77189 95262 87974 73826 169901 226303 214160 173450 116410 140110 115759 157363
17404A57363m552j0506K8102N952L3824J1189o7465r5075k3830K9236L4564L2336
$$ 157363 152811 142305 170407 176359 210183 221372 153907 58832 35002 64238 98802 131138
17392A31138m8584Q206L398m1948K3767p736n6375m0975L3751o196k5287o2235
$$ 131138 82554 90760 94158 52210 75977 68241 11866 -29109 4642 -1554 -26841 -89076
17380h9076K1894Q8087K9908m7128K3500J14581K6967l6229j3612K4405k976r0217
$$ -89076 -67182 20905 50813 3685 27185 141766 168733 132504 118892 143297 140321 50104
17368E0104K0102K4367K6361k7439k8744K2443M2627O0099m3050r9920m5860l6395
$$ 50104 70206 94573 120934 93495 64751 87194 129821 189920 146870 46950 1090 -35305
17356c5305l1744l646P2857K4795K1014N0010k7066j2587L8056K3024L7220k9151
$$ -35305 -67049 -70695 2162 26957 47971 97981 70915 58328 96384 119408 156628 127477
17344A27477j9694J6659N0444m9781q7815O8085J59209J04969O157M4775L1616
$$ 127477 107783 124442 174886 125105 37290 105375 264584 369553 375710 420485 452101
17333D52101p1483q6339o6062j09972r1570l944L3434N3212p188l5196p7537J9137
$$ 452101 380618 294279 228217 118245 26675 22731 56165 109377 102189 66993 -10544 8593
17321H593M5238J7496M0687K5250L8795J9566N0217J11884J31817J5553k2992
$$ 8593 53831 71327 112014 137264 176059 195625 245842 357726 489543 505096 482104
17310D82104n898p3198l0467K6405m1334N1386O7333N0253r951o829p1946n8255
$$ 482104 476206 403008 372541 398946 357612 408998 476331 526584 516633 509804 437858 379603
17298C79603r5383K2398l8573p6974l4552j3626P603L1312n9758j5014L4317R6985
$$ 379603 284220 306618 268045 191071 156519 142893 150496 181808 122050 107036 141353 238338
17286B38338M2787L4696l8187O0397J25163M3664m6145n574m8741k3062j4372
$$ 238338 281125 315821 277634 338031 463194 506858 460713 455139 406398 383336 368964
17275C68964n0364k5417m62n9984o0844r4146M1031L129K5059k2058j8863l4618
$$ 368964 318600 293183 292721 232737 171893 77747 118778 121907 146966 124908 106045 71427
17263G1427l2734J815j7154n008R016M2765N6389J5371m573j513M989K3864l8793
$$ 71427 38693 40508 23354 18346 27362 70127 126516 141887 137314 135801 140790 164654 125861
17250A25861n7894m8517N0192L686l7194k6702j5424m2787O0478N2356m3165j9977
$$ 125861 67967 19450 69642 73328 36134 9432 -5992 -48779 11699 64055 20890 913
17238I13J2206L2809L1842j8690O420j7116j2954r88r849q206R72n401R260q072
$$ 913 13119 45928 77770 59080 65500 48384 35430 34442 24593 16387 17359 11958 21218 13146
17224A3146L7864K1317n2292r110J2820j3476k8683q1833J6952M2244R434J3935
$$ 13146 51010 72327 20035 10925 23745 10269 -18414 -100247 -83295 -41051 -31617 -17682
17212a7682J5445n1355K4549M8680L3620m7978l093K3895k5540J7485K4835l6696
$$ -17682 -2237 -53592 -29043 19637 53257 5279 2186 26081 541 18026 42861 6165
17200F165p025L7811j7803P986J6894K071k5899P3691R386o761j0095j497K2804
$$ 6165 -860 36951 19148 27134 44028 46099 20200 93891 103277 96516 86421 84924 107728
17187A07728M390L2804n699l2832o456L7053J8417k6418m943L6503K8402p3400
$$ 107728 112118 144922 139223 106391 99935 136988 155405 128987 124044 160547 188949 115549
17175A15549o5981l2313l2253j9606O641R124j2713L3908Q4247P3694o0980m8891
$$ 115549 49568 17255 -14998 -34604 -27963 -18839 -31552 2356 86603 160297 99317 50426
17163E0426l9213o495j4271J1344M5186l3885m2022m0874K0467K5370j9930J2867
$$ 50426 11213 4718 -9553 1791 46977 13092 -28930 -69804 -49337 -23967 -43897 -31030
17151c1030L9612K5568j8372j2425O9491J8399k8344l7192k6729O6140M9469p3569
$$ -31030 8582 34150 15778 3353 72844 91243 62899 25707 -1022 65118 114587 41018
17139D1018m5036m1044O6044P6989k4459l7138k3986j774M3951Q522q870q1103
$$ 41018 -4018 -45062 20982 97971 73512 36374 12388 10614 54565 63087 54217 -26886
17127b6886l8238K8839j4841k6457r375M8262J8991o164L3928J8410L3112k0061
$$ -26886 -65124 -36285 -51126 -77583 -86958 -38696 -19705 -25869 8059 26469 59581 39520
17115C9520l0145K1955l4125p6830k3869Q0666K2290J2828K5964j1733j5774m9679
$$ 39520 9375 31330 -2795 -79625 -103494 -22828 -538 12290 38254 26521 10747 -38932
17103c8932j9102p015O3373P537p6656M4308K5296r515K43k7896O2959M5700R71
$$ -38932 -58034 -65049 -1676 5861 -70795 -26487 -1191 -10706 -10463 -38359 24600 70300 71271
17090G1271J1977K3029L7389N7175J8791o4708l4859L1451J556m5549n8498j0288
$$ 71271 83248 106277 143666 200841 219632 154924 120065 151516 153072 107523 49025 38737
17078C8737K816k4126K8176j6849l4409M850j0089J6828l4251K2984J8924K3526
$$ 38737 41553 17427 45603 28754 -5655 -805 -10894 5934 -28317 -5333 13591 37117
17066C7117k929l2133J4185M2316k5197q2008m841K2538K8152N4605r35n8702
$$ 37117 34188 2055 16240 58556 33359 -48649 -53490 -30952 -2800 51805 50870 -7832
17054g832P2666K0533p8814j8295j4463M8840L3257L989k0470p1587k7796P6044
$$ -7832 64834 85367 6553 -11742 -26205 22635 55892 59881 39411 -32176 -59972 16072
17042A6072P0319q748q9882o3216O3465O7548k846p3429l1117O501J7561L5689
$$ 16072 86391 77643 -12239 -75455 -11990 55558 52712 -20717 -51834 -45333 -27772 7917
17030G917J6591K0235L3683m1206k9890q3449o1809L3745Q2800J155K8377J8363
$$ 7917 24508 44743 78426 37220 7330 -76119 -137928 -104183 -21383 -20228 8149 26512
17018B6512Q694R158j6567r2897k0928L8188L6678m7617R01J3535Q336K1253J259
$$ 26512 35206 44364 27797 -65100 -86028 -47840 -11162 -58779 -57878 -44343 -36007 -14754 -13495
17005a3495J273n0218J0941j4158m1350K3586M4387m0876m1758M2967L4732M9613
$$ -13495 -12222 -62440 -51499 -65657 -107007 -83421 -39034 -79910 -121668 -78701 -43969 5644
16993E644M7913J8773K3346o8071k9314j8139L1254j3695o8049j8112R6895M9900
$$ 5644 53557 72330 95676 27605 -1709 -19848 11406 -2289 -70338 -88450 8445 58345
16981E8345L2332j4068p2910K5070N766K7725l1517m1586m6692o2870p442k1570
$$ 58345 90677 76609 3699 28769 34535 62260 30743 -10843 -57535 -120405 -127847 -149417
16969a49417R7657N9551l2748l810M823K0547k9614K2989N4425J5985q3689q2835
$$ -149417 -51760 7791 -24957 -28767 -23944 -3397 -33011 -10022 44403 60388 -23301 -106136
16957a06136k1654Q0634O4671l843j8248J4006L5264k6925p367K5150k7781o1019
$$ -106136 -127790 -47156 17515 13672 -4576 9430 44694 17769 10402 35552 7771 -53248
16945e3248m0711L7527J0483M5808R299m4229J152k924L7N5315M6279m2090j870
$$ -53248 -93959 -56432 -45949 -141 9158 -35071 -33919 -36843 -36806 18509 64788 22698 20828
16932B0828j9197j8084L1139N7854k9377p5910q1713L4178j0096J9608N265K2829
$$ 20828 1631 -16453 14686 72540 43163 -32747 -114460 -80282 -90378 -70770 -65505 -42676
16920d2676N3522M9242j1082o38q1366l1054O0306o168l0494j6712K3059J5919
$$ -42676 10846 60088 49006 48368 -32998 -64052 -3746 -9914 -40408 -57120 -34061 -18142
16908a8142M0425N3864j5837O4804K1040J7972K6073j9398p5435n698m368l780
$$ -18142 22283 76147 60310 125114 146154 164126 190199 170801 95366 89668 85300 81520
16896H1520l116j7884k5038j9676M8118J6707n4827n9752L5035J8030N596n552
$$ 81520 78404 60520 35482 15806 63924 80631 25804 -33948 1087 19117 24713 19161
16884A9161o736J9812L0256k1428k7962n6408j8139P2433K5495n4869k0267K0582
$$ 19161 12425 32237 62493 41065 13103 -43305 -61444 10989 36484 -18385 -38652 -18070
16872a8070K4653O7421N1327K4389k4794J3993J5783l2665M0960q364m908j0427
$$ -18070 6583 74004 125331 149720 124926 138919 154702 122037 162997 154633 149725 139298
16860A39298q6817p695K505k3345K0896k0955p8798m15k196L0974k3146p659L6727
$$ 139298 52481 44786 47291 23946 44842 23887 -54911 -55326 -57522 -26548 -49694 -57353 -20626
16847b0626M1024J978k3635N2900N0533n0006l7320m5415m5683P69N5565O2853
$$ -20626 20398 22376 -1259 51641 102174 52168 14848 -30567 -76250 -75481 -19916 42937
16835D2937L04n7734K0634L6630l40k4571n3546q210O8733M8535k2917j5442J5017
$$ 42937 43241 -14493 6141 42771 42431 17860 -35686 -43896 24837 73372 50455 35013 50030
16822E0030j4050J3625M882o778r5031l3535j7084K3964N3514J8450J49O9080
$$ 50030 35980 49605 54487 47709 -47322 -80857 -97941 -73977 -20463 -2013 -1864 67216
16810F7216N7949k46L8374J5935n5707n7423n3183q010j1199j03686J2350J05541
$$ 67216 125165 124919 163293 179228 123521 66098 12915 4905 -6294 -109980 -97630 7911
16798G911M6712k4526l2437j631k5655K9703j1661M504p120M632j285J0480q7487
$$ 7911 54623 30097 -2340 -3971 -29626 77 -11584 -7080 -14200 -9568 -10853 -373 -87860
16785h7860o0937J4928L8200L9800M9531N9723o0366m6632l7212L5177M3499M3116
$$ -87860 -148797 -133869 -95669 -55869 -6338 53385 -6981 -53613 -90825 -55648 -12149 30967
16773C0967n2631o4666M2067M4886j1555l4726o4780l7049Q2730N6588m2696n2711
$$ 30967 -21664 -86330 -44263 623 -10932 -45658 -110438 -147487 -64757 -8169 -50865 -103576
16761a03576K9598N5920M1116m7981o1985N5183L3904J1328J7058K2744j7850
$$ -103576 -73978 -18058 23058 -24923 -86908 -31725 2179 13507 30565 53309 35459
16750C5459L0250O5671J0805l5147n2971k6549k7709N9767j3767p4774l7175k1212
$$ 35459 65709 131380 142185 107038 54067 27518 -191 59576 45809 -28965 -66140 -87352
16738h7352J14558N3913l1147k1606o2335l7893N3983k5310m4496l5008N9851
$$ -87352 27206 81119 49972 28366 -33969 -71862 -17879 -43189 -87685 -122693 -62842
16727f2842O0737M1267J1635k0970n6536m5738n4801O7945M5898j3666r764R381
$$ -62842 -2105 39162 50797 29827 -26709 -72447 -127248 -59303 -13405 -27071 -36835 -27454
16715b7454n8191M280p094K066K4808o00R0532M2402o9381J4970n01K4848m3744
$$ -27454 -85645 -81365 -88459 -86393 -61585 -62185 28347 70749 1368 16338 15837 40685 -3059
16702c059j8468p993l9584P497K0596L5170J07841J0385j0623l6375l176k5457
$$ -3059 -21527 -29520 -69104 -61607 -41011 -5841 102000 112385 101762 65387 62211 36754
16690C6754o5337L2375j3560L9511N5400n6876o8671n4074K6194M9968N625n084
$$ 36754 -28583 3792 -9768 29743 85143 28267 -40404 -94478 -68284 -18316 -12691 -17775
16678a7775o2159k0376R0204L0451m1796R031O6966j4015J1035K2684L682N955
$$ -17775 -79934 -100310 -10106 20345 -21451 -12420 54546 40531 51566 74250 77932 83887
16666H3887r727l0584m1519L9074j7082m6860k0652l4019p495l1590O1689p2012
$$ 83887 74160 43576 2057 41131 24049 -22811 -43463 -77482 -84977 -116567 -54878 -126890
16654a26890m6711K4345j2574j4442P5083L5426K1946J7552K4077m07O0882N7189
$$ -126890 -173601 -149256 -161830 -176272 -101189 -65763 -43817 -26265 -2188 -2595 58287 115476
16642A15476o0217q0447R3266J9758q8444L513K9753N8794k9974l300k3521o1685
$$ 115476 55259 -25188 68078 87836 -608 2905 32658 91452 61478 58178 34657 -27028
16630b7028q1300N641J6131R5799K5316m9411L430K2363n8741j4239j6797K0607
$$ -27028 -108328 -102687 -86556 9243 34559 -14852 -11422 10941 -47800 -62039 -78836 -58229
16618e8229N160Q342J9428L0922K0170R228o5324r220L3598l9546K0552J7429
$$ -58229 -53069 -44727 -25299 5623 25793 35021 -30303 -39523 -5925 -45471 -24919 -7490
16606g490O0125k7960l3381n6028L236N872K2832L3315l1039m2191q180l546J1065
$$ -7490 52635 24675 -8706 -64734 -61498 -55626 -32794 521 -30518 -72709 -80889 -84435 -73370
16593g3370O2119K9012L7473J0210j4758K529o7163M7228q623L8823K7596m3267
$$ -73370 -11251 17761 55234 65444 50686 53215 -13948 33280 24657 63480 91076 47809
16581D7809k4601J7999L2477J591k1009J0827K7498l1527j2044l2141J6904J8067
$$ 47809 23208 41207 73684 75275 54266 65093 92591 61064 49020 16879 33783 51850
16569E1850k7309R45J1587K025m6739N414r239k4860k719m038J7234L6186N9534
$$ 51850 24541 25486 37073 39098 -7641 -2227 -11466 -36326 -39045 -43083 -25849 10337 69871
16556F9871r524j9491j3522o179l8652K8154O0619J9367k30j3362n5919K6116
$$ 69871 60347 40856 27334 21155 -17497 10657 71276 90643 90413 77051 21132 47248
16544D7248j7992L1050k1180L619n2288M3772J07326L5902m9059j14627p5354
$$ 47248 29256 60306 39126 42745 -9543 34229 141555 177457 128398 13771 -61583
16533f1583J3178R4055l2294k7672J7887M6321m7053k7068k6249k8754J0016n589
$$ -61583 -48405 45650 13356 -14316 3571 49892 2839 -24229 -50478 -79232 -69216 -74805
16521g4805K1916Q8263P2372L1619M352k3066o3189Q426M1150M2507n7646r0765
$$ -74805 -52889 35374 107746 139365 143717 120651 57462 65888 107038 149545 91899 1134
16509A134n0385j5056P4229Q4401L3549j3291m9881p5177r7639j0628N6865L998
$$ 1134 -49251 -64307 9922 94323 127872 114581 64700 -10477 -108116 -118744 -61879 -57881
16497e7881P2289R8522K2050r4279p8504j8831L2284J4377M8996L380J2133q5020
$$ -57881 14408 112930 134980 40701 -37803 -56634 -24350 -9973 39023 42403 54536 -30484
16485c0484k9087L5533J5096o450N8421K7813K8914l0927o5683P22j1256m9863
$$ -30484 -59571 -24038 -8942 -15392 43029 70842 99756 68829 3146 3868 -7388 -57251
16473e7251N1095K4824l4910M453M8921p207o6923J6588N1094o5905R234J2065
$$ -57251 -6156 18668 -16242 -11789 37132 29925 -36998 -20410 30684 -35221 -25987 -13922
16461a3922r6736o4133L6950K4148Q0214K1585L6967R75r148k874o949l8088m9920
$$ -13922 -110658 -174791 -137841 -113693 -33479 -11894 25073 26048 16900 14026 7077 -31011 -80931
16448h0931L815J7554N7154L7892n8270m509P3178L7425k8197k9346m2656p8977
$$ -80931 -77116 -59562 -2408 35484 -22786 -27295 45883 83308 55111 25765 -16891 -95868
16436i5868j0328J9356L3075o249m5021l0145P3165N6785L2970O3565J2769n7148
$$ -95868 -106196 -86840 -53765 -60014 -105035 -135180 -62015 -5230 27740 91305 104074 46926
16424D6926K4943J0714J2030K6468j19818j51450k8124P956L4667N3624J7995
$$ 46926 71869 82583 94613 121081 1263 -150187 -178311 -170355 -135688 -82064 -64069
16413f4069j4966K2051P8290M2886j8729n2574L4132l4359k4760k657K829J9519
$$ -64069 -79035 -56984 21306 64192 45463 -7111 27021 -7338 -32098 -34755 -31926 -12407
16401a2407N2853j0674n1538J389p370l992K2193N1537J0103k7071J4726k1719
$$ -12407 40446 29772 -21766 -20377 -27747 -31739 -9546 41991 52094 25023 39749 18030
16389A8030m0758P952l587J2112N0600L0375k06N139n0115L4227M1587m3169O420
$$ 18030 -22728 -14776 -18363 -6251 44349 74724 74518 79657 29542 63769 105356 62187 68607
16376F8607M1740k6740m6854q237J3009M5504k9495J8683K1199o783m0619j9429
$$ 68607 110347 83607 36753 28516 41525 87029 57534 76217 97416 90633 50014 30585
16364C0585j6760P650J2710l1728j2135m6590j1834M9453J2354l7471J6303N334
$$ 30585 13825 21475 34185 2457 -9678 -56268 -68102 -18649 -6295 -43766 -27463 -22129
16352b2129k1072N5304J5299l5470k8658J8023M7119m0578l2813N0993J2986m8589
$$ -22129 -43201 12103 27402 -8068 -36726 -18703 28416 -12162 -44975 6018 19004 -29585
16340b9585K4070J575L089J1033K9377L2122q114J4898N6357m7053l0377o2369
$$ -29585 -5515 -3940 -851 10182 39559 71681 63567 78465 134822 87769 57392 -4977
16328d977n8712l1173L6163M2761j695p321N5782L0462o5894m6938J07727P704
$$ -4977 -63689 -94862 -58699 -15938 -17633 -24954 30828 61290 -4604 -51542 56185 63889
16316F3889m280k0854K9808M790p5675p6565k4469L9134L454L4852l9641J2478
$$ 63889 59609 38755 68563 73353 -2322 -78887 -103356 -64222 -60768 -25916 -65557 -53079
16304e3079O6015L9505j8706N7270J2301q4330m9412m531J5535m7081K107M3205
$$ -53079 12936 52441 33735 91005 103306 18976 -30436 -34967 -19432 -66513 -64406 -21201
16292b1201l5970k6043j1426n493M0467K8299N3675k1282J3299Q2714L781k7984
$$ -21201 -57171 -83214 -94640 -100133 -59666 -31367 22308 1026 14325 97039 100820 72836
16280G2836N3868p902P045m4019j5009j4330j7311k412r046k6877j4499L4074
$$ 72836 126704 118802 125847 81828 66819 52489 35178 32766 23720 -3157 -17656 16418
16268A6418n687p2127k7313j9747O0237K5261n234j6750L5422M8398K9941p2986
$$ 16418 10731 -61396 -88709 -108456 -48219 -22958 -28192 -44942 -9520 38878 68819 -4167
16256d167o8016L9020k1662j00180l401M7641m5597l7629L0448K3846j46K3941
$$ -4167 -72183 -33163 -54825 -155005 -158406 -110765 -156362 -193991 -163543 -139697 -139843 -115902
16244a15902j2247r830Q0815L2749k0643J7400K3093j7171r680O3552Q4585r862
$$ -115902 -128149 -137979 -57164 -24415 -45058 -27658 -4565 -21736 -31416 32136 116721 106859
16232A06859p5531l0975O339j6414L228l5893j1226L7587j0330l0176L2952k3823
$$ 106859 31328 353 6692 -9722 -6494 -42387 -53613 -16026 -26356 -56532 -23580 -47403
16220d7403O592K1986K8443J502q3723n6059L1667R464L8385P5832P9261Q5496
$$ -47403 -40811 -18825 9618 11120 -72603 -128662 -96995 -87531 -49146 26686 105947 191443
16208A91443j10738j24128j4170k1636m2196P1605J40832J7311q3882l2272K8051
$$ 191443 80705 -43423 -57593 -79229 -121425 -49820 91012 108323 24441 -7831 20220
16197B0220M4566q0186j8627J4408m231J3736J0588m0119j0618j0056k5407N6310
$$ 20220 64786 -15400 -34027 -19619 -23850 -10114 474 -39645 -50263 -60319 -85726 -29416
16185b9416R4792k8138J5000l2522K7466k2820J5228m295p3236k332K0447L4084
$$ -29416 65376 37238 52238 19716 47182 24362 39590 35295 -37941 -40273 -19826 14258
16173A4258l7100l0822j3006j9210J6820l3886k3859O5800N4968K8413J6876o8545
$$ 14258 -22842 -53664 -66670 -85880 -69060 -102946 -126805 -61005 -6037 22376 39252 -29293
16161b9293l3239M3340k2272o6220J037L2695M617O0663J4648M4898j5547r351
$$ -29293 -62532 -19192 -41464 -107684 -106647 -73952 -69335 -8672 5976 50874 35327 25976
16149B5976m2096K9872O454K869J9753j1271M0824k811O799l1063j5227q083J08
$$ 25976 -16120 13752 20206 23075 42828 31557 72381 69570 76369 45306 30079 21996 22104
16136B2104R638n9979j3421J641K532k409m593o0145J9431K0784K3117L5264j0889
$$ 22104 31742 -28237 -41658 -40017 -37485 -39894 -44487 -104632 -85201 -64417 -41300 -6036 -16925
16123a6925m4787K6458R9222k6435n6103J2215M177K1715j0190J1198J81k0562
$$ -16925 -61712 -35254 63968 37533 -18570 -6355 -2178 19537 9347 20545 20726 164
16111A64j6869l464N4346l6031q9095K778n6925n5084K2910N4049M6752J7315
$$ 164 -16705 -20169 34177 -1854 -90949 -88171 -145096 -200180 -177270 -123221 -76469 -59154
16099e9154L0853O7883K6764j1147k8998k397K8293R651p4218k6731K1954P2005
$$ -59154 -28301 39582 66346 55199 26201 23804 52097 61748 -12470 -39201 -17247 54758
16087E4758M9376J8137p7198L626p059j0333k1226N3164K4085m5703l8534j4654
$$ 54758 104134 122271 45073 48699 41640 31307 10081 63245 87330 41627 3093 -11561
16075a1561l2682N2013N8571k843m088k2007n1956j2914l4453L4589m200L3754
$$ -11561 -44243 7770 66341 63498 59410 37403 -14553 -27467 -61920 -27331 -31531 2223
16063B223J8483o8876q152L1754k2847l277N9691L823n8861j2488k3720O13L0976
$$ 2223 20706 -48170 -56322 -24568 -47415 -50692 8999 12822 -46039 -58527 -82247 -81634 -50658
16050e0658K1043l017J5297N080k7066l6696j1411j8032J2991N8013P0654n5525
$$ -50658 -29615 -32632 -17335 -12255 -39321 -76017 -87428 -105460 -92469 -34456 36198 -19327
16038a9327k1488k0445M4985M1751K2469k4652m3733P7729N6668N9707l0831p0162
$$ -19327 -40815 -61260 -16275 25476 47945 23293 -20440 57289 113957 173664 142833 72671
16026G2671q9958j00025K238J16645Q6844N4014J201n9479m714l2848l3669J3994
$$ 72671 -17287 -117312 -115074 1571 88415 142429 143630 84151 79437 46589 12920 26914
16014B6914m8304m5253o990M5936J08482j9732m5139p7566p1362L0000r98j2120
$$ 26914 -21390 -66643 -73633 -27697 80785 61053 15914 -61652 -133014 -103014 -104012 -116132
16002a16132O495N5987O4523r401N5035P4108j1306K9491l310r8056m7474N3486
$$ -116132 -109637 -53650 10873 1472 56507 130615 119309 148800 145490 47434 -40 53446
15990E3446L1156M9723j9811k4139l0639j5048r908m6301m4375l516l5119K6016
$$ 53446 84602 134325 114514 90375 59736 44688 34780 -11521 -55896 -59412 -94531 -68515
15978f8515J9029L171k3246r757J3535N2527P2772M6192o3664p6455K2264P2065
$$ -68515 -49486 -46315 -69561 -79318 -65783 -13256 59516 105708 42044 -34411 -12147 59918
15966E9918k1601n6108M840O6361j8053o2466J0000L468p7542J3573M7980j2331
$$ 59918 38317 -17791 -12951 53410 35357 -27109 -17109 -13641 -91183 -77610 -29630 -41961
15954d1961M6278K4557n4486m6193M7480J14403K482m8430n4790p8425K3801J5978
$$ -41961 4317 28874 -25612 -71805 -24325 90078 92560 44130 -10660 -89085 -65284 -49306
15942d9306k3917n1799L5111M3850K9420O4171p1072l450J2658K0651M4314k7260
$$ -49306 -73223 -125022 -89911 -46061 -16641 47530 -23542 -26992 -14334 6317 50631 23371
15930B3371K4571m0623n3309j7270N1037J6683k0810o2835K2999N8823O788R934
$$ 23371 47942 7319 -45990 -63260 -12223 4460 -16350 -79185 -56186 2637 9425 19359
15918A9359k8680R1704Q9122n2463r1284o4814k2510k4534J3339K6038M1754O5753
$$ 19359 -9321 82383 171505 119042 27758 -37056 -59566 -84100 -70761 -44723 -2969 62784
15906F2784J8917J0698k087l7640J067m2121J566N6069k568k3508P789N3792L339
$$ 62784 81701 92399 90312 52672 53739 11618 13184 69253 66685 43177 50966 104758 108097
15893A08097m765o648l7624L772M4937o4114j2784l9874M5642l1705k6282R6707
$$ 108097 103332 96684 59060 62832 107769 43655 30871 -9003 36639 4934 -21348 75359
15881G5359q889k8492n6723j1684J7365K2282l1542J6026k0054j4231P4122O1460
$$ 75359 66470 37978 -18745 -30429 -13064 9218 -22324 -6298 -26352 -40583 33539 94999
15869I4999r4607p5638J0735o4964P0688j1344m797l7263R942N1483M5104P201
$$ 94999 392 -75246 -64511 -129475 -58787 -70131 -74928 -112191 -102249 -50766 -5662 1539
15857A539J7826K8829K1986l3358K2139p168p912L5778N6329k5343l4162N1761
$$ 1539 19365 48194 70180 36822 58961 51793 43881 79659 135988 110645 76483 128244
15845A28244q4982p0033L4006K6420L5470N95o5099q8125k8078K6444K6778K0878
$$ 128244 43262 -26771 7235 33655 69125 69720 4621 -83504 -111582 -85138 -58360 -37482
15833c7482K6059M6479K6480l8258m2572M204J8586j618l0409M850J7056q546
$$ -37482 -11423 35056 61536 23278 -19294 -15090 3496 1878 -28531 -23681 -6625 -15171
15821a5171l0144n1710k3613L6402N3863K1040k3073M1232K2484r394K1310n5880
$$ -15171 -45315 -97025 -120638 -84236 -30373 -9333 -32406 8826 31310 21916 43226 -12654
15809a2654m6515J3657J341k2608j4224n5556K3412J1560K0893M556R996K012
$$ -12654 -59169 -45512 -44171 -66779 -81003 -136559 -113147 -101587 -80694 -76138 -66142 -64130
15797f4130R3079K1572l5806J5027N1950O579k3943n147l4378k8393k8704m8820
$$ -64130 28949 50521 14715 29742 81692 88271 64328 59181 24803 -3590 -32294 -81114
15785h1114K8928J8843K6698K4291L759L2331K0621k0119l4065L447J9927n4083
$$ -81114 -52186 -33343 -6645 17646 21405 53736 74357 54238 20173 23620 43547 -10536
15773a0536L8919n6144j00293o5430K4957M5526L9663N5215j6100k4156q898J7231
$$ -10536 28383 -27761 -128054 -193484 -168527 -123001 -83338 -28123 -44223 -68379 -77277 -60046
15761f0046j7334L0370J8956N5804p272K0176j5019l7283p8601K0230N4194n8
$$ -60046 -77380 -47010 -28054 27750 20478 40654 25635 -11648 -90249 -70019 -15825 -15883
15749a5883K5M0968O489l6820K1564j3588j6410k3639J02443L0969r996k3409
$$ -15883 -15858 25110 31599 -5221 16343 2755 -13655 -37294 65149 96118 86122 62713
15737F2713J0570l2495l2172R392K601J870k5651l6693J7486K557r061K3471K7623
$$ 62713 73283 40788 8616 18008 20609 22479 -3172 -39865 -22379 -19822 -28883 -5412 22211
15724B2211k4767M1879K9396k1606K1575K4611J8677L5350n3238j05669j3810
$$ 22211 -2556 39323 68719 47113 68688 93299 111976 147326 94088 -11581 -25391
15713b5391L3201k2421r8586N0230k0322r464M0684K8283n3931j6311j2008r840
$$ -25391 7810 -14611 -113197 -62967 -83289 -92753 -52069 -23786 -77717 -94028 -106036 -115876
15701a15876R3233M2543L7941K2354L3626m3505o0237m9637p1113k3866P218O5980
$$ -115876 -22643 19900 57841 80195 113821 70316 10079 -39558 -110671 -134537 -127319 -61339
15689f1339N1924l4851k8210J9480j4656n7241K446L8720Q3970l4749k4302j7957
$$ -61339 -9415 -44266 -72476 -52996 -67652 -124893 -122447 -83727 243 -34506 -58808 -76765
15677g6765N620J6636J0359k7436j9832M6188K3054K733n3425J7714l885M1741
$$ -76765 -71145 -54509 -44150 -71586 -91418 -45230 -22176 -19443 -72868 -55154 -59039 -17298
15665a7298K7960L9850k9082q8462J3135N2170N9665j3969p2287P959k7061l3306
$$ -17298 10662 50512 21430 -67032 -53897 -1727 57938 43969 -28318 -20359 -47420 -80726
15653h0726K6262K8496j9358r592l0875O3971K5077N0160K8183m5486q3378l2722
$$ -80726 -54464 -25968 -45326 -54918 -85793 -21822 3255 53415 81598 36112 -47266 -79988
15641g9988M4867J9392J9173n3737L3758O6229n3910k1527O6756M6958k084q1290
$$ -79988 -35121 -15729 3444 -50293 -16535 49694 -4216 -25743 41013 87971 85887 4597
15629D597p6898M4575M1920q4551l5144N0755K9667m065N687j3864l6367l241
$$ 4597 -72301 -27726 14194 -70357 -105501 -54746 -25079 -29144 -23457 -37321 -73688 -76929
15617g6929m0994N3999L5425n348O4041j2470r6713j7477K9377k8928j05454O2340
$$ -76929 -117923 -63924 -28499 -33847 30194 17724 -78989 -96466 -67089 -96017 -201471 -139131
15605a39131R5329Q5797l671l1673l4511L5981O7424Q835n642l6426k0759p1410
$$ -139131 -43802 41995 38324 6651 -27860 8121 75545 84380 78738 42312 21553 -49857
15593d9857R432K6806q690n7282m0990K3819O1562N4541N8543J8575n8693m7305
$$ -49857 -40425 -13619 -22309 -79591 -120581 -96762 -35200 19341 77884 96459 37766 -9539
15581i539R821J2277N325p0523j5943M5567K3608o1535j9948M0759L1067N7027
$$ -9539 282 12559 17884 -52639 -68582 -23015 593 -60942 -80890 -40131 -9064 47963
15569D7963j0700n1951J5730N2290K1785n4209J828J1056o2591l4057L9149K6093
$$ 47963 37263 -14688 1042 53332 75117 20908 22736 33792 -28799 -62856 -23707 2386
15557B386o7622n3838k9692M1889r745O73M5034M0771K8768p1146p8316K4928
$$ 2386 -65236 -119074 -148766 -106877 -116622 -115949 -70915 -30144 -1376 -72522 -150838 -125910
15545a25910M0674k3403k5000k5867J27097P5658l0418K981P164O888l3825j3423
$$ -125910 -85236 -108639 -133639 -159506 -32409 43249 12831 15812 22976 29864 -3961 -17384
15533a7384l8078l3895j2562J1279K9599Q0519p644n3200P862L6822L2943m5917
$$ -17384 -55462 -89357 -101919 -90640 -61041 19478 11834 -41366 -33504 3318 36261 -9656
15521i656m2769J3620O9824p2044L775k906n0320l151N4147k0328J8890O1548
$$ -9656 -52425 -38805 31019 -41025 -37250 -40156 -90476 -93627 -39480 -59808 -40918 20630
15509B0630m6449P31P071K6427K3844o5932k4559k7034j8144J16451j390j9166
$$ 20630 -25819 -25088 -18017 8410 32254 -33678 -58237 -85271 -103415 13036 11646 -7520
15497g520m9400j0470J8681j220M3464o7064r3737p98P0050K5631J6189J6266
$$ -7520 -56920 -67390 -48709 -49929 -6465 -73529 -167266 -168064 -98014 -72383 -56194 -39928
15485c9928Q583p910n540K8445m2833m5566K78M9806O2308k3694j1868J7346J2280
$$ -39928 -31345 -39255 -44795 -16350 -59183 -104749 -104471 -54665 7643 -16051 -27919 -10573 1707
15472A707m6447n0492R4986k915o2736k9603K2955R0038J8304k7696K2482o3442
$$ 1707 -44740 -95232 -246 -3161 -65897 -95500 -72545 17493 35797 8101 30583 -32859
15460c2859j7613Q9899K2431n5256k3948j6692q9029q5960O0805M6293R6194O818
$$ -32859 -50472 39427 61858 6602 -17346 -34038 -123067 -209027 -148222 -101929 -5735 1083
15448A083m6746L4849O6882O2907j4960l9812k4949Q912l9545l198l8941j0504
$$ 1083 -45663 -10814 56068 118975 104015 64203 39254 48166 8621 5423 -33518 -44022
15436d4022K787R775J0287j627l8255j899R843L0562J665J5573N5721o4859l3045
$$ -44022 -41235 -31460 -21173 -22800 -61055 -62954 -53111 -22549 -20884 -5311 50410 -14449 -47494
15423d7494p78K8339P4432L7674k4238j5972p1783K4481P089l4634m4547j3109
$$ -47494 -48272 -19933 54499 92173 67935 51963 -19820 4661 11750 -22884 -67431 -80540
15411h0540m244J3350K1737J698o2459k5769L1183K8739N3058K5848L3427Q6101
$$ -80540 -84784 -71434 -49697 -47999 -110458 -136227 -105044 -76305 -23247 2601 36028 122129
15399A22129j3419m9638m6678o2507L6830K8729J4196n8174l3579r044L6329K5806
$$ 122129 108710 59072 12394 -50113 -13283 15446 29642 -28532 -62111 -71155 -34826 -9020
15387i020k1587l195O8004O357n9633n3145O179L0994L3072J8451j4248J8368
$$ -9020 -30607 -33802 34202 40559 -19074 -72219 -66040 -35046 -1974 16477 2229 20597
15375B0597N3620n0466j4685q8126k1370J1285N8608Q2858K7641j10715j5723
$$ 20597 74217 23751 9066 -79060 -100430 -89145 -30537 52321 79962 -30753 -46476
15364d6476O9737M7165J9331k6605o0959m2098M4755M6603l034k200K85N408K151
$$ -46476 23261 70426 89757 63152 2193 -39905 4850 51453 48419 46219 46504 51912 54063
15351E4063j7406k9151K637k7367k7717J4639M0443K2560J4015j4484j4031o3887
$$ 54063 36657 7506 10143 -17224 -44941 -30302 10141 32701 46716 32232 18201 -45686
15339d5686K74J3823q2908n5500O0797J15641J7443l5843m3368m2994N630M4404
$$ -45686 -45412 -31589 -114497 -169997 -109200 6441 23884 -11959 -55327 -98321 -92691 -48287
15327d8287M6526M888M8717n8685j2955J5291Q936l3839O5677P2668j3142p0620
$$ -48287 -1761 3127 51844 -6841 -19796 -4505 4431 -29408 36269 108937 95795 25175
15315B5175q5980J7619O2123J3217j0653K3419M91M0432K66o0474j7437j4871
$$ 25175 -60805 -43186 18937 32154 21501 44920 45411 85843 86109 25635 8198 -6673
15303f673N5479O7660o286n3304o1122l1804K1102P6900l8321n9459j00205J0073
$$ -6673 48806 116466 110180 56876 -4246 -36050 -14948 61952 23631 -35828 -136033 -125960
15291a25960K9226J13765M8897k1320Q029k0718o1459P5234O0070n2235m081M2561
$$ -125960 -96734 17031 65928 44608 52637 31919 -29540 45694 105764 53529 49448 92009
15279I2009p4412m6845L2118l2088J8650J07274M7225J8984n6692m4642j6578
$$ 92009 17597 -29248 2870 -29218 -10568 96706 143931 162915 106223 61581 45003
15268D5003j0153k0320k4731l0446l4303N4623O3381p6928m3631m041k6754N0984
$$ 45003 34850 14530 -10201 -40647 -74950 -20327 43054 -33874 -77505 -81546 -108300 -57316
15256e7316N9995L3547p3039o6564J3541L9172m1232l8878j4849N0003M4748L2813
$$ -57316 2679 36226 -36813 -103377 -89836 -50664 -91896 -130774 -145623 -95620 -50872 -18059
15244a8059L3785K4108J7345K7960m8054m9904P441n0840K4306K5246p92K7349
$$ -18059 15726 39834 57179 85139 37085 -12819 -5378 -56218 -31912 -6666 -7458 19891
15232A9891j0001j4409j15k281m889l2623o0476j0682M7116N5168K0167J0414
$$ 19891 9890 -4519 -4634 -6915 -11804 -44427 -104903 -115585 -68469 -13301 6866 17280
15220A7280k6407L5913L446j6599L6423K7471j8701l5812o2560k6361P4550q411
$$ 17280 -9127 26786 30232 13633 50056 77527 58826 23014 -39546 -65907 8643 232
15208B32l0279o0219p5752R3537R8059k0627n011J1838k0292K3021k7307j8206
$$ 232 -30047 -90266 -166018 -72481 25578 4951 -60 11778 -8514 14507 -12800 -31006
15196c1006Q470k73k5333J6212K5865J0670k3735k7247j9349L0093L0295L8781
$$ -31006 -22536 -22809 -48142 -31930 -6065 4605 -19130 -46377 -65726 -35633 -5338 33443
15184C3443l9407K9964N9969J0773J4839j0785n3919r8955J4419M1377Q090M135
$$ 33443 -5964 24000 83969 94742 109581 98796 44877 -54078 -39659 1718 9808 13943
15172A3943R11l876o1799o5465P897O69n347L3039L2186l0647L550Q9618j2206
$$ 13943 14854 10978 -50821 -116286 -108389 -107720 -113067 -80028 -47842 -78489 -74939 14679 2473
15159B473J7578j17686n1387j8377L0791R9909M7967M129l3435j5222J5218N082
$$ 2473 20051 -97635 -149022 -167399 -136608 -36699 11268 15397 -18038 -33260 -18042 -12960
15147a2960j0014J0790K762k3980N0051m322q94k6375k4423L2100K0064l2744
$$ -12960 -22974 -12184 -9422 -33402 16649 12327 11433 -14942 -39365 -7265 12799 -19945
15135a9945J0336N5326l2585p6577j9788J7564j236K063K8773R1600J7801K9903
$$ -19945 -9609 45717 13132 -63445 -83233 -65669 -66905 -64842 -36069 55531 73332 103235
15123A03235k8589k2084l41k9769J0808J5826j0828j8321l0013q8233j9594M530
$$ 103235 74646 52562 52221 22452 33260 49086 38258 19937 -10076 -98309 -117903 -113373
15111a13373J5930L2762l1186M5732n963j863M7533N2477m9630l5627J8650Q6815
$$ -113373 -97443 -64681 -95867 -50135 -56098 -57961 -10428 42049 -7581 -43208 -24558 62257
15099F2257P974n9063l6331K2984J1360L4374R843m111J6389k3798k9690K3277
$$ 62257 70231 11168 -25163 -2179 9181 43555 53398 49287 65676 41878 12188 35465
15087C5465j5162m9631k2036p62n2088M3654P3603L8384k1596Q07o1264N482m499
$$ 35465 20303 -29328 -51364 -52126 -104214 -60560 13043 51427 29831 30638 -30626 -25144 -29643
15074b9643p039L6571j7666M9493l4984M5532K8787j8901K2492o588l9738p0673
$$ -29643 -36682 -111 -17777 31716 -3268 42264 71051 52150 74642 68054 28316 -42357
15062d2357p2105K089m219M482O9718N3244J5431K95M8055Q007k5306l1023j8183
$$ -42357 -114462 -112373 -116592 -112110 -42392 10852 26283 26578 74633 82640 57334 26311 8128
15049H128L7719l0369l9222K3590l7000n0670l2977O669J5269P4864N7803N991
$$ 8128 45847 15478 -23744 -154 -37154 -87824 -120801 -114132 -98863 -23999 33804 39795
15037C9795j8020M6180L0962j7962K204J6320M7712j4009o2819J9904j2786n8392
$$ 39795 21775 67955 98917 80955 83159 99479 147191 133182 70363 90267 77481 19089
15025A9089l2882p2246l4760M426N6202J9419J3762m3828p8637l8980O1414J07713
$$ 19089 -13793 -86039 -120799 -116373 -60171 -40752 -26990 -70818 -149455 -188435 -127021 -19308
15013a9308k6781m7337l1499l8445L781K8202l3521J7876R1568J6913q233K2377
$$ -19308 -46089 -93426 -124925 -163370 -159589 -131387 -164908 -147032 -55464 -38551 -46784 -24407
15001b4407Q8819M4476l5341k74J4296m7320l0312K6149m487n0115L084J9849
$$ -24407 64412 108888 73547 73273 87569 40249 9937 36086 31599 -18516 -15432 4417
14989D417j4883M29k8006n162J1404J5075J3281k0967J7862L1461m1706m6198
$$ 4417 -10466 -10037 -38043 -43205 -31801 -16726 -3445 -24412 -6550 24911 -16795 -62993
14977f2993K1948K0150J913k4175L957m7900J2276N404M5366L7607L6200n53j7171
$$ -62993 -41045 -20895 -18982 -43157 -39200 -87100 -74824 -69420 -24054 13553 49753 49200 32029
14964C2029o932L0491k4109p366l2220O2384j0582k5824N354k5349n7799j8970
$$ 32029 25097 55588 31479 24113 -8107 54277 43695 17871 23225 -2124 -59923 -78893
14952g8893k235M7784L7591j500m3622q574m450J2254L6132L0329o175q1642J8809
$$ -78893 -81128 -33344 4247 2747 -40875 -49449 -53899 -41645 -5513 24816 18641 -63001 -44192
14939d4192j5647k3437Q5849J0241n7109L1554J692J5734J7864k0453k9279M3204
$$ -44192 -59839 -83276 2573 12814 -44295 -12741 -11049 4685 22549 2096 -27183 16021
14927A6021k5935j1416l064L7970K666k2643l8735J22286l4004p0917k3580O734
$$ 16021 -9914 -21330 -24394 13576 16242 -6401 -45136 77150 43146 -27771 -51351 -44617
14915d4617j2931M8407K7523k120K576N3801J3386r7103l6742K1963K4341j1410
$$ -44617 -57548 -9141 18382 16262 18838 72639 86025 -11078 -47820 -25857 -1516 -12926
14903a2926j044M9088l862J7173k1811n4352l4748k6452o4055L9546P3591N797
$$ -12926 -13970 35118 31256 48429 26618 -27734 -62482 -88934 -152989 -113443 -39852 -34055
14891c4055l1634j6372N3510q425M6908k2457M3997L5660M1956P891n9145j03983
$$ -34055 -65689 -82061 -28551 -36976 9932 -12525 31472 67132 109088 116979 57834 -46149
14879d6149p4694P1304L5002O744O847O1749K5207O907k0122j1215j6016o6195
$$ -46149 -120843 -49539 -14537 -7793 -946 60803 86010 92917 72795 61580 45564 -20631
14867b0631J1010L8166n893m7523o1437m1597k074J9345j7959J1629M4231l147
$$ -20631 -9621 28545 22652 -24871 -86308 -127905 -129979 -110634 -128593 -116964 -72733 -75880
14855g5880N7224O9072Q587p5519k9044o3q1862n0452L3257L0978M0499N3530
$$ -75880 -18656 50416 59003 -16516 -45560 -45623 -127485 -177937 -144680 -113702 -73203 -19673
14843a9673K9504M6007l7364m1348m2172m2257r226N1262N3742K4553j02426Q908
$$ -19673 9831 55838 18474 -22874 -65046 -107303 -116529 -65267 -11525 13028 -89398 -80490
14831h0490K1286j1502j3516R1628j087o6228m8638K3074J1742Q8945n0209k8134
$$ -80490 -59204 -70706 -84222 7406 6319 -59909 -108547 -85473 -73731 15214 -34995 -63129
14819f3129j5335k4732O1196N0458k7344L8104L34l150j5501l3335J3127j6344
$$ -63129 -78464 -103196 -42000 8458 -18886 19218 19552 16402 901 -32434 -19307 -35651
14807c5651M4650q4177m1504j0483R6003J4335P308p437k4649P5878M1724o497
$$ -35651 8999 -75178 -116682 -127165 -31162 -16827 -9519 -16956 -41605 34273 75997 69500
14795F9500j07065k8621j9461l9795L700O1464N3772M7603k07m096o4410k9480
$$ 69500 -37565 -66186 -85647 -125442 -121742 -60278 -6506 41097 40890 36794 -27616 -57096
14783e7096l6297K9650O1105K6324p875j3707J6943L334K4550J9324p3006o9401
$$ -57096 -93393 -63743 -2638 23686 15811 2104 19047 22381 46931 66255 -6751 -76152
14771g6152m3254k997J7504N6644L5340J4383K8599P965n6972j6969K6484L4383
$$ -76152 -119406 -122403 -104899 -48255 -12915 1468 30067 38032 -18940 -35909 -9425 24958
14759B4958q546m333K9766P672L2667k3883m5669M4857R1107j8521j09484r9609
$$ 24958 16412 12079 41845 49517 82184 58301 12632 57489 148596 130075 20591 -79018
14747g9018L0925L8863J1075L3022m9030o291L2615l283n2005Q277K0211P953
$$ -79018 -48093 -9230 1845 34867 -14163 -20454 12161 8878 -43127 -34850 -14639 -6686
14735f686K1265L1216M9229k8318k5923l7555L6293P4878n7468j14791o476k2330
$$ -6686 14579 45795 95024 66706 40783 3228 39521 114399 56931 -57860 -64336 -86666
14723h6666l1711l466N1215P9026m2662m5327J4924l2826k8207K8244o8650K4992
$$ -86666 -118377 -121843 -70628 8398 -34264 -79591 -64667 -97493 -125700 -97456 -166106 -141114
14711a41114N5725K9482M4123N3383nk5338l0037o3796k2868O3417N6535K4117
$$ -141114 -85389 -55907 -11784 41599 41594 16256 -13781 -77577 -100445 -37028 19507 43624
14699D3624o6001l4175M0662m3645J2794K4816o735j1906O137M9986N1522n7089
$$ 43624 -22377 -56552 -15890 -59535 -46741 -21925 -28660 -40566 -34429 15557 67079 9990
14687I990r0878L7503J9898n8361k1113n197o0456L6014L1972o856P2101L9951
$$ 9990 -80888 -43385 -23487 -81848 -102961 -108158 -168614 -132600 -100628 -107484 -35383 4568
14675D568n3898o9349m3468O8077K2630m1018L6167q090k8273L3836L8506l55
$$ 4568 -49330 -118679 -162147 -94070 -71440 -112458 -76291 -84381 -112654 -78818 -40312 -40667
14663d0667m0011L6223m490K7254L5122r626M100j8963M245J0799M0051n1932
$$ -40667 -80678 -44455 -48945 -21691 13431 3805 7905 -11058 -6813 3986 44037 -7895
14651g895o8273M2873J18069j3825j14609j7511L8303J5592n3424l2068Q1344
$$ -7895 -76168 -33295 84774 70949 -43660 -61171 -22868 -7276 -60700 -92768 -11424
14640a1424R4625m1783m7295M3526M7998N7148j9379r3029n8015K1749K8025j8396
$$ -11424 83201 41418 -5877 37649 85647 142795 123416 30387 -27628 -5879 22146 3750
14628C750l4004k9919L9711M5449l7247q191m4568j9735m426J4210J592Q620J0202
$$ 3750 -30254 -60173 -20462 24987 -12260 -20451 -65019 -84754 -89180 -74970 -73378 -64758 -54556
14615e4556j0605J1110k5377o439j5817O0143M3991l6568L9145J6735n4138L013
$$ -54556 -65161 -54051 -79428 -85867 -101684 -41541 2450 -34118 5027 21762 -32376 -29363
14603b9363n912M8554L9029k9968j1193L1304k4965L2208n6757o0061k1755n827
$$ -29363 -35275 13279 52308 22340 11147 42451 17486 49694 -7063 -67124 -88879 -94706
14591i4706L1609O6137J4715o378q003q960n4851l67R4406Q7167k5363k2430o0203
$$ -94706 -63097 3040 17755 11377 3374 -5586 -60437 -60804 33602 120769 95406 72976 12773
14578A2773L3040J6360n2179K2400m5450j9616M0853m7377k5733K0887P0987K7188
$$ 12773 45813 62173 9994 32394 -13056 -32672 8181 -39196 -64929 -44042 26945 54133
14566E4133O544L8180j2571L1360O293j8460M391O809K7463j55L1928l0713m1134
$$ 54133 60677 98857 86286 117646 123939 105479 109870 116679 144142 143987 175915 145202 104068
14553A04068m7989N3721N5947j8463P36l1542m7347L0280m322O154K1713L985
$$ 104068 56079 109800 165747 147284 148020 116478 69131 99411 95089 101243 122956 126941
14541A26941p0993l8929J858k070P9759J05765K9176j11550p7673K5346M9791
$$ 126941 55948 17019 18877 16807 96566 202331 231507 119957 42284 67630 117421
14530A17421n9896n8344l1015J9967K1254m5995r8872k9055R8595J4733L253L5931
$$ 117421 57525 -819 -31834 -11867 9387 -36608 -135480 -164535 -65940 -51207 -47954 -12023
14518a2023q60q537K0408K4612K7691N4305p3270q6951L1287L5168o154O2392
$$ -12023 -12883 -21420 -1012 23600 51291 105596 32326 -54625 -23338 11830 5676 68068
14506F8068n1348m3904K0080M0978k4311l4668m8853j7294k7969R3171J7756n1703
$$ 68068 16720 -27184 -7104 33874 9563 -25105 -73958 -91252 -119221 -26050 -8294 -59997
14494e9997k5832K4348J0827j4290J21162P6101m3660p2761q8850l3534M6510
$$ -59997 -85829 -61481 -50654 -64944 56218 132319 88659 15898 -72952 -106486 -59976
14483e9976k9426N4954O7907L3029L2708n358l4498n7062j6877J3464p538m2253
$$ -59976 -89402 -34448 33459 66488 99196 93838 59340 2278 -14599 -1135 -8673 -50926
14471e0926L0887M3700k2201j6633J4020J3496L2847j474k25L3989J8231q683
$$ -50926 -20039 23661 1460 -15173 -1153 12343 45190 43716 43491 77480 95711 87028
14459H7028M39l1935j5976R3866N2405j5521R986p0501k3636K4433O5006M7768
$$ 87028 87467 55532 39556 133422 185827 170306 180292 109791 86155 110588 175594 223362
14447B23362n8105r2460l8522K8983K5060k8398O1789j0067n6503L3809R988m3216
$$ 223362 165257 72797 34275 63258 88318 59920 121709 111642 55139 88948 98936 55720
14435E5720j7094N112q871P7807k2265q4146p7717L465O4495L4738P5026k5118
$$ 55720 38626 43738 34867 112674 90409 6263 -71454 -67989 -3494 31244 106270 81152
14423H1152O7657m1509k9639j1864l8543K1959J762J6691n5408j8238K1561Q6966
$$ 81152 148809 107300 77661 65797 27254 49213 50975 67666 12258 -5980 15581 102547
14411A02547j0242n4952o0727j345N3229O7212J4272J7888j02890n1560K6635
$$ 102547 92305 37353 -23374 -24719 28510 95722 109994 127882 24992 -26568 67
14400F7j069j596K4712J2094L0118K1060l9881l250J325N0588L5573N7687L4772
$$ 67 -1002 -2598 22114 34208 64326 85386 45505 42255 43580 94168 129741 187428 222200
14387B22200o3765p9350p1451O3761P2782M1569j02283O492K5022K0090Q670K5046
$$ 222200 158435 79085 7634 71395 144177 185746 83463 89955 114977 135067 143737 168783
14375A68783L206m9218r2498p8730L0827N3195K0550k5762j15661K701N8271o939
$$ 168783 171989 122771 30273 -48457 -17630 35565 56115 30353 -85308 -82607 -24336 -31275
14363c1275k1908m4970Q106M2472K3228N3713l1488K4067P1496J6407l1116n4611
$$ -31275 -53183 -98153 -90047 -47575 -24347 29366 -2122 21945 93441 109848 78732 24121
14351B4121l2279K424L7164j0575J7870p2880n4904O7401M1142M7450J9282m3440
$$ 24121 -8158 -5734 31430 20855 38725 -34155 -89059 -21658 19484 66934 86216 42776
14339D2776O784J8618j7623q7293r845k0637Q1801L2416L2985N183o8627k9351
$$ 42776 49560 68178 50555 -36738 -46583 -67220 14581 46997 79982 85165 16538 -12813
14327a2813K2679N6317k8239L669K9858j3598o4901k0780L756k5939N668l0736
$$ -12813 9866 66183 37944 41613 71471 57873 -7028 -27808 -24052 -49991 -44323 -75059
14315g5059Q4783K5106n2736k3220P6482Q300o2080K6243P4766K7613l643m3214
$$ -75059 9724 34830 -17906 -41126 35356 43656 -18424 7819 82585 110198 106555 63341
14303F3341N3936N499R52p238m7582M4866J056l4638j0026J8538N9956L9511q7840
$$ 63341 117277 122776 123728 116490 68908 113774 114830 80192 70166 88704 148660 188171 100331
14290A00331M69P6999O0802K439k4599m8219n3516p393j0302O8004r974n2247
$$ 100331 100800 177799 238601 241040 216441 168222 114706 107313 97011 165015 155041 102794
14278A02794j1636l2471N46M8846M5087L4103L327O2568J5296l6551o0989K23
$$ 102794 91158 58687 59233 108079 153166 187269 190596 253164 268460 231909 170920 171143
14266A71143l680O4455R3985L6341P4979J79136J83380K04823L22122M46864M65650
$$ 171143 167463 231918 325903 362244 437223 616359 799739 1004562 1326684 1773548 2239198
14255B239198L55815J19107l5836k48063l89877l76123l38868l36623k07570o2448
$$ 2239198 2595013 2714120 2678284 2430221 2040344 1664221 1325353 988730 781160 718712
14245G18712j42225j42384q0963l1223l3681k5201m07r799N675O8878J4724m7771
$$ 718712 576487 434103 353140 321917 288236 263035 262628 252829 258504 327382 342106 294335
14233B94335K4001K6266L5945l0145n3813q4416J582j2262n7873r766j3911l3051
$$ 294335 318336 344602 380547 350402 296589 212173 213755 201493 143620 133854 119943 86892
14221H6892k771L6799Q2452N94l1372K3801k6727j20143m845J09622R1265m1048
$$ 86892 84121 120920 203372 203966 172594 196395 169668 49525 44680 154302 245567 204519
14209B04519k8502p919N8273n2549O332K9861m3806l5470L6842R5583J2992q3243
$$ 204519 176017 168098 226371 173822 180154 210015 166209 130739 167581 263164 276156 192913
14197A92913q4721k1513L81K940m6279r2849q648N2544N9568O6061j0247J8613
$$ 192913 108192 86679 87060 90000 43721 -49128 -57776 -5232 54336 120397 110150 128763
14185A28763j3298K0577N476M571n6881n0855O1138M366k0671J7655l5222o8052
$$ 128763 115465 136042 141518 146089 89208 38353 99491 103857 83186 100841 65619 -2433
14173b433j0386K5058J8888j4299k5834l1126M3258N6667o6498n5045k6123M5730
$$ -2433 -12819 12239 31127 16828 -9006 -40132 3126 59793 -6705 -61750 -87873 -42143
14161d2143L5314L4188Q366K6303J1367O5267K5469p3150r5819j1365J2271Q447
$$ -42143 -6829 27359 35725 62028 73395 138662 164131 90981 -4838 -16203 -3932 4515
14149D515N7789k034l7752j288k8752P937J2536M6490j8087k9954m1444K4508
$$ 4515 62304 60270 22518 21230 -7522 415 12951 59441 41354 11400 -30044 -5536
14137e536l3631K9781J11584o491m6167m9787j4050J2420J1922N9827L6047J3674
$$ -5536 -39167 -9386 102198 95707 49540 -247 -14297 -1877 10045 69872 105919 119593
14125A19593p6189l9704P206J896L1382L626L99J433N176m3544K7234L5529k5582
$$ 119593 43404 3700 10906 12802 44184 47810 48209 49642 54818 11274 38508 74037 48455
14112D8455m2559J9586Q0229K5578M5373n4496m6184K9154n835q9612j01460j2745
$$ 48455 5896 25482 105711 131289 176662 122166 75982 105136 99301 9689 -91771 -104516
14100a04516M2476L638K755K5720L1794L0249O2419J2947n4686J3540k045N6416
$$ -104516 -62040 -58402 -55647 -29927 1867 32116 94535 107482 52796 66336 64291 120707
14088A20707L0444l2907n6013j1214k0642m9844n7625l6864l0696l9056L7490
$$ 120707 151151 118244 62231 51017 30375 -19469 -77094 -113958 -144654 -183710 -146220
14077a46220O6363P5384O3946p3642p8555M0878k0555P686J795o546k8483Q034
$$ -146220 -79857 -4473 59473 -14169 -92724 -51846 -72401 -64715 -62920 -69466 -97949 -89915
14065h9915j8216L8139p669J4212M2850O0018k7657n6582l5451O5199J0940n4079
$$ -89915 -108131 -69992 -77661 -63449 -20599 39419 11762 -44820 -80271 -15072 -4132 -58211
14053e8211K8446m2628m759R2067J4061k5426o536j2918K8069K206J2156k7281
$$ -58211 -29765 -72393 -77152 14915 28976 3550 -2986 -15904 12165 14371 26527 -754
14041g54j0860l2296k7132M6793L9218L9626J0734O2930O6221j9251L9343K2962
$$ -754 -11614 -43910 -71042 -24249 14969 54595 65329 128259 194480 175229 214572 237534
14029B37534j7727K9283L1068n9230o5451J9747O493P003o856l5661m8585q631
$$ 237534 219807 249090 280158 220928 155477 175224 181717 188720 181864 146203 97618 88987
14017H8987M5661N1400m4814R111K5798j6572m6560k7552l68L1463m5798k7317
$$ 88987 134648 186048 141234 150345 176143 159571 113011 85459 85091 116554 70756 43439
14005D3439m8622J8012N8321l2977q0571l4273j6906n11K7113j997P259L7406
$$ 43439 -5183 12829 71150 38173 -42398 -76671 -93577 -94088 -66975 -68972 -61713 -24307
13993b4307j3979J6615k594m5890J590M5229L2460l786r841J5981l599l453K2819
$$ -24307 -38286 -21671 -24265 -70155 -68565 -23336 9124 5338 -4503 11478 7879 4426 27245
13980B7245q966N1620m208l4443n6385L7298J7434J4249M1070j1779l475j2059
$$ 27245 18279 69899 65691 31248 -25137 12161 29595 43844 84914 73135 69660 57601
13968E7601K6491O7141l433M0594o4430J0010m4677n336l8024l7529L2259N1014
$$ 57601 84092 151233 147800 188394 123964 133974 89297 83961 45937 8408 40667 91681
13956I1681l26J6383N2944j8105n0230m0k0759J82N9054M2407L3818R6280Q3971
$$ 91681 91355 107738 160682 142577 92347 92307 71548 71730 130784 173191 207009 303289 387260
13943C87260R2090Q1038J34518K02464J40095R6434O4717Q984m4114j01558j41734
$$ 387260 479350 560388 694906 897370 1037465 1133899 1198616 1207600 1163486 1061928 920194
13932I20194j06636m7015p6015j04433j24981q2278J5000N4679K5083k1350j19128
$$ 920194 813558 766543 690528 586095 461114 378836 393836 448515 473598 452248 333120
13921C33120K9149P0244l052k5548O1237l6962r5910j7693O8574L5007M1409J26994
$$ 333120 362269 432513 429461 403913 465150 428188 332278 314585 383159 418166 459575 586569
13909E86569K4177R4066J27021K07435K68639L17447K84625J97046J25132m5422
$$ 586569 610746 704812 831833 1039268 1307907 1625354 1909979 2107025 2232157 2186735
13899B186735j42314r2785m5744j25316q0382q2132n2081p9134o0962k270M6773
$$ 2186735 2044421 1951636 1905892 1780576 1700194 1618062 1565981 1486847 1425885 1423615 1470388
13888A470388l155J6141q6081j37526n2072J9690K0001J5200l4019j4701J3841
$$ 1470388 1467233 1483374 1397293 1259767 1207695 1227385 1247386 1262586 1228567 1213866 1227707
13877A227707j3549k5652n1287j8959n6816m7905m1929m0313K7103O7172M6347
$$ 1227707 1214158 1188506 1137219 1118260 1061444 1013539 971610 931297 958400 1025572 1071919
13866A071919l1087j4406L7245m6030k8363p7102k6419l426M4710Q3669J2968
$$ 1071919 1040832 1026426 1063671 1017641 989278 912176 885757 882331 927041 1010710 1023678
13855A023678q17M9230K3595L0362p1376o9477m2245l3429Q979M4726O2162l3028
$$ 1023678 1022861 1072091 1095686 1126048 1054672 985195 942950 909521 918500 963226 1025388 992360
13843I92360o4174M1670K0774q5630N2858M3672J0766r29l9923l7781O4424R1994
$$ 992360 928186 969856 990630 905000 957858 1001530 1012296 1011367 971444 933663 998087 1090081
13831A090081k4005j3183K5812J04325Q4031M0550J2832K3932L9390L678K354
$$ 1090081 1066076 1052893 1078705 1183030 1267061 1307611 1320443 1344375 1383765 1387443 1389797
13820A389797J01471R1557N1248N2845R6700J69165K14790J51143J30105J83754
$$ 1389797 1491268 1582825 1634073 1686918 1783618 1952783 2167573 2318716 2448821 2632575
13810B632575K31085K35367J68525K50482K47587Q2993Q8433K08841J87056L26139
$$ 2632575 2863660 3099027 3267552 3518034 3765621 3848614 3937047 4145888 4332944 4659083
13800D659083M29282N00818N79173Q83437J123560J320378J505642J686748J926917
$$ 4659083 5088365 5589183 6168356 7051793 8175353 9495731 11001373 12688121 14615038
13791A4615038K039221K055459K086380K389803K736639L420124M477502O133686
$$ 14615038 16654259 18709718 20796098 23185901 25922540 29342664 33820166 39953852
13783C9953852Q976744J3775785K1556678L3612367M9335396O5944033P8931405
$$ 39953852 48930596 62706381 84263059 117875426 167210822 233154855 312086260
13776C12086260Q1424469O7097086L7933502K70345l8616057o6079680p8084356
$$ 312086260 393510729 460607815 498541317 498811662 460195605 394115925 316031569
13769C16031569p3447100n7754261m1939348k7627570j7417509j1620203q239671
$$ 316031569 242584469 184830208 142890860 115263290 97845781 86225578 77985907
13762G7985907o240494m947385l950175l296342k965142k803287k768517k760584
$$ 77985907 71745413 66798028 62847853 59551511 56586369 53783082 51014565 48253981
13754D8253981k718025k534752k337324j987764j652886j426364j385326j315339
$$ 48253981 45535956 43001204 40663880 38676116 37023230 35596866 34211540 32896201
13746C2896201j216266j160342j163858j199338j211885j117020j043606q49348
$$ 32896201 31679935 30519593 29355735 28156397 26944512 25827492 24783886 23934538
13738B3934538q50190p48718o49992n79130n17659n51330n09946m99113m99798
$$ 23934538 23084348 22335630 21685638 21106508 20588849 20037519 19527573 19028460 18528662
13729A8528662m65706l95362l53478l21495m26356m26044l56459k82538l23886
$$ 18528662 18062956 17667594 17314116 16992621 16566265 16140221 15783762 15501224 15177338
13720A5177338k98796k32734k65599m23262l66392l13183m38630l47751k90752
$$ 15177338 14878542 14645808 14380209 13956947 13590555 13277372 12838742 12490991 12200239
13711A2200239l95987k68107l09118l28837k76676k81536l10695k76603j77525
$$ 12200239 11804252 11536145 11227027 10898190 10621514 10339978 10029283 9752680 9575155
13702I575155j84906k13813k19367j64819j44209j80413k63290j92794j78131
$$ 9575155 9390249 9176436 8957069 8792250 8648041 8467628 8204338 8011544 7833413
13693G833413j76461j53320j44435j33945q5008j00847k3850p0112p3571j48833
$$ 7833413 7656952 7503632 7359197 7225252 7140244 7039397 7015547 6945435 6871864 6723031
13683F723031j59031r2391j08731j34558q2916j52181j46660k14832j64584n8502
$$ 6723031 6564000 6471609 6362878 6228320 6145404 5993223 5846563 5631731 5467147 5408645
13673E408645j48053j42557r7704n1783q2233j13363q8230j10692j28885j28988
$$ 5408645 5260592 5118035 5020331 4968548 4886315 4772952 4684722 4574030 4445145 4316157
13663D316157j06852j54872o2233L0107p2508K1267Q0092Q5420O0069J52676L20944
$$ 4316157 4209305 4054433 3992200 4022307 3949799 3971066 4051158 4136578 4196647 4349323 4670267
13652D670267M02847M18809M28619K85819J72232k5459j54864k88304k66970l07513
$$ 4670267 5073114 5491923 5920542 6206361 6378593 6353134 6198270 5909966 5642996 5335483
13642E335483l37249l09208k23867r7242n7896j57556j53475p0623l6736j21965
$$ 5335483 4998234 4689026 4465159 4367917 4310021 4152465 3998990 3928367 3891631 3769666
13632C769666j12145j11048j63175j20893l1463m767r8037j16213o2174n4816
$$ 3769666 3657521 3546473 3383298 3262405 3230942 3226175 3128138 3011925 2949751 2894935
13622B894935j17874j28220j08038R6030k7663o4891p8601j28774k1135O5947
$$ 2894935 2777061 2648841 2540803 2636833 2609170 2544279 2465678 2336904 2315769 2381716
13612B381716l7671q0064q9101j07794L9812K4192K4890k8668o3857j08975o3027
$$ 2381716 2344045 2263981 2174880 2067086 2106898 2131090 2155980 2127312 2063455 1954480 1891453
13601A891453J1438j5396r412K8218p2787n7078q6401k8136l3658j0824J1997
$$ 1891453 1902891 1887495 1878083 1906301 1833514 1776436 1690035 1661899 1628241 1617417 1629414
13590A629414o7125K698K0254o6392o1740J9798k6895m8254K7908k630M7560L1887
$$ 1629414 1562289 1564987 1585241 1518849 1457109 1476907 1450012 1401758 1429666 1427036 1474596 1506483
13578A506483q923q2107r2836m5015k6937l6346L321L592j3325o054j0350o8996
$$ 1506483 1497560 1415453 1322617 1277602 1250665 1214319 1217640 1221232 1207907 1201853 1191503 1122507
13566A122507p1447j163K8596j0047m936N6808j8552k7977K5325m4565j8042p2261
$$ 1122507 1051060 1049897 1078493 1068446 1063510 1120318 1101766 1073789 1099114 1054549 1036507 964246
13554I64246m4045n1010l5373L9338N0348Q2617n6166j22909m1235R0444M9424
$$ 964246 920201 869191 833818 873156 923504 1006121 949955 827046 785811 876255 925679
13543I25679J0891j7507m5486l8867n7899l2732q3839n2337o681k7392O3790m631
$$ 925679 936570 919063 873577 834710 776811 744079 660240 607903 601222 573830 637620 632989
13531F32989r6603k8419N5441R6646M3427l3036j3365k0323k3159K9261l1085
$$ 632989 536386 507967 563408 660054 703481 670445 657080 636757 613598 642859 611774
13520F11774p5626j067l7863J1680L4581l7591j3022n4484m0326p213M2146K8496
$$ 611774 536148 535081 497218 508898 543479 505888 492866 438382 398056 390843 432989 461485
13508D61485L0891o31m2372m418k584n758K2647J7421j2331m0374m6456K4463
$$ 461485 492376 491745 449373 444955 442371 436613 459260 476681 464350 423976 377520 401983
13496D01983n109J2815L0837J2083o581j7948m6610k1441N7634K2201j6133m49
$$ 401983 396874 409689 440526 452609 446028 428080 381470 360029 417663 439864 423731 423282
13484D23282j2152q478J4526P044M3414k6575k2054j8413n0677L5635N3203l6001
$$ 423282 411130 402652 417178 424222 467636 441061 419007 400594 349917 385552 438755 402754
13472D02754n8778J1000r2688k3563m7333L868J5068K4183R3635J6430q3785K3834
$$ 402754 343976 354976 262288 238725 191392 195260 210328 234511 328146 344576 260791 284625
13460B84625n9044n0290J6918L3175O861l9096j8282r847k0196L2287L538o6849
$$ 284625 225581 175291 192209 225384 232245 193149 174867 165020 144824 177111 180649 113800
13448A13800j4032j2482J0940J06530N1447R929J046r6543n279L5607J7936q0850
$$ 113800 99768 87286 98226 204756 256203 266132 267178 170635 165356 200963 218899 138049
13436A38049J816O2615j3162k822k0108N6116K8211m8748k1562p0118k6591J29198
$$ 138049 139865 202480 189318 186496 166388 222504 250715 201967 180405 110287 83696 212894
13424B12894J634O942j5313j053o1012q3282k699j9299L122k5459M4339M2452
$$ 212894 214528 221470 206157 205104 144092 60810 58111 38812 41934 16475 60814 103266
13412A03266P3516N7381j8961m7635j3768P2222l786q8509O6285Q3264M9417P48
$$ 103266 176782 234163 215202 167567 153799 226021 222235 133726 200011 283275 332692 333440
13400C33440M7843M7602j2830j01540p4374m2865o2316N3043K5539o1796j3957
$$ 333440 381283 428885 416055 314515 240141 197276 134960 188003 213542 151746 137789
13389A37789J6399l7257O668O305M4157K2050p4896j07766o4144j1031P0843P3618
$$ 137789 154188 116931 123599 129904 174061 196111 121215 13449 -50695 -61726 9117 82735
13377H2735R7164Q457n3350q3743J5j5411N55j5111L7910L6130L2976J858Q554
$$ 82735 179899 188356 135006 51263 51278 35867 36422 21311 59221 95351 128327 130185 138739
13364A38739L9870m0763j6579q441m6155N464L7405J3816R455j00218n2959N3039
$$ 138739 178609 137846 121267 112826 66671 72135 109540 123356 132811 32593 -20366 32673
13352C2673N7147Q4657O995o7631L0939n449p6875q9336o1026k8347J8877L3641
$$ 32673 89820 174477 181472 113841 144780 139331 62456 -26880 -87906 -116253 -97376 -63735
13340f3735l902Q7997K7236L2140J0609m887r344J8301K0208l3377j9026k6594
$$ -63735 -67637 20360 47596 79736 90345 85458 76114 94415 114623 81246 62220 35626
13328C5626l1153l467M5263Q0718j2518j4415J9890M7623j5088j13902j7564N0364
$$ 35626 4473 1006 46269 126987 114469 100054 119944 167567 152479 38577 21013 71377
13316G1377J1933j9203l2867j4220N6482l28J22027K6727J7733K8321j27J7772
$$ 71377 83310 64107 31240 17020 73502 73174 195201 221928 239661 267982 267855 285627
13304B85627m9678l7409q658q934j5044L2014M4733k2963P7754J03193J40920
$$ 285627 235949 198540 189882 180948 165904 197918 242651 219688 297442 400635 541555
13293E41555J80784K36028K93688L42434L62734L23539K24179J02984j32363k51810
$$ 541555 722339 958367 1252055 1594489 1957223 2280762 2504941 2607925 2475562 2223752
13283B223752l87863l25931k77952j85835j81216j90574r9897j3087r4312q1728
$$ 2223752 1835889 1509958 1232006 1046171 864955 674381 574484 561397 467085 385357
13273C85357k5405Q8847o828j1991r850m8694J3691O6843k8717j13049m2643m0148
$$ 385357 359952 448799 441971 429980 420130 371436 385127 451970 423253 310204 267561 227413
13261B27413j9806j0820O8736n989L891Q3964o570k6719o646L0558j7153R1561
$$ 227413 207607 196787 265523 259534 263425 347389 340819 314100 307454 338012 320859 412420
13249D12420N4522j9438k1069N3898M3469P226j0046k267j7443Q5220K2485k3662
$$ 412420 466942 447504 426435 480333 523802 531028 520982 518715 501272 586492 608977 585315
13237E85315o2828j17855r9079n4549J7045O2106K4049k2836p0072p6453L1393
$$ 585315 522487 404632 305553 251004 268049 330155 354204 331368 261296 184843 216236
13226B16236n45j2659k120M4532J3630j03054r4654L873O6776J3817O5321L4575
$$ 216236 215691 203032 200912 245444 259074 156020 61366 65239 132015 145832 211153 245728
13214B45728q951k64O434k9058p1082o6110Q702l417k6043L1200L3630k001m451
$$ 245728 236777 236513 242947 213889 142807 76697 85399 81982 55939 87139 120769 118768 114317
13201A14317L3827R7848l738r5231m7199j7790k0368r151J16M0025K0410M4096
$$ 114317 148144 245992 242254 147023 99824 82034 61666 52515 52631 92656 113066 157162
13189A57162o130n0481J7250M6999N3329M6799m5188o2821o9485J6417n3312K1066
$$ 157162 151032 100551 117801 164800 218129 264928 219740 156919 87434 103851 50539 71605
13177G1605O9122J3624L3057O791L8834m5218k2921K1257k8620n1531k5620O1254
$$ 71605 140727 154351 187408 194199 233033 187815 164894 186151 157531 106000 80380 141634
13165A41634N2020l947q980m3859m1989L7234J226L8960J4502l6060k9485R047
$$ 141634 193654 189707 180727 136868 94879 132113 133339 172299 186801 150741 121256 130303
13153A30303M2066m5467m0176K0645o5l0220N0577K1016r6551n9836k370O1643
$$ 130303 172369 126902 86726 107371 107306 77086 127663 148679 52128 -7708 -10078 51565
13141E1565k6678Q5231N5294p64l14n5831l0759j8359o8311j6559O690n79O0806
$$ 51565 24887 110118 165412 164648 164334 108503 77744 59385 -8926 -25485 -18795 -19374 41432
13128D1432N8002L5166J7198l0604L0656K7664K4108p9756j00916j7603Q0440
$$ 41432 99434 134600 151798 121194 151850 179514 203622 123866 22950 5347 85787
13117H5787k8494k1618M3736N7966J1863J8893n7101N883O596k2878n2181K1633
$$ 85787 57293 35675 79411 137377 149240 168133 111032 116915 123511 100633 48452 70085
13105G0085J8140J3531J8130j22n6024l7924J6501k9441K7696N4908J9679m9425
$$ 70085 88225 101756 119886 119764 63740 25816 42317 12876 40572 95480 115159 65734
13093F5734q0318O894L7008M1343m1934q2876o496L4646K6887J2928j2969K9994
$$ 65734 -14584 -7690 29318 70661 28727 -54149 -60645 -25999 888 13816 847 30841
13081C0841l601O8633j1224q6538o283l6674J7495K3643L2391J8703l6146N7920
$$ 30841 27240 95873 84649 -1889 -8172 -44846 -27351 -3708 28683 47386 11240 69160
13069F9160N090K476O03r545m8065N055L6012l8744j14303R288J6584k2915P9208
$$ 69160 74250 76726 77329 67784 19719 24774 60786 22042 -92261 -82973 -66389 -89304 -10096
13056a0096M2265k7352r14o532l064j8567L274P8673k1776q180M9760N3782P188
$$ -10096 32169 4817 3903 -2629 -5693 -24260 -20986 57687 35911 27731 77491 131273 138461
13043A38461K0405L201o1324q6832j2006P3660N4617J3624j2793o9443L310k8892
$$ 138461 158866 162067 100743 13911 1905 75565 130182 143806 131013 61570 64880 35988
13031C5988R139J1405M1758m499O241l5421K5395M5899n2931p72n2209k357o696
$$ 35988 45127 56532 98290 93791 100032 64611 90006 135905 82974 82202 29993 27636 20940
13018B0940l1671N6283N7031m904j7865J3886N677j10968P323J5991J3644p354
$$ 20940 -10731 45552 102583 97679 79814 93700 99377 -11591 -4268 11723 25367 18013
13006A8013k2212J4030Q0656J474r8004J3039L5656n039K4077k4112r743k6811
$$ 18013 -4199 9831 90487 91961 -6043 6996 42652 37613 61690 37578 27835 1024
12994A024l0786k4315K0326K8240K0101r906j3826M341o4680Q337L7387J5841
$$ 1024 -29762 -54077 -33751 -5511 14590 4684 -9142 -4801 -69481 -61144 -23757 -7916
12982g916J8507J7271n6420j8549M5128Q3058k6635n0775k4497J7616K6325P796
$$ -7916 10591 27862 -28558 -47107 -1979 81079 54444 3669 -20828 -3212 23113 30909
12970C0909J2402o970p3876k5203K0343j5481M2047J8483n3417K9302P1674k982
$$ 30909 43311 36341 -37535 -62738 -42395 -57876 -15829 2654 -50763 -21461 50213 47231
12958D7231j2939l7808J2960K1750K0549P0193j9502q5594K3946L8350L064m5792
$$ 47231 34292 -3516 9444 31194 51743 121936 102434 16840 40786 79136 82200 36408
12946C6408R989J800o1774L523Q1851J2357M2127k5004j5623k4052k9099O2581
$$ 36408 46397 48197 -13577 -10054 71797 84154 126281 101277 85654 61602 32503 95084
12934I5084J6388l542K9893l3869k5531l1786j9199K3316K5480o9254K146O5880
$$ 95084 111472 107930 137823 103954 78423 46637 27438 50754 76234 6980 9126 75006
12922G5006L9286j8812n0641L875o2605j8501L9189J5984l2238J902k2818o0774
$$ 75006 114292 95480 44839 48714 -13891 -32392 6797 22781 -9457 -7555 -30373 -91147
12910i1147k4795N5541Q7243N3183n643n8573n0046K3736K3318k6276q096P4639
$$ -91147 -115942 -60401 26842 80025 74382 15809 -34237 -10501 12817 -13459 -21555 53084
12898E3084M532q071J1379k8157j1046k6214L5363J7371p5996J7593M3594N4989
$$ 53084 57616 49545 60924 32767 21721 -4493 30870 48241 -27755 -10162 33432 88421
12886H8421L5120k2119k8925K0007L397L6292n2635o0141o0923l3750J2479N8547
$$ 88421 123541 101422 72497 92504 95901 132193 79558 19417 -41506 -75256 -62777 -4230
12874d230m422k0194m3726K4831Q7047M0322L1595O0847j0785l4369K5064l6344
$$ -4230 -8652 -28846 -72572 -47741 39306 79628 111223 172070 161285 126916 151980 115636
12862A15636m4222k0426p6495m3760k4274L5672P0122k7411K4228O2644j4311
$$ 115636 71414 50988 -25507 -69267 -93541 -57869 12253 -15158 9070 71714 57403
12851E7403m2001M7401J9361o051j8567J7347k1150n4980N7667K4595l967j3513
$$ 57403 15402 62803 82164 76113 57546 74893 53743 -1237 56430 81025 77058 63545
12839F3545j2090k889j4419j3300j0466K5123M1827N2383j6000n6173o4897O4123
$$ 63545 51455 48566 34147 20847 10381 35504 77331 129714 113714 57541 -7356 56767
12827E6767Q804o1938K4380P6670m5091p8462p8114O3734O8801n7647k5927J03811
$$ 56767 65571 3633 28013 104683 59592 -18870 -96984 -33250 35551 -22096 -48023 55788
12815E5788K6863k4074n0765q9577p013K3631N2288M0770N1701O9178L9164j9245
$$ 55788 82651 58577 7812 -81765 -88778 -65147 -12859 27911 79612 148790 187954 168709
12803A68709r3412l9661J512O5036j1120m0791m0717k3630k4774L3258L6646l8417
$$ 168709 75297 35636 37148 102184 91064 50273 9556 -14074 -38848 -5590 31056 -7361
12791g361l0811j1317k8329O5699J23363m8338n6750l6676m8240j8386O155j6561
$$ -7361 -38172 -49489 -77818 -12119 111244 62906 6156 -30520 -78760 -97146 -90991 -107552
12779a07552N8844N4828j7485m1195m473j3501K473J532M4167j8672N0605K4554
$$ -107552 -48708 6120 -11365 -52560 -57033 -70534 -68061 -66529 -22362 -41034 9571 34125
12767C4125K2515l652j2884m3681n6740L4173j9870k1763L3103K1443q634J6297
$$ 34125 56640 52988 40104 -3577 -60317 -26144 -46014 -67777 -34674 -13231 -21865 -5568
12755e568l5592m455k9278K0414J00630J17326L2758k616k3792n1471n5785m1034
$$ -5568 -41160 -45615 -74893 -54479 46151 163477 196235 193619 169827 118356 62571 21537
12743B1537l5694J9662j682l3044j381j2652J9972K5739l0919j2165J5769l5906
$$ 21537 -14157 5505 3823 -29221 -30602 -43254 -23282 2457 -28462 -40627 -24858 -60764
12731f0764l1547P3930P0318K4146k7495p0417j1439O5333N5098K7015k6380q473
$$ -60764 -92311 -18381 51937 76083 48588 -21829 -33268 32065 87163 114178 87798 79325
12719G9325l5498n0202k1824K2891N2479p497l6478L0901K6739L7039M5835k0097
$$ 79325 43827 -6375 -28199 -5308 47171 39674 3196 34097 60836 97875 143710 123613
12707A23613m1256J9737j0254p8797j2573j423L6505O3618n731n9245k1170M7463
$$ 123613 82357 102094 91840 13043 470 -953 35552 99170 93439 34194 13024 60487
12695F0487O3020j8822m3655j646J8883Q2417K2402n9242o0206j7090O7631K9584
$$ 60487 123507 104685 61030 59384 78267 160684 183086 123844 63638 46548 114179 143763
12683A43763K725p1619k9280k099L6991l077L0679J3873J3028n289l7903n072
$$ 143763 146488 74869 45589 43490 80481 77404 108083 121956 134984 129695 91792 86720
12671H6720O2937Q9713N8717m2712K8528L629J4540P9230J56950J69994J25453
$$ 86720 149657 239370 298087 255375 283903 287532 302072 381302 538252 708246 833699
12660H33699K15155J83300K1977o6658l00499l29607j29696o9652o550K531r1017
$$ 833699 1048854 1232154 1254131 1187473 886974 557367 427671 358019 351469 354000 262983
12649B62983p1585r6141q1063L6141J6287L0672r112L4467M5237O15l7946L5370
$$ 262983 191398 95257 14194 50335 66622 97294 88182 122649 167886 168501 130555 165925
12637A65925J0695l0212l7292R584K1748l731l2023k9108K1794k5019J4171m5646
$$ 165925 176620 146408 109116 118700 140448 136717 104694 75586 97380 72361 86532 40886
12625D0886p1379L4939N80l3153O5791q558l2133J3317M8579l6837n446j52K9631
$$ 40886 -30493 4446 5026 -28127 37664 29106 -3027 10290 58869 22032 16586 16434 46065
12612D6065N3339M5824m8646n8340l9090r345k9721r51L9462L6009n904L6208
$$ 46065 99404 145228 96582 38242 -848 -10193 -39914 -40865 -1403 34606 28702 64910
12600F4910N4846l105l8654k5323Q805O1104J04835k2119o7938l2575K2435l7599
$$ 64910 119756 116651 77997 52674 61479 122583 227418 205299 137361 104786 127221 89622
12588H9622L437K8900l2792k2278o6984j0568N6097K0687L9329J8489m2499k2395
$$ 89622 93059 121959 89167 66889 -95 -10663 45434 66121 105450 123939 81440 59045
12576E9045n6863O3473J2596j3027J3736L4682n0751m5028j5259J8782J3141M5419
$$ 59045 2182 65655 78251 65224 78960 113642 62891 17863 2604 21386 34527 79946
12564G9946j071k8944o9051l6121Q3645K9149j8539P111r332J7777K4386m136
$$ 79946 78875 49931 -19120 -55241 28404 57553 39014 46125 36793 54570 78956 74820
12552G4820K8725l4789o5414k0941N174L8714k890n846j2984k6316L4727M3513
$$ 74820 103545 68756 3342 -17599 -12425 26289 23399 17553 4569 -21747 12980 56493
12540E6493j1546m5624J1035Q736O2018K6154k5872J0773N9668k4358p0410m9949
$$ 56493 44947 -677 10358 19094 81112 107266 81394 92167 151835 127477 57067 7118
12528G118L9348k3052O280J7169L3734j9085N0655J7132o8092m8558K0980N4833
$$ 7118 46466 23414 29694 46863 80597 61512 112167 129299 61207 12649 33629 88462
12516H8462j9499N3496j5940l3235k1817J415o5824K4209O6891M5213m3023p372
$$ 88462 68963 122459 106519 73284 51467 52882 -12942 11267 78158 123371 80348 72976
12504G2976J6085K7010l1266p1610o8336q4095L665N4314Q6798M4111k5170l7125
$$ 72976 89061 116071 84805 13195 -55141 -139236 -135571 -81257 5541 49652 24482 -12643
12492a2643L8522L335L1402Q7050J2379j02863j10393P225o8588n56Q2522J6344
$$ -12643 25879 29214 60616 147666 160045 57182 -53211 -45986 -114574 -115130 -32608 -16264
12480a6264m8219L7629m7556K3082O2486L02K8501K6602K031k2870p1669J1332
$$ -16264 -64483 -26854 -74410 -51328 11158 11460 39961 66563 68594 45724 -25945 -14613
12468a4613N4630O4558m4112j6727r996j03629n7225L1498R9194P9752L7571N1465
$$ -14613 40017 104575 60463 43736 33740 -69889 -127114 -95616 3578 83330 120901 172366
12456A72366n5412q6118l017L1807N9106M6013o0197n6477k0396k7266n248K5908
$$ 172366 116954 30836 27819 59626 118732 164745 104548 48071 27675 409 -4839 21069
12444B1069r061K0271K0114K1301j0617J3115l1350J1190m73J2885l4910j8126
$$ 21069 12008 32279 52393 73694 63077 76192 44842 56032 55559 68444 33534 15408
12432A5408J1362j9968j1353n890J0077O862j6246J5596J1062J252j9540j3732
$$ 15408 26770 6802 -4551 -10441 -364 6498 -9748 5848 16910 18162 -1378 -15110
12420a5110K6366M1500P0554K3895j4750k7452R296p677l1493j5565n5312L448
$$ -15110 11256 52756 123310 147205 132455 105003 114299 106622 75129 59564 4252 7700
12408G700K5453n4560m343P832J8498N9881N0329N2007M962L4384M1548j15762
$$ 7700 33153 -21407 -25750 -17918 580 60461 110790 162797 167759 202143 243691 127929
12396A27929q2793r081O078l551M6482K5627p4998q7146K3304N366q4103k5847
$$ 127929 45136 36055 42133 38582 85064 110691 35693 -51453 -28149 -22783 -106886 -132733
12384a32733P9867N5392J0521O6504j3802j5976m168J6703l1706j1949K9149P771
$$ -132733 -52866 2526 13047 79551 65749 49773 45605 62308 30602 18653 47802 55573
12372E5573O8346k1576p0842p2468l9815j5511R358k2359j2045N0651M0530k45
$$ 55573 123919 102343 31501 -40967 -80782 -96293 -86935 -109294 -121339 -70688 -30158 -30403
12360c0403n6486L7962N533O1730K1058L9913L38m9073p0299l52j3843J2327K2987
$$ -30403 -86889 -48927 -43394 18336 39394 79307 79645 30572 -39727 -40079 -53922 -41595 -18608
12347a8608K0865L8241j5279j3636l0476L5012j9521j5862k0244L6613m8577k2943
$$ -18608 2257 40498 25219 11583 -18893 16119 -3402 -19264 -39508 -2895 -51472 -74415
12335g4415p021Q1741O1666j07729n9223J156M1053J8114L4083J6486N7205K226
$$ -74415 -81436 305 61971 -45758 -104981 -103825 -62772 -44658 -10575 5911 63116 65342
12323F5342n5373n4565K1402L0655j2770P2351L2849l9657m5581m2557k1749L7913
$$ 65342 9969 -44596 -23194 7461 -5309 67042 99891 60234 14653 -27904 -49653 -11740
12311a1740J01666M2164q83p1383l7348q6268j06103J7773M7729J16164M6066
$$ -11740 89926 132090 131207 59824 22476 -63792 -169895 -152122 -104393 11771 57837
12300E7837J8492j0215j3033j5606k2944n1009p935K1525N2596k3347L8021M8137
$$ 57837 76329 66114 53081 37475 14531 -36478 -44413 -22888 29708 6361 44382 92519
12288I2519j4462q0271j4940p303p113Q832n8753J948j0759L8240M9543K9724
$$ 92519 78057 -2214 -17154 -24457 -31570 -22738 -81491 -79543 -90302 -52062 -2519 27205
12276B7205N633l3634j7264J8579k4563j4475p23M6472L5532L3014q7563q770
$$ 27205 32838 -796 -18060 519 -24044 -38519 -39242 7230 42762 75776 -11787 -20557
12264b0557M4958J4661N188L1253j0408j9223L5730O2606l9971o9909o5572n147
$$ -20557 24401 39062 44250 75503 65095 45872 81602 144208 104237 34328 -31244 -36391
12252c6391K5545n976J3710j0180K2680k2273o2510O1525M8861m6969J8335O1851
$$ -36391 -10846 -16822 -3112 -13292 9388 -12885 -75395 -13870 34991 -11978 6357 68208
12240F8208J4605m2484p1875L8171m8808k0693N9433j2082m061k0883J9088n6838
$$ 68208 82813 40329 -31546 6625 -42183 -62876 -3443 -15525 -19586 -40469 -21381 -78219
12228g8219n2977P2109P5434M3887m414n1142r471Q2316P370j6650l0093q720
$$ -78219 -131196 -59087 16347 60234 55820 4678 -4793 77523 84893 68243 38150 29430
12216B9430M955j0914J2680l3286k8019j5566K9739J7191K9771O8188N0910m2286
$$ 29430 34385 23471 36151 2865 -25154 -40720 -10981 6210 35981 104169 155079 112793
12204A12793n9146o118j9987o5848J0333J2994L2686M6738P9897K7512k6010k5156
$$ 112793 53647 47529 27542 -38306 -27973 -14979 17707 64445 144342 171854 145844 120688
12192A20688l5077k9310K2197L26m0241K7837N9129j2529L832m579n5284R331
$$ 120688 85611 56301 78498 78824 38583 66420 125549 113020 116852 112273 56989 66320
12180F6320N5844N0304m6256p2000K4406p268l5604m5567N3106M8269n8227j7637
$$ 66320 122164 172468 126212 54212 78618 71350 35746 -9821 43285 91554 33327 15690
12168A5690J5112J327K7418o5215p892K3182L4340M1434L1675K1982l8124k1016
$$ 15690 30802 32129 59547 -5668 -13560 9622 43962 85396 117071 139053 100929 79913
12156G9913j4950O8979R3402K30346K44942N6328N851j58186j83191j29295j54322
$$ 79913 64963 133942 227344 457690 702632 758960 764811 606625 423434 294139 139817
12145A39817l2098r0543n3104K8058M0097J4809Q896j0375L552k6022n7781J6533
$$ 139817 107719 17176 -35928 -7870 32227 47036 55932 45557 49109 23087 -34694 -18161
12133a8161K7318K4832M5397k250m9396Q785L3802K3945m1579o4509n5620N5139
$$ -18161 9157 33989 79386 77136 27740 36525 70327 94272 52693 -11816 -67436 -12297
12121a2297L937j5377M0160J9602k7959m3980N4888M575j9236M2636J19725K17459
$$ -12297 -8360 -23737 16423 36025 8066 -35914 18974 23549 4313 46949 166674 384133
12109C84133J53822J16067J96563R7918j36548k61162k22318j17078n341P8435
$$ 384133 537955 654022 850585 948503 811955 550793 328475 211397 206056 284491
12099B84491n6419r8365r0375K0391P1686o219r5142Q335J17982J6284l2041J4242
$$ 284491 228072 129707 39332 59723 131409 125190 30048 38383 156365 172649 140608 154850
12087A54850O647l2104m2580K27J04252Q730K2304n1063P032j156l6412l3299
$$ 154850 161497 129393 86813 87040 191292 200022 222326 171263 178295 177139 140727 107428
12075A07428J0479L8666k4297k0679K3660M731Q743J0773N3262M5600J5206l05
$$ 107428 117907 156573 132276 111597 135257 139988 148731 159504 212766 258366 273572 273267
12063B73267N6088N5429l6091l4598m2555m9878j3817j2363o2518j9776K5564
$$ 273267 329355 384784 348693 314095 271540 221662 207845 195482 132964 113188 138752
12052A38752l778K8734N618k1675K1957l0763o9252K0882n996l9690o9703j1401
$$ 138752 134974 163708 169326 147651 169608 138845 69593 90475 84479 44789 -24914 -36315
12040c6315L8328q365L3607J6557Q3495R442j03945l6774K834M7029j7645j27865
$$ -36315 2013 -6352 27255 43812 127307 136749 32804 -3970 -1136 45893 28248 -99617
12028i9617k2518O4617N6053O2408m2704q1410K1207P4833K3051J1111m2850l5652
$$ -99617 -122135 -57518 -1465 60943 18239 -63171 -41964 32869 55920 67031 24181 -11471
12016a1471l6185p955j0927J2330K104J8397K6216n2987J1709L3741j5572L9710
$$ -11471 -47656 -55611 -66538 -54208 -52104 -33707 -7491 -60478 -48769 -15028 -30600 9110
12004I110Q0901n8377p3444l8795j0838L2503M6250N4522m4648P073L3517k2376
$$ 9110 90011 31634 -41810 -80605 -91443 -58940 -12690 41832 -2816 4257 37774 15398
11992A5398q7214k847Q939m541O8536M9981M1080K7443q8955p3572M565J1104
$$ 15398 -71816 -74663 -65724 -70265 -1729 48252 89332 116775 27820 -45752 -41187 -30083
11980c0083k0453l6177J9412j0419k553L0349N5212p6458P532P5238O3988q0586
$$ -30083 -50536 -86713 -67301 -77720 -80273 -49924 5288 -71170 -63638 11600 75588 -4998
11968d998K8331L2307o4550m8012r222M1847O6453j679R1771L9268l5883M933
$$ -4998 23333 55640 -8910 -56922 -66144 -24297 42156 40477 132248 171516 135633 140566
11956A40566n543p6075p6606n6019K4274M070n4615J6035k9449N9333J23672O2792
$$ 140566 135023 58948 -17658 -73677 -49403 -45333 -99948 -83913 -113362 -54029 69643 132435
11944A32435k5197p5833p2051p405L4404K7424j2173j1030K0823N0397K4673o6184
$$ 132435 107238 31405 -40646 -48051 -13647 13777 1604 -9426 11397 61794 86467 20283
11932B0283K6582l9742J6557k6449k1713M317M6551m0386k1108Q3227k500k3673
$$ 20283 46865 7123 23680 -2769 -24482 -20165 26386 -14000 -35108 48119 45619 21946
11920B1946O28n9692j03926j461J19665O1885n2883n6414l2058N4744K6881p030
$$ 21946 22574 -37118 -141044 -142505 -22840 39045 -13838 -70252 -102310 -47566 -20685 -27715
11908b7715k7874K4728J9074m0222P4288l037j0886N827O0633p6914p3483k2925
$$ -27715 -55589 -30861 -11787 -52009 22279 19242 8356 14183 74816 -2098 -75581 -98506
11896i8506L2276P8451l474k4174m9730m0188J2460K3167O9647R707n2073m1412
$$ -98506 -66230 12221 8747 -15427 -65157 -105345 -92885 -69718 -71 9636 -42437 -83849
11884h3849L8672L8164J7239m526k3428L698k4205k5209R0994N0088j7259l3245
$$ -83849 -45177 -7013 10226 5700 -17728 -14030 -38235 -63444 27550 77638 60379 27134
11872B7134l5295k3971J4707K8723l1382m7003j3766P4196l4978j0570M6321L5936
$$ 27134 -8161 -32132 -17425 11298 -20084 -67087 -80853 -6657 -41635 -52205 -5884 30052
11860C0052n7419l722M7703n2270j1220K2608r947J3215P3109n8313j19086q289
$$ 30052 -27367 -31089 16614 -35656 -46876 -24268 -34215 -21000 52109 -6204 -125290 -133579
11848a33579K1109K254M8531L7179L830j5997N7340L8708k3266m2313J8365j5716
$$ -133579 -112470 -110216 -61685 -24506 -20676 -36673 20667 59375 36109 -6204 12161 -3555
11836c555K8568L384K9557L6316L77l4762m539k2686K3166n9280o2186k4307o758
$$ -3555 25013 28397 57954 94270 94647 59885 55346 32660 55826 -3454 -65640 -89947 -96705
11823i6705j114n479K6842J3039k8363j4874J1884k814O7117O0148l0282k3197
$$ -96705 -97819 -103298 -76456 -63417 -91780 -106654 -94770 -97584 -30467 29681 -601 -23798
11811b3798L7235k2319j00492q451K3411l8259q773O7428k333j6105P8553k9288
$$ -23798 13437 -8882 -109374 -117825 -94414 -132673 -141446 -74018 -76351 -92456 -13903 -43191
11799d3191l8494l0292j9222L1251r661J8612J0817k7146m5259L9950Q6111O3909
$$ -43191 -81685 -111977 -131199 -99948 -109609 -90997 -80180 -107326 -152585 -112635 -26524 37385
11787C7385J0298o852n2982l844m8576M3012N8304n6575O708K1228K937j3911
$$ 37385 47683 40831 -12151 -15995 -64571 -21559 36745 -19830 -13122 8106 11043 -2868
11775b868l1605J1048K8302o662k0823L1240Q0266N6008M084k0667p4299n6839
$$ -2868 -34473 -23425 4877 -1785 -22608 8632 88898 144906 148990 128323 54024 -2815
11763b815l2795J8523M1498J4203j5531o6909m0863N2743K2836m0571R943J8761
$$ -2815 -35610 -17087 24411 38614 23083 -43826 -84689 -31946 -9110 -49681 -39738 -20977
11751b0977K6228j6715k9218J7879j7751k0276L2412N3975L308l5394k8034r7992
$$ -20977 5251 -11464 -40682 -22803 -40554 -60830 -28418 25557 28865 -6529 -34563 -132555
11739a32555R168J00866L6534J6706K4753m0248m0050r1255J6500l6097K2010
$$ -132555 -123387 -22521 14013 30719 55472 15224 -24826 -116081 -99581 -135678 -113668
11728a13668M8823M4820r729J3828J0285j4660o4655n6248P9091K520l0244J1020
$$ -113668 -64845 -20025 -29754 -15926 -5641 -20301 -84956 -141204 -62113 -59593 -89837 -78817
11716g8817O2504J7315m5281k9240O5840K4885m8260l002O003O7639K0277J1863
$$ -78817 -16313 1002 -44279 -73519 -7679 17206 -31054 -34056 -28053 39586 59863 71726
11704G1726N3191K3321J7727n3261r3427o0013L1782O1423P5786j4080j6138k9341
$$ 71726 124917 148238 165965 112704 19277 -40736 -8954 52469 128255 114175 98037 68696
11692F8696m396l1184q6949Q882N852l6440J5045j7738N036J0092j5368O1363
$$ 68696 64300 33116 -53833 -44951 -39099 -75539 -60494 -78232 -73196 -63104 -78472 -17109
11680a7109L1483k8589k4484N978J5685O4714m3457m781n4045m3412M1262K6618
$$ -17109 14374 -14215 -38699 -32721 -17036 47678 4221 -560 -54605 -98017 -56755 -30137
11668c0137K0501N2692l4086J4516K0327k7897k2480M9901K4943k5467L011j0218
$$ -30137 -9636 43056 8970 23486 43813 15916 -6564 43337 68280 42813 45824 35606
11656C5606p6817l4925N2642J7082n2986o273j7549j2519l801L5906l1907m0688
$$ 35606 -41211 -76136 -23494 -6412 -59398 -65671 -83220 -95739 -99540 -63634 -95541 -136229
11644a36229L4131K517m1787k2136K3487Q3118O4475j8307r7205K1862M2043j6896
$$ -136229 -102098 -99581 -141368 -163504 -140017 -56899 7576 -10731 -107936 -86074 -44031 -60927
11632f0927J8676K9685j3788J07851K4731l3995j10173L3458l2037j13627L3558
$$ -60927 -42251 -12566 -26354 81497 106228 72233 -37940 -4482 -36519 -150146 -116588
11621a16588J9558q698P6620N1296q198n9880o183M8455n7391m7874k6365J12
$$ -116588 -97030 -105728 -29108 22188 13990 -45890 -52073 -3618 -61009 -108883 -135248 -135136
11609a35136M9966Q5921Q6260q1034p8437j7412o8376l988N1290P6676N5079L6778
$$ -135136 -85170 751 87011 5977 -72460 -89872 -158248 -162236 -110946 -34270 20809 57587
11597E7587k2868n8902L6089R229o5717L5129N3227j4311m7612l4443j1728K3728
$$ 57587 34719 -24183 11906 21135 -44582 -9453 43774 29463 -18149 -52592 -64320 -40592
11585d0592L9079N6971N0163j10278r0375K0433M9131J3670K5285p13M0998p728
$$ -40592 -1513 55458 105621 -4657 -95032 -74599 -25468 -11798 13487 12774 53772 46044
11573D6044J2896J01772k3615p9158k672m6221l0438o0027L2138L8019l4643K8603
$$ 46044 58940 160712 137097 57939 55267 9046 -21392 -81419 -49281 -11262 -45905 -17302
11561a7302N1978j0255q3695l8989K6328M3774l0067K9877J6817k150L3134j0166
$$ -17302 34676 24421 -59274 -98263 -71935 -28161 -58228 -28351 -11534 -13684 19450 9284
11549I284l804p4011k6712J7478k4336j09q3443J4889M0289J16821R4829j670
$$ 9284 5480 -68531 -95243 -77765 -102101 -102210 -185653 -170764 -130475 -13654 81175 79505
11537G9505l7840n543j80n752Q267J9162l5016l1371m727P150l5059K454j6937
$$ 79505 41665 36122 35942 30190 38457 57619 22603 -8768 -13495 -6345 -41404 -38950 -55887
11524e5887N7556N1395m4684j0656m0697l3976M9549O6731J9454N118q1703o9843
$$ -55887 1669 53064 8380 -2276 -42973 -76949 -27400 39331 58785 63903 -17800 -87643
11512h7643j2258P9069K6805k2915l3493N274k7786q14N9719J5512l3032l9978
$$ -87643 -99901 -20832 5973 -16942 -50435 -45161 -72947 -73761 -14042 1470 -31562 -71540
11500g1540N566k34k2365O838l10m4523k7449O4088O9344k5473J1232m9585j1245
$$ -71540 -65974 -66208 -88573 -81735 -82045 -126568 -154017 -89929 -20585 -46058 -34826 -84411 -95656
11487i5656m7485l5945M6768M6475M1302N9928K3189j3476l7424L7320M4318O470
$$ -95656 -143141 -179086 -132318 -85843 -44541 15387 38576 25100 -12324 24996 69314 75784
11475G5784n1495p312K6150J00157o9093k2750M739j4058M2050k7657j5368k4558
$$ 75784 24289 16977 43127 143284 74191 51441 56180 42122 84172 56515 41147 16589
11463A6589Q079L7082k0760n1740M0744k3425l0459O673m0585k1845o336k3795
$$ 16589 24668 61750 40990 -10750 29994 6569 -23890 -17217 -57802 -79647 -85983 -109778
11451a09778K8609J00725N2176q0620l7820m8763M0115N7450m4835M249r234p525
$$ -109778 -81169 19556 71732 -8888 -46708 -95471 -55356 2094 -42741 -38492 -47726 -55251
11439e5251J7753M7493L5198J728R833j5522o913m9907K6965k1185n0950o1261
$$ -55251 -37498 9995 45193 46921 56754 41232 34319 -15588 11377 -9808 -60758 -122019
11427a22019n3508P1376O5455m5693r909M3054j121m9021K2670L6489m3695P995
$$ -122019 -175527 -104151 -38696 -84389 -94298 -51244 -52365 -101386 -78716 -42227 -85922 -77927
11415g7927j5693J4232J6699R253N3297O7068K9463J3061p1310m8897J8138o1218
$$ -77927 -93620 -79388 -62689 -53436 -139 66929 96392 109453 38143 -10754 7384 -53834
11403e3834k4008L9525L8929k8955l0459j0374M2957q958o493q0226L5590M246
$$ -53834 -77842 -38317 612 -28343 -58802 -69176 -26219 -35177 -41670 -121896 -86306 -82060
11391h2060m9946n7718M1477M4126k0378l291j4828j9712P7545O5906k5770n928
$$ -82060 -132006 -189724 -148247 -104121 -124499 -127790 -142618 -162330 -84785 -18879 -44649 -50577
11379e0577J4993N943K8456o585k540q3427m3189J2948O2376R6068K9838r4751
$$ -50577 -35584 -29641 -1185 -7770 -10310 -93737 -136926 -123978 -61602 34466 64304 -30447
11367c0447j1817J8713j5515R1866M4965M3087n1888K123k8159K6817J4343j51029
$$ -30447 -42264 -23551 -39066 52800 97765 140852 88964 91087 62928 89745 104088 -46941
11355d6941r6669k0575O8364p243N7706L1106K1052L5352k4305j7117L4821M1775
$$ -46941 -143610 -164185 -95821 -103064 -45358 -14252 6800 42152 17847 730 35551 77326
11343G7326l6133k3306M6379l9204l1705Q435P3011K3117J1892j0915p2582m9105
$$ 77326 41193 17887 64266 25062 -6643 1792 74803 97920 109812 98897 26315 -22790
11331b2790K3004k4213m664O1981k3829O268M4860o1355n7087J4106M1502p340
$$ -22790 214 -23999 -28663 33318 9489 15757 60617 -738 -57825 -43719 -2217 -9557
11319i557n2210n95J0733o493J9444M2532J4382j10318r0967o036J8867N1753
$$ -9557 -61767 -62362 -51629 -58122 -38678 3854 18236 -92082 -183049 -189085 -170218 -118465
11307a18465J600r468P1046N2569L6560o4870l7535O7235j446l7036J410K8255
$$ -118465 -116865 -126333 -55287 -2718 33842 -31028 -68563 -1328 -2774 -39810 -38400 -10145
11295a0145k0548n7357j5919N2048P5218O525L8046n507m5113o1357L3158N1020
$$ -10145 -30693 -88050 -103969 -51921 23297 29822 67868 62361 17248 -44109 -10951 40069
11283D0069o4490q4736K3192j5971M6166M558j0961K7026n1934P4879L9361L7803
$$ 40069 -24421 -109157 -85965 -101936 -55770 -51212 -62173 -35147 -87081 -12202 27159 64962
11271F4962r8514j10966k6247M0524M4538n557P9956K1834j755O880M2492k142
$$ 64962 -33552 -144518 -170765 -130241 -85703 -91260 -11304 10530 8775 15655 58147 56005
11259E6005m2373m5088K1999L3176J0456J1297J2499O1231l8695q1459j9837L5667
$$ 56005 13632 -31456 -9457 23719 34175 45472 57971 119202 80507 -952 -20789 14878
11247A4878j8774J6818L1736J3827p1014n823O8177m460l2736j2080K3123J0102
$$ 14878 -3896 12922 44658 58485 -12529 -18352 49825 45365 12629 549 23672 33774
11235C3774J3013j079r187k4217l9027j5999j0372l1679N6024J4276p9924K3559
$$ 33774 46787 45708 36521 12304 -26723 -42722 -53094 -84773 -28749 -14473 -94397 -70838
11223g0838o2077N4558N7923L5421k730L914K3783k0652m578k0797j9035R9796
$$ -70838 -132915 -78357 -20434 14987 12257 16171 39954 19302 14724 -6073 -25108 74688
11211G4688O2567j155o9814o4817j30102k9027J03497N509n5772M9765K0016o2707
$$ 74688 137255 136100 66286 1469 -128633 -157660 -54163 -48654 -104426 -54661 -34645 -97352
11199i7352J8595P5382O6374l9334p6749j10914r485P5587O8464N29l4933J0347
$$ -97352 -78757 -3375 62999 23665 -53084 -163998 -173483 -97896 -29432 -28903 -63836 -53489
11187e3489M8061k8582m3660P182O5245J3633L8517l2893o0310p6377j7520l0680
$$ -53489 -5428 -34010 -77670 -70488 -5243 8390 46907 14014 -46296 -122673 -140193 -170873
11175a70873K7869J12412l2771k5781M6247J3683m798P9586M704k7454q4515j0069
$$ -170873 -143004 -30592 -63363 -89144 -42897 -29214 -34012 45574 50278 22824 -61691 -71760
11163g1760K4643K4241o821l3609l1508R8391K2660N648J0587q469j782j7879
$$ -71760 -47117 -22876 -29697 -63306 -94814 3577 26237 31885 42472 34003 32221 14342
11151A4342J9226K7061J8166j2417o6703l948m349N1419J7501r593J7901q088
$$ 14342 33568 60629 78795 66378 -325 -4273 -8622 42797 60298 50705 68606 60518
11139F0518Q6l3962k629m9902j0457L4057K3354l0351n4190J7170J05011L8375
$$ 60518 60604 26642 24013 -25889 -36346 -2289 21065 -9286 -63476 -46306 58705 97080
11127I7080l7226p7839j0972M8709K663o287n0478m8890l9055J3409M3830n9399
$$ 97080 59854 -17985 -28957 19752 22415 16128 -34350 -83240 -122295 -108886 -65056 -124455
11115a24455n665k050K2478N2299K8962J0292l0339m9272q500J0979L6106k1650
$$ -124455 -130120 -132170 -109692 -57393 -28431 -18139 -48478 -97750 -106250 -95271 -59165 -80815
11103h0815K6253L0848J6555L0456l815l6530k8764n0012N781Q7982K801n577
$$ -80815 -54562 -23714 -7159 23297 19482 -17048 -45812 -95824 -90043 -2061 740 -4837
11091d837n360m3583q199L1452m346m6493n7085J3177J4511o0183K5137Q1715
$$ -4837 -10197 -53780 -61979 -30527 -34873 -81366 -138451 -125274 -110763 -170946 -145809 -64094
11079f4094P1081J5514j9555m4619l5218M2506K9669n3915K4954P575l9379O7785
$$ -64094 6987 22501 2946 -41673 -76891 -34385 -4716 -58631 -33677 -26102 -65481 2304
11067B304N2518m7450L087J7171K2527l7705j084N53L7357m1426m9153m413M6960
$$ 2304 54822 7372 10459 27630 50157 12452 11368 11921 49278 7852 -41301 -45714 1246
11054A246L0884j97j3589m2904m0599K1038L1368o4880l2285J9176j2217R2296
$$ 1246 32130 31933 18344 -24560 -65159 -44121 -12753 -77633 -109918 -90742 -102959 -10663
11042a0663n5288j4012L2958M7351j5070K095l9162o6285J9084M7789k1218m1288
$$ -10663 -65951 -79963 -47005 346 -14724 -12629 -51791 -118076 -98992 -51203 -72421 -113709
11030a13709Q8758N3844o012k3707o7802L1968L3812m821o954j8115k4925N15
$$ -113709 -24951 28893 22881 -826 -68628 -36660 -2848 -7669 -14623 -32738 -57663 -57148
11018e7148K3293O3087j837n0333n2004M7775k4430l7476K8470L0764r16o3064
$$ -57148 -33855 29232 27395 -22938 -74942 -27167 -51597 -89073 -60603 -29839 -30755 -93819
11006i3819K8800J657m4824J5796P9091j4870L543n141p563Q6741N6735j0077
$$ -93819 -65019 -63362 -108186 -92390 -13299 -28169 -24626 -29767 -37330 49411 106146 96069
10994I6069j1396q3079J2541K2512K1508l9364l9563O8323m375o594K5498n1766
$$ 96069 84673 1594 14135 36647 58155 18791 -20772 47551 43176 36582 62080 10314
10982A0314n6192k3343j2282J5187J7276N2025N8370O9521M2630K48j7402q5345
$$ 10314 -45878 -69221 -81503 -66316 -49040 2985 61355 130876 173506 173754 156352 71007
10970G1007k6220m1715k4007M89n5251m1j4945L8542N439L8808K5025M2260l404
$$ 71007 44787 3072 -20935 -20446 -75697 -75738 -90683 -52141 -46702 -7894 17131 59391 55987
10957E5987j13769m8736L6457K4927J5962J608M4747J2535n3164L8754N0925L070
$$ 55987 -57782 -106518 -70061 -45134 -29172 -27564 17183 29718 -23446 15308 66233 69303
10945F9303o6196p8919J2354L4787K0093K5061j4889l7634j9744l0018o0578L038
$$ 69303 3107 -75812 -63458 -28671 -8578 16483 1594 -36040 -55784 -85802 -146380 -143342
10933a43342N0334K8702K3326L871j3366M3753N7227p0856m7072K1581M6365N5510
$$ -143342 -93008 -64306 -40980 -37109 -50475 -6722 50505 -20351 -67423 -45842 523 56033
10921E6033K9464K41L6260k6818r68k5350p3456o0671j5686L6316k8757p5336
$$ 56033 85497 85738 121998 95180 94212 68862 -4594 -65265 -80951 -44635 -73392 -148728
10909a48728M4700O7688k2860Q586K9976L2030L8909l6930o7294K4824K3133M3949
$$ -148728 -104028 -36340 -59200 -50614 -20638 11392 50301 13371 -53923 -29099 -5966 37983
10897C7983K5385l4052l8574j8314j8854J1309j4058p279M5045J7488k5081J6612
$$ 37983 63368 29316 -9258 -27572 -46426 -35117 -49175 -56454 -11409 6079 -19002 -2390
10885b390M1023J6228n5666o0432m2217m6657J1466l8807k7371k3753M1452J09694
$$ -2390 38633 54861 -805 -61237 -103454 -150111 -138645 -177452 -204823 -228576 -187124 -77430
10873g7430N183m5758J2513j6932n451K469N7281n1827o1053L8069R8419m125
$$ -77430 -72247 -118005 -105492 -122424 -127875 -125406 -68125 -119952 -181005 -142936 -44517 -48642
10861d8642q2332k3558M770K8314k4711N838P5999R4599j0808q1197J0135M6337
$$ -48642 -130974 -154532 -149762 -121448 -146159 -140321 -64322 30277 19469 -61728 -51593 -5256
10849e256K4057M1312L3979j4372j05922n5531K3520M9209k3629P545N3282j7043
$$ -5256 18801 60113 94092 79720 -26202 -81733 -58213 -9004 -32633 -25088 28194 11151
10837A1151M5177J1072m1331N9309M830q9897k5693k4902L9693J8213P0111M245
$$ 11151 56328 67400 26069 85378 90208 311 -25382 -50284 -10591 7622 77733 81978
10825H1978o7438o0885o4216k0436Q1106P3082L4374Q5337k6309m6403k4988j06133
$$ 81978 14540 -46345 -110561 -130997 -49891 23191 57565 142902 116593 70190 45202 -60931
10813f0931l7875J245J5763o86m4974J3213J5991M6657R207M2851l1281o8957
$$ -60931 -98806 -97561 -81798 -82484 -127458 -114245 -98254 -51597 -42390 461 -30820 -99777
10801i9777r182O622J150N0595M2262Q5525M7690q0796L742N2501l9423K4295
$$ -99777 -108959 -102337 -101187 -50592 -8330 77195 124885 44089 47831 100332 60909 85204
10789H5204M9668m3321J4109K906r8577j1870K0516J9703J7714l9874j0770K3378
$$ 85204 134872 91551 105660 108566 9989 -1881 18635 38338 56052 16178 5408 28786
10777B8786k6654k4454m8355l9558K4695K8578J5412L8368j6933n8948o637J9998
$$ 28786 2132 -22322 -70677 -110235 -85540 -56962 -41550 -3182 -20115 -79063 -85700 -65702
10765f5702M4890k208j9492r75j3522j0305k0591M6817R897m824N6276Q2172L312
$$ -65702 -20812 -23020 -42512 -43487 -57009 -67314 -87905 -41088 -31191 -36015 20261 102433 105745
10752A05745k7227l7408o9333M0884m1057l1457O367O5678M6509l5170J1100J9420
$$ 105745 78518 41110 -28223 12661 -28396 -59853 -53486 12192 58701 23531 34631 54051
10740E4051k3072L728j04402p933m5888J160L3435L7882J4194o0036M9849L2102
$$ 54051 30979 34707 -69695 -77628 -123516 -122356 -88921 -51039 -36845 -96881 -47032 -14930
10728a4930k4274k3213J9191P2836O1904k5866q9536N1777l6196L7740n848n1785
$$ -14930 -39204 -62417 -43226 29610 91514 65648 -23888 27889 -8307 29433 23585 -28200
10716b8200j2651q696J0649k6131j2198N4494N7944o527m6860L896K1773J9608
$$ -28200 -40851 -49547 -38898 -65029 -77227 -22733 35211 28684 -18176 -14280 7493 27101
10704B7101L8054J330N1506m849o8654J3005K9318p843n8115n0423p724J973K0101
$$ 27101 65155 66485 117991 113142 44488 57493 86811 78968 20853 -29570 -37294 -35321 -15220
10691a5220j4954O693N0520L0965l4321m5600q927J4924p746M8408M9917L6509
$$ -15220 -30174 -23481 27039 58004 23683 -21917 -30844 -15920 -23666 24742 74659 111168
10679A11168l3754m2293q0832l6298N32J3127L9942l5018L4188k735l6369j2957
$$ 111168 77414 35121 -45711 -82009 -81477 -68350 -28408 -63426 -29238 -31973 -68342 -81299
10667h1299J6767L5465j5505m1870N6889J0576m451j0119k7134O8242O4731L0767
$$ -81299 -64532 -29067 -44572 -86442 -29553 -18977 -23428 -33547 -60681 7561 72292 103059
10655A03059J2601j0514j1485o8966q7108n0655R8927J61692R340j7905m3733
$$ 103059 115660 105146 93661 24695 -62413 -113068 -14141 147551 156891 138986 95253
10644I5253p9697k1888j7514K7052m406N6312k6112m4172j9924P651K1413n52
$$ 95253 15556 -6332 -23846 3206 -1200 55112 29000 -15172 -35096 -27445 -6032 -6584
10632f584m0094r760M365k4235J316K6558M4285l0926l3869o0619Q0479J20665
$$ -6584 -46678 -56438 -52073 -76308 -74992 -48434 -4149 -35075 -68944 -129563 -49084 71581
10620G1581L8136R592p9184l7467L023L4069J12128n017r0822M9539R2039m623
$$ 71581 109717 119309 40125 2658 5681 39750 151878 146861 56039 105578 197617 192994
10608A92994j2674O548K8741K722J4810j8712n5737N6914N3501k4169m1104K9703
$$ 192994 180320 186868 215609 218331 233141 214429 158692 215606 269107 244938 203834 233537
10596B33537R9656l6595j4655R0685J16975Q5624J42821J66935J52320K98174
$$ 233537 333193 296598 281943 372628 489603 575227 718048 884983 1037303 1335477
10586A335477L80643M22655L56517L69953M04976K60614J10411R8361J18410M1666
$$ 1335477 1716120 2138775 2495292 2865245 3270221 3530835 3641246 3739607 3858017 3899683
10576C899683K0029R1591R2671l9632j99903j94752k89909l64298l59698l75556
$$ 3899683 3919712 4011303 4103974 4064342 3864439 3669687 3379778 3015480 2655782 2280226
10566B280226m05294l29171k55317k10547j07302j24262o0608l1646q2197L03
$$ 2280226 1874932 1545761 1290444 1079897 972595 848333 787725 756079 673882 674185
10556F74185J4218L2997r3230q8170l4374j108j2499m7611q8491l2975m9017n7134
$$ 674185 688403 721400 628170 540000 505626 504518 492019 444408 355917 322942 273925 216791
10544B16791n783K7891M2360R1798N2435m290q5665o1311j1640k1219p639j5681
$$ 216791 211008 238899 281259 373057 425492 421202 335537 274226 262586 241367 233728 218047
10532B18047O0070K6891l6832j9311O852N0976j0113m3748k1453N1962n4198q116
$$ 218047 278117 305008 268176 248865 255717 306693 296580 252832 231379 283341 229143 221027
10520B21027j0641l9396N0542L514r1801P003M7332p9135j22218J8455Q7753L4913
$$ 221027 210386 170990 221532 225046 133245 140248 187580 108445 -13773 4682 92435 127348
10508A27348N1186j3211l6597j153L0262l7164M672Q7583N1727n6123j6305O7742
$$ 127348 178534 165323 128726 127573 157835 120671 125343 212926 264653 208530 192225 259967
10496B59967j4665l5801O960J193O285j0686P459p2175j08364l7431m515J5827
$$ 259967 245302 209501 216461 217654 223939 213253 220712 148537 40173 2742 -1773 14054
10484A4054m061n749K425O8453K1858k3069K8784k721n5825n0979m5651K0051
$$ 14054 9993 4244 6669 75122 96980 73911 102695 99974 44149 -6830 -52481 -32430
10472c2430M5648K6512J5203n817K5144O7286N7892o4072k0341l1822o0177O126
$$ -32430 13218 39730 54933 49116 74260 141546 199438 135366 115025 83203 23026 29152
10460B9152O0592L2492M991r9391P9557J00224R355p4915o0743K9885l5136l2470
$$ 29152 89744 122236 127227 27836 107393 207617 216972 142057 81314 111199 76063 43593
10448D3593K4363O5955k8417l7124o3144L6598N2811k613M4918J4555K8032n0067
$$ 43593 67956 133911 105494 68370 5226 41824 94635 92022 136940 151495 179527 129460
10436A29460m7970k3195j884P936j7554P767K0173j979J6537n79R440l7574P015
$$ 129460 81490 58295 56411 64347 46793 54560 74733 72754 89291 88712 98152 60578 67593
10423F7593O8055J9493J05449O6555R258J564Q9524l3739L9117j2445p881l5560
$$ 67593 135648 155141 260590 327145 336403 337967 427491 393752 432869 420424 412543 376983
10411C76983M3523N496J9451O6733N0170n5474m2305o6271n7514m0497k1391L9852
$$ 376983 420506 426002 445453 512186 562356 506882 464577 398306 340792 300295 278904 318756
10399C18756m1185l223Q1885j33469R180M4606K3334j4294p385J4668j5581m5848
$$ 318756 277571 274348 356233 222764 231944 276550 299884 285590 278205 292873 277292 231444
10387B31444k2252o1435m40J3986K6168o0173j14481k8026J14629P0395J14972
$$ 231444 209192 147757 147317 161303 187471 127298 12817 -15209 99420 169815 284787
10376B84787K0008o1814m9906k0702N2508l2873k9881m1949J4754L2641j1053
$$ 284787 304795 242981 193075 172373 224881 192008 162127 120178 134932 167573 156520
10365A56520p9483o5569O973N8063L9849L6341j1156l7552o2834k9899J2014n0629
$$ 156520 77037 11468 18441 76504 116353 152694 141538 103986 41152 11253 23267 -27362
10353b7362M6044R6762j3274j8366m1340N122J05633J02942O0034J0707l2686
$$ -27362 18682 115444 102170 83804 42464 47586 153219 256161 316195 326902 294216
10342B94216J2772K0104l6722m7255k3954M2202o437r3567j802m973k1166j181
$$ 294216 306988 327092 290370 243115 219161 261363 254926 161359 159557 154584 133418 132237
10330A32237m6775J4711m1797n3926n621K1143N122o7278l1696J4461l1001l7260
$$ 132237 85462 100173 58376 4450 -1171 19972 25094 -42184 -73880 -59419 -90420 -127680
10318a27680N3793N5658P9255q609l6907n542k4840m5842k8232O5705M7817k5225
$$ -127680 -73887 -18229 61026 52417 15510 9968 -14872 -60714 -88946 -23241 24576 -649
10306f49j04746j6466n756j0541J9800N0785l9428J6680J25363O2369j9523J1151
$$ -649 -105395 -121861 -127617 -138158 -118358 -67573 -107001 -90321 35042 97411 77888 89039
10294H9039m8014J4750N5677O2812q317n6071l5109l0953m9433l2378l4980P9774
$$ 89039 41025 55775 111452 174264 165947 109876 74767 43814 -5619 -37997 -72977 6797
10282F797Q1743m804m0965q0008k8427P3391L8823K6153l2849J4211p836p219
$$ 6797 88540 83736 42771 -37237 -65664 7727 46550 72703 39854 54065 46229 39010
10270C9010K3949l0121r1228K1351M9268L7194j9471j9611n9483j27002Q4119
$$ 39010 62959 32838 -58390 -37039 12229 49423 29952 10341 -49142 -176144 -92025
10259i2025J00204N8245l3968m234Q0605l8985o7626K1167M3694k4751L34J8615
$$ -92025 8179 66424 32456 28222 108827 69842 2216 23383 67077 42326 42660 61275
10247F1275m6069k0277N7728m3226o499N3466j931l7630K7158N7157m3306l4320
$$ 61275 15206 -5071 52657 9431 2932 56398 54467 16837 43995 101152 57846 23526
10235B3526N7277j1456m9432k8520j3420O1994N7178Q5463K2914L6740n7519l9074
$$ 23526 80803 69347 19915 -8605 -22025 39969 97147 182610 205524 242264 184745 145671
10223A45671n6026l0237N2541J31352J29079J23280Q1812N7292K7751m3488K6769
$$ 145671 89645 59408 111949 243301 372380 495660 577472 634764 662515 619027 645796
10212F45796o8058j25308q3589n4818n9297j37226j09882n1665J19762M1780l7476
$$ 645796 577738 452430 368841 314023 254726 117500 7618 -44047 75715 117495 80019
10201H0019j6185k8585J7755P1743o871m7943O2264P503k6244k1995k9362k487
$$ 80019 63834 35249 53004 124747 117876 69933 132197 139700 113456 91461 62099 59612
10189E9612J8373j3485o6384m3032q1189L0279L1788J4184M9383R5972J1588m0985
$$ 59612 77985 64500 -1884 -44916 -126105 -95826 -64038 -49854 -471 95501 107089 66104
10177F6104J6883N2576P070j8676K3622r369q566J8118n696n2911n3337L3618
$$ 66104 82987 135563 142633 123957 147579 138210 129644 147762 142066 89155 35818 69436
10165F9436o4298m5794P796M4515J608m4258q0573r2588M6973K1189m2175L9240
$$ 69436 5138 -40656 -32860 11655 13263 -30995 -111568 -204156 -157183 -135994 -178169 -138929
10153a38929N8620L7170J1399q941L2188L8677L1429m7171n9458L0719Q553M5761
$$ -138929 -80309 -43139 -31740 -40681 -8493 30184 61613 14442 -45016 -14297 -5744 40017
10141D0017M5814r1534l0463k3239J2027M8275j6059J9441J3393K066m6734j9206
$$ 40017 85831 -5703 -36166 -59405 -47378 897 -15162 4279 17672 19738 -26996 -46202
10129d6202N2372j6818n2904p5299P833M8227J9315o000Q750Q6910K1604K013
$$ -46202 6170 -10648 -63552 -138851 -131018 -82791 -63476 -69476 -60726 26184 47788 49801
10117D9801j7233M6492J2963k3780j6097j0270p394N457k3241P200k9395l8810
$$ 49801 32568 79060 92023 68243 52146 41876 34482 39939 16698 23898 -5497 -44307
10105d4307N381N0171Q3l2836q383L7137R737O402l5224o7105j8553r123K9530
$$ -44307 -38926 11245 11328 -21508 -29891 7246 16983 23385 -11839 -78944 -97497 -106620 -77090
10092g7090R923L5852M4472j05978l0446R406M822l116K7350k298L766O6540j8664
$$ -77090 -67167 -31315 13157 -92821 -123267 -113861 -109039 -112155 -84805 -87103 -83337 -16797 -35461
10079c5461K6724J4088j7991m8008j2271Q2601Q3146k2114l9661M8377l1011m8241
$$ -35461 -8737 5351 -12640 -60648 -72919 9682 92828 70714 31053 79430 48419 178
10067A78L358J4512Q508k7031M4170K8173n072m987M9079N4414N2882J00094Q9160
$$ 178 3536 18048 26556 -475 43695 71868 66796 61809 110888 165302 218184 318278 407438
10054D07438M6772p5617j26873p9707L8901J2879o6519l6945n2750l5742j7837
$$ 407438 454210 378593 251720 172013 210914 223793 157274 120329 67579 31837 14000
10043A4000J7619l2999k6268J6792L3036J2762k0096p636q708L3501J5317k0929
$$ 14000 31619 -1380 -27648 -10856 22180 34942 14846 7210 -1498 32003 47320 26391
10031B6391k2286j6226J5466o554J3498L7474l2324J9678J0082K0634K7169Q3527
$$ 26391 4105 -12121 3345 -3209 10289 47763 15439 35117 45199 65833 93002 176529
10019A76529n2764q3531q0469n5204o532r02O2531J00299j3140j9518j9995q232
$$ 176529 123765 40234 -40235 -95439 -101971 -102873 -40342 59957 46817 27299 7304 -928
10007i28M6566J1508k7528l2371m3416M2521o1895K6157P8618o754l8668N8396
$$ -928 45638 57146 29618 -2753 -46169 -3648 -65543 -39386 39232 32478 -6190 52206
9995E2206J8111J752j2393J1076m6704j2145P961J0502m1618m8393J5824n463
$$ 52206 70317 72069 59676 70752 24048 11903 19864 30366 -11252 -59645 -43821 -49284
9983d9284M995J6609K8732j024o0921l1157L2849K9571k6448m3315n8549K1690
$$ -49284 -44289 -27680 1052 28 -60893 -92050 -59201 -29630 -56078 -99393 -157942 -136252
9971a36252N1610O7381J00120P108m4389j4362L5665l9548n8801J5899J7458m5963
$$ -136252 -84642 -17261 82859 89967 45578 31216 66881 27333 -31468 -15569 1889 -44074
9959d4074j5602j4837M4428R453k486K032l0863K1713J2357j12571J4051K5583
$$ -44074 -59676 -74513 -30085 -20632 -23118 -21086 -51949 -30236 -17879 -130450 -116399 -90816
9947i0816K0309j2220K4586M6388L4199n4451j4657L106P9940m9199L2721r698
$$ -90816 -70507 -82727 -58141 -11753 22446 -32005 -46662 -43556 36384 -12815 19906 10208
9935A0208m6195K3193Q6298q662n891O200j8835P997N6178N7371m7756m7234L9805
$$ 10208 -35987 -12794 73504 64842 58951 65151 46316 54313 110491 167862 120106 72872 112677
9922A12677q113o3505o5841l7448K7623K7053O138R526n2837o4439N4222N9676
$$ 112677 104564 41059 -24782 -62230 -34607 -7554 -1416 8110 -44727 -109166 -54944 4732
9910D732m0345n9989K8476L9028k017K818K2345J1867p48l4360n2926K5086k505
$$ 4732 -35613 -95602 -67126 -28098 -30115 -27297 -4952 6915 6167 -28193 -81119 -56033 -58538
9897e8538m6841Q9512L3770r01k7036M5123L4895K7021L2802m8694j0640N2102
$$ -58538 -105379 -15867 17903 17002 -10034 35089 69984 97005 129807 81113 70473 122575
9885A22575j95m3794j9916m232q5885r2660L0462P578K3486J3420k7549j9493
$$ 122575 122380 78586 58670 54438 -31447 -124107 -93645 -86067 -62581 -49161 -76710 -96203
9873i6203K0235O636P5575P600K8047O0364m9575k4815P527p244P7286L9962m850
$$ -96203 -75968 -69332 6243 13843 41890 102254 52679 27864 35391 28147 105433 145395 140545
9860A40545J09451K7293k6545j9296k7709o3379m7245n6005m3089J8382j9157
$$ 140545 249996 277289 250744 231448 203739 140360 93115 37110 -5979 12403 -6754
9849f754L79m2263O0211J264J2112L8832o837J2774N610l2293n2301K1376k3466
$$ -6754 -6375 -48638 11573 12837 24949 63781 56944 69718 75328 43035 -9266 12110 -11356
9836a1356m88L2487L453J8499q127k2255J3889J7895Q210l701n4065n4460L6946
$$ -11356 -11844 20643 24096 42595 34468 12213 26102 43997 52207 48506 -5559 -60019 -23073
9823b3073O127l5065P039N6340N8459l6816m5660k2320J6255P8504k984j2723
$$ -23073 -16946 -52011 -44972 11368 69827 33011 -12649 -34969 -18714 59790 56806 44083
9811D4083o1176l7130J3929R1134l4677J150J3094l5379j5387k5166n433j8699
$$ 44083 -17093 -54223 -40294 50840 16163 17313 30407 -4972 -20359 -45525 -50958 -69657
9799f9657L5703P0647m985j01537p2137N2794J02280k6267j4844N4710M8895n6406
$$ -69657 -33954 36693 31708 -69829 -141966 -89172 13108 -13159 -28003 26707 75602 19196
9787A9196n7373l7723L1677j7736N962m6540j7530N6064k6656m5634p881J09641
$$ 19196 -38177 -75900 -44223 -61959 -55997 -102537 -120067 -64003 -90659 -136293 -144174 -34533
9775c4533Q9224R5276j8502p6142k5892j0020P977J6662K0500n6843l141l8980
$$ -34533 54691 149967 131465 55323 29431 19411 27388 44050 64550 7707 4566 -34414
9763c4414l0254J6733M5883j0934k686n7540L213J1160j5295M6497P6201J891
$$ -34414 -64668 -47935 -2052 -12986 -15672 -73212 -69999 -58839 -74134 -27637 48564 50455
9751E0455R719P657q395n6008K0387l4415o1876O705k5323J8938O9847J229j9301
$$ 50455 60174 67831 59436 3428 23815 -10600 -72476 -65771 -91094 -72156 -2309 -1080 -20381
9738b0381K4892M9457J5195J5632Q899k7527l2347M3339k6627l3481K3354o330
$$ -20381 4511 53968 69163 84795 93694 66167 33820 77159 50532 17051 40405 34075
9726C4075J2674N1527k9966p2028q2369k857K8163J682L7064J3832k712j6166
$$ 34075 46749 98276 68310 -3718 -86087 -88944 -60781 -59099 -22035 -8203 -10915 -27081
9714b7081p273M0184j127N583L509n9797j0018P2670K3831O4643n7041r7249Q6527
$$ -27081 -34354 5830 4703 10286 13795 -46002 -56020 16650 40481 105124 48083 -49166 37361
9701C7361L6187k233m6130Q716m0991J5032L2330K8404l5449k1276k805j5334
$$ 37361 73548 71315 25185 33901 -7090 7942 40272 68676 33227 11951 9146 -6188
9689f188L3097L5176M1014N8116L6856r519q2611j0646O673O0554R831p511o924
$$ -6188 26909 62085 103099 161215 198071 188552 105941 95295 101968 162522 172353 164842 157918
9676A57918m0762q0250J4972L4210n1901l8630M3259L8668j9469J7157L6173j9002
$$ 157918 117156 36906 51878 86088 34187 -4443 38816 77484 58015 75172 111345 92343
9664I2343q3774n3198N6353M4727n3990j0809L6329L3573j2892o2013l4689j4948
$$ 92343 8569 -44629 11724 56451 2461 -8348 27981 61554 48662 -13351 -48040 -62988
9652f2988N5054J17729K3010j1582k8320J0832O0350l2031j6722M0382l9756p6442
$$ -62988 -7934 109795 132805 121223 92903 103735 164085 132054 115332 155714 115958 39516
9640C9516l932N3096Q1504J4398J1118p9177l9859M5927K5402k9595l981m9745
$$ 39516 35584 88680 170184 184582 195700 116523 76664 122591 147993 118398 114417 64672
9628F4672R9664L0903q7561j4579L7687n9665p4096M3581N871p5369K4922N992
$$ 64672 164336 195239 107678 93099 130786 71121 -2975 40606 46477 -28892 -3970 2022
9616B022J2193L3922n9776N0110N413n7006M2611K3657K1582m4839j0990K7776
$$ 2022 14215 48137 -11639 38471 43884 -13122 29489 53146 74728 29889 18899 46675
9604D6675L9945J6751j7908o9652J5296K6203K7506j7231m796q603J5407K1008
$$ 46675 86620 103371 85463 15811 31107 57310 84816 67585 62789 54186 69593 90601
9592I0601l4176j5454L6375k3917k5364o2991l7972J17234o622j8925K9572N7015
$$ 90601 56425 40971 77346 53429 28065 -34926 -72898 44336 37714 18789 48361 105376
9580A05376Q6101j7259n0967m9559L2638L245j7111L1395K3122k3115m2998l7865
$$ 105376 191477 174218 123251 73692 106330 109575 92464 123859 146981 123866 80868 43003
9568D3003m2998Q539L5599K1285L3837Q114m527k1779P1263k3095q5827l1029
$$ 43003 5 8544 44143 65428 99265 107379 102852 81073 152336 129241 43414 12385
9556A2385l9079l0781N7329P1072N2698k831k2823M9521P6816n7214j13786l540
$$ 12385 -26694 -57475 -146 70926 123624 120793 97970 147491 224307 167093 53307 49767
9544D9767l8160k4426O8760J8014J1968N0699N0283m2846o6609J842M4429L5739
$$ 49767 11607 -12819 55941 73955 85923 136622 186905 144059 77450 79292 123721 159460
9532A59460k1243n504M0712l2288n9345L3241J960n0979j11458J0371L7083K4598
$$ 159460 138217 132713 173425 141137 81792 115033 116993 66014 -45444 -35073 2010 26608
9520B6608N5984J5004j7312n1980l7997O4949L2328L785j468R272P457L2431J8063
$$ 26608 82592 97596 80284 28304 -9693 55256 87584 91369 89901 99173 106630 139061 157124
9507A57124o4646m9515j05054o9626M0034J2101O2733K3028J295p179n714l4199
$$ 157124 92478 42963 -62091 -131717 -91683 -79582 -16849 6179 7474 295 -5419 -39618
9495c9618QO4444J7974K197M3822O580q2597k4629J3305m5870q679R8107R4679
$$ -39618 -39610 24834 42808 45005 88827 95407 12810 -11819 1486 -44384 -53063 45044 139723
9482A39723K1283j19976n8854K2408l828K4745o9520m6751K1615J2687M5345J3281
$$ 139723 161006 41030 -17824 4584 756 25501 -44019 -90770 -69155 -56468 -11123 2158
9470B158Q723r2825n3142L391R282L6410N0669L9059k9652N1894K0650j8766o5221
$$ 2158 10881 -81944 -135086 -131695 -122413 -86003 -35334 3725 -25927 25967 46617 27851 -37370
9457c7370K0409O7358L4832l0528n1396o890k9980J3408n4414K8792R760J5180
$$ -37370 -16961 50397 85229 54701 3305 -3585 -33565 -20157 -74571 -45779 -36019 -20839
9445b0839j071j4119J8146Q9316K2468p0037K5002k3202J362j4979k839j3888
$$ -20839 -21910 -36029 -17883 71433 93901 23864 48866 25664 27026 12047 9208 -4680
9433d680L73O362M3757M7957m3445n7174n7475Q3622N6949J5883k1219l5626K5705
$$ -4680 -4307 2055 45812 93769 50324 -6850 -64325 19297 76246 92129 70910 35284 60989
9420F0989M0056j9358l6818j24814k1822P4893M1174J376J1223M5748J2352l4156
$$ 60989 101045 81687 44869 -79945 -101767 -26874 14300 15676 26899 72647 84999 50843
9408E0843p4962p587j550J277O044J5022J0562L1460K1639r31K9989J94k5315
$$ 50843 -24119 -31706 -33256 -31979 -25935 -10913 -351 31109 52748 51817 81806 82000 56685
9395E6685l628L7619R8095J37952J89411K76567J45148J01364m2585l15020k55274
$$ 56685 53057 90676 188771 326723 516134 792701 937849 1039213 996628 681608 426334
9384D26334j34498k3367o7440l2277L994J5300j2806n6011p1086R356q907N7854
$$ 426334 291836 268469 201029 168752 172746 188046 175240 119229 48143 57499 48592 106446
9372A06446k3071n30m425L8470L4961j2471J68m8364o0502J419o7847l0733M1381
$$ 106446 83375 82845 78420 116890 151851 139380 139548 91184 30682 32101 -35746 -66479 -25098
9359b5098K3880p01l9275J20533O4439j1400n7295M4083L6863l5321m2949n643
$$ -25098 -1218 -1919 -41194 79339 143778 132378 75083 119166 156029 120708 77759 72116
9347G2116k390K0781k3748k8938j0293J8823K1711R1971L6507J7546p9901m4661
$$ 72116 69726 90507 66759 37821 27528 46351 68062 160033 196540 214086 134185 89524
9335H9524q6160k3872j0964J1199L9258o970J537N7334r203m2024o66n207p8086
$$ 89524 3364 -20508 -31472 -20273 18985 12015 13552 70886 61683 19659 18993 13786 -64300
9322f4300j8723Q346J2845M1940K2597j9186L1746M5787j9416m2395L3520q978
$$ -64300 -83023 -74677 -61832 -19892 2705 -16481 15265 61052 41636 -759 32761 23783
9310B3783k2920K6759m9865n0058L8062O3364J923N3433k0523l8409k1300j8266
$$ 23783 863 27622 -22243 -72301 -34239 29125 31048 84481 63958 25549 4249 -14017
9298a4017O309O072L142l906N1908o494K982N9347J3003K3802j4049m136Q073
$$ -14017 -7708 -1636 1506 -2400 49508 43014 45996 105343 118346 142148 128099 123963 132036
9285A32036k2649J2705J8209J0768k8547J802Q681m8059m4389n519L7438M3117
$$ 132036 109387 122092 140301 151069 122522 124324 133005 84946 40557 35038 72476 115593
9273A15593J4572Q3776L4997n0858q3742p5520q361J7965P8985k899l7443J2307
$$ 115593 130165 213941 248938 198080 114338 38818 30457 48422 127407 124508 87065 99372
9261I9372J0279J7639J8778l400p347l2902j67l4626n667K6643R103j3430l733
$$ 99372 109651 127290 146068 142668 135321 102419 102252 67626 61959 88602 97705 84275 80542
9248H0542N5604L2582n6675m73P1681J4308o6682o6412J3520J3970j4815k9003
$$ 80542 136146 168728 112053 111580 183261 197569 130887 64475 77995 91965 77150 48147
9236D8147p8814J8377N1042M7110J8776J2224J8463l5509k3209K5176N4724k824
$$ 48147 -30667 -12290 38752 85862 104638 116862 135325 99816 76607 101783 156507 153683
9224A53683J0879l241l397N1699l4564j16944j9086K3573K8709M7073L6108L9771
$$ 153683 164562 161321 157924 209623 175059 58115 39029 62602 91311 138384 174492 214263
9212B14263O768N7812J206r5778n1464r6189j457J3207J1164K3817Q280k7613
$$ 214263 221031 278843 280049 184271 132807 36618 35161 48368 59532 83349 91629 64016
9200F4016M5286K2602j5379l3855N8040L3399n5636n6096L5444L6939o0751n4202
$$ 64016 109302 131904 116525 82670 140710 174109 118473 62377 97821 134760 74009 19807
9188A9807L7934K6918L9033N0602J8414J0867J00483L8345m5312k4681m0548P393
$$ 19807 57741 84659 123692 174294 192708 203575 304058 342403 297091 272410 231862 239255
9176B39255K4005j1281n7420l6484L2085K3753j0639k5783l8930J2737n6938R967
$$ 239255 263260 251979 194559 158075 190160 213913 203274 177491 138561 151298 94360 104327
9164A04327L0209N2838N9970L3452m7232k6199J1379K9128k4887J8728L3506K7279
$$ 104327 134536 187374 247344 280796 233564 207365 218744 247872 222985 241713 275219 302498
9152C02498M1435j5094o1581n9752J0732J7429N8445m9236j4897k1782j7210l7466
$$ 302498 343933 328839 267258 207506 218238 235667 294112 244876 229979 208197 190987 153521
9140A53521l0368L5672N9837O4584K8060J852J3264M3606n5249n4808O988l9101
$$ 153521 123153 158825 218662 283246 311306 313158 326422 370028 314779 259971 266959 227858
9128B27858m0284J5949p12p6366j9309M5051j2986k562q368J5452k4232O1035
$$ 227858 187574 203523 202811 126445 107136 152187 139201 136639 128271 143723 119491 180526
9116A80526J2390k5662M5206K9113J3253J2585j1117K4638J6897L119k5152m0698
$$ 180526 192916 167254 212460 241573 254826 267411 256294 280932 297829 300948 275796 235098
9104B35098P540N6796l6295k1875M637m222L5366O6086J7330L8158J7772l3013
$$ 235098 242638 299434 263139 241264 245901 241679 277045 343131 360461 398619 416391 383378
9092C83378k3363k4515k853Q499O5241J4035M8316J3746n6080q7534n9496K8197
$$ 383378 360015 335500 332647 341146 406387 420422 468738 482484 426404 338870 279374 307571
9080C07571K7387M2424Q0987J5212K2261q55J2263K6862M4148J63820J18437R6447
$$ 307571 334958 377382 458369 473581 495842 494987 507250 534112 578260 742080 860517 956964
9068I56964J13270K05421J20323J11318K17716L62655M22249M54371P41872J058774
$$ 956964 1070234 1275655 1395978 1507296 1725012 2087667 2509916 2964287 3706159 4764933
9058D764933J515154K101580K827822L377228L191052K163121L99691j628946
$$ 4764933 6280087 8381667 11209489 14586717 17777769 19940890 20340581 18711635
9050A8711635l175076l332828k641291j943373j310059q75249o57773n53741m65987
$$ 18711635 15536559 12203731 9562440 7619067 6309008 5433759 4775986 4222245 3756258
9041C756258l57782l12058k09095j90247j77732n8852j03470j29437r7868o3548
$$ 3756258 3398476 3086418 2877323 2687076 2509344 2450492 2347022 2217585 2119717 2056169
9031B056169r6670n4095n7444p7417o2931j32994j62870r8808o0561J2580J3556
$$ 2056169 1959499 1905404 1847960 1770543 1707612 1574618 1411748 1312940 1252379 1264959 1278515
9020A278515L1561l6659j8717o2078l6851k2748K51N9816m8494j09834l8134q430
$$ 1278515 1310076 1273417 1254700 1192622 1155771 1133023 1133274 1193090 1144596 1034762 996628 988198
9008I88198m0207o1723n3255j5620j3575l5333K6298J8333m8799K0655r439n0203
$$ 988198 947991 886268 833013 817393 803818 768485 794783 813116 764317 784972 775533 725330
8996G25330J7769j8040m9262k6116m2033J0584p624l9429j1161o28j3200N4455
$$ 725330 743099 725059 675797 649681 607648 618232 610608 571179 560018 559390 546190 600645
8984F00645K7876O111N370p2689o27o4052p8391N628k5542j1294O6622O778j7826
$$ 600645 628521 634632 640002 567313 566686 502634 424243 429871 404329 393035 459657 466435 448609
8971D48609l4662J1043m9349j2861K2252k9012p5467L1077N0291P1052m2035o8217
$$ 448609 413947 424990 375641 362780 385032 356020 280553 311630 361921 432973 390938 322721
8959C22721N7237j1741r8516k8442O6833m1684l4349k9814K3106J13017N070o3268
$$ 322721 379958 368217 269701 241259 308092 266408 232059 202245 225351 338368 343438 280170
8947B80170m0232P947N1919K0406J8258k1542k8094l2757M4086l747l9319k0435
$$ 280170 239938 247885 299804 320210 338468 316926 288832 256075 300161 296414 257095 236660
8935B36660J1970j3193K6573M4756M9867k865j0415O7560p0665m5444o7638Q748
$$ 236660 248630 235437 262010 306766 356633 353768 343353 410913 340248 294804 227166 235914
8923B35914n597M839j9715k3018P5058N3805k3214p6535l0731k0521Q621l1653
$$ 235914 230317 235156 215441 192423 267481 321286 298072 221537 190806 170285 178906 147253
8911A47253j6910M7133J8540K1940n7748k2044J8823K5934P5315K2567n7394l540
$$ 147253 130343 177476 196016 217956 160208 138164 156987 182921 258236 280803 223409 219869
8899B19869R9240J6004M6743P4620K3871L9133N4384J36843K22527R4027L4231
$$ 219869 319109 335113 381856 456476 480347 519480 573864 710707 933234 1027261 1061492
8888A061492m5179k13823o0065j28442k05644m3980M2848n0194q1816m5153Q318
$$ 1061492 1016313 802490 742425 613983 408339 364359 407207 357013 275197 230044 238362
8877B38362K4351L3101N6908l0684m5456k3097j0413K630J6448p972K7905l8243
$$ 238362 262713 295814 352722 322038 276582 253485 243072 245702 262150 254178 282083 243840
8865B43840n4919p5766m7464J9171O3746j0080J3820m8008J1157Q0960O539n1403
$$ 243840 188921 113155 65691 84862 148608 138528 152348 104340 115497 196457 202996 151593
8853A51593r20N2840k299J7863k382K3533j3411j65265p8951O4292K2023j0982
$$ 151593 150673 203513 201214 219077 216695 240228 226817 61552 -17399 46893 68916 57934
8841E7934L2993j3625P9791L9389L3336L2541j7391j6804m343o2021k7287N7576
$$ 57934 90927 77302 157093 196482 229818 262359 244968 228164 223821 161800 134513 192089
8829A92089R619N4901k4087n4738j7364m4874n0606J7286j8907J0837L2049k5986
$$ 192089 201708 256609 232522 177784 160420 115546 64940 82226 63319 74156 106205 80219
8817H0219j3455r430k4423L6209J1994O529q272L9959k1273k2697R190o3289o345
$$ 80219 66764 57334 32911 69120 81114 87643 79371 119330 98057 75360 84550 21261 14916
8804A4916J9123P3659Q3408q2879k7371M4283R921q475m4331j491L8837Q9131
$$ 14916 34039 107698 191106 108227 80856 125139 135060 126585 82254 80763 119600 208731
8792B08731q866o0308p0339p2722Q236M1713j4027L0659N1519l4876j5546K0769
$$ 208731 199865 139557 69218 -3504 4732 46445 32418 63077 114596 79720 64174 84943
8780H4943L1691k1387K5131L1094j48o2758K4925M8743m0003j5840K3566J2656
$$ 84943 116634 95247 120378 151472 151324 88566 113491 162234 122231 106391 129957 142613
8768A42613N8682J104j2505m2277q3998l3895M2287p35K243Q841n12J8699Q7945
$$ 142613 201295 202399 189894 147617 63619 29724 72011 71276 73519 82360 81848 100547 188492
8755A88492n2586k2401J8686j9085N736k4301L334j5904K7738L7586K9442J03511
$$ 188492 135906 113505 132191 113106 118842 94541 97875 81971 109709 147295 176737 280248
8743B80248N6053j6265p2695j4033M5153P712O945M0221N2499P0353K4335J2711
$$ 280248 336301 320036 247341 233308 278461 286173 293118 333339 385838 456191 480526 493237
8731D93237k2856j7039k6406p4702r7124o0135n6011N2181J5844l2151M4377M088
$$ 493237 470381 453342 426936 352234 255110 194975 138964 191145 206989 174838 219215 223303
8719B23303k3361M8396N1463M28j9186l8513L0676J8452K1089L1643J0552l8067
$$ 223303 199942 248338 299801 300229 281043 242530 273206 291658 312747 344390 354942 316875
8707C16875k2996l7960Q469O086N0326p995m9734j145P0805Q4182k3102l4388
$$ 316875 293879 255919 264388 270474 320800 312805 263071 261926 332731 416913 393811 359423
8695C59423p1840r558L7330N743P694K982N059L7981P025k511N13o1914K5772
$$ 359423 287583 278025 315355 321098 328792 331774 336833 374814 381839 379328 379841 317927 343699
8682C43699q378k569P6679P1186J6683J2550L7108K7214k7989p1487j2485k3568
$$ 343699 335321 332752 409431 480617 497300 509850 546958 574172 546183 474696 462211 438643
8670D38643K9763K8114N631M8075l0269k231j5855M9180L9812R9576P5631K9299
$$ 438643 468406 496520 502151 550226 519957 517726 501871 551051 590863 690439 766070 795369
8658G95369l024N2280Q6450l4228o2584J99q5307J97q772l2070l494o0636k3207
$$ 795369 792345 844625 931075 896847 834263 834462 749155 749352 740580 708510 705016 644380 621173
8645F21173l7754K5669O6565j1065l9010L0218J43091P2662o139K1941R105J8601
$$ 621173 583419 609088 675653 664588 625578 655796 798887 871549 865410 887351 896456 915057
8633I15057r414K131J3999Q455M8672Q7866N7342Q1067J11665Q9110O0245J02859
$$ 915057 905643 907774 921773 930228 978900 1066766 1124108 1205175 1316840 1405950 1466195 1569054
8621A569054J35383J04717J16241J42267K01059K80270K45819K61920K89046K68937
$$ 1569054 1704437 1809154 1925395 2067662 2268721 2548991 2794810 3056730 3345776 3614713
8611C614713K89346K02377J69765Q7481q8234j00954k44649l62598l28056l75232
$$ 3614713 3904059 4106436 4276201 4363682 4275448 4174494 3929845 3567247 3239191 2863959
8601B863959l28694k83637k47960k15835j30005m1414n9380j16302j00659m4033
$$ 2863959 2535265 2251628 2003668 1787833 1657828 1616414 1557034 1440732 1340073 1296040
8591A296040m2265o7279j05112j3592J927K4621R5938J50750J45789K1297P1651
$$ 1296040 1253775 1186496 1081384 1067792 1069719 1094340 1190278 1341028 1486817 1508114 1579765
8580A579765R7558j23599k61708j69898m1054R757m3639r2320j05280p5384M2201
$$ 1579765 1677323 1553724 1292016 1122118 1081064 1090821 1047182 954862 849582 774198 816399
8569H16399m232j02404n3622L805R082k1744O0665J9263q7416j4772M5220J7272
$$ 816399 812167 709763 656141 659946 669028 647284 707949 727212 639796 625024 670244 687516
8557F87516R424n8135l7143k472r578l1085k4377j5794M4317K0434k4991n796
$$ 687516 696940 638805 601662 599190 589612 558527 534150 518356 562673 583107 558116 552320
8545E52320l0035p697L6856J18120J04883J43107K45053L15684L44929K11445
$$ 552320 522285 514588 551444 669564 774447 917554 1162607 1478291 1823220 2034665
8535B034665l5056m05800m26570k37169r9959m1025n844N6661J30039J31367N1963
$$ 2034665 1999609 1593809 1167239 930070 830111 789086 783242 839903 969942 1101309 1153272
8524A153272r4462j17563p3744j39603m9881K201n9205o6676n5210K5279O6721
$$ 1153272 1058810 941247 867503 727900 678019 680220 621015 554339 499129 524408 591129
8513E91129J573m8253p2970j9093m9772o9947R597n2004L236j2702P238j3429
$$ 591129 592702 544449 471479 452386 402614 332667 342264 290260 293496 280794 288032 274603
8501B74603L0110K6511M8675O5460m9234J04271J71019J15271J32068J16814N5148
$$ 274603 304713 331224 379899 445359 396125 500396 671415 786686 918754 1035568 1090716
8490A090716o9590k03019j78643j06535l7240p6269j2694k8732n439j072J7796
$$ 1090716 1021126 818107 639464 532929 495689 419420 406726 377994 372555 371483 389279
8479C89279L6484p567L1595j4970n6176j0497L2097R843j05963r7156J2551L4405
$$ 389279 425763 418196 449791 434821 378645 368148 400245 410088 304125 206969 219520 253925
8467B53925m4476j6514j0189J2256l2616n0699J11126O4934j8093O022j0964M5116
$$ 253925 209449 192935 182746 195002 162386 111687 222813 287747 269654 275676 264712 309828
8455C09828q538n8582Q417n075Q1000O0864j1206n0868O236L4022n7857n8898
$$ 309828 301290 242708 251125 246050 327050 387914 376708 325840 332076 366098 308241 249343
8443B49343n2404j966j01938j365j651J6003q580J4336J105M238O484K4839N5595
$$ 249343 196939 194973 93035 91670 90019 106022 97442 111778 112883 117121 123605 148444 204039
8430B04039k929j0438O8349J5178k639j5151q3665L8144O653p8819l9314N9684
$$ 204039 201110 190672 259021 274199 271560 256409 172744 210888 217541 138722 99408 159092
8418A59092P388J2383j4018J4013Q5201P771n8180j3658l8254J7840L6072l9339
$$ 159092 166480 178863 164845 178858 264059 271830 213650 199992 161738 179578 215650 176311
8406A76311m4975l3941k0609J0952N4128L6512k1635K309K493L2776K5513j1812
$$ 176311 131336 97395 76786 87738 141866 178378 156743 159052 161545 194321 219834 208022
8394B08022k7239k3755J9451R7478R05n0534J9072m4803q8109j8516p163k6454
$$ 208022 180783 157028 176479 273957 274862 224328 243400 198597 110488 91972 84809 58355
8382E8355J6855K7111l2498o2451o609P6797P3644j3505l0864J8782P941m268
$$ 58355 75210 102321 69823 7372 763 77560 151204 137699 106835 125617 133558 129290
8370A29290j6818L4066j0717J3244l7705k592L0736O4576p6717m2849J5430l7937
$$ 129290 112472 146538 135821 149065 111360 108768 139504 204080 127363 84514 99944 62007
8358F2007J6155O3375M477k3000k0612n2315O4241N0350k9420O4661L4527M5118
$$ 62007 78162 141537 146014 123014 102402 50087 114328 164678 135258 199919 234446 279564
8346B79564n833q489M721q003n6457P931m8836J9114l0695K8436m9036M9883j0077
$$ 279564 273731 265242 269963 261960 205503 213434 164598 183712 153017 181453 132417 182300 172223
8333A72223j1465j3362K6730N9615P605J6239J1160j14466p1178O8806j0067N532
$$ 172223 160758 147396 174126 233741 241346 257585 268745 154279 83101 151907 141840 147372
8321A47372j8154k6273N208p4065l1849O6440Q9352k5475l7581l9192K7546M3797
$$ 147372 129218 102945 108153 34088 2239 68679 158031 132556 94975 55783 83329 127126
8309A27126n802p214J8618P3721m3188j4667Q0467J05496J02223M0201j28989
$$ 127126 121324 114110 132728 206449 163261 148594 229061 334557 436780 476981 347992
8298C47992q8262n1398l1293N8238M4019q047k286Q853N3151j01860o5765K4141
$$ 347992 259730 208332 177039 235277 279296 271249 268963 277816 330967 229107 163342 187483
8286A87483L2026Q564K1486K5317J34478K06127J38050J30366J57855L9864M581
$$ 187483 219509 228073 249559 274876 409354 615481 753531 883897 1041752 1081616 1086197
8275A086197M8081k1274m1984j28960j53106j88218l4800N0689j0498k7600m8600
$$ 1086197 1134278 1113004 1071020 942060 788954 600736 565936 616625 606127 578527 529927
8264E29927q9264K6335J4470J2785R4287k6254q0611r349j5316M3194l2016p57
$$ 529927 440663 466998 481468 494253 588540 562286 481675 472326 457010 500204 468188 467431
8252D67431m3365j0262R638J1553P5546K3741m8786j24386J6264J01587L2995
$$ 467431 424066 413804 423442 434995 510541 534282 485496 361110 377374 478961 511956
8241E11956k4546l7418P9422N639l7425R4003Q6185Q3994P0229J47819J20389
$$ 511956 487410 449992 529414 535053 497628 591631 677816 761810 832039 979858 1100247
8230A100247M4349M081k790J11595O9324Q3479L216J2341L5814K3470n429j14014
$$ 1100247 1144596 1148677 1145887 1257482 1326806 1410285 1413501 1425842 1461656 1485126 1479697 1365683
8218A365683j78359k04551o1114j26210r6140J0174l2254n2448l5896n7911m4544
$$ 1365683 1187324 982773 921659 795449 699309 709483 677229 624781 588885 530974 486430
8207D86430r108j7547J0779j6435j16436n4307P8672N1317N3005m5176J0485n296
$$ 486430 477322 459775 470554 454119 337683 283376 362048 413365 466370 421194 431679 426383
8195D26383q192k9626q8468l7820p884k2316N4902J5963J1176k6766O5354R6729
$$ 426383 418191 388565 300097 262277 254393 232077 286979 302942 314118 287352 352706 449435
8183D49435R4028N3281O2592J16038N1678J01422M3377K9980P447k604o1795l7737
$$ 449435 543463 596744 659336 775374 827052 928474 971851 1001831 1009278 1006674 944879 907142
8171I07142l4318j25680j40604r7341q3470k5333j6807q818N6040N3756O36r2364
$$ 907142 872824 747144 606540 509199 425729 400396 383589 374771 430811 484567 485203 392839
8159C92839m0348k1678J1007k1559o1702M210L8501p732k5222J7531J1849l1402
$$ 392839 352491 330813 341820 320261 258559 262769 301270 293538 268316 285847 297696 266294
8147B66294m7730n4373k1143m2066L2562L7272N7915n429m9659l3556N9412J04013
$$ 266294 218564 164191 143048 100982 133544 170816 228731 223302 173643 140087 199499 303512
8135C03512J3937l8539J1389O28k772k7767k4893q1583q767M2327m4668m7350
$$ 303512 317449 278910 290299 290927 288155 260388 235495 153912 145145 187472 142804 95454
8123I5454L0732R1039P5441k2474n6909k5436j1639K1235j9727k2744n5968j5652
$$ 95454 126186 217225 292666 270192 213283 187847 176208 197443 177716 154972 99004 83352
$$ [...]
##END NTUPLES=NMR SPECTRUM
##END=
