##TITLE=Analysis number 316092
Compound Code cc 44509
Book Reference 464/8/1
Project Code adrs
Chemist Name chrisr
##JCAMPDX= 6.0         $$ Bruker NMR JCAMP-DX V2.0
##DATA TYPE= NMR SPECTRUM
##DATA CLASS= NTUPLES
##ORIGIN= Bruker BioSpin GmbH
##OWNER= NMR
$$ XWIN-NMR		Version 3.5
$$ Thu Dec 15 15:00:45 2005 GMT Standard Time (UT+0h)  MAYBRIDGE\NMR@NMR_250MHZ
##.OBSERVE FREQUENCY= 250.131544655141
##.OBSERVE NUCLEUS= ^1H
##.ACQUISITION MODE= SIMULTANEOUS (DQD)
##.ACQUISITION SCHEME= undefined
##.AVERAGES= 16
##.DIGITISER RES= 18
##SPECTROMETER/DATA SYSTEM= dpx250
##.PULSE SEQUENCE= zg30
##.SOLVENT NAME= CDCl3
##.SHIFT REFERENCE= (INTERNAL, CDCl3, 0, 16.522)
##AUDIT TRAIL= $$ (NUMBER, WHEN, WHO, WHERE, WHAT)
$$ ##TITLE= Audit trail, XWIN-NMR		Version 3.5
$$ ##JCAMPDX= 5.01
$$ ##ORIGIN= Bruker BioSpin GmbH
$$ ##OWNER= NMR
$$ C:\u/data/dgb/nmr/ADRS/13910/pdata/1/auditp.txt
$$ ##AUDIT TRAIL=  $$ (NUMBER, WHEN, WHO, WHERE, WHAT)
(   1,<2005-12-15 15:00:00.96 +000>,<MAYBRIDGE\NMR>,<NMR_250MHZ>,
      <created by zg, POWCHK disabled, PULCHK disabled
       configuration hash MD5:
       62 19 C7 07 E1 42 D1 B7 37 6C 3D D0 77 39 F9 E6
       data hash MD5: 64K
       0B FF F5 E5 49 82 94 EF C4 0A E9 1E 49 74 C5 74>)
(   2,<2005-12-15 15:00:21.26 +000>,<MAYBRIDGE\NMR>,<NMR_250MHZ>,
      <Start of raw data processing
       ef LB = 0.3 FT_mod = 6 PKNL = 1 SI = 32K 
       data hash MD5: 32K
       69 F9 D9 76 E5 E9 90 47 C5 CE 0E 34 F2 C6 6F 25>)
(   3,<2005-12-15 15:00:26.38 +000>,<MAYBRIDGE\NMR>,<NMR_250MHZ>,
      <apk 
       data hash MD5: 32K
       61 46 31 3D 51 CD 48 3F 69 3B D4 62 6E C8 59 E6>)
(   4,<2005-12-15 15:00:27.92 +000>,<MAYBRIDGE\NMR>,<NMR_250MHZ>,
      <abs ABSG = 5 
       data hash MD5: 32K
       41 16 08 03 E7 E8 75 50 14 7C 38 B0 88 DF D8 57>)
$$ ##END=
$$ 
$$ hash MD5
$$ 6B E1 5C 8E E8 F6 9F 56 C6 A7 1E 0B 82 49 AA 08
##$RELAX= 
##$RELAX= 
##$RELAX= 
##$RELAX= 
##$RELAX= 
##$RELAX= 
##$RELAX= 
$$ Bruker specific parameters
$$ --------------------------
##$DU= <C:\u>
##$EXPNO= 13910
##$NAME= <ADRS>
##$PROCNO= 1
##$TYPE= <nmr>
##$USER= <dgb>
##$AMP= (0..31)
100 100 100 100 100 100 100 100 100 100 100 100 100 100 100 100 100 100 
100 100 100 100 100 100 100 100 100 100 100 100 100 100 
##$AQSEQ= 0
##$AQ_mod= 3
##$AUNM= <au_zg>
##$AUTOPOS= <31 >
##$BF1= 250.13
##$BF2= 250.13
##$BF3= 250.13
##$BF4= 250.13
##$BF5= 500.13
##$BF6= 500.13
##$BF7= 500.13
##$BF8= 500.13
##$BYTORDA= 1
##$CFDGTYP= 0
##$CFRGTYP= 5
##$CHEMSTR= <none>
##$CNST= (0..31)
1 1 145 1 1 1 1 1 1 1 1 1 1 1 1 1 1 1 1 1 1 1 1 1 1 1 1 1 1 1 1 1 
##$CPDPRG= <>
##$CPDPRG1= <>
##$CPDPRG2= <>
##$CPDPRG3= <>
##$CPDPRG4= <mlev>
##$CPDPRG5= <mlev>
##$CPDPRG6= <mlev>
##$CPDPRG7= <mlev>
##$CPDPRG8= <mlev>
##$CPDPRGB= <>
##$CPDPRGT= <>
##$D= (0..31)
0 1 0 0 0 0 0 0 0 0.06 0 0 0 0 0 0 0.0002 0 0 0 0 0 0 0 0 0 0 0 0 0 0 
0 
##$DATE= 1134658798
##$DBL= (0..7)
120 120 120 120 120 120 120 120 
##$DBP= (0..7)
150 150 150 150 150 150 150 150 
##$DBP07= 0
##$DBPNAM0= <>
##$DBPNAM1= <>
$$ [...]
##$SUBNAM7= <"">
##$SUBNAM8= <"">
##$SUBNAM9= <"">
##$SW= 20.6930455092707
##$SWIBOX= (0..15)
0 0 3 0 0 0 0 0 0 0 0 0 0 0 0 0 
##$SW_h= 5175.983436853
##$TD= 65536
##$TD0= 1
##$TE= 294.16
##$TE2= 300
##$TE3= 300
##$TEG= 300
##$TL= (0..7)
0 120 120 120 120 120 120 120 
##$TP= (0..7)
150 150 150 150 150 150 150 150 
##$TP07= 0
##$TPNAME0= <>
##$TPNAME1= <>
##$TPNAME2= <>
##$TPNAME3= <>
##$TPNAME4= <>
##$TPNAME5= <>
##$TPNAME6= <>
##$TPNAME7= <>
##$TPOAL= (0..7)
0.5 0.5 0.5 0.5 0.5 0.5 0.5 0.5 
##$TPOFFS= (0..7)
0 0 0 0 0 0 0 0 
##$TUNHIN= 0
##$TUNHOUT= 0
##$TUNXOUT= 0
##$USERA1= <user>
##$USERA2= <user>
##$USERA3= <user>
##$USERA4= <user>
##$USERA5= <user>
##$V9= 5
##$VALIST= <valist>
##$VCLIST= <CCCCCCCCCCCCCCC>
##$VD= 0
##$VDLIST= <DDDDDDDDDDDDDDD>
##$VPLIST= <PPPPPPPPPPPPPPP>
##$VTLIST= <TTTTTTTTTTTTTTT>
##$WBST= 1024
##$WBSW= 4
##$XGAIN= (0..3)
0 0 0 0 
##$XL= 0
##$YL= 0
##$YMAX_a= 431808
##$YMIN_a= -454736
##$ZGOPTNS= <>
##$ZL1= 120
##$ZL2= 120
##$ZL3= 120
##$ZL4= 120
##$ABSF1= 16.522
##$ABSF2= -4.171173
##$ABSG= 5
##$ABSL= 3
##$ALPHA= 0
##$AQORDER= 0
##$ASSFAC= 0
##$ASSFACI= 0
##$ASSFACX= 0
##$ASSWID= 0
##$AUNMP= <proc_1d>
##$AZFE= 0.1
##$AZFW= 0.1
##$BCFW= 0
##$BC_mod= 0
##$BYTORDP= 0
##$COROFFS= 0
##$CY= 12.5
##$DATMOD= 1
##$DC= 0
##$DFILT= <>
##$DTYPP= 0
##$F1P= 14.0000005364418
##$F2P= -0.99999901652339
##$FCOR= 0.5
##$FTSIZE= 32768
##$FT_mod= 6
##$GAMMA= 0
##$GB= 0
##$INTBC= 1
##$INTSCL= 1
##$ISEN= 128
##$LB= 0.3
##$LEV0= 0
##$LPBIN= 0
##$MAXI= 10000
##$MC2= 0
##$MEAN= 0
##$ME_mod= 0
##$MI= 0
##$NCOEF= 0
##$NC_proc= -5
##$NLEV= 6
##$NOISF1= 0
##$NOISF2= 0
##$NSP= 0
##$NTH_PI= 0
##$NZP= 0
##$OFFSET= 16.522
##$PC= 1
##$PHC0= 84.9211
##$PHC1= 6.890933
##$PH_mod= 1
##$PKNL= yes
##$PPARMOD= 0
##$PSCAL= 4
##$PSIGN= 0
##$REVERSE= no
##$SF= 250.13
##$SI= 32768
##$SIGF1= 0
##$SIGF2= 0
##$SINO= 400
##$SIOLD= 32768
##$SREGLST= <1H.CDCl3>
##$SSB= 0
##$STSI= 32768
##$STSR= 0
##$SW_p= 5175.98343685301
##$SYMM= 0
##$S_DEV= 0
##$TDeff= 65536
##$TDoff= 0
##$TI= <Analysis number 999999
Compound Code 99
Book Reference 9
Project Code 9>
##$TILT= no
##$TM1= 0
##$TM2= 0
##$TOPLEV= 0
##$USERP1= <user>
##$USERP2= <user>
##$USERP3= <user>
##$USERP4= <user>
##$USERP5= <user>
##$WDW= 1
##$XDIM= 32768
##$YMAX_p= 383463233
##$YMIN_p= -657466
$$ End of Bruker specific parameters
$$ ---------------------------------
##NTUPLES= NMR SPECTRUM
##VAR_NAME=  FREQUENCY,     SPECTRUM/REAL,   SPECTRUM/IMAG
##SYMBOL=    X,             R,               I
##VAR_TYPE=  INDEPENDENT,   DEPENDENT,       DEPENDENT
##VAR_FORM=  AFFN,          ASDF,            ASDF
##VAR_DIM=   32768,         32768,           32768
##UNITS=     HZ,            ARBITRARY UNITS, ARBITRARY UNITS
##FACTOR=    0.157963299565203, 1,           1
##FIRST=     4132.6476996994, 0,             0
##LAST=      -1043.33573715361, 0,           0
##MIN=       -1043.33573715361, -657466,     0
##MAX=       4132.6476996994, 383463233,     0
$$ Real data points
##PAGE= N=1
##DATA TABLE= (X++(R..R)), XYDATA
$$ [...]
19153D07720j824J08773j44522j39589J5352l1617Q929n7662l6427k7917m220
19142I6996p973J58895Q5751o5899M3363l4058j40371p5261j0844m758O0364J34687
19130B40892q5869n292P6629j9281K7034M1841J14228p7483l6600k9177j43462
19119A03460l7874J50679O0037l4584n6786r2734K1247N4301m8325j2359L9380
19108A46442R5513Q1525K085q6201J51810P7184j9440K1526j3767M7824J14624
19097F19125l4511M4727M7459j0071L1964J4787m2273J5598M0501Q4698N8648
19086H70652L271j17992M1944j66765n7356m738m697q01l7628k2787m4824J08761
19074E67040j31824k15141j47383q2270J11337K0584L433m8964J0504P9454J35733
$$ y = [407720, 405896, 514669, 370147, 230558, 245910, 214293, 223222, 165560, 129133, 101216, 96996, 89023, 247918, 333669, 267770, 311133, 277075, 136704, 61443, 50599, 45841, 106205, 240892, 155023, 149731, 226360, 207079, 234113, 275954, 390182, 312699, 276099, 246922, 103460, 65586, 216265, 276302, 241718, 184932, 92198, 113445, 167746, 119421, 107062, 146442, 241955, 323480, 325565, 239364, 391174, 468358, 448918, 470444, 456677, 504501, 619125, 584614, 629341, 676800, 666729, 698693, 713480, 671207, 686805, 727306, 812004, 870652, 873923, 755931, 797875, 631110, 573754, 569016, 564319, 563518, 525890, 503103, 458279, 567040, 435216, 220075, 72692, -9578, 101759, 122343, 125776, 76812, 87316, 166770, 302503]
19063C02503J08529n2292j83391j623K46651K1347Q890N9083O1786j26413M8653
19052D93723J04734J38287L8232n4590p0145N4595Q9157J6000j5609K6635P0482
19041H91501J22798K3247J0165R436j80403j68259j4587Q2347l4908K0257j79537
19030E82057p0735k2217q5188j36472M0631N146q8675n2933Q153k5880P2480Q1171
19018C07538n1917J38397J47002j7797o4160M0450j68267o490j1348o1843l9228
19007B12337O0763Q7125j65547k4260M3851P5142k22948k4439K11442N8387J2900
18996C24753j5905k6605j10999j72149l2231O285J1300P6475m4286N5943J37254
18985B09835j4191p5137q6201P4444R3274q1299j33509j12744J35239K9914n8632
$$ y = [302503, 411032, 358740, 175349, 173726, 420377, 441724, 450614, 509697, 571483, 445070, 493723, 598457, 736744, 774976, 720386, 650241, 704836, 793993, 809993, 794384, 821019, 891501, 1014299, 1037546, 1047711, 1057147, 876744, 708485, 693898, 776245, 741337, 761594, 582057, 511322, 489105, 403917, 267445, 308076, 313222, 224547, 171614, 179767, 153887, 226367, 307538, 255621, 394018, 541020, 523223, 459063, 499513, 331246, 324756, 313408, 251565, 212337, 273100, 360225, 194678, 170418, 214269, 289411, 66463, 42024, 253466, 311853, 324753, 308848, 282243, 171244, -905, -33136, -26851, -15551, 60924, 16638, 72581, 209835, 195644, 120507, 34306, 108750, 202024, 120725, -12784, -125528, 9711, 39625, -19007]
18974a9007r0727J1157N3648N5303O5821j15077j41561L2530J18930J68978J12620
18963B52615N0396n0402j06662M7322P4658M1782K9406q927M6918j7685J16672
18952D76093M1503p9739L0884R226R852r768j32807m8576j53495n3676R4607J88174
18940C72278K0968j46426N1384O4181P7781Q2090j74624J0709j0910k5060j1191
18929C11180p5156l348J13382p8341j51706J30958J47716j45441m0030J0539R4875
18918C14628k4449J22942j35056j12147n2785r756p1622K6075J73531j06182j47108
18907b1929L5995O8288J24096j6749r1148L6286j08479l2271J18149K3631p542
18896A28327R6528M6248m6493R6720K6187j7760p1356P4771L5925j828K8480M6719
$$ y = [-19007, -109734, -98577, -44929, 10374, 76195, -38882, -180443, -147913, -28983, 139995, 252615, 303011, 252609, 145947, 193269, 267927, 309709, 339115, 330188, 377106, 359421, 476093, 517596, 437857, 468741, 477967, 487819, 478051, 345244, 296668, 143173, 89497, 184104, 372278, 393246, 246820, 298204, 362385, 440166, 522256, 347632, 358341, 347431, 322371, 311180, 236024, 232676, 346058, 267717, 116011, 246969, 394685, 249244, 209214, 219753, 314628, 290179, 413121, 278065, 165918, 113133, 103377, 31755, 57830, 231361, 125179, -21929, 14066, 82354, 206450, 189701, 98553, 134839, 26360, -5911, 112238, 135869, 128327, 224855, 271103, 224610, 321330, 347517, 329757, 258401, 333172, 369097, 367269, 395749, 442468]
18884D42468q754O5173J3778O4511M6551L3269l8514m2518o691j22443J9401l02095
18872A64136j57623O43J30636J20942l8792k27230l0529N7515J34155P8418j09707
18861A22564N742l4323l5455N4585l5421R3297N2288Q1152N4481n7783j21029
18850A80098J05995M6374P9506M5671K1958Q6719M551m8695o1587Q632J3823o5964
18838D17081j16349J081Q939p0557M3347M4586q6788R2585P358q2848O7147j17366
18826B08216n8842N1699J27565j19166n690N6915P3161J68495K37808O5777j4730
18815G91208p9512p1488o2025P0131J6264K5415R5331R1376Q1256K7306J8639
18804A003901Q1371J68491J97293J37841J79949K29873J80447J34127m2604j88838
$$ y = [442468, 433714, 498887, 512665, 577176, 623727, 656996, 618482, 575964, 569273, 446830, 466231, 164136, 6513, 7156, 137792, 258734, 219942, -7288, -37817, 19698, 153853, 232271, 122564, 128306, 93983, 58528, 113113, 77692, 170989, 223277, 304429, 358910, 301127, 180098, 286093, 332467, 411973, 457644, 479602, 566321, 570872, 522177, 460590, 469222, 483045, 417081, 300732, 301813, 310752, 240195, 283542, 328128, 241340, 333925, 341283, 258435, 325582, 208216, 149374, 201073, 328638, 209472, 203782, 260697, 333858, 502353, 740161, 805938, 791208, 711696, 640208, 578183, 648314, 664578, 689993, 785324, 876700, 957956, 985262, 1003901, 1085272, 1253763, 1451056, 1588897, 1768846, 1998719, 2179166, 2313293, 2270689, 2081851]
18794B081851q9326k34473j26022j16133k53565k03915j02886j73406l3078r0157
18784F58890m7724j3950J42212J1538q779j62604l4452l074k4140J8916k2519
18773E14314J9835R8116O9270r4401n1613J48365K20699L51924N91604N09503
18763B377616P5328K3169L31910J87784k24097k58404n0194K59964K60155O6770
18753C050001K32270L043j29577n5077n0692k24099k33110j33875j12119r4409
18743B252356j27238j53080O502J62644K00811M9998q5546j09549L8827J55981
18733B391706P4591K49639K94062J50571Q1396J66091P9119k7135r9341N7503
18723C418202Q6625J53372K35224J29538m1056p9224K53719N79918L76223K96788
$$ y = [2081851, 1992525, 1758052, 1632030, 1515897, 1262332, 1058417, 955531, 782125, 749047, 658890, 611166, 597216, 739428, 750966, 742187, 579583, 545131, 542057, 517917, 536833, 514314, 534149, 632265, 701535, 607134, 555521, 703886, 924585, 1276509, 1868113, 2377616, 2452944, 2476113, 2808023, 2995807, 2771710, 2513306, 2463112, 2723076, 2983231, 3050001, 3282271, 3285314, 3155737, 3100660, 3049968, 2825869, 2592759, 2458884, 2346765, 2252356, 2125118, 1972038, 1978540, 2141184, 2341995, 2391993, 2306447, 2196898, 2235725, 2391706, 2466297, 2715936, 3009998, 3160569, 3241965, 3408056, 3487175, 3460040, 3360699, 3418202, 3504827, 3658199, 3893423, 4022961, 3981905, 3902681, 4156400, 4736318, 5112541, 5409329]
18713E409329L66826M88149M90907L83511N69527P90963R41107J224667J576411
18704A2241397K268177L111949M722492O970253P716447P462465R841499J4262092
18696F8596771J3801307P449004N731641J0365287J1024968M871572L669104Q215919
18688A33725573J0627965J0227750J3991276J7765607J4011129P082431P108690
18681B14540421Q025665J833905p823543j0464053r553033r693597q207162m163071
18673A74495532o003744j0057455o581994p22551n220162j4438171j5121271j1119262
18665A05230922j1627523j5161797j4620290j1108032q422069p349203o257314
18658C0684694m500607l254364k518202k023351j669964j448905j269517j183462
$$ y = [5409329, 5776155, 6264304, 6755211, 7138722, 7708249, 8499212, 9440319, 10664986, 12241397, 14509574, 17621523, 22344015, 29314268, 37030715, 44493180, 54334679, 68596771, 82398078, 89847082, 95578723, 105944010, 116968978, 121840550, 125509654, 133725573, 144353538, 154581288, 168572564, 186338171, 200349300, 207431731, 214540421, 222566086, 224399991, 216576448, 206112395, 196559362, 186865765, 178658603, 174495532, 168491788, 158434333, 151852339, 151129788, 145909626, 131471455, 116350184, 105230922, 93603399, 78441602, 63821312, 52713280, 44291211, 36942008, 30684694, 26184087, 22929723, 20411521, 18388170, 16718206, 15269301, 13999784, 12816322]
18650A2816322j030798r19382q34908p32103p57622p21769o33372n57657l02037
18641F326674l46895j99412j53516l69605k50880j78709j93107o6516o3219j19901
18631D384914r4803p8210J9796J14971K61121J80471J43345J50916L4288J25582
18621E242391J09051J38378J25786K21830K03837K02339L36886M02853M92639
18612G475990O03767O49554J143004J652950K577098M211666O751575Q580792
18604C3646396Q832493J0160881R778905N076139K310333J900221J470173J611784
18596G4787325K502968N620143Q823628O663106L220187K674103M34139n339831
18588I9385768q460652p510523o296318n361005l828176q41842R69396j363744
$$ y = [12816322, 11785524, 10866142, 10031234, 9299131, 8541509, 7819740, 7186368, 6628711, 6326674, 5979779, 5780367, 5626851, 5257246, 5006366, 4827657, 4634550, 4568034, 4504815, 4384914, 4290111, 4211901, 4231697, 4346668, 4607789, 4788260, 4931605, 5082521, 5116809, 5242391, 5351442, 5489820, 5615606, 5837436, 6041273, 6243612, 6580498, 6983351, 7475990, 8079757, 8729311, 9872315, 11525265, 14102363, 18314029, 25065604, 33646396, 42478889, 52639770, 62418675, 67494814, 69805147, 71705368, 73175541, 74787325, 77290293, 82910436, 91734064, 98397170, 101617357, 104291460, 104725599, 99385768, 90925116, 83414593, 77118275, 71757270, 67929094, 67087252, 68056648, 66692904]
18580F6692904l701086m410123n862264p554181p623249o375171n304416m139884
18572B1722530k769342j771947j210562p69726n31577k79796j57909J15252K79282
18563A4626205O37809J181462J782576L146101N472506Q756934J1092826J1325758
18555E8022177J3042392J3477341P394496K839117K432501K289509J816791K580290
18547A03894614P061159J2344172J0417463N239599M673594L317715n010935j1021700
18539A30915681j0152573q361171p705135o084504k224251J573477q74007n092393
18531I1995124o521249q224425j0894994j2137294j0577750q549918o956591n391945
18523B2740958l827159k599922j785568j505701j237661r63195q88542r00824
$$ y = [66692904, 62991818, 58581695, 52719431, 45165250, 37542001, 31166830, 25862414, 21722530, 18953188, 17181241, 15970679, 15200953, 14669376, 14389580, 14231671, 14346923, 14626205, 15264014, 16445476, 18228052, 21374153, 26846659, 35603593, 46696419, 58022177, 71064569, 84541910, 91936406, 94775523, 97208024, 99497533, 101314324, 103894614, 110955773, 123299945, 133717408, 138957007, 143630601, 146948316, 141937381, 130915681, 120763108, 112401937, 104696802, 98612298, 96388047, 97961524, 97087517, 91995124, 85473875, 77249450, 66354456, 54217162, 43639412, 35089494, 28132903, 22740958, 18913799, 16313877, 14528309, 13022608, 11784947, 10821752, 9933210, 9032386]
18515I032386o75234n16660m55165n44152m84407l49339k88538l50822l95366
18506D972703l50030j69143l02516k04519k11200j91366k75899j54792j60219
18497B953019j23971r6682r1402Q1168K2009j50644k67228k45623j334K3628q604
18486B094336j53540j77038o6407p6781j53842q2744m5430j8426j66858k36488
18476I16782k4507o207m2328q0329M7895q2853m7523J75132m2758P7789J29880
18465A020973Q8248J02304q159l5915m3915q8737k6590r2256j21116K3529J698
18454H20064p5519O7823N7861M0178L1061p4032j12064N6739J08189J85034J20664
18443A225998p5289M1781k5695j11566p2314k0122O1499J94899Q5805R1880J69620
$$ y = [9032386, 8357152, 7840492, 7385327, 6841175, 6356768, 6007429, 5718891, 5368069, 4972703, 4622673, 4453530, 4151014, 3946495, 3735295, 3543929, 3268030, 3113238, 2953019, 2829048, 2732366, 2640964, 2722132, 2744141, 2593497, 2326269, 2080646, 2079312, 2102940, 2094336, 1940796, 1763758, 1697351, 1620570, 1466728, 1383984, 1338554, 1320128, 1153270, 916782, 892275, 886068, 843740, 763411, 811306, 728453, 680930, 856062, 813304, 891093, 1020973, 1109221, 1211525, 1203366, 1167451, 1123536, 1034799, 1008209, 915953, 794837, 818366, 820064, 744545, 812368, 870229, 910407, 941468, 867436, 755372, 812111, 920300, 1105334, 1225998, 1150709, 1192490, 1166795, 1055229, 982915, 962793, 1024292, 1219191, 1304996, 1396876, 1566496]
18432A566496O7450Q9909K6376j63206k19487j4778k024n1365K30952P0171N2128
18421A652622O1796p585l0780r8711q2724o2605J95107k8914k6077m6583q7748
18410A437798k29296P108M9925j04509j9605m0766P3777O8029Q7552l4393k8217
18399A267403q889m6151r2883q9222L6921K32054K47439K44987m188m019N1261
18388A834713j0986q2158j5642k8313j08417J55492J90495l9057j84640L6197
18378A747684J53581j6306l0546J32708K72877L16889L60736M81405L30060M41651
18368D190739K21273J56676K68887J52341M9566O8969N6844J48848J5217K6806
18358E356166n6740J43600J30504p029R6089K92140N28430R21086J406353K032978
$$ y = [1566496, 1633946, 1723855, 1750231, 1587025, 1367538, 1352760, 1350736, 1299371, 1530323, 1600494, 1652622, 1714418, 1706833, 1676053, 1577342, 1494618, 1432013, 1627120, 1598206, 1572129, 1525546, 1437798, 1208502, 1215610, 1265535, 1161026, 1141421, 1100655, 1174432, 1242461, 1330013, 1295620, 1267403, 1258514, 1212363, 1119480, 1030258, 1067179, 1299233, 1546672, 1791659, 1787471, 1783452, 1834713, 1823727, 1741569, 1725927, 1697614, 1589197, 1744689, 1935184, 1896127, 1711487, 1747684, 1901265, 1884959, 1854413, 1987121, 2259998, 2576887, 2937623, 3419028, 3749088, 4190739, 4412012, 4568688, 4837575, 4989916, 5039482, 5108451, 5165295, 5314143, 5329360, 5356166, 5299426, 5443026, 5573530, 5566501, 5662590, 5954730, 6483160, 7404246, 8810599, 10843577]
18348A0843577L083021M893139Q370720J2872730J6238252J7374261J4448485
18341H8124185J1343699P844147L169665m741461j1181570j4504349j4508824
18334F5545492j3400795j1897165r705886o993132m506431k826059j967933j665017
18326A2583074j218143r36969p38402o38576k79848K23864K31338K66059L97920
18317I890317K80494K11132J30023J3699k31122l65472k10284n2180J09007L67558
18307A0143172O61331P74773J184908J777610K352660L318382M841997P062262
18299C2117095J1026645J8035812K7850506L5765899L8338382L2093736K5198804
18292B20426879J7727013P046654j0747772k5634284l2723113l2803369l0553680
$$ y = [10843577, 13926598, 18819737, 27190457, 40063187, 56301439, 73675700, 88124185, 99467884, 107312031, 110481696, 105740235, 94558665, 80054316, 65545492, 52144697, 40247532, 30541646, 23548514, 19042083, 16216024, 14248091, 12583074, 11364931, 10427962, 9689560, 9050984, 8771136, 8995000, 9226338, 9492397, 9890317, 10170811, 10381943, 10511966, 10525665, 10294543, 9929071, 9718787, 9666607, 9775614, 10143172, 10804503, 11579276, 12764184, 14541794, 16894454, 20212836, 25054833, 32117095, 43143740, 61179552, 89030058, 124795957, 163134339, 195228075, 220426879, 238153892, 245200546, 234452774, 208818490, 176095377, 143292008, 112738328]
18285A12738328k6627076k1172948j5327514j0175223o715433m505233l263123
18278B4951778k446795j778192j085859p11820l42411J6993J50484M5476j31925
18269A8667729k49259k87576l57579p13276r11647p74527p80969o01275j31852
18260A3859769J78722L05727M65076O07920J138539J697167K383668L484870M874849
18251B8996307O963484J0981018J7402661K3294362K6048702K3485331K1428719
18244A58600584K2013543K6493461L1964602K5836152m342285k6385749k6658818
18237B07521490k0148086j4219273K476323K6676822J8248451j3417119k5165283
18230A81973325k1859993k3463656k9627118k5822869j5479015p633770k967107
$$ y = [112738328, 86111252, 64938304, 49610790, 39435567, 32720134, 28214901, 24951778, 22504983, 20726791, 19640932, 18929112, 18586701, 18603694, 18754178, 18799654, 18667729, 18418470, 18130894, 17773315, 17060039, 16148392, 15373865, 14592896, 13991621, 13859769, 14038491, 14344218, 14809294, 15417214, 16555753, 18252920, 20636588, 24121458, 28996307, 35959791, 46940809, 64343470, 87637832, 113686534, 137171865, 158600584, 180614127, 207107588, 239072190, 264908342, 260566057, 234180308, 207521490, 187373404, 173154131, 175630454, 202307276, 220555727, 207138608, 181973325, 160113332, 136649676, 107022558, 81199689, 65720674, 58086904, 55119797]
18223E5119797N40893M784257J1839971K4947092M2592657L8987560P637037j1110240
18215A75339024r770140n193750l59491J8400849L6870519J4909442j8550099
18208B11646354k6656483k3777020k8599127l3932614k7351247j6765110r843569
18201D4721184o236938m152739k952581k112095j609143j421101j219967r43551
18193B4073069m02520j09815L8802R6666M7748K90835N79312J148623J778297
18184B7541017K480938K895372M123644O615591J0541582J6779652K4701827L7241345
18176A32920968N3848226N0980386K0785231l855463p417782j457986L723927
18169B49527507J4316893K4955691J4256136l331576j0795961j2701117j8318438
$$ y = [55119797, 55660690, 60444947, 72284918, 97232010, 139824667, 178812227, 186449264, 175339024, 165568884, 160375134, 160015643, 178416492, 215287011, 230196453, 211646354, 184989871, 161212851, 132613724, 98681110, 71329863, 54564753, 44721184, 38484246, 34331507, 31378926, 29266831, 27657688, 26236587, 25016620, 24073069, 23670549, 23560734, 23599536, 23696202, 23743950, 24034785, 24614097, 25762720, 27541017, 30021955, 32917327, 37040971, 43656562, 54198144, 70977796, 95679623, 132920968, 186769194, 237749580, 258534811, 254679348, 247261566, 245803580, 249527507, 263844400, 288800091, 303056227, 299724651, 288928690, 276227573, 257909135]
18162B57909135k5485494k3981270j6662474j2682616j4403835j2805483o039222
18155A45848741l825061r295456j1114219p193069o047405r255554r633039n061665
18147H4423273O86246P868697K2086424M4787511N2261912K1458675j0644646
18140B22928092j6802654j2690223j1782059k190482J7843323J4423350j0708459
18133B01020888k2078901j9226570j8749842k2676181k1078263j2384090l379425
18126H1447616J103516k90724j847291P13484L646167K441341J502271L282222
18118I1998602N021740L912027K787384K145969J54772j056848K55834K119733
18110A07339213L751772J2004248L4819501P1771238N8658991j2422341l5229230
$$ y = [257909135, 232423641, 208442371, 191779897, 179097281, 164693446, 151887963, 145848741, 142023680, 132728224, 121614005, 114420936, 108373531, 99117977, 89484938, 84423273, 85109519, 92978216, 115064640, 159852151, 212114063, 233572738, 222928092, 206125438, 193435215, 181653156, 179462674, 197305997, 211729347, 201020888, 178941987, 159715417, 140965575, 118289394, 97211131, 84827041, 81447616, 82551132, 82260408, 80413117, 81126601, 84772768, 87214109, 88716380, 91998602, 97020342, 100932369, 103719753, 105865722, 106020494, 104963646, 105219480, 107339213, 111090985, 123095233, 157914734, 229685972, 288344963, 275922622, 240693392]
18103B40693392k7269466k8677779m5664778m3696602k6848317j5762002j0171091
18096D2603357p046205n097593l700985k730423k361916k145539j689365j622146
18088A6209185j214997j127536r23635p03969p28122o81611n38345n34360o07902
18079I148708m64037m80922n67706m23171m67513l45440l64577j66922j75432
18070E692988j5019j56316k54047k47844l33698l30257k57031j91247j88607j02289
18060C616633r4165P73J00583m328j58108j62743k076O6347k88983n19047k39971
18049B314915o6869j33067j44717l1279j8868j34438k50560j40815r355J50038
18039A534985q3719j47529J85403K17345J10412Q2913K4317N5986j7477N1041
$$ y = [240693392, 213423926, 184746147, 139081369, 95384767, 68536450, 52774448, 42603357, 35557152, 30459559, 26758574, 24028151, 21666235, 19520696, 17831331, 16209185, 14994188, 13866652, 12943017, 12239048, 11510926, 10829315, 10290970, 9756610, 9148708, 8684671, 8203749, 7636043, 7212872, 6745359, 6399919, 6035342, 5868420, 5692988, 5677969, 5521653, 5267606, 5019762, 4686064, 4355807, 4098776, 3907529, 3718922, 3616633, 3522468, 3523241, 3623824, 3619496, 3461388, 3298645, 3296569, 3362916, 3073933, 2554886, 2314915, 2248046, 2114979, 1970262, 1938983, 1920115, 1785677, 1535117, 1394302, 1384947, 1534985, 1451266, 1303737, 1489140, 1706485, 1816897, 1899810, 1924127, 1980113, 1962636, 2013677]
18029B013677n1483j52012k54727n8774L8697k15133j03175J68443K5298k15182
18019A195629l00795k40663l5258M5662n6346J72138J05083j3277j15762k0371
18009G36040K0982J8517L9795j8726j33317m2483K2396K8806O2956L3327M4466
17998H12759J03277J12222M359P7699J25124n6958R820q2116J9900Q0484K03650
17987A410220Q6067j04502p4380r6044j83301q3840k6636j74093j27728q9927
17977E35836j01842n2220M9600J18519n5891o6857N1990q4011N7665J54568J43661
17966G51018K801j4131R2023J00603j8963O9611j5887L9867J33108J38653J59704
17955A438407j2549j08682j75755j13072Q716k9031J9756N4346j28725q5519q2461
$$ y = [2013677, 1962194, 1810182, 1555455, 1496681, 1535378, 1320245, 1217070, 1385513, 1410811, 1195629, 894834, 654171, 618913, 664575, 608229, 780367, 885450, 872173, 756411, 736040, 757022, 775539, 815334, 796608, 663291, 620808, 643204, 672010, 734966, 768293, 812759, 916036, 1028258, 1032617, 1110316, 1235440, 1178482, 1188302, 1106186, 1126086, 1206570, 1410220, 1496287, 1391785, 1317405, 1221361, 1038060, 954220, 927584, 753491, 625763, 535836, 433994, 381774, 431374, 549893, 494002, 427145, 479135, 395124, 452789, 607357, 751018, 753819, 739688, 831711, 932314, 913351, 982962, 967075, 1006942, 1140050, 1278703, 1438407, 1425858, 1317176, 1141421, 1028349, 1037065, 1008034, 1027790, 1082136, 953411, 867892, 785431]
17944G85431j49361J7815J8750q511j8014O5552J43281J86533l9130J58331K62729
17933A423406J24373o5298q1253L8519N2091j33410q5538p7468j73618j05315
17923I16489M0984j0050l2226J10433J0920j29152o811r014j48867L6266K4133
17912H03105Q3713J01498m7596Q7588Q7630J97505J57558J16549J18129j26998
17902A578681k37799p7515J07742R3539R990R6271K97664K13481J38800L22824
17892B543678M56050K24889l9446j8332j07840j04185P2447Q0933P0197L84101
17882C562492L75255L49985M06888K95746K51960K25267L25035M24261L05351
17873F522240O28560O81695J081761J836932K542429L231186M553400P100951
$$ y = [785431, 636070, 653885, 672635, 664124, 646110, 711662, 854943, 1041476, 1002346, 1160677, 1423406, 1547779, 1482481, 1401228, 1439747, 1491838, 1358428, 1272890, 1195422, 1021804, 916489, 957473, 947423, 915197, 1025630, 1036550, 907398, 900587, 891573, 742706, 778972, 803105, 886818, 988316, 940720, 1028308, 1115938, 1313443, 1471001, 1587550, 1705679, 1578681, 1340882, 1263367, 1371109, 1464648, 1474638, 1570909, 1868573, 2082054, 2220854, 2543678, 2999728, 3224617, 3185171, 3166839, 3058999, 2954814, 3027261, 3108194, 3178391, 3562492, 3937747, 4287732, 4694620, 4990366, 5242326, 5467593, 5792628, 6216889, 6522240, 7150800, 7832495, 8914256, 10751188, 13293617, 16524803, 21078203, 28179154]
17865B8179154J1950166K1959430M2403198O1842159L1474344j1937087k2126866
17858A63744498j8539802k4224137l3120050k7088854j6291670r315222n373792
17851B9790971l351322k136945j323033m93528K21809J216551K481868L876725
17843C0283096O619979J1969458K2603665M3062548N3537457J7353707j4621963
17836A70807947j7870056j4262459j9870340k1939547p772648J4282956L8990185
17829A42366038L5163199k658377k0303044j8213413j8268532k6596851k6369609
17822F5119411j7072209r743319o036520m052250k812577j893394j253092p38892
17814B1517158j420Q55820K208390M183356P654319J4218425K7834522M4285873
$$ y = [28179154, 40129320, 62088750, 104491948, 166334107, 197808451, 185871364, 163744498, 145204696, 120980559, 87860509, 60771655, 44479985, 35164763, 29790971, 26439649, 24302704, 22979671, 22486143, 22707952, 23924503, 26406371, 30283096, 36903075, 48872533, 71476198, 114538746, 168076203, 185429910, 170807947, 152937891, 138675432, 118805092, 96865545, 89092897, 103375853, 142366038, 177529237, 174870860, 154567816, 136354403, 118085871, 91489020, 65119411, 48047202, 38303883, 32267363, 28215113, 25402536, 23509142, 22256050, 21517158, 21515738, 22371558, 24579948, 28763304, 36417623, 50636048, 78470570, 122756443]
17806A22756443K7733196p392226j8027491j5229608j7687287k4925366k1551920
17799D5675741j3000948p453217m635446l299063k535879k047441j476429j047164
17791A0180154q77838p85782l76473l54336l13596l17591k55706k54078l08946
17782F335808l89984l88472j93236j21196j77191j45992j65674j29329l61100
17773D263634m38986l26820j90609l35118l17005k64154j81149r6755m3112j23804
17763A946122j6048k5228j6819j19478k10269o396j00577k9691k16415l1677J17965
17752A291489P0584M7319j90886k32060j49384L3188r742p5948m9970M4655n8305
17741G20940r8168n4190k9489j09695k4743J48557J31098q487J15387L5761k3772
$$ y = [122756443, 150489639, 143097413, 125069922, 109840314, 92153027, 67227661, 45675741, 32674793, 25221576, 20586130, 17287067, 14751188, 12703747, 11227318, 10180154, 9302316, 8516534, 8140061, 7785725, 7472129, 7154538, 6898832, 6644754, 6335808, 5945824, 5557352, 5364116, 5242920, 5065729, 4919737, 4754063, 4624734, 4263634, 3824648, 3497828, 3307219, 2972101, 2655096, 2390942, 2209793, 2113038, 2069926, 1946122, 1930074, 1904846, 1888027, 1768549, 1558280, 1551884, 1451307, 1421616, 1205201, 1173524, 1291489, 1362073, 1409392, 1218506, 986446, 837062, 870250, 860508, 784560, 734590, 779245, 720940, 622772, 568582, 539093, 429398, 404655, 553212, 684310, 675823, 791210, 826971, 803199]
17730H03199J15293J26850j4295k3563o6632p7529j32952j22510J10272N2652
17720G70785m165r1771J06080P7781p4604r1524L676L05881K46693J05240j13452
17709A240620j36812Q498L1886R8203J43667L3105k38150j43357p199k44194p3806
17698G12461o3117j08461j48m065O5862J73561P5778L908J40210k0787n1008J6186
17686I40380J2962l7097j21223M0357L7820n451o0443o766P1421j48082q1450
17675F42428k3174Q9695J62498o1555p3170o9481j34452p333J43604J91043m7958
17664H12145r033j2169J07587n2891o563J8527Q924M5076m4104n5354j21587l7838
17652F52720J04188o8558p8290Q228q6837k5290M2020r1619j30800m2220p145
$$ y = [803199, 918492, 1045342, 1031047, 1007484, 940852, 863323, 730371, 607861, 718133, 770785, 766620, 674849, 780929, 858710, 784106, 692582, 696258, 1002139, 1248832, 1354072, 1240620, 1103808, 1112306, 1144192, 1242395, 1386062, 1419167, 1181017, 1037660, 1030461, 786267, 712461, 649344, 540883, 540735, 536670, 602532, 776093, 851871, 855779, 995989, 975202, 924194, 940380, 953342, 916245, 795022, 835379, 873199, 867748, 807305, 800539, 871960, 723878, 642428, 619254, 708949, 871447, 809892, 736722, 667241, 532789, 525456, 669060, 860103, 812145, 803112, 790943, 898530, 845639, 839076, 857603, 866527, 911603, 867499, 812145, 690558, 652720, 756908, 688350, 610060, 618288, 531451, 506161, 548181, 456562, 325762, 283542, 276397]
17641B76397n3763j17979j1684P8178l4264J20731k7736j13778q2949P1931O1767
17630A66851r0187P9421k6358R010J05683o7281O2658P2585L2020Q514Q7935J11038
17618E51889R7361j01277R235O4887n4350o8755N863k5186k025j1367P9084j49608
17606C95751L8498Q7462j84447o282l0405J7552l214n3230l1272J41908L5612
17595D07933j62866j28421r0953J03589P1982O6977n0881j26130o5129J7669Q4518
17584A28288k504N5933J87173K71791J66309J88463n3331k338k12151l083K64902
17573I89452J36446K48464J5637j30484j18775k52352k93669o9611Q210k27856
17563C05462J00963J43992p6350j48898M4009K4310j16342j31753R7064M2814
$$ y = [276397, 222634, 104655, 92971, 171149, 136885, 257616, 229880, 116102, 33153, 105084, 166851, 76664, 156085, 129727, 138737, 244420, 177139, 239797, 312382, 344402, 352916, 440851, 551889, 649250, 547973, 557208, 622095, 567745, 498990, 504853, 479667, 477642, 466275, 545359, 395751, 434249, 521711, 337264, 330982, 300577, 318129, 314915, 261685, 230413, 372321, 407933, 245067, 116646, 25693, 129282, 201264, 268241, 217360, 91230, 26101, 43770, 128288, 125784, 181717, 368890, 640681, 806990, 995453, 942122, 939784, 727633, 724550, 989452, 1125898, 1374362, 1389999, 1259515, 1140740, 888388, 594719, 525108, 533318, 305462, 406425, 550417, 474067, 325169, 369178, 393488, 277146, 145393, 242457, 285271]
17553B85271j09775P8035K10711K38669L856P6511J31525J20394J36103r7166
17543A074134j72793j48079K0411J31689M0619j9935q6484k54502k05063p0471
17533C09526p9046n9065L8492Q0243q8901L8563m8342j47996n8342O2867o6380
17522a8381N3258J47673K858K4275k12074j57626Q0657J08019r6987k0891J34009
17511D4790L3212q7805j72435J23795K5565j08241K5009Q6354J54647J31031q2329
17500A73593j17555j0334M647j13723p0409J02931N0423p576J1840O9064P5842
17489A68743j83933r3938J6414J39041P7717k3099l5722J8638J10512N761j44022
17478E6112k31871r917J1374K5734K0419J13876m477l8665k0682n0911k7157K2336
$$ y = [285271, 175496, 253531, 464242, 702911, 706767, 783278, 914803, 1035197, 1171300, 1074134, 901341, 753262, 773673, 905362, 945981, 926046, 839562, 585060, 379997, 309526, 230480, 171415, 209907, 290150, 201249, 239812, 191470, 43474, -14868, 47999, -18381, 34877, 182550, 185408, 209683, -2391, -160017, -79360, 28659, -68328, -89219, 44790, 78002, -9803, -182238, -58443, -32878, -141119, -116110, -29756, 124891, 255922, 173593, 56038, 45704, 50351, -63372, -133781, -30850, 19573, 11997, 23837, 92901, 168743, -15190, -109128, -92714, 46327, 124044, 100945, 65223, 83861, 194373, 200134, 56112, -175759, -185676, -174302, -148568, -128149, -14273, -18750, -57415, -78097, -129008, -156165, -133829]
17466a33829R9258J34559n5808J4545N8079j27477J18458Q005j58469O8171K7578
17455E3070Q474N3146L3647j3480Q6171O7407l8687K2562q0246L1304p3581o0776
17443H9011J88713J25146K04192M58492P0086j33120j74627l3817j72057m17879
17433B04140j17030Q8662p3057j9084K1181j0067J9149r4014o2843j0823j5252
17422f9038J7411J73807N7120L2819j05242j24776K8331j9602J3992R9788l4407
17411G0203j44177J41605J24869M261k9749m5182q0985j03854M980L6642P6359
17400E4972K2945o8513L3665l4429j6453j31827j27569j34075j8207J39164J52672
17389a27655J07113o1283J31135K7035r0030O556J6292L1736r5221J8372R0474
$$ y = [-133829, -34571, 99988, 44180, 58725, 116804, -10673, 107785, 115790, -42679, 25492, 53070, 61544, 114690, 148337, 134857, 221028, 288435, 249748, 272310, 192064, 223368, 149787, 89011, 277724, 402870, 607062, 1065554, 1135640, 1002520, 827893, 794076, 622019, 204140, 87110, 175772, 102715, 83631, 104812, 94745, 113894, 19880, -42963, -53786, -69038, -51627, 122180, 179300, 212119, 106877, -17899, 10432, -9170, 4822, 104610, 70203, -73974, 67631, 192500, 196761, 167012, 121830, 40845, -63009, -58029, -21387, 54972, 77917, 9404, 43069, 8640, -7813, -139640, -267209, -401284, -419491, -280327, -127655, -20542, -81825, 49310, 76345, -13685, -7129, 9163, 40899, -54322, -35950, 54524]
17378E4524J68914l3094q1826p7754p9916j6175J28565k5962j19281j11683J25270
17367f8418M5884m0308q0549J25006K44618k2410l756k9419j83552n2267m6419
17356a11590M6157R4453q777l0639J47009L322J7671M6950p728n068K4178j35761
17344H0177o3196m2879p5718M2087o0561P8790K29733K3519M2345M9124k01089
17333A02332j13420L7856Q5328J52786L27510K08881N124o6116o4229m1253q2558
17322E52241j18413q2682L2252n8791j17409n3949m7879L4197j18093L2368J19880
17311A73722R4908L1870M5136J50127K00952K50041R0499p2427p417O7142m0065
17300I84488j96277k06201J7168J13230J88751J4361m2694j91221p4303j59697
$$ y = [54524, 223438, 190344, 108518, 30764, -49152, -65327, 63238, 37276, -82005, -193688, -68418, -22534, -62842, -143391, -18385, 226233, 203823, 200067, 170648, -12904, -65171, -111590, -65433, 29020, 20243, -10396, 136613, 139935, 157606, 204556, 196828, 191760, 215938, 80177, 16981, -25898, -101616, -59529, -120090, -41300, 188433, 211952, 254297, 303421, 102332, -11088, 26768, 112096, 264882, 592392, 801273, 806397, 740281, 676052, 634799, 552241, 433828, 351146, 383398, 324607, 207198, 153249, 105370, 139567, 21474, 53842, 173722, 268630, 300500, 345636, 495763, 696715, 946756, 1037255, 964828, 957411, 1024553, 984488, 788211, 582010, 599178, 712408, 901159, 915520, 872826, 681605, 607302, 447605]
17290D47605j93373j02258J9247K8075J80458P2426j2419o9031j08684k17967
17280D4079j50043L9183K2671p3911O3565J84908K81868K81081K05882L26j85759
17269G13850j52152m0943p8497k9343k6986j16560j15716j29172l6977K5483R489
17258B2476m768k0492n2221n6249j34165j31385L8400K05162K00852k6021r7172
17247e5583p2554J86132J79682J06325m930j94247l4015J12901M7649j49666q5808
17236C5886J43899L6963o7237j22509p4807Q9761P5355p7953q0031j37971r6457
17225b75101Q6858K33832R7612L5402o6114k8302j71796m6943Q3598K632M0629
17214g693M6954M3489j1942p5553m3332j3260J12149j33398j21450O2170N9000
$$ y = [447605, 254232, 151974, 171221, 199296, 379754, 452180, 439761, 370730, 262046, 44079, -105964, -66781, -44110, -118021, -54456, 130452, 412320, 693401, 899283, 899609, 713850, 561698, 520755, 442258, 412915, 385929, 269369, 153653, 24481, -12496, 12987, 22476, 17708, -2784, -55005, -111254, -245419, -376804, -338404, -133242, 67610, 41589, -55583, -128137, 57995, 237677, 344002, 339072, 144825, 110810, 223711, 271360, 121694, 35886, 179785, 216748, 149511, 27002, -47805, 41956, 117311, 39358, -40673, -178644, -275101, -188243, 45589, 143201, 178603, 112489, 84187, -87609, -134552, -50954, -48322, -7693, 39261, 82750, 70808, -4745, -48077, -61337, 50812, -82586, -204036, -141866, -82866]
17203h2866J19961J04626m3142j24950n2989k6602P6502M1677o4481l4448r9947
17192a86659O5565K32896J09533j13249o9629j03221r1502j21901J32680J24934
17182b0553L0614K1186J2259o1626j6544J1293M1846L4006o292j65742l5122K2481
17170a32194M4676M9510J02819Q857p0656m2429k74016k043O4518j03324m43J26327
17158b28398k7257J32617J1400J9958J05525J2289r5356k2621j65248L712J26068
17147a27311k5255k433N8567n191l3270l8109K7757k3548n4658J54266J02890
17136C3705o8709p6752K9469j6324j37018l1332J13998J48304M7254j15137m9221
17125a21763j2848k7704R8827J96971j04062j8161M8535j78300j05755O5859J26863
$$ y = [-82866, 37095, 141721, 98579, -26371, -79360, -105962, -29460, 12217, -52264, -86712, -186659, -121094, 111802, 221335, 108086, 38457, -64764, -156266, -278167, -145487, -20553, 10061, 31247, 43506, -18120, -34664, -23371, 18475, 52481, 46189, -119553, -154675, -132194, -87518, -38008, 64811, 73668, 3012, -39417, -313433, -315476, -250958, -354282, -354725, -228398, -255655, -123038, -111638, -91680, 13845, 26134, -69222, -91843, -257091, -253379, -127311, -152566, -154999, -96432, -101623, -134893, -173002, -145245, -168793, -223451, -69185, 33705, -35004, -111756, -82287, -98611, -235629, -266961, -152963, -4659, 42595, -72542, -121763, -134611, -162315, -63488, 133483, 29421, 11260, 59795, -118505, -224260, -158401, -31538]
17114c1538J19012L884j06687n4690j26524L3379Q8767N0191m3792L5277Q3807
17103E1086o5833j2978L2684j65177m6983J79884J02816j422n5896q2110l7415
17092a01344N8490N3161n4300j07619n9049p79O6142L7805N5861r0946Q2289J2637
17080d7652Q6706R8108j06954m1792P118j35076J48696N690M0089M4877j10832
17069a1022o3265L0048K685n6013J66302L3197j9361K3859q2565n6410J46317
17058A13772n1306m9514J113p2679j32772n2322J53196P2405j0260j03278k7552
17047a59197j96022k6147R1451M8727O2180M5965N7794l7326l8717K4288j11272
17036b38276k4652J59437N0404J6033K16174L7689j70522n4259Q7520J04995K1247
$$ y = [-31538, 87474, 91358, -15329, -70019, -196543, -163164, -74397, -24206, -67998, -32721, 51086, -14747, -27725, 4959, -160218, -207201, -27317, 75499, 74077, 18181, -63929, -101344, -42854, 10307, -43993, -151612, -210661, -211440, -145298, -107493, -51632, -142578, -60289, -47652, 39054, 137162, 30208, -11584, -4466, -139542, 9154, 14844, 54933, 99810, -11022, -74287, -44239, -41554, -97567, 68735, 101932, 82571, 106430, 23865, -32545, 113772, 62466, 12952, 14065, -58614, -191386, -243708, -90512, -18107, -28367, -131645, -159197, -355219, -381366, -289915, -241188, -179008, -133043, -75249, -112575, -151292, -127004, -238276, -262928, -103491, -53087, -37054, 179120, 216809, 46287, -7972, 79548, 184543, 205790]
17025B05790j54083j15376j04626L3889J35122Q8684j55731j41953m1225q30M2695
17014b07644R0490Q8961J42732q7181o7772J58341j06015j03044k9218M8572J11342
17003C9564K7455k9373r0376j05769L2814P5493K1565m6313J0204k7117l8436
16992a30289o2506Q8091O2261J52519P7178m8041j38500j26232R4518K07767J78867
16981C55633M3223k07068j72846l1540J0517N3966K0117J11992J5146j22347j11930
16970c5137j11279p1383m6549J16980M5994L9128L0371M0939j24725K342L6028
16959g7291r2446j3611J10858J39046l0537q2628q3755J38159Q3984n3704l5680
16948B395n3955k2587n1047l5907K0625J0607j7697M0638r230K9592P3337k8412
$$ y = [205790, 51707, -63669, -168295, -134406, 716, 89400, -66331, -208284, -249509, -250339, -207644, -117154, -28193, 114539, 27358, -40414, 117927, 11912, -91132, -120350, -71778, 39564, 67019, 37646, -52730, -158499, -125685, -50192, -28627, -74940, -64736, -91853, -130289, -192795, -104704, -42443, 110076, 187254, 139213, 713, -125519, -31001, 176766, 355633, 398856, 191788, 18942, -12598, -2081, 51885, 72002, 183994, 199140, 76793, -35137, -146416, -217799, -264348, -147368, -101374, -62246, -31875, 9064, -115661, -113319, -77291, -169737, -183348, -72490, 66556, 36019, -46609, -130364, 7795, 91779, 38075, 2395, -51560, -74147, -125194, -161101, -140476, -129869, -147566, -106928, -116158, -86566, -13229, -41641]
16936d1641J69264o3077R470n883P4105Q6318J6940j33280q8926m6967j02702
16925a26379j31333j03242J95512J84498J34093k3149J6731j1903k6758l3714
16915G4356r3256m1499l0451m2004M3755L0481p9367J47340K5869M7602J12778
16904A95604j93272j25414N1618m8465j0429R8837j38784m8598K6485n8985j1551
16893b62954k483r197k1176J45663O9009p5942J8960O3923l4180J21964Q7050
16882A00637j47255k2349J1058k4728j5077J077p6491M3485n4218n1723P2579
16871a63005j8132Q7561J34182k8039q7704K1698M4623q1823o6709N2514j43441
16860b48275p962R2441J8274L3896M5769r4529P376Q7077Q0708L9866R335R126
$$ y = [-41641, 127623, 64546, 74016, 68133, 142238, 228556, 245496, 112216, 23290, -23677, -126379, -257712, -360954, -165442, 19056, 153149, 130000, 146731, 134828, 108070, 74356, -18900, -60399, -90850, -132854, -89099, -58618, -137985, 9355, 35224, 82826, 195604, 2332, -123082, -71464, -119929, -130358, -31521, -170305, -218903, -192418, -251403, -262954, -265437, -274634, -295810, -150147, -81138, -157080, -138120, -74197, -108377, 13587, 100637, -46618, -68967, -57909, -82637, -97714, -96637, -173128, -129643, -183861, -235584, -163005, -181137, -93576, 40606, 12567, -75137, -53439, -8816, -90639, -157348, -104834, -248275, -256237, -163796, -145522, -111626, -65857, -160386, -153010, -65933, 14775, 54641, 63976, 73102]
16848G3102j09048K7541k4209J65239M7249o8199q6940p5778L4766k799j04028
16837a23104M7402P098q7754p6703j44809M2895M539j9434m5939M5495R5044L1921
16825b23349N2031J13796K375q2624m8759J79536Q267K477O0706r760r5473l9098
16813g9875n6088r1003j5588N8998L2403o8554q2932K0321P3449M5288j78328
16802c41909j25495J13531R9181J27011J79158q4067j81877O3789R3844n1014
16792a07848j08858p8682J20390K30959R0646k8647J06116P6132r6066k08047
16782c905j9412p3259j72849j8833L5898Q9732R8205J48096j7906r0401l9369
16771f4003k01372L7031J66586J7375L1191L6564j44672j2841M6221L0556J19563
$$ y = [73102, -35946, -8405, -32614, 132625, 179874, 111675, 24735, -51043, -16277, -19076, -123104, -75702, -68604, -156358, -233061, -377870, -334975, -330436, -349870, -395809, -350314, -255270, -223349, -171318, -57522, -55147, -137771, -186530, -6994, 1273, 3750, 64456, 54696, -40777, -79875, -135963, -226966, -242554, -183556, -151153, -219707, -302639, -282318, -208869, -163581, -341909, -467404, -353873, -254692, -127681, 51477, -32590, -214467, -150678, -56834, -107848, -216706, -295388, -174998, 55961, 146607, 117960, 224076, 300208, 204142, -3905, -23317, -96576, -269425, -288258, -252360, -162628, -64423, 83673, 65767, -24634, -64003, -265375, -228344, -61758, -44383, -13192, 23372, -121300, -134141, -87920, -57364, 62199]
16760F2199k8175j58722o5602k4695L7416J27323J23213N4326j58626j26306k9698
16749a87347L1841J6808K7787J20411q6121k3306j1923l4593O3340N8095r1127
16738a16135M9604O4252j00185L1641r4787j76500o3124J37223J56252N7299j3174
16727f7634l2635J01857J14587o1752R146j0209j3031j5125O7766n95j49892j73018
16715b30535j24980M1328J05229J38234J7736K8466R7627K0444r9821j24226o3474
16704a93972l3989K9981J46579k2502r4544n2344j1139J94373n2893k1959l7565
16693a49974m6456J60034j08364m1334l2495J13758J58916J8491P0983q170M3983
16682A79372O72j75470r2643Q1514j8972Q9719L860L9345j5394K5884k5907N9951
$$ y = [62199, 34024, -124698, -190300, -214995, -177579, -50256, 72957, 127283, -31343, -157649, -187347, -155506, -138698, -110911, 9500, -76621, -99927, -111850, -146443, -83103, -25008, -116135, -66531, -2279, -102464, -70823, -165610, -342110, -405234, -268011, -111759, -54460, -67634, -100269, 1588, 116175, 54423, 63569, 53360, 40329, 25204, 92970, 92375, -57517, -230535, -355515, -314187, -208958, -70724, -52988, -24522, 73105, 93549, -6272, -130498, -193972, -227961, -197980, -51401, -73903, -168447, -220791, -231930, -37557, -90450, -112409, -149974, -196430, -36396, -144760, -186094, -218589, -104831, 54085, 72576, 143559, 135389, 179372, 180044, 4574, -88069, -6555, -25527, 64192, 68052, 107397, 92003, 117887, 91980, 151931]
16670A51931Q9983l7798j35276k9249j39440n9617Q7444K1853K19103J00007n5073
16659B13868N398o6021k8037J5460J8575M3830j03893k71479m0083Q041j4631
16648b18972p0853N5450J01334J4682k3558j67750M2870J01861q5089q1028P5652
16637b55401J33559L3572M7204P6935K3655j3579k1851l520r0704k9034Q1927
16626a7237K0146r6617m8302K9135K40629J63351r9923M449L2223O8126m542j57082
16614A34356o3055J84656K9273k04127k1050k7338l3215j4725j04055k1413k5860
16603a66553R2735l272L456P5150N2446J31785K5331j38065j18240O0351Q0576
16592I5700K01906K7444r0144j57375j15967Q2395r144K2168K2787l7003j60029
$$ y = [151931, 241914, 204116, 68840, 39591, -99849, -159466, -72022, -50169, 168934, 268941, 213868, 219266, 153245, 125208, 140668, 159243, 203073, 99180, -172299, -212382, -204341, -218972, -289825, -234375, -133041, -118359, -141917, -309667, -266797, -164936, -250025, -331053, -255401, -121842, -88270, -41066, 35869, 59524, 45945, 24094, 20574, -70130, -99164, -17237, 2909, -93708, -142010, -112875, 127754, 291105, 191182, 195631, 227854, 295980, 291438, 134356, 71301, 255957, 285230, 81103, 60053, 32715, -500, -15225, -119280, -140693, -166553, -73818, -77090, -73634, 1516, 53962, 185747, 211078, 73013, -45227, 15124, 95700, 297606, 325050, 234906, 77531, -38436, 43959, 34815, 56983, 79770, 42767, -117262]
16581a17262q7254J03173J25013O8847j00444J65077K8193l4795p773k09799p1416
16570a38440O2852p2355l7116p747r4289n6832J66464M3180N8595k1505J17128
16559A9935p4893m0198o3686Q0988J37449Q378j8936j01895k1279J21328K6129
16548G3320j7727L7243j3681m1763p1928m6775M6726r7841j03508k8477M6491
16537b17920K31764J41093J0675l406L467j11373j19092r4985K819R1613O1076
16526d269j02248n1676J16534o259J71843P4306j0795j77812j76797l8392J20794
16515h4771L5350m5092m6957Q1014p6288j03670J9537L3930N3979J31677J07034
16504A05743j03952o4800O2416m5057r6179k9725n8511m838L2724O4618K7587
$$ y = [-117262, -204516, -101343, 23670, 92517, -7927, 157150, 185343, 150548, 142775, -67024, -138440, -75588, -147943, -185059, -192806, -287095, -343927, -177463, -134283, -75688, -97193, 19935, -54958, -95156, -158842, -77854, 59595, 67973, 49037, -52858, -74137, 47191, 73320, 55593, 92836, 79155, 37392, -34536, -81311, -34585, -132426, -235934, -264411, -217920, 13844, 154937, 165612, 162206, 165673, 54300, -64792, -159777, -156958, -65345, -4269, -106517, -158193, -41659, -47918, 123925, 198231, 187436, 9624, -167173, -205565, -84771, -49421, -94513, -141470, -60456, -136744, -240414, -220877, -186947, -132968, -1291, 105743, 1791, -63009, -593, -45650, -141829, -171554, -230065, -234903, -202179, -137561, -109974]
16493a09974k5201K1868k8223j73R4350m6363k7670q702Q8839J4814o1719o7728
16481a55882N4879P3107J4735K1305R4646N5182m8925r7901n9821j62023o376
16470b17074j8551Q0258Q7541j03911j304L5829k0960J578j077J00035n3465m5542
16458a56643J1109n8154N2173L9131q1645m3432J09932K02565P2140O4934m3385
16447A68725n3643J7942j68589j24422j0883J01171R9960l4288j59463K587L533
16436a57370o5337R2115J09089J2294n9418k1235M7740n6489J3245M6825N6602
16425A8061L1848o953j8467N3162J12931j6395m8933N223L3682k7644J232L5750
16413A73497n1048k76845j12050j730M9036K3394J6643J26412p793P0051M2668
$$ y = [-109974, -135175, -113307, -141530, -141703, -47353, -93716, -121386, -130088, -41249, -26435, -88154, -155882, -101003, -27896, -13161, 8144, 102790, 157972, 109047, 11146, -48675, -210698, -217074, -235625, -155367, -67826, -171737, -173041, -137212, -158172, -156594, -157671, -57636, -111101, -156643, -145534, -203688, -151515, -112384, -194029, -237461, -127529, 75036, 147176, 212110, 168725, 115082, 133024, -35565, -159987, -170870, -69699, 30261, -4027, -163490, -160903, -157370, -222707, -130592, -21503, -9209, -68627, -89862, -42122, -98611, -85366, -38541, 18061, 49909, 42956, 24489, 77651, 190582, 174187, 125254, 130477, 164159, 136515, 137747, 173497, 122449, -154396, -266446, -268176, -219140, -195746, -179103, -52691, -60484, 9567, 52235]
16402E2235j7177n4255j37770J6968P7832K9178Q3238K05131j06966j27611k308
16391A8495M3769L7023K5155K648j17693m3429J0947j31343m179N8102J56307
16380E5802N9963O7954l8267q7849R7518J73698k34490j65933r0057N0000K5310
16369h6351m483q6486J01337J12214J42163Q6078j1345j83686j03015n2096j4928
16358a00598p7488J6565M1350N8988P2154o7539o8674l3312j46812K7487M3368
16347b34511J04900J42583q0425j61687K6932Q1348Q6321O1215j49061Q421N127
16336a08837p4958Q7231Q733j17983O0112j2927M5398J04059r8977k17503P6223
16325b49429l506J18818R2104K6675N3672R3080j23297l100J14785l2866j43604
$$ y = [52235, 35058, -19197, -156967, -139999, -62167, -32989, 50249, 255380, 148414, 20803, 18495, 62264, 99287, 124442, 127090, 9397, -34032, -23085, -154428, -158607, -100505, 55802, 115765, 183719, 145452, 57603, 155121, 328819, 94329, -71604, -161661, -111661, -86351, -90834, -177320, -75983, 36231, 178394, 264472, 253127, 69441, -33574, -85670, -100598, -178086, -161521, -120171, -61183, 10971, -56568, -125242, -158554, -305366, -277879, -234511, -129611, 12972, -67453, -229140, -202208, -120860, -34539, 26676, -122385, -113964, -108837, -183795, -96564, -87831, -205814, -145702, -158629, -113231, -9172, -108149, -325652, -249429, -252935, -134117, -42013, -15338, 38334, 131414, 8117, 5017, 119802, 86936, -56668]
16314e6668o7484M7989K2361m9053K0384J17600K4250k3480j8384o008q407J02399
16302A05499q5346j63155M3697m6722L5064J0715R0872K9724J174J73248o929
16291A87841m4407L7974K6714J1847l254Q3604J8359j08390k7120j46611p6209
16280c9652K886J69329J31155q9534o1888k6451M0208J11930j15598o4594j4904
16269D2887j7900j14930q8302q524j4147P7088P4068O5026J21196j27724p8467
16258f9729M4977J66273n5732p0156N7595m4774m6773P7604N0406j61570N244
16247d6635J99741j31151k6535k9226r316Q7216P6034j263j12115N0470l8943
16236A8277n2368J20421r762n3316Q2881M0020m2240j26975j14610K0160l0528
$$ y = [-56668, -124152, -76163, -53802, -102855, -82471, 35129, 59379, 35899, 17515, 11507, 3100, 105499, 20153, -143002, -99305, -146027, -110963, -100248, -9376, 20348, 21522, 194770, 187841, 143434, 181408, 208122, 219969, 216715, 300319, 318678, 210288, 183168, 36557, -39652, -36766, 132563, 263718, 174184, 112296, 85845, 126053, 237983, 122385, 57791, 42887, 24987, -89943, -178245, -186769, -200916, -123828, -49760, 15266, 136462, 8738, -69729, -24752, 141521, 85789, 15633, 73228, 28454, -18319, 59285, 109691, -51879, -46635, 153106, 21955, -4580, -33806, -43122, 44094, 120128, 118865, 6750, 57220, 18277, -34091, 86330, 76568, 23252, 106133, 146153, 103913, -23062, -137672, -117512, -148040]
16225a48040k2731J32162J873r5765M89Q9233m2332j26376J0364O2286o2208r7153
16213b98198P4308L23534J41189r1021o3526r639k2274N561k6404j284R1357j9641
16201A03962m3130j41505M8519p58R891m9093j1996M4633P6876R0892N9190q4893
16189A02588j30936r0046P1489R1433j30901K2547R2809q0910k9470L8069J8697
16178b4631K1339J03206l0004j22134J00015l4502N8650j17730j58796L7756O2902
16167a03929q4516L6030J72166J06127q8160O412q0920r3390K1513r6124J74663
16156c0128P5188j42769j04239l359J12741o540R2897n9906q738P2973l433Q042
16144B729P6573P5257j02364j41465m5035o0760r3380N0065J74932j08227p7158
$$ y = [-148040, -170771, -38609, -36736, -132501, -132012, -42779, -85111, -211487, -201123, -138837, -201045, -298198, -223890, 99644, 240833, 149812, 86286, 76647, 54373, 59934, 33530, 32246, 123603, 103962, 60832, -80673, -32154, -32912, -23021, -72114, -84110, -39477, 37399, 128291, 187481, 102588, -28348, -118394, -46905, 44528, -86373, -63826, 28983, -51927, -81397, -43328, -24631, -3292, 99914, 69910, -52224, 47791, 13289, 71939, -45791, -204587, -166831, -103929, -188445, -152415, 19751, 125878, 37718, 44130, -36790, -130180, -108667, -204791, -30128, 45060, -97709, -201948, -205307, -92566, -99106, -6209, -66115, -74853, -1880, -5313, 2729, 79302, 154559, 52195, -89270, -134305, -195065, -288445, -238380, -63448, -171675, -248833]
16133b48833J44657L4926J02009K2051j29945j05839J9308J30144K9854K6596
16123B4928Q6476n587n6798n2715m5686J05589l1109l8701o713o182K5908J2581
16111A1991k0444L186k8568J02138p3387r9617j59100r466J48737M9786K0984
16100e3760j6082N7280K1888m9606o2163J08020K9063p1690m8696O00Q1723R7297
16088I3874J7836k5364Q6163M107p526k9391m6490N1248j3579j39095j75463r1944
16076b75624J88768J40121K3072r9945M6211p9646n8254J19823Q1913P4827K6362
16065A87628j33042j44534m5535o4186R7761J41951j34271m5878P1402J4501K946
16054e1257K5481J68702j19359r2053M2675K6204N0017J38711n0429M4966q958
$$ y = [-248833, -104176, -69250, 32759, 54810, -75135, -180974, -161666, -31522, -1668, 24928, 111404, 105817, 49019, -3696, -49382, 56207, 25098, -13603, -20316, -26498, -590, 11991, -8453, -5267, -33835, 68303, -5084, -104701, -263801, -273267, -124530, -74744, -53760, -69842, -12562, 9326, -40280, -102443, 5577, 34640, -37050, -85746, -85146, -3423, 93874, 111710, 86346, 172509, 176616, 169090, 139699, 93209, 144457, 130878, -8217, -183680, -275624, -86856, 53265, 76337, -23608, 22603, -57043, -115297, 4526, 86439, 161266, 187628, 54586, -89948, -135483, -199669, -101908, 40043, -94228, -140106, -68704, -54203, -51257, -25776, 142926, 23567, -68486, -25811, 393, 50410, 189121, 138692, 183658, 174700]
16043A74700Q309L2384n9207j3862j04341k3001J64487q4018R251O3333q5084
16032H2951J22396K4570j49509j69954Q119p483Q3759Q1539p2278q3058m3577
16021a22525m3046L7160j00568r0515l7066K3078L0448R1056K2973J20623L168
16010f5214j493j44005k66003r5160K11288K10306k2816J9247o5394m4362Q0076
15999a83530J23410P3199q991o013n8984k4905m1279j8777j0764O2546R1312P2308
15987F9532n5427p6067N2580k7788j1051j47333m3261L2567m7047P7761j2738
15976a88272K0281J39497N3296R3810L6548L0584j7774m7501k5192K2902L7755
15965A55934j25949K2394N607j34268m8669K3717p0136o6006M7614M6000R2241
$$ y = [174700, 183009, 215393, 156186, 142324, 37983, 14982, 179469, 95451, 104702, 168035, 82951, 205347, 229917, 80408, -89546, -81427, -88910, -5151, 76388, 4110, -78948, -122525, -165571, -128411, -228979, -319494, -356560, -333482, -303034, -211978, -189005, -68382, -65214, -66707, -210712, -476715, -571875, -360587, -150281, -173097, -153850, -219244, -263606, -183530, -60120, 13079, 4088, -1925, -60909, -85814, -127093, -145870, -156634, -94088, -2776, 69532, 14105, -61962, -9382, -37170, -48221, -195554, -238815, -206248, -253295, -175534, -188272, -167991, -28494, 24802, 118612, 155160, 185744, 167970, 120469, 95277, 118179, 155934, 29985, 52379, 57986, -76282, -124951, -101234, -171370, -237376, -189762, -143762, -51521]
15954e1521J08643j00809P7933M1607j23850q0341L333r6524L4644J3248P2578
15943a01059M0751J07997r266k01125N539K6663j44180L9601O0321M7412J7286
15932a10060m8088n9388J5259N5716n4558M9192J22960l6623m9987J24663J4361
15921B3447N1003j26590q662L4984j7722n2881M5586Q4834m5548r5540M1568o0275
15909a25796J8244N3031K4000n7188L8771o5574q7486l7253N5437R4651J49252
15898F0089P1446r6295j18401q7987k8026L4194J4392L443J3131J64552L0433
15887F0971K577J3675q0673J380L0141j38450p4763n6191K4494R4291K3805J7278
15875h1465O7857k8928L390q8382r2268J15926L80r4889j6747p8844N2012K00877
$$ y = [-51521, 57122, -43687, 34246, 75853, -47997, -128338, -125005, -221529, -186885, -173637, -101059, -60308, 47689, 38423, -162702, -157163, -130500, -274680, -235079, -174758, -127346, -110060, -158148, -217536, -202277, -146561, -201119, -151927, -28967, -65590, -115577, 9086, 23447, 74450, -52140, -60802, -25818, -43540, -96421, -50835, 33999, -11549, -107089, -65521, -125796, -107552, -54521, -30521, -87709, -48938, -114512, -201998, -239251, -183814, -89163, 60089, 131535, 35240, -83161, -171148, -199174, -164980, -150588, -147145, -134014, 30538, 60971, 63548, 77223, -3450, -2070, 28071, -110379, -185142, -241333, -216839, -122548, -98743, -81465, -13608, -42536, -39146, -127528, -219796, -103870, -103490, -198379, -215126, -293970, -241958, -41081]
15863d1081P9489J02462p4732L9026n6136q0637l3049J50724J25036j7853r4213
15852I9036o8459J7161m9839N3969J08819L2216k1748r5205j47871k5606N4827
15841d2700N6416q3162q1201Q6545J38152O279rp2334j4525p2094N4573J9643
15829d417q9821M2669P0103M5763k010L8924l6253l8248j02190q7340O6599m5337
15817a41558r6673l1102J91718J32650O238q3650r1086n8187L782Q1794K9751
15806e6323J85222R2881L9137j05959j82317j86262L5809J50368K03641J33550
15796C09747j03794k29564k18892O3396K2939J6936J68606j2893k00344p5156
15786b59019O4249L3549J15155J26320Q882L124o2547m0952L2032L4725m7549
$$ y = [-41081, 38408, 140870, 66138, 105164, 49028, -31609, -64658, 86066, 211102, 193249, 99036, 30577, 47738, -2101, 51868, 160687, 192903, 171155, 75950, -71921, -97527, -42700, 13716, -69446, -150647, -64102, 74050, 80329, 80320, 7986, -6539, -78633, -24060, -4417, -94238, -51569, 18534, 64297, 62287, 101211, 64958, 26710, -75480, -162820, -96221, -141558, -238231, -269333, -77615, 55035, 61273, -22377, -113463, -171650, -167868, -86074, -56323, 128899, 221780, 260917, 154958, -27359, -213621, -177812, -27444, 176197, 309747, 205953, -23611, -242503, -179107, -156168, -139232, 29374, 16481, -183863, -259019, -194770, -161221, -46066, 80254, 89136, 92260, 29713, -11239, 20793, 55518, 7969]
15775G969K7984L5850R1315n7531o5818P9555m1722k5843L0389L9399J8749p5331
15763F4965p4710j10445o5913R800Q9741O632q461P6309j91151k2053J42390O6431
15751a6465l5634J0876K6732j87504o0935O0943J00820N3191p4423j1317p8654
15740b12370m2571p777r2048P6418R2427J1969r9255m0481O4076n998q5014J49558
15728a91066K77918L9041o2327j3939m8667r2454k9552J6881P649n8093N1780
15717a02829n0925L4350n131N439J26000P0061o7359k0893O8661J52886O5113
15706B75373r7486l401k355k4144j9129r8603q0753R1956j24822p0634M7926l1270
15694a37342j0679N0568j4803l5533j70430k3163R7817Q0030N2279p9898J1282
$$ y = [7969, 35953, 71803, 163118, 105587, 39769, 119324, 77602, 51759, 82148, 121547, 140296, 64965, -9745, -120190, -186103, -176303, -86562, -79930, -88391, -12082, -203233, -225286, -82896, -16465, -52099, -41223, -14491, -201995, -262930, -201987, -101167, -47976, -122399, -133716, -212370, -254941, -262718, -354766, -278348, -185921, -173952, -273207, -313688, -249612, -255610, -340624, -191066, 86852, 125893, 63566, 49627, 960, -91494, -121046, -104165, -96516, -154609, -102829, -153754, -119404, -124535, -119096, 6904, 76965, 9606, -11287, 57374, 210260, 275373, 177887, 174486, 172131, 147987, 128858, 30255, -50498, 41458, -83364, -153998, -106072, -137342, -148021, -97453, -112256, -147789, -318219, -341382, -243565, -163535, -111256, -191154, -179872]
15683a79872P6316Q6651R9277J155r2685j32609l960k07463M384J8250M9669O9730
15671b11157l7499N9961J32927l2376R2262O2899J19005j4107j23155P3640L7957
15660A60357k01406m7687L025j25942L9050O1008R3106J60032L405n1074p9988
15649A3886O5697k8766r9696n9547j4946j01103N7548J50015K1809R2169R5637
15638A92703l9040j39659r1744K6152q6725K8689l658P7989N7031q6520N3573
15627a1209J81258q679j92334L1353R3543m2148L0161K6477j63024m1314R3783
15616b133P6362o2368m5633k2654J13268M2845Q4655N9816R4747m9686r9037J9814
15604B09996q1792q149n2995j41733p4043n087O0758j3995p0211O8872n1127n3042
$$ y = [-179872, -103556, -16905, 82372, 83527, -9158, -141767, -145727, -353190, -348806, -330556, -280887, -211157, -248656, -188695, -55768, -88144, 4118, 67017, 186022, 171915, 48760, 122400, 160357, -41049, -88736, -85711, -211653, -172603, -111595, -18489, 141543, 144948, 93874, 13886, 79583, 50817, -48879, -108426, -123372, -224475, -166927, -16912, 4897, 97066, 192703, 153663, 14004, -77740, -51588, -138313, -109624, -113282, -35293, 21738, -64782, -11209, 170049, 161370, -30964, 389, 93932, 51784, 81945, 108422, -54602, -95916, -2133, 74229, 11861, -33772, -56426, 56842, 99687, 184342, 244158, 338905, 289219, 190182, 209996, 128204, 120055, 67060, -74673, -148716, -153803, -93045, -107040, -177251, -108379, -159506, -212548]
15592b12548O917J97237J15298k1270j77746L1771j1673K3963k327P4132K1852
15581D5606O405m2775q9781j78714n1991J26914J49872O6142M0713O1804P6806
15570B11001r5664j03444M0976j1735P5918R3967r6521K5613O0159L0152m2844
15559A87578K8598q2739k18421L6100M5362O7559N1021Q6733j2123j33364j28850
15548g2546o5733P1093J8354J92971m3531q5318j42704K1127J21536L1709M3302
15537I0260p8036p3428J5482J4010j7603O5956K7029O657k8014J25800L873r9093
15525E2893R636K6946l6635j5861J33429L901l32M5782Q690j5232k02176k06655
15513a95614j3297O3124J6316m698K5958n1956r3587n4431J42884J95582L7129
$$ y = [-212548, -205631, -8394, 106904, 85634, -92112, -60341, -72014, -48051, -50378, 23754, 45606, 52011, 9236, -80545, -259259, -311250, -184336, -34464, 31678, 72391, 134195, 211001, 115337, 11893, 52869, 41134, 117052, 211019, 114498, 140111, 200270, 230422, 187578, 216176, 133437, -84984, -48884, -3522, 64037, 115058, 201791, 189668, 56304, -72546, -138279, -67186, -48832, 144139, 100608, 15290, -127414, -106287, 15249, 46958, 90260, 12224, -61204, -45722, -31712, -49315, 16641, 43670, 50327, 22313, 148113, 151986, 52893, 62529, 89475, 52840, 36979, 170408, 174309, 173977, 219759, 228449, 213217, 11041, -195614, -208911, -145787, -129471, -134169, -108211, -160167, -253754, -308185, -165301, 30281, 67410]
15502F7410l7406m0390q1507n3233J6155J110l8413J114K778L1470K0611R516
15490a00785K07763o8558p4390k21581L5112M1215J14626J12042j1115j89103
15480a54774p6643J6530K4370Q9688Q5745Q487r4721j00172m2477O2764P9029
15469a02174O1643k35R963m3505q9864k9360O6216j9154J06433M6711q6500n9939
15457a39765J12087J56742N8355o2250O7263R7133k1679j68580m8249m0947m9781
15446c9671M6001L4083J1905j55612N0610p845l2570J1924o3759M3925K10094
15435A09085P1784r1425Q6993L5195Q7007o4923j20575P4850k6035q2858k17252
15424a38154j30179R7481J67125O070K6392m6154l2245Q6773k7753l7463P0823
$$ y = [67410, 30004, -10386, -91893, -145126, -128971, -127861, -166274, -165160, -162382, -130912, -110301, -100785, 106978, 38420, -35970, -257551, -222439, -181224, -66598, 45444, 34329, -154774, -231417, -214887, -190517, -100829, -15084, -6597, -101318, -201490, -243967, -181203, -102174, -40531, -40766, -30803, -74308, -164172, -193532, -127316, -146470, -40037, 6674, -79826, -139765, -27678, 129064, 187419, 125169, 192432, 289565, 267886, 99306, 51057, 10110, -39671, 6330, 40413, 52318, -103294, -52684, -60529, -93099, -81175, -144934, -101009, 109085, 180869, 89444, 176437, 211632, 298639, 233716, 113141, 187991, 161956, 79098, -138154, -268333, -170852, -3727, 2343, 28735, -17419, -49664, 37109, 9356, -28107, 42716]
15413D2716P3063l3467O7914N3259k2497j27925K6894l518j7366K950p3719q1561
15401i3257k4243J47802J80415N7659p1659m0417j28935r2191j3694P5860o3217
15390f5877n6180n5450R8950O5677N4564j1766j21187o6974R7717J8314m8738
15379i0950p7494m7650Q2205R1919n7943M9639M3366K0446K3566J6909q8767l3596
15367f8350M3806R8917M4310J10711L5236m5256j42298K3335L1630k57395M049
15356a21305J92255K7894n7338j33809j02848m8718J20026J49605M2192k8238
15346C9716j80719l2562p5371O9887J35379J4444Q3990j10672O054J08764p1546
15335a2636l2789n7640J0106P9253L9521j75799n6301M8245J7347K2066J13235
$$ y = [42716, 115779, 82312, 150226, 203485, 180988, 53063, 79957, 76439, 59073, 62023, -11696, -93257, -117500, 30302, 210717, 268376, 196717, 156300, 27365, -64826, -78520, -2660, -65877, -122057, -177507, -78557, -12880, 41684, 29918, -91269, -158243, -60526, -42212, -90950, -168444, -216094, -133889, -41970, -99913, -50274, -6908, 13538, 37104, 54013, -34754, -68350, -24544, 74373, 118683, 229394, 264630, 219374, 77076, 100411, 132041, -125354, -121305, 70950, 98844, 41506, -92303, -195151, -243869, -123843, 25762, 67954, 39716, -141003, -173565, -248936, -179049, -43670, -29226, 54764, -55908, -49854, 58910, -12636, -45425, -103065, -92959, -13706, 25815, -149984, -206285, -158040, -140693, -118627, -5392]
15324e392L7807J4290L1489k1886q2016o0966r2121q3299k6705R4463J08716q687
15312i4307j69605J27346O3130j7369K6392P8126J21074k5153o3726k3059o0857
15301c8008k191R8194j2528n9679J21083M2949r8388J511j6547p1180q7460Q587
15289a13657l3258N2339J11089K21648m3720k22890p9800j9414J672Q0768N4184
15278H961m2933K3466N8432K2899k05728o8818j6133Q9055J0796j18821J70612
15267f8212J78019L7691J1032j08425j408K9711j41676J2114M8316J55490N3840
15256B06492n0499j36494j17109P455k9885M9251K2023Q1546p5030j16729Q0866
15245g8113n6034l4067m4134L5296J81089P7741r316M2214J76316q5037j08494
$$ y = [-5392, 32415, 46705, 78194, 56308, -25708, -86674, -178795, -262094, -288799, -194336, -85620, -94307, -263912, -136566, -73436, -90805, -64413, 13713, 134787, 109634, 45908, 22849, -38008, -40199, 57995, 45467, -14212, 106871, 149820, 51432, 52943, 36396, -34784, -122244, -113657, -146915, -94576, 16513, 238161, 194441, -28449, -108249, -127663, -125991, -45223, 8961, -33972, -10506, 47926, 70825, -134903, -203721, -219854, -130799, -120003, -238824, -68212, 109807, 147498, 158530, 50105, 48697, 78408, -63268, -51154, -2838, 152652, 206492, 155993, 19499, -97610, -90155, -120040, -70789, -48766, 32780, -42250, -158979, -78113, -134147, -168214, -212348, -177052, 4037, 81778, 72462, 114676, 290992, 205955, 97461]
15234I7461M5359J00135m2195p5537j44453p8343N3142J87645l6077n7973K9009
15223G8173J05765l9483r6451K4354j36788K1425O511j1029n0636m260m9266m0655
15211a92340Q4857J15141m2750k7458p0293K06077P719M3097k2071n1566j2867
15200C7546J71066p206p0814m0145m6229p7128J7613J33592j52583p4657R0533
15189a8412k0891Q136P5532p4027j7241M515m8966L9316k3623N0174M4508J9177
15177C8198o2899j15785k6045L2873R189l1021J35417J5121m3951l2641K8765
15166e2779L4699k9333j53518J2575N3464P379n0106J3428Q7027m0264J0837o1171
15154a67762l9794K0946M7453l0182J77039J19469j29425j61537J511Q0550K1904
$$ y = [97461, 142820, 242955, 200760, 125223, -19230, -97573, -44431, 143214, 107137, 49164, 78173, 183938, 144455, 48004, 72358, -64430, -43005, -36494, -47523, -98159, -102419, -151685, -192340, -107483, 7658, -35092, -62550, -132843, 73234, 80953, 124050, 101979, 50413, 37546, 208612, 201406, 130592, 90447, 44218, -32910, -15297, 118295, -34288, -108945, -18412, -39303, -31167, 44365, -29662, -46903, -42388, -91354, -52038, -75661, -25487, 19021, 38198, -24701, -140486, -166531, -133658, -124469, -155490, -20073, -4952, -48903, -81544, -52779, -18080, -47413, -200931, -188356, -134892, -127513, -177619, -164191, -77164, -117428, -106591, -167762, -207556, -186610, -139157, -169339, 7700, 127169, -2256, -163793, -162282, -81732, -59828]
15143e9828J6833L3403k9428L1812k8226m7848O8364N5393l1882N2843m7347m9865
15131c5776J06261L6538p223k4415j17495m0249Q1496j2236O2396l2011N368j41675
15119a19021O7212n0737R379M3703J06435J7698l3232r2467L9082Q6795l4747
15108D0100p8837L7248n1392P1377l3944j3840J39953m81p1646l7735K1120m2869
15096b0946j56823j61878N6259J02964M7032J33150N9015P4517J5282j37354p408
15085C810m3149j23592p6123J04328J08333K4561J93742L4082L0254n1226r4503
15074A10517M2318K7544j16066j65778n2647R234J22474o6506L1239J9675N5983
15063A7987P7156j7907n7483K8543J35156N8792N1902M0134P8195j2100K3283
$$ y = [-59828, -42995, -9592, -39020, -7208, -35434, -83282, -14918, 40475, 8593, 61436, 14089, -35776, 70485, 107023, 99800, 75385, -42110, -82359, -863, -13099, 49297, 17286, 22654, -119021, -51809, -102546, -93167, -49464, 56971, 74669, 41437, -51030, -11948, 74847, 40100, -38737, -1489, -52881, 18496, -15448, -29288, 110665, 110184, 38538, 803, 21923, -20946, -177769, -339647, -283388, -180424, -133392, -242, 58773, 133290, 148572, 11218, 3810, -39339, -162931, -239054, -134726, -26393, -1832, 191910, 225992, 256246, 205020, 110517, 152835, 180379, 64313, -101465, -154112, -144878, -22404, -88910, -57671, -37996, 17987, 95143, 77236, 19753, 48296, 183452, 242244, 294146, 334280, 412475, 400375, 423658]
15052D23658j19203j12878j6609M1250j44917j4980k4099k9194P1484q6215p9720
15041i1423J26534J77352j31159j49256J953Q1913K2588P809m09J2611O0759k8068
15029I1204L1428j38869k22158m0807K10704N8807p8024l4036P9957k04982O8666
15018a78110J88902j32249j9472K83294J03241j82812j74396j38800L9330J20803
15008i0269m9799j9802J09718P104l918n1272l89Q7966J7004n153J09088J7768
14996A28046J23143J0442r3839r3062L2555k607j740k8010k8525j8257L5149k9122
14984C4173o2177q5847K8624P6186q6065j6640j2915o2663n6749J2461O0120l2764
14972b04256Q9343R3976J51334k417l044j05391j10941J39763k1905n6737j00264
$$ y = [423658, 304455, 191577, 174968, 216218, 71301, 56321, 32222, 3028, 74512, -11703, -91423, 35111, 212463, 81304, -67952, -65999, 15914, 38502, 46311, 45902, 58513, 119272, 91204, 122632, -16237, -238395, -279202, -68498, -9691, -87715, -121751, -41794, -246776, -178110, 10792, -121457, -140929, 142365, 245606, 62794, -111602, -250402, -211072, -90269, -140068, -159870, -50152, -43048, -46966, -98238, -98627, -10661, 6343, 1190, 110278, 128046, 251189, 261631, 167792, 74730, 107285, 104678, 102938, 74928, 46403, 28146, 63295, 34173, -28004, -113851, -85227, -9041, -95106, -111746, -124661, -187324, -244073, -231612, -171492, -204256, -114913, -20937, 130397, 127980, 124936, 19545, -91396, 48367, 26462, -30275, -130539]
14961a30539q9908M051Q4756P7189N6288K3487J54293k9278j46583J4087R2577
14950A10420O4959L9146j7057n3604o9223l4662p2909J4667N7053o9144Q0422
14939E0068L4604J14856m843r1908j29480j29320j5179J2237o2441L4485O5627
14928a21294P5126m5595o7204j30294j4424P75j5267J00756J89197P6263j8807
14917B9232N155J876J5081J80966r0979j68472Q2751p4517r0043n4061K9755n7627
14905a90883k5333N4597k0142n5379O823Q9035M5301l5248j34648J45180J07319
14894a3378K19060P5145K6933L5221k03976R09J55284n2683j7070o5119q2618
14883G7708k3659m3982j1179L2190J52144K532Q14j07159l9080J27697N3406j16769
$$ y = [-130539, -220447, -216396, -131640, -54451, 1837, 25324, 179617, 150339, 3756, 17843, 110420, 175379, 214525, 197468, 143864, 74641, 39979, -32930, -18263, 38790, -30354, 50068, 84672, 199528, 194685, 102777, -26703, -156023, -171202, -158965, -221406, -186921, -121294, -46168, -91763, -158967, -289261, -303685, -302910, -318177, -217421, -28224, 48039, 29232, 34387, 36263, 51344, 232310, 141331, -27141, 55610, -18907, -108950, -163011, -133256, -190883, -216216, -161619, -181761, -237140, -230317, -141282, -95981, -131229, -265877, -120697, -13378, 205682, 280827, 307760, 342981, 139005, 139914, 295198, 242515, 225445, 160326, 77708, 54049, 10067, -1112, 31078, 183222, 185754, 186568, 79409, 40329, 168026, 221432, 104663]
14871A04663K1951K6204k4450j03512Q0406K4794J7919J6663p401l3937J5616
14860A38916n6162m8191l9113j29107j0090p24l5120N1532R2687Q9788O0705N3550
14848A68671K4527j54300j5113j8456r6031P1285K37276n83m809J51967j76148
14837A88286j16782N2844Q0855L7761j125N2677j40202j48384O3466J58740J9296
14826B47432P293j08299K9770j0958K5301o500K3985k9891k2331k16093N8278
14815b013m2386O233J71012N5315n1281l6719o0644n0791j36041p2125q8327J14212
14803a93555M9994J39082N1500n7026r4884O7406J36772n2814O461o5665o9916
14792h2645o1747n1898P4094j25414J15420N4480L6131l5215m9591K01070M801
$$ y = [104663, 126614, 152818, 128368, 24856, 105262, 130056, 147975, 164638, 157237, 123300, 138916, 82754, 34563, -4550, -133657, -143747, -144471, -179591, -128059, -35372, 54416, 115121, 168671, 193198, 38898, 23785, 5329, -90702, -19417, 217859, 217276, 212467, 364434, 188286, 71504, 124348, 205203, 242964, 241839, 294516, 154314, 5930, 69396, 228136, 247432, 254725, 146426, 176196, 165238, 190539, 184039, 208024, 178133, 155802, -60291, -2013, -44399, -38166, 132846, 188161, 136880, 100161, 39517, -11274, -147315, -219440, -307767, -193555, -143561, -4479, 47021, -10005, -104889, -37483, 99289, 46475, 52936, -12729, -82645, -144392, -196290, -122196, -247610, -132190, -77710, -41579, -76794, -126385, 74685, 79486]
14781G9486p5256J38830r1292N0535L3079L8487n4277j24418O295r4966j50683
14770b44180J29557J39969R8301o0161M6600N8701p112Q7216m6813m2994m4286
14759A14798K2305N476l2275q8218j18480L3183M9508m5793K662K03952P3001
14748B20119r5879r4449j24669O8657m8534l1298L2158n2636p4849J21622J18906
14737C9148K7952j10550K0700J07950j53357n7668P8411R8487j3259P2948n4428
14726E6334L1591j58300j01453P5849R9082M7756j22252K9569J29209J78010P6135
14715C41530p0405j26307p3290M2282K4431J525J37900m5823k02740p3473j7863
14704f2233j02246P2329J35030R554L1657L8600j7468O2733k3036j06623q6715
$$ y = [79486, 4230, 143060, 51768, 102303, 135382, 173869, 119592, -4826, 1469, -93497, -244180, -114623, 25346, 123647, 63486, 110086, 168787, 161675, 248891, 202078, 159084, 114798, 137103, 142579, 110304, 22086, -96394, -63211, -13703, -59496, -56834, 147118, 220119, 124240, 29791, -94878, -26221, -74755, -106053, -73895, -126531, -201380, -79758, 39148, 67100, -43450, -22750, 85200, -68157, -125825, -47414, 51073, 37814, 110762, 56334, 87925, -70375, -171828, -95979, 3103, 50859, -71393, -41824, 87385, 265395, 341530, 271125, 144818, 71528, 113810, 138241, 139766, 277666, 231843, 29103, -44370, -62233, -164479, -92150, 42880, 52434, 84091, 122691, 105223, 167956, 144920, 38297, -48418]
14693d8418j06611o5605L5285O3467P4779J52621N6694m3028k9554k9531j0525
14682D9574o5781j74973l569M9718j6516O0950K8617J33176L1082j68635J35523
14671E9166J89241n5213O4663n353j11569K5425j10929l7222l3049q2993N9871
14660c7962j0081J7320P0434m1438K4890N3348J10417n518k55320L4228J65848
14649A26166j1931m7922K6307j16211l1686N6343K2422K324O1195L3547M7720
14638A68274J23442P3954l9405o2230k08314j19475J27306J07530q3693k22669
14628a35280n4845M1621M7727J31892K2913Q521k814l9317p4938L0928J78650
14617A55058K773q8922n6120Q6293J05126q5158j55373R933J8925O8353J50390
$$ y = [-48418, -155029, -220634, -185349, -121882, -47103, 105518, 162212, 119184, 89630, 60099, 49574, -16207, -191180, -194749, -145031, -161547, -100597, -71980, 61196, 92278, -76357, 59166, 248407, 193194, 257857, 252504, 140935, 166360, 55431, 18209, -14840, -97833, -37962, -48043, -30723, 39711, -1727, 23163, 76511, 186928, 181410, -73910, -39682, 126166, 114235, 66313, 92620, -23591, -55277, 1066, 23488, 25812, 87007, 120554, 168274, 291716, 365670, 326265, 264035, 55721, -63754, 63552, 171082, 87389, -135280, -190125, -148504, -100777, 31115, 54028, 62549, 59735, 20418, -54520, -23592, 155058, 157831, 68909, 12789, 99082, 204208, 119050, -36323, -26390, -7465, 60888, 211278]
14606B11278q3597j08777J36715J06633r9865j67216J69865O8597n167j9165j5872
14595A93429O4804n1402j40593P3804J64239J93143J27784R9971N8569J05739
14585H89487k8978M04853J89413J56936J73669J4513L4557Q6247J36813j40469
14575A917041k87456j90262j59974k18253r6010k12906j64048p0957j49213k6094
14565C41868k8845n3499P1709L7063q5249j31145l3953J25792K30629L8345p3233
14554D39482M773Q4167J47703L4899Q3644N1682R3949J53835K93120K07200K31230
14543A825684L47675M9581j22962j28408j45678q9286r9420k69903k58705j98078
14533I10500k65119j71025R4236j554j69555j28220M3919l7334o3112m9390N9677
$$ y = [211278, 127681, 18904, 155619, 262252, 162387, -4829, 165036, 233633, 228466, 209301, 193429, 258233, 206831, 66238, 140042, 304281, 497424, 625208, 725179, 783748, 889487, 860509, 1265362, 1454775, 1611711, 1785380, 1799893, 1834450, 1920697, 2057510, 1917041, 1629585, 1439323, 1279349, 1061096, 965086, 752180, 588132, 517175, 367962, 341868, 313023, 259524, 331233, 368296, 283047, 151902, 117949, 243741, 474370, 512715, 439482, 444255, 528422, 676125, 711024, 794668, 846350, 940299, 1094134, 1387254, 1594454, 1825684, 2173359, 2222940, 2099978, 1971570, 1825892, 1736606, 1637186, 1367283, 1108578, 910500, 645381, 474356, 568592, 567038, 397483, 269263, 313182, 275848, 212736, 163346, 223023]
14522B23023k3762P002l0837M9184R9022K8899k700j22354l0825O0420j1702m2472
14510B02898J8138J2577j7938L2283j12714j93716Q226R8635j4422N2300r0215
14499c948n3504J68734J54415l3677k9944r860j39173J0817M4216O1951r9072
14488G0955k09967o176J16454J10138J9144R5590j193k6892M4707r9718k65942
14477a52900m6031K14415K05393j08837m7164o1348N4840L3875l4469l069M9191
14466A03896P7575n4161M9521N7610m6728J3739o5160j53963n4475J0532O2952
14455A338J0035o2831K91290J81294j33751j03304j06000M5071l5616L396K9370
14444A20292n4044L3121J68988J3726j27017j30334r5436j05705j0017L1132j01981
$$ y = [223023, 199261, 206263, 175426, 224610, 323632, 352531, 349831, 227477, 196652, 257072, 245370, 202898, 221036, 233613, 215675, 247958, 135244, -58472, -50246, 48389, 33967, 86267, -3948, -57452, 111282, 265697, 232020, 202076, 192216, 53043, 63860, 108076, 170027, 70955, -139012, -145188, -28734, 81404, 100548, 196138, 194945, 168053, 212760, 113042, -152900, -198931, 15484, 220877, 112040, 64876, 3528, 58368, 92243, 57774, 54705, 103896, 181471, 127310, 176831, 234441, 187713, 201452, 136292, -17671, -72146, -61614, 1338, 11373, -51458, 239832, 421126, 287375, 184071, 78071, 123142, 87526, 90922, 120292, 66248, 99369, 268357, 282083, 155066, 24732, -70704, -176409, -186426, -155294, -257275]
14433b57275q279O1733J01077n3355O64J71580K5185n347l0016l2704j01393r02
14421a29032J67250M3776j3618L0329o9380P257N1810O7298j4266R6761L7017
14410B75202n4095J0583L0259l7568n9231r8375o2417n1451N3100j5344j30805
14399a40142o0643K4442j55745L9486J43656Q9779Q3648J24269J33888J24334
14389D06972P421r1557n150L1430j8687p1589k23017P3801J07111j1595j66909
14378C8231p1784o4040J42657J41087P494j13470l9436Q8303M1871l8207k8139
14367A04567l3852J70816k0885K967O7014o0968j09356n1964N2979J69035J73429
14356D63782m7225j11234o6986k8376q8690n8748Q9309K10376l791Q9270L3985
$$ y = [-257275, -265554, -203821, -102744, -156099, -155435, 16145, 41330, 35983, 5967, -26737, -128130, -129032, 38218, 81994, 68376, 98705, 29325, 36582, 88392, 155690, 141424, 238185, 275202, 221107, 231690, 261949, 224381, 165150, 66775, 4358, -47093, 6007, -9337, -140142, -200785, -176343, -332088, -292602, -148946, -59167, 24481, 148750, 282638, 406972, 414393, 322836, 317686, 349116, 330429, 258840, 35823, 109624, 216735, 205140, 38231, -33553, -97593, 45064, 186151, 193645, 80175, 40739, 129042, 170913, 132706, 104567, 70715, 241531, 220646, 223613, 290627, 229659, 120303, 68339, 121318, 290353, 463782, 416557, 305323, 238337, 209961, 121271, 62523, 151832, 362208, 358417, 447687, 481672]
14345D81672j6542q4411o3872m2579o822M4619L2089J13452K4055Q473p0300J00261
14333E20095j19240k03282M3349k344p1454Q0811J15460J16787M9894R4276l2907
14322E91445m530q9345n9060j02490j19986k35960j92O4129j45653j18662J01670
14311a18634o4238j3176J2938J73406Q2545l2615J46603j8286N2510O2M9711J36143
14299D06969l3847k45283j04307Q4542J18372m6941j28430J01559K19026J13503
14289D85163q3742N166J3053j06504j28788j327O9853K0749N1332k447r1012j33838
14277I7658j46236j10995m9649n7968K6093L6989J12906K4455J11195j9334q6449
14266f1335N8022J2884P4450J39456K2585N7554J63464Q7487o6159O3053J92983
$$ y = [481672, 465130, 380719, 316847, 274268, 267446, 312065, 344154, 457606, 481661, 490134, 419834, 520095, 400855, 197573, 240922, 238578, 167124, 247935, 363395, 480182, 530076, 624352, 591445, 586915, 497570, 438510, 336020, 216034, -19926, -20118, 44011, -101642, -220304, -118634, -182872, -196048, -183110, -9704, 72841, 40226, 186829, 168543, 221053, 221115, 270826, 406969, 373122, 127839, 23532, 108074, 226446, 179505, 51075, 152634, 371660, 485163, 401421, 406587, 419640, 313136, 184348, 183021, 252874, 273623, 324955, 322508, 231496, 97658, -48578, -159573, -209222, -267190, -241097, -204108, -91202, -66747, 44448, 25114, -61335, -3313, 9571, 84021, 223477, 246062, 303616, 467080, 554567, 488408, 551461, 744444]
14255G44444K05510l9753j43259L580M181j45043J8614R6239k2517j70372k01566
14244C50058n7154J35976o8402m9001n2117Q7317J03919J074Q9445Q2471k2135
14233F01451r4134j20426J79133J60362q0266M3277K2064l1510m9966J4171K20995
14222H65151L13431J09255p3163r396O4790Q7899k9584j29414j38254j36522N6898
14211I81091N6005p3982r6688Q7010j3228k7448R3069m7520q4548o9259K9126
14200H33628r47n5153K4755K5775j28167j6863R2639M7614J65270J34174R5012
14189A217737r2930r8271j4637j7036p5760j5416p791J00882J06478R7447M8569
14178A249272J69419R1212L2928K1405K15461J77934j49784J17538Q7892J27197
$$ y = [744444, 949954, 910201, 766942, 770522, 774703, 629660, 648274, 744513, 721996, 551624, 350058, 292904, 428880, 360478, 311477, 259360, 346677, 450596, 451670, 541115, 623586, 601451, 507317, 386891, 566024, 726386, 646120, 689397, 711461, 679951, 629985, 644156, 865151, 1178582, 1287837, 1214674, 1205278, 1270068, 1357967, 1328383, 1198969, 1060715, 924193, 981091, 1037096, 963114, 866426, 953436, 940208, 912760, 1005829, 958309, 873761, 804502, 833628, 832681, 777528, 802283, 828058, 699891, 683028, 775667, 823281, 988551, 1122725, 1217737, 1124807, 1026536, 1011899, 994863, 919103, 903687, 895896, 996778, 1103256, 1200703, 1249272, 1418691, 1509903, 1542831, 1564236, 1779697, 1957631, 1807847, 1925385, 2013277, 2140474]
14168B140474J27756J69557J83503J32483K78577M20145M25349M00714L16514
14159D595072K47814L75955L50803N29956O15609P47352R08688J201187J353365
14150A0925801J456643J938733K246133K446240K884275L336223L945619M943733
14142C4123400O673210R646140J3742865J9713989K6363330L2044469L6978258
14135A79285661M1459802M3602310M0125319L2425561K3339630J2766649q59462
14128C72145470j5186651k5684090l1714759l5868487l8243367l6531337l1929594
14121A56987185k6120830k1049826j6292044j2070189q900544o777743n052093
14114F0723916l756947k855218j935370j146413m80783M16818J270335J948151
$$ y = [2140474, 2268230, 2437787, 2621290, 2753773, 3032350, 3452495, 3877844, 4278558, 4595072, 4842886, 5218841, 5569644, 6099600, 6715209, 7462561, 8371249, 9572436, 10925801, 12382444, 14321177, 16567310, 19013550, 21897825, 25234048, 29179667, 34123400, 40796610, 50442750, 64185615, 83899604, 110262934, 142307403, 179285661, 220745463, 264347773, 304473092, 336898653, 360238283, 373004932, 372145470, 356958819, 331274729, 299559970, 263691483, 225448116, 188916779, 156987185, 130866355, 109816529, 93524485, 81454296, 72553752, 65776009, 60723916, 56966969, 54111751, 52176381, 51029968, 50549185, 50966003, 52236338, 54184489]
14106E4184489K905178M297727O243172R146023J3500332J9757633K6300007L1767333
14098A68101894L6323803M0452658M1947778L8014773K9697293J9952760Q972274
14091C83463233m780442j9058322k9449954l5454251l9009093m0490443l8327937
14084A76892791l3170985k7131942k1532655j6830092j2696347r485379p139640
14077D8905751n605015m790425m086821l562495l102582k757481k643281k319315
14069B0038336k019320j753508j423807j248395j166721j058207p98279q04359
14061I765740p96316n68495n01224l41664l94382l41897k76841l41297n49787
14052E653837l39603k24401k00887j54703k35781j38784j85508n3968j27874j64842
$$ y = [54184489, 57089667, 61387394, 67630566, 76776589, 90276921, 110034554, 136334561, 168101894, 204425697, 244878355, 286826133, 324840906, 354538199, 374490959, 383463233, 378682791, 359624469, 330174515, 294720264, 255711171, 215220728, 176892791, 143721806, 116589864, 95057209, 78227117, 65530770, 56045391, 48905751, 43300736, 38510311, 34423490, 30860995, 27758413, 25000932, 22357651, 20038336, 18019016, 16265508, 14841701, 13593306, 12426585, 11368378, 10570099, 9765740, 8969424, 8400929, 7899705, 7558041, 7163659, 6821762, 6544921, 6203624, 5653837, 5314234, 5089833, 4888946, 4734243, 4498462, 4359678, 4174170, 4120202, 3992328, 3827486]
14042C827486j44665K44072J75741l6453N77M7820m954r742j38195l40761l10363
14031C310563k94888k93641k64168k72654l28185j35755L306n2877j26961j36947
14021A407793M8741J14575J4338k0466l9226r5067k47589j20639P7105J09143
14011A248708Q595j08117j01194j3232n8846N1615j22181k63900k8642J09556
14001G22362N5431J46853j6922j5060J652P8781m5569m3802l8649j36807q8937
13990F19333J2679L507r20q1826O7129m3507o4013n877R8271J19184m6884j09101
13978E67975J07751J57j75352j25094J8057J33913n0973R0254m3351p6372L0372
13967D77337J8977p7567k7442M0189k8559r2998J15358J5377R661J61882j6446
$$ y = [3827486, 3682821, 3926893, 4102634, 4066181, 4066758, 4114578, 4109624, 4099882, 3961687, 3620926, 3310563, 3015675, 2722034, 2457866, 2185212, 1857027, 1721272, 1724578, 1671701, 1544740, 1407793, 1456534, 1571109, 1585447, 1564981, 1525755, 1430688, 1183099, 1062460, 1139565, 1248708, 1257303, 1149186, 1047992, 1034760, 975914, 1027529, 905348, 641448, 612806, 722362, 777793, 924646, 907724, 892664, 894316, 973097, 927528, 883726, 845077, 708270, 619333, 632012, 635519, 634599, 552773, 619902, 576395, 512382, 506505, 604776, 723960, 677076, 567975, 675726, 675883, 500531, 375437, 393494, 527407, 476434, 566688, 523337, 446965, 477337, 496314, 418747, 391305, 431494, 402935, 309937, 425295, 440672, 450333, 612215, 595769]
13956E95769j41087l5534J33980J71779j28887k9754P2789N032p1899o3735R7365
13945F05818P6511j78027j30718L6372j27503l728j9742k07443q8554l8236k3787
13934i9037O7029p309J19089L8916J06580J8262m0797j36873N7393R9068Q6966
13923C09287J51119p8595J1467n8787n8635o1471p9588j4806M8220m0145q8320
13912C9746P4675j0673J23997R7865j9650k8944l9247p0687m0949m253j24279
13901b399k49780j89565l4785J38158K9916M7814R4084J46654k1265L0734L5740
13890B5306N0414k45588j2694P144O5444P7352J21287J18n469M9303l8724m6712
13878D7181N2360Q1162l0993k09032k8595R8479j81857J4614M8927Q7870K9063
$$ y = [595769, 454682, 419148, 553128, 724907, 596020, 566266, 639055, 644087, 572188, 508453, 605818, 682329, 504302, 373584, 409956, 282453, 278725, 258983, 51540, -37014, -75250, -99037, -32008, -39317, 79772, 118688, 225268, 243530, 202733, 65860, 123253, 222321, 309287, 460406, 381811, 393278, 334491, 275856, 214385, 134797, 119991, 168211, 128066, 39746, 114421, 103748, 227745, 325610, 305960, 277016, 237769, 167082, 126133, 121880, -2399, -252179, -441744, -476529, -338371, -308455, -260641, -166557, -19903, -41168, -10434, 25306, 75720, -169868, -182562, -175418, -109974, -32622, 88665, 88783, 83314, 132617, 93893, 47181, 99541, 180703, 149710, -59322, -87917, 10562, -171295, -156681, -107754, -19884, 9179]
13867I179l4144O5196m9478O6765J16868l8633j51892r2716M3260p288N6254J14305
13855I7676K1138J13499p4620n8866R0794L0510r0930J1975N574l8207L436R400
13843A21379o2000l8488l3385N6425j24734J48876K16620j1255j41757j1641n6458
13832F3582M5403K858K9274O4950J01527K9450Q6573Q7809N3154q7051l1068k6959
13820D19502q0207k5055l3935O9876r113j5135L5099m5333j75190P178P3035J4009
13808B34731p4063j082R09j15739J25014J4639Q6936l9019j18856K79551O9074
13797D62095j33091Q27L3912o3119j33981J30924K0817j53264N4922J14506l5088
13786B99460P1026n6080p4159n6103k245o5264m0187J18257k0268q8286l4814
$$ y = [9179, -24965, 40231, -9247, 57518, 174386, 135753, -16139, -108855, -65595, -72883, -16629, 97676, 118814, 232313, 157693, 98827, 189621, 220131, 129201, 141176, 146750, 108543, 111979, 121379, 59379, 20891, -12494, 43931, -80803, 68073, 284693, 273438, 131681, 120040, 63582, 108985, 111843, 141117, 206067, 307594, 337044, 423617, 511426, 564580, 477529, 446461, 419502, 339295, 314240, 280305, 350181, 341068, 325933, 361032, 315699, 140509, 147687, 220722, 234731, 160668, 159586, 160495, 44756, 169770, 184409, 271345, 232326, 113470, 393021, 462095, 329004, 329831, 363743, 300624, 166643, 297567, 318384, 165120, 220042, 334548, 299460, 370486, 314406, 240247, 184144, 181899, 116635, 76448, 194705, 174437, 86151, 51337]
13775E1337j18285j08018p365J2060J45860j6928j5111l4700P1123J88583P4415
13764B42971p9478j62560k8439j0555p7705m997K1889N7294Q4611j30209p0322
13753a57500N3554L8070n237J05598K4149j4413m6691m300N9965r3612n5357J20953
13741B5179O4259J7690r0555k7197J1894n8326r8822O2655O9323p9930P9827Q9425
13729F5422k4996M2601L3260p1990n1986J027k0322M9855l4311K813K1679M310
13717A7362l915m753k814O5943O8491o3454o0150N3430m4518j21789M2653m7676
13705a01190n0925O5955K2130m5170J22655R6284q66J23855M3841l8672L770k02150
13693C9517r6312P6239L9327J2126P3683k486k6J85965N0891p9896M7138O1003
$$ y = [51337, -66948, -174966, -182331, -170271, -24411, -41339, -56450, -91150, -20027, 168556, 242971, 163493, 933, -27506, -38061, -115766, -120763, -98874, -41580, 43031, -87178, -157500, -103946, -65876, -71113, 34485, 58634, 44221, -2470, -6770, 53195, -40417, -95774, 25179, 89438, 107128, 16573, -10624, 1270, -57056, -155878, -93223, -23900, -103830, -24003, 65422, 40426, 83027, 116287, 44297, -7689, -6662, -26984, 22871, -11440, -8627, 13052, 17362, 13447, 8694, 5880, 71823, 140314, 76860, 16710, 70140, 25622, -96167, -53514, -101190, -152115, -86160, -64030, -109200, 13455, 109739, 108873, 232728, 276569, 237897, 241667, 39517, -56795, 19444, 58771, 70897, 144580, 142094, 142068, 328033, 378924, 299028, 346166, 407169]
13681D07169K40733K60215J93091K58728K37387K41957J55114p810n2692j13413
13671A820479j32994l19906j20302j47634j60130j55078k8670o9974j06270j32706
13661D46815j56281m6308k4101q0644O4413J02491O0603j38396L587J10373N586
13650C48138O5403N9203O1884k1765J19298J56312J43741J26440K00449L07119
13640A566222K53413J95240J5476P3897j34458j66315r4096k57740l32530j91220
13630I27889j48477j41171M457j65617r6687j50028m591L7396j1206Q1546R698
13619C43209j15385n5409o2588Q5053p222m9124k18694o4975m5845k361p699J50075
13607e0965J60639Q914o0092O6437J50338J66774k58276j86503n197Q3330j084
$$ y = [407169, 647902, 908117, 1101208, 1359936, 1597323, 1839280, 1994394, 1986584, 1933892, 1820479, 1687485, 1367579, 1247277, 1099643, 939513, 784435, 755765, 685791, 579521, 446815, 290534, 244226, 220125, 139481, 203894, 306385, 366988, 228592, 232179, 342552, 348138, 413541, 472744, 534628, 512863, 632161, 788473, 932214, 1058654, 1259103, 1566222, 1819635, 2014875, 2030351, 2104248, 1969790, 1803475, 1709379, 1451639, 1119109, 927889, 779412, 638241, 642698, 477081, 380394, 230366, 225775, 263171, 251965, 333511, 343209, 227824, 172415, 109827, 194880, 187658, 138534, -80160, -145135, -190980, -193341, -201040, -50965, 109674, 118588, 58496, 124933, 275271, 442045, 183769, -2734, -7931, 75399, 74315]
13596G4315j8658N2628j2639P7639Q3882j35498J3395L4370j8723m0008Q6650
13585A97353p5762o5410J20908r1292n6888q5211o9813q6546m435Q9919L8329
13574h8848R9028j9755P1234n6116j14231l641J10871O3727m7320o4509j09316
13563a58876J00687K27804o1341j86769j02714n8241J59107K08525o4920j10962
13553d7700J482l9953R791M3467M8730Q3193P292R9085J24817j05610k84029j00970
13541a60405Q3395J43297J8373M1618M3688q9127r7217r5551k9141J11829M0997
13530A1756k2090r7768O521r9302L110J9450J45071P2169O2875J73387j17445
13519A57734j36394k9456J2367o0295J5017P2244r5620m6609R0588j3393q4244
$$ y = [74315, 55657, 108285, 95646, 173285, 257167, 121669, 135064, 169434, 150711, 110703, 197353, 121591, 56181, 177089, 85797, 28909, -56302, -126115, -212661, -217096, -127177, -88848, 10180, -9575, 61659, 5543, -108688, -112329, -1458, 62269, 14949, -49560, -158876, -58189, 169615, 108274, -78495, -181209, -239450, -80343, 128182, 63262, -47700, -46218, -86171, -76380, -32913, 15817, 99010, 106302, 205387, 330204, 224594, -59435, -160405, -77010, 66287, 84660, 126278, 169966, 80839, -16378, -111929, -141070, -29241, 11756, -10334, -108102, -101581, -200883, -197773, -178323, -33252, 38917, 101792, 275179, 157734, 21340, -8116, 4251, -56044, -41027, 31217, -64403, -111012, -20424, -33817, -118061]
13508a18061Q8680J16769M0286P7496N6688R0179j16003j05871k2974j01327p4062
13497f8200L9415J33075N084j18970k0288K69205L1948j9320J16880k8423m3043
13486B97363j11484p4500r0182q3668L5893Q9387J07407o8410k4915j28329o9806
13475a21244j36237j04890j272K44782J48570Q2936R360p6354j06358O7267J27020
13464A33580n4793j45636q4598M5526J870n9810N731n1419J06255R1891o235o1717
13452g9355J36829L4589k60691j34169M3183J47183J72262N7174q8555K4118l8029
13441A4539j71444J1720p16R1873J5238J09941j6433M6130J10066J39772N8259
13430D08945j27983k70176J7155J5151L5228m3396o5768N614K4802J01436Q478
$$ y = [-118061, -29381, 87388, 127674, 205170, 261858, 352037, 236034, 130163, 107189, 5862, -68200, -28785, 104290, 109374, -9596, -29884, 239321, 271269, 251949, 368829, 340406, 297363, 185879, 111379, 21197, -62471, -26578, 62809, 170216, 101806, 76891, -51438, -121244, -257481, -362371, -363643, -118861, 29709, 112645, 122005, 45651, -60707, 6560, 133580, 78787, -66849, -151447, -105921, -104051, -163861, -158130, -209549, -103294, -11403, -17638, -79355, 57474, 92063, -168628, -302797, -259614, -112431, 59831, 117005, 28450, 52568, 14539, -156905, -145185, -145901, -54028, -38790, 71151, 54718, 100848, 210914, 350686, 408945, 280962, 10786, 27941, 43092, 78320, 34924, -30844, -25230, -428, 101008, 109486]
13419A09486M2109n4137m0537N9645J09775J29753j70887r012q7061q7282N7997
13408E9849k863L2793o0856o1990p5142J33342M7416j0489j04378j38838k4412
13397b05568j36892P0693J23035r354N571K2286n5839N5485L0488k13240J24247
13386a89088K02297N0307k6899m4685N984J21679j5987j3095j8069p5848L170
13375b34K7347Q8834M3147p1650j87558k5762m6680Q3165J41718O1137Q2380m4368
13363A51476j04497N0903p8391n4586n7372O6112R3012m7371p9944q2011m9462
13352a92131J4824l4559M6820J00970j0328m0168j0072l2799J1234O3104K09156
13341A26051K2629k1711j1317p2052l8568O4247R2156Q8494n1359j56585L6885
$$ y = [109486, 151595, 97458, 56921, 116566, 226341, 356094, 185207, 176195, 89134, 1852, 59849, 56986, 89779, 28923, -33067, -108209, 25133, 72549, 62060, -42318, -181156, -205568, -342460, -271767, -148732, -158086, -152515, -130229, -186068, -130583, -100095, -313335, -189088, 13209, 63516, 36617, -8068, -2084, 119595, 103608, 90513, 72444, -3404, -234, 27113, 115947, 159094, 87444, -100114, -125876, -172556, -89391, 52327, 113464, 195844, 151476, 46979, 97882, 19491, -35095, -92467, -26355, 66657, 19286, -60658, -142669, -192131, -177307, -211866, -165046, -64076, -74404, -114572, -124644, -157443, -146209, -83105, 126051, 148680, 126969, 115652, 43600, 5032, 69279, 161435, 249929, 198570, 41985, 78870]
13330G8870o7606q6515j9502J7881q9970j08090K13129J78419R0762n8349p1359
13319G7670o7682J2696L8843J9223R6862N4654K7772l4261n0466o1583j18568
13308d840k6230J9652O013j7678J30599N8208O111j37650l6967J50968K9681J23324
13296C01191Q3953j63299j32601j3954K3287J33845m593j0714P0874J2992j00977
13285B00004j21907j38564p3797M2273O4193P3829N2041l9627m7954j15313o489
13274a11311n6410M4968K02216K1285j60982j7162J06759O0632o4161j09040m0056
13263a23262L120J13220J03120J43607J05306n4847j50568n67p0239p5074q6722
13252i2906l8059j03427j16318J8251J15554j7940N0844J26789O8859J20086n4596
$$ y = [78870, 11264, -75251, -94753, -76872, -166842, -274932, -61803, 116616, 207378, 149029, 77670, 9988, 22684, 61527, 80750, 177612, 232266, 260038, 225777, 175311, 113728, -4840, -31070, -11418, -5405, -23083, 107516, 165724, 171835, 34185, -2782, 148186, 177867, 301191, 385144, 221845, 89244, 75290, 98577, 232422, 227829, 217115, 287989, 300981, 200004, 78097, -60467, -134264, -91991, -27798, 46031, 98072, 58445, 10491, -104822, -111311, -167721, -122753, 79463, 100748, -60234, -77396, 29363, 89995, 25834, -83206, -123262, -120142, -6922, 96198, 239805, 345111, 290264, 139696, 139129, 68890, -6184, -92906, -130965, -234392, -350710, -332459, -216905, -234845, -184001, -57212, 11647, 131733, 77137]
13241G7137j32769k50n2486J2028N4768R5996N0342n9300j58855j05912o7451
13230b86752N621M2751J09687J12468J89948O9212k5599P4642J0796j93532n1709
13219E7533p4316O7656K6495J13461j5886m5418J01181j04146p5962m8979j58946
13208a57327k3864O7455N2218P0601L996p6460Q8750j74087j08232J84458O5974
13197f518k8678m9856L56N1501J130L4681q5288p2217Q8781R1284P1049J20910
13185B17135p9676p3405J8417M3424m1688k018l3859Q4081M0918K4046M1152j5230
13173B23297k3877J609o5973q3865O0410p6331j09640m4060j980J23685J07975
13162A11250j06512j4502J37966K4358l0727m9714l8238M0745J43730k06247q2127
$$ y = [77137, -55632, -55882, -108368, -96340, -41572, 54424, 104766, 45466, -113389, -219301, -286752, -281131, -238380, -128693, -16225, 173723, 242935, 217336, 291978, 302774, 109242, 57533, -16783, 50873, 77368, 190829, 174943, 129525, 230706, 126560, 50598, 1619, -157327, -181191, -113736, -61518, 9083, 13079, -63381, 25369, -148718, -256950, -72492, -6518, -35196, -85052, -84696, -33195, -32065, 2616, -82672, -154889, -66108, 25176, 96225, 217135, 137459, 64054, 82471, 125895, 84207, 82189, 48330, 132411, 173329, 197375, 238527, 223297, 199420, 201029, 135056, 51191, 111601, 35270, -74370, -118430, -120410, 3275, 111250, 4738, -9764, 128202, 152560, 121833, 72119, 33881, 74626, 218356, 12109, -70018]
13151g0018K23211j2043p5322K0357j26670p2676k4595K1701P8897J34195j30842
13140c3805k8066P0792Q1133l2776j05050j48390n908M9098L1401M6223p5823
13129a51171j7507P497Q5030P6412o8078l8073r61O2213l5891J42478R5526l7880
13117A19595p375j00817P7357K21466J91920J07817j03899j96198j97707j12575
13107d16p6131j74466q6577J22841J95172J45984j7328r7531j2445n5963j09097
13096a65957q6922O3847J84754J78761p4168M721m0973k1202r7683j60823J08618
13085a07027J66412M2097m5111n9180m981M4103p1030k5852K7596J33454q3231
13074A7250q9573J4922j7430K0501o4435J2942K0632q3896r4794l6494O4278J67622
$$ y = [-70018, 153193, 141150, 65828, 86185, -40485, -113161, -137756, -116055, -37158, 97037, -33805, -61871, 8921, 90054, 57278, -47772, -196162, -202070, -152972, -121571, -75348, -151171, -168678, -161181, -76151, 261, -67817, -105890, -106851, -44638, -80529, 61949, 157475, 119595, 112220, 11403, 88760, 310226, 502146, 609963, 506064, 309866, 112159, -416, -76547, -251013, -337590, -214749, -19577, 126407, 109079, 11548, -897, -56860, -165957, -252879, -189032, -4278, 174483, 100315, 105036, 64063, 42861, -54822, -215645, -107027, 59385, 101482, 56371, -2809, -7790, 36313, -34717, -60569, -32973, 100481, 17250, -72323, -57401, -74831, -54330, -118765, -105823, -85191, -169087, -263881, -300375, -236097, -68475]
13062f8475J39944J50628k6350n6552j14454j34000m9915l1553k4089J05757N0297
13051e8762k6219O3402J35191k9876r2354l9713o6463J2277N4264o5100J94742
13040H1389M7919j09468j36637K271N6777p9726Q6060R0088j2832j39853j14973
13029b28985J07313Q4152r3181Q5956j4332P2504L103n5533L4325J02667j00519
13018b530r4852r9399l4173O6685N1919j423R2979l660j39861r4412l8597O0717
13006b36607r7691p7343J65627J68480Q8715J15506n5970j50476j16364l1099
12996b27222J17456j61708L3875m7623K0887J5953J5019R9614J48582j1472n3023
12985d9662r9998k0830k6606J04163P2671N8696l2047r0965k2734O6091N6959
$$ y = [-68475, 71469, 222097, 195747, 139195, 24741, -109259, -159174, -190727, -214816, -109059, -58762, -84981, -21579, 113612, 83736, -8618, -48331, -114794, -102517, -48253, -113353, 81389, 129308, 19840, -116797, -114526, -57749, -137475, -51415, 38673, 25841, -114012, -228985, -121672, -37520, -130701, -44745, -59077, 13427, 16530, -39003, -4678, 97989, -2530, -97382, -196781, -230954, -164269, -112350, -113773, -20794, -24454, -164315, -258727, -297324, -236607, -334298, -411641, -246014, -77534, 11181, 126687, 70717, -79759, -196123, -227222, -109766, -271474, -237599, -285222, -264335, -248382, -233363, -133749, 14833, 3361, -49662, -149660, -170490, -197096, -92933, -20262, 38434, 6387, -84578, -107312, -41221, 15738]
12974A5738N7694q2921r2239m2255o4634J61161k6255n3016Q8250J79338k4609
12963A16252k0207q6319o4702p7622J5849J27356Q2989N3940J12588p3880j48253
12952C7991j0429P6097j16334j51971M4127r6607L4631R277K682J31253J56365
12941A17082Q5719Q049P8304l5978q2785j81767j46629J4728J5003k3514n629
12930a57417M7123j3773r7689m9854O8097J32926M5739M8277P666N172j6335k9294
12918i362L0028K4959K6921j48463j1113M0176P0595M9152J282L4149j62024P037
12906d6663O1033P820j48045M5388q318n7133p0860Q5741L4455N7692o4781j53588
12894b57259K0973P9257p8394o3670J57857p1464j27595J63077N2193M2577L6558
$$ y = [15738, 73432, -9489, -101728, -143983, -208617, -47456, -73711, -126727, -38477, 140861, 116252, 96045, 9726, -54976, -132598, -116749, 10607, 93596, 147536, 260124, 186244, 37991, 27562, 103659, -12675, -164646, -120519, -217126, -182495, -173218, -170536, -39283, 117082, 202801, 210850, 289154, 253176, 170391, -11376, -158005, -143277, -128274, -151788, -157417, -110294, -124067, -221756, -271610, -203513, -70587, -24848, 23429, 31095, 36267, 19932, -9362, 20666, 45625, 72546, -75917, -87030, -46854, 23741, 72893, 74175, 108324, -53700, -46663, 14370, 22190, -125855, -80467, -88785, -145918, -216778, -131037, -96582, -38890, -103671, -257259, -236286, -157029, -235423, -299093, -141236, -212700, -340295, -177218, -125025, -82448, -45890]
12883d5890J128k2658J7470j7258k4376O1466L5645P1375l9505n1281j17123r8658
12871b29665L604J30746R3103L8095r9717j61351J0927R3783J9447M2155J24007
12860F5134N3248O588j37083P6661j6544P0532K2200J53763J9371n2647j86236
12849G4987j7531o7122q0014p0755J61523K3850p2883n8671o5989q973n3005J10483
12837a24100R1253J87498l2526K782n885R613J3113j39733l5443L8666J10697
12826A15935R3151j10248n1039M4138l9134l2896J6259K7077P0007n5304o0399
12815A7547j143M1242l0924q3005J0710J1593L0086m239p5521M6444k3183n2277
12803a12670j5932p959N3167k8300r1677m7007K3377J725N7195R4898J63549K2986
$$ y = [-45890, -44762, -67420, -49950, -67208, -91584, -30118, 5527, 76902, 37397, -13884, -131007, -229665, -226061, -95315, -2212, 35883, -63834, -225185, -214258, -120475, -101028, -58873, 65134, 118382, 124970, -12113, 64548, 48004, 118536, 140736, 294499, 313870, 261223, 74987, 57456, -9666, -89680, -160435, 1088, 24938, -47945, -106616, -172605, -181578, -234583, -124100, -32847, 154651, 122125, 124907, 119022, 128635, 141748, 2015, -33428, 5238, 115935, 209086, 98838, 47799, 91937, 52803, 19907, 36166, 63243, 133250, 77946, 17547, 16404, 57646, 26722, -56283, -45573, -33980, -3894, -8133, -83654, -37210, -60393, -112670, -128602, -136561, -83394, -111694, -203371, -250378, -227001, -225276, -168081, -73183, 90366, 113352]
12791A13352m1263J5107N9614j23841j3616M7382J41870r5959n7578J74818M5744
12780B65630j71857j56502M2114K8252O5457n3027M6661Q8032M0513j12955K0525
12769A02843O6953j99256Q5486J03212j27871N8712l9832J32255J83039j90672
12759A74869p9226p5696o1763n4356J5235j28858J14922J12780j0659O183M5222
12748E8653p7649K0153p709J11535J95964J07380j64492j29987p9861p3657K9654
12737a0016J03161m65O287p9430k71889K1608J58428J18740J1281j19158O1828
12726C75p5868l074K8366L6657l6309j39968l31J44378K04318p8999k5541J0321
12714F4325K5630M9262L491r0484j19423Q5730J9715O0210j38821p3076N689o4297
$$ y = [113352, 72089, 87196, 146810, 22969, 9353, 56735, 198605, 102646, 45068, 219886, 265630, 93773, -62729, -20615, 7637, 73094, 20067, 66728, 154760, 195273, 82318, 102843, 169796, -29460, 56026, 159238, 31367, 90079, 50247, 182502, 365541, 174869, 95643, 19947, -41816, -96172, -80937, -209795, -94873, 17907, 7248, 13431, 58653, -18996, 1157, -6552, 104983, 300947, 408327, 243835, 113848, 33987, -39670, -10016, 93145, 92680, 98967, 19537, -252352, -230744, -72316, 46424, 57705, -61453, 375, -75493, -78567, -50201, -13544, -49853, -189821, -190152, -45774, 158544, 79545, 54004, 64325, 89955, 139217, 142708, 52224, -67199, 18531, 38246, 98456, -40365, -113441, -107752, -172049]
12702a72049J0892L3826k1809K0789O2048m5061j08390k0696M4341R418O9960
12691a16731k6558J165N2227o310Q1134m7661m8392L8502j9012L4351N0733n5022
12679f1574P3400L4062l5508n3680q9115j06545O6124O8027M7688j0056O0975
12668f202k1217O4278N3109K8772p068j3142J5590J2104J5045p5611p3006j84196
12656a91544j9263M3296K19300J33349j8309k03971j06733P1818j2391p3886p2551
12645b30885O9032Q6839J19395n2186r2074k8630k4838M197J40965K3739K1252
12634C6806J2794N1191O0953P8642N6403q8811q6366q7965n8631j43598o7180
12623b35762l0084n3169J43436J70368K00998k4094j44236l8159q0103O823o0156
$$ y = [-172049, -161157, -127331, -149140, -128351, -66303, -111364, -219754, -240450, -196109, -186691, -116731, -143289, -142124, -89897, -96207, -15073, -62734, -111126, -72624, -91636, -57285, -6552, -61574, 11826, 45888, 10380, -43300, -132415, -238960, -172836, -104809, -57121, -67177, -6202, -27419, 36859, 89968, 118740, 111672, 98530, 114120, 126224, 141269, 65658, -7348, -191544, -210807, -167511, 51789, 185138, 166829, -37142, -143875, -72057, -84448, -158334, -230885, -161853, -75014, 44381, -7805, -99879, -128509, -153347, -149150, -8185, 15554, 36806, 49600, 100791, 161744, 240386, 296789, 207978, 121612, 33647, -24984, -168582, -235762, -265846, -319015, -175579, -5211, 195787, 171693, 27457, -10702, -90805, -83982, -144138]
12612a44138q6062J09271R7835j10155L5675O8782r6439p4062K0146N5795P8354
12601d4998J60023J08915q4801q166J12763M964l3811n7176j21996j6439j9038
12590B40K614p0399j13561R1715j0533p1953J61596J06561n9822j90700M6460
12579a07782l1199j71379K4423J69133P748j03902P9361j9498k6958P5805J64237
12568E9989M5103o7161j27773p4925j40J08431O4514o2554o958M4585o6405N1062
12556c2232J45841m0215O4293k1763j96488m8440K5731j198J38142J04638N3118
12545A91427j68243J0558n6248j01492J3647n0555l5165l1656M3308Q0006o1112
12534a65525M7639J38443J6104N3716J02035K0885K7410q5308j708K7972l7851
$$ y = [-144138, -230200, -120929, -23094, -133249, -97574, -28792, -125231, -199293, -179147, -123352, -44998, 115025, 223940, 139139, 130973, 243736, 248700, 214889, 157713, 35717, 19278, 240, 2854, -67545, -181106, -89391, -99924, -171877, -10281, 96280, 36458, -154242, -107782, -138981, -310360, -285937, -116804, -109056, -212958, -133597, -153095, -180053, -104248, 59989, 105092, 37931, -89842, -164767, -164907, -56476, 8038, -54516, -61474, -16889, -83294, -32232, 113609, 73394, 137687, 115924, -80564, -129004, -103273, -104471, 33671, 138309, 191427, 23184, 33742, -22506, -123998, -110351, -160906, -196071, -227727, -184419, -104413, -165525, -117886, 20557, 36661, 90377, 192412, 213297, 240707, 155399, 153691, 181663, 143812]
12523A43812p6768Q4751J17284J007j9220J4281N2059o2140k11246j96064R626
12512a42618J04627l466O4639J18872p7577j15597j5089j1245K9612J35800K3881
12501A11839k27398O6688L2233J14694R6590Q9833o5906j37383j50770J9365N7357
12490G142m0417j6636M2865l0046p702K3728j4479l8720O8505Q7465Q5209l3304
12478A33610n4583j01117j23083j3982J86036J06898j9984p0858j8476k9142J06672
12467A01991j7401K9116l1127k1137O4693o6564n3576p8332L399o5334Q644J29082
12455C454j96260P528K8669K7425J5260M8739J60521J26259K2657r5783j70209
12444b1740p6921m6797K5604O4397O9863O9014n6320j09576K9105K3661m1990
$$ y = [143812, 67044, 151795, 269079, 270086, 250866, 265147, 317206, 255066, 43820, -152244, -142618, -37991, -41457, 23182, 142054, 64477, -51120, -66209, -77454, -47842, 87958, 111839, -115559, -48871, -16638, 98056, 194646, 284479, 218573, 81190, -69580, -50215, 7142, -33275, -49911, -7046, -37092, -44794, -21066, -35545, -74265, -5760, 81705, 166914, 133610, 79027, -22090, -145173, -159155, 26881, 133779, 113795, 42937, 24461, -4681, 101991, 84590, 113706, 82579, 61442, 126135, 59571, 5995, -72337, -68938, -134272, -125628, 3454, -192806, -185278, -156609, -129184, -113924, -65185, 95336, 221595, 244252, 148469, -21740, -98661, -145458, -119854, -55457, 14406, 83420, 27100, -82476, -53371, -29710, -71700]
12433g1700R072J19257J1733j03338n1796P4109K9164j29736J20001j0068m6286
12422d9588R0492Q99m6091K6177K48050q4087j29395n1663n1524L4516N4666j0922
12410C1530K4123J17112J01857p274j17617j17287q1975r5266j31354J51368O506
12399a18277p1890J08457Q982P9579N8385m0735j5439q5240r1241M305Q010J030
12387a54074P8172P178K49362J12638q8822j47398r9473P8197J89234j44979p2724
12376G311L8458j6284o8550P260K18548j589O48Q642j14296o6658j5356j0832
12364a2698j7146o5143l5018k7067R7985K00566J01185j08711j60819j45415J11626
12353f0655M2513m8551K92L6791M2915k4589j73652M6152J71624Q8547k1547j0201
$$ y = [-71700, -62628, 56629, 68362, -34976, -86772, -12663, 16501, -113235, 6766, -3302, -49588, 40904, 41803, -4288, 21889, 269939, 185852, 56457, 4794, -46730, -12214, 42452, 31530, 55653, 172765, 274622, 267348, 149731, 32444, -49531, -144797, -276151, -124783, -118277, -190167, -81710, -72728, 6851, 65236, 24501, 9062, -76178, -167419, -163114, -155104, -154074, -75902, -68724, 180638, 293276, 204454, 57056, -42417, 35780, 225014, 80035, 7311, 45769, 29485, -39065, -31805, 186743, 185154, 185802, 194444, 80148, 13490, -1866, -12698, -29844, -94987, -130005, -157072, -59087, 141479, 242664, 133953, -26866, -172281, -60655, -18142, -66693, -66401, -29610, 13305, -11284, -184936, -138784, 32840, 121387, 99840, 89639]
12341H9639r0808r2244j3966K6643K2598P8695L6749j23749m1218J2344M2604
12330e2713M1629r1582r3202k1763J63802q899P0463J71338M1946q4138k29645
12319i2764K3638j9286L0657J56748N6967k3986J41389j94101q7872k8777j72879
12308b10266j33384K5569Q5749N1221J45505M608l4750l2123J82328N9467N7721
12297B01645r3748r5034r496O8881R62j74641j1879Q976J50060l1373K4459L3594
12285G2406k0772r8210N2276K3649p7140N9329J87243N3469q1140N8426N6141
12274B85677J04072j41654j72990N2509J20889j12389l2188K5147k2670j91963
12264h5560j29214J9224J17705K00563p1642o5355Q4215J14428k9718J3192J7260
$$ y = [89639, -1169, -93413, -107379, -80736, -58138, 20557, 57306, -66443, -107661, -95317, -52713, -11084, -102666, -195868, -217631, -53829, -62728, 7735, 179073, 221019, 136881, -92764, -69126, -88412, -57755, 98993, 155960, 131974, 273363, 79262, -8610, -37387, -210266, -343650, -318081, -232332, -181111, -35606, -30998, -65748, -97871, 84457, 143924, 201645, 107897, 12863, 3367, 72248, 73210, -101431, -113310, -104334, 45726, 14353, 38812, 72406, 51634, -46576, 5700, 29349, -47791, 11538, 198781, 252250, 171110, 229536, 285677, 389749, 248095, 75105, 127614, 248503, 136114, 103926, 129073, 106403, -85560, -214774, -195550, -77845, 122718, 51076, -14279, 69936, 184364, 154646, 167838, 185098]
12253A85098j72805o9678J45569J05816j18178j44771j64162P370K16551O5021
12243E5831O0606M4295q2106k5209j18476k7323P772m1153P739l9131n4755O440
12231b05470L5868P4632N2593J03620N8468J11747m4865j91024r7401J4195L0433
12220e7204K165j8696J765M9327O0010r7523j87551O6183M5390J7886K7097m8813
12208a39964j26377J22844J23087j53600N3949P9092K6746R645n8563j68033M5747
12197a85427J78626N998j53018J4881J26608N5818j52579o4746q0061L0634j4141
12186b37407o5380J10207j7075J03043Q5157M6115j30891o0100j08596K3722J18348
12175a32857n319K2838J61316n7001J23257l7122l1334j4979O1528K1065J8608
$$ y = [185098, 12293, -57385, 88184, 194000, 75822, -68949, -233111, -225741, -9190, 55831, 116437, 160732, 78626, 53417, -65059, -92382, -84610, -125763, -118024, -157155, -211910, -205470, -169602, -94970, -42377, 61243, 119711, 231458, 186593, -4431, -101832, -87637, -57204, -55039, -73735, -71970, -22643, 37367, -60156, -247707, -181524, -136134, -118248, -91151, -139964, -266341, -143497, -20410, -174010, -120061, -40969, -14223, -4578, -63141, -231174, -185427, -6801, -803, -153821, -138940, -12332, 43486, -109093, -173839, -253900, -223266, -237407, -302787, -192580, -209655, -106612, -21455, 24660, -106231, -166331, -274927, -251205, -132857, -138176, -115338, 45978, -11023, 112234, 75112, 43778, 28799, 90327, 111392, 130000]
12164A30000j7079m9613q2705L4332M2124n8463n7957P0554k1582r1852j9986
12153a22227j9814m0892l5769L2451P3843K5109M1739q0266M5932n6920K0268
12142a16546Q361N9716m0401Q5952j09489n95k7480k3247L5529p874O9195K00670
12130A33791k922j57200m3137Q8340k1275J432Q6964j90473k20407O7492J92543
12119f4852R7884L1437N7675Q4553j4864q932k6631j78201N2300J02889m0191
12108I3067o9920k1021m9116k8024K8913r378P316o1607r1904N5536J59283J32788
12096A45933j48184j02889M0826M9714O4357l1339Q1679O4358j11716L1558K8123
12085A12420m3041j90318l9838n4564k3678L2787J34705J16575K4019J5826J20474
$$ y = [130000, 112921, 63308, -19397, 14935, 57059, -1404, -59361, 11193, -10389, -102241, -122227, -142041, -182933, -218702, -186251, -112408, -87299, -45560, -125826, -79894, -136814, -116546, -108185, -48469, -88870, -2918, -112407, -113002, -140482, -163729, -128200, -136074, -66879, 133791, 130869, -26331, -69468, 18872, -2403, -971, 85993, -104480, -324887, -257395, -64852, 33032, 64469, 122144, 206697, 191833, 182901, 156270, -21931, 30369, 133258, 93067, 23147, 2126, -46990, -75014, -46101, -55479, -48163, -109770, -201674, -146138, 13145, 145933, -2251, -105140, -64314, -14600, 49757, 18418, 100097, 164455, 52739, 84297, 112420, 69379, -120939, -160777, -215341, -239019, -206232, -71527, 45048, 69067, 84893, 205367]
12074B05367j01213j24131r7895m3343N8573j22080P5749J66484L0205M0421P046
12063I5183N762j33043m155n3031L2628j2587M3089n198l922l7231K9486O3799
12051B0780K9533j2195J4734k454j95401j47579J03342O0352L9045J00088n8909
12040d8664n0362j24377J18518J7334k089j15276J1177J50416j0457j20090N5935
12029a17935m0707P2676K3066k4488P2501N5224n2481k3442n6268p2128P6150
12018h7832J02414R4404L1559j35218j08751o4596Q08P8811J08300n0345n0430
12007h0876J18656Q9899l9739r901L9937l3397m5563n4102K7430N5522l9601L0170
11995E8435M5621J5370j41849M7152J1328J77572N6835q0927J2749o4324p0617
$$ y = [205367, 104154, -19977, -117872, -161215, -102642, -224722, -148973, 17511, 47716, 88137, 95183, 100945, -32098, -36253, -89284, -56656, -69243, -26154, -31352, -35274, -72505, -43019, 20780, 50313, 38118, 52852, 50398, -145003, -292582, -189240, -128888, -89843, 10245, -48664, -99026, -223403, -104885, -87551, -89640, -204916, -193739, -43323, -53780, -173870, -117935, -158642, -85966, -62900, -87388, -14887, 40337, -12144, -35586, -91854, -163982, -87832, 14582, 108986, 140545, 5327, -103424, -168020, -167212, -88401, 19899, -30446, -80876, 37780, 127679, 87940, 78039, 117976, 84579, 39016, -15086, 12344, 67866, 28265, 58435, 104056, 119426, -22423, 24729, 36057, 213629, 270464, 189537, 202286, 137962, 67345]
11984F7345P02K0696R3854l566r4354j73660j99599r2069J10289J87649J20956
11973C8243n4454k33327N2890J17454o08n3701k5962O3290J29308J052n9557r1444
11961a16816k01891l5981K2331J75252R5520k8640L268j05071j23257K14854J65084
11950F4653M6671M8129q4027j42417L9303J4159j40704J9997O9557R4750N7381
11939H7452M4944j12695k18626Q3361J76772J32203J0358k36962k74754P0078
11929b37869O3022R987J69040J0088p5348Q5217Q7954M1274l6198p3656j9599
11918B3912o530l9041P4828Q182j8347O0494j29729j20534p8616K15931J25632
11907A16182q0530r4196N1855M5528J1779j14645j46124n0995o305L2600J03334
$$ y = [67345, 68047, 88743, 182597, 179031, 84677, -88983, -288582, -380651, -270362, -82713, 38243, -16211, -249538, -196648, -79194, -79802, -133503, -159465, -96175, 33133, 34185, -25372, -116816, -318707, -354688, -332357, -157105, -61585, -90225, -86957, -192028, -315285, -100431, 64653, 111324, 159453, 75426, -66991, -27688, -13529, -154233, -134236, -64679, 30071, 87452, 132396, 19701, -198925, -115564, 61208, 193411, 203769, -33193, -307947, -237869, -174847, -164860, 4180, 14268, -61080, 24137, 112091, 153365, 117167, 43511, 23912, 17382, -21659, 53169, 61351, 43004, 103498, -26231, -146765, -225381, -9450, 116182, 35652, -58544, -6689, 38839, 50618, -64027, -210151, -261146, -267451, -234851, -131517]
11896a31517J06359Q7059K63023r4951o8856L4023O3312k19224n4524M0642n9204
11885c3858r5788K1121J7928K0237J8132j07886K09840P0961k2286j19453j41836
11874a62888q4336R8804l1768Q935J51056P9215n5360K0793M9309K6741P5208
11863A75709j2894m2749L2840Q205l3473j61062q0015K3978O5051J15223l3170
11852E7643j90615o0134K6032O4946J171O035J58522M852p6239q2323J26141p4480
11840c8449q1511O5873l8428k5290J25284j09195N807l1327J32539R7448k4598
11829G8153O3368k5636k8005p5841J7727J09224j3745j8304q8011j36862k8105
11818a46037m6429J05203K71197k2452j27962j41229k1619q2571J29127l5537
$$ y = [-131517, -25158, 61901, 324924, 229973, 161117, 195140, 258452, 39228, -15296, 25346, -33858, -129646, -108525, -90597, -70360, -52228, -160114, 49726, 120687, 98401, -21052, -162888, -247224, -148420, -180188, -171253, -20197, 59018, 3658, 24451, 73760, 100501, 175709, 162815, 120066, 152906, 161111, 127638, -33424, -113439, -89461, -24410, 90813, 57643, -132972, -193106, -167074, -102128, -100957, -94922, 63600, 68452, -7787, -90110, 36031, -38449, -119960, -54087, -92515, -117805, 7479, -101716, -95909, -127236, 5303, 102751, 78153, 141521, 115885, 87880, 12039, 29766, 138990, 125245, 106941, 18930, -117932, -146037, -192466, -87263, 183934, 161482, 33520, -107709, -129328, -211899, -82772, -118309]
11808a18309l6217n8769n2009N5334J15705j3739R105R0767n76j8251R4631n2518
11796A5154j2155n8582L1401R5328j16648J0762j53452Q5115J02313K1812m7129
11785b6081m2167J14872k7019k1858j24175n0359K3819N6287J68586R4318J25403
11774B91626N4023m5768l3955p8952j67859j26153Q8004Q7226j8712o9451N8887
11763C8916p2154j75579L7235J34988N8288m7280L5673l3889j79214j44401L4805
11752c12612J41148o9408o9136J06898Q0437n3298L8899M7384q0253R5362R3616
11741A9037m5979m3912j23995j30645Q5139k0017m7426N1648K00005J98692p1503
11730G1044j22146n5536J30944J58165j9163l3887J6168K3911n1525j35269q9435
$$ y = [-118309, -154526, -213295, -265304, -209970, -94265, -108004, -98899, -8132, -8708, -26959, 67672, 15154, 2999, -55583, -24182, 71146, -45502, -34740, -188192, -103077, -764, 21048, -26081, -68248, 46624, 19605, -2253, -126428, -176787, -152968, -96681, 71905, 166223, 291626, 345649, 299881, 265926, 186974, 19115, -107038, -19034, 68192, 49480, -19971, 38916, -33238, -208817, -171582, -36594, 21694, -25586, 10087, -23802, -203016, -347417, -312612, -171464, -240872, -310008, -203110, -122673, -175971, -137072, -89688, -169941, -74579, 19037, -26942, -70854, -194849, -325494, -240355, -260372, -307798, -256150, -56145, 142547, 71044, -51102, -106638, 24306, 182471, 163308, 129421, 145589, 169500, 117975, -17294, -106729]
11719a06729p1323N5246R1306l261J77523l2376j84485l7697J04867Q1296j04000
11708b9633p7703p8737n0124M1862l0084j7347J5469k6586O4665P4095J3675k453
11696a02901j4255n568R473J2913P5282O6612p2396J9010j02090j9880Q4415J3456
11684c5929J09303J37834J5089m5891q7045j99065k1442J36410J22976m2402J42058
11673B31896L1220j51313p1801N1800j19408L3775N8434q5385k6522O0568k9514
11662a6250k5225l944K1226P9561P4937p2274n1701p6371q8875j80538J3568J57508
11650a68378O9900J9817K5134J20152l8184k01537l5405J22042l593J04124O9764
11639H3836Q1252q9279n2130j17935K1172J8192O9808N5136J42952L3876j29991
$$ y = [-106729, -178052, -122806, -31500, -34761, 142762, 110386, -74099, -111796, -6929, 74367, -29633, -107336, -186073, -236197, -194335, -224419, -241766, -226297, -252883, -188218, -114123, -100448, -102901, -117156, -122724, -113251, -100338, -25056, 41556, -30840, -11830, -113920, -133800, -49385, -35929, 73374, 211208, 226297, 180406, 93361, -105704, -127146, 9264, 132240, 89838, 231896, 263116, 111803, 40002, 91802, -27606, 6169, 64603, -20782, -47304, 13264, -16250, -41475, -45419, -24193, 55368, 130305, 58031, 6330, -70041, -158916, -339454, -325886, -168378, -98478, -78661, -53527, 66625, 28441, -173096, -208501, -86459, -90052, 14072, 83836, 165088, 75809, 23679, -94256, -73084, -54892, 14916, 70052, 213004, 246880, 116889]
11628A16889j18527l267r4072l9377K0346N9753R3623J17182j10103j63114n0043
11617a70710P8390r6738Q4282J19511k0910n7249r3122p699J8580o2172M8106
11606a59731M5514j15178n0686l5336j74357m7323J75856J41486O7276J63513
11596A1034J59244k0201o2189j10439j1753K56j58985K3577J10532J20807q3042
11585b1159j73581k20982R0114R0157l5348R5831O6217L1752J06724m5115m247
11574a9637l899j03877j02720L1326N6149O3490J47507j5031j00079R470m7935
11563h5236N3838l9090k6536N3658M9916O0611m9343r324p4874j2320N1047J27418
11551I9765o4449K218j0074r7298j8310J1209p9187l4278L6867k1549J29458J16332
$$ y = [116889, -1638, -4905, -98977, -138354, -118008, -58255, 35368, 152550, 42447, -120667, -170710, -92320, -189058, -104776, 14735, -6175, -63424, -156546, -164245, -145665, -207837, -159731, -114217, -229395, -280081, -315417, -489774, -537097, -361241, -219755, -152479, 11034, 170278, 150077, 87888, -22551, -34304, -34048, -193033, -169456, -58924, 61883, -21159, -194740, -415722, -325608, -235451, -270799, -174968, -108751, -76999, 29725, -15390, -19637, -23536, -127413, -230133, -198807, -142658, -79168, 68339, 53308, -46771, -37301, -85236, -31398, -70488, -97024, -43366, 6550, 67161, 17818, 8494, -66380, -78700, -27653, 99765, 35316, 37534, 27460, -69838, -88148, -76939, -156126, -190404, -153537, -175086, -45628, 70704]
11539G0704L6498k2780j7084l4880j40884j14345l1706j7749K5711J15372J61829
11528C0686J24466R785j6756q2239l2162n4869J15184O8790K337j94754j38678
11517a68210J05261L903K8266J46980j8719j37516j18077P0057K10301n2806j97885
11506a28445q9578K8558m6514m7810J28473K6841m8110J01530P5889l8777j06353
11495a44296m175J11735r0169N1462M3097P6071P9417R6580K0898n4375j90265
11484d020r2022k7752Q7788J3428J18450Q3673j19284l9706p3626j5565J06665
11473C8029p2542j5206K12445R2902r5092j4087O9788O7206l9892r7164r5796
11462E0591l0492j17119J5725N3517O2582l7748j4659J0680O3603L4317m4290
$$ y = [70704, 107202, 84422, 67338, 32458, -108426, -222771, -254477, -272226, -246515, -131143, 30686, 155152, 164937, 148181, 65942, 33780, -21089, 94095, 162885, 165222, -29532, -168210, -62949, -59046, -30780, 116200, 97481, -40035, -158112, -88055, 122246, 69440, -128445, -218023, -189465, -235979, -283789, -155316, -128475, -176585, -75055, 834, -37943, -144296, -148471, -36736, -126905, -75443, -32346, 43725, 123142, 219722, 240620, 186245, -4020, -96042, -123794, -36006, -22578, 95872, 179545, 60261, 20555, -53071, -68636, 38029, -34513, -49719, 162726, 255628, 160536, 146449, 216237, 283443, 243551, 146387, 50591, 20099, -97020, -81295, -27778, 34804, -2944, -17603, -6923, 56680, 90997, 46707]
11451D6707J2942o6302l122J07831l7197k08578j05191J23922J5817k3494Q1010
11440e5655J32662M6165m47M4225q1415j27023J9046j47468R7410J53594R6320
11429A77414m3261J547L0642K6323m6965j08066j60674N0570N9227J40511J25277
11418B52545j91600r7847J6004R3279n1625J5472K2939p7207j12P694r900O4685
11406D4327J5223l1169Q4181K02683m4365j85414q3212j32309p6902J9818k6200
11395b13339M6922K7645l4059Q9386J33239M343q7511j6249J71438P5372j25060
11384G2127L9342q057j36082k3453O8653M0691r0375l6900j9029o6360j6589l999
11372a80031K02647J97830L8787N954j31249j54422K6447k416m2869o450K769
$$ y = [46707, 59649, -6653, -9775, 98056, 60859, -147719, -252910, -128988, -113171, -136665, -55655, 77007, 123172, 122725, 166950, 85535, -41488, -22442, -169910, -72500, 81094, 177414, 134153, 135700, 166342, 192665, 145700, 37634, -123040, -72470, -13243, 127268, 252545, 60945, -36902, -20898, 72381, 20756, 36228, 59167, -18040, -18152, -10458, -20358, 44327, 59550, 28381, 112562, 315245, 270880, 85466, 2254, -130055, -206957, -187139, -213339, -166417, -138772, -172831, -83445, 49794, 54137, -33374, -49623, 121815, 197187, 72127, 111469, 103412, -32670, -56123, 12530, 53221, -37154, -74054, -93083, -159443, -176032, -180031, 22616, 220446, 259233, 265187, 133938, -20484, 5963, 3547, -39322, -45772, -43003]
11361d3003j80532m2020j4608R482J40678M0626m5179L1122J02469j06671L7308
11350g0328J23939J27391n8239j05522r0874j0070J20012q9283p3429k0408M9825
11339i6986J48531J04900o3286L7914K4098j25450n5944J19439K1550p3211q7596
11328d6041J00820K6640J43325L1951j23877r3724J1308p0486r3845j6212q5590
11317b15731k2470j796L1155O2360J35606J40403r4872j05626Q2379J3612q9390
11306f4370J40640j8938J44590L9416L2912j1203j49966r8929o1676J57739J0060
11295A20275q231l9002k3056k03776p1059m3344M015J40045L6304j83600K1331
11284b50098L9502q6430r4210Q4011K00476J72890M6775p7401o0395p0023O0054
$$ y = [-43003, -223535, -265555, -280163, -270681, -130003, -89377, -134556, -103434, -965, -107636, -70328, 53611, 181002, 122763, 17241, -73633, -83703, 36309, -52974, -126403, -146811, -96986, 51545, 156445, 93159, 131073, 155171, 29721, -26223, 93216, 114766, 41555, -46041, 54779, 81419, 224744, 256695, 132818, 39094, 50402, -20084, -113929, -130141, -215731, -238201, -239997, -208842, -146482, -10876, 129527, 34655, -70971, 11408, 25020, -64370, 76270, 57332, 201922, 241338, 274250, 263047, 113081, 14152, -47524, 110215, 120275, 112044, 73042, 49986, -153790, -224849, -268193, -264178, -124133, -87829, -271429, -250098, -210596, -297026, -391236, -307225, -106749, 66141, 112916, 35515, -24880, -94903, -34849]
11273c4849N866K0521O9925K5337j4688j7719j58156N5430J21444j46756J4095
11262e9550n1470j7769j60m5207L7500P0923L4918K6116o5149K3797j05682r8635
11250b50368m9078J09697J66363J43982M602j82000m8831o0510O6809j0872n5647
11239a65853L5989J48274J674m8111m2404P4538m8893Q689P2557r647K6187k19187
11227a66187j81809J12659J70302J58804l4200r5872r0989j12413P570J99601
11217c2534K4485L0534k0854L9593l6768m4788j14263N9856j9118K3634L7516
11206e2707o7182k5907M3370r2592m7296P4666Q3053o1030K4910K0754K9447J61967
11194I1453j09327j50034j02608N7661l2889J61116Q8315p5027o253o8823o0396
$$ y = [-34849, -28983, -8462, 61463, 86800, 72112, 54393, -103763, -48333, 73111, -73645, -59550, -111020, -128789, -128949, -174156, -136656, -65733, -30815, -4699, -69848, -46051, -151733, -250368, -299446, -189749, -23386, 120596, 125198, -56802, -105633, -166143, -99334, -110206, -165853, -129864, 18410, 20084, -28027, -70431, 4107, -44786, -36097, 36460, 26813, 53000, -166187, -347996, -235337, -65035, 93769, 59569, -36303, -127292, -239705, -232135, -32534, -8049, 22485, 1631, 41224, 4456, -40332, -154595, -94739, -113857, -90223, -52707, -119889, -145796, -102426, -195018, -242314, -167648, -84595, -145625, -120715, -99961, -70514, 91453, -17874, -167908, -270516, -212855, -245744, -84628, 3687, -71340, -77593, -146416, -206812]
11183b06812K2083K8577O8237O4106K1817k0473n4286o6747J97838J3811q8341
11172b0190j04528J3842L2694P3965N7527J5476L1844Q9597L7353q0588n5333
11161I1659q2627k7061J69012K3019j20776j9693l435q1987K6892L7895o5030
11150e2132q3012N6566Q8135J66656n5030j22975J44609R8756n4240m4326O290
11139A49297J18484M6923N9901j92023l3079K6559l9682j10329j46445m7639R6980
11128g1053n7276J3729L7526Q223N4435p210j75310Q6184P5025M8117j3841r2163
11116i3614q2970M0746N8397J41436N0579j90015q1493P7617N7917j56099n7507
11105b35006Q6580P1775o4770R7865n5543%J03709J30752l7368K6800o736m3777
$$ y = [-206812, -184729, -156152, -87915, -23809, -1992, -22465, -76751, -143498, 54340, 68151, -20190, -124718, -110876, -78182, -4217, 53310, 68786, 100630, 190227, 227580, 146992, 91659, 9032, -18029, 150983, 174002, 53226, 33533, 30098, -51889, -24997, 12898, -52132, -135144, -78578, 9557, 176213, 121183, -1792, 142817, 241573, 187333, 143007, 149297, 267781, 314704, 374605, 182582, 149503, 176062, 136380, 26051, -120394, -168033, -71053, -128329, -114600, -77074, -68851, -14416, -21626, -196936, -110752, -35727, 12390, -1451, -93614, -176584, -135838, -77441, 63995, 114574, -75441, -156934, -79317, -21400, -177499, -235006, -148426, -76651, -141421, -43556, -99099, -99099, 4610, 135362, 97994, 124794, 118058, 74281]
11093G4281P819p3239m7150j01096J2111k489J562p1624K525J80589r465M0208
11081A4032O6933O1857k8488n5777j16585q3905J15463R4053O9634j1211l1068
11070I4938L6700K3670J079m4025J539K7453J13940L6852K5096J19661j03264
11059C33639j68121n4156Q8464j09574k2183N4137O3692j21795j03236j4603p4249
11048a27985n2198o0606k7402m9845M9144J12944K957o9957J31385J10860K5714
11037D5011N4794L559q6834j85498k2771J58522o9979O6333J40304K7150k369
11026A28222J1148m5331j08602M5621O1713m2380J6323n2532j208l1697m8803
11015f7526q069Q279m0729J23947J07037j44343L0650O3673o7797M0101J12636
$$ y = [74281, 82100, 8861, -38289, -139385, -127274, -129763, -128201, -199825, -197300, -16711, -26176, 14032, 80965, 142822, 114334, 58557, -58028, -141933, -26470, 67583, 137217, 126006, 94938, 131638, 155308, 156387, 112362, 113901, 141354, 255294, 292146, 317242, 436903, 333639, 165518, 111362, 199826, 90252, 68069, 122206, 185898, 64103, -39133, -53736, -127985, -180183, -240789, -268191, -318036, -268892, -155948, -152991, -222948, -91563, 19297, 45011, 99805, 103364, 16530, -168968, -191739, -33217, -103196, -36863, 103441, 130591, 128222, 139370, 94039, -14563, 31058, 92771, 50391, 66714, 14182, 12974, -18723, -67526, -75595, -67316, -108045, 15902, 122939, -21404, 9246, 72919, 5122, 45223, 157859]
11004A57859P6223L919N3838P0590o9102j14634j28032o5430R7146l8336N1954
10993I5995P1412q507M2657m7807l9728P5589o5277M9988L2419q6125o6767K9604
10981H3453L3312M3635j8684j03785J2191J55888n3290O397J2098m6915J06264
10970B30564n5734j5543J17922L0968m1731N6673M5725j08716J1177J34619j77001
10959B28923q3605k1305o419N2973j15989j5477p714J47688k1372q6312N134M0970
10947A17495k5990o3380J02505J69321N5618o7838O8162K8927m7178L9079j67373
10936B09348j30000P6656L9940J01177p4006o714m5258K6096Q9711j0840k866
10925B73244r389j24549K0437Q5183M771j9841o9514k2322n7745n1504P0989J3651
$$ y = [157859, 234082, 238001, 291839, 362429, 293327, 178693, 50661, -14769, 82377, 44041, 95995, 167407, 158900, 201557, 153750, 114022, 189611, 124334, 174322, 206741, 120616, 53849, 83453, 116765, 160400, 141716, 37931, 50122, 206010, 152720, 159117, 171215, 124300, 230564, 174830, 159287, 277209, 308177, 266446, 323119, 368844, 260128, 271305, 405924, 228923, 145318, 124013, 117594, 170567, 54578, 39101, 31387, 179075, 157703, 71391, 76525, 117495, 91505, 28125, 130630, 299951, 355569, 287731, 355893, 384820, 337642, 376721, 209348, 79348, 156004, 195944, 297121, 223115, 216401, 171143, 197239, 286950, 276110, 273244, 263855, 139306, 159743, 244926, 249697, 229856, 160342, 138020, 80275, 28771, 99760, 113411]
10913A13411q3079J26690J10135L5820P336q0975j53916k2324J40996Q8500m4524
10902B38070q8634N3816J12294p2025j36497m4238J9911J2666J50531o5035l9030
10891A41829R7998j00578j93385J3030o2510n6589L3802K12286J62879P8618l2421
10880B94959j12185O1230k2424K2737Q3908J1016J185l2956j68197j070Q1721
10869B19924p962l3646j25957m6557q2597Q792O8527N0118j8029m9555m781n4856
10857g6579l1603J38859P2810j2968q3847R9082L5747j56296J4062J72392l3467
10846A38192Q2278J14944j1559r2751j01393p7324N7068j2521n4323n150P6030
10835A13491r585K09n4862P613j4335m2490r4393K193k5214J19345J20744O99
$$ y = [113411, 30332, 157022, 267157, 302977, 310313, 229338, 75422, 53098, 194094, 282594, 238070, 149436, 203252, 315546, 243521, 107024, 62786, 82697, 95363, 245894, 180859, 141829, 239827, 139249, -54136, -41106, -103616, -160205, -126403, 85883, 248762, 327380, 294959, 182774, 244004, 221580, 244317, 328225, 339241, 340426, 307470, 139273, 138203, 219924, 211962, 178316, 52359, 5802, -76795, -68003, 524, 50642, 32613, -16942, -21723, -76579, -108182, 30677, 103487, 90519, 6672, 105754, 141501, -14795, -733, 171659, 138192, 220470, 335414, 323855, 231104, 129711, 52387, 109455, 96934, 42611, 37461, 113491, 103906, 104115, 49253, 56866, 42531, 41, -94352, -92159, -117373, 1972, 122716, 123415]
10823A23415L1984R0130p9276p3291m8451j40026K2322J25521J1722n8585j82932
10812a77467m6849j5638J04759K01410O4939J0705K2271L860J8815N8700q6152
10801A59353l4044k069q818J9689l98K26P9938j0530q0745m6988j0486M3708L3971
10788A42807k562J02174p5693l0207m847Q4945m6024j81367O9929N6909k0281
10777I5783j14210j1257J06033q1108q3001m9224J05703Q3347R1526K9691N7941
10766B31224N4021J2180q5167j40035l6128j5723o0237J82213J88090m7150k10322
10755G2966J24992J18485j13980p1326J05286L7199j70932n4693J08325J4719
10745A71041L2128Q6609Q5928j15436j88242p9806k9384J5897m6009j8509l4536
$$ y = [123415, 155399, 245529, 166253, 92962, 44511, -95515, -73193, 52328, 64050, 5465, -177467, -224316, -239954, -135195, 66215, 131154, 141859, 164130, 167990, 186805, 245505, 159353, 125309, 123240, 114422, 134111, 133713, 133939, 213877, 203347, 122602, 75614, 65128, 108836, 142807, 140245, 242419, 166726, 136519, 131672, 216617, 170593, -10774, 59155, 116064, 95783, -18427, -29684, 76349, -4759, -87760, -136984, -31281, 52066, 143592, 173283, 231224, 285245, 297425, 212258, 72223, 36095, 20372, -39865, 142348, 330438, 283288, 72966, 197958, 316443, 202463, 131137, 236423, 273622, 102690, 47997, 156322, 171041, 203169, 289778, 375706, 260270, 72028, -7778, -37162, -21265, -67274, -85783, -120319]
10734a20319J14935J35338N0566j11061r8739p5979j0304Q6283K5669J7838P5667
10723H9894K115j50258p0264J30435O7504K7741k8272L0483j43996M4936P3633
10712G3951J2858K8763j25299Q999J83583L8958j3610n3717n6502J22599L4217
10701B54800r7132p7474L6223k0566N8438l5585j67396r7604K9890M5067J1757
10690e9582o265o3361l3700R9509N9911J18735N500M6709j9027l2861l5186p0434
10678I948j5281n2632l79m9825J07559K3353J5783k3344n8056J15308J71776j05077
10666A39133M3933k5356J1118R5552j49320j82109n2338J0117L4842J24646K15015
10655B65233j3873q8456o1274j27157P3819Q3381l2983n7662P675Q1807j88967
$$ y = [-120319, -5384, 129954, 180520, 69459, -29280, -105259, -115563, -29280, -3611, 14227, 89894, 92009, -58249, -128513, 1922, 69426, 97167, 68895, 99378, -44618, 318, 73951, 86809, 115572, -9727, -728, 182855, 221813, 208203, 154486, 97984, 220583, 254800, 157668, 80194, 116417, 95851, 154289, 118704, -48692, -146296, -116406, -71339, -59582, -65847, -129208, -162908, -63399, -3488, 115247, 120747, 167456, 148429, 115568, 80382, 9948, -5333, -57965, -58344, -108169, -610, 22743, 38526, 15182, -42874, 72434, 244210, 139133, 183066, 157710, 168828, 264380, 115060, -67049, -119387, -109270, -74428, 50218, 265233, 251360, 162904, 101630, -25527, 48292, 131673, 98690, 41028, 48703, 130510, -58457]
10644e8457m0445J7645K29P2127J51790N4150j34894M8817j06330N6860K3520
10633H5012m7637M1802j00271j08968q6830R9951J2665l9606L0626j04739P7267
10622a40728J32610Q4112K3043r1131n3783j40965J1332J69340J99505O1430j88380
10611F6385q5537L9544N2292K9348L6690j28812n3750K0547k3134N2423J2670
10600A8666o2727k3413p4240N3480J03090J21044N077o3674l928p2781L7688J8696
10588E6978P664q5944L393L4920o063j01671j11756J00359R3606N1120m3836j08223
10576a09453J6232j1557O2610Q2672N7168J6769M528P749m5290M4114q3250J5071
10564E7363O8775n9130P3267k1257j85444K622J27069R2395R1402j06160p2183
$$ y = [-58457, -98902, -81257, -81028, -8901, 142889, 197039, 62145, 110962, 4632, 61492, 85012, 37375, 79177, -21094, -130062, -216892, -116941, -104276, -143882, -113256, -217995, -140728, -8118, 75994, 99037, 7906, -45877, -186842, -175510, -6170, 193335, 254765, 66385, -19152, 20392, 72684, 102032, 138722, 9910, -43840, -23293, -46427, 5996, 18666, -44061, -67474, -141714, -88234, 14856, 135900, 140977, 77303, 73375, 594, 38282, 56978, 64642, -21302, -17909, 17011, 10948, -90723, -202479, -102120, -8514, 42606, -1230, -109453, -93221, -104778, -42168, 40504, 97672, 114441, 118969, 126718, 81428, 125542, 42292, 57363, 126138, 67008, 140275, 119018, -66426, -63804, 63265, 155660, 247062, 140902, 68719]
10553F8719j22103R769J11341J17169J82669K59693J99273K11789R8558J34214
10543A271091L15540L00401J38145K27815K05082J76786j689K9506N0747N6710
10533B770134j29082j49743j52890p5656j74131j54981k01270k74883l17227k52932
10523H87339j38110j75337j90992n3213J7607o4959L9954M3540l6572j03097r2994
10512A33166j56340m713p5365O3356P0502P969R4000r2757j38036R6881J23131
10501A21794N353j03653j36427p2441J01053J07211J67478j94853r4314k803N3537
10490d8065J26348n8605J2682P3154q326Q9475j2064m7855M8654m7887n3491L876
10478G7896N4404K1820J8875J8643R2693m9140j52169K2064k4351L948L2264O793
$$ y = [68719, -53384, -43615, 67726, 184895, 367564, 627257, 826530, 1038319, 1136877, 1271091, 1586631, 1887032, 2025177, 2252992, 2458074, 2634860, 2633171, 2662677, 2713424, 2770134, 2641052, 2491309, 2338419, 2262763, 2088632, 1933651, 1732381, 1457498, 1140271, 887339, 749229, 573892, 382900, 329687, 347294, 282335, 322289, 365829, 329257, 226160, 133166, -23174, -27887, -103252, -39896, 30606, 38575, 132575, 39818, -98218, -1337, 121794, 127147, 23494, -112933, -185374, -84321, 22890, 190368, -4485, -98799, -101602, -48065, 78283, 19678, 32360, 105514, 97188, 186663, 174599, 126744, 175398, 127511, 74020, 77896, 132300, 154120, 172995, 191638, 284331, 235191, 83022, 105086, 80735, 84683, 116947, 123740]
10466A23740q2405R5499m4915L2922q735m8359m8670N1421j19133r71R4643J93238
10454B38275j1626n2160n3022p9885o5899M6806M2433J05691K2170n8977j6369
10443A17437K2899Q3444o9591n6342m9792k692j64346O9490N4476P6755P2299
10432A54037J2409n6069n4961O248K4265L457k3017J25171Q0148L0041o6313p44
10420B34672m211J1363n9953l6153K0050j59302j6240m254Q2250J14992o250k2269
10408A54695j8637j6219K0100L8500n6497l2251J45789p1205M4942J71932n9343
10397C21806K8395J52255J10337M4184j25525j43291P5026R2622k2561m1153m1343
10386D50752j55405q6153J5390j09859j14700l6139N5165j9449j09481m9713M1560
$$ y = [123740, 41335, 136834, 91919, 124841, 116106, 67747, 19077, 70498, -48635, -49606, 45037, 238275, 226649, 174489, 121467, 41582, -24317, 22489, 64922, 170613, 192783, 133806, 117437, 140336, 223780, 154189, 97847, 48055, 45363, -118983, -49493, 4983, 81738, 154037, 166446, 110377, 55416, 61664, 85929, 89386, 66369, 191540, 271688, 301729, 235416, 234672, 230461, 241824, 181871, 145718, 165768, 6466, -9774, -14028, 68222, 183214, 176964, 154695, 136058, 119839, 139939, 178439, 121942, 89691, 235480, 164275, 209217, 381149, 321806, 350201, 502456, 612793, 656977, 531452, 388161, 463187, 555809, 533248, 492095, 450752, 295347, 209194, 224584, 114725, 25, -36114, 19051, -398, -109879, -159592, -118032]
10375a18032R8883L542Q1226J2747n1958o7213j25966J6377O3156M0928N8596
10364A2286j5824j32733k0407N0193K7449M1075Q8594l1966j20754m0543Q236
10353a34394L4299M7827L9624K7472K7198P4745j07691l4503r671K9913J15296
10342A10115j1077m2573M766N4289k1292m8469J6137o3345J38173m2256n9989
10331C4479Q5237N0279o9399L1269Q8939k1505o895O4162J10820j04319j70308
10320I2759J453n1504P1861l2920k29331j49484P5789P0815J17452p910j84256
10309b25276k4527K6170K5667J73014P8542J3603j4373k06373n4117K07076J33273
10298A32679K568k131o7098q4220r7393p64K11714K362o8165R0204o5104l5200
$$ y = [-118032, -19149, -15607, 65619, 78366, 26408, -40805, -166771, -150394, -87238, -46310, 12286, -3538, -136271, -156678, -106485, -79036, -37961, 50633, 18667, -102087, -142630, -134394, -100095, -52268, -12644, 14828, 42026, 116771, 9080, -25423, -35094, -5181, 110115, 99038, 56465, 61231, 115520, 94228, 45759, 61896, -1449, 136724, 94468, 34479, 119716, 169995, 100596, 131865, 220804, 199299, 192404, 256566, 367386, 263067, 92759, 94212, 42708, 114569, 81649, -147682, -297166, -221377, -150562, -33110, -41020, -225276, -249803, -223633, -197966, -24952, 53590, 67193, 52820, -153553, -207670, -594, 132679, 135247, 133116, 66018, -18202, -115595, -116359, 95355, 97717, 29552, 119756, 54652, 19452]
10286A9452N0732l4718j27991j06518O9870R2828Q483k307M2721M1890N0453R183
10274A14078o0189M9032q9700o1888n2356k0640P7833J49136l7660p2105K7956
10263B3497p9152p5298K5145M2071J04045L0447J52661N0491n6743j20756n8668
10252C7740j19767j19641O6542J23118P3186J8447r2102o2141J25704j5221q751
10241B7114R4620L6225o8495n6247n4602L6677O5621l7622j2207R0840L6028M3268
10229B01220j63133K5993k1064Q4017J519P1545J37436J24387M3797K0147M2481
10218E68345J69150J12337P4169L26954J30306o2630j3800p4886m8461k48773
10208I32711k34183k13764k64908r2459n9591j42355l3711J75064J38970K9746
$$ y = [19452, 70184, 35466, -92525, -199043, -129173, -36345, -27862, -30169, 12552, 54442, 104895, 114078, 53889, 102921, 13221, -48667, -101023, -121663, -43830, 105306, 67646, -4459, 23497, -55655, -130953, -105808, -63737, 40308, 70755, 223416, 273907, 217164, 96408, 37740, -82027, -201668, -135126, -12008, 61178, 79625, -12477, -74618, 51086, 35865, 27114, 121734, 157959, 89464, 33217, -21385, 15292, 80913, 43291, 31084, 121924, 157952, 201220, 38087, 64080, 43016, 127033, 128552, 200097, 337533, 461920, 505717, 525864, 568345, 737495, 849832, 924001, 1250955, 1381261, 1318631, 1304831, 1229945, 1181484, 932711, 698528, 484764, 219856, 127397, 67806, -74549, -108260, 66804, 205774, 235520]
10198B35520J567j83352j4916K3126o9446o9026N3789k0090K7894p1979j39646
10187b26559J1053J68484J40876m4788l7692J5857O1609k5576l3032p5965J5668
10176c0065N6517J05260p2561j47351J07625O4697p4510R7070l5015l0858n2843
10165a2034K2934q5996m3977K847n1012j8961M7538K07621K9877k9058j41287
10154g1508n6421J54345k9345r6083L1679J34638j00826k74480m165R6500P3076
10143a42590J10401J09431R1298P094j06842J08002P2447P051l2407M160N4095
10132B82140p4132j86564l6180j21858m680l0211L0234N7930j866L3648L0652
10121b0887K0820k628M5405R6234O2497L3566n7413j00551k877L8662m4275j02760
$$ y = [235520, 237087, 53735, 38819, 61945, -7501, -76527, -22738, -42828, -14934, -86913, -226559, -215506, -47022, 93854, 49066, 11374, 27231, 88840, 63264, 30232, -45733, -30065, 26452, 131712, 59151, -88200, 19425, 84122, 9612, 106682, 71667, 40809, -12034, 10900, -75096, -119073, -116226, -167238, -186199, -138661, 68960, 98837, 69779, -71508, -127929, 26416, -2929, -99012, -67333, 67305, -33521, -308001, -312166, -215666, -142590, -32189, 77242, 168540, 175634, 68792, 176794, 249241, 256292, 223885, 228045, 282140, 208008, 21444, -14736, -136594, -141274, -171485, -141251, -83321, -85187, -51539, -20887, -67, -2695, 42710, 138944, 201441, 235007, 177594, 77043, 74166, 112828, 68553, -34207]
10109c4207p8487J01231P4759p1379j92336K7784J26352J25911R2282L2947K5304
10098B30161r6734k8914j7995l1374o0270n5649o5365L8080Q9273R1675j06591
10087a3703L5487K5844j2208O5892j4432n3887k1238k0303R0286l519j23527j18361
10075a63669J6814K9529R4877K4639L088Q4480M4668M4897n282j87531k7712p50
10063d1952k5289p0624P2221K26725J5326o6043p7239q3018j2161j8616l2803
10052a13473p5578J61752J46118J6150m1312p6743M7834P9374P8975o9465j36484
10041A7148J867K6279q2845M2638Q5284O4752j0089q8525M0805r1365j75182k2778
10029a92011J3094j26428M9467Q7364Q4061R194n128k94N4716p2018m0222j5537
$$ y = [-34207, -112694, -11463, 63296, -8083, -200419, -172635, -46283, 79628, 171910, 204857, 230161, 133427, 104513, 86518, 55144, -5126, -60775, -126140, -88060, 1213, 92888, -13703, 21784, 47628, 35420, 101312, 86880, 32993, 11755, -8548, 81738, 78219, -45308, -163669, -146855, -117326, -22449, 2190, 5278, 89758, 134426, 179323, 174041, -13490, -41202, -41952, -67241, -137865, -65644, 161081, 176407, 110364, 33125, -49893, -62054, -80670, -113473, -189051, -27299, 118819, 134969, 93657, 16914, 64748, 144122, 223097, 153632, 17148, 19015, 45294, -37551, 5087, 90371, 155123, 145034, 56509, 97314, 5949, -169233, -192011, -178917, -305345, -255878, -168514, -84453, -75259, -80387, -80681, -25965, -97983, -138205, -153742]
10017a53742l561J20397Q646P589N0260M9869m0818J3204R6946P5430K3881L6880
10005B84981K0880k06869j26635m322p0810p2248M7335J60429N6712r0442q046
9994i035j1078K8835Q8555K5020j51100j18959L4420o7027n4962J19545J48574
9983C2788P63N2695J11890M0402l4412k2034l0910r6389K7030O5749l9319K0757
9971A29010J41342l2973o0459J6372L9962j52475n9729J57233n626o9188K4337
9960A27806j39915K3439J00555j0915o0621m2623l062k7521r6040k4332j722Q3987
9948g0964j24815o0308R8750M4645J9432N546n3003O2666P4607M7200L3703n0131
9936B7328J60272Q007j9727k37185o6639J20705l662j2144l539o9342P2520R2376
$$ y = [-153742, -157303, -36906, -28260, -20671, 29589, 79458, 38640, 51844, 148790, 224220, 248101, 284981, 305861, 98992, -27643, -31965, -102775, -175023, -127688, 32741, 89453, -989, -9035, -20113, 8722, 97277, 122297, -28803, -147762, -113342, -180369, -235331, -115786, 32788, 33551, 86246, 198136, 238538, 204126, 182092, 151182, 54793, 81823, 147572, 108253, 129010, 270352, 237379, 176920, 193292, 233254, 80779, 21050, 178283, 172657, 103469, 127806, -12109, 11330, 111885, 100970, 40349, -2274, -5336, -32857, -128897, -153229, -154951, -70964, -195779, -256087, -157337, -112692, -93260, -87714, -140717, -78051, -3444, 43756, 77459, 27328, 187600, 195607, 175880, -61305, -127944, -7239, -10901, -23045, -26584, -95926, -23406, 68970]
9924F8970j0763L661Q77N0492m0131k8317o4234n121R1744J16319j2281J841k9063
9911A43994n1058o769m4775q6479L4619j08083r0829j3929J78498M7934J0359
9900A3482M6257O3923K4144K0167J5454Q2578k7018N601N4981n668j39576r6493
9888E7832p8771j09289j28863P1230J95122O7300Q8900k9422o9007r0762j08759
9877a34489R0323J66885M8983q0962n6354J31753k5506p1971K2490k088l5686
9866E3378K4525j7701j54552p8113K49715J09850k3715R0937J01082k09098n0389
9855I5919J04776N0387L01987M51804L04651N7006j63288j79582j40418k27102
9845F56140j94646k77882l9668n6704K0302R6007O0982J04854j44586j14859Q574
$$ y = [68970, 58207, 61868, 62745, 113237, 73106, 44789, -19445, -24566, 67178, 183497, 171216, 173057, 143994, 92936, 86167, 41392, -45087, -10468, -118551, -209380, -223309, -44811, 3123, 13482, 59739, 123662, 147806, 167973, 183427, 266005, 238987, 244588, 299569, 293901, 154325, 57832, -20939, -130228, -259091, -187861, 7261, 74561, 163461, 134039, 65032, -25730, -134489, -44166, 122719, 171702, 90740, 34386, 166139, 140633, 68662, 91152, 89064, 53378, 77903, 60202, -94350, -172463, 77252, 187102, 163387, 254324, 355406, 146308, 95919, 200695, 251082, 553069, 1004873, 1309524, 1366530, 1203242, 1023660, 883242, 656140, 461494, 183612, 143944, 87240, 107542, 203549, 264531, 369385, 224799, 109940, 118514]
9834A18514J595m4733o380l73l0843j27623k9066Q8396K0793N1555l367q2385
9822d3917r9138J01650J16028M7445r908q9264j0643K1919M1798r9766L4818K2136
9810C3158m8642m4384J4913J17006L2184j9865j01774n5133l7234L674m3423r8141
9798b47661J10880N5861j7825O5594N0126Q1982R4866j5119k63187J2161K81009
9787B08687o0738n8225Q439j04265R190l4540K5331J7489L3314N9152Q9727q4139
9775A09422p530p9337J2933l5483J1428N9840l1481N7786Q1152M2710M5604k1752
9763B45292j45289O465N5061j0063o7923o5317j197Q584J4568M6409m779p6139
9751E672M6342j7429j51800q6588J702j66567N0401J48966J66067O0479L898k6834
$$ y = [118514, 120109, 75376, 68996, 68623, 37780, -89843, -118909, -30513, -9720, 41835, 38468, -43917, -143055, -41405, 74623, 122068, 112160, 22896, 12253, 34172, 75970, -23796, 11022, 33158, -15484, -59868, -44955, 72051, 104235, 84370, -17404, -72537, -109771, -106097, -149520, -247661, -136781, -80920, -98745, -33151, 16975, 98957, 193823, 178704, -84483, -72322, 208687, 147949, 89724, 98163, -6102, 3088, -31452, -6121, 11368, 44682, 103834, 193561, 109422, 101892, 22555, 35488, 5, 11433, 71273, 39792, 97578, 178730, 221440, 267044, 245292, 100003, 106468, 161529, 151466, 83543, 18226, 17029, 25613, 40181, 86590, 81811, 5672, 52014, 34585, -117215, -203803, -202101, -368668, -318267, -169301, -3234, 57245, 61143, 34309]
9739C4309n8766j16440j14917Q8175J26354L1030L8222m2907l6641J20027Q1505
9728A49951k7862k9411R8283q8009j92394j8651J5445J2578p472J16575M0461
9717F9494j07193N9145Q2393j16834J47560M9142j07936o6701M2599j60876j20479
9706b29686j8659J37678J70106J15015n9569j19596r587J199J5755n7813M6951
9695h206m2161N3258j9828l2967q1183j08093N8881J48130Q2729J07141n9414
9684I8287n6669M554Q6657m0914j96484j57296o4280J12805P0325J560J15754
9673b5701J25138j1467m3834n6140o8566R4124L8964l0854J10560K0339K883P6587
9661B32033m5661k5588o1734j7455J51044J60357l2273p1357J52132r9713q3815
$$ y = [34309, -24457, -140897, -255814, -167639, -41285, -10255, 27967, -14940, -51581, 68446, 149951, 122089, 92678, 190961, 102952, -89442, -108093, -92648, -80070, -87542, 29033, 69494, -37699, 21446, 103839, -12995, 134565, 183707, 75771, 9070, 51669, -109207, -229686, -248345, -110667, 59439, 174454, 114885, -4711, -14298, -13099, 2656, -55157, -8206, -50367, 2891, -16937, -49904, -131087, -239180, -180299, -32169, 50560, 157701, 98287, 41618, 46172, 132829, 91915, -104569, -261865, -326145, -213340, -143015, -141455, -25701, 99437, 87970, 44136, -12004, -80570, 13554, 52518, 21664, 132224, 152563, 155446, 232033, 186372, 160784, 99050, 81595, 232639, 392996, 360723, 289366, 441498, 341785, 257970]
9650B57970K4387j37311j98027L3758O7096J7347P6001J11371k7952j54861L252
9639G3031j9267O2277J69515m4342J05257m4068q0042o196J3646o3928j81417
9628a5534j01252j21417N806K30718J42995l9535L5990k7344J144R9570j54821
9617E6320p6340k23118O495J12359P0434J13494L677m9504P9267O1080j23762
9606C0402k02544j1229m0620J27533J67768N2099K0053m7914R1282K33699J83904
9595F04433P8766j39771j75102k30287k39595j57452J26231j66504k8513J30281
9585a97513K4412L1001J7901M8920k4100n2834L3245N9442K1050n1590j0598k1964
9573a22628K5768k9909J64340J47652J33584l3513p7085q5495k9561O2876l1759
$$ y = [257970, 282357, 145046, -52981, -19223, 47873, 65220, 141221, 252592, 224640, 69779, 73031, 53764, 116041, 285556, 241214, 346471, 302403, 222361, 216165, 229811, 165883, -15534, -116786, -238203, -232397, -1679, 141316, 101781, 137771, 110427, 111571, 211141, 56320, -20020, -243138, -236643, -124284, -53850, 59644, 63321, 13817, 93084, 154164, 30402, -172142, -183371, -223991, -96458, 71310, 123409, 143462, 95548, 186830, 420529, 604433, 683199, 543428, 368326, 138039, -101556, -259008, -132777, -299281, -327794, -197513, -173101, -142100, -124199, -75279, -99379, -152213, -118968, -59526, -38476, -90066, -100664, -122628, -96860, -126769, 37571, 185223, 318807, 285294, 208209, 122714, 93153, 156029, 124270]
9562A24270J06176O8144o4782j29797m6436J48011J03762J44293k3682k21324
9552B08635r7349r4006q4J8066q97J6684L5067J03618P971l2142l1106r9241K3879
9539E9095P6884K272j74812r585J73457L7822J78374J80859L4555L3318K2486
9528F14725M3590J3417J62129N2350j06786l4640l2658q0782j84545j19962r3144
9517B33694M4046R545n7154j12349J45598J83352M8341n8179o7712j56719l6154
9506A76309J95025J28364j35197j49061o4481l6829O5055N8250O6274n0058k0244
9495B33407J47719J10707p7666R9021J69095j25265k35966N5003Q9849Q3535J04125
9484F53564r0890Q29n0756j11719P0089K21091N2791M0254J00937K57382J15899
$$ y = [124270, 230446, 298590, 233808, 104011, 57575, 205586, 309348, 453641, 429959, 208635, 111286, 17280, 17196, 35262, 34365, 51049, 86116, 189734, 197705, 165563, 134457, 35216, 59095, 135979, 138251, -36561, -46146, 127311, 165133, 343507, 524366, 558921, 592239, 614725, 658315, 671732, 833861, 886211, 779425, 744785, 712127, 631345, 446800, 326838, 233694, 277740, 287285, 230131, 117782, 263380, 446732, 495073, 436894, 369182, 212463, 176309, 371334, 499698, 364501, 215440, 150959, 114130, 179185, 237435, 303709, 253651, 233407, 381126, 491833, 414167, 513188, 682283, 557018, 321052, 376055, 465904, 549439, 653564, 562674, 563503, 512747, 401028, 471117, 692208, 744999, 785253, 886190, 1143572, 1259471]
9473A259471P3740J53147J05754J63785Q5823O8464L8433K6442l3035R6941K51340
9462B290305K97068L19428M07023L67355M42642L82675O07384O65268Q79728J136200
9452G795076J402501J885308K624081L431453M688548O584267R776193J4616492
9444E2803919K0894091K5129131J9966945O502658m826666j0200998j3425675
9437I6843405j6315894j6396623j3363105r708828o848180m938349l651507k730311
9429B2890608k308006j772568j341207j037804q25156o23039k80196j6737J07302
9420A4793197L26845N19220N84704Q65130J419657J749946K319338L338734M795684
9411C0712455O658230Q708645J2539677J8927486K9649651M5265162N8138755
$$ y = [1259471, 1333211, 1486358, 1592112, 1755897, 1841720, 1910184, 1948617, 1975059, 1942024, 2038965, 2290305, 2587373, 2906801, 3313824, 3681179, 4123821, 4506496, 5113880, 5779148, 6658876, 7795076, 9197577, 11082885, 13706966, 17138419, 21826967, 28411234, 38187427, 52803919, 73698010, 98827141, 118794086, 125296744, 120470078, 110269080, 96843405, 80527511, 64130888, 50767783, 41058955, 34210775, 29272426, 25620919, 22890608, 20582602, 18810034, 17468827, 16431023, 15605867, 14982828, 14702632, 14685895, 14793197, 15120042, 15639262, 16223966, 17089096, 18508753, 20258699, 22578037, 25916771, 30712455, 37370685, 46079330, 58619007, 77546493, 107196144, 152461306, 210600061]
9404B10600061M5193721R445994j6091475k5173154l0797185l7389069l6791156
9397A18997737k8662107j9722140j3251512r185740o901176n318433m186246l411789
9389B8358594l079441k422534j845892j378048r78728q72701o10619n17478l10207
9380A6342946n9793J12498J87545N13574R44912J428774J990675K957836M162503
9371B8581470N947920Q586013J2681693J8417150K2585293J8814353O196827n251691
9363A16559028j0875954j3684767j6350467j6552257j3432213r775662p026177
9356B8861531m977643l644161k722169k208734k044671j631349j199602j134197
9348I299005j006649q37223n49043n19224m94929l25572m45744m46589m27885
$$ y = [210600061, 255793782, 265239776, 249148301, 223975147, 193177962, 155788893, 118997737, 90335630, 70613490, 57361978, 48176238, 41275062, 35956629, 31770383, 28358594, 25279153, 22856619, 21010727, 19632679, 18653951, 17781250, 17170631, 16653153, 16342946, 16283153, 16395651, 16583196, 17096770, 18041682, 19470456, 21461131, 24418967, 28581470, 34529390, 43115403, 55797096, 74214246, 96799539, 115613892, 121810719, 116559028, 105683074, 91998307, 75647840, 59095583, 45663370, 35887708, 28861531, 23883888, 20239727, 17517558, 15308824, 13264153, 11632804, 10433202, 9299005, 8292356, 7455133, 6906090, 6386866, 5891937, 5566365, 5120621, 4674032, 4246147]
9339D246147l18650l01038j78739l00416j69032p5755j48709o6515j35987j33045
9329B418261j24661r5094p9682k2925p2651j12437k21307q1425O968p5994j4570
9318A524483m1960j51128n6543Q011n6309j20403n0629k8313o4838q9559J44214
9307A017026J6702J6296n2300r4212J79247l5129j73961p9701Q4043k7581l1843
9296H18587Q7494q1126q0301k1839m8993p8303o1148O2973J3073O6699R152r1237
9284E95031R0109J69824o2309j6665J59461N1422n4120L2660j9413m5961m0778
9273H59261n6376q6068j68467k0247R1943J47499J122N7789j43213r0007r0885
9262E02351l7525K8802M9990Q3701k336l2017J37173L0453K9852q5640r721J33050
$$ y = [4246147, 3927497, 3626459, 3447720, 3147304, 2978272, 2902517, 2753808, 2687293, 2551306, 2418261, 2293600, 2198506, 2118824, 2095899, 2023248, 1910811, 1689504, 1608079, 1615047, 1539053, 1524483, 1482523, 1331395, 1274852, 1282863, 1226554, 1106151, 1055522, 1027209, 962371, 872812, 1017026, 1033728, 1050024, 997724, 903512, 1082759, 1047630, 873669, 793968, 878011, 850430, 818587, 906081, 824955, 744654, 722815, 673822, 595519, 534371, 597344, 610417, 677116, 686268, 595031, 685140, 854964, 792655, 775990, 935451, 986873, 932753, 965413, 946000, 900039, 859261, 802885, 716817, 548350, 528103, 620046, 767545, 768667, 826456, 683243, 593236, 502351, 464826, 493628, 543618, 627319, 624983, 592966, 730139, 760592, 790444, 704804, 695083, 828133]
9250H28133l3497p8497k15022j67219Q568M380j00108k2532P6402J78731J26634
9239F05973R6579r5324l2519m3446J12898k7571j91342r7760j17005M9572J32928
9228C92983l6443m2542J3919o4134l8194r6014J35477P7319m3706K8741L8763
9217C66169M3874J21524p1531k28667p3972r7092q2821j50795l3283Q5389O4352
9206e6853Q7016K05273L4805j43272N7177J58358q7895O4468n5195j00206j2989
9195A50687o2990m735J87656J20159O2981p3585p1240M7291j39967k9489l4591
9184A52177j50927R5110K93973K4993m8165J9475J17191M5621j25521j67036m3489
9173B13402J92622L4116j93090O91J25259K03374j00025j83072j14902j7893m4633
$$ y = [828133, 794636, 716139, 501117, 333898, 342466, 346846, 246738, 224206, 300608, 479339, 605973, 702552, 607228, 574709, 531263, 644161, 616590, 425248, 327488, 210483, 260055, 392983, 356540, 313998, 327917, 263783, 225589, 129575, 265052, 342371, 298665, 327406, 366169, 410043, 531567, 460036, 231369, 157397, 60305, -22516, -173311, -206594, -121205, -56853, 30163, 235436, 270241, 126969, 184146, 342504, 254609, 319077, 263882, 163676, 150687, 87697, 82962, 270618, 390777, 453758, 380173, 308933, 356224, 216257, 186768, 152177, 1250, 96360, 390333, 415326, 367161, 386636, 503827, 549448, 423927, 256891, 213402, 406024, 440140, 247050, 247741, 373000, 576374, 476349, 293277, 178375, 160482, 115849]
9162A15849J66402K49133P1322O7697M7019j35538j06661P1791o2048N5664J64274
9151G04904R8544J88696J28662N0018J96347K20180R2959N6707k8532K00451M52462
9140B361398M27970L86822N65432P97943J086085J887283K869405M756238Q687301
9131B3825877J6082131K0631510P967102n085562p581747o867437r412434j1699847
9123B7859593q818411n368139l285491j906991j339491r06678q55668p06574o50562
9114D021588m21456m16130l60122m09828k47226l5491o5195k32903l43851l9738
9104A449648o9044j26781k4190l638j19536J324J4419r0443q7197L269l2683j35651
9092G79497l224r9648j26775M4298J9777j20498J6996L669J25860L1041k2084
$$ y = [115849, 282251, 531384, 602706, 670403, 717422, 581884, 475223, 547014, 484966, 540630, 704904, 803448, 992144, 1120806, 1170824, 1367171, 1587351, 1680310, 1737017, 1708485, 1908936, 2361398, 2789368, 3176190, 3741622, 4539565, 5625650, 7512933, 10382338, 15138576, 23825877, 39908008, 60539518, 68506620, 63421058, 55839311, 48971874, 39559440, 27859593, 19041182, 13673043, 10387552, 8480561, 7141070, 6234392, 5378724, 4672150, 4021588, 3600132, 3184002, 2823880, 2414052, 2166826, 2131335, 2066140, 1833237, 1489386, 1449648, 1380604, 1253823, 1229633, 1225995, 1106459, 1107783, 1122202, 1031759, 944562, 947831, 915148, 779497, 776273, 676625, 549850, 594148, 613925, 493427, 510423, 514092, 639952, 670993, 648909]
9081F48909r2382n452l3403j3714k194n6918n5048K5747L0868J8386n55P7012
9069E41256M877j61042n8846j0092j1279J2234J5503q4602l5204K7332M1338q9275
9057A92200r3428J06535P7744r3970j56318N7059o5083L1435L5729P5942j13248
9046E4597P334N6919P012K7100l8231R0502j3522l4217J10224k5552p8465O2350
9034B26051j08097L7176J36159k3465o6947k163j96015k18549K2270J72134J34097
9023A12651j1974k0625J12682r4861J1110l0679L8567J63087P4110l8826j63365
9012A51877M8501k3808k6982L9379O4599q082k40763o0767l260K5457k2686k5522
9000h2057k087O5232J2707P7248R9541J85650p7667j26336Q726Q306Q1173O1157
$$ y = [648909, 556527, 551075, 517672, 503958, 501764, 444846, 389798, 415545, 446413, 464799, 464244, 541256, 546133, 385091, 326245, 316153, 304874, 317108, 332611, 248009, 212805, 240137, 281475, 192200, 98772, 205307, 283051, 189081, 32763, 89822, 24739, 56174, 91903, 167845, 54597, 61931, 118850, 125862, 152962, 114731, 205233, 191711, 157494, 267718, 242166, 163701, 226051, 117954, 155130, 291289, 267824, 200877, 198714, 2699, -215850, -193580, -21446, 112651, 100677, 80052, 192734, 97873, 108983, 78304, 116871, 279958, 354068, 315242, 151877, 200378, 176570, 149588, 188967, 253566, 245484, 4721, -56046, -59306, -33849, -56535, -82057, -84144, -18912, -6205, 71043, 170584, 356234, 278567, 152231, 160957, 169263, 250436, 311593]
8988C11593l1079j02405j15974K8587r4655R995K7467k9375M3029k891n3529M4981
8976C5744q5165j05526R2518O007k2241q2200m4895K3893Q5054N0951J12468L2272
8964I8880k7303O7012n345J5904j03353N9866J83686P6103j75947o3754J12065
8953B37814J21875p3546q8959n1046j5728k4743j7748L3034o5371k9925n7078
8942c1421R3343J11393P9399L7666j14062l5636k5776o1594j19359J4354j37353
8931a89046m540M3162R6463J40599J5657j43360n4706l6631N6667P7468j34668
8920a32935j57835Q5607O2149M7100J04584M8031M3902J13363j45223Q584K2212
8909I9539Q0149k6930q5632m5726j07515M0391O5527k3558l5790J31240M5254
$$ y = [311593, 280514, 178109, 62135, 90722, -3933, 6062, 33529, 4154, 47183, 44292, -9237, 35744, -49421, -154947, -62429, -56422, -78663, -160863, -205758, -181865, -96811, -45860, 66608, 98880, 71577, 138589, 133244, 149148, 45795, 105661, 289347, 365450, 189503, 125749, 237814, 359689, 286143, 197184, 146138, 130410, 105667, 87919, 120953, 55582, 25657, -31421, 61922, 173315, 252714, 290380, 176318, 140682, 114906, 53312, -66047, -51693, -189046, -193586, -150424, -53961, 86638, 102295, -41065, -95771, -132402, -75735, 1733, -132935, -290770, -205163, -143014, -95914, 8670, 56701, 100603, 213966, 68743, 77327, 99539, 179688, 152758, 67126, 21400, -86115, -45724, 19803, -3755, -39545, 91695, 136949]
8898A36949j1436L4830n8670r402L404p6272L9212n8815M688k946j26945J37438
8886A2035J16578J20043j33694m8100Q1122R242J21786J32776l1769q9908j8125
8875B71986o7775L3109n9901j65777N5912n5643j13132j75897j1108J14938R9940
8864g3348m0271m38k2707k6535o4824J84754L2345J02411j06359L124J02328o5235
8852B5245m6008J31682L4676K1197q5436p8427R3465L7947j1598k0109J13524
8841B16158j27439n0586O2555Q3580M1924o6428n0240N7698k6118M9188m9267
8830A41025j08391L6264k0539P1229L0694l6502l7805K6924j2949L5735J4392
8819A40077o4819q7014Q7154Q8510n1789q0211O0440N2139k9458o5167l1155R7843
$$ y = [136949, 125513, 160343, 101673, 92271, 95675, 19403, 58615, -200, 4488, 1542, -125403, 12035, 128613, 248656, 114962, 66862, 147984, 157226, 279012, 411788, 380019, 290111, 271986, 204211, 237320, 177419, 11642, 67554, 11911, -101221, -277118, -288226, -173288, -73348, -113619, -114057, -136764, -163299, -228123, -43369, -11024, 91387, -14972, -11848, 90480, 25245, -20763, 110919, 145595, 166792, 81356, 2929, 96394, 134341, 122743, 102634, 216158, 88719, 38133, 100688, 184268, 226192, 159764, 109524, 167222, 141104, 190292, 141025, 32634, 68898, 48359, 119588, 150282, 113780, 75975, 102899, 89950, 125685, 140077, 75258, -11756, 75398, 163908, 112119, 31908, 92348, 144487, 115029, 49862, 18707, 116550]
8807A16550m6777k2556N4169J33703N695J5503p9282j63201q3751j28419M4395
8796a53971J19148L0798p4244L7003k1543M1609J92859j49n9130Q6468k1693R762
8784A86917M4078n4589q0017j10593P1354Q1713j04923m1222L6118J06411l3547
8773A01700j17050r6976J7960J10954M3047k2524O1687n5243Q272J6629j17187
8762d8731L7665R9332r7721k09007j1195J27250L8996j4652J03771o3155M5224
$$ y = [116550, 69773, 47217, 101386, 235089, 240784, 256287, 177005, 13804, -69947, -198366, -153971, -34823, -4025, -78269, -41266, -62809, -21200, 171659, 171510, 112380, 198848, 177155, 186917, 230995, 176406, 96389, -14204, 57150, 138863, 33940, -7282, 28836, 135247, 101700, -15350, -112326, -94366, 16588, 59635, 37111, 98798, 43555, 51827, 68456, -48731, -11066, 88266, -9455, -218462, -229657, -102407, -63411, -78063, 25708, -37447, 7777]
$$ [...]
##END NTUPLES=NMR SPECTRUM
##END=
