##TITLE=Analysis number 318977
Compound Code cc 44516
Book Reference 464/10/7
Project Code adrs
Chemist Name chrisr
##JCAMPDX= 6.0         $$ Bruker NMR JCAMP-DX V2.0
##DATA TYPE= NMR SPECTRUM
##DATA CLASS= NTUPLES
##ORIGIN= Bruker BioSpin GmbH
##OWNER= nmr
$$ XWIN-NMR		Version 3.5
$$ Wed Apr 26 09:35:39 2006 GMT Daylight Time (UT+1h)  MAYBRIDGE\nmr@NMR_250MHZ
##.OBSERVE FREQUENCY= 250.131544655141
##.OBSERVE NUCLEUS= ^1H
##.ACQUISITION MODE= SIMULTANEOUS (DQD)
##.ACQUISITION SCHEME= undefined
##.AVERAGES= 16
##.DIGITISER RES= 18
##SPECTROMETER/DATA SYSTEM= dpx250
##.PULSE SEQUENCE= zg30
##.SOLVENT NAME= CDCl3
##.SHIFT REFERENCE= (INTERNAL, CDCl3, 0, 16.522)
##AUDIT TRAIL= $$ (NUMBER, WHEN, WHO, WHERE, WHAT)
$$ ##TITLE= Audit trail, XWIN-NMR		Version 3.5
$$ ##JCAMPDX= 5.01
$$ ##ORIGIN= Bruker BioSpin GmbH
$$ ##OWNER= nmr
$$ C:\u/data/dgb/nmr/ADRS/3210/pdata/1/auditp.txt
$$ ##AUDIT TRAIL=  $$ (NUMBER, WHEN, WHO, WHERE, WHAT)
(   1,<2006-04-26 09:34:58.34 +100>,<MAYBRIDGE\nmr>,<NMR_250MHZ>,
      <created by zg, POWCHK disabled, PULCHK disabled
       configuration hash MD5:
       84 BC 41 DB A1 6E 1D 46 DA 25 12 A5 C1 ED C5 3A
       data hash MD5: 64K
       62 36 B7 26 28 19 0C AA 44 85 9D 06 CF AA E2 C2>)
(   2,<2006-04-26 09:35:13.62 +100>,<MAYBRIDGE\nmr>,<NMR_250MHZ>,
      <Start of raw data processing
       ef LB = 0.3 FT_mod = 6 PKNL = 1 SI = 32K 
       data hash MD5: 32K
       7C DB 29 21 B4 42 A3 7F 2E 01 8E F2 E0 1F 7D 79>)
(   3,<2006-04-26 09:35:15.44 +100>,<MAYBRIDGE\nmr>,<NMR_250MHZ>,
      <apk 
       data hash MD5: 32K
       42 89 AF F6 AD 7F 11 D0 C8 84 84 FA DC BB 6F 01>)
(   4,<2006-04-26 09:35:16.48 +100>,<MAYBRIDGE\nmr>,<NMR_250MHZ>,
      <abs ABSG = 5 
       data hash MD5: 32K
       26 8D C2 86 93 12 8D 21 7A AF E2 9C B9 85 A5 58>)
$$ ##END=
$$ 
$$ hash MD5
$$ 69 D1 67 3B D6 E6 0A 2A 7D EA 36 10 66 A6 AF 4B
##$RELAX= 
##$RELAX= 
##$RELAX= 
##$RELAX= 
##$RELAX= 
##$RELAX= 
##$RELAX= 
$$ Bruker specific parameters
$$ --------------------------
##$DU= <C:\u>
##$EXPNO= 3210
##$NAME= <ADRS>
##$PROCNO= 1
##$TYPE= <nmr>
##$USER= <dgb>
##$AMP= (0..31)
100 100 100 100 100 100 100 100 100 100 100 100 100 100 100 100 100 100 
100 100 100 100 100 100 100 100 100 100 100 100 100 100 
##$AQSEQ= 0
##$AQ_mod= 3
##$AUNM= <au_zg>
##$AUTOPOS= <5 >
##$BF1= 250.13
##$BF2= 250.13
##$BF3= 250.13
##$BF4= 250.13
##$BF5= 500.13
##$BF6= 500.13
##$BF7= 500.13
##$BF8= 500.13
##$BYTORDA= 1
##$CFDGTYP= 0
##$CFRGTYP= 5
##$CHEMSTR= <none>
##$CNST= (0..31)
1 1 145 1 1 1 1 1 1 1 1 1 1 1 1 1 1 1 1 1 1 1 1 1 1 1 1 1 1 1 1 1 
##$CPDPRG= <>
##$CPDPRG1= <>
##$CPDPRG2= <>
##$CPDPRG3= <>
##$CPDPRG4= <mlev>
##$CPDPRG5= <mlev>
##$CPDPRG6= <mlev>
##$CPDPRG7= <mlev>
##$CPDPRG8= <mlev>
##$CPDPRGB= <>
##$CPDPRGT= <>
##$D= (0..31)
0 1 0 0 0 0 0 0 0 0.06 0 0 0 0 0 0 0.0002 0 0 0 0 0 0 0 0 0 0 0 0 0 0 
0 
##$DATE= 1146040497
##$DBL= (0..7)
120 120 120 120 120 120 120 120 
##$DBP= (0..7)
150 150 150 150 150 150 150 150 
##$DBP07= 0
##$DBPNAM0= <>
##$DBPNAM1= <>
$$ [...]
##$SUBNAM7= <"">
##$SUBNAM8= <"">
##$SUBNAM9= <"">
##$SW= 20.6930455092707
##$SWIBOX= (0..15)
0 0 3 0 0 0 0 0 0 0 0 0 0 0 0 0 
##$SW_h= 5175.983436853
##$TD= 65536
##$TD0= 1
##$TE= 295.16
##$TE2= 300
##$TE3= 300
##$TEG= 300
##$TL= (0..7)
0 120 120 120 120 120 120 120 
##$TP= (0..7)
150 150 150 150 150 150 150 150 
##$TP07= 0
##$TPNAME0= <>
##$TPNAME1= <>
##$TPNAME2= <>
##$TPNAME3= <>
##$TPNAME4= <>
##$TPNAME5= <>
##$TPNAME6= <>
##$TPNAME7= <>
##$TPOAL= (0..7)
0.5 0.5 0.5 0.5 0.5 0.5 0.5 0.5 
##$TPOFFS= (0..7)
0 0 0 0 0 0 0 0 
##$TUNHIN= 0
##$TUNHOUT= 0
##$TUNXOUT= 0
##$USERA1= <user>
##$USERA2= <user>
##$USERA3= <user>
##$USERA4= <user>
##$USERA5= <user>
##$V9= 5
##$VALIST= <valist>
##$VCLIST= <CCCCCCCCCCCCCCC>
##$VD= 0
##$VDLIST= <DDDDDDDDDDDDDDD>
##$VPLIST= <PPPPPPPPPPPPPPP>
##$VTLIST= <TTTTTTTTTTTTTTT>
##$WBST= 1024
##$WBSW= 4
##$XGAIN= (0..3)
0 0 0 0 
##$XL= 0
##$YL= 0
##$YMAX_a= 418170
##$YMIN_a= -476106
##$ZGOPTNS= <>
##$ZL1= 120
##$ZL2= 120
##$ZL3= 120
##$ZL4= 120
##$ABSF1= 16.522
##$ABSF2= -4.171173
##$ABSG= 5
##$ABSL= 3
##$ALPHA= 0
##$AQORDER= 0
##$ASSFAC= 0
##$ASSFACI= 0
##$ASSFACX= 0
##$ASSWID= 0
##$AUNMP= <proc_1d>
##$AZFE= 0.1
##$AZFW= 0.1
##$BCFW= 0
##$BC_mod= 0
##$BYTORDP= 0
##$COROFFS= 0
##$CY= 12.5
##$DATMOD= 1
##$DC= 0
##$DFILT= <>
##$DTYPP= 0
##$F1P= 14.0000005364418
##$F2P= -0.99999901652339
##$FCOR= 0.5
##$FTSIZE= 32768
##$FT_mod= 6
##$GAMMA= 0
##$GB= 0
##$INTBC= 1
##$INTSCL= 1
##$ISEN= 128
##$LB= 0.3
##$LEV0= 0
##$LPBIN= 0
##$MAXI= 10000
##$MC2= 0
##$MEAN= 0
##$ME_mod= 0
##$MI= 0
##$NCOEF= 0
##$NC_proc= -4
##$NLEV= 6
##$NOISF1= 0
##$NOISF2= 0
##$NSP= 0
##$NTH_PI= 0
##$NZP= 0
##$OFFSET= 16.522
##$PC= 1
##$PHC0= 179.6986
##$PHC1= -13.35952
##$PH_mod= 1
##$PKNL= yes
##$PPARMOD= 0
##$PSCAL= 4
##$PSIGN= 0
##$REVERSE= no
##$SF= 250.13
##$SI= 32768
##$SIGF1= 0
##$SIGF2= 0
##$SINO= 400
##$SIOLD= 32768
##$SREGLST= <1H.CDCl3>
##$SSB= 0
##$STSI= 32768
##$STSR= 0
##$SW_p= 5175.98343685301
##$SYMM= 0
##$S_DEV= 0
##$TDeff= 65536
##$TDoff= 0
##$TI= <Analysis number 999999
Compound Code 99
Book Reference 9
Project Code 9>
##$TILT= no
##$TM1= 0
##$TM2= 0
##$TOPLEV= 0
##$USERP1= <user>
##$USERP2= <user>
##$USERP3= <user>
##$USERP4= <user>
##$USERP5= <user>
##$WDW= 1
##$XDIM= 32768
##$YMAX_p= 337066248
##$YMIN_p= -386310
$$ End of Bruker specific parameters
$$ ---------------------------------
##NTUPLES= NMR SPECTRUM
##VAR_NAME=  FREQUENCY,     SPECTRUM/REAL,   SPECTRUM/IMAG
##SYMBOL=    X,             R,               I
##VAR_TYPE=  INDEPENDENT,   DEPENDENT,       DEPENDENT
##VAR_FORM=  AFFN,          ASDF,            ASDF
##VAR_DIM=   32768,         32768,           32768
##UNITS=     HZ,            ARBITRARY UNITS, ARBITRARY UNITS
##FACTOR=    0.157963299565203, 1,           1
##FIRST=     4132.6476996994, 0,             0
##LAST=      -1043.33573715361, 0,           0
##MIN=       -1043.33573715361, -386310,     0
##MAX=       4132.6476996994, 337066248,     0
$$ Real data points
##PAGE= N=1
##DATA TABLE= (X++(R..R)), XYDATA
$$ [...]
23577b8801m9087J26391J77p0971m1913q8036R6612J83564o5267j05291j15471
$$ -28801 -77888 48503 48680 -22291 -64204 -152240 -55628 127936 62669 -42622 -158093
23566a58093J5640Q7855J13195r461n9008R412P3538M1883q3586k2790N7716k4156
$$ -158093 -142453 -54598 58597 49136 -9872 -460 73078 114961 31375 8585 66301 42145
23554D2145j4015K8784r7293n5180J389k4497M0541J10020j9456L5901o3323K4641
$$ 42145 28130 56914 -40379 -95559 -94170 -118667 -78126 31894 12438 48339 -14984 9657
23542I657K3418J516N2982l035k0722J5346k0232n5769m9057K9102J7425n71m3269
$$ 9657 33075 34591 87573 84538 63816 79162 58930 3161 -45896 -16794 631 60 -43209
23529d3209k413l5821J05257R2680n4559M2827q5829j12298l9434M5141J37170
$$ -43209 -45622 -81443 23814 116494 61935 104762 18933 -93365 -132799 -87658 49512
23518D9512o3625o0074k3230Q818N2191K601l6514O6450O6397m6397M1513m4198
$$ 49512 -14113 -74187 -97417 -88599 -36408 -33807 -70321 -3871 62526 16129 57642 13444
23506A3444k4681l6644N7805r6703m8660J60656P8508j1882O0421N0029l8626
$$ 13444 -11237 -47881 9924 -86779 -135439 25217 103725 91843 152264 202293 163667
23495A63667r3118j3441R4135P1428k3040l7401o9730j39547P0654Q2446p7882
$$ 163667 70549 57108 151243 222671 199631 162230 92500 -47047 23607 106053 28171
23484B8171j1041j9141K5413Q2640n243l7685r296j08547m8844j7747j9292L5268
$$ 28171 17130 -2011 23402 106042 100799 63114 53818 -54729 -103573 -121320 -140612 -105344
23472a05344P2164M248O9326m2275K0616N4180j2679m7569o1184k260N0149K2824
$$ -105344 -33180 -28932 40394 -1881 18735 72915 60236 12667 -48517 -50777 -628 22196
23460B2196q4890L0047R8251j2682K8285j42721J9024L0102j43765n8892O8032
$$ 22196 -62694 -32647 65604 52922 81207 -61514 -42490 -12388 -156153 -215045 -147013
23449a47013L8246R7755o5654k34966L3756K3149o41L2131j8555j1704M8541K269
$$ -147013 -108767 -11012 -76666 -311632 -277876 -254727 -255368 -223237 -241792 -253496 -204955 -202686
23437b02686j0165O0907P5907k0057n4717J9505M5700J02717J2051l6196j2544
$$ -202686 -212851 -151944 -76037 -96094 -150811 -131306 -85606 17111 29162 -7034 -19578
23426a9578Q4789J9119n9540q5973k6316L5974Q1973O8214L027m1018l0211M6860
$$ -19578 65211 84330 24790 -61183 -87499 -51525 30448 98662 101689 60671 30460 77320
23414G7320q910j4758m2757M077j4164L4453M5996j6193p5585j5038R2222J05280
$$ 77320 68410 53652 10895 14972 808 35261 81257 65064 -10521 -25559 66663 171943
23402A71943n7981l9332J2064P3900l6618J0334q1885j47548K9707R4086o1678
$$ 171943 113962 74630 86694 160594 123976 134310 52425 -95123 -65416 28670 -33008
23391c3008q1538R1435j1681l3562j4435j8792L0173O5551K841r0757m4214Q2372
$$ -33008 -114546 -23111 -34792 -68354 -82789 -101581 -71408 -5857 -3016 -93773 -137987 -55615
23379e5615k2446N4249O6265q3155m2595K9907J5757J911j9349L6306M1101j23388
$$ -55615 -78061 -23812 42453 -40702 -83297 -53390 -37633 -35722 -55071 -18765 22336 -101052
23367a01052M6642J3876M210l7286m0464K0465O3684L5740K3911k3532o3956J0743
$$ -101052 -54410 -40534 -36324 -73610 -114074 -93609 -29925 5815 29726 6194 -57762 -47019
23355d7019j059o1813K840J28490J55138J270m0990r1881m4552m1898p6476o8293
$$ -47019 -48078 -109891 -107051 21439 176577 177847 136857 44976 424 -41474 -117950 -186243
23343a86243P3525Q5673J2828N7049n7942o9467J3533j4386P0412M6199J9431
$$ -186243 -112718 -27045 -14217 42832 -15110 -84577 -71044 -85430 -15018 31181 50612
23332E0612P0344O227p454j68013l350O7865M3577R1556l8141j0018j23411j05837
$$ 50612 120956 127183 119729 -48284 -51634 16231 59808 151364 113223 103205 -20206 -126043
23320a26043m3052J20496J32533K3291k7539k7168J4873J9677o1825m3048j2713
$$ -126043 -169095 -48599 83934 107225 79686 52518 67391 87068 25243 -17805 -30518
23309c0518K6380K3745M2364l6920k5659q818L3407q762r6537l1324Q2647Q1173
$$ -30518 -4138 19607 61971 25051 -608 -9426 23981 15219 -81318 -112642 -29995 51178
23297E1178K9805O530j07034l7319q575J2137J20528R2953o0599n6156k4378J8768
$$ 51178 80983 87513 -19521 -56840 -65415 -53278 67250 160203 99604 43448 19070 37838
23285C7838J26188J6804J9408o5185p7948J2051R6711O7868n5111j41927k3598
$$ 37838 164026 180830 200238 135053 57105 69156 165867 233735 178624 36697 13099
23274A3099K6961m107q6146L0612P1974L5376n0171q034j03346o4400J3606R0327
$$ 13099 40060 35953 -50193 -19581 52393 87769 37598 29564 -73782 -138182 -124576 -34249
23262c4249N7274j4361q8730N503P1239p772q2791p2049j15210l7289J17302R5119
$$ -34249 23025 8664 -80066 -74563 -3324 -11096 -93887 -165936 -281146 -318435 -201133 -106014
23250a06014J07375O640O0641k3389p6544j08436N0203N9658O5500m8675p2454
$$ -106014 1361 8001 68642 45253 -31291 -139727 -89524 -29866 35634 -13041 -85495
23239h5495r8423P6763J9158R3630j6834K4667O9709K8964J5572l9923L2371R771
$$ -85495 -183918 -107155 -87997 5633 -11201 13466 83175 112139 127711 87788 120159 129930
23227A29930l8977q9019k0078j2626l3112r3286J03890k1463N469n960P0761N4036
$$ 129930 90953 1934 -18144 -30770 -63882 -157168 -53278 -74741 -69272 -75232 -4471 49565
23215D9565l2659M9628q2115k4331O8167k5412j33407J7985Q9927k9596j3626
$$ 49565 16906 66534 -15581 -39912 28255 2843 -130564 -112579 -22652 -52248 -65874
23204f5874J6223Q3821J2948M858k6375r181K2354M39K6474n1287j7588J1322
$$ -65874 -49651 34170 47118 51976 25601 16420 38774 39213 65687 14400 -3188 8134
23192H134P6025p8885k7633J15789M5184m6660r8967o8533J19288j67131j8055
$$ 8134 84159 5274 -22359 93430 138614 91954 -7013 -75546 43742 -123389 -141444
23181a41444N6285Q3651L8347l4975O4809R985k1519l2991k4155K2498n7077K6362
$$ -141444 -85159 -1508 36839 1864 66673 76658 55139 22148 -2007 20491 -36586 -10224
23169a0224o3688J05143P8698J2327j20930n9056J10289M9487n0160r9838o6171
$$ -10224 -73912 31231 109929 122256 1326 -57730 52559 102046 51886 -47952 -114123
23158a14123l2962J1069J59508J15943j07210l9487K9740o1725l6085n8328J11354
$$ -114123 -147085 -136016 23492 139435 32225 -7262 22478 -39247 -75332 -133660 -22306
23147b2306Q4853M6093K7813m2316m5197L7459p9465K6176k8770o9458K7427Q3233
$$ -22306 62547 108640 136453 94137 48940 86399 6934 33110 4340 -65118 -37691 45542
23135D5542N4609l0816q7443k9078N6634L1599N785p3754m4185L6978M349J05657
$$ 45542 100151 69335 -18108 -47186 9448 41047 46832 -26922 -71107 -34129 -29780 75877
23123G5877j4955k2029j08172j342K0585j04024o4984J33796J18507O833j2593
$$ 75877 60922 38893 -69279 -70621 -50036 -154060 -219044 -85248 33259 40092 27499
23112B7499K0838p3829R312N0529J8631O308j66813l7242m5808P1826P0737R5668
$$ 27499 48337 -25492 -16180 34349 52980 59288 -107525 -144767 -190575 -118749 -48012 47656
23100D7656j4852J5078K1340o1543m4328Q8220O1722J0579k9929p9151P6915M3530
$$ 47656 32804 47882 69222 7679 -36649 51571 113293 123872 93943 14792 91707 135237
23088A35237p7116r3244j19527Q3935K03820m2558n6378L09m9591m1206M2146
$$ 135237 58121 -35123 -154650 -70715 133105 90547 34169 34478 -15113 -56319 -14173
23077a4173Q3450j15154k07077M5734L1110M1626K0521n0570N7079O1817P4631
$$ -14173 69277 -45877 -252954 -207220 -176110 -134484 -113963 -164533 -107454 -45637 28994
23066B8994J7161J32192l0690k40400j82809K1509J26784Q9496K2272M7552l0957
$$ 28994 46155 178347 147657 -92743 -275552 -254043 -127259 -37763 -15491 32061 1104
23055A104L6113L5537p896L5014n2043p8799O2548J335o7513n3870k1123K0710
$$ 1104 37217 72754 64858 99872 47829 -30970 31578 32913 -34600 -88470 -109593 -88883
23043h8883J898p8593k4519N8294j6249o1186N2623O7333L2892J0195K091j3701
$$ -88883 -86985 -165578 -190097 -131803 -148052 -209238 -156615 -89282 -56390 -46195 -44104 -57805
23031e7805K9823J4924M0439O635N80j1812n4906n6143n9637L5865J25559L025
$$ -57805 -27982 -13058 27381 34016 34596 22784 -32122 -88265 -147902 -112037 13522 16547
23019A6547o9775R533L9014l1353l8770N2119P0165j22747j38112l5302J44209
$$ 16547 -53228 -43695 -4681 -36034 -74804 -22685 47480 -75267 -213379 -248681 -104472
23008a04472J23823j21266Q107l0772k6031N5355m1874p7642O9552R3444M1616
$$ -104472 19351 -101915 -93808 -124580 -150611 -95256 -137130 -214772 -145220 -51776 -10160
22997a0160m8818k8854R0867R073o2753L0227P4280J0510p80n4471m5736j04113
$$ -10160 -58978 -87832 3035 12108 -50645 -20418 53862 64372 63592 9121 -36615 -140728
22985a40728K309R6320J29624p89q5485K9559J60966p143r0412j58526m7811J7742
$$ -140728 -138419 -42099 87525 86736 1251 30810 191776 184633 94221 -64305 -112116 -94374
22973i4374L1264Q2100M2845m222P289M653r6483m1262Q3871J1873m8116m8257
$$ -94374 -63110 18990 61835 57613 64902 69555 -26928 -68190 15681 27554 -20562 -68819
22961f8819q8366K2473J5185o0776j0261P5365R9463N8221m8978N519M2258j08693
$$ -68819 -157185 -134712 -119527 -180303 -190564 -115199 -15736 42485 -6493 -974 41284 -67409
22949f7409M2970L4403r4740M6080J23574J0059r5270n1039m2554P8437j5375
$$ -67409 -24439 9964 -84776 -38696 84878 94937 -333 -51372 -93926 -15489 -30864
22938c0864l8981O8248J04467O901q0467L4814P4155L848n5998j26246J5522N5281
$$ -30864 -69845 -1597 102870 109771 29304 64118 138273 142121 86123 -40123 -24601 30680
22926C0680J19945L2908P707m2353P406K0045j19573m0544k360N5485k844N839
$$ 30680 150625 183533 191240 148887 156293 176338 56765 16221 13861 69346 66502 72341
22914G2341r6979n2621J04640K4596K1982m6819j40758j18420J9071Q8518N6722
$$ 72341 -24638 -77259 27381 51977 73959 27140 -113618 -232038 -212967 -124449 -67727
22903f7727L2786N9828J7539M7407k540K2015N8849n3036q0107L2931o4559k05642
$$ -67727 -34941 24887 42426 89833 87293 109308 168157 115121 35014 67945 3386 -202256
22891b02256M6983K0885l283M926J2284P4491J06040L5601r7340l2738O0218p1649
$$ -202256 -155273 -134388 -137671 -132745 -120461 -45970 60070 95671 -1669 -34407 25811 -45838
22879d5838o7907M6463K3398k8721O5027O9166n4822K0543M2862p6653o3515p9283
$$ -45838 -113745 -67282 -43884 -72605 -7578 61588 6766 27309 70171 -6482 -69997 -149280
22867a49280N0178J86042R179m1040n140l6961Q768M2808j8908q7761K3787J53235
$$ -149280 -99102 86940 96119 55079 49939 12978 21746 64554 45646 -42115 -18328 134907
22855A34907P52j56654r0728Q8563M1221M2434J466j3301r66j1056l8544K3060
$$ 134907 135659 -20995 -111723 -23160 18061 60495 61961 48660 47694 36638 -1906 21154
22843B1154Q0933p8327j87892L5893Q2874R845L19n1256L5648O40M0687k5963
$$ 21154 102087 23760 -164132 -128239 -45365 -35520 -35201 -86457 -50809 -50169 -9482 -35445
22831c5445q3450K7566J02452Q1587J658J4515L4392l1200q9927J137k0611m3254
$$ -35445 -118895 -91329 11123 92710 94368 108883 143275 112075 22148 23285 2674 -40580
22819d0580M0438J50876q8914p2333J41070J52161m3438j35509R368k1838q9117
$$ -40580 -142 150734 61820 -10513 130557 282718 239280 103771 113139 91301 2184
22808B184j0545j9520m1665P891o7979k0759O7931K3815L0876O5581K9186m0340
$$ 2184 -8361 -27881 -69546 -61655 -129634 -150393 -82462 -58647 -27771 37810 66996 26656
22796B6656l5231q2232M7621P4401p6420j4107R215j816M5053J7482o4352Q179
$$ 26656 -8575 -90807 -43186 31215 -45205 -59312 -50097 -51913 -6860 10622 -53730 -45551
22784d5551Q332r8373L899M8602k8394M5215n1416l7995J3102P5216J18074q2628
$$ -45551 -37219 -135592 -131693 -83091 -111485 -66270 -117686 -155681 -142579 -67363 50711 -31917
22772c1917K6664J3698P1038m318m1989P853P5193P3068q3645j17196J8351K3593
$$ -31917 -5253 8445 79483 75165 33176 41029 116222 189290 105645 -11551 6800 30393
22760C0393n0143J868K1197M8114o0520P3839j1513m1650j9209O5690J4008j1195
$$ 30393 -19750 -17882 3315 51429 -9091 64748 53235 11585 -7624 58066 72074 60879
22748F0879L4486J43559k920q6466n5714j02243m9478L6729k5070L2507O0588
$$ 60879 95365 238924 236004 149538 93824 -8419 -57897 -21168 -46238 -13731 46857
22737D6857J07269M3087p0373m4839n112k9825j05476q9100P7440Q2502J6671
$$ 46857 154126 197213 126840 82001 76889 47064 -58412 -147512 -70072 12430 29101
22726B9101o2156K7978m472P0209L5280o3645o8115m5084J7177j6604K5700R5504
$$ 29101 -33055 -5077 -9549 60660 95940 32295 -35820 -80904 -63727 -80331 -54631 40873
22714D0873N222j10997M8376J17104L8167m1450q1113R8863m6957n2924j3712
$$ 40873 46095 -64902 -16526 100578 138745 97295 16182 115045 68088 15164 1452
22703A452o6548Q810k216m3280P5790j047m1763l2541Q7930O9485J934j0308Q189
$$ 1452 -65096 -56286 -58502 -101782 -25992 -27039 -68802 -101343 -13413 56072 58006 47698 55887
22690E5887k8651n193O002J27955l3797j8557N9914R2152j09032j10726m4526
$$ 55887 27236 22043 28045 156000 122203 103646 163560 255712 146680 35954 -8572
22679h572J7744j8117O316N7935L3321j09324j1026j2207L6546n7419j9633K0526
$$ -8572 9172 -8945 -2629 55306 88627 -20697 -31723 -43930 -7384 -64803 -84436 -63910
22667f3910j6666Q1283l86k6042o248j8053m8970j8567J6682N3363j7754n0010
$$ -63910 -80576 707 321 -25721 -31969 -50022 -98992 -117559 -100877 -47514 -65268 -115278
22655a15278j9941m7518M4771J59910l1046m7345m3251N4831N2909P0887K8755
$$ -115278 -135219 -182737 -137966 21944 -9102 -56447 -99698 -44867 8042 78929 107684
22644A07684r7115j50990J3025K7108O0613J33289K9351J007j33044r9113r192
$$ 107684 10569 -140421 -127396 -100288 -39675 93614 122965 123972 -9072 -108185 -117377
22633a17377R128J6199K8429l7702p0217o101J31103j2525r7291k9637J0802N101
$$ -117377 -108249 -92050 -63621 -101323 -171540 -177641 -46538 -59063 -156354 -185991 -175189 -170088
22621a70088N5214N7828J20265K0769q7334q9507k1182L8840J8734n2330N4030
$$ -170088 -114874 -57046 63219 83988 -3346 -92853 -114035 -75195 -56461 -108791 -54761
22610e4761M6993j0702p1860j220J69078Q8786m0849o5239p2148L2337K0614K9829
$$ -54761 -7768 -18470 -90330 -91550 77528 166314 125465 60226 -11922 20415 41029 70858
22598G0858r6042k5050J10349O376K9774M2820q579j38954j05433L007q187L4088
$$ 70858 -25184 -50234 60115 66491 96265 139085 130506 -8448 -113881 -110874 -119061 -84973
22586h4973J34941K7274L7321R792k7734j37954J33409Q2896m1341j37492r0762
$$ -84973 49968 77242 114563 124355 96621 -41333 92076 174972 133631 -3861 -94623
22575i4623P6995K5421J2205j41751o363J20132m0260l9247L7187M1143O7331
$$ -94623 -17628 7793 19998 -121753 -128116 -7984 -48244 -87491 -50304 -9161 58170
22564E8170J5091L6363N5551k0246j28698l5113l0158l2209L3809O9856K3905
$$ 58170 73261 109624 165175 144929 16231 -18882 -49040 -81249 -47440 22416 46321
22553D6321k5923j65000o4799N1627R5512l0478k4696N049k4628j41694J3444
$$ 46321 20398 -144602 -209401 -157774 -62262 -92740 -117436 -112387 -137015 -278709 -265265
22542b65265L4204M1692P6975L20m2578J9431P6895R7228L1410o0718J03601L1763
$$ -265265 -231061 -189369 -112394 -112074 -154652 -135221 -58326 38902 70312 9594 113195 144958
22530A44958N6034Q064j19565P172M4799n420j22803l6657K1979J15867M6030
$$ 144958 200992 209056 89491 96663 141462 136042 13239 -23418 -1439 114428 160458
22519A60458J5352m1263l5135r1388j33393n3982K9209N0422K5594J7291L0861
$$ 160458 175810 134547 99412 8024 -125369 -179351 -150142 -99720 -74126 -56835 -25974
22508b5974J14276n1260j592O9289r3344m7988r2431m7777N0259K3968M6510L2471
$$ -25974 88302 37042 35450 104739 11395 -36593 -129024 -176801 -126542 -102574 -56064 -23593
22496b3593j7006j3650n245p3969M1806n4246J1402J13241P3033O8300N9955J298
$$ -23593 -40599 -54249 -59494 -133463 -91657 -145903 -134501 -21260 51773 120073 180028 181326
22484A81326j8048j52522r5375m0177J30030k4661q990M7647O5889L3621P4813
$$ 181326 163278 10756 -84619 -124796 5234 -19427 -28417 19230 85119 118740 193553
22473A93553n990q3430q9785J2930m2862Q283J6082K4505j06290n6019N8727l3921
$$ 193553 187563 104133 14348 27278 -15584 -7301 8781 33286 -73004 -129023 -70296 -104217
22461a04217m9867j33502j82J33214J07448j3059J02141L8483n2448Q0512K4811
$$ -104217 -154084 -287586 -287768 -154554 -47106 -60165 41976 80459 28011 108523 133334
22450A33334p7087o8066o8409Q320P0019M124n7970N7451Q5699L6377M9303n7165
$$ 133334 56247 -11819 -80228 -71908 -1889 2235 -55735 1716 87415 123792 173095 115930
22438A15930j54164n7891M9761j6152k7589n1177L3883J18765Q357m0890M9760
$$ 115930 -38234 -96125 -46364 -62516 -90105 -141282 -107399 11366 19723 -21167 28593
22427B8593M9215j21959j09281L8873Q7174K8943m6301j8981L1562K8125N7454
$$ 28593 77808 -44151 -153432 -114559 -27385 1558 -44743 -63724 -32162 -4037 53417
22416E3417J15253J6027j12265r6831p6248L4928O1662n7498J20138n973p0766
$$ 53417 168670 184697 72432 -24399 -100647 -65719 -4057 -61555 58583 52610 -18156
22405a8156P7144L3401j02194j1166l2180m9296J28321J03973l8783L0770N5651
$$ -18156 58988 92389 -9805 -20971 -53151 -102447 25874 129847 91064 121834 177485
22394A77485j25282o0776N2527l1677L0054O0671p6985j05592k0767K0634l6220
$$ 177485 52203 -8573 43954 12277 42331 103002 26017 -79575 -100342 -79708 -115928
22383a15928M6623J02482m5006l6648N336k4064Q7871K4088J2393j6048k9011
$$ -115928 -69305 33177 -11829 -48477 -43141 -67205 20666 44754 57147 41099 12088
22372A2088l2269l1060p9929l2829N0271J692L6584l6144l5017M1534j6042k2635
$$ 12088 -20181 -51241 -131170 -163999 -113728 -112036 -75452 -111596 -146613 -105079 -121121 -143756
22360a43756M207J49346M4304k7783j40386o0025J48062M2606l6798k3975m8748
$$ -143756 -139549 9797 54101 26318 -114068 -174093 -26031 16575 -20223 -44198 -92946
22349i2946Q4616O6375M0929K3626J9126J3229j66440j60410l6479M9472J7456
$$ -92946 -8330 58045 98974 122600 141726 154955 -11485 -171895 -208374 -158902 -141446
22338a41446k5392m6851P781N2208J48382R2223j2747k1207k7718L5747J4844
$$ -141446 -166838 -213689 -205908 -153700 -5318 86905 74158 52951 25233 60980 75824
22327G5824l8879n322l3528k6082J14465O0177j20053j35829M5810j7890L4300
$$ 75824 36945 31623 -1905 -27987 86478 146655 26602 -109227 -63417 -81307 -47007
22316d7007P4006K9217n6749m6275j2357Q2276O8026j26665o676K335l0413K43
$$ -47007 26999 56216 -533 -46808 -59165 23111 91137 -35528 -42204 -39869 -70282 -70039
22304g0039N0J2132K6190o4766q7965k0212J6749J47760N189l7116n6738O1894
$$ -70039 -69989 -57857 -31667 -96433 -184398 -204610 -187861 -40101 -34912 -72028 -128766 -66872
22292f6872R1449K1059j214n7590J5524n6426k7640O0195Q9741k8291p3433M2253
$$ -66872 24577 45636 44422 -13168 2356 -54070 -81710 -21515 68226 39935 -33498 8755
22280H755L3769m3479K8971R8672o5017l9107M7354J7708r9505n3399L676K1573
$$ 8755 42524 -955 28016 126688 61671 22564 69918 87626 -11879 -65278 -61602 -40029
22268d0029L1041L0202J27951Q424q2317j09128L2013M6631M714j6396r4039P0010
$$ -40029 -8988 21214 149165 157589 75272 -33856 -1843 44788 49502 33106 -60933 9077
22256I077p3514k6572O7410K6382q9893R6212J31111K3964n0099o0831o0331n1938
$$ 9077 -64437 -91009 -23599 2783 -87110 9102 140213 164177 114078 53247 -7084 -59022
22244e9022n074R1241J60574n338k05832j25469j0599J13556O3389o2413Q4686
$$ -59022 -64096 27145 187719 182381 -23451 -148920 -159519 -45963 17426 -44987 39699
22233C9699K5534J2100O8333K7684k4652r3910q3397l931O616l391O070j7649
$$ 39699 65233 77333 145666 173350 148698 54788 -28609 -32540 -25924 -29315 -23245 -40894
22221d0894J6400Q0919n4050J5069O1267j4369J574q7815n9147l2775l7831k0770
$$ -40894 -24494 56425 2375 17444 78711 64342 65916 -21899 -81046 -113821 -151652 -172422
22209a72422O876j8697M9134N9099J3131m7229L4326J4121M951R4358M8940P07
$$ -172422 -165546 -184243 -135109 -76010 -62879 -110108 -75782 -61661 -56710 37648 86588 87295
22197H7295l01M5248j5272N7939p3677p4705k4684L8216l0603o5244k3182j03086
$$ 87295 86994 132242 116970 174909 101232 26527 1843 40059 9456 -55788 -78970 -182056
22185a82056M8899J73740N8291m062J4857o2099j31974k1446J6946Q426R4319
$$ -182056 -133157 40583 98874 94812 109669 47570 -84404 -105850 -88904 -80478 13841
22174A3841j8518n7282O8388N7637J32466O5418q4674n1255r1826l8191N3365
$$ 13841 -4677 -61959 6429 64066 196532 261950 177276 126021 34195 -3996 49369
22163D9369J6385j15879J683Q1570K8908j46506r9815N1229Q0981K18902k6430
$$ 49369 65754 -50125 -48442 33128 62036 -84470 -184285 -133056 -52075 166827 140397
22152A40397l9104m2556q8070J0922m185Q973J8624N6730K160o6448j2611M0809
$$ 140397 101293 58737 -29333 -18411 -22596 -13623 5001 61731 63891 -2557 -15168 25641
22140B5641P4791M8562r4306o8491L2441J0477k558J8967j8773P127K7170K7242
$$ 25641 100432 148994 54688 -13803 18638 29115 26557 45524 26751 33878 61048 88290
22128H8290j3294m4711p3768k7335N8524l242j127p4605q901N1051L8263N894
$$ 88290 74996 30285 -43483 -70818 -12294 -15536 -16663 -91268 -100169 -49118 -10855 -4961
22116d961p2868n5491J30774J48404K0775j01260q0907K668Q5710N145j1668j486
$$ -4961 -77829 -133320 -2546 145858 166633 65373 -15534 -12866 72844 77989 66321 64835
22104F4835q9676p1206n0347n9930P8293J51516l7421P1864q4921n5187P5211
$$ 64835 -24841 -96047 -146394 -206324 -128031 23485 -13936 57928 -26993 -82180 -6969
22093f969O9562l4414R5455l0488j32484j4533q353Q3537J4233O3901n0177j06516
$$ -6969 62593 28179 123634 93146 -39338 -53871 -62224 21313 35546 99447 49270 -57246
22081e7246k4207L5124j2788j8380j03974J1089K110l238L5165M8956N5091R64
$$ -57246 -81453 -46329 -59117 -77497 -181471 -170382 -168272 -171510 -136345 -87389 -32298 -31334
22069c1334o1549J3014Q8548L7190M0537O3797J5681j03548q7314J12547m0481
$$ -31334 -92883 -79869 8679 45869 86406 150203 165884 62336 -24978 87569 47088
22058D7088r2243L2303P3207L735k4021k4198K359n492M7632l125j4583p2292
$$ 47088 -45155 -12852 60355 64090 40069 15871 18230 12738 60370 57245 42662 -29630
22046b9630j18475J6352Q628o4293p2817J9416N6994Q4369M8868J08136R0224
$$ -29630 -148105 -131753 -123125 -187418 -260235 -240819 -183825 -99456 -50588 57548 147772
22035A47772q0834j40545q7578l6615L0299P8244K04702J10779o928l8553o4259
$$ 147772 66938 -73607 -161185 -197800 -167501 -89257 115445 226224 219296 180743 116484
22024A16484l839m9288j6106m4135l231k5807j682P7882K1959K3914l9991k2221
$$ 116484 112645 63357 47251 3116 -115 -25922 -27604 50278 72237 96151 56160 33939
22012C3939R9706O7927j29018j21803p4175k796N6856M1064J5957m0359m5289
$$ 33939 133645 201572 72554 -49249 -123424 -126220 -69364 -28300 -12343 -52702 -97991
22001i7991M9308J8030k2099r510j304k2012Q1425k5058K3295O1988M1970K2340
$$ -97991 -48683 -30653 -52752 -62262 -63566 -85578 -4153 -29211 -5916 56072 98042 120382
21989A20382j26240p0312m422Q0953O6918l6219J21753k6783l3953O084p5276
$$ 120382 -5858 -76170 -80592 361 67279 31060 152813 126030 92077 98161 22885
21978B2885j5014P516n6565p8234L3510L7925Q1066r2523m2559J7608L9844j4665
$$ 22885 7871 15387 -41178 -119412 -85902 -47977 33089 -59434 -101993 -84385 -44541 -59206
21966e9206J235r4555o3919K3206m7175J19867O8004k8958q4233K4858N5113J12417
$$ -59206 -57971 -152526 -216445 -193239 -240414 -120547 -52543 -81501 -165734 -140876 -85763 26654
21954B6654q395r901P6796J9532o6619m2868m3846L195J02586P4150p405j17683
$$ 26654 18259 8358 85154 104686 38067 -4801 -48647 -45452 57134 131284 123879 6196
21942F196r3507o1438Q3468Q8047j366n940l125k1496k8310j8127K3595J05186
$$ 6196 -87311 -148749 -65281 22766 21400 15460 12335 -9161 -37471 -55598 -32003 73183
21930G3183N5586j07170k5034L2448l4619J6812L4051j4750M4747j11325r556
$$ 73183 128769 21599 -3435 29013 -5606 11206 45257 30507 75254 -36071 -45627
21919d5627P3679k5551l639O1027l3082J5618n3463J6373K5479j03167j02074
$$ -45627 28052 2501 -1138 59889 26807 42425 -11038 5335 30814 -72353 -174427
21908a74427O1301J9969K6851O0164N6454l6805Q925j8929J8661K9348n33k18713
$$ -174427 -113126 -93157 -66306 -6142 50312 13507 22432 3503 22164 51512 50979 -167734
21896a67734m0610P5847N2687R2687J33165P8600j15112r483n644r4162l8661
$$ -167734 -208344 -132497 -79810 12877 146042 224642 109530 100047 94403 241 -38420
21885c8420N9433K1429m1781N1055l0273j07137Q0198Q9709L4713J157l7589l8286
$$ -38420 21013 42442 661 51716 21443 -85694 -5496 84213 118926 120083 82494 44208
21873D4208M9835M2703o3635P8369K1267r2002j2048l0352J0911L1185m148k2118
$$ 44208 94043 136746 73111 151480 172747 80745 68697 38345 49256 80441 76293 54175
21861E4175j74094j89106J48796R5910Q4923L6806k1504l324J3079k006r8241
$$ 54175 -119919 -309025 -160229 -64319 20604 57410 35906 32582 45661 43655 -54586
21850e4586j16601L0520M7332J32974N4936p7804r0325L1229O2987l001K2193
$$ -54586 -171187 -140667 -93335 39639 94575 16771 -73554 -42325 20662 17661 39854
21839C9854O4856L2406o6698o4913N1825j0438K53K2706j3879q6537J879L2367
$$ 39854 104710 137116 70418 5505 57330 46892 47145 69851 55972 -30565 -28686 3681
21827C681L1072J8695L55n5579m0872o7780n6687P1296J25569J39100K5508o6401
$$ 3681 34753 53448 53803 -1776 -42648 -110428 -167115 -95819 29750 168850 194358 127957
21815A27957k1446L9295l8723p6318K7381J4105k4336M4502J4486M9170k5582
$$ 127957 106511 145806 107083 30765 58146 72251 47915 92417 106903 156073 130491
21804A30491K5851k2011J939n5261k9254m9413m0291J7222K4022J58602n05k3574
$$ 130491 156342 134331 136270 81009 51755 2342 -37949 -20727 3295 161897 161392 137818
21792A37818J2452L993j8994j6311K3788n9938m0287K5643N0794l6482l0993n201
$$ 137818 150270 154263 135269 118958 142746 82808 42521 68164 118958 82476 51483 46282
21780D6282k9216K7735o630l3966O6672n5559n087J43883j7230j07859m2449Q9548
$$ 46282 17066 44801 38171 4205 70877 15318 10231 154114 136884 29025 -13424 76124
21768G6124j9r5391j363O0958N9193J01438l9012j25392J9905l1853J0761k9473
$$ 76124 76105 -19286 -20649 40309 99502 200940 161928 36536 56441 24588 35349 5876
21756E876M8978j6429l8167l5468j5327k2156N6105L1777o5129m6081M2604l2139
$$ 5876 54854 38425 258 -35210 -50537 -72693 -16588 15189 -49940 -96021 -53417 -85556
21744h5556m4457J09321J23094j03045m2245l1450q270O008o1821n3194J33752
$$ -85556 -130013 -20692 102402 -643 -42888 -74338 -82608 -76600 -138421 -191615 -57863
21733e7863J37605j6456l9882p0908K033L2103p7355k694P2069J67138R528o3533
$$ -57863 79742 63286 23404 -47504 -45471 -13368 -90723 -93417 -21348 145790 155318 91785
21721I1785l9237p9236m5393p1994j9290l0653l2656J8447J27016L7396j6855
$$ 91785 52548 -26688 -72081 -144075 -163365 -194018 -226674 -208227 -81211 -43815 -60670
21710f0670M3547P7700k8002o0434j6962K0339P4348K6311m7291n7904K6823L6082
$$ -60670 -17123 60577 32575 -27859 -44821 -24482 49866 76177 28886 -29018 -2195 33887
21698C3887p6499p4328j7369R3894L5337m3364k4998J6520j01130l4653N6061
$$ 33887 -42612 -116940 -134309 -40415 -5078 -48442 -73440 -56920 -158050 -192703 -136642
21687a36642K3506n5890Q8860M8309k97j8136o8971k9132J7287J05283M9426m944
$$ -136642 -113136 -169026 -80166 -31857 -32154 -50290 -119261 -148393 -131106 -25823 23603 18659
21675A8659K2272J30700m0194j65305K8846Q6656R90p6853r2856j77399p4052
$$ 18659 40931 171631 131437 -33868 -5022 81634 82624 5771 -87085 -264484 -338536
21664c38536J31897J36978Q3487q0013M0775O51Q2599o9168O7266K02285n7932
$$ -338536 -206639 -69661 13826 -66187 -25412 -24761 57838 -11330 55936 258221 200289
21653B00289p1042j5366N243r3585r4037N4917L6759N2007M0286N596J6856n2734
$$ 200289 129247 113881 119124 25539 -68498 -13581 23178 75185 115471 121067 137923 85189
21641H5189r319l7056q391L9897j634r4718n1891M8401R9703J3311m1597n7720
$$ 85189 75870 38814 30423 70320 68686 -26032 -77923 -29522 70181 83492 41895 -15825
21629a5825l9209O1397N1712n6503M6471j6067q1838j4538L4543m1722n8072Q7992
$$ -15825 -55034 6363 58075 1572 48043 31976 -49862 -64400 -29857 -71579 -129651 -41659
21617d1659J06133N1023j15720N127K9714j38550J7881O9921O059m4480J47190
$$ -41659 64474 115497 -223 4904 34618 -103932 -86051 -16130 -10071 -54551 92639
21606I2639K9116p2674k0117l598L3501n2436j6405J9588r6015K7038J00916O1134
$$ 92639 121755 49081 28964 25366 58867 6431 -9974 9614 -86401 -59363 41553 102687
21594A02687J7875m7290K2489O5515j6583Q0638K3697Q4543j08766j40987n3221
$$ 102687 120562 73272 95761 161276 144693 225331 249028 333571 224805 83818 30597
21583C0597L1607J115O7601q3312r5737J9140M2266K550K1489p203n0701n2608
$$ 30597 62204 63319 130920 47608 -48129 -28989 13277 15827 37316 30113 -20588 -73196
21571g3196j54731L7619L0489P3634P8038m1565M029j10411l2335J76379P1582
$$ -73196 -227927 -190308 -159819 -86185 -8147 -49712 -45683 -156094 -188429 -12050 59532
21560E9532r3595m5671L5153k729O2409o90o3473j07480P9918L4067j35351k358
$$ 59532 -34063 -79734 -44581 -47310 15099 14409 -49064 -156544 -76626 -42559 -177910 -180268
21548a80268Q8629Q7061O8280n7317o2535R4538R5925L6581k8349j08312r4170
$$ -180268 -91639 -4578 63702 6385 -56150 38388 134313 170894 142545 34233 -59937
21537e9937q0272K3724M7652L5741O7685J17415l5125n6040m6034L0562K5481
$$ -59937 -140209 -116485 -68833 -33092 34593 152008 116883 60843 14809 45371 70852
21526G0852j1187r601j0196K2770N8429M1359k6605l128k7062p1513j9968o8756
$$ 70852 59665 50064 39868 62638 121067 162426 135821 132693 105631 34118 14150 -54606
21514e4606J6934l2673R3528J11611q4460o7491j11279Q895J50725r694o5592
$$ -54606 -37672 -70345 23183 134794 50334 -17157 -128436 -119541 31184 21490 -44102
21503d4102p3410M232k9043m6781O7223P4577O3686L9607j417p0423p4253K4304
$$ -44102 -117512 -113280 -142323 -189104 -121881 -47304 16382 55989 54572 -15851 -90104 -65800
21491f5800P3614O721l9910k2877j07774K0441O0114L5234k1361N5437L7429O9472
$$ -65800 7814 14535 -25375 -48252 -156026 -135585 -75471 -40237 -61598 -6161 31268 100740
21479A00740M2835p3913j09680l9945k9162K5045M2352j40193o0507K1139O7745
$$ 100740 143575 69662 -40018 -79963 -109125 -84080 -41728 -181921 -242428 -221289 -153544
21468a53544O9761P8216O0786n589m8766j4640n9301M7844Q8690k2257l5180l3820
$$ -153544 -83783 -5567 55219 49630 864 -13776 -73077 -25233 63457 41200 6020 -27800
21456b7800K4321L8089J7886k3143K7904P8863k0867m0917r2479N6730Q9593k5376
$$ -27800 -3479 34610 52496 29353 57257 136120 115253 74336 -18143 38587 128180 102804
21444A02804j41252j4380J4023j180q0486o6336P0023L9710j0451m6749K9641
$$ 102804 -38448 -52828 -38805 -39985 -120471 -186807 -116784 -77074 -87525 -134274 -104633
21433a04633P3620R8065Q0667J48175j47682j37748K8552R1724q6061j00485p097
$$ -104633 -31013 67052 147719 295894 148212 10464 39016 130740 44679 -55806 -62903
21422f2903q1314Q9087q963k3293R275j4878n0442P490Q7382k4107n8865J52127
$$ -62903 -144217 -55130 -64093 -87386 -78111 -92989 -143431 -135941 -48559 -72666 -131531 20596
21410B0596K1112O2088r0798j39297K8932p6021o0552o5674N4566L258l8780O9747
$$ 20596 41708 103796 12998 -126299 -97367 -173388 -233940 -299614 -245048 -241790 -280570 -210823
21398b10823Q6597M0376j94691M3035J26780J1507l8309J1035N8694K0933K851
$$ -210823 -124226 -83850 -278541 -235506 -108726 -97219 -135528 -124493 -65799 -44866 -42015
21387d2015O2651m9955r3885O611N4808l519l3603K7799O1500L1416N4467k5579
$$ -42015 20636 -29319 -123204 -116593 -61785 -65304 -98907 -71108 -9608 21808 76275 50696
21375E0696r6559N6484K8464j5207N6362O459j04575p6420n1991J6707R1836r3656
$$ 50696 -45863 10621 39085 23878 80240 86699 -17876 -94296 -146287 -129580 -37744 -131400
21363a31400j03188J412J20762R2851M3315O8308j34547r0325M5982J22641M0126
$$ -131400 -234588 -233176 -112414 -19563 23752 92060 -42487 -132812 -86830 35811 75937
21352G5937m0401p1876n6006M0354R1408O9687p2672j24476m2690L0895K1083
$$ 75937 35536 -36340 -92346 -51992 39416 109103 36431 -88045 -130735 -99840 -78757
21341g8757M2607k1819q2408k5342J3189o0225R201J26674N707M3973P8828j6544
$$ -78757 -36150 -57969 -140377 -165719 -152530 -212755 -203554 -76880 -71173 -27200 51628 35084
21329C5084k5398j2237p3531J7430M1207K4338Q9791m0835K2304K6149R6217k5192
$$ 35084 9686 -2551 -76082 -58652 -17445 6893 96684 55849 78153 104302 200519 175327
21317A75327j15574N1619j9733l9597j3155O3380l799p981M4464J537k1272l7165
$$ 175327 59753 111372 91639 52042 38887 102267 98468 90487 134951 136488 115216 78051
21305G8051j49114o7707o811l5236J41366M8856n6761k0230k5257J5364N5514
$$ 78051 -71063 -138770 -145581 -180817 -39451 9405 -47356 -67586 -92843 -77479 -21965
21294b1965M2545m3887N0912Q2345l8279J8806j6524q3487K4885Q19K0423k5992
$$ -21965 20580 -23307 27605 109950 71671 90477 73953 -9534 15351 16170 36593 10601
21282A0601p006J03968p0351J1323K7505J214j4224l1362m0698K2604L9960O5755
$$ 10601 3595 107563 37212 48535 76040 77254 63030 31668 -9030 13574 53534 119289
21270A19289j4726r345r5019K2523K2513M278K2877P0560o1893j17535m6137R84
$$ 119289 104563 95218 199 22722 45235 49513 72390 142950 81057 -36478 -82615 -81631
21258h1631o2372o113J6074K1397k7307m2956P1791J97526R4410j2228j94091
$$ -81631 -144003 -150116 -134042 -112645 -139952 -182908 -111117 86409 180819 168591 -25500
21247b5500p9044N694L7283n666k8859P8989M0330m8448q194j29863o2265R4749
$$ -25500 -104544 -98850 -61567 -67233 -96092 -17103 23227 -25221 -33415 -163278 -225543 -130794
21235a30794Q354K7715J74053q5413m5838r1095m1606J15572M9100J7680m8300
$$ -130794 -122440 -94725 79328 -6085 -51923 -143018 -184624 -69052 -19952 -2272 -50572
21224e0572J04842J8289r3835o9946K0842L0586P3450j1743M4706M355J2263k1554
$$ -50572 54270 72559 -21276 -91222 -70380 -39794 33656 21913 66619 70974 83237 61683
21212F1683Q589k4605O1702n3429k8415J8743J1998Q8615K6323k3332j83853q6966
$$ 61683 70272 45667 107369 53940 25525 44268 56266 144881 171204 147872 -35981 -122947
21200a22947R7979Q7694J1751L7781l7181p2983k2169p1142k2430r589k3866m2065
$$ -122947 -24968 62726 74477 112258 75077 2094 -20075 -91217 -113647 -123236 -147102 -189167
21188a89167o423m7278r545j9008M1044J1047L3726N2524L1373J03566k385l4397
$$ -189167 -195590 -242868 -252413 -271421 -230377 -219330 -185604 -133080 -101707 1859 -526 -34923
21176c4923R1750L885o9604n3970M0317k7103k4949q0358J54615J08323O4748
$$ -34923 56827 60712 -8892 -62862 -22545 -49648 -74597 -154955 -340 107983 172731
21165A72731o546q2144j37141q0981J10649O5708k4573n9081k578R7205L7011
$$ 172731 166185 84041 -53100 -134081 -23432 42276 17703 -41378 -43956 53249 90260
21154I0260K0305j9706O0045M5675j09164k9646l5065j1127o1375k2757O0828
$$ 90260 110565 90859 150904 196579 87415 57769 22704 11577 -49798 -72555 -11727
21143a1727O2195Q9870M4294j28944n4857r4212l1603j3698r746M3235J00212
$$ -11727 50468 140338 184632 55688 831 -93381 -124984 -138682 -148428 -105193 -4981
21132d981P1697m7475n2860j04333n611Q4929J48748O1329P9409N2672Q702j26909
$$ -4981 66716 19241 -33619 -137952 -143563 -58634 90114 151443 230852 283524 292226 165317
21120A65317n9871m0239p0933j03791J4752L8849r66l1144Q4604M6732m144j57342
$$ 165317 105446 65207 -5726 -109517 -94765 -55916 -56882 -88026 -3422 43310 39166 -118176
21108a18176r4061J10128R5504j59263m4137J02325M8425k9417q0562o6920K4979
$$ -118176 -212237 -102109 -6605 -165868 -210005 -107680 -59255 -88672 -169234 -236154 -211175
21097b11175J17622J03876L884PL8013r138J3449J18826P3101n3192j08835O1935
$$ -211175 -93553 10323 14207 14214 52227 43089 56538 175364 248465 195273 86438 148373
21085A48373L1380j30062j27622L4186M9908P7686J7303K378j3697o4216q6797
$$ 148373 179753 49691 -77931 -43745 6163 83849 101152 103530 89833 25617 -61180
21074f1180j233K6512K61N7541M4583j00006r0034Q3129J6522j33597L7668j05073
$$ -61180 -62413 -35901 -35640 21901 66484 -33522 -123556 -40427 -23905 -157502 -119834 -224907
21062b24907k372q22J1984J12441J375P1234J1903j4183N5529M2895j0109P3951
$$ -224907 -227279 -228101 -216117 -103676 -102301 -31067 -19164 -33347 22182 65077 54968 128919
21050A28919L9956j05508j13706n9021p1560K5097J0385O4554n7973p830N7440
$$ 128919 168875 63367 -50339 -109360 -180920 -155823 -145438 -80884 -138857 -146687 -89247
21039h9247m9261q596P8791K5110P0354J2112l1019L5098r6666o3288j6300l4384
$$ -89247 -138508 -147104 -68313 -43203 27151 39263 8244 43342 -53324 -116612 -132912 -167296
21027a67296R1990Q5126p7743N9506p534j3895R4633k3806o1348m5480r457o4260
$$ -167296 -75306 9820 -67923 -8417 -15951 -29846 64787 40981 -20367 -65847 -75304 -139564
21015a39564J08672Q1548j1875O3264M3633O4639r0436o5482j140J02729k8850
$$ -139564 -30892 50656 38781 102045 145678 210317 119881 54399 53259 155988 127138
21004A27138q5872p9164l2396J7166K5833j10431j6803O8956O4905L9598M4740
$$ 127138 41266 -37898 -70294 -53128 -27295 -137726 -154529 -85573 -20668 18930 63670
20993F3670n2647k432R769j23092N0143J35149p4398O677J7375j03033l4127q3952
$$ 63670 11023 8591 18360 -104732 -54589 80560 6162 12839 30214 -72819 -106946 -190898
20981a90898Q8802Q9817K2632l3436J6957Q895j2182o6158L2197L0823j4236l7443
$$ -190898 -102096 -12279 10353 -23083 -6126 2769 -9413 -75571 -43374 -12551 -26787 -64230
20969f4230j696N5934O6374Q2299L4755n6047q6290k6957p3497L3579L3164p4639
$$ -64230 -65926 -9992 56382 138681 173436 117389 31099 4142 -69355 -35776 -2612 -77251
20957g7251o5884Q262J3741K5180P2998P5152Q3547l1937L6832j3931m5760j0549
$$ -77251 -143135 -134873 -121132 -95952 -22954 52198 135745 103808 140640 126709 80949 70400
20945G0400l7795k3444o6925P672J29582J970n5341j7197m5972m7043p8064K4147
$$ 70400 32605 9161 -57764 -50092 79490 81460 26119 8922 -37050 -84093 -162157 -138010
20933a38010L7109M9822j15355N9501j1114P0810K4227k0795L7947L7718j01494
$$ -138010 -100901 -51079 -166434 -106933 -118047 -47237 -23010 -43805 -5858 31860 -69634
20922f9634p0478K5763R3222M2289J1282q2669r7423j4761Q0783J07200m738j11535
$$ -69634 -140112 -114349 -21127 21162 32444 -50225 -147648 -162409 -81626 25574 20836 -90699
20910i0699o5985M6677P3376M8823m1450P1729Q3805K6574j9763m1971l8837o6306
$$ -90699 -156684 -110007 -36631 12192 -29258 42471 126276 152850 133087 91116 52279 -14027
20898a4027J9163O9254J1094J04888K583k5673L7239N5219o4044K5345m5274m6190
$$ -14027 5136 74390 85484 190372 192955 167282 204521 259740 195696 221041 175767 129577
20886A29577q0166o1486m6294L726R1587M6562l1373p8n06n6100J30550L1619
$$ 129577 49411 -12075 -58369 -54643 36944 83506 52133 52055 51549 -4551 125999 157618
20874A57618L7654K92K1784J57o0412p7073l1059m5873N3993P8842j10412j30090
$$ 157618 195272 195564 217348 217505 157093 80020 48961 3088 57081 135923 25511 -104579
20862a04579j5027J51815J0416m919L4828K3532P512q3979j66276K8041L2070
$$ -104579 -119606 32209 42625 37706 72534 96066 103578 19599 -146677 -118636 -86566
20851h6566p7941k2844N0342N063J9219N7848K2853m2628J2280o3445J28586L0888
$$ -86566 -164507 -187351 -137009 -131946 -112727 -54879 -32026 -74654 -62374 -125819 2767 33655
20839C3655L8419P6555r7275j38963K2451L4986l2890M0367L6018q1778o046L8427
$$ 33655 72074 148629 51354 -87609 -65158 -30172 -63062 -22695 13323 -68455 -74501 -36074
20827c6074J12423L6194n1019k6945r8129p8330q543k474N4803M423J387O6824
$$ -36074 76349 112543 61524 34579 -63550 -141880 -150423 -152897 -98094 -93671 -92284 -25460
20815b5460N5637k8306K9324l7587K035k0370q3703M0119j2867m0971L4324N8988
$$ -25460 30177 1871 31195 -6392 -4357 -24727 -108430 -68311 -81178 -122149 -87825 -28837
20803b8837J8530j16454o4519q288j3763n6703q700n466M1509N9959N4751L6298
$$ -28837 -10307 -126761 -191280 -199568 -213331 -270034 -278734 -284200 -242691 -182732 -127981 -91683
20791i1683Q0719J38953n3282m6411L2754l221j5014n4919j32516o6217k2982
$$ -91683 -10964 127989 74707 28296 61050 57829 42815 -12104 -144620 -210837 -233819
20780b33819Q8982L1909J27884Q9875j34559R4688k5129n8828j3055O4596M4269
$$ -233819 -144837 -112928 14956 104831 -29728 64960 39831 -18997 -32052 32544 76813
20769G6813n0563n1328m3951k7771L9190L793r733O3253Q544j6972n5309m5636
$$ 76813 26250 -25078 -69029 -96800 -57610 -53817 -63550 -297 8247 -8725 -64034 -109670
20757a09670l6778R4574M0444j9137k1796j2320j1409j7487n9304k4310O0792
$$ -109670 -146448 -51874 -11430 -30567 -52363 -64683 -76092 -93579 -152883 -177193 -116401
20746a16401O3638l4838m4549N8472K3877j1060J43789R9297r6404j14532k1902
$$ -116401 -52763 -87601 -132150 -73678 -49801 -60861 82928 182225 85821 -28711 -50613
20735e0613L0059N2882M3323J00275l6049p7290j27009j00331k088R6766Q711
$$ -50613 -20554 32328 75651 175926 139877 62587 -64422 -164753 -166841 -70075 -61364
20724f1364N887m7252N7771L6522O0528K4079p6108J6912n9427q4521l4534m3181
$$ -61364 -55477 -102729 -44958 -8436 52092 76171 63 16975 -42452 -126973 -161507 -204688
20712b04688K3182O4109N2004R2429l0204P395J4655L9600j4497o2746K7235J7821
$$ -204688 -181506 -117397 -65393 27036 -3168 4227 18882 58482 43985 -18761 8474 26295
20700B6295M3501J3456M1762P7360j80422o6179L6574J6284m1805M9485k9946
$$ 26295 69796 83252 125014 202374 21952 -44227 -7653 8631 -33174 16311 -13635
20689a3635j69823Q0660R4735O4549q3652j9299M3789j0954M3030P4085j2456
$$ -13635 -183458 -102798 -8063 56486 -27166 -46465 -2676 -13630 29400 103485 91029
20678I1029j45979m8892R9026O8309o84m031K172M3313n1391o2295J6473N6331
$$ 91029 -54950 -103842 -4816 63493 62809 58778 60950 104263 52872 -9423 7050 63381
20666F3381r1282p1666j6444P4374K2403o0141n0252l322N9355K7880j3222m1077
$$ 63381 -27901 -99567 -116011 -41637 -19234 -79375 -129627 -132949 -73594 -45714 -58936 -100013
20654a00013K2210J27281L6395l995k8971k034m5751r1158r854R4686j6142n8897
$$ -100013 -77803 49478 85873 81878 52907 50873 5122 -86036 -95890 -1204 -17346 -76243
20642g6243N1044M4140l9921l1014N9635Q958j0310P570k5655J3473J56900J59325
$$ -76243 -25199 18941 -20980 -51994 7641 16599 6289 13859 -11796 1677 158577 317902
20630C17902q9247j34977j52021j5206J1811N0362J37208L1412L0297j33905j02792
$$ 317902 228655 93678 -58343 -73549 -61738 -11376 125832 157244 187541 53636 -49156
20619d9156n2157o855P791J01883K3039J9296J7047o7154j09623K9340J8887p4512
$$ -49156 -101313 -108168 -100377 1506 24545 43841 60888 -6266 -115889 -86549 -67662 -142174
20607a42174k452K9368N8480l837j08042l8939l0616N1020J14443J17302P2655
$$ -142174 -144626 -115258 -56778 -60615 -168657 -207596 -238212 -187192 -72749 44553 117208
20596A17208q7248j1593K5805L6170o1387j05837R440j1212p1872R3296Q9102
$$ 117208 29960 18367 44172 80342 18955 -86882 -77442 -88654 -160526 -67230 21872
20585B1872K2717P236o3476k7372L0227K0286p1800n19M2979r8501o6608l7273
$$ 21872 44589 51825 -11651 -39023 -8796 11490 -60310 -60829 -17850 -116351 -182959 -220232
20573b20232O1649Q5476n7095P6838M8991p5946N514m9326j9087J15829J20042
$$ -220232 -158583 -73107 -130202 -53364 -4373 -80319 -74805 -124131 -143218 -27389 92653
20562I2653l0451j07975p0599M0754K0385l470N4095J49318m1568J08607J6369
$$ 92653 62202 -45773 -116372 -75618 -55233 -58703 -4608 144710 103142 211749 228118
20551B28118r6732q5712r969J937l1610k3661q0710j2062Q6684J6337j9898Q5233
$$ 228118 131386 45674 35705 37642 6032 -17629 -98339 -110401 -23717 -7380 -27278 57955
20539E7955N0620m0385q9499j13852r310R7274l3766k1643n0766P0525L4588r4548
$$ 57955 108575 68190 -21309 -135161 -144471 -47197 -80963 -102606 -153372 -82847 -48259 -142807
20527a42807N5680m0124M9435l21P388Q4017k2358k3707O332K6025J1586j1517
$$ -142807 -87127 -127251 -77816 -78137 -70749 13268 -9090 -32797 -26465 -440 11146 -371
20515c71K4918m6430L8304j17244p4712J18176J09854j0085O4109j2022m3980
$$ -371 24547 -21883 16421 -100823 -175535 -57359 52495 42410 106519 94497 50517
20504E0517O589j17857m2129k1335N9878J978K7791N7885k0180o7167n2544k3402
$$ 50517 57106 -60751 -102880 -124215 -64337 -62359 -34568 23317 3137 -64030 -116574 -139976
20492a39976j4916k3001Q5258L4373J66121O2330j0679k039k0811p2787m7275
$$ -139976 -154892 -177893 -92635 -58262 107859 170189 159510 157471 136660 63873 16598
20481A6598n4236N8332m4711l5270l2895O0073q873M9765L9011q2309r8182k6735
$$ 16598 -37638 20694 -24017 -59287 -92182 -32109 -40982 8783 47794 -34515 -132697 -159432
20469a59432J90711M7963j09638j11305J01190J2161j05390J23658N8423M6836
$$ -159432 31279 79242 -30396 -141701 -40511 -28350 -133740 -10082 48341 95177
20459I5177J7672j39286m9350R6052Q3572N7105r38o8208n0579j22537p757P9230
$$ 95177 112849 -26437 -75787 20265 103837 160942 160004 91796 41217 -81320 -89077 -9847
20447i847K4067J802q7820j4271o2792L8532P5434K4034l2198N313j1401l8842
$$ -9847 14220 16022 -71798 -86069 -148861 -110329 -34895 -10861 -43059 -37746 -49147 -87989
20435h7989Q7324J46642j8170j17540l6474k2049m8204l1782J7210O7785j9757
$$ -87989 -665 145977 127807 10267 -26207 -48256 -96460 -128242 -111032 -43247 -63004
20424f3004K608j1769n6506P2030J31637k1257j25557k3008P6470L6147n8624
$$ -63004 -60396 -72165 -128671 -56641 74996 53739 -71818 -94826 -18356 17791 -40833
20413d0833L8574m4502j23467J1815N9980J5943m1738o7414P3796O6539l478Q1972
$$ -40833 -2259 -46761 -170228 -158413 -98433 -82490 -124228 -191642 -117846 -51307 -54785 27187
20401B7187K984r9048j07261r399K0021J12171J17139K0227r9438K8257Q711o9721
$$ 27187 30171 -68877 -176138 -185537 -165516 -53345 63794 84021 -15417 12840 21551 -48170
20389d8170Q512N9624l7893r3885q1281J6765R2197O875q1512l4603O6280J27104
$$ -48170 -39658 19966 -17927 -111812 -193093 -176328 -84131 -77256 -158768 -193371 -127091 13
20377A3R572Q038r9429R051l177O4930J15311l628j9732K949k6191M2255n2345
$$ 13 9585 17623 -81806 -72755 -75932 -11002 104309 100681 80949 83898 57707 99962 47617
20364D7617l1239L31j21750R35o2252m6088J47808O9716M6253k9251L86J6036
$$ 47617 16378 16709 -105041 -104106 -166358 -212446 -64638 5078 51331 22080 22466 38502
20352C8502p1193o0779N9884J5739l0798k3144J0239L4697l4161O3442k1561O0235
$$ 38502 -32691 -93470 -33586 -17847 -48645 -71789 -61550 -26853 -61014 2428 -19133 41102
20340D1102K39910Q9171p7r0395p7088n1229n6345k4153N1669P0536p4407j7307
$$ 41102 281012 370183 370106 279711 202623 151394 95049 70896 122565 193101 118694 101387
20328A01387J4846l7476r5298j2560o4239j8890K05519L399o1183R8199J5310
$$ 101387 116233 78757 -16541 -29101 -93340 -112230 93289 96688 35505 133704 149014
20317A49014k0292J5899j06204q4729j0939k177O071M4141k3465M6939R6699R7173
$$ 149014 128722 144621 38417 -46312 -57251 -59428 -53357 -9216 -32681 14258 110957 208130
20305B08130M4056q7092j8759n0125n2708m3349K3968J3775M1614p8511l7440
$$ 208130 252186 165094 146335 96210 43502 153 24121 37896 79510 999 -36441
20294c6441k2517n496k7924R7942Q3893M2165n2379J5196N8219k668j16119P744
$$ -36441 -58958 -64454 -92378 5564 89457 131622 79243 94439 152658 149990 33871 41615
20282D1615m1654o4220J9203K0074N443J9899N6577j794n5924k8005J1873m0271
$$ 41615 -39 -64259 -45056 -24982 -19539 360 56937 55143 -781 -28786 -16913 -57184
20270e7184O9241N8189K7073k4248N2602K5218m7710q882j08464p5841K85j2999
$$ -57184 12057 70246 97319 73071 125673 150891 103181 94299 -14165 -90006 -89721 -102720
20258a02720K7549O0827J37416k7333o5842L536j07147m4089M1572M507m3302
$$ -102720 -75171 -14344 123072 95739 29897 33433 -73714 -117803 -76231 -71724 -115026
20247a15026Q2487K9754N3001n2070O81P0711O6447O7985l9625J7583K381k5833
$$ -115026 -32539 -2785 50216 -1854 -1173 69538 135985 203970 164345 181928 184309 158476
20235A58476k03545l6312O092L103l7572m9325O9381Q1983J3172k0718j8811M7100
$$ 158476 -45069 -81381 -75289 -72186 -109758 -159083 -89702 -7719 5453 -15265 -34076 13024
20223A3024n2404R0505N8565q6667q0386l554Q944L0982r0782l8343M0726J1572
$$ 13024 -39380 51125 109690 23023 -57363 -60917 -51973 -20991 -111773 -150116 -109390 -97818
20211i7818K5719J142R6164Q0307l2173p2892j23671O4024J31929l3221j7726
$$ -97818 -72099 -70957 25207 105514 73341 449 -123222 -59198 72731 39510 21784
20200B1784l5821l2656K6400N452O3593O1468L3496o2387m7784M3180j05629l4609
$$ 21784 -14037 -46693 -20293 -14841 48752 110220 143716 81329 33545 76725 -28904 -63513
20188f3513L2844P8915J07844L1387j26498m6809P349m9679Q6850n812M1271R4732
$$ -63513 -30669 48246 156090 187477 60979 14170 21519 -28160 58690 52878 94149 188881
20176A88881m393j79058o5220M4371O8062K2361K1906j19709l2109L9030K5035
$$ 188881 184488 5430 -59790 -15419 52643 75004 96910 -22799 -54908 -15878 9157
20165I157j870r5592J4401N2065N7987P7422l5847L6506l0081k980R8970l6108
$$ 9157 7287 -88305 -73904 -21839 36148 113570 77723 114229 84148 81168 180138 144030
20153A44030p3494l8543k787q38K4867n3229j00739N4220P9615k7652M9284m4420
$$ 144030 70536 31993 29206 28368 53235 6 -100733 -46513 33102 5450 54734 10314
20141A0314R7307J7429p4277J0236n1558j31416q8671N8559J52835L2013q2925
$$ 10314 107621 125050 50773 61009 9451 -121965 -210636 -152077 758 32771 -50154
20130e0154J5626J02235l0080j17239O5071L4394L3299k2014n6723m063R3948
$$ -50154 -34528 67707 37627 -79612 -14541 19853 53152 31138 -25585 -29648 64300
20119F4300J51423j84621r759N1761k4059m7347L8019P1595o9230r5077N7436
$$ 64300 215723 31102 21343 73104 49045 1698 39717 111312 42082 -52995 4441
20108D441j3863j10817Q0362J04504o571l3864k0489M2770O8839P0897o6328m5990
$$ 4441 -9422 -120239 -39877 64627 58056 24192 3703 46473 115312 186209 119881 73891
20096G3891j05909k4645R2266J01101L3336m9935Q737Q2627j29273o3444k8948
$$ 73891 -32018 -56663 35603 136704 170040 120105 128842 211469 82196 18752 -10196
20085a0196j1969J36392l1450r1376L7826n7508m0627K9134n1117J322R7018q8787
$$ -10196 -22165 114227 82777 -8599 29227 -28281 -68908 -39774 -90891 -89569 7449 -81338
20073h1338J05754O2922m9348l7001M5157o1391J6098N4643O4118q433o3739k834
$$ -81338 24416 87338 37990 989 46146 -15245 853 55496 119614 111181 47442 44608
20061D4608M5288p5245J9351L0503q7055p6489K092j0736O9976N6261Q542J25312
$$ 44608 89896 14651 34002 64505 -22550 -99039 -96947 -107683 -37707 18554 27096 152408
20049A52408Q1818j01061j09093L0905l4613k2021m3412J34172k3516o0014k9506
$$ 152408 234226 133165 24072 54977 20364 -1657 -45069 89103 65587 5573 -23933
20038b3933J6732l4062q791K6755L5452L8359K0502m4877n7272q1644J9226R3467
$$ -23933 -7201 -41263 -50054 -23299 12153 50512 71014 26137 -31135 -112779 -93553 -86
20026h6M5396n8476k6091P0084k5342n238j2690N4678K1610j4949K9995M5135
$$ -86 45310 -13166 -39257 30827 5485 247 -12443 42235 63845 48896 78891 124026
20014A24026p0159m1525j35970L122J6212m3327q6787O8800J27808J04232J519
$$ 124026 53867 12342 -123628 -120506 -104294 -147621 -234408 -165608 -37800 66432 67951
20003F7951j5160j9992l6047n173J5436r1771m4329O0783L1875N0060R9952K4844
$$ 67951 52791 32799 -3248 -8421 7015 -84756 -129085 -68302 -36427 13633 113585 138429
19991A38429j6628K1617n5761o3115q956P694J6905n8697m7146o4620P18J12394
$$ 138429 121801 143418 87657 24542 15586 23280 40185 -18512 -65658 -130278 -129560 -17166
19979a7166M5991K843m4460k5618J07182P4093q1941K7689L4946N2808l9788J5632
$$ -17166 28825 31668 -12792 -38410 68772 142865 60924 88613 123559 176367 136579 152211
19967A52211j5825J24497N3430j08083m6527p3725p6116o3962M7876J3173M7656
$$ 152211 136386 260883 314313 206230 159703 85978 9862 -54100 -6224 6949 54605
19956E4605R0315L1658j45606q3812L8850p6931K2187K6914K1673K5044j1663
$$ 54605 144920 176578 30972 -52840 -13990 -90921 -68734 -41820 -20147 4897 -6766
19945f766l9478L2189M8653j7666n642j52094J0704J67499J3332q3549o9307M5808
$$ -6766 -46244 -14055 34598 16932 11290 -140804 -130100 37399 50731 -32818 -102125 -56317
19933e6317J34643K3619j2051o2553m9511n2952O9053L5121N9081l7231K334O988
$$ -56317 78326 101945 89894 27341 -22170 -75122 -6069 29052 88133 50902 53236 60224
19921F0224Q901N5152q0048J7229m8332q6461p4482P1007N0042l3057K0139N46
$$ 60224 69125 124277 44229 61458 13126 -73335 -147817 -76810 -26768 -59825 -39686 -39140
19909c9140l932p9677l7287J23992j674K2134j4611M398L6613M6669o9836o9512
$$ -39140 -43072 -122749 -160036 -36044 -37718 -15584 -30195 -25797 10816 57485 -12351 -81863
19897h1863m9725J17120J06721N592j5180k0118q488l5318k4593L4499O8476Q4711
$$ -81863 -131588 -14468 92253 97845 82665 62547 54059 18741 -5852 28647 97123 181834
19885A81834Q9543O5053j30557j23115p5369k4845k969N1864J7907P0219J8529
$$ 181834 271377 336430 205873 82758 7389 -17456 -20425 31439 49346 119565 138094
19874A38094O9930N7755l6764L3356r2668o0102q2778M9500M201k5920j0372k8566
$$ 138094 208024 265779 229015 262371 169703 109601 26823 76323 80524 54604 44232 15666
19862A5666j3987l0288J05532N9751o4442j05338J0830k5518M4631Q1053P3468
$$ 15666 1679 -28609 76923 136674 72232 -33106 -22276 -47794 -3163 77890 151358
19851A51358P391o1655M6204N407o6407k6048l4755o9214q3050k1934N4821O0002
$$ 151358 158749 97094 143298 148705 82298 56250 21495 -47719 -130769 -152703 -97882 -37880
19839c7880o3630M1988L9235M5413L750M330j4311l3840J12171r9643n5755P639
$$ -37880 -101510 -59522 -20287 25126 28876 33206 18895 -14945 97226 -2417 -58172 -50533
19827e0533l83O1347L6988l9185k7634q2329J14124J64300j1662m1083N9873M1146
$$ -50533 -50916 10431 47419 8234 -19400 -101729 12395 176695 165033 123950 183823 224969
19815B24969n0223o392p7231r5853l122L9965N8574k7651N9556n9950l4535Q1472
$$ 224969 174746 168354 91123 -4730 -7852 32113 90687 63036 122592 62642 28107 109579
19803A09579m9539m985m9546q5281M6947J33952L6873l5393j7686j00508q8374
$$ 109579 60040 55055 5509 -79772 -32825 101127 138000 102607 84921 -15587 -103961
19792a03961K35302K0300j18946n2367m8926O0428o6467m0679L5225M6250N1879
$$ -103961 131341 151641 32695 -19672 -68598 -8170 -74637 -115316 -80091 -33841 18038
19781A8038r3014r9371N5660J08125m3694j2178l5151J7155L7285j8569k541N0964
$$ 18038 -74976 -174347 -118687 -10562 -54256 -66434 -101585 -84430 -47145 -65714 -68255 -17291
19769a7291l3784n1310p8945L2829R1407J0809q3136M3584N4900J19904N6652
$$ -17291 -51075 -102385 -181330 -148501 -57094 -46285 -129421 -85837 -30937 88967 145619
19758A45619l1426L4422M9614j08175m9398k0729R0275n5946n826M3859j6974
$$ 145619 114193 148615 198229 90054 40656 19927 110202 54256 48430 92289 75315
19747G5315n6352m0777P3819p4073M2047K4947J7602J41889n5672r1871r3972
$$ 75315 18963 -21814 52005 -22068 19979 44926 62528 204417 148745 56874 -37098
19736c7098m35N9893J9621N6943L3786r8755J8530J27363M4735k310o0971l9694
$$ -37098 -37533 22360 41981 98924 132710 33955 52485 179848 224583 222273 161302 121608
19724A21608N3922M3035k7284K3654p1504j0860l8208k1658M398L865p2017m4593
$$ 121608 175530 218565 191281 214935 143431 132571 94363 72705 77103 80968 8951 -35642
19712c5642Q3994Q1956M1431K6830K5379p4914j79070k2204J06512K7452j6022
$$ -35642 48352 130308 171739 198569 223948 149034 -30036 -52240 54272 81724 65702
19701F5702m4730j5132K4553l9271l3838M7798N3623p637j6247j0434n5468j38209
$$ 65702 20972 5840 30393 -8878 -42716 5082 58705 51068 34821 24387 -31081 -169290
19689a69290Q5513M5974L1477l4205q4215N0358k2846j926P2343Q1994M4332N7198
$$ -169290 -83777 -37803 -6326 -40531 -124746 -74388 -97234 -99160 -26817 55177 99509 156707
19677A56707P3057j6802r9036J6601q1459Q2471J2132j06090k6485Q1240l1150
$$ 156707 229764 212962 113926 130527 49068 131539 143671 37581 11096 92336 61186
19666F1186n8314j9876o2150j3116M5201Q2667m8694q0609O0748R4095Q200n9755
$$ 61186 2872 -17004 -79154 -92270 -47069 35598 -13096 -93705 -32957 61138 69338 9583
19654I583l6096K7447M7974n1231p704n2576l7804j7177J48686J16957O9328m6559
$$ 9583 -26513 934 48908 -2323 -10027 -62603 -100407 -117584 31102 148059 217387 170828
19642A70828p7089k2464j1380m760J8695R733k456n0332m9525m0450K8686n802
$$ 170828 93739 71275 59895 55135 73830 83563 81107 30775 -18750 -59200 -30514 -36316
19630c6316M4992P5917K6293P4319l8597l9457j05145n9053m3259Q7918O5732
$$ -36316 8676 84593 110886 185205 146608 107151 2006 -57047 -100306 -12388 53344
19619E3344L9343o4452j1235K3228N0257k5545M0079R238Q2438Q1323J05387P6754
$$ 53344 92687 28235 17000 40228 90485 64940 105019 114257 196695 278018 383405 460159
19607D60159R9931j4711q9814j7585O4306M1713m4544K8174J12209J06551Q964
$$ 460159 560090 545379 455565 437980 502286 543999 499455 527629 639838 746389 755353
19596G55353K0690k1577j1760N8766k2282q4759j7925K8252l2340j12604K4092
$$ 755353 776043 754466 742706 801472 779190 694431 676506 704758 672418 559814 583906
19585E83906O1064j15729K3607N8090j32090j33805j24100J6771J3637O355l9403
$$ 583906 644970 529241 552848 610938 478848 345043 220943 237714 251351 257706 218303
19574B18303j6383N1167L2258j45362j23367K937m4546r0552K4985j0582R3026
$$ 218303 201920 253087 285345 139983 16616 19553 -24993 -115545 -90560 -101142 -8116
19563h116Q9403Q255P9338l2306l3658k9287J9697m5705m869Q1163j0130P049
$$ -8116 81287 89542 168880 136574 102916 73629 93326 47621 42752 123915 113785 120834
19551A20834m8668r4462p4786P4660J51974J00890j04149j61079o6719L5628J12290
$$ 120834 72166 -22296 -97082 -22422 129552 230442 126293 -34786 -101505 -65877 46413
19540D6413Q3674J5753m4604j7417k319N6321n8437O5951Q9481m3057p415J01505
$$ 46413 130087 145840 101236 83819 81500 137821 79384 145335 234816 191759 184344 285849
19528B85849J16249J2210k02547q5038N2000N8261M2414K03992J05253q5787k9913
$$ 285849 402098 414308 211761 126723 178723 236984 279398 483390 588643 502856 472943
19517D72943j7453O0807m284j9549m1627O9037M1496p4756q5711l0236o8292k4268
$$ 472943 455490 516297 512013 492464 450837 519874 561370 486614 400903 370667 302375 278107
19505B78107m9288r7731j7019J2294N5352m9522J17967M9846j02644j21808J7741
$$ 278107 228819 131088 114069 126363 181715 132193 250160 300006 197362 75554 93295
19494I3295Q7447N3484n3221k4654K5050J6640p0258J1346j5740J0066O6711J0438
$$ 93295 180742 234226 181005 156351 181401 198041 127783 139129 123389 133455 200166 210604
19482B10604K8417P3444R2243k8649o6968L7777r522m0957l7380M2474R3873j1291
$$ 210604 239021 312465 404708 376059 309091 346868 337346 296389 259009 301483 395356 384065
19470C84065j6102N0207O4566n1992p0693r2078o0111m8870K7602m3678R0263
$$ 384065 367963 418170 482736 430744 360051 267973 207862 158992 186594 142916 233179
19459B33179J01678Q3735j55078q4866j03479k7499J09199J6191q4399J635K1437
$$ 233179 334857 418592 263514 178648 75169 47670 156869 173060 88661 90296 111733
19448A11733N8806l3236j1273k9873M6607N1401o4930o8836Q1823k8976q4805
$$ 111733 170539 137303 126030 96157 142764 194165 129235 60399 142222 113246 28441
19437B8441p8302O4564Q4369K9611k6264j21029O464m1205J6700J21106L6886
$$ 28441 -49861 14703 99072 128683 102419 -18610 -12146 -53351 -36651 84455 121341
19426A21341N9303j5551q9033J7394p6615J3927M4221o931J2803N3248J27695
$$ 121341 180644 165093 76060 93454 16839 30766 74987 68056 80859 134107 261802
19415B61802k08j02590k4616l3773q8879m9346M269K2564J7833j1956N6069N7052
$$ 261802 261594 159004 134388 100615 11736 -37610 -33341 -10777 7056 -4900 51169 108221
19403A08221O6329J6736q1150J947j4306N7324L2553p8394O2396K4529O8024J1003
$$ 108221 174550 191286 110136 112083 97777 155101 187654 109260 171656 196185 264209 275212
19391B75212l301K1032n4127o4365k1228N6266j0499o6049j7451R7698P79n0381
$$ 275212 271911 292943 238816 174451 153223 209489 198990 132941 115490 213188 213967 163586
19379A63586L9338N2951p4210r4208k2068Q8745k8357l4240k6028p22r7213K3769
$$ 163586 202924 255875 181665 87457 65389 154134 125777 91537 65509 64787 -32426 -8657
19367h657R2393j2070o9464J0696n832n401Q1805Q609M0622O7577l6302k2098
$$ -8657 83736 71666 2202 12898 7066 1665 83470 92079 132701 200278 163976 141878
19355A41878p0185O7407P5830N5810m9681o1069J11445P5263P3764k7058r7417
$$ 141878 71693 139100 214930 270740 221059 159990 271435 346698 420462 393404 295987
19344B95987n2766M8827J9207l7949q4489p1154j6138M5154L4717N3849O4736
$$ 295987 243221 292048 311255 273306 188817 117663 101525 146679 181396 235245 299981
19333B99981m3587p742K7511N889r723L6767o3378k3009m2337l2689K1938m6489
$$ 299981 256394 248652 276163 282052 272329 309096 245718 222709 180372 147683 169621 123132
19321A23132Q010k6595N3629l6673k5540j043j3422J7788k4968L2671N8001P761
$$ 123132 131142 104547 158176 121503 95963 94920 81498 99286 74318 106989 164990 172751
19309A72751R836j923l604l4094K3090R0261J3549l2698r5078l5275N0226q1610
$$ 172751 182587 180664 177060 142966 166056 256317 269866 237168 142090 106815 157041 75431
19297G5431J7479L5229q8542P2993J19963R0961p6221M9037P2967p0849q2192
$$ 75431 92910 128139 39597 112590 232553 323514 247293 296330 369297 298448 216256
19286B16256l0347O2727j4116K8832K6320p8816m0435k568J03179M2288p9181
$$ 216256 185909 248636 234520 263352 289672 210856 170421 167853 271032 313320 234139
19275B34139m9823J31062K5657l7973p7413k4534M5713p270k3316k2616J01465
$$ 234139 184316 315378 341035 303062 225649 201115 246828 239558 216242 193626 295091
19264B95091M8138n2214r911n5210r0397l7286n91N111K9253O3530M5364o3428
$$ 295091 343229 291015 281104 225894 135497 98211 97620 102731 131984 195514 240878 177450
19252A77450q8518m687j27437l6303J63579N3310L694n2231n9507k8352q0645
$$ 177450 88932 84245 -43192 -79495 84084 137394 141088 88857 29350 998 -79647
19241g9647K0113P8605J41903L3438k8472N034O3308N4734j4687O4503J42695
$$ -79647 -59534 19071 160974 194412 165940 170974 234282 289016 274329 338832 481527
19230D81527l705P3831j7633K3150m3892M2248N7446P6645Q0075K2062K5452M4096
$$ 481527 477822 551653 534020 557170 513278 555526 612972 689617 769692 791754 817206 861302
19218H61302J64503N8560j2881m5086m338J12971N4171J9727L8609R5876M3609
$$ 861302 1025805 1084365 1071484 1026398 1022060 1135031 1189202 1208929 1247538 1343414 1387023
19207A387023K0951l7886p7135L3555j50350j15154j73362L2740K6615J02048
$$ 1387023 1407974 1370088 1292953 1326508 1176158 1061004 887642 920382 946997 1049045
19197A049045J3296k6671o1927n7169j5849p3531m4041j04064o3009r8901k237
$$ 1049045 1062341 1035670 973743 916574 900725 827194 783153 679089 616080 517179 514942
19186E14942o133j2682o7447k5383L8254p8829Q8632J36061n0655o5598r6311
$$ 514942 508809 496127 428680 403297 441551 362722 451354 587415 536760 471162 374851
19175C74851L4402n326k1748L8614q0640p4506J03449P7094O1762L2218P9508
$$ 374851 409253 403927 382179 420793 340153 265647 369096 446190 507952 540170 619678
19164F19678J5780K251o8415J03164l3803q8221o5906j57686j00924J23496P5076
$$ 619678 635458 637709 569294 672458 638655 550434 484528 326842 225918 349414 424490
19153D24490R1687P4095n932L8981Q9000J16151K1874j10623q0206Q6675J75586
$$ 424490 516177 590272 584340 623321 712321 828472 850346 739723 659517 746192 921778
19142I21778J86354N9136J7810N2957l7631o7302p2322j05602j8404O392M0878
$$ 921778 1108132 1167268 1185078 1238035 1200404 1133102 1060780 955178 936774 943166 984044
19131I84044O0872Q2294J48007J44466J15098q8909k3806L3216J14472m776l0663
$$ 984044 1044916 1127210 1275217 1419683 1534781 1445872 1422066 1455282 1569754 1564978 1534315
19120A534315J71180J62445J70135J72339K79114K05210J97099L00424L00565
$$ 1534315 1705495 1867940 2038075 2210414 2489528 2694738 2891837 3192261 3492826
19111C492826L45820L29299J43812J34322K75186K98455M22504N43614P66119
$$ 3492826 3838646 4167945 4311757 4446079 4721265 5019720 5442224 5985838 6751957
19102F751957R98531J231621J613177K095161L211118N086413P455112Q781376
$$ 6751957 7750488 8982109 10595286 12690447 15901565 20987978 28443090 37224466
19094C7224466Q391822Q321779Q213104M504060l123P16897L127652L385139K666864
$$ 37224466 45616288 53938067 62151171 66655231 66652108 67369005 70496657 73881796 76548660
19085G6548660N726479J1719873J6188299J4703645Q618236N908577J814678o815222
$$ 76548660 82275139 93995012 110183311 124886956 133505192 139413769 141228447 134413225
19077A34413225j1711553j1175254q650541o749792k208521J810150M695617N389995
$$ 134413225 122701672 111526418 102875877 96126085 93917564 95727714 100423331 105813326
19069A05813326j438947q500562p340141o365885j1107548j5025565j1690972
$$ 105813326 104374379 95873817 88533676 82167791 71060243 56034678 44343706
19062D4343706p209869m646403l196310k322085j853095j468378j353275j189968
$$ 44343706 37133837 32487434 29291124 26969039 25115944 23647566 22294291 21104323
19054B1104323j049384r39485p88364n76113o80692o87943o38047n76717m79118
$$ 21104323 20054939 19115454 18327090 17750977 17070285 16382342 15744295 15167578 14688460
19045A4688460n03666n42251m28941k62202l00835j23924n735j05368m9701j2757
$$ 14688460 14184794 13642543 13213602 12951400 12650565 12526641 12520906 12415538 12365837 12353080
19035A2353080J88800K39019L22530L85919P79723J401992K214935L653270N979686
$$ 12353080 12541880 12780899 13103429 13489348 14269071 15671063 17885998 21539268 27518954
19026B7518954Q683451Q836160O698935M598265J020147n861262q737922m119585
$$ 27518954 36202405 45038565 51737500 56335765 57355912 51494650 42756728 38637143
19018C8637143K001452P114626R821484R767266R382583O995495j758073r242369
$$ 38637143 40638595 47753221 57574705 67341971 76724554 83720049 81961976 72719607
19010G2719607q817655r320288r862321o293161j898276J995161M593693M348561
$$ 72719607 63901952 54581664 44719343 38426182 36527906 38523067 43116760 47465321
19002D7465321K821945J223223k679024q146273q443165n294412l094557j876265
$$ 47465321 50287266 51510489 48831465 40685192 32242027 26947615 23853058 21976793
18994B1976793j269466j066220p94742o92160n73873m69957l48498j85792Q987
$$ 21976793 20707327 19641107 18846365 18154205 17580332 17110375 16761877 16576085 16585072
18985A6585072L0984K66619O03681J070766K021429L415473N853048Q891687J0063094
$$ 16585072 16616056 16882675 17486356 18557122 20578551 23994024 29847072 38738759 48801853
18976D8801853P898245N473367K567140m024230r335173n941568P84628O905955
$$ 48801853 56700098 62173465 64740605 60716375 51381202 45439634 46224262 53130217
18968E3130217J1335327J2142266J1763977R600162J243154q461654j0722371
$$ 53130217 64465544 76607810 88371787 97971949 99215103 90753449 80031078
18961H0031078j1841794j2824474q473064k607015K395847N572392N257219L185119
$$ 80031078 68189284 55364810 46891746 44284731 46680578 52252970 57510189 60695308
18953F0695308J156647l452955j0141860j0919060p143200m315470k791781k055275
$$ 60695308 61851955 58399000 48257140 37338080 30194880 25879410 23087629 21032354
18945B1032354j390107j007078j016127r02502o33441n55290n62209n79470p22406
$$ 21032354 19642247 18635169 17619042 16716540 16083099 15527809 14965600 14386130 13663724
18936A3663724n73713m84355m60535k96916k85681m62498n95910j91046k16432
$$ 13663724 13090011 12605656 12145121 11848205 11562524 11100026 10504116 10313070 10096638
18927A0096638k61498k48029k84177k26966k99016l12461j75869j72239k51036
$$ 10096638 9835140 9587111 9302934 9075968 8776952 8464491 8288622 8116383 7865347
18918G865347k03357l6259q4510j23187j05667j61453j89029j51370j60002k6319
$$ 7865347 7661990 7625731 7541221 7418034 7312367 7150914 6961885 6810515 6650513 6624194
18908F624194r3116j48749j81367r5681R3099p7208k36316q7726q8075j14561
$$ 6624194 6531078 6382329 6200962 6105281 6198380 6121172 5884856 5797130 5709055 5594494
18898E594494n1404J15855P1666o3047k4180r7333j27230q131J5760Q9968n198
$$ 5594494 5543090 5658945 5730611 5667564 5643384 5546051 5418821 5410690 5426450 5516418 5511220
18887E511220K4413J9177j1583m6288j11441p4961n5976p4337j1357M1194L6448
$$ 5511220 5535633 5554810 5543227 5496939 5385498 5310537 5254561 5180224 5168867 5210061 5246509
18876E246509J8831j00091j63435n0030j22196k44847j70257j80473k16906k19685
$$ 5246509 5265340 5165249 5001814 4951784 4829588 4584741 4414484 4234011 4017105 3797420
18866C797420j64230j86200j98539j25854j33783j21345k9856J1299Q544r1890
$$ 3797420 3633190 3446990 3248451 3122597 2988814 2867469 2837613 2848912 2857456 2765566
18856B765566Q5113P5600R7450J00383M1283p6431J10187O2876L721j3624J25864
$$ 2765566 2850679 2926279 3023729 3124112 3165395 3088964 3199151 3262027 3265748 3252124 3377988
18845C377988j7818p130K4940k14417j39534m6713j19683j07834j8150o8073j08683
$$ 3377988 3360170 3353040 3377980 3163563 3024029 2977316 2857633 2749799 2731649 2663576 2554893
18834B554893j31394j20210r4937k0970K5741r9930m3924J62287J03792m3709
$$ 2554893 2423499 2303289 2208352 2187382 2213123 2113193 2069269 2231556 2335348 2291639
18824B291639j30759k09246r5491k9369L4043m7730k8434m6476m4858q664p4997
$$ 2291639 2160880 1951634 1856143 1826774 1860817 1813087 1784653 1738177 1693319 1684655 1609658
18813A609658m3605L9417l158r4007K2699K3691Q138N6623M4669J67592J09162
$$ 1609658 1566053 1605470 1602312 1508305 1531004 1554695 1562833 1619456 1664125 1831717 1940879
18802A940879n2174j21077l5972k3472N330j04010P8555o9027K9927n3379m0389
$$ 1940879 1888705 1767628 1731656 1708184 1713514 1609504 1688059 1619032 1648959 1595580 1555191
18791A555191j30766o6019J1536n3188P4498J59589L5486q8892q6967K9541P5730
$$ 1555191 1424425 1358406 1369942 1316754 1391252 1550841 1586327 1497435 1410468 1440009 1515739
18780A515739J18834Q7263j74301j60568K6132M7695J12585M1724m9134q140p4160
$$ 1515739 1634573 1721836 1547535 1386967 1413099 1460794 1573379 1615103 1565969 1557829 1483669
18769A483669r6694Q5581m8545k1327J14077J13377J27881R9343q231l14980l61255
$$ 1483669 1386975 1472556 1424011 1402684 1516761 1630138 1758019 1857362 1849131 1534151 1172896
18758A172896j22524L0344n403j3968l0590L0622j4431j9055m0423o5092k84p9583
$$ 1172896 1050372 1080716 1075313 1061345 1030755 1061377 1046946 1027891 987468 922376 922092 842509
18746H42509o5492N1840j5279Q9954r66M290M3269l9506j64234k5442O8249N0908
$$ 842509 777017 828857 813578 903532 902566 906856 950125 910619 746385 720943 789192 840100
18734H40100J8531O9377J12706L3752j17598j956o307j43617q1273Q0832q724
$$ 840100 858631 928008 1040714 1074466 956868 954912 948605 804988 723715 804547 795823
18723G95823R2757J89794L2937K0004o0778j97959j25153k7528P6810J98535L2155
$$ 795823 888580 1078374 1111311 1131315 1070537 872578 747425 719897 796707 995242 1027397
18712A027397K2764M2964o4652k8387p8529L6277K467j06005N041L9090o130n3164
$$ 1027397 1050161 1093125 1028473 1000086 921557 957834 960301 854296 859337 898427 892297 839133
18700H39133p2575K5788P3013J2989m6233k6324r0229j23311R5513j5980J3558
$$ 839133 766558 792346 865359 878348 832115 805791 715562 592251 687764 671784 685342
18689F85342P3510m20N7410J01550J69367K16525J71024P7604o5923l4780j9647
$$ 685342 758852 758432 815842 917392 1086759 1303284 1474308 1551912 1485989 1451209 1431562
18678A431562j02408o7287l1392J54811K53288J28315J4924j24954o7090j60010
$$ 1431562 1329154 1261867 1230475 1385286 1638574 1766889 1781813 1656859 1589769 1429759
18668A429759j96316M929k9897j7378Q35R0873L9602O752j61736j25945N345M3884
$$ 1429759 1233443 1238372 1208475 1191097 1191932 1282805 1322407 1329159 1167423 1041478 1046823 1090707
18656A090707p0066q0343q9136j30040p3386M8503J11073J41061O3861n4475q4033
$$ 1090707 1020641 940298 851162 721122 647736 696239 807312 948373 1012234 957759 873726
18645H73726J56846O0855j11463O8652L5983m1514K1253R3606N4303N9657P6048
$$ 873726 1030572 1091427 979964 1048616 1084599 1043085 1064338 1157944 1212247 1271904 1347952
18634A347952Q9264J19614J81082R4058J20774j0844k6650L9088Q9275J12826
$$ 1347952 1437216 1556830 1737912 1831970 1952744 1941900 1915250 1954338 2043613 2156439
18624B156439j5148m9591L2988j2344L4138M2707J35051K08601K11362L33471
$$ 2156439 2141291 2091700 2124688 2112344 2146482 2189189 2324240 2532841 2744203 3077674
18614C077674L07765L11433M39186N91685R25976J697887K711767M048198M592727
$$ 3077674 3385439 3696872 4136058 4727743 5653719 7351606 10063373 14111571 18704298
18605A8704298L819976K761975J564269j284650l349713j487448K214633O212135
$$ 18704298 22524274 25286249 26850518 25565868 22216155 20728707 22943340 29155475
18597B9155475Q666006P925071N334531K674695k740143r695344j0137622n234586
$$ 29155475 37821481 45746552 51081083 53755778 51015635 41320291 31182669 25948083
18589B5948083p05475K417017L846869L113438J729247p4272l884767o954378
$$ 25948083 25242608 27659625 31506494 34619932 36349179 36274907 32390140 25435762
18581B5435762n789145l421703k030707j130398q38543o78063m84281l53082k4171
$$ 25435762 19646617 16224914 14194207 13063809 12225266 11547203 11062922 10709840 10685669
18572A0685669J15680M9403L4475J83552J47019K19016L97570O31136J067856
$$ 10685669 10801349 10850752 10885227 11068779 11215798 11434814 11832384 12463520 13531376
18563A3531376J537482K129571L234289N497429Q804822J2715501J3755072J0814941
$$ 13531376 15068858 17198429 20432718 25930147 34734969 47450470 61205542 72020483
18555G2020483P452537K551545o693328j1233399m792610N841672J6033944K1577858
$$ 72020483 79473020 82024565 75331237 64097838 59305228 65146900 81180844 102758702
18547A02758702J8517239J2235796M736042j0534128k6411940k4476896j2714727
$$ 102758702 121275941 133511737 138247779 127713651 101301711 76824815 64110088
18540F4110088k651567M157493O308300M632024K186572k164577j0139856j4430283
$$ 64110088 61458521 65616014 71924314 76556338 78742910 76578333 66438477 52008194
18532E2008194j1075002o546149l999002k738183k018589j617681j260344j117488
$$ 52008194 40933192 34387043 30388041 27649858 25631269 24013588 22753244 21635756
18524B1635756j020306r03792p18696n93998n11795k56143l1154J90666L17495
$$ 21635756 20615450 19711658 18992962 18398964 17887169 17631026 17599872 17790538 18108033
18515A8108033O16643R95048J459262K201514L750434O414388J0609049J5310380
$$ 18108033 18724676 19719724 21178986 23380500 27130934 33545322 44154371 59464751
18507E9464751J6096529J3701772J3379908J1973558J134484p818742n892277
$$ 59464751 75561280 89263052 102642960 114616518 115751002 107932260 102039983
18500A02039983m872628j2408130k1049842j6508311r568555n701040l839204
$$ 102039983 97167355 84759225 63709383 47201072 37632517 31931477 28092273
18493B8092273k705146j956479j628744j268405r35713p72985p03398n40171l41109
$$ 28092273 25387127 23430648 21801904 20533499 19597786 18824801 18121403 17581232 17240123
18484A7240123j12343j22110k8698R789k3208k59051l19085k87924k13952k42497
$$ 17240123 17127780 17005670 16976972 16986761 16963553 16704502 16385417 16097493 15883541 15641044
18474A5641044j17268j5354k9506j43549K6038J49813L45807P75724J128973J702277
$$ 15641044 15523776 15508422 15478916 15335367 15361405 15511218 15857025 16632749 17761722 19463999
18464A9463999K434913L725500N879995R617071J5090614J8629473J6896194J5515785
$$ 19463999 21898912 25624412 31504407 41121478 56212092 74841565 91737759 107253544
18456A07253544J5648232P595586o963763r146918o537897j1630678k1560867
$$ 107253544 122901776 130497362 123533599 114386681 107848784 96218106 74657239
18449G4657239k0272537j2418677p135871m529542l188579k393278j708526j513691
$$ 74657239 54384702 41966025 34830154 30300612 27112033 24718755 23010229 21496538
18441B1496538j342407j143029q91261p26814o73606n69394l97815k83468l77064
$$ 21496538 20154131 19011102 18119841 17393027 16719421 16150027 15752212 15468744 15091680
18432A5091680j97899j22642o9523j42612j80398l6845k07260k34960k40868j35469
$$ 15091680 14893781 14771139 14701616 14559004 14378606 14341761 14134501 13899541 13658673 13523204
18422A3523204k58300l13020q5547J97106K51354K92402N03302P72634J143643
$$ 13523204 13264904 12951884 12866337 13063443 13314797 13607199 14110501 14883135 16026778
18413A6026778J874296L371758N510569O094818N158165N182920M878701M37721
$$ 16026778 17901074 21272832 26783401 32878219 38036384 43219304 48098005 48535726
18405D8535726l896700l141510k453021n384314p911346n513428l037910j960656
$$ 48535726 44639026 41497516 39044495 33660181 25748835 20235407 17197497 15236841
18397A5236841j336851q51217n51516m51416l55434j36996j05541j26107q3975
$$ 15236841 13899990 13048773 12497257 12045841 11690407 11553411 11447870 11321763 11237788
18388A1237788q1385M3692K03795J42040l4055k44249m36150m75311m25813l34520
$$ 11237788 11156403 11200095 11403890 11545930 11511875 11267626 10831476 10356165 9930352 9595832
18378I595832j72307j89227k69561k19373k55346k71405k79647k49531l56032
$$ 9595832 9423525 9234298 8964737 8745364 8490018 8218613 7938966 7689435 7333403
18369G333403m13404l52500k48710k34542j37245k08689j86627j61683m1773j00588
$$ 7333403 6919999 6567499 6318789 6084247 5947002 5738313 5551686 5390003 5348230 5247642
18359E247642o0957k5433p3023n4275J126j07075j17030r7942o0483L0816L9008
$$ 5247642 5186685 5161252 5088229 5033954 5035080 4928005 4810975 4713033 4652550 4683366 4722374
18348D722374n4159j09568k03876j3659R8330M6736J49706J51413P3198o409P7852
$$ 4722374 4668215 4558647 4354771 4341112 4439442 4486178 4635884 4787297 4860495 4854086 4931938
18337D931938J14180P7752n2333j2456k6950N2514J47288J26470J33600K10634
$$ 4931938 5046118 5123870 5071537 5059081 5032131 5084645 5231933 5358403 5492003 5702637
18327E702637K31069J38724k3110n7440j57097k09779j13518O3356R745k5899
$$ 5702637 5933706 6072430 6049320 5991880 5834783 5625004 5511486 5574842 5584587 5558688
18317E558688J58271J90116J81503O8068J01744K46941L71882M12365N10359N36069
$$ 5558688 5716959 5907075 6088578 6156646 6258390 6505331 6877213 7289578 7799937 8336006
18307H336006P21686Q57299J088511J342913K188940L843404O425897R657138
$$ 8336006 9057692 9914991 11003502 12346415 14535355 18378759 24804656 34461794
18299C4461794J1241990R892961P774438N709288J271363k24090P894525J7501185
$$ 34461794 45703784 55596745 63371183 69080471 70351834 70127744 78022269 95523454
18291I5523454J8458892J3492131Q064902l105543j9034693j9829835m250091
$$ 95523454 113982346 127474477 135539379 132433836 113399143 93569308 89319217
18284H9319217J1568133J7905514J4189032R256475K429102j4199937k5584203
$$ 89319217 100887350 118792864 132981896 142238371 144667473 130467536 104883333
18277A04883333j5561647k467446K088728J770772O40907m452514j1887282j0461556
$$ 104883333 89321686 86854240 88942968 90713740 91354647 86902133 75014851 64553295
18269F4553295l555085R60793L050796M935547O727092R460923J7862295L3086761
$$ 64553295 60998210 61959003 65009799 69945346 76672438 86133361 103995656 137082417
18261A37082417M7027897N2778028N2886351M0414245O877310k8334589m5209486
$$ 137082417 184110314 236888342 289774693 330188938 337066248 308731659 263522173
18254B63522173n9705593n7436277l5415655j8233382j0293024o880140n540866
$$ 263522173 203816580 146380303 110964648 92731266 82438242 75558102 70017236
18247G0017236o316232p603071o430387m372025k948415k254813j961780j808369
$$ 70017236 63701004 56097933 49667546 45295521 42347106 40092293 38130513 36322144
18239C6322144j598084j602611j433073j270631j261420j165443j056838q88267
$$ 36322144 34724060 33121449 31688376 30417745 29156325 27990882 26934044 26045777
18231B6045777p76482o99958p19132p93729o39086n79922o59555n15741o40715
$$ 26045777 25269295 24569337 23850205 23056476 22417390 21837468 21177913 20662172 20021457
18222B0021457p34228o23390l62458l98418k94738l66854l96992n17821m77852
$$ 20021457 19287229 18663839 18301381 17902963 17608225 17241371 16844379 16326558 15848706
18213A5848706k98680j74576k36714k25996j97734j87622k21758k10712j06135
$$ 15848706 15550026 15375450 15138736 14912740 14715006 14527384 14305626 14094914 13988779
18204A3988779l17962l44405j50993r7332j79843k06282k04857j81936j78387
$$ 13988779 13670817 13326412 13175419 13078087 12898244 12691962 12487105 12305169 12126782
18195A2126782k49040l33730k86322k69905j97505j28376j08084j54006k10336
$$ 12126782 11877742 11544012 11257690 10987785 10790280 10661904 10553820 10399814 10189478
18186A0189478j04169r4448k10641j15424j14263L9652J1106p555M3157r7776
$$ 10189478 10085309 9990861 9780220 9664796 9550533 9590185 9601291 9593736 9636893 9539117
18176I539117j45532k30109r4268r1426j94531k53555j51386j92587k36293j98160
$$ 9539117 9393585 9163476 9069208 8977782 8783251 8529696 8378310 8185723 7949430 7751270
18166G751270k23582k04693o8414P0214M6455j12052j90288k27724j69342k1858
$$ 7751270 7527688 7322995 7254581 7324795 7371250 7259198 7068910 6841186 6671844 6649986
18156F649986q0561J7478O7643J0726k30732k16392k40930k20878r4729k7088
$$ 6649986 6569425 6586903 6654546 6665272 6434540 6218148 5977218 5756340 5661611 5634523
18146E634523j53513j25152L974O9070j13915j49648r166N3072L6901l6167J44
$$ 5634523 5481010 5355858 5359832 5428902 5314987 5165339 5156173 5209245 5246146 5209979 5210123
18135E210123P7197O8632J98754L11752L29840K52297M4148k30556l02550k78275
$$ 5210123 5287320 5355952 5554706 5866458 6196298 6448595 6492743 6262187 5959637 5681362
18125E681362k70546k53222o0058j6989K7300J65816L05202M23814L44395L59803
$$ 5681362 5410816 5157594 5097536 5080547 5107847 5273663 5578865 6002679 6347074 6706877
18115F706877P32108J233576J491386K037374L381714N644641J0258078J8806005
$$ 6706877 7438985 8672561 10163947 12201321 15583035 21227676 31485754 50291759
18107E0291759K7111559K2963458J3796837R348841l881007l3722406l3183248
$$ 50291759 77403318 100366776 114163613 123512454 119631447 85909041 52725793
18100E2725793j7130854q547871m846096l086733k248714j741974j439537j073470
$$ 52725793 35594939 27047068 22200972 19114239 16865525 15123551 13684014 12610544
18092A2610544q52523p42593p13378p25001n09652l75339m01291m02909l07992
$$ 12610544 11758021 11015428 10302050 9577049 9067397 8692058 8290767 7887858 7579866
18083G579866l53357l53372k30680k70698j70173j85314k21624p5220j42585k10768
$$ 7579866 7226509 6873137 6642457 6371759 6201586 6016272 5794648 5719428 5576843 5366075
18073E366075j71829j63691k36793j37376J9153K7638J1625J12172m080p9858
$$ 5366075 5194246 5030555 4793762 4656386 4675539 4703177 4714802 4826974 4822894 4743036
18063D743036o2419j77115j95377r1682J794q610q6033j26062l4537l4948j11781
$$ 4743036 4680617 4503502 4308125 4216443 4218237 4209627 4123594 3997532 3962995 3928047 3816266
18052C816266k8960n5290r903j19196r813j5473j5334q3960R8631N9741K8552
$$ 3816266 3787306 3732016 3722113 3602917 3593104 3577631 3562297 3478337 3576968 3636709 3665261
18041C665261o8464O8416J13011j5599q1783o6248j60291k80356j17322l7289
$$ 3665261 3596797 3665213 3778224 3762625 3680842 3614594 3454303 3173947 3056625 3019336
18031C019336p8326M6868L808p1302j44493Q2816m3865n7572q2050o3106J5435
$$ 3019336 2941010 2987878 2991686 2920384 2775891 2858707 2814842 2757270 2675220 2612114 2627549
18020B627549J09294L2928J06218J1353K9158M505M3369K1290r0083O4057L9130
$$ 2627549 2736843 2769771 2875989 2887342 2916500 2921005 2964374 2985664 2895581 2959638 2998768
18009B998768Q508J23065O2423j07555k15662k01657k53156j66320j9405n6172
$$ 2998768 3007276 3130341 3192764 3085209 2869547 2667890 2414734 2248414 2229009 2172837
17999B172837N3217O9008j29263q1154q6165o0204P6900M1392O2309J60548J6844
$$ 2172837 2226054 2295062 2165799 2084645 1998480 1938276 2015176 2056568 2118877 2279425 2296269
17988B296269Q1731O0819R9048J10160M5960j1605m9388J480l9389L9040L9536
$$ 2296269 2378000 2438819 2537867 2648027 2693987 2682382 2632994 2634474 2595085 2634125 2673661
17977B673661j08932k93319r5555j7550j43745j18388L3539q161p4643r8870n0589
$$ 2673661 2564729 2271410 2175855 2158305 2014560 1896172 1929711 1921550 1846907 1748037 1697448
17966A697448m8273J3136J5783L2742N1075Q7968P7888k6689p9943q1573K3558
$$ 1697448 1649175 1662311 1678094 1710836 1761911 1849879 1927767 1901078 1821135 1739562 1763120
17955A763120M2793O2316J19783L1785O0437K7761P2949K1318k1077J58977K17931
$$ 1763120 1805913 1868229 1988012 2019797 2080234 2107995 2180944 2202262 2181185 2340162 2558093
17944B558093L27215K78641J62650P5240j6290P6719k0970l9151M7740J38192
$$ 2558093 2885308 3163949 3326599 3401839 3385549 3462268 3441298 3402147 3449887 3588079
17934C588079J18252J27664J43197M8218L8917k3488P4830J68854J04359J75407
$$ 3588079 3706331 3833995 3977192 4025410 4064327 4040839 4115669 4284523 4388882 4564289
17924D564289K56951M86853Q69867J175161J332899J809393K710286M431136P216429
$$ 4564289 4821240 5308093 6177960 7353121 8686020 10495413 13205699 17636835 24853264
17915B4853264J2418174J9632151K1656207J5303944R772589L224182j4877607
$$ 24853264 37271438 56903589 78559796 93863740 103636329 106860511 91982904
17908I1982904k8670077k0457179j0804633n860360l437456k119600j218782l80265
$$ 91982904 63312827 42855648 32051015 26190655 22753199 20633599 19414817 19034552
17900A9034552M33975J129923J423305J285944J117051R63840K59433M63243K528827
$$ 19034552 19468527 20598450 22021755 23307699 24424750 25388590 25648023 26111266 28640093
17891B8640093N992520J1274804J6425365J6404110J2216389R589514M918152
$$ 28640093 34632613 45907417 62332782 78736892 90953281 100542795 105460947
17884A05460947n048151m698349J960668K622980K079849l201132j8851139k3410990
$$ 105460947 100412796 95714447 97675115 100298095 102377944 99176812 80325673 56914683
17876E6914683j4142948p234666l800664j664290q61264q52355q30695j059759
$$ 56914683 42771735 35537069 31736405 30072115 29210851 28358496 27527801 26468042
17868B6468042k074663k226854j260662n10181K5864O83526J894574L763118P020720
$$ 26468042 24393379 22166525 20905863 20395682 20421546 21105072 22999646 26762764 33783484
17859C3783484J2072251J5985764J3193480Q084747M520180n018296k0608616
$$ 33783484 45855735 61841499 75034979 83119726 87639906 82621610 62012994
17852F2012994j9756342j1065730n869370l423491k274782j662944j355314j254148
$$ 62012994 42256652 31190922 25321552 21898061 19623279 17960335 16605021 15350873
17844A5350873j150911q26905o05878m22879l28073l51942l06077k54882k15686
$$ 15350873 14199962 13373057 12767179 12344300 12016227 11664285 11358208 11103326 10887640
17835A0887640k97289l49176l23294k10811k58856k45449r5923p5830j58247j67913
$$ 10887640 10590351 10241175 9917881 9707070 9448214 9202765 9106842 9031012 8872765 8704852
17825H704852n3443j26998j78971l26048l90063k41428j13841j00974j81790j65074
$$ 8704852 8651409 8524411 8345440 8019392 7629329 7387901 7274060 7173086 6991296 6826222
17815F826222k11795j39812k04856j81116j23606j13573j46537n6938k521r7527
$$ 6826222 6614427 6474615 6269759 6088643 5965037 5851464 5704927 5647989 5645468 5547941
17805E547941o2381j09486j17477j15505r5169j16201j19018j19158j16680r6345
$$ 5547941 5485560 5376074 5258597 5143092 5047923 4931722 4812704 4693546 4576866 4480521
17795D480521j10087j11843k7971j24401j55301j02232j4561K2678R3236J45307
$$ 4480521 4370434 4258591 4230620 4106219 3950918 3848686 3834125 3856803 3950039 4095346
17785D095346M3149j910l6677o4171p0673m6069k6298k1296O920p9012k05623
$$ 4095346 4138495 4136585 4099908 4035737 3965064 3918995 3892697 3871401 3878321 3799309 3593686
17774C593686j68350j8098p0172o7887J9996R758j00208j21051j37126n4077O216
$$ 3593686 3425336 3407238 3337066 3269179 3289175 3298933 3198725 3077674 2940548 2886471 2892687
17763B892687r0166j06045P3885J75416Q4090m559j8182q6953N9461K12758L0508
$$ 2892687 2802521 2696476 2770361 2945777 3029867 3025308 3007126 2920173 2979634 3192392 3222900
17752C222900n4946n2316k14254k18415q0030R950m398q5264j50043r2270j73006
$$ 3222900 3167954 3115638 2901384 2682969 2602939 2612889 2608491 2523227 2373184 2280914 2107908
17741B107908o5480J2259j34979j40892o2888J9035J0724P9359p237l7831L3691
$$ 2107908 2042428 2054687 1919708 1778816 1715928 1734963 1745687 1825046 1817809 1779978 1813669
17730A813669J35464J48423J24703j8842j61853j51375j07271M8719L5139n4375
$$ 1813669 1949133 2097556 2222259 2203417 2041564 1890189 1782918 1831637 1866776 1812401
17720A812401n5254j82841j52369j7590m544r2916k3152Q7560j520k8463k8590
$$ 1812401 1757147 1574306 1421937 1404347 1399803 1306887 1283735 1371295 1369775 1341312 1312722
17709A312722q0340k20289j19947j2708J38197N7126p5299J52798Q9444R9632
$$ 1312722 1232382 1012093 892146 879438 1017635 1074761 999462 1152260 1241704 1341336
17699A341336j663L4114j9343j2033r4864Q2161J0920j2012k0966j2022J6748
$$ 1341336 1339673 1373787 1354444 1342411 1247547 1329708 1340628 1328616 1307650 1295628 1312376
17688A312376j90463k11291j9905Q9522N0502n3468j78291j36548P1483N0469
$$ 1312376 1121913 910622 890717 980239 1030741 977273 798982 662434 733917 784386
17678G84386J7744j14289m5943j105N5612p2012p1787n138P4631J60429J14800
$$ 784386 802130 687841 641898 640793 696405 624393 552606 547468 622099 782528 897328
17667H97328L4509p760l659L4906r7925j0858J4637o582o925j2355J7987l7097
$$ 897328 931837 924077 920418 955324 857399 846541 861178 854596 847671 835316 853303 816206
17655H16206o2932o9812k08725j17270L479J917l6342m6453K6651q962k5964M277
$$ 816206 753274 683462 474737 357467 360946 362863 326521 280068 306719 297757 271793 276070
17643B76070J3733r7325p4J9655q2709R2198J07461j5914q7080m5922j9743K7760
$$ 276070 289803 192478 192404 212059 129350 221548 329009 313095 226015 180093 160350 188110
17631A88110J73670L17n445M291j2955m1058k1021q8346J099L4812j06026P6096
$$ 188110 361780 362097 356652 360943 347988 306930 285909 197563 198662 233474 127448 203544
17619B03544J66268m1199n9237p5175k8366K467K2884p361l9236l7203Q6508N9830
$$ 203544 369812 328613 269376 194201 165835 168302 191186 183825 144589 107386 193894 253724
17607B53724m25r2561n5765M3237n1813j5018J7737o5418l625Q4738J02415L6147
$$ 253724 253299 160738 104973 148210 96397 81379 99116 33698 30073 114811 217226 253373
17595B53373M240j24650m5075Q0590l3426L1089K4387j54940o3217J14318O8708
$$ 253373 257613 132963 87888 168478 135052 166141 190528 35588 -27629 86689 155397
17584A55397k8184J2112M097K3869n4150q6416r2927J12785P3364o1647M3539
$$ 155397 127213 139325 143422 167291 113141 26725 -66202 46583 119947 58300 101839
17573A01839J28375N1266j01263j35805n1805p699k4264N8765M0362J100k7253
$$ 101839 230214 281480 180217 44412 -7393 -15092 -39356 19409 59771 60871 33618
17562C3618j7486O7874L7602k1854k1727K8150L7867p7295M7009Q181L3135m382
$$ 33618 16132 84006 121608 99754 78027 106177 144044 66749 113758 121939 155074 150692
17550A50692q7327L789L7967j8546J1947K4348p1449j23986n2447j6609p015j4331
$$ 150692 63365 67154 105121 86575 98522 122870 51421 -72565 -125012 -141621 -148636 -162967
17538a62967k9431J4976L1010L5068N9480K8420j42668j00306J01853N4535N3269
$$ -162967 -192398 -177422 -146412 -111344 -51864 -23444 -166112 -266418 -164565 -110030 -56761
17527e6761j2184Q1860J4804j11705k222L5891J03087R875o0122l4875j7807j6187
$$ -56761 -68945 12915 27719 -83986 -86208 -50317 52770 62645 2523 -32352 -50159 -66346
17515f6346m1916n2638L3136P0473l5308l420K9595k0074q3980P8924Q470J07543
$$ -66346 -108262 -160900 -127764 -57291 -92599 -96019 -66424 -86498 -170478 -91554 -83084 24459
17503B4459P0618o8628M703p8739p0343L4265J5499J06807K7588n2737k6465j521
$$ 24459 95077 26449 31152 -47587 -117930 -83665 -68166 38641 66229 13492 -12973 -14494
17491a4494R287l6044Q2245K5165r557m0516p4542j6281k2476L3248l0344q2111
$$ -14494 -5207 -41251 40994 66159 56602 16086 -58456 -74737 -97213 -63965 -94309 -176420
17479a76420N2912P2958k4283j7514J836O712o271m2586l1888k0090j8429j6644
$$ -176420 -123508 -50550 -74833 -92347 -90511 -83799 -90070 -132656 -164544 -184634 -203063 -219707
17467b19707O155J61597J66121J50132q5022j15297j9192Q480n449J8937J2371
$$ -219707 -213552 -51955 114166 264298 179276 63979 44787 53267 47818 66755 79126
17456G9126l8237k3029M6069M9319n8986J1348Q5670n9918j05071M7957p447J09048
$$ 79126 40889 17860 63929 113248 54262 65610 151280 91362 -13709 34248 26801 135849
17444A35849J6783m6608J17178K25825J64418K2162j3825k5626p8124j55696j79677
$$ 135849 152632 106024 223202 449027 613445 635607 621782 596156 518032 362336 182659
17433A82659q7963J1288o9751k9726R7665M0611N3477l2151K2110J2661q4591
$$ 182659 94696 105984 36233 6507 104172 144783 198260 166109 188219 200880 116289
17422A16289k6376k2600o484L360l4573N8841R8238N6563R71q8535j05188o7829
$$ 116289 89913 67313 60829 64189 29616 88457 186695 243258 244229 155694 50506 -17323
17410a7323o3921m0597m9701m8711L1127M1104j768M4894O6084Q261J09752K1400
$$ -17323 -81244 -121841 -171542 -220253 -189126 -148022 -149790 -104896 -38812 -30551 79201 100601
17398A00601l5026q775Q39j1936k5866J07775R883j50634l7340k7245n7305K1926
$$ 100601 65575 56800 57639 45703 19837 127612 137495 -13139 -50479 -77724 -135029 -113103
17386a13103L1344M9974J37153N6256o4173o0749k5571J12175J33986R0996M4959
$$ -113103 -81759 -31785 105368 161624 97451 36702 11131 123306 257292 348288 393247
17375C93247M4106m9666o7642k5304r5927o8960q225r1526n4096R472p0000p0752
$$ 393247 437353 387687 320045 294741 198814 129854 121629 30103 -23993 -14521 -84521 -155273
17363a55273N9135J12798R9230l9041J3601K6495m5548R7636L0469R1323L1460
$$ -155273 -96138 16660 115890 76849 90450 116945 71397 169033 199502 290825 322285
17352C22285N3612K2430J65443L4091J654r7246k3937l8050j2612O9225n7943
$$ 322285 375897 398327 563770 597861 599515 502269 478332 440282 427670 496895 438952
17341D38952j35255q1508k5880n3449p20k8001o1839j0082Q870J3645K7288K3921
$$ 438952 303697 222189 196309 142860 142140 114139 52300 42218 51088 64733 92021 115942
17329A15942o9111L0789M8207l743J3229M3532R5619J03900N4161J4834N9568
$$ 115942 46831 77620 125827 122084 135313 178845 274464 378364 432525 447359 506927
17318E06927o7667j23088j64797j362K1594L2853M440j52730o2353L7843P5547
$$ 506927 439260 316172 151375 150013 171607 204460 208900 56170 -6183 31660 107207
17307A07207L2348l2689M5771R27l5323l9310o7189N4696j3683j79716p0949R1430
$$ 107207 139555 106866 152637 153564 118241 78931 11742 66438 52755 -126961 -197910 -106480
17295a06480N6990J3618J28876M4588m2351o8156M4779O5872m009n1022L8058
$$ -106480 -49490 -35872 93004 137592 95241 27085 71864 137736 133727 82705 120763
17284A20763L6152N712j43419j62631L7683R6369N8731j0999L8099L0750j9125
$$ 120763 156915 162627 19208 -143423 -105740 -9371 49360 38361 76460 107210 88085
17273H8085p138O063J1331r5851n7737j0266J22036R4831J0888p1026r7976m73
$$ 88085 80947 87010 98341 2490 -55247 -65513 56523 151354 162242 91216 -6760 -7233
17261g233l5182M1627O2534j4775J0882K5165m6515j2629k5413N3223J32552n5168
$$ -7233 -42415 -788 61746 46971 57853 83018 36503 23874 -1539 51684 184236 129068
17249A29068o7799n2471n1545l8968R082Q0196l7985k0609j2464o351n0659L8537
$$ 129068 61269 8798 -42747 -81715 -72633 7563 -30422 -51031 -63495 -69846 -120505 -81968
17237h1968j20225l6676N9996N1969P593k3250l5145N0306K40057Q0111j44266
$$ -81968 -202193 -238869 -178873 -126904 -119311 -142561 -177706 -127400 112657 192768 48502
17226D8502o9513N3117Q5755N9054n8218L3913n4808o7775M1598J48469q8032
$$ 48502 -21011 32106 117861 176915 118697 152610 97802 30027 71625 220094 132062
17215A32062j35379l1791j4334P9506o6525P6480P8767r1302o2458n7798Q9278
$$ 132062 -3317 -35108 -49442 30064 -36461 40019 118786 27484 -34974 -92772 -3494
17204c494P0203l096O749k8274j7706M776O4238N8855r4346k3630k8727K4109
$$ -3494 66709 63613 70362 42088 24382 29158 93396 152251 57905 34275 5548 29657
17192B9657k4964j6298m8989m8072M487N7209L6994N1114K7842q1440q5217L9073
$$ 29657 4693 -11605 -60594 -108666 -104179 -46970 -9976 41138 68980 -12460 -97677 -58604
17180e8604O4473j8615m7134J53113j8369p0732o784l0723N8776K3858o7368l6006
$$ -58604 5869 -12746 -59880 93233 74864 4132 -2652 -33375 25401 49259 -18109 -54115
17168e4115J2591j14985J2074L9421r1k5709N2883J4104O72J11883N0042k644
$$ -54115 -41524 -156509 -144435 -105014 -105105 -130814 -77931 -63827 -63155 48728 98770 96126
17156I6126o7959j096P0433R176p5547q4755j08719J3899M5583N0876j2308M1025
$$ 96126 28167 27071 97504 106680 31133 -53622 -162341 -148442 -102859 -51983 -64291 -23266
17144b3266o8282j23105K1561R1894R6296N671k8202q7927r8276j7453O0309J25608
$$ -23266 -91548 -214653 -193092 -101198 -4902 769 -27433 -115360 -213636 -231089 -170780 -45172
17132d5172n6247o1563K6927O2385M0844K2757j9734k4180R4531J51703n0814
$$ -45172 -101419 -162982 -136055 -73670 -32826 -10069 -29803 -53983 40548 192251 141437
17121A41437m5391p5212r1382J7474L6039L2891L0105L3116P9191P8740j02388
$$ 141437 96046 20834 -70548 -53074 -17035 15856 45961 79077 158268 237008 134620
17110A34620j68023o0310o287k4382j25534O4333J85954J15423J5027j45865n9713
$$ 134620 -33403 -93713 -100000 -124382 -249916 -185583 371 115794 130821 -15044 -74757
17099g4757L332N4375L5418L6857j07471p3097p3646M1735j1923M4938J22211
$$ -74757 -71425 -17050 18368 55225 -52246 -125343 -198989 -157254 -169177 -124239 -2028
17088b028J0820P8199M6815m3171r250N6821j18965p7943j1331j4030J00974Q1955
$$ -2028 8792 86991 133806 90635 81385 138206 19241 -58702 -70033 -84063 16911 98866
17076I8866K5607p76l21Q6206k8863o6975j08447k7483R5995k2838o0117k3472
$$ 98866 124473 123697 123376 209582 180719 113744 5297 -22186 73809 50971 -9146 -32618
17064c2618k4308L2996L5639O4993n3933J5152M0064L689P554m5588n813n2579
$$ -32618 -56926 -23930 11709 76702 22769 37921 77985 81674 89228 43640 37827 -14752
17052a4752l7554J2976K2879n0622l1957J81288L6300j15586K9911n2610r9736
$$ -14752 -52306 -39330 -16451 -67073 -99030 82258 118558 2972 32883 -19727 -119463
17041a19463n0507l7724P7958M7838P258Q6113O4724q8512L648J7308p7017k31026
$$ -119463 -169970 -207694 -129736 -81898 -74640 11473 76197 -12315 -8667 8641 -68376 -299402
17029b99402R3358J86323o6099Q2691J23912k9337k8070n805k7955m0402k3569
$$ -299402 -206044 -19721 -85820 -3129 120783 91446 63376 57571 29616 -10786 -34355
17018c4355m17j6346j07507l5377o6808k8348J84253J43922n5058J2539R6324
$$ -34355 -34772 -51118 -158625 -194002 -260810 -289158 -104905 39017 -16041 -3502 92822
17007I2822m863p9402J1247k7779K5059k5346k9936p8036J16659R8556p758m6580
$$ 92822 87959 8557 19804 -7975 17084 -8262 -38198 -116234 425 98981 91223 44643
16995D4643j4377M8132L8964m5545j10986j9643j595j9376l7449o9643N1584O9789
$$ 44643 30266 78398 117362 71817 -39169 -58812 -60407 -79783 -117232 -186875 -135291 -65502
16983f5502Q1282p8665j23337j19129J13059J26843m0680Q6213M8079m6187K3683
$$ -65502 15780 -62885 -186222 -305351 -192292 -65449 -106129 -19916 28163 -18024 5659
16972E659r4546n8062N0255l6513j7879J6654M6128J19053O7053j4759j18421
$$ 5659 -88887 -146949 -96694 -133207 -151086 -134432 -88304 30749 97802 83043 -35378
16961c5378n6145J1710Q3529N5447m8260m1107O4617M9183j37669m3032k8456
$$ -35378 -91523 -79813 3716 59163 10903 -30204 34413 83596 -54073 -97105 -125561
16950a25561P6231j1352o3701M6060M5702K9284m8108M4572l4137N7420N7809
$$ -125561 -49330 -60682 -124383 -78323 -32621 -3337 -51445 -6873 -41010 16410 74219
16939G4219L4503J151J54461K16j05230m5556n5523K8565o5819j34651R514J24714
$$ 74219 108722 109873 264334 264550 159320 113764 58241 86806 20987 -113664 -104150 20564
16927B0564l654j20664O890P9723L278j3033j7057O2610L9331P4621L1820p6861
$$ 20564 16910 -103754 -96864 -17141 -13863 -26896 -43953 18657 57988 132609 164429 87568
16915H7568q3779p8296j3032J51314j358k5790m6061q6612J7754P6905L3873l7859
$$ 87568 3789 -74507 -87539 63775 62417 36627 -9434 -96046 -78292 -1387 32486 -5373
16903e373n2766o364M7530J0846q7147L2521l9217N767P4608K1914j03573n3979
$$ -5373 -58139 -64503 -16973 -6127 -93274 -60753 -99970 -94203 -19595 2319 -101254 -155233
16891a55233K8209K2809K2259L0539n5183P987N1078o367r1753P453J32927J0333
$$ -155233 -127024 -104215 -81956 -51417 -106600 -98613 -47535 -53902 -145655 -138202 -5275 5058
16879E058k8182M5676O7175n592N5284l3905j00346M8J8300M5949j219K1604l1026
$$ 5058 -23124 22552 89727 84135 139419 105514 5168 5216 23516 69465 68246 89850 58824
16866E8824O2745J9816j76368j39655R434N667K5089J15964O9435m6335M7872
$$ 58824 121569 141385 -34983 -174638 -165204 -159537 -134448 -18484 50951 4616 52488
16855E2488O5325N4573Q9734j5255j2371k8561J5377O096q4567l5571l9997o8071
$$ 52488 117813 172386 262120 246865 234494 205933 221310 227406 142839 107268 67271 -800
16843h00n2497L7255J8993j0489M9261l862J1997Q891j0399k316q2478m6765N5076
$$ -800 -53297 -16042 2951 -7538 41723 37861 49858 58749 48350 46034 -36444 -83209 -28133
16830b8133j9806O5406K3368j4175m1702L4656N8195m2647q541J4644p0550m9610
$$ -28133 -47939 17467 40835 26660 -15042 19614 77809 35162 26621 41265 -29285 -78895
16818g8895O5919R8123J4926j34705m2176m7446J3837J22804L5213p9634o0186
$$ -78895 -12976 85147 100073 -34632 -76808 -124254 -110417 12387 47600 -32034 -92220
16807i2220P8198J31296r4374r8022J19060K573r6502p612m8248P9009R5563k023
$$ -92220 -14022 117274 22900 -75122 43938 46511 -49991 -57603 -105851 -26842 68721 66698
16795F6698o5316l5227J2321M1735M0650n8273p0033O203L1500l5213j90150p3989
$$ 66698 1382 -33845 -21524 20211 60861 2588 -67445 -61242 -29742 -64955 -255105 -329094
16783c29094J02774P23K2478M2859N2940J61511L4370n8461n0895o0856j7002
$$ -329094 -226320 -225597 -203119 -160260 -107320 54191 88561 30100 -20795 -81651 -98653
16772i8653J01087R541N302j2112r607K3465J9808M0205P5356k2348j30801o0426
$$ -98653 2434 11975 17277 5165 -4442 19023 38831 79036 154392 132044 1243 -59183
16760e9183n8003n52p1394L7395n2451R3701O8410P2084P6432j24990j41828K4163
$$ -59183 -117186 -117738 -189132 -151737 -204188 -110487 -42077 30007 106439 -18551 -160379 -136216
16748a36216Q9662l0214n1084q0613N5507J72240Q4711n9381o0824J6532n0540
$$ -136216 -46554 -76768 -127852 -208465 -152958 19282 103993 44612 -16212 320 -50220
16737e0220P56m5382P0581O3269L181l2869R293N893R7N7274r313k50M9385q4897
$$ -50220 -49464 -94846 -24265 39004 42185 9316 18609 24502 24599 81873 72560 72310 121695 36798
16723C6798l155p5294k2894k7063J7044K1408J9400Q173j7439J9103J7565L2994
$$ 36798 33643 -41651 -64545 -91608 -74564 -53156 -33756 -25583 -43022 -23919 -6354 26640
16711B6640p5849J8765N9899l0864j38778K0878L2010N4337o1817j2721R0600
$$ 26640 -49209 -30444 29455 -1409 -140187 -119309 -87299 -32962 -94779 -107500 -16900
16700a6900Q2567K29r0737j8780J5114O5233P398o3643j27954L0532R8342r563
$$ -16900 65667 65896 -24841 -43621 -28507 36726 44124 -19519 -147473 -116941 -18599 -28162
16688b8162l3576P7723J18796l8831J5075j0209k0310l3831r8779P93R4220L5560
$$ -28162 -61738 15985 134781 95950 111025 100816 80506 46675 -52104 -51311 42909 78469
16676G8469q6513P447K7198j72846j20720M7887J38524J09958N1202k3804k3175
$$ 78469 -8044 -597 26601 -146245 -266965 -219078 -80554 29404 80606 56802 33627
16665C3627J6227J02157K5703p2503j32237p0632j3558J01430j40k6326M410O1680
$$ 33627 49854 152011 177714 105211 -27026 -97658 -111216 -9786 -9926 -36252 -31842 29838
16653B9838o1687j07701M5470O3711l2038L6364q3861j60247r412Q2544M5117
$$ 29838 -31849 -139550 -94080 -30369 -62407 -26043 -109904 -270151 -279563 -197019 -151902
16642a51902m6526l6303K0490p258J7729J4962J2323n0374j8984N8776J06478
$$ -151902 -198428 -234731 -214241 -221499 -203770 -188808 -176485 -226859 -245843 -187067 -80589
16631h0589M7317k6407O0609N4369l3964O9995j590n0785m7456l0042k7836o1670
$$ -80589 -33272 -59679 930 55299 21335 91330 89740 38955 -8501 -38543 -66379 -128049
16619a28049J3351N8530M8623m936k3194J6984o0786n3914k6215J16629k6288
$$ -128049 -114698 -56168 -7545 -12481 -35675 -18691 -79477 -133391 -159606 -42977 -69265
16608f9265j56095N1989Q4352J3451J02305L9404p749p908l1501M8398r124m3302
$$ -69265 -225360 -173371 -89019 -75568 26737 66141 58392 50484 18983 67381 58257 14955
16596A4955m3908p9230p0077O9526P6081j3848q286N999q4105n3472N7862J39158
$$ 14955 -28953 -108183 -178260 -108734 -32653 -46501 -54787 -48788 -132893 -186365 -128503 10655
16584A0655Q7345L3395R1017j6566j35050j26483N4966J26686L2314k2395j09100
$$ 10655 98000 131395 222412 205846 70796 -55687 -721 125965 158279 135884 26784
16573B6784J1976k0892p6250J4276J6554m2478p8894q0724p639N0584N6300N2810
$$ 26784 38760 17868 -58382 -44106 -27552 -70030 -148924 -229648 -237287 -186703 -130403 -77593
16561g7593J73020P3999o8928n0769p25M8711M5718R0638O1809j18254m800J6474
$$ -77593 95427 169426 100498 49729 49004 97715 143433 234071 295880 177626 172826 189300
16549A89300M8919J8165L5859n1832j18734N959j22889j53602M4353P6293J65013
$$ 189300 238219 256384 292243 240411 121677 127636 4747 -148855 -104502 -28209 136804
16538A36804M2836L4719p8999j11261m2654M3803l2253j2039o2382j8310O5360
$$ 136804 179640 214359 135360 24099 -18555 25248 -7005 -19044 -81426 -99736 -34376
16527c4376P9006J6068k5722r4689j0605j3422k001L8884K8756j5652p6789o8586
$$ -34376 44630 60698 34976 -59713 -70318 -83740 -85741 -46857 -18101 -33753 -110542 -179128
16515a79128J19842m825j36637P0692O6434l374J1158M7355J21190O0728p9653
$$ -179128 -59286 -64111 -200748 -130056 -63622 -66996 -55838 -8483 112707 173435 93782
16504I3782q6095r236l654L3450j3862j12119o2584J17201l0950J42359R5912
$$ 93782 7687 -1549 -5203 28247 14385 -97734 -160318 -43117 -74067 68292 164204
16493A64204M748L5481j47776n9315p4515r333Q8433J0751K7946K1591r1308p9710
$$ 164204 168952 204433 56657 -2658 -77173 -86506 1927 12678 40624 62215 -29093 -108803
16481a08803j0808r3944M5559O5361R103Q365N6688J02418L0899j92507j23207
$$ -108803 -119611 -213555 -167996 -102635 -93532 -85167 -28479 73939 104838 -87669 -210876
16470b10876O5961N1052J8923p6676Q722R2059J3102k4370R033L8872n4751K267
$$ -210876 -144915 -93863 -74940 -151616 -142894 -50835 -37733 -62103 -53070 -14198 -68949 -66682
16458f6682M2292L6147K8251M0692p084r1425r7583O6422P9019j7293p2318J0782
$$ -66682 -24390 11757 40008 80700 73616 -17809 -115392 -48970 30049 12756 -59562 -48780
16446d8780m6928l390Q4094Q9998K5855r0109m9524Q9643Q922L6583J9459N6851
$$ -48780 -95708 -99098 -15004 74994 100849 10740 -38784 50859 59781 96364 115823 172674
16434A72674l8106k8890q4331p5463m3811p895M7324N2329q3993k3798M0800k4603
$$ 172674 134568 105678 21347 -54116 -97927 -105822 -58498 -6169 -90162 -113960 -73160 -97763
16422i7763M9010k8846P0608n2839j32653M0970J02004o3611M299L8707L2866
$$ -97763 -48753 -77599 -6991 -59830 -192483 -151513 -49509 -113120 -108821 -70114 -37248
16411c7248N1351r818p114k849p7703p106J4130l5328m0642j5994j8570L4057
$$ -37248 14103 4285 -2829 -5678 -83381 -90487 -76357 -111685 -152327 -168321 -186891 -152834
16399a52834J52935R6137J6647K1668j2120R849j6366j3741m6707n7018o5305
$$ -152834 101 96238 112885 134553 122433 132282 115916 102175 55468 -1550 -66855
16388f6855j7199P6820L6249j08140j7375j04710J8556J52466O1361j10503q4667
$$ -66855 -84054 -7234 29015 -79125 -96500 -201210 -182654 -30188 31173 -79330 -163997
16377a63997K5479M5350J49911O9280q3366N0386j6985j12661m3775L1524R6068
$$ -163997 -138518 -93168 56743 126023 42657 93043 76058 -36603 -80378 -48854 47214
16366D7214J1331J9551k1671j07710p6145K5670L7837P3223O5271l1354j6050
$$ 47214 58545 78096 56425 -51285 -127430 -101760 -63923 9300 74571 43217 27167
16355B7167L8460l8496k1220N0707O1653n4268r3266m0302N1027l1053k6353K2099
$$ 27167 65627 27131 5911 56618 118271 64003 -29263 -69565 -18538 -49591 -75944 -53845
16343e3845m0893J3857M1075M6059j7696r033j4369j01627n2153Q3899L9665M1417
$$ -53845 -94738 -80881 -39806 6253 -11443 -20476 -34845 -136472 -188625 -104726 -65061 -23644
16331b3644N0150O9537r665o7670p6304K412q5293m1781Q1061J040l2024J26944
$$ -23644 26506 96043 86378 18708 -57596 -55184 -140477 -182258 -101197 -100157 -132181 -5237
16319e237L6840l0836L3138J2294k8565m0511R3208Q9874j40113o5364l4483l8403
$$ -5237 31603 767 33905 46199 17634 -22877 70331 160205 20092 -45272 -79755 -118158
16307a18158J0785k7836P7237N2376m7088LO684o247K0880n1664l9769J22760
$$ -118158 -107373 -135209 -57972 -5596 -52684 -52681 -45997 -52244 -31364 -83028 -122797 -37
16295c7J7771J7534p135k5616N6501k6532k4059J8205l0072J3396P0260P8783
$$ -37 17734 35268 28133 2517 59018 32486 8427 26632 -3440 9956 80216 158999
16283A58999r1039j02843j3819o6887k5325N9075N0468J8142o7704r0647k9631
$$ 158999 67960 -34883 -48702 -115589 -140914 -81839 -31371 -13229 -80933 -171580 -201211
16272b01211N4000j5462L7862K5329N0748m8052m2446N0365l8522O7405L6625
$$ -201211 -147211 -162673 -124811 -99482 -48734 -96786 -139232 -88867 -127389 -59984 -23359
16261b3359j4171M2328M8516K3328p13p5073p4583N444L8022O8249Q0981L0765
$$ -23359 -37530 4798 53314 76642 75929 856 -73727 -68283 -30261 37988 118969 149734
16249A49734l3373o9036r2142n3931p2319J1519L7453J4245M9022p4257K789R7293
$$ 149734 116361 47325 -44817 -98748 -171067 -159548 -122095 -107850 -58828 -133085 -130296 -33003
16237c3003k5953m690M6097q226K9540j05943R761P9643J3828m7802r935J2202
$$ -33003 -58956 -63646 -17549 -25775 3765 -102178 -92417 -12774 1054 -46748 -56683 -44481
16225d4481J41533J27107m7831l0999l9359p5955M2108M1944m0178q192N6053
$$ -44481 97052 224159 176328 145329 105970 30015 72123 114067 73889 65697 121750
16214A21750J9310q4653J0576Q005j22716o1735J9166J05472l0680k8379K7404
$$ 121750 141060 56407 66983 74988 -47728 -109463 -90297 15175 -15505 -43884 -16480
16203a6480m164R3971O7303l6174m9515p124j7150o9828o9722N6446Q967O255
$$ -16480 -20644 73327 140630 104456 54941 47817 30667 -39161 -108883 -52437 -43470 -37215
16191c7215l2219j1992m2921L5458o704p483J2475K2745J08475m5648k348o4052
$$ -37215 -69434 -81426 -124347 -88889 -95593 -103076 -90601 -67856 40619 -5029 -7377 -71429
16179g1429n943j04639L3529N358L7692J2066r9493l9765n8436k8460J31064O2931
$$ -71429 -77372 -182011 -148482 -143124 -105432 -93366 -192859 -232624 -291060 -319520 -188456 -125525
16167a25525j0696J2003R9602P0115K5303L7978m2431n1822n2750L5211J0366
$$ -125525 -136221 -124218 -24616 45499 70802 108780 66349 14527 -38223 -3012 7354
16156G354m1871M0976L9706j15001o5592p8709K4862J15111Q8839o9915m3344
$$ 7354 -34517 6459 46165 -68836 -134428 -213137 -188275 -73164 15675 -54240 -97584
16145i7584N0226K480j6420J10088L1884n1767m7838K0132K5311j5762N0025M8271
$$ -97584 -47358 -44878 -61298 48790 80674 28907 -18931 1201 26512 10750 60775 109046
16133A09046J04134j2328r8050K1382j8865r8072R242L4156k3444P2981M2586
$$ 109046 213180 200852 102802 124184 105319 7247 16489 50645 27201 100182 142768
16122A42768n0910p8896m0315k7495M3647M6832O308k8466N0581j662j9008K1813
$$ 142768 91858 12962 -27353 -54848 -11201 35631 41939 13473 64054 62392 43384 65197
16110F5197N9621R3764j1272j22986r6710J5170O0535O9532j8769j72652n7754
$$ 65197 124818 218582 207310 84324 -12386 2784 63319 132851 114082 -58570 -116324
16099a16324L3505R611K8329M3880P9106q3673k6174K4425k6783J9514N6496p5845
$$ -116324 -82819 -73208 -44879 -999 78107 -5566 -31740 -7315 -34098 -14584 41912 -33933
16087c3933n5704q2734q9091k2889O5786N7035N7498J34605J650K0090n2750l8136
$$ -33933 -89637 -172371 -261462 -284351 -218565 -161530 -104032 30573 32223 52313 -437 -38573
16075c8573n8475R4280R9208J9384O9189k7187L1371K9761p8586N276r8666n9741
$$ -38573 -97048 -2768 96440 115824 185013 157826 189197 218958 140372 145648 46982 -12759
16063a2759k3616R6022J16533M5488p1272j37525j19968N8102J11256p6772r247
$$ -12759 -36375 59647 176180 221668 150396 12871 -107097 -48995 62261 -14511 -23758
16052b3758J10058L1957m5295m1415o1130m4574N076P6406m5492l2240Q7052N3170
$$ -23758 86300 118257 72962 31547 -29583 -74157 -69081 7325 -38167 -70407 16645 69815
16040F9815m036L1395j46938K118N3971O4283P8933j00305n5401o1917k3768M3622
$$ 69815 65779 97174 -49764 -47646 6325 70608 149541 49236 -6165 -68082 -91850 -48228
16028d8228K7827q6659o7744o7308p028P8549P8438J40162J41260k7727r9711
$$ -48228 -20401 -107060 -174804 -242112 -249140 -170591 -92153 48009 189269 161542 61831
16017F1831p3235p109J5961Q1119k960m2314j9119K9884L5253q2500j27414P0117
$$ 61831 -11404 -18513 -2552 78567 75607 33293 14174 44058 79311 -3189 -130603 -60486
16005f0486L1795K7371O7522J9169l1383l9322J2361J0044J39378J7951r8224
$$ -60486 -28691 -1320 66202 85371 53988 14666 27027 37071 176449 194400 96176
15994I6176j12402k8142N5246J40484J1517n7993R361j9494n0742n0207l1863
$$ 96176 -16226 -44368 10878 151362 162879 104886 114247 94753 44011 -6196 -38059
15983c8059m6449J3891J14294O2845o2347o4118j5184k2120K3074R8265M1040
$$ -38059 -84508 -70617 43677 106522 44175 -19943 -35127 -57247 -34173 64092 105132
15972A05132j44996n2874N0552k0290p0860O1558k082Q7979L7891j00309n612
$$ 105132 -39864 -92738 -42186 -62476 -133336 -71778 -73860 14119 52010 -48299 -53911
15961e3911Q9365k1325j050K2291p3119N8546o4607K7681J10353q414m9644j41910
$$ -53911 35454 14129 13079 35370 -37749 20797 -43810 -16129 94224 85810 36166 -105744
15949a05744J0220l216k3595n3358K2810Q9883O6261Q949K2278l2290k6336k0109
$$ -105744 -95524 -98740 -122335 -175693 -152883 -63000 3261 12210 34488 2198 -24138 -44247
15937d4247j0357o5216Q6994J00442J16711j9899m9154N0751P3232l6431l7802
$$ -44247 -54604 -119820 -32826 67616 184327 164428 115274 166025 239257 202826 165024
15926A65024l7138l900K6513j12629m2911N926q0013k7929J49833O0409r7220
$$ 165024 127886 123986 150499 37870 -5041 885 -79128 -107057 42776 103185 5965
15915E965n0397K99R6753P9636P1208j34696p6666R1797Q377p1539p4969K2948
$$ 5965 -44432 -44133 52620 132256 203464 68768 -7898 83899 92276 20737 -54232 -31284
15903c1284r407n5050M8076J27949o2519M4828J19811k5321j1488j36952o5917
$$ -31284 -40691 -95741 -47665 80284 17765 62593 182404 157083 145595 8643 -57274
15892e7274k9110o5939J6744J22956m2916n5216M4657Q9426j3350r6717q480L8361
$$ -57274 -86384 -152323 -135579 -12623 -55539 -110755 -66098 23328 9978 -86739 -95219 -56858
15880e6858R982p0958l3334l6097K0799P0954P7247M3175l7715n8871J13467j8187
$$ -56858 -46876 -117834 -151168 -187265 -166466 -95512 -18265 24910 -12805 -71676 41791 23604
15868B3604o971R893j9942J4273j6629q2238l6078Q1516L4407j5616n4147m4617
$$ 23604 16633 26526 6584 20857 4228 -78010 -114088 -32572 1835 -13781 -67928 -112545
15856a12545J17452J21913j23944o7371r30q6454j111Q9473J78212L3452o1762
$$ -112545 4907 126820 2876 -64495 -65425 -151879 -152990 -63517 114695 148147 86385
15845H6385j14619j12954M4284J9160N2470J1045O8579n9430M7409Q7296K8978
$$ 86385 -28234 -141188 -96904 -77744 -25274 -14229 54350 -5080 42329 129625 158603
15834A58603r1298o6366m8906q3496K1441M7373L7037N9597L8352P2153L67k5040
$$ 158603 67305 939 -47967 -131463 -110022 -62649 -25612 33985 72337 144490 144857 119817
15822A19817o9099p4207N1428n6544j2506J05087J17275k2599R4201J02200k3133
$$ 119817 50718 -23489 27939 -28605 -41111 63976 181251 158652 252853 355053 331920
15811C31920l2141j68333p3312Q5517k6873l8917m8525l885K6608P5135n1598
$$ 331920 299779 131446 58134 143651 116778 77861 29336 25451 52059 127194 75596
15800G5596n4896K7539M0785N3522R6125p3353l1390M2392J2152q6796j33330
$$ 75596 20700 48239 89024 142546 238671 165318 133928 176320 188472 101676 -31654
15789c1654j442N528j596l627Q42M0673K1626K7332j5883k5379j3925M6636p2983
$$ -31654 -33096 -27568 -29164 -32791 -31949 8724 30350 57682 41799 16420 2495 49131 -23852
15776b3852m7893j14306o1341M3942P4961j6332r1472j2820Q6363J20853P3258
$$ -23852 -71745 -186051 -247392 -203450 -128489 -144821 -236293 -249113 -162750 -41897 31361
15765C1361J36161M1324l2907p9222q0707p6485K302L4353N6444j38161m0332
$$ 31361 167522 208846 175939 96717 16010 -60475 -58173 -23820 32624 -105537 -145869
15754a45869L9880o7497j1795Q076K7020L1756K5508j1669J3595L9525k707o6101
$$ -145869 -105989 -173486 -185281 -177205 -150185 -118429 -92921 -104590 -90995 -51470 -54177 -120278
15742a20278O2270L0998j33289j02926R9967J95568K9834r4733l7265K8549N454
$$ -120278 -58008 -27010 -160299 -263225 -163258 32310 62144 -32589 -69854 -41305 -35851
15731c5851K8776l502k1426k3959K0399K2319K0777j820M7027l95r2780o1743
$$ -35851 -7075 -10577 -32003 -55962 -35563 -13244 7533 5713 52740 52345 -40435 -102178
15719a02178N5186L0187M937L929o827N9575r319o9037j0412K2300o6945o870
$$ -102178 -46992 -16805 -11868 -7939 -14766 44809 35490 -33547 -43959 -21659 -88604 -95474
15707i5474N5523n4668j5587O2624M1607n6028j633o843P3324P444J02982R1675
$$ -95474 -39951 -94619 -110206 -47582 -5975 -62003 -63636 -70479 2845 10289 113271 204946
15695B04946k3901p8961o7402q4164L3321J9343M7886m1551N0225O435K4269p7825
$$ 204946 181045 102084 34682 -49482 -16161 3182 51068 9517 59742 66177 90446 12621
15683A2621o9385J36416k330o2707p3717L3061J12052l3008j15441O030K0146
$$ 12621 -56764 79652 77322 14615 -59102 -26041 86011 53003 -62438 -56408 -36262
15672c6262p7372K5880M6660N9740O5960j403o9784q2391N059k2978p446J8702
$$ -36262 -113634 -87754 -41094 18646 84606 83203 13419 -68972 -63913 -86891 -94337 -75635
15660g5635M6224L9133R0109L3746J0944l1238j43560k3493j1375p493k5005l3937
$$ -75635 -29411 9722 99831 133577 144521 113283 -30277 -53770 -65145 -72638 -97643 -131580
15648a31580M7672L7857o870l3735M3770L8070N4327j5183j22089l3642p4337
$$ -131580 -83908 -46051 -52921 -86656 -42886 -4816 49511 34328 -87761 -121403 -195740
15637a95740K0632J33144M2174o2145m4559k9919j33102P6099N8152R3542L8813
$$ -195740 -175108 -41964 210 -61935 -106494 -136413 -269515 -193416 -135264 -41722 -2909
15626b909n8502m4761J02929n0086j5951N9159p2207k2774M8363m6587n3646J04322
$$ -2909 -61411 -106172 -3243 -53329 -69280 -10121 -82328 -105102 -56739 -103326 -156972 -52650
15614e2650J0511K7432L6040M342j6348j1846M7326N2356q4K7379o647j968M030
$$ -52650 -42139 -14707 21333 25675 9327 -2519 44807 97163 97079 124458 117811 115843 119873
15601A19873j03413j478Q2219j3058K885J1520j43841q2623n9935N4386R5611
$$ 119873 16460 14982 97201 84143 87028 98548 -45293 -127916 -187851 -133465 -37854
15590c7854L5810m9681k3555L3207l4841r178M1417j4950P65N920Q3041m6712
$$ -37854 -2044 -51725 -75280 -42073 -76914 -86092 -44675 -59625 -58860 -52940 30101 -16611
15578a6611j18338J7216q061q2428R7085K4215R3412j3614m3079q2731K971j09563
$$ -16611 -134949 -117733 -125794 -208222 -111137 -86922 6490 -7124 -50203 -132934 -129963 -239526
15566b39526l5540J02578J9642J8534m7352k5051J48856J4096l1060l0649L9391
$$ -239526 -275066 -172488 -152846 -134312 -181664 -206715 -57859 -43763 -74823 -105472 -66081
15555f6081r6481k3531M1299R4750R1197L7363n7975n1566L8831R3696l5928r5202
$$ -66081 -162562 -186093 -144794 -50044 41153 78516 20541 -31025 7806 101502 65574 -29628
15543b9628l0093J5068q340o1768Q2055k9536P6925J67403m9997l3795r8064l2603
$$ -29628 -59721 -44653 -52993 -114761 -32706 -62242 14683 182086 132089 98294 230 -32373
15531c2373m045K1362n5120k8314O361k843j0212j40886m9099K30301L5956M8942
$$ -32373 -36418 -15056 -70176 -98490 -92129 -94972 -105184 -246070 -295169 -64868 -28912 20030
15519B0030r610K2553O0311M0350K0872o7877mk3589j7326J3183L4253k2019m6096
$$ 20030 10420 32973 93284 133634 154506 86629 86625 63036 45710 58893 93146 71127 25031
15506B5031j7173O2124N091m9540L8687n0935M478M8045J2403P1229J46476l9605
$$ 25031 7858 69982 75073 25533 64220 13285 17763 65808 78211 149440 295916 256311
15494B56311o5937n7358o1817M4385L0000r669p5181n0858k1195J6516M6041L5881
$$ 256311 190374 133016 71199 115584 145584 135915 60734 9876 -11319 5197 51238 87119
15482H7119p2826J6429J919k0136m9864k7706J4549j3608j35223R990J6594Q6673
$$ 87119 14293 30722 32641 12505 -37359 -65065 -50516 -64124 -199347 -189357 -172763 -86090
15470h6090R9982K1670O0217k4814j6705k8378J4413L5439R4298J0779j12491
$$ -86090 13892 35562 95779 70965 54260 25882 40295 75734 170032 180811 68320
15459F8320O8059q3120l5270o22o8589m5838j7525J03987J1263q6402O0060o736
$$ 68320 136379 53259 17989 17367 -51222 -97060 -114585 -10598 665 -85737 -25677 -32413
15447c2413P682O62o198n6892r4631Q7550K7296j27834l3797O2096J1430J7847
$$ -32413 -24731 -24069 -30267 -87159 -181790 -94240 -66944 -194778 -228575 -166479 -155049 -137202
15435a37202L9632J3061N2556k453L0728J7420j44385Q28L5032J328k6251N2584
$$ -137202 -97570 -84509 -31953 -34406 -3678 13742 -130643 -129815 -94783 -93455 -119706 -67122
15423f7122L6961N4053P6765o5252r2750N4497Q8972O3741L0336q4657j0700L4264
$$ -67122 -30161 23892 100657 35405 -57345 -2848 86124 149865 180201 95544 84844 119108
15411A19108p7099J9440l5495p4470o1061l8935K0215j8074J7412J28502N4578
$$ 119108 42009 61449 25954 -48516 -109577 -148512 -128297 -146371 -128959 -457 54121
15400E4121Q0905n6783r0644J19285Q3472N4771j9283k0209j0252j8221n7080
$$ 54121 135026 78243 -12401 106884 190356 245127 225844 205635 195383 177162 120082
15389A20082j45407L8397P791J0325l7772R873m696q2699m1248N593Q6471M7154
$$ 120082 -25325 13072 20863 31188 -6584 3289 -1407 -84106 -125354 -119761 -33290 13864
15377A3864R931O426n4028J17548k7344q5414J03071k7823j02942l983J9095K4851
$$ 13864 23795 30221 -23807 93741 66397 -19017 84054 56231 -46711 -50694 -31599 -6748
15365f748k0270J1027k0103N6240k7948j7532K9752q3612K8127N7966Q463m1559
$$ -6748 -27018 -15991 -36094 20146 -7802 -25334 4418 -79194 -51067 6899 15362 -26197
15353b6197j6669O6461K4727j32812j25641O7341P7823L4402j5344Q2258O8470
$$ -26197 -42866 23595 48322 -84490 -210131 -142790 -64967 -30565 -45909 36349 104819
15342A04819o879O716J1147o2832j05065k455j2998N8355L0444j3995M7648N3378
$$ 104819 97940 104656 115803 52971 -52094 -54549 -67547 -9192 21252 7257 54905 108283
15330A08283m5224n9615l8236j4067n3770P8237K1275p6490K4522n275M755j9699
$$ 108283 63059 3444 -34792 -48859 -102629 -24392 -3117 -79607 -55085 -60360 -55605 -75304
15318g5304L5336M1308O6641j0935k3789j2495j0598q4490j34264M8866J04297
$$ -75304 -39968 1340 67981 57046 33257 20762 10164 -74326 -208590 -159724 -55427
15307e5427p1J02661P5923j48717p4500J5j06393M2081R3709J20789J8605j00825
$$ -55427 -55498 47163 123086 -25631 -100131 -100116 -206509 -164428 -70719 50070 68675 -32150
15295c2150L7630R233j12323M105L6201n0262p814K4636N0749O7162O3319l6256
$$ -32150 5480 14713 -97610 -93505 -57304 -107566 -115380 -90744 -39995 27167 90486 54230
15283E4230p2247l272j8139Q8827O7n853R6577o1202j45435q6188M8548Q5873
$$ 54230 -18017 -21289 -39428 49399 49466 43613 140190 78988 -66447 -152635 -104087 -18214
15271a8214j7792N846k1937R392J35127m1632j09422k7048j8418m6962R344J38481
$$ -18214 -36006 -30160 -52097 -42705 92422 50790 -58632 -85680 -104098 -151060 -141716 -3235
15259c235Q118M4060P4555l3743q3902p1787n3224R4681P9715k2249n4508m1612
$$ -3235 4883 48943 123498 89755 5853 -65934 -119158 -24477 55238 32989 -21519 -63131
15247f3131P50M9889r358m0665Q8774k5452o6726m1355l516O7967M1359N796L9334
$$ -63131 -62381 -12492 -21850 -62515 26259 807 -65919 -107274 -110790 -42823 -1464 4332 43666
15234D3666J7144l7834j94035N3535J64889M3694m0035Q499J0907m4644l5630
$$ 43666 60810 22976 -171059 -117524 47365 91059 51024 59523 70430 25786 -9844
15223i844Q0347K818l2054o3836k094k4338o4212r5955K6498M3641k7724N658
$$ -9844 70503 73321 41267 -22569 -24663 -49001 -113213 -209168 -182670 -139029 -166753 -161095
15211a61095p3700k6810J36844J7145k1389N9017J4794L4203R5599L2033N7121
$$ -161095 -234795 -261605 -124761 -107616 -129005 -69988 -55194 -20991 74608 106641 163762
15200A63762o0807l8658p612k5535J1051q6980n0574M6709M2002o0141k3948j3665
$$ 163762 102955 64297 56685 31150 42201 -44779 -95353 -48644 -6642 -66783 -90731 -104396
15188a04396P2153P9553p086m9291l4592m9966N4480M7097j119k7851N998M4831
$$ -104396 -32243 47310 40224 -9067 -43659 -93625 -39145 7952 6833 -21018 -15020 29811
15176B9811j6803o1977k8570P6572N3553m033j04847q5908R1396Q0462k925K3130
$$ 29811 13008 -48969 -77539 -967 52586 48553 -56294 -142202 -50806 29656 26731 49861
15164D9861k7156j9114r0533K9167o4262o0575M9905O0536K799m3579j1939J9865
$$ 49861 22705 3591 -86942 -57775 -122037 -182612 -132707 -72171 -69372 -112951 -124890 -105025
15152a05025R8130l4179L5419L1554M1456M9157j5478O7068l809n68j14291q8105
$$ -105025 -6895 -41074 -5655 25899 67355 116512 101034 168102 164293 163725 49434 -38671
15140c8671L2245j9357j7463L3634N75k9502j00079K2527M9672o462J4877O1498
$$ -38671 -6426 -25783 -43246 -9612 -9037 -38539 -138618 -116091 -66419 -72881 -58004 3494
15128C494J26808o5331o4830k6404p9912M9691k3705J7082P6219m781K0191o195
$$ 3494 130302 64971 141 -26263 -106175 -56484 -80189 -63107 13112 8331 28522 22327
15116B2327j0750n0554l3346q223j53738n8593J65524J72022m3963q7350J2416
$$ 22327 11577 -38977 -72323 -80546 -234284 -292877 -127353 44669 706 -86644 -74228
15105g4228M8360O1530R221l1229j11927n591p7583j3868O2879O4838M3508J10970
$$ -74228 -25868 35662 44883 13654 -98273 -103864 -181447 -195315 -132436 -67598 -24090 86880
15093H6880M5556k4709k0936j07337q3832l4185k0605l5512k4221J52748P5467
$$ 86880 132436 107727 86791 -20546 -104378 -138563 -159168 -194680 -218901 -66153 9314
15082I314q7137M413n371r716O524K8864j83536K2134J52066N7392N1314j18650
$$ 9314 -77823 -73410 -78781 -88497 -81973 -53109 -236645 -214511 -62445 -5053 46261 -72389
15070g2389j7965N8639O3701L4908l1183p4826L7586J33215O9946m5255n9088
$$ -72389 -90354 -31715 31986 66894 35711 -39115 -1529 131686 201632 156377 97289
15059I7289J2304m9609m1918O2460L3507o8472O272J02352r526m6744p8711Q3
$$ 97289 109593 59984 18066 80526 114033 45561 51833 154185 144659 97915 19204 19287
15047A9287l8343p4851J5759J01531o1746m2418L9579J345N8814J2541l0065j7450
$$ 19287 -19056 -93907 -78148 23383 -38363 -80781 -41202 -39857 18957 31498 1433 -16017
15035a6017Q4279o5826K1047L8451K6749j6423q6163r5684M4854J8714N6910k4556
$$ -16017 68262 2436 23483 61934 88683 72260 -13903 -109587 -64733 -46019 10891 -13665
15023a3665m4641Q0502N9588l396m5726k8673O5211o665j21535n5813P5913P6178
$$ -13665 -58306 22196 81784 78388 32662 3989 69200 62535 -59000 -114813 -38900 37278
15011C7278O8059l2387N9705j393j28869O197K130r8076k6315P3462J02992P2882
$$ 37278 105337 72950 132655 131262 2393 8590 10720 -87356 -113671 -40209 62783 135665
14999A35665o4426m1655K3812k0262k3364R6183L7091j37284l9775N3589m6903
$$ 135665 71239 29584 53396 33134 9770 105953 143044 5760 -34015 19574 -27329
14988b7329m8058P2561J39571P5707r7236o6388M1126n4257N2401R2569j09726
$$ -27329 -75387 -2826 136745 212452 115216 48828 89954 35697 88098 180667 70941
14977G0941n1352J2925m3336n0629p923m5135n2562n6462m3990R1349K2261M0575
$$ 70941 19589 32514 -10822 -61451 -69374 -114509 -167071 -223533 -267523 -176174 -153913 -113338
14965a13338O1816m396O6324K5279J2248p9395m1709r1510J296l0475J9775P1120
$$ -113338 -51522 -55918 10406 35685 47933 -31462 -73171 -164681 -163385 -193860 -174085 -102965
14953a02965j4027J7598O8428M1896K2941o1145o8781J1452P7877K9010j06778
$$ -102965 -116992 -99394 -30966 10930 33871 -27274 -96055 -84603 -6726 22284 -84494
14942h4494j16019P5593K2167L025N2396j8541L8250Q0133K7566m606J2371J32831
$$ -84494 -200513 -124920 -102753 -99728 -47332 -65873 -27623 52510 80076 75470 87841 220672
14930B20672N4057o0342n5159j25872j16694m8432l726J0639O5252N9674O4326
$$ 220672 274729 214387 159228 33356 -83338 -131770 -135496 -124857 -59605 69 64395
14919F4395P4163r626j56588j5413q767k5101n5367j04455J12832Q4768O6735
$$ 64395 138558 128932 -27656 -43069 -51836 -76937 -132304 -236759 -123927 -39159 27576
14908B7576N1736l5294o6477j1958m5591O3963M8633L2062l1631q4806m7955m4247
$$ 27576 79312 44018 -22459 -34417 -80008 -16045 32588 64650 33019 -51787 -99742 -143989
14896a43989R5474R1943J02886Q8721n6174q8944p7764j75428j7763N2884P0218
$$ -143989 -48515 43428 146314 235035 178861 89917 12153 -163275 -181038 -128154 -57936
14885e7936J1576J05988L8832m1401l4723j04448P6411n3936k9731k900J28054
$$ -57936 -46360 59628 98460 57059 22336 -82112 -5701 -59637 -89368 -92268 35786
14874C5786J03895j63708j65813o945P2175P6916N147o8745n7012O5907O4848
$$ 35786 139681 -24027 -189840 -196785 -124610 -47694 -42547 -111292 -168304 -102397 -37549
14863c7549P9960J8924l3186R833M7772n5298l1780j8553k797o6736J0521j4378
$$ -37549 42411 61335 28149 37982 85754 30456 -1324 -19877 -22674 -89410 -78889 -93267
14851i3267L9447j16150J6126J04179L3020R17J18525L5812p1939l2707q5268
$$ -93267 -53820 -169970 -153844 -49665 -16645 -15728 102797 138609 66670 33963 -51305
14840e1305J7594k55K4653O7314m1302n2660L813Q0331J16789k3889n0535r7511
$$ -51305 -33711 -33966 -9313 58001 16699 -35961 -32148 48183 164972 141083 90548 -6963
14828f963j08900j12545L804L8906R6012J32639N9850j29799j27798N4194J288
$$ -6963 -115863 -228408 -224604 -185698 -89686 42953 102803 -26996 -154794 -100600 -99312
14817i9312O0928P1349k0465p8506r002j2930p975K9831j0381Q571L5691n1699
$$ -99312 -38384 32965 12500 -66006 -75008 -87938 -95913 -66082 -76463 -67892 -32201 -83900
14805h3900P3057R8080j6940l7064J5770r3167n6540M2823M7721L7039j3705Q0538
$$ -83900 -10843 87237 70297 33233 49003 -44164 -100704 -57881 -10160 26879 13174 93712
14793I3712p533q855l3834p9088m6699N2035O2021j94o2756j4978J8540K134k1096
$$ 93712 86179 77324 43490 -35598 -82297 -30262 31759 31565 -31191 -46169 -27629 -25495 -46591
14780d6591M8539j7792l7802J3038O5582M4409J1663J1185r7838j6811J29644
$$ -46591 1948 -15844 -53646 -40608 24974 69383 81046 92231 -5607 -22418 107226
14769A07226n4491r6583M1761j6319K4562q759k0154K702P6741K1109n7755L7632
$$ 107226 52735 -43848 -2087 -18406 6156 -2603 -22757 -20055 56686 77795 20040 57672
14757E7672k2304j21413L1150O5277K5611N3692M4012j20219n8065n9335j1845
$$ 57672 35368 -86045 -54895 10382 35993 89685 133697 13478 -44587 -103922 -115767
14746a15767M9885M1099n2979R3590l9924J4803k4195L9122J7617J25364L0228
$$ -115767 -65882 -24783 -77762 15828 -24096 -9293 -33488 5634 23251 148615 178843
14735A78843p6620n1731m9700l9236J2632l9415k1996N7894Q3818j6520k9859
$$ 178843 102223 50492 792 -38444 -25812 -65227 -87223 -29329 54489 37969 8110
14724H110m9875J18059J12704j465m7889p2810m2851J298M3922j00790q847P8435
$$ 8110 -41765 76294 188998 187533 139644 66834 23983 25281 69203 -31587 -40434 38001
14712C8001j1141m036L648J1483N7362n6081k0791J9650J52Q704o0516l2931Q0572
$$ 38001 26860 22824 26472 37955 95317 39236 18445 38095 38247 46951 -13565 -46496 34076
14699C4076J0316n7307j06017K8794J46222j0928J3344m7874j17995n0992n872
$$ 34076 44392 -12915 -118932 -90138 56084 45156 58500 10626 -107369 -158361 -164233
14688a64233J40900l3357M8133k5038j15490k9748q7535R9479J16071K4261o3441
$$ -164233 -23333 -56690 -8557 -33595 -149085 -178833 -266368 -166889 -50818 -26557 -89998
14677h9998j8389P8139p221o2826n3918J9049l6822L3779J14269k9650L4523J1795
$$ -89998 -108387 -30248 -37469 -100295 -154213 -135164 -171986 -138207 -23938 -53588 -19065 -7270
14665g270r8173N3735l1492q854j2887N6326k0591j1668m6629J04472L9453m2923
$$ -7270 -105443 -51708 -83200 -92054 -104941 -48615 -69206 -80874 -127503 -23031 16422 -26501
14653b6501n5437M0218P5700k9890l5644m0056o3136n925L565q265r6918Q495
$$ -26501 -81938 -41720 33980 4090 -31554 -71610 -134746 -140671 -137106 -145371 -242289 -233794
14641b33794J12944L584j3695q4047m0727p565O1151N1150l106n9271K2874m8633
$$ -233794 -120850 -117266 -130961 -215008 -255735 -263300 -202149 -150999 -154105 -213376 -190502 -239135
14629b39135J07759P2382j20245n7770O5372O4533L0180O8231N4761l2245q7561
$$ -239135 -131376 -58994 -179239 -237009 -171637 -107104 -76924 -8693 46068 13823 -73738
14618g3738O1222k6487J4251O3788J14750L8250m7791j5688j58663q207p622M4312
$$ -73738 -12516 -39003 -24752 39036 153786 192036 144245 128557 -30106 -38313 -45935 -1623
14606a623L566q1493q1898J7979Q091P0347L6157Q1723J4194n4618k6648J15880
$$ -1623 1943 -79550 -161448 -143469 -135378 -65031 -28874 52849 67043 12425 -14223 101657
14594A01657K5863l2206r5725o1018m7273J5226K4576j4942J15906Q0210n3748
$$ 101657 127520 95314 -411 -61429 -108702 -93476 -68900 -83842 32064 112274 58526
14583E8526j33022j6438L4422o4486n7100P5121J76099j4344j9497R9857J7749
$$ 58526 -74496 -90934 -56512 -120998 -178098 -102977 73122 58778 39281 139138 156887
14572A56887k2341R065j6705j5068m5227l9912K819K347L3339K8167K0044m7222
$$ 156887 134546 143611 126906 111838 66611 26699 29518 31865 65204 93371 113415 66193
14560F6193L252r32L6287O0789m2826Q027m2752o1272o7245l4754k6173Q688N8788
$$ 66193 69445 68513 104800 165589 122763 130790 88038 26766 -40479 -75233 -101406 -92718 -33930
14547c3930k9031n932K4961j3118L0161K2190n2501O7270Q0761n5277n8495j4894
$$ -33930 -62961 -68893 -43932 -57050 -26889 -4699 -57200 10070 90831 35554 -22941 -37835
14535c7835l176O7882O7315K1732j08438l2689N1481N1826o4212j34308k4830
$$ -37835 -41011 26871 94186 115918 7480 -25209 26272 78098 13886 -120422 -145252
14524a45252J8829R9470j514P2532l1626p2144l1653L2935K4651m7428j0449J42163
$$ -145252 -126423 -26953 -28467 44065 12439 -59705 -91358 -58423 -33772 -81200 -91649 50514
14512E0514O9273k2978p0379m6253j0726M6739P0847J2055o211o1989n1518m4614
$$ 50514 119787 96809 26430 -19823 -30549 16190 87037 99092 92881 30892 -20626 -65240
14500f5240K2728R2816L7574P0854j17940q3423L0713P7312j8796l6486N7004
$$ -65240 -42512 50304 87878 158732 40792 -42631 -11918 65394 46598 10112 67116
14489F7116M1371q1793q150r0341J6123p1332m3507J40543J32903O3540k1932
$$ 67116 108487 26694 18544 -71797 -55674 -127006 -170513 -29970 102933 166473 144541
14478A44541o0328K7401N466n0376n5147p4579O6698J15438J2492J1917r2477
$$ 144541 84213 111614 117080 66704 11557 -63022 3676 119114 131606 143523 51046
14467E1046j31001O491J37550m6771P4078O113j14095j14217Q0191K5809J35183
$$ 51046 -79955 -73464 64086 17315 91393 97506 -16589 -130806 -50615 -24806 110377
14456A10377l4692j59588o3498J57879J11633Q9124n7892j18145l1556q523n5933
$$ 110377 75685 -83903 -147401 10478 122111 211235 153343 35198 3642 -4881 -60814
14445f0814l8890M5314N4810N841L6580N2588k352j48301m5027J04772K5021J02849
$$ -60814 -99704 -54390 420 6261 42841 95429 93077 -55224 -100251 4521 29542 132391
14433A32391R0284k8164j05482k8130J9479k8713o1927k4404P392j14518k7530
$$ 132391 222675 194511 89029 60899 80378 51665 -10262 -34666 -27274 -141792 -169322
14422a69322L1425K1566O553j9153Q8807O7954j6590m619j1753j44847r9945L0951
$$ -169322 -137897 -116331 -109778 -128931 -40124 27830 11240 6621 -5132 -149979 -249924 -218973
14410b18973J22476R7236L3507M615q9079O1856m8419M8685l8755j52848j948
$$ -218973 -96497 739 34246 38861 -50218 11638 -36781 11904 -26851 -179699 -181647
14399a81647J17098Q4407N3345K7680j11743j04156L1795o5037j2581J42056m7325
$$ -181647 -64549 19858 73203 100883 -10860 -115016 -83221 -148258 -160839 -18783 -66108
14388f6108r2659l902R0906Q510j1368N0214n9075p0928n6040q7009O3229O0732
$$ -66108 -158767 -162669 -71763 -63253 -74621 -24407 -83482 -154410 -210450 -297459 -234230 -173498
14376a73498l3209K00321N4097K5972j3838N6688l132K0654K9255J1326o1079
$$ -173498 -206707 -6386 47711 73683 59845 116533 113401 134055 163310 174636 113557
14365A13557j7697p2026n7252m0070n652K5495m7395K6462J07254r4401q5590
$$ 113557 95860 23834 -33418 -73488 -79140 -53645 -101040 -74578 32676 -61725 -147315
14354a47315N7030J90172J13055m4980q4382P0362N3913o3938l9677J4103m9916
$$ -147315 -90285 99887 212942 167962 83580 153942 207855 143917 104240 118343 68427
14343F8427j46690K5977J22741R9773K5238n8894n3080o6967o8677n8914M0962
$$ 68427 -78263 -52286 70455 170228 195466 136572 83492 16525 -52152 -111066 -70104
14332g0104J34655J10978k6550k4145P8628p1756j543M6119L200m1574N7038J0301
$$ -70104 64551 175529 148979 124834 203462 131706 130163 176282 179482 137908 194946 205247
14320B05247n5392k0120P0157K3665N6150n994q0454L137J6312p2442j00835k9577
$$ 205247 149855 129735 199892 223557 279707 273713 193259 196396 212708 140266 39431 9854
14308I854J621j9946j2137K3476K790J0046o0039Q5013n6803n6267l5902j1503
$$ 9854 11475 -8471 -20608 2868 5658 15704 -44335 40678 -16125 -72392 -108294 -119797
14296a19797N9367L0133j1029J4331L577j33296l4510N2063J8542J02371M3813
$$ -119797 -60430 -30297 -41326 -26995 -23418 -156714 -191224 -139161 -120619 -18248 25565
14285B5565k1625O4663K761M4621p5520r4698j31985J4047P9617O3199J78418
$$ 25565 3940 68603 71364 115985 40465 -54233 -186218 -172171 -92554 -29355 149063
14274A49063k1142j00759l9148k9054J540J01254O4772K826J637j12704j09776
$$ 149063 127921 27162 -11986 -41040 -39500 61754 126526 129352 130989 18285 -91491
14263i1491K4417L916P2428n616m5333J31588M5121l6235m6310k8839L1685O5649
$$ -91491 -67074 -63158 9270 3654 -41679 89909 135030 98795 52485 23646 55331 120980
14251A20980j05373p8279L4240n8481r2234J0880Q5056K3615M712k2359M4710
$$ 120980 15607 -62672 -28432 -86913 -179147 -168267 -83211 -59596 -54884 -77243 -32533
14240c2533J3780J1732j06497N1385J35493j003L3641N0624k4612p697P832j9376
$$ -32533 -18753 -7021 -113518 -62133 73360 72357 105998 156622 132010 124313 132145 112769
14228A12769k9541n4475n7062N8655Q5889k9545K6553L3046k569n5690o5790J9439
$$ 112769 83228 28753 -28309 30346 116235 86690 113243 146289 143720 88030 22240 41679
14216D1679k2285n9335l7685O2867P7468J09276M5671j04829j13822l2673j29701
$$ 41679 19394 -39941 -77626 -14759 62709 171985 217656 112827 -995 -33668 -163369
14205a63369J7593N7288N3278R2870K8505l1929n2241q8914o3414O4125J9427
$$ -163369 -145776 -88488 -35210 57660 86165 54236 1995 -86919 -150333 -86208 -66781
14194f6781O3094P79n2929j15774J1785L2307k3637L7406O7137O165q3438n6272
$$ -66781 -3687 -2908 -55837 -171611 -159826 -127519 -151156 -113750 -46613 -40448 -123886 -180158
14182a80158J1555O5884J9538k345l344M8371J24368P9633j5359n9047q9680o407
$$ -180158 -168603 -102719 -83181 -85526 -88870 -40499 83869 163502 148143 89096 -584 -6991
14170f991J6939N9028m5683o604m2411k7717K432L7928j8095j399K4368M013K3976
$$ -6991 9948 68976 23293 16689 -25722 -53439 -51007 -13079 -31174 -32573 -8205 -4192 19784
14157A9784j2393m6320k399L0433j4371j0885N6677O579n9158N1761J00387k2494
$$ 19784 7391 -38929 -41328 -10895 -25266 -36151 20526 27105 -32053 19708 120095 97601
14145I7601l6124M1571n7693q0317K9348q6004o6716P3143Q3586j3083k3562J5882
$$ 97601 61477 103048 45355 -34962 -5614 -91618 -158334 -85191 -1605 -14688 -38250 -22368
14133b2368J1378L4573p5332m9193R1548J03750r227n4996K4752N3156l3115m4743
$$ -22368 -10990 23583 -51749 -100942 -9394 94356 85129 30133 54885 108041 74926 30183
14121C0183n8321p0166l8605p4693M5220O1422R3926O1707K9333p4666q1589j9088
$$ 30183 -28138 -98304 -136909 -211602 -166382 -104960 -11034 50673 80006 5340 -76249 -95337
14109i5337p114J9653n3134K8879P0477N4639o1133j2164J951K9305l3251J6545
$$ -95337 -102451 -82798 -135932 -107053 -36576 18063 -43070 -55234 -53283 -23978 -57229 -40684
14097d0684Q2793M2992l9203P0803j5417o3402j3957J2620p3089j2870o3149N5894
$$ -40684 42109 85101 45898 116701 101284 37882 23925 36545 -36544 -49414 -112563 -56669
14085e6669m5759L5564M7323j085m3793m065O0137Q3961N7314o9075n7549M2483
$$ -56669 -102428 -66864 -19541 -20626 -64419 -68484 -8347 75614 132928 63853 6304 48787
14073D8787R2525K3217m0745K0019j6797j5334k3920J04780O4863p1312j58274
$$ 48787 141312 164529 123784 143803 127006 111672 87752 192532 257395 186083 27809
14062B7809j18851k236K083J9024J09298N4700K7332k0195N4114j27946o7292
$$ 27809 -91042 -93278 -91195 -72171 37127 91827 119159 98964 153078 25132 -42160
14051d2160M143j3740k2096K0561l7509K9238J13141j00868m750L3945k1646J7721
$$ -42160 -38017 -51757 -73853 -53292 -90801 -61563 51578 -49290 -54040 -20095 -41741 -24020
14039b4020k8065o6447K0694l2403k3927O7243J38205K9096k0300j37518j17154
$$ -24020 -52085 -118532 -97838 -130241 -154168 -86925 51280 80376 60076 -77442 -194596
14028a94596N8096M4869k6584j0698K8049j8247P0979N4350L188L7106j14262
$$ -194596 -136500 -91631 -118215 -128913 -100864 -119111 -48132 6218 9406 46512 -67750
14017f7750r9900k8138M2093P7332O5361J5338m8631P3656L997l0322N7631r3822
$$ -67750 -167650 -195788 -153695 -76363 -11002 4336 -44295 29361 33358 3036 60667 -33155
14005c3155q0777N5401O3580n0203r8382Q8790M171O197j20607J5446Q4266R9200
$$ -33155 -113932 -58531 5049 -45154 -143536 -54746 -50575 -44378 -164985 -149539 -65273 33927
13993C3927K0164m5388p1668K579l3692j1696L8398j3186K139n6384q0090N2241
$$ 33927 54091 8703 -62965 -60386 -94078 -105774 -67376 -80562 -78423 -134807 -214897 -162656
13981a62656J39553M7415o3199P0486J11855J8756R73j31664p7717J20743M7519
$$ -162656 -23103 24312 -38887 31599 143454 162210 163183 31519 -46198 74545 122064
13970A22064N9382l4284l727k1896j08550k7082K0N5893K1588K5799n1831o3925
$$ 122064 181446 147162 143435 121539 12989 -14093 -14073 41820 63408 89207 37376 -26549
13958b6549n9421M4969J11260N850j07607M6579N6804m3512P0405J450q4826n432
$$ -26549 -85970 -41001 70259 76109 -31498 15081 71885 28373 98778 100228 15402 9970
13946I970K8465j10430L3130k0698k7339J36980O9129k3125q0554r9075L3276
$$ 9970 38435 -71995 -38865 -59563 -86902 50078 119207 96082 15528 -83547 -50271
13935e0271K9201k7723n8451M6705n7464j00706j3801N6159J23601J69058l9325
$$ -50271 -21070 -48793 -107244 -60539 -118003 -218709 -232510 -176351 -52750 116308 76983
13924G6983j1102Q1669p1495q2957K763P047M8100L3239M5058Q5327r5770n0095
$$ 76983 65881 147550 76055 -6902 -4139 2908 51008 84247 129305 214632 118862 68767
13912F8767m4194p3201K5486J8047k4128o3062M9607P4956N0704J7978r8217m1555
$$ 68767 24573 -48628 -23142 -5095 -29223 -92285 -42678 32278 82982 100960 2743 -38812
13900c8812j885j376M9304m8305n0738N8422R5993L0639n8159q3955Q612q6498
$$ -38812 -40697 -42073 7231 -41074 -91812 -33390 62603 93242 35083 -48872 -40260 -126758
13888a26758o4568M705M3123j0303L8872m7727L5686o778J46444Q4188m7850k0587
$$ -126758 -191326 -186621 -143498 -153801 -114929 -162656 -126970 -133748 12696 96884 49034 28447
13876B8447O5898K3488j52153j11268J778M8032N9395M7345P0500P0062j3335
$$ 28447 94345 117833 -34320 -145588 -143810 -95778 -36383 10962 81462 151524 138189
13865A38189r2229j85720m8837M9100P1058n077M9120R7177j16747p8870j49852
$$ 138189 45960 -139760 -188597 -139497 -68439 -73516 -24396 72781 -43966 -122836 -272688
13854b72688k7710J86280J41313Q184m6656P760q3479P4450M5571n7549P2789
$$ -272688 -300398 -114118 27195 35379 -11277 -3517 -86996 -12546 33025 -24524 48265
13843D8265k3292p7563k0654k3233K002k2040L913J4856l4928J4100M0193J7013
$$ 48265 24973 -52590 -73244 -96477 -94475 -116515 -112602 -97746 -132674 -118574 -78381 -61368
13831f1368j3828p5880L9039P3968j9566Q8432k6018J7870N9964j2833n9000J9861
$$ -61368 -75196 -151076 -112037 -38069 -57635 30797 4779 22649 82613 69780 10780 30641
13819C0641j0464m8150m2376R699j4209J4595k3642L5185Q9135m0212n4137L968
$$ 30641 20177 -27973 -70349 -60650 -74859 -60264 -83906 -48721 40414 202 -53935 -49967
13807d9967R473n4854O6537o920k9416O949M9664j6222j50439J14556J33940M7126
$$ -49967 -40494 -95348 -28811 -35731 -65147 -58198 -8534 -24756 -175195 -60639 73301 120427
13795A20427k5598r9350N4524j1999j07836n3053r9967J25683J38339n8950m1273
$$ 120427 94829 -4521 50003 38004 -69832 -122885 -222852 -97169 41170 -17780 -59053
13784e9053l8527R9509K5571J05714P923j28188L1399M5443K5308j9644m6145
$$ -59053 -97580 1929 27500 133214 141137 12949 44348 89791 115099 95455 49310
13773D9310M5639M1975m8049j00497j28123k3405O2502O8358L4822J43445L3941
$$ 49310 94949 136924 88875 -11622 -139745 -163150 -100648 -32290 2532 145977 179918
13762A79918o5737j26966k7087j5056P4403M128o2954M3139P0256k8809j02984
$$ 179918 114181 -12785 -39872 -54928 19475 23603 -39351 3788 74044 45235 -57749
13751e7749k6357j28736q817J47093R2316J4050J6706k7524O996m7197k3708P919
$$ -57749 -84106 -212842 -221659 -74566 17750 31800 48506 20982 27978 -19219 -42927 -35008
13739c5008N2303r1708k0894L6733k0528K9337J1853N7466L3018l2632j6620J0787
$$ -35008 17295 -74413 -95307 -58574 -79102 -49765 -37912 19554 52572 19940 3320 14107
13727A4107L6337N5728k603j07626m8052P3926M6204l5062L5802o1293J4270k0179
$$ 14107 50444 106172 103569 -4057 -52109 21817 68021 32959 68761 7468 21738 1559
13715A559M9l1290J9034r7003Q338L9367l186Q1409K2724q8210n7525M3300l4247
$$ 1559 1608 -29682 -10648 -107651 -99313 -59946 -63132 18277 41001 -47209 -104734 -61434 -95681
13702i5681P0238L0349n8172m4767J3975J04785Q6318m2041l9857M0205L5781
$$ -95681 -25443 4906 -53266 -98033 -84058 20727 107045 65004 25147 65352 101133
13691A01133l3506n9563q7617j1498k816N153K4852R0534J04740N9539j11230
$$ 101133 67627 8064 -79553 -91051 -93867 -88714 -63862 26672 131412 190951 79721
13680G9721m4685M4200j917K3228j3572j19303O1701O4776L9533n2475J4941K1799
$$ 79721 35036 79236 77319 100547 86975 -32328 29373 94149 133682 81207 96148 117947
13668A17947k0483j11839n4189J3128J1474k1183L1044P869p9413j2275Q265r888
$$ 117947 97464 -14375 -68564 -55436 -43962 -65145 -34101 -26232 -105645 -117920 -109655 -119543
13656a19543k1071m6889Q7964R8331j8488j0750N0866k7556n6729j5398K2490
$$ -119543 -140614 -187503 -99539 -1208 -19696 -30446 20420 -7136 -63865 -79263 -56773
13645e6773o6331P470k3678L6427O6948N477j8214n6243q1504O1105R2499J3918
$$ -56773 -123104 -115634 -139312 -102885 -35937 -30460 -48674 -104917 -186421 -125316 -32817 -18899
13633a8899j2507k1583K4371k6822m7660m2234j1673L8413O8324Q8378N8023o8571
$$ -18899 -31406 -52989 -28618 -55440 -103100 -145334 -157007 -118594 -50270 38108 96131 27560
13621B7560j32922m0280K566O6094J8097k5319J04586N8191L7846q5939J8458
$$ 27560 -105362 -145642 -143076 -76982 -58885 -84204 20382 78573 116419 30480 48938
13610D8938j0668M8463o9204o8382p1524m8458O8515P3856M7666L0988P873J6613
$$ 48938 38270 86733 17529 -50853 -122377 -170835 -102320 -28464 19202 50190 58063 74676
13598G4676j1243m5482m9553R036O322m9580P4642K3449M3743k2077J1610M6525
$$ 74676 63433 17951 -31602 -22566 -16244 -65824 8818 32267 76010 53933 65543 112068
13586A12068n0925j16639n1571J593O2465O7780J1678r011M1843O651q2055l2046
$$ 112068 61143 -55496 -107067 -105474 -43009 24771 36449 27438 69281 75932 -6123 -38169
13574c8169O9836R6183K1911q6140R452k5249q384N9122N7445k3138M809j06637
$$ -38169 31667 127850 149761 63621 73073 47824 39440 98562 156007 132869 137678 31041
13562C1041P6908J4217r0497n3790o0615p4012J19823L0491m1742k2398O5173
$$ 31041 107949 122166 31669 -22121 -82736 -156748 -36925 -6434 -48176 -70574 -5401
13551e401P5506m194q612j8288L1316l1980j5115k2324L7668J8076J0252j46991
$$ -5401 70105 65911 57299 39011 70327 38347 23232 908 38576 56652 66904 -80087
13539h0087p0319J6336O757l6898k1115P1212J05557J5938l3842N2148q198j5103
$$ -80087 -150406 -134070 -127313 -164211 -185326 -114114 -8557 7381 -26461 25687 17489 2386
13527B386l4894K2333n0331j4522J2152O6890J26817j8227L7929J67240Q995j14697
$$ 2386 -32508 -10175 -60506 -75028 -62876 4014 130831 112604 150533 317773 326768 212071
13515B12071j3770o9445j07197j75911r2453L5588N6080J7547O1045j0525L3001
$$ 212071 198301 128856 21659 -154252 -246705 -211117 -155037 -137490 -76445 -86970 -53969
13504e3969M3122N2724K9811p8611N754R8008q5880o2776l3069j5355O3814K5405
$$ -53969 -10847 41877 71688 -6923 -1169 96839 10959 -51817 -84886 -100241 -36427 -11022
13492a1022r9343P512j48001J0206M1582Q4521r3931p1804O8087J14004J7014
$$ -11022 -110365 -102853 -250854 -240648 -199066 -114545 -208476 -280280 -212193 -98189 -81175
13481h1175L0379p7072n5333L7078N9224N588R5491j6531N7992K041p8898R7988
$$ -81175 -50796 -127868 -183201 -146123 -86899 -81311 14180 -2351 55641 57682 -21216 76772
13469G6772O2404j61799j39497M8011Q1425Q6764O1606P176l3295n2781l0497
$$ 76772 139176 -22623 -162120 -114109 -32684 54080 115686 122862 89567 36786 6289
13458F289Q865k5308r9738J398J84746M8609o1451j44300m4417L5064o9940M2810
$$ 6289 15154 -10154 -109892 -108494 76252 124861 63410 -80890 -125307 -90243 -160183 -117373
13446a17373N2301Q1785O9795k7861L2667o7182r3847m1844M4852N6443K8464
$$ -117373 -65072 16713 86508 58647 91314 24132 -69715 -111559 -66707 -10264 18200
13435A8200l6335j95729j2248L5015O8196Q9699n4297J3713j2996n062R5113R8156
$$ 18200 -18135 -213864 -226112 -191097 -122901 -33202 -87499 -73786 -86782 -91844 3269 101425
13423A01425R480q8263p9954j4148M6390M3890j6275M1713J3865J18j49236k7708
$$ 101425 110905 22642 -57312 -71460 -25070 18820 2545 44258 58123 58241 -90995 -118703
13411a18703k9614K927O5846k0517j3078J60089J37477j3293m6736K1932n8772
$$ -118703 -148317 -145390 -79544 -100061 -113139 46950 184427 171134 124398 146330 87558
13400H7558k65q3747J1693k556q8382k1620R2139J8263O3037R842p9625q1278
$$ 87558 87293 3546 15239 12683 -75699 -97319 -5180 13083 76120 85962 6337 -74941
13388g4941O6004m8875l1880Q3908P5257K4169J2107K0632R8112m5323j17552
$$ -74941 -8937 -57812 -89692 -5784 69473 93642 105749 126381 224493 179170 61618
13377F1618n8130m2633k953m1651K6363m7003J1245L7739l8188j01855P8670J48745
$$ 61618 3488 -39145 -42098 -83749 -57386 -104389 -93144 -55405 -93593 -195448 -116778 31967
13365C1967K1135M7909j21300K6108j0850J24972O1843n3514J028j01150r6433
$$ 31967 53102 101011 -20289 5819 -5031 119941 181784 128270 129298 28148 -68285
13354f8285L7105k3720Q5933K3777j09446O4232J90914M62p7303m9941Q6198o5486
$$ -68285 -31180 -54900 31033 54810 -54636 9596 200510 200972 123669 73728 159926 94440
13342I4440l7257l2662o3499K510M2265L4676K6611l1279R180J0092o0073q4268
$$ 94440 57183 24521 -38978 -36468 5797 40473 67084 35805 44985 55077 -4996 -89264
13330h9264L6249Q5612M655R56j9742n0813K3996J8048J4658Q6245K3588m2833
$$ -89264 -53015 32597 37252 38208 18466 -32347 -8351 9697 24355 110600 134188 91355
13318I1355K9262M9336m4019Q4319r955m5469j0906n7740l0326M3453p354m7066
$$ 91355 120617 169953 125934 210253 200298 154829 143923 86183 55857 99310 91956 44890
13306D4890j25981l3442N6357M1839j06733M560n7729P3824P7008J12557L3666
$$ 44890 -81091 -114533 -58176 -16337 -123070 -118510 -176239 -102415 -25407 87150 120816
13295A20816j11807m3534K931R0631L7717O8747M5522Q5j12936q2994l1625q5958
$$ 120816 9009 -34525 -31594 59037 96754 165501 211023 211108 98172 15178 -16447 -102405
13283a02405J8568N7587J50309j05455l9706O650J55131n6714j04633M4186p5114
$$ -102405 -83837 -26250 124059 18604 -21102 -14452 140679 83965 -20668 23518 -51596
13272e1596r53J3464P0195K077l6600k8100j9532Q8551k1659n7837K2755K1139
$$ -51596 -52549 -39085 31110 33187 -3413 -31513 -51045 37506 15847 -41990 -19235 1904
13260A904N0877L8628o3791j3962J15651Q5823M7415j15488j64502n1319k7334
$$ 1904 52781 91409 27618 13656 129307 215130 262545 147057 -17445 -68764 -96098
13249i6098n4029n9389l985L4004P4243p0776Q3326Q5846Q0139J5434k3351n2515
$$ -96098 -150127 -209516 -213501 -179497 -105254 -176030 -92704 -6858 73281 88715 65364 12849
13237A2849q6174J24200r929L4631L7932k4796r3707j89837Q0262J49873n4819
$$ 12849 -73325 50875 40946 75577 113509 88713 -4994 -194831 -114569 35304 -19515
13226a9515j6390l7881k4703M0921r6905K989m738N269k0263R0129Q8811m1223
$$ -19515 -35905 -73786 -98489 -57568 -154473 -151484 -156222 -150953 -171216 -81087 7724 -33499
13214c3499L2238n4858o1372J3221J7524R7409O7322K7076n7182p4771m2959R028
$$ -33499 -1261 -56119 -117491 -104270 -86746 10663 77985 105061 47879 -26892 -69851 -60823
13202f0823l7127q4647J25568l9332O2799m0351q5427M7820Q2174R852k8260p092
$$ -60823 -97950 -182597 -57029 -96361 -33562 -73913 -159340 -111520 -29346 -19494 -47754 -54846
13190e4846k59M5533J08902R5653m6390n9060l2565r2320J09544M4146j1546j0763
$$ -54846 -55105 -9572 99330 194983 148593 89533 56968 -35352 74192 118338 106792 96029
13178I6029j00393j82349J0635J30811J46818J5364n8608o2914N9394N7059L7900
$$ 96029 -4364 -186713 -176078 -45267 101551 116915 58307 -4607 54787 111846 149746
13167A49746r4070m1073J20582O6175q6709p1712Q872j941N5740n127o1579o8853
$$ 149746 55676 14603 135185 201360 114651 42939 51811 49870 105610 100483 38904 -29949
13155b9949k817j4840J7408J29278j45972p1304J04531M4062p2206k4495L4853
$$ -29949 -32766 -47606 -30198 99080 -46892 -118196 -13665 30397 -41809 -66304 -31451
13144c1451M7791M1066j4714j40235l3879J27965J73394J70703o5485j23775l1865
$$ -31451 16340 57406 42692 -97543 -131422 -3457 169937 340640 275155 151380 119515
13133A19515o692N7266K4375n6967q3512q5190N0992M3505j28227j26620Q1010
$$ 119515 112823 170089 194464 137497 53985 -31205 19787 63292 -64935 -191555 -110545
13122a10545J65689N0593K1264m1086M5463j5669q8198J8831K1820L6651j05485
$$ -110545 55144 105737 127001 85915 131378 115709 27511 46342 68162 104813 -672
13111f72L0693m5698o1206J0674L5676O9702J4497k9785Q604p9039Q9269N1512
$$ -672 30021 -15677 -76883 -66209 -30533 39169 53666 23881 32485 -46554 42715 94227
13099I4227j48884J18999J31268M8111N0439m6448j61917m7057L5262O5870M4776
$$ 94227 -54657 64342 195610 243721 294160 247712 85795 38738 74000 139870 184646
13088A84646o0639o3153R4261L1429j38340m2581L422N4802N2472r0872p5747
$$ 184646 124007 60854 155115 186544 48204 5623 9045 63847 116319 25447 -50300
13077e0300K0m1370O5792n8851J3974M1651l8121m1500n0623n9803Q8759Q2279
$$ -50300 -50280 -91650 -25858 -84709 -70735 -29084 -67205 -108705 -159328 -219131 -130372 -48093
13065d8093j09306L011J11494J3319j8520n9093N0025R5610K7845M061M2615M1309
$$ -48093 -157399 -154388 -42894 -29575 -48095 -107188 -57163 38447 66292 70353 112968 154277
13053A54277k7156L731p037k5556l1652k1351n2869r1232n1359N8265N0517m7458
$$ 154277 127121 130852 123815 98259 66607 45256 -7613 -98845 -150204 -91939 -41422 -88880
13041h8880m0840K4944L7323O3956J7229q7178n6683J21681J23585j1764l3881
$$ -88880 -129720 -104776 -67453 -3497 13732 -73446 -130129 -8448 115137 103373 69492
13030F9492N5434n6738M7965P8916M5930J4624j11436o6634j6838m1084q7877
$$ 69492 124926 68188 116153 195069 240999 255623 144187 77553 60715 19631 -68246
13019f8246l2096j055M930J5652M4688K3448O6582l8521o3453k5675m8576j5836
$$ -68246 -100342 -101397 -96467 -80815 -36127 -12679 53903 15382 -48071 -73746 -122322 -138158
13007a38158Q3843J34496o6312l0910N2962K9448l2730j15470L7019O1860N059
$$ -138158 -54315 80181 13869 -17041 35921 65369 32639 -82831 -45812 16048 21107
12996B1107P8208K129n2848l0565j0330J1551p9297J3789J21306m4081M650N8658
$$ 21107 99315 101444 48596 18031 7701 19252 -60045 -46256 75050 30969 35619 94277
12984I4277K7313J2789n3335m7861l260L2644P4354O1055p6398j55738J8193R3444
$$ 94277 121590 134379 81044 33183 29923 62567 136921 197976 121578 -34160 -15967 77477
12972G7477o6162N608M4421p1997p4260N2428K4840j01942j3076N3294J33639
$$ 77477 11315 16923 61344 -10653 -84913 -32485 -7645 -109587 -122663 -69369 64270
12961F4270L2771r9561m9735k1908J47939o0558j20325k4796J08859n3515n0504
$$ 64270 97041 -2520 -52255 -74163 73776 13218 -107107 -131903 -23044 -76559 -127063
12950a27063K8608n0440L7280J6429n3721j1751P6112p4456k8010J4699L9103
$$ -127063 -98455 -148895 -111615 -95186 -148907 -160658 -84546 -159002 -187012 -172313 -133210
12939a33210M5109J18733j2817k9899J8830k4472K8784M6679k0841k7364j1083
$$ -133210 -88101 30632 17815 -12084 6746 -17726 11058 57737 36896 9532 -1551
12928a551j17326l7900K672o424O5881K4708o9341L6675N7475R7704K2639p1453
$$ -1551 -118877 -156777 -154105 -160529 -94648 -69940 -139281 -102606 -45131 52573 75212 3759
12916C759q928Q0710m1724j05456O4710J73556J4189l2459q0414o5821K0433l7529
$$ 3759 -5169 75541 33817 -71639 -6929 166627 180816 148357 67943 2122 22555 -14974
12904a4974n2191N6491l8974q7034J11485Q7550p556K6284n1884j46837j20119
$$ -14974 -67165 -10674 -49648 -136682 -25197 62353 54797 81081 29197 -117640 -237759
12893b37759O6839J31321L4995N5103P8357K1959j5166o2063N7350P8613k2242
$$ -237759 -170920 -39599 -4604 50499 128856 150815 135649 73586 130936 209549 187307
12882A87307q1795p5648J3595m26O960l8533L9866p0754m411R1862j8685q0620
$$ 187307 105512 29864 43459 43033 49993 11460 51326 -19428 -23839 68023 49338 -31282
12870c1282n9649o694Q8899J9990l0399K8049M2064L8496m1123n7775O3717N1120
$$ -31282 -90931 -97625 -8726 11264 -19135 8914 50978 89474 48351 -9424 54293 105413
12858A05413j33577j27489J30137J49298n5555o7722r6023J7916O0712J7221o7209
$$ 105413 -28164 -155653 -25516 123782 68227 505 -95518 -77602 -16890 331 -66878
12847f6878n1361P2046N0262K5191n313J1752o4062p9360k7282R3338R1O7228
$$ -66878 -118239 -46193 4069 29260 23947 35699 -28363 -107723 -135005 -41667 -41576 25652
12835B5652J01194r931k04739j04532J1232L6797J2754n3915N9010O9227K089
$$ 25652 126846 116915 -87824 -192356 -181124 -144327 -131573 -185488 -126478 -57251 -55162
12824e5162o0221K2708M4298K6782j7149N4138L7487l8059Q777K5310J4048N3742
$$ -55162 -115383 -92675 -48377 -21595 -38744 15394 52881 14822 23599 48909 62957 116699
12812A16699k8632n2174L1421m3590o9411J5859k121M5762N5233o0471o266j8046
$$ 116699 88067 35893 67314 23724 -45687 -29828 -31949 13813 69046 8575 2309 -15737
12800a5737n1625P035o1587J26565N5916p8778m4996l6095L0726J25160r631p0522
$$ -15737 -67362 -60327 -121914 4651 60567 -18211 -63207 -99302 -68576 56584 46953 -23569
$$ [...]
##END NTUPLES=NMR SPECTRUM
##END=
