##TITLE=Analysis number 319492
Compound Code cc 44816
Book Reference 438/132
Project Code adrs
Chemist Name antons
##JCAMPDX= 6.0         $$ Bruker NMR JCAMP-DX V2.0
##DATA TYPE= NMR SPECTRUM
##DATA CLASS= NTUPLES
##ORIGIN= Bruker BioSpin GmbH
##OWNER= nmr
$$ XWIN-NMR		Version 3.5
$$ Wed May 17 10:12:11 2006 GMT Daylight Time (UT+1h)  MAYBRIDGE\nmr@NMR_250MHZ
##.OBSERVE FREQUENCY= 250.131544655141
##.OBSERVE NUCLEUS= ^1H
##.ACQUISITION MODE= SIMULTANEOUS (DQD)
##.ACQUISITION SCHEME= undefined
##.AVERAGES= 16
##.DIGITISER RES= 18
##SPECTROMETER/DATA SYSTEM= dpx250
##.PULSE SEQUENCE= zg30
##.SOLVENT NAME= CDCl3
##.SHIFT REFERENCE= (INTERNAL, CDCl3, 0, 16.522)
##AUDIT TRAIL= $$ (NUMBER, WHEN, WHO, WHERE, WHAT)
$$ ##TITLE= Audit trail, XWIN-NMR		Version 3.5
$$ ##JCAMPDX= 5.01
$$ ##ORIGIN= Bruker BioSpin GmbH
$$ ##OWNER= nmr
$$ C:\u/data/dgb/nmr/ADRS/4530/pdata/1/auditp.txt
$$ ##AUDIT TRAIL=  $$ (NUMBER, WHEN, WHO, WHERE, WHAT)
(   1,<2006-05-17 10:11:48.29 +100>,<MAYBRIDGE\nmr>,<NMR_250MHZ>,
      <created by zg, POWCHK disabled, PULCHK disabled
       configuration hash MD5:
       84 BC 41 DB A1 6E 1D 46 DA 25 12 A5 C1 ED C5 3A
       data hash MD5: 64K
       91 02 26 F3 47 DA 16 19 11 9A AE DC 2D 09 77 62>)
(   2,<2006-05-17 10:12:01.15 +100>,<MAYBRIDGE\nmr>,<NMR_250MHZ>,
      <Start of raw data processing
       ef LB = 0.3 FT_mod = 6 PKNL = 1 SI = 32K 
       data hash MD5: 32K
       EF D2 C5 F3 D9 72 15 7A 7A 41 A0 B1 EC AB B6 3E>)
(   3,<2006-05-17 10:12:02.74 +100>,<MAYBRIDGE\nmr>,<NMR_250MHZ>,
      <apk 
       data hash MD5: 32K
       50 45 85 52 9E 38 6D 4B 6D 7C 68 3A FA 17 7E DC>)
(   4,<2006-05-17 10:12:03.57 +100>,<MAYBRIDGE\nmr>,<NMR_250MHZ>,
      <abs ABSG = 5 
       data hash MD5: 32K
       FE 0E 51 58 D2 CE 80 69 8C 36 DA D7 36 F0 6D 66>)
$$ ##END=
$$ 
$$ hash MD5
$$ CE 3C 82 53 A6 5B FE 1E B5 A9 5E 27 DB AB E8 FF
##$RELAX= 
##$RELAX= 
##$RELAX= 
##$RELAX= 
##$RELAX= 
##$RELAX= 
##$RELAX= 
$$ Bruker specific parameters
$$ --------------------------
##$DU= <C:\u>
##$EXPNO= 4530
##$NAME= <ADRS>
##$PROCNO= 1
##$TYPE= <nmr>
##$USER= <dgb>
##$AMP= (0..31)
100 100 100 100 100 100 100 100 100 100 100 100 100 100 100 100 100 100 
100 100 100 100 100 100 100 100 100 100 100 100 100 100 
##$AQSEQ= 0
##$AQ_mod= 3
##$AUNM= <au_zg>
##$AUTOPOS= <8 >
##$BF1= 250.13
##$BF2= 250.13
##$BF3= 250.13
##$BF4= 250.13
##$BF5= 500.13
##$BF6= 500.13
##$BF7= 500.13
##$BF8= 500.13
##$BYTORDA= 1
##$CFDGTYP= 0
##$CFRGTYP= 5
##$CHEMSTR= <none>
##$CNST= (0..31)
1 1 145 1 1 1 1 1 1 1 1 1 1 1 1 1 1 1 1 1 1 1 1 1 1 1 1 1 1 1 1 1 
##$CPDPRG= <>
##$CPDPRG1= <>
##$CPDPRG2= <>
##$CPDPRG3= <>
##$CPDPRG4= <mlev>
##$CPDPRG5= <mlev>
##$CPDPRG6= <mlev>
##$CPDPRG7= <mlev>
##$CPDPRG8= <mlev>
##$CPDPRGB= <>
##$CPDPRGT= <>
##$D= (0..31)
0 1 0 0 0 0 0 0 0 0.06 0 0 0 0 0 0 0.0002 0 0 0 0 0 0 0 0 0 0 0 0 0 0 
0 
##$DATE= 1147857106
##$DBL= (0..7)
120 120 120 120 120 120 120 120 
##$DBP= (0..7)
150 150 150 150 150 150 150 150 
##$DBP07= 0
##$DBPNAM0= <>
##$DBPNAM1= <>
$$ [...]
##$SUBNAM7= <"">
##$SUBNAM8= <"">
##$SUBNAM9= <"">
##$SW= 20.6930455092707
##$SWIBOX= (0..15)
0 0 3 0 0 0 0 0 0 0 0 0 0 0 0 0 
##$SW_h= 5175.983436853
##$TD= 65536
##$TD0= 1
##$TE= 295.16
##$TE2= 300
##$TE3= 300
##$TEG= 300
##$TL= (0..7)
0 120 120 120 120 120 120 120 
##$TP= (0..7)
150 150 150 150 150 150 150 150 
##$TP07= 0
##$TPNAME0= <>
##$TPNAME1= <>
##$TPNAME2= <>
##$TPNAME3= <>
##$TPNAME4= <>
##$TPNAME5= <>
##$TPNAME6= <>
##$TPNAME7= <>
##$TPOAL= (0..7)
0.5 0.5 0.5 0.5 0.5 0.5 0.5 0.5 
##$TPOFFS= (0..7)
0 0 0 0 0 0 0 0 
##$TUNHIN= 0
##$TUNHOUT= 0
##$TUNXOUT= 0
##$USERA1= <user>
##$USERA2= <user>
##$USERA3= <user>
##$USERA4= <user>
##$USERA5= <user>
##$V9= 5
##$VALIST= <valist>
##$VCLIST= <CCCCCCCCCCCCCCC>
##$VD= 0
##$VDLIST= <DDDDDDDDDDDDDDD>
##$VPLIST= <PPPPPPPPPPPPPPP>
##$VTLIST= <TTTTTTTTTTTTTTT>
##$WBST= 1024
##$WBSW= 4
##$XGAIN= (0..3)
0 0 0 0 
##$XL= 0
##$YL= 0
##$YMAX_a= 398013
##$YMIN_a= -505714
##$ZGOPTNS= <>
##$ZL1= 120
##$ZL2= 120
##$ZL3= 120
##$ZL4= 120
##$ABSF1= 16.522
##$ABSF2= -4.171173
##$ABSG= 5
##$ABSL= 3
##$ALPHA= 0
##$AQORDER= 0
##$ASSFAC= 0
##$ASSFACI= 0
##$ASSFACX= 0
##$ASSWID= 0
##$AUNMP= <proc_1d>
##$AZFE= 0.1
##$AZFW= 0.1
##$BCFW= 0
##$BC_mod= 0
##$BYTORDP= 0
##$COROFFS= 0
##$CY= 12.5
##$DATMOD= 1
##$DC= 0
##$DFILT= <>
##$DTYPP= 0
##$F1P= 14.0000005364418
##$F2P= -0.99999901652339
##$FCOR= 0.5
##$FTSIZE= 32768
##$FT_mod= 6
##$GAMMA= 0
##$GB= 0
##$INTBC= 1
##$INTSCL= 1
##$ISEN= 128
##$LB= 0.3
##$LEV0= 0
##$LPBIN= 0
##$MAXI= 10000
##$MC2= 0
##$MEAN= 0
##$ME_mod= 0
##$MI= 0
##$NCOEF= 0
##$NC_proc= -4
##$NLEV= 6
##$NOISF1= 0
##$NOISF2= 0
##$NSP= 0
##$NTH_PI= 0
##$NZP= 0
##$OFFSET= 16.522
##$PC= 1
##$PHC0= 165.0375
##$PHC1= 4.622673
##$PH_mod= 1
##$PKNL= yes
##$PPARMOD= 0
##$PSCAL= 4
##$PSIGN= 0
##$REVERSE= no
##$SF= 250.13
##$SI= 32768
##$SIGF1= 0
##$SIGF2= 0
##$SINO= 400
##$SIOLD= 32768
##$SREGLST= <1H.CDCl3>
##$SSB= 0
##$STSI= 32768
##$STSR= 0
##$SW_p= 5175.98343685301
##$SYMM= 0
##$S_DEV= 0
##$TDeff= 65536
##$TDoff= 0
##$TI= <Analysis number 999999
Compound Code 99
Book Reference 9
Project Code 9>
##$TILT= no
##$TM1= 0
##$TM2= 0
##$TOPLEV= 0
##$USERP1= <user>
##$USERP2= <user>
##$USERP3= <user>
##$USERP4= <user>
##$USERP5= <user>
##$WDW= 1
##$XDIM= 32768
##$YMAX_p= 293499031
##$YMIN_p= -296324
$$ End of Bruker specific parameters
$$ ---------------------------------
##NTUPLES= NMR SPECTRUM
##VAR_NAME=  FREQUENCY,     SPECTRUM/REAL,   SPECTRUM/IMAG
##SYMBOL=    X,             R,               I
##VAR_TYPE=  INDEPENDENT,   DEPENDENT,       DEPENDENT
##VAR_FORM=  AFFN,          ASDF,            ASDF
##VAR_DIM=   32768,         32768,           32768
##UNITS=     HZ,            ARBITRARY UNITS, ARBITRARY UNITS
##FACTOR=    0.157963299565203, 1,           1
##FIRST=     4132.6476996994, 0,             0
##LAST=      -1043.33573715361, 0,           0
##MIN=       -1043.33573715361, -296324,     0
##MAX=       4132.6476996994, 293499031,     0
$$ Real data points
##PAGE= N=1
##DATA TABLE= (X++(R..R)), XYDATA
$$ [...]
15610b2541N847J8132P484k720Q405n065o032J4989j4193j8611k4637n032j0210
15597e4184J4466J1709j8482J3780J0220l4200P017J9749K2143J1397k7087j8313
15585d1785L0311J7360K3502l601j0136M661Q751K2557K25j2684o380n142M043
15572C1682R67k2461k0608l3214L1219J9799m131q120n20j8247J4569L6631J2684
15559D0250j4568J0334q693k6900K468P454k0731Q52K89N974Q524K5188R35j0935
15545B0441J6099J7371j4173l8078n140L892o684O148K3372k0150n071l583L549
15532b007O774l679K631Q205l797j6816L539J7219j2424j774n207j098J3027J7569
15518B2162M092l4591j7810l2892k941L3314K4283k1792j2742N449J7304R602
$$ plain form
15610 -22541 -16694 1438 8922 6202 14607 9542 3510 18499 4306 -14305 -38942 -43974 -54184
15597 -54184 -39718 -28009 -46491 -32711 -22491 -56691 -49674 -29925 -7782 3615 -23472 -41785
15585 -41785 -11474 5886 29388 25787 15651 20312 29063 51620 51845 39161 32781 27639 31682
15572 31682 32649 10188 -10420 -43634 -12415 7384 3253 -4867 -5387 -23634 -9065 27566 40250
15559 40250 25682 36016 27323 423 2891 10345 -10386 -9534 -9245 -3271 5253 30441 31376 20441
15545 20441 36540 53911 39738 1660 -3480 412 -6272 -124 23248 3098 -1973 -5556 -2007
15532 -2007 4767 1088 3719 11924 8127 -8689 -5150 12069 -355 -2129 -7336 -8434 4593 22162
15518 22162 26254 -8337 -26147 -59039 -61980 -28666 -4383 -26175 -38917 -33468 -16164 -6562
15506f562J718k4287L52L1225j042r719j2700P814o995J8809K203K287J8166r707
15492A1562p190l5242k787L0825q633J1011k7909n135J502K1257L2781k787j0107
15479I148l4261P012M275j6114R350L3125J6220j8613l5127j583q530j9432J1117
15466d3413O538K9395p991J145l0111o491P077J1175p897j4367M622Q695J367
15453d0256j7340j3422K1644j2738J1252P423k094J7031q8K5438N263j0690j0260
15440a8837l1134j0842J7521M680J7073o986k3368M01K9924J2456J15P309k7741
15427b9429J430R741m943K8624J5576j6270j7624m0438j9396J3371J3728N155
15415d0475P528Q729j3524q962Q902L9695K7343j3407l389o487l390j2130J4588
$$ plain form
15506 -6562 -4844 -29131 -28779 2446 1404 -8315 -21015 -13201 -20196 -1387 816 3103 21269 11562
15492 11562 4372 -30870 -33657 -2832 -11465 -454 -28363 -33498 -31996 -10739 22042 19255 9148
15479 9148 -25113 -18101 -13826 -29940 -20590 12535 28755 10142 -24985 -26568 -35098 -54530 -43413
15466 -43413 -36875 -7480 -15471 -14326 -44437 -50928 -43851 -32676 -40573 -54940 -50318 -41623 -40256
15453 -40256 -57596 -71018 -49374 -62112 -50860 -43437 -45531 -28500 -28588 -3150 2113 -8577 -18837
15440 -18837 -49971 -60813 -43292 -38612 -21539 -28525 -51893 -51492 -21568 -9112 -8997 -1688 -29429
15427 -29429 -27999 -18258 -23201 5423 20999 4729 -12895 -53333 -72729 -59358 -45630 -40475
15415 -40475 -32947 -24218 -37742 -46704 -37802 1893 29236 15829 12440 5953 2563 -9567 5021
15402E021O693k0276J4095L4099J2011o820m1973m2377Q046K2960J678l2332l0144
15389f9319j5129K0744J5174L1788j5417j8894O511K6191J5859l2991r482J1974
15377c2991q129n788K1849j892M3278k7953l479K5248n33k2919p519k660L1198
15364G710p662J4776L050P87l4863j7343J1519m222L506j1886n129J9037K9623
15351H903k1843J1157M5823r450J214M674k7170m9419r607K1853K3684k8990l2360
15338f1531K0402L4321J5746p105J0877J1876P238j9375j9875m5036q59J5203
15326c8118q674n646J9200N177R495k093q400K2826J3544k1220M910M9297Q566
15313D8864l0234J0520j6344M091N213k564j2938r227o489l7156k2146n898K3090
$$ plain form
15402 5021 11714 -8562 5533 39632 51643 44823 2850 -39527 -31481 -8521 -6843 -39175 -69319
15389 -69319 -84448 -63704 -48530 -16742 -32159 -51053 -44542 -18351 -2492 -35483 -44965 -32991
15377 -32991 -41120 -46908 -25059 -26951 16327 -11626 -15105 10143 9610 -13309 -20828 -23488 7710
15364 7710 48 14824 17874 18661 -16202 -33545 -22026 -26248 -22742 -34628 -39757 -20720 8903
15351 8903 -12940 -1783 44040 34590 35804 40478 13308 -36111 -45718 -23865 -181 -29171 -61531
15338 -61531 -41129 -6808 8938 1833 12710 24586 31824 12449 -7426 -52462 -53321 -38118
15326 -38118 -46792 -52438 -33238 -28061 -18566 -20659 -29059 -6233 7311 -13909 -8999 40298 48864
15313 48864 18630 29150 12806 16897 22110 19546 6608 -2619 -9108 -46264 -68410 -74308 -51218
15300e1218L3293K3318o968j3487K5665o124O965q165M877r166k0932j0952j4545
15287d7439j957j530q291j0821O551M7459M9434r720m2485J3333J1070j5314k7729
15274c7439L417K6114N057k5900r74J5968P241J4277J1540J1804j3135j1933O191
15261A2228o383j2251J7954j423l0209j605P381j845P223k239p343J331O952j1622
15247b1851p11M0806J1096k5191j3184l796Q502P146L89j9329m540o852Q385N030
15233a4100l2134j1465J2935J4582j6597o19K1109J5863K5068j1258j1680k8803
15221c7099p808R934l936o757j9325j0716o628J6740L2658P257k75j5108N031
15208c6032J8806j939k0917M557K1699K3524K7136P86j742k3437K070j1438q458
$$ plain form
15300 -51218 -17925 5393 -1575 -15062 10603 4479 11444 3279 8156 -1010 -21942 -32894 -47439
15287 -47439 -49396 -50926 -59217 -70038 -63487 -16028 33406 23686 -18799 -5466 5604 -9710 -37439
15274 -37439 -34022 -7908 -2851 -28751 -29725 -13757 -6516 7761 19301 31105 17970 6037 12228
15261 12228 5845 -6406 11548 10125 -20084 -21689 -14308 -16153 -8930 -11169 -18512 -17181 -10229 -21851
15247 -21851 -22562 18244 29340 4149 -9035 -12831 -4329 2817 3206 -16123 -20663 -27515 -19130 -14100
15233 -14100 -46234 -57699 -44764 -30182 -46779 -47398 -26289 -10426 14642 3384 -8296 -37099
15221 -37099 -44907 -34973 -38909 -45666 -64991 -75707 -82335 -65595 -32937 -25680 -25955 -41063 -36032
15208 -36032 -17226 -19165 -40082 -35525 -13826 9698 36834 37620 35878 12441 14511 3073 -5385
15195e385j8977Q491K1178Q139O616p783r565q135J3089J7751K39j977j8076j0327
15181d722Q412j811j0489k5662j503J6951M421L536j2118q341J4648j6181m374
15168c7233j583j0675M082L8721K8009l1554j3695J8508M263n571l61r033j3334
15155b9456R295O951j9194J2469j7311R039L6884p174l6186k430O866j8919l292
15142e2458K1579K7173J7390J71k0751l412m1895P381K9461j6986r673q400L2694
15129a7726l89p081L2954J5543j3350j2713k3425O466K4043J5598j3111K7616
15117C4425j3799K302m667k6533p262P240K5830J6240K9470J632k4833o215n219
15104B8611k0974o347J0531j6037m6428J508M4361O153K9623o060l9912k7625
$$ plain form
15195 -5385 -24362 -15871 5307 13446 20062 12279 2714 -5421 7668 25419 25658 23681 5605 -4722
15181 -4722 3690 1879 -8610 -34272 -35775 -18824 -14403 -10867 -22985 -31326 -16678 -32859 -37233
15168 -37233 -38816 -49491 -45409 -6688 21321 -10233 -23928 -5420 -1157 -6728 -7089 -16122 -29456
15155 -29456 -20161 -13210 -32404 -19935 -37246 -28207 8677 1503 -34683 -37113 -30247 -49166 -52458
15142 -52458 -30879 -3706 13684 13855 -6896 -10308 -52203 -44822 -15361 -32347 -42020 -50420 -17726
15129 -17726 -18115 -25196 7758 23301 9951 -2762 -26187 -19721 4322 19920 6809 34425
15117 34425 20626 22928 18261 -8272 -15534 -8294 17536 33776 63246 64878 40045 33830 28611
15104 28611 7637 1290 11821 -4216 -50644 -49136 -4775 1378 31001 24941 -14971 -42596
15092d2596J4231l1246l3080M219K4502j725N355J31L0990J7959j0614j0255l900
15079c6029R580L0079n772l024j0096J07p339j9355M6107J9138j4318j6458J685
15066e695L5967L2400k2655j5225j7683k7207J9680O452l508K9197J2075j5859
15054B7939K933l450K502K877j273j0675l2310M279K4189Q852j215J4703J4333
15041E3684M437j249l8631m613L304J217J1309K0368N606R96j1884q268j1695
15028B4581k7594k5247K7535K9573J9412q154k8806q542J3748K3127J3781n343
15016D8071N3095J5193r493j3615n10O276K7127K6924K2632M3813J5148O0953
15004B95614Q8501Q1581J39486K57952M80602Q48123J329423J561842J031602
$$ plain form
15092 -42596 -28365 -59611 -92691 -88472 -63970 -65695 -60340 -60209 -29219 -11260 -21874 -32129 -36029
15079 -36029 -26449 3630 -2142 -5166 -15262 -15155 -22494 -41849 4258 23396 9078 -7380 -5695
15066 -5695 30272 62672 40017 24792 7109 -20098 -418 6034 2526 31723 43798 27939
15054 27939 30872 27422 29924 32801 31528 20853 -11457 -7178 17011 25863 24648 39351 53684
15041 53684 58121 56872 18241 13628 16932 18149 29458 49826 55432 56428 44544 36276 24581
15028 24581 -3013 -28260 -725 28848 48260 40106 11300 2758 16506 39633 53414 48071
15016 48071 101166 116359 106866 93251 92741 99017 126144 153068 175700 219513 234661 295614
15004 295614 384115 465696 605182 863134 1343736 2191859 3521282 5083124 6114726
14995F114726o40668k049637j328293o29900l41943j87338j42277q6268q4813
14986F23589n1815m721k9055k7362l3668m3434k3194k286N024o389k2540k2711
14974C61438m714m7727k6791j2199m120J1815l040l8532m2429P505Q211k0965
14962A88452k4335j4405l158K5332p453j6863J6384o727k7975M502j124p430j0725
14949A14475j6496M0425L0638j7889m525o686k0453j5586j0662K6403J5456j27
14937A34973j2927n569M868L952J5142m0658l0263l4149j7829J4174L903Q683
14925D4300m449O423K0201j1142M772K8249J0097l1561p872J9046o460k6524l1885
14912A3195J5961J2419l561N6909r410j3693k2681m4710p367K7566J379l1022
$$ plain form
14995 6114726 5474058 3424421 2096128 1466228 1124285 936947 794670 708402 623589
14986 623589 571774 567053 537998 510636 476968 433534 410340 408054 413078 406689 384149 361438
14974 361438 356724 308997 282206 270007 265887 277702 274662 236130 193701 201206 209417 188452
14962 188452 164117 149712 146554 171886 164433 147570 163954 157227 129252 133754 132630 125200 114475
14949 114475 97979 138404 169042 151153 146628 139942 119489 103903 93241 119644 135100 134973
14937 134973 122046 116477 121345 125297 140439 99781 69518 35369 17540 31714 35617 44300
14925 44300 39851 46274 66475 55333 60105 88354 98451 66890 59018 78064 71604 45080 13195
14912 13195 29156 41575 38014 94923 85513 71820 49139 4429 -2938 24628 26007 -5015
14900e015j4190R071M1121J9700l4669j113P592p737m643J3538j312j275L305
14887B4373m877j4591k4705n609M355K2083j3357N456J1122p845K0128K4032j6086
14874B4479n874L906J1957J777n826j2415q108J0650K2350l2839j1407l711m660
14861i721j9956J2435p189j3481j7545J0766M2177J6808k0566R73K087J0531j3358
14848f039j2684j0762k133j306k8003p683L3872M7712K3283J7700O037r454K2809
14835G3349j903m408l4584j3082p26k9555K2848J2101N580P289p127l1550j2079
14822a3847M253L395O228N350p376m1474N097J3890L3673L5103k12k8880o972
14809H228r42L511m273o340J1635o471J5263J4294l527k3936k518j3239R357L306
$$ plain form
14900 -5015 -19205 -10134 30987 50687 16018 14905 22497 14760 10117 23655 22343 21068 24373
14887 24373 19496 4905 -19800 -25409 -21054 1029 -12328 -6872 4250 -3595 16533 40565 24479
14874 24479 18605 22511 34468 36245 30419 18004 9896 20546 42896 10057 -1350 -5061 -9721
14861 -9721 -29677 -17242 -24431 -37912 -55457 -44691 -2514 14294 -6272 -5299 -3212 7319 -6039
14848 -6039 -18723 -29485 -31618 -32924 -60927 -68610 -34738 12974 36257 53957 59994 50540 73349
14835 73349 71446 67038 32454 19372 18646 -10909 11939 24040 29620 36909 29782 -1768 -13847
14822 -13847 -9594 -6199 29 5379 -1997 -43471 -38374 -24484 9189 44292 44080 15200 8228
14809 8228 7286 10797 6524 184 11819 5348 20611 34905 31378 7442 4924 -8315 1042 4348
14795D348j3332m770r858n947J0540j6400j2812J8182l876j8310m630K4589j9387
14782e1663k032P512j1168m018o053J0062M045o265N090M8012K5223J8790l886
14769C3649j5444j255n947J2015O932k5422K81n048j7368j7700o707J1915j4397
14756d4496J7751r510l59k2453k443M9926P620l847j859J3848J6677q118R253
14743B1990M754q412q345J8967j3241j4215O467r179l722k790P495l880o50j827
14729f588J9983K9346j1318l258k5686j3923N985k7496k1526P28N682o134K4138
14716c0067M3900R714j8246j5491m210j2706l8103J2138K5480j3549n265K259
14704d4146q967O016K6963m162L44o029l352Q773j1743j3284O735O276J358N656
$$ plain form
14795 4348 -8984 -13754 -23612 -29559 -19019 -35419 -48231 -30049 -33925 -52235 -56865 -32276 -51663
14782 -51663 -53695 -46183 -57351 -61369 -67422 -57360 -53315 -59580 -54490 -6478 18745 37535 33649
14769 33649 18205 16950 11003 23018 29950 4528 4809 -239 -17607 -35307 -42014 -30099 -44496
14756 -44496 -26745 -36255 -36614 -59067 -61510 -11584 -3964 -7811 -9670 4178 20855 12737 21990
14743 21990 26744 18332 9987 28954 15713 1498 7965 -1214 -4936 -7726 -231 -4111 -4761 -6588
14729 -6588 13395 42741 31423 28165 2479 -11444 -5459 -32955 -54481 -53753 -48071 -54205 -30067
14716 -30067 13833 23547 5301 -10190 -14400 -27106 -65209 -53071 -27591 -41140 -46405 -44146
14704 -44146 -53113 -47097 -20134 -24296 -23952 -29981 -33333 -24560 -36303 -49587 -42852 -36576 -35218 -29562
14690b9562J8792m128k3830K653K6248r308k5901j3690J7883J3396l305k92J2782
14677a8262j864k695o79J8141J5965J72m839n929l359O279Q272m092J8417j8313
14663G214k3758k2729p070N807K0510L2296Q691m2790l6228j9398k362J3914K6420
14650c9483J2496J4917p506l3960r476n867K9012K3531j6540j356J0997J2305
14638a0930k86n760J1234r604J3170R424l224p17q67K439Q864m337l3436j5775
14624c9805K2133L318n649J339k746J0825Q587K3684K830k4826N905l438n2066
14611d9909k7125J8184M2317M4247J394j5965m628L5336J3251j8841k255J0149
14599D6155k0096n48J0112M026J113o197n334P059k887n827k5261l1945m806K0194
$$ plain form
14690 -29562 -10770 -14898 -38728 -36075 -9827 -19135 -45036 -58726 -40843 -27447 -30752 -31044 -18262
14677 -18262 -20126 -22821 -23500 -5359 10606 10778 5939 10 -3349 2930 11202 7110 25527 7214
14663 7214 -16544 -39273 -46343 -40536 -20026 12270 20961 -21829 -58057 -77455 -79817 -65903 -39483
14650 -39483 -26987 -12070 -19576 -53536 -63012 -68879 -39867 -16336 -32876 -34232 -23235 -10930
14638 -10930 -11216 -16976 -5742 -15346 -2176 7248 4024 3307 2440 4879 13743 9406 -24030 -39805
14624 -39805 -17672 -14354 -20003 -18664 -21410 -10585 -1998 21686 24516 -310 5595 2157 -49909
14611 -49909 -77034 -58850 -16533 27714 29108 13143 8515 43851 57102 38261 36006 46155
14599 46155 26059 25511 35623 39649 40762 34565 29231 36290 33403 27576 2315 -29630 -34436 -14242
14585a4242Q403P721K59M529M45r463J8645R806O373o800l2937m31L07j927j3661
14570b2973m780L608j7030J7887J4444j5814R983J7030p422P244K1954j8613k6619
14557b1101l3918q895j2041J9443N9801L7915J4730l1141l0297j8495L4062K0118
14545C0181K399j183J8110J4775j9866k7655l2513j0970k966K5622J3527l0337
14533b0876L153J0282L348m232L869j4760k3454j0446J3064L4370K4934j9552
14521c00J6053j255n3093Q166K2415K4559L5740L361k4548l8796l179q917j1323
14508c1117J238j23Q674K698N877MK0322j3953l0765r703K0179K8935K074j7084
14494a2744P553q321k2817L2490K8703l13j9763l769j7273j3035J0431Q904K7826
$$ plain form
14585 -14242 -5839 1882 2141 6670 7115 -2348 16297 26103 32476 25676 -7261 -7692 -7385 -9312 -22973
14570 -22973 -27753 -24145 -41175 -23288 -8844 -24658 -14675 2355 -5067 2177 24131 5518 -21101
14557 -21101 -55019 -63914 -75955 -56512 3289 41204 55934 24793 -5504 -23999 10063 30181
14545 30181 32580 31397 49507 64282 44416 16761 -15752 -26722 -29688 -4066 9461 -20876
14533 -20876 -17723 -7441 -4093 -8325 -4456 -19216 -42670 -53116 -40052 -5682 19252 -300
14521 -300 15753 14498 -38595 -30429 -8014 16545 52285 55646 31098 -7698 -10877 -19794 -31117
14508 -31117 -29879 -30002 -21328 -18630 -12753 -12749 7573 -6380 -37145 -46848 -26669 2266 4340 -12744
14494 -12744 -5191 -13512 -36329 -3839 24864 24551 4788 1019 -16254 -29289 -18858 -9954 17872
14481A7872j1570j7147j9293k0007K2019L9013J0106j6030l5225n603N573K7880
14469b412K3488K193j4902m491O874J018K742r708m414k4834J249K3083k6025
14456b6139M023J0373P136p176k7014O183L7863K4289j6467K0847K2292J6444
14444G2654k0552j7327J1683J1700k0670m7771L369K3377J2408J1884p525q007
14432B5223L4736J9479l052k2861l3912k3888J4229j5046j1048j634k6101l7658
14420h1533K9212L0104K8010M458J3081m124j036j1220O708j873l827k0737K9459
14407A6682Q045J7683r377q924J493o498p630j675j3141K4249J1652L744j5581
14394B0722k0127R316n811P760o447k6715j7498Q484J6169L672j7176l3123Q964
$$ plain form
14481 17872 6302 -10845 -30138 -50145 -28126 10887 20993 4963 -30262 -35865 -30292 -2412
14469 -2412 21076 23269 8367 3876 10750 11768 14510 4802 388 -24446 -23197 -114 -26139
14456 -26139 -22116 -11743 -4607 -11783 -38797 -32614 5249 29538 13071 33918 56210 72654
14444 72654 52102 34775 46458 58158 37488 -10283 -6914 16463 28871 40755 33230 25223
14432 25223 59959 79438 76386 53525 19613 -4275 9954 -5092 -16140 -17774 -43875 -81533
14420 -81533 -52321 -22217 5793 10251 23332 19208 18172 6952 13660 11787 7960 -12777 16682
14407 16682 24727 42410 33033 24109 25602 19104 11474 9799 -3342 20907 32559 36303 20722
14394 20722 595 9911 4100 11860 5413 -21302 -38800 -30316 -14147 -10475 -27651 -60774 -51810
14381e1810J2397K284J8235M2225l350k932j134k0337j6242K9273m315k0045P886
14368g865L596j910p928J0641q096j2775m694M184P335j1921K2077K7746m4465
14355b4075j9288M0100L7426j04k9432r598J6565l715k1451J8291m746n5608j1596
14342f7231J5175J6044Q045K5375J1086p705K402J3907o365K5286p014j1892R07
14329A8020N896m1064k9825l849M051J6612k052K1102N533k3898r670j1098M173
14316d6069K9561j3565K238Q611L625k385Q702j5912k003K199J0365J7189m577
14303b021j0831j392M487o004M114j3243k4902K7168J7279J8412k0446J6842j9267
14290i804l5946K142N087N394J3285K6815j0927l5895k8146j498K6930J8064K6583
$$ plain form
14381 -51810 -39413 -37129 -18894 23331 19981 17049 15915 -4422 -20664 8609 4294 -15751 -7865
14368 -7865 -4269 -6179 -14107 -3466 -11562 -24337 -29031 -24847 -17512 -29433 -7356 20390 -24075
14355 -24075 -43363 -3263 34163 34059 4627 -4971 11594 7879 -13572 4719 -27 -55635 -67231
14342 -67231 -52056 -36012 -27967 -2592 8494 789 3191 17098 10733 36019 29005 17113 18020
14329 18020 23916 -17148 -46973 -50822 -46771 -30159 -32211 -11109 -5576 -29474 -39144 -50242 -46069
14316 -46069 -16508 -30073 -27835 -19224 -15599 -17984 -9282 -25194 -27197 -24998 -14633 2556 -2021
14303 -2021 -12852 -14244 -9757 -15761 -11647 -24890 -49792 -22624 -5345 13067 -7379 9463 -9804
14290 -9804 -45750 -43608 -38521 -33127 -19842 6973 -3954 -39849 -67995 -69493 -42563 -24499 2084
14277B084j987R625p029j5423j0397J8060J9394j2042j6930L804j4052j2137J8048
14264a8982L0596Q118m650p511L291j6667m453k587M387j4879J4697J9397j3396
14251b639j006O979r645K3065K4479l1566j4225L665N43O165J4001J0245l2775
14238b714l7031J3308J54M327j469r483Q22N138j0910M2653o068R186k251j8056
14224a2394k2121j9790l358j1515k262J9759N36M318J7317L666j3893j0769j4045
14211f4551M051M4400Q696j7889n329m929J0917J3384K5972l332l0869K307j728
14198a8900K1427m218k1828j2618J3483m681J820O553q740R020J0195L87n610
14185a3710J3954L0470j0106m0720j3255L7936R521K9915j0166k2398J8546j0801
$$ plain form
14277 2084 97 9722 2693 -12730 -23127 -5067 14327 2285 -14645 -10841 -24893 -37030 -18982
14264 -18982 11614 19732 15082 7571 10862 -5805 -10258 -12845 -8458 -23337 -8640 10757 -2639
14251 -2639 -3645 3334 -6311 16754 41233 9667 -4558 -893 -350 5815 19816 30061 -2714
14238 -2714 -39745 -26437 -26283 -21956 -23425 -32908 -32086 -26948 -37858 4795 -1273 7913 5662 -12394
14224 -12394 -34515 -54305 -57663 -69178 -71440 -51681 -51145 -46827 -29510 -25844 -39737 -50506 -64551
14211 -64551 -60500 -16100 -7404 -25293 -30622 -35551 -24634 -11250 14722 11390 -19479 -17172 -18900
14198 -18900 2527 -1691 -23519 -36137 -22654 -27335 -25515 -18962 -27702 -18682 -8487 -8100 -13710
14185 -13710 244 30714 20608 -20112 -33367 4569 14090 44005 33839 11441 29987 19186
14173A9186l091r215p805L3429J0894n47o139j5016k4247k0375K578N829L1149
14160A6630P680J527M721o313R271l0173l4531m470J65O594J4116J903j0842M226
14146a9496P828j3015P286n939K111j4373m683p650k0838L165K9180K8018J1021
14133B615J848j680p136O542J3774k5773J488J1972L4122n528J8654j117k5798
14120B3983r375r217P768J3831j4262L86L6n769j8997j4444J1734k4352J3070
14107b5608J3006L036J0697k3644j2724J2616J8728n720r530Q981j6226j0745
14095c7133q381K5691K0883o340J5228q012j1190J2654K5803J3135k0126k9602
14083g390m883j1910O238M0311j076K4642K0292j3931k8370R850J2523P281m506
$$ plain form
14173 19186 16095 6880 -925 32504 43398 42851 36712 21696 -2551 -22926 -20348 -14519 16630
14160 16630 24310 25837 30558 24245 33516 3343 -31188 -35658 -35493 -28899 -14783 -12880 -23722 -19496
14146 -19496 -11668 -24683 -17397 -23336 -21225 -35598 -40281 -47931 -68769 -65604 -36424 -8406 2615
14133 2615 4463 2783 -4353 2189 15963 -9810 -8322 3650 37772 32244 50898 49781 23983
14120 23983 14608 5391 13159 26990 12728 13114 13150 7381 -11616 -26060 -14326 -38678 -25608
14107 -25608 -12602 -9566 1131 -22513 -35237 -22621 -3893 -9613 -19143 -10162 -26388 -37133
14095 -37133 -45514 -19823 1060 -5280 9948 1936 -9254 3400 29203 42338 22212 -7390
14083 -7390 -12273 -24183 -17945 22366 21290 45932 66224 52293 23923 33773 46296 53577 49071
14070D9071o368p197j7415j1168k0035r106j6084l133K1651K4918J4848j9798
14058A84j5601L93k404m4628J793L1554J7405J1646Q977n219j256j2352J3936
14045D428K6923K088p728j8517j0965l1205Q41L1353j1443k4897J5175R180q681
14032b3448L0396n569j216k2335O805J1730O55M432J6900j60p952r981J8848L291
14018B2396k0994k5723m873M923K7598P945M2L1098q813k7330M2388M672k6895
14005B6434R471J5435O113l0123l072j2220k4268l8616Q494M3238L3375p152k2137
13992D972K0276L4600k801l5718j7903l1612j9312M545L230M5704J7813m288J9930
13979C9436K5765K3305o071l7597n390l987k1196J1011J1415j8309J5066J2112
$$ plain form
14070 49071 42703 35506 18091 6923 -13112 -22218 -38302 -41435 -19784 5134 19982 184
14058 184 -15417 -15024 -17428 -62056 -60263 -28709 -11304 342 9319 4100 2844 -9508 4428
14045 4428 31351 33439 25711 7194 -3771 -34976 -34135 -2782 -14225 -39122 -23947 -14767 -23448
14032 -23448 6948 1379 163 -22172 -15367 -3637 -2982 1450 18350 18190 10238 257 19105 22396
14018 22396 1402 -24321 -29194 -24271 3327 11272 11314 42412 33599 6269 48657 53329 26434
14005 26434 35905 51340 57453 27330 24258 12038 -12230 -50846 -42352 886 34261 27109 4972
13992 4972 25248 59848 57047 21329 3426 -28186 -47498 -42953 -39723 5981 23794 19506 39436
13979 39436 65201 88506 82435 44838 39448 35461 14265 25276 36691 18382 33448 45560
13967D5560j3032k8167k7858k4812j6075o904L588K7448m2k772J0409K399j6011
13954d6269l370J4337J1914K0678J7074p643p894k9075J6939O740k2170j5308
13942d4047O723J9028P964M10k172j973J4081p5k4196K807P683j6929l349K0449
13928a3596J6348j3250j8396K763K2397q259j8233j7855l27K6724K5903N270q810
13915F79J0992j3121Q723J9328j6613k7473j8207J2374L1564K8954R072j1066
13903C5206k3890l9464J8225n931J4398n046K820p379k617J2286k0347N301J6032
13890d06p412M002j3256k0153K3359J8422q873O667N870n939j289J2453P337m992
13876A5790P74r444R755J8308k4671j7544n552o262K3045R731j8645j0427J9558
$$ plain form
13967 45560 32528 4361 -23497 -48309 -64384 -71288 -67700 -40252 -40294 -43066 -32657 -30258 -46269
13954 -46269 -49639 -35302 -23388 -2710 14364 6721 -1173 -30248 -13309 -6569 -28739 -44047
13942 -44047 -37324 -18296 -10332 -9922 -12094 -14067 14 -61 -24257 -21450 -13767 -30696 -34045 -13596
13928 -13596 2752 -10498 -28894 -26131 -3734 -11993 -30226 -48081 -48408 -21684 4219 9489 679
13915 679 11671 -1450 7273 26601 9988 -17485 -35692 -23318 8246 37200 46272 35206
13903 35206 11316 -28148 -9923 -15854 -1456 -6502 -3682 -11061 -13678 -1392 -21739 -16438 -406
13890 -406 -7818 -3816 -17072 -37225 -13866 4556 -4317 2350 8220 2281 992 13445 20782 15790
13876 15790 16564 7120 16875 35183 10512 -7032 -12584 -18846 4199 13930 -4715 -15142 4416
13863D416L228l2720j9096M785J7399J663J4791r397j4484M5299J2647j2949J4461
13850C0043M5314n310k9558m736J8167J6644l0860l095J8436j0357m2253l5427
13838c2992M749K1354R382j146K3858M948q615m879j4375k665O457R250q79R597
13824B4044K1768j1820k7834j2275L2976K5310n851r144N444q862k3975j6386
13812f605k9971j0950N39M592J9802L5899N619k04K6885j4520k5615k721M698
13799G448k2562J037m730N647R496K105j4240j4707l3132M326N001N571J7727
13786c1013L1097j7813L406n227J176j3951k3775r166K6774K3803q982n181p262
13773c6114Q689K412K507q935K4612M0406Q369m6370k3622K1196K7323o782m7171
$$ plain form
13863 4416 7644 -25076 -44172 -39387 -21988 -20325 -5534 -14931 -29415 15884 28531 15582 30043
13850 30043 75357 70047 40489 35753 53920 70564 39704 36609 55045 44688 2435 -32992
13838 -32992 -28243 -6889 2493 1347 25205 30153 21538 16659 2284 -381 6076 15326 14447 24044
13824 24044 45812 33992 6158 -6117 26859 52169 46318 37174 42618 33756 9781 -6605
13812 -6605 -36576 -47526 -46987 -42395 -22593 13306 18925 18721 45606 31086 5471 2750 7448
13799 7448 -15114 -14077 -18807 -13160 -3664 -1559 -15799 -30506 -63638 -59312 -54311 -48740 -31013
13786 -31013 84 -17729 -14323 -19550 -18374 -32325 -56100 -65266 -38492 -14689 -23671 -28852 -36114
13773 -36114 -27425 -25013 -22506 -31441 -6829 33577 41946 -4424 -28046 -6850 20473 13691 -33480
13760c3480j9095n919K4649J1408k058k0592k980J9376L2480J2262L412J8033
13748C7496N374l3145l395K426Q261j5070j4647K8563N852j4813l244k825M55
13735A288K0461j7732k6376M223J7497j9655j1208K644K8577J5579j3708P208
13723H798k1295k9089k8834J9675L7916P972k6174n764J1514J8196M1235j8334
13711A5816k9183J2302r033j0369m234L0284j1271m738k87K1815K1010J1760Q519
13698E2391j7783L268r311k6372K7299j8522j7893K0744J8189j799p436k1966
13686H09J1678J966j0829K6687K4385j2077R23Q908J5938j3370k5831j2792r855
13673F540R766N139J3768j438m05k213j8354j3903j2629R470J0366K17L75m958
$$ plain form
13760 -33480 -52575 -58494 -33845 -22437 -24495 -45087 -48067 -28691 3789 16051 19463 37496
13748 37496 42870 9725 6330 8756 17017 1947 -12700 15863 21715 6902 3658 833 1288
13735 1288 21749 4017 -22359 -18136 -639 -20294 -31502 -28858 -281 15298 1590 8798
13723 8798 -12497 -41586 -70420 -50745 -12829 -4857 -31031 -36795 -25281 -7085 34150 15816
13711 15816 -13367 -1065 -10098 -20467 -24701 5583 -5688 -10426 -10713 11102 32112 43872 52391
13698 52391 34608 37876 28565 2193 29492 10970 -6923 13821 32010 30211 22775 809
13686 809 12487 14453 3624 30311 54696 42619 43542 52450 68388 55018 29187 16395 6540
13673 6540 16306 21445 35213 33775 33370 31157 12803 -1100 -13729 -4259 6107 6324 6699 1741
13659A741P340J0868j0475j8456m919K42j7008J8455K6656J5423p380j9720k341
13646D26o689k7471K3563K4567K2561R397K996m444m292j0376K8986J4262j1883
13633F1603l3720j2909p171o226K327J6945q451J792j5205M416k491R412K3131
13620C3453p30k2733j1754k2739K7296J3499o808k6791r768K0235M1602k0100
13608A4662j6634k341K6164L188k412l707K227k0464j6761R519J0521j0230O791
13595E23Q861K511J1011J5207k532m552J1480j9479J2715j439j7710j5672J268
13582B192N7K7903K6828j3379m344j1152k9651J5035j488j0597q321j9371J7886
13569h402L1838J252n924p568p887M951K31k1897K0907j6644J5025j6391j1660
$$ plain form
13659 1741 9081 19949 9474 -8982 -13901 -13659 -30667 -12212 14444 29867 22487 2767 426
13646 426 -6263 -33734 -10171 14396 36957 46354 49350 44906 40614 30238 59224 73486 61603
13633 61603 27883 14974 7803 1577 3904 20849 12398 14190 -1015 3401 910 10322 33453
13620 33453 32723 9990 -1764 -24503 2793 16292 9484 -17307 -27075 -6840 34762 14662
13608 14662 -1972 -4313 21851 25039 22627 18920 21147 683 -16078 -6559 3962 -6268 523
13595 523 9384 11895 22906 38113 35581 31029 42509 23030 35745 34306 16596 924 2192
13582 2192 2249 30152 56980 43601 39257 28105 -1546 13489 12001 1404 -6917 -26288 -8402
13569 -8402 23436 24688 18764 11196 3309 8260 8491 -13406 7501 -9143 5882 -10509 -22169
13556b2169o639P827j3053R168J1501O194K6563N098J0261J6872j0983j5318L162
13543B8484K443K6221P96k5422k6235Q615J4711q646j1771j1902n2315P290L5734
13530a1997K7253j0879r642J3040n418j804J5572k3478l143K1096m595J98j6322
13517a0119m574K381M166K0155m46K854k4082k7757K5000J6683K3668J0141k6750
13504A1320j3670J2069L9801J2089j4436J0506o159o0613J5658k0166j4584k2886
13492e1071K29r450J3405L7399K1597O741j404p708K6166l83k3512j2682J4724
13479A4051M943j7904J2805J2598j7030k7709j81J6826P552j778k1935j7987K1851
13466a3898L0446J2084J934j8420j0656j9217O429J4105K3416J6305j8948J3207
$$ plain form
13556 -22169 -28808 -20981 -34034 -24866 -13365 -7171 19392 24490 34751 51623 40640 25322 28484
13543 28484 30927 57148 57944 32522 6287 14902 29613 20967 9196 -2706 -55021 -47731 -11997
13530 -11997 15256 4377 -5265 7775 2357 553 16125 -7353 -10496 10600 6005 6203 -10119
13517 -10119 -14693 -12312 -8146 12009 11563 14417 -9665 -37422 -12422 4261 27929 38070 11320
13504 11320 -2350 9719 49520 61609 47173 57679 51520 -9093 6565 -13601 -28185 -51071
13492 -51071 -50842 -60292 -46887 -9488 12109 18850 17446 9738 35904 35521 12009 -673 14051
13479 14051 18994 1090 13895 26493 9463 -18246 -18427 -1601 5951 4173 -17762 -35749 -13898
13466 -13898 16548 28632 30566 12146 1490 -17727 -11298 2807 26223 42528 23580 36787
13454C6787m553m2143j5789j671N870O621L273J3261o242n80J47j112m014L469
13440f676L4790k252J953K3795j5309k7832j4549P990K1785O204J1516K733j6472
13427B7676k7811p701j5968l364P957P984K590J1818P928J2069J1089K395k4280
13414A2382m0767j4237L2077K8875P179M952r973p622j924O819j266j517L0986
13401D5964J2004K847J4004n0899k1310K9222J5197m1362n416J1730K5869J5134
13389E2984j9871j160q690J3067J3063n804o211n185M348j1840o259k153j8515
13376b226j5051r455Q390J6124j2199k6775J5860r083J637J6472K4031J1168o843
13363A2050k116n489J2836J0111J1962J55j5402l716p02o459k63K2274K741k9456
$$ plain form
13454 36787 32234 -9909 -25698 -27369 -21499 -14878 -11605 1656 -4586 -5166 -5019 -6131 -10145 -6676
13440 -6676 28114 25862 27815 51610 36301 8469 -6080 1910 23695 29899 41415 44148 27676
13427 27676 -135 -7836 -23804 -27168 -19211 -11227 -8637 3181 11109 23178 34267 36662 12382
13414 12382 -28385 -42622 -10545 18330 25509 30461 20488 12866 10942 17761 16495 14978 45964
13401 45964 57968 60815 74819 23920 2610 31832 47029 5667 251 11981 37850 52984
13389 52984 33113 31953 23263 36330 49393 43589 37378 32193 36541 24701 18442 16289 -2226
13376 -2226 -17277 -26732 -18342 -2218 -14417 -41192 -25332 -34415 -32778 -16306 7725 18893 12050
13363 12050 9934 4445 17281 27392 39354 39509 24107 20391 19689 13230 12967 35241 37982 8526
13349H526j1462K554M653l153N521k830R377r028j4278O198k0867j0899J0179
13336b5509J520l3581P71K0436L6859J1212l1101M01n837N207m375K4494K2718
13323B3215M81j1318k2466n433K4274m46N179J2448R506o37r464l245j133K182
13309B3143j1838J1142o306o291k028j5997n139k867J5068K2176K706r155J5445
13296C0059J7769M26j2361k2524m971J5789M818j0002k409j8394L918o839j1995
13283a6716L2232L257J1502J0501n576K1318N079l691j8561J6589P363N41P828
13270G1666O072j121l4620l2934o904N165K5382J2760L9662L548l2875j9597M58
13257C6662J8418M873k2905k0358o26j2690J8312K5092j4713k3794l711J8524
$$ plain form
13349 8526 -2936 -382 4271 1118 6639 3809 13186 4158 -10120 -3922 -24789 -35688 -25509
13336 -25509 -23989 -57570 -56799 -36363 496 11708 -19393 -18992 -24829 -19622 -23997 497 23215
13323 23215 23696 12378 -10088 -15521 8753 8307 13486 25934 35440 34803 25339 22094 20961 23143
13309 23143 11305 22447 16141 9850 7822 -8175 -13314 -16181 -1113 21063 23769 14614 30059
13296 30059 47828 48254 35893 13369 8398 24187 29005 19003 16594 -1800 2118 -4721 -16716
13283 -16716 15516 18773 30275 40776 35200 56518 61597 57906 39345 55934 63297 63838 71666
13270 71666 77738 76617 41997 9063 2159 7324 32706 45466 85128 88676 55801 36204 36662
13257 36662 55080 59953 37048 16690 16064 3374 21686 46778 32065 8271 4560 23084
13245B3084p123K3206N517O831j7292r042p678Q129k0285j7049o511r033m703
13232c1949L8028K4510l756K128r492J3687n614K891K345j9007N082r819M5809
13219E4843K9116Q185n0015p708n940O499J7185j2488l7489J425o838L122N795
13206E692K0301O386r768m0670q688J7189J2084Q059K7616m69r586J967M3872
13193G3985o324r670k9038j1442J653J1043R209k4596l2555M702J3255L5317K167
13180C7706o0207k1928J5876L8197M9920m417p156j3032k3526j1457j199Q762
13168G539J5373k1017Q180K0470J8453k0723J4614K233k3945k849K3343n415l3409
13155B847j7405R037L2862J6000J5783J2202O768k9469j2620j4207J3084J0328
$$ plain form
13245 23084 15961 39167 44684 51515 34223 25181 17503 25632 5347 -11702 -18213 -27246 -31949
13232 -31949 6079 30589 26833 28961 19469 33156 27542 30433 32778 13771 18853 9034 54843
13219 54843 83959 92144 42129 34421 28481 34980 52165 39677 2188 3613 -3225 -103 5692
13206 5692 25993 32379 22611 -18059 -26747 -9558 2526 10585 38201 37732 28146 30113 73985
13193 73985 67661 57991 28953 17511 19164 30207 39416 14820 -17735 -13033 222 35539 37706
13180 37706 -22501 -44429 -28553 9644 59564 55147 47991 34959 11433 -24 -1223 7539
13168 7539 22912 1895 10075 30545 48998 28275 42889 45122 21177 18328 41671 36256 2847
13155 2847 -14558 -5521 27341 43341 59124 71326 78094 48625 36005 21798 34882 45210
13143D5210J535j7906j0042j8809j3787M973k515m942K464K6767P514l2736J7297
13130E023J7082n102n581K8218K445m480o82R981r170j5413M432K6777j4738l7882
13116I10K160J9380J9860J0102J8138Q263L194R4k406k7600k5142K1249J1401
13103E9603O37Q901m6327m8843J9344J8753L761P169J4104M156k34j8104K3340
13090D6260M1071o10k4976j468n652K0055Q556j8944J1297K3301o150j5946n623
13077G1171K1087k0849j884M358l753K5903k4406l2130m702R820J0796J3363J7850
13064H6624M694k964J9668O083k4573k3703k7795J0993L466q404r932L5843R65
13051G0965j3968k0162L212L4099Q861m806K2037L562k0352j7461J0159J2454
$$ plain form
13143 45210 46745 28839 18797 -12 -13799 -8826 -11341 -16283 -13819 12948 20462 -12274 5023
13130 5023 22105 17003 11422 39640 42085 37605 36923 46904 37734 22321 26753 53530 38792 910
13116 910 3070 22450 42310 52412 70550 78813 82007 82101 79695 52095 26953 48202 59603
13103 59603 60240 69141 22814 -26029 -6685 12068 15829 22998 37102 41258 41024 22920 46260
13090 46260 87331 86721 61745 60277 54625 74680 83236 64292 75589 98890 92740 76794 71171
13077 71171 92258 71409 69525 73883 70130 96033 71627 39497 34795 44615 55411 68774 86624
13064 86624 91318 88354 108022 114105 89532 65829 38034 49027 52493 44089 34157 70000 70965
13051 70965 56997 36835 40047 74146 83007 78201 100238 103800 83448 65987 76146 88600
13039H8600r942m449J5626k3013k4084M68m388l378j407K5790L3788P239k644
13026I8206j6901J0531Q580k5181n554J7344j4349k3468q503L6282K1111j5285
13014H2813k3898p454K4562j44J2212k3306k3410k2761r178J4072K7960P538j310
13001E7696j5924J3750K5725j1663j717J0732N419J0665M801l0450R827j4649
12989F4212m971j8662J7736k941J144J3370n431Q475J1831R291j3412k0202j8589
12976D1851j8829K1726J5589J0377J2781o530q586J765K1134M145k0710p631k0428
12963D6654n778P282J2706K790L026J4191J8628P718K8323p663l7725l761R647
12950I6038p839N140k0939N196P224n830J0011k600L655j3835q745O74N472L125
$$ plain form
13039 88600 78658 74209 89835 66822 42738 43206 38818 35440 34033 59823 93611 100850 98206
13026 98206 81305 91836 100416 75235 69681 87025 72676 49208 40705 76987 98098 82813
13014 82813 58915 51461 76023 75879 88091 64785 41375 18614 9436 23508 51468 59006 57696
13001 57696 41772 55522 81247 69584 67867 78599 84018 94683 99484 69034 78861 64212
12989 64212 59241 40579 58315 55374 56518 69888 64457 72932 84763 94054 80642 60440 41851
12976 41851 23022 44748 60337 70714 83495 76965 68379 70144 91278 95423 74713 67082 46654
12963 46654 40876 48158 60864 63654 66680 80871 99499 107217 135540 127877 90152 86391 96038
12950 96038 88199 93339 72400 77596 84820 78990 89001 86401 90056 76221 67476 68150 73622 76747
12936G6747N16J9078Q826N39o248L218l5349L867K971j7169j1678J3638K2586
12923H1542l4760j946J5730M505K5557J1557j2551j5382R276o566K854J3465L3475
12910A26756k0845j8834j2103k1556m403J4864Q95n376J0903O110n780R849K0688
12897A01168J6883m30J8349j5076n005J0497k0780q549K7154j9742m4593K6796
12885H6672J7936J4200N232k004j0978J2667m28k3511J4019o248m642j278q87
12872A00750J112J8580J681J2981j1721j4356m755J2648j9604j6310O269P375
12860I4650R928m032J112O587j8839R132J4762M094r346r703M664K1761J8883
12847A43653l803j4145J8781J7224k388j0396j511J866j4151j6313Q09K471j1714
$$ plain form
12936 76747 77263 96341 105167 105706 99458 102676 67327 71194 74165 56996 45318 58956 81542
12923 81542 46782 44836 60566 65071 90628 102185 89634 74252 83528 76962 79816 93281 126756
12910 126756 105911 87077 74974 53418 49015 63879 64774 59398 70301 76411 70631 80480 101168
12897 101168 118051 117621 135970 120894 115889 126386 105606 97057 124211 104469 59876 86672
12885 86672 104608 118808 124040 122036 111058 123725 123297 99786 113805 107557 102915 101637 100750
12872 100750 101862 120442 122123 135104 123383 109027 104272 116920 97316 81006 87275 94650
12860 94650 104578 100546 101658 108245 89406 98538 113300 117394 108048 98345 103009 124770 143653
12847 143653 139850 125705 144486 161710 159322 148926 147415 149281 135130 118817 119626 122097 110383
12834A10383J3871K3943j3507j6467J896o468K091K6218R936j1083l5284J254
12822A06783J3339J2271k4748m520J7188K7921m662L7914K4368l9569j9853p082
12810A39350K0321L5435j6273Q843J5639p806j904M465N803J9259K4652J5222
12798B63006J3107K3659M9604M6517O5524M5474L7098M0441J2395k9023n3977
12787E13825p6215l0713K3318P370P269K4612J36k2010j0166L1919j8496j5612
12775D35237R530K565J5924J7353Oj0605J4412Q984n4191j9318r392J8961J4840
12762D44306r664j7389J1532J6180M0052O6366M8679N9040J06498J45021J88769
12751A099390J97217J47422M8406l6904j07905j35008j54306j31918r1683o7262
$$ plain form
12834 110383 124254 148197 134690 118223 120119 113651 115742 141960 151896 140813 105529 106783
12822 106783 120122 132393 107645 103125 120313 148234 143572 181486 205854 166285 146432 139350
12810 139350 159671 195106 178833 187676 203315 195509 193605 198070 203873 223132 247784 263006
12798 263006 276113 299772 349376 395893 461417 506891 543989 584430 596825 567802 513825
12787 513825 437610 406897 430215 437585 444854 469466 469602 447592 437426 469345 450849 435237
12775 435237 444767 447332 463256 480609 480615 470010 484422 493406 439215 419897 410505 429466 444306
12762 444306 434642 417253 428785 444965 485017 551383 600062 659102 765600 910621 1099390
12751 1099390 1296607 1444029 1492435 1455531 1347626 1212618 1058312 926394 834711 767449
12741G67449k5086k3214p377n534k427m789N591l3030l8569j419K2147J279k2713
12728F32308J0814q626k2300k5585m8128l7300P095J0428k0893k018K4061j111
12716E18745p384j1243q362j7412K9714M5791P0092P7251J4971q9l2052n456k0358
12703F54208l5367o8264o2933m8115j964j5738m8294m0490j828J5695j909k6710
12691C18291n3007L655J0449J4058K4292r860l2468l263P863j0010k1977n505
12679B42518M782n237k6671k0739L680J6148j978o7n842K2811j591o127q872m486
12665B08329K3767J2887J3638m119N606O164j9707j5725j9747k1932j0110J0786
12653A89837J5041J1446K7537j4308N101R140P554j1503k2851J10P775j8404j9706
$$ plain form
12741 767449 742363 719149 711772 706238 703811 699022 704613 671583 633014 631595 653742 655021 632308
12728 632308 643122 634496 612196 586611 538483 501183 508278 518706 497813 495795 519856 518745
12716 518745 511361 500118 491756 474344 504058 549849 619941 697192 712163 712074 680022 674566 654208
12703 654208 618841 550577 487644 439529 437565 421827 373533 333043 331215 346910 345001 318291
12691 318291 265284 268939 279388 293446 317738 307878 275410 272147 280010 270000 248023 242518
12679 242518 247300 242063 215392 194653 198333 214481 212503 212436 206594 229405 227814 221687 212815 208329
12665 208329 232096 244983 258621 254502 260108 266272 246565 230840 211093 189161 179051 189837
12653 189837 204878 216324 243861 229553 234654 243794 251348 239845 216994 217104 224879 206475 186769
12640A86769J03j713n233Q804J613q030k6488K7738J6516M331o348j2700N096
12627A90458r015R557O458L0P62j0500J1357l229k3736N2742M0871L821j7701
12614B51875k1519O429q551k3849n439l312K0835J2815q818l78j363N573j0373
12601B13925K2294K8966r298j7112o334j558j1201q333L075L77K025J1145J6440
12588B44411o666j1197R642j3714j4018K4566M0242J5668n96j4295l9594j1148
12576B23301l134K656k1124K7565j4638j5176j020j89k744M2333M8404K1715R212
12563C17161J3140K3784J812m3508j5645L126K9635J076J826J204j4373K3784
12551C43022R840j5636q299J1336j1429o131J2291k1379k9718j2577M2123m72
$$ plain form
12640 186769 186872 185159 179926 188730 190343 182313 155825 183563 200079 204410 198062 185362 190458
12627 190458 181443 191000 197458 197488 198250 187750 199107 195878 172142 224884 265755 269576 251875
12614 251875 230356 236785 228234 204385 198946 195634 216469 229284 220466 220088 218725 224298 213925
12601 213925 236219 265185 255887 238775 232441 230883 219682 211349 214424 214801 216826 227971 244411
12588 244411 237745 226548 236190 222476 208458 233024 273266 288934 288338 274043 234449 223301
12576 223301 220167 222823 201699 229264 214626 199450 198430 198241 195497 237830 286234 307949 317161
12563 317161 330301 354085 355897 312389 296744 299870 329505 330581 332407 333611 319238 343022
12551 343022 352862 337226 328927 340263 328834 322703 334994 313615 283897 271320 313443 312971
12539C12971j4872o34Q322N734K4051l93j928k1549M606p893P121K0861j5510
12526C20887J7745k3948j6533K3316K7440j014J3370K3399k31K990L245j3164
12514C77502l4282p700O515N5539K3841p312j8343j4695j4150k4263J2431m365
12502C50718k6027J4622R632N225J1367j360J7906N6350J6113n389j3284j1027
12490D24846M691k047m543N69l66J1995K4214M080J9122L6873L0848L1586j9384
12477E62484l1148R169R833k6354l611o79j861J1704J7775Q624K6782j0259k2855
12464E49604J7558K7272L8793K0741L9926J1312j1754L0621J9104J1623J3229
12453G68029j6450m949K1629L3414m043J1558K2355K4012M0560O5099M6324L6988
$$ plain form
12539 312971 298099 297465 305787 311521 335572 335179 333251 311702 316308 308415 315536 336397 320887
12526 320887 338632 314684 298151 321467 348907 347893 361263 384662 384431 387421 390666 377502
12514 377502 343220 335520 342035 397574 421415 414103 395760 381065 366915 342652 355083 350718
12502 350718 324691 339313 348945 354170 365537 364177 382083 438433 454546 449157 435873 424846
12490 424846 429537 427490 422947 423516 423150 435145 459359 463439 482561 519434 550282 581868 562484
12477 562484 531336 540505 550338 523984 520373 519694 517833 529537 547312 555936 582718 572459 549604
12464 549604 567162 594434 633227 653968 693894 705206 693452 724073 743177 754800 768029
12453 768029 751579 746630 768259 801673 797630 809188 831543 855555 896115 961214 1007538 1044526
12441A044526N6245M6606L9066K9223L6198K7000M0991M822j0784J631J1915K3016
12429A350455J0335O2799P1735J39180J24640J68938K05704J29704J27948J25852
12419B517290J06405L9632O5349J4089m0331n8423m0230l6918k1861k6725l0483
12408B487794j1107N5968J14724J50846J58348J20373N7645q625q0915n6508p8410
12397B910133m0688n2417n0971k5774q694J1142k325L7636N6843Q7485J15351
12386C037721J45743J79828K60395L47846M00976M22516M33684M01878L65733
12377E996320L56469L42480L52605M19830M57578N65927O85980P86994Q80009
12368A0844192Q18273O70602M59537K72385K19563K36859L67445N32276O96242
$$ plain form
12441 1044526 1100771 1147377 1186443 1215666 1251864 1278864 1319855 1324677 1313893 1315524 1327439 1350455
12429 1350455 1360790 1423589 1495324 1634504 1759144 1928082 2133786 2263490 2391438 2517290
12419 2517290 2623695 2663327 2728676 2742765 2702434 2644011 2603781 2566863 2545002 2518277 2487794
12408 2487794 2476687 2532655 2647379 2798225 2956573 3076946 3134591 3125966 3045051 2988543 2910133
12397 2910133 2869445 2817028 2766057 2740283 2731589 2742731 2740406 2778042 2834885 2922370 3037721
12386 3037721 3183464 3363292 3623687 3971533 4372509 4795025 5228709 5630587 5996320
12377 5996320 6352789 6695269 7047874 7467704 7925282 8491209 9177189 9964183 10844192
12368 10844192 11662465 12333067 12792604 13064989 13284552 13521411 13888856 14421132 15117374
12359A5117374R34521J352293K009552L008558M478459O430516Q835401J1351395
12351E3518069J3271881J3707089J1350508N727174j832313q364256j1323323
12344G6054829j0563100p734508m577888k057055m71537M40048J097717J908515
12336E4097021K825003L469611L466910K637512J224564j31710p22733l56109
12328F6510069O43254J698112K616228L402497L840391L623815K542362Q12702
12320H5689430q69959j881095j934660j063250O06938K567898M569667P086400
12312I4771369J0986232J7095866K5457578L4193900L9166504L5127926J9224091
12305B76023466m314790k5472002l5594610l4137666k6650906j8638355j2328493
$$ plain form
12359 15117374 16051895 17404188 19413740 22422298 26900757 33331273 42166674 53518069
12351 53518069 66789950 80497039 91847547 97574721 95742408 87378152 76054829
12344 76054829 65491729 57757221 53179333 51122278 50650741 51090789 52188506 54097021
12336 54097021 56922024 60391635 63858545 66496057 67720621 67588911 66866178 66510069
12328 66510069 67153323 68851435 71467663 74870160 78710551 82334366 84876728 85689430
12320 85689430 84819471 82938376 81003716 79940466 80547404 83115302 87684969 94771369
12312 94771369 105757601 122853467 148311045 182504945 221671449 256799375 276023466
12305 276023466 271708676 246236674 210642064 176504398 149853492 131215137 118886644
12298A18886644p906992m787246k212676M2114J744286K459463J920355M00702
12290A10546650j648599l523076m561793m480342l682757k654758j649287o76400
12282H7669638M7781J91591m74675j729534k862760l362884l093923k347972j495861
12273G2541401o67271M5747R31760K487581N037979Q347813J1453256J2661068
12265A12839334J0346517M060819m268733j1209384j4435796j4153666j2019607
12258G1159484r439643o989317m917114l383135k292292j619529j226903r98610
12250D0292941r22345q58169q61228q87247r55778j061743j221154j356000j412978
12241C0756299j393188j294930j200969j059572r77217q90149q36918q16430q24367
$$ plain form
12298 118886644 110979652 106192406 103979730 104021844 105766130 108225593 110145948 110546650
12290 110546650 108898051 105374975 100813182 96332840 92650083 89995325 88346038 87669638
12282 87669638 87717419 87909010 87434335 85704801 82842041 79479157 76385234 74037262 72541401
12273 72541401 71874130 71919877 72851637 75339218 80377197 88725010 100178266 112839334
12265 112839334 123185851 127246670 122977937 111768553 97332757 83179091 71159484
12258 71159484 61719841 54730524 49813410 46430275 44137983 42518454 41291551 40292941
12250 40292941 39370596 38512427 37651199 36763952 35808174 34746431 33525277 32169277 30756299
12241 30756299 29363111 28068181 26867212 25807640 24830423 23940274 23103356 22286926 21462559
12232B1462559q58096q84043q33398p86503p51763o55846n34764m82610m21056
12223A5254480m20849m07315l99889l72833l72657l03624k74187k27418k06011
12214A2269697k08018k32754k19508k18287k44749k57733k66635l38408l27289
12205I956316k80062k28979j97458j85828j39948j13686j36062j54696j39927
12196H379670j22872j30707j56455j93687j94203k25488k33434k70574l00800
12187F551450k80844k48363k22883k10647j43572j70241j70191j51275j65650
12178D787784j45180j54947j32654j32835j41374j36424j33924j37420j13168
12169C559858j15241j12179j10537r5366j34079j27283j06708r9085o1598n8268
$$ plain form
12232 21462559 20604463 19720420 18887022 18100519 17348756 16692910 16158146 15675536 15254480
12223 15254480 14833631 14426316 14026427 13653594 13280937 12977313 12703126 12475708 12269697
12214 12269697 12061679 11828925 11609417 11391130 11146381 10888648 10622013 10283605 9956316
12205 9956316 9676254 9447275 9249817 9063989 8924041 8810355 8674293 8519597 8379670
12196 8379670 8256798 8126091 7969636 7775949 7581746 7356258 7122824 6852250 6551450
12187 6551450 6270606 6022243 5799360 5588713 5445141 5274900 5104709 4953434 4787784
12178 4787784 4642604 4487657 4355003 4222168 4080794 3944370 3810446 3673026 3559858
12169 3559858 3444617 3332438 3221901 3126535 2992456 2865173 2758465 2659380 2597782 2539514
12159B539514r1096o5310l0649n3112o6526p0745o6114r1618p6607m8155l8092
12148A841490n0439q7279j01928k7580k5220m512m5546l9464o556l4386o7860
12137A350720n7837m8901m0107l2059m1002k8492k0167k4244k1222m6382k6047
12126I64260M170m219j4890j5137O512l6428n8797m2148k858K3089q888j1485
12114H03181o424J1885M410j9417j9212p602J3821k4967m6001j9429j6100m185
12102F69960o024j2500k977J039j394j4381N172J3801j526j6461k4039o819j2347
12089E91504J5841K3036J5189J2261J5766R688j6458n500j5453k8036m101L4636
12077F48373p108m6432r06M1507R881k136J1516J2180L8812J6164Q749L414j6114
$$ plain form
12159 2539514 2448418 2383108 2352459 2299347 2232821 2162076 2095962 2004344 1927737 1879582 1841490
12148 1841490 1791051 1703772 1601844 1574264 1549044 1544532 1498986 1459522 1452966 1418580 1350720
12137 1350720 1292883 1243982 1203875 1171816 1130814 1102322 1082155 1057911 1036689 990307 964260
12126 964260 968430 964211 949321 934184 940696 904268 845471 803323 800465 823554 814666 803181
12114 803181 796757 808642 813052 793635 774423 766821 780642 755675 709674 690245 674145 669960
12102 669960 663936 651436 648459 649498 648104 633723 638895 652696 651170 634709 610670 603851 591504
12089 591504 607345 630381 645570 657831 673597 683285 666827 661327 645874 617838 613737 648373
12077 648373 641265 594833 593927 635434 645315 643179 654695 666875 705687 721851 730600 734014 717900
12064G17900k1863k8023m4072l1981k8607N995M097k2814j9719l136N961K516
12052E36254J0485K9592Q857k4545l6329J3660j7382j437J3232j4637n7787l6425
12040D23538k1108j9414J8353M000j7981O035K2991j0465n4859O275j6784K3742
12028C64323J1757K5580P78l968k28l8240l0341j0056k0799k3456o060J2891j2898
12015B69283k6021k8198o948P790O005L6435J8597M620l7026P63o524m649J36
12002B34263m762o05n969o066n032j1576l8019j9245j5313k0634Q078J8056J698
11989A34874j8237M791J26j1565l4135K1848L066q206n494K946K435J7065k896
11976A06618j5259M907J983M357j145l0097K755q864j0082M759K9355r205k1058
$$ plain form
12064 717900 696037 668014 623942 591961 563354 569349 573446 550632 530913 527777 533738 536254
12052 536254 546739 576331 585188 560643 524314 537974 520592 519155 532387 517750 459963 423538
12040 423538 402430 383016 401369 405369 387388 393423 416414 405949 351090 357365 340581 364323
12028 364323 376080 401660 402438 398470 398242 360002 329661 319605 298806 275350 269290 282181 269283
12015 269283 243262 215064 208116 215906 221911 258346 276943 281563 244537 245300 238776 234127 234263
12002 234263 229501 228896 222927 216861 211829 200253 162234 142989 127676 107042 115120 133176 134874
11989 134874 116637 121428 121554 109989 75854 97702 100768 92562 87068 90014 92449 109514 106618
11976 106618 91359 96266 98249 102606 101461 71364 74119 65255 55173 59932 89287 80082 59024
11963E9024j2182L6862J4564o650j0679k1977o929P656j8212j6072j681J1883
11951C5607K0797K404L1068j456J854p409J0706o038o758n91J5464J0191m6255
11938E9584J1498K6085j9743m4518K5j9539M368L3348L1943R252j1786k8252J2375
11925F4640J5466m741R389o10l702P470J5414o067k1977J1929J1676J1812P185
11912A17884J3454J3001J8544K0010j7154j6580J7376J5239J6863M4086M5370
11901B88093N3722N6865R1291K6697J0748r18l5845n0674m4048l6127m2719p599
11889C09486J0908K8737J4754j7679j024L210J273J0517k734J1005k1351R161
11877C56263J4227P118L5054J7298J4945M2180J1843q864L6361Q336j1027l299
$$ plain form
11963 59024 46842 83704 98268 91618 80939 58962 52033 59689 41477 25405 23724 35607
11951 35607 56404 58808 89876 88420 90274 82865 93571 87533 80775 80184 95648 105839 59584
11938 59584 71082 97167 77424 32906 32931 13392 17760 51108 83051 92303 80517 52265 64640
11925 64640 80106 75365 84754 84144 80442 87912 103326 97259 75282 87211 98887 110699 117884
11912 117884 131338 144339 162883 182893 165739 149159 166535 181774 198637 242723 288093
11901 288093 341815 398680 489971 516668 527416 526498 490653 439979 395931 359804 317085 309486
11889 309486 320394 349131 363885 346206 345182 348392 349665 360182 357448 368453 347102 356263
11877 356263 370490 377608 412662 429960 444905 487085 498928 490064 526425 534761 523734 520435
11865E20435o63J105J2856K9142O1217J18130J40656J44702J40763J76436Q5906
11854A430685j3753q9208j35978j72461j61753j24971p4324m4415m0991p3481
11844D99350n781o422m4110n8968j0839J1676J6236M0655J7648J0713K9261L065
11832E02484l5535l0183q727J4730q842p983L8666L7286J6291j6431k7017m605
11820D70134j8502k5424J7350L9195K7490J3266K3525M7771J5027j8490n1579
11809E39763r1314p5388n8770k9905l7796N610K6739P793k3526m5501l4123k0356
11797A63226m1194N070K4972K7036Q899J5481l4114k5389O736M613j9476j9923
11785A15937J2568M3908k4158q331k1926o740J9535k5219r935L9001q901k1407
$$ plain form
11865 520435 519772 520877 533733 562875 624092 742222 882878 1027580 1168343 1344779 1430685
11854 1430685 1416932 1327724 1191746 1019285 857532 732561 658237 613822 572831 499350
11844 499350 493569 487147 443037 384069 373230 384906 401142 441797 459445 470158 499419 502484
11832 502484 466949 436766 428039 442769 433927 425944 464610 501896 518187 501756 474739 470134
11820 470134 451632 426208 443558 482753 510243 523509 547034 594805 609832 591342 539763
11809 539763 448449 373061 314291 284386 246590 252200 278939 286732 263206 217705 183582 163226
11797 163226 122032 127102 152074 179110 188009 203490 169376 143987 150723 155336 135860 115937
11785 115937 128505 172413 148255 139924 117998 111258 130793 105574 95639 134640 125739 104332
11773A04332M992L440K656p234k346k0042l2074l3508R79J0362j2037J3535J9433
11760E2488M580j5649R616K0961k6104k4062j5406K7637K8873J9282m318k9427
11748D8471l1942m928L2983l6732k5749K8507O214j4352N2776J5015r127j7452
11736D3684l6759p478L1996J0209j2156k112J8722K5118n500j0942l660Q595k2272
11723C7445n209J952k9239j8718J6796N467J0687j0860r236L1529M092J9650J3910
11710F8266p475j3983o065M257q741j5392N929J6536o429J2369O885k642j3048
11697D0467m8004K500L9562J2006p064m633m1544l1221R038K1561M472O004J1322
11684A4466j9274k0615N884Q14j4837j0554J6312J163k1364P220J7788J1434M032
$$ plain form
11773 104332 109324 112764 115420 108186 105840 85798 53724 20216 21195 31557 19520 33055 52488
11760 52488 57068 41419 51035 71996 45892 21830 6424 34061 62934 82216 77898 48471
11748 48471 16529 11601 44584 7852 -17897 10610 16824 2472 55248 70263 61136 43684
11736 43684 6925 -553 31443 41652 29496 27384 46106 71224 65724 54782 51122 59717 37445
11723 37445 32236 34188 4949 -13769 3027 8494 19181 8321 -915 30614 34706 54356 68266
11710 68266 60791 46808 40743 45000 36259 20867 26796 43332 36903 49272 56157 53515 40467
11697 40467 -7537 -5037 34525 46531 39467 34834 -6710 -37931 -28893 -7332 -2860 3144 14466
11684 14466 -4808 -25423 -19539 -18725 -33562 -44116 -27804 -26641 -48005 -40785 -22997 -11563 -7531
11671g531J385j8786l0731k2918L3415L4958M958k1119P009J8930O950M69n982
11658A007J9411K4990j5456j2181p347k0207P716J2621k3488k0774l801P364j2043
11645d2188P13j2720m215R653P557n57J1483L4576J4868P397L211r757j4379j2611
11631f969k041K5266K9244p806j7934k4392j4335p863P964J9650j9657l6641p680
11618f3194J696M3031K0750j540j7533J1637J4796n366l4763k1377J3262L7217
11606a384j1869k199q972K1641Q340L644R452l703m6486k2359J6635P867j4360
11593d3753P823K1845J0471M144M206K823l1536l1757J1436l467N10J5611K0539
11580a1105J6953K122R511J4758K4676l4342k6539K6463P462n90Q681J1728k1416
$$ plain form
11671 -7531 -6146 -24932 -55663 -78581 -45166 -10208 -5250 -26369 -19360 -430 6520 6989 1007
11658 1007 20418 45408 29952 17771 10424 -9783 -2067 10554 -12934 -33708 -37509 -30145 -42188
11645 -42188 -41475 -54195 -58410 -48757 -41200 -41757 -30274 4302 19170 26567 29778 20021 5642 -6969
11631 -6969 -9010 16256 45500 37694 19760 -4632 -18967 -26830 -18866 784 -18873 -55514 -63194
11618 -63194 -61498 -18467 2283 743 -16790 -5153 9643 4277 -30486 -51863 -38601 -1384
11606 -1384 -13253 -15452 -24424 -2783 5557 9201 18653 14950 -31536 -53895 -37260 -29393 -43753
11593 -43753 -35930 -14085 -3614 530 4736 7559 -23977 -55734 -44298 -47765 -47255 -31644 -11105
11580 -11105 5848 7970 17481 32239 56915 22573 -3966 22497 29959 29369 38050 49778 28362
11567B8362l4745l430j1803J6620M765j9351oK620r080R417K0549K4601p943k81
11553B0295k3610j0698k4908J9963K1802L719m78N29k2614K913R572k0914k5514
11540d9943M947j587j1324K0431j1225n264J5241L714L7337K5595k8498R640j8335
11527i271j1670o586m82j726M867K6966Q898M370J2041K5845j3644k0159Q0j3520
11513F009j1711K6301K3043j9307k9341j6216J8453J7031n404j64o672k3313K210
11500a9081J5775q888R894o948j2558K0638L0242M3120l757j21O975m2188N21
11487C3624P310j3911j1793j808p290l1235j2599J2857K1852L0293n040m0504
11475a8244j4575N787j3194M746J6326k0131J3288J60k2825m084L0676J7508k8674
$$ plain form
11567 28362 -6383 -9813 -21616 -4996 -231 -19582 -19588 -16968 -26048 -16631 3918 28519 20576 20295
11553 20295 -3315 -14013 -38921 -18958 2844 6563 6085 6614 -16000 -13087 -3515 -24429 -49943
11540 -49943 -44996 -46583 -57907 -37476 -48701 -53965 -38724 -35010 2327 27922 -576 9064 -9271
11527 -9271 -20941 -27527 -28009 -29735 -24868 2098 10996 15366 27407 53252 39608 19449 19529 6009
11513 6009 -5702 20599 43642 24335 -5006 -21222 -2769 14262 8858 8694 2022 -21291 -19081
11500 -19081 -3306 -12194 -2300 -9248 -21806 -1168 29074 72194 68437 68316 75291 33103 33624
11487 33624 40934 27023 15230 13422 6132 -25103 -37702 -24845 -2993 27300 22260 -18244
11475 -18244 -32819 -27032 -40226 -35480 -19154 -39285 -25997 -25837 -48662 -52746 -22070 -4562 -33236
11462c3236l0576L867J9170M836j1246K2763J4159K0683r64L64R529K1029L319
11449D3697j483n355m327j2324k4573l6070K132L3142o384q16K5000J7740J845
11436C2224j0724l6031j6399J9188J0802q064L107J4785k5566p749R210K589r446
11423b2074j4979J1392J2293N511k8905j9718J5131J6783n466j5702j7375J3087
11411e0022k718M66L291q806M132L1103L1514J4821J603L391k6636j0101J5307
11398G345K606j1659L031K3185N321j1695l7099J2257m3883m321K8029J7214K0510
11385A0841R130J7343j3255O641k8963J3223j3569m1903J0538O174K2080m838
11373f558j0802p727Q300J3311j5805J0528J4653K7270J371J6553l4336l6347
$$ plain form
11462 -33236 -63812 -59945 -40775 -35939 -47185 -24422 -10263 10420 9456 9820 19349 40378 43697
11449 43697 42214 36859 32532 20208 -4365 -40435 -38303 -5161 -11545 -12361 12639 30379 32224
11436 32224 21500 -14531 -30930 -11742 -940 -9004 -5897 8888 -16678 -24427 -15217 -12628 -22074
11423 -22074 -37053 -25661 -13368 -7857 -36762 -56480 -41349 -24566 -30032 -45734 -63109 -50022
11411 -50022 -52740 -52274 -48983 -57789 -53657 -22554 8960 23781 25384 28775 2139 -7962 7345
11398 7345 9951 -1708 1323 24508 29829 18134 -18965 -6708 -50591 -54912 -26883 -9669 10841
11385 10841 19971 37314 24059 30700 1737 14960 1391 -40512 -29974 -23800 -1720 -6558
11373 -6558 -17360 -25087 -16787 -3476 -19281 -8753 5900 33170 34541 51094 16758 -19589
11361a9589M6206L3995k2884l9555K426k133j4644J0619Q619k2630j2417j9757
11349e1744Q580M3176J8383J5406K77J1782j1178k2604P357L966r614j4209q887
11336i309J4041Q93J9537j1685o552j8611l839j784n88L1972L3155r33j0781K2385
11322E7901q559n259l9733k1409j9491k3722K147J7728j1032n584M1378J9825
11310D190J7509j311k4333P208J2214J0207l8336k5844J8715L1153n002j8554
11298a2184m7106j2402K1461M2487L1543J9588J3144j4194j4894k9705l0047q524
11286d0833n967j28j0801J3539m76J4128J1134m636j9167j3776M5040L3914j290
11273B0681K88Q718P473k69j5663j8128p177P690R18J2918k2516J6262J5401j2588
$$ plain form
11361 -19589 26617 60612 37728 -1827 599 -1534 -16178 -5559 3060 -19570 -31987 -51744
11349 -51744 -43164 12 18395 33801 34078 45860 34682 12078 19435 23401 13787 -422 -9309
11336 -9309 4732 5625 25162 13477 6925 -11686 -15525 -17309 -17897 14075 47230 46297 35516 57901
11322 57901 49342 44083 4350 -17059 -36550 -60272 -58125 -40397 -51429 -57013 -15635 4190
11310 4190 21699 20388 -3945 3263 15477 25684 -12652 -38496 -19781 11372 6370 -12184
11298 -12184 -59290 -71692 -50231 -7744 23799 43387 56531 42337 27443 -2262 -32309 -40833
11286 -40833 -46800 -46928 -57729 -44190 -44666 -30538 -19404 -24040 -43207 -56983 -11943 21971 20681
11273 20681 20969 29687 37160 36891 21228 3100 -4077 3613 4531 17449 -5067 11195 26596 14008
11259A4008J1358j451m751r480j1580p879J3818J5002M689j0775J7363J4142k5430
11246A9034o762j314P867Q089l0843J3993K0980R858j3371L3235K1199o606m8160
11233B7199l2110l397K1762n535j0342J038j6470K565M5589J5468k3830j2841
11221I096q578j2063j5910Q089J8660p242j1739n490K996K5142K4481k23n531
11208B1688K3606R759j1595k9514k9203l557o302J6994J8997k1611k2717J7788
11196a5667K1999N149k125q271P856k001Q526k2454q71N043n654K0554R708j9019
11182B773N443N559j6140j1011N421J752J5236k3744R520K3324J604j7471O784
11169I050j5974j0042J7822j2131k5518j1461K9172J9482p660M040J696j0220
$$ plain form
11259 14008 25366 23915 19164 9684 -1896 -9775 4043 19045 23734 12959 30322 44464 19034
11246 19034 12272 10958 18825 26914 -3929 10064 31044 40902 27531 60766 81965 75359 27199
11233 27199 -4911 -8308 13454 7919 -2423 -1385 -17855 -15290 30299 45767 21937 9096
11221 9096 518 -11545 -27455 -19366 -706 -7948 -19687 -25177 -22181 2961 27442 27219 21688
11208 21688 45294 55053 43458 13944 -15259 -18816 -25118 -8124 10873 -10738 -33455 -15667
11196 -15667 6332 11481 9356 1085 8941 6940 15466 -6988 -7859 -2816 -8470 12084 21792 2773
11182 2773 8216 13775 -2365 -13376 -7955 -6203 9033 -14711 -5191 18133 19737 2266 9050
11169 9050 -6924 -16966 856 -11275 -36793 -48254 -19082 400 -7260 -3220 -1524 -11744
11157a1744l154J9104O425O946L790Q352j7142N349J387J2702P11j1258m658o463
11143A0347k7715j5730K8686r51J998Q074N531O976Q743m874K523R031p628j2993
11129A2018j1222j4103R625j1662n712l9277J2633Q565J5136j857r120K1955J1591
11116a430J9061k1735L914K1976k8374J3015L0058J4036N122k402k4924m1637
11104a3320j5818K035J9078j1540J84K5455P951j3310m633n626K190J0609J0842
11091A4097J059k000P071j0111J323J1797M920J201l940k4237k556P654L799J6036
11077B6113l743o656J2110M311K3321J2463j775k4942l4705k3673K1922L0372
11065C5118k243q765j0705M163K9530J6890k4304q278J5734j2097l8496k0132
$$ plain form
11157 -11744 -14898 4206 10631 17577 21367 29719 12577 17926 19313 32015 32726 21468 16810 10347
11143 10347 -17368 -33098 -4412 -5363 -3365 4709 10240 17216 25959 21085 23608 32639 25011 12018
11129 12018 796 -13307 -3682 -15344 -21056 -60333 -47700 -39135 -23999 -25856 -34976 -13021 -1430
11116 -1430 17631 -4104 -190 21786 -6588 6427 36485 50521 55643 53241 28317 -13320
11104 -13320 -29138 -27103 -8025 -19565 -19381 6074 14025 715 -3918 -9544 -7354 3255 14097
11091 14097 15156 13156 20227 10116 11439 23236 28156 29357 25417 1180 -1376 6278 10077 26113
11077 26113 22370 15714 27824 32135 55456 67919 66144 41202 6497 -17176 4746 35118
11065 35118 32875 24110 13405 17568 47098 63988 39684 31406 47140 35043 -3453 -23585
11053b3585j8657M984K4184K5162o787P890K1689R15N946l1065K03Q182j4714
11040D347J5926J4854M391j5121N777q26k0787N681j0858j0686J3967J3844J8031
11027C8540j6245N371k1o950m059m2265N126K5075j1325k9591J6046l0501j5225
11014f6024J1648L8024K5994j1662j2663J0225K1510o255P073M75J5011O084j5936
11001B3504l382L81r534j9898j2626L0578j6952q878o438J4164K5243R450O536
10988C2148k0159m0136Q564k205j0682l4069Q995L6441J7511L705p296K3679M143
10975B0639J7358m314N202l378K764q645l9967K021p466K1621K2453J8509P671
10962E4468k9986m210J1538K211j5747N225J3517k813j9458J3881K7746l356N638
$$ plain form
11053 -23585 -42242 -37258 -13074 12088 5301 13191 34880 35795 41741 10676 10879 19061 4347
11040 4347 20273 35127 39518 24397 30174 29348 8561 14242 3384 -7302 6665 20509 38540
11027 38540 22295 27666 27645 20695 16636 -25629 -20503 4572 -6753 -36344 -20298 -50799 -66024
11014 -66024 -54376 -16352 9642 -2020 -14683 -4458 17052 10797 17870 18345 33356 39440 23504
11001 23504 20122 20503 10969 -8929 -21555 9023 -7929 -16807 -23245 -9081 16162 25612 32148
10988 32148 11989 -28147 -19583 -21788 -32470 -66539 -57544 -21103 -3592 113 -7183 16496 20639
10975 20639 37997 33683 38885 35507 38271 29626 -10341 -8320 -15786 5835 28288 46797 54468
10962 54468 24482 20272 31810 34021 18274 23499 37016 34203 14745 28626 56372 53016 58654
10949E8654K374l9891k4197J4473M45n049M862N051J0859j4433p867j8356P941
10936e134K8825K273j6146K569K6921J2377J6224q128k4820j6503l6532J0778
10924g296J3023p74r666M461L3339L794M364j6634k3387k8148O556J1703M7394
10911C8729J4919R181N088k257m4739m311N295j0851M948J4634J5571J2956j6702
10898D2461l5135n150L4436k6129p170J4278m666o718J123J7856L1168K397m3348
10885A5403l0523L345j1481L2408N30O665J9884L50j8046j5210q245P875J1577
10872A4532j1841J4775o78o870J8389p00k5594j1035K12J236j0693J8564o558
10859f261K0276P276J1242N023j5713P843P029j3408L8625r076k1708j1358k2962
$$ plain form
10949 58654 61028 21137 -3060 11413 11858 6809 11671 16722 27581 13148 5281 -13075 -5134
10936 -5134 23691 25964 9818 12387 39308 51685 67909 59781 34961 18458 -18074 -7296
10924 -7296 5727 4953 -4713 -252 33087 36881 41245 24611 1224 -26924 -20368 -8665 38729
10911 38729 53648 62829 67917 65660 20921 16610 21905 11054 16002 30636 46207 59163 42461
10898 42461 7326 2176 36612 10483 3313 17591 12925 6207 7330 25186 56354 58751 15403
10885 15403 -15120 -11775 -23256 9152 9682 16347 36231 36581 18535 3325 -4920 2955 14532
10872 14532 2691 17466 16788 9918 28307 27607 2013 -9022 -8810 -7574 -18267 297 -6261
10859 -6261 14015 21291 32533 37556 21843 29686 36715 23307 61932 52856 31148 19790 -3172
10846c172N09P672J9593K4506P449k3898o580k6912k0055J2467j066j0772q962
10833b9221M7437K3708J4130J2821k8754l5541J1759m740M130k3433k1482J8296
10821a0890J8081K7024n002k9318k014K4419L2853k8467k4395l2835j815L4512
10809B153L4454L006J3305J280K325R62j2617k7379k8425k181K3580P701K703
10796B0867N167P970K2023j4423M932J7175R792q876p008k8772J6757J0602j4089
10783D2117j1519K6363k8495K574M4493K5527m180r546o939k1440j0420J3361
10771F1896K50r074l0934k1657J6996L2033j527P728j3548J5481J1863j3099r1
10758E6317K2085k118k996j3450Nj8059n28J3301M7466J9992K364p873k8902k8876
$$ plain form
10846 -3172 -2663 5009 24602 49108 56557 32659 26079 -833 -20888 -8421 -9487 -20259 -29221
10833 -29221 18216 41924 56054 68875 40121 4580 16339 11599 15729 -7704 -29186 -10890
10821 -10890 7191 34215 29213 -105 -2119 22300 55153 26686 2291 -30544 -32359 2153
10809 2153 36607 39613 52918 54198 56523 57485 44868 17489 -10936 -13117 10463 18164 20867
10796 20867 26034 34004 56027 41604 46536 63711 73503 64627 57619 28847 45604 56206 42117
10783 42117 30598 56961 28466 31040 75533 101060 96880 87334 80395 58955 48535 61896
10771 61896 62146 53072 22138 481 17477 49510 47983 55711 42163 57644 69507 56408 56317
10758 56317 78402 76284 73288 59838 59843 41784 41256 54557 102023 122015 124379 116506 87604 58728
10744E8728j6775p538J0262K5390J323o340p555O666j9936j0434K119L3735K6222
10731I5867o707m20L3682k2531q057l3675q874J2433Q921j3917o376k6365k170
10718B1811J9309J1935M298k0352q616J7733m140j9140q131J2176M4554J2203
10706H3640q836n175J1559j3430j2824j905m506k184p289j7977n310K732R203
10693B7698J5737L5684J2585L538j1582l808l3184m529O034L182M10K517j9156
10680C5126l704j9294K948M1029k0870p304J7518K1q806l0916M179k178n279K2821
10666B5291J0227p070o961L9692Q994j1212j124Q324j8828K0786m764j1739j503
10653E0113j8002j9333M783Q553J1951J901j0337k274J6745n903o770K0506J7276
$$ plain form
10744 58728 41953 34415 44677 70067 71390 65050 57495 64161 44225 33791 35910 69645 95867
10731 95867 89160 88740 122422 99891 91834 58159 49285 61718 70639 56722 50346 23981 21811
10718 21811 41120 53055 57353 37001 28385 46118 41978 22838 14707 26883 71437 83640
10706 83640 74804 69629 81188 67758 54934 53029 48523 46339 39050 21073 15763 18495 27698
10693 27698 43435 79119 91704 95242 83660 79852 46668 42139 48173 51355 51765 54282 35126
10680 35126 31422 12128 15076 56105 35235 27931 45449 45470 36664 5748 9927 7749 2470 25291
10666 25291 35518 28448 21487 61179 70173 58961 57837 66161 47333 68119 63355 51616 50113
10653 50113 32111 12778 17561 26114 38065 39966 29629 27355 44100 38197 31427 51933 69209
10640F9209l0208r368P82J8536K4009m453j6295L20j6918J7465M228J517m330
10627E4494N31J0415J0326j5839k3936j0495k360J2783L640J6724J773k9131J0248
10614C9173N059j3145j1615k371L506j886K0364J5540m844l3644J0403J8753J2817
10601E8110J5605J4101j1907m42J1243R9j4127j8694j4017k0877J0281K2275L028
10588E4678j277J0983J9482j4726K39J0432L086K5519j524j1152p100Q540R524
10575A06704k0005k3360n998K2915L8256m982k0256J55j6156O023K1677L33k7581
10562G7725L58N708Q315k280N174J5776p107j3152N305k32n43l095p564J6632
10548A01020J308j5744j589k0868r303K070K7308R178J1742P731o894j6418o732
$$ plain form
10640 69209 39001 29633 30415 48951 72960 68507 52212 52532 35614 53079 57307 58824 54494
10627 54494 55025 65440 75766 59927 35991 25496 23136 35919 39559 56283 58056 28925 39173
10614 39173 44232 31087 19472 17101 20607 18721 39085 54625 49781 16137 26540 45293 58110
10601 58110 73715 87816 75909 75467 86710 86809 72682 53988 39971 19094 29375 51650 54678
10588 54678 53401 64384 83866 69140 69379 79811 82897 108416 106892 95740 88640 97180 106704
10575 106704 86699 63339 57341 80256 118512 113530 93274 93429 77273 83296 104973 105306 77725
10562 77725 78083 83791 92106 89826 95000 110776 103669 90517 95822 95590 95047 91952 84388 101020
10548 101020 102328 86584 84995 64127 54824 56894 84202 93380 105122 112853 105959 89541 82809
10535H2809l0293l2391J9447K0015k1515j864J9397L4456q290m296J5428K0998
10523A13901l5699n9649p884L9239L0446J5802j8610m803R092j2799m631J3188
10511G7593j2858K1837p849r268K566k7309m039P066Q535K4345L229P568j1268
10498H0148J6366q783o363j6422k3143K7700J5994j6248j2677K5832r178j288
10486G1938k279P953j2376N645k1660n267O393R48K6964J9993n047j2912k9744
10473E0549M358N477J4211M677L2870R437o718k1848j133K9404m817p609l993
10460A04865J0147j1968r9L277K3047Q429j8669j900k237J5069J7210k6581l2048
10447H8542j7767j1535J8837L9200K3134p446m956p119J3863j0904j4939J4651
$$ plain form
10535 82809 52516 20125 39572 59587 38072 36208 55605 90061 81771 77475 92903 113901
10523 113901 78202 18553 10669 49908 80354 96156 77546 72743 81835 69036 64405 77593
10511 77593 64735 86572 78723 69455 72021 44712 40673 47739 56274 80619 83848 91416 80148
10498 80148 96514 87731 81368 64946 41803 69503 85497 69249 56572 82404 73226 71938
10486 71938 69659 77612 65236 70881 49221 43954 50347 51295 78259 98252 93205 80293 50549
10473 50549 54907 60384 74595 79272 112142 121579 114861 93013 91880 121284 116467 108858 104865
10460 104865 115012 103044 102945 106222 129269 137698 119029 117129 114892 129961 147171 120590 88542
10447 88542 70775 59240 78077 117277 140411 132965 128009 120890 134753 123849 108910 123561
10435A23561J1674k9500P737N990K0216O280j2035j8048L238N66l723l8201j1801
10422F5954L2110N152j1838P99J2794j3510j3889M057q453M080J4896K395J03
10409I4650J0857K3365r121O55R819n596K7792j0325l8148K0756J2015k0139k9493
10396H7087K0127J3011r956P242Q52j1646J9488J1953k7769l0465j762L342j091
10383H0413M619j0656p98K111J8896J7672J8696l9400j498J0110L851P374p501
10370A03889j0919L0186J2723j1172l1077J186j186J2263j1296K2518Q232m003
10358A21344j247n216K1810j3933k7148M562K6258J1935k5945J2856J176k07j733
10345A24512n900N286q739o352k4901j0767K7986O485J3884K4732j114K73j1531
$$ plain form
10435 123561 135235 105735 113472 119462 139678 145958 133923 115875 119113 119679 115956 77755 65954
10422 65954 98064 103216 91378 92177 104971 91461 77572 81629 73176 77256 92152 94547 94650
10409 94650 105507 128872 119751 120406 130225 124629 152421 142096 103948 124704 136719 116580 87087
10396 87087 107214 120225 110269 117511 118363 106717 126205 138158 110389 79924 78162 81504 80413
10383 80413 85032 74376 73578 75689 94585 112257 130953 91553 90055 100165 104016 111390 103889
10370 103889 92970 123156 135879 124707 93630 94816 93630 105893 94597 117115 125347 121344
10358 121344 120097 114881 136691 122758 95610 100172 126430 138365 112420 125276 126452 126245 124512
10345 124512 118612 123898 115159 108807 83906 73139 101125 107610 121494 146226 145112 145385 133854
10332A33854q27J716k211O657k0677p772k293j1580q84K0135Q484O89j2498k8347
10318H4446l254K0431K2160J1464N694P778O698k1400J1633j2487K765K4962J656
10305A62546l6951m1047N944K5513K5461J2453L3310j2986J4913L272Q868k3984
10293A77312Q463J5055Q75j5074m121L4395J5730J687n532J6486M921L5616J0484
10280B96297J8092L9343L2981N83m2906j675k7533q292j3087r523j9960J902K983
10267B69205k8980j7184O70j3641k2586p32J5380N724j460K1553J0384M516r49
10254B41900r010r046P567m835l8262J3316J2514K3124M0771P461O9904N7243
10242D12647P7746M3827O7549O6026M7788N2635N5827K8702M271J0n0301o8843
$$ plain form
10332 133854 133027 134743 132532 139189 118512 110740 108447 96867 95983 116118 124602 125291 112793 84446
10318 84446 81192 101623 123783 135247 140941 148719 155417 134017 145650 133163 135928 160890 162546
10305 162546 125595 84548 90492 116005 141466 153919 187229 174243 189156 192428 201296 177312
10293 177312 185775 200830 201705 186631 182510 216905 232635 234322 228790 245276 250197 285813 296297
10280 296297 314389 353732 386713 387296 344390 342715 315182 306890 293803 284280 264320 266222 269205
10267 269205 240225 223041 223711 210070 187484 186752 202132 207856 206396 227949 238333 242849 241900
10254 241900 232890 223844 231411 226576 188314 201630 214144 237268 278039 285500 355404 412647
10242 412647 490393 534220 601769 667795 715583 768218 824045 852747 857018 857028 806727 737884
10230G37884q7466j01528m8536n0465k8510k9081j7415r901l2222l7805J84L1715
10218C26854K0788l8755m9064J580j1960n75R807j180J8042m193J5306J2612j2486
10205B86776J8944K8478L1545N0219N4430O8646N9230J05566J44550J59346J36573
10194A144303R1342R2062J7238R322n3717j43852j64559j56686j16183q7516n6583
10183E75171o2234k4369l826j1965j0204j8392l540j5542J0403K7461l205k4628
10171D35130n6849l9789r225N051r77r485r334M533J4274Q028j1064K0008J8903
10158C69204P2015N6665M9231O4101Q2489J15234J31237J24438P1194N552n9874
10147A081486p2060j36797j33022r6488j04513o0701k1019j6025r934l1311l0494
$$ plain form
10230 737884 650418 548890 500354 449889 421379 392298 374883 364982 332760 294955 295139 326854
10218 326854 347642 308887 259823 261403 249443 248868 258675 257495 275537 271344 286650 299262 286776
10205 286776 305720 334198 365743 415962 470392 539038 598268 703834 848384 1007730 1144303
10194 1144303 1235645 1327707 1344945 1354267 1300550 1156698 992139 835453 719270 631754 575171
10183 575171 512937 488568 484742 472777 462573 444181 440641 425099 435502 462963 459758 435130
10171 435130 378281 338492 329267 334318 333341 323856 314522 319055 333329 341357 330293 350301 369204
10158 369204 441219 497884 547115 611216 693705 808939 940176 1064614 1135808 1141360 1081486
10147 1081486 1009426 872629 739607 643119 538606 477905 456886 440861 430927 399616 369122
10136C69122N001P603Q952r113k2939o239J497k1369o158P623k5890J95j3526
10123B94759j5912N6Q267P093j4144J8444N954Q23l0576K875O366L5877N9342
10110C79224O8434M3138N3277M0775r973n9199o3131n5867o2826m0054j7632m152
10098B72014M844J6533K1343m071j782j3896k6744j4737M124k1524R483L2838
10086B78425J2258R588m0011k2398l3450m2976j0255L5440K2950K2697M916l606
10074B33578q00k3789m686J2262j5780K5452J7911J1151J0093L148l7485k4684
10062B06371m736J3830j2121j1139O2647J9306l7363k1931K2321O728N632j3619
10050B35926K6872J5798J1973k3847j0184K942P322J9952L186R833j7824j0551
$$ plain form
10136 369122 374123 381726 390678 381565 358626 352387 353884 332515 326357 333980 308090 308285 294759
10123 294759 278847 278903 287170 294263 280119 298563 304517 305340 274764 277639 284005 319882 379224
10110 379224 447658 490796 544073 584848 574875 515676 452545 396678 333852 293798 276166 272014
10098 272014 276858 293391 314734 310663 308881 294985 268241 253504 257628 236104 245587 278425
10086 278425 290683 300271 260260 237862 204412 161436 151181 186621 209571 232268 237184 233578
10074 233578 232778 208989 204303 216565 200785 226237 244148 255299 265392 268540 231055 206371
10062 206371 201635 215465 203344 192205 254852 274158 236795 214864 237185 243913 249545 235926
10050 235926 262798 278596 290569 266722 256538 259480 266802 286754 289940 299773 281949 271398
10038B71398l702J4951J2600p729j3770m640L9199L9674M7o69j1757m551k5270
10025C05781K212O046L57j7245R084L6042j501l822j4107q827J5321K4634m553
10012C49422J4849l0564k5633q995O000O966J3309Q677O192K8534J9787m0738
10000C47806j3550J2241P0j1202l3480J6197K0856P790J1924R088K5245M6162
9988D39147l0294k1892k6988K26P418M502O212K363J1064q469n600k0718p625
9975C49346J1658Q173m443l6611M434J5203J5175K3087M416P428J8269K2184K784
9962D41103o015l3996n329L3777L7576o106N69L27J9637k1089K3410L5267K5946
9949E45077L3923K9387L9904j0292m3380l1402k1255m991P364m920j4835q718
$$ plain form
10038 271398 267696 282647 295247 287518 273748 269108 308307 347981 348028 347359 335602 331051 305781
10025 305781 307993 314039 314396 297151 306235 342277 340776 336954 322847 314020 329341 353975 349422
10012 349422 364271 333707 308074 299079 305079 312045 325354 334031 340223 368757 388544 347806
10000 347806 334256 346497 346567 335365 301885 318082 338938 346728 358652 367740 392985 439147
9988 439147 408853 386961 359973 360199 367617 372119 378331 380694 391758 383289 377689 356971 349346
9975 349346 361004 369177 364734 328123 332557 347760 362935 386022 390438 397866 416135 438319 441103
9962 441103 435088 401092 395763 429540 467116 461010 461579 461906 481543 460454 483864 519131 545077
9949 545077 579000 608387 648291 637999 594619 563217 541962 536971 544335 539415 524580 515862
9937E15862j1163J7113N3186J4270K0957L4928K1192k284J6578J281P939L8308
9925G28167J251M355L7213N891R944K2172K5459L1745p489j5668j1766K1871M1169
9912H94314N0297M5810M3831K4460K4198L4034M2567N9008K4965L599J413Q086
9900A256582M7738K8839N3992J16788P7034J07853J34748J56206J77852J48231
9890B305863J25149N7844Q3426J12751J69276K36443K65762K49600K43260J93803
9880D043177Q6321m4110q5833r6894p9203k5295l4613r1794r0834p5593m9894
9869C455435j9180j6684O5122J53288K20108K92538L57706M71095P17337R63844
9859F660609J096796R06287M61717L6425j04017M6077R7519n4396l05229n50002
$$ plain form
9937 515862 504699 521812 574998 589268 610225 645153 666345 664061 680639 681920 689859 728167
9925 728167 729418 733773 770986 776877 786821 808993 834452 866197 858708 843040 831274 853145 894314
9912 894314 944611 990421 1034252 1058712 1082910 1116944 1159511 1218519 1243484 1247083 1248496 1256582
9900 1256582 1304320 1333159 1387151 1503939 1580973 1688826 1823574 1979780 2157632 2305863
9890 2305863 2431012 2488856 2572282 2685033 2854309 3090752 3356514 3606114 3849374 4043177
9880 4043177 4129498 4085388 3999555 3902661 3823458 3798163 3763550 3671756 3580922 3505329 3455435
9869 3455435 3436255 3419571 3484693 3637981 3858089 4150627 4508333 4979428 5696765 6660609
9859 6660609 7757405 8663692 9125409 9161834 9057817 9103894 9201413 9147017 8841788 8291786
9849H291786n99053m87078l85395k60701r8945j5896m1801j3526L1644Q8074J65684
9838F674793K79861L75981M32585M75029N63883O07243O10564P59221Q84853J097372
9828A2761385J425801J850910K495370L534377M995043O940463R197856J1554720
9820E4755925J3923501J5652507J4774362Q527473l112789j2932081j4766890
9813G6822008j2395843r538407o777701m299023k414506q53555O28222K199654
9805D3370849M008313N904796P567843Q287764P858375O717990N608407M414397
9797I3738734K722958J517255J356143Q09835p38030k158429l136090m103966
9789I0008410m885038m542101l000311j485480n37088P13389L302672P306095
$$ plain form
9849 8291786 7692733 7205655 6820260 6559559 6460614 6444718 6402917 6389391 6421035 6509109 6674793
9838 6674793 6954654 7330635 7763220 8238249 8802132 9409375 10019939 10779160 11664013 12761385
9828 12761385 14187186 16038096 18533466 22067843 27062886 34003349 43201205 54755925
9820 54755925 68679426 84331933 99106295 107633768 104520979 91588898 76822008
9813 76822008 64426165 54887758 48110057 43811034 41396528 40542973 41171195 43370849
9805 43370849 47379162 53283958 60851801 69139565 76997940 83715930 89324337 93738734
9797 93738734 96461692 97978947 99335090 100144925 99406895 97248466 94112376 90008410
9789 90008410 85123372 80581271 77580960 76095480 75558392 76271781 79574453 86880548
9781H6880548J2804548K0109558K9115778L8700126M4910224M0613066K0365183
9774B93499031j3998472m1417404m3947895l5009366k6164182j8657342j2350728
9767A01953642p208964l309314m24225J567885K701504L267113L761091M124132
9759A06432864L909948L465119K798588J633678J32506j213753j507042j502433
9751A14149475l004404n710936p912261r193498r273442p803614n633096l712745
9743F1905479k146281q17080N64257K066024L876919O167223Q909590J1658188
9735I2184319J3245312J1956546O212623l934922j3290356j5649254j3308532
9728G7415736j0748650q727517o769615m974482l630997k734871k095899j643915
$$ plain form
9781 86880548 99685096 119794654 148910432 187610558 232520782 273133848 293499031
9774 293499031 279500559 238083155 194135260 159125894 132961712 114304370 101953642
9767 101953642 94744678 91435364 91011139 92579024 95280528 98547641 102308732 106432864
9759 106432864 110342812 113807931 116606519 118240197 118372703 117158950 115651908 114149475
9751 114149475 111145071 105434135 97521874 88328376 79054934 71251320 65618224 61905479
9743 61905479 59759198 58942118 59506375 61572399 65449318 71616541 80526131 92184319
9735 92184319 105429631 117386177 123598800 119663878 106373522 90724268 77415736
9728 77415736 66667086 57939569 51169954 46195472 42564475 39829604 37733705 36089790
9720C6089790j412469j387549j350078j307915j211811j121257j092413j045666
9712B6160632r73082q57731p79230o82229o19528n75764n12165m78660l87249
9703B0294994k23953p5774K9982J37682J88033J22892p9588k79366l06487k17209
9693A9591206l71095p89429j154499j230389j053423q25312o52568n57254n06669
9684A2450568m27476l77410l33657k86413j98041j72636j50152j54216j06437
9675A0244130j13673j05112j13399j35764j72302j40754j76065k13403l20663
9666H752995l42607l55811l43725l09082k82160k12413j65688j83429k12970k37355
9656F107755k52686k30691j91775j39934j56388j61374j80331k06011k09435j64906
$$ plain form
9720 36089790 34677321 33289772 31939694 30631779 29419968 28298711 27206298 26160632
9712 26160632 25187550 24329819 23550589 22868360 22248832 21673068 21160903 20682243 20294994
9703 20294994 20071041 19995267 20025249 20162931 20350964 20473856 20394268 20114902 19808415 19591206
9693 19591206 19220111 18430682 17276183 16045794 14992371 14167059 13514491 12957237 12450568
9684 12450568 12023092 11645682 11312025 11025612 10827571 10654935 10504783 10350567 10244130
9675 10244130 10130457 10025345 9911946 9776182 9603880 9463126 9287061 9073658 8752995
9666 8752995 8410388 8054577 7710852 7401770 7119610 6907197 6741509 6558080 6345110 6107755
9656 6107755 5855069 5624378 5432603 5292669 5136281 4974907 4794576 4588565 4379130 4214224
9646D214224j37549j46816j38184j26138j17716j00729r3930r7721q3041j30993
9636C041407j09436q7649r2997n5507r8192r6304j05977q5954r4885p5852o0070
9625B078584o8792p6652l4888m2165n9494n6499n8207l9861m2327o4328k8032
9614A507339j7889l8997m4913J1413k9561m9647l3674l2095o8841n6296n6183
9603A090656m6259m2993l0179k2247j8706q063j0021k3489k4675m661j522k5600
9591H32241k8564k4866m3375o7891l6518k4637l517J5192R741j4927K8352K8202
9579F69433p579j0774k7698J770o973j6901k5657j5691j2784J2308J815K6671
9567E87940J1765M394L855n885k0655r534K4763m117j3713k7079j5161j4270N039
$$ plain form
9646 4214224 4076675 3929859 3791675 3665537 3547821 3447092 3353162 3255441 3172400 3041407
9636 3041407 2931971 2844322 2751325 2695818 2597626 2501322 2395345 2309391 2214506 2138654 2078584
9625 2078584 2009792 1933140 1898252 1856087 1796593 1740094 1681887 1642026 1599699 1535371 1507339
9614 1507339 1489450 1450453 1405540 1416953 1387392 1337745 1304071 1271976 1203135 1146839 1090656
9603 1090656 1044397 1001404 971225 948978 930272 922209 912188 888699 864024 859363 857841 832241
9591 832241 803677 778811 735436 667545 631027 606390 602873 618065 627806 612879 641231 669433
9579 669433 661854 651080 623382 625152 618179 601278 575621 559930 547146 559454 561269 587940
9567 587940 599705 604099 607954 602069 581414 571880 596643 592526 578813 551734 536573 522303 527342
9554E27342J2297n821J23j6892j3386k2326k8671j9374j596J7036K277o138R784
9541D54655K767L436l3240r659J6092R699J3093k0426o3626Q62J6540J6669j1957
9528C94905k7530n114L5505K6672J5454r328n069p417n914j5104m4588p080l005
9515C42387k1949m2785K211n306R001o224r567k880J2867J1824p01k2262O876
9502B73492J5893l4785k0004J43K7677M0532p08k0578k9551Q000k950l3011l5016
9489A89134m0528j4873p167J2068L9428K5334P140k611K9083Q097l4185p914J0328
9476B13334l2773n6888p408p141k5054m809K5024j5310o706M574n616R46k3426
9463E8747L0000J5383K511K965k0580M174J4597N921J9968J6055l429n045m6835
$$ plain form
9554 527342 539639 533818 533941 517049 503663 481337 452666 433292 431696 448732 451009 444871 454655
9541 454655 457422 460858 427618 417959 434051 443750 456843 436417 372791 373653 390193 406862 394905
9528 394905 367375 362261 397766 424438 439892 430564 425495 418078 412164 397060 352472 345392 342387
9515 342387 320438 277653 279864 274558 283559 277335 267768 264888 277755 289579 288878 266616 273492
9502 273492 289385 254600 234596 234739 262416 302948 302240 281662 252111 260111 257161 224150 189134
9489 189134 148606 133733 126566 138634 178062 203396 210536 207925 237008 245105 210920 203006 213334
9476 213334 180561 123673 116265 109124 84070 79261 104285 88975 82269 86843 81227 82173 58747
9463 58747 88747 104130 106641 109606 89026 93200 107797 113718 133686 149741 146312 141267 94432
9450I4432l5124o101J1791N343K9486L841J9016L0097J8684M5729J8777K1726
9438B57697M7872L9046j499k07k6171n0249n0384j5902j2444l5843m5875r160
9426I6881K397j2432p928J396p388n077J9403q739l9185j4224J5285L8661J3399
9413I2449k401J6797M0382L4791O23m3133o882M182K5817K6998J9560M9518M5422
9400C04123P1830P8457J23728J52016J37922R1965M1016j2685j00818j35458j05518
9389F46578j06774q7302m1429m1034l4877j8998O045j8537j5609j8525r548j8268
9377B41722j0436j3830j4775k1570k9496M87K5536R329Q267R671n45J3590J2070
9364B30020K2864M1264L9902p627K6423M1033N0323J26327J43121J55289J78392
$$ plain form
9450 94432 59308 53207 64998 70341 99827 103668 122684 152781 171465 217194 235971 257697
9438 257697 305569 344615 343116 342909 316738 266489 216105 200203 187759 151916 106041 96881
9426 96881 99278 86846 78918 80314 72926 67849 87252 78513 39328 25104 40389 79050 92449
9413 92449 90048 106845 147227 182018 182641 139508 132626 136808 162625 189623 209183 258701 304123
9400 304123 375953 454410 578138 730154 868076 960041 1001057 988372 887554 752096 646578
9389 646578 539804 452502 411073 370039 335162 316164 322209 303672 288063 269538 259990 241722
9377 241722 231286 217456 202681 181111 151615 152102 177638 186967 195234 204905 204360 217950 230020
9364 230020 252884 294148 334050 326423 352846 393879 444202 570529 713650 868939 1047331
9353A047331J44631Q7940K3604n1540j05653j27144j04076j16740j20431r7351
9343E80571o3262o2155l4290j0535l5222j1447j5722q214j8687Q602J243k8375
9331C02507j4705k812j612l3682m1056q495J4305K2521K8649l901J129O679n651
9318B63876Q24K4479N8064O6073P1246Q5066R9043Q0569L9322k6071j4297k1005
9306G27189k9901n3276o8624q3734p4393p0366m5439l377q026l2685L994q357
9294B53005r011j8932j9494j2392j2934q923P352j0847p791k024J2258K673j1069
9281A61871k3753K0772J4344k994j3317r512N687K105L469K9799L9035J973J3423
9268B42902j4830j8109R078R292J2674J4592p196l8691l9070q746n365J0145R041
$$ plain form
9353 1047331 1191962 1279902 1303506 1251966 1146313 1019169 915093 798353 677922 580571
9343 580571 517309 455154 420864 410329 375107 363660 347938 339724 321037 329639 330882 302507
9331 302507 287802 284990 283378 249696 208640 200145 214450 236971 265620 261719 262848 269527 263876
9318 263876 264700 289179 347243 413316 484562 569628 668671 749240 788562 762491 748194 727189
9306 727189 697288 644012 575388 491654 417261 346895 301456 298079 290053 257368 261362 253005
9294 253005 243994 225062 205568 193176 180242 171319 178671 167824 160033 158009 170267 172940 161871
9281 161871 138118 158890 173234 170240 156923 147411 153098 155203 158672 188471 227506 229479 242902
9268 242902 228072 209963 219041 228333 241007 255599 248403 209712 170642 161896 156531 166676 175717
9255A75717k660J4466j8808k8436r662J4922p449j732J885j723k0833N190L1984
9242A52861k643j3051j3760j0272n050k5050K8769K9350L218J3983J6341O651
9230A81347j2505k4184j3946q760r110l574J0295J5820Q227J3203q239K4836M406
9217A77816k5085l308J0258K5763j7048L420L1524Q319J7795j3465k0856R059
9205B04192J4413K4581M4653N0342Q928j9796k9595K2456M5301J9810K7034M6769
9193D59088L8095K8928L4321N4134J04475O8808O9662Q3711R3878J00319J56079
9182A291498J75201K20930K53183K44144L06699L43250M19180M27824M61930L59973
9172D503812K80323J87637j9393j65656k80523l57725l67339l35204l41536k87347
$$ plain form
9255 175717 173057 187523 168715 140279 130617 145539 138090 136358 138243 136520 115687 120877 152861
9242 152861 150218 137167 123407 113135 108085 83035 111804 141154 144372 158355 174696 181347
9230 181347 168842 144658 130712 121952 112842 109268 119563 135383 143610 156813 148574 173410 177816
9217 177816 152731 149423 159681 185444 168396 171816 203340 211659 229454 215989 195133 204192
9205 204192 218605 243186 287839 338181 347109 327313 297718 320174 365475 385285 412319 459088
9193 459088 497183 526111 560432 614566 719041 787849 857511 941222 1035100 1135419 1291498
9182 1291498 1466699 1687629 1940812 2184956 2491655 2834905 3254085 3681909 4143839 4503812
9172 4503812 4784135 4971772 4952379 4786723 4506200 4148475 3781136 3445932 3104396 2817049
9162B817049k58287k18076j98343j99505j07716j04990j05495q6419q0491n6336
9152A401391p5893j04370p6509n4508p0666o8379l2292j6440m7887m1925m0521
9141G72001k7786m5098k1660k42o778m1788j6442Q123k8765n812l3550l609k4797
9128E23797o5011m7654o351l750J2037N931j9009m9137Q27J6822J1241k1069J0316
9115C68990j6403k6430l0514n233K8511r66k6872m132j4370N987k4335l6539j3366
9102B04328M081J1639J0953J3081j458o52k6206J547M988J6840j5576k4252j5069
9089A84244m965J9869j818J3319Q697l3059k3060j7034J0635j7509k8153N254
9077A16420K3589m979l9953r071M0300J3879k3084j3756o02P385j3423q54p771
$$ plain form
9162 2817049 2558762 2340686 2142343 1942838 1835122 1730132 1624637 1538218 1457727 1401391
9152 1401391 1325498 1221128 1144619 1090111 1019445 951066 918774 902334 854447 812522 772001
9141 772001 744215 699117 677457 677215 670437 628649 612207 620330 591565 585753 552203 548594 523797
9128 523797 458786 411132 404781 401031 413068 418999 399990 350853 351680 368502 379743 358674 368990
9115 368990 352587 326157 295643 290410 318921 317955 291083 286951 272581 278568 254233 217694 204328
9102 204328 208409 220048 231001 244082 242624 241972 215766 217313 222301 239141 223565 199313 184244
9089 184244 179279 199148 197330 210649 219346 186287 163227 146193 156828 139319 111166 116420
9077 116420 140009 135030 95077 86006 126306 140185 117101 103345 102743 110128 96705 95851 88080
9064H8080k5233Q51N365K3966r934p560L2835O188k9664l5573L0420P611j591
9051H5761k2271l989j3339J6299L265k3424j5135L5723K6462l2188o44n912l0666
9038A9942o881m095M0765K5166k3600j4067p107L943j8381L073L5932J3295M042
9025G2027J548k676K70M07j2936k2107k1583q92K122R677J2470j8940k6835k1882
9011b9330L82Q5J826n292N408Q255Q845J3800K0654k7610J625J070J8911Q584
8997B7213Q357q859K529q203k0471O237R933o693K5547r963l4247j3614L0129
8984G895K5207p60j3394n753M328p150J9845k7307m2276J1011L192j4544k2410
8971f2116J268L2183J1303L944K9899J2968p285o937j3497k4190j8174K6979R638
$$ plain form
9064 88080 62847 63698 69063 93029 83095 75535 108370 114558 84894 49321 79741 87352 85761
9051 85761 63490 59501 46162 62461 65726 42302 27167 62890 89352 57164 56520 50608 19942
9038 19942 13061 8966 49731 74897 51297 37230 30123 34066 15685 18758 54690 67985 72027
9025 72027 73575 70899 71169 71576 58640 36533 14950 14058 16180 25857 38327 19387 -7448 -29330
9011 -29330 -28948 -28863 -27037 -32329 -26921 -18666 -9821 3979 24633 -2977 -1352 -282 18629 27213
8997 27213 35570 26711 29240 21037 566 6803 16736 10043 35590 25627 -8620 -22234 7895
8984 7895 33102 32342 18948 13195 17523 10373 30218 2911 -39365 -28354 -25162 -39706 -62116
8971 -62116 -60848 -28665 -17362 -13418 16481 29449 22164 15227 1730 -22460 -40634 -13655 -4017
8958d017L268K0778J791J697o825k1741K1683N819p830o182L289R781k603l417
8944A5491J3358j8261k5114n813Q482J1976P442J6453K333k0476j0153J3752J6388
8931B5858k1335j6950J046m932O74j0938k6641j3024K1460K1230J1963K1830K2689
8918C2930N438l6490K920K3679o987K053J5021J3124k0878J808J0544K9391K4512
8905I7065J9757L3879J6174K000j5353K2744M3353k3409m1184n183k117j5441
8893A32285m59l1712k0876J233l0154K4118P222K3185L2891n335j6108l6555l8263
8880D1472J2424K718J1803Q517K2661K9002J0515Q021M4257L5090M503K078K4864
8867B57925j0602l7361J42j285m1876l8996l894Q064R104p929K6039O3046N4006
$$ plain form
8958 -4017 -749 20029 21820 23517 16692 -5049 16634 22453 14623 8441 11730 21511 18908 15491
8944 15491 28849 10588 -14526 -20339 -11857 119 7561 24014 26347 5871 -4282 9470 25858
8931 25858 4523 -12427 -11381 -16313 -15639 -26577 -53218 -66242 -44782 -23552 -11589 10241 32930
8918 32930 38368 1878 4798 28477 21490 23543 38564 51688 30810 32618 43162 72553 97065
8905 97065 116822 150701 166875 168875 153522 176266 219619 196210 155026 149843 147726 132285
8893 132285 131826 100114 79238 80471 50317 74435 81657 104842 137733 132398 116290 79735 41472
8880 41472 53896 56614 68417 76934 99595 128597 139112 147133 191390 226480 230983 233061 257925
8867 257925 247323 209962 210104 208819 166943 127947 124053 132117 141221 133292 159331 222377 276383
8854B76383K8314J09115J00042O1010m6592j09804j14400p2737l7822k6494j3588
8843A53427l2151j6289q410K3424p469j7249P62k9301k7332j1506L05M2538p847
8830F2902o093J6987J6452j37l922j8863N002j964j5571J6556j1287k7689O208
8817C8581N851P555J5977K360m640J4705K173J8209n294k9342j3987P408J5196
8804G4752k0530j9877J5496n772m156J0656j570l1157N536L7003M762J749o3j5667
8790E1162j5079j7219J5124K1347j8002k9930J838J662o025L751J8284J1589Q16
8777C9318K6367J5240J2951r056k9161l2674j2602j487L1698m186l255L544j3634
8764B3063L213J3164J0135j2735k3081L638K1035j3138N262L048J3371L868j5523
$$ plain form
8854 276383 304697 413812 513854 574864 528272 418468 304068 231331 193509 167015 153427
8843 153427 121276 104987 96577 120001 112532 95283 96045 66744 39412 27906 28211 70749 62902
8830 62902 56809 73796 90248 90111 86189 67326 72328 70364 54793 71349 60062 32373 38581
8817 38581 44432 51987 67964 70324 65684 80389 82562 100771 95477 66135 52148 59556 74752
8804 74752 54222 34345 49841 44069 39913 50569 48999 17842 23378 60381 65143 66892 66829 51162
8790 51162 36083 18864 33988 55335 37333 7403 9241 10903 4878 8629 26913 38502 39318
8777 39318 65685 80925 93876 84820 55659 22985 10383 8896 40594 36408 33153 36697 23063
8764 23063 26276 39440 49575 36840 13759 17397 38432 25294 30556 33604 46975 50843 35320
8751C5320k746l848J5944K8771J1036k2829L6726n956j8697L89M3993R270j6512
8738A10861j3805L940m661J1351P278P564J1250j5765K308J1943O318O366M1109
8725A86057L8908L4513J3771J3055j1591n1133m494n418N146M966j569m9279k6959
8712A45973O16m917J0741K9163J0312j8099r86P2j5698k128L080j2037J8953M1180
8698B06225j9648j3868l4569l0048K1068J5831j2963P346K9155J5318j6759M453
8686A71541l3437j3708P505J837l694j264Q183o541J65R845M677J7036L0993N008
8672A98146j0396m586j4001P952J1837j0906J9594K4064M708L326M0817K9385
8660B99940O6445J20837J23287P3206k1335j27102j17045p3350k7864j6630J6292
$$ plain form
8751 35320 32574 28726 44670 73441 84477 61648 98374 92418 73721 74110 118103 127373 110861
8738 110861 97056 100996 96335 107686 114964 122528 133778 118013 120321 132264 138582 144948 186057
8725 186057 224965 259478 273249 286304 274713 223580 219086 213668 218814 223780 222211 172932 145973
8712 145973 146589 141672 152413 181576 191888 173789 172803 172875 157177 155049 158129 146092 165045 206225
8698 206225 186577 172709 138140 108092 129160 144991 132028 139374 168529 183847 167088 171541
8686 171541 138104 124396 131901 133738 130044 128780 136963 130422 130587 140432 145109 162145 193138 198146
8672 198146 187750 183164 169163 177115 188952 178046 197640 221704 226412 229738 270555 299940
8660 299940 366385 487222 610509 683715 662380 535278 418233 344883 317019 300389 316681
8649C16681p09J4585M4865M0864N3205O0492M1658l8734n5336k6175j0339k0666
8637D20391m2211j5262n569M373Q507o206P89J7705K7308P235j092J3118n460
8624D23626l396J1278K2416J0509L3545L0958N146J5113R822K9830N6395O1436
8612G06678O3348R6673R2029N9072j1045o654L4844L8401O1444P0183J02195Q6307
8600A393475J09130J09925J34392J30454P9444K5646j7272r0658j66644j68966
8590A538926j61529j60146j14723o2851q6664q7367p7943p2210o2900k8302k7980
8579E96311n4151l4471j626j2027M679J2085n19l4576l5873l6821j9959O659J706
8566C91417k4398m514k4757j7844j5239k1858l0339j8239j4333o424k3020J357
$$ plain form
8649 316681 315972 330557 375422 416286 469491 529983 571641 532907 477571 451396 441057 420391
8637 420391 378180 362918 357349 361722 370229 364023 364812 382517 409825 417060 415968 429086 423626
8624 423626 420230 431508 453924 464433 497978 528936 534082 549195 559017 588847 645242 706678
8612 706678 770026 866699 958728 1017800 1006755 1000101 1034945 1073346 1134790 1204973 1307168 1393475
8600 1393475 1502605 1612530 1746922 1877376 1956820 1982466 1965194 1874536 1707892 1538926
8590 1538926 1377397 1217251 1102528 1039677 953013 865646 787703 715493 652593 624291 596311
8579 596311 542160 507689 506063 494036 498715 510800 510281 475705 439832 403011 383052 389711 391417
8566 391417 367019 362505 337748 319904 304665 282807 252468 234229 219896 213472 190452 191809
8554A91809M5262L724m652n241J7941o919k4921l814l840Q016k8866j8114n195
8541A65190j832M425p811j5880K120j944j0303k137n61L403L2945J0504q793k8340
8527A40986l1873r063o442J6515J1552R836N566j5316k0801K202l262J3370m443
8514A08827j2805n695O327k886j642K7300J9738k5773k1183k2853j4663p738J9909
8501F6863P3o288r071j1558n291j0718k3439N565j0256K4577K2584O746K756N871
8487E8414l1562j0663J8271J6904N0l5597J0048R493j9429l442j790K4124K6561
8474F1382n569j7408O151j3404J1780J2419l0164j4291K918j9492k0712Q33j7668
8461d3225J6865J3070Q593R317J5655n103K8073P699j1446j2604M465k445q616
$$ plain form
8554 191809 237071 240795 236143 230902 248843 241924 217003 213189 209349 217365 188499 170385 165190
8541 165190 163358 167783 159972 144092 146212 144268 133965 131828 131267 134670 167615 178119 169326 140986
8527 140986 109113 100050 93608 110123 121675 131511 137077 121761 100960 103162 99900 113270 108827
8514 108827 96022 90327 96654 93768 92126 119426 139164 113391 92208 69355 54692 46954 66863
8501 66863 66936 60648 51577 40019 34728 24010 571 6136 -4120 20457 43041 49787 52543 58414
8487 58414 26852 16189 34460 51364 51414 15817 25865 35358 15929 12487 10697 34821 61382
8474 61382 55813 38405 44556 31152 42932 55351 25187 10896 13814 -5678 -26390 -25557 -43225
8461 -43225 -26360 -13290 -4697 4620 20275 15172 43245 50944 39498 26894 31359 28914 20298
8448B0298j3905k883J4136J846q400J5645n989q298N860K973K702j0205j6726
8435b946k1175k2948K7803K4545L99p249K764R203k355k1746K436K015Q395m429
8421e288j3831l27K8158J7542k5180j0318Q714Q564M5j8983l988R597M156j3867
8407a5006k350K9053O830p841P94Q694j6198J225K3531J624O634Q666k8690n043
8393A1923k693O744L2319j56r650k5312m5111j2468J7920O079j5487l455P795
8380c1552K2056O028k3913N856N350j960j5524o352K9721K0613k6022L831j4789
8367b6657k414P599p183L211J0212J9848R868j3413j1539j2303j4088K5865J3658
8354B664p810l4442r136J5714j9830K1357K0217K431l548J8547n594M45J7405
$$ plain form
8448 20298 6393 3510 17646 19492 11092 26737 20748 12450 18310 21283 23985 13780 -2946
8435 -2946 -24121 -47069 -19266 5279 5678 -1571 1193 10396 8041 -13705 -11269 -9254 -859 -5288
8421 -5288 -19119 -19446 8712 26254 1074 -9244 -530 8034 8079 -10904 -14892 -5295 -1139 -15006
8407 -15006 -17356 11697 18527 10686 11480 20174 3976 5201 28732 30356 36990 45656 16966 11923
8393 11923 9230 15974 48293 48137 38487 13175 -31936 -44404 -26484 -20405 -35892 -39347 -31552
8380 -31552 -9496 -3468 -27381 -21525 -16175 -18135 -33659 -40011 -10290 10323 -15699 -11868 -26657
8367 -26657 -29071 -21472 -28655 -25444 -15232 4616 14484 1071 -10468 -22771 -36859 -10994 2664
8354 2664 -5146 -39588 -48724 -33010 -52840 -31483 -11266 -8835 -12383 6164 570 1015 18420
8341A8420J6565K862n648p768q270l4441r209j3413K7686J2106j2026k78N617
8328g797J5518j1493j6175k122L6894P205l167j5027J32j0998l227j913l3155
8315d5325L816K5855K3662Q828l7310J5306J8527K319Q93j7212L8613n113j7820
8302A5039l2808j3730L2000J6867m656m392P100j4947J6752N866n1812m6560J335
8289g3946J7948Q093L2621K2922m218Q112j66k1296j3738J2432K5786J3405l2061
8276d106l2555N585r85j0757m353L3940J3954j1523J634j0845m122J2481o667
8263a8319l819J6508K601N601o351j4251k9421j7743M1275K948J927J2373J6719
8250A0048L524r6J3879K2771K38k1290j3979q686j8038R165m113O797K0932J4522
$$ plain form
8341 18420 34985 37847 32199 24431 16161 -18280 -27489 -40902 -13216 -1110 -13136 -13414 -7797
8328 -7797 7721 -3772 -19947 -22069 14825 22030 18863 3836 3968 -7030 -10257 -12170 -45325
8315 -45325 -41509 -15654 8008 16836 -20474 -5168 13359 15678 16571 -641 37972 32859 15039
8302 15039 -17769 -31499 501 17368 12712 8320 15420 473 17225 23091 -28721 -75281 -73946
8289 -73946 -55998 -47905 -15284 7638 3420 11532 11366 -9930 -23668 -11236 14550 27955 -4106
8276 -4106 -36661 -31076 -32061 -42818 -47171 -13231 723 -10800 -9166 -20011 -24133 -11652 -18319
8263 -18319 -22138 -5630 -3029 2572 -3779 -18030 -47451 -65194 -23919 -20971 -19044 -6671 10048
8250 10048 13572 13476 27355 50126 50364 29074 15095 6409 -11629 -2464 -6577 220 21152 35674
8236C5674k5959n661J6039q824q379p735k7707N428J3267J6001k4518Q658L1538
8223A7822L125J4264J12n7491k4612J5847j9644J454Q389K702P744K1731N345
8210c212j3644j2975q627J913N991N952j7608l114L318L1874J48j6068R683q414
8196b4783M47L7409K518j2527j7697l089p178J5495K056J7547L472j4364J6329
8183A5635N379P780q538K8551k785k2836r143l53M385J1044j1593j368J8948j383
8169C3723j7951j3461n846Q432J435J0283K048r695n853L830k703J4614J2167
8156C1023J937J8803p625l4031l1225O495K2766J8707P004r441j3573m0532j8608
8143d8300K869J8938J2296K7396J3699m46R740k105k0190J2489N880J7935n168
$$ plain form
8236 35674 9715 4054 20093 11269 2890 -4845 -32552 -27124 -13857 2144 -22374 -13716 17822
8223 17822 20947 35211 35323 -22168 -46780 -30933 -50577 -49123 -40734 -38032 -30288 -8557 -3212
8210 -3212 -16856 -29831 -38458 -36545 -30554 -24602 -42210 -45324 -42006 -10132 -9984 -26052 -16369 -24783
8196 -24783 -24336 13073 15591 3064 -14633 -17722 -24900 -9405 -7349 10198 13670 -694 15635
8183 15635 21014 28794 20256 48807 46022 23186 14043 13690 18075 29119 17526 16158 35106 33723
8169 33723 15772 2311 -3535 4897 6332 16615 18663 8968 3115 6945 4242 18856 31023
8156 31023 32960 51763 44138 10107 -21118 -14623 8143 26850 33854 24413 10840 -29692 -48300
8143 -48300 -45431 -26493 -14197 13199 26898 26452 36192 34087 13897 26386 32266 50201 45033
8130D5033k5613k4024r28J9573o007r157J1818Q613n822j7150l778J6053N492
8117A4103J9036J6690J0949J4773j3351k8878r896K8994J3324j1k4364m8817N123
8104b325J4476J1387J8237M911O414L545m561n914j3808q419N505j907j6833K199
8090A2907j42p060j1723M985j0323N31K0265k823j8300K31O394R508P378m261
8076G567K2904L3901K5920k8651l2593K8517K1130M4290K3937j4574k1445R326
8064A20229M451m0155l3323L983J5434J3859K8717j3124j3261n559J298k064J2281
8051I2766N2885M773j8502k5076r791M064Q374K7726L1589j3269j6953j274J177
8038A38489K577k0804j2870K0288K3477m437j0482l114J2787J1533M933J3021
$$ plain form
8130 45033 19420 -4604 -5532 14041 8034 -1123 10695 19308 13486 -3664 -7442 8611 14103
8117 14103 33139 49829 60778 75551 62200 33322 23426 52420 65744 65733 41369 -7448 -2325
8104 -2325 12151 23538 41775 46686 53100 56645 52084 46170 32362 23943 29448 27541 10708 12907
8090 12907 12765 5705 -6018 -1033 -11356 -10825 9440 6617 -11683 -11452 -5058 4450 11828 7567
8076 7567 30471 64372 90292 61641 29048 57565 78695 122985 146922 132348 110903 120229
8064 120229 124680 84525 51202 55185 70619 84478 113195 100071 86810 81251 82549 80485 92766
8051 92766 145651 150424 131922 106846 97055 101119 109493 137219 168808 155539 138586 137312 138489
8038 138489 141066 120262 107392 127680 151157 146720 136238 133124 145911 157444 162377 175398
8026A75398o805l910j1027j9080P947K6663j2386j7658K0485J4800J4017o634
8014A81810r573j6195j409j6459j7129L3965P852p343K0738M1589K2702K6000
8002B66548J8329q677l1624l1752m2343k3927j9492q999O48k7990k7505k7044
7990C6172K5522J5896P144R497k3430Q994N2564J1052K127p669k4916k5756Q83
7977H8080O321J41N210p436K5429J2457M533P95J6613k6241j8204J4027L2106
7964A53831L027j9486J8962O16l8166k936J8987J1734k721j0410k0823m5556j2713
7951E4346J2783j0756K947L00M209M314r243k2712J9861P379o428J6356J9966
7938I3322k516o610L107k3240k4370K706L6123M748Q853k654J211K495j9201O494
$$ plain form
8026 175398 168593 164683 153656 134576 142523 169186 156800 139142 159627 174427 188444 181810
8014 181810 172237 156042 154633 138174 121045 155010 162862 155519 176257 217846 240548 266548
8002 266548 284877 276200 244576 212824 170481 146554 127062 118063 118711 90721 63216 36172
7990 36172 61694 77590 84734 94231 70801 79795 132359 143411 145538 137869 112953 87197 88080
7977 88080 94401 94542 99752 92316 117745 130202 134735 135530 152143 125902 107698 121725 153831
7964 153831 156858 137372 156334 156950 118784 115848 134835 146569 143848 133438 112615 67059 54346
7951 54346 67129 56373 59320 59620 63829 68143 58900 36188 56049 63428 57000 73356 93322
7938 93322 90806 84196 87303 64063 39693 42399 78522 83270 92123 89469 90680 93175 73974 80468
7924H0468K6773M278m6040l3947P716K1822P446k0983j051J1743R975o396l255
7911E8549J6575J104n2560k0728J3933K2252k171P853J1981k974k7110j7778j8723
7898i797K973K3184K0727k3070j298K772l1389j8149J7707L5984J5151r553n360
7885A9882r369j036J6366J4275J3504j3570k371k1612j4864k0580O405J71J21
7872a2678J1025R645l518j7107j6434K841K4122J1908J1455j4698l489L713R725
7859A6510k3146k8128J3309K9896m312M962L0681j8961l501j6647J5779J7977
7847C4419k1059l0049K4536J1280k779k1102n628j0559M236o608M81p720o543
7834c7095K0813J193J1811p211j7698J6957L5416J9061n913p36k811L021m9362
$$ plain form
7924 80468 107241 111519 65479 31532 39248 61070 68516 47533 46482 58225 68200 61804 58549
7911 58549 75124 76228 23668 2940 16873 39125 36954 44807 56788 53814 26704 8926 -9797
7898 -9797 -6824 16360 37087 14017 12719 15491 -15898 -34047 -16340 19644 34795 25242 19882
7885 19882 10513 9477 25843 40118 53622 40052 37681 16069 1205 -19375 -12970 -12799 -12678
7872 -12678 -1653 7992 4474 -12633 -29067 -26226 -2104 9804 21259 6561 3072 6785 16510
7859 16510 -6636 -34764 -21455 8441 4129 9091 39772 20811 17310 663 16442 34419
7847 34419 13360 -16689 7847 19127 16348 -4754 -10382 -20941 -16705 -23313 -22832 -30552 -37095
7834 -37095 -16282 -15089 -3278 -10489 -28187 -11230 24186 43247 37334 36598 33787 36808 -12554
7821a2554J289K0133j0175j1472j3513k1066j0672M304j100j1731J0568p860K4066
7808c9783K8210j5999L845K919m134J1526j711J606j3596j7738K0588j1805K1294
7795a4778J7980N05j7088j0361n784J0529N421j387J0979n11l1368j7984r158
7782f3005O201J1861L0772J7474R889p058j2895j3183o467j2756J7206Q78o053
7769b7136J5334K2134P937R846j7230l8813r964L1197l681J3077K5800j9173j4828
7756e500j6283N430K7084K2233J57m4887N053J0163K3788k425l4894k1102J5096
7743a6087q589k6547J5804K5549J8913n822p861j8728j0987j6250j4527J2213
7731e2919R440k6027L733Q791J4291L1335k0142p402J1575p905K0287L0389L016
$$ plain form
7821 -12554 -11265 8868 -1307 -12779 -26292 -47358 -58030 -53726 -54826 -66557 -55989 -63849 -39783
7808 -39783 -11573 -27572 -23727 -20808 -24942 -13416 -15127 -13521 -27117 -44855 -24267 -36072 -14778
7795 -14778 3202 3707 -13381 -23742 -29526 -18997 -13576 -14963 -3984 -4495 -35863 -53847 -63005
7782 -63005 -56804 -44943 -14171 3303 13192 6134 -6761 -19944 -26411 -39167 -21961 -21083 -27136
7769 -27136 -11802 10332 18269 28115 10885 -27928 -37892 -6695 -10376 2701 28501 9328 -5500
7756 -5500 -21783 -16353 10731 32964 33121 -11766 -6713 3450 27238 24813 -10081 -31183 -16087
7743 -16087 -24676 -51223 -35419 -9870 9043 3221 -4640 -23368 -34355 -50605 -65132 -52919
7731 -52919 -43479 -69506 -65773 -56982 -42691 -11356 -31498 -38900 -27325 -35230 -14943 15446 18462
7718A8462k0085o25k1336o143L7331J4310j7640k1313k0878M176J1731K4545O332
7705H867p634L239k5971k0404r651R908J6993J0925j3625L686n814k4654j1732
7692f5867P665r741K0426K7944P665j2045J5763P746L2013k1473m7422J7857K4371
7679D902n803j1172j5070r275J5215r183O741j5337N833p823K8199O514k0847
7666b7106l2106K3514L0958R449l227O94Q809j6747k2650J798j1364m986J065
7653d1899O839j4636k204J9023j1691J5120M5947k9232q095k584k0187q202Q165
7640d3636L482J3956L9395j6029j2935L798K5480j319N607m94n779k3378p223
7627a9075R627r709L258K4861J7348q190j9750J3138k9018j5994J9722J4861J1702
$$ plain form
7718 18462 -1623 -2248 -23584 -29727 7604 21914 4274 -17039 -37917 -33741 -22010 2535 8867
7705 8867 1233 4472 -21499 -41903 -51554 -41646 -24653 -13728 -27353 -23667 -29481 -54135 -65867
7692 -65867 -58202 -67943 -47517 -19573 -11908 -23953 -8190 -444 31569 10096 -37326 -19469 4902
7679 4902 -901 -12073 -27143 -36418 -21203 -30386 -23645 -38982 -33149 -40972 -12773 -6259 -27106
7666 -27106 -59212 -35698 -4740 4709 1482 2176 10985 -5762 -28412 -26614 -37978 -42964 -41899
7653 -41899 -35060 -49696 -51900 -32877 -44568 -29448 16499 -12733 -20828 -23412 -43599 -51801 -43636
7640 -43636 -40154 -26198 13197 -2832 -15767 -11969 13511 12192 17799 17305 11526 -11852 -19075
7627 -19075 -9448 -19157 -15899 8962 26310 18120 -1630 11508 -17510 -33504 -13782 1079 12781
7614A2781K196j9097L168r103m503n049L2631k438l263K6541R974j8757m66j5485
7600I130L807L731l9913p865j3430r866J7990L6929k126O222k329k1823k0453
7587c9996M193K5923l0445j7599J6762P032k0020J8755K1610n857o62m227Q404
7574a6127K8402P660l882k1517J226l5717Q503J6516J2576J1367q406k1654j5146
7561c6199J0651L45J5852K4490J5666k3191n4278j6263O798M2063J2799j9127
7549b0394M513N003r794k6202J5134K1733r811J1510K2444l292k46J0100j8368
7536B330J7954P581j6700k8878m775J5020J0401N828J0521J4894p157J5104r589
7523C2534j4477K289O626m792J3703J919k0283q240r853J3474M465j0855j7586
$$ plain form
7614 12781 14977 -4120 -952 -10055 -14558 -19607 13024 10586 7323 33864 43838 25081 24615 9130
7600 9130 12937 16668 -23245 -31110 -44540 -54406 -36416 513 -1613 4609 2280 -19543 -39996
7587 -39996 -35803 -9880 -40325 -57924 -41162 -34130 -54150 -35395 -13785 -19642 -20304 -24531 -16127
7574 -16127 12275 19935 16053 -5464 -4238 -39955 -31452 -14936 -2360 9007 601 -21053 -36199
7561 -36199 -25548 -25203 -9351 15139 30805 7614 -46664 -62927 -56129 -14066 -1267 -20394
7549 -20394 -15881 -10878 -20672 -46874 -31740 -10007 -19818 -8308 14136 10844 10598 20698 2330
7536 2330 20284 27865 11165 -17713 -22488 -7468 2933 8761 19282 34176 27019 42123 32534
7523 32534 18057 20346 26972 22180 35883 37802 17519 9279 -574 12900 17365 6510 -11076
7510a1076J5003J2488j5254j1473J0506J2750k1640p648q545N913P801j0540m980
7497b6695M25j5254j8785J2534k973J8667n601k266J0623J2717l4583m753J7133
7484c8811M073k2757q277L3867K5855j3156r272J5020L3274Q398j8995k4870q439
7471b4090J3811q620j1304K3108N062r488J1659L6750J3521L790l4607k4233k3361
7458b8002r406J4434k4L6612J2499j334j8961O574J2356K0954k1027j5314j0041
7445f80j0902k208k5822l6516j4861M998m234K8136K0452O79j6221J8014J7772
7432b1393j0704N042r878o978j7811N996K109K8496K1169R31j4521j6665R466
7419b4741K292l5168r470J6104K6804r921J6790O069m598j2011J022j2520K284
$$ plain form
7510 -11076 3927 16415 1161 -10312 194 12944 -8696 -16344 -24889 -18976 -11175 -21715 -26695
7497 -26695 -26270 -41524 -60309 -47775 -50748 -32081 -37682 -39948 -29325 -16608 -51191 -55944 -38811
7484 -38811 -34738 -57495 -65772 -31905 -6050 -19206 -28478 -13458 19816 28214 9219 -15651 -24090
7471 -24090 -10279 -18899 -30203 -7095 -2033 -11521 138 36888 50409 54199 19592 -4641 -28002
7458 -28002 -37408 -22974 -22998 13614 26113 24779 5818 12392 24748 45702 24675 9361 -680
7445 -680 -11582 -13790 -39612 -76128 -90989 -85991 -90225 -62089 -41637 -40958 -57179 -39165 -21393
7432 -21393 -32097 -27055 -36933 -43911 -61722 -55726 -53617 -25121 -3952 -3021 -17542 -34207 -24741
7419 -24741 -22449 -57617 -67087 -50983 -24179 -34100 -17310 -11241 -15839 -27850 -26828 -39348 -37064
7406c7064J1371J4815k0529J961R209L0164M173l5182J0801J2393j617J3215k5364
7393a1654j4794J2140L4386J2555j5574j9432j1137n38q87j563j0117p409q709
7380d2733O008n422j9137J7134K4776j792l2772o28J1920K543j4160n843n612
7367f5718J4830K9232L969j4865J3722n143M705r720J4460m217P23R763J090J5540
7353H371J6586r362J3266q528r924J1310j2321J8416M381j1310l5678k7389P385
7340c4797m11j033O927k141K506n99l0100k3923J6616Q893J7651J4114K3436j6320
7326a9181k7585o310j074L032K6030J8402K399J2196j4537J0813J7490m7001j7138
7313d2464j8745J6612p308Q19L8289L1843p100j9964j0022k5755L0026K764p77
$$ plain form
7406 -37064 -25693 -10878 -31407 -29446 -20237 9927 14100 -21082 -10281 2112 495 13710 -11654
7393 -11654 -26448 -14308 20078 32633 17059 -2373 -13510 -14048 -14935 -16498 -26615 -34024 -42733
7380 -42733 -36725 -42147 -61284 -44150 -19374 -21166 -53938 -54566 -42646 -40103 -54263 -60106 -65718
7367 -65718 -50888 -21656 -17687 -32552 -18830 -23973 -19268 -28988 -14528 -18745 -18022 -8259 -7169 8371
7353 8371 24957 15595 28861 20333 10409 21719 9398 27814 32195 20885 -14793 -42182 -34797
7340 -34797 -35208 -36241 -29314 -31455 -28949 -29548 -59648 -83571 -66955 -58062 -40411 -26297 -2861 -19181
7326 -19181 -46766 -53076 -54150 -51118 -25088 -6686 -4287 7909 -6628 4185 21675 -25326 -42464
7313 -42464 -61209 -44597 -51905 -51086 -12797 19046 11946 -8018 -18040 -43795 -13769 -11005 -11782
7300a1782r86p761j2331L039J959R255L9901J4715j6756k1252m209K0327J5008
7287B9127p006J8271k4158j7124n594k5279j4564L599j0933K056n064M710M783
7274d7176j9912K3365K8931k80K9985K841j7914r357L357R746K636p881k3135
7261b4794j7017Q449J4810K3761J5281j2893r509O68j9174r955K814J8475J2294
7248C210K4204p554J6313R681J2632L76Q095k334m2002k7790n014j2357J5057
7235g483J099l00n51j3279p911m155J533j699M992O377l2637q542K1895l56Q573
7220c2444K0496J7891L0887r759m0917j2808K2513K1164k3891l319p051j2011
7208b9249J0313j822j61K8759m908o537J4699K8783r881k1456k5189n5158O618
$$ plain form
7300 -11782 -12768 -20529 -32860 -29821 -27862 -18607 21294 36009 19253 -1999 -6208 14119 29127
7287 29127 22121 40392 16234 -890 -6484 -31763 -46327 -42728 -53661 -51605 -56669 -51959 -47176
7274 -47176 -67088 -43723 -14792 -15072 14913 17754 -160 -9517 -6160 3586 6222 -1659 -24794
7261 -24794 -41811 -33362 -18552 5209 20490 7597 -1912 -1244 -20418 -30373 -27559 -9084 3210
7248 3210 27414 19860 36173 45854 58486 58862 66957 64623 22621 -5169 -10183 -22540 -7483
7235 -7483 -6384 -6684 -7235 -20514 -28425 -32580 -31047 -32746 -27754 -21377 -54014 -62556 -40661 -41017 -32444
7220 -32444 -11948 5943 36830 27071 -13846 -26654 -4141 17023 -6868 -10187 -17238 -29249
7208 -29249 -18936 -20758 -20919 7840 2932 -3605 11094 39877 29996 8540 -16649 -71807 -65189
7195f5189J2023j1466L706o506J5849M0860k680j6970P929J7186L400j1848N540
7182h166O609L188P048r659J1308R12k9433j1984K4770k1466p305k677q890J9342
7168b6403P070k5167l2943k0470L1419O569Q122J3865J2182j7388j8512K7364
7156c4292K3385M226J4431L568N233r007l0561P42o299l5386k6461Q364K3888
7143e8169o342J1413L4357P068J2929L083R729j1674J2100P729J8805j2257M90
7130B9261J5722j6556k8733l036q860j192j8329M291M2743j9675k9193J494J362
7117c0701N009j3777J0554K5420J5613j105k868j8882p888j411J3775K7027p125
7104A3641m781J2204o849l6734o534J2506J8218j4027l450j9576l0637k7207j0143
$$ plain form
7195 -65189 -53166 -64632 -60926 -67432 -51583 -10723 -13403 -30373 -22444 -5258 -1858 -13706 -8166
7182 -8166 -1557 1631 8679 -980 10328 11240 -18193 -30177 -5407 -26873 -34178 -36855 -45745 -26403
7168 -26403 -19333 -44500 -77443 -97913 -66494 -59925 -51803 -37938 -25756 -43144 -61656 -34292
7156 -34292 -10907 -6681 7750 11318 16551 7544 -23017 -22275 -28574 -63960 -90421 -82057 -58169
7143 -58169 -64511 -53098 -18741 -11673 1256 4339 14068 2394 14494 22223 41028 28771 29261
7130 29261 44983 28427 -306 -3342 -12202 -13394 -31723 -27432 15311 -4364 -33557 -32063 -30701
7117 -30701 -25692 -39469 -28915 -3495 12118 11013 8145 -10737 -18625 -20036 -6261 20766 13641
7104 13641 8860 21064 14215 -22519 -29053 -16547 1671 -12356 -15806 -35382 -66019 -93226 -103369
7091a03369L8502O0353M81j610p430j1740j3243k3865J3323O315O98J8576j2589
7078c5598p764J6700j7250J4034J3998K3157j4914j9727r037l5704J1800R966
7066e0339O691K2106Q626K799l322k505K0350j3402J0282J1053K0500p073k4242
7053A524m3850l1042j9458P957K1985J7542R400Q894L430J7885N700L6049j3951
7040B2065k6625k5345j0530R354J8505j588j6033l668J8286j1768l6121K7125
7028c6343N0593J8569k6109R879K091N267k2476j2061o648m033K2915j27j7943
7015a6426o896J8748o542k2007n40N210j7762N858K1122J7220J3545J6041l5439
7002g868k3161J4873L0486k076r171J0077j4316m1428l12J0450K7262K2484l940
$$ plain form
7091 -103369 -64867 -4514 -4033 -5643 -13073 -24813 -38056 -61921 -48598 -42283 -41585 -23009 -35598
7078 -35598 -43362 -26662 -43912 -29878 -15880 7277 -7637 -27364 -36401 -72105 -60305 -50339
7066 -50339 -43648 -21542 -12916 -10117 -13439 -15944 4406 -8996 1286 12339 32839 25766 1524
7053 1524 -42326 -73368 -92826 -84869 -62884 -45342 -35942 -27048 -23618 -5733 -33 36016 22065
7040 22065 -4560 -29905 -40435 -31081 -12576 -14164 -30197 -33865 -15579 -27347 -63468 -36343
7028 -36343 14250 32819 6710 16589 18680 23947 1471 -10590 -17238 -21271 1644 1517 -16426
7015 -16426 -23322 -4574 -11116 -33123 -33663 -28453 -46215 -40357 -19235 -2015 11530 27571 -7868
7002 -7868 -31029 -16156 14330 12254 3083 13160 -1156 -42584 -42896 -32446 -5184 17300 13360
6989A3360J1868l2710m2831J4763K187N899k0542m57J1465k967J883J2732j4507
6976c9857j2249O467J9192J6859J7976J1M157L527J1813J0880k589k9550k8851
6963b2214M99J0329J2333M357k8977N768K1830q300k3988q955j8716L0829M108
6950b1097n715J6360R653o228J897J0078q436j5366K603J2652J0865M842k8036
6937a5928j6270j0470J2097Q142m4709j2702M530J6362K9009J4001l4249n998
6925e6185J8147J0126J6085j4633k3743j1378p553J4186J149J1987J7940P279
6913a6593J455K3995Q801j2699M043m080j935O438l4546k9650J838k139J6742
6900c8330K1843J057k219j6940N548J8476j42J8613m052l7123j4712j0424L3893
$$ plain form
6989 13360 25228 -7482 -50313 -35550 -33363 -27464 -48006 -48463 -36998 -39965 -38082 -25350 -39857
6976 -39857 -52106 -45639 -26447 -9588 8388 8399 12556 16083 27896 38776 36187 6637 -22214
6963 -22214 -21715 -11386 947 5304 -23673 -17905 3925 -4375 -28363 -37318 -56034 -25205 -21097
6950 -21097 -26812 -10452 -799 -7027 -5130 4948 -3488 -18854 -16251 -3599 7266 12108 -15928
6937 -15928 -32198 -42668 -30571 -22429 -67138 -79840 -75310 -58948 -29939 -15938 -50187 -56185
6925 -56185 -38038 -27912 -11827 -26460 -50203 -61581 -69134 -54948 -53799 -41812 -23872 -16593
6913 -16593 -15138 8857 17658 4959 9002 4922 2987 9425 -25121 -54771 -52933 -55072 -38330
6900 -38330 -16487 -15430 -17649 -34589 -29041 -10565 -10707 7906 3854 -33269 -47981 -58405 -24512
6887b4512K9146j8292k6648J7662N57j7671l989k1260J8826K3387J5978k3777
6875c0593P446j8610l1027q991K6497J4234L8504J5411L1j311j2987r429Q275
6862b550k3064l4330l582J7201K3296J9561J8799J4079o668q623k577j2334Q572
6849G780p821k1149k499J7385K3652l9172l3891K0152K2574K8627r681m50K8614
6836C4121p558l3377J124J5678J4446J8988k665j6152j2526k6573K931M230p485
6823a4818J8232N173l5920k2975m294K5829J4446N522j1994o032P349k33P435
6810a2280J233O798j568k929o55j2502m310J4382J4872j4514J3352n897j9734
6797b3752m096J2444L2195L970N366p658k260k7036K1506K76J0279L3711k3233
$$ plain form
6887 -24512 4634 -13658 -40306 -22644 -22087 -39758 -43747 -65007 -46181 -22794 -6816 -30593
6875 -30593 -23147 -41757 -72784 -81775 -55278 -41044 -2540 12871 12902 11591 -1396 -10825 -2550
6862 -2550 -25614 -59944 -63526 -46325 -23029 -3468 15331 29410 22742 14119 11542 -792 7780
6849 7780 -41 -21190 -23689 -6304 17348 -21824 -55715 -35563 -12989 15638 5957 5507 34121
6836 34121 26563 -6814 -5690 9988 24434 43422 40757 24605 12079 -14494 -11563 -7333 -14818
6823 -14818 3414 8587 -27333 -50308 -54602 -28773 -14327 -8805 -20799 -26831 -19482 -19715 -12280
6810 -12280 -11047 -4249 -5817 -8746 -9401 -21903 -26213 -11831 3041 -11473 1879 -4018 -23752
6797 -23752 -27848 -15404 16791 20761 26127 18469 16209 -10827 10679 10955 21234 54945 31712
6784C1712k2694L400J5707J0818n530j7006m8543j7803J0178K0457L5555j4665
6772A586j6238J7891M1797J5746L557k4955N70M4635J875J7747j8044m9699l1516
6759D952K27K796K3189l533k5559J2020J2524n799o877J059P511O526q162l6630
6745a5756k8099J3302K8385L7696K1412J5929k5303q737K7931Q029k4168j799
6733D8822R287J4046J1424Q475J799p035l8684o753r544j8611k8674j5606J6825
6720a4229Q246P455K4809k5293j3073l357J9278K2466n655L493q679r270m081
6707B110j5519P022J0009P503o395k992J3857k9978p033M209K6789J4802k754
6694B1630K7574k960n092q585k3878R843J2986l1237k5759O657N556l209j2587
$$ plain form
6784 31712 9018 12418 28125 38943 33413 16407 -32136 -49939 -39761 -19304 16251 1586
6772 1586 -14652 3239 45036 60782 64339 39384 39954 84589 86464 104211 86167 36468 4952
6759 4952 5179 7975 31164 27631 2072 14092 26616 20817 13940 14999 22510 29036 20874 -15756
6745 -15756 -43855 -30553 -2168 35528 56940 72869 47566 38829 66760 74789 50621 48822
6733 48822 58109 72155 83579 92054 93853 86818 48134 41381 31837 13226 -15448 -31054 -14229
6720 -14229 -5983 1472 26281 988 -12085 -15442 3836 26302 20647 24140 15461 6191 2110
6707 2110 -13409 -6387 3622 11125 4730 1738 15595 -14383 -21416 -17207 9582 24384 21630
6694 21630 49204 46244 41152 32567 8689 18532 31518 281 -25478 -18821 -13265 -16474 -29061
6681b9061k895J5586K8413j7474m1780k6832l511K6124J1427J4894J6602k2486
6669c0993m07K163L4166J5437j0947J209J664j9559m651J9951R339O79j2111K7753
6655C3693k2701k2292K5528j6051k0960J3113r945n815K712r923p434J764J1533
6642b6778K955p0L2164O41J4098m175o194j7114j2391O220p997J5374j4974n6715
6628g4956M166M4888k610J0360L37j2415K1431k2597o620p269m530N1870L346
6615E401J807r08J2448K494J1647M850K749k4407j8405j9439J4758k088K6727
6602A7634O95r523J180J2573J6021j5358l9102k4544J5657K0306o431p461o315
6589b4668j855P708R713P404p590j1407J8358r004p196q342J6370j3592m684j5979
$$ plain form
6681 -29061 -31956 -16370 12043 -5431 -47211 -74043 -77554 -51430 -40003 -25109 -8507 -30993
6669 -30993 -31400 -29237 4929 20366 9419 10628 12292 -7267 -11918 8033 17372 18051 5940 33693
6655 33693 10992 -11300 14228 -1823 -22783 -9670 -19615 -25430 -22718 -32641 -40075 -38311 -26778
6642 -26778 -23823 -23893 8271 8912 23010 18835 12641 -4473 -16864 -10644 -18641 -3267 -18241 -74956
6628 -74956 -70790 -25902 -28512 -18152 -17815 -30230 -8799 -31396 -38016 -45285 -49815 2055 5401
6615 5401 7208 6300 18748 21242 32889 37739 40488 16081 -2324 -21763 -7005 -9093 17634
6602 17634 18329 8806 9986 22559 38580 23222 -15880 -40424 -24767 -4461 -10892 -18353 -24668
6589 -24668 -26523 -18815 -9102 -1698 -9288 -20695 -2337 -11341 -18537 -26879 -10509 -24101 -28785 -44764
6575d4764J4482j5835N579K5334J9091j6279J764Q086m3665j5356J0005K4434
6563b7124L4777J8996l0974q137J6145L764l744l3698o596p234R342P105n342
6550c2720J3357j2837p330j4104o194L384L8374K2195J3062j7679m0542o970K531
6537d5473J73J5449K6681j6154j8954J3723j3208P19j3412r890N163K8890J0169
6524a6124n039Q665n385j5628J4213J4321J0958q018p432j5172l297k4764K0068
6511c2634J3973n093J6063J191k4874J8786K571j4393j0888J4296K5282p819J4287
6498A0748M728j4369j1088j1898L503N843J829J3606J6548R188k046N820j4223
6485A8189k1916k482O702k3903L0450j4340n477P905O454L1299J0865l7265j9455
$$ plain form
6575 -44764 -30282 -46117 -40538 -15204 3887 -12392 -10628 -2542 -46207 -61563 -51558 -27124
6563 -27124 7653 26649 -4325 -12462 3683 7447 3703 -29995 -36591 -43825 -34483 -27378 -32720
6550 -32720 -19363 -32200 -39530 -53634 -59828 -56444 -18070 4125 17187 -492 -41034 -48004 -45473
6537 -45473 -45300 -29851 -3170 -19324 -38278 -24555 -37763 -37044 -50456 -60346 -55183 -26293 -16124
6524 -16124 -21163 -12498 -17883 -33511 -19298 -4977 5981 -2037 -9469 -24641 -27938 -52702 -32634
6511 -32634 -18661 -23754 -7691 -6500 -31374 -12588 -10017 -24410 -35298 -21002 4280 -3539 10748
6498 10748 15476 1107 -9981 -21879 -18376 -12533 -10704 2902 19450 28638 26592 32412 18189
6485 18189 -3727 -6209 493 -23410 7040 -7300 -12777 -4872 1582 32881 43746 6481 -12974
6472a2974j3088k6642Q431L0292m882n4741k2504J4245J6399K8035J1176K1434
6460d819M434j6770j8931k833J0266r53q64j5680K6375K2428l1245j8352K3535
6447b3409q170O455j3953k368l253P925K7325J068N03n19j899J0347J2600J203
6433A3855J903O661J0903N94k9294J980K114k6353j4870K589O771j6175K032J9059
6419a8231K4211J4203l2606k6199P568J517j1639P450N914J1685j7060p417L597
6406c7007k2020Q28K2965K2876P921m852L50J5389L773k0342J6376K5402l69L253
6392C4543k058l2156o873K0142j0724k6168M953N378Q758k96j3883L470l0152
6379d5066J0148L3741j3492j7537J4713k871m131j7219j2133n243L9852K0882
$$ plain form
6472 -12974 -26062 -52704 -44273 -13981 -18863 -73604 -96108 -81863 -65464 -37429 -26253 -4819
6460 -4819 -385 -17155 -36086 -38919 -28653 -29606 -30470 -46150 -19775 2653 -28592 -46944 -23409
6447 -23409 -31579 -25124 -39077 -41445 -44698 -36773 -9448 -8380 -7877 -8396 -10295 52 12652 13855
6433 13855 15758 22419 33322 33916 4622 6602 8716 -17637 -32507 -29918 -23147 -39322 -37290 -18231
6419 -18231 5980 20183 -12423 -38622 -31054 -29537 -41176 -33726 -27812 -16127 -33187 -40604 -37007
6406 -37007 -59027 -58199 -35234 -12358 -4437 -9289 -8939 6450 10223 -10119 6257 31659 31290 34543
6392 34543 32485 329 -6544 13598 2874 -23294 -18341 -12963 -4205 -4501 -18384 -14914 -45066
6379 -45066 -34918 -1177 -14669 -32206 -17493 -20364 -24495 -41714 -53847 -59090 -19238 1644
6367A644j5227l825l761P44L315j0636j1914K5785L8177k5266m7159m746M504
6354d8365K9199p137k806K1280K3281j5434j2354k7431P550J3254J0091J8598
6342I726J7622K6958l1989o3525J6224M3906q611k4224k8933k4056J7617L4673
6330a4612O782m542q530J7735M570J3145J2725j6588J8775J179l1900j8718L376
6317a6603k776o344j8836N5386K1098j1862m1444k1972o468J5605K0484K346o526
6304a7912l7877j3332j0711L3700l046j1921J0552J2605J8315R205k845L020n186
6291a5433j5267J2696N833q365M091K5324k2312o262j4081J4666L409J3506q459
6278a0654j1990R469L9373k762k8321j4594m5498q109L4366L1520R522R435l147
$$ plain form
6367 1644 -13583 -17408 -21169 -20425 -17110 -27746 -39660 -13875 24302 -964 -48123 -52869 -48365
6354 -48365 -19166 -26303 -29109 -7829 15452 18 -12336 -39767 -32217 -18963 -8872 9726
6342 9726 27348 54306 22317 -41208 -24984 18922 10311 -13913 -42846 -66902 -49285 -14612
6330 -14612 -7830 -12372 -20902 -3167 1403 14548 27273 10685 29460 30639 -1261 -19979 -16603
6317 -16603 -19379 -25723 -44559 10827 31925 20063 -21381 -43353 -49821 -34216 -13732 -11386 -17912
6304 -17912 -55789 -69121 -79832 -46132 -49178 -61099 -50547 -37942 -19627 -10422 -13267 -10247 -15433
6291 -15433 -30700 -18004 -12171 -20536 -16445 8879 -13433 -19695 -33776 -19110 -15701 -2195 -10654
6278 -10654 -22644 -13175 26198 23436 -4885 -19479 -64977 -73086 -38720 -7200 2322 11757 8610
6265H610m607j9793J6026K6242J870j4509M524J5083n591k8954q745j3629r622
6252c3095j9815K0254L1113K2255k9475Q52l458j7379Q928J7103K913j9081O483
6239a2402L5433j1891p507p482l449p245J3117q547l3411j8106J0649K4680R470
6226a6691O290M477K3421J8182p280J7568k5122l0004O403j009n50J1489k0768
6213a3594m9k155p948J1804M0348P872J7840k1367j9867J0506l100N736K292l3070
6199d752k0113p230k0030j5458J4470K472K472K0569j2234j2992j360J2242k516
6186d4460J0520L2037K4532p507q759M881r877m582j5245L173M28j4522M044J5807
6172i530L2025L231k0650k069k4488J0077k9410Q097m703N777j126J1291o658
$$ plain form
6265 8610 4003 -15790 236 26478 28348 13839 18363 33446 27855 -1099 -9844 -23473 -33095
6252 -33095 -52910 -32656 -1543 20712 -8763 -7911 -11369 -28748 -19820 -2717 196 -18885 -12402
6239 -12402 23031 11140 3633 -3849 -7298 -14543 -1426 -9973 -43384 -61490 -50841 -26161 -16691
6226 -16691 -10401 -5924 17497 35679 28399 45967 20845 -9159 -2756 -3765 -4315 7174 -13594
6213 -13594 -13643 -15798 -23746 -11942 28406 36278 54118 32751 12884 23390 20290 26026 28318 -4752
6199 -4752 -24865 -32095 -52125 -67583 -53113 -50641 -48169 -27600 -39834 -52826 -54186 -41944 -44460
6186 -44460 -33940 -1903 22629 15122 6363 11244 1367 -3215 -18460 -15287 -14859 -29381 -25337 -9530
6172 -9530 22495 25726 5076 3007 -21481 -11404 -40814 -32717 -37420 -31643 -32769 -21478 -28136
6159b8136k5422J9168M413J6353O140j0748Q792Q374m079k7699L669M1122K8110
6146D0057l3526m0359J3564k022k9336m6462j6769K8050N3505L8868J5417j8048
6134B939P86j82j3756j6487J720M172K5463q833j1094R930l266J3057J7251R830
6120C1530M848J156o461Q169K0019j2467j8199q814k2341j8652j623J6590R906
6107C661J4474K2037j8138j8899M585K8837o508k9565Q919K2032k0933k8248K1388
6094C642J1345p218J5310o975o904k2168k4442O314J5606K3300K9602O045k5974
6081A7483k1903j7828j7925J225L2048N403K164P750J6584j0384j3815J6012K9959
6068D6773k2570j8530R999l119m634l386m1535k4520J6210J615M237K0696J3190
$$ plain form
6159 -28136 -53558 -34390 -29977 -13624 -7484 -18232 -9440 -1066 -5145 -32844 -29175 11947 40057
6146 40057 6531 -33828 -20264 -22286 -51622 -98084 -114853 -86803 -33298 5570 20987 2939
6134 2939 3725 3543 -10213 -26700 -24980 -20808 4655 -4178 -15272 -5342 -8608 4449 21700 31530
6120 31530 36378 37534 31073 39242 59261 46794 28595 19781 -2560 -21212 -22835 -6245 3661
6107 3661 18135 40172 22034 3135 7720 36557 30049 484 9403 31435 10502 -17746 3642
6094 3642 14987 7769 23079 16104 9200 -12968 -37410 -31096 -15490 7810 37412 43457 17483
6081 17483 -4420 -22248 -40173 -38948 -6900 -1497 667 8417 25001 14617 802 16814 46773
6068 46773 24203 5673 15672 12553 7919 4533 -37002 -61522 -45312 -43697 -39460 -18764 -5574
6055e574J856k1706j4312J2353l216J086J5548j5955O385K7397j4495J0538R839
6042I744O117k5762K701j3892L432l629L5449j5281k7416L9058j90k7008m2145
6029e8822r985j283O789J761J9587K7227j6546k1244K3874J4859K1738J0705j3848
6016D812m1537M259o950j0601O552J7722J4797K1418j7525L063k8710n676J3225
6003b5151q201J8987K4947r30j5480j1989q374k5865R041K9307R583J4772O94
5990A1341k8991o127P48J8302R840p425q242J3950J6199j5325J31l542k7003k1292
5976d7436M5958k362l046j4243l820J1202j3731j409j6814K8780L3886k6481j9201
5963b8717O944L8671J2276k8089p554m707J457K2320L2487M589j5652q614l1519
$$ plain form
6055 -5574 -3718 -25424 -39736 -27383 -30599 -29513 -13965 -29920 -23535 3862 -10633 -95 9744
6042 9744 15861 -9901 -7200 -21092 -17660 -21289 14160 -1121 -28537 10521 10331 -16677 -58822
6029 -58822 -68807 -70090 -63301 -61540 -41953 -14726 -31272 -52516 -28642 -13783 7955 18660 4812
6016 4812 -36725 -32466 -39416 -50017 -43465 -25743 -10946 10472 -7053 -3990 -32700 -38376 -25151
6003 -25151 -33352 -14365 10582 9652 -5828 -17817 -26191 -52056 -43015 -13708 -4125 10647 11341
5990 11341 -17650 -23777 -23029 -4727 5113 -2312 -10554 3396 19595 4270 4401 859 -26144 -47436
5976 -47436 -1478 -3840 -6886 -21129 -24949 -13747 -27478 -28887 -45701 -16921 16965 -9516 -28717
5963 -28717 -21773 16898 29174 1085 -6469 -11176 -9719 12601 45088 49677 34025 25411 -6108
5950f108Q795n283l736J2179k477l18k3331L865l20P424K8499j5784l0235J789
5936b5041K3854j479N52L498L850r897k5399j3908m480R900J5069J5965j628R613
5922D69p557j4020J5619K040p973m061j5194k2250J0039q520K3586M1057j2274
5909I61R231J2515j3353Q241l345J2022k2935k896o551l7717K205J5423Q343K4588
5895F732K933J4969R004m857q005k2124L629Q352k2108O189o446n696m998Q854
5881a3572j902p7j2810j994Q268N607k3878O750O1107K0472q891k3015n14K862
5867A8413n87N589J5591k3816p52K707r273o319n7J7073k504P867P092M973L066
5852C9063k7232M464j9287n331J140m334L0587j6546k2830j5357n170J0537K6986
$$ plain form
5950 -6108 2687 -2596 -6332 5847 3370 3052 -20279 -16414 -16734 -9310 19189 3405 -26830 -25041
5936 -25041 -1187 -2666 -2114 1384 5234 -4663 -30062 -43970 -48450 -38550 -23481 -7516 -9144 469
5922 469 -7088 -21108 -5489 -3449 -11422 -15483 -30677 -52927 -42888 -51408 -27822 13235 961
5909 961 10192 22707 9354 17595 14250 26272 3337 441 -6110 -43827 -41622 -26199 -17856 6732
5895 6732 9665 24634 33638 28781 20776 -1348 2281 10633 -11475 -5286 -11732 -17428 -22426 -13572
5881 -13572 -15474 -15551 -28361 -30355 -22087 -16480 -40358 -33608 27499 47971 39080 16065 15551 18413
5867 18413 17826 23415 39006 15190 14438 17145 7872 1553 1496 18569 16065 23932 31024 35997 39063
5852 39063 11831 16295 -2992 -8323 -7183 -11517 19070 2524 -20306 -35663 -40833 -30296 -3310
5839c310J4358O766O597J4006j9283j5302R698J3550l705j8611j7870p610R771
5826a0945J737m4957M971K7508J4020k005r169k3896Q815J8519q814j3575R86
5813c6805l738K4966j9406p871K9319M2495R553k1034j5452j7855J040k9328J7534
5800b6582k887K119L3224L0253J2006K29N377k0990j3448J501n646p906j464m332
5786A454j1438n076J9521n408j6940p6k290O849J0662K1532L423k8704k5255K494
5772b9252J8172k792j2937J929K0572K909j6839j8662J6401O509K889K3219J8089
5759C0207j7175K134M107m897j0690j6347k3684N759k3k151K0667K5415J3516
5746B6838M352l6667k7227k446K2508k890k2273L116K1109J5081k541J2531R766
$$ plain form
5839 -3310 11048 17814 24411 38417 19134 3832 13530 27080 23375 4764 -13106 -20716 -10945
5826 -10945 -9208 -54165 -49194 -21686 -7666 -9671 -18840 -42736 -33921 -15402 -24216 -37791 -36805
5813 -36805 -40543 -15577 -34983 -42854 -13535 28960 38513 17479 2027 -15828 -14788 -44116 -26582
5800 -26582 -29469 -27350 5874 36127 48133 48362 53739 32749 19301 20802 15156 7250 5786 1454
5786 1454 -9984 -15060 4461 -947 -17887 -17963 -20253 -13404 -2742 18790 22213 -6491 -31746 -29252
5772 -29252 -11080 -13872 -26809 -24880 -4308 -1399 -18238 -36900 -20499 -13990 -11101 12118 30207
5759 30207 13032 15166 19273 14376 3686 -12661 -36345 -30586 -30609 -32760 -12093 13322 26838
5746 26838 31190 -5477 -32704 -35150 -12642 -15532 -37805 -34689 -13580 1501 -1040 11491 21257
5733B1257K483N246j3132j9616k4309j1903J3992m20j397k91R5J8466n544O992
5719h081P941k794k1230Q970J506k129J7493j110L3479K3372m541k0516k0287
5706A2073k594K4820J3391m448o774j5901Q836O617k1663R24o599j1747k792n377
5692a1234k7175m007K4246J0241k2739m35J8618n046j1192O809m271P388K7808
5679I011J8518l1080j1313o663l4124M09J356O50J4625P15j2498K0503K6409R384
5665E902k9399o87M3145K9087m942k234k3675j1392J7155J1954j6678j3152k3067
5652a7983m05R457R378j6261l2227J2890r58K7700q706L327q449j9843k0987J712
5638f1355j0337J9570L7333j369J0011l90J0745q85j636q877l0677k9492N431
$$ plain form
5733 21257 23740 28986 15854 -3762 -28071 -39974 -25982 -26402 -27799 -28090 -27995 -9529 -15073 -8081
5719 -8081 -140 -2934 -24164 -15194 -13688 -15817 1676 566 34045 57417 52876 32360 12073
5706 12073 9479 34299 47690 43242 36468 20567 29403 36020 14357 15281 8682 -3065 -5857 -11234
5692 -11234 -38409 -42416 -18170 -7929 -30668 -31103 -12485 -17531 -28723 -21914 -26185 -18797 9011
5679 9011 27529 -3551 -14864 -21527 -55651 -55242 -53886 -53236 -38611 -37896 -50394 -29891 -3482 5902
5665 5902 -23497 -24184 18961 48048 43106 40872 17197 5805 22960 34914 18236 5084 -17983
5652 -17983 -18388 -8931 447 -15814 -48041 -35151 -36109 -8409 -17115 -13788 -22237 -42080 -63067 -61355
5638 -61355 -71692 -52122 -14789 -16158 -6147 -6537 4208 3323 1687 -7190 -37867 -67359 -61928
5625f1928J9747J0290j3740j3469J6307P849r910J3474p329L2178L104j2628R091
5612f964L756K7547j3921n1148M673Q772R286k0282J8105O605m515K3708O901
5599A2523m812j6543q111p873J8122K999M959P086R686j0338p64J4095l0318j6386
5585b5675J5890J6363j1385q806j022k1259j7472j492K1468L2236k792j6173N241
5572a4878J5187Q033k1790j3608m102L600K2012P371j5458O115M266L7584l0932
5559C400k2541M983j4741j2486K2102J9310q952M105k8146r385P420K3021L616
5546h294m131j3530J726J60j0550J4166q88j0339m26J79j623R314J4877N804k4052
5531b7607q996M990K9469R891R803j626j4049J930j7277m3922P134Q277J7926
$$ plain form
5625 -61928 -42181 -31891 -45631 -59100 -42793 -34944 -44854 -31380 -38709 -6531 -3427 -16055 -6964
5612 -6964 -3208 24339 10418 -40730 -36057 -27285 -17999 -38281 -20176 -13571 -18086 5622 12523
5599 12523 7711 -8832 -16943 -24816 -6694 -3695 1264 8350 18036 7698 6934 21029 -9289 -25675
5585 -25675 -9785 6578 -4807 -13613 -14635 -35894 -53366 -54858 -33390 -1154 -3946 -20119 -14878
5572 -14878 309 8342 -13448 -27056 -31158 -27558 -5546 1825 -13633 -7518 -3252 34332 3400
5559 3400 -19141 -14158 -28899 -41385 -19283 27 -8925 -4820 -32966 -42351 -34931 -11910 -8294
5546 -8294 -12425 -25955 -24229 -24069 -34619 -20453 -21341 -31680 -32106 -31927 -33550 -24236 -9359 -3555 -27607
5531 -27607 -36603 -31613 -2144 7747 17550 15924 1875 3805 -13472 -57394 -50260 -41983 -24057
5518b4057n911J0589j7681o123o374m465L0025j119k0617j0339K5689K7942j1896
5505a4337q06Q713J8412m874K0052J3829Q042r181m1987j0042R453j0229J8142
5492E187o754j8019k5782K4702K762l51j5038k619J0407J6401M81L878p375J2864
5478G44j0498j6108K0410j343j5758l274o7q917j5836j485J4098J0848L4043J2469
5464A9326O999j2499j8635j2704j2768j0223L693j5404J1690L3003j2241J7659
5452b104J1078l2128j7608j0194q898R773J1120K7207J7440j2866m381n578J085
5439a6054R373J8294Q292j1298q941J4774m6154p084P130o80L529L750M058k6305
5425d7316l7934J4329M793K3784J9276n209L834L1146l935n372J4002j4002J2515
$$ plain form
5518 -24057 -29968 -19379 -37060 -43183 -49557 -54022 -23997 -25116 -45733 -56072 -30383 -2441 -14337
5505 -14337 -15143 -6430 11982 7108 27160 40989 49031 39850 -2137 -12179 -2726 -12955 5187
5492 5187 -1567 -19586 -45368 -20666 -17904 -18255 -33293 -35912 -25505 -9104 -8623 -4745 -12120 744
5478 744 -9754 -25862 -5452 -6795 -22553 -25827 -25894 -34811 -50647 -52132 -38034 -27186 6857 19326
5464 19326 26325 13826 -4809 -17513 -30281 -40504 -36811 -52215 -40525 -7522 -19763 -2104
5452 -2104 8974 -23154 -40762 -50956 -59854 -50081 -38961 -11754 5686 -7180 -11561 -17139 -16054
5439 -16054 -6681 11613 19905 8607 -334 14440 -31714 -38798 -31668 -32348 -28819 -25069 -21011 -47316
5425 -47316 -85250 -70921 -66128 -42344 -23068 -28277 -24443 6703 2768 -2604 11398 -2604 9911
5412I911o901j5270j4074O151J8022J3188K260n471m185k5522j5820J7630q263
5399b8344J8786K0527P715Q300N390k1220r929J38k890j3303J6094n443j4250
5386a8429Q159J557J2221r472j0556J5098R283k7983j2403K188J2666N682N434
5373f555J2474r812k2709j5732j7846Q24J9326L1003J4811j9956j9919K5700L1047
5360B2656L208j6200j3495j870k092m3398l5332M5204K8215O323N771p134j3422
5347b1566j5770l983R012M8580L4132J1717j3695l033P607m3931j9582j1931R33
5334b1510j4018K080l288N393L5775L5309j6625j4784J7107P291l469l4744j9391
5321b4874j6821r356J2716L3214J7270J386l84k2640m129K0023J861m19J7109
$$ plain form
5412 9911 3010 -12260 -26334 -20183 -2161 11027 13287 7816 3631 -21891 -37711 -20081 -28344
5399 -28344 -9558 10969 18684 26984 32374 11154 1225 1363 -1527 -14830 1264 -4179 -18429
5386 -18429 -10270 -8713 3508 -5964 -16520 -1422 7861 -20122 -32525 -30337 -17671 -11989 -6555
5373 -6555 5919 -3893 -26602 -42334 -60180 -59356 -40030 -9027 5784 -14172 -34091 -8391 22656
5360 22656 25864 9664 -3831 -5701 -7793 -51191 -86523 -41319 -13104 -6781 -1010 -8144 -21566
5347 -21566 -37336 -41319 -32307 16273 50405 62122 48427 45394 53001 9070 -10512 -22443 -21510
5334 -21510 -35528 -33448 -36736 -31343 4432 39741 23116 8332 25439 32730 29261 -5483 -24874
5321 -24874 -41695 -51051 -38335 -5121 12149 13535 13151 -9489 -13618 6405 8266 7847 24956
5308B4956P157j81j1528N001M702j7359J515J0231J2030j8961Q376j9181j6758
5295a0000K128j3492k3643j2194P498j736L160P704j2790K0939R541K2614P860
5282G589n162m560j1997j678M521L175N189J9058k2555j3257J2302K271k6084
5269c1188N892N496O904j4144R583K7614o619j4191J0942k051j8327J1680k0193
5256b8602n542j0380O315J6487R248J0866K7336r286l7160J5593J0140N844Q355
5243A9214j4489j4181J4523J1899k1617l0231J0984K3730J3806j227J6041k9666
5231a214j3574N821j3813j0726L6J373L6196L4594k0509j1822M641P068k9178
5218a1107K107j1951j5999Q454N094Q499N661j2917k8522J5255J0497J2361J651
$$ plain form
5308 24956 32113 31932 20404 25405 30107 12748 14263 24494 36524 17563 25939 6758 -10000
5295 -10000 -7872 -21364 -45007 -57201 -49703 -51439 -48279 -40575 -53365 -32426 -22885 -271 7589
5282 7589 2427 -2133 -14130 -15808 -11287 -8112 -2923 16135 -6420 -19677 -7375 -5104 -31188
5269 -31188 -25296 -19800 -12896 -27040 -17457 10157 3538 -10653 289 -1762 -20089 -8409 -28602
5256 -28602 -34144 -44524 -38209 -21722 -12474 -1608 25728 16442 -20718 -5125 5015 10859 19214
5243 19214 4725 -9456 5067 16966 -4651 -34882 -23898 -168 13638 12411 28452 -1214
5231 -1214 -14788 -8967 -22780 -33506 -33470 -32097 4099 38693 18184 6362 11003 18071 -11107
5218 -11107 -9000 -20951 -36950 -28496 -23402 -14903 -9242 -22159 -50681 -35426 -24929 -12568 -10917
5205a0917k223N728o774n419J7129L4892K7183r125k3925l3004o033J1510K1272
5192B0294J3377k6385L714P985m627P075j1962P065O713j7080M856J3102j3185
5179A0942j5829J6368J4232l3467J3020L732j5728j1346m872n120K561j049o262
5166c2818J3682J0730j8291j5212j6588J2279N556N344K7442n729k0965O610L0790
5153B830J572q051k9323K061n508J390n521K7221N8282J8583l0152l3624q211
5140h451k0670J1363K9773J5617j0674j5984j6886k9760j2697K0000M2220J9904
5128B3755J5024q446l0751J2960K9555Q843j2977j7144k402J6999j0584m210O404
5115B7026j3507M792m54R225o35n4250l6288K6191L4356J8383j6004j5884r542
$$ plain form
5205 -10917 -13140 -7412 -14186 -19605 -2476 32416 59599 50474 26549 -6455 -12488 -978 20294
5192 20294 33671 7286 11000 18985 14358 21433 9471 16536 23249 6169 11025 24127 10942
5179 10942 -4887 11481 25713 -7754 5266 8998 -6730 -18076 -22948 -28068 -25507 -26556 -32818
5166 -32818 -19136 -8406 -26697 -41909 -58497 -46218 -40662 -35318 -7876 -13605 -34570 -27960 2830
5153 2830 4402 -3649 -32972 -30911 -36419 -35029 -40550 -13329 44953 63536 33384 -240 -8451
5140 -8451 -29121 -17758 12015 27632 16958 974 -15912 -45672 -58369 -38369 3851 23755
5128 23755 38779 30333 -418 12542 42097 50940 37963 20819 18417 35416 24832 20622 27026
5115 27026 13519 18311 17857 27082 26447 -27803 -64091 -37900 -3544 14839 -1165 -17049 -26591
5102b6591o704k525K3012n262J7491K3447k5292o099j0066J2440J0402Q979j7415
5089d183j2114K2565L3617K1686J7802l2609m1226l3975j7308J049J3323J4348
5077a7025J0010k082k7191j6977J5702k548M853o197j4212R241M6012l321P603
5064C868l840J610j7160Q684M869J943j7318n356r473l702Q475J7168J9716J8355
5050B7839j9768j6513j3428K7013j9758j0527J2039j7862L251J7364P970K525
5038A45p431j4031k0333Q093J1900K842m279L007k132K844J869Q667N980l941
5024f800o447k268J7233j5516m971j5538J2262J0015N694J3887r154j7078J6645
5011b036L8710J920j7488n534j957j1531j4700J3638j147j1319K4056J0002r344
$$ plain form
5102 -26591 -33295 -35820 -12808 -18070 -579 22868 -2424 -8523 -18589 -6149 4253 13232 -4183
5089 -4183 -16297 6268 39885 61571 79373 46764 5538 -28437 -45745 -44696 -31373 -17025
5077 -17025 -7015 -9097 -36288 -53265 -37563 -40111 -35258 -41455 -55667 -46426 -414 -3735 3868
5064 3868 28 1638 -15522 -6838 -1969 -26 -17344 -22700 -32173 -35875 -27400 -10232 9484 27839
5050 27839 8071 -8442 -21870 5143 -14615 -25142 -13103 -30965 -27714 -10350 -2380 145
5038 145 -7286 -21317 -41650 -33557 -21657 -18815 -23094 -20087 -22219 -19375 -17506 -8839 -2859 -6800
5024 -6800 -13247 -15515 1718 -13798 -18769 -34307 -22045 -12030 -6336 7551 -1603 -18681 -2036
5011 -2036 36674 38594 21106 15572 13615 2084 -12616 1022 -125 -11444 12612 22614 13270
4998A3270k2015M530J5539k050R023L370J8690j6815j5651j4324p6J4699k1593
4985a3403j609P878j3709O591P859l186q174M95j7609J5369L5176K0375j0521
4972B5532k5710j8820Q79J8208L1194M519j344j187k3256j6870Q094L0226M95
4959C1960j0208P874P675K162j0276j609J2250j3928K51n978m4656l3077l4291
4946i1851O909M0458Q378l651L261j5382J0388j1701k3129L9916K7609P338O585
4933E128o087k848o27M8020M223l1386J3869O736j6889k7221l770r818r096K0553
4919i213q093r904K3120K9305J5770J2456j9405j3209J09l2620j1878J5090m111
4906a2583j729P08p195J1039R170K3991j2208j5142j1198k3110L3570j491j3696
$$ plain form
4998 13270 -8745 -4215 11324 9274 18297 21667 40357 23542 7891 -6433 -6509 8190 -13403
4985 -13403 -15012 -7134 -20843 -14252 -6393 -9579 -17753 -17258 -34867 -19498 15678 36053 25532
4972 25532 -178 -18998 -18119 89 31283 35802 34458 33271 10015 -6855 1239 31465 31960
4959 31960 21752 29626 37301 39463 29187 27578 39828 25900 26151 20173 -24483 -57560 -91851
4946 -91851 -84942 -44484 -36106 -39757 -36496 -51878 -41490 -53191 -76320 -36404 -8795 -1457 5128
4933 5128 -959 -3807 -4434 43586 47809 16423 30292 37028 20139 -7082 -10852 -20670 -29766 -9213
4919 -9213 -17306 -27210 -4090 25215 40985 53441 34036 20827 20936 -11684 -23562 -8472 -12583
4906 -12583 -14312 -13604 -20799 -9760 -590 23401 11193 -3949 -15147 -38257 -4687 -6178 -19874
4893a9874m887J3578N704j5732N800K536J3236j419j3991L834k007j555j5131
4880b9908q495k747j3769J9566J6141o673R252J0606Q006k822j3320j3601K0350
4867g414m632j5219J2595l318N847R291l364J9580k493n581J2440Q844j693J767
4853B6650M011j5366l9424K132J0814m808M035L1107n238J8600J251J2542p70
4840D5536j8693j377Q011j3730m035j4555R724j4502o677J170l3520L879J9949
4827a8820m807o514L1701K1880j392l3350j3963K4593k5538Q315K7578k7461k4274
4814d2052J6711K4644K644j4815J4732j3705J0238K4841j8235q096l015O360K9055
4801B9307j310j3145M780L5241q126k3488j4716p176J1278j2505K5880r33O796
$$ plain form
4893 -19874 -24761 -11183 -5479 -21211 -15411 -12875 361 -1058 -15049 -11215 -13222 -14777 -29908
4880 -29908 -38403 -41150 -54919 -35353 -19212 -25885 -16633 -6027 1979 -843 -14163 -27764 -7414
4867 -7414 -12046 -27265 -14670 -17988 -12141 -2850 -6214 13366 10873 5292 17732 26576 24883 26650
4853 26650 30661 15295 -24129 -21997 -11183 -15991 -11956 19151 13913 32513 33764 46306 45536
4840 45536 26843 25466 33477 19747 15712 1157 10881 -3621 -10298 -9128 -42648 -38769 -18820
4827 -18820 -23627 -30141 1560 23440 22048 -11302 -25265 -672 -26210 -17895 9683 -17778 -42052
4814 -42052 -25341 -697 1947 -12868 1864 -11841 -1603 23238 5003 -3093 -6108 252 29307
4801 29307 27997 14852 19632 54873 46747 23259 8543 1367 12645 140 26020 25087 31883
4788C1883J1191j6971k6679q829R743k1215j0663j4737O244l93l744K5613J3876
4775d681K850j4965M703k712P720J1371l021l0740M445J7212j1861J8071J3149
4762A1541n723l87k7180n775M556R686m363l561M374P273N3803K384m0195n656
4748G77J2042K7974k440l8212k6585k35J383M467L0589J9725q036K2992m406k1493
4734A8542k545j8275k1379O018k5304k1872M2254K659j798J7056K2884K77r639
4721H878k5964o450J04J6139O687J179l3159o362L742P753J3193J3245K6525j4280
4707A1230j3051J9417k227j4142Q789j2827j6629r160N297j609q730N496l1386
4694e9532K200J6138j2540L4497P401k0535P816Q975L781j7926L2451M5071L51
$$ plain form
4788 31883 43074 26103 -576 -9405 338 -20877 -31540 -46277 -40033 -40426 -44170 -18557 -4681
4775 -4681 -1831 -16796 -12093 -14805 -7085 4286 1265 -29475 -25030 -7818 -19679 -1608 11541
4762 11541 5818 5431 -21749 -27524 -22968 -13282 -17645 -21206 -16832 -9559 44244 46628 6433 777
4748 777 12819 40793 38353 141 -26444 -26679 -25296 -20829 9760 29485 21449 44441 40035 18542
4734 18542 15997 -2278 -23657 -17639 -42943 -64815 -22561 -19902 -21700 -4644 18240 18517 8878
4721 8878 -17086 -23536 -23432 -7293 -606 573 -32586 -38948 -35206 -27453 -14260 -1015 25510 11230
4707 11230 -1821 17596 15369 1227 10016 -2811 -19440 -28600 -23303 -24912 -33642 -28146 -59532
4694 -59532 -57332 -41194 -53734 -19237 -11836 -32371 -24555 -15580 -11799 -29725 2726 47797 48148
4681D8148j2370m225l7437j0261L263j4004J1073J5566j4708o157P11J1299Q719
4668c83l608q020J4165J6397P417N664l7459k1241P491N352J1877J8384j9864
4655c828J0867J3851r696k2217j1629j0461J6339L7732L2087K847k2259k6980
4643F653l0712K2206K8643L757q678o469J752k2002l3731q85L8348J6569k4716
4630i265k2201J5788M936q833J0593N51O466pl136k664r767J824R899L541p5j3620
4614a5970O841n56N59M996j3563r655J5390N854j311k0337n370J4345O880J6952
4600E055r406k7533R00J6835J2215n11K0617J7193K969L478p386k5992N57J2955
4586B1946J3431P4o897M225k1856j6550K1377K9219l0363j3109P077K3704J2733
$$ plain form
4681 48148 35778 31553 -5884 -16145 -12882 -26886 -15813 -247 -14955 -21112 -20401 -9102 -383
4668 -383 -3991 -12011 2154 18551 25968 31632 -5827 -27068 -19577 -14225 -2348 16036 -3828
4655 -3828 7039 20890 11194 -11023 -22652 -33113 -16774 20958 53045 55892 33633 6653
4643 6653 -24059 -1853 26790 30547 21869 15400 17152 -4850 -38581 -39466 -1118 15451 -9265
4630 -9265 -31466 -15678 -10742 -19575 -8982 -8431 -1965 -1972 -5108 -7772 -17539 -15715 -5816 -2275 -2350 -15970
4614 -15970 -9129 -9685 -9126 -4130 -17693 -27348 -11958 -6104 -7415 -27752 -33122 -18777 -11897 5055
4600 5055 -4351 -31884 -30984 -14149 -1934 -2445 18172 35365 38334 41812 34426 8434 8991 21946
4586 21946 35377 35451 28554 32779 10923 -5627 15750 44969 14606 1497 8574 32278 45011
4573D5011O143j6787p864p339n9261n544R605k051q999K0692R610J628K182l280
4559a6254j2908Q478J2135m163j870K3133J4306j66j234j1417j0946k831l2530
4546c6267K552L2071J5143J336j0957j9466l1949O268K4900O975J2656j3475L643
4533f570p84O590J9879j8910j5895R322j7520j5821n103O648R843K8458J2677
4520A2814j2739n56P866j0495j3213P387K7129K2500R892o827r618j2621j2402
4507I117j0911J936j0n445m788k2640k208m851J7422J6572O293J5717n033q488
4493B683J1438L8556J5108j294j3629j3324q339k8436l1746Q655l749J8281Q839
4480C043M086j9779k3696q952K1750K3361l261p979k92M378N112o635j9461k369
$$ plain form
4573 45011 51154 34367 26503 19164 -40097 -45641 -36036 -38087 -47086 -26394 -16784 -15156 -12974 -16254
4559 -16254 -29162 -20684 -8549 -12712 -14582 8551 22857 22691 21457 10040 -906 -3737 -36267
4546 -36267 -33715 -1644 13499 14835 3878 -15588 -47537 -41269 -16369 -9394 3262 -10213 -6570
4533 -6570 -7354 -764 19115 205 -15690 -6368 -23888 -39709 -44812 -38164 -28321 137 12814
4520 12814 75 -481 7385 -3110 -16323 -8936 18193 40693 50585 43758 34140 21519 9117
4507 9117 -1794 142 132 -5313 -10101 -32741 -34949 -39800 -22378 -5806 487 16204 11171 2683
4493 2683 14121 52677 67785 66491 52862 39538 31199 2763 -28983 -20328 -24077 -5796 3043
4480 3043 7129 -12650 -36346 -45298 -23548 -187 -3448 -11427 -11719 -7341 -2229 -8864 -28325 -30694
4466c0694j0679K0843J7103k2492J626L461k2885m921Q300O172J3965O415k1176
4453c4962j3361J6667J6381j4293j9110j028J0150L3178K6534j3349k1267j0415
4441b4875J1053j3421r024l652J2293J4021J9011j5713r462m317O301N030R548
4428c207J1812n487l364L9220r533o4330j9303J2502J6200K4818r177j1380J3348
4415g881J7116j569k245n925n884o017j2192J2699p606J3660j917j4277q062K9515
4401e85P670K0943m775k0759K1853r057j1838n869J6020K6045q916J5412j9924
4388B6220n346K0098k2372m3832n326j3521j3343J7264J661K3522n049j517K2509
4375I68K0602K0473j4831n645K3158k144r580J4422K06k7481j9764J5189K5768
$$ plain form
4466 -30694 -41373 -20530 -3427 -25919 -24293 -20832 -43717 -48638 -40338 -34166 -20201 -13786 -34962
4453 -34962 -48323 -31656 -15275 -29568 -48678 -49706 -39556 -6378 20156 6807 -14460 -24875
4441 -24875 -13822 -27243 -36267 -39919 -27626 -13605 5406 -10307 -19769 -24086 -17785 -12755 -3207
4428 -3207 8605 3118 -246 38974 29441 -34889 -54192 -41690 -25490 -672 -9849 -21229 -7881
4415 -7881 9235 7666 5421 -504 -6388 -12405 -24597 -11898 -19504 -5844 -7761 -22038 -30100 -585
4401 -585 7085 28028 23253 2494 24347 15290 3452 -2417 13603 39648 30732 46144 26220
4388 26220 20874 40972 18600 -25232 -30558 -44079 -57422 -40158 -38497 -14975 -20024 -21541 968
4375 968 21570 42043 27212 21567 44725 42581 33001 47423 47629 20148 384 15573 41341
4362D1341P857p604J6129r481l028k3648j2916k653k1929p979K3435R819L0221
4349C9564k0340k9363M611L302k1012m108L9605J9989l4698l4288k09K7235K4909
4336A5197P172P061m8623k9954J149L799j7233j0290L9033K1564j5992k3290M929
4323d5478J2754J3537R193L1434N332j6698O081R983m6709j7427J014j4169O278
4310d4875J8530M1931L1469R328L3q705j279q206l2272Q061j6237M289j0777j0227
4296a8937m353L4018R628l985j9549j2043J1652Q530J3334Q685k6414j1798j8353
4283b9585K116J8291J462j164K8379P612j8281k6408j397K0283m308j7615k240
4270b2855n451K684M412J9934K0367j4175J6730j4523j4876L1437L4489j7344
$$ plain form
4362 41341 49198 41594 57723 48242 45214 21566 8650 5997 -15932 -23911 -476 9343 39564
4349 39564 19224 -10139 -5528 -2226 -23238 -27346 12259 32248 -2450 -36738 -36947 -9712 15197
4336 15197 22369 29430 -19193 -49147 -47998 -44199 -61432 -71722 -32689 -11125 -27117 -50407 -45478
4323 -45478 -32724 -19187 -9994 21440 26772 10074 16155 26138 -20571 -37998 -36984 -51153 -44875
4310 -44875 -26345 15586 47055 56383 56416 47711 46432 38226 5954 14015 -2222 2067 -8710 -18937
4296 -18937 -23290 10728 20356 16371 -3178 -15221 -3569 4961 18295 26980 566 -11232 -29585
4283 -29585 -27469 -9178 -7716 -8880 19499 27111 8830 -17578 -18975 1308 -3000 -20615 -22855
4270 -22855 -28306 -25622 -21210 -1276 19091 4916 21646 7123 -7753 23684 58173 40829
4258D0829k5535j7226j7362k8583L831K6709J4360K3804k9452k7734L8502K8327
4246C0470j3974l127p023j9916N947r293M32K2744m377k0283O99o382J267M879
4232a7937m074R019q647J9018J47j8645K2247L2014P128j9116m120K542M794K137
4218B6507k122l826q03K002q638p524j3838m4626J1673K9212Q134P069m551k09
4204a540J7983j3276K2042Q65j3733J3192k801j6141n873J1385k483k7620J0122
4191g878J2530n769J166L4681K5145j9952n3313k2510n41k597Q107k0010L2073
4178a8868K2218K66j1176k8217l951k013O889R555O636J5153J3870k0352j3945
4165b3935j86r230o352j6246J0544K0625K4398L0489J7717o534k0325j8331j4324
$$ plain form
4258 40829 15294 -1932 -19294 -47877 -44046 -17337 -2977 20827 -8625 -36359 2143 30470
4246 30470 16496 13369 6346 -13570 -7623 -16916 -16484 6260 1883 -18400 -17701 -24083 -22816 -17937
4232 -17937 -22011 -12992 -21639 -2621 -2474 -21119 1128 33142 40270 21154 17034 19576 24370 26507
4218 26507 24385 20559 19756 21758 13120 5596 -8242 -52868 -41195 -11983 -3849 3220 -1331 -1540
4204 -1540 16443 3167 25209 26074 12341 25533 22732 6591 718 12103 9620 -18000 -7878
4191 -7878 4652 -1117 49 34730 59875 39923 -13390 -35900 -36441 -39038 -30931 -50941 -18868
4178 -18868 3350 3616 -7560 -35777 -39728 -41741 -34852 -25297 -18661 -3508 10362 -9990 -23935
4165 -23935 -24121 -33351 -39703 -55949 -45405 -24780 -382 30107 47824 41290 20965 2634 -11690
4152a1690k5721K0667J1536o396L703J8639j1549J4764K288R452M512k3549j0504
4139c848K7078J8422j259k2471j1651k1078m999j3757q033j0519J8893J0700J5045
4126g477K9227o765O348Q642o83p862k2018k5344j2740J6557K1306r329P99r896
4112a9235j3954J2568L2285J5503k175l826p442m056l129l212j0328N196O724
4099D919k0823L285J377l439l719J2215k6033q950l185J2236M1351p040K2527
4086B4721q067o105J5472J5901k4674k5945J6243M8058k647J2586l3499m3217
4074a1173J822N386K8165J1316J4742n248j9545J1700j2656m307Q900j5646K1936
4061C5392j3031l783j3563k630O325j6614k03r519J625J7492l04M762J1058R112
$$ plain form
4152 -11690 -37411 -16744 -5208 -11604 -7901 10738 -811 13953 16241 25693 30205 6656 -3848
4139 -3848 23230 41652 40393 17922 6271 -14807 -19806 -33563 -41596 -52115 -33222 -22522 -7477
4126 -7477 21750 14985 21333 29975 29292 21430 -588 -25932 -38672 -22115 -809 -10138 -9339 -19235
4112 -19235 -33189 -20621 11664 27167 24992 21166 13724 9668 6539 3327 -7001 -1805 4919
4099 4919 -15904 -12619 -11242 -14681 -18400 -6185 -32218 -41168 -44353 -32117 9234 2194 24721
4086 24721 16654 10549 26021 41922 17248 -8697 7546 55604 52957 65543 32044 -11173
4074 -11173 -9351 -3965 24200 35516 50258 45010 25465 37165 24509 20202 29102 13456 35392
4061 35392 22361 18578 5015 2385 8710 -7904 -8107 -17626 -16001 1491 1187 5949 17007 26119
4047B6119j018k4541l3593N590K2035k692J7546n292k92M324M730j8423O7J0843
4033E403J4272P372j0378k4715l615p511K2811J1424j2918n246k0980l136L391
4020b3826Q98J2162L2464J7553j0510k9770m789j2130j828K3045k83j941l07n4
4006F84q992k3034k059L2050J1323j2328l639L153p424j0679j3542m631O466J1136
3992b1516J6210J8798K4268N207m077l1312j4092P385M785l227k3246k0902K0074
3979b1645m955l421M202J5826K887j1778l07O102J1173k3903J4672R785k1423
3966b2785J1429K6478K4045J0500j0024O937p363j6648k787J365l9130k9959J0503
3953c7439J6121j6219k831J5585K360J6072J7011k8720n774J3877K5664K2438
$$ plain form
4047 26119 25101 560 -33033 -27443 -5408 -8100 9446 4154 3862 8186 12916 -5507 -5440 5403
4033 5403 19675 27047 16669 -8046 -11661 -19172 3639 15063 2145 -3101 -24081 -27217 -23826
4020 -23826 -22928 -10766 21698 39251 28741 -1029 -5818 -17948 -19776 3269 2986 1045 738 684
4006 684 -8308 -31342 -33401 -1351 9972 -2356 -5995 -2842 -10266 -20945 -34487 -39118 -32652 -21516
3992 -21516 -5306 13492 37760 42967 38890 7578 -6514 871 5656 2429 -20817 -41719 -21645
3979 -21645 -26600 -30021 -25819 -9993 -7106 -18884 -19191 -13089 -1916 -25819 -11147 -1362 -22785
3966 -22785 -11356 15122 39167 49667 39643 46580 39217 22569 19782 21147 -17983 -47942 -37439
3953 -37439 -21318 -37537 -40368 -24783 -22423 -6351 10660 -18060 -23834 -9957 15707 38145
3941C8145o664k3217l8583L17R002K0518Q381j6062l090J7245j4666K2479J9646
3928C3451j2885l9785o00N915j056K4096J0821j2129r184J1668J4875k2924M573
3915F836K4719J4259k6884l5073k129L722K3662j4416k347k948j223K4325l417
3902I086m373k54l489J7366o654k869j6871o579j8906j2164j1811K1196J9895
3889a6427Q822n47K2881J3617p025l8520o380m449R118J8267K3159j471j7275
3876C770J5974Q561q697k8294l2891o163q73R809L3379N701N160J2601J8156J1299
3862D7492l9904j383J0930p556k9534J6621K1397k8498J041L356j404j0804N054
3849a3192j2512q698k7006p13M3483K4053Q142j6251j9292Q557J0545k801j6075
$$ plain form
3941 38145 31481 8264 -30319 -30002 -21000 -482 7899 -8163 -11253 5992 -8674 13805 33451
3928 33451 20566 -19219 -19819 -13904 -14960 9136 19957 7828 -1356 10312 25187 2263 6836
3915 6836 31555 45814 18930 -16143 -18272 -14550 9112 -5304 -7651 -10599 -11822 12503 9086
3902 9086 4713 4459 970 18336 11682 8813 -8058 -14637 -33543 -45707 -57518 -36322 -16427
3889 -16427 -7605 -8152 14729 28346 21321 -17199 -23579 -28028 -18910 -643 22516 21045 3770
3876 3770 19744 28305 19608 -8686 -41577 -47740 -48613 -38804 -5425 276 5436 18037 36193 47492
3862 47492 7588 6205 17135 9579 -19955 -3334 18063 -10435 -9394 -6038 -7442 -18246 -13192
3849 -13192 -25704 -34402 -61408 -62121 -18638 5415 13557 -2694 -21986 -13429 -2884 -5685 -21760
3836b1760J9262L5223l92k5906l577J3006J2870K0129R160l4284k9406k771p957
3823a6403J2456K7470K8408l3435l3473j1732K4669K9841k2323J564l211L07k1706
3810a7568j18J0730k6338J190L8615K3934J4922R376l3886p999l086j1156J9683
3797A8299R489k1917N214L935q146j4510J312N578J3567J8367J5480P860l2491
3784B2037l6294j1208k318J7874k791M792K4449j1774p714l046k6791O927K9555
3771C698n881l174J8816p104L940J2039K0197k2406l3664l2406k447J6642J0003
3758b1747j7575m829K5402j2112P563J0701L313J6992K3011k6429k0893J3534
3746c069l439k0927j5489J4549K0048K6299J7189l9161k7971O779J2661K5441
$$ plain form
3836 -21760 -2498 32725 32333 6427 2850 15856 28726 48855 58015 23731 -5675 -8446 -16403
3823 -16403 -3947 23523 51931 18496 -14977 -26709 -2040 27801 5478 7042 3831 4138 -17568
3810 -17568 -17686 -6956 -33294 -32104 6511 30445 45367 54743 20857 12858 9772 -1384 18299
3797 18299 27788 5871 11085 15020 6874 -7636 -6324 -746 12821 31188 46668 54528 22037
3784 22037 -14257 -25465 -27783 -9909 -12700 -7908 16541 4767 -2947 -5993 -32784 -25857 3698
3771 3698 -2183 -5357 13459 6355 10295 22334 42531 20125 -13539 -45945 -48392 -31750 -21747
3758 -21747 -39322 -44151 -18749 -30861 -23298 -12597 -9284 7708 30719 4290 -16603 -3069
3746 -3069 -6508 -27435 -42924 -28375 -8327 17972 35161 -4000 -31971 -25192 -12531 12910
3734A2910J2835n830J906J7149O825j0304o132j8438J6608j309j2340Q040k0075
3721A845l3443q476K643M09K6759L3690j9097m926o847j2455L666K7858J6488
3708B8114p539j0109l3527P108J9703K3527K1001k0451k3159J379j8198k4029
$$ plain form
3734 12910 25745 19915 21821 38970 45795 35491 29359 10921 27529 26220 13880 21920 1845
3721 1845 -31598 -40074 -37431 -37022 -10263 23427 4330 -596 -7443 -19898 -16232 11626 28114
3708 28114 20575 10466 -23061 -15953 3750 27277 48278 27827 4668 6047 -12151 -36180
$$ [...]
##END NTUPLES=NMR SPECTRUM
##END=
