##TITLE=Analysis number 313633
Compound Code cc 45204
Book Reference 440/56
Project Code adrs
Chemist Name craigr
##JCAMPDX= 6.0         $$ Bruker NMR JCAMP-DX V2.0
##DATA TYPE= NMR SPECTRUM
##DATA CLASS= NTUPLES
##ORIGIN= Bruker BioSpin GmbH
##OWNER= NMR
$$ XWIN-NMR		Version 3.5
$$ Thu Sep 15 12:17:49 2005 GMT Daylight Time (UT+1h)  MAYBRIDGE\NMR@NMR_250MHZ
##.OBSERVE FREQUENCY= 250.131544655141
##.OBSERVE NUCLEUS= ^1H
##.ACQUISITION MODE= SIMULTANEOUS (DQD)
##.ACQUISITION SCHEME= undefined
##.AVERAGES= 16
##.DIGITISER RES= 18
##SPECTROMETER/DATA SYSTEM= dpx250
##.PULSE SEQUENCE= zg30
##.SOLVENT NAME= CDCl3
##.SHIFT REFERENCE= (INTERNAL, CDCl3, 0, 16.522)
##AUDIT TRAIL= $$ (NUMBER, WHEN, WHO, WHERE, WHAT)
$$ ##TITLE= Audit trail, XWIN-NMR		Version 3.5
$$ ##JCAMPDX= 5.01
$$ ##ORIGIN= Bruker BioSpin GmbH
$$ ##OWNER= NMR
$$ C:\u/data/dgb/nmr/ADRS/9510/pdata/1/auditp.txt
$$ ##AUDIT TRAIL=  $$ (NUMBER, WHEN, WHO, WHERE, WHAT)
(   1,<2005-09-15 12:17:30.56 +100>,<MAYBRIDGE\NMR>,<NMR_250MHZ>,
      <created by zg, POWCHK disabled, PULCHK disabled
       configuration hash MD5:
       62 19 C7 07 E1 42 D1 B7 37 6C 3D D0 77 39 F9 E6
       data hash MD5: 64K
       B9 21 87 37 AF BD 5D 29 D4 3A A0 5C 1E B9 EE 9E>)
(   2,<2005-09-15 12:17:42.21 +100>,<MAYBRIDGE\NMR>,<NMR_250MHZ>,
      <Start of raw data processing
       ef LB = 0.3 FT_mod = 6 PKNL = 1 SI = 32K 
       data hash MD5: 32K
       08 77 1A 9A 96 B9 F6 FD F3 9F FA 89 04 50 58 10>)
(   3,<2005-09-15 12:17:43.92 +100>,<MAYBRIDGE\NMR>,<NMR_250MHZ>,
      <apk 
       data hash MD5: 32K
       03 56 16 A1 B9 24 A7 3F 13 A0 1C E4 CC A3 44 F2>)
(   4,<2005-09-15 12:17:44.74 +100>,<MAYBRIDGE\NMR>,<NMR_250MHZ>,
      <abs ABSG = 5 
       data hash MD5: 32K
       61 BA 1A 26 36 D1 1D F5 1D FC A9 24 D1 88 B3 B4>)
$$ ##END=
$$ 
$$ hash MD5
$$ E5 32 48 81 BF 22 51 D4 65 72 BA 95 45 81 55 C8
##$RELAX= 
##$RELAX= 
##$RELAX= 
##$RELAX= 
##$RELAX= 
##$RELAX= 
##$RELAX= 
$$ Bruker specific parameters
$$ --------------------------
##$DU= <C:\u>
##$EXPNO= 9510
##$NAME= <ADRS>
##$PROCNO= 1
##$TYPE= <nmr>
##$USER= <dgb>
##$AMP= (0..31)
100 100 100 100 100 100 100 100 100 100 100 100 100 100 100 100 100 100 
100 100 100 100 100 100 100 100 100 100 100 100 100 100 
##$AQSEQ= 0
##$AQ_mod= 3
##$AUNM= <au_zg>
##$AUTOPOS= <16 >
##$BF1= 250.13
##$BF2= 250.13
##$BF3= 250.13
##$BF4= 250.13
##$BF5= 500.13
##$BF6= 500.13
##$BF7= 500.13
##$BF8= 500.13
##$BYTORDA= 1
##$CFDGTYP= 0
##$CFRGTYP= 5
##$CHEMSTR= <none>
##$CNST= (0..31)
1 1 145 1 1 1 1 1 1 1 1 1 1 1 1 1 1 1 1 1 1 1 1 1 1 1 1 1 1 1 1 1 
##$CPDPRG= <>
##$CPDPRG1= <>
##$CPDPRG2= <>
##$CPDPRG3= <>
##$CPDPRG4= <mlev>
##$CPDPRG5= <mlev>
##$CPDPRG6= <mlev>
##$CPDPRG7= <mlev>
##$CPDPRG8= <mlev>
##$CPDPRGB= <>
##$CPDPRGT= <>
##$D= (0..31)
0 1 0 0 0 0 0 0 0 0.06 0 0 0 0 0 0 0.0002 0 0 0 0 0 0 0 0 0 0 0 0 0 0 
0 
##$DATE= 1126783049
##$DBL= (0..7)
120 120 120 120 120 120 120 120 
##$DBP= (0..7)
150 150 150 150 150 150 150 150 
##$DBP07= 0
##$DBPNAM0= <>
##$DBPNAM1= <>
$$ [...]
##$SUBNAM7= <"">
##$SUBNAM8= <"">
##$SUBNAM9= <"">
##$SW= 20.6930455092707
##$SWIBOX= (0..15)
0 0 3 0 0 0 0 0 0 0 0 0 0 0 0 0 
##$SW_h= 5175.983436853
##$TD= 65536
##$TD0= 1
##$TE= 295.16
##$TE2= 300
##$TE3= 300
##$TEG= 300
##$TL= (0..7)
0 120 120 120 120 120 120 120 
##$TP= (0..7)
150 150 150 150 150 150 150 150 
##$TP07= 0
##$TPNAME0= <>
##$TPNAME1= <>
##$TPNAME2= <>
##$TPNAME3= <>
##$TPNAME4= <>
##$TPNAME5= <>
##$TPNAME6= <>
##$TPNAME7= <>
##$TPOAL= (0..7)
0.5 0.5 0.5 0.5 0.5 0.5 0.5 0.5 
##$TPOFFS= (0..7)
0 0 0 0 0 0 0 0 
##$TUNHIN= 0
##$TUNHOUT= 0
##$TUNXOUT= 0
##$USERA1= <user>
##$USERA2= <user>
##$USERA3= <user>
##$USERA4= <user>
##$USERA5= <user>
##$V9= 5
##$VALIST= <valist>
##$VCLIST= <CCCCCCCCCCCCCCC>
##$VD= 0
##$VDLIST= <DDDDDDDDDDDDDDD>
##$VPLIST= <PPPPPPPPPPPPPPP>
##$VTLIST= <TTTTTTTTTTTTTTT>
##$WBST= 1024
##$WBSW= 4
##$XGAIN= (0..3)
0 0 0 0 
##$XL= 0
##$YL= 0
##$YMAX_a= 496943
##$YMIN_a= -460316
##$ZGOPTNS= <>
##$ZL1= 120
##$ZL2= 120
##$ZL3= 120
##$ZL4= 120
##$ABSF1= 16.522
##$ABSF2= -4.171173
##$ABSG= 5
##$ABSL= 3
##$ALPHA= 0
##$AQORDER= 0
##$ASSFAC= 0
##$ASSFACI= 0
##$ASSFACX= 0
##$ASSWID= 0
##$AUNMP= <proc_1d>
##$AZFE= 0.1
##$AZFW= 0.1
##$BCFW= 0
##$BC_mod= 0
##$BYTORDP= 0
##$COROFFS= 0
##$CY= 12.5
##$DATMOD= 1
##$DC= 0
##$DFILT= <>
##$DTYPP= 0
##$F1P= 14.0000005364418
##$F2P= -0.99999901652339
##$FCOR= 0.5
##$FTSIZE= 32768
##$FT_mod= 6
##$GAMMA= 0
##$GB= 0
##$INTBC= 1
##$INTSCL= 1
##$ISEN= 128
##$LB= 0.3
##$LEV0= 0
##$LPBIN= 0
##$MAXI= 10000
##$MC2= 0
##$MEAN= 0
##$ME_mod= 0
##$MI= 0
##$NCOEF= 0
##$NC_proc= -4
##$NLEV= 6
##$NOISF1= 0
##$NOISF2= 0
##$NSP= 0
##$NTH_PI= 0
##$NZP= 0
##$OFFSET= 16.522
##$PC= 1
##$PHC0= 126.2906
##$PHC1= 5.218132
##$PH_mod= 1
##$PKNL= yes
##$PPARMOD= 0
##$PSCAL= 4
##$PSIGN= 0
##$REVERSE= no
##$SF= 250.13
##$SI= 32768
##$SIGF1= 0
##$SIGF2= 0
##$SINO= 400
##$SIOLD= 32768
##$SREGLST= <1H.CDCl3>
##$SSB= 0
##$STSI= 32768
##$STSR= 0
##$SW_p= 5175.98343685301
##$SYMM= 0
##$S_DEV= 0
##$TDeff= 65536
##$TDoff= 0
##$TI= <Analysis number 999999
Compound Code 99
Book Reference 9
Project Code 9>
##$TILT= no
##$TM1= 0
##$TM2= 0
##$TOPLEV= 0
##$USERP1= <user>
##$USERP2= <user>
##$USERP3= <user>
##$USERP4= <user>
##$USERP5= <user>
##$WDW= 1
##$XDIM= 32768
##$YMAX_p= 357098255
##$YMIN_p= -60113
$$ End of Bruker specific parameters
$$ ---------------------------------
##NTUPLES= NMR SPECTRUM
##VAR_NAME=  FREQUENCY,     SPECTRUM/REAL,   SPECTRUM/IMAG
##SYMBOL=    X,             R,               I
##VAR_TYPE=  INDEPENDENT,   DEPENDENT,       DEPENDENT
##VAR_FORM=  AFFN,          ASDF,            ASDF
##VAR_DIM=   32768,         32768,           32768
##UNITS=     HZ,            ARBITRARY UNITS, ARBITRARY UNITS
##FACTOR=    0.157963299565203, 1,           1
##FIRST=     4132.6476996994, 0,             0
##LAST=      -1043.33573715361, 0,           0
##MIN=       -1043.33573715361, -60113,      0
##MAX=       4132.6476996994, 357098255,     0
$$ Real data points
##PAGE= N=1
##DATA TABLE= (X++(R..R)), XYDATA
$$ [...]
18408I0142249J0224191M457648k185472p307344j1277828j4305440j4777661
18401E4970343j3243770j0534670p804135n571670l914520k781032k006544j472541
18393G641461j100174q21748n97268m04821k43396j03481k7201K5787L6873J5381
18383D421413m9078j38561j94361k21120k09569j44421o8467M2425J53673K41428
18373C833362L24105L74538M24133N10841P03336J019938J545986K442318L680078
18364A4858635M888803N648859N471550M910648L591177J194274j334831l151199
18356C6077916m678604n704523n648426m901931l787577k762012j975219j389786
18348E229838r77786p08962n32739m04912l07072k35337j69885j13757o9858m2574
$$ plain form
18408 90142249 100366440 104824088 102638616 95331272 84053444 69748004 54970343
18401 54970343 41726573 31191903 23387768 17816098 13901578 11120546 9114002 7641461
18393 7641461 6541287 5719539 5122271 4717450 4474054 4370573 4343372 4369159 4406032 4421413
18383 4421413 4372335 4233774 4039413 3818293 3608724 3464303 3395836 3438261 3591934 3833362
18373 3833362 4157467 4532005 4956138 5466979 6170315 7190253 8736239 11178557 14858635
18364 14858635 19747438 25396297 30867847 35778495 39369672 40563946 39229115 36077916
18356 36077916 31399312 25694789 20046363 15144432 11356855 8594843 6619624 5229838
18348 5229838 4252052 3543090 3010351 2605439 2298367 2063030 1893145 1779388 1709530 1666956
18338A666956j7596M441J549o362l6498j12086j44738j40214j06292p4589o0187
18327I74384l9223l0022j6720l2733l8030m2145l9925n3476m1013m0616m1765
18316E58716k0130j9643j7377J749Q527J2721M92j5830j6730j0210p950k3382
18304D50953j1784r991p535k0984j6629q325o647j8012j7030j570k357M076K364
18291C36529k300o462o548r520n984K975P05K1032K7449J3784J1650K5290O454
18278D15054l755o836j9413k4437o305j1231l5175k9900k8597j6087j1043k850
18266B19425R11M471J0082m734K876k529m439q561j0087L528j4414M100p848j2398
18252A80383j167o84j1759j6751O721J5266J58q577J9183J2144K183j0671j961
$$ plain form
18338 1666956 1649360 1653801 1655350 1648988 1612490 1500404 1355666 1215452 1109160 1034571 974384
18327 974384 935161 905139 888419 855686 817656 775511 735586 682110 641097 600481 558716
18316 558716 538586 518943 501566 503315 511842 524563 525055 509225 492495 482285 474335 450953
18304 450953 439169 429178 421643 400659 384030 375705 369058 351046 334016 332446 330089 334165 336529
18291 336529 334229 327767 321219 311699 305715 308690 309395 330427 357876 371660 383310 408600 415054
18278 415054 411299 404463 385050 360613 354308 343077 307902 278002 249405 233318 222275 219425
18266 219425 220336 224807 234889 230155 233031 230502 226063 217502 207415 210943 196529 200629 192781 180383
18252 180383 179216 178532 166773 150022 156743 172009 172167 163590 182773 194917 197100 186429 184468
18239A84468L771j5152j9021J3051L0319K485r855p066l200J035o642r298l132
18226A61763N734L410p175j3578j8808j2839L557J0489L159r42J4358J2761j0587
18213A51302j4295K59Q028J7684O471m599j907p569j8878j2905J5097J0538J681
18200A50907N941K84M16K1633J080L060p720K162K272n603q240m64J1569L108
18186A80405j2756j5158j2053N121l751L682j443j020J1410o54j541K584N617
18173A60443l315p502J1184J4279r865O570K4813J4312N705Q035J3875J5709J4264
18160B68507K8568K3573L5101L2578K5000K1290k890J1566J5686J2892L4373K7415
18148E33659J7960J2913J8373P026M445j4190k2952j3657j6664k6586q876L365
$$ plain form
18239 184468 188239 173087 154066 167117 197436 199921 190066 183000 179800 180835 174193 164895 161763
18226 161763 167497 170907 163732 150154 131346 118507 122064 132553 135712 134770 149128 161889 151302
18213 151302 137007 137266 145294 162978 169449 164850 162943 155374 136496 123591 138688 149226 150907
18200 150907 156848 157132 157548 179181 180261 183321 175601 177763 180035 174432 166192 165728 177297 180405
18186 180405 167649 152491 140438 145559 141808 145490 144047 143027 154437 153783 152242 154826 160443
18173 160443 157128 149626 160810 175089 165224 171794 196607 210919 216624 224659 238534 254243 268507
18160 268507 297075 320648 355749 388327 413327 434617 431727 443293 458979 471871 506244 533659
18148 533659 551619 564532 582905 589931 594376 580186 557234 543577 526913 500327 491451 494816
18136D94816m216j9666k9632n881q08j6000j6329r471J3683L2680M9949N3994
18124E43119N8730O3094Q9577Q2235Q1151Q0992Q5091J01113J15536J75723K50619
18113A726980L80388O09272J079382K120596M542354Q072155N366566l843675
18105B0054018n316632m239796l108615k208748j448928r20901n81498l98175
18097A830725k84735k17054j75740j33037j23204j11518q4181o1730n1155m0059
18087E48312l9670m4011l9134l6121l7827l1169k7407j3920q511k1280l2744j9229
18075A97289O42K93n192P646q550k84M089M187Q94j0993j3329p723q170o298R868
18060A64369j686k563n635n487r952p920k371R517j923Q098J533j37n856p762
$$ plain form
18136 494816 490600 470934 441302 435421 434613 418613 402284 392813 406496 439176 489125 543119
18124 543119 601849 664943 754520 836755 917906 998898 1083989 1185102 1300638 1476361 1726980
18113 1726980 2107368 2716640 3796022 5916618 10458972 18531127 23897693 20054018
18105 20054018 14737386 10497590 7388975 5180227 3731299 2810398 2228900 1830725
18097 1830725 1545990 1328936 1153196 1020159 896955 785437 701256 639526 588371 548312
18087 548312 508642 464631 425497 389376 351549 320380 292973 279053 270542 249262 216518 197289
18075 197289 197931 198224 193032 200678 192128 191844 195933 200120 201014 190021 176692 168969 160799 154501 164369
18060 164369 162683 160120 154485 148998 139046 131126 128755 138272 136349 144447 145980 145843 139987 132225
18046A32225j0694m589n08R4O541j465K886M964o599q410M832Q518q836k551j517
18031A14891j0832j2059j866Q345J1861J3206J1803j5199j5460k475j781k603
18019I7831j5139n91n870j678p43J0924j545r96N823R417J7484o871p155O261
18005A07152P656o708J593l80j4208l50L17N870O664p946K306l858j8274k250
17991G7584j2297J604J7243J7148o854j2107K3o322m55J5695Rk689n975Q352M671
17976I5630P419m195j2430j2108o353j5054j1198N946Q949n390J415P251L468
17963F3350L439J2330l30l154Q774k932M63J052K018R094N466J105L242K7117
17949A31034M0487M3374M7376L9270M3200K9209O720n380k7516m3109m6616m1615
$$ plain form
18046 132225 121531 116942 116434 116528 123069 121604 124490 129454 122855 114445 119277 127795 118959 116408 114891
18031 114891 104059 92000 90134 98479 110340 123546 135349 120150 104690 102215 100434 97831
18019 97831 82692 82101 76231 74553 73810 84734 83189 82193 88016 97433 114917 108046 100891 107152
18005 107152 114808 108100 109693 109313 95105 94755 95072 100942 107606 99660 101966 98108 79834 77584
17991 77584 65287 66891 84134 101282 94428 82321 82344 76022 75567 91262 91271 88582 82607 90959 95630
17976 95630 103049 98854 86424 74316 67963 52909 41711 47657 56606 51216 52631 59882 63350
17963 63350 66789 79119 78789 75635 84409 81477 81940 82992 85010 94104 99570 100675 103917 131034
17949 131034 171521 214895 262271 301541 344741 373950 380670 375290 347774 304665 258049 216434
17937B16434k9884l0353m1706j2216j8321j699n734j8989k4369r895J3497J1131
17925D7896M781k131K721p576M932K8686K0278M097r757p090r740j392j007J4389
17911H9087J3649J2554J381J6638R528P797J1154K738J4445M1763N4490O8929
17899C44153P0512P7230N9459M8104J1689j3029m6841p4060q2256p0573n3601
17888B70787m3981m0101l6006k8037k7002k3831q206l832m495P174N690m610n794
17875E7756N590l90k566P011N506l969j156r447j8007N03J2107K457J391P032
17861F3818M014k298J0005k307L906M387l904L0317L8787L5115K7879M0975L3336
17848B84030K6009J1286j8592k9399l0159m0968k2849k0973k1374k1859j8625
$$ plain form
17937 216434 186550 156197 114491 102275 83954 82255 76521 57532 33163 23268 36765 47896
17925 47896 52677 50546 53267 45691 50623 79309 99587 103684 93927 86837 77097 75705 74698 89087
17911 89087 102736 115290 116671 133309 142837 150634 161788 164526 178971 220734 275224 344153
17899 344153 414665 491895 551354 599458 611147 598118 551277 477217 394961 324388 270787
17888 270787 226806 186705 150699 122662 95660 71829 63623 59791 55296 62470 68160 63550 57756
17875 57756 63346 62956 60390 67401 72907 68938 67782 58335 40328 40831 52938 55395 56786 63818
17861 63818 67832 65534 75539 73232 77138 81525 77621 107938 146725 181840 209719 250694 284030
17848 284030 310039 321325 302733 273334 243175 202207 179358 158385 137011 115152 96527
17837I6527j7185r977j1831q499j2023q467l090o94J1135N816o568q651M776O382
17823C7651J901K13K009l149J086l93J0445N939l623N618J0584p030j9960J0272
17809E1563j677j3926j0325M096p20k139M283R094O654P10j784j4493R113L908
17795D4357j6867n517J547n392L450J6280Q187j3742r26K804j438j8281o731N246
17781A2977P448J3379K526M41N45r252P556k892j0991j0455J216j0055q501J808
17767d250K1303O971P056J1625l907j5945o488N742P14j537l422q662Q900p56
17753A7344P538O553l851P933n500j2131j0582J3327J655J505l418O26O364j1587
17739A5776j2644l848M948o382l370l138n856N687J8320O421k173m163m786R71
$$ plain form
17837 96527 79342 69365 57534 49035 37012 28545 25455 24761 35896 41712 35144 26493 31269 37651
17823 37651 39552 39765 41774 38625 39711 39318 49763 55702 52079 57697 68281 61251 41291 51563
17809 51563 49886 35960 25635 29731 29011 26872 31155 40249 46903 47613 45829 31336 40449 44357
17795 44357 27490 21973 23520 18128 21578 37858 46045 32303 31377 34181 32743 14462 7731 12977
17781 12977 20425 33804 36330 36771 37316 28064 35620 32728 21737 11282 12498 2443 -6058 -4250
17767 -4250 17053 24024 31080 42705 38798 22853 16365 22107 22821 21284 17862 9200 18100 17344
17753 17344 24882 31435 27584 35517 30017 17886 7304 20631 22286 23791 20373 20999 27363 15776
17739 15776 3132 -716 4232 -2150 -5520 -8658 -14514 -8827 9493 15914 13741 9578 4792 5763
17725E763Q578J2475O28j2142K428R734J0973N430O683j0370p449k377o881o81
17711B2792J99M74N04M641J1006j232m322J0720K070j1470O707N099j5803J308
17697C2693K019k857J533m194j300k243o056J3349K538j2166N00K161r23m787
17683B0267L532J814O588L275O318R675M159m27J132J0265L09n521L207p665r111
17668D7817K392P478M715j2891r2J993O060J584m299M621J3600n239o155k710
17654E8874J6130J4823J0926l652Q6M474L398r268j6446j00J3j1213n175o91N6
17639F2235l387j4701Q949O872o419j2458k906J13J8236J0035j8285j4443Q898
17626D2739O152m896l971J1711R700j002j1627j003K680J0377J0654N641n672
$$ plain form
17725 5763 14341 26816 27444 15302 17730 27464 38437 43867 50550 40180 32731 30354 23473 22792
17711 22792 22991 23465 23969 28610 39616 38384 34062 44782 46852 35382 42089 47188 31385 32693
17697 32693 34712 31855 33388 29194 27894 25651 19595 32944 35482 23316 23816 25977 25054 20267
17683 20267 23799 25613 32201 35476 41794 51469 55628 55201 56333 66598 66907 61386 64593 56928 47817
17668 47817 50209 57687 62402 49511 49419 51412 57472 59056 54757 59378 72978 67739 61584 58874
17654 58874 75004 89827 100753 97101 97187 101661 105059 95791 79345 79245 79258 68045 62870 62179 62235
17639 62235 58848 44147 53096 59968 53549 41091 38185 38298 56534 66569 48284 33841 42739
17626 42739 48891 43995 40024 51735 61435 60433 48806 47803 50483 60860 71514 77155 71483
17613G1483j406q646j8997r380K801Q276L362L46j502O093K606P340O714p753
17599F1337M73l745r614O420M683P309P88r213j553o400k076L807N050o877O153
17584E6542M487o738J791j992j3262J0630R397K346j1948n310n6l122r857r368
17570B3540R940N070m956l483P135J870l208p595p494M920j749j283P500K269
17556C2476P03j022m771R320o05n282L859M27L196n764j1450n396O459J3482m513
17541C1119r028p841m952R163R986P54J3375O051o303L105O882q76p249m97k11
17526D3478j5679r384J3559J3061o841j0566M094j4757p973J6918J1654k015m274
17513C1275R994K359k1815m693m051J4461K2828J9657n825n301q307k0067j0454
$$ plain form
17613 71483 70077 61431 42434 33054 35855 44131 47493 47839 46337 52430 55036 62376 69090 61337
17599 61337 61810 58065 48451 54871 59554 66863 67651 58438 56885 50485 48409 52216 57266 50389 56542
17584 56542 61029 54291 56082 54090 40828 51458 60855 63201 51253 45943 45887 42765 32908 23540
17570 23540 33480 38550 33594 30111 37246 39116 35908 28313 20819 25739 23990 22707 30207 32476
17556 32476 33179 32157 27386 36706 36101 30819 34678 35105 38301 32537 21087 15691 22150 35632 31119
17541 31119 22091 14250 9298 18461 28447 29201 42576 48627 42324 45429 52311 51435 44186 43689 43478
17526 43478 27799 18415 31974 45035 38194 27628 31722 16965 8992 25910 37564 35549 31275
17513 31275 41269 43628 21813 17120 13069 27530 50358 70015 64190 58889 50582 30515 20061
17500B0061j770J1228J3596q780j0992j502r844m945j224P790J7391P678m739
17487C3948j184j353n091m193q102J4062j750r177J462o50Q593r14k1315k560
17473A776L178J7685j4578j351q243J464m412m10q958Q614L271N164n696o790
17459i286q59J0018J261L669P549k680n329P370O600J1662p222l279M733M680
17445B8887p647Q941K7588J5024M2140L6879k0655k3326j8271k0977j4059j6783
17433C7741j699P364j3221j3779J1300N688K671p930j311n024j218j159q045N902
17419A7280J6958J0221n484j3031K515K165o244n504j6249p464J1928J1719J330
17406B0140P601K770q135k375n87R014N627m668j0850p756r95j0384l083m172
$$ plain form
17500 20061 18291 29519 43115 34335 23343 21841 11997 7052 5828 13618 31009 38687 33948
17487 33948 32764 31411 26320 22127 14025 28087 26337 17160 18622 17972 26565 25651 4336 1776
17473 1776 4954 22639 8061 6710 -1533 -69 -4481 -4891 -13849 -5235 -1964 3200 -2496 -9286
17459 -9286 -10145 -127 1134 4803 12352 9672 4343 11713 18313 29975 22753 19474 24207 28887
17445 28887 21240 30181 57769 72793 114933 151812 131157 107831 89560 68583 54524 37741
17433 37741 36042 43406 30185 16406 27706 33394 36065 28135 26824 21800 20582 19423 11378 17280
17419 17280 34238 44459 38975 25944 28459 30624 24380 18876 2627 -4837 7091 18810 20140
17406 20140 27741 30511 22376 20001 19414 28428 34055 29387 18537 10781 9786 -598 -3681 -7853
17392g853Q65M104M552P949J4301L485j6078m790J1106R773K634O227o453P49
17378C0571J2839Q978j384j1187j2943j51O539j841N482q288j2916L039R952M10
17364B9100p999O278j4788n648K772O760K315o734L040m950K40j754R16j4046
17350d498j0523K002L997K487K804J2421J5800q03q919q922J330J295l312j052
17336D107J749M210p99Q20J1280q01r86k507j133P15r873L687L374P032l504L077
17320B0448m582N52O739k224m005j804k9J2402L198J052q707j9919n121n0j3165
17305a5215l331J1425l43R82o32L206J0294K416L575n199K666j4298p022k215
17291a3691K603N74j154K455O706J1113P689j548k544q49J1642k056q731j5243
$$ plain form
17392 -7853 -6988 -2884 1668 9617 23918 27403 11325 6535 17641 27414 30048 36275 29822 30571
17378 30571 43410 52388 51004 39817 26874 26723 33262 31421 36903 28615 15699 18738 28690 29100
17364 29100 21101 27379 12591 6943 9715 16475 18790 12056 15096 10146 10386 8632 9548 -4498
17350 -4498 -15021 -13019 -9022 -6535 -3731 8690 24490 23687 14768 5846 7176 8471 5159 4107
17336 4107 5856 10066 9267 10087 21367 20566 19580 17073 15940 16655 6782 10469 13843 20875 17371 20448
17320 20448 15866 16418 23157 20933 16928 15124 15095 27497 30695 31747 23040 3121 -2000 -2050 -15215
17305 -15215 -18546 -7121 -7464 -6482 -7114 -3908 6386 8802 12377 7178 9844 -4454 -11476 -13691
17291 -13691 -11088 -10514 -11668 -9213 -2507 8606 16295 14747 12203 11354 22996 20940 12209 -3034
17277c034m025k375J2266n436k103N483q72L921R933J208m238j2706o719Q11J4359
17262F473l46j1656Q71O765k849J613P913o93j7163L341K0503k986j6328j2755
17248a7297j0574j1513J0975J1848K17j112m87n172Q078J1465R148r99j6824j978
17234a4225J3512M853j1207k1442O741J0062O553J2277k347j1652p628K115j3100
17221b5488j3344r135J8613J5009l877M140M687k469k053J003L999N399L630l867
17207c753j4779K923N539Q392P63j776j0988n058q078l687J2637k104J303N664
17193a3002l918K0074Q626L333j654k594Q763l74o088L195O346l686j547q664
17179H810p702J713J0896M110k33M842m10K0881L429p574m659l807n653o779K628
$$ plain form
17277 -3034 -7059 -9434 2832 -2604 -4707 776 -96 3825 13758 14966 10728 -1978 -8697 -7886 6473
17262 6473 6127 -5529 -4658 2107 -742 871 8784 8091 -9072 -5731 14772 11786 -4542 -17297
17248 -17297 -27871 -39384 -28409 -16561 -16344 -17456 -17943 -23115 -15037 -3572 5576 4577 -12247 -14225
17234 -14225 -713 4140 -7067 -28509 -21768 -11706 -5153 7124 4777 -6875 -14503 -12388 -25488
17221 -25488 -38832 -47967 -29354 -14345 -18222 -14082 -9395 -11864 -13917 -12914 -8915 -3516 114 -3753
17207 -3753 -18532 -15609 -10070 -1678 -915 -2691 -13679 -18737 -26815 -30502 -17865 -19969 -18666 -13002
17193 -13002 -16920 3154 11780 15113 13459 10865 19628 19254 13166 16361 22707 19021 17474 8810
17179 8810 1108 2821 13717 17827 17594 22436 22026 42907 46336 38762 34103 30296 24643 17864 20492
17164B0492J628r757j1625J6164N003O36q950M293Q247j2207j4515k033R9o391
17150h916P638R972j800j5398l181P607o35J1821N455M386n137p382l126n015
17136c711M375M58p742j1273L143O831r417N173J0273J520j696k55m305J3025
17122F399R466m186L854r536q728Q165M769j4849j2458j4369N612K405J2277n577
17108a6756j1318k076l287o452r36M968J0899J0420p107M173k933R724J84K023
17094h474N746k84P056j2852K755N849j4638r00k530j332L467o517m12j5299k841
17079d1206J9310J6651K546m37O69K676n016r170K137l409N596p962R582O700
17065a333P674p758l747j1320o875k121m856O831K948R809L233K757j892q040
$$ plain form
17164 20492 22120 12363 738 16902 21905 22541 13591 17884 26131 13924 -591 -2624 -2525 -8916
17150 -8916 -1278 8694 6894 -8504 -11685 -4078 -4713 7108 12563 16949 11812 4430 1304 -3711
17136 -3711 664 1122 -6620 -17893 -14750 -7919 -17336 -12163 -1890 -370 -2066 -2321 -6626 6399
17122 6399 15865 11679 15533 5997 -2731 5434 10203 -4646 -17104 -31473 -25861 -23456 -11179 -16756
17108 -16756 -28074 -30150 -33437 -39889 -40825 -35857 -24958 -14538 -21645 -17472 -20405 -10681 -10497 -8474
17094 -8474 -2728 -3012 4044 -8808 -6053 -204 -14842 -15742 -18272 -19604 -16137 -22654 -23066 -38365 -41206
17079 -41206 -21896 -5245 -2699 -3136 -2467 209 -4807 -13977 -11840 -15249 -9653 -17615 -8033 -1333
17065 -1333 6341 -1417 -5164 -16484 -23359 -25480 -30336 -23505 -20557 -10748 -7515 -4758 -6650 -14690
17051a4690R103L674n794n568J125J2232m53J947j817o206R56R630J1110L823
17037A9072j0299j3947n643q920L419J2114j55q598o035J4197O584J58r164n757
17023a2974O565J366K464j3429k431l110K326L106R450N707n942j3149o752L857
17009b2946K841J0126k495j1512Q079M073k525R402O408k798q637m404p390J2901
16995h877J1275k245J801r887q600M052P148k448j5j1619n253o690J1924J7327
16981b107O543j158R160r321m04j0706m668k535k050P868J320L740n894M775q045
16966a3482q194L381Q255J1650J0235O762r01J684j1989p471j58K988J252r59
16952C053J146O992j2009j4971o876q016J7976J3650P17L645n005j2551j0086
$$ plain form
17051 -14690 -5587 -1913 -7707 -13275 -12150 82 -371 1576 -241 -6447 -5491 4139 15249 19072
17037 19072 8773 -5174 -10817 -19737 -16318 -4204 -4359 -12957 -18992 -4795 1789 1947 -7217 -12974
17023 -12974 -6409 -5043 -2579 -16008 -18439 -21549 -19223 -16117 -6667 -960 -6902 -20051 -26803 -22946
17009 -22946 -20105 -9979 -12474 -23986 -15907 -11834 -14359 -4957 1451 -1347 -9984 -14388 -21778 -8877
16995 -8877 2398 153 1954 -7933 -16533 -12481 -5333 -7781 -7796 -19415 -24668 -31358 -19434 -2107
16981 -2107 4436 3278 12438 3117 2713 -7993 -12661 -15196 -17246 -9378 -8058 -4318 -10212 -5437 -13482
16966 -13482 -21676 -18295 -10040 1610 11845 18607 17706 19390 7401 -70 -228 2760 4012 3053
16952 3053 4199 11191 -818 -15789 -22665 -30681 -12705 945 1662 5307 302 -12249 -22335
16939b2335k920J157J4413J3488p11n802p12J0927j763j2230j1721K436O100n681
16925a5354m447j5191j8084O70M140J3486R749J1304K0099O033J581j1573J717
16912D130N535m580P329L569n211j7141m561L301N455j0740r321m164J8208l733
16898a1924o505q449n486l91o34J2147J5238Q285R48p27P714O318n709m071j1655
16883d901r295m288j1002K080R761Q614N31j0822p414M289R624n17j441R340M507
16868i34N712p567L863L887L216p09r281J745o981p054N280Q30J753j5423o265
16853b7928J4079p538J709j520k92O907L596j3284P10M330Q540N763q012k850
16839a5790J3469n505j869P000K377j704L99r662r081P836P761J878m413k1430
$$ plain form
16939 -22335 -25255 -24098 -9685 3803 3092 -2710 -3422 7505 5742 -6488 -18209 -15773 -9673 -15354
16925 -15354 -19801 -34992 -53076 -52406 -48266 -34780 -25031 -13727 6372 12405 13986 2413 4130
16912 4130 9665 5085 12414 15983 10772 -6369 -10930 -7629 -2174 -12914 -22235 -26399 -8191 -11924
16898 -11924 -18429 -26878 -32364 -32755 -33389 -21242 -6004 2281 3229 2502 10216 16534 10825 6754 -4901
16883 -4901 -14196 -18484 -29486 -27406 -17645 -9031 -8500 -19322 -26736 -22447 -12823 -13340 -14781 -5441 -934
16868 -934 4778 -2789 1074 4961 8177 7468 -1813 -68 -7049 -14103 -8823 -7993 -6240 -21663 -27928
16853 -27928 -13849 -21387 -19678 -21198 -21490 -14583 -10987 -24271 -23561 -19231 -10691 -4928 -12940 -15790
16839 -15790 -2321 -7826 -9695 -2695 -318 -2022 -1623 -11285 -20366 -12530 -4769 -2891 -7304 -28734
16825b8734J317R168Q016O299l894P355J0860M631p708q042j913j0840M026J8813
16811I354l28j5458j0562o013M717R633M603m580J588J329r204n405o410j0508
16797c7244m600R631J4045m666L721J2342J3618K799J885j6097j7017M368J4729
16784b486o394O76j309L084P960j3619o795K538k425n104R600J1042P33m610N409
16769a700M958L157l845l456P09q617m439n93j918K908N216R254or33p2J737q382
16752f022N63j944n988K063J805N027m714k91M96R07k646j1113M883P698l432
16737a2708R18J182q81l295J1095K640n575K859M235J737p670p236k955R234Q377
16722A957K684L602j128m963K594q91p147j3241Q611o18l648J054L408l499j0709
$$ plain form
16825 -28734 -27417 -18249 -10233 -3934 -7828 -473 10387 15018 7310 -732 -2645 -13485 -9459 9354
16811 9354 9026 -6432 -16994 -23007 -18290 -8657 -4054 -8634 -7046 -5717 -14921 -20326 -26736 -37244
16797 -37244 -41844 -32213 -18168 -22834 -19113 -6771 6847 9646 11531 -4566 -21583 -17215 -2486
16784 -2486 -8880 -8204 -9513 -6429 1531 -12088 -18883 -16345 -18770 -23874 -14274 -3232 -2499 -7109 -1700
16769 -1700 3258 6415 2570 -886 -177 -8794 -13233 -13826 -15744 -12836 -7620 1634 1628 695 623 2360 -6022
16752 -6022 -5459 -7403 -13391 -11328 -9523 -4496 -9210 -9501 -9005 -8098 -10744 -21857 -16974 -9276 -12708
16737 -12708 -11790 -10608 -11489 -14784 -3689 -1049 -6624 -3765 470 2207 -5463 -12699 -15654 -6420 1957
16722 1957 4641 8243 7115 2152 4746 3855 -3292 -16533 -7922 -8540 -12188 -11134 -7726 -11225 -21934
16707b1934N469J3605J0265J109q234j929M840m593r24M457n815j5011q443N323
16693b1815R92m605J2100J252r848n4J890J391j146R219N109J229J672j4215k596
16678a9425O10K611q7M452r02j2510m959q489j97J2413k778R955J391K371j75
16663a5719P50l138J1863j641o549l286j985K396K477o881N398j559l449r136
16649c0459J9112O203j735R036m995O379M29l555P626j286j0316j5173r148R441
16635a8441K047P398K105j6873p305J7362L003m459J2296R065n66j0021p515P537
16621d367N523j4665l500L725M910L267l291j36K117M053l998j0559L225J0294
16607c402O430K07j393J838r562J10j2155j346L15k845O015R215R248J4728q339
$$ plain form
16707 -21934 -16465 -2860 7405 8514 280 -1649 3191 -1402 -2326 2131 -3684 -18695 -27138 -21815
16693 -21815 -20823 -25428 -13328 -12076 -21924 -21978 -20088 -18697 -19843 -10624 -5515 -4286 -2614 -16829 -19425
16678 -19425 -18815 -16204 -16291 -11839 -12741 -25251 -30210 -38699 -38896 -26483 -29261 -19306 -17915 -15544 -15719
16663 -15719 -14969 -18107 -6244 -7885 -14434 -17720 -19705 -17309 -14832 -21713 -16315 -17874 -21323 -30459
16649 -30459 -11347 -5144 -6879 2157 -2838 3541 3970 415 8041 6755 -3561 -18734 -27882 -18441
16635 -18441 -16394 -8996 -6891 -23764 -31069 -13707 -10704 -15163 -2867 6198 5632 -4389 -11904 -4367
16621 -4367 1156 -13509 -17009 -13284 -8374 -5107 -8398 -8534 -6417 -2364 -6362 -16921 -13696 -3402
16607 -3402 3028 3235 1842 3680 -5882 -5772 -17927 -19273 -18958 -21803 -15788 -6573 2675 17403 9064
16592I064q520j0283j3321l659J7763n87N578M22n538L205L130J212J059j108
16578a583p141M8J3025N937n65n311q425o970n418k296O282O286J611q465J79
16563a2806K829q645m036K187j094k512P567m170o144N202j431R720o558q059
16549b7950K0479o166o358N607q821o265J720O591Q807P151p355j1338n17K916
16535b1499J221l556n737J305k586N224J2156p281o715O557O278j1825o287J0887
16521b1858k638L127Q801M67M162j0917L316n57N114j478L656M711j150r42o606
16506a2792J043J490q570j0724M690L341J0760j793l951o03j475N948J97n092
16492a7531K108Q44M03l730O619j1248r346R061J7889P683n4k29q450P237j181
$$ plain form
16592 9064 544 -9739 -23060 -26719 -8956 -9543 -3965 -3543 -9081 -5876 -2746 -1534 -475 -1583
16578 -1583 -8724 -8676 4349 10286 9721 4410 -4015 -10985 -16403 -18699 -12417 -6131 -4520 -12985 -12806
16563 -12806 -9977 -18622 -22658 -20471 -21565 -24077 -16510 -20680 -26824 -21622 -23053 -13333 -19891 -27950
16549 -27950 -7471 -13637 -19995 -14388 -23209 -29474 -27754 -21163 -12356 -5205 -12560 -23898 -24415 -21499
16535 -21499 -20278 -23834 -29571 -28266 -30852 -25628 -13472 -20753 -27468 -20911 -14633 -26458 -32745 -21858
16521 -21858 -24496 -21369 -12568 -12101 -7939 -18856 -15540 -16097 -10983 -12461 -8805 -4094 -5244 -6186 -12792
16506 -12792 -11749 -10259 -18829 -29553 -24863 -21522 -10762 -12555 -16506 -17109 -18584 -12636 -12439 -17531
16492 -17531 -15423 -14579 -14176 -17906 -11287 -22535 -31881 -22820 -4931 2752 2698 2469 -5981 1256 75
16477G5k588N515r944j4599J074M052Q724p212j734J0024M233j627m171n505J975
16462a1708Q631N526j185n499j6000j138R839r200j2600n371J464M364J2373P156
16448a3348n643Q075p583J3839P90n013O233o225j0136m047j542k308N916j102
16434b2094L348J6521R451r398j8374N67O201J885j1810j2690K525P560j1229
16421c7537m019R668N457K97J306l345k456J6249p0q70m850j2253N21K511j2827
16406d2218L028J3883L653M43l173N465J877N80O049L963p010l338L525J254O375
16391e644M868O91k981k922j394o085J903L210N918J152L255m554k438Q075q150
16376e096j1381K111q160j833r209Q237K1126p378J58K702o241N746o252m684
$$ plain form
16477 75 -2513 3002 -6942 -21541 -20467 -16415 -7691 -14903 -16637 -6613 -2380 -4007 -8178 -13683 -11708
16462 -11708 -3077 2449 1264 -4235 -20235 -21373 -11534 -20734 -33334 -38705 -37241 -32877 -20504 -13348
16448 -13348 -18991 -10916 -18499 -4660 -3870 -8883 -2650 -8875 -19011 -23058 -24600 -26908 -20992 -22094
16434 -22094 -18746 -2225 7226 -2172 -20546 -19979 -13778 -11893 -23703 -36393 -33868 -26308 -37537
16421 -37537 -41556 -31888 -26431 -26134 -24828 -28173 -30629 -14380 -14450 -15320 -20170 -32423 -31902 -29391 -42218
16406 -42218 -39190 -25307 -21654 -21211 -24384 -18919 -17042 -16462 -10413 -6450 -13460 -16798 -13273 -12019 -5644
16391 -5644 -776 -85 -3066 -5988 -7382 -13467 -11564 -8354 -2436 -1284 1971 -2583 -5021 3054 -5096
16376 -5096 -16477 -14366 -22526 -24359 -33568 -25331 -4205 -11583 -11425 -8723 -14964 -9218 -15470 -20154
16362b0154m095J3351J0395P930j0936j0652P126j848m664q998j900Q752O050
16349i643N257J297l633M402m124p568j0108j031O96J0743O329n106J535p08m300
16334a5962P005J427k622Q646j3285j2901k749j775O9LR402J4048J41o910o264
16319b1727m372l937L670k15N075J3464j202j1116r343o557q372K249M013J1698
16305b6672k248Q741Q781r040k16m50N494J3804l440m357l135m854L621n879p457
16290b7307O238J4712L116o763Q47J827p646n681o155K910R79Q090n81p554q538
16275c1506q71l574p00N645M352N644J3232J237j2683r70J5113M170k991p928
16261a1830o49n196o539L747J1301P32K801l188r597j0321l007K08m813r078o390
$$ plain form
16362 -20154 -24249 -10898 -503 7427 -3509 -14161 -7035 -8883 -13547 -22545 -24445 -15693 -9643
16349 -9643 -4386 -3089 -6722 -2320 -6444 -14012 -24120 -25151 -24455 -13712 -7383 -12489 -10954 -11662 -15962
16334 -15962 -8957 -7530 -10152 -1506 -14791 -27692 -30441 -32216 -32147 -32144 -22742 -8694 -8553 -15463 -21727
16319 -21727 -26099 -30036 -26366 -26581 -21506 -8042 -9244 -20360 -29703 -36260 -44632 -42383 -38370 -26672
16305 -26672 -28920 -20179 -11398 -20438 -20654 -21104 -15610 -1806 -5246 -9603 -12738 -17592 -13971 -19850 -27307
16290 -27307 -21069 -6357 -3241 -10004 -9157 -7330 -14976 -20657 -26812 -23902 -22923 -14833 -15414 -22968 -31506
16275 -31506 -32377 -35951 -36651 -31006 -26654 -21010 -7778 -6541 -19224 -20194 -5081 -911 -3902 -11830
16261 -11830 -12479 -17675 -24214 -20467 -9166 -8434 -5633 -8821 -18418 -28739 -31746 -31538 -36351 -45429 -51819
16246e1819R572J3988Q907q877l889J618N923M287j205Q049n347n320q933m009
16232c7055P114J6626J258O615M264o120k773j132o782r259n860J1938k242k6029
16218d9437n167J3201J1877O068O590K620K7085K2449k346l677m933n052k473
16205A6805j3437j5362o02o601r597m407j8603N226R802L34M046J8592K4123r233
16191A086r966o87L715j2276o826p72j056j110R659l180j0205o504N637J3528
16177a8957o494K931J1008j357l576n572j0686M368J9778J9870J9287o015J764
16164B6349M242Q2O579k501j2708k7320j2217j2509l501Q19l831r671J2740J4877
16150a8570Q163j1872q881P036M706k492L034K154L933o86j056j0879p776n027
$$ plain form
16246 -51819 -42247 -28259 -19352 -28229 -32118 -30500 -24577 -20290 -21495 -13446 -18793 -24113 -33046 -37055
16232 -37055 -29941 -13315 -12057 -5442 -1178 -7298 -10071 -11203 -17985 -27244 -33104 -21166 -23408 -49437
16218 -49437 -54604 -41403 -29526 -23458 -16868 -14248 12837 35286 32940 29263 24330 19278 16805
16205 16805 3368 -11994 -12596 -19197 -28794 -33201 -51804 -46578 -36776 -36442 -32396 -13804 10319 1086
16191 1086 -8880 -9567 -5852 -18128 -24954 -25726 -26782 -27892 -18233 -21413 -31618 -38122 -32485 -18957
16177 -18957 -25451 -22520 -11512 -12869 -16445 -22017 -32703 -28335 -8557 11313 30600 24585 26349
16164 26349 30591 30673 37252 34751 22043 -5277 -17494 -30003 -33504 -32685 -36516 -46187 -33447 -18570
16150 -18570 -10407 -22279 -31160 -24124 -19418 -21910 -18876 -16722 -12789 -13475 -14531 -25410 -33186 -38213
16136c8213J6762N672p863o287k503m238j3942N698J8514p907L527K649J0086
16123a8045M608Q759r793o6P192l976j5089m992K912n70N247J51j649N958N833
16108a3520o672N212R176l149l324o257p555m000O490l467L766M659K010k621
16094a9252j6922r084J0365J8290K989M967o735k961m006n734N268N951R119l630
16080a1375j1111K671N549N473J2325O823K585N826O893N665L459j2845N002J0076
16066C7016p196l381O305K575j0486j3804j7876j3702Q092q798J221k224r180
16053c1438P04J693P558N12J779j625N401o175j4286O433N40L428m756J201J4864
16038a4167N812j245P967M96N32O345j6530j3009j1970m675K605l69j360Q337
$$ plain form
16136 -38213 -21451 -15779 -23642 -29929 -32432 -36670 -50612 -44914 -26400 -34307 -30780 -28131 -18045
16123 -18045 -13437 -4678 -14471 -14537 -7345 -11321 -26410 -31402 -28490 -29060 -23813 -23662 -25311 -19353 -13520
16108 -13520 -20192 -14980 -5804 -8953 -12277 -18534 -26089 -30089 -23599 -27066 -23300 -18641 -16631 -19252
16094 -19252 -36174 -45258 -34893 -16603 -13614 -8647 -15382 -18343 -22349 -28083 -22815 -16864 -7745 -11375
16080 -11375 -22486 -19815 -14266 -8793 3532 10355 12940 18766 25659 31324 34783 21938 26940 37016
16066 37016 29820 26439 32744 35319 24833 11029 -6847 -20549 -12457 -21255 -20034 -22258 -31438
16053 -31438 -30734 -29041 -21483 -20971 -19192 -20817 -15416 -21591 -35877 -29444 -28904 -25476 -30232 -29031 -14167
16038 -14167 -8355 -9600 -1633 -1137 -605 5740 -10790 -23799 -35769 -40444 -37839 -38208 -39568 -31231
16024c1231J25k771J3485R912J0900L086r11m424n129K086j795L328l814K252
16010d901M385J3737J561j2642j7840k419j42K865m877m446L076K305J2280K321
15996d737r357k68O407n524j0484j0597J0064R787o41J1155O188M948m199r608
15982f866o318o969j0203l540O198J2190o888m330M358M196r562r203N230J8182
15968a3525L629k542r003N525J4083O281N925j0177j2893N983K712L619r561L023
15954f921q096j1824p126J079Q06M182L411n191m751J1663j071j4140k4j58J487
15939c6674Q83L848J5810N604M682n495j785m240j8231n081K733L889O463K293
15925b5301M339j974j2396Q547J423P030P251q226J864j263j2179J0205P145K583
$$ plain form
16024 -31231 -31106 -33877 -20392 -10480 420 3506 2595 -1829 -6958 -4872 -6667 -3339 -7153 -4901
16010 -4901 -516 13221 14782 2140 -15700 -18119 -18261 -15396 -20273 -24719 -21643 -19338 -7058 -4737
15996 -4737 -14094 -14362 -7955 -13479 -23963 -34560 -24496 -14709 -15350 -4195 1993 6941 2742 -6866
15982 -6866 -13184 -20153 -30356 -33896 -27698 -15508 -22396 -26726 -22368 -18172 -27734 -36937 -31707 -13525
15968 -13525 -9896 -12438 -21441 -15916 -1833 4448 10373 196 -12697 -6714 -4002 -383 -9944 -6921
15954 -6921 -15017 -26841 -33967 -32888 -32082 -27900 -24489 -29680 -34431 -22768 -23839 -37979 -38003 -38161 -36674
15939 -36674 -35791 -31943 -16133 -10529 -5847 -11342 -13127 -17367 -35598 -40679 -37946 -34057 -27594 -25301
15925 -25301 -20962 -22936 -35332 -26785 -25362 -18332 -11081 -19307 -17443 -18706 -30885 -20680 -13535 -10952
15911a0952p273n345O397J118P086N558p952L281L794K831O342r242j1825j1903
15897b8085l885K476J6666r839j5082R93P151N783L714N84K735O625J302K010
15883f852k790j206j1810L624p481n155P151P890J809m723J114R17L160J030M349
15868h973K196p664k118j0033m127J1402N098K341o916r030l492j91J451M137
15854b5919j971j1201L430K725M848k509M089j685O278Q01J7890J277l568n406
15840a0921q25j408o144R363P887j1981j3381J210M030p048k767r75P357L685
15826b1918O820m886n844K863P691k478n154j458k714p586j667K174K493N175
15812b6489M682k355o844M755P081K036j873j835j0915k402K924J5350J1156n835
$$ plain form
15911 -10952 -18225 -23570 -17173 -16055 -8969 -3411 -11363 -8082 -4288 -1457 4885 -4357 -16182 -28085
15897 -28085 -31970 -29494 -12828 -22667 -37749 -36756 -29605 -23822 -20108 -19524 -16789 -10164 -8862 -6852
15883 -6852 -9642 -10848 -22658 -19034 -26515 -31670 -24519 -16629 -14820 -19543 -18429 -17512 -14352 -13322 -8973
15868 -8973 -6777 -14441 -16559 -26592 -30719 -19317 -14219 -11878 -18794 -27824 -31316 -31507 -30056 -25919
15854 -25919 -27890 -39091 -35661 -32936 -28088 -30597 -26508 -28193 -21915 -21114 -3224 -1947 -5515 -10921
15840 -10921 -11746 -13154 -19298 -9935 -2048 -14029 -27410 -26200 -22170 -29218 -31985 -32960 -25603 -21918
15826 -21918 -15098 -19984 -25828 -22965 -15274 -17752 -22906 -24364 -27078 -34664 -36331 -34157 -31664 -26489
15812 -26489 -21807 -24162 -31006 -26251 -19170 -17134 -19007 -20842 -31757 -34159 -31235 -15885 -4729 -10564
15798a0564o081r852j72J0912M309k30O730m934l247p69l618r184o832m123M429
15783c3226o942J4897m735O731K986n778O989R018p97j0644J0096m312o246Q209
15769a3754J0662K810K035K358n674O9p230j2329p61o929O625R666L987o874P162
15754h177l976j0533m237K049N864q218l794P115N218N865J924J5399O709j2158
15740i50j4546n943j3778o77L224J4954Q034K163K138R0m784J934R169j685k461
15725c118p733n246J9429J0116p11p750k2460l096J623m640P175R322j0911P493
15711a0507J3852Q534j0383j3075q375k358J518j0424Q00J5985L099K050Q038
15698a246n076M669M161m010K875n016j5917o855M176J1257O948J3716o536q899
$$ plain form
15798 -10564 -16645 -26497 -26669 -15757 -11448 -11678 -4948 -9882 -13129 -13898 -17516 -26700 -33532 -37655 -33226
15783 -33226 -40168 -25271 -30006 -23275 -20289 -26067 -19078 -10060 -10857 -21501 -11405 -15717 -21963 -13754
15769 -13754 -3092 -282 1753 4111 -1563 -1494 -8724 -21053 -21814 -28743 -22118 -12452 -8465 -15339 -8177
15754 -8177 -12153 -22686 -26923 -24874 -19010 -27228 -31022 -23907 -18689 -12824 -10900 4499 11208 -950
15740 -950 -15496 -21439 -35217 -35894 -32670 -17716 -9682 -7519 -5381 -5291 -10075 -8141 1028 -657 -3118
15725 -3118 -10851 -16097 3332 13448 12737 4987 -17473 -20569 -18946 -23586 -16411 -7089 -18000 -10507
15711 -10507 3345 11879 1496 -11579 -19954 -22312 -20794 -31218 -30418 -14433 -11334 -9284 -1246
15698 -1246 -6322 -1653 2508 -1502 1373 -3643 -19560 -26415 -22239 -10982 -4034 9682 3146 -5753
15684e753Q528n437p090l948l910Q892N698q784q250Q982R283j0300j1292M579
15670a8802M243j5229J0683R242j4608Q948Q013o729M766l015p873M570p705J0649
15656a2847N633l243m455k0361K864P594J4929J0332N194N58m688n808k718J5054
15642H038P136N882j811m162p625n652k280J1807n225j0396K128N197K29k122
15628A144j1620m967N432O719m304R270J162O239j490j2239l456o196o167O263
15614a4210K899P9P155J609l557J422L184k200l508J259l828L883j816M820j0476
15599a3285r647o49j0254J805O045J0721M241k028p19R376r919j0090J360K124
15585b0919l860L374J0273J0234l15n774l669O543J644R089j320p946P197L499
$$ plain form
15684 -5753 2775 -2662 -9752 -13700 -17610 -8718 -3020 -11804 -20054 -11072 -1789 -12089 -23381 -18802
15670 -18802 -14559 -29788 -19105 -9863 -24471 -15523 -7510 -14239 -9473 -12488 -20361 -15791 -23496 -12847
15656 -12847 -7214 -10457 -14912 -35273 -32409 -24815 -9886 446 5640 6198 1510 -4298 -7016 8038
15642 8038 15174 21056 19245 15083 7458 1806 -474 11333 6108 -4288 -2160 3037 3266 1144
15628 1144 -10476 -15443 -10011 -3292 -7596 1674 2836 9075 7585 -4654 -8110 -14306 -20473 -14210
15614 -14210 -11311 -11232 -4077 -2468 -6025 -4603 -1419 -3619 -7127 -5868 -9696 -5813 -7629 -2809 -13285
15599 -13285 -22932 -23581 -33835 -32030 -25985 -15264 -11023 -13051 -13770 -4394 -14313 -24403 -23043 -20919
15585 -20919 -24779 -21405 -11132 -898 -1213 -6987 -10656 -4113 -2469 6620 5300 -2646 4551 8050
15571H050R176K1838M503r316q068n726j57M02n673o453k019p643j9457j0637
15557c1180Q158k940l428J1139J1016o139j0730n298L822P73o288J232j657J1736
15543a9784P552q851l032R791J4056o089j377m013k035R887o067K562O188N298
15529D086J0180N126Oj5270l990O052R400k466J287n434j0540p103j4350R972
15515a3044R438K459R245O611N533R027r529j4586L674J1844K507N347r950L661
15501B2237l140q920n199n799j998j558J40n017P82O056o100o674j0536R452J3580
15486b694R05j549J0995J4229N802N03j1378q253N179l543j2812J19J0714O70
15472H887n944m513r210q389O054M607n605L946O057L565N479j066r361q021j752
$$ plain form
15571 8050 17226 39064 43567 34251 26183 20457 20300 20702 15029 8576 6557 -1086 -20543 -31180
15557 -31180 -23022 -25962 -29390 -18251 -7235 -13374 -24104 -29402 -25580 -24807 -31095 -29863 -31520 -19784
15543 -19784 -12232 -21083 -24115 -14324 -268 -6357 -7734 -11747 -13782 -3895 -9962 -7400 -1212 4086
15529 4086 14266 19392 19398 4128 138 6190 15590 13124 14411 8977 -1563 -8666 -23016 -13044
15515 -13044 -3606 -1147 8098 14709 20242 29269 19740 5154 8828 20672 23179 28526 18576 22237
15501 22237 19097 10177 4978 -821 -2819 -4377 -4237 -9254 -8472 -2416 -8516 -15190 -25726 -16274 -2694
15486 -2694 -1789 -3338 7657 21886 27688 28191 16813 8560 13739 10196 -2616 -2497 8217 8887
15472 8887 2943 -1570 -10780 -19169 -13115 -8508 -14113 -10167 -4110 -545 4934 3868 -5493 -13514 -15266
15457a5266J6468J3985L217m804n949m393PL465M276R89j4009M727O733Q384k893
15442A4937o825J290j095m098r28j223m82J694Q811j1433L15J0961L645k346m284
15427H939k592R356K071Q715J283j0168q947j2705J2150P359j2925k017J1579
15414A2098M224q063j6106J926j150J077K624P771M801J217p373j692r099o18
15400h363N080k760N759J5139M715j4695o090N855O262M414J0494j4984j6084
15387e258k38J8363K32j2643N3L594q86j0575r213Q383R132J75J2077K817j2710
15372C303p023m067l549r516L176K1041J3420P719j0875j951O549J1212j5621
15359A3818q802J1961K369k714O24N202J705P94l018q739j0254R364l522J160
$$ plain form
15457 -15266 1202 15187 18404 13600 7651 3258 3265 6730 11006 11995 -2014 2713 9446 17830 14937
15442 14937 8112 9402 8307 4209 3281 2058 1576 3270 12081 648 963 11924 15569 13223 8939
15427 8939 6347 15703 17774 26489 27772 17604 8657 -4048 8102 15461 2536 519 12098
15414 12098 16322 8259 -7847 -5921 -7071 -5994 -3370 4401 9202 10419 3046 1354 -7745 -8363
15400 -8363 -3283 -6043 -284 14855 19570 4875 -1215 4640 10902 15316 25810 10826 -5258
15387 -5258 -5496 12867 13099 456 509 4103 3217 -7358 -16571 -8188 944 1119 13196 16013 3303
15372 3303 -3720 -7787 -11336 -20852 -17676 3365 16785 24504 13629 11678 18227 29439 13818
15359 13818 5016 16977 19346 16632 17256 22458 24163 24957 21939 13200 2946 12310 8788 9948
15345I948K1788L897L578m261q575q931N945n64L771R14j3521r862P60l348n485
15330c946l106J2940J5643M16j2917L973J1373j493j5554O859O818Q039O825J2383
15316D8253J7202j1722q722k403J2174J89q618k376j0841j0076j463J816L827
15303B7240p035j0321M203M553o306J666N487Q205Q92K191o72j0438N422m339
15289B0748L274Q547L410M695m683l507j445P293p92P70j571M998k337l112j704
15274C4584P630k092O542J2226J246L394k1031j1365Q014m563n259m041K691m194
15260B3782M905J2173j439o840m119J705Q215k106p849j4660P057R072Q234r10
15246C7220k768N03j1298m640K1556J0309r532m6j462P179J969k079q116m447
$$ plain form
15345 9948 31736 35633 39211 34950 26375 17444 23389 22825 26596 27510 13989 4127 4887 1539 -3946
15330 -3946 -7052 5888 21531 21947 9030 13003 24376 22883 7329 14188 21006 29045 35870 48253
15316 48253 65455 53733 45011 42608 54782 54971 46353 43977 33136 23060 21597 23413 27240
15303 27240 20205 9884 14087 18640 12334 14000 19487 27692 28584 30775 30103 19665 25087 20748
15289 20748 24022 32569 35979 40674 35991 32484 31039 38332 37540 38310 36739 41737 39400 36288 34584
15274 34584 42214 40122 46664 58890 60136 63530 42499 31134 39148 34585 29326 25285 27976 23782
15260 23782 28687 40860 39421 32581 28462 30167 38382 36276 28427 13767 20824 29896 38130 37220
15246 37220 34452 34955 23657 19017 40573 50882 41350 41304 39842 47021 48990 46911 38795 34348
15232C4348J2710J7851k374j478l016l726j0030Q295j0012j3551J2685Q443l318
15219D6827N66J125j2787l208L448J2412L305r403j715K207Q512N203o075q612
15205D1805p131M110l616m502L691J030J198j1747r43N448P391l592P778K090
15191D3010k972K148m082m265K590k887k106R85j098J2012M607j3711K511K225
15177C8967l564n935l936j207K405N294L917J7427j7264j4837J2894K500K594
15164C9255J3117j23K974j681M688L393p439K214Q572l600j440K429L48k864K7
15149E9870O0M534j1002n893l750J71J0189j3098k883m569p750k154J0080J7715
15135E1520k762l11J1780Q945p447k15N663j049p276j2779j40J7141k061j428
$$ plain form
15232 34348 47058 64909 62535 61057 58041 54315 44285 52580 42568 29017 41702 50145 46827
15219 46827 47393 48518 35731 32523 35971 48383 51688 42285 40570 42777 51289 56492 50417 41805
15205 41805 34674 38784 35168 30666 34357 35387 36585 24838 23895 29343 36734 33142 40920 43010
15191 43010 40038 42186 38104 33839 36429 33542 31436 32421 31323 43335 47942 34231 36742 38967
15177 38967 35403 29468 25532 24325 26730 32024 35941 53368 36104 21267 34161 36661 39255
15164 39255 52372 52249 55223 53542 58230 61623 54184 56398 64970 61370 59930 62359 62707 59843 59870
15149 59870 59930 64464 53462 47569 43819 43990 54179 41081 38198 33629 25879 23725 33805 51520
15135 51520 48758 48447 60227 69172 61725 61510 67173 66124 58848 46069 45929 63070 61009 59581
15121E9581J1586J0697P943O356L11r519L48K881N646mo5p020o43O52k311R03
15105H7342l98O176p52j7305l114N959O592o630n306n054r718N93Q847M99j561
15090F6170M386O392k693n81J381K496l538J301m271j407k344J807J2006m586
15076G6519p648l794M142N937J2211J0217p440p427Q04Q76l129m670K528N748
15062H4874K850P169O457L373K178L91o850j1630Q53p474o342p105l161L855P876
15047G7314J3870K3087o204o678J2351K70Q085k018p086P214J9386K255l572N054
15033A43328j0972k661J7359N140j691Q967R876J4055O291J0108L1557L8692M0968
15020C11017N9589R5102J27552J36363J13962J09988J20118J14874R5741M8334
$$ plain form
15121 59581 71167 81864 89807 96163 96474 86955 87303 90184 95830 95826 95761 88741 88098 88750 86439 87342
15105 87342 86944 93120 92368 75063 71949 77908 84500 77870 72564 67510 57792 58385 67232 67731 66170
15090 66170 70556 76948 74255 73674 75055 77551 74013 75314 71043 69636 67292 69099 81105 76519
15076 76519 68871 65077 69219 75156 87367 97584 90144 82717 83521 84397 81268 76598 79126 84874
15062 84874 87724 94893 101350 104723 106901 107292 100442 88812 89665 82191 75849 68744 65583 69438 77314
15047 77314 91184 114271 108067 101389 113740 114010 122095 120077 112991 120205 139591 141846 138274 143328
15033 143328 132356 129695 147054 152194 150503 159470 169346 183401 189692 199800 231357 270049 311017
15020 311017 370606 465708 593260 729623 843585 953573 1073691 1188565 1284306 1332640
15010A332640Q945k9659r2378j17906j07911r6845j10791j47601j24172r1119
15000D23203p1338n3758m8497m2702j9983o760n417m497n583m04j7412m231j65
14987A42456l623l946j767l636K523M659n529j5826k745q89J1022O962N184m085
14973A30760Q30Q582n576k954M053M468k697j3703r57o84k587K699Q777q663P307
14958A29655J1535N505J2810m207j0419j0425q008n755K404L333L082J705M544
14945A35759q515j855l461N42j406M931O191j385N650r74l699L638m427j1490
14931A19499M893J2212J5499O888O797j183o621r053o773K054M082Q150k159Q239
14917A62524P558p066J0535Q283K610M315M288J5664m808j1637k775m143o047
$$ plain form
15010 1332640 1341585 1311926 1219548 1101642 993731 896886 786095 638494 514322 423203
15000 423203 351865 298107 249610 206908 186925 180165 174748 170251 164668 164264 146852 142621 142456
14987 142456 138833 134887 133120 129484 132007 136666 131137 115311 112566 111677 122699 129661 134845 130760
14973 130760 131590 140172 134596 131642 135695 140163 137466 123763 122806 122122 119535 122234 131011 122348 129655
14958 129655 141190 146695 159505 155298 144879 134454 126446 120691 123095 126428 129510 131215 135759
14945 135759 127244 125389 121928 122470 121064 125995 132186 130801 136451 135477 131778 135416 130989 119499
14931 119499 124392 136604 152103 158991 165788 164605 157984 148931 142158 144212 148294 156444 154285 162524
14917 162524 170082 163016 173551 181834 184444 188759 193047 208711 203903 192266 189491 185348 179301
14904A79301l824j387k412n916J560p699j391L807J4880J1216q050j694n645N048
14890A77794n215J16n387J6768J6225L778j1019j9307j1116l358j490O753L570
14877A68112P553R815r841j2494n054k194J1020J5219J0748J3872o34J2M045K584
14863B12763N209J6623j847q285o18j230Q520J2868J2111o123j5204j4039k2794
14850A97954m537q625J770l288k173J2520J0275j4919j6228j83K3624J9445j093
14837B14542j5700K085J5323R540n93J3032K499O977O452j2991k104J0939m805
14824B45196j1659n383m37Q290p95m99p009N636k1389j9891j775j519M186j153
14810A91799k644N815J272l639N32O58p730l267m516J078P652K806L834j110o492
$$ plain form
14904 179301 175477 174090 171678 165762 167322 159623 158232 162039 176919 188135 180085 178391 172746 177794
14890 177794 172579 172695 167308 184076 200301 204079 193060 173753 162637 159279 157789 164542 168112
14877 168112 175665 185480 175639 163145 158091 155897 166917 182136 192884 206756 206122 206134 210179 212763
14863 212763 217972 234595 232748 224463 223845 222615 231135 244003 256114 249991 234787 220748 197954
14850 197954 193417 184792 186562 183274 181101 193621 203896 188977 172749 172566 196190 215635 214542
14837 214542 198842 200927 216250 225790 225197 238229 240728 247705 254157 241166 239062 250001 245196
14824 245196 233537 228154 227717 236007 235212 234713 227704 233340 211951 192060 190285 188766 192952 191799
14810 191799 189155 194970 196242 192603 193135 193793 186063 182796 178280 179358 187010 189816 193650 192540 186048
14795A86048J394Q499r94j2158J0332L380J0275M344k564q230Q480P020r206l608
14781B03012Q976J1311K20J989L638Q349J2416J0296p450j6074j1280J613O325
14768B33341j5474j5501l396r715j0662L526R81O650k848K50J4600J933r250J003
14754A95438o855J816j7851Q008J3525N293p843j4012k428J4394R943N487R653
14741B14568j278k485j4122J1390J9232O344M361m43k727k713P515L173j5178
14728B27637j837j2455r615j7207p991N504Q272P655O932l330q555n506k683N28
14714A87349j2771J954o3K04K372J3423r657K896o355j2523Q326q50k574Q80p27
14699A71884K923M140l792r542m902k861m253q38O496M726R733r041L101K574
$$ plain form
14795 186048 187442 195941 194947 182789 193121 196501 206776 211120 208556 200326 208806 215826 206620 203012
14781 203012 211988 223299 223519 225508 229146 237495 249911 260207 252757 236683 225403 227016 233341
14768 233341 217867 202366 198970 189255 178593 182119 183100 189750 186902 187152 201752 203685 194435 195438
14754 195438 188583 190399 172548 180556 194081 199374 191531 177519 175091 189485 199428 204915 214568
14741 214568 213290 210805 196683 208073 227305 233649 238010 237567 234840 232127 239642 242815 227637
14728 227637 225800 213345 203730 186523 178532 184036 192308 199963 206895 203565 195010 189504 186821 187349
14714 187349 174578 176532 176469 176673 179045 192468 182811 185707 179352 166829 175155 174305 171731 172611 171884
14699 171884 174807 178947 175155 165613 160711 157850 153597 152759 159255 163981 173714 164673 167774 170348
14685A70348K426M060O566n310m385L994q684p023o44n880J2257l051j0923L879
14671A57630Q588L936P56O88J0155R027M321Q768n783O107p965l611Q106O746
14657B07469r353j1633r883M42M385J0912J118J6505K7401K1731J7758J5278K1807
14644C13937J7161r561m802k4213k5558k1089j5793k6873k2130j2029j1962j0006
14632A47082Q337N431M499l220R266j6554j9478L669R539P545q84M670k480k203
14618A55219p595n273n54N271J6077K82l561p911n636l094p505j941l19J1511
14604A44971k33K411j489K364j541j3397N358j630j3942r82K0247J1596n196j058
14590A47479K361k312m294l87j227o13j6870K306J5799J648j0748k069J2487o786
$$ plain form
14685 170348 172774 176834 183400 178090 173705 177699 169015 161992 161348 155468 167725 164674 153751 157630
14671 157630 166218 170154 170910 171598 181753 190780 195101 203869 198086 204193 196228 192617 200723 207469
14657 207469 198116 186483 176600 177042 181427 192339 193457 209962 237363 259094 276852 292130 313937
14644 313937 331098 321537 316735 292522 266964 245875 230082 203209 181079 169050 157088 147082
14632 147082 155419 160850 165349 162129 171395 154841 135363 139032 148571 156116 155232 159902 157422 155219
14618 155219 147624 142351 141797 147068 163145 163427 159866 151955 146319 143225 135720 133779 133460 144971
14604 144971 144738 147149 145660 148024 146483 133086 138444 136814 122872 121890 142137 153733 148537 147479
14590 147479 149840 147528 143234 142847 141620 141007 124137 126443 142242 143890 133142 131073 143560 136774
14576A36774j0303q189k300J006j421j1884K219M546R746J344R675j0436o381
14563A14396P816n086j6506p433K2846M167l884J584J36j1289Q577J5474J021
14550A31819k272l345J789J2521r885j9883j4118O439J1619J684j2330r347o83
14537I4008P771Q437Q88J701q877J603q072M510O167M920n576m232k750j0702
14523H9796J3544J6052N708j1332j2295q017K733O569R586q590l335j5814j0691
14510G3914q834J3610Q521j359L388k837j96m595L777O473k339O656N130J036
14496A02345N577M315r09m207j4113n063M610L915K514o689O257j915m821q959
14482H2857j309J0321k360k385o439J115M188j652k567j564j0388n200J791k376
$$ plain form
14576 136774 126471 118282 115982 116988 115567 103683 105902 110448 120194 121538 131213 120777 114396
14563 114396 122212 117126 100620 93187 116033 120200 116316 117900 118036 106747 115324 130798 131819
14550 131819 129547 126202 127991 140512 130627 110744 96626 103065 114684 116368 104038 94691 94008
14537 94008 101779 110216 111104 112805 103928 105531 97459 101969 108136 113056 107480 103248 100498 89796
14523 89796 103340 119392 125100 113768 101473 93456 96189 102758 112344 103754 100419 84605 73914
14510 73914 65080 78690 87211 85852 89240 86403 86207 81612 85389 91862 89523 96179 101309 102345
14496 102345 107922 112237 111328 107121 93008 87945 92555 96470 98984 92295 98552 96637 91816 82857
14482 82857 81548 91869 89509 87124 80685 81800 85988 84336 81769 80205 69817 64617 66408 64032
14468F4032P177J0432o086p989K06P190L557R390o588l193n447m033n657n955
14454E7036J573j923l98J554M329p61j279k632J1243J1089M779o072r040q39J174
14439F9833m948J0030q452j2909J4057j378m533L463n363J628n00N71Q733m861
14425F5371l718j59J2694L240M425q117j0806J1666O164m183r717N822K193l992
14411G0883J0423m669j911r25o782n406O84j220L888m361j742R793Q454l238n223
14396F8648j195J818j2127j1220p90j694K208J3048N303J2484Q408M349J6503
14383A05743r675M845J2174J749m725M390n842l925k355r908m171Q699o517j9389
14369G1093o308l881n374k252J1590O096N807j0201j1749O610J3670N831k792
$$ plain form
14468 64032 71209 81641 75555 67566 67772 74962 78519 87909 81321 78128 72681 68648 62991 57036
14454 57036 58609 56686 56288 57842 62171 61410 60131 57499 68742 79831 84610 78538 69498 68659 69833
14439 69833 64885 74915 66463 53554 67611 66233 61700 65163 59800 61428 60928 61499 70232 65371
14425 65371 61653 61494 74188 77428 81853 73736 62930 74596 80760 76577 66860 72682 74875 70883
14411 70883 81306 76637 74726 73801 67019 61613 62297 61077 64965 60604 58862 68655 77109 73871 68648
14396 68648 67453 69271 57144 45924 45134 43440 45648 58696 63999 76483 84891 89240 105743
14383 105743 96068 100913 113087 114836 110111 114501 108659 104734 102379 92471 88300 96999 90482 71093
14369 71093 64785 60904 55530 53278 64868 70964 76771 66570 54821 61431 75101 80932 78140
14356G8140l593p438j520j2573m220P733m534Q513j358j0023o169R615j5556m459
14342C2558M74R349J007J2259Q767N150l0022k1617P527P472N063Q111m404j280
14328D0414o995K747J1189L469J2882m102K359Q362J728K3839J9612J0413J072
14315A26989n228j1144j1721n783K489j2492j3649j6642j9120o986J63m40M626
14302C1062Q523J2488R270L461L584k105o853J774r63j0022j330J1258J525L695
14288F5367l816j4308l925m288K687P45K202p282j4267k490P455P198K036N471
14274D2785j1047J838o695j110K103m997o287N731J3265k081L3j0220n424k97
14260A7597Q759l255M812m209k2400J2659M732j286K55P524J686K830k149j01
$$ plain form
14356 78140 74547 67109 65589 53016 48796 56529 51995 60508 59150 49127 42958 52573 37017 32558
14342 32558 33032 42381 43388 55647 64414 69564 39542 17925 25452 32924 37987 46098 41694 40414
14328 40414 33419 36166 47355 50824 63706 59604 61963 70325 72053 95892 115504 125917 126989
14315 126989 121761 110617 98896 93113 95602 83110 69461 52819 33699 26713 26876 26436 31062
14302 31062 39585 52073 61343 64804 68388 66283 59430 61204 60241 50219 48889 60147 61672 65367
14288 65367 61551 47243 43318 39030 41717 42462 44664 37382 23115 20625 28080 35278 37314 42785
14274 42785 31738 33576 26881 25771 27874 22877 16590 22321 35586 33505 33538 23318 17894 17597
14260 17597 26356 23101 27913 23704 1304 13963 18695 17409 17664 25188 26874 29704 27555 27454
14246B7454O642m270J8964l844p347M536k381j0521j8547j0642P197k951L405
14233G695r335K791K163P992N718O724l980p226k914L331n713m086O711k81M90
14218A0080O229P919p430p731n54n319p001j2515N829j360N202J1548J4161P555
14204B6613l772n328K87O494j0443m182J933o048k594p559M318l225j3546k978
14190b0030J550J8781J6396r836n419L795R621K175k183o618q076O310J2705J920
14176B1091M273q18j5529m264r896Q164R980J5445N707n146q052o117j2026N0
14162B862m84r77M666j478P947O377p326J867k540r152J2133J8287J760o874P961
14147C5029k79p467j669L648K906p866j249p8K691j1920l214n397p057J2999Q068
$$ plain form
14246 27454 34096 29826 48790 44946 37599 42135 39754 29233 10686 44 7241 4290 7695
14233 7695 -1640 1151 3314 11306 17024 23748 19768 12542 9628 12959 7246 3160 9871 9590 10080
14218 10080 16309 24228 16798 9067 8513 3194 -3807 -16322 -10493 -11853 -6651 4897 19058 26613
14204 26613 22841 17513 17800 24294 13851 9669 11602 5554 2960 -4599 -281 -3506 -17052 -20030
14190 -20030 -18480 301 16697 6861 1442 5237 14858 17033 14850 8232 156 6466 19171 21091
14176 21091 25364 24546 9017 4753 -5143 3021 13001 28446 34153 29007 20955 14838 2812 2862
14162 2862 2378 1401 6067 4589 12536 18913 11587 13454 10914 1762 13895 32182 33942 27068 35029
14147 35029 34750 27283 25614 29262 32168 24302 23053 22975 25666 13746 10532 5135 -1922 11077 19145
14132A9145J0682n816k263K753k224n497K690O615j158j575N950R93j6073n457
14118H765k422o472N298J1636n612k1310q858J7648K15J2753J0874l608N842K466
14104B7215j3972O264J0823j5203k0451J0221o068N40m554q410R277r5o289o62
14090a1364O827l58P273L603o561k113O213j071j681j3743l133P272P041o742
14076h537K724M288j3131Q469P827l239p998j4785k055J2378Q081M931O876R584
14062A5413m54k307j322m322k743P621m43j0426M730j787j3488j521N518Q521
14048B990P741K474p014j1304Q394l614p705o801j943M754Q142l75j575J203Q211
14033C578n140o675j6494p266J5285J4902J1235j191p453l878J2896O884j8592
$$ plain form
14132 19145 29827 24011 21748 24501 22277 16780 19470 26085 24927 23352 29302 30295 14222 8765
14118 8765 6343 -129 5169 16805 11193 -10117 -18975 -1327 -1112 11641 22515 18907 24749 27215
14104 27215 13243 19507 30330 15127 -5324 4897 -1171 -631 -5185 -13595 -4318 -4413 -10702 -11364
14090 -11364 -4537 -4895 2378 5981 -580 -2693 3520 2449 768 -12975 -16108 -8836 -1795 -8537
14076 -8537 -5813 -1525 -14656 -6187 1640 -1599 -9597 -24382 -26437 -14059 -5978 -1047 5829 15413
14062 15413 14959 12652 11330 7008 4265 11886 11443 1017 5747 3960 -9528 -11049 -5531 2990
14048 2990 10731 13205 6191 -5113 3281 -333 -8038 -14839 -16782 -12028 -3886 -4261 -5836 -4633 3578
14033 3578 -1562 -8237 -24731 -31997 -16712 -1810 9425 8234 781 -3097 9799 16683 -1909
14020a909q191P353K023M21O324N721J4442j2149l703r38o371R984J163O284n179
14005A5275o423R545N014o681m714n952L757J1991K816k39p060q239o560N014
13991G544j160k474n61J5540q169p085M505K685r500l872r987m356Q312J1086
13977B508L512M785P091N572K718m758J886Q52k12j0634R565m745K44j469r885
13962G030j0354P788R525m389j913L798n611p93Q210n345m507j3479m084J2189
13948a935J2837j2594j5296Q241O150j560N330R720j648J998m868j0085k956L123
13934c543o344Q292N657N728K70m933j3164N915P174k500n760J0202J097Q797
13920A6888M638M268p759m831n831N855M302o235O434j2262j1697O034Q225K970
$$ plain form
14020 -1909 -10100 -2747 -724 -303 6021 11742 26184 14035 10332 9394 3023 13007 14170 20454 15275
14005 15275 8852 18397 23411 16730 12016 6064 9821 21812 24628 24389 17329 9090 2530 7544
13991 7544 6384 3910 3349 18889 10720 3635 8140 10825 1325 -2547 -12534 -16890 -8578 2508
13977 2508 6020 10805 17896 23468 26186 21428 23314 24166 23954 13320 22885 18140 18384 16915 7030
13962 7030 -3324 4464 13989 9600 7687 11485 5874 5081 13291 7946 3439 -10040 -14124 -1935
13948 -1935 10902 -1692 -16988 -8747 -2597 -4157 1173 10893 9245 11243 6375 -3710 -6666 -3543
13934 -3543 -9887 -1595 4062 9790 10060 5127 -8037 -2122 5052 2552 -3208 6994 8091 16888
13920 16888 21526 25794 18035 13204 7373 13228 17530 11295 17729 5467 -6230 -196 8029 10999
13906A0999J379m823o016m835J068L502K915M908N091m755k143r153j0793p202
13892a9858J061J6076N75M899O921O525K098L401o902j2355j2899k605J7500n103
13878f66n613K557J5135J7190J5920J7272R211J3466J2872K3347P732K365O763
13865A37551J0250o336j7355j1760o552j1177k0972l587j1489p538n323q874K416
13852C9254l018K0497L5545J2727L76j1542n269k283k1064j7631q496j0830N94
13839B8860j3582m324J0345Q158J0997J5024O873j574J0705J7129J6546J3207
13827A18364n5J2645j235m562l703k0164l0548P37j0184j4101o548l397k083j0400
13813B4766J0024Q295q24j3787r296o25k236n480K074o024m43M290n398m132l287
$$ plain form
13906 10999 12378 7555 1539 -3296 -2228 1274 4189 9097 14188 9433 7290 -1863 -12656 -19858
13892 -19858 -18797 -2721 -2146 2753 9674 16199 18297 21698 14796 2441 -10458 -13063 4437 -666
13878 -666 -6279 -3722 11413 28603 44523 61795 71006 84472 97344 120691 128423 130788 137551
13865 137551 147801 141465 124110 112350 105798 94621 73649 70062 58573 51035 45712 36838 39254
13852 39254 36236 56733 92278 105005 105381 93839 88570 86287 65223 47592 39096 28266 28860
13839 28860 15278 10954 21299 29457 40454 55478 62351 60777 71482 88611 105157 118364
13827 118364 118309 130954 129719 125157 121454 101290 70742 71479 61295 47194 40646 37249 35166 24766
13813 24766 34790 43085 42261 28474 19178 18553 16317 10837 12911 6887 6444 10734 5336 1204 -2083
13798b083J32k458q737M14L200K897L511m272l241M210J071n674m036M587L924
13783f555P737J0191J3476l557p209p811Q421P091K1836P140l978j373K6j920
13769D3515K234R967J5158K7908L0024J5646K5381K7948k382o995K161l485j4091
13756A72989q591k2784k5136k1208j4901L598j441j6636j6299K731M2p881p707
13743C6776j1696o586j969M099o482J0849J2015n059j1178o012L721J1006q563
13730B0921j1691R171Q045Q72o970j2700p801j203L581R561L32J820k601M650
13716A5987P42N45j1310r448N230k361J115O404J512N497Q352j2866j2936N568
13702B031R501l344l633m52J153P457p432N84m714R495M577K025p279l713j0853
$$ plain form
13798 -2083 -1951 -4409 -13146 -12732 -9532 -6635 -3124 -7396 -10637 -6427 -5356 -11030 -15066 -10479 -6555
13783 -6555 1182 11373 24849 21292 14083 6272 14693 21784 43620 50760 46782 45409 45435 43515
13769 43515 45749 55716 70874 98782 128806 144452 169833 197781 195399 188404 190565 187080 172989
13756 172989 164398 141614 116478 95270 80369 83967 82526 65890 49591 52322 52364 44483 36776
13743 36776 25080 18494 16525 20624 14142 24991 37006 31947 20769 14757 18478 29484 20921
13730 20921 9230 18401 26446 27318 20348 7648 -153 -1356 2225 11786 12118 13938 11337 15987
13716 15987 16729 17274 5964 -3484 1746 -615 500 6904 8416 13913 22265 9399 -3537 2031
13702 2031 11532 8188 4555 4103 5256 12713 5281 5865 1151 10646 15223 17248 9969 6256 -4597
13687d597k951j2170j1853J1522J6360O675L592M140k0153n997O647Q396K924
13674B535m686m659J17J2927k25o267N100J0433P702j5135p970O912m86k683p412
13659c797l533l476K004Q773P031r942j2229L001K89j897m139n073J536J851L828
13644a5773j636K587J3310P830j0564K912j0624q41r371j3014k578o410L081J1687
13630b9404R629L165j0145l032L355M505N402mP523J2518k658o357J0823J494
13616F814r995P264J0214J413k822M005m467L959n572l778k522l536m75Q902k111
13601G293k2079j5575J1909k443K899P790O173j2388q855J1362K366o361o489
13588b4398j0338l261N585J0846L187p258r567k294O944P019M827o225N204K041
$$ plain form
13687 -4597 -7548 -19718 -31571 -20049 -3689 2986 6578 10718 -9435 -15432 -8785 -389 2535
13674 2535 -2151 -6810 -6693 6234 6009 -258 4842 15275 22977 7842 -128 6784 6298 3615 -3797
13659 -3797 -7330 -10806 -8802 -29 7002 -2940 -15169 -12168 -11879 -13776 -17915 -22988 -21452 -19601 -15773
13644 -15773 -17409 -14822 -1512 6318 -4246 -1334 -11958 -12799 -22170 -35184 -37762 -44172 -41091 -29404
13630 -29404 -19775 -16610 -26755 -29787 -26432 -21927 -16525 -16529 -9006 3512 854 -5503 5320 6814
13616 6814 -3181 4083 14297 15710 12888 16893 12426 16385 10813 7035 4513 977 502 9404 7293
13601 7293 -14786 -30361 -18452 -20895 -17996 -10206 -4033 -16421 -25276 -13914 -11548 -17909 -24398
13588 -24398 -34736 -37997 -32412 -21566 -18379 -25637 -35204 -37498 -30554 -23535 -18708 -24933 -19729 -17688
13574a7688N59k42L378j0119L029j0018j1634K034N321L97M473l992m981J551
13560c7932n418m84O295J773p344o48M405R456R16k648Q04K596Q881j772l083
13545b4203O986R061j456Q142n118K26L024J870j2681m802K752K286j1924L048
13531b2789N966l023o22j2537p263P546K3641Q416n557n728k336l50l654l531
13517b1821M742j0837L837J097J601p53j561P546N674M069m578J2019N741q344
13503a568j3768j7677L587J6529P491m550l656J529J4960K1690j1424m189M432
13490A3386J5518j863o750l783o811J2546J1661J6665K173n097l67L825o158k846
13476D2099m476J0429K788j1997q063r633m820l36q133J657J2401K102N35J8061
$$ plain form
13574 -17688 -17129 -17371 -13993 -24112 -21083 -31101 -42735 -40701 -35380 -34983 -30510 -34502 -39483 -37932
13560 -37932 -43350 -43834 -37539 -35766 -43110 -43758 -39353 -29897 -28981 -31629 -30825 -28229 -19348 -21120 -24203
13545 -24203 -17217 -8156 -9612 -1470 -6588 -6362 -3338 -1468 -14149 -18951 -16199 -13913 -25837 -22789
13531 -22789 -16823 -19846 -20468 -33005 -40268 -32722 -9081 -665 -6222 -11950 -14286 -14636 -18290 -21821
13517 -21821 -17079 -27916 -24079 -22982 -21381 -22134 -23695 -16149 -10475 -6406 -10984 1035 6776 -1568
13503 -1568 -15336 -33013 -29426 -12897 -5406 -9956 -13612 -12083 2877 24567 13143 8954 13386
13490 13386 28904 27041 20291 16508 9697 22243 33904 50569 52742 47645 47278 51103 44945 42099
13476 42099 37623 48052 50840 38843 30780 21147 16327 15991 7858 9515 21916 24018 24553 42614
13462D2614K2455J902j1870k1683j2920n320r798L15l892n868J987J279J263q570
13448h106J808J871J3123k430m910k934j0911m490m278N2j026q61m635O664J3550
13433g513K158O336n005j5406n042K2226J0197l601j063n785r335O12k921P450
13419f692M822J3162O933j0588j2090r130o752k869M490j80j0998k77k849p373
13405d0391M658Q612N161m226j396p649J8042J3031L831l461L557m652r919R643
13391e159p276n848j0160p317m484j297J9761K034m913N012q31L633K463j3284
13377b7666r292K783j502j3073R809K1228j307Q59J080M525N147Q706j8076j6746
13363c3525j531J408O657k659j0540P752J2334j857p012m18J058K23N910L830
$$ plain form
13462 42614 65069 66971 55101 33418 20498 15178 5380 5695 1803 -4065 -2078 -799 464 -8106
13448 -8106 -6298 -4427 8696 6266 1356 -1578 -12489 -16979 -21257 -21205 -22231 -23092 -27727 -21063 -7513
13433 -7513 -5355 981 -4024 -19430 -24472 -2246 7951 4350 3287 -2498 -11833 -11221 -14142 -6692
13419 -6692 -1870 11292 18225 7637 -4453 -13583 -20335 -23204 -18714 -18894 -29892 -30169 -33018 -40391
13405 -40391 -35733 -27121 -21960 -26186 -27582 -35231 -17189 -4158 -327 -3788 -231 -4883 -14802 -5159
13391 -5159 -12435 -18283 -28443 -35760 -40244 -41541 -21780 -19746 -24659 -19647 -20478 -16845 -14382 -27666
13377 -27666 -36958 -34175 -35677 -48750 -38941 -17713 -19020 -18161 -17081 -12556 -7409 1297 -16779 -33525
13363 -33525 -35056 -33648 -26991 -29650 -40190 -32438 -20104 -21961 -28973 -29391 -28333 -28110 -22200 -18370
13349a8370j0268r005N5P641o649L867M18P639l602J3654R318l214J08m927r004
13334b2339r855j227L755j098K159J704R541K069n290K50j4568N337J238J910
13320b6414O887q684m080p765q437J54J3426J275k377l18K468n700j0264l169
13306e2998J1971J170L243P808l562L32Q432P809K063L021J0220L396j2655j0742
13292b0492Q852R970j0522j0270m648o491k360J7372Q869J85J0758M17j2698m606
13278a5664P853K1053n911j8359j3925j4213K459J9257m548K403M679P738j081
13265h259k291j3343q703R976K818j0537J704J1294r319q974r146j291Q144L720
13251c4207q16r508LJ6371J3155N61m762l647p580o565j0702K218j2389k245K1569
$$ plain form
13349 -18370 -28638 -37643 -37588 -29947 -36596 -32729 -32311 -24672 -28274 -14620 -5302 -8516 -8408 -13335 -22339
13334 -22339 -32194 -33421 -29666 -30764 -28605 -26901 -17360 -15291 -20581 -20331 -34899 -29562 -28324 -26414
13320 -26414 -19527 -28211 -32291 -40056 -48493 -48339 -34913 -33638 -36015 -36333 -33865 -39565 -49829 -52998
13306 -52998 -41027 -39857 -36614 -28806 -32368 -32036 -23604 -15795 -13732 -10711 -491 2905 -9750 -20492
13292 -20492 -11640 -1670 -12192 -22462 -27110 -33601 -35961 -18589 -9720 -9535 1223 1640 -11058 -15664
13278 -15664 -7811 13242 7331 -11028 -24953 -39166 -36707 -17450 -21998 -19595 -14916 -7178 -8259
13265 -8259 -10550 -23893 -32596 -22620 -19802 -30339 -28635 -17341 -26660 -35634 -44780 -46071 -37927 -34207
13251 -34207 -35023 -44531 -44528 -28157 -15002 -14441 -19203 -22850 -30430 -36995 -47697 -45479 -57868 -60113 -38544
13236c8544K0741Q833k527m259n329P395k276k310k790k237j2369j0236N097m689
13222d5500j3022r43J3264J3121M233o504m996J6961q169j1941M604l13j606N657
13208c5154o043P337J4035o678M071n554l040J658M323p099k842P212J9099J1625
13194B950o16m883J6625N71o015p831m513j3812P861N90K207L386k948L324J651
13179a453q081r249J2453N491j0224j9990J2177P592M248k11O677J0682K3505
13166C3617J8971Q325q184j5242j3927j9375j0199q346n042M266p487m863K99
13153b7187M689K885R041K848j057O760j0503l309R363o705K253M678K13o703
13139a2734l201L588l795p862j965N448k0l872n46J7170R938j414L53P511Q842
$$ plain form
13236 -38544 -17803 -8970 -11497 -15756 -21085 -13690 -15966 -18276 -21066 -23303 -35672 -45908 -40811 -45500
13222 -45500 -58522 -59465 -46201 -33080 -28847 -35351 -40347 -23386 -31555 -43496 -38892 -39205 -40811 -35154
13208 -35154 -41197 -33860 -19825 -26503 -22432 -27986 -31026 -29368 -25045 -32144 -34986 -27774 -8675 2950
13194 2950 2334 -2549 14076 14647 8632 801 -3712 -17524 -9663 -9073 -6866 -3480 -6428 -3104 -1453
13179 -1453 -9534 -18783 -6330 -839 -11063 -31053 -18876 -11284 -7036 -7247 -570 10112 33617
13166 33617 52588 60913 52729 37487 23560 4185 -6014 -14360 -19402 -15136 -22623 -27486 -27187
13153 -27187 -22498 -19613 -10572 -7724 -8781 -2021 -12524 -15833 -6470 -13175 -10922 -6244 -6031 -12734
13139 -12734 -15935 -12347 -16142 -24004 -25969 -20521 -20541 -24413 -24959 -7789 2149 735 1088 8599 17441
13124A7441K1753M2012O3463P2876M2489O670l5538n6747l9098l4797k3068j2186
13112F5270q446k314p712k3349j3807N367O730Q070L10p457j0024j1203p997r682
13098a6244J1896J1333M42j047j035j1731j220m450M137K933O638M544j032J3257
13084A8421N625q36J1025J2668M500J7431L5042N1639Q4300P9695K5732k4175
13072C21067n3051n5593n4993l9041l4925l0620k8679k2025l428P793k049j0273
13060e817p897J055n978j3646J545K4281P640j1366r082p218P892P005M073q361
13046a5874k471N457n548K018P271K258o22l031m549R892Q533J0236J5774K0038
13032D9382L3464K5237Q003q305k7361l6917l5202j0790L921R063m155k0716k379
$$ plain form
13124 17441 39194 81206 144669 217545 260034 266704 231166 174419 135321 100524 77456 65270
13112 65270 56824 54510 46798 23449 9642 15009 21739 29809 30119 22662 12638 1435 -6562 -16244
13098 -16244 -4348 6985 7427 6380 5345 -6386 -7606 -12056 -7919 -4986 1652 6196 5164 18421
13084 18421 24046 23210 34235 46903 51403 68834 103876 155515 239815 319510 345242 321067
13072 321067 268016 212423 157430 118389 83464 52844 24165 2140 -1288 6505 4456 -5817
13060 -5817 -13714 -12659 -18637 -32283 -30738 -6457 1183 -10183 -19265 -26483 -18591 -11586 -7513 -15874
13046 -15874 -18345 -12888 -18436 -16418 -9147 -6889 -7511 -10542 -15091 -5199 3334 13570 29344 49382
13032 49382 82846 108083 116086 107781 80420 43503 8301 -2489 1432 10495 6340 -14376 -16755
13019a6755J2122M178J016j2866j1994q050r64R104J8147M388j3232q903k473
13006b6282O98l298j413J2755J7445p901J339J885M148j0321l226Q826R832j4732
12992a0245j8948k47Q209L298J3588M444J4788Q228j4489j1784O224o54r933M05
12978g116P222R649L619p286j3016j0711r040Q745K1062l252L33P27K048j2542
12964i558j4702O630R613R599M221P806j4637p997p29P975p280k251M251N113
12950a946n588n350Q19J4279J2776J0588N608Q822K793j4460q912q071j5163p807
12936a1612l58R035K200Q254K301m334k219p096j226J379J194m271k981l33J924
12921h143Q87m048l218j0064n838m436P931J1270L541P476r62j0014N331l221
$$ plain form
13019 -16755 -4633 -455 561 -12305 -24299 -32349 -33313 -24209 -6062 -1674 -14906 -23809 -26282
13006 -26282 -25584 -28882 -30295 -17540 -95 -7996 -6657 -4772 -624 -10945 -14171 -5345 4487 -10245
12992 -10245 -29193 -29440 -21231 -17933 -4345 99 14887 23115 8626 -3158 3066 2412 -7521 -7116
12978 -7116 106 9755 13374 6088 -6928 -17639 -26679 -17934 3128 -124 209 936 2984 -9558
12964 -9558 -24260 -17630 -8017 1582 5803 13609 -1028 -9025 -9754 -1779 -9059 -11310 -7059 -1946
12950 -1946 -7534 -12884 -12065 2214 14990 25578 31186 40008 42801 28341 19429 11358 -3805 -11612
12936 -11612 -11970 -2935 -735 7519 9820 5486 3267 -3829 -5055 -3676 -2482 -6753 -9734 -10067 -8143
12921 -8143 -7256 -11304 -14522 -24586 -30424 -34860 -26929 -15659 -12118 -4642 -5604 -15618 -10287 -13508
12907a3508Q683n27o16l500j1427J2514K7483l455q362j2333L3k680j7909p027
12893c2631O968K015j521l042P999k427P459J363k416j85r046R966M591k227M533
12878h601k0432m213k715Q7Q560O579M087O794k676m160O255j883L908Q282m654
12863d782l602O574J2450J710j2668j1864K437r56O445m220j2519o788k895O147
12849b4531l889k778J1585q528o845k845l534J5107m307n135J0443K266n498J675
12835b6814n977n895R719k988n431R90K1368J3955K527M712j529j3190J413N280
12821a860n321J475R173p787j2379K34J1254j621p647N114M119j505n072K068
12807i755k858L532l833l964l196M984k406N232O148k959J526O491O626R091m08
$$ plain form
12907 -13508 -4825 -5352 -5968 -9468 -20895 -8381 19102 15647 7285 -5048 -5015 -7695 -25604 -32631
12893 -32631 -25663 -23648 -25169 -28211 -20212 -22639 -15180 -13817 -16233 -16418 -25464 -15498 -10907 -13134 -8601
12878 -8601 -29033 -33246 -35961 -35874 -27314 -20735 -16648 -9854 -12530 -16690 -10435 -12318 -8410 -128 -4782
12863 -4782 -8384 -1810 10640 12350 -318 -12182 -9745 -10701 -4256 -8476 -20995 -27783 -30678 -24531
12849 -24531 -28420 -31198 -19613 -28141 -34986 -37831 -41365 -26258 -30565 -35700 -25257 -22991 -28489 -26814
12835 -26814 -32791 -38686 -28967 -31955 -37386 -36396 -15028 -1073 1454 6166 4637 -8553 -7140 -1860
12821 -1860 -7181 -5706 3467 -4320 -16699 -16465 -5211 -6832 -14479 -9365 -5246 -6751 -11823 -9755
12807 -9755 -12613 -9081 -12914 -16878 -20074 -15090 -17496 -12264 -6116 -9075 -7549 -1058 5568 14659 14251
12792A4251k0181k7720M262J1630K199r651J881Q351j628J652M599P94r891L001
12778a6451n65J4398N957p58j0495r738j217P191J404J2950J465l403P13k925
12764a474L496O190r935j241R457n104M955J0975q375j4005p396L12o810m63k504
12749b1922j150M76k019M24J2949O567M430M665n229j0129q05N762R76j6167M31
12734b0741Q627Q073l384J806j385p537j9428J2075R670M379K1200O73j8202j2140
12720a6314p358M020M106q86J0154J5520L977j0281M671J0956J892J2363j0927
12707B1893k635N269k871j2733j6073o459P383J0908J0079j433k183J3722J9496
12694D4363M100j0088r798r27q013o906j0132R658J4970M636M712q970r699N40
$$ plain form
12792 14251 -5930 -33650 -29388 -17758 -15559 -25210 -23329 -14978 -16606 -14954 -10355 -9561 -19452 -16451
12778 -16451 -17016 -2618 3339 2581 -7914 -17652 -18869 -11678 -10274 2676 4141 738 1451 -1474
12764 -1474 2022 8212 -1723 -2964 6493 1389 6344 17319 8944 -5061 -12457 -12145 -18955 -19418 -21922
12749 -21922 -23072 -22596 -24615 -24191 -11242 -4675 -245 4420 -809 -10938 -11743 -5981 -5005 -21172 -20741
12734 -20741 -12114 -4041 -7425 -5619 -7004 -14541 -33969 -21894 -12224 -7845 13355 14028 -4174 -16314
12720 -16314 -23672 -19652 -15546 -16432 -6278 9242 13219 2938 7609 18565 20457 32820 21893
12707 21893 19258 24527 21656 8923 -7150 -13609 -6226 4682 14761 13328 11145 24867 44363
12694 44363 48463 38375 28577 27650 19637 12731 2599 12257 27227 31863 36575 27605 17906 18446
12680A8446J9068J4064o276q899J259L350j9595j8699k312O984P216J459K412
12667A8477o873j786Q18k728p307m541k400J7985J1748m702j0318p325o051M26
12653d577o485K980N564R735O908Q881j5233o810l025Q161L123j2007n562n51
12639h898q66R672q34J824j1331j429K1845N579J3l818j0335o195k79P438J1942
12624A4328J2378J5032J1068J0642K496J4090J7913K0633P704L717J2065O035
12612A48101J2058Q653P975J222J3575K5111M4770N1434N2058P3026J12784J59129
12600G09896J80766J98414K19044K11885J68585J16560N5330j0664q4514j61691
12590A603611j98181k14240j98939j93801j58073j25729r2935o5096o5368l9817
$$ plain form
12680 18446 37514 51578 45302 36403 37662 41012 21417 2718 406 7390 14606 16065 18477
12667 18477 11604 9818 10636 7908 601 -3940 -6340 11645 23393 18691 8373 1048 -5003 -4577
12653 -4577 -11062 -8082 -2518 7217 14125 23006 7773 963 -2062 6099 9222 -2785 -8347 -8898
12639 -8898 -9764 -92 -926 898 -10433 -11862 9983 15562 15575 11757 1422 -4773 -5052 2386 14328
12624 14328 26706 41738 52806 63448 65944 80034 97947 118580 126284 130001 142066 148101
12612 148101 160159 168812 176787 178009 191584 216695 261465 312899 364957 437983 550767 709896
12600 709896 890662 1089076 1308120 1520005 1688590 1805150 1860480 1849816 1765302 1603611
12590 1603611 1405430 1191190 992251 798450 640377 514648 421713 356617 291249 251432
12580B51432l3113k6109r316j6228k4067j8033q500j5409k0621j6148r450l717
12568E0721j2284j578M995l957k620J663k84M704Q295O411O131M69J981k063j0533
12553E2051k166L968P268N714K615P203j0447K768K2436J6458rm192R648O318
12539A19633M167q015k1098q794k01k0192q901J0585m857j934j982K15J11r828
12525D8909J074J378M789J103J7165K543r73L856L442N746P341L23r261j2132
12511G5303m887m057l690r93L306l79Q536O285L970L664j178O29j9116n997L0033
12496I1429J7136N522j4565j4054o915n709n975J4389J8981K1758J9701J977M603
12483A48278J1645N741j2464j1438J693P099j3833j7932r338j1639k498o304R771
$$ plain form
12580 251432 218319 192210 182894 166666 142599 124566 116066 100657 80036 63888 54438 50721
12568 50721 38437 36859 41854 37897 35277 36940 36656 41360 49655 56066 62197 62666 64647 62584 52051
12553 52051 49885 53853 61121 66835 69450 76653 66206 68974 91410 107868 107859 103667 113315 119633
12539 119633 123800 115785 94687 85893 85692 65500 56599 67184 62327 60393 58411 58626 58737 48909
12525 48909 49983 51361 56150 57253 74418 76961 75988 79844 83286 89032 96373 96696 87435 75303
12511 75303 70416 66359 62669 61676 64982 64603 73139 79424 83394 87058 85880 86509 67393 61396 91429
12496 91429 108565 114087 99522 85468 78553 72844 66869 81258 100239 121997 141698 143675 148278
12483 148278 159923 165664 153200 141762 143455 150554 136721 118789 109451 97812 95314 89010 98781
12470I8781R319m41n943j0707n694R550K7078J4207q571l840j0216j7569q748
12457H7206J3820J1520J525p81N656J534n150r07M583J1591J7139J2514J8214
12444A78464Q747J4781K1408J3416J1256J2363P520J0553J1668K4077J3713j593
12432C26373K556O820l988j4067j6614n439K394R086J4509K1366K6182J4354j3821
12419C69711l2224l4102k6312j6654k2308m276p091l141k26Q22J5422J1565J2777
12406B63963J2203J3435Q171J5831J8195J2872J9683R376o405O427J0676l738
12394C80689p436j015J5988J6956J9885J4950j6012r020j0811j2139r533k0231
12382C62271j6017P523N924j1255p82N175J4452J1468n141n694n759L045Q785
$$ plain form
12470 98781 108100 107659 101716 91009 85315 94865 121943 136150 127579 123739 113523 95954 87206
12457 87206 101026 112546 114071 113290 118946 120480 115330 114423 119006 130597 147736 160250 178464
12444 178464 187211 201992 223400 236816 248072 260435 267955 278508 290176 314253 327966 326373
12432 326373 328929 335749 331761 317694 301080 295641 298035 307121 321630 342996 369178 383532 369711
12419 369711 337487 303385 277073 260419 238111 233835 226744 223603 223377 224199 239621 251186 263963
12406 263963 276166 289601 297772 313603 331798 344670 364353 373729 367324 373751 384427 380689
12394 380689 373253 372238 388226 405182 425067 440017 424005 414985 404174 392035 382502 362271
12382 362271 346254 353777 359701 348446 347664 352839 367291 378759 373618 367924 362165 365210 373995
12369C73995J0434O326R948Q956M381J3774K3946K4636J1840O424J0735M988N222
12356E15605k0188k8848k3731k0304j4478O096O181p131J612o153j9321j702M093
12343C91731m491M065K5885J6188J3303K1537J6101J6346N05r597j5761k2374
12331D53438k0329k2215l0183j9271k3261l460J3252Q52p56m306J2678J3098J2595
12318C82132Q335k668j5482k3956l4967m1694n5209o9234o8537n3922m1344k9784
12306d6330q546K2687L2589O1099R4293P4993O1749O2784M6399J5582r106j6297
12294C91896k3715j8510r713m255k9207k6296j6485o195M626p926l92K854L464
12281B60146J253j898j989J1360J4639j346O807J6874K0737J7929K7860K8161
$$ plain form
12369 373995 384429 390755 400703 409659 414040 427814 451760 476396 488236 494660 505395 510383 515605
12356 515605 495417 466569 442838 422534 408056 414152 420333 413202 414814 408661 389340 387638 391731
12343 391731 387240 391305 417190 433378 446681 468218 484319 500665 501170 491573 475812 453438
12331 453438 433109 410894 380711 361440 338179 334719 347971 348823 348067 343761 356439 369537 382132
12318 382132 390467 387799 372317 348361 313394 271700 216491 147257 78720 24798 -16546 -46330
12306 -46330 -54876 -32189 400 61499 155792 230785 292534 355318 401717 417299 408193 391896
12294 391896 368181 349671 339958 335703 306496 280200 263715 257520 262146 254220 253828 256682 260146
12281 260146 261399 259501 257512 268872 283511 282165 288972 305846 326583 344512 372372 400533
12269D00533Q9k431L159J4124m154q202O931J2775J9025J4270O692J2850Q417
12256D84078J3569K4739L4461K0686J8212J8136J9024R759J7490J4917J5413L5251
12244G25735K7312J7075P723J7772L0369L0402L4274L3241M1679L3524L3618L9028
12232A071752M0484M6651M7855O0413O0333N4160O5620Q4082Q1937R1953R5170
12221A800410J07685J10644J15666J05017J31273J51460J74151K08044K46481
12212C150831K82378L51838L75184M15177M64746N27721N82483O56470P53092
12203G559920Q89867J070098J323886J667999K035516K385638K755552L129846
12195B2818322L426396L590637L741098L971125M377424N200295O810627R865992
$$ plain form
12269 400533 400622 398191 401350 415474 411320 403118 410049 422824 441849 456119 462811 475661 484078
12256 484078 497647 522386 556847 577533 595745 613881 632905 642664 660154 675071 690484 725735
12244 725735 753047 770122 777845 795617 825986 856388 890662 923903 965582 999106 1032724 1071752
12232 1071752 1112236 1158887 1206742 1267155 1327488 1381648 1447268 1531350 1613287 1705240 1800410
12221 1800410 1908095 2018739 2134405 2239422 2370695 2522155 2696306 2904350 3150831
12212 3150831 3433209 3785047 4160231 4575408 5040154 5567875 6150358 6806828 7559920
12203 7559920 8449787 9519885 10843771 12511770 14547286 16932924 19688476 22818322
12195 22818322 26244718 29835355 33576453 37547578 41925002 47125297 53935924 63801916
12187F3801916J5182685K2750643L0040248L4917581L9967899M3285503M1316873
12180B91263348L2999519K2443078J0392310l432437j7517868k9947061l7222341
12173B68978548m0046535m0054961l8307431l2930776k5581985j8823744j3490524
12166E9742592r652179p060055n399375m350746l742612l408187l161066k907911
12158B0060461k646639k369569k068962j759383j429723j137438r18915p46333
12150F983499o12872n05361m09658l37621k92394k73961k37430k26791k13539
12141C873872j94249j75140j78927j72501j53157j33268j34179j12228j00644
12132B519579q7410q2912o0168k8924j3240k8724l9510l0886l3544l6751o6198
$$ plain form
12187 63801916 78984601 101735244 131775492 166693073 206660972 249946475 291263348
12180 291263348 324262867 346705945 357098255 353665818 336147950 306200889 268978548
12173 268978548 228932013 188877052 150569621 117638845 92056860 73233116 59742592
12166 59742592 50090413 43030358 37630983 33280237 29537625 26129438 22968372 20060461
12158 20060461 17413822 15044253 12975291 11215908 9786185 8648747 7729832 6983499
12150 6983499 6370627 5865266 5455608 5117987 4825593 4551632 4314202 4087411 3873872
12141 3873872 3679623 3504483 3325556 3153055 2999898 2866630 2732451 2620223 2519579
12132 2519579 2432169 2349257 2289089 2260165 2246925 2218201 2178691 2147805 2114261 2077510 2011312
12121B011312q0182q7390p0240p4850o8597n3857m3465l3710k7863m814j2563
12110A453781k5348k6427l6522l6592l4007n5791m7990l1172l1456k1946j8835
12099A087695j6184r265j1389j5854k101j743M888J9900K5766J855j5259j4211
12087A054098J648J361m291j0777j3620j3769k9148k2263k3004l2491l4414k0616
12075H52714k0045j6451k1457j7923j6887j7794j0531j3010j2273k3931j9279
12064F63133l234j6408l0574r422J0899K6279L4715M0184N7869P5585O5215N7576
12052I71817M9603L0004J6073l755l1347m6409p0314p9635p7822o6649o7281n4728
12040E69557n2236m6218l0990l2345k4341j0430j5325k7748p119O660j5831k8771
$$ plain form
12121 2011312 1931130 1843740 1773500 1698650 1630053 1576196 1532731 1499021 1471158 1466344 1453781
12110 1453781 1428433 1402006 1365484 1328892 1294885 1239094 1191104 1159932 1128476 1106530 1087695
12099 1087695 1071511 1062246 1050857 1035003 1032902 1031159 1036047 1055947 1081713 1083568 1068309 1054098
12087 1054098 1055746 1057107 1052816 1042039 1028419 1014650 985502 963239 940235 907744 873330 852714
12075 852714 832669 816218 794761 776838 759951 742157 731626 718616 706343 682412 663133
12064 663133 659899 643491 612917 603495 614394 640673 675388 715572 773441 849026 914241 971817
12052 971817 1021420 1051424 1067497 1063742 1032395 985986 915672 836037 758215 691566 624285 569557
12040 569557 517321 471103 440113 407768 383427 372997 357672 329924 322805 329465 313634 284863
12028B84863k7084k5060j2566l5747l4794l4397k7534j6591K093R957k528K470
12016H3082J5347m381l148N666m511L857R548q370O851j346q846J338o623L88
12002H8852M531l290j3403j6864j5665l766P515J3279N475J5331J8999P312J2525
11989A20831J4185K942R17j787L408j5811o270N628p994k023K1303O709r586M901
11975A37353Q912J7354L2770L7825L8965J8896J3270q939o261j2784k2700k4368
11963B30293k7804k8659j2539O887o831j4604j4348j5234n017Q870N958Q138o069
11950A29041L93J5161R444J0934J5084Q653q753j1250P017m098N814m720J391
11937A74111K0276L8821N1585L6743N855J2012j5011j1908J2605J2914J1679K4452
$$ plain form
12028 284863 257779 232719 220153 184406 149612 115215 87681 71090 73183 83140 80612 83082
12016 83082 98429 94048 90900 96566 92055 95912 105460 97090 103941 102595 93749 95087 88464 88852
12002 88852 93383 90093 76690 59826 44161 40395 47910 61189 66664 81995 100994 108306 120831
11989 120831 135016 137958 138875 137088 140496 124685 118415 124043 116049 114026 135329 142038 132452 137353
11975 137353 146265 163619 196389 234214 273179 292075 305345 296406 290145 277361 254661 230293
11963 230293 202489 173830 161291 168178 161347 146743 132395 117161 112144 121014 126972 135110 129041
11950 129041 129434 144595 154039 164973 180057 188710 179957 168707 175724 171626 177440 172720 174111
11937 174111 194387 233208 284793 321536 327391 339403 324392 312484 325089 338003 349682 374134
11925C74134K624q512r818k6092k8071j0629j4292m0598j8099j3454r672j032
11913A96489j5195k2635m268P344K511N239k417o157O635K547l654J2699o320
11900A72818l0016r397J1281J589R279L589J1209l270J6980Q836l112L15K836
11887A92937m913P496J5040R826K5609J6726J9917Q435r855j0771l2685k5324
11875B12438k5921l6070J59J4661J1605J8673K0581P060O20L393M284o02P27o101
11861B25507m36j0911K151l7O148J417j4067j4186k884K0065J0578M389J1709
11848B39443J0878J3084J6966J9677K9281L0972M7829N0426M8421M3141J9251
11837E69369N223k7974l5018n6860n8893m0266m2362j9181j3691j5141j2748j2502
$$ plain form
11925 374134 376758 368246 358428 332336 304265 293636 279344 238746 220647 207193 197521 196489
11913 196489 181294 158659 154391 161735 164246 169485 167068 160911 167546 170093 166439 179138 172818
11900 172818 142802 133405 144686 146275 155554 159143 170352 167082 184062 192898 189786 190101 192937
11887 192937 188024 195520 210560 220386 245995 262721 282638 291073 281218 270447 237762 212438
11875 212438 186517 150447 150606 165267 176872 195545 216126 223186 223806 227199 231483 230881 231608 225507
11861 225507 225071 214160 216311 216274 222422 223839 209772 195586 192702 212767 223345 227734 239443
11848 239443 250321 263405 280371 300048 329329 360301 408130 458556 506977 550118 569369
11837 569369 574592 546618 511600 454740 395847 355581 313219 294038 280347 265206 252458 239956
11825B39956m852Q980J5374J479R651P540K6K568N732J7890K0082R275J6834K3155
11811C73690L0755J5053J1442K4039L0518L6975K5875J0153O646p36k037K268
11799E64641p865j7146j4444j7623j2267l443j6709k0001j5280j2018k0349j1195
11787C96301n518k4529j5470k3866j2996n573Q96L427J7489J2760J6242J5263
11775C74426M2173M5792L8218L8098N6976N3822K1552J2064N371J7444M0406P4756
11763H21098R7060J34253J82874K07720K04145J75485J33670P1174R528o0708
11753A976299j24443j77692k04056k13701k06127j72546j43963j25548p9364o5244
11743D63615o1090n5664l6993m1811l9167j8665m734o781m147j4732N347R701
$$ plain form
11825 239956 235104 244084 259458 260937 270588 278128 278154 280722 286454 304344 324426 333701 350535 373690
11811 373690 404445 419498 430940 454979 485497 522472 548347 558500 565146 564410 562373 564641
11799 564641 556776 539630 525186 507563 495296 491853 475144 455143 439863 427845 407496 396301
11787 396301 390783 366254 350784 326918 313922 308349 309245 312672 330161 342921 359163 374426
11775 374426 416599 462391 500609 538707 595683 649505 671057 683121 688492 705936 746342 821098
11763 821098 918158 1052411 1235285 1443005 1647150 1822635 1956305 2027479 2037007 1976299
11753 1976299 1851856 1674164 1470108 1256407 1050280 877734 733771 608223 528859 463615
11743 463615 402525 346861 309868 268057 228890 210225 205491 198710 194563 179831 185178 194879
11731A94879o184k253M32j3945j4497o246q453j184M410n999q73q795J736L258
11717A36286j0085J4765j2864m755m787R465j2086n593n56j1091j75K178P17O860
11703A08279j4904q765R139P409R666R56j3138p796P519k758j3183n692J866o013
11689G2585M443j2110j0855J2833j271j0265P742J8280N321j929m013l980j4574
11676F2207m873M109o244L17O058O856P586J053j0033o731P40k915q359j4556
11662C5215q71J5365K331n36N993Q77j3918o059K0010J9000k968J440j9537j6997
11648C9345J934K0168O396o3r610m540N022r102L137J1788Q075j933j5963n884
11634D8770q080n149J528l128m301n679j613M411M44J587p27o919j6186J197J9304
$$ plain form
11731 194879 188695 186442 186874 172929 158432 152186 143733 142549 146959 140960 140087 131292 133028 136286
11717 136286 126201 140966 128102 123347 118560 128025 115939 110346 109790 98699 98524 100702 101419 108279
11703 108279 93375 84610 93749 101158 110824 111780 98642 90846 98365 95607 82424 76732 78598 72585
11689 72585 77028 64918 54063 66896 65625 55360 63102 81382 86703 84774 80761 76781 62207
11676 62207 57334 61443 55199 55516 61574 68430 76016 77069 67036 60305 61045 58130 49771 35215
11662 35215 34344 49709 52040 51504 57497 58374 44456 38397 58407 77407 74439 75879 56342 39345
11648 39345 41279 61447 67843 67780 58170 53630 58652 49550 52687 64475 72550 70617 54654 48770
11634 48770 40690 35541 37069 33941 29640 23961 22348 26759 27203 28790 28063 21144 4958 6155 25459
11619B5459J4379R67r4k437J0926m576K933N813l881k4703o55O562J7530R97r068
11604D0152m741j5124P421R734K404M478J698m642j97p978j3362r93N455N785
11590C0090K4934J4507l469j1842L855L548q540p128M248j0663L803j0043j9744
11577A3556l950J7898J4214j796O750L135K147Q968J1675p616j6299o114j491
11564D1077J71J4173L08j6491q482L647L8j087j5346J1028L332M481N209J541
11550D3599J1576Q224p039j091k466l205P981q964o736q890j1302o45Q97M950
11536B6889N159o341k440j0160k87J1812J0831M211k114O020P621N635m330j2923
11522C9583k024k26N73M205Q726j486o936J8582j686O423M078k0438j4493l490
$$ plain form
11619 25459 39838 40805 40711 38274 49200 44624 47557 53370 49489 24786 24131 30693 48223 49220 40152
11604 40152 35411 20287 27708 37442 39846 44324 46022 41380 41183 33205 19843 18850 24305 30090
11590 30090 55024 69531 66062 54220 58075 61623 53083 45955 50203 39540 43343 33300 13556
11577 13556 9606 27504 41718 39922 46672 49807 51954 60922 72597 64981 48682 42568 41077
11564 41077 41248 55421 55729 39238 30756 34403 34441 33354 18008 29036 32368 36849 42058 43599
11550 43599 55175 63399 56360 55269 52803 49598 57579 48615 41879 32989 21687 21042 21939 26889
11536 26889 32048 25707 23267 13107 12820 24632 35463 39674 37560 43580 51201 56836 52506 39583
11522 39583 37559 37333 37906 42111 50837 49351 42415 60997 59311 65734 69812 49374 34881 31391
11508C1391k533j001P075J1867M71j0376J002N748l476n234j3830r789P903q134
11494A1084n886J0962J1233J1372L893P882Q681J346o44O754o85p530j6976j7572
11480B3914L611P738L514p506n596P54j2630j641M680l661K3942J4612j0068o618
11466C5045J297M936l668j0239j4566K295J0906l435M23L066l291J0366J84N059
11452C8378k981J155P371O026j0526p781q398m767l93J4169j402j3354m768N248
11438A7977p398q978J339n696R4J0528K132Q005J036K648K974p065j833L231L079
11423B2073K963R155M941j503l375N851k869l097M620r007n897K197p438p890
11409A0724r688O929L732R835j0971o452K479Q501J4771J371p946j7366R347j917
$$ plain form
11508 31391 28858 27857 34932 46799 47270 36894 37896 43644 40168 34934 21104 11315 19218 11084
11494 11084 5198 16160 27393 38765 42658 50540 59221 60567 59923 66677 65992 58462 41486 23914
11480 23914 27525 35263 38777 31271 25675 26429 13799 12158 16838 13177 37119 51731 41663 35045
11466 35045 36342 41278 37610 27371 12805 15100 26006 22571 22994 26060 22769 33135 33319 38378
11452 38378 35397 36552 43923 49949 39423 31642 23244 18477 18084 32253 30851 17497 12729 17977
11438 17977 10579 1601 2940 -2756 -2662 7866 9998 18003 19039 21687 24661 17596 15763 18994 22073
11423 22073 25036 34191 39132 37629 34254 40105 37236 34139 38759 29752 23855 26052 18614 10724
11409 10724 1036 7965 11697 21532 10561 4109 6588 15089 29860 31231 23285 5919 15266 13349
11395A3349m806q12q289M615j111P934l106M440O34L08l249K173N86K284N029
11380A9979p822Q42N750N886Q084j0067J252J867N091j467N561k708q680j2967
11366A0601j0162K406J0842p957j7104L35J520Q135J0318M739k897j6782O239
11353B33K179P471J0784Q190q463p678Q434M570k503l882k16J588M297p190j7805
11338IJ922M592m20N06P696M443j1320J991N918J2539R178k259r282Q76J504K357
11322C0250k336l515q46n190O86K126J1697r171j3144k884K686J6230n162o873
11308A4554L744K627R132N298j6006n480N97P203M783m264n903j567j091J397
11294A5024m364O617O97n955O733M51p875o493R123J4088Q737R95p578j0866m301
$$ plain form
11395 13349 8543 7731 -558 4057 2946 10880 7774 12214 12848 13156 9907 12080 12666 14950 19979
11380 19979 12157 12999 18749 24635 32719 22652 23904 25771 30862 29395 34956 32248 23568 10601
11366 10601 439 2845 13687 5730 -11374 -11039 -9519 -1384 8934 13673 10776 -6006 233
11353 233 2412 9883 20667 28857 20394 12716 21150 25720 23217 19335 19119 20707 25004 17814 9
11338 9 1931 6523 6103 6609 14305 18748 7428 9419 15337 27876 37054 34795 25513 26389 27893 30250
11322 30250 27914 24399 23553 18363 19049 21175 32872 23701 10557 7673 10359 26589 21427 14554
11308 14554 18298 20925 30057 35355 19349 13869 14466 21669 26452 22188 16285 14718 13627 15024
11294 15024 10660 17277 17974 12019 18752 19203 11328 4835 13958 28046 36783 37778 30200 19334 15033
11279A5033j883j558J2512O91p94P371Q998j613k433R200q842p949M129P38o90
11264C2910j196J5397M831k718o519L950Q506J1234K8733K0142Q117k924O51j2639
11250A08475k2682j9375j0065j4232j3111K408k101r706J231k221Q925K889l587
11237B6848J92J1896J922p77n414p68L949J3919m346m217o160o294k042J080J4110
11222D3898K457J775q617j769J4209J449n736r304m076l27J99M824K670p453j4223
11207A9976j1808J732Q403j47l075q594j916L708O516L8N772J3830N020j0212
11193B9243l573J2754o505o799O2P976J742m653p903p813Q922O867P578O817p094
11178C7621r292k682J067O654J3703l803r4r091o362k103l56K627R564R73O458
$$ plain form
11279 15033 13150 11592 24104 24795 24001 31372 40370 38757 36324 45524 36682 28733 32862 33600 32910
11264 32910 31714 47111 51942 49224 42705 46655 55161 66395 95128 115270 123387 120463 121114 108475
11250 108475 85793 66418 56353 42121 29010 31418 29317 19611 20842 18621 27546 30435 26848
11237 26848 27040 38936 40858 40081 34667 33899 37848 51767 47421 43204 37044 30750 28708 29788 43898
11222 43898 46355 48130 39513 37744 51953 53402 47666 38362 34286 33959 34158 38982 41652 34199 19976
11207 19976 8168 9900 18303 18156 15081 6487 4571 8279 14795 14833 20605 34435 39455 29243
11193 29243 25670 38424 31919 25120 25182 33158 34900 30247 22344 14531 23453 30320 37898 44715 37621
11178 37621 28329 25647 26714 33368 47071 43268 43174 34083 27721 25618 25262 27889 37453 38426 44884
11163D4884p140j322J3782O51K246M41o515k708k477k504K094O412l722L228Q060
11148E5410J945N10j0056q26K16J1404J8467J0070K0528K047O129J3965k972j8543
11134A08294k6827j2769j932O593n957o579l550K174q482K775P565K321n283J2
11120E8355r501M972L669l410n839n235R014J3137K172M577r30r738m611J1252
11106F7884J3736K727j0318J908o784j2875l32J525r126k534K607R522k128M895
11092F0707J5403R371R701J8721K1396J4694J6436K5562N3705Q8723R1721P7787
11080E03927M1638L6342R2006J27096O4274n2217j02527m6664k2771n6946r4026
11069D90132r8757p7836o8966n2099k9371k6299o113k5764k1580L375P685O032
$$ plain form
11163 44884 37744 36422 50204 50855 53101 53542 47027 44319 41842 39338 41432 47844 44122 47350 55410
11148 55410 57355 57865 47809 46983 47199 58603 77070 87140 107668 109715 115844 129809 126837 108294
11134 108294 81467 68698 66766 73359 67402 60823 57273 59447 50965 53740 61305 63626 58343 58355
11120 58355 48854 53826 57495 54085 48246 43011 52025 65162 67334 71911 70981 61243 56632 67884
11106 67884 81620 84347 74029 75937 69153 56278 55946 57471 48345 45811 48418 57940 55812 60707
11092 60707 76110 85481 95182 113903 135299 149993 166429 191991 245696 334419 426140 503927
11080 503927 545565 581907 673913 801009 865283 813066 710539 663875 641104 584158 490132
11069 490132 391375 313539 244573 192474 163103 136804 130691 104927 83347 86722 94407 100439
11057A00439n834j35J130q443q121M383M426l801M825Q86j6477j905L292L14N88
11042G5567m43m305l765m538P80k143n137L433N561J172j2742l103O444R944o894
11027E9831p649p785L00N960M043O432M974O182K742j1226N283l108j0553j0861
11013D4565L643J9245J3750R57j979L690J2126M00n27J606r598j437n405J3114
10999I4150N797j3342k1119m45J1202J3682L67m284o141L548J410o652J638k863
10985G6948J0190P146J6047O36J072m994n280K5m199J316o368K39J3031M719j0290
10970A00238j6886k174Q351J8202J859k480m582r647m715O898R631k697l549J496
10956I9945l911Q036M876j3649J595R832K365L662j615q628M787J4455M850K070
$$ plain form
11057 100439 94605 94470 95600 87157 79036 83419 87845 84044 88869 89755 73278 71373 74665 74979 75567
11042 75567 75124 70819 67054 62516 63296 61153 56016 59449 65010 66182 53440 50337 56781 66725 59831
11027 59831 52182 44397 44697 50657 54700 61132 66106 72288 75030 63804 69087 65979 55426 44565
11013 44565 48208 67453 81203 82160 80181 83871 95997 96397 95870 97476 87878 86441 81036 94150
10999 94150 99947 86605 65486 65041 76243 89925 90292 86008 79867 83415 84825 78173 79811 76948
10985 76948 87138 94284 110331 110967 112039 107045 101765 101790 97591 98907 92539 92778 105809 110528 100238
10970 100238 83352 81178 89529 107731 109590 107110 102528 92881 88166 95064 104695 101998 98449 99945
10956 99945 96034 104070 108946 95297 96892 106724 109089 112751 111136 102508 107295 121750 126600 128670
10942A28670o121j1771j2785n610l09J6013O327m950l839R075L804J405o201O946
10928A20654P608R199o511N644Q193n670j5631o304m368j2614k816J1366J7747
10915A26497K327j1323K972J4429J677l218J157P895O386j979J458J249m693J097
10901A45931O318P361L095J279r739j570Q549O799J006j2254q433o250J717R033
10887A52842j0590q555J2191J2700l507Q23M88M324J5445J8042j0344p009j4993
10874A61857o286J0431O448M351n315K604K34p243p2M747k720j77O764R762j57
10859A85228j2818Q530o393m490k497k871j213N726M079P719L075j2063l29P368
10845A79051O052J091J2620K1386K0227q655j1468O85m277J6022J0379m227q163
$$ plain form
10942 128670 122549 110778 97993 92383 92074 108087 114414 109464 105625 114700 118504 119909 113708 120654
10928 120654 128262 137461 130950 136594 144787 139117 123486 117182 112814 100200 97384 108750 126497
10915 126497 128824 117501 120473 134902 136579 133361 134518 142413 148799 146820 148278 149527 144834 145931
10901 145931 152249 159610 162705 163984 154245 152675 161224 168023 169029 156775 148342 142092 143809 152842
10887 152842 142252 133697 145888 158588 155081 155904 156392 160716 176161 194203 183859 176850 161857
10874 161857 155571 166002 172450 176801 171486 174090 174324 167081 167009 171756 169036 168859 175623 185385 185228
10859 185228 172410 180940 174547 170057 167560 164689 163476 169202 173281 181000 184075 172012 171683 179051
10845 179051 185103 186194 198814 220200 240427 231772 220304 220989 216712 232734 243113 238886 230723
10832B30723L038J9472R106N72P960j514O901J4618J4086K4656J7870N486P107
10819C60081J0472J0117K5823K4211J8563R162N459J3565K5809K2185J0998J7874
10807E54319K3005L6349J7181K577J1320J5041N163J330N060M512J718k448R832
10794F84959k66l522Q708L848r1O279J1311k530J3104R177N662K1658K4029J4786
10780G97112J8085K8180K5002J4998J966J876k74j3745j551K023O873K944m159
10767H79330o36j9542j2941r143k0718k2659K856J575j9510j6196m538o036q005
10754G43837r84Q374J027k281j0022j4735n015k30J1071J334o8Q720J3997J8557
10740G73582O898j155j2369j8364j1167j2843q81j5791j1549j5990p327k8960
$$ plain form
10832 230723 233761 253233 262339 262911 270871 269357 276258 290876 304962 329618 347488 352974 360081
10819 360081 370553 380670 406493 430704 449267 458429 463888 477453 503262 525447 536445 554319
10807 554319 577324 613673 630854 633431 644751 659792 664955 666285 671345 675857 677575 675127 684959
10794 684959 684693 681171 689879 693727 693636 699915 711226 708696 721800 730977 736639 758297 782326 797112
10780 797112 815197 843377 868379 883377 885343 887219 886945 873200 871649 873672 880545 883489 879330
10767 879330 878694 859152 846211 837068 816350 793691 796547 798122 778612 762416 757878 751842 743837
10754 743837 742853 751227 752254 749973 739951 725216 720201 719971 731042 732376 732308 741028 755025 773582
10740 773582 780480 779325 766956 748592 737425 724582 723701 707910 696361 680371 673044 644084
10728F44084k6283k3401j3496k5584o713J4716r152j9201k0993k3567k1227j3415
10716D55768o705k1005j2788o524M046P914q781j6022K542J4692p374J86J6206
10703D22155J0968O943q629N263J6647j6988j3187J0667l624j7208m570L668Q312
10690D20417O565L142N485j0242k224n488n882Q968P848J385j0623J152J8733
10677D39236J6057J3905J3356j7196q336r72P034J206k1103j7915R284K0611n755
10664D49412p719M261J0744M307l6K4849R710L936J0407J3676J1728J1211J5459
10651E61945P853L497J0438j0045j1457O131L732K982J4757P533J768L348L704
10638F06186N375J1889j146o230J8142J2936J0277J970m28M716J0183J3985M59
$$ plain form
10728 644084 617801 594400 580904 555320 548607 563323 554171 534970 513977 490410 469183 455768
10716 455768 449063 428058 415270 408746 412792 420706 411925 395903 398445 413137 405763 405949 422155
10703 422155 433123 440066 431437 436700 453347 436359 423172 433839 430215 413007 408437 412105 420417
10690 420417 426982 430124 435609 425367 423143 417655 411773 420741 428589 429974 419351 420503 439236
10677 439236 455293 469198 482554 465358 457022 456050 463084 464290 443187 425272 434556 455167 449412
10664 449412 441693 445954 456698 461005 460969 485818 495528 499464 509871 523547 535275 546486 561945
10651 561945 569798 573295 583733 573688 562231 568362 572094 575076 589833 597366 599134 602482 606186
10638 606186 611561 623450 622304 616074 634216 647152 657429 659399 658971 663687 673870 687855 688314
10625F88314M89m490K817J6109J3543j6862j6442J7341K1841K952M297l959r62
10612G24988L51J0433J6457K931K490R698J5105O313n134r090J4116J1020J1513
10599H11191l603O446J3649L4476K0908j267J093N679K1209N007j0319O865J2691
10586I24025J667k653R248P569J0625J0416n395Q701J3943l009n453M526M987
10573I79197J1024J7433J3289K472K500Q738J1822J2681L80J3061J9126J1067
10561A102790J2049J7509J1110J0719k640P776J7437J1386K1427K616P139J7438
10549A236756J2408J4681J2398J1343J4837K2373J4444J2103K0447K2473J4688
10538A408951Q201K7167K3432P044q33J4611J2330J8617J8080Q907J8749K6377
$$ plain form
10625 688314 688803 684313 687130 703239 716782 699920 683478 700819 722660 725612 729909 725950 724988
10612 724988 725339 735772 752229 755160 757650 767348 782453 788766 783632 774542 788658 799678 811191
10599 811191 807588 814034 827683 862159 883067 881800 882893 888572 909781 914788 904469 911334 924025
10586 924025 925692 923039 932287 939856 950481 960897 955502 964203 978146 975137 969684 974210 979197
10573 979197 990221 1007654 1020943 1023415 1025915 1034653 1046475 1059156 1059536 1072597 1091723 1102790
10561 1102790 1114839 1132348 1143458 1154177 1151537 1159313 1176750 1188136 1209563 1212179 1219318 1236756
10549 1236756 1249164 1263845 1276243 1287586 1302423 1324796 1339240 1351343 1371790 1394263 1408951
10538 1408951 1417152 1444319 1467751 1474795 1473962 1488573 1500903 1519520 1537600 1546507 1565256 1591633
10526A591633J6506J7852J6798J1154K2891K7173J8442J1109J6101J3878J6927
10515A780464L2646M1108L4994K8453J6954K3281K8403K0922K5914K2530J5047
10504B070716L877J2509Q358K5100K2345J9754K4868J3191J4365K9548K9398L8275
10492B312304L8014L8215M2469K9482L9581L8421L2252L1750M0581M0742L4889
10481B718700L6364L9487M3004M5968L6006N1209O6021O1995N0100O2844O2718
10470C274416N0904M8560O0449N8360O0771P5263P4908O7534O7202P9130R4803
10459D012300J12895J01713Q5935R8377J10774J17219J23439J24599J31734J23754
10449E142739J35614J51657J65024J63167J61650J78546J79812J97944K21716
$$ plain form
10526 1591633 1608139 1625991 1642789 1653943 1676834 1704007 1722449 1733558 1749659 1763537 1780464
10515 1780464 1813110 1854218 1889212 1917665 1934619 1957900 1986303 2007225 2033139 2055669 2070716
10504 2070716 2074593 2087102 2095460 2120560 2142905 2162659 2187527 2200718 2215083 2244631 2274029 2312304
10492 2312304 2350318 2388533 2431002 2460484 2500065 2538486 2570738 2602488 2643069 2683811 2718700
10481 2718700 2755064 2794551 2837555 2883523 2919529 2970738 3036759 3098754 3148854 3211698 3274416
10470 3274416 3325320 3373880 3434329 3492689 3553460 3628723 3703631 3771165 3838367 3917497 4012300
10459 4012300 4125195 4226908 4312843 4411220 4521994 4639213 4762652 4887251 5018985 5142739
10449 5142739 5278353 5430010 5595034 5758201 5919851 6098397 6278209 6476153 6697869
10440F697869K14257K23600K51813K73008K72573K97865L05598L03677L31991
10431I172251L61508L71907M07512M28903M68768N04509N30782N70239O18014
10422A3434393O73645P22092P78135Q36972R12946R91302J066707J149087J247819
10413B1813098J356778J477825J605848J720777J875283K039313K206540K389646
10405C6485108K596431K787401K989967L201347L399073L577279L735427L853519
10397F2625552L883272L860135L748847L535558L217036K813414K354095J842073
10389H7879982J315748P99130L44885k891k70857m44009n16119m87280l58094
10380H8260495j79173N1745L12463O13052R22660J264850J604890J923300K233942
$$ plain form
10440 6697869 6912126 7135726 7387539 7660547 7933120 8230985 8536583 8840260 9172251
10431 9172251 9533759 9905666 10313178 10742081 11210849 11715358 12246140 12816379 13434393
10422 13434393 14108038 14830130 15608265 16445237 17358183 18349485 19416192 20565279 21813098
10413 21813098 23169876 24647701 26253549 27974326 29849609 31888922 34095462 36485108
10405 36485108 39081539 41868940 44858907 48060254 51459327 55036606 58772033 62625552
10397 62625552 66508824 70368959 74117806 77653364 80870400 83683814 86037909 87879982
10389 87879982 89195730 89994860 90339745 90336854 90065997 89621988 89105869 88618589 88260495
10380 88260495 88081322 88133067 88445530 89058582 89981242 91246092 92850982 94774282 97008224
10371I7008224K517479K767106K973690L116438L178528L171106L056349K865661
10363A20654581K550139K173475J739165J237983P17082K06982k99625q00531
10355A28179251j235029j626294j989647k314124k562759k755945k874233k936526
10347A09884694k950313k892879k781600k618706k412340k167845j881228j576423
10339I0603360j277119r30095n84255k34604J04580M36834P21704R87361J219840
10330I1047606J336558J371499J307933J101112P59811L02558k82257r31866j604701
10321I4408253k288357k884869l411331l823916m098699m259387m306530m255816
10313F5079348m142767l972260l759474l537066l308201l079103k841995k632006
$$ plain form
10371 97008224 99525703 102292809 105266499 108382937 111561465 114732571 117788920 120654581
10363 120654581 123204720 125378195 127117360 128355343 129072425 129279407 128979782 128179251
10355 128179251 126944222 125317928 123328281 121014157 118451398 115695453 112821220 109884694
10347 109884694 106934381 104041502 101259902 98641196 96228856 94061011 92179783 90603360
10339 90603360 89326241 88396146 87811891 87577287 87681867 88118701 88840405 89827766 91047606
10330 91047606 92384164 93755663 95063596 96164708 96924519 97227077 96944820 96012954 94408253
10321 94408253 92119896 89235027 85823696 81999780 77901081 73641694 69335164 65079348
10313 65079348 60936581 56964321 53204847 49667781 46359580 43280477 40438482 37806476
10305C7806476k431160k243846k064519j896935j751850j605023j476231j357075
10297B2979837j252870j177141j077578r79794r23518q43014p75970p21114o56180
10288A4572658o23984n77762n31259n09292m74104m42137m19877l95718l63257
10279A0235268l53732l30767l02893k92978k80679k73093k54413k53556k40504
10270G652653k21323k07400j91839j93401j77744j64767j67766j57274j65946
10261F005193j48215j35515j26228j30381j30693j24043j18903j12390j11646
10252D867179j09736j05300j00062r2218j01633q4804q8406q1348q3895p9681
10242C940096p0737n8757o0356o7670o1724o0138l7320l3574m4275n4617o0086
$$ plain form
10305 37806476 35375316 33131470 31066951 29170016 27418166 25813143 24336912 22979837
10297 22979837 21726967 20549826 19472248 18492454 17568936 16725922 15949952 15228838 14572658
10288 14572658 13948674 13370912 12839653 12330361 11856257 11414120 10994243 10598525 10235268
10279 10235268 9881536 9550769 9247876 8954898 8674219 8401126 8146713 7893157 7652653
10270 7652653 7431330 7223930 7032091 6838690 6660946 6496179 6328413 6171139 6005193
10261 6005193 5856978 5721463 5595235 5464854 5334161 5210118 5091215 4978825 4867179
10252 4867179 4757443 4652143 4552081 4459863 4358230 4273426 4185020 4103672 4019777 3940096
10242 3940096 3869359 3810602 3750246 3682576 3620852 3560714 3523394 3489820 3445545 3390928 3330842
10231C330842n7706l8447k4510k2199m219n532M636k7906l4469j2802K224J1697
10219C121609p28r459l4880n0674q9370r6516q8214r0180q5308o4374n8670m7814
10207B405422l7424m0109l8518j9677k6206j6301k9986l4730k2874k9482k0466
10196B089649k6435l8524l4966k2922k0238l2780k9509k9901k6113l0947k4341
10185A772973k0246k2520j4161k3923l4557k9215l3897l0416l8687k9394k4409
10174A471548m1749m0126k5028j5274j9889m4668l6960l3769r306J338j8592k0712
10162A166813k1340r311o058j3395j3999k2938j6785j7864P56o2n969q980K148
10149A033016k841k2156l1244j8905q664j1715j3288n731O974j2846k2095q031
$$ plain form
10231 3330842 3273136 3234689 3210179 3187980 3183761 3178229 3182865 3154959 3120490 3107688 3109912 3121609
10219 3121609 3120881 3111422 3076542 3025868 2936498 2839982 2751768 2661588 2576280 2511906 2453236 2405422
10207 2405422 2367998 2327889 2289371 2269694 2243488 2227187 2197201 2162471 2139597 2110115 2089649
10196 2089649 2063214 2024690 1989724 1966802 1946564 1913784 1884275 1854374 1828261 1797314 1772973
10185 1772973 1752727 1730207 1716046 1692123 1657566 1628351 1594454 1564038 1525351 1495957 1471548
10174 1471548 1429799 1389673 1364645 1349371 1329482 1284814 1247854 1214085 1204779 1206117 1187525 1166813
10162 1166813 1145473 1136162 1130104 1116709 1102710 1079772 1062987 1045123 1045879 1045817 1039848 1030868 1033016
10149 1033016 1030175 1008019 976775 957870 949206 937491 924203 918472 925446 912600 890505 882474
10137H82474n842j4979j9460m473J3989K535Q393N761O055J0677J4339K081j497
10124I00053q065j3932j2994K265q912k2427k2154j7197j5994o468O453p005j5212
10111G58411j6047r242j757j4752q895j1699j0447j3574r978p176J4861Q761K863
10098F81329L664R092R280M005n857J116J1936k536m38N835j2156j5355n841j7475
10084F66599j4472j3279o962q152p541N523O418q865j9166l133m242p323j3053
10071E72352j4546j7561j2290k841M653j4384j0204j569J3107k04J1291l516j5554
10058E08734P125J0750j7089j2816Q52J758q387N614M471P546K3625K3965K7768
10045E83916M2868M8962J9925l925l2152l4055l4546k2221k6469k2640k2943j9733
$$ plain form
10137 882474 876632 861653 842193 837720 851709 854244 862637 868398 874453 885130 899469 901550 900053
10124 900053 891988 878056 865062 867327 858415 835988 813834 796637 780643 774175 780628 773623 758411
10111 758411 742364 733122 731365 716613 707718 696019 685572 671998 662020 654844 669705 678466 681329
10098 681329 684993 694085 703365 707370 701513 702629 714565 712029 711591 717426 705270 689915 684074 666599
10084 666599 652127 638848 631886 623734 616193 621716 628134 619269 600103 596970 592728 585405 572352
10071 572352 557806 540245 527955 525114 529767 515383 505179 503610 516717 516513 527804 524288 508734
10058 508734 515859 526609 509520 496704 497556 499314 490927 496541 501012 508558 532183 556148 583916
10045 583916 626784 675746 695671 691746 659594 625539 590993 568772 542303 519663 496720 476987
10033D76987r655j0902J536L716j151l851N40J944N382n273p395o742n585n303
10019D34248J8269n220j4800j6413R232M645N22o973J2122O477J483l122n27M305
10005D44248Q651k797j6799r265L870K560L471L952P674M371L870O806k460m200
9991D53952J019J2971M917K232R334J7352K4640l535J1239J3320J8328J8095K1956
9978F05820J9968K6428K8257K5027K0373K1654J6724R245N82n04j1636q212k116
9965G51610N008O779j729k467R070m978j2105p23L372J125O688O911J0508L172
9951G82241J1932J9437L2835K5208R624J9064J4361J7804J454J3290J7096J7029
9939I81375J3728p159o574n942r288j6451j0594r039j5644j9251k1592j1274j5918
$$ plain form
10033 476987 467332 456430 457966 461682 460531 456680 457220 459164 464546 459273 451878 445136 439551 434248
10019 434248 452517 447297 432497 416084 425316 429961 430483 423510 435632 442109 443592 440470 439943 444248
10005 444248 452899 450102 433303 424038 427908 430468 433939 437891 445565 449936 453806 460612 458152 453952
9991 453952 454971 467942 472859 475091 484425 501777 526417 522882 534121 547441 565769 583864 605820
9978 605820 625788 652216 680473 705500 725873 747527 764251 773496 774078 773574 761938 753726 751610
9965 751610 756618 763397 761668 759201 768271 763293 751188 750465 753837 754962 761650 768561 779069 782241
9951 782241 794173 813610 846445 871653 881277 900341 914702 932506 933960 947250 964346 981375
9939 981375 995103 987944 981370 975428 966140 949689 939095 930056 914412 895161 873569 862295 846377
9926H46377l919j926k563R7j6935l0484l0635k3126j1147k098j2388P185J6048
9913G34486P473K10J82K6258M1641M6135Q6401J14138J26004N1355o2432j08945
9901A062906q6272o7568p5343n3661m0893n2511l6987k7116l8832k7722j4228
9890E41773j1005q146j4859k6490j6180j6378k1860j1954p443p662q463r255j7373
9877C64705j4501r185k366q439N101O726O873J8374J7233P785J6851q364j3517
9864C87276p374j8126j6845j1319j3425P646J984j274M127j005K832K907Q128
9851C45532P305m389J43M859J4841K1506J6618K2336L7357O5359O4763Q1059J22182
9838G99471J88571K81516L01120J28365j15776k15651k29775k09865j60115j13759
$$ plain form
9926 846377 842458 840532 837969 838066 821131 790647 760012 736886 725739 723641 711253 718438 734486
9913 734486 741959 742169 742351 768609 810250 856385 942786 1056924 1182928 1234283 1171851 1062906
9901 1062906 976634 909066 833723 780062 739169 686658 649671 622555 583723 556001 541773
9890 541773 530768 522622 507763 481273 465093 448715 426855 414901 407458 399796 391333 382078 364705
9877 364705 350204 341019 338653 330214 335315 342041 348914 367288 384521 392306 409157 400793 387276
9864 387276 379902 361776 344931 333612 320187 327833 329817 328543 332670 331665 334497 337404 345532
9851 345532 352837 348448 348591 353450 368291 389797 406415 428751 466108 531467 596230 677289 799471
9838 799471 988042 1269558 1570678 1699043 1583267 1367616 1137841 927976 767861 654102
9828F54102p3003m5297k5902J122J8599M1423P8231Q3493R1727P1831j930n6752
9816H37644n4054l6925r605P2027J98050L54194L22393M9417k18195l08963k56809
9805I49174j99593j57396j09572p8760m1962k7508k9879j6318J0233L10k156n62
9793B96011J567l843k6819p500J596N099J7608q77j3454q684j477q071L36m401
9779B47091o700j0816r498j9518p348J4176K9712K0887J5105J1200J5144m418
9767B95017n386k669j296o991j087r442q255k230q097j3863l015j2501j0978l469
9753B05738O342J801q419M081j3230j9382j900J4636O549K482Q175N172k880j5424
9739A93741j8584j1682k271o165L958L112P303M28p515P869j967M15J8304m888
$$ plain form
9828 654102 581099 535802 509900 511022 529621 571044 649275 732768 824495 896326 894396 837644
9816 837644 783590 746665 737060 809087 1007137 1361331 1683724 1733141 1514946 1205983 949174
9805 949174 749581 592185 482613 403853 361891 334383 304504 288186 298419 298729 296573 296011
9793 296011 297578 293735 266916 259416 261012 266111 283719 282842 269388 260704 259227 251156 251492 247091
9779 247091 240391 229575 220077 200559 193211 207387 237099 257986 273091 284291 299435 295017
9767 295017 289631 286962 285666 278675 277588 268146 259891 257661 249564 235701 232686 220185 209207 205738
9753 205738 212080 213881 205462 209543 196313 176931 175031 189667 196216 198698 206873 212045 209165 193741
9739 193741 175157 163475 161204 155039 158997 162109 169412 169840 162325 170194 168227 168642 186946 182058
9725A82058J384J641K790k763L773J8242K8221Q755l608N233n863j8005j3090
9712B08768l148J533r729n537k802q44m563p8O546r897j5070J495J2610L849m572
9697A78561q556o034n63k426J694M575o97l039o590p145n089K342l540J1657P892
9682A63042q831M69J0768k252l266l393q758P895Q220J0296J4795O461m736j06
9668A90604P020N801q151j4986J547j877j1480j157L959j1132m81n55q106r709
9654A41297o634j1408P230J3100N691N631J725l03J0869K173k801p198m654m078
9640A50640l012K2918O977j1858n461J2790q429j1556o76k585K350P088J0137
9627A69323n728n178N277j5671J303L841n918P5O868Q576J1332K5j4747j0645
$$ plain form
9725 182058 183442 185083 187873 185110 188883 207125 235346 244101 240493 245726 239863 221858 208768
9712 208768 205620 207153 197424 191887 189085 188241 183678 183600 190146 180249 165179 166674 179284 183133 178561
9697 178561 170005 163971 163408 160982 162676 167251 166554 163515 156925 149780 144691 147033 143493 155150 163042
9682 163042 154211 154680 165448 163196 159930 156537 147779 155674 163894 174190 188985 195446 190710 190604
9668 190604 197624 203425 195274 180288 181835 179958 168478 167321 171280 160148 159667 159112 151006 141297
9654 141297 134663 123255 130485 143585 149276 154907 156632 156329 167198 169371 166570 159372 154718 150640
9640 150640 147628 170546 177523 165665 160204 172994 164565 153009 152333 149748 152098 159186 169323
9627 169323 163595 158417 163694 148023 149326 153167 147249 147324 154192 162768 174100 174125 159378 148733
9613A48733M471O164k510N780O48j0645J151J3837R084P031M025N740p617o883
9599A79009p53L684J989k150r89K594P852j7427j7038M075M513K370P666N679
9585A81074L635M379p228j1253k611J1419J9814K17K55J770m488p054j928M289
9571A92290o949m413o94R054Q81P322K404j647l56o916O652J4647K683m520J2968
9556B23406N232N800J5313J0451K0971K7997L6778K7656K9730J2188R534j5121
9544D09935l6184l4929k5342j9219j4763r661k4093p754K68J240M821P491L835
9531B55645R954R236J5161J2807J341Q269J065K0349L8193L1068M1938M3278L4580
9518E22884L9881M4509K8256J8770Q165K2206K5760K4321L712j3873k5193j4666
$$ plain form
9613 148733 153204 159368 156858 162638 163286 152641 153792 167629 176713 183744 187769 193509 185892 179009
9599 179009 178256 181940 183929 181779 180790 183384 191236 173809 156771 160846 165359 167729 175395 181074
9585 181074 184709 189088 181860 170607 167996 179415 199229 199446 199701 201471 196983 189929 188001 192290
9571 192290 185341 180928 180234 189288 190169 197491 199895 198248 197892 190976 197628 212275 214958 210438 223406
9556 223406 228638 234438 249751 260202 281173 309170 345948 373604 403334 415522 425056 409935
9544 409935 373751 338822 313480 294261 279498 269837 245744 237990 238258 239498 244319 251810 255645
9531 255645 265599 274835 289996 302803 304144 312413 313478 333827 372020 403088 445026 488304 522884
9518 522884 562765 607274 635530 654300 662465 684671 710431 734752 738464 724591 699398 684732
9506F84732k4272k2619j6572k2327k4874l1863l3164j1539r553r941o047R448
9494D81409M338l38P088M874K4430K0286K0392K4546J2192L1971M0722N2236L2593
9481G56739L2520N0438M7728L1063L3075K1686J2073o557j8596k7127m4151l5599
9469H53292k6726k8972l7136n1079l3141m0750m2739l0190j7003l527j7714j7066
9457E07249r545j1045P311J2366Q248O231J1273J9073J9779K2265L2930K4965
9445F51100J6734J4704J1813J9666K1421K0340L567L285o102k7341l2234l2814
9433F64139l4050l0017m1806k8004j9863l8930l1008k4159j9162r279j3020k0810
9421C54031J163j8881k8237l697j1723O250J5718Q474N051J1919R935K275J2427
$$ plain form
9506 684732 660460 637841 621269 598942 574068 542205 509041 497502 487949 478008 471961 481409
9494 481409 485747 485409 492497 497371 521801 542087 562479 587025 599217 631188 671910 724146 756739
9481 756739 789259 839697 887425 918488 951563 973249 985322 978765 960169 933042 888891 853292
9469 853292 826566 797594 760458 709379 676238 635488 592749 562559 545556 542029 524315 507249
9457 507249 497704 486659 493970 506336 514584 520815 532088 551161 570940 593205 626135 651100
9445 651100 667834 682538 694351 714017 735438 755778 759345 762630 756528 729187 696953 664139
9433 664139 630089 600072 558266 530262 510399 471469 440461 416302 397140 387861 374841 354031
9421 354031 355194 336313 308076 304379 292656 298906 314624 323098 328149 340068 350003 352278 364705
9408C64705J3342J7804J8380J4247N144p434j5068k1032j2074j7227j6703k8140
9396C15944k3700j4218j9437j4995J480J1819K965o032P639J497R02j699m105
9383B58060p840J794n34J4495J2479Q143N638J7130j224m347J077q823K435J0096
9369C08579J4004l988J055l497k999J4174J1139o420j1760r053N136L965J3180
9356C33515R840j147k29R009P285J3009P019J2490J2672J0934L02P44n688J2869
9342D22624J485J2049J4172J230J0915Q871J1573K798m06P88r044j37K0197K0832
9328E17947J2890j2799l32J2820P335M031p985j4672l685J1475J4970L332Q458
9315E53785J637R269J1681J8421N012M967J8015K5588J400M059J1533k46j2525
$$ plain form
9408 364705 378047 395851 414231 428478 433622 426188 411120 390088 378014 360787 344084 315944
9396 315944 292244 278026 258589 243594 245074 256893 259858 253826 261465 262962 263864 262165 258060
9383 258060 250220 252014 251480 265975 278454 286597 292235 309365 308141 303794 304871 296048 298483 308579
9369 308579 322583 318595 319650 316153 313154 327328 338467 332047 320287 311234 316370 320335 333515
9356 333515 343355 342208 341979 350988 358273 371282 378301 390791 403463 414397 414699 415443 409755 422624
9342 422624 424109 436158 450330 451560 462475 471346 482919 485717 485311 486099 477055 476918 497115 517947
9328 517947 530837 518038 517706 530526 537861 541892 533907 519235 515550 527025 541995 545327 553785
9315 553785 555422 564691 576372 594793 599805 604772 622787 648375 649775 653834 665367 665121 652596
9302F52596J1135J6755K100J918J3880K3242K5409J6257K5192J6118J7082j983
9290H19701k799l819r362m670L733j313J3085Q825L2243K5681Q210J8643J3893
9277I22051K6434L6003K4220M974p133N911J3936J4359J7235J8635J7296K7205
9265A121126J6957K5793J9332L541O976l347J6530J3790J3651J5679P271N12N165
9252A262976J425k436j0767k48P134J4625K8671K4282K1941Q836K4295J3835R011
9239A403580M336P895o128J04J6117Q881N928K665P799K4078R244J6407K1391
9226A522297L3761K0783Q579K2489K4881J2047J9996J2096P150J4912N424L806
9214A708221J4028J5864P446O286K2899K3905L392p001m848n594m564j0819j4325
$$ plain form
9302 652596 663731 680486 682586 684504 698384 721626 747035 763292 788484 804602 821684 819701
9290 819701 816902 813083 803721 799051 802784 801471 814556 823381 855624 881305 889515 908158 922051
9277 922051 948485 984488 1008708 1013682 1006549 1012460 1026396 1040755 1057990 1076625 1093921 1121126
9265 1121126 1138083 1163876 1183208 1186749 1193725 1190378 1206908 1220698 1234349 1250028 1257299 1257811 1262976
9252 1262976 1264401 1261965 1251198 1250950 1258084 1272709 1301380 1325662 1347603 1356439 1380734 1394569 1403580
9239 1403580 1407916 1415811 1409683 1409787 1425904 1434785 1440713 1443378 1451177 1475255 1484499 1500906 1522297
9226 1522297 1556058 1576841 1585420 1607909 1632790 1644837 1664833 1676929 1684079 1698991 1704415 1708221
9214 1708221 1722249 1738113 1745559 1751845 1774744 1798649 1802041 1795040 1790192 1784598 1780034 1769215 1754890
9201A754890P994J9031K2572J0388K3459K5320J9361M557P337J3163R438K0574
9189A938084J4344o81K1627K3655J4552N0254N2912N3372N5881O6137P3715P7689
9177B441541R2247J01436J10987J24193J67000J98770K33189K62535L10335L65588
9167D407821M29525M92472N79497P13046Q82018J062560J231738J379018J498468
9158A2676163J666939J938821K229167K429785K533684K585885K546755K287297
9150C0894496J630413O48945m46002j395410k000228k208989k127273j909401
9142B3086551j634852j284332r04121n20647j32580K36380N94089R50640J318471
9133B1709599J704616K029801K304782K515768K751266L061538L463830L947196
$$ plain form
9201 1754890 1762884 1781915 1804487 1814875 1838334 1863654 1883015 1887572 1894909 1908072 1917510 1938084
9189 1938084 1952428 1951747 1973374 1997029 2011581 2061835 2114747 2168119 2224000 2290137 2363852 2441541
9177 2441541 2533788 2635224 2746211 2870404 3037404 3236174 3469363 3731898 4042233 4407821
9167 4407821 4837346 5329818 5909315 6622361 7504379 8566939 9798677 11177695 12676163
9158 12676163 14343102 16281923 18511090 20940875 23474559 26060444 28607199 30894496
9150 30894496 32524909 33173854 32727852 31332442 29332214 27123225 24995952 23086551
9142 23086551 21451699 20167367 19263246 18742599 18610019 18846399 19440488 20391128 21709599
9133 21709599 23414215 25444016 27748798 30264566 33015832 36077370 39541200 43488396
9125D3488396M393302M768763M973170M895346M567545M019532L367283K780282
9117G7253619K290573J908459J622971J357349J060820O21179o7772r12837j776896
9108H3357465k414259k771547k885045k865608k778221k568950k207461j683274
9100F3183100j038696l41752L52291R89404J558083K064637K518832K954949L388560
9091G5629408L848275M288868M743478N158226N521441N767015N828288N692747
9083A16477746N430461N147248M931768M612588L861985K427717L64660j922748
9075A41331425l953148n475149o478489p034142p208279o997202o478781n779982
9067I1926253n015877m228922l466769k753417k057625j393978p54381j54957
$$ plain form
9125 43488396 47881698 52650461 57623631 62518977 67086522 71106054 74473337 77253619
9117 77253619 79544192 81452651 83075622 84432971 85493791 86114970 86047198 85134361 83357465
9108 83357465 80943206 78171659 75286614 72421006 69642785 67073835 64866374 63183100
9100 63183100 62144404 61802652 62154943 63144347 64702430 66767067 69285899 72240848 75629408
9091 75629408 79477683 83766551 88510029 93668255 99189696 104956711 110784999 116477746
9083 116477746 121908207 127055455 131987223 136599811 140461796 142889513 143254173 141331425
9075 141331425 137378277 131903128 125424639 118390497 111182218 104185016 97706235 91926253
9067 91926253 86910376 82681454 79214685 76461268 74403643 73009665 72255284 72100327
9059G2100327M09589R52044J521982K083132K637337L211056L723592M125440
9051I0764499M377493M460751M334990L981229L440577K692964J658238M17659
9043A16128400r87472k457527l781523m873748n620362o053536o158190o011920
9035H0184122n686058n274761m813907m329494l852672l395853l008317k649473
9027D7173587k266628j910832j576542j239881q73523m64609l9179M14502R00191
9018D0117086J341992J700119J808315J662118J344006J018812P28499L13236
9010E0034183l70693j245155k061321k682763l088762l265527l141623k821140
9002C1357199k427981k054675j763343j555566j456560j403766j411954j422576
$$ plain form
9059 72100327 72509916 73461960 74983942 77067074 79704411 82915467 86639059 90764499
9051 90764499 95141992 99602743 103937733 107918962 111359539 114052503 115710741 116128400
9043 116128400 115140928 112683401 108901878 104028130 98407768 92354232 86196042 80184122
9035 80184122 74498064 69223303 64409396 60079902 56227230 52831377 49823060 47173587
9027 47173587 44906959 42996127 41419585 40179704 39306181 38841572 38802393 39216895 40117086
9018 40117086 41459078 43159197 44967512 46629630 47973636 48992448 49720947 50034183
9010 50034183 49663490 48418335 46357014 43674251 40585489 37319962 34178339 31357199
9002 31357199 28929218 26874543 25111200 23555634 22099074 20695308 19283354 17860778
8994A7860778j397838j329825j262618j152513j035366r44757q13567o84908n88669
8985H650717n12739m39507l49602k90958k61795k19345k13483k04362j79687j61274
8975E817965j47113j42408j43191j21592j00907p9502o2072l6130J451R870K0666
8964E017037K8699N7272O6893O2726P6794Q0920Q5473Q5554Q8840Q1142Q7487
8953E818837J09278J38768J58109J84909K14322K41722K80026L35704L75412M30685
8943H287772M66526N06647N60563N93538O38988O72745O95678P13062P16036P32631
8933A4584186P41444P53731P57971P73839P56204P50238P39381P58377P84408
8924B1399779Q44844R52120J089443J231587J331386J329520J192890R27887N24175
$$ plain form
8994 17860778 16462940 15133115 13870497 12717984 11682618 10737861 9924294 9239386 8650717
8985 8650717 8137978 7698471 7348869 7057911 6796116 6576771 6363288 6158926 5979239 5817965
8975 5817965 5670852 5528444 5385253 5263661 5162754 5083252 5021180 4985050 4986501 4996371 5017037
8964 5017037 5045736 5103008 5169901 5232627 5309421 5390341 5475814 5561368 5650208 5731350 5818837
8953 5818837 5928115 6066883 6224992 6409901 6624223 6865945 7145971 7481675 7857087 8287772
8943 8287772 8754298 9260945 9821508 10415046 11054034 11726779 12422457 13135519 13851555 14584186
8933 14584186 15325630 16079361 16837332 17611171 18367375 19117613 19856994 20615371 21399779
8924 21399779 22244623 23196743 24286186 25517773 26849159 28178679 29371569 30299456 30823631
8915C0823631Q9619k97868n63322o73974o04282m36865k05052P0975L43031N90712
8905B9136605P61159Q78048Q88113P90112O26039M73780L30762K54776K50201
8896C4389595L08105M15618N64486P55008R70807J202230J452544J689097J872609
8887D3620099J972103J972325J840167J552754J189951Q09161M50056J74138n5562
8878E3525192k52445m26218n74154p33626q76112r92805j112832j258896j396992
8869D5901112j484747j530668j476783j344803j142084q84755n89064k75475M8018
8860C7220751L78189P09900J058870J411203J733798J992163K161326K179268
8852D8845468K013363J702475J238767P03644J43495l38743p70538j128897j370941
$$ plain form
8915 30823631 30913250 30615382 30052060 29378086 28773804 28336939 28131887 28202862 28545893 29136605
8905 29136605 29897764 30775812 31663925 32454037 33080076 33553856 33884618 34139394 34389595
8896 34389595 34697700 35113318 35677804 36432812 37403619 38605849 40058393 41747490 43620099
8887 43620099 45592202 47564527 49404694 50957448 52147399 52956560 53406616 53580754 53525192
8878 53525192 53272747 52846529 52272375 51538749 50662637 49669832 48557000 47298104 45901112
8869 45901112 44416365 42885697 41408914 40064111 38922027 38037272 37448208 37172733 37220751
8860 37220751 37598940 38308840 39367710 40778913 42512711 44504874 46666200 48845468
8852 48845468 50858831 52561306 53800073 54503717 54647212 54308469 53537931 52409034 51038093
8843E1038093j521669j589967j609882j581471j525791j465462j405986j352614
8835C8985251j293051j166027j011086q57125o97779n67229n13828n65239o51627
8826C1662260p49775q43329q60138p65435o53278n01809l33069j69653m9826K3905
8816B6759853L9389j7413p8031j58933k52115k95647k97836k93886k51938k15279
8806B4938164j86274j80830k38191l63466n48867p23822r28334j116880j266424
8797A9385076j342580j345341j297983j188763j066944r23394p82249o70960n31590
8788A0235272l79288k62549j53388m2733M0073Q6397R6426L4254q6644j83360
8778I384460k65128k97902k92491k49360j85773j09424n3170n8748q2393j69214
$$ plain form
8843 51038093 49516424 47926457 46316575 44735104 43209313 41743851 40337865 38985251
8835 38985251 37692200 36526173 35515087 34657962 33960183 33392954 32879126 32313887 31662260
8826 31662260 30912485 30069156 29209018 28443583 27790305 27288496 26955427 26785774 26735948 26759853
8816 26759853 26799242 26781829 26703798 26544865 26292750 25997103 25699267 25405381 25153443 24938164
8806 24938164 24751890 24571060 24332869 23969403 23420536 22696714 21768380 20651500 19385076
8797 19385076 18042496 16697155 15399172 14210409 13143465 12220071 11437822 10766862 10235272
8788 10235272 9855984 9593435 9440047 9397314 9437387 9523784 9620210 9654464 9567820 9384460
8778 9384460 9119332 8821430 8528939 8279579 8093806 7984382 7931212 7872464 7790071 7620857
8768G620857k85640l79864m59778m87968m86727m72377m18729l70475l18964k84498
8758C655837k46827k13168j82934j65838j41943j23624j13047r8395r3049r5657
8748B181355p2411o0189n2486o8232n3605m5135l7428j2742k3033j6844j5606
8737A723644l4035k8087j2254k6786l9346k1845j7552l0585l6714m1649l4866
8726A399925k3725k5269j1848p218j7077j7929k8563j5064M508R27j194M157Q502
8713A270132O462J1234J5994J9463J5177J8078K5068K8609L3242R280j2324k133
8701A438282p751j9637j7465l4133k9268k0699m8009n9563l2581k7992j9553j8817
8689A102814l0160r811o139m239J139j955n27j7405q61R122J9806J5452Q911J9442
$$ plain form
8768 7620857 7335217 6955353 6495575 6007607 5520880 5048503 4629774 4259299 3940335 3655837
8758 3655837 3409010 3195842 3012908 2847070 2705127 2581503 2468456 2370061 2277012 2181355
8748 2181355 2108944 2048755 1996269 1928037 1874432 1829297 1791869 1779127 1756094 1739250 1723644
8737 1723644 1689609 1661522 1649268 1622482 1583136 1561291 1543739 1513154 1476440 1434791 1399925
8726 1399925 1376200 1350931 1339083 1331865 1314788 1296859 1268296 1253232 1257740 1258667 1257473 1261630 1270132
8713 1270132 1276594 1287828 1303822 1323285 1338462 1356540 1381608 1410217 1443459 1452739 1440415 1438282
8701 1438282 1430531 1410894 1393429 1359296 1330028 1309329 1261320 1201757 1169176 1141184 1121631 1102814
8689 1102814 1072654 1062843 1056704 1052465 1053604 1051649 1051122 1033717 1032856 1041978 1061784 1077236 1086147 1105589
8675A105589J3865K4194L0182K7776L0942K6343N789n662M53k9555l6797l3920
8663A159199l6933k2606k5882k8576l3557k4158k9804k0359k2161j2240j6947
8652H85976j8541l1874k2592K789o701k1805j0964l69l256K2686J4706k547Q983
8639H16491M324N51J4494K753J307J3742q087j6927j8328k845r969k2982j1356
8626G63168q065j0197j2212j8142k0220r683k0089k6844j8344p330o151k291J2756
8613F16356K5482O9817J19162M2861n0528p4487p4321n6060l6368j4607K902m461
8601E65748j2489L547p728J468j0825j2077K165Q366J4003J0160m562o013O766
8588E58529J356m007p953j0199R490L510N267K0588J9353K2050J9437K7307K6919
$$ plain form
8675 1105589 1119454 1143648 1173830 1201606 1232548 1258891 1264680 1259018 1259471 1229916 1193119 1159199
8663 1159199 1122266 1099660 1073778 1045202 1011645 987487 957683 937324 915163 902923 885976
8652 885976 867435 835561 812969 815758 809057 787252 776288 775919 772663 795349 810055 807508 816491
8639 816491 820815 821366 835860 838613 839920 853662 845575 828648 810320 807475 797506 774524 763168
8626 763168 755103 744906 732694 714552 694332 684649 664560 637716 619372 612042 605891 603600 616356
8613 616356 641838 711655 830817 873678 823150 748663 674342 618282 581914 567307 570209 565748
8601 565748 553259 556806 549078 550546 539721 527644 529809 538175 552178 562338 557776 551763 558529
8588 558529 559885 555878 547925 537726 547216 550726 555993 576581 595934 617984 637421 664728 691647
8575F91647M8139M8905L8764N3169O4242R1284R3803J03026J69071K37963J44825
8564A784838j02898j92148j82058j51712j29988j09180q2454n5522n4979n9355
8554F64544m1441m6384m2576k1627k2645k1191k8193j9365j8736k0068j3964N444
8542C73798R6o22j173j44k367p6P177l232o555L245m20N446L476J2884J5104M894
8526D11531Q250K285N265L1882N7889R6038Q6543k0561q3423p6861m6595m4812
8514D27431l3303j320J639J998l134j7414j5004J0230J0258J0158M364m649L438
8501C94692O261j496j1298J654J9122L3652K7529L0218L2426K2452j0579l3510
8489E11123j3005M62M664P336o594j5646n211j2945j5711k1454l463n958m555
$$ plain form
8575 691647 739786 788691 827455 880624 944866 1036150 1129953 1232979 1402050 1640013 1784838
8564 1784838 1681940 1489792 1307734 1156022 1026034 916854 834400 778878 723899 664544
8554 664544 623103 576719 534143 512516 489871 468680 440487 421122 402386 382318 368354 373798
8542 373798 373894 373272 372099 371955 369588 369512 376689 373457 366902 370147 369727 375173 378649 391533 406637 411531
8526 411531 419781 422066 427331 459213 517102 613140 699683 679122 595699 518838 472243 427431
8514 427431 394128 392808 394447 396445 393311 375897 360893 371123 381381 391539 395903 391254 394692
8501 394692 400953 399457 388159 389813 408935 442587 470116 500334 532760 555212 544633 511123
8489 511123 498118 498580 503244 510580 503986 488340 483129 470184 454473 433019 429556 423598 419043
8476D19043r30j561j0925j2613j2049M26L362q550r534j5998n587J0856K1885
8463C77825J7630N876N356J819O959O107j941K085K0852K5738J4386K0361K1330
8450E24383k436M193J0483j0919k4519j9975p547o632j9060k7609q776j4057j5063
8437C82466k411o982M69O432R859Q215r630r520j013j3423j1179j1150M01J3602
8423C56136k332r02k964j2896m010j933j664K264n211j330J1965J0862R626K243
8409C59854n086j5935j122k5242p948L916Op252k0125j0739l558m532J767J3742
8395B77746J2449n534n620j6258p662r627j998j6699N736P373j120p174O912k273
8381B36251j2400n323l303o443L674K7427Q055p536p559j4502q385P83o537J6
$$ plain form
8476 419043 418113 416552 405627 393014 380965 381391 384753 376203 366669 350671 345084 355940 377825
8463 377825 395455 401331 406687 408506 415465 421572 419631 421716 442568 468306 482692 503053 524383
8450 524383 521947 526140 536623 525704 501185 481210 473663 467031 447971 420362 411586 397529 382466
8437 382466 380055 373073 373542 379974 389833 398048 388418 378898 377885 364462 353283 342133 342534 356136
8423 356136 353804 352902 349938 337042 333032 331099 329435 331699 326488 325158 337123 347985 357611 359854
8409 359854 354768 338833 337711 312469 304521 308437 308443 301191 281066 270327 266769 262237 264004 277746
8395 277746 290195 284661 279041 262783 255121 245494 243496 226797 232533 239906 238786 231612 238524 236251
8381 236251 223851 218528 215225 208782 212456 239883 247938 240402 232843 218341 209956 210739 204202 204218
8367B04218r395j1429n003q444o118n353O77K210j0920j6525M15n167J1692P811
8353A48669O484J8272K31j0509j0259l832Q2r937k605p473j6553m981P316J064
8339A15969k314q465j4816J536P117o143j1337O571O625M381N096O941p246J040
8325A04955P165n356n699p130n83j0455M354J180j3723L751K967o460J9916Q586
8311A03468j629r157l494j456J717n767N943L686j2965p949K334J075J1459l627
8297H3638j5069J860k907o919j492J4919N503K708K051K820m062O560J3556j3320
8283H9846j1807q013o361j433R846K1206K66r72m038J240k247p510j989K760j824
8268G8970k188M498j352p281k561M774L11J090p506l168O669K583K310R614Q389
$$ plain form
8367 204218 194823 183394 178391 169947 163829 158476 159153 161363 150443 133918 134333 129166 140858 148669
8353 148669 155153 173425 173656 163147 152888 149056 149138 139201 136596 129123 112570 107589 114905 115969
8339 115969 113655 105190 90374 91910 99027 92884 81547 88118 94743 99124 104220 111161 103915 104955
8325 104955 112120 106764 101065 93935 93352 82897 87251 88431 74708 78459 81426 74966 94882 103468
8311 103468 101839 92682 89188 87732 89449 83682 89625 93311 80346 72397 74731 75806 87265 83638
8297 83638 68569 70429 67522 60603 59111 74030 79533 82241 84292 87112 83050 89610 103166 89846
8283 89846 78039 70026 63665 62232 72078 93284 93550 92578 88540 89780 87533 80023 78034 80794 78970
8268 78970 76782 81280 79928 72647 70086 74860 75171 76261 68755 65587 72256 74839 77149 86763 95152
8253I5152J680n804j2826M046J128j147M22n16N850k756o683j4294k301O772j2504
8238E6219O433J4851j1297j1613J5198J3079J407j2112P039j039j7265n597P367
8225F2670J170n409P06Q707L619L020p089N146J2169r183j2525L836L059o251
8211F3645R754j77m529k016J723L97p863r011O700n840P300Q924J4569J0944k301
8196I2219K180o223p714J62o351j7838k0386N893j062j925L897N04l850l827R250
8181D4929O459j585l737K5j056J2216K3736O180p941l656j5938K235O45K839n581
8166E9770j0679M32O026j1487N952J2601o780j1702l577p880P895J1852o95k372
8152D9356q76n319N39L3185L8132l36r983j5254j3152l324m255k2157q122l088
$$ plain form
8253 95152 96832 91028 78202 82248 83376 82229 82651 82135 87985 85229 78546 64252 61951 68723 56219
8238 56219 62652 77503 66206 54593 69791 82870 84277 72165 79204 78165 60900 55303 62670
8225 62670 63840 58431 59137 67844 71463 74483 67394 72540 84709 75526 63001 66837 69896 63645
8211 63645 73399 73222 68693 66677 68400 68797 60934 51923 58623 52783 60083 69007 83576 94520 92219
8196 92219 94399 88176 80462 80624 74273 56435 36049 41942 40880 38955 42852 43356 39506 35679 44929
8181 44929 51388 49803 46066 46091 45035 57251 80987 87167 79226 75570 59632 61867 62512 65351 59770
8166 59770 49091 49523 55549 44062 50014 62615 55835 44133 40556 32676 40571 52423 51728 49356
8152 49356 48480 43161 43700 76885 115017 114681 104698 89444 76292 72968 68713 46556 38434 35346
8138C5346j1390M165J4158K473Q409O796J168P561P511M57M986p20L805j0988
8124G3737p455L219R798J95j2034p014J0963K0224K9J03L100M28J3837j2732o173
8109I0225o91k0993j0458j717m607O480P196Q955J4646R069m472o770j2453j6149
8095E8261N285M999j617R055R354l197n672m617K5367N412j4356r312l826J5844
8081I0980J1361K1700J2732j2398j9588j2090l822K0261O745r77J8734J2116J1456
8068A57210K2130J3488N448J1929j7465k8626j8911p682J166l414m187j2025j2114
8055A06947o481J483O129O882L562k160P707N892L841M407o927n02l487j1960
8041A15333p762Q758J5300m474O108R316K9680J1779n53p013j3392k950J1854
$$ plain form
8138 35346 23956 28121 42279 44752 53161 59957 61125 68686 76197 76654 81640 80920 84725 73737
8124 73737 66282 69501 79299 79494 67460 60446 71409 91633 91662 91765 94865 95293 109130 96398 90225
8109 90225 89534 68541 58083 56366 51759 58239 65435 74390 89036 98105 93633 86863 74410 58261
8095 58261 63546 68545 66928 75983 85337 82140 76468 71851 97218 102630 88274 78962 75136 90980
8081 90980 102341 124041 136773 124375 104787 92697 88875 109136 115881 114904 133638 145754 157210
8068 157210 179340 192828 198276 210205 192740 164114 145203 137521 138687 135273 131086 119061 106947
8055 106947 100466 101949 108078 114960 118522 116362 124069 129961 133802 138209 131282 130780 127293 115333
8041 115333 107571 116329 131629 127155 133263 142579 172259 184038 183485 176472 163080 160130 171984
8028A71984Q444Q395J897J6252J7693m658o143K485l261K355R166M786r757j4013
8014B05625j4046Q81Q461m071P32n54P149o032m15q187R350L954q893j0164j3984
7999A69806k413l109J3859R313P403j246J0783J3628j0018N58R009K395j2434
7986B07534J1129J4261r926J229J3466o6J851j924J1163P56J1357J8592L477L505
7972B86404P229M383J0748K5498K4310K3594K7064P427j1412j8635k3626l1241
7960C31743j5339r199j1278k9406j0788j2374j4431j3627p407p758k687M43j1502
7947A86390l35q184j0779J2423K1604K0322J1959m872N470j577p17m845P395N041
7933B39295o050O505M61J81O291N734J1016J3927J2616J0155J0890J106q547j0433
$$ plain form
8028 171984 180428 188823 190720 206972 224665 220007 213864 216349 213088 215443 224609 229395 219638 205625
8014 205625 191579 192460 200921 196850 197582 197028 204177 198145 197730 189543 198893 202847 193954 183790 169806
7999 169806 167393 164284 178143 187456 194859 193613 204396 218024 208006 208564 217573 219968 207534
7986 207534 218663 232924 222998 224227 237693 237627 239478 237554 248717 249473 260830 279422 282899 286404
7972 286404 293633 298016 308764 334262 358572 382166 409230 416657 405245 386610 362984 331743
7960 331743 316404 307205 295927 266521 255733 243359 228928 215301 207894 200136 197449 197892 186390
7947 186390 186055 177871 167092 179515 201119 221441 233400 228528 233998 232421 231704 226859 234254 239295
7933 239295 233245 239750 240211 240392 246683 252417 263433 277360 289976 300131 311021 312127 303580 293147
7919B93147j3211j4685k123r926j5918k5827j6915j0514j4791k5423n595L234
7907A41453N84O526m88l298p728l15O29l724p586M360O126p88j5126p685O630
7892A19570M711j35O449O820R025r36j5806k143K980r320J318L099m312J0758
7878A32078P552q945l397q952l080O494Q87l253M96p843j7382l412k514j956p991
7863G8782K963n721j0250M539j664j0786J6889j743j4580j3005m739K3732K727
7850F7144j1837R959J0023n889m014j3812q22O039m428k23o334k792L206L550
7836D9770J1439q52m025Q761Q578n455m057J4712J1054K84j6368O561m335k850
7822G3217r746k655J07o196j4050j1579M886N637O435j4584j3303q823r860J3460
$$ plain form
7919 293147 279936 265251 263128 253202 237284 211457 194542 184028 169237 143814 138219 141453
7907 141453 142037 148563 148075 144777 137049 136734 137363 133639 126053 130413 136539 135751 120625 112940 119570
7892 119570 124281 124146 130595 137415 146440 145504 129698 127555 130535 121215 122533 125632 121320 132078
7878 132078 139630 130685 127288 118336 115256 121750 122637 119384 119880 112037 94655 91243 88729 86773 78782
7863 78782 81745 76024 65774 70313 68649 57863 74752 73009 58429 45424 40685 64417 67144
7850 67144 55307 65266 75289 69400 65386 51574 50752 56791 52363 52140 45806 43014 46220 49770
7836 49770 61209 60357 56332 65093 73671 68216 64159 78871 89925 90209 73841 80402 76067 73217
7822 73217 63471 60816 60923 54727 40677 29098 33984 39621 46056 31472 18169 9346 -514 12946
7808A2946J3747P477q847j1389Q070J8991j42j3123k357K848P282K408p60j1057
7794B6094j3438j390Q667q342L176J693J2391K320p7J1319o533o868n801j1603
7780A1608k524K132O976P623j100j8368m687M755J943O771L135M672m588o09L47
7765A8086K920J0657J048n102R040j069L07N383q36j9362j0009j323j210J5768
7751B4298J7566m951q586J05l921r391j1692p687J4321l229L931l352q082N016
7737D346M533r334k103j639J037M30P862k585L008J5704m252j2123r73N996k434
7722G473m273J662m234j523j0596K465O448J741k949p198L790L806k822K20l18
7707f308N81O287P283J6894j1719O98Q222J625k212j1103N636K836n085m957R564
$$ plain form
7808 12946 26693 34170 25323 13934 22004 40995 40853 27730 25373 28221 35503 37911 37151 26094
7794 26094 12656 11266 19933 11591 14767 16460 28851 31171 31094 42413 35880 29012 23211 11608
7780 11608 9084 11216 18192 25815 24715 6347 1660 6415 8358 15129 18264 22936 18348 17739 18086
7765 18086 21006 31663 32711 27609 36649 35580 35887 41270 40434 21072 11063 9740 8530 24298
7751 24298 41864 36913 28327 28432 24511 15120 3428 -4259 10062 6833 10764 7412 -670 4346
7737 4346 8879 -455 -2558 -4197 -3160 -2730 5132 2547 5555 21259 17007 4884 3911 9907 7473
7722 7473 3200 4862 628 -895 -11491 -9026 -2578 -837 -3786 -10984 -7194 -3388 -6210 -5990 -6308
7707 -6308 -5727 560 7843 24737 13018 13716 21938 23563 21351 10248 15884 18720 13635 8678 18242
7692A8242J6519m29j6197L579O919j9685r930J3527k236J0826L336k708J795j745
7678B1813r46q153q252K677L686J094m864J1796N338j4552l617Q583O274R80m658
7663A7199r517j0560l534L537K96K91k331q49j973L151R074Q466R819j0620j1941
7648E08L797M028j687L201NJ0550J51k813p237k837q998o785J791q18O884N329
7632E069j6148o527J5675K245m738J1703J066Q657l158m533L51K489O607o886
7618A1872o420n093j458P735N76p602k504n64M06M661J062j1303p684P879M954
7603c483j1313K384k060q39J1312J9230J9177J2564r578k3866r873Q434Q42Q933
7589B1864J686p722j0967j0627M525j572J7676R971k1132l404M067k503p88Q05
$$ plain form
7692 18242 34761 34332 18135 21714 28633 8948 -982 12545 10309 21135 24471 21763 23558 21813
7678 21813 20867 12714 4462 7139 10825 11919 7055 18851 24189 9637 6020 14603 20877 21857 17199
7663 17199 7682 -2878 -6412 -2875 -2579 -2288 -4619 -5468 -7441 -4290 4784 13250 23069 12449 508
7648 508 4305 8333 6646 9847 9852 20402 20553 17740 10503 7666 -1332 -8117 -6326 -7144 -260 5069
7632 5069 -11079 -17606 -1931 314 -4424 7279 8345 17002 13844 9311 9662 12151 18758 11872
7618 11872 5452 359 -1099 6636 7212 -390 -2894 -3458 -3052 1609 2671 -8632 -16316 -8437 -3483
7603 -3483 -14796 -12412 -14472 -15311 -3999 15231 34408 46972 37394 13528 3655 12089 12931 21864
7589 21864 23550 15828 4861 -5766 -1241 -2813 14863 24834 3702 298 4365 1862 1074 1879
7575A879m502J499M763J0717J855j077j052p751m072j1748J0467J81j2955O995
7561d801O553K801k72o321J777J5791j153j4351K964M044j399j920m800R80r65
7546a072j429j303J9151N349p304O300L396n802M783k13j399L118L141j3438j8341
7531e063r004k38J6072O039M611J6440j4753j3517K176O034L596J166q324o46
7517D589R377J2967M738j62j5782j2259J138O127R712Q888j5157j5487J0876K45
7503I810N216N567m44J321m696j7114k694L524O260k78J0576k63p123r788K538
7488B412P89J1346Q670r166r427p140j125N457J293P012j7293o488R504J5978
7474A1822j239j1155K769m001q038P511J692m561K885M837J3792j013r030q117
$$ plain form
7575 1879 -2623 -1124 3639 14356 16211 15134 14082 6331 2259 -9489 978 1159 -11796 -4801
7561 -4801 1752 4553 4281 -2040 -263 15528 14375 24 2988 7032 5633 3713 -1087 -107 -1072
7546 -1072 -2501 -3804 15347 20696 13392 19692 23088 17286 22069 21856 20457 23575 26716 13278 -5063
7531 -5063 -14067 -14305 1767 7806 12417 28857 14104 587 2763 8797 12393 13559 5235 4589
7517 4589 13966 26933 31671 31509 15727 3468 4606 10733 20445 29333 14176 -1311 9565 9810
7503 9810 15026 20593 20149 21470 16774 -340 -3034 490 6750 6472 17048 16785 9662 -126 2412
7488 2412 3201 14547 23217 14051 4624 -2516 -3641 1816 3109 10121 -7172 -13660 -4156 11822
7474 11822 10583 -572 2197 -1804 -9842 -2331 -639 -5200 -2315 2522 16314 15301 6271 -1846
7460a846L45J442O325k589p968J3758M909j7147n954n755p043k103j141J6115
7446h652M152n535J3783M793M410o74m825r232M726N334k34J1725r829p267j344
7431A331m299n406r658N780J3316M229J3399m304j3579Q64J6196j934j1806q511
7417d382J1739Q638j0142j0212k399l900J1209Q468K676r292q050o645P827J5632
7403A1167o65j3210n510j881K2263J7208j1170o075m416L635J684L736j2886m109
7389b29J1042m66j0317j817O892M559n440m791R422L231J2663m395j0489J422
7375A1287L60q808n203K787L987R479j2332O315Q220K18m374J0715q57m40j15
7360B1239j751j1326o785N078J551M179J1049O642J1762l528j3221p784N026j19
$$ plain form
7460 -1846 -1501 -59 6266 3677 -4291 9467 14376 -2771 -8725 -14480 -21523 -23626 -24767 -8652
7446 -8652 -4500 -10035 3748 8541 12951 12277 7452 -1780 2946 8280 8046 19771 9942 2675 1331
7431 1331 -2968 -8374 -18032 -12252 1064 5293 18692 14388 809 1673 17869 15935 4129 -4382
7417 -4382 7357 15995 5853 -4359 -6758 -10658 551 9019 11695 2403 -5647 -12292 -4465 11167
7403 11167 10502 -2708 -8218 -10099 12164 29372 18202 12127 7711 11346 13030 16766 3880 -229
7389 -229 10813 10347 30 -1787 5105 9664 4224 -567 8855 12086 24749 20354 9865 11287
7375 11287 11647 2839 -2364 423 4410 13889 1557 7872 16092 16310 11936 22651 21794 21354 21239
7360 21239 19488 8162 1377 6455 8006 12185 23234 29876 41638 38110 24889 17105 22131 22012
7346B2012o877J0386n585j1565j3669N11k017M555p013M714P718j1389r214K573
7332a4860R125R294J3263n25p719n44l038j2141m504J4059k534P230K654L8l168
7317F630j2571J307R901j3002q295O627J2206j311P264N029J0255L958L281j0336
7303B0943j6587q085L594n219O236N289o127P75R798O94k132j206J1982o372o697
7288F886M797M611L673p214M285l12m766j3898k998K393m455L909n615j0972l130
7273b2806m301r27J1199J2307L037J1709J026L762n771Om908k521K357J2076J1680
7258B7925l003j8186n812N099L55J255K352K962m0q29k663M620L297P78m367j1436
7242B307p123q703o532m591M48j146O239J0950L522k89n884m078J977r437l718
$$ plain form
7346 22012 15135 25521 19936 8371 -5298 -4787 -6804 -2249 -9262 -4548 3170 -8219 -17433 -14860
7332 -14860 -5735 3559 16822 16297 8578 8034 4996 -7145 -11649 2410 -124 7106 9760 9798 6630
7317 6630 -5941 -4634 5267 -7735 -16030 -9403 2803 1492 8756 13785 24040 27998 31279 20943
7303 20943 4356 -3729 -135 -5354 882 6171 44 819 10617 11311 9179 7973 19955 13583 6886
7288 6886 11683 16294 19967 12753 17038 16726 11960 -1938 -4936 -2543 -6998 -3089 -8704 -19676 -22806
7273 -22806 -27107 -28034 -16835 -4528 -1491 10218 11244 15006 9235 9241 4333 1812 4169 16245 27925
7258 27925 24922 6736 924 6023 6378 7633 9985 12947 12907 12078 9415 14035 17332 18110 13743 2307
7242 2307 -4816 -13519 -20051 -24642 -24194 -25340 -19101 -8151 -4629 -4918 -10802 -14880 -12903 -22340 -26058
7227b6058L32J2875J0199J959J0078Q384l87j230j3316q152j460k208Q281l412
7213d115k71o123j5966P04M073J2688N147Q080M72l185p704J410K47L093j0735
7198a2185m578J2095m72k630J579j793o479P89M403L828J4764J953j3642r493
7184a1861J6336J865K063k074K453n57n52l990J2199Q932j1984p754J0018l466
7170A1628j4144q686L716J472M48J747J934p513o156l700J2809J3448j1648q151
7156a2796j385j121R74P039O595m758P435j248j482N583l750K864J0842J055m196
7141A1651o827O299O15l957l463n341J950O458J116r626m428o74M501L026k288
7126i88j0215n605p384P915K6707J5684j8006j587J3704J279j5553K703k665j0052
$$ plain form
7227 -26058 -25726 -12851 -2652 -693 9385 17769 17382 16152 2836 -5316 -6776 -8984 -703 -4115
7213 -4115 -4386 -10509 -26475 -25771 -21698 -9010 -3863 4217 4689 1504 -6200 -4790 -4543 -1450 -12185
7198 -12185 -16763 -4668 -5140 -7770 -6191 -7984 -14463 -13674 -9271 -5443 9321 11274 -2368 -11861
7184 -11861 4475 6340 8403 6329 8782 8225 7673 3683 15882 24814 12830 5076 15094 11628
7170 11628 -2516 -11202 -7486 -6014 -5566 -3819 -1885 -9398 -15554 -19254 -6445 7003 -4645 -12796
7156 -12796 -14181 -15302 -14328 -7289 -694 -5452 1983 735 -747 4836 1086 3950 14792 15847 11651
7141 11651 4824 11123 11738 7781 4318 -1023 927 7385 8501 -1125 -5553 -6227 -1726 1300 -988
7126 -988 -11203 -16808 -24192 -16277 10430 26114 8108 6521 20225 21504 5951 8654 5989 -4063
7112d063M262L646q550Q77m06K131Q572p262Q163o605r274m35P164Q254j351j2489
7096g366k738n187n558k217O390P600J421r647L88P524m901j7540K303J5551J0112
7081c865M858j4701K07P075o976j9787R11J1158K954K371J0674n15J600m802p376
7066a6214Q600N235K154J5039O49n007Q742L253q417j8466k925O078j535q176
7052a0990L303k739J458L382L260k544j1000m346J871m240K524O949m8L65M305
7037h490j027R134O407L220o210n770m1J46k950J301r326K361o94j831J203O220
7021f347K616l785l705P941N990R222j6272J549r13r347p2K901j4631k495M493
7006b2855l065J3882J1434j4823j2432K469R468J1803P269J281Q797P280Q59j0316
$$ plain form
7112 -4063 199 3845 -4705 -3828 -4234 -2103 6469 -793 7370 765 -8509 -8944 -1780 6474 5123 -7366
7096 -7366 -10104 -15291 -20849 -23066 -16676 -9076 -7655 -17302 -16914 -9390 -14291 -31831 -29528 -13977 -3865
7081 -3865 993 -13708 -13501 -6426 -13402 -33189 -32278 -21120 -18166 -15795 -5121 -5636 -4036 -8838 -16214
7066 -16214 -7614 -2379 -225 14814 15463 10456 19198 22451 14034 -4432 -7357 -1279 -2814 -10990
7052 -10990 -7687 -10426 -8968 -5586 -2326 -4870 -15870 -20216 -18345 -22585 -20061 -13112 -13160 -12795 -8490
7037 -8490 -9517 -383 6024 9244 3034 -2736 -2777 -2631 -5581 -4280 -13606 -11245 -11939 -13770 -12567 -6347
7021 -6347 -3731 -7516 -11221 -3280 2710 11932 -4340 -2791 -3704 -13051 -13123 -10222 -24853 -27348 -22855
7006 -22855 -25920 -12038 -604 -15427 -27859 -25390 -15922 -4119 3150 4431 13228 20508 21367 11051
6992A1051r936L302M622P61l869j0785j3210L358N977M491J3614o120j98J307
6978D365N131n657L606M125J963n161r217J332J361j2445r366L820p444Q407R223
6963e957O853M127N267m957m218K871k66l668M118l634m109J6301M911l207n323
6948I109j5765k859n990j3064J007J4099J2615J1617J088r963j1753k749l977
6935a6585J0288O686p859q098j2592J4134J2336Q442j288M515J352k051p174n10
6921A596Q65j15J0075k801j3170l40J488n730m897k990J181J5588Q93o38n79L492
6905C918J993j2978j7030K443j392M793J551P734r51m36j6003j0447O450J7106
6891a3249J1285P894j460j533K908j6587o015J620P359P242L185r054L450M317
$$ plain form
6992 11051 1115 4417 9039 9800 5931 -4854 -18064 -14706 -8729 -4238 9376 3256 3058 4365
6978 4365 9496 3839 7445 11570 13533 8372 -845 487 1848 -10597 -19963 -16143 -23587 -15180 -5957
6963 -5957 896 5023 10290 5333 1115 3986 3720 52 4170 536 -3573 12728 17639 14432 9109
6948 9109 -6656 -9515 -15505 -28569 -27562 -13463 -848 10769 11857 1894 -9859 -12608 -16585
6935 -16585 -6297 389 -7470 -15568 -28160 -14026 -1690 6752 5464 9979 11331 9280 2106 1596
6921 1596 2461 2346 12421 9620 -3550 -3890 -2402 -8132 -13029 -16019 -14838 750 1643 1005 426 3918
6905 3918 5911 -7067 -24097 -21654 -23046 -18253 -16702 -8968 -9919 -10355 -26358 -36805 -30355 -13249
6891 -13249 -1964 5930 4470 2937 5845 -10742 -16757 -15137 -7778 -536 2649 -6405 -2955 1362
6877A362l070p458J0469L716o929k0070j373R389R660q316j4133m69R805J1679
6863e738R92q54k303M572l674p846k26J2548M169M803K627k923k5518q910J5613
6848a2668J3003R88m788R41k115m688o797N70o065q723K110J0173j745O012k683
6833a6475o57J3129J5803N410j3213k307P62m434n309K829j3015n222K25J1214
6819a1260j687r042O699K912n137O119L312l106j558r435K301o722p631M439K2608
6804g188J1435O087K152j675m832j0975j462M386l005M779J3882J8297M857K202
6790C8940q046j9892L738P799j6387m379M065n626j4673q0o791J1176N909N468
6776A221M598J393O821N01m131K776L963n506j0195n839K133r980Q89J2023l32
$$ plain form
6877 1362 -1708 -9166 1303 5019 -1910 -21980 -23353 -13964 -4304 -12620 -26753 -27222 -17417 -5738
6863 -5738 -4746 -5600 -7903 -3331 -7005 -14851 -15077 -2529 1640 6443 9070 6147 -19371 -28281 -12668
6848 -12668 335 1323 -3465 -2524 -4639 -9327 -16124 -15554 -21619 -30342 -28232 -18059 -19804 -13792 -16475
6833 -16475 -17132 -4003 11800 17210 3997 1690 2452 -1982 -7291 -4462 -17477 -22699 -22474 -11260
6819 -11260 -12947 -21989 -15290 -12378 -17515 -11396 -8084 -11190 -12748 -22183 -19882 -26604 -34235 -29796 -7188
6804 -7188 4247 10334 12486 10811 5979 -4996 -6458 -2072 -5077 -298 13584 31881 36738 38940
6790 38940 30894 11002 14740 22539 6152 1773 5838 212 -14461 -14541 -21332 -10156 -4247 1221
6776 1221 5819 7212 14033 14534 10403 13179 17142 11636 1441 -4398 -2265 -12245 -11356 667 335
6761C35K950k738o340n49l837k67M730M439q694j3147P491O164p210Q372j1251
6746a9552R449J0625j0617p234o38J1041K204N796Q52P407J9707O107q65j775
6732C2507K465p8J846J8868P867q765j0360o526m909O559J8140J9348J2467J0632
6718A00061m068j1668j4067o084Q240K5386J8357K5515R957J2767N5300O9540
6706B89236L3864k2758n8586m9657l8838l9828k6759j8203j8307j7007q185j2281
6694A2691R595M415n674r106n131J2453J094M463k344j2922k4880O713J6982K311
6680A0660q227L115r88j5666j2129M381J0823N246J4791R25j123m108J842p033
6666B509j1932n149J279J1807l448o759l969k294J211L349j331M216L698J460
$$ plain form
6761 335 3285 547 -5793 -6342 -10179 -10446 -5716 -1277 -9971 -23118 -15627 -9463 -16673 -8301 -19552
6746 -19552 -10103 522 -10095 -17329 -17967 -6926 -4722 1074 1926 9333 29040 35147 34282 32507
6732 32507 34972 34894 36740 55608 63475 54710 44350 37824 32915 39474 57614 76962 89429 100061
6718 100061 95993 84325 70258 64174 72414 97800 116157 141672 151629 164396 219696 289236
6706 289236 323100 300342 241756 192099 153261 113433 86674 68471 50164 33157 24972 12691
6694 12691 22286 26701 21027 11921 6790 19243 20337 24800 22456 9534 -15346 -8633 8349 10660
6680 10660 2433 5548 4560 -11106 -23235 -18854 -8031 -2785 12006 12931 11808 7700 9542 2509
6666 2509 -9423 -14572 -13293 -1486 -4934 -11693 -15662 -17956 -16745 -13396 -14727 -10511 -6813 -5353
6652e353P0j495R90L12Q772j1102m695L447j7j535N985M231n797k546o685j85
6636a5603l029j801R921L141N972M01j3922j904J865O641K617k080o731K850Q684
6621b978R502J0016o532j938l258n578j0680k505J0029J2247Q239J407o183j3204
6607a416j3370J931J4524J380l403j7675j7737M940K657J2750R751k283K274L179
6593b498j186L922O380M116L340j2618j1324o982l665m483M477Q507J3209N756
6579F951M430j273o720q150M278J918l83q441m308J0878K720r937N568J568p481
6564h382m23J9114o4q197l585P665Q959q036j0902j1377J0386Q941N527L453q314
6549D765o286M163m904n576O759L74j85j921n12n872l432m772m716l8J1919M712
$$ plain form
6652 -5353 -5283 -6778 -5788 -5476 3296 -7806 -12501 -9054 -9071 -10606 -4621 -390 -6187 -8733 -15418 -15603
6636 -15603 -18632 -20433 -10512 -7371 -1399 -998 -14920 -16824 -14959 -8318 -5701 -7781 -14512 -11662 -2978
6621 -2978 6524 16540 10008 8070 4812 -766 -11446 -13951 -3922 8325 16564 17971 11788 -1416
6607 -1416 -14786 -12855 1669 3049 -354 -18029 -35766 -30826 -28169 -15419 -5668 -7951 -5677 -2498
6593 -2498 -3684 238 6618 10734 14074 1456 -9868 -16850 -20515 -24998 -20521 -12014 1195 6951
6579 6951 11381 10108 3388 -4762 -484 1434 1051 -7390 -11698 -820 1900 -8037 -2469 -901 -8382
6564 -8382 -8805 10309 10245 2048 -1537 6128 15087 7051 -3851 -15228 -4842 4099 9626 13079 4765
6549 4765 -1521 2642 -2262 -7838 -1079 -705 -890 -2811 -3323 -9195 -12627 -17399 -22115 -22153 -10234 -5522
6533e522j2372P83o90O744O243j0083l822J1709L279k765N322J0808m202j1010
6519e578j43m898k857J461N049r731N653J1358j013n225j002O243j905r550q043
6504b0181q80J1972j827l037P151j3242o557J4857N793n281K607q747j1243P178
6490b1437Q176M834J2700m675o051n493J28Q762m575p455K890p84Q004L827q590
6475i739N82P221n174n791p171K944l560J1213Q190M737L015l174j2223j1777
6461b0707j4754l273L45N917K634R311R918M535M387N749o159M088p30j243n029
6446e011n225J180K710M225O858R610o768j5028m517Q146n148N571k995q20J116
6431f096p881r306m472j272Q96Q326j71J62M872N055Q676m603J1358J0251j3601
$$ plain form
6533 -5522 -17894 -17111 -17801 -11057 -4814 -14897 -18719 -7010 -3731 -6496 -1174 9634 5432 -5578
6519 -5578 -5721 -10619 -13476 -12015 -6966 -16697 -11044 314 -699 -5924 -6926 -683 -2588 -12138 -20181
6504 -20181 -21061 -9089 -10916 -13953 -6802 -20044 -26601 -11744 -5951 -11232 -8625 -17372 -28615 -21437
6490 -21437 -13261 -8427 4273 -402 -6453 -11946 -11818 -3056 -7631 -15086 -12196 -12980 -4976 -1149 -9739
6475 -9739 -9157 -1936 -7110 -12901 -20072 -17128 -20688 -9475 -1285 3452 6467 3293 -8930 -20707
6461 -20707 -35461 -38734 -38389 -32472 -29838 -20527 -10609 -6074 -1687 4062 -2097 1991 1261 18 -5011
6446 -5011 -10236 -9056 -6346 -2121 4737 14347 7579 -7449 -11966 -3820 -8968 -3397 -6392 -7212 -6096
6431 -6096 -13977 -23283 -27755 -29027 -28131 -19805 -19976 -19814 -14942 -9887 -1211 -5814 5544 15795 2194
6416B194M723J65J7147j106m916m147l089l979K882l855l479o526j349L453m211
6401f093m749L737J814o125R901J0566k515j1051n297n7M008k600J924p286K678
6386a1145J2893P95j1177q619j276m183J2482J3104J6216j4711j2111J0601m452
$$ plain form
6416 2194 6917 7082 24229 23123 18207 14060 10971 6992 9874 6019 2540 -3986 -5335 -1882 -6093
6401 -6093 -10842 -7105 -5291 -11416 -1515 9051 6536 -4515 -9812 -9869 -5861 -8461 -6537 -13823 -11145
6386 -11145 1748 2543 -8634 -17253 -18529 -22712 -10230 2874 19090 4379 -7732 2869 -1583
$$ [...]
##END NTUPLES=NMR SPECTRUM
##END=
