##TITLE=Analysis number 316333
Compound Code cc 45211
Book Reference 382/154/1
Project Code adrs
Chemist Name simons
##JCAMPDX= 6.0         $$ Bruker NMR JCAMP-DX V2.0
##DATA TYPE= NMR SPECTRUM
##DATA CLASS= NTUPLES
##ORIGIN= Bruker BioSpin GmbH
##OWNER= nmr
$$ XWIN-NMR		Version 3.5
$$ Wed Jan 11 12:35:55 2006 GMT Standard Time (UT+0h)  MAYBRIDGE\nmr@NMR_250MHZ
##.OBSERVE FREQUENCY= 250.131544655141
##.OBSERVE NUCLEUS= ^1H
##.ACQUISITION MODE= SIMULTANEOUS (DQD)
##.ACQUISITION SCHEME= undefined
##.AVERAGES= 16
##.DIGITISER RES= 18
##SPECTROMETER/DATA SYSTEM= dpx250
##.PULSE SEQUENCE= zg30
##.SOLVENT NAME= CDCl3
##.SHIFT REFERENCE= (INTERNAL, CDCl3, 0, 16.426)
##AUDIT TRAIL= $$ (NUMBER, WHEN, WHO, WHERE, WHAT)
$$ ##TITLE= Audit trail, XWIN-NMR		Version 3.5
$$ ##JCAMPDX= 5.01
$$ ##ORIGIN= Bruker BioSpin GmbH
$$ ##OWNER= nmr
$$ C:\u/data/dgb/nmr/ADRS/14470/pdata/1/auditp.txt
$$ ##AUDIT TRAIL=  $$ (NUMBER, WHEN, WHO, WHERE, WHAT)
(   1,<2006-01-11 12:35:33.72 +000>,<MAYBRIDGE\nmr>,<NMR_250MHZ>,
      <created by zg, POWCHK disabled, PULCHK disabled
       configuration hash MD5:
       62 19 C7 07 E1 42 D1 B7 37 6C 3D D0 77 39 F9 E6
       data hash MD5: 64K
       EF 9E E2 C9 F1 08 1E 4A 2B 4C B5 F0 3B 4D D5 B3>)
(   2,<2006-01-11 12:35:45.93 +000>,<MAYBRIDGE\nmr>,<NMR_250MHZ>,
      <Start of raw data processing
       ef LB = 0.3 FT_mod = 6 PKNL = 1 SI = 32K 
       data hash MD5: 32K
       C0 4B BB F0 E9 85 CA B4 17 B1 B7 55 47 F0 AA 6D>)
(   3,<2006-01-11 12:35:47.87 +000>,<MAYBRIDGE\nmr>,<NMR_250MHZ>,
      <apk 
       data hash MD5: 32K
       90 02 54 BA F1 61 FB 28 41 0E D3 77 EC 04 06 D9>)
(   4,<2006-01-11 12:35:48.61 +000>,<MAYBRIDGE\nmr>,<NMR_250MHZ>,
      <abs ABSG = 5 
       data hash MD5: 32K
       00 D7 B9 E9 D5 AC A2 76 30 6A CF AF 5C 1A C8 0F>)
$$ ##END=
$$ 
$$ hash MD5
$$ D6 EB F7 DA 99 07 CB C3 B6 16 F9 3C 5F 0D 83 5F
##$RELAX= 
##$RELAX= 
##$RELAX= 
##$RELAX= 
##$RELAX= 
##$RELAX= 
##$RELAX= 
$$ Bruker specific parameters
$$ --------------------------
##$DU= <C:\u>
##$EXPNO= 14470
##$NAME= <ADRS>
##$PROCNO= 1
##$TYPE= <nmr>
##$USER= <dgb>
##$AMP= (0..31)
100 100 100 100 100 100 100 100 100 100 100 100 100 100 100 100 100 100 
100 100 100 100 100 100 100 100 100 100 100 100 100 100 
##$AQSEQ= 0
##$AQ_mod= 3
##$AUNM= <au_zg>
##$AUTOPOS= <25 >
##$BF1= 250.13
##$BF2= 250.13
##$BF3= 250.13
##$BF4= 250.13
##$BF5= 500.13
##$BF6= 500.13
##$BF7= 500.13
##$BF8= 500.13
##$BYTORDA= 1
##$CFDGTYP= 0
##$CFRGTYP= 5
##$CHEMSTR= <none>
##$CNST= (0..31)
1 1 145 1 1 1 1 1 1 1 1 1 1 1 1 1 1 1 1 1 1 1 1 1 1 1 1 1 1 1 1 1 
##$CPDPRG= <>
##$CPDPRG1= <>
##$CPDPRG2= <>
##$CPDPRG3= <>
##$CPDPRG4= <mlev>
##$CPDPRG5= <mlev>
##$CPDPRG6= <mlev>
##$CPDPRG7= <mlev>
##$CPDPRG8= <mlev>
##$CPDPRGB= <>
##$CPDPRGT= <>
##$D= (0..31)
0 1 0 0 0 0 0 0 0 0.06 0 0 0 0 0 0 0.0002 0 0 0 0 0 0 0 0 0 0 0 0 0 0 
0 
##$DATE= 1136982932
##$DBL= (0..7)
120 120 120 120 120 120 120 120 
##$DBP= (0..7)
150 150 150 150 150 150 150 150 
##$DBP07= 0
##$DBPNAM0= <>
##$DBPNAM1= <>
$$ [...]
##$SUBNAM7= <"">
##$SUBNAM8= <"">
##$SUBNAM9= <"">
##$SW= 20.6930455092707
##$SWIBOX= (0..15)
0 0 3 0 0 0 0 0 0 0 0 0 0 0 0 0 
##$SW_h= 5175.983436853
##$TD= 65536
##$TD0= 1
##$TE= 294.16
##$TE2= 300
##$TE3= 300
##$TEG= 300
##$TL= (0..7)
0 120 120 120 120 120 120 120 
##$TP= (0..7)
150 150 150 150 150 150 150 150 
##$TP07= 0
##$TPNAME0= <>
##$TPNAME1= <>
##$TPNAME2= <>
##$TPNAME3= <>
##$TPNAME4= <>
##$TPNAME5= <>
##$TPNAME6= <>
##$TPNAME7= <>
##$TPOAL= (0..7)
0.5 0.5 0.5 0.5 0.5 0.5 0.5 0.5 
##$TPOFFS= (0..7)
0 0 0 0 0 0 0 0 
##$TUNHIN= 0
##$TUNHOUT= 0
##$TUNXOUT= 0
##$USERA1= <user>
##$USERA2= <user>
##$USERA3= <user>
##$USERA4= <user>
##$USERA5= <user>
##$V9= 5
##$VALIST= <valist>
##$VCLIST= <CCCCCCCCCCCCCCC>
##$VD= 0
##$VDLIST= <DDDDDDDDDDDDDDD>
##$VPLIST= <PPPPPPPPPPPPPPP>
##$VTLIST= <TTTTTTTTTTTTTTT>
##$WBST= 1024
##$WBSW= 4
##$XGAIN= (0..3)
0 0 0 0 
##$XL= 0
##$YL= 0
##$YMAX_a= 392258
##$YMIN_a= -550231
##$ZGOPTNS= <>
##$ZL1= 120
##$ZL2= 120
##$ZL3= 120
##$ZL4= 120
##$ABSF1= 16.42602
##$ABSF2= -4.267151
##$ABSG= 5
##$ABSL= 3
##$ALPHA= 0
##$AQORDER= 0
##$ASSFAC= 0
##$ASSFACI= 0
##$ASSFACX= 0
##$ASSWID= 0
##$AUNMP= <proc_1d>
##$AZFE= 0.1
##$AZFW= 0.1
##$BCFW= 0
##$BC_mod= 0
##$BYTORDP= 0
##$COROFFS= 0
##$CY= 12.5
##$DATMOD= 1
##$DC= 0
##$DFILT= <>
##$DTYPP= 0
##$F1P= 14.0000005364418
##$F2P= -0.99999901652339
##$FCOR= 0.5
##$FTSIZE= 32768
##$FT_mod= 6
##$GAMMA= 0
##$GB= 0
##$INTBC= 1
##$INTSCL= 1
##$ISEN= 128
##$LB= 0.3
##$LEV0= 0
##$LPBIN= 0
##$MAXI= 10000
##$MC2= 0
##$MEAN= 0
##$ME_mod= 0
##$MI= 0
##$NCOEF= 0
##$NC_proc= -4
##$NLEV= 6
##$NOISF1= 0
##$NOISF2= 0
##$NSP= 0
##$NTH_PI= 0
##$NZP= 0
##$OFFSET= 16.42602
##$PC= 1
##$PHC0= -68.99397
##$PHC1= 5.918102
##$PH_mod= 1
##$PKNL= yes
##$PPARMOD= 0
##$PSCAL= 4
##$PSIGN= 0
##$REVERSE= no
##$SF= 250.130024006644
##$SI= 32768
##$SIGF1= 0
##$SIGF2= 0
##$SINO= 400
##$SIOLD= 32768
##$SREGLST= <1H.CDCl3>
##$SSB= 0
##$STSI= 32768
##$STSR= 0
##$SW_p= 5175.98343685301
##$SYMM= 0
##$S_DEV= 0
##$TDeff= 65536
##$TDoff= 0
##$TI= <Analysis number 999999
Compound Code 99
Book Reference 9
Project Code 9>
##$TILT= no
##$TM1= 0
##$TM2= 0
##$TOPLEV= 0
##$USERP1= <user>
##$USERP2= <user>
##$USERP3= <user>
##$USERP4= <user>
##$USERP5= <user>
##$WDW= 1
##$XDIM= 32768
##$YMAX_p= 329009526
##$YMIN_p= -53103
$$ End of Bruker specific parameters
$$ ---------------------------------
##NTUPLES= NMR SPECTRUM
##VAR_NAME=  FREQUENCY,     SPECTRUM/REAL,   SPECTRUM/IMAG
##SYMBOL=    X,             R,               I
##VAR_TYPE=  INDEPENDENT,   DEPENDENT,       DEPENDENT
##VAR_FORM=  AFFN,          ASDF,            ASDF
##VAR_DIM=   32768,         32768,           32768
##UNITS=     HZ,            ARBITRARY UNITS, ARBITRARY UNITS
##FACTOR=    0.157963299565203, 1,           1
##FIRST=     4108.6406940353, 0,             0
##LAST=      -1067.34274281771, 0,           0
##MIN=       -1067.34274281771, -53103,      0
##MAX=       4108.6406940353, 329009526,     0
$$ Real data points
##PAGE= N=1
##DATA TABLE= (X++(R..R)), XYDATA
$$ [...]
18190A741592J58370J78885J99858K37422K69312L19832L75510M48446N62085
18181D491312O95474Q84270J223691J822463K715195L477723L283822K951147
18173B1545097L677751M550728L043252J374378J565383K109792K199505K935562
18165D3001448L576664J749735j08208J52783m24858k122164k649996k435323
18157D0740081k497580k018198q68698j436151l661329m350335l800821l215009
18149A8891960l273352l105467k480207j637927j015900o51761m61434l23470
18141E942442j92286o0226R6961K76255M28100M48127L84668L82787N30163Q23013
18131I060004J272840J994719L070448M241638M477175L915615M416508N892123
$$ plain form
18190 1741592 1899962 2078847 2278705 2516127 2785439 3105271 3480781 3929227 4491312
18181 4491312 5186786 6071056 7294747 9117210 11832405 15310128 18593950 21545097
18173 21545097 25222848 29773576 32816828 34191206 35756589 37866381 40065886 43001448
18165 43001448 46578112 48327847 48219639 48372422 47947564 45825400 43175404 40740081
18157 40740081 38242501 36224303 35355605 33919454 30258125 25907790 22106969 18891960
18149 18891960 15618608 12513141 10032934 8395007 7379107 6727346 6265912 5942442
18141 5942442 5750156 5689930 5786891 6063146 6491246 6939373 7324041 7706828 8236991 9060004
18131 9060004 10332844 12327563 15398011 19639649 24116824 28032439 32448947 38341070
18123C8341070N090690K215861J590382K338009K767141L387974M483777L359894
18115F3574798Q84862J107495J591948j5445q6742J992942m07016n926532o576356
18106E6139954n782671o013629n957072n017331l912394l978979m364192m163284
18098A6950402l558247k728792k051145j525502j102388p70223n41219m18224
18090D254662l32078k41732j64918j10493Q941J27896K21877K16840O8495j68012
18080C881478l77761m39127l67796k48360j36388l1015N2721J45397K78124M82995
18070C240268P70621J172412J613652J806451J444571O52692j67557n73863n41024
18061I418223l78839m07787n82615p39741p54816p25593o63250o27210o28429
$$ plain form
18123 38341070 43431760 45647621 47238003 49576012 52343153 55731127 60214904 63574798
18115 63574798 64459660 65567155 67159103 67143658 67056916 69049858 68642842 62716310 56139954
18106 56139954 50357283 44343654 38386582 33369251 29456857 25477878 21113686 16950402
18098 16950402 13392155 10663363 8612218 7086716 5984328 5214105 4672886 4254662
18090 4254662 3922584 3680852 3515934 3405441 3414382 3542278 3764155 3980995 4049490 3881478
18080 3881478 3503717 3064590 2696794 2448434 2312046 2281031 2333752 2479149 2757273 3240268
18070 3240268 4010889 5183301 6796953 8603404 10047975 10700667 10533110 9959247 9418223
18061 9418223 9039384 8631597 8048982 7309241 6554425 5828832 5165582 4538372 3909943
18052C909943n92976n10918l73060k37153j29410j16977j19397j13714j12869
18043A603469j16841j26185j24281j04977p8898n0570k8658j8369k0011k0537
18033I14142l6793m7749l1565l3639k2701j115J3697K1627K5166L2578M0676L8455
18021I12779N2894O2267Q6051J12853J35732J76680K27343K40830K49931L07410
18011B564770M24984M91975M62342N66251P57531Q72678R08493J163833J476960
18002I689817J302221R28755R56860J211915P10022o6554l34198p6265L7795m06114
17992A3954254j036701j193332r36981j055902j455104j467205j192215r29177
17984D687637p79511o30483l94693j67241r5242r8813m8534O441m0136j16001
$$ plain form
18052 3909943 3316967 2806049 2432989 2195836 2066426 1949449 1830052 1716338 1603469
18043 1603469 1486628 1360443 1236162 1131185 1052287 1001717 973059 954690 934679 914142
18033 914142 877349 829600 798035 764396 741695 740580 754277 775904 801070 833648 874324 912779
18021 912779 965673 1027940 1113991 1226844 1362576 1539256 1766599 2007429 2257360 2564770
18011 2564770 2989754 3481729 3944071 4510322 5267853 6140531 7049024 8212857 9689817
18002 9689817 10992038 11920793 12877653 14089568 14799590 14733036 14398838 14322573 14360368 13954254
17992 13954254 12917553 11724221 10787240 9731338 8276234 6809029 5616814 4687637
17984 4687637 3908126 3277643 2882950 2715709 2620467 2521654 2473120 2479561 2439425 2323424
17974B323424j51068j02720o1389k7934L1084P2969J22705K10611L15436L33030
17964C066148L02468L33154L20752K92403L58684M54710L28347K34104M70633
17955F161403P51233O44710L46085K74154L05401J75413j67967m29755m60544
17946G600133k71762j51964l73523o11041o09822n02362n55529o92861o95700
17937C135569n73400m29022l59064l06742k18055j26119n2243J681L2479N8623
17927A163707Q2719Q5701L5489P952k1396p3813q7393q8412o4162m2488l2858
17916I65046k7825O573N4757M3790j4403J0275N6457N0506N3300J01175J42202
17905A441853J51466J36537J05034l2699j25577j17423j04703j46841j35978j18912
$$ plain form
17974 2323424 2172356 2069636 2008247 1980313 2011397 2084366 2207071 2417682 2733118 3066148
17964 3066148 3368616 3701770 4022522 4314925 4673609 5128319 5456666 5690770 6161403
17955 6161403 6912636 7557346 7903431 8177585 8482986 8658399 8490432 8060677 7600133
17946 7600133 7328371 7176407 6802884 6191843 5582021 5079659 4524130 3831269 3135569
17937 3135569 2562169 2133147 1774083 1467341 1249286 1123167 1070924 1072605 1105084 1163707
17927 1163707 1246426 1332127 1367616 1375568 1354172 1280359 1192966 1104554 1040392 997904 965046
17916 965046 937221 943794 998551 1042341 1027938 1038213 1094670 1145176 1198476 1299651 1441853
17905 1441853 1593319 1729856 1834890 1802191 1676614 1559191 1454488 1307647 1171669 1052757
17895A052757r1062o0163l2167l8832l1589j4453q438l1698m0937l8456k6427
17884F38535k7644j1213p748K026J089N237J3153J1124J466j2545k1008j2062
17872E80410j2416j2619l692j4260k3781k5974q432q404p307j0600j1574P718
17860D49069K3286J6780J2513J4527M944K939j0481k1771k8731l0104k4074j0408
17848C98489o638o59j038O45K1938K7294K5065K1125J4458J3192J6867L3405N0775
17835F14918Q0407J02206J09801P3909L8174n295m9141m9868l8940l670M2770
17824I15271R2470J25027J21784J09875P5369N2638N4021P2212J20370J67734
17814A906771K07242K44817K79057L35676M10601N09786O43543P99448J021485
$$ plain form
17895 1052757 961695 901532 869365 830533 798944 784491 776053 744355 703418 664962 638535
17884 638535 610891 599678 591930 593956 595045 600282 613435 624559 626025 613480 592472 580410
17872 580410 567994 555375 551683 537423 513642 487668 479236 470832 463525 452925 441351 449069
17860 449069 472355 489135 501648 516175 521119 524058 513577 491806 463075 432971 408897 398489
17848 398489 391851 391192 390154 390799 412737 440031 465096 486221 500679 513871 530738 564143 614918
17835 614918 695325 797531 907332 981241 1019415 1014120 964979 915111 876171 872501 915271
17824 915271 1007741 1132768 1254552 1364427 1439796 1492434 1546455 1618667 1739037 1906771
17814 1906771 2114013 2358830 2637887 2973563 3384164 3893950 4537493 5336941 6358426
17805F358426J336910J821936K599122L903771O119691R454524J2879017J4349854
17797E8823251J1187796M956946k745515j0330292j4108037j3983516j0872535
17790B2928098p250591m453051k721979j722054j134328p56595n16522l88111
17782C984867l24875l09038k93143k46332j67995p1213L6305J36164K00811K14441
17772C159992J72062R8174L2544p369K4707R9925J90385K95996L86135M71322
17762D923873N51029O48442P85848R83362J262550J665820K255777L135535M546117
17753B0758353O898258J0774401J6057759K0974480K2067936J6964208O862968
17746A21358363n394964j6454825k2381735k2148584j7642739j2040536p553614
$$ plain form
17805 6358426 7695336 9517272 12116394 16020165 22139856 31594380 44473397 58823251
17797 58823251 70011047 74967993 72222478 61892186 47784149 33800633 22928098
17790 22928098 15677507 11224456 8502477 6780423 5646095 4889500 4372978 3984867
17782 3984867 3659992 3350954 3057811 2811479 2643484 2572271 2608576 2744740 2945551 3159992
17772 3159992 3332054 3430228 3462772 3455403 3480110 3580035 3770420 4066416 4452551 4923873
17762 4923873 5474902 6123344 6909192 7892554 9155104 10820924 13076701 16212236 20758353
17753 20758353 27656611 38431012 54488771 75463251 97531187 114495395 121358363
17746 121358363 115963399 99508574 77126839 54978255 37335516 25294980 17741366
17739A7741366m665436k993462k004242j395378j001671p54909n93878m92306
17731C840084m06389l17502k36636j41692l6717N2120J16554J19419R1338L6451
17721C117030m7358j01757j00959m0019N7211J49637K40205K82123K76990K48485
17711D081588K36376K50101L43376N39463Q23340J262167J915729K943941M661890
17702A7057971P128736R434382R993018P089810K447197l267939q263610j0300311
17694C1319254r636193p184895m678405k859153j766864j158524p93094n60063
17686B682063m06279k98300k35045k00332j64203j37723r7364o2741l2111N610
17676A053575L0240L4916L0595K0403k7802n3066m0376k0260K2209O7923J06803
$$ plain form
17739 17741366 13075930 10082468 8078226 6682848 5681177 4926268 4332390 3840084
17731 3840084 3433695 3116193 2879557 2737865 2701148 2753268 2869822 2989241 3080579 3117030
17721 3117030 3069672 2967915 2866956 2826937 2884148 3033785 3273990 3556113 3833103 4081588
17711 4081588 4317964 4568065 4911441 5450904 6274244 7536411 9452140 12396081 17057971
17702 17057971 24186707 33621089 43614107 50703917 53151114 49883175 41619565 31319254
17694 31319254 21683061 14498166 9819761 6960608 5193744 4035220 3242126 2682063
17686 2682063 2275784 1977484 1742439 1542107 1377904 1240181 1142817 1080076 1047965 1053575
17676 1053575 1083815 1118731 1149326 1169729 1141927 1088861 1048485 1028225 1050434 1118357 1225160
17665A225160J11030P0832p487p9463j27635j51991j34595r4691n9992l8799j7080
17654F95289j125o45J3003M437R999K2690O665j9421k8523l5262l3216k6915k7071
17641E79905k0099j2212r834j5878l2999l8358l6559m5194l3324k7792k6678k8836
17629B52142j4217L003M638j2876l013M294R728J7710J1581P829J8846L3307L4848
17616C67820L5478K0619N375k844j6411k0983k0260j4005p549J081J282l821m75
17603C45307Q735J3652Q475R756l902j9123k2084j6208k4618k1403j7437q531
17591B52619O779n374j5549m700n372k0718k3973j8685j9638J178J004n077j1503
17578A30991j7227j0247j1238l033L907J0332J4819o04m605o728n605k356j892
$$ plain form
17665 1225160 1336190 1407022 1399535 1320072 1192437 1040446 905851 811160 751168 712369 695289
17654 695289 694164 693519 706522 710959 720958 743648 750313 730892 702369 667107 633891 606976 579905
17641 579905 559806 547594 537760 521882 488883 450525 413966 368772 335448 307656 280978 252142
17629 252142 237925 240928 245566 232690 229677 233971 243699 261409 272990 280819 299665 332972 367820
17616 367820 403298 423917 429292 426448 410037 389054 368794 354789 347240 348321 349603 345782 345307
17603 345307 354042 367694 376169 385925 382023 362900 340816 324608 299990 278587 261150 252619
17591 252619 259398 254024 238475 233775 228403 207685 183712 165027 145389 146567 147571 142494 130991
17578 130991 113764 103517 92279 89246 93153 103485 118304 117700 113095 106367 100762 98406 96514
17565I6514N521J9605J4234m6j0580n345J028l472n238N268J3386J0890R140R5
17551A51000k985M858k848r776j1221j2166p174m035M905M28o798m157J853k416
17537I9468n116J871R168L629l771K763l659q737j249k709p278j454K442m963
17523H0405N094M617N262L231r56J317Q245M962k697J238k149J281K062l021J530
17508A10421N379L238O308k120P460P084L454M31k19J885K150m422n315p415R47
17493A29266N211p826q600r207l763j435J218K125O025m231M0r606j5570m069
17479G9578K08L338J230j530J6j624K788j943l467j573M041L588Q37P994N315
17464I8796J029j595l029p455l274L492Q799P469M857q469K730P964L563L145
$$ plain form
17565 96514 102035 121640 135874 135828 125248 119903 120931 117459 112221 117489 130875 141765 150905 151000
17551 151000 148015 152873 150025 140249 129028 116862 109688 105653 110558 110986 104188 100031 101884 99468
17537 99468 94352 96223 105391 109020 105249 108012 104353 95616 94367 91658 84380 82926 85368 80405
17523 80405 85499 90116 95378 98609 97653 98970 107215 112177 109480 110718 108569 109850 111912 108891 110421
17508 110421 115800 119038 125346 123226 130686 137770 141224 141655 141436 143321 145471 141049 135734 128319 129266
17493 129266 134477 126651 118051 108844 105081 103646 104864 106989 113014 108783 108823 99217 83647 79578
17479 79578 79786 83124 84354 82824 82840 81216 84004 82061 78594 77021 81062 84650 85487 93481 98796
17464 98796 99825 98230 95201 87746 84472 87964 96763 104232 109089 100620 103350 111314 114877 118022
17450A18022Q09O313P296J221P950J5324J8267J4208n200j5576k9798k1717r236
17437A07883m192m469k964j3715k064K632k837r841k968l369k11j0846k094p563
17423D3382j674q95J803P657K415O821J1349l947J916nj2334j0564m139K611M734
17408D9130O550M086K541j272J1427k769l210P998N464n023k063l190r793q23
17394E9053N168n144J201j98k245k043l648o630N578J301r885k870K463P366O458
17379E5925l776J44K604N524M234n927K512O894P36k768k794M704p804j2698j5244
17364C2266p22L8n525L197N119M75L948Q160k531j513J777L291K265j656J182
17349D9771p155p034l633M850P118L145m480K649J873J239j1335m144N367J564
$$ plain form
17450 118022 118831 125144 132440 133661 141611 156935 175202 189410 184210 168634 138836 117119 107883
17437 107883 103691 99222 96258 82543 80479 83111 80274 70433 67465 64096 63885 53039 50945 43382
17423 43382 41708 40813 42616 50273 52688 59509 70858 66911 68827 68822 56488 45924 41785 44396 49130
17408 49130 55680 59766 62307 61035 72462 69693 66483 74481 79945 74922 72859 69669 59876 59053
17394 59053 64221 59077 60278 60080 57835 55792 52144 45514 51092 52393 42508 39638 42101 49467 55925
17379 55925 52149 52293 54897 60421 64655 58728 61240 68134 68870 66102 63308 68012 60208 47510 32266
17364 32266 31544 31582 26057 29254 34373 34848 38796 46956 44425 42912 44689 47980 50245 48589 49771
17349 49771 42616 35582 31949 36799 43917 47062 42582 45231 47104 48343 37008 32864 38231 39795
17335C9795l0j530j421k479K791P437O765M486j51m3o111J109k111j694n911m885
17319C6017J050M17m865M351J8924M313n502n286l08R9R0Q454N961p973l085M254
17303E6911J553j53l408k52M135l8l995o95L893J785J6044K0347K1885K8418M1206
17288A87636N9539O0184N2751L1850m289m3037o4253o8425n5539k6351k4929j1036
17276I4101j2770r358j258j713n565K262j0298m335K950m20p482k315j605j79
17262D2015N682K807M697j429K330N464l51j486m750j323P135J2204P023O624
17248H6642J412N208L401Q089J7760K0937L5669M9593P0939J02753J08034R2214
17236F02651N2612o237p1656j03174j10689j01386o7783m3080l8175k5129j9109
$$ plain form
17335 39795 39765 38235 36814 34335 37126 44563 51328 55814 55663 55620 49509 50618 48507 46813 40902 36017
17319 36017 37067 37484 32619 36970 55894 60207 54705 49419 49111 49210 49300 57754 63715 55742 52657 56911
17303 56911 58464 58311 54903 54651 58786 58748 54753 54058 57951 59736 75780 96127 118012 146430 187636
17288 187636 247175 307359 360110 391960 387671 344634 280381 211956 156417 130066 105137 94101
17276 94101 81331 71973 70715 69002 63437 65699 55401 51066 54016 53596 46114 43799 42194 42015
17262 42015 47697 50504 55201 53772 56102 61566 61215 59729 54979 53656 60791 72995 80018 86642
17248 86642 88054 93262 96663 104752 122512 143449 179118 228711 299650 402403 510437 602651
17236 602651 655263 649026 577370 474196 363507 262121 194338 151258 113083 87954 68845
17225F8845j3266N423O126l523m72k717o102r754m934k777P241Q592j007J177
17211E2852n428K998M890J232o070m024N188l962m627Q40J941K921R877M899N6
17196F3583R60Q393P365K0000K5707L5655M8150N1083M2016K2170j1376m2159
17184B71547n3842n3595l2956k4840k3099k1210j0402r368k954m420o782n73m000
17171B3506j882Q952K857p29L83j364L794J3034m776J707O763M561M186n676r084
17156D6232j4482L23N704l387j996O526P417k927k761o941N385N357m201k764
17142C7485M915p062l968J289K404O80M446P128o085n993j774j932M528m174k669
17127B9218J944J37q998k025o96O377J0657N359o984o362j442K064L940N23m817
$$ plain form
17225 68845 55579 61002 67128 63605 63133 60416 54314 44560 39626 36849 44090 52682 51675 52852
17211 52852 47424 50422 55312 56544 50474 46450 51638 47676 43049 43889 45830 48751 58628 63527 63583
17196 63583 64543 72936 80301 100301 126008 161663 209813 260896 302912 325082 313706 271547
17184 271547 217705 164110 131154 106314 83215 62005 51603 42235 39281 34861 28079 27506 23506
17171 23506 21624 30576 33433 32704 33087 31723 35517 48551 43775 45482 52245 56806 60992 55316 46232
17156 46232 31750 32073 37777 34390 32394 38920 46337 43410 40649 33708 39093 44450 40249 37485
17142 37485 42400 35338 31370 32659 35063 35743 40189 47317 41232 35239 33465 31533 36061 31887 29218
17127 29218 31162 31299 22301 20276 19580 25957 36614 41973 34989 28627 27185 29249 33189 33712 28895
17112B8895n734K768J188R470K396k85K35m459r570j98L948R866r85q979l817
17097B4739k386j876K699J0679K249o084k264M53K885J352n459J033J121q19l942
17082B4380J614M352m126n039J557Q702J457k358q034l51K66l893Q048L931o32
17067B9874j894J482l565o264o778J465J658M005K299L835j89j09q738P04L299
17052B1084P25k114k148J435O93j809J131J264M303m243O114J2932L996k212K839
17037D3990p057m550l044j128J395o662o106N694P099L037j830j930j912O333
17023C3329q728j213P095K425p712l621p616k265J2830J3201M836l588o240p409
17009B5324k113J745l781K381R42J0551l98q993m192L479L366Q541J017r353l457
$$ plain form
17112 28895 23161 25929 27117 36587 38983 38698 38933 34474 24904 24706 28654 38520 37535 28556 24739
17097 24739 22353 20477 23176 33855 36104 30020 27756 28209 31094 32446 26987 28020 29141 28322 24380
17082 24380 25994 30346 26220 21181 22738 31440 32897 30539 22505 22154 22420 18527 26575 30506 29874
17067 29874 27980 29462 25897 19633 12855 14320 15978 19983 22282 26117 25928 25819 17081 17785 21084
17052 21084 21809 19695 17547 18982 19675 17866 18997 20261 24564 20321 26435 39367 43363 41151 43990
17037 43990 36933 32383 29339 28211 29606 22944 16838 22532 29631 32668 30838 28908 26996 33329
17023 33329 24601 23388 30483 32908 25196 21575 13959 11694 24524 37725 42561 38973 32733 25324
17009 25324 23211 24956 21175 23556 24498 35049 34651 25658 21466 24945 28311 36852 37869 28516 25059
16994B5059r185o699Q72J122Q043M498l457l271J187r364K229M204j033K68m164
16979A0309l758Q196R232R84J500Q24j1075k47L016Q621L36o204J642J860q124
16964A7112r626k610R557J870K166O008M164O104m226k655l015j697J653m301
16950B0504O406L4135K3127K0636J9920L8820N4446N5742M1264J6540k6422n0890
16938B54228n8245n3236m2343l0436j3840j2306j4019l250L413R830M292L767
16926D7855p305j4197l130k136r736N125N447J885J0575J177k786q879j0426n731
16912G738m449L545O608Q919O168j593j019p521q013j1611o96J522L597k941l063
16897b809L252q780l375P246R269o42P706P070k734L112N504Q79j0708J232N750
$$ plain form
16994 25059 15874 9175 10047 11169 19212 23710 20253 16982 18169 8805 11034 15238 14205 14473 10309
16979 10309 6551 14747 23979 24963 26463 27287 16212 15965 18981 27602 27938 21734 23376 25236 17112
16964 17112 7486 4876 14433 16303 18469 24477 28641 34745 30519 27864 24849 23152 24805 20504
16950 20504 26910 61045 84172 104808 124728 163548 217994 273736 315000 331540 305118 254228
16938 254228 195983 142747 100404 69968 56128 43822 29803 26553 29966 39796 44088 47855
16926 47855 40550 26353 23223 21087 11351 16476 21923 23808 34383 35560 32774 23895 13469 7738
16912 7738 3289 6834 13442 22361 28529 26936 25917 18396 10383 -1228 -1924 -402 3195 254 -2809
16897 -2809 443 -8337 -11712 -4466 4803 4161 11867 18937 16203 19315 24819 25698 14990 16222 21972
16882B1972n492n204N201J0146k001m830n085q464l292n271q291J6761J1664L146
16868B0960K728l670M429J905o242j0239j907L093Q876P397p047n614J303o903
16854I069K654l949q915K902L699p76M640j892J589P024j277o275p847J881O908
16839I435J616M401J282k180o399q397J031L977J0233R344N513L352j1758m643
16825A6807o081j524P9N946K888k822j499j3258j2229l227K899N924M72O418N270
16810F063M670l076M048Q635k974k953n048j327R35J331m90L520K976r30k015
16795A3365J285r50O29K225j2429K328K945J309O137N533l666r020n851K036L060
16780H936Q574k108m576K919k56O184R369j669j0462n107j75l463M409j039K406
$$ plain form
16882 21972 16480 11276 16477 26623 24622 19792 14707 6243 2951 -2320 -10611 6150 17814 20960
16868 20960 23688 20018 24447 26352 20110 9871 7964 11057 19933 27330 20283 14669 15972 9069
16854 9069 11723 7774 -1141 1761 5460 4684 9324 7432 9021 16045 14768 8493 646 2527 9435
16839 9435 11051 15452 16734 14554 8155 -242 789 4766 14999 24343 29856 33208 21450 16807
16825 16807 10726 9202 9281 15227 18115 15293 13794 536 -11693 -14920 -12021 -6097 -5625 793 6063
16810 6063 10733 7657 11705 20340 17366 14413 9365 8038 8973 10304 9814 13334 16310 15380 13365
16795 13365 14650 13700 14329 16554 4125 6453 9398 10707 16844 22377 18711 9691 3840 5876 8936
16780 8936 17510 15402 10826 13745 13489 19673 29042 27373 16911 11804 11629 8166 12575 11536 13942
16765A3942Q112M043l641J648K245l83k369q903L641P203o33p648n847j1748l239
16750c577J4331k739N192K697n079l774L276l406k104L644r40M516l018k848R638
16735A5809J780q129l594M689k391l712K149J794J241O33O161J398q103l259J11
16720F577j335l217K297O430j321l291l919K666L529m259r688k192Q606Q449Q565
16705A7897o325k812m837O508p935p385k048P852Q461M17m10J3046K217o782j0475
16690G389j3502K825R652J929k188M378M874L414l131L560m148n757l17k08O179
16675A4949P632K480o866p475p296J281j580l673O986Q619l361q99M39J200J401
16660A3837o178J165m21k468k750J216L343k967L328j759K513K544N74J4789R77
$$ plain form
16765 13942 22054 26097 22456 24104 26349 25966 23597 14694 18335 25538 24905 17257 11410 -338 -3577
16750 -3577 10754 8015 13207 15904 10825 7051 10327 6921 4817 8461 7521 12037 9019 6171 15809
16735 15809 17589 9460 5866 10555 8164 4452 6601 8395 9636 10269 16430 17828 9725 6466 6577
16720 6577 5242 2025 4322 10752 9431 6140 2221 4887 8416 4157 -5531 -7723 883 9332 17897
16705 17897 11572 8760 3923 10431 2496 -4889 -6937 915 9376 9793 9383 22429 24646 17864 7389
16690 7389 -6113 -3288 6364 8293 6105 10483 15357 18771 15640 19200 15052 9295 8978 8770 14949
16675 14949 22581 25061 18195 10720 3424 4705 3125 -548 6438 15057 11696 10797 11236 12436 13837
16660 13837 7659 8824 8403 5935 3185 4401 7744 4777 8105 6346 8859 11403 11977 26766 27743
16645B7743m017m111q894k190M956K166l898L219l865M359P499J661o148k325
16631A6155m777m476n3R112m579O2j17p91L951m361n035O284J846P507k181p401
16615A1146n021O817J496r64p024q061J799O486Q251O102P2j264j527p772j555
16600H981L181J016P423n353l180l323J244L720p222K858p73k137N477J568Q86
16585A4366p405m191N743j417J966O212N192j483o744r75j1458n036Q85K701J138
16570e06Q840L356l800N806K484p024p023l731o535O180L906n65J842N622P720
16555A6572n045p381m25J471k621k836j709N1K767J399j095p71N440N03l031m516
16539a227P215J5077J456p714n297L02j201l337J492M112o352j452J416l326l946
$$ plain form
16645 27743 23726 19615 10721 8531 13487 15653 11755 14974 11109 15468 22967 24628 18480 16155
16631 16155 11378 6902 6849 15961 11382 11444 11327 10536 14487 10126 5091 11375 13221 20728 18547 11146
16615 11146 6125 12942 14438 13474 6450 -1611 188 6674 14925 21027 21099 19835 18308 10536 8981
16600 8981 12162 13178 20601 15248 12068 8745 9989 13709 6487 9345 8572 6435 11912 13480 14366
16585 14366 6961 2770 8513 7096 9062 15274 20466 18983 12239 11264 -194 -5230 -4345 -1644 -506
16570 -506 8334 11690 7890 13696 16180 9156 2133 -1598 -8133 -1953 1953 1388 3230 8852 16572
16555 16572 11527 4146 3721 5192 2571 -265 -1974 -1923 844 2243 1148 377 5817 6320 3289 -1227
16539 -1227 5988 21065 22521 14807 9510 9812 8611 5274 6766 10878 4526 3074 4490 1164 -2782
16524b782m701k821Q287Q390j406M67N953O344O09N241m804l463p739n07M292
16509A1360M24J731m857k072K774J1632J95j911J344n356L247J756r381K172N496
16494A8554j625q631L182K523J776L990m230k659q784m480k893K859N910J662
16480G154m16M37Q46N535O308k91l004p860m524M051J0446L031j296Q30j77l264
16464A7806q838Q275O679p739r988l957N366j774j312n58M118j307o272p95L548
16449C252L323J239J371j491k125l793q66j2254n02O156M173J869M364M236l08
16434H644j4073k502Q406J094k593j666K729M743r99k523n685o781k7K708p381
16419a5906L818O332Q738J795k326m916N097K693J230Q6j187k597Q98O089k845
$$ plain form
16524 -2782 -7483 -10304 -2017 6373 4967 5434 11387 17731 18340 23581 18777 15314 7575 7068 11360
16509 11360 11784 13515 8658 6586 9360 20992 21187 19276 20620 15264 18511 20267 10886 13058 18554
16494 18554 16929 8298 11480 14003 15779 19769 15539 12880 4096 -384 -3277 -418 5492 7154
16480 7154 6738 7175 8021 13556 19864 19573 16569 8709 4185 8236 18682 21713 20417 21247 21070 17806
16464 17806 8968 17243 23922 16183 6195 2238 7604 5830 4518 3960 8078 6771 499 -296 3252
16449 3252 6575 7814 9185 7694 5569 1776 910 -11344 -11846 -5690 -1517 352 4716 8952 8644
16434 8644 -5429 -7931 475 1569 -1024 -2690 39 4782 3783 1260 -4425 -11206 -11233 -8525 -15906
16419 -15906 -12088 -5756 2982 4777 2451 -2465 2632 5325 6555 6641 5454 2857 3755 9844 6999
16404F999q570O436M335n937j638J051k098K154N196l499q317o515k727J406K954
16389h770N27M242K553K189J852K064l845n068J263L277J3804N841p845m422l939
16374C723n632k153L928O358N843k897j1969o870n731M541M548Q754N671N030
16360A3144O107L43p717o826J545J263M156m602n523L935m67n968q501O241J1851
16345H981j207q119j906Q038j578j886o944k650M090J384j200r88M813L443j817
16330B454K031l616o47Q381M591p472q088K383J224P41l709J752J47m169K763
16315a234J477k114m091m009j63J192P65l64Q805M118p811q8M394J195j04j828
16299A40M917l238l780m850j655O605L173q626l770M635Q233L007J98m938j224
$$ plain form
16404 6999 -1571 4865 9200 3263 1625 2676 578 2732 7928 4429 -3888 -10403 -13130 -11724 -8770
16389 -8770 -8243 -4001 -1448 741 2593 4657 812 -4256 -2993 284 14088 19929 12084 7662 3723
16374 3723 -1909 -4062 -134 6224 12067 9170 -2799 -9669 -15400 -10859 -6311 2443 8114 13144
16360 13144 19251 19594 11877 5051 6596 7859 12015 7413 1890 5825 5358 -610 -9111 -2870 8981
16345 8981 7774 -345 -2251 5787 4209 2323 -4621 -7271 -3181 -1797 -2997 -3985 828 4271 2454
16330 2454 4485 869 222 8603 13194 5722 -2366 17 1241 1982 -1727 25 172 -3997 -1234
16315 -1234 243 -1871 -5962 -9971 -10134 -8942 -8177 -8541 264 4382 -3429 -3517 877 2072 1968 140
16299 140 5057 1819 -1961 -6811 -8466 -1861 1312 -7314 -11084 -6449 1784 4791 4989 51 -1173
16284a173N700k948K50O771l776n612o054K698M799L269O304J628m210K86L65
16269H297l649J964P34l146P585N656j64O72l023l442K539r94m700L897K521L430
16253A8177k384j0579P962M423J609J159j631p579n208N19M73n13n43l493Q41
16238C233m532m709j187L000O238J428j04K713N873K807K12p604p840O58P795
16223G981M521j1278k063k570O478O452l931j865r41L165K049k532n156O600O831
16208A3741q627p057N083M285J347m871n9K935l936m330J22J165j275m032l022
16193h531J178j679K425J925L966K293l413K701N544m632j655p99M826M758L491
16178A2398n410n549M364R973k434n340q722j637L597K480j955l646N16J729L373
$$ plain form
16284 -1173 4527 1579 1829 8600 4824 -788 -6842 -4144 655 3924 10228 11856 7646 7932 8297
16269 8297 4648 6612 7346 4200 11785 17441 17277 17949 14926 11484 14023 13029 8329 12226 14747 18177
16253 18177 15793 5214 13176 17599 19208 20367 18736 11157 5949 6468 6941 6428 5885 2392 3233
16238 3233 -1299 -6008 -7195 -4195 2043 3471 3367 6080 11953 14760 14972 7368 -472 186 7981
16223 7981 12502 1224 -839 -3409 3069 9521 5590 3725 2784 5949 7998 5466 310 6910 13741
16208 13741 5114 -1943 3140 7425 8772 3901 3842 6777 2841 -1489 -1367 -202 -1477 -5509 -8531
16193 -8531 -7353 -9032 -6607 -4682 -716 1577 -1836 865 6409 1777 122 -677 4149 8907 12398
16178 12398 6988 1439 5803 15776 13342 8002 -720 -2357 1240 3720 1765 -1881 -1365 364 3737
16163C737K843m413j129l313m789M764O284m295J28K347j111l035O296k555o085
16148d326R453N860j064L82o533m582k030L207j478k020n505K022O533O009k227
16133C701l137O682N551l582n121l288n048r134l77P254J192m182q978n87R677
16118i377M182n643O248l532j574p03M771K103J399N18M64M272k793k046K263
16103E52j332N59j923n931p149K702p38L897J911M685P574j213M502j334p873
16088a111L101P184Q679K143o268l035k225n16o407M278J0628l762o578k49P045
16073A2907K337J268l554q100J884l66k265k55N582M684L087j554J814L979k334
16058A9114o626o690n150L84j621L638K627M062l373O04J194o149m832r04M734
$$ plain form
16163 3737 6580 2167 1038 -2275 -7064 -2300 3984 -311 -183 2164 1053 -1982 4314 1759 -4326
16148 -4326 5127 10987 9923 10305 3772 -810 -2840 367 -1111 -3131 -8636 -6614 -81 5928 3701
16133 3701 564 7246 12797 9215 4094 806 -4242 -13376 -13753 -6499 -5307 -9489 -18467 -19054 -9377
16118 -9377 -5195 -10838 -4590 -8122 -9696 -10399 -5628 -3525 -2126 -1608 -1144 3128 335 -1711 552
16103 552 -780 -221 -2144 -8075 -15224 -12522 -13260 -9363 -7452 -2767 4807 3594 8096 6762 -1111
16088 -1111 1990 9174 17853 19996 13728 10693 8468 7952 1545 5823 16451 12689 6111 5862 12907
16073 12907 15244 16512 12958 4858 6742 6376 4111 3856 9438 14122 17209 15655 17469 21448 19114
16058 19114 12488 5798 648 1032 -589 3049 5676 9738 6365 6969 8163 2014 -2818 -3722 1012
16043A012j593J594L448l811p237O172m13L498K95K807j43p04J6k442J303n706
16027a904l918p615l381Q353P028Q324Q331k833m648q613j591K782m754P281J52
16012B994Q80M722R466N074r589j3184M049j408j0298J580j401k591K258R384
15998A936J0309k244j0097l4Q415o735l616J2K908l117L013J843j381M599m786
15983A025q299Q4L52L131K431J0851o411j4027N696O272N75L720K925M957l604
15968I678l757K477q107o335N569J374l621L021j38N581k813j0916N297P687n342
15953c45q305o025j72o314N106K964n363O920Q955J0917n096q121m388m50m29
15938a0146O974J0443N793R75j29o200l695K250o266j215M298J664k072n018k892
$$ plain form
16043 1012 -581 1013 4461 650 -6587 -415 -828 2670 2965 5772 5629 4925 4941 2499 3802 -1904
16027 -1904 -5822 -13437 -16818 -8465 -1437 6887 15218 12385 7737 -876 -2467 315 -4439 2842 2994
16012 2994 3874 8596 18062 23136 13547 363 4412 3004 -7294 -5714 -7115 -9706 -7448 1936
15998 1936 12245 10001 -96 -130 8285 1550 -2066 -2054 854 -2263 750 2593 1212 5811 1025
15983 1025 -7274 -7190 -6838 -3707 -1276 9575 3164 -10863 -5167 1105 1680 5400 8325 13282 9678
15968 9678 5921 8398 291 -6044 -475 899 -2722 299 161 5742 2929 -7987 -2690 4997 -345
15953 -345 -8650 -14675 -14847 -21161 -16055 -13091 -18454 -11534 -2579 8338 3242 -4879 -9267 -9717 -10146
15938 -10146 -3172 7271 13064 14039 13910 7710 4015 6265 -1 -1216 3082 4746 2674 -2344 -5236
15923e236J560J298n22K798P327N495r025l855r09n384n993q802l415K533N837
15908a6293J1419P271K745k373K241P376j190p933j1353o294k783J548N022j486
15894a2083P518K568P307m859o713M641O249j635N219n124j4271m94M301q14n750
15879a3940l122M464M47K275J611R189O4L325O289n633j0881o753O36M335K183
15864e511N821R638P963l973q814o345o32j607n431J893j280M639Q790q848p612
15849a1309l982J347O430j814p52P583l57L727J791r070k09N76M114N856l587
15834C44j894k343m190m952l655O076K075M252j136K99N72O40m858q504j81K989
15818a4466M003K38p14L217O244q801k012O079l027j767j594J0134O449N60j481
$$ plain form
15923 -5236 -3676 -2378 -2900 -102 7225 12720 3695 -160 -1069 -6453 -12446 -21248 -24663 -22130 -16293
15908 -16293 -4874 2397 5142 2769 5010 12386 11196 3263 -8090 -14384 -17167 -15619 -10597 -12083
15894 -12083 -4565 -1997 5310 451 -6262 -1621 4628 2993 8212 3088 -11183 -11677 -7376 -8190 -13940
15879 -13940 -17062 -12598 -12151 -9876 -8265 924 988 4313 10602 4969 -5912 -12665 -12029 -7694 -5511
15864 -5511 310 9948 17911 13938 5124 -1221 -1853 -3460 -8891 -6998 -8278 -3639 5151 -3697 -11309
15849 -11309 -15291 -13944 -7514 -9328 -10080 -2497 -2854 873 2664 -6406 -6615 -6039 -1925 3931 344
15834 344 -1550 -3893 -8083 -13035 -16690 -10614 -8539 -4287 -5423 -5124 -4552 -3912 -8770 -17274 -17455 -14466
15818 -14466 -10463 -10225 -10939 -7722 -1478 -10279 -12291 -6212 -9239 -11006 -12600 -2466 3983 4543 3062
15803C062k284j1889j2864k170Q591Q894J2233J0259n707o319k92l376J656k744
15789b950O41N155j573K768m93K620j2799n245j37j24L566K346k279R679J953
15774C128n226j1014l018M015L755m517j0105L683R318P260L945m308r224N41
15760a1767j001L936K788k176K296M248Q546n048m246K744n34j34k997q01L353
15745g93K741k288o02P274K307j935j301j0662o455j30R86k176K59L870q42k877
15729a2624m394m37L717R425n970l147K933Q330o50j29J995j669k223K589P12
15714a542M93l306N233K674m235N45l535J313m302m645J914k95n543J413R302
15699d516k09j922R71m041q572L634J0721N009m942k649Q8J486P3l445J71J686
$$ plain form
15803 3062 778 -11111 -23975 -26145 -17554 -8660 3573 13832 8125 1806 1514 -1862 -206 -2950
15789 -2950 -2309 2846 1273 4041 3548 6168 -6631 -11876 -12013 -12137 -8571 -6225 -8504 1175 3128
15774 3128 -2098 -13112 -16130 -12115 -8360 -12877 -22982 -19299 -9981 -2721 1224 -3084 -12308 -11767
15760 -11767 -12768 -8832 -6044 -8220 -5924 -1676 6870 1822 -2424 320 -214 -348 -3345 -4146 -793
15745 -793 1948 -340 -942 6332 8639 6704 5403 -5259 -11714 -11844 -10858 -13034 -12775 -8905 -9747 -12624
15729 -12624 -17018 -17455 -13738 -4313 -10283 -13430 -10497 -2167 -2817 -2946 -951 -2620 -4843 -2254 -1542
15714 -1542 -1049 -4355 878 3552 -683 -138 -3673 -2360 -6662 -11307 -9393 -9688 -15231 -13818 -4516
15699 -4516 -4725 -6647 -5676 -9717 -18289 -14655 -3934 1075 -3867 -6516 -6428 -4942 -4869 -8314 -8143 -6457
15683f457m472r76O851J523j2921r19J0134m606R866j350p537r66p13l114P340
15668h317R105m27k853L453J182K440n600l401n059O153q19o158j858k975O056
15653i078N964M801j936j1501j901k864j061R954N163p280m970l128j775O916
15639a2696O317j869O0j403j903m955J499R3l900j434j0355l80J7516P498k913
15624h825J467J0762J1060l638m300l262o643o482K057M253m796K870p919o307
15610a9703K804O303j88k772N552J408j822q990K598N646L591N519l0J385l968
15595b667q345k268P34P966l472l312P066K222o98n668m937O004Nn943k73M111
15579i475j500L115J867K506m04j316M82M457k789l119K062P41R2O65j049J843
$$ plain form
15683 -6457 -10929 -11905 -5054 -3531 -16452 -17371 -7237 -11843 -1977 -3327 -10864 -11830 -12543 -15657 -8317
15668 -8317 788 361 -2492 961 2143 4583 -1017 -4418 -9477 -3324 -4143 -10301 -12159 -15134 -9078
15653 -9078 -3114 1687 -249 -11750 -13651 -16515 -17576 -7622 -2459 -9739 -14709 -17837 -19612 -12696
15639 -12696 -6379 -8248 -8188 -9591 -11494 -16449 -14950 -14857 -18757 -20191 -30546 -30926 -13410 -5912 -8825
15624 -8825 -7358 3404 14464 10826 6526 3264 -3379 -9861 -7804 -3551 -8347 -5477 -13396 -19703
15610 -19703 -16899 -10596 -10784 -13556 -8004 -6596 -8418 -17408 -14810 -9164 -5573 -54 -84 1301 -2667
15595 -2667 -11012 -13280 -12546 -4580 -8052 -11364 -4298 -2076 -2774 -8442 -13379 -7375 -7370 -13313 -13586 -9475
15579 -9475 -10975 -7860 -5993 -3487 -3891 -5207 -4725 -268 -3057 -6176 -4114 -3373 -3281 -2616 -3665 -1822
15563a822J598J102j369r899k023J1097n164j877k213M678Q64O65K747J9J0662
15548I065N607j557J116J0883K7267L7866O8392M9103k9904o0000n0751l1743
15536C5344k0578o508q651K578l885j1440q806J477J3186L797o881k647l336L287
15522a3063R078k14K073q51K385r023m37R567R504l860l188j485q496m607J106
15507a1511M52M391O491m530N06L300P73j146l627r928P947J1635N460j041K641
15492A1813p844n778q090p268N649N193l153o978m41M098j409J793j582l744j3702
15477c1443L20P075P26J0129N648l075L220K491l695k692J005n79K264N470N836
15462B700L079j374j5115k786p8P38L905k209k380j944N207Q197j204j0059m071
$$ plain form
15563 -1822 -224 878 -491 -10390 -12413 -1316 -6480 -8357 -10570 -5892 -5028 -4363 -1616 -1597 9065
15548 9065 14672 13115 14231 25114 52381 90247 158639 207742 177838 117838 67087 35344
15536 35344 14766 8258 -393 2185 -1700 -13140 -21946 -20469 -7283 -3486 -10367 -13014 -16350 -13063
15522 -13063 -3985 -4199 -2126 -2977 -592 -9615 -10052 -485 9019 5159 1971 486 -8010 -12617 -11511
15507 -11511 -11059 -6668 -177 -4707 -4201 -901 -128 -1274 -4901 -14829 -6882 4753 10213 9172 11813
15492 11813 3969 -1809 -9899 -17167 -11518 -6325 -9478 -16456 -16897 -12799 -14208 -12415 -13997 -17741 -31443
15477 -31443 -31123 -24048 -23322 -13193 -7545 -10620 -7400 -4909 -8604 -11296 -10291 -10870 -8606 -3136 2700
15462 2700 5779 4405 -10710 -13496 -13574 -12836 -8931 -11140 -13520 -15464 -10257 -2060 -3264 -13323 -17394
15447a7394O48j468R565J1047J0859l624r661q973J6p67n81N147K823p497R103
15432g57L888n283l767O755N876q412M129L604J703j45j596o298n009p558m701
15417a7571N812Q388J206q2L091o513l856j0075n687R956P66k948K317j52j998
15402a7346j55J366k029j960P542L545m378J858K309O76l539M158N402J259q726
15387a0018l855K804R100M302M272N664q444p531k005l065p437p352N231N685
15373a2649n474l95o14O977j989m930J764O487R797k614j1736p131p268K031J2186
15358a5558R229J187n436k767n14K156L875O852M36k55j916j2025l730K259P60
15343a5447O189O298k031k600l468o687j135J0608J1150p388p869m214R72J183
$$ plain form
15447 -17394 -16746 -18214 -8649 2398 13257 9633 -28 -9001 -8985 -9752 -10333 -5186 -2363 -9860 -757
15432 -757 3131 -2152 -5919 836 6712 -1700 2429 6033 7736 7591 5995 -303 -5312 -12870 -17571
15417 -17571 -11759 -3371 -2165 -2247 844 -5669 -9525 -19600 -25287 -15331 -14565 -17513 -15196 -15348 -17346
15402 -17346 -17501 -16135 -18164 -20124 -12582 -9037 -13415 -11557 -9248 -8572 -12111 -7953 -2551 -1292 -10018
15387 -10018 -13873 -11069 -1969 2333 6605 12269 3825 -3706 -5711 -8776 -16213 -23565 -18334 -12649
15373 -12649 -18123 -18518 -19132 -12155 -14144 -19074 -17310 -10823 -1026 -3640 -15376 -22507 -29775 -27744 -15558
15358 -15558 -6329 -5142 -10578 -13345 -13859 -11703 -7828 -976 -540 -795 -2711 -14736 -18466 -16207 -15447
15343 -15447 -9258 -2960 -4991 -7591 -11059 -17746 -18881 -8273 2877 -4511 -12380 -16594 -15622 -14439
15329a4439r152N189K756J384O462M259J0562l702p829o571N160O259k42M00l707
15314c211K386L546p479m236N84m459l132K118N518m564p124P691O72j929p34
15299a4353O100M036n689m269l220m87m599l043L592Q824K931L232j516M791j805
15284e475J655p887p630k35R494L939J040K731P90l690k244r788j0840M87Q889
15269a8764J3861M992m71p08j1072o709J155M82K300O223R032R930L941p361j2548
15254e717j376M157l242m919J902N889L38M264P038n901J2272R97O268J5542J1684
15239D9196M997j728k670M426R595m884m908j1102j5662m069k989j264o106q164
15225D668J772L47p463j533J755J627l263l953n31m061j031j999J318k176j526
$$ plain form
15329 -14439 -23591 -18402 -15646 -14262 -7800 -3541 7021 3319 -4510 -11081 -5921 338 96 496 -3211
15314 -3211 -825 2721 -4758 -8994 -8410 -12869 -16001 -13883 -8365 -12929 -20053 -12362 -11690 -13619 -14353
15299 -14353 -8253 -4217 -9906 -14175 -17395 -17882 -22481 -25524 -21932 -13108 -10177 -6945 -8461 -3670 -5475
15284 -5475 -3820 -11707 -19337 -19572 -10078 -6139 -5099 -2368 -1578 -5268 -7512 -17300 -28140 -27653 -18764
15269 -18764 -4903 89 -382 -1090 -12162 -18871 -17716 -17234 -14934 -8711 321 10251 14192 6831 -5717
15254 -5717 -7093 -2936 -6178 -11097 -9195 -3306 -2968 1296 8334 2433 14705 15702 21970 37512 49196
15239 49196 54193 52465 49795 54221 63816 58932 54024 42922 27260 23191 20202 18938 12832 4668
15225 4668 6440 6787 -676 -2209 -454 1173 -2090 -6043 -6574 -10635 -11666 -13665 -12347 -14523 -16049
15210a6049J391L240k673M780K380p31q599n435P72o933M144K359M684Q768K070
15195e832q61N294Q206l197o460n378k870R68N549M31j879j125J7q856o976k983
15179b5952J612l965k870J1059O207K467L108m769l036l012J282j74N49K524N048
15164i922P873m734m714l548P099k111k679l688N413P25N007P688K860M95r323
15149c559j2832k26K943M518j631l982J886N466O284K782j620q361N42M467J957
15134a366n968k779j843J825P227K324O725l735q607j1263R43L622M850m235L891
15119h389J2529o315k151J481r30J3085P948r45p560M060n431K069p133k458J852
15104A712L642m143n897L215j166m434M522j939o513k799q545P516M493k441j107
$$ plain form
15210 -16049 -14658 -11418 -14091 -9311 -6931 -7662 -16261 -21696 -20924 -27857 -23713 -21354 -16670 -7902 -5832
15195 -5832 -6693 -1399 6807 3610 -2850 -8228 -11098 -10130 -4581 -4150 -6029 -7154 -7137 -15993 -22969 -25952
15179 -25952 -24340 -28305 -31175 -20116 -13909 -11442 -8334 -13103 -16139 -19151 -17869 -18043 -17494 -14970 -9922
15164 -9922 -2049 -6783 -11497 -15045 -7946 -10057 -12736 -16424 -11011 -10286 -5279 2409 5269 5764 -3559
15149 -3559 -16391 -16617 -13674 -9156 -10787 -14769 -12883 -7417 -1133 1649 29 -8332 -7790 -3323 -1366
15134 -1366 -7334 -10113 -11956 -10131 -2904 -580 6145 2410 -6197 -17460 -16517 -12895 -8045 -12280 -8389
15119 -8389 4140 -2175 -4326 -2845 -3775 9310 17258 16313 8753 12813 7382 9451 2318 -140 1712
15104 1712 5354 1211 -4686 -1471 -2637 -7071 -2549 -4488 -11001 -13800 -22345 -14829 -10336 -12777 -13884
15089a3884Q116M443K920N453l611m505r39R418L257p700l892N660L042K982q063
15074B697j275L618n416m912L515N671L177P20K136l593l726o309r075O21j09
15059a2260O768O345M834m545M284r513r988J1455J0470O889N007L779M454n116
15045B2863j5148K89j856j615j020J0496J1406Q372k431o926k336k770J0138J3287
15031D2749L051K842J6460M630q090p129J958Q758J5599J2660p09m340L931K943
15017I5313n177K275J0197O156J836j681O805K6064L3393L7193K8298L6701N2777
15004C30150O0119N9266P0884P8252O9954O5707P7577J07460J55364K03821K53243
14993A531797L35199L87574M74792O81458J040568J694478L118509O192459J1795743
$$ plain form
15089 -13884 -5768 -1325 1595 7048 3437 -1068 -2007 7411 10668 2968 -924 4736 7778 10760 2697
15074 2697 1422 5040 -376 -5288 -1773 3898 7075 7795 9931 6338 2612 -3697 -12772 -12151 -12260
15059 -12260 -5492 853 5687 1142 5426 -4087 -14075 -2620 7850 14739 19746 23525 27979 22863
15045 22863 7715 8004 6148 4533 3513 14009 25415 33787 31356 24430 22094 19324 29462 42749
15031 42749 45800 48642 65102 69732 61642 54513 56471 65229 80828 93488 92779 88439 92370 95313
15017 95313 90136 92411 102608 108764 110600 108919 115724 141788 175181 212374 240672 277373 330150
15004 330150 390269 449535 520419 598671 668625 734332 811909 919369 1074733 1278554 1531797
14993 1531797 1866996 2254570 2729362 3410820 4451388 6145866 9264375 15456834 27252577
14984B7252577J0735718l240884r406040j0548045o619337l226132j657773r59070
14976B331014o04872m13153k76151j81321j41433j11525q8408o6452n9878n6530
14966C31291l3279k5970j9382j7192j4331k799p737j4562q435o795r389k7231
14954A44189k0423j1936l449M876J28r087j8047j2771j9000j0481j981l57J8140
14941E9801O202j4537j1190r037n672p78O862P597J086P950L3j5674k0534o932
14927E177k666q241L185J5378N868n94L057L073p70n982q322k416o904Q854J0152
14912A8849O030J0345L416k694J392M421m711j1457j555j2009j4129n054L016
14899d140o8q50L80j159r383L752p681l081J78O116k332o544K27J5904P441o428
$$ plain form
14984 27252577 37988295 34747411 25341371 14793326 8173989 4947857 3290084 2331014
14976 2331014 1726142 1312989 1036838 855517 714084 602559 514151 447699 387821 331291
14966 331291 298012 272042 252660 235468 221137 218338 210601 196039 187604 180809 171420 144189
14954 144189 123766 111830 108381 113257 113385 104298 86251 73480 54480 43999 42018 41661 59801
14941 59801 66003 51466 40276 31239 25567 24789 31651 39248 40334 48284 48317 32643 12109 5177
14927 5177 2511 -5730 -2545 12833 18701 18107 21164 24237 23467 17485 9163 6747 -157 8697 18849
14912 18849 24879 35224 38640 35946 37338 41759 37048 25591 24036 12027 -2102 -7156 -4140
14899 -4140 -4208 -5058 -4678 -5837 -15220 -11468 -19149 -22230 -22052 -15936 -18268 -24812 -24585 -8681 -1240 -7668
14883g668N066P058J205L574J3341M201l104l608m825j645k424L772k831j0163
14869A949L2l765m678J056K841l294r822k137N952m173P28N737L236k492k10K613
14853f427q596o338q36L801L036M689J6343O040n838k535j025l822j402K762j751
14838a899j82K660N486m094r77l795n294L669N135q956k934Q558J7012m782j6387
14823f780r722m397K337j0691J468M140K6K912J381L9K223k314j459m125j298
14808b6260j109O220Q180o21l985O925L557L545R009R27l590q567q487n04pK031
14792a2736k691o106L538J5072J355j371p726k246j078K306K004m176N540k62
14778h577J982J115J955N560m41o744p23Q428K608k871m95J490J693q996j82n60
$$ plain form
14883 -7668 -2602 4456 5661 9235 22576 26777 23673 20065 15240 13595 11171 14943 12112 1949
14869 1949 1981 -1784 -6462 -5406 -2565 -5859 -15681 -17818 -11866 -16039 -15311 -9574 -6338 -8830 -9040 -6427
14853 -6427 -15023 -21361 -22197 -18396 -15360 -10671 5672 11712 5874 3339 2314 -1508 -2910 -148 -1899
14838 -1899 -2081 579 6065 1971 994 -2801 -8095 -4426 709 -8247 -11181 -2623 14389 9607 -6780
14823 -6780 -16502 -20899 -18562 -29253 -27785 -23645 -23619 -20707 -19326 -19287 -17064 -19378 -20837 -24962 -26260
14808 -26260 -27369 -21149 -12969 -13590 -17575 -10650 -7093 -3548 5461 6388 2798 -5769 -14256 -14760 -14767 -12736
14792 -12736 -15427 -21533 -17995 -2923 -1568 -2939 -10665 -12911 -13989 -11683 -9679 -13855 -8315 -8577
14778 -8577 -6595 -5480 -3525 2035 1594 -5150 -5873 2555 5163 2292 1797 3287 4980 -4016 -4198 -4758
14762d758K852l678j2398n33J665P308O351m289M629N481P660K969r020j6829
14748a2590o078L625R417p066m909J2042P925o207l005m216k707J711o021o283
14734b4362Q527O633L324p10M028k47p218m028l495J118P910N271n40k509r111
14719a5409k547O98K290K565P40n811p919l82L215P573l292J097M686N223o021
14704a3294k754L292K807M857m600p759l914n222n630K964O836L889M426M489
14690i613M424K76M182m001p835K130q00n700o355N716m099L572j276n993L611
14675b1761Q986k811r893K203Q823n788p771k614L539m795l15Q877J854N369j409
14660a7506L211R18J983j615K789r68j998L254K32p676k157j351q143l786N744
$$ plain form
14762 -4758 -1906 -5584 -17982 -18515 -16850 -9542 -3191 -7480 -2851 2630 10290 13259 4239 -12590
14748 -12590 -18668 -15043 -5626 -12692 -17601 -5559 2366 -3841 -6846 -11062 -13769 -12058 -18079 -24362
14734 -24362 -15835 -9202 -5878 -6588 -2560 -2807 -10025 -14053 -17548 -16430 -8520 -3249 -3789 -6298 -15409
14719 -15409 -17956 -17258 -14968 -12403 -11663 -17474 -25393 -25775 -22560 -14987 -18279 -17182 -12496 -7273 -13294
14704 -13294 -16048 -12756 -9949 -5092 -9692 -17451 -21365 -26587 -32217 -29253 -22417 -18528 -14102 -9613
14690 -9613 -5189 -4913 -731 -4732 -12567 -10437 -11237 -16937 -23292 -17576 -21675 -18103 -19379 -25372 -21761
14675 -21761 -12775 -15586 -25479 -23276 -14453 -20241 -28012 -30626 -27087 -31882 -32197 -23320 -21466 -16097 -17506
14660 -17506 -14295 -13377 -11394 -13009 -10220 -11188 -13186 -9932 -9700 -17376 -19533 -20884 -29027 -32813 -27069
14645b7069J3514J2458J043m528L787k193k912l686L665K405J845j553O548Q354
14631A1678L897p656q171l248j2051n242l464J0779L262O226L385l005K626K150
14617A166m773l943k455N227O212K918k413j0808r175j466K221q394J291L989
14603b0403l533Q734J076n050r318L842K449O745Q3j782n911j641P142J0389m502
14588a1680p271K606K432m199l815J81L703m701J215M958J762l792m194l467R175
14573a7087J429q66J294L034n037q90Q341l443p897p087P654K301l003m433J854
14558b3836L425J108L939P864L52j3713p325M325p310q5R221M880J301m942J873
14543a8923j971L625N880L834O820k959j3095p170o914m914R571J1917L20M019
$$ plain form
14645 -27069 -13555 -1097 -54 -4582 -795 -2988 -5900 -9586 -5921 -3516 -1671 -3224 3324 11678
14631 11678 15575 7919 -252 -3500 -15551 -20793 -24257 -13478 -10216 -3990 -605 -3610 -984 1166
14617 1166 -3607 -7550 -10005 -4778 1434 4352 1939 -8869 -18044 -19510 -17289 -25683 -24392 -20403
14603 -20403 -23936 -15202 -14126 -19176 -28494 -24652 -22203 -15458 -15375 -17157 -23068 -24709 -17567 -7178 -11680
14588 -11680 -18951 -16345 -13913 -18112 -21927 -21746 -18043 -22744 -21529 -16571 -14809 -18601 -22795 -26262 -17087
14573 -17087 -15658 -16524 -15230 -12196 -17233 -18123 -9782 -13225 -21122 -28209 -20555 -18254 -21257 -25690 -23836
14558 -23836 -20411 -19303 -15364 -7500 -7148 -20861 -28186 -23861 -31171 -31256 -22035 -17155 -15854 -20796 -18923
14543 -18923 -20894 -17269 -11389 -7555 -735 -3694 -16789 -23959 -30873 -35787 -26216 -14299 -13979 -9960
14529i960N57r102l227J772P520O596k468J164r52q621l057J902l628j698K890
14514b0312L643J451K329J255R069j194o531o735J039l036j085j521O560l598
14500a8666n771n691R94L206M394j424R637J0000m366m333L062L651M435n588
14486f460J590l034j114r409m060k939J887L707L005O136n282l399l01q632M52
14471b7853L652L718R106k736j913l010m070P560P63m995n58J868J699k221k345
14456b1335N505k034j959p970O328P805K208q360J754M213o421j1046N178O830
14442a9304p983J934L929l366l384L968k327j583J0327j37k040m254m54J1034
14428a3640l65N198J0582L476R887M790o442M856L3653N8322N9190j0187m9804
$$ plain form
14529 -9960 -9403 -18505 -21732 -19960 -12440 -5844 -8312 -7148 -8100 -16721 -19778 -17876 -21504 -23202 -20312
14514 -20312 -16669 -15218 -12889 -11634 -2565 -3759 -10290 -17025 -15986 -19022 -20107 -21628 -15068 -18666
14500 -18666 -24437 -30128 -29134 -25928 -21534 -22958 -13321 -3321 -7687 -12020 -8958 -5307 -872 -6460
14486 -6460 -4870 -7904 -9018 -18427 -22487 -25426 -23539 -19832 -16827 -10691 -15973 -19372 -19673 -28305 -27853
14471 -27853 -24201 -20483 -11377 -14113 -16026 -19036 -23106 -15546 -14783 -19778 -20336 -18468 -16769 -18990 -21335
14456 -21335 -15830 -17864 -19823 -27793 -21465 -13660 -11452 -19812 -18058 -13845 -20266 -31312 -26134 -19304
14442 -19304 -27287 -25353 -21424 -24790 -28174 -24206 -26533 -28116 -17789 -17926 -19966 -24220 -24674 -13640
14428 -13640 -14005 -8807 1775 5251 15138 19928 13486 18342 51995 110317 169507 159320 109516
14415A09516m8708l0456k8422j2037J947j017l018m042l058M535Q804r99L70R792
14401C207L6l09k568o270l699L45O560m54o839p439M518L425q991M65N138m64
14385a3339p862l585N506L618k976q479j735R516q7j233P499m044r822l839M866
14370b5996M166R52J19m095P071M235K283k474j3371p296J4686J344L691N767
14356h918m37o014M942M012j13k900M33l970q662j0806N885J0573L901m738l945
14341b0757M755M627j172k844o906N873N852N47J245J850j503j364m3r94l323
14326a4157K256M25j345n289p592k71M135J0463M825J514oN461P925r578j0558
14311a1792k905J92p21Q28j2638K515L853L663m07R619K985r90j590p808k368
$$ plain form
14415 109516 60808 30352 1930 -10107 -8160 -9177 -12195 -16237 -19295 -14760 -5956 -6955 -6585 3207
14401 3207 3243 2934 366 -5904 -9603 -9258 -2698 -3152 -9991 -17430 -12912 -9487 -18478 -18013 -12875 -13339
14385 -13339 -21201 -24786 -19280 -15662 -18638 -27117 -28852 -19336 -19423 -20656 -13157 -17201 -27023 -30862 -25996
14370 -25996 -21830 -20878 -20759 -24854 -17783 -13548 -11265 -13739 -27110 -34406 -19720 -18376 -14685 -8918
14356 -8918 -9355 -15369 -10427 -6415 -6528 -9428 -8995 -12965 -21627 -32433 -26548 -15975 -12074 -16812 -20757
14341 -20757 -16002 -11375 -12547 -15391 -22297 -16424 -10572 -10025 -8780 -6930 -8433 -9797 -9840 -10834 -14157
14326 -14157 -11901 -11476 -12821 -18110 -25702 -25973 -21838 -11375 -6550 -5036 -5042 419 8344 -1234 -11792
14311 -11792 -14697 -14505 -15226 -14398 -27036 -24521 -20668 -17005 -17412 -7793 -4808 -5798 -7388 -15196 -17564
14296a7564j443J712N381K509l993k417q002K546N389m532o233n141J979M330
14282b5479j504J147N442K262K790K467j154n407j629J85K166J670n963R041J155
14267a2811m687k785J302k93K800l20n396p530N132O118Q68n367J32M804L012
14252a5021Q09m429L391J624m315k202q317O74R338N386L581M10O47p273k979
14237a8676j307N482p196n951l12L851M521o765k198K389M588J047r864m823N102
14222c0112N691Q255o437Q62K286l408J40O291j5l271k169K215r42n652R070P038
14206a0158Q569n387j1295J592M355J502Q6m366k230k857Q32n388p447k793O584
14191b8401O410L378L563q161k835R84J199M25m98j0282J745J4982L373K198N472
$$ plain form
14296 -17564 -19007 -17295 -11914 -9405 -13398 -15815 -23817 -21271 -15882 -20414 -26647 -31788 -29809 -25479
14282 -25479 -26983 -25836 -20394 -18132 -15342 -12875 -14029 -19436 -21065 -20880 -18714 -17044 -23007 -13966 -12811
14267 -12811 -17498 -20283 -18981 -19274 -16474 -16794 -22190 -29720 -24588 -18470 -17602 -22969 -22837 -18033 -15021
14252 -15021 -14212 -18641 -15250 -13626 -17941 -20143 -28460 -27786 -18448 -13062 -9481 -9071 -8424 -15697 -18676
14237 -18676 -19983 -14501 -21697 -27648 -27960 -24109 -19588 -26353 -28551 -26162 -21574 -20527 -30391 -35214 -30112
14222 -30112 -24421 -16166 -22603 -21741 -19455 -22863 -22723 -16432 -16447 -19718 -21887 -19672 -20614 -26266 -17196 -10158
14206 -10158 -1589 -6976 -18271 -16679 -12324 -10822 -10736 -15102 -17332 -20189 -19357 -24745 -32192 -34985 -28401
14191 -28401 -21991 -18613 -15050 -23211 -26046 -25062 -23863 -23438 -23936 -34218 -32473 -17491 -14118 -11920 -6448
14176f448j725k683m701l403n111o194j555k585o71M156L7n917L868O708N760
14161b0464L382p42l82n43M871L967J2473l501q959j1815j2280J067J1720Q755
14147a2451n16p80l610l599r254k7P211N236j33l654L534J1854J092j3866O910
14132a2053M761m236Q67o428l099j566L359R644M88j261m620q708M352k351j211
14117b2062J302j224l141k730J199P856m6K253k613K795J019k4j443m356L362
14102a7853r66J969l144q56j128L148P128o093p915P419K060j269R94N36P32l808
14086a9046l692o01k654N343Q688k899j0772l682O110M415K40O249r1m402M730
14071a2064l111q877r911L595O503k942L899K523j417q04n785q167J446J647J235
$$ plain form
14176 -6448 -8173 -10856 -15557 -18960 -24071 -30265 -31820 -34405 -35076 -30920 -30883 -36800 -32932 -26224 -20464
14161 -20464 -17082 -17824 -18206 -18749 -13878 -9911 2562 -939 -9898 -21713 -33993 -32926 -21206 -12451
14147 -12451 -12967 -13747 -17357 -20956 -30210 -30237 -23026 -17790 -17923 -21577 -18043 -6189 -5097 -18963 -12053
14132 -12053 -7292 -11528 -10661 -17089 -20188 -21754 -18395 -8751 -8263 -9524 -14144 -22852 -18500 -20851 -22062
14117 -22062 -20760 -21984 -25125 -27855 -26656 -18800 -18846 -16593 -19206 -16411 -15392 -15416 -16859 -21215 -17853
14102 -17853 -18819 -16850 -19994 -20850 -21978 -18830 -11702 -17795 -25710 -18291 -16231 -17500 -16506 -15970 -15238 -19046
14086 -19046 -22738 -23339 -25993 -20650 -11962 -14861 -25633 -29315 -23205 -18790 -18550 -12301 -12392 -16794 -12064
14071 -12064 -15175 -24052 -33963 -30368 -23865 -26807 -22908 -20385 -21802 -22606 -28391 -36558 -35112 -33465 -32230
14056c2230J3579N109J757j762j669n440J124L808O680m027r253o128l184J386
14042c0250O675M741N622N544L725j460o346m350P758m615k395J2456n079l028
14028a1002M870k684l340O564P081l303j0739m957K060K475l613m431r798n49
14014c1366M044J5362J013n3j785k693l610j3158o999l890K945J2140N399m92
14000b3143l882k610q6L521K102L702O96J364k897m118l507P67L709r324j082
13985c4788R061J568J1401L713j0017O50P548O302O753j3347j2102J246O563Q645
13971f804l218q240K68k946l928P964l581m999n427K259O301L373p524j968j718
13956c0188P587L042N422j371j491m782k837m530r175J178J634N876P418M712
$$ plain form
14056 -32230 -18651 -13542 -11785 -13547 -15216 -20656 -19532 -15724 -9044 -13071 -22324 -28452 -31636 -30250
14042 -30250 -23575 -18834 -13212 -7668 -3943 -5403 -11749 -16099 -8341 -12956 -15351 -2895 -7974 -11002
14028 -11002 -6132 -8816 -12156 -5592 1489 -1814 -12553 -17510 -15450 -12975 -16588 -21019 -30817 -31366
14014 -31366 -27322 -11960 -10947 -11000 -12785 -15478 -19088 -32246 -39245 -43135 -40190 -28050 -22651 -23143
14000 -23143 -27025 -29635 -29721 -26200 -24098 -20396 -19700 -18336 -21233 -25351 -28858 -28091 -24382 -33706 -34788
13985 -34788 -25727 -24159 -12758 -9045 -19062 -18412 -10864 -4562 2191 -11156 -23258 -22012 -15449 -6804
13971 -6804 -10022 -18262 -17994 -20940 -24868 -16904 -20485 -25484 -30911 -28652 -22351 -18978 -26502 -28470 -30188
13956 -30188 -22601 -19559 -14137 -15508 -16999 -21781 -24618 -29148 -38323 -37145 -35511 -29635 -22217 -17505
13942a7505j323J607j237l74m071N946M341J842k525K61O70Q27r15l373P119p058
13926a5768j463Q911K792R81r91k119J490l204j2063N263k634m384k216m022q90
13911c0317M857M097N279o14q815k357Q80N101k217j193K094M824k818m399j639
13896b7237k664J2153M438Q08k924J2776N081p360o88l106n989J616k076r304
13882b4476j299p097L417P574p21M143N165n733j444q27L205M244l545l397q464
13867b9255l756K573R178J439j1309k458p935R2J0978P270k290o998L4M374N327
13852b2736l870m401M202L560j308o44j0878O186L813k993O729j671j598l515
13838b9124J562p7k356n128l18r83k10L741N443K228n150K455J054p540L446N845
$$ plain form
13942 -17505 -18828 -17221 -18458 -18832 -22903 -16957 -12616 -10774 -13299 -13038 -12368 -11541 -12456 -15829 -8710 -15768
13926 -15768 -17231 -8320 -5528 -4547 -5538 -7657 -6167 -9371 -21434 -16171 -18805 -23189 -25405 -29427 -30317
13911 -30317 -25460 -21363 -16084 -16698 -25513 -27870 -26990 -21889 -24106 -25299 -23205 -18381 -21199 -25598 -27237
13896 -27237 -29901 -17748 -13310 -12502 -15426 -2650 2431 -4929 -5617 -8723 -14712 -13096 -15172 -24476
13882 -24476 -25775 -32872 -29455 -21881 -22602 -18459 -13294 -19027 -20471 -21298 -18093 -13849 -17394 -20791 -29255
13867 -29255 -33011 -30438 -21260 -19821 -31130 -33588 -41523 -41431 -30453 -23183 -25473 -32471 -32437 -28063 -22736
13852 -22736 -26606 -31007 -26805 -23245 -24553 -25197 -36075 -29889 -26076 -29069 -22340 -24011 -25609 -29124
13838 -29124 -27562 -27639 -29995 -35123 -35441 -36424 -36634 -32893 -27450 -25222 -30372 -27917 -26863 -34403 -30957 -25112
13822b5112l684N7Q874k768J767L66J561L000k076p251o788M566J2191O812l251
13807a1736p523J361J540p642K242K654m581n602p329k386J0239J4916j873o29
13793a6349Mk087j0850L712p54j094L672J0786R859j666q519l994n974k545n634
13778c1433R92k625J805L086L937J3049M11p143q307j1176M90R951M101l870L952
13763b2780L490K973j757k311M988K980l869m805k485Q046j133m476p07m622M319
13748b2149k844q77j008J148k295o935m873J2689N435K476j280K891M497l184
13734a6309r72k414K16o246L976M603n952K119P065Q816n895n232o807m818k411
13719c0261M358l720l154K302R252j582o917n064m533K224J0531J1745K065j793
$$ plain form
13822 -25112 -28796 -28739 -19865 -22633 -20866 -20500 -18939 -15939 -18015 -25266 -32054 -27488 -15297 -8485 -11736
13807 -11736 -19259 -17898 -16358 -24000 -21758 -19104 -23685 -29287 -36616 -39002 -28763 -13847 -15720 -16349
13793 -16349 -16345 -18432 -29282 -25570 -26324 -27418 -23746 -12960 -3101 -4767 -13286 -17280 -23254 -25799 -31433
13778 -31433 -30441 -33066 -31261 -28175 -24238 -11189 -10778 -17921 -26228 -37404 -36914 -26963 -22862 -26732 -22780
13763 -22780 -19290 -16317 -18074 -20385 -15397 -12417 -16286 -21091 -23576 -15530 -16663 -21139 -21846 -26468 -22149
13748 -22149 -24993 -25870 -26878 -25730 -28025 -34960 -39833 -27144 -21709 -19233 -20513 -17622 -13125 -16309
13734 -16309 -17281 -19695 -19479 -25725 -21749 -17146 -23098 -20979 -13914 -5098 -10993 -16225 -23032 -27850 -30261
13719 -30261 -25903 -29623 -32777 -30475 -21223 -22805 -29722 -34786 -39319 -37095 -26564 -14819 -12754 -14547
13705a4547k902l356m017N292k6O09j141o417m721m997J504N124J925K968O74
13690b4028o730j230J767l19M153P989K981P51J403k190k366O470j841o85k997
13675a6872p36L818k351n8l096O755J0507k261J311J078j2804p774J3530Q202
13661g51m39k003l92K193L405K414J1251J1360K1819K8222K9022L1076K7470M8245
13647B12892M6543K8631K0010O686q415k868k8774m5062m0016m3420m4314l3949
13635F7944k4897j4728m678M667J895k974k825p44n347p531j2768p300J104L81
13621g801j1609n255M101O407Q626J751k547o130k131k213j41n42j627j94L303
13606a6002r70n682k235j174k355J594K525M481l91N738q266q171p803j764J885
$$ plain form
13705 -14547 -17449 -20805 -24822 -19530 -19556 -18947 -20088 -26505 -31226 -36223 -34719 -29595 -27670 -24702 -24028
13690 -24028 -30758 -31988 -30221 -30540 -26387 -18398 -15417 -14666 -13263 -15453 -17819 -11349 -13190 -13875 -16872
13675 -16872 -17608 -13790 -16141 -16199 -19295 -12540 -2033 -4294 -2983 -1905 -14709 -22483 -8953 -751
13661 -751 -1190 -3193 -3585 -1392 2013 4427 15678 27038 48857 77079 106101 137177 164647 212892
13647 212892 259435 288066 308076 314762 306347 303479 274705 229643 189627 146207 101893 67944
13635 67944 43047 28319 23641 28308 30203 27229 24404 23660 18313 10782 -1986 -9286 -8182 -7801
13621 -7801 -19410 -24665 -20564 -14157 -5531 -3780 -6327 -12457 -14588 -16801 -16942 -17484 -19111 -19305 -16002
13606 -16002 -16972 -22654 -24889 -26063 -28418 -26824 -24299 -19818 -20209 -14471 -22737 -30908 -38711 -40475 -38590
13591c8590L6N834J1098o85q292l769J175M422J1682M386k709l300p320m397M142
13576b6287kK229P521k773N946P176L340j63n825j4300q823J481M827L089o43
13561b3207M72m47M141p583J974N143K096M030K716l424l196o88K183M721m565
13546a5634p853m700m696L050P720N958k538j139J2346J3412l449k983l11j326
13532b143j1147q019L463K283O493L142M271Q267Q415l264q345q150j0147n692
13518b0573L8j0025l813M541l385l717p842p080j247R142R792O400l748m390K467
13503c3440n97l16p831j795j697N517P013n349l365n42J4360P391M109Q426o140
13488a4256k656n037r171N313P839K548M739K582l899m779q881L7M71o143J771
$$ plain form
13591 -38590 -38554 -32720 -21622 -22307 -30599 -34368 -33193 -28771 -17089 -12703 -15412 -18712 -26032 -30429 -26287
13576 -26287 -26289 -24060 -16539 -19312 -13366 -6190 -2850 -3013 -8838 -23138 -31961 -30480 -25653 -22564 -23207
13561 -23207 -22735 -23182 -19041 -26624 -24650 -19507 -17411 -13381 -10665 -14089 -17285 -17973 -15790 -11069 -15634
13546 -15634 -23487 -28187 -32883 -29833 -22113 -16155 -18693 -19832 -7486 5926 2477 -506 -817 -2143
13532 -2143 -13290 -21309 -17846 -15563 -9070 -5928 -1657 6610 15025 11761 3416 -4734 -14881 -20573
13518 -20573 -20535 -30560 -34373 -29832 -33217 -36934 -44776 -51856 -53103 -43961 -34169 -27769 -31517 -35907 -33440
13503 -33440 -34037 -34353 -42184 -43979 -45676 -40159 -33146 -38495 -41860 -42402 -28042 -20651 -16542 -8116 -14256
13488 -14256 -16912 -21949 -31120 -25807 -17968 -15420 -10681 -8099 -11998 -16777 -25658 -25621 -25150 -31293 -29522
13473b9522J151K342m731o192L216O217K494K177R992Q362k504p485K879k806
13459a4410r461k350K352M861l747k683M582J3585j547j0501j614o410L922N915
13445a7506j79J208K198m395o175J843k409J975p29P134L635J729j95J039N174
13430e653k146n175n938j173L84l595M180L68k06N453M413j0420j3439P73O064
13415b6110n22j038k629N272R681Q74p59j64m571k855o887j936N45O300N595k769
13399b1973j0383j346K958M263p026J319O658O052L155N078P05J347n680m251
13385a9124n67Q337m901n246K844J314l349k806j800p15J681j068N830N901q346
13370b2015k871r32k624J840j498l501q147K817R577O572m295j3845M96Q846K542
$$ plain form
13473 -29522 -28371 -26029 -30760 -36952 -33736 -27519 -25025 -22848 -12856 -4494 -6998 -14483 -11604 -14410
13459 -14410 -23871 -26221 -23869 -19008 -22755 -25438 -20856 -7271 -8818 -19319 -20933 -27343 -23421 -17506
13445 -17506 -17685 -16477 -14279 -18674 -24849 -23006 -25415 -23440 -24169 -17035 -13400 -11671 -11866 -10827 -5653
13430 -5653 -7799 -12974 -18912 -20085 -19701 -23296 -19116 -18748 -18954 -13501 -9088 -19508 -32947 -32174 -26110
13415 -26110 -26632 -27670 -30299 -25027 -15346 -14472 -15231 -15395 -19966 -22821 -29708 -31644 -31099 -24799 -19204 -21973
13399 -21973 -32356 -33702 -30744 -26481 -33507 -32188 -25530 -19478 -16323 -11245 -10540 -9193 -14873 -19124
13385 -19124 -19691 -11354 -16255 -21501 -18657 -17343 -20692 -23498 -25298 -26013 -24332 -25400 -19570 -13669 -22015
13370 -22015 -24886 -25818 -28442 -26602 -28100 -31601 -39748 -36931 -27354 -20782 -25077 -38922 -38426 -29580 -27038
13355b7038K440P43o937l148N551M375l753K534O42j410J529J816P885M390o729
13340a7110P63o657k16l415l331L521R12j09r174m942O098O379m551M237N406
13325b2189R47m57O32j1101r152l915Q892J1371J883m118k701J922J953J401k052
13310b6684k759j1289L024J2130m128j88K82n715J908k079m378P978N732J1435
13296a4731j497K603m96J918m221n964L51K591N997o110q807p082J709L742m346
13281c4343m788L132R916n585m373m925M164J0870P793J618j0999j3145K784O939
13267c0942M123J524L278q7k832L029N984k268k399k99p781L096Q260K819k58
13252a4753k598O718p39q59P361J76o800o392M161L415j89l262q806p418K803
$$ plain form
13355 -27038 -24598 -23855 -30792 -33940 -28389 -24014 -27767 -25233 -24591 -26001 -24472 -22656 -14771 -10381 -17110
13340 -17110 -16347 -23004 -23220 -26635 -29966 -26445 -25533 -25642 -34816 -39758 -33660 -27281 -31832 -27595 -22189
13325 -22189 -21242 -21699 -21067 -32168 -41320 -45235 -36343 -24972 -23089 -27207 -29908 -27986 -26033 -24632 -26684
13310 -26684 -29443 -40732 -37708 -25578 -29706 -29894 -29612 -35327 -33419 -35498 -39876 -31898 -26166 -14731
13296 -14731 -16228 -13625 -14121 -12203 -16424 -22388 -22037 -19446 -13449 -19559 -28366 -35448 -33739 -29997 -34343
13281 -34343 -39131 -35999 -26083 -31668 -36041 -40966 -36802 -25932 -18139 -16521 -27520 -40665 -37881 -30942
13267 -30942 -26819 -25295 -22017 -22104 -24936 -21907 -15923 -18191 -20590 -20889 -28670 -25574 -17314 -14495 -14753
13252 -14753 -17351 -10633 -11372 -12231 -4870 -4694 -11494 -17886 -13725 -10310 -10499 -13761 -22567 -29985 -27182
13237b7182L484N021m483K75O068K01k744M625J199J367Q76q80J884N687J939
13222b663N587P780R302R232Q663J5360L1240N2478O4219L2667q281m3811o0532
13209A21241m7500k8854j6257j6493r527j3348o798N414J637L022l64K740R83
13196d104j0032k249M628Q631N455J3917k558j8045r305O330P434J695M671O966
13182A3434m474K860N131P969n04N539J3207J8806K0041L1694O1829R5028J50761
13169D21321J85430J34853J1835j28551j87214j55115j02106o6734m7754j4476
13159E1489j0222j1951j0680q414j1295j0557j874O751J871K519m667j094M42
13146g682k75N184R144p20k504K83o950m218O471N273P472N392P987J1152J0593
$$ plain form
13237 -27182 -23698 -18677 -23160 -22885 -16817 -16616 -19360 -14735 -13536 -12169 -11293 -12173 -10289 -4602 -2663
13222 -2663 2924 10704 20006 29238 37901 53261 84501 136979 201198 233865 225584 181773 121241
13209 121241 73741 44887 28630 12137 2610 -10738 -17536 -12122 -10485 -7463 -7827 -5087 -4104
13196 -4104 -14136 -16385 -11757 -3126 2329 16246 13688 -4357 -13662 -7332 102 1797 6468 13434
13182 13434 8960 11820 16951 24920 24416 29955 43162 61968 82009 113703 175532 270560 421321
13169 421321 606751 741604 753439 624888 437674 282559 180453 113719 65965 51489
13159 51489 41267 29316 18636 10222 -1073 -11630 -13504 -6753 -4882 -2363 -7030 -8124 -7682
13146 -7682 -7957 -2773 6371 5651 3147 3430 -3520 -7738 -1267 4006 11478 16870 24857 36009 46602
13131D6602N342P004J7127L5936N7136R2504J43552J86225J57687M0931j12786
13120F77260j83743j70012j32098p3507l2950k0753k3102q496J030o456j7189
13109I984l040k867p779l570l81m570j539k802N480J3431P76q877q910m076M982
13094a3758m267j0547k698Q986K263K664J1266J1244M772Q089J3482N541K921
13081C9958K2138L8918O7482N0550K0306j6985n2055n8923m3484l4473k0054p515
13069E863p412J750j6525n444n841k306m642k330K524N736K482L219O052n745
13055b2619m231j095P854n692k123N127o062J655M983o681l820J376O752R872
13041a4704M806q465q695K219K519k96M618k72m538O528q66K318O020O73k336
$$ plain form
13131 46602 51944 58948 76075 112011 169147 261651 405203 591428 749115 790046 677260
13120 677260 493517 323505 191407 117900 84950 64197 41095 32599 33629 27173 9984
13109 9984 6944 4077 -3702 -7272 -7653 -12223 -13762 -16564 -11084 2347 3123 -5754 -14664 -18740 -13758
13094 -13758 -18025 -28572 -31270 -22284 -20021 -17357 -6091 5153 9925 18014 31496 37037 39958
13081 39958 62096 101014 168496 219046 239352 222367 170312 111389 67905 33432 13378 5863
13069 5863 -1549 201 -16324 -21768 -27609 -29915 -34557 -36887 -34363 -28627 -26145 -22926 -16874 -22619
13055 -22619 -26850 -27945 -20091 -25783 -27906 -22779 -28841 -27186 -22203 -28884 -32704 -31328 -24576 -14704
13041 -14704 -9898 -18363 -27058 -24839 -22320 -22616 -17998 -18270 -22808 -16280 -17146 -14828 -8808 -8135 -10471
13026a0471l302L419N164n017j2391j3843P820k765K330J5448Q212r445l396J321
13012a6916n940m402n741k876K888Q426L667L18q474m375OK188r44O862M746l15
12996b0882n271P166P002J615p826p059O246Q754L413L822m717K449Q159j867
12982A004n750J594O169J976k265J946J856p365l591m770j056P202J08j1661m347
12967a8950M421J0291l517m085k445N71N797J110j341j1351p516J551O819n45
12953a9190J0835p844J365O320M906K695Kn161q986p823k902L530R314M700j1278
12938a9517L05m039q065L786P573j709l925R804m92K990k422p583o45N649r32
12923a9222N240r8O850L12J837P047J703j917J14l196m747J29M560m445j1963
$$ plain form
13026 -10471 -13773 -10354 -5190 -10207 -22598 -36441 -28621 -31386 -29056 -13608 -5396 -14841 -18237 -16916
13012 -16916 -22856 -27258 -32999 -35875 -32987 -24561 -20894 -20576 -29050 -33425 -33419 -31231 -32175 -25313 -20567 -20882
12996 -20882 -26153 -18987 -11985 -10370 -18196 -25255 -19009 -10255 -6842 -3020 -7737 -5288 2871 1004
12982 1004 -4746 -3152 3017 4993 2728 4674 6530 -835 -4426 -9196 -10252 -3050 -2942 -14603 -18950
12967 -18950 -14529 -4238 -7755 -11840 -14285 -13714 -7917 -6807 -8148 -19499 -27015 -25464 -18645 -19190
12953 -19190 -8355 -16199 -14834 -8514 -3608 -913 -911 -6072 -15058 -22881 -25783 -22253 -12939 -8239 -19517
12938 -19517 -19212 -23251 -31316 -27530 -19957 -21666 -25591 -15787 -16279 -13289 -15711 -23294 -23939 -18290 -19222
12923 -19222 -13982 -14080 -7230 -6918 -5081 1966 3669 1752 1866 -1330 -6077 -5948 -1388 -5833 -17796
12908a7796l435M404l364j1271M631J093j324M3L674j810J32L631L278l473N534
12893a6053K709o378J0397L023M011r390l10K451o855k885k109k410m599J366
12879b7032O819N102K479o455l48M425l274K782L734K701j659l832o331j74m000
12864b5063l897R523R829J562o342j139N560J717L585m331o256q344q723J1190
12850b1129j067M653P560n85o747k675l992M034N931J285K348P106J0977K192
12836I891k041l075J409l226p075j450Q35m02M486R667J49o886j847o414m106
12821a0085n439n279L67J0566M890M21n102l648m476N897P969O12l451M314q060
12806a0504m299J3742J81L864R48p394k942N296O868o074L889L994j2935p762
$$ plain form
12908 -17796 -21231 -16827 -20191 -31462 -26831 -25738 -27062 -27019 -23345 -25155 -25023 -21392 -18114 -21587 -16053
12893 -16053 -13344 -19722 -9325 -6302 -2291 -11681 -11991 -9540 -16395 -19280 -21389 -23799 -28398 -27032
12879 -27032 -20213 -15111 -12632 -19087 -19435 -15010 -18284 -15502 -11768 -9067 -10726 -14558 -20889 -21063 -25063
12864 -25063 -28960 -19437 -9608 -8046 -14388 -15527 -9967 -8250 -4665 -8996 -15252 -23596 -32319 -21129
12850 -21129 -22196 -17543 -9983 -10568 -17315 -19990 -23982 -19948 -14017 -12732 -10384 -3278 7699 9891
12836 9891 7850 4775 6184 2958 -4117 -5567 -4732 -5134 -648 9019 9168 2282 435 -5979 -10085
12821 -10085 -15524 -20803 -20436 -9870 -4980 -4559 -9661 -13309 -17785 -11888 -3919 -3307 -6758 -2444 -10504
12806 -10504 -14803 -1061 -880 2984 3932 -3462 -6404 -1108 5760 -314 3575 7569 -5366 -13128
12792a3128j43k144P23K049P087Q284j1806m399m81L015J316o817q505R56R806
12777a4187O669L698K826j0907l597K495k144k443O719p445L209J0441J586P130
12763D050j084l864L258m004j2338l020K958k314m133M45J084P324Q917O861K550
12748F690P651o02Q142R73k956J874Q78R838j379J896L142r42k33q493j5229r649
12732A601k881m411K940l068N591K542m028l913n684L575O91k088k343K80R56
12717a0240J425M573J280r034p472j204R483J455m425J325M990M942L366k143
12703a679K306k965j659k946o48l62l48P433n924o991j230M689k357m513m89K895
12687a4788o073k009N189L030k360J530M837j0733j0307j06K255O022L262N75
$$ plain form
12792 -13128 -13271 -15415 -14692 -12643 -5556 2728 -9078 -13477 -13958 -10943 -9627 -16444 -24949 -23993 -14187
12777 -14187 -7518 -3820 -994 -11901 -15498 -13003 -15147 -17590 -10871 -18316 -15107 -4666 -3080 4050
12763 4050 2966 -898 2360 -1644 -13982 -17002 -14044 -16358 -20491 -20046 -18962 -11638 -2721 4140 6690
12748 6690 14341 13739 21881 22854 19898 21772 22650 32488 31109 33005 36147 35205 34972 26479 11250 1601
12732 1601 -1280 -5691 -2751 -5819 -228 2314 -1714 -5627 -11311 -7736 -7045 -9133 -11476 -11196 -10240
12717 -10240 -8815 -4242 -2962 -11996 -19468 -20672 -11189 -9734 -14159 -12834 -7844 -2902 464 -1679
12703 -1679 627 -2338 -3997 -6943 -7591 -7953 -8301 -868 -6792 -13783 -15013 -10324 -12681 -17194 -17683 -14788
12687 -14788 -20861 -22870 -17681 -14651 -17011 -15481 -10644 -21377 -31684 -31790 -29535 -23513 -20251 -19676
12673a9676M105J837J898q017J4k225M580L748L672K37l020k728J305j811k669
12658a8750K389k799l508l168J979j837K384k575n528L342J4921K814j4294o351
12644c0981l417r25M431J641n213M11M724P2L5M137o48k481q287o169J516j123
12628d2277K279J0064P88l302j031k695J174O831l23o95L491K843J073k955o141
12613c0876M7M878P519j224j717k670r30k93J0407Q47O18J493l000r520j4616
12598c9037M597J4703N466K210o800j252m218P028N889o963q918K642N058Q644
12584a0951O242k056j2731k277M333M312j526M714M298P524n955p018j232l69
12570a2692j859K267J1142J293q177m166k704o039M930N431L319J943K537L22
$$ plain form
12673 -19676 -15571 -13734 -11836 -19853 -19839 -22064 -17484 -13736 -10064 -9827 -12847 -15575 -14270 -16081 -18750
12658 -18750 -16361 -19160 -22668 -25836 -23857 -25694 -23310 -25885 -31413 -28071 -13150 -10336 -24630 -30981
12644 -30981 -34398 -35323 -30892 -29251 -34464 -34053 -29329 -29257 -29222 -25085 -25733 -28214 -36501 -42670 -41154 -42277
12628 -42277 -39998 -29934 -29146 -32448 -33479 -36174 -35000 -28169 -28492 -29187 -25696 -22853 -21780 -24735 -30876
12613 -30876 -30829 -25951 -18432 -19656 -21373 -24043 -24973 -25266 -14859 -14012 -13394 -11901 -14901 -24421 -39037
12598 -39037 -34440 -19737 -14271 -12061 -18861 -20113 -24331 -17303 -11414 -18377 -27295 -24653 -19595 -10951
12584 -10951 -4709 -6765 -19496 -21773 -17440 -13128 -14654 -9940 -5642 1882 -4073 -11091 -12323 -12692
12570 -12692 -14551 -12284 -1142 151 -8026 -12192 -14896 -20935 -16005 -10574 -7255 -5312 -2775 -2453
12556b453R87l417n958l412m682j104N572N525N846O99n274J267O211j696n116
12541g005J532O397j708Q107K599m815P327M552n52n696j3185o677O37M067J228
12526c192Q348K018M983M615K392N271P468K779L54P578J0772J666J110k409r144
12511D4609r672q695o222k78l391l510L707m22m122k903K202N206L79q434j857
12496F597K25J119L133l314K277m244n995J79O031L412J866K248K035n742o163
12481C664j375m097L769M439n69K695K271O6r604l094K875k30K26J187p756o085
12465a1618J2518L621n332q033n46K101l909P149J1993Q777J4178J6495J0045
12452E7439L647K074L548r23m926p14k102j0809j0948k867p490p433o230O263
$$ plain form
12556 -2453 -1466 -4883 -10841 -14253 -18935 -20039 -14467 -8942 -3096 -2397 -7671 -6404 -193 -1889 -7005
12541 -7005 -5473 924 -784 7323 9922 5107 12434 16986 16434 10738 -2447 -9124 -8487 -4420 -3192
12526 -3192 5156 7174 12157 16772 19164 24435 31903 34682 35036 42614 53386 55052 56162 53753 44609
12511 44609 34937 26242 20020 19742 16351 12841 16548 16126 12004 9101 11303 16509 16888 8454 6597
12496 6597 6822 7941 11074 7760 10037 5793 -202 -23 6008 9420 11286 13534 15569 9827 3664
12481 3664 2289 -1808 1961 6400 5831 8526 10797 10863 1259 -1835 1040 810 1036 2223 -5533 -11618
12465 -11618 900 4521 -811 -8844 -9390 -7289 -11198 -4049 7944 16721 30899 47394 57439
12452 57439 61086 63160 66708 65785 60859 60145 58043 47234 36286 33419 25929 18496 12266 18529
12438A8529O242P121R451N552k227j680Q182J1756r88j2469L237n052J854J3191
12424F2699J4962J0333J1112J6673J1144K3148K4737L2756L3665L3471M7414O7516
12412C89630R8139J23981J57132J90595J99198J99606J83716J33444O4843l545
12402A736739o7204j37181j84617k14016k09609j86895j65438j28804r9810o5158
12392B78007l7851k5363k0051k5650k5542j3168j4259o931j0048j8246j0951o736
12380F3211q699N423K958n504l816p120n118M224Q558R61n906Q080P480j301m658
12365E8773l850M23k561j26p356R08K815R542M256j054n944m329k895n518j176
12350D1908k35p659r80n552O916j1004l690K734J756M141J109J720k614j885p251
$$ plain form
12438 18529 24771 31892 41343 46895 44668 42988 51170 62926 61938 49469 52706 47654 49508 62699
12424 62699 77661 87994 99106 115779 126923 150071 174808 207564 241229 274700 322114 389630
12412 389630 487769 611750 768882 959477 1158675 1358281 1541997 1675441 1740284 1736739
12402 1736739 1669535 1532354 1347737 1133721 924112 737217 571779 442975 343165 278007
12392 278007 240156 214793 194742 169092 143550 130382 116123 109192 99144 80898 69947 63211
12380 63211 54512 59935 62893 57389 53573 46453 41335 45559 54117 55078 49172 57252 64732 63431 58773
12365 58773 54923 55346 52785 52659 45303 46211 49026 58568 62824 61770 55826 51497 48602 43084 41908
12350 41908 41673 34014 33034 27482 34398 23394 19704 22438 24194 28335 29444 31164 28550 26665 19414
12335A9414J245Q325J4086R998M524L511L477P147K064P585N038P94O710J1274
12321A05192j860o959M208J121o033M685J0590J3252J4562M049j1751j9175j0271
12308A01610l413o662j0701q008o264j667j586p113j0930j5492j6364O373O017
12295B5800l834o561j213L798r35K382Q724J0078M349p96M639J1358J7875J7288
12281I2952J1100Q562j918j1455j4792q783l822K744K776n484l530J0759J1317
12268I0426J6222K686r264j4288m614n931L418J1910O738o885k404k87K107j715
12254H8119L058N940O749J3555J8702K3927L0243L3155L4560L4542K6090K6826
12242C45466P861l458m689L241J9613M4345L3427j7090o1760p2728n9040l9409
$$ plain form
12335 19414 20659 28984 43070 53068 57592 61103 64580 71727 73791 81376 86414 87208 93918 105192
12321 105192 103332 96373 100581 101702 95669 100354 110944 124196 138758 142807 131056 111881 101610
12308 101610 98197 91535 80834 72826 66562 64895 63309 56196 45266 29774 13410 19783 25800
12295 25800 21966 15405 14192 17990 17055 19437 28161 38239 42588 41792 46431 57789 75664 92952
12281 92952 104052 112614 110696 99241 84449 75666 71844 74588 77364 71880 68350 79109 90426
12268 90426 106648 109334 100070 85782 81168 75237 78655 90565 97303 90418 88014 87727 89834 88119
12254 88119 91177 97117 103866 117421 136123 160050 190293 223448 258008 292550 318640 345466
12242 345466 353327 349869 345180 348421 368034 412379 445806 428716 366956 294228 235188 195779
12230A95779k4440j0670q015j1314m387q616j4285l538j0888j0767l417m509n072
12217G5861M92l229l720J571M917P338O26M668P128n330k056J459L878q94k196
12202I0513Q965K2236J9439J5427O824j33J0375K2385K4519N4353N6857J6894
12190C48654l0605o2097o3198m7844l5529k2288j2469l909p852o76M282K002N676
12177G4147Q611J1814J6978K109K326J2490J8646J5577Q809J4749N518J5626J4781
12164B22181P826O400n738j609J516n055n016J2711O827j089n287k835j398P030
12150B36464Q729R476J6729J1304J497j0900j3228j8436j6427q898O69p149j3406
12137A96424k1240p271k141O07r787m014L128l769J535R689J9603J6783J4278
$$ plain form
12230 195779 171339 160669 152654 141340 136953 128337 114052 110514 99626 88859 85442 80933 75861
12217 75861 76353 73124 69404 70975 75892 83230 83856 88524 95652 90322 88266 89725 93603 92709 90513
12202 90513 99478 121714 141153 156580 163404 163271 173646 196031 220550 274903 331760 348654
12190 348654 318049 255952 192754 144910 109381 87093 74624 70715 62863 62187 66469 68471 74147
12177 74147 82758 94572 111550 113659 115985 128475 147121 162698 171507 186256 191774 207400 222181
12164 222181 230007 236407 230669 229060 230576 225521 220505 233216 240043 238954 233667 230832 229434 236464
12150 236464 245193 254669 271398 282702 284199 273299 260071 241635 225208 216310 216979 209830 196424
12137 196424 175184 167913 165772 166379 156592 152578 155706 151937 153472 163161 182764 199547 213825
12124B13825J6174K0109K5834K8839K2774J0478J2019J2469J0704J3155J295j343
12112C86332J849J934K271n404n712N78j670M51o92J129n148r289j499n512n854
12097C53764M976j030K262M683R205J4732J0432P056P432O160K03N43R573J2619
12083D42610J2350J4930R772K712O270J5143K0838J3132J5828J1396O430J5525
12071E86936J547J644L593L750O041m246M838R992J8561L5820M1946L7801L6758
12058G84981M7098M6406M8606M3324L7355N5750O6809O6673O9189Q2078R0207
12047A438476Q9399J13498J30567J57489J89812K40824L50757M97853N97805O57372
12037D463852P21028P79336P09286M84470K57516M7606j95363m38010n78276n96467
$$ plain form
12124 213825 229999 250108 275942 304781 327555 338033 350052 362521 373225 386380 387675 386332
12112 386332 388181 390115 392386 386982 381270 381848 380178 380629 379937 381066 375918 366629 365130 359618 353764
12097 353764 358740 357710 359972 364655 373860 388592 399024 406080 413512 419672 419875 420418 429991 442610
12083 442610 454960 469890 479662 482374 488644 503787 524625 537757 553585 564981 571411 586936
12071 586936 588483 590127 593720 597470 603511 599265 604103 614095 632656 668476 710422 748223 784981
12058 784981 832079 878485 927091 970415 1007770 1063520 1130329 1197002 1266191 1348269 1438476
12047 1438476 1527875 1641373 1771940 1929429 2119241 2360065 2710822 3208675 3806480 4463852
12037 4463852 5184880 5964216 6673502 7157972 7415488 7463094 7267731 6829721 6251445 5654978
12027E654978n68188m87547l72643k20812p6095L4798J11152J73718K19991K72807
12017D742159L32683M07443M96850O09497P35655R17980J157840J436404J777382
12008A2613893K101573K407660K715972L020984L260322L449825L716161M184750
12000C7471140M976660O310132Q641653J2656923J8963798K6715229L2472299
11993A48207834L5925823L8637092L9270651L3913881K2661949J0392296j422259
11986C27587267j3525312k6795030l6428959m0164493l9512483l7259255l2844786
11979A01056949k5933320j8352807j1896670p535796n000978l633760k885932
11972B5817686k497830k343159k309543k240402k069501j859633j636263j379999
$$ plain form
12027 5654978 5086790 4599243 4226600 4005788 3929693 3964491 4075643 4249361 4469352 4742159
12017 4742159 5074842 5482285 5979135 6588632 7324287 8242267 9400107 10836511 12613893
12008 12613893 14715466 17123126 19839098 22860082 26120404 29570229 33286390 37471140
12000 37471140 42447800 48757932 57399585 70056508 89020306 115735535 148207834
11993 148207834 184133657 222770749 262041400 295955281 318617230 329009526 327587267
11986 327587267 314061955 287266925 250837966 210673473 171160990 133901735 101056949
11979 101056949 75123629 56770822 44874152 37338356 32337378 28703618 25817686
11972 25817686 23319856 20976697 18667154 16426752 14357251 12497618 10861355 9481356
11964I481356j106360q60886o85603n63205m66406m09800l79589l56494l28456
11955D324557l11777k90733k68837k55360k24447j96776j70265j55182j35851
11946B315329j09710j06428q8993q4617o9260o1482n1128n0275m2700m5376m7891
11935A557469m4111m9798m6055m7516l9520l7691l9963l4296k6813l1628k6494
11924A133584l2127l1988m2376l4405l3883k5854k5670j4471m742j2927o274l349
11912H65518j1799k3453k9207k2557l2533l3538l9995k7977k7220k6100k4334
11901E66805j9852r431l344n686r137l72l02L762o954l939o802p713Q57j390j6491
11886D80011j3575q113l054j660k553j0618j5922m468n019m649r414j6659j7771
$$ plain form
11964 9481356 8374996 7514110 6828507 6265302 5798896 5389096 5009507 4653013 4324557
11955 4324557 4012780 3722047 3453210 3197850 2973403 2776627 2606362 2451180 2315329
11946 2315329 2205619 2099191 2010198 1925581 1856321 1794839 1743711 1693436 1650736 1605360 1557469
11935 1557469 1513358 1463560 1417505 1369989 1330469 1292778 1252815 1218519 1191706 1160078 1133584
11924 1133584 1101457 1069469 1027093 992688 958805 932951 907281 892810 888068 875141 868867 865518
11912 865518 853719 830266 801059 778502 745969 712431 672436 644459 617239 591139 566805
11901 566805 546953 537522 534178 528492 519355 518983 518681 522443 515489 511550 504748 497035 497892 496502 480011
11886 480011 466436 458323 455269 453609 451056 440438 424516 420048 415029 410380 400966 384307 366536
11873C66536j0534j3675j4002j8507o431l408L704M876M22l4L898o177j2156n776
11859B88736j145K459j096l493l235m113K218J3537J4161J0661K898N72o3n044
11845C17053j565m781j1630j0792p860j4866j0693j1621j4846p784j4490p383
11833A98742q725M919M556L692K342p415o320j613K415j873O854j089j5252p214
11819A74019o931n768q921r360p047l015j073n484m613J074R372N36L125J1070
11805A46984J2586J1525Q44R103J1165M523P915P372L448N304O913J1871P070
11792B46623j789p315n542r259j2824k2767q389k225j7000j2708q285J1628Q320
11779A58468J1883P951k34R90m05o702K634p652J547N669J365j078j301l519N070
$$ plain form
11873 366536 356002 342327 328325 309818 303387 299979 303683 308559 308981 308947 312845 306668 294512 288736
11859 288736 287591 290050 288954 285461 282226 278113 280331 293868 308029 318690 321588 322160 322097 317053
11845 317053 315488 310707 299077 288285 280425 265559 254866 243245 228399 220615 206125 198742
11833 198742 190017 194936 199492 203184 205526 198111 191791 190178 192593 190720 197574 196485 181233 174019
11819 174019 167088 161320 152399 143039 135992 132977 131904 126420 121807 122881 132253 132789 135914 146984
11805 146984 159570 171095 171939 181042 192207 196730 204645 212017 215465 220769 227682 239553 246623
11792 246623 244834 237519 231977 222718 209894 187127 178738 176513 159513 146805 138520 150148 158468
11779 158468 170351 178302 178068 179058 178653 171951 174585 166933 168480 174149 175514 174436 173135 169616 174686
11764A74686l674r351K851Q346J432N612K388j060P098L096j6248k0297j1707
11751A43172j2182j3691p323K96m163j374J1623J1919Q560O327L640J323l729
11738A44398q137M39J592J170j4846n717j347p998j529j917m056k997O328Q62
11724A06245P674P220J37n736k600N403N853n069k410m149o191o71M494K67N68
11709A11035j594K85J0857L499o777J471j286O98Ml911j4127K609J1338R538J958
11694A25597K938O545L050R49j1811j6702r847J3056J0870J966L60O673j12k879
11680A30653q510j662m24l956K403q305r494p075n969m89j628j3827j0933N060
11666F5844l597k635m006l960K214p18M202L701j1473j280J311O48P858J1755
$$ plain form
11764 174686 171012 161661 164512 172858 174290 179902 182290 181230 188328 191424 175176 154879 143172
11751 143172 130990 117299 109976 110272 106109 104735 116358 128277 136837 143164 146804 148127 144398
11738 144398 136261 136700 138292 139462 124616 118899 117552 109554 108025 106108 102052 99055 105383 106245
11724 106245 113919 121139 121276 115540 112940 118343 124196 119127 116717 112568 106377 105706 110200 110467 111035
11709 111035 109441 109726 120583 124082 117305 118776 117490 118188 118192 114281 100154 102763 114101 123639 125597
11694 125597 128535 135080 138130 139079 127268 110566 100719 113775 124645 126611 126971 133644 133532 130653
11680 130653 122143 120481 120057 116101 118504 110199 100705 93630 87661 87172 85544 71717 60784 65844
11666 65844 62247 59612 55606 51646 53860 53142 57344 61045 49572 48292 49603 50251 58109 69864
11652F9864q585o428L152K411M337O120r00M525p902l807L668M694L480L885k549
11637G5965M608o968l742K063l904n942l688K217R816J2402Q174k99L152n599
11623H8255p403L659Q428p49q503N170P528M745J920J789j124Q780L6j011N778
11608A17298n090j1981r475j2361j3170n202J4446O324M253K552L776j276M797
11595I4891m55K557o694j5682J041J1257N279J0552Q028J0464J1794O021J2758
11582A51811J6437K2058L2233L0685K7370L9246M5165O1140R3549J23815J52206
11571G95715J73793J94368K07779J88118J35423O9590J3505m9509j16908j79700
11561A432174k08957k05696j94884j79019j40672j08735p2791n3300m0396k4222
$$ plain form
11652 69864 61279 54851 58003 60414 64751 70871 69971 74496 66594 62787 66455 71149 74629 78514 75965
11637 75965 80573 73605 69863 71926 68022 62080 58392 60609 70425 82827 91001 90702 93854 88255
11623 88255 80852 84511 92939 92190 83687 88857 96385 101130 103050 104839 103715 112495 112531 111520 117298
11608 117298 112208 100227 90752 78391 65221 60019 74465 80789 85042 87594 91370 90094 94891
11595 94891 94436 96993 90299 74617 75658 86915 92194 102746 110774 121238 133032 139053 151811
11582 151811 168248 190306 222539 253224 280594 319840 365005 426145 519694 643509 795715
11571 795715 969508 1163876 1371655 1559773 1695196 1764786 1778291 1728782 1611874 1432174
11561 1432174 1223217 1017521 822637 643618 502946 394211 321420 268120 227724 203502
11551B03502j7409j6258j5038r631j7846r796j2259n761r908j1131p227k601M62
11538F9099K764m948J31L261m406j344L621K102r125q643r446j708M308O38j633
11523D4671n114L390M997K490K437j767N479R025m585l669N484Q866n772p845
11509E8087j410l685q827m279L205L660K300n263K939N457O045J754M360m151
11495F0192o068o120r609J902J1146j485Q764P808k114k553O394O828M027M391
11481H3503j470o22P133M904m304r789k755n110j291m940K514n298l217p612p389
11466D4257l014l296M095L099m053j9N886n195k607o321r095J3595J0323k589
11452D5066n895j2628n116k140r459O97R613J301O9j629k567J347P151R168K929
$$ plain form
11551 203502 186093 169835 154797 145166 127320 117524 105265 99504 89596 78465 71238 68637 69099
11538 69099 71863 66915 67046 70307 65901 64557 68178 70280 61155 52512 43066 41358 45666 46304 44671
11523 44671 39557 42947 47944 50434 52871 51104 56583 65608 61023 57354 62838 71704 65932 58087
11509 58087 56677 52992 44165 39886 43091 46751 49051 43788 46727 52184 58229 59983 64343 60192
11495 60192 54124 48004 38395 40297 51443 49958 58722 66530 64416 61863 68257 75085 79112 83503
11481 83503 82033 81411 88544 93448 89144 79355 76600 71490 70199 65259 67773 62475 59258 51646 44257
11466 44257 41243 37947 42042 45141 41088 41069 46955 41760 39153 32832 23737 37332 47655 45066
11452 45066 39171 26543 21427 19287 9828 10525 20138 21439 21508 19879 17312 18659 25810 34978 37907
11437C7907j879m021n122J912L837M164O710K347n809p622P04J2180M66J860j2037
11422C5597l267M080K066o650o160K371J114K937K243R064K437M406k908j2582
11408C4748L301L436j926p59N24N276Q143j682J1402J1945L703j079r319j631
11394F6082n905l433m990k666j59m138k904M366j253j553M523jn425m735L786
11379D1595l223q054j689O58P306R518l185j3467K179M941j380m848L682R364
11365D3397l116p040o42N914M506l086j241l138R431M171l828n738q649m962M573
11350C0552Q261L463O065j470r678q426K872L101k44k256n718k054L319O57K698
11335C1142J551J898K414M693P170Q07j749o320P653K719j1658j1261L41m13M131
$$ plain form
11437 37907 36028 32007 26885 28797 32634 36798 43508 45855 40046 32424 33128 45308 45774 47634 35597
11422 35597 32330 36410 38476 31826 25666 28037 29151 32088 34331 43395 45832 50238 47330 34748
11408 34748 38049 41485 39559 38800 39324 44600 52743 51061 62463 74408 78111 77032 67713 66082
11394 66082 60177 56744 51754 49088 48929 44791 41887 46253 45000 43447 47970 47969 42544 37809 41595
11379 41595 38372 30318 28629 29287 36593 46111 42926 29459 31638 36579 35199 30351 34033 43397
11365 43397 40281 33241 32599 38513 43019 39933 38692 35554 44985 49156 45328 39590 30941 25979 30552
11350 30552 38813 42276 48341 46871 37193 28767 31639 34740 34496 32240 26522 24468 27787 28444 31142
11335 31142 32693 34591 37005 41698 48868 49675 47926 41606 49259 51978 40320 29059 29400 28987 33118
11320C3118J0166O854J842k384k725K226m982n567l982m146j132N402M949K830
11306D2469k342m051k600J122O28m868k604q071K46O197N354K540j33n51Q996
11291D2332L459o698o218o614J829K794N4L079J0023q78L328K758j182m337O876
11276E0605J0913L619R206L0986K1430J6085J6635K569j7288j7019k6158k1110
11264H0473k4506r454K954L214k37J574o598l990L069k227p1q39p299R37M470
11249D1470L378K663q882o118Q463J0677K379L866j2630q344M575J71N386Q39
11235D7893j841N981M41p942J426P252J4465j09O06M019R656N032l674l919o400
11220G2886L395R820Q544R729O792P18l120q12j816M549n049O218R708K321j236
$$ plain form
11320 33118 43284 50138 51980 49596 46871 49097 44115 38548 34566 30420 29288 34690 39639 42469
11306 42469 40127 36076 33476 34598 35226 30358 27754 19683 19929 26126 31480 34020 33887 33336 42332
11291 42332 45791 39093 32875 26261 28090 30884 30938 34017 44040 43162 46490 49248 48066 43729 50605
11276 50605 61518 65137 74343 105329 126759 142844 159479 162048 144760 127741 101583 80473
11264 80473 55967 46513 49467 52681 52444 54018 47420 43430 46499 44272 44201 43362 36063 37000 41470
11249 41470 44848 47511 38629 32511 40974 51651 54030 57896 45266 36922 41497 41668 47054 47893
11235 47893 46052 52033 52474 44532 45958 53210 67675 67566 68172 72191 81847 86879 83205 79286 72886
11220 72886 76281 86101 94645 104374 111166 111884 108764 107952 106136 110685 105636 111854 121562 123883 122647
11205A22647J898J1301J2802L670M923J4403J2999J0003J4541J3747J857O530
11193B31321J4275J5783K1440K2757K7849J9696K4411J7352N384J8080J7647J6940
11181D52935J4021J7168K2686K1139L1777L7570L4180M112P175K4697M824o922
11169F65362o033j3946j5181K158R862J8909K0311J6120J8313K2382K0600K2173
11157G81030K1474J2918P395j1827k1790k0779k8236k4546k4191j8714j4408j0244
11145F48082j6456j9622q327M34o841k2964j3589j4163q500p716j7150j1146j1790
11132D90252j1715k048N763K864J5006M017R87O410k187J92N213p726j4927j4093
11118D78008k7032l1851l5015l6051l7311l2921k7329k5245j2977j2242j2479
$$ plain form
11205 122647 124545 135846 148648 152318 157241 171644 184643 194646 209187 222934 224791 231321
11193 231321 245596 261379 282819 305576 333425 353121 377532 394884 400268 418348 435995 452935
11181 452935 466956 484124 506810 527949 559726 597296 631476 635588 642763 667460 672284 665362
11169 665362 659329 645383 630202 632360 642222 661131 681442 697562 715875 738257 758857 781030
11157 781030 802504 815422 822817 810990 789200 768421 740185 715639 691448 672734 658326 648082
11145 648082 631626 612004 603677 604111 597270 574306 560717 546554 538054 530338 513188 502042 490252
11132 490252 478537 476489 482252 485116 500122 504139 505126 511536 509349 509541 514754 507028 492101 478008
11118 478008 450976 419125 384110 348059 310748 277827 250498 225253 212276 200034 187555
11107A87555n773k592j0717n428j0057p814j1597n573k054n500k831J142m620
11094A14141o432m594j814K644l306k571m729p821k257k711J047J422n107m819
11080G3093N05O83R80q857m731L811n305n660K158J0753Q338N231r85l937p677
11065F8400J753N175L510n693l403l436j688k205K171K743n604j210N405O10l676
11050F2852L304l434J000j274q246m653R657K425l147o275l08L823j2K476K305
11035F0493J520p763j723Q039L118k125p310L0K293m294P834M511m689m963k649
11020E2322M638R529n554O114O000M093K714l498j3377m212Q20J697K224j173
11006F2337P254J532q865P207K0850k654p109o824o173J55J1000J312k40j848
$$ plain form
11107 187555 181782 179190 168473 163045 152988 145174 133577 128004 125950 120450 117619 118761 114141
11094 114141 107709 103115 101301 103945 100639 98068 93339 85518 83261 80550 81597 83019 77912 73093
11080 73093 73598 74281 75261 66404 61673 65484 60179 54519 56677 67430 75768 80999 80014 76077 68400
11065 68400 70153 75328 78838 73145 69742 66306 64618 62413 64584 67327 61723 60513 65918 66528 62852
11050 62852 66156 62722 63722 62448 54202 49549 59206 61631 58484 52209 51901 55724 55712 58188 60493
11035 60493 62013 54250 52527 60566 63684 61559 54249 54279 56572 52278 60112 64623 59934 54971 52322
11020 52322 56960 66489 60935 67049 73049 77142 79856 76358 62981 58769 59589 61286 63510 62337
11006 62337 69591 71123 62258 69465 90315 87661 80552 73728 67555 67710 78710 80022 79782 77934
10992G7934j900L523k943j0229m160P662L681m968J503L178m634P09M016m664
10978F8708n733L214J538m649R526L652o836J196O716O738j281q424O094P014
10964H7473k963p391j655O054m942m10m472j1166K189K121L409J539M594Q639
10950H3019P895r79k020J606J0064J55q255r140J811l718l714P496J4463O12J167
10935A00462r94M284p004k686k444j1814r35J5M565J353N669m665L502o296M618
10920H7630L672n574q188M593O261O74O263n604j288J1492K814O493Q543J024
10906A18805m536m823M449l509m452o318n310L165K584O473R373l251q31o35K362
10891A13546o700o866M904Q293k87p940n524P402J198N283O143P682k514J889
$$ plain form
10992 77934 76034 79557 76614 66385 62225 69887 73568 68600 70103 73281 68647 69356 73372 68708
10978 68708 62975 66189 67727 63078 72604 76256 69420 70616 77332 84070 82789 74365 80459 87473
10964 87473 84510 77119 75464 81518 76576 76166 71694 60528 62717 64838 68247 69786 74380 83019
10950 83019 90914 89935 87915 89521 99585 99740 91485 82345 84156 80438 76724 84220 98683 99295 100462
10935 100462 99468 103752 96748 94062 91618 79804 78869 78884 83449 84802 90471 85806 89308 83012 87630
10920 87630 91302 85728 77540 82133 88394 89068 95331 89727 88439 99931 102745 109238 117781 118805
10906 118805 114269 109446 113895 110386 105934 99616 94306 97471 100055 106528 115901 112650 111819 111184 113546
10891 113546 106846 99980 104884 113177 112890 104950 99426 106828 108026 113309 119452 127134 124620 126509
10877A26509O749k560m16m158m9J44P029j0579j37O708K181L622o109O00O531
10862A36065j928j250J0715Q8k954o8J0246J1779J037M42p090n912m845n271K021
10847A43075O59O387J0101l664M557L661m922K294Q90l88k296j064J917L967O110
10832A71284J1814Q80L592J157O33K021K373j299j963o810L696Q192J6536J994
10818B14100k70j998M410M997k272J1838J7054K063Q052J0520Q59J1054J0713
10805B91120R537M638J3931J9414J2356J1910J0296J5930J9570J1898J1585K1841
10793D54026K2120J7611J3836J1022J8828J4745Q908L929P509K326L200J5013
10781E93073J3000O571N671N467L03J04M96N93J49j928M329J2046J4314O564R602
$$ plain form
10877 126509 133258 130698 130282 126124 126075 126219 133248 122669 122532 129240 131421 135043 128934 129534 136065
10862 136065 134137 132887 143602 143690 140736 140668 150914 162693 163730 164172 157082 151170 146325 141054 143075
10847 143075 143734 150121 160222 156558 161115 164776 159854 162148 163038 162650 160354 159290 161207 165174 171284
10832 171284 183098 183978 187570 188727 189360 191381 193754 192455 190492 183682 187378 195570 212106 214100
10818 214100 213830 211832 216242 221239 218967 230805 247859 249922 257974 268494 269353 280407 291120
10805 291120 300657 305295 319226 338640 350996 362906 373202 389132 408702 420600 432185 454026
10793 454026 476146 493757 507593 518615 537443 552188 561096 565025 572534 574860 578060 593073
10781 593073 606073 612644 618315 623782 624085 624189 624685 625278 625427 623499 627828 639874 654188 660752 670354
10766F70354J1756J6359J4734J1161K2019J5362J1551O728L213J5436K1127K644
10754H22444N339P763J8211K7257J6987O059J3807J6751O941L444r797j1038j9604
10741I04564l5732l9741l5570k4427k1481j9878j8819j4252j3318j1439K383Q938
10729F81228p137o824K940K411N966L785j276M176k884r959l867P06q522j8042
10715F42701r739j182r16j6824j4855k9922k5449j3183j3076j4477j7335j7432
10703D68311j1728j2064j7648j2277k738q11o406m07L027r067p31n065o561l16
10689C85519k464j045J101m376k006k899j4672l828K532J963K513K190K674L542
10675C70744k576L5j565L167J4570M699r207j1966r422o833j058R124L733k783
$$ plain form
10766 670354 682110 698469 713203 724364 746383 761745 773296 780024 783237 798673 819800 822444
10754 822444 827783 835546 853757 881014 898001 904060 917867 934618 941559 945003 935206 924168 904564
10741 904564 868832 829091 793521 769094 747613 727735 708916 694664 681346 669907 672290 681228
10729 681228 674091 667267 670207 672618 678584 682369 681093 685269 682385 672426 668559 669265 660743 642701
10715 642701 632962 631780 630864 614040 599185 569263 543814 530631 517555 503078 485743 468311
10703 468311 456583 444519 426871 414594 411856 411045 404639 404232 407259 398192 397461 392396 385835 385519
10689 385519 383055 382010 383111 378735 376729 373830 359158 355330 357862 359825 362338 364528 367202 370744
10675 370744 368168 368203 366638 369805 384375 389074 379867 367901 358479 351646 350588 359712 363445 360662
10661C60662L004J2992R162k222j2283J129M255J713M606O725N468k242n668Q27
10647C88128O621K062N038J2303N823n038n548J5397J5489K931K087N904j379
10634D49818m619J567N860J1358R177P207J96o637K855J3046P096m5K953j150
10620D98682r40j61Q183J0725p29l915M50J0275J3157M402O935N974M467Q122
10606E65627J2194O730Q858J1202R037L907M906K354m857n992Q539P147K894M586
10592F37132N454J800R223J0379K000L763M526K83o47n08N633l114K843Q292P799
10577F94858K924K247n170J0534M238N823N565J8980J4089O822O920R157K508
10564G79495Q74L418K072P691o18P880P991K5671J1312R925J1001P804M039n128
$$ plain form
10661 360662 363666 376658 385820 383598 371315 372444 376699 378412 383018 389743 395211 392969 387301 388128
10647 388128 394749 396811 401849 414152 419975 414937 409389 424786 440275 443206 445293 451197 449818
10634 449818 445199 446766 452626 463984 473161 480368 480564 473927 476782 489828 496924 496879 499832 498682
10620 498682 497742 497581 505764 516489 515760 511845 512295 522570 535727 540129 547064 553038 557505 565627
10606 565627 577821 584551 593409 604611 613648 617555 622461 624815 619958 613966 622505 629652 632546 637132
10592 637132 642586 644386 653609 663988 665988 669751 674277 674560 673913 673405 679038 675924 678767 687059 694858
10577 694858 697782 700029 694859 705393 709631 715454 721019 739999 754088 760910 767830 776987 779495
10564 779495 780369 783787 785859 793550 792932 800812 808803 834474 845786 855711 866712 874516 878555 873427
10550H73427l620P347N249J4671P493p26J525Q165J2350J3601O602J5424K990
10537I64498J0577J2628J4378K0968O113Q17J2133K0545J5538J8949J8777J4187
10525A130108J2652K0100J2803Q493K4884K2620J0078J6571K2079K4543K3078
10514A328009J6234J5332K6851J5047J5620J8770K5885K4962K9934K9494K3041
10503A569179J7761K0290J8777K5979K6634L2262K4777J5003K4362L0897K2112
10492A828033J5729J6436K8552K9591J7549K5799K5530K1678K2144K7082L3068
10481B091191L5011L1878J7899K6608L5278L9056L2371L2734L1996M2359M3249
10470B459630L2514L4495M7632M0582L6233L8218N2941M9385L9917M8144N4133
$$ plain form
10550 873427 869807 877154 882403 897074 904567 903841 905366 913531 925881 939482 946084 961508 964498
10537 964498 975075 987703 1002081 1023049 1029162 1029979 1042112 1062657 1078195 1097144 1115921 1130108
10525 1130108 1142760 1162860 1175663 1184156 1209040 1231660 1241738 1258309 1280388 1304931 1328009
10514 1328009 1344243 1359575 1386426 1401473 1417093 1435863 1461748 1486710 1516644 1546138 1569179
10503 1569179 1586940 1607230 1626007 1651986 1678620 1710882 1735659 1750662 1775024 1805921 1828033
10492 1828033 1843762 1860198 1888750 1918341 1935890 1961689 1987219 2008897 2031041 2058123 2091191
10481 2091191 2126202 2158080 2175979 2202587 2237865 2276921 2309292 2342026 2374022 2416381 2459630
10470 2459630 2492144 2526639 2574271 2614853 2651086 2689304 2742245 2791630 2831547 2879691 2933824
10459B933824M9553M2457N3535N9109O0445M8888N0911O6072O2329O2519P8959
10448C568601P8352P2486P1351Q7667R3532Q7823Q5569R2128J07078J04079J13903
10437D562569J13927J12075J25465J31223J33694J28247J47020J54766J49901
10428E758887J51366J71459J87737J93990J95803K03710K21836K35865K41608
10419G562261K58763K77904K82102L00351L18814L38523L55339L80170M07048
10410A0481275M35044M57000M88696N22003N66720O08329O45512O92676P51357
10401A5648612Q17604Q72589R38401J020487J106176J193204J289358J391885
10393B4278316J509812J622134J750634J890681K026177K185704K339764K493012
$$ plain form
10459 2933824 2983377 3025834 3079369 3138478 3198923 3247811 3298722 3364794 3427123 3489642 3568601
10448 3568601 3646953 3719439 3790790 3878457 3971989 4059812 4145381 4237509 4344587 4448666 4562569
10437 4562569 4676496 4788571 4914036 5045259 5178953 5307200 5454220 5608986 5758887
10428 5758887 5910253 6081712 6269449 6463439 6659242 6862952 7084788 7320653 7562261
10419 7562261 7821024 8098928 8381030 8681381 9000195 9338718 9694057 10074227 10481275
10410 10481275 10916319 11373319 11862015 12384018 12950738 13559067 14204579 14897255 15648612
10401 15648612 16466216 17338805 18277206 19297693 20403869 21597073 22886431 24278316
10393 24278316 25788128 27410262 29160896 31051577 33077754 35263458 37603222 40096234
10385D0096234K643711K797971K941298L055730L154021L215374L223526L167903
10377F4295768L061373K883819K643618K341597J994435J613830J234808Q78142
10369H0947390N43386K76153P5585l2138o8345k2794R3406K82419N31895Q44677
10359H3471634J253251J768192K476480L477068M646378N547219N930104O395068
10351A14965394O749600O645498N275711L814296K189855J217217l97629j779069
10343A38680873l231602l536726l491238l356027l339338l256864k916724k599494
10335A12952860k385237k343002k401170k461484k501368k522218k504196k443008
10327I3391177k347035k198580k021089j804874j574817j308360j040303p65207
$$ plain form
10385 40096234 42739945 45537916 48479214 51534944 54688965 57904339 61127865 64295768
10377 64295768 67357141 70240960 72884578 75226175 77220610 78834440 80069248 80947390
10369 80947390 81490776 81766929 81842514 81810376 81742031 81719237 81812643 82095062 82626957 83471634
10359 83471634 84724885 86493077 88969557 92446625 97093003 102640222 108570326 114965394
10351 114965394 121714994 128360492 133636203 137450499 139640354 140857571 140459942 138680873
10343 138680873 135449271 131912545 128421307 125065280 121725942 118469078 115552354 112952860
10335 112952860 110567623 108224621 105823451 103361967 100860599 98338381 95834185 93391177
10327 93391177 91044142 88845562 86824473 85019599 83444782 82136422 81096119 80330912
10319H0330912m91232k06895M0970K76547M85249O63373P98672Q58232Q45087
10310H3600915P56248N70156K94088p3646n20048j002756j525645k034419k494717
10301G7570176k894238l209219l433425l564092l601706l557430l466747l335814
10293E0507505l171179k986447k804062k615613k435042k258010k097919j936295
10285C0202938j792304j662901j525363j408243j308438j206894j112349j023933
10277A9162513r44866q73632q09009p54056p00479o62621o21524n69672n28806
10268A2697848m95139m62801m34942l93168l58761l36415k93090k41330j73363
10259I508839q4151n1011l6210P469J10050J07330M873j27699j83489j74837k51698
$$ plain form
10319 80330912 79839680 79632785 79673755 79950302 80435551 81098924 81897596 82755828 83600915
10310 83600915 84357163 84927319 85221407 85147761 84627713 83624957 82099312 80064893 77570176
10301 77570176 74675938 71466719 68033294 64469202 60867496 57310066 53843319 50507505
10293 50507505 47336326 44349879 41545817 38930204 36495162 34237152 32139233 30202938
10285 30202938 28410634 26747733 25222370 23814127 22505689 21298795 20186446 19162513
10277 19162513 18217647 17344015 16535006 15780950 15080471 14417850 13796326 13226654 12697848
10268 12697848 12202709 11739908 11304966 10911798 10553037 10216622 9923532 9682202 9508839
10259 9508839 9424688 9373677 9337467 9344936 9454986 9562316 9567189 9439490 9256001 9081164 8829466
10248H829466l86306n10530m93684m45780l90754l84098l57785k92191k31267
10239E337071j82939j50455j40645j27966j12823j06867j11984r8769r3146q7068
10229D124409q3699q9198p3221p9759r3604q0422p5341p2797o0344o2804n8618
10218C294602n8928o5492n9862m9965l9588n5454n5624m4646m2953m1433m4866
10207B735791l0933k5835k8032k7621l0813l4361l7495l9862l8483k8660k7621
10196B386075l1325k6228j9193k3842k8737k3092k8257j9421k4380k1956k1786
10185B117858j9371j9410j7385k4374l0160j8974j9339k4031k6161k9877k8809
10174A859967m4549m0763l0868k5316k6348k2566k0393k3677j8924k1354k1848
$$ plain form
10248 8829466 8443160 7932630 7438946 6993166 6602412 6218314 5860529 5568338 5337071
10239 5337071 5154132 5003677 4863032 4735066 4622243 4515376 4403392 4304623 4211477 4124409
10229 4124409 4040710 3951512 3878291 3798532 3704928 3624506 3549165 3476368 3416024 3353220 3294602
10218 3294602 3235674 3170182 3110320 3060355 3020767 2965313 2909689 2865043 2822090 2780657 2735791
10207 2735791 2704858 2679023 2650991 2623370 2592557 2558196 2520701 2480839 2442356 2413696 2386075
10196 2386075 2354750 2328522 2309329 2285487 2256750 2233658 2205401 2185980 2161600 2139644 2117858
10185 2117858 2098487 2079077 2061692 2037318 2007158 1988184 1968845 1944814 1918653 1888776 1859967
10174 1859967 1815418 1774655 1743787 1718471 1692123 1669557 1649164 1625487 1606563 1585209 1563361
10163A563361j8530j6346k1607k0097k0806k1298k1538j7522j0320j1957j8174
10152A365166j8217j6207p178j7713j8837j1977j4602k0991k5278j3182j5527
10141A185457j4296k509j836j1194j8033q775j0649j6255q282k535j5535j5600
10129A059958q618j0731j4289j6399j4054m647j810o263n596p417k4609p413N08
10116I38620J10j4381n895l763o107p415L628j4578j3928q633m881o331k726J248
10102H54968m728j0637M98l895n113j0718j0787n384j1722j305o857j3183p643
10089G63494k831o563p891j453L605r675n998o652j1583j2005k053p170K328J927
10075F97480m485l302j2748r626k144l66l273J722m240N823k328j0680q726L185
$$ plain form
10163 1563361 1544831 1528485 1506878 1486781 1465975 1444677 1423139 1405617 1395297 1383340 1365166
10152 1365166 1346949 1330742 1323564 1305851 1287014 1275037 1260435 1239444 1214166 1200984 1185457
10141 1185457 1171161 1168652 1166816 1155622 1137589 1128814 1118165 1101910 1093628 1091093 1075558 1059958
10129 1059958 1051340 1040609 1026320 1009921 995867 991220 989410 983147 977551 970134 945525 938112 938620
10116 938620 938730 924349 918454 914691 908584 901169 904797 890219 876291 867658 862777 856446 853720 854968
10102 854968 850240 839603 840101 836206 831093 820375 809588 804204 792482 791177 784320 771137 763494
10089 763494 760663 754100 746209 744756 748361 738686 732688 726036 714453 702448 700395 693225 695553 697480
10075 697480 692995 689693 676945 667319 665175 664809 661536 663258 659018 664841 662513 651833 643107 646292
10061F46292L57j0957n978J568M34l376J688L838R920J2311K8196L4319N5174
10048G73786J28474K26202J02796j17224j74854j62412r0113m7955k2693j9536
10038E96471p645j1086j3752j1048m799p647m304j30k645j3174j0741j984j460
10025E06056m443m097j0675k775k114O558O82j1862p994m967l359J4O177R03L208
10010D71312L226o533m252n987k990l880O1r65k18o589R68P495m398o195N401
9995D46456L212O78N77q647r4M306j1313m613R149N693o236q000o63J568j804
9980D30269L97J763K917m84K549J5860J4159R690J4563Q976M143J2640P952N114
9966E30508J3783J7364J1947K1475J1922J4357J2994J2473J6630K3215J3754R947
$$ plain form
10061 646292 646649 635692 629714 631282 631716 628340 630028 633866 643786 656097 684293 718612 773786
10048 773786 902260 1128462 1231258 1114034 939180 776768 686655 638700 616007 596471
10038 596471 588826 577740 563988 552940 548141 540494 536190 536060 533415 520241 509500 507516 506056
10025 506056 501613 497516 486841 484066 481952 488510 489192 477330 469336 464369 461010 461024 467201 468104 471312
10010 471312 474538 468005 463753 457766 454776 450896 450957 449992 449774 443185 444153 451648 447250 441055 446456
9995 446456 449668 450346 450923 442276 442182 446488 435175 430562 439711 445404 439168 431168 430505 432073 430269
9980 430269 430666 432429 435346 434862 437411 453271 467430 477120 491683 500659 504802 517442 525394 530508
9966 530508 544291 561655 573602 595077 606999 621356 634350 646823 663453 686668 700422 710369
9954G10369J9646K4123K8202L2860K6839L0004K1862J4194J090k773r673k4099
9942H72644k1446j1850j4191j4685j2785j5798j2826p789k685N782J1131J3057
9930G88559Q005N776Q458K1474J4045J5490R759O641P045Q091n417j0706m765
9917H72455l614K955J759r443k1180j9973j6145j0621k4163k1419j3426q888n634
9904G22663r344p418q336n733l102k854l405J402n926N468J1066K839J510Q46
9890F99676R498J1441J748J678m423r588j7281j3991J664n772j9074j2768p992
9877F34816j5702k2032k2558j9808j5536j2136J309R739L161M324K1571K5305
9865E92453L5321M9040Q6172J29968K07943L62031O70678R87930Q45731O0175
$$ plain form
9954 710369 730015 754138 782340 815200 842039 872043 893905 908099 909189 906416 896743 872644
9942 872644 851198 839348 825157 810472 797687 781889 769063 761274 758589 764371 775502 788559
9930 788559 796564 802340 810798 832272 846317 861807 871566 878207 885252 893343 887926 877220 872455
9917 872455 868841 871796 873555 864112 842932 822959 806814 796193 772030 750611 737185 728297 722663
9904 722663 713319 705901 697565 691832 688730 685876 682471 683873 677947 683415 694481 697320 698830 699676
9890 699676 709174 720615 722363 724041 719618 710030 692749 678758 680422 674650 655576 642808 634816
9877 634816 619114 597082 574524 554716 539180 527044 528353 538092 541253 545577 567148 592453
9865 592453 627774 676814 762986 892954 1100897 1462928 2133606 3121536 3967267 4027442
9855D027442p08296r91748q12582m95143k70171j45739r7702o0204l9547k5454
9845C80856k0492j1726j9008o779o985q848j7072j9016k965P273J0369j123n4
9832B84430o158j5521j7479o215q415L330p637j3176k764J877R020O103m219m126
9818B19050k619l725k056J759K944L69j1207q771l291m024L084Q400R93q050l941
9803A88915Q734Q160j2703p633j466J142J485K319K16K730O22j533r42N348p088
9788A88306q823n287n347j293L881J251L944N116n006l452k90q75Q95q061p505
9773A57454P87K344l163r275L488J985R20N448p71Q12J634M205p20L574p1j41
9757A68510j2469p438j13J333L501J774J195J191L889K640P085p64n917o735k791
$$ plain form
9855 4027442 3319146 2327398 1514816 1019673 749502 603763 506061 445857 406310 380856
9845 380856 360364 348638 329630 322851 315866 307018 289946 270930 267965 275238 285607 284484 284430
9832 284430 278272 262751 245272 239057 230642 233972 226335 213159 210395 212272 221292 227395 223176 219050
9818 219050 216431 212706 210650 212409 215353 215722 204515 195744 192453 188429 191513 199913 200906 192856 188915
9803 188915 197649 205809 193106 185473 184007 185149 186634 188953 189169 191899 192521 190988 190046 195394 188306
9788 188306 179483 174196 168849 167556 171437 172688 176632 181748 176742 173290 173000 172125 173020 164959 157454
9773 157454 158241 160585 157422 148147 151635 153620 154540 159988 159217 160029 161663 165868 165148 168722 168651 168510
9757 168510 156041 148603 148490 149823 153324 155098 156293 157484 161373 164013 171098 170334 164417 157682 154891
9742A54891k784L139j904m180J765m323o917m691J904O583N215J561O050j065
9728A55244p111n459j0728o115R098K524l185K687q84M634L461q17K92k144n452
9713A36045M091j148o009m583M513j889J640L038K20K089L368n649k865m699q309
9698A19853k333P222Q448m201K541M726o33K629j681M997j197l917q252N836l14
9683A33724P636M975q207k413M251k434j617j679J864m602l518k322q662m234
9669A12762l220k376K634P503O342m15j367j006P30L585N428R92k132J488j932
9654A29016r631j0184j1253l414R564J0582M968M48K610M052K262P914O286p062
9640A36158j0983n606r08K435N835k747m474l773k654Q504L428K714nj051m943
$$ plain form
9742 154891 152107 155246 153342 149162 150927 146604 139687 134996 136900 143483 148698 150259 156309 155244
9728 155244 148133 142674 131946 125831 134929 137453 134268 136955 136071 140705 144166 143349 143641 141497 136045
9713 136045 140136 138988 132979 128396 132909 131020 132660 135698 135918 138007 141375 135726 132861 128162 119853
9698 119853 117520 124742 133190 128989 131530 136256 135623 138252 136571 141568 140371 136454 128202 134038 133724
9683 133724 141360 146335 138128 135715 139966 137532 135915 134236 136100 131498 127980 125658 116996 112762
9669 112762 109542 107166 109800 117303 123645 123230 121863 120857 121587 125172 130600 131592 129460 130948 129016
9654 129016 119385 109201 97948 94534 104098 114680 119648 120096 122706 126758 129020 136934 143220 136158
9640 136158 125175 119569 118661 121096 126931 124184 119710 115937 113283 121787 125215 127929 127924 126873 121930
9625A21930N71n163o191J823Q948m78j667l955K654R641J927n58m084L043L71
9610A28812j545j546k734K461k499K229l444r258m406L334M173L876Q39J909j57
9595A22044k997m680P855M039K692K835j912J072Q770Q519J042P115O468k966
9581A59896J307Q627M160R445K3461J5680K0165K4324K7455L2546J7676L496j1097
9568C37141j9347k9310k4810k0480j3130j0547l840q757L393m032q303J761N459
9555B05198L412L835P439J1187J0545J7087J9272K6125J9616J0002K2638M1589
9543C97945M4482L3889K6290L2582K2039J8987K9416K5552P977M537o897l089
9531F33710O78j9323k4222l5743l5699k5279k1824j3570j6491j3941m873K60j1796
$$ plain form
9625 121930 122501 117338 111147 112970 121918 121440 119773 115818 118472 128113 130040 129482 125398 128441 128812
9610 128812 127267 125721 122987 125448 122949 125178 121734 112476 108070 111404 115577 119453 120292 122201 122044
9595 122044 119047 114367 122222 126261 128953 131788 129876 130948 139718 148237 149279 156394 162862 159896
9581 159896 161203 169830 173990 183435 206896 222576 242741 267065 294520 327066 344742 348238 337141
9568 337141 317794 288484 263674 243194 230064 219517 215677 206920 210313 206281 197978 199739 205198
9555 205198 208610 212445 219884 231071 241616 258703 277975 304100 323716 333718 356356 397945
9543 397945 442427 476316 502606 535188 557227 576214 605630 631182 639159 643696 636799 633710
9531 633710 634388 615065 590843 555100 519401 494122 472298 458728 442237 428296 423423 423683 411887
9518D11887j04k740Q712R441R950N591J9425K1879L4994L6355K6297K7056L7372
9505F46115M7295M4779M1559L7987K9737J9633J9395J044k4534j9954k1523l0368
9493G91165m0305m6733m8882m1865k9185l7428k6482k7230j6011j8440j3200p349
9481D38055M933k560o386L960L969J480M324J7317J9703K0923K2393J5611J5435
9468E59157K1869L2705K4227J9453J6673R664N81r007j7748j2867k8400l1877
9456E84430l4406l8631m1789l8951l4377k6796j8025k1194j2298l869k564j314
9444C10216p678n354q217j2830r132n785k082M236J4649J0506R430J3664J5815
9431C27438K2572K0887O566K420M051p34r378j4214k1084k4958k8639k2412j1083
$$ plain form
9518 411887 411783 409043 417755 427196 437146 442737 462162 484041 519035 555390 581687 608743 646115
9505 646115 693410 738189 779748 817735 847472 867105 886500 887544 863010 843056 821533 791165
9493 791165 750860 704127 655245 613380 584195 546767 520285 493055 477044 458604 445404 438055
9481 438055 442988 440428 434042 438002 441971 443451 447775 465092 484795 505718 528111 543722 559157
9468 559157 581026 613731 637958 657411 674084 683748 684329 675322 657574 644707 616307 584430
9456 584430 550024 511393 469604 430653 396276 369480 351455 330261 317963 314094 311530 310216
9444 310216 302538 297184 288967 276137 267005 261220 259138 263374 278023 288529 297959 311623 327438
9431 327438 350010 370897 377463 379883 383934 383200 373822 359608 338524 313566 284927 262515 251432
9418B51432j3243j7386p070q097m263r4j027p82k704J771l125N27L759q433j492
9403A89773Q061N405J0368J4396L484j390K854R95k361l735Q338L20K90N658p176
9388B35280n143R304j698J39k804k731m130k336k485p41J928M473l822m154M47
9373B21527n415R550J0345M936K477L629n263J2873J5385J0877J964J1021K0601
9360C14507J0328R960J1205J691L14O089L733l356p422m612k678o387m817r81
9346C27574k460K162L400k595p358K169m75j040J165J8140J5242Q741N924R022
9332C79611K926K145J0033R515J5404J0256Q661Q338Q435N354O315O257Q128Q8
9318D81466j871J987K38m454L646J0528J6773P200O102O151J6875J2874Q090M031
$$ plain form
9418 251432 238189 220803 213733 205636 201373 201279 200252 199470 196766 198537 195412 195939 199698 191265 189773
9403 189773 197834 203239 213607 228003 231487 230097 232951 233946 231585 227850 236188 236508 236798 242456 235280
9388 235280 230137 239441 237743 237882 235078 232347 228217 225881 223396 222655 224583 229056 225234 221080 221527
9373 221527 216112 225662 236007 240943 243420 247049 241786 254659 270044 280921 282885 293906 314507
9360 314507 324835 334795 346000 347691 348005 354094 357827 354471 347049 342437 339759 333372 328555 327574
9346 327574 325114 327276 330676 328081 320723 322892 322417 321377 322542 340682 355924 364665 370589 379611
9332 379611 382537 384682 394715 404230 419634 429890 438551 446889 455324 460678 466993 473250 481378 481466
9318 481466 479595 481582 481820 477366 481012 491540 508313 515513 521615 527766 544641 557515 565605 569636
9304E69636K797N25M076L431K698M456J1232L953M656P832J2714J7870R424N680
9290F60980J7710K0319J1286R78J427P651Q493R640R696L276l958M106N078N6
9276G56738j069Q23O899P739l693K139L05J1144J3736R225O036J2535K5591K0487
9262H68635R286M077J3600O987N990J1765J1860P099Q833Q364Q843N982o082N458
9248I70697J0174J334l639K146Q779M701J5368J8619R872J852l25N21J8506J3264
9234A071869J901O301K2950K3241J9701K0423J3958J0694K1472K4247J8781K3611
9222A279149K6653J8219K2138J3404J9390K2956J7188K0595K4129L2195L4372
9211A530388L3166N0363N1416M6921N0050N2102N5046N9975P5368R0584J05781
$$ plain form
9304 569636 572433 572958 577034 580465 583163 587619 598851 602804 607460 615292 628006 645876 655300 660980
9290 660980 678690 699009 710295 711273 712700 720351 728844 738484 748180 751456 747498 751604 756682 756738
9276 756738 755669 756492 763391 771130 767437 769576 769881 781025 794761 803986 810022 822557 848148 868635
9262 868635 877921 881998 895598 902585 908575 920340 932200 939299 948132 956496 965339 971321 965239 970697
9248 970697 980871 982205 978566 980712 989491 994192 1009560 1028179 1038051 1039903 1039578 1040099 1058605 1071869
9234 1071869 1073770 1080071 1103021 1126262 1145963 1166386 1180344 1191038 1212510 1236757 1255538 1279149
9222 1279149 1305802 1324021 1346159 1359563 1378953 1401909 1419097 1439692 1463821 1496016 1530388
9211 1530388 1563554 1613917 1665333 1712254 1762304 1814406 1869452 1929427 2004795 2095379 2201160
9200B201160J22256J34770J48166J75326J98187K18505K51673K99464L38207L98127
9190D485841M77318N65077O77747Q26047J015770J188285J361853J494509J613112
9181A3705559J804580K057211K271754K388765K372748K280928K044843J512532
9173C0438920O36288m16362j398787k059370k289990k189131j898003j554490
9165A9269075j189750q16414m25832m8293L11933O50003R88405J327472J670429
9156B1737028K009532K282678K499575K691108K925123L235233L631852M058502
9148D5070631M416243M626970M606733M325574L814151L190784K580707K053929
9140G4685722J648693J359124J109606Q13650M09047j88310r69339j778025k429312
$$ plain form
9200 2201160 2323416 2458186 2606352 2781678 2979865 3198370 3450043 3749507 4087714 4485841
9190 4485841 4963159 5528236 6205983 7032030 8047800 9236085 10597938 12092447 13705559
9181 13705559 15510139 17567350 19839104 22227869 24600617 26881545 28926388 30438920
9173 30438920 31075208 30658846 29260059 27200689 24910699 22721568 20823565 19269075
9165 19269075 18079325 17262911 16837079 16788786 17100719 17750722 18739127 20066599 21737028
9156 21737028 23746560 26029238 28528813 31219921 34145044 37380277 41012129 45070631
9148 45070631 49486874 54113844 58720577 63046151 66860302 70051086 72631793 74685722
9140 74685722 76334415 77693539 78803145 79616795 80025842 79837532 78868193 77090168 74660856
9131G4660856k795707k900209k836677k685768k463447k105508j594317r74065
9123E6305158l00448L76624J026856J594216K086700K521000K920552L310203
9115F9840861L704613M113260M510512M868459N181656N388200N433613N288892
9107A08330066M981732M587086M211519L814244L168533J999778K24492j907688
9099A29409762l932784n490933o476004o962418p058916o799049o243661n505237
9091H0940760m690204l873561l102521k383447j715954j083485m84932R5155O37033
9082F4338844J143528J638947K133602K632128L127338L596449L967980M197306
9074H6776122M255292M114257L769416L234314K478951J510644L19591j041755
$$ plain form
9131 74660856 71865149 68964940 66128263 63442495 60979048 58873540 57279223 56305158
9123 56305158 56004710 56381334 57408190 59002406 61089106 63610106 66530658 69840861
9115 69840861 73545474 77658734 82169246 87037705 92219361 97607561 103041174 108330066
9107 108330066 113311798 117898884 122110403 125924647 129093180 131092958 131317450 129409762
9099 129409762 125476978 119986045 113510041 106547623 99488707 92689658 86445997 80940760
9091 80940760 76250556 72376995 69274474 66891027 65175073 64091588 63606656 63701811 64338844
9082 64338844 65482372 67121319 69254921 71887049 75014387 78610836 82578816 86776122
9074 86776122 91031414 95145671 98915087 102149401 104628352 106138996 106458587 105416832
9066A05416832k483976l815384m888829n632086n992508o025875n805987n426399
9058F5345788m952058m449792l952033l479129l039108k643842k285242j936651
9050C8607933j601937j268532r44973n97358k47654J35449N51433R78039J393295
9041C7005695J708360J852832J757697J423251R93886N80158J37433m42208j207402
9032D3809702k003823k645173l047176l177445l047494k716364k304909j915579
9024B2951739j607739j389029j259843j207412j182230j182986j167213j127336
9016A2827951j055141r69776q80513p76442o87473n91043m99646m28841l62302
9007F576774k99587k69027k29788j92648j65565j46673j27714j18034j10585j04755
$$ plain form
9066 105416832 102932856 99117472 94228643 88596557 82604049 76578174 70772187 65345788
9058 65345788 60393730 55943938 51991905 48512776 45473668 42829826 40544584 38607933
9050 38607933 37005996 35737464 34792491 34195133 33947479 34082928 34634361 35612400 37005695
9041 37005695 38714055 40566887 42324584 43747835 44741721 45321879 45459312 45017104 43809702
9032 43809702 41805879 39160706 36113530 32936085 29888591 27172227 24867318 22951739
9024 22951739 21344000 19954971 18695128 17487716 16305486 15122500 13955287 12827951
9016 12827951 11772810 10803034 9922521 9146079 8458606 7867563 7367917 6939076 6576774
9007 6576774 6277187 6008160 5778372 5585724 5420159 5273486 5145772 5027738 4917153 4812398
8997D812398r6101r3090q6470o5549n8812l7202l351O78J1810L3133L8726M5810
8985D501980N5901N1936O5970P7367P7631P7500P7576R6477J06471J08699J29965
8974E427473J56285J78339K08231K39607K75083L19021L62165L96018M35895M77648
8964H475765N10461N46214N72298O08990O16976O35683O48300O49526O56573O65161
8954A4585947O73209O73541O89768P03203P10372P29786P57501Q20993R08140
8945B1252460J009932J109586J177747J157532J010681P41781L93243Q62l37941
8936B7515883n52747o22785n49678l71795j36005J15759L67365N84409P39021
8927B7089427Q29899Q46178P59935O13664M62362L34447K58997K61437L06963
$$ plain form
8997 4812398 4716297 4623207 4536737 4471188 4412376 4375174 4371823 4372501 4384311 4417444 4456170 4501980
8985 4501980 4557881 4609817 4675787 4753154 4830785 4908285 4985861 5082338 5188809 5297508 5427473
8974 5427473 5583758 5762097 5970328 6209935 6485018 6804039 7166204 7562222 7998117 8475765
8964 8475765 8986226 9532440 10104738 10713728 11330704 11966387 12614687 13264213 13920786 14585947
8954 14585947 15259156 15932697 16622465 17325668 18036040 18765826 19523327 20344320 21252460
8945 21252460 22262392 23371978 24549725 25707257 26717938 27459719 27852962 27853824 27515883
8936 27515883 26963136 26340351 25790673 25418878 25282873 25398632 25765997 26350406 27089427
8927 27089427 27919326 28765504 29525439 30139103 30601465 30935912 31194909 31456346 31763309
8918C1763309L93053N43414P29840R40801J148092J351787J542255J688252J769046
8909D1869849J749120J612702J366175J027067O65558L31934O1533j41894l28911
8900D8213133m82677o04896p25437q49582r56354j041487j137895j242957j330873
8891C9840975j361188j302007j167747r67081p26055m42474j46010J61569M64113
8882C4354095P58958J060458J346785J609858J802222J930730J947708J790110
8874D6600924J480971J049036N51181M8618m21175q15076j127727j340162j464609
8865D4561981j519154j518372j465431j386140j327138j269941j200147j122280
8857C3753378j026934r01693p44941o01153m89139m44127m62476n37199o43559
$$ plain form
8918 31763309 32156362 32699776 33429616 34370417 35518509 36870296 38412551 40100803 41869849
8909 41869849 43618969 45231671 46597846 47624913 48290471 48622405 48683938 48542044 48213133
8900 48213133 47730456 47125560 46400123 45550541 44594187 43552700 42414805 41171848 39840975
8891 39840975 38479787 37177780 36010033 35042952 34316897 33874423 33728413 33889982 34354095
8882 34354095 35113053 36173511 37520296 39130154 40932376 42863106 44810814 46600924
8874 46600924 48081895 49130931 49682112 49730730 49309555 48494479 47366752 46026590 44561981
8865 44561981 43042827 41524455 40059024 38672884 37345746 36075805 34875658 33753378
8857 33753378 32726444 31824751 31079810 30478657 29989518 29545391 29082915 28545716 27902157
8848B7902157p13018p29482o80946n82969m43852k88821j44187l9038K4525L9742
8838B4344111M022o2036j46107k10946k66194k85383k75559k54084k26354k04711
8828B2416759k13369k62017l60743n08803o89761q71468j038842j170820j228091
8819A6072845j230496j169065j068247r38429q13422o73496n53063m25159l03817
8810H897651j95797j16804k6343M0073Q9948P4777J8860o1377j45439k21360k65515
8799H088674k67988k40153j78832j20540p7585o8991j04693j73435k62225l42358
8789F251874m00481m50170m51259m25306l83659l41772k99766k42783k00147j85396
8779B871135j58416j40900j24622j00272q8125p8940p0479o9233p2305o0784m5785
$$ plain form
8848 27902157 27189139 26459657 25778711 25195742 24751890 24463069 24318882 24279844 24304369 24344111
8838 24344111 24348133 24286097 24139990 23929044 23662850 23377467 23101908 22847824 22621470 22416759
8828 22416759 22203390 21941373 21580630 21071827 20382066 19510598 18471756 17300936 16072845
8819 16072845 14842349 13673284 12605037 11666608 10853186 10179690 9626627 9201468 8897651
8810 8897651 8701854 8585050 8558707 8598780 8688728 8763505 8782365 8720988 8575549 8354189 8088674
8799 8088674 7820686 7580533 7401701 7281161 7203576 7134585 7029892 6856457 6594232 6251874
8789 6251874 5851393 5401223 4949964 4524658 4140999 3799227 3499461 3256678 3056531 2871135
8779 2871135 2712719 2571819 2447197 2346925 2258800 2179860 2109381 2040148 1967843 1907059 1861274
8768A861274l9059m1429l3106j8642l1877l1699k2241k3493k5709k6994l3309
8757A533716l0595l4182l5700l4519l7664m0277k4317j5343j6471j1104m887r684
8745A238973n489Q08j1562K186o462L83l665K221J0861Q464J3431K8661K3670
8732A302480K2694J8205J9889J4705k35m245o323q350j5354j3721k5278l0085
8720A274382l0246l6334l4235l1244l1191k4900j7040j5174j2616q240n893j261
8708A026008L53R950P584J3979p20m17M073J2152K8051L1872K1444L1174K4200
8695A209703J4610J5499M078q555j9341j5839k6191k8374l7149l3093l4297j8183
8683A022868r933j9350k8187k3952k4196k5574j1569j8335k0676j6088j5176p52
$$ plain form
8768 1861274 1822215 1780786 1747680 1729038 1697161 1665462 1643221 1619728 1594019 1567025 1533716
8757 1533716 1503121 1468939 1433239 1398720 1361056 1320779 1296462 1281119 1264648 1253544 1248657 1238973
8745 1238973 1233484 1234292 1222730 1224916 1218454 1218837 1215172 1217393 1228254 1236718 1250149 1278810 1302480
8732 1302480 1325174 1343379 1363268 1377973 1377738 1373493 1367170 1358820 1343466 1329745 1304467 1274382
8720 1274382 1244136 1207802 1173567 1142323 1111132 1086232 1069192 1054018 1041402 1033162 1027269 1026008
8708 1026008 1026361 1036311 1043895 1057874 1057154 1056737 1060810 1072962 1101013 1132885 1154329 1185503 1209703
8695 1209703 1224313 1239812 1243890 1235335 1215994 1200155 1173964 1145590 1108441 1075348 1041051 1022868
8683 1022868 1012935 993585 965398 941446 917250 891676 880107 861772 841096 825008 809832 809080
8671H09080N389k164N972Q970R445J4157K5825L0365L3719O7180R8096J70765
8659A276799K76491K40935m0110k28003k58622j90631j11742o8855m9189l3416
8649H13657k1965j4564j1114n474O039M4821M2759j8292o2234q4476n6649l9596
8637E92912j9679j0084m116m175L641K831l803Q950J5311K4577L6469L8859M869
8624F86562j6513j2667L889P215J7160L3109N8602P4881J46957K74146N02390
8613A775731N64027K5964l93637n35963m12610k24224j23538p4043m7480k0879
8603E33348o68J4437N2168J15402J44907K5798q1841j31129j14325p0395l6871
8592D50831j9572j0055o770K857K010M949J0962J5772J7421L8671M7898K1360
$$ plain form
8671 809080 814469 812305 818277 827247 836692 850849 876674 907039 940758 1007938 1106034 1276799
8659 1276799 1553290 1794225 1754115 1526112 1267490 1076859 965117 896262 847073 813657
8649 813657 791692 777128 766014 760540 766579 811400 854159 835867 773633 689157 632508 592912
8637 592912 573233 563149 559033 554858 558499 561330 557527 566477 581788 606365 642834 681693 686562
8624 686562 670049 657382 661271 668486 685646 718755 777357 852238 999195 1273341 1775731
8613 1775731 2339758 2365722 1972085 1436122 1023512 799288 675750 601707 554227 533348
8603 533348 532680 547117 599285 714687 859594 885392 803551 672422 558097 487702 450831
8592 450831 431259 421204 414434 417291 419301 424250 435212 450984 468405 507076 554974 576334
8580E76334k0025m3921n6266l5660j1824m662J9884K4802L7060O0833J11816K04480
8568H62851K82658J12163j46952k41339k14091j41745o9837l0069j4564m068P740
8557D02747K4801M7614O4340M0479j7440m9575m8506l0852j6919r272k982K673
8545D07108j1368q493q526o69Q119k537L495P742J0917L689j4541k7455k6496
8532C40985k1572N112l659J263R173O823J2001P087K443p45K831k558j86M115
8518C63113J684J1719Q251Q233J4307N565J4246J2432K342O820J004J613q167
8505D43162j6575r379N027J222l079j5633l696K336j696j5544q374K446L424n400
8491C78241q497m895J132m097j988Q86p443M828J1449J2417L212J368J4352J9481
$$ plain form
8580 576334 556309 512388 456122 420462 408638 403976 423860 448662 485722 546555 658371 862851
8568 862851 1145509 1257672 1110720 869381 655290 513545 443708 413639 399075 395007 402747
8557 402747 427548 475162 539502 579981 562541 512966 464460 433608 416689 407417 404435 407108
8545 407108 395740 387247 378721 378052 386171 383634 387129 394871 405788 409477 394936 367481 340985
8532 340985 319413 324525 320866 322129 331302 338125 350126 357213 359656 358911 361742 359184 358998 363113
8518 363113 364797 376516 384767 393000 407307 412872 427118 439550 441892 448712 449716 451329 443162
8505 443162 426587 417208 422235 423457 420378 404745 401049 403385 401689 386145 377771 380217 383641 378241
8491 378241 369744 364849 365981 361884 359896 360782 353339 358167 369616 382033 385245 386613 400965 420446
8477D20446J4086J0745K3108K3365K1536R443p803j5241j4926j8295j5314j1181
8465D39969j6127j0232p421L191J8890K4816J6628O067j5468k9041l5014k1597
8453C74661r723j0651r299m717k203r856N50P510n711j745o151M615J365P099
8439C35744J1412L937P888J5668J7167R297N811n791j3716j4504j1410p857r282
8426C44364p970j239J1459P680J3940K0893O900j4249k9296m2950k7609k2121
8414B59802j7073j3859l766l00q344r120K710l435j4677Q639O478K620l87k264
8400B07024J0126P158O149Q547N982K693N091N43o346o070j2960r452j1366k1668
8386A85451j3019K428p882j2611j1273K08K930l575j711O985K862O275M227j417
$$ plain form
8477 420446 434532 445277 468385 491750 513286 522729 514926 499685 484759 466464 451150 439969
8465 439969 423842 413610 406189 409380 428270 453086 469714 475781 460313 431272 396258 374661
8453 374661 364938 354287 344988 340271 338068 328212 328762 336272 330561 328816 322665 327280 328645 335744
8439 335744 347156 351093 358981 374649 391816 401113 406924 401133 387417 372913 361503 353646 344364
8426 344364 336394 335155 346614 354294 368234 389127 396027 381778 352482 309532 281923 259802
8414 259802 242729 228870 225104 224804 216460 207340 210050 206615 191938 200577 207055 209675 209288 207024
8400 207024 217150 224308 230457 239004 244986 247679 252770 253313 246967 240897 227937 218485 207119 185451
8386 185451 172432 174860 166978 154367 143094 143302 146232 142657 140946 147931 150793 157068 161295 159878
8372A59878j0815q80P246L75n535p560k076j288K635Q454j09j396n513r080J26
8357A34462K719q109l545l35Q38l447K544P6p18N521l709q746N965J1191M830
8342A39537n270q780P17l390m516k055Q422K669J699k059l326J476O715q453r345
8327A14041O171N124j081K44j3218p744k283m660M021k687N049L909J5447J0821
8313A33154K907O930R25j8j058o082p529q647j2352K553P971J1136l04r218o258
8298A14110j0097o831R987Q345r519m225N073j325N11Q548j139j201J211o44L923
8283A16727M571l187m427m922k500P531M854q8k749p354k340k24N440K419k006
8268A11745j734k557l29J998J0462n177j2912M738J0027l24J952J173j967K92
$$ plain form
8372 159878 149063 148183 155429 155804 150269 142709 140633 139345 141980 150434 150325 148929 143416 134336 134462
8357 134462 137181 129072 125527 125192 126030 122583 125127 125203 124485 130006 126297 117551 123516 134707 139537
8342 139537 134267 125487 126204 122814 118298 116243 124665 127334 129033 126974 123648 125124 131839 123386 114041
8327 114041 120212 125336 124255 124499 111281 103537 101254 96594 100615 97928 102977 106886 122333 133154
8313 133154 136061 142991 143916 143898 142840 136758 129229 120582 108230 110783 118754 129890 129586 120368 114110
8298 114110 104013 97182 107169 115514 105995 101770 106843 105518 106029 114577 113438 112237 113448 112804 116727
8283 116727 121298 118111 113684 108762 106262 113793 118647 118559 115810 108456 106116 105892 111332 113751 111745
8268 111745 110011 107454 107125 109123 119585 114408 101496 106234 116261 115937 117889 119062 117095 117387
8254A17387P865kQ520Q986l296r795p101r534j1040k268l31k430M698l528J360
8239I9491j663L669M004m877n018j985k8O769M065J103p452o973l003O875K385
8224I7362j650n535o979J950J952N449K968M736O157J0434M714j2842k053J0417
8210A17080J4966N635J834l508j1530j2793j0393l891L136q52o450k975K797l689
8196H9367n80K414J238J0255k263K409M256k031o523n892L039K699Q28K153q533
8181I2836r54j635j067k173n417m472L6K744M838P704l557l812q420p115kM268
8165G3802Q870M151N811R736P150r20j800M394L4q043o384J74o110n184M343L700
8149I3724M933L621o346n875n111m369o85L341n691L37m537m21M487Q483j102
$$ plain form
8254 117387 125252 125250 133770 142756 139460 129665 122564 113030 101990 99722 99391 96961 101659 98131 99491
8239 99491 97828 101497 105501 100624 95606 93621 93593 100362 104427 105530 98078 91105 88102 94977 97362
8224 97362 95712 90177 83198 85148 87100 92549 95517 100253 106410 116844 121558 108716 106663 117080
8210 117080 132046 137681 139515 136007 124477 111684 101291 97400 100536 99684 93234 90259 93056 89367
8196 89367 88787 91201 92439 102694 100431 102840 107096 105065 98542 92650 95689 98388 99216 101369 92836
8181 92836 91882 90247 89180 87007 81590 77118 77154 79898 84736 92440 88883 85071 76651 69536 69534 73802
8165 73802 82672 86823 92634 102370 109520 108600 106800 111194 111228 103185 96801 96975 90865 85681 90024 93724
8149 93724 98657 102278 95932 90057 84946 80577 79892 83233 77542 77879 73342 72921 77408 85891 84789
8134H4789k889j439J0365Q408L65J531r26k420q521m606N446P661J0102O486M540
8119A18892n527o726n960m736J69M517K18K709O201Q057Q537P371P356k774O289
8104A44593j354j0852m787R1j1589j0449Q204L402L557J37l490n518k762K174
8090A11357O947R185l915r368n673q22N296q47m771j032N447L346O26J913Q525
8075A26214N619m646k325J575O138K1656J4873J3043O761k984j1786j0726k923
8062A60489o407r207J806l131o108L067K630j2894j1441k732r66m275M326l223
8048A11934N050n456M727J0051J1957Q87p329p221o036J865J511m797m995p79
8034A11369j076P999M402l538O357k927r816k437K736J1713k393j31M081k606
$$ plain form
8134 84789 81900 80461 90826 99234 99599 101130 100204 97784 89263 84657 90103 97764 107866 114352 118892
8119 118892 113365 106639 100679 95943 96112 100629 100847 103556 109757 117814 126351 133722 141078 138304 144593
8104 144593 143239 132387 127600 127691 116102 105653 113857 117259 120816 120953 117463 111945 109183 111357
8090 111357 118304 127489 123574 114206 108533 107711 113007 112160 107389 106357 111804 115150 115776 117689 126214
8075 126214 131833 127187 124862 126437 132575 154231 169104 182147 188908 185924 174138 163412 160489
8062 160489 154082 144875 146681 143550 137442 140509 143139 130245 118804 116072 115106 110831 115157 111934
8048 111934 116984 111528 116255 126306 138263 139150 131821 124600 118564 120429 121940 117143 112148 111369
8034 111369 110293 118292 122694 119156 125513 122586 112770 110333 113069 124782 122389 122258 126339 123733
8020A23733k29l785p087q737q532Q604O804L100l969j2681j2566R93N906l389
8006H8165l271J138M69J064M531L112p785o198M377P1L056K881m292J41N27n468
7990H2518j27k826L722L362P442M026p697o302L630M261r176J170L372k199o697
7975G8479n917k820q59L381p354n329N842J1916P413P34K596l558o455j683k961
7960G3425j19L02j971j528n6p79M040O709j445j1633m710L425J1483R361r15L525
7944H9114q088p698q228L464L78l804L734L102p11R37p012o559O146k511j135
7929F1129k540n614p92L994J1790L635l536k106k106l935L128p785l227M99R966
7914F2500Q604J689o709r627k902j78M861K349j637k546M366Q44k4L595o930j0688
$$ plain form
8020 123733 123504 119719 112632 103895 95363 103967 110771 113871 109902 97221 84655 85648 91554 88165
8006 88165 84894 86032 86501 87565 92096 95208 87423 81225 85602 85673 88729 91610 87318 87459 87986 82518
7990 82518 82391 79565 83287 86649 94091 98117 90420 84118 87748 92009 82833 84003 87375 85176 78479
7975 78479 72562 69742 68883 72264 64910 59581 65423 77339 84752 85486 88082 84524 78069 76386 73425
7960 73425 73306 73608 71637 70109 70053 69274 73314 80023 78578 66945 62235 65660 77143 86504 85589 89114
7944 89114 81026 73328 65100 68564 68942 65138 68872 71974 71263 72200 65188 58629 64775 62264 61129
7929 61129 58589 52975 52183 56177 67967 71602 68066 65960 63854 59919 63047 55262 52035 52534 62500
7914 62500 71104 72793 66084 56457 53555 53377 58238 60587 58950 56404 60770 61614 61590 65185 58255 47567
7898D7567m428R660J634n106M566n466n626L369P334j041q437K371Q22o61J2679
7883E9237O7N097O902J820k345k279j3215M04l169j715P130K141m520p174r733
7868C8648j13K655J572j275J0124K78j1103m276J0893J0950p034J576J587m722
7854D9760j2096m72J0944Q953k817n462k663m041J07L20P931M543K92J231J498
7839E8028o576m746q98m48K38o055L409P300K922k296k159n597J512J236M497
7824E0367L545J184l363J475N465o306p014N382n183j1217j450j614M692j953
7810C4010n905L245R926k021k281o23k12L676k304o151k418O040Q702k467q94
7795D0323n226K063n868O205J315j898O410P385J865j2938K85K07p129J75O325
$$ plain form
7898 47567 43139 52799 54433 49327 53893 48427 42801 46170 53504 52463 44026 46397 47219 46558 59237
7883 59237 59304 64401 71303 73123 70778 68499 55284 55688 52519 50804 57934 60075 55555 48381 38648
7868 38648 38535 41190 42762 41487 51611 51889 40786 36510 47403 58353 51319 52895 54482 49760
7854 49760 37664 37192 48136 57089 54272 48810 46147 42106 42213 42533 50464 55007 55299 56530 58028
7839 58028 51452 46706 45808 45360 45598 39543 42952 50252 53174 50878 48719 43122 44634 45870 50367
7824 50367 53912 55096 51733 53208 58673 52367 45353 50735 45552 34335 32885 31271 35963 34010
7810 34010 28105 31350 41276 39255 36974 36351 36139 39815 37511 31360 28942 34982 43684 41217 40323
7795 40323 35097 37160 31292 37497 38812 36914 43324 50709 52574 39636 39921 40128 32999 33174 39499
7780C9499R81J844J391n091l353j867Q244J088j571O228J570n704o062r46J253
7765C7504j835N359K993M299M68r642p288O11K461l313k243J261M54J492J988
7750C4569k57l154j309N29N708J559m11q3L171l626L489P150k775o681J466J489
7734D0834j936J611l76j3682Q58R159P519O622j2722j2534J100R61k398P87n448
7719B0355P086J2495N069p15j806k890J531L042J711m685J564K45n029j350j342
7704C5281O181N266l391p163o383J327O846R389O344L261j103k524J990p256j2160
7689C5905j2739l646O518K953L072l141N893J3020j905j1272o989R32J226J606
7675C1433m186m85Q465O281O385k628k480n944k078q50K200P047J427R10l435
$$ plain form
7780 39499 40480 42324 43715 38624 35271 33404 41648 42736 41165 47393 48963 43259 37197 36251 37504
7765 37504 35669 41028 44021 48320 48788 39146 31858 32469 34930 31617 29374 30635 31089 32581 34569
7750 34569 34312 31158 29849 30378 36086 37645 37234 37151 40322 36696 40185 47335 44560 37879 39345 40834
7734 40834 38898 40509 40133 26451 27309 36468 43987 50609 37887 25353 26453 27414 25016 25803 20355
7719 20355 27441 39936 45005 44290 42484 39594 41125 44167 45878 41193 42757 43002 37973 36623 35281
7704 35281 41462 46728 43337 36174 29791 31118 37964 47353 53697 56958 55855 53331 55321 48065 35905
7689 35905 23166 19520 26038 28991 32063 28922 34815 47835 45930 34658 27669 28601 29827 31433
7675 31433 27247 26762 35227 41508 47893 45265 42785 36841 34763 33913 36113 43160 44587 45497 42062
7660D2062k965M77K245K336M22q240j366J661N191l29r391j3120k710L599L413
7645B3285N348N015P138O173N208m027j333k891m175m293K771j782r813J975R945
7630C8544M167j1530n351p58L269L73N672Q87k140L927m289m143Q361J802l972
7615C4819j594o20O608o173j0518M790L504J1756K216q762k990l48k104o417p605
7600A6562q635J612J0768N169Q248k871m137n176n520M816L043J294O005j99o321
7585B4658m301M804L612O09l050o226N088M512N259K280K615M367m58j3921r779
7570B0069j781J642L244p6n194J345L936J603j079j858l690j166Q243p8l245r32
7554B0983m41O080M788k368l330j213M944m078n836j0517J158Q721M983O564o861
$$ plain form
7660 42062 39097 39574 41819 44155 44577 36337 34971 36632 41823 41494 32103 18983 16273 19872 23285
7645 23285 28633 33648 40786 46959 52167 48140 46807 43916 39741 35448 38219 36437 26624 28599 38544
7630 38544 42711 31181 25830 25072 28341 28714 34386 35273 33133 37060 32771 28628 36989 38791 34819
7615 34819 33225 32605 39213 33040 22522 27312 30816 42572 44788 36026 33036 32688 30584 24167 16562
7600 16562 7927 9539 20307 25476 33724 30853 26716 21540 16020 20836 23879 25173 31178 30979 24658
7585 24658 20357 25161 28773 29382 26332 20106 25194 29706 34965 37245 39860 44227 43769 29848 20069
7570 20069 18288 19930 23174 23098 17904 19249 23185 24788 23709 21851 18161 16995 25238 25160 21915 20983
7554 20983 20542 26622 31410 29042 25712 24499 29443 25365 19529 9012 10170 18891 23874 30438 23577
7539B3577L292n39k864m117m925m117K471P305L236J329J859m386o456J017j561
7524A5121n5j365L023J294N165K434P80l830j763K624M315j291q102n455k858
7509A0037k72N165J754l461l349J1114J0072q71j056m428J359j87K815K732j687
7494B9737R27m726J408Q000p683O61j118j545K916j67l388n009q543n478k167
7479C825N677P829P469O683O73o444k105K661o080N280P444j701M790K689L247
7464D1937N791j322o340r954m196m474M602L947K271q54J000M384p641l180L378
7449B9349J889q030J490q34O732k880q851J097M76j433K85O124L956l950q21p975
7433A6624L430n09j58R204J3691P731o253n6j2065J438R787K750q318K884j471
$$ plain form
7539 23577 26869 26330 23466 19349 14424 10307 12778 20083 23319 24648 26507 22121 15665 16682 15121
7524 15121 15066 13701 16724 18018 23183 25617 26397 22567 20804 23428 27743 26452 18350 12895 10037
7509 10037 9765 14930 16684 13223 9874 20988 31060 30189 29133 24705 26064 25877 28692 31424 29737
7494 29737 30664 25938 27346 35346 27663 28324 27206 25661 28577 28410 25022 20013 11470 5992 3825
7479 3825 9502 17331 24800 31483 32156 25712 23607 26268 20188 25468 32912 31211 36001 38690 41937
7464 41937 47728 46406 40066 30112 25916 21442 26044 29991 32262 31408 32408 36792 29151 25971 29349
7449 29349 31238 23208 24698 23864 30596 27716 18865 19962 20438 19005 19290 25414 29370 25420 24599 16624
7433 16624 20054 19545 19387 28591 42282 50013 43760 43704 31639 33077 42864 45614 37296 40180 38709
7418C8709k134r40o933j604L503l807j2268k032L607L016K891Q06p569p11m002
7403A0532L168O784P014L86j783J870m512n504m345q82R293P535J163k931j612
7388B6176j262q01N253o768J229J0123K058o456p631l091k0O41K603k989L74J819
7372B1258Q63p266p100K671M563P647N824l806n445o218m01Q407L543K599j327
7357B5812j441j495K758Q73o570L570k45Q8m95l041k718K889M618n37O224K26
7341C0516p747o811m469J414L683J2464K492l049j669J22q188r821k584R45j827
7326E471J052M809j800L397n86P259J3618n959n981k262n758J184L635R829Q858
7311C6766M060k539p962j0629l204K13J844O50P22l858L387N375l629P79o82l634
$$ plain form
7418 38709 36575 35635 28702 27098 30601 26794 14526 12494 16101 19117 22008 22814 15245 14534 10532
7403 10532 13700 20484 27498 27884 26101 27971 23459 17955 13610 12728 22021 29556 30719 27788 26176
7388 26176 24914 24113 29366 22598 23827 33950 36008 29552 21921 18830 18810 19451 22054 19065 19439 21258
7372 21258 22121 14855 7755 10426 14989 22636 28460 24654 19209 12991 12590 20997 24540 27139 25812
7357 25812 24371 22876 25634 26507 19937 23507 23262 23350 22855 19814 17096 19985 24603 24066 30290 30516
7341 30516 22769 15958 11489 12903 16586 29050 31542 28493 26824 26946 18758 8937 6353 7298 5471
7326 5471 6523 11332 9532 12929 12343 19602 33220 27261 21280 19018 13260 14444 18079 27908 36766
7311 36766 40826 38287 30325 19696 16492 16705 18549 19199 19921 16063 19450 24825 21196 21975 21293 17659
7295A7659R92M64L131l047n032l530J601o626k284L753R234M661j525R93K883
7280B3327j91r595o265M709J243K344L524j566J389P160Q86n024l72J206q596
7265A4179o9K506o33o848q377K967L543J0455J0690J617L61p28m562n019j156
7250A8926l202k448j932M214O973L649j353J106j888L285n134m004J977R897r50
7235B9116m912j244j667m497L517J240J0266m330J74L102l840r752j95J903Q47
7220A9728l284m408N129n46M054k703k056q98P227p594m159Q937r8n612j170M252
7204A6799K700k986J672l601J613k515j352P836K65j264n380q183K974K636K86
7189A1500N684L764n519q2L460o005O500J357n100o904q768L756P822J402m011
$$ plain form
7295 17659 18651 19115 22246 19199 14167 10637 12238 5612 3328 7081 16315 20976 19451 20444 23327
7280 23327 23136 13541 7276 11985 13228 15572 19096 17530 18919 26079 26965 21941 21569 22775 14179
7265 14179 14110 16616 15983 9135 758 3725 7268 17723 28413 30030 30391 29663 25101 20082 18926
7250 18926 15724 13276 11344 15558 22531 26180 24827 25933 24045 27330 22196 18192 20169 30066 29116
7235 29116 24204 22960 21293 16796 20313 21553 31819 27489 27663 30765 26925 17173 16978 18881 19728
7220 19728 16444 12036 17165 16619 20673 17970 15914 15016 22243 14649 10490 19427 19329 13717 12547 16799
7204 16799 19499 16513 18185 14584 16197 13682 12330 20166 20431 19167 13787 5604 8578 11214 11500
7189 11500 17184 20948 15429 15347 18807 12802 19302 20659 15559 8655 -113 3643 11465 12867 8856
7174H856J713K481K301K055j277l109O584L104q658n134L552O681L225j035n434
7159A5905J492J213o63Q829K758k658p646L060q625n034L234R233Q637M36O31
7144C0802P53j3059j409J0568P639n467r127j96l779J023q5j637J327L806j347
7129A9812P396o634n524j951p384n129O254M345n729k23Q607O56m248O327j958
7114A4617l824L295O307j314j441O264m784q463l752J344J042O04q66m828Q373
7099A2574J0517m00p991m864n86j514n409J83R440O913K578K656k54o186m363
7084A3294M918J165Q24l863j3972J451N982l121O20m415L580l435O977J0696k282
7069A8419r935L40J0668R55p165q66j000L759J164L352N022j057j1496q757j119
$$ plain form
7174 8856 10569 13050 15351 17406 16129 13020 19604 22708 14050 8916 12468 19149 22374 21339 15905
7159 15905 17397 18610 17947 26776 29534 26876 19230 22290 13665 8631 11865 21098 29735 30171 30802
7144 30802 31555 18496 17087 27655 35294 29827 20700 20504 16725 17748 17663 16026 17353 21159 19812
7129 19812 27208 20574 15050 13099 5715 586 6840 11185 5456 5233 13840 14496 10248 16575 14617
7114 14617 10793 14088 20395 19081 17640 23904 19120 10657 6905 8249 9291 9895 9029 4201 12574
7099 12574 23091 22691 14700 9836 9250 7736 2327 2510 11950 18863 21441 24097 23843 17657 13294
7084 13294 18212 19377 20201 16338 2366 3817 9799 6678 7298 2883 6463 3028 10005 20701 18419
7069 18419 8484 8824 19492 20447 13282 12416 11416 15175 16339 19691 24713 23656 12160 3403 2284
7054B284L229j069o776k211r57Q198Q449k347m465O765P230k390k086p356o92
7039E806P118P332p704L288n144m281L617M804N786N894j677n557j620j831K057
7024A7888L392l824K750K609l723j410L175Q685O798M52j5227r976O05J755M332
7009A8281J217l386k467L255P293M136o854n767M224m023o423N127r61M202k629
6994A5225k468M898J072k70j545N52J657k434m167n662k140j65N359J2496K01
6979B2609o761m518l920N182J1473M30n760k534K04l181Q618J696m452n954j369
6964A1763p916j120J302K837l691r94J61k086O129J466J764k653RL920j28K402
6948A3165j751n527o50M025K700J490k090K718J096m427o67Q50m306J833Q019
$$ plain form
7054 2284 5513 4444 -2332 -4543 -5500 2698 11147 8800 4335 11100 18330 15940 13854 6498 5806
7039 5806 12924 20256 12552 15840 10696 6415 10032 14836 20622 26516 24839 19282 17662 15831 17888
7024 17888 21280 17456 20206 22815 19092 17682 20857 29542 36340 36792 21565 11589 12194 13949 18281
7009 18281 19498 16112 13645 16900 24193 28329 21475 15708 19932 15909 9486 14613 13652 17854 15225
6994 15225 12757 17655 18727 18457 16912 17464 19121 16687 12520 6858 4718 4553 9912 22408 22609
6979 22609 15848 11330 7410 12592 24065 24495 18735 16201 16405 13224 21842 23538 19086 13132 11763
6964 11763 3847 2727 4029 6866 3175 2181 2342 256 6385 7851 9615 6962 6971 10891 10763 13165
6948 13165 11414 5887 5237 9262 11962 13452 11362 14080 15176 10749 10082 10932 6626 8459 16478
6933A6478P058P889M730m300r139l494l7N932K989k834m837k069k629K331L127
6918B1195n677k450J393M682m881o521RK124n408J596r617P745R460M31m46k47
6902A3388n021K853N650n513l123J90K802N053K487l644J862r593o226K322j05
6887C382R487P374K996k602l677O915M124l923j2725m67M748m945l66l782L125
6872I664K960N152N660l010j333m544J58q99L091j938o99o446j0244q10K38M198
6856A198l4n52N313L57r849o844M246L291k39M660O923k577Q997L732j143N646
6840B3125J1372R107K943o198j6075j1218P92k781K728M691l178l164n483j556
6826E105m732q07J592N383Q83l87l496L656M385M965O811J764O4o786m301JK590
$$ plain form
6933 16478 23536 31425 36155 31855 22716 19222 19185 25117 28106 25272 20435 18366 15737 18068 21195
6918 21195 15518 13068 14461 19143 14262 7741 7750 9874 4466 6062 -3555 4190 13650 14081 13635 13388
6902 13388 8367 11220 16870 11357 8234 8424 11226 16279 18766 15122 16984 7391 1165 3487 3382
6887 3382 12869 20243 23239 20637 16960 23875 27999 24076 11351 10884 15632 10687 10321 6539 9664
6872 9664 12624 17776 23436 20426 19093 14549 14707 13808 16899 14961 14262 7816 -2428 -3238 -3000 1198
6856 1198 1164 612 5925 6282 -3567 -10411 -6165 -2874 -3113 1547 8470 5893 14890 18622 17479 23125
6840 23125 34497 43604 46547 40349 24274 13056 13848 11067 13795 18486 15308 12144 6661 5105
6826 5105 373 -434 1158 6541 7424 7037 3541 7197 11582 16547 23358 25122 25186 18400 14099 14100 16690
6809A6690l847l064J068J100k9K286K809Q05K483J386K716L397o457m969K969
6794A9343k744K712K054p799M006J2517P572q14P618J300J32P822l277J161R024
6779F0627J2420P867O199k067o907K560L453P056Q982J359o776p642P44J9133
6765A07008J5236K3033P679J7085M0259N5464O7032N6560J9658l1070o5796q0802
6753B31346o9914m7960l1637j9660j6103j5943m044j450q794m520l502P499K294
6740A7612n893k202J278L982M889Q361L064j0011j151j240J116M576l040n256
6726A6085o584K315L593m093L652j288K366m073K733K47M13q285R349Q634l313
6711B1751k464q316k863L407L583j886J941L777L444j707m037o567R97r69J922
$$ plain form
6809 16690 12843 9779 10847 11947 11918 14204 17013 17818 20301 21687 24403 27800 21343 16374 19343
6794 19343 16599 19311 21365 13566 17572 30089 37661 36847 44465 45765 45897 53719 50442 51603 60627
6779 60627 73047 80914 87113 85046 78139 80699 84152 91208 100190 101549 94773 87131 87875 107008
6765 107008 122244 145277 152956 170041 210300 265764 332796 389356 409014 377944 312148 231346
6753 231346 161432 113472 81835 62175 46072 30129 26085 24635 15841 11321 7819 15318 17612
6740 17612 11719 9517 10795 14777 19666 28027 31091 21080 19929 18689 19805 24381 21341 16085
6726 16085 9501 11816 15409 11316 14968 13680 16046 11973 14706 14953 15366 7081 16430 25064 21751
6711 21751 19287 10971 8108 11515 15098 13212 15153 18930 22374 20667 16630 10063 11060 10091 12013
6696A2013m664l436K72m47M689P46k656P73p731k739P050R701j713m336M920n112
6680G330m899J114M358Q12o323o799q316N464J3196q62j353M794k595k798P610
6665A0733R344j4487k218P416J38j0444K538N966n184l770l747P005P945M745
6651A5980K93j110O830l460o723J097M829n511r477K359M444J477J389j780j344
6636I293r38j968J60K547q525k205p044L926Q642Q597m879m767l658M17M45M057
6620D100j106o152k094L613N945k491k107L560l278M50p29L297K573K625k720
6605E486m088k515j917L224L654O53J305Q80m695K790L516K969N33L046m000l225
6589G616j423n754N009K431n228m191L194K428j206N373K448l429o303P535J1495
$$ plain form
6696 12013 7349 3913 4185 3738 8427 9173 6517 7290 -441 -3180 3870 13571 11858 7522 12442 7330
6680 7330 2431 3545 7903 8715 2392 -4407 -12723 -7259 5937 5075 3722 8516 5921 3123 10733
6665 10733 20077 5590 3372 10788 10926 482 3020 8986 3802 32 -3715 3290 11235 15980
6651 15980 16273 15163 21993 18533 11810 12907 17736 12225 2748 5107 9551 11028 12417 10637 9293
6636 9293 8355 6387 6547 9094 569 -1636 -8680 -4754 3888 12485 7606 2839 -819 -402 43 4100
6620 4100 2994 -3158 -5252 -1639 4306 1815 -292 3268 -10 440 -289 3008 5581 8206 5486
6605 5486 1398 -1117 -3034 190 3844 4497 5802 6682 1987 4777 8293 11262 11795 14841 10841 7616
6589 7616 6193 439 5448 7879 2651 -1540 1654 4082 2876 8249 10697 7268 965 8500 19995
6574A9995m290k853q038r38K965j0387n204l162N94Q810R139J0334j652q758k062
6559D493m327K658j780J118j491k93k141J184R77Q31O522O916l827k128r71J003
6543H744j677j0577n140Q521O556L566Q25l65K485q234J754N355m015k360m545
6528H93J326j405m194m46N353O148l395J330N694p923n164O164k908O452M250
6513A2175q870N940N543K674m726J96O035o37m289o717j244k942J81J57p600k856
6497f980N357N614j2291j6892P604J0031J1003O845J826r95p01l864L97M369o14
6482A0709J319m73o109n249L637k082o422K828J633K170M893k7p397P50O73m068
6466c215L351O748k021M643m871k27O284k883o185k53l581o13P336j170m213q7
$$ plain form
6574 19995 15705 12852 4814 3876 6841 -3546 -8750 -11912 -11318 -2508 6631 16965 15313 6555 4493
6559 4493 166 2824 1044 2162 671 378 -1763 -579 398 1229 7751 14667 10840 8712 7741 8744
6543 8744 7067 -3510 -8650 -129 6427 9993 10818 10453 12938 4704 6458 11813 7798 5438 893
6528 893 2219 814 -3380 -3826 1527 7675 4280 5610 11304 3381 -1783 4381 1473 7925 12175
6513 12175 3305 9245 14788 17462 12736 12932 18967 18330 14041 7324 6080 3138 3319 3476 -4124 -6980
6497 -6980 -1623 3991 -8300 -25192 -17588 -7557 3446 10291 12117 11122 10421 6557 6954 11323 10709
6482 10709 12028 11555 5446 197 3834 1752 -4670 -1842 -209 1961 6854 6827 -570 180 853 -3215
6466 -3215 136 6884 4863 9506 4635 4408 10692 7809 1624 1371 -2210 -2823 4513 3343 -870 -957
6450i57l936K486m22l640J843j556J896O759Q464p321k19L15O314l514m343J579
6434C748q087k958K854k710o308k85J484Q93M593J5304P312m327o190k442J254
6419D135R42K468J816n936j594Q653Q6p44k021k231L461n059o65J471K56n753
6403g15k15r51m192K347j076j46q51j746J33L386K844q605n212N931j558J254
6387i372K864J1205K587k470k483K094L027j588l48j200K716p829M33R698M362
6372A3696o737p379j398k991M907l53p720N673K018Q584n76k563M281k885k806
6357C751o588j677l414n621M886N245r549m023O173L677L632m232K232M136j981
6342c353K926R00J081O13r636q109L623J2079M806j1139m307o412R4Q416R58k964
$$ plain form
6450 -957 -4893 -2407 -2829 -6469 -4626 -6182 -4286 2473 10937 3616 3397 3712 10026 6512 2169 3748
6434 3748 -4339 -7297 -4443 -7153 -13461 -13746 -12262 -11369 -6776 8528 15840 11513 5323 2881 4135
6419 4135 5077 7545 9361 3425 1831 10484 10570 9826 7805 5574 9035 3976 3311 4782 5038 -715
6403 -715 -930 -1881 -6073 -3726 -4802 -4948 -5799 -7545 -7412 -4026 -1182 -9787 -14999 -9068 -10626 -9372
6387 -9372 -6508 4697 7284 4814 2331 4425 7452 5864 5516 4316 7032 -797 -364 9334 13696
6372 13696 6959 -420 -1818 -4809 98 -255 -7975 -2302 -284 8300 7724 5161 9442 6557 3751
6357 3751 -2837 -4514 -7928 -13549 -8663 -3418 -12967 -16990 -10817 -7140 -3508 -7740 -5508 -1372 -3353
6342 -3353 -427 473 1554 2167 -7469 -15578 -11955 124 4930 -6209 -10516 -16928 -16834 -8418 -7460 -10424
6326a0424N22J396J778M493j092L797j354r60N00J0839j806r448n49M19k43m54
6310b586J028l458J811M317l263N918j923J641k024K118o976L372L095r995K605
6295d320n471O116P615j65l2M838k423q081l987o642L01J2957Q080J722k109J0064
6279A8463R785K216k042j0571q196o811j1558m339l56l123J557Q761Q099r128
6265g243j3801P312P007L151L276J189p610P716N403K346k709j381L530J729K220
6250A2135K368M617m136r824k525l763p916l577L077K790r222q834o784L366J0507
6235a7721J0860J9455R199J4419J3273Q281j455l686n079p078q277j2586j4277
6222E328o540l0l156o384J40K774O823Q903M092L394P260p184n674p598J23rj0990
$$ plain form
6326 -10424 -9902 -8506 -6728 -2235 -3327 470 -884 -1844 -1344 9495 7689 -1759 -2308 -1889 -2132 -2586
6310 -2586 -1558 -5016 -3205 1112 -2151 3767 1844 3485 1461 3579 -3397 -25 3070 -6925 -4320
6295 -4320 -9791 -3675 3940 3775 3743 8581 6158 -1923 -5910 -12552 -12251 706 8786 10508 8399 18463
6279 18463 28248 30464 28422 17851 9655 2844 -8714 -13053 -13409 -16532 -14975 -6214 1885 -7243
6265 -7243 -21044 -13732 -6725 -3574 -298 891 -6719 997 6400 8746 6037 4656 8186 9915 12135
6250 12135 14503 19120 14984 5160 2635 -1128 -9044 -12621 -9544 -6754 -15976 -24810 -31594 -28228 -17721
6235 -17721 -6861 12594 21793 36212 49485 57766 56311 52625 47546 40468 32191 19605 5328
6222 5328 -1212 -1242 -4398 -10782 -10642 -7868 -1045 7858 11950 15344 22604 15420 9746 2148 2271 2262 -8728
6205h728p410K090M544m415L25P016J449m532J56L011j763J586k994k227n726
6190a7618M470J0494N069K432Q115K459N122N599P628N691k839l763q545o128
6176A8186n068j014j3605p232o446P62Q481M157K872q24l101O793k099q723n028
6161a1889k180k90O300O233O935L085K48N24r110j3147O70N541M09O32P893L160
6145E014L600K748J200Q54l671l235n361k698k933K23L105k445Q471N44l604k598
6129g86m258M368r80q355r1J1073N321Q885N635l80p633l319k942l855P61n226
6113a782j102p99l267j637L987J3254N538j442J022m337n268L133J996k292p591
6098e87k911K973L647P49P78l269j288j942k530N182N812k576n644Q09j994j3238
$$ plain form
6205 -8728 -16138 -14048 -9504 -13919 -13594 -6578 -5129 -9661 -9505 -6494 -8257 -6671 -9665 -11892 -17618
6190 -17618 -13148 -2654 2415 4847 12962 15421 20543 26142 33770 39461 36622 32859 24314 18186
6176 18186 13118 12104 -1501 -8733 -15179 -14417 -5936 -1779 1093 269 -2832 3961 1862 -6861 -11889
6161 -11889 -14069 -14359 -8059 -1826 5109 8194 8442 8966 -144 -13291 -12621 -7080 -6671 -6039 1854 5014
6145 5014 8614 11362 12562 13416 9745 6510 1149 -1549 -4482 -4259 -1154 -3599 4872 5416 1812 -786
6129 -786 -5044 -676 -1656 -10011 -10102 971 6292 15177 20812 20432 12799 9480 6538 2683 3444 -1782
6113 -1782 -2884 -3683 -6950 -8587 -4600 8654 14192 12750 13772 9435 4167 7300 9296 7004 -587
6098 -587 -3498 -525 3122 3871 4649 1380 92 -1850 -4380 802 6614 4038 -1606 -797 -2791 -16029
6082a6029m879J1539L838L060k576q166j202K677k546m65J717M259L771J2302
6068G300L675N163K937n18o514q800n653L869M670o230L211L555l611Q70L331
6053G255p294o479K667N108M126L769p512q262O96N709M484p74l062P85K274m66
$$ plain form
6082 -16029 -20908 -9369 -5531 -2471 -5047 -13213 -14415 -11738 -14284 -14749 -13032 -8773 -5002 7300
6068 7300 10975 16138 19075 18557 12043 3243 -2410 1459 6129 -101 3110 6665 3054 3924 7255
6053 7255 -39 -6518 -3851 1257 5383 9152 1640 -6622 -5926 -217 4267 3493 431 1216 3490 3024
$$ [...]
##END NTUPLES=NMR SPECTRUM
##END=
