##TITLE=Analysis number 328813
Compound Code cc 58710
Book Reference 486/152
Project Code adrs
Chemist Name simons
##JCAMPDX= 6.0         $$ Bruker NMR JCAMP-DX V2.0
##DATA TYPE= NMR SPECTRUM
##DATA CLASS= NTUPLES
##ORIGIN= Bruker BioSpin GmbH
##OWNER= nmr
$$ XWIN-NMR		Version 3.5
$$ Thu Jul  5 13:40:21 2007 GMT Daylight Time (UT+1h)  MAYBRIDGE\nmr@NMR_250MHZ
##.OBSERVE FREQUENCY= 250.131544655141
##.OBSERVE NUCLEUS= ^1H
##.ACQUISITION MODE= SIMULTANEOUS (DQD)
##.ACQUISITION SCHEME= undefined
##.AVERAGES= 16
##.DIGITISER RES= 18
##SPECTROMETER/DATA SYSTEM= dpx250
##.PULSE SEQUENCE= zg30
##.SOLVENT NAME= CDCl3
##.SHIFT REFERENCE= (INTERNAL, CDCl3, 0, 16.522)
##AUDIT TRAIL= $$ (NUMBER, WHEN, WHO, WHERE, WHAT)
$$ ##TITLE= Audit trail, XWIN-NMR		Version 3.5
$$ ##JCAMPDX= 5.01
$$ ##ORIGIN= Bruker BioSpin GmbH
$$ ##OWNER= nmr
$$ C:\u/data/dgb/nmr/ADRS/480/pdata/1/auditp.txt
$$ ##AUDIT TRAIL=  $$ (NUMBER, WHEN, WHO, WHERE, WHAT)
(   1,<2007-07-05 13:39:26.70 +100>,<MAYBRIDGE\nmr>,<NMR_250MHZ>,
      <created by zg, POWCHK disabled, PULCHK disabled
       configuration hash MD5:
       76 6E 9A 78 1E 09 19 81 EC 84 63 8F B0 6A 59 2D
       data hash MD5: 64K
       9C 32 DC 08 6A 0C EB C9 83 BA 28 71 98 E9 E7 E3>)
(   2,<2007-07-05 13:39:54.05 +100>,<MAYBRIDGE\nmr>,<NMR_250MHZ>,
      <Start of raw data processing
       ef LB = 0.3 FT_mod = 6 PKNL = 1 SI = 32K 
       data hash MD5: 32K
       6C 5E 1B 9C 08 BD 85 FD AE 9D 98 11 E3 05 D1 1D>)
(   3,<2007-07-05 13:40:02.84 +100>,<MAYBRIDGE\nmr>,<NMR_250MHZ>,
      <apk 
       data hash MD5: 32K
       6D 92 71 C9 11 18 C0 74 5D BA A2 68 B4 C7 FE 49>)
(   4,<2007-07-05 13:40:04.45 +100>,<MAYBRIDGE\nmr>,<NMR_250MHZ>,
      <abs ABSG = 5 
       data hash MD5: 32K
       9F B9 C8 69 26 9E 0C 03 E8 3C 98 06 5D 23 85 C9>)
$$ ##END=
$$ 
$$ hash MD5
$$ E8 7F C7 68 D2 54 6F 56 50 D0 FB 71 FC 8A 87 CE
##$RELAX= 
##$RELAX= 
##$RELAX= 
##$RELAX= 
##$RELAX= 
##$RELAX= 
##$RELAX= 
$$ Bruker specific parameters
$$ --------------------------
##$DU= <C:\u>
##$EXPNO= 480
##$NAME= <ADRS>
##$PROCNO= 1
##$TYPE= <nmr>
##$USER= <dgb>
##$AMP= (0..31)
100 100 100 100 100 100 100 100 100 100 100 100 100 100 100 100 100 100 
100 100 100 100 100 100 100 100 100 100 100 100 100 100 
##$AQSEQ= 0
##$AQ_mod= 3
##$AUNM= <au_zg>
##$AUTOPOS= <33 >
##$BF1= 250.13
##$BF2= 250.13
##$BF3= 250.13
##$BF4= 250.13
##$BF5= 500.13
##$BF6= 500.13
##$BF7= 500.13
##$BF8= 500.13
##$BYTORDA= 1
##$CFDGTYP= 0
##$CFRGTYP= 5
##$CHEMSTR= <none>
##$CNST= (0..31)
1 1 145 1 1 1 1 1 1 1 1 1 1 1 1 1 1 1 1 1 1 1 1 1 1 1 1 1 1 1 1 1 
##$CPDPRG= <>
##$CPDPRG1= <>
##$CPDPRG2= <>
##$CPDPRG3= <>
##$CPDPRG4= <mlev>
##$CPDPRG5= <mlev>
##$CPDPRG6= <mlev>
##$CPDPRG7= <mlev>
##$CPDPRG8= <mlev>
##$CPDPRGB= <>
##$CPDPRGT= <>
##$D= (0..31)
0 1 0 0 0 0 0 0 0 0.06 0 0 0 0 0 0 0.0002 0 0 0 0 0 0 0 0 0 0 0 0 0 0 
0 
##$DATE= 1183639164
##$DBL= (0..7)
120 120 120 120 120 120 120 120 
##$DBP= (0..7)
150 150 150 150 150 150 150 150 
##$DBP07= 0
##$DBPNAM0= <>
##$DBPNAM1= <>
$$ [...]
##$SUBNAM7= <"">
##$SUBNAM8= <"">
##$SUBNAM9= <"">
##$SW= 20.6930455092707
##$SWIBOX= (0..15)
0 0 3 0 0 0 0 0 0 0 0 0 0 0 0 0 
##$SW_h= 5175.983436853
##$TD= 65536
##$TD0= 1
##$TE= 296.16
##$TE2= 300
##$TE3= 300
##$TEG= 300
##$TL= (0..7)
0 120 120 120 120 120 120 120 
##$TP= (0..7)
150 150 150 150 150 150 150 150 
##$TP07= 0
##$TPNAME0= <>
##$TPNAME1= <>
##$TPNAME2= <>
##$TPNAME3= <>
##$TPNAME4= <>
##$TPNAME5= <>
##$TPNAME6= <>
##$TPNAME7= <>
##$TPOAL= (0..7)
0.5 0.5 0.5 0.5 0.5 0.5 0.5 0.5 
##$TPOFFS= (0..7)
0 0 0 0 0 0 0 0 
##$TUNHIN= 0
##$TUNHOUT= 0
##$TUNXOUT= 0
##$USERA1= <user>
##$USERA2= <user>
##$USERA3= <user>
##$USERA4= <user>
##$USERA5= <user>
##$V9= 5
##$VALIST= <valist>
##$VCLIST= <CCCCCCCCCCCCCCC>
##$VD= 0
##$VDLIST= <DDDDDDDDDDDDDDD>
##$VPLIST= <PPPPPPPPPPPPPPP>
##$VTLIST= <TTTTTTTTTTTTTTT>
##$WBST= 1024
##$WBSW= 4
##$XGAIN= (0..3)
0 0 0 0 
##$XL= 0
##$YL= 0
##$YMAX_a= 403769
##$YMIN_a= -353292
##$ZGOPTNS= <>
##$ZL1= 120
##$ZL2= 120
##$ZL3= 120
##$ZL4= 120
##$ABSF1= 16.522
##$ABSF2= -4.171173
##$ABSG= 5
##$ABSL= 3
##$ALPHA= 0
##$AQORDER= 0
##$ASSFAC= 0
##$ASSFACI= 0
##$ASSFACX= 0
##$ASSWID= 0
##$AUNMP= <proc_1d>
##$AZFE= 0.1
##$AZFW= 0.1
##$BCFW= 0
##$BC_mod= 0
##$BYTORDP= 0
##$COROFFS= 0
##$CY= 12.5
##$DATMOD= 1
##$DC= 0
##$DFILT= <>
##$DTYPP= 0
##$F1P= 14.0000005364418
##$F2P= -0.99999901652339
##$FCOR= 0.5
##$FTSIZE= 32768
##$FT_mod= 6
##$GAMMA= 0
##$GB= 0
##$INTBC= 1
##$INTSCL= 1
##$ISEN= 128
##$LB= 0.3
##$LEV0= 0
##$LPBIN= 0
##$MAXI= 10000
##$MC2= 0
##$MEAN= 0
##$ME_mod= 0
##$MI= 0
##$NCOEF= 0
##$NC_proc= -2
##$NLEV= 6
##$NOISF1= 0
##$NOISF2= 0
##$NSP= 0
##$NTH_PI= 0
##$NZP= 0
##$OFFSET= 16.522
##$PC= 1
##$PHC0= -51.37165
##$PHC1= 6.525532
##$PH_mod= 1
##$PKNL= yes
##$PPARMOD= 0
##$PSCAL= 4
##$PSIGN= 0
##$REVERSE= no
##$SF= 250.13
##$SI= 32768
##$SIGF1= 0
##$SIGF2= 0
##$SINO= 400
##$SIOLD= 32768
##$SREGLST= <1H.CDCl3>
##$SSB= 0
##$STSI= 32768
##$STSR= 0
##$SW_p= 5175.98343685301
##$SYMM= 0
##$S_DEV= 0
##$TDeff= 65536
##$TDoff= 0
##$TI= <Analysis number 999999
Compound Code 99
Book Reference 9
Project Code 9>
##$TILT= no
##$TM1= 0
##$TM2= 0
##$TOPLEV= 0
##$USERP1= <user>
##$USERP2= <user>
##$USERP3= <user>
##$USERP4= <user>
##$USERP5= <user>
##$WDW= 1
##$XDIM= 32768
##$YMAX_p= 308536122
##$YMIN_p= -253878
$$ End of Bruker specific parameters
$$ ---------------------------------
##NTUPLES= NMR SPECTRUM
##VAR_NAME=  FREQUENCY,     SPECTRUM/REAL,   SPECTRUM/IMAG
##SYMBOL=    X,             R,               I
##VAR_TYPE=  INDEPENDENT,   DEPENDENT,       DEPENDENT
##VAR_FORM=  AFFN,          ASDF,            ASDF
##VAR_DIM=   32768,         32768,           32768
##UNITS=     HZ,            ARBITRARY UNITS, ARBITRARY UNITS
##FACTOR=    0.157963299565203, 1,           1
##FIRST=     4132.6476996994, 0,             0
##LAST=      -1043.33573715361, 0,           0
##MIN=       -1043.33573715361, -253878,     0
##MAX=       4132.6476996994, 308536122,     0
$$ Real data points
##PAGE= N=1
##DATA TABLE= (X++(R..R)), XYDATA
$$ [...]
$$ plain form
17259 5334 863 -2177 6427 12946 13588 11274 7785 5916 993 13961 17728 16260 14333 17977 20771
17244 20771 22005 16740 20554 28046 25809 32933 51152 71330 103501 156719 229914 310688 365731
17231 365731 371189 332003 293623 298218 341685 391648 400272 344144 250005 161764 106776 84268
17219 84268 64518 48416 36469 30634 29908 31739 25273 27593 29903 27620 25824 30873 34148 36023
17205 36023 36199 29322 22763 22811 33856 31833 35580 39193 36339 25436 22482 30587 45836 62442
17191 62442 92065 146501 218738 329680 464450 588377 647344 641324 604218 574317 569037
17180 569037 582979 577421 539158 470006 379101 287453 201459 142612 108914 88688 77320 65058
17168 65058 69319 75844 86118 104039 123288 140269 166839 189266 189402 181547 161868 133978 110312
$$ packed form
17259E334m471l040Q604O519O42k314l489j869m923J2968L767j468j927L644K794
17244B0771J234n265L814P492k237P124J8219K0178L2171N3218P3195Q0774N5043
17231C65731N458l9186l8380M595M3467M9963Q624n6128r4139q8241n4988k2508
17219H4268j9750j6102j1947n835p26J831o466K320K310k283j796N049L275J875
17205C6023J76o877o559M8J1045k023L747L613k854j0903k954Q105J5249J6606
17191F2442K9623N4436P2237J10942J34770J23927N8967o020l7106k9901n280
17180E69037J3942n558l8263o9152r0905r1648q5994n8847l3698k0226j1368j2262
17168F5058M261O525J0274J7921J9249J6981K6570K2427J36p855j9679k7890k3666
$$ plain form
17155 110312 86207 58621 46852 38584 37216 40610 57610 69262 68954 61404 64509 81237 105344
17142 105344 153362 198677 252041 291354 295103 264113 228805 229884 249653 282911 299455 272600
17130 272600 214623 156880 111696 78817 61806 52113 47362 41268 40501 55162 63463 66256 61974
17117 61974 56437 49147 30959 20111 25622 24024 23669 31210 52856 87027 111513 125636 148359
17104 148359 168839 164175 133499 100002 70574 56514 44806 36806 28055 14456 4553 3650 -4089
17091 -4089 176 10596 22649 18305 13182 11826 13906 14260 15245 4741 1003 9885 14058 15146
17077 15146 8889 3613 1859 2910 6345 16930 23771 24722 20350 11533 3407 4724 19162 26260
17063 26260 30502 27872 17374 12769 14611 13603 13606 12718 10845 11788 9875 18822 28189 32196 32470 30606
$$ packed form
17155A10312k4105k7586j1769q268j368L394J7000J1652l08p550L105J6728K4107
17142A05344M8018M5315N3364L9313L749l0990l5308J079J9769L3258J6544k6855
17130B72600n7977n7743m5184l2879j7011r693m751o094p67J4661Q301K793m282
17117F1974n537p290j8188j0848N511j598l55P541K1646L4171K4486J4123K2723
17104A48359K0480m664l0676l3497k9428j4060j1708q000q751j3599r903r03p739
17091d089M265J0420J2053m344n123j356K080L54R85j0504l738Q882M173J088
17077A5146o257n276j754J051L435J0585O841R51m372q817q126J317J4438P098
17063B6260M242k630j0498m605J842j008Lq88j873R43j913Q947R367M007K74j864
$$ plain form
17047 30606 45415 65729 92355 120048 130089 142586 161339 208713 288935 404205 564252
17036 564252 780920 1014514 1157241 1097137 880292 626186 415114 275737 203473 163698
17026 163698 134256 110781 89891 76228 70301 53046 46810 52711 59926 53733 44493 47908 49592
17013 49592 41609 36631 43979 43732 47867 52287 60382 61479 56152 38474 31208 34200 37267 46921
16999 46921 59706 75746 92303 114791 148088 201463 290735 439327 660512 909188 1112010
16988 1112010 1174011 1127533 1077008 1088620 1163961 1203656 1083670 845623 593171 402536
16978 402536 280233 213949 183515 145854 118712 103303 88730 72223 62869 52861 47292 51467
16966 51467 59536 48652 47737 49759 50925 42038 34430 33483 34747 34369 30135 33293 40291 39424 44246
$$ packed form
17047C0606J4809K0314K6626K7693J0041J2497J8753M7374Q0222J15270J60047
17036E64252K16668K33594J42727o0104k16845k54106k11072j39377p2264l9775
17026A63698k9442k3475k0890j3663n927j7255o236N901P215o193r240L415J684
17013D9592p983m978P348k47M135M420Q095J097n327j7678p266K992L067R654
16999D6921J2785J6040J6557K2488L3297N3375Q9272J48592K21185K48676K02822
16988A112010O2001m6478n0525J1612P5341L9695j19986k38047k52452j90635
16978D02536j22303o6284l0434l7661k7142j5409j4573j6507r354j0008n569M175
16966E1467Q069j0884r15K022J166q887p608r47J264l78m234L158O998q67M822
$$ plain form
16951 44246 51547 48193 46910 59397 59735 76639 106865 137419 185726 267274 408268 613971
16939 613971 824867 961087 950685 803318 617252 472753 404497 407244 446318 504749 568066
16928 568066 624250 655981 669023 676732 673595 657751 610788 540987 464630 374102 284265 215759
16916 215759 171408 139677 115536 95776 85266 76060 64430 60252 54166 51996 55592 58271 62968
16903 62968 68778 87541 99067 105899 123255 133597 140259 137684 135731 120925 101748 86622 74418
16890 74418 61878 52293 51314 58623 67697 80811 115916 155742 217748 285323 358096 417427 469143
16877 469143 496217 509291 505536 501343 518133 521533 509967 484067 432344 362436 285889 222250
16865 222250 166975 119442 93533 79046 60187 47598 38064 35659 42438 41174 31100 30780 31018
$$ packed form
16951D4246P301l354j283J2487L38J6904L0226L0554M8307Q1548J40994K05703
16939F13971K10896J36220j0402j47367j86066j44499o8256K747L9074N8431O3317
16928E68066N6184L1731J3042P709l137j5844m6963o9801p6357r0528q9837o8506
16916B15759m4351l1731k4141j9760j0510r206j1630m178o086k170L596K679M697
16903F2968N810J8763J1526O832J7356J0342O662k575j953j4806j9177j5126j2204
16890G4418j2540r585r79P309R074J3114L5105L9826O2006O7575P2773N9331N1716
16877D69143K7074J3074l755m193J6790L400j1566k5900n1723o9908p6547o3639
16865B22250n5275m7533k5909j4487j8859j2589r534k405O779j264j0074l20K38
$$ plain form
16852 31018 22741 16801 27677 35920 35691 43071 37846 24730 18502 22593 18343 15379 22716 26729
16838 26729 23558 20722 23086 22372 16831 17375 13015 13946 15258 8120 5613 16794 26956 27434 20303
16823 20303 21563 17938 20851 24055 30709 30323 23890 7593 6735 2047 5980 16465 25115 23590
16809 23590 21868 36094 55936 68380 75746 80012 86823 77022 73245 75352 82161 112379 149399
16796 149399 191701 210536 203733 191991 204140 238802 252758 210805 152305 115286 95248 81393
16784 81393 69573 69583 72601 84375 95654 110478 144842 194325 233628 231565 204548 187140 189841
16771 189841 208459 201890 166988 116107 84910 67692 60901 45078 31958 28658 25857 27437
16759 27437 30777 39661 46307 54988 56182 61195 62922 58965 70327 74899 75040 74698 74410 75477 80091
$$ packed form
16852C1018q277n940J0876Q243k29P380n225j3116o228M091m250k964P337M013
16838B6729l171k836K364p14n541N44m360R31J312p138k507J1181J0162M78p131
16823B0303J260l625K913L204O654l86o433j6297q58m688L933J0485Q650j525
16809B3590j722J4226J9842J2444P366M266O811r801l777K107O809L0218L7020
16796A49399M2302J8835o803j1742J2149L4662J3956m1953n8500l7019k0038j3855
16784H1393j1820J0L018J1774J1279J4824L4364M9483L9303k063k7017j7408K701
16771A89841J8618o569l4902n0881l1197j7218o791j5823j3120l300k801J580
16759B7437L340Q884O646Q681J194N013J727l957J1362M572J41l42k88J067M614
$$ plain form
16744 80091 68850 50770 37222 32966 37121 47186 52368 62688 66960 67558 64561 69244 71847
16731 71847 62331 60810 62203 64035 63539 60977 52996 51638 48536 47296 61919 74025 69289 57784
16717 57784 47856 52553 59192 60632 74158 71483 59877 58349 68484 67732 68691 65073 62561 68764
16703 68764 80033 82021 97177 115057 118397 123095 126135 123437 135783 154782 178924 205310 233767
16690 233767 271288 303570 332117 342477 347605 339556 329229 319098 323589 331151 347911 391974
16678 391974 447270 510557 569113 619913 664749 689201 714220 751432 820497 904130 1034859
16667 1034859 1238765 1530336 1966261 2624744 3682358 5413163 8118230 12056422 17173574
16658 17173574 22953735 28366857 32091797 32997534 30910050 26425525 20870758 15454836
$$ packed form
16744H0091j1241j8080j3548m256M155J0065N182J0320M272N98k997M683K603
16731G1847r516j521J393J832m96k562p981j358l102j240J4623J2106m736j1505
16717E7784r928M697O639J440J3526k675j1606j528J0135p52R59l618k512O203
16703F8764J1269J988J5156J7880L340M698L040k698J2346J8999K4142K6386K8457
16690B33767L7521L2282K8547J0360N128q049j0327j0131M491P562J6760M4063
16678C91974N5296O3287N8556N0800M4836K4452K5019L7212O9065Q3633J30729
16667A034859K03906K91571M35925O58483J057614J730805K705067L938192N117152
16658A7173574N780161N413122L724940R05737k087484m484525n554767n415922
$$ plain form
16650 15454836 11010087 7810047 5707205 4389867 3571881 3091357 2884032 2892757 3076488
16641 3076488 3353309 3642608 3912807 4183258 4464623 4614720 4481418 4103472 3669666
16632 3669666 3266991 2864246 2443091 2050181 1751727 1593423 1584111 1734705 2083396 2709966
16622 2709966 3640860 4776936 5801841 6205845 5890573 4901867 3761840 2804745 2180572
16613 2180572 1872042 1778319 1830552 2017841 2377539 2966303 3941156 5531736 8052063
16604 8052063 11748637 16587870 22069945 27148192 30412161 30894836 28412311 23736173
16596 23736173 18225922 13079888 9030443 6216122 4396834 3244143 2506708 2007708
16588 2007708 1660697 1394737 1191377 1032705 910675 813804 740341 665963 597792 548096
$$ packed form
16650A5454836m444749l200040k102842j317338q17986m80524k07325Q725J83731
16641C076488K76821K89299K70199K70451K81365J50097j33302l77946m33806
16632C669666m02675m02745m21155l92910k98454j58304r312J50594L48691O26570
16622B709966R30894J136076J024905M04004l15272r88706j140027r57095o24173
16613B180572l08530r3723N2233J87289L59698N88764R74853J590580K520327
16604H052063L696574M839233N482075N078247L263969M82675k482525m676138
16596B3736173n510251n146034m049445k814321j819288j152691p37435m99000
16588B007708l47011k65960k03360j58672j22030r6871p3463p4378o8171m9696
$$ plain form
16578 548096 494861 426783 369963 329117 302141 298729 293752 296107 300412 312402 332682 328594
16566 328594 306100 273184 241681 198408 165459 135995 116585 102685 97167 92618 84811 80996
16554 80996 81018 81368 73840 63932 51544 50228 54007 55963 59184 55656 58141 62312 55890 52235 50605
16539 50605 40436 47101 47734 38929 29016 29289 26047 17702 17031 30240 30284 24934 20921 13010 10399
16524 10399 10282 8951 11064 13406 9539 -1320 8021 10498 14406 25576 27302 28011 25310 17391
16510 17391 12124 -671 -12893 -18931 -16331 -5557 -8142 -6992 -6722 -11844 -5741 -1625 9100 18425
16496 18425 21092 19735 29740 29198 24408 23287 22518 13750 9282 1336 -4131 1352 12125 14500
16482 14500 17155 23220 17044 15572 19437 13317 6481 2248 -6601 -3923 -4024 2928 4424 -6842
$$ packed form
16578E48096n3235o8078n6820m0846k6976l412m977K355M305J1990K0280m088
16566C28594k2494l2916l1503m3273l2949k9464j9410j3900n518m549p807l815
16554H0996K2L50p528r908j2388j316L779J956L221l528K485M171o422l655j630
16539E0605j0169O665O33q805r913K73l242q345o71J3209M4n350m013p911k611
16524A0399j17j331K113K342l867j0859R341K477L908J1170J726P09k701p919
16510A7391n267j2795j2222o038K600J0774k585J150K70n122O103M116J0725R325
16496A8425K667j357J0005n42m790j121p69q768m468p946n467N483J0773K375
16482A4500K655O065o176j472L865o120o836m233q849K678j01O952J496j1266
$$ plain form
16468 -6842 -13712 -5211 5126 10107 2593 5934 5072 8656 15061 22650 28321 19595 8784 -2459
16454 -2459 -12455 -21080 -24780 -34398 -34260 -35564 -30546 -15636 -13612 -5881 -1995 4343 6814 1741 -699
16439 -699 -7875 -1280 1489 -457 3658 4612 10753 14553 8894 15045 24103 25365 25977 24178 18328
16424 18328 3721 -4862 -15070 -19056 -5839 1662 6106 8745 4038 -6914 -3069 6106 261
16411 261 -2047 2352 -549 -317 -5188 -1076 9528 9325 4558 -864 3361 13250 14483 12639 13343
16396 13343 9730 6087 5321 5226 1367 -2651 5542 10116 2373 -3366 782 8592 5031 -1801 4841
16381 4841 4561 261 11834 19491 24702 30108 21271 10736 17336 8675 659 3731 5011 -7944
16367 -7944 -4755 -4176 -5024 -7068 -3532 -542 12732 18803 13065 10672 14963 13041 5673 5678 -670 -5633
$$ packed form
16468f842o870Q501J0337M981p514L341q62L584O405P589N671q726j0811j1243
16454b459r996q625l700r618J38j304N018J4910K024P731L886O338K471n073k440
16439f99p176O595K769j946M115R54O141L800n659O151R058J262O12j799n850
16424A8328j4607q583j0208l986J3217P501M444K639m707j0952L845R175n845
16411B61k308M399k901K32m871M112J0604k03m767n422M225R889J233j844P04
16396A3343l613l643p66r5l859m018Q193M574p743n739M148P810l561o832O642
16381D841k80m300J1573P657N211N406q837j0535O600q661q016L072J280j2955
16367g944L189N79q48k044L536K990J3274O071n738k393M291j922p368No348m963
$$ plain form
16351 -5633 -5535 -2714 -4742 -4596 -1184 4747 8733 -1868 -1720 -9303 -10937 -9788 -1381 2339 7666
16336 7666 2542 -4238 -2495 -6345 -8662 1276 16696 30747 24661 17334 5483 2702 2670 111
16322 111 7794 9493 12400 2853 -2680 1830 -5386 -14223 -23952 -15781 -5217 -6183 -11014 -5775 -8733
16307 -8733 -7128 -17742 -18379 -17770 -12865 -15228 -19452 -24845 -13664 -2290 12695 15416 17940 15596
16293 15596 824 -1178 -4929 -11622 -4793 -2056 359 6612 4639 -5837 1938 4648 -9978 -6746
16279 -6746 -22 -774 2578 1481 1092 15690 22869 19284 14343 11441 9766 8169 9976 6528 12376
16264 12376 17388 15068 8629 6149 -541 -7577 -8276 -8360 -3442 -3981 -7769 -12418 -11139 2456 4369
16249 4369 2177 -1056 -6320 -5234 -3258 -5078 -1818 3323 5249 -1353 858 -5914 -3064 -4316 -5155
$$ packed form
16351e633R8K821k028J46L412N931L986j0601J48p583j634J149Q407L720N327
16336G666n124o780J743l850k317R938J5420J4051o086p327j1851k781l2k559
16322A11P683J699K907r547n533M510p216q837r729Q171J0564r66m831N239k958
16307h733J605j0614o37O09M905k363m224n393J1181J1374J4985K721K524k344
16293A5596j4772k002l751o693O829K737K415O253j973j0476P775K710j4626L232
16279f746O724p52L352j097l89J4598P179l585m941k902j675j597J807l448N848
16264A2376N012k320o439k480o690p036o99q4M918n39l788m649J279J3595J913
16249D369k192l233n264J086J976j820L260N141J926o602K211o772K850j252q39
$$ plain form
16234 -5155 -2660 897 5719 -1680 -5430 -6087 -6966 -11697 -19454 -17369 -12464 -5171 -4754 -12383 -19482
16219 -19482 -20692 -16209 -1656 4668 8198 11405 2682 -5206 -2013 7004 7260 -2867 -9492 -9620
16205 -9620 -11180 -10170 -2345 3597 10743 8592 6079 7333 6702 8836 9758 -1571 -20802 -19570 -21854
16190 -21854 -8772 401 2445 1443 4474 3567 906 3205 -4745 -16018 -12879 -5368 -3797 -1856
16176 -1856 5340 4899 -1674 -5113 -1676 1877 -1939 -6065 -10110 -1526 -4028 1546 106 -3302 -6237
16161 -6237 1495 5929 2248 -688 3069 13882 17565 15630 18498 25346 27679 41226 81173 116014
16147 116014 142193 163165 172316 173001 165613 137196 108401 71787 53410 47071 37327 25009 10334
16134 10334 -2632 -6519 -363 1658 -2750 -2818 1564 11958 9970 15062 16918 10321 15424 24119
$$ packed form
16234e155K495L557M822p399l750o57q79m731p757K085M905P293M17p629p099
16219a9482j210M483J4553O324L530L207q723p888L193R017K56j0127o625j28
16205i620j560J010P825N942P146k151k513J254o31K134R22j1329j9231J232k284
16190b1854J3082R173K044j002L031r07k661K299p950j1273L139P511J571J941
16176a856P196m41o573l439L437L553l816m126m045Q584k502N574j440l408k935
16161f237P732M434l681k936L757J0813L683j935K868O848K333J3547L9947L4841
16147A16014K6179K0972R151O85p388k8417k8795l6614j8377o339r744j2318j4675
16134A0334j2966l887O156K021m408o8M382J0394j988N092J856o597N103Q695
$$ plain form
16120 24119 23489 21294 30946 37121 47136 54196 45548 29685 26848 22006 10471 727 4370 11899
16106 11899 10264 3528 8476 13140 7711 5228 -802 -3622 6483 15040 18550 34524 54916 80508
16092 80508 110364 137322 162217 177539 170025 141847 104370 74808 46570 27280 21152 12647
16080 12647 15576 16851 15957 11772 1102 -5272 -5782 -1692 -1042 -7599 -3829 1243 5167 7337 15449
16065 15449 4814 6248 15706 11309 15539 9250 4106 -1019 -5988 -6738 -627 -4043 -779 11718
16051 11718 3302 9731 18367 10097 2063 -4008 -8478 -5277 -6462 -134 3582 -4351 -14128 -11958
16037 -11958 -15169 -12562 -567 7803 8208 -5976 -3964 -5815 654 265 -4657 -78 -4913 -16539
16023 -16539 -18231 -21872 -16694 -10096 -7966 -8493 -3894 -5252 -8219 323 7126 7790 -3895 -9585 -7360
$$ packed form
16120B4119o30k195R652O175J0015P060q648j5863k837m842j1535r744L643P529
16106A1899j635o736M948M664n429k483o030k820J0105Q557L510J5974K0392K5592
16092H0508K9856K6958K4895J5322p514k8178l7477k9562k8238j9290o128q505
16080A2647K929J275q94m185j0670o374n10M090O50o557L770N072L924K170Q112
16065A5449j0635J434R458m397M230o289n144n125m969p50O111l416L264J2497
16051A1718q416O429Q636q270q034o071m470L201j185O328L716p933r777K170
16037a1958l211K607J1995Q370M05j4184K012j851O469l89m922M579m835j1626
16023a6539j692l641N178O598K130n27M599j358k967Q542O803O64j1685n690K225
$$ plain form
16008 -7360 -7059 -7430 -9030 -3503 -562 -3966 -4862 -6446 -3640 2974 5956 10934 19233 17851 17165 9814
15992 9814 6529 -333 -9109 -20079 -16794 -9547 -1272 348 2655 4668 5704 3848 -5736 -11507
15978 -11507 -980 4251 8651 3670 -5340 -10629 -5502 -7739 -10321 -4920 -2952 -12046 -12375 -9268
15964 -9268 -11545 -12466 -12909 -17794 -23180 -18549 -11233 -12853 -9397 -7408 -8126 -7345 -13287 -11155 -13425 -9950
15948 -9950 -1856 -3201 -1637 1670 2659 2385 2183 -871 -3837 2082 2786 -3820 -14964 -7429 -6643 -1561
15932 -1561 -3382 -2966 -4192 -6931 -13564 -16414 -17253 -13762 -4884 -8457 -5397 5561 -399 -12482 -8222
15917 -8222 -8071 -9117 117 4722 7391 8909 6797 11126 6519 -8894 -25492 -29064 -19233 -11544
15903 -11544 -3432 1862 -2938 -11573 -13490 -17076 -21689 -11037 -2478 -5126 -4417 472 -3154 -2945 -2960
$$ packed form
16008g360L01l71j600N527K941l404q96j584K806O614K982M978Q299j382o86p351
15992I814l285o862q776j0970L285P247Q275J620K307K013J036j856r584n771
15978a1507J0527N231M400m981r010n289N127k237k582N401J968r094l29L107
15964i268k277r21m43m885n386M631P316j620L456J989p18P81n942K132k270L475
15948i950Q094j345J564L307R89k74k02l054k966N919P04o606j1144P535P86N082
15932a561j821M16j226k739o633k850q39L491Q878l573L060J0958n960j2083M260
15917h222J51j046R234M605K669J518k112M329m607j5413j6598l572R831P689
15903a1544Q112N294m800q635j917l586m613J0652Q559k648P09M889l626K09j5
$$ plain form
15888 -2960 -7669 -16045 -15062 -12048 -15967 -16353 -10892 -5518 2716 3477 -2505 -13432 -17989 -17905 -20240 -10611
15872 -10611 -9043 -12173 -20812 -17857 498 6384 -2821 -5982 -4859 216 -3163 -2596 -5671 -1870
15858 -1870 3732 -2522 -5653 -5155 13050 21732 13518 -2865 -4484 3632 8771 -1021 1188 507 6115
15843 6115 8113 719 -7150 -8295 -10897 -9408 -6154 -2818 -1890 4317 5224 -205 33 4892 7791
15828 7791 5153 -2383 9558 4770 -6148 -9881 -13968 -7462 -837 -5049 -6502 -14891 -12450 -5666
15814 -5666 -25 753 -1851 -9288 -14638 -17558 -12701 -5679 1991 6731 5554 1579 -2644 -477 -597
15799 -597 3471 1545 -2590 -19082 -17917 -4815 -483 3921 -3299 -14559 -10062 -8299 -8979 -1639
15785 -1639 6477 6818 4019 -3183 -11161 -13655 -5994 -1664 -3897 -1079 3099 5983 1128 -3729 -4051
$$ packed form
15888b960m709q376R83L014l919l86N461N374Q234P61n982j0927m557Q4k335R629
15872a0611J568l130q639K955J8355N886r205l161J123N075l379N67l075L801
15858a870N602o254l131M98J8205Q682q214j6383j619Q116N139r792K209o81N608
15843F115J998p394p869j145k602J489L254L336R28O207R07n429K38M859K899
15828G791k638p536J1941m788j0918l733m087O506O625m212j453q389K441O784
15814e666N641P78k604p437n350k920M857P022P670M740j177l975m223K167j20
15799e97M068j926m135j6492J165J3102M332M404p220j1260M497J763o80P340
15785a639Q116L41k799p202p978k494P661M330k233K818M178K884m855m857l22
$$ plain form
15770 -4051 -5396 -7405 -6664 2343 -8105 -8876 -8062 -9356 -11146 -13449 -23065 -16197 -3225 -1134 8110
15755 8110 8761 9557 815 2925 263 -3173 -4444 -3106 -3153 -15491 -18281 -17889 -13769 -12253 -15481 -13817
15739 -13817 -19985 -18746 -17598 -12785 -6516 -4877 -4929 -3568 -801 1740 1997 3624 2357 1446 6961
15724 6961 2216 1626 -2541 11669 14685 17179 12427 4387 4276 3735 -3004 -3212 -1880 -1997 4143 4146
15708 4146 -4780 -4978 -1619 2350 9093 5460 -5696 -10561 -12876 -6054 -2912 7294 9103 401
15694 401 2589 -2995 -5201 -6617 -3637 -918 4335 9959 14294 10367 4447 3581 3872 1545 -1840
15679 -1840 -4603 -4189 484 -6147 -6840 -9737 -10292 -4052 -2903 -12897 -12549 -12846 -4307 -4881 -5879 -1161
15663 -1161 3082 5903 9201 -827 -9150 -7068 -11654 -7849 1606 -1340 -3831 5026 2451 -5934
$$ packed form
15770d051j345k009P41R007j0448p71Q14j294j790k303r616O868J2972K091R244
15755H110O51P96q742K110k662l436j271J338m7j2338k790L92M120J516l228J664
15739a3817o168J239J148M813O269J639n2J361K767K541K57J627j267r11N515
15724F961m745n90m167J4210L016K494m752q040j11n41o739k08J332j17O140L
15708D146q926j98L359L969O743l633j1156m865k315O822L142J0206J809q702
15694D01K188n584k206j416K980K719N253N624M335l927n920q66K91k327l385
15679a840k763M14M673o631o93k897n55O240J149r994L48k97Q539n74r98M718
15663a161M243K821L298j0028q323K082m586L805R455k946k491Q857k575q385
$$ plain form
15649 -5934 -6904 -5036 -13207 -12343 -10344 -4990 4002 4812 11024 13827 4273 4811 18372 21635 11301
15634 11301 -1871 -4484 -3823 -4237 -10487 -14834 -23382 -21621 -15333 -9433 -5959 -3422 4985 15870
15620 15870 9321 -481 -3007 -6003 -12860 -14045 -3671 6476 -4528 -21775 -19655 -12819 -12339 -8363
15606 -8363 8978 8320 -6745 -11184 -798 6451 3874 -7346 -9751 -4199 -1445 -4575 -4691 -9742
15592 -9742 -2660 -2589 -4889 -1291 -902 -8035 -16031 -12068 -5790 10614 6986 -2587 2633 -6395 -5250
15577 -5250 -2674 -3749 -9801 -3298 3650 9379 13097 12684 11189 1511 7652 8010 -847 -6271 -8289
15562 -8289 447 5354 2063 -8077 -6360 1218 9901 5014 -4294 -9552 -12369 -22209 -22583 -16757 -9667
15547 -9667 5687 6699 5406 8006 11340 8064 6586 9090 10198 4138 -7239 -13908 -8592 1731
$$ packed form
15649e934r70J868q171Q64J999N354Q992Q10O212K803r554N38J3561L263j0334
15634A1301j3172k613O61m14o250m347q548J761O288N900L474K537Q407J0885
15620A5870o549r802k526k996o857j185J0374J0147j1004j7247K120O836M80L976
15606h363J7341o58j5065m439J0386P249k577j1220k405N552K754l130j16n051
15592i742P082P1k300L598L89p133p996L963O278J6404l628r573N220r028J145
15577e250K576j075o052O503O948N729L718m13j495r678O141L58q857n424k018
15562h289Q736M907l291j0140J717P578Q683m887r308n258k817r840l74N826P090
15547i667J5354J012j293K600L334l276j478K504J108o060j1377o669N316J0323
$$ plain form
15533 1731 3917 2795 1090 -5548 -13833 -15885 -14709 -15519 -18436 -15871 -7861 -3066 231 -2770 -274
15518 -274 -2671 -7766 -6327 7800 11293 6889 261 4545 4578 6863 2504 3377 3840 1318 -3198 -8528
15502 -8528 -2388 -1113 -731 1770 -2101 -10865 -11645 1735 5238 478 -4761 -3576 2605 4350 5436
15487 5436 6901 4994 9651 8607 3515 -1046 -1943 -8698 -5500 -2218 1018 1981 3169 10287 9691
15472 9691 -5244 -3382 -1217 1584 -54 -8842 -11939 -18727 -17453 -19630 -23552 -18057 -9511 -1267
15458 -1267 -3061 -10415 -8011 4468 5096 -2844 -5453 -3069 -3313 1121 4191 3668 -868 -5714 -2337
15443 -2337 -8472 -14578 -6337 -2097 -1934 -2854 -4463 -11706 -3744 3834 2393 842 3915 -1187 -5708
15428 -5708 -16890 -6243 412 -2569 -8965 -8701 2520 7516 5663 -3628 -9614 -4518 -6750 -3836
$$ packed form
15533A731K186j122j705o638q285k052J176q10k917K565Q010M795L297l001K496
15518b74k397n095J439J4127L493m404o628M284L3K285m359Q73M63k522m516n330
15502h528O140J275L82K501l871q764p80J3380L503m760n239J185O181J745J086
15487E436J465j907M657j044n092m561q97o755L198L282L236R63J188P118n96
15472I691j4935J862K165K801j638q788l097o788J274k177l922N495Q546Q244
15458a267j794p354K404J2479O28p940k609K384k44M434L070n23m536m846L377
15443b337o135o106Q241M240J63r20j609p243P962P578j441j551L073n102m521
15428e708j1182J0647O655k981o396K64J1221M996j853r291n986N096k232K914
$$ plain form
15414 -3836 -1535 -2210 -2963 -4378 -3517 419 -2986 -8204 -11675 -10591 -10384 -12564 -18214 -24519 -27312 -27161
15398 -27161 -14096 -1571 -2095 -2060 -2086 -6064 -19877 -24901 -30524 -29611 -22705 -9959 -2286 3523 2855
15383 2855 -779 846 -1762 -1784 -8457 -20119 -19421 -13898 -8058 -904 8795 9171 6658 -376 -4191
15368 -4191 -8127 -7809 572 6159 2548 2328 -1738 -7344 -6191 -8326 -5549 1012 11808 9385 3811
15353 3811 816 -6337 -5855 -5458 -2094 1260 -6169 -13060 -8291 -1205 10179 9035 9516 15519 17015
15338 17015 9476 10349 8989 772 -616 -1234 -3746 -4517 4222 1327 -1084 -2140 1878 -6070 -1628
15323 -1628 -4104 -6059 226 6612 9476 12202 8760 6692 -681 -9836 -15099 -17771 -19964 -9800
15309 -9800 685 4324 -7995 -7877 327 4507 9607 12258 9378 4470 274 2680 6101 5793 6020
$$ packed form
15414c836K301o75p53j415Q61L936l405n218l471J084K07k180n650o305k793J51
15398b7161J3065J2525n24L5k6l978j3813n024n623R13O906J2746P673N809o68
15383B855l634J625k608k2o673j1662O98N523N840P154R699L76k513p034l815
15368d191l936L18Q381N587l611k20m066n606J153k135K777O561J0796k423n574
15353C811k995p153M82L97L364L354p429o891M769P086J1384j144M81O003J496
15338A7015p539Q73j360q217j388o18k512p71Q739k895k411j056M018p948M442
15323a628k476j955O285O386K864K726l442k068p373r155n263k672k193J0164
15309i800J0485L639j2319J18Q204M180N100K651k880m908m196K406L421l08K27
$$ plain form
15294 6020 6108 -4385 -7054 -5939 -3247 4652 7231 -4048 -5839 -301 -1115 6123 8618 2974 2843
15279 2843 -70 873 -870 -8894 -9143 -11228 -15371 -12431 -14616 -15636 -11854 -13221 -2239 933 5
15264 5 -2759 -1451 583 5149 4536 9180 1776 -12967 348 7876 7973 8144 7465 99 -7498 -2177
15248 -2177 1210 6465 6585 7693 13192 3595 -3411 -7726 -1649 3154 3281 -6319 -7453 -206 3096
15233 3096 -2747 -1029 3233 6423 3111 4761 3714 3409 3641 -4679 -10550 -9096 -2913 4865 5406
15218 5406 -5593 -9528 -15231 -17246 -10542 -4769 4587 16519 23603 15514 14864 19058 14741 11314
15204 11314 11009 -3145 -1322 3838 3483 -1772 -1949 -3316 -6428 -199 2303 1472 3263 6404 4057
15189 4057 10471 17720 17901 12245 4836 1816 -6344 -6942 -4240 -8282 -12641 -9811 -4669 -11069 -10258
$$ packed form
15294F020Q8j0493k669J115K692P899K579j1279j791N538q14P238K495n644j31
15279B843k913R43j743q024k49k085m143K940k185j020L782j367J0982L172r28
15264Ek764J308K034M566o13M644p404j4743J3315P528R7J71o79p366p597N321
15248b177L387N255J20J108N499r597p006m315O077M803J27r600j134P247L302
15233C096n843J718M262L190l312J650j047l05K32q320n871J454O183P778N41
15218E406j0999l935n703k015O704N773R356J1932P084q089o50M194m317l427
15204A1314l05j4154J823N160l55n255j77j367l112O229K502q31J791L141k347
15189D057O414P249J81n656p409l020q160n98K702m042m359K830N142o400Q11
$$ plain form
15174 -10258 1284 848 896 7969 9621 -1062 -5486 -5452 1970 6327 15435 13469 -317 -6970 -6533
15159 -6533 4128 9908 645 -9756 -10315 -5834 5902 6458 5834 8361 9597 8359 4038 5582 6979
15144 6979 -2092 -9480 -16932 -6274 4249 2011 -4363 -3120 6750 9868 5072 2159 527 -4492
15130 -4492 -5908 -10482 -3791 -1150 -5734 -4915 -930 596 7482 4879 -2699 225 7292 10604 9679
15115 9679 -2596 -3262 -8000 -9058 -9651 -5114 3194 11835 12362 -4576 -10346 -3481 -3803 867 -965
15100 -965 -7608 -5508 -86 2354 6656 7938 2005 2366 3030 128 -10562 -9071 -10607 -8596 -9489
15085 -9489 -15090 -10514 -9771 -10271 -8094 -11699 -15865 -11111 -9902 -1650 -4014 -9259 -8331 -6397 -10441
15070 -10441 -6865 139 5686 4823 465 -1055 -7451 -7370 -2315 -4797 -4442 -400 -1153 -485 -9920 -15288
$$ packed form
15174a0258J1542m36M8P073J652j0683m424L4P422M357R108j966j3786o653M37
15159f533J0661N780r263j0401n59M481J1736N56o24K527J236j238m321J544J397
15144F979r071p388p452J0658J0523k238o374J243R870L118m796k913j632n019
15130d492j416m574O691K641m584Q19L985J526O886k603p578K924P067L312r25
15115I679j2275o66m738j058n93M537Q308Q641N27j6938n770O865l22M670j832
15100i65o643K100N422K440M302J282n933L61O64k902j0690J491j536K011q93
15085i489n601M576P43n00K177l605m166M754J209Q252k364n245R28J934m044
15070a0441L576P004N547q63m358j520o396Q1N055k482L55M042p53O68r435n368
$$ plain form
15054 -15288 -4423 -8575 -10861 -18610 -21494 -11102 -7997 -8076 -3606 -535 -4446 -5346 -5397 -1454 430
15039 430 -6306 -3598 -619 5782 -2269 -10721 -7659 -2115 -11225 -19811 -8811 2312 8814 13266
15025 13266 8949 2345 4303 11058 8999 5675 -6074 -140 5038 1026 -979 -1719 -1947 2410 7465
15010 7465 2324 -8026 -9029 -7649 -3825 -2506 1049 274 7641 6401 -4725 -3885 -9458 -9889 -8067
14995 -8067 -5542 -5623 -17694 -24772 -14195 -143 959 -1482 1505 3281 7091 11771 8712 -624
14981 -624 173 -3724 -7291 -3110 -378 2075 12166 14825 10937 7453 6435 9347 2358 -653 3737
14966 3737 390 -10676 -12418 -7328 -5890 -11290 -7438 -3920 -3912 1091 -3985 -7711 -6918 -1525 -1824 1867
14950 1867 -2186 -5818 7049 6652 6579 14238 13564 7696 -1088 -3212 5132 1290 792 -814 4104 5320
$$ packed form
15054a5288J0865m152k286p749k884J0392L105p9M470L071l911r00n1L943J884
15039D30o736K708K979O401q051q452L062N544r110q586J1000J1123O502M452
15025A3266m317o604J958O755k059l324j1749N934N178m012k005p40k28M357N055
15010G465n141j0350j003J380L824J319L555p75P367j240j1126Q40n573m31J822
14995h067K525q1j2071p078J0577J4052J102k441K987J776L810M680l059r336
14981f24P97l897l567M181K732K453J0091K659l888l484j018K912o989l011M390
14966C737l347j1066j742N090J438n400L852L518QN003n076l726P93N393k99L691
14950A867m053l632J2867l97p3P659o74n868q784k124Q344l842m98j606M918J216
$$ plain form
14934 5320 1443 2871 -3961 -3949 -2087 -5050 -7597 -11554 -3052 -4502 -9405 -6218 -11681 -8563 -5077
14919 -5077 -194 2325 -6422 -15903 -16779 -7449 -1591 2830 -1297 1987 6600 13002 12087 5353 2375
14904 2375 8785 7124 4397 1468 -182 1456 3842 -2880 -1491 5378 4092 12055 14814 14567 11960
14889 11960 12417 17586 14719 14269 10426 9986 2184 -1753 -3237 -13446 -13977 -12968 -6799 1481 9520
14874 9520 5192 -2282 -7474 -14070 -15032 -10572 -1777 1791 -2587 -3696 -9433 -11509 -6914 -11322 -11356
14859 -11356 -2229 6784 3490 -2969 -5018 -8728 -14688 -13423 -3227 -1137 -2675 -5436 -9003 -7373
14845 -7373 -2449 934 -6045 -6625 -560 -17 -1211 5600 12209 9613 929 -4870 2374 5659 9684
14830 9684 5257 920 -4710 -6937 -3812 -14243 -13769 -11277 -14123 -9862 -7031 -3116 -4630 -3111 -4654
$$ packed form
14934E320l877J428o832J2J862k963k547l957Q502j450m903L187n463L118L486
14919e077M883K519q747r481q76R330N858M421m127L284M613O402r15o734k978
14904B375O410j661k727k929j650J638K386o722J389O869j286P963K759k47k607
14889A1960M57N169k867m50l843m40p802l937j484j0209n31J009O169Q280Q039
14874I520m328p474n192o596r62M460Q795L568m378j109n737k076M595m408l4
14859a1356R127R013l294o459k049l710n960J265J0196K090j538k761l567J630
14845g373M924L383o979n80O065N43j194O811O609k596q684n799P244L285M025
14830I684m427m337n630k227L125j0431M74K492k846M261K831L915j514J519j543
$$ plain form
14815 -4654 -12799 -3043 7343 144 -10441 -13074 -16615 -21888 -24151 -25534 -21086 -9405 -3374 -1085
14801 -1085 3419 6158 14687 13414 4354 -1676 2509 5125 -1641 -11817 -13550 -9999 -4853 -2704
14787 -2704 -3045 -13750 -7453 11883 9865 1098 -7666 -14948 -11134 -912 116 -2872 -3614 -111
14773 -111 3293 7190 7145 11660 9553 11319 10676 10619 5106 -2177 1107 4215 -9748 -20762 -22117 -12414
14757 -12414 15 6740 11142 13573 4418 1154 6061 9170 15241 9446 9397 13395 2505 -12150
14743 -12150 -19401 -16819 -18889 -15809 -15626 -12208 -12867 -17625 -12844 -9999 -10855 -3796 -4278 -6094 -3728
14728 -3728 2654 -317 651 2853 -6352 -8064 6004 16292 18088 10164 6285 806 4730 7121
14714 7121 4931 -1408 -11046 -14243 -6230 -805 3498 6304 -3575 -4816 -7035 -18587 -19222 -24118 -16626
$$ packed form
14815d654q145R756J0386p199j0585k633l541n273k263j383M448J1681O031K289
14801a085M504K739Q529j273r060o030M185K616o766j0176j733L551N146K149
14787b704l41j0705O297J9336k018q767q764p282L814J0222J028k988p42L503
14773a11L404L897m5M515k107J766o43n7n513p283L284L108j3963j1014j355R703
14757a2414J2429O725M402K431r155l264M907L109O071n795m9L998j0890j4655
14743a2150p251K582k070L080J83L418o59m758M781K845q56P059m82j816K366
14728c728O382k971R68K202r205j712J4068J0288J796p924l879n479L924K391
14714G121k190o339r638l197Q013N425M303K806r879j241k219j1552o35m896P492
$$ plain form
14699 -16626 -10972 -10641 -11234 1526 3312 -6575 -11435 -12888 -13599 -16367 -8617 -4256 58 -3246 -3774
14684 -3774 -2344 -2952 -824 10200 7180 6679 6116 6015 -1912 -10481 -11112 -5401 -6731 -14904 -16276 -21355
14668 -21355 -20737 -10448 -532 1034 6339 14635 12950 11159 1953 3444 5309 116 -5414 2322
14654 2322 6318 6381 8957 17015 15796 9092 -3027 -11923 -12874 -2207 6073 9617 9124 14433 13273
14639 13273 9035 1781 -2635 -7281 -14009 -10176 -12598 -16298 -16147 -11361 -1669 4507 2754 3162 7634
14624 7634 8944 5130 3657 -1336 -4406 5408 11680 14596 5694 -1298 -46 512 6669 14839 24
14609 24 -18947 -20023 -15970 -15498 -14388 -18434 -17963 -11459 -3828 -3261 -3893 -1171 -3406 -694 1335 -670
14593 -670 -5377 -4644 -3489 -8367 -5336 -2082 1427 858 -6870 2268 7606 5297 -2077 -14487 -23479
$$ packed form
14699a6626N654L31n93J2760J786r887m860j453p11k768P750M361M314l304n28
14684c774J430o08K128J1024l020n01n63j01p927q569o31N711j330q173j372n079
14668b1355O18J0289R916J566N305Q296j685j791r206J491J865n193n530P736
14654B322L996O3K576Q058j219o704j2119q896r51J0667Q280L544m93N309j160
14639A3273m238p254m416m646o728L833k422l700J51M786R692O176j753M08M472
14624G634J310l814j473m993l070R814O272K916q902o992J252N58O157Q170j4815
14609B4j8971j076M053M72J110m046M71O504P631N67o32K722k235K712K029k005
14593f70m707P33J155m878L031L254L509n69p728R138N338k309p374j2410q992
$$ plain form
14578 -23479 -23090 -15574 -3325 4134 -568 -11920 -10267 -3082 -10073 -16935 -9518 -1702 2763 6847
14564 6847 5691 7351 7068 6697 308 6800 18090 16243 13731 651 -8225 -8010 -4532 -4440 -4520 -6004
14548 -6004 -2061 -423 -4637 -6508 -654 -4651 -9411 -5203 5171 14470 15264 11981 8297 16173 27062
14533 27062 24880 19066 11024 5810 7238 7713 16479 24088 25919 16455 8790 1804 417 400 -4414
14518 -4414 -11595 -3960 3710 6956 6619 -3896 -5494 -4881 -3772 1871 5769 -229 -1828 2629 1989
14503 1989 5629 5556 15698 12424 5798 7676 16034 16872 8200 6655 5484 6404 7270 17609 19480
14488 19480 13031 10973 4595 2476 -4536 -4036 -2354 -7726 -5046 -2174 -4374 -15790 -25227 -21594
14474 -21594 -10101 -1052 -3361 4154 3061 2777 6328 1092 -3701 5329 12610 7020 280 1531
$$ packed form
14578b3479L89P516J2249P459m702j1352J653P185o991o862P417P816M465M084
14564F847j156J660k83l71o389O492J1290j847k512j3080q876K15L478R2q0j484
14548f004L943J638m214j871N854l997m760M208J0374R299P94l283l684P876J0889
14533B7062k182n814q042n214J428M75Q766P609J831r464p665o986j387j7m814
14518d414p181P635P670L246l37j0515j598O13J109N643L898n998j599M457o40
14503A989L640p3J0142l274o626J878Q358Q38q672j545j171R20Q66J0339J871
14488A9480o449k058o378k119p012N00J682n372K680K872k200j1416r437L633
14474b1594J1493R049k309P515j093k84L551n236m793R030P281n590o740J251
$$ plain form
14460 1531 9694 10574 4069 3556 1966 2254 6879 4309 4527 -2098 -4838 -7210 -10333 -7667 -14532 -20872
14444 -20872 -16123 -7445 -13439 -20135 -18560 -14883 -8144 -699 -8784 -15537 -17954 -13685 -14514 -11197 -7131
14429 -7131 -2665 2968 -557 -4383 817 5308 -431 -11213 -18576 -17230 -3861 -5249 -6044 1498
14415 1498 1442 -643 -5317 1383 1864 11949 12432 7908 -7412 -13669 -1938 -2870 -5009 -4486 -7512
14400 -7512 -12090 -6148 -5583 -10865 -11505 -5604 5109 12939 13361 1629 -8992 -12642 -9669 -5885 81
14385 81 -1250 -11929 -6277 607 9678 19963 20251 14571 1287 659 1328 4187 7415 6204 2835
14370 2835 7027 10929 7513 -10596 -22810 -15901 -10358 2882 3991 936 10647 5106 -2981 -7056
14356 -7056 -141 -1065 9381 4973 -10508 -7355 -10737 -8878 -6031 1277 -555 -8915 -5188 -29
$$ packed form
14460A531Q163Q80o505n13j590K88M625k570K18o625k740k372l123K666o865o340
14444b0872M749Q678n994o696J575L677O739P445q085o753k417M269q29L317M066
14429g131M466N633l525l826N200M491n739j0782p363J346J3369j388p95P542
14415A498n6k085m674O700M81J0085M83m524j5320o257J1731r32k139N23l026
14400g512m578N942N65n282o40N901J0713P830M22j1732j0621l650K973L784N966
14385H1j331j0679N652O884R071J0285K88n680j3284o28O69K859L228j211l369
14370B835M192L902l416j8109j2214O909N543J3240J109l055R711n541q087m075
14356g056O915r24J0446m408j5481L153l382J859K847P308j832q360L727N159
$$ plain form
14342 -29 6829 12933 15946 8328 -3789 -5356 -6659 -11105 -3316 2182 7244 7846 -805 -6200 -9998
14327 -9998 -14067 -19390 -9897 -7611 -17939 -15115 -10541 -12807 -13435 -17487 -21124 -19082 -20955 -19214 -19300
14312 -19300 -16681 -7680 -6848 -8954 -12804 -7120 -2306 1503 2714 5177 5398 3023 958 -1096 -4163
14297 -4163 -3798 -2613 929 873 7721 3661 -2707 -4240 -7414 -4550 -5292 374 7724 8528 12550 26381
14281 26381 28803 18668 10457 4729 -529 -826 -5305 -3476 -7121 -4080 818 8981 7767 14084
14267 14084 16679 8280 1878 -9057 -10384 -8049 -1572 4934 1290 -446 1962 1098 3483 7982
14253 7982 1111 -6320 -9712 -15580 -19025 -12264 2156 4353 4801 -3526 1872 865 -4756 -12084 -14801
14238 -14801 -18685 -10675 -4266 -1923 7600 12996 738 -2172 9108 17367 13988 8410 2594 11392
$$ packed form
14342b9O858O104L013p618j2117j567j303m446P789N498N062O02q651n395l798
14327i998m069n323R493K286j0328K824M574k266o28m052l637K042j873J741q6
14312a9300K619R001Q32k106l850N684M814L809J211K463K21k375k065k054l067
14297d163L65J185L542n6O848m060o368j533l174K864p42N666P350Q04M022J3831
14281B6381K422j0135q211n728n258k97m479J829l645L041M898Q163j214O317
14267A4084K595q399o402j0935j327K335O477O506l644j736K408q64K385M499
14253G982o871p431l392n868l445O761J4420K197M48q327N398j007n621p328k717
14238a4801l884Q010O409K343R523N396j2258k910J1280Q259l379n578n816Q798
$$ plain form
14224 11392 17627 8869 -3285 -5261 -643 4096 -9005 -14611 -16751 -9087 -335 -1053 -1686 -1312 -5019
14209 -5019 -598 -7491 -19465 -23031 -8212 146 -1027 -2015 913 6771 -4550 -12042 -5206 4553
14195 4553 7025 11002 9970 4341 7646 1850 -5101 -11006 -11282 -14522 -22025 -23406 -19449 -23066 -24892
14180 -24892 -19615 -10523 -9580 -12096 -9033 -5122 4702 6366 -2243 -4672 10089 8369 -2427 1519
14166 1519 271 -6389 -11512 -12981 -7117 4538 10977 12215 8324 5305 -5764 -8364 -5055 492
14152 492 649 -5951 -9455 -14409 -6552 -4706 -325 -1431 2572 1730 5928 -194 -2313 -1595 -7136 -8909
14136 -8909 -12539 -17581 -5613 -719 -5948 -10759 -11145 -2863 -1548 -7934 -5757 6621 6 1896
14122 1896 -371 -642 -5225 -8068 -3194 -24 -2171 -7298 -1326 6162 -859 -13930 -10168 -410 9251
$$ packed form
14224A1392O235q758j2154j976M618M739j3101n606k140P664Q752p18o33L74l707
14209e019M421o893j1974l566J4819Q358j173r88K928N858j1321p492O836R759
14195D553K472L977j032n629L305n796o951n905k76l240p503j381L957l617j826
14180b4892N277R092R43k516L063L911R824J664q609k429J4761j720j0796L946
14166A519j248o660n123j469N864J1655O439J238l891l019j1069k600L309N547
14152D92J57o600l504m954P857J846M381j106M003q42M198o122k119P18n541j773
14136h909l630n042J1968M894n229m811l86Q282J315o386K177J2378o615J890
14122A896k267k71m583k843M874L170k147n127N972P488p021j3071L762R758R661
$$ plain form
14107 9251 2344 -2553 1751 9507 8470 5593 -860 -8119 -10979 -12900 -11397 -3459 -2603 -974 7314
14092 7314 7273 -4 -7301 -13759 -12837 -14259 -12323 -8833 -13993 -8996 -8065 -11595 -12285 -7772 1756 262
14076 262 597 6 -3224 3024 12355 9859 8140 6838 11032 6874 4489 5402 10054 -634 -8701
14061 -8701 -10191 -8158 -7400 -10660 -12425 -11259 -6753 -2690 7509 6847 -1174 -8927 -21666 -13668 -7349
14046 -7349 -3314 602 3877 9428 5864 2425 1965 -3372 4540 1480 -5569 -4380 -5264 -5557 -8876
14031 -8876 -3931 869 7315 18710 8669 9109 6650 12086 7983 -6553 -5139 -1007 6842 4385
14017 4385 1201 7288 14078 2759 -8719 278 2330 -13479 -16554 -9355 -4388 -1808 6877 8211
14003 8211 12953 12778 9613 3901 -3645 -2954 -627 -13461 -17530 -918 -912 6697 13732 14317 19020 15087
$$ packed form
14107I251o907m897M304P756j037k877o453p259k860j921J503P938Q56J629Q288
14092G314m1p277p297o458R22j422J936L490n160M997R31l530o90M513R528j494
14076B62L35n91l230O248R331k496j719j302M194m158k385R13M652j0688q067
14061h701j490K033P58l260j765J166M506M063J0199o62q021p753j2739P998O319
14046g349M035L916L275N551l564l439m60n337P912l060p049J189q84k93l319
14031h876M945M800O446J1395j0041M40k459N436m103j4536J414M132P849k457
14017D385l184O087O790j1319j1478Q997K052j5809l075P199M967K580Q685J334
14003H211M742j75l165n712p546O91K327j2834m069J6612OP609P035N85M703l933
$$ plain form
13987 15087 13856 7431 -2962 -4 3602 5639 -983 -2143 -9474 -3277 -2571 -6406 -14721 -16508
13973 -16508 -7914 -4231 2632 -584 3298 11824 18742 8481 5314 1308 -2967 1531 -5087 -14000
13959 -14000 -15978 -10525 -12677 -16069 -2470 9049 4226 -9668 -13364 -4441 -1844 4652 13081 7691
13945 7691 -8801 -18004 -18736 -22267 -15827 -4021 -2670 -13516 -16475 -24300 -17399 -13540 -11288 -8252
13931 -8252 -4277 -2612 -3266 -1205 -8205 -7915 180 365 -9214 1032 1216 -3118 -6571 -414 -3301
13916 -3301 -2349 -863 -2489 -6536 -8541 -7371 1329 14930 18810 24020 19107 12761 2585 4430
13902 4430 2554 359 1806 2581 2127 -750 -2800 -6310 -8447 -10292 -1747 -197 -4346 979 5636
13887 5636 3529 1720 179 10646 12966 5874 -6990 -14261 -13375 -7988 -10507 -7536 2134 -4138
$$ packed form
13987A5087j231o425j0393K958L606K037o622j160p331O197P06l835q315j787
13973a6508Q594L683O863l216L882Q526O918j0261l167m006m275M498o618q913
13959a4000j978N453k152l392J3599J1519m823j3894l696Q923K597O496Q429n390
13945G691j6492r203p32l531O440J1806J351j0846k959p825O901L859K252L036
13931h252L975J665o54K061p000K90Q095J85r579J0246J84m334l453O157k887
13916c301R52J486j626m047k005J170Q700J3601L880N210m913o346j0176J845
13902D430j876k195J447P75m54k877k050l510k137j845Q545J550m149N325M657
13887E636k107j809j541J0467K320p092j2864p271Q86N387k519K971R670o272
$$ plain form
13873 -4138 -3646 -10406 -13142 -10603 -7289 -5256 2583 258 -2998 -5934 -11786 -7827 -1881 -731 -5146
13858 -5146 -12366 -9954 -4963 1698 11458 16382 12638 3005 -5995 -7305 1375 7886 5224 -6452
13844 -6452 -10804 -6921 -3507 1470 -1995 -1187 4462 8082 7926 2640 3611 10897 3332 -12833 -18066
13829 -18066 -14609 -4390 6001 3184 -201 -4777 -5003 -3431 -2731 -6738 -11321 -16511 -20274 -11093
13815 -11093 -1926 -4224 -2656 -1551 1835 -2504 -10486 -12138 -9345 -2973 3458 8973 3640 -5242
13801 -5242 -3408 -698 -3202 -1469 -1295 -4156 -10075 -4204 -323 437 4837 6746 7970 10300 11731
13786 11731 6850 9760 3450 -1627 -2660 3061 1404 -3783 -5473 6207 14340 15669 17633 9804
13772 9804 2255 5401 3007 3554 -2412 -5778 -1837 7950 16784 10335 4762 810 8125 6363 -3454
$$ packed form
13873d138M92o760k736K539L314K033P839k325l256k936n852L959N946J150m415
13858e146p220K412M991O661R760M924l744r633r000j310Q680O511k662j1676
13844f452m352L883L414M977l465Q08N649L620j56n286R71P286p565j6165n233
13829a8066L457J0219J0391k817l385m576k26J572P00m007m583n190l763R181
13815a1093R167k298J568J105L386m339p982j652K793O372O431N515n333q882
13801e242J834K710k504J733J74k861n919N871L881P60M400J909J224K330J431
13786A1731m881K910o310n077j033N721j657n187j690J1680Q133J329J964p829
13772I804p549L146k394N47n966l366L941R787Q834o449n573l952P315j762r817
$$ plain form
13757 -3454 -522 6883 15869 15798 13504 5410 4006 6770 10478 10231 10514 3520 2705 4896 8569 7748
13741 7748 20029 19108 9240 7408 15373 13496 14216 15479 8486 5860 2696 9864 10353 10829 6635
13726 6635 5031 11690 16836 14271 9283 824 -8721 -8490 -5649 -2447 5950 12533 4261 -4047 -11210
13711 -11210 -16342 -13561 -4364 -2208 -5244 -3523 5953 5522 5521 5662 6436 9436 1436 -2917 -6910 -9546
13695 -9546 -9189 -5453 -3870 -3750 -4297 -4720 -6816 50 1804 -4439 916 8379 10702 1334 -2233 -2404
13679 -2404 2978 12200 12525 4296 4134 6398 7358 5446 -1230 -2763 -2209 9824 12025 11309 16844 22801
13663 22801 22681 10276 -3166 -1036 8668 8396 7761 1477 4150 -3287 -4257 -2151 3473 5962 6485
13648 6485 4547 2768 -5653 -5909 -394 -1084 5338 14599 13381 5578 -2368 -9916 -10189 -2015 2178
$$ packed form
13757c454K932P405Q986p1k294q094j404K764L708k47K83o994q15K191L673q21
13741G748J2281r21r868j832P965j877P20J263o993k626l164P168M89M76m194
13726F635j604O659N146k565m988q459r545K31K841L202Q397O583q272q308p163
13711a1210n132K781R197K156l036J721R476m31jJ41P74L000q000m353l993k636
13695i546L57L736J583J20n47m23k096O866J754o243N355P463K323r368l567j71
13679b404N382R222L25q229j62K264R60j912o676j533N54J2033K201p16N535N957
13663B2801j20j2405j3442K130R704k72o35o284K673p437r70K106N624K489N23
13648F485j938j779q421k56N515o90O422R261j218p803p946p548k73Q174M193
$$ plain form
13633 2178 1153 1938 224 3692 -1354 105 -1710 -7201 -8828 -6020 -3537 -5821 -8223 -3578 -1926
13618 -1926 -2594 4210 14559 6751 8712 13253 15759 4345 3306 6758 5208 1289 1776 3768 9044
13603 9044 4585 -582 -660 -1814 -1689 1806 -2668 -6908 -3997 -524 488 3136 9496 10760 9587
13588 9587 11278 12781 9029 14659 15642 9839 -3912 -13167 -2575 1867 12914 24412 17255 12484
13574 12484 13195 5013 -2984 6046 16793 13554 13542 17935 18758 8829 4816 667 3068 2585 4559
13559 4559 11553 11681 10171 20067 25439 11108 -3613 -6791 -1020 -11868 -12879 -3403 1566 -1509
13545 -1509 1800 7827 5107 -3654 -10564 -914 1102 -2841 -8666 -6529 5090 2097 6659 489
13531 489 -1700 2321 6344 4505 -508 -1068 4119 8242 6293 -1683 968 4207 5361 6468 4006
$$ packed form
13633B178j025P85j714L468n046J459j815n491j627K808K483k284k402M645J652
13618a926o68O804J0349p808J961M541K506j1414j039L452j550l919M87J992N276
13603I044m459n167p8j154J25L495m474m240K911L473J012K648O360J264j173
13588I587J691J503l752N630R83n803j3751r255J0592M442J1047J1498p157m771
13574A2484P11q182p997R030J0747l239j2M393Q23r929m013m149K401m83J974
13559D559O994J28j510R896N372j4331j4721l178N771j0848j011R476M969l075
13545a509L309O027k720q761o910R650K016l943n825K137J1619k993M562o170
13531D89k189M021M023j839n013n60N187M123j949p976K651L239J154J107k462
$$ plain form
13516 4006 -15354 -12057 -7119 2934 9534 10043 697 -13392 -11893 -13057 -4487 4842 13861 798
13502 798 -2303 -319 8493 9391 4639 -961 795 874 -5509 -11226 -7321 -3829 624 -1354 2707 12358
13486 12358 4960 -7363 -10896 -12823 -3100 8196 6475 5177 6554 11085 13977 14901 13911 13877 3313
13471 3313 4793 1634 5521 16057 21871 11868 6604 2565 -2130 3885 12800 10793 2060 -2010
13457 -2010 -5596 -3506 -2548 -9846 -2124 7559 4174 1024 311 -1107 2915 4543 -2794 682 -904
13442 -904 -10936 -9405 -12210 -2148 4239 3855 2619 4019 -286 -3769 -4105 -253 6622 7232 6835
13427 6835 8100 8118 10036 -3261 -8572 -5076 -4900 -4550 -4655 2651 1245 -5657 -823 5899 6010 6682
13411 6682 8820 1409 -9993 -7432 -4748 -535 4430 4009 1309 -1958 -13724 -10851 -325 -2621
$$ packed form
13516D006j9360L297M938J0053O600N09r346j4089J499j164Q570R329R019j3063
13502G98l101J984Q812Q98m752n600J756P9o383n717L905L492M453j978M061R651
13486A2358p398j2323l533j927R723J1296j721j298J377M531K892R24r90l4j0564
13471C313J480l159L887J0536N814j0003n264m039m695O015Q915k007q733m070
13457b010l586K090R58p298P722R683l385l150p13j418M022J628p337L476j586
13442i04j0032J531k805J0062O387l84j236J400m305l483l36L852O875O10l97
13427F835J265J8J918j3297n311L496J76L50j05P306j406o902M834O722J11O72
13411F682K138p411j1402K561K684M213M965m21k700l267j1766K873J0526k296
$$ plain form
13397 -2621 -16423 -18530 -9821 -821 9235 7980 6462 1900 8927 15415 23870 18703 16073 10978
13383 10978 6301 5323 -1174 -7783 -3291 -4809 -18276 -15975 -11346 -5606 -307 -7853 -17503 -5254
13369 -5254 261 5875 42 -5819 -10443 -19593 -15336 -10441 -10129 -15433 -18273 -12376 -13392 -12704 -11450
13354 -11450 -10266 -18747 -18547 -21356 -23340 -18277 -1789 8157 7179 5638 -83 -491 -120 540 -2391
13339 -2391 -3765 -4852 -5011 -7359 -6458 -7716 973 2859 -8366 -6400 12881 19276 7668 257
13325 257 4814 2350 -841 2988 11981 6330 4026 5117 8638 11376 2049 -8859 -7749 -795 9852
13310 9852 10965 3855 2554 16138 10351 4976 -2742 -4542 -8304 -3755 6476 7969 5372 52
13296 52 -1225 11082 9802 4087 -3046 -1971 -8315 -7839 -628 7885 3719 5139 3399 -747 -12100
$$ packed form
13397b621j3802k107Q709R000J0056j255j518m562P027O488Q455n167k630n095
13383A0978m677r78o497o609M492j518j3467K301M629N740N299p546r650J2249
13369e254N515N614n833n861m624r150M257M895L12n304k840N897j016O88J254
13354a1450J184q481K00k809j984N063J6488R946r78j541n721m08L71O60k931
13339b391j374j087j59k348R01j258Q689J886j1225J966J9281O395j1608p411
13325B57M557k464l191L829Q993n651k304J091L521K738r327j0908J110O954J0647
13310I852J113p110j301J3584n787n375p718j800l762M549J0231J493k597n320
13296E2j277J2307j280n715p133J075o344M76P211Q513m166J420j740m146j1353
$$ plain form
13281 -12100 -15331 -10377 621 2367 -8260 -2763 5492 9994 7248 3280 16036 13331 4619 10200
13267 10200 7558 -1645 1238 877 -1519 -1266 2089 -29 -2699 3392 5370 -871 -4988 -7229 -991
13252 -991 982 4362 10159 16444 9448 5223 8112 9089 7652 1788 -1367 3884 610 -3289 -5750
13237 -5750 3849 3573 -99 352 -5067 -377 -3732 -11093 -16487 -13848 -7223 212 -5018 -12402 -3270
13222 -3270 -2367 36 4825 1007 -4933 3005 5787 8466 9700 6039 -11110 -11078 -3170 4733 4880
13207 4880 9586 12451 22283 37114 84364 123729 121715 93701 61010 41439 26026 20469 14346
13194 14346 12865 16550 21158 11059 -3309 -10930 -4493 3029 2776 949 2617 6808 -4276 -7231
13180 -7231 -10305 -10641 -234 2797 4542 9314 11371 8492 -2254 -2318 59 160 -1489 -269 -1480
$$ packed form
13281a2100l231M954J0998J746j0627N497Q255M502k746l968J2756k705q712N581
13267A0200k642r203K883l61k396K53L355k118k670O091J978o241m117k241O238
13252i91J973L380N797O285o996m225K889R77j437n864l155N251l274l899k461
13237e750R599k76l672M51n419M690l355p361n394K639O625P435n230p384R132
13222c270R03K403M789l818n940P938K782K679J234l661j7149L2P908P903J47
13207D880M706K865R832J4831M7250L9365k014k8014l2691j9571j5413n557o123
13194A4346j481L685M608j0099j4368p621O437P522k53j827J668M191j1084k955
13180g231l074l36J0407L031J745M772K057k879j0746o4K377J01j649J220j211
$$ plain form
13165 -1480 -7529 -7155 -5687 -487 -4071 4284 6439 14136 12123 9579 7722 11691 19551 18180 20327
13150 20327 20261 17348 13582 10305 10476 9012 5685 10732 12828 13148 7647 -109 925 -2812 -4770
13135 -4770 -5345 -7280 -3136 1433 -463 -2540 -13645 -15602 -9269 -3922 -5512 -741 4811 4141 5984
13120 5984 8180 -3708 -9374 -6710 662 14828 21029 11677 -200 1035 6172 14732 10578 7691
13106 7691 702 796 8253 7608 9794 19951 25000 29787 37165 44305 43764 35901 44234 54749 61343
13091 61343 54970 40939 28190 26416 28437 28096 29226 34569 50645 94036 127572 108527 73409
13078 73409 55184 45762 30151 14996 16737 18954 19282 18138 7687 7038 6949 11851 13100 4574
13064 4574 -2160 -1934 -7892 -3380 -4864 -9410 -6762 10433 13971 13315 12561 5629 14765 13653 12674
$$ packed form
13165a480o049L74J468N200l584Q355K155P697k013k544j857L969P860j371K147
13150B0327o6k913l766l277J71j464l327N047K096L20n501p756J034l737j958
13135d770n75j935M144M569j896k077j1105j957O333N347j590M771N552o70J843
13120E984K196j1888n666K664P372J4166O201r352j1877J235N137Q560m154k887
13106G691o989R4P457o45K186J0157N049M787P378P140n41p863Q333J0515O594
13091F1343o373j4031j2749j774K021l41J130N343J6076M3391L3536j9045l5118
13078G3409j8225r422j5611j5155J741K217L28j144j0451o49q9M902J249q526
13064D574o734K26n958M512j484m546K648J7195L538o56p54o932R136j112r79
$$ plain form
13049 12674 12711 8986 12068 7387 10923 10974 11012 2875 2911 10564 4600 -1070 -775 4867 10809 15633 5313
13032 5313 -1165 5762 3387 10152 20199 13143 12102 9303 2361 8976 10820 5152 3628 10527
13018 10527 11558 12721 7834 6197 2697 5082 2122 5529 9460 11804 19435 23803 23043 21056 11423
13003 11423 676 -6138 -3504 1482 -1244 -2723 2224 9500 4378 6827 7119 11035 5204 -140
12989 -140 -2877 -12276 -14671 -7134 -6321 -3194 83 -475 1058 4629 1405 4076 7059 6127 4925 6673
12973 6673 11008 11888 14180 12895 8747 20603 29549 38110 32394 21266 14356 7278 12140 7083
12959 7083 5628 7900 11276 16508 14495 9356 3738 -3154 -465 8444 9465 11649 5943 2904 1158
12944 1158 -1618 -4259 -952 7245 4013 210 613 -5965 -7324 2340 4060 2320 -4127 -11097 -15808
$$ packed form
13049A2674L7l725L082m681L536N1L8q137L6P653n964n670K95N642N942M824j0320
13032E313o478O927k375O765J0047p056j041k799o942O615J844n668j524O899
13018A0527J031J163m887j637l500K385k960L407L931K344P631M368p60j987r633
13003A1423j0747o814K634M986k726j479M947P276n122K449K92L916n831n344
12989a40k737r399k395P537Q13L127L277n58J533L571l224K671K983r32j202J748
12973F673M335Q80K292j285m148J1856Q946Q561n716j1128o910p078M862n057
12959G083j455K272L376N232k013n139n618o892K689Q909J021K184n706l039j746
12944A158k776k641L307Q197l232l803M03o578j359R664J720j740o447o970m711
$$ plain form
12929 -15808 -22149 -10642 -5866 -12340 -9421 -2762 6027 -349 -4240 1753 -5007 -14065 -7017 6390
12915 6390 15669 16650 10407 4081 3218 -360 -469 5713 14045 9186 5089 5385 2826 3230 9080 211
12899 211 -4819 1859 359 3585 10588 10467 9880 8507 9163 13825 17206 2899 -9721 -712 13694
12884 13694 5927 -1399 -5750 -7297 -5608 -8746 -86 6335 5387 444 3211 7809 131 -6403 -7950
12869 -7950 -3059 3155 1411 -7251 -13102 -14667 -13036 -2517 9976 19086 14235 12266 15264 15569
12855 15569 9169 13662 12369 10405 7114 6986 10047 13783 6003 -321 -2214 -5922 -13281 -13492 -12302
12840 -12302 -9127 -7471 -10449 -2411 5375 7552 1041 -2920 -4823 -134 3532 7797 6719 2027
12826 2027 -1350 -10258 -17652 -7368 -406 8022 7139 8408 2231 2197 1179 4206 2625 4075 8110
$$ packed form
12929a5808o341J1507M776o474K919O659Q789o376l891N993o760r058P048J3407
12915F390R279R81o243o326q63l578j09O182Q332m859m097K96k559M04N850q869
12899B11n030O678j500L226P003j21n87j373O56M662L381j4307j2620R009J4406
12884A3694p767p326m351j547J689l138Q660O421r48m943K767M598p678o534j547
12869g950M891O214j744q662n851j565J631J0519J2493R110m851j969K998L05
12855A5569o400M493j293j964l291j28L061L736p780o324j893l708p359k11J190
12840a2302L175J656k978Q038P786K177o511l961j903M689L666M265j078m692
12826B027l377q908p394J0284O962Q428q83J269o177l4j018L027j581J450M035
$$ plain form
12811 8110 6581 7738 8010 8119 873 -865 -3288 -336 5428 4206 8311 6764 -2268 1332 1788
12796 1788 4256 9359 11459 253 -555 17654 20474 12499 7820 2689 11674 15513 6324 6517 653
12781 653 9075 13425 15550 23499 23229 17127 23491 16741 2759 4578 10656 7103 6577 5635 6314 11976
12765 11976 19754 22449 19856 13624 14711 16673 20159 22663 23138 13989 5860 215 -8142 -8630 3743
12750 3743 16162 7162 7472 6106 -3275 -5734 3995 170 5127 10686 11056 10879 6602 10670 6296
12735 6296 -11570 -8674 2852 7915 8170 9205 8306 11398 18061 10943 8369 9045 7448 3514 5763
12720 5763 1883 2927 3132 4777 6315 7451 10904 3860 -2993 -4740 -4431 -1097 3174 3185 3980 2120
12704 2120 5565 8416 3730 -9308 -13450 -8771 -6312 -9816 138 1531 2427 -2308 2870 16280
$$ packed form
12811H110j529J157K72J09p246j738k423K952N764j222M105j547r032L600M56
12796A788K468N103K100j1206q08J8209K820p975m679n131Q985L839r189J93n864
12781F53Q422M350K125P949k70o102O364o750j3982J819O078l553n26r42O79N662
12765A1976P778K695k593o232J087J962L486K504M75r149q129n645q357m88J2373
12750C743J2419r000L10j366r381k459R729l825M957N559L70j77m277M068m374
12735F296j7866K896J1526N063K55J035q99L092O663p118k574O76j597l934K249
12720E763l880J044K05J645J538J136L453p044o853j747L09L334M271J1P95j860
12704B120L445K851m686j3038m142M679K459l504R954J393Q96m735N178J3410
$$ plain form
12690 16280 21282 15429 14048 17810 19234 21366 18908 24552 14774 11803 7383 17365 18682 14455
12676 14455 11248 16366 12849 5487 1427 -5935 -10258 -4165 -3430 2680 11315 11232 4978 7123 7000
12661 7000 5561 11611 13207 7304 4480 3595 4144 6938 15246 20233 15931 17585 20634 22029 24562
12646 24562 32730 44554 38188 33093 67334 99519 144729 161297 141404 112336 110733 118889 117005
12633 117005 100687 77991 56876 41018 27160 20719 27618 22461 10396 21731 28450 26089
12621 26089 20826 22013 25413 36674 21862 23169 33500 29508 50110 68315 90449 122618 179486
12608 179486 231312 243876 210330 177231 167100 171575 199876 282397 422104 664123 1085699
12597 1085699 1668287 2120034 2118359 1670783 1094890 675587 438480 298895 220168 176619
$$ packed form
12690A6280N002n853j381L762J424K132k458N644r778k971m420R982J317m227
12676A4455l207N118l517p362m060p362m323O093P35O110Q635q3o254K145j23
12661G000j439O050J596n903k824q85N49K794Q308M987m302J654L049J395K533
12646B4562Q168J1824o366n095L4241L2185M5210J6568j9893k9068j603Q156j884
12633A17005j6318k2696k1115j5858j3858o441O899n157j2065J1335O719k361
12621B6089n263J187L400J1261j4812J307J0331l992K0602J8205K2134L2169N6868
12608A79486N1826J2564l3546l3099j0131M475K8301Q2521J39707K42019M21576
12597A085699N82588M51747j675m47576n75893m19303k37107j39585p8727m3549
$$ plain form
12587 176619 151287 136441 130376 116648 95097 77475 65750 61792 58405 58521 62519 65197 74962
12574 74962 104331 155456 218284 333165 434241 421330 299540 199395 133742 91333 72357
12563 72357 59977 59801 56860 51667 46692 41358 35808 28296 19877 16938 15444 13683 22963 22205 16604
12548 16604 7767 3876 15121 20512 21407 24286 20185 3806 -2288 9516 25559 34194 36188 37403
12534 37403 28807 17033 20302 25875 29051 14069 13865 18427 12136 14231 12016 13926 8452 1707
12520 1707 7466 845 1455 13288 12240 6558 7210 7732 2576 -1347 2526 2548 7270 16312 27244
12505 27244 28657 24203 28499 26959 23742 27050 25578 19128 14589 13921 21237 16412 16816 27459 29985
12490 29985 19855 17061 23848 28282 22470 28236 24615 21908 17635 15173 20566 21210 20301 16404 9803
$$ packed form
12587A76619k5332j4846o065j3728k1551j7622j1725l958l387J16L998K678R765
12574G4962K9369N1125O2828J14881J01076j2911j21790j00145o5653m2409j8976
12563G2357j2380j76k941n193m975n334n550p512q419k939j494j761R280p58n601
12548A6604q837l891J1245N391Q95K879m101j6379o094J1804J6043Q635J994J215
12534C7403q596j1774L269N573L176j4982k04M562o291K095k215J910n474o745
12520A707N759o621O10J1833j048n682O52N22n156l923L873K2M722R042J0932
12505B7244J413m454M296j540l217L308j472o450m539o68P316m825M04J0643K526
12490B9985j0130k794O787M434n812N766l621k707m273k462N393O44r09l897o601
$$ plain form
12475 9803 10490 16729 19943 19990 14587 21296 27707 28808 31181 20361 16504 16594 6879 21149 21986 21404
12459 21404 17226 10484 9839 11845 13148 17970 22302 23104 23076 25418 22984 14326 10572 11630 10806 5865
12443 5865 11814 12461 18459 13087 11320 8140 9607 9691 9779 10992 9653 12938 16641 22220 19859 14820
12427 14820 9962 -663 -2948 5679 3814 7129 6946 6510 13032 13320 5693 9071 10699 23273 19533
12412 19533 16314 14836 9344 4924 9568 7501 6522 9119 15968 16197 23415 28273 26769 16893 26312
12397 26312 28093 33236 43518 36652 28368 33629 35256 30153 25225 22539 23676 18693 9856 8729
12383 8729 13717 16246 9378 6656 11526 8723 3456 9831 10762 6942 3682 -365 875 2078 10462
12368 10462 15762 23693 26855 18691 15297 17841 11542 12697 19143 23686 22688 22823 24714 31037 35898
$$ packed form
12475I803O87O239L214M7n403O709O411J101K373j0820l857R0r715J4270Q37n82
12459B1404m178o742o45K006J303M822M332Q02k8K342k434q658l754J058q24m941
12443E865N949O47N998n372j767l180J467Q4Q8J213j339L285L703N579k361n039
12427A4820m858j0625k285Q627j865L315j83m36O522K88p627L378J628J2574l740
12412A9533l219j478n492m420M644k067r79K597O849K29P218M858j504r876R419
12397B6312J781N143J0282o866q284N261J627n103m928k686J137m983q837j127
12383H729M988K529o868k722M870k803n267O375R31l820l260m047J240J203Q384
12368A0462N300P931L162q164l394K544o299J155O446M543r98J35J891O323M861
$$ plain form
12353 35898 38981 43153 43297 42662 43111 40731 37265 40557 45285 55592 63164 74554 93401 125883
12339 125883 152009 177849 193839 191465 182611 158238 121172 78303 48138 42795 44496 40183
12327 40183 34597 25838 24341 23370 22665 14440 11802 14066 14369 14578 26040 30258 31472 27703 21349
12312 21349 24600 29551 23934 26156 31713 29488 17352 11982 5777 7562 17135 15436 14091 13286
12298 13286 16984 14761 16598 29921 41495 44193 59216 79925 108365 134408 190140 271102
12286 271102 354740 409941 419775 381293 313091 241680 183589 132431 102559 80411 63153 50515
12274 50515 44821 37113 35630 41552 38506 40753 33008 34086 33680 28319 30121 29345 35633 39620 41753
12259 41753 42833 49251 47626 50487 49757 47464 42950 34725 18394 16845 17494 21608 28512 38416 38179
$$ packed form
12353C5898L083M172J44o35M49k380l466L292M728J0307P572J1390J8847L2482
12339A25883K6126K5840J5990k374q854k4373l7066m2869l0165n343J701m313
12327D0183n586q759j497r71p05q225k638K264L03K09J1462M218J214l769o354
12312B1349L251M951n617K222N557k225j2136n370o205J785R573j699j345q05
12298A3286L698k223J837J3323J1574K698J5023K0709K8440K6043N5732Q0962
12286B71102Q3638N5201R834l8482o8202p1411n8091n1158k9872k2148j7258j2638
12274E0515n694p708j483N922l046K247p745J078m06n361J802p76O288L987K133
12259D1753J080O418j625K861p30k293m514q225j6331j549O49M114O904R904k37
$$ plain form
12244 38179 27844 29569 39993 50557 67798 81859 87119 97682 123247 171939 224953 249565
12232 249565 239979 207167 172383 129358 93139 75466 66799 52488 47839 42762 32852 22839
12220 22839 29347 35872 36278 33355 30120 30759 33448 33980 33178 30702 26053 25344 34796 35454 43216 56164
12204 56164 65151 59382 52317 52325 55957 50419 37837 29783 24892 27798 32320 40388 39050 38145 33660
12189 33660 30346 31606 30886 17542 5694 189 6343 22489 33313 34916 18741 12914 23555
12176 23555 19830 18098 24321 30670 36591 39786 34423 39555 37351 38861 43784 45353 39682 48343
12162 48343 44893 44739 42988 39088 36920 42709 42676 42406 37855 30144 29844 35816 44053 44543 39756 35685
12146 35685 37326 44153 45756 48377 50974 51618 55842 55209 62716 50136 42688 31006 32099 37851
$$ packed form
12244C8179j0335J725J0424J0564J7241J4061N260J0563K5565M8692N3014K4612
12232B49565r586l2812l4784m3025l6219j7673q667j4311m649n077r910j0013
12220B2839O508O525M06k923l235O39K689N32q02k476m649p09R452O58P762J2948
12204E6164Q987n769p065QL632n538j2582q054m891K906M522Q068j338r05m485
12189C3660l314J260p20j3344j1848n505O154J6146J0824J603j6175n827J0641
12176B3555l725j732O223O349N921L195n363N132k204J510M923J569n671Q661
12162D8343l450j54j751l900k168N789l3k70m551p711l00N972Q237M90m787m071
12146C5685J641O827J603K621K597O44M224o33P507j2580p448j1682J093N752
$$ plain form
12132 37851 47128 49732 48466 35067 34324 42097 38354 35962 38624 35373 31167 35703 41961 44256
12118 44256 42453 39494 43124 51060 45466 43218 50752 55803 60444 56702 51725 36692 27445 27162
12104 27162 26330 29056 15776 4438 13913 38509 29737 19109 33929 31101 18017 11097 14981
12091 14981 18507 20958 28497 33486 31333 33953 30878 34662 35898 27849 30752 34156 32505 33981
12077 33981 47138 44180 43119 35121 34591 43945 39572 41403 42113 30926 26924 32123 36930 37175 31338
12062 31338 15391 8719 10770 18516 21816 28515 34213 41617 57058 64037 61983 65979 77713 94100
12048 94100 93504 82022 75538 77125 86139 89841 89187 94825 110938 120484 129678 140376 162756 213746
12034 213746 277589 362889 500275 652397 730916 716662 700369 731300 741704 647167 510815
$$ packed form
12132C7851R277K604j266j3399p43P773l743k392K662l251m206M536O258K295
12118D4256j803k959L630P936n594k248P534N051M641l742m977j5033r247k83
12104B7162q32K726j3280j1338R475K4596q772j0628J4820k828j3084o920L884
12091A4981L526K451P539M989k153K620l075L784J236q049K903L404j651J476
12077C3981J3157k958j061p998n30R354m373J831P10j1187m002N199M807K45n837
12062C1338j5947o672K051P746L300O699N698P404J5441O979k054L996J1734J6387
12048I4100n96j1482o484J587R014L702o54N638J6113R546R194J0698K2380N0990
12034B13746O3843Q5300J37386J52122P8519j4254j6293L0931J0404r4537j36352
$$ plain form
12023 510815 405849 350607 326826 338882 381376 454402 575794 798225 1088591 1264416
12013 1264416 1215094 1127015 1157982 1249005 1171646 912653 656844 482357 383399 332750 299511
12002 299511 274244 257869 252196 266153 285995 285929 266945 250579 232757 220084 203363 189136
11990 189136 169595 163389 171336 194507 211221 232475 267507 319470 378079 450523 559421 739217
11978 739217 989261 1267171 1490078 1653040 1737135 1723564 1607273 1501098 1353002 1124819
11968 1124819 946531 849228 826860 889264 1060840 1352801 1780697 2243697 2580482 2794901
11958 2794901 2911570 2889539 2662080 2441662 2112532 1599967 1139886 832973 665830 573397
11948 573397 517246 485340 459946 444128 428203 399023 371234 354959 336216 313591 281637
$$ packed form
12023E10815j04966n5242k3781J2056M2494P3026J21392K22431K90366J75825
12013A264416m9322q8079L0967R1023p7359k58993k55809j74487r8958n0649l3239
12002B99511k5267j6375n673J3957J9842o6j8984j6366j7822j2673j6721j4227
11990A89136j9541o206P947K3171J6714K1254L5032N1963N8609P2444J08898J79796
11978G39217K50044K77910K22907J62962Q4095j3571j16291j06175j48096k28183
11968A124819j78288r7303k2368O2404J71576K91961M27896M63000L36785K14419
11958B794901J16669k2031k27459k20418l29130n12565m60081l06913j67143r2433
11948E73397n6151l1906k5394j5818j5925k9180k7789j6275j8743k2625l1954
$$ plain form
11937 281637 281010 299520 322486 337887 358595 389569 441151 474684 491004 512713 548913 607888
11925 607888 691626 835608 1045188 1299349 1484728 1570706 1629397 1693523 1666697 1575320 1541664
11914 1541664 1624562 1798875 2015489 2288383 2717461 3395912 4382905 5808633 7870675
11905 7870675 10790847 15173521 21304265 26262045 26013927 23348232 22716014 24670793
11897 24670793 25369829 21458355 15560133 10833908 7862129 6145673 5103076 4288450
11889 4288450 3573125 3031527 2665315 2402989 2220868 2110815 2079149 2032359 1887673 1721177
11879 1721177 1643045 1671625 1710098 1630488 1476161 1349463 1285935 1285425 1295972 1308985 1347597
11868 1347597 1421668 1526300 1650993 1809947 2027971 2343526 2748374 3224505 3785065 4503039
$$ packed form
11937B81637o27J8510K2966J5401K0708L0974N1582L3533J6320K1709L6200N8975
11925F07888Q3738J43982K09580K54161J85379Q5978N8691O4126k6826r1377l3656
11914A541664Q2898J74313K16614K72894M29078O78451R86993J425728K062042
11905G870675K920172M382674O130744M957780k48118k665695o32218J954779
11897B4670793O99036l911474n898222m726225k971779j716456j042597q14626
11889D288450p15325n41598l66212k62326j82121j10053l1666m6790j44686j66496
11879A721177p8132K8580L8473p9610j54327j26698o3528n10J0547J3013L8612
11868A347597P4071J04632J24693J58954K18024L15555M04848M76131N60560P17974
$$ plain form
11858 4503039 5469167 6794057 8645718 11361411 15620455 22328226 31939691 42194944
11850 42194944 49457360 53822649 56109192 59340853 61861828 58839450 48437338 34203328
11842 34203328 22798453 15781744 11696105 9183942 7517911 6366062 5578825 5012188
11834 5012188 4563605 4201309 3909854 3660581 3440187 3261289 3115508 3077437 3045440 2859840
11824 2859840 2466018 2034924 1720121 1522381 1413501 1347023 1311735 1309859 1325731 1361529
11814 1361529 1406777 1483016 1589277 1755803 1992398 2293416 2626884 3011964 3531083 4276701
11804 4276701 5293806 6781287 9144973 12996543 18960963 27455500 36212265 39501234
11796 39501234 38427527 38380621 38279146 32958440 24164265 16552445 11545027 8541647
$$ packed form
11858D503039R66128J324890J851661K715693M259044O707771R611465J0255253
11850D2194944P262416M365289K286543L231661K520975l022378j0402112j4234010
11842C4203328j1404875p016709m085639k512163j666031j151849p87237n66637
11834E012188m48583l62296k91455k49273k20394j78898j45781l8071l1997j85600
11824B859840l93822m31094l14803j97740j08880o6478l5288j876J5872L5798
11814A361529M5248P6239J06261J66526K36595L01018L33468L85080N19119P45618
11804D276701J017105J487481K363686L851570N964420Q494537Q756765L288969
11796C9501234j073707m6906j01475n320706q794175p611820n007418l003380
$$ plain form
11788 8541647 6718686 5486205 4542985 3810034 3275807 2882293 2572517 2362880 2276826
11779 2276826 2276242 2186251 1989809 1859277 1801266 1643607 1355636 1071954 865380 713785
11769 713785 615128 552233 499862 459706 428502 399588 384447 351439 323442 303330 287373
11758 287373 269029 255563 231247 206661 207439 201782 184977 176485 170447 159116 164536 170199 167271
11745 167271 161333 160008 160196 167980 170160 154197 149002 149741 149102 145047 136856 129284 126286 123846 119042
11730 119042 113391 110898 116687 122872 121011 111334 100577 99461 106457 111443 126169 133547 135233 135991
11716 135991 151966 164609 177253 187738 207470 232204 262593 295197 324829 324015 304393 274546
11704 274546 247393 221044 194741 167590 140128 127131 130912 149914 166328 152669 133587 119040
$$ packed form
11788H541647j822961j232481r43220p32951n34227l93514l09776k09637q6054
11779B276826n84q9991j96442j30532n8011j57659k87971k83682k06574j51595
11769G13785r8657o2895n2371m0156l1204k8914j5141l3008k7997k0112j5957
11758B87373j8344j3466k4316k4586P78n657j6805q492o038j1331N420N663k928
11745A67271n938j325J88P784K180j5963n195P39o39m055q191p572k998k440m804
11730A19042n651k493N789O185j861r677j0757j116O996M986J4726P378J686P58
11716A35991J5975J2643J2644J0485J9732K4734L0389L2604K9632q14j9622k9847
11704B74546k7153k6349k6303k7151k7462j2997L781J9002J6414j3659j9082j4547
$$ plain form
11692 119040 116080 113620 115053 122049 125849 125860 130489 113848 96775 92094 92430 86741 82702 87636
11678 87636 99131 103715 100099 97594 111294 134284 144566 142777 146520 148284 169225 186257 185373
11665 185373 191615 192321 190240 191537 188959 185809 177612 177460 172048 167910 167837 168963 157192 134274 118499
11650 118499 104757 88640 81934 61879 56494 69201 75313 86222 96308 111188 109415 99885
11638 99885 92027 83800 81067 82738 87081 82351 80713 84717 78359 73188 62703 62776 65933 71236 80957
11623 80957 71382 69181 69220 64670 68774 74533 82998 86357 84746 82503 78968 74625 59857 61975 68076
11608 68076 69607 69365 75477 90672 93834 84462 87388 96307 90438 87037 90722 107199 112462 110310
11594 110310 100524 97359 89689 91264 91463 88186 82500 76036 74280 70545 68998 66503 66264 70911 75058
$$ packed form
11692A19040k960k460J433O996L800J1M629j6641j7073m681L36n689m039M934
11678H7636J1495M584l616k505J3700K2990J0282j789L743J764K0941J7032q84
11665A85373O242P06k081J297k578l150q197j52n412m138p3J126j1771k2918j5775
11650A18499j3742j6117o706k0055n385J2707O112J0909J0086J4880j773r530
11638I9885p858q227k733J671M343m730j638M004o358n171j0485P3L157N303R721
11623H0957r575k201L9m550M104N759Q465L359j611k243l535m343j4768K118O101
11608F8076J531k42O112J5195L162r372K926Q919n869l401L685J6477N263k152
11594A10310r786l165p670J575J99l277n686o464j756l735j547k495k39M647M147
$$ plain form
11579 75058 80037 80176 76850 84392 92896 91433 95130 102351 100144 104726 99357 92030 100208 113344
11565 113344 109281 117593 128380 129726 134173 140270 156971 187847 232381 284325 323024 339214
11553 339214 347796 395828 485554 558517 628934 756343 966820 1296416 1887000 2987293
11543 2987293 5024240 8567296 13984505 16990579 13401873 8193844 4778955 2984642
11535 2984642 2040986 1497661 1170465 968392 840305 752722 663196 565955 507627 477151
11525 477151 453168 404751 350415 315782 294101 278711 278796 293496 300233 286247 282575 302311
11513 302311 348526 391667 434759 507000 624681 807676 1148708 1787889 2944320 4940147
11503 4940147 7963125 9267097 6962483 4206779 2499717 1596709 1113385 832874 651359
$$ packed form
11579G5058M979J39l326P542Q504j463L697P221k207M582n369p327Q178J3136
11565A13344m063Q312J0787J346M447O097J6701L0876M4534N1944L8699J6190
11553C39214Q582M8032Q9726P2963P0417J27409K10477L29596N90584J100293
11543B987293K036947L543056N417209L006074l588706n208029l414889j794313
11535B984642r43656n43325l27196k02073j28087q7583q9526r7241n8328l0476
11525D77151k3983m8417n4336l4633k1681j5390Q5J4700O737j3986l672J9736
11513C02311M6215M3141M3092P2241J17681J82995L41032O39181J156431J995827
11503D940147L022978J303972k304614k755704j707062r03008m83324k80511j81515
$$ plain form
11494 651359 541469 480521 429263 373842 322098 285531 262187 241021 209720 184912 170638
11483 170638 156538 146355 140027 130940 127879 121611 120819 120456 110283 108871 110513 114531 125764 124803
11469 124803 140320 151371 143681 121302 109709 100294 88445 79438 75244 76811 72970 72218 66237
11456 66237 73394 79758 83570 91074 97866 114002 121945 140652 151234 148888 144830 142883 137998 118996
11442 118996 104833 105319 102022 98050 98106 103115 107131 103803 104476 106838 104677 114824 128603 144317
11428 144317 132748 115511 111733 103140 95892 92620 90952 85761 84485 82550 81099 82093 85673 82961
11414 82961 76801 87364 112524 128958 142583 163375 165666 177844 215587 245214 269284 292822
11402 292822 324437 367198 404881 420282 393474 337423 290500 264803 243242 224286 212770
$$ packed form
11494F51359j09890o0948n1258n5421n1744l6567k3344k1166l1301k4808j4274
11483A70638j4100j0183o328r087l061o268p92l63j0173j412J642M018J1233r61
11469A24803J5517J1051p690k2379j1593r415j1849r007m194J567l841p52n981
11456F6237P157O364L812P504O792J6136P943J8707J0582k346m058j947m885j9002
11442A18996j4163M86l297l972N6N009M016l328O73K362k161J0147J3779J5714
11428A44317j1569j7237l778q593p248l272j668n191j276j935j451R94L580k712
11414H2961o160J0563K5160J6434J3625K0792K291J2178L7743K9627K4070K3538
11402B92822L1615M2761L7683J5401k6808n6051m6923k5697k1561j8956j1516
$$ plain form
11391 212770 197722 195113 195328 187575 175237 167077 158368 158138 160177 162696 159522 147404 147929 151376
11377 151376 153950 153457 170336 186835 200787 217075 225243 231015 254137 287063 324737 371628
11365 371628 436426 493995 538466 602938 750115 1033893 1483524 1872320 1959983 1698376
11355 1698376 1288194 939460 718348 579621 507277 472780 471997 491530 529228 599511 697650
11344 697650 817228 933501 1033305 1140043 1273234 1417397 1525080 1611883 1703661 1784847
11334 1784847 1862816 1908070 1918130 1894122 1837273 1763380 1694244 1629550 1547315 1451769 1362895
11323 1362895 1295372 1246342 1224897 1246664 1302993 1384942 1485951 1592603 1742205 1940748
11313 1940748 2183526 2470842 2840914 3375278 4147044 5243599 6825085 8832732 10814492
$$ packed form
11391B12770j5048k609K15p753j2338q160q709k30K039K519l174j2118N25L447
11377A51376K574m93J6879J6499J3952J6288Q168N772K3122L2926L7674M6891
11365C71628O4798N7569M4471O4472J47177K83778M49631L88796Q7663k61607
11355A698376m10182l48734k21112j38727p2344l4497p83J9533L7698P0283R8139
11344F97650J19578J16273R9804J06738J33191J44163J07683Q6803R1778Q1186
11334A784847P7969M5254J0060k4008n6849p3893o9136o4694q2235r5546q8874
11323A362895o7523m9030k1445K1767N6329Q1949J01009J06652J49602J98543
11313A940748K42778K87316L70072N34364P71766J096555J581486K007647J981760
$$ plain form
11304 10814492 12723535 14797092 16932068 18955146 20835218 22544375 23741671 24218787
11296 24218787 24244888 24247066 24048704 23007663 21274179 19389089 17561109 15686121 13894964
11287 13894964 12196663 10334412 8654761 7408980 6561290 5988010 5581755 5282886 4988260
11278 4988260 4692248 4377537 4068812 3797563 3539115 3286110 3039145 2805788 2596438
11269 2596438 2438686 2353854 2341453 2404299 2529709 2691020 2910700 3231976 3646774 4201911
11259 4201911 4948119 6024285 7630241 9936166 12814513 15891530 19072448 21937864
11251 21937864 24958519 28152504 31513274 35045212 37493233 38867100 38920048 38442077
11243 38442077 38044715 37123611 35663584 33019163 29566941 25950400 22480139 19428572
$$ packed form
11304A0814492J909043K073557K134976K023078J880072J709157J197296M77116
11296B4218787K6101K178j98362j041041j733484j885090j827980j874988j791157
11287A3894964j698301j862251j679651j245781q47690n73280m06255k98869k94626
11278D988260k96012l14711l08725k71249k58448k53005k46965k33357k09350
11269B596438j57752q4832j2401O2846J25410J61311K19680L21276M14798N55137
11259D201911P46208J076166J605956K305925K878347L077017L180918K865416
11251B1937864L020655L193985L360770L531938K448021J373867N2948m77971
11243C8442077l97362r21104j460027k644421l452222l616541l470261l051567
$$ plain form
11235 19428572 16510278 13752624 11226276 9082633 7477314 6339883 5502708 4864440
11227 4864440 4367673 3986711 3684086 3402581 3113090 2829427 2574108 2371825 2206511
11218 2206511 2048869 1895509 1765488 1675889 1631936 1624171 1655880 1729992 1872662 2067204
11208 2067204 2315588 2638347 3107383 3826973 4856612 6140148 7393787 8496462 9612925
11199 9612925 10856030 12448808 14085395 15485105 16534319 16722391 16467336 16247552 16335584
11190 16335584 16387983 15575886 14135922 12356857 10676030 9341283 8169020 7039778
11182 7039778 5730276 4410969 3372518 2653215 2160474 1800218 1530840 1317412 1146200
11173 1146200 1002385 878951 779989 701940 634222 572512 532847 492111 443528 411809 383400
$$ packed form
11235A9428572k918294k757654k526348k143643j605319j137431q37175o38268
11227D864440m96767l80962l02625k81505k89491k83663k55319k02283j65314
11218B206511j57642j53360j30021q9599m3953p765L1709P4112J42670J94542
11208B067204K48384L22759M69036P19590J029639J283536J253639J102675J116463
11199I612925J243105J592778J636587J399710J049214J88072k55055k19784Q8032
11190A6335584N2399q12097j439964j779065j680827j334747j172263j129242
11182G039778j309502j319307j038451p19303m92741l60256k69378k13428j71212
11173A146200j43815j23434r8962p8049o7718o1710l9665m0736m8583l1719k8409
$$ plain form
11162 383400 351106 334361 309647 291270 275058 258602 241892 231762 221769 214179 199537 179455
11150 179455 161115 150749 138338 125114 123786 132740 133504 125573 125119 127256 125766 123527 120974 122983
11136 122983 120711 106315 111135 115093 110016 96449 84255 78885 89065 94583 88845 87011 83990
11123 83990 88582 99923 97873 96050 100212 93961 91554 98564 110677 113324 98132 88664 81313 79515
11109 79515 92145 104825 134172 148686 130318 108253 92265 78119 58046 39811 23463 25683
11097 25683 26131 21432 17612 13684 22872 25141 32524 49122 85447 149433 223209 313043 369834
11084 369834 408717 451731 502181 538898 535519 435242 272197 126228 52410 19976 38955
11073 38955 91233 186767 279448 310224 282501 258168 244148 218671 190849 167110 164480 176067
$$ packed form
11162C83400l2294j6745k4714j8377j6212j6456j6710j0130r993p590j4642k0082
11150A79455j8340j0366j2411j3224j328Q954P64p931m54K137j490k239k553K009
11136A22983k272j4396M820L958n077j3567j2194n370J0180N518n738j834l021
11123H3990M592J1341k050j823M162o251k407P010J2113K647j5192r468p351j798
11109G9515J2630J2680K9347J4514j8368k2065j5988j4146k0073j8235j6348K220
11097B5683M48m699l820l928R188K269P383J6598L6325O3986P3776Q9834N6791
11084C69834L8883M3014N0450L6717l379j00277j63045j45969p3818l2434J8979
11073C8955N2278R5534R2681L0776k7723k4333j4020k5477k7822k3739k630J1587
$$ plain form
11061 176067 195157 202403 200823 191345 179186 160571 144534 137178 129512 133964 147437 165492 175862
11048 175862 173007 155900 149404 138975 134762 136144 128299 131514 123448 115886 118023 138546 155981
11035 155981 166819 169084 169426 171507 177272 181711 188230 196630 202199 197951 183536 171811 158657
11022 158657 148150 148695 165441 192534 210922 219399 231473 236300 246437 255313 267034 271674 272688
11009 272688 270641 269493 277073 286749 308055 339098 372758 397226 422611 450154 486624 528574
10997 528574 563884 596488 639648 735982 895498 1166760 1648863 2499460 3954531 6225151
10987 6225151 8334649 8786873 7250982 4854476 3075461 2080619 1570947 1306964 1171789
10978 1171789 1093640 1036359 996239 983515 990826 999840 989632 961905 938279 948508 1000555 1066341
$$ packed form
11061A76067J9090P246j580r478j2159j8615j6037p356p666M452J3473J8055J0370
11048A75862k855j7107o496j0429m213J382p845L215q066p562K137K0523J7435
11035A55981J0838K265L42K081N765M439O519Q400N569m248j4415j1725j3154
11022A58657j0507N45J6746K7093J8388Q477J2074M827J0137Q876J1721M640J014
11009B72688k047j148P580R676K1306L1043L3660K4468K5385K7543L6470M1950
10997E28574L5310L2604M3160R6334J59516K71262M82103Q50597J455071K270620
10987F225151K109498M52224j535891k396506j779015r94842n09672k63983j35175
10978A171789p8149n7281m0120j2724P311R014j0208k7727k3626J0229N2047O5786
$$ plain form
10966 1066341 1127269 1168829 1195513 1229969 1293664 1403920 1544812 1691452 1834448 1980047
10956 1980047 2113748 2257365 2439005 2687455 3055804 3599538 4324284 5237101 6336307
10947 6336307 7469233 8668200 9813782 10979200 12433247 14684450 18438162 24546319
10939 24546319 34791615 52790225 84794720 139404937 222265540 293902692 308536122
10932 308536122 256858082 172419983 106178923 67351277 45785975 33298954 25593830
10925 25593830 20646673 17397381 15245956 13626330 12228149 10777485 9218140 7638464
10917 7638464 6222277 5180995 4459135 3898057 3389791 2932250 2546242 2248915 2016976
10908 2016976 1825216 1677864 1556273 1459414 1357187 1234327 1123390 1049516 1008196 980765
$$ packed form
10966A066341O0928M1560K6684L4456O3695J10256J40892J46640J42996J45599
10956A980047J33701J43617J81640K48450L68349N43734P24746R12817J099206
10947F336307J132926J198967J145582J165418J454047K251203L753712O108157
10939B4546319J0245296J7998610L2004495N4610217Q2860603P1637152J4633430
10932C08536122n1678040q4438099o6241060l8827646k1565302j2487021p705124
10925B5593830m947157l249292k151425j619626j398181j450664j559345j579676
10917G638464j416187j041282p21860n61078n08266m57541l86008k97327k31939
10908B016976j91760j47352j21591r6859j02227j22860j10937p3874m1320k7431
$$ plain form
10898 980765 944591 891922 820867 747380 683854 643229 622557 595956 559613 533206 532695 552500
10886 552500 564188 561451 549908 547506 542504 528600 501546 455936 437739 435899 447221 458610
10874 458610 458813 452017 440043 427259 406670 390088 376623 357172 329155 307928 300925 291674
10862 291674 286623 273307 263050 252008 233788 218534 213102 205471 196519 192138 193929 188503 183411
10849 183411 175314 177999 187597 199509 200673 195990 184652 154809 120579 100028 105241 117817 117898
10836 117898 111998 104060 112749 124893 136181 152885 184477 220601 241108 252186 257488 258997
10824 258997 272294 295937 311362 312633 301160 290595 276636 261489 252451 240224 228221 207248
10812 207248 171907 126584 84294 71422 66552 61315 44402 59319 84227 91740 86704 84991
$$ packed form
10898I80765l6174n2669p1055p3487o3526m0625k0672k6601l6343k6407n11J9805
10886E52500J1688k737j1543k402n002j3904k7054m5610j8197j840J1322J1389
10874D58610K03o796j1974j2784k0589j6582j3465j9451k8017k1227p003r251
10862B91674n051j3316j0257j1042j8220j5254n432p631q952m381J791n426n092
10849A83411q097K685R598J1912J164m683j1338k9843l4230k0551N213J2576Q1
10836A17898n900p938Q689J2144J1288J6704L1592L6124K0507J1078N302J509
10824B58997J3297K3643J5425J271j1473j0565j3959j5147r038j2227j2003k0973
10812B07248l5341m5323m2290j2872m870n237j6913J4917K4908P513n036j713
$$ plain form
10800 84991 86714 73242 34247 440 11981 86535 181287 240184 262596 264333 235171 132240
10788 132240 -36676 -187026 -253878 -247560 -219833 -189007 -158476 -116342 -59772 9030 75494
10777 75494 128262 150262 171332 177847 180386 193797 203571 208655 210846 205483 194391 181444 170368
10764 170368 151742 134284 124668 104877 88730 82726 86071 78332 64941 44950 23457 20641
10752 20641 26028 53930 60992 63396 52850 39788 37809 34904 38548 56199 67694 63304 54181
10739 54181 55197 66837 75442 72051 72725 77429 74806 69208 59435 55733 46324 39069 45067 39657
10725 39657 29571 38313 50018 50264 61430 55786 53575 54847 53289 36140 23114 6822 -408
10712 -408 4381 17927 21385 17677 19114 34769 31674 17773 10842 12037 12530 12955 19249 24590 21641
$$ packed form
10800H4991J723j3472l8995l3807J1541P4554R4752N8897K2412J737k9162j02931
10788A32240j68916j50350o6852O318K7727L0826L0531M2134N6570O8802O6464
10777G5494N2768K2000K1070O515K539J3411R774N084K191n363j1092j2947j1076
10764A70368j8626j7458r616j9791j6147o004L345p739j3391j9991k1493k816
10752B0641N387K7902P062K404j0546j3062j979k905L644J7651J1495m390r123
10739E4181J016J1640Q605l391O74M704k623n598r773l702r409p255N998n410
10725C9657j0086Q742J1705K46J1166n644k211J272j558j7149j3026j6292p230
10712d08M789J3546L458l708J437J5655l095j3901o931J195M93M25O294N341k949
$$ plain form
10697 21641 13650 8103 9480 15567 14540 6592 7058 1504 6281 12437 28679 34529 36500 34680
10683 34680 33980 35857 38003 30852 27438 31696 45505 51986 53584 55721 37478 27818 18547 15148
10669 15148 20982 14457 10089 19157 24131 32766 34856 21668 16675 21302 26355 29116 32350 34137
10655 34137 41445 38855 21533 20282 25886 28185 23616 24865 33573 35603 36224 24405 18846 14972
10641 14972 17753 22545 22589 22309 25365 23899 20468 14862 16834 27793 40994 53910 52153 41429
10627 41429 34454 32279 34059 17218 11640 16009 26015 30756 19497 12616 14403 19346 28660 27264
10613 27264 15517 16558 18710 20163 31023 44045 45542 44692 35172 27464 31241 30651 27329 21089
10599 21089 16982 13751 18570 25880 21836 19533 15343 5388 4356 -1459 2742 8385 4947 -1631
$$ packed form
10697B1641p991n547J377O087j027p948M66n554M777O156J6242N850J971j820
10683C4680p00J877K146p151l414M258J3809O481J598K137j8243r660r271l399
10669A5148N834o525m368R068M974Q635K090j3188m993M627N053K761L234J787
10655C4137P308k590j7322j251N604K299m569J249Q708K030O21j1819n559l874
10641A4972K781M792M4k80L056j466l431n606J972J0959J3201J2916j757j0724
10627D1429o975k175J780j6841n578M369J0006M741j1259o881J787M943R314j396
10613B7264j1747J041K152J453J0860J3022J497q50r520p708L777n90l322o240
10599B1089m107l231M819P310m044k303m190r955j032n815M201N643l438o578
$$ plain form
10585 -1631 -1506 1680 8413 9033 4609 31 -5788 -4517 -4724 120 -2828 -1522 6411 19304 23186
10570 23186 18439 13396 6986 3935 719 -2691 -8709 -15600 -11697 -2395 15577 23753 42467 51924
10556 51924 51708 31826 23520 12895 1355 8745 15124 14116 15345 14374 11026 9617 20463 24110
10542 24110 24266 22571 16492 10592 12987 15977 20250 23349 23957 22520 28077 21149 13489 4483 -4578
10527 -4578 1494 -4320 -882 1055 -873 4522 16148 24200 24480 26533 23780 24575 31502 40852 51768
10512 51768 51801 65111 95491 137159 206264 317561 505812 823803 1268342 1570033 1557284
10501 1557284 1200952 768671 476743 310271 218618 157223 125098 94388 84716 81148 85054
10490 85054 83996 73859 60708 47965 42779 42238 38904 26875 26843 36550 31304 27152 20090 19059
$$ packed form
10585a631J25L186O733O20m424m578n819J271k07M844k948J306P933J2893L882
10570B3186m747n043o410l051l216l410o018o891L903R302J7972Q176J8714R457
10556E1924k16j9882q306j0625j1540P390O379j008J229r71l348j409J0846L647
10542B4110J56j695o079n900K395K990M273L099O08j437N557o928p660r006r061
10527d578O072n814L438J937j928N395J1626Q052K80K053k753P95O927R350J0916
10512E1768L3J3310L0380M1668O9105J11297J88251L17991M44539L01691j2749
10501A557284l56332m32281k91928j66472r1653o1395l2125l0710r672l568L906
10490H5054j058j0137j3151j2743n186n41l334j2029l2R707n246m152p062j031
$$ plain form
10476 19059 14593 13045 14541 18574 21016 19914 18055 23243 18251 23139 25173 22191 23361 16413
10462 16413 15854 16999 14623 17728 13501 18099 21840 15553 4892 -2883 5138 12419 6854 -2483
10448 -2483 -10399 -13682 -13716 -9836 -11679 -7528 2396 11380 17915 12908 11150 441 -4575 -6192 -6059
10433 -6059 -7745 2483 -285 10730 13776 3196 -2869 -4395 204 10600 18959 9727 2778 1025
10419 1025 8734 15393 23263 23135 19135 16529 5875 6604 19271 20772 18710 3880 -2709 2441
10405 2441 4277 -2964 309 -5276 -10517 -17326 -537 -1487 -12462 -7291 -2367 4071 2151 -6774
10391 -6774 -14588 -22244 -14362 -14377 -21152 -24136 -20935 -12526 -1172 8126 4720 6612 1798 -7669 -4905
10376 -4905 5876 11078 2980 4686 8746 -930 -14625 -13290 -11454 -1477 3292 1777 5810 3149
$$ packed form
10476A9059m466j548J496M033K442j102j859N188m992M888K034k982J170o948
10462A6413n59J145k376L105m227M598L741o287j0661p775Q021P281n565r337
10448b483p916l283l4L880j843M151R924Q984O535n007j758j0709n016j617J33
10433f059j686J0228k768J1015L046j0580o065j526M599J0396Q359r232o949j753
10419A025P709O659P870j28m000k606j0654P29J2667J501k062j4830o589N150
10405B441J836p241L273n585n241o809J6789r50j0975N171M924O438j920q925
10391f774p814p656P882j5o775k984L201Q409J1354R298l406J892m814r467K764
10376d905J0781N202q098J706M060r676j3695J335J836R977M769j515M033k661
$$ plain form
10362 3149 -1945 -5749 -2378 -1269 -9240 -7359 5677 -7141 -12748 -5381 -10831 -17293 -13614 -4400
10348 -4400 -3121 -10358 -12569 -4196 -2201 4037 11743 5765 3319 1134 4670 12758 13947 5836 -8375
10333 -8375 -10435 3901 6003 -502 2193 13113 17025 15372 -4895 -15140 -11967 -3786 -1131 -5144
10319 -5144 1916 14391 12653 -191 2014 1371 6669 10126 8622 -1837 -6725 -5735 -3752 7843
10305 7843 16486 21375 6601 -7842 -8456 -5696 -8146 934 8840 15756 16151 17181 13932 5221 6881
10290 6881 -3408 -6982 -8485 -10187 -114 31 3873 4177 8661 9186 4106 4104 7367 10685 13803 15402
10274 15402 11490 5423 4090 3627 8853 2459 -10937 -14883 -9900 858 8935 5789 -3501 -7399
10260 -7399 -8106 1801 8939 10655 9590 12607 3887 2870 4237 13683 23141 17394 2962 -1531 -4716
$$ packed form
10362C149n094l804L371J109p971J881J3036j2818n607P367n450o462L679R214
10348d400J279p237k211Q373J995O238P706n978k446k185L536Q088J189q111j4211
10333h375k060J4336K102o505K695J0920L912j653k0267j0245L173Q181K655m013
10319e144P060J2475j738j2844K205o43N298L457j504j0459m888R90J983J1595
10305G843Q643M889j4774j4443o14K760k450R080P906O916L95J030l249q711J660
10290F881j0289l574j503j702J0073J45L842L04M484N25n080kL263L318L118J599
10274A5402l912o067j333m63N226o394j3396l946M983J0758Q077l146r290l898
10260g399p07R907P138J716j065L017q720j017J367R446R458n747j4432m493l185
$$ plain form
10245 -4716 -15598 -20986 -11024 -1133 -2702 6362 5852 13933 15021 5041 4566 -1013 -450 675 4481
10230 4481 4661 2772 -12395 -12334 -8635 -7105 467 -6092 -7678 -13411 -21544 -16183 -4491 -2539 -6788
10215 -6788 -12390 -12328 -13619 -11401 -5632 -193 1819 3368 2450 2776 2741 2614 5471 9998 11497 1327
10199 1327 4648 5927 -4174 -14248 -9783 -14774 -26275 -28282 -17334 -13547 -6410 5473 4669 -3784
10185 -3784 -6416 2954 4939 9842 11956 5332 -1473 -6289 -7708 -16142 -12418 -4027 -1446 -6412 -11965
10170 -11965 -6309 -951 -7937 -9986 -5320 -6125 -6760 -9158 -6785 -8972 -8807 -7239 2304 11272 6710
10155 6710 -1772 -13296 -13941 -9930 -2608 12167 17927 19719 22251 17563 10284 6636 3373 1063
10141 1063 -5898 -7879 2054 9457 14359 16941 13827 5654 -1051 309 4357 9542 16070 7625 1160
$$ packed form
10245d716j0882n388R962R891j569R064n10Q081J088r980m75n579N63J125L806
10230D481J80j889j5167O1L699J530P572o559j586n733q133N361J1692J952m249
10215f788n602O2j291K218N769N439K012J549r18L26l5j27K857M527J499j0170
10199A327L321J279j0101j0074M465m991j1501k007J0948L787P137J1883q04q453
10185c784k632R370J985M903K114o624o805m816j419q434L724Q391K581m966n553
10170a1965N656N358o986k049M666q05o35k398K373k187J65J568R543Q968m562
10155F710q482j1524o45M011P322J4775N760J792K532m688p279l648l263k310
10141A063o961j981R933P403M902K582l114q173o705J360M048N185O528q445o465
$$ plain form
10126 1160 -8182 -6387 -5106 -9689 -12818 -8237 -6269 -6015 296 9290 -944 -4457 7499 9520
10112 9520 5776 7466 2804 -4786 -8700 -13987 -12219 -3589 -529 8174 8317 5874 3512 -4032 1408
10097 1408 3069 -6398 -9027 -9295 -12838 -7328 1075 -2659 -9034 -7712 -3131 -11137 -4836 -7318 -8099
10082 -8099 -10126 -16736 -21632 -28718 -16208 -10971 -7809 4598 20674 20599 8917 1146 10071 12525
10068 12525 3410 2647 6298 12933 18396 14189 6985 -7368 -9866 5155 10614 13226 7823 4998
10054 4998 1968 8981 7401 9624 11694 17055 13113 -1086 -7185 -4239 -3913 -7366 -7276 8024 10484
10039 10484 17525 20188 20397 1151 1323 4495 10797 12685 5585 -3828 -21459 -27882 -21705 -7956
10025 -7956 -6923 -724 3186 11035 5904 5181 4709 -2469 3445 3556 4180 -4088 -510 1620 7764 921
$$ packed form
10126A160r342J795J281m583l129M581J968K54O311Q994j0234l513J1956K021
10112I520l744J690m662p590l914n287J768Q630L060Q703J43k443k362p544N440
10097A408J661r467k629k68l543N510Q403l734o375J322M581q006O301k482p81
10082h099k027o610m896p086J2510N237L162J2407J6076p5j1682p771Q925K454
10068A2525r115p63L651O635N463m207p204j4353k498J5021N459K612n403k825
10054D998l030P013j580K223K070N361l942j4199o099K946L26l453R0J5300K460
10039A0484P041K663K09j9246J72L172O302J888p100r413j7631o423O177J3749
10025g956J033O199L910P849n131p23m72p178N914J11O24q268L578K130O144o843
$$ plain form
10009 921 -4868 -6624 -9210 -13431 -10266 -17054 -14283 -14356 -8386 1483 2728 4618 7167 1763 4277
9994 4277 9232 9350 11071 5423 4133 5888 10511 2602 -91 -2814 5313 -302 -8290 -5320 -6965
9979 -6965 -10964 -12862 -9956 -5521 -4311 1038 2859 3280 3324 -1369 -803 -2864 619 1051 -5744 -3048
9963 -3048 -4816 -9531 -3226 -4854 -8422 -8791 -8246 -1782 -5776 -15228 -24201 -16361 -13196 -3715 12922
9948 12922 15040 8186 4291 13273 13037 12282 12596 6369 12251 17676 17547 13489 2148 21 -11491
9933 -11491 -19114 -24615 -20600 -14572 -14748 -14834 -22042 -17205 -6608 2924 -3284 -13209 -8207 -3173 -1042
9918 -1042 -4329 -826 -5684 -4004 -2962 -10940 -5567 4323 16475 13785 5398 7338 8426 21269
9904 21269 25038 20002 8545 -2785 -8786 517 -2833 -7142 -3222 3906 3635 5310 5733 4853 -529
$$ packed form
10009I21n789j756k586m221L165o788K771p3N970R869J245J890K549n404K514
9994D277M955J18J721n648j290J755M623p909k693k723Q127n615p988K970j645
9979f965l999j898K906M435J210N349J821M21M4m693N66k061L483M32o795K696
9963c048j768m715O305j628l568l69N45O464l994r452q973P840L165R481J6637
9948A2922K118o854l895Q982k36p55L14o227N882N425j29m058j1341k127j1512
9933a1491p623n501M015O028j76q6p208M837J0597R532o208r925N002N034K131
9918a042l287L503m858J680J042p978N373R890J2152k690q387J940J088J2843
9904B1269L769n036j1457j1330o001R303l350m309L920P128k71J675M23q80n382
$$ plain form
9889 -529 -5807 -15339 -12141 -11253 -6547 4282 7661 3962 6314 4698 5534 3290 4428 -1303 -7817
9874 -7817 -4896 3090 -2332 -877 1499 5415 12529 18365 24416 24547 4908 -1696 -5098 -1941 6022
9859 6022 1257 1589 6812 11810 14854 13142 17099 15942 15612 16199 19113 14253 11334 14564 3992
9844 3992 -978 3523 7935 9605 9739 17936 14182 8355 229 -3190 -9038 -8323 -4184 7180 4220
9829 4220 1445 5168 3796 6461 12776 7307 6911 13721 16687 18853 12954 -3830 -9975 -11332 -7569
9814 -7569 -922 -3588 -9175 -1269 1927 6237 7694 8394 20983 20526 17712 11028 -7411 -10617 -10922
9799 -10922 -13519 -5878 1913 -1244 -7067 -5057 138 9424 8887 10182 9368 7190 14059 19514 6913
9784 6913 2180 4914 1070 -4397 -3848 -6228 -5430 -7121 -3715 -8933 -7130 -6561 -2018 -5644 2124 -2036
$$ packed form
9889e29n278r532L198Q88M706J0829L379l699K352j616Q36k244J138n731o514
9874g817K921P986n422J455K376L916P114N836O051J31j9639o604l402L157P963
9859F022m765L32N223M998L044j712L957j157l30N87K914m860k919L230j0572
9844C992m970M501M412J670J34Q197l754n827q126l419n848P15M139J1364k960
9829D220k775L723j372K665O315n469l96O810K966K166n899j6784o145j357L763
9814g569O647k666n587P906L196M310J457P00J2589m57k814o684j8439l206l05
9799a0922k597P641P791l157n823K010N195R286n37J295q14k178O869N455j2601
9784F913m733K734l844n467N49k380P98j691L406n218J803N69M543l626P768m160
$$ plain form
9768 -2036 -15029 -13177 -15390 -15343 -2738 6624 10446 11115 15823 15704 10158 12827 6273 2005 -2961
9753 -2961 -6345 -5066 -5379 -13103 -13272 -12447 2172 9262 10598 11345 16352 16457 18666 16401 18406 13679
9737 13679 7686 -1911 6050 11739 9040 7802 3563 449 4509 1519 -5194 -4170 -1479 -4726 -8177
9722 -8177 -15253 -9487 4761 4101 8980 10263 4619 -3682 -11733 -12376 -14179 -9421 -3173 -7341 -14203
9707 -14203 -20080 -19851 -15085 -5134 -2868 -1161 -6461 -7858 -9361 -7938 -12757 -10301 -12591 -15785 -18891
9692 -18891 -14258 58 11426 9188 -2115 -11840 -5860 2679 -3411 -4695 -13047 -13884 -17399 -14684
9678 -14684 -9756 563 4830 5596 8596 11158 10269 9484 8030 6220 -1476 489 8641 16251 9365
9663 9365 4246 10738 11968 6396 6630 7111 6396 7541 6224 1062 5976 14743 7726 2495 3571 -5496
$$ packed form
9768b036j2993J852k213M7J2605R362L822O69M708j19n546K669o554m268m966
9753b961l384J279l13p724j69Q25J4619P090J336P47N007J05K209k265K005m727
9737A3679n993r597P961N689k699j238m239l114M060k990o713J024K691l247l451
9722h177p076N766J4248o60M879J283n644q301q051o43j803M758O248m168o862
9707a4203n877K29M766R951K266J707n300j397j503J423m819K456k290l194l106
9692a8891M633J4316J1368k238j1303r725N980Q539o090j284q352q37l515K715
9678a4684M928J0319M267P66L000K562q89p85j454j810p696J965Q152P610o886
9663I365n119O492J230n572K34M81p15J145j317n162M914Q767p017n231J076r067
$$ plain form
9647 -5496 -8458 -4118 4511 1673 4360 584 -8003 -14855 -427 14088 22801 27075 26419 8199
9633 8199 2624 9879 5635 10954 7565 -108 -5829 -2153 2046 5529 -1716 -7666 -12321 -19814 -19627
9618 -19627 -12622 -1828 -7051 -11901 -9116 -7419 -4960 -9392 -12011 -13329 -8058 -3022 4637 -1544
9604 -1544 -3641 5758 6480 7486 5049 10734 18171 6341 1833 1112 8158 4222 -1268 1937 9985
9589 9985 7155 3040 4063 5679 1568 842 -4305 -7632 -6161 -3013 -2217 -6902 -4450 -8374 -6125
9574 -6125 -4859 -311 -7316 -9429 -7551 -5870 -11695 -21651 -14185 -13288 -18673 -10914 -9627 -8129 -11649
9559 -11649 -8398 647 6753 10536 600 936 16363 20264 10796 9529 547 -1975 2751 7964 5599
9544 5599 1910 3844 6909 -3416 -10463 -11292 -7908 -7961 -504 4863 921 -3618 -8308 -10831 -2858
$$ packed form
9647e496k962M340Q629k838K687l776q587o852J4428J4515Q713M274o56j8220
9633H199n575P255m244N319l389p673n721L676M199L483p245n950m655p493J87
9618a9627P005J0794n223m850K785J697K459m432k619j318N271N036P659o181
9604a544k097R399P22J006k437N685P437j1830m508p21P046l936n490L205Q048
9589I985k830m115J023J616m111p26n147l327J471L148P96m685K452l924K249
9574f125J266M548p005k113J878J681n825r956P466Q97n385P759J287J498l520
9559a1649L251R045O106L783r936L36J5427L901r468j267q982k522M726N213k365
9544E599l689J934L065j0325p047q29L384n3P457N367l942m539m690k523P973
$$ plain form
9529 -2858 4667 12085 9264 7417 4054 -5435 -7017 -1623 11900 13915 7421 4140 -588 -2587 4337
9514 4337 2151 1367 2412 1631 -12739 -10328 1275 -949 -12050 -13957 -6110 2238 8654 7105 284
9499 284 881 9125 22770 21271 17052 23148 14672 4897 -4709 -8374 -8583 -11354 -3290 4534 5502 2998
9483 2998 1907 5767 13020 17776 20089 20184 14710 6561 -2310 2403 -2577 -6451 -8478 -15946 -18573
9468 -18573 -8325 -8466 -5473 -2680 -2847 276 -9849 -6404 2431 10526 7003 2226 5592 687 -8390
9453 -8390 -1357 8296 6694 10487 6910 1697 -653 -4153 -9557 -13866 -3700 6704 4607 6819
9439 6819 4388 484 -7578 -12716 -12924 -9237 -6204 -2363 1785 871 2242 1651 -282 2631 13321
9424 13321 13887 235 -5776 4297 11855 11986 -3423 -5227 1942 -66 3832 9809 7328 1808
$$ packed form
9529b858P525P418k821j847l363r489j582N394J3523K015o494l281m728j999O924
9514D337k186p84J045p81j4370K411J1603k224j1101j907P847Q348O416j549o821
9499B84N97Q244J3645j499m219O096q476r775r606l665k09k771Q064P824R68k504
9483B998j091L860P253M756K313R5n474q149q871M713m980l874k027p468k627
9468a8573J0248j41K993K793j67L123j0125L445Q835Q095l523m777L366m905r077
9453h390P033R653j602L793l577n213k350l500n404m309J0166J0404k097K212
9439F819k431l904q062n138k08L687L033L841M148r14J371n91j933K913J0690
9424A3321N66j3652o011J0073P558J31j5409j804P169k008L898N977k481n520
$$ plain form
9410 1808 3810 6757 -1096 -10501 -11967 -9431 -2047 8999 12280 10464 -4136 4720 9417 16950
9396 16950 17135 17922 18903 7683 -3383 -6879 874 2442 -1927 -3121 -1014 -4947 1447 7868 12296
9381 12296 10759 1727 -6531 -4613 -12483 -16783 -8797 -2572 5349 5380 4224 9570 15398 19381 12754
9366 12754 8766 1471 4783 6349 14306 18660 8930 -475 1134 2008 1004 -11643 -16172 -10275 -8562
9351 -8562 1450 5745 2426 5258 1706 -4741 2305 15251 10988 5267 -1079 -7120 -6984 -5515 7484
9336 7484 9733 3284 2271 769 8287 12493 7973 360 1614 5239 975 4911 3656 6185 -1958
9321 -1958 -16125 -19375 -6345 10892 22888 23024 16430 10698 4833 250 6145 422 -5037 -5259
9307 -5259 -687 4798 3111 4182 10738 11784 16274 26369 27996 14068 13249 11587 11684 12638 13394 20365
$$ packed form
9410A808K002K947p853r405j466K536P384J1046L281j816j4600Q856M697P533
9396A6950J85P87R81j1220j1066l496P753J568m369j194K107l933O394O421M428
9381A2296j537r032q258J918p870m300P986O225P921L1j156N346N828L983o627
9366A2754l988p295L312J566P957M354r730r405J609Q74j004j2647m529N897J713
9351h562J0012M295l319K832l552o447P046J2946m263n721o346o041J36J469J2999
9336G484K249o449j013j502P518M206m520p613J254L625m264L936j255K529q143
9321a958j4167l250J3030J7237J1996J36o594n732n865m583N895n723n459k22
9307e259M572N485j687J071O556J046M490J0095J627j3928q19j662R7R54P56O971
$$ plain form
9291 20365 23074 31736 33170 22642 13431 6586 5486 11375 20096 26347 35174 36787 23899 17851
9277 17851 12692 10532 12993 16305 18290 16370 18229 21170 21527 25008 22419 20641 22557 20657 23415
9262 23415 30049 24194 17631 24039 28816 32789 34728 30539 22024 25649 30236 29252 21253 27330 35414
9247 35414 37723 27898 28172 34860 31332 20520 18065 28225 34237 33701 28133 28894 40023 33142 38952
9232 38952 52537 52293 39478 37650 42270 39507 44456 50585 53932 47800 36550 31009 32186 36186
9218 36186 44910 46440 43111 42260 45835 54834 70177 73935 72711 59550 57231 63776 75700 84349
9204 84349 68316 54959 46575 46266 48993 60135 68168 76354 75996 76845 71003 69701 68487 70049 69273
9189 69273 77752 92781 85461 79720 89247 101422 103774 108965 103962 103056 115370 117910 116924 111527
$$ packed form
9291B0365K709Q662J434j0528r211o845j100N889Q721O251Q827J613j2888o048
9277A7851n159k160K461L312J985j920J859K941L57L481k589j778J916j900K758
9262B3415O634n855o563O408M777L973J939m189q515L625M587r84p999O077Q084
9247C5414K309r825K74O688l528j0812k455J0160O012n36n568P61J1129o881N810
9232C8952J3585k44j2815j828M620k763M949O129L347o132j1250n541J177M000
9218C6186Q724J530l329q51L575Q999J5343L758j224j3161k319O545J1924Q649
9204H4349j6033j3357q384l09K727J1142Q033Q186l58Q49n842j302j214J562p76
9189F9273Q479J5029p320n741R527J2175K352N191n003r06J2314K540r86n397
$$ plain form
9175 111527 110466 109963 111153 113502 125772 136434 144539 148206 152968 160134 179171 192008 194693 183428
9161 183428 186296 199054 216115 219102 232574 248295 260120 267515 270434 281752 301301 325488
9149 325488 330433 348503 372385 379403 400165 420839 446497 473278 504128 529932 558140 586619
9137 586619 620196 661641 694271 723132 753790 798539 848205 889306 935869 976115 1012839 1058815
9125 1058815 1104763 1140989 1173057 1188242 1201949 1213831 1223971 1225004 1215598 1193460 1167081 1140553
9113 1140553 1100918 1057461 1029404 992882 952587 908419 867530 834987 787615 740771 703207
9102 703207 669823 626130 584286 550429 522159 501054 479353 455625 436426 415023 396062 369679
9090 369679 345831 328185 309239 285136 268948 267943 258377 229798 219998 216934 209490 204990 198080
$$ packed form
9175A11527j061n03J190K349J2270J0662Q105L667M762P166J9037J2837K685j1265
9161A83428K868J2758J7061K987J3472J5721J1825P395K919J1318J9549K4187
9149C25488M945J8070K3882P018K0762K0674K5658K6781L0850K5804K8208K8479
9137E86619L3577M1445L2630K8861L0658M4749M9666M1101M6563M0246L6724M5976
9125A058815M5948L6226L2068J5185J3707J1882J0140J033r406k2138k6379k6528
9113A140553l9635m3457k8057l6522m0295m4168m0889l2543m7372m6844l7564
9102G03207l3384m3693m1844l3857k8270k1105k1701k3728j9199k1403j8961k6383
9090C69679k3848j7646j8946k4103j6188j005r566k8579r800l064p444m500o910
$$ plain form
9077 198080 182863 172714 169487 177900 178579 166764 157405 147386 135759 129284 118819 112072 107610
9064 107610 100197 102307 111754 112387 101895 107523 109093 109780 114600 117567 105275 97563 94220 93969 88758
9049 88758 78764 67276 64384 62423 68962 70334 69868 73121 74870 69433 57947 54908 54449 52261 51109
9034 51109 55727 52548 52516 43885 47637 48233 40753 39517 43657 43587 46137 44608 44954 50267 39535 32741
9018 32741 28121 23624 24966 23872 42921 48087 30950 17399 14016 19645 26429 29898 28990 34755
9004 34755 40279 35852 33240 34711 31285 26721 25515 23690 24951 28142 33050 36121 33220 31801 23419
8989 23419 21566 22992 30157 32570 18423 11475 15174 18510 22569 25289 30254 29376 23263 27540 20433
8974 20433 10200 12761 18812 15661 13346 14390 17285 20547 19503 12679 12798 19245 17227 7534 4880
$$ packed form
9077A98080j5217j0149l227Q413O79j1815r359j0019j1627o475j0465o747m462
9064A07610p413K110R447O33j0492N628J570O87M820K967j2292p712l343k51n211
9049H8758r994j1488k892j961O539J372m66L253J749n437j1486l039m59k188j152
9034E1109M618l179l2q631L752N96p480j236M140p0K550j529L46N313j0732o794
9018C2741m620m497J342j094J9049N166j7137j3551l383N629O784L469r08N765
9004C4755N524m427k612J471l426m564j206j825J261L191M908L071k901j419q382
8989B3419j853J426P165K413j4147o948L699L336M059K720M965q78o113M277p107
8974B0433j0233K561O051l151k315J044K895L262j044o824J19O447k018r693k654
$$ plain form
8959 4880 8298 14126 18470 19584 6820 1305 2219 5807 9696 -1664 -13693 -6651 4303 3799
8945 3799 -2867 -12903 -9746 -1753 4798 10990 10823 6618 10026 10512 12129 14977 10022 17735 20596
8930 20596 17261 10331 11809 5271 4712 422 -10221 142 4058 648 -2244 -5607 -7128 1478
8916 1478 4953 4766 6922 11412 15364 14468 15129 7091 -3654 -3672 -11445 -8893 1288 1681 -598 6611
8900 6611 9931 9269 8445 8288 6826 10787 12602 22014 37052 51221 49996 43823 25555 9761 5319
8885 5319 10036 9728 6783 3085 8192 14406 9900 10145 16467 13033 6644 -1452 6376 12913 5835
8870 5835 9110 11649 4411 -3828 -8971 -8742 -6437 -858 7294 8976 3125 -7126 -10964 -2287 10972
8855 10972 14543 16760 7166 3784 9501 9784 5901 1619 5396 3455 3941 379 -4263 -2884 7208
$$ packed form
8959D880L418N828M344J114j2764n515R14L588L889j1360j2029P042J0954n04
8945C799o666j0036L157P993O551O192j67m205L408M86J617K848m955P713K861
8930B0596l335o930J478o538n59m290j0643J0363L916l410k892l363j521Q606
8916A478L475j87K156M490L952q96O61q038j0745j8p773K552J0181L93k279P209
8900F611L320o62q24j57j462L961J815R412J5038J4169j225o173j8268j5794m442
8885E319M717l08k945l698N107O214m506K45O322l434o389q096P828O537p078
8870E835L275K539p238q239n143K29K305N579Q152J682n851j0251l838Q677J3259
8855A0972L571K217r594l382N717K83l883m282L777j941M86l562m642J379J0092
$$ plain form
8840 7208 14624 11931 -2039 -4541 -8226 -18717 -16336 -7755 -2499 6578 9051 10797 8993 10884
8826 10884 15804 10334 7189 5301 7739 9873 14089 14593 8061 3370 7180 21407 22632 21192 6299
8811 6299 3027 4392 -416 -5996 -6618 -8628 -9685 -8161 -7637 -961 8639 16562 14251 3726 -1038
8796 -1038 -1265 3327 7689 5732 -333 10170 12881 8840 8277 10141 12294 5456 10262 23093 23340
8781 23340 19860 6937 740 5229 11103 9392 6778 10748 6818 8822 8169 820 1897 5241 9533
8766 9533 11741 11655 7406 775 1477 1351 -262 1220 -2473 -3677 721 -1828 -6457 -4295 -6446 2380
8750 2380 13025 11021 8728 12904 15904 18924 21028 19211 14235 18991 18956 12012 8136 3234 -6636
8735 -6636 -6269 5650 6945 11875 10585 5864 2249 4628 -1727 6895 4362 8485 8726 3897 -4008
$$ packed form
8840G208P416k693j3970k502l685j0491K381Q581N256R077K473J746j804J891
8826A0884M920n470l145j888K438K134M216N04o532m691L810J4227J225j440j4893
8811F299l272J365m808n580o22k010j057J524N24O676R600P923k311j0525m764
8796a038k27M592M362j957o065J0503K711m041n63J864K153o838M806J2831K47
8781B3340l480j2923o197M489N874j711k614L970l930K004o53p349J077L344M292
8766I533K208q6m249o631P02j26j613J482l693j204M398k549m629K162k151Q826
8750B380J0645k004k293M176L000L020K104j817m976M756l5o944l876m902r870
8735f636L67J1919J295M930j290m721l615K379o355Q622k533M123K41m829p905
$$ plain form
8720 -4008 -8814 -2759 11801 9816 5280 292 -2402 4079 10685 13898 -1374 -8179 -4036 1657
8706 1657 3808 7900 15323 14989 10888 8075 16433 26986 26593 20359 7012 3922 6076 7499 7288
8691 7288 1093 -7966 -2400 5461 -7711 -2413 6715 12750 16375 23620 13124 4638 7200 -1738
8677 -1738 -2402 4649 5862 6441 9760 11398 6132 1436 -4372 -1746 207 1752 3854 9951 13408
8662 13408 9074 14332 10086 21978 28139 19926 11163 11433 12659 18190 22676 16419 20572 29513 22380
8647 22380 21156 20021 15766 13484 12228 17124 16517 9922 24322 22833 27252 21871 24210 25961 23681
8632 23681 22143 26563 24229 20154 29335 32342 37172 46124 45801 42290 44948 45575 45903 47500 60532
8617 60532 64435 61657 64481 65191 63711 57225 44118 46037 53057 52456 54515 47658 39982 28574 24683
$$ packed form
8720d008m806O055J4560j985m536m988k694O481O606L213j5272o805M143N693
8706A657K151M092P423l34m101k813Q358J0553l93o234j3347l090K154J423k11
8691G288o195r059N566P861j3172N298R128O035L625P245j0496q486K562q938
8677a738o64P051J213N79L319J638n266m696n808K626J953J545K102O097L457
8662A3408m334N258m246J1892O161q213q763K70J226N531M486o257M153Q941p133
8647B2380j224j135m255k282j256M896o07o595J4400j489M419n381K339J751k280
8632B3681j538M420k334m075R181L007M830Q952l23l511K658O27L28J597J3032
8617F0532L903k778K824P10j480o486j3107J919P020o01K059o857p676j1408l891
$$ plain form
8602 24683 24578 25279 30754 28094 13851 4076 1659 1621 12536 19026 23106 19515 16447 13732 15329
8587 15329 13993 4511 5204 6882 15332 23865 28703 21248 8912 11975 4712 763 9492 18434 19481
8572 19481 15744 1061 -1745 2493 5898 1012 -2120 1701 3151 -3860 -9171 -1249 6817 15077
8558 15077 18737 12108 6252 15020 12561 12717 6795 4571 11209 4910 3652 5949 10409 19641 21293
8543 21293 23728 24418 18969 14122 8565 7337 12951 15572 10802 14758 6714 5224 15025 15062 10180
8528 10180 11126 16562 7512 -1997 8275 13828 9835 13916 9824 4073 6070 4109 7030 11944 6261
8513 6261 8179 5509 2590 11247 10880 10142 14621 14800 13608 -855 -1424 -9611 -15885 -14278 4525
8498 4525 5674 3945 18099 17705 19112 14698 3804 -3906 -2571 2760 1390 -1167 -1525 17 -2240
$$ packed form
8602B4683j05P01N475k660j4243r775k417l8J0915O490M080l591l068k715J597
8587A5329j336r482O93J678Q450Q533M838p455j2336L063p263l949Q729Q942J047
8572A9481l737j4683k806M238L405m886l132L821J450p011n311P922Q066Q260
8558A5077L660o629n856Q768k459J56n922k224O638o299j258K297M460R232J652
8543B1293K435O90n449m847n557j228N614K621m770L956q044j490R801L7m882
8528A0180R46N436r050r509J0272N553l993M081m092n751J997j961K921M914n683
8513F261J918k670k919Q657l67p38M479J79j192j4463n69q187o274J607J8803
8498D525J149j729J4154l94J407m414j0894p710J335N331j370k557l58J542k257
$$ plain form
8483 -2240 2095 370 -3792 -10428 -10328 -3033 597 -139 -13751 -17676 -5914 4729 7060 2757 -5625
8468 -5625 -7240 -622 698 1229 -5495 3011 5877 4720 2010 -1196 -668 874 5984 16222 17113
8453 17113 14339 10606 5655 13541 21886 27375 15328 -3892 2812 11586 3578 -3181 1913 5509
8439 5509 6051 6561 5523 2410 6191 4531 3747 -554 -1939 8481 15341 7993 9315 2092 -224
8424 -224 2374 -8993 -16166 -20030 -17692 -19143 -6394 1983 -5770 -3440 -197 -7314 -10866 605
8410 605 3515 -4324 -10130 -16472 -12283 -6467 -6786 -1316 -6273 -2377 7498 4842 2639 7030 1607
8395 1607 4345 7212 12786 10386 1056 -9792 -13673 -8652 -6256 -5038 -3804 -317 8582 162 -2026
8380 -2026 695 -1175 -2584 -8744 -1988 4906 4977 2988 6274 12631 14896 10046 5619 -3682 -6335
$$ packed form
8483b240M335j725m162o636J00P295L630p36j3612l925J1762J0643K331m303q382
8468e625j615O618J320N31o724Q506K866j157k710l206N28J542N110J0238Q91
8453A7113k774l733m951P886Q345N489j2047j9220O704Q774q008o759N094L596
8439E509N42N10j038l113L781j660p84m301j385J0420O860p348J322p223k316
8424b24K598j1367p173l864K338j451J2749Q377p753K330L243p117l552J1471
8410F05K910p839n806o342M189N816l19N470m957L896R875k656k203M391n423
8395A607K738K867N574k400r330j0848l881N021K396J218J234L487Q899q420k188
8380b026K721j870j409o160O756O894P1j989L286O357K265m850m427r301k653
$$ plain form
8365 -6335 -12877 -7867 -1490 1221 -831 3130 -235 5055 -1252 -7229 -9333 -9182 -6511 -486 2151
8350 2151 6174 4146 959 3636 7696 691 -4134 5908 4876 -114 4127 4048 1973 23 3955
8335 3955 7640 4128 -5782 -8866 -8930 -4779 -5797 -9248 -689 13831 13345 3189 2364 -7267 -16397
8320 -16397 -17338 -21074 -18528 -14218 -14356 -12476 -11445 3623 -5508 -15956 -7376 3103 -3994 -9865
8306 -9865 -11919 -16172 -9125 -1145 3075 6824 6848 1507 -1085 6480 9459 22236 26053 20958 15262
8291 15262 19247 12085 3420 6873 15555 13384 16230 15224 15031 12790 7740 4406 4835 722 -2275
8276 -2275 589 4734 1220 -2927 -5936 -4523 -6641 -8553 -7571 -3275 7785 14827 20403 25163 28224
8261 28224 23371 18898 20427 16482 9231 14848 17448 10839 7585 3366 -9145 -10977 -169 13751
$$ packed form
8365f335o542N010O377K711k052L961l365N290o307n977k104J51K671O025K637
8350B151M023k028l187K677M060p005m825J0042j032m990M241p9k075j950L932
8335C955L685l512r910l084o4M151j018l451Q559J4520m86j0156q25r631r130
8320a6397r41l736K546M310j38J880J031J5068r131j0448Q580J0479p097n871
8306i865k054m253P047P980M220L749K4n341k592P565K979J2777L817n095n696
8291A5262L985p162q665L453Q682k171K846j006j93k241n050l334M29m113k997
8276b275K864M145l514m147l009J413k118j912R82M296J1060P042N576M760L061
8261B8224m853m473J529l945p251N617K600o609l254m219j2511j832J0808J3920
$$ plain form
8247 13751 20432 11151 6346 2293 -2392 -8376 25 9207 5956 -4077 -9677 -12384 -2365 9859
8233 9859 9562 4771 2396 12446 24731 27347 19217 11393 4309 12322 15055 10126 -1337 -1485 2492
8218 2492 21043 29299 19806 9114 -1159 981 -918 1469 554 9396 9930 9469 7120 5820 10217
8203 10217 11265 11972 1948 2357 7100 13106 11314 3830 -6033 -12343 -10369 -11667 -14397 -7903 -10294
8188 -10294 -7880 -8453 -8788 -11535 -11600 -14410 -17673 -10540 -1791 6419 14285 16999 7920 -1607 -3300 -3683
8172 -3683 -3007 -874 2800 8946 14997 6375 161 -4598 -1991 7321 7957 6946 4879 -3098 -12169
8157 -12169 -9834 -1116 -6274 -11916 -7959 -4182 5547 6103 4324 -5997 -3043 5045 1147 580 -2072
8142 -2072 1344 -3271 -9861 -8458 -7772 -1114 5902 -3526 -18025 -14934 -10506 -864 -4377 -5556 -1797
$$ packed form
8247A3751O681r281m805m053m685n984Q401R182l251j0033n600k707J0019J2224
8233I859k97m791k375J0050J2285K616q130p824p084Q013K733m929j1463j48L977
8218B492J8551Q256r493j0692j0273K140j899K387r15Q842N34m61k349j300M397
8203A0217J048P07j0024M09M743O006j792p484r863o310J974j298k730O494k391
8188a0294K414n73l35k747o5k810l263P133Q749Q210P866K714r079r527j693l83
8172c683O76K133L674O146O051q622o214m759K607R312O36j011k067p977r071
8157a2169K335Q718n158n642L957L777R729N56j779j0321K954Q088l898n67k652
8142b072L416m615o590J403O86O658P016r428j4499L091M428R642l513j179L759
$$ plain form
8127 -1797 9364 17723 15004 7109 11280 9554 3266 -3383 -6010 -6872 -1627 -2076 -2511 -3464 3688 2646
8111 2646 4053 -1169 -2378 -6620 -6352 7525 12273 4910 -6253 -3755 -473 1116 -6793 -8288 -5137
8096 -5137 -11537 -8853 1260 5531 6107 12808 16192 6273 -646 -5846 1396 12855 9708 8662 5548
8081 5548 13886 14663 9998 -2894 -4903 -1434 4492 12634 8672 4705 5669 -3251 -3276 -560 5023 6021
8065 6021 10399 2673 -1671 -2104 1258 4076 4489 4949 11473 10807 12843 8389 1799 -4933 5453 8366
8049 8366 4566 11905 12627 12149 9814 19066 17094 17750 11253 9664 11279 8421 17282 13964 7988 15879
8033 15879 23340 15928 15177 16936 15947 20263 17272 24549 28449 34029 28140 21533 24310 20480 23846
8018 23846 28801 28684 19947 17931 17715 25341 32549 34567 29811 19299 9977 16701 15561 1159 -11963
$$ packed form
8127a797J1161Q359k719p895M171j726o288o649k627q62N245m49m35r53P152j042
8111B646J407n222j209m242K68J3877M748p363j1163K498L282J589p909j495L151
8096e137o400K684J0113M271N76O701L384r919o919n200P242J1459l147j046l114
8081E548Q338P77m665j2892k009L469N926Q142l962l967R64q920k5K716N583R98
8065F021M378p726m344m33L362K818M13M60O524o66K036m454o590o732J0386K913
8049H366l800P339P22m78k335R252j972O56o497j589J615k858Q861l318n976P891
8033A5879P461p412p51J759r89M316k991P277L900N580n889o607K777l830L366
8018B3846M955j17q737k016k16P626P208K018m756j0512r322O724j140j4402j3122
$$ plain form
8003 -11963 -11084 -7377 -6000 -661 3328 2366 -6329 66 5283 2195 9864 17357 11187 6021 11821
7988 11821 14791 16479 6554 6447 9093 4825 5009 3805 14707 20764 18927 17324 7753 10719 10227
7973 10227 8612 10081 12421 12361 13127 12789 10761 12274 14695 13241 14137 8169 3007 11750 27919 37436
7957 37436 23734 16221 4302 4995 10492 17742 13330 20763 28352 21952 17870 19199 24230 19567
7943 19567 19408 20378 12917 11583 18449 20049 16522 14172 10441 14231 18561 22678 24250 15208 15027
7928 15027 13402 6949 5822 4523 10904 14381 4533 -2584 5242 13210 9197 13426 21896 22643 22233
7913 22233 8729 7359 -862 -2095 -914 3076 8198 10445 13409 11425 9402 2357 -474 8587
7899 8587 5700 11935 9381 10582 10012 8487 7983 3932 4338 1086 -1038 2656 10136 8734 6524 8969
$$ packed form
8003a1963Q79L707J377N339L989r62q695O395N217l088P669P493o170n166N800
7988A1821K970J688r925j07K646m268J84j204J0902O057j837j603r571K966m92
7973A0227j615J469K340o0P66l38k028J513K421j454Q96n968n162Q743J6169R517
7957C7436j3702p513j1919O93N497P250m412P433P589o400m082J329N031m663
7943A9567j59R70p461j334O866J600l527k350l731L790M330M117J572r042j81
7928A5027j625o453j127j299O381L477r848p117P826P968m013M229Q470P47m10
7913B2233j3504j370q221j233J181L990N122K247K964j984k023p045k831R061
7899H587k887O235k554J201n70j525n04m051M06l252k124L694P480j402k210K445
$$ plain form
7883 8969 2504 -4525 -19082 -18734 -15072 -7560 -8175 -11230 -11310 -8077 702 4871 6074 3561 15692
7868 15692 23934 27295 18147 10478 6459 8148 8519 8520 11948 15574 11923 3811 -3347 -2998 2840 9018
7852 9018 13540 18576 16225 18387 23236 21845 15257 11491 7594 13447 12432 9345 10560 14357 13096
7837 13096 2548 1880 -727 -1882 1475 -1877 -140 -2155 -11226 -7421 -13175 -12932 2772 9936 3090
7822 3090 5265 9290 1302 626 2929 173 -4622 -3363 2941 11818 22182 22680 15910 2614 -5202
7807 -5202 -9242 -4823 2010 5329 10691 18960 22876 19322 8455 -2988 -19827 -16649 -1324 703
7793 703 4566 6493 6814 -3234 -9482 -6119 249 6618 2288 -1718 -7296 -2401 1651 7048 1883
7778 1883 -2881 -6282 11450 11133 -2672 -6631 -4090 -7424 -13140 -9213 3050 3767 -1467 -11262 -11823
$$ packed form
7883H969o465p029j4557L48L662P512o15l055q0L233Q779M169J203k513J2131
7868A5692Q242L361r148p669m019J689L71JL428L626l651q112p158L49N838O178
7852I018M522N036k351K162M849j391o588l766l897N853j015l087J215L797j261
7837A3096j0548o68k607j155L357l352J737k015r071L805n754K43J5704P164o846
7822C090K175M025p988o76K303k756m795J259O304Q877J0364M98o770j3296p816
7807e202m040M419O833L319N362Q269L916l554j0867j1443j6839L178J5325K027
7793G03L863J927L21j0048o248L363O368O369m330m006n578M895M052N397n165
7778A883m764l401J7732l17j3805l959K541l334n716L927J2263P17n234r795n61
$$ plain form
7763 -11823 -1369 -6150 -17872 -23863 -20250 -4899 8837 13964 17975 9043 4847 -691 1109 3729
7749 3729 2027 2275 3783 3275 -1590 -2343 -430 -645 -3372 3765 -4248 -16939 -18342 -16582 -12917 -10082
7733 -10082 -9056 -8743 -6079 112 11053 3474 -4542 -296 4043 3931 4782 7101 7356 8476 7935 12568
7717 12568 7731 6305 9192 5227 7624 6976 -392 -5817 -3568 -806 -5036 -159 -564 -443 4547
7702 4547 13333 15083 12006 8790 7369 4438 -179 7401 11481 13574 14297 9594 7674 12504 15504
7687 15504 11811 7703 6388 632 -540 -4093 689 -596 -2826 -1994 8149 9711 7177 17 -501
7672 -501 3830 9300 7614 2520 -923 -4268 -12134 -24062 -21188 -17181 -15089 -2266 -2579 -1140 7671
7657 7671 8773 12931 13982 10789 3589 -3928 -3617 -1846 -2425 270 -8892 -6086 -5903 -19125 -24547
$$ packed form
7763a1823J0454m781j1722n991L613J5351J3736N127M011q932m196n538J800K620
7749C729j702K48J508n08m865p53J913k15k727P137q013j2691j403J760L665K835
7733a0082J026L13K664O191J0941p579q016M246M339j12Q51K319K55J120n41M633
7717A2568m837j426K887l965K397o48p368n425K249K762m230M877m05J21M990
7702D547Q786J750l077l216j421k931m617P580M080K093P23m703j920M830L000
7687A5504l693m108j315n756j172l553M782j285k230Q32J0143J562k534p160n18
7672e01M331N470j686n094l443l345p866j1928K874M007K092J2823l13J439Q811
7657G671J102M158J051l193p200p517L11J771n79K695r162K806J83j3222n422
$$ plain form
7642 -24547 -26178 -14851 -15680 -10072 -5241 -6306 -15101 -16505 -12573 -14413 -12528 -8328 -10620 -15685 -18247
7627 -18247 -14160 -4284 -3474 -2138 -4704 -3760 -4350 -422 5335 3103 5802 9818 8934 12060 10905 16138
7611 16138 13598 -6732 -22772 -17674 -15908 -8844 -5953 -14444 -20103 -19325 -13663 -10379 -19302 -12276
7597 -12276 -1382 -7128 -16918 -22393 -21073 -10506 3491 5575 12389 4900 -4686 -4072 4350 3643
7583 3643 -25 -6175 -16782 -18314 -6295 -4023 -10461 -15864 -11611 -5459 -6018 -4161 4436 13659 17093
7568 17093 11443 5181 -5096 4056 11978 7772 4609 -1785 -12640 -9299 4728 13717 10501 16352
7554 16352 18071 13897 8530 7116 -2104 3574 5742 8038 11629 -1357 -11434 -10847 -3860 -551
7540 -551 -11906 -11892 -11894 -18131 -17621 -12091 -14282 -17711 -3959 4357 -6496 -1181 -313 -7628 -7297 4364
$$ packed form
7642b4547j631J1327q29N608M831j065q795j404L932j840J885M200k292n065k562
7627a8247M087R876Q10J336k566R44n90L928N757k232K699M016q84L126j155N233
7611A6138k540k0330j6040N098J766P064K891q491n659P78N662L284q923P026
7597a2276J0894n746r790n475J320J0567J3997K084O814p489r586O14Q422p07
7583C643l668o150j0607j532J2019K272o438n403M253O152n59J857Q597R223L434
7568A7093n650o262j0277R152P922m206l163o394j0855L341J4027Q989l216N851
7554A6352J719m174n367j414r220N678K168K296L591j2986j0077N87O987L309
7540e51j1355J4ko237N10N530k191l429J3752Q316j0853N315Q68p315L31J1661
$$ plain form
7524 4364 4331 -35 4185 2718 -1134 -5160 -3734 -2676 -4779 -13316 -9771 -5303 955 2861 6124
7509 6124 -6344 -10027 -15889 -24154 -12900 -12376 -18457 -19698 -17200 -18398 -4346 3600 463 -2793
7495 -2793 -2008 -5157 -1287 3485 -1942 7071 10620 3108 -842 -2701 1276 6858 -3068 -2197 9031
7480 9031 11134 11236 5833 -2906 -5728 -5504 -2409 178 1215 -5733 -18390 -5367 3420 3051 -5798
7465 -5798 -17490 -21753 -11899 -491 -2041 4659 1355 -1704 -735 5995 18812 11651 -1344 -773
7451 -773 6092 -393 -4438 -5758 -1306 -2764 2617 1469 -4511 -8110 -7412 -15562 -14412 -8345 -7893 -8594
7435 -8594 -16697 -19623 -10592 -6673 -17840 -20587 -14464 -5770 -3800 -15665 -23254 -27870 -20786 -8124
7421 -8124 -849 10254 2820 -1332 -3740 -689 -533 -628 -4204 -8315 -10219 -14270 -13413 -8233 -7742 -10140
$$ packed form
7524D364l3m366M220j467l852m026J426J058k103q537L545M468O258J906L263
7509F124j2468l683n862q265J1254N24o081j241K498j198J4052P946l137l256
7495b793P85l149L870M772n427R013L549p512l950j859L977N582r926Q71J1228
7480I031K103J02n403q739k822K24L095K587J037o948j2657J3023Q787l69q849
7465e798j1692m263R854J1408j550O700l304l059R69O730J2817p161j2995N71
7451g73O865o485m045j320M452j458N381j148n980l599O98q150J150O067M52p01
7435h594q103k926R031L919j1167k747O123Q694J970j1865p589m616P084J2662
7421h124P275J1103p434m152k408L051J56r5l576m111j904m051Q57N180M91k398
$$ plain form
7405 -10140 -3417 11266 11300 2268 -11216 -5639 -2574 2625 3572 1150 1473 -904 1230 -2454 -8701
7390 -8701 -10341 -7623 -12624 -13588 -14456 -3280 -738 -11472 -22543 -28493 -33874 -27153 -24429 -20082 -15676
7375 -15676 -12510 -10920 -3841 -6979 -10334 -16345 -10968 -2165 -2012 -6651 -16968 -16208 -9712 -2852 8280
7360 8280 3389 -4783 -1993 -2571 -9485 -6523 -9010 -6623 1321 8980 6692 4470 -927 -814 -4298
7345 -4298 -2834 1146 5898 7446 -5011 -4517 -1533 29 1513 9694 14215 8364 8578 11006 11799
7330 11799 8206 5074 -1377 -88 -2116 -1941 -7376 -16161 -18117 -16678 -5375 -6520 -6358 -10728 -7087
7315 -7087 -8695 -14142 -17347 -4280 -1322 -8115 -12307 -10801 -15428 -17697 -17646 -13348 -7672 -15369 -10101
7300 -10101 1037 4718 -3080 -8815 -12406 -3267 -11873 -10759 -6587 -11426 -13024 -16502 -13933 -11899
$$ packed form
7405a0140O723J4683L4r032j3484N577L065N199R47k422L23k377K134l684o247
7390h701j640K718n001r64q68J1176K542j0734j1071n950n381O721K724M347M406
7375a5676L166J590P079l138l355o011N377Q803J53m639j0317P60O496O860J1132
7360H280m891q172K790n78o914K962k487K387P944P659k288k222n397J13l484
7345d298J464L980M752J548j2457M94K984J562J484Q181M521n851K14K428P93
7330A1799l593l132o451J289k028J75n435q785j956J439J1303j145J62m370L641
7315g087j608n447l205J3067K958o793m192J506m627k269N1M298N676p697N268
7300a0101J1138L681p798n735l591R139q606J114M172m839j598l478K569K034
$$ plain form
7286 -11899 -16169 -16364 -13316 -19372 -11846 -4416 -225 -2803 -14427 -14445 -10227 109 3457 -3039 -6563
7271 -6563 -9951 -10387 -10459 -18105 -23528 -19363 -8491 -6715 -7238 -7786 -21161 -18034 -4562 310 -2906
7256 -2906 -5946 598 11698 6026 -3980 -15995 -21910 -25785 -20937 -8919 -13706 -19842 -11688 364
7242 364 157 1992 7520 3029 2989 3964 7539 4594 2806 1021 2215 5451 6541 2701 5434 3677
7226 3677 4812 1701 9171 9014 2568 -2843 -4807 -2310 -9265 -17149 -12313 -6859 -2453 3248 3540
7211 3540 -2814 -16623 -15525 -12254 -2213 1062 7024 10053 9923 5623 1981 1408 -3760 -9346 -11717
7196 -11717 -11570 -5594 -5773 -4288 227 4383 5215 9287 12380 6839 -4029 -8722 1707 5179 3030
7181 3030 -6045 -7834 -5811 3665 10902 9937 7669 3459 -6155 -15776 -11032 -6008 -10407 -7694 -9881
$$ packed form
7286a1899m270j95L048o056P526P430M191k578j1624j8M218J0336L348o496l524
7271f563l388m36p2p646n423M165J0872J776n23n48j3375L127J3472M872l216
7256b906l040O544J1100n672j0006j2015n915l875M848J2018m787o136Q154J2052
7242C64k07J835N528m491m0R75L575k945j788j785J194L236J090l840K733j757
7226C677J135l111P470j57o446n411j964K497o955p884M836N454M406N701K92
7211C540o354j3809J098L271J0041L275N962L029j30m300l642n73n168n586k371
7196a1717J47N976j79J485M515M156Q32M072L093n541j0868m693J0429L472k149
7181C030r075j789K023R476P237r65k268m210r614r621M744N024m399K713k187
$$ plain form
7166 -9881 -11877 -19051 -19516 -17043 -10538 -1487 3359 8818 17174 10111 -4517 -8663 -8895 -9401 -10524
7151 -10524 -5949 -9894 -15086 -9554 -5199 -7534 -7187 -305 1538 -1447 -461 5548 679 -5039 -4683
7136 -4683 -3815 -7763 -13327 -23544 -16878 -7122 -8324 -1794 3586 2588 5231 7269 8478 10571 4419
7121 4419 3680 6235 11424 11730 7766 -5209 -5168 -14535 -15904 -12520 -16619 -16313 -13364 -12822 -13440 -9859
7105 -9859 -7810 -11469 -1486 11124 13093 10831 19897 15672 9177 -975 -8713 -6825 -10932 -6418
7091 -6418 -6138 4940 10826 3650 -2512 -8601 -12241 -11314 -6172 -8985 -11780 -9562 250 -9024 -18638
7076 -18638 -10074 -6415 -16412 -10327 -6084 -7191 -8044 -17838 -5628 2579 7892 4477 -2090 -662 2991
7061 2991 4676 -5363 -18650 -15093 -8360 -8168 1298 7565 5578 5950 -2128 -7814 -12527 -10990 -6540
$$ packed form
7166i881j996p174m65K473O505R051M846N459Q356p063j4628m146k32n06j123
7151a0524M575l945n192N532M355k335L47O882J843k985R86O009m869n718L56
7136d683Q68l948n564j0217O666R756j202O530N380r98K643K038J209K093o152
7121D419p39K555N189L06l964j2975M1r367j369L384m099L06K949N42o18L581
7105i859K049l659R983J2610J969k262R066m225o495j0152p738J888m107M514
7091f418K80J1078N886p176o162o089l640R27N142k813k795K218R812r274r614
7076a8638Q564L659r997O085M243j107q53r794J2210Q207N313l415o567J428L653
7061B991J685j0039j3287L557O733J92R466O267j987L72q078n686m713J537M450
$$ plain form
7046 -6540 -4452 -4520 -7863 -7492 -10578 -11551 -5776 3553 6576 4789 6373 13191 3979 -902 -5471 -7573
7030 -7573 -5552 -4119 -1305 -1980 -4262 -3252 -3069 -313 -210 74 393 3211 936 -6109 -11503 -13165
7014 -13165 -6249 -10370 -6699 9289 12418 -2910 -14516 -4576 5922 10131 5663 314 -1819 -10295
7000 -10295 -10426 -10018 -6608 -3246 -3403 -12209 -14053 -15257 -12476 -6170 -4252 -1333 6017 4356 -5662
6985 -5662 -12883 -10458 -2667 2140 409 -7001 -5336 -668 -4026 -12687 -16001 -11019 -12750 -8491 -5357
6970 -5357 55 4193 7925 2461 536 9408 18949 10621 2266 6847 1636 3273 4719 -1613 -2054
6955 -2054 5194 12242 13912 5306 6356 2850 8556 1217 -4665 -1625 1900 670 2036 -7907 -7218
6940 -7218 -2124 -5829 -5705 -12914 -6952 -3096 -676 4641 8259 14430 20792 8799 -3109 -6957 1907
$$ packed form
7046f540K088o8l343L71l086r73N775R329L023j787J584O818r212m881m569k102
7030g573K021J433K814o75k282J010J83K756J03K84L19K818k275p045n394j662
7014a3165O916m121L671J5988L129j5328j1606R940J0498M209m468n349k133q476
7000a0295j31M08L410L362j57q806j844j204K781O306J918K919P350j661j0018
6985e662p221K425P791M807j731p410J665M668l358q661l314M982j731M259L134
6970e357N412M138L732n464j925Q872R541q328q355M581n211J637J446o332m41
6955b054P248P048J670q606J050l506N706p339n882L040L525j230J366r943O89
6940g218N094l705J24p209N962L856K420N317L618O171O362j1993j1908l848Q864
$$ plain form
6925 1907 784 4737 14644 12564 10801 12274 5761 3832 4722 4751 843 3852 11471 10194 -1143
6910 -1143 -5429 2714 7145 5056 -2395 -6138 -7077 -5974 -12978 -28704 -27633 -20775 -14160 -14279 -17929
6895 -17929 -7296 -1415 3600 1363 -8213 -14277 -14817 -11657 -6804 -6022 5146 7233 2921 -9287
6881 -9287 -18906 -18390 -7571 -2464 -1263 10543 15387 11115 2781 -9708 -19093 -24468 -22217 -18594
6867 -18594 -13910 -3982 -1286 3342 3141 -2626 -3276 5058 6815 273 -1731 -1117 2014 2449 10387 12651
6851 12651 9527 -2498 -5524 -6163 -15380 -7981 -5137 -2476 3564 5538 521 -2011 402 5078 -9883
6836 -9883 -18230 -9828 -7489 -13909 -18326 -17553 -5108 3591 15606 19313 4764 -13274 -12188 -2878
6822 -2878 -6955 -7164 -6521 904 8801 8088 9000 8788 2093 -1586 1196 -2737 -4789 1585 6515 -2016
$$ packed form
6925A907j123L953R907k080j763J473o513j929Q90K9l908L009P619j277j1337
6910a143m286Q143M431k089p451l743r39J103p004j5726J071O858O615j19l650
6895a7929J0633N881N015k237r576o064n40L160M853P82J1168K087m312j2208
6881i287r619N16J0819N107J201J1806M844m272q334j2489r385n375K251L623
6867a8594M684R928K696M628k01n767o50Q334J757o542k004O14L131M35P938K264
6851A2651l124j2025l026o39r217P399K844K661O040J974n017k532K413M676j4961
6836i883q347Q402K339o420m417P73J2445Q699J2015L707j4549j8038J086R310
6822b878m077k09O43P425P897p13R12k12o695l679K782l933k052O374M930q531
$$ plain form
6806 -2016 -2316 -4949 503 6132 9337 71 -13406 -21294 -11116 -89 -4929 481 5478 7160
6792 7160 7284 9928 7227 2536 -4271 -7545 4176 3554 -6327 -3066 -8436 -7834 -5169 5542 3240
6777 3240 -1560 -10012 2169 14700 6914 2480 -8435 -10463 -642 2545 -1999 320 11984 11387
6763 11387 6339 2555 -224 1600 11895 8019 12751 12292 12595 12364 11604 2750 -8195 -10526 -11983
6748 -11983 -932 1092 -4750 -5843 4068 8490 9194 6987 7942 19764 22086 23655 22016 16189 16804
6733 16804 12741 5804 -481 -7323 -8231 -7920 -4358 6162 1333 -3829 -3603 -2975 -262 -8936 -15895
6718 -15895 -8733 -6317 -7492 -4068 6318 11659 5497 8016 8009 -2728 -10778 2452 4696 -4457 -6439
6703 -6439 -7266 -7584 -4955 -4203 -2688 4050 1750 -3569 -5667 -10651 -9876 -11446 -18852 -20494 -9719 -1853
$$ packed form
6806b016l00k633N452N629L205r266j3477p888J0178J1027m840N410M997J682
6792G160J24K644k701m691o807l274J1721o22r881L261n370O02K665J0711k302
6777C240m800q452J2181J2531p786m434j0915k028R821L187m544K319J1664n97
6763A1387n048l784k779J824J0295l876M732m59L03k31p60q854j0945k331j457
6748a1983J1051K024n842j093R911M422P04k207R55J1822K322J569j639n827O15
6733A6804m063o937o285o842r08L11L562J0520m829n162K26O28K713q674o959
6718a5895P162K416j175L424J0386N341o162K519pj0737q050J3230K244r153j982
6703f439q27l18K629P52J515O738k300n319k098m984P75j570p406j642J0775P866
$$ plain form
6687 -1853 -5596 -3174 -8025 -6818 -1936 7160 11121 8450 16071 14200 6129 -1251 -569 -3341 -12018
6672 -12018 -19405 -14048 -6126 985 -4018 -4563 -5073 -5503 -2874 2793 3662 -10304 -27269 -26139 -10424
6657 -10424 7002 9361 3498 -1851 1693 5954 9412 8896 6273 1411 1848 12223 16330 14417 15072
6642 15072 5892 2423 589 -2532 -3924 2512 3046 2536 2384 3862 7583 812 2739 4371 7199
6627 7199 12769 5319 3907 -3366 -7337 -6657 -5087 -9831 -2094 7700 6043 3465 -5723 -8581 209
6612 209 -4055 -2371 -1282 -1514 -6688 -6470 -5875 2967 8454 -3207 -3493 -3582 -3932 -6720 -7773 -6656 -7239
6595 -7239 -14395 -15797 -13569 -11406 -7630 1458 -1237 -6438 -4443 -1362 -1790 3705 9780 10971 2409
6580 2409 4724 7310 1457 -6036 -4869 4143 4030 -2694 -5147 -1489 6978 7042 7769 8611 8589 16955 19474
$$ packed form
6687a853l743K422m851J207M882R096L961k671P621j871q071p380O82k772q677
6672a2018p387N357P922P111n003n45n10m30K629N667Q69j3966j6965J130J5715
6657a0424J7426K359n863n349L544M261L458n16k623m862M37J0375M107j913O55
6642A5072r180l469j834l121j392O436N34n10j52J478L721o771J927J632K828
6627G199N570p450j412p273l971O80J570m744P737R794j657k578r188k858Q790
6612B09m264J684J089k32n174K18N95Q842N487j1661k86q9l50k788j053J117n83
6595g239p156j402K228K163L776R088k695n201J995L081m28N495O075J191q562
6580B409K315K586n853p493J167R012j13o724k453L658Q467O4P27Q42k2Q366K519
$$ plain form
6563 19474 7695 -8078 -9812 -16178 -11584 -10671 -11205 -10802 -123 2617 -4281 -10030 -11405 -10310 -11335
6548 -11335 -3930 -1684 -6138 -6683 -1872 -6088 -12314 -7269 -1164 5926 603 -8949 -7389 -3744 -8256
6533 -8256 -9907 -1429 -2508 -6444 -1647 -1329 -800 67 4255 12965 10442 -2998 -2338 -2426 7556 10104
6517 10104 -890 -11423 -12288 -11222 -9025 -9814 2666 8041 5285 14919 10947 716 -5659 -2123
6503 -2123 2117 2971 1006 2729 -4704 -5850 -3985 1268 1345 -5511 -16562 -15891 -11716 -813 939
6488 939 2734 5882 5944 3845 7380 5902 11066 17863 20989 13027 -37 3508 4885 2191 721
6473 721 -657 8909 18012 6802 -1587 -14888 -15633 -9147 -7744 -1849 -3639 -957 -2632 1007 -7894
6458 -7894 -22095 -24380 -10649 8952 -5205 -13903 -9120 -3556 -13058 -11986 -5253 1255 -7923 109
$$ packed form
6563A9474j1779j5773j734o366M594R13n34M03J0679K740o898n749j375J095j025
6548a1335P405K246m454n45M811m216o226N045O105P090n323r552J560L645m512
6533h256j651Q478j079l936M797L18N29Q67M188Q710k523j3440O60q8R982K548
6517A0104j0994j0533q65J066K197p89J2480N375k756R634l972j0231o375L536
6503b123M240Q54j965J723p433j146J865N253P7o856j1051O71M175J0903J752
6488I39J795L148O2k099L535j478N164O797L126p962j3064L545J377k694j470
6473G21j378R566R103j1210q389j3301p45O486J403N895j790K682j675L639q901
6458g894j4201k285J3731J9601j4157q698M783N564r502J072O733O508r178Q032
$$ plain form
6444 109 11914 3894 -4781 -4618 196 -300 -4883 -7829 -3321 2460 -983 -3509 -6764 501 741 -9255
6428 -9255 -4581 7157 9929 7193 4012 -7320 -8194 -10264 -7014 -10589 -5964 7735 10742 6745
6414 6745 9253 953 -8760 -12963 -7540 -3206 -1587 -7220 -7042 -16475 -32494 -19728 -12645 -11234 -9849
6399 -9849 311 -810 1954 7924 5843 5730 1066 -4065 3318 8204 1650 -88 12116 14466 14235
6384 14235 11778 -2829 -9027 -7242 -4155 -1849 5231 -910 -10777 -14818 -17241 -9205 -6454 -6049 -4979
6369 -4979 -6656 -3146 -3364 -1728 4069 5811 8780 9040 5656 3805 -5927 -8802 -11179 -10597 -12514 -14798
6353 -14798 -15824 -16648 -12026 -10517 -5309 -7953 -7985 -1897 -2735 -4844 -3593 4136 8858 9511 5275 -4510
6337 -4510 609 8350 14204 10746 1873 -1241 -11783 -21350 -16340 -10305 -4138 6614 5161 6129 -1094
$$ packed form
6444A09J1805q020q675J63M814m96m583k946M508N781l443k526l255P265K40r996
6428i255M674J1738K772k736l181j1332q74k070L250l575M625J3699L007l997
6414F745K508q300r713m203N423M334J619n633J78r433j6019J2766P083J411J385
6399i849J0160j121K764N970k081j13m664n131P383M886o554j738J2204K350k31
6384A4235k457j4607o198J785L087K306P080o141r867m041k423Q036K751M05J070
6369d979j677L510k18J636N797J742K969K60l384j851r732k875k377N82j917k284
6353a4798j026q24M622J509N208k644l2O088q38k109J251P729M722O53m236r785
6337d510N119P741N854l458q873l114j0542r567N010O035O167J0752j453R68p223
$$ plain form
6322 -1094 -1285 14800 12097 8790 6019 -2707 -8525 -11453 -11506 -14537 -17963 -22894 -25464 -20544 -11139
6307 -11139 -7639 -4860 -8983 -7187 -13313 -16698 -2926 3902 7254 788 -1668 -2668 1362 3490
6293 3490 -191 -1434 -654 5668 9523 1114 -15271 -9036 -10605 -13097 -15243 -11271 -3165 2441 9808
6278 9808 15378 10646 -2886 -3083 12475 9618 1465 1277 7600 6241 7652 8870 4175 1218 8755
6263 8755 5826 -6330 -12337 -8244 -3763 -11289 -13028 1952 11689 -827 -5131 -250 1739 2070
6249 2070 -2247 -112 4109 7794 1099 -7127 -12956 -5090 3974 4648 5585 1575 -1584 28 692 4110
6233 4110 4708 8478 15104 9046 -2863 -3123 15475 7180 -211 -3643 5293 13629 9600 6404 -4118
6218 -4118 -10380 -9314 -2928 3434 2602 -6487 -9035 5899 4784 -5003 -11887 -21568 -13983 -1123 4165
$$ packed form
6322a094j91J6085k703l307k771q726n818k928n3l031l426m931k570M920R405
6307a1139L500K779m123J796o126l385J3772O828L352o466k456j000M030K128
6293C490l681j243P80O322L855q409j6385O235j569k492k146L972Q106N606P367
6278I808N570m732j3532j97J5558k857q153j88O323j359J411J218m695k957P537
6263H755k929j2156o007M093M481p526j739J4980R737j2516m304M881J989L31
6249B070m317K135M221L685o695q226n829P866R064O74R37m010l159J612O64L418
6233D110N98L770O626o058j1909k60J8598q295p391l432Q936Q336m029l196j0522
6218d118o262J066O386O362q32r089k548J4934j115r787o884r681P585J2860N288
$$ plain form
6203 4165 -1370 -4377 -7987 -7552 2797 -1571 -8359 -5601 771 1343 3533 3590 36 -8904 -15226 -11736
6187 -11736 -16180 -7829 -1305 -1812 -3590 -4415 -11047 -16917 -8184 -12200 -15614 -1730 7699 3413 2503
6172 2503 3938 3355 -2679 3604 8026 8670 14745 7649 7703 -926 -10647 -8035 -3996 -4283 -12444 -16125
6156 -16125 -15608 -8834 -7852 -6895 -5899 -8231 -329 7276 198 1398 182 2497 7774 -359 1653 -232
6140 -232 -3342 2287 5622 3930 4399 -509 -11133 -5186 -2484 3947 3497 -8462 -3407 -2057 513
6125 513 5758 5729 7739 -5911 -12850 -8166 -4152 -4386 -7117 -10080 -9387 -2183 -9496 -2377 4385 -6483
6109 -6483 -5249 158 -3391 -12009 -21218 -22223 -12924 -14411 -15149 -14128 -15471 -13992 -11925 -13553 -14287
6094 -14287 -20872 -24099 -12268 -5399 -3594 -8690 -12989 -7917 -12088 -14526 -19202 -14957 -4096 -9480
$$ packed form
6203D165n535l007l610M35J0349m368o788K758O372N72K190N7l554q940o322L490
6187a1736m444Q351O524n07j778q25o632n870Q733m016l414J3884R429m286r10
6172B503J435n83o034O283M422O44O075p096N4q629r721K612M039k87q161l681
6156a6125N17O774R82R57R96k332P902P605p078J200j216K315N277q133K012j885
6140b32l110N629L335j692M69m908j0624N947K702O431m50j1959N055J350K570
6125E13N245k9K010j3650o939M684M014k34k731k963O93P204p313P119O762j0868
6109f483J234N407l549q618r209j005R299j487p38J021j343J479K067j628p34
6094a4287o585l227J1831O869J805n096m299N072m171k438m676M245J0861n384
$$ plain form
6080 -9480 -7530 -11301 -14651 -13604 -16452 -13982 -11873 -10535 -7685 -2732 5111 -1042 -2144 -5153 -15542
6065 -15542 -14052 465 5129 9781 9975 1365 -494 -179 1761 6614 9644 9673 11078 5721 -2002
6050 -2002 -7462 -7355 -10378 -15044 -11020 -6090 -9094 -18482 -12556 -4152 183 -6589 -3657 4547 4720
6035 4720 1860 -2898 -5893 -11338 -14830 -11679 -11895 -17637 -23799 -23323 -10392 -4819 -6368 276 138
6020 138 -6956 -836 774 -1275 5555 12101 11051 2234 3392 2952 -802 -676 1764 9500 7338 4674
6004 4674 11548 9033 5201 -1500 -5905 -3312 215 5761 9800 4935 5269 10914 21416 15263 9293
5989 9293 6971 9151 536 -3303 1597 2983 1347 -1897 3170 4607 2095 1737 5392 -2314 -8212
5974 -8212 -11416 -3951 -994 1312 -3441 -6255 -10747 -2281 3968 -1848 1473 3043 5308 -828 -8848
$$ packed form
6080i480J950l771l350J047k848K470K109J338K850M953P843o153j102l009j0389
6065a5542J490J4517M664M652J94q610j859L15J940M853L030K9J405n357p723
6050b002n460J07l023m666M024M930l004r388N926Q404M335o772K932Q204J73
6035D720k860m758k995n445l492L151k16n742o162M76J2931N573j549O644j38
6020A38p094O120J610k049O830O546j050q817J158m40l754J26K440P736k162k664
6004D674O874k515l832o701m405K593L527N546M039m865L34N645J0502o153n970
5989I293k322K180q615l839M900J386j636l244N067J437k512l58L655p706n898
5974h212l204P465K957K306m753k814m492Q466O249n816L321J570K265o136q020
$$ plain form
5959 -8848 -14809 -8913 -4445 854 8452 9514 6918 1705 -354 7850 2832 713 9745 6074 5165
5944 5165 2769 17 -3520 -3409 -2087 6961 4614 8751 1330 -3414 -2026 -2519 -558 6057 9380
5929 9380 -1512 -9490 -17161 -19642 -19984 -14467 -8637 -6713 -9556 -16143 -20443 -10330 -3282 262 4703
5914 4703 6885 1787 -10130 -17341 -10807 -9518 -3826 1440 3436 -7171 -15795 -14198 -17633 -19476
5900 -19476 -14660 -13345 -15648 -15297 -14697 -11034 -4728 -756 1586 4750 5421 8760 8774 4800 5133 1922
5884 1922 -325 3500 -176 -2646 675 2940 10612 12389 3466 -5304 -8852 -10980 -4070 1112 -1478
5869 -1478 3573 -2827 -5780 3593 12887 14093 6683 5455 -1962 -5841 -3621 -2307 -11337 -10789 -3812
5854 -3812 -159 -772 -3194 -9844 -6735 -8261 -6991 -1560 -2892 -2798 -2726 -6457 -6639 -9880 -11605 -2537
$$ packed form
5959h848n961N896M468N299P598J062k596n213k059Q204n018k119R032l671r09
5944E165k396k752l537J11J322R048k347M137p421m744J388m93J961O615L323
5929I380j0892p978p671k481l42N517N830J924k843o587m300J0113P048L544M441
5914D703K182n098j1917p211O534J289N692N266J996j0607q624J597l435j843
5900a9476M816J315k303L51O00L663O306L972K342L164O71L339J4l974L33l211
5884A922k247L825l676k470L321K265P672J777q923q770l548k128O910N182k590
5869a478N051o400k953R373R294J206p410j228p417l879K220J314r030N48O977
5854c812L653o13k422o650L109j526J270N431j332R4P2l731j82l241j725R068
$$ plain form
5838 -2537 1708 2115 788 -11613 -11413 -15923 -8858 -6418 -1926 5510 10691 5730 7690 8738 6420
5823 6420 3557 -71 -5363 572 4373 1262 -9895 -6974 -12656 -19170 -13665 -16070 -16564 -19032 -14274
5808 -14274 -12414 -7402 3457 13884 13928 16193 9849 -2067 -1881 -908 1355 170 3444 -6380 -4379
5793 -4379 480 -1898 -5613 -3435 3872 10123 13208 11018 9417 9744 7754 -2429 -3122 -6056 -8866
5778 -8866 -1977 8119 12988 254 506 3868 8428 15368 4721 -11662 -23980 -26176 -16398 -8467
5764 -8467 -13839 -10915 -11025 -14229 -8645 -12740 -10755 -3033 -1028 -3131 -6561 -9344 -2152 5504 343
5749 343 -12515 -3366 -5534 -7669 3224 14396 10765 -3818 -18 5741 -597 -7782 -11592 -10822
5735 -10822 -4272 -5222 -14061 -8567 -3182 143 4551 -2282 -3942 -11216 -16283 -17309 -12422 -3020 4000
$$ packed form
5838b537M245M07j327j2401K00m510P065K440M492P436N181m961J960J048k318
5823F420k863l628n292N935L801l111j1157K921n682o514N505k405m94k468M758
5808a4274J860N012J0859J0427M4K265o344j1916J86R73K263j185L274r824K001
5793d379M859k378l715K178P307O251L085k190j601L27j990j0183o93k934k810
5778h866O889J0096M869j2734K52L362M560O940j0647j6383j2318k196R778P931
5764h467n372K924j10l204N584m095J985P722K005k103l430k783P192P656n161
5749C43j2858R149k168k135J0893J1172l631j4583L800N759o338p185l810P70
5735a0822O550r50q839N494N385L325M408o833j660p274n067j026M887R402P020
$$ plain form
5720 4000 5962 4029 1965 2020 7385 12285 15223 7622 -1471 3944 3318 -1940 -1420 -2999 -1787 7241
5704 7241 8186 3069 -2002 2470 -786 3851 7307 15780 9986 -1364 -6321 -5325 2341 -8122 -15414
5689 -15414 -9897 3873 1216 -605 -6743 -6364 -1983 -2513 -7439 -4371 2290 -1335 -7503 -5970 -2728
5674 -2728 -5393 -8477 -5972 -10343 -7226 -2664 6798 15271 12516 7807 8894 8312 382 -2905 -7382
5659 -7382 -6337 2393 -606 -4844 -11136 -19236 -15359 -2400 -1640 -3317 -7710 -760 923 5078 6043
5644 6043 7030 3309 1110 -2448 378 24 1605 4675 13478 17682 14394 5414 -9694 -5721 1137
5629 1137 1571 -5984 603 4479 4054 -1493 128 6537 -5197 -9455 -9298 1303 2309 -6017 -15857
5614 -15857 -20343 -17429 -10769 -312 3947 8527 9503 -4289 -4031 4757 3835 4659 7809 9666 6010
$$ packed form
5720D000J962j933k064N5N365M900K938p601r093N415o26n258N20j579J212R028
5704G241R45n117n071M472l256M637L456Q473n794j1350m957R96P666j0463p292
5689a5414N517J3770k657j821o138L79M381n30m926L068O661l625o168J533L242
5674b728k665l084K505m371L117M562R462Q473k755m709J087n82p930l287m477
5659g382J045Q730k999m238o292q100L877J2959P60j677m393O950J683M155R65
5644F043R87l721k199l558K826l54J581L070Q803M204l288q980j5108L973O858
5629A137M34p555O587L876m25n547J621O409j1734m258J57J0601J006q326r840
5614a5857m486K914O660J0457M259M580R76j3792K58Q788r22Q24L150J857l656
$$ plain form
5599 6010 3229 3946 6319 9953 10103 4004 -194 -9622 -9211 -8142 3347 12807 7058 10774 7054
5584 7054 6246 2864 3754 9724 4872 4418 1955 -3060 -410 -2885 -795 4947 3701 -1549 1794 9847
5568 9847 1260 -336 8744 8584 8116 5761 -5077 -9383 -5425 74 5616 7070 1567 394 -7909
5553 -7909 -5895 -2802 1430 -1109 -2590 -1891 -3902 -1871 4189 -3270 -4469 -4895 -1481 2933 1096
5538 1096 5609 5643 5869 14904 15179 4764 6954 7917 -4307 -13194 -13059 -130 6660 7786 10041 6283
5522 6283 1569 -3951 -5620 -8044 859 3510 -2803 -359 361 1251 -3315 -3277 2438 -4598 -8478 -1408
5506 -1408 8107 17179 25106 16724 -674 -4590 -13796 -13889 -6406 516 6885 3099 1604 2506 -4832
5491 -4832 -8579 -1580 2921 -2918 -5025 -498 -10631 -14409 -9697 -7768 -4231 -2367 3957 10169 12490
$$ packed form
5599F010k781P17K373L634J50o099m198r428M11J069J1489R460n749L716l720
5584G054q08l382Q90N970m852m54k463n015K650k475K090N742j246n250L343Q053
5568I847q587j596R080j60m68k355j0838m306L958N499N542J454n503j173q303
5553g909K014L093M232k539j481O99k011K031O060p459j199m26L414M414j837
5538A096M513L4K26R035K75j0415K190R63j2224q887J35J2929O790J126K255l758
5522F283m714n520j669k424Q903K651o313K444P20Q90m566L8N715p036l880P070
5506a408R515R072P927q382j7398l916r206r3P483O922O369l786j495R02p338
5491d832l747O999M501n839k107M527j0133l778M712J929L537J864O324O212K321
$$ plain form
5476 12490 17227 17872 11912 3172 389 950 -3974 -7181 -11274 686 4980 -5869 -5000 -8229 -7656
5461 -7656 -4382 -3729 -3185 -1369 6608 17135 14600 7718 4826 10685 14302 9809 3117 -1221 3413
5446 3413 3433 -1043 264 3553 2648 4983 -2603 -5082 1867 2818 -305 236 534 7970 5015 -791
5430 -791 2397 7415 1441 9248 5283 12605 5143 -3072 -4432 2412 4785 -399 -1926 -932 749
5415 749 -2697 -8216 -8938 -13530 -15872 -15028 -10008 -2167 2573 178 -1952 1719 3992 -15619 -14692 -9307
5399 -9307 -16592 -15268 -7068 -5745 -3314 5809 -2127 -14630 -6685 -4111 -718 -253 -3790 -1860 2661
5384 2661 11600 22442 13770 653 -5348 -3080 -2937 -6514 -6562 -5078 -9526 -15129 -15882 -18337 -7842
5369 -7842 -2952 2659 2599 4829 8639 12071 4964 211 -4391 -10126 -17114 -13122 -10716 -8998 -656
$$ packed form
5476A2490M737O45n960q740k783N61m924l207m093J1960M294j0849Q69l229N73
5461g656L274O53N44J816P977J0527k535o882k892N859L617m493o692m338M634
5446C413K0m476J307L289r05K335p586k479O949R51l123N41K98P436k955n806
5430g91L188N018n974P807l965P322p462q215j360O844K373n184j527R94J681
5415G49l446n519p22m592k342Q44N020P841M740k395k130L671K273j9611R27N385
5399i307p285J324Q200J323K431R123p936j2503P945K574L393M65l537J930M521
5384B661Q939J0842q672j3117o001K268J43l577m8J484m448n603p53k455J0495
5369g842M890N611o0K230L810L432p107m753m602n735o988L992K406J718Q342
$$ plain form
5354 -656 2248 -7013 -14051 -10114 -3289 -6040 -12368 -16790 -19406 -13195 -4959 -1944 -6247 -4879 6625
5339 6625 15915 21532 21370 10569 4345 4713 5883 -1678 -6000 -10585 -153 5391 7129 915 2976
5324 2976 5166 6285 3570 -1999 4718 3636 4551 5622 1358 1803 1019 6921 6114 6824 6097 5371 4626
5307 4626 9981 -371 -4142 5798 12650 7416 2126 -2192 483 3437 -1408 -8694 -18397 -19411 -7216
5292 -7216 -1357 4446 -295 1734 4713 6320 15340 15410 5244 5083 11324 5850 -7858 -12039 -15851
5277 -15851 -17060 -19317 -7337 1096 3931 4892 9827 11233 14665 8136 5489 5134 -1753 4350 9230
5262 9230 2130 -2216 -6675 6085 2383 -44 -4321 -10638 -6943 2774 797 -5604 -9494 -7040 -3962
5247 -3962 4985 10960 12687 14382 9591 4098 1408 2017 5468 7584 4988 2897 2888 6655 5701 5827
$$ packed form
5354f56K904r261p038L937O825k751o328m422k616O211Q236L015m303J368J1504
5339F625R290N617j62j0801o224L68J170p561m322m585J0432N544J738o214K061
5324B976K190J119k715n569O717j082R15J071m264M45p84N902q07P10p27p26p45
5307D626N355j0352l771R940O852n234n290m318K675K954m845p286r703j014J2195
5292g216N859N803m741K029K979J607R020P0j0166j61O241n474j3708m181l812
5277a5851j209k257J1980Q433K835R61M935J406L432o529k647l55o887O103M880
5262I230p100m346m459J2760l702k427m277o317L695R717j977o401l890K454L078
5247c962Q947N975J727J695m791n493k690O09L451K116k596k091rL767r54J26
$$ plain form
5231 5827 4475 423 -2628 -4819 -4411 3125 5781 1916 -3696 -3268 -2403 -1633 5963 4429 6280 -2234
5215 -2234 4663 15550 19237 23792 20720 15852 13053 21977 21403 8167 -7433 -9804 -7399 641
5201 641 831 4228 7520 2727 -3446 -11446 -9113 -9110 -6121 -6989 -12109 -19451 -15513 -2931 8514 6523
5185 6523 8402 14959 14238 6263 6001 1053 9412 3292 1616 5337 9184 11172 20944 12265 4886
5170 4886 7009 2812 787 5160 6172 -1271 -10965 -12098 -3178 66 3347 4909 4782 2339 -9328
5155 -9328 -7754 3465 1175 -2278 -14409 -21487 -13465 -7123 -5379 -2317 532 12476 20098 14672
5141 14672 11022 17400 21725 15777 12232 9964 2634 3506 7441 9377 11540 7741 3127 10516 15591
5126 15591 8812 721 1490 -122 -654 12402 17737 12099 7676 5551 9905 2139 -7466 -10409 -7100
$$ packed form
5231E827j352m052l051k191M08P536K656l865n612M28Q65P70P596j534J851q514
5215b234O897J0887L687M555l072m868k799Q924n74j3236j5600k371K405Q040
5201F41J90L397L292m793o173q000K333LK989q68n120p342L938J2582J1445j991
5185F523J879O557p21p975k62m948Q359o120j676L721L847J988R772q679p379
5170D886K123m197k025M373J012p443r694j133Q920L244L281J562j27k443j1667
5155i328J574J1219k290l453j2131p078Q022O342J744L062K849J1944P622n426
5141A4672l650O378M325n948l545k268p330Q72L935J936K163l799m614P389N075
5126A5591o779q091P69j612n32J3056N335n638m423k125M354p766r605k943L309
$$ plain form
5111 -7100 -4052 822 8947 15047 9106 3243 9699 7365 -2676 -1546 5054 7627 7720 -2008 -5105
5096 -5105 -8284 -19506 -25794 -18766 -13145 -12657 -13408 -12236 -4745 -5787 -9861 -5709 12461 15336 7303
5081 7303 6554 9221 6040 5217 8125 11344 5446 -709 2751 12344 15571 4233 7132 9347 -3288
5066 -3288 -9328 -56 18 1519 3394 9279 18282 24967 20167 23268 27365 13946 2060 10443 7057
5051 7057 161 -9143 -9700 -11347 -16655 -14803 -8812 881 5020 6851 5543 6942 9651 3864 2065
5036 2065 -902 1882 9870 8890 7553 1659 -4642 -5376 -13169 -17110 -15919 -14209 -3814 -736 -587
5021 -587 4389 8509 5831 3584 -635 -4581 -9382 -18779 -18062 -5788 -3256 2464 524 -4478 -3559
5006 -3559 -5418 -9162 734 4565 7133 5740 -1643 -2584 -12142 -8844 -131 5465 6444 -6594 -11806
$$ packed form
5111g100L048M874Q125O100n941n863O456k334j0041J130O600K573R3r728l097
5096e105l179j1222o288P028N621M88p51J172P491j042m074M152J8170K875q033
5081G303p49K667l181q23K908L219n898o155L460R593L227j1338K899K215j2635
5066c288o040R272P4J501J875N885R003O685m800L101M097j3419j1886Q383l386
5051G057o896r304n57j647n308J852N991R693M139J831j308J399K709n787j799
5036B065k967K784P988r80j337n894o301p34p793l941J191J710J0395L078J49
5021e87M976M120k678k247m219l946m801r397P17J2274K532N720j940n002R19
5006c559j859l744R896L831K568j393p383r41r558L298Q713N596R79j3038n212
$$ plain form
4991 -11806 -8764 -8589 -13053 -9770 3502 6242 5503 -1842 -7647 -1336 9172 8502 6424 3674 2246
4976 2246 -1746 4832 11499 15391 8937 -2675 -2283 6462 -5087 -16687 -12234 -5736 -7744 -7449 -1976
4961 -1976 -5015 2022 2064 -132 7210 3125 -2058 -3162 -81 -4434 -11154 -472 6539 6553 139 -4569
4945 -4569 -5100 -10309 -15464 -19764 -17109 -16029 -16065 -8440 -8946 -15349 -6493 -1365 48 5863 -3587 -5736
4929 -5736 -6044 -9417 -7184 -4723 -7834 -7943 -8235 -4736 -3215 -5920 -6020 -4221 -4455 -3975 2741 -1491
4913 -1491 -6654 -3795 11991 6258 -4358 -8781 -2749 -3167 2184 5782 6955 6955 7909 11765 5514 167
4897 167 -1587 2481 4746 2978 1263 -1220 -6171 -9027 -14866 -9711 -1408 1372 3092 2600 -2491
4882 -2491 1352 1555 82 -3231 -5462 -1648 -6128 -6194 -6318 -5565 -9893 -7629 2428 6060 8203 4000
$$ packed form
4991a1806L042J75m464L283J3272K740p39p345n805O311J0508o70k078k750j428
4976B246l992O578O667L892o454j1612L92Q745j1549j1600M453O498k008K95N473
4961a976l039P037M2k196P342m085n183j104L081m353o720J0682P011J4o414m708
4945d569n31n209n155m300K655J080l6P625n06o403Q856N128J413N815r450k149
4929e736l08l373K233K461l111j09k92L499J521k705j00J799k34M80O716m232
4913a491n163K859J5786n733j0616m423O032m18N351L598J173%R54L856o251n347
4897A67j754M068K265j768j715k483m951k856n839N155Q303K780J720m92n091
4882b491L843K03j473l313k231L814m480o6j24P53m328K264J0057L632K143m203
$$ plain form
4866 4000 355 -8907 -12535 175 3589 604 6944 -1632 -3985 -2453 -6753 -6903 -4189 -8279 -9107
4851 -9107 -9967 -8268 -7424 2332 7957 5879 -2508 -9386 -1882 -377 2304 8195 6173 1704 -798
4836 -798 4782 4760 7977 3511 -1714 -5076 -8771 -12131 -10383 -13293 -9236 -3742 3115 8161 13202 9313
4820 9313 2611 941 1702 4843 12145 9792 1684 -917 668 5987 12143 9634 -834 -5405 -8352
4805 -8352 -8486 -13464 -11599 -14751 -10335 1364 6522 16003 13774 7595 2781 -1337 -3259 -5263 2336
4790 2336 7048 2358 -7657 -11687 -8302 -13566 -7901 1488 -1229 -4755 -11942 -6366 4587 2057
4776 2057 -3814 4511 2525 -9936 -8258 -6780 -15383 -14006 -13292 -14156 -6597 1043 -2385 -8338 -11464
4761 -11464 -12861 -8442 -7389 472 6549 10562 9982 6490 10723 4474 -3284 -6564 -5776 -9729 -9400
$$ packed form
4866D000l645r262l628J2710L414k985O340q576k353J532m300j50K714m090q28
4851i107q60J699Q44R756N625k078q387o878P504J505K681N891k022m469k502
4836g98N580k2L217m466n225l362l695l360J748k910M057N494O857N046N041l889
4820I313o702j670P61L141P302k353q108k601J585N319O156k509j0468m571k947
4805h352j34m978J865l152M416J1699N158R481k229o179m814m118j922k004P599
4790B336M712m690j0015m030L385n264N665R389k717l526p187N576J0953k530
4776B057n871Q325j986j2461J678J478q603J377P14q64P559P640l428n953l126
4761a1464j397M419J053P861O077M013n80l492M233o249p758l280P88l953L29
$$ plain form
4746 -9400 -9174 -7920 -8987 -3540 698 -84 -3730 -5525 2979 5999 6311 8226 19543 6039 -1590
4731 -1590 3983 18194 23002 18644 12931 6102 2017 -3849 -5113 928 8418 1359 266 -1172 4517
4716 4517 5649 -990 1862 841 -2362 -79 937 -2625 -1668 -2214 -3090 419 5563 5374 1689 2025
4700 2025 -2804 -3416 -6458 -9024 -13638 -3643 -1050 -9311 -8753 -10899 -8600 407 4976 40 -6565
4685 -6565 -9931 -12246 -8252 -6721 -4353 1258 9900 7436 739 1422 4170 2606 -4040 -4831 -2972
4670 -2972 -6455 -10215 -12145 -2058 8576 10609 15691 11926 2787 -7250 -13869 4731 13891 12720
4656 12720 13943 7211 5626 946 -3312 -6286 -22354 -22691 -5211 11056 11888 12788 13439 5842 -4530
4641 -4530 470 6232 4563 9038 561 -13262 -19620 -17996 -10214 -3389 1039 2136 299 11527
$$ packed form
4746i400K26J254j067N447M238p82l646j795Q504L020L12J915J1317j3504p629
4731a590N573J4211M808m358n713o829m085n866j264O041P490p059j093j438N689
4716D517J132o639K852j021l203K283J016l562R57n46q76L509N144j89l685L36
4700B025m829o12l042k566m614R995K593q261N58k146K299R007M569m936o605
4685f565l366k315L994J531K368N611Q642k464o697O83K748j564o646p91J859
4670b972l483l760j930J0087J0634K033N082l765r139j0037o619J8600R160j171
4656A2720J223o732j585m680m258k974j6068l37J7480J6267Q32R00O51p597j0372
4641d530N000N762j669M475q477j3823o358J624P782O825M428J097j837J1228
$$ plain form
4627 11527 5795 -4004 -9106 1401 8689 3904 -5902 -6975 767 -460 982 2179 4246 13186
4613 13186 12446 1914 799 -533 5733 7829 4380 894 -2368 -10886 -10678 -12459 -11517 -14095 -8383
4598 -8383 -9084 -2854 -3536 -3614 -3623 -4326 -6563 -22207 -26065 -17461 -9842 -5495 -721 2266 -9101 -16858
4582 -16858 -18672 -34516 -36970 -16230 -2785 -5667 -1418 944 12270 8941 -215 -8587 -9630 -1614
4568 -1614 -4872 -10745 -10849 -7905 -1614 -1266 -11365 167 16151 15664 -4636 -15325 -16091 -11096 -13585
4553 -13585 -11556 -3357 5772 14027 13022 3123 -4019 -4743 -1137 4115 5906 1256 3381 6352 123
4538 123 -3240 -4299 -6227 -4943 -2916 3761 -590 -512 8361 3306 -2263 6264 4529 3068 419 -6572
4522 -6572 -5045 688 -27 -3645 -244 -4006 6496 4721 -13827 -16373 -10461 4812 2957 -813
$$ packed form
4627A1527n732r799n102J0507P288m785r806j073P742j227J442J197K067Q940
4613A3186p40j0532j115j332O266K096l449l486l262q518K08j781R42k578N712
4598h383p01O230o82p8rp03k237j5644l858Q604P619M347M774K987j1367p757
4582a6858j814j5844k454K0740J3445k882M249K362J1326l329r156q372j043Q016
4568a614l258n873j04K944O291L48j0099J1532J5984m87k0300j0689p66M995k489
4553a3585K029Q199R129Q255j005r899p142p24L606N252J791m650K125K971o229
4538A23l363j059j928J284K027O677m351P8Q873n055n569Q527j735j461k649o991
4522f572J527N733p15l618L401l762J0502j775j8548k546N912J5273j855l770
$$ plain form
4508 -813 -5417 -9227 -7297 -7758 -14858 -20266 -21295 -9921 -727 1164 -2404 -189 -97 -2365 1093 -1981
4492 -1981 -5690 -1288 -5020 -3791 -5862 -5231 -13074 -7231 -3529 -2710 4237 4637 -1865 -6204 -10018 -13986
4476 -13986 -2122 4830 1066 -4431 -10958 -4923 2308 9182 9396 5661 2033 7955 6567 6211 11455
4461 11455 14836 9995 2763 2142 171 2513 1935 3319 8413 5605 3276 -3576 -9916 -3218 1405
4446 1405 2236 4002 4752 4652 -5157 -9976 -5972 -10153 -14977 -12159 -11415 -10016 632 7444 6741 -1111
4430 -1111 -8804 -9272 -1489 -1486 2484 5049 3258 -71 -10281 -5552 5019 2746 -10441 -13044 -2756
4415 -2756 -4353 -3481 -8977 -8057 517 -1420 -998 -209 -2299 -10084 -11780 -1995 8541 8405 2743 -3592
4399 -3592 -16301 -14571 -5579 -587 -6891 -6745 -7684 -4968 -9803 -20717 -19273 -7772 -4799 -10629 -15286
$$ packed form
4508h13m604l810J930m61p100n408j029J1374R194J891l568K215R2k268L458l074
4492a981l709M402l732J229k071O31p843N843L702Q19O947M00o502m339l814l968
4476a3986J1864O952l764n497o527O035P231O874K14l735l628N922j388l56N244
4461A1455L381m841p232o21j971K342n78J384N094k808k329o852o340O698M623
4446A405Q31J766P50j00r809m819M004m181m824K818P44J399J0648O812p03p852
4430a111p693m68P783LL970K565j791l329j0210M729J0571k273j3187k603J0288
4415b756j597Q72n496R20Q574j937M22P89k090p785j696R785J0536j36n662o335
4399c592j2709J730Q992M992o304J46r39K716m835j0914J444J1501K973n830m657
$$ plain form
4384 -15286 -17431 -12607 -2848 -6681 -3141 2125 15045 14452 10189 2172 -10127 -14760 -10295 -9661 -21272
4369 -21272 -26561 -28790 -17351 -4958 -7352 -19322 -15614 -5650 2050 -841 -16795 -9619 -7854 -10287
4355 -10287 -1647 3522 6763 8444 3790 4094 2508 -356 2780 -4283 -1615 -7378 -8091 -5985 -5787
4340 -5787 -7043 9641 12000 7819 -797 -6074 -3663 -7409 343 4497 4725 4115 11344 10175 6481
4325 6481 -395 -13604 -22598 -16835 -14923 -16227 -7196 -7083 -311 6930 9206 6494 1878 -896 -4663
4310 -4663 -4679 -1588 5203 -4577 -7290 -4183 824 -1138 -994 5840 11811 9103 2447 -5883 -4249 -4950
4294 -4950 -7640 -4030 1695 -948 -12152 -7551 -1747 8525 9360 -904 -5460 8437 19722 9910
4280 9910 -423 -3142 1427 7390 9262 365 8402 12601 12956 9271 10225 5528 -1126 -4300 114
$$ packed form
4384a5286k145M824R759l833L540N266J2920n93m263q017j2299m633M465O34j1611
4369b1272n289k229J1439J2393k394j1970L708R964P700k891j5954P176J765k433
4355a0287Q640N169L241J681m654L04j586k864L136p063K668n763p13K106J98
4340e787j256J6684K359m181q616n277K411l746P752M154K28o10P229j169l694
4325F481o876j3209q994N763J912j304R031J13O772P241K276k712m616k774l767
4310d663j6L091O791r780k713L107N007j962J44O834N971k708o656q330J634p01
4294d950k690L610N725k643j1204M601N804J0272Q35j0264m556J3897J1285r812
4280I910j0333k719M569N963J872q897Q037M199L55l685R54m697o654l174M414
$$ plain form
4265 114 6367 6859 3525 -2869 -152 4738 7197 3549 -4432 -16210 -13141 -10283 -13335 -13823 -12865 -8495
4249 -8495 -6840 -8303 -5040 -9120 -18613 -10631 -2867 1612 7463 9140 4169 2559 10086 13594 4697
4234 4697 -8645 -14498 -14686 -4409 -2029 3361 -1850 -5791 -1838 -7641 -8971 -13057 -9695 -3793 -3923
4219 -3923 -1370 7418 14110 4970 -552 2399 14184 16630 8058 4302 -1426 -9073 -15374 -9013 -3264
4204 -3264 4892 5904 3878 5880 -5548 -5533 4368 5496 -5654 -15041 -16992 -13873 -2964 2285 3204
4189 3204 2466 7323 8954 -4579 -1779 2131 -4470 -4243 12968 20286 21450 20899 11421 -432 -6619
4174 -6619 -13604 -7126 -8335 -14366 -12908 -20478 -19792 -17966 -16783 -6701 991 -7040 -11010 -15824 -19046
4159 -19046 -15274 -9592 2205 -2567 -3933 3 -3717 -7250 32 -3105 -2401 6387 7671 -222 427
$$ packed form
4265A14O253M92l334o394K717M890K459l648p981j1778L069K858l052m88R58M370
4249h495J655j463L263m080r493P982P764M479N851J677m971j610P527L508q897
4234D697j3342n853j88J0277K380N390n211l941L953n803j330m086L362N902j30
4219c923K553Q788O692r140n522K951J1785K446q572l756n728p647o301O361N749
4204c264Q156J012k026K002j1428J5R901J128j1150r387j951L119J0909N249R19
4189C204p38M857J631j3533K800L910o601K27J7211P318J164n51r478j1853o187
4174f619o985O478j209o031J458p570O86J826J183J0082P692q031l970m814l222
4159a9046L772N682J1797m772j366L936l720l533P282l137P04Q788J284p893O49
$$ plain form
4144 427 7522 7604 -5131 -7352 -8044 -373 6979 6323 1586 -4355 -7461 -1650 10605 13085 11144 7200
4128 7200 5422 -2919 -14904 -16292 -18931 -16532 -14636 -4910 1624 8087 4580 1076 2018 -3227 -10396
4113 -10396 -8679 -10217 -7954 -4501 3804 11609 9295 1032 -5307 -5730 -5697 -4435 -4723 -5233 -8984 -8314
4097 -8314 -8774 -9825 -9297 -10383 -13094 -11511 -6295 10937 16154 9031 12466 12372 6363 2080 2760 8898
4081 8898 7682 9145 10863 1137 665 1162 1804 6550 10845 14487 4628 -930 6550 8536 726 826
4065 826 6361 15995 14034 3966 -4116 -4395 6263 10996 7453 -721 -1632 -3429 -7565 -6985 -5936
4050 -5936 -2886 2945 10445 2400 -13484 -12382 -6383 483 541 13238 18093 23343 27787 18820 10865
4035 10865 11593 19742 15748 16144 18762 14229 3655 1013 10093 5867 -7044 -6958 8261 12837 2723
$$ packed form
4144D27P095Q2j2735k221o92P671P352o56m737n941l106N811J2255K480j941l944
4128G200j778q341j1985j388k639K399J896R726O534O463l507l504R42n245p169
4113a0396J717j538K263L453Q305P805k314q263o339m23L3J262k88n10l751O70
4097h314m60j051N28j086k711J583N216J7232N217p123L435r4o009m283O80O138
4081H898j216J463J718r726m72M97O42M746M295L642r859n558P480J986p810J00
4065H26N535R634j961j0068q082k79J0658M733l543q174r11j797m136N80J049
4050e936L050N831P500q045j5884J102N999O866N8J2697M855N250M444q967p955
4035A0865P28Q149l994L96K618m533j0574k642R080m226j2911Q6J5219M576j0114
$$ plain form
4020 2723 -5800 -16009 -8691 -881 1565 7815 11813 9901 9450 14587 17225 14302 11102 5245 3482
4005 3482 2778 -1587 -3969 -4169 -8257 -11242 -54 9584 8187 1013 4265 6125 6524 7061 12414 3744
$$ packed form
4020B723q523j0209P318P810K446O250L998j912m51N137K638k923l200n857j763
4005C482p04m365k382k00m088k985J1188R638j397p174L252J860L99N37N353q670
$$ [...]
##END NTUPLES=NMR SPECTRUM
##END=
