##TITLE=Analysis number 329619
Compound Code cc 59009
Book Reference 546/28
Project Code adrs
Chemist Name craigr
##JCAMPDX= 6.0         $$ Bruker NMR JCAMP-DX V2.0
##DATA TYPE= NMR SPECTRUM
##DATA CLASS= NTUPLES
##ORIGIN= Bruker BioSpin GmbH
##OWNER= nmr
$$ XWIN-NMR		Version 3.5
$$ Tue Sep 18 13:44:01 2007 GMT Daylight Time (UT+1h)  MAYBRIDGE\nmr@NMR_250MHZ
##.OBSERVE FREQUENCY= 250.131544655141
##.OBSERVE NUCLEUS= ^1H
##.ACQUISITION MODE= SIMULTANEOUS (DQD)
##.ACQUISITION SCHEME= undefined
##.AVERAGES= 16
##.DIGITISER RES= 18
##SPECTROMETER/DATA SYSTEM= dpx250
##.PULSE SEQUENCE= zg30
##.SOLVENT NAME= CDCl3
##.SHIFT REFERENCE= (INTERNAL, CDCl3, 0, 16.4563)
##AUDIT TRAIL= $$ (NUMBER, WHEN, WHO, WHERE, WHAT)
$$ ##TITLE= Audit trail, XWIN-NMR		Version 3.5
$$ ##JCAMPDX= 5.01
$$ ##ORIGIN= Bruker BioSpin GmbH
$$ ##OWNER= nmr
$$ C:\u/data/dgb/nmr/ADRS/1700/pdata/1/auditp.txt
$$ ##AUDIT TRAIL=  $$ (NUMBER, WHEN, WHO, WHERE, WHAT)
(   1,<2007-09-18 13:43:37.70 +100>,<MAYBRIDGE\nmr>,<NMR_250MHZ>,
      <created by zg, POWCHK disabled, PULCHK disabled
       configuration hash MD5:
       76 6E 9A 78 1E 09 19 81 EC 84 63 8F B0 6A 59 2D
       data hash MD5: 64K
       D3 5E FA 69 DF 9F 9D A0 4A 44 04 77 C9 D3 9F E0>)
(   2,<2007-09-18 13:43:53.17 +100>,<MAYBRIDGE\nmr>,<NMR_250MHZ>,
      <Start of raw data processing
       ef LB = 0.3 FT_mod = 6 PKNL = 1 SI = 32K 
       data hash MD5: 32K
       E5 A1 B0 06 9B 0E 68 4E 7F EA 10 47 4B BA F9 E2>)
(   3,<2007-09-18 13:43:54.98 +100>,<MAYBRIDGE\nmr>,<NMR_250MHZ>,
      <apk 
       data hash MD5: 32K
       A3 3D DD B4 7A 01 44 C3 9D 19 2A 33 8B 3E EC 60>)
(   4,<2007-09-18 13:43:55.82 +100>,<MAYBRIDGE\nmr>,<NMR_250MHZ>,
      <abs ABSG = 5 
       data hash MD5: 32K
       0A D5 54 44 FF B5 EC 5F 5F ED E9 75 21 70 59 72>)
$$ ##END=
$$ 
$$ hash MD5
$$ 30 10 59 72 C0 06 BF E5 0D EA A4 24 C2 B3 20 D4
##$RELAX= 
##$RELAX= 
##$RELAX= 
##$RELAX= 
##$RELAX= 
##$RELAX= 
##$RELAX= 
$$ Bruker specific parameters
$$ --------------------------
##$DU= <C:\u>
##$EXPNO= 1700
##$NAME= <ADRS>
##$PROCNO= 1
##$TYPE= <nmr>
##$USER= <dgb>
##$AMP= (0..31)
100 100 100 100 100 100 100 100 100 100 100 100 100 100 100 100 100 100 
100 100 100 100 100 100 100 100 100 100 100 100 100 100 
##$AQSEQ= 0
##$AQ_mod= 3
##$AUNM= <au_zg>
##$AUTOPOS= <32 >
##$BF1= 250.13
##$BF2= 250.13
##$BF3= 250.13
##$BF4= 250.13
##$BF5= 500.13
##$BF6= 500.13
##$BF7= 500.13
##$BF8= 500.13
##$BYTORDA= 1
##$CFDGTYP= 0
##$CFRGTYP= 5
##$CHEMSTR= <none>
##$CNST= (0..31)
1 1 145 1 1 1 1 1 1 1 1 1 1 1 1 1 1 1 1 1 1 1 1 1 1 1 1 1 1 1 1 1 
##$CPDPRG= <>
##$CPDPRG1= <>
##$CPDPRG2= <>
##$CPDPRG3= <>
##$CPDPRG4= <mlev>
##$CPDPRG5= <mlev>
##$CPDPRG6= <mlev>
##$CPDPRG7= <mlev>
##$CPDPRG8= <mlev>
##$CPDPRGB= <>
##$CPDPRGT= <>
##$D= (0..31)
0 1 0 0 0 0 0 0 0 0.06 0 0 0 0 0 0 0.0002 0 0 0 0 0 0 0 0 0 0 0 0 0 0 
0 
##$DATE= 1190119415
##$DBL= (0..7)
120 120 120 120 120 120 120 120 
##$DBP= (0..7)
150 150 150 150 150 150 150 150 
##$DBP07= 0
##$DBPNAM0= <>
##$DBPNAM1= <>
$$ [...]
##$SUBNAM7= <"">
##$SUBNAM8= <"">
##$SUBNAM9= <"">
##$SW= 20.6930455092707
##$SWIBOX= (0..15)
0 0 3 0 0 0 0 0 0 0 0 0 0 0 0 0 
##$SW_h= 5175.983436853
##$TD= 65536
##$TD0= 1
##$TE= 296.16
##$TE2= 300
##$TE3= 300
##$TEG= 300
##$TL= (0..7)
0 120 120 120 120 120 120 120 
##$TP= (0..7)
150 150 150 150 150 150 150 150 
##$TP07= 0
##$TPNAME0= <>
##$TPNAME1= <>
##$TPNAME2= <>
##$TPNAME3= <>
##$TPNAME4= <>
##$TPNAME5= <>
##$TPNAME6= <>
##$TPNAME7= <>
##$TPOAL= (0..7)
0.5 0.5 0.5 0.5 0.5 0.5 0.5 0.5 
##$TPOFFS= (0..7)
0 0 0 0 0 0 0 0 
##$TUNHIN= 0
##$TUNHOUT= 0
##$TUNXOUT= 0
##$USERA1= <user>
##$USERA2= <user>
##$USERA3= <user>
##$USERA4= <user>
##$USERA5= <user>
##$V9= 5
##$VALIST= <valist>
##$VCLIST= <CCCCCCCCCCCCCCC>
##$VD= 0
##$VDLIST= <DDDDDDDDDDDDDDD>
##$VPLIST= <PPPPPPPPPPPPPPP>
##$VTLIST= <TTTTTTTTTTTTTTT>
##$WBST= 1024
##$WBSW= 4
##$XGAIN= (0..3)
0 0 0 0 
##$XL= 0
##$YL= 0
##$YMAX_a= 460380
##$YMIN_a= -581647
##$ZGOPTNS= <>
##$ZL1= 120
##$ZL2= 120
##$ZL3= 120
##$ZL4= 120
##$ABSF1= 16.4563
##$ABSF2= -4.236872
##$ABSG= 5
##$ABSL= 3
##$ALPHA= 0
##$AQORDER= 0
##$ASSFAC= 0
##$ASSFACI= 0
##$ASSFACX= 0
##$ASSWID= 0
##$AUNMP= <proc_1d>
##$AZFE= 0.1
##$AZFW= 0.1
##$BCFW= 0
##$BC_mod= 0
##$BYTORDP= 0
##$COROFFS= 0
##$CY= 12.5
##$DATMOD= 1
##$DC= 0
##$DFILT= <>
##$DTYPP= 0
##$F1P= 14.0000005364418
##$F2P= -0.99999901652339
##$FCOR= 0.5
##$FTSIZE= 32768
##$FT_mod= 6
##$GAMMA= 0
##$GB= 0
##$INTBC= 1
##$INTSCL= 1
##$ISEN= 128
##$LB= 0.3
##$LEV0= 0
##$LPBIN= 0
##$MAXI= 10000
##$MC2= 0
##$MEAN= 0
##$ME_mod= 0
##$MI= 0
##$NCOEF= 0
##$NC_proc= -3
##$NLEV= 6
##$NOISF1= 0
##$NOISF2= 0
##$NSP= 0
##$NTH_PI= 0
##$NZP= 0
##$OFFSET= 16.4563
##$PC= 1
##$PHC0= 158.1931
##$PHC1= 5.769389
##$PH_mod= 1
##$PKNL= yes
##$PPARMOD= 0
##$PSCAL= 4
##$PSIGN= 0
##$REVERSE= no
##$SF= 250.130016431733
##$SI= 32768
##$SIGF1= 0
##$SIGF2= 0
##$SINO= 400
##$SIOLD= 32768
##$SREGLST= <1H.CDCl3>
##$SSB= 0
##$STSI= 32768
##$STSR= 0
##$SW_p= 5175.98343685301
##$SYMM= 0
##$S_DEV= 0
##$TDeff= 65536
##$TDoff= 0
##$TI= <Analysis number 999999
Compound Code 99
Book Reference 9
Project Code 9>
##$TILT= no
##$TM1= 0
##$TM2= 0
##$TOPLEV= 0
##$USERP1= <user>
##$USERP2= <user>
##$USERP3= <user>
##$USERP4= <user>
##$USERP5= <user>
##$WDW= 1
##$XDIM= 32768
##$YMAX_p= 285624076
##$YMIN_p= -205587
$$ End of Bruker specific parameters
$$ ---------------------------------
##NTUPLES= NMR SPECTRUM
##VAR_NAME=  FREQUENCY,     SPECTRUM/REAL,   SPECTRUM/IMAG
##SYMBOL=    X,             R,               I
##VAR_TYPE=  INDEPENDENT,   DEPENDENT,       DEPENDENT
##VAR_FORM=  AFFN,          ASDF,            ASDF
##VAR_DIM=   32768,         32768,           32768
##UNITS=     HZ,            ARBITRARY UNITS, ARBITRARY UNITS
##FACTOR=    0.157963299565203, 1,           1
##FIRST=     4116.21477336956, 0,            0
##LAST=      -1059.76866348345, 0,           0
##MIN=       -1059.76866348345, -205587,     0
##MAX=       4116.21477336956, 285624076,    0
$$ Real data points
##PAGE= N=1
##DATA TABLE= (X++(R..R)), XYDATA
$$ [...]
15972E9892r983J3625j0484j0148r967R280K3321r677l9015K4740j479k9810k2784
15959a2489j1611n946O884q062J1500J6478o125N090j591K8560k780j1263J1593
15946B0238j2409J8082M12j4909q320m655J5052J4642M41j1019l4190j8861r624
15933d5120L515p073j0959L999K6453K0103K9030J1752M408P967J8845n669l2583
15920B4668j0831J0464k9235K425J2259J4191K1233n322k914j1891k4656k0095
15908a9704J466J4833M085n160P281m4L149P329M735l6782k8513J9365K7226J8790
15894A8056n811M721l0925Q217j113j4793L972K3188J2115k1197l1905K4821M491
15881f163J0147J7188P633k564K7479l912j9704O898k4387k2315R64J6391n632
$$ plain form
15972 59892 49909 63534 53050 42902 32935 42215 65536 55859 16844 41584 40105 10295 -12489
15959 -12489 -24100 -30046 -23162 -31224 -19724 -3246 -9371 -4281 -5872 22688 19908 8645 20238
15946 20238 7829 25911 26323 11414 3094 -1561 13491 28133 28574 17555 -16635 -35496 -45120
15933 -45120 -41605 -48678 -59637 -55638 -29185 -9082 19948 31700 36108 44075 62920 57251 24668
15920 24668 13837 24301 -4934 -2509 9750 23941 45174 39852 36938 25047 391 -19704
15908 -19704 -18238 -3405 680 -4480 2801 2757 5906 13235 17970 -18812 -47325 -27960 -734 18056
15894 18056 12245 16966 -13959 -5742 -6855 -21648 -17676 5512 17627 -3570 -35475 -10654 -6163
15881 -6163 3984 21172 28805 26241 53720 49808 30104 37002 12615 -9700 -8736 7655 2023
15868B023o59p599Q883K596J3420l852k671m737km302r655L675K8125k526j531
15853B1188J455j5496k2524r980J7176K772N404r407M590N748j1086j2920k193
15840b5273J1452K286L777j5749M857P544J3841p409Q580l6175j4848J6410J9996
15827a0711k6584j939M403K7772Q075L865M283k2252m649R942o375K301m48l528
15813a5845j0032O541l893j4908M037J5700K9696J1924P821k43r871m469P763
15800B4221j3238l8755L42l015m227o583J9041Q718K2276R274k2007m458j9545
15787b7956j6382r454L2777L0350J7048r253m960k586J488J044n609p506j8835
15774a9834l011J9932J1059P326k5092j1516j6864K232J8193j6259K696k806j1695
$$ plain form
15868 2023 1364 -6235 2648 5244 18664 14812 12141 7404 7402 3100 -6555 -2880 25245 22719 21188
15853 21188 22643 7147 -15377 -25357 -8181 -5409 -5 -9412 -4822 926 -10160 -23080 -25273
15840 -25273 -13821 -11535 -7758 -23507 -18650 -11106 2735 -4674 3906 -32269 -47117 -30707 -10711
15827 -10711 -37295 -39234 -34831 -7059 1016 4881 9164 -13088 -17737 -7795 -14170 -11869 -12317 -15845
15813 -15845 -25877 -19336 -23229 -38137 -34100 -18400 11296 23220 31041 30798 20927 16458 24221
15800 24221 10983 -27772 -27430 -30445 -34672 -41255 -22214 -13496 8780 18054 -3953 -8411 -27956
15787 -27956 -44338 -53792 -21015 9335 26383 17130 12170 9584 11072 12116 6507 -999 -19834
15774 -19834 -22845 -2913 8146 15472 -9620 -21136 -38000 -35768 -17575 -33834 -31138 -33944 -45639
15761d5639P729K790J3032J2450m8R336J3153M127l8776k2052K570J0917J442
15748b8969q580K3311O317M3140K3389j6507j7980j3552K770k501k1104k1263
15736c1529o446n425J3244r26J4976K8053j1947L052P688j3205J41o423J8392
15723I645M462J6329q514M375k127k1307j6j6089l324J9961K7151J2129j1189
15710C1486L742R731k059J7923j1437p326K2037k9835k4727m906J2905K0129P000
15697D4663r417J2906k5061L402K319j2652j1322k0651Q579K2657O594o341O385
15684B2061R537L2076J4260k5325k6582O553j6776J6092j1849o870K708j8100
15672b215n36L7852P494j6977J1147j1536p125J6456j8386l3128k525J7979q28
$$ plain form
15761 -45639 -37910 -35120 -22088 -9638 -9686 -350 12803 16930 -21846 -43898 -41328 -30411 -28969
15748 -28969 -37549 -14238 -7921 35219 58608 42101 24121 10569 13339 10838 -10266 -31529
15736 -31529 -37975 -43400 -30156 -31082 -16106 11947 0 3052 10740 -2465 -2324 -8747 9645
15723 9645 14107 30436 21922 26297 24170 2863 2847 -13242 -16566 3395 30546 42675 31486
15710 31486 35228 44959 42900 60823 49386 42060 64097 34262 9535 4629 17534 37663 44663
15697 44663 35246 48152 23091 26493 28812 16160 4838 -15813 -7234 15423 22017 15676 22061
15684 22061 31598 63674 77934 52609 26027 32580 15804 31896 20047 13177 15885 -2215
15672 -2215 -2751 35101 42595 25618 36765 25229 18104 34560 16174 -16954 -19479 -1500 -2328
15659b328k4394K0076N2087j6912k6922K556J540q64l333q899K062P592m043j01
15645a883j5130N301J4432K6976J0662j8181J1168n831j1886K6157J4344J2124
15633F8253q985m5350l8534K2735R177J521j1900j1921o195K876L7034J9276o351
15620C1636j5080k1878j1416K2931N463j2566O666N016M602J3440Q822j1041J2187
15607C8782r724j7640o79j007n003J9585J160j5217k0297O287J8035P3j1997J39
15593B497j2610J3814K3245J7312j1876k3733k2153Q427J3200J1072j9969j6158
15581a6932J0857L9830N677j6631j9410m176J8034L7168K6522j4364j2541j9927
15569C4107J501J0704P11J226j1768j3240k2796j490J5630K2185J899k2231l26
$$ plain form
15659 -2328 -26722 -6646 45441 28529 1607 4163 5703 4839 1506 -7393 -5331 2261 -1782 -1883
15645 -1883 -17013 -11712 2720 29696 40358 22177 33345 27514 15628 41785 56129 68253
15633 68253 59268 13918 -24616 -1881 7296 8817 -3083 -15004 -21199 -18323 18711 37987 31636
15620 31636 16556 -5322 -16738 6193 11656 -910 5756 10772 15374 28814 37636 26595 38782
15607 38782 29058 11418 10739 9732 4729 24314 25474 10257 -10040 -3753 14282 14355 2358 2497
15593 2497 -10113 3701 26946 44258 32382 8649 -13504 -5077 8123 19195 -774 -16932
15581 -16932 -6075 33755 39432 22801 3391 -785 17249 54417 80939 66575 54034 34107
15569 34107 35608 46312 47023 48249 36481 23241 445 -1045 14585 36770 38669 16438 16112
15556A6112K4729J1954K0087n119k37q863k2226r787M456k502N695j8163J516
15543A7652J0455L431J2740J077k505J7277r508J5564k795Q306l459J5069K1596
15530A04900j8228l4731p223j0777P208K2577Q631J3737J1813j3870k1208j5496
15518D7333p920l74J8535r082k7607j3491r944J4513R032k271p349J9063M8069
15505G8507J127p430j0989o709j008O383J0770j5247k7386K0796j4848l5458p421
15492h913K8579K735K030O169o481M0050K7367J5261j6507j4375J9957J304m088
15479I3088n170k6127j5372J0959J3772J5140K6446J6971j3289n1908r498N862
15467F0874p493k8432l551J8881J9485M595k2343j5749J5214K5311J3818J0007
$$ plain form
15556 16112 40841 52795 72882 67763 67526 58663 36437 26650 31106 28604 34299 16136 17652
15543 17652 28107 31538 44278 45355 42850 60127 50619 66183 63388 71694 68235 83304 104900
15530 104900 86672 51941 44718 33941 41149 63726 72357 86094 97907 84037 62829 47333
15518 47333 39413 39039 57574 48492 20885 7394 -2550 11963 20995 18724 11375 30438 78507
15505 78507 79634 72204 61215 54506 53498 59881 70651 55404 28018 48814 33966 -1492 -8913
15492 -8913 19666 22401 24431 30600 24119 64169 91536 106797 90290 75915 95872 97176 93088
15479 93088 87918 61791 46419 57378 71150 86290 112736 129707 116418 64510 55012 60874
15467 60874 53381 24949 21398 40279 59764 64359 42016 26267 41481 66792 80610 90617
15455I0617l4096j8641j4020J8559K1379K04N114k9297L386k101J9254R705J9154
15442H9217k4603k1980p666n248N431L53k0473q71J9773J5463J9715j3010q525
15429D7576K3132K652n104J6201m586N545j3916j5656r232j9893L0182L7824J282
15416I6007k7124j6640k2111J1242j0194p904j4530N418O287j545n482K332N086
15403B0842j4529n917J5432J8090K1180q502j9128K7527P11j4351J8395r735J4158
15390F4173M850j2458l180j4460M897k389M37J217j6344k386K9090K193j3762
15377D1878l542p372m433ol703n653k149K5596K3649L1912j3059K454k3902n10
15363F1160L707J0189l402n313J55Q874N984n06p687j9123J5723Q028q798O424
$$ plain form
15455 90617 56521 37880 23860 42419 63798 64002 69116 39819 43205 41104 60358 70063 89217
15442 89217 64614 42634 34968 29720 35151 35504 15031 14160 33933 49396 69111 56101 47576
15429 47576 70708 73360 68256 84457 79871 85416 71500 55844 46612 26719 56901 94725 96007
15416 96007 68883 52243 30132 41374 31180 23276 8746 14164 20451 18906 13424 15756 20842
15403 20842 6313 396 15828 33918 55098 46596 27468 54995 55706 41355 59750 50015 64173
15390 64173 69023 56565 53385 38925 43822 41433 41870 43087 26743 24357 53447 55640 41878
15377 41878 38336 30964 26531 26525 22822 17169 15020 40616 64265 96177 83118 85572 61670 61160
15363 61160 64867 75056 71654 66341 66496 75370 81354 80848 73161 54038 69761 77789 68991 75415
15349G5415l397k2548m558j2940K8461J5237k6867Q782K2738L0855l511l3646
15337G4021j0105L8043j4256k2260q977J996K38p082R18q064l58L7569J7332j969
15323I7046M028j8938j9035Q626j2249P008j0063o240k2547j0160K5652J9022
15311F2150l5009l1348O637L6453K3590j2466l8386m105L6509j0064K2299J9727
15299G5987k3916O245O129m307k4047J1463Q210O150J5168k8383N56K8404K3437
15286A01096k5092l7749k5579l4496J0326M2219L3220k3581K384j2909J2592J3098
15274E5529k463j4195K7620q718J1434J7952J1378j6188k7586k5640J4368J4622
15262E8113k0820Q583K6100j1293l7443l41K5954J4059L571m409r482j7621k1694
$$ plain form
15349 75415 72018 49470 44912 31972 60433 75670 48803 57585 80323 111178 107667 74021
15337 74021 63916 101959 87703 65443 56466 58462 58700 51618 52536 44472 44114 81683 99015 97046
15323 97046 101074 82136 63101 71727 59478 66486 56423 50183 27636 17476 43128 62150
15311 62150 27141 -4207 2430 38883 62473 50007 11621 7516 44025 33961 56260 75987
15299 75987 52071 58316 64445 60138 36091 47554 55764 61914 77082 48699 49255 77659 101096
15286 101096 76004 38255 12676 -21820 -11494 30725 63945 40364 42748 29839 42431 55529
15274 55529 53066 38871 66491 57773 69207 87159 98537 82349 54763 29123 43491 58113
15262 58113 37293 45876 71976 60683 23240 22899 48853 62912 66483 62074 52592 34971 13277
15249A3277O812O323J4336L4901O414l4457m7302j1841N267k004j8675l550J8155
15236a2344M6582p545p790N121Q202R457J6667k3618K1681K0675j0397j4315L4921
15223H7297O396j9021k8041k3559L287m30j9712j0754J3223O266J9896k842j7646
15210A4360J7593L2127q614k6425P074L4239J0319r047o643j1512o169j758p80
15197D4764J324K0042m237J843k238k4749k2081K0630J2290j868k9390p298j1241
15184b209N454r020K0518J7798j7510m986r136J0328o702J002K7457q271q521
15171A6202j582l709R421j9174m0N1734K8759J1392r400l7267k292m988K3749
15158F2805J4714o499K636k0013k9006L4461J7652j2508l0950j2768J4777K1937
$$ plain form
15249 13277 20089 26412 40748 75649 82063 47606 304 -11537 -6270 -8274 -26949 -30499 -12344
15236 -12344 34238 26693 18903 24024 32226 41683 58350 34732 56413 77088 66691 52376 87297
15223 87297 93693 74672 46631 23072 26359 25929 6217 -4537 8686 14952 34848 32006 14360
15210 14360 31953 64080 55466 29041 36115 70354 80673 71626 64983 53471 47302 45544 44764
15197 44764 46088 66130 61893 63736 61498 36749 14668 35298 47588 45720 16330 9032 -2209
15184 -2209 3245 -5775 14743 32541 15031 10045 909 11237 4535 5537 32994 24723 16202
15171 16202 14620 10911 20332 1158 1118 52852 81611 93003 83603 46336 44044 39056 62805
15158 62805 77519 71020 73656 53643 24637 59098 76750 64242 33292 20524 35301 57238
15146E7238J8430P567l1196l5849p65l195j0046m371M304k522o26P912P751p434
15132G198j3785J617j1219K7711J3093j1014j2797L939Q699k3152M584K9889K3070
15119D7833j137L18m1636K328K1643J1580n566J0799q822o494j8328j4444O90
15106a236J8808J0395N080J5611m7M487k7272L025K5619R315k6388R41n63J0705
15092D8480k0025l1450J5882o617j3653j3467k6317m089L0507O320Q529R666O957
15079A0723K8254p536q897r292j5657k2621j4791R265L2356L3063M133m162J2068
15066D6906J9814k6222j2244K5114J2523R256q204k6335k2047j4672Q388J9437
15054C1714l0765j0528n294K2127N36j172m780J8055R80l880J8086J6368J8236
$$ plain form
15146 57238 75668 83235 52039 16190 15425 12230 2184 -2187 2117 -405 -1031 6881 14632 7198
15132 7198 -6587 -4970 -16189 11522 24615 13601 804 4743 13442 -9710 -5126 24763 47833
15119 47833 46696 47014 5378 7706 29349 40929 35363 46162 37340 30846 12518 -1926 -1236
15106 -1236 17572 27967 33047 48658 48611 53098 25826 28851 54470 63785 37397 38338 37775 48480
15092 48480 28455 -2995 12887 6270 -7383 -20850 -47167 -51256 -20749 -14429 -5900 3766 10723
15079 10723 38977 31441 22544 13252 -2405 -25026 -39817 -30552 1804 34867 39000 34838 46906
15066 46906 66720 40498 28254 53368 65891 75147 66943 40608 18561 3889 12277 31714
15054 31714 949 -9579 -14873 7254 7790 6618 1838 19893 20873 16993 35079 51447 69683
15041F9683m453J005j9504k5215P616J1952P656N344k0294j7130Q896K0931o808
15028C9679m6180j5648Q722J1830j5906J1409K648K517M894K6509k5216j1136
15016e878K6041J8950k658j927j5892N447r186m0818p2J8282J49L096J1658L7235
15002D4427J3954K8342l3597k6278j1069Q16r616O987K029j3084N366n991P249
14989I535K4543j236l7598r860j3726Q865K9238j6987j263K1968J2543P945j3546
14976B0421k0158J102j3486L738j1476J2864R670j2671j0101j0398o259j4784
14964e1538j0456N376L651K2907J1901J4142K3093l0998k9558K3485L7094J371
14952B0470k9774k8888L643J8170p069J7941M177l199k9498K47P81R327J4172
$$ plain form
15041 69683 65230 66235 46731 21516 29132 41084 48740 54084 33790 16660 25556 46487 39679
15028 39679 -6501 -22149 -13427 -1597 -17503 -6094 -3446 -929 3965 30474 5258 -5878
15016 -5878 20163 39113 36455 34528 18636 24083 14897 -25921 -25993 -7711 -7562 -4466 7192 44427
15002 44427 58381 86723 53126 26848 15779 16595 6979 13966 15995 2911 8277 2286 9535
14989 9535 34078 32842 -4756 -14616 -28342 -19477 9761 -7226 -8489 13479 26022 33967 20421
14976 20421 263 1365 -12121 -8383 -19859 -6995 2675 -9996 -20097 -30495 -36754 -51538
14964 -51538 -61994 -56618 -52967 -30060 -18159 -4017 19076 -11922 -41480 -17995 19099 20470
14952 20470 -9304 -38192 -34549 -16379 -23448 -5507 -1330 -4529 -34027 -33780 -32999 -23672 -9500
14939i500J5639J3108j0600o638K214J1906K096q798n794K35J9277M616k4841
14926B920m213J801Q13k2488P011m791R867K3146K6395k4191k8799M929N022j3236
14912a5814L3495J8860j2330o594l9592M798J0422j1569j359Q463L6361K702k0239
14899G604k588n124k0935n360l2817N300N4295K0451N407p836o291m353J192R595
14885A8540j4486j268j2564l293j1344R103K9741r17j834r35o87j254k4870j1657
14871b7725Q240K1736Q934P054J546J6072m907k5806K248L1818J2547k248j3545
14858C5964j1699q918K0051r576K788j210J2479k0338o674J5371l0003k5433O509
14845b0689J0772J2124j3495j7165r988L308J8835R354K8629J4064j7133K50M050
$$ plain form
14939 -9500 6139 19247 8647 2009 4223 16129 18225 9427 3633 3868 23145 27761 2920
14926 2920 -1293 508 1321 -21167 -14156 -18947 -9080 14066 40461 16270 -12529 -7600 -2578 -15814
14912 -15814 17681 36541 24211 17617 -21975 -17177 -6755 -18324 -19683 -11220 25141 27843 7604
14899 7604 5016 -108 -21043 -26403 -59220 -53920 375 20826 26233 18397 12106 7753 8945 18540
14885 18540 4054 2786 -9778 -13071 -24415 -15312 14429 13512 11678 10743 10056 8802 -16068 -27725
14871 -27725 -19485 2251 11185 18239 19785 35857 30950 5144 7392 39210 51757 49509 35964
14858 35964 24265 15347 35398 25822 28610 27400 39879 19541 12867 28238 -1765 -27198 -20689
14845 -20689 -9917 2207 -11288 -28453 -38441 -35133 -16298 -6944 21685 35749 18616 18866 22916
14832B2916l999r637l1148j7409K750J1403J2193j9869j3099K004N994m406P296
14819c5011j586P827J2565K159L4816j7018j0004q699R864j5420k4275M208L1383
14806i191K2537K6052R118j6889n93j1963j0347q068K054L920R478j8309o256
14793h457L0660K7824j5420m04M380m5733j3132r445M212j6607p3J6237J8861
14780g097k3200J541P725N894O56J2349J2918k78J92J3542J256p099k4011k287
14766g899J9634m713k853r080o811J4278Q506L361j6563l9679j7682J1396K0265
14753b7840k3622j7575n737J0823R571R577K1067k267J8304R4K5228K3457l8041
14740C039j8517Q383K6785j5527p263L1875j2482r197L25p169j0436J6844J1650
$$ plain form
14832 22916 18917 9280 -21868 -39277 -36527 -25124 -12931 -32800 -45899 -43895 -37901 -42307 -35011
14819 -35011 -36597 -28770 -16205 -14046 20770 3752 -6252 -14951 -5087 -20507 -44782 -40574 -9191
14806 -9191 13346 39398 48516 31627 31034 19071 8724 656 2710 6630 16108 -2201 -8457
14793 -8457 22203 50027 34607 34203 38583 -7150 -20282 -29727 -25515 -42122 -42195 -25958 -7097
14780 -7097 -30297 -28756 -21031 -15137 -14481 -2132 10786 10508 10700 24242 25498 18399 -5612 -7899
14766 -7899 11735 7022 4169 -4911 -11722 2556 11062 14423 -2140 -41819 -59501 -48105 -27840
14753 -27840 -51462 -69037 -74774 -63951 -54380 -44803 -23736 -26003 -7699 -7605 17623 41080 3039
14740 3039 -15478 -7095 19690 4163 -3100 28775 16293 7096 7421 252 -10184 6660 18310
14727A8310R353j722n216K0400k246o532l3291j2429j0349M390N101p312l308
14714b4851K8841J4258j7307r580k2283P252K4271J6445Q029J8851j5556p844
14702B0526M40J8855J5906n3757m8250O892J4215J6164J9131j6269j4273K381
14690a8039j7287q641J4639L8772k7250q826J4307J359K6566k766j0396M868m602
14677B704p381j30J1013J0157j215o556j0754n904Q549j2966n417J4452o691l331
14663a3470k242k144j9494M269K832J133K3256L778j2687K1516k163J1026R621
14650B5231J900j8676m186j9222l313p192j8082Q057K4988J2575P521j0809j8623
14637a9831K9566J9475l0104l562K4992m1779k2366K5839J9593J0926R170J8735
$$ plain form
14727 18310 27663 25941 20725 41125 38879 32347 -944 -13373 -23722 -19332 -14231 -21543 -24851
14714 -24851 3990 18248 941 -8639 -30922 -23670 601 17046 25075 43926 28370 20526
14702 20526 20966 39821 55727 1970 -46280 -39388 -25173 -9009 10122 -6147 -20420 -18039
14690 -18039 -35326 -43967 -29328 9444 -17806 -26632 -12325 -10966 15600 12834 2438 7306 2704
14677 2704 -4677 -4807 6206 16363 15148 8592 -2162 -8066 483 -12483 -17900 -3448 -10139 -13470
14663 -13470 -15712 -17856 -37350 -33081 -30249 -29116 -5860 -2082 -14769 6747 4584 15610 25231
14650 25231 27131 8455 4269 -14953 -18266 -25458 -43540 -35483 -10495 2080 9601 -1208 -19831
14637 -19831 9735 29210 -894 -4456 20536 -21243 -43609 -17770 1823 12749 21919 40654
14625D0654N127L264P70m3110j7676J993K3507J13j338j0617j9263J501K7163
14612A2088p395l266l228M737K896m8442l787K9621n41J0051R544K2737l1210
14599f195l0809j4911J0848J1244M354O485k4043o657P470L2295K8151m245o017
14586G970j0051l3047o123l171J6997M978k4120l1650j947L8094K2588J4563J2345
14573G426R763P362K5617N60k4289j2442K325j2605L347p682l809r259k022Q087
14559g621j2826j7463k3787K1557K8057L630J1990J545J348L5916M823p508j1194
14546B8467j0065m871j7641j6185j2774Q425K9614q36j3417J5594M094l32Q579
14533A8652j4318K722J9456j6602m1607K5691P388N682j2943n7451j1357M983
$$ plain form
14625 40654 45781 49045 49815 6705 -10971 -8978 14529 14642 13304 2687 -16576 -15075 12088
14612 12088 4693 1427 -1801 2936 5832 -42610 -46397 -16776 -17317 -7266 2278 25015 -6195
14599 -6195 -37004 -51915 -41067 -29823 -25469 -18984 -43027 -49684 -42214 -9919 18232 13987 7970
14586 7970 -2081 -35128 -41251 -44422 -27425 -22447 -46567 -78217 -80164 -42070 -19482 -4919 7426
14573 7426 17189 24551 50168 50728 26439 13997 16322 3717 7064 -618 -4427 -13686 -15708 -7621
14559 -7621 -20447 -37910 -61697 -40140 -12083 -8453 3537 5082 6430 42346 47169 39661 28467
14546 28467 18402 13531 -4110 -20295 -33069 -24644 4970 4134 -9283 6311 10405 10073 18652
14533 18652 4334 7056 26512 9910 -31697 -6006 1382 7064 -5879 -63330 -74687 -69704
14521f9704M1025J2493K7850J8975Q557N557p643o891n428j9341q941K1952j0039
14508H422k5189m1692m981L453K50P166M1893Q494m397k9150j249J5589L1207
14495I816J5056J578l6926M5j4904o163J0858J3884O001J5101m457l835K836J8910
14481B7800J532j3168n186J8034J5469j2145k7078m821J2885j4033k3528k3175
14469d7414q469o911L5899K9581R076Q039j5572j7748L3596o372k2217l756P401
14456d867j3273J9022K419L130m404L0351l418k1567j4662j2312l367J8101j4585
14443a9432q125Q146j0886K5575J11m376j6220Q208P501K6051K2682p341m4212
14430a2318j3551l310Q346L8964L4388j9756j1232J5116K616m7498j1999K465
$$ plain form
14521 -69704 -28679 -16186 11664 30639 39196 44753 37110 30219 24791 5450 -3491 18461 8422
14508 8422 -16767 -58459 -63440 -59987 -59737 -52571 -10678 -2184 -6581 -35731 -36980 -21391 9816
14495 9816 24872 26450 -10476 -10431 -25335 -31498 -20640 -6756 -755 14346 9889 6054 8890 27800
14481 27800 29332 16164 10978 29012 44481 32336 5258 437 13322 -711 -24239 -47414
14469 -47414 -55883 -62794 -26895 2686 11762 19801 4229 -13519 20077 13705 -8512 -12268 -4867
14456 -4867 -18140 882 3301 6431 2027 32378 28960 7393 -7269 -19581 -22948 -4847 -19432
14443 -19432 -27557 -19411 -30297 -4722 -4611 -8987 -25207 -16999 -9498 16553 39235 31894 -12318
14430 -12318 -25869 -29179 -20833 18131 52519 32763 21531 36647 39263 -8235 -20234 -17769
14418a7769j8256k361J4972N335J3307p921O147J3194J3367j5793j0764L883j514
14405d173l340n951l13J1923L7001L534k5657J5411M542j4664j0560j3633m214
14392a0094j5658J8969J9721N307J5306J9632J806j4587k2440q356j5088O770
14380A288p179P966J658j7149m42O900j4471O481K7383l05l197j777K0014K2709
14366D9879j7084l4845k4496M23K6416K862q68L617L99n256m404K0570K1596R713
14352D8522j2852k4701j9161p444K548M28J1245J686R153o982k0749p002m60P999
14338a7770J2760M0570p773k9179K395J4094K0092M775j3427M162k0122j6870
14326f293j7593M152K0897J1817j5079r85j3463j833M924P290N711N519j4248
$$ plain form
14418 -17769 -36025 -38386 -23414 -18079 -4772 -12693 -6546 6648 20015 4222 -6542 -2659 -4173
14405 -4173 -7513 -13464 -13777 -1854 35147 38681 13024 28435 32977 18313 7753 -5880 -10094
14392 -10094 -25752 -6783 12938 18245 33551 53183 54989 40402 17962 9606 -5482 1288
14380 1288 -5891 2075 3733 -13416 -13858 -6958 -21429 -14948 12435 12130 8933 7156 27170 49879
14366 49879 32795 -2050 -26546 -26123 293 3155 2287 5904 6303 1047 -3357 17213 38809 48522
14352 48522 35670 10969 -8192 -15636 -13088 -12660 -1415 271 9424 2442 -18307 -25309 -25769 -17770
14338 -17770 -5010 35560 27787 -1392 1003 15097 35189 39964 26537 30699 10577 -6293
14326 -6293 -23886 -19734 1163 12980 -2099 -3084 -16547 -18380 -13456 -6166 -455 5064 -9184
14313i184q016J0516j7086l691K1030Q952q674J0818J8765K0060j1970l1599l430
14300c509K1214k472l4294q321R161L5692R437q652J2413J2062l4269k6348M974
14287a2912R582l2296j645R54J7628Q299L5556J5068L89M116j7568N0j8268m991
14273C962j0555j4095j9523L558J1156O635J5110m128R562J2449j5535P653K2151
14260B8400j3129j8975q969J8239L4984j8304k2424l996M605n756j1707j91J6602
14247f21k510j573j3088j3632R727J109M649O022p228j3923j7368j6880J5670
14234d9646K8035J8442J4873K8774r161r079j1399j7095k595R465L3987k027k1648
14221A0926n75l529P523j2414p805J0700J5144K6675j4095l2079J0071L41j0834
$$ plain form
14313 -9184 -17200 -6684 -23770 -27461 -6431 2521 -6153 4665 23430 43490 31520 -79 -3509
14300 -3509 17705 15233 -19061 -27382 -18221 17471 26908 18256 30669 42731 8462 -17886 -12912
14287 -12912 -3330 -35626 -37271 -36317 -18689 -10390 25166 40234 40623 44739 27171 27221 8953 3962
14273 3962 -6593 -20688 -40211 -36653 -25497 -18862 -3752 -7880 1682 14131 -1404 6249 28400
14260 28400 15271 -3704 -12673 5566 40550 22246 -178 -4174 431 -5325 -17032 -17223 -621
14247 -621 -3131 -4704 -17792 -31424 -21697 -20588 -15939 -9917 -17145 -31068 -48436 -65316 -49646
14234 -49646 -21611 -3169 11704 40478 31317 22238 10839 -6256 -8851 614 34601 32574 10926
14221 10926 10351 6822 14345 1931 -5874 4826 19970 46645 32550 471 10542 10883 49
14208D9R147J0687Q305K659M315l8746j4511j7168m306K0290L3834j6703J0102
14195G954K9584N973n087j0453o293K823j6033j4962j366k900J0302J9568J1154
14182C0264j1688j8029j4788m842m46k454J3968J3819r887J8255n528j9355j6508
14169b7219j2748m95J6948J7818M5812J3798j8936K291k1276j872m474j5583L188
14156b748o197J6574R211j4860k4460K823L610K2586J4535l412o997q960n574
14143c869Q403m220m025n507L898j9414p865K8760k3552k7141K6004K7585M925
14130C982q293j4766Q662L1757K4581j4533k561o731j4430m938o287N402J08P430
14116I383M507j7327J3965j045j3547j0864J4517J7190j4848K0834o104l4313
$$ plain form
14208 49 9196 19883 28188 30847 35162 -3584 -18095 -35263 -39569 -19279 14555 -2148 7954
14195 7954 37538 43511 38424 27971 21678 24501 8468 -6494 -7860 -10760 -458 19110 30264
14182 30264 18576 547 -14241 -19083 -19529 -21983 -8015 5804 -4083 14172 8644 -10711 -27219
14169 -27219 -39967 -40462 -23514 -5696 40116 53914 34978 37269 15993 14121 9647 -5936 -2748
14156 -2748 -8945 7629 16840 1980 -22480 -19657 -16047 6539 21074 17662 10665 1705 -3869
14143 -3869 4534 314 -3711 -9218 -5320 -24734 -32599 -3839 -27391 -54532 -28528 -943 3982
14130 3982 -4311 -19077 -10415 21342 45923 31390 28829 22098 7668 2730 -3557 1845 1953 9383
14116 9383 13890 -3437 10528 9483 -4064 -14928 -411 16779 1931 22765 16661 -17652
14104a7652k7988j824K7581J8148O325j4618N116L3949j0897K783j2249k3278
14092a4604Q707J054Q965K0248j2559J0798k0018j0666j8406J4493L5615j1308
14080A2319M954K2739P387P236J5j3824k3097j6426j9029K7254K2488j8290k8680
14067a4954K0442J7291r568J5278K9622n584K309j9709k7136p978Q695J8138k0736
14054F110K1297p494O360J0116o241j378O574j3655j6137k6467o932j504L313
14041b6038R754K801k4019k227N600J0183M075K0334K5071J3226k6121j5113M72
14028b002R904r476j0796J8466J631r123m613m248J1011N35M692O917q092j8106
14014a3300R791r880K5396M354k2583q603L879l340j6624J3447K8945o088l5412
$$ plain form
14104 -17652 -45640 -47464 -19883 -1735 4590 -10028 -4912 29037 18140 20923 8674 -14604
14092 -14604 -5897 -4843 4122 24370 11811 22609 2591 -8075 -26481 -11988 23627 12319
14080 12319 17273 40012 47399 54635 54650 40826 17729 1303 -17726 9528 32016 13726 -14954
14067 -14954 5488 22779 13211 28489 58111 52527 54836 35127 7991 13 8708 26846 6110
14054 6110 27407 19913 26273 36389 30148 28770 35344 21689 5552 -20915 -27847 -29351 -26038
14041 -26038 -16284 -13483 -37502 -39729 -34129 -23946 -19871 463 25534 38760 12639 -2474 -2002
14028 -2002 7902 -1574 -12370 6096 7727 -1396 -6009 -10257 754 1289 5981 12898 4806 -13300
14014 -13300 -3509 -13389 12007 16361 -6222 -14825 -10946 -14286 -30910 -17463 11482 5394 -30018
14001c0018K00M5275L3745l000k1516J60l2109k841Q781K8240J1042j5430m648
13988A7881L2097J8353L594o145j1534j7390O405L6627n309j5798k4793j893Q00
13975C2895J401n385R043J7546N555L949j2510O295L554J6980J7760m332k2012
13962G0739k81k6585k1545j4848j429o486o779k2293N744K1698J2580K4224K0170
13949E4909j9234j1273m2831j4065L6335R833J2422R828q259K994L742O425K7900
13936F8726p142r023N981l6743n413M939r665o756j4811q625J4564J7949J8951
13923C2932J3638M266K0873k294l01L97l5957l0908j3033K4837L775J2457j0838
13910A9844J5507K7584J1107j7564q87J2468m978J9587n736j6728k3233k2205
$$ plain form
14001 -30018 -29818 15457 49202 46202 24686 24846 -7263 -10104 -1323 26917 37959 22529 17881
13988 17881 49978 68331 71925 65780 54246 36856 43261 79888 74579 58781 33988 32095 32895
13975 32895 34296 28911 37954 55500 61055 65004 52494 58789 62343 79323 97083 92751 70739
13962 70739 70458 43873 22328 7480 6051 -435 -7214 -29507 -23763 -2065 10515 34739 54909
13949 54909 35675 24402 -18429 -32494 3841 13674 26096 35924 27665 30659 34401 40826 68726
13936 68726 61584 52561 58542 21799 16386 21325 11660 4904 -9907 -18532 -3968 13981 32932
13923 32932 46570 50836 71709 69415 69114 69511 33554 2646 -10387 14450 18225 30682 19844
13910 19844 35351 62935 74042 56478 55591 68059 63081 82668 76932 60204 36971 14766
13898A4766L5598K942J405j9922m0784j1253K0542O205J2818Q324m601k6755K2638
13885B1923M2820K055m4494j2020J9071K0696O491Q962k538k1096k7603p043q221
13872i97l505M295o939k1347L1633J8160r421J8533o775j2796J3603j2657N962
13859A7749k895l2107m98L0745K1000m196j7402k30J7262l1109J9863J9987k869
13846C5300K0240J9932Q820K528k2301j4870p442j8261q161K8818q348M439k523
13833C8171j659Q083N198j5564k9924p18J3724J4272o673O930J8175j0076O879
13820D6818n820j7071m47j8735k309N065J710j1229l562L0821q97k2842j0625
13807i123J7161R891L877l467j2126n036n549m215O176p315L0621m845j0026L5701
$$ plain form
13898 14766 50364 53306 54711 34789 -5995 -17248 3294 9499 22317 30641 26040 -715 21923
13885 21923 64743 66798 22304 10284 29355 50051 56542 65504 62966 41870 14267 7224 -997
13872 -997 -4502 -207 -7146 -28493 3140 21300 11879 30412 23637 10841 24444 11787 17749
13859 17749 14854 -17253 -17751 12994 33994 29798 12396 12166 29428 -1681 18182 38169 35300
13846 35300 55540 75472 84292 86820 64519 49649 42207 23946 15785 44603 36255 40694 38171
13833 38171 36512 44595 49793 34229 4305 3587 17311 31583 24910 31840 50015 39939 46818
13820 46818 40998 23927 23480 4745 2436 7501 9211 -2018 -5580 25241 24344 1502 -9123
13807 -9123 8038 17929 21806 18339 6213 1177 -4372 -8587 -2411 -9726 20895 16050 6024 41725
13793D1725Q309j7512n897p150m054j1642r510L629q263J5725L0310N363k0532
13780B0501l4627l1298J7884K6437K6110K55R014j1403K1498J6190k7732k6792
13768F037j7576J5723O345n767J23p223P439j596n541J2602j0250p214J9805k659
13754A0248J776j772j2295J585L8965K7034k154P672k013P209p099m8988j5878
13741D290j1239j86K5861J4836j2793R779K1646l162j2972J0100m2458k4963K671
13728a8590k0766j2685R613L6110K4545L696r520M958J5572N940j0335k0118J9529
13715B7949J521j2421K5705k234j4171k0725K8166J0532j7301m006k744j7389
13703B882j6854P699Q427O62p573l598r209r245L242J8481N259J3462M3084k818
$$ plain form
13793 41725 50034 32522 26625 19475 15421 3779 -5731 -2102 -10365 5360 35670 41033 20501
13780 20501 -14126 -45424 -27540 -1103 25007 25262 34276 22873 44371 60561 32829 6037
13768 6037 -11539 4184 10529 4762 4885 -2338 5101 3505 -2036 10566 316 -6898 12907 10248
13754 10248 12024 10252 -2043 -458 38507 65541 63387 71059 69046 76255 69156 20168 4290
13741 4290 -6949 -7135 18726 33562 20769 30548 52194 49032 36060 46160 3702 -21261 -18590
13728 -18590 -39356 -52041 -42428 -6318 18227 21923 12403 17361 32933 38873 28538 8420 27949
13715 27949 29470 17049 42754 40520 26349 5624 33790 44322 27021 23015 20271 2882
13703 2882 -13972 -6273 2154 2816 -4757 -8355 -17564 -26809 -23567 -5086 173 13635 56719 53901
13689E3901m2839l0846J2166M854P041K907n021m903J1152j3787k84j970K2650
13676A5021J6534k8453j2522p26L0696J8532P115K3201L0412k3638j2515J1067
13664G4724j6287k2476j1796P11K4902L790o570J5675J893j5096r427R953O145
13651E6141o126o732Q11J7395K936k5625q324p06J2529K3777J3223r067k2901
13638D7331J762K7348n131k4452m7572j9283R250J6139K144J7414k346k0568J6406
13625A8442j3331r081L1620k0935n573K5265M084k4825j2282R964K1251J0395
13613C4994k7782J1291J8223j0237k771l100j7976r368L61J4029r927P290K3706
13600B8733J8620j8608K2690r954j9998M981M0444J8305l0993j7735p319K142
$$ plain form
13689 53901 11062 -19784 -7618 -2764 4277 7184 2163 -2740 8412 -5375 -5659 -7629 15021
13676 15021 31555 3102 -9420 -10146 20550 39082 46197 69398 99810 76172 63657 74724
13664 74724 58437 35961 24165 24876 49778 53568 46998 62673 64566 49470 40043 49996 56141
13651 56141 50015 43283 44094 61489 64425 38800 30476 29770 42299 66076 79299 70232 47331
13638 47331 49093 76441 71310 46858 -714 -19997 -10747 5392 7536 24950 22604 2036 18442
13625 18442 5111 -3970 27650 6715 1142 26407 30491 5666 -6616 3348 24599 34994
13613 34994 7212 18503 36726 26489 23718 20618 2642 -6726 -6365 7664 -2263 5027 28733
13600 28733 47353 28745 51435 41481 21483 26464 66908 85213 54220 36485 29166 31308
13588C1308J6713K7080q409n779j1805j7917L4640J6809j4516K669M570n408r355
13575F0600L2275J2425k40K6792j2255p139p973J2238J4284J2420R710Q938P627
13562A69702n646M480L3727R193j5049o584l2129j7514j8870l2122j0599O707
13550H5296J749P498m262j2775j6493J328M876L377k1264j5877M54J1753L2L0181
13536G5873J6335N369L1675J0654k6766j2659L0013J5296J6864k031J903k1282
13524A41244J0708K2685o673l9780k6337j5950j8593K6259J1879j23J5738k4999
13512I6058k1912J030J6300j615j8095j2228J185p694j8143j9611O156K9319K3313
13499G4063M3028Q364j8905k4608Q860K7171k9249j3367m084J0673J2294Q906
$$ plain form
13588 31308 48021 75101 66692 60913 49108 31191 65831 82640 68124 70793 75363 69955 60600
13575 60600 92875 105300 105060 131852 119597 112458 104485 116723 131007 143427 153137 162075 169702
13562 169702 164056 168536 202263 211456 196407 189823 157694 140180 121310 89188 78589 85296
13550 85296 87045 94543 90281 77506 61013 62341 67217 70594 49330 33453 33907 45660 45692 75873
13536 75873 92208 97577 129252 139906 113140 100481 130494 145790 162654 160623 162526 141244
13524 141244 151952 174637 167964 128184 101847 85897 67304 93563 105442 105319 121057 96058
13512 96058 74146 75176 91476 89861 71766 59538 60723 53029 34886 15275 21431 50750 74063
13499 74063 117091 125455 106550 81942 90802 117973 88724 75357 71273 81946 94240 103146
13487A03146j046k0658J8447K5046j2935l0013J607L758K3943J9181K4218j1773
13475A42921J7200o796k4712m7675j6112L5486K8033k00k4794l3790j07J510k6241
13462D4723J6527j6847j265J2852J9075K7198n150k7159l2325j1993J2569J7456
13450E5661Q276J9361r483r440q6J7792j0514j7920n921K7594r107j5712j8055
13437C2446L9767K2212k6212l8222K4680N825j1557K9625L801l1935k635Q157
13425E5952J0927J5322n579J3972k4980Q62J9890L6024j2206m450K9845K0582
13413A56161M191l145L899l912J0421L1425N50l2855k8412O259Q845J9435m913
13400A67949k8923l6195j0273K792q24R224K1268J576Q227J7845L1r64j8585k4246
$$ plain form
13487 103146 102100 81442 99889 124935 112000 81987 83594 87352 111295 130476 154694 142921
13475 142921 160121 153325 128613 80938 64826 100312 128345 128145 103351 69561 69454 70964 44723
13462 44723 61250 44403 43138 55990 75065 102263 97113 69954 37629 25636 38205 55661
13450 55661 63937 83298 73815 64375 64289 82081 71567 53647 47726 75320 66213 50501 32446
13437 32446 72213 94425 68213 29991 54671 60496 48939 78564 82365 50430 47795 55952
13425 55952 66879 82201 76622 90594 65614 66476 86366 122390 110184 105734 135579 156161
13413 156161 160352 157207 161106 157194 167615 199040 199590 166735 138323 144582 153427 172862 167949
13400 167949 139026 102831 92558 95350 94526 103750 125018 126594 134821 152666 152697 151733 133148 108902
13386A08902K643L3290L1665M4198L0315K4077J4765j2455j5556k1020q986J2644
13374B44482K0679k6829j2886j8181k3609j8777l2935j048L0516R113j1470m21
13362A58634o440k0150k7848r957R743L3723L2258K34m089k333j3886k2609j9849
13349A07431m961l1248P324J9072j2465q326K1208N893j1054j3722n564j6786
13337E6802r889L6927K6740k805j3488J2171J405j3000j5463M159p602j2456R018
13324G2519L6o828K065K7351K4866J8132O275P071K0593L431Q607j4369k1346
13311A48403j7827j7079J1953R159N060j899R862k9294j1007R559K5442M174j3843
13298A32663J624M3762J0488k0568j5937r440L8420L0919l93O044j5072q965k6702
$$ plain form
13386 108902 111545 144835 176500 220698 251013 275090 289855 277400 261844 240824 231838 244482
13374 244482 265161 238332 225446 207265 183656 164879 131944 130896 161412 170525 159055 158634
13362 158634 152194 132044 104196 94239 103982 137705 169963 170197 166108 163775 149889 127280 107431
13349 107431 102470 71222 78546 97618 85153 76827 98035 103928 92874 79152 73588 56802
13337 56802 46913 83840 110580 107775 94287 106458 107863 94863 79400 83559 75957 63501 72519
13324 72519 72555 65727 67792 95143 120009 138141 144416 151487 172080 175511 184118 169749 148403
13311 148403 130576 113497 125450 134609 139669 137770 147632 118338 107331 116890 142332 146506 132663
13298 132663 134287 178049 188537 167969 152032 142592 181012 211931 211538 217582 202510 193545 166843
13285A66843j935K330J6216O7K3068k571j7549j0079j9621l2999K9891L090J0904
13272A67655J1716p778l2508k2792j482L792m634J3282o383P226K2432M916k3815
13259A31627j6250n058O68k1819Q865J0497J1391R304r759L2785M594q806N050
13246A53089J3150j3006l785o291l1035j9000R532M143J6209R15O537J8001n510
13233A42949j4792j1225k126p204k172O549J041J0837j9662q06j242M774J0500
13220A17421j2454k8549K0992M7480K3749l403J828K6710L6162j2074k1451M125
13208B00536n223K1202L2835R850j43j280J6273l1994k1362j922P675M2100K0106
13195B88653J5117r30J7527K2099L4390J4711k5484k7024l1174j4007j2248j0562
$$ plain form
13285 166843 164908 167238 183454 183521 206589 204018 186469 176390 156769 123770 153661 156751 167655
13272 167655 179371 171593 139085 116293 114811 118603 113969 127251 120868 128094 150526 155442 131627
13259 131627 115377 110319 110987 89168 98033 108530 119921 129225 119466 152251 156845 148039 153089
13246 153089 166239 153233 149448 143157 112122 93122 102654 106797 123006 123921 130458 148459 142949
13233 142949 128157 116932 114806 107602 105430 111979 113020 123857 104195 103389 102147 106921 117421
13220 117421 104967 76418 97410 144890 168639 165236 167064 193774 229936 217862 196411 200536
13208 200536 195313 216515 249350 259200 259057 257777 274050 242056 220694 218772 226447 268547 288653
13195 288653 303770 302840 320367 342466 376856 391567 366083 339059 307885 293878 281630 271068
13183B71068m419l0254J299M2516R396o739l5714l6251J8580J2628P325J9379
13171B68814p67k8843j4642K9219K4322Q826r931k5914r959Q960j6253l4934j5673
13158A83225M1594O889n235m85j2728J4163L4079K4827N1909O7531P5227P5138
13146E56134L1006p804n3473l0888n4525K497l1639k2997J7598l7285l4102J5434
13134C49956O506j3121r182n25M2607L2361J3015k597j4866j4883M4061P2757
13122E06089M4746K8799p643k0519n547J595o347m0394j7376j9992k6276k3583
13110D13552k2760p526l1036q856L5256N5086N8562M0044L6576J1286K919k7516
13098E55587n3063m4701j4294k1013J429K9697j8730P039q479j7076J2338K134
$$ plain form
13183 271068 266649 236395 237694 280210 289606 282867 247153 210902 229482 242110 249435 268814
13171 268814 268047 239204 224562 253781 278103 286929 276998 251084 241125 250085 233832 198898 183225
13158 183225 224819 231708 226473 225988 213260 227423 261502 286329 338238 405769 480996 556134
13146 556134 587140 579336 525863 494975 440450 442947 411308 388311 405909 368624 334522 349956
13134 349956 356462 343341 334159 333634 376241 408602 421617 419020 404154 389271 433332 506089
13122 506089 550835 579634 571991 551472 545925 547520 541173 500779 483403 463411 437135 413552
13110 413552 390792 383266 352230 343374 378630 433716 492278 532322 568898 580184 583103 555587
13098 555587 502524 457823 443529 422516 423945 453642 434912 441951 433472 416396 428734 430868
13086D30868N802k9224l9683j8178j7980j5943l4823l4323k4561p036L36K6304
13074B41559K0459j5387l3589L309P518J0604M6174K3984O334M026J9281J7619
13062C51891O525J3180p337j7231R682L9300M6941N263j7552j8582o443O208l3038
13049C78807K739l962j6324j9032J1775J9339L1418j9623k1865j3805j3365q63
13037C35239j8752j3196j8k6254J495O631j3885k0153K5325L0593J1507j2016
13025C06516J392M427P880j6715K3388R675K8461K6825L3653K1333j6730n0834
13013C79271l8051k8165m6865j5994N989P661n221J2710l6997k734j5526q824
13001B07254q453K359K0289K7250J456l5151l6875j3517Q793J7074J434P344M0123
$$ plain form
13086 430868 436670 407446 367763 349585 331605 315662 280839 246516 221955 214919 215255 241559
13074 241559 262018 246631 213042 216351 223869 234473 280647 304631 310965 314991 334272 351891
13062 351891 358416 371596 364259 347028 356710 396010 442951 448214 430662 412080 405637 411845 378807
13049 378807 381546 377584 361260 342228 354003 373342 404760 385137 363272 349467 336102 335239
13037 335239 316487 303291 303273 277019 278514 285145 271260 251107 276432 307025 318532 306516
13025 306516 307908 312335 320215 303500 326888 336563 365024 391849 425502 446835 430105 379271
13013 379271 341220 313055 266190 250196 256185 263846 258625 271335 234338 231604 216078 207254
13001 207254 198801 201160 221449 248699 250155 215004 178129 164612 173405 190479 191913 199257 239380
12988B39380P008P844J5524J3589L1888K8846K4229J8793L8307R927l1850m895
12976C98590J3129q8M066m3899j4703N667j5853k1514m7096j4859k2252l0552
12964B10636j7283k4966p742j682O55j9088j3149n074J9835L1310L8001n266l4486
12951A71701j9938m27J4352K8643K8112L3575M317N129L4311J8719J7461j1003
12939C24952M466L4743J548l3186l4168k3341j8533j6678N923J8244J8733m397
12927B78306K3418j8032m751k783r068m2557k276j579l9238k8535k708K491r063
12914A43625n103N11q079n878J3194O340P894L638m121m413K5045K9336j1879
12901A90110j3712l7053m190K1438L071O450J2158Q554j3304J402J3570K945k870
$$ plain form
12988 239380 246388 254232 269756 283345 315233 344079 368308 387101 425408 435335 403485 398590
12976 398590 411719 411631 415697 371798 357095 362762 346909 325395 278299 263440 241188 210636
12964 210636 193353 168387 160645 158963 159618 140530 127381 122307 142142 173452 211453 206187 171701
12951 171701 151763 151336 165688 194331 222443 256018 260335 265464 299775 318494 335955 324952
12939 324952 329418 364161 365709 332523 298355 275014 256481 239803 245726 263970 282703 278306
12927 278306 301724 283692 278941 276158 267090 224533 222257 220678 181440 152905 150197 152688 143625
12914 143625 138522 139033 130954 125076 138270 144610 152504 156142 152021 147608 172653 201989 190110
12901 190110 176398 139345 135155 156593 159664 166114 178272 186826 173522 174924 188494 191439 188569
12888A88569J6065M1526L5587M2932M1791L4637L5364N5303J06906J35990O6018
12877H00688J8322l4461r5401r2341r0562p0899o1050m6078l2126k5115l8659
12866B32318j8009m955Q693j402m687k507p177j6534K6171N1858J1270l2697k9126
12853B13216J0093K5111o375J6230O5235N2022O4254J05372N0678K0962J0929
12842F27727r560p7451j03682p1516m8012m0086j7362k528P305j8504k1009l235
12830B22087L3448k7467l4569j0425m429M316k080q469P073K876k5837k421L6082
12817A90185K4701L631l2993L5390K3193K2719J1427q546k941k249k6212J3724
12805B52029K3636J7371l1454j2022j3697j1637K7229j5635J050j9755k7252K2363
$$ plain form
12888 188569 204634 246160 281747 324679 366470 401107 436471 491774 598680 734670 800688
12877 800688 819010 784549 689148 596807 506245 435346 374296 328218 296092 270977 232318
12866 232318 214309 209354 218047 216645 211958 209451 202274 185740 211911 263769 275039 242342 213216
12853 213216 223309 248420 242045 258275 323510 375532 439786 545158 595836 616798 627727
12842 627727 618167 540716 437034 365518 317506 277420 260058 257530 264835 246331 225322 222087
12830 222087 255535 228068 193499 183074 178645 182961 180881 172412 179485 182361 156524 154103 190185
12817 190185 214886 218517 185524 220914 244107 266826 278253 269707 266766 264517 238305 252029
12805 252029 275665 293036 261582 249560 235863 224226 251455 235820 236870 217115 189863 212226
12793B12226K2888m118J7786J7281L92j1522q826o258j8253j0123J0151p308o582
12780B07734j260L1173K2582J7110L321K1857O415l1224m7146J5905K4540K102
12768B73109p35r944K6411K7285L1826j3215k0830J0019K806j4383L199K2782
12756C38330L1463L9492J4552J8150l429j354q319m270J0124K6450K7188l1271
12744D57106L0607M9294L8623J8253k4735K5225M6953M1224N7337P8969Q5471
12733I04327Q3012O4737R0594J17571J31131J73615J71904J85849K44873L39640
12723B507253M83822O42472Q33546J075645J189953J202204J179648J084504J046055
12714A1245102J055130J032880Q44879M33962l0309l02026l25665j64815K802
$$ plain form
12793 212226 235114 230996 248782 266063 266455 254933 246107 239849 221596 211473 221624 214316 207734
12780 207734 206474 237647 260229 277339 280660 302517 308932 277708 230562 246467 271007 273109
12768 273109 272374 262430 288841 316126 347952 334737 313907 323926 326732 312349 315548 338330
12756 338330 369793 409285 423837 441987 438558 437204 428885 424615 434739 461189 488377 457106
12744 457106 487713 537007 575630 593883 569148 594373 641326 682550 739887 818856 904327
12733 904327 987339 1052076 1142670 1260241 1391372 1564987 1736891 1922740 2167613 2507253
12723 2507253 2991075 3633547 4467093 5542738 6732691 7934895 9114543 10199047 11245102
12714 11245102 12300232 13333112 14177991 14611953 14581644 14279618 13953953 13789138 13791940
12705A3791940P5190O7703P225J24659K87153M96015O75749P27674O19264M24764
12695A7297336K51374J35989J06087Q0271j7674j35064l42104o18323q06077q50370
12685A5101445q10946p60620q23083q70380p15974m50776j51706N7218J57545
12676A0732723J56120O9899q5422l30362n15070o97502q41411q99739q73556p72693
12666E942987o12148l92729j74850P1578L04758N25124O67617P29221P14022O63264
12656H438844N64458M46358K29326p6716l66469n12166n79586o47384o77038o72994
12646F146633n58390l79238k07930k4708J40846L40834N41571Q08151J160183
12637G967952J535641J986156K364341K620409K620486K384624K038903J698925
$$ plain form
12705 13791940 13867130 13934833 13942058 14066717 14353870 14849885 15525634 16253308 16872572 17297336
12695 17297336 17548710 17684699 17790786 17871057 17853383 17718319 17376215 16757892 15951815 15101445
12685 15101445 14290499 13529879 12706796 11836416 11120442 10669666 10517960 10575178 10732723
12676 10732723 10888843 10958742 10873320 10542958 10027888 9330386 8488975 7589236 6715680 5942987
12666 5942987 5330839 4938110 4763260 4834838 5139596 5664720 6332337 7061558 7775580 8438844
12656 8438844 9003302 9449660 9678986 9602270 9235801 8723635 8144049 7496665 6819627 6146633
12646 6146633 5588243 5209005 5001075 4976367 5117213 5458047 5999618 6807769 7967952
12637 7967952 9503593 11489749 13854090 16474499 19094985 21479609 23518512 25217437
12629B5217437J317766Q67431K61550m63971j137312j408754j278225r24363o40784
12620B1810775n26564m97193m16093j65427J40402L48745M22074M31041L81577
12611B1929337L26397L20839K97215K54963J98933J51964p0734m68261r40892
12602B1999761j245869j259067j201683j131936j079542r15848p16757m14069
12594A4034990j62588p1303q7513j27651k16259l23338n40757p83337r40769j006638
12584I774837r46492p95671o45273m75974k42041N8215L61318O55730Q19144Q55908
12574I419701P76777O10969M72494K95171L8985l60923p13310q59251q94647r07788
12564G878178r22798r01340p74154n82910l82694j76917k0398R5478K67210M65489
$$ plain form
12629 25217437 26535203 27402634 27664184 27200213 26062901 24654147 23375922 22451559 21810775
12620 21810775 21284211 20787018 20370925 20205498 20345900 20694645 21116719 21547760 21929337
12611 21929337 22255734 22576573 22873788 23128751 23327684 23479648 23408914 22940653 21999761
12602 21999761 20753892 19494825 18293142 17161206 16081664 15165816 14449059 14034990
12594 14034990 13872402 13801099 13713586 13585935 13369676 13046338 12505581 11722244 10781475 9774837
12584 9774837 8828345 8032674 7387401 6911427 6669386 6727601 7088919 7744649 8563793 9419701
12574 9419701 10196478 10807447 11279941 11575112 11614097 11253174 10539864 9680613 8785966 7878178
12564 7878178 6955380 6054040 5279886 4696976 4314282 4137365 4116967 4212445 4479655 4945144
12554D945144O12746P30133Q08411Q02936O90115O21978N71839M22476J57772
12545A0363550k12270n51177p45017p98952q38177r10234r31261q68131p40459
12536C767872o08826m84679l70124k90861k18777j60653j51810j22503j02192
12527A257447j06364j11446r4876n0845r678k2355l9570l5824j8919l6577k5590
12516G05403k2246L188K0729k7907m1031l9615k4588J7410J6938k2302k9639p140
12504E49200n540J3381K7504j0848j2249k8738p526M433q935j3350J516J805j4947
12491D95706j2122J5081J8225j4047J183L4858N9662M0666R145j9779o7524m0546
12479E20508l5031j7456k3793k6568j2410k1918o575N0077J8119L081J979q700
$$ plain form
12554 4945144 5557890 6288023 7096434 7899370 8589485 9211463 9783302 10205778 10363550
12545 10363550 10151280 9600103 8855086 8056134 7217957 6307723 5376462 4508331 3767872
12536 3767872 3159046 2674367 2304243 2013382 1794605 1633952 1482142 1359639 1257447
12527 1257447 1151083 1039637 944761 893916 884238 861883 822313 786489 767570 730993 705403
12516 705403 683157 686345 707074 679167 638136 598521 573933 591343 608281 585979 556340 549200
12504 549200 543660 557041 584545 573697 561448 532710 525184 529617 520682 507332 508848 510653 495706
12491 495706 483584 498665 516890 502843 504026 538884 598546 639212 648357 628578 561054 520508
12479 520508 485477 468021 444228 417660 405250 383332 376757 426834 444953 448034 450013 441313
12467D41313R233J3364R907k733j8815J8092K0652L1686L1415J6753n912R449
12455E74404J2928m000J4742K1328L1133J0245L2891O1782M0939L1941r199m2876
12443G76258m9732k4231n7322m5271m2230j9551m394Q090j9467j7545L5106L0273
12431E69984L1429P622k3066j9418O003K1280N690J610l6856n639K3098j1534
12419E70203p871k4544Q842r076j3763j6891Q811L4264L9123M6732m290l4981
12407E96559m5248m8316k4536j2755r882R045J2174l590J723p511k043R323j1427
12394D63516k3753p373K385P811K4718Q539p436l7463o612K8173k4629j6563N094
12381D16407R014J9808j1213k2864R827M0271J6838k449j0692o453m441K2955
$$ plain form
12467 441313 450546 463910 473817 471084 452269 470361 491013 522699 554114 570867 564955 574404
12455 574404 587332 583332 598074 619402 650535 660780 693671 755453 796392 828333 819134 776258
12443 776258 726526 702295 644973 599702 557472 537921 533527 541617 522150 504605 539711 569984
12431 569984 601413 609035 585969 566551 572554 593834 599524 601134 564278 558639 581737 570203
12419 570203 562332 537788 546630 537554 523791 506900 515711 549975 589098 635830 631540 596559
12407 596559 551311 502995 478459 465704 455822 464867 477041 473451 475174 467663 465620 474943 463516
12394 463516 439763 432390 434775 442586 467304 475843 468407 430944 424332 452505 427876 411313 416407
12381 416407 425421 445229 434016 411152 420979 461250 478088 475639 464947 458494 454053 477008
12369D77008K2732r732J0168N831m2272j8869K0726K6681K6523l884K96L4743
12357E49951L0814P962n15Q298K114m2763l2815L0448L2102j0567n4202R038j9692
12344E10173j4601P450r683J2347j4021N281O241K3234J2502j3301r4L690J7163
12331E46381r110P165j2862n265K6227J0261K3679L3636J4747J1602M6781N4057
12319G47299K1520n581L1868K4591j7085l756L678j8620k293o273p715n479M5194
12306H07348O3535L8536L1611P6725Q4586M4993N3377M3161M7610M0388L7591
12295A369461L4746Q9782J18210J41579K09236K77573L85595N53287P00141Q79793
12285D759403J041913J047861Q75327M29818j60746p21295r91679r52938q01845
$$ plain form
12369 477008 499740 490008 500176 506007 463735 444866 465592 492273 518796 514912 515208 549951
12357 549951 580765 588727 588212 596510 598624 555861 523046 553494 585596 575029 520827 529865 510173
12344 510173 495572 503022 493339 505686 491665 496946 503187 526421 538923 525622 525528 529218 546381
12331 546381 537271 544436 531574 526309 552536 562797 586476 620112 634859 646461 693242 747299
12319 747299 768819 763238 795106 819697 802612 798856 802534 783914 781621 775348 767633 762154 807348
12306 807348 870883 909419 941030 1017755 1102341 1147334 1200711 1243872 1291482 1331870 1369461
12295 1369461 1404207 1493989 1612199 1753778 1963014 2240587 2626182 3179469 3879610 4759403
12285 4759403 5801316 6849177 7724504 8154322 7993576 7272281 6280602 5327664 4525819
12276D525819o38945m92129l65289k47942j88848j75702q9085m1554l2460n317
12266B248548k6504j5009J5935K9086L0480M8370O2430J17005J85766K12327K59477
12255C167911L58732M38406N83144P22862R16534J096580J140816R78158N65692
12246I968835J4105n46084r53164j078351j049206q79303o48375m70131l33279
12237D025047k03096j21437m3797M3442R4428J30695J45094J27387J21413J64735
12227D483911J74396J68380K43447L07229M23453N77170P77624J036842J421223
12218I613675J917521K548491L287464L971832M354568L989080K585057M02354
12210C2670042j876204l389833l888469l588030k990308k379074j836690j410578
$$ plain form
12276 4525819 3886874 3394745 3029456 2781514 2592666 2416964 2327879 2286325 2253865 2248548
12266 2248548 2222044 2207035 2222970 2252056 2282536 2330906 2393336 2510341 2696107 2908434 3167911
12255 3167911 3526643 3965049 4548193 5271055 6187589 7284169 8424985 9403143 9968835
12246 9968835 9982940 9436856 8483692 7405341 6356135 5476832 4828457 4358326 4025047
12237 4025047 3821951 3700514 3656717 3700159 3794587 3925282 4070376 4197763 4319176 4483911
12227 4483911 4658307 4826687 5070134 5377363 5800816 6377986 7155610 8192452 9613675
12218 9613675 11531196 14079687 17367151 21338983 25693551 29682631 32267688 32670042
12210 32670042 30793838 27404005 23515536 19927506 16937198 14558124 12721434 11310856
12202A1310856j136573q62364o84647m99419l47553k17982r0323K7312J48224
12193G647531K29524L29362L97632M67975N77157P50728R33370J148639J373832
12184A3855750J614978J901057K257344K773842L352831L956244M374335M402915
12176C8489296L948704L118172K178874J235885K59978j078159k711270m192142
12168D1249338m961736m863243m187328l306179k352897j476156p44052q9009
12160A9268738M74826Q15532P94628O14326N08386M67389L12033j20813p38402
12151B2396643j262869j503935j523063j485113j485751j456189j334364j159854
12143A1185505r16603p39613n65068m10556l03925k15929j54671p1992l3633J3228
$$ plain form
12202 11310856 10174283 9311919 8627272 8127853 7780300 7562318 7471995 7499307 7647531
12193 7647531 7877055 8206417 8604049 9072024 9649181 10399909 11333279 12481918 13855750
12184 13855750 15470728 17371785 19629129 22402971 25755802 29712046 34086381 38489296
12176 38489296 42438000 45556172 47735046 48970931 49230909 48152750 45441480 41249338
12168 41249338 36287602 31424359 27237031 23930852 21577955 20101799 19357747 19268738
12160 19268738 19743564 20559096 21353724 21968050 22476436 22943825 23255858 23135045 22396643
12151 22396643 21133774 19629839 18106776 16621663 15135912 13679723 12345359 11185505
12143 11185505 10268902 9529289 8964221 8553665 8249740 8033811 7879140 7807148 7773515 7786743
12133G786743Q1331J76385K72746L89203M95108O44347Q68644J175498J514443
12124A3404448J947988K454878L097843L646272M010349L966145L366778K214219
12116C8108920P24557p01625j621734j903083j759299j434961j220088j227593
12108B8965094j376791j566093j644768j596307j425212j171102r27926r03586
12100A8353309j131789j565993j868464j855598j566157j232908r80292p63834
12092G388274o22361n30736m10785l12278k44949k01569j49232q3998o376Q0151
12082D906141J30793K19143L57574M95320P07892R77108J113374J095249R45644
12073A0948238P45275N92906O74167P22311N19047M4466m39173p86723q63583
$$ plain form
12133 7786743 7868074 8044459 8317205 8706408 9201516 9845863 10714507 11890005 13404448
12124 13404448 15352436 17807314 20905157 24551429 28561778 32527923 35894701 38108920
12116 38108920 38833477 38131852 36510118 34607035 32847736 31412775 30192687 28965094
12108 28965094 27588303 26022210 24377442 22781135 21355923 20184821 19256895 18353309
12100 18353309 17221520 15655527 13787063 11931465 10365308 9132400 8152108 7388274
12092 7388274 6765913 6235177 5824392 5512114 5267165 5065596 4916364 4832366 4825990 4906141
12082 4906141 5036934 5256077 5613651 6108971 6816863 7793971 8907345 10002594 10948238
12073 10948238 11693513 12286419 12960586 13682897 14201944 14246410 13807237 13020514 12156931
12064A2156931q26411q08160p64030p84476p64166o75766n29456l63657j73935
12055F466874o6581N6765K78878N01534P33607J001106J195444J086871O54598
12046A1909096N3933n94907j081523j231841j131592q99781n65344l11591j02083
12037F044367M2795J81301L78860N85316P79078J047679J185654J183844J066218
12028A2495112R00996P30077N16344K40612j31571n92400r57829j147626j218550
12019A0835165j293697j245511j102228r37857p22177n21112l54478k40217j82827
12010D235061r4499J0222J04495J81929L08982M56920N85170O81235P44027P52428
12000G965970P69014P37846N88366L53465N8366k80714n13174o10834o94106p35834
$$ plain form
12064 12156931 11330520 10522360 9758330 8973854 8209688 7533922 7004466 6640809 6466874
12055 6466874 6400293 6457058 6735936 7237470 7971077 8972183 10167627 11254498 11909096
12046 11909096 11963029 11368122 10286599 9054758 7923166 7023385 6458041 6146450 6044367
12037 6044367 6087162 6268463 6647323 7232639 8011717 9059396 10245050 11428894 12495112
12028 12495112 13396108 14126185 14642529 14883141 14751570 14159170 13201341 12053715 10835165
12019 10835165 9541468 8295957 7193729 6255872 5533695 5012583 4658105 4417888 4235061
12010 4235061 4140562 4150784 4255279 4437208 4746190 5203110 5788280 6469515 7213542 7965970
12000 7965970 8734984 9472830 10061196 10414661 10473027 10192313 9679139 9068305 8374199 7638365
11990G638365p45221p42847o40755m73700l02538j81730j3623J77446L48971N45868
11980E610236P56677R17351R94173R86971Q38205O46334L96045R2306k13555m19596
11970A0605147n89481p49235r36020j039909j008733q42539n99523l98733j92947
11961D248027M218R9161J85868L02735L83199M80690O02391P56573Q69369Q69887
11951H802118P73503N92493L33331P9246j67205l39445m64764n97682p04064q51500
11941G456031q88374q15532o11893m37952k44512k6412J41375K94791M25520O04326
11931E897368P18414Q32583R25984R14679R14945P69939N78968L86688J68559
11922A2108127O2914k875p5779j83930k84214l48755l50239k55157j69492k47339
$$ plain form
11990 7638365 6893144 6150297 5509542 5035842 4733304 4551574 4537951 4715397 5064368 5610236
11980 5610236 6366913 7284264 8278437 9265408 10103613 10749947 11145992 11238298 11024743 10605147
11970 10605147 10015666 9266431 8330411 7290502 6281769 5439230 4839707 4440974 4248027
11961 4248027 4252245 4351406 4537274 4840009 5223208 5703898 6306289 7062862 7932231 8802118
11951 8802118 9575621 10168114 10501445 10580691 10413486 10074041 9609277 9011595 8307531 7456031
11941 7456031 6567657 5752125 5140232 4702280 4457768 4431356 4572731 4867522 5293042 5897368
11931 5897368 6615782 7448365 8374349 9289028 10203973 10973912 11552880 11939568 12108127
11922 12108127 12171041 12168166 12092387 11908457 11624243 11275488 10925249 10670092 10500600 10253261
11912A0253261l77026m99315n95111o57237p27368p79046p38214o78482n42836
11903D658626l51368k70193j23759J012J12524K48975L99216N76103P40393Q24514
11893F816043Q16609P07690N69359L19314O3271j62685l91193o09565p98466q46876
11883F483501q62188p97114o46804m52828l03220j90932r1682K4401Q4517J84266
11873C431917L28191M27717N30353O55761P89648Q54355Q54698P28629N43377
11864I144646K40014m7069k63138m69694o46314p91850q53667q36598p24477n49348
11854D202505l58383j72349m3613N9239J64045K83042L82847N12074O73345O91522
11844F394274O91487O35648M95134L74308J74144p6188l05945n26011p10704q08196
$$ plain form
11912 10253261 9876235 9376920 8781809 8124572 7397204 6618158 5879944 5201462 4658626
11903 4658626 4307258 4037065 3913306 3914318 4026842 4275817 4675033 5251136 5991529 6816043
11893 6816043 7632652 8340342 8909701 9229015 9292286 9129601 8738408 8128843 7330377 6483501
11883 6483501 5621313 4824199 4177395 3724567 3421347 3230415 3138733 3163134 3247651 3431917
11873 3431917 3760108 4187825 4718178 5373939 6163587 7017942 7872640 8601269 9144646
11864 9144646 9384660 9337591 9074453 8604759 7958445 7166595 6312928 5476330 4751853 4202505
11854 4202505 3844122 3671773 3628160 3687399 3851444 4134486 4517333 5029407 5702752 6394274
11844 6394274 7085761 7721409 8216543 8590851 8764995 8688807 8382862 7856851 7146147 6337951
11834F337951q91812q46471p55683o10550m43028l30601k81255j78492j35721
11825A864338j23496r6270r6215q9796o6577n8002n6055l2082k9170l1749l6756
11814A148170l1766K112K4756k9361j8294J1495o045p164L518j1088k3083J5049
11802A078299J6320l477k549k263P155q763j9645r330k5545m1949n182K5580K6560
11789A035211K3598j4541l932J0079j4042p461J234o154J2871L5614j938k8940
11777A041599k2152J8589J0961J0191j0621n100n571O893N196J044L251L2479
11765A086759P845kO122J9452J2017J5812L6308j71j1689p385j0462l2998N663
11752A127271J3174j8380K4267p05j4238k0123M0087M7001J0360j3757k186k2015
$$ plain form
11834 6337951 5446139 4599668 3843985 3233435 2790407 2459806 2178551 2000059 1864338
11825 1864338 1740842 1644572 1548357 1458561 1391984 1333982 1277927 1245845 1216675 1184926 1148170
11814 1148170 1116404 1118516 1143272 1113911 1095617 1107112 1101067 1093903 1097421 1086333 1063250 1078299
11802 1078299 1094619 1091142 1088593 1086330 1093485 1084722 1065077 1055747 1030202 988253 983071 1008651 1035211
11789 1035211 1058809 1044268 1040336 1050415 1036373 1028912 1030146 1023992 1036863 1072477 1070539 1041599
11777 1041599 1019447 1038036 1048997 1059188 1048567 1043467 1037896 1044789 1049985 1051029 1054280 1086759
11765 1086759 1094604 1094602 1100724 1120176 1132193 1148005 1184313 1184142 1172453 1165068 1154606 1121608 1127271
11752 1127271 1140445 1122065 1146332 1145627 1131389 1111266 1151353 1198354 1208714 1194957 1192771 1170756
11740A170756P894J5908K7798L5532K5291k1633q068J6295K9582J8143P989M2134
11728A367621J6337M7816O9041K9348Q817k7527j5568K8119m225k4883o0323j7036
11716A417537M073K3666l400r607j9275j9536o378J4545m0582o084R144j4613
11704A349490j1351J4675j4975j3859l040J1392o760L188K1198K1957m063J7481
11692A385333J0299R39R19K7065q4L675J3847N087K4188M6426J8081J432K5343
11679A562550J3504m727P335L524L0832K6191L0523P025p186j4335L919m497l3809
11666A620849n242L0964J0405J457p869K1028K2731q977j3677L182J0885L285
11654A689021J2269J8425j8650j8146n878j800O774J5253N507k1756P216J4904
$$ plain form
11740 1170756 1178650 1194558 1222356 1257888 1283179 1261546 1253478 1269773 1299355 1317498 1325487 1367621
11728 1367621 1383958 1431774 1500815 1530163 1538980 1511453 1495885 1524004 1519779 1494896 1434573 1417537
11716 1417537 1421610 1445276 1441876 1432269 1412994 1393458 1387080 1401625 1361043 1354959 1364103 1349490
11704 1349490 1338139 1352814 1337839 1323980 1320940 1332332 1325572 1328760 1349958 1371915 1367852 1385333
11692 1385333 1395632 1396571 1397490 1424555 1424471 1428146 1441993 1447080 1471268 1517694 1535775 1537207 1562550
11679 1562550 1576054 1571327 1578662 1582186 1613018 1639209 1669732 1676757 1669571 1655236 1659155 1654658 1620849
11666 1620849 1615607 1646571 1656976 1658433 1650564 1671592 1694323 1685346 1671669 1674851 1685736 1689021
11654 1689021 1701290 1719715 1701065 1682919 1677041 1675241 1682015 1697268 1702775 1681019 1688235 1703139
11642A703139J5306J343p128K9242J6963L2724K037p63J735J9473L0463N972l611
11629A846895k5340l3028K6058L0826K8867j7459k209o206K1228J8874l1865m393
11617A852248J1325J9331R844p191J3096L2989o919j1426J8319j3370J2844M7298
11605A978388J2052J4774K5314N176j1417k822k7273N021J9440L5099J441k8473
11593B026720K1013O4790K4051m7K1828K6923p044K129M166Q365k0116k528j972
11580B168278j0613K928m60J3256O616j9628j8170J5361N166J443J7682N2207
11568B234066Q253k6422q288p452J5637Q170L2698K0444J831k1339j7912l2258
11556B207428O807J0767l1917q45R807J7664K5978K6258J6006K8131J3982M830
$$ plain form
11642 1703139 1718445 1719788 1712660 1741902 1758865 1791589 1793626 1792863 1794598 1814071 1844534 1850506 1846895
11629 1846895 1821555 1788527 1814585 1845411 1874278 1856819 1854610 1848404 1869632 1888506 1856641 1852248
11617 1852248 1863573 1882904 1892748 1885557 1898653 1931642 1924723 1913297 1931616 1918246 1931090 1978388
11605 1978388 1990440 2005214 2030528 2035704 2024287 2021465 1994192 1999213 2018653 2053752 2055193 2026720
11593 2026720 2047733 2112523 2136574 2136527 2158355 2185278 2178234 2180363 2184529 2192894 2172778 2170250 2168278
11580 2168278 2157665 2160593 2160133 2173389 2180005 2160377 2142207 2157568 2162734 2164177 2181859 2234066
11568 2234066 2242319 2215897 2207609 2200157 2215794 2223964 2256662 2277106 2278937 2257598 2239686 2207428
11556 2207428 2214235 2225002 2193085 2192240 2202047 2219711 2245689 2271947 2287953 2316084 2330066 2334896
11544B334896J3785J7670r982k9219l5376J0158k1046o80K372L0682L0664m1303
11532B302621Q80K9860l381Q423L488j2141l188J1132R579J0491J4837J2160N698
11519B390459K0638K5809k5661l5014P087J3405l1893l326L0115K0419l9784l9681
11507B332573K5028m933n88j9302r858J7056Q518J4546J947L1509j0316j9990
11495B366190l0583j509L6211O445k2867j1500m263q108k0051k931J0555J4870
11483B332459M3163k558l7495M484L2997O88j6095q848N432k6619l2169N830J40
11470B301409N964K6326j4k1897j9215j946J7090M2611j4216k446J841j1285j2246
11457B311976J3279j3256l4450k7868O820j7215k7057k1894J9283J1165j9909
$$ plain form
11544 2334896 2348681 2366351 2356369 2327150 2291774 2301932 2280886 2280206 2282578 2313260 2343924 2302621
11532 2302621 2303501 2333361 2329980 2338403 2341891 2329750 2326562 2337694 2347273 2357764 2372601 2384761 2390459
11519 2390459 2411097 2436906 2411245 2376231 2383318 2396723 2364830 2361504 2391619 2412038 2372254 2332573
11507 2332573 2357601 2352668 2352080 2332778 2322920 2339976 2348494 2363040 2364987 2396496 2386180 2366190
11495 2366190 2335607 2334098 2370309 2376754 2353887 2342387 2338124 2330016 2309965 2307034 2317589 2332459
11483 2332459 2375622 2373064 2335569 2340053 2373050 2373738 2357643 2348795 2354227 2327608 2295439 2301269 2301409
11470 2301409 2307373 2333699 2333685 2311788 2292573 2290627 2307717 2350328 2336112 2333666 2335507 2324222 2311976
11457 2311976 2325255 2311999 2277549 2249681 2256501 2239286 2212229 2190335 2209618 2220783 2200874
11446B200874J0323j6274J1002L056m520J595l1430k7724Q525o024l946m865j6091
11433B124501p295k6613q607J0620J0714O058j3412j9256J358O038k4346k2922
11421B036838k0666P947J0506o497j7960k3379P057K1262M97l2972R798J1906
11409B004337L511L2219L336n674j4558L8404J3113l1565l7007k2370k0177k9258
11397A934311O019m6979j1699j3348j1422J0622o598m353l703j6155K2961K5932
11385A885588k615K5613j0562J595j3256k1846k8214n6112k7135j2244k0563j6915
11373A703334j470k281q321k6804j0717M845k4683J4492K5240l016j4661j3189
11361A642769j2512J073k056m3093q481O175j5619j0355r141K3930K0673j1610
$$ plain form
11446 2200874 2211197 2194923 2205925 2208981 2204461 2206056 2174626 2146902 2155427 2149403 2145457 2140592 2124501
11433 2124501 2117206 2090593 2081986 2092606 2103320 2109378 2095966 2076710 2078068 2084106 2059760 2036838
11421 2036838 2016172 2024119 2034625 2028128 2010168 1986789 1993846 2015108 2015605 1982633 1992431 2004337
11409 2004337 2007848 2040067 2043403 2037729 2023171 2061575 2074688 2043123 2006116 1983746 1963569 1934311
11397 1934311 1940330 1893351 1881652 1868304 1856882 1867504 1860906 1856553 1852850 1836695 1859656 1885588
11385 1885588 1882973 1908586 1898024 1899619 1886363 1864517 1836303 1780191 1753056 1740812 1720249 1703334
11373 1703334 1701864 1699583 1691262 1664458 1653741 1658586 1633903 1648395 1673635 1670619 1655958 1642769
11361 1642769 1630257 1631330 1629274 1586181 1577700 1583875 1568256 1557901 1548760 1572690 1593363 1581753
11349A581753j3945j8799M724J0781n938k5409j9359k9650k0578n878K1056R735
11337A488493O173l166K4724J6235K035Q377k6824j4389q128p118j0373o364j6025
11324A453650m823P34J3214J5302p824j6306J1858k0981j7738n125M849k153j2838
11311A411819k2843j8682L989M430l5237k8289j814L9365K9083o767n5534j2756
11299A306764j1389j215k2782j0487p231l3061m5610n371N727J5262M1204m2295
11287A189516l2437p787k0079j0586N793K0296J2757L940j7221j1606j6002O074
11275A122658J4404K118J395l2211l9512l911K4170O819k554J4956j2028k7025
11263A069279K049l17k0213r316J0651j5964j712Q799r139J0343J7174P989n117
$$ plain form
11349 1581753 1567808 1549009 1553733 1564514 1558576 1533167 1513808 1484158 1463580 1457702 1478758 1488493
11337 1488493 1494666 1491500 1516224 1532459 1534494 1542871 1516047 1501658 1493530 1486412 1476039 1469675 1453650
11324 1453650 1448827 1449561 1462775 1478077 1470253 1453947 1465805 1444824 1427086 1421961 1426810 1424657 1411819
11311 1411819 1388976 1370294 1374283 1378713 1343476 1315187 1313373 1352738 1381821 1375054 1319520 1306764
11299 1306764 1295375 1294160 1271378 1260891 1253660 1220599 1174989 1169618 1175345 1190607 1231811 1189516
11287 1189516 1157079 1149292 1129213 1118627 1124420 1144716 1157473 1161413 1144192 1132586 1116584 1122658
11275 1122658 1137062 1139180 1140575 1108364 1068852 1064941 1089111 1095930 1093376 1108332 1096304 1069279
11263 1069279 1071328 1071011 1050798 1041482 1052133 1036169 1034457 1043256 1034117 1044460 1061634 1069623 1064506
11250A064506l8215j4668j5067m399R032R8l811Q464L1204P890k4524Q293l5744
11237I93059k4629J4697N231j1456q894P184j415j4293j5398j5502k935r256k8451
11224H87942N163L1256J3851N201j2540k2126j7356k2991K784J4824o316Q732
11212H88424k1573j8586R509R350k549J5053K212k512k6253K187Q641L130n253
11199H61780j1765l7788k0181J238j0998O878J4990J7774j5217k3721o522p255
11187G69213j6316J5321P229P178j371J2023j6631l0576l6003l3628J0099K2014
11175G08552Q981j7363Q829N860j9121j4742k1623J2490L1401J140j5922n915
11163F82567l447k4672m707J7179L8301K1982J1292O126j5572k4415o80l556l896
$$ plain form
11250 1064506 1026291 1011623 996556 992157 1001189 1001287 997476 1005940 1037144 1045034 1020510 1028803 993059
11237 993059 968430 983127 988358 976902 968008 975192 973777 959484 944086 928584 925649 916393 887942
11224 887942 893105 924361 938212 943413 930873 908747 891391 868400 871184 886008 879692 888424
11212 888424 866851 848265 857774 867124 864575 879628 881840 879328 853075 855262 863903 867033 861780
11199 861780 850015 812227 792046 793284 782286 789164 804154 821928 806711 782990 776468 769213
11187 769213 752897 768218 775447 782625 781254 793277 776646 746070 710067 676439 686538 708552
11175 708552 717533 700170 708999 714859 695738 680996 659373 671863 703264 704404 688482 682567
11163 682567 679120 654448 649741 666920 705221 727203 738495 744621 729049 704634 703954 700398 696502
11150F96502J1514K0345J0227n808j1745j3748o884q801J3093k64o127j1164j5477
11137F71663j6736l5841j1853J3152K9569K7023k8760M149K1371l388K36k2300
11125F48285J721M4364J8205j4417k4395l791Q470o284j1908q906l887P161j4657
11112F39961j7309K5701k288k6563j0187J2711o813J5900M592K235l2640k7095
11100E78205j8027K889Q699k2099k0348K1323K0877j4827q263l874j4069R160
11088E39646K0522q892J4649J7516R55k2939J4758M6692J8969K3214K100o7355
11076E99835m2538l3493K356L668k5778p495j2701J4247L4975J1852J2398L7269
11064E94595K2816J6420p003l3330o016r323p154j9760k8044k724m227n649J4042
$$ plain form
11150 696502 708016 728361 738588 732780 721035 707287 700403 691602 704695 704431 698304 687140 671663
11137 671663 654927 619086 607233 620385 649954 676977 648217 652366 673737 670349 670585 648285
11125 648285 650006 694370 712575 698158 673763 669972 678442 672158 660250 651344 647457 654618 639961
11112 639961 622652 648353 646065 619502 609315 622026 615213 631113 635705 637940 605300 578205
11100 578205 560178 563067 571766 549667 529319 550642 571519 556692 548429 544555 530486 539646
11088 539646 560168 551276 565925 583441 584396 561457 576215 622907 641876 665090 667190 599835
11076 599835 557297 523804 526160 529828 504050 496555 483854 498101 533076 544928 557326 594595
11064 594595 617411 633831 626828 593498 587482 578159 571005 551245 523201 520477 516250 510601 524643
11051E24643q935k1483J3835J4846k767j5257n05J5450l095m378r974k856r022
11038D90502k215Q040Q649J7809P828Q587j1891j4224j5962K2431k1262l703L137
11025D97726l2093N215P477J2742J9877L5680K1698K548K120J7803k1377j4528
11013E54888l4149j2629q236j3879j9745q834m855J9127k6238j5154J5226N3621
11001D99143L0878K7555j2698J6409J0597m2107k0264r139k61j5600j9519k1622
10989D43372j1984m993m401Q420Q856J9985J393K423k0946k2121j603n26J8432
10976D36307N596p238n0169l364O539j1933J0291j4104j5033J6223K6643K8142
10964D27900j0647k6378r479K905K8527J881j3315R990l392j5117K799p94k6635
$$ plain form
11051 524643 515708 494225 508060 522906 520139 504882 504377 519827 516732 512354 502380 499524 490502
11038 490502 488287 496327 504976 522785 530613 539200 527309 513085 497123 519554 498292 494589 497726
11025 497726 465633 470848 478325 491067 510944 546624 568322 570870 572990 590793 569416 554888
11013 554888 520739 508110 499874 485995 466250 457416 452561 471688 445450 430296 445522 499143
11001 499143 530021 557576 544878 561287 571884 529777 509513 500374 500113 484513 464994 443372
10989 443372 431388 426395 421994 430414 439270 459255 460648 463071 442125 420004 418401 417875 436307
10976 436307 441903 434665 384496 381132 387671 375738 386029 371925 356892 373115 399758 427900
10964 427900 417253 390875 381396 384301 412828 414709 401394 411384 407992 392875 395674 394880 368245
10951C68245k1925k808J1291J8543j1917o622J759R0j996M868N232L578J814K5137
10937C95289K2782K7652J8263J235j2190o915k7453k5786p751q419p870j5972
10925C52865J0339L273k3789l0210K317K1742J1253m2511L977l932j117J0132
10913C14339J209k3774j7098L3147K2208N328K235K0938j2581j6729K5189Q621
10901C63032R776N610k6481k1046r675r637J7140k4969j2202K6769M88n787K7047
10888C40065K7189J6719j3924K628l7349j8455N003K3304J3000J1445k1104l0296
10876C18225Q714Q730O180l200k6895k8686k5997n791m00n456j6013r95L5604
10863B64020J6554k8355Q502L1577r023J47J7675R950r53J5291N45O606r073k6864
$$ plain form
10951 368245 346320 343512 354803 373346 361429 354807 356566 356656 354660 359528 364760 368338 370152 395289
10937 395289 418071 445723 463986 465221 453031 446116 418663 392877 385126 376707 368837 352865
10925 352865 363204 366477 342688 312478 314795 336537 347790 305279 309256 305324 304207 314339
10913 314339 315548 291774 274676 307823 330031 335359 337594 358532 345951 329222 354411 363032
10901 363032 372808 378418 351937 330891 321216 311579 328719 303750 291548 318317 318805 313018 340065
10888 340065 367254 383973 370049 372677 335328 316873 321876 345180 358180 369625 348521 318225
10876 318225 326939 335669 341849 338649 311754 283068 257071 251280 250880 245424 229411 228416 264020
10863 264020 280574 252219 260721 292298 283275 283422 301097 311047 310094 325385 325930 332536 323463 296599
10849B96599Q348K40j5103J243P978k8214J7809J1330k6960r150o080R365m861
10836B62544J32K738K1895K6699k1841k2600p497K0490L0393m081j7502q071k7193
10823B56106J7437J9265r549j6326k937Q80J1291K024J7564k8765m0935j9158
10811B06897J4790M390J8845K4090j7120k034O830k1540O090J6969m049K0549
10799B74707L1197J2072Q930R713K101k7107j3005l7074p57n443P923J4760o640
10786B71377l8972m030K6420r243k7592j5435j1045K2956Q305p669o976m97J254
10773B08853L5456L3281m805M953j340k3196l6657K611K4540M4967J0884p572
10761B91975l4270K1279J7318Q718q40j6429k7392k610J3131O178m244M6953N7774
$$ plain form
10849 296599 304947 305187 290084 291327 299305 271091 288900 300230 273270 264120 258040 267405 262544
10836 262544 262676 265414 287309 314008 292167 269567 262070 282560 312953 308872 291370 283299 256106
10823 256106 273543 292808 283259 266933 263996 264876 276167 278191 295755 266990 226055 206897
10811 206897 221687 226077 244922 269012 251892 249858 256688 235148 241238 258207 254158 274707
10799 274707 305904 317976 326906 336619 338720 311613 298608 261534 260777 255334 263257 278017 271377
10786 271377 232405 228375 254795 245552 217960 202525 191480 214436 222741 215072 208096 207599 208853
10773 208853 244309 277590 272785 277738 276398 253202 216545 219156 243696 288663 299547 291975
10761 291975 257705 278984 296302 305020 304180 287751 260359 257749 270880 277058 272814 319767 377541
10748C77541M5985Q5208J01028O622p9578q9533o0457l6017l4108k7884K2154
10737C10961N0726n837q605j1413p28j0804j3111J3755l378O7127K3768M0564
10725D53025O1814R8039J34443J95088K13223J59907Q2184J38641J42677K753
10715A681794j75103j75038j03555j45882k01818j87887j10196r5129o3392k7914
10705C95880n003k8630j6546K9123j2024l0195k3374j8529r310n682K0745n259
10693B91196j0529k3340k6618J3503L341J8664J6098N546j515l2024j7102Q532
10681B45752j0716k1584j192M413L939l2216J503J401L853O295j5071J6777K7745
10668B30899M688j580M745K2758p852M829J08P37J1201j4211l4943q654J8166
$$ plain form
10748 377541 423526 508734 609762 616384 536806 447273 386816 350799 316691 288807 310961
10737 310961 361687 355850 347245 335832 335104 324300 311189 324944 321566 388693 412461 453025
10725 453025 514839 612878 747321 942409 1155632 1315539 1397723 1536364 1679041 1681794
10715 1681794 1506691 1331653 1228098 1082216 880398 692511 582315 487186 423794 395880
10705 395880 390877 362247 345701 374824 362800 332605 309231 290702 281392 275710 296455 291196
10693 291196 280667 257327 230709 244212 247553 266217 282315 287861 286346 254322 237220 245752
10681 245752 235036 213452 212260 216673 220612 188396 189899 191300 195153 201448 186377 203154 230899
10668 230899 235587 234007 238752 261510 253658 258487 258595 259332 270533 256322 221379 212725 230891
10655B30891J2077J37p265p450j2282j8395j6380K8977M800J0058l949r854O118
10642B17483L981K0051o690o418L487J4451K6017q254j0479q385j7998j4061q953
10629B04232l0719k5607J5702K0498K9505K9420J7344J014k6610J2669J2842J4494
10617B74784m0237N76K613j3483R259Q249N565N396j8491J1263r01J4700J1812
10604B71105k759O059K0682N061l0741R010k6682j8764Q202J4857k0833l8214
10592A96983l4424j746K7201P935J5495J7280n368J8461K0768j2503k928j1031
10580B36123J1864J0354L0696J4139j4705o920J2439L9681L0819L7118N412p401
10568C99619k9909j3157J5311j5856l2771j1566J3102k8420P307K2773l929l6365
$$ plain form
10655 230891 242968 243105 235840 228390 216108 197713 181333 210310 215110 225168 221219 211365 217483
10642 217483 221464 241515 234825 228407 231894 246345 272362 264108 253629 245244 227246 213185 204232
10629 204232 173513 147906 163608 184106 213611 243031 260375 261389 234779 247448 260290 274784
10617 274784 234547 235123 237736 224253 233512 241761 247326 252722 234231 245494 244593 259293 271105
10604 271105 268346 274405 295087 300148 269407 278417 251735 232971 241173 256030 235197 196983
10592 196983 162559 160813 188014 195949 211444 228724 223356 241817 262585 250082 247154 236123
10580 236123 247987 258341 289037 303176 288471 281551 293990 333671 364490 401608 407020 399619
10568 399619 369710 356553 371864 356008 323237 311671 324773 296353 303660 326433 322504 286139
10556B86139j9373j039l566j7850L367j0790j0759N941j535J8113k389M113J1707
10543B62079M076N608j3474j5894j8465j7304k4673J7425J2810J8551J668L9025
10531B71432K2050k3380j8310J669J4109K1819Q360j871L431J6347L1460O914
10519C54030j6629Q367K10m1551k0128j8197j1584q335j411p090l524l941l4782
10506A95435m652l161K912J732q830j4387J9417O954j6935J9217M861K2096J8276
10493B42935K6140R454k1802J443L5391J3170k7458l6341k9919K396r838l6322
10481A69249K1830k501r189j0985j1033Q524Q548M9851J5505M590L3561K7624
10469C05574K5327Q9174M3002j0172j4780J9965L2543n214m6240k0015j8897k6589
$$ plain form
10556 286139 266766 265727 262161 244311 247678 236888 226129 232070 230535 248648 246259 250372 262079
10543 262079 266155 271763 258289 242395 223930 206626 181953 199378 212188 230739 232407 271432
10531 271432 293482 270102 251792 253461 267570 289389 297749 295878 299309 315656 347116 354030
10519 354030 337401 345768 345978 304427 284299 266102 254518 246183 244772 237682 234158 230217 195435
10506 195435 190783 187622 190534 192266 183436 169049 188466 195420 178485 197702 202563 224659 242935
10493 242935 269075 278529 256727 258170 293561 306731 279273 242932 213013 215409 205571 169249
10481 169249 191079 188578 179389 168404 157371 165895 174443 224294 239799 244389 277950 305574
10469 305574 330901 420075 463077 452905 438125 458090 490633 485419 439179 419164 400267 373678
10457C73678l4592j5034L4003J7069L5529J6941J3646L1519L1037M6217O0500
10446F10513M3684J1979K4803J876m8822k7198l0363k5616l1109m8158n2926l6887
10434C91776M612J5597j9318n514k4461k7260Q820P001o124K982k988k549L3152
10421C75726K2469J7489o478j0897K1974M2284K5173j0716O476J1551O5o96N647
10408E00067k9301k5746K9620m848j0403k2251j2239K9629J5770J9144J2421K0463
10396E22326Q383q421J8886J8595J343K0973L5799L888q369R743j1843k4865K1017
10383F07455j6147j6587J4032L4862R950K4774J4591J7252K1855M2602M4558M7216
10371H46413L4288P0887O5004M7390K1460N0610L6918L2764K422J4027J2628M9695
$$ plain form
10457 373678 339086 324052 358055 375124 410653 427594 441240 472759 503796 550013 610513
10446 610513 654197 666176 690979 692855 644033 616835 586472 560856 529747 481589 428663 391776
10434 391776 396388 411985 392667 387153 362692 335432 344252 351253 345129 348111 345123 342574 375726
10421 375726 398195 415684 409206 398309 420283 462567 487740 477024 483500 495051 495116 494420 500067
10408 500067 470766 445020 474640 469792 459389 437138 424899 454528 470298 489442 501863 522326
10396 522326 530709 522288 541174 559769 561112 582085 617884 621772 613403 623146 611303 586438 607455
10383 607455 591308 574721 588753 623615 633565 658339 672930 690182 712037 754639 799197 846413
10371 846413 880701 951588 1016592 1063982 1085442 1136052 1172970 1205734 1208156 1222183 1234811 1284506
10359A284506Q1250J15919Q3099N7376N7006M2099J0792M7161O9479R4524J35834
10348B079045J62411J77873J96140K52964L47041M60330O10173P45685P87462
10339E819124O84938P03209R29816J028232Q18179O53478Q50238J177334J394539
10330A4059087J656685K144778L030636M507248O719617J0117762J5925507K5135626
10322H3296946L6582544M2931654L1788857J9267357K8003777L5768553P984388
10315B85624076l1359879l5392065k0325716k3880599m0223235m0067801k7897847
10308F6476934j7346179j1040647p504633n308770l838473k919534k361338j868253
10300A4289107j414424j227141j104555q98032p24954p93225q25043o84265n54361
$$ plain form
10359 1284506 1365756 1481675 1564774 1622150 1679156 1721255 1732047 1779208 1848687 1943211 2079045
10348 2079045 2241456 2419329 2615469 2868433 3215474 3675804 4285977 5031662 5819124
10339 5819124 6504062 7207271 8137087 9165319 9983498 10636976 11487214 12664548 14059087
10330 14059087 15715772 17860550 20891186 25398434 32118051 42235813 58161320 83296946
10322 83296946 119879490 162811144 194600001 213867358 241871135 277639688 285624076
10315 285624076 254264197 218872132 198546416 174665817 134442582 94374781 66476934
10308 66476934 49130755 38090108 30585475 25276705 21438232 18518698 16157360 14289107
10300 14289107 12874683 11647542 10542987 9644955 8920001 8126776 7301733 6617468 6063107
10291F063107n41021n52942n26978l86746l14626k65759k51772k49188j63221
10282B810854j33201j55196j66205j43071j16019j03300j16821p2897l8252n6347
10272A709545n4225o4965n7128K453n0430m5175l9273r0828l3986m3160m1393
10261A191435k8995j3463k1272l0085l1056l6160n6q130R701K0036j7583Q778
10249A043150K3871N2669K6845M2795O9847J11221J55096J31039L3310q7667j53051
10238A449125j05724m879N4109P4915J05497K04242K90651K05793M3879O032J35696
10227B459336L16075L17509m8332l43004l51625j60783j7968q2451k64740l67940
10217A456077k81496j97517j04011p7355n2167k7494k2908o887j3028N207k1567
$$ plain form
10291 6063107 5522086 4969144 4442166 4055420 3740794 3475035 3223263 2974075 2810854
10282 2810854 2677653 2522457 2356252 2213181 2097162 1993862 1877041 1804144 1765892 1709545
10272 1709545 1655320 1590355 1533227 1535680 1485250 1440075 1400802 1309974 1275988 1232828 1191435
10261 1191435 1162440 1148977 1127705 1097620 1066564 1030404 1030348 1022218 1031919 1051955 1034372 1043150
10249 1043150 1067021 1119690 1146535 1189330 1259177 1370398 1525494 1656533 1689843 1602176 1449125
10238 1449125 1343401 1338522 1392631 1467546 1573043 1777285 2067936 2273729 2317608 2323640 2459336
10227 2459336 2775411 3092920 3044588 2701584 2349959 2189176 2171208 2088757 1824017 1456077
10217 1456077 1174581 977064 873053 795698 743531 716037 693129 686242 673214 678421 656854
10206F56854m9433k3333j7510N800q066r431m517j0980P37L0722K706j0046l7672
10193E25831j2334O396j2735k2826k9044k3423j7014j3381m673k7989l226M610
10181C70192j2849k7545j996J0080p42j5167l8168m0272l8007l5680J6616o038
10169A80424L739J8792J345k7486J4041P4100J4485K0722K2289M2129J5580j2252
10157C67908K5372M69q607k2100j3471L0264J619k3859k6306k1321K5886K0851
10145C56705j2933k5561k178N547j410m20Q723Q979K5199L3646J0873k6510r854
10132C70806j8608m234J3248K4505k529L126j7432j5708j05M320k5696n5917k2244
10119B53532p26J6486J0378Q843o595k1314k0282q972K2789K8959Q738k3180k7386
$$ plain form
10206 656854 607421 584088 566578 572378 564312 554881 550364 539384 540121 570843 573549 563503 525831
10193 525831 513497 519893 507158 484332 455288 431865 414851 401470 396797 368808 365582 370192
10181 370192 357343 329798 327802 337882 337140 321973 283805 243533 205526 169846 186462 180424
10169 180424 184163 202955 204300 176814 190855 264955 279440 300162 322451 364580 380160 367908
10157 367908 393280 393749 385142 363042 349571 379835 381454 357595 331289 309968 335854 356705
10145 356705 343772 318211 316033 321580 320170 319750 328473 337452 362651 396297 407170 380660 370806
10132 370806 352198 347964 361212 385717 383188 386314 368882 353174 353069 357389 331693 275776 253532
10119 253532 252806 269292 279670 288513 281918 260604 240322 231350 254139 283098 291836 268656 241270
10106B41270k052J7165q74Q55o532k700q31J4080L1283N54j3196Q617M317O149
10092B98105J8942j0123k0807O73l96J8055J6434j687r179j318j3888k964r349
10079B82498j884K457P660J0912L7089j0964j5341k254p553p404o120J3201J3109
10066C15406K6615j9072J1010J1181k0105k7886n548P601P832M317j8571k0075
10054B72705l080J679R468k3703n818J9036L001P190K6508q154J1614j674j0781
10041B97991p062j3822o039l964L0088p1q557p639K661k3488O667j1030J3549
10028B69284Q793N811L0818Q933k6298k2579K6560O367k6446J1227j2940P645
10016B87175L1707K1982J9112j2841k6666J9300L1030N439K5980j2431m4378j2259
$$ plain form
10106 241270 239218 256383 255509 256364 249832 247132 246301 260381 291664 292218 279022 287639 291956 298105
10092 298105 317047 306924 286117 286790 286394 304449 320883 319196 310017 308699 294811 291847 282498
10079 282498 280614 283071 290731 301643 338732 327768 312427 310173 302620 295216 289096 302297 315406
10066 315406 342021 322949 333959 345140 325035 297149 291601 299202 307034 311351 292780 272705
10054 272705 269625 271304 280772 257069 251251 270287 273288 280478 306986 298832 310446 308772 297991
10041 297991 290929 277107 271068 267104 297192 297121 288564 280925 283586 260098 266765 255735 269284
10028 269284 278077 283888 314706 323639 297341 274762 301322 307689 281243 292470 279530 287175
10016 287175 318882 340864 359976 347135 320469 339769 370799 376238 402218 389787 345409 333150
10004C33150J796j033j7872k6075J2394N071J1711J2469M34j0841k0442M085L7888
9991C42735j1650l5001L065R071Q956l108r955j8352j3915P307O645K9646J2439
9978C27883l1208M061j8672p088J198p288J950K5665l009L3458K4533l8478j0485
9965C02520j4850L913J7145J8477j6128o662M442n614q294j6438K9824L9182j039
9952C46478J5484K3182j621O484j3809j6591K4125M5039J272k3622j6930m307
9940C85184K9246K0235K7429L0358R486K3592L2818j5765l3530k3312L117J438
9928D90296l6601l3149o18N0073O1438P1469J49533K53927L67242N79948O77962
9917B631520N00686j4407l54006l78651k56819m5276N5246r8501k38170k24310
$$ plain form
10004 333150 334946 333913 316041 289966 302360 307431 319142 331611 332045 321204 300762 304847 342735
9991 342735 331085 296084 299149 308220 317176 314068 304113 285761 271846 279153 285798 315444 327883
9978 327883 296675 300736 282064 274976 276174 268886 270836 296501 293492 326950 351483 313005 302520
9965 302520 287670 291583 308728 327205 311077 304415 308857 303243 294949 278511 308335 347517 346478
9952 346478 361962 385144 383523 390007 376198 359607 383732 428771 430043 406421 389491 385184
9940 385184 414430 434665 462094 492452 501938 525530 558348 542583 509053 485741 488858 490296
9928 490296 453695 420546 419928 470001 531439 602908 752441 1006368 1373610 1953558 2631520
9917 2631520 3132206 3117799 2763793 2385142 2128323 2083047 2138293 2039792 1801622 1577312
9907A577312j74399j78125k03074j94030j53974r0629m5676m0012n1842k9329
9897D16222j2296N861k5016n346J0607m385j9067L041K2491J2890l5738j8423
9885C50841K9771N0686L0560n517j3770L654j6499j0043N2261R1778J03297J64410
9873H31429K61612L04724L03823N0751k89070l64745k40329j33938p2904n8707
9863E92646m2292m0149m6234R369Q158J4050M7721K4304K6477M5899Q3714J61666
9851H85329K41021L15643L30196L25863K52608N6441j00049k21310k80427j97262
9841A608053l6949J54125K30758J82279q0221l36764l85021l13707k05951j23411
9831F93191p5018p0152l8253l602k2330k0530r338k0271k4043q27M910L0554J1876
$$ plain form
9907 1577312 1402913 1224788 1021714 827684 673710 583081 537405 497393 445551 416222
9897 416222 403926 409787 384771 379425 390032 385647 366580 369621 392112 405002 369264 350841
9885 350841 380612 431298 461858 456341 442571 446225 429726 419683 471944 563722 667019 831429
9873 831429 1093041 1397765 1701588 1752339 1463269 1098524 858195 724257 651353 592646
9863 592646 550354 510205 463971 473340 481498 495548 543269 567573 594050 639949 723663 885329
9851 885329 1126350 1441993 1772189 2098052 2350660 2407101 2307052 2085742 1805315 1608053
9841 1608053 1571104 1725229 1955987 2138266 2058045 1721281 1336260 1022553 816602 693191
9831 693191 618173 548021 509768 506166 483836 463306 453968 433697 409654 408827 413737 444291 456167
9818D56167j7107J1954J7017M2282K218Q186K5084n451O212J3856N2730P6390
9806F89538J46791K09805L56205N24002O78929O57603L90110J12906j52240l69349
9796C244300n93995o73114n31948l49387k09720j27437q9345m6907m8138l3464
9786E40845j4701P03r858k2334o020N685k0334r207k2526O935R434p705N598r906
9772D46609j0381j5964p333k0030n59J1382K8662J2037M902j1246J5829M0327
9760D94235N065J1229J4637N492R327j336l467M6209M3294M8785L5414O5418J15926
9747H90228J09547J21133J64685J47504P9339M82m9871q7223j38689j19091j00056
9736A017988n9608k4924m070k439j2338K960K5709N9459Q3328Q6046P6395J20136
$$ plain form
9818 456167 439060 451014 468031 510313 512531 520717 545801 540350 546562 560418 613148 689538
9806 689538 836329 1046134 1402339 1926341 2605270 3262873 3652983 3765889 3613649 3244300
9796 3244300 2650305 1977191 1445243 1095856 886136 758699 669354 622447 574309 540845
9786 540845 526144 526847 516989 494655 488635 494320 473986 464779 442253 449188 458622 450917 456515 446609
9772 446609 436228 420264 412931 392901 392342 403724 432386 444423 449325 438079 453908 494235
9760 494235 499300 510529 525166 530658 539985 538649 535182 581391 624685 673470 708884 774302 890228
9747 890228 999775 1120908 1285593 1433097 1512436 1512918 1463047 1375824 1237135 1118044 1017988
9736 1017988 958380 933456 929386 926947 914609 917569 943278 1002737 1086065 1172111 1248506 1368642
9724A368642J69793K16079K38009K41339K25127J61443J20122J02104l504q9492
9714B749662o7653j11303j19223p4925k1120P6331O9413O3198M0926M7706L9645
9703B692657O9312J36471J93848K75354L26662L07499K39313J31737O9862k9822
9693D412893n2591p2262l4239o601q248l064l966M057J1968J4376P4142J14030
9681D450495J46595J87974J97848K59442K69608L10990L04696K73014K37872J76024
9671F814558Q5229K5393o3954r0130p3270k135N5703Q6565J47452J24397N6777
9660G166585l1262j16723j16275p0552j8101N1190J30735J82437K32417K93489
9650G703940K96122K92227K59040K02993J63026J09152Q2525R9712J75988K51587
$$ plain form
9724 1368642 1538435 1754514 1992523 2233862 2458989 2620432 2740554 2842658 2839154 2749662
9714 2749662 2682009 2570706 2451483 2376558 2355438 2431769 2501182 2564380 2605306 2653012 2692657
9703 2692657 2761969 2898440 3092288 3367642 3694304 4001803 4241116 4372853 4442715 4412893
9693 4412893 4360302 4288040 4253801 4247200 4238952 4235888 4231922 4235979 4247947 4262323 4336465 4450495
9681 4450495 4597090 4785064 4982912 5242354 5511962 5822952 6127648 6400662 6638534 6814558
9671 6814558 6899787 6925180 6861226 6771096 6697826 6695691 6751394 6837959 6985411 7109808 7166585
9660 7166585 7135323 7018600 6902325 6831773 6813672 6864862 6995597 7178034 7410451 7703940
9650 7703940 8000062 8292289 8551329 8754322 8917348 9026500 9109025 9208737 9384725 9636312
9640I636312L30143L61485K68213J72521J49637J56754J12884P8213M0769O8563
9630A1375494J32892K14791K62039L28072L76949L43095K68227K03324K27728
9621A3732611K96902L97446M38591L95229K61673k8243k18270l43311l49059l22513
9611A4261056l12565l32180k93433k40027j16348L3777J06586J95190K38230K15950
9601A3756236J02972M9032J20847K27143L55011M36408L78321J80431R61j02202
9591A5505160k01548k38848k47277l03762l18822k74268k59724k82925l00059
9582A3077927k88334k95846k80401k51612j63902K9273K02093L33561L57206L34190
9572A3054155K56506K44841L27430M49753M37090L64905K46335J45785J03564
$$ plain form
9640 9636312 9966455 10327940 10596153 10768674 10918311 11075065 11187949 11266162 11306931 11375494
9630 11375494 11508386 11723177 11985216 12313288 12690237 13033332 13301559 13504883 13732611
9621 13732611 14029513 14426959 14865550 15260779 15522452 15494209 15275939 14932628 14583569 14261056
9611 14261056 13948491 13616311 13322878 13082851 12966503 13000280 13106866 13302056 13540286 13756236
9601 13756236 13859208 13908240 14029087 14256230 14611241 15047649 15425970 15606401 15607362 15505160
9591 15505160 15303612 15064764 14817487 14513725 14194903 13920635 13660911 13377986 13077927
9582 13077927 12789593 12493747 12213346 11961734 11797832 11827105 12029198 12362759 12719965 13054155
9572 13054155 13310661 13555502 13882932 14332685 14769775 15134680 15381015 15526800 15630364
9563A5630364R8412J01745Q0413k309j44373l65393n86212o65051p72919q42246
9553A2532431r49088r96499j000361q79750o76937m43829k07493j0830J75623
9544G543267L20359L81302M46654M82007M70571M85501L80612K85909K42234K22656
9534A1261072J69609m1715l65261o34606p32735p62775p32429p02784o45229n27177
9524F285970l59377j99404o930J80433L74581M99316N44883N42818N58710N40138
9514H961138M82147L02595P9727o0167j63429k61376l78097m55709m93492n42353
9504G470984n49775n25227m51616l62910k39340j18765J5473J66739L47001N79103
9494F331667P24347Q51097R44555R48674Q89706P50290N20293K59960k0936l32395
$$ plain form
9563 15630364 15728776 15830521 15910934 15908625 15764252 15398859 14812647 14147596 13374677 12532431
9553 12532431 11583343 10586844 9586483 8706733 8029796 7585967 7378474 7367644 7543267
9544 7543267 7863626 8244928 8691582 9173589 9644160 10129661 10510273 10796182 11038416 11261072
9534 11261072 11430681 11388966 11023705 10389099 9656364 8893589 8161160 7458376 6813147 6285970
9524 6285970 5926593 5727189 5720259 5900692 6275273 6774589 7319472 7862290 8421000 8961138
9514 8961138 9443285 9745880 9825607 9765440 9602011 9340635 8962538 8506829 8013337 7470984
9504 7470984 6921209 6395982 5944366 5581456 5342116 5223351 5238824 5405563 5752564 6331667
9494 6331667 7056014 7907111 8851666 9800340 10690046 11440336 11960629 12220589 12199653 11867258
9484A1867258o55643q00006r12599j022131j060506j016899r12512p08072n42930
9475D235960l95445k63963j84548q6423K9976J16493K02020K73319L97479M32537
9465D757405L93341L69518L56652K86414J86580N0334r7227k43063l72564m60532
9455E226858n07199m69838m30384m57641m53670l64943k92079k12394j59838j40262
9445A738610r9358r4218o9883n3322k5380l4378m6794n2613k1751m409j7799j4803
9433A203902jK6924L5284L9342R6K9372K9288K6880N2653Q6340J09051J63235
9421A802366K55561L62832M33749M59627L75054J25526j53728l15873l63894l23096
9411B658124k54507j72082j18998n8050l5878j8552k9119J8190M3600O5140P0780
$$ plain form
9484 11867258 11211615 10411609 9499010 8476879 7416373 6399474 5486962 4778890 4235960
9475 4235960 3840515 3576552 3392004 3305581 3335557 3452050 3654070 3927389 4324868 4757405
9465 4757405 5150746 5520264 5876916 6163330 6349910 6400244 6303017 6059954 5687390 5226858
9455 5226858 4719659 4249821 3819437 3361796 2908126 2543183 2251104 2038710 1878872 1738610
9445 1738610 1639252 1545034 1475151 1421829 1396449 1362071 1315277 1262664 1240913 1236504 1218705 1203902
9433 1203902 1203901 1230825 1266109 1305451 1305547 1334919 1364207 1391087 1443740 1530080 1639131 1802366
9421 1802366 2057927 2420759 2854508 3314135 3689189 3814715 3660987 3345114 2981220 2658124
9411 2658124 2403617 2231535 2112537 2054487 2018609 2000057 1970938 1989128 2032728 2097868 2168648
9400B168648Q7115J79850K76118M23501N34323O26405O49249N33928K62168j18562
9390E622743m49700o02631n90143m89665l58441k31129j27889n5240j3984L5622
9380B739543P1683J27352J78819L03992L96552M48173M37400L04891J50165N1261
9370E209831J3650K3519q1367k34604l61088m35777l92300l05860k13042j13019
9360C109943q5906m5739p663O3275J10562K32764L23397M61244N96222O86152
9350E444251P26537O60291M52364J41288k05616m80174o36720o44112n42127l86259
9340D529723j72048m6869J42422L35864M93465O47756O81639N28670K27833q9079
9330G279376l20946l36633j65595j671J08445J27365N5641o6518k21867m03788
$$ plain form
9400 2168648 2255763 2435613 2711731 3135232 3669555 4295960 4945209 5479137 5741305 5622743
9390 5622743 5173043 4570412 3980269 3490604 3132163 2901034 2773145 2717905 2703921 2739543
9380 2739543 2811226 2938578 3117397 3421389 3817941 4266114 4703514 5008405 5158570 5209831
9370 5209831 5223481 5247000 5165633 4931029 4569941 4134164 3741864 3436004 3222962 3109943
9360 3109943 3024037 2978298 2970635 3033910 3144472 3377236 3700633 4161877 4758099 5444251
9350 5444251 6170788 6831079 7283443 7424731 7219115 6738941 6102221 5458109 4915982 4529723
9340 4529723 4357675 4310806 4453228 4789092 5282557 5930313 6611952 7140622 7368455 7279376
9330 7279376 6958430 6621797 6456202 6454531 6562976 6690341 6745982 6679464 6457597 6053809
9320F053809m55036m66170l34896j68180k4092J52027L17844N14147P25413R86135
9310G301001J059032R07917N86847K09425k08679n01437n15804m87976m60443
9301G889883m69535m42049l87421l11993k44979j44030L9335K39136M45889P30410
9291G344646J018352J157525J035156O02078M4013l75496n13570m19825l56633
9282I536246m10761m66044m48019l74160l16430l28827l44821l65465k66214j40915
9272F074590K3874K21468M53011P40579J039010J295218J493289J472476J136616
9263A3950131M72057m15595j212210j637118j577765j299983r77413o93643n09331
9254F099130l51264k50491j74854q5635L217J27863K51484M17005O16122P71698
$$ plain form
9320 6053809 5598773 5132603 4797707 4629527 4605435 4757462 5075306 5589453 6314866 7301001
9310 7301001 8360033 9267950 9854797 10064222 9855543 9354106 8838302 8350326 7889883
9301 7889883 7420348 6978299 6590878 6278885 6033906 5889876 5929211 6168347 6614236 7344646
9291 7344646 8362998 9520523 10555679 11157757 11201770 10826274 10312704 9892879 9536246
9282 9536246 9125485 8659441 8211422 7837262 7520832 7192005 6847184 6481719 6215505 6074590
9272 6074590 6098464 6319932 6772943 7513522 8552532 9847750 11341039 12813515 13950131
9263 13950131 14422188 14006593 12794383 11157265 9579500 8279517 7302104 6608461 6099130
9254 6099130 5747866 5497375 5322521 5236886 5240103 5367966 5619450 6036455 6652577 7424275
9244G424275P32942N46862L06235K05781J17426j64490n76436q72478r36930q24959
9234E958228o35202m91650l34865k28506j67590p2438j1006Q9378J42595J81992
9224D430936K82400M21044N68413O31873N95491K73382j97862o07467q08610q32835
9214D756765p10940n27490l49022k30644j66790r5112n3878l9038L5951N0934
9204B670736K9208K8687M5158N0596O2003J22894J46473J43399J37439P2903p6571
9193C432925k77215l57674l02142k34426j82010j12135o2587k5884N037O3762
9183A947651Q5503J07075J87690K58212L87862M41348M84613L57829J56907m9507
9173D365183k53572m18328m57242l82607k79922k21927j64853r6905n1242m0171
$$ plain form
9244 7424275 8157217 8704079 9010314 9216095 9333521 9169031 8592595 7720117 6783187 5958228
9234 5958228 5323026 4831376 4496511 4268005 4100415 4027977 4016971 4106349 4248944 4430936
9224 4430936 4713336 5134380 5702793 6334666 6930157 7203539 7005677 6398210 5589600 4756765
9214 4756765 4045825 3518335 3169313 2938669 2771879 2676767 2622889 2583851 2619802 2670736
9204 2670736 2699944 2728631 2773789 2824385 2886388 3009282 3155755 3299154 3436593 3509496 3432925
9193 3432925 3155710 2798036 2495894 2261468 2079458 1967323 1904736 1878852 1883889 1947651
9183 1947651 2033154 2140229 2327919 2586131 2973993 3415341 3899954 4257783 4414690 4365183
9173 4365183 4111611 3693283 3236041 2853434 2573512 2351585 2186732 2089827 2038585 1998414
9163A998414l0247M3898Q5859J01916J01925J65178K70759M37879O10882Q00727
9153D587190J012515J063313Q39266L32063k47945p12796r66379r34262p78721
9144D194244n73609l90421k21906j65145j12872n5763q872L4466N7439J22688
9134B880249J66442K56408L98312N67023Q14290J159700J459776J654245J503687
9125A0860132Q49449j41752j032292j437278j412035j142934q48281o04122m13931
9116D676956k94328j51598q8209j9572P5456J28937J81550L00411M06689O51877
9106E868169R07853J198113J539639J840465J867894J459457N33521n83776j409522
9097A3221813j679858j564710j258166q88555n60858l94739l71260l86711l92455
$$ plain form
9163 1998414 1968167 2012065 2097924 2199840 2301765 2466943 2737702 3175581 3786463 4587190
9153 4587190 5599705 6663018 7502284 7834347 7586402 6873606 5907227 4972965 4194244
9144 4194244 3620635 3230214 3008308 2843163 2730291 2674528 2665656 2700122 2757561 2880249
9134 2880249 3046691 3303099 3701411 4268434 5082724 6242424 7702200 9356445 10860132
9125 10860132 11709581 11567829 10535537 9098259 7686224 6543290 5695009 5090887 4676956
9116 4676956 4382628 4231030 4142821 4123249 4198705 4327642 4509192 4809603 5216292 5868169
9106 5868169 6776022 7974135 9513774 11354239 13222133 14681590 15215111 14631335 13221813
9097 13221813 11541955 9977245 8719079 7830524 7269666 6874927 6503667 6116956 5724501
9088E724501l51186k94996j76209n3421M7785J79251L57380N20417P54296J031442
9078G739260J249474J387105J194036O11411k10028q99875j219734j166868q09443
9069G875338m77899k30264j82222k59503m15209n01998m84978l40804k49599j19440
9059D613422r657Q5441K48732L58436N54947P28884Q83557Q86670O62899K89179
9049I302510j10865m64608o95031o22133l63698k9550K01801K67509J32036j18010
9039G499961m15472n63732n50791m07369l00767k27117j12935L4881J31518K32015
9029E320192K88829L35856L25573K75137J06255q5586k24815j81113K040J89610
9019F351978L56697M13070K98062L9619k54841m87862o37543p07853o29786n10456
$$ plain form
9088 5724501 5373315 5078319 4902110 4848689 4896474 5075725 5433105 5953522 6707818 7739260
9078 7739260 8988734 10375839 11569875 12181286 11971258 11071383 9851649 8684781 7875338
9069 7875338 7397439 7167175 6984953 6725450 6310241 5808243 5323265 4982461 4732862 4613422
9059 4613422 4603765 4689206 4937938 5296374 5851321 6580205 7463762 8350432 9013331 9302510
9049 9302510 9191645 8727037 8032006 7409873 7046175 7016625 7218426 7485935 7617971 7499961
9039 7499961 7084489 6520757 5969966 5562597 5261830 5034713 4921778 4956659 5088177 5320192
9029 5320192 5609021 5944877 6270450 6545587 6651842 6566256 6341441 6160328 6162368 6351978
9019 6351978 6708675 7121745 7419807 7459426 7204585 6716723 6079180 5371327 4741541 4231085
9009D231085m01344l31397k47686j97297j30028j00660n9532o369L4313N1645
8999B842730R5979J29328J80470K46048L40242M39050N04414N42861M21280J06615
8989E849017k57394n04258n90418n50506m56615l50569k33416j54107j13623r0114
8979B547997j7106J999J4358M2622J04841J64782J98234K61832L66676M91558
8969D177793N37859N48022L75508P2823l01375n07330n55847n07322l95533k68565
8959C176033j83937j40030q2726l5285N3287R7420J31870J65410J62490J64528
8949C509060K15309K15731K24976K14846K27542K51612K62106K69472K17429J16979
8939E725062L9137J1561p380m2153q0829j23458j37122p4782j21097j89463k19632
$$ plain form
9009 4231085 3829741 3498344 3250658 3053361 2923333 2822673 2763141 2756772 2791085 2842730
8999 2842730 2938709 3068037 3248507 3494555 3834797 4273847 4778261 5321122 5742402 5849017
8989 5849017 5591623 5087365 4496947 3946441 3489826 3139257 2905841 2751734 2638111 2547997
8979 2547997 2530891 2532890 2547248 2589870 2694711 2859493 3057727 3319559 3686235 4177793
8969 4177793 4715652 5263674 5639182 5712005 5410630 4903300 4347453 3840131 3444598 3176033
8959 3176033 2992096 2852066 2769340 2734055 2787342 2884762 3016632 3182042 3344532 3509060
8949 3509060 3724369 3940100 4165076 4379922 4607464 4859076 5121182 5390654 5608083 5725062
8939 5725062 5764199 5775760 5768380 5726227 5645398 5521940 5384818 5310036 5188939 4999476 4779844
8928D779844k29172k05170j56462j44465j39805j31110j09077q3949k5476K1133
8918C576291L5709N1062Q8909J21288J35595J85186J80208J98177K39530K71764
8908E083719L14669K67901J29363N3629J4211r6570j18059k07427k69196k25883
8898D946357j82441j17153q0195j6125P8735J47892K14423L85078N29722O02502
8888F508795O91477O50273N76474M86251L43251J55838l7924k34178m03626n31273
8878H205358o62709o91712o35779m93696m15738l30458k63202j98462r2081j0414
8868D411107J01995K29802L00669M43234N59067O45114P34600Q52661Q48329P93396
8858I919974P20976O50271N40706M34586K34097p163k43920m24570n17052o55651
$$ plain form
8928 4779844 4550672 4345502 4189040 4044575 3904770 3773660 3664583 3580634 3555158 3576291
8918 3576291 3612000 3663062 3751971 3873259 4008854 4194040 4374248 4572425 4811955 5083719
8908 5083719 5398388 5666289 5795652 5849281 5863492 5766922 5648863 5441436 5172240 4946357
8898 4946357 4763916 4646763 4566568 4550443 4629178 4777070 4991493 5376571 5906293 6508795
8888 6508795 7200272 7850545 8427019 8913270 9256521 9412359 9374435 9140257 8736631 8205358
8878 8205358 7542649 6850937 6215158 5721462 5305724 4975266 4712064 4513602 4421521 4411107
8868 4411107 4513102 4742904 5043573 5486807 6045874 6690988 7425588 8278249 9126578 9919974
8858 9919974 10640950 11291221 11831927 12266513 12500610 12493447 12249527 11824957 11307905 10652254
8848A0652254p26780p62727p97944p74705p81539p02750n62297l88087k08969
8839D946456m2630P6383K13178K95144L53983L74798L68780L54929L53978L11615
8829G606614K87653K10235R0048m1751j30077k27994l18696m14804m26924m63225
8819F171079m65954m01003l12048j88454o3378O9620K19494K95654L36235L90553
8809F051798M07036L46711K82910K32848J71507J43332J14147J07372M1315N114
8799G904090J7983j1511p8654j76315k87874l51331m09814m44533m65350m53986
8789E242705l57840k53941j61778o2482N0926J36161J83073K30123K55792K72935
8779E535674K59515K06854J33981J04594L3708l0074j14884k24240l39012l53031
$$ plain form
8848 10652254 9925474 9162747 8364803 7590098 6808559 6105809 5543512 5155425 4946456
8839 4946456 4903826 4980209 5193387 5488531 5842514 6217312 6586092 6941021 7294999 7606614
8829 7606614 7894267 8104502 8194550 8152799 8022722 7794728 7476032 7061228 6634304 6171079
8819 6171079 5705125 5304122 4992074 4803620 4740242 4809862 5029356 5325010 5661245 6051798
8809 6051798 6458834 6805545 7088455 7321303 7492810 7636142 7750289 7857661 7898976 7904090
8799 7904090 7922073 7910562 7831908 7655593 7367719 7016388 6606574 6162041 5696691 5242705
8789 5242705 4884865 4630924 4469146 4406664 4457590 4593751 4776824 5006947 5262739 5535674
8779 5535674 5795189 6002043 6136024 6240618 6274326 6244252 6129368 5905128 5566116 5213085
8769E213085m04523l78354l98298l67848k85711k28725j73430j17268o5870o8244
8759B724814p6400k9074M0511M7068J8516o588o88l5426l8645l3151j3020O882
8747B604799q82k764l339K889j5485l7968l3732o0422n0388o2164k7214O327N0840
8734B370497J13847J45194J36641J47238J28950P1784j0014p0755j10138j93068
8724B730176k21508k16539k03228j70465j32769j38896j46493j42277p3698o0691
8714A223612o5848n8297o2087n6406n6006J0445l32j2528n3314o8669o4314j0335
8702G25921k0099m2418k4890k4150j5792K7942n246k3295m481J6421p462j9915
8690E82536M308L201L326J3624l5101J9481j0490k778P857l998K2286L1331K414
$$ plain form
8769 5213085 4808562 4430208 4031910 3664062 3378351 3149626 2976196 2858928 2793058 2724814
8759 2724814 2648414 2619340 2659851 2706919 2725435 2718847 2718159 2682733 2644088 2610937 2597917 2604799
8747 2604799 2603917 2601153 2597814 2600703 2585218 2547250 2513518 2453096 2402708 2340544 2313330 2319657 2370497
8734 2370497 2484344 2629538 2766179 2913417 3042367 3114151 3104137 3033382 2923244 2730176
8724 2730176 2508668 2292129 2088901 1918436 1785667 1646771 1500278 1358001 1284303 1223612
8714 1223612 1157764 1099467 1037380 980974 924968 935413 935081 922553 869239 800570 736256 725921
8702 725921 705822 663404 638514 614364 598572 626514 621268 597973 593492 609913 602451 582536
8690 582536 586844 590045 593371 606995 571894 591375 580885 578107 585964 581966 604252 635583 637997
8677F37997l2462j1037q22J3307j2624K503K522r7r163R532Q657Q761J1424k0383
8663F08115j6581L17P620n972J4881j1144l2472j6318J6653N982J2424K266j3233
8650E72538J8051J9037J7752K1969P66N4J4494J8661J229M0779N5405M9194Q4146
8637I14075R2092R630r3004q9815o8303n7206J1347J5605j3186P649o869k1497
8625G00518k4690L5099M4912L0118j3973k0540m114L7955L3179K3978O606L7243
8613H86291L6705K8084K2331M6178M9669K8671M9114J8993J8698J8781m708J8888
8601A217695J7778J9892K4713j6297m6574k7791K0130O4616J44730K05261J15239
8590A739392j13372k05307j45945j25336o1926m3899k7953m003k9690n2928o0918
$$ plain form
8677 637997 605535 594498 593676 606983 594359 596862 599384 599287 590124 599656 608313 617074 628498 608115
8663 608115 591534 591851 599471 593499 608380 597236 564764 548446 565099 571081 583505 585771 572538
8650 572538 590589 609626 627378 649347 650113 650167 664661 683322 684551 725330 780735 829929 914075
8637 914075 1006167 1015797 922793 832978 764675 707469 718816 734421 721235 728884 722015 700518
8625 700518 675828 710927 755839 785957 771984 751444 747330 785285 818464 842442 849048 886291
8613 886291 922996 951080 973411 1019589 1069258 1097929 1147043 1166036 1184734 1203515 1198807 1217695
8601 1217695 1235473 1255365 1280078 1263781 1217207 1189416 1209546 1274162 1418892 1624153 1739392
8590 1739392 1626020 1420713 1274768 1149432 1087506 1043607 1015654 1011651 981961 929033 868115
8579H68115l1076k5243j5535o8924l8419o7295o5552j3216l002j6989n0543l1842
8567D40479m652j7531j2870m268m7798l648j1692m225K3710J4554p287P219Q804
8554C80795k0986p206L867K6897P845N7133O5442Q8020N6217m8144r3050q9763
8542D27067l9642k5558l7351l7265j8181K226k005L2962L702q836J9086j555j0547
8529C04103k9056O059J9967l6158r700L0386K6604n59J473j6799j7353o451Q415
8516B80931K0005j5077L21J4999n232k6545o667j6175l879K3992N848j5807k9061
8503B27653j0980k3139k0315J8881J9182k4858j6519J0202J1181M634P36j7449
8491A79209K357K481K2134P752j8240M682J9202O478L2937j1058j324k2950j8895
$$ plain form
8579 868115 837039 811796 796261 727337 688918 621623 556071 542855 539853 522864 472321 440479
8567 440479 435827 418296 405426 401158 353360 349712 338020 333795 357505 372059 364772 371991 380795
8554 380795 359809 352603 356470 383367 391212 448345 513787 601807 658024 609880 516830 427067
8542 427067 387425 361867 324516 287251 269070 271296 269291 302253 305955 297119 316205 314650 304103
8529 304103 275047 281106 301073 264915 255215 285601 312205 311646 313119 296320 278967 272516 280931
8516 280931 300936 285859 286180 301179 295947 269402 262735 246560 242681 266673 272521 256714 227653
8503 227653 216673 193534 173219 192100 211282 186424 169905 180107 191288 195922 196658 179209
8491 179209 181566 184047 206181 213933 195693 200375 219577 226055 258992 247934 246610 223660 204765
8478B04765J8449j2932O024J571n1677L540M1767L4959q843k746j7319N41p19
8465B17380r449J7943j3823o014J3905O141m129k3336M944K2560l82Q941J9821
8452B54502k6246l1814K322K2835J6757k2356r324j3433l794L832m32j9316l983
8439A69550J0902J9179j1622L803q52L5963J5463J3148n806k1589k4382K2986
8427B26743L054j3427l0140O702Q95j6897Q849J2587m459o5j2775j9174j3447
8414A48446J0045J5237J4035Q469L673K1017j227j7775l0745j8634r17P470M164
8401A63258K5365J4725l394j8392J8327k5951l0887j0295J7613K3675j0481N468
8389A69031r102j2139k3522j9999J3406J4650M958K757J2009K0138J4817Q943
$$ plain form
8478 204765 223214 210282 216306 217877 166200 169740 211507 246466 237623 234877 217558 218099 217380
8465 217380 207931 225874 212051 206037 219942 226083 221954 198618 203562 226122 225740 234681 254502
8452 254502 228256 196442 198764 221599 238356 216000 206676 193243 189449 193281 192849 173533 169550
8439 169550 180452 199631 188009 191812 190960 226923 242386 255534 249728 228139 203757 226743
8427 226743 229797 216370 186230 192932 193827 176930 185779 198366 193907 193842 181067 161893 148446
8414 148446 158491 173728 187763 196232 199905 220922 219695 201920 171175 152541 151624 159094 163258
8401 163258 188623 203348 199954 181562 199889 173938 143051 132756 150369 174044 163563 169031
8389 169031 159929 147790 124268 104269 117675 132325 137283 140040 152049 172187 187004 195947
8377A95947J9748l966j3911o083k5725q310j8513r331j4913K3472L5348j5512
8365A58251j0153k9163J1312l393j2911J7613k0211N218M578m243Q656O846K497
8352A34897R205k2163J00L552L630J4466k7810M671j9836l4952k8437J524K0463
8339E9310K4474R019Q261P499r823M937j9211O324m572M854N923J5921j2408p652
8325I2856j9567q871M715J8047k507N916K5851J2198M1859l766j7940J458l1969
8312A18280k2321L67k4372K814J474M043M731j0k9509L468J1174J0605j0890j6793
8298E3061l726Q007m046j5298j3421J9392J4974p893k3042r40J1560N4148J5192
8285A07968l9624k172L6411m665J8221n473j2935p906P860j763j6745Q291L6615
$$ plain form
8377 195947 215695 211729 197818 191735 166010 157700 139187 129856 114943 138415 173763 158251
8365 158251 148098 118935 130247 126854 113943 131556 111345 116563 121141 116898 125554 132400 134897
8352 134897 144102 121939 122039 125591 129221 143687 115877 120548 100712 65760 37323 38847 59310
8339 59310 83784 92803 101064 108563 98740 103677 84466 90790 86218 91072 96995 112916 100508 92856
8325 92856 73289 64418 69133 87180 84673 90589 116440 128638 170497 166731 148791 150249 118280
8312 118280 95959 96326 71954 74768 76242 80285 85016 85006 55497 58965 70139 80744 69854 53061
8298 53061 49335 57342 53296 37998 24577 43969 58943 51050 28008 27068 38628 92776 107968
8285 107968 68344 66172 102583 97918 116139 110666 97731 89825 97685 95922 79177 87468 124083
8272A24083K2267l934N833k4265l9273j117O440j4059n422J5730j9904p713M236
8259F2902J6181p94O069j4801l5773j0364J0319L478K7529J3003r872K362K6328
8246I6567K2746j0625j6900o466n749j9596J6902l7769j8097J1147J6911n358
8234D3713J8309K2257l2918L847J1535P934P870R449J2020k593j3958N324j1015
8221H1774j8158n982K0593r307j14p192j4102J219L806K8075O023j8903m642k1341
8207D1749r895J5930O87O251J4143J4519K095k4281J1654K0207M9687j2536n2009
8194G8201k1152l235R597Q414N782o042k0505j4861K7060L6338k273k4666j8036
8181E4622P945J2381N045m60J387J588J3758j6486M05J0785L528J0321N633K071
$$ plain form
8272 124083 146350 142416 148249 123984 84711 83594 90034 75975 70553 86283 66379 58666 62902
8259 62902 79083 78289 84358 69557 33784 23420 33739 37217 64746 77749 67877 70239 96567
8246 96567 119313 108688 91788 85322 79573 59977 76879 39110 21013 32160 49071 43713
8234 43713 62022 84279 51361 55208 66743 74677 82547 91996 104016 101423 87465 92789 81774
8221 81774 63616 57634 78227 68920 68806 61614 47512 48731 52537 80612 86635 67732 63090 41749
8207 41749 31854 47784 48471 54722 68865 83384 85479 61198 72852 93059 142746 130210 78201
8194 78201 57049 53814 63411 71825 77607 71565 51060 36199 63259 99597 97324 72658 54622
8181 54622 62567 74948 79993 79533 80920 82508 96266 79780 80185 90970 94498 104819 110452 112523
8167A12523j8110j0028j5059o74j010K1224O037N619j8771J3060j422j9940j189
8154G2260p178K608J6848l996O308M3132K7572L9983N5330p366k9558o6528l1413
8141A18002j3136k1983r347j72j395J4409O014k1066l9931J5157R86L437K0277
8128G1252k2259q000r615R332J0381J794L796Q50o168k70P578j3720J5558L521
8114F4030N635j2146k0133J705K5832K2521L3899L3595L7346M4759J5984l7900
8102B15127n2869p2643r252K840k396O06n814k3817j4761j3151M929o09j0245
8089A7945R978J4614K675N351m577j9949j9551J1070K5852L6480J9063k1033k4376
8076E3542J4333J7134o852l4231j5500j3379L2979N3659J3595l4994k2420K5235
$$ plain form
8167 112523 94413 84385 69326 68652 67642 88866 94903 100522 81751 94811 93389 73449 72260
8154 72260 65082 67690 84538 80542 86850 129982 157554 197537 252867 245501 215943 149415 118002
8141 118002 104866 82883 73536 73364 71969 86378 92392 71326 31395 46552 47538 50975 71252
8128 71252 48993 40993 31378 40710 51091 52885 56681 57531 51363 51093 58671 44951 60509 64030
8114 64030 69665 57519 37386 39091 64923 87444 121343 154938 192284 237043 253027 215127
8102 215127 162258 89615 80363 83203 80807 81413 75599 51782 37021 23870 28799 28190 17945
8089 17945 27923 42537 45212 50563 45986 26037 6486 17556 43408 79888 98951 77918 53542
8076 53542 67875 85009 78157 43926 28426 15047 48026 101685 115280 80286 57866 83101
8064H3101J7326m826k1774j3102r278n73k605M461J5886J1194J5432m740j9675
8051G0827n069J5220N975J6891j1202j0958r119K5179M7310J8463K5044k590k3409
8038A62562K9433L5919K5570J0627J578j2191J741J7288M859j6522j5974K2927
8026B67817M062j879Q170J9501r887L155p764k2747m515k340o728j0287P66N686
8012B43010R889r75j2588K383M268K4727o764n847J0322L0774L0332M4220N2173
7999D25924O1530O2965Q9911J30474J20446K8571r7097j26915q9867p5332q4133
7988D46477m2747q888J8537P6943R3623P5241J2488o8278j08608j33154p6022
7977B85612k0711J401j9942k2809m416J7446P205k8825k5017N710J4181j1400
$$ plain form
8064 83101 100427 95601 73827 60725 51447 50874 48269 52730 68616 79810 95242 90502 70827
8051 70827 65758 80978 86953 103844 92642 81684 72565 97744 145054 163517 188561 185971 162562
8038 162562 191995 227914 253484 264111 265689 253498 255239 272527 277386 260864 244890 267817
8026 267817 271879 270000 278170 297671 287784 290939 283175 260428 255913 253573 246845 236558 237324 243010
8012 243010 252899 251924 239336 241719 245987 270714 263950 258103 268425 299199 329531 373751 425924
7999 425924 487454 550419 640330 770804 891250 919821 822724 695809 605942 530610 446477
7988 446477 403730 394842 413379 490322 583945 659186 671674 603396 494788 361634 285612
7977 285612 264901 266302 246360 223551 219135 236581 243786 214961 189944 195654 209835 198435
7965A98435o499K4286K705R748K752r969J0671p26J7766O2992M2741O0239N8414
7952D73555P0602M0128J7225r535l8386l7645j8618l2484k9461K903M3173N4866
7940E36323m752n0138r0930j13198l2681j6358j770l0886l9391m7270r301N3991
7928A53639m165k2781J038j1265R648P475J718l946J4616j8807k2794l339R944
7915A10981L1985J6464J6547K818J977K5201K4069l3753k4697J3718l1236r014
7903A45060r357L836L264L249j3980K983o706j6982l5358l9783l0470j0283L947
7890e80K2220J723J5698Q116J7808J0143j8191k1445O698r268o519j8670L8911
7877D6644K8514J3087o75k4385k537o329j8789p405j369J1045j1213J8682Q8L668
$$ plain form
7965 198435 191936 216222 218927 228675 231427 221458 232129 231403 249169 312161 354902 415141 473555
7952 473555 544157 584285 601510 591975 553589 515944 497326 464842 435381 438284 481457 536323
7940 536323 531571 481433 390503 277305 244624 228266 226496 195610 156219 108949 99648 153639
7928 153639 149474 126693 127731 116466 126114 133589 135307 131361 145977 127170 104376 101037 110981
7915 110981 142966 159430 175977 178795 180772 205973 230042 196289 171592 185310 154074 145060
7903 145060 135703 139539 142803 146052 132072 135055 128349 111367 76009 36226 5756 -4527 -580
7890 -580 21640 23363 39061 47177 64985 75128 56937 35492 42190 32922 26403 7733 46644
7877 46644 75158 88245 87570 63185 60648 54319 35530 28125 26756 37801 26588 45270 45358 49026
7863D9026J1212r62j231l0204j3273O195J2967k1916k4848J5288K6093R901P687
7850D5935N074J0966j610j2939n124m224J7264j4553j6590P908j3351l579k597
7837A2580J4900k218k4254J4734N496J3010k5378j9489P149J1734k1544M208J5090
7824F018L7545P59p273J0412q890j6906O257Q143J6953P519k2070k4728n70k3215
7810a0046j1311R563N349J6380l478j2809q610l438P001K4783j375j3161Q158
7797G006J1526l4961R415M1295K703r729o07k4219J7032L3034k6897J681J3792
7784D1071J909m0044o178K9066K9383k5141l1025J3238k6311m586j2287K380J6325
7771a2200k399K054J6110J1793j3330k6069J3293K2572j6506J3770O973J2507
$$ plain form
7863 49026 60238 59276 58045 27841 14568 20763 33730 11814 -13034 2254 28347 38248 45935
7850 45935 51009 61975 60365 47426 42302 38078 55342 40789 24199 32107 18756 15177 12580
7837 12580 27480 25262 1008 15742 21238 34248 8870 -10619 -3470 8264 -13280 -9072 6018
7824 6018 43563 44322 37049 47461 38571 21665 27922 36065 53018 60537 38467 13739 13169 -10046
7810 -10046 -21357 -11794 -6445 9935 6457 -6352 -14962 -18400 -11399 13384 12009 -1152 7006
7797 7006 18532 -16429 -7014 34281 36984 27255 26648 2429 19461 52495 25598 27279 41071
7784 41071 42980 2936 -3242 25824 55207 30066 -959 12279 -14032 -18618 -30905 -28525 -12200
7771 -12200 -14599 -12545 3565 15358 2028 -24041 -10748 11824 -4682 9088 16061 28568
7759B8568k5312m988R368J5581J3402n0650J6785J8785J3886j2326k6748j891
7747e540J8027l008l880q309K0082J7415Q769N719j744m024k3991k800j4677j0954
7733h915m584R195k6365J4907K9067J4292j5943k3354P854m949M242K058k5938
7720b8433N803O408r118J521N928r51L449J795j2077J6478K3035j323L005K368
7706A7888r188K1880J3793R760k5226k5146P464k0141p351N646K4156J6860j0102
7693B0293L440k4195j4456M316k9168Q055M98k1228j081J1861Q501j1865J2814
7680c2215K8752J8289R816R281l592j0323r481k7450J4832M5271J5574j4950l6277
7667G527j891r785M758K2861J5600j3576K0374Q272J363K957l117m892l2632K221
$$ plain form
7759 28568 3256 -1732 7636 23217 36619 -14031 2754 21539 35425 23099 -3649 -5540
7747 -5540 12487 9479 5599 -2710 17372 34787 43556 49275 47531 43507 19516 16716 2039 -8915
7733 -8915 -13499 -4304 -30669 -15762 13305 27597 11654 -11700 -3846 -8795 -4553 -2495 -28433
7720 -28433 -22630 -16222 -25340 -23819 -17891 -18842 -15393 -13598 -25675 -9197 13838 12515 15520 17888
7706 17888 8700 30580 44373 54133 28907 3761 11225 -8916 -16267 -10621 13535 30395 20293
7693 20293 23733 -462 -14918 -10602 -39770 -31715 -31217 -52445 -53526 -41665 -33164 -45029 -32215
7680 -32215 -3463 14826 24642 33923 30331 20008 10527 -16923 -2091 43180 58754 43804 7527
7667 7527 5636 -4149 609 23470 39070 25494 45868 54140 55503 58460 55343 50451 17819 20040
7653B0040j1733q49l047j4097j6106n04L1815M2921l006j6489q353r740J8680
7640B9532j1493k3416j4912K2905j4472o654L511R777L2855J7462m33J6124j4003
7627D6783k2678O171j1211P309J0533M390O129l7602J890o714j0020J5728J0726
7614B1434p577j4845l015J0255j3749O125K6266j5394J0357L0861p866j6309K861
7601B9404M085P00j3222j1545j6216j4857j0637K0592L804j1575J9039K4455M465
7588B8492l1164j5060R659J0592p571Q894j2921r095K0468M787N939k17p299k240
7574C264J2277n963J648J9028r002k1349j5086j9363K4865L0004p299m72J1579
7561B4131q24J90k4640N60p036j6860N369J3832J4668j204R370N894j560k3624
$$ plain form
7653 20040 8307 7458 4411 -9686 -25792 -26296 5519 48440 45434 28945 20592 10852 29532
7640 29532 18039 -5377 -20289 2616 -11856 -18510 -14999 -5222 27633 45095 44662 60786 46783
7627 46783 24105 30276 19065 26374 36907 41297 47426 9824 11714 5000 -5020 10708 21434
7614 21434 13857 -988 -4003 6252 -7497 -1372 24894 9500 19857 50718 42852 26543 29404
7601 29404 33489 34189 20967 9422 -6794 -21651 -32288 -11696 -7892 -19467 -428 24027 28492
7588 28492 -2672 -17732 -8073 2519 -5052 3842 -9079 -18174 2294 7081 13020 12803 5504 3264
7574 3264 15541 9578 11226 30254 21252 -97 -15183 -34546 -9681 20323 13024 12552 24131
7561 24131 23307 23497 -1143 -583 -7619 -24479 -19110 -5278 9390 8186 17556 23450 21890 -1734
7547a734l0001r592N990K6922J0616N81M719K656L6686l3258j8970r189j0270
7534b4844K7606q702l4730k3126J5044J1989J3974q83m00m123j4349l939J5607
7521c0876r43L6887P100j4074J1794L242J5334k1281N904J1394k560J6920K2972
7508F1813j6409j8721l0499J181p796K28K3029K4970j0209j6489M367k5825R62
7495i398K2456j0300J57K528l836j1104K2077K8458L249q894M09k4389l473j452
7481F488N960j2275M935K1127K1200q507j6335k83o907K20q48j0271J0577Q096
7467B3177K3884j588j7241o09j267j0395j7498j8778%K6716j1956L036j3162J833
7453a3848K8555J4122J1130k0549k0865q039p01O747O275k200k891P401p012o816
$$ plain form
7547 -1734 -31735 -41327 -35337 -8415 2201 2782 7501 10157 46843 13585 -5385 -14574 -24844
7534 -24844 2762 -5940 -40670 -63796 -48752 -36763 -22789 -23672 -24072 -28195 -42544 -46483 -30876
7521 -30876 -31819 5068 12168 -1906 9888 13130 28464 7183 13087 24481 21921 38841 61813
7508 61813 45404 26683 -3816 -2635 -10431 -10203 12826 37796 27587 11098 15465 -10360 -9398
7495 -9398 13058 2758 2915 5443 1607 -9497 12580 41038 44287 35393 35802 11413 7940 6488
7481 6488 12448 173 5108 26235 47435 38928 22593 22310 15403 15623 14775 4504 15081 23177
7467 23177 47061 45473 28232 27623 26356 15961 -1537 -20315 -20315 6401 -5555 -2519 -15681 -13848
7453 -13848 14707 28829 39959 19410 -1455 -9494 -10195 -3448 2827 627 -2264 5137 -1875 -8691
7439h691r188l023J9706k650q326J20N867j6173m762N656J4984Q819K223J0763
7425A5325L4577j7386l3820k8922n615K0538J9355j468o957j5766K1967L3329
7413C5157P789j0466n403j5625J080R94J2988K235r011l3046k4318J1916Q136
7400a7574k7127o940N159J4349J1921K4678J1771j544j9612j8405J2014k0433
7388c1743j1256j8152m69J8796J6640J7052q711j464J556j7180K3305K6716p051
7375H039l3857l132l660J2239L5342P099l0719m175L1700n484J155o141j2736
7362d330l669K6306q165q275P300K1910M741j7940j5491k6278J9501K6643m682
7349A7571l1340Q815J881J0991J7751p154m271m638J3210L3551o43j0057k1431
$$ plain form
7439 -8691 -17879 -20902 -1196 -3846 -12172 -12052 -6185 -22358 -27120 -21464 -6480 2339 4562 15325
7425 15325 49902 32516 -1304 -30226 -35841 -15303 4052 2584 -4373 -20139 1828 35157
7413 35157 42946 32480 27077 11452 12532 13526 26514 28749 19738 -13308 -37626 -25710 -17574
7400 -17574 -44701 -51641 -46482 -32133 -20212 4466 16237 14693 -4919 -23324 -11310 -31743
7388 -31743 -42999 -61151 -61620 -42824 -26184 -9132 -17843 -19307 -17751 -34931 -11626 15090 8039
7375 8039 -25818 -28950 -32610 -20371 14971 22070 -8649 -12824 18876 13392 14547 8406 -4330
7362 -4330 -7999 18307 10142 1867 9167 31077 35818 17878 2387 -23891 -4390 22253 17571
7349 17571 -13769 -4954 -3073 7918 25669 18515 14244 9606 22816 56367 55724 45667 24236
7336B4236k4433O835j9384k2982J4667K6672j6569l835K259j004N7340J4317n310
7323E2809l1556k0132R584K4024l268l1253l2717J599J6931K0398j01r409M050
7310I59J7863k0716l6374j2336J8440J4930K8995l218j6044q253j448j334M331
7297a4205L034n713k407L3487J7027k325J024j030j0791j1614k802M170J1816
7284A9671o916N69q259j484J4547j2955o690j0037J3685K261J8607M455r950q714
7270H790j3350Q553L789j9864l924J6801J4585J3120R733o875J839j3557k7332
7257g692J0278K0424K334J4849j599j8841q025j3283K393j254N998k320j9731
7244a6469L367m780j1935j8964j1531k0654l755K5688K5946M5552p994j9380j9697
$$ plain form
7336 24236 -197 6638 -12746 -35728 -21061 5611 -10958 -14793 -12534 -13538 43802 58119 52809
7323 52809 21253 1121 10705 34729 31461 208 -32509 -30910 -13979 6419 6318 -3091 959
7310 959 18822 -1894 -38268 -50604 -32164 -17234 11761 8543 -7501 -15754 -17202 -18536 -14205
7297 -14205 -11171 -16884 -19291 14196 31223 28898 29922 28892 18101 6487 3685 7855 19671
7284 19671 12755 13324 5065 3581 18128 5173 -1517 -11554 2131 4392 22999 27454 17504 8790
7270 8790 -4560 3993 7782 -12082 -16006 795 15380 28500 38233 31358 33197 19640 -7692
7257 -7692 2586 23010 25344 40193 38594 19753 11728 -1555 838 -416 5582 3262 -16469
7244 -16469 -13102 -17882 -29817 -48781 -60312 -80966 -84721 -59033 -33087 12465 4471 -14909 -34606
7231c4606K5948K5368K3671K1491k6216m3295K2638J4329m019M514J3985K0267
7219F4075p317j3945q646k65l1964k7171J1207J4242m711L136L1112J5332k041
7206D3044n311k1768j9204k462K8324J8902k7120r843j1310r283r002L0J544j1051
7192c4510n939L1313J7144l742q247p858p196K535M50q897K6999l509q751K871
7178g337K1376N139p534M620J1918p755P065j2674j4618j9250M497j1090J0582
7165a5061K8631r602q687K2237K1264j8551l659l010j5140K5613o489l4797n375
7152b2626j4007n79J8788O031N129l677Q321J8076L1733k0387l8818l5674L108
7139d4582J2716J6782K6915R827j894j3064m856O045M32j7913r89L3932r042j2677
$$ plain form
7231 -34606 -8658 16710 40381 61872 35656 -7639 14999 29328 25309 29823 43808 64075
7219 64075 56758 42813 34167 33902 1938 -25233 -14026 216 -4495 -1359 29753 45085 43044
7206 43044 37733 15965 -3239 -5701 22623 41525 14405 4562 -6748 -16031 -25033 -25003 -23459 -34510
7192 -34510 -40449 -9136 8008 4266 -3981 -11839 -19035 -16500 -16050 -24947 2052 -1457 -10208 -7337
7178 -7337 14039 19178 11644 16264 28182 20427 27492 14818 200 -19050 -14553 -25643 -15061
7165 -15061 13570 3968 -4719 17518 38782 20231 16572 13562 -1578 24035 17546 -17251 -22626
7152 -22626 -36633 -37212 -18424 -12393 -7264 -10941 -2620 15456 47189 26802 -12016 -47690 -44582
7139 -44582 -31866 -15084 11831 21658 19764 6700 1844 7889 8321 -9592 -10581 23351 14309 1632
7125A632l272J2918L524L829P069j5007j4002k6386K0577J6404J1734J2643K1749
7112E3412j5500n204j6228j6382J002K6339l493k1293l238o705O049N763r594
7099e072j718N288l1222o318J5194J5997J296Q403P85j1818n200L2010J2703j788
7085B8540j643k2035k5157m274J5618q211J9671j4938P54J2872N099l8674k2476
7072e4854J000l657J2498L1408J8921j0869j8797K9740J9051l9053k4950j8988
7060e8550J3248J8335o882p986j3183L5790K0468J0285J3588J3937P094j3545
7048C2599j4476j7651M407L841l2790J692r515M9621L121j4018M515j5374j0055
7035a4083k6293j1873J6312J7937J0489J9083q15J2790j0053j6837j1010l2161
$$ plain form
7125 1632 -1640 11278 14802 18631 25700 10693 -3309 -29695 -9118 7286 19020 31663 53412
7112 53412 37912 32708 16480 98 1100 27439 23946 2653 -585 -7290 -1241 4522 -5072
7099 -5072 -6790 -1502 -32724 -39042 -23848 -7851 -6555 1848 2633 -9185 -14385 17625 30328 28540
7085 28540 26897 4862 -20295 -24569 -8951 -17162 2509 -12429 -11675 1197 6296 -32378 -54854
7072 -54854 -53854 -57511 -45013 -13605 5316 -5553 -24350 5390 24441 -14612 -39562 -58550
7060 -58550 -45302 -26967 -33849 -41835 -55018 -19228 1240 11525 25113 39050 46144 32599
7048 32599 18123 472 4879 8720 -24070 -22378 -31893 17728 20849 6831 11346 -4028 -14083
7035 -14083 -40376 -52249 -35937 -18000 -7511 11572 10757 23547 13494 -3343 -14353 -46514
7023d6514L448O269k405K7574K3525j0645J254l5319r988M419K5951R266j5754
7010a8919q859l0676O830J3423j879J8870L078j7466j6346l914l542L9054K1019
6997F73p807k2289J1188n570k0034L1461J7928P84K3348l456p206O903q561j3292
6983D070N463R909j1409j2072M520M3264J766j9176J051l648k1438k2229l0510
6970e0439k51K2218k5306J25n245N062J2145M932q342K2726n201L1058L0863R49
6956C5294j6770O69m224k38K834j6053k636K5152K72l3258l7370K3377J7544m258
6942i665j0809j2264K3168P660j1927j1145K8627K4342q444j9957J18J6234K0547
6929C6485K623J0490k9007J383j5583L174j316l671p03L0823m24j9435j3952n595
$$ plain form
7023 -46514 -43066 -36797 -39202 -11628 11897 1252 2506 -32813 -42801 -38382 -12431 -3165 -18919
7010 -18919 -27778 -58454 -51624 -38201 -40080 -21210 -18132 -35598 -51944 -55858 -59400 -20346 673
6997 673 -7134 -29423 -18235 -23805 -43839 -12378 5550 6334 29682 26226 19020 25923 17362 4070
6983 4070 9533 19442 8033 -4039 481 43745 45511 26335 27386 23738 2300 -19929 -50439
6970 -50439 -50690 -28472 -53778 -53653 -58898 -53836 -41691 -36759 -45101 -22375 -27576 3482 34345 35294
6956 35294 18524 19193 14969 14731 17565 1512 -1124 24028 24300 -8958 -46328 -22951 -5407 -9665
6942 -9665 -20474 -32738 -9570 -1910 -13837 -24982 3645 27987 19543 -414 -296 15938 36485
6929 36485 39108 49598 20591 21974 6391 9565 8249 4578 3875 34698 34274 14839 887 -4708
6915d708L0724J2402R602r975k2550k2259j447j658M181j5867j0215K1778k109
6902a2101L896K3867L829k652r262J7084j4819K070j1638K928J3296L947M783
6889B5228J2899K8051n980r514k0139j3718R663l606R864M95j1114m336j6354
6876A439j3632m172K801p833r325J8078K1377j9900j3363Q406K6186L0483R060
6863D9605m0903l423N661R292N255j2861k5927j3026O275n026r100J5870j0492
6850b8800J0396j0702L001q189j6389L6622K8023M906N993j0972J6753K907j6587
6837A6962M189j3438J1754J1509p776k409r017l488O449j3005N013R260k0055
6824d052n879Q974J167j0222k003P704m872j929P805j3636n100J3282J6414K5526
$$ plain form
6915 -4708 26016 38418 48020 38045 15495 -6764 -8211 -9869 -5688 -21555 -31770 -9992 -12101
6902 -12101 -8205 15662 19491 16839 7577 24661 9842 11912 274 3202 16498 20445 25228
6889 25228 38127 66178 60198 50684 30545 16827 26490 22884 32748 33243 22129 17793 1439
6876 1439 -12193 -16365 -13564 -21397 -30722 -12644 8733 -11167 -24530 -16124 10062 40545 49605
6863 49605 8702 5279 10940 20232 25487 12626 -13301 -26327 -20052 -25078 -34178 -18308 -28800
6850 -28800 -18404 -29106 -26105 -34294 -50683 -14061 13962 18868 24861 13889 30642 33549 16962
6837 16962 21151 7713 19467 30976 23200 20791 11774 8286 14735 1730 6743 16003 -4052
6824 -4052 -9931 -957 210 -10012 -12015 -4311 -9183 -11112 -3307 -16943 -22043 -8761 7653 33179
6810C3179j8728N17N893J1874j8386k9865j7338k6752Q929J082L2715K2864O763
6797A2747J9079L353N962j6874r211K2657j655j4689j4005o190k909K069j3098
6784a2764O766O620j4908o040J8536M252q299J9481K450k1033p72J4543M088J5875
6770B8795m01M457m193m610k6143J9384J1456q379k734k8061J0512M974n136k7636
6756b7715J3629L6695L719N876k1765j3416p213N590K9091r951m7738n955M1493
6743B340O758K170K3764j8303j4651q120k511J8569j9221j3337J6111o941o411
6730a9783K44J1078j729j8636q784J6475K4667L0967K0650j041k6884j4113k0267
6717g156J9473Q24M143P291M0598L9916L3895N9897J4812k8580l3789m3893m0812
$$ plain form
6810 33179 14451 14968 20861 32735 14349 -15516 -32854 -59606 -50677 -49595 -16880 5984 12747
6797 12747 31826 35179 41141 24267 15056 37713 36058 21369 7364 1174 -1735 334 -12764
6784 -12764 -5998 622 -14286 -20326 -1790 2462 -5837 13644 16094 -4939 -5711 8832 12920 28795
6770 28795 28394 32851 28658 24048 -2095 17289 28745 20366 17632 -10429 83 5057 -79 -27715
6756 -27715 -14086 22609 26328 32204 10439 -2977 -10190 -4600 24491 14540 -33198 -39153 2340
6743 2340 9098 11268 35032 16729 2078 -6042 -8553 10016 -9205 -22542 -6431 -13372 -19783
6730 -19783 -19539 -8461 -10190 -28826 -37610 -21135 3532 34499 55149 54108 27224 13111 -7156
6717 -7156 12317 13141 17284 24575 65173 105089 138984 198881 213693 185113 151324 107431 66619
6704F6619r8p065r911k4425l2847n10P978K557q053j2584j2832R690M0736M392
6690B3647k2003L741K6722K4472p530j2814l472k1491k474n46K2816P840k1591
6677A7317K00k6272l7508K2159P667R038Q000j6554o639N727J2998q250K1340
6664I223r476j2146m368M02q90j3340J7241r992R347K6903J2074j1330Q949J843
6650B4440L882l2898k1467K1200P294M347K1419M4153n445k7765k849J8767j2835
6637D2243n860Q16j5474l8804j9307K3878N656L2248p303P941k54k5403P161L2851
6623D0389j3223l2733R79J8789j8746K030J3950j7060J0794J236J1464j7705j3277
6610a3113M276J7637m733o306j839J2827p099R5N878j3149k7675J9992J2302j2071
$$ plain form
6704 66619 66521 59456 49545 25120 -7727 -8237 -259 2298 -5755 -18339 -31171 -21481 19255 23647
6690 23647 1644 5385 32107 56579 49049 36235 32763 11272 8798 8252 31068 38908 17317
6677 17317 17517 -8755 -46263 -24104 -16437 -7399 601 -15953 -22592 -16865 -3867 -12117 9223
6664 9223 -253 -12399 -16767 -16365 -17255 -30595 -13354 -23346 -13999 12904 24978 13648 22597 24440
6650 24440 28322 -4576 -26043 -4843 2451 6798 28217 72370 66925 39160 36311 55078 42243
6637 42243 36383 37199 21725 -17079 -36386 -12508 -6852 25396 18093 26034 25780 377 7538 40389
6623 40389 27166 -5567 -4588 14201 -4545 -2515 11435 -5625 5169 6405 17869 164 -13113
6610 -13113 -8837 8800 4067 -2239 -4078 8749 1650 1745 7623 -5526 -33201 -13209 -907 -12978
6596a2978J5794N935R955K5298J7487k1566j4857K295j066K433j0746N210J7672
6583D0866q184l1099j8038O624j7333p705L9171r67k1628n721P55J4646O980j6240
6569a7873K801j678j255Q828K4669Q500N276k1396p230J4238R75P110J5508k0187
6555A8286k5934l5352M400K3178O355K6801j6168L366L544K0136k0168k3948k6018
6542d1522k218n868J2504K9901J8389j0640r491K0073K7960l7493l9703N584K1373
6529a1151K6194o453k4273J0499J8618j4958k9996j624q677K2823O47j7075m079
6516c9505K9976K1279l689j269k7847k9584J1279K8398J1588J2207q665k1559
6504a7391k970J6601L1627K695l5225j0915l205J454M739J6356M620k9018k1190
$$ plain form
6596 -12978 2816 8751 18706 44004 61491 39925 25068 27363 26297 28730 17984 23194 40866
6583 40866 32682 1583 -16455 -9831 -27164 -34869 4302 3335 -18293 -24014 -23259 -8613 -1633 -17873
6569 -17873 -15072 -16750 -18005 -9177 15492 23992 29268 7872 642 14880 15855 22965 38473 18286
6555 18286 -7648 -43000 -38600 -15422 -9067 17734 1566 4932 8476 28612 8444 -15504 -41522
6542 -41522 -43740 -49608 -37104 -7203 11186 546 -8945 11128 39088 1595 -38108 -32524 -11151
6529 -11151 15043 8590 -15683 -5184 13434 -1524 -31520 -33144 -41821 -18998 -18351 -35426 -39505
6516 -39505 -9529 11750 8061 6792 -21055 -50639 -39360 -10962 626 12833 4168 -17391
6504 -17391 -20361 -3760 27867 30562 -4663 -15578 -18783 -17329 -12590 3766 8386 -20632 -41822
6491d1822N138N535J474N081k63j647K065P1J004P646N965J360k6819J0412L300
6476b1500o891p968k839L1337Q340k7252J3544k741j4121J950L1607Q963Q613
6463B1042m884l1999J1650J9245j873k6974j1799R74L012R774K356K5189K5291
6450D1004q973l5331l4742l784K5449p307K810L053J0617j6232L836L5572L033
6437A9005J3184J9108M712o218k0266k3184j4401j6090O882K29o215N697K1414
6424C857p34J51p095o013k3658Q445Q110j2090m562L541j4062K0264L3717q559
6410A312R31N749r124J6664K3955j0109R94j522l519j541K32k0251k777J4682
6396A5676j0018j7509j7479Q243j3418j0217j1941R348K5064K0308j1194j2202
$$ plain form
6491 -41822 -36684 -31149 -29675 -24594 -24857 -26504 -24439 -24368 -23364 -15718 -9753 -8393 -35212 -24800 -21500
6476 -21500 -28391 -36359 -39198 -7861 479 -26773 -13229 -15970 -30091 -28141 3466 12429 21042
6463 21042 16158 -15841 -4191 15054 13181 -13793 -25592 -24618 -21606 -11832 -9476 15713 41004
6450 41004 32031 -3300 -38042 -41826 -16377 -23684 -20874 -17821 -7204 -23436 -19600 15972 19005
6437 19005 32189 51297 56009 49791 29525 6341 -8060 -24150 -17268 -17039 -23254 -17557 3857
6424 3857 3123 3274 -3821 -9834 -33492 -25047 -16937 -29027 -33589 -30048 -44110 -23846 9871 1312
6410 1312 2243 7992 -1132 15532 39487 29378 30372 28850 25331 23790 24022 3771 994 15676
6396 15676 5658 -11851 -29330 -21087 -34505 -44722 -56663 -47315 -22251 -1943 -13137 -25339
6384b5339R770J3593o698R55K7557n087j0868r773P692o39K2037K6549j7382K774
6370C5141L628j1104J0576k4502j1864j1978K858n439o21j0852k0514J7059J9104
6357h508J7892m161r120J2416K773m851J0086l078r844J0505K0513k067j5707
6344A6849r210J5919J1912l397k5638k346J0447N532k315k3588P049J9296Q938
6331B9448o05R868P165K791p759k5849M706K189O485M583R591K579J6075k5867
6317C5400l9556O093Q932p941j1734k6180k1869K3568K0836K643J9910P910k2602
6304d590p630R31k402K501J4033l897K1204M824l6379q202J0730J4949N800j2966
6290a094l0408j0773R907L3039R981m3306J1537L7836J336k4785N344L4845J4857
$$ plain form
6384 -25339 -15569 -1976 -8674 -7719 19838 14751 3883 -5890 1802 1163 23200 49749 32367 35141
6370 35141 38769 27665 38241 13739 1875 -10103 -7245 -12684 -13305 -24157 -44671 -27612 -8508
6357 -8508 9384 5223 -3897 8519 11292 6441 16527 13449 3605 14110 34623 32556 16849
6344 16849 7639 23558 35470 32073 6435 4089 14536 20068 17753 -5835 1214 20510 29448
6331 29448 28843 38711 45876 48667 40908 15059 19765 21954 28439 33022 42613 45192 61267 35400
6317 35400 -4156 1937 10869 2928 -8806 -34986 -56855 -33287 -12451 -9808 10102 18012 -4590
6304 -4590 -12220 -11289 -13691 -11190 2843 -1054 20150 24974 -11405 -19607 -8877 6072 11872 -1094
6290 -1094 -31502 -42275 -32368 671 10652 -32654 -21117 16719 18055 -6730 -1386 33459 48316
6277D8316k633p076j9364k9607k036L0226K4427j4425k1839J962K6733P122K175
6264D3981p514k7169j0896j1311o912j2769L2678J829r521l649K746j5482R113
6251a4876k985J697J5883M334k2519k8087K7328L8850K7426j3633m1969j6881
6239b5432K8560K4328J4487R507j870l1313k8900l122J0832Q912K1840N934k4965
6226H798q704K2342L2837Q411j2743k4064j9511j3372j4926n552j2104K9729R427
6213E68j598N64J1088q447J6636J7232o965j5126k6647M154Q536j179j4597j2459
6199b8240J2865J9344k3980j0512K7529K0396n182k3354J1562J3704k3944j06
6187i918P705Q249P395J2117J2989J6935O958j7357l4589j2377j233M344J791
$$ plain form
6277 48316 45683 38607 19243 -10364 -12400 17826 42253 27828 5989 7951 34684 41806 43981
6264 43981 36467 9298 -1598 -12909 -19821 -32590 88 1917 -7604 -11253 -8507 -23989 -14876
6251 -14876 -17861 -16164 -281 4053 -18466 -46553 -19225 19625 47051 33418 -8551 -25432
6239 -25432 3128 27456 41943 51450 49580 18267 -10633 -13755 -2923 5989 27829 33763 8798
6226 8798 94 22436 55273 63684 50941 26877 7366 -6006 -20932 -26484 -38588 -8859 568
6213 568 -1030 -466 10622 2175 18811 36043 29078 13952 -12695 -8541 -5 -1184 -15781 -28240
6199 -28240 -15375 3969 -20011 -30523 -2994 17402 12220 -11134 428 14132 -9812 -9918
6187 -9918 -2213 6036 13431 25548 38537 55472 62430 45073 10484 -1893 -3126 1218 3009
6174C009J48J2068m408n913J97K563J0939Q668k2173J0150p305k5773p781J5597
6160a0014j7837L009j725n462J9050j485m664O77m0174q834L9384K5309N294j4222
6146a1694J057K1305K288n089l133R032L734L615l7384k4935J3297K7116K0792
6133B0001N916k5022m1422P635p869k2581k8947L0166M775O896J1097J1801J5410
6120a2144K1175j6769r242j270j9579l187j7750l3502j4501K0554J9590K1151
6108d5474J9452N437k581L232J0963p746L533L0939J8614j1605j0398j5223Q390
6095G533M721q427k3912J650K2648Q244j3129m60m183p276j153J558J6021Q023
6081A1858l8179N486L6409K4307j4103j8201N305j6069o948Q140J2299p751J4198
$$ plain form
6174 3009 3157 15225 10817 4904 5101 7664 18603 27271 5098 15248 7943 -17830 -25611 -10014
6160 -10014 -27851 -24842 -26567 -32029 -12979 -14464 -19128 -18451 -58625 -67459 -28075 -2766 2528 -11694
6146 -11694 -10637 10668 12956 7867 4734 13766 17500 21115 -16269 -41204 -27907 -791 20001
6133 20001 25917 895 -40527 -32892 -40761 -63342 -92289 -62123 -57348 -50452 -39355 -27554 -12144
6120 -12144 9031 -7738 -16980 -18250 -37829 -41016 -58766 -92268 -106769 -86215 -66625 -45474
6108 -45474 -26022 -20585 -23166 -19934 -8971 -16717 -13184 17755 36369 24764 14366 -857 7533
6095 7533 12254 3827 -20085 -18435 4213 12457 -672 -1132 -5315 -12591 -13744 -12186 3835 11858
6081 11858 -26321 -20835 15574 39881 25778 7577 12882 -3187 -10135 -1995 10304 2553 16751
6068A6751j8413m439Q58J8272n025N932j1790r538K3942L091M090l885K042m106
6054A7782l888q604j1431p037m72k759N617M298o963J7464J5758O069l8505k8585
6040d1256Q106R82Q673L1318J2139j6768J8080o85O333q434q050o073J4438Q661
6026B7464L732J374k0679j8994J0264J7763M548J1007l2060L66k1462J7574P175
6013H072M849l263o072J5193j1623l3812p393J9546k463r232Q743M311J1946m820
5999f018O767k242j4286m14j6179p468j086o660K1335K7835J5987p670j8686j7818
5985b6603j0859J0746k76k3383N054O405r210j799J2144k93j756n659K0646J6124
5971h719j0393N015J439k618K014j1861k586P290M623J635J323k1534J1689L626
$$ plain form
6068 16751 -1662 -6101 -5243 13029 8004 13936 2146 -7392 16550 19641 23731 19846 21888 17782
6054 17782 13894 5290 -6141 -13178 -13650 -16409 -10792 -6494 -13457 4007 19765 25834 -12671 -41256
6040 -41256 -33150 -32168 -23495 7823 19962 3194 21274 20589 26922 18488 10438 4365 18803 27464
6026 27464 31196 32570 11891 -7103 3161 20924 25472 36479 4419 4785 -16677 897 8072
6013 8072 12921 9658 3586 18779 7156 -26656 -34049 -14503 -16966 -26198 -17455 -13144 -1198 -6018
5999 -6018 749 -1493 -15779 -16193 -32372 -39840 -40926 -47586 -26251 1584 17571 9901 -8785 -26603
5985 -26603 -37462 -26716 -26992 -50375 -45321 -38916 -48126 -49925 -37781 -38074 -39830 -45489 -24843 -8719
5971 -8719 -19112 -14097 -12658 -15276 -13262 -25123 -27709 -20419 -15796 -14161 -12838 -34372 -22683 -19057
5957a9057J952J8147J3312j1341k846K0690K292m608K225j2214o932J9364k4075
5944c091j9023J1084K7738Q881K8098j5264m0393k9645j701K5958J6176J2766
5932B1584q847j5882N761K577l348j9699J112J483L2470M1238j4314j811k7189
5919A5135p435J6618K5259n063j5665r62J2457j2709k7327k623j9073J8703K1890
5906A9205J3168M71M944j1257K76j419J1645M725k9431j1574l032k5786K8239
5893A74K956l0985q131R489J2538m934k9690J2949l743J6505K7616pR384K460
5879A6581k1705m950J847m765O988J0274J4353r448k6132j0730k26J1467K847
5866a3599r11J2330r252J9781J1975k6678j2515J0584K93o348j6915q558J8640
$$ plain form
5957 -19057 -17105 1042 14354 3013 167 20857 23149 18541 20766 8552 1620 20984 -3091
5944 -3091 -22114 -11030 16708 25589 53687 38423 -1970 -31615 -33316 -7358 8818 21584
5932 21584 12737 -3145 2616 5193 1845 -17854 -16742 -15259 17211 58449 44135 42324 15135
5919 15135 7700 24318 49577 44514 28849 27887 40344 27635 308 -2315 -21388 -2685 19205
5906 19205 32373 32844 37788 26531 26807 25388 37033 41758 12327 753 -2279 -28065 174
5893 174 3130 -27855 -35986 -26497 -13959 -18893 -48583 -35634 -39377 -22872 4744 4737 14121 16581
5879 16581 -5124 -10074 -8227 -12992 -6004 4270 18623 9175 -16957 -27687 -27913 -16446 -13599
5866 -13599 -14510 -2180 -11432 8349 20324 -6354 -18869 -8285 -7992 -14340 -31255 -39813 -21173
5853b1173l578k5619J2077K2918J2000K2224k1776j1849J9834J7924P236j3897
5841A6321j1381j8861K3532K3008k1367P689q518l1408p545K2234L0139K7144
5829E0987l94r214p452j4996j2160k885o235p519r345K0258L6051j4389J3177
5816C5884M729k2020M18o093q128K724m931j2190N683J5186k5879j9623N946J1888
5802a6406P593k6515q290m861j3287K3612L4715N431j960j0330K4039J156Q855
5789B3752j0783j1861p989O784K4096M49k0905r678J00K101o537o996K989N06
5775a3972k1868M408k064L1642l924m759R192K0061j475K2870J000j1764o618
5762B2729k9667m208k2890o965M6170J1382j8678j4442O814M067P31k5072L459
$$ plain form
5853 -21173 -24751 -50370 -38293 -15375 -3375 18849 -2927 -14776 5058 22982 30218 16321
5841 16321 4940 -13921 9611 32619 11252 18941 10423 -20985 -28530 -6296 23843 50987
5829 50987 50593 41379 33927 18931 6771 3886 -2349 -9868 -19213 1045 37096 22707 35884
5816 35884 40613 18593 19011 12918 4790 7514 2583 -9607 -3924 11262 -14617 -34240 -28294 -16406
5802 -16406 -8813 -35328 -43618 -48479 -61766 -38154 -3439 1992 32 -10298 13741 14897 23752
5789 23752 12969 1108 -6881 -97 23999 24448 3543 -6135 -6035 -3934 -10471 -17467 -14478 -13972
5775 -13972 -35840 -31432 -33496 -1854 -5778 -10537 -1345 18716 17241 40111 41111 29347 22729
5762 22729 -6938 -11146 -34036 -41001 5169 16551 -2127 -16569 -9755 -5688 -4957 -30029 -26570
5749b6570K3864J4210l990o335N578m779r484k4780j4025p866J0163O753N219
5736c2042J0766J174Q57j8181M51J2133K3892R741j2423O567R639j035K7187j7795
5722B0931k1026p663J4544J486j6074O635j2801k1675J4245K2328K4159p489k990
5709A4610j2751k0019j3607K278L103J3865J9098O281l788Q056j6688j2186J0552
5696a196Q410j6055p315k377J329J9757J5073j7095k8202K0480L7966K460j2005
5683B1230J043J3919j1763l5218N783j0485j4781K0260K0536J1417j8187l0832
5671b7078j517o832P895J3007P614J0037P937n472k2437k5367J3363K8345J9337
5658A8832n35o269O743j3131J6663O267N051o865j1184k773p003L4255j3554l2655
$$ plain form
5749 -26570 -2706 11504 7514 1179 6757 1978 -7506 -32286 -46311 -54177 -44014 -37261 -32042
5736 -32042 -21276 -20102 -19245 -37426 -36975 -24842 -950 8791 -3632 2935 12574 11539 38726 20931
5722 20931 -95 -7758 6786 8272 -7802 -1167 -13968 -35643 -21398 930 25089 17600 14610
5709 14610 1859 -18160 -31767 -29489 -26386 -12521 6577 12858 9070 17126 438 -11748 -1196
5696 -1196 7214 -8841 -16156 -18533 -17204 2553 17626 531 -27671 -7191 30775 33235 21230
5683 21230 22273 36192 24429 -10789 -5006 -15491 -30272 -10012 10524 21941 3754 -27078
5671 -27078 -28595 -35427 -27532 -14525 -6911 3126 11063 5591 -16846 -42213 -28850 -505 18832
5658 18832 18297 12028 18771 5640 22303 28570 33621 26756 15572 12799 5796 40051 26497 -6158
5644f158M311K1507j4468l368l0422q477J6228J1586j0226L1301o694r38J4261
5631A8443J0045J1498J800k6174q007j6845k8735j314Q282J592j8886K902K337
5618d3062K7161k0405R468P232N798m658K215J0889j9308J0059j8987L002J1486
5605a9110R080K0857L775K0415j0129m7256J8163L7764m132k0659J7325Q033k2504
5592A1622N770K1191l069p561q922j0990k2306q075k2608l1162M131K8112L8292
5579e575R115Q032O499k0680n409j8936k3202K147J248J2321P55K1755k3523K0598
5565a4855J3596j7103j0647J0675L048o053J8596J7979K3104k2860n6876P628
5553c3768K6716K9270j688l3279p884P550L3766j5892j2115p748k1877r38k946
$$ plain form
5644 -6158 -1847 19660 5192 1824 -28598 -37075 -20847 -9261 -19487 11814 5120 4182 18443
5631 18443 28488 39986 41786 15612 7605 -9240 -37975 -39289 -31007 -29415 -48301 -45399 -43062
5618 -43062 -15901 -36306 -26838 -19606 -13808 -18466 -16251 -5362 -24670 -14611 -33598 -30596 -19110
5605 -19110 -10030 10827 14602 35017 24888 -22368 -4205 33559 29427 8768 26093 34126 11622
5592 11622 17392 38583 35514 27953 19031 8041 -14265 -22340 -44948 -76110 -71979 -43867 -5575
5579 -5575 3540 11572 18071 -2609 -8018 -26954 -50156 -48009 -46761 -34440 -33685 -11930 -35453 -14855
5565 -14855 -1259 -18362 -29009 -18334 -15286 -21339 -2743 15236 38340 15480 -41396 -33768
5553 -33768 -7052 22218 20530 -12749 -20633 -13083 20683 4791 -7324 -15072 -36949 -37887 -40833
5540d0833J3615L0613J4428l723K624l959j1006o085l2976Q363j874j580j9249
5527e1642r423p916K6215K9357J2632N07M699j2913m3987J7790L0158J5121J4551
5514B5149P382k2684o483R167j1315j4915K732J0787K2748k3484J60n399J4457
5501H302K5867l423j1584l5667j0714L2082K0475K725M044j803l7318J3223K1445
5488B7654J5717J0496R22l7678l4791k3994K578J4501L3612J0263J1488K9370
5476F0138n30l2092J0269m812k5952K041j8251N466K4210K1619J777o972l7135
5463b24M097J8286j2493J5880J1775k7633k0987m269m818K580O540J0065O544
5450E343q948p057J4493k0845q895K1870P806k2135r698M900k9084J6822K5224
$$ plain form
5540 -40833 -27218 3395 17823 14100 16724 12765 1759 -4326 -37302 -28939 -30813 -32393 -51642
5527 -51642 -61065 -68981 -42766 -13409 -777 -270 4429 -8484 -52471 -34681 -4523 10598 25149
5514 25149 32531 9847 3364 12531 1216 -13699 -10967 -180 22568 -916 -756 -6155 8302
5501 8302 34169 30746 19162 -16505 -27219 4863 25338 28063 32107 30304 -7014 6209 27654
5488 27654 43371 53867 54789 17111 -17680 -41674 -39096 -24595 9017 19280 30768 60138
5476 60138 59608 27516 37785 32973 7021 9062 -9189 -3723 20487 42106 43883 36911 -224
5463 -224 3873 22159 9666 25546 37321 9688 -11299 -15568 -20386 -17806 -11266 -1201 5343
5450 5343 -3605 -10662 3831 -17014 -25909 -4039 3767 -18368 -28066 -23166 -52250 -35428 -10204
5437a0204M319J7697j871j3548J3442N257P60j7431m96L2467r33n59n321l0888
5423g309j8431M1688K6862n236j215q799q345n741p778r580J0027J1092k764N185
5409A9656j0786l4453K2902l703O909k396j3393j1491j9045K6157L9388n734j426
5396A2585l1822K058L8807l014j7051P944J815p119l2846L985j5129J2234N772
5383b1781J1894K4390L4539M360J298k8573l3260o619M396o392j4732j2383P431
5370c5432K5782r930j0969J223L326L543r206J5235J2202O721J2919p449n432
5357B533j1689j3740Q401J1095K761K3575j4227L217q643n787N145j0092J2761
5344E310J9157r101o677L403j2423j1640K1033o392M853k5893k1430J3663J2350
$$ plain form
5437 -10204 -5885 11812 9941 -3607 9835 15092 15852 -1579 -2075 30392 29459 28900 23579 -7309
5423 -7309 -25740 15948 42810 37574 36359 27560 19215 13474 5696 -3884 6143 17235 14471 19656
5409 19656 8870 -25583 -2681 -6384 525 -1871 -15264 -26755 -45800 -19643 19745 14011 12585
5396 12585 -19237 -17179 21628 18614 1563 9507 11322 4203 -28643 -24658 -39787 -27553 -21781
5383 -21781 -9887 14503 49042 53402 54700 26127 -7133 -13752 -9356 -15748 -30480 -42863 -35432
5370 -35432 -9650 -19580 -30549 -29326 -26000 -22457 -31663 -16428 -4226 2495 15414 7965 2533
5357 2533 -9156 -22896 -14495 -3400 -639 22936 8709 11926 3283 -2504 2641 -7451 5310
5344 5310 24467 15366 8689 12092 -331 -11971 9062 2670 7523 -18370 -39800 -26137 -13787
5331a3787o229j6759j3513j6135J8003N596M287J057K6090L5816P788k4399j1801
5318c986J9134K5148j6107j8570j6087k944j63o035k571J571Q159n645O121j1797
5304b3772R935R152J4983j7199j477j2090P123J3650M309o185Q905j5446J0270
5291B158p246N33J5016J461k552L3928o322q545r030j3489O094n510N90R224J8650
5276C4960J4013J0032k763m9116j2409O793O475q905J4557p491j1327O318l639
5263b502N67K9813L000k6360J3543J4324j6823l6444n497M577l806j0004J3839
5250b1773J0689K226o174p299p993Q330L821j2957K853Q902K127J2414J1227J1071
5236A7464j5478L736m239m002J1803j0129l113K4494K30M572k831m2176l4805
$$ plain form
5331 -13787 -20016 -36775 -50288 -66423 -48420 -42824 -38537 -37480 -11390 24426 32214 7815 -3986
5318 -3986 15148 40296 24189 5619 -10468 -13412 -13575 -19610 -22181 -20610 -12451 -18096 -11975 -23772
5304 -23772 -13837 -4685 10298 -6901 -8378 -20468 -13345 305 4614 -1571 7334 -8112 2158
5291 2158 -5088 -4555 10461 11922 9370 43298 36976 28431 19401 5912 12006 6496 7086 16310 34960
5276 34960 48973 59005 56242 7126 -5283 1510 7985 -920 13637 6146 -5181 1137 -2502
5263 -2502 -1935 27878 30878 4518 18061 32385 15562 -20882 -26379 -21802 -25608 -35612 -21773
5250 -21773 -11084 -8858 -15032 -22331 -30324 -21994 -18173 -31130 -28277 -19375 -17248 -4834 6393 17464
5236 17464 1986 5722 1483 -2519 9284 -845 -3958 20536 20766 25338 22507 -19669 -54474
5223e4474L319J7820q809K5065J0090j8560j1435o631J7417R037K834N74P813
5210e940L6435k038k6839J0331k0108j0267Q116N440K6201k867j7329k4579J9437
5197d007J007j3165N02o502K1381K139L33P285O688K0520n824l4233m65q027K394
5182i974Q09J969j1642m45L3157J8524m3997n090P239j1825n820L1516l213j6464
5168a5256J0897p149J04O466J4562L2001l189j4243j4400j3590K328J7112J0351
5155B5994R916j9845j3552J9978R185Q222j7371l580k276k7938m296J8087j2530
5142a0006o757P06J5716J554l940K731k4867J6773K3203j5533p472j6049L798
5129b0143O390K9049r624m1285k049J8740R062p583K2818L5771K633o683j0523
$$ plain form
5223 -54474 -51155 -33335 -42144 -17079 -6989 -25549 -36984 -43615 -26198 -17161 -14327 -13753 -5940
5210 -5940 30495 28457 1618 11949 -8159 -18426 -10310 -4870 21331 18464 1135 -23444 -4007
5197 -4007 -3000 -16165 -15663 -22165 -784 1355 1688 8973 15661 36181 30357 -3876 -4341 -12368 -9974
5182 -9974 -9165 -7196 -18838 -19283 13874 32398 -11599 -16689 -9450 -21275 -27095 4421 1208 -15256
5168 -15256 -4359 -11508 -11404 -4938 9624 41625 38436 24193 9793 -3797 -1469 15643 25994
5155 25994 35910 16065 2513 22491 31676 39898 22527 18947 16671 -11267 -15563 2524 -10006
5142 -10006 -16763 -16057 -341 1213 -2727 4 -24863 -8090 15113 -420 -7892 -23941 -20143
5129 -20143 -13753 15296 5672 -35613 -37662 -18922 -9860 -17443 5375 41146 43779 37096 26573
5116B6573J128n846j642K601k3457M205J2196L867O875l0191k265J8854n909j1805
5102d816J2964J1534R826j939k1838n625r781j8742o915l640J2493l816P689Q968
5088a3638J9802j7634l6885r357N425J4363l714J6361k955q241l325K3969J3051
5075b778j1946J5561K7085m064M740j1503l3807j8749j2696J064L7754J1749m136
5062a726K797q60J0229j639J744L877k1085j1086L474k0251K2467L825l435J4307
5048B638M716j7469L383O149j797k8985l0867j9660L1567J8520J7746L3706J3489
5035C3136p928k3010J848K1623J6785k6078l8025L733J9277o572K7542J1362j9560
5022A4133k283J78l00k3505p377J199k2731N703J2737Q861R17l1330j4706L067
$$ plain form
5116 26573 27701 21855 20213 22814 -643 3562 15758 19625 26500 -3691 -5956 12898 6989 -4816
5102 -4816 8148 19682 29508 27569 5731 106 -9675 -28417 -35332 -38972 -26479 -30295 -22606 -13638
5088 -13638 6164 -11470 -48355 -57712 -52287 -37924 -41638 -25277 -28232 -36473 -39798 -15829 -2778
5075 -2778 -14724 837 27922 23858 28598 17095 -16712 -35461 -48157 -47093 -9339 2410 -1726
5062 -1726 1071 211 10440 8801 10545 14422 -6663 -17749 -14275 -34526 -12059 -8234 -11669 2638
5048 2638 7354 -10115 -6732 -583 -2380 -31365 -62232 -81892 -50325 -31805 -14059 19647 33136
5035 33136 25208 2198 4046 25669 42454 16376 -21649 -17916 1361 -5211 22331 33693 14133
5022 14133 11850 12028 11728 -11777 -19154 -17955 -40686 -34983 -22246 -13385 -12468 -43798 -58504 -55437
5008e5437L6516J7182L909k1597K184M85K195n171m60q794J9001K6155p365P138
4994A5941K6825L817j9393j6841M126J5955m197k3144o196R493m439n701K929
4981h25j1315J8505q976o837j4938j122j689o475k3883K3373L0188K1159J0338
4968B7503K807o188P235k6428r935j2197m745j6706J3215J6071J0517K653L835
4955G637n174R542M773j6254q965m585K4435Q172j3350l1518P091J9859k246m266
4941d849l4183J2209L0880J0672p716j6931P428J7279K4641K5372k0299P282N989
4928E7774n1079m109L0968J6268J0441j7715r835r953k680k4299Q366J7640L918
4915B5705k613j0614J468j7696j6405O511L9494r480k6796j2508J577j3810p983
$$ plain form
5008 -55437 -18921 -1739 2170 -19427 -17243 -16758 -14563 -19734 -20194 -28988 -9987 16168 8803 15941
4994 15941 42766 46583 27190 10349 14475 30430 26233 3089 -3107 6386 1947 -3754 -825
4981 -825 -12140 6365 -2611 -9448 -24386 -25508 -27197 -33672 -57555 -34182 -3994 17165 27503
4968 27503 30310 24122 31357 4929 -5006 -17203 -21948 -38654 -25439 -9368 1149 3802 7637
4955 7637 2463 12005 16778 524 -8441 -13026 11409 19581 6231 -25287 -18196 1663 -583 -4849
4941 -4849 -39032 -26823 4057 14729 7013 -9918 -2490 14789 39430 64802 44503 51785 57774
4928 57774 6695 2586 33554 49822 60263 42548 32713 22760 20080 -4219 4147 21787 25705
4915 25705 23092 12478 13946 -3750 -20155 -13644 25850 16370 -10426 -22934 -21357 -35167 -43150
4902d3150L4531J4816r261j4333K557J8286l266n972j5465M981P179Q418L133
4889B454R236L540J6805J3244j6569P790r086P89k5842j8799j067j0672p366J5258
4875b0285O515K2754M810l670m230k954k0440k9983L7133K4938J631J2199k3878
4862D540m685n630R07j3174j0649o819j4787K172J6503K7904R89n939j4865o835
4848c0368O444R774J6191J7344L255K3100j304l4375k1990j979p804L4275K4096
4835C6659j0803j5688q413P58O519K1688J8309j9798j7845K1417J49l029k0671
4822I252q551N25L137J7243Q676K793l3711l8077j7655M79J6145J9355R270q878
4808a9997j7350j632O516K5853j45p743K1521L0364j0978k2234j5525Q843L007
$$ plain form
4902 -43150 -8619 6197 -3064 -17397 -14840 3446 180 -5792 -21257 -16276 -9097 -679 2454
4889 2454 11690 15230 32035 45279 28710 36500 27414 28203 2361 -16438 -17505 -28177 -35543 -20285
4875 -20285 -13770 8984 13794 10124 5894 2940 -17500 -47483 -10350 14588 16219 28418 4540
4862 4540 -145 -5775 -4868 -18042 -28691 -35510 -50297 -48125 -31622 -3718 -2729 -8668 -23533 -30368
4848 -30368 -23924 -14150 2041 19385 22640 45740 44436 10061 -11929 -13908 -21712 12563 36659
4835 36659 25856 10168 1755 2513 9032 30720 49029 29231 11386 32803 32952 29923 9252
4822 9252 701 1226 4363 21606 30282 33075 -636 -38713 -56368 -55889 -39744 -20389 -11119 -19997
4808 -19997 -37347 -38979 -32463 -6610 -6755 -14498 7023 37387 26409 4175 -11350 -2507 500
4795E00j2187k789J9965J767l2418j0798j09j7214P456K3425M0153j4202m1111
4782c7562o258J3284K654J6911K3959O427j0019J9483j293p274j7839k2954j6767
4769c7248L2666j614n507L2668J3428o135j0313R355J8335j4413k2323k4773m566
4756b0440K3226L5000j2567m3372K5559J007m442K930m386J7467o728k2719k61
4743i726P989n004m77M432M263j0833L921J5251J9137j4150m0481j2081r618k063
4729d9440J1162K032K6799R703j1370n464q787J6112K6060K4985L472l7774j8229
4716a0739J6650r24r296J6995j5443J2799M10p005j6027j2148n581p691J4530
4703b3470J9068k9605N462L6709k0374J731J8502J0519j8157O780J4445L070l9409
$$ plain form
4795 500 -11687 -14476 5489 7256 -25162 -35960 -36069 -53283 -45827 -22402 17751 3549 -37562
4782 -37562 -43820 -30536 -27882 -10971 12988 19415 9396 28879 27586 20312 2473 -20481 -37248
4769 -37248 -4582 -6196 -11703 20965 34393 28258 17945 27300 45635 31222 8899 -15874 -20440
4756 -20440 2786 37786 25219 -18153 7406 8413 3971 6901 2515 19982 13254 -9465 -9726
4743 -9726 -1737 -6741 -7218 -2786 1477 -9356 -5435 9816 28953 14803 -25678 -37759 -47377 -49440
4729 -49440 -38278 -36246 -9447 256 -11114 -16578 -25365 -9253 16807 41792 45264 7490 -10739
4716 -10739 5911 4987 -4309 12686 -2757 10042 10452 3447 -12580 -24728 -30309 -38000 -23470
4703 -23470 -4402 -34007 -28545 8164 -12210 -10479 8023 18542 385 7165 21610 24680 -14729
4690a4729j4020K2361J2476j8161J719k3686o558m019J2448K424J9730Q787j0380
4677a1608r783K0558K9007R736L138k4722l6260L4257K4277J2845j3845r473j99
4664B7928M093j6612j2693O487J631l1135l1090n801K1744l703M955N860J2500
4651a5836n666l8918Q752J3258L400K1825M937J0348j8513n64J4755j8038J6310
4638c950N008K3493k080j5456j5750J0687J1522R094l273k146l586N891j7729
4625A725J0618q213l468p327j4549M715K862O314j3969J4450L6307K139j2701
4612A8903j4416O113J8774r25n57R986J7246J2253j8352l6456l1425N480L664
4599i712j05J7644J2783k971m3430J8266J8833M455m661K562P408r784N523K347
$$ plain form
4690 -14729 -28749 -6388 6088 -12073 -10354 -34040 -40598 -44617 -32169 -29745 -10015 -1228 -11608
4677 -11608 -21391 -833 28174 37910 41048 16326 -19934 14323 38600 51445 37600 28127 27928
4664 27928 32021 15409 2716 9203 10834 -20301 -51391 -57192 -35448 -39151 -34196 -28336 -15836
4651 -15836 -21502 -60420 -51668 -38410 -35010 -13185 -8248 2100 -16413 -16977 -2222 -20260 -3950
4638 -3950 1058 24551 22471 7015 -8735 1952 13474 22568 19295 17149 13563 19454 1725
4625 1725 12343 4130 662 -6665 -21214 -16499 -13637 -7323 -21292 -6842 29465 31604 18903
4612 18903 4487 10600 29374 28449 27892 37878 55124 67377 49025 12569 -18856 -13376 -9712
4599 -9712 -9817 7827 20610 17639 -25791 -7525 11308 15763 11102 13664 21072 11288 16811 19158
4585A9158k925R578j001k2674R612K209q456k0174R283J3292M04M003J0094J131
4571B3534K688j471j4844O750K574M078m504l2456j0731L2147n363j9460J7673
4558F15Q528j2306J639M0022J3614r264l1888j7754k3215J4300N879O012J7504
4545A3686K5118r931l0514p526p955J9502q688J5575l876K87j9908N076j0655
$$ plain form
4585 19158 16233 25811 24810 2136 11748 13957 5501 -14673 -5390 7902 8306 12309 22403 23534
4571 23534 26222 24751 9907 16657 19231 23309 18805 -13651 -24382 7765 2402 -17058 615
4558 615 9143 -3163 -1524 38498 52112 42848 10960 -6794 -30009 -15709 -9830 -3818 13686
4545 13686 38804 28873 -1641 -9167 -17122 2380 -6308 9267 5391 5678 -14230 -9154 -19809
$$ [...]
##END NTUPLES=NMR SPECTRUM
##END=
