##TITLE=Analysis number 328693
Compound Code cc 60503
Book Reference 494/190
Project Code adrs
Chemist Name craigr
##JCAMPDX= 6.0         $$ Bruker NMR JCAMP-DX V2.0
##DATA TYPE= NMR SPECTRUM
##DATA CLASS= NTUPLES
##ORIGIN= Bruker BioSpin GmbH
##OWNER= nmr
$$ XWIN-NMR		Version 3.5
$$ Tue Jun 26 13:12:51 2007 GMT Daylight Time (UT+1h)  MAYBRIDGE\nmr@NMR_250MHZ
##.OBSERVE FREQUENCY= 250.131544655141
##.OBSERVE NUCLEUS= ^1H
##.ACQUISITION MODE= SIMULTANEOUS (DQD)
##.ACQUISITION SCHEME= undefined
##.AVERAGES= 16
##.DIGITISER RES= 18
##SPECTROMETER/DATA SYSTEM= dpx250
##.PULSE SEQUENCE= zg30
##.SOLVENT NAME= CDCl3
##.SHIFT REFERENCE= (INTERNAL, CDCl3, 0, 16.522)
##AUDIT TRAIL= $$ (NUMBER, WHEN, WHO, WHERE, WHAT)
$$ ##TITLE= Audit trail, XWIN-NMR		Version 3.5
$$ ##JCAMPDX= 5.01
$$ ##ORIGIN= Bruker BioSpin GmbH
$$ ##OWNER= nmr
$$ C:\u/data/dgb/nmr/ADRS/2030/pdata/1/auditp.txt
$$ ##AUDIT TRAIL=  $$ (NUMBER, WHEN, WHO, WHERE, WHAT)
(   1,<2007-06-26 13:12:23.93 +100>,<MAYBRIDGE\nmr>,<NMR_250MHZ>,
      <created by zg, POWCHK disabled, PULCHK disabled
       configuration hash MD5:
       76 6E 9A 78 1E 09 19 81 EC 84 63 8F B0 6A 59 2D
       data hash MD5: 64K
       30 0E 86 D8 11 F4 29 D1 B4 1B C7 76 FC AF 38 74>)
(   2,<2007-06-26 13:12:40.60 +100>,<MAYBRIDGE\nmr>,<NMR_250MHZ>,
      <Start of raw data processing
       ef LB = 0.3 FT_mod = 6 PKNL = 1 SI = 32K 
       data hash MD5: 32K
       E6 0C E2 F1 7C C6 28 DE F8 2E CF 76 DB 35 B8 9D>)
(   3,<2007-06-26 13:12:42.45 +100>,<MAYBRIDGE\nmr>,<NMR_250MHZ>,
      <apk 
       data hash MD5: 32K
       CF 55 FF DA DC DE A6 5F 13 BC 76 10 53 92 5B D4>)
(   4,<2007-06-26 13:12:43.17 +100>,<MAYBRIDGE\nmr>,<NMR_250MHZ>,
      <abs ABSG = 5 
       data hash MD5: 32K
       2F 4D 79 F7 B4 FC 03 B5 F8 A0 31 5A 9E 3A CE 62>)
$$ ##END=
$$ 
$$ hash MD5
$$ 44 50 F7 03 55 44 58 69 4F 6D 88 05 A7 AA A0 0A
##$RELAX= 
##$RELAX= 
##$RELAX= 
##$RELAX= 
##$RELAX= 
##$RELAX= 
##$RELAX= 
$$ Bruker specific parameters
$$ --------------------------
##$DU= <C:\u>
##$EXPNO= 2030
##$NAME= <ADRS>
##$PROCNO= 1
##$TYPE= <nmr>
##$USER= <dgb>
##$AMP= (0..31)
100 100 100 100 100 100 100 100 100 100 100 100 100 100 100 100 100 100 
100 100 100 100 100 100 100 100 100 100 100 100 100 100 
##$AQSEQ= 0
##$AQ_mod= 3
##$AUNM= <au_zg>
##$AUTOPOS= <31 >
##$BF1= 250.13
##$BF2= 250.13
##$BF3= 250.13
##$BF4= 250.13
##$BF5= 500.13
##$BF6= 500.13
##$BF7= 500.13
##$BF8= 500.13
##$BYTORDA= 1
##$CFDGTYP= 0
##$CFRGTYP= 5
##$CHEMSTR= <none>
##$CNST= (0..31)
1 1 145 1 1 1 1 1 1 1 1 1 1 1 1 1 1 1 1 1 1 1 1 1 1 1 1 1 1 1 1 1 
##$CPDPRG= <>
##$CPDPRG1= <>
##$CPDPRG2= <>
##$CPDPRG3= <>
##$CPDPRG4= <mlev>
##$CPDPRG5= <mlev>
##$CPDPRG6= <mlev>
##$CPDPRG7= <mlev>
##$CPDPRG8= <mlev>
##$CPDPRGB= <>
##$CPDPRGT= <>
##$D= (0..31)
0 1 0 0 0 0 0 0 0 0.06 0 0 0 0 0 0 0.0002 0 0 0 0 0 0 0 0 0 0 0 0 0 0 
0 
##$DATE= 1182859942
##$DBL= (0..7)
120 120 120 120 120 120 120 120 
##$DBP= (0..7)
150 150 150 150 150 150 150 150 
##$DBP07= 0
##$DBPNAM0= <>
##$DBPNAM1= <>
$$ [...]
##$SUBNAM7= <"">
##$SUBNAM8= <"">
##$SUBNAM9= <"">
##$SW= 20.6930455092707
##$SWIBOX= (0..15)
0 0 3 0 0 0 0 0 0 0 0 0 0 0 0 0 
##$SW_h= 5175.983436853
##$TD= 65536
##$TD0= 1
##$TE= 296.16
##$TE2= 300
##$TE3= 300
##$TEG= 300
##$TL= (0..7)
0 120 120 120 120 120 120 120 
##$TP= (0..7)
150 150 150 150 150 150 150 150 
##$TP07= 0
##$TPNAME0= <>
##$TPNAME1= <>
##$TPNAME2= <>
##$TPNAME3= <>
##$TPNAME4= <>
##$TPNAME5= <>
##$TPNAME6= <>
##$TPNAME7= <>
##$TPOAL= (0..7)
0.5 0.5 0.5 0.5 0.5 0.5 0.5 0.5 
##$TPOFFS= (0..7)
0 0 0 0 0 0 0 0 
##$TUNHIN= 0
##$TUNHOUT= 0
##$TUNXOUT= 0
##$USERA1= <user>
##$USERA2= <user>
##$USERA3= <user>
##$USERA4= <user>
##$USERA5= <user>
##$V9= 5
##$VALIST= <valist>
##$VCLIST= <CCCCCCCCCCCCCCC>
##$VD= 0
##$VDLIST= <DDDDDDDDDDDDDDD>
##$VPLIST= <PPPPPPPPPPPPPPP>
##$VTLIST= <TTTTTTTTTTTTTTT>
##$WBST= 1024
##$WBSW= 4
##$XGAIN= (0..3)
0 0 0 0 
##$XL= 0
##$YL= 0
##$YMAX_a= 376080
##$YMIN_a= -283645
##$ZGOPTNS= <>
##$ZL1= 120
##$ZL2= 120
##$ZL3= 120
##$ZL4= 120
##$ABSF1= 16.522
##$ABSF2= -4.171173
##$ABSG= 5
##$ABSL= 3
##$ALPHA= 0
##$AQORDER= 0
##$ASSFAC= 0
##$ASSFACI= 0
##$ASSFACX= 0
##$ASSWID= 0
##$AUNMP= <proc_1d>
##$AZFE= 0.1
##$AZFW= 0.1
##$BCFW= 0
##$BC_mod= 0
##$BYTORDP= 0
##$COROFFS= 0
##$CY= 12.5
##$DATMOD= 1
##$DC= 0
##$DFILT= <>
##$DTYPP= 0
##$F1P= 14.0000005364418
##$F2P= -0.99999901652339
##$FCOR= 0.5
##$FTSIZE= 32768
##$FT_mod= 6
##$GAMMA= 0
##$GB= 0
##$INTBC= 1
##$INTSCL= 1
##$ISEN= 128
##$LB= 0.3
##$LEV0= 0
##$LPBIN= 0
##$MAXI= 10000
##$MC2= 0
##$MEAN= 0
##$ME_mod= 0
##$MI= 0
##$NCOEF= 0
##$NC_proc= -3
##$NLEV= 6
##$NOISF1= 0
##$NOISF2= 0
##$NSP= 0
##$NTH_PI= 0
##$NZP= 0
##$OFFSET= 16.522
##$PC= 1
##$PHC0= -50.36375
##$PHC1= 7.390023
##$PH_mod= 1
##$PKNL= yes
##$PPARMOD= 0
##$PSCAL= 4
##$PSIGN= 0
##$REVERSE= no
##$SF= 250.13
##$SI= 32768
##$SIGF1= 0
##$SIGF2= 0
##$SINO= 400
##$SIOLD= 32768
##$SREGLST= <1H.CDCl3>
##$SSB= 0
##$STSI= 32768
##$STSR= 0
##$SW_p= 5175.98343685301
##$SYMM= 0
##$S_DEV= 0
##$TDeff= 65536
##$TDoff= 0
##$TI= <Analysis number 999999
Compound Code 99
Book Reference 9
Project Code 9>
##$TILT= no
##$TM1= 0
##$TM2= 0
##$TOPLEV= 0
##$USERP1= <user>
##$USERP2= <user>
##$USERP3= <user>
##$USERP4= <user>
##$USERP5= <user>
##$WDW= 1
##$XDIM= 32768
##$YMAX_p= 594465273
##$YMIN_p= -111187
$$ End of Bruker specific parameters
$$ ---------------------------------
##NTUPLES= NMR SPECTRUM
##VAR_NAME=  FREQUENCY,     SPECTRUM/REAL,   SPECTRUM/IMAG
##SYMBOL=    X,             R,               I
##VAR_TYPE=  INDEPENDENT,   DEPENDENT,       DEPENDENT
##VAR_FORM=  AFFN,          ASDF,            ASDF
##VAR_DIM=   32768,         32768,           32768
##UNITS=     HZ,            ARBITRARY UNITS, ARBITRARY UNITS
##FACTOR=    0.157963299565203, 1,           1
##FIRST=     4132.6476996994, 0,             0
##LAST=      -1043.33573715361, 0,           0
##MIN=       -1043.33573715361, -111187,     0
##MAX=       4132.6476996994, 594465273,     0
$$ Real data points
##PAGE= N=1
##DATA TABLE= (X++(R..R)), XYDATA
$$ [...]
23143 -5212 -10582 -2321 720 -4296 22504 26795 19705 2837 -4755 -17093 -65328 -59987 -19679
23130 -19679 10025 26459 22301 7652 20210 20003 28473 8921 -8180 -26670 -25421 462 18008
23117 18008 15089 22452 9476 -37529 -24359 1693 23985 44231 57799 22160 23753 23365 18924
23104 18924 -5515 -33779 -32735 -18014 1586 6722 -13188 -15407 -40670 -54791 -71618 -70922 -58461
23091 -58461 -24361 -25096 -45165 -33419 107 41293 24567 12155 -18601 -19935 -8176 -6632
23079 -6632 -10774 18970 32361 15897 31540 30784 17116 65518 71537 55014 22151 1774 -2998
23066 -2998 4757 29481 24996 -14750 -13272 2900 -10090 11284 4247 16864 32674 48461 32033
23053 32033 12636 -5891 9895 26784 51841 65943 45574 30451 25876 26711 31064 35977 4627
23040 4627 -30118 -16423 -1938 4736 3753 -2896 11513 1494 -7567 -21924 -28784 -29580 -38779 -49997
23026 -49997 -43692 -45086 -75903 -68419 -22839 17439 7653 19387 42669 51250 30830 41809 30344
23013 30344 -18007 -20551 -12625 -21903 6628 18572 22684 33719 25121 20726 21252 20546 40224 29548
22999 29548 18224 22378 -479 24583 30067 25281 15945 811 3371 15909 47264 38369 32088
22986 32088 -516 -16389 -30356 -33450 -11673 30363 59303 30471 16840 23275 35738 41709
22974 41709 31674 7989 -15180 5360 36364 7278 -17629 -8731 3174 -21657 -37233 -32159
22962 -32159 -4804 -9420 -9620 -15693 -3862 25598 13061 -44077 -37126 7030 12747 19377 14033
22949 14033 12880 53043 51317 33979 14726 3195 4192 -6726 -3401 160 17153 20462 11445
22936 11445 14817 42610 54619 26636 7448 2968 -22397 -22207 -7 -7950 -3478 9903 26328
22923 26328 34990 13849 -12690 -19733 -14334 -17290 -37573 -36013 -8406 6466 -37561 -62889 -45371
22910 -45371 -14297 4972 -3522 7480 28048 52610 36576 9139 -6974 -26221 -24790 -6530
22898 -6530 -22689 -24004 -21107 -25681 -21822 -21912 -29498 -17625 9843 35988 23955 6342 5095 4050
22884 4050 7988 4764 -32359 -51639 -41698 14653 19906 7712 -7772 20952 38064 39780 53888
22871 53888 61065 23852 10026 20943 32011 40926 23718 -457 -21411 -15665 1455 26605
22859 26605 61798 76117 60447 39935 32949 32660 21426 25071 19147 -7756 -18145 14618 31316
22846 31316 2273 -1299 10975 9749 4460 -3130 -41629 -74149 -102778 -78705 -61566 -39904
22834 -39904 -25765 -10179 -251 -8572 -22734 -6865 8624 8078 -5874 1034 -24681 -50507 -46563
22821 -46563 -18845 -8609 -21988 18295 18290 18038 -5980 -18050 -64 -22775 -15339 -11788 -19509
22808 -19509 6395 -357 12187 12155 -29344 -42142 -38145 -29255 -26982 -22622 -61036 -73226 -54565
22795 -54565 -33718 -43403 -29656 -4042 -18061 -32378 -69401 -51844 -29084 -11108 -31444 -71084
22783 -71084 -76204 -89435 -83170 -70918 -58808 -17732 28773 26861 2052 6521 -29390 -44223
22771 -44223 -40510 -17794 -37103 -30405 -18526 -59741 -64628 -56423 -25885 14826 50725 78869
22759 78869 45826 35064 54083 59218 63639 41112 44674 42840 20448 25312 36700 19482 2160
22746 2160 12263 21799 41090 56484 47652 28443 9500 -22691 -24733 -26264 -20696 -20191 -15811
22733 -15811 -13207 -20518 -23715 -219 11292 -4227 13193 13081 2189 18574 13661 -12149 -35740
22720 -35740 -53236 -44286 -19393 3451 8578 -20788 -7464 -7009 -8370 -3400 6247 -11445 2654
22707 2654 44822 27053 11554 18669 49983 62716 50902 27511 13969 4799 20371 3854
22695 3854 -4295 9330 44827 62438 41106 2253 -1623 1887 1301 -21206 -45315 -28639 -33803
22682 -33803 -30894 -26772 18009 18549 13500 8754 1174 -12182 -40121 -50613 -54752 -92734 -80631
22669 -80631 -59632 -46708 -2220 2621 -17551 -37537 -40569 -18687 11993 54615 87394 98955
22657 98955 66263 30984 43579 47926 33108 26947 33714 40291 30722 21662 26265 38167 32837
22644 32837 22590 -5228 -1379 40150 45247 18799 7752 8298 -13540 -26129 -30102 -4601 -10899
22631 -10899 22304 16706 -16274 -28480 -14898 1356 -12238 -41805 -51971 -40799 -24041 -30180
22619 -30180 -30937 -15771 -7132 -3043 -3946 -12967 -40206 -52451 -52225 -50797 -28742 -5747 -40648 -52357
22605 -52357 -8971 1944 -8538 -26285 14504 25192 23634 29533 31507 11841 19750 12035 -15520
22592 -15520 -34826 -36541 -595 28466 10635 -12978 -12998 5977 22150 27376 176 3314 13228
22579 13228 8782 885 1595 9311 -10162 0 3436 -15215 -18176 -21113 -15405 -5432 -7336 -18448
22565 -18448 -1502 24193 60547 59834 31375 16529 17185 21911 32755 59097 68118 64358 27169
22552 27169 -11638 -4358 15451 30168 30634 52354 66912 50923 36085 8794 -14963 -24984
22540 -24984 -60860 -54887 -40373 -14228 14948 -2982 16709 24380 14860 -2845 -7818 125 1790
22527 1790 25904 14457 5236 5847 18432 -7120 629 21785 14856 16505 12739 12384 24352 17329
22513 17329 -5238 -10180 -21366 -39844 -58353 -46215 -32073 -15351 -15518 -7148 -15441 -16756 -12140
22500 -12140 -3252 16812 16619 15040 16435 30162 10155 1915 7218 -824 -6729 -11796 17350 22235
22486 22235 5969 6036 15391 16123 22055 10761 -24893 -38110 -29629 -5179 29713 41807 35270
22473 35270 465 -33963 -53943 -29838 -14180 6560 -11862 -43922 -44262 -40408 -27100 -9945
22461 -9945 8672 9597 10259 -8837 -28 5497 -17239 -36023 -22077 -18411 -25994 -24996 -38071 -45448
22447 -45448 -16841 18099 6081 -17410 -20661 4569 10064 -14018 -15652 -20626 -17167 -28770 -31354
22434 -31354 -26021 -1074 17883 11435 10037 25251 -26440 -41075 -18436 600 1540 2774 5534
22421 5534 27350 19968 13442 -14111 -22670 -27384 5430 15251 24513 51319 15599 -467 -3657
22408 -3657 7881 8524 -1618 -6166 -9315 -15464 -15880 -7825 8895 8911 1774 -10015 -13663 -11345 -12013
22393 -12013 -39730 -15320 4908 6041 -6205 -15327 -11115 -7732 -13520 -33500 -34783 -4164 23081
22380 23081 12886 -16027 -17903 -2378 -7380 -24580 -27515 -48088 -44331 -19378 -7111 7445
22368 7445 -12777 -22252 -5801 13457 14536 26706 29663 -9011 -23622 -59175 -76439 -29954
22356 -29954 -6168 -3648 -9274 6129 10507 -15679 -6154 -1739 -2752 -3281 13230 -4045 25846
22343 25846 22244 -9633 -32493 -28777 -27540 -20710 -19918 -25969 -34256 -41670 -72814 -44300 -19824
22330 -19824 -29580 -14014 -19723 -44259 -42104 -7195 6224 4071 -19915 11132 34146 23480
22318 23480 9992 17882 22216 1518 -43737 -67533 -27928 -8267 -3214 1354 7127 -20205 -38282
22305 -38282 -53927 -45875 -36580 -44792 -35140 -59790 -45325 -23862 -45641 -60068 -33247 -26728 -28494
22292 -28494 -47367 -31662 2110 -11673 -26963 -33653 -45022 -39178 -39944 -34607 -8257 34063 3905
22279 3905 -4736 -2767 -14392 -21198 1057 12132 -12923 -5689 -7956 -5100 26537 11303 -35135
22266 -35135 -13762 -8694 -14656 -26564 -13981 12513 7342 -16340 -59943 -53209 -31874 -10541
22254 -10541 29282 67805 51116 18562 -19131 -46264 -38019 -23754 -30169 -26273 -37686 -29274
22242 -29274 1972 2710 -14340 4873 -2316 -10862 -17322 12351 18295 2017 29364 60625 63089
22229 63089 48539 58289 27030 8132 -4866 -673 34653 42240 35150 38804 2535 -7458 -41738
22216 -41738 -59250 -35232 -5069 31612 53371 37807 20342 25674 18089 406 5991 21613
22204 21613 4811 -28622 -12980 19195 5658 -34605 -48049 -43457 -33585 -49299 -87222 -90629
22192 -90629 -58904 -13094 5244 8391 14859 21311 15354 2665 -17597 -44065 -51175 -67174 -47132
22179 -47132 -20491 4083 -10755 -15588 3280 11298 -3051 -29517 -9361 9187 7830 6755
22167 6755 9259 10493 -14600 -36073 -42538 -42723 -16214 -38521 -63854 -72769 -49130 -38152 -28981
22154 -28981 -20574 -29215 -39745 -56561 -50413 -33347 -28484 -14781 -16698 -16859 -13563 -8852 -17865 -15030
22140 -15030 -20766 225 -19993 2429 6532 -11944 -17322 7325 29834 39301 2918 -22487
22128 -22487 -2042 -6904 -26438 -45210 -29595 -28593 -10047 8155 -27204 -66490 -72752 -66135
22116 -66135 -48380 -73181 -93588 -74585 -70803 -53200 -23376 -16295 -24227 -22011 -24059 -2795 5856
22103 5856 18952 30916 35115 36542 -15707 -20309 19506 -3552 -23295 -12771 -11345 -4930 17155
22090 17155 20728 8567 -9214 -2821 19052 4925 -8456 36266 2081 -28647 -31879 10462
22078 10462 45486 42374 41307 30752 7700 204 -16019 -10455 -2697 -8419 -5035 1381 11351
22065 11351 16947 15053 14491 16208 3145 1314 9026 4154 14385 7070 -6051 1411 9233 66047
22051 66047 53743 28113 21702 -10134 -50519 -46205 -61043 -66532 -29829 12564 -2722 -26572
22039 -26572 -2632 -16796 -23394 -40184 -83564 -100520 -57612 -53420 -67663 -51545 -22496 1505
22027 1505 17292 10479 10068 25739 680 -37196 -53799 -54707 -51123 -64250 -48315 -28133 -35908
22014 -35908 -30844 -19646 -3863 -4560 -19125 -20419 -7468 -24408 -31922 -3220 14177 33594 30766
22001 30766 30931 37942 19146 3629 631 -3810 -16730 -15683 -12128 -12112 -11116 -1815 -10765 -4689 25190
21986 25190 63241 75707 65159 45021 34110 17790 5238 1136 10855 28327 20905 20738 8008
21973 8008 12589 20742 7481 12049 -10906 -10453 -28895 -35913 4314 20901 17866 -5674 -31327
21960 -31327 -16539 -749 7761 -371 -4611 -43862 -51202 -4062 32547 24106 28272 34284 15194
21947 15194 8379 -18062 -28822 -12791 -13517 -23606 -22852 -3846 -19900 -28753 -15227 -17416 -31289
21934 -31289 -15999 8110 -18076 -18519 23312 34984 23009 -22453 -61604 -84260 -66751 -38354
21922 -38354 -26039 -28851 -32706 -49985 -48303 -42444 10264 16159 -6573 14132 9696 6913 26747
21909 26747 23989 5479 19280 15801 18904 29877 49248 53401 14456 26850 40557 55796
21897 55796 44556 38767 16458 10072 19506 -15784 -1094 26662 14320 21250 22945 2750 -52892
21884 -52892 -54475 -37567 -29862 -50794 -38865 -37860 -36130 -37122 -32309 720 9109 -20872 -43632
21871 -43632 -53797 -57024 -54919 -35688 -40458 -10217 -2951 -39080 -41704 -37075 -29579 -40598 -43251
21858 -43251 -29770 -25482 -45341 -81562 -70868 -62911 -41070 7499 15369 11013 11390 16503 37609
21845 37609 45026 20073 33613 82 -27448 -8841 -6448 9352 38782 26786 16837 27337
21833 27337 23460 -8805 4896 25251 27032 33619 35080 13517 -21710 -2290 13534 -25854
21821 -25854 -49054 -68112 -61900 -50166 -45568 -37206 3589 30188 46903 49218 36168 14103
21809 14103 -20774 -10036 -18909 190 9146 -16813 -45383 -61340 -73555 -61536 -62201 -58746 -35558
21796 -35558 6619 19920 -2068 -21772 -5511 -22733 -57795 -70460 -46014 -37560 -54275 -19545
21784 -19545 19250 5012 -8167 -7375 -31899 -40215 -47350 -52642 -27291 -2720 -44362 -75254 -60689
21771 -60689 -15860 -18326 -35625 -1688 2187 -14008 -28991 -31012 -61 15093 20032 -2298
21759 -2298 -18595 -1068 -2338 -17799 -23997 17913 38398 18453 19053 22901 -83 -36439 -21143
21746 -21143 23505 26064 4955 -8715 -19299 10196 26615 13628 -8067 -28140 -44887 -33638
21734 -33638 -21612 -16736 -20459 -57603 -77752 -42525 1896 40698 53462 52727 49433 40041 32838
21721 32838 36164 14793 -1621 4176 36296 26602 23561 3703 8988 2282 -16518 -27529 -25321
21708 -25321 -27086 -31526 -16050 -31415 -24787 15275 52721 47824 53496 38296 31783 57864 52834
21695 52834 35881 -3300 -16107 -18214 -8062 -7352 16314 33843 42775 12295 -17000 -30230
21683 -30230 -34687 -30589 -27549 -16031 -35787 -39679 -30973 -11542 -19687 -27641 -25244 -33382 -30651 -26235
21669 -26235 -31223 -51101 -41935 -42551 -150 27109 29700 60455 42847 -297 -15947 -29224 -31617
21656 -31617 -5762 -1031 -4302 3727 -4022 -4610 -17213 -7552 -19017 -30996 -19352 -12013 21241
21643 21241 45564 12656 -28902 -21643 -14957 -47326 -50211 -17320 -9284 -918 -31433 -14976 4729
21630 4729 -350 -13507 6414 716 8917 6698 -5194 -20495 -23475 -42781 -32631 -8305 2689
21617 2689 -3820 -26267 -20695 6900 18431 3122 21738 28815 -29269 -33212 -23535 -53120 -58112
21604 -58112 -37119 -23553 -12952 16353 166 9884 30172 1237 14569 5583 -18663 -33158
21592 -33158 -29171 -31376 -45609 -28036 -12435 6665 -1928 -3892 23904 32919 23428 31551 25727
21579 25727 48028 38215 22359 31649 6330 1074 23401 47484 17903 17447 -33874 -34336 -29340
21566 -29340 777 12487 7872 -28844 -33619 1968 35477 18573 -14171 -14405 -12620 -30141 -27656
21553 -27656 7088 18511 33433 50845 31944 -1512 -10979 -18074 -14811 5937 20238 33452
21541 33452 28318 -12623 -24355 -25056 -19758 -4460 -12829 -7766 4012 -6839 -15930 13286 21369
21528 21369 -13534 -23462 -9390 17434 32768 19465 22582 31329 27977 19670 8728 11305 -5310
21515 -5310 -17854 -5311 15307 28790 -5246 -43989 -44541 -10860 4732 25119 4033 -1778
21503 -1778 4024 22950 24147 21706 827 -33222 -54562 -51602 -62421 -79199 -62221 -40592 -24000
21490 -24000 -8123 -749 1376 -13434 -26884 -21563 -13364 -9312 -4442 -16423 -12087 -34250 -53083
21477 -53083 -63866 -69481 -47307 -8679 19516 33815 1264 -30227 -17171 11090 -3099 -18289
21465 -18289 4506 3297 -40987 -67816 -54585 -54184 -41832 -12639 -8592 -22951 -14067 9377 25373
21452 25373 -2401 -31528 -21850 -12858 2102 27999 41828 22595 11888 13606 209 6562
21440 6562 10404 19729 29461 19588 11729 -5871 -19703 -9203 -14626 18934 47004 22561 1389
21427 1389 -11343 -11732 -22391 -18143 -30201 -39164 -23572 -7503 -21428 -39436 -37198 -37749 -5150
21414 -5150 29997 27972 18574 5917 864 -13750 -46975 -34355 -18468 -10753 11837 25197 18839
21401 18839 8951 3373 8067 -3154 -16340 -41691 -27770 -14741 9251 18803 3340 -19249
21389 -19249 -12785 -8608 -4485 -7879 -26161 -14788 -17918 -16866 -10453 -3023 -6411 10726 8285 -15757
21375 -15757 -24831 -2959 38972 43348 7702 -1674 -15037 -24626 -19472 14950 25613 22936 17093
21362 17093 16956 48268 53207 13300 -10615 -41444 -58430 -50056 -16683 -15872 7760 -7952 11285
21349 11285 39029 12053 -14543 -26036 -34857 -34046 -41818 -34070 16925 47857 45514 7263 -6041
21336 -6041 5485 9214 -1254 5853 16015 22063 5581 -23676 -43030 -45512 -21297 -11805 -20880
21323 -20880 -760 -8527 -14679 8445 32730 -714 -29814 -7264 -655 -168 -20365 -52665 -62566
21310 -62566 -36102 -6733 -12017 2257 9741 -1054 -7335 -7838 -3650 -8663 19 5505 15731
21297 15731 37677 37005 9342 11205 11308 1024 -16054 -7203 -36471 -42700 -15917 13054 13202
21284 13202 5608 7993 23274 28775 36984 4743 -10327 -14299 -10844 -12254 20297 39359 26651
21271 26651 17443 30741 17947 2947 7456 20834 26979 18598 -7395 -14710 -23411 -16206 14145
21258 14145 -26568 -14550 16772 -962 -13165 -24193 -4360 -23201 -20067 -5938 3573 25152
21246 25152 -1462 -8109 1776 -5388 -23990 -51794 -41620 -11537 -13666 -32601 -7112 -14467 -31512
21233 -31512 -7732 1287 13912 -6101 -40292 -45006 -28808 -22024 -12206 1881 9879 32314 10817
21220 10817 4289 5259 24781 60452 57133 36146 13839 5439 -15233 -17890 17171 25464 -7972
21207 -7972 -50089 -19799 12282 16649 29979 24927 4512 -19021 -39699 -13770 -13475 -39483 -36932
21194 -36932 -11396 -21416 -24079 -20838 -9067 -854 19600 25086 -8364 21619 21328 -8720 -17086
21181 -17086 -29477 -21545 1366 -23151 -56782 -37351 -26945 -29799 -24546 -48048 -45654 -28185
21169 -28185 -18559 -26576 -10931 -32165 -21972 -27227 -20664 -18541 -24848 -16514 -7384 58 -1625 2403
21155 2403 -17293 -36310 -30627 -35736 -37295 -22610 -3684 13211 15144 13576 -6761 -29813 -9961
21142 -9961 3544 9538 1033 -26181 -33337 -31457 536 21040 17265 6186 4093 15578 2626
21129 2626 -8284 1097 8214 20694 14467 -16386 2749 6463 10354 47346 43031 33860 -11287
21116 -11287 -44872 -27359 -24394 -21908 -46012 -33491 -4451 5109 -22580 -39464 -27907 -25515
21104 -25515 -27464 -8737 -6348 -19470 -34073 -52937 -77942 -67689 -50017 -31360 -8180 750
21092 750 -36225 -27086 -15510 -23634 -52170 -19797 29767 13710 -9262 -1572 6299 -11999 -6424
21079 -6424 3071 -13040 -19439 -11309 19602 -836 -37550 -52326 -28207 -8541 -25215 -48561
21067 -48561 -29032 -24186 -24029 -22365 -34660 -19113 -24981 -30476 -17333 -8242 -6002 5801 -1532
21054 -1532 -7240 501 260 -8966 -28789 -28394 -15138 -11236 -13428 -30428 -39285 -50145 -46903 -44323
21040 -44323 -29792 1423 35020 35541 27343 23912 8254 -33268 -39268 -34940 -42534 -13070 -10819
21027 -10819 -9408 6579 357 -38342 -29102 -10902 -10051 6540 10853 -1924 -39624 -35344 16085
21014 16085 12294 -255 18773 -2664 -29991 -21211 6360 9545 -31171 -21480 -18537 -26017 1689
21001 1689 -22465 -19813 1301 35533 67710 60404 11482 18312 31742 25603 10390 -23379 -24257
20988 -24257 999 43855 55316 23382 -4604 -4520 -7052 -4804 10662 19426 26994 21675 3838
20975 3838 -22413 -10635 30566 49298 15207 1203 26334 39198 207 -14101 -17281 -23918
20963 -23918 -1945 -8129 -35801 -44639 -22858 -7429 -17526 -4160 -13574 -19663 5006 -15246
20951 -15246 -22067 979 14103 2498 13230 -2504 -13336 1807 4577 6143 -10812 -50691
20939 -50691 -70400 -84649 -80718 -95105 -110421 -95943 -61564 -44972 -49771 -31118 -12688 -11907
20927 -11907 -12461 -3207 -21297 11235 8915 -3934 -20620 -30278 -26151 -20778 14139 22602 15690
20914 15690 -5097 -46062 -38745 -8038 6434 44673 44425 26550 15547 14248 15871 37589 28612
20901 28612 23379 11019 -10883 -6916 5908 -6123 -16363 2530 -5128 -5787 -12041 19653 4778
20888 4778 -3238 1773 11078 31173 33914 40407 39118 7038 -22402 -29962 -29253 -45329 -64296 -33385
20874 -33385 -25948 -22791 -2271 15381 8717 -5157 -5851 -5210 -24108 -29122 -15833 -11696 15504
20861 15504 23819 -2324 5576 7546 26588 41564 32237 6258 949 -2061 -20377 -13390 12
20848 12 5834 -15285 -22947 -30479 -31602 15852 31620 778 9748 14499 44208 60961 20339
20835 20339 -8405 -34984 -8058 21167 9637 -16221 -19203 -56182 -86429 -66705 -30843 -7367
20823 -7367 21664 13357 21463 -10115 -37115 -49662 -48565 -37331 -23751 -8792 21906 64425
20811 64425 49001 -14126 -37435 -38837 -21922 -17018 -97 5556 15709 -4727 -23349 18169
20799 18169 31154 7705 714 25419 32572 20536 -14797 -12752 -15708 19709 22300 1779 20103
20786 20103 39347 25652 -3363 -20196 -8794 -52166 -39096 -30154 -11535 -19930 -43699 -62864
20774 -62864 -30528 -6768 -29402 -36023 -15491 -65 -12691 -14410 4469 12941 11976 -8062 -30729
20761 -30729 -23847 -36439 -51415 -50709 -20574 -24580 -50092 -17687 2584 13013 4076 -27320 -36748
20748 -36748 -17308 -1830 -23413 -30368 -20014 -7036 306 -5854 23423 35625 -31 1107
20736 1107 3791 12626 21307 24926 39247 37742 28856 28748 28023 24179 2897 3629 4379 -10715 -9928
20721 -9928 626 -15118 -18066 -12756 962 -19048 -49636 -34286 -18735 4635 13554 -6284
20709 -6284 -36046 -29594 -8873 -4615 -936 -18055 -35450 -23361 -12406 -19428 -11036 10205 16068
20696 16068 15871 8677 -15594 -13996 -637 18326 14404 16575 33582 2562 7276 16105 50492
20683 50492 52927 58989 55163 21044 8708 -12735 -44521 -27743 1472 -17060 -2090 6630
20671 6630 -16661 -26831 -23167 -18589 -7400 -21902 -25311 -28883 5700 -146 -5937 14848 10324
20658 10324 -22798 -24886 -10538 -16510 -19812 -28431 -14759 6060 8057 10971 13815 -1716 -22401
20645 -22401 -24363 -30204 -20801 1152 20603 3836 25183 21892 -3003 -18993 -23124 -51270 -42652
20632 -42652 -47002 -40685 -29338 -11386 -1982 13421 8154 567 -18893 -39508 -22984 1088 -917
20619 -917 -2028 -979 -44335 -63195 -46734 -15843 8786 10937 -3170 -17316 -38167 -32022 -14464
20606 -14464 3293 15939 3978 -41579 -62355 -50934 -39071 -18003 -5762 -32151 -29297 -31837
20594 -31837 -20650 -11291 -17174 -33236 -46116 -53005 -46447 -41156 -56587 -49213 -610 40960 32962
20581 32962 4714 -2424 22713 7037 -27749 -14675 -5417 12581 9602 19490 6523 -24497
20569 -24497 -2396 -11475 27687 55798 40619 27735 -5253 -3795 23954 43837 24472 -2724
20557 -2724 -4687 3355 14382 25547 27137 -16063 -29558 -2384 5718 8190 -5685 -17348 -1431
20544 -1431 13344 -4263 -2324 13178 24840 34972 11106 -16744 -3131 -14129 -11763 -17041
20532 -17041 -32194 -35382 -38410 -19572 6548 13160 16037 -4511 -31914 -28008 -178 20708 39065
20519 39065 35844 20988 -6389 -10857 -8469 -17138 -24332 -53656 -64374 -63951 -36189 -23751 -7082
20506 -7082 -11948 -32237 -38529 -22769 9244 -9890 -16411 6370 6586 17383 38162 32691 26735
20493 26735 7318 -19274 -28979 1973 24033 5289 -15587 5385 -2088 -18785 -1907 29760
20481 29760 11079 -35403 -52673 -48672 -41686 -30124 -19302 -29828 -25309 -43766 -64828 -72080
20469 -72080 -57928 -57165 -60060 -53176 -39519 -21080 7444 15020 4165 4583 8083 17779 41811
20456 41811 40827 12476 -10397 -19255 -11085 -15634 -39376 -18065 -2260 -10012 5262 24552 5987
20443 5987 -5821 10340 16616 6355 9694 24514 11657 -12401 -12013 -21830 -22201 -18824 -25984 -33140
20429 -33140 -6629 11432 17060 -10406 -39325 -29520 -9070 6530 12041 14706 26558 -844
20417 -844 -20546 -3988 35422 9180 -8924 -1237 -22449 -52096 -41316 -14208 17509 19226
20405 19226 20558 44548 28989 11106 26479 25365 47231 35144 12744 4959 10678 23736
20393 23736 -28530 -33896 -16881 -5630 -6065 -21560 740 28536 26378 -3619 -10987 -11759 -6907
20380 -6907 19396 20958 2418 -22513 -25237 -17679 3540 26222 12982 -37878 -37888 -35428 -55481
20367 -55481 -52710 -44918 3283 1623 -28362 -19147 -1048 16192 19320 -22804 -45619 -47470 -21315
20354 -21315 -14368 -13636 1306 -5887 -12619 -7842 7424 35655 16002 -52 17687 15304 6470
20341 6470 2143 8366 35602 25363 13592 -26147 -16842 -31428 -33794 -20518 17074 6841 -3448
20328 -3448 -11259 -10371 -36223 -32656 3174 17594 18188 13240 16084 431 6009 24625 67960 56972
20314 56972 21690 14919 9791 18061 18509 -3797 -31541 -28791 -22215 -32379 -47852 -25338 4209
20301 4209 -8729 -7267 5183 -36209 -35686 -26063 -33969 -28336 -14903 -9962 9161 8459 -5325 12004
20287 12004 13172 18023 36712 14304 -6857 -27860 -23613 -17716 -12337 1878 10677 -12919 -6783
20274 -6783 3569 20996 23260 7862 4146 -3321 12991 9519 -20557 -14435 1847 -789 -11405
20261 -11405 8677 22090 9174 1781 -26021 -30830 5238 19544 1656 -32055 -54699 -81790
20249 -81790 -48684 7702 13057 14072 -14281 -38595 -20096 5348 1339 2154 17268 -9944 -40466
20236 -40466 -32778 -55124 -74510 -39871 8791 3532 627 10265 49024 67634 75532 23894 -20779
20223 -20779 12180 8222 -6759 -13567 -26236 -32203 -67559 -54802 -28485 12838 38061 51093
20211 51093 30437 -6177 -12906 10689 25833 16661 -17820 -25843 -43002 -33897 -13522 -29327
20199 -29327 -25948 10532 27260 21939 22364 40925 54598 51232 5311 -13554 -29087 -39433 -1855
20186 -1855 23408 17404 20630 9987 4876 -29256 -42531 -42169 -21158 17177 37658 42144 31127
20173 31127 37624 17818 20547 -1850 -24183 -6041 -4408 -23012 -19271 -17523 -23856 -63275 -58674
20160 -58674 -27178 -250 35020 29762 6114 -889 -1176 24091 2751 11649 35806 12422 19905
20147 19905 43728 45015 41406 -2508 31294 40076 32692 62492 83493 75596 41858 -25976 -21275
20134 -21275 -27097 -31105 -23218 -42786 -56722 -28832 -8711 5557 5961 -12744 5001 18385 -4437
20121 -4437 -24729 -2353 -19877 -8321 12258 372 -14726 -20584 -19262 -26149 -22124 -37700 -27417
20108 -27417 -11095 -12516 -38693 -26227 -16110 -26409 1411 36099 47487 26551 -9358 -12133
20096 -12133 -4117 9577 18094 -4020 -14312 11140 17018 2794 7700 -12307 8586 31713
20084 31713 43999 62859 56413 1638 -33829 -23853 -7071 -770 5720 20660 35048 30965 5384
20071 5384 4072 4712 6763 -8192 314 8538 -10224 -27962 -9193 11510 1333 -7895 -1639
20058 -1639 -18451 -21544 -7968 -7689 -3027 -1117 -16454 4676 -2070 -16630 -18052 -5307 19590
20045 19590 16489 18128 41201 39953 53390 38289 23190 51945 69651 30553 19340 44853
20033 44853 19692 -11286 -20327 9586 493 -10833 -21106 -37807 -29210 20103 56425 20796
20021 20796 69 -6376 3481 11341 20443 4693 18086 32372 23441 6773 14300 -7483 -33103
20008 -33103 -41618 -47250 -41782 -29424 -36225 -40724 -37630 -9565 20314 52668 17254 19916 10080
19995 10080 -27915 -46551 -58244 -42952 -16089 -11450 22404 29444 36359 28646 40935 26680
19983 26680 31787 47626 88005 135477 167237 184571 162217 133488 136160 169250 222949 276158
19971 276158 288943 318367 341457 330790 329703 332728 292212 254658 257427 293030 348604 408351
19959 408351 448333 480741 476691 452464 404195 341804 275709 215133 181857 189023 231275 272285
19947 272285 300525 279430 260318 225872 185635 149095 137968 122155 110631 85468 77391 83206
19935 83206 110969 105385 97544 104874 130930 157540 142375 108789 103241 116801 104576 79312
19923 79312 74050 123916 165851 182992 184415 178442 181486 186234 143105 133938 126046 104905 124281
19910 124281 127538 121093 80439 46938 47475 44598 52216 41752 32139 -3888 -48569 -26756 16620
19897 16620 56831 47162 30961 23226 32484 52645 32227 30079 32918 62872 89640 87915 43916
19884 43916 16319 8451 -5138 -13289 -12219 -17428 -29036 -18344 -27598 -20641 2456 28588 17318
19871 17318 6950 18943 -17377 -29048 -9403 2313 -27937 18941 45020 49585 60253 43044
19859 43044 38672 41639 49319 52248 49489 24259 12273 14322 7407 11663 -10276 561 2719
19846 2719 -2397 13238 21991 6055 2497 10626 -9302 -16375 -269 -2905 10548 3288 684
19833 684 24831 44175 39325 4788 -12080 -10642 -10668 11374 40715 20082 13977 39613 29933
19820 29933 12027 13315 3035 1594 8060 2286 19529 38726 23454 7040 -4799 15900
19808 15900 17669 1359 -8701 9366 5504 9943 28911 31009 4129 5632 -13267 -23825 2939
19795 2939 4688 -14596 -15347 -5438 775 20661 11781 9035 36993 23658 -12230 -9667 28682
19782 28682 -5557 -34774 -13076 10059 13594 -2027 14476 20293 12101 8025 30404 16636
19770 16636 1520 35076 54110 43037 25167 15207 54716 60270 42226 30622 15506 37167
19758 37167 29155 25370 32668 48972 47297 49644 33084 25869 -1659 -37182 -44786 7853 28710
19745 28710 10173 5744 -24928 -26170 -28496 -53600 -48777 -57373 -68197 -57205 -52690 -35645 2822
19732 2822 26776 19408 -22395 -23285 -11958 5651 1797 -21525 -11318 15180 7719 -25639 -24527
19719 -24527 36786 71926 80851 76259 81858 72182 50836 50076 45039 55425 49887 29298 14028
19706 14028 8101 -17181 -32540 19367 68772 64458 47066 19015 33240 50457 32554 54804
19694 54804 66832 46144 36084 71236 97948 104290 70309 37801 21375 22887 49019 76745
19682 76745 91725 118232 113416 120972 80818 61255 58402 82950 82144 69457 62968 62589 71042
19669 71042 69196 62367 53410 67014 68530 77188 82344 85562 80496 71395 65931 60261 70492 74156
19655 74156 61158 65274 89532 69200 54074 68576 111290 130684 102743 87031 66742 57211
19643 57211 57302 55352 50230 65744 85419 99603 86214 79484 65781 49469 54611 102509 136407
19630 136407 147355 120916 98447 81842 55812 53277 75570 80646 74237 99417 125626 153159
19618 153159 156903 212836 255907 281567 289666 283325 281117 294038 286323 280032 289952 262700 230441
19605 230441 244121 215883 164702 125314 101898 104210 80201 73404 87275 122582 104420 108769
19593 108769 130240 127359 140901 132765 124046 140251 122220 89613 76789 69143 102741 123054
19581 123054 121639 85099 69750 63729 82280 95737 127588 125014 110520 124814 107868 77661
19569 77661 42763 45557 66691 107964 139792 133072 130517 144550 160927 160869 154291 169124 180912
19556 180912 195174 248621 266728 252215 246104 213317 185364 165993 173934 191770 180045 148345
19544 148345 132010 145393 179147 158847 151825 146181 139658 141551 125245 141706 161648 172763
19532 172763 164954 208025 204566 203251 209312 169322 165826 160251 131979 128632 134004 136233 146542
19519 146542 178962 200248 208377 239630 264891 248296 284626 330923 350091 368755 409786 411753
19507 411753 395613 450478 521352 535976 533506 545453 527989 459620 399832 364715 360686 379543
19495 379543 344958 346614 408164 418839 377512 376250 371756 354865 362631 365473 369596 378739 388928
19482 388928 375586 346070 328239 368374 409263 441788 470878 495913 531054 562236 584558
19471 584558 579432 600476 642759 709896 778155 858704 969561 1095129 1256665 1396899 1544688
19460 1544688 1741055 2010286 2263904 2478346 2680307 2885436 3043078 3212501 3428963
19451 3428963 3683499 4054906 4554858 5176893 5998386 7138010 8631421 10697878 13714866
19442 13714866 18396268 26201361 39609423 59852567 84815380 103248056 97030511
19435 97030511 71591428 50365265 40219076 37910235 42348659 55280320 78281758
19428 78281758 109963325 136836371 130709018 93716558 59229879 39397188 28851017
19421 28851017 23443777 21638495 23042058 27662962 34881139 39594816 35724049 26265253
19413 26265253 18130699 12893675 9745126 7891612 6834192 6196550 5780945 5545024
19405 5545024 5468516 5568673 5768117 6048879 6685206 7962937 10182726 14129876 20777693
19396 20777693 29509169 34530395 30724087 22692769 16999206 14414250 14155726 16111889
19388 16111889 21062078 29775393 39684688 43411618 39913375 34889340 28637437 20854975
19380 20854975 14720525 11197578 9452651 9041068 9962865 12574319 16910515 20541992
19372 20541992 19246117 13916107 9175361 6354304 4637391 3440428 2694945 2263495
19364 2263495 1948837 1761881 1594813 1443978 1303481 1186914 1117405 1066914 1036573 961627
19354 961627 868937 797128 784747 757420 745810 723139 665616 615930 562493 511912 455231
19343 455231 419155 401517 404340 395089 370646 333558 324632 339674 355195 360438 357872 355130 363682
19330 363682 358856 343753 303299 272971 275911 269009 239552 214402 189733 203973 235562 253111
19318 253111 230975 214126 201729 198771 195597 226077 241015 230892 231236 247532 343109 488042
19306 488042 623301 717415 610672 429280 354432 322954 270971 251503 247329 224644 229038
19295 229038 257370 283788 295214 306324 290991 237683 167622 130946 151414 162113 151095
19284 151095 124429 101178 106951 135773 151227 143626 118410 86220 99882 130374 127147 113794
19272 113794 84998 89352 104852 99632 92115 99220 122456 144507 124882 91687 94580 106358
19260 106358 82704 70311 49157 27971 27076 47850 51570 68235 99079 111786 125271 119426
19248 119426 137961 138608 125747 121512 112103 80672 83808 95820 84029 60198 69147 69221 57013
19235 57013 49742 58568 70247 77604 88123 100761 108947 65279 37092 36665 71109 81748 75474
19222 75474 34806 11901 29452 70270 70265 62619 72914 87009 73337 35751 15431 28538 73885
19209 73885 88822 128978 124112 108336 104963 94737 95069 70101 37113 79880 120272 126706 91807
19196 91807 60748 76645 80919 62864 69137 105397 111480 126924 141558 130330 123419 150506
19184 150506 185044 202884 236014 300279 357408 391721 374917 328346 261671 230128 214400
19173 214400 205701 205297 225843 289683 359755 421529 436016 394567 335509 265030 228167 188738
19161 188738 152060 159103 141320 128929 150824 165927 146222 161918 145579 131917 107977 74198
19149 74198 66504 81512 99672 128010 163083 149674 128748 123239 118394 115898 126655 122926 116037
19136 116037 110850 98671 96947 98351 104948 110564 99620 84229 94542 84898 95889 101978 107846
19123 107846 103322 113797 138124 165503 142964 137880 152679 202555 201638 178896 149338 99390
19111 99390 81649 99257 113527 84127 60130 73782 57520 64241 80332 60979 66553 47523
19099 47523 39935 39525 27401 16734 17563 58786 78319 84045 66470 59240 78811 76920 77856 84489
19085 84489 91094 85565 87432 103528 101538 97055 101992 119742 133599 131086 136619 142800 169552
19072 169552 203412 228994 231557 226969 210581 188757 173910 192797 186836 154023 154631 130793
19060 130793 96402 54619 53761 57482 72706 78344 94842 140188 169218 191944 185250 175385 142661
19047 142661 147622 156503 181947 188348 202565 241963 253341 251696 220544 205717 207611 217018 224515
19034 224515 252236 266538 259375 292810 323142 343650 369689 368813 349803 332762 358649 408383
19022 408383 468772 524803 583656 638246 694101 739056 816272 880581 919228 1014857 1136963
19011 1136963 1320828 1641913 2130435 2880569 4103092 6125435 9100960 11735910 11544965
19002 11544965 8891275 6627374 5707956 5797804 6855024 9235503 13702757 20340833
18994 20340833 25305035 23177111 16296055 10746531 7801513 6436009 6115259 6863098
18986 6863098 8933784 12434145 15751484 15368768 11387677 7572997 5291671 3999158
18978 3999158 3248697 2761826 2525018 2428453 2310074 2216905 2174935 2218515 2287204 2360187
18968 2360187 2478311 2644135 2832134 3059702 3361125 3772182 4350162 5239189 6603977
18959 6603977 8787789 12467503 18761772 28612118 39027913 41281335 33448379 24364739
18951 24364739 19458442 18262462 20090824 25641611 36595335 53632250 69473249 69349236
18943 69349236 52861689 35472616 24893788 19425136 17066961 17308852 20426928 26672952
18935 26672952 33773256 34822164 27576372 18731494 12836450 9493458 7580090 6498636
18927 6498636 5959857 5705655 5631472 5762928 6164898 6958689 8192232 10220377 13879825
18918 13879825 20296936 30238859 41684826 50687416 52759303 44432248 30981501 20866109
18910 20866109 15032633 11815857 10304655 10297866 12002646 15821240 20987932 23203589
18902 23203589 19383112 13237126 8886089 6371601 4904682 4033031 3467603 3097560
18894 3097560 2898903 2842197 2901079 2972142 2985233 2856081 2700084 2583111 2502273 2449617
18884 2449617 2470480 2602265 2794033 3081132 3456570 3890674 4434495 5241920 6708664
18875 6708664 9254694 13229448 17867403 19973029 18100522 15240624 14303573 15799241
18867 15799241 19456686 24405147 29646043 34277000 39452513 43545443 41399333 34714653
18859 34714653 27360742 19879721 14211635 11340590 10644239 10789394 9843395 7488653
18851 7488653 5313735 3969775 3202950 2723264 2367378 2151095 1971695 1803052 1737537
18842 1737537 1712984 1665642 1610669 1583046 1587975 1555786 1505371 1457581 1416435 1395988 1375021
18831 1375021 1389960 1476175 1639775 2001118 2608853 3678333 5314992 7117191 7673722
18822 7673722 6482690 4901505 3956212 3568900 3646665 4215155 5535552 8001162 11917321
18813 11917321 15981026 17063371 15049399 11914605 8348213 5376902 3581079 2530708
18805 2530708 1906579 1500112 1250563 1082809 939918 821760 730741 660651 596919 543791
18795 543791 516555 495062 443209 413404 443185 406608 405899 417989 392218 401675 398902 408832
18783 408832 391396 346899 305417 276722 297954 291312 257744 217001 188999 157110 158612 187598
18771 187598 232320 254406 292738 365665 467430 564730 555785 434762 338839 292998 254652
18760 254652 213682 187980 166943 173555 163781 148509 159772 167463 151471 122211 111714 87173
18748 87173 103607 105554 107494 79113 61349 73822 93809 96949 132787 128850 114714 113911 89031
18735 89031 93757 84944 93470 116749 142197 162037 165279 125529 99934 116454 119980 133114 166127
18722 166127 204613 223264 240879 251520 219250 150026 138245 129714 114252 143882 142642 174584
18710 174584 191322 202241 237851 295539 289974 238370 231182 220802 203842 179964 138526 88237
18698 88237 45445 69646 86318 93512 99710 93788 71726 84917 99008 120803 129767 128615 157057
18685 157057 182712 217770 219105 204602 171971 174377 194612 164984 145498 137099 138912 155784
18673 155784 149178 127106 109421 93176 111130 146959 204735 182631 162832 156080 125704 130160
18661 130160 158261 194878 209513 236818 248092 248372 267786 267133 271981 255232 243468 244070 242738
18648 242738 225775 242675 249921 259312 289002 331627 356567 353947 338306 330788 361787 398044
18636 398044 425253 471203 516707 581798 631669 672158 684125 762909 843609 924427 990485
18625 990485 1026167 1017512 1024851 1090938 1181851 1298567 1416037 1466407 1535354 1609767 1767266
18614 1767266 1925433 2081416 2211456 2351983 2576414 2869240 3111064 3314846 3568380
18605 3568380 3968804 4545714 5370260 6544186 8175600 10459214 13768368 18868938 27050671
18596 27050671 39829231 57604276 74999859 80216436 68870889 51010658 36864996
18589 36864996 28334397 24043494 22858471 24513885 29529223 39168120 54382276 72201614
18581 72201614 82034898 74775197 56154635 38446571 26258700 18543626 13635943 10482797
18573 10482797 8376934 6902883 5842135 5071386 4481045 4051884 3673792 3333851 2978961
18564 2978961 2629855 2348852 2149273 2015120 1976247 1930584 1770277 1633258 1538605 1453189
18554 1453189 1396451 1343836 1289425 1216516 1148178 1128368 1121745 1126328 1098822 997344 859378
18543 859378 776052 741431 770546 770726 724534 640826 557981 526318 486462 450820 418131 371759
18531 371759 331297 311147 323098 331620 326917 315496 307667 330575 346532 334367 322887 351913
18519 351913 380065 372741 360407 327392 291548 274238 281647 276286 266567 265230 250238 235148
18507 235148 228791 238881 235528 249497 259461 259495 241836 214024 186722 201276 183463 140666 113203
18494 113203 107954 110139 123618 114230 128250 148680 172146 165211 156984 160046 155140 178845 174399
18481 174399 149498 146546 137525 136369 143092 174872 194667 154997 122820 139517 153513 171613
18469 171613 252315 319764 346114 310987 225866 170333 166252 178947 167545 158726 190895 195669
18457 195669 164935 154776 150391 121976 120245 130044 114423 129050 155226 147319 107619 71037
18445 71037 73501 101199 89606 80541 76435 77403 63374 18725 23584 53123 40640 18850 48141
18432 48141 45017 43705 73280 87535 99765 158733 153203 126303 102633 102569 126272 199424 210552
18419 210552 164544 174460 180272 159369 121140 127556 133997 167899 208246 193313 159568 148824
18407 148824 118985 82209 78111 61813 82446 136761 159325 141337 153006 170215 178370 156087
18395 156087 162209 173269 180603 220308 240733 224261 188919 150373 144686 177330 200499 217852
18383 217852 214437 196729 193017 168012 159787 136595 123132 120498 129077 123221 101284 88684 86252
18370 86252 62111 58983 65263 84308 101972 100089 89541 91086 93315 102573 93243 82224 69613
18357 69613 68717 66424 94149 104206 96665 96133 95727 107540 125571 157313 208500 306622 334082
18344 334082 304522 269989 286331 272113 277959 283295 304819 313566 304919 259631 220359 217633
18332 217633 236662 237217 207797 130840 97817 106932 103614 101410 80994 71283 68635 60273 68125
18319 68125 84925 84069 62531 60186 71138 60343 84369 105448 113752 102951 130693 143739
18307 143739 139479 132866 144645 167003 177363 184992 180623 180395 179712 186859 155390 125321 121691
18294 121691 81252 71190 57643 88629 104086 132962 166399 157995 137584 130380 124311 136150
18282 136150 125132 79379 79536 54476 38405 49161 36096 35029 22802 27225 35518 65669
18270 65669 62583 8574 9349 13711 41747 36718 31908 28594 15309 22203 40290 47066 41346 36264
18256 36264 34117 53994 74976 56788 52916 26364 39008 52954 44453 34839 69925 50712
18244 50712 12806 -2313 -304 -26066 -13613 38421 54871 63967 82284 104702 132384 143660
18232 143660 116438 89450 45929 17981 8935 33755 36542 5306 -665 -18637 -18815 -11268 25251
18219 25251 41043 34688 17421 17671 23588 13847 60232 55948 33087 -15897 -20520 5780 -288
18206 -288 9602 53124 43393 36309 64818 54018 50864 19362 -4773 -10533 -3776 22227 29095
18193 29095 36244 53354 40562 34718 -14724 -42526 -38169 -4693 36456 34266 44290 47495 37941
18180 37941 74434 90338 118273 115142 115906 99277 92004 131304 116725 108650 95470 84844 73328
18167 73328 60362 78847 94381 78458 70685 73005 71720 88032 93330 105528 106501 121162 111011
18154 111011 101328 73966 49994 38545 62809 80824 101116 112443 136958 157112 162216 158650
18142 158650 154190 152060 182614 159701 152863 162869 220622 277461 269744 287865 329664 364262
18130 364262 420583 459780 497193 561743 610416 641400 686030 770373 865875 988830 1142925
18119 1142925 1360374 1689225 2111483 2698227 3525887 4717363 6526032 9579217 15409378
18110 15409378 26722640 46800634 69939095 71786816 49038420 27406197 16028504
18103 16028504 10165828 6859753 4926611 3780804 3032885 2514568 2114736 1818194 1571244
18094 1571244 1315264 1085688 890464 722327 625277 555666 512471 485028 446773 417756
18084 417756 368564 295585 275989 282356 247807 213926 224817 240553 241221 256343 244003 208705
18072 208705 175857 163233 131318 118605 147061 138750 97479 112080 116631 100324 106927 80984
18060 80984 56183 50702 52374 61048 70736 79369 79001 65185 70774 114817 137230 137778 123407 101199
18046 101199 56788 39596 23048 10368 12920 27960 47355 45505 51168 84068 165900 237891
18034 237891 274284 312627 277649 238328 196682 138599 102623 118047 131344 129533 126955 121724
18022 121724 124229 143299 135158 107965 100628 84299 60718 68336 52043 41704 9260 -11138
18010 -11138 12649 22374 42995 48142 87784 109750 84235 80559 148043 260417 369146 403797
17998 403797 360605 272853 231413 190859 178381 196875 207042 247567 291856 347554 410204
17987 410204 459656 476491 400526 306049 243743 194092 209345 236033 301863 285668 271877
17976 271877 274888 204151 175955 151326 125828 106262 90503 60243 57558 26979 13517 -11455
17964 -11455 -5065 33476 35940 51249 36771 27661 8305 -2323 -17329 -27876 -21908 -34566
17952 -34566 -30969 -271 -8635 -29665 -15438 -11809 -20854 18579 44487 28732 25173 -1843 11587
17939 11587 22923 15533 9184 12244 10169 25755 34290 10589 -15709 -19503 9368 36182 27341
17926 27341 19064 24856 24310 34182 52220 56732 47669 28588 30644 41706 28850 32217 41834 32756
17912 32756 23384 -27415 -10058 -12738 271 5881 6683 11422 -3607 -6910 -14593 -37612 -32984
17899 -32984 -11211 -9668 6741 -3066 8456 29141 3848 -16151 -2224 -8072 -16378 4050
17887 4050 1856 4279 5049 7668 18571 29876 30525 12620 -20652 -11698 -4380 -4180 -19114 -34038
17873 -34038 -25869 -34774 -23626 -13525 -5363 -22799 -34292 -22096 9224 5251 -2716 413 -5435
17860 -5435 -15756 -16617 1994 23582 15679 -26704 -36704 -18453 7197 -4075 -23581 -29200 3712
17847 3712 32254 62962 64598 62420 46928 21728 -10133 -16848 -14142 -19289 -46163 -61593 -51987
17834 -51987 -39658 -30550 -34007 -19573 14079 58550 78128 78998 37013 24258 21063 20421 -5096
17821 -5096 -12729 -4591 12491 14990 25345 28429 33967 32040 20917 -12206 -28720 -28568 -9494
17808 -9494 -2038 -8410 -11364 -24651 -54980 -42287 1113 33939 12097 689 26134 27504 3204
17795 3204 6428 15237 16375 39372 37886 23502 9864 -11479 -29184 -36417 -48154 -33381 -655
17782 -655 -21845 -38576 -43584 -48722 -43888 -64780 -47880 -23312 -9913 -9600 18605 50130 39120
17769 39120 36198 34129 38638 32805 20083 38087 57740 43011 35271 5602 17195 11509 24778
17756 24778 41943 21706 -4487 -11958 -22519 -8768 9173 16712 -2676 -47066 -70419 -37473
17744 -37473 -30661 -22501 15173 5398 -8237 8019 14540 5520 -16625 -5707 12618 -1965 -17293
17731 -17293 -33635 -42157 -34615 -21341 -2009 27512 28079 6872 -16999 -31408 -32740 -32683 -30343
17718 -30343 -27547 -25144 -9248 -15632 -71731 -72014 -36288 -3929 21206 30475 30433 28807 51253 31074
17704 31074 20305 22689 29871 25418 21012 17531 25710 13993 7139 10949 13878 7540 14048 21322
17690 21322 5516 -21607 -29636 -13354 -10365 -28027 -19963 -3742 -29180 -26807 7146 11848 -2753
17677 -2753 17548 15815 9831 12046 -8659 -23157 -20963 -25961 22575 45555 41998 6085 7303
17664 7303 28306 44899 53160 38623 25798 17184 37743 19174 -18926 2400 4149 -35067
17652 -35067 -46880 -42081 -11389 6723 -12383 -34972 -20324 -21303 -19924 -6692 -7012 -4605 -4295
17639 -4295 -24189 4117 -6695 -26993 -35472 -20131 -20401 8438 21333 34816 56172 28404
17627 28404 6535 2189 -15271 -24032 -2706 -1433 6161 -6839 -47562 -84089 -79525 -55684 -40834
17614 -40834 -42738 -39073 -52244 -66478 -43371 -21338 -14281 -23523 -17187 -1182 -4308 -11675 -7214
17601 -7214 14625 31684 -13141 1941 33090 61693 49678 27466 9854 9325 20293 -21502
17589 -21502 -47634 -19875 -25672 -42200 -45876 -18912 -36191 -39930 -17034 632 -2209 1656 -5403
17576 -5403 -8826 -15197 -29770 -20665 -18783 -19868 40 -13818 3521 -6366 -355 -26709 -40260
17563 -40260 -45525 -21596 -15422 2368 6696 26599 35976 32148 -4017 -5210 12144 19381 1187
17550 1187 -17363 -31638 -29367 -15552 -45585 -38546 -38307 -44042 -14466 27018 19942 -8633 -6431
17537 -6431 16821 40763 49350 49101 39459 23676 25136 18629 8753 -12024 -36465 -9994 -2572
17524 -2572 5455 7792 42347 58499 39738 17577 24361 17889 4510 -12775 -6273 -18366 -18148
17511 -18148 -29449 -40147 -41393 -49289 -30644 -34502 -27277 -42376 -3402 44549 58538 58584 42647
17498 42647 29342 -7041 -5125 -11826 -61 12329 13215 -21091 -23527 -39755 -30961 8141 -2544
17485 -2544 -16409 -13909 -21013 -14737 -3010 21529 24863 27466 58398 67935 62015 36580 20388
17472 20388 -203 526 13762 3406 8800 20651 17078 17475 26662 17182 13233 -7331 -19381
17459 -19381 -7367 18825 18845 31721 49670 63446 45428 18090 -3781 5451 280 -2654 20875
17446 20875 38686 46518 57932 122934 248605 353157 305354 183644 78521 14955 7735
17435 7735 1961 29189 27279 17588 23492 27204 69297 66583 39519 -4404 -18202 6981 -2526
17422 -2526 -20325 -42606 -71217 -75165 -50578 -21725 -1837 -11853 -36631 -33002 -28106 -35678 -47450
17409 -47450 -44830 -25910 -17586 -15308 -13369 -29680 -9767 37901 12884 -11154 -18903 -39627 -20552
17396 -20552 -3064 -5082 10403 5451 -12752 -27924 -18328 -4707 -23999 -24978 -33368 -27845 13903
17383 13903 36361 20757 -12016 -4621 -1049 3682 17730 38691 3149 13674 22234 18437 10595
17370 10595 14600 2547 -13907 -12384 19386 26127 48338 89595 115949 200985 310512 443446
17358 443446 501314 418424 272009 183266 145848 110635 87114 91480 132632 171028 236952
17347 236952 333770 391670 352646 272165 187727 117949 57481 16299 -9494 -2358 19633 27299
17335 27299 45898 58191 47124 17996 -37095 -74285 -61703 -34236 -27061 -49280 -21331 4247
17323 4247 -5124 -15536 -14975 23621 17341 -36332 -82271 -82978 -90977 -79784 -50603 -18727 -36431
17310 -36431 -61860 -44656 -8232 -47664 -59466 -43184 -18999 -5530 -8779 2095 -6107 7116
17298 7116 18842 1489 732 25337 1619 -4724 -11623 -23988 -32010 -6211 -335 -19109 -43569
17285 -43569 -49480 -73808 -80042 -22193 5908 6621 30096 58464 35361 12029 15370 -10582 -38223
17272 -38223 -49323 -41897 -11798 -830 30888 32265 -14202 -1483 -15283 -22488 -14526 -22954 -25834
17259 -25834 -3069 -13313 -16445 4055 127 883 17644 12785 1339 -37764 -38354 6383 19609
17246 19609 20198 16717 31012 35738 3441 16183 10770 3870 -3837 -5315 1178 -13611 -5435 -17151
17232 -17151 8744 45233 30629 -3526 -14179 -45598 -77315 -43460 -17045 -11239 -24354 -36922
17220 -36922 -14255 37094 34136 -9361 -38060 -58979 -17531 3765 -5420 12491 30361 24670
17208 24670 6951 1807 16867 18088 15375 4579 21544 18476 22345 25380 26990 -13780 -26118
17195 -26118 -4181 2644 -23829 -10497 -9219 12554 40418 30679 45683 19119 312 -9697
17183 -9697 -12522 -19890 -22718 5557 1134 -17350 14361 57579 63756 22406 -3636 -8102 -2861
17170 -2861 -443 -2267 12225 15855 17378 31437 9372 -13975 6545 -20659 -26290 -25951 -17993
17157 -17993 -34509 -3614 35939 55984 22792 17787 19202 10271 -15512 -26207 -20189 -27735 -151
17144 -151 45496 38295 27411 34218 -2199 -22263 -26611 -32571 -13276 676 -1984 -22142 -39184
17131 -39184 -16116 3877 19892 25635 23292 21342 -2019 -22597 -36886 3510 19631 30495
17119 30495 23198 6089 12507 29229 47879 44116 25961 7777 46412 84657 98991 109388
17107 109388 65478 54229 59102 47906 26641 -14055 19906 54868 33590 41949 69196 84947
17095 84947 97993 90082 68509 59017 60740 60934 40796 34135 27518 7084 1404 2888 -5379 -18940
17081 -18940 -30427 -39431 -7260 2190 9858 12151 -18097 -42124 -46612 -288 -27610 -36136 -26361
17068 -26361 -64739 -52022 -20750 -17138 -5249 -1844 -43103 -20635 -17816 -12660 7971 47558
17056 47558 91417 93467 71207 28901 17311 -1655 -2761 19371 35360 20129 27399 76072
17044 76072 102009 79199 66844 59786 56257 57662 60333 23783 -4480 18018 24058 -2918 -2987
17031 -2987 -4396 1962 -4913 22861 42589 12909 -35306 -32589 -23148 -17264 -13058 -302 22562
17018 22562 37575 54603 47272 17625 -2686 -4011 -13491 8538 37137 44550 64166 46455
17006 46455 45946 52515 50173 82485 73514 31370 16518 -7376 -9560 -3044 15794 13795 -1274
16993 -1274 10724 42436 51696 47684 -4357 -20851 -19258 593 -17338 -50430 -51428 -26865 13689
16980 13689 28341 22199 5837 -32478 -30003 -2733 19473 33258 49590 20534 -35934 -94794
16968 -94794 -74051 -54094 -25785 -20926 1557 7274 4929 31461 39232 11377 -17508 -28651
16956 -28651 -1333 47513 53140 44366 -1029 -34067 -36029 -15199 -6631 -3390 -908 15484 9387
16943 9387 -3857 8173 12459 16132 -1326 1204 20473 29218 25403 14685 17524 33094 51585
16930 51585 102921 124526 83093 39621 30620 31083 37872 54766 57950 61263 86375 84932 77710
16917 77710 122705 147945 138958 88810 63651 59162 36411 40189 42844 24009 16688 43162 58990
16904 58990 57390 23279 6407 -6435 -17951 9418 47951 83459 61701 38371 20208 -2572
16892 -2572 2139 13423 3122 35139 44107 21850 9226 43154 56365 48182 24042 1125
16880 1125 20075 33378 29715 34084 55409 83384 96274 93080 100424 115934 90196 69587 38358
16867 38358 19492 23593 56711 60249 65595 78875 69025 70332 72497 95400 126779 147065 155425
16854 155425 162199 155680 138753 139568 164520 177570 180533 179551 222033 208729 215603 249933 270106
16841 270106 285643 338577 364542 408119 435927 459139 463694 498501 518857 548990 628661 762635
16829 762635 924531 1117579 1299364 1368009 1353490 1297034 1327560 1453343 1632299 1927068
16819 1927068 2251617 2517412 2749201 3017134 3338386 3707604 4153681 4850785 5881105
16810 5881105 7430841 9741054 13247412 18969062 28833464 45478089 69936212 92010013
16802 92010013 92133120 70208222 46629584 31827634 24011907 20427726 19935001 22404849
16794 22404849 28864159 41438981 62157540 85964157 94397426 77549143 51540260
16787 51540260 32604688 21581494 15102269 11048770 8434784 6735940 5563080 4666727
16779 4666727 4035452 3576838 3260245 3090009 2944015 2735156 2453129 2154627 1887020
16770 1887020 1634275 1453169 1326072 1226750 1185585 1202861 1257748 1280361 1176595 1018539
16760 1018539 887853 764582 681590 613898 567072 505876 483597 466902 438723 405846 392996
16749 392996 384793 389255 386082 395189 370962 348076 310737 272931 246667 251356 284257 291668 264323
16736 264323 250139 225998 223333 210197 226472 203792 202084 199547 183571 170432 168444 151990
16724 151990 132911 142381 181377 180728 170897 148653 125535 121008 123378 130485 143618 110839 103826
16711 103826 112739 125736 129651 94906 74222 94909 107319 116173 110503 108134 116529 136467 127153
16698 127153 131513 131607 115902 127791 126696 114240 83120 80752 69033 48494 54834 38863 35912
16685 35912 33443 37943 52697 107321 140379 126376 127169 110194 98174 112690 103621 91478 63724
16672 63724 43518 28495 13225 38659 50220 72735 82540 89624 88572 68134 52747 59062
16660 59062 70566 101285 126139 109588 104272 95280 91228 106735 105932 76367 54496 72504 93722
16647 93722 72414 70014 63352 60211 74268 51364 22890 -772 -1900 5258 20543 47038 51502
16634 51502 52913 55443 42857 40310 47163 37946 26517 28870 35931 30162 26077 76983 122065
16621 122065 131731 112939 62785 60311 81517 113289 104352 86475 78852 83781 116681 147565
16609 147565 110853 85235 79488 56012 49700 32613 35956 27982 2793 -20229 -11259 -7158 23939
16596 23939 -3022 -34767 -9746 -6401 -1374 12578 31224 15162 -20544 -50343 -47464 -9244
16584 -9244 4619 5371 -27548 -37899 2442 28703 26476 3153 -2431 -4084 -3159 18399 32223
16571 32223 49196 58019 50516 16321 11403 19331 2353 6216 39365 19758 -21163 -17999 -7162
16558 -7162 -765 25427 54759 55942 60901 20184 17338 66705 76052 56648 7074 14530 2403
16545 2403 -6403 39050 58661 37055 628 -15487 -16195 -33803 -22524 -9172 -5518 3188 11578
16532 11578 7352 -19725 -26480 -32322 -33344 -39758 -11800 -10765 17967 15953 16104 19271 -14929 -21953
16518 -21953 -30922 -47406 -45788 -25833 5809 5345 -780 -9944 -14876 2805 15838 33491 5354
16505 5354 13119 18906 -14659 -29167 -19348 -17334 -24336 -38942 -41178 -20090 -8364 -5598 23415
16492 23415 33908 5152 13638 -4168 -10841 2779 19509 40206 43782 39561 36587 37326 60320
16479 60320 44217 -11130 -46182 -11665 8207 15781 38620 38622 15307 826 -5224 -28349 -18836
16466 -18836 -12797 -692 24826 13764 13406 36405 56911 7466 -6057 -8533 -6777 22079 13102
16453 13102 28224 61206 52424 67468 61576 59938 47452 31237 12338 7758 -20644 -29090 9887
16440 9887 46165 34604 16186 29513 32840 13321 -6184 13869 10824 -14715 -44702 -29323
16428 -29323 -12199 -4128 14037 7552 -4781 -10515 -26069 -57384 -34090 7372 7840 22396 30558
16415 30558 33301 6672 -9987 -37275 -61231 -49221 -7981 14861 32528 24205 40089 22831
16403 22831 -397 29 -27475 -46389 -40292 -22255 -14048 -36076 -15939 33031 58681 41682
16391 41682 30640 -4763 -10978 3913 126 -11152 -26825 -10650 -2419 -39317 -59438 -56536
16379 -56536 -40894 -34056 -32911 10357 48391 3540 3152 5724 16194 -7681 -21562 -920 16468
16366 16468 34304 26969 8836 15300 10748 29347 11125 -11068 -17207 5828 24508 42828
16354 42828 31309 38302 37541 18442 4417 8857 12214 17753 36256 23940 32583 18558 25720
16341 25720 33229 24771 30938 42245 37163 8146 -13367 -15548 -45571 -50408 -49573 -19722 11190
16328 11190 20586 26253 27246 16126 -11453 3310 42891 44131 -6971 -17856 14977 10368 34921
16315 34921 19455 16925 55474 41003 52 -28354 -927 -1569 3790 7002 25111 46280 30404
16302 30404 -12940 -18076 -33342 -37623 -10469 5060 -10328 -18333 -28727 -19935 -9370 -6711 -25952
16289 -25952 -12707 11849 37694 56882 82879 54414 19829 9968 26494 27972 7714 -21331
16277 -21331 -22618 -20319 -26857 -12218 18023 36903 57915 46421 43597 24788 -10193 -14212 -6552
16264 -6552 -15557 -4315 -2257 11016 49367 52632 36158 18103 8748 20578 -8896 -38608 -12385
16251 -12385 -7822 20976 50927 80008 118447 110523 111075 182855 269818 376330 448185 453912
16239 453912 381589 301142 204951 137308 102003 84410 101782 143945 197702 295511 376909
16228 376909 424035 355368 252625 151333 74713 61812 61420 51867 40235 28282 16466 16887
16216 16887 29396 27078 45293 53645 17234 -28595 -37943 -22524 17720 41550 79284 54016
16204 54016 26791 30365 46332 34512 -20621 -61720 -40744 -9643 -29650 -57456 -45400 -4203
16192 -4203 23473 11073 10787 16976 2993 -13175 -30754 -37413 -22169 -3108 -8767 -18505 -11523
16179 -11523 -15555 -10844 19309 20674 43579 59241 62422 53443 9722 -26935 -36421 -2872 25059
16166 25059 30415 18988 733 34843 54465 26834 24163 1471 -21044 -5840 -13010 15070
16154 15070 28566 25744 17653 11506 33775 70401 96227 40502 3378 4592 24023 4097
16142 4097 1328 1909 -12182 -25058 -44287 -59622 -43162 -30797 -33203 -42691 -49258 -41301 -21888
16129 -21888 -30884 -26259 -30537 -37188 -17611 -19223 -31095 -4463 -23073 -35318 -15282 15678 36637
16116 36637 21632 -4504 34690 41618 42956 9487 -30448 -35192 -32926 9896 33299 22305
16104 22305 4737 2241 20049 24078 27873 25111 25593 23041 36517 69267 55010 30336 -16918
16091 -16918 -33024 -40737 -43825 -42857 -26814 -3999 -10921 -27706 7256 11064 -10843 -1464 26803
16078 26803 24115 27451 15757 -26557 -13895 25068 37841 38982 38060 11460 -23783 -44079 -71065
16065 -71065 -46304 -4546 18842 20482 -5418 -44070 -59595 -62105 -32742 -40875 -53749 -63755
16053 -63755 -63735 -67271 -59223 -37964 -46423 -37429 -32838 -46795 -29343 -18523 -23775 -15951 6960 28556
16039 28556 31585 24216 5918 -26837 -33570 1107 -3584 -9166 -29005 -21433 6260 9251 665
16026 665 -1020 11225 260 -4778 6485 16037 12510 33413 28441 44218 51771 31992 27289
16013 27289 44837 24780 16386 29244 41149 13092 10666 2492 3670 27157 34755 13337 -8835
16000 -8835 -34445 -62902 -49724 -30030 -13789 -15269 -41122 -38208 -32399 -32011 -21801 1277 -17071
15987 -17071 -32003 -42103 -33134 -19078 -13385 -10579 -24485 -37284 -26859 -35955 -8817 22233
15975 22233 4576 -8349 -8308 -6856 -6200 2126 -8606 -20135 -4654 988 3719 21219 39582
15962 39582 23201 10772 -5701 -36537 -7969 -19485 -10652 6747 -14374 -45499 -62018 -69932
15950 -69932 -65457 -53520 -61207 -59405 -44655 -7950 17806 26132 16805 17077 32572 52153 39636
15937 39636 15128 -3386 -7616 18426 29456 18017 31836 38436 30277 14622 8640 18916
15925 18916 28307 12688 -11243 -3464 27251 153 10886 12272 965 -19414 -25295 -45740
15913 -45740 -3066 20047 5823 -46884 -54659 -18816 19865 1089 -51477 -53331 -50124 -31724
15901 -31724 -60164 -70660 -55418 -20608 17840 -12052 -22806 -12525 31636 36485 -1498 -37050
15889 -37050 -53014 -40493 -8517 9116 2635 -6790 -25661 -40672 -28384 -35229 -50986 -39346
15877 -39346 -22960 -33990 -35406 -32813 -34401 217 7204 -3982 -24546 -42821 -42476 -10301 5432
15864 5432 37911 38439 20164 15564 8710 -4297 -2168 -14878 -40872 -36327 -10978 -7625 16757
15851 16757 19990 -14350 -3946 -44 12022 30465 29147 9121 9974 18602 24095 3952 -20927
15838 -20927 -55556 -34221 -23083 -45340 -62534 -58254 -47115 -38661 -50623 -53915 -35455 -10309
15826 -10309 6929 2193 8789 13965 11457 -7865 9932 19734 29347 12835 -19782 -12992 -9223
15813 -9223 591 -7067 -9958 -7133 17210 45092 58931 57235 31505 38254 26727 152 5388
15800 5388 7547 3642 20079 -8511 -15502 -11766 2635 -6812 -18092 -31710 -29286 -5993 2438
15787 2438 -5491 16607 34667 30909 15036 19500 22696 34485 20438 8406 -29615 -40519 -7162
15774 -7162 85 40576 75478 66857 78466 82584 51845 7062 23180 11356 19170 33131 17956
15761 17956 -3701 -14134 4436 -3559 -12904 -2629 -20595 -38386 -38234 -24230 -40255 -61320
15749 -61320 -28801 -38949 -47227 -33910 -26916 -15377 -7506 7104 -6336 10 10174 7821 -329
15736 -329 14270 25284 27479 26975 22336 39367 21249 -10052 -32564 -46446 -40730 -29330 -33235
15723 -33235 -31609 -26090 -21724 19477 15783 -12936 -53964 -61849 -36927 -28967 17996 -3020 -57713
15710 -57713 -76404 -67568 -49270 -57215 -34369 -5400 11703 17737 52230 62780 21041 8910
15698 8910 4524 -30927 -28874 -58307 -56986 -11550 -5400 -33747 -19038 -8211 12305 35585 36742
15685 36742 30072 18403 24702 24394 26330 19067 9632 12971 18584 15331 23637 4012 -28728 -27482
15671 -27482 -18938 -1923 4510 19185 19412 15140 -2553 -17623 -19891 -12505 -13854 2836 7317
15658 7317 15936 22445 -11357 -42139 -36540 -22132 -9647 1712 4792 7575 -25385 -53654 -56640
15645 -56640 -30448 5402 9571 8534 -10810 -23957 -33376 21689 22032 -15463 -14622 -3007 -31360
15632 -31360 -33673 -11854 10873 -3707 -18964 -27222 -9418 -3637 -29596 -29451 -54462 -56293 -15340
15619 -15340 -6691 21312 35411 17494 -9583 -18101 -16897 -10694 -21490 -10627 10937 12941 36013
15606 36013 46374 26945 -2307 -17940 -9613 2369 10622 -258 17119 14561 3549 2870 4949
15593 4949 35583 11621 -10727 -12106 5839 33992 57217 16915 17585 -1269 -14318 5822
15581 5822 32435 31888 14039 20060 38093 52513 52157 35282 29074 25100 12250 -7421 -19918
15568 -19918 -33697 -30902 -17409 -31923 -64931 -72132 -64469 -7300 43632 48094 2431 -11082
15556 -11082 -220 12874 -9245 -2825 3690 44346 60387 28235 -14488 -26724 -8228 -3353
15544 -3353 -37465 -15845 -26690 -28979 -17532 -15078 -26031 -48540 -42170 -49756 -31484 -11636 -12938
15531 -12938 12042 37284 53312 29082 -14731 2409 35618 27885 -3329 -3663 3783 -4931 -26266
15518 -26266 -32759 -29359 -55511 -59441 -42949 -49 27440 4667 3943 -3021 -14401 -2861 15289
15505 15289 35573 15410 9793 -8962 -10025 5328 22682 11800 -7948 600 18900 -817
15493 -817 5629 761 2740 -13929 -36568 -26100 -25028 -21724 -17459 -20506 -44402 -46538 -5712 -13719
15479 -13719 -27516 -95 30630 307 -13804 -6706 13702 14571 -14046 -57665 -75806 -63829
15467 -63829 -17405 7080 -3062 -32414 -32889 -23289 -18819 -50274 -51544 -34897 -10348 5398 14284
15454 14284 24508 -4161 -17791 -9801 -13855 -20014 -12667 6358 -3643 15568 14133 -5276 -11793
15441 -11793 -52395 -43387 -44117 -56642 -66248 -34480 -41887 -30186 -6720 6441 9643 23662 11204
15428 11204 -3103 57921 55329 48813 55821 27183 13600 10671 5837 17033 17924 15175 28518
15415 28518 46740 8918 -8773 -888 15182 25934 28400 29879 41353 34006 34617 10284 25152
15402 25152 30850 39440 17361 43143 64008 -774 -30981 6193 21642 20818 6376 7795 -41406
15389 -41406 -66409 -54897 -69131 -53220 -20486 6046 36606 51110 31786 14088 18448 5966
15377 5966 -8659 -23142 -30346 -44213 -49419 -4501 30032 35417 33786 36656 31084 12126 8352
15364 8352 31800 32498 22833 -21106 -60708 -47122 -20594 -11174 -18046 -573 -13293 -35391 -7238
15351 -7238 34730 42136 25459 18749 -4673 709 -7649 -30078 -51140 -33983 -16777 -1933 2902
15338 2902 -27905 -13867 11125 -17239 -13306 -10119 -3362 721 35208 61348 52244 20790 14130
15325 14130 42539 41179 22486 -14655 -42955 -64517 -52687 -19063 92 -5869 762 -10093
15313 -10093 -3209 -15692 -11270 10660 27622 24863 1213 -9486 -19423 -50057 -46426 -40179 -28710
15300 -28710 9538 10966 -6391 -6741 -3048 -36670 -39733 -16185 -9108 6540 26733 6847 18754
15287 18754 15902 -18509 -3866 27340 31154 19519 5484 -5163 6302 -858 4834 12543 25353
15274 25353 4747 12642 -9449 9201 32408 16234 27029 37090 25499 5796 -4127 -14641
15262 -14641 15329 3286 3833 -1124 -14182 -21675 -41394 -39549 -27317 -38477 -32845 -35423 -19930
15249 -19930 -30703 -31052 -49310 -58403 -23452 4197 10446 -4822 -5992 -11812 -31111 -22285 -11577
15236 -11577 -25129 15829 16829 -2632 14732 2406 1161 -28945 -31040 -24440 -6531 3974
15224 3974 -18882 -15142 -8952 7600 -1894 -8888 -15044 -148 26576 36517 38843 45997 24659
15211 24659 3273 -43182 -28719 9020 37658 31389 2434 18023 23456 16189 55562 45136
15199 45136 14542 5791 -9266 -34745 -44488 -30228 -16715 -38199 -62410 -23608 -10160 1226
15187 1226 -15411 -27583 -43915 -38004 -11909 -647 7841 -7967 -33020 -15126 19466 45812
15175 45812 50942 29909 -1839 8044 25769 28763 24124 48574 71650 65469 49233 39037 23964
15162 23964 6630 -2742 -8795 -6289 12626 38368 42092 18301 20904 22578 28827 14516 13408
15149 13408 34176 38461 45448 43476 22652 33849 36586 51043 29693 6517 14306 42419 28705
15136 28705 21934 11363 -4809 -13296 3281 19007 4789 20737 26219 39379 59999 52829
15124 52829 33946 537 -3639 7140 -1103 39138 31365 23893 39785 58034 65984 36264 18379
15111 18379 -782 -16667 -3984 14110 48368 62266 68122 57818 58156 28070 12970 30095
15099 30095 56495 34793 49500 65768 70140 62350 68250 83615 68963 30479 20538 32362
15087 32362 42124 34671 46082 59195 55804 9704 16199 20964 37552 58123 85668 120960 133169
15074 133169 117571 129890 197617 193158 158762 139818 130533 82487 64878 78523 82646 89551
15062 89551 85367 55465 35775 38536 44489 60300 41467 25337 29535 25966 10314 -2882 15083
15049 15083 22970 46702 67389 52025 29146 53301 108910 87490 61524 63813 55355 63999
15037 63999 70002 76927 93933 72459 61190 44927 23169 13954 -16741 -12780 -29099 -8883
15025 -8883 8840 29185 23917 5045 -15257 -8993 44434 77510 63201 50646 29835 -11747
15013 -11747 -14393 -8545 -7027 -14525 10277 11340 15657 5283 10836 23797 24879 14540 18275
15000 18275 11408 6573 -1401 -6066 -23147 -45415 -41096 -48162 -56960 -47265 -14982 -6639 3676
14987 3676 3623 1473 -8806 -22787 -22038 -16653 -18766 -57755 -36332 -17022 -27791 -11562 11975
14974 11975 -18154 -36855 -17087 -5715 8004 -8649 -16675 -13004 23408 19435 24567 -12766
14962 -12766 -20282 -7583 -3318 -14277 -2560 27813 33091 36870 6318 -13640 -20465 36164 49703
14949 49703 43718 14046 798 -2518 -35699 -22562 -3434 -7113 4800 8450 -11501 -17974 12776
14936 12776 30873 47758 3755 -21763 -29911 -58518 -57383 -25116 -14910 4288 44238 51928
14924 51928 25817 60758 68938 49853 30295 23464 23756 33916 22725 18998 29288 36813 29604
14911 29604 -4562 4578 26274 41940 -227 -30 39589 8922 3941 5435 -4804 -31003 -44829
14898 -44829 -47764 -60611 -72248 -63712 -46843 -22746 -8152 -37562 -25035 -23568 -45863 -37281
14886 -37281 -4627 11446 -3434 -9717 -23492 -14746 -10417 -2185 10293 -11466 -14663 -9587 399
14873 399 6668 10380 838 -12753 9284 15703 4972 -7959 8793 11032 -21833 -7917 30861
14860 30861 60944 59373 5465 -13496 19604 18457 30023 20874 -3839 556 -14697 -50606
14848 -50606 -40572 -8999 9786 -578 1530 -14673 -28916 -6923 37569 32154 25702 30066
14836 30066 14902 31837 27564 12649 -2758 21404 2297 -21195 -17777 -6279 4453 -8928
14824 -8928 -28653 -15699 -21954 -10449 -16231 -30980 -38576 -39700 -13817 5745 3220 -11662 -20797
14811 -20797 -22444 21443 24797 7797 -4304 -12566 -12998 -12937 14213 15715 -6367 -11154 -17849 20074
14797 20074 54965 36475 24960 7681 -16767 -40669 -28971 -15628 -11047 -2763 -6560 -19772
14785 -19772 -39329 -20392 -16880 -5623 -10937 -2426 10672 46104 36429 7781 -19543 -371
14773 -371 21078 -10350 -18797 -12926 -16517 -4143 -721 10700 -6021 -28388 -41833 -24602 -9156
14760 -9156 15021 33811 -845 -62409 -53898 -6300 12415 -4144 25064 26725 51720 35261
14748 35261 -234 -31260 -22652 -6883 -3652 -29453 -44687 -41827 -18972 -4886 -4674 -1451 11536
14735 11536 21245 24275 40015 40377 25607 19557 6413 13519 1199 1943 18416 14585 45490
14722 45490 39868 16177 32449 23291 7472 -1157 -15987 -4723 -9829 9201 16742 11073 16455
14709 16455 19496 36258 22164 30224 3374 -34411 -43059 -16991 2665 2206 16403 22925 601
14696 601 -3203 -4536 -14812 7143 20839 -11205 -47840 -63434 -46382 -34011 -23120 -23016 -27920
14683 -27920 8301 4516 -9215 -18224 -29044 -21643 -14994 -19408 -12468 -7095 11698 33101 19312
14670 19312 -19280 -4410 17897 12490 -24054 -15436 2776 3408 2435 1764 -1589 -17360 -25734 -25404
14656 -25404 -27053 -13010 14600 4782 -20482 -41760 -44208 -45679 -51670 -21562 9510 -14390 -17987
14643 -17987 -3519 -4074 -7177 16493 22233 16328 -23531 -24313 -21748 -32149 -12658 -10321 16129
14630 16129 -6218 -41321 -27354 -25000 -23650 -12323 -24079 -47807 -55931 -53255 -42120 -6267
14618 -6267 -18134 -2593 7578 -5095 15148 14903 -1181 -13390 6078 12517 15549 16421 35632
14605 35632 43705 30889 36314 44193 42289 44907 5812 -12571 -7019 -23426 -44919 -36842 -36343
14592 -36343 -48010 -49453 -61949 -52150 -23790 -7855 -18280 -21865 -19505 -20781 -53437 -32425 -1386
14579 -1386 -18825 -3032 -23195 -38183 -43112 -39040 -42277 -29294 -17112 -26493 -20429 -12501 -31419
14566 -31419 -49634 -40625 -40653 -45154 -27457 -9223 -1325 19620 10981 -32128 -50469 -77528 -71709
14553 -71709 -30306 -3675 -28242 -41475 -30453 -34652 -30844 -49572 -66417 -70432 -57841 -32577
14541 -32577 -7761 -9332 -36884 -42747 -36526 -2941 34252 20520 22673 33445 7384 25919
14529 25919 43776 22072 16659 -15397 -35494 -56690 -69351 -52424 -53095 -53752 -29140 -2327 -5225
14516 -5225 -7378 -5208 20327 10731 -4745 -8171 10105 -2853 -17797 25556 31361 -4856 -46390
14503 -46390 -24226 -12001 -10926 -2442 21336 40034 12293 11340 16731 17284 20564 5231 -20330
14490 -20330 -25968 -22161 -1867 -6339 -9538 15527 24932 32500 22185 20277 6045 -15349 -25336
14477 -25336 -25604 -31470 -34467 -15556 -32793 -16742 1571 15304 -19463 -999 31015 20393
14465 20393 13109 4328 32451 4710 -21250 4741 -639 -5056 2310 15467 37984 42000 23641
14452 23641 -24979 -30667 -15984 -19933 -3827 19051 -2956 -10657 -7961 4578 14674 10173 -2367
14439 -2367 -19760 -33990 -61576 -50645 -30813 -18530 -14532 -4604 -6794 772 34108 31546 3631
14426 3631 -10497 -16716 5288 -5827 -39631 -53883 -25082 -7626 -12845 -39114 -66048 -64015
14414 -64015 -54963 -55510 -38256 -36392 -3470 -27123 -38234 -34322 -41871 -42004 -31063 -43451 -23066
14401 -23066 -33578 -31147 -11248 -9986 11012 30402 40378 15502 12037 14901 13435 43883 42852
14388 42852 24282 8397 -8624 -19429 -34733 -40565 -32396 -42662 -39135 -13335 -35931 -49685
14376 -49685 -44874 -66882 -30319 -15919 -5659 16891 35634 34615 55324 26522 -2925 -22489
14364 -22489 -27696 -17606 -3854 23806 39514 57970 32551 41233 71555 47934 2063 -34484
14352 -34484 -24973 -7513 7297 15147 33057 23239 -591 -3796 20544 34826 22273 28063 32163
14339 32163 21962 16143 782 -27505 -24024 -23318 -3336 -22995 -23344 -39695 -30819 -51181 -69457
14326 -69457 -20109 -9864 -38784 -39397 -36385 -60816 -57173 -71643 -61724 -23623 -14045 -6204 -20079
14313 -20079 -15625 -8261 -15917 -47 -751 27449 33468 31694 30697 23510 35589 30581 5681 -12364
14299 -12364 -28088 -25962 -26934 -57175 -63679 -31620 -5312 11830 10165 -17757 -35212 -32562 -21289
14286 -21289 -29719 -23985 11742 21914 15190 25388 44653 3041 -32668 -50592 -36545 -20319
14274 -20319 -28335 -5643 -10659 -15379 -42059 -60410 -56070 -67388 -30886 -1707 -16391 -15977 2199
14261 2199 -6765 -14138 -25879 -11615 -15 8340 -3790 1386 31887 10240 -1663 -329 -7109
14248 -7109 -7939 -7878 -20757 -28636 -28102 -38296 -39454 -23088 -12023 -16560 -25025 -34345 -16405 -151
14234 -151 3069 26430 24019 6434 -35212 -50629 -8222 19718 17770 -5422 -15871 -15585 -3790
14221 -3790 8552 6126 10 -17255 -17643 35720 35332 17271 1805 21817 19718 962 6252
14208 6252 -14106 -30018 -35086 -16881 7140 33670 34804 25290 2114 3089 4346 -6281 -4502
14195 -4502 727 36607 37701 26888 24235 31584 37628 22864 27652 16858 -985 1578 34862
14182 34862 41501 18792 1227 10121 639 -29190 -42879 -28610 -22191 4076 21730 15279 16065
14169 16065 19231 -3638 -23428 -50166 -53320 -55574 -40978 -31649 -16679 7037 -12680 -30023
14157 -30023 -65065 -41547 -7757 -19728 -17615 -13123 -19691 -5687 -15658 -28274 -24702 -28029 -61523
14144 -61523 -61767 -37223 -26498 599 22934 22111 18270 7627 26224 38035 10851 -6361 -8275
14131 -8275 -19113 -33386 -23247 -12086 -43573 -61597 -34987 -25664 -24136 -20967 -24075 -20166 -29140
14118 -29140 -33915 -29252 -43818 -26214 5689 33800 43126 15942 -15308 -37165 -38536 -51430
14106 -51430 -47049 -70877 -86028 -66353 -51254 -23390 -12814 -1912 -58444 -69383 -98248 -67789
14094 -67789 -59604 -45906 -26392 -30455 -25506 -8281 6023 133 -11944 -45147 -42097 -39382 -58477
14081 -58477 -60705 -41219 -7730 -4398 -3394 -720 26726 9021 -9206 -4940 4376 8782 -12245
14068 -12245 -6328 -23999 -28219 -18783 756 -5758 -8874 10622 37398 63345 60723 23436 -5379
14055 -5379 7931 10468 -15186 -15008 -21562 -36989 -14675 -30971 -4700 30486 -13022 -33174 -30141
14042 -30141 -13084 -8198 -3610 5320 4868 2686 -8200 17224 21846 14924 46543 58264 17354
14029 17354 -16596 -13557 -11140 14862 9307 -27318 -40356 -41326 -31742 -21596 -9574 -40908 -52581
14016 -52581 -38675 -15090 -18087 -60941 -62603 -62486 -61338 -23508 -38144 -20900 -5565 1562 8573
14003 8573 -24031 -37245 -14383 -13313 -16884 -672 44459 40342 21857 9717 13043 10524 -2358
13990 -2358 785 4323 -9976 -16696 12812 33342 15087 -3535 24336 9416 2640 9753 4534
13977 4534 9982 10946 -19909 -25540 8705 26046 33400 22433 -1105 -13820 -5143 -21090 -38048
13964 -38048 -44657 -39733 -41926 -46600 -16377 -27781 -44597 -37419 -26221 -15922 -6533 9621 7663
13951 7663 -13468 -14900 -34225 -27479 -17974 -4587 12601 4018 -6882 8856 -16042 -45093 -58617
13938 -58617 -51639 -27043 -12515 -25361 -31482 -32885 -57188 -71355 -51643 -5455 -7101 1643 10471
13925 10471 -7424 -16938 -20705 -34722 -9008 13390 -14717 -21439 -21350 -28824 -20165 5632 35635
13912 35635 31334 30897 26747 2449 16270 35610 40086 41837 40573 5534 -8389 -23400 -23870
13899 -23870 -44742 -45134 18484 6575 -17435 -3609 22885 28986 -16463 -40168 -16549 1809
13887 1809 -4691 -17441 -9649 -49616 -72592 -57073 -56286 -65086 -66002 -74723 -50239 -26948 -26701 -32964
13873 -32964 -8303 -8720 -33439 -40059 -49978 -38293 -21543 3373 -11899 -1531 9547 25549
13861 25549 14072 -2423 5883 -28744 -12063 -7637 4368 1581 9102 13980 17335 10739 14826
13848 14826 29432 18649 7853 26062 20847 3443 -6428 -42049 -76694 -39513 -46067 -67847
13836 -67847 -61669 -48644 -18590 -5421 -11185 -35063 -38197 -6424 40506 36777 16420 12612 3890
13823 3890 27947 32945 25141 27151 30101 18843 1801 -12978 -27445 -22931 -16600 -24853 -12577
13810 -12577 -18225 -31352 -25202 3773 32063 7185 2806 15313 35053 -22356 -36315 -14407
13798 -14407 -3150 -14523 -12121 -7103 -11629 -12197 -27873 -11375 -20552 -25579 -23198 -32626 -42358 -36515
13784 -36515 -22776 1492 -27061 -43551 -42454 -64879 -32442 -17579 -8578 9469 -12659 -32287
13772 -32287 -46523 -26874 -14141 2858 18775 -15241 -26212 -18394 5359 -13397 -36762 -26127
13760 -26127 -14359 -26819 -733 17857 -261 -10770 1607 22689 9070 -21321 -11136 -18470
13748 -18470 -31590 -16179 6522 14270 25543 31788 32363 14928 8582 -1791 -19372 -30029 -14389
13735 -14389 9235 -12074 -21792 -33445 -38786 -18050 -10170 -5253 -18001 -1273 13892 -28076
13723 -28076 -41379 -47670 -43700 58 19477 10316 740 -11946 -12417 -6215 2827 33729 59409
13710 59409 71449 63551 52470 92259 50477 -15522 -62751 -14335 24916 -2450 -2424 11251
13698 11251 -4639 -44592 -29610 12316 21189 22645 9099 4287 23241 12425 -5036 -10268
13686 -10268 18196 29210 701 -23897 -35165 -4495 9939 5958 34988 34522 9452 -28940
13674 -28940 -32878 -40150 -17293 2662 6561 8553 43 9695 16060 -9830 -39270 -58496 -42902
13661 -42902 -2783 12239 22509 -3352 -6725 3920 20460 -6519 -15892 -32563 -16087 -26691
13649 -26691 -22739 -22690 -28845 -29288 -56477 -40041 -23569 -16772 -24664 -4570 28642 37376 42953 32676
13635 32676 2535 -26362 -36710 -23647 -8211 308 -245 8227 -18626 -29394 -20192 -6878 12088
13622 12088 20892 25946 27921 67210 72019 92258 103278 108066 90953 51662 12915 15336 14654
13609 14654 -9721 -32175 -42046 -32103 -20635 -6132 850 -20731 -30639 -14208 -558 27356
13597 27356 31046 24619 2196 -10200 -6391 3675 2566 25776 20527 -24676 -31046 -7192 -4497
13584 -4497 1943 11899 15878 16847 -6542 15852 2367 586 48219 82966 101226 119447 144622
13571 144622 192758 230938 194961 118252 54809 30202 23283 33255 15355 18844 55754 87062
13559 87062 99746 84824 76288 60273 14474 -9928 -5265 10046 -14537 -23720 -8113 9929
13547 9929 8817 21221 1029 -11665 -37826 -19309 2469 11770 3844 -23741 -24034 -24123 -27067 -14988
13533 -14988 -19581 -6542 7412 26707 46745 103232 182702 261948 279050 235678 172311 116271
13521 116271 72552 31175 12525 39153 52456 40456 15529 12453 24028 20512 -12156 -10386
13509 -10386 -17088 -14897 -34040 -54455 -39268 -7512 -30171 -25350 -40558 -57044 -56172 -40993 -22579
13496 -22579 -1487 -1630 12426 7709 -23675 -17281 -8869 3074 23967 37973 55274 38597 35220
13483 35220 38262 54360 75883 50641 27358 27518 20288 369 -20298 -39894 -28607 7903
13471 7903 36111 48179 32781 28255 5768 -42160 -33204 14703 17338 -8368 -22852 -54782
13459 -54782 -51704 -29024 -23671 16545 16697 -47338 -54770 -33778 -10642 9610 14725 7322 -26128
13446 -26128 -34043 -24272 -16349 14223 7010 -1907 -13424 2293 27771 46154 20957 -6374 916
13433 916 -3346 13497 21628 -2462 -28199 -15715 -604 -36447 -52733 -53337 -40788 -25741 -1602
13420 -1602 -6350 2732 -2561 17803 53410 65298 49861 26880 3268 24013 15407 3095 -1774
13407 -1774 -4558 -6787 -19044 -29447 -2864 -1059 14068 23038 10319 -25112 -25991 -15692 -36799
13394 -36799 -43087 -25260 -8845 -2341 -15561 -31249 -28664 -8308 -21099 -53325 -69830 -83871
13382 -83871 -79192 -62501 -37987 -14034 9499 39473 19914 -22571 -32291 -15161 -11449 -19555
13370 -19555 -15523 -5603 -4195 -616 -6955 -3781 5122 -6969 22187 30686 28998 29541 40594 44322
13356 44322 17975 30218 25163 12103 -1409 -13003 951 48800 72553 33946 36090 28619
13344 28619 26810 -5704 -13734 -2497 -35683 -42088 -35919 -7437 7289 28440 21646 864 -11480
13331 -11480 -7219 9678 25124 10768 -1094 -17603 -19263 -286 578 -19687 -8828 -5653 6956
13318 6956 15053 11535 -4383 -17238 6202 35331 36010 -4350 -36155 -31950 6744 35755 49910
13305 49910 58965 87614 75177 74158 126059 155782 207527 274228 370566 514041 769466 1242584
13293 1242584 2016591 2858100 3072241 2388259 1530673 955860 616120 425324 315450
13284 315450 261459 199355 152895 139544 103247 69544 63830 68597 50077 48809 49116 50804 39067
13271 39067 32853 35076 40726 15527 17438 31953 25494 40643 49537 27100 5509 8509 32964
13258 32964 20754 -10649 16256 24269 13587 -11780 -30752 -21642 -14363 6045 -12867 -24325
13246 -24325 -39774 -27370 -26812 -20597 -10296 -9760 -3349 4381 12892 96 11469 17454 19728 29035
13232 29035 24675 35027 30341 3366 -4481 -13822 -13852 1784 -10284 -34469 -36724 -12768 11194
13219 11194 10469 42025 50391 4473 13919 16083 26108 28009 59322 69202 43033 8434 13055
13206 13055 9575 5773 10523 13335 13901 30118 86543 133598 169752 170767 134333 104065 74111
13193 74111 55538 61411 50958 23587 11300 12864 9395 14516 27157 33572 35731 20507 33280
13180 33280 49450 55062 22652 -9580 -7041 -11496 -31799 -31967 -25346 2658 -4440 676 -6725
13167 -6725 -7801 -4851 14538 47332 45400 31180 24500 35740 49893 61924 82881 117070 196095
13154 196095 290767 384624 452548 427458 331339 223377 152537 80590 25297 4136 -6530
13143 -6530 9868 9463 13269 37265 33886 30980 29872 4570 -14449 2722 15232 71208 65321
13130 65321 54141 49010 6538 1159 14142 -1945 -4316 18499 37520 34503 39238 67280 106762
13117 106762 99628 90487 124540 146378 157914 208594 240339 270861 379293 524479 643831
13106 643831 699019 702275 587267 422229 296123 192814 103310 76275 68214 65177 70637
13095 70637 68414 41828 47060 73098 38242 26670 26843 26988 37009 43263 40580 67003 104583
13082 104583 109026 80087 87289 85139 95136 103125 90405 95866 101917 88914 90309 76964 32253
13069 32253 -19822 -16348 -11935 19404 49904 54634 92679 169411 225743 225626 175877 130562 119087
13056 119087 136401 187909 196242 152556 127053 118619 116235 102846 68264 53196 30433 -19472
13044 -19472 -63514 -64379 -70540 -56593 -53362 -44609 -19365 7594 14276 9981 -2493 7034 4374
13031 4374 30049 37536 44366 45303 21201 -15752 -1283 -23133 -34937 -33450 -12467 -13232 -3019
13018 -3019 41058 89624 96129 75140 72092 85549 86604 57624 45592 27054 18538 35902 46383
13005 46383 42745 -5357 -39393 -58716 -21669 1187 -14004 -27416 -7408 25865 78090 72735
12993 72735 70304 46789 40624 72493 75500 77675 108821 134293 154201 143339 143713 195957 288667
12980 288667 443982 627241 777440 852357 773334 595781 422823 348384 327796 292981
12970 292981 273274 249770 270820 293190 277655 223773 221296 237999 188680 141901 106650 103774
12958 103774 107095 87205 83472 112525 135093 109186 57996 53680 88872 107538 127903 154733
12946 154733 155217 150293 154601 137787 117234 122149 159052 179016 186728 171259 161955 168708 194412
12933 194412 202722 181655 188473 207524 260614 262584 254822 254063 260447 295586 322063 361983 411376
12920 411376 445972 468054 478387 551062 664923 841199 935325 895996 777757 640854 544322
12909 544322 476233 440570 456443 455361 449102 455343 473993 541012 619372 677734 690533 697419
12897 697419 686273 675568 680677 727697 811689 904805 1014897 1112127 1143341 1215564 1323121
12886 1323121 1412023 1463742 1526946 1645710 1790493 1918886 2123601 2403463 2654821 2870065
12876 2870065 3101063 3352270 3647332 4067349 4527082 4966263 5529464 6277641 7056804
12867 7056804 7867538 8761374 9803995 11139281 13136810 16068252 20205213 26006776
12859 26006776 34200440 45513525 60515532 82109672 119649143 189798820 313069768
12852 313069768 484839275 594465273 522920079 346885354 210071255 133329275
12846 133329275 90955393 66624035 51682397 40910643 32515906 26325997 21782892
12839 21782892 18339378 15549589 13208218 11259660 9619028 8276707 7297449 6641543
12831 6641543 6078114 5533652 5028503 4622965 4257690 3914450 3632564 3408745 3275772
12822 3275772 3202650 3100052 2915357 2720172 2546462 2421228 2290723 2117463 1953395 1809019
12812 1809019 1697226 1662993 1660713 1655722 1673955 1665558 1593514 1561880 1532956 1427571 1315241
12801 1315241 1227450 1196897 1186426 1184761 1153690 1124993 1107989 1115438 1053651 955407 871912 831958
12789 831958 774099 777264 818463 884594 1022586 1234804 1435111 1459463 1293212 1016213 823316
12778 823316 736427 648534 609504 584646 563671 543752 525445 511079 527465 528216 471821 431998
12766 431998 432416 416986 401042 406618 419715 432222 413858 377433 372626 370537 367285 401841 403733
12753 403733 401557 383032 348537 329710 319754 306941 296568 320114 324436 298505 270449 280462
12741 280462 283355 268146 247233 246035 243609 260586 213214 176440 175261 209459 213391 222336 240816
12728 240816 248178 252239 296350 336477 336487 332413 324868 289721 258210 229795 239147 210625 207113
12715 207113 226510 229451 227977 215655 212314 192488 136624 151598 202238 235441 250645 236798
12703 236798 198170 178877 187901 213607 214110 148905 101078 98839 120369 137365 136494 113258 137271
12690 137271 133624 121610 117568 100450 102550 92416 110140 145221 168230 170247 157903 152877
12678 152877 160213 135880 158488 138647 124361 150529 186894 200845 176618 153135 153693 180182
12666 180182 185297 165117 165626 172155 191233 170216 164519 181363 186496 150353 127742 128535 82750
12653 82750 67452 39129 16802 3351 18618 26203 2729 4276 30078 47508 75674 91239
12641 91239 91071 66495 44318 51392 82896 96683 87584 78500 79832 71949 99163 98814 88174
12628 88174 65546 33227 32662 29678 13421 -11724 -17349 4794 24572 43813 50285 20511 31023
12615 31023 38362 48078 54566 59697 52513 57014 38554 43265 70487 75796 80867 91162 101636
12602 101636 115452 141801 151068 144771 133992 106351 91471 66699 84067 65586 24700 39951
12590 39951 29083 33224 56992 49664 55136 107606 131518 106168 84052 100840 122040 109812
12578 109812 68182 65991 109080 144612 175558 160049 144395 135684 110891 89307 67180 48578
12566 48578 70722 90427 82230 81835 81376 78395 85087 103346 83016 52465 42412 51001 68011
12553 68011 65513 67086 91679 93681 69311 73956 86396 72929 60821 65304 54758 72245 74722
12540 74722 57766 78590 99539 79712 74778 47208 31356 4201 16720 31955 37546 79851
12528 79851 94100 61521 39186 37583 36800 11187 23209 45518 26236 38139 25671 24272
12516 24272 -11401 -41519 -10424 2514 -7151 -5521 -13832 -8853 14870 37308 53734 20143
12504 20143 15297 5952 18575 13712 5300 18309 32723 21471 8586 15780 29454 35629 21818
12491 21818 32017 36731 33450 39078 34912 14096 32711 32952 25551 53183 65769 54425 52756
12478 52756 47567 17177 7909 33054 45850 9791 24650 60520 91828 115420 131075 128241
12466 128241 118735 108900 88238 65465 68896 49277 33293 44666 6374 -11631 -21929 -18606
12454 -18606 3608 20250 34073 45436 40386 14392 6519 800 24140 32703 13093 9407 18678
12441 18678 23299 16884 27706 18651 -2291 15469 617 -4359 18449 53143 41655 41762 35899
12428 35899 41911 54283 69676 72760 69254 73803 67772 86451 106328 118716 107428 81463 91052
12415 91052 129418 157028 180933 230634 302879 389481 492123 671869 1017071 1623420 2462971
12404 2462971 3097214 2852140 1978481 1264539 850191 576589 433626 344307 280251 219048
12394 219048 186655 175236 166754 118522 116479 114800 100998 74580 48968 44074 37537 43719 88549
12381 88549 84367 91724 91310 86068 57819 72615 93590 97376 79196 78753 80566 75154 60367 39986
12367 39986 59129 65440 52930 36655 35379 47610 53162 67495 51204 3940 -1048 -15862
12355 -15862 -13328 26066 34394 20241 -10603 -3584 48444 46928 22090 20816 1115 -27023 5969
12342 5969 60402 68182 52091 39369 28399 55460 47725 27540 3185 -21332 -16117 25062
12330 25062 40823 21816 18537 -9601 -18311 -29132 -16530 -5621 13102 25485 23505 7360
12318 7360 16004 16688 17009 13445 6571 15938 5205 17772 38195 36762 45033 40540 23816 20639
12304 20639 6975 2357 14046 35585 31232 29583 17800 17974 22622 21168 -4934 -7850 -3985
12291 -3985 20587 28616 10612 19580 35463 16608 17965 26658 49145 53755 54330 19484 18039
12278 18039 40692 48056 44321 16877 7838 45233 52967 61979 69070 63345 15176 -22137 -22325
12265 -22325 -17724 -31694 -8647 -630 36273 61894 41912 33980 25072 -4816 -20580 -8614
12253 -8614 34072 57633 18106 -3111 13031 17067 17937 3200 1853 -13791 -24165 -21000 -22581
12240 -22581 -31489 -22137 -11215 -7510 32354 27643 -277 5287 4612 -13121 -11294 13093 21905
12227 21905 51057 30808 -3584 12515 37458 51267 73410 67592 78351 81342 59152 9101
12215 9101 -8922 -4988 -8724 -33158 -29835 -32464 -4458 42252 42681 44409 18091 9417 19111 -8044
12201 -8044 -346 20762 39769 35670 29796 19606 7663 8822 3419 12204 35904 27562 31232
12188 31232 32032 29792 10313 -11167 -15580 -11361 12000 3183 -15898 -9781 23313 48212 57307
12175 57307 46516 23543 23807 9779 -1229 -5464 -17400 -10847 -10254 -3044 -5795 -301 27668
12162 27668 20454 13945 7440 -7548 -45836 -30513 -2851 -28890 -52340 -21966 -22962 -7593 12113
12149 12113 29690 41837 60755 31019 15653 29992 37479 25352 15982 9893 17940 48271
12137 48271 23221 29946 60369 84998 70503 45448 46157 80042 86280 63539 2659 -21158
12125 -21158 -2683 12543 46840 44317 22107 4129 -9088 -26101 -27948 12554 49489 42670
12113 42670 23703 10743 -21303 -12845 3734 -5211 7575 15904 4048 16442 37686 24644
12101 24644 28523 31511 26091 -2381 -29096 -6543 9504 10559 -12766 -23100 33367 28782 -3598
12088 -3598 -12429 -11712 -15228 -16027 -25815 -22459 10458 15706 30618 25708 -21845 -50609 -30067 4695
12074 4695 30068 36770 30599 45435 46006 16984 -5599 8129 2398 1053 21386 11782 17994
12061 17994 29815 27060 15054 7258 -7260 -22323 -5963 -3983 -9704 -8033 -9923 5741 28181
12048 28181 38327 32031 31648 37537 28557 18480 11099 14059 -3978 -13929 11040 45184 54956
12035 54956 45230 9044 4707 -614 -18939 -17375 12623 23803 16628 -14967 3480 21308 5221
12022 5221 -4630 -6973 -2216 17461 20522 1913 -2461 -11564 -273 5562 -11659 -11363 9766 14444
12008 14444 47263 64019 49045 46036 32729 5324 -7513 -10907 3471 20958 39451 70621
11996 70621 64958 68688 85837 29991 19474 -7515 -20429 -30555 -23986 -24893 -29149 -7721 -21520
11983 -21520 -10455 27499 46493 41181 32027 6539 -20637 -1103 -12101 -28721 -19119 -6770
11971 -6770 -32144 -5686 3276 18377 37576 54155 52405 71310 63762 50397 33743 5602
11959 5602 -29644 -26437 -23038 -25942 -24379 -28449 -54208 -75872 -73004 -42528 -9259 -3464 -10692
11946 -10692 -19628 6952 20325 18094 28010 1908 -11978 -27816 -1142 -7247 -31787 -56223
11934 -56223 -73348 -49174 -34757 -51532 -59387 -78407 -45127 -16700 -19451 -2694 21748 8026
11922 8026 -9315 7311 3331 -9050 -30541 -33285 -29282 -14357 -1124 -10927 -24671 -27700 1991
11909 1991 -8055 -21128 8450 22990 23693 25765 24539 22711 4375 -16623 -3259 14776 50954
11896 50954 65658 43591 3268 7893 -3042 -23420 -23169 -30433 -20341 -420 -5310 -40322 -43170
11883 -43170 -11730 23558 19455 17610 7442 6408 2765 34528 40323 34230 31278 20222 -6196
11870 -6196 -23969 -30331 -50697 -76589 -52117 -10504 -16274 2084 -5428 -10181 -15195 -37965 -44655
11857 -44655 -24666 -23486 -29556 -32271 -33653 -2399 3240 9500 -2251 -11813 -7865 6661 38461
11844 38461 41342 19909 19140 7765 32031 35435 38988 23627 33545 36674 10220 16757 17360 1062
11830 1062 -6727 -18153 -8492 -44753 -40834 -33582 -60076 -54607 -19675 -985 2050 1884 -3977 -31359
11816 -31359 -49311 -70240 -64442 -28805 -6111 -983 2580 3024 -8457 -12525 -18800 -22396 -16485
11803 -16485 -902 -11422 -18985 -52178 -68214 -52766 -32282 -37802 -31364 -6747 23231 9390
11791 9390 -18599 -9077 36074 62613 56692 35058 -4070 -14947 -17134 -6627 14069 31518
11779 31518 36631 10327 -11670 19904 11068 4580 1895 -21127 -19836 7918 20209 -1998 -8299
11766 -8299 -8122 -14320 -25925 -49666 -50405 -52985 -21371 7193 16822 -2165 -11142 10850 8029 -6292
11752 -6292 -25352 240 6960 -13709 -10453 -21124 -18406 1143 18303 18558 6184 -14624 -46824
11739 -46824 -62775 -66405 -75672 -66269 -43309 -45245 -39494 -16357 -3414 -1053 -21284 -18300 -3044
11726 -3044 -6647 -54124 -51831 -62666 -40445 -15983 32724 51970 42458 36806 40502 24894 11187
11713 11187 7699 -8235 -42331 -34444 -44398 -48548 -18971 7048 -22997 -17729 -11792 -16443 -13943
11700 -13943 27259 51268 32176 1808 17574 8717 -5344 -24065 -26597 -14867 -20835 -29811
11688 -29811 -31903 -14485 -28014 -49136 -67464 -78243 -43426 -51349 -37930 3677 8870 -16609
11676 -16609 -52539 -44992 -34896 -39042 -31147 -33624 -29169 -16810 8643 -15755 -44450 -33154 -32876
11663 -32876 -16117 -8109 26063 45263 29202 -11597 -36103 -22686 -9543 -9470 4734 11040 7962
11650 7962 -369 5489 -19874 -41481 -26413 -11486 -45655 -82871 -65964 -31860 1436 5416
11638 5416 8165 -1221 -27371 -40137 -58702 -43686 -32350 -17252 -21037 -6518 2717 -22811 -16002
11625 -16002 -21849 -33594 -30259 -46071 -28081 -5761 -14048 -27484 -22831 -26113 -31768 -13143 9309
11612 9309 33534 12821 13166 35329 51832 50035 22187 -5301 -13550 -17316 -29017 -28354 1792
11599 1792 23985 25549 41341 31282 5547 -27646 -15505 3176 2818 -8265 -2451 25774 15732
11586 15732 -11131 -9366 -758 8911 -5335 -31726 -21018 -2165 -2997 -2043 -8436 -17681 -28418
11573 -28418 -2479 17622 7152 4456 2624 -440 -11620 -378 4402 17533 32723 23847 19757
11560 19757 -676 -15239 -36364 -27697 -3612 7050 -1241 -11755 -19567 -12471 -31676 -24497 -19437
11547 -19437 -12399 16384 9046 17196 19025 30331 41511 14460 -16167 -12968 3990 6213 -9686
11534 -9686 -1442 7163 11808 -19607 -26808 -18043 -29938 -28738 -35621 -1272 -7941 -20698 -3933
11521 -3933 2888 -30327 -22616 -28954 -23401 -7705 5208 16569 5710 -27815 -40128 -41331 -58475
11508 -58475 -51516 -10947 698 15398 2557 -24477 -43300 -59641 -65207 -73695 -65759 -53491
11496 -53491 -28418 -460 36923 38414 14907 -4897 11657 31509 17100 32938 35638 -3123
11484 -3123 29014 22753 4492 -8285 -18465 2696 13699 33143 41882 54172 54271 23371 30359
11471 30359 31142 -20001 -34634 -10711 2217 -16168 -37363 -16821 2912 -9161 -18903 2260
11459 2260 10112 3711 -5803 -20940 -2034 28 4169 14181 22656 47239 23527 -31429 -30063
11446 -30063 -35879 -58284 -58255 -23924 -7356 -15817 -19757 17285 5812 -27628 -25889 -32096 -36604
11433 -36604 -30739 -28627 -26012 -13519 -30809 -54073 -51628 -21400 -25399 -53943 -75688 -55475 -7211
11420 -7211 17426 34035 43200 46545 38496 40710 41725 26490 15668 -14974 13268 22303 7673
11407 7673 -4615 -2853 -5316 1535 22633 -2226 -17883 -18750 -15064 -30601 -15441 -6638 14647
11394 14647 19855 7187 16005 549 -4226 28708 17938 -1968 -2299 -12262 -19989 14698 37776
11381 37776 22030 1860 -12343 -18709 -11312 -16040 -20558 -38634 -32957 -34355 -46306 -51717 -4537
11368 -4537 31709 33242 37208 27477 72 10085 34063 27039 16156 -11487 -15944 -26453 -5974
11355 -5974 -7496 2665 -240 12433 18632 -8968 -24572 -18917 -5672 6293 -27230 -55855 -44766
11342 -44766 -34450 -11001 -18569 -26632 -35768 -44642 -42428 -50430 -44319 -23597 -4260 -8266 -3901
11329 -3901 -7236 -8941 -2772 -12186 -20086 -2686 6056 12926 27864 35970 22770 15961 29939 48485
11315 48485 6884 -20121 1589 50 -6772 -7441 7382 21246 41627 2134 11688 22699 26118
11302 26118 11507 1346 -17594 -22033 16241 2891 -8761 21095 27760 -175 -23681 -38777
11290 -38777 -37157 -24373 -26580 -62290 -60898 -29992 -11634 3677 9241 2482 3996 18218 21557
11277 21557 22022 11861 -15245 -26877 3956 16439 -1433 1244 -5997 -14826 -20082 -11708 -5949
11264 -5949 17667 -28526 -65030 -62332 -50472 -41010 -33592 -22127 -32872 -33577 -22444 15544 15193
11251 15193 15634 14938 -3627 -17352 -26837 -26116 -11322 -23783 -30202 -37126 1534 25143 21132 24716
11237 24716 51528 24740 10467 11693 11651 16054 17924 5834 8636 -19512 -12718 -9933 -22449
11224 -22449 -22360 -12854 9185 32746 31698 28957 630 -33251 -50483 -49580 -5935 12041 2713
11211 2713 10425 -28593 -31563 -41130 -30968 -28543 -24734 -6961 1404 1069 701 -18755 -39916 -57163
11197 -57163 -47496 -38816 -32842 -24493 -5427 -1074 -17823 -5033 15201 -17330 -6272 19630 3355
11184 3355 -10118 -16925 -16054 -10047 -14785 1495 7655 10984 14026 26978 1845 -354 -11397 2003
11170 2003 1597 -21425 -24936 -23621 -23936 -41357 -65589 -49109 -23552 327 1908 -11748 -37212
11157 -37212 -28079 -18867 -38296 -35224 -22206 -23783 -25100 -43432 -49122 -56640 -39317 -11435 -10523
11144 -10523 -30487 -14425 -33609 -36519 -29858 -16600 -25117 -55035 -60727 -22230 -14156 -10523 2351
11131 2351 48891 62367 60523 21469 11687 38779 35927 6656 -36340 -63556 -56506 -34571 -37189
11118 -37189 -43967 -19347 -30086 -44608 -54153 -36041 -1111 -5252 -12042 18373 32950 38430 43697
11105 43697 26996 26823 10762 -22965 -47245 -54972 -56516 -32809 -14366 -6566 -20613 -7188 -33690
11092 -33690 -48531 -23789 -4203 1828 1413 -18044 -19362 10039 -6213 -23884 -6460 14950
11080 14950 26941 19381 -18393 -39346 -21286 -11393 -11082 23543 23111 -17521 -20170 -12918 4166
11067 4166 37177 37995 28838 32391 330 -7245 3695 11578 19495 12483 -23278 -23268 -25542 -30153
11053 -30153 -20876 -24817 -24582 -25426 -31934 -31811 -42029 -11079 -21380 -41125 -18211 9636 10353 6389
11039 6389 23971 14832 8564 14714 22872 49050 53228 27858 30848 16241 19125 3908 -14291
11026 -14291 -25078 -2730 34879 20806 -25893 -62337 -39983 7601 122 4701 22139 5801
11014 5801 -9895 -10071 687 18962 19073 23504 15084 17708 6596 -23300 -42320 -2504 23403
11001 23403 18417 -3082 -6863 -12995 -33804 -13581 -4605 3702 -5801 -25059 -18466 4836 33582
10988 33582 31455 24428 16192 -2180 13948 29763 4344 -7482 -3542 3685 3025 -14971 -25953
10975 -25953 -5101 -14687 -9670 25446 31043 15269 38423 29750 6210 -24598 -26970 -1334 3399
10962 3399 1778 -11124 -9454 19679 48990 44981 11765 -7571 -6359 1497 -2054 -25089 -49272
10949 -49272 -46212 -55166 -57668 -39345 -19664 -20557 -15360 -14580 -14099 -23490 -43968 -49284 -21174 6663
10935 6663 4601 -5696 -17016 11565 16084 -12131 -6373 -7920 -18674 -7865 -21873 -40105 -26889
10922 -26889 10801 39192 43369 32566 -11270 -30909 -7022 -1874 -19503 -36172 -26333 -33033
10910 -33033 -25557 -11921 -9899 16869 9698 321 433 8196 12941 25145 20817 -19143 -38863
10897 -38863 -54545 -48326 -30164 -19960 14761 22554 8507 3135 -20997 -16723 13091 32389
10885 32389 49270 34076 27598 47859 40870 223 -61729 -99432 -76821 -49574 -44189 -62864
10873 -62864 -58036 -14166 7437 6219 -8571 658 10260 21009 35435 39708 10392 -26183 -20763
10860 -20763 934 -13554 -24623 -26927 -3174 5797 23881 30874 23031 4112 -35381 -50445
10848 -50445 -43930 -26892 -25401 -35764 -28377 -22634 -4997 4331 -14018 -35670 -38764 -37851 -32507
10835 -32507 -44373 -51487 -38796 -35627 505 30394 6889 18704 35531 22589 12459 44057
10823 44057 39541 4018 -32539 -45002 -45828 -31290 -38422 -13596 1225 544 -1817 -1306 -30985
10810 -30985 -4645 48556 73145 53165 -4195 -32764 -36033 -26506 -23055 -30817 -34876 -20478 -9440
10797 -9440 -522 -16373 -34012 -39084 -17044 -12127 11752 44650 29160 -6721 -18342 -25224 -4440
10784 -4440 -6568 -48054 -29448 -42426 -48327 -31570 -24160 -30438 -16185 -3289 -3083 13462 -2981
10771 -2981 -5926 -7088 -24860 -27080 -27963 -23266 -15271 -15082 -25658 -43927 -47497 -31603 -12292 -14535
10757 -14535 -13399 -41682 -51592 -65592 -82590 -60665 -38997 -40595 -43297 -30218 -12761 -1559
10745 -1559 -24558 -55331 -27207 -7393 24263 46573 38166 26895 -9132 6656 48609 64615
10733 64615 52582 49521 76027 67348 56590 33382 26887 17693 -26734 -30143 -1329 -9049 -11129
10720 -11129 -12456 -1246 11552 6781 -14682 -10799 -4114 -20353 -38821 -27565 -13579 27507
10708 27507 21837 437 -8778 -42553 -60187 -39195 -36280 -17096 3627 -1000 10252 28202
10696 28202 22702 17452 38527 57947 35322 3098 -3719 -12467 22098 44508 35494 24672 42773
10683 42773 48891 41066 18727 24808 9238 -8464 756 31438 44873 49407 29518 6938 16800
10670 16800 47603 40654 2038 -627 -20960 -10259 8587 9616 11053 12863 39083 60802 62146
10657 62146 74076 73411 44326 25826 21958 22261 32595 25739 -13451 -21102 -23259 -22106 -12305 14944
10643 14944 1865 5075 14665 22932 29575 5975 -13412 -14509 -7952 12390 37433 56126 43894
10630 43894 42968 27618 -8402 -16367 -17063 -11308 -7907 -11922 -11637 -186 13178 13430 7983 1844
10616 1844 5088 -17949 -40317 -44639 -56700 -28112 14174 11368 19514 34688 40174 56458 68394
10603 68394 45832 35143 28195 637 3193 21854 6975 20690 37038 21659 -2418 -4774
10591 -4774 -14611 10263 21580 14621 3635 -7609 -24775 -23747 -29267 -13260 8913 30308 2661
10578 2661 -24854 -23351 -16738 -29127 -4400 -9424 -22522 -5708 -13490 -6834 -28638 -23704 -22511
10565 -22511 -48577 -52816 -54257 -35258 -32241 -29300 -27590 -38813 -42752 -21548 -4414 16281 -10628
10552 -10628 -13842 -23689 5127 10458 6443 -1765 -28746 -35721 -23426 -16723 12072 -726 -33032
10539 -33032 -27829 8621 13388 21650 -29830 6383 12095 -26077 -7742 4980 30514 12786
10527 12786 9420 -34218 -36424 130 8877 -21420 -26109 8497 29416 12997 -5452 1161 21410
10514 21410 -8273 -12699 23851 51730 30842 26206 15453 16785 30022 -2778 -51935 -52957
10502 -52957 -18333 5885 5517 -826 -1717 -2958 -3697 4255 36269 61785 52899 15394 -24371 -18725
10488 -18725 4832 2242 24522 50413 44348 28808 44241 69418 87173 58450 48800 65738
10476 65738 45000 50459 72857 95988 113212 115732 113450 153641 232189 338447 425482 469233
10464 469233 497814 601722 710036 727678 658569 581776 527491 464062 340995 222017 152275
10453 152275 133008 76116 54471 36469 56841 77345 67796 69813 70323 60820 56407 42486 38107
10440 38107 46445 38427 14757 24752 15505 11680 41604 74236 64006 77775 85068 37646 24746
10427 24746 10023 4206 21661 24667 9775 -8540 28173 29540 52253 43584 10693 4895 -18653
10414 -18653 -13803 -10456 11422 38984 1739 -9048 -9607 -1953 17188 26207 57848 57259 54035
10401 54035 16563 -6638 -11675 28354 65624 55399 22448 30625 24043 10467 2170 21207
10389 21207 25981 54022 59652 61155 16028 12760 29250 81761 118021 162244 188430 155937
10377 155937 121824 97520 86674 75180 91530 50624 6809 3569 13471 43020 68261 51531
10365 51531 59512 58833 51401 21477 7657 7289 28064 49891 62498 75853 53607 58087 65106
10352 65106 59196 49303 36691 39984 39761 45057 68956 73966 69976 38681 59284 72781 67553
10339 67553 56246 72138 109750 131002 165551 225370 285173 307660 267675 249067 233058 192241
10327 192241 159532 143456 109812 66507 86370 71528 30944 17542 24783 43260 36930 29772
10315 29772 30758 23751 34604 58602 74422 28637 2530 18709 -3315 -16116 -3680 -3240 -19664
10302 -19664 982 32778 9052 -22496 -27704 8609 24107 40617 44109 22640 10440 9386
10290 9386 7090 31984 56428 94920 116344 151573 186325 216808 196563 160949 136554 74387
10278 74387 12707 -5808 -6046 -20632 9632 28303 48198 29782 -6967 5276 10562 19360
10266 19360 15740 6396 -5709 -12611 8293 -1135 -40233 -66748 -48306 -31393 10268 13164 8182
10253 8182 7686 9140 -19705 -37424 -27833 -28917 -20584 -5708 22883 23897 37904 48153 19738
10240 19738 31249 48001 23597 -18446 -14485 398 12011 18061 34203 45990 37543 40306
10228 40306 42544 25485 16394 17835 13241 -12467 -29845 22255 26233 24978 11275 21215 16207
10215 16207 -18202 -53498 -33862 -8050 15849 4103 -9354 -21585 12491 56035 57622 41938
10203 41938 9124 440 -8286 -21646 -36181 -25505 -8600 11326 20017 58486 55295 47399 42890
10190 42890 13135 7549 13031 16342 30442 38422 56131 61961 25603 8042 11812 10908 23457
10177 23457 35384 43915 15827 9720 5645 -576 -145 -11595 -5241 31358 38133 13826 4620
10164 4620 25060 34377 28048 30912 -5266 -34844 -19333 -11862 -24792 -18811 -11176 -2225 -23544
10151 -23544 -9643 2563 20675 1793 -12143 13828 17937 -4015 -20530 -29587 -15775 24054
10139 24054 43401 51909 29789 2875 -55621 -64394 795 22940 -2231 906 6206 -6207
10127 -6207 -12401 21564 28621 24111 24055 34649 8518 -13996 -6315 15846 38189 71245 70859 41171
10113 41171 2281 -14227 -24031 -829 18398 13770 -4673 -6794 -2902 -7734 -6739 16071 16593
10100 16593 58627 40978 13704 30259 28452 32412 13469 4427 3762 -4415 -8219 -18306 -11837
10087 -11837 16127 -9309 -29105 -17167 -10757 3246 15327 12751 -2215 39554 75310 69151
10075 69151 44504 -578 -25859 -18335 11094 49208 37024 -8278 -391 13508 16187 -5343
10063 -5343 -15795 -23324 -18502 3267 -2075 -11953 -11088 -12025 14031 26671 40563 19245 14392 33705
10049 33705 -148 -22391 -24580 -66 17793 20031 4248 -32395 -28343 -17763 -12165 57
10037 57 25095 37814 5821 -10368 4618 12910 19000 18724 23772 22305 17991 10116 14721 27204
10023 27204 26017 31484 16523 165 25235 30046 1199 10086 890 13030 47274 37571 -17295
10010 -17295 -21765 -19205 -380 6472 8103 7438 12167 41549 36363 45476 15981 -8657 13349
9997 13349 42411 16487 -2260 11443 17140 15975 686 6008 -1015 -22515 -39882 -32086 -6122
9984 -6122 16683 21124 15209 -9184 -34957 7721 50477 34574 31477 24431 22583 33895 41357
9971 41357 51337 51152 64024 33781 35632 45806 37191 34836 31943 34692 13134 36536 65696
9958 65696 42803 46594 35631 42178 45902 60942 77705 78047 58043 65235 85775 117347 128938
9945 128938 106948 92225 76493 110059 150856 182192 226840 267683 365338 480770 649394
9934 649394 1000365 1645770 2770354 4448831 5488968 4666921 2929409 1734498 1106790
9925 1106790 734787 475476 337623 316323 280390 237799 206708 173239 156489 105632 69200
9914 69200 71671 52634 42479 50713 66348 76192 78308 51463 64079 64001 83242 87253 63154
9901 63154 72983 66628 62738 88364 103309 78604 51689 23899 30376 64583 63133 87352 82586
9888 82586 49011 35456 11335 18659 16356 27781 44473 52460 59854 55318 71448 87482 101056
9875 101056 86862 66825 40320 37912 32441 34019 47302 57133 59684 77821 88773 90019 81663
9862 81663 79084 72623 76940 92843 118050 128959 113452 123348 147506 181272 207263 222728 257189
9849 257189 308394 403278 584149 931755 1476991 2061439 2345330 2027596 1410040 889800
9839 889800 582538 409798 293780 248420 233307 208429 194063 170703 148653 161101 180725
9828 180725 167407 157035 157994 171910 177456 146537 140364 141845 127859 121960 134054 129217 132636
9815 132636 138721 132529 154851 180798 175217 189199 196966 166702 150669 169834 196265 177084
9803 177084 143108 120534 137479 149704 141910 139146 123262 124079 148206 183921 201691 178062
9791 178062 171928 137722 102876 95098 109161 113065 113119 118365 131055 147877 140523 140146 124860 126433
9777 126433 148820 150885 185157 214573 210851 163288 163505 195845 209785 216985 193766 170288 141665
9764 141665 116064 137073 114577 88354 90012 114678 109173 97683 119557 127837 129841 135286 132682
9751 132682 145050 118968 114739 102483 105326 93953 88859 102553 78408 69234 67028 71194 98283
9738 98283 91146 83365 70969 71261 77769 84898 91190 98035 113486 100902 85253 96271 77792
9725 77792 87206 95107 91660 95429 79580 93925 77876 101211 139090 134883 129964 132518 134071
9712 134071 109764 91320 92653 84719 81947 99299 62613 51455 65585 35259 37709 73098
9700 73098 59902 27013 45509 51037 38463 24612 38457 57697 71764 43809 75895 84273
9688 84273 81405 80339 95723 85598 54035 63774 103440 119623 109543 101364 94420 95253 130414
9675 130414 155443 163819 180121 160203 122992 108105 69515 71397 92276 87741 82414 93173
9663 93173 113846 125200 112198 118676 90250 84964 92983 117505 166886 148628 119913 115491 104504
9650 104504 80813 75098 71671 60448 65183 78966 99808 84746 74689 105601 110244 74145
9638 74145 56896 75632 71123 66649 67565 78238 68187 66244 65832 96972 136038 148124 109175
9625 109175 100620 81775 103712 118321 114668 114183 125562 121044 98546 97113 115380 79476 76249
9612 76249 115506 133317 123317 105239 117583 123172 114921 111305 123532 118600 141570 175178 169913
9599 169913 122831 127085 126280 146766 160815 133662 105905 116876 118636 106805 108061 129538 126774
9586 126774 137335 133243 103312 89593 123492 160724 162278 148636 118745 126614 149966 145744
9574 145744 137129 136395 128549 117093 94810 105061 149986 138133 124816 116058 105014 90921 96763
9561 96763 129117 128342 113093 127221 130737 108653 102833 127699 136188 135577 158387 164080 171674 187312
9547 187312 190636 182324 166663 150693 161529 181553 173288 187245 180772 179093 179721 184246 181988
9534 181988 161662 158008 193251 204470 211249 224514 200417 189850 189044 221163 226614 211072 215294
9521 215294 231167 242226 253863 259876 277688 258662 236102 218591 217457 227126 242017 246254
9509 246254 219794 220457 233488 234227 190393 207858 232608 240880 214438 203815 214408 236186 241219
9496 241219 259512 274588 269278 268769 312198 306209 269011 274389 264212 264175 302402 325005 354168
9483 354168 348004 311645 282442 266955 299570 327067 338812 344061 358317 340263 316194 328572
9471 328572 333455 333807 310668 312475 338434 309708 272317 283216 284143 278629 317412 294156 292615
9458 292615 333964 352117 342771 337779 324099 307141 310768 310831 286465 275981 313666 345960 352071
9445 352071 374627 379291 397764 404995 387998 382422 391471 401574 404158 386066 363853 346554 361861
9432 361861 385374 390314 379155 390303 397931 424352 427422 418002 412941 419835 406236 367677 383157
9419 383157 425511 438087 441685 407012 410350 416690 417223 425768 387447 372771 384195 390049 390754
9406 390754 401970 389500 389558 414652 442016 434654 433853 416504 366988 377188 401984 431101 421350
9393 421350 406204 408134 423020 431805 436724 441211 421115 403652 414439 426348 434314 436304 401432
9380 401432 375212 362874 411538 455911 450051 447279 430295 425237 425228 422654 422557 426330 406063 413187
9366 413187 419296 443142 455189 460586 497718 486237 468642 460649 428177 425315 446599 417521
9354 417521 443700 480545 492752 510642 508053 484935 462322 445824 448658 428168 404282 439863
9342 439863 448077 420920 425042 437004 427968 437164 452602 427913 385405 376497 385060 397533 409742
9329 409742 416663 442355 430599 402040 377490 371392 376770 367014 374791 375638 354750 391471 422353
9316 422353 401739 371284 369531 350423 325800 322598 323924 316916 316676 314510 355108 361889 348516
9303 348516 347078 361638 375963 400125 384405 380357 379438 365272 344486 333710 339143 343453 331833
9290 331833 307233 305305 302128 337213 367123 332071 337311 348953 337577 334297 314168 305791 317400
9277 317400 323098 301632 311934 333302 338200 336371 324850 318947 336059 319728 299632 313505
9265 313505 304795 293265 257202 229952 277536 304461 297389 282620 274886 269196 293531 285427 248031
9252 248031 252391 266342 260991 230358 215869 225742 222382 216548 256591 298862 284848 270887 265110
9239 265110 283210 257489 253074 298913 274205 256432 270378 259054 237707 217231 206661 222902
9227 222902 219612 207568 204304 216488 221069 208556 218040 233488 273830 294497 289321 281573 283151
9214 283151 279839 294333 260628 268654 238584 220731 216238 239924 236553 222435 224346 245158 261375
9201 261375 260476 230475 226557 226469 166050 173629 170482 191965 187141 162062 164000 130884 153572 158911
9187 158911 186371 189781 193883 182976 179025 200354 211404 190562 183778 163337 139181 124320
9175 124320 150938 189156 190626 185300 181682 184604 173449 159998 146798 163530 183909 165120
9163 165120 147014 136502 131133 116463 108706 127044 123922 155123 149335 117773 87529 99912
9151 99912 104069 105204 105291 104029 117627 128471 120216 142566 139126 135625 117531 125674 132568 107582
9137 107582 99066 89506 98979 137225 149054 140800 159530 160177 158359 163121 168307 169409 145879 113899
9123 113899 88280 102534 102972 106603 75834 79370 80537 80881 75869 69961 97493 93766 101618 124679
9109 124679 123294 109850 118956 124663 119781 68351 63235 60852 49603 45623 27933 28090 42527
9096 42527 45356 50073 76969 87455 89498 121632 135461 139451 99841 79187 82790 93407 94787
9083 94787 91558 89326 82378 72694 68403 94579 104019 99407 95932 88323 75969 91254 98836 63426
9069 63426 39800 67531 82777 88756 101819 90302 78200 85873 92563 101576 89696 87590 115181
9056 115181 115756 105575 98265 105643 96815 70391 53087 40325 62163 66160 91974 108440 116122
9043 116122 98148 97460 88391 107960 102094 56316 13316 19749 50386 65827 85770 94210 67483
9030 67483 74723 83294 53280 15167 -2141 28121 1654 -6847 14351 24372 24664 30732 33630
9017 33630 40234 51280 52709 58640 80357 71385 79371 63151 80544 94548 78596 70051 55426
9004 55426 40263 62457 81620 89735 80676 55725 53101 50153 64283 54515 20609 -8025 -31923
8991 -31923 2727 30166 33767 42701 50554 56033 68831 65796 56858 20216 -21994 -1094 28504
8978 28504 30766 56344 66592 35841 24149 53261 38396 41972 55656 39328 5837 -20464
8966 -20464 5952 4196 -22947 -17719 10313 29005 38368 9542 16718 17043 25512 37582 63684
8953 63684 83649 61009 32181 -12894 -9159 37185 61529 45310 31352 33750 35594 53141
8941 53141 53592 45408 49935 34915 33533 34029 28615 53017 58205 68504 39345 24065 21085 44545
8927 44545 86361 94456 73140 47436 63914 75132 50912 13524 13987 9927 14531 16799 28065
8914 28065 18555 -10375 -8119 -14694 -24957 -40116 -27498 -23864 -54943 -38278 -8195 14074 12487
8901 12487 -15206 10426 45341 56747 26947 49160 70342 59545 37440 25574 46141 54139
8889 54139 29680 32726 39368 16299 26867 29742 2913 5394 9338 27440 66510 73745 66943
8876 66943 73342 85434 80601 83395 85228 118934 165608 198262 294574 291389 227576 164269 127606
8863 127606 119255 84421 68158 58699 51107 19204 19528 37610 56510 42477 37955 33327 27978
8850 27978 10949 -18316 -747 31129 37468 17438 30654 57637 56239 31180 24352 28447 42409
8837 42409 70307 68930 57441 51556 85913 59579 41302 43948 69562 165478 219261 274250
8825 274250 383720 533379 668203 664045 520026 360929 263644 178713 127691 140934 166787
8814 166787 165761 121932 116333 92658 89162 74153 50790 63047 65691 47755 37163 43476 38685
8801 38685 74871 65235 56424 60900 62760 54927 36897 50627 65443 72837 75524 86958 53069
8788 53069 53923 86039 94432 97347 121863 140000 122300 148746 206057 273735 330880 336801 291837
8775 291837 229236 165132 127747 110119 107876 92381 101269 106022 104908 105677 114801 101882 113997
8762 113997 138434 141101 150494 170602 178982 175751 195850 190090 179690 167299 149479 127270 152436
8749 152436 187768 187735 201602 211468 215770 191205 156861 176669 203391 196642 177818 170585 159330
8736 159330 134733 149727 171493 159562 154003 149533 169982 175758 164853 156255 184276 222970
8724 222970 237198 227675 223698 217552 212067 198424 216354 222536 224586 219758 200349 219481 221688
8711 221688 195179 217888 272092 296020 276787 271523 245097 225718 240222 286309 305055 302310
8699 302310 310163 319600 345506 379136 359306 336624 342729 325529 328913 358931 360723 343215 343534
8686 343534 355195 353727 364417 356673 341021 350405 355416 371982 387835 394898 384257 404395 408121
8673 408121 430756 443219 433270 424809 417652 437210 448562 457827 451918 442267 430234 456151 468496
8660 468496 468952 481661 470019 460136 483771 506941 538420 581818 579311 590955 607653 631622
8648 631622 670202 736095 840468 978532 1134145 1209572 1090216 942261 856734 794556 774187
8637 774187 753016 751664 784429 821012 820073 817242 822933 843644 861058 888729 905211 918972 937679
8624 937679 979364 1005699 1034556 1069211 1097814 1146711 1207242 1291552 1347105 1403413 1407663 1430027
8612 1430027 1442724 1464832 1480509 1468359 1465812 1466828 1482147 1442352 1424404 1448895 1491737 1592221
8600 1592221 1838072 2220979 2470481 2290140 1900026 1661509 1560492 1510386 1472204 1450077
8590 1450077 1461004 1481408 1431934 1338872 1230328 1103180 973203 829597 741591 674528 616174
8579 616174 564187 532428 533409 487076 435086 402367 399595 353226 320568 329327 306223 286066
8567 286066 307626 358254 344829 324359 300971 264046 241114 204012 205158 232377 292309 364526
8555 364526 469263 642699 744185 698325 541956 402089 306130 269695 225085 206900 230814
8544 230814 220873 194376 142805 132617 153811 184928 219471 210045 175936 178579 140066 123117
8532 123117 125942 92757 85814 101816 106938 82624 67555 79061 85675 102486 138072 127764
8520 127764 101256 102492 112632 102997 103888 106973 85135 60636 56299 50390 76290 78362 28423
8507 28423 13180 29465 22558 5292 30246 3346 -3590 13533 18967 24698 33583 49847 55292
8494 55292 55235 64515 65418 56673 82755 54306 42415 25698 20540 4214 3729 1681 37850 70010
8480 70010 46732 1027 -2873 1782 6333 54570 72378 64995 70802 88438 63701 30870 15103
8467 15103 2972 18239 32149 19194 12985 26234 34057 25326 38478 46759 30031 17325 9314
8454 9314 8240 21833 42223 6485 5314 18412 29016 43536 27782 28247 22469 17758 13316
8441 13316 -18299 -45730 -39551 -38057 -42347 -47641 -37501 -10764 -4817 -15949 -37523 -23505 1248
8428 1248 30843 41645 21565 39656 26627 23112 24576 2157 37698 58392 42919 24837
8416 24837 21427 21246 32002 36781 22873 3380 -27689 -54866 -47074 -17636 19098 22112 34846
8403 34846 51839 59331 55031 18937 28033 48790 29537 148 -21549 -1603 -54 13021 12251
8390 12251 20891 35560 15311 -4925 2787 15332 23298 18511 14370 38561 42761 26534 18498
8377 18498 42642 16827 8026 6225 8460 50645 53948 31203 2988 3352 24482 41258 45878
8364 45878 16562 -22424 13733 65350 66254 34076 19250 13915 19469 50885 35668 45028 47268
8351 47268 62375 72704 59324 51180 45164 42840 13463 22602 63725 65460 60758 33217 22911
8338 22911 30101 1544 -39894 -38712 1521 31908 29477 23628 19706 24354 28697 37691 19993
8325 19993 -266 -30871 -29927 11657 25970 44492 31891 10070 4345 7213 9056 -2438 6368
8312 6368 -258 -34147 -25649 -7287 14138 20410 -3712 -12670 -10637 49943 61437 44267 21046
8299 21046 16702 5783 15613 20735 13702 14342 18042 16170 759 13381 5770 -10843 2548 31406
8285 31406 50440 48805 13978 -17539 -13116 -8099 -5810 6224 -31139 -33709 -302 41678 27250
8272 27250 6333 -7303 -25147 -8277 -30023 -43480 -31116 1958 12555 13257 12969 8959 10233
8259 10233 20295 15559 15585 33405 77086 70138 38599 -1691 -19504 -29884 -19571 4141 14207
8246 14207 36694 47320 40756 40037 44045 54362 37858 29853 31462 29977 48668 41786 42837 43423
8232 43423 37987 16350 988 6144 6123 -8165 15519 47003 58719 43288 37098 41092 54402
8219 54402 49209 51752 54359 26960 41740 39655 37890 32049 20070 23469 58714 69979 70463 75883
8205 75883 50137 21458 19888 439 16587 38713 16900 37820 63212 56065 12295 5920
8193 5920 -2376 -30465 -19346 -8704 -10994 -17581 -2802 4945 16669 20593 3685 1723 -6120
8180 -6120 6947 6535 24528 33964 18652 31165 47264 31435 -1600 -7598 446 -12833 -12731
8167 -12731 19058 22571 16634 26339 46280 53837 48964 32864 27420 29826 28731 11351 -2838
8154 -2838 18535 19983 38612 24156 -7271 -8094 -16028 -17362 -40596 -38279 -8803 -12854 -5167 8207
8140 8207 12672 26279 9904 22083 22027 34981 48600 25145 -499 -10287 -29131 -51043 -61115
8127 -61115 -62828 -62000 -33223 -5977 -10059 -7 -13835 1226 32255 60928 67533 59036 19173
8114 19173 -21040 -29328 -14180 3994 2344 23635 31375 34100 54971 39488 15120 -2629 -15976
8101 -15976 -15032 -12390 10299 -1285 -21865 -12600 19575 53950 35338 18201 38938 44601 30321
8088 30321 1093 -22886 -37845 -8969 10228 19284 14289 -4198 -4419 50565 67142 72203 52649
8075 52649 33198 39317 57213 61832 36845 38636 37445 9708 3419 10334 35774 46531 52384
8062 52384 53576 79162 59704 51304 65641 55120 44175 24474 14514 26690 20867 34259 76190
8049 76190 77862 90804 92780 104534 125113 127089 97818 99899 124972 148820 161907 157237 162443
8036 162443 152215 151872 146924 124136 136163 157461 116482 100704 112196 133608 126854 121830 95932
8023 95932 85138 52743 55498 70323 100111 100767 85119 104551 91389 78291 108126 130100
8011 130100 140772 153860 145203 126097 133763 132390 129431 127495 132750 162202 171370 197092 231590
7998 231590 304499 389721 455953 478937 442604 388120 341625 301359 267985 257428 203003 158953
7986 158953 146822 110177 89742 89089 126871 125656 104569 101349 111481 96900 54728 77752
7974 77752 92673 85957 110029 109127 87915 81644 80514 75800 83594 76138 85409 97938 93000 101903
7960 101903 120398 121087 145604 203666 237055 194125 172940 173705 195067 221185 228639 232240 214652
7947 214652 196218 175729 184299 162880 124505 96809 71833 59100 39661 32243 -8251 19184
7935 19184 52961 24583 39371 48777 55509 95762 92348 44689 11436 29452 70678 75845 80264
7922 80264 77378 60248 46802 63105 62057 32307 19032 24465 29576 4114 -16395 -850 36182
7909 36182 69755 95367 74020 60628 51950 53269 66671 67663 58101 47389 50421 42539 19276
7896 19276 20511 6320 -41546 -54688 -56638 -43557 14755 34783 18772 20722 39349 36740 38759
7883 38759 28421 37089 48052 59445 56736 66934 71201 43107 9217 -20747 -23667 -10004 -6295
7870 -6295 23717 28132 4596 -25953 -20573 -4811 5119 15499 27404 -5554 -27432 -35179 -46405
7857 -46405 -49874 -33343 1476 15777 23788 3784 -10162 -2375 -6370 -17199 -39948 -26883 -7565
7844 -7565 -22554 -48957 -53203 -50729 -43665 -47588 -44360 -29896 -6083 -12920 -26151 -25284 -21671 -11147
7830 -11147 8982 -7253 -17135 -36023 -18013 9543 18316 -3464 2285 11004 -14762 -20639 -19636
7817 -19636 -24756 -22359 -4770 1995 -24990 -26736 -26934 -26876 -15851 -10736 -20511 -28723 -30279 -1489
7803 -1489 18077 21045 14157 -2224 -704 -12780 -5483 30583 38049 24337 8967 -18558 -27427
7790 -27427 -21606 -23242 -19377 -13849 -12293 -15005 -8886 4448 -18212 -31156 -16251 9435 22399
7777 22399 22758 22786 7192 -9079 945 4568 -3423 -13597 -4162 -12211 -10245 4139 31474 43862
7763 43862 39446 5211 3742 6366 26113 49028 58801 59740 33055 6265 -579 -20845 -50716
7750 -50716 -62771 -48704 -30763 -25195 -27909 -13739 29795 25291 -31173 -41726 -12000 -8576 -1122
7737 -1122 4830 700 21874 -13524 -59923 -60723 -55471 -52876 -37799 -36359 -55141 -64885 -69685 -67989
7723 -67989 -63843 -37991 -13096 -11856 20773 43455 46363 16271 8237 8885 -32128 -32037 -48455 -69038
7709 -69038 -65596 -33045 -2855 4754 14918 37382 21444 6260 15767 26169 20403 22428 29280
7696 29280 23799 -4657 -20628 8504 28494 54248 48829 16131 -5581 -8913 -21842 -26905 -5121
7683 -5121 -8559 -8068 -9781 -220 2997 561 8272 9904 50425 14248 -14464 -40215 -59310 -46933
7669 -46933 -9163 23419 17790 -22022 -48990 -36975 -25920 -13008 -2574 -9613 -24525 -12915
7657 -12915 20940 48400 15721 -19772 -23486 -2965 45747 55814 49438 50146 17739 -13624 -25418
7644 -25418 -20080 -28249 -28969 -27174 -13174 -9430 6621 39490 47349 17714 -1683 -7284 -12951 -3453
7630 -3453 19618 35902 36465 54322 20989 17129 9576 6996 -16079 -30345 -37820 -53799 -48041
7617 -48041 -18228 -3410 -30762 -27535 2995 20339 48689 60306 47127 31689 8308 2341
7605 2341 7442 21451 -4672 -21901 -42424 -58672 -48117 -31235 -38051 -8834 58665 70317
7593 70317 50168 1751 199 13718 -15776 -28090 -41761 -44880 1820 622 -13138 7438
7581 7438 8455 -20146 -34927 -48734 -40000 -31409 -31875 -26807 -22373 -27326 -24726 25523 15702 -16081
7567 -16081 -17531 -30747 -32089 11924 50761 16077 15832 10619 -1698 3040 -34995 -56220 -53642
7554 -53642 -40768 -33397 -32084 -33577 -39568 -72303 -50805 -30277 -24372 19507 47447 40820 753
7541 753 -300 4144 -10917 -26352 -35228 -19536 18808 29633 16471 -13891 -26227 -5576 -4508
7528 -4508 -30084 -27133 16074 31702 -14150 -37912 -38829 -45604 -22197 2925 -18083 -5531 14012
7515 14012 32916 39878 49459 61041 43744 4274 -14476 -14019 12047 17786 706 10944 38505
7502 38505 49944 54977 63348 50980 54147 44020 23210 9694 17007 -3941 -14619 -1858 -1393
7489 -1393 -4330 -25986 -33557 -32832 -17115 -9770 -9700 -21682 -12094 6251 -4281 -9263 -41877 -50689
7475 -50689 -40520 -30501 -18026 -2549 -12867 -29205 -14681 -10980 654 -18078 -50925 -70591
7463 -70591 -53148 -41835 575 2596 -18227 -47809 -27478 13450 25455 -10984 -41753 -46753
7451 -46753 -30836 -20965 -31628 -44901 -34146 -15499 13207 3563 6876 26081 24096 42447 32456
7438 32456 33798 24309 8305 -12017 -19986 1496 6521 10192 -15469 -19398 -4778 -9786 -18589
7425 -18589 10370 46986 30396 10717 -674 4868 -16692 -41334 -50623 -42756 -26664 -41980
7413 -41980 -50536 -31830 -11773 -4053 -21637 -6816 14683 15822 9286 -3113 -7610 -19338 -2017
7400 -2017 4498 -1999 -25633 -2668 7439 -19852 -28990 -43079 -55382 -43040 -21484 -44683 -42717
7387 -42717 -7114 5647 12371 -12530 -24664 -37443 -8185 14225 9770 8805 17043 10844 11039
7374 11039 29105 55190 46766 53849 55475 31959 21034 -8053 -35268 -26474 -1663 12342 3609
7361 3609 1111 21215 36735 37946 54401 49088 44676 30646 25099 16690 24501 33140 16154 18418
7347 18418 27023 2558 -33682 -29164 -1871 24386 -12809 -39543 -28284 2692 7110 -11505
7335 -11505 -12279 4849 -2929 -10932 -16030 -37331 -20113 -19493 -22894 -21037 -26621 -33661 4228 14923
7321 14923 17837 18698 -5123 -16506 -36429 -50569 -49163 -43601 -10987 13810 -6835 -39961 -40246
7308 -40246 -19237 8679 21907 51877 11875 -7472 25920 32581 6730 15056 45530 46857
7296 46857 25321 31841 20097 -4524 -18710 -44869 -55223 -29590 4098 -5304 -33265 -30381
7284 -30381 -24859 -789 -270 -31463 -39440 -19802 -4915 -31657 -40923 -9251 18140 13090 8698
7271 8698 -36749 -76757 -96087 -86952 -44498 -15637 8577 -16763 -12144 8197 32522 35187 16143
7258 16143 17523 29345 24832 313 -10914 -5347 6342 10663 14629 6137 -18631 -2801 5646
7245 5646 -15829 -25322 -19957 -22470 -40088 -36804 -32516 2604 23848 -5180 -12032 -15528 -5338
7232 -5338 8205 -11405 -31410 -31121 -45229 -25729 -14037 -818 2106 1172 -11710 -20237 -2749
7219 -2749 37814 46922 21210 21916 1228 12976 22398 35145 56782 57370 21756 -42 -22768
7206 -22768 -20747 -19049 15587 8895 -16473 -18352 -408 6291 9120 -13755 11018 8772 -31776
7193 -31776 -26372 -36394 -24406 7045 10309 -352 21266 -13077 -31333 -28482 -11888 -879
7181 -879 -34468 -39081 -16637 -18213 -44103 -54781 -45224 -29100 -18182 15440 -10115 -39725 -37062
7168 -37062 -44233 -47497 -82309 -73435 -38030 -10856 -39132 -22666 -36633 -60272 -70989 -60625
7156 -60625 -34268 -19241 -17949 -20712 -32780 -28936 -17214 -5704 -2926 -11865 -30296 -55512 -28211
7143 -28211 -15068 5147 2939 16478 29967 32640 32355 11024 5694 22376 22710 -8699 -36383
7130 -36383 -22312 -6518 8481 -16057 -42651 -9341 22130 21508 12798 38221 58749 57042 41556
7117 41556 20354 5433 12106 10976 -2315 -19716 -5899 -614 -27664 -57759 -62630 -33627 -14233
7104 -14233 -33006 -53333 -38697 -39663 -12558 -6635 19908 10650 580 924 29929 4987 -14806
7091 -14806 5793 19800 18930 2338 6310 6469 21152 47600 48123 8350 -33424 -23185 -11219
7078 -11219 -12299 -15887 -9168 -14388 -36515 -3852 21372 -476 -6056 -27266 -22931 6137 10322
7065 10322 -8228 -29654 -12459 -1269 -712 24651 15749 -11734 -4199 -911 -25165 -7998 7619
7052 7619 23991 35356 33914 36045 51446 25005 -11486 -3926 3523 19514 14097 -2867 -23145
7039 -23145 -32244 -8087 6622 -21169 -50308 -53321 -17867 -18932 -25183 -23935 -613 -5043 -2533
7026 -2533 26279 11277 -21065 21490 33824 54332 79836 54498 -4193 -15060 13871 12666
7014 12666 -8235 -36604 -45333 -20691 -17317 -19799 -21643 -3105 -41882 -58821 -61726 -54972 -29747
7001 -29747 -11122 -4163 218 13045 21331 -2011 -11611 -19997 -12047 -19972 -25389 -29828 -25299 -28068
6987 -28068 -26771 -22415 -33658 -64299 -38500 5646 26045 28314 27986 46002 78421 85840 95639
6974 95639 95871 79026 52984 22739 16785 -26519 -24330 -5638 -17438 -40311 -42443 -30425 -9995
6961 -9995 8658 26419 36020 36360 -9282 -37175 -18486 12761 14431 26768 68399 68384 42713
6948 42713 38626 17437 -10532 -5993 23724 28342 34186 48512 42408 46993 35089 -28432 -44963
6935 -44963 -17371 -52322 -53819 -44261 -20480 -27199 -45190 -30849 -29297 -44176 -45078 -35183 -35503 -17306
6921 -17306 -18805 398 2800 15928 39918 21045 1592 -12509 -40906 -23867 20547 45151
6909 45151 35962 24258 18694 16026 19843 19756 31235 44030 6984 -26326 -35159 -42861 -39727 -25292
6895 -25292 2698 -1574 -10175 -31829 -39360 -22323 -46434 -32832 -12923 -22888 -15681 831 -5059
6882 -5059 -46689 -58683 -39939 14032 20613 15876 13801 17450 -5436 -32620 -43321 -44001 -30063
6869 -30063 -17294 16785 15548 -7296 -12519 -18671 -15145 -7255 -53331 -42837 -36329 -26222 -35935
6856 -35935 -55922 -60331 -24095 -1249 2328 -52 -6752 118 15266 14874 18308 -998 -13873
6843 -13873 -21331 -28074 -43498 -54609 -30049 -6295 -5037 -27049 -39050 -44868 -28791 -9016 -822
6830 -822 -23907 -41239 -42266 -39960 -46385 -56263 -54534 -4728 33364 1385 -27816 -16374 -12095
6817 -12095 21663 22974 14798 -7160 -30437 -47049 -33141 -41848 -44106 -11212 10853 46455 44197
6804 44197 20980 12092 10575 6496 3511 14566 23873 -6224 -28004 -21859 -13810 14553 30909
6791 30909 7299 11256 45034 42301 36706 16565 -3749 -24959 -38718 -47854 -39664 -1615 -19597
6778 -19597 -51032 -41325 -2633 8126 4522 9842 17743 -8263 -17989 -27830 -28506 -44791 -43431 -27686
6764 -27686 -6448 14669 5061 6546 9826 5078 19499 7201 -24550 -51157 -41196 -40800 -33105
6751 -33105 -31736 -24292 4893 26292 14887 -1850 -759 26430 18811 -1194 -3754 -7956 -3415
6738 -3415 7551 -8088 -24898 -19986 -28081 531 27288 24645 17978 19180 17922 370 -19828
6725 -19828 4486 25048 16218 16399 -154 4084 17060 55475 101674 100465 63299 25585 1272
6712 1272 5111 -1227 22661 36503 36740 33698 8706 -4924 18332 19270 8316 -21142 -21803 -8398
6698 -8398 -23362 -17317 -24645 -13427 -10527 -6725 6988 -8448 -28681 -17037 -13228 -37319 -27084
6685 -27084 -12811 3289 12226 6169 -10006 -9596 -26000 -35716 -22922 23698 -4248 -21566 -15230
6672 -15230 -19263 10158 35527 37067 27294 30843 31257 42787 30055 18695 17611 -40789 -37326
6659 -37326 -49957 -50596 -36491 -32310 -18154 -2049 3493 8658 5553 21022 22673 21714 35380 46019
6645 46019 40054 32648 10512 -8336 -5831 15437 -13125 -28578 -1377 11588 -21738 -38328
6633 -38328 -22614 -25710 -11585 18013 37026 28440 -8482 -19709 -28975 -68 -11367 -24670
6621 -24670 -11905 -5850 -20057 -14981 -10062 -20125 -1407 10677 2870 -3595 16809 32140 15067
6608 15067 23801 22635 8738 23830 15169 -10314 -34432 -22003 -3937 10389 -11169 2853
6596 2853 -6988 -13908 1394 -16156 -40622 -44865 -29056 -15145 -15484 -24746 -16825 -4910 -19353
6583 -19353 -7890 16032 44050 52573 19246 6634 3356 -998 -3386 -14769 -36479 -42556 -35008
6570 -35008 -20786 -21199 -32924 -27954 -42119 -57991 -41116 -17955 -15918 -13498 -7177 -6551 391 -910
6556 -910 34022 40038 43647 27856 13121 18433 2271 -21420 -41187 -45422 -13446 -1898 1262
6543 1262 -7507 -35197 -50422 -54726 -63984 -42315 -50273 -51519 -32702 -3989 15461 3935 -9124
6530 -9124 1724 -7917 -11563 2665 6595 -5656 -25082 -11953 -1443 -10386 1128 6447 -29574
6517 -29574 -69309 -89917 -97557 -111187 -94628 -61858 -45558 -47034 -42124 -33512 -29297 -11657 -28006
6504 -28006 -19764 33594 44577 -5578 -42674 -27564 -11722 4612 3858 8069 1119 -8864 -281
6491 -281 -18190 -59718 -22520 -13253 -22844 -35819 -35770 -50277 -47630 -44414 -58303 -75937 -90793 -90062
6477 -90062 -78132 -52058 -37453 -57238 -67607 -48822 -48337 -37983 17012 44389 35285 44923 5956
6464 5956 -15699 -35179 -47937 -71731 -61733 -19005 -14721 -26199 -6811 -4228 -5240 -19840 -25310
6451 -25310 -35961 -36931 -34502 -21816 -31779 -42880 -29753 -2790 28625 18533 -103 -17376 7136
6438 7136 22766 15232 -14995 -4864 -8130 -21995 -21911 -38613 -33110 -27607 3565 5416 204 -7901
6424 -7901 -28077 -50646 -48648 -16568 -10921 -36467 -40490 -26802 2342 12354 9287 35253 36753
6411 36753 4112 -25118 -8868 5404 -20791 -20876 4443 21185 39930 21464 18334 -4334 -13936
6398 -13936 2834 10870 -106 -20594 -34295 -6380 11888 15637 4831 17058 17813 -8623 4128
6385 4128 23253 -25291 -64188 -38484 -28498 -32637 -24398 6582 -2792 -15641 -46481 -68540 -71037
6372 -71037 -47489 -34576 -18123 -13922 -31071 -20027 33604 55970 44427 19773 4827 1081
6360 1081 -16845 -16342 -7165 -28735 -49962 -52905 -43094 -29407 -27316 -40047 -74999 -61847 -42306
6347 -42306 -51459 -38980 -21312 8758 3818 11580 17505 -18736 -44402 -57722 -46251 -6742 711
6334 711 9208 -1296 -32154 -18984 11648 6249 -27722 -34019 -13253 -862 1038 1657 -9615
6321 -9615 -27965 440 29112 40325 48686 41581 26969 23529 -7178 -12516 47 3789 -5150
6308 -5150 -773 8189 -28154 -52894 -20397 -16067 7080 16949 10207 -1680 -12156 -29145 -15852
6295 -15852 22249 31761 1205 -2234 7630 11477 44573 50688 58131 75009 51554 32849 -216
6282 -216 11198 13067 38251 25986 -511 -2125 25534 56550 34042 11193 4418 4933 -5394
6269 -5394 -21621 -16779 -2825 16878 29654 34563 21608 -3288 -36170 -41116 -24909 4971 13554
6256 13554 -3401 -29062 -29186 -37380 -18021 -9388 -35527 -17392 15495 30111 27600 7016 -10843
6243 -10843 -19547 -21115 -30081 -43652 -22466 10635 23997 6933 -23713 -25652 23412 41581 29165
6230 29165 18216 35403 17427 -28124 -44931 -35389 -26201 12514 14313 1920 -4726 14820 11925
6217 11925 9899 17246 -5915 -13841 -760 102 600 -16378 -19847 -2510 -2549 -20981 -32523 -57097
6203 -57097 -61634 -43710 -36537 353 16373 1728 -10495 10319 21671 4186 3721 -6210 510
6190 510 28820 32929 8546 -12393 -7498 -6442 -6177 2418 8688 26590 13314 -6802 -6079 -11915
6176 -11915 -23665 -29243 -41028 -60989 -44835 -10966 19362 22238 3980 -11733 -36590 -32652
6164 -32652 -70726 -48537 -5804 3322 -12463 -33282 -13751 19581 19118 16270 3214 8708 -103
6151 -103 -18465 2107 25887 24050 -4923 -9113 -6340 -21210 -22747 -25442 -51428 -68968 -57456
6138 -57456 -44452 -5432 25531 19850 9252 -30159 -66352 -59714 -35314 -24457 -46767 -39781
6126 -39781 -2623 19199 33804 61640 63090 34356 45292 43960 37358 20837 10329 -4614
6114 -4614 -3133 20951 -6369 -26803 -11953 -24182 -53895 -52791 -61816 -45253 -30803 -11832 -11815
6101 -11815 1376 -3027 -31284 -44653 -63634 -55621 -32502 -32986 -38757 -24183 -25083 -17190 -13922 -40203
6087 -40203 -61451 -45126 -48322 -36554 13558 29125 4556 -4737 -1505 33352 22356 -9299
6075 -9299 -40567 -55171 -52774 -11332 3272 -4722 -10088 13814 36241 34560 3013 19425 23936
6062 23936 19421 14526 4038 5811 -7804 -11333 -6925 -9275 -35021 -20516 2397 8824 22706
6049 22706 31556 42585 18314 -1731 -34274 -35820 -2461 35428 32858 23225 15153 14583 21697
6036 21697 -15366 -7159 13274 13732 23579 30321 31103 19514 7177 647 17311 -10137 -12777 -28259
6022 -28259 -32450 -26853 -15264 3673 -5875 2241 32232 62779 72792 81205 84372 43770 3428
6009 3428 -17822 -36266 -59980 -72107 -30080 8760 38909 54755 52505 21565 11484 15773
5997 15773 -3935 -13350 -25254 -15686 -15347 -28653 -31223 -23428 -16355 -22070 1313 7708 -9919 -26182
5983 -26182 -9285 -10560 -7233 -14528 -2719 -3657 -13109 -23822 21379 51749 34024 11681 11359
5970 11359 793 3953 18084 10729 7609 24046 45548 13496 -9233 -10515 -33987 -48278 -27166
5957 -27166 -44934 -11255 -10111 -17624 -15665 -29263 -41053 -18645 -9981 -17392 6911 50812 44669
5944 44669 -30835 -29219 -6215 -5990 -17945 -39591 -24666 -12654 5035 12020 19596 24683 -6561
5931 -6561 -6527 1372 -6392 2271 468 4833 8043 -15488 -38044 -49207 -29767 -48271 -17325 7417
5917 7417 -3415 -21061 -40234 -46918 -26991 -12224 -20482 -19629 -37956 -46392 -43896 -43780 -23981 -17380
5903 -17380 -35460 -39940 -21646 -28674 -65959 -73465 -57954 -2627 -7589 -1866 156 18083 3441
5890 3441 -12590 -15490 -11036 9369 18378 -22152 -49009 -15630 28840 24995 -18106 -22809 -8141
5877 -8141 -16279 -26609 -23990 -34866 -16793 3835 1359 25388 20317 3359 1774 -22415 -16075
5864 -16075 27713 44776 36685 48499 41158 41263 42397 18663 561 17174 20864 12828 23209
5851 23209 48253 45588 27893 12490 10381 418 -7176 -23334 1115 12438 -1741 -32086 -4585
5838 -4585 -1167 -6461 13485 45642 66772 25028 -5880 -16809 -24715 -38650 -29540 26344 50191
5825 50191 5161 -50854 -45452 -23562 -16924 -18938 -20981 -28894 -26757 -28096 -36178 -38000 -58268 -68673
5811 -68673 -65721 -46895 -73742 -99696 -93496 -59651 -53540 -50805 -32323 -12238 2457 10306 13776
5798 13776 33724 31805 -1898 -6808 -5810 -32391 -21491 29614 23273 -37488 -44577 -37095 -56727
5785 -56727 -65389 -7458 -1739 -36643 -50551 -65264 -99859 -84213 -67222 -63795 -29486 1057
5773 1057 17947 5538 20021 25664 19604 25660 -8330 6144 36924 1318 -33693 -8513 -1199
5760 -1199 3725 -6214 -20653 -16752 -3364 170 31950 31133 36198 19329 -12488 -8044 12153 -12951
5746 -12951 -5355 26056 -7017 -28927 -7674 -19647 -33510 -21220 11186 13912 15831 8595 -17602
5733 -17602 -25911 -4654 -19073 -39467 -60215 -59653 4970 16796 15979 43694 49621 58404 38905
5720 38905 -6587 9997 19521 31558 40216 4482 -5083 -7517 4495 -4763 -36438 -47227 -22669
5707 -22669 10128 29919 42124 75995 82904 76394 69107 58357 41585 40996 40224 34158 20402
5694 20402 -3054 -12220 -24960 -33168 -24280 -22234 -6233 7320 22699 37021 36462 28193 -3021
5681 -3021 -40462 -46125 -23983 -29851 -33729 -30825 -8708 4203 12858 -3575 -6158 2249 -1936 1892
5667 1892 8244 4303 -4738 -8368 2241 16460 -9517 -6020 23423 36090 34530 41330 41633 -4702
5653 -4702 -18978 -22566 -29241 3105 54926 83642 56760 18353 -7360 -15940 -27035 -26193 -17273
5640 -17273 -12814 9607 -10366 -29764 -12044 -8464 -16708 -30861 -55255 -38248 -39284 -29708 -11490
5627 -11490 -5995 1247 6830 15931 33211 31371 15236 14824 23341 24390 25297 17908 33088 33028 13929
5612 13929 -19648 -25323 -153 -1071 -23319 -57846 -51725 -25857 -3436 3316 23371 27490 2801
5599 2801 -12277 -21615 -40173 -20917 -2971 -21403 -33605 -16691 11207 -3953 -1793 35561
5587 35561 37348 37102 35082 -2731 -30417 -45407 -7957 28626 34760 28060 4285 -4618 -709
5574 -709 -38120 -24916 -921 -453 4189 46222 40664 10984 24436 5513 -33692 -34050 -17083
5561 -17083 -12498 16916 -390 -30388 -21359 -32099 -10643 7785 22066 13328 13686 -25939 -36978
5548 -36978 -25605 -14903 -18517 -20609 -20100 -39783 8451 40032 29500 21296 36396 44693 18597
5535 18597 33666 36260 14485 -13062 -17345 14647 21230 4679 -1108 4032 -20277 -36795 -61845
5522 -61845 -45448 -2513 -2377 3477 4716 8222 3128 7635 -31908 -38447 -40635 -58130 -60467 -46575
5508 -46575 10509 20185 42960 61826 45447 37742 42295 27603 20991 17946 -23725 -61985 -70459
5495 -70459 -62514 -22071 19442 37167 44475 27484 21256 -886 -7647 17850 8442 873 -10909
5482 -10909 -32404 -26941 -8811 15700 14797 9184 -1658 -8603 -4657 -7488 -14538 -27378 -42158
5469 -42158 -52367 -54943 -30830 -11698 -21603 -40632 -45403 -29552 -25738 1898 -2780 -31095 -12176
5456 -12176 9306 65112 51315 38019 21672 13445 20323 16630 9222 4224 -9381 -16490 -19976
5443 -19976 -13274 -24623 -30051 -39975 -48016 -44717 -37666 -39281 -46242 -73757 -47191 8418 34803
5430 34803 41566 24648 4796 33719 20360 10858 36111 65733 60847 49323 32213 -11748
5418 -11748 158 -914 -30196 -25057 -25626 -25474 -1841 8474 27063 20352 19184 -804 11471
5405 11471 4815 -1183 -12765 -3123 33828 50612 31855 65594 45883 47544 43700 21255 27961
5392 27961 31537 33512 43960 38342 3098 5403 12015 11282 36780 56719 52119 63089 40227
5379 40227 30643 24166 20670 17395 -8337 -13471 4764 -4732 -21595 -38984 -59967 -55705 -59955
5366 -59955 -46600 -19834 -15412 -23575 -30050 -25619 -36711 -45326 -34694 -28409 -10127 32709 21579
5353 21579 17409 28883 -1618 -17739 -22600 -23666 -18737 -18726 -43995 -54882 -28203 -8663 7423
5340 7423 6987 5610 36090 37444 24615 19853 698 -15814 -27428 -20340 -16528 -6274 -16796
5327 -16796 -16068 -33178 -72150 -73072 -50227 -27016 -20131 -32333 -61317 -75182 -62820 -15793 -943
5314 -943 -12240 4070 31072 -1351 -10711 1972 30945 39260 38480 27023 4238 6745 22649
5301 22649 -28430 -33249 1531 56340 70288 36917 39237 37664 21963 10437 7607 1573 -43442
5288 -43442 -45566 -11558 20664 23306 10951 14280 2274 14560 13474 15378 2752 -11206 -9792
5275 -9792 -12847 -31762 -17379 -3287 22939 11643 -7047 -7779 8900 4344 12608 44592 49357
5262 49357 19765 -2318 9665 30171 37567 10251 -23662 -28883 -41982 -19466 1858 -29361
5250 -29361 -36943 -6650 7894 11199 7084 -5115 12594 15276 17274 36625 14763 -38957 -50618
5237 -50618 -38997 -43404 -24786 -2401 -11488 -48619 -25941 -17069 -34738 -28645 -44501 -52966 -52420
5224 -52420 -31801 -30766 -563 32507 39797 52390 52724 58835 41859 40171 27461 24169 -7431
5211 -7431 -27814 -29808 -38891 -16518 -7171 27467 20487 22194 2651 3704 -9099 -20255 -21476
5198 -21476 -28022 -34081 -38831 -36188 -29542 -10883 -30073 -24202 -3050 -9098 -52730 -76153 -62771
5185 -62771 -43378 -16035 -6502 -19747 -11475 -19452 -29721 -17986 9233 -11327 -24270 -28464 -1785
5172 -1785 6325 -5592 -32667 -1458 20978 -7796 -29480 -24092 -3961 9267 6752 5128 6588
5159 6588 2821 7677 -14133 -36273 -18901 -20663 -18444 -15580 -48947 -38609 -42091 -4063 41905
5146 41905 22072 -29589 -56427 -54057 -50021 -9228 2875 26017 34777 20219 15591 -1074 -55
5133 -55 13150 26112 18882 -12494 4676 11758 9822 4674 18032 15789 987 10109 2070 10690
5119 10690 -7468 -42162 -31193 3560 9819 9126 -6876 -25161 -22445 981 -3410 28658 45483
5106 45483 19396 1926 -22896 -41442 -48958 -30569 -38541 -60855 -46269 -39837 -5688 -5752 -40393
5093 -40393 -76357 -77679 -48089 -25240 -23860 -14332 -47859 -70290 -75318 -47765 2544 -15581 -31374
5080 -31374 -13721 -17141 -45282 -72306 -58142 -24733 1793 8393 4137 7143 22561 36692 35295
5067 35295 32062 36475 49810 39296 26789 43145 18561 6898 -4412 -42554 -48692 -43213 -24253
5054 -24253 -2725 6476 10766 -5464 12330 23304 19752 -24111 -50621 -58681 -43356 -5921 -7185
5041 -7185 13572 27184 38711 7493 -9192 -11826 4972 22604 -6615 3820 -25437 -40227
5029 -40227 -31107 -20348 -14383 -6086 11348 -5097 -22506 -29715 -43696 -49639 -16766 -42305 -60433
5016 -60433 -56680 -61020 -45204 -29410 -39597 -24899 17733 23773 29738 27600 28981 -1593 -15853
5003 -15853 -19728 -4675 -2910 3747 15688 30183 20879 17286 23474 48382 32232 17549 17197
4990 17197 23955 16302 3553 -13396 -5946 -2165 -23717 -7863 -19254 -4391 12474 -21062 -47547
4977 -47547 -39334 -12219 -6141 -11903 -12937 -8061 5905 17341 26772 14781 22242 533 -12631
4964 -12631 -21320 -22095 -13586 -9707 -1826 16072 -6965 -37458 -42171 -48232 1875 49110 29864
4951 29864 21791 22129 7996 -2218 -16831 -28834 -22699 -14335 -17206 -27199 -63651 -98511 -83957
4938 -83957 -47213 -6585 20669 47343 24567 19154 -10066 -35532 -53258 -35451 12140 5484
4926 5484 -21719 -58913 -54812 -27571 -4856 -6525 -26582 -23123 -8346 35360 45509 35864 27673
4913 27673 18879 3621 -4668 -1527 -15436 -31862 -44760 2631 23795 39381 29316 15753
4901 15753 8392 20664 4318 -6893 -6014 9110 18003 33238 27288 31711 43941 43683 35621 18391
4887 18391 14193 1680 -33939 -33287 -36624 -34039 -32141 -63044 -68007 -56808 -33444 -20666 -4113
4874 -4113 -10372 3533 16904 38313 47754 53272 35672 -878 -23672 -41553 -55996 -47824 -48451
4861 -48451 -37569 -6601 -14626 -22756 599 -8423 -65021 -58232 -8619 24189 12411 9187 10573
4848 10573 18190 42227 44960 26837 10448 6220 1582 29023 55659 44615 11057 17508 15973
4835 15973 2159 18335 44800 59271 36975 20160 8034 -1608 -3201 -23820 -45208 -66916
4823 -66916 -85075 -45492 -26048 -28047 -37642 -28075 7496 40985 20246 3974 33794 22159
4811 22159 29829 27428 -734 -14087 -25508 13834 42666 46401 14580 6246 27787 36171 49253
4798 49253 8386 -10111 15634 9671 -20965 -30948 -4631 -3664 -2094 -34802 -63904 -61148 -63952
4785 -63952 -43329 -42321 -43995 -35612 -45036 -37141 -18460 -9424 -15298 -2526 38390 40960 24967
4772 24967 803 -21447 -12956 18255 14681 343 25816 -9761 -50078 -54433 -32333 -5948
4760 -5948 14758 10382 -10297 -15966 -5604 -15720 -1303 18225 25887 22577 20738 25072 10838
4747 10838 19585 3338 -40044 -48648 -52738 -55407 -55504 -21493 -10468 -18617 -15795 -13662 -13083 -19302
4733 -19302 -39671 -9585 15571 16000 31650 48894 14422 -9097 -14759 -34656 -46193 -41490 -17406
4720 -17406 -12302 -1469 -7414 -20231 -6291 12806 -3065 -34964 -14147 -6410 -1706 -5463 14309
4707 14309 33081 9113 -1752 40129 57698 52761 20051 -13428 -15554 -43430 -50121 -77489
4695 -77489 -82942 -68619 -75793 -83763 -68850 -48779 -48330 -40328 -23401 -20686 -38956 -20403 -111
4682 -111 33400 37619 49928 33436 32230 44920 35402 36176 52896 43732 30532 11403 -9054
4669 -9054 -35042 -41001 -39206 -9968 -19055 -25373 -7892 -21969 -43165 -18060 -13291 -36428 -26878
4656 -26878 9085 13149 16776 -7888 13346 27427 34422 25413 14330 4353 -6554 -12566 -10683
4643 -10683 -10867 -9588 -2925 -1346 10529 -10822 -55127 -78468 -58103 -22944 6402 22469 26465
4630 26465 1808 -13425 -12232 -7798 -7813 8255 -10427 -30258 -27152 -19475 22156 10814 18765
4617 18765 18124 30030 39432 54346 67067 68591 81763 56353 39383 12782 -22402 -23265 -16747
4604 -16747 -1565 8650 22790 116 -30819 -29309 2667 48173 56744 21970 -2690 7947
4592 7947 -9505 -7528 -32175 -20316 -18180 -729 43896 43519 16705 11078 41177 41846 3549
4579 3549 -27604 -14399 4310 -7340 -24253 -28507 11274 40201 40778 15422 12667 -4833 -4575
4566 -4575 -23264 7692 1475 -3772 -4901 7237 -10148 -22153 -30862 -1615 26782 33326 14831
4553 14831 12138 -15599 -32698 -26387 -33742 -29111 -2834 19559 27645 3263 1022 927 -31679 -33081
4539 -33081 -49640 -42704 -16338 768 32181 26560 37251 48867 26913 -6169 -25294 -22546
4527 -22546 2478 40014 36615 54456 31926 21952 -336 14137 39778 61122 55172 31872
4515 31872 1540 6163 18637 12773 6337 16234 19673 32165 33195 18281 28218 26532 28961 8926
4501 8926 -348 -15576 -835 -7502 -18519 -23393 -41508 -62977 -47965 -23208 -24923 -21604 -809
4488 -809 20247 18348 2273 13 10919 -497 38017 29874 -12527 -28152 -17082 -38006 -35436
4475 -35436 -19538 -5684 4905 -7618 8239 20494 10395 7853 -6628 -9627 -11991 -32979
4463 -32979 -23547 19169 50481 44620 3238 -29552 -43371 -45785 -18312 5742 13693 -13605 -16972
4450 -16972 -24855 -22122 -4986 16076 26307 19046 13329 11362 5062 -918 -7280 -21816 -24823 -23262
4436 -23262 -14079 -9616 -26389 -8622 19865 16552 27087 19309 -24619 -21197 -21621 14390 11070
4423 11070 -13388 -41097 -56186 -44952 -44112 -21674 -8818 2687 29804 -96 -33401 -30993
4411 -30993 -15777 -5918 -18738 -15840 -3524 30612 18416 -26781 -51706 -55236 -75744 -75728 -60881
4398 -60881 -48542 -76729 -56988 -16414 -38802 -46034 -27958 -10296 -15837 -20416 -11122 -1696 5900
4385 5900 21151 18703 19558 39808 26770 16414 5639 -4731 -7494 -53 27823 -13205 -18030
4372 -18030 1998 7210 15160 9601 538 -4075 -5027 9128 5984 -6183 6395 4470 18734 18785
4358 18785 11482 -5376 12138 18342 -1987 -22898 -2966 16582 35118 72236 73471 53278
4346 53278 70588 43734 -15547 -46180 -59464 -33206 -3444 -24349 -51331 -25592 -17369 -45266
4334 -45266 -51173 -31453 15832 36792 34392 59920 45854 4313 1902 16991 -6556 -53577
4322 -53577 -43516 -1585 -8108 -55166 -79895 -78854 -56607 -60433 -61458 -56163 -17417 -25056 -23899
4309 -23899 -15102 -29174 -14732 -24195 -39194 -23228 -4725 18186 19097 17838 16112 36192 17317
4296 17317 6012 -8274 -17407 -28023 -28797 -2064 8724 -6778 1878 36512 29037 -12739 -32967
4283 -32967 -30240 -1696 17733 19406 -6864 -42765 -60944 -39928 -32119 -28020 -61653 -92000 -91732
4270 -91732 -58582 -62699 -43833 -15387 -6676 11468 7353 9349 49169 70809 65407 24333 -1716
4257 -1716 393 -4866 14320 42689 18033 -16236 -16784 -7499 -26470 -28888 -13338 -7322 9485
4244 9485 4297 -1208 590 22971 16247 24267 28561 24841 22204 11415 -10411 -19720 -11097 4592
4230 4592 -32871 -37019 -38960 -28385 -8939 -3396 -11467 -17723 -40030 -50478 -30163 -48669 -71407
4217 -71407 -58946 -67831 -75346 -30972 -18927 -24090 -23677 -30548 -9552 -10018 -876 -3525 -8703 -640
4203 -640 -7609 20146 36464 42049 39038 31034 37286 19771 -11010 -8492 14586 41324 17896
4190 17896 -11672 -15458 4771 12015 -3327 -21373 -18055 -13996 -17826 -16210 7265 -7050 -3886
4177 -3886 3218 -1942 29523 41465 21976 -12854 -1828 -4310 -14376 -18045 -30727 -12450 2434
4164 2434 24354 14329 -6091 -17402 -22036 -28667 -12685 -13536 -44334 -40666 -9745 -5541 24598
4151 24598 14698 21472 28573 27537 33811 11633 10065 15426 -12264 9633 2252 -7402 -22596 -38239
4137 -38239 -17523 4967 3229 4089 -12523 -17746 -27199 -27550 -31844 -59881 -44101 -7548 -27314
4124 -27314 -30451 -27005 -29255 -29154 -41309 -11917 28725 22295 -2272 -25970 -44768 -20249 -9714
4111 -9714 -20247 -25459 -21111 -17688 -12928 944 17870 38477 38964 11280 -11678 -6426 -6884 -3020
4097 -3020 -14076 -27253 -40849 -57081 -40813 -27387 -20103 -33932 -20466 4931 -11227 -28655
4085 -28655 -49483 -71323 -52490 -25528 -20152 -14333 15613 -4114 -5267 -5814 -32873 -6927 -3521
4072 -3521 12667 39992 46703 32355 29839 31087 14718 508 -3749 -6044 1394 -2038 -13897
4059 -13897 -5407 8935 12762 21966 9426 2903 6746 -535 9408 8329 187 -27557 -14666 -8749
4045 -8749 -22745 -8793 -9730 5642 11445 -10419 -12622 2148 -11187 -13937 4743 4178 753 14531
4031 14531 24062 24826 25503 19995 15646 21262 22797 20268 38471 44048 27797 46067 69332 78496
4017 78496 88652 56972 44009 18489 -2728 14668 24809 45604 26567 21095 14990 29
4005 29 2812 -10003 1200 38507 29867 32167 40154 52168 52787 34351 10043 -3516 11541 10480
3991 10480 -8042 -3810 2745 7299 13878 50940 50529 15763 799 18904 29472 5816 -29648
3978 -29648 -49782 -44065 -35254 -31473 -20517 -8373 2427 5856 6048 -4393 -15533 -22151 -32871
3965 -32871 -7499 8165 -27850 -46222 -27586 -17848 13049 42598 57509 51785 56178 54130 37046
3952 37046 15234 -10094 -9712 -5328 -8057 -27503 -32327 -30848 -16137 -8498 18425 29534 52273
3939 52273 27822 -31300 -45347 -56788 -17070 32299 9472 -21838 -36059 -66390 -60885 -43358
3927 -43358 860 25471 11532 22565 20057 14566 28457 23382 14814 6427 -24640 -66367 -73183
3914 -73183 -67337 -48877 -36906 -29369 -6241 -24429 -27508 -19869 -22271 -19363 14866 13061 22371
3901 22371 33283 17820 -6952 -4674 -10136 -41336 -52286 -36534 -19951 -45324 -47164 -28085
3889 -28085 -31945 -12870 25813 10523 1755 2071 7787 19944 33594 21270 -6749 -14119 -16754
3876 -16754 5465 15111 -8082 -42541 -54823 -40889 -7993 2897 -12426 -13133 21667 3825
3864 3825 -14815 -27381 -28332 -14423 -2773 -8396 -24731 -28584 -53624 -53002 -27551 -17071 -33987
3851 -33987 -38990 -23750 -19433 -7838 -32230 -68907 -50535 -29687 -21278 3234 25038 21087 8056
3838 8056 1379 -12978 -24436 -26829 -8525 -14974 -18540 -22605 -13881 3590 20686 14705 17408 42309
3824 42309 25713 10634 -15462 -5913 12828 32232 34838 33735 11574 -9982 -14389 -8728 14321
3811 14321 13532 20875 28459 41654 26739 16592 21740 21469 -3433 -23260 -22300 -29201 -49932 -17024
3797 -17024 16506 25489 7782 43477 35205 9017 -39878 -18239 24349 21420 43121 24579
3785 24579 -34120 -26756 -565 25420 29849 27247 -23501 -32551 -52847 -61464 -4973 -12216 -42889
3772 -42889 -18839 1954 -14683 2388 -10206 -25291 -14872 -6800 -10912 18990 24486 -13649
3760 -13649 -16224 4329 -11105 -16548 -24760 7599 48826 6822 -11863 -5789 -30956 -34817 -43801
3747 -43801 -31144 -8982 -4942 574 21315 22929 14005 18898 -5958 -1575 2927 -6378 -14261 -5285
3733 -5285 -5693 -37692 -39033 -30902 -17214 -43316 -44228 -34830 -1274 -8599 6993 20 13674 -9265
3719 -9265 -38655 -19520 -18810 -1549 722 -26098 -17861 -7627 -11450 7373 11360 -1093 -8867
3706 -8867 -646 10481 27346 38149 41627 35628 10502 16166 26017 1285 -14215 -30656 -36725
3693 -36725 258 11471 10512 -9981 -12064 -9559 25623 35166 1764 -46066 -56613 -35374 -27962
3680 -27962 -47303 -48651 -49313 -10292 4727 6272 32612 38655 -7996 -4387 3870 31312 24670
3667 24670 27859 22268 6034 9960 21326 7458 1308 -371 18525 16593 7711 -646 21866
3654 21866 38871 16099 2587 16080 27618 25119 20591 2776 -41140 -38780 -25948 -36588
3642 -36588 -33296 -30475 -34468 -41448 -36665 -25567 -20105 -1757 963 627 2005 19747 8558 17222
3628 17222 10318 32437 58016 43237 53062 46325 -12437 -3576 34313 50781 50051 43246 15105
3615 15105 12812 10656 -16150 -19545 -32602 -34579 -19333 -37291 -55058 -26789 -21759 -32482 -43686
3602 -43686 -38915 -18434 -36353 -49800 -35377 -22161 -7641 11297 26728 11631 12654 16961
3590 16961 4611 26951 -8099 -39487 -30821 -10401 23770 11444 173 -8458 -25778 -46043
3578 -46043 -18392 12568 4870 2464 -27789 -45571 -21449 -2900 -25587 -35697 -16777 4382
3566 4382 24142 25873 21015 29951 18337 -1420 -32796 -47054 -38373 -31608 -6836 54031 77761
3553 77761 91614 96717 80308 52253 45638 35171 41653 31256 45662 46404 46685 50347 39778
3540 39778 34738 53981 83651 53321 -2138 -5587 -11712 7853 23653 -7687 -56938 -22087
3528 -22087 8628 33752 34063 33347 -6009 -50373 -42497 -41335 -34666 -63601 -40065 6937 27644
3515 27644 30618 40345 24042 -5685 -18756 4368 23967 35233 44360 34716 29529 30779 16661
3502 16661 16392 46654 32299 23686 18010 -26525 -37636 -27402 -33350 16187 20054 16519 21050
3489 21050 45055 73223 60398 36907 -2456 -40121 -43289 -28814 -33434 -24554 -8484 9988
3477 9988 21164 12755 7358 22463 38302 16649 3259 -2049 3940 8373 20959 27442 6302
3464 6302 -15061 -26456 -9241 34246 39582 -6300 -349 47276 51607 52794 47012 53030 57455
3451 57455 31307 -20231 -45870 -2285 7619 -380 -48589 -60878 -43734 -29950 -33019 -29284 -18459
3438 -18459 8791 -15673 -39507 -45525 -31489 -26284 -7697 19901 18568 18276 19546 3634 -1755
3425 -1755 -23158 -15804 7297 26130 27963 28216 37468 33379 28102 20220 9983 -10651 -15992 -14340
3411 -14340 -11904 -13854 756 13321 7079 11368 8307 -7542 -7855 -4098 -5000 -14732 -5255 -1589
3397 -1589 9194 7990 11897 36270 11403 11654 -10569 -27162 -11898 -5328 6296 -411 -15996
3384 -15996 -42010 -22962 22074 14120 17694 38914 39663 36719 25711 23770 40513 23231 -892
3371 -892 -28831 -19519 5768 16142 -3916 -12717 -36707 -59429 -30200 -22455 -39031 -50540 -21518
3358 -21518 -3026 11673 3682 -540 11345 6642 10702 31396 40352 40075 34017 37047 -13444 -43314
3344 -43314 -65015 -51712 -24613 16123 -13085 -23811 -5991 -9839 -30770 -30380 -13304 16720
3332 16720 40435 44921 18173 32841 32405 30302 42845 48421 31547 5779 5324 36078 56597
3319 56597 48922 17867 -18744 -8059 7282 -325 -13531 1706 13432 28421 31746 15308
3307 15308 -1714 120 9594 31655 28026 -8779 -14717 17810 -6547 -27232 -28765 -12153 -766
3294 -766 -11041 -21692 -2947 41516 57836 63858 34429 31647 48762 7062 -6759 8390 18807
3281 18807 -12631 -5941 -6826 -38040 -48469 -41388 -14951 18156 18770 822 -8719 -12029 -25720
3268 -25720 -24557 -12742 -21334 -37990 -22681 -31019 -37645 -32213 -20066 -21057 716 3692 404 -16502
3254 -16502 -24205 -36238 -51579 -33067 -6364 -618 -16845 -11320 -45438 -56357 -60624 -39207 -19728
3241 -19728 -10372 -20802 -6148 -1777 -6859 -33843 -41094 -47222 -62980 -45747 -23245 -37541 -39713
3228 -39713 -10371 5870 -12655 -33762 -48421 -51379 -41995 -54551 -32918 -8237 7858 6967 37986
3215 37986 11441 11071 18142 11704 -876 832 24584 31886 30712 37450 37701 26293 27575 13978
3201 13978 19133 2240 -27241 -27326 -9868 16666 18589 17914 15665 -15156 2681 21476 32650
3188 32650 46578 20233 18000 20921 17558 9514 9130 18835 3772 -18908 -3183 27762 43425
3175 43425 47463 24030 -4511 -46792 -63924 -45800 -38920 -33885 -20558 -11006 -38740 -56192 -69488
3162 -69488 -83767 -97430 -100121 -87069 -64727 -9035 23032 22821 -3148 -5830 20983 14778 10589
3149 10589 -12315 -8704 -21990 -38122 -30671 -7800 -23815 -37034 -22645 -5221 -12871 -29993
3137 -29993 2596 12428 -2515 -7441 19132 31115 26779 12203 14219 20457 4130 -32698 -37566
3124 -37566 2920 -3647 -9170 572 -13534 5589 27784 10188 -16150 -23163 -46863 -27079 -22922
3111 -22922 -32939 -36251 -20629 6762 11860 43724 62227 83311 86498 55588 26936 2542
3099 2542 40 -14991 -27091 -46950 -71689 -70390 -29906 -2637 24095 22284 -1908 -2648 -4461
3086 -4461 -19139 -18461 1045 23426 42294 -298 -17489 -18792 2609 9687 414 -4699 -40336
3073 -40336 -53634 -21605 -12737 -16985 -3643 -5528 17585 41305 36230 33174 47389 45421 -2230
3060 -2230 -54053 -54471 -25361 -31838 -39061 -7553 15677 21602 -2473 -21147 -17883 -28206 -28635 -19693
3046 -19693 -33415 -33709 -11809 -27069 -2157 5773 2654 -13971 -20833 -35165 -36480 -22134 -8365
3033 -8365 17082 24526 47073 33168 -3736 -23454 -3335 38740 51364 16278 -13993 -10936
3021 -10936 182 -5194 -18506 -55434 -56261 -23226 -9219 5364 20012 18597 13459 30795 47904
3008 47904 16301 8198 15522 21123 -13001 -19663 1089 24153 3964 -23761 -10697 -476 -21259
2995 -21259 -9953 11351 6897 26582 32576 -10570 -16758 -29198 -10392 -504 -10276 7785 6646
2982 6646 20792 12503 2918 17259 9507 1168 13075 12325 -18776 -40229 -36739 -19989 -10109 -3076
2968 -3076 7479 28181 52799 49435 27333 13848 -20289 -14939 -11414 -987 -1323 22406 25562
2955 25562 12158 22295 32687 -4091 -40169 -24921 -41782 -6059 15004 -3002 -1826 30732
2943 30732 58197 42572 28722 42994 55566 15247 -18913 12970 27857 27031 4632 -18745
2931 -18745 -2426 8060 19691 -17601 -41368 -10386 -6272 -4861 3130 -13423 -25607 -25647 -20131
2918 -20131 -22137 -27903 -11692 -13726 -3425 -12909 -13697 -15333 -15757 -35753 -23392 15460 32190 20217
2904 20217 -8823 -2623 11502 23416 24278 -23927 -24815 -7507 5484 9787 -3753 -17324 -26169
2891 -26169 -3722 19221 1218 -18252 73 -404 -9888 -24424 -27289 -5012 15355 30109 42776
2878 42776 40760 34655 -1 -18523 -26585 -25673 -14554 -10578 -24116 -23370 -50846 -63044 -31990
2865 -31990 -17256 -18425 2326 -1484 -16776 -46571 -37168 -51648 -94629 -81710 -46296 -1258
2853 -1258 34713 8995 6336 14754 9147 31967 12565 20984 9130 -8582 -16116 5212 9760
2840 9760 5958 8332 3174 -14815 -8903 5855 -11551 -41530 -37514 -18566 -4419 -17672 -31392
2827 -31392 -10520 -7348 -21192 -17317 -17196 25312 24645 41491 55961 66544 66811 26845 4467
2814 4467 17836 9469 10801 2575 -8612 3297 2658 713 26393 23232 -3521 5191 16400 32372
2800 32372 43992 58594 59665 64805 1529 -22993 -20663 -12957 -20606 -37516 -10553 20813 26770
2787 26770 33876 23370 28578 64588 71666 51372 -5659 -16201 -1915 14747 55501 78236
2775 78236 83944 66013 73043 67944 74087 71464 40776 -2889 -12743 -9555 -18931 -11382 1732 7141
2761 7141 18197 -12521 -7634 27805 20100 -4917 11279 32039 31894 -12572 -27439 -13306 -3616
2748 -3616 -9250 -24408 -12807 -4940 -15082 5303 -4087 -1000 -29584 -37972 -43195 -32461 -13649
2735 -13649 -9772 13721 25678 -22417 -63533 -61570 -31344 4132 13263 -23451 -18286 10143 -870
2722 -870 -10283 -9613 21210 15723 42018 34314 16164 -118 4416 33353 57175 39463 -658
2709 -658 -11722 -25238 -26572 -26398 -7 12243 38579 56311 54951 31346 22454 28643 6875
2696 6875 -3505 7685 21328 38572 58523 40052 13636 3892 9888 11671 14335 34689 50102
2683 50102 41259 38554 37691 28483 18569 35935 58893 53880 31563 30422 20542 -13468 -42226 -31773
2669 -31773 -13807 -8827 25270 22854 -1450 -23559 -34363 -45440 -55595 -22245 18164 22948
2657 22948 21106 3983 2387 25654 24499 8494 -3812 -26803 -25927 -11342 -22003 -21238 -4305
2644 -4305 16731 5639 -31646 -44485 -48621 -58093 -36630 -22841 -34178 -48599 -57140 -46221 -28093
2631 -28093 -18624 -10860 -29200 -15496 -14875 15303 13502 7140 8221 17392 29909 17467 -8222
2618 -8222 -41642 -36987 -14699 3495 26667 27879 2850 -28428 -28386 11847 46516 34779 5235
2605 5235 -19790 -23324 238 24496 22498 23612 39403 13036 -4070 21062 32865 26324 41113
2592 41113 56539 50388 40468 30881 2129 -5239 -15127 10659 2005 22284 35666 31222 5696
2579 5696 1321 23343 39901 56899 58394 57146 43220 15513 -26190 -37084 27069 46692 25920
2566 25920 5685 669 -2275 12679 19286 15610 6449 -12535 -18087 -20520 -6557 -7540 -7106 -20833
2552 -20833 -20817 -9240 10645 15415 1169 -5453 14277 -4561 13691 69527 87371 44908 14910
2539 14910 -8130 -28240 -22657 -24275 -16684 177 23363 20682 -12975 -14089 -9856 -17904 9615
2526 9615 -550 -3576 -12942 -46228 -56751 -33435 -10965 10757 18006 -17080 -24165 -19692 -20306
2513 -20306 -10102 -23299 -1745 23696 38211 37079 20572 12694 10624 12883 14701 12333 -2295
2500 -2295 -27406 -7850 -4520 -5752 -17661 -3838 -15673 -13978 -21902 -36023 -42875 -24510 -8609
2487 -8609 -7359 -27573 -18039 15752 38369 39281 16866 -7104 5660 50006 70753 58133 4170
2474 4170 -7371 -7325 1529 21594 -4583 -8947 -4078 -5628 3985 23697 13449 22516 16735 20161
2460 20161 12179 4618 -17692 -3003 -5674 2129 13740 21645 20601 32833 47025 50014 33368
2447 33368 63468 66072 48730 -2211 -16729 -20941 -8632 5439 8442 17480 42072 46220 41620
2434 41620 7980 -1668 9820 12384 31534 62958 64905 51749 55963 46709 26064 18271 10198
2421 10198 -17787 -16671 -4017 2069 -4419 -20664 -45880 -25133 -13862 -35612 -28254 -8682 21870
2408 21870 40566 32589 29433 39997 29841 24460 45506 57198 27754 6257 -5322 6931
2396 6931 4300 -20693 -31314 -30641 -30815 -30431 -5680 21753 32713 58782 48588 57382 63726 68624
2382 68624 63930 11508 -8708 -3593 16787 30740 11159 3000 -8164 -25043 -18687 3099 -6143
2369 -6143 -9661 -13455 -18798 21600 27571 -8113 -24195 -13867 -23391 -17206 -6426 -44414 -36349
2356 -36349 -23709 -1331 -12354 -14406 -12878 -34354 -13095 17653 27613 -5234 -9091 -18950 -3815
2343 -3815 25468 -3309 -34069 -32967 -36191 -34208 -20007 14282 44437 38522 6103 5279 6641
2330 6641 2384 -6658 -13350 -14795 -3947 28214 64208 56229 29681 21478 18734 55510 69756
2317 69756 50535 40194 27465 -1142 -27776 -26534 -21464 -12006 4353 33753 10487 -34631
2305 -34631 -52590 4708 46483 28509 69 -14693 -970 15412 33049 41639 22444 6829
2293 6829 -1111 -14600 -1243 40801 37951 16289 -20286 -28518 -11825 -26875 -14274 -355 -4462
2280 -4462 -20893 -15929 6231 14891 9966 23578 45170 28328 53264 17563 -7194 -9455 -18477
2267 -18477 2513 12391 -6907 -31777 -50822 -9796 23632 19650 16262 6336 22070 30392 47318
2254 47318 34894 2981 -8580 3162 17361 15668 28882 44036 28407 8031 17881 6864
2242 6864 1903 -1902 -12923 -21694 -5871 -11732 -19880 -43663 -26007 5543 4135 -16154 -58709
2229 -58709 -12663 26456 36342 20653 34081 54147 29593 25912 32927 32731 13477 9961 -5720
2216 -5720 -12730 -20603 5838 4166 -6137 -23903 -14867 -20802 -9852 3479 7067 14346 33884
2203 33884 39174 30853 25862 -7207 -5195 14064 -26581 -25096 15522 33929 29077 41861 8890
2190 8890 535 -17607 -39028 -38443 -49492 -23302 787 13273 28603 20990 -22531 -24668 28106
2177 28106 43307 5029 26328 53755 68428 54807 53843 62072 51217 44055 33505 17344 35455
2164 35455 47709 25792 -19542 -27162 13154 14099 28082 25873 -15372 -41212 5204 7789 34962
2151 34962 44179 34876 -17071 -41879 -50382 -46410 -37077 -46113 -48476 -27106 2569 1621 16147 20396
2137 20396 12263 295 22487 21243 -939 -13294 6000 13727 2530 -30122 -6193 25426
$$ [...]
##END NTUPLES=NMR SPECTRUM
##END=
