##TITLE=Analysis number 329285
Compound Code cc 62110
Book Reference 540/8
Project Code adrs
Chemist Name mikem
##JCAMPDX= 6.0         $$ Bruker NMR JCAMP-DX V2.0
##DATA TYPE= NMR SPECTRUM
##DATA CLASS= NTUPLES
##ORIGIN= Bruker BioSpin GmbH
##OWNER= nmr
$$ XWIN-NMR		Version 3.5
$$ Thu Aug 16 11:11:23 2007 GMT Daylight Time (UT+1h)  MAYBRIDGE\nmr@NMR_250MHZ
##.OBSERVE FREQUENCY= 250.131544655141
##.OBSERVE NUCLEUS= ^1H
##.ACQUISITION MODE= SIMULTANEOUS (DQD)
##.ACQUISITION SCHEME= undefined
##.AVERAGES= 16
##.DIGITISER RES= 18
##SPECTROMETER/DATA SYSTEM= dpx250
##.PULSE SEQUENCE= zg30
##.SOLVENT NAME= CDCl3
##.SHIFT REFERENCE= (INTERNAL, CDCl3, 0, 16.446)
##AUDIT TRAIL= $$ (NUMBER, WHEN, WHO, WHERE, WHAT)
$$ ##TITLE= Audit trail, XWIN-NMR		Version 3.5
$$ ##JCAMPDX= 5.01
$$ ##ORIGIN= Bruker BioSpin GmbH
$$ ##OWNER= nmr
$$ C:\u/data/dgb/nmr/ADRS/740/pdata/1/auditp.txt
$$ ##AUDIT TRAIL=  $$ (NUMBER, WHEN, WHO, WHERE, WHAT)
(   1,<2007-08-16 11:10:06.83 +100>,<MAYBRIDGE\nmr>,<NMR_250MHZ>,
      <created by zg, POWCHK disabled, PULCHK disabled
       configuration hash MD5:
       76 6E 9A 78 1E 09 19 81 EC 84 63 8F B0 6A 59 2D
       data hash MD5: 64K
       55 B7 E8 0E D9 78 D6 F3 DD 41 C2 2E 05 16 70 C2>)
(   2,<2007-08-16 11:10:38.36 +100>,<MAYBRIDGE\nmr>,<NMR_250MHZ>,
      <Start of raw data processing
       ef LB = 0.3 FT_mod = 6 PKNL = 1 SI = 32K 
       data hash MD5: 32K
       A5 F9 E8 D6 3A 52 A1 2C E4 FD 96 22 A6 B1 A1 33>)
(   3,<2007-08-16 11:10:43.35 +100>,<MAYBRIDGE\nmr>,<NMR_250MHZ>,
      <apk 
       data hash MD5: 32K
       A6 F1 4D 6B EA 8B 94 F2 59 BA 56 A0 0B 94 09 E6>)
(   4,<2007-08-16 11:10:47.77 +100>,<MAYBRIDGE\nmr>,<NMR_250MHZ>,
      <abs ABSG = 5 
       data hash MD5: 32K
       F1 E2 74 9F FD BE 5D D2 AB BD 2C A5 75 DB 6F 5A>)
$$ ##END=
$$ 
$$ hash MD5
$$ 40 FC 34 06 43 D8 4B 33 6B 0D FD 10 59 28 ED B2
##$RELAX= 
##$RELAX= 
##$RELAX= 
##$RELAX= 
##$RELAX= 
##$RELAX= 
##$RELAX= 
$$ Bruker specific parameters
$$ --------------------------
##$DU= <C:\u>
##$EXPNO= 740
##$NAME= <ADRS>
##$PROCNO= 1
##$TYPE= <nmr>
##$USER= <dgb>
##$AMP= (0..31)
100 100 100 100 100 100 100 100 100 100 100 100 100 100 100 100 100 100 
100 100 100 100 100 100 100 100 100 100 100 100 100 100 
##$AQSEQ= 0
##$AQ_mod= 3
##$AUNM= <au_zg>
##$AUTOPOS= <15 >
##$BF1= 250.13
##$BF2= 250.13
##$BF3= 250.13
##$BF4= 250.13
##$BF5= 500.13
##$BF6= 500.13
##$BF7= 500.13
##$BF8= 500.13
##$BYTORDA= 1
##$CFDGTYP= 0
##$CFRGTYP= 5
##$CHEMSTR= <none>
##$CNST= (0..31)
1 1 145 1 1 1 1 1 1 1 1 1 1 1 1 1 1 1 1 1 1 1 1 1 1 1 1 1 1 1 1 1 
##$CPDPRG= <>
##$CPDPRG1= <>
##$CPDPRG2= <>
##$CPDPRG3= <>
##$CPDPRG4= <mlev>
##$CPDPRG5= <mlev>
##$CPDPRG6= <mlev>
##$CPDPRG7= <mlev>
##$CPDPRG8= <mlev>
##$CPDPRGB= <>
##$CPDPRGT= <>
##$D= (0..31)
0 1 0 0 0 0 0 0 0 0.06 0 0 0 0 0 0 0.0002 0 0 0 0 0 0 0 0 0 0 0 0 0 0 
0 
##$DATE= 1187259003
##$DBL= (0..7)
120 120 120 120 120 120 120 120 
##$DBP= (0..7)
150 150 150 150 150 150 150 150 
##$DBP07= 0
##$DBPNAM0= <>
##$DBPNAM1= <>
$$ [...]
##$SUBNAM7= <"">
##$SUBNAM8= <"">
##$SUBNAM9= <"">
##$SW= 20.6930455092707
##$SWIBOX= (0..15)
0 0 3 0 0 0 0 0 0 0 0 0 0 0 0 0 
##$SW_h= 5175.983436853
##$TD= 65536
##$TD0= 1
##$TE= 296.16
##$TE2= 300
##$TE3= 300
##$TEG= 300
##$TL= (0..7)
0 120 120 120 120 120 120 120 
##$TP= (0..7)
150 150 150 150 150 150 150 150 
##$TP07= 0
##$TPNAME0= <>
##$TPNAME1= <>
##$TPNAME2= <>
##$TPNAME3= <>
##$TPNAME4= <>
##$TPNAME5= <>
##$TPNAME6= <>
##$TPNAME7= <>
##$TPOAL= (0..7)
0.5 0.5 0.5 0.5 0.5 0.5 0.5 0.5 
##$TPOFFS= (0..7)
0 0 0 0 0 0 0 0 
##$TUNHIN= 0
##$TUNHOUT= 0
##$TUNXOUT= 0
##$USERA1= <user>
##$USERA2= <user>
##$USERA3= <user>
##$USERA4= <user>
##$USERA5= <user>
##$V9= 5
##$VALIST= <valist>
##$VCLIST= <CCCCCCCCCCCCCCC>
##$VD= 0
##$VDLIST= <DDDDDDDDDDDDDDD>
##$VPLIST= <PPPPPPPPPPPPPPP>
##$VTLIST= <TTTTTTTTTTTTTTT>
##$WBST= 1024
##$WBSW= 4
##$XGAIN= (0..3)
0 0 0 0 
##$XL= 0
##$YL= 0
##$YMAX_a= 565885
##$YMIN_a= -327625
##$ZGOPTNS= <>
##$ZL1= 120
##$ZL2= 120
##$ZL3= 120
##$ZL4= 120
##$ABSF1= 16.44597
##$ABSF2= -4.247202
##$ABSG= 5
##$ABSL= 3
##$ALPHA= 0
##$AQORDER= 0
##$ASSFAC= 0
##$ASSFACI= 0
##$ASSFACX= 0
##$ASSWID= 0
##$AUNMP= <proc_1d>
##$AZFE= 0.1
##$AZFW= 0.1
##$BCFW= 0
##$BC_mod= 0
##$BYTORDP= 0
##$COROFFS= 0
##$CY= 12.5
##$DATMOD= 1
##$DC= 0
##$DFILT= <>
##$DTYPP= 0
##$F1P= 14.0000005364418
##$F2P= -0.99999901652339
##$FCOR= 0.5
##$FTSIZE= 32768
##$FT_mod= 6
##$GAMMA= 0
##$GB= 0
##$INTBC= 1
##$INTSCL= 1
##$ISEN= 128
##$LB= 0.3
##$LEV0= 0
##$LPBIN= 0
##$MAXI= 10000
##$MC2= 0
##$MEAN= 0
##$ME_mod= 0
##$MI= 0
##$NCOEF= 0
##$NC_proc= -3
##$NLEV= 6
##$NOISF1= 0
##$NOISF2= 0
##$NSP= 0
##$NTH_PI= 0
##$NZP= 0
##$OFFSET= 16.44597
##$PC= 1
##$PHC0= -44.96466
##$PHC1= 8.068533
##$PH_mod= 1
##$PKNL= yes
##$PPARMOD= 0
##$PSCAL= 4
##$PSIGN= 0
##$REVERSE= no
##$SF= 250.130019015527
##$SI= 32768
##$SIGF1= 0
##$SIGF2= 0
##$SINO= 400
##$SIOLD= 32768
##$SREGLST= <1H.CDCl3>
##$SSB= 0
##$STSI= 32768
##$STSR= 0
##$SW_p= 5175.98343685301
##$SYMM= 0
##$S_DEV= 0
##$TDeff= 65536
##$TDoff= 0
##$TI= <Analysis number 999999
Compound Code 99
Book Reference 9
Project Code 9>
##$TILT= no
##$TM1= 0
##$TM2= 0
##$TOPLEV= 0
##$USERP1= <user>
##$USERP2= <user>
##$USERP3= <user>
##$USERP4= <user>
##$USERP5= <user>
##$WDW= 1
##$XDIM= 32768
##$YMAX_p= 516895269
##$YMIN_p= -95107
$$ End of Bruker specific parameters
$$ ---------------------------------
##NTUPLES= NMR SPECTRUM
##VAR_NAME=  FREQUENCY,     SPECTRUM/REAL,   SPECTRUM/IMAG
##SYMBOL=    X,             R,               I
##VAR_TYPE=  INDEPENDENT,   DEPENDENT,       DEPENDENT
##VAR_FORM=  AFFN,          ASDF,            ASDF
##VAR_DIM=   32768,         32768,           32768
##UNITS=     HZ,            ARBITRARY UNITS, ARBITRARY UNITS
##FACTOR=    0.157963299565203, 1,           1
##FIRST=     4113.63092271796, 0,            0
##LAST=      -1062.35251413505, 0,           0
##MIN=       -1062.35251413505, -95107,      0
##MAX=       4113.63092271796, 516895269,    0
$$ Real data points
##PAGE= N=1
##DATA TABLE= (X++(R..R)), XYDATA
$$ [...]
$$ plain form
18366 7614106 7027363 6481253 5923640 5416747 5011099 4698309 4513673 4446582 4503993 4703828
18356 4703828 4947704 5194551 5408584 5649447 5965673 6413679 6949411 7677482 8825367
18347 8825367 10601627 13616193 18867161 27968393 43295088 62004016 70330569 68208401
18339 68208401 60333020 46175231 33992553 27721436 26058771 28416939 35840249 49649177
18331 49649177 63705387 67090561 63855574 56037301 45720581 42021098 46664021 52130109
18323 52130109 50949979 46291687 38134649 28174517 21342981 17480014 15400174 14568765
18315 14568765 14875748 16506632 20156392 27209532 40079903 58666499 70962576 70423882
18307 70423882 63289034 49156040 33557773 23271146 17202098 13441222 11003091 9476364
$$ packed form
18366G614106n86743n46110n57613n06893m05648l12790j84636o7091N7411J99835
18356D703828K43876K46847K14033K40863L16226M48006N35732P28071J147885
18347H825367J776260L014566N250968R101232J5326695J8708928Q326553k122168
18339F8208401p875381j4157789j2182678o271117j662665K358168P423310J3808928
18331D9649177J4056210L385174l234987p818273j0316720l699483M642923N466088
18323E2130109j180130m658292q157038r960132o831536l862967k079840q31409
18315A4568765L06983J630884L649760P053140J2870371J8586596J2296077n38694
18307G0423882p134848j4132994j5598267j0286627o069048l760876k438131j526727
$$ plain form
18299 9476364 8567631 8082327 8009596 8173425 8087273 7652942 6978679 6104641 5399763 4950182
18289 4950182 4750376 4771502 4951728 5151828 5437597 5818527 6375650 7204942 8595636
18280 8595636 11015165 15302130 22954240 34021242 43576734 48339346 46319841 39188136
18272 39188136 30318830 22201862 17284886 14994211 14474713 15421690 18176423 23765795
18264 23765795 34256210 52005299 70477566 75247072 70404271 58821805 41345070
18257 41345070 27730361 19647436 14825276 11792180 9835771 8579954 7709215 7080452
18249 7080452 6671686 6430849 6304022 6233158 6249163 6382513 6508459 6676923 6975139 7285784
18239 7285784 7618250 8238408 9295818 11048786 13992952 18951330 27379517 41431192
$$ packed form
18299I476364r08733m85304p2731J63829q6152m34331o74263q74038p04878m49581
18289D950182j99806K1126J80226K00100K85769L80930N57123Q29292J390694
18280H595636K419529M286965P652110J1067002R555492M762612k019505p131705
18272C9188136q869306q116968m916976k290675n19498R46977K754733N589372
18264B3765795J0490415J7749089J8472267M769506m842801j1582466j7476735
18257D1345070j3614709q082925m822160l033096j956409j255817q70739o28763
18249G080452m08766k40837j26827p0864J6005J33350J25946J68464K98216L10645
18239G285784L32466O20158J057410J752968K944166M958378Q428187J4051675
$$ plain form
18231 41431192 59522882 73332991 85605766 100335473 105716040 97091495 84358997
18224 84358997 66660664 47337594 35098010 28933618 26698847 27756045 32849229 43463396
18216 43463396 57971678 71068148 79256236 75746456 63894725 49527786 34618620
18209 34618620 24073944 17832844 13999789 11506845 9779633 8605995 7814009 7323746
18201 7323746 7001922 6715607 6455062 6206068 5946090 5754215 5659363 5718907 5959798 6490872
18191 6490872 7441981 9155471 12297953 18181651 27172606 34025692 36513800 38496932
18183 38496932 40398299 41242445 38305143 33903996 27761547 20194874 15340797 13286275
18175 13286275 13267032 15429730 20599440 28419263 34601323 38977225 41656417 37820155
$$ packed form
18231D1431192J8091690J3810109J2272775J4729707N380567q624545j2732498
18224H4358997j7698333j9323070j2239584o164392k234771J057198N093184J0614167
18216D3463396J4508282J3096470Q188088l509780j1851731j4366939j4909166
18209C4618620j0544676o241100l833055k492944j727212j173638p91986m90263
18201G323746l21824k86315k60545k48994k59978j91875r4852N9544K40891N31074
18191F490872R51109J713490L142482N883698Q990955O853086K488108J983132
18183C8496932J901367Q44146k937302m401147o142449p566673m854077k054522
18175A3286275j9243K162698N169710P819823O182060M375902K679192l836262
$$ plain form
18167 37820155 31079463 24381622 17134880 11721247 8510268 6583587 5328750 4440408
18159 4440408 3832134 3423924 3141948 2921578 2737392 2555577 2357436 2188383 2030435
18150 2030435 1865562 1730856 1610217 1504720 1454932 1413749 1432991 1494288 1523871 1487766
18140 1487766 1431309 1338118 1205044 1121225 1073445 1070018 1068485 1051569 1021680 989974 963079
18129 963079 952068 955925 961962 1014262 1065521 1119322 1180964 1275406 1344551 1422229 1584706 1793276
18117 1793276 2116469 2561879 3179088 4176771 5805678 8741758 14368024 25751760 44321641
18108 44321641 54279813 51899084 46053393 32563241 19413164 12465652 8783840 6614233
18100 6614233 5166263 4183250 3562028 3130263 2769796 2431406 2112735 1870914 1663234
$$ packed form
18167C7820155o740692o697841p246742n413633l210979j926681j254837q88342
18159D440408o08274m08210k81976k20370j84186j81815j98141j69053j57948
18150B030435j64873j34706j20639j05497m9788m1183J9242O1297K9583l6105
18140A487766n6457r3191j33074q3819m7780l427j533j6916k9889l1706k6895
18129I63079j1011L857O037N2300N1259N3801O1642R4442O9145P7678J62477K08570
18117A793276L23193M45410O17209R97683J628907K936080N626266J1383736J8569881
18108D4321641R958172k380729n845691j3490152j3150077o947512l681812k169607
18100F614233j447970r83013o21222m31765l60467l38390l18671k41821k07680
$$ plain form
18091 1663234 1480662 1343832 1288112 1258724 1253801 1235240 1178655 1107297 1002129 874740 758384
18080 758384 654686 611008 608327 666465 773441 849299 825744 770566 709308 617264 602578
18069 602578 602168 651439 699132 769505 831784 785205 702645 590221 463688 383540 342964
18058 342964 342114 364907 409808 498035 630130 769459 836649 881663 888319 861164 822462 767962
18046 767962 738596 686489 594332 536719 493902 422735 372347 358810 330163 295623 266894
18035 266894 235628 198727 210683 245689 296581 401070 575562 690074 722292 761653 747807
18024 747807 690980 640519 608533 568928 591054 689441 778685 767817 777229 753975 663050 578035
18012 578035 508082 415179 329377 291302 263550 238899 216689 174650 181976 190271 198993 226226
$$ packed form
18091A663234j82572j36830n5720k9388m923j8561n6585p1358j05168j27389j16356
18080G58384j03698m3678k681N8138J06976P5858k3555n5178o1258r2044j4686
18069F02578m10M9271M7693P0373O2279m6579q2560j12424j26533q0148m0576
18058C42964q50K2793M4901Q8227J32095J39329O7190M5014O656k7155l8702n4500
18046G67962k9366n2107r2157n7613m2817p1167n0388j3537k8647l4540k8729
18035B66894l1266l6901J1956L5006N0892J04489J74492J14512L2218L9361j3846
18024G47807n6827n0461l1986l9605K2126R8387Q9244j0868R412k3254r0925q5015
18012E78035o9953r2903q5802l8075k7752k4651k2210m2039P326Q295Q722K7233
$$ plain form
18000 226226 246150 302549 318264 344484 410488 477972 540077 630796 723444 793063 872106
17989 872106 936229 951116 979198 1003784 1040376 1091672 1134273 1156865 1195899 1231421 1298088
17978 1298088 1407138 1380239 1246515 1074435 896912 746347 653701 594009 587636 655243
17968 655243 746333 755363 694355 640404 515046 392072 325001 311911 290656 240696 202010
17957 202010 185619 198751 196155 183955 212957 270992 296996 325060 349199 387769 417096 448834
17945 448834 464186 449363 476228 510871 515022 546800 559176 550952 543954 505803 500544 558042
17933 558042 573676 595044 586580 556821 506156 458291 428550 366085 271758 216842 187475 171523
17921 171523 152598 154890 146038 123851 95155 96432 103102 120557 130241 105639 113576 89959 95634
$$ packed form
18000B26226J9924N6399J5715K6220O6004O7484O2105R0719R2648O9619P9043
17989H72106O4123J4887K8082K4586L6592N1296M2601K2592L9034L5522O6667
17978A298088J09050k6899j33724j72080j77523j50565r2646n9692o373O7607
17968F55243R1090R030o1008n3951j25358j22974o7071j3090k1255m9960l8686
17957B02010j6391J3132k596j2200K9002N8035K6004K8064K4139L8570K9327L1738
17945D48834J5352j4823K6865L4643M151L1778J2376q224o998l8151n259N7498
17933E58042J5634K1368q464k9759n0665m7865k9741o2465r4327n4916k9367j5952
17921A71523j8925K292q852k2187k8696J277O670J7455R684k4602P937k3617N675
$$ plain form
17908 95634 98029 101320 110940 129266 200499 259795 307289 314521 287668 244672 237254 237582 269157
17895 269157 300192 323744 302933 274786 240103 195962 212053 212663 193052 186674 153755 149953
17883 149953 115186 95776 108053 96445 61005 32616 47470 49105 48312 50000 72491 42180
17871 42180 43376 51276 64410 96561 91181 74936 71112 90074 89406 81082 80605 89085 106053 155211
17857 155211 215811 280153 349684 384556 386188 347055 313487 298288 355047 418277 436654 418791
17845 418791 377794 318798 258229 201772 166027 134688 124265 102531 58190 57942 76725 76595
17833 76595 71080 71167 66708 60580 56048 58712 42111 50428 57369 37223 15966 40208 59970 34892
17819 34892 26548 60056 93436 94699 78353 70504 79298 111243 160218 173257 232456 308786
$$ packed form
17908I5634K395L291R620J8326P1233N9296M7494P232k6853m2996p418L28L1575
17895B69157L1035K3552k0811k8147l4683m4141J6091O10j9611o378l2919l802
17883A49953l4767j9410J2277j1608l5440k8389J4854J635p93J688K2491l0311
17871D2180J196P900J3134L2151n380j6245l824J8962o68q324m77Q480J6968M9158
17857A55211O0600O4342O9531L4872J632l9133l3568j5199N6759O3230J8377j7863
17845D18791m0997n8996o0569n6457l5745l1339j0423k1734m4341k48J8783j30
17833G6595n515Q7m459o128m532K664j6601Q317O941k0146k1257K4242J9762k5078
17819C4892q344L3508L3380J263j6346p849Q794L1945M8975J3039N9199P6330
$$ plain form
17807 308786 347253 343723 323310 268235 210350 170777 178258 206195 253171 309601 343036 328672
17795 328672 272344 220121 181674 154981 124337 114122 113222 94952 104368 114806 88708 46521
17783 46521 14863 4217 31052 59990 70369 51461 38336 18289 9982 7968 9082 22016
17771 22016 50943 65158 72904 64756 55703 57234 70152 109554 156076 221687 248625 253595 235089
17758 235089 226840 237696 245383 225580 203423 179257 179403 189821 197358 201929 248423 286639 279987
17745 279987 266079 225561 237220 274209 383322 527947 600512 577010 485298 352672 258128
17734 258128 226740 200032 241419 341309 517619 592564 558186 489948 359013 255459 204361
17723 204361 200858 190539 198475 204140 197664 202605 193053 205810 263634 307725 361234 411304 457142
$$ packed form
17807C08786L8467l530k0413n5075n7885l9573P481K7937M6976N6430L3435j4364
17795C28672n6328n2223l8447k6693l0644j0215r00j8270R416J0438k6098m2187
17783D6521l1658j0646K6835K8938J0379j8908j3125k0047q307k014J114J2934
17771B2016K8927J4215P746q148r053J531J2918L9402M6522O5611K6938M970j8506
17758B35089q249J0856P687j9803k2157k4166J46J0418P537M571M6494L8216o652
17745B79987j3908m0518J1659L6989J09113J44625P2565k3502r1712j32626r4544
17734B58128l1388k6708M1387R9890J76310P4945l4378o8238j30935j03554n1098
17723B04361l503j0319P936N665o476M941r552J2757N7824M4091N3509N0070M5838
$$ plain form
17710 457142 440027 405912 367135 325725 253089 210663 233365 304591 375501 446215 517667
17699 517667 554193 530796 464792 411714 425334 474834 577052 648371 721346 803089 768186
17688 768186 660786 610606 503426 447929 472541 559892 640613 688804 759378 723286 628110
17677 628110 521968 366179 264322 214837 183325 184048 182010 215865 271779 297013 320058
17666 320058 321499 339494 333599 325060 295207 227066 180275 163871 156073 183697 237001 269344
17654 269344 318116 351904 333906 270634 226586 172187 136369 110324 105393 147633 248643
17643 248643 369154 411273 366112 299645 237250 169704 134980 150450 169313 258209 352076
17632 352076 389340 356471 274029 206397 137532 92945 88909 91970 47958 34650 35480 19758
$$ packed form
17710D57142j7115l4115l8777m1410p2636m2426K2702P1226P0910P0714P1452
17699E17667L6526k3397o6004n3078J3620M9500J02218P1319P2975Q1743l4903
17688G68186j07400n0180j07180n5497K4612Q7351Q0721M8191P0574l6092r5176
17677F28110j06142j55789j01857m9485l1512P23k038L3855N5914K5234K3045
17666C20058J441J7995n895q539k9853o8141m6791j6404p798K7624N3304L2343
17654B69344M8772L3788j7998o3272m4048n4399l5818k6045m931M2240J01010
17643B48643J20511M2119m5161o6467o2395o7546l4724J5470J8863Q8896R3867
17632C52076L7264l2869q2442o7632o8865m4587m036L061m4012j3308Q30j5722
$$ plain form
17620 19758 33356 38736 37674 35411 19008 6606 26416 8862 -20671 -26475 -11618 5730
17608 5730 -8477 -11291 -2377 13848 1794 -3380 -21929 -14356 20839 30766 11803 15515 44444
17595 44444 34671 24475 46873 19176 1150 4369 18112 10832 3112 6926 -6699 -16873 -19419
17582 -19419 -11750 -2309 -6655 3360 7984 15815 21170 20138 20239 25502 20955 25117 34151 8282
17568 8282 10145 25721 20976 509 -9099 -5143 19240 16259 -2694 -21150 -18009 1047 5628
17555 5628 80 -8982 6894 -11253 -14917 9540 2725 -16513 -15241 -14337 -5860 32136 45238
17542 45238 15127 1309 -806 6119 20769 22923 16232 17819 15406 39409 54918 35574 51729
17529 51729 101012 161985 236231 327269 434618 568844 689363 767840 793386 828634 840999
$$ packed form
17620A9758J3598N380j062k263j6403j2402J9810j7554k9533n804J4857J7348
17608E730j4207k814Q914J6225j2054n174j8549P573L5195R927j8963L712K8929
17595D4444r773j0196K2398k7697j8026L219J3743p280p720L814j3625j0174k546
17582a9419P669R441m346J0015M624P831N355j032J01N263m547M162R034k5869
17568H282J863J5576m745k0467r608L956K4383k981j8953j8456L141J9056M581
17555E628n548r062J5876j8147l664K4457o815j9238J272R04Q477L7996J3102
17542D5238l0111j3818k115O925J4650K154o691J587k413K4003J5509j9344J6155
17529E1729M9283O0973P4246R1038J07349J34226J20519P8477K5546L5248J2365
$$ plain form
17518 840999 786093 715867 642626 537612 459304 361825 278441 236357 189268 147649 127025
17507 127025 111877 97307 90595 91837 104958 93442 63635 47616 59767 25727 14211 31569
17495 31569 42809 37480 40509 54474 33710 29039 10546 13331 25997 8140 13602 2592 650
17482 650 -9784 -25264 -37923 -36960 -16967 10884 49565 35231 -3338 -20054 -7219 6520
17470 6520 8552 1002 -11992 -4564 4599 -3260 7374 4971 -23781 -21650 -30235 -10970 30091
17457 30091 37212 30542 16506 14935 36497 66291 55837 27130 3410 -33845 -25275 29863
17445 29863 80673 116949 204656 294745 296630 247717 207775 125324 69190 62127 59961 24024
17433 24024 7478 6488 -26493 -35208 -27359 -15081 13010 -7759 -12257 -6681 -10281 10506 19465
$$ packed form
17518H40999n4906p0226p3241j05014p8308r7479q3384m2084m7089m1619k0624
17507A27025j5148j4570o712J242J3121j1516k9807j6019J2151l4040j1516J7358
17495C1569J1240n329L029J3965k0764m671j8493K785J2666j7857N462j1010j942
17482F50j0434j5480j2659R63J9993K7851L8681j4334l8569j6716J2835J3739
17470F520K032p550j2994P428R163p859J0634k403k8752K131q585J9265M1061
17457C0091P121o670j4036j571K1562K9794j0454k8707k3720l7255Q570N5138
17445B9863N0810L6276Q7707R0089J885m8913l9942q2451n6134p063k166l5937
17433B4024j6546r90l2981q715P849J2278K8091k0769m498N576l600K0787Q959
$$ plain form
17420 19465 13176 -394 -3078 12606 19466 1459 -19614 -25401 -15743 16645 7039 -8802 2207
17407 2207 -15236 -45516 -26019 -16801 651 10231 -12468 -18276 -29359 -29914 -38017 -35191 -4624
17394 -4624 7439 -1943 -5669 -9778 16658 5548 5196 -1451 -22478 -27646 -54673 -54593 -67977 -60257
17380 -60257 -24793 -8058 -30674 -24769 -37034 -41737 -52635 -38024 5699 14211 13925 16646 27265
17367 27265 38113 34406 -15316 -25664 -15506 -23859 -34572 -21249 -16507 9013 8119 22325 25104
17354 25104 11973 -10261 -19865 202 16641 19455 27277 40787 41452 37569 46170 44797 40818
17341 40818 20549 10354 27002 24867 23936 54858 44174 25189 8211 2161 8428 18521 13308
17328 13308 -12762 -29495 -38978 -39204 -38378 -19020 -24776 -28060 -10435 10622 16379 14845 7968 13216
$$ packed form
17420A9465o289j3570k684J5684O860j8007k1073n787R658L2388r606j5841J1009
17407B207j7443l0280J9497R218J7452R580k2699n808j1083n55q103K826L0567
17394d624J2063r382l726m109K6436j1110l52o647k1027n168k7027Q0j3384P720
17380f0257L5464J6735k2616N905j2265m703j0898J4611M3723Q512k86K721J0619
17367B7265J0848l707m9722j0348J0158q353j0713J3323M742K5520q94J4206K779
17354B5104j3131k2234r604K0067J6439K814P822J3510O65l883Q601j373l979
17341D0818k0269j0195J6648k135r31L0922j0684j8985j6978o050O267J0093n213
17328A3308k6070j6733r483k26Q26J9358n756l284J7625K1057N757j534o877N248
$$ plain form
17314 13216 108 10214 4686 -5410 -8342 -12965 -20040 -4806 -8743 -30683 -39447 -43238 -19507
17301 -19507 -16038 -23458 -299 8793 -2662 19526 22833 20133 53612 58893 42331 42629 43502 64739
17287 64739 70637 48748 35100 51989 61464 45041 14590 -6726 1671 -17467 -43379 -58479
17275 -58479 -51346 -18046 -13059 25550 51377 50112 23395 21582 21782 37750 46487 38740 32060
17262 32060 21900 4775 -12848 -11805 -16091 6591 9164 16106 588 -84 -9191 -30770 -14325
17249 -14325 -4799 -2819 5271 -8874 -24667 -32119 -24968 -10519 -6920 17493 26252 3556 -6459
17236 -6459 28344 26411 17029 15768 12671 40238 67264 50972 32259 32976 36507 39493 46272 34008
17222 34008 20181 41512 73120 84478 64254 59955 61695 83324 84055 102304 105411 117935 132431
$$ packed form
17314A3216j3108J0106n528j0096k932m623p075J5234l937k1940q764l791K3731
17301a9507L469p420K3159R092j1455K2188L307k700L3479N281j6562K98Q73K1237
17287F4739N898k1889j3648J6889R475j6423l0451k1316Q397j9138k5912j5100
17275e8479P133L3300M987L8609K5827j265k6717j813K00J5968Q737p747o680
17262C2060j0160j7125j7623J043m286K2682K573O942j5518o72r107k1579J6445
17249a4325R526J980Q090j4145j5793p452P151J4449L599K4413Q759k2696j0015
17236f459L4803j933r382j261l097K7567K7026j6292j8713P17L531K986O779j2264
17222C4008j3827K1331L1608J1358k0224m299J740K1629P31J8249L107J2524J4496
$$ plain form
17209 132431 161368 182142 198356 206736 224965 316695 406104 509162 640014 807355 1016400
17198 1016400 1208969 1317125 1386175 1413988 1331543 1224195 1095540 906555 734489 561924
17188 561924 444888 346854 260641 181224 129641 96761 90557 102122 91054 87866 93951 120230
17176 120230 113557 100477 113158 108674 81590 52494 14842 6722 13816 12190 9064 -3937 7319
17163 7319 47604 53985 63583 44292 27565 13946 4515 -11315 -8353 22211 46447 43404 7015
17150 7015 18900 27945 21838 21915 34346 22672 2873 -4073 21195 36494 33826 28748 62831
17137 62831 86437 86853 63291 33072 49803 91339 116857 117660 104014 108480 106840 113611 82120
17124 82120 71062 75959 80475 82497 64517 65814 54502 62700 83417 78905 87099 98458 108982
$$ packed form
17209A32431K8937K0774J6214Q380J8229R1730Q9409J03058J30852J67341K09045
17198A016400J92569J08156O9050K7813q2445j07348j28655j88985j72066j72565
17188E61924j17036r8034q6213p9417n1583l2880o204J1565j1068l188O085K6279
17176A20230o673j3080J2681m484k7084k9096l7652q120P094j626l126j3001J1256
17163G319M0285O381R598j9291j6727j3619r431j5830K962L0564K4236l043l6389
17150G015J1885R045o107P7J2431j1674j9799o946K5268J5299k668n078L4083
17137F2831K3606M16k3562l0219J6731M1536K5518Q03j3646M466j640O771l1491
17124H2120j1058M897M516K022j7980J297j1312Q198K0717m512Q194J1359J0524
$$ plain form
17111 108982 95646 98084 98318 83973 62584 69846 82420 87333 95811 84325 89429 99985 87087
17098 87087 80981 79831 77290 60040 34646 51627 69956 69989 76373 104378 98441 98898 146505 189154
17084 189154 231620 219607 233983 221457 219461 232358 250231 303861 337888 327575 339625 351195
17072 351195 340939 274183 215478 188161 161713 128484 95454 46119 12268 28868 53843
17061 53843 59424 39274 42738 31149 53414 69749 74186 75808 77952 66490 55803 78348 91043
17048 91043 105245 115191 92562 89382 79602 89786 90023 93524 98795 101962 97534 101280 94680 95865
17034 95865 132643 165837 189830 179332 144536 158781 162073 149398 139390 162614 204291 249055
17022 249055 316446 376650 439573 475360 498147 529107 566498 564699 568524 545842 472204 410323
$$ packed form
17111A08982j3336K438K34j4345k1389P262J2574M913Q478j1486N104J0556j2898
17098H7087o106j150k541j7250k5394J6981J8329L3O384K8005n937M57M7607M2649
17084A89154M2466j2013J4376j2526j996J2897J7873N3630L4027j0313J2050J1570
17072C51195j0256o6756n8705k7317k6448l3229l3030m9335l3851J6600K4975
17061E3843N581k0150L464j1589K2265J6335M437J622K144j1462j0687K2545J2695
17048I1043J4202R946k2629l180r780J0184K37L501N271L167m428L746o600J185
17034I5865L6778L3194K3993j0498l4796J4245L292j2675j0008K3224M1677M4764
17022B49055O7391O0204O2923L5787K2787L0960L7391j799L825k2682p3638o1881
$$ plain form
17010 410323 389150 351694 342206 349215 371461 364028 374346 363133 388364 428266 441890 482516
16998 482516 538309 607744 669161 720522 787052 848768 893940 921638 959070 997184 1032928
16987 1032928 1038990 1053487 1086014 1125728 1201292 1282843 1387604 1531177 1740764 1989094 2328120
16976 2328120 2740337 3177618 3635645 4081793 4483739 4853128 5137146 5393563 5665185
16967 5665185 5975905 6332957 6814017 7490633 8500618 10019030 12371391 16051114 21920250
16958 21920250 31069143 43741851 58484973 75027342 95480836 118180506 135820752
16951 135820752 147046092 155552731 158528041 152129960 139673430 123854816 103983173
16944 103983173 83292754 65315175 50121777 37431997 27866032 21314900 16939225
$$ packed form
17010D10323k1173l7456r488P009K2246p433J0318j1213K5231L9902J3624M0626
16998D82516N5793O9435O1417N1361O6530O1716M5172K7698L7432L8114L5744
16987A032928O062J4497L2527L9714P5564Q1551J04761J43573K09587K48330L39026
16976B328120M12217M37281M58027M46148M01946L69389K84018K56417K71622
16967E665185L10720L57052M81060O76616J009985J518412K352361L679723N869136
16958B1920250R148893J2672708J4743122J6542369K0453494K2699670J7640246
16951A35820752J1225340Q506639K975310o398081j2456530j5818614j9871643
16944A03983173k0690419j7977579j5193398j2689780r565965o551132m375675
$$ plain form
16937 16939225 13947160 11789348 10157932 8916285 7940617 7137912 6441497 5851271 5360098
16928 5360098 4951143 4595374 4274245 3963264 3671048 3372988 3081434 2761508 2461535
16919 2461535 2189751 1949154 1773882 1642406 1518637 1417863 1345217 1281649 1232565 1199433
16909 1199433 1154356 1088118 999939 904640 827897 742901 671903 599210 566506 530546 478126
16898 478126 466516 440779 426556 409230 411734 413340 390209 379740 375696 382841 361770 351891
16886 351891 360705 370837 357400 308838 274610 283005 288916 290260 291132 261480 237232 225755 246920
16873 246920 246375 235541 206110 176564 168365 169401 178475 178081 186116 214807 264556 277211 291647
16860 291647 300952 328891 327488 296970 259341 223530 188312 177123 217964 258526 290663 259840
$$ packed form
16937A6939225k992065k157812j631416j241647r75668q02705o96415n90226m91173
16928E360098m08955l55769l21129l10981k92216k98060k91554l19926k99973
16919B461535k71784k40597j75272j31476j23769j00774p2646o3568m9084l3132
16909A199433m5077o6238q8179r5299p6743q4996p0998p2693l2704l5960n2420
16898D78126j1610k5737j4223j7326K504J606k3131j0469m044P145k1071r879
16886C51891Q814J0132j3437m8562l4228Q395N911J344Q72k9652k4248j1477K1165
16873B46920n45j0834k9431k9546q199J036R074l94Q035K8691M9749J2655J4436
16860B91647R305K7939j403l0518l7629l5811l5218j1189M0841M0562L2137l0823
$$ plain form
16848 259840 270397 290825 264853 233286 214807 208184 176746 151021 148198 137164 138244 124028
16836 124028 114330 123796 100216 87493 91219 63284 15612 -2561 10143 6010 -92 9967
16824 9967 26685 55380 75413 57196 40255 42835 41435 19394 18207 -3926 -22778 14212
16812 14212 39628 38887 73860 81361 69193 72264 51867 35971 24421 3365 -6000 -5077 8273
16799 8273 31826 57311 57679 30451 16482 -15 -1102 -4753 28005 40611 22932 -2449 -20168
16786 -20168 -4789 20036 29540 44645 26444 14849 2775 5732 19769 -1016 3856 6538
16774 6538 12454 13966 -14705 -7142 -25326 -53492 -28984 -16994 -38973 -59541 -64811 -38877 -11416
16761 -11416 -5547 -18802 6292 16036 3340 -12687 -587 -15126 20818 25798 24595 16109 10734
$$ packed form
16848B59840J0557K0428k5972l1567j8479o623l1438k5725k823j1034J080j4216
16836A24028r698R466k3580j2723L726k7935m7672j8173J2704m133o102J0059
16824I967J6718K8695K0033j8217j6941K580j400k2041j187k2133j8852L6990
16812A4212K5416p41L4973P501j2168L071k0397j5896j1550k1056r365R23J3350
16799H273K3553K5485L68k7228j3969j6497j087l651L2758J2606j7679k5381j7719
16786b0168J5379K4825R504J5105j8201j1595j2074K957J4037k0785M872K682
16774F538N916J512k8671P563j8184k8166K4508J1990k1979k0568n270K5934K7461
16761a1416N869j3255K5094R744j2696j6027J2100j4539L5944M980j203q486n375
$$ plain form
16748 10734 8058 34168 39357 27806 13925 -2134 -11775 6362 8836 -3271 -18068 -30570
16736 -30570 -14306 3489 -8429 -9120 -11048 -23027 -28219 -2838 -13281 -28348 -33632 -25026 -22832
16723 -22832 -21266 13399 15224 -179 -8189 -6194 5480 -8554 -7321 14969 11427 -14375 -13925
16710 -13925 -21283 -24355 -9979 2360 -16244 10264 32536 49143 47417 50210 39821 13592
16698 13592 -15185 -14368 -5467 -1191 17142 14529 7914 1306 3265 28363 63915 60266 37978
16685 37978 15451 6733 -1367 -1381 1626 -587 -29957 -32164 -27126 -16277 7185 41022 65519
16672 65519 34324 4034 3587 -5974 -3835 10539 34831 49158 41501 34100 19803 5594 12180
16659 12180 3642 4915 13113 35764 34711 20434 12610 -3919 -17653 -13956 -11620 4018 15483
$$ packed form
16748A0734k676K6110N189j1551j3881j6059r641J8137K474j2107j4797j2502
16736c0570J6264J7795j1918o91j928j1979n192K5381j0443j5067n284Q606K194
16723b2832J566L4665J825j5403q010J995J1674j4034J233K2290l542k5802M50
16710a3925p358l072J4376J2339j8604K6508K2272J6607j726K793j0389k6229
16698A3592k8777Q17Q901M276J8333k613o615o608J959K5098L5552l649k2288
16685C7978k2527q718q100j4L007k213k9370k207N038J0849K3462L3837K4497
16672F5519l1195l0290m47r561K139J4374K4292J4327p657p401j4297j4209O586
16659A2180q538J273Q198K2651j053j4277p824j6529j3734L697K336J5638J1465
$$ plain form
16646 15483 -2414 6034 23327 17527 4219 -1520 -13676 -15653 1984 21023 29349 4981 -10782
16633 -10782 -1278 2008 -8905 -6551 16959 16473 8895 24669 -532 -1524 -1281 12917 35969 6814
16619 6814 -31861 -16563 3167 14361 -24074 -35263 -18827 -18727 -40951 -59446 -44304 -26225
16607 -26225 -5167 23440 16652 -4972 15824 32302 25271 37445 51025 55608 71751 118955
16595 118955 151820 171699 172618 185870 213303 212694 174278 174187 169659 123569 89233 63637 41613
16582 41613 4530 -6443 -5913 -22048 -17304 -21473 -35594 -16619 492 9717 3298 10360 24418
16569 24418 36651 21341 6493 4675 -13293 -14719 -23125 -27387 -45159 -22970 -28756 -64387 -57346
16556 -57346 -15046 10142 30403 36046 14324 22251 17171 13180 29656 26299 16115 1571 -7602
$$ packed form
16646A5483j7897Q448J7293n800j3308n739j2156j977J7637J9039Q326k4368j5763
16633a0782R504L286j0913K354K3510m86p578J5774k5201r92K43J4198K3052k9155
16619F814l8675J5298J9730J1194l8435j1189J6436J00k2224j8495J5142J8079
16607b6225K1058K8607o788k1624K0796J6478p031J2174J3580M583J6143M7204
16595A18955L2865J9879R19J3252K7433o09l8416r1m528m6090l4336k5596k2024
16582D1613l7083j0973N30j6135M744m169j4121J8975J7111R225o419P062J4058
16569B4418J2233j5310j4848j818j7968j426q406m262j7772K2189n786l5631P041
16556e7346M2300K5188K0261N643k1722P927n080l991J6476l357j0184j4544r173
$$ plain form
16543 -7602 1750 -1305 -18906 -7670 -9587 14086 1992 -20297 -1036 23366 14992 -16809 -15715
16530 -15715 -5398 -11794 -13549 18380 22663 37442 20593 12093 -19372 -32378 -23157 -12342 -18590
16517 -18590 -3644 -7573 3275 -19546 -30122 -35390 -51239 -59615 -33664 -29573 -34615 -32110 -8243
16504 -8243 16946 35493 26602 -17658 -24638 -9371 8280 52417 70967 54380 21970 13347
16492 13347 33449 41907 28594 24435 26182 48171 51993 25115 5705 -13706 -11019 4509 6584
16479 6584 -9401 -17674 1740 -10932 -11973 -29332 -32539 -8985 -5044 -17234 -4394 433 -8238
16466 -8238 -32066 -38281 -21194 -5589 21225 16942 1299 11719 26851 23138 -6577 -5819 12792
16453 12792 -5097 -52941 -58582 -36316 -18736 -10572 -1375 -4849 -30325 -26186 -37844 -66116 -78415
$$ packed form
16543g602R352l055j7601J1236j917K3673j2094k2289J9261K4402q374l1801J094
16530a5715J0317o396j755L1929M283J4779j6849q500l1465j3006R221J0815o248
16517a8590J4946l929J0848k2821j0576n268j5849q376K5951M091n042K505K3867
16504h243K5189J8547q891m4260o980J5267J7651M4137J8550j6587l2410q623
16492A3347K0102Q458j3313m159J747K1989L822k6878j9410j9411K687J5528K075
16479F584j5985q273J9414j2672j041j7359l207K3554L941j2190J2840M827q671
16466h238k3828o215J7087J5605K6814m283j5643J0420J5132l713k9715P58J8611
16453A2792j7889m7844n641K2266J7580Q164R197l474k5476M139j1658k8272j2299
$$ plain form
16440 -78415 -70866 -32740 -4070 -27979 -40237 -25414 -16187 -6162 -16814 -31430 -28621 -20023
16428 -20023 -67418 -61388 -35213 -20310 -23869 -39828 -37023 -26817 -3883 7013 -7331 -18402
16416 -18402 -16180 -29686 -13692 -13469 6210 40349 32073 32795 44908 60104 76382 47558 27307
16403 27307 35538 53615 23995 -10600 -31000 -35914 -29027 10714 19141 27377 20568 1626 9528
16390 9528 29230 29806 24736 34114 26037 37475 69684 92471 129872 179083 271724 356122 435131
16377 435131 540130 637584 699171 775749 813728 807294 770638 718322 626638 523250 417453
16366 417453 331639 249351 185474 137740 112948 101217 78333 78648 56009 36492 59989 69666
16354 69666 34721 28427 -9100 -19521 -1927 4453 -8123 -17600 -11014 -3384 -9629 -16542 -3549
$$ packed form
16440g8415P549L8126K8670k3909j2258J4823R227J0025j0652j4616K809Q598
16428b0023m7395O030K6175J4903l559j5959K805J0206K2934J0896j4344j1071
16416a8402K222j3506J5994K23J9679L4139q276P22J2113J5196J6278k8824k0251
16403B7307Q231J8077k9620l4595k0400m914O887L9741Q427Q236o809j8942P902
16390I528J9702N76n070R378q077J1438L2209K2787L7401M9211R2641Q4398P9009
16377D35131J04999R7454O1587P6578L7979o434l6656n2316r1684j03388j05797
16366D17453q5814q2288o3877m7734k4792j1731k2884L15k2639j9517K3497R677
16354F9666l4945o294l7527j0421J7594O380j2576r477O586P630o245o913J2993
$$ plain form
16341 -3549 17719 12788 -5308 11529 18179 257 -17535 -13330 -21319 -7963 13504 3359 -9013
16328 -9013 4993 24606 18327 -26610 -57446 -11756 36769 46222 35413 12535 5707 6015 -2960
16315 -2960 -11719 -28964 -47448 -38161 -18992 -19908 -7233 10572 -17163 -68665 -59416 -52301 -35290
16302 -35290 -29876 -14125 -11045 -22424 -34313 -21427 -5276 13785 -12137 -6931 11149 13539
16290 13539 -1017 -1765 15002 14345 28070 30633 33577 2592 -25625 -10430 -2001 -19350 -30358
16277 -30358 -25370 -23363 -23320 -55931 -52262 -43659 -46010 -55293 -55628 -38091 -18627 -23718 -41852 -75344
16263 -75344 -53802 -46212 -21456 -6923 -15863 -9187 -3301 -28884 -65369 -46127 -32871 -43070
16251 -43070 -45948 -41776 -50263 -60959 -40416 -14845 -1522 469 10162 36159 27679 6533 -1424
$$ packed form
16341c549K1268m931j8096J6837O650j7922j7792M205p989J3356K1467j0145j2372
16328i013J4006J9613o279m4937l0836M5690M8525R453j0809k2878o828L08q975
16315b960q759j7245j8484R287J9169r16J2675J7805k7735n1502R249P115J7011
16302c5290N414J5751L080j1379j1889J2886J6151J9061k5922N206J8080K390
16290A3539j4556p48J6767o57J3725K563K944l0985k8217J5195Q429j7349j1008
16277c0358M988K007M3l2611L669Q603k351r283l35J7537J9464n091j8134l3492
16263g5344K1542P590K4756J4533q940O676N886k5583l6485J9242J3256j0199
16251d3070k878M172q487j0696K0543K5571J3323J991R693K5997q480k1146p957
$$ plain form
16238 -1424 -360 -6328 2178 25575 32882 37417 7523 -9466 -36266 -52944 -61685 -68717 -53676
16225 -53676 -39000 -56618 -73262 -67477 -16137 -17849 -12224 -11713 -20560 -8537 -3177 -17523 -18350
16212 -18350 -30258 -37430 -41092 -22818 -12214 2263 11290 15940 26471 -14203 -25137 545
16200 545 3812 8776 -11982 -34836 -47603 -45107 -70653 -79162 -86533 -71124 -40368 -20009 -3483
16187 -3483 4479 32723 30269 29973 18645 28679 25508 -12991 -23730 -21284 -21582 -25365 -17863 -8712
16173 -8712 -20661 -32631 -31706 -33663 -36358 -31627 -77472 -95107 -51505 -36371 -36418 -27966 -29148 -27972
16159 -27972 -4909 8145 -14143 -36319 -45303 -22878 6301 8238 -6026 -11686 2972 23161
16147 23161 21611 -338 -19771 -38738 -23744 -9571 13618 13756 -4104 -20930 -13829 5633
$$ packed form
16238a424J064n968Q506K3397P307M535k9894j6989k6800j6678q741p032J5041
16225e3676J4676j7618j6644N785N1340j712N625N11q847J2023N360j4346q27
16212a8350j1908p172l662J8274J0604J4477R027M650J0531m0674j0934K5682
16200E45L267M964k0758k2854j2767K496k5546q509p371J5409L0756K0359J6526
16187c483P962K8244k454k96j1328J0034l171l8499j0739K446k98l783P502R151
16173h712j1949j1970R25j957k695M731m5845j7635M3602J5134m7Q452j182J176
16159b7972K3063J3054k2288k2176q984K2425K9179J937j4264n660J4658K0189
16147B3161j550k1949j9433j8967J4994J4173K3189J38j7860j6826P101J9462
$$ plain form
16135 5633 -6736 -952 -14433 -8431 9124 11150 21980 41226 71581 37698 6290 -13126
16123 -13126 21504 14209 -9690 -22009 -28808 -2221 10848 -15906 -28272 -14764 -6014 -3667
16111 -3667 7837 705 -23853 -44187 -46494 -29391 -9274 15670 21400 5229 2318 -10205 910
16098 910 1860 -4083 22685 44908 5617 -22549 -17859 10033 35083 29282 31489 9136 -29587
16085 -29587 -55547 -50817 -38910 -21887 3237 13585 -7288 -12690 -7808 16218 21663 9072
16073 9072 9899 14493 -10345 -30502 -18762 1549 8241 -10963 -31989 -46791 -37594 -34483 -16006
16060 -16006 9246 12258 -607 -26634 -37176 -38641 -15696 -28468 -43117 -57145 -70184 -67786
16048 -67786 -62997 -66419 -58628 -50355 -28194 21806 31318 33871 -7145 -20468 -32499 -29620 -35594
$$ packed form
16135E633j2369N784j3481O002J7555K026J0830J9246L0355l3883l1408j9416
16123a3126L4630p295k3899j2319o799K6587J3069k6754j2366J3508Q750K347
16111c667J1504p132k4558k0334k307J7103K0117K4944N730j6171k911j2523J1115
16098I10R50n943K6768K2223l9291k8166M690K7892K5050n801K207k2353l8723
16085b9587k5960M730J1907J7023K5124J0348k0873n402M882K4026N445j2591
16073I072Q27M594k4838k0157J1740K0311O692j9204k1026j4802R197L111J8477
16060a6006K5252L012j2865k6027j0542j465K2945j2772j4649j4028j3039K398
16048f7786M789l422P791Q273K2161N0000R512K553m1016j3323j2031K879n974
$$ plain form
16035 -35594 -32475 -34676 -12811 5086 4482 -17334 -32058 -13858 26473 23726 -10635 -19343 -26752
16022 -26752 -31722 -68810 -55116 -27681 -25988 -30199 -16613 -10584 -23611 -34106 -2423 1160 1872
16009 1872 22525 32263 22432 20247 36404 39297 18566 22417 11972 -27736 -7554 -21339 -17502
15996 -17502 -13776 4216 21842 18200 20891 35029 14590 -669 -5299 -2460 25020 25038 2047
15983 2047 786 -6710 -15565 -13605 5536 12283 -819 -4232 -29908 -49396 -11949 9789 22061
15970 22061 5811 6626 15066 34808 24871 16242 -3462 -2094 3645 -2676 -3776 -10720 -3908 11829
15956 11829 13279 27697 30214 -5439 -34256 -55213 -42356 -22965 -17080 -18161 -24785 -36114 -32984
15943 -32984 -33806 -40864 -59648 -51660 -16981 -20559 -22056 -22520 -25444 -24876 -43333 -56076 -54856 -18331
$$ packed form
16035c5594L119k201K1865J7897o04k1816j4724J8200M0331k747l4361q708p409
16022b6752m970l7088J3694K7435J693m211J3586O029j3027j0495L1683L583P12
16009A872K0653R738r831k185J6157K893k0731L851j0445l9708K0182j3785L837
15996a7502L726J7992J7626l642K691J4138k0439j5259m630K839K7480J8k2991
15983B047j261p496q855J960J9141O747j3102l413k5676j9488L7447K1738J2272
15970B2061j6250Q15Q440J9742r937q629j9704J368N739o321j100o944O812J5737
15956A1829J450J4418K517l5653k8817k0957J2857J9391N885j081o624j1329L130
15943c2984q22p058j8784P988L4679l578j497m64k924N68j8457j2743J220L6525
$$ plain form
15929 -18331 12810 -3762 -18490 -12470 -21403 -28111 -19078 -8041 -5157 -22993 -46930 -63772 -56074
15916 -56074 -37515 7761 17192 9173 38272 28383 20335 1988 27037 49111 42261 22298 -11900
15903 -11900 -28041 -8189 -7316 -14896 -15484 7649 32554 51699 42603 11134 2406 2967 -25358
15890 -25358 -16312 -8891 -825 -7797 -11570 -13960 -17367 -29521 -20096 -15953 -12985 -8434 -6066 8253
15876 8253 -12510 4021 11786 6750 -7504 18503 26854 -6262 12917 22041 8082 671 637
15863 637 -1587 20778 17487 19095 18012 781 5077 2382 568 12294 21776 20672 19380 6596
15849 6596 -13145 -24249 -59433 -39347 -19981 -6269 -9383 -11919 -1131 -16116 -20639 -13273 -41135
15836 -41135 -65236 -42994 -12505 7233 17869 22058 22496 6595 3338 5076 -12026 -36078 -32743
$$ packed form
15929a8331L1141j6572j4728O020q933o708R033J1037K884j7836k3937j6842P698
15916e6074J8559M5276R431q019K9099r889q048j8347K5049K2074o850j9963l4198
15903a1900j6141J9852Q73p580n88K3133K4905J9145r096l1469q728N61k8325
15890b5358R046P421Q066o972l773k390l407j2154R425M143K968M551K368J4319
15876H253k0763J6531P765n036j4254K6007Q351l3116J9179R124j3959p411l4
15863F37k224K2365l291J608j083j7231M296k695j814J1726R482j104j292j2784
15849F596j9741j1104l5184K0086J9366J3712l114k536J0788j4985m523P366k7862
15836d1135k4101K2242L0489J9738J0636M189M38j5901l257J738j7102k4052L335
$$ plain form
15823 -32743 -16924 -31243 -25639 358 23140 428 -4284 -11890 -199 3220 -3537 -10494 -17183
15810 -17183 -13081 -15873 -18342 -31541 -14544 7703 -8986 -11004 -5903 31409 25539 21255 13421
15797 13421 13732 -18864 -43219 -32321 -19161 -10046 -23250 -41285 -41561 -25889 -27792 -52617 -47979
15784 -47979 -47872 -32160 -12954 -12811 -18129 -27932 -14399 6728 -11502 -19543 -26575 -33312 -39210 -38940
15770 -38940 -16815 -7898 -23072 -1572 -6044 -11791 -31221 -34341 -40658 -75068 -82277 -70629 -41946
15757 -41946 -37931 -46739 -32727 -5516 -36870 -41272 -23419 6408 29960 33556 11339 -2481
15745 -2481 17031 22614 4469 -11498 -16971 -20684 -45595 -38685 -14720 8886 2449 6342 -1038
15732 -1038 -35198 -49351 -31324 -18797 -27575 -8554 -11523 -15952 -17418 -37993 -51872 -39503 -26025
$$ packed form
15823c2743J5819j4319N604K5997K2782k2712m712p606J1691L419o757o957o689
15810a7183M102k792k469j3199J6997K2247j6689k018N101L7312n870m284p834
15797A3421L11l2596k4355J0898J3160R115j3204j8035k76J5672j903k4825M638
15784d7979J07J5712J9206J43n318r803J3533K1127j8230q041p032o737n898K70
15770c8940K2125Q917j5174K1500m472n747j9430l120o317l4410p209J1648K8683
15757d1946M015q808J4012K7211l1354m402J7853K9827K3552L596k2217j3820
15745b481J9512N583j8145j5967n473l713k4911O910K3965K3606o437L893p380
15732a038l4160j4153J8027J2527q778J9021k969m429j466k0575j3879J2369J3478
$$ plain form
15719 -26025 -15424 -43809 -29378 -6477 -14597 -31375 -42470 -36092 1791 30922 22134 19068
15707 19068 9399 1839 -4105 -8404 -4891 -261 16092 18697 24952 21865 -6851 -32941 -19536
15694 -19536 -8350 14153 -2559 -3665 -11315 -34940 -20616 -5345 -26664 -45726 -59278 -31274
15682 -31274 -34364 -32860 -20636 -9285 14592 3806 -791 4057 10393 17962 29165 20325 24363
15669 24363 39389 40414 10220 -21843 -23470 -8142 -21481 -41718 -30305 -39041 -33562 -24882 -28547
15656 -28547 -26635 -14444 5092 4006 481 2000 13577 -14626 -18675 -5771 -5791 8096 23239
15643 23239 27769 19023 -17957 -24308 -15620 5312 6438 28636 7754 -7022 -25196 -34384 -23649
15630 -23649 -26021 -28732 -45809 -22475 6418 -5757 -21157 5718 19856 29624 19534 -23579
$$ packed form
15719b6025J0601k8385J4431K2901q120j6778j1095O378L7883K9131q788l066
15707A9068r669p560n944m299L513M630J6353K605O255l087k8716k6090J3405
15694a9536J1186K2503j6712j106p650k3625J4324J5271k1319j9062j3552K8004
15682c1274l090J504J2224J1351K3877j0786m597M848O336P569J1203q840M038
15669B4363J5026J025l0194l2063j627J5328j3339k0237J1413q736N479Q680l665
15656b8547J912J2191J9536j086l525J519J1577k8203m049J2904k0J3887J5143
15643B3239M530q746l6980o351Q688K0932J126K2198k0882j4776j8174r188J0735
15630b3649k372k711j7077K3334K8893j2175j5400K6875J4138R768j0090m3113
$$ plain form
15618 -23579 -24609 -37871 -64183 -48466 -20835 -20198 -16833 -4137 25343 30742 11088 18484 31622
15605 31622 19111 11693 -6893 -505 -31715 -59365 -18813 -116 -1787 -18220 -34484 -42974
15593 -42974 -37407 -29193 -44380 -63983 -51422 -44406 -37285 -43312 -60441 -37616 -15680 17147 26193
15580 26193 27286 15565 16899 7352 13073 11987 -10402 -31304 -31031 -28044 -56993 -23487 -3471
15567 -3471 2773 9107 2494 8087 20692 -16139 -25090 -8119 -8992 -24807 -14137 -9072 -38895
15554 -38895 -28949 -31314 -32344 -45599 -46065 -27258 -11876 71 11880 11954 20649 13572 13205 30173
15540 30173 36560 38924 26802 -4641 -16058 -702 24040 43278 22521 7056 13377 21522
15528 21522 -3051 -1712 2666 -13801 -16745 -19669 -37926 -50587 -54269 -45446 -71697 -65290 -44097
$$ packed form
15618b3579j030j3262k6312J5717K7631O37L365J2696K9480N399j9654P396J3138
15605C1622j2511p418j8586O388l1210k7650M0552J8697j671j6433j6264q490
15593d2974N567Q214j5187j9603J2561P016P121o027j7129K2825K1936L2827R046
15580B6193J093j1721J334r547N721j086k2389k0902K73K987k8949L3506K0016
15567c471O244O334o613N593J2605l6831q951J6971q73j5815J0670N065k9823
15554c8895R946k365j030j3255m66J8807J5382J1947J1809P4Q695p077l67J6968
15540C0173O387K364j2122l1443j1417J5356K4742J9238k0757j5465O321Q145
15528B1522k4573J339M378j6467k944k924j8257j2661l682Q823k6251O407K1193
$$ plain form
15515 -44097 -28807 -10523 -3242 -15860 -30193 -37524 -23711 1389 19833 16200 35862 25868
15503 25868 17062 5373 -19693 -37554 -24951 -25468 -18316 -17333 -20957 -35347 -44371 -53862 -55754 -26806
15489 -26806 -10723 12249 -2935 15410 18203 8160 -7946 -13891 -9886 -15326 -22770 -14547 -10204
15476 -10204 -23683 -19606 -33967 -15322 7759 13162 9380 3470 -456 8289 17546 18464 7582
15463 7582 17524 8399 -32253 -30949 -36420 -34181 -47179 -45559 -33492 -5717 9125 28878 -6503
15450 -6503 -45219 -36466 -23480 -28950 -18127 -7182 -6841 15590 -3648 -31203 -15120 -12193 -4136
15437 -4136 -14740 -10866 -33187 -70476 -69375 -44862 -15044 12355 17217 -11424 -34893 -36636 -18098
15424 -18098 -17178 -39921 -26589 2702 12308 4254 -24809 -7951 6429 -3999 -9466 -30521 -23366
$$ packed form
15515d4097J5290J8284P281j2618j4333p331J3813K5100J8444l633J9662r994
15503B5868q806j1689k5066j7861J2603n17P152R83l624j4390r024r491j892K8948
15489b6806J6083K2972j5184J8345K793j0043j6106n945M005n440p444Q223M343
15476a0204j3479M077j4361J8645K3081N403l782n910l926Q745R257R18j0882
15463G582R942r125m0652J304n471K239j2998J620J2067K7775J4842J9753l5381
15450f503l8716Q753J2986n470J0823J0945L41K2431j9238k7555J6083K927Q057
15437d136j0604L874k2321l7289J101K4513K9818K7399M862k8641k3469j743J8538
15424a8098R20k2743J3332K9291R606q054k9063J6858J4380j0428n467k1055P155
$$ plain form
15411 -23366 -1101 -12027 -28594 -9546 9306 23202 21506 16949 -3060 -2834 18251 22032 27370
15398 27370 32116 16143 7305 -10017 -21445 -37823 -54057 -56646 -51823 -28140 -4250 5003 14212
15385 14212 -1150 12501 35339 22030 -15150 -1576 5877 -58 -16664 -23072 -48939 -51247
15373 -51247 -54239 -53301 -58237 -25239 1950 449 -11261 -9862 -14997 -25494 -26279 -36050 -27309 -16822
15359 -16822 -32287 -45933 -40004 -40831 -23800 -3185 -14524 -27223 -15810 -28811 -42194 -28322
15347 -28322 -40409 -37754 -28275 -24600 -22775 -33593 -37475 -19752 -23195 -14512 -24148 -27172 -38285
15334 -38285 -40474 -27698 -2490 -4572 -4296 -23074 -22034 -34260 -52736 -33637 -4358 1354 21308
15321 21308 9743 -23092 -42550 -63806 -67196 -28896 -29025 -39824 -31519 9287 13746 545 6988
$$ packed form
15411b3366K2265j0926j6567J9048J8852J3896j696m557k0009K26K1085L781N338
15398B7370M746j5973q838j7322j1428j6378j6234k589M823K3683K3890R253R209
15385A4212j5362J3651K2838j3309l7180J3574P453n935j6606o408k5867k308
15373e1247k992R38m936L2998K7189j501j1710J399n135j0497p85r771Q741J0487
15359a6822j5465j3646N929q27J7031K0615j1339j2699J1413j3001j3383J3872
15347b8322j2087K655R479L675J825j0818l882J7723l443Q683r636l024j1113
15334c8285k189J2776K5208k082K76j8778J040j2226j8476J9099K9279N712J9954
15321B1308j1565l2835j9458k1256l390L8300j29j0799Q305M0806M459j3201O443
$$ plain form
15308 6988 -3271 872 -15302 -16264 -26999 -9578 -5419 4593 10173 -10091 -29322 2323 13097
15295 13097 13019 30679 -1097 -11816 -24119 -18613 -21744 -60954 -26163 -12614 -22739 -9474 9230
15282 9230 35486 14677 18508 29300 24384 25423 22439 26261 31683 23678 -9541 3649 23024
15269 23024 11563 -5765 -39839 -41065 -15767 -25645 -35463 -34470 -21508 -28892 -11816 11165 20218
15256 20218 -4274 2340 -43526 -90553 -74671 -45624 -11600 2634 -4165 5389 -30788 -51709
15244 -51709 -43426 -33745 -14793 29030 22286 14183 -11010 -4668 20111 34682 7256 -25843 -23897
15231 -23897 1712 4246 -5726 -33005 -58051 -51350 -26897 -33616 -36976 -40501 -17670 -23152 -19627
15218 -19627 -8862 5155 -4021 -7381 2763 17826 21821 22731 23653 38779 44273 20580 26484
$$ packed form
15308F988j0259M143j6174r62j0735J7421M159J0012N580k0264j9231L1645J0774
15295A3097p8J7660l1776j0719j2303N506l131l9210L4791J3549j0125J3265J8704
15282I230K6256k0809L831J0792m916J039k984L822N422q005l3219J3190J9375
15269B3024j1461j7328l4074j226K5298r878r818R93J2962p384J7076K2981R053
15256B0218k4492O614m5866m7027J5882K9047L4024J4234o799R554l6177k0921
15244e1709Q283R681J8952M3823o744q103k5193O342K4779J4571k7426l3099J946
15231b3897K5609K534r972k7279k5046O701K4453o719l360l525K2831n482L525
15218a9627J0765J4017r176l360J0144J5063L995R10R22J5126N494k3693N904
$$ plain form
15205 26484 17489 16330 5513 -8476 14841 28900 10957 -7792 -24815 -40251 -16626 14727
15193 14727 27260 13146 22675 3107 7586 27976 809 -28355 -28598 -10241 -33194 -28515 -12449
15180 -12449 -11036 -22084 -18414 -24828 -25916 -18022 -775 18384 5125 -1363 24965 42254 43118
15167 43118 58002 69651 39572 -8561 -25006 -21159 -30544 -22774 -20655 -8010 -25300 -42352
15155 -42352 -35142 -39362 -46332 -35940 -11960 5396 10032 22428 5800 21244 18603 -10399 -699
15142 -699 6446 1673 -17709 -45822 -32094 -6820 30230 44470 43080 35085 10303 -4754 -25083
15129 -25083 -22836 1130 -8163 -17280 -23410 -19605 -9634 -5823 7174 -837 -17466 -13063 1621
15116 1621 28968 49626 42606 33228 27023 39152 32681 13666 27401 25038 -14119 -41972 -28737
$$ packed form
15205B6484q995j159j0817j3989K3317J4059j7943j8749j7023j5436K3625L1353
15193A4727J2533j4114R529j9568M479K0390k7167k9164k43J8357k2953M679J6066
15180a2449J413j1048L670o414j088P894J7247J9159j3259o488K6328J7289Q64
15167D3118J4884J1649l0079m8133j6445L847r385P770K119J2645j7290j7052
15155d2352P210m220o970J0392K3980J7356M636J2396j6628J5444k641k9002R700
15142f99P145m773j9382k8113J3728K5274L7050J4240j390p995k4782j5057k0329
15129b5083K247K3966r293r117o130L805R971L811J2997q011j6629M403J4684
15116A621K7347K0658p020r378o205J2129o471j9015J3735k363l9157k7853J3235
$$ plain form
15103 -28737 -11619 -22946 -32193 -53241 -46360 -19945 19044 21561 19678 18049 23298 5301 -17065
15090 -17065 -30489 -26106 -2581 14783 2994 -11376 -6912 -7571 -3113 -20477 -8362 12487 -3845
15077 -3845 2142 29263 5416 -21748 -17984 331 11663 1010 -10313 -9509 9346 -5391 -30551
15064 -30551 -45376 -59986 -41759 -20078 5463 21119 23770 23012 40302 43814 -10592 -44376
15052 -44376 -30174 -6295 18770 20027 206 -10633 36199 59388 32652 -3052 -11286 -19386
15040 -19386 -6558 1331 -1745 -34278 -28023 -13502 -12550 -23565 -27041 -15454 -22930 -20587 -27084
15027 -27084 -27058 -13678 -24403 -13982 -21130 -36758 -19093 3790 28089 -3826 -21029 -20965 -7420
15014 -7420 -3158 -20341 -21673 -11353 -4396 8958 22723 6181 5242 -9286 -43878 -44695 -3194
$$ packed form
15103b8737J7118j1327r247k1048O881K6415L8989K517j883j629N249j7997k2366
15090a7065j3424M383K3525J7364j1789j4370M464o59M458j7364J2115K0849j6332
15077c845N987K7121k3847k7164L764J8315J1332j0653j1323Q04J8855j4737k5160
15064c0551j4825j4610J8227K1681K5541J5656K651p58J7290L512n4406l3784
15052d4376J4202K3879K5065J257j9821j0839M6832K3189k6736l5704q234q100
15040a9386J2828P889l076l2533O255J4521R52j1015l476J1587p476K343o497
15027b7084K6J3380j0725J0421p148j5628J7665K2883K4299l1915j7203O4J3545
15014g420M262j7183j332J0320O957J3354J3765j6542r39j4528l4592q17M1501
$$ plain form
15001 -3194 9900 18608 30431 12422 -25710 -27882 -11518 -6743 -3149 -3680 -15805 -26048 -18884
14988 -18884 -20063 -28126 -24854 -27202 296 16893 -5413 -35010 -53635 -35376 -32196 -50173 -6811
14975 -6811 8370 8755 -3078 -17339 13343 7271 -489 -10217 -10956 -30091 -49300 -35920 -38353
14962 -38353 -48228 -69591 -62161 -26605 -9147 5452 -5823 -18298 -16747 -3958 -6346 -382 -3377
14949 -3377 -7152 -5994 7694 -10972 -18196 -11588 -33205 -36332 -915 -13459 -15704 5366 -2879
14936 -2879 -15956 -9693 -17213 -33957 -31314 -13345 -26784 -45620 -21733 -18960 -16390 -15957 -27818
14923 -27818 -16187 -38085 -46333 -26947 -22389 -27395 -21920 -23519 -24044 7667 18740 7878 11335
14910 11335 5806 5721 -12792 -10941 3931 23807 39833 14630 8114 8407 -12286 -45655 -30137
$$ packed form
15001c194J3094Q708J1823j8009l8132k172J6364M775L594n31j2125j0243P164
14988a8884j179q063L272k348K7498J6597k2306k9597j8625J8259L180j7977M3362
14975f811J5181L85j1833j4261L0682o072p760r728p39j9135j9209J3380k433
14962c8353r875k1363P430L5556J7458J4599j1275j2475J551J2789k388N964k995
14949c377l775J158J3688j8666p224O608k1617l127L5417j2544k245K1070q245
14936b879j3077O263p520j6744K643J7969j3439j8836K3887K773K570M33j1861
14923b7818J1631k1898q248J9386M558n006N475j599n25L1711J1073j0862L457
14910A1335n529q5j8513J851J4872J9876J6026k5203o516K93k0693l3369J5518
$$ plain form
14897 -30137 -7549 18445 26251 29155 29373 21077 30650 1641 -12528 1259 6083 -4940 16272
14884 16272 4480 -15628 -28242 -41768 -22913 -25550 -38933 -40133 -38899 -34969 -8496 25281
14872 25281 36157 18841 28392 40323 6970 -20224 -35798 -19091 -2251 21763 25178 21725
14860 21725 17949 26367 34958 52436 38322 25567 13010 19477 1859 11195 19055 40467 45552
14847 45552 43774 48742 24683 3066 -2818 -1299 -11256 -11453 -26522 -25356 -4460 20737 11869
14834 11869 -17058 -20371 -21567 -17379 -24488 -23824 -21282 -1724 -13299 -25426 -37741 -43885 -28305
14821 -28305 -20472 -6549 -3349 -960 5309 5086 11309 13351 974 -4767 12738 4700 -21301 -32554
14807 -32554 -22916 -3038 11459 -12588 -49273 -52028 -31014 -14211 82 11692 24860 13462
$$ packed form
14897c0137K2588K5994P806K904K18q296R573k9009j4169J3787M824j1023K1212
14884A6272j1792k0108j2614j3526J8855k637j3383j200J234L930K6473L3777
14872B5281J0876j7316R551J1931l3353k7194j5574J6707J6840K4014L415l453
14860B1725l776Q418Q591J7478j4114j2755j2557O467j7618R336P860K1412N085
14847D5552j778M968k4059k1617n884J519r957j97j5069J166K0896K5197q868
14834A1869k8927l313j196M188p109O64K542J9558j1575j2127j2315o144J5580
14821b8305P833J3923L200K389O269k23O223K042j2377n741J7505q038k6001j1253
14807c2554R638J9878J4497k4047l6685k755K1014J6803J4293J1610J3168j1398
$$ plain form
14795 13462 15480 15492 14745 7114 -1148 -17610 169 13078 -9592 -15908 9045 28474 22872 3840
14781 3840 2667 24269 24609 26070 -3262 -36139 -59179 -34541 -10387 -6707 -7499 -14382 -3803
14768 -3803 4470 -12443 -17790 288 -15823 -2661 36701 51891 65567 73023 63256 47746 38480
14755 38480 22729 20870 -263 -17762 -5815 -3614 -22534 -13067 -17337 15404 11717 2774 5727
14742 5727 -23219 -39728 -18439 -30163 -24465 21900 46063 32254 19255 26116 38363 17954
14730 17954 -16843 -33857 -15254 -5602 12816 16980 6142 4160 1826 6524 -1127 -2781 -19632
14717 -19632 -45409 -30779 -7618 -2981 30871 56739 53981 50819 29257 13608 29852 -12891
14705 -12891 -4987 1911 7997 -3158 1850 -43586 -34029 -13940 -7533 -26514 -36479 -12812 12838
$$ packed form
14795A3462K018J2p47p631q262j6462J7779J2909k2670o316K4953J9429n602j9032
14781C840j173K1602L40J461k9332l2877k3040K4638K4154L680p92o883J0579
14768c803Q273j6913n347J8078j6111J3162L9362J5190J3676P456r767j5510r266
14755C8480j5751j859k1133j7499J1947K201j8920R467m270L2741l687q943K953
14742E727k8946j6509K1289j1724N698M6365K4163j3809j2999O861J2247k0409
14730A7954l4797j7014J8603R652J8418M164j0838j982k334M698p651j654j6851
14717a9632k5777J4630K3161M637L3852K5868k758l162k1562j5649J6244m2743
14705a2891P904O898O086j1155N008m5436R557K0089O407j8981r965K3667K5650
$$ plain form
14692 12838 1329 -25885 -37264 -42868 -48724 -9857 8857 1637 -7818 -11629 -14004 -37244 -45422
14679 -45422 -45098 -34011 -30331 -16017 -19137 -22240 -23667 -13745 -11492 -3127 -21451 -33159 -41651 -65587
14665 -65587 -60927 -50233 -40314 -16869 -12171 -19443 -26799 -35646 -32756 -17788 -13431 -21723 -31047 -9091
14651 -9091 30505 23329 3543 -16069 -45680 -28601 -9616 4465 4049 27349 7236 18992
14639 18992 39374 44091 36898 23141 19049 9994 616 6455 17203 23898 -7976 -37124 -20946
14626 -20946 18025 17824 24490 14330 -5936 -2836 2142 13073 11136 20419 21937 10551 -16898
14613 -16898 13626 7366 -4730 -15914 -11203 7221 26144 5211 -7941 -8907 -6078 -5460 -2336
14600 -2336 2519 11622 46584 31376 -12325 -37617 -32323 -13410 -1740 30859 18633 12382 -585
$$ packed form
14692A2838j1509k7214j1379n604n856L8867J8714p220r455l811k375k3240q178
14679d5422L24J1087L680J4314l120l103j427R922K253Q365j8324j1708q492k3936
14665f5587M660J0694R919K3445M698p272p356q847K890J4968M357q292r324K1956
14651i091L9596p176j9786j9612k9611J7079J8985J4081m16K3300k0113J1756
14639A8992K0382M717p193j3757m092r055r378N839J0748O695l1874k9148J6178
14626b0946L8971k01O666j0160k0266L100M978J0931j937R283J518j1386k7449
14613a6898L0524o260j2096j1184M711J8424J8923k0933j3152r66K829O18L124
14600b336M855R103L4962j5208m3701k5292N294J8913J1670L2599j2226o251j2967
$$ plain form
14587 -585 3367 -446 -13134 -8246 -14532 -20755 -33430 -47417 -52764 -88162 -93352 -75318 -49049
14574 -49049 -44045 -35974 8952 53327 43887 30849 16926 17851 21457 33536 21391 23730 -11551
14561 -11551 -19178 -5791 12522 16615 25592 38474 49596 35504 27643 -3732 -44565 -27575
14549 -27575 -8521 -22680 -16079 3307 -5560 -24553 -11337 -5563 13950 5377 -16011 -22947 -39545
14536 -39545 -39808 -35644 -21639 -12959 -9079 5449 8456 29333 34405 4360 15394 21379 14642
14523 14642 3939 7754 7720 -3937 -3884 -13045 -340 2628 -699 -28867 -20946 16773 9069 -16166
14509 -16166 -4382 36203 29794 9417 827 -13432 -23232 -10352 12539 18761 -6904 -44698
14497 -44698 -33443 -33557 -13434 20770 27062 -3614 16802 44226 45072 4377 -42764 -27260 104
$$ packed form
14587e85L952l813j2688M888o286o223j2675j3987n347l5398n190J8034K6269
14574d9049N004Q071M4926M4375r440j3038j3923R25L606J2079j2145K339l5281
14561a1551p627J3387J8313M093Q977J2882J1122j4092p861l1375m0833J6990
14549b7575J9054j4159O601J9386q867j8993J3216N774J9513q573k1388o936j6598
14536c9545k63M164J4005Q680L880J4528L007K0877N072l0045J1034N985o737
14523A4642j0703L815l4j1657N3r161J2705K968l327k8168P921L7719p704k5235
14509a6166J1784M0585o409k0377q590j4259r800J2880K2891O222k5665l7794
14497d4698J1255j14K0123L4204O292l0676K0416K7424Q46m0695m7141J5504K7364
$$ plain form
14484 104 6572 21627 28892 25289 26125 20341 19567 34940 17888 369 16908 711 -37857 -44976
14470 -44976 -44950 -34426 -16823 -19014 6767 24028 1612 -32232 -43405 -35636 -13126 5770 14913
14457 14913 22447 31636 -1272 -15254 -32465 -60895 -33250 -30739 -40732 -32461 -12149 17366 36503
14444 36503 43190 44590 56607 34774 19299 22899 11206 19140 36563 27527 -321 -6192 711
14431 711 611 33561 42374 1853 -14838 -11590 -6871 3553 -1242 3823 -5769 -8285 -11877 -4547
14417 -4547 6413 11139 -27712 -34055 -21887 -29414 -13798 15689 35978 27668 24170 19571 11748
14404 11748 11025 16894 14701 26665 25582 22034 15780 51467 30951 11534 6201 -9526 2711
14391 2711 32921 26577 -6989 -7095 -21994 -16963 -4951 8754 32580 30951 13186 10069 783
$$ packed form
14484A04O468J5055P265l603Q36n784p74J5373j7052j7519J6539j6197l8568p119
14470d4976K6J0524J7603k191K5781J7261k2416l3844j1173P769K2510J8896R143
14457A4913P534R189l2908j3982j7211k8430K7645K511r993Q271K0312K9515J9137
14444C6503O687J400J2017k1833j5475L600j1693P934J7423r036k7848n871O903
14431G11j00L2950Q813m0521j6691L248M719J0424m795N065r592k516l592P330
14417d547J0960M726l8851o343J2168p527J5616K9487K0289q310l498m599p823
14404A1748p23N869k193J1964j083l548o254L5687k0516j9417n333j5727J2237
14391B711L0210o344l3566j06j4899N031J2012J3705K3826j629j7765l117r286
$$ plain form
14378 783 -24157 -27196 -42821 -29849 -33225 -58516 -45636 -35804 -38175 -2815 33879 50604 38874
14365 38874 14856 24431 44307 55235 23416 12123 -2372 -12688 -18763 -4518 937 27022
14353 27022 59032 62278 45982 14139 6151 1851 -34358 -42278 -25776 -19745 -14294 -20420 -7802
14340 -7802 7795 -23131 -36517 -10099 900 5006 17663 11943 6233 5627 3113 16074 12192
14327 12192 7489 -12385 -8303 1816 14434 -6339 -16374 17713 19196 8270 -7680 -26483
14315 -26483 -11796 -10671 2947 14526 15785 -13236 -561 19963 44466 52648 33119 10438
14303 10438 -140 27049 23672 27817 18928 -11192 -5051 -11791 31397 64526 50763 21716 13833
14290 13833 -14280 -25542 -33128 -40069 -26344 18106 38774 24841 -13230 -25284 -9278 -6157
$$ packed form
14378G83k4940l039j5625J2972l376k5291J2880R832k371L5360L6694J6725j1730
14365C8874k4018R575J9876J0928l1819j1293j4495j0316o075J4245N455K6085
14353B7022L2010L246j6296l1843p988m300l6209p920J6502O031N451o126J2618
14340g802J5597l0926j3386K6418J0999M106J2657n720n710o06k514J2961l882
14327A2192m703j9874M082J0119J2618k0773j0035L4087J483j0926j5950j8803
14315b6483J4687J125J3618J1579J259k9021J2675K0524K4503Q182j9529k2681
14303A0438j0578K7189l377M145q889l0120O141o740M3188L3129j3763k9047p883
14290A3833k8113j1262p586o941J3725M4450K0668j3933l8071j2054J6006L121
$$ plain form
14278 -6157 -9535 10666 39347 67115 76792 61833 50370 50600 45989 50136 40638 -2838 -28351
14265 -28351 -12341 18324 49623 25764 11117 -16789 -52405 -54068 -38324 -27539 -27391 -34942
14253 -34942 -35259 -38999 -46169 -32457 -20753 -24996 -8059 10829 13448 20533 16194 17197 38755
14240 38755 22903 25880 36859 15923 -16843 -31870 -35242 -24851 -22658 -4400 7940 -4190
14228 -4190 -17967 -11316 -9234 -34702 -53784 -62747 -40021 -27376 3665 16926 10228 -12274 -38319
14215 -38319 -40062 -26849 -15212 -37418 -44013 -33954 -20899 15398 18631 -10565 -9597 7914 5055
14202 5055 -6688 3296 15859 274 -4535 6212 -791 3697 25189 25789 29364 21111 11738 7645
14188 7645 12926 5371 -7194 -36975 -32822 -31385 -46396 -17486 4233 -10708 -38722 -45215 -29131
$$ packed form
14278f157l378K0201K8681K7768R677j4959j1463K30m611M147r498m3476k5513
14265b8351J6010L0665L1299k3859j4647k7906l5616j663J5744J0785J48p551
14253c4942l17l740p170J3712J1704m243J6937J8888K619P085m339J003K1558
14240C8755j5852K977J0979k0936l2766j5027l372J0391K193J8258J2340j2130
14228d190j3777O651K082k5468j9082q963K2726J2645L1041J3261o698k2502k6045
14215c8319j743J3213J1637k2206o595J0059J3055L6297L233k9196R68J7511k859
14202E055j1743R984J2563j5585m809J0747p003M488K1492O00L575q253r373m093
14188G645N281p555j2565k9781M153J437j5011K8910K1719j4941k8014o493J6084
$$ plain form
14175 -29131 -30280 -40783 -29555 -9215 2366 -72 -7102 5019 12089 4456 -26134 -34907 -15831
14162 -15831 -22770 -13372 -19346 -23236 -7170 9045 7461 21017 10850 -8644 4557 8727 10342
14149 10342 11010 -4315 -19930 -20340 -14409 -16453 -3007 -16134 -12825 -8960 5998 11127 14268 -4756
14135 -4756 -34017 -20734 9759 -2992 -22128 8527 20491 -2641 11172 17362 -19703 -19274
14123 -19274 -14141 -11911 -2616 -1304 4819 1304 10822 12858 14390 9103 2176 -1985 -6069 -19999
14109 -19999 -26386 -29225 -27058 -28995 -28016 -22062 5576 4412 -24732 -43429 -18575 -1216 -9715
14096 -9715 -25723 -25417 -22298 -4428 22807 2074 -33222 -35174 11822 38377 45546 62885 65022
14083 65022 36569 4267 6935 19501 17449 18061 35688 40347 40742 13838 10763 26249 31748
$$ packed form
14175b9131j149j0503J1228K0340J1581k438p030J2121P070p633l0590q773J9076
14162a5831o939R398n974l890J6066J6215j584J3556j0167j9494J3201M170J615
14149A0342O68j5325j5615m10N931k044J3446j3127L309L865J4958N129L141j9024
14135d756k9261J3283L0493j2751j9136L0655J1964k3132J3813O190l7065M29
14123a9274N133K230R295J312O123l515R518K036J532n287o927m161m084j3930
14109a9999o387k839K167j937R79N954K7638j164k9144j8697K4854J7359q499
14096i715j6008L06L119J7870K7235k0733l5296j952M6996K6555P169J7339K137
14083F5022k8453l2302K668J2566k052O12J7627M659L95k6904l075J5486N499
$$ plain form
14070 31748 407 -23784 -3882 25285 22533 24831 24252 42272 25214 6959 -10643 -15882 7504
14057 7504 12134 12270 -8005 -20007 2331 32555 24317 31500 31741 19665 21920 36797 44242 32748
14043 32748 31408 49832 36506 20202 19092 1618 7811 21635 22773 16998 4195 -4349 -1589
14030 -1589 782 -11787 -5126 -14135 -20951 -16706 -5061 12646 19285 18078 1205 -4063 16136
14017 16136 10683 21738 51463 63803 74338 79871 57704 52091 32978 33156 32935 34606 24949
14004 24949 35418 54779 39209 21531 15459 22976 31814 17948 11441 12027 15413 22032 28135
13991 28135 52873 55555 85787 95978 101665 100863 122667 177328 188239 180531 161864 140066 109102
13978 109102 60726 16007 15084 28771 47143 57540 35975 18599 42388 41276 29344 46778
$$ packed form
14070C1748l1341k4191J9902K9167k752K298n79J8020j7058j8255j7602n239K3386
14057G504M630J36k0275j2002K2338L0224q238P183K41j2076K255J4877P445j1494
14043C2748j340J8424j3326j6304j110j7474O193J3824J138n775j2803q544K760
14030a589K371j2569O661r009o816M245J1645J7707O639j207j6873n268K0199
14017A6136n453J1055K9725J2340J0535N533k2167n613j9113J78k21J671r657
14004B4949J0469J9361j5570j7678o072P517Q838j3866o507N86L386O619O103
13991B8135K4738K682L0232J0191N687q02K1804N4661J0911p708j8667k1798l0964
13978A09102m8376m4719r23J3687J8372J0397k1565j7376K3789j112j1932J7434
$$ plain form
13966 46778 47183 51014 64194 57638 70258 71530 85614 96782 73984 77679 103111 95164 60328
13953 60328 43480 64069 32092 27366 29808 -6094 -1151 24428 33521 28675 14622 3598 31466
13940 31466 24123 1455 10496 10303 627 -12714 -12158 -29893 -22948 -20717 -22739 5416 30120 27282
13926 27282 22667 40522 36897 18493 17594 28581 26662 36187 40073 22219 23886 35083 27394
13913 27394 40649 42095 19172 15709 9918 6490 23431 11043 13324 26215 22950 8338 17774
13900 17774 -1853 -42734 -42022 3201 -31643 -50022 -14249 277 -17383 -25215 -2821 6168
13888 6168 4344 -3493 -26587 -47475 -47069 -34447 -22903 -11069 -4328 -5997 347 -13788 -38113
13875 -38113 -24104 -31145 -21564 -20202 -36395 -38196 -48515 -53285 -53364 -52230 -47520 -52777 -40146 -22708
$$ packed form
13966D6778M05L831J3180o556J2620J272J4084J1168k2798L695K5432p947l4836
13953F0328j6848K0589l1977m726K442l5902M943K5579R093m846j4053j1024K7868
13940C1466p343k2668R041j93r676j3341N56j7735O945K231k022K8155K4704k838
13926B7282m615J7855l625j8404q99J0987j919R525L886j7854J667J1197p689
13913B7394J3255J446k2923l463n791l428J6941j2388K281J2891l265j4612R436
13900A7774j9627m0881P12M5223l4844j8379L5773J4526j7660p832K2394Q989
13888F168j824p837k3094k0888M06J2622J1544J1834O741j669O344j4135k4325
13875c8113J4009p041R581J362j6193j801j0319m770p9J134M710n257J2631J7438
$$ plain form
13861 -22708 -8328 -23943 15578 29507 1957 1087 6701 10595 3251 12974 30725 16598 6916
13848 6916 20863 39911 40218 21408 -4280 -12897 -13629 -14368 -24947 -17389 -30833 -50795 -31497
13835 -31497 1689 1634 9697 17407 25490 21294 16520 4275 6398 10873 25243 24995 20424 33430
13821 33430 56542 69118 61804 33038 15809 7590 28278 31261 34097 25432 2397 11911 -10676
13808 -10676 -26713 -19553 11118 35967 45890 73574 88483 110188 140352 168347 202783 195784
13796 195784 205213 199522 145883 113397 122390 126577 135832 144427 178498 195027 176223 130583 119321
13783 119321 154276 160616 159742 170511 173880 142838 116684 79166 61230 77783 85312 59109
13771 59109 24081 44793 69384 81360 108317 154723 167731 213930 254596 260131 229099 228609
$$ packed form
13861b2708J4380j5615L9521J3929k7550q70N614L894p344R723J7751j4127r682
13848F916J3947J9048L07j8810k5688q617p32p39j0579P558j3444j9962J9298
13835c1497L3186n5Q063P710Q083m196m774j2245K123M475J4370k48m571J3006
13821C3430K3112J2576p314k8766j7229q219K0688K983K836q665k3035R514k2587
13808a0676j6037P160L0671K4849R923K7684J4909K1705L0164K7995L4436o999
13796A95784R429n691n3639l2486Q993M187R255Q595L4071J6529j8804m5640j1262
13783A19321L4955O340q74J0769L369l1042k6154l7518j7936J6553P529k6203
13771E9109l5028K0712K4591J1976K6957M6406J3008M6199M0666N535l1032m90
$$ plain form
13759 228609 220827 216149 224035 181432 125005 102114 122294 148662 146291 128492 99705 77236
13747 77236 85276 93541 58611 34463 24860 29431 43920 56191 54525 49605 29191 18762 13959
13734 13959 10763 5700 5965 36641 21838 25147 46434 60086 69229 48103 27123 31220 14954
13721 14954 -15998 -7706 -2885 15128 27868 21182 17182 6233 19458 15544 -14591 -20033 -10165
13708 -10165 12500 40651 41725 -1489 -11975 -22367 -43922 -43776 -26033 -24232 -14421 -8338 -9645
13695 -9645 -25233 -34585 -30805 -22595 -34904 -28455 7927 11546 -4264 -13986 -16892 -26279 -37945
13682 -37945 -38664 -15284 -12424 -12300 22627 22313 18257 27064 38556 19328 -17494 -41421 -54201
13669 -54201 -40653 -33472 -39767 -22085 -12 13214 15806 10267 21528 23032 -23525 -39949 -56368
$$ packed form
13759B28609p782m678P886m2603n6427k2891K0180K6368k371j7799k8787k2469
13747G7236Q040Q265l4930k4148r603M571J4489J2271j666m920k0414j0429m803
13734A3959l196n063K65L0676j4803L309K1287J3652R143k1126k0980M097j6266
13721A4954l0952Q292M821J8013J2740o686m000j0949J3225l914l0135n442R868
13708a0165K2665K8151J074m3214j0486j0392k1555J46J7743J801R811O083j307
13695i645j5588r352L780Q210j2309O449L6382L619j5810r722k906r387j1666
13682c7945p19K3380K860J24L4927l14m056Q807J1492j9228l6822k3927j2780
13669e4201J3548P181o295J7682K2073J3226K592n539J1261J504m6557j6424j6419
$$ plain form
13656 -56368 -34525 -12427 -18874 -8217 -12012 -3014 4304 -1844 -11429 -10119 -6466 -9962 -40507
13643 -40507 -30178 -41357 -16399 -29550 -28698 -14873 -14669 -15952 1654 17010 9387 -14730 -9666
13630 -9666 6777 23309 -2737 -32754 -34614 -20999 -13357 -8691 1208 -23971 -16133 -16036 6161
13617 6161 19218 -757 -3157 13258 10450 16202 19139 1192 9204 3114 -30152 -30032 11918
13604 11918 10406 -12755 -23467 -13776 -17160 -26506 -44155 -39120 -41300 -23738 -17258 -8472 6871
13591 6871 9647 23434 32631 21358 2218 1607 13206 -14577 -16918 -7679 27927 52372 22666
13578 22666 -11244 1022 35489 34208 37043 23001 6472 -4387 447 1349 15172 15577 24917
13565 24917 11544 6062 11416 7888 -13042 -23836 -16838 -33179 -46333 -44430 -30953 -28680 -12429
$$ packed form
13656e6368K1843K2098o447J0657l795Q998P318o148r585J310L653l496l0545
13643d0507J0329j1179K4958j3151Q52J3825K04j283J7606J5356p623k4117N064
13630i666J6443J6532k6046l0017j860J3615P642M666R899k5179P838R7K2197
13617F161J3057j9975k400J6415k808N752K937j7947Q012o090l3266J20M1950
13604A1918j512k3161j0712R691l384r346j7649N035k180J7562O480Q786J5343
13591F871K776J3787R197j1273j9140o11J1599k7783k341R239L5606K4445k9706
13578B2666l3910J2266L4467j281K835j4042j6529j0859M834R02J3823M05R340
13565B4917j3373n482N354l528k0930j0794O998j6341j3154J903J3477K273J6251
$$ plain form
13552 -12429 11048 13114 -10313 -32035 -36376 -39401 -35670 -36957 -22165 -20071 -37730 -42592 -15259
13539 -15259 -95 -901 1000 13176 5554 27086 22812 23428 31638 14202 6193 10553 17494 25447
13525 25447 27605 22709 -23561 -54534 -38795 -45741 -39645 -34442 4729 226 -32047 -56574 -48600
13512 -48600 -46497 -73007 -61920 -9412 29173 43817 39405 44244 57724 53490 37854 11142
13500 11142 -5501 -17380 -25366 -13174 922 3373 -1992 -21397 -12710 -12913 26291 43016 25100
13487 25100 39076 30235 6954 -6497 -21626 -8122 -3912 -12681 -21018 1714 40233 70789
13475 70789 56261 28324 283 -8629 -2837 11417 -1401 -27520 -17337 7288 33803 30271
13463 30271 25779 30471 48597 56573 45673 24972 19966 36100 38873 31643 21507 11120 6628
$$ packed form
13552a2429K3477K066k3427k1722m341l025L731j287J4792K094j7659m862K7333
13539a5259J5164q06J901J2176p622K1532m274O16Q210j7436q009M360O941P953
13525B5447K158m896m6270l0973J5739o946O096N203L9171m503l2273k4527P974
13512d8600K103k6510J1087N2508L8585J4644m412M839J3480m234j5636k6712
13500A1142j6643j1879p986J2192J4096K451n365j9405Q687k03L9204J6725j7916
13487B5100J3976q841k3281j3451j5129J3504M210q769q337K2732L8519L0556
13475G0789j4528k7937k8041q912N792J4254j2818k6119J0183K4625K6515l532
13463C0271m492M692J8126P976j0900k0701n006J6134K773p230j0136j0387m492
$$ plain form
13450 6628 10395 13462 -686 -16851 -18706 12465 13649 -899 7888 21458 22503 40473 29406
13437 29406 18652 3765 4134 -11977 -26859 -19393 -15146 -14908 -10178 4998 16619 1255 -27029
13424 -27029 -12735 5208 8922 -7985 -49808 -33594 -14861 -13208 -9533 1998 22663 55701
13412 55701 30085 -15113 -21504 -15478 -8588 -9627 -10162 21336 29749 8967 -23566 -18242 -9450
13399 -9450 -1557 415 -16212 -6428 -8976 -10088 -13296 22187 49619 41996 30832 1318 4822
13386 4822 -8139 -35376 -46874 -48969 -16292 9364 31359 21334 1968 -11412 -23987 -5591
13374 -5591 21666 1668 -9199 26227 47581 21832 15147 2075 -18033 -4955 -12142 -31761
13362 -31761 -43661 -21561 5290 2715 -8254 -8496 2595 -18051 -27345 -25261 -20771 -22283 -31772
$$ packed form
13450F628L767L067j4148j6165j855L1171J184j4548Q787J3570J045J7970j1067
13437B9406j0754j4887L69j6111j4882P466M247K38M730J5176J1621j5364k8284
13424b7029J4294J7943L714j6907m1823J6214J8733J653L675J1531K0665L3038
13412E5701k5616m5198o391O026O890j039n35L1498Q413k0782l2533N324Q792
13399i450P893J972j6627R784k548j112l208L5483K7432p623j1164k9514L504
13386D822j2961k7237j1498k095L2677K5656K1995j0025j9366j3380j2575J8396
13374e591K7257j9998j0867L5426K1354k5749o685j3072k0108J3078p187j9619
13362c1761j1900K2100K6851k575j0969k42J1091k0646r294K084M490j512r489
$$ plain form
13349 -31772 -48997 -25716 20 4719 -24090 -30981 -13931 -15797 -2422 6677 10381 10602 -8669
13336 -8669 -15648 -13022 14438 15862 10883 4567 36195 22420 -1335 -5157 -4832 -16691 -28792
13323 -28792 -6232 22637 28355 62259 80660 47623 9097 9710 9457 12094 15745 20138 13073
13310 13073 3372 -10002 -10541 -16545 -28834 -22073 -8011 -13589 -13323 -22669 -48842 -59619 -60092 -39477
13296 -39477 4049 9884 -29486 -33653 -45273 -30625 -16186 -1309 3996 21192 1103 -19885
13284 -19885 5088 8531 -13078 -12570 21480 55113 39407 31031 5785 -14345 -11551 30551 33389
13271 33389 30509 66880 78876 69864 58697 37714 31749 26802 -6690 -24928 -29797 -7996 29934
13258 29934 60041 53558 58248 68036 37531 34231 41344 56480 59189 73190 68750 70756 52990
$$ packed form
13349c1772j7225K3281K5736M699k8809o891J7050j866J3375R099L704K21j9271
13336h669o979K626K7460J424m979o316L1628j3775k3755l822L25j1859j2101
13323b8792K2560K8869N718L3904J8401l3037l8526O13k53K637L651M393p065
13310A3073r701j3374n39o004j2289O761J4062n578K66r346k6173j0777m73K0615
13296c9477M3526N835l9370m167j1620J4648J4439J4877N305J7196k0089k0988
13284a9885K4973L443k1609N08L4050L3633j5706q376k5246k0130K794M2102K838
13271C3389k880L6371J1996r012j1167k0983n965m947l3492j8238m869K1801L7930
13258B9934L0107o483M690R788l0505l300P113J5136K709J4001m440K006j7766
$$ plain form
13245 52990 28175 28773 37319 13998 -16198 -20595 -18762 7910 11429 -28305 -33409 -5280 8264
13232 8264 8496 -21042 6707 12626 24863 28428 17626 16990 10123 12206 26345 41176 33960 24983
13218 24983 39277 30597 32484 -1452 -21271 -7983 14748 22772 39495 47973 32810 16625
13206 16625 12187 -2014 9396 18139 16973 4541 -5184 1656 1018 3971 29713 66870 68234
13193 68234 41222 -8180 -21250 1904 21776 18031 33435 28846 -10708 -5905 -24588 -36528
13181 -36528 -29955 -42249 -22277 20409 21622 17049 11338 5497 -8911 -9361 -4544 4162 1653 19496
13167 19496 23291 23603 22325 13300 17990 18047 -369 -20152 -28516 -36350 -33139 -15645 -3311 12058
13153 12058 27420 32711 37901 2306 -11274 17970 35869 34466 16884 1527 -4029 5997
$$ packed form
13245E2990k4815N98Q546k3321l0196m397J833K6672L519l9734n104K8129J3544
13232H264K32k9538K7749N919J2237L565j0802o36o867K083J4139J4831p216q977
13218B4983J4294q680J887l3936j9819J3288K2731Q024J6723Q478j5163j6185
13206A6625m438j4201J1410Q743j166j2432r725O840o38K953K5742L7157J364
13193F8234k7012m9402j3070K3154J9872l745J5404m589l9554M803j8683j1940
13181c6528O573j2294J9972M2686J213m573n711n841j4408m50M817Q706k509J7843
13167A9496L795L12j278r025M690N7j8416j9783q364p834L211J7494J2334J5369
13153A2058J5362N291N190l5595j3580K9244J7899j403j7582j5357n556J0026
$$ plain form
13141 5997 601 -22083 -10666 7336 3630 729 7244 -566 -57589 -55545 -35495 -10894 12267
13128 12267 18426 39834 42076 25484 -19206 -33151 -21828 -12055 -6409 4755 -21678 -26996 27419
13115 27419 37077 21198 3399 -4395 -12696 -28549 -16483 -19336 -30368 4927 16868 13091 37594
13102 37594 33198 -2892 -10911 -8679 -24698 6777 10633 -7441 7008 25689 27789 26567 -27713
13089 -27713 -32360 -1584 20463 18312 767 494 12894 36598 43792 46306 30985 12372 27026
13076 27026 38887 15084 -589 -13560 -3607 6415 33806 57171 65973 43625 47300 65525
13064 65525 49822 33533 50804 44540 63959 65607 45176 27757 11866 17155 34056 38156
13052 38156 25447 66504 80820 88040 92785 83358 69524 84535 93756 67801 49695 36296
$$ packed form
13141E997n396k2684J1417J8002l706k901O515p810n7023K044K0050K4601K3161
13128A2267O159K1408K242j6592m4690j3945J1323R773N646J1164k6433n318N4415
13115B7419R658j5879j7799p794q301j5853J2066k853j1032L5295J1941l777K4503
13102C7594m396l6090q019K232j6019L1475L856j8074J4449J8681K100j222n4280
13089b7713m647L0776K2047k151j7545k73J2400K3704P194K514j5321j8613J4654
13076B7026J1861k3803j5673j2971R953J0022K7391K3365Q802k2348L675J8225
13064F5525j5703j6289J7271o264J9419J648k0431j7419j5891N289J6901M100
13052C8156j2709M1057J4316P220M745r427j3834J5011R221k5955j8106j3399
$$ plain form
13040 36296 40983 32169 62655 71790 46223 43167 41987 13206 -304 15892 45939 47423 47453
13027 47453 63158 74000 86322 91096 74681 70180 62647 80476 52466 41498 40748 25413 5926
13014 5926 3608 -2938 15700 28251 19105 37971 89946 114396 166914 190361 254782 336957
13002 336957 416744 599025 843459 1111904 1457200 1860438 2216182 2420492 2568992 2643999
12992 2643999 2535334 2301803 2015496 1663219 1328536 1050058 830361 632935 475617
12983 475617 383695 322889 288433 247953 202369 173838 160762 142542 145070 131978 91034 83793
12971 83793 81056 68149 100097 116544 78186 50770 66271 86307 69085 42006 35259 51420
12959 51420 72011 52452 56313 33247 1449 -25331 -20105 20084 57258 68596 74294 88430
$$ packed form
13040C6296M687q814L0486R135k5567l056j180k8781j3510J6196L0047J484L0
13027D7453J5705J0842J2322M774j6415m501p533J7829k8010j0968p50j5335j9487
13014E926k318o546J8638J2551r146J8866N1975K4450N2518K3447O4421Q2175
13002C36957P9787J82281K44434K68445L45296M03238L55744K04310J48500P5007
12992B643999j08665k33531k86307l52277l34683k78478k19697j97426j57318
12983D75617r1922o0806l4456m0480m5584k8531j3076j8220K528j3092m0944p241
12971H3793k737j2907L1948J6447l8358k7416J5501K0036j7222k7079o747J6161
12959E1420K0591j9559L861k3066l1798k6780N226M0189L7174J1338N698J4136
$$ plain form
12947 88430 58309 17002 2767 11944 28485 24038 396 15825 43267 53914 50416 27711
12935 27711 -112 28190 34371 26214 38301 36474 39763 53307 65704 46966 60308 61459 43756
12922 43756 52869 85890 86841 108521 148086 176503 166733 168302 168462 187862 180868 170082 162157
12909 162157 156251 167013 185981 184714 174669 189651 217263 233111 293810 319630 326794 339052
12897 339052 353019 345713 436216 498100 503892 498720 467210 423124 381966 369850 359725 313178
12885 313178 269160 267336 345839 468365 636019 879040 1129393 1283311 1371732 1378052 1250731
12874 1250731 1168323 1164229 1136516 1064988 1042485 1032576 955147 850723 716173 567745 480698
12863 480698 396039 318025 270668 250777 203068 174165 178344 187937 168668 167931 191538 231769
$$ packed form
12947H8430l0121m1307j4235R177J6541m447k3642J5429K7442J0647l498k2705
12935B7711k7823K8302O181q157J2087j827L289J3544J2397j8738J3342J151j7703
12922D3756R113L3021R51K1680L9565K8417r770J569J60J9400o994j0786p925
12909A62157n906J0762J8968j267j0045J4982K7612J5848O0699K5820P164J2258
12897C39052J3967p306R0503O1884N792n172l1510m4086m1158j2116j0125m6547
12885C13178m4018j824P8503J22526J67654K43021K50353J53918Q8421O320j27321
12874A250731q2408m094k7713p1528k2503r909p7429j04424j34550j48428q7047
12863D80698q4659p8014m7357j9891m7709k8903M179R593j9269p37K3607M0231
$$ plain form
12851 231769 218692 221854 230523 239652 274336 319933 347436 369140 376668 371584 326870 281209
12839 281209 252943 231435 263941 322852 379850 470058 615659 824684 1086053 1316763 1543784
12828 1543784 1706777 1845645 1938339 1997407 2029733 1962565 1874640 1777179 1639914 1463992
12818 1463992 1317235 1169372 1035247 891978 764271 639354 551795 495239 489267 476901
12808 476901 461880 443089 442039 453594 445906 439537 434800 425119 428789 415991 387976 375661 360489
12795 360489 348093 338058 302243 274267 247219 205557 174044 153150 127201 109555 121607
12784 121607 135657 165247 189434 222222 275777 320922 360508 422433 504589 640606 857783
12773 857783 1233053 1696117 2199041 2847339 3530353 3973895 4310863 4499000 4289782 3882001
$$ packed form
12851B31769j3077L162Q669R129L4684M5597K7503K1704P528n084m4714m5661
12839B81209k8266k1508L2506N8911N6998R0208J45601K09025K61369K30710K27021
12828A543784J62993J38868R2694N9068L2326o7168q7925r7461j37265j75922
12818A463992j46757j47863j34125j43269j27707j24917q7559n6556n972j2366
12808D76901j5021j8791j050J1555p688o369m737r681L670j2798k8015j2315j5172
12795C60489j2396j0035l5815k7976k7048m1662l1513k0894k5949j7646J2052
12784A21607J4050K9590K4187L2788N3555M5145L9586O1925Q2156J36017K17177
12773H57783L75270M63064N02924O48298O83014M43542L36968J88137k09218m07781
$$ plain form
12763 3882001 3384747 2766663 2154645 1636144 1221465 943359 772411 656388 557188 470589
12753 470589 408175 384202 375656 327973 308469 314764 332302 326599 292070 310073 322579 311243
12741 311243 280343 257383 268620 296791 347648 381487 435672 459925 468642 448952 416379 387376
12729 387376 373912 320867 297990 295907 282680 254520 253497 277125 268618 249208 235789 244277
12717 244277 265034 274537 282149 282184 250189 237220 234907 237031 219285 204223 224502 238111 222401
12704 222401 219457 220396 220852 236706 232135 211799 205149 188121 171659 175616 179588 179440 171113 207252
12690 207252 239692 258194 276811 334498 391963 457048 497552 520511 583290 602286 612944
12679 612944 647863 705711 769645 818954 839272 844732 809642 770327 698421 565446 453282
$$ packed form
12763C882001m97254o18084o12018n18501m14679k78106j70948j16023r9200q6599
12753D70589o2414k3973q546m7683j9504O295J7538n703l4529J8003J2506j1336
12741C11243l0900k2960J1237K8171N0857L3839N4185K4253Q717j9690l2573k9003
12729C87376j3464n3045k2877k083j3227k8160j023K3628q507j9410j3419Q488
12717B44277K0757R503P612L5l1995j2969k313K124j7746j5062K0279J3609j5710
12704B22401k944R39M56J5854m571k0336o650j7028j6462L957L972j48q327L6139
12690B07252L2440J8502J8617N7687N7465O5085M0504K2959O2779J8996J0658
12679F12944L4919N7848O3934M9309K0318N460l5090l9315p1906j32975j12164
$$ plain form
12668 453282 338365 256492 209115 173452 153618 122185 108608 102193 119312 151993 152259 160484
12656 160484 158192 158383 185394 223364 222021 219060 219347 228358 206775 205755 192814 194355 190431 184020
12642 184020 155945 124210 109682 97712 132517 167040 212871 268273 295875 311131 324358
12631 324358 328947 334462 322657 336553 321916 301816 282381 252771 272842 299357 312414 311892
12619 311892 327122 339892 375344 396403 412565 430607 455936 516656 571734 599535 622079
12608 622079 651008 690387 720843 761560 835206 915187 969141 1042428 1165158 1265384 1339654
12597 1339654 1383096 1408956 1435531 1444293 1461844 1540802 1653176 1748944 1879204 2052675 2277794
12586 2277794 2537697 2853985 3258500 3765097 4403950 5142799 6007045 6990812 7935426
$$ packed form
12668D53282j14917q1873m7377l5663j9834l1433j3577o415J7119L2681K66Q225
12656A60484k292J91K7011L7970j343k961K87R011k1583j020j2941J541l924o411
12642A84020k8075l1735j4528j1970L4805L4523M5831N5402K7602J5256J3227
12631C24358M589N515j1805J3896j4637k0100j9435k9610K0071K6515J3057n22
12619C11892J5230J2770L5452K1059J6162J8042K5329O0720N5078K7801K2544
12608F22079K8929L9379L0456M0717P3646P9981N3954P3287J22730J00226P4270
12597A339654M3442K5860K6575Q762J7551P8958J12374R5768J30260J73471K25119
12586B277794K59903L16288M04515N06597O38853P38849Q64246R83767R44614
$$ plain form
12577 7935426 8652982 9335188 9941135 10212776 10352006 10493705 10597499 10791913 11298039
12568 11298039 12116689 13328112 15043068 17442568 20783571 25339794 31725737 40993860
12560 40993860 54755559 76011828 108857404 154424221 208224566 271623110 348917857
12553 348917857 419595504 463267187 496924283 516895269 497660255 454558079 404921402
12546 404921402 340199848 270179774 210955040 161380280 119863404 89424879 68945207
12539 68945207 54908224 44786385 37228543 31402608 26861149 23247457 20367527 18035857
12531 18035857 16126891 14527243 13160925 11986617 10937670 9983924 9135061 8378896
12523 8378896 7675616 7017482 6391292 5849428 5384667 4961504 4636164 4352702 4119811
$$ packed form
12577G935426P17556O82206O05947K71641J39230J41699J03794J94414N06126
12568A1298039Q18650J211423J714956K399500L341003M556223O385943R268123
12560D0993860J3761699K1256269L2845576M5566817N3800345O3398544P7294747
12553C48917857P0677647M3671683L3657096J9970986j9235014m3102176m9636677
12546D04921402o4721554p0020074n9224734m9574760m1516876l0438525k0479672
12539F8945207j4036983j0121839p557842n825935m541459l613692k879930k331670
12531A8035857j908966j599648j366318j174308j048947r53746q48863p56165
12523H378896p03280o58134o26190n41864m64761m23163l25340k83462k32891
$$ plain form
12514 4119811 3881635 3665188 3469414 3350026 3259402 3164961 3061002 2935539 2830244 2731394
12504 2731394 2595913 2440292 2283694 2124043 1967888 1837751 1727762 1648785 1610119 1580726
12494 1580726 1529703 1452923 1427789 1435367 1397234 1376774 1346784 1300807 1293433 1285293 1275374 1270929
12482 1270929 1238080 1193086 1150462 1092963 1047335 1013374 991183 961591 927703 883379 836855
12471 836855 814146 801687 786299 759440 736249 741321 745620 750923 751916 734449 778144 759012
12459 759012 728069 717495 685972 631704 617811 601294 570822 549747 553367 546288 557017 552551
12447 552551 537649 552034 542565 534024 500359 493442 517215 535115 574996 588506 561111 548709
12435 548709 538951 498919 464099 402891 340733 275661 218465 202156 216495 240578 276520 302992
$$ packed form
12514D119811k38176k16447j95774j19388r0624r4441j03959j25463j05295r8850
12504B731394j35481j55621j56598j59651j56155j30137j09989p8977l8666k9393
12494A580726n1023p6780k5134P578l8133k0460k9990m5977p374q140r919m445
12482A270929l2849m4994m2624n7499m5628l3961k2191k9592l3888m4324m6524
12471H36855k2709j2459j5388k6859k3191N072M299N303R93j7467M3695j9132
12459G59012l0943j0574l1523n4268j3893j6517l0472k1075L620p079J0729m466
12447E52551j4902J4385r469q541l3665o917K3773J7900L9881J3510k7395j2402
12435E48709r758m0032l4820o1208o2158o5072n7196j6309J4339K4083L5942K6472
$$ plain form
12423 302992 315683 322611 320077 311973 307258 280837 252456 255684 253911 252296 271623 296920 290960
12410 290960 309070 333067 320452 291568 297092 285064 279616 268301 234826 202581 198664 190607
12398 190607 193807 182737 168151 169904 164817 184721 208282 213581 199556 189787 174635 135895
12386 135895 135908 146167 136233 133805 127084 134293 168154 219928 223762 186353 146381 126115 105928
12373 105928 111422 100690 92278 97419 67217 12420 1278 17562 44781 71141 97488 101218
12361 101218 116472 146400 139657 144668 138615 104811 109569 135977 135503 145175 174291 195432 171549
12348 171549 173388 180528 185196 153364 122038 118559 139620 132276 149700 158903 147874 140485 153802
12335 153802 170695 159259 139963 159654 178619 141601 95980 66578 50076 70698 110282
$$ packed form
12423C02992J2691O928k534q104m715k6421k8381L228j773j615J9327K5297n960
12410B90960J8110K3997j2615k8884N524j2028n448j1315l3475l2245l917q057
12398A90607L200j1070j4586J753n087J9904K3561N299j4025r769j5152l8740
12386A35895J3J0259r934k428o721P209L3861N1774L834l7409l9972k0266k0187
12373A05928N494j0732q412N141l0202n4797j1142J6284K7219K6360K6347L730
12361A01218J5254K9928o743N011o053l3804M758K6408m74R672K9116K1141k3883
12348A71549J839P140M668l1832l1326l479K1061p344J7424R203j1029p389J3317
12335A53802J6893j1436j9296J9691J8965l7018m5621k9402j6502K0622L9584
$$ plain form
12324 110282 108999 97434 103120 102957 114730 144571 155241 158768 158713 146514 168867 179184 155460
12311 155460 113898 111140 110322 108720 127564 144213 184892 206250 239540 274618 327826 401540
12299 401540 487525 599561 753028 880560 984944 1035247 1032019 1018473 957034 837835 742769
12288 742769 638664 522801 414681 304955 271006 249459 205773 172935 129908 111642 121702
12277 121702 125326 130289 119537 126083 124869 139065 146322 174502 204937 203433 194353 161053 138811
12264 138811 160382 158876 131182 125929 113028 87461 78508 68297 58871 49565 66891 73228 79605
12251 79605 69997 60621 49065 63984 59039 56774 74444 70293 85840 93670 70572 58962 70195
12238 70195 70477 59219 69154 109973 96594 56119 40793 69413 69789 59191 89094 90675 70538
$$ packed form
12324A10282j283j1565N686j63J1773K9841J0670L527n5j2199K2353J0317k3724
12311A55460m1562k758q18j602J8844J6649M0679K1358L3290L5078N3208P3714
12299D01540Q5985J12036J53467J27532J04384N0303l228j3546o1439j19199r5066
12288G42769j04105j15863j08120j09726l3949k1547m3686l2838m3027j8266J0060
12277A21702L624M963j0752O546j214J4196P257K8180L0435j504r080l3300k2242
12264A38811K1571j506k7694n253j2901k5567q953j0211r426r306J7326O337O377
12251G9605r608r376j1556J4919m945k265J7670m151J5547P830k3098j1610J1233
12238G0195K82j1258R935M0819j3379m0475j5326K8620L76j0598K9903J581k0137
$$ plain form
12225 70538 91245 96445 104763 122979 116186 126056 121712 117638 98152 82652 88014 80474 57760
12212 57760 31666 38178 61693 26439 16244 28372 47472 58648 65740 51993 76705 97598
12200 97598 100496 105899 90672 70499 67978 58153 40077 42274 41539 53659 57701 55761 52095 49009
12186 49009 70930 69696 72374 73627 52359 53984 75622 71933 62511 30412 59637 82461 56638
12173 56638 57758 87070 68809 69151 75223 89435 70093 61210 78110 82721 47547 38964 68098
12160 68098 85180 74410 72779 91050 99622 80713 50168 50238 51995 54045 58730 62772 54019 47838
12146 47838 59719 90909 99917 83768 79848 73053 73467 84821 82081 72626 78644 69558 85856
12133 85856 75712 68541 82456 113319 126278 130136 136467 141071 132568 115848 119556 169410 172588
$$ packed form
12225G0538K0707N200Q318J8216o793R870m344m074j9486j5500N362p540k2714
12212E7760k6094O512K3515l5254j0195J2128J9100J1176P092j3747K4712K0893
12200I7598K898N403j5227k0173k521r825j8076K197p35J2120M042j940l666l086
12186D9009K1921j234K678J253k1268J625K1638l689r422l2099K9225K2824k5823
12173E6638J120K9312j8261L42O072J4212j9342q883J6900M611l5174q583K9134
12160F8098J7082j0770j631J8271Q572j8909l0545P0J757K050M685M042q753o181
12146D7838J1881L1190R008j6149l920o795M14J1354k740r455O018r086J6298
12133H5856j0144p171J3915L0863J2959L858O331M604q503j6720L708M9854L178
$$ plain form
12120 172588 185016 186510 156045 165018 193711 209935 247957 325444 394168 533042 742178
12109 742178 1147735 1846984 2544733 2877862 3039862 3098115 3009095 2902871 2893409 2863365
12099 2863365 2673547 2421133 2135341 1807299 1504361 1217121 930140 701512 584968
12090 584968 472879 398133 337507 286267 237192 202178 189843 174745 142436 138249 108390
12079 108390 115407 126165 109832 94946 79310 41697 60199 74562 82339 74123 41005 54505
12067 54505 84976 101285 100418 82554 52219 64350 73444 82146 51168 25662 25360 49606 58965
12054 58965 45125 15553 -7431 -20943 -3377 14639 15830 14986 16322 35916 43485 47429 50247
12041 50247 36881 28537 9918 9949 20256 27394 48732 54930 50205 39151 45371 45832 53740 61495
$$ packed form
12120A72588J2428J494l0465Q973K8693J6224L8022P7487O8724J38874K09136
12109G42178M05557O99249O97749L33129J62000N8253q9020j06224r462l0044
12099B863365j89818k52414k85792l28042l02938k87240k86981k28628j16544
12090E84968j12089p4746o0626n1240m9075l5014j2335j5098l2309m187k9859
12079A08390P017J0758j6333j4886j5636l7613J8502J4363P777q216l3118J3500
12067E4505L0471J6309q67j7864l0335J2131R094Q702l0978k5506l02K4246R359
12054E8965j3840k9572k2984j3512J7566J8016J191q44J336J9594P569L944K818
12041E0247j3366q344j8619L1J0307P138K1338O198m725j1054O220M61P908P755
$$ plain form
12027 61495 66493 53946 39134 54106 49022 40951 49577 56453 74076 34289 11847 33849 40530
12014 40530 41955 59861 38069 25523 12951 -6059 16689 35657 25047 42085 14201 20658
12002 20658 58717 58395 65401 80336 78363 58078 52176 47972 42121 47577 53082 50223 51547 64663
11988 64663 90695 78165 55341 80468 82018 77488 67418 55684 55959 77411 87599 119330
11976 119330 153287 134882 127659 140784 186240 204746 233250 321621 468514 764689 1236815
11965 1236815 1707272 1828844 1687584 1360572 921810 588051 386074 284216 227022 194584
11955 194584 139246 120131 126517 115175 131716 131758 111893 125932 133284 88049 68928 57312
11943 57312 15462 4541 14694 20938 21064 17967 16455 21611 5730 -18296 -18124 -12431 398
$$ packed form
12027F1495M998j2547j4812J4972n084q071Q626O876J7623l9787k2442K2002O681
12014D0530J425J7906k1792j2546j2572j9010K2748J8968j0610J7038k7884O457
12002B0658L8059l22P006J4935j973k0285n902m204n851N456N505k859J324J3116
11988F4663K6032j2530k2824K5127J550m530j0070j1734K75K1452J0188L1731
11976A19330L3957j8405p223J3125M5456J8506K8504Q8371J46893K96175M72126
11965A236815M70457J21572j41260l27012m38762l33759k01977j01858n7194l2438
11955A94584n5338j9115O386j1342J6541M2j9865J4039P352m5235j9121j1616
11943E7312m1850j0921J0153O244J26l097j512N156j5881k4026J72N693J2829
$$ plain form
11930 398 -37097 -5927 6331 -7303 8090 4505 16701 25156 33700 29503 24742 -7630 -23828
11917 -23828 1274 15664 39656 54842 19167 -14898 -14365 10233 56361 61262 28757 9562
11905 9562 6679 -12441 -9893 -7837 11322 24379 38618 50233 26643 19168 9332 18551 26983
11892 26983 2732 -8505 -2081 26322 23165 43874 70106 66938 70118 66397 40672 20983 1712
11879 1712 -246 10984 44421 66720 47613 23757 11792 19024 13590 791 21497 12316 9633
11866 9633 -1972 18352 27031 13009 -5806 -13555 17514 17910 -3420 -17403 -16906 -1220 2564
11853 2564 -10850 6692 29781 37226 10252 -15092 -10893 -1055 15915 37408 38850 32628 35533
11840 35533 23564 37447 34863 38413 31617 51324 35607 23802 19359 11559 25742 19251 31511
$$ packed form
11930C98l7495L1170J2258j3634J5393l585J2196Q455Q544m197m761l2372j6198
11917b3828K5102J4390K3992J5186l5675l4065N33K4598M6128M901l2505j9195
11905I562k883j9120K548K056J9159J3057J4239J1615k3590p475r836R219Q432
11892B6983k4251j1237O424K8403l157K0709K6232l168L180l721k5725j9689j9271
11879A712j958J1230L3437K2299j9107k3856j1965P232n434j2799K0706r181k683
11866I633j1605K0324Q679j4022j8815p749L1069L96k1330j3983M97J5686L784
11853B564j3414J7542K3089P445k6974k5344M199R838J6970K1493J442o222K905
11840C5533j1969J3883k584L550o796J9707j5717j1805m443p800J4183o491J2260
$$ plain form
11827 31511 64469 51960 49255 39176 13421 5881 4701 -16422 -31511 -21236 8026 5658
11815 5658 30433 25188 16193 5082 704 -22719 -32722 -29957 -9578 -4089 9755 19514 33892
11802 33892 28555 15817 -1535 -6435 9403 32463 22496 16582 10197 -5872 -36339 -39582 -16453
11789 -16453 2745 -6491 7039 41146 55414 65694 48602 4908 -30692 -37925 -9717 4159
11777 4159 2289 -8348 -33459 -26913 -14860 -7972 -11406 13730 5845 -2975 -512 3866 21828
11764 21828 33395 38049 48588 87653 73466 22508 -5095 -6962 5289 19120 26692 32048
11752 32048 13803 18212 29820 33462 6323 37439 64299 70050 59223 38841 42080 43959 13629
11739 13629 -9284 6924 10613 -11733 -5507 15161 40731 29364 -8493 -22191 -12652 -32542
$$ packed form
11827C1511L2958j2509k705j0079k5755p540j180k1123j5089J0275K9262k368
11815E658K4775n245q995j1111m378k3423j0003K765K0379N489J3844R759J4378
11802C3892n337j2738j7352m900J5838K3060r967n914o385j6069l0467l243K3129
11789a6453J9198r236J3530L4107J4268J0280j7092m3694l5600p233K8208J3876
11777D159j870j0637k5111O546J2053O888l434K5136p885q820K463M378J7962
11764B1828J1567M654J0539L9065j4187n0958k7603j867J2251J3831P572N356
11752C2048j8245M409J1608L642k7139L1116K6860N751j0827k0382L239J879l0330
11739A3629k2913J6208L689k2346O226K0668K5570j1367l7857j3698R539j9890
$$ plain form
11727 -32542 -47252 -10260 -3809 -32253 -15936 3268 1420 16694 -6587 -22833 -4236 -16722
11715 -16722 -28309 -12342 -11161 3462 8657 -10247 -10321 -6846 -1690 -6202 -21515 -51398 -12079
11702 -12079 21723 4568 -10969 -5771 15396 29094 11644 15773 3904 -16411 -13665 -30319
11690 -30319 -36943 -46117 -44263 -20687 2483 19502 34234 24200 1200 -12137 4685 98
11678 98 2484 8358 1626 -15264 -25456 -15937 -6672 13001 -8731 -28449 -30178 -24512 -45 -694
11664 -694 -11455 -14540 -995 -21277 -41307 -46948 -38405 -9793 -3015 -23333 -25900 -17307 -974
11651 -974 14149 26892 22259 17641 21847 17833 4125 5282 35686 36529 29084 43696 47479 52441
11637 52441 49387 36195 21671 29117 34910 30338 22310 15083 30296 35473 41799 54089 26593
$$ packed form
11727c2542j4710L6992O451k8444J6317J9204j848J5274k3281j6246J8597j2486
11715a6722j1587J5967J181J4623N195j8904p4L475N156m512j5313k9883L9319
11702a2079L3802j7155j5537N198K1167J3698j7450M129j1869k0315K746j6654
11690c0319o624r174J854K3576K3170J7019J4732j0034k3000j3337J6822m587
11678I8K386N874o732j6890j0192R519R265J9673k1732j9718j729N666K4467o49
11664f94j0761l085J3545k0282k0030n641Q543K8612O778k0318k567Q593J6333
11651i74J5123J2743m633m618M206m014j3708J157L0404Q43p445J4612L783M962
11637E2441l054j3192j4524P446N793m572q028p227J5213N177O326J2290k7496
$$ plain form
11624 26593 25833 48406 58917 16742 -3324 -1915 -9897 -13644 5433 27009 23854 15324 -10927
11611 -10927 -14791 -3769 -8018 -12246 -3211 -11628 -33695 -41329 -34451 -5918 28812 37373 9417
11598 9417 -10420 -6699 12012 25437 19415 -18599 -24232 -39921 -43589 -20843 -10004 963 36066
11585 36066 18332 5939 11109 7832 16192 1888 -17246 -21404 3774 9194 -11768 -15627 11820
11572 11820 23719 -293 -13017 -6139 -1842 -17332 2742 8938 20169 30167 17241 8897 17322
11559 17322 26519 49694 18842 -8348 -27829 -36411 -3931 1454 -13897 -32239 -14983 20442
11547 20442 41117 22381 13458 11703 21984 27520 30808 22181 36993 30165 22042 11496 27988
11534 27988 51347 27204 9359 10896 21065 -9504 -8838 7447 16731 962 -23100 -17294 14512
$$ packed form
11624B6593p60K2573J0511m2175k0066J409p982l747J9077K1576l155q530k6251
11611a0927l864J1022m249m228R035q417k2067p634O878K8533L4730Q561k7956
11598I417j9837L721J8711J3425o022l8014n633j5689l668K2746J0839J0967L5103
11585C6066j7734j2393N170l277Q360j4304j9134m158K5178N420k0962l859K7447
11572A1820J1899k4012j2724O878M297j5490K0074O196J1231R998j2926q344Q425
11559A7322R197K3175l0852k7190j9481q582L2480N385j5351j8342J7256L5425
11547B0442K0675j8736q923j755J0281N536L288q627J4812o828q123j0546J6492
11534B7988K3359k4143j7845J537J0169l0569O66J6285R284j5769k4062N806L1806
$$ plain form
11521 14512 20118 3589 -4134 7475 -7578 -18041 -14557 -22128 -20318 15042 47058 48029 56164
11508 56164 48826 24621 -8011 -16119 -9937 5791 4195 344 6291 -5567 -17060 -18851 603
11495 603 -14236 -28957 -43584 -31949 -34681 -18904 -18203 -27771 -9769 45506 41307 30803 22107
11482 22107 29608 29832 31904 25323 11198 7990 3691 -5507 -18931 -41955 -42912 -28853 -9173 -3348
11468 -3348 -290 10334 2998 -4226 12898 26869 32556 8521 -17055 8855 14239 15444 22549
11455 22549 20143 16748 126 -518 -8477 -18373 5261 -2339 10476 2268 495 25629 42222
11442 42222 27413 18807 13853 20971 29328 32249 28844 -2932 13122 27872 15733 -9010 584
11429 584 23340 2344 7363 25100 27818 14882 4617 -9384 -4971 10533 6314 -364 8837
$$ packed form
11521A4512N606j6529p723J1609j5053j0463L484p571J810L5360L2016R71Q135
11508E6164p338k4205l2632q108O182J5728j596l851N947j1858j1493j791J9454
11495F03j4839j4721j4627J1635k732J5777P01r568J8002N5275m199j0504q696
11482B2107P501K24K072o581j4125l208m299r198j3424k3024r57J4059J9680N825
11468c348L058J0624p336p224J7124J3971N687k4035k5576K5910N384J205P105
11455B2549k406l395j6622o44p959r896K3634p600J2815q208j773K5134J6593
11442D2222j4809q606m954P118Q357K921l405l1776J6054J4750j2139k4743R594
11429E84K2756k0996N019J7737K718j2936j0265j4001M413J5504m219o678R201
$$ plain form
11416 8837 14874 -12904 7369 -90 8170 9368 9097 12747 -1357 -11685 -1247 6471 8153 22684
11402 22684 5015 8089 39720 41322 33363 16501 7701 20353 39152 38900 5537 10082 20616
11389 20616 -3335 5271 13634 13932 33558 18967 -22823 -20283 -4340 21827 24113 23907 33357
11376 33357 38303 57821 26987 36871 68850 82303 55071 20114 14673 11689 13679 -4567 -28670
11363 -28670 -40581 -30900 -10180 12169 25413 18896 5546 23125 18335 -187 -13564 -14883
11351 -14883 -22865 7381 34658 43458 4819 -13811 -6363 26463 51993 43970 18319 18755 19906
11338 19906 16436 7758 4417 13134 18601 30936 49923 47969 35814 34531 26955 29061 46312
11325 46312 42792 23592 34349 25552 13280 8884 -5301 -30464 -842 18008 12473 -4477
$$ packed form
11416H837O037k7778K0273p459Q260J198k71L650j4104j0328J0438P718J682J4531
11402B2684j7669L074L1631J602p959j6862q800J2652J8799k52l3363M545J0534
11389B0616k3951Q606Q363K98J9626j4591m1790K540J5943K6167K286k06R450
11376C3357M946J9518l0834R884L1979J3453k7232l4957n441k984J990j8246k4103
11363b8670j1911R681K0720K2349J3244o517j3350J7579m790j8522j3377j319
11351a4883p982L0246K7277Q800l8639j8630P448L2826K5530q023k5651M36J151
11338A9906l470q678l341Q717N467J2335J8987j954j2155j283p576K106J7251
11325D6312l520j9200J0757q797j2272m396j4185k5163K9622J8850n535j6950
$$ plain form
11313 -4477 -11768 4551 4800 -10852 -10312 6511 3760 -16004 -24653 -4322 -1310 -1616 -5110 -5839
11299 -5839 -10222 -8576 -14865 -50978 -40873 -14558 -14120 -11192 -21762 1416 45235 48837 73736
11286 73736 59008 11175 8088 -8181 -20115 -10366 27869 21364 16330 14157 3423 16344 57825
11273 57825 64271 57119 25471 8725 14754 10144 1480 17853 22031 25663 28287 32108 40354 32771
11259 32771 29267 14640 -11549 -19032 -51688 -47023 -46728 -40392 -32649 -9729 15477 6088 -4859
11246 -4859 -12662 10931 37763 50794 60865 17248 15071 5658 6228 131 -1867 17204 28975
11233 28975 25378 26692 27022 5932 9410 21299 15596 31138 52249 44720 34550 22331 36082
11220 36082 53521 48717 58566 60785 37413 15870 17351 14541 2009 -7688 -3614 -7071 19058
$$ packed form
11313d477p291J6319K49j5652N40J6823k751j9764q649K0331L012l06l494p29
11299e839m383J646o289l6113J0105K6315M38K928j0570K3178M3819L602K4899
11286G3736j4728m7833l087j6269j1934R749L8235o505n034k173j0734J2921M1481
11273E7825O446p152l1648j6746O029m610q664J6373M178L632K624L821Q246p583
11259C2771l504j4627k6189p483l2656M665K95O336P743K2920K5206r389j0947
11246d859p803K3593K6832J3031J0071m3617k177r413N70o097j998J9071J1771
11233B8975l597J314L30k1090L478J1889n703J5542K1111p529j0170j2219J3751
11220C6082J7439m804R849K219k3372k1543J481k810j2532r697M074l457K6129
$$ plain form
11207 19058 47741 49292 333 -23024 -20458 -934 20963 -7950 -28449 -721 43391 34726
11195 34726 25986 15779 5759 -8256 -1683 29925 38387 39054 17889 23057 52042 42380 13503
11182 13503 -5041 12077 35004 46733 3284 -22332 -6606 23285 21709 19620 9284 -1618
11170 -1618 13701 7252 5270 -6783 -14545 -1739 12333 31539 41407 31474 23469 28608 37624
11157 37624 37527 41601 39738 26613 39907 60401 39123 31327 10079 -26698 2710 33880 15816
11144 15816 -17312 -3374 18661 22722 15047 10559 12287 17209 6389 2540 626 1118 -16531
11131 -16531 -12597 -16513 -18661 -19660 -9600 11305 24649 10856 -650 -25609 -60369 -43509 6316
11118 6316 15439 19090 11721 3976 11091 23439 59789 90631 61136 49090 30022 -10483 -33024
$$ packed form
11207A9058K8683J551m8959k3357K566J9524K1897k8913k0499K7728M4112q665
11195C4726q740j0207j0020j4015O573L1608Q462O67k1165N168K8985r662k8877
11182A3503j8544J7118K2927J1729m3449k5616J5726K9891j576k089j0336j0902
11170a618J5319o449j982j2053p762J2806J4072J9206R868r933q005N139R016
11157C7624r7M074j863j3125J3294K0494k1278p796k1248l6777K9408L1170j8064
11144A5816l3128J3938K2035M061p675m488J728M922j0820l849j914M92j7649
11131a6531L934l916k148r99J0060K0905J3344j3793j1506k4959l4760J6860M9825
11118F316R123L651p369p745P115J2348L6350L0842k9495j2046j9068m0505k2541
$$ plain form
11105 -33024 2556 11348 -16243 -19512 -23948 14723 20927 4147 -20162 -12543 6423 7755 25812
11092 25812 30786 51913 79374 83267 67479 60849 44805 30042 7437 7590 10292 16337 16931
11079 16931 24887 14880 -65 -16311 -736 14153 706 -13948 -34779 -46477 -1968 5367
11067 5367 -4083 -16273 -22291 -28639 -29429 -15727 -2555 -8816 -10307 -8442 20017 21614 2273 -15169
11053 -15169 -48855 -38909 204 12070 9995 2852 13632 14853 39455 68573 46895 46165 48426
11040 48426 28138 10466 20334 11370 17281 12159 -2700 -6715 -2016 3692 7298 -2381 4304 3486
11026 3486 12461 4142 10913 15509 11948 27902 33694 -6449 -37695 -36945 -2385 -2984 -10404 15949
11012 15949 15586 27110 37304 19457 11975 31270 33493 45537 57243 48996 38397 37032 38965
$$ packed form
11105c3024L5580Q792k7591l269m436L8671O204j6780k4309P619J8966J332J8057
11092B5812M974K1127K7461L893j5788o630j6044j4763k2605J53K702O045N94
11079A6931P956j0007j4945j6246J5575J4889j3447j4654k0831j1698M4509P335
11067E367r450j2190o018o348p90J3702J3172o261j491J865K8459J597j9341j7442
11053a5169l3686R946L9113J1866k075p143J0780J221K4602K9118k1678p30K261
11040D8426k0288j7672R868q964N911n122j4859m015M699N708L606r679O685q18
11026C486Q975q319O771M596l561J5954N792m0143l1246P50L4560n99p420K6353
11012A5949l63J1524J0194j7847p482J9295K223J2044J1706q247j0599j365J933
$$ plain form
10999 38965 37826 45036 41655 66586 71138 53625 44266 16391 21068 48751 46785 58698 43748
10986 43748 12940 11821 1045 20189 42800 43599 28579 42538 15709 6779 7732 14568 13062
10973 13062 13944 41130 46773 16088 -19152 20336 34880 33022 53910 59166 49140 27732 20074
10960 20074 14482 -11374 -814 8723 27478 41540 20786 19719 35565 32968 2805 -780 13409
10947 13409 27276 3419 -12718 -7345 -17469 -25758 -10965 4473 -28373 -26987 -195 -26164
10935 -26164 -39870 -68770 -76251 -29605 -22296 -4123 22390 34726 8576 -8405 -6735 20912
10923 20912 7021 13102 -12591 -53051 -63413 -52068 -29542 5907 31344 32823 30204 24281
10911 24281 10472 28340 52291 36172 37196 20869 33025 40676 104529 188105 213295 183246
$$ packed form
10999C8965j139P210l381K4931M552j7513r359k7875M677K7683j966J1913j4950
10986D3748l0808j119j0776J9144K2611P99j5020J3959k6829q930R53O836j506
10973A3062Q82K7186N643l0685l5240L9488J4544j858K0888N256j0026k1408p658
10960B0074n592k5856J0560R537J8755J4062k0754j067J5846k597l0163l585J4189
10947A3409J3867k3857j6137N373j0124q289J4793J5438l2846J386K6792k5969
10935b6164j3706k8900p481M6646P309J8173K6513J2336k6150j6981J670K7647
10923B0912j3891O081k5693m0460j0362J1345K2526L5449K5437J479k619n923
10911B4281j3809J7868K3951j6119J024j6327J2156P651O3853Q3576K5190l0049
$$ plain form
10899 183246 179058 155572 141240 142869 109188 82108 60894 25561 22745 14549 52095 63525
10887 63525 43311 36896 10923 7917 -5725 -1564 5867 -11348 -33180 -17069 -58 -3199 -22611
10874 -22611 -61310 -44268 -30913 -30145 -16668 -17768 -39262 -22121 -33591 -47967 -63280 -40794
10862 -40794 -17823 11496 -10479 -48414 -58700 -47417 -36142 -23365 -20057 -15456 -41086 -38106
10850 -38106 -24084 -16696 7665 26155 31482 33833 8805 -26872 -24912 -17452 -14867 -24453 -18143
10837 -18143 -32077 -17675 -11169 -34706 -76207 -83383 -66024 -48816 -52516 -38913 -6598 24373
10825 24373 19490 16121 5789 558 -28360 -39141 -27532 9611 33456 22676 13348 -18278
10813 -18278 -5029 8425 4025 -4478 23087 36469 37477 -1182 -9211 12374 5891 3019 15811
$$ packed form
10899A83246m188k3486j4332J629l3681k7080k1214l5333k816q196L7546J1430
10887F3525k0214o415k5973l006j3642M161P431j7215k1832J6111J7011l141j9412
10874b2611l8699J7042J3355P68J3477j100k1494J7141j1470j4376j5313K2486
10862d0794K2971K9319k1975l7935j0286J1283J1275J2777L308M601k5630K980
10850c8106J4022P388K4361J8490N327K351k5028l5677J960P460K585r586O310
10837a8143j3934J4402O506k3537m1501p176J7359J7208l700J3603L2315L0971
10825B4373m883l369j0332n231k8918j0781J1609L7143K3845j0780r328l1626
10813a8278J3249J3454m400q503K7565J3382J008l8659q029K1585o483k872J2792
$$ plain form
10800 15811 1339 23487 16979 29357 42443 15120 -9907 10148 32562 25957 -24134 -42008
10788 -42008 -30855 -10756 4658 -14571 12414 35462 38625 45444 14729 4963 18298 22194
10776 22194 14003 20560 -7884 3929 1628 -12049 -6813 1891 22892 11097 -12076 24892 51112
10763 51112 37432 34960 30220 27820 -4806 -22078 -6107 13596 -245 -5251 4837 6523 816
10750 816 -30681 -23487 10478 29683 -1656 -20699 -20065 3063 19685 12487 -21842 -9620 -2154
10737 -2154 4605 24775 18503 -1118 -9490 13259 7535 11831 14656 5986 4136 10615 7565 14956
10723 14956 25606 16336 -2580 -13957 -22170 -39133 -48902 -55877 -44544 -18614 -9945 2284 680
10710 680 21504 35581 19188 3966 -1105 11547 56914 70953 44966 32515 39080 25042
$$ packed form
10800A5811j4472K2148o508J2378J3086k7323k5027K0055K2414o605n0091j7874
10788d2008J1153K0099J5414j9229K6985K3048L163O819l0715r766J3335L896
10776B2194q191O557k8444J1813k301j3677N236Q704K1001j1795k3173L6968K6220
10763E1112j3680k472m740k400l2626j7272J5971J9703j3841n006J0088J686n707
10750H16l1497P194L3965J9205l1339j9043O34K3128J6622p198l4329J2222P466
10737b154O759K0170o272j9621q372K2749n724M296K825q670j850O479l050P391
10723A4956J0650r270j8916j1377q213j6963r769o975J1333K5930Q669J2229j604
10710F80K0824J4077j6393j5222n071J2652M5367J4039k5987j2451O565j4038
$$ plain form
10698 25042 37183 31934 35986 63801 69515 46823 1789 -7610 5854 1831 8286 23142 28768
10685 28768 40353 38892 20850 -5703 -14388 -9264 -23131 -46164 -28049 -5804 16497 52861
10673 52861 64376 76954 36355 26483 6721 -20418 7912 38234 28796 8655 3934 13175
10661 13175 5093 1353 -7243 6688 42005 39174 27995 21753 28671 21850 21137 27375 20625 30328
10647 30328 9471 1494 -19374 -15023 14548 16698 17507 27630 37615 50157 37033 34450 37394
10634 37394 16920 21253 42928 25719 -4259 -25174 -29050 -13039 2592 16001 6292 4669
10622 4669 -5205 -9978 -12697 -28800 -47136 -50894 -64325 -39467 -27437 -38885 -37614 -46798 -53212
10609 -53212 -65178 -64210 -54570 -48196 -47886 -30993 -17733 -19263 -28184 -33901 -19500 -15783 -469 9233
$$ packed form
10698B5042J2141n249M052K7815N714k2692m5034r399J3464m023O455J4856N626
10685B8768J1585j461j8042k6553q685N124j3867k3033J8115K2245K2301L6364
10673E2861J1515J2578m0599r872j9762k7139K8330L0322r438k0141m721R241
10661A3175q082l740q596J3931L5317k831j1179o242O918o821p13O238o750R703
10647C0328k0857p977k0868M351K9571K150Q09J0123R985J2542j3124k583K944
10634C7394k0474M333K1675j7209k9978k0915l876J6011J5631J3409r709j623
10622D669r874m773k719j6103j8336l758j3431K4858J2030j1448J271r184o414
10609e3212j1966R68R640O374L10J6893J3260j530q921n717J4401L717J5314R702
$$ plain form
10595 9233 -6198 -14659 -5163 8835 32051 8479 -36341 -46153 -33546 -63409 -35167 -20325
10583 -20325 -25596 -11823 35781 29073 5900 -31386 -28059 -10812 -27567 -9284 -7691 -6655 -11476
10570 -11476 -8775 3985 3284 -6325 -169 12283 19311 16703 2129 -15708 -12564 -20213 -48341
10557 -48341 -55397 -65009 -56362 -19168 3165 15382 35661 34752 -11227 -60282 -77738 -56253 -29851
10544 -29851 -3921 15177 22863 7046 -6818 -26280 -47971 -46854 -32127 7155 17426 30644
10532 30644 41377 38546 41325 41669 33214 19856 19301 38092 46776 53876 43012 31119 45407
10519 45407 39067 33150 27666 21585 2750 -27492 -19996 -2579 -14335 13889 64003 76225 98833
10506 98833 157414 252063 400922 550724 709963 853385 898274 867284 766878 608954
$$ packed form
10595I233j5431q461R496J3998K3216k3572m4820r812J2607k9863K8242J4842
10583b0325n271J3773M7604o708k3173l7286L327J7247j6755J8283J593J036m821
10570a1476K701J2760p01r609O156J2452P028k608j4574j7837L144p649k8128
10557d8341p056r612Q647L7194K2333J2217K0279r09m5979m9055j7456K1485K6402
10544b9851K5930J9098P686j5817j3864j9462k1691J117J4727L9282J0271J3218
10532C0644J0733k831K779L44q455j3358n55J8791Q684P100j0864j1893J4288
10519D5407o340n917n484o081j8835l0242P496J7417j1756K8224N0114J2222K2608
10506I8833N8581R4649J48859J49802J59239J43422M4889l0990j00406j57924
$$ plain form
10496 608954 459255 329714 233518 185392 141349 116872 120624 66679 52886 51038 50166 62460
10484 62460 87185 79933 64322 48623 39010 26574 28503 7052 -4126 -14602 2763 -4826
10472 -4826 25922 10929 -15691 -8668 20106 36652 45130 53069 28101 17357 19216 20754 35430
10459 35430 39086 48151 31498 24676 7735 -7720 -7773 -422 17299 16899 14291 745 -28895 -22050
10445 -22050 -13085 -7402 16521 26161 47897 63248 49939 21159 16627 30202 33297 33828 23526
10432 23526 12682 8816 18321 37406 69643 72922 54300 51781 56666 40753 31120 29715 22539
10419 22539 -4006 8391 7762 -690 22501 66085 99896 89996 106490 178869 202980 176587
10407 176587 153071 125313 112750 64880 30817 28601 9863 33462 39746 24044 13064 -379
$$ packed form
10496F08954j49699j29541r6196m8126m4043k4477L752n3945j3793j848q72J2294
10484F2460K4725p252j5611j5699r613j2436J929k1451j1178j0476J7365p589
10472d826L0748j4993k6620P023K8774J6546Q478P939k4968j0744J859J538J4676
10459C5430L656R065j6653o822j6941j5455n3P351J7721m00k608j3546k9640O845
10445b2050Q965N683K3923R640K1736J5351j3309k8780m532J3575L095N31j0302
10432B3526j0844l866R505J9085L2237L279j8622k519M885j5913r633j405p176
10419B2539k6545J2397o29q452K3191M3584L3811r900J6494P2379K4111k6393
10407A76587k3516k7758j2563m7870l4063k216j8738K3599O284j5702j0980j3443
$$ plain form
10395 -379 3584 -2287 25054 24372 32490 36572 40980 -9431 -45691 -42861 -63778 -83914 -80985 -27847
10381 -27847 893 -5911 -5560 303 -10132 13343 8775 -19923 3994 40112 29828 -5440 -25803
10368 -25803 -15497 -3506 18545 -355 -12809 163 14734 5136 7572 32342 44886 28311
10356 28311 49090 47428 257 13479 51093 62436 88964 84103 72591 118190 161851 209103
10344 209103 254288 326416 472230 724481 1014589 1317443 1674462 2088680 2468905 2730291
10334 2730291 2914928 3017692 2981434 2821754 2576683 2240714 1874612 1515455 1198564 928247
10324 928247 699673 534798 401248 316466 273398 250428 229380 218046 185945 148791 156194
10313 156194 139717 130328 126765 105144 89993 73428 65605 54539 55367 80548 70251 56412
$$ packed form
10395c79L963n871K7341o82Q118M082M408n0411l6260K830k0917k0136K929N3138
10381b7847K8740o804L51N863j0435K3475m568k8698K3917L6118j0284l5268k0363
10368b5803J0306J1991K2051j8900j2454J2972J4571r598K436K4770J2544j6575
10356B8311K0779j662m7171J3222L7614J1343K6528m861j1512M5599M3661M7252
10344B09103M5185P2128J45814K52251K90108L02854L57019M14218L80225K61386
10334B730291J84637J02764l6258j59680k45071l35969l66102l59157l16891k70317
10324I28247k28574j64875j33550q4782m3068k2970k1048j1334l2101l7154P403
10313A56194j6477r389l563k1621j5151j6565p823j1066Q28K5181j0297j3839
$$ plain form
10301 56412 68965 98693 102508 71972 12817 2469 12394 7943 13219 -3095 -3640 -13984 3487
10288 3487 24749 32284 38293 40387 38873 43221 35737 29533 52034 48949 48082 42147 62779 75960
10274 75960 110145 137927 115319 110209 107340 93475 78825 71480 69983 71539 61797 70243 92138
10261 92138 123109 172335 193611 215992 201712 183043 132715 84989 59767 51118 36900 28817
10249 28817 7266 6689 33131 42380 65372 54024 50045 56391 49634 2985 -7360 -16817 -18446
10236 -18446 20279 23205 9647 1130 -18621 -16819 17394 31860 42359 61647 49154 42314
10224 42314 50199 42217 59267 71248 72120 54112 42495 21891 19102 12106 25108 56993 53658
10211 53658 53307 40693 38699 9477 -12907 -21390 -22656 -33745 -51804 -37421 -12103 -22658 -44158
$$ packed form
10301E6412J2553K9728L815l0536n9155j0348R925m451N276j6314n45j0344J7471
10288C487K1262P535O009K094j514M348p484o204K2501l085q67n935K0632J3181
10274G5960L4185K7782k2608n110k869j3865j4650p345j497J556r742Q446K1895
10261I2138L0971M9226K1276K2381j4280j8669n0328m7726k5222q649j4218q083
10249B8817k1551n77K6442R249K2992j1348l979O346o757m6649j0345r457j629
10236a8446L8725K926j3558q517j9751J802L4213J4466J0499J9288j2493o840
10224D2314P885p982J7050J1981Q72j8008j1617k0604k789o996J3002L1885l335
10211E3658l51j2614j994k9222k2384q483j266j1089j8059J4383K5318j0555k1500
$$ plain form
10198 -44158 -50771 -37392 -19406 -4155 -7037 11990 28755 18825 18079 12098 -9121 14953 39481
10185 39481 16352 26557 15861 2485 32694 35914 25702 36341 23460 21937 36610 47181
10173 47181 47028 28599 14070 12136 7679 10148 -27436 -20307 46 7415 -389 -4835 15340
10160 15340 25707 18185 15886 8708 -17951 -28913 -31904 -12698 -12931 -8991 -18654 -13922 -10080 2439
10146 2439 4779 28483 26155 22942 14054 -6410 -23347 -36815 -10007 -12386 -43469 -39691 1184
10133 1184 11153 3343 2421 1059 -5587 -20833 -54636 -46303 -2123 24908 14582 -13295 -14773
10120 -14773 -14631 -4953 28897 31202 38269 36009 21256 18886 24346 36293 38224 2715 -5038 4433
10106 4433 6106 42109 23441 -21510 -41302 -51181 -27898 -30678 -15251 -11479 -1528 -37049 -58448
$$ packed form
10198d4158o613J3379J7986J5251k882J9027J6765r930p46n981k1219K4074K4528
10185C9481k3129J0205j0696j3376L0209L220j0212J0639j2881j523J4673J0571
10173D7181j53j8429j4529j934m457K469l7584P129K0353P369p804m446K0175
10160A5340J0367p522k299p178k6659j0962k991J9206k33L940r663M732L842J2519
10146B439K340K3704k328l213q888k0464j6937j3468K6808k379l1083L778M0875
10133A184R969p810r22j362o646j5246l3803Q333M4180K7031j0326k7877j478
10120a4773J42R678L3850K305P067k260j4753k370N460J1947J931l5509p753R471
10106D433J673L6003j8668m4951j9792r879K3283k780J5427L772R951l5521k1399
$$ plain form
10093 -58448 -44326 -16836 1413 -14101 -13789 -4294 -12773 -15828 -5397 -18686 2532 14868 4889
10080 4889 -18924 -7864 7873 22031 14972 17021 9653 -7928 5735 5073 -11930 -15459 20756
10067 20756 37364 41683 31214 24835 29792 23613 -9887 -13023 -1594 -28839 -27972 5213 11931
10054 11931 4232 -9172 -20194 2679 9659 1080 15526 26474 23563 46472 43284 25473 -8351
10041 -8351 -33487 -25747 -20335 -31071 -30121 -45735 -41701 -25808 -17932 -6601 -4361 -20456 -23118
10028 -23118 -20362 -29071 -24677 -18281 -40758 -33119 -26398 -40253 -45739 -60785 -32331 -20417 -548
10015 -548 24203 28333 19695 -21810 -24332 4559 9253 -30835 -27546 -6903 15149 25186 18936
10002 18936 26979 37814 65541 57980 22761 -10341 -12161 -9181 -32770 -23793 9070 6537 16142
$$ packed form
10093e8448J4122K7490J8249j5514L12R495q479l055J0431j3289K1218J2336r979
10080D889k3813J1060J5737J4158p059K049p368j7581J3663o62j7003l529L6215
10067B0756J6608M319j0469o379M957o179l3500l136J1429k7245Q67L3185O718
10054A1931p699j3404j1022K2873O980q579J4446J0948k911K2909l188j7811l3824
10041h351k5136P740N412j0736R50j5614M034J5893P876J1331K240j6095k662
10028b3118K756q709M394O396k2477P639O721j3855n486j5046K8454J1914J9869
10015e48K4751M130q638m1505k522K8891M694m0088L289K0643K2052J0037o250
10002A8936Q043J0835K7727p561l5219l3102j820K980k3589Q977L2863k533R605
$$ plain form
9989 16142 22702 -1285 -7511 -6452 -17987 5644 18131 11691 -1125 5759 26250 18151 1067
9976 1067 -26242 -38103 -31353 -1469 28342 34149 45169 41317 22300 -13336 -29094 -37859 -12290
9963 -12290 -23431 -5965 7547 -12189 -35707 -2062 9995 4821 62 -15946 -34445 -38846
9951 -38846 -11260 13843 7677 7910 -32607 -41318 -21847 -4456 6322 18105 28046 24823 32205
9938 32205 50693 55554 46966 55285 40375 14540 34873 46962 35022 16881 31106 33861 13262
9925 13262 17143 26909 21579 5415 -7897 1048 -1186 -17237 -24264 -4960 14192 681 31612
9912 31612 35743 54152 50565 9282 -22929 -19893 -23727 -28853 -16637 -5929 -8522 -18927 -35131
9899 -35131 -54018 -60064 -36858 1745 11374 -27714 -32964 -46770 -53140 -13490 7819 -12613 3082
$$ packed form
9989A6142O560k3987o226J059j1535K3631J2487o440j2816O884K0491q099j7084
9976A067k7309j1861O750K9884K9811N807J1020l852j9017l5636j5758q765K5569
9963a2290j1141J7466J3512j9736k3518L3645J2057n174m759j6008j8499m401
9951c8846K7586K5103o166K33m0517q711J9471J7391J0778J1783R941l223P382
9938C2205J8488M861q588Q319j4910k5835K0333J2089j1940j8141J4225K755k0599
9925A3262L881R766n330j6164j3312Q945k234j6051p027J9304J9152j3511L0931
9912C1612M131J8409l587m1283l2211L036l834n126J2216J0708k593j0405j6204
9899c5131j8887o046K3206L8603R629l9088n250j3806o370L9650K1309k0432J5695
$$ plain form
9886 3082 26486 5574 4404 31219 27702 27074 1507 -21150 -13685 -14421 2237 9173 -19861 -33020
9872 -33020 -12579 5715 -356 -29079 -26457 -1694 -287 7417 29540 16545 11310 158 17233
9859 17233 16946 20958 24901 23306 20340 13782 30834 9155 10196 -2341 -1966 11725 20190 35029
9845 35029 11897 -1538 -1301 29455 80541 109368 87007 49174 34766 28650 9539 -11161
9833 -11161 18413 28762 -2472 -7596 -11835 -28420 -22279 -6126 4158 11901 17422 21310 -2149
9820 -2149 -6296 -10126 -6646 13352 34018 35486 -3911 6344 10613 -4282 -13102 29567 45975
9807 45975 22632 -5632 -6635 21447 25149 13957 -14973 -8565 16305 19518 12486 12162 4371
9794 4371 23252 34511 15515 -8013 -42200 -56268 -25778 -12603 -256 -6957 -12238 -17222 -25720
$$ packed form
9886C082K3404k0912j170K6815l517o28k5567k2657P465p36J6658O936k9034j3159
9872c3020K0441J8294o071k8723K622K4763J407P704K2123j2995n235j1152J7075
9859A7233k87M012L943j595k966o558J7052k1679J041j2537L75J3691Q465J4839
9845C5029k3132j3435K37L0756N1086K8827k2361l7833j4408o116j9111k0700
9833a1161K9574J0349l1234n124m239j6585O141J6153J0284P743N521L888k3459
9820b149m147l830L480J9998K0666J468l9397J0255M269j4895q820M2669J6408
9807D5975k3343k8264j003K8082L702j1192k8930O408K4870L213p032l24p791
9794D371J8881J1259j8996k3528l4187j4068L0490J3175J2347o701n281m984q498
$$ plain form
9781 -25720 -26271 -17370 -37055 -34215 -24978 -20944 8363 -237 14395 23119 28080 26343 14454 3515
9767 3515 -10203 -38203 -49216 -52327 -36946 -20332 -34736 -42290 -48975 -35826 -6578 -1312 -16011
9754 -16011 -31504 -44371 -46129 -51553 -80769 -63973 -59947 -60726 -49090 -34593 -13212 -3824 -17351
9741 -17351 -31384 -55098 -67695 -50920 -12954 -18468 -32982 -28848 -25066 -36520 -32388 -24841 -28796
9728 -28796 -53610 -68755 -45402 -15103 6878 8171 5038 2242 -13909 269 4788 1104 -10958
9715 -10958 -12549 9803 28121 8432 20807 3583 -10200 -26879 -24324 -26584 -23774 -16169 -23259
9702 -23259 -19986 -24461 -14827 -15123 -8435 4117 107 -9441 10905 11832 13667 -2780 -17488 -5000
9688 -5000 11198 11373 20973 18885 6006 -19689 -51242 -53482 -19586 36190 36750 33876 29178 2550
$$ packed form
9781b5720n51Q901j9685K840R237M034K9307q600J4632Q724M961j737j1889j0939
9767C515j3718k8000j1013l111J5381J6614j4404p554o685J3149K9248N266j4699
9754a6011j5493j2867j758n424k9216J6796M026p79J1636J4497K1381R388j3527
9741a7351j4033k3714j2597J6775L7966n514j4514M134L782j1454M132P547l955
9728b8796k4814j5145K3353L0299K1981J293l133k796j6151J4178M519l684j2062
9715a0958j591K2352J8318j9689J2375j7224j3783j6679K555k260K810P605p090
9702b3259L273m475R634k96O688J2552m010r548K0346R27J835j6447j4708J2488
9688e000J6198J75R600k088j2879k5695l1553k240L3896N5776N60k874m698k6628
$$ plain form
9674 2550 -3556 9578 26158 24326 12762 966 5277 5869 -527 17795 10633 9559 9557 13334 -4713
9659 -4713 -6963 -2606 -19020 -10832 18238 46521 36058 17835 -2564 -12586 -23424 4758 -9105
9646 -9105 -33406 -3241 -15650 -16293 -30200 -59389 -52423 -16610 18964 -7762 -18221 -10943 -30423
9633 -30423 -40903 -42146 158 63097 82119 50069 19249 4498 -5977 -12941 -18895 -9405 17225
9620 17225 27646 -1537 -32877 -32984 -26254 -12694 -28097 -16665 14438 34137 33266 33816 35630
9607 35630 13843 -16399 -20408 13592 12374 10400 -6543 -12434 -17962 -4893 2387 -32492 -38312
9594 -38312 -16637 1393 1922 19574 20208 11635 -12418 8856 27057 -4646 -25553 -9526 7929
9581 7929 17459 -833 27502 50776 58891 35257 22262 17962 15850 19305 13937 -4673 -28266
$$ packed form
9674B550o106J3134J6580j832j1564j1796M311N92o396J8322p162j074kL777j8047
9659d713k250M357j6414Q188K9070K8283j0463j8223k0399j0022j0838K8182j3863
9646i105k4301L0165j2409o43j3907k9189O966L5813L5574k6726j0459P278j9480
9633c0423j0480j243M2304O2939J9022l2050l0820j4751j0475o964n954R490K6630
9620A7225J0421k9183l1340j07O730J3560j5403J1432L1103J9699q71N50J814
9607C5630k1787l0242m009L4000j218j974j6943n891n528J3069P280l4879n820
9594c8312K1675J8030N29J7652O34q573k4053K1274J8201l1703k0907J6027J7455
9581G929R530j8292K8335K3274Q115k3634j2995m300k112L455n368j8610k3593
$$ plain form
9568 -28266 -43800 -47355 -33459 -18128 -6273 6023 8592 20144 21741 6329 -27431 -3001
9556 -3001 29170 6698 4963 11951 -5407 -14554 -11258 6473 2281 -18552 -33297 -39850 -21039
9543 -21039 -29751 -17724 -27400 -26444 -18801 -6498 10766 41679 27342 38112 18628 211 -5120
9530 -5120 -34688 -25845 -38832 -20745 -11342 -33316 -32525 -28618 -14436 -14811 -15871 15763 9243 17377
9516 17377 3082 -4772 20512 44655 45609 17034 -8935 -1065 24421 30629 10484 10877 -3997
9503 -3997 -11233 -1140 -9777 -234 -10319 -17618 -27863 -12074 2443 11071 19032 40967 35307
9490 35307 15309 -8028 2460 4096 57999 105135 104966 59810 43965 30518 15673 39512
9478 39512 36638 26705 60492 65132 48242 34162 32585 36204 19324 -7227 -2047 11721 -10329
$$ packed form
9568b8266j5534l555J3896J5331J1855J2296K569J1552J597j5412l3760K4430
9556c001L2171k2472j735O988j7358r147L296J7731m192k0833j4745o553J8811
9543b1039q712J2027r676R56P643J2303J7264L0913j4337J0770j9484j8417n331
9530e120k9568Q843j2987J8087R403k1974P91L907J4182l75j060L1634o520Q134
9516A7377j4295p854K5284K4143R54k8575k5969P870K5486O208k0145L93j4874
9503c997p236J0093q637R543j0085p299j0245J5789J4517Q628P961K1935n660
9490C5307j9998k3337J0488J636N3903M7136j69m5156j5845j3447j4845K3839
9478C9512k874r933L3787M640j6890j4080j577L619j6880k6551N180J3768k2050
$$ plain form
9465 -10329 627 -25088 -31432 -17863 -2613 -3373 -6939 4491 2604 4914 29083 35827 52905
9452 52905 63611 103029 148694 163470 117679 53021 32821 6119 1807 612 -6241 -12426 -1500
9439 -1500 -1455 15416 26262 21802 38278 35348 32678 33642 28973 18955 45366 50203 45143 56110
9425 56110 57478 28717 23410 36416 52450 45783 43539 44599 36751 59366 85473 74585 61255
9412 61255 50684 30953 13174 25978 37262 24034 23969 24248 24081 25628 10653 3528 -2892 -2524
9398 -2524 6321 31105 34657 14120 17388 11219 13324 29932 6606 2748 32016 29956 -276
9385 -276 2 7302 3786 39190 51621 56431 66409 59867 31145 23910 41237 48233 33489 57161
9371 57161 81078 55132 45909 8031 -22543 -12790 18234 30020 24220 4506 -13111 -2106
$$ packed form
9465a0329J0956k5715o344J3569J5250p60l566J1430j887K310K4169O744J7078
9452E2905J0706L9418M5665J4776m5791o4658k0200k6702m312j195o853o185J0926
9439a500M5J6871J0846m460J6476k930k670R64m669j0018K6411M837n060J0967
9425E6110J368k8761n307J3006J6034o667k244J060p848K2615K6107j0888j3330
9412F1255j0571j9731j7779J2804J1284j3228o5K79j67J547j4975p125o420L68
9398b524Q845K4784L552k0537L268o169K105J6608k3326l858K9268k060l0232
9385b76K78P300l516L5404J2431M810R978o542k8722p235J7327O996j4744K3672
9371E7161K3917k5946r223l7878l0574R753L1024J1786n800j9714j7617J1005
$$ plain form
9359 -2106 -2948 10181 11175 9692 31997 59533 64833 55862 38846 3496 5723 45683 56490 31398
9345 31398 21321 32881 44514 48817 55216 42765 50057 73132 70229 71939 34402 21235 45391
9332 45391 42814 25105 43605 52158 16750 -6604 18839 38352 18029 33894 40435 35622 44264
9319 44264 71612 83021 77851 74075 55784 38484 49440 50308 69202 55668 49176 33230 15603
9306 15603 21539 38767 42988 28365 22076 29241 55617 70200 60131 37386 23464 -4809 15106
9293 15106 18560 61235 83125 61193 41926 35921 45844 48031 47852 54436 50694 57168 85966 96865
9279 96865 78247 79321 79509 85603 92255 132139 163577 145268 108579 100709 124230 108839 83105
9266 83105 91270 107563 96227 71528 75668 82806 91351 79883 107414 109332 95908 81133 89455
$$ packed form
9359b106q42J3129R94j483K2305K7536N300q971j7016l5350K227L9960J0807k5092
9345C1398j0077J1560J1633M303O399j2451P292K3075k903J710l7537j3167K4156
9332D5391k577j7709J8500Q553l5408k3354K5443J9513k0323J5865O541m813Q642
9319D4264K7348J1409n170l776j8291j7300J0956Q68J8894j3534o492j5946j7627
9306A5603N936J7228M221j4623o289P165K6376J4583j0069k2745j3922k8273J9915
9293A5106L454M2675K1890k1932j9267o005R923K187j79O584l742O474K8798J0899
9279I6865j8618J074J88O094O652L9884L1438j8309l6689p870K3521j5391k5734
9266H3105Q165J6293j1336k4699M140P138Q545j1468K7531J918j3424j4775Q322
$$ plain form
9253 89455 79358 83514 98275 81349 88895 84723 47881 54934 49649 37670 39259 58538 66033
9240 66033 55860 70987 95538 77491 58515 80774 79355 74299 83426 83818 60804 48253 66737
9227 66737 101965 117575 150320 166072 184602 226069 225343 222087 256002 262847 260628 259603 223282
9214 223282 210069 223486 271434 267577 238507 233598 248061 263306 266992 265951 266074 262106 279846
9201 279846 297569 311779 304263 316770 342171 352640 373918 392635 428073 485882 526062 562560
9189 562560 637632 738315 863603 1036156 1256044 1596745 2110301 2975403 4511996 7350958
9179 7350958 13011922 22476560 27730723 26678024 23755911 16856755 10235848 6666116
9171 6666116 4730437 3572528 2830014 2282598 1878346 1579157 1369958 1216721 1095268
$$ packed form
9253H9455j0097M156J4761j6926P546m172l6842P053n285j1979J589J9279P495
9240F6033j0173J5127K4551j8047j8976K2259j419n056R127L92k3014j2551J8484
9227F6737L5228J5610L2745J5752J8530M1467p26l256L3915O845k219j025l6321
9214B23282j3213J3417M7948l857k9070m909J4463J5245L686j041J23l968J7740
9201B79846J7723J4210p516J2507K5401J0469K1278J8717L5438N7809M0180L6498
9189E62560P5072J00683J25288J72553K19888L40701N13556Q65102J536593K838962
9179G350958N660964R464638N254163j052699k922113o899156o620907l569732
9171F666116j935679j157909p42514n47416m04252k99189k09199j53237j21453
$$ plain form
9162 1095268 996338 899841 806994 775579 761400 736713 697618 673476 671507 648972 584940 548617
9150 548617 531258 483656 450424 438857 405414 327898 274965 264537 253301 272514 301892 302848
9138 302848 280028 274801 278937 264067 300025 311622 317319 293814 253672 194064 186946 166456
9126 166456 166489 193858 221845 200277 212115 185119 167684 176524 184460 221932 257486 285861 326195
9113 326195 299310 283961 271701 255465 254314 275495 307169 311358 326883 344281 395179 393855
9101 393855 384975 379243 351435 301966 294741 274516 287541 277613 249862 229430 229210 234793 233102
9088 233102 247020 233331 227382 225014 247947 268579 255269 244213 225890 184088 156472 151379
9076 151379 183468 211767 215648 203549 182984 181904 196356 192771 171673 185332 163632 163207 206958
$$ packed form
9162A095268r8930r6497r2847l1415j4179k4687l9095k4142j969k2535o4032l6323
9150E48617j7359m7602l3232j1567l3443p7516n2933j0428j1236J9213K9378R56
9138C02848k2820n227M136j4870L5958J1597N697k3505m0142n9608p118k0490
9126A66456L3K7369K7987k1568J1838k6996j7435Q840P936L7472L5554K8375M0334
9113C26195k6885j5349j2260j6236j151K1181L1674M189J5525J7398N0898j324
9101C93855q880n732k7808m9469p225k0225J3025r928k7751k0432k20N583j691
9088B33102J3918j3689n949k368K2933K0632j3310j1056j8323m1802k7616n093
9076A51379L2089K8299L881j2099k0565j080J4452l585k1098J3659k1700m25M3751
$$ plain form
9063 206958 234634 216538 191369 205310 218337 234432 243333 260645 259603 263914 257732 280403
9051 280403 302424 353214 369246 355233 338474 330264 315730 306183 301759 296141 294990 262605 249729
9038 249729 253054 228755 225371 245114 248326 206727 183375 183133 172218 144804 141959 162775 179967
9025 179967 173838 172989 174455 199831 201923 192898 192830 174162 180861 185686 188412 171026 163140 188352
9011 188352 208278 218170 210715 195214 175399 173872 192369 206148 211421 231679 254385 294640
8999 294640 336845 348598 336031 313731 283185 222236 177019 160950 152327 136831 116045 72709
8987 72709 67633 58240 83412 107309 135413 147214 140608 164810 178876 177480 152161 153261 126781
8974 126781 99709 110021 104259 118220 100811 86721 77233 91457 82915 80203 84896 82401 68710
$$ packed form
9063B06958K7676j8096k5169J3941J3027J6095Q901J7312j042M311o182K2671
9051B80403K2021N0790J6032j4013j6759q210j4534r547m424n618j151l2385j2876
9038B49729L325k4299l384J9743L212m1599k3352k42j0915k7414k845K0816J7192
9025A79967o129q49J466K5376K092r025o8j8668O699M825K726j7386p886K5212
9011A88352J9926R892p455j5501j9815j527J8497J3779N273K0258K2706M0255
8999B94640M2205J1753j2567k2300l0546o0949m5217j6069q623j5496k0786m3336
8987G2709n076r393K5172K3897K8104J1801o606K4202J4066j396k5319J100k6480
8974A26781k7072J0312n762J3961j7409j4090r488J4224q542k712M693k495j3691
$$ plain form
8961 68710 88266 88139 78965 96855 96224 78392 96983 143841 165471 164404 174186 192819 184540
8948 184540 176405 171626 167905 167011 176872 186635 181193 170451 171384 178918 168339 130275 81355 70608
8934 70608 71821 78816 108431 118110 127276 129452 143158 144160 112262 115237 122758 128202 118829 80333
8920 80333 45300 42779 58312 94114 124859 110272 72669 63253 71501 67722 86017 92318 69420
8907 69420 75601 69693 38968 24381 -3960 1065 -1956 -5725 22390 35175 58127 60867 84540
8894 84540 85601 71073 69607 65135 61096 37235 35681 43497 22869 55207 81775 62142 55154
8881 55154 66257 78943 84541 71727 73820 108168 111171 89478 106583 145126 154907 153405 153795
8868 153795 158891 166389 153569 134069 100761 108783 117659 137598 140921 130071 130578 109148 73211
$$ packed form
8961F8710J9556j27r174J7890o31j7832J8591M6858K1630j067R782J8633q279
8948A84540q135m779l721q94R861R763n442j0742R33P534j0579l8064m8920j0747
8934G0608J213O995K9615R679R166K176J3706J002l1898K975P521N444r373l8496
8920H0333l5033k521J5533L5802L0745j4587l7603r416Q248l779J8295O301k2898
8907F9420O181n908l0725j4587k8341N025l021l769K8115J2785K2952K740K3673
8894H4540J061j4528j466m472m039k3861j554P816k0628L2338K6568j9633o988
8881E5154J1103J2686N598j2814K093L4348L003k1693J7105L8543R781j502L90
8868A53795N096P498j2820j9500l3308Q022Q876J9939L323j0850N07k1430l5937
$$ plain form
8855 73211 50031 58243 80092 55756 46379 77367 84682 75791 92545 112171 131083 132544 177524
8842 177524 211245 199004 179785 174527 173634 149384 165659 170407 189447 189133 193085 219341 225164
8829 225164 213688 190580 196861 196564 178046 185662 194999 200897 194502 149359 131628 151890 183293
8816 183293 197235 230388 207021 181365 181431 154040 117935 118810 137122 150080 190621 207094 208207
8803 208207 226710 251959 270532 345486 406142 414092 411166 419787 422733 403856 391520 358817
8791 358817 345101 338597 326964 343827 355019 361375 379987 378580 398778 393930 355485 361762 354190
8778 354190 319255 309405 315669 325414 322256 308415 298848 311202 346808 337211 339670 338283 365801
8765 365801 381440 334756 300206 288411 285704 307680 341510 384215 405060 439031 496877 557089
$$ packed form
8855G3211k3180Q212K1849k4336r377L0988P315q891J6754J9626J8912J461M4980
8842A77524L3721j2241j9219n258q93k4250J6275M748J9040l14L952K6256N823
8829B25164j1476k3108O281k97j8518P616R337N898o395m5143j7731K0262L1403
8816A83293J3942L3153k3367k5656O6k7391l6105Q75J8312J2958M0541J6473J113
8803B08207J8503K5249J8573P4954O0656P950k926Q621K946j8877j2336l2703
8791C58817j3716o504j1633J6863J1192O356J8612j407K0198m848l8445O277p572
8778C54190l4935r850O264R745l158j3841r567J2354L5606r597K459j387K7518
8765C65801J5639m6684l4550j1795k707K1976L3830M2705K0845L3971N7846O0212
$$ plain form
8753 557089 553820 543239 539457 550567 545249 542356 572723 571020 566311 579211 573137 583594 584012
8740 584012 555215 521989 493918 473117 445197 438734 463096 458884 431043 431440 455858 472777
8728 472777 460610 406979 361395 353209 364399 369577 371503 390187 404205 418624 430077 458389
8716 458389 495411 513235 559057 587740 610750 653038 666647 642957 627186 624094 604882 602450
8704 602450 630202 693837 756446 766154 736835 719712 646555 592149 554216 534885 506263 485071
8692 485071 478997 487110 513296 559239 569829 567105 563381 552370 567802 646794 726745 863115
8680 863115 1109180 1471310 2120470 3086098 4069816 4438664 4241752 3643349 2748530 1992070
8670 1992070 1512002 1187820 999610 871298 798749 757025 742754 728214 730876 734066 736425
$$ packed form
8753E57089l269j0581l782J1110n318k893L0367j703m709J2900o074J0457M18
8740E84012k8797l3226k8071k0801k7920o463K4362m212k7841L97K4418J6919
8728D72777j2167n3631m5584q186J1190N178J926J8684J4018J4419J1453K8312
8716D58389L7022J7824M5822K8683K3010M2288J3609k3690j5771l092j9212k432
8704F02450K7752O3635O2609R708k9319j7123p3157n4406l7933j9331k8622k1192
8692D85071o074Q113K6186M5943J0590k724l724j1011J5432P8992P9951J36370
8680H63115K46065L62130O49160R65628R83718L68848j96912n98403q94819p56460
8670A992070m80068l24182j88210j28312p2549m1724j4271j4540K662L190K359
$$ plain form
8659 736425 735114 730784 727182 736857 710622 655832 629626 617907 572862 540160 495042 464471
8647 464471 464092 449872 420666 424814 431024 439863 416340 390762 391798 392279 414755 431633 398988
8634 398988 407333 423228 450852 472609 452085 427733 427492 437712 431978 447053 473658 506291
8622 506291 554255 574165 618692 688054 724195 757239 804464 834660 891667 938422 981822 1010982
8610 1010982 1062414 1114010 1120257 1109856 1110520 1094341 1082863 1079934 1109170 1142382 1155182 1171943
8598 1171943 1169808 1175519 1171600 1098787 1022792 974262 899454 820403 767334 723942 692629 687370
8586 687370 658524 611748 563261 519988 505099 493187 472252 436785 443233 432811 437107 448622
8574 448622 447547 415147 374884 372144 380574 369615 363725 353889 338932 315612 279779 281088 276536
$$ packed form
8659G36425j311m330l602R675k6235n4790k6206j1719m5045l2702m5118l0571
8647D64471l79j4220k9206M148O210Q839k3523k5578J036M81K2476J6878l2645
8634C98988Q345J5895K7624K1757k0524k4352k41J0220n734J5075K6605L2633
8622E06291M7964J9910M4527O9362L6141L3044M7225L0196N7007M6755M3400K9160
8610A010982N1432N1596O247j0401O64j6179j1478k929K9236L3212J2800J6761
8598A171943k135N711l919p2813p5995m8530p4808p9051n3069m3392l1313n259
8586F87370k8846m6776m8487m3273j4889j1912k0935l5467O448j0422M296J1515
8574D48622j075l2400m0263k740Q430j0959n890r836j4957k3320l5833J309m552
$$ plain form
8561 276536 266873 264398 277431 268969 288267 281263 287181 294411 268071 274233 290763 273335 240690
8548 240690 225607 229613 228403 234192 222984 238812 251293 250962 241051 251061 271597 277603 229994
8535 229994 186494 200012 203084 188138 177314 200884 203651 218070 240099 226989 227282 235342 231077
8522 231077 213385 208253 223120 209481 183802 181733 209002 230839 248183 254792 240477 259713
8510 259713 267462 264722 249308 248090 259526 228751 229376 298825 424786 541138 712549 980367
8498 980367 1288093 1518425 1601834 1597695 1516751 1361483 1186075 990019 780988 604007
8488 604007 506297 435456 373825 302775 271552 258610 212948 190982 200076 178625 159597 124158
8476 124158 115030 149568 160010 169133 155191 158418 186396 211998 204030 199191 236115 271032 283081
$$ packed form
8561B76536r663k475J3033q462J9298p004N918P230k6340O162J6530j7428l2645
8548B40690j5083M006j210N789j1208J5828J2481l31r911J0010K0536O006m7609
8535B29994m3500J3518L072j4946j0824K3570K767J4419K2029j3110K93Q060m265
8522B31077j7692n132J4867j3639k5679k069K7269K1837J7344O609j4315J9236
8510B59713P749k740j5414j218J1436l0775O25O9449J25961J16352J71411K67818
8498I80367L07726K30332Q3409m139q0944j55268j75408j96056k09031j76981
8488F04007r7710p0841o1631p1050l1223j2942m5662k1966R094k1451j9028l5439
8476A24158r128L4538J0442R123j3942L227K7978K5602p968m839L6924L4917J2049
$$ plain form
8463 283081 281059 271119 279771 304844 301827 322901 318971 299864 287093 305458 297764 322843 342434
8450 342434 333574 357351 414526 424546 440574 508843 533161 538043 544353 558456 551946 531342
8438 531342 512522 486977 451245 437726 422804 404120 394922 402350 384005 337109 293959 270812
8426 270812 237506 230225 206471 171369 154837 176175 198764 210677 201697 241686 283640 288133
8414 288133 272184 257598 202758 172729 171807 154586 172258 174808 156115 165603 169257 127362 135515
8401 135515 155375 178513 215539 233099 272434 341848 404878 437615 452783 479971 476416 462526
8389 462526 450250 405623 315642 247111 204358 190579 186087 161446 143582 141408 134279 142712
8377 142712 142256 130217 115877 154575 175048 169192 163789 170519 166471 182322 204131 237915 272817
$$ packed form
8463B83081k022r940Q652K5073l017K1074l930j9107j2771J8365p694K5079J9591
8450C42434q860K3777N7175J0020J6028O8269K4318M882O310J4103o510k0604
8438E31342j8820k5545l5732j3519j4922j8684r198P428j8345m6896m3150k3147
8426B70812l3306p281k3754l5102j6532K1338K2589J1913q980L9989M1954M493
8414B88133j5949j4586n4840l0029r22j7221J7672K550j8693R488L654m1895Q153
8401A35515J9860K3138L7026J7560L9335O9414O3030L2737J5168K7188l555j3890
8389D62526j2276m4627q9981o8531m2753j3779m492k4641j7864k174p129Q433
8377A42712m56j2039j4340L8698K0473n856n403O730m048J5851K1809L3784L4902
$$ plain form
8364 272817 251041 250161 242508 240848 241002 193600 174800 152524 165831 201395 190608 172609 125067
8351 125067 91847 92733 101647 103837 134728 155982 123768 104618 89441 69651 82048 83763 99249
8338 99249 93637 83578 80255 69514 105392 121141 122897 115650 97502 89113 95984 120941 126340
8325 126340 138052 127406 128258 135950 144110 168761 193231 217295 218154 174765 167406 156376 166741
8312 166741 143671 128151 127958 114834 114777 126376 117904 98689 85606 93583 105135 102128 79128
8299 79128 81352 86384 90313 72088 55633 65153 86833 110709 121779 129552 120446 115835 111972
8286 111972 101904 51390 54265 73573 62629 56107 70497 84628 117088 118007 123773 111488 109091
8273 109091 124599 131831 129224 139864 141876 132781 116360 121730 122670 114795 101036 130633 118589
$$ packed form
8364B72817k1776q80p653j660J54m7402j8800k2276J3307L5564j0787j7999m7542
8351A25067l3220Q86Q914K190L0891K1254l2214j9150j5177j9790J2397J715J5486
8338I9249n612j0059l323j0741L5878J5749J756p247j8148q389O871K4957N399
8325A26340J1712j0646Q52P692Q160K4651K4470K4064Q59m3389p359j1030J0365
8312A66741k3070j5520j93j3124n7J1599q472j9215j3083P977J1552l007k3000
8299G9128K224N032L929j8225j6455R520K1680K3876J1070P773r106m611l863
8286A11972j0068n0514K875J9308j0944o522J4390J4131L2460R19N766j2285k397
8273A09091J5508P232k607J0640K012r095j6421N370R40p875j3759K9597j2044
$$ plain form
8260 118589 128874 123165 106674 102741 89867 88272 96642 104975 102354 60597 59572 72618 82891
8247 82891 60086 32233 36304 61507 78954 78634 55856 43671 52189 31053 30496 52233 71903
8234 71903 49642 31344 69191 96378 94658 82008 65380 61184 45468 68982 91548 103044
8222 103044 88311 99829 101514 99279 110043 102447 90684 93213 101176 104290 105941 97933 90060
8209 90060 83326 84668 108233 123364 125078 116140 83975 78460 51635 37733 48754 61942 64361
8196 64361 52158 59151 68512 65744 57411 57263 62658 49059 62074 51556 32093 12324 24065
8183 24065 16966 3901 -1668 1953 4156 34115 57589 62068 45720 37287 39068 28615 19933
8170 19933 24352 36669 31268 15410 -3068 4915 38523 44669 43518 51231 62193 72583 93226
$$ packed form
8260A18589J0285n709j6491l933j2874j595Q370Q333k621m1757j025J3046J0273
8247H2891k2805k7853M071K5203J7447l20k2778j2185Q518k1136n57K1737J9670
8234G1903k2261j8298L7847K7187j720j2650j6628m196j5716K3514K2566J1496
8222A03044j4733J1518J685k235J0764p596j1763K529P963L114J651q008p873
8209I0060o734J342K3565J5131J714q938l2165n515k6825j3902J1021J3188K419
8196F4361j2203O993R361k768q333j48N395j3599J3015j0518j9463j9769J1741
8183B4065p099j3065n569L621K203K9959K3474M479j6348q433J781j0453q682
8170A9933M419J2317n401j5858j8478P983L3608O146j151P713J0962J0390K0643
$$ plain form
8157 93226 90364 84799 113569 101830 98337 89103 80441 131428 136434 102770 74049 51385 43900
8144 43900 41304 35580 58876 68266 68467 57692 63532 56765 46965 24540 15299 30744 35760 45464
8130 45464 18298 8604 11016 17744 48522 53990 73106 90984 81203 90686 90617 107400 156797 210466
8116 210466 274050 357681 406897 407123 406955 382033 374489 343941 303201 302730 332284 363371 420312
8103 420312 461016 475548 472753 447716 410746 391015 382159 389198 369203 347002 343160 325466
8091 325466 312531 330544 387913 490946 660999 836327 1021537 1151717 1183036 1171377 1136404
8080 1136404 1055700 947340 795852 650792 535035 457814 433125 417935 431625 496866 606376
8069 606376 713927 776208 819154 824151 774466 706549 621630 599232 634017 680550 734695 826643
$$ packed form
8157I3226k862n565K8770j1739l493r234q662N0987N006l3664k8721k2664p485
8144D3900k596n724K3296R390K01j0775N840o767r800k2425r241J5445N016R704
8130D5464k7166r694K412O728L0778N468J9116J7878r781R483o9J6783M9397N3669
8116B10466O3584Q3631M9216K26j68k4922p544l0548m0740m71K9554L1087N6941
8103D20312M0704J4532k795k5037l6970j9731q856P039j9995k2201l842j7694
8091C25466j2935J8013N7369J03033J70053J75328J85210J30180L1319j1659l4973
8080A136404q0704j08360j51488j45060j15757p7221k4689j5190J3690O5241J09510
8069F06376J07551O2281M2946M997m9685o7917q4919k2398L4785M6533N4145R1948
$$ plain form
8057 826643 930771 966287 952625 887116 804613 723818 682294 650426 609696 601845 612373 637155
8045 637155 677493 773994 869849 997954 1216911 1545934 1919061 2230521 2402083 2384668
8035 2384668 2198261 1902037 1597691 1323212 1086388 892518 728760 624090 570562 556484
8025 556484 566273 586345 624978 627046 617545 617957 602248 571465 561174 557370 599922 607523 661341
8012 661341 741331 767444 769310 734694 682097 655988 658233 619647 576037 587988 588541 584122 614497
7999 614497 649064 660205 688894 738002 814597 909774 1004442 1038776 1029801 1008949 950319 838969
7987 838969 745199 642039 518600 426808 360447 339033 309932 261232 236156 260514 287200
7976 287200 319874 294310 267240 259985 271353 287200 318378 333504 306816 309517 327795 356988
$$ packed form
8057H26643J04128L5516j3662o5509q2503q0795m1524l1868m0730p851J0528K4782
8045F37155M0338R6501R5855J28105K18957L29023L73127L11460J71562j7415
8035B384668j86407k96224l04346k74479k36824j93870j63758j04670n3528j4078
8025E56484R789K0072L8633K068r501M12j5709l0783j0291l804M2552P601N3818
8012F61341P9990K6113J866l4616n2597k6109K245l8586m3610J1951N53m419L0375
7999F14497L4567J1141K8689M9108P6595R5177R4668L4334q975k0852n8630j11350
7987H38969r3770j03160j23439r1792o6361k1414k9101m8700k5076K4358K6686
7976B87200L2674k5564k7070p255J1368J5847L1178J5126k6688K701J8278K9193
$$ plain form
7964 356988 388759 396689 408411 419089 390554 383843 432534 451194 435260 427648 417666 406025
7952 406025 368935 331155 307193 291906 294060 283318 277738 249037 227348 203104 211839 239755
7940 239755 224670 206549 199137 197157 168981 148818 156588 178032 163574 139214 152174 195300
7928 195300 210609 223655 239116 257818 276575 294822 283363 248495 258800 267476 280597 295748
7916 295748 286412 284352 277634 271972 285633 292324 271637 262502 255203 252425 245507 220418 201243
7903 201243 220431 222539 227468 216467 192265 174120 178770 169494 143753 136985 111220 118402 126488
7890 126488 117492 122257 117939 118487 158451 153944 155930 158176 164268 141362 127524 125115 102730 80193
7876 80193 52223 56692 62310 72109 78667 121339 125900 112104 101679 88592 91335 96115 82567
$$ packed form
7964C56988L1771P930J1722J0678k8535o711M8691J8660j5934p612r982j1641
7952D06025l7090l7780k3962j5287K154j0742n580k8701k1689k4244Q735K7916
7940B39755j5085j8121p412j980k8176k0163P770K1444j4458k4360J2960M3126
7928A95300J5309J3046J5461J8702J8757J8247j1459l4868J0305Q676J3121J5151
7916B95748r336k060o718n662J3661O691k0687r135p299k778o918k5089j9175
7903B01243J9188K108M929j1001k4202j8145M650r276k5741o768k5765P182Q086
7890A26488q996M765m318N48L9964m507J986K246O092k2906j3838k409k2385k2537
7876H0193k7970M469N618R799O558M2672M561j3796j0425j3087K743M780j3548
$$ plain form
7863 82567 82971 65295 79032 101478 98080 70995 51591 43688 24236 22638 58476 81832 53998
7850 53998 23716 33576 74084 80728 39420 33840 51974 70782 75361 61594 42575 24140 37665
7837 37665 46319 13320 3850 18577 37880 47792 41624 72607 83677 63221 55251 66471 62568
7824 62568 44490 77947 72382 49773 39943 25751 13864 21185 28301 55564 70860 53365 25048
7811 25048 29834 49259 47845 26925 12087 5539 6724 23208 17988 31201 43707 33849 38301
7798 38301 50875 13251 3152 -2717 14473 31487 20950 38457 48645 20478 7175 15166
7786 15166 -7369 -17797 2704 26465 35710 23035 13735 4851 -15882 -13809 -3044 7601 13756
7773 13756 24288 30930 30964 29799 5484 -14124 -12948 -25440 18529 59427 71728 41257 6747
$$ packed form
7863H2567M04j7676J3737K2446l398k7085j9404p903j9452j598L5838K3356k7834
7850E3998l0282R860M0508O644m1308n580J8134J8808M579j3767j9019j8435J3525
7837C7665Q654l2999r470J4727J9303R912o168L0983J1070k0456p970J1220l903
7824F2568j8078L3457n565k2609r830j4192j1887P321P116K7263J5296j7495k8317
7811B5048M786J9425j414k0920j4838o548J185J6484n220J3213J2506r858M452
7798C8301J2574l7624j0099n869J7190J7014j0537J7507J0188k8167j3303P991
7786A5166k2535j0428K0501K3761R245j2675r300q884k0733K073J0765J0645O155
7773A3756J0532O642L4j165k4315j9608J176j2492M3969M0898J2301l0471l4510
$$ plain form
7760 6747 -13344 -27170 -11837 20188 11533 7158 5667 8400 3139 -3732 -16656 14482 11143
7747 11143 10603 -22624 -49933 -31837 -1672 14205 -8485 -28928 -40411 -23994 -9815 -2661
7735 -2661 6587 5041 1403 -20442 -43572 -52620 -46756 -21858 -16168 -19539 -31489 -22960 5858 9588
7721 9588 -2686 8047 5619 4141 -9150 -14291 -5297 2501 -13498 -45944 -43038 -26781 -2579
7708 -2579 1041 -7547 -5426 -25471 -33682 -18255 -17135 -1015 1651 1145 -6689 269 6458 2996
7694 2996 13261 18023 21740 26566 35817 21953 26562 34096 51489 47820 37408 11600 -7937
7681 -7937 -13526 -1274 -473 -41182 -53712 -49808 -45433 -34874 -7704 9892 6074 351 -3915 -10077
7667 -10077 1003 -4817 13555 13433 -11150 -14431 10090 24459 17919 18078 27935 26093 16682 -9659
$$ packed form
7760F747k0091j3826J5333L2025q655m375j491K733n261o871j2924L1138l339
7747A1143n40l3227k7309J8096L0165J5877k2690k0443j1483J6417J4179P154
7735b661R248j546l638k1845k3130r048N864K4898N690l371j1950Q529K8818L730
7721I588j2274J0733k428j478j3291n141Q994P798j5999l2446K906J6257K4202
7708b579L620q588K121k0045q211J5427J120J6120K666n06p834O958O189l462
7694B996J0265M762L717M826R251j3864M609P534J7393l669j0412k5808j9537
7681g937n589J2252Q01m0709j2530L904M375J0559K7170J7596l818n723m266o162
7667a0077J1080n820J8372j22k4583l281K4521J4369o540J59R857j842r411k6341
$$ plain form
7653 -9659 -36103 -38974 -34532 -20646 -11675 -9635 -8024 -12248 5666 1136 3577 18208 26352 22336
7639 22336 40110 43590 44807 47644 48474 24053 -10432 -26062 -27396 -4521 7227 4790 13141
7626 13141 -24188 -29424 -715 -17178 -18281 -15325 -22265 -25510 -12412 7858 -6100 10020 11264
7613 11264 9078 19003 11319 16230 11235 32246 43160 57503 42462 30308 25128 28605 37135
7600 37135 43802 41880 10921 -8036 -17260 -22114 -28346 -21184 -11437 -11068 -10683 -14682 1320 -6499
7586 -6499 -15402 1096 10347 15704 2208 -3451 29569 42395 27456 10206 -2109 -5692 -6768
7573 -6768 -9845 -3973 -14498 -9566 589 2311 -618 5612 15568 21150 -8293 -20820 -9954 -15970
7559 -15970 -15038 -9655 6849 -11620 -39738 -51950 -45458 -16788 -2799 -6630 12886 7313 -18567
$$ packed form
7653i659k6444k871M442J3886Q971K040J611m224J7914m530K441J4631Q144m016
7639B2336J7774L480J217K837Q30k4421l4485j5630j334K2875J1748k437Q351
7626A3141l7329n236K8709j6463j103K956o940l245J3098K0270j3958J6120J244
7613A1264k186R925p684M911m995K1011J0914J4343j5041j2154n180L477Q530
7600C7135O667j922l0959j8957r224m854o232P162R747L69L85l999J6002p819
7586f499q903J6498R251N357j3496n659L3020J2826j4939j7250j2315l583j076
7573f768l077N872j0525M932J0155J722k929O230R956N582k9443j2527J0866o016
7559a5970R32N383J6504j8469k8118j2212O492K8670J3989l831J9516n573k5880
$$ plain form
7546 -18567 -29723 -46538 -71318 -34417 1294 3123 6484 -11415 -29953 -22835 -22033 10223 30414
7533 30414 28163 8435 31405 18433 1585 -6352 -5899 -7350 13360 2835 -26526 -30740 -17523
7520 -17523 1356 -3155 -49910 -46306 -31279 -26494 4316 22215 11579 3534 -32000 -66805 -47456
7507 -47456 -44705 -57306 -49940 -35497 -18866 -3250 -13359 -26890 -9212 30742 30956 21515 9842
7494 9842 2314 29168 753 -5616 -28167 -20965 -10384 19846 57304 72108 48987 32945 33595
7481 33595 18339 -10091 -40671 -49204 -20433 -20031 -30891 -43808 -23406 -17535 -3619 -2036 889
7468 889 18706 28864 49487 6337 -28768 -31824 1814 5411 -14356 273 6438 -10647 -28420
7455 -28420 -19083 -25222 -19724 -17089 -22064 -24891 -32802 4059 20182 21910 12765 -8346 -17922 -33217
$$ packed form
7546a8567j1156j6815k4780L6901L5711J829L361j7899j8538P118Q02L2256K0191
7533C0414k251j9728K2970j2972j6848p937M53j451K0710j0525k9361m214J3217
7520a7523J8879m511m6755L604J5027M785L0810J7899j0636q045l5534l4805J9349
7507d7456K751j2601P366J4443J6631J5616j0109j3531J7678L9954K14r441j1673
7494I842p528K6854k8415o369k2551P202J0581L0230L7458J4804k3121j6042O50
7481C3595j5256k8430l0580q533K8771M02j0860j2917K0402N871J3916J583K925
7468H89J7817J0158K0623m3150l5105l056L3638L597j9767J4629O165j7085j7773
7455b8420R337o139N498K635m975k827p911L6861J6123J728r145k1111r576j5295
$$ plain form
7441 -33217 -25208 -8424 -4343 -15722 -6921 2352 8774 7240 -8328 -46264 -32948 24178 52378
7428 52378 22782 3786 1887 16832 27969 19657 7958 11432 34205 26277 11203 -15457 -17689
7415 -17689 -2203 22836 34553 48161 21021 16794 26265 14854 3081 -19760 7566 35576
7403 35576 32422 53804 44115 56188 42648 8270 -22060 -25443 -6463 -4145 -7027 -36644 -42924
7390 -42924 -49061 -43967 -38385 -41443 -26389 -19358 -12447 6856 445 -10706 -27456 -6834 27616
7377 27616 24617 17699 -3395 -10161 -32565 -50578 -55146 -43932 -33935 -42917 -28278 -11654 9487
7364 9487 23670 8042 -18916 -10361 -6437 -15314 10993 43465 36117 41066 17754 23350 10572
7351 10572 8734 17363 19426 29139 17537 -11515 -18751 -1584 -17589 -53638 -59802 -45208 -26937
$$ packed form
7441c3217Q009J6784M081j1379Q801R273O422j534j5568l7936J3316N7126K8200
7428E2378k9596j8996j899J4945J1137q312j1699L474K2773p928j5074k6660k232
7415a7689J5486K5039J1717J3608k7140m227R471j1411j1773k2841K7326K8010
7403C5576l154K1382r689J2073j3540l4378l0330l383J8980K318k882k9617o280
7390d2924o137N094N582l058J5054P031O911J9303o411j1151j6750K0622L4450
7377B7616k999o918k1094o766k2404j8013m568J1214R997q982J4639J6624K1141
7364I487J4183j5628k6958Q555L924q877K6307L2472p348M949k3312N596j2778
7351A0572j838Q629K063R713j1602k9052p236J7167j6005l6049o164J4594J8271
$$ plain form
7338 -26937 -35947 -48738 -69167 -55135 -36471 -13477 -823 -1616 -18220 -30475 -1300 7132 9616
7325 9616 7695 5939 18718 682 -18027 -6259 10738 9855 3860 -1183 -18661 -17916 14651 30398
7311 30398 12052 17348 8526 -32645 -27047 3847 22584 15869 -10522 -10309 12947 16014 -5668
7298 -5668 -11576 -30335 -38490 -41497 -18650 -39685 -66708 -37833 -24552 -24421 -21998 -14652 -3838
7285 -3838 5699 1668 -5903 -3038 -28480 -27781 -27995 -34204 -36967 -57647 -84902 -93261 -79019 -64351
7271 -64351 -51274 -26274 1176 -3705 -11592 -28182 -33196 -8210 14236 39486 43522 35574 44826
7258 44826 14721 -18102 -13991 888 5892 -14872 -15354 -10599 -20894 4869 29551 24430 6265
7245 6265 14196 -3086 -51394 -49857 -21280 -22912 -17163 -15115 -19872 -31051 -31588 -17730 -26638 -44803
$$ packed form
7338b6937r010j2791k0429J4032J8664K2994J2654p93j6604j2255K9175Q432K484
7325I616j921j756J2779j8036j8709J1768J6997q83n995n043j7478P45L2567J5747
7311C0398j8346N296q822m1171N598L0894J8737o715k6391K13K3256L067k1682
7298e668n908j8759q155l007K2847k1035k7023K8875J3281J31K423P346J0814
7285c838R537m031p571K865k5442O99k14o209k763k0680k7255q359J4242J4668
7271f4351J3077K5000K7450m881p887j6590n014K4986K2446K5250M036p948R252
7258D4826l0105l2823M111J4879N004k0764m82M755j0295K5763K4682n121j8165
7245F265P931j7282m8308J537K8577j632N749K048m757j1179n37J3858q908j8165
$$ plain form
7231 -44803 -30347 -29322 -20722 -28069 -32266 -17325 -3299 12722 3112 11129 13303 12712 16976 -3202
7217 -3202 -1873 -12146 -3731 -14723 -22373 -6801 -25311 -46419 -56777 -44837 -27441 -36891 -49980
7204 -49980 -42143 -37586 -9677 16548 11609 -10233 11813 20052 14342 7827 6518 11687 38508
7191 38508 21049 -10314 -6744 11970 15488 9900 -9326 -43294 -51112 -63300 -68307 -56185 -48777
7178 -48777 -52818 -57978 -28698 -6771 2178 18012 1645 -11720 -14511 1614 8913 22938 2644
7165 2644 -10299 -4903 2993 -21658 -35100 -26109 -22339 -38098 -12012 7925 -4209 -33677 -38174
7152 -38174 -26899 -10188 2876 -5104 -31699 -42331 -2906 23129 -3459 -14401 -15251 -18332 -21268
7139 -21268 -26533 -33672 -29835 -22115 -17503 -19499 -15533 8784 35765 48473 17776 -37586 -35237
$$ packed form
7231d4803J4456J025Q600p347m197J4941J4026J6021r610Q017K174n91M264k0178
7217c202J329j0273Q415j0992p650J5572j8510k1108j0358J1940J7396r450j3089
7204d9980P837M557K7909K6225m939k1842K2046Q239n710o515j309N169K6821
7191C8508j7459l1363L570J8714L518n588j9226l3968p818j2188n007J2122P408
7178d8777m041n160K9280K1927Q949J5834j6367j3365k791J6125P299J4025k0294
7165B644j2943N396P896k4651j3442Q991L770j5759K6086J9937j2134k9468m497
7152c8174J1275J6711J3064p980k6595j0632L9425K6035k6588j0942q50l081k936
7139b1268n265p139L837P720M612j996L966K4317K6981J2708l0697n5362K349
$$ plain form
7126 -35237 -6853 -14953 -24585 -16028 -8272 13405 21564 15801 -14057 3966 12945 8546 17615 21873
7112 21873 8099 10580 17149 -997 -20291 -12255 13341 13002 3663 455 19113 6527 -26660
7099 -26660 -57325 -61996 -44846 -21405 -24184 -12448 -5637 -20468 -33117 -37652 -74232 -49525 -31371
7086 -31371 -19883 -10516 14317 41557 43044 13856 -5870 28755 50235 47215 32654 38424 35224
7073 35224 9112 -13941 -29798 -42905 -36057 -13595 10838 24542 26401 27425 20650 -3402 -3499
7060 -3499 17253 6590 -4190 -23118 -22216 -27000 -13929 7922 24078 57736 54000 50332 46389
7047 46389 23667 5600 -14076 -7920 5180 10697 20350 16687 19616 7202 -5479 7276 7917
7034 7917 -9958 -9618 9060 21059 -9710 -31417 -47052 -41323 -35349 -16088 11745 37632 37683
$$ packed form
7126c5237K8384q100r632Q557P756K1677Q159n763k9858J8023Q979m399R069M258
7112B1873j3774K481O569j8146j9294Q036K5596l39r339l208J8658j2586l3187
7099b6660l0665m671J7150K3441k779J1736O811j4831j2649m535l6580K4707J8154
7086c1371J1488R367K4833K7240J487k9188j9726L4625K1480l020j4561N770l200
7073C5224k6112k3053j5857j3107O848K2462K4433J3704J859J024o775k4052r7
7060c499K0752j0663j0780j8928R02m784J3071K1851J6156L3658l736l668l943
7047D6389k2722j8067j9676O156J3100N517R653l663K929j2414j2681J2755O41
7034G917j7875L40J8678J1999l0769k1707j5635N729N974J9261K7833K5887N1
$$ plain form
7021 37683 6763 -15970 -30579 -20559 20876 28431 5478 -18947 -28243 1943 -3550 -23384
7009 -23384 -22068 -43838 -53960 -43368 -3097 29367 4183 -18490 -31075 -16009 219 8891
6997 8891 17897 -6888 8446 23717 38910 31421 45996 45774 20772 11233 -2869 -24146 -48568
6984 -48568 -55650 -28780 -4885 -13389 -1416 -7187 -28607 -24583 -12044 -7394 -6715 -9548 -20331
6971 -20331 -30850 -36027 -39864 -51875 -61702 -56609 -24744 -17289 -318 18255 10874 1154 -21444
6958 -21444 -20826 -10541 -10492 6692 17042 22953 27610 31959 21251 14332 27810 37696 16468 -425
6944 -425 13788 21323 -9067 -28605 -2269 2716 -27597 -43367 -51713 -36594 -38536 -46186 -37375
6931 -37375 -4200 -1135 -6452 -2676 8671 -13017 -34796 -49965 -43185 -30415 -12621 -10994 -39576
$$ packed form
7021C7683l0920k2733j4609J0020M1435P555k2953k4425r296L0186n493j9834
7009b3384J316k1770j0122J0592M0271L2464k5184k2673j2585J5066J6228Q672
6997H891R006k4785J5334J5271J5193p489J4575k22k5002r539j4102k1277k4422
6984d8568p082K6870K3895q504J1973n771k1420M024J2539M650O79k833j0783
6971b0331j0519n177l837j2011r827N093L1865P455J6971J8573p381r720k2598
6958b1444O18J0285M9J7184J0350N911M657M349j0708o919J3478R886k1228j6893
6944d25J4213P535l0390j9538K6336M985l0313j5770q346J5119j942p650Q811
6931c7375L3175L065n317L776J1347k1688k1779j5169O780J2770J7794J627k8582
$$ plain form
6918 -39576 -29195 -12805 -921 25786 49944 32127 6490 -3743 13598 21513 25762 13492
6906 13492 -1409 3052 -21072 -38650 -36875 -31970 -23015 -27424 -9340 -11019 28216 48395 51901
6893 51901 52379 56223 42012 32992 42271 60988 38134 -1522 -30088 -15854 10885 -7121 -23873
6880 -23873 -20818 13142 21358 250 7473 13303 10453 3008 -12580 3296 8498 -4060 2214
6867 2214 -994 8029 36750 73392 59510 25031 -6107 -41525 -43344 -28801 -15361 -7458 438
6854 438 17322 204 -26520 -9235 -9282 -9066 -4758 17908 31146 17684 -6153 -8351 -11306 -14492
6840 -14492 -43167 -40673 -32989 -24619 -9349 -12045 -3642 14271 -15974 -21957 -9027 9439 22574
6827 22574 16598 25436 34885 31700 32794 22993 24986 -3964 -15003 -40535 -44679 -50510 -64202 -57268
$$ packed form
6918c9576J0381J6390J1884K6707K4158j7817k5637j0233J7341P915M249j2270
6906A3492j4901M461k4124j7578J775M905Q955m409J8084j679L9235K0179L506
6893E1901M78L844j4211r020R279J8717k2854l9656k8566J4234K6739j8006j6752
6880b3873L055L3960Q216k1108P223N830k850p445j5588J5876N202j2558O274
6867B214l208R023K8721L6642j3882l4479l1138l5418j819J4543J3440P903P896
6854D38J6884j7118k6724J7285m7K16M308K2666J3238j3462k3837k198k955l186
6840a4492k8675K494P684Q370J5270k696Q403J7913l0245n983J2930J8466J3135
6827B2574n976Q838R449l185J094r801J993k8950j1039k5532m144n831j3692O934
$$ plain form
6813 -57268 -23318 -18149 -18867 -15698 11212 27164 36957 20472 -13141 -25383 -777 15386 -3954
6800 -3954 -42303 -49336 -40410 -38885 -38186 -4045 25962 28949 15016 44679 59651 61148 55286 34332
6786 34332 36025 23285 8117 -12389 -31520 -25536 -15764 -17821 -16475 -21042 -30573 -30677 -18771 -1245
6772 -1245 41394 53018 48494 50764 33449 -14888 -37522 -27448 -17064 3283 49076 61251
6760 61251 43796 48822 61992 34912 -4187 -17252 1223 10395 17423 31261 55436 64255 50350
6747 50350 51915 73040 43048 36084 46997 36977 37303 44787 69884 71530 46486 16445 39364
6734 39364 69550 105785 154933 193942 235554 264822 299975 362940 405984 405288 328952 244405
6722 244405 175284 119660 103342 84701 48999 26826 25466 43200 36863 28111 13031 -5426
$$ packed form
6813e7268L3950N169p18L169K6910J5952R793j6485l3613j2242K4606J6163j9340
6800c954l8349p033Q926J525O99L4141L0007K987j3933K9663J4972J497n862k0954
6786C4332J693j2740j5168k0506j9131N984R772k057J346m567r531j04J1906J7526
6772a245M2639J1624m524K270j7315m8337k2634J0074J0384K0347M5793J2175
6760F1251j7455N026J3170k7080l9099j3065J8475R172P028J3838K4175Q819j3905
6747E0350J565K1125k9992o964J0913j0020L26P484K5097J646k5044l0041K2919
6734C9364L0186L6235M9148L9009M1612K9268L5153O2965M3044o96p6336q4547
6722B44405o9121n5624j6318j8641l5702k2173j360J7734o337q752j5080j8457
$$ plain form
6710 -5426 -14871 -1576 24905 56542 65509 50522 37740 26003 18556 4416 -2442 -2549 -10292
6697 -10292 9901 16455 3892 -8132 1074 -12086 -15412 12180 35294 11999 13638 49919 35394
6684 35394 17662 17096 6155 1659 -1420 11305 15255 11697 21922 32684 29359 11422 -23443
6671 -23443 -39020 -37943 -20992 -27158 -24204 -47026 -57918 -45247 -35417 -23816 21630 43009 11580
6658 11580 20701 21302 8296 7490 -12196 -38441 -12409 15175 2140 20640 -18981 -7240 -5231
6645 -5231 -9529 -27752 -43753 -17719 22435 21786 29398 17423 2383 -5684 2592 -4384 -50656
6632 -50656 -48029 -44285 -27569 -11710 -7575 -18434 7818 11532 -2628 -21894 -19111 -1016 3387
6619 3387 -23621 -8488 -3323 -12649 -7226 5327 46 -2798 29700 65067 37854 30193 38301
$$ packed form
6710e426r445J3295K6481L1637Q967j4987j2782j1737p447j4140o858j07p743
6697a0292K0193O554j2563j2024R206j3160l326K7592K3114k3295J639L6281j4525
6684C5394j7732n66j0941m496l079J2725L950l558J0225J0762l325j7937l4865
6671b3443j5577J077J6951o166K954k2822j0892J2671R830J1601M5446K1379l1429
6658A1580R121O01j3006q06j9686k6245K6032K7584j3035J8500l9621J1741K009
6645e231m298j8223j6001K6034M0154o49P612j1975j5040q067Q276o976m6272
6632e0656K627L744J6716J5859M135j0859K6252L714j4160j9266K783J8095M403
6619C387k7008J5133N165r326N423J2553n281k844L2498L5367k7213p661Q108
$$ plain form
6606 38301 39909 21869 -22474 -30206 12939 22163 36782 17814 -7292 -6783 -4061 14684 41490
6593 41490 18313 753 -10340 768 30322 52383 49790 53364 40026 14968 13106 47633
6581 47633 71348 87611 62987 68761 70091 86723 73078 29150 2549 14315 30803 4933
6569 4933 2898 22616 29724 21619 36903 21940 -8725 -9700 7367 10926 -4137 -20973 -23435
6556 -23435 -13780 -15872 -14264 -5800 -16640 -47281 -23491 -3406 1478 -4838 -19243 14238 26172
6543 26172 6002 1747 -21888 -22290 -6502 -1370 -4700 -8343 16604 7826 -29331 -53977 -24188
6530 -24188 -13052 -27407 -34367 -39880 -34778 -8426 -1692 -16510 -15217 -20744 -23222 -15250 -14911 8634
6516 8634 17587 -5628 -19525 -37201 -32650 -17256 8387 38206 12816 9382 -6471 5644 -14441
$$ packed form
6606C8301J608j8040m4343p732M3145R224J4619j8968k5106N09K722J8745K6806
6593D1490k3177j7560j1093J1108K9554K2061k593L574j3338k5058j862L4527
6581D7633K3715J6263k4624N774J330J6632j3645m3928k6601J1766J6488k5870
6569D933k035J9718P108q105J5284j4963l0665r75J7067L559j5063j6836k462
6556b3435R655k092J608Q464j0840l0641K3790K0085M884o316j4405L3481J1934
6543B6172k0170m255k3635m02J5788N132l330l643K4947q778l7157k4646K9789
6530b4188J1136j4355o960n513N102K6352O734j4818J293n527k478P972L39K3545
6516H634Q953k3215j3897j7676M551J5394K5643K9819k5390l434j5853J2115k0085
$$ plain form
6503 -14441 -9647 27475 28781 14571 18736 10096 -11024 -8925 -1355 -19211 -20511 -6390 23426
6490 23426 30166 10628 6600 6815 19055 24109 -7737 -21747 -1806 1789 -22118 -26505 -43843
$$ packed form
6503a4441M794L7122J306j4210M165q640k1120K099P570j7856j300J4121K9816
6490B3426O740j9538m028K15J2240N054l1846j4010J9941L595k3907m387j7338
$$ [...]
##END NTUPLES=NMR SPECTRUM
##END=
