##TITLE=Analysis number 328669
Compound Code cc 62116
Book Reference 540/4
Project Code adrs
Chemist Name mikem
##JCAMPDX= 6.0         $$ Bruker NMR JCAMP-DX V2.0
##DATA TYPE= NMR SPECTRUM
##DATA CLASS= NTUPLES
##ORIGIN= Bruker BioSpin GmbH
##OWNER= nmr
$$ XWIN-NMR		Version 3.5
$$ Tue Jun 26 09:19:39 2007 GMT Daylight Time (UT+1h)  MAYBRIDGE\nmr@NMR_250MHZ
##.OBSERVE FREQUENCY= 250.131544655141
##.OBSERVE NUCLEUS= ^1H
##.ACQUISITION MODE= SIMULTANEOUS (DQD)
##.ACQUISITION SCHEME= undefined
##.AVERAGES= 16
##.DIGITISER RES= 18
##SPECTROMETER/DATA SYSTEM= dpx250
##.PULSE SEQUENCE= zg30
##.SOLVENT NAME= CDCl3
##.SHIFT REFERENCE= (INTERNAL, CDCl3, 0, 16.4512)
##AUDIT TRAIL= $$ (NUMBER, WHEN, WHO, WHERE, WHAT)
$$ ##TITLE= Audit trail, XWIN-NMR		Version 3.5
$$ ##JCAMPDX= 5.01
$$ ##ORIGIN= Bruker BioSpin GmbH
$$ ##OWNER= nmr
$$ C:\u/data/dgb/nmr/ADRS/1860/pdata/1/auditp.txt
$$ ##AUDIT TRAIL=  $$ (NUMBER, WHEN, WHO, WHERE, WHAT)
(   1,<2007-06-26 09:19:15.87 +100>,<MAYBRIDGE\nmr>,<NMR_250MHZ>,
      <created by zg, POWCHK disabled, PULCHK disabled
       configuration hash MD5:
       76 6E 9A 78 1E 09 19 81 EC 84 63 8F B0 6A 59 2D
       data hash MD5: 64K
       4F 6F 44 BC 6E 6D 82 C3 F1 1F B3 FC 5F 9C 7A E0>)
(   2,<2007-06-26 09:19:29.65 +100>,<MAYBRIDGE\nmr>,<NMR_250MHZ>,
      <Start of raw data processing
       ef LB = 0.3 FT_mod = 6 PKNL = 1 SI = 32K 
       data hash MD5: 32K
       77 8F 85 EB 27 0B 0A 61 A4 30 84 77 CE 8B 40 1D>)
(   3,<2007-06-26 09:19:31.32 +100>,<MAYBRIDGE\nmr>,<NMR_250MHZ>,
      <apk 
       data hash MD5: 32K
       49 1E C9 1F 81 11 67 52 D4 E5 44 FB 29 9D 9A A4>)
(   4,<2007-06-26 09:19:32.15 +100>,<MAYBRIDGE\nmr>,<NMR_250MHZ>,
      <abs ABSG = 5 
       data hash MD5: 32K
       46 E9 83 7C C7 29 55 41 43 47 40 E9 A6 82 C9 22>)
$$ ##END=
$$ 
$$ hash MD5
$$ CA 62 BA 08 20 4D C4 12 A6 67 AE 24 D3 E1 9D 52
##$RELAX= 
##$RELAX= 
##$RELAX= 
##$RELAX= 
##$RELAX= 
##$RELAX= 
##$RELAX= 
$$ Bruker specific parameters
$$ --------------------------
##$DU= <C:\u>
##$EXPNO= 1860
##$NAME= <ADRS>
##$PROCNO= 1
##$TYPE= <nmr>
##$USER= <dgb>
##$AMP= (0..31)
100 100 100 100 100 100 100 100 100 100 100 100 100 100 100 100 100 100 
100 100 100 100 100 100 100 100 100 100 100 100 100 100 
##$AQSEQ= 0
##$AQ_mod= 3
##$AUNM= <au_zg>
##$AUTOPOS= <5 >
##$BF1= 250.13
##$BF2= 250.13
##$BF3= 250.13
##$BF4= 250.13
##$BF5= 500.13
##$BF6= 500.13
##$BF7= 500.13
##$BF8= 500.13
##$BYTORDA= 1
##$CFDGTYP= 0
##$CFRGTYP= 5
##$CHEMSTR= <none>
##$CNST= (0..31)
1 1 145 1 1 1 1 1 1 1 1 1 1 1 1 1 1 1 1 1 1 1 1 1 1 1 1 1 1 1 1 1 
##$CPDPRG= <>
##$CPDPRG1= <>
##$CPDPRG2= <>
##$CPDPRG3= <>
##$CPDPRG4= <mlev>
##$CPDPRG5= <mlev>
##$CPDPRG6= <mlev>
##$CPDPRG7= <mlev>
##$CPDPRG8= <mlev>
##$CPDPRGB= <>
##$CPDPRGT= <>
##$D= (0..31)
0 1 0 0 0 0 0 0 0 0.06 0 0 0 0 0 0 0.0002 0 0 0 0 0 0 0 0 0 0 0 0 0 0 
0 
##$DATE= 1182845954
##$DBL= (0..7)
120 120 120 120 120 120 120 120 
##$DBP= (0..7)
150 150 150 150 150 150 150 150 
##$DBP07= 0
##$DBPNAM0= <>
##$DBPNAM1= <>
$$ [...]
##$SUBNAM7= <"">
##$SUBNAM8= <"">
##$SUBNAM9= <"">
##$SW= 20.6930455092707
##$SWIBOX= (0..15)
0 0 3 0 0 0 0 0 0 0 0 0 0 0 0 0 
##$SW_h= 5175.983436853
##$TD= 65536
##$TD0= 1
##$TE= 295.16
##$TE2= 300
##$TE3= 300
##$TEG= 300
##$TL= (0..7)
0 120 120 120 120 120 120 120 
##$TP= (0..7)
150 150 150 150 150 150 150 150 
##$TP07= 0
##$TPNAME0= <>
##$TPNAME1= <>
##$TPNAME2= <>
##$TPNAME3= <>
##$TPNAME4= <>
##$TPNAME5= <>
##$TPNAME6= <>
##$TPNAME7= <>
##$TPOAL= (0..7)
0.5 0.5 0.5 0.5 0.5 0.5 0.5 0.5 
##$TPOFFS= (0..7)
0 0 0 0 0 0 0 0 
##$TUNHIN= 0
##$TUNHOUT= 0
##$TUNXOUT= 0
##$USERA1= <user>
##$USERA2= <user>
##$USERA3= <user>
##$USERA4= <user>
##$USERA5= <user>
##$V9= 5
##$VALIST= <valist>
##$VCLIST= <CCCCCCCCCCCCCCC>
##$VD= 0
##$VDLIST= <DDDDDDDDDDDDDDD>
##$VPLIST= <PPPPPPPPPPPPPPP>
##$VTLIST= <TTTTTTTTTTTTTTT>
##$WBST= 1024
##$WBSW= 4
##$XGAIN= (0..3)
0 0 0 0 
##$XL= 0
##$YL= 0
##$YMAX_a= 397061
##$YMIN_a= -290116
##$ZGOPTNS= <>
##$ZL1= 120
##$ZL2= 120
##$ZL3= 120
##$ZL4= 120
##$ABSF1= 16.45118
##$ABSF2= -4.241993
##$ABSG= 5
##$ABSL= 3
##$ALPHA= 0
##$AQORDER= 0
##$ASSFAC= 0
##$ASSFACI= 0
##$ASSFACX= 0
##$ASSWID= 0
##$AUNMP= <proc_1d>
##$AZFE= 0.1
##$AZFW= 0.1
##$BCFW= 0
##$BC_mod= 0
##$BYTORDP= 0
##$COROFFS= 0
##$CY= 12.5
##$DATMOD= 1
##$DC= 0
##$DFILT= <>
##$DTYPP= 0
##$F1P= 14.0000005364418
##$F2P= -0.99999901652339
##$FCOR= 0.5
##$FTSIZE= 32768
##$FT_mod= 6
##$GAMMA= 0
##$GB= 0
##$INTBC= 1
##$INTSCL= 1
##$ISEN= 128
##$LB= 0.3
##$LEV0= 0
##$LPBIN= 0
##$MAXI= 10000
##$MC2= 0
##$MEAN= 0
##$ME_mod= 0
##$MI= 0
##$NCOEF= 0
##$NC_proc= -3
##$NLEV= 6
##$NOISF1= 0
##$NOISF2= 0
##$NSP= 0
##$NTH_PI= 0
##$NZP= 0
##$OFFSET= 16.45118
##$PC= 1
##$PHC0= -52.37652
##$PHC1= 9.092071
##$PH_mod= 1
##$PKNL= yes
##$PPARMOD= 0
##$PSCAL= 4
##$PSIGN= 0
##$REVERSE= no
##$SF= 250.130017712678
##$SI= 32768
##$SIGF1= 0
##$SIGF2= 0
##$SINO= 400
##$SIOLD= 32768
##$SREGLST= <1H.CDCl3>
##$SSB= 0
##$STSI= 32768
##$STSR= 0
##$SW_p= 5175.98343685301
##$SYMM= 0
##$S_DEV= 0
##$TDeff= 65536
##$TDoff= 0
##$TI= <Analysis number 999999
Compound Code 99
Book Reference 9
Project Code 9>
##$TILT= no
##$TM1= 0
##$TM2= 0
##$TOPLEV= 0
##$USERP1= <user>
##$USERP2= <user>
##$USERP3= <user>
##$USERP4= <user>
##$USERP5= <user>
##$WDW= 1
##$XDIM= 32768
##$YMAX_p= 368983610
##$YMIN_p= -112738
$$ End of Bruker specific parameters
$$ ---------------------------------
##NTUPLES= NMR SPECTRUM
##VAR_NAME=  FREQUENCY,     SPECTRUM/REAL,   SPECTRUM/IMAG
##SYMBOL=    X,             R,               I
##VAR_TYPE=  INDEPENDENT,   DEPENDENT,       DEPENDENT
##VAR_FORM=  AFFN,          ASDF,            ASDF
##VAR_DIM=   32768,         32768,           32768
##UNITS=     HZ,            ARBITRARY UNITS, ARBITRARY UNITS
##FACTOR=    0.157963299565203, 1,           1
##FIRST=     4114.93382082865, 0,            0
##LAST=      -1061.04961602436, 0,           0
##MIN=       -1061.04961602436, -112738,     0
##MAX=       4114.93382082865, 368983610,    0
$$ Real data points
##PAGE= N=1
##DATA TABLE= (X++(R..R)), XYDATA
$$ [...]
23048 -49445 -54913 -35199 -18592 4240 -7527 16022 41635 12745 2898 -11043 -15896 -15690 15545
23035 15545 -3582 -4910 -584 -2574 4321 -29845 -13513 -3436 -15026 -40581 -69573 -60992 -21911
23022 -21911 1922 3962 -20404 -14092 -17381 -4314 -18226 -52664 -47320 -4924 -15175 -30681
23010 -30681 -17130 -4735 -47039 -68096 -58201 -48755 -13427 -22558 -17167 -27060 -42450 -57429 -47264
22997 -47264 -23479 -23255 -51507 -59889 -67153 -62157 -58271 -15937 15533 -994 12723 17025 25253
22984 25253 30089 28615 14384 -27346 -49756 -60835 -44171 -39644 -41124 -38379 -26922 17794 39914
22971 39914 23906 1384 4580 1424 7359 27657 36038 42380 30194 34615 31524 8593 -9450
22958 -9450 -6810 21359 25188 55363 39796 29301 13650 31707 52286 44779 26106 -2354
22946 -2354 15512 6484 -22232 -29952 -16720 4190 22934 -10243 -18172 11978 -2072 -3576 4397
22933 4397 12174 11363 16958 23153 46568 46094 46115 32355 -17264 -13154 10581 5363 -28900 -39094
22919 -39094 -17235 -14144 10194 5266 -6455 -1482 -390 2748 37266 33872 11639 -6534 -6345
22906 -6345 -6846 1641 6675 -1658 -35461 -12656 24005 6102 18226 13113 -16337 7556 38848
22893 38848 36556 -1510 -17810 -9347 -15672 -10321 6803 -6378 1942 20122 16469 7762 36438
22880 36438 40237 27147 12742 11971 -29261 -60416 -53224 -6511 12633 34701 39741 2112 15975
22867 15975 12713 3290 -14304 -7736 -7630 -12530 -20403 -23550 -12361 -1557 -19716 -11377 1571
22854 1571 5939 -8814 -37168 -16588 -34166 -35907 -25026 -22530 -20060 -23227 -34433 -8679 -6002
22841 -6002 630 -8435 -16656 -9822 -2001 -9808 -49404 -43948 -26223 -26591 -47209 -65037 -33671 -18555
22827 -18555 -5635 41375 40262 42748 -2036 -15814 -14623 -43736 -79912 -56910 -70265 -71147 -59265
22814 -59265 -26240 10713 51407 63349 31480 11327 23962 25837 15876 5552 -10018 -3615
22802 -3615 45666 68098 34706 42634 74599 52120 -10414 -26887 -25653 -30105 -43355 -50822 -44608
22789 -44608 -2941 10890 18639 3093 -1272 -3111 -10817 -40426 -7050 -7438 -17898 -30699 -38450
22776 -38450 -20992 29392 38974 5468 -32698 -17974 872 6941 167 -23750 -28724 9845
22764 9845 18822 10078 -3806 -33653 -20760 -16015 -3604 -5704 -12776 432 -13135 -43370 -44899
22751 -44899 -48126 -36376 -20826 -18721 -20231 -15472 -28450 -46857 -54821 -42194 -17983 -9248 -9104
22738 -9104 -23775 -33974 -36109 -20658 36781 61090 60540 69113 38459 19426 13363 -3349 -12169
22725 -12169 -29265 -30493 -14411 10587 11066 -1981 6001 3919 -6275 -4970 -26030 -23197 330
22712 330 24573 23409 -21674 -35975 -27566 -13698 -15799 13184 5427 -20317 -15736 -33378 -87418
22699 -87418 -73272 -53612 -60734 -49578 -10730 -16 -9330 -3983 -10176 -4943 8411 -20526 -45436
22686 -45436 -67366 -49226 6010 -11359 -57288 -55679 -60172 -46334 -27297 -71589 -87056 -79078
22674 -79078 -57019 -32250 -25273 -16344 -18529 6964 39843 25013 -2146 -22351 -24937 -29369 3827
22661 3827 5421 11380 21150 15837 504 -14691 -17624 4856 -13130 -19968 -13523 35000 48175
22648 48175 38238 26928 -9100 -19497 -16797 -15920 -28072 -16433 16316 2839 2605 -2279 -835
22635 -835 -11512 -9872 -33548 -13636 576 -13061 -1318 -3082 -1812 23322 23738 1076 -2752
22622 -2752 -10223 -8609 412 -8844 -4158 -3960 -11745 -8486 2135 -16772 -34303 -26471 -34188 -45822
22608 -45822 -39852 -38369 -20222 -11537 -55 -5074 -12684 -6194 27001 22302 -2851 -8461 -11537
22595 -11537 12306 38307 12913 9014 24135 29958 38852 61854 61424 45327 52118 63776 47453
22582 47453 14419 -24020 -22633 -20169 -3251 7187 -26186 -38458 -58711 -71199 -40576 -20820
22570 -20820 -5216 6930 14957 15426 22066 18103 -10725 -49915 -37134 -33859 -29663 8615 15518
22557 15518 19993 40072 30382 33179 32505 48718 27942 15842 22075 8705 1593 -8600 -4742
22544 -4742 18960 18219 147 -13983 -40434 -31319 -21490 -17266 -21887 -15508 -20667 -28235 -12454 -9156
22530 -9156 -17396 5642 -806 -16796 1769 -2070 -30743 -41885 -40962 -52935 -59892 -37014 -27027
22517 -27027 -25244 -31334 -44069 -33188 -31215 -31296 -26727 -17265 -11566 -12221 -8128 -21761 -12815 -26203
22503 -26203 20568 14311 14446 12767 27218 3678 -28730 -23757 10935 31919 29513 37923 33053
22490 33053 12124 1048 -9520 -31932 -13209 12037 4345 13469 17870 24213 1415 25952
22478 25952 48828 37352 30650 11564 -11936 -1942 2927 -12915 -32566 -27963 -1602 6144 2406
22465 2406 -13340 -40398 -33525 -31760 -22352 14863 20383 45516 18800 -16177 -7815 9432 -15522
22452 -15522 3666 19841 -11776 10198 26875 32635 16294 -8076 -19866 -11527 836 -12661
22440 -12661 -7781 15443 21518 18828 -12181 -39642 -36200 -18762 -4653 -31668 -30171 13451 38816
22427 38816 41086 36651 244 -37188 -22881 -4750 -8061 -21747 -31684 -43853 -25356 -29619 -31433
22414 -31433 -39960 -19887 -26382 -10747 8462 42658 48848 29126 6032 -15625 -22483 -31035 -25273
22401 -25273 -26543 -33251 -38158 -48166 -20237 1889 4301 8525 -13552 -15476 -1908 -12875 -3099
22388 -3099 -25350 -20170 -7113 -4712 -21075 -17945 -17406 658 11051 -1299 -6160 6702 -21936
22375 -21936 -10534 -914 6426 5118 -8016 34172 42728 39401 37818 12784 -16891 -37704 -21070
22362 -21070 -17796 -20803 -20600 1299 13792 11142 15298 18877 -4966 -5481 -11341 -20075 -5708 2574
22348 2574 15203 24308 25682 21911 -7456 14788 49595 35217 10702 1139 18952 24125 -3156
22335 -3156 -8475 24172 35444 30267 35092 35034 28082 9648 1833 -13181 -51455 -63466 -89090
22322 -89090 -50935 -5850 -14654 -29062 -47568 -43370 -30429 -36679 -48218 -25932 -15072 -14817 16916
22309 16916 32052 34292 16957 3886 18532 15249 8512 -1030 -5635 -4638 -16565 -33797 -37692
22296 -37692 -14389 -18011 -9882 -5539 -12302 -33468 -22687 -27532 -40147 -38776 -20574 2963 7576
22283 7576 8994 -63254 -58763 -35074 -28316 5365 28501 31721 33054 52137 33940 24927 21732
22270 21732 -6594 -43037 -63663 -32839 -24116 -26193 6457 33059 24076 27686 -6549 -33374
22258 -33374 -1920 -8440 -37458 -15654 -8105 -49618 -81874 -52237 -13635 -2576 -33961 -72970
22246 -72970 -84003 -82558 -13004 -2349 -15417 -4564 -15801 -15982 8496 23453 18676 -28591
22234 -28591 -65999 -70896 -38460 -14518 -5302 -2867 -13104 -39078 -81573 -88285 -74633 -39262
22222 -39262 -14996 -17943 -21422 -21944 -400 -18827 -34609 -36809 374 33993 22825 9085 9082
22209 9082 -23432 -53436 -62390 -47016 -46518 -8010 4402 -13219 -53925 -69228 -68351 -33243 -46524
22196 -46524 -41349 -30001 -55640 -35418 -21412 -20261 -25400 1459 25416 2584 -28795 -25278
22184 -25278 23370 45782 30871 19597 22950 31920 46714 37049 12483 6178 -5016 -15933
22172 -15933 -9923 -4148 12341 -15259 -32730 -9914 -26710 -38594 -13917 -5485 24860 43381
22160 43381 35591 -13486 -60068 -69510 -41915 -24175 -26785 -14140 -22241 -26274 -29215 -3692 -28520
22147 -28520 -36936 -17484 -20412 -20626 -17812 7049 20823 1285 -13580 -31555 12143 11386 23450
22134 23450 12289 -3534 8934 13691 195 -27105 -18938 3991 -6898 1726 -18817 -18461 5227
22121 5227 24735 5737 -18464 10768 37779 12042 -7523 18722 19256 9764 -4099 -18651
22109 -18651 -15098 3195 -21565 -47735 -46590 -39660 -33443 2743 17097 -11558 -12948 -8043 19140
22096 19140 24709 10919 2428 -21036 -22478 -7858 539 -9443 -6345 -5303 30095 32395 -10370
22083 -10370 -36582 -43443 -25093 5253 7930 -13312 -19843 -33259 -25123 -15675 -7644 -9337 -25534
22070 -25534 -55026 -64200 -38096 -25829 -31623 -34233 -8565 -8207 -6422 1281 15381 -11866 -38463
22057 -38463 -6166 10996 -13080 3449 -13915 -25185 -23865 -37834 -7345 -1821 -27048 -37947
22045 -37947 -60544 -64571 -26557 -12707 -44733 -46098 -21040 -5472 22994 13530 -4194 -13012
22033 -13012 -29146 -28120 -48179 -81620 -64780 -23929 -25053 -35724 2686 9361 2471 31675
22021 31675 41179 30421 10800 -32982 -38716 -21931 11512 9659 -3666 -29716 -37129 -20716
22009 -20716 6798 -3321 21220 35554 20623 2209 9954 27431 34746 33495 42763 23381
21997 23381 -4358 -16495 12298 10429 9031 2573 35574 77013 68522 64247 67476 60755 57256
21984 57256 42543 30410 26618 49079 53934 -10709 -31645 -8081 -9015 15833 32042 558
21972 558 -33338 -21745 5316 62109 68107 32024 142 1276 6921 -22640 -23808 -21693 -37258
21959 -37258 -43582 -39673 -45438 -20339 19842 10215 -8790 -17146 -9614 -14986 -2603 6098 -4925
21946 -4925 -2515 -3295 -7239 -4718 20331 42137 34320 28080 21706 16499 -9478 -36736 -31084 -14285
21932 -14285 6433 5162 14799 7376 -34651 -62790 -73658 -40752 -2118 -10871 -44305 -47713 -19537
21919 -19537 -9985 9102 14561 12641 17909 28843 31936 15990 -4411 -34829 -54931 -37535 -14685
21906 -14685 25320 31458 18287 26277 35174 33155 9636 -8287 4203 -2718 21546 48652 35365
21893 35365 22461 33 1213 -1764 6272 3226 -7218 -9511 35126 67832 59947 29773 6846
21880 6846 1565 -6682 -10078 16753 25441 48989 53051 16016 23521 35859 42995 33487 12264
21867 12264 -13918 -9140 -9734 -41388 -40184 -34831 -63226 -32221 8787 46222 31180 17062 -9826
21854 -9826 -18206 10649 25797 19460 -4681 -21724 -15330 -5693 11481 -3302 -3526 -14395 -45491
21841 -45491 -33042 -17105 -30213 -40459 -15454 -9650 -32548 -5711 -14110 -38600 -22044 6278
21829 6278 16738 -6622 -1980 -2465 -22618 -30343 -41556 -5182 12263 -533 1590 21135 16405
21816 16405 21066 34471 33973 9528 -4935 37400 49807 56085 41840 6963 3877 -14284 -23534
21803 -23534 -25639 -31148 -23374 -467 13251 17770 7692 -29802 -53059 -40168 -22663 -15445 -5275
21790 -5275 785 -3065 9402 -11454 -24208 -1778 -20266 -46067 -13871 9888 -425 -16171
21778 -16171 -17613 13235 13506 -13272 19279 32269 34443 20719 -3321 -6773 42 -31166 -57792
21765 -57792 -47433 -56251 -87145 -72770 -50795 -6846 -1243 -14944 -22452 -16410 -21886 -34905 -50807
21752 -50807 -56500 -49696 -54948 -69882 -41168 -16681 -40365 -50785 -40030 -23135 668 8925
21740 8925 4022 -10962 -12589 -14428 -21560 -8915 376 -8514 -10403 -5989 13778 28704 33550 -4370
21726 -4370 -23651 -5397 -8681 -9912 -18097 -36443 -7706 12217 -3205 -11749 -40981 -57742 -42509
21713 -42509 -9947 -7489 -7116 -17011 3736 16863 780 -2931 -27388 -33940 -1584 35253 18312
21700 18312 -21802 -44733 -51054 -41813 -26004 -40733 -25333 3976 36997 34620 4094 925
21688 925 -6338 -36852 -51386 -33203 -39955 -35424 -23216 -7723 -9153 -22252 26571 29089 30791
21675 30791 917 -19508 -14900 -16426 -33232 -30196 -32415 -15414 -6045 -11113 -9193 -15559 -38451
21662 -38451 -37684 -7859 8367 2363 7791 24507 35389 20719 18476 4942 -21378 -39661 4842
21649 4842 16426 3462 2142 -6991 -5531 4174 -2835 -15098 -6223 -36298 -51491 -52561 -36194
21636 -36194 -10519 27942 19852 -44159 -58647 -22754 -13498 -1601 -9049 -12935 -10380 -18767 -19691
21623 -19691 -8284 5356 11877 -10700 -504 21494 25873 -3914 -10463 -119 17 17784 16561
21610 16561 11712 2024 -31520 -20434 20059 13088 11163 17055 -5409 -30502 -40226 -33686 -32646
21597 -32646 -35333 -14832 -6284 -8713 31005 60079 39355 8565 11607 11928 -9447 -14647 -37906
21584 -37906 -30164 -28129 -29192 -13694 9580 20571 15434 25044 23213 26419 35557 16281 -23687
21571 -23687 -40790 -43415 -51858 -42301 -19234 24436 20394 9256 4949 -11525 -17170 674 19899
21558 19899 2050 -21546 -36590 -33414 -23834 -34007 -53847 -44885 -13365 -4500 -18707 -2650
21546 -2650 -4483 -23986 -25813 -18597 -22039 -32481 -30931 -9649 12745 9359 16908 5914 9400
21533 9400 23105 36386 36386 13801 -16853 -11982 -12002 -9015 15079 26819 -16327 -37215 -45593 -51778
21519 -51778 -40464 -21483 -25991 -35457 4262 20451 20668 10694 3225 3743 -4099 -31622 -36768 -8910
21505 -8910 -6592 2546 -15623 -42827 -31188 -31196 -11036 -29351 -19762 -18260 -10731 22468 -23023 -52478
21491 -52478 -69319 -92849 -85840 -49630 -353 22237 11883 8292 8497 276 -7630 -17972 -38653
21478 -38653 -25544 -24186 -35834 -62878 -23898 -16281 -32332 -24058 1876 5781 -7693 -5107 -6776
21465 -6776 -2572 15256 27703 22197 13849 15117 13702 -7324 -11986 -1004 20155 1131 9277
21452 9277 15762 13659 -518 17288 23020 35928 33641 20552 676 -42959 -55163 -50179 -45686
21439 -45686 -7202 37107 48928 27494 16172 -8031 -28980 1080 17461 29905 30086 -2033
21427 -2033 -4760 -17018 -15553 5688 23808 30960 27114 27959 6344 -4943 15270 -3150 -51753
21414 -51753 -55274 -33789 -839 -21615 -9681 11277 2592 -10700 -24863 -24754 -25228 -32019 -43197
21401 -43197 -43385 -57173 -53338 -60170 -58658 -19149 41441 69832 39820 33639 3510 -18987 -6127
21388 -6127 13737 8753 -7236 -50490 -54025 -37433 -23029 -1214 8434 1707 14334 24807 20351
21375 20351 12577 11815 18952 -9731 -4809 4485 -6712 -18876 954 5529 24732 27492 16851
21362 16851 -2907 -26847 -13186 -30839 -54310 -56810 -54487 -11410 -11955 -30108 -33022 -37228 -13864
21349 -13864 10760 9328 24486 19207 12970 15877 17307 30563 16595 20690 5686 -28362 -4051
21336 -4051 21064 -2563 -27663 -17776 -4334 -23312 -16191 -33578 -34369 -38981 -48601 3080 50398
21323 50398 13215 2408 7045 -6412 -46434 -70289 -60696 -59502 -52733 -31425 -29696 397 -11203
21310 -11203 -30939 -42900 -54519 -62718 -17870 -9147 -34438 -32870 -17666 6238 12738 14819 -339
21297 -339 -26440 -31073 -20731 -7544 -24590 -13628 -24734 -21160 -24963 -22055 -25625 -20408 -837
21284 -837 3828 -27897 -23244 8965 20182 8574 -17561 -32723 -31181 -11118 -31380 -33390 -23284
21271 -23284 -4888 -6660 -14647 16363 -11626 -15493 -10969 -16995 -24627 -26623 -18328 -52677 -32214
21258 -32214 -36707 -37034 -33818 -24608 -40634 -28431 2841 10156 1133 -22679 -52742 -44660 -52343
21245 -52343 -46022 -42647 -2871 -8226 14428 5869 3570 278 -1679 -9871 4102 -7588 5455
21232 5455 10389 31679 39077 28678 12278 2189 -7054 -21839 24197 11838 -34144 -58812
21220 -58812 -30981 -14752 -14302 -2609 17122 23844 18896 33168 4001 -24442 -35184 -25383 2957
21207 2957 25679 35054 -4154 -32036 -39451 -29556 -31819 -14234 -6711 -15745 7928 38266 17778
21194 17778 -13713 -30521 -39104 -50196 -35855 -6594 7735 159 -17209 -13045 -11311 23078
21182 23078 47765 42138 50740 25322 17160 21091 9793 -8634 -7532 -7921 -25331 -42969 -26529
21169 -26529 -1944 -5457 2616 -5130 -6160 -35697 -32060 -15540 -29347 -27179 -17177 -13529 -24140
21156 -24140 -47112 -37889 -31853 -33735 -14853 11794 20484 24940 31827 27424 27232 26046 23935 38568
21142 38568 25221 19959 27103 21751 8218 4200 -1832 -8996 -17884 16774 22437 11016 13746
21129 13746 -11997 -54227 -86827 -93545 -106753 -94824 -83030 -78913 -61894 -68546 -62235 -62124 -49657
21116 -49657 -52781 -16232 -3942 -38977 -45286 -46027 -23647 -17195 -7466 -45807 -47267 -35851 -29213
21103 -29213 -23644 -31780 -17642 -3671 12774 5792 1754 -14363 -6484 36836 30901 -5418 -42149
21090 -42149 -42023 -46954 -52419 -59783 -36254 -14600 -1031 15680 28474 2347 -24164 -9893 -30
21077 -30 9978 7857 5948 -11779 -12359 33552 67371 41207 11010 -13247 -24416 -47610 -30506
21064 -30506 -6514 -17126 -12709 12628 29766 26031 36561 24111 -18225 -12167 34710 27615
21052 27615 -2769 -5139 -3928 11402 13545 2629 17034 28777 35751 22877 -2401 -1164 -15547
21039 -15547 -32757 -31947 -4106 -18692 -3623 -40475 -60619 -43690 -15256 -17889 -23930 -33446 -19645
21026 -19645 3526 16637 62 -10660 4044 -8459 -7743 -8177 -6817 -12212 -17509 -8141 -17436
21013 -17436 -18494 -6152 10849 -16816 -36260 -33603 -3227 23094 31345 18996 30839 35842
21001 35842 21596 6312 -8326 7701 31328 52329 43668 32563 26103 15457 -1576 -17740
20989 -17740 -30369 -31885 -53037 -50098 -34032 751 27193 9462 -10171 -42490 -22657 11576
20977 11576 38916 12192 -14564 -16488 6273 -5450 -16599 -31749 17150 675 -39560 -54617
20965 -54617 -58337 -27607 -5613 4712 7462 19506 38318 37805 8991 -26824 -24090 9054 13664
20952 13664 13136 1134 -7292 15469 51105 61015 48852 20320 10867 21567 7784 7830 46293
20939 46293 55514 50004 47634 26251 -6924 -13546 -22375 -20070 -11459 -14975 -29079 -24693 2064
20926 2064 44243 53215 44073 46715 51311 25090 8387 -4005 -19531 -14644 -8555 19899 12111
20913 12111 -18127 -23234 -13872 -40639 -50240 -39989 -56778 -38875 -15361 19006 18521 -27615 -32789
20900 -32789 -33911 -41028 -42847 -13504 -17090 -112 -12914 -20783 5578 22846 13666 15104 36872
20887 36872 37999 25372 33506 45351 26786 19267 -2567 -32231 -50219 -26317 -4437 -11609
20875 -11609 -3336 4606 10017 -7117 573 14191 21257 -2643 -3650 -7733 -23832 -42765 -20197
20862 -20197 -7163 -16223 -5474 -4587 -3118 10661 32959 10190 -4564 6660 7690 6322 23102
20849 23102 18259 2609 -11824 -43268 -48843 -50843 -38108 -12295 -4216 -17970 -27028 -20138 -26118
20836 -26118 -47171 -28227 10369 33094 19469 -9425 -11826 20402 33397 17504 34041 17973
20824 17973 32859 25988 -4975 -24775 -16036 2406 9188 -5706 -14975 -2412 31614 36366 -17843
20811 -17843 -51417 213 50669 48520 29635 36618 -781 -14126 5732 -8142 -15457 5590
20799 5590 25999 32940 25221 11150 -2248 -6488 -12355 -52342 -16644 7610 14777 23132 -4526
20786 -4526 2654 9972 -12556 -26047 -35437 -11003 -369 5442 -250 -43476 -50916 -42395 -15262
20773 -15262 -12550 -3932 -19103 -21246 -32892 -21961 -14959 -17416 -27940 -15123 16719 27298 11636
20760 11636 386 16567 34845 13410 16837 28789 16968 22798 11743 15576 30764 23335
20748 23335 996 -3714 -9761 -326 3825 1638 -10072 -31215 -7197 14675 -2810 -18615 -25820
20735 -25820 -14028 -7267 -29584 -12020 21737 61437 52327 27476 3985 -7360 -16139 -40491
20723 -40491 -31522 -4929 20249 42592 23525 -7793 -7321 19131 40318 18179 13275 1358
20711 1358 -6362 -30455 -34197 -13860 413 -20126 -24262 8233 5588 -18418 -13303 5658 -15468
20698 -15468 -26176 -8983 6841 6210 1250 7404 -9906 -12469 -20560 -46867 -35932 1005 26461
20685 26461 60621 44475 45972 24785 -4851 -28427 -33413 -24118 -13082 -1560 -13918 -4514
20673 -4514 -433 -29084 -75553 -61735 -9583 20573 6307 3064 3839 26029 40168 25370 707
20660 707 -5380 -15841 -40512 -65658 -69323 -20001 7995 4314 313 17954 9023 -1900 18881
20647 18881 17151 25684 36331 48075 34814 13706 14631 7165 -16212 -36611 -4136 -1476 1595
20634 1595 33645 53612 43052 4982 -16056 -29614 13155 22409 -16048 -37396 -42756 -46197
20622 -46197 -44929 -29049 -25343 -9454 -17303 -19865 -14217 11775 5378 -15729 -34226 -54052 -45814
20609 -45814 -28529 -37026 -55565 -79238 -82416 -56155 -21230 -25318 -30855 -9824 4516 -216 19066
20596 19066 25561 25916 -16978 -11805 -377 -14088 -3890 10993 11888 2935 -2744 -4325 -8612 -33029
20582 -33029 -17672 -6611 14000 11114 -9634 -28248 -60116 -84388 -92948 -59202 -44450 -31103
20570 -31103 -35025 -34719 -39228 -55480 -63422 -60347 -80336 -73626 -64853 -54887 -31622 -5405 9158
20557 9158 -9233 -25763 6454 9077 -4358 -9227 11755 59826 45753 25523 25597 6380 -15608
20544 -15608 -7667 1238 22496 46489 44201 36044 19117 15664 -1573 -6767 -25240 -42523 -44923
20531 -44923 -37824 -39490 -35545 -32718 -13187 -5367 6214 -7413 -14941 -4763 10026 18217 3229
20518 3229 19150 27895 13093 15189 30727 8410 15792 -2186 -20648 -32870 -17699 -26351 -21785
20505 -21785 -48097 -67750 -81589 -50170 -39419 -34919 -24184 -5436 -17425 -22694 -15661 -36137
20493 -36137 -48374 -22577 -32620 -40307 -37199 -30266 -29794 -58 3508 26725 18144 12827 16212
20480 16212 4781 -11602 -14127 -37444 -435 -1921 -22312 -43552 -30401 -5481 6374 5910
20468 5910 1624 -14010 -30265 -35743 -46811 -16950 9243 -10946 -21129 -12140 -11620 -964 -13507
20455 -13507 -1361 -30792 -48392 -55383 -20461 -19217 -46948 -52625 -45017 -47794 -37347 -6732 12552
20442 12552 19885 1478 -31624 -52404 -36540 -21843 -27149 -4585 4036 6126 -14489 -17454 -12344
20429 -12344 12984 -22979 -56432 -34919 -1859 7440 -6818 1771 -827 -23701 -31874 11802
20417 11802 39117 46538 45638 40822 79713 60815 17803 5763 24769 12495 7382 10654 -15205
20404 -15205 -30232 -31290 -33258 -27354 -27976 -30559 -31189 -14607 -20545 -27517 -63810 -55585 -20853 -14096
20390 -14096 -31243 -24825 -13046 12042 -16266 -28498 3077 2725 22130 39530 54982 30559
20378 30559 -795 10963 21893 31716 39857 16744 20628 6561 9619 1425 448 -32687 -61911
20365 -61911 -23508 -1092 -13382 -31528 -40057 -31348 4480 6311 -28645 -20820 9891 6011 -21640
20352 -21640 -36347 -22072 -11570 -3890 15687 24555 28986 29248 24696 10743 6917 12318 -3468
20339 -3468 9761 19570 11371 -11619 -25132 -26009 -53349 -34380 15017 28088 37969 37274 24171
20326 24171 14804 -15653 -9403 12355 -12676 -11570 -3406 1642 190 -8497 -1252 -31449 -24565
20313 -24565 13208 41788 31034 7769 2346 -4207 -5580 -16098 -14167 -9854 6316 37495 29946
20300 29946 30635 18290 19679 14463 -23330 -12321 8211 6241 6051 656 -10158 -7256 -8030 9835
20286 9835 11315 -20434 -48054 -42589 -10790 1877 17198 681 242 5389 -12189 -25947 -21789
20273 -21789 -34901 -45078 -25529 -8949 15296 6855 -1897 -2837 -12690 -22135 -9503 41305 33477
20260 33477 12621 12767 18706 11626 -10015 -7837 -13104 -11465 4157 -3613 434 5657 22934 23251
20246 23251 15787 20708 47112 43593 26245 8373 -24000 -52352 -48997 -40079 -46131 -100685 -98042
20233 -98042 -49892 -46750 -78871 -82431 -45541 -7263 -29062 -35057 -41479 -60194 -24829 -1148
20221 -1148 -36808 -74596 -74344 -45601 -22969 -12700 3985 27562 45868 36675 15066 16794 53665
20208 53665 45131 19850 3765 -4512 -35547 -26895 -10891 -39362 -58911 -47691 -27611 -52187
20196 -52187 -59537 -40015 -21941 -8440 -3911 -33579 -28665 -6445 -21733 -10336 15179 -43165
20184 -43165 -21336 23894 43584 31040 45761 50040 16839 -17317 -45146 -38500 -17994 6407
20172 6407 7236 14389 6947 18528 26619 35452 26740 7214 -11260 -31786 -22005 -20600 -28229 -27531
20158 -27531 -9038 18463 13627 -14008 -9041 24563 19217 213 4442 4484 -28373 -41220 -55108
20145 -55108 -27601 -28417 2206 -9990 -16625 21051 1010 -10491 22044 40614 58359 67331
20133 67331 40359 29155 46418 47286 8012 -30321 -39034 -40760 -20525 -29970 -25971 -38789 -34355
20120 -34355 -6173 -5775 -16368 -6922 -27306 -11589 -21165 -25163 -16522 -2696 28899 34925 57381
20107 57381 47067 33653 5505 2772 1219 11085 12629 -17192 -17841 -27744 -24666 1774 15841
20094 15841 1036 4251 25842 3762 4756 4038 2455 -1969 11952 -3882 -4377 -4019 14891 30979
20080 30979 23638 -10339 -36162 -28822 -6914 -11977 -17527 8341 57200 74259 60170 39457
20068 39457 25894 13890 528 -10201 -7627 11017 31114 25635 13904 -6582 -41962 -16911
20056 -16911 1071 11676 9497 5317 648 8428 6090 23422 33144 43813 24663 3239 -10772
20043 -10772 24763 56160 43913 63293 79051 84883 70938 59681 63745 34983 20761 11955
20031 11955 17329 24960 1371 -15947 -31388 -14478 12988 21810 21444 23872 14700 3564 -11326
20018 -11326 -15863 2718 23789 989 15650 21764 13501 -3688 23155 16256 48505 54105 -4534
20005 -4534 -2909 3519 -1579 -53 6347 19746 14568 23580 49881 79444 117896 95377 31586
19992 31586 5276 6954 56988 88561 55192 14142 -12155 -35710 -5928 8972 449 4017
19980 4017 -4234 2640 13634 12947 -2608 -5962 -4279 824 40776 49378 11897 8374 5904 11807
19966 11807 -5620 -23522 -14051 24257 4809 -5495 8745 4888 10419 8371 -27436 -50208
19954 -50208 -28109 5328 27208 7109 -23886 7981 -8825 -5381 -31538 -44944 11841 47496
19942 47496 41434 13611 13793 25018 1324 7021 32144 30331 8636 -10998 -24640 -25482 -33629
19929 -33629 3858 3279 1228 13448 17315 -5679 -4269 13320 21907 31723 27515 14345 14200 11679
19915 11679 -6796 -20647 -5623 12424 41901 40000 14594 -401 -3221 -7991 -1858 15106
19903 15106 9829 -25403 -3342 30438 64371 42033 24290 24918 12006 -8397 -526 40833
19891 40833 36429 13200 4732 3996 -10311 -18728 -17410 -23113 -20599 -43641 -28435 -47240 -50782
19878 -50782 -29670 -26253 -58425 -36042 -23203 -4230 -638 12473 35736 41970 57678 20590
19866 20590 436 4979 19184 40369 38435 25684 11572 38019 34734 44302 50325 54882 35632
19853 35632 15840 6961 5772 -16757 -22032 -22259 -2637 26796 47086 35280 23273 1267 -515
19840 -515 15532 6582 11058 12965 17804 33350 29367 1098 8964 34158 18067 -6126 -31482
19827 -31482 -31043 1212 -460 -5347 4417 21043 26079 25756 3496 -6370 -5562 -15111 1289 14645
19813 14645 -3839 -15832 10171 13167 -11775 1554 -8641 5538 7727 26092 26453 274
19801 274 -5920 -17689 -21206 -10185 -596 -20957 -35283 -12516 -3599 -26250 -39645 -39011 -31797
19788 -31797 -18357 -31358 -18538 9502 21783 10808 4347 13891 11739 18240 61881 66703 84761
19775 84761 47279 16569 -19723 -48149 -49793 -23064 954 -2482 13269 12519 -2363 -10696 1058
19762 1058 8179 10313 11417 13339 9211 35593 34402 19039 -6010 11398 34036 25437 30882
19749 30882 4673 14805 -276 -9396 -16133 -39828 -41112 -38028 -28464 -15410 838 17051 15327
19736 15327 24638 30346 19283 13222 33401 34796 8255 26157 48767 46323 32450 19830 9102
19723 9102 -7248 -39518 -39316 -31986 -21480 7387 4508 -6330 16417 25689 107 -9948 -15533
19710 -15533 -4986 6984 15218 -3103 -27859 -19342 -32028 -69038 -67442 -38467 -6297 -19608
19698 -19608 -33610 2724 -4512 -28383 -2176 -4603 2824 19101 17105 28307 -3236 -4107 16497
19685 16497 17459 18817 21527 5922 11380 13906 -3414 19142 34385 37613 18629 10973 39958
19672 39958 49400 29261 22461 21582 10284 14923 17747 -13179 -18227 793 31880 14592 7411
19659 7411 -5077 -35798 -19853 27172 26841 -2443 -5966 -5687 -22970 -45595 -37828 -3978 -1138
19646 -1138 -9173 -22062 -54 33543 17145 -1194 -1437 -16664 1208 25051 24567 21506 -10134
19633 -10134 -22908 -37968 -30303 -23218 -18500 -14189 -20378 -13403 -20829 553 9781 3176 5777 33536
19619 33536 -1691 -30823 -29153 10941 21308 15859 7802 1353 -2839 20341 15479 25671 31534
19606 31534 41903 29913 22202 46608 36415 14701 14549 34972 70191 96977 123393 173158
19594 173158 211888 208429 192990 195555 216636 224062 201354 183000 177858 186360 201192 214315
19582 214315 245779 253551 242312 205496 128453 76667 72345 70410 75720 84340 89168 90334 60338
19569 60338 57395 50743 26194 21010 35271 35833 60271 33733 31160 56051 76120 80176 69482
19556 69482 44330 14011 745 38438 55600 31449 68467 97468 81823 50070 67518 134985
19544 134985 181692 216408 226513 215887 246210 242053 223764 199925 182011 219199 248269 241230
19532 241230 226059 220541 179341 117424 86655 52238 27442 9766 15307 -967 15744 23969
19520 23969 22423 6201 8934 7609 -29054 -41365 2066 26596 43912 31632 21840 10780
19508 10780 2940 15179 22712 34035 18961 61705 79344 77570 51957 49925 39747 26031
19496 26031 60411 63134 36443 28228 30674 52454 63775 50392 19161 19625 34636 32635 29516
19483 29516 39631 36112 12691 22906 42156 23230 21278 17881 13259 38622 48971 68670
19471 68670 76613 72653 95548 96697 68571 46071 43936 54527 68976 74624 79788 65696 54455
19458 54455 59188 74619 56392 45583 47746 37194 36011 24845 39982 57354 104028 161862
19446 161862 201256 195220 155426 119851 138290 151290 147043 162675 157077 146971 157539 145736
19434 145736 89830 62237 38256 39459 72335 67903 31687 41845 71847 61158 32625 20984
19422 20984 20541 51185 99262 89393 49576 71089 79135 68902 59384 54752 70542 77501 76915
19409 76915 67365 34570 30540 56138 47386 45494 53079 74447 84353 143989 170203 192978 232664
19396 232664 252982 276161 262052 255096 221534 182126 188330 224969 266082 275172 258697 229820
19384 229820 203079 160535 136695 113667 103479 89920 60099 46791 60850 91552 104909
19373 104909 54491 18484 33630 82683 83498 48944 42766 54024 65320 36931 54702 75811
19361 75811 63142 74414 63440 64653 48115 28306 38054 40083 63026 70563 73429 96313 134154
19348 134154 199607 225057 197746 173287 149814 133074 105053 132771 156975 166615 176316 167447
19336 167447 127286 87282 55894 33215 51210 47900 52856 42816 67286 76344 79133 73545
19324 73545 95362 102729 101741 98665 98256 87273 81758 86325 89204 103634 108776 119128 109420 72260
19310 72260 84927 79724 55448 42271 37746 11723 -6312 -19599 -22899 -40932 -9458 20017
19298 20017 58994 80205 63610 46838 49576 60042 61606 20054 17414 -5390 24092 57725
19286 57725 63317 28908 50930 78163 79899 55484 63974 70651 94536 96306 117497 127887 101154
19273 101154 73308 38789 65097 49039 58503 88426 91107 97741 110294 80989 84299 99476
19261 99476 114478 114792 101408 104929 107432 92693 91131 123537 150196 147455 155923 142558 104922
19248 104922 102264 107404 95831 105612 97033 92736 78357 70051 70077 75490 47522 31071 50792
19235 50792 67827 97964 97881 91217 83371 80362 114700 131060 154648 150924 122528 115630 102782
19222 102782 115490 96186 107438 129499 131168 158589 149685 169880 190803 216841 245331 254507
19210 254507 293292 287466 260559 238734 241122 298456 334971 325818 320954 319191 282539 224717
19198 224717 215422 210792 213650 184075 183171 184441 179411 186215 189628 173084 169660 187589 220798
19185 220798 181734 129299 127352 157731 161428 185151 226561 236897 217513 219984 238738 246003
19173 246003 199354 178982 164008 129975 106867 136333 176482 215652 289801 353820 360480 373279
19161 373279 376024 331005 288619 277810 287346 320898 345006 371687 347417 314260 290471 276989
19149 276989 256654 226226 216697 206479 210844 213969 233966 227999 209615 217642 256742 289051
19137 289051 297752 292028 281221 271076 265879 258373 248282 254498 287541 303412 297473 287178 271075
19124 271075 247694 265736 284516 280365 283184 303817 303000 334314 365056 329715 297062 303331
19112 303331 295650 284328 300901 301645 301698 293779 304381 322717 320117 310609 324618 345481 389432
19099 389432 436005 467447 483540 518448 584585 650678 690983 756974 861513 952339 1030482
19088 1030482 1119558 1218736 1300173 1360322 1451801 1558622 1669484 1797634 1970403 2196841
19078 2196841 2491003 2920418 3477176 4325389 5696397 7863495 11315820 16820501 23943522
19069 23943522 29014243 30143414 30628242 32314118 31721214 27820850 24535664 25299232
19061 25299232 30068933 34357406 33867725 31411759 31473204 31717644 27298848 19756728 13341115
19052 13341115 9304317 6925232 5487195 4545413 3906139 3463647 3155395 2985010 2915993
19043 2915993 2851695 2761055 2743068 2783822 2821983 2841030 2827166 2833493 2873959 2945053 3023154
19032 3023154 3155833 3323598 3587914 4003291 4539260 5307597 6554893 8539072 11659390
19023 11659390 16704474 24491139 33585707 39208197 40625066 41997959 42732749 39119512
19015 39119512 33482965 31072523 34234969 41470281 46415421 45504031 43444768 43311748
19007 43311748 40029192 31234497 21510790 14597691 10363989 7822743 6189102 5108926
18999 5108926 4305682 3662799 3224102 2935959 2736819 2539914 2341097 2217424 2158680 2093449
18989 2093449 1952846 1813600 1691908 1565438 1402708 1342121 1289357 1247580 1151140 1096050
18979 1096050 1066917 1029787 985797 985349 987227 1000777 984075 982517 951934 956128 988409 1012360
18967 1012360 1018236 968066 911006 883468 871793 818254 806219 825381 843363 864893 905343
18956 905343 883273 830378 827679 851696 879325 900807 915129 999611 1063193 1052171 1028384 1066999
18944 1066999 1098308 1180279 1296029 1464750 1704979 2025018 2562045 3391296 4652443 6702330
18934 6702330 10051694 14775411 18478123 17912287 14112604 10468301 8481645 7976114
18926 7976114 8786097 11120875 15084913 19019025 19056422 14935192 10182301 6919149 5018524
18917 5018524 3872495 3128262 2595124 2216305 1981338 1871133 1860373 1919318 1958963 1977839
18907 1977839 1925468 1809747 1745222 1736635 1814179 1922305 2065414 2226781 2318630 2386878 2460315
18896 2460315 2546028 2676381 2908859 3276393 3834150 4657776 5866632 7718525 10587838
18887 10587838 15106545 22473439 33964250 47545410 53621711 46887613 34784576 25666777
18879 25666777 21302841 20737954 23706132 30681337 41230055 49136369 46013988 34351744
18871 34351744 22876473 15351946 10975286 8320855 6558553 5304003 4410873 3770627
18863 3770627 3349853 3128992 3046132 3048315 3015257 2889325 2695537 2524387 2409981 2347975
18853 2347975 2344131 2436489 2564056 2686351 2758443 2783102 2777035 2801530 2936836 3217739 3694639
18842 3694639 4413435 5541634 7248665 9947404 14290638 21213381 31171837 40073421
18834 40073421 40306758 32290584 23334266 17647186 15269742 15520364 18340118 24079359
18826 24079359 31741777 35643647 31421599 22808687 15388474 10654437 7805241 6092835
18818 6092835 5049440 4360553 3923536 3608463 3449600 3262628 2974967 2736468 2578676
18809 2578676 2369680 2078494 1852407 1711196 1688129 1718381 1729313 1700106 1657748 1552788
18799 1552788 1376397 1232492 1107224 971471 897200 861824 837177 817283 795137 792634 808415
18788 808415 826093 894309 985963 1052112 1016787 949475 882432 868229 916788 995744 1112932
18777 1112932 1233089 1367152 1453863 1609585 1975748 2259804 2215372 2007096 1802583 1642403
18767 1642403 1591047 1639442 1693827 1752533 1941573 2186048 2320599 2199756 1952937 1707844
18757 1707844 1524171 1395319 1324699 1314104 1337885 1366685 1440367 1598658 1867791 2124511
18747 2124511 2257176 2249803 2185874 2153384 2240575 2442048 2714598 3069364 3486279 3952694
18737 3952694 4464381 5069246 6096024 7778967 10446385 14796601 21732234 30855777
18729 30855777 36818584 34471890 27121438 20929586 18131455 18563993 22234843 29567515
18721 29567515 38575309 41774043 35266072 24692670 16275531 11118371 8066073 6205169
18713 6205169 5008803 4245903 3783382 3471994 3212486 3010005 2845451 2750956 2742782 2746004
18703 2746004 2748432 2815425 2985076 3126429 3259950 3534690 3963155 4297934 4329548 4145901
18693 4145901 3968051 3906838 4032336 4350257 4929241 5952664 7503631 9628364 12503303
18684 12503303 16690702 23445253 34095835 46238288 50675572 43789692 33224787 26168252
18676 26168252 23896935 25926558 32530842 43441021 52531304 50135331 37862226 25166404
18668 25166404 16603460 11504905 8399667 6463542 5219416 4356457 3753261 3290883
18660 3290883 2968986 2731838 2569491 2466274 2358612 2222013 2085233 2024516 2007470 1977332
18650 1977332 1927964 1893429 1856542 1823167 1790401 1782451 1844695 1950728 2039884 2118358 2282748
18639 2282748 2567820 3043767 3775593 4930980 6846018 10008610 14729231 19090216 19284157
18630 19284157 15555029 11620286 9433409 9029263 10255097 13255139 17207200 18764700
18622 18764700 15958397 11242567 7499075 5199904 3787796 2870760 2262540 1854058
18614 1854058 1583093 1398849 1294896 1275998 1268247 1230210 1164897 1087913 1008086 946116 873687
18603 873687 844902 845204 851425 838873 813511 764540 712044 696932 664457 637208 622036 547229
18591 547229 471336 421436 419616 441090 453448 464505 489582 504746 555763 593919 627330 629931
18579 629931 630660 657399 731016 828424 981302 1162937 1237135 1213903 1136358 1033626 925495
18568 925495 855609 808527 816528 940151 1078865 1184810 1184190 1131175 1088421 1030009 944621
18557 944621 819441 721758 644098 578220 589846 610045 606260 590670 619396 646290 671901
18546 671901 716055 749212 723436 690921 732840 813459 915732 1040597 1159667 1220180 1188164
18535 1188164 1138546 1161868 1225789 1322650 1518513 1782861 2161171 2577669 2794084 2732270
18525 2732270 2511614 2324911 2186180 2125421 2177738 2376711 2704320 3056157 3318554 3406319
18515 3406319 3352432 3246152 3230854 3415106 3790480 4409700 5392569 6930016 9245411
18506 9245411 12718342 18159100 26417432 36064090 42042912 43022635 43880168 46134840
18498 46134840 44961964 39912670 36539957 38409046 43004154 44620735 42979997 41650657
18490 41650657 39108521 32104903 23021804 15886841 11569360 9088545 7525242 6418775
18482 6418775 5637890 5222353 5102282 5125047 5022353 4712846 4302467 3925936 3694362 3600346
18472 3600346 3566315 3593335 3673276 3725798 3731486 3791826 3939933 4067656 4117966 4263441 4641926
18461 4641926 5340335 6341278 7645204 9384425 12175456 16929908 24069235 31071341
18453 31071341 33611604 33008130 34070805 36663405 35882248 32023234 30188652 32464947
18445 32464947 35242377 34808410 33013967 32537902 30682826 24847271 17536209 11996521
18437 11996521 8680068 6780128 5694693 5007148 4578459 4269568 3930392 3608198 3436571
18428 3436571 3261447 2979467 2694841 2618603 2633377 2582770 2457813 2273309 2108305 1981187
18418 1981187 1906111 1935227 2048118 2115939 2154071 2145661 2046386 1929275 1790905 1546804 1260513
18407 1260513 1061783 918649 837698 802569 815197 842730 845846 869837 912184 918797 870993
18396 870993 767787 676501 646223 638203 689835 797665 914269 1033051 1065711 950601 782373
18385 782373 627576 543747 527272 558295 597792 679477 759584 785410 712002 615366 552813
18374 552813 523695 542756 629920 729532 807758 811485 739152 629060 518845 425209 393928
18363 393928 405540 418273 481643 517520 526323 481281 430998 383780 317235 275881 284659 328407
18351 328407 370060 353300 321923 296406 306979 320879 330997 354340 384723 409406 406039 374275
18339 374275 338453 319339 272240 242743 236032 211808 195561 195515 203651 206748 223444 212399 191971
18326 191971 178436 183903 188467 259564 319783 316204 283434 242565 197230 156387 136159 139719
18314 139719 209262 293118 327483 317684 321604 351008 382054 385623 356904 310373 279250 271365
18302 271365 303151 344796 374329 362261 349604 315920 319127 341364 360230 365338 317881 263714
18290 263714 210174 184707 183940 228939 255353 262563 274114 304337 310265 298759 281384 269660
18278 269660 276432 295975 318772 291392 254372 280918 286420 278933 245203 202697 179417 182018
18266 182018 202647 227124 228727 204409 195152 188587 181809 183806 209503 180320 155406 144950
18254 144950 140712 137071 142605 146154 144724 176921 229589 321195 371891 336357 294003 238614
18242 238614 192161 175713 194965 214121 232420 253853 293165 341217 389590 412821 358301
18231 358301 322056 334891 386327 438601 502720 576370 674900 761011 842022 916467 961820
18220 961820 1003633 1044209 1110428 1173764 1205882 1153673 1057718 992354 979493 1001459 1044376
18209 1044376 1082263 1041932 979551 969270 954579 920478 881226 822086 762479 716491 673015
18198 673015 650496 617597 513168 428456 373995 356842 337290 342442 362511 383357 376270 327831
18186 327831 332205 337470 278151 238276 252510 288136 319707 341202 349515 373905 381855 379500
18174 379500 405861 427431 454556 469706 448411 401430 378635 377424 356912 364558 381736 405102
18162 405102 412581 470615 502345 507339 504161 526409 538337 518738 469389 436038 461067 499019
18150 499019 534880 546322 499473 433158 380550 362116 362966 377173 399429 384950 369864 376063
18138 376063 378495 392740 409633 441243 450918 437163 462347 493739 530475 577796 592624 606320
18126 606320 642552 729909 798552 917112 1102177 1294438 1522375 1817541 2139104 2579150
18116 2579150 3190950 4093890 5492192 7779442 11580710 18138777 29862082 49655008
18108 49655008 71170390 72853483 53248403 31808081 18652714 11827692 8100149
18101 8100149 5903216 4497126 3536698 2818275 2276073 1907613 1599899 1376400 1212347
18092 1212347 1079507 976302 882513 797230 684483 604901 555161 524963 475677 423266 399856
18081 399856 370208 346497 337739 323150 281414 252629 225537 210400 206162 214604 212231 184038
18069 184038 171421 200671 217149 193894 189014 149487 83135 76826 86284 49063 33787 43579
18057 43579 46135 33559 23747 25369 58217 69455 64605 39480 55480 74117 51235 51704 40435
18044 40435 33686 41518 61643 72580 86417 84170 53773 39271 58078 87953 124322 105313
18032 105313 75076 75607 60926 43723 29745 25651 22964 42725 66098 78676 72512 46059
18020 46059 26283 22536 -3938 17984 24625 -9187 10233 16116 15222 26961 38575 27891 -5928
18007 -5928 9083 56159 83705 83411 32841 9830 23455 22686 9742 14144 7690 -1303 32281
17994 32281 18317 -3234 -24093 -24567 -8394 5753 30784 28964 53864 59549 78922 95497
17982 95497 162834 215031 230151 241755 238807 213131 191944 179822 180248 211606 243664 223076
17970 223076 189467 161831 117320 75156 32959 29116 27883 19034 8341 11933 33988 11167
17958 11167 13986 21941 54483 22345 -3885 -24402 -11022 -20815 -7207 38101 60899 55959
17946 55959 60697 51171 39221 41123 33401 18087 -3636 -16560 -29773 -13449 41091 68945
17934 68945 100970 175848 206053 220737 191880 153200 150069 168539 172852 180137 176367 180506 174656
17921 174656 159616 159343 134233 92769 63927 35315 39762 51083 24463 2462 -17454 11767
17909 11767 45451 38806 36971 8294 -3739 -1094 19194 45706 66370 52292 41183 22756
17897 22756 38319 42307 12768 -30654 -18251 8254 7914 32499 48624 35301 1308 20984
17885 20984 50198 51532 59027 36008 22521 2586 -171 12632 22597 15492 -8216 8431 10723
17872 10723 4160 258 20141 14223 10159 34385 41008 41146 33849 -1566 -2682 34587 62173
17859 62173 51910 18633 -17085 -32832 -17338 -10655 -26663 -13677 -4238 -25463 -11980 14268
17847 14268 18622 42791 48533 48430 60265 37544 16390 -7842 -25943 -11421 -13694 20827 23308
17834 23308 25240 -11137 -31650 -18645 -24205 21841 55168 37591 31486 34922 13797 8124 46144
17821 46144 67974 61713 54421 79150 105834 150673 197651 234416 287587 361387 440865 494908
17809 494908 520442 548784 564927 591476 544829 469720 370577 305856 228022 157183 98480
17798 98480 94889 100890 93241 52515 -657 -21578 -11597 -28348 6343 21955 36416 44219 70896
17785 70896 67109 46480 50879 18785 22264 47603 52743 37308 2914 9722 15294 7017 5390
17772 5390 -2709 7932 -7431 -7080 -4901 -4687 -8337 860 45814 62247 67231 51716 39885 27506
17758 27506 33990 38635 90510 126950 96457 29055 23844 28224 9910 24828 40368 27719
17746 27719 26431 21773 32010 47108 58443 46067 32560 53666 66507 8052 -20843 -17597
17734 -17597 -13042 -175 9794 3500 3808 3644 11087 18891 26974 1632 -6486 -8728 -4364 19630
17720 19630 40338 -1733 -32355 -6147 5049 10951 -3168 -3746 -4964 -1083 20247 29781 23895
17707 23895 17343 -1958 9566 12282 15816 12295 7373 5555 8689 13108 -2050 -13561 -17234
17694 -17234 -2274 3985 9962 -6250 -31076 -27404 -28285 -14396 2755 -4643 -6520 -15276 -17883
17681 -17883 -11604 -23273 -24287 10371 9814 29794 -6095 -13894 15332 37898 36641 26436 4031
17668 4031 -9843 -12290 -37359 -38294 -5566 -21162 -46699 -28130 1942 23524 29569 26653 35607
17655 35607 54170 71837 75918 54323 16047 -10746 -12917 4198 -8379 2363 23562 25210
17643 25210 30547 8545 2461 2452 -27362 -50209 -26509 -15180 -4809 -16798 -24908 -21298 -10623
17630 -10623 9696 -9817 -13904 -10803 -18825 -1828 2796 -15504 9820 31915 -9232 -40381
17618 -40381 -29013 -25612 -41583 -58095 -49418 -51884 -62176 -21684 -862 -8028 -14519 -16507 -21644
17605 -21644 -54761 -46742 -17729 17556 18602 -7973 -27358 -17685 -12143 6677 -39407 -45192 -31804
17592 -31804 -40848 -41051 -55987 -56118 -28273 29479 10494 -4223 17890 17287 6474 -1209 -9166
17579 -9166 -5718 -3568 -2195 7880 27919 33926 53891 22665 11266 -30581 -26476 -13835 -8400
17566 -8400 6415 22590 32476 28845 -9574 -15054 -8243 -3274 10078 -31481 -41408 -40382 -12580
17553 -12580 25457 31659 28971 45710 9470 22671 62004 80515 36136 24150 6408 -1010
17541 -1010 22454 14791 12049 31954 22154 15159 14992 23164 15571 5745 11043 25988 -5894 17512
17527 17512 53407 48793 34675 19978 -1116 10314 4647 -324 33773 56794 36023 43007
17515 43007 27349 10592 7427 9523 28731 26265 29382 26458 -4418 -37152 -5813 16180 20874
17502 20874 -10744 -2378 39952 63766 79802 55034 49060 59846 60941 91729 118214 135979
17490 135979 110388 96359 84225 53833 51252 39495 36492 7262 -23387 -26732 -30979 -33615
17478 -33615 -17278 -925 -2955 6192 -7915 -4345 -12197 8087 -10087 -45037 -35113 1604 7301
17465 7301 -17203 -20060 -2562 -9827 -35091 19 5040 20603 27556 10214 7055 7141 25509
17452 25509 60660 48244 6767 -268 25285 33062 40090 52935 101019 200911 329832 408657
17440 408657 383436 259072 171334 116929 84387 46418 15894 16423 26897 23774 15328 8385
17428 8385 6135 2372 28589 51670 57326 50112 57275 65763 49780 60731 51741 31617 23069
17415 23069 9076 6605 -5641 4619 -12826 8152 63947 90393 57857 25301 7238 -5357
17403 -5357 20871 41767 74319 57949 35969 18452 18147 13046 25897 14003 15689 718 987
17390 987 17192 6724 13024 40415 72331 81547 61133 71129 69359 88464 108996 76884 38540
17377 38540 52277 48669 32490 46528 47914 78632 123545 145894 131799 97422 111692 148104
17365 148104 147752 177898 169445 163003 180834 174315 130415 129170 118115 132720 108056 75654 78994
17352 78994 74658 51807 48602 44638 37214 59875 75456 47330 29580 66957 85828 55563
17340 55563 -3839 -3990 19857 39049 51520 78080 90583 68748 47141 41657 80924 105017
17328 105017 88061 77766 94107 110804 132053 140581 131087 118004 148746 158212 146701 128425
17316 128425 112860 105751 89212 114769 121270 123970 102229 98858 109493 120209 150859 168371
17304 168371 161632 123974 118147 143067 151898 150136 165141 185262 188868 185363 207647 228784 245562
17291 245562 236714 224767 254424 263209 262135 255643 264985 274614 321107 392105 411051 419999 451807
17278 451807 463561 477334 460759 489618 536077 553669 589907 639775 685041 734606 796516
17267 796516 890466 1016299 1161529 1302065 1446463 1613150 1798003 1964304 2130926 2304048
17257 2304048 2522307 2737510 2964027 3251184 3645670 4163002 4821055 5645165 6760595
17248 6760595 8305550 10577486 14006545 19226339 26974013 37529777 49731054 62429556
17240 62429556 76904740 93340712 106000415 110371929 110467578 109881425 104075989 90491192
17232 90491192 74172837 59538069 46487792 34599937 24898723 17975041 13420533
17225 13420533 10487422 8526381 7129076 6132257 5379473 4744746 4242251 3806838 3446930
17216 3446930 3143327 2850276 2644968 2493663 2345269 2174482 2013664 1870683 1737243
17207 1737243 1558480 1394257 1254385 1133803 1022285 938357 872045 829050 801300 801859 799440
17196 799440 841536 855783 817491 782563 756837 744765 677314 604549 539777 475685 424579
17185 424579 411968 389353 377385 331008 282741 289824 311060 295105 275214 247391 205702 189909
17173 189909 221234 239211 197606 193827 198897 202485 163688 99845 114294 127895 159415 188968
17161 188968 183915 191762 184987 178832 151387 117030 101394 116533 107815 100266 86263 73530 73422
17148 73422 110632 121518 120517 119593 109000 90057 98171 91063 49974 47557 70526 68099 65909
17135 65909 49219 37363 55067 73694 80592 65233 70291 69159 59904 39499 19170 45997
17123 45997 67428 60216 59943 47161 48169 61431 79006 110640 138283 116050 98167 77715
17111 77715 63890 68411 56583 32221 38324 55499 68810 72302 63462 70188 76669 96153 100204
17098 100204 52265 37430 71495 89923 113786 94233 48758 15105 -1668 -10057 -4469 6618
17086 6618 19720 50553 66909 73006 31299 19346 46159 89329 80319 51752 29667 12686
17074 12686 5076 -23885 -12073 21427 64379 90434 77369 96026 92574 68745 72030 87311
17062 87311 84407 83393 73844 60651 49880 61726 41705 35060 59922 84869 69366 38252
17050 38252 20750 40944 66313 69784 57011 66648 60643 51770 40385 26100 8901 -524 5293
17037 5293 -23586 -21626 -10908 5324 -966 12802 45301 45932 12368 7383 12291 -4338 -13078
17024 -13078 -22221 -8069 -2724 12201 59867 107162 107127 105452 63012 65818 103237 127573 136593
17011 136593 123917 70482 24374 -11738 -18884 -32284 -45765 -38220 -31912 -11217 -4093 10915
16999 10915 17266 5281 14101 51817 73845 61423 40455 20929 -1464 -2769 7709 16013
16987 16013 13796 -8841 -19827 -30191 -25815 -31846 -4719 -2861 9532 -23011 -44046 -28944
16975 -28944 -34920 -39462 -11714 15123 4785 232 23978 60756 55837 1856 -1582 -15271 -17836
16962 -17836 17357 43221 -10843 -8395 6867 4894 -14813 -17111 -32125 -46881 -34863 -10315
16950 -10315 12510 3348 1092 21557 38030 45462 50428 63830 33168 5572 -3137 388 -5034
16937 -5034 8785 56292 45397 23726 17761 28462 36762 24574 6712 30572 32756 60756
16925 60756 50811 -14804 -39726 -28942 -12181 -25419 -45872 -46563 -63507 -84482 -64671 -35522
16913 -35522 -14874 1492 16113 2701 14122 43533 52230 44941 60614 41370 32469 34109
16901 34109 44199 34095 37343 20831 33267 15583 -11197 -24747 -45141 -29175 -22415 -22689
16889 -22689 -13756 -17293 14139 22123 26775 -16482 -33959 -20817 927 3433 15601 2603 -38853
16876 -38853 -31439 17876 -10901 -40268 -41224 -5786 7928 4414 15532 37944 14977 -13006
16864 -13006 -1179 824 -33143 -50142 -15960 1706 855 6513 -32941 -55666 -40099 -36033 -29926
16851 -29926 -15862 13051 9093 18932 24126 -4537 -11886 -1129 -38446 -59083 -32272 3469
16839 3469 5089 -7079 -9716 -27852 -15644 -28201 -26144 -38494 -49151 -61418 -51563 -24736 -31548
16826 -31548 -49519 -51583 -30846 -1592 -31387 -33812 -31828 -38520 -40610 -16850 26962 47666 33618
16813 33618 7273 3717 653 -198 11893 10994 5573 2079 -375 -19510 -50701 -75537 -54956
16800 -54956 -10784 10529 20478 36915 33942 27964 -14141 -32805 -13071 -4983 -853 -22126 -36438
16787 -36438 -19108 -15586 4772 12342 16213 -16910 922 14029 16411 -2610 -26801 -36409 -49182
16774 -49182 -43516 -52741 -47961 -15872 -6941 -14856 -968 6278 -5884 -21067 -26568 -10047 18151
16761 18151 -11633 -22501 -5433 -790 -22067 -26421 -324 9003 -4409 10913 62669 41626
16749 41626 12768 13525 22811 -11943 -32637 -73486 -51194 18689 21171 -3844 -12253 -11480 -6942
16736 -6942 -17337 -40474 -77903 -85499 -42300 -32868 -21438 -11928 -1380 961 -14319 -14448 -31587
16723 -31587 -39927 -23095 -7340 -20899 -29634 -17286 -47795 -49734 -63169 -52956 -32991 -10347
16711 -10347 -29619 -36216 -31184 -49151 -23001 -7272 -27897 -19054 1591 18822 27031 15953
16699 15953 16255 19703 17169 5701 -15490 -36717 -40343 -27430 -5966 -2224 -14485 -10052 842
16686 842 -2470 -22510 -17963 -11308 -8767 6182 23382 24433 17875 21678 34252 30257 22698 36725
16672 36725 16382 2702 -7903 -2964 31286 45720 82106 162663 250282 347716 430512 496483
16660 496483 536698 551903 545666 539405 514668 443710 408043 340724 277405 197243 135599 100301
16648 100301 61585 67655 31205 5552 6377 26842 37116 37336 26485 -4720 -42779 -43119 -27968
16635 -27968 2147 26682 14330 8527 -5246 -12910 -13323 -11557 -15101 -21004 -16585 -38371 -11903
16622 -11903 -2371 -21183 -8555 -29620 -41068 -38259 -34959 -25145 -347 -4077 -2212 -8586 -24953
16609 -24953 -41115 -28395 769 20866 16481 -18559 -25692 -24674 -11692 -14212 7704 38384
16597 38384 29631 31820 29314 22154 8947 -10892 -8314 4073 8246 24820 4633 -19987 -12283
16584 -12283 3955 17669 -31267 -47094 -47673 -11437 31109 37057 11292 -17013 -12025 -31452
16572 -31452 -34491 -36340 -51751 -23206 -7230 -16701 -31153 -30574 -33388 -66660 -90991 -96930 -59937
16559 -59937 -37394 -45567 -51712 -53266 -30485 -14341 22673 29710 33999 45765 77413 93879 93687
16546 93687 75520 49471 28182 38210 21453 9169 22955 14209 -10165 -21796 -16627 748
16534 748 -25403 -42998 -34932 -35608 -48182 -43374 -26229 -28966 -49920 -42282 -45688 -51288 -47830 -30188
16520 -30188 -20232 -39166 -50913 -35696 -32025 -35987 -30700 -2494 -3968 15025 14560 -1072 -7030
16507 -7030 32464 55270 53934 30352 7675 7023 -5179 3581 18130 31525 32005 10186 -13012
16494 -13012 -28302 -30758 -19669 -3149 -23963 -52443 -68514 -50384 -32954 -59917 -83875 -61120
16482 -61120 -47552 5462 -1396 -14204 -24893 -26717 -42505 -38970 -37214 -50971 -65659 -50435
16470 -50435 -33026 -53810 -41561 -16336 -22933 -51859 -66429 -58240 -59366 -64755 -57905 -40794 -44364
16457 -44364 -23103 -21264 -8925 12834 -12331 -38988 -27176 -19711 -26270 -26783 -29945 -36583 -33264
16444 -33264 -34865 -21914 -9158 -25748 -45905 -45300 -24748 -15844 -3209 1430 -1846 -31411 -21802
16431 -21802 -19808 -26623 -6497 -3517 -24154 -17056 -16870 -31360 -43242 -28990 -12798 -28056 -45196
16418 -45196 -45029 2393 22103 -12748 -24162 -5220 -16381 -47339 -76721 -68783 -67851 -77906 -82319
16405 -82319 -86407 -72646 -58804 -49986 -41836 -31375 -3032 5829 6458 -3618 -41884 -45901 -27456
16392 -27456 -12116 -9573 -29757 -50087 -46349 -24347 -37709 -53976 -50499 -31692 -35549 -27308 -33901
16379 -33901 -54309 -39265 -6576 -20577 -64871 -57531 -36004 -13265 -9876 24296 29467 37464
16367 37464 39737 40295 39307 51010 26158 16699 -1619 -41571 -38643 -6882 9700 9903 25369
16354 25369 27643 -6028 -11142 -20317 -1140 -28272 -1412 26320 48738 56246 38144 8977
16342 8977 -17605 -33699 -39953 -20225 -9672 7830 30307 -2303 -27012 -44831 -36197 -19960
16330 -19960 -29160 -33698 -21487 15357 29914 10134 -9603 6017 10549 -4226 -5489 -13219 -1065
16317 -1065 17913 -2850 652 5079 -3353 -23922 -19131 -30490 -62349 -72068 -46958 -22203 19996
16304 19996 18545 17396 9467 6277 7667 24983 16782 -2497 12146 20823 2691 -35644 -46918
16291 -46918 -24178 -38584 -20121 -15599 -33058 -68825 -35519 -4450 5184 47330 58359 44058
16279 44058 594 -1906 -18128 -9805 -11633 -24910 -31918 -26875 -15736 -32700 -17109 -7186 1306
16266 1306 -2253 9086 13206 -17155 1243 5637 -554 -7223 -15152 9589 12884 18860 33497
16253 33497 15342 17329 733 -36390 -71573 -45299 -3535 -9070 -10799 -43378 -61800 -36855
16241 -36855 -19664 -27246 69 25808 37808 28535 26283 45648 59920 75936 39932 26646
16229 26646 12927 12936 7805 6897 19861 42499 36711 38354 39184 45741 33549 19079 -1769 -11503
16215 -11503 -17017 21369 11896 -5815 -14329 -35773 -21807 10839 18096 27753 27907 17455 -8829
16202 -8829 -6242 -19628 -22971 4104 49 -38715 -63524 -36442 -45133 -27234 -24496 -24097 -12869
16189 -12869 -55206 -72071 -71980 -57863 -40674 -29714 -28838 -32916 -5845 17004 43165 45175 9365
16176 9365 2174 -3159 -15491 -22538 -13193 11028 17662 -15305 -6716 21918 23494 15192 8489 2375
16162 2375 -32233 -26675 20046 46355 19723 -5606 -18959 -2099 -6828 -2619 -10820 -18326 -20595
16149 -20595 8965 16574 -19018 -42352 -43464 -23791 -29100 -10710 26259 19328 6240 13981 -3634
16136 -3634 -23885 -15326 -28380 -42115 -35680 -13648 -25879 -60491 -54208 -26567 -49668 -17709
16124 -17709 17037 32314 4527 8134 20765 25264 35629 37906 19416 28899 35211 21329 11203
16111 11203 -18638 -36354 -54887 -38893 -17528 -20892 -5701 16446 11376 45086 32985 4563
16099 4563 -4279 -15415 -47117 -79455 -104997 -61264 -11760 10630 -7534 9907 28855 28615
16087 28615 28148 -243 -29652 -43626 -31523 -19250 5915 23467 21066 38187 34488 7467
16075 7467 4770 -26504 -33206 -10876 -2693 -1206 -17442 -14302 -7422 6817 -233 -19693 -25403
16062 -25403 2589 2810 -1799 -24506 -17519 -26817 -17648 -3592 12814 29280 38359 21883 21091
16049 21091 4147 -20222 -19274 -31718 -39576 -40954 -40968 -45808 -34787 14687 35050 -4250 -8801
16036 -8801 -8269 -12250 -34866 -42206 -22626 -27058 -31751 -23072 4867 5062 5456 13523 20120 29205 18694
16021 18694 -15761 -35106 -22599 -30568 -31063 -24801 -51601 -72045 -43223 -46498 -42185 -49218 -23034
16008 -23034 -4661 -830 -35622 -67542 -65928 -40451 -23078 -18364 -22148 -27475 -5612 -9744 -7136
15995 -7136 7665 -3353 -29984 -36105 -22357 -23669 -6172 11689 5673 -5140 8078 10185 10723
15982 10723 -6493 -2442 41162 38498 26616 30317 43495 14697 -2367 -8605 -5020 -13432 -5012
15969 -5012 -23736 -26641 -10111 2266 -12864 -32892 -23859 -6048 -4958 9013 2404 11349 -1126
15956 -1126 -28164 -48543 -34455 -21364 -14340 -16268 -1728 26357 30600 46300 69635 80178
15944 80178 65074 43099 30675 2159 -21655 -53288 -63753 -67362 -59530 -31354 -29060 -32375
15932 -32375 -6550 20482 29419 17923 3936 20328 19873 15298 17567 -11191 -26163 -27150 -9596
15919 -9596 -14341 -16073 -37788 -28682 -34922 -29026 -17920 -20492 -5299 47405 41179 -5769 -9003
15906 -9003 36434 50825 47298 66893 48715 38095 35952 29889 15030 -8060 -15691 -13940 -8042
15893 -8042 -22460 -4568 14962 -1252 -3552 27083 12472 17833 61133 67737 41360 26722
15881 26722 -6362 -24294 6872 37132 29336 2458 -9814 -15886 -4051 9059 14826 23348
15869 23348 32647 6860 -3404 -19759 -1721 -26278 -36855 -22145 -11726 -27345 -45797 -44123
15857 -44123 -38908 -35990 -43349 -15478 -2797 2193 9925 -19677 -18913 1229 4413 12291 -8962
15844 -8962 -15151 12219 16673 -6828 4358 7436 9668 11663 25056 27395 1321 8825 3054
15831 3054 8823 -9352 -3568 -1391 -24921 -40015 -45495 -52939 -26274 -24999 -20924 755 -5506
15818 -5506 -3383 -22306 -17461 588 21115 17548 7767 -9758 -38779 -67674 -63012 -34721 -16157
15805 -16157 -34483 -38529 3315 37784 24046 -3795 -47474 -61471 -34058 940 18652 9704
15793 9704 18425 38962 46355 13796 -6729 -11994 -16749 -23296 -28846 -15232 3436 -13808 -40524
15780 -40524 -37289 -27554 -43200 -53838 -50263 -19542 9099 10188 27988 38646 8072 -9292
15768 -9292 -12662 12735 -17535 -31079 -32009 -22830 -11329 -4667 -17056 -10552 3815 11612 -5961
15755 -5961 -13562 -22050 -27248 -9317 22020 27119 15291 13537 15710 26746 16107 30703 20916
15742 20916 -22462 -56695 -41739 -46843 -62614 -31289 -12314 -9254 1914 -9260 -28069 -48080
15730 -48080 -25968 28920 45149 15359 -26511 -5605 16054 5723 17776 3638 -18994 -11671
15718 -11671 6357 -1890 -26373 -28988 16132 25037 63755 65598 57013 49692 15839 12816 22316
15705 22316 21701 15528 7034 -12987 -2346 10727 -1054 4419 15733 22153 35626 4285 -39184
15692 -39184 -43764 -23322 -1094 -9708 -4617 10880 27531 13693 12847 20669 7153 -5533 -24657
15679 -24657 -17413 -13011 -13237 -8340 -6672 -23057 -37767 -41573 -20321 19996 17282 -9351 -7723
15666 -7723 -2414 21370 12432 -5726 -25334 -8873 16722 4651 -19442 -26447 -45413 -37910 -36870
15653 -36870 -28131 -25469 -34278 -14389 12841 6121 -22231 -32380 -3810 -9715 -32029 -25650 349
15640 349 27863 47767 54638 35717 -1453 971 11937 8450 -16453 -26983 -36017 -21635 5944
15627 5944 14954 22261 2750 6040 13342 -1161 -33766 -41842 -33293 -32563 -11730 -9254 -19459 -11255
15613 -11255 18164 -5393 -35893 -34001 -19036 -24303 -2776 -12418 -2505 -15948 -2424 3853 -4603
15600 -4603 -10995 -13503 -21190 -48731 -79693 -55943 -29454 -33261 -37217 -43720 -18558 -918 -17620
15587 -17620 -27994 -4672 -8652 -19702 -9657 532 5343 -11203 -9676 360 -3283 -30293
15575 -30293 -43585 -47540 -25965 7884 19189 43652 26333 28940 23104 7005 -282 13356
15563 13356 13465 33650 48296 34434 32971 24328 7366 9148 30878 35429 23061 42879 43358
15550 43358 21329 28302 25058 41484 41575 8034 -3524 5247 9300 10044 10109 40585 40544 23820 21450
15535 21450 38414 32649 11145 24260 32086 18205 12091 -20134 -55030 -24862 14149 8117
15523 8117 -10216 -11503 -7224 -12060 -4705 27235 21986 -10700 3356 -4204 2991 9366 4911 -5356
15509 -5356 9037 32105 25523 10874 1486 -22782 -21490 -15873 -11348 -16121 -2362 7438 -12760
15496 -12760 -16249 -14977 -24819 -26062 -36382 -45966 -56842 -50963 -53665 -26430 -7449 17123 -18676
15483 -18676 -6145 9395 -3320 -29394 -27515 -4807 20732 11685 21104 33452 40211 30253 31732
15470 31732 36475 42570 24600 24381 -3278 12329 -708 -24403 -36156 -16466 -11148 -2680 -3539
15457 -3539 -19217 -34577 -38347 -9135 23298 6559 -14756 -3323 -13383 -26955 -7628 9320
15445 9320 18513 27142 32416 34342 6209 -23604 -18091 -13853 -22089 4349 18721 40257 29696
15432 29696 11389 9238 21145 39386 15542 17690 19640 -5534 -4097 13602 35816 33775 7972
15419 7972 3010 -1322 7127 24118 18883 -1937 -40575 -38211 -11038 5563 46441 60802 62206
15406 62206 37980 22267 32190 24813 -19492 -21647 -9568 24946 44329 64495 57380 41662
15394 41662 25151 12956 20153 36918 23140 27275 67784 77182 57115 72621 72517 34393 34597
15381 34597 64935 81557 59954 55846 76758 65125 45392 36987 50541 17586 23724 38015
15369 38015 37928 39042 27022 31181 26114 21656 -2707 -4091 -20743 -32000 -5080 24864 38834
15356 38834 60283 42311 5708 -7737 -8404 -14452 -11170 -25556 -37813 3334 61824 48152
15344 48152 26794 11415 7746 22863 20174 25225 31061 7372 -14391 22493 58944 69055
15332 69055 74319 64033 59700 55341 45650 25565 17551 6984 8622 33046 76754 78920 81372
15319 81372 62698 73047 54107 56515 58952 67510 72904 78311 84814 64564 43917 57533 60092
15306 60092 38577 29699 45048 42809 46848 32423 30820 49449 20633 -9558 8894 19649
15294 19649 40439 42223 26059 24955 25346 11182 6189 15413 14625 23452 28241 28302 19027 43094
15280 43094 68319 57590 41560 43331 53696 74423 55422 48394 52305 70409 52423 61213
15268 61213 43950 1260 13701 40462 22398 43222 61156 74082 69611 49209 29738 38239
15256 38239 49116 64994 90237 68826 46443 46984 35929 27628 36985 35955 34509 84364 128543
15243 128543 125858 108612 107092 43138 12206 22424 30679 13817 734 1085 15647 30630
15231 30630 43809 53421 37774 18271 25384 11075 24162 17297 33838 76628 84486 64006
15219 64006 59341 52681 35593 46358 81232 82702 65741 52053 30694 22396 21396 19993 42948
15206 42948 26337 -11440 -6378 15216 49403 46191 51250 61938 53043 4951 -10062 -8466 16822
15193 16822 42569 67149 85135 73719 62351 57803 74693 52076 46166 54865 29023 22769
15181 22769 41712 48650 37025 53344 71485 54392 11310 -7510 41039 60673 63893 65205
15169 65205 57498 33776 36702 65695 58332 76367 89046 77011 76138 91618 70648 50772 48538
15156 48538 24643 52715 64958 76673 67097 46296 71744 58247 37183 25980 12055 5884
15144 5884 6497 40613 70640 79968 82272 91119 83069 38204 20580 10327 -8377 -14259 -6792
15131 -6792 3527 -2016 17092 33423 61057 68295 53328 32515 21094 28851 39487 50094
15119 50094 60915 67508 64141 43924 46979 56362 80420 82654 95078 103467 70200 54575 62671
15106 62671 77075 79297 53405 61969 60868 75575 71799 44687 31334 19986 6607 -10116
15094 -10116 3904 25598 24622 41297 44563 38056 15040 41810 7666 -25947 -17026 -2951 -2865
15081 -2865 -24670 -10050 7628 7316 15310 22704 12443 -6801 -14370 4629 27726 47325 48966
15068 48966 39217 25629 20300 9831 329 12108 2177 21247 47823 81223 78824 90984 101190
15055 101190 85054 61481 45822 23411 331 -8629 615 -6245 -7543 23605 41721 50041
15043 50041 58519 45844 47712 29804 32300 18223 5445 -26384 -38739 -20314 26657 52122
15031 52122 65163 43720 33101 41103 53850 27169 11374 50989 53204 70687 58285 41517
15019 41517 20545 11721 11135 10588 44821 60204 67630 54187 32640 51375 58472 62508 45125
15006 45125 39169 16025 -20594 -39890 -20283 -8227 -15048 14836 13943 -302 -8848 22863 34829
14993 34829 23489 16778 22949 25504 23251 -6404 18976 -2450 -10574 -3827 -11382 16503 26174
14980 26174 31168 4452 14661 26431 32795 48078 27915 -7609 -45 6723 9152 10929 41580
14967 41580 71961 66524 52080 66753 78554 55922 75846 75347 72435 30526 -1951 -17638
14955 -17638 -8376 21140 36031 39749 36861 46603 47446 46373 42295 49850 44758 40983 35075 22061
14941 22061 -1420 1804 32925 177 -10357 16125 14980 22615 59045 72700 52693 79229
14929 79229 81903 56494 45663 43724 48742 29798 29477 34930 36010 33450 58060 58689 46505 33400
14915 33400 28272 25341 30204 35304 48731 36362 64017 68076 60983 47783 60095 52052 45866
14902 45866 51475 42997 38786 21983 30529 32678 10787 27104 53683 51017 17089 16887 48892
14889 48892 44409 4680 18541 54895 68690 73473 53916 32897 6715 22909 49984 55654
14877 55654 48991 34206 31030 40080 32061 45715 42442 49910 68614 69884 56938 36223 67018
14864 67018 86367 78986 69408 48702 16314 -4289 -5251 22704 50524 56724 85509 89071 43742
14851 43742 3466 -8744 43166 39759 20628 -4531 -914 1606 -13881 -38407 -17889 -553
14839 -553 18071 42128 37147 40286 24440 26469 23770 43639 29927 25563 38710 37028 10184
14826 10184 26266 47345 22321 582 16682 48391 74045 84159 88494 52927 20963 3726
14814 3726 -9695 -14241 -4356 -16748 -15425 -15496 -21269 6288 15748 14349 6198 8898 -6971 3166
14800 3166 19307 51280 52069 57290 45953 22198 -13799 14578 31553 43494 39833 9459 -6276
14787 -6276 -23647 1022 -4220 -30183 -23802 10107 8543 -32465 -60539 -49146 -26918 -7128
14775 -7128 -5683 24785 52367 57602 37962 33901 28080 30974 7804 6024 14759 4735 42302
14762 42302 78839 60885 28610 281 18741 33025 -4820 6714 22211 32017 45874 55259
14750 55259 70709 61544 43490 36272 20394 29120 40345 34240 446 -375 13828 8286 34202
14737 34202 47450 41438 37614 34130 28825 -9621 -7455 6509 36332 46496 53780 37535 36408
14724 36408 35327 22677 21705 25684 42551 56615 66176 70956 42998 26760 44703 37255 36713
14711 36713 38510 43845 26273 6893 23509 38210 55691 62899 54427 65325 60987 37875 45516
14698 45516 64286 69377 46331 33149 36890 41716 44527 26504 24926 67326 66007 18017 -3237
14685 -3237 -9807 -14468 -42638 -57024 -71282 -66803 -44676 -52808 -65978 -35150 3407 19953 27199
14672 27199 44925 22702 -23333 -26124 -26571 -37070 -24611 -23828 6103 -3393 -5201 -15819 -10613
14659 -10613 -1652 -4698 26812 35536 21782 32458 43923 59365 53886 30401 -18909 -50359
14647 -50359 -50945 -50433 -24960 6602 423 -15451 -10906 17795 15663 9394 19773 19365 19290 -14910
14633 -14910 -30461 -32797 -20438 -3345 7989 10652 -22117 -25021 -30639 -30893 -10216 6662 2658
14620 2658 -17618 -7804 5650 26008 20105 10418 2861 -8930 -13395 -6496 2189 -7084 -6224 20998
14606 20998 47239 86108 73739 38661 -17929 -29058 -6033 7747 7187 15800 4570 -7501
14594 -7501 17339 12554 8942 -10182 -18485 -40691 -31182 7657 18955 14742 7310 48 23784
14581 23784 40392 16665 3461 5687 6486 -12622 -6464 6164 -1886 -5365 122 16326 -5498
14568 -5498 -27172 -35654 -43671 -59305 -28057 -10327 -44904 -51453 -42171 -26999 4758 16913 22871
14555 22871 19720 17748 21987 4000 -13967 -363 -14546 -31994 -41258 -31894 -7436 -21771 -8322
14542 -8322 21598 16023 -5885 -31679 -14843 4392 15857 29943 19632 40714 72969 19230
14530 19230 1731 -6005 -37368 -48850 -40266 -29148 -5020 -4190 -22916 -12902 1723 25932
14518 25932 17802 -20689 -27161 -8661 27155 19666 -11858 -16542 7011 14564 19195 27354 38381
14505 38381 46907 45927 27904 24541 13892 5738 6505 7508 32051 2344 -15513 19486 22952
14492 22952 8892 2546 -72 10790 10516 100 13397 -16094 -41612 -23761 6606 9544 7016
14479 7016 8525 9860 -4829 -16778 -35721 -25456 -2295 -4034 9460 6203 -6662 -2479 -14624
14466 -14624 -36782 -73717 -86331 -63059 -28701 -19237 -20770 -29390 -12767 -10891 -11636 -51278 -67258
14453 -67258 -57565 -24783 -20203 -17424 -47960 -47232 -11788 11637 26893 -526 -10345 -13820 1592
14440 1592 9715 -3794 -18574 -29112 -25526 14137 19454 18235 -529 -9029 3376 -8607 297
14427 297 -12331 -11492 1322 -13306 -36106 -29807 7801 -8294 -3597 -2492 -12427 -34502 -45898
14414 -45898 -45846 -16549 50212 80393 64243 37931 49478 33910 22009 8521 16294 -36418
14402 -36418 -67553 -100904 -96214 -62925 -44874 -17146 -3400 -3889 -14261 -62717 -57112 -28423
14390 -28423 -10029 -21427 -19657 -1997 3479 34187 28895 25675 22631 8470 -22752 -42936 -68745
14377 -68745 -49820 -43454 -33373 -46873 -26752 -17871 1688 8253 11307 -412 -8664 16998 21886
14364 21886 7099 21220 -5383 8007 9867 1880 -1610 -1660 7237 -13307 -26324 -19898 -5541
14351 -5541 -45 2847 -3495 -11188 -9826 -6564 -9264 10742 14671 -3338 -12511 -17284 -3480 29323
14337 29323 14943 14905 14983 35219 15854 22124 19062 -2446 -20651 -49351 -24554 -1413 2198
14324 2198 11250 -13797 -27157 -18373 -23954 -17187 -34667 -47133 -50435 -49753 -7974 20979 36427
14311 36427 18081 -244 -1785 6227 3596 -3406 20198 34328 15632 26563 32152 32038 31695
14298 31695 26396 47679 33493 2467 25222 42812 12032 -5345 -30557 -33518 -13779 -9860
14286 -9860 -5441 -10035 -20915 -31188 -12628 -7962 -23818 -54794 -51206 -39110 -41025 -37978 -31524
14273 -31524 -43727 -17638 -17435 -36039 -27583 -14126 -23707 -12360 7100 37589 32815 33353 15828
14260 15828 13109 49254 101405 75746 48567 43578 15410 13929 -8106 -9338 -4939 3468 2233
14247 2233 -18029 -14736 -2423 6470 1179 12943 1934 -22338 -2906 6290 -23978 -56493 -46113
14234 -46113 -41705 -54251 -23358 -6437 -12088 -40861 -39259 -404 -24752 -12778 -7673 -29570
14222 -29570 -16935 -18178 -2536 -8049 -21654 -20327 -7335 -19622 -47572 -53720 -47433 -22538 -18512
14209 -18512 -8695 -12785 -22698 -32846 -48829 -44408 -35667 -28383 -11844 5390 -4411 -12152 -16255
14196 -16255 -2391 -18059 -23136 -5197 -1169 -2873 -7149 -1242 -2427 -2912 -13433 -21050 -12494 -37909
14182 -37909 -59623 -54850 -43003 -9832 262 6378 3233 4917 451 33020 36662 19641 22135
14169 22135 -8021 -9982 17709 47382 24189 3768 -2687 -14187 -22484 -28616 -2392 31137
14157 31137 68700 55967 81296 75903 21503 1172 -44045 -65844 -45587 -36924 -16872 -7785
14145 -7785 10728 -20655 -32955 -49427 -47910 -33205 -31018 -42715 -25803 -6226 18944 -3014
14133 -3014 2552 17372 5776 25505 37039 46741 40896 20968 10413 1987 7876 5945 34017
14120 34017 20985 -4810 -12654 -10774 -21175 -4016 7068 6642 -16998 -27663 -21277 4092 39808
14107 39808 56434 29980 27790 27393 -12185 -34132 -38406 -35366 -2666 -4236 -25938 -27079 -27950
14094 -27950 -9580 10511 21008 -15497 -16342 -15422 -51398 -49011 -19901 -21155 -33505 -43732 -54385
14081 -54385 -54223 -41842 -34232 -23213 -14821 -28152 -10312 -16878 7067 24522 512 -12226 -41549
14068 -41549 -73090 -65585 -36803 -24410 -18912 -6423 -8856 -10077 -40177 -37986 8717 19964 5806
14055 5806 -11242 3977 10076 15154 29584 34023 45996 15561 3944 -8894 -7228 -20310 -62685
14042 -62685 -35543 -19227 -15747 -24732 -25903 -40793 -20429 -11933 -21628 -45642 -77317 -72881 -44948
14029 -44948 -16063 -36598 -27054 -46268 -39717 -16896 -62376 -54594 -39382 -28530 -32008 -40860 -25371
14016 -25371 13443 22844 -17704 -38685 -52353 -55791 -66985 -56247 -26971 -22091 -16113 -2495
14004 -2495 2656 -10487 -10930 -28961 -28751 -9851 4254 -23519 -19967 7035 -11423 -31533 -21197
13991 -21197 -21822 -49989 -62578 -56321 -30198 -18188 -22302 -40193 -41983 -35428 -34287 -19701 28415
13978 28415 33476 26141 5066 -28285 -14456 9636 951 -14773 -11420 16178 45353 27404
13966 27404 24507 30431 40009 2892 -6630 -20664 -40893 -11181 5684 11912 -4753 23319 42620
13953 42620 48428 44072 47286 63341 33538 -26648 -16191 23252 8678 1712 -1873 16581 21172
13940 21172 46092 34314 13404 -11498 -28149 -29413 -19689 5588 -20987 -26884 -30701 -30999 -22759
13927 -22759 -31404 -24842 4483 23701 12990 17492 25605 -6448 7536 5225 -4377 -12325 -26278
13914 -26278 -26907 -24013 -23353 9771 14686 2048 -8445 -44934 -39261 -17250 -28618 -48587 -77102
13901 -77102 -54063 -42527 -24820 -16012 -37431 -43964 -65955 -51261 -16254 -9970 -39545 -61531
13889 -61531 -67463 -44695 -42957 -21752 -23400 -43705 -45387 -39819 -52005 -20411 11363 3401 -38595
13876 -38595 -30849 -20041 -9963 4810 -875 -27080 -47273 -37963 -45920 -30601 -1298 -10653 11482
13863 11482 20201 315 -26916 -40787 466 20353 18534 28676 39341 55740 47343 29094
13851 29094 14486 4414 -9816 16619 11641 4836 -15474 -41191 -44012 -29600 -16792 -21708
13839 -21708 -15991 -39895 -34415 -50044 -63389 -33547 -22681 5192 22334 -5508 -23953 -19286
13827 -19286 -43137 -37172 -52579 -76849 -68306 -70243 -52192 -53029 -18950 -1057 5927 14978 12071
13814 12071 23760 54231 58064 23386 6007 -7895 -30128 -38785 -54064 -65689 -68289 -62749
13802 -62749 -29886 6614 -9923 -57032 -53946 -22490 -30140 -60055 -71378 -65165 -42778 -48683
13790 -48683 -14917 -1002 -9387 -1590 -12607 -12551 -11378 13812 25114 139 -12816 -28328 -38640
13777 -38640 -35281 -11435 -8624 -19730 -45080 -35025 -22572 -58462 -65181 -20714 -16933 -32722
13765 -32722 -45986 -33458 -10695 -40168 -30057 6674 -4876 -14317 -4764 -11388 -36459 -60491
13753 -60491 -59299 -61878 -64096 -57799 -41527 -42315 -65516 -58324 -35289 -7122 -11125 -8098 16454
13740 16454 44859 31552 -13784 -24724 -29758 -29007 -32809 -30576 -16902 -26506 -35392 -32488 -38432
13727 -38432 -37329 -15615 -18758 -51002 -65017 -71462 -43781 4926 12978 19325 22953 -7452 -39140
13714 -39140 -56318 -55658 -41968 -45630 -72760 -52395 -37678 -58098 -58992 -26701 -27410 -13284 15567
13701 15567 17852 11243 -28811 -36812 -20592 -29222 -38347 -30390 -26635 -39990 -53609 -32926 4447
13688 4447 6839 42354 60275 9819 -24882 -6817 18012 13978 13785 29044 18412 12820 13573
13675 13573 4319 7875 -7407 6178 33811 54322 17329 -9956 -16679 -39 -3657 -26719
13663 -26719 -40175 -43781 -56193 -62491 -51938 -47305 -23236 -21031 -3866 -19495 -36047 -39175 -24989
13650 -24989 -11056 -11400 -20404 -37210 -21876 -6769 -10117 -14904 -4558 974 20008 18742 -4029
13637 -4029 -2242 -5126 -4824 -12968 -16746 -14156 -16252 -16064 -17664 -19427 301 933 -7311 -20892 -22399
13622 -22399 -7612 23305 49130 27182 16398 8191 10755 23644 9423 10236 14109 19087 15591
13609 15591 3171 2487 -3385 -22446 -71463 -102699 -63851 -12941 8458 -18584 -25626 -32901 -30418
13596 -30418 7331 10705 2827 24806 36073 31681 29808 68 2822 856 -6059 6975 -8682
13583 -8682 -35302 -25482 -27656 -49806 -15649 -24444 -29758 -21389 4350 29829 37693 -3728 -15496
13570 -15496 -33557 -30165 -14789 2983 -11939 -15221 -18476 -22351 1944 3446 -20972 -35440 -68357
13557 -68357 -44624 4543 27925 24193 20395 13144 -13840 -39056 -31838 10130 21866 19864 34755
13544 34755 48201 27164 3102 -17351 -28483 930 869 -22332 -5921 18750 54068 73145
13532 73145 32667 13664 -28813 -30325 -46035 -57988 -53790 -15951 3439 692 -19770 -4753
13520 -4753 -1541 -15936 -37057 -17389 -13072 6199 14719 3764 -29743 -7120 -4636 -19885 -13585
13507 -13585 -29899 -45119 -50636 -32697 -16786 -18789 2745 10172 10537 5725 -3730 -9380 -34289
13494 -34289 -42115 -11593 -9155 -24668 -24790 -31020 -35522 -34833 -45586 -61582 -20594 -15135 -45408
13481 -45408 -47215 -59267 -44148 -26832 21499 38904 40676 65713 95602 86226 63304 28523
13469 28523 3640 17943 23921 28321 15651 6360 3659 -1990 -20196 -14957 -9058 -25927 6385
13456 6385 20052 16859 20463 -8564 -29713 -20138 18564 -12754 -34587 -33028 -4514 -7705 7000
13443 7000 13742 24760 1557 -20801 -42854 -46126 -43996 -51602 -43773 -36939 -25650 -31584 -14121
13430 -14121 20237 2482 -26843 -15231 -29351 -47875 -32394 -38314 -21324 -62155 -77989 -63422
13418 -63422 -42733 -17242 -21853 -17602 -1850 -8279 -2460 6007 27227 30585 24964 32094 -299
13405 -299 -20921 -21380 -15615 -42523 -53126 -39120 -30468 -9813 -8870 -14863 -524 10507 17636 48232
13391 48232 45669 37503 31186 26538 63485 68573 27569 14177 -10331 -6411 18746 29441 7379
13378 7379 -20751 -7744 5054 -8910 -21729 -17254 23426 19008 28965 56619 63480 8299 -35002
13365 -35002 -26020 2964 21519 8247 -2238 -11320 -15289 216 -5944 16166 28333 61345
13353 61345 43989 12740 -7438 -41193 -20760 40225 21743 -29602 -23432 -37683 -51386 -45425
13341 -45425 -30950 -22233 -45344 -27472 6348 35602 52089 45290 22624 3891 26808 21055
13329 21055 -20261 -22803 -18707 2537 -6486 1262 -15390 -21316 -32227 -12660 -15000 -23841 -10042
13316 -10042 -6327 -8067 20698 20090 1647 -26485 -28364 -5897 -25480 -30470 -18024 -4669 -19655
13303 -19655 -16261 -40678 -56310 -47601 -53197 -39850 -21518 4101 31068 40979 17523 17842 22846
13290 22846 23696 19197 5182 -2866 3417 -12379 -42529 -20727 -1620 -22285 -31287 -34385 -48934
13277 -48934 -33671 -11962 1263 20684 -4290 -3497 16158 12595 14094 47965 40253 24745 -6367
13264 -6367 -3624 10732 -14353 -13848 -5867 -25601 -37029 -31107 -12930 -32948 -27449 -25213 -36127
13251 -36127 -30727 -37112 -43212 -13340 -1206 -5888 621 -21297 -43886 6497 33609 -12809 -16144
13238 -16144 -15783 1411 3654 -7196 -2464 -11231 -5320 -18957 -10626 -7194 -10226 -30965 -22235 5409
13224 5409 16767 32124 47532 58575 26989 9612 20724 7371 1231 25453 30059 37901
13212 37901 51511 52274 77829 95612 132190 175079 250919 369759 499351 690080 914211
13201 914211 1170948 1452522 1675423 1817587 1851899 1825799 1706564 1454875 1191298 944322
13191 944322 734500 505208 346036 272250 235080 217201 212761 149436 95721 64163 73460
13180 73460 71738 86812 94082 100507 65827 26284 14618 16784 -7679 -19856 -18710 -18422 -19781
13167 -19781 -2138 11988 9715 15710 9427 572 -10340 -8586 3776 -1091 -23503 -61682 -64788
13154 -64788 -57613 -41819 -25225 -21823 644 39256 46907 25736 40619 31328 43794 53462 59912
13141 59912 16756 -1147 8136 12354 30932 39661 32030 29484 5525 -2161 -13976 4564 24394
13128 24394 -4033 -18189 -17375 -17420 -20992 -33018 -18361 -26984 -18832 -27681 -40593 -39286 -9431 8212
13114 8212 29610 51204 39841 26080 31523 50305 26248 30416 29574 30175 16289 33271 24207
13101 24207 -3156 14064 15672 17135 -11146 -47254 -27119 -11657 -22085 -40460 -23097 30124
13089 30124 30175 59 -7395 -10430 -43133 -42661 -34587 -33483 -20208 -3675 15390 26022 48511
13076 48511 49110 63859 47670 61969 73835 65702 67710 74894 52852 28481 13818 -23591 -11936
13063 -11936 26496 30024 29119 18409 7576 38052 64764 32772 9424 -339 -3119 -19115 -16670
13050 -16670 14063 20084 19015 5661 -16975 -7487 -14478 -5933 -6619 -14447 -42681 -44254 -43054 -57730
13036 -57730 -36841 1524 -2208 13140 28435 14519 -21068 -7331 23577 28800 32859 9224
13024 9224 13737 -12036 -25271 -33051 -17859 10475 15480 26206 51342 82312 102837 120025
13012 120025 141921 208271 277203 324269 322446 313162 311430 273466 223519 161276 128128 83074
13000 83074 81349 86266 86854 56816 27089 15208 11474 32125 21807 21312 43622 17347 -5561
12987 -5561 24960 42770 29971 32361 8423 -9452 -7525 -2948 -26908 -54628 -21473 -20828 -12093
12974 -12093 248 3632 22185 29727 18178 16278 54585 60269 42154 13104 20950 10803 -16761
12961 -16761 -41684 -50968 -8527 3024 -12043 -29415 -22416 -4676 -12930 -17210 17963 20730 18316
12948 18316 11496 23775 33095 30364 30659 45082 41899 70008 79986 68930 96252 93542 88437
12935 88437 87505 61380 40216 24461 51452 43926 32074 63881 61984 61371 51683 7008 -18955
12922 -18955 -19864 -50478 -47833 -52887 -27774 -2221 7854 12879 26158 47600 36923 13103 9158
12909 9158 1034 19283 44968 35129 12624 30134 34324 48850 51212 23437 38591 84997 102964
12896 102964 98799 66305 72152 60218 92132 122534 125875 131571 164423 206869 268710 378500
12884 378500 454415 517796 599472 645532 644519 581337 512708 460700 401494 362295 345743 325130
12872 325130 325112 314011 321721 333925 334468 287667 254047 248639 219810 185484 129430 92956 71931
12859 71931 71226 84419 99260 109155 121690 112838 154745 187358 210314 212814 198671 194598 199555
12846 199555 176967 163068 171448 168034 163891 171136 177101 199618 210894 219996 209168 209282 231414
12833 231414 229035 216187 201933 191791 219486 219759 231712 255827 288742 307980 338401 367779
12821 367779 363402 370658 388871 390217 395622 430380 452885 470868 507969 540579 561262 545248
12809 545248 518600 551539 612145 630930 646266 686271 727484 752896 808953 862658 929873
12798 929873 982350 1003801 1040114 1081091 1149252 1224607 1298841 1379140 1468169 1553083 1664991
12787 1664991 1782120 1945359 2127063 2290992 2449665 2613211 2813182 3018013 3253167
12778 3253167 3549018 3898535 4302160 4755163 5302600 5942612 6750221 7785387 9086892
12769 9086892 10707834 12747424 15397038 18806132 23232401 29242164 37697244 49948989
12761 49948989 68208509 95537395 133445950 179121427 229401262 284990900 336136111
12754 336136111 363297335 368983610 365400876 341894092 293512162 238899751 189962823
12747 189962823 145018304 105530713 75826455 55880404 42705088 33684975 27297650
12740 27297650 22590488 18983397 16205943 14070035 12391055 11041936 9872757 8869989
12732 8869989 7980768 7226811 6609940 6064476 5532240 5054137 4672249 4339881 4059925
12723 4059925 3794657 3522971 3308324 3149386 2972043 2805952 2677960 2581794 2450689 2343597
12713 2343597 2263480 2154984 2023378 1935430 1843946 1718388 1625096 1593893 1549828 1487657 1436477
12702 1436477 1406013 1349395 1255748 1172494 1129411 1075907 1063943 1037523 1009504 956425 945748
12691 945748 960230 954573 935990 914407 884905 860941 829587 835082 851758 842425 837769 798913
12679 798913 771417 750767 729652 721365 671055 656449 661877 631994 602297 606331 598104 548329
12667 548329 500238 482800 447645 456497 473933 473051 441880 439746 453250 431211 431108 430633 430462
12654 430462 411398 404185 404398 405794 401504 380681 384067 361084 344307 345994 344617 371440 392959
12641 392959 350875 328018 329988 320380 331773 334038 324297 301491 318681 330156 333358 335844 353498
12628 353498 379089 414802 383552 365823 362465 343351 309529 325920 312908 305344 313597 281916
12616 281916 271512 265902 278288 254364 218476 211403 190614 192265 176094 190471 199220 205636
12604 205636 203048 219713 251177 256740 228264 251434 264742 248056 217980 210085 226303 235178
12592 235178 251464 218970 218977 226461 216506 204751 225384 233154 209085 205553 202980 246405 263152
12579 263152 242209 206666 155073 144662 135942 138342 134537 151357 166790 159569 140570 149867
12567 149867 164238 149771 160404 185588 173738 163775 152761 153477 178225 157649 120322 103484
12555 103484 124566 130796 137965 148094 175480 198409 234687 260706 285870 293414 328179 366539
12543 366539 386346 445427 474675 471693 436778 385849 358520 338798 301493 279535 278910 222741
12531 222741 175933 153352 163657 177343 182579 169039 165140 163380 137911 116310 109558 110963
12519 110963 115371 112707 93134 90391 105676 105290 124995 150365 147086 128742 159985 178284 180940
12506 180940 166416 144746 148959 135179 158111 145496 118592 104859 94384 91491 66451 76630
12494 76630 99641 132652 126856 107543 92588 115368 118920 88866 47535 70201 102899 141728
12482 141728 155107 143174 135486 145515 189285 245080 247392 216486 174148 132880 164747 210365
12470 210365 195610 176013 177147 171312 161403 163645 150110 119314 66339 10933 17872 19131 23553
12457 23553 27956 24741 22249 55899 41848 41576 41557 45884 44700 44323 47991 59433 64123 65391 80799
12442 80799 97279 72150 13365 8052 10561 -1530 26200 71151 94097 79135 68479 41373
12430 41373 23123 44804 46817 44804 33357 18479 32800 35798 6279 7240 55508 92795 92194
12417 92194 89686 54645 27920 48640 83656 91041 71747 48838 48624 29716 24938 29917 30892
12404 30892 35554 47687 55531 41542 47178 24138 24620 18396 40021 37034 41399 65529 88503
12391 88503 76415 51641 25987 5960 -22516 -33197 -16322 -7180 42559 10270 572 18301
12379 18301 10831 -10442 1026 10465 4421 8858 39233 27950 40725 43694 34516 57241 39970
12366 39970 40545 47996 65575 69057 62612 38667 28819 65254 63291 52281 66132 55831 93155
12353 93155 90064 77066 82780 80361 51247 55666 72792 76447 50391 16956 27397 63726 77555
12340 77555 73414 39781 41405 47415 73459 95121 64382 62772 54509 55684 42822 45105 39577
12327 39577 40165 51370 45057 35951 47809 74102 91230 88473 112021 117390 130373 153823 170109
12314 170109 193331 220136 224499 260788 374576 526792 737884 987194 1226174 1503208
12304 1503208 1767221 1866519 1895019 1893531 1764228 1502885 1207392 978056 744557 540849
12294 540849 382044 318823 247047 199330 176541 165818 152593 129523 95026 101565 98855 87949
12282 87949 78202 44559 15091 35899 30444 25829 36495 49503 55038 30152 45924 52237 54028
12269 54028 68419 66291 43141 21865 49946 73599 68937 56754 68525 75006 105370 118139
12257 118139 89733 54253 41201 50625 57380 87094 109164 94628 67355 63377 92067 121607
12245 121607 154509 136733 72141 61559 60927 58177 74599 85260 50404 34938 52885 63750
12233 63750 94200 72875 41457 55009 53044 64590 23546 -12877 -749 -1216 11876 41657
12221 41657 64579 65642 26673 24660 54367 22956 16795 32535 15010 12193 6451 31801 65506
12208 65506 48184 44888 57346 54104 37876 13968 4946 11242 13399 17524 25453 -8607 -31881
12195 -31881 -30320 -34515 -23206 -8313 30741 55906 82447 99125 64851 24802 33395 28361
12183 28361 15646 784 13408 -24719 -47868 -46616 -50641 -33793 -16630 -20559 -4869 -1423
12171 -1423 27499 23528 -10714 -18949 4023 13758 6466 -243 -18502 -2521 -3114 -15731 -12869
12158 -12869 -8699 3295 1853 16706 27167 15798 -2764 -11793 -12735 8273 27639 45196 55401
12145 55401 25290 10771 15673 33158 47316 56401 52705 35028 16580 10992 -9638 -2586 12753
12132 12753 21361 2619 -5123 -34284 -51578 -32506 1972 14020 13741 10826 2244 -13696 1457
12119 1457 24338 36456 24559 17395 27037 -3102 -16225 -16513 -15601 -14220 -17251 -8091 -7759 105
12105 105 22451 28948 18126 10775 10775 53993 59708 51736 41977 41521 28747 -1285 -12704 12880
12091 12880 39456 37156 35962 19847 43912 40672 37152 27679 43575 41442 29047 19127 4861
12078 4861 57917 89207 74413 42109 47609 40716 24728 17034 35534 48036 59140 56060 54379
12065 54379 8334 -5844 -14151 2818 -35504 -64487 -58763 -42960 -30767 -40775 -54209 -50100
12053 -50100 -38897 6195 15071 6926 -141 -3804 26186 37924 24102 19806 37978 40217 78941
12040 78941 91924 40050 15132 17930 31022 48770 33666 35691 34047 28581 36219 29835 24321
12027 24321 54066 45266 17988 17457 316 2547 3914 -28703 -20967 -18312 -881 7987 -1469
12014 -1469 -20214 -30106 -14899 -20869 -13131 -10244 2035 10902 -13555 -333 5543 16132 3534
12001 3534 15887 41121 28753 1168 1844 3142 22842 16803 28396 -124 -5939 17719 11391
11988 11391 30481 45683 45105 27572 7350 20082 30824 58874 53852 17804 -14563 -29416
11976 -29416 -27960 -17091 92 9830 -7305 1674 19515 38881 33771 33076 43394 3503 -38191
11963 -38191 -33969 -26376 -2146 5684 12334 11193 12296 17994 24108 26696 7383 26784 18885 1635
11949 1635 30267 23580 -8676 -10278 18283 853 -6048 -17941 15727 34856 21585 10859
11937 10859 28246 39105 26077 39948 46333 37956 23009 27034 23295 10636 -16359 -8117 9059
11924 9059 5641 -32788 -31173 -4106 5644 14399 20184 16719 -18730 -13799 -30883 -56150 -68890
11911 -68890 -59907 -24460 -12544 -11128 5076 14135 23071 6201 -1896 -21163 -30867 -11816 -14338
11898 -14338 -19557 -1806 36161 42590 10200 8136 20176 19574 52532 46033 12856 147 7599
11885 7599 -1356 -4586 6590 8010 10248 -4798 -5660 21358 45780 43668 63290 70212 55541
11872 55541 23342 -166 -23839 -1637 41951 50341 47974 39241 40581 41304 5232 -7940 21669
11859 21669 28422 22978 12539 3545 31348 59382 35918 3791 9044 61450 66375 46865 26266
11846 26266 34548 42644 9211 432 -9364 18131 -8856 -44069 -45150 -34922 -29703 -2527 5612
11833 5612 -30735 -60602 -90131 -64686 -23948 -41692 -42982 -49426 -36431 -12893 -19484 -5074
11821 -5074 21116 566 -23131 -22103 -16220 -10283 -17479 -1889 13437 2887 -2671 -4585 -20877
11808 -20877 -37685 -19405 -10788 -23901 -35227 -38313 -5690 2891 1397 6656 17989 5942 33012
11795 33012 33819 63 -21399 -17075 -28378 -16148 -29597 -39596 -32269 -26650 -18716 13211 16766
11782 16766 -10581 5237 -12182 -15592 -18199 -30390 -13890 -20259 -2081 16912 -4234 -5988
11770 -5988 2094 -4836 -14561 -3037 15916 40632 22164 -5886 -29274 -30308 -6077 -4872 -20021
11757 -20021 5208 17229 21854 11651 18067 7925 -4615 -22555 12627 20483 6137 -14165
11745 -14165 -12037 -29704 -33111 -7445 24651 32736 56381 52593 43990 36964 33960 54702 17489
11732 17489 1488 22092 43627 17726 -12823 -24903 -6449 16292 38341 21578 19574 12173
11720 12173 -5336 28881 15446 23799 13591 -9612 -2644 3234 -30936 -29368 -22375 -3378 29870
11707 29870 14278 -10864 -11327 -14601 -31131 -66983 -81714 -73415 -60223 -37206 -30311 -1316 49188
11694 49188 62883 67752 59619 38414 27621 39691 46481 66892 63094 10822 -21995 -18849 -30580
11681 -30580 -34206 -16372 367 28474 18186 -6525 -30319 -32529 -3614 9882 8099 53
11669 53 13890 20309 -3674 2480 7770 23010 27630 26400 5125 7200 -12866 -8211 -10795 -20466
11655 -20466 -13708 1402 4522 598 -10816 -24824 -42635 -21166 3342 29682 13324 -11085
11643 -11085 -29185 -25792 -22682 5823 37096 -571 -1036 18617 -2064 -14998 28318 39891
11631 39891 22291 47090 62511 44286 44493 49236 25035 -2811 23518 40168 28597 -21056
11619 -21056 -37373 -49469 -22623 -3978 -25339 -25174 -37174 -16435 -4343 -9126 -25590 2765
11607 2765 13482 -17633 11208 43044 5779 -13854 15835 1526 1268 -3967 7103 26360
11595 26360 1613 -17592 -15952 -8354 -42033 -88809 -61982 -15463 11361 26855 32545 8540
11583 8540 -5282 -9054 -13203 -6014 -21255 -16127 -31458 -47982 -46163 -20118 -34266 -44809 -36902
11570 -36902 -18974 -11960 -13464 4613 16406 48701 48466 37324 20155 -24740 -41182 -2373
11558 -2373 17767 2843 30840 30488 -5994 -4992 -9908 -2145 -2352 -990 8970 28950 35201 21625
11544 21625 -6779 3409 29423 6478 18009 -23775 -70247 -51873 -23688 -25187 1788 4662
11532 4662 -21414 -16018 8027 -13642 -18009 -15095 -23316 -4624 12888 15947 -9342 709 4547
11519 4547 11592 -1483 -1349 -573 -7504 -14514 -4120 -5004 -30434 -2714 33147 14034 -24642 -30772
11505 -30772 -60 935 -20421 -9155 13522 23650 -5948 -32637 -37036 -37579 -48387 -23705 -29030
11492 -29030 -22552 -1615 25492 14245 -28731 -24743 -18092 -19021 -13001 3535 22381 19871 14603
11479 14603 26330 -7754 -12806 -33857 5256 38479 12305 25187 6929 -30714 -49164 -73752
11467 -73752 -63010 -41844 -18318 -14119 1740 -5769 -10433 -37223 -19196 28564 38873 19923
11455 19923 987 1608 -20977 -11547 -2159 16129 2093 -11894 -12104 5841 -9515 -9119 14207
11442 14207 51843 35195 16279 13453 631 -20914 -1194 8011 -19161 -20956 -192 -1207
11430 -1207 -3138 18937 21788 16880 44264 29505 -16141 -35099 -44736 -46980 -37355 -42076 -36767
11417 -36767 -31718 -16176 -1242 -18781 -8651 24020 12582 214 3148 1413 -2392 -8062 -23998
11404 -23998 2718 9658 -5050 -6238 2790 -11417 -18073 -13190 -36946 -35577 -30127 -10206 31819
11391 31819 59847 68605 74284 62144 34035 17375 5612 4197 -6186 -21498 403 -6967
11379 -6967 -17428 -38631 -41228 -1489 29369 46538 53626 41377 17661 1748 4608 14838
11367 14838 19286 14527 -17278 -25470 -7533 -12087 -13095 -19159 -36915 -35322 -47773 -47316 -37561 -45581
11353 -45581 -53144 -42231 -29453 -31553 -22564 -13442 -8677 18809 10839 -8171 2796 -3094 -18329
11340 -18329 -6176 4558 -16646 -5321 21909 31811 5060 -7534 -51322 -45351 -7654 16022
11328 16022 15961 21051 15601 -3234 -3570 3761 20672 4288 8555 9491 14849 775 21990 66572
11314 66572 71479 50063 23085 2689 -3686 -30264 -31983 -29185 -51371 -69483 -54459 -60094 -31437
11301 -31437 4334 -6449 1727 7616 -10372 -35529 -57408 -49964 1699 19307 2624 16519
11289 16519 -13656 -23910 -17497 -27440 4059 706 -9277 -24104 -36959 -43936 -50319 -74217 -54477
11276 -54477 -38217 11483 31627 22177 11479 15887 7309 -19466 -24202 -12195 12287 -1522
11264 -1522 -8862 -24580 -25056 -30768 -32450 -17958 7139 20417 5222 -9821 -17481 -14497 -10256
11251 -10256 -9664 9429 17865 -11005 -29865 -35910 -21451 -14419 -16762 -15377 14001 -531 -3216
11238 -3216 25979 28630 13694 -2412 -1439 18007 -13107 -20982 -8630 17071 16351 -12204 -38686
11225 -38686 -36340 -22482 -232 10225 68 -14013 18574 45184 12469 -2268 -38277 -48081
11213 -48081 -46461 -51638 -55003 -26831 4638 23939 42582 38615 32982 26948 35143 41694 29393
11200 29393 9984 20180 -30811 -51562 -15622 -10700 -7796 -26596 -24520 5205 5163 -9452 -51592
11187 -51592 -62002 -35782 -7761 37272 38594 29268 10134 10657 23475 3442 -51817 -61210 -69971
11174 -69971 -44898 -23272 -3257 246 21350 37468 47455 64254 35017 23090 11446 -13187
11162 -13187 -9272 17642 30134 24141 33959 23168 2538 7328 42630 51113 69889 46296 43744
11149 43744 20387 816 -10400 -19102 -27768 -32726 -41034 5935 24275 -10442 -39110 -36596 -53946
11136 -53946 -59055 -32350 -30343 -33967 -30325 -23031 -33089 -22791 -28075 -2639 19932 5603 -19438
11123 -19438 -15411 -25397 -22895 -7115 866 -6804 3805 2505 -6961 -37561 -46032 -12097 -2049
11110 -2049 -14438 532 17406 5201 29594 56394 38003 18777 18483 23174 3965 -12894
11098 -12894 -7503 20857 40648 48786 32439 26290 23393 22273 327 4581 36802 32719 17744
11085 17744 27279 46539 64871 29543 -7964 -8760 -17744 -19355 -11003 -5261 -7603 -678 29810
11072 29810 38615 9911 -2815 -22614 -27542 -9794 -5266 -2254 -25995 -35569 -1738 30756 29638
11059 29638 31527 39126 38299 45128 47102 25114 568 29934 14397 -12433 -20054 -30794 -43412
11046 -43412 -24602 995 -24133 -43031 -48166 -45941 -40135 -74174 -65913 -47938 -45445 -12643 17874
11033 17874 13652 13891 -7754 -6490 -12053 -16116 -24825 -18162 -10661 -21434 -42956 -64447 -30608
11020 -30608 -4483 12463 3585 -14383 -22938 -23605 -12364 2579 40075 45504 41596 -10879 -10410
11007 -10410 20561 36011 13151 -3173 -8959 -25001 -15817 453 -9250 -11764 -24191 -24864 10710
10994 10710 4913 3893 -22137 -27637 -45176 -56248 -27865 -21777 -24574 1741 21452 -173 -10986
10981 -10986 -12593 -16324 -23448 -50801 -44285 -14703 6112 12914 -3083 -6086 11699 18001 22987
10968 22987 23218 18113 -9991 -1478 -16923 -24682 -16522 -28310 -34021 -27481 -12600 19539 10624
10955 10624 -29019 -21040 6746 12831 18494 12533 13677 20500 9045 46844 46487 13703 -17668
10942 -17668 -11170 1754 10364 -2141 8859 22256 19354 -5503 -42184 -22165 3370 23001
10930 23001 9204 -32813 -23407 -29832 -47202 -36706 4896 29611 29121 31149 19445 -4188 -11876
10917 -11876 -4537 -17466 -26076 -35083 -45656 -6842 30278 23905 3004 14058 67650 32937
10905 32937 -12596 -554 17944 7735 15980 17269 4516 -6163 -39775 -37294 -27493 -29706 -25683
10892 -25683 -7920 4653 -23566 -26243 -59076 -42387 -14188 6735 52469 58733 15442 -56992
10880 -56992 -35015 14668 28577 12391 28075 29574 30011 44983 47026 21752 4294 -2706 -13342
10867 -13342 8044 5520 -7502 -7939 -11791 15755 26931 18312 26821 -4700 -15476 -8670 -30030
10854 -30030 -26974 45979 27240 3838 50 8447 12093 17539 18614 12957 31197 42437 25491
10841 25491 230 -18328 -18548 -17568 6599 30435 31293 10788 -5922 7103 47733 62110 27787
10828 27787 -16243 -10886 14298 3157 -12207 -31053 -43266 -34797 -33075 -9597 1371 496 -16879
10815 -16879 -20044 -9660 3628 -6308 -18530 -10674 9145 8477 -8417 -25139 -32147 -24226 -49763
10802 -49763 -65144 -35316 -14536 6763 4766 -20859 -18459 -42022 -9686 -8798 -2957 16211 20293
10789 20293 17084 -8578 -7438 13133 36879 33628 37934 49715 55814 28803 21091 32384 15783
10776 15783 15813 -2443 -38478 -73565 -48725 -16951 -11290 -38233 -47901 -63101 -41305 -9867 -48744
10763 -48744 -69865 -22009 -1664 21734 44465 21692 3016 18139 -21284 -36744 -20080 -13024
10751 -13024 -14544 4494 745 -4686 -1851 4004 3050 2342 -5211 6219 33268 14558 -14125 -25697
10737 -25697 3475 26303 727 -14223 -32253 -30675 1083 -4091 -732 -2665 16649 22782 30893
10724 30893 19738 15147 -17886 -15682 15839 11248 28649 33751 31573 22841 -1812 -22891 -10682
10711 -10682 5731 13120 -13988 -32153 -32387 -41188 -55832 -66818 -63757 -61955 -61059 -41625 -28725
10698 -28725 -19717 -29762 -28268 -9705 22815 10183 9439 7770 6597 -23994 -52250 -16608 15733
10685 15733 -14800 -29769 -7405 -16676 -5416 -20719 -7753 -1287 -11355 -9811 15408 9902
10673 9902 -9805 -19294 -24858 -1732 34133 66730 81931 72726 61984 32007 10562 12878 36059
10660 36059 31916 29633 27838 -6524 -17464 -20425 17716 51759 62616 33138 2503 7336 9818
10647 9818 9729 10234 25129 33157 2703 -2732 13724 11025 5617 20313 23507 34401 41987 1999
10633 1999 -13682 11675 36757 9737 -12034 -19193 -37179 -35681 -5587 -973 5030 8059 3106
10620 3106 6358 3241 2107 13295 22729 -7510 -7378 -2477 -12976 16582 61111 57405 41704
10607 41704 11330 -7359 4578 27855 55316 42967 353 10605 -2612 -18689 -19309 -37973
10595 -37973 -17995 -21360 -19916 -484 10482 28421 30587 15339 6487 11433 -22613 -21309 -9993
10582 -9993 10647 17372 -2151 -9591 5125 13403 17965 17111 783 -16300 -45827 -58112 -57181
10569 -57181 -46322 -14687 17406 20306 7051 -5674 -103 11918 -10479 -35132 -28420 -24384
10557 -24384 -10738 -30262 -29967 -19645 -10401 23014 13123 -186 8943 18522 37417 75567 69696
10544 69696 33644 26291 -13804 -24120 22101 44200 55116 28456 11305 19841 -8266 -27428
10532 -27428 -8688 2943 24182 27708 29051 17979 1691 -17776 -3838 -2478 -15558 -8540
10520 -8540 -10000 -637 3560 13004 11274 18296 5631 -7662 -9520 -25492 -31525 -57802 -46628
10507 -46628 368 -9649 -11701 18689 23861 22429 25048 7437 26379 2506 -24325 -29969 -10977
10494 -10977 5853 -1327 4748 17176 4650 -17692 9259 45428 47053 29306 18236 6362
10482 6362 -34088 -58446 -38051 -13655 -18816 -39918 -33969 -11980 -13161 284 17450 15219 -4309
10469 -4309 -31240 -47979 -60838 -39375 -25122 -2689 30512 24068 -4170 8339 -12659 -32504
10457 -32504 -26263 -30111 13245 12956 -19428 -20992 1923 -4540 -25915 -8513 25451 20320 7614
10444 7614 9340 -3563 2692 380 -21164 -42677 -43330 -33302 -51053 -45317 -41394 -27160 -19208
10431 -19208 -8058 -6423 2213 -17967 -15322 474 1230 11550 -8956 -21176 -16856 -26891 -26328
10418 -26328 -21440 -47970 -29536 -12235 -1134 -6291 5916 13388 22779 40512 28282 13934
10406 13934 -7526 -29008 -38381 -45786 -44467 -20564 -4924 3480 15722 5594 9535 17641 18441
10393 18441 22570 26116 1379 -35701 -49103 -49548 -34010 -18297 -18387 -17583 -11408 -2854 8556 14014
10379 14014 -5047 -17321 -56740 -77316 -44856 -8026 -6671 -20686 -24001 2486 23711 -24064
10367 -24064 -46442 -66805 -27569 6840 -4205 -21286 -42877 -35290 -9083 -12670 10902 36725
10355 36725 37768 9682 4712 19982 66844 59770 39621 39685 39709 32373 4805 -3021 10283 43713
10341 43713 84607 93942 66150 76424 75906 73194 65574 76033 55568 28512 27239 28183 20291
10328 20291 18118 13385 31828 53444 2537 -23058 -14474 -15359 16620 20070 12939 524 5396
10315 5396 5553 -16345 -30900 -29399 -12840 -29031 -31921 -56233 -68686 -55108 -22599 5786 1574
10302 1574 -3784 -6050 -14916 -21428 -22003 386 -16292 -25419 -153 29585 10359 12550 12343 -15032
10288 -15032 -24448 -13479 -38332 -23014 12039 32163 3869 -5083 8382 -421 -19120 -26449
10276 -26449 -6619 24935 19479 -795 -16655 -3365 -2829 -3578 -13266 -21641 -37406 -44192 -35949
10263 -35949 -27774 -25708 -1779 -5355 -6837 -18620 -35666 -38329 -49933 -78360 -82816 -58773 -21019
10250 -21019 -15420 -22980 -23904 -26525 -16926 -20461 -1150 -5342 -10819 -2947 -31782 -34653 -10682 -13894
10236 -13894 -14730 1985 -1544 -6886 -27199 -29826 -21112 -34863 -45685 -34575 -31940 -35547 -32002
10223 -32002 1990 33924 45743 25748 11225 9526 -6527 18441 34918 -25655 -34237 16816
10211 16816 12928 19893 10883 -12041 -8786 -5701 -43247 -72230 -39811 1199 41944 31248 -4030
10198 -4030 -13508 -25529 -56643 -71172 -42112 480 -1743 -30991 -36468 -40315 -35803 -31735 -25229
10185 -25229 -31090 -34490 -24295 -25619 -23845 651 -9814 -55953 -56211 -53211 -65867 -52838 -20577
10172 -20577 8793 29101 -1300 -26195 -25841 -36059 -15161 6935 243 -17849 -53555 -41959
10160 -41959 -33632 -13965 13888 28205 42879 72191 66593 32988 22785 61851 80098 51274
10148 51274 28928 18804 10034 10649 7051 -6388 -18542 -17313 -45592 -61224 -49862 -20384 3275
10135 3275 3877 -25102 -32759 -42062 -27565 -24808 -15440 -7040 -12089 -57790 -55831 -6319 24416 42906
10121 42906 16602 4812 29737 47442 41663 32408 31339 14714 30331 21984 2740 -1437 1207
10108 1207 -18902 -31959 -54610 -29081 18247 53933 29688 21445 14131 -1585 1657 28185
10096 28185 16351 -21104 -18729 20123 5096 -27919 -42044 -38852 -14696 -24769 -31839 -28966
10084 -28966 -25693 -32952 -42694 -39753 -33251 -27913 -25498 -40955 -56549 -30062 -33868 -36632 -24429
10071 -24429 -2812 -33174 -71277 -36910 -9875 -9379 -10965 -25122 17068 40613 12620 9050
10059 9050 2980 -7799 -36800 -31160 18960 26628 36006 24711 20922 41832 73511 71045 83508
10046 83508 136820 173730 159107 103241 56346 -2230 -14729 -5103 9243 -10424 -61628 -78203
10034 -78203 -56137 -39481 -13298 -28742 -59168 -47762 -46561 -54848 -58807 -38122 -51758 -58546
10022 -58546 -36115 -36916 -41080 -34966 -38627 -36724 -15040 -26459 -43481 -56721 -31441 5282 2744
10009 2744 -23823 -42825 -30234 -30105 -9859 41047 28540 12874 29992 55240 69541 34258
9997 34258 7948 -1251 2024 -14556 -26009 1559 11172 -12207 -26815 9003 47264 56543 58057
9984 58057 33952 -3690 8519 -2011 4614 17358 -5927 -43722 -51216 -27492 -9534 5419
9972 5419 -31329 -16052 -18496 -24296 -3745 -7922 -8846 -11361 -6754 -20086 -40991 -46029 -25063 -19719
9958 -19719 -16138 -5231 -21788 -363 7982 14076 26458 3999 -31811 -60931 -72134 -65872 -61844
9945 -61844 -40420 -17129 -14098 -14205 -9693 -17161 -36593 -9563 -6504 -27318 -6689 -10090 4285
9932 4285 4621 27029 14428 25784 53802 49179 25900 21102 19026 1592 4672 -18720 -30849
9919 -30849 -33632 -22069 -36965 -32265 -5588 -349 -9003 -10930 -42230 -21148 928 -29960 -48586
9906 -48586 -39932 -25218 -8240 -21246 -35301 -23384 -8416 21313 35602 31607 -3327 -21571
9894 -21571 5164 -2927 708 31228 42682 30692 -11180 -40080 -51668 -12382 12254 -8195
9882 -8195 -30940 -47298 -52136 -60462 -65276 -51383 -39931 -27492 -25494 -51801 -67843 -55887 -53405
9869 -53405 2973 46524 48572 53571 44394 30019 47739 69662 58977 35396 24199 13599
9857 13599 15044 3434 -27616 -35902 -5830 41893 84453 100427 80374 55469 42019 57205
9845 57205 86004 86544 90352 73206 40161 25903 7131 10418 7841 19290 16451 11690 24110
9832 24110 25626 5017 13564 44594 68722 57076 47895 83426 117328 138849 161771 183220
9820 183220 202027 208958 241121 298633 350404 430448 533354 704465 955886 1368490 2077248
9809 2077248 3121718 4278712 5137436 5564034 5578758 5206166 4463869 3426326 2387890
9800 2387890 1643000 1142751 834717 686165 549178 468393 443910 422490 389996 394856 444805
9789 444805 564175 831322 1267013 1618313 1539851 1093930 728000 516693 347179 226391
9779 226391 153279 129624 81028 57608 42064 44898 52115 96709 110902 93420 74703 43280
9767 43280 35392 61770 89610 66614 67486 52931 49345 51299 40451 57294 68591 88071 68510
9754 68510 77648 56370 42709 49901 25067 27269 8475 -1057 3063 -8918 10933 41084 13279
9741 13279 -14887 -9315 4090 708 9942 18454 1406 -20727 -27741 -21145 -2651 21399 9806
9728 9806 -22511 -21410 -28733 -16231 2129 -4627 30634 44821 12752 6826 34694 35576 41895
9715 41895 25840 17544 12407 -2772 16571 18912 12115 26712 7920 14959 7124 -10642 -38793
9702 -38793 -28084 -2306 23618 -121 -14434 -1598 4915 15873 15458 -1226 5313 20987 6379
9689 6379 -19494 -45636 -39286 -30540 3089 -4819 -27331 -32939 -30671 -42861 -8994 10053 41547
9676 41547 44576 21487 16365 12286 9172 -11102 -15036 -7596 1664 40156 62178 49813 44872
9663 44872 14568 -36691 -36827 -23170 -27639 1163 20359 1368 15370 19262 1032 916 3566
9650 3566 9219 15091 7726 13967 7692 -16391 -21921 -19920 20684 50625 52025 26155 -39064 -37849
9636 -37849 -19305 -13917 8691 -2151 -13840 -1338 38187 38664 7439 -23206 -20395 -16890 -11659
9623 -11659 -12132 -18030 9991 -3938 -8156 -20267 -43251 -44065 -26009 -13310 -15963 -8119 10694
9610 10694 12320 7845 -14609 -35587 -44239 -34112 -30393 -42264 -47601 -45309 1799 12634 4138
9597 4138 6388 4717 -21205 -20526 -2142 7051 -6091 -47772 -69153 -75673 -98609 -77061 -38061
9584 -38061 -18195 -15476 -43758 -62282 -61109 7378 47268 57282 15565 3530 -1570 -25087
9572 -25087 -57715 -46940 -25093 471 -9063 8024 46661 45860 8534 -23457 -10950 -33105
9560 -33105 -52477 -50681 -43174 -43189 -15143 2693 -12754 -50084 -68810 -66577 -59812 -52622 -48732 -43681
9546 -43681 -29509 2845 -5278 -1433 14333 33822 40777 47201 50431 38806 5574 -8707 -18951
9533 -18951 -4435 10351 -1836 -21699 -3059 31803 2435 396 6858 15112 6857 15256 12349
9520 12349 3983 4518 45263 50829 58522 44836 34356 34946 23070 32458 64841 14899 -5962
9507 -5962 10448 13294 1984 -29226 -42003 -33733 13003 33757 43751 59249 46537 67879 79143
9494 79143 56738 33231 34788 37254 16209 13458 9574 -3173 3066 24560 11064 40561 50127
9481 50127 36043 21871 19498 31990 28726 25687 7303 -20812 -3309 -5333 -6713 -14828 2576
9468 2576 6060 33563 40012 33762 47766 60029 94800 107899 100690 83040 62236 58287 52615
9455 52615 59188 51848 36842 60759 84136 75004 37607 24017 -1204 -4557 10270 27046 28505
9442 28505 37018 20909 32099 18092 -6481 -5401 -12012 -8346 14116 2476 2942 -21568 -8803
9429 -8803 -18813 -1501 25120 23625 30808 25306 46977 89063 87437 54614 71985 76795 61445
9416 61445 44884 40492 42478 17262 29476 73249 63993 60538 66168 103091 111537 100626 76744
9403 76744 59127 55903 64882 69811 79393 92763 96180 97414 95535 99839 78375 87093 106952 114836
9389 114836 79995 48288 52901 31918 12063 28065 19747 17782 11421 -2613 5635 35830 62365
9376 62365 89630 95446 68538 66269 43775 33566 42056 39187 54523 99767 97510 95707 89988
9363 89988 51911 15615 34922 67817 55225 45259 36513 39787 78867 85023 113087 138665 113452
9350 113452 45670 26575 34800 45105 41129 28425 2584 16210 28038 35601 51159 69361
9338 69361 54694 52700 39514 36458 32953 17890 136 24149 34622 26238 9845 34098 53273
9325 53273 39635 41611 43970 39182 47448 51467 48904 25364 37808 63965 57454 38281 37247
9312 37247 35664 55480 59223 70200 70350 74051 50665 36700 36385 66216 82741 116323 159120
9299 159120 166359 154232 172249 176095 162675 141705 158160 154632 159882 161102 160178 129570 126378
9286 126378 112996 120096 127640 116003 105036 77018 61717 33607 12778 8045 533 -10774
9274 -10774 6072 36155 824 11193 53704 61203 46803 76773 77856 70758 92513 119698
9262 119698 107386 122643 157714 178258 217200 295802 351293 385864 414188 433950 423956 388971
9250 388971 346091 321909 313818 296633 302847 319626 312131 310727 284395 294966 312971 304011 277439
9237 277439 283679 295913 277242 268743 269617 296896 306424 318338 304181 288838 270118 234698 219808
9224 219808 209435 209845 209822 191222 170881 198244 189392 176458 184245 238118 319764 380509 422201
9211 422201 445704 444523 459182 510666 566866 601903 625134 640251 685076 716239 790195 856317
9199 856317 873895 882171 862276 830010 812958 818314 790141 724154 649689 604977 526177 444267
9187 444267 364835 323983 327295 367902 381443 412735 446820 492762 503867 503947 517320 498355
9175 498355 479824 489119 532483 524164 489041 497593 498973 498769 511615 507127 560296 622060 739074
9162 739074 858465 968599 1066594 1133175 1234193 1395288 1570369 1776769 2031285 2277604
9152 2277604 2504132 2790390 3183774 3736535 4530682 5611571 7070026 9064010 11593281
9143 11593281 14335155 16423311 16916172 15541710 12967686 10272910 8040705 6336443
9135 6336443 5098723 4214959 3566987 3036018 2570556 2214059 1894580 1636891 1434862
9126 1434862 1284881 1136588 1023720 928069 844773 742642 648356 596777 547155 522589 500940
9115 500940 505759 516224 514522 464420 402294 374612 405196 474081 524034 550214 588293 589619
9103 589619 557952 518364 458200 449416 476244 501919 532478 570219 550309 484984 408931 362123
9091 362123 333535 280215 236834 237311 256067 258232 252573 267124 267507 236633 219119 225355 203940
9078 203940 181234 138129 101156 82077 118809 133875 147467 156344 135718 116830 126383 115818
9066 115818 115809 117759 99270 89938 91403 96228 100982 86458 103759 121397 139329 141720 176606 185699
9052 185699 139347 110246 114973 115801 99171 100731 112735 105845 120465 151505 188732 196492 206903
9039 206903 179199 172043 166120 159421 125262 109135 120649 125629 127540 114713 133151 163906 126465
9026 126465 107273 112502 99777 104799 106684 88192 98452 119385 114929 146618 160711 134155
9014 134155 124102 145596 142143 120853 115147 104546 83007 116155 113651 99752 114901 110019
9002 110019 104171 115796 103330 125627 151885 171983 198810 185297 170027 181833 192834 156048
8990 156048 158886 163007 168030 196898 217314 212950 184563 181039 211949 282074 282770 260999 222427
8977 222427 197426 202455 200484 185942 155618 154907 132387 118945 105818 106204 109698 112099 118061
8964 118061 120674 141328 148405 149530 152898 139231 119813 120562 124145 133859 120972 98657 103495
8951 103495 106050 92988 94462 89390 116137 128218 134007 174929 179855 199061 249884 287357 292135
8938 292135 322193 345839 352288 312089 281747 265768 240412 192441 175603 180944 194568 242658
8926 242658 249474 260062 263773 248151 251467 257816 235323 178226 187220 219865 245770 225915 208527
8913 208527 206243 194239 179373 185119 181902 170949 183603 222932 224423 179369 130499 117989
8901 117989 142554 169797 178393 167523 163005 218038 240011 234896 216910 244069 224525 188546
8889 188546 169594 173567 140574 97755 93087 104740 93208 108252 125003 145414 132703 163647
8877 163647 193549 197295 212360 275377 330830 329771 276260 212234 196195 180677 156434 155577
8865 155577 136971 128253 148039 121524 112967 97864 97552 117695 125020 129737 89743 77059 90098
8852 90098 91209 78999 73547 86009 87424 85553 84666 103558 118950 123858 111412 125950 163850
8839 163850 212226 208017 182686 165505 184512 222060 284431 341613 406865 492571 589285 670931
8827 670931 740983 782762 769401 761583 711257 580746 488444 408363 349768 321193 278011 225303
8815 225303 200483 218394 234465 205466 172030 144021 124434 140108 169330 179831 162481 182164
8803 182164 205108 219197 260554 310841 331971 368134 387219 474835 573872 693413 834939
8792 834939 994247 1214696 1433705 1634558 1812400 1905184 1974567 1990965 1958290 1856923
8782 1856923 1736982 1617013 1536931 1484909 1451585 1368246 1275895 1173072 1059837 989220 884323
8771 884323 764158 648650 571625 537798 476133 440890 435503 418754 410055 424300 449769 485192
8759 485192 504103 514984 559704 635262 693825 743008 764361 791895 796233 763283 724053 764752
8747 764752 823266 866622 924899 997473 1077407 1161282 1236977 1318374 1473639 1669229 1891866
8736 1891866 2048165 2157693 2185227 2192485 2182826 2145316 2086745 2010894 1881906 1696890 1478211
8725 1478211 1235796 1035428 912924 824319 748215 668146 614861 570149 520885 452239 444437
8714 444437 409655 377497 366300 329984 315146 314635 296818 258861 256012 312869 333588 339214
8702 339214 314633 284641 318594 341926 403657 482701 562909 628872 665390 756600 870701
8691 870701 988030 1124043 1219158 1278795 1304057 1290445 1244758 1281244 1286061 1185672 1029553
8680 1029553 853286 717816 657919 596419 517556 445738 410128 382399 357735 343223 333953
8669 333953 317253 289493 261095 228015 248624 272574 281151 266176 227538 207823 175746 146841
8657 146841 102450 101970 137050 142633 138190 152216 159612 139971 154070 181183 204732 248144 254932
8644 254932 268453 338522 390484 423696 433662 413332 377551 328926 285505 262465 241266 178081
8632 178081 159241 182965 165365 177826 198857 220839 240848 229008 232550 241594 256816 270548
8620 270548 264560 268309 241024 252984 211244 186066 181722 175751 158480 165086 142804 127848 94383
8607 94383 93496 92699 81153 92744 110293 114174 108496 124465 155900 172459 173152 169282 133370 144862
8593 144862 174808 196575 194304 204565 177699 142937 179119 207792 208248 167435 183994 158489
8581 158489 126530 137026 127956 153822 164293 178173 165183 145891 137066 127174 116436 118538
8569 118538 99291 41919 1285 -7629 10703 42659 49740 23443 6597 5138 34034 31011
8557 31011 45434 34801 2734 -19499 -19413 -15803 -32013 -33295 5739 29667 5938 7884 -576
8544 -576 38294 91069 76266 78328 67863 86594 97198 94603 124183 135104 108362 104773 134747
8531 134747 114679 104543 63472 31087 38894 41133 31894 11634 16507 23432 43846 43828 36338
8518 36338 7293 13728 10651 26749 30541 30669 26533 33878 37704 37020 12032 -874 -542 -3533
8504 -3533 -7719 4683 31886 33837 46791 61540 36486 10209 22477 24272 56816 104748 128409
8491 128409 109557 82417 78408 77085 64081 47359 51034 39989 32280 25498 34937 7330 9333
8478 9333 2368 3423 8134 -2269 -21155 -10676 22261 47121 47545 58681 42983 9330 -8857
8465 -8857 5220 30745 79445 102604 66540 43730 49473 31766 22824 24655 52075 46852 32005
8452 32005 30418 11716 9485 27100 32155 49773 33173 6864 2738 -12139 -4806 5809 41661
8439 41661 81841 97548 103456 88082 95168 93225 104303 82340 60075 39852 51345 41000
8427 41000 52484 64030 65780 31105 28137 31119 50594 65773 69235 63945 87292 75903 50461
8414 50461 60768 62524 31365 -1317 5427 28186 28499 33755 40635 49519 37198 14678 4113
8401 4113 -16785 -22567 -5558 17847 23757 18089 39421 27868 20071 39532 33369 8185 38838
8388 38838 80929 100111 98929 89705 95554 95781 57491 37064 38666 44165 52742 25421 -4334
8375 -4334 186 -20389 35699 56234 39928 23596 16073 43221 31459 7112 -20064 -51991
8363 -51991 -19541 12557 44717 16147 -12843 -19030 -8654 -4042 -5936 -4662 -31516 -50967 -19239
8350 -19239 -11373 -18010 -4440 6036 -1572 20463 30215 -2067 -17297 -26527 -11094 17594 52887
8337 52887 41455 10937 9012 5446 -15847 -22625 -30706 -18681 2134 19520 10899 20031 25974
8324 25974 7417 -4379 -12931 1324 -3179 -16557 -36759 -5295 -12480 -4981 5926 13717 -4486
8311 -4486 -7147 8378 -2759 12029 42740 32114 7471 9651 -8529 -19647 -4595 -12402 -29092
8298 -29092 -10554 44832 49216 21244 -15210 -51674 -39382 -30615 -12220 -4759 -1636 -4965 9342
8285 9342 6396 -5628 -5347 -8067 -24124 -16756 -5324 -1177 28131 41908 55374 73887 90349
8272 90349 91692 105391 75806 43924 18667 -2349 -9160 -5737 -10528 -31073 -27733 -20836 -19723
8259 -19723 5207 13718 51616 78992 38894 22771 32843 49208 36046 9861 -268 8964
8247 8964 10802 2559 -31871 -39094 -16365 -6878 -2892 2943 -16455 1023 1545 -6767 -1881 2001
8233 2001 5090 -4933 -17550 -16489 -48069 -37676 11348 17373 -8054 -2418 -25127 -25089 7209
8220 7209 19250 42487 39929 38810 46021 60253 46315 23328 9915 -5743 5903 11834 34352
8207 34352 43679 60796 67349 62054 23400 30408 56977 46758 23438 32154 53662 58692 33854
8194 33854 31567 32957 16010 -17160 -42068 -4401 48207 62608 35221 20703 12480 19392 33076
8181 33076 20402 7889 27605 7050 -16887 -19179 -12618 -17851 -28307 -16332 17446 32436
8169 32436 10323 -5181 20662 29414 51050 44562 56303 61681 57690 71383 62815 44804 28185
8156 28185 14276 14302 44158 59467 62801 36628 14382 10073 15861 21472 14248 9235 1233 35925
8142 35925 63371 61463 45583 41967 46254 54059 63251 57400 36768 32913 35377 15703 12874 25001
8128 25001 36678 97149 157647 167678 165586 157479 188861 234497 282936 386168 449358 531030
8116 531030 690961 911386 1188267 1540428 1906519 2209320 2414621 2499897 2452500 2246293
8106 2246293 1922273 1524683 1136807 836368 637831 517197 440986 392662 330286 292834
8096 292834 276305 264707 262986 250077 247599 246867 222507 186627 150613 156612 209186 221812 253605
8083 253605 272129 290789 331720 377111 412621 422034 423556 436541 468629 515041 600118 738909
8071 738909 927605 1192310 1582539 2139166 2901609 3787923 4608678 5009066 4795837 4111836
8061 4111836 3309185 2607017 2053991 1637105 1319851 1071299 889774 751983 639112 533446
8051 533446 472705 413731 374444 317560 292429 276291 271229 250204 218491 220974 231608 245494
8039 245494 270691 282658 293353 354625 421402 503488 592292 568552 487571 415647 367896 385375
8027 385375 438124 528263 619756 713772 891942 1120413 1335600 1507313 1618566 1674315 1686157
8016 1686157 1618638 1466318 1246521 1030268 846049 678580 536582 442936 363403 306227
8006 306227 265503 244500 197396 157917 157786 167351 156042 134580 116936 93818 101868 96106 77977
7993 77977 112869 117543 99939 139595 181587 180566 170415 164104 168656 152536 144489 130968 131901
7980 131901 123375 115561 131939 105344 77143 73047 93056 125299 154760 204658 244311 316406
7968 316406 406223 459707 445962 402670 399096 357762 272102 237205 216827 169765 126374 95087
7956 95087 66645 53914 49083 62166 45741 34972 42856 42176 59083 56547 68489 46031 44332
7943 44332 66196 61652 57157 33514 43821 59493 55292 55182 68941 79809 75415 79355 75272
7930 75272 63657 97478 133151 162618 223875 303695 403008 521586 657543 753256 814956
7919 814956 770613 646029 543403 410769 306558 224236 200846 163531 133770 106031 59219
7908 59219 51225 44540 57267 59859 49849 45945 42621 72129 68509 21576 -6440 13741 38573
7895 38573 12700 2113 5708 10781 -1384 10480 25721 36205 53065 80963 59171 33979
7883 33979 44367 58763 104781 133322 157008 214787 244034 268323 289043 307793 293322 266008
7871 266008 226738 192224 163190 107371 64025 29000 44628 62796 77777 73585 24121 16698
7859 16698 15809 -1330 -7741 -8354 34641 54843 31777 -1057 -15668 6424 -4444 7837 -3659
7846 -3659 -4930 -5754 -35147 -43683 -34490 -27742 449 4898 6036 13772 29146 32907 17098 23158
7832 23158 7187 -10840 1778 8893 15452 16106 51718 51721 28277 5188 604 18531 13566 -5721
7818 -5721 -21530 -47023 -55325 -24169 18327 30028 17642 -2916 -20035 -30151 -21368 8411
7806 8411 -8185 -13364 -6298 -26268 -10479 4127 26339 -12260 -15020 10372 21943 -8943 -23803
7793 -23803 -21400 10290 16571 5372 -999 14487 3237 6781 -7521 -9817 -814 -6369 -9598
7780 -9598 -24047 4384 12804 6384 29376 34939 21237 9731 18150 -107 -27123 -9658 -14832
7767 -14832 17080 14645 6677 -7450 -12324 -8742 -12198 -9808 -17949 21492 68199 91234 73710
7754 73710 60537 54357 40169 25855 18809 13822 20339 36189 30431 4552 -16810 23166 20886
7741 20886 14370 -21404 -46300 -20934 -17550 -19448 -15943 -15541 -10142 -22768 -36712 -16712 -8023
7728 -8023 -16401 -25721 -38734 -6527 440 11616 6510 23950 3618 -17008 6266 -458 -29811
7715 -29811 -20203 -25798 -38133 -37358 -13083 8996 6559 2102 -16308 -63772 -64631 -85126 -67045
7702 -67045 -61130 -36345 -42455 -32623 -24345 -17364 -24389 -59927 -76207 -52407 -8206 5153 2978
7689 2978 -10036 -21768 -11229 -14234 -16807 -42575 -29674 -24532 -33166 -17121 -21810 7577 43662
7676 43662 61838 16541 -881 5049 -25375 -14024 -22445 -15574 -10647 5858 19621 59401 68101
7663 68101 12810 7518 8923 5292 -19191 -28479 -19135 -8634 3846 -7898 -5781 10480 12637
7650 12637 22267 7655 7797 40892 59510 32420 21818 21516 -3059 -3469 -189 2268 -1043 -13544
7636 -13544 11044 24995 18966 25063 36325 35448 5531 13223 34984 56606 81490 53476 43400
7623 43400 21721 30492 30424 19357 8871 46962 40792 4686 11832 8840 7708 35507 40250 59488
7609 59488 64513 50250 36051 -10363 -33813 -1858 8070 -9975 -26527 -30535 -46429 -55864 -31240
7596 -31240 -21806 -11157 -18253 -5040 -1948 8535 -7731 -35354 -48209 -44134 -57002 -28721 -24023
7583 -24023 10727 48640 43627 20129 10034 16167 36671 45940 24121 -2622 7684 21317
7571 21317 35079 17443 33739 13959 -4879 -18755 -31673 -33368 -24880 -11504 14662 25804
7559 25804 13916 -34195 -43242 -50870 -62722 -55264 -29147 19489 25748 1523 4675 10470 20798
7546 20798 33795 22746 21763 -4600 -25308 -33874 -4827 18681 29219 53046 73573 60806
7534 60806 41189 8224 -8559 -8345 -5706 4195 3319 17274 10811 27111 26386 26643 21838 42115
7520 42115 30976 21789 23016 36247 58165 68727 25233 9687 18549 21030 -4443 -10781 4399
7507 4399 2860 -14508 -32529 -25646 15612 27815 34862 54202 16696 -5168 -6291 12410 26567
7494 26567 34182 12869 -4224 -11169 8343 7870 -9073 -2906 3512 28523 42210 45380 38466
7481 38466 2069 12874 53576 28227 -3611 901 5037 13614 21361 13400 16084 8095 16753
7468 16753 14889 3330 -27394 -13187 6685 26533 26521 12736 -2011 8367 30407 24228 5669
7455 5669 9246 -6944 -31315 -17875 -8135 17962 4207 -18511 -6590 -14146 -10587 9066 167
7442 167 -28416 12470 28496 14022 28604 18013 -770 -12614 -16969 -24230 -30800 -5206 -10425
7429 -10425 -12813 -17325 -20658 -9089 -14459 -992 7168 18122 23829 10238 -13793 -8302 -16020
7416 -16020 -15956 13728 29547 16742 23164 1604 19669 -14166 3218 25976 26252 32180 15409
7403 15409 -8859 4195 18376 7717 8096 17409 41049 43320 38653 15436 -4979 1007 22204
7390 22204 34507 12414 26229 -1489 -397 -1576 -12053 -3930 -4535 -17787 -16478 11882 11010
7377 11010 -19861 -31957 -42915 -41798 -51580 -66880 -38769 -3858 1511 -13848 -29018 -21980 -36357
7364 -36357 -38361 -31869 -22406 -31474 -37450 -13091 -17613 -18462 2302 1534 -1381 -24767 -42026 1464
7350 1464 5624 -3808 688 5010 27923 39259 45220 33815 27081 15232 8181 8646 5172 1938
7336 1938 35045 39313 24953 27819 22220 33533 47783 36915 20247 -2317 -23857 -958 -6796
7323 -6796 17386 -3395 -32548 -11344 11481 18151 32513 39535 52780 49994 16926 11356 -417
7310 -417 -17514 -30007 -16084 -13697 8192 25676 28014 32016 14251 -7681 14613 17181 9458
7297 9458 10355 -24210 -38383 -52164 -38892 -11452 1027 -37809 -54093 -63334 -48635 -7018 12010
7284 12010 1191 14879 17012 16494 -16739 -30131 -61089 -90690 -61345 -50262 -59720 -19487 5498
7271 5498 14101 14446 31377 26314 11305 7361 -3505 -22445 -45297 -35928 -9981 -7485 -20802
7258 -20802 -29556 -25458 -18563 -22814 -44336 -37617 -10452 -20142 -12030 -34260 -58762 -21066 20758
7245 20758 22045 -19358 -48414 -28608 4421 -10576 -8004 1979 -13128 -26429 -26992 -41112 -42397
7232 -42397 -23495 -14439 -20743 -4798 -20994 -25541 5469 -6031 -5429 32268 4695 -24428 -29211
7219 -29211 -44691 -41857 -13519 15773 472 -16481 -19550 -8327 938 -24464 -67047 -41392
7207 -41392 -11988 -3690 -14188 -23294 -25899 -41147 -54996 -50537 -35383 -28730 -4377 -8464 -3536
7194 -3536 2120 12183 7538 10556 38610 56080 41473 29115 -7226 -20204 -31660 -29607 -39801
7181 -39801 -39989 -53331 -50789 -21693 -39901 -44663 -47831 -52365 -54567 -43096 -35428 -23216 -29307 -24359
7167 -24359 -11533 -34889 -34351 -30442 -35061 -27178 2848 38588 30343 4777 -33549 -46067 -20626
7154 -20626 -8215 -20377 -31881 -34639 -46271 -42089 -45381 -59945 -63746 -84118 -61834 -42522 -30977
7141 -30977 -12295 -27619 -32360 -10456 16958 2817 3083 -11254 -12301 2233 6055 3239 -16333
7128 -16333 -32444 -12024 -19818 -9477 18031 30216 52580 36148 1432 -11183 -12417 -43635
7116 -43635 -30202 2024 239 -5497 -8470 -20865 -18222 10861 25527 17318 -32501 -33629 -19473
7103 -19473 -20293 11998 41950 56597 34310 27582 -15971 -13053 -13815 -32020 -25335 -34798 -27944 -10665
7089 -10665 3021 -7390 -3699 1502 -14063 -2860 -33361 -41333 -15361 -13875 -7509 -16466 -41437
7076 -41437 -60540 -49993 -22384 24759 43089 27386 -264 -3054 -3707 -18819 21706 21977 15580
7063 15580 27982 12577 -60 -2148 -12562 -20012 -38790 -30303 -27367 -28518 -33881 -26386 -28998
7050 -28998 -23077 23322 21314 -4329 -27742 -36631 -49561 -40256 -46159 -66451 -51388 -36443 -54487
7037 -54487 -55060 -50329 -50080 -37368 -24803 -15546 1906 11891 33192 39670 56978 58230 -4978 5947
7023 5947 22881 24503 47380 48722 55985 27903 4086 -19236 -35474 -16889 3425 20764 24347
7010 24347 20975 12145 7610 6252 3607 -1515 10777 12192 -5389 -12099 -18253 -23795 -8805 17371
6996 17371 30343 39199 38609 28661 21842 -7278 -26743 -7175 3422 10316 29232 56228 54100
6983 54100 8877 -30188 -37373 -35047 -10824 12189 10986 -4387 -13138 8090 24369 -15213 -12187
6970 -12187 -21182 -29712 11584 37688 21830 21895 23963 28305 496 -16664 6582 -2762 -19370
6957 -19370 -15769 -22692 -16178 -20186 -13090 -10439 2473 -6707 -19641 -50048 -83678 -77610 -39899
6944 -39899 -2001 11973 -759 9458 -4462 -6035 -6351 5970 17351 26877 32084 43536 30111
6931 30111 547 -11877 -7496 -21613 -44802 -50353 -44720 -65314 -47928 -39682 -56861 -40154 -25896
6918 -25896 -22979 -7865 -29239 -43856 -36875 -43424 -24107 -15627 -11172 -52189 -71086 -49392 -7949
6905 -7949 -25439 -29882 -21635 -32215 -43798 -39240 -40728 -44722 -13256 -1001 14135 -8870 -3050
6892 -3050 -34486 -36079 -15851 35643 49055 16913 -20315 -18010 -590 25571 24876 -5354 -28283
6879 -28283 -22145 -21197 -27766 -9377 -25643 -13612 33887 42948 5568 -15313 -18727 -25971 -29274
6866 -29274 -9954 -16297 -10220 -17014 -2693 11639 17094 6136 20633 50568 16136 7658 2491
6853 2491 -8329 937 -7090 -8404 4522 -3434 -23108 -47461 -66835 -80148 -81872 -33941 -24565
6840 -24565 -51201 -29349 -29126 -56513 -50840 -15669 779 4183 11256 12099 49038 31285 -1557
6827 -1557 -9545 -5547 -16017 -4422 6566 -5306 -10580 -31360 -19670 -38344 -42352 -17411 8890
6814 8890 11783 8419 -21168 -20236 -7803 -7943 5481 23017 36669 23909 20957 24449 7086 20562
6800 20562 57341 56816 25328 12119 19947 11438 17951 21989 12423 -2227 -20090 -15517 -2583
6787 -2583 8238 4446 44794 44975 43985 36276 27906 36100 -9155 -27894 -23773 -6152 -8 1849
6773 1849 5524 -2340 -5590 -11204 2296 5176 -18616 -10908 -24790 -19727 -2605 -5592 6134 7779
6759 7779 12998 2703 -16059 -26697 -21013 -22724 -26713 -8990 24462 54509 24926 -10026 -14253
6746 -14253 -7226 23818 57312 27172 14373 20078 53895 27595 6946 1386 3778 -2051 15207
6733 15207 48542 39188 29243 26902 37111 43484 66621 100402 142587 206093 254922 376446
6721 376446 525597 743493 1056917 1370370 1449945 1187187 812841 543840 372033 244244
6711 244244 183230 144503 134096 97273 74824 69907 84470 28860 5637 9909 34996 34887
6699 34887 14633 13614 45553 57861 43428 64989 66652 31777 26700 7989 -5260 -23440
6687 -23440 -23770 -39531 -33316 -42221 -44814 -33538 -1465 21215 38320 17059 5008 16922 33803
6674 33803 32553 -3540 -4537 10605 11542 -11513 -28015 -4040 12208 -8221 32480 49809 15202
6661 15202 -6414 -2649 -21092 -30140 -15807 12834 18213 2134 -25063 -30911 -34856 -18619 3164
6648 3164 -4593 306 4742 -818 21534 41238 35598 5002 -4644 -10496 -37463 -49576 -23253
6635 -23253 15603 24394 -11105 -15931 -3161 17946 12000 2633 28 14916 22568 8654 18943
6622 18943 41781 48239 38659 -8513 -834 19305 3676 7931 5475 16638 36786 15287 23316
6609 23316 44493 54324 60816 66184 59935 42661 45683 17319 8044 32391 30429 -804 5957
6596 5957 5448 6322 -10516 -12341 -9981 -440 17741 47181 47607 46090 45813 31529 -3588 -423 4243
6581 4243 8566 13611 7529 -19501 -3050 -11718 -39314 -25093 -15874 -25021 -31112 -18175 4784
6568 4784 16412 15406 14760 41186 27519 -18181 -26663 -6007 16266 31572 -897 -26029 -22209
6555 -22209 -12926 25976 13578 16544 -1482 -19606 -9474 -2888 17707 21920 -4543 325 974
6542 974 -21915 -34963 -34686 -31263 -24009 -26866 -11445 2877 -35544 -34201 -16188 -10740 -3412 -13978
6528 -13978 -8910 38134 65620 41401 18651 3088 -28193 -27536 4135 -9847 -18400 -6656 37762
6515 37762 48736 45819 488 -11609 -38360 -58408 -55037 -24024 -11330 1011 8796 -7753
6503 -7753 -23139 16231 34833 41452 43553 21118 19085 -4888 20790 19316 -4637 -48994 -39375
6490 -39375 -18158 -20166 -11595 9950 -8941 -34285 -45791 -33698 -37704 -45176 -7092 20544 29730
6477 29730 21529 53251 63094 55602 58521 50290 17698 -8604 -11254 -7667 17347 32469 24223
6464 24223 13141 7897 -1860 -9102 -28438 -50764 -45440 -21440 10836 -3325 15640 41220 27799
6451 27799 586 1715 1129 19694 45260 51181 37899 15438 13001 4358 -7105 -36860 -48935
6438 -48935 -51249 -30123 -1087 13373 55808 64901 39624 42348 50481 51854 47669 1615 -18344
6425 -18344 8765 32321 48064 41351 34101 7783 11442 17224 -10196 -7714 -10721 -11170 -6719 -30166
6411 -30166 -50629 -39588 -39932 7188 26550 36896 5282 -43212 -50135 -31738 11616 41035
6399 41035 22820 14395 14952 8747 2716 15216 34346 21460 11538 35386 41434 49594 36871
6386 36871 28407 19366 17852 4303 5226 -23320 -27897 -33880 -27781 -37298 -26506 -26075 -25731 -10454
6372 -10454 -5149 17014 -4759 -17983 -14676 -3667 -12802 -32365 -18578 16618 41536 27344
6360 27344 22578 -17023 -50656 -54342 -48812 -49185 -66446 -66065 -53365 -37715 -33060 -42431 -27390 2631
6346 2631 -7210 -9600 -42224 -28445 -4130 23037 43087 13127 -22803 -6699 -6896 -25986 -12306
6333 -12306 43690 67593 27736 9829 26867 29151 17297 18489 -14481 -61004 -72394 -92407
6321 -92407 -68207 -35404 7784 18388 -11764 -22427 -27705 -25688 5394 -1392 -20493 -21174 -3512
6308 -3512 8589 -4583 -22434 -37659 -28355 1532 -1575 -11489 -10498 -13723 -34891 -50476 -18867
6295 -18867 10230 -5360 -32887 -42269 -21847 -39419 -57353 -32297 22175 39625 37918 12747
6283 12747 -21660 -5090 -6270 7521 14873 7790 11428 17734 8658 18791 5191 -2332 36298
6270 36298 59618 48134 22456 -4320 -20067 -24948 -37732 -17782 -18768 -25629 -34677 -45083 -49310
6257 -49310 -40230 -48064 -31216 -18558 14210 11679 -343 -403 -29799 -27737 -12653 10401 34794
6244 34794 12380 36645 50065 46722 28651 29843 1248 -8629 4167 9580 3505 2532 14971
6231 14971 19598 -1842 2495 -7954 -11502 -28281 -18345 -29025 -30521 -23965 2503 25380 3622
6218 3622 -25037 -40473 -69026 -45212 -18307 -10267 -22379 -18244 -6780 -17418 -14162 13612 -7205
6205 -7205 -8590 -1280 1691 12116 5020 -23522 -27179 -27100 -18386 -5905 10801 1122 20523 54099
6191 54099 42893 19743 27058 29211 36426 -7786 -9020 8761 6980 -28040 -21370 -15922 -38552
6178 -38552 -54225 -51124 -33483 -18098 -32518 -44149 -55548 -44006 -18852 6419 8061 -2271
6166 -2271 -2672 -24048 -19605 -11052 -15996 -15074 -13454 -13996 5490 -5647 -26682 -11880 9410 -18043
6152 -18043 -20269 -6482 5188 -5888 -12052 -5801 -10186 -14050 -26155 -28540 -6703 471 13975
6139 13975 21318 -12538 -58270 -16108 17113 14078 -13044 -9813 18121 39781 37621 -8421 -23012
6126 -23012 -33162 -27538 12948 42526 33391 19129 30273 30664 5136 1862 5481 -2675 -10884
6113 -10884 -16778 1911 3256 -2975 -51629 -43950 -17931 -12522 13509 2560 -6344 15241 28709
6100 28709 14513 -10354 18233 45265 50325 30722 -16913 -53956 -62397 -14179 21109 -2969
6088 -2969 11606 40977 35190 -11984 -7410 -26228 -34178 -40734 -42555 -30395 -26811 -16980 -10179 -21186
6074 -21186 -6273 12673 28987 45610 30912 8284 -11337 -839 7625 4292 -9459 -24215
6062 -24215 4250 6130 -2223 -13280 12926 41594 22470 -7277 -33929 -36747 -38686 -32939 -32344
6049 -32344 -11715 15614 12771 -8250 -26043 -8575 3643 -5511 -9506 -7610 8592 2878 9957
6036 9957 16998 -3092 -13562 -41611 -67550 -37528 -40421 -27567 -18182 -17121 17297 37845 2738
6023 2738 1101 556 -124 -692 -23432 -32599 -32519 -16094 -13935 14419 23055 18917 25927 43398 22219
6008 22219 5344 26983 18776 2278 -14849 5500 31644 48944 40584 39264 41186 42867 74645
5995 74645 68407 73434 73722 14446 608 -31051 -5793 37697 34965 21733 8752 4628 22810
5982 22810 9714 -4249 951 32106 26994 19086 22537 19469 8572 2004 14737 4966 -3526
5969 -3526 27803 17560 5384 5763 7806 12226 2875 -21409 10646 32001 34103 22850 -13116
5956 -13116 -15446 -5407 -17057 -4257 7163 16651 37800 37589 735 -9644 -28226 -47975 -28859
5943 -28859 -240 -16149 4345 10850 17796 15350 2370 -6348 7592 -614 -20478 -15235 -12941
5930 -12941 -23061 663 34251 39469 29093 19836 17454 34585 42779 42216 6058 -4583 5126
5917 5126 15825 8474 -4236 -13970 -23586 -40005 -19451 -5068 -10964 -7432 -29362 -70715 -54883
5904 -54883 -35899 -18929 -17296 -26828 -13397 -20146 -36220 -66383 -54355 -31542 -28444 -18170 -11884
5891 -11884 14344 14231 13731 22951 -251 -14575 -49 -11546 -13585 -1488 -17750 -42101 -54403
5878 -54403 -54840 -47243 -21530 -15729 -12486 3006 25797 19868 4327 -41185 -83018 -95547 -49077
5865 -49077 -9933 4883 187 -26858 -27370 -5149 -56 -14300 3563 10611 1329 -1589 -14846
5852 -14846 15659 22323 8224 16817 13720 -5424 19105 54749 72716 56920 34322 19621
5840 19621 -750 -23799 -38884 -38376 -21593 -18538 8681 28782 53145 65254 33115 5725
5828 5725 11122 13484 -15517 2605 45902 40467 20417 30105 30768 35917 51244 32773 -817
5815 -817 -8068 -18284 -11666 -12908 -22630 -21729 -17861 -24972 -43475 -39343 -19383 -16419 -25328 -28358 -14829
5800 -14829 7622 17044 20058 -1043 -22737 -2051 -11744 -24630 -14160 -5279 14334 16439 21030
5787 21030 -6265 -31783 -31438 -29812 -11365 -10899 -5229 -19531 -16322 -20909 -15301 -17479 -6420 48518
5773 48518 50755 14896 13014 -6854 -25912 3074 372 -17564 -15780 -3436 2854 3719 -24482
5760 -24482 -31433 -31300 -25503 2801 1209 18527 38201 22687 20078 15783 -516 -19638 -37432
5747 -37432 -42392 -52731 -2538 32605 28123 7590 -16634 7373 21862 -771 -16605 -11319
5735 -11319 27229 22897 1626 -11010 -32715 -39636 -16254 -11680 -11264 -3909 3581 25645 43159
5722 43159 44749 21916 5831 -14761 -43736 -24478 -9057 -13173 -13092 -71024 -86141 -89308 -75943
5709 -75943 -22823 10583 -23412 -21746 954 -9002 -13269 -4204 -12474 -12454 15625 1687 -11915
5696 -11915 -9703 -33747 -44531 -36737 -12537 23556 9591 -2971 16569 26016 36238 23975
5684 23975 6478 4410 -4220 -12302 24559 16272 16295 -5621 -19153 -21408 -12664 21030 16934 -5700
5670 -5700 -17147 -23249 -11555 -7579 1831 3509 -5854 -16198 -47942 -32297 4850 -3651 -21025
5657 -21025 -15943 -38648 -42423 -24615 -548 2092 -5942 -25464 -16273 -16130 -11147 -17458 -22506 -12475
5643 -12475 6877 -11955 -30692 1026 22386 8446 39804 58985 53851 56965 44486 31792
5631 31792 14840 13772 -17663 -47573 -37010 -7678 -13280 -5401 -7145 16334 52061 34715 -15912
5618 -15912 -12999 -11856 -14953 3493 8642 -2280 -26185 -45098 -54763 -39568 -12833 31388 25377
5605 25377 10906 -29237 -54134 -45932 -26382 -4707 5455 25695 37246 25190 -18388 -31933
5593 -31933 -26678 -54997 -38409 -15729 -12417 -28241 -19277 -23980 -34761 -21950 -17360 7184 -695
5580 -695 641 -4676 -8020 35608 46390 20916 -19694 -2960 -13755 -18299 -3136 -5687 -37262
5567 -37262 -37066 -23992 -10889 14989 -3926 -368 19493 70121 62895 16230 -30378 -59532 -43723
5554 -43723 -2383 22886 9447 2418 -11159 -16590 -5702 -11649 -11573 1039 5263 -8995 -636
5541 -636 -1705 -39 7916 -14931 -57250 -17932 4062 770 2062 17222 15688 -10694 13650
5528 13650 3626 -10421 -23864 -40612 -45954 -34876 -30381 -13075 10391 15112 15411 -8919 -7175
5515 -7175 5794 7564 -11154 -14833 -16736 -45654 -60601 -60543 -49295 -14328 1142 25907 42608
5502 42608 17646 26856 30422 42363 54880 64534 41776 19256 -7934 -3793 -17430 -48900 -63110
5489 -63110 -45216 -36472 -62354 -60784 -62968 -55285 -10275 2045 21769 28084 -629 -38317 -59459
5476 -59459 -22778 -2918 213 13719 13201 2063 -30383 -39678 -19542 -13861 -26540 -33978 -31295
5463 -31295 -34528 -23320 27789 48685 3927 -36689 -34109 -12173 18668 26710 35246 27946 42359
5450 42359 80839 75199 42901 15705 -25622 -42133 -23797 -2004 -2322 -35691 -25777 -48249 -86135
5437 -86135 -49817 -26088 -25068 -25121 -4562 7266 20574 21318 -9638 3572 23386 24753 29768
5424 29768 22310 17305 -3436 -8208 -11081 12533 21192 10730 6541 12174 30719 16762 -10965
5411 -10965 -1475 11404 3506 -24079 -28708 -14343 -10114 20926 48056 37989 -3726 7477 4577
5398 4577 1499 6006 32353 35207 21080 18462 -4541 6751 -5668 -39612 -55529 -44261 -53310
5385 -53310 -42658 -20620 3796 -41411 -66374 -66203 -53433 -55071 -50396 -6724 -1315 -13421 -15383
5372 -15383 -18885 -10945 -11296 -15182 -29461 -23726 13376 38411 17977 3585 9669 20853 8499
5359 8499 -12718 -19967 -6549 5448 -4819 -3893 -17004 1906 -26110 -50555 -25192 -31036 -50581
5346 -50581 -58581 -24404 -24448 -31295 -24188 11494 26427 19972 7723 11845 51764 44554 7287 -22475
5332 -22475 -22052 -2134 25486 52651 52681 43515 28062 38355 72285 62202 36211 28133 -10440
5319 -10440 -26877 -34489 -48406 -50410 -35982 -20765 8099 10769 14294 3173 10217 6930 -11125
5306 -11125 -2958 -6448 7337 7916 2126 13314 18034 4218 21889 12446 -2822 -22749 -41945
5293 -41945 -41592 -28884 -6164 -20067 -55658 -47254 -37012 -54817 -39582 -35606 -34530 -25445 -26894
5280 -26894 -26033 -23874 5735 -20380 -28574 3109 38338 24989 28338 4460 9774 5863 18273
5267 18273 22413 16328 6898 -19894 -36658 -61458 -53713 -37023 7951 42898 45146 30409 37342
5254 37342 58864 9568 -29933 -23786 15259 14697 -23716 -35189 -10238 -20261 -34461 -49252
5242 -49252 -63655 -54698 -34702 -24418 17747 40039 46724 11778 6568 37000 56114 48005 -2012
5229 -2012 -52261 -63377 -40206 -5235 782 -3601 4394 8008 23144 12029 -22393 -45576 -60432
5216 -60432 -45905 -17130 -1983 2146 3056 984 -13049 -20286 -12961 718 18966 20141 35362
5203 35362 -1596 6570 -5078 -1679 34334 56692 45516 10262 6325 23850 -1306 -17543
5191 -17543 -21045 -13333 -12576 -29568 -18921 11054 6174 -21905 -20346 -22065 -8686 -9439 -9492 -11638
5177 -11638 -15822 17342 35212 36383 39780 40462 27328 22419 27885 36690 10690 22284 16062 24966
5163 24966 27574 47921 37766 43673 40149 15494 12107 2012 -16537 -17441 -32993 -25430 -21070
5150 -21070 -28600 -16463 31731 37643 18976 9005 -4946 -37318 -81972 -73273 -19968 30136 33381
5137 33381 24068 50353 72368 59398 20009 13853 -1646 15435 23123 15204 -2456 548 12106
5124 12106 48206 50964 65672 68459 64020 19167 -8595 -21297 -50875 -35136 -6958 -23041
5112 -23041 -19855 -16274 2723 16524 -12786 -15855 -19808 -23152 -493 36847 20047 -16554 -18013
5099 -18013 -53319 -54307 -37201 -30859 -52906 -61737 -58336 -35267 -41733 -48079 -38688 -29484 -44335 -33357
5085 -33357 -24432 -17829 -12196 7499 1938 -17617 -50343 -13272 -12479 -4469 15837 19245 29506
5072 29506 28571 29364 33832 10598 -11301 -427 3851 19720 33597 24826 577 10370 10508 -27420
5058 -27420 -31412 -45326 -32485 -5325 31016 37550 20508 10134 -2542 -9007 -13785 -15395 703
5045 703 -4858 581 -680 5851 -13160 -17404 -18794 -19577 -23783 -17505 -14201 -3431 28576 24199 17319
5030 17319 21453 3946 13263 -3134 -8654 10566 858 33681 57697 33778 20793 -1186 -6038
5017 -6038 -22044 -2836 2299 -13585 -8620 -15135 -38899 -53580 -28354 555 -12939 -22453 10215
5004 10215 27111 37039 41779 31616 9456 5406 -11465 -16857 4466 12959 -10799 -1415 -2499
4991 -2499 -3846 12925 14673 -294 -856 -7942 -2295 1544 -4939 -16157 -2130 22370 44504 40632
4977 40632 16662 5192 -18547 -29406 -14118 -35450 -41938 -48318 -33707 -18398 -22210 1931
4965 1931 4244 -6502 -31899 -51016 -17490 -3883 -4021 -31562 -40593 -29065 -15579 -4817 18883
4952 18883 22301 42366 25916 -2252 -31592 -33327 -16441 -24371 -34256 -39167 -18899 4219 17879
4939 17879 28240 3006 8847 27175 34276 21122 2615 1441 10943 15964 7254 -2903 2857
4926 2857 45330 10147 -25998 -27443 -24909 -17095 9936 -10892 -16349 7989 3619 -28063 -16558
4913 -16558 -6615 1356 5445 -4872 -30817 -51599 -43014 5366 3224 -29147 -40147 -60065 -53833
4900 -53833 -25912 32543 55941 55084 45876 36995 23879 15155 29078 11480 -629 -11612 -22472
4887 -22472 2393 -5711 798 1806 -351 -15354 -13061 -20820 -27672 -20125 -5409 -13903 11168 23150
4873 23150 33553 28363 -4535 -12163 -9743 -11387 5600 -365 -22873 -23324 -7967 -10119 -27064
4860 -27064 -56245 -52106 -68810 -53873 -28716 -30944 -44944 -30430 -1124 -6898 -23175 -31207 -31984
4847 -31984 -47454 -67208 -60809 -43092 -32842 -8300 6953 30730 39136 -3420 -20470 -13134
4835 -13134 -28926 -20069 -13655 34331 74485 84563 89047 67923 12999 -12056 -14901 -31103 -24599
4822 -24599 -9560 -601 -3486 8979 8765 -59 15909 4363 -20559 -35318 -14627 4772 27611
4809 27611 44869 39812 27060 24147 30675 29535 40538 53737 41324 41442 38554 21313 29917
4796 29917 30074 18747 -3078 -30863 -23191 -14626 -7162 -14729 -23203 -8309 -4444 -21878 -38078
4783 -38078 -60100 -38610 -32158 -37879 -31611 1425 982 -40500 -55052 -45316 -56748 -58986 -33784
4770 -33784 -9865 -12325 19280 23630 10876 -7810 -26950 2701 4438 -4753 41694 48222 25828
4757 25828 16019 7244 2002 10863 8542 -3779 -31735 -10665 -21574 -18793 -23049 -35589 -17864
4744 -17864 2750 12692 -16867 -34724 -33616 -30695 2435 12751 3538 -10950 -13054 712 6424
4731 6424 -27133 -31626 -21953 -2898 35092 54337 30591 6131 -17099 -6127 -6094 -3441 6405
4718 6405 16402 33048 51651 33857 24508 13826 -9349 -15127 -12219 14924 23888 7180 6806
4705 6806 17325 26417 32410 15893 -38034 -70082 -29498 -2884 33637 35283 24339 14645 16144
4692 16144 18031 18150 37506 64429 69384 58091 34705 20794 11048 -856 186 -17384 -62614
4679 -62614 -54945 -18786 6289 19675 36365 38479 36223 52213 76805 82719 58575 49775 49468
4666 49468 46566 66021 52755 37392 3752 1119 22447 41516 40095 17696 -15900 -21073 -13878
4653 -13878 -9282 -11087 -13495 -19541 -13181 -22448 9175 20254 23322 -4914 -28905 -34325 -18442
4640 -18442 -16922 -13193 -1992 16028 24914 38577 22865 22329 20896 14896 18472 23048 15554 1483
4626 1483 15261 12948 21112 8688 16192 -4909 -36576 -25122 -8309 35755 32303 18136 5204
4613 5204 1142 -17548 -48825 -43078 -18882 -32119 -25159 -19957 4955 18374 14000 10637 7462
4600 7462 6733 -15184 -29479 -28335 -45300 -24308 4672 29803 21015 22445 54580 63444 42718
4587 42718 24014 -8249 -32196 -34071 -43758 -75191 -59516 -46030 -42817 -31701 -26430 -17259 -22394
4574 -22394 7866 10520 15870 33943 36806 35840 -3055 2199 -6755 -21899 -6622 17034 13279
4561 13279 10827 23904 544 -7928 -10203 5785 -3960 -13580 5105 -10079 -3111 10272 8888
4548 8888 3843 18109 -2707 -13662 2262 15274 25924 4572 -13670 -24555 -28964 -32864 -35138
4535 -35138 34478 70156 57828 49561 54493 40194 26534 8734 -16874 -24291 -14970 26139 32850
4522 32850 19421 -7648 -2158 16684 40360 41016 23016 18999 -14725 -24139 18323 -431 -12721
4509 -12721 -49245 -55448 -43795 -19895 6197 32549 24715 23943 32792 6949 -11160 5532 25400
4496 25400 31310 36740 59649 73338 48368 23153 31536 13835 12454 -23073 -42786 -45045 -18929
4483 -18929 -2199 -13273 -35081 -33796 -28640 -8106 9554 5544 17202 33582 19207 26025 40518
4470 40518 28031 21665 -2676 -27359 -32261 -27283 -10054 372 6905 23614 -1721 -5197 22082
4457 22082 10920 26513 41851 33910 29182 14990 11875 -7688 -9406 3079 1376 22636 31223
4444 31223 17361 8474 5784 3061 4713 34240 27813 36379 30251 23746 -9862 -3923 17495 31613
4430 31613 8719 20428 22065 1506 -12546 -3519 -7046 4549 2190 -6745 16698 19063 24311
4417 24311 11500 -11359 -23147 -34703 -31543 -34750 -39453 -19947 20053 26671 23910 7968 12693
4404 12693 27121 31831 39761 40122 25491 5901 -29659 -17642 -2053 -22203 -34947 -11427 -6790
4391 -6790 -5479 -30468 2115 681 -6645 -20728 -26261 -9596 27282 29120 10865 25178 38058
4378 38058 43365 71855 64568 31127 6121 14170 -4666 -21623 -19620 -24880 -25894 -18754 967
4365 967 -21343 -39385 -40944 -48415 -37365 -21851 -21110 -29111 -8205 -37186 -60738 -31373 -46026
4352 -46026 -69356 -62338 -1694 29109 8429 704 15209 16323 16851 6808 15487 21623 35115
4339 35115 51760 21215 -6414 -2024 -7220 -29928 -36531 -40986 -42661 -37272 6463 21496 -8846
4326 -8846 -4978 -13804 17905 29739 1816 -6980 -13430 -13202 -11712 -7637 -14628 8572 26214 4545
4312 4545 -26008 -27634 982 39833 17551 -264 16453 16609 12850 5238 4039 17834 15660
4299 15660 33239 33978 2786 -12758 -8149 17571 525 28357 54293 28872 -11212 -13588 -3655
4286 -3655 -2621 6049 20408 23858 -11009 -31639 -6262 -22199 -41733 -33284 -27362 -18349 -46684
4273 -46684 -32045 -6414 -4598 37506 59971 36067 26979 7092 -38706 -27112 -13153 -9491
4261 -9491 -25017 -36361 -14014 6964 -1170 -27338 -50517 -64028 -42660 -23758 -33264 -35376 -2053
4248 -2053 -11378 -28374 -21247 -21955 -16899 -5968 -2819 -42219 -14423 29471 55917 50887 34774
4235 34774 10514 18216 11668 -25578 -28526 -8471 -2867 1530 19859 25095 12533 11407 -2285
4222 -2285 -5594 -39797 -57303 -40249 -2543 13112 -10344 -24118 4379 -4231 -31685 -49604
4210 -49604 -42941 -12445 15070 8917 -2313 -14126 -9720 -21434 4917 22825 -2961 -45727
4198 -45727 -69849 -32197 -27498 -27343 -9963 -30338 -9086 -26870 -21613 -4639 -2812 13207 31678
4185 31678 22703 29952 53377 43022 11408 -1477 -6995 13133 3824 8120 33363 67827 60847
4172 60847 29440 46025 26888 -1281 -6853 -4560 -12220 -26259 -26108 1877 21860 6299 -43014
4159 -43014 -95463 -77071 -81191 -88039 -39381 -13111 -12315 -372 -26259 -34327 -47112 -62628 -58841
4146 -58841 -44778 -17237 -22595 4431 10931 8325 22222 -5678 -7486 15917 28493 9047 10196
4133 10196 -16589 -22055 -4112 14970 33031 30482 16936 4151 -10239 1396 22099 8077
4121 8077 -31428 -78583 -50707 10091 32708 54444 67857 66448 59747 45248 5430 -37232
4109 -37232 -29248 -32497 -18331 -10602 -3288 3043 4433 20933 28842 2962 3719 4678 8521 5938
4095 5938 1258 591 11205 26035 12059 -39103 -75984 -85055 -56351 -34103 -24376 -34983 -46540
4082 -46540 -50369 -42698 -19068 30952 30469 47900 50320 33603 3455 -10802 19832 42509 23990
4069 23990 -3827 -20752 13426 68848 70477 53962 43553 11472 -14572 -22454 -18277 -25800 -29943
4056 -29943 -19006 14696 25196 39030 25269 18078 -2027 -1225 7936 4387 -10225 -38824 -53072
4043 -53072 -44691 -42298 -48971 -24443 12151 32574 40715 43016 9697 8106 8755 -13926 -24703
4030 -24703 3387 23584 -26913 -49887 -39732 -23744 3645 30693 30800 14661 15388 6069 -18205
4017 -18205 -21246 -26259 -6406 1505 -9705 1230 24649 37185 38012 16569 -21214 -5809 19919
4004 19919 30269 61919 45371 49740 44725 28708 9243 -32911 -42690 -8832 -2243 -16555 -26744
3991 -26744 -25211 -36081 -21105 -15671 -8117 -31497 -24046 11210 30319 17390 8943 30901 18706
3978 18706 -7559 23648 47012 38259 50415 41099 13496 389 -20133 -35005 -30759 -26447 -36738
3965 -36738 -42294 -24102 5139 -1775 -29748 -31372 -10699 -5510 -5475 -12342 -23467 -40367 -40120 -30788
3951 -30788 -21571 -8043 -13934 -1429 -13461 -14606 -25534 -43211 -25524 -21355 -4720 25543 53378
3938 53378 36089 -10497 -9995 -14185 -27929 -26316 3286 5595 20932 19281 47789 53572 11315
3925 11315 -696 3354 -6824 6575 -12585 -48710 -31017 -40015 -79584 -78839 -44627 -34806 -27794
3912 -27794 -31333 -35318 -14971 7946 8541 258 -13678 -8565 3907 17429 25947 12265 25894
3899 25894 24549 6722 10908 10855 18720 7232 8046 6183 33376 17952 3007 -9875 -16483 -21886
3885 -21886 3546 -14826 -36834 -11406 318 -15348 -33272 -42333 -10325 -28146 -24262 -11091
3873 -11091 -49952 -33223 -9402 -4640 -245 23641 21404 4702 -16676 -21359 927 -22461 -53443
3860 -53443 -40704 -36392 -31414 -27438 -12478 -10276 -9422 5982 41183 12597 15305 5481 8517 18598
3846 18598 21176 23150 26280 15959 37156 24298 24176 15328 -22692 -25984 18656 43297 40004
3833 40004 19252 451 25762 54995 29390 15798 40528 13342 -22896 -21034 6963 22288
3821 22288 24479 30231 24432 26973 40619 55217 40148 12257 -33410 -32060 -10751 -11785 -11612
3808 -11612 1055 -4077 -469 4129 -2227 -41301 -40009 620 3580 -3343 -7196 -28187 -52501
3795 -52501 -58535 -60192 -65775 -77522 -89235 -51577 -15049 6425 -12111 -23112 -11984 -2134 -15402
3782 -15402 -14014 82 252 -39977 -60395 -40019 -39041 -12877 18333 24260 -20622 -12933 -9802
3769 -9802 -6140 -1750 -8292 -17324 -18482 -14957 -21568 -32144 -30236 -9144 -14973 -22812 -5616 10720
3755 10720 -992 -20305 -9409 -2284 9418 2126 1300 34975 14133 -7740 -4701 -6757 676
3742 676 2273 4581 19286 10016 -3525 -445 -11634 784 22680 25701 13620 799 -18058
3729 -18058 -11352 -13474 -10601 -14320 -31139 25571 68188 79901 56124 33898 27201 32671 42580
3716 42580 27273 25717 53349 46596 4632 -28492 -16780 14359 -2110 -14279 -13837 -31192 -5462
3703 -5462 25075 40509 40465 38375 2243 -23407 -9854 -690 -13213 -14646 -14361 -5942 -14508 -7372
3689 -7372 -2020 -20850 -12442 12914 3009 -15958 12213 -1026 -8528 -6331 586 -6096 -13482 -11468
3675 -11468 -12657 -3500 6607 12443 22145 29090 26777 -9903 -11549 -12886 -20374 -47580 -55572 -11162
3661 -11162 9293 -13224 2935 49611 68367 47806 23593 -12122 -411 6105 -24133 2936
3649 2936 6499 -15017 -35491 -20395 -9647 -24350 342 18035 -6065 5490 14963 5003 2976
3636 2976 6070 -36464 -45406 -21259 -7932 21019 43390 40865 3488 6271 -3462 -2925 -19081
3623 -19081 -29906 -7454 -10246 -25951 -35303 -22641 -7524 13495 -24273 -25343 -23919 -3353 18661
3610 18661 15087 3998 -8168 1574 -4946 -16806 -35783 -12752 26002 42364 44848 31061 11533
3597 11533 30727 35024 24877 44265 -97 -35059 -36464 -14752 7394 5646 -28595 -48815
3585 -48815 -50784 -54898 -44150 -13445 7768 13081 23999 37013 5403 15753 21690 -12663 -21095
3572 -21095 -28950 -41780 -48368 -31923 -3230 -5008 -4376 -8257 -23195 7830 10142 -15949 -17512
3559 -17512 -9188 -22137 -21591 -4195 7079 42369 34960 26705 -46 -14774 -8776 -37373 -63768
3546 -63768 -41272 -4077 37605 36270 25298 746 7201 1154 -15322 -35624 -34130 -29633 -28866
3533 -28866 -21608 -40335 -41968 -24127 -23428 -74326 -68239 -22253 -15551 319 35436 59753 62354
3520 62354 36438 -2145 -21770 -46480 10678 15806 -17064 -55000 -57719 -56497 -70032 -56497
3508 -56497 -20460 4663 -14252 -60715 -53238 -5420 17558 17389 -22726 -65037 -66224 -9676 2702
3495 2702 -32627 -39900 -17861 -7865 2134 5161 4347 5814 5752 -8920 10951 22971 -9661 -36800
3481 -36800 -37908 -14316 -9773 -6312 -3353 5022 -1132 -12519 -11075 -38376 -54752 -38139 -28424
3468 -28424 -27034 8898 43887 49156 49187 36851 13728 58 -8758 -10897 -24602 -15687 -19573 -22799
3454 -22799 4173 10573 -6582 -32312 -58450 -57635 -42117 -17280 -29598 -35843 1458 25277 6242
3441 6242 -14588 -22144 1628 6491 33030 38776 22741 19860 30268 28322 6248 -9436 -20120
3428 -20120 -13259 8325 5937 -39447 -39473 -11613 -15237 -22815 -6037 -19235 -40365 -34407 -38510 -30014
3414 -30014 -47150 -40293 -43244 -38653 -30580 -27044 -359 23228 38062 9563 6281 17633 2827
3401 2827 -24539 -36321 -17772 9669 27263 24295 23794 41164 34361 9003 6313 21020 42148
3388 42148 41319 33746 8355 -16964 -34431 -20682 -4762 -402 -9955 -22375 -17793 11472 3066
3375 3066 -46467 -58660 -42469 -29215 2633 26786 21018 -25697 -7242 12334 -21409 -41497
3363 -41497 -34174 -38423 -30336 -55684 -21979 -3809 -40921 -21526 9844 6951 758 13495 13655
3350 13655 -9409 -650 25664 30675 34527 22176 -7577 -11937 10720 11558 15586 16012 -3813 5191
3336 5191 5905 -20349 -58653 -32237 2660 3024 14192 8487 16728 33564 26728 6176 13220 34844
3322 34844 64163 83325 47234 20833 18968 30722 26252 -2179 -17361 -19940 -51236 -35388
3310 -35388 -12833 9651 21138 5285 -27765 -44159 -25935 3927 -10622 -4768 -2055 -6977
3298 -6977 6269 20134 26466 3016 -1261 7336 40240 62903 59300 47609 43113 27870 16221
3285 16221 17534 20107 17062 8415 -20798 -33997 -25848 -25420 -19468 11356 18572 1141 -150 -18320
3271 -18320 -16869 4456 18004 2172 -15113 8999 29419 30901 25501 22096 21761 48356 54312
3258 54312 45984 22468 17385 14121 -21151 -17710 -32690 -36018 -27130 -21805 -42732 -33031 -9039
3245 -9039 -26275 -27928 -40549 -53331 -33123 8241 16391 2312 -19702 -24671 -10389 -21111 -10269
3232 -10269 -10897 15741 26334 21127 20598 -15739 -10221 -2363 -2520 -11847 -15706 -20235 -17086 -3510
3218 -3510 11902 25010 2298 -19250 -41182 -17230 2139 10557 26849 -1599 -535 11309
3206 11309 13470 4949 1623 18646 6041 -9636 -43254 -50645 -47460 -22399 6891 20844 36892
3193 36892 18229 -14790 -28719 -28938 6566 9697 34530 16341 9618 19851 5156 28184 40551
3180 40551 12736 -18555 -6073 10050 2470 4581 29255 14739 -19937 2508 -25656 -51403
3168 -51403 -37327 -25317 -28036 -10376 -19643 -20986 -24997 -27049 -22441 -33955 -59531 -57423 -46421
3155 -46421 -13771 -12751 -12626 1518 7700 14025 42433 39258 15276 38892 36232 26622 8946
3142 8946 -2502 -30234 -18112 18790 43270 45970 41414 53157 64417 59349 36871 19060 11899
3129 11899 31332 19984 12697 -2758 -2695 10432 -5084 -11888 14711 13870 1347 25060 43260
3116 43260 46741 6896 -31924 -19881 11267 395 -32088 -46634 -18796 -14431 1607 -806
3104 -806 -12194 4687 22320 3269 1809 25055 50484 50457 30592 680 -19625 -31662 -17117
3091 -17117 -3517 -4829 -20337 -37699 -20038 12438 8389 -6272 5785 9525 2249 15136 40274
3078 40274 33748 24588 24479 37283 22004 12306 30296 49916 37251 17826 20456 21093 426
3065 426 -23359 -12535 20899 22764 28508 5213 -14969 -26217 -60063 -83637 -20807 13222 21333
3052 21333 27352 29008 21793 15776 17309 -28524 -16302 -7860 6556 23597 35045 9630 -10473
3039 -10473 -2805 -13464 -10326 33755 47683 28646 -5464 -10706 11861 23816 50533 40372
3027 40372 13026 1156 -4744 -30761 -55014 -39367 -38244 -25502 643 63665 50510 21261
3015 21261 27996 31627 -1732 -14893 -4019 -17455 -41284 6516 17191 21130 23995 16625 17412
3002 17412 33578 38734 22661 -5197 -14846 29583 72536 80286 61182 31445 6682 25736
2990 25736 28381 60834 68144 46691 52645 40033 17682 4376 -7135 9395 20142 41228
2978 41228 10827 -5852 -10487 -12423 -44535 -83981 -55118 -31033 -18670 -12880 -9802 -2394 -8249
2965 -8249 -1508 4690 4678 -14246 -7296 -1746 8168 11274 8798 11317 12228 31129 27083 26332 21237
2950 21237 21326 22688 28008 25707 25724 7078 -30761 -33761 8774 6012 -12860 34 7554 -5326
2936 -5326 -21476 5310 4920 -11098 -9726 -14636 6600 27726 15998 19682 3536 26066 40252
2923 40252 29991 19710 20736 33363 47388 44084 14922 15883 30627 42890 39771 26412 28049
2910 28049 8644 -9583 -15699 -21267 -5352 12239 7200 2667 3539 12791 33535 19478 21346
2897 21346 27307 8145 22105 13041 -1648 -5571 1336 16206 286 -5342 20578 -6970 -32909
2884 -32909 -43252 -47843 -16784 13462 45553 63379 27418 18333 39625 9699 -37311 -7608
2872 -7608 24624 12416 7248 -9807 -537 36300 28701 21171 -28179 -72324 -72071 -40157 -3657
2859 -3657 2954 -20940 -34465 -18946 -1038 -4299 -39548 -71751 -68950 -62619 -77458 -62699 -4903
2846 -4903 7450 29657 22962 -18368 -52806 -14863 -15029 -34777 -16914 10733 8901 -9384 -37493
2833 -37493 -62399 -56055 -65605 -57882 -38788 -11369 10439 11560 8614 32233 30071 49156 54584
2820 54584 37403 38579 13696 -14390 -13332 476 52810 31086 30831 26393 -18112 -45189 -40736
2807 -40736 -41100 13111 40195 23456 55361 38136 8744 -33371 -23422 -36818 -52792 -47506 -23491
2794 -23491 -1805 7137 5846 26361 39877 25312 -6017 -7803 -25658 -21318 4870 7311 -3062
2781 -3062 8945 36515 27799 23474 39658 52886 31100 40535 12997 -14164 -20363 -5421 -10383
2768 -10383 -44355 -43626 -12103 10410 23727 -2314 21716 32436 15598 2656 13848 20983
2756 20983 16672 40769 41981 44572 33088 -7914 2199 10903 -1306 -13694 -7064 -1633 6853
2743 6853 11963 43162 32507 -3638 -5911 6320 -16076 -38631 -43012 -16937 -17545 -16084 37244
2730 37244 68675 41513 31373 23548 11602 27077 16810 3987 -18026 -62472 -55842 -42941
2718 -42941 -31599 -7413 -6613 -1716 -10673 -35591 -24010 4824 16494 10802 -893 6708 30364
2705 30364 37129 38162 3101 -9460 -10033 16367 22601 49458 58307 58556 54993 77357 68622 66870
2691 66870 29545 -19419 -13646 17143 10125 5593 43762 49241 21980 -15684 -15186 -2858 -3749
2678 -3749 -9719 -25884 -13402 -7941 1221 19075 58108 46937 190 -14179 21080 17068 9684
2665 9684 18196 18155 19879 25763 24921 12895 23448 28297 3691 -3309 -24557 -44694 -46308 -22451
2651 -22451 -45544 -63403 -47796 -6921 -4436 -17551 -27134 -11198 -19192 -21475 -52586 -66258 -21248
2638 -21248 -14470 8204 28631 25240 -15854 -20952 1069 17321 28241 5774 -128 11045 -25999
2625 -25999 -60041 -58744 -64450 -54910 -24718 4821 -424 -25209 -10788 11040 20617 41182 15936
2612 15936 -13617 -9305 27912 19868 23754 262 -16795 -22864 -48365 -71260 -44536 -30221 -37200
2599 -37200 -27185 -31509 -36151 -57251 -82369 -59629 -38784 -46341 -38518 -7551 182 -1249 27786
2586 27786 48341 66151 31427 40203 52443 48280 14907 -13893 -24234 2982 1228 12490
2574 12490 1030 21430 43549 56419 17811 -8518 12011 13498 -2064 -20369 -31701 -31946
2562 -31946 -10005 1208 -23661 -7945 -4627 -1564 6719 -19755 -51396 -76014 -56159 -43263
2550 -43263 -50620 -22914 -11998 -9106 -14634 17082 34442 24750 15924 30596 49072 42648 15869
2537 15869 -14152 -23896 -9287 7261 6041 9280 -11023 1020 14861 -7598 -28852 -52921
2525 -52921 -46346 -40875 388 24239 29489 24790 19619 32904 57722 58118 54254 48249 24575 -8426
2511 -8426 -11952 -1512 -7100 32014 48765 18079 13055 18154 26772 15594 25219 16163 18634 -10416
2497 -10416 -31801 -47260 -75107 -87595 -68788 -8805 -5129 -28159 -10499 -17967 4187 14592
2485 14592 29299 22331 9207 22782 7797 -25308 -32258 -47308 -55087 -58722 -17245 -8762 -25006
2472 -25006 -16217 -2185 -7536 -9360 -25678 4162 19936 -6294 -32678 -32728 -26931 -20883 -8549
2459 -8549 -10859 -34581 -30310 2469 24706 23228 19082 24719 37734 12242 -5390 7120 4339
2446 4339 -5661 3534 -1323 -20884 -57549 -54609 -72597 -55251 -15059 8100 1493 -15977 -18779
2433 -18779 -2417 21797 16240 -5212 -333 -13417 -12757 -24590 -32440 -20404 -14640 -14236 -5011 -1215
2419 -1215 6900 -16025 -34453 -40746 -35371 -23501 -20612 14490 34401 18308 -22341 -4876 13108
2406 13108 15336 17013 2129 6867 1804 -16084 64 29782 9188 -8657 -17473 -22001 -6928
2393 -6928 1990 -9027 1284 4804 -12497 -1247 11875 -25265 -41062 -59139 -64146 -50252 -2045
2380 -2045 8812 -11443 -46752 -50122 -27260 -19487 -13159 -17377 10735 4594 -13986 -41356 -56048
2367 -56048 -19739 -5947 -23845 -23179 -34305 -51244 -47510 -49755 -31751 -13033 2063 1326 -12508
2354 -12508 -20656 -41346 -9450 29415 15864 4107 1043 27911 36890 27406 32622 11353 984
2341 984 -5535 5193 1366 -8600 -21337 -7382 -24827 -30857 -20606 5283 39022 36526 55649
2328 55649 72773 45034 12966 22100 38165 62614 49304 29705 8605 -5222 -621 -18233
2316 -18233 2340 25361 36892 28932 15307 -25027 -46437 -45496 -16291 -1940 4850 12671 7449
2303 7449 -6533 -14303 -26029 -25468 -13891 -910 6665 8581 11070 9152 -650 4928 7103 -453
2289 -453 -14948 958 2308 28482 35343 34213 21563 3185 -17025 -8795 16915 4335 -1301
2276 -1301 -26292 -3379 14350 4189 6800 2257 21546 25052 14513 2629 -2670 33319 22760
2263 22760 36995 30096 17031 5914 27920 19320 7161 -13132 -27775 -42355 -53411 -22945
2251 -22945 -31471 -22551 -5602 -27383 -14555 6618 5413 20411 19383 11528 52684 57384 42607
2238 42607 32579 30635 31750 32510 17666 10481 4453 5030 16005 14325 29681 38137 30984 53146
2224 53146 73636 56130 25894 32142 61527 69085 49244 32882 36223 30565 5989 -4656 4262
2211 4262 16433 2770 -31321 -29681 -13261 5885 42707 45512 25049 -8605 -28611 14713
2199 14713 39881 33405 13302 7723 11931 13064 -4945 -428 -953 -14962 -48835 -44568 -37971 -26030
2185 -26030 280 4496 -527 13485 14637 14005 25930 18305 -14956 -3631 8530 -15713 -32286
2172 -32286 -22842 -8393 -23023 -45810 -35181 -6112 -16405 -40488 -19871 -686 15323 6617
2160 6617 -21799 -25090 -7840 -13767 -49629 -66388 -61626 -31991 6376 38630 55421 44464 37925
2147 37925 67083 65501 38000 7118 -27101 -48119 -49813 -44025 -29119 -43077 -57041 -42632
2135 -42632 -23672 -3814 9635 132 5086 -5378 -26894 -21993 -38968 -13112 10526 -2222
2123 -2222 -4337 -12517 -9233 -605 -25301 -24762 -2450 3834 26464 26146 16441 23555 9967 802
2109 802 -5319 -16403 -47010 -43243 -25372 1948 -12805 -24859 -26944 -12754 634 -21167 -34608
2096 -34608 -28327 -28328 -543 8234 -813 -11142 -36067 -59062 -41453 -21179 -11554 1459 14864
2083 14864 20096 11393 -10550 -33118 -7144 25167 29614 44682 58644 31280 -623 -28488
$$ [...]
##END NTUPLES=NMR SPECTRUM
##END=
