##TITLE=Analysis number 329446
Compound Code cc 62209
Book Reference 518/173
Project Code adrs
Chemist Name colinb
##JCAMPDX= 6.0         $$ Bruker NMR JCAMP-DX V2.0
##DATA TYPE= NMR SPECTRUM
##DATA CLASS= NTUPLES
##ORIGIN= Bruker BioSpin GmbH
##OWNER= nmr
$$ XWIN-NMR		Version 3.5
$$ Mon Sep  3 14:25:23 2007 GMT Daylight Time (UT+1h)  MAYBRIDGE\nmr@NMR_250MHZ
##.OBSERVE FREQUENCY= 250.131544655141
##.OBSERVE NUCLEUS= ^1H
##.ACQUISITION MODE= SIMULTANEOUS (DQD)
##.ACQUISITION SCHEME= undefined
##.AVERAGES= 16
##.DIGITISER RES= 18
##SPECTROMETER/DATA SYSTEM= dpx250
##.PULSE SEQUENCE= zg30
##.SOLVENT NAME= CDCl3
##.SHIFT REFERENCE= (INTERNAL, CDCl3, 0, 16.4516)
##AUDIT TRAIL= $$ (NUMBER, WHEN, WHO, WHERE, WHAT)
$$ ##TITLE= Audit trail, XWIN-NMR		Version 3.5
$$ ##JCAMPDX= 5.01
$$ ##ORIGIN= Bruker BioSpin GmbH
$$ ##OWNER= nmr
$$ C:\u/data/dgb/nmr/ADRS/20/pdata/1/auditp.txt
$$ ##AUDIT TRAIL=  $$ (NUMBER, WHEN, WHO, WHERE, WHAT)
(   1,<2007-09-03 14:24:09.51 +100>,<MAYBRIDGE\nmr>,<NMR_250MHZ>,
      <created by zg, POWCHK disabled, PULCHK disabled
       configuration hash MD5:
       76 6E 9A 78 1E 09 19 81 EC 84 63 8F B0 6A 59 2D
       data hash MD5: 64K
       E1 77 FD 70 D1 3E 45 A2 62 2F 12 24 1E 97 2D 8E>)
(   2,<2007-09-03 14:24:41.18 +100>,<MAYBRIDGE\nmr>,<NMR_250MHZ>,
      <Start of raw data processing
       ef LB = 0.3 FT_mod = 6 PKNL = 1 SI = 32K 
       data hash MD5: 32K
       16 65 03 38 2D 44 F4 CB 3B 52 C6 E2 DB A4 73 EE>)
(   3,<2007-09-03 14:24:45.89 +100>,<MAYBRIDGE\nmr>,<NMR_250MHZ>,
      <apk 
       data hash MD5: 32K
       97 7E BA D1 7D BB 80 02 C0 C7 B0 96 FD 83 DD D2>)
(   4,<2007-09-03 14:24:50.59 +100>,<MAYBRIDGE\nmr>,<NMR_250MHZ>,
      <abs ABSG = 5 
       data hash MD5: 32K
       EC 36 B7 F5 F6 FC 1F 58 54 5F 58 60 DC 60 F0 16>)
$$ ##END=
$$ 
$$ hash MD5
$$ 7C A7 00 95 76 AC AB CD 5F A4 E4 78 C6 AC E7 33
##$RELAX= 
##$RELAX= 
##$RELAX= 
##$RELAX= 
##$RELAX= 
##$RELAX= 
##$RELAX= 
$$ Bruker specific parameters
$$ --------------------------
##$DU= <C:\u>
##$EXPNO= 20
##$NAME= <ADRS>
##$PROCNO= 1
##$TYPE= <nmr>
##$USER= <dgb>
##$AMP= (0..31)
100 100 100 100 100 100 100 100 100 100 100 100 100 100 100 100 100 100 
100 100 100 100 100 100 100 100 100 100 100 100 100 100 
##$AQSEQ= 0
##$AQ_mod= 3
##$AUNM= <au_zg>
##$AUTOPOS= <28 >
##$BF1= 250.13
##$BF2= 250.13
##$BF3= 250.13
##$BF4= 250.13
##$BF5= 500.13
##$BF6= 500.13
##$BF7= 500.13
##$BF8= 500.13
##$BYTORDA= 1
##$CFDGTYP= 0
##$CFRGTYP= 5
##$CHEMSTR= <none>
##$CNST= (0..31)
1 1 145 1 1 1 1 1 1 1 1 1 1 1 1 1 1 1 1 1 1 1 1 1 1 1 1 1 1 1 1 1 
##$CPDPRG= <>
##$CPDPRG1= <>
##$CPDPRG2= <>
##$CPDPRG3= <>
##$CPDPRG4= <mlev>
##$CPDPRG5= <mlev>
##$CPDPRG6= <mlev>
##$CPDPRG7= <mlev>
##$CPDPRG8= <mlev>
##$CPDPRGB= <>
##$CPDPRGT= <>
##$D= (0..31)
0 1 0 0 0 0 0 0 0 0.06 0 0 0 0 0 0 0.0002 0 0 0 0 0 0 0 0 0 0 0 0 0 0 
0 
##$DATE= 1188825846
##$DBL= (0..7)
120 120 120 120 120 120 120 120 
##$DBP= (0..7)
150 150 150 150 150 150 150 150 
##$DBP07= 0
##$DBPNAM0= <>
##$DBPNAM1= <>
$$ [...]
##$SUBNAM7= <"">
##$SUBNAM8= <"">
##$SUBNAM9= <"">
##$SW= 20.6930455092707
##$SWIBOX= (0..15)
0 0 3 0 0 0 0 0 0 0 0 0 0 0 0 0 
##$SW_h= 5175.983436853
##$TD= 65536
##$TD0= 1
##$TE= 297.16
##$TE2= 300
##$TE3= 300
##$TEG= 300
##$TL= (0..7)
0 120 120 120 120 120 120 120 
##$TP= (0..7)
150 150 150 150 150 150 150 150 
##$TP07= 0
##$TPNAME0= <>
##$TPNAME1= <>
##$TPNAME2= <>
##$TPNAME3= <>
##$TPNAME4= <>
##$TPNAME5= <>
##$TPNAME6= <>
##$TPNAME7= <>
##$TPOAL= (0..7)
0.5 0.5 0.5 0.5 0.5 0.5 0.5 0.5 
##$TPOFFS= (0..7)
0 0 0 0 0 0 0 0 
##$TUNHIN= 0
##$TUNHOUT= 0
##$TUNXOUT= 0
##$USERA1= <user>
##$USERA2= <user>
##$USERA3= <user>
##$USERA4= <user>
##$USERA5= <user>
##$V9= 5
##$VALIST= <valist>
##$VCLIST= <CCCCCCCCCCCCCCC>
##$VD= 0
##$VDLIST= <DDDDDDDDDDDDDDD>
##$VPLIST= <PPPPPPPPPPPPPPP>
##$VTLIST= <TTTTTTTTTTTTTTT>
##$WBST= 1024
##$WBSW= 4
##$XGAIN= (0..3)
0 0 0 0 
##$XL= 0
##$YL= 0
##$YMAX_a= 315186
##$YMIN_a= -358850
##$ZGOPTNS= <>
##$ZL1= 120
##$ZL2= 120
##$ZL3= 120
##$ZL4= 120
##$ABSF1= 16.45162
##$ABSF2= -4.241552
##$ABSG= 5
##$ABSL= 3
##$ALPHA= 0
##$AQORDER= 0
##$ASSFAC= 0
##$ASSFACI= 0
##$ASSFACX= 0
##$ASSWID= 0
##$AUNMP= <proc_1d>
##$AZFE= 0.1
##$AZFW= 0.1
##$BCFW= 0
##$BC_mod= 0
##$BYTORDP= 0
##$COROFFS= 0
##$CY= 12.5
##$DATMOD= 1
##$DC= 0
##$DFILT= <>
##$DTYPP= 0
##$F1P= 14.0000005364418
##$F2P= -0.99999901652339
##$FCOR= 0.5
##$FTSIZE= 32768
##$FT_mod= 6
##$GAMMA= 0
##$GB= 0
##$INTBC= 1
##$INTSCL= 1
##$ISEN= 128
##$LB= 0.3
##$LEV0= 0
##$LPBIN= 0
##$MAXI= 10000
##$MC2= 0
##$MEAN= 0
##$ME_mod= 0
##$MI= 0
##$NCOEF= 0
##$NC_proc= -5
##$NLEV= 6
##$NOISF1= 0
##$NOISF2= 0
##$NSP= 0
##$NTH_PI= 0
##$NZP= 0
##$OFFSET= 16.45162
##$PC= 1
##$PHC0= -42.34882
##$PHC1= 4.551028
##$PH_mod= 1
##$PKNL= yes
##$PPARMOD= 0
##$PSCAL= 4
##$PSIGN= 0
##$REVERSE= no
##$SF= 250.130017602847
##$SI= 32768
##$SIGF1= 0
##$SIGF2= 0
##$SINO= 400
##$SIOLD= 32768
##$SREGLST= <1H.CDCl3>
##$SSB= 0
##$STSI= 32768
##$STSR= 0
##$SW_p= 5175.98343685301
##$SYMM= 0
##$S_DEV= 0
##$TDeff= 65536
##$TDoff= 0
##$TI= <Analysis number 999999
Compound Code 99
Book Reference 9
Project Code 9>
##$TILT= no
##$TM1= 0
##$TM2= 0
##$TOPLEV= 0
##$USERP1= <user>
##$USERP2= <user>
##$USERP3= <user>
##$USERP4= <user>
##$USERP5= <user>
##$WDW= 1
##$XDIM= 32768
##$YMAX_p= 296630647
##$YMIN_p= -212231
$$ End of Bruker specific parameters
$$ ---------------------------------
##NTUPLES= NMR SPECTRUM
##VAR_NAME=  FREQUENCY,     SPECTRUM/REAL,   SPECTRUM/IMAG
##SYMBOL=    X,             R,               I
##VAR_TYPE=  INDEPENDENT,   DEPENDENT,       DEPENDENT
##VAR_FORM=  AFFN,          ASDF,            ASDF
##VAR_DIM=   32768,         32768,           32768
##UNITS=     HZ,            ARBITRARY UNITS, ARBITRARY UNITS
##FACTOR=    0.157963299565203, 1,           1
##FIRST=     4115.04402569078, 0,            0
##LAST=      -1060.93941116223, 0,           0
##MIN=       -1060.93941116223, -212231,     0
##MAX=       4115.04402569078, 296630647,    0
$$ Real data points
##PAGE= N=1
##DATA TABLE= (X++(R..R)), XYDATA
$$ [...]
17714A01498314j9139042k1433040j6516807j1417764p763327n364072l792130
17707A6072132k781951k120804j543222j125110q94899p42379n75022m53348l02935
17698E532462k18186j46907o649o2799k60012l90895l91391k67959j48292m9132
17688C590240l9584k2459j95877j92196j52551j70226j57506j78629j92939j89375
17678B098898l7579N4771N0376l1758p8954j14358l1357m244l5300k0219Q454
17667A858730K6679p3082j42122q156l3763j6040j071L7993l1056R602m5766j3177
17655A568771M166k2661q380J7452k367j5600K8422j1778L1497J3776P543o078
17643A604763o3294l1825M1173r314m5545p07j6414o2248l3068J6577j5286J6884
$$ y = [101498314, 82359272, 60926232, 44409425, 32991661, 25228334, 19864262, 16072132, 13290181, 11169377, 9626155, 8501045, 7606146, 6863767, 6288745, 5835397, 5532462, 5314276, 5167369, 5160720, 5097921, 4837909, 4447014, 4055623, 3787664, 3639372, 3590240, 3550656, 3528197, 3332320, 3140124, 2987573, 2817347, 2659841, 2481212, 2288273, 2098898, 2061319, 2116090, 2166466, 2134708, 2055754, 1941396, 1910039, 1905795, 1870495, 1850276, 1858730, 1885409, 1812327, 1670205, 1662049, 1628286, 1612246, 1611175, 1649168, 1618112, 1627714, 1581948, 1568771, 1572937, 1550276, 1541896, 1559348, 1556981, 1541381, 1569803, 1558025, 1589522, 1603298, 1610841, 1604763, 1541469, 1509644, 1550817, 1541503, 1495958, 1495251, 1478837, 1416589, 1383521, 1400098, 1384812, 1401696]
17631A401696j7994j966p000N2735K5576L3722K7287P8162M5434K3262N0803O1977
17619A773694Q0574K7209N6373L5394l7323o209J6409L6577M7204P234l7766J2783
17607B012153O0838P3815M5676R1469O3612J6136J31335J52060J04699R9406J60792
17596C011991J86893K51830K05890Q3449Q6172J11088J06584K57955L42021L20781
17586D964654K77345K61354J86576K15430M73586O80106O10882M97720N46193
17577H713846O28297P14226Q49036J178853J360435J463520J654286K030169K511874
17568B1104542L320622M458813O307202R260273J4099083K1615013K7887816K0589681
17560A28643045p77628j5998971j4995051n628254N614230J6394790J7653461
$$ y = [1401696, 1383702, 1381736, 1374736, 1427471, 1453047, 1486769, 1514056, 1592218, 1637652, 1660914, 1711717, 1773694, 1854268, 1881477, 1937850, 1973244, 1935921, 1929712, 1946121, 1982698, 2029902, 2037136, 1999370, 2012153, 2072991, 2146806, 2192482, 2283951, 2347563, 2363699, 2495034, 2647094, 2751793, 2851199, 3011991, 3198884, 3450714, 3656604, 3740053, 3826225, 3937313, 4043897, 4301852, 4643873, 4964654, 5241999, 5503353, 5689929, 5905359, 6378945, 7059051, 7669933, 8167653, 8713846, 9342143, 10056369, 10905405, 12084258, 13444693, 14908213, 16562499, 18592668, 21104542, 24425164, 28883977, 35191179, 44451452, 58550535, 80165548, 108053364, 128643045, 127865417, 111866446, 96871395, 91243141, 96857371, 113252161, 130905622]
17553A30905622O52913j9304225k4921825j9518961j3084481q481616n191826
17546D1055601k747066o47426J384466L653429P074316J2550932J9449060K0833909
17538A02607221P949467r348345j5366971j0091380j367066P916171J4151492
17531I6450589Q061572q872575k0023473j9269530j3940939r615646o712952m723612
17523B1353434l351103k455806j943670j557682j224689q99672o74635n13994
17515H732183n97890p13049o64163o00860n05688l47129k06485k37432k89177
17506D570310j89610j51605k67716l31003k79416k46361j87339j05187q5382j18220
17496B608471j71052j72093q3397m4739j41748j54200n0168n665q1821p2487p6891
$$ y = [130905622, 131558535, 112254310, 87332485, 67813524, 54729043, 46247427, 41055601, 38308535, 37661109, 39045575, 42699004, 49773320, 62324252, 81773312, 102607221, 110556688, 101208343, 85841372, 75749992, 74382926, 82299097, 96450589, 104512161, 95639586, 75616113, 56346583, 42405644, 32789998, 26077046, 21353434, 18002331, 15546525, 13602855, 12045173, 10820484, 9920812, 9246177, 8732183, 8134293, 7421244, 6757081, 6156221, 5650533, 5303404, 5096919, 4859487, 4570310, 4380700, 4229095, 3961379, 3630376, 3350960, 3104599, 2917260, 2812073, 2726691, 2608471, 2437419, 2265326, 2181929, 2137190, 1995442, 1841242, 1791074, 1785409, 1703588, 1631101, 1554210]
17485A554210n1120q5101m2996n0065K0233j3026n2157j02105l4865P884k8011
17474A122881l2677r171l456m9475o6368m3950k8217k0433M2443J8582l1869J3957
17462I12247m6027l615o232K9919J5242J925q866o8420l2564l9366m0699p878
17450G05666P7658K5749l9821l589L8431j8240k8846O7588J27565P9569L0506
17439A062236q7732j58889n7373k1306m7447k7836K8108K5569k474O236m371J309
17427G16030j3444k0144J1104o787j0236j1038p371m7942p1127m853j850j649
17415E30693l186k0963q580j6126k6287L9127L0716p10k1664n2633L0700j62n349
17402D75576Q348L3109p597k97l008l0396m5822K5414k4560n4421k9875K7926
$$ y = [1554210, 1503090, 1417989, 1374993, 1324928, 1345161, 1332135, 1279978, 1177873, 1143008, 1150892, 1122881, 1090204, 1081033, 1077577, 1028102, 961734, 917784, 889567, 869134, 911577, 930159, 898290, 912247, 866220, 862605, 856373, 886292, 901534, 903459, 894593, 826173, 793609, 754243, 713544, 705666, 783324, 809073, 769252, 765663, 804094, 785854, 757008, 824596, 952161, 1031730, 1062236, 974504, 815615, 758242, 736936, 689489, 661653, 689761, 715330, 712856, 719092, 714721, 716030, 702586, 682442, 693546, 686759, 676523, 665485, 658114, 610172, 539045, 534192, 532342, 530693, 527507, 506544, 497964, 481838, 455551, 494678, 525394, 524684, 503020, 450387, 481087, 480925, 475576, 483924, 517033, 509436, 509139, 506131, 475735, 429913, 455327, 430767, 376346, 346471, 374397]
17390C74397j3219q1962p1479j0484n784J2638O2955N3034K9481k3599m7225l3337
17378B45416K566K3704L0589m589j8922k9023N796M9466L3341k999J601j4394
17366C22552k4582K9816j5053K3322M3359o8280l130J4391J6144k6821n3291o1633
17354A96794l3406L5855K4426J7050k2502M6735J03070L3810N412m8829q3207
17343B75208m1891J6008L7925K1555m7037L2881K9589q625m2283j5624m0566K8119
17331B45259l3037l8847j9803L9417P3938O5809M2892j925n3483l6929r1181L620
17319A95730r782j8867o2804J0127K6379L7293O0475O1397k2123p2463l3942p184
17307A64236m956j8040K0658M3295l741o465O5548N2724k1920l6905j6050m8294
$$ y = [374397, 361178, 279216, 207737, 197253, 191469, 204107, 267062, 320096, 349577, 325978, 278753, 245416, 247982, 271686, 302275, 297686, 278764, 249741, 255537, 305003, 338344, 335345, 336946, 322552, 297970, 327786, 312733, 336055, 379414, 311134, 308004, 322395, 338539, 311718, 258427, 196794, 163388, 199243, 223669, 240719, 218217, 264952, 368022, 401832, 407244, 358415, 275208, 233317, 249325, 287250, 308805, 261768, 294649, 324238, 315613, 273330, 257706, 217140, 245259, 212222, 173375, 153572, 192989, 266927, 332736, 375628, 373703, 320220, 283291, 192110, 195730, 185948, 167081, 104277, 114404, 140783, 178076, 238551, 299948, 277825, 205362, 171420, 164236, 159280, 141240, 161898, 205193, 201452, 194987, 260535, 313259, 291339, 254434, 238384, 190090]
17295A90090l1667k3189M992N3717k8030j8942M9496m696m6534k9813J8098J3747
17283A47269j466k4556K2347k7541n3187L3495K4840K2159M4063L6653J6993j5552
17271B25517k8307N969M908k8094L34m1085K27J2945k8722K2292j387n1036n3063
17258D0498M3053Q507M570J9728l8047j0965J3119O7487J7972J4351m8563m9273
17246H2437J3901j2860J9545M2454P2423Q3682R0890P5637J39613N4057n4402
17235F07377r4370q7237j28842n2852q0499m8634m7245L2662N1169N4724K8989
17224B35242L0269j0509K0374j7243L6970J7359L8547L6407J00708J05997N7184
17213F51305m2424j27903n3969J0773l2252n0391J6608J43178J12125J3689n1957
$$ y = [190090, 158423, 135234, 140226, 193943, 165913, 146971, 196467, 191771, 145237, 115424, 133522, 147269, 145803, 121247, 143594, 116053, 62866, 96361, 121201, 143360, 187423, 224076, 241069, 225517, 197210, 203179, 208087, 179993, 180327, 139242, 139469, 152414, 123692, 145984, 144597, 93561, 40498, 83551, 92058, 96628, 116356, 78309, 67344, 80463, 147950, 165922, 180273, 131710, 82437, 96338, 83478, 103023, 145477, 217900, 301582, 392472, 468109, 607722, 661779, 607377, 513007, 425770, 296928, 244076, 163577, 114943, 67698, 100360, 151529, 206253, 235242, 265511, 255002, 275376, 258133, 295103, 312462, 351009, 387416, 488124, 594121, 651305, 608881, 480978, 427009, 437782, 405530, 355139, 371747, 514925, 627050, 640739, 588782]
17202E88782q1199q6844j25069j11114m3161J381r438J0218N906l5568j3058K0497
17190A21333N2943K381k0485j7116N9348Q0676J59415Q4007L4469q2576o0141
17179D14254n6679p0201m5076l8005n6661r0346m2207l6723j6536M1694J8524
17168B2038M5556J1201O928O328O289O936L7396o2288m2722K7767n172Q175p807
17155F0625M0241k9440n073N349M5324J3362J0618o1023k6693P5543P0982k4172
17143A75643n3042K4588N460r6714k8001M2138K2596k0985n0675N849K8834M6740
17131A02431o062k8461l0214K2371L6675J3335o082l1981n3226K607k2911j002
17119b520J7389j7344m1101l3465M0181L5463L0534N5783O868n9253m4966o651
$$ y = [588782, 507583, 420739, 295670, 184556, 141395, 142776, 133338, 143556, 149462, 113894, 100836, 121333, 174276, 176657, 156172, 139056, 198404, 279080, 438495, 522502, 556971, 474395, 414254, 357575, 287374, 242298, 204293, 147632, 57286, 15079, -21644, -38180, 3514, 22038, 67594, 78795, 85723, 92051, 98340, 105276, 142672, 80384, 37662, 65429, 60257, 68432, 60625, 100866, 71426, 66353, 71702, 117026, 130388, 141006, 79983, 53290, 128833, 199815, 175643, 122601, 147189, 152649, 55935, 27934, 70072, 92668, 71683, 21008, 26857, 55691, 102431, 96369, 67908, 37694, 60065, 96740, 110075, 103993, 72012, 18786, 21393, -1518, -2520, 14869, -2475, -43576, -77041, -36860, -1397, 29137, 84920, 91788, 32535, -12431, -19082]
17107a9082O521Q4943M8892J5242o431l4881O269J9577L4113R77j7596m2262l8993
17094E7289K2130J3617l7583j958K3508L4459j1049n7857j0348q199j2707P426
17082A8728K0155L1221K5179K0609o2147M367J1754k3670J7615M1519m9340p671
17070D8319j0899J6548m7007l4237l0767J3864N1687P9849N0250n1360p233k9500
17058D9514p3871P3139M3168M1583J870k5206j0271j3766K6281k6734J7901Q0356
17046A83964J0289L053L7647L3544L3949J01685J22131Q5800l9109l3415p6545
17035D62993J4458L6980Q5847N4938q023q1847j60947j14086k7494j1879n5409
17024A95531J1688J6422m3865K0368M2728O0987J97748J32534J5790n9302m2110
$$ y = [-19082, -12561, 72382, 121274, 136516, 130085, 95204, 101473, 121050, 155163, 156140, 138544, 96282, 57289, 79419, 93036, 55453, 53495, 77003, 111462, 100413, 42556, 32208, 24009, 11302, 18728, 38883, 70104, 95283, 115892, 53745, 58112, 69866, 46196, 63811, 105330, 55990, 48319, 37420, 53968, 6961, -27276, -58043, -44179, 7508, 87357, 137607, 86247, 79014, 49514, -24357, 48782, 91950, 133533, 135403, 110197, 99926, 86160, 112441, 85707, 103608, 183964, 194253, 197306, 234953, 268497, 302446, 404131, 526262, 612062, 572953, 539538, 462993, 477451, 514431, 600278, 655216, 647193, 565346, 404399, 290313, 262819, 250940, 195531, 207219, 223641, 179776, 200144, 242872, 303859, 501607, 634141, 649931, 590629, 548519]
17013E48519p0446J454L3871K7405L0777l237q6269j33527j62128j10295J3873
17002H9997M09M6836K2356p4066m2161J2867M1028K5359l552p7770L1353J5614
16990H8270q860p086k8296M0505L7765m2912J7582j9297l5283N018M5748K7395
16978A20549N033K2751L988m3957k5047l6562P922m7250n4342L7125L1344p3948
16966e2394m1422m356j1934L3974L9884P4361L0009K5242j5304J4817k56k2209
16954G0412l6538j4802M513M004l5675l2309L955k128L1991L0917j9130k8157
16942b2947L5172J98j7081l407O472o595L9619j3596k4659J122j6237K510L394
16929a6035J9103J27l1572k081K5990J5336k8752l3113L2147J7701K1978N3987
$$ y = [548519, 478073, 479527, 513398, 540803, 571580, 568343, 482074, 348547, 186419, 76124, 89997, 90406, 137242, 159598, 85532, 43371, 56238, 97266, 122625, 119073, 41303, 72656, 88270, 79410, 72324, 44028, 84533, 122298, 79386, 96968, 77671, 42388, 47406, 93154, 120549, 125582, 148333, 152321, 108364, 83317, 46755, 54677, 7427, -46915, -9790, 21554, -52394, -93816, -98172, -110106, -76132, -36248, 38113, 68122, 93364, 78060, 92877, 92621, 70412, 33874, 19072, 23585, 27589, -8086, -40395, -36440, -38568, -6577, 24340, 5210, -22947, 12225, 12423, -4658, -8065, -1593, -8188, 31431, 17835, -6824, -5702, -21939, -19429, -16035, 3068, 3195, -28377, -30458, -4468, 10868, -17884, -50997, -18850, -1149, 20829, 74816]
16917G4816j5612q1952j9301K1452m272k2031j5011J2116P742l8834O2934N0593
16905C2640r421n8665L4380J9919k1582k6189j2209K57J9204k900m0022J9649
16893d4939L3308l2790k8956P116J8527J00106J6379j4183L0973n2986m3017L1749
16881B1287K7389q6184k5876J5657R871j7465O470M0017j7701k7212r680J9443
16869d3984M9106j3929l4611L3509J3640j7564j1914L4676M8260M2147J94k4989
16857G4541l9490l9194M3504q058n97M0153o0940l3567m3662n7171k7358Q5551
16845f6288J08076O0528m7721n8643j2352J2180K5090l3883o8076J0307r262M4980
16833c5064R8754M2073q1331o9939Q809J3477J9092N464Q144N3456N6849j3441
$$ y = [74816, 59204, -22748, -42049, -20597, -24869, -46900, -61911, -49795, -42053, -80887, -17953, 32640, 23219, -35446, -1066, 18853, -2729, -28918, -41127, -40870, -21666, -24566, -64588, -44939, -11631, -44421, -73377, -66261, -47734, 52372, 68751, 54568, 85541, 32555, -10462, 21287, 48676, -37508, -63384, -47727, -37856, -55321, -48851, -8834, -26535, -53747, -63427, -43984, 5122, -8807, -43418, -9909, 3731, -13833, -25747, 8929, 57189, 99336, 99530, 74541, 35051, -4143, 39361, 31303, 30706, 70859, 9919, -23648, -67310, -124481, -151839, -66288, 41788, 102316, 54595, -4048, -16400, -4220, 20870, -13013, -81089, -70782, -80044, -35064, 63690, 105763, 24432, -45507, -36698, -23221, -4129, 1335, 9479, 62935, 119784, 106343]
16821A06343l4506j8743l8587q7224L650M3307K8426o9048J5242k9390j8455Q8181
16809a0804N9449m5394J111k8453n3625L910N4055J8839m5411j124O3208p544
16797H217J1979K6190N8831j2987l3118P372m4449N758L3235N4727o3123o1796
16785i164j9360M3750K6853r723L166K7737j8816m5414K9913O6414n8918k3360
16773A3078M6293l6704k966j2101m576j1669M066k9898J4261l012j0932o01k3500
16760e8261K4644l7139K0160K2375n832P329N0027N9112J526l0924j192k4008
16748B7817k3233J8302l0440n3436N132P391l1473P3669K7048N5777j5545m3696
16736A7313l4459r886m364N6598K1711j1850n2433L832j4012O004L5974L4427
$$ y = [106343, 71837, 53094, 14507, -72717, -69067, -25760, 2666, -66382, -51140, -80530, -98985, -10804, 48645, 3251, 4362, -24091, -77716, -73806, -19751, -912, -46323, -47447, 15761, 8217, 20196, 46386, 105217, 92230, 59112, 66484, 22035, 27793, 61028, 115755, 52632, -9164, -28524, 15226, 42079, 32356, 35522, 63259, 44443, -971, 28942, 95356, 36438, 13078, 59371, 22667, 19701, 7600, 3024, -8645, -4579, -34477, -20216, -23228, -34160, -34761, -58261, -33617, -70756, -50596, -28221, -34053, -26724, 23303, 82415, 83941, 53017, 51825, 27817, 4584, 22886, -7554, -60990, -55858, -48467, -79940, -6271, 20777, 76554, 61009, 17313, -17146, -27032, -31396, 25202, 46913, 35063, -17370, -13538, -27550, -21546, 14428, 48855]
16724D8855o8867l5257L6301L8700K413j1803M304L5201L466k5085j4479l5065
16712b1316l5162O0796Q617q249n627q925N369n604K1686M0355j2399j9650o4772
16699d4881O1630N5741J053j9563r915m2008k0597j6054L3879p312k7741j9676
16687e5444O3096p2379k7605J7744L3152K6733j0553K3136O6115M1357m4288k0511
16675D0553p488k2081k654J3k1745M4826K8551m7031k1102O169N9914k6041l9318
16662g434k3655K8790K426j4134q55N2139O6976l8555k6231l4624Q168l9934J4782
16649a2141j6281j8445K3355O372N024K769j1629o893K4167k4335l2150J9146
16637d1041L1147J0834l122m4941m3439o661L1608n587m1518K5947L1811l3897
$$ y = [48855, -20012, -55269, -18968, 19732, 22145, 10342, 14646, 49847, 53313, 28228, 13749, -21316, -56478, 4318, 12935, 4686, -941, -9866, -4497, -10101, 11585, 51940, 39541, 19891, -44881, 16749, 72490, 73543, 53980, 44065, 2057, -18540, -34594, -715, -8027, -35768, -55444, 7652, -64727, -92332, -74588, -41436, -14703, -25256, -2120, 63995, 105352, 61064, 40553, 33065, 10984, 8330, 8343, -13402, 31424, 59975, 12944, -8158, -1989, 57925, 31884, -7434, -31089, -2299, 127, -14007, -14862, 37277, 104253, 65698, 39467, 4843, 13011, -26923, -12141, -28422, -46867, -23512, -17140, -12116, -9347, -20976, -27869, -3702, -28037, -60187, -41041, -9894, 940, -2182, -47123, -90562, -97223, -65615, -71202, -112720, -86773, -54962, -88859]
16625h8859J2177P918K0609j4600l2429j3288N018L5305J7457L3039K8041O766
16613A7154k7857J2200l1952n565J2867K0532j2268K7494K2909j4637l2118j2762
16601b4003l549L1150M3217L1716R259n6691m1206J9855K2194J6093l8613n147
16589D275O975m409J850L3512l175l0517n0945J45K6123M2271P986M995q405k6666
16575D015N8325K5326m1255m8500Q285M729K9843p0893j1616N1568N2542M3355
16563A05724o9103r8996m0777K000N8348M2280L0557o865m4944q562k643P587
16551b5394K2423K0122r867o211J5861j0861j6060n4494j6780K2911L072l328
16539e8606M1474K7300k4256r202J4088M7502j2720p4202j3653L7493P1101J6812
$$ y = [-88859, -76682, -68764, -48155, -62755, -95184, -108472, -103454, -68149, -50692, -17653, 10388, 17154, -10703, 1497, -30455, -36020, -23153, -2621, -14889, 12605, 35514, 20877, -11241, -24003, -27552, 3598, 46815, 78531, 87790, 31099, -10107, 9748, 31942, 48035, 9422, 4275, 11250, 6841, 8691, 42203, 39028, 8511, -42434, -42289, -16166, 26105, 34091, 39086, 30681, 4015, 62340, 87666, 46411, -2089, 6196, 10925, 40768, -30125, -41741, 9827, 62369, 105724, 36621, -62375, -103152, -101152, -42804, -524, 30033, 23168, -21776, -30338, -32981, -25394, -2971, 17151, 7284, 1073, 16934, 6073, -9987, -64481, -81261, -58350, -55278, -58606, -17132, 10168, -14088, -23290, -9202, 38300, 25580, -48622, -62275, -24782, 46319, 63131]
16527F3131n5766k9716n45n524J6509O1675m0060n9703r356r135J1482Q6681Q184
16514C7857o52K7481o2713l1894J0329K4508K2896o7546j1697J5741J604m1683
16502g5769J6194J7604L2521L8979k9788n2555M7215K244o2755J3266K0829K3660
16490h355K3681k936o613m0863j1131L3701J5423k0268k4266J2480J1078j6917
16478c4986J4210M014Q45o5842k879k45L6451j793J6856K8601K7973J3237k9599
16465F843J4828K1603j1451n4671P883K5655L9620j3160n1845m0675k98q34J4569
16452d1933M8482N0718K3713j8028J2905m5003m5141r788J2004L02j9800O7005
16440C5436K7037k4860n130J3659q998O231k0800j6188l6236k8348m976j1034
$$ y = [63131, 7365, -22351, -22896, -28420, -11911, 49764, 9704, -49999, -59355, -68490, -57008, 29673, 37857, 37205, 64686, 1973, -29921, -19592, 4916, 27812, -39734, -51431, -35690, -34086, -75769, -59575, -41971, -9450, 29529, -259, -52814, -5599, -3355, -66110, -52844, -32015, -8355, 15326, 12390, 5777, -35086, -46217, -12516, 2907, -17361, -41627, -29147, -18069, -34986, -20776, -16762, -15917, -81759, -84638, -84883, -48432, -50225, -33369, -4768, 23205, 36442, 6843, 21671, 43274, 31823, -22848, -14965, 10690, 50310, 37150, -14695, -55370, -55668, -56502, -41933, 6549, 57267, 80980, 62952, 75857, 30854, -14287, -24075, -12071, -11769, -31569, 35436, 62473, 37613, 32483, 46142, 37144, 43375, 22575, 6387, -29849, -58197, -63173, -74207]
16428g4207j4542N7824L2030k357k984k2658N2846k0262K226r102K0076k7655
16416h765K2202L5103K634n5940n9159J6600K9118o454L0568M0639j5149J2824
16404D4221k3400o0433L3858L0133m2930J0006m0361l2418O9231O1753k8605Q357
16392B9412k4754k8614K8785k5649j2173N3947K5815l5928L3042j8785M607k8212
16380A493l66O9335K880N402K6216J8819l0096m8988p6901q8882J9183N4212O1602
16367A3909L895N68L7116m2271j4791j8909J3798L5117l6621o1910o776r60N7889
16354a9946N4116N0065l2083k1741k9769r329J81k7269J2197j811r403k6637o433
16341f7862L1779K5043K5674K0965j2299N363j7909l7939r022P1406N441k2595
$$ y = [-74207, -88749, -30925, 1105, -1252, -4236, -26894, 25952, 5690, 7916, -1186, 18890, -8765, 13437, 48540, 51174, -4766, -63925, -47325, -18207, -24661, 5907, 46546, 31397, 44221, 20821, -39612, -5754, 24379, -18551, -8545, -48906, -81324, -12093, 49660, 21055, 29412, 4658, -23956, 4829, -20820, -32993, 20954, 46769, 10841, 43883, 25098, 29705, 1493, 1127, 70462, 73342, 78744, 104960, 123779, 93683, 44695, -32206, -121088, -101905, -47693, 13909, 17804, 18372, 55488, 13217, -1574, -20483, -6685, 28432, -8189, -70099, -76875, -77835, -19946, 34170, 84235, 52152, 30411, 642, -8687, -8506, -35775, -23578, -25389, -34792, -61429, -67862, -36083, -11040, 14634, 35599, 23300, 28663, 10754, -27185, -36207, 35199, 40640, 18045]
16329A8045P208K7736J9367J6839l458n5776K374N3906L4901j8447m0101o8488
16317e894l6082j0260m760m4442M5502M9260N0439O043l5850J6736m3851N239
16305g920N6084J807M6186K7141k9004k1085k9316m1211j4813L5862M7815O0951
16293A32497j9419p58k1072m6721j0054j5643l3037j9097M9581K2974L773Q352
16281E1376l4355k9669n5261l8151L9824J02273L2595l8867j7094J826j1328k8834
16269b5665j6920L4449J8200j3199J7902Q845J5176l7736k7959l0032M4138L8022
16257B5221m710m7735j9393j8198M3220m4460K3858P2901l1545k9458L8652L5842
16245D4195k5955n2803n8421O747J17553K2703p4652l1378M424j4322j8246N6476
$$ y = [18045, 25253, 52989, 72356, 89195, 85737, 29961, 32335, 86241, 121142, 102695, 62594, -5894, -41976, -52236, -56996, -101438, -55936, -6676, 43763, 49806, 13956, 30692, -13159, -7920, 48164, 49971, 96157, 123298, 94294, 73209, 43893, 2682, -12131, 23731, 71546, 132497, 113078, 112320, 91248, 44527, 34473, 18830, -14207, -33304, 16277, 39251, 43024, 51376, 17021, -12648, -67909, -106060, -66236, 36037, 68632, 29765, 12671, 14497, 3169, -25665, -42585, -8136, 10064, -3135, 14767, 23612, 38788, 1052, -26907, -56939, -12801, 25221, 20511, -27224, -46617, -64815, -21595, -66055, -42197, 30704, -841, -30299, 8353, 44195, 18240, -34563, -92984, -86237, 31316, 54019, -20633, -52011, -47587, -61909, -80155, -23679]
16233b3679L5605j209m9175L1082R5894j8013k1721n505k4934q6661J2134J4012
16221d2170k832O988M5654K699j1647k4332r664l0896Q0235M1366K5947m5733
16209C5615K794J6988l2987l9003l187Q228J8951J1824K0404j453r008l7089L900
16196d023J3165j9779l8779J2330q378m1311K5933k2115K622K6590K8437N3762
16184B8454n5502J6315K4084j0311q903J7589k8885q615J9970K2483k5426k4274
16172c3021M8654L4435J8670L8664m6493j4654o1724n736L9128P8011M75m3244
16160E3165r0513k9712l8942j1060k4107J5121J8022L9194L9927r900K9553K5670
16148A6418j5770N6796J4881m0172n3701m6667k0677L0123J1374k3843K1867J4183
$$ y = [-23679, 11926, 10717, -38458, -7376, 88518, 70505, 48784, 43279, 18345, -68316, -56182, -42170, -45002, -38014, 7640, 10339, -1308, -25640, -35304, -66200, 14035, 55401, 81348, 35615, 38409, 55397, 22410, -16593, -19780, -11552, 7399, 19223, 39627, 38174, 29166, -7923, -4023, 9142, -10637, -49416, -37086, -45464, -86775, -60842, -82957, -80335, -53745, -25308, 28454, -27048, -10733, 13351, 3040, -5863, 11726, -17159, -25774, -5804, 16679, -8747, -33021, 15633, 50068, 68738, 107402, 60909, 46255, -15469, -21205, 17923, 95934, 96409, 53165, -37348, -67060, -106002, -117062, -141169, -126048, -108026, -68832, -28905, -38805, -9252, 16418, 648, 57444, 72325, 32153, -21548, -68215, -88892, -58769, -47395, -71238, -49371, -35188]
16136c5188K2155J1290l8891O097j3639m0711K6226J8339j4162L7980j1007m5290
16124g6801l628k846J6342O7524j7112m2515q465m7278J6559L1841N6745k057
16112a1691N0322J4980l2505p484j9766j8349J6983L5564K1780l4819J1922n2762
16100b5825l1263J5308L5086L1216l7203k6784J9940j9999M676l7069j1333M3143
16088d0107J8081l0350Q156K3543N2810k5091k1617K439L4418M2118l2467m1407
16076i474N419k0437N2362J6345k8624n2258j5460N3052K6102m1417K8990Q921
16064B3521m994P529j205o5734k9563O789M8619P3216j2239m6458j7641K3328
16052E168j3191p3848K1325L4040K8568N1958n2857n4194N0093K9187o1874K7688
$$ y = [-35188, -13033, -1743, -40634, -34537, -48176, -88887, -62661, -44322, -58484, -20504, -31511, -76801, -80429, -83275, -66933, 591, -16521, -59036, -67501, -114779, -98220, -66379, -9634, -11691, 38631, 53611, 21106, 13622, -6144, -24493, -7510, 28054, 49834, 15015, 26937, -25825, -57088, -41780, -6694, 24522, -12681, -39465, -19525, -39524, -34848, -71917, -83250, -40107, -22026, -52376, -44220, -20677, 32133, 7042, -14575, -12136, 22282, 64400, 31933, -9474, -4055, -24492, 27870, 44215, 15591, -36667, -52127, 925, 27027, -14390, 14600, 23521, 18527, 26056, 24851, -40883, -70446, -63657, -15038, 58178, 45939, -519, -18160, 5168, -8023, -81871, -60546, -26506, 2062, 54020, 1163, -53031, -2938, 26249, -35625, -7937]
16040g937n101n1067O324J9113J5116O873M367j6793o1767q1998M2L8616N3634
16027h0578M5848K9968p597J0728O9030o7908l0820j7104k4284j4123K9972J3226
16015d3642J4323k0730K1445K6727L4620m0209J3252n6685o8780L4118N2967M1882
16003I288L9602O4401j935m4031l2497j4961k0406J3892N0366L6780P827j0418
15991I7908l3682j811m8802m2853J7824K2032K2972J1087R567M900k0355k2572
15979A6215m7229L2087O945K0365K292K0099j8002o6178P224N9459M8516k250
15967G9543j4763L1580m281p6506l0496n6152j0289K3059o944j1484m0052j4115
15955a30900J7740K5821M0147j6895J6209K8531M0756L8583n11m5453N2499J7871
$$ y = [-7937, -13038, -64105, -57781, -38668, -23552, -16679, -12312, -29105, -90872, -172870, -172828, -134212, -80578, -34730, -4762, -12359, -1631, 67399, -509, -31329, -48433, -72717, -86840, -56868, -43642, -29319, -50049, -28604, -1877, 32743, -7466, 5786, -50899, -119679, -85561, -32594, 9288, 48890, 113291, 111356, 67325, 34828, 19867, -539, 13353, 63719, 100499, 108326, 97908, 64226, 62415, 13613, -29240, -11416, 10616, 33588, 44675, 54242, 59142, 38787, 16215, -31014, 1073, 8018, 28383, 30675, 50774, 32772, -33406, -26182, 33277, 81793, 79543, 64780, 96360, 92079, 15573, -14923, -71075, -81364, -58305, -65249, -76733, -116785, -130900, -113160, -87339, -47192, -64087, -47878, -19347, 21409, 59992, 59481, 14028, 66527, 84398]
15943H4398m7592l139k5303l6631J7856j3142k6615Q404j118l405j0832L0098
15931b7021j1062j4006N1170M9659k521l3159l9682J451Q759n973m246K0578l1731
15918c7784m6024J6481m7007l015Q468l2251k402L5374J1321r505K0056r482k7013
15905a22783q117K1035N8278L4514o559n2701J4769J7402l498l2309K7908j9922
15893g1983k4625n9564N1956K9838L0314K2054j3294j3722P688K4077J3103J6395
15881A2237M0389M8969Q309o7472j8280K1540o6342r2872M9130L5993K726q676
15869c4349L2127j0919m9973O276L0745J3313k0175n740J6285L7620K8362l0265
15857A3307K7702l6608j0051k407p6631m0440J1519k16J9469K5764k7181M3115
$$ y = [84398, 36806, 33667, 8364, -28267, -10411, -23553, -50168, -41764, -42882, -46287, -57119, -27021, -38083, -52089, -919, 48740, 46219, 13060, -26622, -25171, -16412, -22385, -26631, -6053, -37784, -83808, -67327, -114334, -117349, -108881, -141132, -143534, -108160, -96839, -106344, -86288, -95770, -122783, -130900, -109865, -51587, -17073, -23632, -76333, -61564, -44162, -47660, -79969, -52061, -71983, -96608, -156172, -104216, -74378, -44064, -22010, -35304, -49026, -41338, -17261, -4158, 12237, 52626, 101595, 109904, 42432, 24152, 45692, -20650, -113522, -64392, -28399, -25673, -34349, -2222, -13141, -63114, -56838, -26093, -12780, -32955, -38695, -22410, 15210, 43572, 13307, 41009, 4401, -5650, -8057, -84688, -125128, -113609, -113825, -94356, -68592, -95773, -52658]
15845e2658q126M5960K8343K5499j3053j590K1733q22k7080J1864o641o4301L0001
15832a0871K1666L9490j9043n8941j9454L0100K5073J2815l7781j9155l1890J8074
15820d9917L8384R794M0330q134k2740o4315J6415K7476P951J2847k796J4903
15808B0198M391K208j8648K5000k1086o211K3292L4558j5229l7330J03J9066j4106
15795A6206N144J2213k0123p4468m4171j155j8672O7101P5729J6148q257j7886
15783G809N3935n8017o2236P986K6990j4587p5166J5815K6022J5538L1149L9916
15771A5154o722j0206J0108J8564M5452k748j9261M016J544n3183j6383O3609
15759D9944l8615k9030R9752k5664p9851M1598M4220n9701J2430K4354p351p152
$$ y = [-52658, -60784, -14824, 13519, 39018, 25965, 24375, 46108, 45286, 18206, 30070, 23429, -40872, -10871, 10795, 50285, 31242, -27699, -47153, -17053, 8020, 20835, -16946, -36101, -67991, -49917, -11533, -1739, 38591, 30457, 7717, -56598, -40183, -12707, -4756, 8091, 5295, 20198, 24589, 26797, 8149, 33149, 12063, 5852, 29144, 63702, 48473, 11143, 11246, 30312, 16206, 21350, 33563, 13440, -61028, -105199, -106354, -125026, -57925, 17804, 33952, 25695, 7809, 61744, 3727, -58509, -50523, -23533, -38120, -113286, -97471, -71449, -55911, -24762, 15154, 8432, -1774, 8334, 26898, 72350, 69602, 50341, 54357, 55901, 2718, -13665, 49944, 11329, -17701, 82051, 56387, -23464, 18134, 62354, 2653, 15083, 39437, 32086, 24934]
15747B4934J0898M7142o5783q3245P584L9984O5323j1260o9901q231K8660l0142
15735d4037M2953J7424j6398J3670k3449o1012J3410q663k0011J4487J1757L2751
15723b7118M9407L3214K5476j0884p5337n7817L4004K5407N418m4683m1256J1528
15711g2641L0250p9724k3082M1813q661K64L3186K0832K7424J5458j7980l1588
15699f4449q276J2578M446n2910J531J1584j9804j9122O2442M4418M8761j2049
15687I150m6826k7173l7310K285M5591L4927m422p5163o4390J0513R0686O1847
15675b85k1854l1038n026L7434k3112K5169l4561l4880J1723K6357j7332j1475
15663g8880l976K0692M6311K5358J8254K9253K3923l5270p6308J1452K1020M4454
$$ y = [24934, 35832, 82974, 17191, -66054, -58470, -18486, 46837, 35577, -34324, -42555, -13895, -44037, -1084, 16340, -58, 13612, -9837, -70849, -57439, -66102, -86113, -71626, -59869, -27118, 22289, 55503, 80979, 70095, -5242, -63059, -29055, -3648, 1770, -42913, -84169, -72641, -42391, -122115, -145197, -103384, -112045, -111781, -78595, -57763, -30339, -14881, -32861, -64449, -72725, -60147, -55701, -108611, -107080, -95496, -115300, -134422, -71980, -27562, 21199, 9150, -37676, -64849, -102159, -99874, -54283, -19356, -23778, -98941, -163331, -152818, -62132, -285, -22139, -53177, -58203, -20769, -43881, -18712, -53273, -88153, -76430, -50073, -67405, -78880, -82856, -62164, -15853, 9505, 27759, 57012, 80935, 45665, -30643, -19191, 1829, 46283]
15651D6283Q094m6314o1038n0020J82J9583K7240k4468j1015K8197N8259M183
15639h34o6664k978p581n591M5994L6764j9762o7496j8341P3628J3629l0009j7647
15626f6888q47L9415l3367j3194j7557Q37L1432l981N78j2823J296L2463M1799
15613h37Q970k525k7614R031k6810k5515q166j9780l0568M6084O9853l8818J6369
15600c0326j2472j1175j8340J8959L4529K8223n224k4660J6930J4227K6841j0269
15588B7243k2333n1022M696j5299j6335M2007J7099l0244j7741k3448j4669N2484
15576d7562m110m3104L0883O7484j9077l7486l7459m3592M6473M4220M1840M4976
15564D3486K1301j5265q1551p4067J2177r736O6778N0646L8708k9041n1026j7944
$$ y = [46283, 54377, 8063, -52975, -102995, -102813, -83230, -55990, -80458, -91473, -63276, -5017, -834, -67498, -70476, -78057, -83648, -37654, -890, -20652, -88148, -106489, -32861, -19232, -49241, -66888, -67735, -28320, -61687, -74881, -92438, -91601, -60169, -64150, -63572, -76395, -75099, -42636, -837, 8133, 5608, -22006, -12975, -39785, -65300, -73466, -93246, -123814, -77730, -7877, -46695, -30326, -42798, -53973, -72313, -53354, -18825, 9398, 4174, -20486, -3556, 10671, 37512, 27243, 4910, -46112, -41416, -56715, -73050, -31043, -13944, -44188, -61929, -85377, -100046, -47562, -51672, -94776, -63893, 3591, -15486, -52972, -90431, -134023, -87550, -43330, -1490, 43486, 64787, 49522, -32029, -106096, -93919, -103655, -36877, 13769, 52477, 23436, -27590, -45534]
15552d5534L5604k1196J973m6028J6221O8062M5846j8684p3990r340Q4070K7163
15540F4167j8817J2852J5781k87J11n362o3377k8502j4709o5550n7299j9393P8369
15527a02016R7770M9216K734n5400J0310P810Q617m3150K1646q654L56n6993q1961
15514a49715J2285N3654r615J1181j5263M6742K8114j8772j4474l116L7182J1044
15502a0753J400l9278J3972L2842Q3150R1762p004k6596l9531k9003r2586k1183
15490d2808k8522K9691O6946J1430o597k7459m9378P018J5286M9231L2885r327
15478D8396n0076N466l9758j5116M3595J9432n9033j7000K5541l0219L8482J114
15466b9176p0095k2196K1238M7228J6341J2829J4893j2615J9671P2412M4499l0963
$$ y = [-45534, -9930, -31126, -29153, -75181, -58960, 9102, 54948, 36264, -37726, -47066, 37004, 64167, 45350, 58202, 73983, 73696, 73807, 68445, 5068, -23434, -38143, -103693, -160992, -180385, -102016, -4246, 44970, 47704, -7696, 2614, 10424, 19041, -24109, -2463, -11117, -10761, -67754, -149715, -137430, -83776, -93391, -82210, -97473, -50731, -22617, -41389, -55863, -58979, -21797, -10753, -9353, -48631, -34659, -1817, 81333, 173095, 166091, 139495, 99964, 70961, -21625, -42808, -71330, -41639, 25307, 36737, 30140, 2681, -46697, -39679, -24393, 24838, 57723, 48396, -1680, 3786, -35972, -51088, -7493, 11939, -47094, -64094, -38553, -68772, -30290, -29176, -99271, -121467, -100229, -53001, -36660, -23831, -8938, -21553, -1882, 70530, 115029, 84066]
15454H4066j310k1741K311J1431k341k1375l0877k2720L1527j724m9460l9760
15442f1973K8471K4036O4436K1231j4724m6896K068L383j7680k1430R772o578
15430a5884M3131L3718k0385l4633M7366k1723n9056L7259j2837m7854K6472k1502
15418d5928j3146m265J400j9764L371L1578K9688J3993l6246K988K9385L2277
15406B5331j1556K2799j178m7654K9095n1511n2196l381R1545L9466r3916j9924
15394g3080M0145N1099L6365j7378k3148p534J3289J9182n3538o1916j6541M6984
15382d6071p315N3858L1621Q333n3631P729L924K0823J2056n6373J6554n0707
15370e9199k9381O4455N5990L7457L2191J9002k9380j8984k4972J4312n070j6074
$$ y = [84066, 82756, 61015, 63326, 74757, 72416, 51041, 20164, -2556, 28971, 27247, -22213, -61973, -33502, -9466, 54970, 76201, 61477, 14581, 16649, 20032, 2352, -19078, -9306, -15884, 27247, 60965, 40580, 5947, 53313, 31590, -27466, 9793, -3044, -50898, -24426, -45928, -59074, -63339, -61939, -81703, -78332, -46754, -17066, -3073, -39319, -36331, -6946, 25331, 13775, 36574, 35396, -12258, 16837, -34674, -86870, -90251, 1294, 40760, -53156, -73080, -32935, 18164, 54529, 37151, 14003, 6469, 19758, 38940, -14598, -76514, -93055, -46071, -53386, 472, 32093, 40426, -13205, -5476, -1552, 19271, 31327, -25046, -8492, -59199, -88580, -24125, 31865, 69322, 101513, 120515, 91135, 72151, 47179, 61491, 56421, 40347]
15358D0347L7757N3463l4776k1667o1683k1903J9301o459j9697K9641j5194k7577
15346b8447p606l9992J4770O5211L7357k0319r1649J5965M0305l9838o079K2672
15334c7650L1585k3319j8517J9083O640j8355r936J2850M6162J4444m2588J069
15322a8532m233K0246N2434M188n1251j7704k9316J3251J7841K5688K2268K8688
15310F3568L2774n4551m4066q234J7064P9344J2160k2126J9166m8255j4122l071
15298B9651L194m8k2871L104l17M4935N1133l0134P123k8857m1487o2197K0538
15285b6233M4449o69J6304P752O142k0114J8930q996k7881j2923L265K2049K1324
15272D3399k2774L4107K8720o3178m3421K2376j7498k2978O8591M4467q823k1827
$$ y = [40347, 78104, 131567, 96791, 75124, 13441, -8462, 10839, 4380, -15317, 14324, -870, -28447, -36053, -76045, -61275, 3936, 41293, 20974, -70675, -54710, -14405, -54243, -60322, -37650, -6065, -29384, -47901, -28818, -22178, -40533, -50469, -37619, 8543, 22987, -19601, -18532, -22765, -2519, 49915, 54103, 2852, -14852, -44168, -30917, -13076, 12612, 34880, 63568, 96342, 41791, -2275, -10509, 6555, 85899, 98059, 75933, 95099, 46844, 32722, 29651, 32845, 32797, 9926, 13030, 12713, 57648, 108781, 78647, 85770, 56913, 15426, -46771, -26233, 18216, 17547, 33851, 41603, 47745, 27631, 46561, 37565, 9684, -3239, 26, 22075, 43399, 20625, 54732, 83452, 20274, -23147, -771, -18269, -41247, 27344, 71811, 62988, 41161]
15260D1161j1307J9069j816r721k6275P54L7022P693l7554J7433L4273l056L2367
15247A00043L907o3654l7080K2591j2312l7819m2333R217K8791M6994m4101p318
15235c3074m2473q586L3772M2804R906k1111m9106m0359K4516O9207L2430l6287
15223a8361M0777N0583k3543q482j3866k8624O5307P352l3997k5308O589K0319
15211C8746O815o8668k6905L4814M7405L28N2169K4372m0478m4041k4538p395
15199g376K0515M2082j3954l7922k5790J182L0796J4954j7004l6238j0112M6384
15187G517L6429m2418k4345L2083j9763j845j9707k1317P8017j1006l0848k1005
15175c8208o2674j4924L3957L8887o193L0399j9646K076J8434J2787O183k3186
$$ y = [41161, 29854, 48923, 47107, 37386, 11111, 11865, 48887, 56580, 19026, 36459, 70732, 67676, 100043, 103950, 40296, 3216, 25807, 13495, -24324, -66657, -57440, -28649, 18345, -25756, -33074, -75547, -84133, -50361, -7557, 2349, -18762, -67868, -108227, -83711, -14504, 17926, -18361, 22416, 72999, 49456, 40974, 27108, -1516, 63791, 71143, 37146, 11838, 18427, 38746, 45561, -23107, -50012, -15198, 32207, 32535, 84704, 109076, 68598, 24557, 19, -7376, 13139, 55221, 41267, 3345, -22445, -21263, 9533, 24487, 7483, -28755, -38867, 7517, 43946, 1528, -22817, 9266, -10497, -12342, -32049, -53366, 24651, 13645, -17203, -38208, -100882, -115806, -81849, -42962, -49155, -18756, -38402, -36326, -17892, -5105, 1078, -22108]
15163b2108J6456J1356k1622l110L0717P7841K0676j8531j6873k5430j5872L576
15151C7076o1035l643j5394p804j0632l7204M1865N8000J6176n6852N160k3694
15139e7981l4730n5133K1549L6252j0724r102M3971m5560j3078J9714N3943N7745
15127F866J0040K3223J6826o4936O590J6177k9024n159o5506O725K1818K0993
15115c5367M5050j6195J335M5155m166j2326p684L3496m3145q2214N37M2409M1111
15102G996M4626k5869l3824j1272J9951L288K1961j8776n0317j2060J430l4589
15090h7455L1016O507O9169L1156r461j4128j0073q360n926J7148N406M708o4924
15077c5217l5132O1876K1191J9387k578l6401K1578n4813n4947K280L5432J3733
$$ y = [-22108, -5652, 5704, -15918, -19028, 11689, 89530, 110206, 91675, 74802, 49372, 33500, 37076, -23959, -27602, -42996, -50800, -61432, -98636, -56771, 1229, 17405, -39447, -34287, -57981, -92711, -147844, -126295, -90043, -100767, -109869, -65898, -111458, -124536, -104822, -50879, 6866, 16906, 40129, 56955, -7981, -1391, 14786, -14238, -19397, -84903, -78178, -56360, -35367, 9683, -6512, -5177, 39978, 35812, 23486, 15802, 49298, 6153, -76061, -75524, -33115, 7996, 52622, 26753, -7071, -18343, 1608, 4896, 26857, 8081, -42236, -54296, -52866, -87455, -56439, -49932, 19237, 50393, 40932, 26804, 16731, 8371, 2445, 19593, 24999, 29707, -35217, -70349, -8473, 12718, 32105, 29527, -6874, 14704, -40109, -95056, -92776, -57344, -43611]
15065d3611L3604N9688R482N658n6302r2579j284O0263J6828L869O715J4752l6298
15052a9215j9147J0020j9814J749K0516j290l0710M0973J1846J185N543j6936
15040a5280K6298M923L9235j0008l3865n1474j030J4590j8509r89J6584L0520
15028I95k1949K4299P2185l5445p1228O775O475K0431J4684J5360k852m8088K0062
15015A704O1981q3034l0310J7957n92K4961M7190J6403J6391l7003m6312J3178
15003B514K9336K9821j8114l0021n0618k4703O388J9655K751Q116M018N0311K2759
14990E2213l608k6805O725k0585J131j7735q126k4844M4429O9392k1213J4081
14978F5055J5511j3707J4492o9044K855L1437K5845j2342l0292l0035m452m3689
$$ y = [-43611, -10007, 49681, 59163, 64821, 8519, -84060, -85344, -25081, -8253, -4384, 2331, 17083, -19215, -38362, -28342, -48156, -46407, -25891, -27181, -57891, -16918, -5072, -3887, 1656, -15280, 11018, 15941, 55176, 45168, 11303, -40171, -41201, -26611, -45120, -46109, -29525, 995, -20954, 3345, 75530, 40085, -31143, -24368, -17893, 2538, 17222, 32582, 29730, -18358, 1704, 63685, -19349, -49659, -31702, -32294, -7333, 39857, 56260, 72651, 35648, -10664, 2514, 31850, 61671, 43557, 13536, -37082, -61785, -55397, -35742, -32991, -24875, -20857, 29454, 52213, 48605, 21800, 28525, 7940, 9071, -8664, -16790, -41634, 2795, 72187, 50974, 65055, 80566, 66859, 81351, 12307, 15162, 46599, 72444, 60102, 29810, -225, -4677, -48366]
14966d8366r230N4194R09m4522N203m756l60L4683J9187r007j8868q833K201J1517
14952a6048K062o5080R491O0151j9286k9364K864N1186m9636m5236q666L3123
14940g4439J353L6443n7452m2147J681M4305K0083O3460K2105J5191K2589O326
14928E9498r797k3984J1972k3912k0282J6750P722J8513J9010r16k0389j6115
14916A8070q4640k7280M7558N2756j9715N5599L0007j8110O305l2055m0059m6391
14904e7955o4005L8228J2267k0065m1480L5196O6787q252M5307j1400n5025k5056
14892h5453L1166N9822M6580l170l6533k1225k4515l1614K5117M9057J5394j8900
14880E726m4369l239K2780k3319l7418L3144O3857o368L21L9525m05r779J2011
$$ y = [-48366, -57596, -3402, -2493, -47015, -41812, -46568, -46928, -12245, 6942, -2065, -20933, -29766, -27565, -16048, -13986, -79066, -69575, -9424, -28710, -58074, -55210, -4024, -53660, -98896, -107562, -74439, -73086, -36643, -94095, -136242, -134561, -90256, -70173, -6713, 15392, 30583, 53172, 59498, 49701, 25717, 37689, 13777, -6505, 10245, 17967, 36480, 55490, 54574, 34185, 18070, -66570, -93850, -46292, 6464, -13251, 42348, 72355, 54245, 60550, 28495, -11564, -57955, -121960, -83732, -71465, -91530, -133010, -97814, -31027, -39279, 6028, -5372, -60397, -85453, -54287, 5535, 52115, 48945, 12412, -8813, -33328, -64942, -39825, 9232, 24626, 5726, -38643, -41882, -19102, -42421, -79839, -46695, 17162, 10794, 11115, 50640, 50235, 40456, 52467]
14867E2467K3415J7346o759p28o1495J7873j8688l0695j0103K5457n2528J2226
14855c2212O5068L4488J54l6806k4771j0864N4613m78n154K812K3089k6208J5433
14842E9164k3132j8498K0991L4872o2681q0640M7794O5004j6682j3400Q783J173
14830B2748J1517j1772j1007m3115O71j0444M7412K7281n1166L1178l7681p596
14818c1974K2099K8445J3809J6808l5650l9149M5650L5138n028m2401L2044L2904
14806G2695j4061k3399l4684o621k8079M1829l1582k4007J0065L8320K3228k1147
14794B557l2212M7984k7132n8564P2392L931J7952L4656l3754q217J5370K0837
14782E5800L2059L4095n7153k4531k877o5908m1135P324K7794R113M1147K7084
$$ y = [52467, 75882, 93228, 86469, 85741, 24246, 42119, 23431, -7264, -17367, 8090, -44438, -32212, 32856, 67344, 67498, 30692, 5921, -4943, 49670, 49192, 44038, 46850, 69939, 43731, 59164, 36032, 17534, 38525, 73397, 10716, -69924, -22130, 42874, 26192, 12792, 21575, 22748, 34265, 22493, 11486, -31629, -30958, -41402, 6010, 33291, -17875, 13303, -24378, -31974, -9875, 18570, 32379, 49187, 13537, -25612, 20038, 55176, 50148, 7747, 39791, 72695, 58634, 35235, 551, -6070, -34149, 7680, -23902, -47909, -37844, 476, 23704, 2557, -29655, 18329, -8803, -67367, 5025, 8956, 26908, 61564, 27810, 19593, 34963, 55800, 87859, 121954, 64801, 40270, 37393, -28515, -69650, -62326, -34532, -25419, 15728, 42812]
14770D2812k7474j6137K4744L1218L0349n1083k6820J2761q551J0807L183M647
14758C0456L286j8712o261m18j655J1332J7968M3509O7r4606o7696l546q797L1066
14744f4007K6317n2535r535N2852M7332m4211k8450L3559O7029M2272j3603m5847
14732A1173l1496l1988k4976k809N1164l114j668M3451k116N28l2367k0353q171
14719e2742o8952K038R4065O7193k7222q706l518o854j3105k835k2167K5279K7377
14706I851j7867n091M4194N4953o387p4696k8164m4693j796K3038L405p121o235
14693e6609m8945K3945Q875J5354j0196n057M2638k8864p941N1820L1562J1626
14681B8208P462J9392o9809n9674m2188K5938K2523p0467p397N1442k6566K2484
$$ y = [42812, 15338, -799, 23945, 55163, 85512, 34429, 7609, 20370, 11819, 22626, 25809, 30456, 33742, 15030, 8769, 8351, 6696, 18028, 35996, 79505, 79572, -15034, -82730, -86276, -95073, -64007, -37690, -90225, -99760, -46908, 424, -43787, -72237, -38678, 28351, 70623, 57020, 11173, -20323, -52311, -77287, -80096, -28932, -32046, -33714, 9737, 7621, 8149, -24218, -44571, -52742, -121694, -119656, -25591, 41602, 14380, 5674, 2156, -4698, -17803, -20638, -42805, -17526, 9851, -8016, -13107, 31087, 86040, 79653, 4957, -23207, -67900, -69696, -46658, -43253, -50374, -56609, -105554, -81609, -72734, -57380, -67576, -72633, -29995, -58859, -66800, -14980, 16582, 28208, 35670, 55062, -14747, -74421, -116609, -90671, -68148, -138615, -146012, -94570, -121136, -98652]
14669i8652P592l272k581O0625M0413N625L1553k1188k9949j611j6010K0663L7689
14656C0897j608o8947k6125J295J5470m1011k4242o5068M0898O100k49p9641M2754
14643a69477Q0005N8385J3084J5876j5665k8108m73N7764J9841j9376l1323j130
14631b0597k0048j8581L9836K3953l5883k0185k3152O4351J0672l8332k6968L4574
14619c0360L3665n3444j4109j0870N3334M590o6859j3872L0220r921K4214k8754
14607h2166m3246N0281R5256J1874n806j9867n723k091K3345n23R737j7343j8643
14594d915j8761n6195n5630K0708j745j2098M7329Q2501j6785l0384L5534P5609
14582F5168n312O335r351k0598o2683L0483J4112K6320M278m5396o8347K8006
$$ y = [-98652, -91060, -94332, -96913, -36288, 4125, 9750, 41303, 20115, -9834, -11445, -27455, -6792, 30897, 29289, -39658, -65783, -64488, -49018, -90029, -114271, -179339, -138441, -132341, -132590, -212231, -169477, -89472, -31087, -18003, -2127, -17792, -45900, -46373, 11391, 31232, 11856, -19467, -20597, -40645, -59226, -19390, 4563, -31320, -51505, -74657, -10306, 366, -37966, -64934, -30360, 3305, -50139, -64248, -75118, -21784, -17194, -84053, -97925, -67705, -77626, -53412, -82166, -125412, -75131, 20125, 31999, 26193, 6326, 603, -1488, 21857, 21334, 31071, 13728, -4915, -23676, -79871, -135501, -114793, -116538, -128636, -81307, 1194, -15591, -45975, -10441, 65168, 59856, 66191, 56840, 36242, -26441, 4042, 18154, 44474, 48752, 3356, -64991, -36985]
14570c6985L8153M08N0131M6624K0497o3641m7773p755N8090L5425k8046m9265
14558A5863j7705O649k78M0956j1505k0815l8311K0240O434R181k6509N3757N371
14545D3328L2117K385M1749m893k1482m9910j1309j2369j9509K5953k8201r893
14533a2034L4281J4003K646K6705r976l4260k7847J6008K3730n5297J030K9050
14521H039n7368n240K3881K5465J4852R703l5479r161l343N238J5390j3247K7274
14508F004K8464k573j9688M8336j2981K0092J9038K0632k8525n8801R46k4632
14496c688n7937l2127m380J2529n026J3674P164J0333K078L760j957q000L5219
14483b8358N4773K0550l2296k4045l1841K497J0604J0722L739n659L349L3055
$$ y = [-36985, 1168, 1576, 51707, 98331, 118828, 55187, 7414, -341, 57749, 93174, 65128, 15863, -1842, 4807, 4529, 45485, 33980, 13165, -25146, -4906, 1528, 10709, -15800, 37957, 43328, 75445, 77830, 119579, 114686, 93204, 43294, 31985, 19616, 107, 26060, -2141, -12034, 22247, 36250, 38896, 65601, 55625, 21365, -6482, 9526, 33256, -22041, -21011, 8039, -49329, -54569, -30688, -5223, 9629, 19332, -16147, -25308, -28651, -23413, -8023, -21270, 6004, 34468, 31895, 12207, 60543, 47562, 67654, 86692, 107324, 78799, 19998, 20944, -3688, -61625, -93752, -98132, -85603, -90629, -76955, -69791, -59458, -57380, -53620, -55577, -63577, -28358, 26415, 46965, 14669, -9376, -41217, -38720, -28116, -17394, -13655, -19314, -15965, 17090]
14471A7090j8021J0862N1693l5146q0147p320L3333O087m0848k8353K7203J5644
14459d7923M6511K5238K313l5133k8291L0800K0075O85Q789k9746M7695N5631
14447I6644Q069k7223o9627j234R784J4686L889l1387O950K8665J5842K068m2388
14434A4738j8095k4963L779K890N3679J0809j675K616j6658m9088K965j6962K509
14421c3456j877o181J8360K2049J5826l7743j0611Q166K1855j5212k1616K6672
14409a3768o142q7530j0787J0629q325J2061K2684n96N3804J6851J6665J8564
14397B4110p9672m2519j8285K3198O4191K7206j2752J9091K6580k2954r680j5426
14385a6912O066N3046N7980r789q197K6153o844O193n1328q7595J7486j948k3415
$$ y = [17090, -931, 9931, 61624, 26478, -53669, -60989, -27656, -21569, -62417, -90770, -63567, -47923, -1412, 23826, 26139, -8994, -37285, -6485, 13590, 14275, 23064, -6682, 41013, 96644, 104713, 77490, 7863, 6629, 16413, 31099, 34988, 3601, 10551, 39216, 55058, 57126, 14738, -3357, -28320, -24541, -21651, 32028, 42837, 41162, 43778, 27120, -21968, -19003, -35965, -33456, -35333, -41514, -23154, -1105, 14721, -23022, -33633, -25467, -3612, -18824, -40440, -13768, -19910, -107440, -118227, -107598, -115923, -103862, -81178, -81774, -27970, -11119, 5546, 24110, -55562, -98081, -116366, -93168, -28977, -1771, -14523, 4568, 31148, 8194, -1486, -16912, -10846, 42200, 100180, 90391, 82194, 108347, 101503, 107696, 56368, -31227, -13741, -15689, -39104]
14372c9104J8121L9019J0198J8858m780K6651l6103r8793p415K3916K9903L2728
14360A3199K4704q902K4211K7812p448K1856k7955K6439m064k2704k6233N264
14348D6179M8192m066m6712l2425n4181l8228j4215M4544K1389O6910L7741m6752
14336B8376p3963m7710j6301j8810Q253n736M7179j4899N3368O9368j9534n8022
14324d8431k5694L5206J8955j2198k7519J0511L7768j1025K0421N8633J1437j2751
14312E5313j9655k9463J8793J1312l3714j9370J6715M190j4513O2016M6989n1353
14300D7260r243l1386o1039L981L2543Q983K6523K2825o163r264J6309j5760j8681
14287F888k3939K6793j2764K144N3774l7483j3403K5909L483m8875l4686k4388
$$ y = [-39104, -20983, 18036, 28234, 47092, 42312, 68963, 32860, -65933, -73348, -49432, -19529, 13199, 37903, 29001, 53212, 81024, 73576, 95432, 67477, 93916, 89852, 67148, 40915, 46179, 94371, 90305, 43593, 11168, -43013, -81241, -95456, -50912, -29523, 37387, 75128, 28376, -45587, -93297, -109598, -128408, -120155, -125891, -78712, -93611, -40243, 29125, 9591, -48431, -74125, -38919, -19964, -32162, -59681, -49170, -11402, -22427, -2006, 56627, 68064, 55313, 35658, 6195, 24988, 36300, 2586, -16784, -69, 4121, -10392, 51624, 98613, 47260, 38017, 6631, -54408, -50427, -17884, -8901, 17622, 40447, 34284, 25020, 41329, 25569, 6888, -17051, 9742, -3022, -878, 52896, 15413, 2010, 27919, 31402, -17473, -52159, -76547]
14275g6547O184N7036k388J1643L466M8979L7835l145j1550k3712k5362n7977
14263c5538J6179M9913k1711k8595R389L5527N7246rK2402M3511j6606j8737l157
14250A09814k4642j9636J6243q0401m8657K7698J5717L2168o359j9112q5207m8981
14238a31355N6975K4677n8377n1843L9967Q0774J511j9669k1049L6821P2244k0453
14226A0223L0043j049K5924P182j7678o0311k3686R280L1362j4436k1467j7456
14214d2069L5018j2560n112l7535N547j7301k063j2780o968j4132P9544K9026
14202a385j0324P548K7323r198m77M1473L4876O340n4858l3956K3383M5738j3936
14189F2547k3468j8993k1504L5812O6422L9545m3847m4536l0856j4265J335j614
$$ y = [-76547, -70363, -13327, -15715, -4072, -606, 48373, 86208, 83063, 71513, 47801, 22439, -35538, -19359, 30554, 8843, -19752, -10363, 25164, 82410, 82401, 104803, 148314, 131708, 112971, 109814, 85172, 65536, 81779, 1378, -47279, -19581, -3864, 28304, 21945, 2833, -82374, -131355, -74380, -49703, -108080, -159923, -119956, -39182, -37671, -57340, -78389, -41568, 30676, 10223, 40266, 39217, 65141, 72323, 54645, -5666, -29352, -20072, 11290, -3146, -24613, -42069, -7051, -19611, -24723, -62258, -56711, -74012, -76075, -88855, -95823, -109955, -30411, -1385, -11709, -4161, 23162, 13964, 13487, 54960, 89836, 96176, 41318, 7362, 30745, 76483, 62547, 39079, 20086, -1418, 34394, 100816, 140361, 96514, 51978, 21122, 6857, 8192, 6578]
14177F578O378l1406j9846j7972k7981J1602R1071n33o3230O6405K1249j632k4080
14164A6603P608n1791n615j45j8933O6021p690n4544j7107L2416Q2071R3458j2942
14151A29410o8132l3428l2827m2974j0640L9442L5540N8426Q567m817m5541o545
14139B6481m626J6705m8809k6346L6113K2356k9002M4613J5980N475o165q93j5018
14126C6864l7173l3112J1273J5046J0978R242j5020k0014J3953n3167J5379K52
14114d5499R253M6097k8656M2470L9223N131N5653k61L1461l2134k9622l3279
14102E9837l2250N7593r963o6871k4119K2780M6748J5394N498l7338o4418J7074
14090a0035K3560j1853P56k5684k1252R707p785L2375L0428l7567N8845N461n1036
$$ y = [6578, 12956, -18450, -38296, -56268, -84249, -72647, 18424, 17891, -45339, 21066, 42315, 40683, 16603, 24211, -27580, -33195, -33340, -52273, 13748, 6058, -48486, -65593, -33177, 48894, 142352, 129410, 61278, 27850, -4977, -47951, -58591, -19149, 16391, 74817, 83384, 78567, 33026, 26481, 21855, 38560, -10249, -36595, -482, 21874, -7128, 37485, 53465, 58940, 52775, 51882, 36864, -309, -33421, -22148, -7102, 3876, 13118, -1902, -21916, -7963, -61130, -45751, -45499, -36246, 9851, -18805, 23665, 62888, 68019, 123672, 123411, 154872, 122738, 93116, 59837, 27587, 85180, 75217, 8346, -15773, 7007, 53755, 69149, 74647, 37309, -27109, -10035, 13525, 1672, 2428, -23256, -44508, -34801, -42586, -10211, 20217, -17350, 41495, 46956, -4080]
14077d080J7971K4936M3221J0537Q756k3571J1055k1948l8161l53M7950L0852
14065A07165l9608l8546l8687J5442l1535M8232J9002K7131p186q591q28J5115
14053F7106Q094k4025m8318l2386j4269L4160K8069O208l4572k9577j920N1557
14041A0127k4948K5282M3022N3337K469o2272m950J2051J8693m7566k5325j1986
14029a2066K1536P485N5735l0224l2480j6080N388m352p304K729n191k6424K0506
14016b0742L2507N4374q192q327j6160J3478O1568L3530K0267j9932j9519j8252
14004A04600o769q126N80N316r5194n9438O0997M2737n5435m4365n601l222J5250
13991d8670L4382O793n8087L4085p938l5926j9016K9588O1658j517J8000l7425
$$ y = [-4080, 13891, 38827, 82048, 92585, 101341, 77770, 88825, 66877, 28716, 28363, 76313, 107165, 67557, 29011, -9676, 5766, -25769, 22463, 41465, 68596, 61410, 52819, 51991, 67106, 75200, 51175, 2857, -29529, -43798, -9638, 18431, 24639, -9933, -39510, -41430, 10127, -14821, 10461, 53483, 106820, 109289, 47017, 42067, 54118, 72811, 25245, -80, -12066, 9470, 16955, 72690, 42466, 9986, -6094, -706, -5058, -12362, -9633, -14824, -41248, -20742, 11765, 66139, 57947, 49620, 33460, 46938, 108506, 142036, 162303, 142371, 122852, 104600, 97831, 89705, 90285, 95601, 407, -59031, 1966, 44703, -10732, -55097, -60698, -63920, -48670, -14288, -7495, -65582, -31497, -39435, -75361, -94377, -64789, -3131, -4648, 13352, -24073]
13979b4073j1728M2082N1385M1630n3995m1445n2293m3597N4955J2104P755j0367
13967b7587P680m2374J3513L8145j8628K3091K0911n568l4882K0535O4778P748
13955F7362o1348r311k4738l323K8466J1158r385O314k6349l1091K1368j5350
13943d6227J7289L2917P15J3032J8604J3M4536j7426r765J6912Q217j2508j3979
13930E2330j3877J7391J4772o234n1373m4418k5328q247J4368N0354L7130l1743
13918E125l2058J517K101O9707J5170l2356o2093k3064j9761j239J1757M8896
13906a6298L7916J3032o668k3951j6151j4580K5508j331n009K0304Q3555K7144
13894A23471m1623M0324L0564m6029o7148j283L6407p831k8593j5630L4826l3140
$$ y = [-24073, -35801, 6281, 57666, 99296, 45301, 3856, -48437, -92034, -37079, -24975, -17220, -27587, -19907, -62281, -48768, -10623, -29251, -6160, 14751, 9183, -25699, -5164, 59614, 67362, 6014, -3297, -28035, -31358, -2892, 8266, -1119, 5195, -21154, -52245, -30877, -46227, -28938, 3979, 4694, 17726, 36330, 36343, 80879, 63453, 53688, 70600, 78817, 66309, 52330, 38453, 55844, 70616, 64382, 13009, -31409, -56737, -64984, -50616, -262, 36868, 5125, -26933, -25416, -23315, 46392, 61562, 29206, -32887, -55951, -75712, -76951, -65194, -16298, 21618, 34650, 27982, 4031, -12120, -26700, -1192, -2523, -7532, 12772, 96327, 123471, 81848, 122172, 152736, 106707, 39559, 38276, 74683, 66852, 38259, 22629, 57455, 24315]
13882B4315J7573L40r155K7683l9126l0736K3306M1828Q500L514k5014j3743K2272
13869E1557L8608k0396P315r172l1115l193P399J3937M2953J4862M880n1913l9788
13856B5934o846O987p985k8395L6278L2075N5292J6130j4662n5471k0357L5891
13844G4871L275j2411m0006J030L7156r221l4432k0855K9754L3308K3396l7097
13832D8768j4905K5473J4604p0427j3774n624m464K4740O595o503j6327N8513
13820D6669L0773m3666o7780K3571R0037P8184K4509j7922M842k0158j0473k6435
13808A12151k6587m8864k1535m8592j6017l1517n8747M173K9870L5612M7234j549
13796b4368J7198P821q247K108L8409j2704m9656J7728J8116j3847j2106J1077
$$ y = [24315, 41888, 42228, 33073, 60756, 21630, -9106, 14200, 56028, 64528, 68042, 43028, 29285, 51557, 90165, 69769, 77084, 67912, 36797, 33604, 41003, 54940, 97893, 112755, 117635, 65722, 25934, 19088, 26075, 18090, -10305, 25973, 58048, 113340, 129470, 114808, 59337, 38980, 74871, 78146, 65735, 25729, 26759, 63915, 54694, 20262, -593, 29161, 62469, 85865, 48768, 33863, 59336, 73940, 3513, -10261, -15885, -20349, 4391, 10986, 4483, -11844, 46669, 77442, 33776, -34004, -10433, 79604, 157788, 182297, 164375, 169217, 149059, 138586, 112151, 85564, 36700, 15165, -33427, -49444, -80961, -139708, -135535, -105665, -70053, -22819, -24368, -7170, 651, -7596, -5488, 32921, 20217, -29439, -11711, 6405, -7442, -19548, -8471]
13784h471J1648K0954m158O6897P37n1078p1726l0918M1521K1995o460j3158r242
13771c1459m8860L6362M6390M196p091K6823J0812K9421m2750j0504J4127K8264
13759E5731J6528o9625l7521L7308L8106K1507m2752l13K9516l4054N1292K2325
13747H8048l2278j2407M2312l614l3025J9908l3547p1569j8073K4942L0598K7944
13735B9239m4556o11K4577j9720l0591M2329M9687l416m1703k2998j8466l4404
13723g0633J7732M6648L5205n258K9841l691q013q839l886K5619k2801k8792k1472
13710a8340L3433J9371l7564j0033K4203N6513l2839k6571L1238k5525J8599J4284
13698D6769Q052l2066j4254L995m081m7582R345M3898j2590k3546L3958O9554
$$ y = [-8471, 3177, 24131, 19973, 86870, 87607, 36529, -35197, -66115, -24594, -2599, -9059, -22217, -31459, -80319, -43957, 2433, 6629, -462, 26361, 37173, 66594, 23844, 13340, 27467, 55731, 72259, 2634, -34887, 2421, 40527, 62034, 19282, 18969, 48485, 14431, 65723, 88048, 55770, 43363, 85675, 82061, 49036, 68944, 35397, -36172, -54245, -29303, 1295, 29239, -15317, -15928, 8649, -11071, -41662, 667, 50354, 46938, 5235, -17763, -36229, -70633, -52901, -6253, 28952, 23694, 53535, 49844, 41831, 32992, 29106, 54725, 31924, 3132, -18340, 15093, 34464, -3100, -13133, 11070, 67583, 34744, 8173, 39411, 13886, 32485, 46769, 54821, 22755, 8501, 12496, 8415, -39167, -29822, 14076, 1486, -22060, 11898, 81452]
13686H1452r5931m6511K9095k3940j9569P5016L3315K6283k0956N0486J8061l8768
13674F8033k0752R47N2079j5789n6355L677m1502J546M5790n6232r134N6679l3185
13661d198o7150J8471L5889j9307L9554K0156k7050m0081r894M2516N1527L8838
13649G9271o721K633m4401j5844L2908r830j0282K6440j4440j5926M2258M5905
13637A11971j3645m0051l5091K861Q665P2978J5041n6168j5511j3078o643k0015
13625A1314K1656N4857N3730n7286n0843l7475r529J4974N606M8413L4806M97
13613I0720l8880J9117K5366l1498J9422M3406J8944J5771j5550o4391k8964k4201
13601B9262j8634p360O6616k0233J49K3280J5503q517p3178r862K5526j3133M457
$$ y = [81452, -14479, -60990, -31895, -55835, -75404, -388, 32927, 59210, 38254, 88740, 106801, 68033, 47281, 48228, 100307, 84518, 28163, 31840, -9662, -8116, 37674, -18558, -27692, 28987, -4198, -71348, -52877, -16988, -36295, 3259, 23415, -3635, -43716, -53610, -11094, 40433, 79271, 72550, 75183, 30782, 14938, 47846, 38016, 27734, 54174, 39734, 23808, 66066, 111971, 98326, 58275, 23184, 26045, 34710, 107688, 122729, 66561, 51050, 37972, 31329, 11314, 32970, 87827, 141557, 84271, 33428, -4047, -13576, 1398, 7004, 55417, 90223, 90720, 51840, 70957, 96323, 64825, 84247, 127653, 146597, 162368, 146818, 82427, 53463, 29262, 10628, 3268, 69884, 49651, 49800, 73080, 88583, 80066, 6888, -2974, 22552, 9419, 13876]
13588A3876R226l5512N163j7697K4521M9851J9635J3943l8369n067O4934L2695
13576A37199j0436m5835k9471J065J0181o081j6735K6360J7865k9775m8781j0942
13564e386j4055m5865L824M8588P1137K1533m8323m2853l0954N9607K1033k1436
13552A6850Q38L8803k7401l9091L4757n2134Q083N7868k8787l6080P121K4645
13540E472P133J9501J9441n4334l9264k900J6108J0115L819j4188j4352N0100
13528F651M4629R667K7286k8016n0743l77J1315K8630M7393p2554l941n0509O3830
13515C3261M0794q643m3719L7197K0041O7014j5868n5654k0064L4645J8972K0036
13503A28012L4629L9340m5183m1204n377j9237o496m0774K0247o24q79J7419q507
$$ y = [13876, 23102, -12410, -7247, -24944, -423, 49428, 69063, 83006, 44637, 39570, 104504, 137199, 126763, 80928, 51457, 52522, 62703, 56622, 39887, 66247, 84112, 54337, 5556, -5386, -19441, -65306, -61482, -12894, 58243, 79776, 31453, -11400, -42354, 17253, 38286, 16850, 17688, 56491, 29090, -10001, 24756, -27378, -19295, 38573, 9786, -26294, -19173, 5472, 12605, 32106, 51547, -2787, -42051, -44951, -28843, -18728, -14909, -29097, -43449, 6651, 51280, 60947, 88233, 60217, 9474, 9097, 20412, 49042, 96435, 23881, 19940, -30569, 33261, 74055, 65412, 21693, 58890, 78931, 145945, 130077, 74423, 54359, 89004, 107976, 128012, 162641, 201981, 156798, 115594, 110217, 90980, 84484, 43710, 63957, 63333, 62454, 79873, 71366]
13490G1366R274M6560p0482n9772j0493j2116m1939j6356L8427K2703P565q481
13478b3744j5334L6380L6971k2395k1118k2975J6529J0514M7106J524N2919P6788
13466A73165K3727l6655m5551n3799j6237j9384M215l7192j116N5557K8672k4270
13454E1132Q196K1093R8189J5639p5215k7401l1959m8257K8598J3182K4738m180
13442G3755L61K4848L179m3119K4355K5124l5390j14802k419M3461m4680K8253
13430a7074O5903M4790J6585J2635k8355M0440M1515J6176L461l9905q6739q2000
13418a2568L8642k9020p252j8301M0126K9783P9963k7850o9320m0644J1578J9366
13406A4503O0750J9521k1121M1389o360J1239k3469p6406o0763J4898K2092K5012
$$ y = [71366, 80640, 127200, 56718, -3054, -13547, -25663, -67602, -83958, -45531, -22828, -15263, -23744, -39078, -2698, 34273, 11878, -9240, -32215, -15686, -5172, 41934, 43458, 96377, 173165, 196892, 160237, 114686, 60887, 44650, 25266, 29481, -7711, -8827, 46730, 75402, 51132, 59328, 80421, 178610, 194249, 119034, 91633, 59674, 11417, 40015, 53197, 77935, 73755, 74116, 98964, 102143, 59024, 83379, 108503, 73113, -41689, -44108, -647, -45327, -17074, 48829, 93619, 110204, 122839, 94484, 134924, 176439, 192615, 196076, 156171, 69432, -12568, 26074, -2946, -10198, -28499, 11627, 41410, 121373, 93523, 24203, -16441, -4863, 14503, 75253, 94774, 73653, 115042, 108682, 119921, 96452, 20046, -40717, -25819, -3727, 21285]
13394B1285R589l2234k7912L2163Q8016O7205M43k535N922P442o000J0064k8616
13381A44832n7128J4236K2934K2877K0062L4754j1030l4518j01961p2856K1590
13370C792L8639M7320O1695m1445n0357k0599P28L2326L1534o860L6383m5142
13358H8014m5932k5943k1896r945J208L5217M2949k8825l4018M259L0024n709
13346B9403j5563K0705K7459j6554m1720j5894n22P0392K3302m6183k9449J9118
13334B4494K7587m3731p972l72J0343Q5504L6214j2046o8004j9878j2506K858
13322B2491J3610K6667K3085n095l6997j3071j5657K3125J2943k7892o0563K903
13310c4451R797M8529L9526K1713L8539j8927n1858n128k491J6592M3048J0290
$$ y = [21285, 30874, -1360, -29272, 2891, 90907, 158112, 158555, 156020, 161942, 169384, 163384, 173448, 144832, 87704, 101940, 124874, 147751, 167813, 202567, 191537, 157019, 55058, -17798, 3792, 42431, 89751, 151446, 110001, 59644, 39045, 39773, 72099, 103633, 96773, 133156, 88014, 42082, 16139, -5757, -15702, -14494, 20723, 63672, 34847, 829, 5088, 35112, 29403, 13840, 34545, 62004, 45450, 3730, -12164, -12686, 57706, 81008, 34825, 5376, 24494, 52081, 8350, 378, 6, 10349, 95853, 132067, 120021, 52017, 32139, 19633, 22491, 36101, 62768, 85853, 80758, 43761, 30690, 15033, 38158, 51101, 23209, -37354, -34451, -24654, 23875, 63401, 85114, 123653, 104726, 52868, 47740, 45249, 61841, 104889, 115179]
13298A15179l4972p01J1876j335K0954l2557k7559j2695K7033r793L5245Q090
13286I8765K0635r3353l1055N1543L9073J3577j5059r0698k5031Q1785P8127m4885
13274H3424j3296K3423l0650j688L916l268K6280o044K0579k8352j9679M80J1487
13261F6612N025L858J6306L5824j0271k231j7156J6535l4587j2209n93n519J2713
13248G4307J2964n22J0703P2983J7829n641o9815k1352P462j6455j7662K2172
13236H6973K8026N303q420j194l284l7625J2795O255L0103k1469K3691K6767o9878
13223G8043q7948K780O3003k3960N7969K4624q409n7397k1984K9896J0284k1131
13211D5770K0415j3537M8181Q9941J8815p3662l3047P578P9195j7149m2614J8313
$$ y = [115179, 80207, 79506, 91382, 90047, 111001, 78444, 50885, 38190, 65223, 55430, 90675, 98765, 119400, 26047, -5008, 46535, 85608, 99185, 84126, -6572, -31603, 50182, 128309, 83424, 70128, 93551, 62901, 61213, 65129, 61861, 88141, 82097, 102676, 74324, 54645, 55125, 66612, 71637, 75495, 91801, 127625, 117354, 115123, 97967, 114502, 79915, 67706, 67113, 61594, 74307, 87271, 86749, 97452, 170435, 188264, 182623, 112808, 91456, 98918, 82463, 64801, 86973, 114999, 120302, 111882, 110688, 107404, 69779, 82574, 88829, 118932, 97463, 121154, 147921, 78043, -9905, -7125, 55878, 31918, 89887, 114511, 106102, 48705, 26721, 56617, 66901, 45770, 66185, 52648, 100829, 190770, 209585, 135923, 102876, 110454, 189649, 172500, 129886, 148199]
13199A48199N8091Q6845L5819P6511M0949m6291n4524m5230j2531m6581m660O115
13187B42712Q273K2060p884K1021J6599K849L3861o2109n3016k8816o3609j657
13175A30284O749P4231N9479J4100l3875L2306K1094N7978O9543L7329R777K4197
13163E03192Q7692J1873q836j7134l2568j2627l166l8902O230K0993L0959j072
13151E46634q013K3002M7705J6962k9675n8766m4910j11273m6633m0858o753N5972
13139C43394O5150O5490K2984M800m5126n440q855l8139n4861M7625N2261j099
13127D48184j4935l7442j5529l0454Q982L4091L7801M2330K8073L0368L6164l3991
13115E33642K507R1323K7242K8963k1045l1928m536j9971J555J2283M6556J487
$$ y = [148199, 206290, 293135, 328954, 405465, 446414, 400123, 345599, 300369, 287838, 241257, 236597, 242712, 250985, 273045, 265161, 286182, 302781, 305630, 339491, 277382, 224366, 195550, 131941, 130284, 137033, 211264, 270743, 284843, 250968, 283274, 304368, 362346, 431889, 469218, 478995, 503192, 590884, 602757, 593921, 576787, 544219, 531592, 528426, 489524, 495754, 516747, 547706, 546634, 538621, 561623, 609328, 626290, 596615, 537849, 492939, 381666, 335033, 294175, 287422, 343394, 408544, 474034, 497018, 501818, 456692, 451252, 442397, 404258, 349397, 397022, 449283, 448184, 433249, 395807, 380278, 349824, 358806, 392897, 430698, 473028, 501101, 531469, 567633, 533642, 536149, 627472, 654714, 683677, 662632, 630704, 626168, 606197, 607752, 620035, 666591, 668078]
13103F68078k645K2574k3648o0500r7133k501M2097K2502j7413N0746M4196O3956
13091G10309J04502O4496L3045L1738m4940o8266q187r9747l8395l7215m7299
13080F00041n7147n0012m5204p2366k4294Q531q80N013J4091r231k2952J1325
13068C56915L5171J09381P3034K563K3134M4003k76q8798k951M0787l967n1450
13056E37546o7958j4904p5372m3212n481K773m8238l5328L0353l1271o214P2843
13044C15537m3460n0612m7098L0005M1285M5926Q279J8750m1946o83K5708J1299
13032C12990o1861j1266P018K4960l3252k3987K5408J5896O1289O1375L3942p7923
13020C34589n5452j4241o788J9575M892J7900J0657k2610M89M7829P580N231N269
$$ y = [668078, 665433, 688007, 664359, 603859, 506726, 504225, 546322, 568824, 551411, 602157, 646353, 710309, 814811, 879307, 912352, 944090, 899150, 830884, 822697, 722950, 684555, 647340, 600041, 542894, 492882, 447678, 375312, 351018, 359549, 358669, 363682, 377773, 368542, 345590, 356915, 392086, 501467, 574501, 577064, 600198, 644201, 643925, 555127, 552176, 592963, 588996, 537546, 469588, 454684, 379312, 336100, 330619, 333392, 285154, 249826, 280179, 248908, 242694, 315537, 272077, 221465, 174367, 204372, 245657, 291583, 299862, 318612, 276666, 275983, 301691, 312990, 251129, 239863, 246881, 271841, 238589, 214602, 240010, 255906, 317195, 378570, 412512, 334589, 279137, 264896, 258108, 277683, 282575, 300475, 311132, 288522, 289011, 336840, 344420, 349651, 354920]
13007C54920j2669m5292l9169J7211j4971m3668M1323J0401J6688n9238N629K9843
12995B61008L1059j8547k5435J0011O232L8836L4670k9681j12528O147M0825k4824
12983B17773j163K8992K3971K5335N0643L1478j1911p4119l0442n8325n197L0617
12971B27652M5068N1642L0390n4663o7136l9717J8874Q925L5850K755r620N0858
12959C00878K5854N921j23M074j1011K7663J8927O388J458J6285l1908j9060L952
12946C49298J8307P795m1595K7102J7582J1262n168j6483j8983l2544l799j9004
12934B93770K1449O3060K3637m2762o1669k2507L3030J9062m2342n3751R1810
12923C22787N6779K0145k3116N337Q1913j4418n6012q8051n3939N6848K3052k105
$$ y = [354920, 342251, 296959, 257790, 275001, 260030, 216362, 257685, 268086, 284774, 225536, 231165, 261008, 292067, 273520, 248085, 258096, 264328, 303164, 337834, 308153, 195625, 201772, 242597, 217773, 216610, 245602, 269573, 294908, 345551, 377029, 365118, 290999, 260557, 202232, 197035, 227652, 272720, 324362, 354752, 300089, 232953, 193236, 212110, 221035, 256885, 259640, 250020, 300878, 326732, 332653, 332530, 336604, 325593, 353256, 372183, 378571, 380029, 396314, 364406, 345346, 349298, 367605, 375400, 333805, 360907, 378489, 389751, 384583, 368100, 349117, 316573, 312774, 293770, 315219, 378279, 401916, 359154, 297485, 274978, 308008, 327070, 284728, 230977, 322787, 379566, 399711, 376595, 381932, 463845, 449427, 393415, 305364, 251425, 308273, 331325, 329220]
12911C29220N5324K4761p1044P15k5455q753j5165L7791J9612M0184k5302j6194
12899C45694N0080K6610j5730k980L5341N1643k7886m1828K8445M7218M2957K3347
12887E62911j2233o628m2717m6179O161k0217j5202o202O418K4835J4906J5899
12875D81752N8656L0399k9972l6839p8430m0452J8030P1792N0598K6548L6407
12864E88489o737j7807L7652l5782k5115L9728q791J954j4014K9963J9693L6440
12852F45673J2393q3850n4310J7328P7492K8407o168k0485n3392M5656M4940L2942
12840F86626j8323n2202J6820K8764J2728K982J2441o486L9314j6170k7432q553
12828F70509J8322L511N673J6003L2353j757j0865M8243K3314L5435L0923k7909
$$ y = [329220, 384544, 409305, 338261, 338976, 313521, 304768, 289603, 327394, 347006, 387190, 361888, 345694, 395774, 422384, 406654, 403674, 439015, 490658, 462772, 420944, 449389, 496607, 539564, 562911, 550678, 544050, 501333, 455154, 461315, 441098, 425896, 419694, 426112, 450947, 465853, 481752, 540408, 570807, 540835, 503996, 425566, 385114, 403144, 474936, 525534, 552082, 588489, 581752, 563945, 601597, 565815, 540700, 580428, 571637, 573591, 559577, 589540, 609233, 645673, 658066, 574216, 519906, 537234, 614726, 643133, 636965, 616480, 563088, 608744, 653684, 686626, 668303, 616101, 632921, 661685, 674413, 677395, 689836, 683350, 722664, 706494, 679062, 670509, 688831, 692342, 698015, 714018, 746371, 744614, 733749, 781992, 805306, 840741, 871664, 843755]
12816H43755j6214O5082N1169O187J4967M1156j7687m6502L0593K3024J9320N4111
12804A068961L6305K0164N0027M4548M9322O6508J10307R2272O1149J04426N8605
12793A762594Q472q761m9195n3923O049M502J0947N1864O3433L2297N0003L0714
12781A908996O7150R6248J00933R6828Q6318K521L2161J875J1766J8167o4338
12770B358625j3765K4986N0246J23567R8957R9890J29876J77098J78431J46672
12760C374583K00318J82212J87535J97339K49374L39672K88079L13973L50957
12751E684042L88410N04247N82312O35426P69558Q66517J036036J282138J641984
12742A3390670K185705K799559L599030M528053N443792N865047N016613L297865
$$ y = [843755, 827541, 892623, 943792, 949979, 964946, 1006102, 988415, 941913, 972506, 995530, 1014850, 1068961, 1105266, 1125430, 1175457, 1220005, 1269327, 1335835, 1446142, 1538414, 1599563, 1703989, 1762594, 1771066, 1762305, 1713110, 1659187, 1665236, 1669738, 1680685, 1732549, 1795982, 1828279, 1878282, 1908996, 1976146, 2072394, 2173327, 2270155, 2356473, 2358994, 2391155, 2393030, 2404796, 2422963, 2358625, 2344860, 2369846, 2420092, 2543659, 2642616, 2742506, 2872382, 3049480, 3227911, 3374583, 3574901, 3757113, 3944648, 4141987, 4391361, 4731033, 5019112, 5333085, 5684042, 6072452, 6576699, 7159011, 7794437, 8563995, 9430512, 10466548, 11748686, 13390670, 15576375, 18375934, 21974964, 26503017, 31946809, 37811856, 42828469, 46126334]
12734D6126334J654690L16467q17160j921024k811091l358837l583037l404478
12726C2201864k761421j980715j197502n54309j8796M13575J036069J808515K530571
12717C1477851L326091M239732N161070O155557P385600Q762426R882297R726216
12709H6116840P356636K946132j674063m790076o598513p910897q518025q279345
12701E8648689p518583o523034n438712m253448k994720j965741j299907p47556
12693B7906988j80841N87251J502191K308699K980775L488902L622684L321724
12685D5538373K897940K641520K485893J688324j03760k188066l494185m035826
12677D5430213m368290m444880l802963k683774j556512n36535K03991P01667
$$ y = [46126334, 47781024, 48097491, 47280331, 45359307, 42548216, 39189379, 35606342, 32201864, 29440443, 27459728, 26262226, 25707917, 25689121, 26102696, 27138765, 28947280, 31477851, 34803942, 39043674, 44204744, 50360301, 57745901, 66508327, 76390624, 86116840, 93473476, 96419608, 94745545, 89955469, 83356956, 75446059, 66928034, 58648689, 51130106, 44607072, 39168360, 34914912, 31920192, 29954451, 28654544, 27906988, 27726147, 28313398, 29815589, 32124288, 35105063, 38593965, 42216649, 45538373, 48436313, 51077833, 53563726, 55252050, 55148290, 52960224, 49466039, 45430213, 41061923, 36617043, 32814080, 30130306, 28573794, 28037259, 28241250, 28942917]
12669B8942917J298435K070185L058040M171280N228663N859052N912640N915414
12661F2456626N549801L852339J064921j335800k514891l072026l772407m711357
12653E7517206n161701m757656m030252l071234j852246o39681M18439J355770
12645C9778645K174136L155743M490877N931974P522860R168990J0815259J2033194
12637I5071678J2261166J1506678J0115473P679208K923534m199006j0814840
12630A24543891j3914868j3769260j2405823j0910392r350656p763538o342826
12623E0086528n079609l856093k623813j502925o03401Q5278P97862J692316K844156
12614D1840299L985296M813229N187798N045632M278032K959637J568167J0034
$$ y = [28942917, 30241352, 32311537, 35369577, 39540857, 44769520, 50628572, 56541212, 62456626, 68006427, 71858766, 72923687, 71587887, 69072996, 66000970, 62228563, 57517206, 52355505, 47597849, 43567597, 40496363, 38644117, 38004436, 38422875, 39778645, 41952781, 45108524, 49599401, 55531375, 63054235, 72223225, 83038484, 95071678, 107332844, 118839522, 128954995, 136634203, 139557737, 135358731, 124543891, 110629023, 96859763, 84453940, 73543548, 64192892, 56429354, 50086528, 45006919, 41150826, 38527013, 37024088, 36420687, 36505965, 37303827, 38996143, 41840299, 45825595, 50638824, 55826622, 60872254, 65150286, 68109923, 69678090, 69688124]
12606F9688124j852352m454903p024020q358002q092043o914260n592874m342832
12598B3056838l257506k472681j889449j458372j220583j102504r69851q57903
12590I827989p59650p24244o10189m82444m35559m55943m08485m56233m01212
12581E094030k75157k30343k37478j81383j74547j29277j47095j31979j54798
12572C431973q8513j1751m956J2658n0399n4486j4019k5859j02563j59859j29288
12561B802938r8409j59296r1965n5663m4071k0105m6630j45057q0599n7849q2182
12550A921112m2807j9823n1204n1562r333j5892k8764m5095Q73Q296q0409k2439
12538A562953J1738m4878l9774j6640j2859j9313j448m7504k3989q185K514K4188
$$ y = [69688124, 67835772, 63380869, 56356849, 47998847, 39906804, 32992544, 27399670, 23056838, 19799332, 17326651, 15437202, 13978830, 12758247, 11655743, 10685892, 9827989, 9068339, 8344095, 7733906, 7251462, 6815903, 6359960, 5951475, 5495242, 5094030, 4818873, 4588530, 4351052, 4169669, 3995122, 3865845, 3718750, 3586771, 3431973, 3343460, 3331709, 3326753, 3339411, 3289012, 3234526, 3220507, 3194648, 3092085, 2932226, 2802938, 2704529, 2545233, 2453268, 2397605, 2353534, 2333429, 2286799, 2141742, 2061143, 2003294, 1921112, 1878305, 1858482, 1807278, 1755716, 1746383, 1730491, 1701727, 1656632, 1657505, 1665801, 1585392, 1562953, 1574691, 1529813, 1490039, 1473399, 1460540, 1441227, 1439779, 1392275, 1368286, 1360101, 1362615, 1386803]
12526A386803m222k4611L760k6041R250J2884m1993l6080k8823j4939N6687k9261
12514A263414k8327L3223N5738j8329k0415k4437J1392P2282r836n6842j0940
12503A266923J6047l2279q2592m71L800K1065K721j4592M314k9208j4770O2233
12491A203191k830m6241m9428j7659m6930o1706j0588M2818Q267n0O848L5083
12479A060775N1625l5574M2764O0158l5224o4654J2300M3141K8698j2046k6456
12468A125507o4636o1760l373R976M793j698O5937J5943l5166j4379K7485J8092
12456A086721K3702N7611M1856M817j4685l0457J0257P78K245R879j417L0288
12444A221595M3162j4793K75L5823Q791K0094p827k5520l6864q549j4354N3362
$$ y = [1386803, 1382581, 1357970, 1361730, 1335689, 1344939, 1357823, 1315830, 1279750, 1250927, 1235988, 1292675, 1263414, 1235087, 1268310, 1324048, 1305719, 1285304, 1260867, 1272259, 1344541, 1334705, 1277863, 1266923, 1282970, 1250691, 1168099, 1167628, 1171428, 1192493, 1195214, 1180622, 1184936, 1155728, 1140958, 1203191, 1200361, 1154120, 1104692, 1087033, 1040103, 978397, 967809, 1010627, 1018894, 1018844, 1025692, 1060775, 1112400, 1076826, 1119590, 1179748, 1144524, 1079870, 1092170, 1135311, 1164009, 1151963, 1125507, 1060871, 999111, 995738, 1005714, 1010507, 1008809, 1074746, 1090689, 1055523, 1041144, 1068629, 1086721, 1110423, 1168034, 1209890, 1214707, 1200022, 1169565, 1179822, 1180600, 1182845, 1192724, 1191307, 1221595, 1264757, 1249964, 1250239, 1286062, 1294853, 1314947, 1307120, 1281600, 1244736, 1236187, 1221833, 1275195]
12432A275195M2638L5218M0607M3247M282j6485N948j9800j4363M8030J9249j1129
12420A452637j8223O3117P8737M242N433J6426J5633K3842M6990J1581Q4326J6024
12408A800765O8565O8313N4249r054M5902L9819q560J4857O9091N5940Q0767P1175
12396B351829J9320l6514J9516J03358Q7983J2595L5996J82468R0504K0343J7054
12385B904452O6039J49751J73589J95457J59318J68535K16096K15067J86993K18814
12375D654111K96217K89297L06356L70914M58388N33253N84515O05557P30533
12366H829141Q98390J035108J241791J462194J708452J891104K044695K288219
12358B1399094K854067L706957N125116P030932R284862J1243815J1441321Q700753
$$ y = [1275195, 1317833, 1353051, 1393658, 1436905, 1441187, 1424702, 1430650, 1410850, 1396487, 1444517, 1463766, 1452637, 1434414, 1497531, 1576268, 1580510, 1585943, 1602369, 1618002, 1641844, 1688834, 1700415, 1784741, 1800765, 1869330, 1937643, 1991892, 1982838, 2028740, 2068559, 2059999, 2074856, 2143947, 2199887, 2280654, 2351829, 2371149, 2334635, 2354151, 2457509, 2545492, 2558087, 2594083, 2776551, 2867055, 2887398, 2904452, 2970491, 3120242, 3293831, 3489288, 3648606, 3817141, 4033237, 4248304, 4435297, 4654111, 4950328, 5239625, 5545981, 5916895, 6375283, 6908536, 7493051, 8098608, 8829141, 9727531, 10762639, 12004430, 13466624, 15175076, 17066180, 19110875, 21399094, 24253161, 27960118, 33085234, 40116166, 49401028, 60644843, 72086164, 80786917]
12350H0786917L454920k395428o641986q327464q198350o923867n308873l474451
12342D2971418j590858J85437J835045L398003M827377O423019Q175818R218235
12334G5443494P922932L287240l338696q933253j1330105j0808357q890739o926992
12326C6425524n235749l962455l127601k613611k194795j853074j640947j423982
12318A4373310j106880q11061n93396m46037l10232k44265j51694k8471P6277
12309A0757551J64014K47161L24755M18928M91716N25893N11298O41392Q28795
12300A4911503J105658J413901J723089J978262K146502K471649K717503L170810
12292C1638877M134325N584988P619820J0032613J2381318J3050947J0398936
$$ y = [80786917, 84241837, 81846409, 75204423, 66876959, 58678609, 51754742, 46445869, 42971418, 41380560, 41565997, 43401042, 46799045, 51626422, 58049441, 66225259, 75443494, 83366426, 86653666, 83314970, 74381717, 63051612, 52243255, 43352516, 36425524, 31189775, 27227320, 24099719, 21486108, 19291313, 17438239, 15797292, 14373310, 13266430, 12455369, 11861973, 11415936, 11105704, 10861439, 10709745, 10681274, 10757551, 10921565, 11168726, 11493481, 11912409, 12404125, 12930018, 13441316, 14082708, 14911503, 16017161, 17431062, 19154151, 21132413, 23278915, 25750564, 28468067, 31638877, 35773202, 41358190, 48978010, 59010623, 71391941, 84442888, 94841824]
12285I4841824N329290Q36855j719308k811168k764963j362699Q44428K848337
12277I6042596L530680K270402o8248j610996j257054O66965L433865N932885
12269A08941095O361382L059423k404913o819153q336394p095179m752244k552414
12261H6401603j023655m74956r29362k968321n986986q371250q626842p333558
12253E0686673n645646l947915k616357j660201q80679j90425K41963Q00697J607005
12244C8395115K258470K925942L634250M526640N503804O894281Q906966J1808423
12236H4853891J5975615K1747265K8823346L5917030L9428412L4272995J8118421
12229B79136975m541826k4500938l4854382l5648348l0781080k4273884j8206321
$$ y = [94841824, 100171114, 101007969, 99288661, 96477493, 93712530, 92349831, 93194259, 96042596, 99573276, 101843678, 101775430, 100164434, 98907380, 99574345, 103008210, 108941095, 115302477, 118361900, 115956987, 109137834, 100801440, 93706261, 88954017, 86401603, 85377948, 84902992, 83973630, 81005309, 75018323, 66647073, 58020231, 50686673, 45041027, 41093112, 38476755, 36816554, 35935875, 35745450, 35987413, 36788110, 38395115, 40653585, 43579527, 47213777, 51740417, 57244221, 64138502, 73045468, 84853891, 100829506, 122576771, 151400117, 187317147, 226745559, 261018554, 279136975, 274595149, 250094211, 215239829, 179591481, 148810401, 124536517, 106330196]
12222A06330196j3358985r679208o844395m706915k923161r88649J107656L350468
12214G2287007N590754O886781O048326K792182j569248n106344o524244o097537
12206G4307677m826529l342039j871558l50356J353488L190279N142681P132556
12198H0736199R171042J0946902J2303215J3007640J2799859J1855193J1700966
12191A62521016J4502923K0822394K8452831L2401108K7197282J0733093j1914148
12184B84716499l1006506m0224829l9906988l4160438k7182832k0867463j5735125
12177G5632318j1935858r182595p230060n826474m860688m108115l608593l179045
12169B5700890k636266k318880j995613j653258j370581j218494j070553r57118
$$ y = [106330196, 92971211, 83292003, 76447608, 71740693, 68817532, 67828883, 68936539, 72287007, 77877761, 84764542, 90812868, 93605050, 92035802, 86929458, 80405214, 74307677, 69481148, 66139109, 64267551, 63917195, 65270683, 68460962, 73603643, 80736199, 89907241, 100854143, 113157358, 126164998, 138964857, 150820050, 162521016, 177023939, 197846333, 226299164, 258700272, 285897554, 296630647, 284716499, 253709993, 213485164, 173578176, 139417738, 112234906, 91367443, 75632318, 63696460, 54513865, 47283805, 41457331, 36596643, 32488528, 28879935, 25700890, 23064624, 20745744, 18750131, 17096873, 15726292, 14507798, 13437245, 12480127]
12161A2480127r16142p37148n96073n70971m50430m36729m20322l57560l35039
12152G659713k85252k79449k85994k46274j87460j59430j05429j75767j49888
12143E784770j40092o4020j3415j49100k19476k11833j86474k35410k41348j86899
12133D136703j89150j53940j07744q0947r0133r3653k8127l4942p7873l0512R144
12122C258826n8196q9520j17933j38565j25378n9987p9228j34995n903M2261o2168
12111B429214j01199j30929m6198Q745k173p603k6549P670j448p2025j8688m5348
12099A993469q9928j7389p724o7769o0480j4378n9737n7230p490m2526k8999j788
12087A538031l4735J6628j5000l5154n6531l0393K638M1867J5018j0476q8136
$$ y = [12480127, 11563985, 10826837, 10230764, 9659793, 9209363, 8772634, 8352312, 7994752, 7659713, 7374461, 7095012, 6809018, 6562744, 6375284, 6215854, 6110425, 5934658, 5784770, 5644678, 5580658, 5567243, 5418143, 5198667, 4986834, 4800360, 4564950, 4323602, 4136703, 3947553, 3793613, 3685869, 3604922, 3514789, 3421136, 3393009, 3358067, 3280194, 3249682, 3258826, 3200630, 3111110, 2993177, 2854612, 2729234, 2669247, 2590019, 2455024, 2449121, 2491382, 2429214, 2328015, 2197086, 2150888, 2159633, 2157460, 2149857, 2123308, 2130978, 2129530, 2057505, 2038817, 1993469, 1903541, 1886152, 1878428, 1810659, 1750179, 1735801, 1676064, 1618834, 1611344, 1568818, 1539819, 1538031, 1503296, 1519924, 1504924, 1469770, 1413239, 1382846, 1385484, 1427351, 1442369, 1431893, 1343757]
12076A343757n9182k1676P753R965Q06K4531N057o008M6852n414o4240n4841N9008
12063A286368K1003k3714R017j1504j5936J182J1497J1451j1237m7133j24141
12052A106853n8966k6771j2558n4153n2680P3448j0362j2470m386n428K3766n420
12040I60873k6243k8112o9404n2174n0746n4981R0957P9836K4718M5438l8664
12029H81498o7810j4895n205m4123l8993m5315O311M8383j6668k3381n554k328
12017F71920J2320n1556j3465j230K306k8226q1688j8417Q5057j9984j3852L1264
12005E74449N7374J1827N3788l8620J1512J7242r429m003J4708k1662j8644M168
11993F52710l2686R696L8424L4730l5276l7517k6601n670k6721L8132j254k3576
$$ y = [1343757, 1284575, 1262899, 1270652, 1280617, 1281423, 1305954, 1311011, 1305003, 1351855, 1346441, 1282201, 1227360, 1286368, 1307371, 1283657, 1292674, 1281170, 1265234, 1266416, 1277913, 1289364, 1278127, 1230994, 1106853, 1047887, 1021116, 1008558, 954405, 901725, 975173, 964811, 952341, 947955, 942527, 966293, 960873, 934630, 906518, 837114, 784940, 734194, 679213, 770170, 850006, 874724, 920162, 881498, 813688, 798793, 793588, 749465, 710472, 665157, 671468, 719851, 703183, 679802, 674248, 671920, 684240, 632684, 619219, 617989, 620295, 592069, 510381, 491964, 577021, 557037, 543185, 574449, 631823, 643650, 697438, 658818, 670330, 687572, 678143, 674140, 688848, 667186, 648542, 652710, 620024, 629720, 668144, 702874, 667598, 630081, 603480, 597810, 571089, 609221, 607967, 584391]
11981E84391L0535k8433n8021L6119q402l9209k172l3372m8958p177j9758j3200
11969C92343O2793J4847l5224j2181O156L5761J3528k5737k2824l0378m9872M6337
11957C95549J6826J7478O369l7671l6622j590K4633j4938o436k3177N5103M850
11945D00374J4512K1931m5570n7152K3729Q6623J00425j3528k2098O0452P0224
11934F39922J37565J43050J99834J84320J56026J6135j76803k43957j88926j19752
11924G47414j01617j40220j06744m1802L7651q40p1998r795j9645j0127J0543
11913B92820j0077N5133o685M4027K3586N2167L9331N3438q525J7221J8385M6423
11901F17244K8425J3624n5593p1632l6012k1121j763M4495K434o3738q378P428
$$ y = [584391, 614926, 586493, 528472, 564591, 556189, 516980, 514808, 481436, 432478, 425301, 405543, 392343, 455136, 469983, 434759, 422578, 428734, 464495, 478023, 452286, 429462, 399084, 349212, 395549, 412375, 429853, 436222, 398551, 361929, 360339, 384972, 370034, 363598, 340421, 395524, 400374, 414886, 436817, 391247, 334095, 357824, 444447, 544872, 531344, 509246, 569698, 639922, 777487, 920537, 1120371, 1304691, 1460717, 1476852, 1300049, 1056092, 867166, 747414, 645797, 505577, 398833, 357031, 394682, 393842, 321844, 312049, 292404, 282277, 292820, 282743, 337876, 331191, 375218, 398804, 450971, 490302, 543740, 535215, 552436, 570821, 617244, 645669, 659293, 603700, 532068, 496056, 474935, 473172, 517667, 520101, 456363, 447985, 455413]
11889D55413N894K6918j600K3342N8967M2158j4864j066l1763r7852n0874m5934
11877C68739k7455o8037n3250J5930P8573K5100n563l7976n5975l0023J5783K377
11865B28223k0664j9867L6712N2635m7225m9656K7286J3568L8861p033j5851k7104
11853B09885j408N382O871M87L0117j1022j8132q0487q076J10142O3771J8679
11841C26209L9536K6447R1989L2925N128J43994L9646r178m4957J1379K488q580
11829F57026k7087j6368P0072L0153j8430j2340n3523n5124k0554L0943P3772
11818F58540P3332M5897j9199r8359l8584m5077m8352l5065K3631L0763P342q5439
11806D69430m6645j7244o8148Q690j7963l4837o2685J5953M4744P1390k0509o7350
$$ y = [455413, 461307, 488225, 486625, 509967, 568934, 611092, 596228, 595162, 563399, 465547, 414673, 368739, 341284, 273247, 219997, 235927, 314500, 339600, 334037, 296061, 240086, 210063, 225846, 228223, 207559, 187692, 224404, 277039, 229814, 180158, 207444, 221012, 259873, 252840, 236989, 209885, 208477, 213859, 220730, 221217, 251334, 240312, 222180, 141693, 133617, 243759, 307530, 326209, 365745, 392192, 484181, 517106, 522234, 666228, 705874, 696696, 651739, 663118, 665606, 657026, 629939, 613571, 683643, 713796, 695366, 683026, 629503, 574379, 553825, 584768, 658540, 731872, 777769, 758570, 660211, 621627, 576550, 528198, 493133, 516764, 547527, 554869, 469430, 422785, 405541, 337393, 346083, 328120, 293283, 230598, 246551, 291295, 362685, 342176, 274826]
11794B74826o0926r659n290q205P7954O1568O2005J4776l3614k6304P585N70L1771
11781C87057J05678L3204M1423J37007J25132J43610J91779J65207J38370N6788
11771A525255m4064q4449j11069j35905j68281j65468p4775q507M5269r673k8682
11760G39651p193l0681q3311m0804m2649n038p1963l3713m2836K704K5961Q439
11748D18567J5634M6833L2363J6710O6890J1174o3032j6788J6385j2791m4926
11737D87019R0626O0633N4965N3624J51618J35581J41072J96591J01193P9545
11727A552467l2783j46350j86126j88338j71817j25689q8967o0988m6106m3737
11717D61566l9021p2792q2699n1901M3857o570j0805J8225k2003J8165l5280m2698
$$ y = [274826, 213900, 204241, 198951, 190746, 268700, 330268, 392273, 407049, 373435, 347131, 354716, 355286, 387057, 492735, 525939, 567362, 704369, 829501, 973111, 1164890, 1330097, 1468467, 1525255, 1481191, 1396742, 1285673, 1149768, 981487, 816019, 741244, 732737, 778006, 768333, 739651, 732458, 701777, 618466, 577662, 535013, 529975, 458012, 424299, 381463, 384167, 410128, 418567, 434201, 481034, 513397, 530107, 596997, 608171, 545139, 528351, 544736, 531945, 487019, 577645, 638278, 693243, 746867, 898485, 1034066, 1175138, 1371729, 1472922, 1552467, 1519684, 1373334, 1187208, 998870, 827053, 701364, 612397, 551409, 505303, 461566, 422545, 349753, 267054, 215153, 259010, 252440, 241635, 259860, 237857, 256022, 220742, 178044]
11705A78044j8429j1688n518J7932L0447K0975k4346o7795K485j0835K409J0972
11693A24653N0575M2874j3547n8561k5329l9410l4104J3270Q447J7267J7172j272
11681A02035M4316L5351J5710m3248l1503R794N0685O592m9941K2623O2117n3250
11669A71281j00228p2567k0016P2621K0821R992J8351J1534j1175j6165l001l5993
11657D5455n1351M2080j4018L0196O0422J8533K1250M1533K0440p758n1984j4429
11645A40369l1151N8240K223m0779l3388m216L2891j7311J6100N7719K4852m7462
11633A58087m9767l4074k7889n8672K3166L8733L8160j6972O005N757J2488M0749
11621A35771M368l8754k0997J16J9885l3326m3258P817k5773N561K3153P6012
$$ y = [178044, 159615, 147927, 142409, 160341, 190788, 211763, 187417, 119622, 122107, 111272, 113681, 124653, 175228, 218102, 204555, 145994, 120665, 81255, 47151, 60421, 68868, 86135, 103307, 102035, 146351, 181702, 197412, 154164, 122661, 132455, 183140, 189732, 139791, 162414, 224531, 171281, 71053, -1514, -21530, 51091, 71912, 81904, 100255, 111789, 100614, 84449, 81448, 45455, -5896, 36184, 22166, 52362, 112784, 131317, 152567, 194100, 214540, 206782, 154798, 140369, 109218, 167458, 169681, 128902, 95514, 91298, 124189, 106878, 122978, 180697, 205549, 158087, 108320, 74246, 46357, -12315, 10851, 49584, 87744, 70772, 76777, 82534, 95022, 135771, 140139, 101385, 80388, 80504, 100389, 67063, 23805, 31622, 5849, 11410, 34563, 110575]
11609A10575L2884J9893j5640M873m6012l2338j8724N368M8028K6782J8667p8417
11597G5939j5658J3453j1164N371j936N779M5220K0997n679l870m5159m7151j7604
11584A8538K6380M3186q130l4900J7972J0140K4376Q645k3841p1942j7352K8452
11572B1524L7974M0083M1587j6215k2063m296J729j3027j04591j6107K9208K4151
11560A9957K9391N6283o0396p91j4263L0651M6281L0491l9388l3448J9657j5342
11548F9083p2218j605R705m965P3974l0272M0688N1314J4694n1934m350l3048
11536F1066L0464K6505n0339K9239L9444n4266m8303M3972O09j7864k0091J6664
11524E7100n1844j4521K1320J4428J272M6301J5771N193J0563L7207M7240J2801
$$ y = [110575, 143459, 163352, 147712, 152585, 106573, 74235, 55511, 60879, 108907, 135689, 154356, 75939, 60281, 73734, 62570, 67941, 66005, 71784, 117004, 138001, 132322, 128452, 83293, 36142, 18538, 44918, 88104, 79974, 45074, 63046, 73186, 97562, 106207, 82366, 10424, -6928, 21524, 59498, 99581, 141168, 124953, 102890, 98594, 100323, 87296, -17295, -33402, -4194, 19957, 49348, 105631, 45235, 44444, 30181, 60832, 107113, 137604, 98216, 64768, 84425, 69083, -3135, -4740, 4965, 0, 73974, 43702, 84390, 135704, 150398, 98464, 94114, 61066, 91530, 118035, 67696, 96935, 136379, 82113, 33810, 77782, 78391, 60527, 40436, 57100, 5256, -9265, 12055, 26483, 27755, 74056, 89827, 95020, 105583, 142790, 190030, 202831]
11512B02831j3752m294k9039l0062m2637q659L6059j0846k6265m1247n019K9465
11500E6535p158m7591N462K1481K0633K7663k8656Q367j2897O7821M091n9642
11488E6109j7679J1988j8462J4507J1463L1988M7428l3667l4833O8763L318l6124
11476A04799K5701m3105j8815N3477k6003m7214K8032J2313n4539L8915K4331
11465I7892J0864J1955O782L107k8144m1100R986j4471J1973J2081K481j8236
11453F5170J628k2524l262M4011j7366n4377p2970N0697L554N4921M5021L342
11441I7845l8654P960M2816m2703P911R734O428K317M8052M0610o5825J2607O426
11428A35524n0915j0590k0823K866l2912L6040o449q4362k2814M5528L0711j5940
$$ y = [202831, 189079, 184785, 155746, 125684, 83047, 74388, 110447, 99601, 73336, 32089, 27070, 56535, 49377, 1786, 7248, 28729, 49362, 77025, 48369, 56736, 43839, 111660, 115751, 56109, 38430, 50418, 31956, 46463, 57926, 89914, 137342, 103675, 68842, 137605, 140923, 104799, 130500, 87395, 68580, 122057, 96054, 48840, 76872, 89185, 34646, 73561, 97892, 108756, 120711, 127493, 130600, 102456, 61356, 71342, 56871, 68844, 80925, 83406, 65170, 66798, 44274, 41012, 85023, 67657, 13280, -59690, -8993, -5439, 49482, 94503, 97845, 59191, 67151, 109967, 67264, 75175, 84909, 91337, 93654, 141706, 182316, 116491, 129098, 135524, 84609, 74019, 53196, 56062, 23150, 59190, 52741, -31621, -54435, -8907, 21804, 5864]
11416E864l5919r955j739N7939O8346J0691J2250L616l0709j1377j2617N25Q294
11403F5209j8934L3203o538m2818n6519l7792K3984M4061M384M2130L6238o0722
11391B5886l1144m1189j0031J8919J3169j0392k0531j124O8094N6044k9553m8775
11379a0627K7814M0929k0741J0456n9709j0489M9883k0206j1827L232j3178J837
11367a2626n471N0912J7272l9578L6336J6640j5751M575J0968Q336l958K9046
11355I6701k3511l9718J7342k3029j9884K8624r1Q87J1879L7348m1928M5140K5369
11342A15129j3822L7447J0125m862Q491k8715n9338m4923N013j1136N6904k565
11330F7748N280J3915K3978p018r9595r543J2008J4437j6311l2534m2481P0142
$$ y = [5864, -30055, -40010, -41749, 16190, 84536, 95227, 107477, 111093, 80384, 69007, 56390, 56915, 65209, 46275, 79478, 72940, 30122, -26397, -64189, -40205, 3856, 8240, 50370, 86608, 25886, -5258, -46447, -56478, -37559, -24390, -34782, -55313, -56437, 11657, 67701, 38148, -10627, 17187, 58116, 37375, 47831, -11878, -22367, 27516, 7310, -4517, -1285, -14463, -12626, -18097, 32815, 50087, 10509, 46845, 63485, 47734, 52309, 63277, 71613, 67655, 96701, 73190, 33472, 50814, 27785, 7901, 36525, 36434, 37321, 49200, 86548, 44620, 89760, 115129, 101307, 138754, 148879, 144017, 152508, 123793, 64455, 19532, 24545, 13409, 70313, 67748, 73028, 86943, 110921, 103903, 4308, -5235, 6773, 21210, 4899, -27635, -70116, 26]
11318B6M1965O4422k4751n1288l4744M2116J5024m4168n898K3929J5722k0925
11306B1430p585N5615N8381l5023k8988j4586k1314J6241k1159J8607L7100J3766
11294I2485L2573l1022m8126p423k0554l0430K7795J8199m0862k7257J07392M8226
11282A20996o2527J3171Q770o0785k986K3068q56p3494m5812L8117P2565k6774
11270C453K8199J994p446n5422R0421N5888j9516m9476k5902m4155N111L5931
11258A9080L6825m8003l5015P5600K0328n3523N948k6944n6863k3405J0377N3398
11246b2197r674M3478p893N810M8075L1656j8382j1542J1769K3188K0454k788
11234A11954l4288k6161m2334n374M9009j6471n9898r49r868k2989j4741J4074
$$ y = [26, 41991, 106413, 81662, 30374, -4370, 37746, 52770, 8602, 2704, 26633, 42355, 21430, 13845, 69460, 127841, 92818, 63830, 49244, 27930, 44171, 23012, 41619, 78719, 92485, 125058, 94036, 45910, 38487, 17933, -12497, 15298, 33497, -7365, -34622, 72770, 120996, 58469, 71640, 80410, 19625, 16639, 39707, 38851, -34643, -80455, -42338, 30227, 3453, 31652, 33646, 26200, -29222, 61199, 117087, 97571, 48095, 22193, -21962, -16851, 19080, 55905, 7902, -27113, 48487, 68815, 15292, 21240, -5704, -62567, -85972, -75595, -22197, -31871, 11607, 3714, 9524, 57599, 89255, 70873, 59331, 71100, 94288, 114742, 111954, 77666, 51505, 9171, 3797, 52806, 36335, -23563, -24512, -34380, -57369, -72110, -58036]
11222e8036L2070K7962J3789r830l5011M715L5049K4638R188J5359k3065j7084
11210A9744P359J2926j7497K1126N6083k7236K5413m8039q9742n0343L6923L2225
11198b1058K5166L3124m9994M2290L1436j3534m8589k0894K2745L3516J0864m721
11186D0351k1440j7473M1200k8098j1813L523L939k0050L5899J0921L3714l7365
11174C3308j351j5983L5802L3420k4179k9514N305L4271M2592l5245k6664R270
11162F1032l8535k2199J7146J9708J1349r600K4465J0424m4581l1921l86o716
11150i814L7660J4945l9446n255L4588L5737Q755m1071j2859R806k130J4751K2900
11137F8567K1721J1981N523k5289k7768j5931K0919L0992j3724K2140K2362n2658
$$ y = [-58036, -25966, 1996, 15785, 5955, -29056, -24341, 10708, 35346, 44534, 59893, 36828, 19744, 27103, 40029, 22532, 43658, 99741, 72505, 97918, 49879, -39863, -90206, -53283, -21058, 4108, 37232, -12762, 29528, 60964, 47430, -1159, -22053, 692, 34208, 45072, 40351, 18911, 1438, 42638, 14540, 2727, 6250, 10189, -9861, 26038, 36959, 70673, 33308, 31957, 15974, 51776, 85196, 61017, 31503, 36808, 71079, 113671, 78426, 51762, 61032, 22497, 298, 17444, 37152, 48501, 38901, 63366, 73790, 29209, -2712, -3098, -9814, 27846, 42791, 3345, -1910, 32678, 68415, 77170, 36099, 23240, 33046, 30916, 45667, 68567, 90288, 102269, 107792, 82503, 54735, 38804, 59723, 90715, 76991, 99131, 121493, 68835]
11125F8835m5734J5883j2963J1082R39N321j0570j2091l3856P691O902M9071M2554
11112I3064m1194r764m5347N579j3536j0346M7245K3912j2080J5757k0734n53
11100C2003L3495m2950n4013N2229N462q3062J8094K8973R645J4658k3727j88
11088i381J1624L3033P615l754K3961m8163k3776L1527L9818J1379k3367K0632
11076G1148M707l6771m2343r414j5442r426R895j5031p2512K2954L9386J2371
11064d0478q231M9691m219M1250J976j2451k1102L0560j8613k7537l969J6758
11052C635N1786m1747l9627J0741O100K9248L8155k463l6642k9479j5410J1671
11040a4032K5704j0886P6909K8941p999r551j2851j9551j4036j2934k5544K6950
$$ y = [68835, 23101, 38984, 26021, 37103, 38042, 43363, 32793, 20702, -13154, -5463, 1439, 50510, 93064, 51870, 42106, -3241, 2338, -11198, -21544, 25701, 49613, 37533, 53290, 32556, 32003, 65498, 22548, -31465, 20764, 26226, -56836, -38742, -9769, -124, 14534, -9193, -9381, 2243, 35276, 42891, 39137, 63098, 14935, -8841, 22686, 62504, 73883, 50516, 71148, 75855, 39084, -3259, -12673, -28115, -37541, -27646, -42677, -115189, -92235, -52849, -40478, -48709, 982, -3237, 38013, 39989, 27538, 6436, 36996, 18383, -9154, -13123, 3635, 55421, 13674, -25953, -15212, -9112, 20136, 58291, 55828, 19186, -10293, -25703, -14032, 11672, 786, 77695, 106636, 98637, 89086, 76235, 56684, 42648, 29714, 4170, 31120]
11028C1120l156k434O53k8962m2430N0493K5673K3585p903k4780k0247j4556k4481
11015c7425J3242Q6158M1362j6560r385j4306n5773J2302N9224j0362n1077J906
11003A9306j7043j6635K3493N0537n4654R147o2660j5716J6257Q305K9141K4281
10991A3759j7792l4374J5802L6527k6959j2572L8398k8381O181K7563Q102m3188
10979a6934m0482J5035J3873L7360q671K9589p985L7806M5267k1970m403n0107
10967B8378j193O802R107j1913L0766n6038k7870l5393L1288L4685J9989n5118
10955b6510q863L4087M7088N1406k9812l6633O612n703J1974m1036j3650J1272
10943B32j639j3199l500K7881k402o885Q965m396K7019L5737k6655m1679j0112
$$ y = [31120, 27964, 25530, 26183, -2779, -45209, 5284, 30957, 54542, 46639, 21859, 1612, -12944, -37425, -24183, 61975, 103337, 86777, 77392, 63086, 7313, 19615, 78839, 68477, 17400, 19306, 2263, -14372, 9121, 59658, 5004, 14151, -48509, -64225, -47968, -39663, -10522, 13759, -4033, -38407, -22605, 13922, -13037, -25609, 12789, -15592, -9411, 18152, 26254, -16934, -57416, -42381, -28508, 8852, 181, 29770, 21785, 59591, 104858, 82888, 78485, 28378, 27185, 33987, 43094, 31181, 61947, 5909, -21961, -57354, -26066, 8619, 28608, -26510, -35373, -1286, 45802, 97208, 67396, 30763, 37375, 31672, 43646, 2610, -11040, 232, -1407, -14606, -18106, 9775, 7373, 488, 9453, 5057, 32076, 67813, 41158, -521, -10633]
10930a0633M2051j0845m0822Q625k0799m1625J5126K4807l311L1313m0708o4774
10918a11595K7456K1408q294N214M4968P640n1216m7345J4106O6987L569k1652
10906d8754J6889K5106J6428K1167k849k4996O5078L1438Q290k1211m3934n4364
10894a1712q7954K628M0528J5563k1927M0923l347j8125L9527l210k9789k6385
10882f3280j31L5937J043K7949J8386j4875o616M0560j0506j8926k887N9025m0991
10869B4688J9574m8224m2698M1951N6814M2957j5208n3650M4884R183N662L5197
10857A21130O406m5654n2162m3581k8311J1126O8154J9677j1300J9913M0443J9416
10845A25257N234k2501k8531k2848l4764M1877K2185O373j4634M464m658K5527
$$ y = [-10633, 31418, 20573, -20249, -11624, -32423, -74048, -58922, -34115, -37426, -6113, -46821, -111595, -84139, -62731, -71025, -65811, -20843, -13203, -64419, -111764, -97658, -30671, -27102, -48754, -31865, -6759, 9669, 30836, 27987, 2991, 68069, 99507, 107797, 86586, 42652, -11712, -99666, -97038, -56510, -40947, -62874, -21951, -25298, -43423, -3896, -7106, -36895, -63280, -63411, -27474, -26431, 1518, 19904, 5029, -1587, 38973, 28467, 9541, 6654, 65679, 24688, 44262, -3962, -46660, -4709, 52105, 95062, 79854, 26204, 71088, 80271, 85933, 121130, 127536, 81882, 29720, -13861, -42172, -31046, 37108, 56785, 45485, 65398, 105841, 125257, 130491, 107990, 79459, 56611, 21847, 63724, 85909, 92282, 77648, 82112, 77454, 102981]
10833A02981K7358K1287n0625p7284j2242j1775P126P4010K6427m80j7887n5904
10821C2992k7872K0691M8620M9578P791n2517K6440L4776o6172k9598o3723j3013
10809c2007k7711J0927q103O6927J0883q938L7124L60P063j9508j3350M8947M4953
10796A17567n6715k8068j7553J9103K5184L6869j8897J0496J9119Q745j9762j0650
10784H5438m527m9729n0898J8717k2752M3509J7029m1698K0303K2512J9416m0356
10772A6964j7169J4202K941J1824L9119k8657m6332O8465L3823j6299k5154K6617
10760H0344O5409p671l9329J3078n1699j6158K0708k2483K666K7090p946o51K8523
10747I1881L4053k101p3843n761M143K7606N7886M1838n5079n6092K5183n578
$$ y = [102981, 130339, 151626, 101001, 23717, 11475, -300, 6826, 80836, 107263, 106783, 88896, 32992, 5120, 25811, 74431, 124009, 131800, 79283, 105723, 140499, 74327, 44729, -18994, -32007, -59718, -48791, -56894, 10033, 20916, 11978, 49102, 49462, 56525, 37017, 23667, 72614, 117567, 60852, 32784, 15231, 34334, 59518, 96387, 77490, 87986, 107105, 115850, 96088, 85438, 80911, 31182, -19716, -999, -23751, 19758, 36787, -4911, 15392, 37904, 57320, 16964, -205, 13997, 16938, 28762, 67881, 39224, -7108, 61357, 95180, 78881, 53727, 80344, 145753, 138082, 98753, 111831, 60132, 43974, 64682, 42199, 44865, 71955, 64009, 63358, 91881, 125934, 123833, 49990, 44229, 48372, 75978, 133864, 175702, 120623, 64531, 89714, 84136]
10735H4136o901r495r19n250m7572m6402K2947Q2959n1143J7523K1872L2228n6042
10722C7941j6794m184J4747K6326m984k5970K0966O5464K8249J7339j3585q898
10710A36617m4201m3205k5304O575q868p551l319M7284k050O243l0815j3541J6292
10697C4157R905J996j1166j0624K5877J6958j3640J3460m066J3905L4378P861
10685A19001j1108Q559O947n4647J8151O1091O734q307m3255L1840j6832l2313
10673H5861j9247m7995K1874j7814J5092l6343L3901L7507m3251l9502j2789K1659
10661a047O5586K7995k9330J2379m8871k7959l444m4295K1031J9182j0127k273
10649b1173J5373L3087O2371j826n3706N2319R271k5027j5679j8394N898M0631
$$ y = [84136, 77235, 67740, 66821, 61571, 13999, -32403, -9456, 73503, 22360, 39883, 61755, 93983, 37941, 21147, 16963, 31710, 58036, 53052, 27082, 48048, 113512, 141761, 159100, 145515, 136617, 92416, 49211, 23907, 30482, 21614, 14063, 10744, 58028, 55978, 62221, 31406, 17865, 34157, 44062, 46058, 34892, 24268, 50145, 67103, 53463, 66923, 62857, 76762, 111140, 119001, 107893, 116452, 123399, 68752, 86903, 147994, 154728, 146421, 103166, 135006, 118174, 85861, 66614, 18619, 40493, 22679, 37771, 1428, 35329, 72836, 29585, -9917, -22706, -1047, 64539, 92534, 63204, 75583, 26712, -1247, -4691, -48986, -27955, -8773, -18900, -21173, -5800, 27287, 89658, 87832, 34126, 86445, 95716, 70689, 55010, 36616, 42514, 83145]
10637H3145M7430Q109N5640K0045l0358m1663K2357j5799k5261o694l6617O46
10625H0980k20J7398q533P8516R755k6471l5271J50q7O77l020J0706K0152J5314
10611A60046N313J0404M4082m2348l9776J4229L5818n9096r2339k8712L5028N0194
10599I2843j4808j5694k4887J9427J687k4552q658j2315L4756K6820P2449j9761
10587A27307l0953l0001o3661r511J2113m7567k1391O1220R0840r500M0280j0729
10575A08447j09261q099N7182P5696J6286P897p0140K5177Q0458J866m9022m101
10563A32386K193L1428P4487l1725q4513m0760K1767P2613j7903k6860k3027o2013
10551D8073m8678L1764o23j2082L5561M1368O687J1830M7148l6811k9925j8660
$$ y = [83145, 130575, 138684, 194324, 214369, 184011, 142348, 164705, 148906, 123645, 116951, 80334, 80980, 80760, 98158, 89625, 168141, 177896, 151425, 116154, 116304, 116217, 116894, 113874, 124580, 144732, 160046, 165359, 175763, 219845, 177497, 137721, 151950, 187768, 128672, 36333, 7621, 42649, 92843, 78035, 62341, 37454, 56881, 58568, 34016, 25358, 13043, 47799, 74619, 147068, 127307, 96354, 66353, 2692, -6819, 5294, -42273, -63664, -2444, 88396, 78896, 119176, 108447, -814, -8913, 48269, 123965, 140251, 148148, 78008, 103185, 183643, 185509, 136487, 132386, 134579, 166007, 240494, 208769, 124256, 83496, 105263, 177876, 159973, 133113, 110086, 48073, -605, 31159, 30536, 18454, 54015, 95383, 102070, 113900, 161048, 124237, 94312, 75652]
10539G5652j8024j7947l3355j2086K5598K0426J5189o327K969O2405O3775j2233
10527A66042k0120j0791o346L7061J2104k4142m2237j9335m1993K0159K4747P0940
10515A66089k1083m9644o7472k9343L9136J3740j0962J9392N020j0291l3796J2406
10503C3192N2029M1356L260l9405L023k2874j3919j4418P062N3332j9430m2092
10491D1116K5673m752L1279J262j2029o196l3446K7485M0318p059n0917j7788
10479C4946Q3467N2653l5640J0819L5155K5016l5074m629j6107k2719J2463l2996
10467A07354J6970L9477J1055L1543p3149n0372M283J00J3192K7566J0300l5388
10455A02931l8089k1684P8845N1243k1106l988L4202j9681n5448k0663m8129l1203
$$ y = [75652, 57628, 39681, 6326, -5760, 19838, 40264, 55453, 49126, 52095, 114500, 178275, 166042, 145922, 135131, 128785, 165846, 177950, 153808, 111571, 92236, 50243, 70402, 95149, 166089, 145006, 95362, 27890, -1453, 37683, 51423, 40461, 59853, 64873, 54582, 20786, 33192, 85221, 126577, 129837, 90432, 93455, 70581, 56662, 42244, 49306, 102638, 83208, 41116, 66789, 62037, 93316, 94578, 82549, 76353, 42907, 70392, 110710, 103651, 52734, 34946, 118413, 171066, 135426, 146245, 181400, 206416, 171342, 166713, 150606, 127887, 140350, 107354, 124324, 163801, 174856, 206399, 133250, 82878, 87161, 87261, 100453, 128019, 138319, 102931, 64842, 43158, 122003, 173246, 152140, 148152, 182354, 162673, 107225, 86562, 38433, 7230]
10443G230L5098L4286K598o9615j0938K8315N4512r673M7K5697O2556k9301o0191
10430G0621l8925j2787L0439R0453J6999l6737L173N56J0733j4568k8108J5153
10418A07002j1809k5844Q599K6099L163l7108L8597L8711M030o0336K3716P885
10406A22705R422k2594J710N166J4310L8917J9039m535l4487k3004l9662l2062
10394E4925J1254k0012K4050K8689P553k0318k5060O8380L5732n2831m9271K9389
10382I2480L9485M3041J1763q3163j456Q4069J5947L437m303L2784l1077m7110
10370A55897K9501N3111M7881m83o5977m1790l4279K3283k539o646j3723j199
10358A43037k9771J7470P2602R730J2652M0604l6263n2736P268K707j1136N0077
$$ y = [7230, 42328, 76614, 79212, 9597, -1341, 26974, 81486, 71813, 71860, 97557, 160113, 130812, 70621, 31696, 18909, 49348, 139801, 156800, 120063, 123236, 123792, 134525, 119957, 91849, 107002, 95193, 69349, 77948, 104047, 107210, 70102, 108699, 147410, 151440, 91104, 114820, 122705, 132127, 109533, 111243, 116409, 130719, 169636, 188675, 184140, 149653, 126649, 86987, 54925, 66179, 46167, 70217, 98906, 106459, 86141, 61081, 129461, 165193, 112362, 63091, 92480, 131965, 175006, 186769, 103606, 102150, 186219, 202166, 205603, 201300, 234084, 203007, 155897, 185398, 238509, 286390, 285907, 219930, 178140, 143861, 167144, 164605, 157959, 144236, 143037, 113266, 130736, 203338, 213068, 225720, 266324, 230061, 177325, 184593, 187300, 176164, 226241]
10346B26241N0508J670j1042N7310N2045l4489m9106j497p277L0999M7827R535
10334C72724m3445m0299j2216J3113J0592P2957M2933K8572k2402p038J0061k1312
10322D04240M8366Q1595j8420l1121j7981j6907M2472J6040O470n528k5821o1880
10310D21525k0554K7632J3220q021K2235L3970l385j0799o0739K5877K3486n6859
10298D07588m3695K5374m2559l0360L5472K9254n223m4614k0040J912M3222L1020
10286C87351j4945k2928l5845l0872J133k3087R989Q848k6023L1370L2437k8883
10274B88545m6339l5913k3125m1926N7221L6934o557O9508J7345k9838J3668l8566
10262B60957N581L8202N4414N5622L3707J4836M2300K3343n5042k656J3934J0978
$$ y = [226241, 276749, 278419, 267377, 324687, 376732, 342243, 293137, 291640, 284363, 315362, 363189, 372724, 329279, 288980, 276764, 289877, 300469, 373426, 416359, 444931, 422529, 415491, 425552, 404240, 452606, 534201, 515781, 484660, 466679, 449772, 492244, 508284, 514754, 509226, 483405, 421525, 400971, 428603, 441823, 433802, 456037, 490007, 486622, 475823, 415084, 440961, 464447, 407588, 363893, 389267, 346708, 316348, 351820, 381074, 375851, 331237, 311197, 313109, 356331, 387351, 372406, 349478, 313633, 282761, 283894, 260807, 270796, 279644, 253621, 284991, 317428, 288545, 242206, 206293, 183168, 141242, 198463, 235397, 228840, 298348, 315693, 285855, 299523, 260957, 266538, 304740, 359154, 414776, 448483, 463319, 505619, 528962, 473920, 471264, 485198, 496176]
10250D96176P998j4089k8110j3567P5830O8242L7538k4488J4469N9837j312j8336
10238F60188n3185p9684K204P1735O4733M0492N6394J3724k0772l7318j9077l2721
10226F66713O3636Q5046j9419j1647j4560L4832n4852n2460J0923L6647M1826
10215G86685M4699O68p4187r3157o0795k2665l2502p8847k8247L2416K8321m2298
10203D60091l0227L787K7178J0732J2352L3283j523n8917m6207N963n8065j6795
10191C41652K1465n734l4369j8574q317K0405k2085l9400M216J2518m2055K6675
10179B56397L5071J284L9500L0396r826O2933M0320j9083j6495j1839m1495q232
10167C58931K2870O933m5749K2366N4230k3162l1875J0780n2215L874M8380o7428
$$ y = [496176, 504174, 490085, 461975, 448408, 524238, 592480, 630018, 605530, 619999, 679836, 678524, 660188, 607003, 527319, 529523, 601258, 665991, 706483, 762877, 776601, 755829, 718511, 699434, 666713, 730349, 815395, 795976, 784329, 769769, 804601, 749749, 697289, 708212, 744859, 786685, 831384, 832052, 757865, 664708, 603913, 581248, 548746, 469899, 441652, 474068, 502389, 460091, 429864, 433651, 460829, 471561, 483913, 517196, 515673, 456756, 410549, 416512, 358447, 341652, 363117, 357383, 323014, 304440, 296123, 316528, 294443, 255043, 259259, 271777, 229722, 256397, 291468, 292752, 332252, 362648, 352822, 415755, 456075, 436992, 420497, 408658, 367163, 358931, 381801, 388734, 342985, 365351, 419581, 396419, 364544, 375324, 323109, 326983, 375363, 307935]
10155C07935l4490k5085L451J6855M7213m848L3051J4318K2856j8720R804k155
10143C70185m322k6069K2891k24k2742L859M748j3548J4611J4050Q8785J6527
10131D68751l9566n5065n8572p142K3554k0539j8133K2475R069l3291J1028N4854
10119C57423Q2141Q0768J8321L7241L2271P6693N9945M8002P7495Q0522K9527
10108I80349m2659m1106j0097r1707j87982p8063L7326k2694j8176j1829J2935
10097E26297m6905k5838L6229N8291J6055j1470J7539M9537O9803P7709N5009
10086H22256L3713O1990P3733N7007K9721k0908q6952n1591o5153n7673o9745
10075G26398m8541k4162J4192k606q6951j0091P0375K2414j7470m836P1L402k8493
$$ y = [307935, 273445, 248360, 251811, 268666, 315879, 311031, 344082, 358400, 381256, 362536, 372340, 370185, 365863, 339794, 362685, 362461, 339719, 343578, 348326, 334778, 349389, 363439, 452224, 468751, 429185, 374120, 315548, 308406, 331960, 311421, 293288, 315763, 324832, 291541, 302569, 357423, 439564, 520332, 538653, 575894, 608165, 684858, 744803, 792805, 870300, 950822, 980349, 937690, 896584, 886487, 794780, 606798, 528735, 566061, 543367, 525191, 513362, 526297, 479392, 453554, 489783, 548074, 564129, 552659, 570198, 619735, 689538, 767247, 822256, 855969, 917959, 991692, 1048699, 1078420, 1057512, 970560, 918969, 853816, 796143, 726398, 677857, 653695, 667887, 665281, 578330, 568239, 638614, 661028, 643558, 638722, 638793, 642195, 613702]
10062F13702L2914J1184q455P438O614M6404J9201j8255k740L9291R149K748r213
10049G49982L2951Q8033J05495N1862J3602Q6642L554o0384l5747n5306n4143
10038I26541k7981K0052j1855Q087J0128J7721p1940l4129M4071L5050O0269J8948
10026I94962J5982J4399M0416J04644J43692L7642J9411L2266P5268J6513o7150
10015A428045O728n6171o7050k6818p0236j7111L0839J1558k4623J74j6920q89
10003A197526n650N032J9570m817r24K5228M6443R2412J01930R2550K2672m4651
9991A547321j212k0483J3921j8021k8827J7821L8622o211L0869N4906P4272J1337
9979A714315l1824N7410J06676P1873J8807L4522K4434J15128J00928L8256M2108
$$ y = [613702, 646616, 657800, 649345, 656783, 663397, 709801, 729002, 710747, 708007, 747298, 756447, 759195, 749982, 782933, 870966, 976461, 1028323, 1041925, 1128567, 1132121, 1071737, 1035990, 980684, 926541, 898560, 918612, 906757, 914844, 924972, 942693, 870753, 836624, 880695, 915745, 976014, 994962, 1010944, 1025343, 1065759, 1170403, 1314095, 1351737, 1371148, 1403414, 1478682, 1495195, 1428045, 1434773, 1378602, 1311552, 1284734, 1214498, 1197387, 1228226, 1239784, 1215161, 1215335, 1198415, 1197526, 1191876, 1196908, 1216478, 1211661, 1210737, 1235965, 1282408, 1374820, 1476750, 1569300, 1591972, 1547321, 1546109, 1525626, 1539547, 1521526, 1492699, 1510520, 1549142, 1542931, 1573800, 1628706, 1702978, 1714315, 1682491, 1739901, 1846577, 1918450, 1937257, 1971779, 1996213, 2111341, 2212269, 2250525, 2292633]
9968B292633J18613J40155J18467P0781J67503J92251K35420J21403J94728K43683
9958C895637K74858L21121L80132M34532L34554M22485O02642P44416Q52163J053977
9948I316517J361972J589492J904958K054711K068837J969065J577482J087324
9940B2930358O93032N56207O61731Q43494J067732J411079J904974K364444K553939
9931C4986990K425536J855759J145018N73347J93308J60580M18340P14224Q01499
9922D3274601R36133J139706J426542J595228J562160J672301J746425J601956
9914E4955052J083613K79184n83635j125519j423288j685758j687731j549572
9906D8262346j457855j343480j200329r99682p74763p19679r35710j310101j684269
$$ y = [2292633, 2411246, 2551401, 2669868, 2740649, 2908152, 3100403, 3335823, 3457226, 3651954, 3895637, 4170495, 4491616, 4871748, 5306280, 5640834, 6063319, 6665961, 7410377, 8262540, 9316517, 10678489, 12267981, 14172939, 16227650, 18296487, 20265552, 21843034, 22930358, 23623390, 24179597, 24841328, 25684822, 26752554, 28163633, 30068607, 32433051, 34986990, 37412526, 39268285, 40413303, 40986650, 41179958, 41340538, 41758878, 42473102, 43274601, 44210734, 45350440, 46776982, 48372210, 49934370, 51606671, 53353096, 54955052, 56038665, 56317849, 55734214, 54608695, 53185407, 51499649, 49811918, 48262346, 46804491, 45461011, 44260682, 43261000, 42486237, 41766558, 40830848, 39520747, 37836478]
9897C7836478j900758j921409j694697j276461p57366k77539M1922J15542Q0678
9888C0246390k28750p75420j407956k002587k472466k622569k473867k053859
9880A6208916j720548j351566j028482p71811n56095l71630k46103n8484R3208
9871A0197405K00483K69059L59366M79806N51304P35032R18747J225759J437848
9862A6374809J818911K271817K882969L565211M391349N162243N529324N284648
9854D7281281M370416L170521J913047Q67056K81660J76473M59777J030493K018863
9845F1569587L309017M391585M925464M778011M167103L124715J877249Q72605
9837H9015336O27709R55041J336796J747643K202561K895881L438985L359041
$$ y = [37836478, 35935720, 34014311, 32319614, 31043153, 30285787, 30008248, 30050170, 30165712, 30246390, 30017640, 29242220, 27834264, 25831677, 23359211, 20736642, 18262775, 16208916, 14488368, 13136802, 12108320, 11336509, 10780414, 10408784, 10162681, 10104197, 10197405, 10397888, 10666947, 11026313, 11506119, 12057423, 12792455, 13711202, 14936961, 16374809, 18193720, 20465537, 23348506, 26913717, 31305066, 36467309, 41996633, 47281281, 51651697, 54822218, 56735265, 57602321, 57883981, 58060454, 58520231, 59550724, 61569587, 64878604, 69270189, 74195653, 78973664, 83140767, 86265482, 88142731, 89015336, 89643045, 90598086, 91934882, 93682525, 95885086, 98780967, 102219952, 105578993]
9829A05578993K766357K151376J440063L32140j001933k034587k581878k854781
9821A03795750l134737l413180l086398k454527j900879j619231j464900j331715
9813H5390183j231988j494686k261120l227811m166136m936791n057443m443784
9805E8570424l499813k435158j703719j162932q99187q30903j282054k106581
9797D4650077l089021l949756m332574m371965m096264l576681k987871k442189
9789A5803756j940542j506355j279486j057108q33711p27781o70862n94425n04331
9780F689155l99794l73603l13530k68758k58609k08341j85878j38040j97683j83180
9770D161739n8075l6997k5417q6768j48165j38172m9225l7662K0858N874o964
$$ y = [105578993, 108345350, 110496726, 111936789, 112268929, 111266996, 109232409, 106650531, 103795750, 100661013, 97247833, 94161435, 91706908, 89806029, 88186798, 86721898, 85390183, 84158195, 82663509, 80402389, 77174578, 73008442, 68071651, 63014208, 58570424, 55070611, 52635453, 50931734, 49768802, 48869615, 48038712, 46756658, 44650077, 41561056, 37611300, 33278726, 28906761, 24810497, 21233816, 18245945, 15803756, 13863214, 12356859, 11077373, 10020265, 9186554, 8458773, 7787911, 7193486, 6689155, 6289361, 5915758, 5602228, 5333470, 5074861, 4866520, 4680642, 4542602, 4344919, 4161739, 4103664, 4066667, 4041250, 3954482, 3806317, 3668145, 3618920, 3581258, 3602116, 3607990, 3601026]
9759C601026k5351k2545L2143J9746O1597P6326j3456l1458O139j5526L3402O3058
9747C785101m6Q0180J04841Q4175J09123J57973J41292J03670K39214K59451K58674
9736E323648K73848L22729L37236M10140M12744L84408L67966M17092M18145M81127
9726I149083O48677P32598Q33638J059328J241830J577947J964075K393789K832775
9717B2433740L375602M027610N005665O268901P765199R518532J0885315J0792691
9709H0073255P942249K653705l368492p880989r874289r746390q464043o988050
9701D4346956n676133m492991l503123k532443j673817r72427l04182M73841J158946
9692B6824627J923601K692366L506018M087331M572214N120588N886272O759153
$$ y = [3601026, 3575675, 3553130, 3585273, 3605019, 3666616, 3742942, 3729486, 3698028, 3704167, 3688641, 3722043, 3785101, 3785055, 3865235, 3970076, 4054251, 4163374, 4321347, 4462639, 4566309, 4805523, 5064974, 5323648, 5597496, 5920225, 6257461, 6667601, 7080345, 7464753, 7832719, 8249811, 8667956, 9149083, 9797760, 10530358, 11363996, 12423324, 13665154, 15243101, 17207176, 19600965, 22433740, 25809342, 29836952, 34842617, 41111518, 48876717, 58395249, 69280564, 80073255, 88015504, 90669209, 87300717, 79419728, 69545439, 59799049, 51335006, 44346956, 38670823, 34177832, 30674709, 28142266, 26468449, 25496022, 25191840, 25665681, 26824627, 28748228, 31440594, 34946612, 39033943, 43606157, 48726745, 54613017, 61372170]
9684F1372170P323964O997985M986140J369482k920731o265894p696413p426517
9676E7740186o470770n708047n297667n098274m585933l908733l124845k357962
9668B1187955j642897j098695p95832n32890k48067o3266J8234J73437M04250
9659A7402229M73777N49722P22915J019587J391714J979333K510825L112912L780023
9650C2943037M620964N438873O186503O859113P247569P076651N503024K586530
9642G8462264r13328l759033n559015o228244o255556n688821m877027m090058
9634D1091182l287180k386301j612320p43047J65915J104351K139338L144487
9626C9616425M204319N362274O698182Q188207R490994J0199821R937421Q245613
$$ y = [61372170, 68696134, 75694119, 80680259, 82049741, 79129010, 72863116, 65166703, 57740186, 51269416, 45561369, 40263702, 35165428, 30579495, 26670762, 23545917, 21187955, 19545058, 18446363, 17650531, 17117641, 16869574, 16806308, 16824542, 16997979, 17402229, 17876006, 18425728, 19148643, 20168230, 21559944, 23539277, 26050102, 29163014, 32943037, 37564001, 43002874, 49189377, 56048490, 63296059, 70372710, 75875734, 78462264, 77548936, 73789903, 68230888, 62002644, 55747088, 50058267, 45181240, 41091182, 37804002, 35417701, 33805381, 33062334, 33228249, 34332600, 36471938, 39616425, 43820744, 49183018, 55881200, 64069407, 73560401, 83760222, 93697643, 101943256]
9618A01943256N269179J381758k931799o730111r222715j0308215j0114674r211383
9610F0075296p945512o681891n609911m577285l604679k714918j776887r69775
9602B6194438k38246M67866J122246J694423K073855K497226K780072K777778
9594C9369658K262265J036678p35600k497099l591717m004193l906244l505034
9586B4428714l025548k497892j937830j572932j255262j004935p86732o27502
9578A1720081m50578l67885l01618l31754j97448k03339j17933O3469K38176K87626
9568A0338797L98348O42939R64308J318809J737998K143385K384398K484742K562514
9559B4976238K758760L200648L697065L617771K584727P27263j459793l032152
$$ y = [101943256, 107212435, 108594193, 105662394, 98932283, 89709568, 79401353, 69286679, 60075296, 52129784, 45447893, 39837982, 35260697, 31656018, 28941100, 27164213, 26194438, 25956192, 26424058, 27546304, 29240727, 31314582, 33811808, 36591880, 39369658, 41631923, 42668601, 41933001, 39435902, 35844185, 31839992, 27933748, 24428714, 21403166, 18905274, 16967444, 15394512, 14139250, 13134315, 12347583, 11720081, 11269503, 10901618, 10600000, 10268246, 10070798, 9867459, 9749526, 9812995, 10051171, 10338797, 10737145, 11380084, 12344392, 13663201, 15401199, 17544584, 19928982, 22413724, 24976238, 27734998, 30935646, 34632711, 38250482, 40835209, 41562472, 40102679, 37070527]
9551C7070527l724952l821225l417241k920339k593119k291566j963995j610133
9543A4727957j156967p38135l99423p3833K91869N87998R26603J383817J814716
9534A7364602K232579K705640L324003M052016M606115M444419L132388N87966
9526D2449728k271202m392948n255651m980595m237490l498074k787386k228281
9518A2798101j815465j474721j200759j057334q53351o12563m96466m36501l45851
9509D505090k91985k18091j72865k20168j59965j72654j99219j33964j58674j96978
9499B580527j19411o6677k5659k4416j8687j8229m7713j5899o1174j20137r8209
9488A964316j54241r5659n7347j1920p7822j10658n1463m5246O724K7101k5166
$$ y = [37070527, 33345575, 29524350, 26107109, 23186770, 20593651, 18302085, 16338090, 14727957, 13570990, 12832855, 12433432, 12359599, 12651468, 13239466, 14166069, 15549886, 17364602, 19597181, 22302821, 25626824, 29678840, 34284955, 38729374, 41861762, 42449728, 40178526, 35785578, 30529927, 25549332, 21311842, 17813768, 15026382, 12798101, 10982636, 9507915, 8307156, 7249822, 6396471, 5783908, 5287442, 4850941, 4505090, 4213105, 3995014, 3822149, 3601981, 3442016, 3269362, 3070143, 2936179, 2777505, 2580527, 2461116, 2394439, 2368780, 2344364, 2325677, 2307448, 2259735, 2243836, 2182662, 2062525, 1964316, 1810075, 1714416, 1657069, 1645149, 1567327, 1456669, 1405206, 1359960, 1366684, 1393785, 1368619]
9477A368619q2897n7439L8892J2124Q230K0392K690l701j3932M6369P5236n8523
9465A356060o4837m5515j40254r2013o5696j4309K7633j8863n5775l1911L4356
9454H88876P0487L3569k351N8250K1000o0723m2727O482K6793j7908l1129K299
9442I52918m7611n2154J008M3059M7935q727j0586K8696L2905L9123N6105K5482
9430A108153J5561J8913k5458o1058L901J2030Q440N200M347K0189K8473n9419
9418A079272o7021k9892j0212K833k6707o4190J8672L342r230k893L5895J6515
9406I46384m043n0247o8580P398j2282n1653l5700j2555n7138q68L4551K9288
9394G24555j5170k9364J0675p0798o0868l0110m3775O194k4101n1849J0523j7054
$$ y = [1368619, 1285722, 1228283, 1267175, 1279299, 1287529, 1307921, 1310611, 1306910, 1292978, 1339347, 1414583, 1356060, 1291223, 1245708, 1105454, 1013441, 947745, 933436, 961069, 942206, 886431, 854520, 888876, 959363, 992932, 990581, 1048831, 1069831, 1009108, 966381, 972863, 999656, 981748, 950619, 952918, 905307, 853153, 854161, 897220, 945155, 936428, 925842, 954538, 987443, 1026566, 1082671, 1108153, 1123714, 1142627, 1117169, 1056111, 1060012, 1072042, 1080482, 1085682, 1090029, 1110218, 1138691, 1079272, 1012251, 982359, 972147, 974980, 948273, 884083, 902755, 906097, 896867, 893974, 929869, 946384, 942341, 892094, 823514, 830912, 818630, 766977, 731277, 718722, 661584, 660716, 695267, 724555, 709385, 680021, 690696, 619898, 559030, 528920, 485145, 491339, 467238, 415389, 425912, 408858]
9382D08858l5755m0197J7895O066J9774P8607J4173j4712m2978o8749N749K5480
9370C74211k2451k8844J0001J9349l6629J1887L6855p4093N209L9888r5K429J483
9357C39200J9498N3822L982j2729J7777J8093n3506n2377l2640l6832J0392N6861
9345C31541L5221L4797q202n2861l2871o118J5978J930M689K8689p566l7544m2505
9332B65178K1979N4406M427l801L437j0312K932L5600j7959J0789j744M9274j369
9319D12837n620j4425l3476n5090j7291J4856L5244N8286K8423J708J4907K4342
9307D64701M0863J16519M7336L3696L9670L1041O0573J371q3433p6521q2508o6544
9295E26764l256O4714N185o2468o9992l1255K7516N5285q280l1825j1489p161
$$ y = [408858, 373103, 332906, 350801, 356867, 376641, 455248, 469421, 454709, 411731, 342982, 348731, 374211, 351760, 322916, 332917, 352266, 315637, 327524, 364379, 290286, 295495, 335383, 335288, 337717, 339200, 358698, 412520, 416502, 403773, 421550, 439643, 386137, 333760, 301120, 264288, 274680, 331541, 366762, 401559, 393357, 340496, 307625, 301507, 317485, 319415, 324104, 352793, 345227, 307683, 265178, 287157, 341563, 345990, 342189, 345626, 335314, 338246, 373846, 355887, 366676, 364932, 414206, 412837, 407217, 392792, 359316, 304226, 286935, 301791, 337035, 395321, 423744, 425452, 440359, 464701, 505564, 622083, 669419, 703115, 742785, 773826, 834399, 835770, 752337, 675816, 593308, 526764, 523508, 588222, 593407, 530939, 460947, 429692, 457208, 512493, 504213, 472388, 460899, 453738]
9283D53738k0394M2007M0513M6725R6236J19391J20954J22807L3014p0068l0692
9272I54231l1699l9659k4259P019R74K6234m2577L653K0847L333M8750R2227J31868
9259A150942J26906N2240J01630R3335J02473J47885J90306K67294L44020L45348
9249B922379M73698N87834P11130Q96387J110661J431497J841353K090897K001135
9240A4066971J218702l1679j244002j886254k009593j791913j527225j192220
9232E602787q88417o80023o01185m76806l81215l01610k39074j69646k16089k07493
9222A441229j16246j691k9295m2755m3151m1487j7343K5646r196j3144P4727M8943
9210A276237l8984o4428o0483p9691j26784j17921m1360k8491o3262n0620n0916
$$ y = [453738, 433344, 475351, 515864, 562589, 658825, 778216, 899170, 1021977, 1054991, 984923, 954231, 922532, 882873, 858614, 865633, 866607, 892841, 850264, 853917, 874764, 878097, 926847, 1019074, 1150942, 1277848, 1330088, 1431718, 1525053, 1627526, 1775411, 1965717, 2233011, 2577031, 2922379, 3396077, 3983911, 4695041, 5591428, 6702089, 8133586, 9974939, 12065836, 14066971, 15285673, 15253994, 14009992, 12123738, 10114145, 8322232, 6795007, 5602787, 4714370, 4034347, 3433162, 2956356, 2575141, 2273531, 2034457, 1864811, 1648722, 1441229, 1324983, 1323292, 1293997, 1251242, 1208091, 1166604, 1149261, 1174907, 1165711, 1152567, 1227294, 1276237, 1237253, 1172825, 1112342, 1032651, 905867, 787946, 746586, 718095, 654833, 604213, 553297]
9199E53297m5049M762j7223q167K8309M7565n8558J62o226J0436M3372k0227j0857
9186E21596N6629L8387n6240n2249o855J0322K1860l8589n8025q1566m7015N944
9174C14199k0072j8870j2879L8847m223K7649J6119J0210j3391P9367L3837j3595
9162D37198k3389l8891M908J5601n3648O101j4426K4059q069K8817P5053O9158
9150E22472l4730M1551M0647J5123o042m3032p0086m6940J6978N8370k4393n4692
9138D15226l3345m2750j8274J596M4588J7634p240l1396l182l2631K0777j1223
9126C19780M3923M2305N0181J8221p570J4075j164j8191o9756M672J2447j6170
9114C92753o963l5326m7208n6160j2429K7719J2809N0494L4188J3490l6402p7969
$$ y = [553297, 508248, 513010, 495787, 487620, 515929, 563494, 504936, 505098, 498872, 509308, 552680, 532453, 521596, 578225, 616612, 560372, 508123, 501268, 511590, 533450, 494861, 436836, 355270, 308255, 314199, 294127, 275257, 262378, 301225, 297002, 324651, 340770, 350980, 337589, 416956, 450793, 437198, 413809, 374918, 379826, 395427, 341779, 347880, 333454, 357513, 349444, 378261, 453314, 522472, 487742, 529293, 569940, 585063, 579021, 535989, 465903, 418963, 435941, 494311, 469918, 415226, 381881, 339131, 320857, 322453, 367041, 384675, 377435, 346039, 342857, 310226, 331003, 319780, 363703, 406008, 456189, 474410, 466840, 480915, 479751, 461560, 391804, 396476, 408923, 392753, 385790, 350464, 303256, 247096, 234667, 262386, 275195, 325689, 359877, 373367, 336965, 258996]
9102B58996r78O8572N3345k4685j4918K1414K5122Q091m5814l3865J0476l0205
9090B95551l1277K0907L7392l378J2511J6480J5612n5932m6313J0177P391J3429
9078B92550j2718P4171L7957L445n918J16J1474j1851j557O2030L7500m0510j7709
9065D28980P944j1551K2037M0763l1075n7470n693J3290M0476L7705M3180k4219
9053E04367M662J6339K6435K2713m46m6217J0256k1954j2713N6079N5270N7801
9041F72592j0590j39J9637j7895J3558K454R933l4088l6735j7850R1384R8933
9029G91194Q3985J4116m8122J2628O5017M1612p614j3070J5821l4648q146N7513
9017I70286R4551O2284J3245M46K0102J0737P0474P7014L1633P12k0369M7612
$$ y = [258996, 258018, 326590, 379935, 355250, 340332, 361746, 386868, 394959, 349145, 315280, 325756, 295551, 264274, 285181, 322573, 319195, 331706, 348186, 363798, 307866, 261553, 271730, 279121, 292550, 279832, 354003, 391960, 395405, 389487, 389603, 401077, 389226, 387669, 449699, 487199, 446689, 428980, 436924, 425373, 447410, 488173, 457098, 399628, 393935, 407225, 447701, 485406, 528586, 504367, 509029, 525368, 551803, 574516, 574070, 527853, 538109, 516155, 503442, 559521, 614791, 672592, 662002, 661863, 681500, 663605, 677163, 679617, 689550, 655462, 618727, 600877, 692261, 791194, 875179, 889295, 841173, 853801, 918818, 960430, 952816, 939746, 955567, 920919, 912773, 970286, 1064837, 1127121, 1140366, 1140812, 1160914, 1171651, 1242125, 1319139, 1350772, 1351484, 1331115, 1378727]
9005A378727P6801N7423O1371O9593J27047M7537O8715Q1071J9687O1114J03514
8994B152600J47608J51523Q8392J41544K07993J89198K48575K68903K92103K91323
8984D179762L25566L47593M32483N24748O25463P04421Q36696J005958J202205
8975A0184895J438813J646594K150699K764573L523687M646376O058465Q045923
8967D0460025J0204741J1136203Q982010K818414m688322r473807j0489900r165380
8959C9783984p226232n595406m262763l180173k391732j869859j416891j108096
8951A2732832r08575o79752m51656l38315k59827j24689n5258r562J11611K02432
8941A0219241K95637M35611N47547O37393P97371J012617J270410J492762J782537
$$ y = [1378727, 1455528, 1512951, 1574322, 1643915, 1770962, 1818499, 1887214, 1968285, 1987972, 2049086, 2152600, 2300208, 2451731, 2540123, 2681667, 2889660, 3078858, 3327433, 3596336, 3888439, 4179762, 4505328, 4852921, 5285404, 5810152, 6435615, 7140036, 7976732, 8982690, 10184895, 11623708, 13270302, 15421001, 18185574, 21709261, 26355637, 32414102, 40460025, 50664766, 61800969, 70782979, 73601393, 68913071, 59439264, 48949364, 39783984, 32557752, 26962346, 22699583, 19519410, 17127678, 15257819, 13840928, 12732832, 11824257, 11144505, 10692849, 10354534, 10094707, 9970018, 9914760, 9905198, 10016809, 10219241, 10514878, 10950489, 11498036, 12135429, 12932800, 13945417, 15215827, 16708589, 18491126]
8932A8491126K130746K607592L177850L963918N230086O914797R215928J2577231
8924F4309274J7526091K3200751K6667786K1235140L998275j5555611k5635809
8917A15745897k5102341k0153620j5051011j1065410q136521n998046m451671
8910B5787277l443606k707276k206727j801875j439273j156330r83370q30956
8902A1217864o27700m47899l52786k79373j99727j25105m133J12448K11387L12347
8892I817323L95748N25088O52426Q36286J043437J308463J498556J901541K518408
8883B0497276L323642M330316N730158P421924R108121R700583P275161J246298
8875F8633479n698233r901808j0470182q989716p065427n266051l895810k967175
$$ y = [18491126, 20621872, 23229464, 26407314, 30371232, 35601318, 42516115, 51732043, 64309274, 81835365, 105036116, 131703902, 152939042, 156937317, 141381706, 115745897, 90643556, 70489936, 55438925, 44373515, 36236994, 30238948, 25787277, 22343671, 19636395, 17429668, 15627793, 14188520, 13032190, 12048820, 11217864, 10590164, 10142265, 9789479, 9510106, 9310379, 9185274, 9181141, 9293589, 9504976, 9817323, 10213071, 10738159, 11390585, 12226871, 13270308, 14578771, 16077327, 17978868, 20497276, 23820918, 28151234, 33881392, 41303316, 50411437, 60112020, 67387181, 68633479, 62935246, 53033438, 42563256, 33573540, 26508113, 21242062, 17346252, 14379077]
8867A4379077k274953j763536j369799j145385r13137p76259p26538o57149m69507
8858D282814l64087k98973l40788k52756j99286j93969j47838j68093j56194j09740
8848B051090r6652o6896j04279q5335o2247J728m5052p1740q0167n1476m5608
8837A343366l4206m2508n0229o1305q0391k7307l1664k1539n7972n555k1824n1403
8825H57463n2322k7357l3531O3400l342m7113j5979n6399j7814P379l4445j2959
8813F26981k3785k3696M5138k1966m0146m2840J0619L899K8184J5837l8268j3665
8801E26292J4580k551P882M5713j1203r741K35N1610k606J9457N5179n0236r4239
8788E50372k8680J7237l9195k1330O2775l3929j5698P5927l514j9479K8647o6220
$$ y = [14379077, 12104124, 10340588, 8970789, 7825404, 6912267, 6136008, 5409470, 4752321, 4282814, 3918727, 3619754, 3278966, 3026210, 2826924, 2632955, 2485117, 2317024, 2160830, 2051090, 1954438, 1887542, 1783263, 1697928, 1635681, 1637409, 1592357, 1520617, 1440450, 1388974, 1343366, 1309160, 1266652, 1216423, 1155118, 1074727, 1047420, 1015756, 994217, 936245, 930690, 908866, 857463, 805141, 777784, 744253, 807653, 804311, 757198, 741219, 684820, 667006, 674385, 639940, 626981, 603196, 579500, 624638, 602672, 562526, 519686, 530305, 534204, 562388, 578225, 539957, 526292, 540872, 538321, 546203, 591916, 580713, 570972, 571207, 622817, 620211, 639668, 694847, 644611, 550372, 521692, 538929, 499734, 478404, 541179, 507250, 491552, 567479, 563965, 544486, 573133, 506913]
8776E06913k3602m0017j1333j2993n0989k524J6110J8929k7792j00043r791J4476
8764B77344R26K4027L0090J7365K520j3540K2824J5236J7518K157l288l0887J596
8751C63888q124L0518j2155m33K3757m4647r223P4707N0903n203m5531P68M7598
8738D66823m81m6794j4329k746K2174J0929j6537m7192l7659l8903Q765Q509p4216
8725B38343o3710M720L3566L6780J2680K893j6538L4613J5169n0335K9059M9476
8713C26716n0064o1240M3465N0800l3444o5490K0930q162J4856J124J3780Q771
8701B62042N6990M3297p1828k8932q745l6378Q300O093K2593Q334j1248O7072
8689C17590M1151m353Q768P735K4518L0119J6452k5563M6793O5591L9919Q7709
$$ y = [506913, 483311, 443294, 431961, 418968, 367979, 365455, 381565, 400494, 372702, 272659, 262868, 277344, 278270, 302297, 332387, 349752, 352272, 338732, 361556, 376792, 394310, 396467, 393179, 362292, 363888, 355764, 386282, 374127, 373694, 397451, 352804, 343581, 418288, 469191, 463988, 418457, 419225, 466823, 466342, 419548, 405219, 402473, 424647, 435576, 419039, 371847, 334188, 295285, 304050, 312559, 238343, 174633, 179353, 212919, 249699, 262379, 265272, 248734, 283347, 298516, 248181, 277240, 326716, 276652, 215412, 258877, 309677, 276233, 210743, 231673, 223511, 238367, 239491, 253271, 262042, 319032, 362329, 290501, 261569, 252824, 216446, 224746, 230839, 253432, 261766, 250518, 317590, 358741, 354388, 363156, 370891, 395409, 425528, 441980, 416417, 463210, 528801, 568720, 656429]
8677F56429J13983R3072M5013M0279k001r152k7103j01989p4900p8357p2717q1507
8665E01050n3998j3904J5261p104o2067n4245m2436K5822M658J3019J4514L454
8653C44024l0706J7727L5356Q337N4316O1670K2863j2352O2355P5957J34535J48435
8641I22517J4716p9807n1684m329J4260M9116J29164J01130J33307J92141J96553
8630A617084J23766l0193j05389j78446j99964k02837j30985o9246l7712J629
8620G87707m4283m4194r186m9809r9281o919K3563n1278J0542K8034M88L2447
8608E77831n7344J7363O0014R0138R4104L0075K2064J42427Q8546J71742K60063
8597A497023L03400O9896k02899j80033q5165n1175q7210Q559R02M6595m4504
$$ y = [656429, 770412, 863484, 908497, 948776, 946775, 937623, 910520, 808531, 733631, 655274, 582557, 501050, 447052, 433148, 448409, 441305, 379238, 324993, 282557, 308379, 313037, 326056, 340570, 344024, 313318, 331045, 366401, 374738, 429054, 490724, 513587, 501235, 563590, 639547, 774082, 922517, 937233, 857426, 805742, 801413, 815673, 864789, 993953, 1095083, 1228390, 1420531, 1617084, 1740850, 1710657, 1605268, 1426822, 1226858, 1024021, 893036, 823790, 786078, 787707, 743424, 699230, 690044, 640235, 540954, 534035, 557598, 506320, 516862, 544896, 545384, 577831, 520487, 537850, 597864, 688002, 782106, 812181, 834245, 976672, 1065218, 1236960, 1497023, 1800423, 1870319, 1667420, 1487387, 1402222, 1351047, 1263837, 1272396, 1273298, 1319893, 1275389]
8586A275389l3747l5585r0326r8667p6608r8779j03819j03127m7155m6773n2806
8575D87997n4932k9332l5897n131l6539n0476J9350k8512J2612n1354K4131K0473
8563B72390L76Q4005O836o50n019j7743k086k176m2029K9488P7622P5462N0112
8550E26588j1717q1986m9738n5032p991l2935q128k535L7156K4344k8744K4748
8538C34030L5559R54o6414l8473m3823k0555q972m6621J6696K3151J8830j3071
8526A91291m8395n499O0705k134J8332P0281J7856j32809k3019R174M380K2010
8514A82173J7388J5943n843N181n8606l6242K5163j8658n0763j9836O0456J6683
8502A33039M2968M9039J6976k3006k6118k1171k5876l0233O8015M0128K532j2017
$$ y = [1275389, 1241642, 1206057, 1115731, 1017064, 940456, 841677, 737858, 634731, 587576, 540803, 487997, 433065, 403733, 367836, 362705, 326166, 275690, 295040, 266528, 279140, 227786, 251917, 272390, 272766, 356771, 363607, 362957, 357938, 340195, 338109, 335933, 293904, 323392, 401014, 476476, 526588, 514871, 432885, 383147, 328115, 320124, 287189, 279061, 276526, 313682, 338026, 309282, 334030, 369589, 370543, 304129, 265656, 221833, 201278, 192306, 145685, 162381, 185532, 204362, 191291, 142896, 137397, 198102, 195968, 214300, 284581, 302437, 169628, 146609, 155783, 160163, 182173, 199561, 215504, 209661, 214842, 156236, 119994, 145157, 126499, 75736, 55900, 116356, 133039, 176007, 225046, 242022, 219016, 192898, 171727, 145851, 115618, 183633, 223761, 226293, 214276]
8490B14276m0886P85L0060m7849o8449J1373J7616j7822l7251j2373j2629p7317
8478d0466l6552O2185O6582n049L071N937n075K9019N392j2130k1105L3815J7126
8465A02750J7428k1918Q865k5213m1909O1328J793j5276o4146R151N8153J1085
8453A02091m3625j8932N3778K3834L7401J8316J0186k8775L6286P5743k7042j3734
8441B25527j3173m190p8064j7581l5653k818j3953K9611J1371q494k5465l8674
8429B8444J5309N777Q5101L4804P348p0862m1126k61L2349j2378l3367J07J4330
8416F5575l3030L031m0666l4225J845J5636N7634K0888M0513L8344k6605j641
8404A07299J2433M3433n7959k2024j8400J7461J0266K514M7943L8893r1347j09852
$$ y = [214276, 173390, 174175, 204235, 156386, 87937, 99310, 116926, 99104, 61853, 49480, 36851, -40466, -77018, -14833, 51749, 46700, 49771, 55708, 50633, 79652, 85044, 72914, 51809, 85624, 102750, 120178, 98260, 107125, 81912, 40003, 101331, 103124, 87848, 23702, 32853, 91006, 102091, 58466, 39534, 93312, 117146, 154547, 172863, 183049, 154274, 190560, 266303, 239261, 225527, 212354, 208164, 130100, 112519, 76866, 74048, 60095, 89706, 101077, 92583, 67118, 28444, 43753, 49530, 134631, 169435, 176783, 105921, 64795, 64534, 96883, 84505, 51138, 51245, 65575, 32545, 35576, -5090, -39315, -37470, -21834, 35800, 56688, 97201, 135545, 108940, 107299, 119732, 163165, 105206, 83182, 64782, 82243, 92509, 95023, 142966, 181859, 90512, -19340]
8392a9340K302K9127K4196r53K1848N7328k7182m9698P903P6299N2127j6123n3822
8379A04012J20k608J830k6241r990p931J3827J0102L146n71K4746k6821k6466
8366E7155k6272l6171L7596J0420N672m3804j8517M2808K8171j8424K2374K4978
8354H5986k3117p4637k4403L7198M8906K546j9851Q85l533q015K8161k7823k0731
8341A572k5878o628L5170J1518J295N5176o924m3717n4799O4271M7019L88k3218
8328E5245O176L470J9596r951j2991p0520j356K9042O1213Q427l0351j2719l7515
8315G766J9046M2287o926K2946J620l9372k2633L0257n7244J1446N509k2774L977
8302d095o8840M2760L4178j4262K3305j9709O426N2720P0164k3057o836k516m6168
$$ y = [-19340, -17038, 12089, 36285, 35332, 57180, 114508, 87326, 37628, 45531, 121830, 173957, 157834, 104012, 104132, 101524, 103354, 77113, 67123, 59192, 73019, 83121, 86267, 85696, 110442, 83621, 57155, 30883, -5288, 32308, 42728, 48400, 4596, -13921, 28887, 57058, 38634, 61008, 85986, 62869, -11768, -36171, 1027, 49933, 52479, 32628, 33513, 29980, 21965, 50126, 22303, 1572, -24306, -30934, 4236, 15754, 17049, 72225, 65301, 21584, -33215, 31056, 78075, 78463, 55245, 61421, 64891, 84487, 74536, 61545, -8975, -10331, 18711, 79924, 88351, 58000, 45281, 7766, 26812, 69099, 62173, 85119, 86739, 47367, 24734, 54991, -2253, 9193, 14702, -8072, -4095, -72935, -30175, 4003, -10259, 13046, -6663, -237, 52483, 122647, 99590, 92754, 90238, 44070]
8289D4070k0121L6725k1950l9638P017K595r868j6347P4959K4258q494j157k8625
8276D3424Q272j8094K7646J7250J5871k6j9748j2652K7797M5022k8026j6404k8546
8263F1786k7797L8643O7492o728m5637k7995M0078J3188j1632J635l1566n2224
8251A9243m2182N4295K7805l3376K5011k987J4877k6007k4658m0142R849K4750
8239F478O4654J9894o5508m587L7807L9238o7441m0106k4568k875M1302j3217
8227h929l0113O4224K6338o2321J8789L9439L212L5358J3956j8827q115l1776
8215D1235k1275o166M091O193m1220k0579L5351l1347R938M6679q814J5728K2670
8202E2484J2606J7846j3005J1738j3997o73n162n340J8080j7506n5370K5132o558
$$ y = [44070, 23949, 60674, 38724, -914, 6103, 8698, -1170, -17517, 57442, 81700, 73206, 72049, 43424, 51696, 33602, 61248, 78498, 94369, 94343, 74595, 61943, 89740, 134762, 106736, 90332, 61786, 33989, 72632, 140124, 133396, 87759, 59764, 99842, 113030, 101398, 103033, 71467, 19243, -22939, 31356, 59161, 25785, 50796, 47809, 62686, 36679, 12021, -28121, -18272, 6478, 71132, 91026, 25518, 20931, 58738, 97976, 30535, -9571, -34139, -37014, 4288, -8929, -39042, 25182, 51520, -10801, 7988, 47427, 50639, 85997, 99953, 81126, 73011, 41235, 19960, 13794, 17885, 24078, -17142, -37721, -2370, -33717, -23779, 22900, 14086, 29814, 52484, 65090, 82936, 69931, 81669, 67672, 66999, 61837, 56497, 74577, 57071, 1701, 26833, 20275]
8189B0275p1256J34K192K0140l0420L3643L9856J8609K5529K6289l8953n2383
8177f345k5877R376N3984R406L5525o0140k8846J2141M3725K3602o8308j5289
8165a7046K4548N1155N1477j0070m7201q162n1095m5712R1800K7538r8418m1763
8153g2949R766L5603K7215M6186k047j8061J9998j0401p343J2197K7821j311k5847
8140D0827o520l459M6991m0347j8128J5630K3164M650p3844J4822Q922j3381O3405
8127F2732L7173l2287j3776k7862m2445k6327k579J36M8214K094Q725K099o582
8114I315J2183L32K659N5079j8827j1031M5667r198N73l2042j0346M971K1330
8101G0665J031q2443J705O594L9165J7943N7448o74m2981K2295o5364k9714M7326
$$ y = [20275, -50981, -50847, -48655, -28515, -58935, -25292, 14564, 33173, 58702, 84991, 46038, -6345, -32222, -22846, 31138, 40544, 76069, 15929, -12917, -776, 42949, 66551, -1757, -17046, 7502, 58657, 110134, 100064, 52863, 44701, -6394, -52106, 39694, 67232, -31186, -72949, -63183, -27580, -365, 45821, 43774, 25713, 45711, 35310, 27967, 40164, 67985, 66674, 40827, 34307, 30848, 77839, 37492, 19364, 34994, 58158, 62808, -11036, 3786, 12708, -673, 62732, 99905, 67618, 53842, 25980, -16465, -42792, -45371, -45235, 2979, 5073, 13798, 15897, 9315, 21498, 21830, 24489, 79568, 60741, 49710, 95377, 86179, 86752, 54710, 44364, 49335, 70665, 71696, -10747, -9042, -2448, 36717, 54660, 112108, 111434, 68453, 90748, 25384, -4330, 42996]
8088D2996N6037l659l0267o9351R237L381r21M3604J100J3558O8350l1051o9656
8075C3358O636J8833j6677n2235K4278P3057K9241L312j1258J6814m4344o3239
8063A7776K1489j1427k567R615k977M788j945l3967M0857P6778J2637o3475J4307
8050H1889J5663L3526J8289L7653N0433l8884j8781K089j6251l3998j6757j1766
8038A03105J9946o69J5120n280j6052k6408m5210O5150O2897K6341o466K0657
8026B13131K8933k569j9325O809N36l7931j7961o470k0189n5069J4216K4480l2226
8013I6365j075M0249J346k3066j8253R655L3463L7782L2753O6584J3174N5703
8001C44680q781l9372J8055K0685K2081m6727p0086p0926l8783M64P3608O3424
$$ y = [42996, 99033, 95374, 65107, -4244, 4993, 8374, 7453, 51057, 52157, 65715, 134065, 103014, 33358, 39994, 58827, 42150, -10085, 14193, 87250, 116491, 119803, 108545, 125359, 81015, 17776, 39265, 27838, 25271, 34886, 31909, 36697, 34752, 785, 41642, 118420, 131057, 67582, 81889, 97552, 131078, 149367, 187020, 237453, 198569, 179788, 181877, 165626, 131628, 114871, 103105, 123051, 122382, 137502, 132222, 116170, 89762, 44552, 109702, 172599, 198940, 192474, 213131, 242064, 239495, 220170, 226979, 227515, 189584, 171623, 165153, 144964, 89895, 104111, 128591, 96365, 95290, 135539, 136885, 113819, 95566, 105221, 138684, 176466, 209219, 275803, 288977, 344680, 335899, 296527, 314582, 335267, 357348, 310621, 240535, 169609, 130826, 131290, 204898, 268322]
7989B68322M2503r36l2792j846P067n9887m0322L0017J2286m0458n0953j9011
7977A13990k4859K3202m378P424J6341k1642L5345M6363j8161k7595l3545K0168
7965A32653Q6971N8131K4821O092K949L3718n362j2812n3042n5972K0643Q8010
7953C26800k3308k1427J5346M5286l9904k6047m871k5810o9304m6179o934K0111
7941A43759M8182N3081m8402n8687l721m3608O822J7841L8064q935M5417n133
7929A84680J5741l8282p0644k0558k261o281Q007j2614L4394M7327L1536Q881
7917A79926n3706K1145L8656L0898p479m42J6213m1412m5827j4370l1677n7293
7905C4632l60L524m1947P377K7399N4725P6689k032p0295j2360k8151K4445M7317
$$ y = [268322, 310825, 309889, 277097, 275251, 282318, 222431, 182109, 212126, 224412, 183954, 133001, 113990, 89131, 112333, 107955, 115379, 131720, 110078, 145423, 191786, 173625, 146030, 112485, 132653, 219624, 277755, 302576, 308668, 311617, 345335, 339973, 327161, 274119, 218147, 238790, 326800, 303492, 282065, 297411, 342697, 302793, 276746, 271875, 246065, 176761, 130582, 123648, 143759, 191941, 245022, 196620, 137933, 134212, 90604, 97426, 115267, 153331, 144396, 189813, 184680, 200421, 162139, 91495, 70937, 68676, 62395, 70402, 57788, 92182, 139509, 171045, 179926, 126220, 147365, 186021, 216919, 209440, 208998, 225211, 183799, 137972, 123602, 91925, 34632, 34272, 37796, -4151, 3226, 30625, 85350, 162039, 160007, 89712, 77352, 49201, 73646, 120963]
7892A20963k8490J7853k3971l3072L2403J4252K220J417J4470K1251P682N495
7880A52473M7244n6719r0309k6067J0041N8577L1417j6852r5780L8786p658j2906
7868C2247P5945k0435q9158J6641O3876N4783m723q9462r5791n5836O5237M5838
7856h38j662m096J1726L4308o3903P203K1416M1364J617j7151l7581M530j383
7843d450Q514N5709J876j5995J6897J9791J4997k8409j0731N905k9506n7686p68
7830b3856K8212k7817j4701K1592l7681J0468O4092M8053m4166l3883L0612N562
7818B6487K8803K6746m3440l0764R752l9108J3013K5280J0222n3329J8686P5031
7806F7379m9120M0942K7979K260k7160j3854l7461p316L9797O381N1177P03n993
$$ y = [120963, 92473, 110326, 86355, 53283, 85686, 99938, 102158, 103575, 118045, 139296, 146978, 152473, 199717, 142998, 52689, 26622, 36663, 95240, 126657, 109805, 14025, 52811, 45153, 32247, 108192, 87757, -1401, 15240, 79116, 133899, 129176, 39714, -56077, -111913, -46676, -838, -2500, -6596, 5130, 39438, -24465, -17262, 4154, 45518, 47135, 29984, -7597, -3067, -4450, 4064, 59773, 61649, 45654, 62551, 82342, 97339, 68930, 58199, 64104, 34598, -23088, -23856, 4356, -23461, -38162, -16570, -54251, -43783, 20309, 68362, 24196, -9687, 20925, 26487, 55290, 82036, 38596, 7832, 17584, -21524, -8511, 16769, 26991, -26338, -7652, 67379, 18259, 59201, 87180, 89440, 62280, 48426, 10965, 3649, 43446, 49827, 101004, 101707, 95714]
7793I5714j2137m6571j9962j3451j555K551j6870J2708l8089J52K6195L2745K5920
7780D7350m9739J815n175J0326l7001J8277j2227N2750M476m5015j4702j2872
7768d1737l696N0761k2708q875O0477J7166n181m0335P201K7839j0541J608K7502
7755E9481L9171j6937l3859L340l236l1730L2679Q306k7987l6430m3167r807M8318
7742a1858j5944l433m578R497r985K582Q280l1451L2112K9105j4643j6693k1345
7729d8354N0676N9718l4399J503k3551k1360j9868J4808J6109N407k1308K25k2118
7716d2512n2913o490M5974L4575K8979o2347k7727M7463O789p7259m553K7670
7704h2351J5922J9541M8781q466j3382o993k9581K3420K8091k783j3602p655K9945
$$ y = [95714, 83577, 37006, 17044, 3593, 2038, 4589, -12281, 427, -37662, -37510, -11315, 21430, 47350, -2389, -574, -5749, 4577, -32424, -14147, -26374, 26376, 30852, -14163, -28865, -41737, -45433, 5328, -17380, -26255, 34222, 51388, 46207, 5872, 13073, 40912, 30371, 31979, 59481, 98652, 81715, 47856, 51196, 47960, 16230, 48909, 57215, 29228, -7202, -50369, -60176, -11858, -27802, -31235, -35813, -26316, -36301, -33719, -25439, -56890, -24778, 4327, -10316, -27009, -48354, 2322, 62040, 27641, 29144, 5593, -15767, -35635, -20827, -4718, 689, -20619, -20394, -42512, -95425, -101915, -55941, -21366, 7613, -54734, -82461, -34998, -28209, -105468, -110021, -82351, -66429, -46888, 1893, -6573, -19955, -26948, -56529, -33109, -5018, -7801, -21403, -29058, 887]
7691H87j7939k7887l39l0934L0948Q966L5360k3952q5884j9632O4350P1571m69
7678E046o799l3007k3132j5366N3128m343L3451L0360p006l8406K5631L1116j1950
7665C8723J4647k3208l1182J1927J4943p0359k0094o5j2645r120K5424M9095J2009
7652I5j0346M432K789j6359l2602L0652M4189K0030Q988J4316k914L3584j06079
7639i225l0079J8509R585l0312J322o9675l8438r878p12L6015L1419J2602P0189
7626h678M0094K2140j1712J8739L1966k1452m6712j6655p2464r689P0894K3509
7614A9980k3667l5883j1359j2316J058K6457J8032K2073m4138o5866O3356J6151
7602b6122j4798k007m0479J2796L6437o0924k1836O2361L7280p7Q795J6171K019
$$ y = [887, -17052, -44939, -45278, -76212, -45264, -36298, -938, -24890, -110774, -130406, -66056, 5515, 5046, -1753, -34760, -57892, -73258, -20130, -24473, 8978, 39338, 32332, -6074, 19557, 50673, 38723, 53370, 30162, -1020, 10907, 25850, -44509, -64603, -64668, -77313, -86433, -61009, -11914, 95, -10251, -5819, -3030, -19389, -51991, -21339, 22850, 42880, 51868, 66184, 63270, 96854, -9225, -39304, -20795, -11210, -41522, -40200, -109875, -148313, -158191, -158903, -122888, -91469, -78867, -8678, 31416, 53556, 41844, 60583, 92549, 71097, 24385, 7730, -64734, -74423, -3529, 19980, -3687, -39570, -50929, -63245, -62187, -35730, -17698, 4375, -39763, -105629, -42273, -26122, -40920, -42927, -83406, -70610, -34173, -95097, -116933, -54572, -17292, -17369, -8574, 7597, 9616]
7589I616K1275K8971J2915k2371j6566n280l8993k2806M1171K9359k1236k6539
7577a0484j3796m6024r584P1248O2518o5340n6179l9315j5366J8261N7670Q5358
7565C8967M8591L3509o556l6911o7276l0897l3207k7066j1200M734J0382j4080
7553i1010n78J7784J3783J2215l5094q927K5943O7L104n397K4017K9027N037n6211
7539f6240l1311j6342M6906J3420j1946K4735J9843m661L9253N9371K8821K047
7527A03896l1893M280J1636J4764l309m6142k8971j4729j8691j5438j597n932
7515c2126K8010M4596k1925m8350J0836M628r192n085o7936j80K3770L1883N1166
7502A0095r654J7798J707Q809q408o843O0195l5497l8112J0541L4364J0503l7137
$$ y = [9616, 30891, 59862, 72777, 50406, 33840, 28560, -10433, -33239, 7932, 37291, 16055, -10484, -24280, -70304, -79888, -8640, 53878, -11462, -67641, -106956, -122322, -104061, -46391, 38967, 87558, 121067, 114511, 77600, 10324, -20573, -53780, -80846, -92046, -87312, -76930, -91010, -91588, -73804, -60021, -47806, -82900, -91827, -65884, -65817, -62713, -68110, -44093, -15066, -10029, -66240, -97551, -113893, -66987, -53567, -65513, -40778, -20935, -25596, 13657, 73028, 101849, 103896, 72003, 76283, 87919, 102683, 99374, 53232, 24261, 9532, -9159, -24597, -26194, -32126, -4116, 40480, 18555, -29795, -18959, -14331, -23523, -28608, -96544, -96724, -72954, -41071, 10095, 441, 18239, 19946, 28755, 20347, 13504, 73699, 38202, 90, 10631, 44995, 55498, 18361]
7489A8361l3497k4303L1206K2492J8417k2714k9137m6221N816M4044N825l9034
7477d8745k4852J1038L3356J2822L5647N1794L6824j6777p3919l0237N5662M7584
7465I0197m0958n0964p7849k2212M5496K2327L790K8625M8194j998p6658k2625
7453e4635m34R828M475M1858R64l3405k5732Q398M3944M401l21K7275M0252M796
7439G1664l9560m2408M8158L7742L4938k353p6420r4208L5832p459p5l9670k6758
7426a00577J5921K6514K3710K3382O867r1300j5107Q7951j768J5498N759k2243
7414b5393k480J5226j1481j4004j9879j7324q713N4864J2556L1041k1026o8997
7402g5610K7279J7925j4882m187M1691M6368K162m5767l3212M2784k952n5799
$$ y = [18361, -15136, -39439, -8233, 14259, 32676, 9962, -19175, -65396, -59580, -15536, -9711, -48745, -73597, -62559, -29203, -16381, 19266, 71060, 107884, 91107, 17188, -13049, 42613, 90197, 49239, -1725, -79574, -101786, -56290, -33963, -30173, -1548, 46646, 44648, -32010, -54635, -55069, -45241, -40766, 1092, 2056, -31349, -57081, -48683, -4739, -338, -659, 26616, 66868, 71664, 32104, -10304, 37854, 75596, 110534, 108181, 31761, -62447, -26615, -34074, -34149, -73819, -100577, -84656, -58142, -34432, -11050, -4183, -95483, -110590, -22639, -24407, -8909, -3150, -25393, -27873, -12647, -24128, -38132, -58011, -75335, -84048, -29184, -16628, 14413, -6613, -75610, -48331, -30406, -45288, -49475, -7784, 38584, 40746, -5021, -38233, 4551, 1599, -54200]
7390e4200L5785M3488r87k3129o4043O820O584K2124o6441P27R2071R262n8512
7377e0451o3852K5401K3270q852P982K0322p13Q376K0602j7552j6315O8371L2715
7364D9304J4970k0650K734K3272l0621J3562N143j8927l6126K1259J6252o963
7352C3209j7550k6541j2054N2756j5093k0722J5045M94J6881J7117M734K4957
7340G3233n2530l5282j5406m882N7849L8167K6158q260j4643m4404j4492l8869
7328c3361j095j3838K2172O249l3642n2889L3078K9085K1692j8640k2298k9275
7316i2762k3397O158K8967O8691O2666m8704j6521M7401m3231p5414k2135L6268
7304g2013N156L9748j0355k5117J8404j2772n8521q988J5976K317O9845L9228
$$ y = [-54200, -18415, 25073, 24086, 957, -63086, -56266, -49682, -27558, -93999, -93272, -1201, 8061, -50451, -114303, -88902, -65632, -74484, -66502, -46180, -46893, -38517, -17915, -35467, -51782, 16589, 49304, 64274, 43624, 46358, 69630, 39009, 52571, 57714, 38787, 2661, 23920, 40172, 33209, 15659, -10882, -22936, 29820, 14727, -5995, 9050, 9544, 26425, 43542, 48276, 73233, 20703, -14579, -29985, -34867, 22982, 61149, 87307, 79047, 64404, 20000, 5508, -33361, -34456, -48294, -26122, -19873, -53515, -106404, -73326, -44241, -22549, -41189, -63487, -92762, -116159, -110001, -81034, -12343, 50323, 1619, -14902, 32499, -10732, -86146, -108281, -72013, -66857, -27109, -37464, -62581, -44177, -56949, -115470, -124458, -108482, -106165, -36320, 2908]
7292B908L4914n3583l3584j988j8172K3845P683Q19n622K9724q918k5201p611
7279e4786N7127L1802n3307l0619p409l9572K6057K8676l7074j9810j4331J19795
7267F549P8553k1730n3350M0800K946q3761k9186P0656N4579o39k4046j2382l2682
7254c693k2541J1737L6548K3126m9251o937m9862K8455L5435M644l1849l3846
7242e8034k9704N517K514O7180J294l3590j2174m5148r996O0131O38j8237n32
7229g0141j9330n147M2869M3068L7866K6723l0957J9762R394Q182l7707l9019
7217a4437N3787J7441j9128K952L9249O087N853l8751j2205k6187l7191j8296
7205d0826L9086K0083M7743l4567j2730L3453j0131l0529j8200J9588O7480J7191
$$ y = [2908, 37822, -15761, -49345, -51333, -69505, -45660, -37977, -37158, -42780, -13056, -21974, -47175, -54786, 2341, 34143, -19164, -49783, -57192, -96764, -70707, -42031, -79105, -98915, -113246, 6549, 85102, 63372, 10022, 50822, 53768, -29993, -59179, 11477, 66056, 65417, 41371, 28989, -3693, -26234, -14497, 22051, 45177, -4074, -11011, -60873, -32418, 3017, 7661, -24188, -58034, -87738, -82221, -79707, -12527, -11233, -44823, -56997, -102145, -112141, -52010, -51372, -69609, -70141, -89471, -94618, -51749, -8681, 29185, 55908, 24951, 44713, 54107, 62289, 24582, -14437, 39350, 56791, 37663, 40615, 79864, 85951, 91804, 53053, 40848, 14661, -22530, -40826, -1740, 18343, 66086, 31519, 18789, 52242, 42111, 11582, -6618, 12970, 80450, 97641]
7193I7641K93k5062l2082J3220P8618K0797m1480o2869l2439j5399j822N102m8294
7180d3776q9004j3080R8152L6475k1641Q847M1161K4083r174l4654N711O376m2248
7167c2772l9192j6889J0810l2809M6272J0237J5281M4677K4555j4146l7911m4450
7155f6337L3931N9512M2546n8028j1864L1161N2651K9420n8782o690k3463o6158
7143d2101j5762N0712j4007k7069k4235p43K8034n139M422J5907m217n3089J8872
7130f8415L7438l6370n7364M3119O2729M3465L88k2849K6087J657p8124r2454
7118a40693l3920L5873j4510k869n430K9074M5282K1307m9768l8134p350k6279
7106a87417M9186P7649N9309N616k536l6393K3143J902l6962n0947L1653M7504
$$ y = [97641, 97934, 72872, 40790, 54010, 132628, 153425, 111945, 49076, 16637, 1238, -584, 4518, -43776, -132780, -145860, -47708, -11233, -32874, -24027, 17134, 41217, 32043, -2611, 3100, 9476, -32772, -71964, -88853, -78043, -110852, -64580, -54343, -39062, 5615, 30170, 16024, -21887, -66337, -32406, 27106, 69652, 11624, -240, 30921, 83572, 112992, 54210, 47520, 24057, -42101, -57863, -7151, -21158, -48227, -72462, -73205, -45171, -50310, -45888, -29981, -34198, -87287, -68415, -30977, -67347, -124711, -81592, -18863, 24602, 24990, 2141, 28228, 29885, -48239, -140693, -174613, -138740, -153250, -156119, -161549, -132475, -87193, -65886, -115654, -153788, -161138, -187417, -138231, -60582, -1273, 4343, 1807, -34586, -11443, -9541, -46503, -97450, -65797, -18293]
7094a8293l3956m4551n7230j6739M9788k3944j4934R0964K5584o4070N538l748
7082a05591j3611M0758J3762k3946N459k8313k2518K7186L7547l631M9620J4603
7070h675n3666k0589K2034M2559L1144n788o5420P253k7938q0298L8827P7017
7058d3540R930p7700l3399l9768L4851J2756J7322L7310J9320Q2500j6396l345
7046a59K2991j2875k6177m1225l9218m8971K2352P2168L7018k395l6711m6320
7034i9522L4447L8302m2863o5692q087P9609R2951L2510L6696Q354m2585j0144
7022E3976j8138o9434k7953M872o858K2650N4504K5783R146r232l5138k4272J9173
7009i21K6430L362K376M644o773l3509p4097k0386j6768L9141N0234l1751p477
$$ y = [-18293, -52249, -96800, -154030, -170769, -120981, -144925, -159859, -68895, -43311, -107381, -101843, -105591, -119202, -78444, -64682, -88628, -83169, -111482, -134000, -106814, -69267, -72898, -23278, -8675, -62341, -82930, -60896, -18337, 12807, 7019, -58401, -51148, -79086, -159384, -120557, -43540, -33610, -111310, -144709, -184477, -149626, -136870, -119548, -82238, -62918, 19582, 3186, -159, 22832, 9957, -16220, -57445, -96663, -145634, -123282, -51114, -14096, -16491, -53202, -99522, -65075, -26773, -69636, -135328, -143415, -63806, 29145, 61655, 98351, 106705, 64120, 53976, 35838, -33596, -61549, -56677, -63535, -40885, 13619, 39402, 48548, 39316, 4178, -20094, -921, 25509, 28871, 31247, 35891, 29118, -4391, -78488, -98874, -115642, -76501, -26267, -58018, -65495]
6996f5495M4480M2093r091R130J5918K0140J8150k5510j3434L9311k7162n4947
6984f417k9994L423N9120j177p416M985k7611l2624L1350l026Q733O533l192J4587
6970A7274r944k6672k6226J3806O043L139m5805l6195K7145K8277n5672j4095
6958a18925K7358M5991J5721P066L1361j1114q7057j5517L5517K9252j7625Q041
6946d9931N7824N3810L5035n6464o4579N095k7104k2744j4162l0522l5031M5018
6934a03755L9328L5054m946J2321p047M5112J2487o6170j7656J4207j3669r001
6922f3735J7797L2685k4467j2762J7953L2347L4573M5904m7966k773m2894q263
6910b1601L0779K5723p8707J330O653K0850P1217m0792m9549J8356J7188p236
$$ y = [-65495, -21015, 21078, 11987, 21117, 37035, 57175, 75325, 49815, 36381, 75692, 48530, -6417, -36411, -32988, 26132, 24955, 17539, 22524, -5087, -37711, -6361, -9387, -654, 5879, 2687, 17274, 7330, -19342, -45568, -31762, -25719, -22580, -68385, -104580, -77435, -49158, -104830, -118925, -91567, -45576, -29855, -22789, 8572, -2542, -89599, -105116, -69599, -40347, -57972, -49931, 7893, 61703, 96738, 40274, -24305, -19210, -46314, -69058, -83220, -113742, -148773, -103755, -64427, -29373, -34319, -21998, -29045, 16067, 28554, -37616, -55272, -41065, -54734, -63735, -45938, -13253, -37720, -50482, -32529, -182, 34391, 80295, 32329, 29556, -13338, -21601, 9178, 34901, -43806, -42476, -35823, -14973, 56244, 15452, -34097, -15741, 1447, -5789]
6898e789l9970j0759K0881P749k7329o8078j8909L894l371J2363M608K7430o525
6885a03805M3279J2495J8968O745m2780K4163P7374l9148r9870p1771K672P9287
6873i2391N8294M3985o062m0385J6764L1946j5555L0697N3143L0311o5119j6450
6861B9178P922k9215o923l41R662k1184p796o7636q430p652k2755K6114O246M5085
6847d7725M9706l7718n640j172J1011L6849R947n978n879p5357q683p244M077
6834h3806k255m1267n211M0858M5538K1634N324k9247n5502R309R058J3591R932
6821f2044L4454N6698M3850K7190K887n5471n7064l7350J282J1285K8828L5778
6809C0323k2415K5667l2357J2232L6989j3852n3233k8742j2644k0883k5211j9207
$$ y = [-5789, -45759, -56518, -35637, -27888, -55217, -123295, -142204, -138310, -141681, -129318, -124710, -97280, -103805, -60526, -48031, -29063, -22318, -65098, -40935, 36439, -2709, -102579, -174350, -171678, -92391, -34097, 9888, 3826, -36559, -19795, 12151, -3404, 27293, 80436, 110747, 45628, 29178, 37100, 7885, 962, 621, 10283, -10901, -18697, -86333, -94763, -102415, -125170, -99056, -92810, -47725, 1981, -35737, -41377, -42549, -31538, 5311, 15258, 9280, 3401, -71956, -80639, -87883, -83806, -86061, -127328, -132539, -91681, -46143, -24509, -19185, -48432, -103934, -94625, -85567, -71976, -62044, -27590, 29108, 72958, 100148, 103035, 47564, -9500, -46850, -45568, -34283, -5455, 30323, 7908, 33575, 1218, 13450, 50439, 36587, -16646, -45388, -58032, -78915, -104126, -123333]
6797a23333L8459N9331K6038k6364j8404J687P0665M7005l6702l0445n2337M2601
6785a799o91J5114k5429m1073m0389l2807K1572l118O7436P8585m2219m9810k4744
6772g9372K918k1600J4232O4964M915m9884l1999K1257n6463K5384K0853M416
6760h0379J5736J7937M9962K394j9690l3378j8355N3349J2300k3661K4931k5758
6748b4612k4983P3995N3179j0714J0384n1063m8286j7833n5139q200M5522p465
6736f5215j0990K7557J7966O7350M725J5684N3328l8537m7037J5539M0943K7004
6724A08317N175K7970J7730N5679O6447O4965J59993J58463j2212j64262j48949
6713C39316j17024p9059Q529m7834p2610m7390j0115m5011M5001N8054J2817l5086
$$ y = [-123333, -84874, -25543, 495, -25869, -44273, -42586, 28079, 75084, 38382, 7937, -44400, -1799, -2490, 12624, -12805, -53878, -94267, -127074, -105502, -108620, -41184, 37401, -4818, -54628, -79372, -76454, -98054, -83822, -18858, -13943, -63827, -95826, -74569, -131032, -105648, -84795, -80379, -64643, -46706, 3256, 5650, -14040, -47418, -65773, -12424, -124, -23785, 1146, -24612, -49595, 24400, 77579, 66865, 77249, 26186, -22100, -39933, -95072, -103272, -57750, -65215, -76205, -48648, -30682, 36668, 41393, 57077, 110405, 71868, 24831, 40370, 81313, 108317, 113492, 141462, 159192, 214871, 281318, 346283, 506276, 664739, 652527, 488265, 339316, 222292, 143233, 151762, 103928, 31318, -16072, -26187, -71198, -26197, 31857, 44674, 9588]
6701I588N4017L5079n2275k1735O807j1191J0654j3046j6335j7925M521L806N470
6688b565l7950k9638J3386k618p960j4639P808K0416L7267p769N3104M7727q115
6675F8454n2610n2642Q995K7756j6490L2065L6010p263L1024K6149M662o618o5251
$$ y = [9588, 63605, 98684, 46409, 24674, 31481, 20290, 30944, 17898, 1563, -16362, -11841, -8035, -2565, -40515, -70153, -56767, -59385, -67345, -81984, -74176, -53760, -16493, -24262, 28842, 76569, 68454, 15844, -36798, -27803, -47, -16537, 15528, 51538, 44275, 75299, 101448, 106110, 99492, 34241]
$$ [...]
##END NTUPLES=NMR SPECTRUM
##END=
