##TITLE=Analysis number 329243
Compound Code cc 62313
Book Reference 464/172/8
Project Code adrs
Chemist Name chrisr
##JCAMPDX= 6.0         $$ Bruker NMR JCAMP-DX V2.0
##DATA TYPE= NMR SPECTRUM
##DATA CLASS= NTUPLES
##ORIGIN= Bruker BioSpin GmbH
##OWNER= nmr
$$ XWIN-NMR		Version 3.5
$$ Tue Aug 14 11:10:00 2007 GMT Daylight Time (UT+1h)  MAYBRIDGE\nmr@NMR_250MHZ
##.OBSERVE FREQUENCY= 250.131544655141
##.OBSERVE NUCLEUS= ^1H
##.ACQUISITION MODE= SIMULTANEOUS (DQD)
##.ACQUISITION SCHEME= undefined
##.AVERAGES= 16
##.DIGITISER RES= 18
##SPECTROMETER/DATA SYSTEM= dpx250
##.PULSE SEQUENCE= zg30
##.SOLVENT NAME= CDCl3
##.SHIFT REFERENCE= (INTERNAL, CDCl3, 0, 16.522)
##AUDIT TRAIL= $$ (NUMBER, WHEN, WHO, WHERE, WHAT)
$$ ##TITLE= Audit trail, XWIN-NMR		Version 3.5
$$ ##JCAMPDX= 5.01
$$ ##ORIGIN= Bruker BioSpin GmbH
$$ ##OWNER= nmr
$$ C:\u/data/dgb/nmr/ADRS/610/pdata/1/auditp.txt
$$ ##AUDIT TRAIL=  $$ (NUMBER, WHEN, WHO, WHERE, WHAT)
(   1,<2007-08-14 11:09:31.73 +100>,<MAYBRIDGE\nmr>,<NMR_250MHZ>,
      <created by zg, POWCHK disabled, PULCHK disabled
       configuration hash MD5:
       76 6E 9A 78 1E 09 19 81 EC 84 63 8F B0 6A 59 2D
       data hash MD5: 64K
       8A 73 95 06 36 4E D4 12 B3 D1 86 0D 80 EE 18 79>)
(   2,<2007-08-14 11:09:46.78 +100>,<MAYBRIDGE\nmr>,<NMR_250MHZ>,
      <Start of raw data processing
       ef LB = 0.3 FT_mod = 6 PKNL = 1 SI = 32K 
       data hash MD5: 32K
       27 4A DB 18 66 4C B0 FB AA BC EC DA 7E E1 B6 0D>)
(   3,<2007-08-14 11:09:48.53 +100>,<MAYBRIDGE\nmr>,<NMR_250MHZ>,
      <apk 
       data hash MD5: 32K
       8B 99 61 5D D5 86 54 F4 62 C4 30 F3 6E 0D E7 A4>)
(   4,<2007-08-14 11:09:49.47 +100>,<MAYBRIDGE\nmr>,<NMR_250MHZ>,
      <abs ABSG = 5 
       data hash MD5: 32K
       69 15 85 17 CB 18 F3 3D B3 64 00 EE 68 DC 7A 81>)
$$ ##END=
$$ 
$$ hash MD5
$$ 4A F3 14 D3 C8 FC 21 41 DE 10 A7 FD 70 0A 9D BF
##$RELAX= 
##$RELAX= 
##$RELAX= 
##$RELAX= 
##$RELAX= 
##$RELAX= 
##$RELAX= 
$$ Bruker specific parameters
$$ --------------------------
##$DU= <C:\u>
##$EXPNO= 610
##$NAME= <ADRS>
##$PROCNO= 1
##$TYPE= <nmr>
##$USER= <dgb>
##$AMP= (0..31)
100 100 100 100 100 100 100 100 100 100 100 100 100 100 100 100 100 100 
100 100 100 100 100 100 100 100 100 100 100 100 100 100 
##$AQSEQ= 0
##$AQ_mod= 3
##$AUNM= <au_zg>
##$AUTOPOS= <13 >
##$BF1= 250.13
##$BF2= 250.13
##$BF3= 250.13
##$BF4= 250.13
##$BF5= 500.13
##$BF6= 500.13
##$BF7= 500.13
##$BF8= 500.13
##$BYTORDA= 1
##$CFDGTYP= 0
##$CFRGTYP= 5
##$CHEMSTR= <none>
##$CNST= (0..31)
1 1 145 1 1 1 1 1 1 1 1 1 1 1 1 1 1 1 1 1 1 1 1 1 1 1 1 1 1 1 1 1 
##$CPDPRG= <>
##$CPDPRG1= <>
##$CPDPRG2= <>
##$CPDPRG3= <>
##$CPDPRG4= <mlev>
##$CPDPRG5= <mlev>
##$CPDPRG6= <mlev>
##$CPDPRG7= <mlev>
##$CPDPRG8= <mlev>
##$CPDPRGB= <>
##$CPDPRGT= <>
##$D= (0..31)
0 1 0 0 0 0 0 0 0 0.06 0 0 0 0 0 0 0.0002 0 0 0 0 0 0 0 0 0 0 0 0 0 0 
0 
##$DATE= 1187086170
##$DBL= (0..7)
120 120 120 120 120 120 120 120 
##$DBP= (0..7)
150 150 150 150 150 150 150 150 
##$DBP07= 0
##$DBPNAM0= <>
##$DBPNAM1= <>
$$ [...]
##$SUBNAM7= <"">
##$SUBNAM8= <"">
##$SUBNAM9= <"">
##$SW= 20.6930455092707
##$SWIBOX= (0..15)
0 0 3 0 0 0 0 0 0 0 0 0 0 0 0 0 
##$SW_h= 5175.983436853
##$TD= 65536
##$TD0= 1
##$TE= 297.16
##$TE2= 300
##$TE3= 300
##$TEG= 300
##$TL= (0..7)
0 120 120 120 120 120 120 120 
##$TP= (0..7)
150 150 150 150 150 150 150 150 
##$TP07= 0
##$TPNAME0= <>
##$TPNAME1= <>
##$TPNAME2= <>
##$TPNAME3= <>
##$TPNAME4= <>
##$TPNAME5= <>
##$TPNAME6= <>
##$TPNAME7= <>
##$TPOAL= (0..7)
0.5 0.5 0.5 0.5 0.5 0.5 0.5 0.5 
##$TPOFFS= (0..7)
0 0 0 0 0 0 0 0 
##$TUNHIN= 0
##$TUNHOUT= 0
##$TUNXOUT= 0
##$USERA1= <user>
##$USERA2= <user>
##$USERA3= <user>
##$USERA4= <user>
##$USERA5= <user>
##$V9= 5
##$VALIST= <valist>
##$VCLIST= <CCCCCCCCCCCCCCC>
##$VD= 0
##$VDLIST= <DDDDDDDDDDDDDDD>
##$VPLIST= <PPPPPPPPPPPPPPP>
##$VTLIST= <TTTTTTTTTTTTTTT>
##$WBST= 1024
##$WBSW= 4
##$XGAIN= (0..3)
0 0 0 0 
##$XL= 0
##$YL= 0
##$YMAX_a= 456077
##$YMIN_a= -645279
##$ZGOPTNS= <>
##$ZL1= 120
##$ZL2= 120
##$ZL3= 120
##$ZL4= 120
##$ABSF1= 16.522
##$ABSF2= -4.171173
##$ABSG= 5
##$ABSL= 3
##$ALPHA= 0
##$AQORDER= 0
##$ASSFAC= 0
##$ASSFACI= 0
##$ASSFACX= 0
##$ASSWID= 0
##$AUNMP= <proc_1d>
##$AZFE= 0.1
##$AZFW= 0.1
##$BCFW= 0
##$BC_mod= 0
##$BYTORDP= 0
##$COROFFS= 0
##$CY= 12.5
##$DATMOD= 1
##$DC= 0
##$DFILT= <>
##$DTYPP= 0
##$F1P= 14.0000005364418
##$F2P= -0.99999901652339
##$FCOR= 0.5
##$FTSIZE= 32768
##$FT_mod= 6
##$GAMMA= 0
##$GB= 0
##$INTBC= 1
##$INTSCL= 1
##$ISEN= 128
##$LB= 0.3
##$LEV0= 0
##$LPBIN= 0
##$MAXI= 10000
##$MC2= 0
##$MEAN= 0
##$ME_mod= 0
##$MI= 0
##$NCOEF= 0
##$NC_proc= -2
##$NLEV= 6
##$NOISF1= 0
##$NOISF2= 0
##$NSP= 0
##$NTH_PI= 0
##$NZP= 0
##$OFFSET= 16.522
##$PC= 1
##$PHC0= 158.6779
##$PHC1= 8.442768
##$PH_mod= 1
##$PKNL= yes
##$PPARMOD= 0
##$PSCAL= 4
##$PSIGN= 0
##$REVERSE= no
##$SF= 250.13
##$SI= 32768
##$SIGF1= 0
##$SIGF2= 0
##$SINO= 400
##$SIOLD= 32768
##$SREGLST= <1H.CDCl3>
##$SSB= 0
##$STSI= 32768
##$STSR= 0
##$SW_p= 5175.98343685301
##$SYMM= 0
##$S_DEV= 0
##$TDeff= 65536
##$TDoff= 0
##$TI= <Analysis number 999999
Compound Code 99
Book Reference 9
Project Code 9>
##$TILT= no
##$TM1= 0
##$TM2= 0
##$TOPLEV= 0
##$USERP1= <user>
##$USERP2= <user>
##$USERP3= <user>
##$USERP4= <user>
##$USERP5= <user>
##$WDW= 1
##$XDIM= 32768
##$YMAX_p= 514014579
##$YMIN_p= -85585
$$ End of Bruker specific parameters
$$ ---------------------------------
##NTUPLES= NMR SPECTRUM
##VAR_NAME=  FREQUENCY,     SPECTRUM/REAL,   SPECTRUM/IMAG
##SYMBOL=    X,             R,               I
##VAR_TYPE=  INDEPENDENT,   DEPENDENT,       DEPENDENT
##VAR_FORM=  AFFN,          ASDF,            ASDF
##VAR_DIM=   32768,         32768,           32768
##UNITS=     HZ,            ARBITRARY UNITS, ARBITRARY UNITS
##FACTOR=    0.157963299565203, 1,           1
##FIRST=     4132.6476996994, 0,             0
##LAST=      -1043.33573715361, 0,           0
##MIN=       -1043.33573715361, -85585,      0
##MAX=       4132.6476996994, 514014579,     0
$$ Real data points
##PAGE= N=1
##DATA TABLE= (X++(R..R)), XYDATA
$$ [...]
##PAGE= N=2
##DATA TABLE= (X++(I..I)), XYDATA
$$ plain form
18052 -1831040 -1812151 -1792300 -1771957 -1752403 -1735549 -1715171 -1697808 -1685885 -1670392 -1650856 -1634817
18041 -1634817 -1617413 -1602689 -1592699 -1579377 -1565261 -1551303 -1538576 -1522511 -1503788 -1489973 -1479401
18030 -1479401 -1467729 -1456271 -1447346 -1433781 -1420647 -1408645 -1395870 -1384982 -1373511 -1361243 -1344737
18019 -1344737 -1321857 -1314089 -1313339 -1300272 -1287106 -1273445 -1259775 -1250210 -1245279 -1237726 -1224730 -1218383 -1208272
18006 -1208272 -1196905 -1183603 -1170593 -1165629 -1155987 -1144332 -1129471 -1122064 -1116677 -1107062 -1097565 -1087399
17994 -1087399 -1079403 -1071755 -1063277 -1054079 -1045288 -1033231 -1024908 -1016769 -1003882 -999180 -991576 -981715 -973434
17981 -973434 -970281 -967401 -966388 -960012 -948431 -934263 -925022 -920375 -917922 -916228 -909817 -902633 -900092 -893197
17967 -893197 -882907 -878298 -875918 -869233 -861398 -853358 -848965 -842963 -837081 -829254 -820230 -810407 -803798 -797090
$$ packed form
18052a831040J8889J9851K0343J9554J6854K0378J7363J1923J5493J9536J6039
18041a634817J7404J4724R990J3322J4116J3958J2727J6065J8723J3815J0572
18030a479401J1672J1458Q925J3565J3134J2002J2775J0888J1471J2268J6506
18019a344737K2880P768P50J3067J3166J3661J3670R565M931P553J2996O347J0111
18006a208272J1367J3302J3010M964R642J1655J4861P407N387R615R497J0166
17994a087399P996P648Q478R198Q791J2057Q323Q139J2887M702P604R861Q281
17981i73434L153K880J013O376J1581J4168R241M647K453J694O411P184K541O895
17967h93197J0290M609K380O685P835Q040M393O002N882P827R024R823O609O708
$$ plain form
17953 -797090 -787979 -778878 -771363 -765411 -761014 -756318 -749590 -744389 -742025 -735470 -725352 -720413 -713047 -711150
17939 -711150 -706954 -700537 -699548 -698094 -692212 -684089 -675534 -670257 -666889 -663643 -660287 -655813 -649859 -645814
17925 -645814 -636996 -628757 -620828 -619676 -616394 -610075 -606273 -602482 -598447 -592215 -587228 -581312 -578140 -572954
17911 -572954 -571442 -563750 -560295 -562441 -556667 -552852 -551226 -547110 -539508 -534088 -528319 -518872 -517533 -517024
17897 -517024 -510952 -501390 -496835 -492220 -489305 -492417 -488606 -485053 -480736 -474931 -472422 -464416 -455344 -455377 -457572
17882 -457572 -456947 -455045 -451679 -448998 -443606 -438606 -433478 -429644 -418750 -412772 -410761 -402408 -397353 -400882
17868 -400882 -401849 -399488 -395952 -392189 -382080 -379167 -378841 -374787 -372883 -368448 -362174 -360134 -359508 -349729 -345656
17853 -345656 -346042 -341668 -339210 -340584 -337619 -329701 -326099 -322840 -317552 -313728 -309085 -305071 -306493 -303180
$$ packed form
17953g97090R111R101P515N952M397M696O728N201K364O555J0118M939P366J897
17939g11150M196O417R89J454N882Q123Q555N277L368L246L356M474N954M045
17925f45814Q818Q239P929J152L282O319L802L791M035O232M987N916L172N186
17911e72954J512P692L455k146N774L815J626M116P602N420N769R447J339N09
17897e17024O072R562M555M615K915l112L811L553M317N805K509Q006R072l3k195
17882d57572O25J902L366K681N392N000N128L834J0894N978K011Q353N055l529
17868d00882r67K361L536L763J0109K913L26M054J904M435O274K040O26R779M073
17853c45656l86M374K458j374K965P918L602L259N288L824M643M014j422L313
$$ plain form
17839 -303180 -295291 -290905 -288259 -286629 -280093 -275675 -277187 -277770 -278298 -274667 -270344 -264511 -260095 -257759 -259478
17824 -259478 -257791 -253024 -249084 -245515 -240102 -242079 -238046 -230055 -230148 -231072 -226053 -223423 -219137 -218789 -219468
17809 -219468 -217654 -217196 -214706 -215021 -215796 -211668 -203023 -200029 -199239 -194742 -192430 -190798 -187549 -186587 -187839
17794 -187839 -182934 -177635 -171957 -166832 -164803 -166802 -166748 -162227 -159594 -158022 -153812 -146502 -142365 -137374 -133140
17779 -133140 -130585 -134137 -138616 -138491 -131104 -124035 -123426 -127033 -127430 -121474 -113287 -108890 -108362 -104256 -104091
17764 -104091 -106926 -105601 -99989 -98090 -93847 -89856 -84132 -78289 -81522 -77458 -73610 -71437 -69486 -62483
17750 -62483 -58190 -59042 -58333 -57117 -59660 -56807 -54620 -53853 -51794 -47995 -40873 -38209 -34317 -31261 -34240
17735 -34240 -37719 -35944 -31979 -30914 -30052 -27427 -28520 -27915 -28105 -26847 -20244 -15032 -10280 -5813 -4527
$$ packed form
17839c03180P889M386K646J630O536M418j512n83n28L631M323N833M416K336j719
17824b59478J687M767L940L569N413j977M033P991r3r24N019K630M286L48o79
17809b19468J814M58K490l15p75M128Q645K994P90M497K312J632L249R62j252
17794a87839M905N299N678N125K029j999N4M521K633J572M210P310M137M991M234
17779a33140K555l552m479J25P387P069O09l607l97N956Q187M397N28M106J65
17764a04091k835J325N612J899M243L991N724N843l233M064L848K173J951P003
17750f2483M293q52P09J216k543K853K187P67K059L799P122K664L892L056k979
17735c4240l479J775L965J065Q62K625j093O05j90J258O603N212M752M467J286
$$ plain form
17720 -4527 -4196 -4357 -6406 -2382 -10 4784 4357 9259 19134 18783 14054 14007 18973 28993 32496 29723
17704 29723 27474 31895 38268 40696 42908 47360 51548 52473 54867 55928 62092 66216 71852 73092 70100
17689 70100 72446 77920 80402 76972 76481 82836 89457 96674 95007 99122 105694 108766 112551 120763 126087
17674 126087 127736 127622 133345 141640 152374 157509 163227 168433 172480 180809 190669 201956 213175 224490
17660 224490 237444 247905 258320 264932 269637 262410 238051 205226 164178 121109 91281 74724
17648 74724 75529 87839 100401 113472 118413 110783 93757 54408 10060 -32423 -62175 -79877
17636 -79877 -77709 -69570 -61590 -50178 -37479 -24126 -11290 759 14321 19621 23105 31252 42842
17623 42842 45456 45477 52418 64063 72092 75373 72858 76076 82273 83713 87658 93237 98775 107160 111047
$$ packed form
17720d527L31j61k049M024K372M794m27M902R875l51m729m7M966J0020L503k773
17704B9723k249M421O373K428K212M452M188R25K394J061O164M124N636J240k992
17689G0100K346N474K482l430m91O355O621P217j667M115O572L072L785Q212N324
17674A26087J649j14N723Q295J0734N135N718N206M047Q329R860J1287J1219J1315
17660B24490J2954J0461J0415O612M705p227k4359l2825m1048m3069k9828j6557
17648G4724Q05J2310J2562J3071M941p630j7026l9349m4348m2483k9752j7702
17636g9877K168Q139P980J1412J2699J3353J2836J2049J3562N300L484Q147J1590
17623D2842K614K1O941J1645Q029L281k515L218O197J440L945N579N538Q385L887
$$ plain form
17608 111047 111931 116069 114384 117425 128619 135905 142138 141040 140285 145464 150587 147342 149894 153541
17594 153541 156934 146849 136739 133766 134269 132784 122824 116776 120072 122885 121486 120871 123577 122404
17580 122404 123076 130146 133209 130967 138242 149629 154929 154394 157977 159235 162246 165107 170065 177404
17566 177404 180366 185630 186744 182216 177505 176872 175034 176157 177937 185767 196169 201761 196591 191610
17552 191610 190887 189714 193354 192817 190505 194416 201180 201405 207650 212860 216266 216828 217475 218496 216812
17537 216812 217558 219439 215340 214847 217528 221454 226896 228294 230316 233162 235854 234633 230497 234106 234079
17522 234079 235853 237990 241833 242166 248677 250812 246034 249001 252330 250734 253763 253944 252837 251403 250491
17507 250491 253121 254746 257589 264307 266922 266731 268357 265976 266454 269458 268170 271982 274594 270995 265594
$$ packed form
17608A11047Q84M138j685L041J1194P286O233j098p55N179N123l245K552L647
17594A53541L393j0085j0110k973N03j485r960o048L296K813j399o15K706j173
17580A22404O72P070L063k242P275J1387N300n35L583J258L011K861M958P339
17566A77404K962N264J114m528m711o33j838J123J780P830J0402N592n170m981
17552A91610p23j173L640n37k312L911O764K25O245N210L406N62O47J021j684
17537B16812P46J881m099m93K681L926N442J398K022K846K692j221m136L609k7
17522B34079J774K137L843L33O511K135m778K967L329j596L029J81j107j434r12
17507B50491K630J625K843O718K615j91J626k381M78L004j288L812K612l599n401
$$ plain form
17492 265594 270686 275149 275970 276728 278240 283289 286769 285469 290123 290846 291842 292779 294464 290870 289326
17477 289326 288613 286283 292982 298328 296671 302387 307147 306447 304447 301709 301401 306230 310894 318890 318451
17462 318451 317045 318872 318478 317678 319563 319145 320091 319586 320112 327317 335811 341024 340518 337396 335625 336645
17446 336645 343191 349320 355098 355317 358170 357391 333640 305754 295407 303795 312165 322100 328391 326337
17432 326337 324252 331973 333854 329612 328137 335377 347516 352593 350594 350950 350617 355040 357021 357490 354814
17417 354814 348698 349791 355520 360152 363738 366038 365400 363695 366878 366670 365127 366594 368955 367420 370240
17402 370240 378675 383805 381956 380810 382075 383783 383407 381993 379095 379005 381549 385742 387949 387497 386266
17387 386266 388726 391081 392552 390164 392605 392940 392487 396663 399460 400476 401100 396740 399417 402726 403841
$$ packed form
17492B65594N092M463Q21P58J512N049L480j300M654P23R96R37J685l594j544
17477B89326p13k330O699N346j657N716M760p00k000k738l08M829M664P996m39
17462C18451j406J827l94q00J885m18R46n05N26P205Q494N213n06l122j771J020
17446C36645O546O129N778K19K853p79k3751k7886j0347Q388Q370R935O291k054
17432C26337k085P721J881m242j475P240J2139N077j999L56l33M423J981M69k676
17417C54814o116J093N729M632L586K300o38j705L183k08j543J467K361j535K820
17402C70240Q435N130j849j146J265J708l76j414k898r0K544M193K207m52j231
17387C86266K460K355J471k388K441L35m53M176K797J016O24m360K677L309J115
$$ plain form
17372 403841 400030 400996 402679 405812 407097 408944 412756 416518 421797 423214 421559 420918 418768 420299 418710
17357 418710 419398 424101 430305 429389 429941 430688 428839 424976 425548 429466 436603 438403 436428 434837 435343 441957
17341 441957 441428 437721 436732 439775 444262 450710 454731 451544 447303 446348 444196 448520 452882 456471 456622
17326 456622 457519 459787 462374 460988 458194 454660 457004 455582 455219 458642 463855 463142 466290 473438 476706
17311 476706 471812 466238 470664 472970 477961 475890 473618 471931 471768 469850 475191 484359 485361 487416
17297 487416 487385 487788 487292 489684 487899 487788 489628 490785 496273 496999 489536 488463 492837 496966 494357 499767
17281 499767 502375 498812 504183 506638 506284 507863 508963 507488 505522 504262 504461 506243 508779 509006 506510
17266 506510 506998 515163 518917 514813 512528 517407 522239 520993 521502 523212 521135 522297 528561 527296 525376
$$ packed form
17372D03841l811R66J683L133J285J847L812L762N279J417j655o41k150J531j589
17357D18710O88M703O204r16N52P47j849l863N72L918P137J800j975j591N06O614
17341D41957n29l707r89L043M487O448M021l187m241r55k152M324M362L589J51
17326D56622Q97K268K587j386k794l534K344j422l63L423N213p13L148P148L268
17311D76706m894n574M426K306M991k071k272j687j63j918N341R168J002K055
17297D87416l1M03m96K392j785j11J840J157N488P26p463j073M374M129k609N410
17281D99767K608l563N371K455l54J579J100j475j966j260J99J782K536K27k496
17266E06510M88Q165L754m104k285M879M832j246N09J710k077J162O264j265j920
$$ plain form
17251 525376 525829 527284 527733 530133 536603 543487 544502 541698 538782 543569 544147 540465 536164 536822 542441
17236 542441 543524 545751 548950 548510 547081 544931 541542 535605 532526 533830 541259 542529 543785 549700
17222 549700 552588 549958 551398 556257 559658 558746 557685 559029 560651 559664 562882 566288 566864 564613 564033
17207 564033 567806 573123 576995 576367 573718 568609 565721 569443 572121 578021 580619 574438 575699 578006
17193 578006 575627 579296 583376 588070 592558 593327 596308 596113 590985 594558 593856 594404 592316 595380 592107
17178 592107 589846 591385 594594 600216 607530 610013 608749 608525 610148 611027 611323 612933 615480 612020 611281
17163 611281 615264 614089 615383 617609 619052 622895 626432 623541 618151 620330 622833 623014 625063 628152
17149 628152 628364 624673 627968 628006 630542 631717 633278 637578 642904 645060 645989 648108 651431 650132 647723
$$ packed form
17251E25376M53J455M49K400O470O884J015k804k916M787N78l682m301O58N619
17236E42441J083K227L199m40j429k150l389n937l079J304P429J270J256N915
17222E49700K888k630J440M859L401r12j061J344J622r87L218L406N76k251n80
17207E64033L773N317L872o28k649n109k888L722K678N900K598o181J261K307
17193E78006k379L669M080M694M488P69K981j95n128L573p02N48k088L064l273
17178E92107k261J539L209N622P314K483j264k24J623Q79K96J610K547l460p39
17163F11281L983j175J294K226J443L843L537k891n390K179K503J81K049L089
17149F28152K12l691L295L8K536J175J561M300N326K156R29K119L323j299k409
$$ plain form
17134 647723 653359 657763 657192 653119 649755 650394 649108 648927 650006 651334 651893 651325 654754 655250 657221 655193
17118 655193 651734 646874 640318 637280 637537 640558 639570 646591 649276 654403 657842 656697 656265 662772 669006
17103 669006 666748 662675 664668 665947 664003 666219 669157 672310 673848 677244 677543 676722 675993 677360 678142
17088 678142 678175 680894 678727 679551 685386 690664 691063 695659 694921 693569 695084 699872 705052 702815 703427 703773
17072 703773 697238 696109 697915 700356 701099 702775 705612 705453 711458 714350 714110 717000 715578 718382 722275
17057 722275 721769 721864 721848 721003 721445 717703 718979 724141 726537 724010 724098 726333 734435 736681 739915 742998
17041 742998 741703 737323 738098 743207 746391 749940 750966 753475 752919 746818 743196 746669 751003 752686 751329
17026 751329 748193 756574 763848 767934 762344 757477 754296 753853 759019 760795 762237 760143 762064 766172
$$ packed form
17134F47723N636M404n71m073l364O39j286j81J079J328N59n68L429M96J971k028
17118F55193l459m860o556l038K57L021r88P021K685N127L439j145m32O507O234
17103F69006k258m073J993J279j944K216K938L153J538L396K99q21p29J367P82
17088F78142L3K719k167Q24N835N278L99M596p38j352J515M788N180k237O12L46
17072G03773o535j129J806K441P43J676K837j59O005K892k40K890j422K804L893
17057G22275n06R5j6q45M42l742J276N162K396k527Q8K235Q102K246L234L083
17041G42998j295m380P75N109L184L549J026K509n56o101l622L473M334J683j357
17026G51329l136Q381P274M086n590m867l181m43N166J776J442k094J921M108
$$ plain form
17012 766172 769015 769929 765062 766661 764711 765452 771985 778122 781081 784676 782496 777964 779944 783053 784762
16997 784762 786596 788771 791970 796817 797814 800250 798704 798475 797365 794029 799427 802792 802120 803379 804499
16982 804499 803792 805794 805106 808624 815829 818636 819372 812564 812777 818185 822334 824018 823009 822498 822829 826345
16966 826345 831668 832206 829225 828539 832646 835438 834632 833717 837165 840586 841132 836188 837819 842367 844071
16951 844071 845635 844519 847402 851014 852889 847159 844044 847488 848642 848411 850376 854456 856216 860119
16937 860119 859160 859810 858922 855190 858094 858974 860493 860011 864058 868827 866873 869005 872032 874536 875085 874977
16921 874977 871657 873222 878432 883578 884203 884336 884971 886179 890185 893389 891532 888497 889619 891564 892430
16906 892430 901478 901984 902600 906940 911396 912126 910360 909546 912103 916552 918447 917929 919044 921435 924685
$$ packed form
17012G66172K843R14m867J599j950P41O533O137K959L595k180m532J980L109J709
16997G84762J834K175L199M847R97K436j546k29j110l336N398L365o72J259J120
16982H04499p07K002o88L518P205K807P36o808K13N408M149J684j009n11L31L516
16966H26345N323N38k981o86M107K792q06r15L448L421N46m944J631M548J704
16951H44071J564j116K883L612J875n730l115L444J154k31J965M080J760L903
16937H60119r59O50q88l732K904Q80J519m82M047M769j954K132L027K504N49j08
16921H74977l320J565N210N146O25J33O35J208M006L204j857l035J122J945Q66
16906H92430R048N06O16M340M456P30j766q14K557M449J895n18J115K391L250
$$ plain form
16891 924685 924447 921280 921810 926360 932710 936007 930595 925053 928336 935068 937781 941715 941460 943777 945890
16876 945890 948592 950060 953364 959070 961992 965177 960128 957384 960188 966979 972396 979128 981394 981283
16862 981283 978986 974811 977391 980863 977843 979187 988549 993079 998095 999045 1000053 1002839 1007042 1010213
16848 1010213 1014600 1016980 1017585 1017244 1018339 1024520 1030874 1037135 1042277 1045786 1045496 1047353 1056178 1066065 1074150
16833 1074150 1076181 1082190 1089517 1097864 1109758 1124103 1137918 1152971 1168989 1189133 1204933 1214537
16821 1214537 1210358 1195828 1181872 1169968 1140464 1082332 1029958 1014031 1018403 1018079 1011332 1013078
16809 1013078 1015461 1007126 1000836 994670 966424 907090 857451 841719 836478 823154 811269 817317
16797 817317 839644 858659 875082 889359 902949 914400 926241 931481 935524 943193 952014 959508
$$ packed form
16891I24685k38l167N30M550O350L297n412n542L283O732K713L934k55K317K113
16876I45890K702J468L304N706K922L185n049k744K804O791N417O732K266j11
16862I81283k297m175K580L472l020J344R362M530N016R50J008K786M203L171
16848A010213M387K380O05l41J095O181O354O261N142L509k90J857Q825R887Q085
16833A074150K031O009P327Q347J1894J4345J3815J5053J6018K0144J5800R604
16821A214537m179j4530j3956j1904k9504n8132n2374j5927M372l24o747J746
16809A013078K383q335o290o166k8246n9334m9639j5732n241j3324j1885O048
16797H17317K2327J9015J6423J4277J3590J1451J1841N240M043P669Q821P494
$$ plain form
16785 959508 962458 967291 973625 979582 982573 984709 986212 989164 994340 996788 999238 1008522 1018804 1024685
16771 1024685 1029540 1034860 1036665 1034600 1036931 1042186 1047905 1050100 1054163 1058891 1058753 1058736 1061730 1067095 1075462
16756 1075462 1077656 1082095 1082979 1081320 1081572 1084984 1085962 1089005 1093767 1099539 1098545 1100696 1106445 1109980 1109580
16741 1109580 1110352 1112927 1117682 1118847 1120799 1126646 1131720 1136812 1139511 1140774 1140998 1137764 1135769 1142863
16727 1142863 1148615 1144429 1143509 1147611 1147636 1151991 1157653 1160152 1161826 1162641 1167038 1168705 1170628 1174783 1179256
16712 1179256 1179289 1178891 1183915 1184095 1183074 1184622 1186796 1188243 1194079 1200290 1203509 1208600 1211426 1208665 1210052
16697 1210052 1210396 1211297 1214896 1226212 1230151 1229992 1233819 1236443 1237077 1236887 1239187 1234953 1235579 1242024 1247297
16682 1247297 1251983 1250997 1255907 1258877 1265750 1269375 1270793 1274797 1276834 1281177 1283661 1289137 1292711 1290154
$$ packed form
16785I59508K950M833O334N957K991K136J503K952N176K448K450R284J0282N881
16771A024685M855N320J805k065K331N255N719K195M063M728j38j7K994N365Q367
16756A075462K194M439Q84j659K52L412R78L043M762N772r94K151N749L535m00
16741A109580P72K575M755J165J952N847N074N092K699J263K24l234j995P094
16727A142863N752m186r20M102K5M355N662K499J674Q15M397J667J923M155M473
16712A179256L3l98N024J80j021J548K174J447N836O211L219N091K826k761J387
16697A210052L44R01L599J1316L939j59L827K624O34j90K300m234O26O445N273
16682A247297M686r86M910K970O873L625J418M004K037M343K484N476L574k557
$$ plain form
16668 1290154 1292146 1296560 1302678 1303036 1295992 1296556 1300450 1310117 1314480 1319981 1326782 1328819 1329130 1335545 1342841
16653 1342841 1345207 1340219 1339132 1343212 1344903 1345838 1351196 1359728 1366193 1366864 1369181 1370005 1371453 1372586 1375020
16638 1375020 1380321 1384848 1388657 1396835 1397471 1398674 1407111 1410029 1411255 1411689 1415565 1417454 1418254 1421932 1424625
16623 1424625 1428767 1433623 1440963 1445653 1445994 1445579 1445357 1455412 1462391 1467862 1473130 1471707 1474955 1486346
16609 1486346 1493232 1497128 1498065 1502201 1504899 1501493 1509588 1512617 1515848 1527825 1535069 1537130 1539194 1548632
16595 1548632 1547371 1545761 1547582 1551910 1556108 1561596 1570661 1580033 1590158 1595476 1596656 1604688 1613331 1612557
16581 1612557 1609086 1613386 1623519 1629223 1632830 1637858 1641875 1656015 1667189 1676738 1685474 1695189 1702274
16568 1702274 1714172 1728154 1739242 1739328 1719681 1690631 1661478 1635297 1628925 1644223 1669017 1687330
$$ packed form
16668A290154J992M414O118L58p044N64L894R667M363N501O801K037L11O415P296
16653A342841K366m988j087M080J691R35N358Q532O465O71K317Q24J448J133K434
16638A375020N301M527L809Q178O36J203Q437K918J226M34L876J889Q00L678K693
16623A424625M142M856P340M690L41m15k22J0055O979N471N268j423L248J1391
16609A486346O886L896R37M136K698l406Q095L029L231J1977P244K061K064R438
16595A548632j261j610J821M328M198N488R065R372J0125N318J180Q032Q643p74
16581A612557l471M300J0133N704L607N028M017J4140J1174R549Q736R715P085
16568A702274J1898J3982J1088Q6j9647k9050k9153k6181o372J5298K4794J8313
$$ plain form
16556 1687330 1698530 1719141 1739683 1753685 1746241 1718410 1692322 1668058 1651488 1655343 1668325 1684419
16544 1684419 1702749 1708007 1712172 1719874 1729360 1738398 1749890 1756822 1762216 1772807 1781544 1787812 1795287
16531 1795287 1798630 1806828 1809347 1814985 1822664 1832429 1843082 1847752 1849178 1855339 1862914 1868034 1874075 1880931
16517 1880931 1889395 1890287 1890782 1894323 1901525 1907848 1907025 1909748 1910853 1919219 1926576 1931286 1936747 1938955 1940939
16502 1940939 1946931 1953686 1965113 1974644 1979839 1986972 1996300 2006467 2016887 2028071 2037648 2047223 2057563
16489 2057563 2062434 2072477 2082074 2091831 2093753 2097595 2105118 2117140 2129813 2143963 2149592 2156161 2167761
16476 2167761 2176719 2179554 2183793 2191729 2198926 2206469 2215398 2228972 2238178 2249848 2257305 2260984 2273319
16463 2273319 2286090 2298706 2307101 2314706 2328502 2342444 2352842 2364707 2378124 2386218 2397037 2410492
$$ packed form
16556A687330J1200K0611K0542J4002p444k7831k6088k4264j6570L855J2982J6094
16544A684419J8330N258M165P702R486R038J1492O932N394J0591Q737O268P475
16531A795287L343Q198K519N638P679R765J0653M670J426O161P575N120O041O856
16517A880931Q464Q92M95L541P202O323q23K723J105Q366P357M710N461K208J984
16502A940939N992O755J1427R531N195P133R328J0167J0420J1184R577R575J0340
16489B057563M871J0043R597R757J922L842P523J2022J2673J4150N629O569J1600
16476B167761Q958K835M239P936P197P543Q929J3574R206J1670P457L679J2335
16463B273319J2771J2616Q395P605J3796J3942J0398J1865J3417Q094J0819J3455
$$ plain form
16451 2410492 2419757 2431462 2441368 2453500 2467949 2478206 2487663 2503615 2526519 2535797 2543762 2558440
16439 2558440 2579107 2592454 2606111 2618548 2628135 2634439 2648608 2661624 2675767 2692445 2706610 2724619
16427 2724619 2739622 2752852 2769451 2785161 2801339 2814183 2827605 2845240 2859213 2873578 2887130
16416 2887130 2906723 2928712 2952569 2971144 2991856 3013951 3031941 3045310 3062042 3086091 3108155
16405 3108155 3128084 3151957 3175002 3189252 3201295 3217626 3237114 3250000 3258004 3271539 3296225
16394 3296225 3318960 3342055 3356357 3363902 3380922 3404480 3428480 3449264 3461244 3474773 3496958
16383 3496958 3524227 3556343 3581045 3593358 3616806 3652411 3688377 3715571 3733243 3771330 3811539
16372 3811539 3845938 3875543 3905522 3936270 3971710 4004493 4035972 4074806 4110702 4152987 4198354
$$ packed form
16451B410492R265J1705R906J2132J4449J0257R457J5952K2904R278P965J4678
16439B558440K0667J3347J3657J2437R587O304J4169J3016J4143J6678J4165J8009
16427B724619J5003J3230J6599J5710J6178J2844J3422J7635J3973J4365J3552
16416B887130J9593K1989K3857J8575K0712K2095J7990J3369J6732K4049K2064
16405C108155J9929K3873K3045J4250J2043J6331J9488J2886Q004J3535K4686
16394C296225K2735K3095J4302P545J7020K3558K4000K0784J1980J3529K2185
16383C496958K7269L2116K4702J2313K3448L5605L5966K7194J7672L8087M0209
16372C811539L4399K9605K9979L0748L5440L2783L1479L8834L5896M2285M5367
$$ plain form
16361 4198354 4244426 4289079 4328275 4369723 4413701 4455665 4500964 4551708 4601173 4646489 4689928
16350 4689928 4740892 4792488 4843365 4893554 4942065 4989601 5040526 5093468 5153780 5212549 5278159
16339 5278159 5347688 5418095 5486345 5552517 5618080 5680775 5749774 5828974 5908068 5988002 6068742
16328 6068742 6154710 6248286 6340348 6433639 6536765 6644131 6751560 6860966 6976832 7099704
16318 7099704 7221624 7344401 7472846 7609888 7756103 7908607 8063436 8216773 8382927
16309 8382927 8558523 8744004 8928808 9123074 9334277 9563828 9796594 10037075 10305407
16300 10305407 10595180 10899053 11220329 11560912 11926014 12289447 12664504 13077374 13518589
16291 13518589 13952469 14403127 14926228 15504472 16113722 16772729 17511131 18321500 19214236
$$ packed form
16361D198354M6072M4653L9196M1448M3978M1964M5299N0744M9465M5316M3439
16350D689928N0964N1596N0877N0189M8511M7536N0925N2942O0312N8769O5610
16339E278159O9529P0407O8250O6172O5563O2695O8999P9200P9094P9934Q0740
16328F068742Q5968R3576R2062R3291J03126J07366J07429J09406J15866J22872
16318G099704J21920J22777J28445J37042J46215J52504J54829J53337J66154
16309H382927J75596J85481J84804J94266K11203K29551K32766K40481K68332
16300A0305407K89773L03873L21276L40583L65102L63433L75057M12870M41215
16291A3518589M33880M50658N23101N78244O09250O59007P38402Q10369Q92736
$$ plain form
16282 19214236 20222966 21408026 22773996 24321188 26140824 28346036 30951277 33930159
16274 33930159 37107603 39655764 39748515 36569060 33137309 31425966 27221986 16732179
16266 16732179 5907490 1944013 1780216 452318 -1007688 -44297 972267 -407086
16258 -407086 -1807601 -2247811 -6465378 -17196243 -27444352 -31255380 -32654543 -35868593
16250 -35868593 -38853374 -38486743 -35728040 -32478133 -29508602 -26980162 -24852741 -23032358
16242 -23032358 -21460328 -20126848 -18995017 -18000098 -17105792 -16301537 -15590157 -14940229 -14324683
16233 -14324683 -13761880 -13248437 -12756191 -12290903 -11892782 -11553299 -11220831 -10883367 -10570796
16224 -10570796 -10284190 -9995724 -9709944 -9429980 -9160676 -8907284 -8669654 -8445922 -8230469
$$ packed form
16282A9214236J008730J185060J365970J547192J819636K205212K605241K978882
16274C3930159L177444K548161R2751l179455l431751j711343m203980j0489807
16266A6732179j0824689l963477j63797j327898j460006R63391J016564j379353
16258d07086j400515m40210m217567j0730865j0248109l811028j399163l214050
16250c5868593k984781L66631K758703L249907K969531K528440K127421J820383
16242b3032358J572030J333480J131831R94919Q94306Q04255P11380O49928O15546
16233a4324683N62803N13443M92246M65288L98121L39483L32468L37464L12571
16224a0570796K86606K88466K85780K79964K69304K53392K37630K23732K15453
$$ plain form
16215 -8230469 -8021452 -7825970 -7647459 -7473749 -7306170 -7145561 -6994724 -6852926 -6708150
16206 -6708150 -6570539 -6435410 -6308146 -6187036 -6067991 -5956376 -5849808 -5742370 -5638866
16197 -5638866 -5537968 -5445786 -5358293 -5270930 -5182732 -5102874 -5020204 -4940264 -4858773 -4785031 -4704424
16186 -4704424 -4622907 -4548486 -4481827 -4424399 -4361851 -4293588 -4232060 -4176948 -4118853 -4062227 -4006727
16175 -4006727 -3957465 -3906131 -3855432 -3806965 -3761662 -3709461 -3660019 -3616562 -3568587 -3526264 -3489124
16164 -3489124 -3453590 -3418071 -3383755 -3346104 -3303480 -3260344 -3223859 -3192649 -3157278 -3122026 -3088758
16153 -3088758 -3053390 -3016270 -2982100 -2946572 -2908218 -2872656 -2840858 -2809228 -2780924 -2752503 -2725986
16142 -2725986 -2701244 -2676629 -2652420 -2631728 -2606276 -2582332 -2556183 -2527580 -2503869 -2487217 -2469322
$$ packed form
16215h230469K09017J95482J78511J73710J67579J60609J50837J41798J44776
16206f708150J37611J35129J27264J21110J19045J11615J06568J07438J03504
16197e638866J00898R2182Q7493Q7363Q8198P9858Q2670P9940Q1491P3742Q0607
16186d704424Q1517P4421O6659N7428O2548O8263O1528N5112N8095N6626N5500
16175d006727M9262N1334N0699M8467M5303N2201M9442M3457M7975M2323L7140
16164c489124L5534L5519L4316L7651M2624M3136L6485L1210L5371L5252L3268
16153c088758L5368L7120L4170L5528L8354L5562L1798L1630K8304K8421K6517
16142b725986K4742K4615K4209K0692K5452K3944K6149K8603K3711J6652J7895
$$ plain form
16131 -2469322 -2438944 -2408577 -2393975 -2381471 -2364093 -2340941 -2319942 -2304204 -2280897 -2269166 -2253611
16120 -2253611 -2231009 -2201650 -2177777 -2159513 -2140080 -2116937 -2101545 -2084879 -2064110 -2042864 -2025821
16109 -2025821 -2006232 -1987257 -1964505 -1951844 -1937352 -1919536 -1902010 -1887555 -1873706 -1856096 -1841286
16098 -1841286 -1824317 -1810776 -1797244 -1779299 -1765187 -1752096 -1736664 -1727157 -1720818 -1705415 -1691960 -1679410
16086 -1679410 -1666410 -1648657 -1630234 -1622631 -1616836 -1605117 -1597066 -1582319 -1569243 -1561188 -1550459 -1543866
16074 -1543866 -1532857 -1516262 -1504478 -1489175 -1471532 -1460540 -1449226 -1440097 -1431338 -1422816 -1410810 -1400978
16062 -1400978 -1388903 -1376814 -1370573 -1359195 -1354694 -1349076 -1338672 -1327510 -1314321 -1304276 -1290555 -1276718
16050 -1276718 -1263618 -1256725 -1249303 -1234659 -1221090 -1212116 -1205541 -1201065 -1196109 -1191106 -1187059 -1181977 -1172762
$$ packed form
16131b469322L0378L0367J4602J2504J7378K3152K0999J5738K3307J1731J5555
16120b253611K2602K9359K3873J8264J9433K3143J5392J6666K0769K1246J7043
16109b025821J9589J8975K2752J2661J4492J7816J7526J4455J3849J7610J4810
16098a841286J6969J3541J3532J7945J4112J3091J5432R507O339J5403J3455J2550
16086a679410J3000J7753J8423P603N795J1719Q051J4747J3076Q055J0729O593
16074a543866J1009J6595J1784J5303J7643J0992J1314R129Q759Q522J2006R832
16062a400978J2075J2089O241J1378M501N618J0404J1162J3189J0045J3721J3837
16050a276718J3100O893P422J4644J3569Q974O575M476M956N003M047N082R215
$$ plain form
16037 -1172762 -1168067 -1158576 -1147354 -1139449 -1134751 -1132412 -1130884 -1124693 -1114399 -1104886 -1098839 -1094486 -1090186
16024 -1090186 -1087435 -1080808 -1075768 -1069943 -1061411 -1052362 -1044496 -1034723 -1028358 -1024165 -1011470 -998346 -991998
16011 -991998 -983574 -978026 -971715 -968445 -965434 -960546 -956656 -949446 -945133 -940337 -933369 -925424 -917826 -913014
15997 -913014 -911793 -903173 -898798 -891920 -888516 -885188 -877360 -868014 -858516 -857273 -855334 -841922 -830583 -829341
15983 -829341 -822088 -816898 -816578 -815348 -810898 -802218 -794085 -788372 -781740 -774027 -766870 -768523 -767333 -764151
15969 -764151 -756021 -747082 -741609 -737705 -735184 -731179 -726792 -718657 -715930 -711284 -705280 -698939 -693865 -688112
15955 -688112 -686842 -681864 -673445 -671294 -671860 -671739 -665042 -658471 -658590 -655840 -657686 -655039 -650670 -643504 -639784
15940 -639784 -633565 -627156 -621662 -615452 -608344 -601672 -599353 -595846 -591380 -581586 -572452 -568905 -574270 -571488
$$ packed form
16037a172762M695R491J1222P905M698K339J528O191J0294R513O047M353M300
16024a090186K751O627N040N825Q532R049P866R773O365M193J2695J3124O348
16011i91998Q424N548O311L270L011M888L890P210M313M796O968P945P598M812
15997i13014J221Q620M375O878L404L328P828R346R498J243J939J3412J1339J242
15983h29341P253N190L20J230M450Q680Q133N713O632P713P157j653J190L182
15969g64151Q130Q939N473L904K521M005M387Q135K727M646O004O341N074N753
15955f88112J270M978Q419K151n66J21O697O571j19K750j846K647M369P166L720
15940f39784O219O409N494O210P108O672K319L507M466R794R134L547n365K782
$$ plain form
15926 -571488 -567718 -566065 -565575 -561533 -555065 -550431 -550044 -546328 -539518 -535324 -531239 -527153 -526023 -523828 -522473
15911 -522473 -518484 -516232 -509072 -503485 -502136 -498169 -496227 -494823 -491823 -487622 -482082 -476511 -472351 -472110
15897 -472110 -475520 -474363 -470374 -465553 -458861 -450567 -453141 -455253 -453200 -446314 -439265 -431547 -423140 -418595
15883 -418595 -417414 -412329 -408001 -409582 -410380 -405731 -405483 -406298 -403771 -394895 -388589 -387776 -381883 -377627 -379078
15868 -379078 -373953 -370544 -368662 -365235 -363294 -359967 -361782 -362530 -359071 -360011 -357615 -354026 -351912 -346582 -338635
15853 -338635 -334703 -329817 -329104 -332863 -329042 -323008 -317719 -315445 -316531 -313431 -305756 -302578 -303704 -300982
15839 -300982 -296743 -297344 -295975 -293197 -286629 -283298 -283111 -282510 -282073 -277948 -272936 -266979 -263409 -258974 -258910 -259847
15823 -259847 -257902 -255165 -258804 -258547 -254783 -255262 -249838 -242415 -239202 -234595 -231889 -234482 -235521 -230737 -224532
$$ packed form
15926e71488L770J653M90M042O468M634L87L716O810M194M085M086J130K195J355
15911e22473L989K252P160N587J349L967J942J404L000M201N540N571M160K41
15897d72110l410J157L989M821O692Q294k574k112K053O886P049P718Q407M545
15883d18595J181N085M328j581p98M649K48q15K527Q876O306Q13N893M256j451
15868c79078N125L409J882L427J941L327j815p48L459r40K396L589K114N330P947
15853c38635L932M886P13l759L821O034N289K274j086L100P675L178j126K722
15839c00982M239o01J369K778O568L331J87O01M37M125N012N957L570M435O4r37
15823b59847J945K737l639K57L764m79N424P423L213M607K706k593j039M784O205
$$ plain form
15808 -224532 -219600 -218931 -213529 -212014 -213953 -210323 -202811 -205536 -209848 -207944 -206480 -201923 -197442 -193362
15794 -193362 -193471 -189001 -182344 -179674 -176705 -177867 -179889 -182750 -183056 -175782 -168738 -164839 -163527 -158746 -157660
15779 -157660 -157841 -155795 -148980 -144298 -142848 -142771 -144754 -146037 -141577 -133776 -128314 -124672 -121656 -118009 -115075
15764 -115075 -114243 -112648 -109152 -110810 -110624 -105545 -105338 -104531 -100337 -96609 -96255 -89698 -85903 -80968 -77520
15749 -77520 -69559 -66037 -66759 -62339 -58873 -56213 -56526 -53946 -51950 -47377 -46279 -43847 -40965 -38122 -34919
15734 -34919 -29982 -26004 -16372 -4645 3646 7855 10419 15472 24134 31369 34590 46251 63404 77965
15720 77965 92036 112345 135019 146637 145339 127908 112392 102163 77581 16942 -39863 -56806
15708 -56806 -57361 -62385 -62332 -57683 -53629 -57349 -59105 -64790 -96637 -149799 -199261 -220952 -232816 -250021
$$ packed form
15808b24532M932O69N402J515j939L630P512k725m312J904J464M557M481M080
15794a93362j09M470O657K670K969j162k022k861l06P274P044L899J312M781J086
15779a57660j81K046O815M682J450P7j983j283M460P801N462L642L016L647K934
15764a15075Q32J595L496j658J86N079K07Q07M194L728L54O557L795M935L448
15749g7520P961L522p22M420L466K660l13K580J996M573J098K432K882K843L203
15734c4919M937L978R632J1727Q291M209K564N053Q662P235L221J1661J7153J4561
15720G7965J4071K0309K2674J1618j298j7431j5516j0229k4582o0639n6805j6943
15708e6806n55n024N3M649M054l720j756n685l1847n3162m9462k1691j1864j7205
$$ plain form
15694 -250021 -258861 -248228 -227210 -203487 -188736 -175887 -163371 -155770 -149025 -132957 -121128 -110702
15682 -110702 -103079 -99797 -99445 -94903 -89919 -84438 -82259 -78106 -76259 -75685 -74334 -70297 -62618 -58662 -54804
15667 -54804 -51060 -52004 -45928 -37852 -32874 -32365 -28976 -29126 -27929 -25566 -26064 -24155 -20729 -15686 -13264
15652 -13264 -15008 -16492 -7286 -1464 -2864 -4621 -2785 -944 3979 10103 9750 6677 13340 14005 13736
15637 13736 15432 18393 21154 23847 29424 32559 33327 31190 30358 33294 32714 33048 36106 40797 43984
15622 43984 46109 49382 53085 54202 55156 58904 58498 55994 56041 56150 67249 72846 71466 72339 73485 75691
15606 75691 79882 77828 70923 73288 77645 78332 78181 79832 79093 84696 85455 82036 77752 76578 82555
15591 82555 84473 88626 91442 92480 94958 98146 101126 103622 103909 101391 101163 104584 104655 101666 104401
$$ packed form
15694b50021q840J0633K1018K3723J4751J2849J2516P601O745J6068J1829J0426
15682a10702P623L282L52M542M984N481K179M153J847N74J351M037P679L956L858
15667e4804L744r44O076Q076M978N09L389j50J197K363m98J909L426N043K422
15652a3264j744j484R206N822j400j757J836J841M923O124l53l073O663O65k69
15637A3736J696K961K761K693N577L135P68k137q32K936n80L34L058M691L187
15622D3984K125L273L703J117R54L748m06k504M7J09J1099N597j380Q73J146K206
15606G5691M191k054o905K365M357O87j51J651p39N603P59l419m284j174N977
15591H2555J918M153K816J038K478L188K980K496K87k518k28L421P1k989K735
$$ plain form
15576 104401 110235 114985 116428 114442 112276 107329 108272 107044 98803 99505 106124 108692 106614 102900 105237
15561 105237 109354 111344 112017 108645 107043 110824 115638 116385 118216 116759 118389 117798 117002 118160 123071
15546 123071 125634 122010 126812 127079 125085 123260 126913 124291 128238 127517 126190 129159 131356 130256 126936
15531 126936 125582 126854 129199 134039 134634 136857 136153 135500 135293 136890 140783 143108 149405 150473 146676
15516 146676 146510 146603 149326 150415 146498 150343 151435 148692 151912 154076 155582 162251 166190 164766 166094
15501 166094 167629 168370 168177 168708 168481 172193 172435 172102 172613 176753 179240 183823 181770 176714 176915 182264
15485 182264 188506 188636 182216 180659 183670 186945 186472 187696 188321 192093 197384 201448 200730 201965 200505
15470 200505 200637 202304 203310 201520 198723 200093 200094 201328 201255 199857 204205 203582 206697 208324 210907 212632
$$ packed form
15576A04401N834M750J443j986k166m947R43j228q241P02O619K568k078l714K337
15561A05237M117J990O73l372j602L781M814P47J831j457J630n91p96J158M911
15546A23071K563l624M802K67j994j825L653k622L947p21j327K969K197j100l320
15531A26936j354J272K345M840N95K223p04o53k07J597L893K325O297J068l797
15516A46676j66R3K723J089l917L845J092k743L220K164J506O669L939j424J328
15501A66094J535P41j93N31k27L712K42l33N11M140K487M583k053n056K01N349
15485A82264O242J30o420j557L011L275m73J224O25L772N291M064p18J235j460
15470B00505J32J667J006j790k797J370JJ234p3j398M348o23L115J627K583J725
$$ plain form
15454 212632 216024 215866 212618 215374 217433 219451 223271 223947 220528 223373 225932 229877 231627 229101 229582
15439 229582 232225 232767 233578 229712 227254 229131 237212 237700 237564 237530 232945 233193 234283 237122 243384 247110
15423 247110 242728 244955 251649 255794 258108 249298 249726 254021 254118 253354 253971 256671 259215 258765 259858 261789
15407 261789 265318 265776 267104 268119 269105 270228 270914 267842 270400 272968 271118 272920 269673 266928 270509
15392 270509 270293 274461 279733 276733 272680 275843 279896 279580 280050 284201 286744 292618 294098 292572 290603
15377 290603 292205 290701 296014 298190 297831 297131 302889 303935 298978 300756 303819 302482 296299 296213 301818
15362 301818 304406 302647 298522 298376 301107 306498 309285 305575 301786 299513 300340 301149 301761 302486 305368
15347 305368 313854 321930 321452 318606 317556 320948 323653 320133 319347 323570 323128 326314 326342 328231 328009 326811
$$ packed form
15454B12632L392j58l248K756K059K018L820O76l419K845K559L945J750k526M81
15439B29582K643N42Q11l866k458J877Q081M88j36l4m585K48J090K839O262L726
15423B47110m382K227O694M145K314q810M28M295R7p64O17K700K544m50J093J931
15407B61789L529M58J328J015R86J123O86l072K558K568j850J802l247k745L581
15392B70509k16M168N272l000m053L163M053l16M70M151K543N874J480j526j969
15377B90603J602j504N313K176l59p00N758J046m957J778L063j337o183q6N605
15362C01818K588j759m125j46K731N391K787l710l789k273Q27Q09O12P25K882
15347C05368Q486Q076m78k846j050L392K705l520p86M223m42L186K8J889k22j198
$$ plain form
15331 326811 331905 328588 329944 329802 328839 328215 322152 323907 327112 329709 331949 330222 330080 335134 338900
15316 338900 338992 338217 342786 351886 351757 348514 351449 353718 349734 349104 351336 349740 347254 348798 350752
15301 350752 357243 359172 356770 361778 366882 364017 356988 352640 354398 358428 361581 365879 367008 365765
15287 365765 368553 368876 366063 363642 360940 357191 361916 366729 369530 370404 371807 375386 375102 373270 376383
15272 376383 375953 377359 385602 386982 381607 379033 377467 375336 375031 377983 383271 391720 394998 396089 397194
15257 397194 393575 391914 391533 388521 390596 392376 389876 389280 388118 391306 394080 392516 393945 397094 395262
15242 395262 397480 400772 403577 401791 398027 397717 402389 403111 407464 411304 412497 412769 412086 410580 409786
15227 409786 406868 406604 409052 413731 413321 411952 411069 410913 411482 414452 415071 412849 412809 414325 417660 419337
$$ packed form
15331C26811N094l317J356j42r63o24o063J755L205K597K240j727j42N054L766
15316C38900R2p75M569R100j29l243K935K269l984o30K232j596k486J544J954
15301C50752O491J929k402N008N104k865p029m348J758M030L153M298J129j243
15287C65765K788L23k813k421k702l749M725M813K801Q74J403L579k84j832L113
15272C76383m30J406Q243J380n375k574j566k131l05K952N288Q449L278J091J105
15257C97194l619j661l81l012K075J780k500n96j162L188K774j564J429L149j832
15242C95262K218L292K805j786l764l10M672P22M353L840J193K72o83j506p94
15227D09786k918k64K448M679m10j369q83j56N69K970O19k222m0J516L335J677
$$ plain form
15211 419337 422803 424587 423529 423207 424892 422832 421873 425056 426553 428265 425518 430785 433929 433113 436728
15196 436728 435359 431504 432336 434878 434215 438625 442727 441679 441389 444436 439689 435550 436113 436908 438266
15181 438266 442503 442842 441545 442181 441318 440543 446124 450612 451692 450084 445949 441085 442606 451207 456914
15166 456914 457915 456366 454324 451999 450653 453264 454962 457158 459348 456447 459741 463010 463915 465042
15152 465042 464523 466851 465310 459351 463253 470518 472618 468778 464844 463763 467138 471857 475510 477835
15138 477835 478805 480801 478918 475977 476951 481255 483504 483172 488069 485689 487554 487965 488172 486688 486799 485445
15122 485445 485200 485504 490415 492441 494400 492148 493361 488156 488527 495045 499142 500369 500698 496738 492422
15107 492422 492902 494439 497576 496390 501261 505576 502700 506016 508126 504717 506731 506874 503009 502500 506971
$$ packed form
15211D19337L466J784j058l22J685k060r59L183J497J712k747N267L144q16L615
15196D36728j369l855Q32K542o63M410M102j048k90L047m747m139N63P95J358
15181D38266M237L39j297O36q63p75N581M488J080j608m135m864J521Q601N707
15166D56914J001j549k042k325j346K611J698K196K190k901L294L269R05J127
15152D65042n19K328j541n959L902P265K100l840l934j081L375M719L653K325
15138D77835R70J996j883k941R74M304K249l32M897k380J865M11K07j484J11j354
15122D85445k45L04M911K026J959k252J213n205L71O518M097J227L29l960m316
15107D92422M80J537L137j186M871M315k876L316K110l409K014J43l865n09M471
$$ plain form
15092 506971 507377 507465 510710 511579 512243 512513 511811 507386 502476 505656 513422 521917 527136 525103 524486 523254
15076 523254 517810 513870 515077 520672 527602 527393 523599 519883 517654 518590 520164 519876 520939 525091 527406
15061 527406 531057 531629 534708 539221 535782 534464 528540 529253 532119 534314 531047 540148 548405 551424 548148
15046 548148 545275 544200 547154 546927 547098 546755 546922 545089 547245 552547 550629 550764 549291 550931 554869
15031 554869 555363 551601 548901 551021 552673 557737 557425 554642 554754 553527 555523 556771 556355 555834 549855
15016 549855 549631 552472 554609 560820 562446 560390 563030 564555 562746 560091 559673 562294 567266 571369 570956
15001 570956 569165 573925 576279 575179 575846 570452 567013 568591 572120 577988 579822 579865 576374 571801 573217
14986 573217 578900 578614 578381 579467 584611 583663 584358 585082 586469 585686 588422 589067 587290 586389 583378 582544
$$ packed form
15092E06971M06Q8L245Q69O64K70p02m425m910L180P766Q495N219k033o17j232
15076E23254n444l940J207N595O930k09l794l716k229R36J574k88J063M152K315
15061E27406L651N72L079M513l439j318n924P13K866K195l267R101Q257L019l276
15046E48148k873j075K954k27J71l43J67j833K156N302j918J35j473J640L938
15031E54869M94l762k700K120J652N064l12k783J12j227J996J248m16n21n979
15016E49855k24K841K137O211J626k056K640J525j809k655m18K621M972M103m13
15001E70956j791M760K354j100O67n394l439J578L529N868J834M3l491m573J416
14986E73217N683k86k33J086N144r48O95P24J387p83K736O45j777r01l011q34
$$ plain form
14970 582544 581701 578802 580410 588717 591752 588843 588858 591600 589619 594594 596310 595427 595971 599698 598614
14955 598614 599006 598210 596013 598710 603067 604352 603702 601961 601213 601045 596980 601629 605585 603347 603326 605711
14939 605711 605399 606435 608900 611630 614703 614988 611805 608656 606990 612964 615832 616097 617956 622354 619735
14924 619735 616706 615851 616908 618480 619555 619947 621283 618516 615522 618767 616733 619093 620597 619937 623970
14909 623970 623571 623605 622773 625679 626262 632892 636713 638563 639743 637276 634379 633929 631794 630733 632261 636256
14893 636256 638226 637905 639000 639012 635064 640435 645453 649807 652923 647093 647266 641666 641272 647286 644851
14878 644851 647315 651112 651705 652049 647183 650418 656525 657987 655950 655882 653975 652122 657981 660898 657180
14863 657180 655235 660621 665101 666006 662430 660948 659892 660926 664444 666563 665178 666381 668159 669202
$$ packed form
14970E82544q43k899J608Q307L035k909J5K742j981M975J716q83N44L727j084
14955E98614L92p96k197K697M357J285o50j741p48j68m065M649L956k238k1K385
14939F05711l12J036K465K730L073K85l183l149j666N974K868K65J859M398k619
14924F19735l029q55J057J572J075L92J336k767k994L245k034K360J504o60M033
14909F23970l99L4q32K906N83O630L821J850J180k467k897m50k135j061J528L995
14893F36256J970l21J095J2l948N371N018M354L116n830J73n600l94O014k435
14878F44851K464L797N93L44m866L235O107J462k037o8j907j853N859K917l718
14863F57180j945N386M480R05l576j482j056J034L518K119j385J203J778J043
$$ plain form
14849 669202 666847 667478 667811 663715 662241 663588 667105 673638 671883 673319 679108 674558 671992 672415 673627
14834 673627 676024 678702 685900 685618 686419 686008 690071 689864 690614 685781 685672 686382 686965 685607 688613 688675 688500
14817 688500 688780 687356 692298 691512 694704 694501 693082 692164 691265 695675 696623 698482 699728 697659 698209 697856
14801 697856 700087 701452 704873 707264 707831 709066 708978 708129 708047 710297 710548 708567 709317 706895 711197 710156
14785 710156 706548 704926 707497 717103 721578 720343 716241 713407 715736 718033 719408 721142 717507 717044
14771 717044 718354 719980 717341 716503 716414 720408 726530 724101 723306 727882 730549 727791 727730 727930 732204 733722
14755 733722 734160 736292 736342 734870 736055 734662 732923 737354 743044 745604 747794 745521 744521 745802 741571
14740 741571 740389 743213 745571 743859 743993 746912 750720 751010 752558 754234 753071 750758 749409 746146 753576
$$ packed form
14849F69202k355O31L33m096j474J347L517O533j755J436N789m550k566M23J212
14834F73627K397K678P198k82Q01m11M063k07P50m833j09P10N83j358L006O2j75
14817F88500K80j424M942p86L192k03j419r18q99M410R48J859J246k069N50l53
14801F97856K231J365L421K391N67J235q8q49q2K250K51j981P50k422M302j041
14785G10156l608j622K571R606M475j235m102k834K329K297J375J734l635m63
14771G17044J310J626k639q38q9L994O122k429p95M576K667k758o1K00M274J518
14755G33722M38K132N0j472J185j393j739M431N690K560K190k273j000J281m231
14740G41571j182K824K358j712J34K919L808K90J548J676j163k313j349l263P430
$$ plain form
14725 753576 758515 757849 758312 760860 758546 754664 755993 757887 762453 757799 759306 761048 761739 760632 759927
14710 759927 764504 769764 776596 776661 765789 762913 764697 768152 770111 772227 767972 767901 769306 772633 776268
14695 776268 777433 773766 771189 770358 776562 781298 782769 783256 781804 777517 775930 776519 781826 784830 780676
14680 780676 777549 784002 788324 793442 791301 790662 792395 795579 799841 797335 798415 801161 802976 803359 803124
14665 803124 802871 796034 792313 790779 791563 795428 802141 798936 798193 802782 801220 797189 797877 805393 804089
14650 804089 801933 808192 810518 806104 805443 809453 814977 815722 812384 808045 814899 816031 818016 817386 815454
14635 815454 822706 826508 825415 824786 828196 828768 826881 826206 831591 835572 827860 823817 821533 822853 825205
14620 825205 827856 828408 829111 832731 835863 837131 836089 837515 838820 842421 841271 839545 841109 841656 838867
$$ packed form
14725G53576M939o66M63K548k314l882J329J894M566m654J507J742O91j107p05
14710G59927M577N260O832O5j0872k876J784L455J959K116m255p1J405L327L635
14695G76268J165l667k577q31O204M736J471M87j452m287j587N89N307L004m154
14680G80676l127O453M322N118k141o39J733L184M262k506J080K746J815L83k35
14665H03124k53o837l721j534P84L865O713l205p43M589j562m031O88P516j304
14650H04089k156O259K326m414o61M010N524P45l338m339O854J132J985o30j932
14635H15454P252L802j093o29L410N72j887o75N385L981p712m043k284J320K352
14620H25205K651N52P03L620L132J268j042J426J305L601j150j726J564N47k789
$$ plain form
14605 838867 838955 843647 846393 843033 844836 844813 850924 852943 849861 847758 850483 852811 852764 849970 849422 848165
14589 848165 852250 852794 850998 850644 847952 849328 854904 855910 856300 859306 860900 864364 864077 861954 867317
14574 867317 863058 858897 856130 855645 851174 854611 860455 860885 863595 867103 867727 865099 864065 868290 876240
14559 876240 877445 875109 872606 874677 877844 879780 879323 877705 876956 877914 876831 878137 874991 876805 876112
14544 876112 879257 885149 887283 892680 890620 886064 888308 893583 897142 898829 899216 901348 903302 895760
14530 895760 892984 891525 891593 890939 891286 895470 902433 903273 905681 910799 908777 907579 905767 905867 906906 907335
14514 907335 903112 903823 906280 908068 912475 916025 921251 924696 925341 925417 924399 924316 919338 916134 915117 911600
14498 911600 914095 916198 923109 925324 927213 925926 920434 919217 920711 926319 926830 923780 923566 927260 932785
$$ packed form
14605H38867Q8M692K746l360J803k3O111K019l082k103K725K328m7k794n48j257
14589H48165M085N44j796l54k692J376N576J006L90L006J594L464k87k123N363
14574H67317m259m161k767m85m471L437N844M30K710L508O24k628j034M225P950
14559H76240J205k336k503K071L167J936m57j618p49R58j083J306l146J814o93
14544H76112L145N892K134N397k060m556K244N275L559J687L87K132J954p542
14530H95760k776j459O8o54L47M184O963Q40K408N118k022j198j812J00J039M29
14514I07335m223P11K457J788M407L550N226L445O45P6j018q3m978l204j017l517
14498I11600K495K103O911K215J889j287n492j217J494N608N11l050k14L694N525
$$ plain form
14483 932785 930505 927888 929533 932508 937496 938573 934668 936052 938527 941649 942936 945065 948285 946089
14469 946089 942008 937645 936829 937741 939152 947321 954832 954100 955501 957610 957320 958356 951677 950457 951400
14454 951400 950296 953316 951183 953710 960476 965818 968498 966771 965731 965162 965650 967888 968862 969173 965572
14439 965572 965134 965030 968039 971498 974532 975481 975464 974060 974215 974952 976444 979924 979061 975357 973037 974733
14423 974733 974707 973449 975464 979223 985783 988133 987733 985832 987900 987626 986717 988979 994033 998028 996497
14408 996497 1001633 998681 992769 993211 991081 993434 993270 994083 994778 1002036 1001132 999887 999576 1001516 1005914 1004408
14392 1004408 1005732 1007192 1005445 1009351 1008187 1008556 1009276 1013586 1016428 1016566 1013990 1013660 1015684 1014170 1011781
14377 1011781 1015567 1023288 1024093 1022679 1023779 1027194 1024794 1028610 1032526 1029208 1029528 1028022 1029573 1031901
$$ packed form
14483I32785k280k617J645K975M988J077l905J384K475L122J287K129L220k196
14469I46089m081m363q16R12J411Q169P511p32J401K109k90J036o679j220R43
14454I51400j104L020k133K527O766N342K680j727j040n69M88K238R74L11l601
14439I65572m38j04L009L459L034R49j7j404J55P37J492L480q63l704k320J696
14423I74733k6j258K015L759O560K350m00j901K068k74r09K262N054L995j531
14408I96497N136k952n912M42k130K353j64Q13O95P258r04j245l11J940M398j506
14392A004408J324J460j747L906j164L69P20M310K842J38k576l30K024j514k389
14377A011781L786P721Q05j414J100L415k400L816L916l318L20j506J551K328
$$ plain form
14363 1031901 1033734 1034485 1033245 1034512 1035086 1034472 1031559 1032605 1036637 1038467 1038291 1037391 1043628 1045179 1039441
14348 1039441 1034990 1036737 1035168 1040640 1043037 1043842 1046036 1044398 1043627 1046444 1046727 1047142 1051274 1059045 1057886
14333 1057886 1056931 1056347 1053855 1052290 1052104 1055379 1058641 1061929 1065563 1066472 1068498 1069203 1069114 1069555 1065792 1065258
14317 1065258 1067324 1074738 1076668 1078064 1077938 1078108 1083643 1084191 1081119 1076311 1080132 1077294 1075327 1080148 1081348
14302 1081348 1080496 1079192 1081273 1080993 1080523 1085630 1087573 1088927 1088786 1087079 1089575 1092747 1095751 1092886 1091480
14287 1091480 1089249 1088528 1092052 1098475 1100253 1094964 1098319 1102166 1102483 1101209 1102358 1106006 1107542 1108043 1110660
14272 1110660 1109824 1108735 1114543 1118289 1122890 1123564 1119756 1115988 1114863 1116199 1112873 1110979 1113711 1122832
14258 1122832 1126583 1127258 1122714 1122502 1125197 1127822 1124824 1119645 1119660 1117906 1126886 1128592 1130844 1132613 1135193
$$ packed form
14363A031901J833P51j240J267N74o14k913J046M032J830j76r00O237J551n738
14348A039441m451J747j569N472K397Q05K194j638p71K817K83M15M132P771j159
14333A057886r55n84k492j565j86L275L262L288L634R09K026P05q9M41l763n34
14317A065258K066P414J930J396j26J70N535N48l072m808L821k838j967M821J200
14302A081348q52j304K081k80m70N107J943J354j41j707K496L172L004k865j406
14287A091480k231p21L524O423J778n289L355L847L17j274J149L648J536N01K617
14272A110660q36j089N808L746M601O74l808l768j125J336l326j894K732R121
14258A122832L751O75m544k12K695K625k998n179J5j754Q980J706K252J769K580
$$ plain form
14243 1135193 1138322 1142771 1142593 1143712 1145673 1144641 1142640 1143272 1147298 1153856 1154409 1150544 1150819 1154594 1152332
14228 1152332 1151078 1154758 1153514 1152972 1150991 1151292 1151894 1151351 1149289 1150958 1151826 1156152 1161086 1167539 1170094
14213 1170094 1172209 1171796 1171839 1169768 1170730 1165804 1160910 1166404 1168147 1170793 1174125 1176816 1174803 1170180 1172256
14198 1172256 1171325 1171139 1173363 1175092 1176853 1182366 1182315 1182542 1176304 1178298 1180238 1183542 1187922 1190109 1189306
14183 1189306 1189868 1192430 1194506 1199434 1200276 1199942 1202212 1203983 1204616 1199247 1200839 1204956 1203473 1201680 1198971
14168 1198971 1200545 1207530 1210198 1208191 1212708 1209373 1210584 1217551 1219105 1220082 1218735 1217457 1221753 1223624
14154 1223624 1224060 1226609 1226482 1224610 1223388 1224822 1225150 1225534 1224391 1226206 1230268 1231298 1229498 1229907 1235379
14139 1235379 1237968 1241927 1243820 1239317 1230558 1229888 1235619 1241925 1247203 1247791 1243574 1248653 1247873 1249149 1245464
$$ packed form
14243A135193L129M449j78J119J961j032k001O32M026O558N53l865K75L775k262
14228A152332j254L680j244n42j981L01O02n43k062J669Q68M326M934O453K555
14213A170094K115m13M3k071R62m926m894N494J743K646L332K691k013m623K076
14198A172256r31j86K224J729J761N513n1K27o238J994J940L304M380K187q03
14183A189306N62K562K076M928Q42l34K270J771O33n369J592M117j483j793k709
14168A198971J574O985K668k007M517l335J211O967J554R77j347j278M296J871
14154A223624M36K549j27j872j222J434L28L84j143J815M062J030j800M09N472
14139A235379K589L959J893m503q759o70N731O306N278N88m217N079p80J276l685
$$ plain form
14124 1245464 1244433 1248426 1255240 1257211 1259088 1260574 1260126 1261120 1263146 1262617 1264248 1261581 1259872 1262774 1264312
14109 1264312 1263485 1263643 1265765 1265903 1269703 1271119 1272903 1271488 1270186 1271221 1273307 1276754 1280087 1276228 1272847
14094 1272847 1275297 1276976 1277669 1279950 1283048 1281433 1282399 1287724 1286443 1285846 1289467 1294778 1298613 1302104 1302179
14079 1302179 1302624 1303111 1304578 1308701 1315426 1317403 1313370 1307405 1308357 1306446 1303216 1309515 1314460 1318458 1320166
14064 1320166 1320113 1321451 1319541 1322837 1328236 1326337 1327683 1329130 1332239 1336906 1334780 1337057 1334171 1336149
14050 1336149 1339152 1338193 1334017 1334106 1332517 1335148 1342636 1347367 1346391 1348327 1346715 1346434 1343636 1346651 1353451
14035 1353451 1354575 1352978 1356576 1355007 1351965 1352016 1354034 1354947 1358421 1362247 1361659 1366588 1372541 1371506 1368096
14020 1368096 1369724 1377844 1375985 1370864 1369879 1370545 1370701 1371338 1372332 1372372 1377313 1382693 1386068 1389999 1393634 1392427
$$ packed form
14124A245464j031L993O814J971J877J486m48R94K026n29J631k667j709K902J538
14109A264312q27J58K122J38L800J416J784j415j302J035K086L447L333l859l381
14094A272847K450J679O93K281L098j615R66N325j281n97L621N311L835L491P5
14079A302179M45M87J467M123O725J977m033n965R52j911l230O299M945L998J708
14064A320166n3J338j910L296N399j899J346J447L109M667k126K277k886J978
14050A336149L003r59m176Q9j589K631P488M731r76J936j612k81k798L015O800
14035A353451J124j597L598j569l042N1K018R13L474L826n88M929N953j035l410
14020A368096J628Q120j859n121r85O66J56O37R94M0M941N380L375L931L635j207
$$ plain form
14004 1392427 1391804 1392367 1399072 1399837 1395207 1389231 1388709 1394307 1396485 1393448 1397723 1402046 1402670 1403340 1401336
13989 1401336 1402568 1405018 1409618 1408553 1409592 1413688 1420585 1418835 1418103 1420993 1422638 1419268 1420269 1420168
13975 1420168 1423536 1423572 1425320 1428412 1430999 1433183 1436600 1439099 1441973 1442250 1442923 1446994 1450772 1450678 1449818 1454241
13959 1454241 1455554 1455633 1458986 1461853 1462528 1461792 1460617 1463997 1465046 1465048 1465387 1464450 1461940 1458179 1463811 1465636
13943 1465636 1461888 1466563 1472716 1476904 1472403 1467890 1472414 1476705 1478922 1479229 1478803 1478120 1477591 1483699 1483327
13928 1483327 1485334 1483953 1482552 1483351 1487133 1487703 1487712 1491121 1497641 1493854 1495859 1501704 1500469 1497189 1503177
13913 1503177 1505786 1504537 1506403 1510188 1513956 1514397 1516703 1520377 1522569 1517160 1513334 1517896 1525228 1531389
13899 1531389 1531354 1528580 1531794 1532803 1537315 1541974 1540185 1536475 1533957 1537504 1543905 1547212 1554879 1559985
$$ packed form
14004A392427o23N63O705P65m630n976n22N598K178l037M275M323O24O70k004
13989A401336J232K450M600j065J039M096O897j750p32K890J645l370J001j01
13975A420168L368L6J748L092K587K184L417K499K874K77O73M071L778r4q60M423
13959A454241J313P9L353K867O75p36j175L380J049KL39r37k510l761N632J825
13943A465636l748M675O153M188m501m513M524M291K217L07m26o83n29O108l72
13928A483327K007j381j401P99L782N70RL409O520l787K005N845j235l280N988
13913A503177K609j249J866L785L768M41K306L674K192n409l826M562P332O161
13899A531389l5k774L214J009M512M659j789l710k518L547O401L307P667N106
$$ plain form
13885 1559985 1560156 1562332 1566895 1560858 1557517 1562676 1565436 1565810 1566388 1572721 1573824 1574903 1575033 1576737 1583168
13870 1583168 1587217 1582060 1577279 1571268 1564211 1561212 1559122 1559837 1564621 1564878 1567980 1572510 1572957 1580007 1584525
13855 1584525 1584456 1580514 1583944 1584511 1583333 1584591 1588797 1592086 1591604 1597555 1599644 1602717 1605096 1604692 1606079
13840 1606079 1609714 1609630 1611012 1616241 1617076 1615457 1617188 1618286 1619676 1619559 1621894 1624915 1624929 1624757 1629154 1634133
13824 1634133 1639751 1640957 1639873 1642806 1646470 1647783 1648787 1651626 1651091 1651567 1654004 1655867 1654729 1659063
13810 1659063 1659988 1662719 1670754 1671525 1668033 1668106 1667298 1670016 1674257 1674785 1678527 1682478 1685430 1685157 1677825 1674440
13794 1674440 1681997 1688401 1690591 1691395 1693500 1691838 1698461 1703114 1698398 1701418 1706632 1712455 1714002 1712617
13780 1712617 1712709 1710789 1711124 1712087 1712818 1712214 1716076 1721651 1725725 1730677 1728405 1723804 1725922 1731626 1739751
$$ packed form
13885A559985J71K176M563o037l341N159K760L74N78O333J103J079J30J704O431
13870A583168M049n157m781o011p057k999k090P15M784K57L102M530M47P050M518
13855A584525o9l942L430N67j178J258M206L289m82N951K089L073K379m04J387
13840A606079L635q4J382N229Q35j619J731J098J390j17K335L021J4j72M397M979
13824A634133N618J206j084K933L664J313J004K839n35M76K437J863j138M334
13810A659063R25K731Q035P71l492P3q08K718M241N28L742L951K952k73p332l385
13794A674440P557O404K190Q04K105j662O623M653m716L020N214N823J547j385
13780A712617R2j920L35R63P31o04L862N575M074M952k272m601K118N704Q125
$$ plain form
13765 1739751 1746758 1745914 1744387 1743461 1745103 1751316 1754165 1752816 1752763 1752605 1756931 1763251 1766065 1765808 1763215
13750 1763215 1764232 1767113 1773716 1778234 1776269 1779242 1784069 1784974 1785473 1784424 1784342 1783828 1787325 1790702 1789933
13735 1789933 1788885 1793281 1801687 1803471 1804729 1804454 1807819 1805757 1807089 1815600 1819668 1815601 1815862 1817289
13721 1817289 1819781 1821430 1823622 1826112 1825866 1830163 1831771 1832883 1838676 1840717 1845115 1847635 1848843 1853417
13707 1853417 1856056 1851569 1853094 1854194 1853802 1857188 1864507 1868439 1868764 1868232 1875126 1881753 1885041 1885244 1882951
13692 1882951 1894645 1897517 1895922 1893840 1898123 1901466 1902700 1901074 1901565 1906551 1909673 1908530 1912390 1914278
13678 1914278 1914730 1914457 1913527 1917850 1923957 1928270 1929160 1931099 1938515 1944702 1948615 1947924 1947457 1952646 1955045
13663 1955045 1954788 1959902 1966812 1973389 1980244 1985366 1984877 1984944 1991319 1992846 1992292 1995291 2004475 2009360 2009464
$$ packed form
13765A739751P007q44j527r26J642O213K849j349n3j58M326O320K814k57k593
13750A763215J017K881O603M518j965K973M827R05M99j049q2n14L497L377p69
13735A789933j048M396Q406J784J258k75L365k062J332Q511M068m067K61J427
13721A817289K492J649K192K490k46M297J608J112N793K041M398K520J208M574
13707A853417K639m487J525J100l92L386P319L932L25n32O894O627L288K03k293
13692A882951J1694K872j595k082M283L343J234j626M91M986L122j143L860J888
13678A914278M52k73r30M323O107M313Q90J939P416O187L913o91m67N189K399
13663A955045k57N114O910O577O855N122m89O7O375J527n54K999R184M885J04
$$ plain form
13648 2009464 2013360 2019386 2021879 2030587 2037513 2044504 2052671 2064761 2078692 2091893 2095786 2097426 2091454
13635 2091454 2075076 2053779 2025138 2001041 1972883 1945229 1926928 1917895 1921321 1932978 1939895 1952480
13623 1952480 1963293 1973353 1983125 1993921 1999568 2006730 2010222 2015985 2026406 2034766 2039345 2043288 2049964
13610 2049964 2060998 2065334 2069270 2080608 2097498 2109450 2123333 2130229 2129726 2126453 2119906 2102385 2079102
13597 2079102 2049130 2022621 1997326 1976787 1967387 1965927 1969902 1980462 1989878 1999250 2010377 2016385
13585 2016385 2024125 2032439 2041152 2043149 2047735 2059061 2064194 2068205 2070816 2073149 2077995 2085216 2092175 2093083
13571 2093083 2098567 2106827 2111337 2108995 2106541 2105585 2109995 2117017 2122779 2126600 2130311 2134486 2132995 2135795
13557 2135795 2140567 2140485 2143891 2149733 2153062 2155622 2161807 2167221 2172639 2170209 2168370 2171579 2177578 2185113
$$ packed form
13648B009464L896O026K493Q708O926O991Q167J2090J3931J3201L893J640n972
13635B091454j6378k1297k8641k4097k8158k7654j8301r033L426J1657O917J2585
13623A952480J0813J0060R772J0796N647P162L492N763J0421Q360M579L943O676
13610B049964J1034M336L936J1338J6890J1952J3883O896n03l273o547j7521k3283
13597B079102k9972k6509k5295k0539r400j460L975J0560R416R372J1127O008
13585B016385P740Q314Q713J997M586J1326N133M011K611K333M846P221O959R08
13571B093083N484Q260M510k342k454r56M410P022N762L821L711M175j491K800
13557B135795M772q2L406N842L329K560O185N414N418k430j839L209N999P535
$$ plain form
13543 2185113 2188487 2190507 2191242 2193175 2197042 2200966 2203166 2203638 2204882 2209479 2214434 2213291 2213608 2222042 2226107
13528 2226107 2229432 2230167 2231827 2235635 2241101 2242205 2243638 2244879 2250682 2257003 2265197 2265311 2263171 2263910 2268583
13513 2268583 2271883 2275891 2282225 2289007 2290869 2287817 2290716 2293994 2295263 2297914 2308085 2312824 2314506 2313957
13499 2313957 2318721 2322789 2322477 2328432 2329723 2332394 2336069 2338480 2341879 2347308 2348832 2350038 2353545 2353308
13485 2353308 2353602 2358085 2363585 2361584 2365459 2377226 2381094 2382773 2382867 2380342 2386512 2391744 2396340 2395927 2398320
13470 2398320 2403186 2406449 2410687 2413217 2416471 2419144 2417899 2419650 2424280 2431074 2432907 2434920 2435202 2441440
13456 2441440 2448732 2454388 2458338 2460578 2460083 2457361 2460239 2466991 2470431 2474532 2480690 2485117 2488081 2493896
13442 2493896 2494346 2499216 2503151 2508283 2512622 2515280 2522723 2524428 2524617 2525206 2529349 2535077 2540891 2544437 2549527
$$ packed form
13543B185113L374K020P35J933L867L924K200M72J244M597M955j143L17Q434M065
13528B226107L325P35J660L808N466J104J433J241N803O321Q194J14k140P39M673
13513B268583L300M008O334O782J862l052K899L278J269K651J0171M739J682n49
13499B313957M764M068l12N955J291K671L675K411L399N429J524J206L507k37
13485B353308K94M483N500k001L875J1767L868J679R4k525O170N232M596m13K393
13470B398320M866L263M238K530L254K673j245J751M630O794J833K013K82O238
13456B441440P292N656L950K240m95k722K878O752L440M101O158M427K964N815
13442B493896M50M870L935N132M339K658P443J705J89N89M143N728N814L546N090
$$ plain form
13427 2549527 2546202 2545400 2548145 2552997 2559431 2564207 2567000 2566144 2568214 2570514 2573223 2578685 2587438 2594492
13413 2594492 2596524 2598303 2604755 2606943 2607022 2605021 2608307 2614252 2621734 2630284 2631197 2635085 2641860 2650083 2651585
13398 2651585 2653398 2657974 2658466 2659762 2663865 2667216 2671067 2675985 2680517 2684488 2689654 2689127 2688578 2689700 2693328
13383 2693328 2697648 2709603 2718048 2720065 2719610 2726413 2735801 2743416 2748476 2746813 2746799 2747677 2752286 2758858 2761799
13368 2761799 2764577 2770041 2773087 2780234 2786299 2788928 2792637 2792180 2797671 2804792 2811847 2816824 2819263 2827444
13354 2827444 2829749 2830193 2832337 2839503 2845940 2855043 2859915 2864167 2869070 2873233 2873994 2871647 2873359 2884516
13340 2884516 2890367 2887802 2891015 2894751 2901177 2904259 2906697 2912026 2918154 2920290 2920857 2921758 2930437 2942465
13326 2942465 2952191 2955187 2958731 2963981 2972376 2979748 2984685 2985461 2987020 2993608 2997017 3002803 3007913 3014559
$$ packed form
13427B549527l325q02K745M852O434M776K793q56K070K300K709N462Q753P054
13413B594492K032J779O452K188P9k001L286N945P482Q550R13L888O775Q223J502
13398B651585J813M576M92J296M103L351L851M918M532L971N166n27n49J122L628
13383B693328M320J1955Q445K017m55O803R388P615N060j663j4Q78M609O572K941
13368B761799K778N464L046P147O065K629L709m57N491P121P055M977K439Q181
13354B827444K305M44K144P166O437R103M872M252M903M163P61k347J712J1157
13340B884516N851k565L213L736O426L082K438N329O128K136N67R01Q679J2028
13326B942465R726K996L544N250Q395P372M937P76J559O588L409N786N110O646
$$ plain form
13312 3014559 3016677 3020447 3029805 3036687 3040676 3043209 3042853 3047704 3052904 3058804 3067859 3074242 3081408 3082966
13298 3082966 3085543 3095590 3100514 3096450 3101560 3114269 3120869 3124997 3126530 3129783 3136698 3140514 3141186 3148641
13284 3148641 3153472 3156096 3160185 3164952 3175305 3183539 3190505 3195645 3200702 3204433 3208851 3216889 3227182
13271 3227182 3238019 3241087 3239513 3242788 3247731 3255578 3264497 3269228 3279013 3286237 3287195 3290838 3301807 3311356
13257 3311356 3317496 3324893 3325456 3329100 3334976 3340314 3340522 3342917 3348225 3357763 3366604 3373132 3377558 3384181
13243 3384181 3392318 3400078 3407603 3411776 3415980 3417884 3428805 3438960 3443060 3452011 3464347 3469587 3471495
13230 3471495 3470846 3474052 3480288 3487856 3497656 3504827 3512792 3518566 3521405 3524182 3534351 3543470 3546309 3552968
13216 3552968 3563049 3575574 3582425 3583850 3591330 3601943 3612207 3619378 3624550 3630572 3636482 3641684 3646483
$$ packed form
13312C014559K118L770R358O882L989K533l56M851N200N900R055O383P166J558
13298C082966K577J0047M924m064N110J2709O600M128J533L253O915L816O72P455
13284C148641M831K624M089M767J0353Q234O966N140N057L731M418Q038J0293
13271C227182J0837L068j574L275M943P847Q919M731R785P224R58L643J0969R549
13257C311356O140P397N63L644N876N338K08K395N308R538Q841O528M426O623
13243C384181Q137P760P525M173M204J904J0921J0155M100Q951J2336N240J908
13230C471495o49L206O236P568R800P171P965N774K839K777J0169R119K839O659
13216C552968J0081J2525O851J425P480J0613J0264P171N172O022N910N202M799
$$ plain form
13203 3646483 3656131 3664276 3670766 3679396 3685473 3692187 3700393 3706490 3711803 3713813 3716492 3727633 3739670
13190 3739670 3748719 3756816 3765683 3773601 3782367 3791918 3803709 3818364 3823814 3829132 3837242 3844427 3854812
13177 3854812 3865039 3874633 3880436 3888642 3894815 3904996 3917074 3930420 3942663 3951373 3958706 3965365 3976646
13164 3976646 3986259 3993132 4000038 4012452 4022358 4030067 4038732 4046931 4058600 4068041 4071063 4078817 4093918
13151 4093918 4105039 4110699 4117576 4131297 4147869 4162838 4179323 4185620 4197792 4210303 4222913 4235444
13139 4235444 4252587 4273560 4286169 4304356 4324980 4339011 4353997 4366254 4379074 4398537 4420033
13128 4420033 4443064 4464201 4483422 4509790 4538238 4559108 4584526 4614154 4648672 4691549 4741421
13117 4741421 4799692 4862734 4933153 5016159 5091755 5113799 5029481 4899021 4763425 4560953 4320470
$$ packed form
13203C646483R648Q145O490Q630O077O714Q206O097N313K010K679J1141J2037
13190C739670R049Q097Q867P918Q766R551J1791J4655N450N318Q110P185J0385
13177C854812J0227R594N803Q206O173J0181J2078J3346J2243Q710P333O659J1281
13164C976646R613O873O906J2414R906P709Q665Q199J1669R441L022P754J5101
13151D093918J1121N660O877J3721J6572J4969J6485O297J2172J2511J2610J2531
13139D235444J7143K0973J2609J8187K0624J4031J4986J2257J2820J9463K1496
13128D420033K3031K1137J9221K6368K8448K0870K5418K9628L4518M2877M9872
13117D741421N8271O3042P0419Q3006P5596K2044q4318j30460j35596k02472k40483
$$ plain form
13106 4320470 4132400 4009097 3894065 3830936 3866164 3949850 4040417 4119455 4184129 4239652 4285667
13095 4285667 4329776 4369306 4408665 4446327 4482241 4517958 4547368 4579781 4615493 4648188 4683998
13084 4683998 4717578 4746327 4782457 4825629 4868176 4906520 4940675 4982112 5031124 5091001 5169949
13073 5169949 5253899 5344648 5450918 5583704 5756743 5967930 6189841 6241248 5684071 4404539
13063 4404539 3325751 3075721 3250919 3486119 3686979 3835930 3950532 4051413 4139509
13054 4139509 4211512 4272951 4330557 4383966 4429910 4475018 4522039 4568013 4601435 4633658 4670672
13043 4670672 4705061 4734313 4755117 4776176 4801288 4829428 4855860 4873619 4889341 4907356 4928356
13032 4928356 4948989 4967357 4982802 5000849 5022473 5040226 5060091 5079689 5104417 5125065 5144185
$$ packed form
13106D320470j88070j23303j15032o3129L5228Q3686R0567P9038O4674N5523M6015
13095D285667M4109L9530L9359L7662L5914L5717K9410L2413L5712L2695L5810
13084D683998L3580K8749L6130M3172M2547L8344L4155M1437M9012N9877P8948
13073E169949Q3950R0749J06270J32786J73039K11187K21911N1407n57177j279532
13063D404539j078788k50030J75198K35200K00860J48951J14602J00881Q8096
13054D139509P2003O1439N7606N3409M5944M5108M7021M5974L3422L2223L7014
13043D670672L4389K9252K0804K1059K5112K8140K6432J7759J5722J8015K1000
13032D928356K0633J8368J5445J8047K1624J7753J9865J9598K4728K0648J9120
$$ plain form
13021 5144185 5161993 5178361 5196228 5217921 5238835 5259649 5281308 5293870 5311103 5325360 5344119
13010 5344119 5365968 5384354 5401241 5418495 5432846 5452656 5472883 5492228 5513222 5536333 5558087
12999 5558087 5575571 5594821 5611161 5626555 5641708 5659801 5677684 5691543 5706483 5723269 5747716
12988 5747716 5773028 5792815 5815507 5836727 5852243 5864815 5878122 5899237 5923769 5949421 5972607
12977 5972607 5991954 6016022 6039068 6060516 6089975 6118616 6132923 6146073 6168182 6194448 6224751
12966 6224751 6257075 6282384 6304192 6310724 6303307 6312766 6333488 6362387 6389265 6412940 6436152 6459689
12954 6459689 6489147 6516856 6553446 6587199 6619641 6646475 6668822 6685875 6699851 6714107 6729713
12943 6729713 6742183 6755350 6776443 6808124 6840046 6857821 6878090 6907872 6939332 6965070 6986564
$$ packed form
13021E144185J7808J6368J7867K1693K0914K0814K1659J2562J7233J4257J8759
13010E344119K1849J8386J6887J7254J4351J9810K0227J9345K0994K3111K1754
12999E558087J7484J9250J6340J5394J5153J8093J7883J3859J4940J6786K4447
12988E747716K5312J9787K2692K1220J5516J2572J3307K1115K4532K5652K3186
12977E972607J9347K4068K3046K1448K9459K8641J4307J3150K2109K6266L0303
12966F224751L2324K5309K1808O532p417R459K0722K8899K6878K3675K3212K3537
12954F459689K9458K7709L6590L3753L2442K6834K2347J7053J3976J4256J5606
12943F729713J2470J3167K1093L1681L1922J7775K0269K9782L1460K5738K1494
$$ plain form
12932 6986564 7009284 7030946 7050310 7069522 7094708 7117310 7146599 7181938 7225378 7261713 7307704
12921 7307704 7348073 7379798 7412896 7442467 7479530 7520615 7566104 7613643 7668898 7728358 7782314
12910 7782314 7842901 7913159 7991767 8089177 8195497 8289660 8276149 7948245 7462609 7274371
12900 7274371 7346584 7466601 7577125 7666809 7741777 7815511 7887651 7947074 7989630 8021194 8048517
12889 8048517 8074170 8099784 8134803 8178609 8227289 8278632 8321808 8353712 8395265 8439776 8486581
12878 8486581 8534675 8570324 8580072 8588837 8609054 8655532 8717526 8775640 8833851 8882790 8918261 8952329
12866 8952329 8989983 9026558 9065377 9109467 9159466 9218310 9274105 9332056 9395461 9461265 9518048
12855 9518048 9568797 9622865 9681263 9745165 9804505 9857042 9915520 9969337 10017909 10071163 10128462
$$ packed form
12932F986564K2720K1662J9364J9212K5186K2602K9289L5339M3440L6335M5991
12921G307704M0369L1725L3098K9571L7063M1085M5489M7539N5255N9460N3956
12910G782314O0587P0258P8608R7410J06320R4163j3511l27904m85636j88238
12900G274371P2213J20017J10524Q9684P4968P3734P2140N9423M2556L1564K7323
12889H048517K5653K5614L5019M3806M8680N1343M3176L1904M1553M4511M6805
12878H486581M8094L5649R748Q765K0217M6478O1994N8114N8211M8939L5471L4068
12866H952329L7654L6575L8819M4090M9999N8844N5795N7951O3405O5804N6783
12855I518048N0749N4068N8398O3902N9340N2537N8478N3817M8572N3254N7299
$$ plain form
12844 10128462 10181965 10238805 10295930 10355623 10414077 10470905 10515899 10564340 10619032 10673445 10730164
12833 10730164 10796873 10859031 10919454 10978855 11047524 11134834 11231284 11318035 11381898 11440763 11512513
12822 11512513 11595740 11682302 11767036 11849610 11927398 11985637 12035446 12089762 12148944 12218976 12293621
12811 12293621 12371497 12446239 12511702 12570472 12628160 12692750 12761888 12829322 12907343 12996782 13090883
12800 13090883 13201560 13321738 13437338 13545795 13655148 13763076 13867594 13970710 14083939
12791 14083939 14201340 14324388 14455154 14595369 14742172 14877474 14958505 14996404 15065428 15174319
12781 15174319 15303135 15447194 15598590 15755350 15912783 16072504 16235107 16397620 16554730
12772 16554730 16701687 16857573 17028130 17212967 17400168 17591515 17776183 17939317 18094241
$$ packed form
12844A0128462N3503N6840N7125N9693N8454N6828M4994M8441N4692N4413N6719
12833A0730164O6709O2158O0423N9401O8669Q7310R6450Q6751O3863N8865P1750
12822A1512513Q3227Q6562Q4734Q2574P7788N8239M9809N4316N9182P0032P4645
12811A2293621P7876P4742O5463N8770N7688O4590O9138O7434P8021Q9439R4101
12800A3090883J10677J20178J15600J08457J09353J07928J04518J03116J13229
12791A4083939J17401J23048J30766J40215J46803J35302Q1031L7899O9024J08891
12781A5174319J28816J44059J51396J56760J57433J59721J62603J62513J57110
12772A6554730J46957J55886J70557J84837J87201J91347J84668J63134J54924
$$ plain form
12763 18094241 18249706 18413673 18598783 18818490 19002097 19081371 19085510 19103933 19320807 19728882
12753 19728882 20123911 20339321 20407500 20484084 20664452 20949143 21243553 21518610 21797024 22093442
12743 22093442 22393080 22704761 23026050 23344333 23670773 24010909 24362761 24732696 25122528
12734 25122528 25520535 25928067 26344674 26768498 27202793 27648778 28111883 28600882 29106831
12725 29106831 29622382 30160377 30726781 31317261 31938471 32588785 33276260 34000933 34745154
12716 34745154 35534243 36393127 37304598 38263032 39286597 40386843 41561339 42818460 44169149
12707 44169149 45581721 47047265 48621705 50327990 52178675 54157908 56200729 58357775
12699 58357775 60797472 63524814 66560013 70039754 74047661 78631052 84077615 90698588
$$ packed form
12763A8094241J55465J63967J85110K19707J83607P9274M139J8423K16874M08075
12753A9728882L95029K15410O8179P6584J80368K84691K94410K75057K78414K96418
12743B2093442K99638L11681L21289L18283L26440L40136L51852L69935L89832
12734B5122528L98007M07532M16607M23824M34295M45985M63105M88999N05949
12725B9106831N15551N37995N66404N90480O21210O50314O87475P24673P44221
12716C4745154P89089Q58884R11471R58434J023565J100246J174496J257121J350689
12707D4169149J412572J465544J574440J706285J850685J979233K042821K157046
12699E8357775K439697K727342L035199L479741M007907M583391N446563O620973
$$ plain form
12691 90698588 98699554 108435159 120242246 133600255 145467647 147343891 130595248
12684 130595248 104481635 79233966 44283383 248332 -37096648 -62386955 -86901526
12677 -86901526 -105791300 -105768720 -93643202 -79695359 -67375725 -57095022 -48587061 -41424386
12669 -41424386 -35266469 -30020066 -25485925 -21343108 -17523299 -14037652 -10822728 -7802335
12661 -7802335 -4962723 -2239716 480533 3186840 5877393 8598415 11333292 14034204
12653 14034204 16692535 19343401 22058949 24889499 27838225 30859415 33951534 37213730
12645 37213730 40753910 44703793 49120888 53960451 59276258 65181083 71885749 79823050
12637 79823050 89384549 100738990 114039481 129467712 147426063 169606428 198355388
$$ packed form
12691I0698588Q000966R735605J1807087J3358009J1867392J876244j6748643
12684A30595248k6113613k5247669l4950583m4035051l7344980k5290307k4514571
12677h6901526j8889774K2580J2125518J3947843J2319634J0280703Q507961P162675
12669d1424386O157917N246403M534141M142817L819809L485647L214924L020393
12661g802335K839612K723007K720249K706307K690553K721022K734877K700912
12653A4034204K658331K650866K715548K830550K948726L021190L092119L262196
12645C7213730L540180L949883M417095M839563N315807N904825O704666P937301
12637G9823050R561499J1354441J3300491J5428231J7958351K2180365K8748960
$$ plain form
12630 198355388 232383790 259238705 239341698 114327561 -91501072 -248877753 -288854752
12623 -288854752 -265476632 -230823476 -200726596 -177704574 -160102432 -145204444 -132259262
12616 -132259262 -121363716 -112178649 -104191291 -97083620 -90890782 -85559891 -80898800 -76763861
12608 -76763861 -72979499 -69440436 -66187412 -63270802 -60679797 -58367425 -56274945 -54357957
12600 -54357957 -52571914 -50935148 -49455012 -48097162 -46787566 -45467093 -44215083 -43253942
12592 -43253942 -42579370 -41799402 -40832764 -39918181 -39101277 -38263915 -37373568 -36505564 -35694105
12583 -35694105 -34941716 -34245240 -33585538 -32932114 -32291100 -31667301 -31066694 -30511139 -30000920
12574 -30000920 -29511576 -29039353 -28591728 -28158031 -27723760 -27307629 -26915747 -26530910 -26144270
$$ packed form
12630A98355388L4028402K6854915j9897007j25014137k05828633j57376681l9976999
12623b88854752K3378120L4653156L0096880K3022022J7602142J4897988J2945182
12616a32259262J0895546R185067P987358P107671O192838N330891M661091M134939
12608g6763861L784362L539063L253024K916610K591005K312372K092480J916988
12600e4357957J786043J636766J480136J357850J309596J320473J252010R61141
12592d3253942O74572P79968R66638R14583Q16904Q37362Q90347Q68004Q11459
12583c5694105P52389O96476O59702O53424O41014O23799O00607N55555N10219
12574c0000920M89344M72223M47625M33697M34271M16131L91882L84837L86640
$$ plain form
12565 -26144270 -25762335 -25393215 -25034089 -24683882 -24346016 -24006547 -23667568 -23327749 -23017066
12556 -23017066 -22761503 -22536973 -22304792 -22051828 -21811825 -21583912 -21350160 -21095545 -20825231
12547 -20825231 -20546397 -20274947 -20039971 -19827414 -19609561 -19378879 -19155352 -18947115 -18749189
12538 -18749189 -18561526 -18386570 -18211976 -18028959 -17860719 -17702747 -17548118 -17388064 -17223629
12529 -17223629 -17064430 -16912223 -16754716 -16608793 -16467497 -16316771 -16165891 -16022528 -15884095
12520 -15884095 -15741652 -15614474 -15492098 -15363831 -15231311 -15092659 -14951855 -14811860 -14671954
12511 -14671954 -14533314 -14394457 -14251282 -14102828 -13988537 -13947408 -13983087 -14006366 -13925626 -13737812
12501 -13737812 -13556106 -13482340 -13505802 -13534506 -13506713 -13392700 -13194953 -13043730 -12986678 -12934695
$$ packed form
12565b6144270L81935L69120L59126L50207L37866L39469L38979L39819L10683
12556b3017066K55563K24530K32181K52964K40003K27913K33752K54615K70314
12547b0825231K78834K71450K34976K12557K17853K30682K23527K08237J97926
12538a8749189J87663J74956J74594J83017J68240J57972J54629J60054J64435
12529a7223629J59199J52207J57507J45923J41296J50726J50880J43363J38433
12520a5884095J42443J27178J22376J28267J32520J38652J40804J39995J39906
12511a4671954J38640J38857J43175J48454J14291M1129l5679k3279Q0740J87814
12501a3737812J81706P3766k3462k8704K7793J14013J97747J51223N7052N1983
$$ plain form
12491 -12934695 -12842988 -12722676 -12606665 -12493988 -12388597 -12294546 -12214527 -12151467 -12091037 -12022384
12481 -12022384 -11937462 -11839717 -11757462 -11697122 -11638639 -11574401 -11508475 -11442302 -11379125 -11314579 -11237539
12470 -11237539 -11146180 -11047094 -10955644 -10885289 -10833909 -10782667 -10721697 -10666113 -10613043 -10553730 -10488463
12459 -10488463 -10425359 -10360214 -10298618 -10243768 -10195100 -10146326 -10103656 -10065801 -10024341 -9978528 -9933381
12448 -9933381 -9877351 -9818394 -9755499 -9690762 -9626061 -9569762 -9520194 -9475550 -9438408 -9393076 -9349708
12437 -9349708 -9309308 -9260084 -9205315 -9158194 -9119411 -9085604 -9050591 -9019927 -8983649 -8927002 -8871183
12426 -8871183 -8836035 -8819837 -8798881 -8763558 -8716332 -8671591 -8635204 -8599063 -8553930 -8510603 -8471522
12415 -8471522 -8429383 -8376255 -8331687 -8294529 -8258189 -8215602 -8174319 -8138500 -8101767 -8059552 -8017516
$$ packed form
12491a2934695R1707J20312J16011J12677J05391R4051Q0019O3060O0430O8653
12481a2022384Q4922R7745Q2255O0340N8483O4238O5926O6173O3177O4546P7040
12470a1237539R1359R9086R1450P0355N1380N1242O0970N5584N3070N9313O5267
12459a0488463O3104O5145O1596N4850M8668M8774M2670L7855M1460M5813M5147
12448i933381N6030N8957O2895O4737O4701N6299M9568M4644L7142M5332M3368
12437i349708M0400M9224N4769M7121L8783L3807L5013L0664L6278N6647N5819
12426h871183L5148J6198K0956L5323M7226M4741L6387L6141M5133M3327L9081
12415h471522M2139N3128M4568L7158L6340M2587M1283L5819L6733M2215M2036
$$ plain form
12404 -8017516 -7976274 -7943127 -7911676 -7879417 -7847433 -7805091 -7764256 -7727905 -7698058 -7680723 -7668051
12393 -7668051 -7644147 -7619000 -7596252 -7569255 -7535874 -7506196 -7470637 -7425981 -7374187 -7326735 -7290307
12382 -7290307 -7264944 -7248248 -7228069 -7202907 -7169920 -7127508 -7092517 -7061683 -7030589 -6996711 -6973962
12371 -6973962 -6957095 -6950899 -6964254 -6960524 -6941008 -6920514 -6896741 -6871380 -6847278 -6818748 -6780529 -6738062
12359 -6738062 -6705713 -6685103 -6665195 -6642950 -6616770 -6590713 -6561793 -6537619 -6514977 -6497814 -6476938
12348 -6476938 -6449792 -6415157 -6386342 -6365454 -6338411 -6314128 -6287010 -6263307 -6237965 -6211017 -6188538
12337 -6188538 -6169869 -6151061 -6119987 -6095085 -6073878 -6048318 -6032956 -6024005 -6016066 -6003161 -5989902 -5970430
12325 -5970430 -5947765 -5929651 -5903537 -5883872 -5861231 -5840925 -5826800 -5811251 -5793812 -5776257 -5753297
$$ packed form
12404h017516M1242L3147L1451L2259L1984M2342M0835L6351K9847J7335J2672
12393g668051K3904K5147K2748K6997L3381K9678L5559M4656N1794M7452L6428
12382g290307K5363J6696K0179K5162L2987M2412L4991L0834L1094L3878K2749
12371f973962J6867O196j3355L730J9516K0494K3773K5361K4102K8530L8219M2467
12359f738062L2349K0610J9908K2245K6180K6057K8920K4174K2642J7163K0876
12348f476938K7146L4635K8815K0888K7043K4283K7118K3703K5342K6948K2479
12337f188538J8669J8808L1074K4902K1207K5560J5362Q951P939J2905J3259J9472
12325e970430K2665J8114K6114J9665K2641K0306J4125J5549J7439J7555K2960
$$ plain form
12314 -5753297 -5730041 -5704163 -5676964 -5659803 -5639526 -5618632 -5595845 -5575012 -5561394 -5542079 -5518087
12303 -5518087 -5498448 -5480873 -5467254 -5454285 -5443558 -5427050 -5401585 -5378666 -5356691 -5332709 -5311226
12292 -5311226 -5293134 -5271886 -5253863 -5233344 -5215642 -5199887 -5184861 -5176309 -5163962 -5144733 -5117446
12281 -5117446 -5088491 -5070218 -5056504 -5036290 -5017785 -4999629 -4980316 -4955720 -4928948 -4903565 -4879108
12270 -4879108 -4850617 -4828512 -4806208 -4776403 -4749550 -4723811 -4692379 -4662346 -4626647 -4593617 -4552453
12259 -4552453 -4501462 -4440404 -4363048 -4277459 -4191761 -4125299 -4131451 -4233330 -4359498 -4508966 -4727877
12248 -4727877 -4956149 -5121085 -5236973 -5348030 -5389726 -5340748 -5254385 -5169579 -5095541 -5030806
12238 -5030806 -4974804 -4932827 -4892804 -4859834 -4825229 -4791699 -4759804 -4737251 -4718295 -4698869 -4672824
$$ packed form
12314e753297K3256K5878K7199J7161K0277K0894K2787K0833J3618J9315K3992
12303e518087J9639J7575J3619J2969J0727J6508K5465K2919K1975K3982K1483
12292e311226J8092K1248J8023K0519J7702J5755J5026Q552J2347J9229K7287
12281e117446K8955J8273J3714K0214J8505J8156J9313K4596K6772K5383K4457
12270d879108K8491K2105K2304K9805K6853K5739L1432L0033L5699L3030M1164
12259d552453N0991O1058P7356Q5589Q5698O6462o152j01879j26168j49468k18911
12248d727877k28272j64936j15888j11057m1696M8978Q6363Q4806P4038O4735
12238e030806N6002M1977M0023L2970L4605L3530L1895K2553J8956J9426K6045
$$ plain form
12227 -4672824 -4642871 -4614701 -4587215 -4563354 -4542021 -4523149 -4503816 -4483638 -4467697 -4448077 -4421250
12216 -4421250 -4401572 -4384753 -4369362 -4346049 -4316833 -4292471 -4270561 -4251701 -4231548 -4213111 -4196366
12205 -4196366 -4176831 -4157905 -4137482 -4114614 -4085620 -4051899 -4016473 -3986631 -3952144 -3909183 -3865286
12194 -3865286 -3821395 -3771485 -3705527 -3628459 -3541598 -3441629 -3327948 -3179729 -2981029 -2749474
12184 -2749474 -2591919 -2846143 -3894598 -5199103 -5777070 -5717052 -5490363 -5276712 -5106521
12175 -5106521 -4979135 -4876941 -4786735 -4710601 -4644039 -4587453 -4537829 -4489857 -4451860 -4422413 -4392657
12164 -4392657 -4369943 -4344650 -4317098 -4295700 -4268659 -4245271 -4224332 -4212926 -4191927 -4170923 -4155399
12153 -4155399 -4142303 -4122536 -4108343 -4096164 -4078418 -4057059 -4040901 -4029796 -4018248 -4005910 -3994587
$$ packed form
12227d672824K9953K8170K7486K3861K1333J8872J9333K0178J5941J9620K6827
12216d421250J9678J6819J5391K3313K9216K4362K1910J8860K0153J8437J6745
12205d196366J9535J8926K0423K2868K8994L3721L5426K9842L4487M2961M3897
12194c865286M3891M9910O5958P7068Q6861R9969J13681J48219J98700K31555
12184b749474J57555k54224j048455j304505n77967O0018K26689K13651J70191
12175e106521J27386J02194R0206P6134O6562N6586M9624M7972L7997K9447K9756
12164d392657K2714K5293K7552K1398K7041K3388K0939J1406K0999K1004J5524
12153d155399J3096J9767J4193J2179J7746K1359J6158J1105J1548J2338J1323
$$ plain form
12142 -3994587 -3981134 -3967856 -3955225 -3944076 -3931436 -3913104 -3900131 -3888830 -3880124 -3874497 -3865034 -3853689
12130 -3853689 -3843428 -3832989 -3823841 -3814451 -3804508 -3793725 -3787947 -3781009 -3774191 -3767623 -3757916 -3746700 -3737160
12117 -3737160 -3724515 -3712992 -3706153 -3696768 -3688664 -3680778 -3673236 -3673008 -3672695 -3668769 -3660427 -3645799 -3633976
12104 -3633976 -3627244 -3619317 -3612415 -3601463 -3591242 -3583714 -3579237 -3576257 -3568624 -3560757 -3551742 -3544068 -3537000
12091 -3537000 -3530187 -3513655 -3498961 -3491204 -3483739 -3475721 -3468794 -3464778 -3463113 -3457513 -3452811 -3443785 -3431963
12078 -3431963 -3424742 -3416637 -3409280 -3401118 -3394739 -3391262 -3384590 -3374585 -3371919 -3370441 -3368048 -3359552 -3352800 -3346322
12064 -3346322 -3337447 -3335407 -3330655 -3323121 -3318135 -3304592 -3291583 -3276901 -3270297 -3266695 -3265489 -3259838 -3248786
12051 -3248786 -3236798 -3227980 -3223424 -3218770 -3214747 -3215162 -3212912 -3207282 -3198564 -3192418 -3188377 -3180926 -3175507 -3170389
$$ packed form
12142c994587J3453J3278J2631J1149J2640J8332J2973J1301Q706N627R463J1345
12130c853689J0261J0439R148R390R943J0783N778O938O818O568R707J1216R540
12117c737160J2645J1523O839R385Q104P886P542K28L13L926Q342J4628J1823
12104c633976O732P927O902J0952J0221P528M477K980P633P867R015P674P068
12091c537000O813J6532J4694P757P465Q018O927M016J665N600M702R026J1822
12078c431963P221Q105P357Q162O379L477O672J0005K666J478K393Q496O752O478
12064c346322Q875K040M752P534M986J3543J3009J4682O604L602J206N651J1052
12051c248786J1988Q818M556M654M023m15K250N630Q718O146M041P451N419N118
$$ plain form
12037 -3170389 -3167515 -3166009 -3163780 -3155533 -3148778 -3143041 -3134516 -3125839 -3121914 -3119043 -3117802 -3104958 -3100105 -3094891
12023 -3094891 -3088824 -3084910 -3082944 -3076505 -3072284 -3066976 -3055385 -3047345 -3042775 -3037512 -3035166 -3034798 -3031834 -3025446
12009 -3025446 -3016047 -3013884 -3010840 -3003184 -2995735 -2989165 -2983613 -2978335 -2971616 -2968954 -2961245 -2951954 -2942696 -2941256
11995 -2941256 -2939812 -2934462 -2930083 -2927141 -2920272 -2918271 -2911370 -2905502 -2900024 -2891914 -2889129 -2882737 -2875748 -2868658
11981 -2868658 -2866626 -2861236 -2856796 -2847260 -2844727 -2843554 -2832713 -2830704 -2835979 -2843565 -2846652 -2840273 -2831142 -2822762
11967 -2822762 -2814528 -2807504 -2797455 -2794950 -2788299 -2785624 -2781479 -2779565 -2776773 -2770549 -2766228 -2764228 -2759412 -2751650
11953 -2751650 -2744745 -2740909 -2738046 -2731068 -2724420 -2720449 -2714409 -2709703 -2705424 -2705433 -2703573 -2695822 -2695593 -2695786 -2689236
11938 -2689236 -2684615 -2682160 -2672995 -2667484 -2665576 -2663190 -2656549 -2651813 -2646993 -2645196 -2644088 -2643108 -2639490 -2636790
$$ packed form
12037c170389K874J506K229Q247O755N737Q525Q677L925K871J241J2844M853N214
12023c094891O067L914J966O439M221N308J1591Q040M570N263K346L68K964O388
12009c025446R399K163L044P656P449O570N552N278O719K662P709R291R258J440
11995b941256J444N350M379K942O869K001O901N868N478Q110K785O392O989P090
11981b868658K032N390M440R536K533J173J0841K009n275p586l087O379R131Q380
11967b822762Q234P024J0049K505O651K675M145J914K792O224M321K000M816P762
11953b751650O905L836K863O978O648L971O040M706M279rJ860P751K29j93O550
11938b689236M621K455R165N511J908K386O641M736M820J797J108R80L618K700
$$ plain form
11924 -2636790 -2634872 -2631281 -2628160 -2620277 -2615200 -2613281 -2609685 -2605445 -2598039 -2597819 -2593777 -2578672 -2570222 -2561059
11910 -2561059 -2552983 -2549351 -2546516 -2550062 -2549314 -2542973 -2539939 -2537374 -2531101 -2525269 -2526203 -2523699 -2522049 -2523629
11896 -2523629 -2519058 -2511157 -2505353 -2503430 -2501185 -2498367 -2493477 -2485287 -2480795 -2480200 -2471161 -2464041 -2463972 -2459790 -2461661
11881 -2461661 -2459151 -2455846 -2456861 -2454384 -2449156 -2447447 -2438193 -2436397 -2434438 -2432752 -2429126 -2425395 -2418609 -2417079
11867 -2417079 -2415058 -2406756 -2401897 -2396762 -2395274 -2394183 -2389750 -2380863 -2374430 -2375699 -2378606 -2376408 -2369781 -2363323
11853 -2363323 -2363618 -2363580 -2354069 -2348645 -2349024 -2350752 -2347765 -2344877 -2343455 -2338161 -2333405 -2324594 -2323571 -2324180 -2316461
11838 -2316461 -2311748 -2308025 -2302940 -2296958 -2294403 -2293548 -2293316 -2289481 -2279407 -2275061 -2274895 -2273756 -2277359 -2284427
11824 -2284427 -2286616 -2277906 -2266728 -2260576 -2255451 -2252603 -2248869 -2242403 -2236864 -2232989 -2233582 -2228195 -2221414 -2216284
$$ packed form
11924b636790J918L591L121P883N077J919L596M240P406K20M042J5105Q450R163
11910b561059Q076L632K835l546P48O341L034K565O273N832r34K504J650j580
11896b523629M571P901N804J923K245K818M890Q190M492N95R039P120O9M182j871
11881b461661K510L305j015K477N228J709R254J796J959J686L626L731O786J530
11867b417079K021Q302M859N135J488J091M433Q887O433j269k907K198O627O458
11853b363323k95L8R511N424l79j728K987K888J422N294M756Q811J023o09P719
11838b316461M713L723N085N982K555Q55K32L835J0074M346J66J139l603p068
11824b284427k189Q710J1178O152N125K848L734O466N539L875n93N387O781N130
$$ plain form
11810 -2216284 -2209559 -2207246 -2208706 -2214980 -2226281 -2235502 -2234789 -2230136 -2225150 -2221650 -2215545 -2215385 -2208537 -2199208
11796 -2199208 -2193983 -2188828 -2183470 -2183881 -2179025 -2175923 -2174041 -2174741 -2170004 -2170505 -2172067 -2166665 -2155009 -2145733
11782 -2145733 -2141081 -2137690 -2133582 -2135130 -2136089 -2133912 -2133110 -2133472 -2134692 -2134067 -2129423 -2126653 -2122779 -2115020 -2111286
11767 -2111286 -2110865 -2112143 -2110588 -2103807 -2095949 -2099197 -2097699 -2095302 -2093026 -2094562 -2091260 -2084901 -2079028 -2072498
11753 -2072498 -2071473 -2067662 -2064099 -2058377 -2057303 -2054157 -2053094 -2048718 -2043581 -2040505 -2037981 -2037290 -2041475 -2043678
11739 -2043678 -2042015 -2035457 -2031421 -2030472 -2023714 -2019217 -2021578 -2019520 -2012497 -2006547 -2004804 -2000844 -1999830 -2002826
11725 -2002826 -2000401 -1992338 -1992605 -1987219 -1985703 -1988324 -1985582 -1984501 -1978482 -1973098 -1973539 -1975481 -1973812 -1965705
11711 -1965705 -1962902 -1964176 -1958480 -1952691 -1949538 -1950563 -1953169 -1949605 -1942350 -1942061 -1942758 -1939920 -1938609 -1938336 -1935762
$$ packed form
11810b216284O725K313j460o274j1301r221P13M653M986L500O105J60O848R329
11796b199208N225N155N358m11M856L102J882p00M737n01j562N402J1656R276
11782b145733M652L391M108j548r59K177Q02l62j220O25M644K770L874P759L734
11767b111286M21j278J555O781P858l248J498K397K276j536L302O359N873O530
11753b072498J025L811L563N722J074L146J063M376N137L076K524O91m185k203
11739b043678J663O558M036R49O758M497k361K058P023N950J743L960J014k996
11725b002826K425Q063k67N386J516k621K742J081O019N384m41j942J669Q107
11711a965705K803j274N696N789L153j025k606L564P255K89o97K838J311K73K574
$$ plain form
11696 -1935762 -1935297 -1925756 -1919636 -1914618 -1915705 -1916886 -1915898 -1915027 -1912726 -1908794 -1905834 -1905306 -1901506 -1897683 -1896192
11681 -1896192 -1894145 -1893335 -1888887 -1885083 -1880206 -1885208 -1886487 -1879560 -1878732 -1877411 -1869747 -1863384 -1861023 -1859184
11667 -1859184 -1858275 -1858135 -1855151 -1852776 -1848990 -1846402 -1850330 -1850426 -1845640 -1843549 -1840054 -1838444 -1835797 -1829596 -1830796
11652 -1830796 -1833877 -1826423 -1821814 -1819888 -1815729 -1807528 -1807722 -1810335 -1808802 -1807092 -1804065 -1797770 -1794949 -1797318
11638 -1797318 -1798631 -1799581 -1793015 -1791388 -1791093 -1788104 -1781997 -1781171 -1779954 -1779097 -1775595 -1770175 -1771350 -1768737 -1762332
11623 -1762332 -1761092 -1763975 -1766166 -1764978 -1765666 -1760734 -1754178 -1751204 -1746218 -1742566 -1745142 -1742274 -1734235 -1729832
11609 -1729832 -1731914 -1736446 -1737568 -1732427 -1727328 -1726926 -1730990 -1725594 -1724752 -1721436 -1717458 -1715937 -1710074 -1708079
11595 -1708079 -1706411 -1704996 -1700557 -1696000 -1697016 -1699231 -1698442 -1694460 -1691665 -1691010 -1686602 -1682095 -1679863 -1679242 -1680656
$$ packed form
11696a935762M65R541O120N018j087j181R88Q71K301L932K960N28L800L823J491
11681a896192K047Q10M448L804M877n002j279O927Q28J321P664O363K361J839
11667a859184R09J40K984K375L786K588l928r6M786K091L495J610K647O201j200
11652a830796l081P454M609J926M159Q201j94k613J533J710L027O295K821k369
11638a797318j313r50O566J627K95K989O107Q26J217Q57L502N420j175K613O405
11623a762332J240k883k191J188o88M932O556K974M986L652k576K868Q039M403
11609a729832k082m532j122N141N099M02m064N396Q42L316L978J521N863J995
11595a708079J668J415M439M557j016k215P89L982K795O55M408M507K232O21j414
$$ plain form
11580 -1680656 -1678527 -1678779 -1680471 -1683608 -1685268 -1684011 -1676526 -1670135 -1669162 -1667147 -1665439 -1662601 -1659442 -1657058
11566 -1657058 -1649917 -1643896 -1641432 -1643054 -1646588 -1644017 -1641531 -1642791 -1642025 -1638346 -1633556 -1633994 -1633341 -1632017 -1625590
11551 -1625590 -1622520 -1624638 -1626686 -1627044 -1625117 -1622425 -1614961 -1612957 -1610297 -1608490 -1609285 -1610013 -1606191 -1603562 -1605296
11536 -1605296 -1605281 -1601857 -1597143 -1595430 -1593358 -1592419 -1590868 -1589815 -1585882 -1585940 -1582757 -1577126 -1571970 -1575906 -1581441
11521 -1581441 -1576044 -1571010 -1568454 -1566529 -1563234 -1564054 -1563409 -1560740 -1556486 -1555534 -1554687 -1554851 -1554026 -1550871 -1549093
11506 -1549093 -1548474 -1547507 -1546419 -1541282 -1537647 -1543551 -1539384 -1535023 -1532779 -1531628 -1528054 -1525427 -1520873 -1515253
11492 -1515253 -1511899 -1514970 -1520595 -1520955 -1520777 -1519865 -1514157 -1511216 -1509192 -1505338 -1502759 -1498155 -1502441 -1504935 -1495530
11477 -1495530 -1491810 -1491281 -1492626 -1494574 -1493219 -1484310 -1483649 -1481705 -1481875 -1481152 -1479705 -1476803 -1468537 -1468253 -1475683
$$ packed form
11580a680656K129k52j692l137j660J257P485O391R73K015J708K838L159K384
11566a657058P141O021K464j622l534K571K486j260P66L679M790m38O53J324O427
11551a625590L070k118k048l58J927K692P464K004K660J807p95p28L822K629j734
11536a605296J5L424M714J713K072R39J551J053L933n8L183N631N156l936n535
11521a581441N397N034K556J925L295q20O45K669M254R52Q47j64Q25L155J778
11506a549093O19R67J088N137L635n904M167M361K244J151L574K627M554N620
11492a515253L354l071n625l60J78R12N708K941K024L854K579M604m286k494R405
11477a495530L720N29j345j948J355Q909O61J944j70P23J447K902Q266K84p430
$$ plain form
11462 -1475683 -1477919 -1479312 -1473049 -1467743 -1471004 -1468213 -1468854 -1466583 -1461548 -1459124 -1454706 -1455690 -1450602 -1450914 -1456168
11447 -1456168 -1459014 -1453638 -1449690 -1448377 -1442818 -1440933 -1443823 -1437167 -1437715 -1441460 -1437084 -1433556 -1430743 -1433425
11433 -1433425 -1431811 -1434396 -1429549 -1423136 -1421930 -1424478 -1425364 -1421653 -1420922 -1418194 -1416556 -1417256 -1415548 -1409150 -1409302
11418 -1409302 -1409785 -1407081 -1407011 -1407150 -1402860 -1403197 -1402200 -1398949 -1396117 -1397331 -1393970 -1389893 -1389052 -1385941 -1384654 -1382022
11402 -1382022 -1380614 -1377555 -1374349 -1375350 -1379302 -1379224 -1378046 -1377440 -1370667 -1364740 -1365670 -1365359 -1366399 -1362967 -1356253
11387 -1356253 -1357329 -1360647 -1365466 -1367744 -1368362 -1365324 -1359056 -1357968 -1357219 -1351809 -1347238 -1342430 -1338315 -1340058
11373 -1340058 -1342859 -1341050 -1340558 -1342774 -1343245 -1341405 -1337964 -1337774 -1335030 -1336697 -1336609 -1330885 -1327966 -1325991 -1323471
11358 -1323471 -1323479 -1318933 -1320585 -1319084 -1317773 -1318910 -1314597 -1308605 -1302327 -1295507 -1294456 -1301539 -1302761 -1303190 -1302226
$$ packed form
11462a475683k236j393O263N306l261K791o41K271N035K424M418r84N088l12n254
11447a456168k846N376L948J313N559J885k890O656n48l745M376L528K813k682
11433a433425J614k585M847O413J206k548q86L711P31K728J638p00J708O398j52
11418a409302m83K704P0j39M290l37R97L251K832j214L361M077Q41L111J287K632
11402a382022J408L059L206j001l952P8J178O06O773N927r30L11j040L432O714
11387a356253j076l318m819k278o18L038O268J088P49N410M571M808M115j743
11373a340058k801J809M92k216m71J840L441J90K744j667Q8N724K919J975K520
11358a323471qM546j652J501J311j137M313N992O278O820J051p083j222m29R64
$$ plain form
11343 -1302226 -1297285 -1297656 -1294473 -1289275 -1289150 -1291859 -1291680 -1285767 -1286915 -1288683 -1286142 -1278779 -1280930 -1284003 -1278617
11328 -1278617 -1278988 -1282222 -1283408 -1279958 -1282017 -1279518 -1273143 -1269199 -1264701 -1267186 -1262707 -1265676 -1264052 -1263780
11314 -1263780 -1261882 -1263812 -1261161 -1254348 -1253859 -1255913 -1255037 -1255231 -1253863 -1252643 -1249321 -1247441 -1245816 -1247234 -1246589
11299 -1246589 -1246585 -1247824 -1249034 -1249074 -1247075 -1244979 -1237842 -1235184 -1237043 -1235337 -1233955 -1232954 -1228096 -1228700 -1229556 -1227708
11283 -1227708 -1225189 -1227199 -1222923 -1220556 -1221258 -1222883 -1220864 -1216612 -1215700 -1215370 -1211738 -1208507 -1209610 -1206224 -1202189
11268 -1202189 -1202470 -1201092 -1199774 -1198395 -1198133 -1199345 -1199138 -1196697 -1195343 -1195175 -1191875 -1194316 -1190931 -1188482 -1188958
11253 -1188958 -1185036 -1178960 -1180603 -1181543 -1180298 -1181010 -1182969 -1181282 -1179890 -1178321 -1176818 -1174397 -1172068 -1176888
11239 -1176888 -1175056 -1168416 -1161719 -1158053 -1156843 -1160228 -1163904 -1165795 -1162149 -1163046 -1165878 -1165654 -1163488 -1159297
$$ packed form
11343a302226M941l71L183N198J25k709J79N913j148j768K541P363k151l073N386
11328a278617l71l234j186L450k059K499O375L944M498k485M479k969J624K72
11314a263780J898j930K651O813M89k054Q76j94J368J220L322J880J625j418O45
11299a246589Mj239j210m0J999K096P137K658j859J706J382J001M858o04q56J848
11283a227708K519k010M276K367p02j625K019M252R12L30L632L231j103L386M035
11268a202189k81J378J318J379K62j212K07K441J354J68L300k441L385K449m76
11253a188958L922O076j643r40J245p12j959J687J392J569J503K421K329m820
11239a176888J832O640O697L666J210l385l676j891L646q97k832K24K166M191
$$ plain form
11225 -1159297 -1159562 -1160377 -1158934 -1155785 -1152807 -1152363 -1148043 -1150406 -1152431 -1152253 -1152223 -1149359 -1141264 -1135500 -1136628
11210 -1136628 -1137957 -1137393 -1140745 -1144213 -1143504 -1142256 -1141243 -1141124 -1134641 -1128916 -1127294 -1128632 -1131527 -1127643 -1122503
11195 -1122503 -1120718 -1121523 -1123555 -1120777 -1122210 -1119562 -1118222 -1118397 -1113290 -1116829 -1114066 -1112210 -1110104 -1108796
11181 -1108796 -1105891 -1101844 -1101450 -1102212 -1099978 -1100381 -1099139 -1096988 -1095304 -1094050 -1093927 -1093364 -1087917 -1085516 -1086756
11166 -1086756 -1084208 -1078755 -1076704 -1076367 -1082813 -1085918 -1090373 -1084110 -1077667 -1080289 -1079935 -1078975 -1077697 -1076829 -1072655
11151 -1072655 -1070048 -1071923 -1067772 -1068165 -1073626 -1073361 -1066426 -1061955 -1061246 -1062719 -1066308 -1066986 -1066263 -1062406 -1061935
11136 -1061935 -1059399 -1059453 -1057016 -1055211 -1054556 -1049783 -1046611 -1048339 -1049784 -1051125 -1047697 -1043246 -1043572 -1044156 -1042067
11121 -1042067 -1039442 -1033899 -1035362 -1036533 -1035356 -1038229 -1035260 -1028629 -1023725 -1025670 -1027869 -1028729 -1028084 -1027883 -1029399
$$ packed form
11225a159297k65q15J443L149K978M44M320k363k025J78L0K864Q095N764j128
11210a136628j329N64l352l468P09J248J013J19O483N725J622j338k895L884N140
11195a122503J785q05k032K778j433K648J340j75N107l539K763J856K106J308
11181a108796K905M047L94p62K234m03J242K151J684J254J23N63N447K401j240
11166a086756K548N453K051L37o446l105m455O263O443k622L54R60J278Q68M174
11151a072655K607j875M151l93n461K65O935M471P09j473l589o78P23L857M71
11136a061935K536n4K437J805O55M773L172j728j445j341L428M451l26n84K089
11121a042067K625N543j463j171J177k873K969O631M904j945k199q60O45K01j516
$$ plain form
11106 -1029399 -1028309 -1025497 -1022874 -1021065 -1021620 -1018730 -1016554 -1014157 -1011230 -1008353 -1006617 -1008114 -1014318 -1017294
11092 -1017294 -1012759 -1006088 -1002205 -1001395 -1003516 -1001979 -998633 -997772 -995356 -995505 -999030 -1001289 -998444 -994433 -991724
11077 -991724 -989975 -990220 -985123 -982137 -984409 -983876 -985995 -989270 -991361 -992156 -987644 -979439 -976960 -974603 -974199
11062 -974199 -973812 -973308 -971366 -969892 -976234 -979276 -979491 -977933 -973450 -971521 -969138 -968052 -968358 -967511 -967531 -965719
11046 -965719 -966378 -968392 -965862 -962367 -963716 -960840 -952518 -951456 -952947 -951153 -948599 -945670 -945786 -950789 -956547
11031 -956547 -954958 -951991 -948888 -945223 -944264 -951662 -954265 -954362 -954899 -955604 -951568 -943710 -939042 -936556 -933124
11016 -933124 -926877 -924434 -926911 -929119 -935924 -938523 -935840 -931323 -922776 -920121 -921598 -926718 -930592 -930280
11002 -930280 -928832 -923960 -923908 -921778 -920485 -914948 -913963 -914174 -912415 -909276 -912313 -910490 -908171 -905186 -907564
$$ packed form
11106a029399J090K812K623J809n55K890K176K397K927K877J736j497o204k976
11092a017294M535O671L883Q10k121J537L346Q61K416j49l525k259K845M011K709
11077i91724J749k45N097K986k272N33k119l275k091p95M512Q205K479K357M04
11062i74199L87N04J942J474o342l042k15J558M483J929K383J086l06Q47k0J812
11046i65719o59k014K530L495j349K876Q322J062j491J794K554K929j16n003n758
11031i56547J589K967L103L665R59p398k603r7n37p05M036P858M668K486L432
11016i33124O247K443k477k208o805k599K683M517Q547K655j477n120l874L12
11002i30280J448M872N2K130J293N537R85k11J759L139l037J823K319K985k378
$$ plain form
10987 -907564 -909442 -913349 -916951 -914233 -911323 -904782 -900532 -902539 -904032 -902376 -894447 -892391 -896419 -898808
10973 -898808 -897202 -896159 -889965 -886708 -887344 -889222 -887989 -885134 -881175 -882571 -879081 -878894 -879448 -880455 -880591
10958 -880591 -878764 -876677 -873644 -874217 -875579 -878633 -874736 -870832 -869514 -870267 -868277 -866605 -868080 -866336 -863175
10943 -863175 -861673 -862251 -859422 -857394 -852079 -850647 -854436 -857088 -856256 -853033 -845030 -840411 -838787 -842765 -844236
10928 -844236 -843958 -846871 -849348 -851663 -856725 -859873 -864858 -869256 -866810 -865905 -863572 -866400 -864557 -860225 -854755
10913 -854755 -853836 -850157 -847371 -848156 -842369 -838688 -837600 -832212 -833446 -832938 -830247 -830751 -830802 -829932 -833058 -838536
10897 -838536 -835665 -829676 -830050 -827764 -824624 -822016 -819405 -823890 -827503 -829395 -829078 -825966 -822896 -822348 -822961
10882 -822961 -822749 -825316 -826673 -825100 -821230 -817958 -821117 -821457 -820119 -821242 -815865 -814192 -809436 -806305 -806346
$$ packed form
10987i07564j878l907l602K718K910O541M250k007j493J656P929K056m028k389
10973h98808J606J043O194L257o36j878J233K855L959j396L490J87n54j007j36
10958h80591J827K087L033n73j362l054L897L904J318p53J990J672j475J744L161
10943h63175J502n78K829K028N315J432l789k652Q32L223Q003M619J624l978j471
10928h44236K78k913k477k315n062l148m985m398K446R05K333k828J843M332N470
10913h54755R19L679K786p85N787L681J088N388j234N08K691n04n1Q70l126n478
10897h38536K871N989l74K286L140K608K611m485l613j892L17L112L070N48o13
10882h22961K12k567j357J573L870L272l159l40J338j123N377J673M756L131m1
$$ plain form
10867 -806346 -808233 -811490 -813100 -807532 -798289 -794471 -798651 -798589 -794535 -793689 -791736 -787955 -789349 -790745 -786488
10852 -786488 -786617 -786173 -786147 -785989 -786302 -788036 -787668 -785548 -784997 -785790 -786293 -784286 -779626 -776445 -776491 -773076 -772992 -773546
10834 -773546 -777786 -779190 -778064 -777519 -774212 -768616 -764310 -767808 -769865 -763849 -760122 -760495 -764244 -767485 -770029
10819 -770029 -767100 -759877 -753008 -751620 -756213 -754069 -756610 -756775 -752314 -752974 -755352 -759110 -754605 -751714 -748037
10804 -748037 -748242 -746581 -742618 -740505 -743014 -743886 -743969 -739934 -741239 -742155 -743095 -744239 -734752 -730516 -734054 -733260
10788 -733260 -729844 -730308 -732793 -736787 -734998 -732691 -729961 -731592 -730230 -730234 -730024 -730614 -731933 -736481 -735136 -728672
10772 -728672 -721897 -717196 -719130 -724358 -724632 -719632 -719308 -724953 -723442 -718828 -715508 -714941 -712244 -712771 -714455
10757 -714455 -712108 -713997 -709209 -709742 -709917 -705983 -703851 -698718 -698984 -700282 -695461 -700623 -699148 -691661 -691095
$$ packed form
10867h06346j887l257j610N568R243L818m180O2M054Q46J953L781j394j396M257
10852g86488j29M44K6J58l13j734L68K120N51p93n03K007M660L181m6L415Q4n54
10834g73546m240j404J126N45L307N596M306l498k057O016L727l73l749l241k544
10819g70029K929P223O869J388m593K144k541j65M461o60k378l758M505K891L677
10804g48037k05J661L963K113k509q72q3M035j305r16r40j144R487M236l538P94
10788g33260L416m64k485l994J789K307K730j631J362mK10n90j319m548J345O464
10772g28672O775M701j934n228k74N000L24n645J511M614L320N67K697n27j684
10757g14455K347j889M788n33j75L934K132N133k66j298M821n162J475P487N66
$$ plain form
10742 -691095 -689913 -691706 -693425 -690569 -684351 -683634 -683224 -686526 -688898 -686612 -688884 -688885 -692546 -687857 -688453 -686163
10726 -686163 -685978 -689031 -687884 -684446 -681318 -680606 -678834 -677829 -676363 -677653 -671522 -674370 -675108 -671741 -667350
10711 -667350 -659505 -657691 -660337 -662380 -661962 -661803 -665512 -672954 -674151 -666651 -662337 -663078 -659896 -660991 -664971
10696 -664971 -667862 -669980 -665439 -659773 -655594 -655528 -658321 -656160 -651826 -648371 -646859 -644912 -649369 -648055 -648442
10681 -648442 -648153 -649153 -649936 -647875 -643058 -639951 -639352 -641657 -645431 -651753 -649375 -647154 -643861 -643125 -640959
10666 -640959 -635506 -628769 -629854 -631680 -630764 -625725 -625004 -626716 -634450 -638974 -635512 -633864 -633771 -631392 -626339
10651 -626339 -623169 -625858 -626929 -623308 -622441 -623762 -623503 -620974 -620649 -616702 -615340 -621068 -618719 -618425 -613956
10636 -613956 -613440 -610438 -611041 -607044 -604099 -602124 -600471 -600874 -603834 -604411 -601318 -602235 -604313 -609475 -616482
$$ packed form
10742f91095J182j793j719K856O218P17M10l302k372K286k272jl661M689n96K290
10726f86163J85l053J147L438L128P12J772J005J466j290O131k848p38L367M391
10711f67350P845J814k646k043M18J59l709p442j197P500M314p41L182j095l980
10696f64971k891k118M541N666M179O6k793K161M334L455J512J947m457J314l87
10681f48442K89j000p83K061M817L107N99k305l774o322K378K221L293P36K166
10666f40959N453O737j085j826R16N039P21j712p734m524L462J648R3K379N053
10651f26339L170k689j071L621Q67j321K59K529L25L947J362n728K349K94M469
10636f13956N16L002o03L997K945J975J653m03k960n77L093r17k078n162p007
$$ plain form
10621 -616482 -615137 -609154 -604300 -604463 -602721 -597070 -593313 -597059 -598930 -599628 -593758 -591411 -587678 -587453 -590361
10606 -590361 -592645 -590442 -587975 -586460 -583269 -586154 -588684 -588492 -586189 -583825 -582134 -578937 -573930 -573310 -578856
10591 -578856 -577608 -572752 -569401 -567466 -570531 -571664 -571306 -566020 -566074 -568235 -573691 -570939 -560190 -556283 -556246
10576 -556246 -557563 -555326 -553709 -557965 -565549 -563559 -559735 -564985 -565283 -562355 -563026 -558536 -554536 -547050 -541491
10561 -541491 -539362 -543969 -550106 -547971 -546939 -544209 -545733 -551522 -547770 -546072 -546966 -542445 -539779 -536199
10547 -536199 -531283 -531559 -535032 -536077 -534065 -536934 -539405 -536482 -535715 -536942 -534793 -534767 -534171 -533879 -533599 -532755
10531 -532755 -532596 -533686 -531517 -527062 -526098 -528279 -528459 -530377 -529002 -529041 -526742 -525443 -520869 -517873 -519228
10516 -519228 -516536 -515378 -517489 -514674 -516970 -517327 -515508 -512816 -511970 -513161 -513927 -508608 -506416 -509024 -512438
$$ packed form
10621f16482J345N983M854j63J742N651L757l746j871o98N870K347L733K25k908
10606e90361k284K203K467J515L191k885k530J92K303K364J691L197N007O20n546
10591e78856J248M856L351J935l065j133L58N286n4k161n456K752J0749L907L7
10576e56246j317K237J617m256p584J990L824n250k98K928o71M490M000P486N559
10561e41491K129m607o137K135J032K730j524n789L752J698q94M521K666L580
10547e36199M916k76l473j045K012k869k471K923P67j227K149K6N96K92K80Q44
10531e32755J59j090K169M455R64k181j80j918J375l9K299J299M574K996j355
10516e19228K692J158k111K815k296l57J819K692Q46j191p66N319K192k608l414
$$ plain form
10501 -512438 -511830 -505413 -504619 -502475 -503152 -506151 -502950 -504138 -503834 -499869 -498820 -498725 -495982 -491444 -482890 -480710
10485 -480710 -484962 -483637 -479651 -477457 -480636 -481658 -480673 -483124 -482383 -479801 -476919 -473304 -469711 -469931 -474556
10470 -474556 -474638 -469572 -466565 -460999 -459951 -458800 -458998 -454319 -450003 -452643 -461319 -469927 -474788 -469222 -464214
10455 -464214 -467303 -473197 -480654 -479725 -474765 -474244 -473112 -470540 -466903 -470985 -474472 -474216 -473389 -475108 -471042
10440 -471042 -469766 -465241 -458334 -448841 -442238 -440908 -440311 -438866 -441059 -444540 -448545 -448820 -449374 -447268 -440919
10425 -440919 -443349 -450850 -450874 -447970 -444431 -440842 -437536 -433872 -435422 -441156 -442158 -442953 -442213 -443366 -441949
10410 -441949 -441118 -446127 -445095 -444586 -439193 -437115 -434614 -428806 -427555 -432242 -431090 -425719 -425043 -426740 -425556
10395 -425556 -423129 -424604 -421141 -418089 -420222 -420310 -419148 -419402 -419614 -417124 -419456 -420022 -421824 -420352 -418945
$$ packed form
10501e12438O08O417P94K144o77k999L201j188L04L965J049R5K743M538Q554K180
10485d80710m252J325L986K194l179j022R85k451P41K582K882L615L593k20m625
10470d74556q2N066L007N566J048J151j98M679M316k640q676q608m861N566N008
10455d64214l089n894p457R29M960N21J132K572L637m082l487K56Q27j719M066
10440d71042J276M525O907R493O603J330N97J445k193l481m005k75n54K106O349
10425d40919k430p501k4K904L539L589L306L664j550n734j002p95P40j153J417
10410d41949Q31n009J032N09N393K078K501N808J251m687J152N371O76j697J184
10395d25556K427j475L463L052k133q8J162k54k12K490k332n66j802J472J407
$$ plain form
10380 -418945 -417816 -413053 -411177 -414412 -414440 -409967 -409092 -404474 -402081 -402614 -402846 -405201 -404346 -403941 -403732 -400224
10364 -400224 -400076 -400493 -394553 -385212 -388777 -388565 -384379 -389162 -392655 -390517 -385443 -387704 -390072 -395706 -395751
10349 -395751 -393651 -391378 -387389 -387950 -384497 -385283 -386825 -381657 -374683 -376324 -379287 -379468 -376162 -370636 -369099
10334 -369099 -368861 -371275 -369801 -368873 -370682 -371530 -367788 -362339 -364110 -366463 -367412 -367221 -368316 -364957 -358945
10319 -358945 -352149 -347074 -346538 -351088 -353476 -356191 -355262 -354437 -352579 -353251 -352617 -355657 -352355 -350089 -348769
10304 -348769 -344177 -345229 -342611 -343764 -349155 -344784 -340591 -340086 -338693 -332790 -330447 -328502 -325881 -328094
10290 -328094 -331840 -333517 -330624 -327335 -322464 -322023 -321775 -317503 -320662 -322899 -324318 -328113 -328570 -323937 -321780
10275 -321780 -322069 -322308 -324171 -324261 -320884 -316745 -312402 -311214 -308392 -310869 -310880 -308068 -305719 -306793 -309274 -309892
$$ packed form
10380d18945J129M763J876l235k8M473Q75M618K393n33k32k355Q55M05K09L508
10364d00224J48m17N940R341l565K12M186m783l493K138N074k261k368n634m5
10349c95751K100K273L989n61L453p86j542N168O974j641k963j81L306N526J537
10334c69099K38k414J474R28j809q48L742N449j771k353r49J91j095L359O012
10319c58945O796N075N36m550k388k715R29Q25J858o72O34l040L302K266J320
10304c48769M592j052K618j153n391M371M193N05J393N903K343J945K621k213
10290c28094l746j677K893L289M871M41K48M272l159k237j419l795m57M633K157
10275c21780k89k39j863r0L377M139M343J188K822k477j1K812K349j074k481o18
$$ plain form
10259 -309892 -309419 -308417 -305946 -300933 -297390 -294752 -295794 -291819 -293862 -297267 -297920 -293329 -287497 -288142 -286463
10244 -286463 -289260 -289886 -288515 -281611 -271779 -271736 -277866 -280209 -276593 -271174 -272965 -276724 -275028 -270503 -270664
10229 -270664 -269438 -268812 -267272 -265931 -262820 -263731 -263996 -264183 -260736 -259691 -257519 -256482 -255111 -256459 -254944
10214 -254944 -255899 -250179 -240668 -232780 -224441 -216225 -206353 -198582 -192956 -195309 -209043 -216640 -223775 -248109
10200 -248109 -283098 -298405 -306321 -319242 -327397 -326114 -317462 -310920 -304864 -293919 -284204 -278424 -274195
10187 -274195 -272491 -268904 -267120 -265820 -265347 -261399 -258591 -250738 -250978 -252387 -251389 -250294 -250644 -250061 -246938
10172 -246938 -240459 -237144 -239050 -240960 -232925 -226641 -227175 -224025 -223346 -220387 -216984 -211452 -211834 -208892 -204056
10157 -204056 -201276 -199907 -200483 -197200 -193015 -189603 -185399 -188052 -182965 -177080 -166462 -159329 -152667 -139886
$$ packed form
10259c09892M73J002K471N013L543K638j042L975k043l405o53M591N832o45J679
10244b86463k797o26J371O904R832M3o130k343L616N419j791l759J696M525j61
10229b70664J226O26J540J341L111r11k65j87L447J045K172J037J371j348J515
10214b54944r55N720R511P888Q339Q216R872P771N626k353j3734p597p135k4334
10200b48109l4989j5307p916j2921q155J283Q652O542O056J0945R715N780M229
10187b74195J704L587J784J300M73L948K808P853k40j409R98J095l50N83L123
10172b46938O479L315j906j910Q035O284n34L150O79K959L403N532l82K942M836
10157b04056K780J369n76L283M185L412M204k653N087N885J0618P133O662J2781
$$ plain form
10143 -139886 -132108 -121674 -112535 -113499 -116785 -117164 -113797 -112521 -129999 -151902 -173334 -194187 -223930
10130 -223930 -255184 -278967 -295282 -309468 -324968 -339556 -345431 -336485 -321935 -306740 -296424 -286632
10118 -286632 -280075 -273430 -266190 -262845 -259614 -253507 -248234 -245402 -241415 -237512 -237282 -236489 -232611 -231422 -236960
10103 -236960 -237317 -234309 -230348 -223669 -217429 -214304 -213145 -208112 -209313 -206988 -201292 -197376 -197494 -201139 -203765
10088 -203765 -203264 -201351 -197213 -194317 -192189 -191933 -191938 -189047 -184981 -182062 -177621 -171638 -170769 -173900 -176160 -177189
10072 -177189 -176164 -177451 -174459 -173566 -172920 -169156 -169078 -172153 -174780 -170955 -166984 -165737 -168538 -165763 -161439
10057 -161439 -158452 -160360 -162222 -166221 -165891 -163968 -159611 -152404 -147721 -147518 -148078 -150248 -147793 -145838 -142306
10042 -142306 -138902 -137168 -138382 -138882 -138677 -138168 -135799 -130032 -127527 -125520 -120410 -115031 -120171 -124512 -124605
$$ packed form
10143a39886P778J0434R139r64l286l79L367J276j7478k1903k1432k0853k9743
10130b23930l1254k3783j6315j4186j5500j4588n875Q946J4550J5195J0316R792
10118b86632O557O645P240L345L231O107N273K832L987L903K30P93L878J189n538
10103b36960l57L008L961O679O240L125J159N033j201K325N696L916j18l645k626
10088b03765N01J913M138K896K128K56nK891M066K919M441N983Q69l131k260j029
10072a77189J025j287K992Q93O46L764P8l075k627L825L971J247k801K775M324
10057a61439K987j908j862l999L30J923M357P207M683K03n60k170K455J955L532
10042a42306L404J734j214n00K05N09K369N767K505K007N110N379n140m341r3
$$ plain form
10027 -124605 -118574 -113647 -117611 -117395 -115267 -116803 -112396 -104980 -102614 -99172 -96544 -95327 -99578 -112270
10013 -112270 -123010 -122782 -117791 -118009 -118068 -118256 -115059 -110004 -110449 -112526 -114191 -106321 -99041 -92393 -89369
9998 -89369 -88867 -88321 -90256 -89514 -93050 -90771 -87418 -84091 -84256 -83386 -81163 -82610 -75837 -79024 -81424 -75215
9982 -75215 -67318 -68360 -69741 -71355 -68572 -67713 -69889 -71134 -70298 -68467 -69525 -66353 -63013 -64846 -64223
9967 -64223 -58485 -55377 -56117 -60421 -60387 -59944 -57550 -53222 -46760 -45842 -47308 -45710 -42938 -44228 -40828 -40620
9951 -40620 -38735 -36894 -32796 -28456 -26766 -24383 -19834 -17899 -20999 -19913 -15246 -14824 -23938 -22604 -14878
9936 -14878 -14608 -6408 -2315 -1843 -1354 325 3046 8370 12503 21107 30698 35451 35547 32943 20339 -8640
9920 -8640 -36283 -48849 -49359 -45200 -39378 -33622 -28068 -26141 -24729 -20302 -23544 -20867 -14551 -7641 -7069
$$ packed form
10027a24605O031M927l964K16K128j536M407P416K366L442K628J217m251j2692
10013a12270j0740K28M991k18n9j88L197N055m45k077j665P870P280O648L024
9998h9369N02N46j935P42l536K279L353L327j65Q70K223j447O773l187k400O209
9982g5215P897j042j381j614K783Q59k176j245Q36J831j058L172L340j833O23
9967f4223N738L108p40m304L4M43K394M328O462R18j466J598K772j290L400K08
9951d0620J885J841M098M340J690K383M549J935l100J086M667M22r114J334P726
9936a4878K70Q200M093M72M89J679K721N324M133Q604R591M753R6k604j2604k8979
9920h640k7643j2566n10M159N822N756N554J927J412M427l242K677O316O910N72
$$ plain form
9905 -7069 -4369 -4067 -1119 4772 4668 11750 12138 12334 13869 15373 18869 19571 20807 20416 18736 19301 22271
9888 22271 28302 27752 26036 29453 34032 34746 34949 37842 38751 40247 38870 40898 42099 43833 49598 54973
9872 54973 54544 55212 56601 56667 54942 58000 64246 65207 65355 66524 68577 71033 70865 69151 69142 67000 64663
9855 64663 71617 79043 73865 69253 73079 77029 79186 79469 84200 88329 89541 92532 97088 95906 96487
9840 96487 95573 98980 100029 100574 101423 104231 105929 109912 112041 111371 107659 107310 111035 118394 119753 122169
9824 122169 124839 127100 125612 122979 126049 128537 130275 133299 137393 139161 140464 146343 148634 151025
9810 151025 148626 145744 147102 149273 155624 156099 159201 161600 164324 168456 174293 174048 177708 180750 179522
9795 179522 176899 176493 173339 176801 184433 187451 187427 190183 194780 199157 197136 204648 210748 214429 212277
$$ packed form
9905g069K700L02K948N891j04P082L88J96J535J504L496P02J236l91j680N65K970
9888B2271O031n50j716L417M579P14K03K893R09J496j377K028J201J734N765N375
9872E4973m29O68J389O6j725L058O246R61J48J169K053K456j68j714rk142k337
9855F4663O954P426n178m612L826L950K157K83M731M129J212K991M556j182N81
9840I6487r14L407J049N45Q49K808J698L983K129o70l712l49L725P359J359K416
9824A22169K670K261j488k633L070K488J738L024M094J768J303N879K291K391
9810A51025k399k882J358K171O351M75L102K399K724M132N837k45L660L042j228
9795A79522k623m06l154L462P632L018k4K756M597M377k021P512O100L681k152
$$ plain form
9780 212277 213999 220900 228819 233547 235424 237774 239397 240279 236320 237705 238346 244137 253462 253498 249093
9765 249093 242948 242883 247233 258979 267781 273790 276681 279033 283120 292566 299096 304575 307833 313080 322046
9750 322046 328181 338134 349378 362985 373400 384363 407003 433726 460059 479978 476513 395520
9738 395520 248298 161302 159489 189107 219748 243658 266513 281880 296798 309261 322711 342755
9726 342755 367221 383846 399603 416995 441282 469748 505613 549703 604510 651731 676805 644172
9714 644172 530633 337123 125429 -33495 -111138 -119572 -80917 -28939 16946 56772 91552
9703 91552 119054 136296 156616 179063 197679 208498 225517 241894 255158 267867 279286 280592
9691 280592 275635 269811 266276 261301 253367 249684 257288 270217 282462 293009 298109 310346 318176
$$ packed form
9780B12277J722O901P919M728J877K350J623Q82l959J385O41N791R325L6m405
9765B49093o145o5M350J1746Q802O009K891K352M087R446O530N479L258N247Q966
9750C22046O135R953J1244J3607J0415J0963K2640K6723K6333J9919l465q0993
9738C95520j47222q6996j813K9618L0641K3910K2855J5367J4918J2463J3450K0044
9726C42755K4466J6625J5757J7392K4287K8466L5865M4090N4807M7221K5074l2633
9714F44172j13539j93510k11694j58924p7643q434L8655N1978M5885L9826L4780
9703I1552K7502J7242K0320K2447J8616J0819J7019J6377J3264J2709J1419J306
9691B80592m957n824l535m975p934l683P604J2929J2245J0547N100J2237P830
$$ plain form
9678 318176 323846 330824 336377 338484 345367 354235 361773 368253 377008 386087 391222 396173 397684 406425
9664 406425 417796 427054 436382 446692 454232 460842 465268 473164 484237 487391 491921 503848 513799
9651 513799 521792 537742 550276 562879 572979 587784 604132 618836 629660 643176 661049 679485
9639 679485 699135 717433 741290 768804 790451 812487 844077 881155 917476 953866 984948 1018584
9627 1018584 1055233 1067866 1039301 1040100 1098485 1187594 1295863 1424037 1572305 1745182 1960641
9616 1960641 2232753 2576399 2986723 3362083 3242438 1823519 -670903 -2476264 -2824091
9607 -2824091 -2477005 -2055388 -1704828 -1423533 -1205428 -1030959 -891002 -778700 -684475 -599765
9597 -599765 -524727 -453208 -393832 -342596 -297120 -261405 -230190 -199853 -174468 -154673 -131419 -101690
$$ packed form
9678C18176N670O978N553K107O883Q868P538O480Q755R079N135M951J511Q741
9664D06425J1371R258R328J0310P540O610M426P896J1073L154M530J1927R951
9651E13799P993J5950J2534J2603J0100J4805J6348J4704J0824J3516J7873J8436
9639F79485J9650J8298K3857K7514K1647K2036L1590L7078L6321L6390L1082L3636
9627A018584L6649J2633k8565P99N8385Q9109J08269J28174J48268J72877K15459
9616A960641K72112L43646M10324L75360j19645j418919k494422j805361l47827
9607b824091L47086M21617L50560K81295K18105J74469J39957J12302R4225Q4710
9597e99765P5038P1519N9376N1236M5476L5715L1215L0337K5385J9795K3254K9729
$$ plain form
9585 -101690 -71975 -46239 -23484 400 21481 45208 77756 111100 144103 176586 200684 200611
9573 200611 164962 93827 16680 -57166 -104735 -117986 -102099 -68108 -36815 -11935 10201 26432
9561 26432 43663 55654 63010 72469 84304 94271 107224 121759 137647 149941 156112 164539 172785
9548 172785 173752 174377 180199 182444 182479 186700 204248 215915 223018 224474 227106 231907 241895 249240 253576
9533 253576 260736 266045 271860 275565 280841 281743 286360 289689 287178 289719 291792 290391 292992 298083 301751
9518 301751 301685 308222 317104 324327 324162 327607 333108 334095 337620 342671 356606 366837 369938 369584 371774
9503 371774 369093 362772 356001 357047 359376 366245 370042 373309 372230 378176 386814 392296 393074 399775 406427
9488 406427 410044 412224 415130 421407 424314 425639 425522 432867 439879 444086 446015 443969 436816 434070 440187
$$ packed form
9585a01690K9715K5736K2755K3884K1081K3727L2548L3344L3003L2483K4098p3
9573B00611l5649p1135p7147p3846m7569j3251J5887L3991L1293K4880K2136J6231
9561B6432J7231J1991P356R459J1835R967J2953J4535J5888J2294O171Q427Q246
9548A72785R67O25N822K245L5M221J7548J1667P103J456K632M801R988P345M336
9533B53576P160N309N815L705N276R02M617L329k511K541K073j401K601N091L668
9518C01751o6O537Q882P223j65L445N501R87L525N051J3935J0231L101l54K190
9503C71774k681o321o771J046K329O869L797L267j079N946Q638N482P78O701O652
9488D06427L617K180K906O277K907J325j17P345P012M207J929k046p153k746O117
$$ plain form
9473 440187 444302 452883 464765 467315 467339 467387 470420 475804 479753 483525 486613 486116 488037 497524 504337
9458 504337 503423 504062 507849 510626 511006 520776 530839 535527 536684 540678 543676 547196 546107 545105 542696
9443 542696 534595 536622 544261 548164 551416 554087 563732 566749 571121 571439 573888 580529 583697 581487 587233
9428 587233 592424 593529 595621 600513 609229 611284 613984 617302 615456 620851 626387 628869 627212 628335
9414 628335 633026 638697 635012 635256 636433 638962 642054 650202 652402 659218 665424 669713 669658 675267 681909
9399 681909 687044 682262 679886 682781 687567 692902 696168 696120 698314 703729 709428 714899 723251 725274 727974
9384 727974 729282 732239 736377 738099 742083 748687 751245 752346 750861 750766 753708 759087 766631 774264 774846
9369 774846 776707 783048 783965 790048 798230 805935 807349 810941 815061 816934 820155 826682 831255 833542 838584
$$ packed form
9473D40187M115Q581J1882K550K4M8L033N384L949L772L088m97J921R487O813
9458E04337r14O39L787K777L80R770J0063M688J157L994K998L520j089j002k409
9443E42696q101K027P639L903L252K671R645L017M372L18K449O641L168k210N746
9428E87233N191J105K092M892Q716K055K700L318j846N395N536K482j657J123
9414F28335M691N671l685K44J177K529L092Q148K200O816O206M289n5N609O642
9399F81909N135m782k376K895M786N335L266m8K194N415N699N471Q352K023K700
9384G27974J308K957M138J722L984O604K558J101j485r5K942N379P544P633N82
9369G74846J861O341R17O083Q182P705J414L592M120J873L221O527M573K287N042
$$ plain form
9354 838584 844305 851170 854222 857720 864962 869494 868570 866989 873798 878843 885138 895087 908403 916496
9340 916496 922014 930700 940818 954617 962984 973288 984410 995952 1014455 1039118 1070241 1097456
9328 1097456 1099632 1069811 1004597 907589 817156 750277 729348 736338 759723 782696 806812 830733
9316 830733 847137 855698 870087 886264 894154 900187 909531 917149 928360 941852 954833 958688 957904
9303 957904 961940 966174 967585 962558 958295 961360 962446 970262 975522 982175 986980 988718 995038 997199
9289 997199 1002509 1013680 1023412 1028900 1031728 1034775 1036929 1039359 1047357 1050876 1055943 1061114 1068858 1071096
9275 1071096 1073562 1078340 1088098 1099199 1103744 1102327 1105021 1106257 1103780 1108324 1117231 1127278 1136855 1142053
9261 1142053 1143885 1152251 1156313 1158089 1164313 1170731 1180008 1180331 1186346 1188197 1189636 1196613 1205273 1210827
$$ packed form
9354H38584N721O865L052L498P242M532r24j581O809N045O295R949J3316Q093
9340I16496N518Q686J0118J3799Q367J0304J1122J1542J8503K4663L1123K7215
9328A097456K176k9821o5214r7008r0433o6879k0929O990K3385K2973K4116K3921
9316H30733J6404Q561J4389J6177P890O033R344P618J1211J3492J2981L855p84
9303I57904M036M234J411n027m263L065J086P816N260O653M805J738O320K161
9289I97199N310J1171R732N488K828L047K154K430P998L519N067N171P744K238
9275A071096K466M778R758J1101M545j417K694J236k477M544Q907J0047R577N198
9261A142053J832Q366M062J776O224O418R277L23O015J851J439O977Q660N554
$$ plain form
9247 1210827 1217468 1224657 1233745 1233741 1234003 1238213 1239693 1241764 1245364 1252524 1253864 1259259 1265573 1270673 1278915
9232 1278915 1287588 1295002 1302513 1305927 1312953 1315881 1318499 1325195 1326100 1325774 1332931 1338715 1347702 1356670 1362445
9217 1362445 1369857 1376115 1381292 1384639 1390088 1396604 1400385 1407194 1409951 1417287 1429527 1441121 1450761 1458170
9203 1458170 1462119 1460780 1453647 1449474 1452277 1457814 1460930 1467540 1478042 1494218 1499993 1501736 1510871 1520462
9189 1520462 1526847 1531619 1537729 1546492 1552169 1562823 1569604 1575809 1581802 1585109 1592594 1601035 1606018 1606326
9175 1606326 1605721 1616545 1622531 1630225 1636630 1648329 1660652 1668942 1675385 1681590 1688591 1688046 1693791 1701772
9161 1701772 1705892 1715544 1726116 1735317 1739067 1747025 1754545 1766113 1774270 1781304 1785592 1788559 1795794 1800174
9147 1800174 1812403 1824238 1831559 1839058 1846462 1857930 1869311 1873374 1882624 1895222 1901306 1911711 1916952
$$ packed form
9247A210827O641P189R088mK62M210J480K071L600P160J340N395O314N100Q242
9232A278915Q673P414P511L414P026K928K618O696R05l26P157N784Q987Q968N775
9217A362445P412O258N177L347N449O516L781O809K757P336J2240J1594R640P409
9203A458170L949j339p133m173K803N537L116O610J0502J6176N775J743R135R591
9189A520462O385M772O110Q763N677J0654O781O205N993L307P485Q441M983L08
9175A606326o05J0824N986P694O405J1699J2323Q290O443O205P001n45N745P981
9161A701772M120R652J0572R201L750P958P520J1568Q157P034M288K967P235M380
9147A800174J2229J1835P321P499P404J1468J1381M063R250J2598O084J0405N241
$$ plain form
9134 1916952 1919820 1930620 1940175 1949630 1956469 1962918 1976236 1982234 1987047 1999183 2006606 2014111 2024369
9121 2024369 2036078 2046605 2054524 2064169 2069437 2079930 2090800 2101655 2109771 2122558 2133647 2142601
9109 2142601 2151921 2160434 2169474 2181578 2191055 2199595 2206182 2218151 2225553 2232235 2242354 2250877 2264062
9096 2264062 2277636 2290211 2304254 2312676 2322526 2324406 2333581 2344501 2356561 2366954 2379819 2394451
9084 2394451 2404164 2415179 2426148 2440110 2450708 2454760 2467699 2477575 2489754 2502447 2518124 2530648
9072 2530648 2545454 2553141 2563928 2575242 2582594 2595942 2611298 2623821 2636749 2644749 2659225 2673961
9060 2673961 2685248 2692411 2705208 2721199 2732399 2744976 2762739 2777142 2789353 2799996 2813614 2829446
9048 2829446 2844742 2864743 2883056 2897827 2905328 2919816 2935507 2951646 2966759 2982350 3005135 3021493
$$ packed form
9134A916952K868J0800R555R455O839O449J3318N998M813J2136P423P505J0258
9121B024369J1709J0527P919R645N268J0493J0870J0855Q116J2787J1089Q954
9109B142601R320Q513R040J2104R477Q540O587J1969P402O682J0119Q523J3185
9096B264062J3574J2575J4043Q422R850J880R175J0920J2060J0393J2865J4632
9084B394451R713J1015J0969J3962J0598M052J2939R876J2179J2693J5677J2524
9072B530648J4806P687J0787J1314P352J3348J5356J2523J2928Q000J4476J4736
9060B673961J1287P163J2797J5991J1200J2577J7763J4403J2211J0643J3618J5832
9048B829446J5296K0001J8313J4771P501J4488J5691J6139J5113J5591K2785J6358
$$ plain form
9036 3021493 3032197 3045075 3062038 3079634 3097252 3114014 3126359 3142652 3159673 3174965 3191671
9025 3191671 3212211 3233962 3253872 3272653 3292946 3312801 3330519 3346034 3366738 3384845 3397807
9014 3397807 3416872 3440069 3462760 3483659 3505408 3532295 3557856 3576586 3598692 3617335 3637999
9003 3637999 3657380 3679539 3699177 3723548 3740882 3757674 3781885 3809896 3837163 3858050 3883425
8992 3883425 3909674 3937638 3959532 3981783 4006062 4028974 4058643 4082195 4103703 4134220 4161766
8981 4161766 4189085 4219558 4253378 4283940 4305397 4334586 4365682 4394833 4419773 4448386 4478719
8970 4478719 4511613 4541035 4566965 4595455 4628235 4661049 4696152 4725885 4754920 4786887 4823508
8959 4823508 4856224 4892406 4924072 4960061 4998544 5037075 5070474 5105889 5139991 5177273 5211743
$$ packed form
9036C021493J0704J2878J6963J7596J7618J6762J2345J6293J7021J5292J6706
9025C191671K0540K1751J9910J8781K0293J9855J7718J5515K0704J8107J2962
9014C397807J9065K3197K2691K0899K1749K6887K5561J8730K2106J8643K0664
9003C637999J9381K2159J9638K4371J7334J6792K4211K8011K7267K0887K5375
8992C883425K6249K7964K1894K2251K4279K2912K9669K3552K1508L0517K7546
8981D161766K7319L0473L3820L0562K1457K9189L1096K9151K4940K8613L0333
8970D478719L2894K9422K5930K8490L2780L2814L5103K9733K9035L1967L6621
8959D823508L2716L6182L1666L5989L8483L8531L3399L5415L4102L7282L4470
$$ plain form
8948 5211743 5247963 5281692 5321104 5365535 5402413 5440435 5487692 5530386 5566586 5605654 5650616
8937 5650616 5697213 5737450 5783381 5829962 5876316 5920106 5970374 6020943 6071540 6121279 6173215
8926 6173215 6225154 6274607 6328086 6377588 6429579 6485698 6538232 6595253 6655428 6710673 6764257
8915 6764257 6816788 6875566 6940359 7007248 7073538 7138471 7202437 7274354 7340565 7408907 7479744
8904 7479744 7551322 7623882 7691078 7762506 7838381 7915439 7992683 8076475 8162662 8238188 8318201
8893 8318201 8403293 8488445 8570649 8652499 8738603 8823643 8912292 9000714 9094944 9193236 9288537
8882 9288537 9385535 9482545 9575166 9673948 9775004 9871337 9967297 10064873 10168548 10279633 10385914
8871 10385914 10492956 10598747 10704400 10810849 10917703 11027896 11140516 11247684 11355531
$$ packed form
8948E211743L6220L3729L9412M4431L6878L8022M7257M2694L6200L9068M4962
8937E650616M6597M0237M5931M6581M6354M3790N0268N0569N0597M9739N1936
8926F173215N1939M9453N3479M9502N1991N6119N2534N7021O0175N5245N3584
8915F764257N2531N8778O4793O6889O6290O4933O3966P1917O6211O8342P0837
8904G479744P1578P2560O7196P1428P5875P7058P7244Q3792Q6187P5526Q0013
8893H318201Q5092Q5152Q2204Q1850Q6104Q5040Q8649Q8422R4230R8292R5301
8882I288537R6998R7010R2621R8782J01056R6333R5960R7576J03675J11085J06281
8871A0385914J07042J05791J05653J06449J06854J10193J12620J07168J07847
$$ plain form
8862 11355531 11461545 11564849 11670458 11773664 11869949 11971597 12072438 12166125 12250525 12333096
8852 12333096 12420067 12498570 12566115 12632187 12691916 12738514 12769881 12795734 12811019 12817807 12801501
8841 12801501 12771827 12732248 12674849 12592851 12490757 12369136 12219309 12045254 11845954 11613270
8831 11613270 11343023 11041434 10712467 10345436 9941849 9492272 9007349 8488808 7929993
8822 7929993 7333553 6701066 6029741 5331828 4605676 3854749 3077340 2284223 1479204 665423
8812 665423 -148155 -957648 -1756425 -2537397 -3300214 -4048722 -4822113 -5711107 -6777541 -7820738
8802 -7820738 -8624734 -9233712 -9764988 -10255088 -10709517 -11132364 -11524884 -11885068 -12215690 -12523234
8792 -12523234 -12790970 -13027466 -13233537 -13415135 -13565082 -13692081 -13797339 -13878855 -13940946 -13983925
$$ packed form
8862A1355531J06014J03304J05609J03206R6285J01648J00841R3687Q4400Q2571
8852A2333096Q6971P8503O7545O6072N9729M6598L1367K5853J5285O788j6306
8841A2801501k9674l9579n7399q1998j02094j21621j49827j74055j99300k32684
8831A1613270k70247l01589l28967l67031m03587m49577m84923n18541n58815
8822G929993n96440o32487o71325o97913p26152p50927p77409p93117q05019q13781
8812F65423q13578q09493p98777p80972p62817p48508p73391q88994j066434j043197
8802g820738q03996o08978n31276m90100m54429m22847l92520l60184l30622l07544
8792a2523234k67736k36496k06071j81598j49947j26999j05258q1516o2091m2979
$$ plain form
8782 -13983925 -14014153 -14028998 -14026686 -14016573 -13997479 -13962010 -13916650 -13865808 -13815114 -13752730 -13678797
8771 -13678797 -13602509 -13519901 -13433768 -13341186 -13248338 -13149902 -13045723 -12941630 -12843186 -12738837 -12635226
8760 -12635226 -12533386 -12430059 -12326167 -12222118 -12111589 -12000713 -11894503 -11789132 -11685560
8751 -11685560 -11580078 -11476729 -11371035 -11265646 -11167287 -11071869 -10972554 -10874763 -10779174 -10686375
8741 -10686375 -10593391 -10493801 -10397813 -10308336 -10217993 -10127468 -10040519 -9956110 -9866571 -9783471 -9703357
8730 -9703357 -9620125 -9540271 -9462194 -9382862 -9304760 -9228223 -9149693 -9075005 -8999363 -8923283 -8853543
8719 -8853543 -8790168 -8725907 -8653174 -8588740 -8518419 -8449980 -8387865 -8322114 -8258551 -8196009 -8133739
8708 -8133739 -8077825 -8022126 -7964000 -7905577 -7844188 -7783659 -7728897 -7677502 -7623508 -7570070 -7521179
$$ packed form
8782a3983925l0228j4845K312J0113J9094L5469M5360N0842N0694O2384P3933
8771a3678797P6288Q2608Q6133R2582R2848R8436J04179J04093R8444J04349J03611
8760a2635226J01840J03327J03892J04049J10529J10876J06210J05371J03572
8751a1685560J05482J03349J05694J05389R8359R5418R9315R7791R5589R2799
8741a0686375R2984R9590R5988Q9477R0343R0525Q6949Q4409Q9539Q3100Q0114
8730i703357Q3232P9854P8077P9332P8102P6537P8530P4688P5642P6080O9740
8719h853543O3375O4261P2733O4434P0321O8439O2115O5751O3563O2542O2270
8708h133739N5914N5699N8126N8423O1389O0529N4762N1395N3994N3438M8891
$$ plain form
8697 -7521179 -7467929 -7415463 -7367514 -7319273 -7270084 -7221981 -7172891 -7125481 -7083039 -7042214 -6994171
8686 -6994171 -6947589 -6899146 -6851724 -6809337 -6767810 -6726938 -6688756 -6650458 -6607242 -6562710 -6523827
8675 -6523827 -6489515 -6452005 -6413546 -6372871 -6334449 -6298331 -6260659 -6223937 -6188513 -6150198 -6113972
8664 -6113972 -6082006 -6049297 -6020491 -5991604 -5954755 -5920022 -5890319 -5859582 -5829641 -5796875 -5768647
8653 -5768647 -5738808 -5713600 -5680552 -5644946 -5611751 -5579819 -5554877 -5530940 -5505628 -5475724 -5451851
8642 -5451851 -5424081 -5399935 -5377033 -5350939 -5322780 -5294070 -5269050 -5242268 -5221533 -5202396 -5178229
8631 -5178229 -5153645 -5125101 -5101912 -5077819 -5050466 -5028022 -5005800 -4986675 -4962778 -4940084 -4917397
8620 -4917397 -4892306 -4874052 -4860032 -4838684 -4818306 -4795918 -4779775 -4761313 -4741226 -4719413 -4697025
$$ packed form
8697g521179N3250N2466M7949M8241M9189M8103M9090M7410M2442M0825M8043
8686f994171M6582M8443M7422M2387M1527M0872L8182L8298M3216M4532L8883
8675f523827L4312L7510L8459M0675L8422L6118L7672L6722L5424L8315L6226
8664f113972L1966L2709K8806K8887L6849L4733K9703L0737K9941L2766K8228
8653e768647K9839K5208L3048L5606L3195L1932K4942K3937K5312K9904K3873
8642e451851K7770K4146K2902K6094K8159K8710K5020K6782K0735J9137K4167
8631e178229K4584K8544K3189K4093K7353K2444K2222J9125K3897K2694K2687
8620d917397K5091J8254J4020K1348K0378K2388J6143J8462K0087K1813K2388
$$ plain form
8609 -4697025 -4673298 -4654401 -4639228 -4623777 -4607455 -4582483 -4563481 -4547381 -4530191 -4509223 -4487909
8598 -4487909 -4467837 -4448514 -4424824 -4405573 -4394180 -4379392 -4362571 -4346085 -4331719 -4313772 -4297662
8587 -4297662 -4282001 -4263836 -4251216 -4233121 -4209872 -4188842 -4179242 -4168923 -4150250 -4139227 -4128843 -4110007
8575 -4110007 -4096378 -4077447 -4061365 -4049160 -4035890 -4023633 -4008931 -3988643 -3971015 -3957126 -3942549
8564 -3942549 -3927694 -3909600 -3889581 -3879295 -3866155 -3861261 -3867303 -3870839 -3864081 -3851889 -3841622 -3823404
8552 -3823404 -3805476 -3790475 -3774655 -3756269 -3742380 -3735310 -3725679 -3710439 -3698152 -3686209 -3671874 -3655789
8540 -3655789 -3643057 -3629446 -3616272 -3605345 -3597185 -3590304 -3580524 -3567869 -3557808 -3549418 -3540226 -3535400 -3530492
8527 -3530492 -3529491 -3529082 -3523013 -3513276 -3495881 -3475104 -3460527 -3461109 -3474719 -3483419 -3484288 -3482583 -3475242 -3461795
$$ packed form
8609d697025K3727J8897J5173J5451J6322K4972J9002J6100J7190K0968K1314
8598d487909K0072J9323K3690J9251J1393J4788J6821J6486J4366J7947J6110
8587d297662J5661J8165J2620J8095K3249K1030R600J0319J8673J1023J0384J8836
8575d110007J3629J8931J6082J2205J3270J2257J4702K0288J7628J3889J4577
8564c942549J4855J8094K0019J0286J3140M894o042l536O758J2192J0267J8218
8552c823404J7928J5001J5820J8386J3889P070R631J5240J2287J1943J4335J6085
8540c655789J2732J3611J3174J0927Q160O881R780J2655J0061Q390R192M826M908
8527c530492J001M09O069R737J7395K0777J4577n82j3610q700q69J705P341J3447
$$ plain form
8513 -3461795 -3446541 -3430678 -3415423 -3401608 -3393276 -3381402 -3371528 -3359136 -3350683 -3344301 -3334644 -3325277 -3311107
8500 -3311107 -3299779 -3287960 -3280726 -3275265 -3263979 -3255237 -3246894 -3238020 -3231733 -3226312 -3216550 -3209832 -3201465
8487 -3201465 -3191519 -3178686 -3166135 -3152574 -3142542 -3136478 -3132111 -3126552 -3114685 -3102471 -3089816 -3079344
8475 -3079344 -3070467 -3066131 -3055855 -3057892 -3067224 -3070793 -3063813 -3058176 -3045532 -3032392 -3023804 -3011535 -3000893
8462 -3000893 -2996078 -2993173 -2987012 -2979813 -2973315 -2962857 -2952391 -2945740 -2944892 -2941473 -2936309 -2928722 -2920891 -2914021
8448 -2914021 -2908148 -2902554 -2890811 -2879346 -2876082 -2876217 -2872117 -2864622 -2856079 -2851464 -2844543 -2830476 -2820208
8435 -2820208 -2811742 -2804039 -2802032 -2795959 -2789034 -2779226 -2770860 -2762559 -2762389 -2766835 -2762030 -2750067 -2743769 -2741610
8421 -2741610 -2743577 -2741503 -2739133 -2733375 -2724918 -2714909 -2708629 -2707079 -2696711 -2688391 -2686390 -2679815 -2677132 -2672373
$$ packed form
8513c461795J5254J5863J5255J3815Q332J1874R874J2392Q453O382R657R367J4170
8500c311107J1328J1819P234N461J1286Q742Q343Q874O287N421R762O718Q367
8487c201465R946J2833J2551J3561J0032O064M367N559J1867J2214J2655J0472
8475c079344Q877M336J0276k037r332l569O980N637J2644J3140Q588J2269J0642
8462c000893M815K905O161P199O498J0458J0466O651Q48L419N164P587P831O870
8448b914021N873N594J1743J1465L264j35M100P495Q543M615O921J4067J0268
8435b820208Q466P703K007O073O925R808Q366Q301J70m446M805J1963O298K159
8421b741610j967K074K370N758Q457J0009O280J550J0368Q320K001O575K683M759
$$ plain form
8407 -2672373 -2666635 -2657700 -2648495 -2644561 -2641786 -2635078 -2625932 -2618854 -2620052 -2614879 -2607864 -2601385 -2599732 -2600739
8393 -2600739 -2600139 -2595376 -2590422 -2587764 -2579115 -2574252 -2569167 -2561509 -2551153 -2544745 -2542979 -2542820 -2542889 -2541547 -2539952
8378 -2539952 -2537970 -2532464 -2524744 -2516379 -2512382 -2504682 -2499738 -2493619 -2486369 -2482740 -2477454 -2469386 -2461580 -2457121
8364 -2457121 -2457189 -2454927 -2455369 -2454985 -2450277 -2442125 -2433151 -2428779 -2424241 -2419564 -2418708 -2419660 -2420896 -2417820 -2407368
8349 -2407368 -2398803 -2396106 -2395471 -2397184 -2400628 -2399227 -2394838 -2385843 -2376094 -2375374 -2372983 -2364880 -2357438 -2357076 -2351182
8334 -2351182 -2346903 -2345793 -2342726 -2339756 -2331559 -2324503 -2320261 -2319205 -2319029 -2313246 -2306038 -2304354 -2299272 -2289619
8320 -2289619 -2286027 -2282381 -2276335 -2273101 -2269735 -2266621 -2269415 -2272428 -2272321 -2263982 -2255486 -2252721 -2247545 -2245957
8306 -2245957 -2250135 -2249782 -2252301 -2246030 -2241348 -2237719 -2236023 -2231684 -2224238 -2218208 -2217181 -2212645 -2209497 -2206519
$$ packed form
8407b672373N738Q935R205L934K775O708R146P078j198N173P015O479J653j007
8393b600739O00M763M954K658Q649M863N085P658J0356O408J766J59o9J342J595
8378b539952J982N506P720Q365L997P700M944O119P250L629N286Q068P806M459
8364b457121o8K262m42L84M708Q152Q974M372M538M677Q56r52j236L076J0452
8349b407368Q565K697O35j713l444J401M389Q995R749P20K391Q103P442L62N894
8334b351182M279J110L067K970Q197P056M242J056J76N783P208J684N082R653
8320b289619L592L646O046L234L366L114k794l013J07Q339Q496K765N176J588
8306b245957m178L53k519O271M682L629J696M339P446O030J027M536L148K978
$$ plain form
8292 -2206519 -2204077 -2199982 -2191491 -2186914 -2187908 -2184454 -2179381 -2176674 -2172831 -2174344 -2169348 -2161825 -2157621 -2154367
8278 -2154367 -2151316 -2144057 -2139836 -2138713 -2138003 -2135539 -2133553 -2134022 -2135266 -2133019 -2125207 -2118676 -2120117 -2115189 -2112939
8263 -2112939 -2112765 -2113635 -2110903 -2107591 -2106033 -2100526 -2096370 -2097207 -2092133 -2084816 -2074275 -2066544 -2065098 -2068164 -2071062
8248 -2071062 -2063527 -2057805 -2057184 -2058108 -2051577 -2045868 -2037825 -2034403 -2033121 -2037033 -2042648 -2041058 -2036833 -2035415 -2029207
8233 -2029207 -2020524 -2015881 -2012485 -2006589 -2007077 -2005143 -1998726 -1991216 -1994188 -1997423 -1995071 -1997020 -2002443 -2003592
8219 -2003592 -2003917 -1999999 -1996085 -1993423 -1990569 -1985160 -1983642 -1975597 -1972733 -1974438 -1973175 -1962116 -1955658 -1955755 -1954051
8204 -1954051 -1952458 -1949613 -1941538 -1939091 -1939405 -1936273 -1932917 -1930334 -1926263 -1921924 -1917261 -1917555 -1917434 -1915207 -1913043
8189 -1913043 -1908544 -1903880 -1900878 -1902205 -1901055 -1898753 -1895867 -1893466 -1893031 -1888136 -1886079 -1882769 -1880142 -1878025
$$ packed form
8292b206519K442M095Q491M577r94L454N073K707L843j513M996P523M204L254
8278b154367L051P259M221J123P10K464J986m69j244K247P812O531j441M928K250
8263b112939J74q70K732L312J558N507M156q37N074P317J0541P731J446l066k898
8248b071062P535N722O21r24O531N709Q043L422J282l912n615J590M225J418O208
8233b029207Q683M643L396N896m88J934O417P510k972l235K352j949n423j149
8219b003592l25L918L914K662K854N409J518Q045K864j705J263J1059O458r7J704
8204a954051J593K845Q075K447l14L132L356K583M071M339M663k94J21K227K164
8189a913043M499M664L002j327J150K302K886K401M35M895K057L310K627K117
$$ plain form
8175 -1878025 -1876147 -1878934 -1878733 -1875841 -1874587 -1872151 -1868521 -1870114 -1868455 -1864817 -1868074 -1866805 -1862147 -1854003
8161 -1854003 -1851473 -1852643 -1854717 -1852458 -1847710 -1844633 -1844162 -1842770 -1841341 -1838730 -1835531 -1836619 -1834630 -1827095
8147 -1827095 -1822485 -1827545 -1826335 -1822016 -1819628 -1812264 -1805373 -1803398 -1804164 -1803506 -1800649 -1804339 -1802181 -1800190 -1800770
8132 -1800770 -1800550 -1798828 -1797697 -1795797 -1794778 -1791600 -1784420 -1778480 -1772424 -1773819 -1774924 -1773453 -1765681 -1761152
8118 -1761152 -1761760 -1765317 -1762444 -1762776 -1764633 -1762837 -1757931 -1751052 -1744215 -1746186 -1745735 -1741509 -1740221 -1740164 -1737201
8103 -1737201 -1734212 -1732373 -1734648 -1733225 -1731553 -1728937 -1724046 -1718523 -1717783 -1720381 -1719091 -1714244 -1711817 -1712504 -1713498
8088 -1713498 -1711700 -1708555 -1708004 -1709290 -1703524 -1701577 -1699934 -1695784 -1689498 -1688388 -1682374 -1680825 -1679551 -1679954 -1679841
8073 -1679841 -1676229 -1679145 -1680171 -1672205 -1668908 -1670538 -1672505 -1672618 -1668450 -1668165 -1670702 -1668944 -1661582 -1657398 -1651335
$$ packed form
8175a878025J878k787K01K892J254K436L630j593J659L638l257J269M658Q144
8161a854003K530j170k074K259M748L077M71J392J429K611L199j088J989P535
8147a827095M610n060J210M319K388P364O891J975p66O58K857l690K158J991n80
8132a800770K20J722J131J900J019L178P180N940O056j395j105J471P772M529
8118a761152o08l557K873l32j857J796M906O879O837j971M51M226J288N7K963
8103a737201K989J839k275J423J672K616M891N523P40k598J290M847K427o87r94
8088a713498J798L145N51j286N766J947J643M150O286J110O014J549J274m03J13
8073a679841L612k916j026P966L297j630j967j13M168K85k537J758P362M184O063
$$ plain form
8058 -1651335 -1649109 -1648730 -1644611 -1642304 -1639611 -1644080 -1640907 -1640052 -1642518 -1640500 -1633809 -1632459 -1633945 -1632414 -1634284
8043 -1634284 -1634481 -1633145 -1629157 -1630021 -1631746 -1626008 -1623873 -1623471 -1616351 -1613228 -1616868 -1618278 -1616590 -1615807 -1617202
8028 -1617202 -1612773 -1612231 -1609599 -1603351 -1604821 -1610097 -1607464 -1603085 -1599579 -1595584 -1595615 -1594190 -1589222 -1583925 -1583436
8013 -1583436 -1582037 -1582282 -1579995 -1580707 -1583730 -1586716 -1581915 -1573308 -1573094 -1574483 -1572726 -1573617 -1568918 -1568846 -1563860 -1557927
7997 -1557927 -1558151 -1563906 -1565506 -1560595 -1559800 -1557147 -1554072 -1555265 -1553904 -1544151 -1545425 -1542947 -1541596 -1544920 -1545375
7982 -1545375 -1543824 -1540844 -1545322 -1544316 -1543518 -1541068 -1538591 -1537784 -1534236 -1532271 -1532880 -1529269 -1524565 -1522787 -1521719
7967 -1521719 -1523586 -1517751 -1515584 -1523558 -1523696 -1519961 -1519827 -1523409 -1523621 -1519406 -1512718 -1505650 -1506168 -1509904 -1505583
7952 -1505583 -1502972 -1505092 -1504528 -1504419 -1503967 -1503936 -1500066 -1499298 -1497142 -1494324 -1489402 -1487532 -1487390 -1486153 -1488298 -1485859
$$ packed form
8058a651335K226L79M119K307K693m469L173Q55k466K018O691J350j486J531j870
8043a634284j97J336L988q64j725N738K135M02P120L123l640j410J688P83j395
8028a617202M429N42K632O248j470n276K633M379L506L995l1J425M968N297M89
8013a583436J399k45K287p12l023k986M801Q607K14j389J757q91M699P2M986N933
7997a557927k24n755j600M911P95K653L075j193J361R753j274K478J351l324m55
7982a545375J551K980m478J006P98K450K477Q07L548J965o09L611M704J778J068
7967a521719j867N835K167p974j38L735J34l582k12M215O688P068n18l736M321
7952a505583K611k120N64J09M52L1L870P68K156K818M922J870J42J237k145K439
$$ plain form
7936 -1485859 -1484371 -1491153 -1491975 -1490220 -1481998 -1480603 -1483665 -1483730 -1484382 -1482881 -1479343 -1472254 -1472761 -1474988 -1476610
7921 -1476610 -1477195 -1470839 -1465692 -1464980 -1462455 -1462903 -1463524 -1461807 -1463844 -1468151 -1470346 -1468663 -1468122 -1463751 -1465746
7906 -1465746 -1467754 -1464755 -1461182 -1458755 -1452890 -1447825 -1447645 -1449929 -1450417 -1451112 -1456405 -1456147 -1455764 -1449193 -1444398
7891 -1444398 -1440304 -1443009 -1446870 -1446645 -1445879 -1441063 -1438089 -1438164 -1440221 -1438435 -1436594 -1433306 -1432867 -1432779 -1432147 -1430539
7875 -1430539 -1429204 -1430154 -1430680 -1426276 -1424144 -1428712 -1425292 -1417636 -1411480 -1406523 -1408093 -1412585 -1415562 -1420412 -1415538
7860 -1415538 -1409798 -1407102 -1409023 -1410347 -1410938 -1412009 -1408408 -1405692 -1403596 -1400251 -1402098 -1404237 -1405591 -1409512
7846 -1409512 -1410409 -1405962 -1405384 -1402082 -1398645 -1399950 -1399301 -1397849 -1395001 -1389484 -1387280 -1385424 -1387906 -1389149 -1388438
7831 -1388438 -1384741 -1382015 -1381444 -1378077 -1377185 -1377009 -1380674 -1382577 -1381112 -1381886 -1378543 -1375566 -1377828 -1377044 -1375140
$$ packed form
7936a485859J488o782q22J755Q222J395l062o5o52J501L538P089n07k227j622
7921a476610n85O356N147P12K525m48o21J717k037m307k195J683N41M371j995
7906a465746k008K999L573K427N865N065J80k284m88o95n293K58L83O571M795
7891a444398M094k705l861K25P66M816K974p5k057J786J841L288M39Q8O32J608
7875a430539J335r50n26M404K132m568L420P656O156M957j570m492k977m850M874
7860a415538N740K696j921j324n91j071L601K716K096L345j847k139j354l921
7846a409512q97M447N78L302L437j305O49J452K848N517K204J856k482j243P11
7831a388438L697K726N71L367Q92J76l665j903J465p74L343K977k262P84J904
$$ plain form
7816 -1375140 -1375851 -1375674 -1373011 -1376492 -1375303 -1368823 -1365676 -1362115 -1361028 -1360688 -1362089 -1354007 -1356334 -1360954 -1355637
7801 -1355637 -1353347 -1355352 -1359764 -1357005 -1352563 -1346234 -1340829 -1343989 -1352033 -1354705 -1352356 -1349227 -1347410 -1342812
7787 -1342812 -1339064 -1335441 -1335956 -1340936 -1342001 -1341123 -1339673 -1335158 -1334085 -1334973 -1333990 -1332921 -1335005 -1330087 -1330633
7772 -1330633 -1333094 -1334435 -1330141 -1327139 -1321103 -1314344 -1314855 -1319505 -1314840 -1311296 -1316333 -1322390 -1320357 -1317647
7758 -1317647 -1318065 -1316073 -1312442 -1314929 -1320855 -1319223 -1312859 -1307492 -1302370 -1297704 -1295992 -1297941 -1302255 -1306015
7744 -1306015 -1304501 -1304150 -1303544 -1301520 -1304418 -1305192 -1299085 -1293779 -1291015 -1295423 -1294317 -1291334 -1291749 -1291358 -1296537
7729 -1296537 -1296126 -1292205 -1289266 -1290185 -1289597 -1286104 -1283920 -1284666 -1284835 -1284833 -1282591 -1281957 -1281362 -1278232 -1277884 -1273878 -1274857
7712 -1274857 -1276109 -1276542 -1275344 -1278723 -1278667 -1278332 -1275185 -1273816 -1276200 -1277840 -1276592 -1271596 -1270935 -1270292 -1266100 -1267336
$$ packed form
7816a375140p11J77K663l481J189O480L147L561J087L40j401Q082k327m620N317
7801a355637K290k005m412K759M442O329N405l160q044k672K349L129J817M598
7787a342812L748L623n15m980j065Q78J450M515J073q88R83J069k084M918n46
7772a330633k461j341M294L002O036O759n11m650M665L544n037o057K033K710
7758a317647m18J992L631k487n926J632O364N367N122M666J712j949m314l760
7744a306015J514L51O06K024k898p74O107N306K764m408J106K983m15L91n179
7729a296537M11L921K939r19N88L493K184p46j69KK242O34N95L130L48M006r79
7712a274857j252m33J198l379N6L35L147J369k384j640J248M996O61O43M192j236
$$ plain form
7696 -1267336 -1264822 -1264262 -1261691 -1260322 -1259997 -1260375 -1262004 -1263206 -1263373 -1261015 -1255492 -1251039 -1252461 -1252045 -1249753
7681 -1249753 -1248910 -1251318 -1251431 -1249055 -1252441 -1254363 -1256680 -1255549 -1248119 -1242748 -1246442 -1246565 -1247879 -1244708 -1245315
7666 -1245315 -1247011 -1244973 -1241335 -1237170 -1234119 -1237774 -1238637 -1236197 -1231339 -1231094 -1237173 -1234766 -1228098 -1227846 -1229558
7651 -1229558 -1228120 -1227547 -1224973 -1221529 -1223498 -1220640 -1219605 -1219299 -1214560 -1211980 -1212930 -1207732 -1209216 -1214741 -1217398
7636 -1217398 -1218060 -1211950 -1210527 -1215364 -1214441 -1215091 -1215570 -1216694 -1213429 -1214690 -1212690 -1210692 -1205671 -1204900 -1206558
7621 -1206558 -1205735 -1205932 -1202741 -1200733 -1202039 -1207079 -1209875 -1209172 -1207219 -1206017 -1202573 -1205250 -1203379 -1199090 -1198073
7606 -1198073 -1198886 -1203744 -1204629 -1199123 -1193703 -1190921 -1185966 -1184592 -1188439 -1184772 -1188128 -1185090 -1183779 -1182593 -1181513
7591 -1181513 -1181897 -1179381 -1178519 -1181761 -1183123 -1185298 -1188562 -1187673 -1182249 -1181316 -1182692 -1182429 -1178522 -1171785 -1168590
$$ packed form
7696a267336K514N60K571J369L25l78j629j202j67K358N523M453j422M16K292
7681a249753Q43k408j13K376l386j922k317J131P430N371l694j23j314L171o07
7666a245315j696K038L638M165L051l655q63K440M858K45o079K407O668K52j712
7651a229558J438N73K574L444j969K858J035L06M739K580r50N198j484n525k657
7636a217398o62O110J423m837R23o50m79j124L265j261K000J998N021P71j658
7621a206558Q23j97L191K008j306n040k796P03J953J202L444k677J871M289J017
7606a198073q13m858q85N506N420K782M955J374l847L667l356L038J311J186J080
7591a181513l84K516Q62l242j362k175l264Q89N424R33j376K63L907O737L195
$$ plain form
7576 -1168590 -1169194 -1167950 -1168128 -1168410 -1171516 -1175024 -1178623 -1178061 -1176587 -1175192 -1176444 -1178904 -1178903 -1174154 -1170080 -1168852
7560 -1168852 -1163042 -1157792 -1155741 -1156327 -1154197 -1153490 -1157438 -1158370 -1157799 -1155361 -1155102 -1157419 -1158569 -1159883 -1163869
7545 -1163869 -1162002 -1162073 -1160882 -1160659 -1154671 -1152610 -1147349 -1145519 -1143478 -1141088 -1143542 -1148308 -1146630 -1145379 -1146954
7530 -1146954 -1149434 -1146190 -1142723 -1136902 -1132828 -1128191 -1132505 -1137558 -1139449 -1142273 -1145906 -1143617 -1144451 -1137642
7516 -1137642 -1134690 -1138905 -1141428 -1137814 -1137639 -1139300 -1138020 -1129526 -1127356 -1130237 -1129781 -1129607 -1129601 -1130251 -1130979 -1132817
7500 -1132817 -1131510 -1128209 -1127477 -1125467 -1129059 -1129318 -1129133 -1129087 -1125294 -1120693 -1117872 -1115640 -1121329 -1122928 -1116009
7485 -1116009 -1110306 -1113344 -1112815 -1114864 -1119149 -1115257 -1113555 -1115885 -1113600 -1111444 -1112224 -1109860 -1107407 -1112259 -1114867
7470 -1114867 -1112868 -1112943 -1114888 -1109314 -1106559 -1109226 -1113534 -1109229 -1105592 -1102486 -1103531 -1104117 -1104714 -1106036 -1107620
$$ packed form
7576a168590o04J244j78k82l106l508l599N62J474J395j252k460JM749M074J228
7560a168852N810N250K051n86K130P07l948r32N71K438K59k317j150j314l986
7545a163869J867p1J191K23N988K061N261J830K041K390k454m766J678J251j575
7530a146954k480L244L467N821M074M637m314n053j891k824l633K289q34O809
7516a137642K952m215k523L614J75j661J280Q494K170k881M56J74Oo50p28j838
7500a132817J307L301P32K010l592k59J85M6L793M601K821K232n689j599O919
7485a116009N703l038N29k049m285L892J702k330K285K156p80K364K453m852k608
7470a114867J999p5j945N574K755k667m308M305L637L106j045n86n97j322j584
$$ plain form
7455 -1107620 -1102968 -1099494 -1097748 -1093439 -1096054 -1098108 -1100689 -1101912 -1099715 -1096164 -1094581 -1091733 -1089018 -1083904
7441 -1083904 -1083914 -1085586 -1088218 -1090120 -1095626 -1095828 -1091087 -1090999 -1096777 -1098769 -1097255 -1088263 -1085330 -1083959 -1080689
7426 -1080689 -1083797 -1084410 -1080964 -1083591 -1083707 -1080216 -1083465 -1084669 -1079321 -1078057 -1078244 -1083571 -1084284 -1079724 -1076090
7411 -1076090 -1076697 -1082297 -1079716 -1075616 -1076936 -1072493 -1068974 -1070645 -1072495 -1074558 -1072804 -1070096 -1069600 -1066585 -1066252
7396 -1066252 -1063747 -1062178 -1067730 -1070357 -1073093 -1075027 -1071774 -1066442 -1064983 -1066206 -1068454 -1067948 -1063741 -1060209
7382 -1060209 -1053841 -1052180 -1049943 -1054338 -1061326 -1064071 -1059168 -1058678 -1056734 -1054597 -1055517 -1055790 -1053336 -1046926 -1049437
7367 -1049437 -1054031 -1059713 -1059446 -1060037 -1061129 -1060399 -1055390 -1055675 -1058185 -1052956 -1051272 -1058166 -1060025 -1059168 -1059826 -1059969
7351 -1059969 -1054837 -1054602 -1052138 -1053108 -1051844 -1049020 -1046047 -1047488 -1047483 -1044701 -1047984 -1048151 -1044336 -1044572 -1041173 -1040283
$$ packed form
7455a107620M652L474J746M309k615k054k581j223K197L551J583K848K715N114
7441a083904j0j672k632j902n506k02M741Q8n778j992J514Q992K933J371L270
7426a080689l108o13L446k627j16L491l249j204N348J264j87n327p13M560L634
7411a076090o07n600K581M100j320M443L519j671j850k063J754K708M96L015L33
7396a066252K505J569n552k627k736j934L253N332J459j223k248N06M207L532
7382a060209O368J661K237m395o988k745M903M90J944K137r20k73K454O410k511
7367a049437m594n682K67n91j092P30N009k85k510N229J684o894j859Q57o58j43
7351a059969N132K35K464r70J264K824K973j441NK782l283j67L815k36L399Q90
$$ plain form
7335 -1040283 -1038414 -1042191 -1042681 -1039891 -1037414 -1038730 -1041851 -1044617 -1042997 -1039047 -1037760 -1035741 -1031116 -1029716
7321 -1029716 -1029409 -1030520 -1028642 -1027859 -1031876 -1031697 -1033601 -1034216 -1034889 -1035171 -1033806 -1035154 -1030285 -1025362 -1027944 -1024633
7305 -1024633 -1019552 -1019821 -1022091 -1023333 -1024789 -1022067 -1017723 -1017474 -1021262 -1021781 -1025353 -1027000 -1028230 -1027302 -1026936
7290 -1026936 -1025962 -1024847 -1021638 -1016919 -1012274 -1010017 -1012197 -1013179 -1013420 -1017381 -1017869 -1015699 -1014679 -1013348 -1008824
7275 -1008824 -1007954 -1006228 -1008764 -1014321 -1018247 -1019494 -1016614 -1011947 -1011972 -1016625 -1018992 -1018393 -1012915 -1010496 -1008158
7260 -1008158 -1005277 -1004567 -1013047 -1014880 -1018225 -1011349 -1004496 -1001689 -996793 -996166 -996508 -995547 -991717 -991741 -991562 -993781
7244 -993781 -992799 -989020 -989155 -990308 -993731 -990178 -990108 -990285 -991541 -991113 -996506 -993746 -989676 -984902 -985119 -987210
7228 -987210 -988859 -992505 -991381 -984161 -977301 -974769 -983230 -985405 -984798 -979602 -978364 -978108 -979462 -980391 -981083
$$ packed form
7335a040283J869l777m90K790K477j316l121k766J620L950J287K019M625J400
7321a029716L07j111J878P83m017J79j904o15o73k82J365j348M869M923k582L311
7305a024633N081k69k270j242j456K722M344K49l788n19l572j647j230R28L66
7290a026936R74J115L209M719M645K257k180r82k41l961m88K170J020J331M524
7275a008824Q70J726k536n557l926j247K880M667k5m653k367N99N478K419K338
7260a008158K881P10q480j833l345O876O853K807M896O27l42R61L830k4J79k219
7244i93781R82L779j35j153l423L553P0j77j256M28n393K760M070M774k17k091
7228i87210j649l646J124P220O860K532q461k175O07N196J238K56j354r29o92
$$ plain form
7213 -981083 -978000 -975867 -980831 -983364 -979997 -976362 -978160 -977334 -975653 -975935 -976735 -976351 -978517 -978841 -977790 -975218
7197 -975218 -970933 -970310 -976051 -981466 -984716 -985224 -985093 -981688 -977042 -970836 -969257 -968551 -969512 -967068 -966284 -967750
7181 -967750 -973967 -974751 -975567 -970071 -964425 -962783 -967881 -969720 -971495 -972098 -969686 -968622 -970660 -972006 -974860
$$ packed form
7213i81083L083K133m964k533L367L635j798Q26J681k82q00L84k166l24J051K572
7197i75218M285O23n741n415l250n08J31L405M646O206J579P06r61K444P84j466
7181i67750o217p84q16N496N646J642n098j839j775o03K412J064k038j346k854
$$ [...]
##END NTUPLES=NMR SPECTRUM
##END=
