##TITLE=Analysis number 328410
Compound Code cc 62326
Book Reference 464/140/5
Project Code adrs
Chemist Name chrisr
##JCAMPDX= 6.0         $$ Bruker NMR JCAMP-DX V2.0
##DATA TYPE= NMR SPECTRUM
##DATA CLASS= NTUPLES
##ORIGIN= Bruker BioSpin GmbH
##OWNER= nmr
$$ XWIN-NMR		Version 3.5
$$ Mon Jun  4 11:41:34 2007 GMT Daylight Time (UT+1h)  MAYBRIDGE\nmr@NMR_250MHZ
##.OBSERVE FREQUENCY= 250.131544655141
##.OBSERVE NUCLEUS= ^1H
##.ACQUISITION MODE= SIMULTANEOUS (DQD)
##.ACQUISITION SCHEME= undefined
##.AVERAGES= 16
##.DIGITISER RES= 18
##SPECTROMETER/DATA SYSTEM= dpx250
##.PULSE SEQUENCE= zg30
##.SOLVENT NAME= CDCl3
##.SHIFT REFERENCE= (INTERNAL, CDCl3, 0, 16.522)
##AUDIT TRAIL= $$ (NUMBER, WHEN, WHO, WHERE, WHAT)
$$ ##TITLE= Audit trail, XWIN-NMR		Version 3.5
$$ ##JCAMPDX= 5.01
$$ ##ORIGIN= Bruker BioSpin GmbH
$$ ##OWNER= nmr
$$ C:\u/data/dgb/nmr/ADRS/100/pdata/1/auditp.txt
$$ ##AUDIT TRAIL=  $$ (NUMBER, WHEN, WHO, WHERE, WHAT)
(   1,<2007-06-04 11:41:10.71 +100>,<MAYBRIDGE\nmr>,<NMR_250MHZ>,
      <created by zg, POWCHK disabled, PULCHK disabled
       configuration hash MD5:
       76 6E 9A 78 1E 09 19 81 EC 84 63 8F B0 6A 59 2D
       data hash MD5: 64K
       9C 43 DD 34 4A F1 98 D6 89 07 B6 55 42 03 4D B0>)
(   2,<2007-06-04 11:41:23.89 +100>,<MAYBRIDGE\nmr>,<NMR_250MHZ>,
      <Start of raw data processing
       ef LB = 0.3 FT_mod = 6 PKNL = 1 SI = 32K 
       data hash MD5: 32K
       AA CF E8 69 3F DC 50 97 EB B7 91 9E E8 0C 41 F3>)
(   3,<2007-06-04 11:41:25.43 +100>,<MAYBRIDGE\nmr>,<NMR_250MHZ>,
      <apk 
       data hash MD5: 32K
       93 92 5F 0E 55 A0 6C 9E 1D E2 87 79 3D 0B E7 8D>)
(   4,<2007-06-04 11:41:26.12 +100>,<MAYBRIDGE\nmr>,<NMR_250MHZ>,
      <abs ABSG = 5 
       data hash MD5: 32K
       1A C1 F7 11 18 85 48 AD 2B B9 24 A8 CD 6D 75 15>)
$$ ##END=
$$ 
$$ hash MD5
$$ 22 30 3C C9 7D 94 A9 C8 CF 97 4C 26 BD 49 62 CB
##$RELAX= 
##$RELAX= 
##$RELAX= 
##$RELAX= 
##$RELAX= 
##$RELAX= 
##$RELAX= 
$$ Bruker specific parameters
$$ --------------------------
##$DU= <C:\u>
##$EXPNO= 100
##$NAME= <ADRS>
##$PROCNO= 1
##$TYPE= <nmr>
##$USER= <dgb>
##$AMP= (0..31)
100 100 100 100 100 100 100 100 100 100 100 100 100 100 100 100 100 100 
100 100 100 100 100 100 100 100 100 100 100 100 100 100 
##$AQSEQ= 0
##$AQ_mod= 3
##$AUNM= <au_zg>
##$AUTOPOS= <3 >
##$BF1= 250.13
##$BF2= 250.13
##$BF3= 250.13
##$BF4= 250.13
##$BF5= 500.13
##$BF6= 500.13
##$BF7= 500.13
##$BF8= 500.13
##$BYTORDA= 1
##$CFDGTYP= 0
##$CFRGTYP= 5
##$CHEMSTR= <none>
##$CNST= (0..31)
1 1 145 1 1 1 1 1 1 1 1 1 1 1 1 1 1 1 1 1 1 1 1 1 1 1 1 1 1 1 1 1 
##$CPDPRG= <>
##$CPDPRG1= <>
##$CPDPRG2= <>
##$CPDPRG3= <>
##$CPDPRG4= <mlev>
##$CPDPRG5= <mlev>
##$CPDPRG6= <mlev>
##$CPDPRG7= <mlev>
##$CPDPRG8= <mlev>
##$CPDPRGB= <>
##$CPDPRGT= <>
##$D= (0..31)
0 1 0 0 0 0 0 0 0 0.06 0 0 0 0 0 0 0.0002 0 0 0 0 0 0 0 0 0 0 0 0 0 0 
0 
##$DATE= 1180953669
##$DBL= (0..7)
120 120 120 120 120 120 120 120 
##$DBP= (0..7)
150 150 150 150 150 150 150 150 
##$DBP07= 0
##$DBPNAM0= <>
##$DBPNAM1= <>
$$ [...]
##$SUBNAM7= <"">
##$SUBNAM8= <"">
##$SUBNAM9= <"">
##$SW= 20.6930455092707
##$SWIBOX= (0..15)
0 0 3 0 0 0 0 0 0 0 0 0 0 0 0 0 
##$SW_h= 5175.983436853
##$TD= 65536
##$TD0= 1
##$TE= 683.16
##$TE2= 300
##$TE3= 300
##$TEG= 300
##$TL= (0..7)
0 120 120 120 120 120 120 120 
##$TP= (0..7)
150 150 150 150 150 150 150 150 
##$TP07= 0
##$TPNAME0= <>
##$TPNAME1= <>
##$TPNAME2= <>
##$TPNAME3= <>
##$TPNAME4= <>
##$TPNAME5= <>
##$TPNAME6= <>
##$TPNAME7= <>
##$TPOAL= (0..7)
0.5 0.5 0.5 0.5 0.5 0.5 0.5 0.5 
##$TPOFFS= (0..7)
0 0 0 0 0 0 0 0 
##$TUNHIN= 0
##$TUNHOUT= 0
##$TUNXOUT= 0
##$USERA1= <user>
##$USERA2= <user>
##$USERA3= <user>
##$USERA4= <user>
##$USERA5= <user>
##$V9= 5
##$VALIST= <valist>
##$VCLIST= <CCCCCCCCCCCCCCC>
##$VD= 0
##$VDLIST= <DDDDDDDDDDDDDDD>
##$VPLIST= <PPPPPPPPPPPPPPP>
##$VTLIST= <TTTTTTTTTTTTTTT>
##$WBST= 1024
##$WBSW= 4
##$XGAIN= (0..3)
0 0 0 0 
##$XL= 0
##$YL= 0
##$YMAX_a= 353066
##$YMIN_a= -291392
##$ZGOPTNS= <>
##$ZL1= 120
##$ZL2= 120
##$ZL3= 120
##$ZL4= 120
##$ABSF1= 16.522
##$ABSF2= -4.171173
##$ABSG= 5
##$ABSL= 3
##$ALPHA= 0
##$AQORDER= 0
##$ASSFAC= 0
##$ASSFACI= 0
##$ASSFACX= 0
##$ASSWID= 0
##$AUNMP= <proc_1d>
##$AZFE= 0.1
##$AZFW= 0.1
##$BCFW= 0
##$BC_mod= 0
##$BYTORDP= 0
##$COROFFS= 0
##$CY= 12.5
##$DATMOD= 1
##$DC= 0
##$DFILT= <>
##$DTYPP= 0
##$F1P= 14.0000005364418
##$F2P= -0.99999901652339
##$FCOR= 0.5
##$FTSIZE= 32768
##$FT_mod= 6
##$GAMMA= 0
##$GB= 0
##$INTBC= 1
##$INTSCL= 1
##$ISEN= 128
##$LB= 0.3
##$LEV0= 0
##$LPBIN= 0
##$MAXI= 10000
##$MC2= 0
##$MEAN= 0
##$ME_mod= 0
##$MI= 0
##$NCOEF= 0
##$NC_proc= -2
##$NLEV= 6
##$NOISF1= 0
##$NOISF2= 0
##$NSP= 0
##$NTH_PI= 0
##$NZP= 0
##$OFFSET= 16.522
##$PC= 1
##$PHC0= -48.95596
##$PHC1= 3.20367
##$PH_mod= 1
##$PKNL= yes
##$PPARMOD= 0
##$PSCAL= 4
##$PSIGN= 0
##$REVERSE= no
##$SF= 250.13
##$SI= 32768
##$SIGF1= 0
##$SIGF2= 0
##$SINO= 400
##$SIOLD= 32768
##$SREGLST= <1H.CDCl3>
##$SSB= 0
##$STSI= 32768
##$STSR= 0
##$SW_p= 5175.98343685301
##$SYMM= 0
##$S_DEV= 0
##$TDeff= 65536
##$TDoff= 0
##$TI= <Analysis number 999999
Compound Code 99
Book Reference 9
Project Code 9>
##$TILT= no
##$TM1= 0
##$TM2= 0
##$TOPLEV= 0
##$USERP1= <user>
##$USERP2= <user>
##$USERP3= <user>
##$USERP4= <user>
##$USERP5= <user>
##$WDW= 1
##$XDIM= 32768
##$YMAX_p= 325167915
##$YMIN_p= -130154
$$ End of Bruker specific parameters
$$ ---------------------------------
##NTUPLES= NMR SPECTRUM
##VAR_NAME=  FREQUENCY,     SPECTRUM/REAL,   SPECTRUM/IMAG
##SYMBOL=    X,             R,               I
##VAR_TYPE=  INDEPENDENT,   DEPENDENT,       DEPENDENT
##VAR_FORM=  AFFN,          ASDF,            ASDF
##VAR_DIM=   32768,         32768,           32768
##UNITS=     HZ,            ARBITRARY UNITS, ARBITRARY UNITS
##FACTOR=    0.157963299565203, 1,           1
##FIRST=     4132.6476996994, 0,             0
##LAST=      -1043.33573715361, 0,           0
##MIN=       -1043.33573715361, -130154,     0
##MAX=       4132.6476996994, 325167915,     0
$$ Real data points
##PAGE= N=1
##DATA TABLE= (X++(R..R)), XYDATA
$$ [...]
24046 7823 15646 -10783 -26382 -26360 -16964 -9583 10862 -1362 -3406 16881 16943 -6179 -11821 -37765
24032 -37765 -32590 1258 25159 27987 14335 839 9896 19612 19758 1907 -15965 -20219 -3218
24019 -3218 -10088 -9486 -2564 8981 10632 13633 23213 10658 -15796 -17178 -9348 -5064 309 -10726
24005 -10726 -18765 -39245 -55568 -43833 -45537 -38330 -31699 -26097 -34160 -26944 -17031 -12292 -11374 -5462
23991 -5462 -7197 -16710 -25142 634 -2399 -22461 -27367 -19896 -6246 15248 16294 5946 -10738
23978 -10738 4078 20120 21670 15767 30791 33701 27970 23434 15162 23277 29281 19501 11865 3279
23964 3279 8265 -4431 -12768 -4142 1722 23554 28153 17994 746 11878 27712 27565 11480
23951 11480 -5619 -25343 -29037 -5420 7686 -2199 -16110 -6266 8788 9903 9060 3650 4148
23938 4148 4664 15962 26154 11447 10236 26703 8875 -13729 -26817 -36582 -24589 -25917 -20772
23925 -20772 -11604 -26178 -19726 5064 12031 932 7138 16516 2595 2203 13755 38308 50561
23912 50561 47461 21936 10004 13460 8028 -5304 -14420 -5577 34827 33518 8307 -6486 -18038
23899 -18038 -21371 -19534 -13171 4819 1432 5024 16673 31805 9697 24895 38514 29975 28190
23886 28190 22944 19807 35456 47711 26797 14551 11109 -2224 14080 49578 53759 29312
23874 29312 -3619 -5843 -13475 -22815 -27830 -19242 -7411 -8512 -8164 -11136 -26050 -30236 -5449 1808
23860 1808 -24844 -25415 -10910 -8461 -9515 -11033 -11400 -10165 -13094 2324 15800 21934 -2941 -14245
23846 -14245 -28472 -22822 -15568 -13703 3304 4855 6244 -2631 -17938 -16736 -18345 -27148 -22907 -13157
23832 -13157 -6682 -19234 -25331 -23547 -9828 4163 9508 23775 34758 -65 4368 19775 -2880
23819 -2880 -8654 -2424 14247 10247 17566 -56 -27476 -22739 -16147 -16545 -7585 -13207 -27543 3072
23805 3072 31410 30317 7486 -7222 -13064 -7437 13792 20333 31568 40254 20535 1442 2810
23792 2810 -10411 -15975 -21120 -6251 -8204 -16141 -21977 -33333 -3337 19059 23270 12979 301
23779 301 2505 18417 36699 28460 8469 741 11352 14637 -4391 -8724 3336 24205 17783
23766 17783 -21782 -23216 -11525 -16918 -18919 -15385 -13473 -9547 -18907 8416 29331 28772 10542
23753 10542 -3616 -3162 7462 18543 23584 26818 28981 23867 6694 -18147 -22026 -28764 -33778
23740 -33778 -14372 -20013 -29160 -28828 -34951 -20946 18682 37734 25531 -353 -30970 -40774 -41233
23727 -41233 -18563 -17717 -22066 -32002 -26618 -39485 -31843 -29808 -34684 -35661 -26701 -32970 -36084 -28347
23713 -28347 -25503 -31802 -36919 -25197 -12543 -18087 -20847 -18612 -10265 -9351 -7159 -10333 -34106 -40707
23699 -40707 -31534 -2260 34924 32148 32736 36479 9285 -13330 -15070 -6764 9314 12180 4620
23686 4620 13846 19430 34430 27275 1186 -5867 5102 4433 14085 24848 21757 3469 -10012
23673 -10012 -11151 -20724 -32550 -25680 -18409 11491 18761 19262 11509 633 -1268 -17225 -21079 -6856
23659 -6856 21523 12015 -25825 -41366 -37749 -25699 7840 10984 -11613 -4635 -1594 -9949 -17736
23646 -17736 -20286 -41923 -40425 -23305 -18157 -30193 -34799 -52174 -59435 -48800 -25011 -18688 -32621
23633 -32621 -27164 -15146 -24833 -13352 13293 28208 19562 689 -2269 5337 11543 22146 13295
23620 13295 -11394 -29969 -21092 -315 22817 29180 11710 -22709 -30010 -25949 -13139 2372
23608 2372 14029 5459 -14134 -34509 -44194 -11384 5014 5505 -15190 -42455 -39058 -25690 -18618
23595 -18618 -11412 -687 -10296 -39916 -32919 -11634 -224 18071 18856 -3589 -21794 -20532 -5955
23582 -5955 13191 15163 -11403 -23919 -21483 -26069 -23509 -23911 -29047 -12144 -4773 -26118 -31322 -11930
23568 -11930 230 6374 9187 6067 10257 10679 -4750 -20929 -12328 4863 -2021 -10405 13370
23555 13370 25506 7789 -19537 -28718 -21738 -16296 -12005 -12020 -23354 -18194 -18891 -20429 4918 9097
23541 9097 -3200 -4425 -457 2831 -8432 2140 10347 7751 9126 6483 4570 3771 776 -11876
23527 -11876 -5748 -652 -9036 1549 -9300 -31739 -15944 -4464 -2583 867 2831 -18510 -18945
23514 -18945 -18691 3509 13352 -10910 -8674 -25503 -38132 -46136 -22649 -558 4599 7418 -13441
23501 -13441 -13338 -9096 -15794 -13978 -23218 -5518 -12688 -6202 -16931 -22923 -22976 -11195 11382 7632
23487 7632 12444 20858 25363 33437 11251 172 -15092 -32791 -46427 -49357 -64159 -75611 -43326
23474 -43326 -24192 -37718 -54387 -43131 -21746 -12135 -3077 -7761 -5483 -568 -7609 -7189 -5126
23461 -5126 4090 -8969 -14213 -6782 -624 7385 20359 25110 3595 -18594 -5032 10958 14128
23448 14128 5060 -6721 -20940 -24005 -11599 -4479 -906 10196 2871 16361 989 -16170 -27693
23435 -27693 -8925 21019 36437 31620 4641 -18809 -12684 -14140 -20338 -17225 -7345 -1245 9324
23422 9324 -2948 -10199 4620 26620 30677 -14419 -2160 15748 29809 11646 15074 14919 -3631
23409 -3631 12215 14447 10931 10852 8544 11923 27316 10766 -25907 -49558 -46957 -23603 11795
23396 11795 22988 26303 26545 12351 -4786 -21754 -15902 -7483 5793 1661 802 5131 9715 -10836
23382 -10836 -38405 -18444 -19640 -22642 -12912 -28649 -11778 -11282 -7040 6454 16882 14238 -7149
23369 -7149 -14620 -28208 -15275 -9232 -3383 -1876 -5423 -6680 -11965 2261 4892 11497 1991 20093
23355 20093 19402 13137 21927 28635 31353 21956 15154 20874 15416 -9373 -30965 -33975 -27596 -21260
23341 -21260 -14956 -24576 -30238 -17991 -25114 -45628 -38331 -15176 -26614 -36429 -31298 -51787 -37554
23328 -37554 -16214 13988 26238 18518 3954 -19585 -20880 -37173 -35731 -28403 -3600 -16789
23316 -16789 -40507 -41631 -29356 -14072 4625 16274 11457 1642 -12979 -7190 -21035 -50984
23304 -50984 -66389 -59065 -21479 -11423 -9616 -111 -5676 -19301 -26556 -19236 -10665 -1726 9724
23291 9724 10750 1824 14036 33430 27713 20007 -2404 -5730 -17536 -18895 -18201 -12212 5442 -6155
23277 -6155 1695 -2462 2009 373 -32672 -38749 -49730 -38409 -25087 -38154 -24724 2940 1146
23264 1146 -10451 -9157 -4688 -10453 -32029 -13784 -4243 -9766 -14275 -8632 -2779 -24877 -15132 -22303
23250 -22303 -26606 -12623 -6303 -3025 5208 5351 15519 17486 7061 12410 24830 25663 24967 2307
23236 2307 -21253 -39935 -44825 -21981 -13140 -13685 -1130 1788 -6338 -16066 -51568 -33573 -16761
23223 -16761 -16855 -990 475 -15598 -11408 32464 40063 40493 31027 25489 21349 23688 25122 18109
23209 18109 19067 14742 11084 1431 17501 22234 680 -14044 -36794 -21802 -11783 -3584 13646
23196 13646 8195 7724 -5681 -2500 -907 -964 9733 -8263 -10624 -4071 -20134 -12049 -13417 -19122
23182 -19122 -36270 -22828 -10271 -27435 -29073 -20526 -8472 4503 28842 26084 -5119 -18477
23170 -18477 -12479 -26211 -23865 -13558 -14702 -19699 -13701 3918 -8736 -14212 -18117 -8499 19741
23157 19741 22982 -8478 -20889 -23292 -16260 -25309 -11177 -7352 -4079 8299 -14140 -18094 9363
23144 9363 8389 4063 5336 -828 -13391 -3018 -10415 -11076 14783 18190 5754 -2327 9307 -205
23130 -205 -8679 -8102 134 -7572 -15950 -15100 -13633 -13042 11103 16409 10647 494 2788 -8145 -13944
23115 -13944 6625 32951 26282 3559 -2617 -7691 -10079 -877 -4254 2388 16750 14984 15132 20684
23101 20684 -5203 -21404 -15353 4458 -743 -17387 -17477 199 -6196 -27012 -24077 7566 35607
23088 35607 16820 1949 5342 4133 -16061 -30466 -28994 -29044 -34192 -28324 -21112 -10924 -4685 7721
23074 7721 11219 -5067 -6703 -29007 -37998 -27213 -35565 -29519 -6263 7620 8733 4312 8029
23061 8029 -7412 -8414 11609 7150 6619 -1664 -5166 1546 -1507 -28499 -52644 -35618 -11400
23048 -11400 -36794 -41730 -32858 -28354 -47617 -22560 -337 17355 7361 -17037 -16142 -11504 -16084
23035 -16084 -25393 -13571 -4536 2832 9356 -6763 -9077 12829 -4664 -22041 2895 34081 15387
23022 15387 -8856 -28841 -41098 -29200 -9626 -14408 -25539 -11259 -6583 445 -603 -16563
23010 -16563 -24515 -6734 933 14037 15916 14864 10682 -1099 4735 16652 20483 -1235 -26932
22997 -26932 -43116 -27878 -12192 1587 -328 -7655 -27180 -32498 -19122 -22492 -18658 -8116 -20662
22984 -20662 -41022 -24997 -1699 6814 15535 34892 60834 73961 55576 9827 -1898 -2300
22972 -2300 2465 -1545 3247 6573 -14578 -21953 -16222 -16712 -5374 -1015 -15907 -25541 -35476 -33306
22958 -33306 -28448 -20982 -19121 -14740 -11055 -6938 -12724 -35793 -42258 -25055 -18732 -9180 -14659 -43389
22944 -43389 -50003 -34509 -19290 -40687 -48618 -11573 24740 19003 12423 14621 24722 2351 -14379
22931 -14379 -4092 11667 12042 1747 5035 17069 2279 -13006 -24895 -3771 -4007 -1994 -3295
22918 -3295 -10768 -2909 7941 7002 3295 1780 -5099 -7496 -9 7623 11935 -6505 -23781 -12610
22904 -12610 -15566 -10285 4494 1896 -8588 -27275 -16298 -25856 -35570 -26820 -16363 -19867 -15527
22891 -15527 14488 18336 17053 32855 19353 -10468 -4704 10553 22892 3680 -4382 4302 13821
22878 13821 25992 19636 12620 4310 2679 -12199 -7662 -20006 -22520 -19277 -28743 -10999 -4349
22865 -4349 -7734 -18273 -16651 -22296 -38072 -56624 -59695 -32876 -23260 8509 3439 10510 20575
22852 20575 4379 11238 12464 4666 3543 -8155 -24 -11703 -27985 -18293 -4133 -21222 -21872
22839 -21872 -7016 -23280 -27426 -27808 -23532 -10412 -21152 -19796 -4543 -13302 -7410 -17939 -3419
22826 -3419 14079 10878 -1796 -10174 -3421 -7821 -23387 -26848 -17131 20888 28407 15480 -21044
22813 -21044 -38094 -33546 -16064 -22231 -39416 -43870 -25940 -21388 -19406 -5898 4834 3551 10925
22800 10925 20457 26260 7010 -4524 -24868 -21064 -11543 -4578 -208 12139 22449 9150 -9637
22787 -9637 -16431 21001 38549 40368 33067 41792 24709 11527 9573 1283 6938 7451 7674 -4226
22773 -4226 -21628 -16521 -27595 -35324 -16926 -19116 -42332 -48413 -63971 -63326 -55301 -40394 -16439
22760 -16439 -3532 -16997 -11740 -17186 -22229 -36277 -30563 -26823 -14749 -10867 -8479 1026 10422
22747 10422 -10637 -24622 -36569 -53805 -43986 -27878 -22013 -21115 -11047 -12952 -25032 -27519 -13729
22734 -13729 -2689 -4038 -28003 -29322 -21817 -23301 -14920 5842 35471 49275 47028 40734 22425
22721 22425 -2335 -5938 5514 2381 -5994 -11365 -23597 -23712 -34960 -38638 -13339 -5118 10725
22708 10725 -94 -19486 -8588 8028 9001 -4135 -13411 -15705 -16100 -18465 -4957 7298 23133
22695 23133 -4794 -34073 -9819 -4145 -27107 -28259 -19789 -20713 -31583 -40269 -30451 -26811 -21047
22682 -21047 -21899 -6344 11715 21060 18415 1794 -8380 -1094 -14990 -24493 -20685 2415 20544
22669 20544 -1042 -10982 -3006 13156 12230 13366 3195 -18542 -13787 -7776 -19882 -29638 -21572
22656 -21572 6743 -2653 -9315 -2386 -6729 -2350 12314 9907 -9325 -11162 -31044 -13994 -5321
22643 -5321 -20850 -39030 -17521 -17585 -13498 -3029 -12134 -24781 -8198 8138 -5042 -38825 -61024
22630 -61024 -30270 -30633 -41074 -29618 -10224 1139 13826 12865 4449 -17135 -32011 -15061 4962
22617 4962 5976 9468 13562 795 -29061 -43839 -45795 -41238 -42296 -33221 -18200 -1378 -449 -8960
22603 -8960 1031 -1561 -10837 -7021 -4798 4135 20124 15082 6487 4152 6320 -2624 -3217 31293
22589 31293 30592 27734 19370 12527 1744 2949 2407 9519 17513 -772 -12264 -3836 -11397 -15453
22575 -15453 223 8487 2591 -5956 -15495 -23001 -24728 18954 46904 40400 37358 29517 26074 31386
22561 31386 35996 45773 40586 30785 10060 11203 16920 19495 -6710 -24509 -17555 -2974 1619
22548 1619 7406 12870 23269 13454 -15208 -13269 -13074 -14344 -18102 -17060 -5471 12594 16407 10795
22534 10795 4565 9532 27693 26195 18661 3928 -6325 -3559 11603 15444 10033 15488 7977
22521 7977 -125 13118 23063 8863 -24310 -25047 -30507 -14764 -9927 -40151 -35262 -31127 -17095
22508 -17095 2673 24077 25323 -521 -19920 -40494 -30296 -22719 -12536 -25953 -34815 -37863
22496 -37863 -54263 -72183 -62993 -32193 -14901 -1318 9287 9487 -1823 2628 -6512 -20056 -29888
22483 -29888 -34385 -44837 -31277 -23781 -36139 -27430 -26263 -31613 -29863 -30920 -40065 -32241 -22257 -13896
22469 -13896 -15296 -6128 -11985 -10015 -12552 -11725 -10441 -4399 -1037 6723 -2769 -12937 -23497 -13036
22455 -13036 -3459 -13257 8272 714 -2920 -8624 -23097 -19856 -20389 -22992 -9797 5902 20854
22442 20854 -4070 -21661 -31406 -21251 -33773 -22284 -26850 -37907 -35995 -12905 533 17670
22430 17670 12401 -12383 -217 6928 -8259 -19200 -10020 -6444 -19081 -20472 318 7606 2145
22417 2145 -14328 -16486 -12880 -16469 -4834 6719 13 6590 9011 6129 8523 -11100 -23301
22404 -23301 -32792 -20487 -17714 -25273 -52186 -23663 8640 7151 -12153 -29341 -13330 -10435 4670
22391 4670 5685 632 -16943 -10690 -6711 -24515 -8573 -3937 29937 37545 22866 16627 -2755
22378 -2755 999 462 -14239 -3260 1381 -1444 -17527 4072 4902 -18088 -30843 -22417 1623
22365 1623 5189 10512 5851 -19038 -40502 -25810 -32027 -33868 -19079 -22160 -20896 -30052 -22086 -7314
22351 -7314 6087 25348 24399 8424 -11940 -940 -3894 2446 12811 25510 20084 5131 -18804
22338 -18804 -22346 -4872 -4119 -14598 -25056 -41549 -32573 -9541 572 -957 9237 14214 12392
22325 12392 13355 16826 25939 11348 -9889 -2344 11405 17993 18164 12313 18810 9124 -7779 -24908
22311 -24908 -33022 -24707 -29810 -16672 -1079 -9028 -1119 14306 13050 15371 21751 18788 -817
22298 -817 764 11114 -5104 3324 11999 -12386 -13234 -10746 -12988 -286 -12678 -30858 -30957 -31958
22284 -31958 -22792 -21479 -4925 11903 22749 20978 20148 27112 11436 -3353 21927 12891 -2277
22271 -2277 -5443 -17695 -9986 -9884 -6194 -3159 -7302 3001 7558 7421 22043 14586 -3962 -15234
22257 -15234 -16315 -20282 -19037 -382 -7537 6154 6250 12920 32654 39814 42333 30106 27366 27410
22243 27410 17065 -9890 -22634 -8947 -4559 -5182 -12783 -25264 -20641 -4942 -31784 -42712 -32673
22230 -32673 -15771 -15192 -5069 2378 -5322 -5201 -5029 -19400 5321 10381 7913 6086 -13744 -7442
22216 -7442 -5080 8237 8429 -11513 -34400 -36832 -41606 -46114 -22326 -8564 -8629 -22240 -14984 -6344
22202 -6344 -15181 -22916 -11402 -20573 -31466 -20525 -21616 -11354 -10117 7898 16492 -23301 -66101
22189 -66101 -49518 -32671 -21266 -6906 13775 12477 2845 -28720 -48376 -48311 -24817 -9043 10516
22176 10516 -772 -19928 -37153 -24630 -8226 564 -11493 -9157 -12454 -23148 -22364 -10908 -1355
22163 -1355 -20173 -29565 -26608 -29934 -12512 -1037 -11692 -10265 -14292 -14288 -12154 -6749 -9880 -12517
22149 -12517 -3555 -102 3290 3300 22033 28195 14671 -6153 -13255 -16781 -15497 -17265 -5518 4071
22135 4071 4519 7929 17508 16675 337 -17223 -21507 -2597 -823 -9412 3190 -734 -3746 -23811
22121 -23811 1826 5800 9570 -944 -6319 12 10921 13130 30836 32954 32784 18617 5912
22108 5912 11467 -1498 -4013 -8817 -14086 27 22138 14785 8226 -12403 -14093 -9519 -11782 -1380
22094 -1380 7410 -27368 -50081 -51129 -41418 -17943 -13 -7905 -24262 -9283 -8937 -1811 -4597
22081 -4597 -4952 -20111 -27977 -31812 -28093 -25298 -27616 -31458 -14406 -21143 -29577 -1319 9348 -1605
22067 -1605 -21168 -38207 -38904 -20093 -2215 13361 21289 7667 -14700 -38973 -37057 -35165 -28316
22054 -28316 -38804 -42416 -37200 -5009 11849 9698 8936 13789 4579 -1721 -6454 -2246 1656 9557
22040 9557 6459 5616 6717 13091 21045 8211 7886 11584 -6959 583 2701 -14926 -26780 -28868
22026 -28868 -27071 -23700 -6193 -2258 -9002 2630 1228 -9886 4717 15336 11511 15083 19828
22013 19828 24961 9662 4431 10367 5004 -948 -7129 -6224 -9008 -2780 -35232 -30350 -23082 -38096
21999 -38096 -50988 -61529 -48613 -24968 -1101 5017 -461 3876 4021 1724 1321 -974 30645
21986 30645 20974 19596 23106 14716 9466 -863 -25384 -25855 -4057 7744 -6846 -4898 7975
21973 7975 5949 -5754 104 2779 -2821 -21056 -39062 -54061 -52791 -25626 -5385 3101 -17325
21960 -17325 -39540 -23633 -19966 -15943 -19728 -10846 -23714 -37383 -16291 8308 8863 6201 -10965
21947 -10965 -28591 -37935 -37707 -35625 -23306 -12060 -1376 -11352 -8700 -41 16996 23826 18453
21934 18453 941 12581 20266 4896 2274 2255 -12633 -10607 -22078 -31573 -40945 -22775 3296
21921 3296 5952 -9767 -18073 -5093 18658 21940 9050 59 -1111 1873 -7333 -23915 -26694
21908 -26694 -18288 -10858 16589 16938 -8442 -20688 -25620 -24006 -8538 -2133 1495 -17673 -53589
21895 -53589 -66268 -32074 -11673 -7684 -12952 -25903 -20056 -18248 -31847 -23663 -20221 -11924 -13125
21882 -13125 6584 11098 3360 6658 12389 17914 7938 6743 -1010 9306 23435 13557 15650 14183
21868 14183 24509 51554 61071 56199 42055 6479 -11777 3645 12501 10455 5090 363 -167
21855 -167 -5583 11771 34391 33365 21566 17358 17377 19037 17119 13976 3911 8716 -2102 5978
21841 5978 12817 18732 8626 -3017 151 -12257 -26824 -21642 -20319 -20391 -18174 -15266 -19046 -5594
21827 -5594 -25695 -23970 -15054 -21206 -29433 -35609 -17924 42 1800 -3731 5074 -21072 -29592 -12139
21813 -12139 -10903 -18725 -11034 -13951 -16740 -15261 -15124 6860 10693 -690 -3664 -16563 -14425 -16330
21799 -16330 -37956 -18053 26474 43445 33260 7715 -7052 4048 -867 -6529 -10395 -11127 -4439
21786 -4439 -3432 1324 -11124 -20077 -35347 -32642 -24520 -24371 -31013 -36286 -56653 -62527 -56585 -41341
21772 -41341 -34080 -30212 -40327 -25076 -17917 -9639 -8331 392 -3766 -15835 -14096 -9443 -2001 -15548
21758 -15548 -35786 -40281 -26484 -15886 -11938 -7152 -15958 -11768 5015 -17889 -17564 4215 -8375
21745 -8375 -36850 -52598 -22882 -4165 -7947 -7500 22927 20986 13656 18940 23967 4263 10620
21732 10620 -5232 -14645 -10156 -20935 -12235 3155 23060 31376 1886 -4586 -16348 -16948 3534
21719 3534 -6730 -13362 -18830 -24984 -35633 -37610 -27517 -24695 -15511 -2791 5313 -838 -11887
21706 -11887 -6755 -30911 -20651 -19353 -22921 -22645 -21561 -14952 12831 13363 22896 18483 -2411 -4831
21692 -4831 6688 736 -5250 -1633 -12693 -9555 -17723 -32888 -33903 -25034 -18120 -8402 -26334 -44942
21678 -44942 -58876 -58208 -47246 -26689 -11942 -10137 -1234 8956 1309 -3133 -7908 -8208 -10789 -16120
21664 -16120 -19673 -18447 210 -5508 3315 -1315 -14853 -35004 -47502 -37595 -32776 -13272 -19133
21651 -19133 -14593 -11643 -1192 -3326 -25321 -32334 -22321 -28473 -23223 -30048 -31826 -3467 -8246
21638 -8246 -24187 -9156 -19754 -39632 -17945 -16975 -23893 512 -3347 -15802 -17375 -14881 -13788
21625 -13788 -1578 -27512 -37005 -23310 -25515 6929 22212 3254 -4911 -12702 -4994 -18883 -25374
21612 -25374 -23616 -18718 -16652 -9800 -689 -19854 -21009 -4386 17469 10753 -7392 -20646 -34230
21599 -34230 -34948 -24921 -31474 -30626 -20155 -180 16013 10017 -13048 -38968 -22654 -6766 2668
21586 2668 2561 -13562 -24273 -10110 -6766 -271 18448 28054 25021 19089 8454 14456 8551 13856
21572 13856 8809 7852 15870 23103 3940 -11775 -184 10688 24961 18526 16010 8340 -874
21559 -874 -2256 15201 14525 9046 15613 24256 27032 14833 10412 6080 26106 23595 15995 -4370
21545 -4370 -20247 -10236 174 -22629 -10366 16296 15898 6039 7895 38058 33728 9021 7157
21532 7157 14180 7044 9400 22062 8090 -17234 -14253 -3445 10675 2319 -33183 -39158 -36539
21519 -36539 -32760 -44887 -48148 -18183 -3957 21759 22382 13130 -8011 -6311 -22619 -16400 -18534
21506 -18534 -14791 -3898 -6571 -5301 7048 4891 -2752 7336 27705 26685 7607 4500 12372
21493 12372 -4881 -1789 -2271 -17769 -15861 -27902 -19395 -17994 -31688 -28633 -25990 -38075 -37196 -25571
21479 -25571 17118 20299 -11545 -22953 -12285 3069 7812 19130 22150 25109 27239 25730 38388
21466 38388 37560 22577 8847 2554 2555 -17277 -14405 -12398 -3916 23861 31915 14085 -1830 -12719
21452 -12719 -15252 -19482 -6086 -2387 2716 15784 22378 8047 -7745 -16198 -5690 -6118 3452
21439 3452 131 -17954 -35934 -13585 -7024 -6439 7271 7463 3437 -8981 -1197 -1808 2948 1575
21425 1575 -2202 -13661 -4882 6346 -10835 -37675 -31841 -24719 -16647 -26617 -22616 -23109 -23424 -3803
21411 -3803 -14882 -20242 10182 19467 1248 -29 18222 27630 29206 41002 34133 1734 -6449
21398 -6449 -7269 -6494 -20214 -13350 3988 8229 21439 12567 -15870 -25177 -16399 -23978 -29534 -30364
21384 -30364 -39581 -35404 -24156 -19057 -19311 5831 -14922 -29204 -22039 -26935 -27103 -27920 -20123 -12721
21370 -12721 -12090 -11810 -7088 31 5822 10933 -688 -7245 -22858 -26500 -18164 -25205 -37000 -32405
21356 -32405 -19237 -3361 -5758 -21762 -18057 -15999 -2454 -12253 -16816 -7560 17728 32299 20726
21343 20726 5401 10155 4243 -37841 -35968 -20544 15048 23310 25535 20656 9107 8526 5943
21330 5943 5033 10426 15733 20721 30684 14208 -534 -15214 -38805 -29927 -510 4467 -6582
21317 -6582 -5035 5048 -6425 -11515 7253 7410 -3538 -3108 -8611 -22013 -22804 -19118 -17513 1023
21303 1023 -9090 5267 8526 -9491 1571 4524 -15934 -2281 -1708 -13112 -3186 4724 -3977
21290 -3977 -13561 -18538 -17994 -36124 -39277 -22555 -20425 -11774 -11394 9431 10569 13035 13247 33058
21276 33058 28485 25466 4651 -6037 8849 21403 13049 -11418 -17428 -32124 -31062 -22134 5056
21263 5056 2047 5721 13263 8962 5744 469 -4839 -15714 -15214 -13350 -6663 7939 23469 28664
21249 28664 25892 15875 -6734 -7455 -26059 -26251 -30093 -14922 12773 10969 17708 21424 13032 19377
21235 19377 19522 11783 -3580 -41846 -38752 -2121 7828 -6185 -9998 -6084 -6097 -5818 6251 24528
21221 24528 33789 25190 9769 8061 23650 17500 7994 4033 -5611 -82 -20487 -16043 -13341 -34312
21207 -34312 -51720 -34965 -26620 -32974 -41830 -43740 -9986 -5460 -8948 12848 3220 9848 22182
21194 22182 14720 11767 1054 -11089 -2772 9239 25526 8033 -23460 -39541 -14245 -11147
21182 -11147 -1304 -9694 -8836 17741 9694 -11096 -188 11729 10231 1956 11495 14099 4641 7532
21168 7532 19878 32427 40231 35714 23815 -9183 -16879 -25747 -15380 -7710 -6053 -6698 -6676 -12847
21154 -12847 -23186 -24609 -9189 9970 17507 22437 7551 878 14842 14615 13120 16359 8829
21141 8829 -17425 -26581 -12196 1608 5495 -11240 -19247 -35391 -8583 -902 2011 -17077 -32677
21128 -32677 -18669 4532 -6289 -10838 -19148 -26386 -15354 -12669 -16788 -11380 2849 6887 4814
21115 4814 46522 55552 38497 12632 1785 21610 22211 13095 29960 52221 55885 34075 8585
21102 8585 -37 1345 9751 29613 30393 -16728 -49616 -46088 -42402 -53263 -35771 -20123 -30512
21089 -30512 -24294 -10814 -13383 7340 2753 -825 21590 27894 13311 -15591 -18228 -4133 31462
21076 31462 25302 2848 1951 -8146 -15934 -13073 5252 -736 6958 2755 12973 44214 58998
21063 58998 53059 25585 19954 12924 3022 124 -13688 -10455 -15655 -8320 -2184 14668 -8923
21050 -8923 -35530 -26342 -19256 -29046 -16890 -1903 4251 20941 27585 12512 -11563 -11207 -6671
21037 -6671 -7920 -7377 13574 9267 7044 -12558 -29103 -15207 504 -3438 -10162 13935 34669
21024 34669 47852 44231 34179 24372 13404 3210 4992 18131 19130 -90 -4633 -9290 -13548
21011 -13548 9818 13797 6119 -14413 -257 21438 13739 -8830 -4554 1422 10231 16538 -8866
20998 -8866 -22232 -2165 5093 8747 19399 18383 11294 14501 14393 5370 -7602 -5769 2374 6347
20984 6347 1952 13034 1024 13581 30154 17937 16258 -1792 2969 -11463 -9107 -13614 13474
20971 13474 10845 -8215 -25189 -31088 -21918 -26580 -16359 -5275 -10660 -34486 -11425 15566 26563
20958 26563 15694 5018 -1029 17640 24592 21144 -711 6754 9878 31292 29258 -1838 -13314
20945 -13314 114 24627 29134 19036 7144 11598 27139 28813 17894 -7359 -18037 3127
20933 3127 18628 12646 30705 39665 33841 38360 44537 50769 35126 12927 4202 1838 -1258 -11568
20919 -11568 -11828 -4033 31013 44573 25514 20655 10456 -26446 -23604 -23334 -24326 -18157 -23537 -24850
20905 -24850 -7514 -5039 -19342 -17160 -25749 -37171 -27819 1599 10219 12333 11698 13975 24953
20892 24953 29693 19744 10726 -17065 -18012 -22396 -15020 -20112 -46295 -54373 -51304 -34779 -37616 -23832
20878 -23832 -18891 -22464 -12258 4356 1678 12448 -1929 -7886 -12250 -6420 -3927 -1585 -762 -7116
20864 -7116 -2936 11004 9261 7302 19301 18044 16382 30642 34180 35397 14221 -2506 7089
20851 7089 22018 21158 -8499 -35773 -38495 -23568 -18818 -20139 -784 -9631 -8693 -99 2260 6810
20837 6810 7695 -11327 -33887 -22757 -5925 -295 -5783 -6605 6952 16980 20820 44467 54651
20824 54651 37802 38696 35775 8752 296 5011 -1547 -24289 -14678 8889 -10065 -3005 4137
20811 4137 20907 9121 9578 12841 2588 -755 3664 -10797 -22874 -16638 311 9215 6851
20798 6851 3001 2569 -11682 -10765 5794 -9405 -875 20591 37776 22220 18122 26769 22738 9814
20784 9814 -7390 -19333 -26841 8666 20299 12838 4574 13217 8756 7266 -8080 -11893 -26928
20771 -26928 -9842 7407 -517 -6542 -5543 -25387 -29416 -8932 2261 9867 8266 -7496 -32418
20758 -32418 -22886 -18471 1911 13924 17504 28437 24626 42454 44241 34516 4359 -10447 -1705
20745 -1705 -8478 -18069 -504 3602 18364 34235 32981 25835 21292 17812 23692 27913 20096 13101
20731 13101 16434 13800 -2431 -15646 2303 13127 4213 8692 749 16914 46295 33571 13305
20718 13305 7603 1418 -23317 -31441 -18929 -22468 -22627 -562 17346 22924 9048 22483 15426
20705 15426 14148 3052 -246 -1402 -7413 -19195 -13071 -9198 -14942 -28053 -27997 -15603 -6777 -6900
20691 -6900 -8818 -5698 -3856 -2884 -22682 -27813 -27567 -36740 -24932 -8531 -3576 -6640 -22332 -40428
20677 -40428 -44128 -6290 32391 32590 38582 19499 18545 29352 46172 50979 44136 32181 31055
20664 31055 36171 -686 290 10873 11555 21121 17407 13727 8867 32089 38491 19003 6213 14496
20650 14496 14823 22417 12156 -96 22822 38938 36737 22504 -9173 -1129 -6307 -19792 -20723
20637 -20723 3147 29627 36364 23558 8761 -1992 -10293 -19644 -12647 -3781 13292 -10900 -31534
20624 -31534 -22351 -12296 -8949 -12388 -13537 -9621 -874 -3818 -9800 -17127 -7907 -13299 -16181 -14854
20610 -14854 -11828 -21551 -15575 -17001 -3856 -7426 6523 7835 -4742 -37746 -48346 -35151 -6700
20597 -6700 10167 9146 10196 2080 2371 3419 -2473 -4809 17905 15233 -4067 -6177 -8983 2197
20583 2197 31120 41206 6099 -11583 -16029 -22156 -13944 4925 13277 5589 8648 3301 6893
20570 6893 9334 -648 -3077 -3748 -5383 2936 -1385 -23801 -20801 -980 10701 -7876 -9659 27132
20556 27132 33342 41826 39833 26566 31764 10451 -1463 11352 14799 11150 -5100 -12561 7641
20543 7641 17288 18697 12456 3833 5776 350 1931 -1414 -5009 -23053 -25673 -22090 -15753 5694
20529 5694 5886 -4896 3680 27163 34181 5308 -4318 14038 17301 8076 4262 -5070 -5905 6275
20515 6275 5394 1973 6160 37369 7559 -6732 17369 26028 22512 5861 -11106 14937 25707
20502 25707 25190 17548 2030 12611 9683 18538 25122 1407 -16727 -17428 -10494 -13106 9799 27084
20488 27084 25451 31770 30624 12427 21188 24863 3019 1445 -2230 686 5377 3610 20834 23643
20474 23643 8880 3937 426 7164 14578 33579 39658 26116 7874 21987 13165 16607 33063
20461 33063 31003 25151 14837 21210 43834 26295 878 -1054 12110 320 -7029 11365 5631
20448 5631 -16419 -17597 1383 12096 27325 8463 -21308 -33231 -39525 -38557 -16160 -9847 3360
20435 3360 7746 8100 28348 40032 23269 7578 -81 1757 8129 -3812 1923 15975 18958
20422 18958 33337 40120 37002 31397 48341 45548 32764 14000 1101 15828 26819 30564 17302
20409 17302 16071 47377 36261 23055 18547 2368 3041 16584 28911 43912 34716 27300 36007
20396 36007 33777 21553 27551 12433 18325 16722 4938 18283 32046 32980 36713 21919 7960
20383 7960 -31729 -25796 -14374 -11219 -6554 -19066 -16426 1947 25367 10335 -10832 20099 10940
20370 10940 -10464 2867 28911 36421 28201 26816 39147 39619 14139 16613 13624 18754 16212
20357 16212 -8869 -26522 -23649 -21861 539 14616 17869 43008 45422 39049 26879 14887 4318
20344 4318 25709 29430 26299 25985 33619 25926 14283 5286 -8611 -15153 -26704 -35430 -39321 -22715
20330 -22715 -20329 -18354 -4392 13799 22099 13622 5002 1252 -9324 -18066 -16628 944 18781
20317 18781 -6596 -26972 -22645 -14339 -16465 -20241 -6889 12299 7716 16949 18801 21354 7256
20304 7256 15910 18255 15737 9930 -6164 -7807 11466 7191 3111 15001 12272 -10731 -1501 16569
20290 16569 18264 17229 21219 35842 28708 34240 29140 15031 26876 51030 46291 34172 12266
20277 12266 17652 16843 13933 4432 4525 12385 11512 -745 -1955 -25894 -26549 -30274 -21629 -12202 -11181
20262 -11181 -18354 -10530 -3582 2629 -2850 -6127 7652 18364 2690 1535 16823 590 471
20249 471 -14481 -7931 11245 19341 4030 18056 29332 13328 6102 17639 30579 27163 22680
20236 22680 11214 4733 6192 8574 2322 28261 33536 24783 14442 7614 23921 25867 31461
20223 31461 16752 4898 -9684 5963 18630 31634 23945 -4381 -852 -379 -7600 -7103 -8005
20210 -8005 28322 36953 9127 7364 30142 26757 25115 47073 67219 75345 91335 94697 85514
20197 85514 81739 54834 26138 17655 13366 17211 12659 13662 9684 23275 -422 10487 33362
20184 33362 30101 7944 3949 7719 -10150 -17402 -6454 1683 -3750 7994 32528 48939 61511
20171 61511 46705 17081 -18148 -25298 -17596 -12738 -14037 -10289 1609 22934 37817 15860 -1890
20158 -1890 19693 25119 29784 45794 59443 54093 46376 32693 11328 20347 22471 26068 22356
20145 22356 16146 13741 16295 23998 32242 39874 36015 42884 35616 22681 23924 38517 34232 27573
20131 27573 25900 15279 13386 10576 14625 8690 -1020 -3178 -21447 -24168 -16716 -1411 5366 6490
20117 6490 19563 5111 -14182 -15673 -12651 9015 27444 34617 28596 7880 5190 25962 36434
20104 36434 54909 55517 27879 15821 27668 30234 13672 12669 33435 27754 11001 1422 -21751
20091 -21751 -37276 -16398 700 1318 2536 -20837 -25494 -22172 -84 15617 18206 13361 21980
20078 21980 14896 5094 -3928 9693 24927 12238 9394 13080 12665 20080 11454 -3992 -11616 -18160
20064 -18160 -10706 -6428 -10638 -8790 2432 -7431 -12503 4355 29489 36444 26563 7051 9188
20051 9188 17345 19218 18473 4305 -12304 -26483 -11519 -19162 -5749 14626 33428 30079 22555
20038 22555 20187 32439 17519 16714 18144 4143 621 -6345 13667 9832 -8876 -6182 941
20025 941 29606 24232 93 -2165 2531 2237 -3108 19756 39276 24328 20137 19007 8994 4744
20011 4744 4657 -8285 -16137 -1846 2096 13459 13904 12882 16441 14499 18194 27296 46214 31070
19997 31070 9411 2581 20034 29026 4588 -337 -1839 -16154 -32461 -21800 2393 12472
19985 12472 21413 22189 44786 66710 67308 59227 49873 17801 -7267 2064 13718 6823 10173 16552
19971 16552 10905 -4926 5470 29176 39769 45955 31831 10220 -1363 -15878 -20725 -7079
19959 -7079 18785 23668 12631 19718 15546 25101 43364 36002 19159 26264 31828 47113 23015
19946 23015 13474 8193 -8144 20569 28979 14593 23535 25332 31899 18828 21715 24103 19798
19933 19798 22146 1214 -5847 16744 18260 -10179 -12425 2208 28044 14518 2039 18075
19921 18075 9924 5243 10058 20825 4505 -13036 -8712 -18607 -28972 -17459 -13532 -2954 -1561
19908 -1561 8324 25677 25417 21222 18882 25892 19319 8494 6981 6781 27912 47889 45934 52446
19894 52446 38039 43667 31178 23780 27035 41804 34032 24349 13567 9307 18474 12732 8632
19881 8632 46604 50909 23136 16952 21586 23709 13028 2106 14621 8758 11295 8557 3882
19868 3882 10585 19141 30344 24025 21770 34965 38149 42107 47716 32028 29806 10731 -8037
19855 -8037 -2359 3687 21325 24065 23118 41074 42265 24169 1893 3832 10565 27690 30135 8067
19841 8067 8137 13106 14738 12695 6916 22278 17084 21651 36040 29044 34515 26608 8882 -4626
19827 -4626 1600 9663 11620 21848 41826 48183 46769 66219 62879 42101 6195 13858 29366
19814 29366 31560 36003 18943 8982 10841 4195 -7504 11447 23904 6676 -15421 -21882 1031
19801 1031 24252 33450 59169 59984 44235 37618 28112 38439 32514 28455 27042 13726 -1705
19788 -1705 762 605 12526 22918 10528 14510 20156 8845 13495 43800 48703 20471 8864
19775 8864 -9311 -15865 3378 14693 12896 17959 31250 27218 31953 37777 40725 46558 51136 40149
19761 40149 27832 31853 44532 32580 6779 2261 5339 17219 36600 62693 51261 32990
19749 32990 22208 13798 10727 30199 36263 23858 24472 5533 12189 16398 18296 23926 11211
19736 11211 -5 3129 11606 -9944 -7599 -1775 5541 26004 46803 27375 27644 31205 29151
19723 29151 16873 -1986 6482 17282 -1332 -7202 1555 13963 12551 16782 35227 46245 30280
19710 30280 20649 15616 523 -3212 4216 6580 12756 34247 16641 -91 5448 -5648 -8554
19697 -8554 21157 22744 13477 25693 28526 12102 13772 13457 4002 2688 -18480 -14575 9127 23074
19683 23074 8983 11690 14553 13577 23124 24988 18859 8653 -9262 -7859 11025 20150 17812 18964
19669 18964 36067 31810 21383 17478 19999 11782 15166 32260 23664 22187 34570 26008 26572 27377
19655 27377 22905 27630 31065 24213 20447 32441 42675 24124 -4836 -17454 -2790 20848 24918
19642 24918 -3514 -3386 -5872 -7549 12115 36344 40855 27432 20327 -1987 -9840 -190 -3899
19629 -3899 18711 34326 27600 32554 37223 44348 46921 40836 24279 16433 18994 51225 41093
19616 41093 15609 10510 33770 37537 25448 14069 18092 29801 42939 46804 40990 42146 34031
19603 34031 27861 31353 27873 28766 26287 13701 8012 18980 13141 8497 19742 19995 36226 57436
19589 57436 31902 14986 12804 28982 41835 45047 23190 -7444 -17075 4997 17703 19071
19577 19071 17481 -1690 -21476 -23242 -11243 8521 -340 8465 27009 8838 -16303 -7524 -17386
19564 -17386 -19111 -9749 -3227 6283 26561 20041 7881 19542 10163 -25569 -16241 -17739 20525
19551 20525 47623 30126 30829 21434 33073 38109 15783 -17861 -25026 -19099 7773 15663 16847
19538 16847 21508 10266 -5444 -6473 -26448 -18541 -20678 -19247 -8045 -28287 -31979 -41514 -42293
19525 -42293 -13488 -6165 2574 -8306 -15687 34 -5650 1701 21888 29870 10858 2617 3191
19512 3191 18853 13504 1969 6753 1922 3323 5686 3748 8861 6552 -7521 9267 -1405
19499 -1405 -11722 618 2316 23196 25933 25306 31455 55001 38069 30236 35432 42854 33410 21113
19485 21113 16568 32681 35975 38508 36319 19228 16709 16784 9943 14372 16426 32674 13674 5977
19471 5977 -2217 3743 9984 16172 2867 -6079 -15057 -10950 -4459 -3554 12043 3978 -16475 -10785
19457 -10785 2179 13324 -10875 -21867 -29069 -29892 -27395 -28489 -42081 -33567 -15003 -22693 -24748
19444 -24748 -31242 -26659 -21624 -17899 -341 28027 30976 33731 30694 8942 23842 33977 27706
19431 27706 30239 10528 6377 31349 42385 30287 20115 15783 4527 2193 -1355 9332 1069
19418 1069 788 -4255 -3894 -2451 4 -16959 -4520 -6234 -5825 13396 21966 39680 23162 -2732
19404 -2732 -21910 -9055 24621 12798 29169 36537 16634 2950 4534 37947 35430 28619 22487
19391 22487 -437 -20730 2299 8750 -3551 -14294 -4836 -2261 -13180 -24977 -28722 -16335
19379 -16335 5302 -877 -11216 -17576 10864 25088 14777 -4518 -17077 -27827 -30179 -12529
19367 -12529 -22141 -28332 -23880 -5065 16018 -2173 -2527 11393 1391 380 4403 7654 10854
19354 10854 -1702 8552 1127 -6942 19495 13467 -11410 -409 18011 23359 26131 24312 17095
19341 17095 8540 27541 32921 27163 15901 13309 2158 8830 6778 11098 12434 -6010 4664
19328 4664 3878 6466 25709 43272 32542 18331 7410 2567 11769 16947 8863 13817 23561 31413
19314 31413 17743 24061 36331 16877 3915 -535 -977 5771 -1039 -206 13057 10083 17947 6119
19300 6119 8517 7512 4520 15913 22073 25328 24477 26633 17067 23919 11770 -2767 -12744 -18715
19286 -18715 -15405 -8884 -5144 -19791 -13592 7419 7882 -14101 -21793 -21613 9042 41267 38378 34944
19272 34944 28608 18542 8240 2094 2573 6659 13031 18009 6447 -15865 -7660 1621 5509 -18866
19258 -18866 -17347 -8950 -3877 14455 14664 16986 23763 20343 34503 39716 68067 76742 110689 165005
19244 165005 231936 287810 276594 214633 182004 123485 74935 66534 77931 77809 87421 127771
19232 127771 196419 240131 263793 274646 261775 237052 181243 138869 127291 92634 33929
19221 33929 6779 -1215 11384 25391 34955 33852 29189 23164 25063 48593 55703 52102 55670
19208 55670 68775 72806 57349 37888 20359 32643 31025 21261 29502 21587 20407 23613 7871
19195 7871 -5044 -2000 -8529 -7798 -13704 -18703 6936 24708 37381 46575 30934 8134 -1518
19182 -1518 10023 -10300 -22627 -19569 -35782 -34137 -16300 -19639 -9806 -2136 6058 8736 -4953
19169 -4953 -7977 -30746 -64620 -67370 -40553 -25759 -13112 15413 30736 8289 -18699 -8636
19157 -8636 3716 16372 19952 24303 25453 20556 3755 -1929 -1050 -5097 -24601 -16346 7200 15904
19143 15904 -7388 -18732 -28751 -26689 -18158 -42456 -59333 -41451 -15347 -9557 -17970 -7334
19131 -7334 1835 -3331 -4110 14838 17077 210 -5320 -16496 -27114 -27667 -31271 -35351 -24767 -12567
19117 -12567 4182 -15178 -23004 -31173 -30123 -35504 -16649 -18530 -20986 -17483 -15102 -1970 20804
19104 20804 19048 2522 15364 -15301 -26962 -36455 -39155 -36368 -12616 12111 14518 19700 30886
19091 30886 32662 27075 13257 5257 12924 15137 6974 5114 -4710 -2326 14939 24860 30533 29087
19077 29087 24306 18224 4932 5983 12549 6336 -1671 -22661 -39849 -13449 8723 -299 -20168
19064 -20168 -20035 -24358 -30437 -8224 13437 20755 30628 35127 18513 6322 7883 8853 -20558 -27952
19050 -27952 -22993 -21374 -25178 -21404 -10517 -10616 -18974 6246 -1615 -2648 -596 -1678 -17354 -11844
19036 -11844 -3915 -15023 -26043 -11802 -3073 -16470 -27082 -30519 -22509 -28512 -16210 -2874 11533
19023 11533 11525 6480 -10595 -22590 -19149 -7716 11264 22125 20178 27782 24636 14090 25913
19010 25913 9581 -2015 -15206 -4049 -19120 -22559 152 21452 22894 28314 55738 36825
18998 36825 9408 69 -18416 -22698 -42483 -16052 6927 14089 25878 12544 10805 10727 3589
18985 3589 -5871 -17900 -1370 7154 8865 -5377 -2343 -19381 -40252 -56407 -49000 -16895 -10469
18972 -10469 5176 7968 16078 6534 -17143 -37643 -62674 -60545 -49641 -37586 -19659 -2374
18960 -2374 -8561 -9940 -11877 -9149 -23515 -45858 -49238 -49112 -26793 -19381 -25467 -24769 -28423 -15605
18946 -15605 -15585 -10826 1310 -3689 -17042 -2437 2544 3355 10112 -4266 -22858 -26512 9872 25266
18932 25266 13814 21600 22641 33964 16808 10425 12267 -12542 -12144 17231 32871 43401 19704
18919 19704 10770 11065 3746 -8696 -14439 -9670 -3571 -23140 -28633 -25617 -17477 -20335 -11899 1173
18905 1173 19564 30802 36409 41790 42159 19385 21475 12397 -6858 -22360 4042 15598 11517
18892 11517 5086 6723 11516 32233 31441 33588 25619 21748 34472 36579 41561 32638 31051 31894
18878 31894 4421 4838 19197 27429 18273 15427 -2261 -5494 12622 20642 8163 -11320 -3137
18865 -3137 10406 -13706 -1313 -6844 -14184 -8434 17106 6697 -696 -15037 -15152 -5982 -18831
18852 -18831 -31211 -46941 -18429 -1684 -15303 -15166 -16037 -25579 -13997 -1755 -6144 1437 4217
18839 4217 -2543 14991 17467 -250 -7512 4146 17476 13134 -7825 4935 11616 4999 -10459
18826 -10459 -20397 -13183 -11901 -14940 -9957 -2296 3074 -9962 6656 1925 15212 -3744 -13543
18813 -13543 -15917 -20611 -11013 -17049 -18913 -33831 -21756 -26462 -12192 9295 9399 9790 8085 -7174
18799 -7174 -6689 8952 22755 36531 24206 -9113 7783 18026 29079 41403 28245 28079 33396
18786 33396 28364 20377 23010 38603 40881 30165 34198 35714 13184 14128 7000 41631 78505
18773 78505 84713 114792 136541 134269 138382 172598 218237 208006 180558 165748 144661 138438
18761 138438 146617 133587 111862 113206 107300 82482 73276 47046 48766 36214 44943 75085 79789
18748 79789 47757 44995 32174 48544 52829 67160 59275 64615 70496 66115 69284 78888 88923
18735 88923 80758 93231 120276 136330 126290 127576 122913 118272 114508 114833 116062 93809 102360
18722 102360 123912 115664 115531 120521 113478 108882 106708 128096 145096 164630 172419 170274 154754
18709 154754 155982 148905 131625 149216 181131 193476 204298 207127 214794 246551 267717 258422
18697 258422 242612 246093 233455 234792 247913 294788 319891 308188 336422 369958 419437 458227
18685 458227 473823 480987 506646 544828 616513 681668 717791 743072 743978 735540 729530 757180
18673 757180 816117 890279 959040 1035893 1104310 1162989 1249589 1360854 1503323 1654221 1801759
18662 1801759 1912019 2061034 2257866 2500161 2854060 3338483 3955997 4748961 5846722
18653 5846722 7442031 9772343 13254987 18519873 26189285 35837518 44546163 48576757
18645 48576757 46628068 39248109 30202731 23357247 19358230 17527668 17356302 18751754
18637 18751754 21970951 27587027 35873322 45224956 51655666 52253540 46578028 36651473
18629 36651473 27189880 20545848 16304450 13555142 11652677 10253357 9171663 8317709
18621 8317709 7654322 7114881 6656597 6275583 5934941 5640254 5388013 5185908 5015436
18612 5015436 4851041 4646152 4385555 4127229 3891734 3655902 3414784 3173284 2960071
18603 2960071 2762825 2587429 2424040 2325855 2219022 2083617 1942217 1805484 1692148 1616215
18593 1616215 1524420 1447435 1385721 1303632 1217942 1133624 1053221 990243 924123 860211 840257
18582 840257 848116 808871 748186 727944 685850 653733 640126 608057 575472 536962 519334 499668
18570 499668 477417 447922 400966 390273 378710 339743 323552 315709 284403 280533 283547 272880
18558 272880 251318 238019 235274 227628 236608 239281 229393 234091 213942 213424 209972 200685 191142 172585
18544 172585 164801 160398 153392 137996 141671 154543 161339 167435 146084 142946 146780 142126 149837
18531 149837 168457 165164 159226 163345 130740 112027 110847 129508 160565 168131 150136 154996 182913
18518 182913 198443 203225 197292 179559 189930 192095 216708 226795 235067 236622 259123 275644
18506 275644 288750 294342 316441 388163 440056 554674 709592 907585 1089362 1223550 1247702
18495 1247702 1138693 951316 777990 671973 625501 664126 755669 884208 1046008 1249092
18485 1249092 1431693 1494349 1421206 1243658 992521 777065 643241 578431 522367 492909
18475 492909 510722 544762 544258 535273 476192 418724 366708 350501 319516 294414 268834 240167
18463 240167 230679 233018 201870 187435 202448 202530 202979 189843 197633 192694 175264 184551 186577 186110
18449 186110 184234 178800 173174 147367 124082 140908 138484 114025 100443 97012 106002 94009 81063
18436 81063 70764 92829 120085 117952 89737 71215 79036 78647 93984 87961 67343 71431 68539
18423 68539 64688 83350 73967 44303 31308 48418 50619 35625 10126 4033 2891 -9188 2817
18410 2817 26726 18251 17784 14315 3663 4824 29743 26884 5722 7299 18712 28068 2934
18397 2934 -856 7899 18022 22565 20038 8371 8294 35915 39081 48667 59272 78601 96936 96136
18383 96136 66402 42378 25042 10287 22172 44694 52556 27837 23309 12211 9403 20951
18371 20951 5244 20281 21665 -1624 1802 7543 7582 44690 67942 66982 45428 57888 63992
18358 63992 55530 53291 50177 55192 58748 54736 48922 4520 -4216 -9169 -5848 -2973 -5014 -5767
18344 -5767 10198 30909 35842 55601 65900 72198 85558 88751 73649 54267 63102 52394 53122
18331 53122 53701 52689 69405 69011 59432 43114 17406 12920 16959 24295 914 26926 42981
18318 42981 31227 27783 22714 14756 6799 -446 7515 15927 37298 39863 41633 45039 43046 41289
18304 41289 23187 8083 4484 30778 29259 24009 22057 37183 16759 19412 17112 15007 38504
18291 38504 26549 19988 11611 4083 -6763 -2320 11790 9895 13473 1308 -8657 6988 6074
18278 6074 -8551 -4206 14646 32374 43984 42963 40144 37043 24319 14936 4997 -972 12078
18265 12078 6073 10985 10214 -2967 7269 15697 11381 7512 -1339 -17391 -24250 -23237 -19308 -10515
18251 -10515 -22356 -16078 -2738 -3285 -5217 4896 14246 31414 21143 -2926 -5508 16747 24814
18238 24814 17963 22472 34681 59913 53177 26895 3896 -3698 -23515 -5202 6553 16055 2086
18225 2086 -1029 9350 7401 -1352 -15993 -25376 -15472 2404 2728 7470 22006 25572 43199 19864
18211 19864 19695 8633 -11938 -36025 -48489 -24885 -5867 -12953 -16949 -21355 -26111 -13772 -5084
18198 -5084 9387 50071 55001 51096 35081 45704 42262 26322 23424 25772 30307 34099 16644
18185 16644 9766 27933 34424 41833 29611 28856 38298 26044 22076 21677 32573 44651 53553 57801
18171 57801 76128 71158 57500 74385 89298 119423 129840 121612 113041 99795 82484 85755
18159 85755 104328 124891 149256 138021 115962 98071 88076 89212 102159 97039 96452 99777 95873
18146 95873 106641 110422 147540 155547 159705 143813 102885 120222 147945 133857 151530 186596
18134 186596 193820 199897 216461 234446 241173 246968 266656 288913 325241 389039 460767 515495
18122 515495 575765 700269 851546 1053507 1304665 1620569 2073029 2772604 3822267 5435945
18112 5435945 8124635 12745306 20128506 28558345 32881820 32185933 25884680 16864037
18104 16864037 10762867 7516883 5708490 4582542 3836351 3301594 2891563 2612557 2414572
18095 2414572 2256926 2070849 1945009 1885253 1841391 1773996 1733176 1736190 1740219 1702580 1590072
18084 1590072 1452251 1351427 1266784 1187204 1083174 976156 888649 830454 756364 676841
18074 676841 627495 600200 564154 517931 468682 441740 428743 402742 359687 347101 337262 315439
18062 315439 301834 299539 286019 282737 267854 252870 236133 232567 242647 224811 197779 204987
18050 204987 225675 225078 239216 267108 288000 319956 349974 408156 419781 397836 360069 320510
18038 320510 284326 245089 243796 249311 257338 273711 311957 362154 390686 420270 442389 402752
18026 402752 341230 299925 250243 210522 206690 197237 203333 196100 183873 164615 159123 140160
18014 140160 124364 128278 126845 111460 107006 114844 116199 98996 71362 90721 102880 96007 82164
18001 82164 111463 129875 129383 114795 112552 103107 95705 99779 99495 123443 158639 142286 143270 165835
17987 165835 189524 182198 178159 177578 179972 206217 201508 185425 187485 167989 155056 154554 169651
17974 169651 175761 192498 187459 187584 200071 191112 204054 201782 199622 215618 231740 238194 223973
17961 223973 230200 240123 234826 238737 247535 276621 277714 274855 286540 316651 344986 359645 369550
17948 369550 399172 432340 463600 479838 509706 548647 612747 685893 795573 899442 978145
17937 978145 1013371 1018928 1023948 1090522 1194730 1371699 1575649 1802918 2075492 2388636 2773867
17926 2773867 3259585 3843144 4571442 5550343 6973989 9186640 12699560 18405960 27451069
17917 27451069 39798971 51336509 56418350 53664880 43312040 31113465 22777716
17910 22777716 18309441 16261715 15918302 17196626 20413111 26407196 36024361 47656173
17902 47656173 55612497 56305653 49328119 36899028 25977501 19135463 15096311 12584454
17894 12584454 10884756 9675546 8764514 8020806 7368358 6833746 6351015 5972036 5643687
17885 5643687 5379356 5123586 4899532 4697732 4555493 4418093 4235660 4009824 3780161
17876 3780161 3508964 3227361 2952437 2704454 2513401 2367145 2207110 2052902 1909162
17867 1909162 1795316 1683976 1592328 1497609 1392251 1291433 1242025 1191187 1123539 1055971
17857 1055971 1003589 977638 952241 913044 879723 836731 793724 746570 689963 669308 624379
17846 624379 582623 544067 524848 487439 481370 485933 482041 438176 397985 406915 388122 348906
17834 348906 324293 320295 328774 319355 316292 289388 295235 289096 272486 271837 284514 273848 266506
17821 266506 249514 197952 175492 168744 156003 159024 162214 174554 189544 208710 215197 211882
17809 211882 217261 243159 242618 252410 210076 186771 178883 164800 163902 135219 118791 107566 108172
17796 108172 115881 128992 129456 134217 136092 153804 152737 177210 198066 169411 152562 167036 146723
17783 146723 124524 140835 151951 139368 124349 134736 133940 122305 103036 97276 113420 114462
17771 114462 90018 91939 100451 113863 125855 152605 143986 152336 168569 172493 186485 153396
17759 153396 101218 93484 114895 130970 121365 107176 101764 117316 122759 112489 115340 134481
17747 134481 142521 135720 140068 149412 133052 115506 114443 119738 129441 136139 117372 108958 104763
17734 104763 86848 75136 82175 105224 119718 115947 112862 97806 92019 96890 92110 93877 95787
17721 95787 88047 87315 88649 84606 96583 99602 110878 116494 108598 94281 81817 69312 70007 71407
17707 71407 69832 68957 72237 69777 75840 83929 88309 89541 50873 59422 74960 63588 34328 25086
17693 25086 28310 34106 35831 31617 33432 24714 21462 11324 13239 21555 5191 -9132 21255
17680 21255 30739 5901 -4031 9071 11071 24312 36445 28375 29511 23751 18501 4419 -711
17667 -711 3787 20178 34009 23051 29765 43052 43948 36567 38483 55971 58300 49407 18221 12269
17653 12269 41189 54853 36554 21046 -1226 -4619 29293 30101 16884 791 7136 50595
17641 50595 56898 76903 104961 91965 69823 64386 51932 40983 42880 58506 69390 63351
17629 63351 61974 52934 64676 55503 47052 57913 65614 59751 60813 50217 23217 -649 17102
17616 17102 40710 37806 41583 55121 82569 95886 92377 63097 44332 60036 52353 58548 53373
17603 53373 68186 74050 59541 60180 96104 132281 133773 152200 201821 260320 348028 484883
17591 484883 723653 1007205 1221972 1279923 1186330 943159 698788 514545 428570 394567
17581 394567 403336 444653 556213 755623 1033597 1265561 1332669 1225888 958405 660526
17571 660526 472676 373155 331570 315852 278412 245866 235158 211367 182714 161904 152842
17560 152842 149123 137941 133958 128998 135791 144084 126152 105952 102704 125170 113712 93538 97164
17547 97164 106161 102925 76997 75696 72115 51615 55428 60619 49637 30345 44317 58789 22090
17534 22090 5920 35657 38311 39528 37743 13717 3536 14195 23284 40343 49450 45831 29947
17521 29947 38777 30987 11633 -8836 4637 35761 54283 43411 14724 18625 28595 38814
17509 38814 49298 51641 50662 51755 34463 36322 10024 -51 10845 9351 6045 9864 35848
17496 35848 11184 -22376 -8859 4316 7935 -1500 -14968 -8443 18680 28261 26918 34850 64801
17483 64801 58991 48264 22173 13449 8713 -8302 -12548 -7260 32451 19823 -696 1212 4777
17470 4777 3218 7473 13112 27993 7976 21264 32454 34470 39884 31046 30127 26119 8248 -21110
17456 -21110 -45762 -57221 -54220 -22461 10587 17954 17263 31183 16595 34827 54056 60498 89508
17443 89508 138593 169274 188812 178329 153154 129565 94653 60954 36415 26581 32964 19441
17431 19441 2164 6642 2196 10538 2637 2317 -4955 1551 9839 24624 18841 -781 -3750 -18756
17417 -18756 -26433 -40730 -40499 -6376 10359 10888 -666 5820 5476 7299 14088 25293 18603 5344
17403 5344 21246 43811 39719 13178 1578 -5145 18190 37264 22364 21786 12801 -10056 -4225
17390 -4225 8953 17247 13838 24367 49423 31110 38694 36999 11747 11960 -19026 -42254 -27796
17377 -27796 -9292 -1068 9037 -6197 9513 20009 18429 8326 12692 15876 28989 28999 35437
17364 35437 27812 32356 34250 24792 25610 31917 46240 51569 35487 28495 24088 17873 24137 34282
17350 34282 31757 13659 2732 755 34341 42901 64074 59438 67733 110678 147699 188260 262391
17337 262391 294165 285466 244747 186141 152689 128176 100476 82740 97139 127773 172680 208976
17325 208976 253718 316805 322209 267487 209794 155019 138023 114862 98045 102641 95777 86878
17313 86878 65931 53046 43213 32990 14121 -7154 5343 10872 10478 6931 340 -2125 14360
17300 14360 33917 39087 44483 38713 18919 11636 11269 1624 14893 -543 -13287 -15238 10521
17287 10521 7050 2231 -3158 -1521 1944 -8726 -3776 2244 13779 23878 16087 -1308 -10764
17274 -10764 -11298 5080 10097 -1362 3455 4306 7445 38682 25607 104 716 18401 12938 -17878
17260 -17878 -40010 -20458 -18111 -37572 -32442 -8604 -3834 -27757 -41009 -33121 -28849 -16074 6186
17247 6186 14638 24807 19510 15131 5263 -782 -12717 -16943 -23055 -27350 -38120 -17272 -7016
17234 -7016 15895 34949 24001 10488 -10067 -19596 3529 32921 41558 23842 5584 -10223
17222 -10223 -4390 7894 12989 16468 12545 1236 7133 -219 -12524 -5048 352 -11832 27671
17209 27671 27592 -580 -1284 -2325 -540 24096 30273 23296 30836 38872 18783 20531 62093 70660
17195 70660 49164 21054 33778 15944 6320 -15018 -12875 2228 10548 16652 11228 22940 23062
17182 23062 14201 10269 18568 34002 14968 13209 6898 -28224 -11372 11306 20515 13574 4466
17169 4466 -1166 11926 13935 1497 -3525 4732 20236 9336 19364 36912 15724 -15027 -22194
17156 -22194 -2915 -4069 1150 -5196 -38992 -20740 -16403 -23977 -9132 -27914 -36868 -17091 -21169
17143 -21169 -17584 5939 27620 42831 23480 20906 9604 -1926 14976 14771 10772 22820 15701
17130 15701 -2657 -2238 339 10984 6284 13843 14169 27131 18972 26856 30215 6738 -7887 -6368
17116 -6368 -15795 -31614 -8218 -2632 -19807 -28919 -29474 -31061 -20403 -6665 11369 22702 23644
17103 23644 32540 29691 13624 10175 6329 8516 25419 24854 25216 30675 21637 32284 44422 31049
17089 31049 27522 7671 1543 22329 12178 -14375 -31568 -17830 -8757 -10230 -28233 -19100 95
17076 95 17683 27566 25582 14564 -1035 -17799 -17862 -8663 -5170 -2800 -11216 -15736 -927 9310
17062 9310 -12548 -16871 -12043 9176 20299 20334 8563 9949 10120 9740 -16040 -19933 -31173 -26353
17048 -26353 -6297 -1670 2157 9081 7632 -485 -22619 -40188 -29920 -27582 -5671 24743 16718
17035 16718 8736 6844 11417 -4439 5291 14381 6468 -11191 -14837 -20075 -27498 -23705 -31337 -9414
17021 -9414 10459 15536 363 11482 28460 35498 31918 14334 -2008 -1261 21756 32250 41677
17008 41677 45043 35185 26679 26538 10231 -10489 -15682 -31518 -38569 -23939 -16608 -13428 -21577 -30045
16994 -30045 -30918 -31105 -10483 9397 11704 6009 16984 31967 27903 18786 15461 -17513 -26022 -16986
16980 -16986 -2844 5645 24020 29328 27860 22855 11851 11937 14721 15703 21308 19884 -961 -6860
16966 -6860 -11541 -2513 11173 -872 -23895 -5245 6640 -17355 -46752 -48529 -48975 -60731 -53529
16953 -53529 -45645 -34308 -3044 -6632 -28909 -45595 -42620 -9645 -6559 -13978 -12708 -17170 -29179
16940 -29179 -26664 -30451 -12858 3585 -3908 -2351 16027 23079 24990 5847 -8098 -1124 -14056
16927 -14056 -23041 -18443 -13562 -10892 317 8305 3194 -7105 -10088 -17584 -30528 -38874 -47270 -50421
16913 -50421 -38652 -28462 -26255 -26676 -17190 2968 -11878 4269 286 -24711 -24940 -22610 -17202
16900 -17202 -14729 -8033 -14617 -6102 -7264 -9674 5878 8408 2017 14022 11169 14460 36600 29440
16886 29440 10851 -10790 -19589 -6729 -3194 -14760 -20008 -22108 -16074 -19239 -12730 2204 20321
16873 20321 20435 17407 13476 -8610 -16096 153 31539 54487 22237 -89 360 -3362 197
16860 197 5302 -6472 3417 9263 -7530 -20344 -27640 -14618 678 8773 425 -7707 -3362 -18103
16846 -18103 -21918 -27560 -11506 -4228 4056 23533 29260 17392 13316 8521 -15648 -15697 -1887 8890
16832 8890 184 -13332 7821 -14799 -29155 -21676 -9100 -12776 -19338 -9626 -17616 -24937 -10619
16819 -10619 -19810 -25560 -30718 -14634 -8745 1697 -4653 -33193 -54399 -42684 -23448 -16302 -5148
16806 -5148 -18292 -21750 -30836 -19294 -26153 -22886 -8045 -29441 -30834 -23664 -23839 -28916 -8119 2735
16792 2735 2138 -10262 -1170 -2768 -19139 -14026 1410 16503 17164 24023 34917 19638 30290
16779 30290 22443 25541 992 4305 8575 -16250 -24362 -8360 7080 16594 36774 17513 4056
16766 4056 10651 32600 26148 10215 8928 21375 373 -22410 -27014 -20443 3450 9471 16977
16753 16977 4728 -15133 -21623 515 4193 -1518 -11408 -20077 -27254 -16462 -11442 -2475 -12487
16740 -12487 -8547 -10632 -5641 3949 25649 32778 22947 34641 45325 35672 27766 18639 -287
16727 -287 10290 15092 34659 35079 37324 25354 13785 21577 22050 19803 35193 40553 17104 15398
16713 15398 8408 13839 7299 -20844 -17531 13147 23743 25770 24985 922 -20803 -30322 -31708
16700 -31708 -24979 -24705 -26288 -18156 -10317 990 27558 29562 13157 18316 5485 16559 19221
16687 19221 13811 -2289 5417 7162 5424 11480 8147 10524 6336 9988 15422 -8407 -7166 -8236
16673 -8236 -12570 -17043 -21558 -20564 -2301 4152 -9735 -7021 -20002 -16091 -9508 -21299 -28924 -31866
16659 -31866 -25953 -19029 -28096 -31884 -16899 -7311 2808 7752 -2651 3875 -8751 -18782 -27204
16646 -27204 -26818 -14344 -12406 -19414 -211 21171 13649 9024 8647 6520 -10283 -15353 -16919 -18468
16632 -18468 -12557 -16283 -24840 -43777 -53237 -37923 -31836 -29443 -5065 -1078 -16380 -19505 -16848
16619 -16848 -35685 -27577 -3689 11112 4495 8562 -16429 -24959 -7271 -10109 -9386 -12623 -11150
16606 -11150 -8769 -9436 -10055 -13026 -15738 -23755 -18666 -16832 -10965 -10070 -22377 -15305 -15901 107 -10316
16591 -10316 -9928 -8325 -14597 11495 8902 -6383 -17122 -14396 5952 18057 27624 23193 18434
16578 18434 25812 41545 36335 14062 442 -5528 -4209 6291 16070 9580 5932 14000 44143
16565 44143 42208 34459 23577 16897 1908 -8490 -10988 -7267 -12863 -9012 -5644 -1328 816 -2192
16551 -2192 -13687 -27732 -31466 -41393 -14838 5796 15604 26229 26413 35629 38170 15868 -1975
16538 -1975 -7291 -41 7714 -4600 -23233 -23207 -36573 -31438 -20923 11200 31108 26384 9777
16525 9777 -4674 -1114 -2545 -1478 -1376 -3486 -6610 -6514 -26230 -13931 -4190 4788 4442 13134 19501
16510 19501 -367 -13404 -6760 12200 14791 37377 49030 24077 10017 792 23247 34742
16498 34742 49199 52095 43838 39206 36813 36336 22802 20756 29074 50212 53317 30209 29892 19260
16484 19260 8576 -18541 -42000 -36031 -9525 -6504 -2824 953 -14659 -19793 1282 33879 24811
16471 24811 21284 20452 6647 4679 4007 -5948 -13664 -12113 -5241 -12611 -30530 -27280 -22938 -23198 -25576
16456 -25576 -24866 -23364 -31846 -48057 -49791 -57078 -42220 -19851 -2189 17135 -2988 -28462 -24920
16443 -24920 -6100 5049 7409 5229 -7550 -10497 1989 18581 18177 23882 9692 -25824 -33609
16430 -33609 -37423 -15631 -15410 -10744 -18729 -13914 5920 29271 38568 26377 25520 12846 1139
16417 1139 -8819 -9222 -16670 -24690 -5398 7575 23308 15904 12874 4910 11850 11156 -86 607
16403 607 -1684 7421 1444 -4762 -22069 -22760 -23869 -32108 -22215 -35300 -15559 5444 1645 -14195
16389 -14195 -13173 -19054 -23494 -31425 -30323 -16456 -9411 -4649 -5617 -9930 -11952 -1662 2366 3760
16375 3760 -3378 -105 3459 9564 4697 -27454 -39487 -21145 -14564 -16393 -10852 5221 12082 7072
16361 7072 12812 -376 -10994 -16526 -19171 -27787 -43323 -42771 -28189 -26142 -26918 -15712 20560 42219
16347 42219 21230 574 -17447 -28081 -4491 3086 -4923 -6402 3243 18752 21549 14807 16019
16334 16019 2358 -2892 -5230 -11298 10004 19659 1635 -363 -23077 -31653 -27957 -30714 -1730
16321 -1730 -6638 -16136 -29442 -25253 -9238 1858 2234 19304 30150 11536 -10825 -18307 11831
16308 11831 28726 16122 312 7218 7377 8764 4775 -5542 -25799 -23100 -34422 -18366 -19739
16295 -19739 -21543 -22532 -6843 4882 14298 13232 1948 10384 -17029 -25265 -15656 -3072 -9406
16282 -9406 -24349 -30696 -35618 -34894 -28295 -10153 -13536 -28961 -28846 -34066 -25391 161 -12074 -9193
16268 -9193 -12592 -21325 -10713 -14165 2357 6563 248 -9250 -18807 -16196 -25148 -29561 -7461 -6179
16254 -6179 -12868 -9515 21772 28647 17581 1293 4489 6777 15086 3634 9348 4166 -970 -18479
16240 -18479 -5113 7883 -8562 -41572 -40712 -5413 -5817 8604 133 -23036 -20820 -25615 -27261
16227 -27261 -22936 -20724 -34481 -43158 -34397 -9888 -539 6548 6325 8461 -4811 -12341 -2207 9795
16213 9795 9871 -12765 -20723 -18733 -27289 -29872 -20372 915 -14676 -20794 -16143 -8798 6116 7924
16199 7924 -4618 8854 1572 -6937 -7883 -4006 148 -9366 -22966 -26413 -8237 12165 5519 -22351
16185 -22351 -28560 -15487 -5414 -10472 -1903 -415 -18022 -36477 -22692 -72 -12982 -32821
16173 -32821 -37050 -36509 -4409 34484 32194 9009 1266 13502 13651 14591 25950 46649 31228
16160 31228 13177 4027 4595 4402 162 -14781 4839 4062 11420 12137 -597 -13364 -12375 1694
16146 1694 -11571 -5716 -19682 -47995 -35285 -31871 -19394 -19084 -44594 -19688 14803 35025 40309
16133 40309 47927 4235 -15242 2482 13528 4981 -4080 -6436 -10882 -16151 -22307 -25628 -24197
16120 -24197 -21317 -23603 -36364 -17867 -16393 -21313 -29516 -44957 -35554 -21595 7251 17937 -5278
16107 -5278 -8184 -8617 12103 2892 9638 27964 20839 15912 -6277 -11699 -18187 -28894 -28524 -51581
16093 -51581 -69719 -53455 -40860 -33208 -45867 -49553 -19121 -2859 -10601 -8239 12400 24710
16081 24710 10470 -2056 4106 -6273 -21011 -15988 -25359 -43053 -27135 -19169 -16067 12639 5608
16068 5608 -7833 -7998 -19114 -34705 -22382 -9864 -5048 6352 12255 5443 2545 8066 27612
16055 27612 27020 19176 -10226 -14353 -14386 -9285 -1295 1890 10595 13321 4837 13435 28700 30058 25088
16040 25088 -5956 -24304 -27300 -16652 14068 25446 -1324 -11573 2437 -6830 -6278 -18097
16028 -18097 -20020 -17300 -19148 -14011 -20063 -17872 -16293 -17208 -5632 14175 18412 17588 -18645 -26028
16014 -26028 -20818 -36862 -16139 -11140 -5365 11731 20354 31555 21707 8877 6952 8481 -3619
16001 -3619 -1338 -606 -23221 -22596 -14143 3137 6662 4801 -21895 -39706 -24991 1552 11209 -1640
15987 -1640 -14358 -15762 7340 -1837 -24878 -25289 -15234 -17855 -6775 -5583 17773 29390 28736
15974 28736 24537 4317 -6316 -1208 2943 12297 14238 -593 -8747 -30617 -31417 -13006 -6501
15961 -6501 2092 21720 16108 -629 -4716 -10128 -12953 -23583 -22765 -6295 1933 -20277 -42111
15948 -42111 -32651 -14008 -4356 -14013 -24388 -27131 -24167 -21307 -29228 -27241 -19028 -22505 -29196 -17947
15934 -17947 -18910 -8160 -1602 12991 15005 3990 -3992 -10143 -14216 -6464 20014 21436 -15009
15921 -15009 -31543 -19436 -36227 -41184 -18728 -20785 -15732 -18536 -15565 -3730 7760 -10826 -20422
15908 -20422 -24291 -19918 -23955 -23827 -18339 -11249 -21057 -886 9120 -8297 -24897 -36477 2446
15895 2446 31119 23086 24724 23678 9011 -6364 -10505 -7761 -12431 -998 17277 26663 25787 47725
15881 47725 38935 8214 -12711 -17424 -4698 -2273 1314 16985 6393 -6677 -16252 -4573 9319
15868 9319 15842 17312 8597 -19604 -25530 -23488 -19533 -13537 -19377 -14201 -3004 -12688 -16208 -22448
15854 -22448 -25899 -31035 -24233 -2163 -4794 -9367 -12938 -10027 7384 21057 16968 27444 15320
15841 15320 3452 1752 -6259 -3130 -10911 -25664 -26056 -24086 -7228 -12449 -13454 -22455 -4527 17694
15827 17694 25581 4314 -19385 -6580 -17847 -34538 -31692 -18896 -1204 -252 2646 3413 4346
15814 4346 7575 5203 -5547 -36408 -44141 -72406 -67618 -37314 -26356 -31619 -28272 -30131 -27693
15801 -27693 8013 19567 968 3161 4139 -5634 -5734 10036 12460 17515 16650 5309 -337 4012
15787 4012 21162 -9326 -25895 -27062 -11184 13212 18996 6446 14905 47968 43344 2938 -9469
15774 -9469 5009 20470 11045 716 14155 9803 3220 -5235 -3422 -5828 -31037 -25509 -8208
15761 -8208 3697 -14357 -26745 -28467 -26616 -5113 4178 13746 29036 6660 -181 -7708 -26635
15748 -26635 -35771 -29880 -17859 -12568 18016 28392 26103 18578 4457 -8642 -29963 -31052 -49920
15735 -49920 -47465 -42573 -54544 -36673 -8246 -13388 -21899 1139 3747 -5976 -16596 -27257 -25485
15722 -25485 -10419 -9833 -7618 -8576 -11132 -12606 -12220 -17828 -30797 -52158 -58484 -58166 -45888 -32903
15708 -32903 -14505 3869 -2038 -24443 -24131 9408 18173 8213 5856 758 -6543 -15701 -18261 -15016
15694 -15016 -58 20157 16966 -7459 -15266 -33025 -48692 -46678 -38183 -28370 -20964 -18814 -4928
15681 -4928 -26271 -40115 -22152 -11539 -13278 -17553 -19463 -19779 -27528 -27531 -27407 -21286 -31811 -26531 -20704
15666 -20704 -17172 4690 -5797 -1480 -8423 8526 5905 -13164 -17061 -30648 -21656 4618 7564
15653 7564 -10655 -19485 -17291 -11830 -9663 -14123 -16428 -10863 -19702 -11315 -6860 -28090 -4234 10047
15639 10047 7741 8356 7421 13500 -2431 -156 -6763 10520 13271 -7916 -19954 -5745 10791
15626 10791 90 -12406 -13937 -414 2502 -11156 -17716 -12942 -16006 -17376 -4683 1109 15457
15613 15457 3160 -11197 -7495 -9293 -12893 -20904 -24200 -28932 -9200 -32338 -36517 -14168 -19522
15600 -19522 -4369 3106 11732 31001 23919 21339 13533 -9416 -21338 -10466 -14320 -19041 -13168
15587 -13168 -19045 -18446 -22179 -36211 -29112 -15625 -21369 -16547 -21788 -36812 -26368 -9537 -8044
15574 -8044 -23875 -26640 -9214 -12462 -18275 -20609 -3184 22019 15895 5487 -11004 -7047 -14656
15561 -14656 -22862 -37458 -56003 -38622 -48118 -53667 -38588 -16831 -16152 -18938 -3877 -6523 -14871
15548 -14871 -14241 -22186 -40238 -40682 -30086 -40706 -31815 4569 6731 -3802 -10961 -3887 -3935 -8923
15534 -8923 -13994 -39950 -45042 -20229 -23883 -19670 -2087 -3904 9798 14945 -17489 -21977 -21196 -27055
15520 -27055 -21948 -5466 -6123 -24488 -21482 -28925 -36079 -29884 -26554 -34105 -39337 -41430 -37829 -17001
15506 -17001 -4670 1498 -10726 -14957 -15888 -9557 -9966 -3745 -10940 -21308 -13514 -18156 -27204 -40133
15492 -40133 -31821 -18475 -5918 -5859 3988 14955 -10784 -27595 -27459 -29160 -41050 -47671 -34643
15479 -34643 -14496 -12771 -38691 -44184 -31526 -11727 -5200 6497 29374 11056 -18998 -27947
15467 -27947 -11792 -705 -2805 17778 14561 -414 -16613 -27346 -30223 -26050 -17648 7941 5807
15454 5807 6056 3373 3531 17258 14627 -2469 -14128 -15209 -1830 -4350 -17636 -13265 -14395 -35031
15440 -35031 -39395 -41107 -50288 -35647 -24940 -11785 -14873 -31533 -32754 -10532 7965 3742 -9072
15427 -9072 -29939 -42680 -40850 -17979 -15122 -130 17386 8163 -9481 -14823 -5389 10935 7746
15414 7746 11014 -6967 -14169 -29644 -36971 -22657 -13225 407 16664 -2236 -12364 -4202 -508
15401 -508 25355 35647 14744 1556 4395 24013 14219 -8024 -27649 -42665 -42455 -23212 -14091
15388 -14091 -10766 -3521 12790 4327 -2806 2370 -6530 -23240 -21499 -7629 2898 -19196 2325
15375 2325 20499 2126 -19539 -17191 -15602 -10384 -4566 10234 11834 14117 23643 20897 20982 25822
15361 25822 17541 -967 -10512 -7224 -19918 -45130 -41147 -26885 -26690 -16168 -15489 -18671 -812
15348 -812 22935 19595 3547 -12298 10523 20949 9627 4066 -5677 -26076 -36277 -35519 -46443
15335 -46443 -48741 -37817 -31248 -23219 -20974 -8026 -10489 -27532 -17903 -12082 5166 1300 -17052
15322 -17052 -14386 4287 -12921 -20936 -21649 -20117 -50333 -68545 -72910 -52148 -34614 -27133 -17665
15309 -17665 -11653 -20262 -30461 -21441 -14414 -3712 -13768 -18428 -9875 -17600 -27519 -28348 -10496 -10891
15295 -10891 -10626 -17481 -19202 -17609 -1972 779 -30931 -41563 -9115 -8670 -18892 2126 8454
15282 8454 -3532 3992 7833 8698 -16497 -25587 -44739 -48246 -30880 3123 -1391 -12095 342
15269 342 25187 40361 23757 3108 -2493 -8036 -16313 65 13015 7877 1346 -784 -19477
15256 -19477 -37599 -52609 -48548 -60075 -62365 -34465 -22111 -24597 -40134 -42399 -36731 -24907 -4703
15243 -4703 2805 2774 8616 36331 13966 3695 -10337 -17613 -14885 -12955 -21912 -35200 -29936 -16509
15229 -16509 -28758 -43505 -51863 -66660 -53988 -39528 -23491 -31354 -21468 4153 16296 2745
15217 2745 18597 29049 15207 1465 -7863 -7048 -22833 -28837 -25706 -3495 -5214 -11527 -228
15204 -228 -13662 -6782 -7592 -6889 11337 3878 -8293 5050 494 4505 12914 21229 26525 29119
15190 29119 19638 20021 12418 14781 -7620 -16314 1352 87 6597 -8572 11774 30290 19248
15177 19248 7999 1478 -22418 -9337 -4427 -11347 -12099 -29122 -16696 -23063 -22040 -3797 6547
15164 6547 3092 -11814 -25437 -2956 14627 5459 -7770 3863 7517 -255 -10339 -13162 5107
15151 5107 -460 1648 24630 25976 25508 19155 30877 40992 31406 17579 7066 -27343 -41946
15138 -41946 -27359 -9779 -20203 -34254 -24579 -8393 -21998 -16348 3596 30425 36740 10762
15126 10762 7448 -9156 -19701 -7507 17391 7872 -20757 -30238 -24633 -24066 -29301 -7264 18579
15113 18579 28960 11565 15749 21130 -5754 -14063 -14373 -7045 -11382 -18927 -16230 -13354 -9494 -26276
15099 -26276 -32375 -6022 -5763 1328 -7612 -24056 -25264 -23862 -28592 -35289 -14574 -9436 -6870 18147
15085 18147 28800 18373 3194 -23969 -20215 -3243 9668 9487 22533 21892 21607 13134 4133
15072 4133 1134 26856 53630 33366 6702 -17145 -19159 -8568 -6115 34 -19942 -8936 6152
15059 6152 10011 25339 38262 32307 18507 27015 16409 -1032 -10459 10484 21270 22008 18422
15046 18422 25240 23647 849 10477 10022 7288 1245 -4009 -9495 1592 30490 23845 10437 -5683
15032 -5683 -25593 -34226 -41522 -54299 -37163 -28262 -22902 -3292 8655 14541 -11063 -22150 -15765
15019 -15765 -7275 -18490 -36712 -32215 -15819 -2430 21717 22331 6416 3327 -8589 -24810 -35919
15006 -35919 -53218 -40749 -32966 -22339 2047 2060 -4695 5217 -8251 -37339 -33683 -7879 -14923
14993 -14923 -11880 -25313 -26840 -18582 -27629 -32598 -37339 -33712 -36413 -28987 -21378 -19954 -22886 -49943
14979 -49943 -50202 -54254 -43168 -23254 -4479 -1359 -577 1464 -7587 -26724 -20097 -16799 13341 21639
14965 21639 14019 -9691 -8676 -18338 -7011 -10098 -9328 1948 3464 8624 -26090 -38574 -19482
14952 -19482 -17415 -19519 -16030 -20865 -14826 7548 24862 11162 3386 13723 -10138 4282 502
14939 502 -1443 7157 2781 -14383 -43063 -44530 -55858 -76190 -42159 15876 37354 19732 -1684
14926 -1684 1403 2667 -12302 -26052 -33376 -23582 -20143 -24214 -6234 -3067 -210 18445 11051 2780
14912 2780 -859 -1744 -5437 -16554 -3725 -10024 -30651 -26593 -2489 5325 5698 -14899 1591 11236
14898 11236 2277 1326 -11894 -28860 -42237 -24710 -40467 -40531 -41371 -27156 3625 20693 23331
14885 23331 11939 9710 5409 2010 -12266 14759 40287 38147 10465 -1498 -760 13788 4804
14872 4804 -14387 -6835 -19806 -19918 -15579 -12525 -26064 -11489 12293 18745 19582 6726 -11291
14859 -11291 -8237 6500 227 -25471 3452 1112 -19380 -18307 -14787 -11604 -14755 -23834 -27487
14846 -27487 -19797 -28269 -17741 -24783 -35366 -37426 -1822 12837 -8042 -14251 -23125 -20534 -7032
14833 -7032 -8043 -9023 5164 10463 1848 527 -2092 -12247 2590 5369 -5985 -3592 10890 21758
14819 21758 22021 16425 18868 12615 14734 15243 2325 -10618 -26438 -55663 -48343 -18513 -4290
14806 -4290 109 25692 32524 22038 18635 17755 12441 2163 11418 16501 -5776 -26096 -23317 -23012
14792 -23012 -21479 -5229 3438 3257 6126 20533 17712 -7894 -22936 -37885 -26508 -31482 -31006
14779 -31006 -17501 -11837 -22547 -14700 -2962 -12557 -28121 -31177 -18678 -12485 -19712 -1166 31106
14766 31106 30749 9497 -221 3393 -3062 -23263 -2485 2959 -8651 -11298 -5738 -12834 -2046
14753 -2046 13176 23526 8380 -7991 -1479 9929 18040 13283 11242 2633 -9684 -12880 -30859
14740 -30859 -37014 -26504 -13687 -20060 -10784 -12561 -8616 -20362 -8554 1014 -911 6714 -5271
14727 -5271 -9191 -13375 7388 21191 15315 18186 16503 25123 21475 -12591 -23885 -14196 -33811
14714 -33811 -48699 -44348 -19055 -6937 -21405 -32114 -25418 -5041 21090 38702 36574 15587
14702 15587 27593 27350 17466 13906 -6269 -14232 -21846 -21834 -1344 8027 2306 -895 -3204 4336
14688 4336 14303 16679 13821 12270 2726 7028 4503 -11639 -528 10811 6023 7185 8505 32481
14674 32481 37057 35061 21873 -12273 -3402 15660 162 -4665 7755 -6648 -12571 -26921 -24872
14661 -24872 -11017 -12439 -5583 229 11178 13731 4019 7566 713 191 1654 4893 2013 -1006
14647 -1006 -8968 -8249 -6623 7458 14044 10737 -10855 -6862 -6426 -13190 -17340 -25431 -18961 -23115 -31461
14632 -31461 -29443 -23552 -11197 -7955 -23541 -29128 -34201 -31528 -24238 -11288 4736 -582 -3952
14619 -3952 -5435 5139 9169 -5360 -25313 -26255 -24585 -21172 -7806 2909 -6562 -25543 -34092
14606 -34092 -20466 -4154 -3403 4451 5099 -16898 -24770 -14759 -111 -11033 -7757 -2760 7434
14593 7434 590 -6337 -5041 -10751 -16332 -4731 -6672 -16681 -7944 15781 -5940 -31422 -34698
14580 -34698 -18757 -541 -18841 -17826 -2687 9014 -12147 -29328 -23213 -8071 3232 2910
14568 2910 4590 -1293 -3639 13169 6143 5746 25462 36321 9065 5101 7841 -4194 -4851 -4038
14554 -4038 8509 15213 4089 4687 930 13591 2092 -494 -11082 -26347 -15653 -21528 -25210
14541 -25210 -21500 -13455 -1911 -2586 17184 7164 6776 8407 -7605 -11719 8427 5810 -14005
14528 -14005 -18571 -49088 -62871 -57594 -58913 -53460 -31936 -22957 -5217 14005 26566 21202 9715
14515 9715 17234 9306 -5136 -14713 3486 21281 28509 9544 -6362 -13575 -22463 -32962 -24865
14502 -24865 5324 38210 61659 103080 145706 182431 214853 195507 160901 133613 96495 68873
14490 68873 41123 32047 24120 30538 23489 24709 30314 18086 15119 27856 13356 18323 24006
14477 24006 17382 7205 11772 8843 -1798 -24856 -29263 -15681 5677 891 -9735 -7340 -4312
14464 -4312 -6487 -13997 -10017 4368 859 -4762 -29196 -39424 -19977 -11665 -23713 -39034 -24599
14451 -24599 7599 14750 5392 -14265 -8985 -10844 935 17029 14747 -6543 -26327 -24608 -9289
14438 -9289 10255 -3267 -513 532 4240 11081 -17611 -24186 -33069 -37023 -48222 -36936 -8244
14425 -8244 -2545 -8705 4701 5947 -1162 4399 1248 -4489 -4672 -38745 -32985 -25121 -18660 -392
14411 -392 2760 -9100 -48695 -77729 -70490 -67230 -45327 -34938 -34215 -37693 -39830 -35529 -28639 -27293
14397 -27293 -26399 -36505 -38284 -33668 -13113 -8627 741 -3297 -18480 -13236 -12115 -19120 -12532 7444
14383 7444 10103 5918 -8077 -29400 -50231 -31643 -16498 -28174 -26398 -30444 -32057 -6121 8879
14370 8879 12714 -1348 -2350 -17977 -29906 -25534 -1164 10137 -15201 -23196 -6908 5097 22274
14357 22274 -235 -8171 -7220 -3599 -9972 -11191 -14746 9156 20670 23406 -3850 -18817 -28994
14344 -28994 -23968 -9106 2139 13193 7191 -6759 -28288 -27097 -9914 -15599 2478 25881
14332 25881 34134 31738 27546 9396 3514 6187 2587 -28293 -43007 -34749 -23721 -7412 -15313
14319 -15313 -35711 -53040 -60357 -54040 -43612 -21685 -10072 4208 -4016 -16276 -23778 4209
14307 4209 5332 -5392 5188 -10965 -31813 -26481 6995 11733 12215 12325 -11277 -44607 -36322
14294 -36322 -30852 -26997 -13859 -18430 -40443 -40068 -26243 -28513 -34145 -28575 -17637 -4429 -2175
14281 -2175 1019 3174 -7436 -11068 -2540 17478 14331 1296 -13500 -8286 -4254 1714 3334 7610
14267 7610 4535 -9017 2019 -10290 -29057 -21285 -21668 -3477 16267 10593 3982 25327 45557
14254 45557 35608 -3365 -20904 -12921 -6449 4912 18072 6274 21041 31714 29320 25099 10472
14241 10472 -6388 -8202 9453 36536 59552 58443 33628 19812 9516 -5659 -14013 -15954
14229 -15954 -30140 -47928 -38621 -44387 -34413 -30731 -37556 -43796 -32113 -28763 -39798 -42625 -41893 -22459
14215 -22459 -10866 2167 3457 -10857 2310 11240 22917 22962 415 -19800 -30131 -16318 20694
14202 20694 26017 -8152 -21664 -13921 -3722 -271 -25121 -9092 -1122 2027 3180 14433 9702
14189 9702 12662 19432 21458 20731 5156 -20195 -39383 -40813 -17805 1170 1843 -3077 -4418 -540
14175 -540 19912 29327 12501 -8401 -11692 -32467 -18562 21200 32924 23359 10641 15760 18493
14162 18493 23204 17077 -2472 -33694 -34482 -26153 3622 -7889 -31914 -15938 1112 -5197 -1088
14149 -1088 -1144 13534 14472 -5043 -7598 -12294 -337 234 7031 16844 16793 19941 31173 46710 48140
14134 48140 41051 32437 27552 37294 52233 41057 16685 -3901 -15101 -2816 17963 33457
14122 33457 27227 11122 21528 27003 15672 6394 12075 10419 16759 27617 25352 8159 11264
14109 11264 5108 5553 277 -7386 -2006 13428 17971 30461 36015 42861 41989 25849 45987 56113
14095 56113 48583 42252 33194 18139 2560 2324 -8823 -8457 3787 26541 19460 -5321 -22878
14082 -22878 -9060 6725 6145 -4656 2743 -15971 -29756 -13284 -9196 -27949 -35577 -21199 -22319
14069 -22319 -15448 10993 38407 24364 9911 -11827 -20728 -21116 -34043 -24283 -38498 -41492 -32817
14056 -32817 -28087 -727 14400 14322 7397 -14346 -11533 -24212 -25744 -19075 -22564 -19659 -30247 -33845
14042 -33845 -45393 -45380 -51150 -55189 -55982 -37128 -6945 6164 -4994 -16581 -20731 -6632 -21025
14029 -21025 -8676 -4160 -4302 7945 27005 33570 35161 33887 17874 10803 21073 9722 -18959
14016 -18959 -14938 -9901 -29745 -19474 -23205 -15551 -11519 -14139 -15918 -12220 -13879 -21036 -12340 -10204
14002 -10204 -9599 2537 12613 10449 -1319 -5525 -11345 -5411 8442 6904 3192 -4085 -12799 5546
13988 5546 2095 -3006 5006 15792 15677 16441 22673 43822 43586 25593 27900 38460 51102 40728
13974 40728 24565 8563 9424 7230 34730 59532 45918 17622 9093 10921 14667 8858 28370
13961 28370 16271 -5935 -15944 -53 -6913 -16257 -28200 -45884 -50640 -36466 -19057 -8063
13949 -8063 1035 15218 18828 5405 372 -4452 4468 18127 20789 -5449 -16360 -6075 11352
13936 11352 10825 302 -4027 4862 15242 9114 -13437 -25839 -35493 -32147 -46812 -50935 -50658 -27688
13922 -27688 -21108 -25906 -17531 -9004 -4670 3804 41722 49107 16898 2933 19419 11731 27867
13909 27867 41925 58658 44412 28565 3370 -18052 -17377 -13309 -29738 -28739 -13264 -17788 -29025
13896 -29025 -20633 -15482 1009 4651 -28753 -24219 -6866 11466 5838 18269 -5387 -18220 -23477
13883 -23477 -11896 291 8334 6948 13571 31621 43502 36898 14344 9582 7297 10165 20771
13870 20771 18308 13018 7409 -3899 -1921 20561 51507 46227 19204 12329 -2545 -14329 -35024
13857 -35024 -40449 -44170 -28940 3838 25620 21317 34217 38438 10010 -20542 -16231 11941 11259
13844 11259 10489 -5253 -13403 -10426 2780 13064 -728 -14231 -16612 -24425 -22315 -22693 -17996 -30458
13830 -30458 -31407 -27622 -38223 -18998 12461 12336 634 14952 -630 -24659 -8139 18107 13688
13817 13688 14107 2791 -8664 -25466 -23108 -17168 -14088 4007 4577 2376 -3991 -30039 -23617 278
13803 278 -558 -24952 -43499 -37554 -26621 -20615 -12302 -9977 -16491 -591 11575 18007 37056 48665
13789 48665 17918 1829 -24702 -31736 -15160 -14544 -27960 -21109 -23761 -13113 -22953 -29261 -27385
13776 -27385 -14461 -16163 2950 42570 81980 110770 121327 142437 157916 154488 156013 162247
13764 162247 177572 211038 281934 402105 580170 833097 1199780 1556310 1737679 1649545
13754 1649545 1326556 913613 640545 510887 411874 305794 254313 224737 225377 208803 181555
13743 181555 144660 115204 121112 135074 130796 133359 124879 128017 111956 102704 83298 74514 88698
13730 88698 78390 80989 111156 104358 72906 62172 66965 76360 71357 69827 74736 94934 92723
13717 92723 62599 50484 29262 20010 23755 33485 32970 34997 17718 21766 30688 26357 24310 29576
13703 29576 22160 6891 10068 28363 40437 24561 11201 23651 13201 29872 35248 21012
13691 21012 27222 23575 2992 7217 34696 42218 38311 8756 -21340 -18493 -5326 10550 12263
13678 12263 5068 1625 4477 1833 10583 16224 10712 14535 -6321 -17777 -14282 819 -19375
13665 -19375 -10421 -8919 -26481 -14094 -3575 -451 12812 21316 13994 12072 14913 14572 8170 21641
13651 21641 20847 23318 25219 11596 -1143 22665 47435 25304 1890 -30028 -29836 -20846 -4407
13638 -4407 9011 13424 6190 6673 -1318 17724 20800 16415 4693 12739 -14 3416 -2763 -12474
13624 -12474 -7802 16600 28572 43790 35059 5809 -30614 -54692 -98098 -130154 -124098 -102060
13612 -102060 -90912 -73073 -52630 -33580 -18532 -16620 82 28990 31614 27315 31321 43349
13600 43349 40110 23389 23673 1149 3631 -299 -10960 -18759 -22624 -10398 21295 37368 43795
13587 43795 53005 70941 58268 27454 -9713 -34973 -23488 -14723 -12099 -15027 -19523 -8390 -42760
13574 -42760 -52226 -52466 -41262 -29019 -20182 43217 123412 190731 212040 216154 222965 218917 203132
13561 203132 182599 170885 148792 131250 87212 71012 69554 71403 46755 44165 60449 38641
13549 38641 14684 26516 33989 41974 55867 49414 44565 45785 53829 77578 103656 112030 108015
13536 108015 109491 77388 23759 5157 -17239 -20243 -12159 5672 -3643 17503 53582 54143 61681
13523 61681 91847 74647 43404 34925 27272 26689 42912 46596 48518 19576 8133 -3734 -24487
13510 -24487 -18053 -9402 -37397 -59288 -67891 -84694 -76236 -63338 -39800 -25750 -13165 -9666 1047
13497 1047 3195 -12635 -28584 -41021 -39573 -26414 -39320 -45552 -55386 -35680 -29985 -45645 -33175
13484 -33175 -21797 -16849 1788 9098 19251 23395 26263 33466 23149 22152 24653 2130 -10504
13471 -10504 -2421 9078 19582 14315 -281 -20701 -36627 -46576 -69887 -54927 -7343 36489
13459 36489 68943 80920 77800 75627 83365 83238 96436 92152 97761 75680 58480 69088 95761
13446 95761 106723 121829 130314 166333 184557 218196 262288 359797 490726 590428 583644 504224
13434 504224 441365 367093 308940 285435 264084 254883 230653 196067 164668 151262 150572 139017
13422 139017 128896 127107 147104 155619 161796 173987 176885 169121 173182 169354 176489 191905 183195
13409 183195 182562 198247 220818 239326 247406 253512 269460 274557 305099 338874 347293 369103 411151
13396 411151 422092 415150 436384 441565 431139 422861 429445 436878 447580 449939 439685 423370 395176
13383 395176 408096 432517 478728 509262 519540 565312 580489 572566 570670 540573 519667 521057
13371 521057 521671 532258 550359 577627 597954 611759 642918 676265 701075 741908 775828 813260
13359 813260 822508 850838 873266 891017 925786 968928 1026257 1096387 1188308 1256121 1286440 1334605
13347 1334605 1377399 1438631 1504542 1577961 1637437 1691941 1734645 1808638 1937566 2074501 2236073
13336 2236073 2428757 2636225 2819390 2990981 3217500 3484098 3809636 4229932 4731527
13327 4731527 5356422 6133405 7113292 8374298 10043877 12246075 15072130 18502005 22847895
13318 22847895 28689699 36960932 48959566 66796898 94904329 140385648 208184196
13311 208184196 282763424 325167915 321453206 269447228 189758264 127705539 91143151
13304 91143151 69918201 56519230 47178964 40246090 34934917 30944839 28031700 25821617
13296 25821617 24094327 22731320 21592819 20697213 20066434 19667222 19468751 19347436 18868965
13287 18868965 17875385 16674937 15471265 14370491 13392878 12551765 11904740 11434233 11224350
13278 11224350 11424094 12178777 13397646 14185342 13964021 12674398 10508810 8571257 7294903
13269 7294903 6435210 5794976 5316197 4920077 4565259 4260264 3972330 3740812 3552090
13260 3552090 3360747 3191206 3033157 2902241 2786859 2692707 2581097 2456285 2318238 2192202
13250 2192202 2088612 1976877 1881910 1782427 1681180 1575445 1472436 1373317 1300927 1249843
13240 1249843 1186001 1129483 1091972 1084615 1044040 983115 925186 861065 821527 773783 714719
13229 714719 685148 651431 610453 592377 564467 517859 499274 487830 513043 506928 484147 460033
13217 460033 463866 447297 447718 440062 425310 404955 386631 375410 364242 336884 308908 305540
13205 305540 308473 301236 283608 290729 283967 291545 285101 265239 250708 250238 248568 261877 285341
13192 285341 273173 266618 297068 332318 332859 333274 384067 468431 575433 607513 554515 497736
13180 497736 427801 379986 366179 324184 294425 274632 252991 232028 220907 209192 194189
13169 194189 183292 183928 192616 155647 144170 152497 158689 167416 175102 207968 275266 322437 340147
13156 340147 327380 310894 286675 281234 284596 284990 267669 259006 270123 283636 297571 298858 286698
13143 286698 274771 282972 285700 272652 271772 265149 261434 280343 292668 295865 290796 269751 258001
13130 258001 251727 248340 251715 250250 261245 283795 274137 259204 255859 248040 229226 223643 241976
13117 241976 267386 284378 270628 264515 268948 240725 206977 205223 201909 189450 174596 164219
13105 164219 151304 150289 129370 90272 80091 105242 121300 99092 88578 103340 113638 86116
13093 86116 70002 78366 85376 101365 111009 114799 102768 114225 130612 122283 117621 106347 89187
13080 89187 80300 78330 76156 53317 53716 67446 82554 77589 75373 80238 73995 70287 73411 74125
13066 74125 55372 68418 88617 92035 129949 158675 155699 147956 144355 109373 102508 105354 98317
13053 98317 88608 84561 89340 75037 67683 68385 71804 74599 85908 107984 82537 71000 74971
13040 74971 58488 51020 45744 49491 36510 16523 23650 34175 53064 50828 39700 34237 35690
13027 35690 50879 50179 42198 39430 34662 25612 7651 16295 17777 25426 31168 32896 56948 63199
13013 63199 43139 38460 73430 86916 94673 125734 170352 207311 219434 206617 168084 132718
13001 132718 98815 56486 35000 53904 65468 70064 64485 57365 46702 60708 66371 52878
12989 52878 60796 69271 69566 67611 78104 80490 70285 64873 55786 42581 42494 36294 31133 25363
12975 25363 41766 47681 41455 56993 39993 21907 23411 16625 10062 1697 26493 47080 24240
12962 24240 305 -9246 -4531 8591 35339 36480 28952 34256 51350 63440 50389 35699 31103
12949 31103 28136 19570 12729 43509 45559 38983 48693 55983 39597 43019 49314 60258 49471
12936 49471 42749 29529 44419 33232 23958 22595 34925 47610 42958 24024 22817 26101 40260
12923 40260 40664 51867 55000 41634 26457 23564 21766 22572 32698 16825 740 33270 73214
12910 73214 75475 70635 46386 45177 48996 51396 35758 16570 14592 19368 33827 47681 45378
12897 45378 45325 35172 25458 11257 27616 27083 25388 25384 24052 23604 37174 42200 38202 50729 65683
12882 65683 59300 32617 21042 17092 19095 42308 51119 47201 45352 37664 54995 41716 21701
12869 21701 34531 51304 74489 102972 152842 176798 240419 328405 448811 653217 964436
12858 964436 1342819 1629175 1689087 1485183 1062913 680378 450112 311739 242914 199802
12848 199802 181478 174841 189663 203363 197415 178102 169407 161339 136546 125103 139966 164335
12836 164335 151336 158239 161459 150336 120955 80208 74798 72887 61951 71085 80076 98239 102277
12823 102277 114558 112273 114354 90963 65738 38995 23214 40260 39660 50550 51142 40431 40221
12810 40221 24284 52402 72269 63163 45271 30943 47896 61345 50677 40432 39061 26710
12798 26710 12207 13241 44213 43562 52115 44527 32594 29991 26708 35115 46764 42653 33521 29174
12784 29174 30133 40129 38100 35735 38916 28739 18752 23552 9582 3432 19838 28826 12397 15572
12770 15572 12473 -9861 -14270 112 13960 26366 40652 44333 39999 49568 75601 81601 65977
12757 65977 65256 61530 39671 28671 27232 32728 33373 22027 23350 29891 40025 33293 11295 3871
12743 3871 -3586 -614 -7698 -16140 3952 14421 21520 21843 30471 19543 12837 24791 -12966 -29439
12729 -29439 -15291 2523 10727 18591 7208 1495 -4319 8654 8202 7264 3647 -14555 -16907 4222
12715 4222 15028 31344 26923 47434 70932 68203 56063 61314 45696 23916 40553 51101
12703 51101 39130 1876 -12564 -1417 7628 16359 5644 -17163 -27746 -53151 -38771 -34403
12691 -34403 -20097 -5990 14762 39123 33812 15973 -5029 3553 12523 9808 32954 42638 20998
12678 20998 7189 5666 2107 22184 21671 21039 7999 2758 -7112 -1606 4089 13999 20705 16744
12664 16744 18634 24499 43400 47723 18855 6507 252 13794 33801 30494 10571 3797 5754
12651 5754 23286 33903 22392 4780 2338 6773 27547 24589 4376 4289 16135 32940 16417
12638 16417 18524 3298 7012 33787 47487 43071 31354 23991 22644 15324 21247 9311 -20812
12625 -20812 -23536 -13311 687 14189 3530 -22625 -14687 -1307 -44 -832 1688 -7876 -24034
12612 -24034 -8643 18492 36350 21694 18932 14230 9417 -5066 -9101 -9040 -5119 -1526 -1264 3629
12598 3629 6270 14654 4848 5833 11383 31302 28691 30614 18248 5717 16054 29791 43081
12585 43081 33253 27983 13684 22317 26569 29841 28967 35073 25488 14359 -3505 5439 17660 4863
12571 4863 15823 14239 -8356 -21537 -6413 18214 30942 34370 22321 6977 19034 11943
12559 11943 14940 15073 -173 -12141 -21336 657 22994 26737 22832 10023 -7458 6495 6010
12546 6010 8313 33645 19323 7256 -12465 -13121 -839 22273 22991 31971 60692 53257 34562
12533 34562 10167 10596 28580 19189 4515 -10636 -2225 -2799 7510 4719 -9180 -11749 -15133
12520 -15133 -13376 -13336 -10674 -14383 -7327 -1153 14320 17655 26359 24210 21116 8762 -10554 -16379
12506 -16379 -12413 -5177 -13847 -8114 3721 15026 21062 33268 40180 28444 2674 -16422 -14150
12493 -14150 -13196 -24545 -30440 -40158 -42922 -14807 1856 -3914 3637 -12898 -6746 -10837 -16170 -10122
12479 -10122 -23527 -42145 -39489 -44615 -23532 1392 -11181 -5309 -19430 -18868 5373 19466 -4453
12466 -4453 3306 -1046 -24117 -34210 -18529 22880 60237 28060 14428 24271 6239 15243 9572
12453 9572 14689 4873 -3835 -6906 -18617 -57522 -58396 -31625 -19542 -33369 -30973 -28141 -4330
12440 -4330 18922 17659 7619 23458 15630 25267 41399 47244 61113 71282 63382 40764 18713
12427 18713 9853 -2270 -24092 -22044 -5869 -4865 15782 25930 17724 7188 -1624 7711 -1036
12414 -1036 2860 6212 -1998 -6407 6268 8578 4449 6177 8270 19854 28228 33383 14495 -1391
12400 -1391 3284 25831 33314 30627 28147 17467 -3298 -11378 8723 26647 31938 34375 38447
12387 38447 19876 4845 -17334 -32339 -9876 10244 -10509 -10089 -2912 5917 7960 8524 15422
12374 15422 8375 3202 1565 -19719 -27606 -37319 -39523 -35342 -11243 -2937 -17682 -25399 -1155
12361 -1155 -6311 8400 17893 8606 -4577 -16225 -2678 12081 16817 21529 19884 2144 -17312
12348 -17312 -15632 15298 18622 6583 -3046 -6696 30874 31215 32118 23203 -231 16458 11945 -18453
12334 -18453 -29005 -30029 -27717 -18749 -6092 -3413 -18402 -3665 6052 -7580 20432 29026 15299
12321 15299 7052 6461 -13514 -13082 -22059 -28008 -12691 -10384 -25551 -20541 -11967 -2392 14190 19413
12307 19413 -12007 -22786 -21690 -15423 -6419 -31288 -17082 4763 -20848 -25921 -7687 15461
12295 15461 17006 18048 5366 -16216 -6322 5070 -13402 -18380 -33295 -42332 -26768 -11968 -12906
12282 -12906 -20704 -1862 4974 1940 12907 20040 41012 38087 20395 34770 18215 16815 16153
12269 16153 22095 27090 9708 -4774 10631 5857 11313 12176 11783 14609 20974 18589 13337 13798
12255 13798 6755 -13969 -11515 6323 33170 16227 -1092 -3247 -374 -4505 -9237 -14683 -5733
12242 -5733 1292 5614 10080 9348 3809 -440 15819 21406 26635 13326 -11019 -31367 -41748 -38210
12228 -38210 -21095 -10272 -11851 2375 11562 15921 10557 2862 6689 8511 -14254 -20580 -20602 -11232
12214 -11232 11942 37542 32594 27442 37910 35231 10662 -18359 -25319 -31712 -15693 -4831 -20588
12201 -20588 -15577 -10375 -12993 -21059 -30839 -19764 -4605 -10933 -13117 -19279 -7821 1558 -3242 -10580
12187 -10580 2907 29405 9068 -22031 -28613 -17909 -10306 12233 22843 8156 3528 16973
12175 16973 19389 28460 23903 26707 10275 -1920 -6216 -5282 10006 -6707 -5449 13279 13096 -16922
12161 -16922 -40919 -34958 -42803 -56559 -49634 -31437 -30555 -30908 -24929 -27537 -39989 -45546 -48116 -27736
12147 -27736 -16470 -24790 -26625 -12737 18823 35200 25625 29413 32294 19191 4037 -5584 1980
12134 1980 5714 7733 -172 5522 16021 12705 -1240 13014 17706 8754 -8926 -21933 -12291
12121 -12291 -17683 -16600 -11577 3553 17375 11971 -4122 -13718 -2925 20096 37204 31460 19775
12108 19775 5973 18231 40057 34116 26901 15367 14930 -6929 17573 11257 21251 7688 3014
12095 3014 -1850 13042 24897 14778 7933 13180 14067 7749 -4066 -15375 -7643 10127 5709
12082 5709 -5722 -11196 -10277 -7583 -14950 3013 5826 -524 6959 3117 -8160 -20860 -6938 -16189
12068 -16189 -34530 -53683 -63340 -58243 -48821 -18765 -839 -7894 -16228 -22638 -19011 2114 16449
12055 16449 16024 -7563 -429 9008 -2868 -39229 -33042 -26388 -21473 -427 -3454 5861 10477 471
12041 471 -4453 58 -8066 -31047 -35293 -26170 -11464 -18772 -13690 -20940 -24987 -4584 -9104 2619
12027 2619 8910 -6346 -11187 -12188 -16163 -16915 -22361 -17130 -2215 -15559 -32057 -43278 -49334 -43625
12013 -43625 -12189 -5621 -5580 2773 7205 5900 -3891 -4296 -9301 -7637 -4892 -5606 -14084 -3684 -976
11998 -976 -1506 18044 4115 15180 28655 9964 -17187 -6403 -11767 -15739 -20971 -40581 -27300
11985 -27300 -9428 -17674 -14798 -21512 -3606 -1733 7824 -6046 -26491 -28557 -19995 -7964 -12604
11972 -12604 -24132 -33980 -10259 -57 -21150 -19795 -11838 -7431 -9369 -8686 -27148 -24472 -21661
11959 -21661 -17692 -19490 -3228 6543 3431 7255 10552 -11732 -21611 -29205 -26305 -28074 -32812 -39446
11945 -39446 -30313 -3078 9194 20835 -6996 -19013 -20646 -12522 -11082 890 12372 10334 7396
11932 7396 -212 7086 -9800 -3990 -10595 -9139 -7449 7696 -2500 -27102 -17932 -8518 -1557 5337
11918 5337 1762 -22056 -19184 1126 -14264 -28072 -22982 -28087 -27710 -8585 14262 12953 8715
11905 8715 12711 -3211 -36469 -45752 -40835 -37156 -24817 480 28852 40811 15573 -3649 6638
11892 6638 -2758 11623 31566 29558 15633 -3668 -8771 -9480 -13537 -4611 -5639 18413 24926 5616
11878 5616 -9372 -3693 2724 1469 13737 -6441 -6761 -4815 -6305 306 -10595 -13779 -10114 -7131
11864 -7131 -25605 -39037 -44476 -53544 -37016 -26040 8435 40247 38103 17870 -13273 -24193
11852 -24193 -35632 -16220 12904 12179 16265 36344 34910 18269 19440 26485 14560 17692 20089
11839 20089 23479 28246 28383 12654 -21016 -29611 6075 6625 -9542 1326 22452 33549 9738
11826 9738 3694 1618 -9668 -8140 5636 16820 14630 6034 -14212 -17119 -11740 -2906 22809
11813 22809 22053 21832 21858 15660 19283 10093 -16930 -23488 -476 15396 14020 5237 6456 1616 -13233
11798 -13233 -10535 -2419 2479 1534 -7489 -623 979 -18015 -15996 -4565 -16681 -22815 -28750 -39359
11784 -39359 -29435 -30561 -11536 -11276 -2823 10843 11439 -886 -3352 -5466 -1067 10475 18126 7552
11770 7552 7895 11810 6778 1910 -21136 -36095 -12983 -5152 -2712 -2569 -11334 4232 13798 -10024
11756 -10024 -23718 -23473 -6023 3785 9076 -11765 -13948 -9910 -9986 3145 19324 15622 -3828 -6354
11742 -6354 2270 339 125 -13670 -35517 -35603 -18407 -7921 -32449 -31829 -30971 -18795 -2059 4407
11728 4407 1893 -7335 -14416 -30600 -36795 -42978 -40621 -40349 -19256 6514 1158 9751 40327 44850
11714 44850 16789 15211 18860 -8448 -24974 -21968 -23923 -44983 -34985 -34897 -30918 -27568 -28862 -42311
11700 -42311 -28680 -8878 -2730 -17589 -4971 3708 756 1275 -891 5244 6626 -3775 6106
11687 6106 11539 5377 -2767 -1669 31224 29949 32630 30620 28915 9790 5249 7539 -16876 -43298
11673 -43298 -47881 -45756 -33935 -10996 1489 -10565 -573 13353 10323 1153 -7938 -11057 -27337
11660 -27337 -30915 -30033 -10748 -5048 -24316 -21546 -19977 -7740 499 -15855 -12344 9324 18421
11647 18421 -4122 5031 6187 3630 -18 -13668 -9505 -11652 -20521 -13146 -4041 -8309 -18603 -25735
11633 -25735 -3473 -5357 2102 20744 21380 12938 -638 -22339 -3329 5089 10424 -7682 -23329
11620 -23329 -13507 7929 7147 6644 10214 -9463 -16756 -6289 -4689 -17231 -5170 16099 -7841
11607 -7841 -35336 -25880 -23097 -29960 -19410 -18831 -29203 -17756 -18776 -39156 -50542 -27693 -1224
11594 -1224 3316 -11397 -21002 -28606 -31204 -32605 -24247 -13306 -13013 -8510 -17042 -37327 -47363 -42452
11580 -42452 -38216 -21630 -3109 17309 5156 -16705 -33974 -31757 -23881 -18167 -5202 -17330
11568 -17330 -4739 757 15171 4056 -14340 -21574 -16947 -23807 -20676 -30464 -19050 1294 -7381
11555 -7381 -2184 22850 21297 -349 9013 21744 34626 41128 66109 56299 37843 21129 14197
11542 14197 15974 -5225 -40676 -62182 -46256 -34729 -30297 -20268 -29653 -19709 5786 14883 17321
11529 17321 31456 65694 64858 47069 37081 32439 15936 -2084 -18738 -23772 -19126 -8706 183
11516 183 9554 5649 3755 -3295 -1965 3621 -13514 -7627 -11797 -2822 22441 45402 45796 23948
11502 23948 20395 28079 29377 11343 -5881 1105 17832 14689 -15529 -32128 -16944 -2938 -6021
11489 -6021 -13308 -12405 -29081 -27830 -17664 -42900 -67081 -75054 -50986 -23911 -30517 -39557 -34136
11476 -34136 -11453 18922 13180 -4510 -7630 -7834 6722 12892 16997 20869 -4198 -20816 -19821
11463 -19821 3029 13176 -2445 19172 37947 25570 -822 -7467 -421 24431 8843 1872
11451 1872 18764 33240 17817 6221 1664 -14874 -38698 -37480 -26754 -16846 -13860 -18075 2648
11438 2648 5252 -20971 -26893 -36894 -24867 -5292 -11064 1944 3664 -17275 -20405 -26251 -34236
11425 -34236 -19027 -2873 -4996 2144 12054 32741 39007 21925 7040 -7944 2686 -12926
11413 -12926 -28926 -29487 -40538 -34367 -3144 -734 11886 31818 16970 -16781 -32818 -30428 -18517
11400 -18517 -2844 26758 30946 4030 -1307 5955 20042 20645 8378 -18050 -36837 -45958 -45668
11387 -45668 -25205 -7236 593 -6168 -15236 -7969 -17679 -25726 -17057 -39318 -58608 -46772 -54486
11374 -54486 -41264 -44501 -40088 -35834 -31622 -25860 -13063 -12626 -25743 -33975 -10175 -9583 -14621 -6393
11360 -6393 -18816 -3766 20975 18949 17078 -10083 -20263 -14505 -29235 -45634 -40445 -12084 15528
11347 15528 -1599 2632 -8859 -22310 -38286 -40171 -14328 -9096 9003 20211 39673 42449
11335 42449 27901 24706 15216 -9799 -3172 14151 18133 38965 46988 32632 27824 30322 10957
11322 10957 14670 20131 12756 -1194 -19828 -23432 -25471 -1203 11976 12658 13963 18575 6082
11309 6082 -4137 -17588 -2478 3382 2834 -608 237 6358 10629 4909 4573 1148 -12743 -3224
11295 -3224 23434 20520 14467 27424 19270 4122 1100 -10575 -36019 -33515 -3863 6598 5540
11282 5540 4822 640 -1639 -14759 -19702 -13090 -10780 -20025 -28817 -33675 -21869 -7615 -26568 -49841
11268 -49841 -67307 -54581 -49705 -54811 -69398 -55868 -37061 -40754 -49520 -47149 -33113 -19452 -12526
11255 -12526 -8180 -5692 -2304 1397 -14513 -13719 -12680 -8664 6962 22467 9578 -1804 9668
11242 9668 -12614 -12836 10214 4856 -7012 -20875 6855 2915 -21914 -19876 -13251 -21437 -30146
11229 -30146 -15294 -6154 -8932 25758 17472 15408 29657 17235 -14905 -35465 -26611 -32230 -30868
11216 -30868 -16125 -3922 -1092 5205 643 -15007 -24924 -30411 -15268 -14496 -5512 -11525 -22572
11203 -22572 -28815 -13519 -8830 -11924 -20473 -24496 -13485 -18317 -19796 -15979 -17544 -38983 -56297
11190 -56297 -41809 -34323 -21719 5663 8444 1430 17449 19892 16309 4995 -10264 -3360 -3320
11177 -3320 -5094 5504 23678 12946 -4907 -9765 -22258 -12381 -17039 -31495 -1451 13489 2420
11164 2420 2599 686 3217 9742 958 -29882 -23451 -6388 5234 -5687 2265 -1070 -3857 -15620
11150 -15620 -15051 -7976 -1556 -21652 -22029 -23664 -29507 -20802 -20314 -14689 -22302 -26143 -22223 -15081 -6636
11135 -6636 78 -8330 -15139 -27543 -40243 -35224 -26633 -13713 -17149 -13605 -18603 -31119 -26616 -20452
11121 -20452 -14553 -23869 -22360 -17268 -19247 -24805 -22382 -4798 -15562 -28935 -38506 -42702 -31578
11108 -31578 -7516 -4239 -2797 3051 32655 38898 19000 4572 7546 902 11520 -1812 -4152
11095 -4152 -3502 -10563 -16908 -9846 -26718 -41705 -33684 -20865 5709 8261 16411 12787 28156 62267
11081 62267 44995 26741 14939 12237 3921 13357 35254 22738 12024 83 -10335 286
11069 286 862 -20110 -18471 -8328 -18297 -27768 -21087 -36894 -42594 -30505 -8026 10870 28177
11056 28177 37494 28805 39070 38089 19268 -14244 -33030 -40166 -37263 -42125 -24256 -27507 -6232
11043 -6232 -9114 3392 -7043 2380 3620 -1261 2283 -469 8066 9163 13706 17835 14422 12840
11029 12840 17451 3288 11050 27807 29940 3238 2171 9379 11249 7030 -1667 -4799 14729
11016 14729 4212 16974 27584 10535 -16038 -14919 5985 21039 30622 10535 -8832 3885
11004 3885 1472 -8149 -5741 -9732 -31059 -22422 -23112 -39859 -22469 8288 22562 21618 15209 2514
10990 2514 -16500 -26096 -20582 -9369 -4358 -19418 -5977 17012 7471 6277 3641 -1214 2899
10977 2899 8176 9837 31758 34620 31436 17976 19906 14600 -12312 -9811 -16856 -22948 -24918 -26622
10963 -26622 -36495 -45272 -45262 -32360 -5089 -11259 8202 15049 2904 -5859 7564 13053 -2404
10950 -2404 -32436 -31051 -16170 338 -7666 -6991 12418 4134 -14126 -16226 -6090 -5978 -23359
10937 -23359 -19638 -5733 -9313 -3987 -3563 -18011 -17510 -6408 -24159 -35424 -25642 1793 24646
10924 24646 12957 -6951 -4569 -6224 3465 11433 11130 9318 13304 7761 1516 435 -10289 -27214
10910 -27214 -34269 -42390 -28780 -25817 -13312 -10329 -7004 7752 7945 2663 3303 13351 -3642 -11457
10896 -11457 -24364 -41664 -25293 -18497 -23129 -16129 -5676 -12900 -14864 -11124 -667 2966 3717
10883 3717 -11919 -20474 -22508 -31234 -17416 -17727 -17052 -6931 10825 21590 23025 2379 3570 -5040
10869 -5040 -1365 7284 -5029 11654 4171 -3544 -1274 20499 7195 -15910 -12181 -8613 -6042
10856 -6042 -3760 -16588 -25160 -17140 -10070 -17169 -12909 -16770 -24508 -18600 -8164 -13254 -17606 -15075
10842 -15075 -20572 -13091 -20424 -38611 -32053 2760 -12061 -10802 -12673 -12323 731 -2413 16090
10829 16090 9742 5252 19238 25672 3916 4700 10377 5198 3064 -24394 -11366 -13824 -34238
10816 -34238 -30079 -211 1735 6670 4077 616 -1570 -4966 -3510 -6123 8875 3385 8305 2559
10802 2559 1433 23486 31237 23671 11147 5498 7698 6287 -10707 -604 -962 -18126 -20508 -11434
10788 -11434 -12342 -7946 -3173 -5365 -31 -1794 2588 8793 2760 -3578 -8173 6234 15456 16560
10774 16560 3803 -20433 -23417 -13656 -8069 13359 10827 11123 -13182 -25955 -29046 -17269 -12823
10761 -12823 -744 -101 -8315 -9650 19849 14260 1541 11540 12577 21583 -11708 -14829 -27199
10748 -27199 -31542 -23091 -13615 -17999 -15351 -18486 -27480 -38140 -42277 -32778 -24829 -20513 -33454 -24440
10734 -24440 -8828 -291 5168 6522 19128 8267 -5801 -15581 -12474 12356 8154 7585 26665
10721 26665 33861 34215 30027 -2311 -7420 18226 21881 26885 33438 18699 10590 26785 42834
10708 42834 40799 32975 12028 -12316 -5108 -4898 -20990 -47065 -53832 -21666 -9302 -4450 -211
10695 -211 1470 1061 -13419 -23823 -42984 -32207 -3443 -10502 -18012 -22571 -15635 -517 7754 4135
10681 4135 -5329 -10701 -24501 -37298 -23170 -14812 -3849 14292 -19632 -23866 -16259 -7433 -16536
10668 -16536 -11175 -2230 3910 16033 35114 36919 14946 27506 18957 33126 21993 20904 47610
10655 47610 44599 42929 41801 24144 2843 -13250 -9586 -17762 -25979 -19959 -8876 6981 8160
10642 8160 -13079 -38285 -35940 -26990 -16818 -2978 -19935 -30751 -4524 10057 18200 28876
10630 28876 14332 12298 10755 -5552 -25908 -19146 -9534 9487 6920 7422 13625 23073 11768
10617 11768 5908 5071 2477 4322 -606 -6942 6125 3034 2275 16567 13323 18519 35415 35604
10603 35604 24522 31800 31333 36428 31048 22232 -1569 -31709 -24954 -4498 3682 9228 14200 5304
10589 5304 -9034 1424 8335 17710 19969 7530 6928 -1186 -5002 -22797 -16030 -10443 -5745 15290
10575 15290 32293 28496 34136 17016 6921 8171 6693 4684 -11794 -23647 -8873 16425 27929
10562 27929 -11448 -50015 -60182 -39984 -7119 998 6953 4062 74 -6104 -19268 -7855 8531
10549 8531 8776 -636 -26138 -40150 -29572 -12583 -474 18838 17313 -1026 -6027 -4935 -4168
10536 -4168 -2274 -884 -4543 -30554 -27136 -22875 -15129 -23658 -12036 -561 282 16880 22611 25518
10522 25518 23908 26932 9912 7626 15941 16870 29025 25953 12909 -11449 -4054 -20222 -43281
10509 -43281 -50409 -42327 -36446 -47531 -68026 -65738 -56250 -61436 -55491 -46305 -36470 -14357 2634
10496 2634 -24284 -49391 -51369 -25840 -21483 -14912 -5890 8328 8858 4420 -19991 -25026 -2983
10483 -2983 12354 19319 23945 39780 30299 -324 1929 11567 17477 12873 12028 6611 20960 21198
10469 21198 4426 -979 -22176 -30522 -30409 -43178 -27407 -21670 -13120 -2434 34293 53073 32855
10456 32855 12784 18064 23827 29353 24308 24584 22858 14326 19077 21168 4315 9017 9973 5028
10442 5028 15118 32624 17894 16856 8363 -6026 -2562 8714 -2911 -8960 -10176 23130 43976
10429 43976 53992 35326 30790 1573 561 8710 21162 11356 8158 -4923 6283 -2727 6245
10416 6245 9667 22735 37735 19118 17366 -351 3369 -502 -19732 -8411 16816 13542 19481
10403 19481 41587 49322 50424 53408 62642 52362 40251 26866 20909 12741 24997 43364 23960
10390 23960 4021 -14593 -34643 -51248 -37523 -20883 -12674 -988 476 -4599 -23413 4523
10378 4523 14350 7211 6287 11270 20428 24764 44650 35412 32358 40240 42375 52019 38060 14808
10364 14808 -5687 -19005 3683 23731 24308 42619 41650 23915 4027 -1897 -12071 5613 30258
10351 30258 28787 -817 -4490 -14444 4248 33381 31274 17278 15148 2048 1819 -7963 -16414
10338 -16414 -9066 2241 -1406 9271 4891 10643 15246 9864 2656 -760 5275 5946 11253 2294
10324 2294 7075 22906 20334 20302 18542 16400 10783 12732 26790 19962 28686 32283 23129 -548
10310 -548 21750 45797 25027 -11223 -33856 -21551 -14638 -8909 5226 -1751 4477 -1178 -16785
10297 -16785 -8490 10166 15528 8946 9351 15238 8875 -7612 -15230 -3863 3310 19920 23364 15649
10283 15649 10058 16860 15244 1370 5501 824 -7127 -2508 11938 -3995 -14044 -19927 -8113
10270 -8113 -3839 23846 28124 7948 6267 3887 11777 17833 36763 25624 1131 3259 17027
10257 17027 31820 32078 7063 63 -4697 11686 25023 4270 -5039 -8203 10188 8399 10112
10244 10112 7884 18665 21026 14225 -11302 -5566 -23670 -26008 -16067 9746 3379 7895 357
10231 357 -20034 -26204 -48062 -42621 -8362 2780 -11675 -16829 -26470 -23668 -1609 5438 28942
10218 28942 27201 7607 11218 35264 30498 30021 11661 -1073 6984 7123 -3391 10699 29733
10205 29733 45439 15957 -6351 -30531 -20337 -9275 -3026 -3580 705 1917 19187 28185 25422
10192 25422 32502 25014 28173 44407 48271 37444 26925 40012 57882 43111 22379 14549 9882
10179 9882 1657 3896 14322 33300 22500 736 4819 1259 -15570 -20416 -13650 -16182 -20387
10166 -20387 -17554 -5730 -9588 2289 7737 -3978 -6413 6156 123 -1053 23883 43626 34145
10153 34145 37191 17909 22325 27895 21898 12250 778 4556 20805 10640 25145 17139 1551
10140 1551 6258 14892 15763 30584 57906 61775 52886 63234 85636 74896 61769 67069 56689
10127 56689 48168 41710 29627 10411 25603 39961 46996 36519 31131 28520 28463 34245 17966
10114 17966 -3721 -25522 -16935 -20487 -34961 -38082 -36693 -16372 -1454 9236 -3809 2018 6831
10101 6831 3725 19030 8003 -2968 -4186 -4984 -2510 20924 31457 24404 38318 47659 37630
10088 37630 28862 9330 -17817 -24142 -4922 10146 17378 23767 11212 -18257 -18049 -9498 -7931
10075 -7931 13166 26746 29946 24182 18234 17437 1111 9205 11201 24061 43048 39614 5406
10062 5406 -9490 976 7300 10392 -6914 2875 33125 42192 49259 62703 47184 29606 21423
10049 21423 19455 22772 25978 29014 17435 -909 4283 14286 38857 52048 38745 20991 -15048
10036 -15048 -899 12406 11108 10645 9570 33439 52349 39958 52641 31918 12223 -3701
10024 -3701 -6512 -4672 -9662 -26096 -2359 13907 -666 2725 -1283 9289 28683 57664 53391
10011 53391 31213 20172 25658 2533 13996 33062 43401 28487 48106 44379 26008 18546
9999 18546 22894 37466 36331 26949 3973 2750 9362 21018 17366 24462 20386 4865 6038 14674
9985 14674 15436 6938 -10888 -19660 757 24782 26002 14775 3105 27020 46431 48918 60239
9972 60239 45665 34356 18017 11114 36037 20304 2702 -7866 8187 24929 20023 19621 23649
9959 23649 20228 27536 42683 37481 22275 31913 20853 1539 -16059 -16966 9193 20714 14013
9946 14013 5459 11229 5438 15419 38122 42009 37596 11631 7453 33527 50960 54065 40631
9933 40631 33515 30622 29096 28577 14593 13517 25912 24520 18056 12571 -711 15376 26858 29615
9919 29615 45201 47947 41879 52600 42667 23692 34867 28658 25332 25414 16084 -650 -3646 13142
9905 13142 20895 14016 7823 16815 21356 19835 1770 11098 11798 18758 49310 67632 69884 61128
9891 61128 45748 36977 24260 22819 35069 31570 26793 16555 3492 1349 14222 13961 10225
9878 10225 27192 37410 44824 49792 37837 49954 64615 54721 47567 38979 30693 29496 40081
9865 40081 33699 22648 3349 -4617 -6500 11000 17892 31766 74519 87755 78833 74782 67127
9852 67127 40535 33848 13753 10266 -7115 2001 35843 66495 64517 58784 38011 13400 -6137
9839 -6137 14015 27803 17739 9805 27643 42481 33673 22837 28197 41507 52289 27026 18631
9826 18631 30968 22074 2962 4979 12548 9775 16395 30512 27015 15032 19040 15391 3190
9813 3190 -11684 -16498 -5552 -8109 9674 20518 17459 15160 8301 13211 40640 53508 47196
9800 47196 37651 29989 15405 18388 27751 33402 31318 27322 19576 24842 23862 34180 54807 55725
9786 55725 33533 24149 6998 4261 18934 35267 48673 43861 35704 40125 36828 26396 31523
9773 31523 31472 42197 57802 63141 62163 62028 54881 45404 42010 52888 68291 58780 62419 57313 30929
9758 30929 13882 21442 23521 29620 38123 30413 33657 29533 24122 41730 71330 55619 50647 58169
9744 58169 68406 60281 52396 44648 43958 45781 50778 20003 22784 29678 44299 44818 54247 46828
9730 46828 22327 22392 15342 10809 8214 10062 26655 53621 56754 56630 62415 56498 49800 44555 43706
9715 43706 40587 32459 15333 36139 45137 40904 47702 57883 81262 81210 83233 69892 77806 84386
9701 84386 62789 65294 73910 73061 79536 71163 60001 65731 79850 64012 36257 52986 40753
9688 40753 15334 19052 30275 40909 47772 48570 55409 41321 19261 5385 15325 29385 19741
9675 19741 20287 32974 62421 59256 55697 64386 55091 40710 36038 52161 66628 63916 53767
9662 53767 28626 28829 33243 37855 27276 33004 36032 54566 70383 63652 37279 22999 41406
9649 41406 32467 30896 40645 31823 21485 21737 18601 13529 21118 16822 24699 35431 18324 14657
9635 14657 28385 36309 38567 34054 52730 69764 62580 42455 54725 57262 41696 21968 20283
9622 20283 25646 25047 19676 9863 406 7175 15397 37576 52357 73671 86445 65567 39754
9609 39754 633 -5832 418 18624 45657 74420 69933 60634 34909 15236 28004 55410 58118
9596 58118 49113 36018 46246 65768 63086 45420 38014 21300 7985 24905 51435 42722 31902
9583 31902 29662 22272 26094 25696 12969 27454 38794 24826 38024 54076 72295 81138 68529
9570 68529 43963 28969 37832 44036 32170 38613 58865 50538 54308 59324 57353 45802 50936
9557 50936 54350 67145 75944 90887 81424 63487 47392 57043 80309 83379 92190 97478 102631
9544 102631 99763 69750 50051 27838 21311 40253 44948 48471 34319 29273 20666 23661 70895
9531 70895 97167 95971 102263 78610 57590 49656 52158 47060 45610 49503 48967 63691 54301 55515
9517 55515 69274 74960 85364 55493 55751 52977 76983 86786 89772 75474 67757 57201 58731
9504 58731 61345 63351 45842 17739 21528 46214 56715 63519 44774 44150 49293 70031 78908
9491 78908 82467 70105 59729 58622 60210 61033 48641 37271 48911 64178 71547 43134 30073
9478 30073 45888 52571 49701 68858 73833 50622 40644 39460 42926 31859 36689 42301 66744
9465 66744 76257 70346 81973 85269 86871 74850 85703 71489 75134 100825 113469 84942 60830
9452 60830 59522 48537 60143 93092 99664 97721 92837 60148 56108 51644 44047 43590 42806 69809
9438 69809 75484 61225 47449 58535 68822 87578 75877 71292 71648 63413 69153 74516 73554 98751
9424 98751 107413 87580 78809 74810 92597 83197 67284 81855 87060 72034 54076 55058 37551
9411 37551 46499 63328 88250 99433 111634 123410 114720 102727 108930 125659 116475 91626 80850
9398 80850 77008 87123 73049 61558 71511 86923 91087 60651 58243 51688 69384 83271 91706
9385 91706 85428 75410 70113 89728 114427 138141 127857 114702 122770 133756 118355 87332
9373 87332 60580 43759 49019 78724 91405 101880 86328 66687 51804 61736 56249 75761
9361 75761 96927 87189 74175 81669 73359 71320 62985 72534 85907 80730 89368 109375 106620 88767
9347 88767 68322 73599 84251 110414 126517 130102 117454 99602 105917 114509 110334 108294 104864
9334 104864 81926 68290 83524 80589 67219 63892 56370 51742 56486 62116 80541 91423 100994
9321 100994 71995 40163 35782 70754 82912 87354 88238 72187 80815 79724 93751 74093 84530
9308 84530 95823 95473 98995 81543 88317 77017 58980 53160 68572 75580 77795 91881 85714
9295 85714 69213 73124 75402 73281 62747 64621 71579 65275 69746 75654 97518 94760 72180 54714
9281 54714 43064 79531 111786 126627 100054 96400 91757 87594 89092 85959 69846 75024 60634
9268 60634 31709 42767 55520 58975 76191 86494 105180 106053 89622 100084 92060 84906 88877
9255 88877 97622 85074 99805 100110 82959 58580 60668 56182 45271 74562 81800 58634 67138
9242 67138 51463 49371 80004 86740 77629 69333 89939 109468 122346 127693 120004 106929 106536
9229 106536 99798 90744 87961 81695 66697 78605 72655 63385 67857 85818 81737 91908 89257
9216 89257 100748 88322 79019 75871 88681 78338 64979 67696 85513 106455 122064 115128 112403
9203 112403 104495 87505 90248 87157 78914 89578 80727 85108 96672 99835 93539 91342 81367 79640
9189 79640 79515 68792 76468 85818 91456 94504 96202 89921 86909 97500 92361 87344 61720 45737
9175 45737 64929 66653 67525 68134 49220 35682 42146 55393 72054 76225 80887 81621 86250 77600
9161 77600 81270 89060 92824 115402 117352 113047 105316 87916 71989 73991 67825 82917 99019
9148 99019 106076 115569 105624 87112 78477 83752 94142 64366 47534 45384 43025 47639 32764
9135 32764 39358 45526 59711 66990 83064 95215 76493 66564 55645 65681 76399 81469 89548
9122 89548 94469 100421 95057 75407 68285 62256 58607 52703 59694 54125 52379 70698 53689 59743
9108 59743 81532 80701 73215 71323 86203 79311 72889 72349 78169 83195 72301 48867 65390 83094
9094 83094 98568 98278 89135 82106 81723 94251 91902 60804 50516 58536 49181 51075 70436 91106
9080 91106 89300 78576 62016 39241 51268 69858 77588 87450 92630 84821 71062 84094 79230
9067 79230 64380 73381 75661 78457 84078 78928 83289 83675 89412 69068 62221 56298 50412 50620 66462
9052 66462 78360 74373 85606 103800 131169 159753 158265 138697 136952 113617 91632 97782 105196
9039 105196 94100 76248 68233 78990 59582 54820 48381 60661 57209 66710 49333 35396 49135
9026 49135 69028 70659 68979 58881 54304 76752 109208 105947 87020 72190 41663 50918 51879
9013 51879 33207 5720 3809 10261 21442 53650 65406 37294 45491 66939 71937 59447 83261
9000 83261 101102 74445 47787 49070 42249 46481 36719 37922 43169 55754 43789 45300 44572 51713
8986 51713 71056 56666 30089 35458 53879 51911 37355 41798 46411 42847 48658 56758 61958
8973 61958 58828 53924 64266 64790 43698 55032 66129 67228 72707 50697 26661 31877 44383
8960 44383 32066 18812 34406 38848 46161 47986 58323 71865 93556 80632 83435 65899 46506
8947 46506 60339 60814 74816 72613 37308 38930 46385 69119 84220 79181 64182 61520 69396
8934 69396 71489 45623 42017 35336 28350 39638 43008 9169 24060 33524 15711 32089 34233
8921 34233 43490 55588 46237 42257 41256 48872 65954 66099 72012 76455 76135 79303 86267 103239
8907 103239 119999 117499 94299 67820 54741 35005 25553 14630 6339 15792 37210 69188
8895 69188 99039 103367 89660 95499 107092 100288 67855 50967 58192 58486 60347 63292 47970
8882 47970 49369 40755 16301 13523 10313 3103 27307 49344 82074 78163 66557 71770 68852
8869 68852 63595 61643 56156 46430 44252 55006 51125 56790 63999 76358 81616 62161 55134 72591
8855 72591 71632 55475 40949 45504 39137 38862 47745 44282 59289 58041 54865 48062 35290 30619
8841 30619 32249 6541 5331 22807 35375 48767 60564 48523 34354 34814 47565 58767 67679
8828 67679 47068 32508 27031 16634 25460 37098 30925 44497 52846 47361 56174 36975 54803
8815 54803 87255 86308 77734 55527 60713 57501 66751 72059 82378 83158 58699 45135 52294 45449
8801 45449 41409 28473 40600 43167 78047 82496 50097 51957 50557 61057 59309 57699 50045
8788 50045 46844 41405 41392 28055 5472 5364 20612 32650 32620 26689 43450 33706 22047 24302
8774 24302 37754 38987 39618 45120 57778 64006 60057 45404 31133 35584 50095 42601 47204 30613
8760 30613 16378 11179 13331 31214 19856 318 7519 16287 18000 20782 23786 40865 59492
8747 59492 53412 53984 50086 61779 59290 40218 25061 16235 6827 5532 15093 18059 35379 39225
8733 39225 42289 39435 34126 51085 48483 37874 24209 17748 25065 56740 61100 54549 52165 49769
8719 49769 49831 65744 68922 78172 72615 51633 46589 48581 32394 20160 13150 15353 29188 53287
8705 53287 48507 45480 47425 25253 -4795 -10474 -6846 11360 32760 22786 11336 27885 41808
8692 41808 48524 43445 30777 38199 50760 19757 -6736 -4146 33983 35403 30266 25110 8729
8679 8729 -18120 -18801 -13610 -6779 -5137 3980 15054 17169 26553 7698 -12080 10862 22807 11402
8665 11402 9947 9821 14303 21229 35180 44507 46082 46445 53968 44707 21428 14262 13479 1159 -175
8650 -175 -13461 -3267 17328 14035 19429 17225 27131 21830 44885 57019 63219 65820 52558 40178
8636 40178 44124 49676 51992 42149 28029 29957 44472 61538 45365 18115 24090 40023 32764
8623 32764 32366 25929 12035 -11418 -25975 -13525 15444 49489 29307 24195 16728 10495 11894
8610 11894 13231 13168 34067 31175 15806 17975 29521 21852 9787 13463 14965 28075 33823 23552
8596 23552 18038 -3042 -3955 1562 5362 23320 48916 67531 84488 66703 56256 37260 26766
8583 26766 16062 18453 22217 25933 12397 -5647 24938 8210 7609 9716 30203 28503 33902
8570 33902 37200 24572 10893 16554 40324 49993 40586 31274 29275 43870 48073 32124 21528
8557 21528 18740 24461 27184 19102 19561 28081 12590 22815 28562 38551 24887 516 -11634 -14043
8543 -14043 -2412 4817 19626 44548 33077 38543 44959 18029 1790 3494 3203 4874 2917
8530 2917 3772 8468 22926 35785 47105 45227 27400 7659 13730 2473 972 -17771 -12156
8517 -12156 -2244 -11953 10229 22054 19996 16468 25254 40255 30259 24239 20982 13676 21407 29539
8503 29539 30015 20327 14667 24247 34119 36480 18398 4662 13435 23356 12640 12417 12566 11236 -12011
8488 -12011 -21613 -7284 3387 3876 8088 12188 11836 5192 3102 12955 22756 29437 8759 2251
8474 2251 -12205 -30506 -23360 -2931 7823 17215 18266 21218 4376 -6190 -8192 8422 9902
8461 9902 -5324 -22329 -37725 -32505 -36006 -12088 4236 21128 32128 31490 28109 41029 50971
8448 50971 46084 18415 4224 -7664 -1850 -2555 -17734 -1233 -2468 12736 16182 5154 -15606
8435 -15606 -23616 -14217 11031 21438 23859 40554 22190 16772 13126 22438 32769 23179 11861
8422 11861 4444 2856 21597 21366 12387 -8033 -13582 -2477 -8618 -14873 -19118 -23638 -22327 -24071
8408 -24071 -8881 13040 17011 16296 14151 15276 12744 24038 41196 34655 18959 14598 16468 16530
8394 16530 -2811 11616 18825 17119 32012 25327 15293 18249 28108 31412 22949 3901 -15892
8381 -15892 -33316 -26245 1155 22056 34649 23923 27114 14670 22523 15930 -8710 -9291 11485
8368 11485 34973 35773 34265 23334 10567 9329 8569 -5674 -1515 2855 14948 11230 7963 8652
8354 8652 18394 6014 -15962 -25759 -19186 -10415 -22131 -32731 -15091 -3376 -15777 -10292 4340
8341 4340 9423 23945 32440 30940 30437 21859 1783 -15163 -12918 16520 27942 19256 30334 36306
8327 36306 25320 7914 11082 22592 19637 10561 -10397 -23378 -34073 -24788 -12528 2108 16223
8314 16223 19944 17153 5255 653 -8730 -5534 -12731 -29398 647 18289 -13708 -36049 -28594
8301 -28594 11605 26376 22537 -4156 11740 19232 7936 5786 10280 -8290 -9683 -680 -8009
8288 -8009 -6568 11282 12053 -1932 -23724 -31836 -27997 -13561 4939 7532 18215 31079 25220
8275 25220 33567 43725 22154 14292 1387 5017 18670 15545 14471 15097 17826 25655 11258 9524
8261 9524 -7822 -12818 -15635 -23629 -14577 -7593 -12291 5121 15084 21007 10009 -15314 -41182 -52604
8247 -52604 -45969 -33154 -45273 -20926 -61 -8356 -13625 -13308 3119 118 -1097 9362 6961
8234 6961 -5735 -2263 -9708 -23023 -35917 -35644 -32879 -6585 -7178 3534 22135 35843 36619 18603
8220 18603 1430 251 2889 10568 21961 18942 -3609 9170 33678 28123 9354 -11218 -11413
8207 -11413 21309 29200 11507 9518 20333 9479 -3849 -15169 -1691 -8141 -4246 8035 39900
8194 39900 34203 8375 14156 27861 20231 21715 14852 12078 10211 10922 18116 13829 12880 18869 15146
8179 15146 14371 8142 -13636 -18291 7386 8773 -1976 -713 4614 17951 -2729 6587 -9723
8166 -9723 -22659 -8995 -6047 -15621 -14218 -26708 -19026 -21561 -4829 14209 25318 35129 11916
8153 11916 8262 12290 19249 29573 20514 14367 23342 29550 18540 51 13023 19390 28438 18580
8139 18580 13485 22077 15028 8327 35247 44281 12846 -14565 -21233 -13799 -11387 6698 29459
8126 29459 42125 35593 28245 14505 19502 13862 6005 1105 -183 -438 22360 40125 52967 44233
8112 44233 35872 15507 3400 -10544 -14907 -15819 7792 29389 26746 14860 33405 51739 63637
8099 63637 51993 25812 13917 18393 36827 37099 16196 639 7993 20222 29524 28035 28852
8086 28852 15952 1066 4319 5432 280 6218 16180 17689 13583 18195 12521 10867 -8857 -16859
8072 -16859 -16042 -15458 -12757 -486 11368 25162 16795 17767 14031 -1677 -8440 -3993 10565 24870
8058 24870 35816 35059 13947 15599 23320 15572 18358 13138 -3304 5155 17782 16354 5755 -12627
8044 -12627 -26319 -24793 -12743 10954 24443 13886 7132 1647 -3323 -12999 -10452 -14633 -14849 -4318
8030 -4318 -7999 -7332 10247 33694 36704 20025 7338 15117 10319 6313 23363 36201 19289
8017 19289 8519 6520 14849 24570 15019 17572 1721 -13284 -11578 -3820 1463 -9532 -26207
8004 -26207 -27343 -22365 798 294 1158 7873 17651 13655 259 -3189 -10648 -23063 -29337 -4593
7990 -4593 6834 20231 14793 -5033 -2289 -3229 6522 -12399 -19282 -35921 -18553 1236 15982
7977 15982 10071 -4434 2154 37837 65420 81620 60856 16264 -16724 -37420 -40802 -55855
7965 -55855 -52435 -22580 -20210 -10893 2329 10238 20301 43336 44499 21042 -16000 -38959 -30617
7952 -30617 -10964 -1485 -15395 -28789 -47217 -48056 -36018 -29971 -24032 -27025 -37039 -23210 -3548
7939 -3548 -2116 -4943 -9095 -15107 -15369 -38476 -21957 -1104 15052 15661 17412 18765 12741 19068
7925 19068 18922 22986 17566 -3600 -2563 -13219 -17589 -23467 -22214 -12717 -14378 -3558 3465 2411
7911 2411 16759 23222 3027 4098 15436 26721 16253 8593 8360 20769 33418 7928 -4642
7898 -4642 2991 -3138 18973 10422 27600 21697 12365 -12890 -11625 1589 34179 33158 14953
7885 14953 -3076 953 12288 18961 25089 16071 22254 27971 27357 25401 52986 60418 41907 22193
7871 22193 22880 10268 4770 703 2293 15694 16020 5884 16629 -114 -8435 7309 -1880 -2257
7857 -2257 -7798 -11613 3266 8550 3057 13217 8099 -6381 -21424 -15787 -3524 -1544 9440
7844 9440 27710 20032 3176 -23701 -14095 4678 8919 26897 23914 24728 12861 8925 12319 11510
7830 11510 9798 7312 2510 -8122 6535 22968 3669 -10894 -2380 9446 -7582 -11557 -21826
7817 -21826 -14072 385 7501 12694 -4477 4167 8635 -8162 -15665 -6458 -8911 9011 17984 23102
7803 23102 24445 29815 21993 9491 -8534 -26926 -25058 -13434 11549 15356 11019 31276 42390
7790 42390 28106 14266 25421 7080 -23392 -49688 -41413 -20735 -13037 -26291 -23546 -14385 -29035
7777 -29035 -44087 -59278 -62914 -55537 -36910 -26642 1271 15544 -8371 -30651 -60968 -87842
7765 -87842 -84929 -69308 -32229 -20081 -37508 -37687 -30967 -18975 1908 17879 13477 -7762 -7834
7752 -7834 -4735 -6534 -31552 -25869 -22478 -23132 -19458 192 6171 16035 8481 1817 -11948 -168
7738 -168 -2756 5924 20816 -2475 -20617 -18666 -17027 -30095 -35403 -25213 -14823 6935 10198
7725 10198 -19988 -46028 -40610 -13047 -9924 -7819 712 -4566 -21217 -17265 -28740 -40698 -41652
7712 -41652 -24587 -19266 -39725 -27641 -14616 -14490 -10735 -20507 -1646 16349 -15803 -22599 2277
7699 2277 -12620 -18700 -22244 -11022 -1142 3452 -6324 -15610 -2379 12060 9128 5763 -7339 -13305
7685 -13305 -9765 -19571 -27748 -33261 -15683 13284 39237 30657 428 -17226 -33627 -18717 -13388
7672 -13388 -10489 -6211 -2343 10410 5151 -4900 -19448 -26067 -6262 -7510 16192 23272 32865
7659 32865 32383 21731 24129 12816 -6404 -16640 75 6264 7314 15554 11235 7484 7716 9970
7645 9970 21835 38693 31363 16274 -12892 -17428 -1835 10685 33793 37250 20192 52 2287
7632 2287 4133 9403 20074 16269 9700 -5549 -8053 -12387 -5377 12020 4568 15286 24866 8559
7618 8559 5088 11248 9346 19663 -3138 -26819 -17472 -7858 10593 24174 21155 11841 6420 -1690
7604 -1690 292 -24201 -24703 -16537 -16418 -13016 -25177 -41274 -42019 -25279 -8692 -552 -1974 11568
7590 11568 14346 4338 -8830 -8635 -12256 -8629 10962 12370 7328 24507 10809 12172 5484 -31739
7576 -31739 -33059 -26223 -23396 -13429 -13197 -10217 -9533 -11701 -25264 -19462 2595 14640 -4741 -4134
7562 -4134 -14888 -45785 -25077 -22887 -6028 3474 -5701 -7947 3522 18488 17002 13573 6766
7549 6766 -4720 -10011 -7836 4265 -80 -15420 -2128 24221 44801 27629 -1289 -10193 -21671
7536 -21671 -4599 363 -9147 -5377 -1137 -5347 -11291 3873 23 2952 21981 24598 18723 18738
7522 18738 -339 -5603 -3123 -31629 -29406 -16931 -5076 3809 -9647 -7100 -3413 19495 41093
7509 41093 29870 9978 -3611 5597 24100 9490 25283 31676 31892 45735 47347 18260 6185
7496 6185 11313 19255 29314 9838 2564 3954 9863 18613 8916 9237 841 -9450 -26351 -28936
7482 -28936 -14930 -1094 5676 16439 6394 -2397 187 -10893 -32341 -10267 -4583 -3046 -1102
7469 -1102 -11769 -10201 13543 -385 -4701 -9297 -10846 -15434 -21373 -13843 -37241 -32974 -20416 -16273
7455 -16273 -18478 -30115 -37635 -45180 -49757 -41792 -38919 -32387 -34733 -32661 -28308 -8495 1048 11895
7441 11895 20279 10443 412 -14760 -5168 -6130 9764 10776 26405 5498 249 4807 -3947 -9684
7427 -9684 -20608 -40853 -35170 -22677 -11300 -5145 -3209 -12266 -10202 -731 -16946 -21471 -5183
7414 -5183 13773 14246 2757 -16142 -19404 -26705 -26598 -16007 -12956 -28118 -33026 -32054 -22994 -19318
7400 -19318 -24296 -4923 -1899 3243 19350 10933 8999 11096 14659 3593 -1222 -21408 -19419 -16816
7386 -16816 -14306 -7147 -16763 -9054 -2066 10424 -4957 -18415 15014 518 1587 -2882 -203
7373 -203 3117 -2211 27137 15887 -19352 -20565 -13672 -14558 -11305 -5042 -15219 -2591 -2101 -1863 -1716
7358 -1716 10033 37634 28192 8806 -3198 4966 -8166 2298 23907 33016 27506 1654 -24467
7345 -24467 -42181 -48045 -50598 -54309 -64979 -61562 -26579 5400 7178 7198 7895 -3028 -3515 -11345
7331 -11345 -1938 -26743 -39181 -31833 -17684 -5036 15246 23122 40019 47419 34763 36678 23279
7318 23279 -5410 -14307 -26832 -35653 -29773 -3383 14907 5082 4852 5312 -19409 -58287 -45031
7305 -45031 -31994 -38362 -40471 -38892 -32211 -11139 12705 15486 -2053 -17776 -12734 -17198 -14566
7292 -14566 6686 2658 -18309 -27656 -35978 -32111 -21918 -18277 796 505 -10271 -10092 -9221 2523
7278 2523 2696 11231 -10176 -7589 -5701 -20884 -34205 -28707 -14518 3145 15128 23223 34683
7265 34683 23674 38406 48340 21616 9585 27917 30820 6165 -6961 -813 0 -2058 -5581
7252 -5581 -9422 -39114 -48690 -17064 -4516 -1633 -8005 -15503 1494 23936 19347 2452 3854
7239 3854 -13825 -19387 -7278 -7545 -26172 -27786 -16783 -9992 -7089 -16685 -3559 -1845 -3225 1056
7225 1056 -9871 -23067 -16932 -15848 -24771 -20394 -20891 -16830 16172 7703 -18487 -23457 4780 10531
7211 10531 422 -6760 11261 -12232 -2957 18448 15304 22956 33131 24560 16934 11465 3271
7198 3271 -9001 -1969 14917 -1762 11099 28627 32730 20048 25935 7708 -22929 -25949 -27781
7185 -27781 -13105 -2658 -18127 -22107 -11582 7331 15856 14958 8005 2509 -1988 -3185 -21557
7172 -21557 -36383 -19859 2731 6678 -851 1180 -2192 -3152 -4132 -11188 -25119 -18305 -7833 15571
7158 15571 12310 -7447 18597 9609 -24255 -17702 -18507 -16942 -38531 -53058 -30828 3891 22266
7145 22266 6449 -3220 3801 2341 -6899 2320 -10924 -18352 -7004 -31346 -28504 -23077 -14566 -10624
7131 -10624 -13771 -16620 -13729 -10634 -17571 -9051 -1015 -2813 8468 -2916 -17629 -24493 -8684 5925
7117 5925 6716 -7857 -8614 2579 7353 -3654 -29280 -31403 -9767 -738 -7987 -41209 -56114 -55016
7103 -55016 -27134 -3506 12958 18900 18505 13293 5667 -31949 -21938 -3126 16808 20030 6314
7090 6314 -8409 -1241 -939 2371 -19864 -22843 5821 13456 22871 32966 32760 22050 9660 -27
7076 -27 -13119 -7642 4299 191 -5923 -11673 -3789 -5157 10804 26679 31570 39249 47198 42396
7062 42396 32196 14316 -5726 -10401 -4728 17115 8616 -5733 -28808 -36865 -30517 -19380 -8283
7049 -8283 -12114 -30404 -53686 -51132 -23716 279 23092 15523 12863 6295 -14323 -24946 -17621
7036 -17621 -21121 -2467 20713 33361 35407 3725 -290 11354 15449 10984 -638 -20754 -28896
7023 -28896 -17162 11043 8854 37874 46098 20822 -2576 -14143 -5923 12104 21482 10562 -9015
7010 -9015 -9640 28 23586 48751 32120 28004 16171 -755 -14112 -13385 -5230 -15895 -28057
6997 -28057 -26642 -17304 4117 14123 12224 10401 10596 11974 15743 12985 -1719 4650 7824 -3178
6983 -3178 5109 9827 19022 -528 -11370 12200 16966 302 -24205 -22918 -30165 -24593 -16025 -10270
6969 -10270 -17853 -9309 7522 -12748 -16454 -17727 -9035 -12390 -7367 4226 480 10550 11870 -4757
6955 -4757 11165 5497 -9456 8123 26275 18755 14958 3126 16822 29587 30845 27291 19018
6942 19018 14637 10253 2411 15833 17891 8812 -10781 -12108 -13506 -11963 -6536 -11286 -6220 223
6928 223 3577 -76 -15895 -22621 14502 25636 7286 13888 20111 13015 -305 -335 -7245 -19277
6914 -19277 -32024 -47790 -44136 -24791 -2520 -12478 -13791 -8535 -2512 15416 3936 -145 18471
6901 18471 51340 39572 30322 16167 -41594 -53077 -26888 -4180 9595 7895 11886 22869
6889 22869 42738 47756 38965 6798 -23439 -33492 -36039 -15577 -6835 811 486 -2027 4231 -10338
6875 -10338 -14112 -7924 12589 7778 -13702 -13556 -5043 1442 2959 -7526 -22012 -12313 -11623 -17806
6861 -17806 -20341 -13086 -4024 8958 24192 32816 28687 36944 45045 24649 -5269 -7752 -10214 -3434
6847 -3434 -2436 -13158 3166 11636 -1210 -7198 2926 -8408 -27798 -32422 -32976 -18925 -9180 -4887
6833 -4887 -12356 -5542 -7447 -23109 -30791 -15190 -16054 -4610 -9110 -29300 -43956 -36804 -57107 -75128
6819 -75128 -60240 -51909 -37526 -23303 -15501 -27893 -36789 -34638 -24669 -826 -14980 -16699 -21616
6806 -21616 -22717 -17695 -31528 -19621 -11461 -15012 -9498 -6489 -10256 -19216 -23001 -19910 -20252 -20774 -4069
6791 -4069 11090 7707 -118 13202 12214 14209 8005 -4456 -8126 -14625 -34093 -46172 -39227 -26916
6777 -26916 -17508 -11550 -16980 -6427 14351 11772 -6573 -13167 -489 -1328 1344 4054 290 -6708
6763 -6708 -17984 -10309 -8357 -11944 -937 4901 -11803 -2706 3583 -5579 -6738 -5117 -2122 1392
6749 1392 7245 20123 11750 -515 14829 18645 6473 12945 7903 3337 2060 -11494 78
6736 78 8293 -5925 -8728 -24801 -12735 -20289 -50059 -42322 -19728 -1309 25080 48469 71883
6723 71883 77256 97905 92379 69968 54469 26806 1224 12152 19060 -14334 -30655 -22130 -16466
6710 -16466 12737 9145 -8921 -4700 -9162 -5260 1215 2004 11723 10349 -10139 -11021 598 -3470
6696 -3470 -15005 8779 16866 923 -9522 -17349 -11935 1180 -8544 289 2707 -1027 -7862 2009
6682 2009 -1589 -16135 -17824 -9913 -24947 -11348 -1128 3556 9915 10852 -1926 -21047 -19585 -3781
6668 -3781 -8928 -4042 22980 36710 12603 -8374 -9742 8270 -383 -12658 -24155 -36091 -35160
6655 -35160 -30666 -31883 -47842 -53174 -48636 -56840 -42775 -29759 -25792 -34210 -48000 -47150 -30074 -43877
6641 -43877 -32591 -28635 -31675 -36089 -17679 -29388 -38950 -48303 -22903 2267 -9199 2931 -5900
6628 -5900 -25367 -42095 -47738 -32304 -15578 -10780 -7476 13801 13719 7663 4376 3680 7377 -7878
6614 -7878 -12235 5072 16239 7254 -5239 -14725 -15429 -34414 -41593 -22195 -6483 -3192 -15613
6601 -15613 -9797 2246 1919 -22170 -35556 -30863 -26721 -28949 -36423 -47093 -35936 -25668 -35538
6588 -35538 -25053 -16464 -15662 -890 19067 8276 -13803 -12004 -2383 -9304 -4983 -16732 -12427
6575 -12427 -26803 -50599 -37474 -15435 -1928 1934 -6799 -15390 -19733 -13238 -16573 -14176 -5126
6562 -5126 1074 19085 9916 2176 -11261 -13091 -1767 -8956 -17904 -39840 -30872 -10489 -7578 16780
6548 16780 9742 15488 21109 25729 15647 17471 17326 24181 35716 23851 -3259 -21819 911
6535 911 13192 15602 10022 5410 28569 44990 54939 44198 24502 19244 21500 24102 32081 14482
6521 14482 13682 1697 -16333 -26730 -19252 -2899 -1915 -3502 6353 10112 10076 10732 12034 -1460 5206
6506 5206 25298 35909 7560 -10846 9372 21267 11066 -11198 -13568 -5346 -10414 -51481 -65663
6493 -65663 -33123 -28098 -32115 -19602 -11315 -20091 -59959 -61184 -42716 -31386 -22158 -21792 -18546 -1786
6479 -1786 2585 -17819 -23041 -14269 -7132 -6547 7410 3627 -8650 -14054 -14976 -33840 -37931 -17660
6465 -17660 -6817 -4390 14501 24180 17569 -1994 -3652 -5413 -470 12783 15192 -12638 -16320
6452 -16320 -31889 -16681 -28915 -50191 -61865 -53417 -32512 -21116 -40333 -44178 -31514 -17608
6440 -17608 -19490 -42765 -47605 -48736 -48200 -23044 -28465 -46768 -30581 -17381 -44298 -47253 -42926
6427 -42926 -44831 -23035 -18866 -16791 -14092 -35169 -37664 -16698 -32892 -30118 -25728 -38456 -34083
6414 -34083 -19736 -13984 -8428 -6094 -11668 -18818 -15283 -22545 -38473 -38021 -31942 -44754 -48144 -25264
6400 -25264 -16935 -28662 -20370 -18670 -8284 39657 37481 10681 1649 -14230 -2137 13836 14788
6387 14788 14188 14365 23869 32137 40079 34597 22486 2862 726 -4509 -19691 -32125 -11988 -3258
6373 -3258 824 14896 25122 20730 45 1310 13725 9596 18879 425 -29627 -13519 80
6360 80 -20850 -28483 -21667 -20230 -17465 -39580 -48807 -46620 -32656 -29757 -18989 -1722 -760 2134
6346 2134 14274 15256 6888 3269 15864 4288 -5017 472 10909 -8447 -4933 11690 11012 1549
6332 1549 -7665 -15155 -26003 -17632 -22133 -18431 -16573 939 15188 15192 -298 -881 7133 -1172 -10898
6317 -10898 -2378 2157 10338 5440 -8056 -7661 -21250 -16381 32711 48167 54306 70189 55108
6304 55108 40832 42434 34821 29036 5603 -6112 -8626 -6741 -9337 -13534 -22247 -30814 -32935 -14002
6290 -14002 -10007 3462 7916 -20557 -26098 -6968 -501 689 -7039 -10689 -5332 -3741 10937 32637
6276 32637 11030 -26227 -35587 -30815 -16489 -7556 4415 30433 29061 23547 9113 -19827 -35356
6263 -35356 -26662 2563 3779 -25329 -25144 -17530 -47747 -51047 -45855 -60894 -74301 -43315 4265
6250 4265 -359 -28265 -17527 -17926 -19838 -13074 -16908 -5856 5749 -23038 -24979 -41665 -24987
6237 -24987 -8126 -29993 -21487 -18253 -18944 17972 32845 25798 12779 7917 8194 18752 19085 11731
6223 11731 11172 -3254 -6572 -18223 -12527 7800 3665 -6072 9010 19163 14924 -6406 -27284
6210 -27284 -17233 -5543 -23896 -20977 -1132 5982 8109 6779 6674 31111 20138 15114 23802
6197 23802 17173 -15108 -18115 -1884 4533 12740 26366 18911 -3831 -2731 -9803 -1763 10263
6184 10263 7600 -6713 -26041 -24560 -21500 -21548 -11218 14413 34188 -5039 8571 13343 130
6171 130 -6642 13956 24740 15993 -534 -10809 -3296 1823 10518 31353 25673 10696 4949 9608
6157 9608 -992 -462 -8720 -12346 1898 -1040 -4889 12073 25905 44823 27637 20607 16499 -7005
6143 -7005 14881 17553 33843 49231 27491 5766 -14933 -14001 -5876 -15766 13536 22520 4308
6130 4308 8945 4106 -2789 3798 13117 12472 11259 7668 26003 32679 39448 26438 4289 -13147
6116 -13147 -16431 -4106 11882 321 -19298 -25993 -11295 3991 -6960 -40066 -43689 -31851
6104 -31851 3518 18831 2647 15973 30588 19172 -8891 4891 -1134 17817 16825 -3963
6092 -3963 -4380 5079 18954 2348 -24312 -18751 -9167 852 -6530 -18430 -21203 -9934 -9200 -36728
6078 -36728 -21078 8027 5618 4816 -19052 -41006 -32241 -3351 -15325 -23360 -29178 -9063 -13559
6065 -13559 -16184 -11152 -10983 -2671 17226 22939 26127 23620 11822 18304 18071 8393 6774 14010 18817
6050 18817 6547 -10260 6310 -13238 -21943 -6628 -1685 8528 28427 16110 4748 -2799
6038 -2799 -10826 -21211 -21442 -8037 5252 12971 7958 -2193 -18014 -37932 -39146 -32285 -35223 -27269
6024 -27269 -8315 -7242 -23309 -18963 -12545 -6513 1105 195 -12942 -34646 -27973 -27677 -18940 -13858
6010 -13858 -11342 5471 4093 9994 28420 28781 21046 22446 1188 8660 258 11417 16748 14398
5996 14398 -5705 -9396 -2323 -17339 -17666 -2762 -12313 -2224 -20530 -13728 -7680 -13580 -20231 -25907
5982 -25907 -9091 2885 10577 5835 15186 38437 28956 5447 6424 7417 8703 8143 4800 -497
5968 -497 -4150 -14389 -37405 -31213 -23071 -19706 -25689 -16342 -12975 -20691 -29009 -47460 -45130 -17473
5954 -17473 -3900 2251 17027 22935 18090 30972 20859 19099 21336 -4484 -889 1205 -4612
5941 -4612 -389 -20434 -30968 -29992 -33914 -36221 -39526 -41858 -36895 -12839 -14943 -13978 -16444 -13730 1076
5926 1076 7806 4173 6187 -2442 -15967 -18000 -20822 -28542 -33254 -23268 -14675 13744 29962 31172
5912 31172 21721 10295 9831 13447 -1093 -7199 -23254 -14851 -11487 -50256 -49029 -24048 -16066 -33365
5898 -33365 -28739 -13615 -7053 -1124 -6691 2048 -6125 -24023 -20536 -6689 -3296 -10112 -12729 -16699
5884 -16699 -34177 -26331 -26948 -22945 -12690 -8524 -4470 -18222 -22850 -8648 3480 -3950 -3865 20633
5870 20633 31974 28900 53 -4801 13557 15817 -2402 -16864 -12123 -7095 -43099 -31230 -18093
5857 -18093 -27423 -33890 -24894 -19125 -15012 -14281 -8992 -25485 -27454 -7628 -8148 -14180 -8604 -6426 -7684
5842 -7684 -9132 -14729 -7401 -15707 -29376 -30825 -25598 -29368 -15348 -11834 -16464 -9623 295 -11296
5828 -11296 -27388 -30587 -10146 12683 4373 11070 14753 -4500 -13383 -24857 -30197 -20948 -5605
5815 -5605 -6349 -5024 4 -7791 -29137 -22465 -13631 -16154 -24270 545 11454 -3562 -8230 3002
5801 3002 7894 1261 20507 21900 12249 7674 -5777 4090 20010 26369 14091 23750 34302 38376
5787 38376 15161 9592 8258 4732 186 -13074 -4819 25075 44604 33434 10042 22925 27028
5774 27028 26124 28586 40213 51187 55722 45502 35863 27521 31768 38694 23311 10900 8390 5426
5760 5426 -10841 -26653 -25797 11150 41539 20168 13175 -8860 -192 6590 11280 19798 52807
5747 52807 46199 18365 -2288 -16708 3413 878 -3426 7438 9294 -5823 5072 8306 6754
5734 6754 -1243 20223 7882 -6199 -11978 1448 5420 1833 -6266 -19145 -18019 -5341 -13437
5721 -13437 -15899 -14015 -11545 2001 -4727 -9878 -14177 -5981 15402 30244 40996 26702 14192
5708 14192 18116 31332 2422 -15078 -2606 -1483 7207 18193 21901 17565 21903 45653 65962
5695 65962 35705 26368 2240 178 -6389 3614 -1721 2514 -10190 -5361 -10732 12321 10520
5682 10520 -4333 17757 36303 38660 27804 -14147 -20604 -825 -10455 -15617 -12465 3642 12026
5669 12026 11407 26700 11832 19788 4114 -7899 -32497 -33628 -27815 -25161 -52470 -30370 -15903
5656 -15903 -18348 -14083 -22439 -25541 -36491 -22193 -20194 -25596 -10244 10232 14466 18228 -2987
5643 -2987 -15625 -7678 4362 20218 12121 -27 2936 12740 20191 -16500 -33365 1243 26265
5630 26265 40311 26729 21784 31810 9064 -4925 4852 3779 18086 14374 -16294 -19841 -10296
5617 -10296 7561 35785 14705 3550 -7682 -10418 -6073 10181 3312 10979 33796 45206 24844
5604 24844 -2656 -3716 -18777 -1284 23862 9415 -2914 -28345 -25304 1539 5014 4751 1213
5591 1213 -17655 -17684 1060 28399 27753 16945 -3435 -23466 -15409 -27564 -28994 -33114 -32478 -8367
5577 -8367 -1629 -4606 -22614 -23628 2081 7171 8203 9828 11384 381 -10964 -7001 -26012 -23259
5563 -23259 -35996 -21309 -6711 -689 -18042 -48116 -13187 -1084 2639 10459 5257 13148 14279
5550 14279 18871 2968 -31205 -47105 -33007 -6501 -14641 -21348 -19977 -3752 -5422 -5764 -16075
5537 -16075 -5556 -3781 -973 9945 17612 15448 17002 16083 9229 -3631 6071 26929 19279 21067
5523 21067 13831 -3087 -373 4645 -7249 -11899 -25895 -19840 -6204 -14800 -11876 -23229 -4186
5510 -4186 -19496 -27670 -23336 -32710 -24259 954 28716 38222 27948 29233 27528 -3857 -5382 6893
5496 6893 2930 18923 4483 -11522 -12081 15 8755 12261 14679 5711 -17662 -2608 -26357
5483 -26357 -33061 -21398 -13716 -15351 -18676 -31314 -31809 -31616 -25605 -26314 -20512 -23137 -14664 -5512 -4717
5468 -4717 -25320 -44567 -34381 -31833 -17415 -16785 -17940 -11855 -31513 -19558 -16852 -28543 -29735
5455 -29735 -9461 4407 -13408 -50450 -55083 -41861 -13839 -7076 -3209 4517 13732 -4496 -16482
5442 -16482 -3130 3295 2554 -2266 -16968 -16213 -11350 4126 25814 -3233 -15679 -3812 -12475
5429 -12475 -9837 1365 8056 27999 16894 -523 -27295 -35713 -18116 -8880 -14127 -18850 -18683
5416 -18683 -36104 -22634 -9291 -5697 -24310 -19164 1018 4658 16182 12471 -8197 -12119 -4008
5403 -4008 14968 23922 33781 38471 6811 -10987 -14649 -12052 9970 9360 4621 -18986 -36076 -30001
5389 -30001 -13551 3962 29022 48788 48077 51587 38428 26185 13945 17936 4363 6955 27257
5376 27257 20996 15842 25916 13301 -1679 -10831 -14707 -11920 -6258 -7173 -30378 -47709 -13458
5363 -13458 18799 36046 34365 24458 15442 17508 13280 5388 8358 -1242 -9594 1713 15534 14056
5349 14056 384 -20081 -14990 6626 25564 28127 21768 15961 7989 4457 8737 719 -9107 -1147
5335 -1147 11207 30010 15584 1521 -1136 -19118 -19779 -24436 -20091 -33101 -15433 5320 559
5322 559 1866 -863 -8649 -25042 -8801 4371 -12119 -17297 -14753 -5579 -12187 -18022 -6481 -22779
5308 -22779 -11510 -7913 -27905 3121 15219 12516 33306 26495 818 -2481 1188 15512 -2340
5295 -2340 3061 7713 -11849 4079 34222 40905 32574 19677 14752 20798 18404 5525 -9423
5282 -9423 -10538 5116 5832 -16349 -12759 -16859 -16845 -10306 -6134 -4122 15127 -1807 -2971 -4772 -7364
5267 -7364 8714 -2881 -12216 -10152 -28159 -5914 5655 14843 -2390 -19918 -4524 1297 -5484
5254 -5484 25139 20865 577 -8246 -25354 -54447 -47046 -27056 -31230 -14158 -7043 -7212 -14366 -25485
5240 -25485 -18658 17921 33211 25540 26520 5043 12592 3470 1321 -7247 9396 7221 -17458 -27073
5226 -27073 -36435 -19435 6101 3724 15529 23074 34504 41821 33780 14106 -8757 -22896 -20468
5213 -20468 -9696 5399 10663 3539 8368 1313 2816 -13194 -21699 -10543 8223 23975 12137
5200 12137 -2123 4080 17147 29337 12752 -1348 -22548 -22835 -16480 12903 14002 -4104 -9726
5187 -9726 -11295 16194 15698 -7105 -33094 -24697 939 3612 2017 244 -2265 -20600 -14393 -11209
5173 -11209 -1762 8504 -19676 -41731 -36304 -19525 -32407 -34094 -24350 -19002 -22151 -40019 -40240
5160 -40240 -25067 -11557 -5020 -21438 -12350 -9754 11667 33285 15887 4413 -1124 -2497 -3846
5147 -3846 1226 -13601 -17153 -34255 -51531 -61858 -61326 -36876 -11546 -10751 -12832 -9527 -21046 -40177
5133 -40177 -32312 -13141 2167 23273 5791 -9205 -17351 -30311 -35069 -22261 -23771 -26807 -31581
5120 -31581 -44180 -41808 -35797 -22079 -12126 -4530 -17159 -21297 -16524 2235 15683 10897 25778
5107 25778 42386 25433 28603 34951 42544 25774 8708 -3001 -19280 -7474 9861 23892
5095 23892 34606 38043 33178 18081 31584 33222 26479 17490 2888 10556 24318 39566 38451
5082 38451 42000 17507 -1867 12235 4960 312 -19467 -12168 3200 -1001 -2177 621 15495
5069 15495 12633 20193 22847 18579 18371 6000 34472 42625 38362 33950 4475 4363 27787 23594
5055 23594 14588 868 -15249 -10700 -3646 -3638 -32759 -43255 -28125 -17920 -7231 -12748 -4435 -14137
5041 -14137 -25879 -7194 8935 19293 22102 21825 30154 11778 8819 -4637 14769 20757 3018
5028 3018 9866 -4665 -26165 -24862 -26636 -29056 -14711 -9713 2587 7998 9435 24901 31608 23801
5014 23801 31035 26719 12331 26929 19061 8111 -3430 -14928 -19596 -29008 -36565 -27557 -35249
5001 -35249 -39959 -41390 -33669 -47233 -35208 -34418 -36350 -32901 -19206 -21058 -32735 -26844 -5195 4767
4987 4767 4436 -11417 -18977 -21464 -4411 -6559 -16138 -6837 2470 -9808 -18454 -26185 -19700 -3050
4973 -3050 8374 737 20448 14421 -180 3988 10355 9516 -5720 5551 22439 15026 13979 21171
4959 21171 22291 27076 3558 -6878 -8804 -26322 -20090 3411 17805 21434 11794 7033 4910
4946 4910 2837 17118 -909 -15201 -5510 21270 27657 16773 9525 -2409 -17346 -10773 -7285
4933 -7285 4197 11554 -6346 -7386 -5144 4424 1738 4708 7625 -3743 -10401 -5781 -9493 31574
4919 31574 50007 21091 15477 13108 8552 15702 13974 21175 39688 21618 20331 39745 27705
4906 27705 21371 24182 17614 -11728 5631 34049 66055 46169 8603 1095 19627 16581 5283
4893 5283 2663 14 3062 -1218 1267 396 3184 9108 16121 15116 18312 5729 -9954 -17770 5929
4878 5929 7247 6774 3029 -14398 -23959 -21220 -31733 -34986 -32380 -22495 -31702 -29963 -4377 1799
4864 1799 1103 -4689 4811 25261 13911 3918 29646 -9365 -24658 -12130 -5514 767 -6723 -1359
4850 -1359 14389 1716 10615 -13286 -18682 -5926 -2405 -11599 -17959 -11331 -16661 -11418 8784 4387
4836 4387 -13499 -40424 -27838 -7549 7671 -910 -10729 -320 5423 21823 25013 24623 3787
4823 3787 6918 5966 21780 4160 3786 11049 -8901 13411 32296 25785 2933 -6424 -9101 -24663
4809 -24663 -15496 -13433 -22483 -2566 3950 5131 3644 -3448 19937 22928 3417 5318 13243 2297
4795 2297 -5365 -11370 -17755 -8505 -4296 -23376 -28663 -23945 -17011 1161 9103 -10106 -7479 5096
4781 5096 18570 15212 11632 3322 1829 -13569 -20 1367 -6407 -12113 -7955 1600 5891 9887
4767 9887 8833 2973 8168 13508 27269 34039 31353 1737 -383 19951 29598 44872 32318 47731
4753 47731 41692 31724 18503 28003 47713 47090 19436 2971 8834 4959 -27771 -40065 -22707
4740 -22707 -9428 -5461 -8502 696 25035 20327 216 -9710 -30494 -47628 -27780 -18796 -25988
4727 -25988 -19516 -15331 10518 21888 -1360 2641 -11582 -20364 -12127 -25642 -51033 -33805 -1902
4714 -1902 22799 28498 23033 -684 -8710 -3294 -7635 -8189 425 -8684 -14475 -43042 -66884 -60533
4700 -60533 -58568 -57107 -50294 -12558 -1196 -11296 -21007 -24694 -22222 -15468 10559 11956 -10550
4687 -10550 3425 19151 12898 25645 38700 50888 45233 33392 27373 26199 9818 4648 -10029
4674 -10029 -2302 -6931 2611 28294 40190 23960 2681 -22367 -6632 -13696 -19269 -30148 -925
4661 -925 30609 17638 -8497 -17352 -9046 -7731 -12117 -15264 -13381 -7967 -9478 -8259 -1585 2149
4647 2149 7294 -16275 -38065 -25849 -13349 -482 6573 -3527 -13559 -19217 -9842 -17401 -10124
4634 -10124 5038 -57 -21491 -51278 -47171 -37336 -29332 -8718 1378 -329 -8430 6590 -1662
4621 -1662 -3622 24432 30127 25824 12251 -18244 -29900 -11970 -8822 -15548 -13326 -11420 15547
4608 15547 22899 40459 28051 36282 25439 11177 -3528 -27661 -30207 -16264 -8142 2473 10451
4595 10451 7029 11692 -813 597 21306 21137 28745 20563 -3753 1434 10633 -5820 -8504 7347
4581 7347 -7764 -24898 -15325 -3353 7459 12946 21834 9625 -3339 7222 9601 8377 9613
4568 9613 22274 22633 17434 -6580 -17017 -5330 11971 12623 7024 -12156 -29245 -6350 -7819
4555 -7819 -2018 2391 -8588 -5047 -3139 5802 9790 -6617 5593 7800 -3670 -10447 -16458 -6143
4541 -6143 -3278 -6706 -2004 8679 -5334 -11374 -5910 14876 7790 -8457 -17715 -15937 -5360 23781
4527 23781 41558 47671 41029 32267 -2962 -23287 -27814 1404 7187 7431 12113 13906 12021 754
4513 754 10277 5040 5500 1545 6109 10416 -12848 -36740 -28549 -8282 10287 19494 8386 5297
4499 5297 -2020 2877 -9640 -5457 5458 -13729 -2411 -6174 -15270 -14547 -4506 3776 -8266 -16028
4485 -16028 -12075 -7122 19808 14075 -12956 -16918 12742 12889 -8646 -26214 -8383 7176 5985
4472 5985 4549 3433 -1794 2047 1591 -2814 -9984 -8501 -21261 -37936 -31140 -17606 -19166 -19774 -12058
4457 -12058 -9771 -40397 -28382 -22816 -24705 -26846 -16282 -10712 -25101 -31104 -25216 -41531 -31806
4444 -31806 -14353 -16609 -12936 -29778 -20993 -2520 14363 24109 777 6422 15624 8256 -10422
4431 -10422 -8286 -2550 7991 539 1261 8704 -8931 -18916 -17333 -23834 -7004 -10397 -23943 -11318
4417 -11318 4832 11105 2805 -12335 -4547 2403 -2839 -16373 -11183 -8378 -1121 -1688 -10981 -21154
4403 -21154 -5305 -2373 -8774 -10954 -21017 -18342 21828 22303 1607 -5107 5089 1472 -3351 -1108
4389 -1108 448 11503 22817 40573 45639 30897 7394 -20981 -17872 -3149 -130 -5016 802
4376 802 15118 11592 -16969 -33333 -7453 -3099 13748 17836 26462 28502 16841 6932 -14126
4363 -14126 -10134 5705 21934 -2727 -18695 -18763 -26249 -17507 -1110 9662 5857 257 19216
4350 19216 32411 32695 20976 4914 -2505 -11088 -1317 19980 16109 18680 28363 22381 11596 2897
4336 2897 5539 -6756 7093 38944 27208 17249 17901 9132 5367 -3909 -7773 -8678 -6757 -25522
4322 -25522 -44056 -28848 -13353 -30227 -21018 -5230 -16062 -8733 3210 10057 -12831 -11942 -16867
4309 -16867 -25691 -47320 -31277 -30232 -42373 -29914 -24729 -8430 -10514 -7679 1708 7269 22756
4296 22756 8933 -14181 -29275 -33973 -20756 -11941 -2928 2480 931 -6778 -16033 -875 -9020
4283 -9020 -8533 -11696 -12887 -17026 -17280 -8198 -6594 2232 -2911 -35452 -38558 -29069 -34522 -15620 8513
4268 8513 18351 13595 18871 20645 31253 23795 6908 9635 10961 30292 19677 25995 21630 3
4254 3 -9602 4070 -14189 -22872 -6857 20098 19383 17130 2192 20555 31151 18250 3746 -12431
4240 -12431 5039 11796 25642 11062 8121 15145 22313 44039 15107 -6052 785 4957 21131
4227 21131 19248 22961 13424 29387 31186 29878 34326 33888 9071 20185 -3363 -24855 -30607 -26077
4213 -26077 -25405 -21601 10125 12571 1914 12217 278 -32568 -22994 -16293 -32898 -50616 -31926
4200 -31926 -23884 -13547 696 -9838 -18934 -28042 -13453 -1186 -10359 -3660 2826 -2613 -1897 -25703
4186 -25703 -28324 -24678 -52135 -50166 -57571 -40961 -3243 17049 3129 -5353 -8195 -18680 -30816
4173 -30816 -23473 -18486 -5367 1095 3170 -11544 -8162 3472 3529 -1025 -4991 -13626 -14895 -4547
4159 -4547 8103 156 -2562 -20918 -15929 -2500 -2465 -9981 -17858 -6023 7889 7879 1918 1117 7825
4144 7825 -12070 -38374 -30338 -30399 -52046 -62244 -37308 -397 -5506 -31293 -26176 -26258 -27207 -21419
4130 -21419 -25116 -19572 -13327 5256 17165 8061 -7683 -17723 -10392 -38986 -49067 -29982 -18923
4117 -18923 -14230 6136 7199 -231 9641 420 -21061 -32820 -26269 -13169 -961 -2752 -8856
4104 -8856 -19851 -1956 -7893 -21548 -32508 -25971 2730 16973 15954 35332 34972 12457 -9634
4091 -9634 -16955 -12321 -12437 10400 26039 46971 26647 16281 9575 -2696 -25338 -12652 -19174
4078 -19174 -23195 -42589 -28012 -9854 -19053 -27981 -26391 -20960 -42257 -45565 -33641 -4069 5268
4065 5268 -8257 -24606 -10953 9394 8834 -6036 -20815 -46000 -28389 10086 9122 1966 -8705
4052 -8705 7087 490 -3121 9660 -3209 1527 -773 -21157 -37525 -33166 -23723 -12828 -3942
4039 -3942 -3191 -8252 -22940 -20648 -19690 -9346 7250 7760 10687 11443 6736 18070 23241 25200 19581
4024 19581 -8896 -17031 7002 11519 -9994 -17416 -4503 11827 11335 3663 1774 7447 12148 13872
4010 13872 265 5662 -2784 -19896 -7754 -14684 -4942 21508 16328 12528 19382 12505 2525 11852
3996 11852 -2013 -26496 -4811 17262 35738 46264 31194 3922 -6417 -4820 -17941 -6711
3984 -6711 -19787 -22065 -25852 -25841 -6804 -1248 19445 29538 12639 4365 1024 11529 14498 11647
3970 11647 20122 21657 28034 25685 26048 2535 -10838 -21257 -13593 -11484 -3541 32 -20877 -25467
3956 -25467 -19229 -27144 -21678 -13711 -11142 -829 -10816 -25814 -17232 -102 -9105 -4263 18602 27598
3942 27598 20993 13465 9199 -6179 -21550 -31023 -23223 -38973 -31117 -11723 4199 -26146 -33370
3929 -33370 -42115 -32433 -13358 -6056 18077 34315 38823 17602 -22493 -31830 -16608 539 8099
3916 8099 9285 12490 -5413 -15315 -9314 -9522 -11094 -14820 -8272 -2572 1892 -12485 -13414 -22757 -12771
3901 -12771 -13163 -21563 -42613 -32157 -9026 -10778 -15537 -20910 -9095 -14336 -3452 -18497 -18393 -3826
3887 -3826 -35393 -28583 -3849 3695 2074 -1233 -3376 -5771 -7202 -3429 -1823 7088 5772 -15219
3873 -15219 -28487 -39233 -18652 -9167 -17948 -26221 -29892 -23738 -16494 -18661 -20638 2527 -3656 -8241
3859 -8241 3801 -1660 7645 20622 5702 6322 7740 13447 20004 1364 -504 6101 17623 12115
3845 12115 6968 -17219 -1872 8896 24205 15076 -7755 2541 -9428 -33690 -26059 -30695 -38460
3832 -38460 -17883 -10507 6380 28219 11038 -4893 11248 14457 17077 22253 17623 16921 2258
3819 2258 -16446 -11453 -15045 -7682 -1637 7713 21934 33147 30650 17019 4970 4739 -12854 -28183
3805 -28183 -22384 -26773 -27554 -19595 -34935 -51833 -30385 -18846 -26459 -30213 -35516 -31961 -14917 8164
3791 8164 15693 -3049 -32653 -18897 8 -6892 -21030 -29416 -12057 3349 5097 14727 5094
3778 5094 -15114 -28955 -42225 -21274 12128 15799 8060 10106 17917 10373 9421 25945 5549
3765 5549 -21153 -12354 -9845 -12584 -853 -5579 -24402 -18167 2769 -11661 -27675 -25548 -22587
3752 -22587 -7269 2494 -14386 -12244 -10782 -1483 8160 28762 25840 -11673 -25302 -15536 -21846
3739 -21846 -30930 -24169 965 2523 -7952 -10092 -8666 -9214 -18980 -23800 -17276 -10638 -8830 -12763
3725 -12763 -20319 -16735 -6716 -8650 -2104 -6135 -4211 2717 -13808 -34716 -30511 -27028 -29581 -20080
3711 -20080 -8954 -20996 -7041 3492 -8114 -38570 -25769 -15322 -12702 -5507 8084 -447
3699 -447 -13297 -26330 -21725 -4600 -16279 -31504 -18611 5396 10241 -8797 -16741 -13710 4214
3686 4214 32181 53718 47393 31540 6283 6269 1974 32703 38884 23611 27697 11074 -11772
3673 -11772 -7444 -10779 -14324 -6885 -4413 -20338 -24588 -25821 -9799 6068 15092 15497 7945 -10253
3659 -10253 -10262 -7 7812 8864 12239 3385 20991 18858 -3216 -4844 1951 -2452 -34680 -38085
3645 -38085 -18877 -282 15614 7094 1166 -9179 -12286 -3885 -11372 -19966 -24103 -17751 -1063
3632 -1063 -8922 -6145 -18647 -28878 -20657 -25678 -45020 -36447 -22526 -14689 -17312 -6822 -17259
3619 -17259 -30968 -26229 -33011 -24614 -22092 -25279 -4050 -5745 -21476 -6472 5537 1330 6803
3606 6803 10930 16957 2439 -20149 -17860 -11550 -6661 -3379 5240 16152 32101 38064 24061 20661
3592 20661 24261 8506 5718 5121 -1500 3890 -14728 -13584 -9003 -16559 -15862 -20514 -28604 -8879
3578 -8879 8957 17209 9583 31028 45893 37381 24606 17777 6496 -7571 -12056 -898 8182
3565 8182 417 -16315 2018 10121 18098 23371 13290 10466 18317 27161 1600 -3152 -4533 -8829
3551 -8829 -5093 -29629 -42361 -34127 -24988 -20132 -28631 -27782 -9498 -15393 -14257 -3048 5511 7797
3537 7797 31624 40806 45674 19231 -10947 8218 35706 34814 26575 28438 25758 16153 994 -1893
3523 -1893 -4845 -10011 -18517 -29365 -40571 -29383 -15138 -15450 -17868 -22185 -19495 -6436 1831 27003
3509 27003 41348 26710 -6551 -10894 13423 28405 21404 10099 1491 -5085 -9763 -11399 5689
3496 5689 10503 5132 706 2273 3730 -10055 -21175 -6069 6090 18537 17096 -4620 -19372
3483 -19372 -41081 -49148 -50567 -42982 -28206 -14776 -1422 4389 -7068 5245 20922 37147 24229
3470 24229 5288 12659 15743 511 -18901 -11926 -5844 3472 3886 3374 3783 7545 8719 8200 23289
3455 23289 25332 -5205 -17898 -10443 -8740 12396 21551 21763 -9283 -6494 11657 12129 16592 21689
3441 21689 11108 -3770 -7472 16325 36734 30734 17791 14130 -8024 -16983 -8381 -28201 -36693
3428 -36693 -20178 -16917 -21685 -32045 -31338 -11204 5007 1998 -1231 4186 -4528 14222 28685
3415 28685 10453 316 -4024 -18320 -4997 -20062 -34323 -32703 -34800 -34466 6223 30986 4876
3402 4876 -10190 -13264 -20657 -18279 -24709 -17158 -29019 -25397 2025 38 3543 -17623 -27311 -23859
3388 -23859 -14101 -18685 -19914 5250 505 -31547 -59435 -56689 -44928 -29058 -12515 -3978 -10470
3375 -10470 -12303 -15237 -25126 -20329 -6279 -13818 -18846 -16339 -4876 -7115 -16584 -22644 -34559 -51409
3361 -51409 -56763 -34553 -30635 -35310 -35406 -12560 -6767 -18121 -29604 -31787 -26892 -21734 -28928 -42660
3347 -42660 -17778 -10591 -4968 -1499 -2137 -5105 8161 31907 9701 -23788 -20928 -9624 -16557
3334 -16557 -10260 -19194 -16767 -37630 -25913 -6820 -17622 -16262 -276 8404 -7440 -15933 -4723
3321 -4723 12768 4046 -20330 -17006 3525 15587 3395 9225 10881 23104 31112 35218 18367
3308 18367 11216 9751 7382 19667 2373 -21072 -8541 13330 9282 -255 -23444 -25261 -17542
3295 -17542 -27211 -20405 -13339 -9054 24912 32695 31304 14292 5406 -578 -13998 -40241 -34407 -16533
3281 -16533 -26487 -35285 -20768 -12470 516 -3216 -20774 -2006 -3051 -22547 -18161 -11109 -16919
3268 -16919 -19015 -8174 2594 -6416 -4067 7558 11379 1409 -15022 -46236 -52169 -28806 -11144
3255 -11144 5277 -2034 -2044 6065 -13498 -19910 -3395 -17204 -18124 -8792 -922 -16951 -18687 -25531
3241 -25531 -31303 -25551 -16226 -1024 -161 10658 7366 1659 -15952 -41706 -37586 -19665 -9321
3228 -9321 -26917 -22786 -309 -10150 -1563 3869 3260 3053 -21100 -28600 -17227 -3393 -6144 -807
3214 -807 10829 17393 5626 496 -12518 -1053 -10638 -11400 -9261 -11494 -8820 17240 22335 13696
3200 13696 27523 25531 8939 -10995 -26928 -18810 5309 9824 6921 13901 11705 -2142 -5914
3187 -5914 19408 31893 23221 -9779 -27088 -19939 -1741 21477 21669 10604 10952 25730 23131
3174 23131 6434 -3425 -1348 17220 19900 2561 15404 10083 13835 24984 7620 12666 22033
3161 22033 22814 9642 19279 22867 -7685 -11074 -5407 279 11357 21726 21729 15796 16225 -1105 -2171
3146 -2171 -26730 -34056 -25014 -23344 -20300 -34790 -31700 -13512 3632 7995 -5803 -4309 21774
3133 21774 21694 19419 25517 -2103 7730 4463 -18712 -7983 -19596 -59916 -49785 -40038 -36061 -24274
3119 -24274 -13340 7599 20110 36428 42384 31417 16599 8001 1515 -12366 -6453 15309 9932
3106 9932 13803 12564 3950 -14425 -22421 -44489 -44557 -68466 -64264 -42506 10 684 -12039 12639
3092 12639 48893 17634 -1225 76 5872 13900 31941 29684 14745 493 -16662 -12098 -23629
3079 -23629 -15385 176 -4652 -8372 5050 11103 -3474 -6090 11862 4425 -6498 -32106 -16532
3066 -16532 4770 27008 19480 -148 8841 -2276 -17120 -9644 1460 -946 15587 31363 23316
3053 23316 18164 21054 6476 18299 17206 10962 1310 9278 18801 10456 -11862 -20064 -11761 -21685
3039 -21685 -31148 -19288 -24011 -5193 17549 10949 -2027 -1258 -12921 -23054 -23072 -42004 -38900 -8319
3025 -8319 27699 17244 -8340 -13086 779 13760 1688 -10597 -28434 -31202 -19897 -16783 -9920
3012 -9920 7675 18195 7675 5292 12254 -2018 10774 7088 2485 -9515 -14486 -24963 -19870
2999 -19870 -24603 -26230 -16625 -20807 -43058 -34716 -24176 -21693 -25296 -19794 -15247 -21246 -8654 -349
2985 -349 4948 -2310 -9945 -14589 -24006 -14407 -14263 -10863 4773 12308 -99 -9123 -12771 -5729 -1051
2970 -1051 -2169 -6503 -8472 -22167 -1541 3540 1467 -8006 -14391 -6548 -918 4051 4689 -4314 -1426
2955 -1426 -9534 -9238 -383 4476 15974 14421 11012 44508 48823 38731 1757 -24000 -28804 -41485
2941 -41485 -55556 -48397 -34487 -29834 -17006 -6787 -28110 -48835 -44187 -15617 -13689 -19686 -23563
2928 -23563 -27979 -34963 -38673 -21078 3764 4406 13532 36067 55919 47176 -6164 -16815 -40135
2915 -40135 -45180 -11453 25561 33373 6268 -3018 5601 21558 7832 23960 10523 -2137 13979
2902 13979 25679 22755 24003 43245 29749 18909 5086 -23816 -38706 -39666 -25630 -16651 -12083
2889 -12083 -16225 -36913 -32022 -22720 -32556 -33623 -29882 -34378 -16986 -30188 -37587 -21005 9078
2876 9078 -5787 -6109 -5304 -24296 -20483 -25722 -21765 -13545 -14427 -20105 -13975 -20819 -20247 -8056 7299
2861 7299 14897 -887 -12398 -18713 -8748 -13343 -487 8056 17942 23699 19620 18718 9942 7718
2847 7718 9904 25325 29096 28480 151 -5733 -12590 -30852 -24850 -6049 2136 -5513 -13051 -32921
2833 -32921 -8907 -6155 -22444 -5820 4648 5004 18090 5424 28152 56579 56532 33715 16302
2820 16302 32279 13482 14649 13379 -2331 -946 18136 45752 30370 4053 3509 -467 -24111
2807 -24111 -21413 -15213 -30685 -41383 -23646 -8011 -2465 -8128 -6159 -10509 -12822 -6521 6644
2794 6644 6150 -2070 -4945 -719 280 -700 10956 17808 7740 2825 -1009 -17804 -13308 -506 -16710
2779 -16710 -19888 -6095 -12312 -5836 6766 20232 29599 12580 1497 -8798 -11045 -22088 -11050
2766 -11050 -9427 -15018 -24301 -29844 -20000 1283 2885 3523 20719 30443 38306 41987 35741 23128
2752 23128 3410 -19774 -15336 1741 8384 5518 -9150 -26677 -25587 -52525 -68406 -48716 -25625
2739 -25625 -12992 -21576 -39462 -49234 -42739 -27421 -21531 3769 2024 -21306 -11330 7872 24743
2726 24743 37996 30705 10492 13354 2936 672 -1491 6735 3559 -12113 -15686 -15297 -7797 -16259
2712 -16259 -6807 6280 2216 5639 8713 12443 625 3517 -16716 -15650 -7390 3652 8105 21893
2698 21893 32902 24928 9776 -5449 -17507 -10810 13615 15685 14398 1693 -16912 -20163 -32372
2685 -32372 -43724 -37389 -32223 -45888 -47987 -25621 -18866 -13031 18132 30412 19634 5000 -5585
2672 -5585 -8732 -6852 -398 392 -2400 24060 30526 24991 24689 27077 7108 20058 13865 18930 14982
2657 14982 17098 6122 -649 11577 15278 6450 -3767 -12085 -21799 -18795 -12111 -5516 15589 20495
2643 20495 -6277 -23656 -6763 29804 31809 15438 6585 5028 24893 36596 25777 2622
2631 2622 -22163 -15293 -13380 -7118 -2054 -89 3431 -5622 -8210 -1953 530 5716 -21918 -1114
2617 -1114 6271 15595 30584 16178 6190 18027 15121 -3533 -5441 -18378 -16264 7609 19130
2604 19130 10396 -8703 -8000 11406 6732 -6897 -14459 -1826 7393 7258 3631 7982 19682 22791
2590 22791 24018 1038 -16207 -19572 -22938 -7974 12819 -1453 -26726 -16386 16364 22990 17273
2577 17273 27569 22204 31815 40496 20863 12428 -13860 -36218 -24306 -10068 -13736 -8587 -2685
2564 -2685 1848 66 3280 -671 -15433 -25296 -7654 -7997 -9259 -3900 6536 16239 -12518 -7869
2550 -7869 5179 13199 18095 8441 12468 32950 12185 2560 -468 -9524 8069 19997 9004
2537 9004 -3634 -11780 -24502 -9956 -14401 -13813 -15663 -7433 10802 1418 -8118 -12700 -5312 -1099
2523 -1099 4169 7950 35862 37766 42810 44077 30158 14532 11706 41035 41697 28261 4981 -7492
2509 -7492 -8826 -20901 -19589 -12381 -7599 -19911 -38564 -36873 -37483 -46402 -42409 -45002 -19768 -6173
2495 -6173 5903 10261 20534 22744 -6536 -5846 8010 7236 4670 10963 14118 10352 30360 22451
2481 22451 10883 10637 1063 -8085 2520 13091 10513 13289 24835 23712 3463 -21160 -6641
2468 -6641 26221 28904 13118 12915 1127 -27538 -53272 -23990 -8206 -15778 -17229 -9687 6154
2455 6154 711 -17446 -30020 -39235 -54036 -63538 -63621 -46984 -51447 -22502 -4324 -3910 14363 18029
2441 18029 11033 -2759 -25615 -14734 -4510 -9648 -7212 2168 4549 5347 7423 11652 28293 31578
2427 31578 26459 16781 541 -5346 1578 11775 1144 20753 41118 37833 44385 53687 44080
2414 44080 35954 23514 5733 -6343 -10140 -7109 12643 -9450 -22864 -10834 24851 15699 7995
2401 7995 2335 5390 10388 12827 34185 37609 47649 38670 33584 9229 2796 4470 -3827 -11645
2387 -11645 3617 11825 19468 -14190 -34001 -34220 -13414 3502 28445 33102 40016 36530 19941
2374 19941 1560 5697 24771 19596 10702 -5579 -13097 -6940 -23427 -18388 -12603 -38346 -17808
2361 -17808 -27657 -38070 -19918 -16579 -2827 9645 13903 20688 3743 -27092 -31906 -6891 6220
2348 6220 -6833 3124 6375 -1719 -7830 4325 6772 6303 18323 -8536 -23206 -10683 -2057 -503
2334 -503 -757 -1355 -8460 5162 22478 25412 20031 10212 -8270 7401 18243 31253 7515 -18449
$$ [...]
##END NTUPLES=NMR SPECTRUM
##END=
