##TITLE=Analysis number 328840
Compound Code cc 62613
Book Reference 494/194
Project Code adrs
Chemist Name craigr
##JCAMPDX= 6.0         $$ Bruker NMR JCAMP-DX V2.0
##DATA TYPE= NMR SPECTRUM
##DATA CLASS= NTUPLES
##ORIGIN= Bruker BioSpin GmbH
##OWNER= nmr
$$ XWIN-NMR		Version 3.5
$$ Mon Jul  9 12:57:25 2007 GMT Daylight Time (UT+1h)  MAYBRIDGE\nmr@NMR_250MHZ
##.OBSERVE FREQUENCY= 250.131544655141
##.OBSERVE NUCLEUS= ^1H
##.ACQUISITION MODE= SIMULTANEOUS (DQD)
##.ACQUISITION SCHEME= undefined
##.AVERAGES= 16
##.DIGITISER RES= 18
##SPECTROMETER/DATA SYSTEM= dpx250
##.PULSE SEQUENCE= zg30
##.SOLVENT NAME= CDCl3
##.SHIFT REFERENCE= (INTERNAL, CDCl3, 0, 16.4521)
##AUDIT TRAIL= $$ (NUMBER, WHEN, WHO, WHERE, WHAT)
$$ ##TITLE= Audit trail, XWIN-NMR		Version 3.5
$$ ##JCAMPDX= 5.01
$$ ##ORIGIN= Bruker BioSpin GmbH
$$ ##OWNER= nmr
$$ C:\u/data/dgb/nmr/ADRS/610/pdata/1/auditp.txt
$$ ##AUDIT TRAIL=  $$ (NUMBER, WHEN, WHO, WHERE, WHAT)
(   1,<2007-07-09 12:57:00.08 +100>,<MAYBRIDGE\nmr>,<NMR_250MHZ>,
      <created by zg, POWCHK disabled, PULCHK disabled
       configuration hash MD5:
       76 6E 9A 78 1E 09 19 81 EC 84 63 8F B0 6A 59 2D
       data hash MD5: 64K
       DE 36 4A 47 D0 BC 41 50 11 E8 BD 79 DE A7 57 A5>)
(   2,<2007-07-09 12:57:15.70 +100>,<MAYBRIDGE\nmr>,<NMR_250MHZ>,
      <Start of raw data processing
       ef LB = 0.3 FT_mod = 6 PKNL = 1 SI = 32K 
       data hash MD5: 32K
       4C EE 01 83 92 8A 96 0F 86 5E C6 AA 93 8F 71 3F>)
(   3,<2007-07-09 12:57:17.47 +100>,<MAYBRIDGE\nmr>,<NMR_250MHZ>,
      <apk 
       data hash MD5: 32K
       58 29 D5 B1 2A 47 4C 01 DF CE DF 9F 79 CD BF B1>)
(   4,<2007-07-09 12:57:18.22 +100>,<MAYBRIDGE\nmr>,<NMR_250MHZ>,
      <abs ABSG = 5 
       data hash MD5: 32K
       D9 0B 72 35 02 37 AA 27 05 8A 89 2D EF FD B4 AD>)
$$ ##END=
$$ 
$$ hash MD5
$$ 8D 8D EC 89 31 24 A3 C4 D2 5E F2 39 4C DB 60 66
##$RELAX= 
##$RELAX= 
##$RELAX= 
##$RELAX= 
##$RELAX= 
##$RELAX= 
##$RELAX= 
$$ Bruker specific parameters
$$ --------------------------
##$DU= <C:\u>
##$EXPNO= 610
##$NAME= <ADRS>
##$PROCNO= 1
##$TYPE= <nmr>
##$USER= <dgb>
##$AMP= (0..31)
100 100 100 100 100 100 100 100 100 100 100 100 100 100 100 100 100 100 
100 100 100 100 100 100 100 100 100 100 100 100 100 100 
##$AQSEQ= 0
##$AQ_mod= 3
##$AUNM= <au_zg>
##$AUTOPOS= <41 >
##$BF1= 250.13
##$BF2= 250.13
##$BF3= 250.13
##$BF4= 250.13
##$BF5= 500.13
##$BF6= 500.13
##$BF7= 500.13
##$BF8= 500.13
##$BYTORDA= 1
##$CFDGTYP= 0
##$CFRGTYP= 5
##$CHEMSTR= <none>
##$CNST= (0..31)
1 1 145 1 1 1 1 1 1 1 1 1 1 1 1 1 1 1 1 1 1 1 1 1 1 1 1 1 1 1 1 1 
##$CPDPRG= <>
##$CPDPRG1= <>
##$CPDPRG2= <>
##$CPDPRG3= <>
##$CPDPRG4= <mlev>
##$CPDPRG5= <mlev>
##$CPDPRG6= <mlev>
##$CPDPRG7= <mlev>
##$CPDPRG8= <mlev>
##$CPDPRGB= <>
##$CPDPRGT= <>
##$D= (0..31)
0 1 0 0 0 0 0 0 0 0.06 0 0 0 0 0 0 0.0002 0 0 0 0 0 0 0 0 0 0 0 0 0 0 
0 
##$DATE= 1183982218
##$DBL= (0..7)
120 120 120 120 120 120 120 120 
##$DBP= (0..7)
150 150 150 150 150 150 150 150 
##$DBP07= 0
##$DBPNAM0= <>
##$DBPNAM1= <>
$$ [...]
##$SUBNAM7= <"">
##$SUBNAM8= <"">
##$SUBNAM9= <"">
##$SW= 20.6930455092707
##$SWIBOX= (0..15)
0 0 3 0 0 0 0 0 0 0 0 0 0 0 0 0 
##$SW_h= 5175.983436853
##$TD= 65536
##$TD0= 1
##$TE= 296.16
##$TE2= 300
##$TE3= 300
##$TEG= 300
##$TL= (0..7)
0 120 120 120 120 120 120 120 
##$TP= (0..7)
150 150 150 150 150 150 150 150 
##$TP07= 0
##$TPNAME0= <>
##$TPNAME1= <>
##$TPNAME2= <>
##$TPNAME3= <>
##$TPNAME4= <>
##$TPNAME5= <>
##$TPNAME6= <>
##$TPNAME7= <>
##$TPOAL= (0..7)
0.5 0.5 0.5 0.5 0.5 0.5 0.5 0.5 
##$TPOFFS= (0..7)
0 0 0 0 0 0 0 0 
##$TUNHIN= 0
##$TUNHOUT= 0
##$TUNXOUT= 0
##$USERA1= <user>
##$USERA2= <user>
##$USERA3= <user>
##$USERA4= <user>
##$USERA5= <user>
##$V9= 5
##$VALIST= <valist>
##$VCLIST= <CCCCCCCCCCCCCCC>
##$VD= 0
##$VDLIST= <DDDDDDDDDDDDDDD>
##$VPLIST= <PPPPPPPPPPPPPPP>
##$VTLIST= <TTTTTTTTTTTTTTT>
##$WBST= 1024
##$WBSW= 4
##$XGAIN= (0..3)
0 0 0 0 
##$XL= 0
##$YL= 0
##$YMAX_a= 296512
##$YMIN_a= -221503
##$ZGOPTNS= <>
##$ZL1= 120
##$ZL2= 120
##$ZL3= 120
##$ZL4= 120
##$ABSF1= 16.45209
##$ABSF2= -4.241083
##$ABSG= 5
##$ABSL= 3
##$ALPHA= 0
##$AQORDER= 0
##$ASSFAC= 0
##$ASSFACI= 0
##$ASSFACX= 0
##$ASSWID= 0
##$AUNMP= <proc_1d>
##$AZFE= 0.1
##$AZFW= 0.1
##$BCFW= 0
##$BC_mod= 0
##$BYTORDP= 0
##$COROFFS= 0
##$CY= 12.5
##$DATMOD= 1
##$DC= 0
##$DFILT= <>
##$DTYPP= 0
##$F1P= 14.0000005364418
##$F2P= -0.99999901652339
##$FCOR= 0.5
##$FTSIZE= 32768
##$FT_mod= 6
##$GAMMA= 0
##$GB= 0
##$INTBC= 1
##$INTSCL= 1
##$ISEN= 128
##$LB= 0.3
##$LEV0= 0
##$LPBIN= 0
##$MAXI= 10000
##$MC2= 0
##$MEAN= 0
##$ME_mod= 0
##$MI= 0
##$NCOEF= 0
##$NC_proc= -4
##$NLEV= 6
##$NOISF1= 0
##$NOISF2= 0
##$NSP= 0
##$NTH_PI= 0
##$NZP= 0
##$OFFSET= 16.45209
##$PC= 1
##$PHC0= -53.9249
##$PHC1= 14.30418
##$PH_mod= 1
##$PKNL= yes
##$PPARMOD= 0
##$PSCAL= 4
##$PSIGN= 0
##$REVERSE= no
##$SF= 250.130017484995
##$SI= 32768
##$SIGF1= 0
##$SIGF2= 0
##$SINO= 400
##$SIOLD= 32768
##$SREGLST= <1H.CDCl3>
##$SSB= 0
##$STSI= 32768
##$STSR= 0
##$SW_p= 5175.98343685301
##$SYMM= 0
##$S_DEV= 0
##$TDeff= 65536
##$TDoff= 0
##$TI= <Analysis number 999999
Compound Code 99
Book Reference 9
Project Code 9>
##$TILT= no
##$TM1= 0
##$TM2= 0
##$TOPLEV= 0
##$USERP1= <user>
##$USERP2= <user>
##$USERP3= <user>
##$USERP4= <user>
##$USERP5= <user>
##$WDW= 1
##$XDIM= 32768
##$YMAX_p= 404883249
##$YMIN_p= -226003
$$ End of Bruker specific parameters
$$ ---------------------------------
##NTUPLES= NMR SPECTRUM
##VAR_NAME=  FREQUENCY,     SPECTRUM/REAL,   SPECTRUM/IMAG
##SYMBOL=    X,             R,               I
##VAR_TYPE=  INDEPENDENT,   DEPENDENT,       DEPENDENT
##VAR_FORM=  AFFN,          ASDF,            ASDF
##VAR_DIM=   32768,         32768,           32768
##UNITS=     HZ,            ARBITRARY UNITS, ARBITRARY UNITS
##FACTOR=    0.157963299565203, 1,           1
##FIRST=     4115.16138669806, 0,            0
##LAST=      -1060.82205015495, 0,           0
##MIN=       -1060.82205015495, -226003,     0
##MAX=       4115.16138669806, 404883249,    0
$$ Real data points
##PAGE= N=1
##DATA TABLE= (X++(R..R)), XYDATA
$$ [...]
20216 96157 131174 145307 162946 90065 18540 50143 79146 101357 107364 61759 59991 47786
20204 47786 27551 12042 -37940 -58809 8169 59955 43977 42587 81116 125340 24853 2410
20192 2410 27926 -928 3744 42007 13792 45471 62389 127120 97557 88498 21147 -15584
20180 -15584 21515 80967 73425 59734 64506 52786 34416 15115 13350 18509 58510 93486
20168 93486 27610 4016 12106 24566 59045 100195 126684 170113 197432 148581 19575 -37526
20156 -37526 -30854 38348 70229 103432 106934 114859 114208 71195 -7060 38954 95035 115922 93444
20143 93444 83128 80781 84305 10229 -38307 -82187 -104014 -81207 -66706 -31928 -18108 6162
20131 6162 61221 95358 79307 97770 83177 68475 74182 107062 131470 144986 116092 61603
20119 61603 41629 74514 121418 56396 34620 87824 168101 146643 142528 133015 124972 154425
20107 154425 181440 196328 209332 291976 338236 326372 339813 418104 480642 529647 548540
20096 548540 612302 649080 665049 680001 691620 642466 496285 436207 410138 356798 242196
20085 242196 169518 124085 50572 56900 98964 98716 122732 41485 23041 53714 58234 67408
20073 67408 49691 18675 40102 54029 170487 215910 235947 273054 340583 416529 516110
20062 516110 480434 493875 508709 505164 497440 474102 435966 396471 364125 310809 218520 228754
20050 228754 218580 149882 131259 115097 106248 88438 53463 37151 10828 50342 113150 111750
20038 111750 43698 73071 77322 46167 16176 47874 112886 55324 41924 95455 66487 51528
20026 51528 25916 51781 109123 90012 74910 120210 148740 110403 37935 36520 34601 41304
20014 41304 53455 31853 23607 39304 30070 33426 96426 76909 50771 54522 65720 76158
20002 76158 8039 12902 46669 89877 74852 -13967 -65339 -32832 -34583 -40588 12337 43999
19990 43999 34973 46581 39636 62390 63647 59675 32543 30870 -12070 -57667 -20578 37218 65417
19977 65417 41951 39335 90117 110120 32640 11568 51290 125487 115420 28211 21803 27323
19965 27323 119992 189743 137511 92248 134839 118389 126987 80590 83813 61680 65754 132697
19953 132697 154250 111354 90993 75436 112115 122171 81964 95242 86220 75558 33448 21599
19941 21599 34030 10070 11747 35122 21180 35852 95028 109548 118421 124348 135639 101164
19929 101164 75906 67330 94171 129460 73296 59930 94818 128515 182920 196769 205573 176524
19917 176524 83366 104161 150916 156714 104790 75279 151890 155860 105627 125813 130564 150910
19905 150910 185523 204938 175187 120214 91703 136213 188662 139898 89635 34944 30931 60653
19893 60653 71164 22168 46267 31973 62042 82363 14601 4431 74374 130252 189979 202543
19881 202543 147319 110598 75718 93159 93423 86270 25241 28797 78456 112098 117283 108330 79514
19868 79514 47828 83917 92019 12216 -55884 -96870 -74123 -14401 50963 80186 54091 31438
19856 31438 54463 57557 109756 94816 104723 118716 111529 109068 130032 158862 163580 96084 93161
19843 93161 174761 184570 75306 11016 3064 -10935 -37353 29436 62543 134967 171942 206754
19831 206754 248755 257637 238181 204534 136863 4310 42175 74256 103258 101070 113399 156463
19819 156463 160877 109792 130264 196104 211047 159657 145396 151493 72161 -9115 38409 32158
19807 32158 -17430 22879 94553 103778 131538 146836 157466 173570 202413 226910 158860 116878
19795 116878 104416 83176 51416 63411 85341 107974 103699 69084 136239 242884 239617 221372
19783 221372 180506 231396 230345 211100 213733 159729 144836 154683 187204 201970 241191 209983
19771 209983 241091 280854 316837 340913 358617 381792 385268 315642 283346 291885 300720 343954
19759 343954 397029 423634 434779 371952 324824 303504 261540 214180 242325 233754 170899 196943
19747 196943 225258 182216 109202 132744 179475 153700 154184 219797 317851 367085 359932 345885
19735 345885 399923 373013 356071 401875 433236 415049 399167 418590 401605 393388 334728 320139
19723 320139 379553 407529 425845 434513 387175 362282 385171 375043 342346 320636 338000 351140
19711 351140 270804 191496 223594 222817 208638 178077 229421 308361 276645 227732 201971 218848
19699 218848 231946 264947 248214 212757 216067 227501 218445 203445 209617 218805 249814 250828
19687 250828 241935 228739 282430 309787 331912 292652 289257 316603 339854 340689 286155 330972
19675 330972 319405 218281 226232 281370 263167 227851 276849 324155 398337 402355 356069 322857
19663 322857 337982 293816 306751 325524 323775 313273 372838 472246 483373 422393 430898 469143
19651 469143 435469 390887 388028 377936 378920 394923 420069 450290 490001 467287 453960 471393
19639 471393 395876 393775 432110 441112 453175 450571 388798 413781 404864 432631 438373 410609
19627 410609 398652 458761 516649 532025 499629 422643 406139 427793 418360 453432 517073 498753
19615 498753 444892 427924 410136 420213 480349 504881 522748 505726 459718 488679 533167
19604 533167 569850 561125 564717 612676 651778 712264 753240 766882 787090 841680 913072 950321
19592 950321 996791 948045 925985 914803 902325 885399 877262 936189 962479 985553 986434 968580
19580 968580 911913 805734 757828 787066 854251 953127 1022264 1078635 1120097 1178019 1189867
19569 1189867 1283341 1365345 1421887 1509333 1579402 1570898 1545772 1677165 1762004 1893054 2118853
19558 2118853 2348732 2648318 2903304 3063745 3187940 3226366 3217280 3223554 3263433 3261484 3206331
19547 3206331 3132387 3056810 3016999 3078814 3187372 3355654 3630644 3889938 4235979 4730494
19537 4730494 5269802 5822357 6565894 7602628 8898236 10597438 13170404 17017278 22643054
19528 22643054 30237041 38897354 48979973 62890805 79063063 90125019 97167637
19521 97167637 107770149 116345125 112816913 103915609 98284746 90308230 75303688 59719207
19513 59719207 47599081 37554754 28542111 21294429 16149968 12630509 10245157 8664632
19505 8664632 7566740 6818147 6326581 5955057 5688874 5512232 5394724 5358273 5371377 5411123
19495 5411123 5373323 5394639 5568600 5737551 5956991 6135994 6381026 6658712 6967277 7255639
19485 7255639 7561445 7920221 8421585 9062811 10035957 11517457 13921448 17764104 23477411
19476 23477411 30421767 37314576 45430601 57024964 71177394 81731929 85919360 91444090
19468 91444090 99593521 103314662 98815337 90643655 85620794 79579615 68011275 54814285
19460 54814285 43929702 35673193 28126096 21115906 15496162 11479194 8787767 7036428
19452 7036428 5848027 4949309 4262042 3739116 3321413 3019292 2810895 2576072 2375526
19443 2375526 2284834 2122615 2024683 1961378 1931410 1867333 1794180 1703871 1612756 1508261 1410743
19432 1410743 1366109 1269543 1145527 1021070 906022 803487 752363 729169 671380 616156
19422 616156 559188 526010 519191 535623 526579 447623 428152 453951 447350 447597 459092 476397
19410 476397 436691 347831 337287 271100 207688 201042 177105 167331 178708 121414 103634 105955
19398 105955 117414 134033 187272 125362 146813 224959 227090 169008 188695 181302 142183 129281
19386 129281 142224 133284 116723 100976 93850 73553 157912 170968 147801 122271 135813 210611
19374 210611 170489 100236 109269 91119 115678 164651 169741 162222 150896 119390 102051 86152
19362 86152 60009 18038 44071 18127 -186 9790 284 -16118 16513 45860 13521 25730
19350 25730 -3768 27805 23069 74476 99905 57583 37203 44454 103726 114406 130416 150412
19338 150412 162187 177319 158186 128996 99930 55892 51446 50928 -33898 -9984 34682 16295
19326 16295 5831 16959 -5001 12147 40576 18524 -15678 35998 38534 45691 26176 10516
19314 10516 92218 163825 132915 101686 105408 85461 56951 31871 45809 59690 77978 90214
19302 90214 70387 68629 87869 126638 93444 36774 67235 93831 100166 133151 179128 136390
19290 136390 79293 64181 38022 33914 20549 69390 74672 153302 154482 122985 148461 198369
19278 198369 213974 225516 256188 199306 218220 276119 233446 184965 155365 115730 94176
19267 94176 113011 82092 20494 -19576 -23623 -5511 27978 38148 23959 -18707 -35644 -14733
19255 -14733 9363 -653 -10773 -7695 36580 77467 97599 72933 48063 50732 51248 46510 12004
19242 12004 -2184 -31478 -31851 -28802 -13980 -6960 63839 69228 59526 112663 159585 179420 160145
19229 160145 174506 166061 181509 216800 174712 218934 231454 155721 106354 108800 92399 77686
19217 77686 44641 34786 55404 88703 122365 102123 100135 104883 78326 59841 2267 23796
19205 23796 100887 93900 112713 128278 136045 70702 34721 39592 6093 1136 14919 27268
19193 27268 -36270 -62483 -12956 35225 566 -22304 -39636 -42002 -61245 -21054 -1206 35805
19181 35805 69178 44227 10070 -12961 -11573 56879 50570 37210 54246 78530 44134 -25498
19169 -25498 -14579 2832 -29059 -70818 -50798 -18462 7890 37688 93696 143501 116719 10539
19157 10539 -8787 -10878 -18605 -23870 41227 102806 68924 46470 69790 86928 10791 40691
19145 40691 33773 -969 -39055 -69994 -78600 -42853 22310 11433 -4728 -9705 -38956 -100449
19133 -100449 -20285 34574 36823 23031 51544 80174 26027 -24622 -33671 5216 78101 66284
19121 66284 -22122 -38591 -49934 -75027 -124625 -50709 16656 101319 103063 107376 76703 47464
19109 47464 17844 -5029 -67821 -47660 23002 20964 -12903 -10464 25067 40287 9704 26807
19097 26807 84746 71548 68904 86992 62593 -22038 -12739 47278 76085 96328 54409 -25954
19085 -25954 22985 48352 66521 72335 34289 -6931 1372 75083 83611 43651 23393 47375
19073 47375 112871 121223 139484 112589 137679 133570 94644 98275 55991 44405 88638 68166
19061 68166 22804 38949 110705 162940 203053 171280 97144 76062 92980 97077 66065 93751
19049 93751 121746 117940 54217 29908 42173 40887 75155 68732 114218 84664 74509 106708
19037 106708 130050 106178 97950 47498 9056 -12051 -30929 -9852 -4897 12888 30857 30290
19025 30290 64629 39530 22387 24948 81416 114728 108244 82080 10316 -27427 -7906 29838
19013 29838 55676 104801 94191 20576 38353 48980 10580 26314 60500 70952 84290 118164
19001 118164 104328 78215 109878 113797 103700 120783 63494 26877 79204 86768 96680 125339
18989 125339 109088 94956 119355 138439 127952 130461 54030 23196 30309 42984 41154 6249
18977 6249 -6827 40966 94084 37028 28513 54442 58009 49089 81170 45810 84937 144038
18965 144038 194497 210626 241662 239437 282176 303871 362233 327978 250057 226798 231530 204954
18953 204954 140297 92592 131858 163682 160057 196188 215757 252591 349965 388123 430499 528783
18941 528783 581002 615401 648822 672661 609163 498327 461585 432060 396453 290658 217124
18930 217124 185241 181142 245125 225324 202897 153120 94815 55086 60688 60559 43603 67936
18918 67936 43885 21922 23673 67157 92271 114901 114007 73840 20654 4530 27398 114496
18906 114496 93213 56744 85595 127322 109547 137909 112259 90357 105282 122308 120546 91072
18894 91072 91620 62097 40987 62298 79150 30105 -13631 35869 75516 60374 81055 141922
18882 141922 156171 162370 209591 263049 235798 224853 297201 443008 525537 524027 587969 659157
18870 659157 667822 691358 665794 635274 585914 530967 425900 357110 287314 229953 194049
18859 194049 179438 176896 190439 169629 214077 200819 115845 104014 108644 113046 161502 167088
18847 167088 232162 248557 273277 385733 590336 843598 1169004 1347892 1419433 1360986
18837 1360986 1122950 834398 582029 425230 342648 305375 325859 337657 296885 287958 285005
18826 285005 258417 218657 173586 148027 108039 86765 84317 83290 108983 152015 186500 187953
18814 187953 150682 109799 119320 145765 149612 135002 46768 13115 -26551 20374 69690 85597
18802 85597 88232 85078 70365 71487 99305 75839 81901 112082 138446 134386 146592 120564 33011
18789 33011 -7828 80098 30313 59745 133206 159067 238761 300569 330844 407244 483450 478228
18777 478228 450263 420177 374984 297175 266955 316995 263430 206139 268121 363416 568487
18766 568487 765532 732142 503884 295154 189132 170750 198074 196347 242991 210009 160684
18755 160684 120527 111055 76768 80891 94565 89242 150842 212247 189463 139558 105249 124728
18743 124728 147574 133463 173705 151706 113012 131188 150422 126399 48712 67856 142571
18732 142571 122956 197839 285789 304288 296684 282077 264489 308627 323506 278640 191901 181391
18720 181391 178891 137773 133283 127344 116027 94643 93070 32483 28746 30131 -8957 14597 68180
18707 68180 152765 173612 98505 91784 131929 132819 123350 106057 90876 2712 -39954 -34746 -629
18694 -629 27344 23307 17732 57470 79857 69032 101930 88851 44117 14270 36568 93985
18682 93985 115372 67216 28287 4667 35755 79147 100659 78591 70738 23010 2780 -39751
18670 -39751 -70709 -28151 12766 53940 112183 153906 200559 155352 179944 154743 136524 135613
18658 135613 111762 30712 -16395 -2438 13721 20460 33568 -15846 8732 31796 68349 78276
18646 78276 75152 67122 116251 188324 203436 195982 197479 210380 236401 283658 247029 206838
18634 206838 151786 150873 160176 185320 186919 234870 226212 145287 132886 122993 64341 30906 80770
18621 80770 134147 184780 172168 121188 183716 225167 193569 185033 165064 96815 138333 170659
18609 170659 187073 191103 157189 148790 83399 28998 14044 43751 107694 93054 122956 115230
18597 115230 102469 102230 93788 145994 195560 198449 160920 98842 99350 191798 250789 298762 337758
18584 337758 308246 222079 190894 231351 228566 273896 295026 358681 459684 505824 452678
18573 452678 402299 430951 363197 273937 237792 314324 301143 307117 380804 437563 451592 418425
18561 418425 302167 257906 290797 299572 285194 292009 304860 287892 278144 299437 297119 290791
18549 290791 345412 319183 239642 184679 143569 148363 191949 224348 220107 223424 246657 295261
18537 295261 346475 329688 308646 314513 352028 368487 324979 334257 294211 226092 263458 308654
18525 308654 288447 210402 167798 190940 235859 313356 338535 341756 323877 311660 274963 292949
18513 292949 295535 263861 263808 248347 295412 303272 264593 271587 303825 381812 409536 452470 484684
18500 484684 492738 468829 456528 410523 365854 345881 370051 385100 403841 366537 362262 333824
18488 333824 302020 242893 221105 277976 318191 299672 273398 266572 277169 269181 304884 312549
18476 312549 320172 417432 465959 412672 394419 418074 425564 427396 359840 381467 460844 461975
18464 461975 405106 393617 435342 469611 464955 467197 489670 510820 530023 548608 580016 661775
18452 661775 719290 761981 763528 723375 714206 622760 537953 491263 471349 477839 465990 462694
18440 462694 452297 360889 278974 261323 302619 326295 376040 425352 400635 342302 306511
18429 306511 300287 356835 416662 385047 393319 442037 416835 431161 481777 503146 492547 419592
18417 419592 392099 419493 438859 382314 375321 420373 390031 353103 356319 360789 442557 535530
18405 535530 512930 495508 484821 462143 519649 560735 595653 668065 697766 755473 731121
18394 731121 721169 723352 696526 671827 687604 673687 694423 737284 666997 691504 736507 763560
18382 763560 744838 678157 720329 754014 756743 746603 713101 737347 749403 708451 712968 706246
18370 706246 723541 745025 714131 708452 723279 709328 734502 800227 865175 949730 1014105 1094958
18358 1094958 1114959 1088163 1044149 1149872 1177985 1112981 1128852 1131540 1137408 1131032 1144563 1184391
18346 1184391 1191109 1184360 1246245 1268612 1309587 1368780 1392855 1478671 1597448 1721786 1871681
18335 1871681 2093242 2430918 2923257 3629079 4611312 6101347 8574634 12472013 17731753
18326 17731753 23519770 28352284 30953681 31154740 28747022 24069163 18547862 13467528
18318 13467528 9664226 7159399 5477344 4413181 3745246 3342689 3133392 3043842 2990257
18309 2990257 3025890 3159583 3234367 3217694 3133898 2960303 2845673 2848158 2808090 2782002 2697057
18298 2697057 2708112 2785164 2837158 2896396 3058918 3272649 3454997 3562454 3782316 4117895
18288 4117895 4605305 5175129 5783085 6420426 7443060 8973599 11349162 15207586 21346056
18279 21346056 30189233 41072194 52671318 62862570 70297327 72808897 69467937 62009205
18271 62009205 51811502 40613191 30299359 21878723 15775268 11742486 9070265 7308880
18263 7308880 6104017 5254229 4727613 4321948 4034508 3794342 3573243 3458394 3434229
18254 3434229 3413464 3503739 3545970 3512205 3429674 3389399 3340576 3256002 3265816 3411771 3522934
18243 3522934 3561508 3557938 3494935 3486930 3469329 3495529 3652785 3934606 4375308 5017781 5971832
18232 5971832 7501634 9963599 13884384 20120065 28596070 38128206 46217722 50641596
18224 50641596 51088937 47105034 39248469 30000477 21507283 15073789 10817840 8050354
18216 8050354 6162400 4825141 3892556 3217106 2733072 2434191 2140613 1930392 1769329
18207 1769329 1602316 1446690 1350188 1361460 1322618 1303489 1275659 1251742 1273132 1307587 1300931
18196 1300931 1238919 1230979 1261488 1310740 1256224 1226898 1148567 1081913 1022825 1010939 973087
18185 973087 954260 938589 887801 851727 858701 882730 847948 837184 787770 745929 761426 721280
18173 721280 735715 711955 767623 827824 816110 774123 704522 685224 703663 727029 716629
18162 716629 744384 748525 802941 808047 805329 865005 875364 881216 882256 902446 887167 879008 906755
18149 906755 899248 884160 901094 965920 1039879 1062590 1130469 1150314 1114088 1056700 1086466 1162956
18137 1162956 1184749 1186199 1171040 1187073 1277490 1282761 1333201 1412126 1465678 1479158 1559172 1773732
18125 1773732 1963052 2132004 2296928 2558967 2766685 3091886 3538457 4168521 5088613
18116 5088613 6209694 7569603 9695908 13312326 19693611 31540989 53939541 93817916
18108 93817916 134691491 124847017 85248814 53104151 32818525 21145163 14550513
18101 14550513 10617212 7973433 6220469 5130195 4297513 3687154 3227339 2804667 2430524
18092 2430524 2155836 1990294 1927813 1800107 1630485 1465157 1377799 1298331 1253803 1222961
18082 1222961 1154892 1122749 1085296 1047560 996060 955503 939168 903642 864566 879597 898512
18071 898512 888340 900007 941302 968875 901677 945853 1005443 1028777 1012546 998071 949148
18060 949148 961027 914443 880238 903737 982585 977982 1008060 980405 946672 949505 951005 945159
18048 945159 959281 991778 1001493 1026044 1121269 1149514 1112415 1081324 1033452 1012957 1079508 1158170
18036 1158170 1167183 1246008 1311971 1323688 1248319 1298521 1368106 1393575 1459909 1609087 1720079
18025 1720079 1841661 1974428 2053157 2213805 2417408 2549115 2678054 2863175 3085624 3522912
18015 3522912 4043569 4643913 5637831 7141413 9308879 11955836 14155409 15837023 18318855
18006 18318855 22222777 25742908 27354709 28811683 30733558 33078373 36133639 39434309
17998 39434309 40411404 39290385 39675503 41605799 41532876 39542861 37302827 35265931 33668796
17989 33668796 33178606 32291380 28526574 23986563 20856097 18727180 15999448 12736927
17981 12736927 9946173 7883712 6538754 5611931 5050878 4742730 4478360 4272481 4134536
17972 4134536 4008379 3965799 4019665 4080798 4173228 4364259 4717474 5276490 6176863 7560071
17962 7560071 9423670 11052016 12133251 13671867 16356886 18920432 20010468 20882920
17954 20882920 22335997 24201156 26433827 28843486 29867231 29445195 30016593 31913433
17946 31913433 32209164 30583788 28892513 27467315 26086702 25311521 24702863 22118263
17938 22118263 18533645 16014245 14410345 12431574 9909228 7601788 5886292 4725267
17930 4725267 4000391 3520725 3212938 3008917 2796471 2652300 2645321 2661282 2646685 2681800
17920 2681800 2613086 2604710 2619309 2618090 2597473 2650591 2733077 2890585 3040102 3255919 3551294
17909 3551294 3830989 4214366 4675433 5271340 6053086 7126004 8659575 11031333 14142480
17900 14142480 17261316 20497892 24834876 29609114 32682190 33934957 35703557 37383627
17892 37383627 36922775 35625347 35140163 35561869 36668217 39176943 42746566 45617941
17884 45617941 48274410 52210525 55970410 57341091 55828388 54101953 53136922 50366605
17876 50366605 46247104 42967627 40847629 39328533 38689489 38691077 37576009 35519863 34311415
17867 34311415 32452335 28648667 24122149 20300467 16979398 13464143 10334488 8056569
17859 8056569 6498000 5471254 4685368 4041051 3579801 3318479 3134501 2977608 2829960
17850 2829960 2665276 2437767 2257774 2102855 1979347 1941305 1929257 1902743 1821731 1737763
17840 1737763 1692072 1716713 1692697 1606551 1473974 1497602 1590838 1614401 1583084 1466378 1357247
17829 1357247 1334296 1329035 1310595 1317269 1272819 1299582 1356023 1323627 1282419 1298546 1213182 1150496
17817 1150496 1135521 1156235 1143962 1128989 1148868 1157841 1188230 1193458 1183921 1131453 1131663 1200594
17805 1200594 1199911 1184276 1190922 1161451 1074885 1141499 1244243 1285462 1319691 1384195 1427338 1468430
17793 1468430 1517632 1606756 1657091 1714315 1767616 1906394 2084266 2273081 2435046 2562469
17783 2562469 2766903 2994081 3284090 3710532 4207197 4987392 6245171 8232488 11332085
17774 11332085 15502702 19756365 23760247 28030798 30388123 30419370 30687474 31319704 31117123
17765 31117123 31108645 31848110 30950595 28325927 26067223 24305257 23177923 23075272 23611136
17756 23611136 25211511 26748519 26410564 25722225 25703193 25262919 24480236 24443508 23987521
17747 23987521 21640623 18777598 15868386 12610614 9612902 7451398 5969779 4967105
17739 4967105 4444876 4177827 4028764 3904272 3705840 3495395 3331074 3346127 3461616 3610904
17729 3610904 3892157 4390877 5068365 5995353 7493557 9962512 13231940 16390027 19520149
17720 19520149 22893195 24384340 24177565 24461082 24895293 24560596 24573557 25235349 24561709
17711 24561709 22526232 20866928 19628436 18975762 19003870 19595999 21167921 22297091 21701944
17702 21701944 21220042 21177451 20605591 19958234 20026745 19596286 17453773 14961192 12446230
17693 12446230 9584167 7044287 5239070 3966306 3128866 2583128 2152063 1872642 1712911
17684 1712911 1598773 1423754 1303077 1155421 985784 875000 836435 855866 798188 726626
17674 726626 700346 686192 690936 657021 589228 581166 553829 557998 517956 417957 353494 327884
17662 327884 333784 342159 351213 346494 333051 332007 339576 329264 277423 271027 225419 205332 188136
17649 188136 234434 219182 245240 224569 265412 264417 222135 199533 176243 149125 178807 96956
17637 96956 95293 67558 17364 21398 94639 137020 153963 189416 256242 237969 187858 198646
17625 198646 231237 238149 212208 146231 121232 72113 69345 117002 161496 165000 135267 89191
17613 89191 101209 131273 119115 91017 148785 191102 144847 113936 66035 81317 124010 136597
17601 136597 145416 208701 173158 138875 115984 119626 127732 101992 54109 49348 38205 45209
17589 45209 86522 92318 80865 80405 42756 -6151 39956 115094 159794 146709 168490 142020
17577 142020 158409 179085 160885 195802 187000 97013 83426 107139 139621 197751 165141 124318
17565 124318 128744 76049 63364 121275 192510 194185 163737 160831 211907 258575 238264 216059
17553 216059 252851 308178 296194 257852 270698 277627 270778 234246 253343 251457 209075 224968
17541 224968 225868 210363 175505 105177 80392 113331 111345 76136 97942 128382 131463 76141
17529 76141 32003 -5087 22780 50236 46400 -3524 -44286 -34351 -27347 11043 25465 -7246
17517 -7246 -10195 4995 42150 131776 139190 129661 152883 163355 199936 217156 256727 340746
17505 340746 425171 452549 455094 455526 440203 440869 443015 397604 413586 406359 423095 417331 412332
17492 412332 458210 434732 363311 310196 401834 446230 410708 445233 456191 423457 377735
17481 377735 262424 206442 196290 199497 160448 134044 147692 122890 120479 154338 175795 183787
17469 183787 193943 152935 99245 140931 175352 178707 188130 247624 258282 200101 177024 212335
17457 212335 195409 144465 181008 160001 167443 177390 212606 216802 225331 255254 305351 358645
17445 358645 441550 542935 705415 937142 961594 734860 529669 413251 350558 386646
17435 386646 403244 293626 226840 188898 178682 182178 189744 182536 192196 251736 308296 306307
17423 306307 333402 344523 359118 387358 470623 527761 552592 558905 636008 736855 718692
17412 718692 733100 777281 771741 734283 753227 760166 672696 570396 546168 542719 515334 438318
17400 438318 335012 309100 338922 335231 294839 316527 307940 297639 351648 404321 344659 345453
17388 345453 373344 408933 449013 484921 523450 571196 522735 517331 514818 533486 591304 636037
17376 636037 650120 710440 795425 822361 817815 836968 855723 882571 960043 1041145 1107987 1199440
17364 1199440 1203601 1222639 1289829 1379626 1365248 1359941 1343335 1310573 1297738 1310164 1219926 1156665
17352 1156665 1080203 1042153 1016802 999488 1020013 1052179 1120788 1101921 1096967 1119332 1170960
17341 1170960 1099359 969754 938346 909406 827300 746898 739054 770382 745307 739581 726505
17330 726505 661202 545783 459151 441753 447908 379170 285985 262681 277514 259849 257223 225852
17318 225852 223477 182676 168412 166732 130144 165761 105969 34729 18493 -45770 -26273 11615
17306 11615 85815 96542 93663 93833 90596 77475 86447 95818 102907 112128 124374 132923 66828
17293 66828 58079 87377 102874 92096 122724 55144 -11262 37167 104091 149457 168036 144146
17281 144146 119015 113645 136520 167001 119121 132990 56181 26091 16377 58902 58987 61822 25440
17268 25440 -14185 -26697 17044 -4028 -93651 -57474 33828 73521 65187 105032 127508 162075
17256 162075 197435 206620 244253 305021 305684 266103 273927 296645 305028 293061 227366 228469 231984
17243 231984 226919 188775 173899 190426 150707 185191 175076 173732 188213 208545 269815 236587
17231 236587 268643 292878 384425 509229 589358 602113 566716 623783 626309 589867 531288
17220 531288 510617 517265 556586 547092 521662 495946 367596 367073 408108 450734 522510 558611
17208 558611 546553 618596 669825 697949 693090 602132 524703 517318 485973 437813 395545 367063
17196 367063 391517 411628 397830 363313 336306 323055 297628 329583 376162 367637 329991 321517
17184 321517 262472 262015 299756 328211 336747 374644 440367 436343 430796 465219 527981 475929
17172 475929 407733 425709 460428 494162 496182 490248 518280 543648 495969 407138 421740 476780
17160 476780 471866 430388 416774 423129 394475 400298 397897 400558 412400 415709 389129 333707 275965
17147 275965 238933 247289 279246 222178 165429 146675 158340 120372 107136 125876 160054 165282
17135 165282 157520 108288 108988 88359 64755 46011 46162 29209 30999 79833 114255 93236 81300
17122 81300 -2154 -3585 17314 -33742 -20001 -11777 -10107 3787 52479 64070 5396 -8336
17110 -8336 34007 20913 50 5217 3593 -18171 -71158 -63393 -93039 -103421 -113844 -89567
17098 -89567 -13097 15617 42760 47403 7546 -43869 -20273 -62592 -153399 -160113 -82827 -29311
17086 -29311 -14432 -115433 -79000 -14171 14421 -14022 -28306 -2067 20323 -19941 -1317
17075 -1317 25338 9229 -27929 -75305 -49150 20465 26644 29752 963 -16059 -37300 -34072
17063 -34072 -46896 -12229 19152 10884 -44311 -41779 -16206 12348 63195 98972 46503 3297
17051 3297 33548 68123 112530 102201 23330 53542 79568 57012 63613 49710 48753 86468
17039 86468 42589 7751 40777 92075 93088 76724 70513 62158 88211 128535 87979 45950
17027 45950 9435 -65366 -96818 -77686 -56010 -49504 -75346 -155279 -148042 -135237 -56195 -43122
17015 -43122 -63461 -126894 -79842 -40946 12195 9225 216 -46425 -115304 -120024 -71312 -68104
17003 -68104 -63045 -26071 10853 6086 -63007 -109492 -122570 -81300 -35826 -28825 -19937 25422
16991 25422 47121 2071 -27656 -18722 -372 4508 -226 -2097 28624 11602 34555 35718 -23194
16978 -23194 27009 -19691 -28862 -43979 -26407 7153 24435 23243 12404 -16727 -58269 -96760
16966 -96760 -21996 7814 -36719 -56994 -36467 13226 11235 -17478 -37039 -47772 -33858 -32895
16954 -32895 -17035 -3484 -33792 -34429 -23958 -13011 -10257 -34275 -43585 -41071 -45425 -27194 -41427
16941 -41427 -31478 -33823 -21407 -23536 -59807 -14167 -29795 7397 4773 6738 15057 -37571 -74802
16928 -74802 -36969 -57716 -38268 -34415 -51760 -67969 -24552 -7809 -44892 -179648 -226003 -159226
16916 -159226 -143029 -151642 -71949 -63609 -83507 -90909 -119099 -185484 -155229 -84820 -41884 -89657
16904 -89657 -106325 -100235 -122839 -82662 -8070 -8950 -9499 -4443 -7634 -73118 -104690 -128448 -83822
16891 -83822 -31836 -35951 -99563 -124667 -85055 -56302 -42025 -55284 -141784 -162039 -100731 -65821
16879 -65821 -72800 -27091 -27011 -15443 34923 51067 51314 48374 32397 24937 -5314 -41158 -72601
16866 -72601 -26713 -28876 -47786 -57724 -75969 -25600 22616 22183 26292 1592 -78430 -136716 -77861
16853 -77861 -88482 -107342 -91340 -57207 -53933 -82984 -119091 -122827 -129003 -95753 -97322 -112775
16841 -112775 -83720 -100440 -73902 -90877 -110320 -122579 -129769 -133417 -113641 -144740 -129750 -84666
16829 -84666 -28928 -37737 -27244 -17437 -39960 -63596 -100412 -67641 -53643 -20343 -9905 35072
16817 35072 7684 -18963 -74275 -102664 -61205 -5767 14259 31518 10962 -15288 -49059 -41802
16805 -41802 -10314 -31938 -85287 -90972 -69639 -99577 -70855 -28144 -7779 -69592 -114845 -126764
16793 -126764 -104467 -102212 -123220 -140485 -88229 -321 -26939 -39895 -35511 -36151 9056 -37888
16781 -37888 -88572 -30772 -8484 1300 -37375 -48389 -65527 -85343 -100493 -106370 -67952 -8034
16769 -8034 -31492 -16487 11751 -7312 -58677 -32542 -17042 41513 26601 18534 3850 -85417
16757 -85417 -86124 -108087 -102571 -115029 -86538 -59938 -60191 -72794 -69538 -13134 11787 83245 73198
16744 73198 96225 36864 -48946 -47345 2828 -47400 -58725 -66817 -32686 -41866 -104476 -193858
16732 -193858 -188306 -142266 -117938 -87555 -40317 3615 18650 44820 12494 5950 -18010 -61250
16720 -61250 -38584 -47970 -72501 -52821 -80385 -66223 -58967 -65607 -115259 -152730 -159606 -118424
16708 -118424 -103405 -62003 -36730 -50383 -86249 -33417 5084 1055 5177 25070 82630 67816
16696 67816 -1698 -57667 -87757 -83228 -1249 62683 55612 54689 13323 -77170 -117283 -103649
16684 -103649 -138373 -150872 -123162 -120738 -50124 15448 4752 75800 88569 47707 9160 -25271
16672 -25271 -91470 -125739 -113780 -76013 -86174 -18553 11387 7943 -48730 -58347 -34868 -20884
16660 -20884 -82647 -117184 -69693 -46132 -23607 -6378 -15601 -83523 -96134 -16547 4689 33516
16648 33516 38238 25004 -16708 -33940 -67477 -77254 -71249 -47459 -42418 -41841 -32953 -31132 24914
16635 24914 64891 83556 85765 78693 42455 12767 12878 -14261 -48859 -60624 -86483 -118934
16623 -118934 -112137 -81886 -53173 -28870 -64250 -7628 17535 -33989 -36306 -75464 -90464 -105754
16611 -105754 -118819 -109032 -144144 -102252 -47788 -33221 -22394 -72164 -78745 -80912 -63123 24614
16599 24614 54393 36722 2880 43727 65802 91047 71517 14450 -663 -20878 -63467 -57132
16587 -57132 -13260 8770 56589 78006 32283 -19048 7298 17979 -15594 -56588 -20638 11359
16575 11359 -42104 -69880 -122728 -143142 -77331 -82567 -120307 -26826 6131 11088 -1841 4775
16563 4775 -29271 -53809 -70269 -98430 -64887 1978 73050 96754 40120 12444 -57418 -83284
16551 -83284 -63621 -46390 -82555 -132134 -108515 -87804 -99446 -120225 -132816 -153487 -136022 -117486
16539 -117486 -112711 -101336 -58425 -99211 -106635 -92268 -138905 -66058 -124547 -146752 -123020 -98605
16527 -98605 -77203 -39959 -4154 8130 -22591 12203 -3298 17963 29815 14265 57776 -18726
16515 -18726 -68699 -33456 -1779 7878 3521 67250 70909 3277 -65568 -79381 -52394 -48014
16503 -48014 -55766 -34740 -68679 -121178 -158286 -75923 -17365 -16488 -105263 -169579 -139657 -75344
16491 -75344 -4707 3289 -17956 -51781 -57366 -57201 -14116 -39981 -70066 -99756 -108796 -88765 -151500
16478 -151500 -180239 -104330 -70555 -117956 -170953 -131675 -98683 -58083 -29271 -42789 -64050
16467 -64050 -46028 -82493 -86056 -66695 -25114 -14574 -31822 -36909 -47929 -31432 -70309 -106362
16455 -106362 -80082 -54863 -56227 -55216 -94307 -92726 -61098 -112298 -152178 -73817 5343 11109
16443 11109 -74459 -117160 -124870 -148708 -141334 -83083 -53532 -73741 -40223 -72472 -107949 -150145
16431 -150145 -147391 -128784 -138695 -162394 -120928 -71689 -81174 -129775 -104829 -114132 -154275 -130438
16419 -130438 -139855 -83352 1344 -14583 -9091 -17438 -32322 9239 -11097 -16772 6278 41403
16407 41403 -30278 -57787 -47218 -11502 -17542 1452 8849 43743 37082 11400 7138 -36775
16395 -36775 -22584 -43427 -89674 -81945 -97634 -85368 -93408 -111683 -118125 -123284 -118872 -100952 -39412
16382 -39412 -18815 -79719 -83610 -35035 -4272 -40358 -54888 -76213 -55262 5142 11957 -36254
16370 -36254 -31296 17718 42248 52701 18340 -21016 -57621 -43875 -4925 -13252 -42036 -11162
16358 -11162 -30826 -108235 -121527 -121109 -37697 31446 5334 -32549 -70122 -92135 -86163 -23294
16346 -23294 26549 13923 -16037 -30604 -25211 29859 39238 -48131 -117509 -120749 -95773 -78208
16334 -78208 -99496 -96840 -84228 -59942 -86734 -131838 -142057 -112193 -101727 -154871 -132630 -81918
16322 -81918 -85705 -114571 -78525 -26054 -64414 -109633 -89073 -84276 -107416 -112900 -118759 -75345
16310 -75345 -36401 -62741 -72359 -66189 -49308 22413 39905 42995 79349 72198 51061 21254
16298 21254 4070 -26138 -59095 -100669 -44422 -30421 -61965 -52025 -52395 16333 95075 44888
16286 44888 10424 14417 52562 60104 80936 79279 25974 18136 23073 -32821 -62897 -90864 -56089
16273 -56089 -76768 -86200 -50930 -31137 -9630 24946 -6597 -143477 -188444 -185627 -156432 -91208
16261 -91208 -25416 -57546 -92899 -94379 -76120 -81968 -68363 2160 -56694 -147123 -106411 -69028
16249 -69028 -63792 -30078 -38530 -37507 -2307 -9125 -29205 -12234 26678 18345 -56654 -62471 -70833
16236 -70833 -137150 -120340 -123570 -137786 -96760 -68197 -32500 -27361 -58630 -96372 -105558 -70908
16224 -70908 -51289 -100624 -119219 -60423 -50259 -96818 -129816 -139117 -137541 -95557 -85267 -130400
16212 -130400 -122717 -131926 -129984 -37755 -224 7583 -15761 -66187 -70905 -80308 -86397 -46415 -91400
16199 -91400 -70449 -6881 -4910 -59966 -88317 -97178 -125628 -138487 -105596 -79723 -54434 -67957
16187 -67957 -98292 -91604 -96676 -50950 -92109 -106406 -98667 -77750 -31142 -46705 -58500 -71868
16175 -71868 -82864 -87034 -86911 -51662 -10402 -19283 -37619 -43905 23080 88603 13816 -68030 -102160
16162 -102160 -107971 -127369 -72718 -52464 -46259 -107187 -170963 -147664 -69973 -53859 -82634 -30712
16150 -30712 5900 30506 30171 3161 30467 12126 -1734 5380 -49481 -61673 -29145 -29110 -62262
16137 -62262 -66548 -25846 24779 48414 23970 10489 32320 -4693 -60897 -88168 -105193 -65165
16125 -65165 -44110 -22459 -10048 -33802 -48131 -83143 -89965 -91815 -61178 -72252 -74935 32947
16113 32947 24090 -15623 -15962 2340 7763 4116 -23706 -48334 -63209 -25126 18678 66724 62786
16100 62786 52565 53689 14833 -38836 -112974 -132249 -101630 -103873 -126154 -96408 -44234 18415
16088 18415 2561 -4401 21104 69062 -9021 -38307 -44497 -40169 -23635 34216 38172 -38829
16076 -38829 -49152 -81467 -43749 16211 45303 36380 -10795 -31618 -71997 -19601 24504 -1572
16064 -1572 -88511 -72395 -21683 50612 33094 40333 28820 1326 -34594 -78008 -77749 -66263
16052 -66263 -11589 -44481 -19146 9032 -15753 -27448 -27045 4435 -41909 -62032 -60473 -130595
16040 -130595 -114128 -111515 -65658 -58002 -47318 -25449 -51661 -117021 -72291 1853 -734 -40720
16028 -40720 -68431 -60218 -30686 -10367 -54148 -76338 -103219 -141175 -123402 -124797 -147562 -136924
16016 -136924 -106627 -90063 -63824 -11232 32198 64390 2658 -8865 -4990 19599 44755 45367
16004 45367 61389 33244 -32816 -33451 -24157 -325 -9134 -113417 -89534 -58761 30869 23552
15992 23552 -6874 16697 -50374 -107961 -92540 -62710 -34784 -18358 -90338 -99418 -49896 -49814
15980 -49814 -74376 -112277 -125077 -39243 -19087 -38232 -43051 -66191 -87057 -58726 -64965 -40699
15968 -40699 -81795 -68255 18600 18826 39203 31049 52302 7542 11551 54528 68554 85319
15956 85319 76418 53734 19050 3090 -3328 -9387 -51854 -58005 -58755 -12490 -101318 -144058 -127058
15943 -127058 -59847 10660 34761 34423 79253 37138 -32582 -39649 5415 39902 32344 -7902
15931 -7902 -50265 -82394 -43990 -54627 -82181 -146510 -193856 -131316 -109093 -126116 -131399 -138002
15919 -138002 -149795 -144519 -93160 -24652 1970 -69569 -60421 26101 79160 68353 68288 -29195
15907 -29195 -74685 -61675 -127009 -188288 -126184 -115413 -109988 -17206 26831 -2199 -52250 -26725
15895 -26725 4934 -5259 -27062 -25850 -7905 32047 49610 54905 101645 152846 61991 -1071
15883 -1071 -12415 -67265 -101498 -47276 583 50006 46610 74175 70219 20691 -8571 -34858
15871 -34858 -88086 -91177 -125063 -74523 -26159 -1790 -96 24469 49950 68007 29307 -22144
15859 -22144 -20249 1820 -6264 -35350 -9351 24451 5477 -66127 -103639 -78762 912 25354
15847 25354 -9435 -29655 -41858 -37034 -28915 -17368 -53183 -19562 19016 -1762 -34844 -49331
15835 -49331 -3936 -73050 -109382 -86803 -61107 -57873 -34271 -31634 -58513 -56782 -13342 8911
15823 8911 -25421 -46249 -63588 -44701 -18340 -32365 -53436 -19369 24075 45104 40452 5744
15811 5744 5456 16860 13634 14261 -28425 -36620 -39185 -6022 9367 11024 21012 -14814 -64928 -54629
15797 -54629 -17625 42738 51119 36182 92688 99521 67871 -132 -43445 -45348 -43338 -59431
15785 -59431 -14416 -28844 -3858 16962 19754 -16978 -48975 -92933 -98177 -24603 8544 -46237
15773 -46237 -58690 -30418 -32806 -37460 -67318 -122956 -137151 -122204 -77340 -98875 -102151 -84502
15761 -84502 -50891 14110 -19085 -59621 -47423 -50784 -82499 -92817 -120543 -61320 -13178 -43602
15749 -43602 -88327 -55356 -14384 -77945 -116103 -92771 -105007 -115510 -72900 -146634 -129872 -94991
15737 -94991 -56646 -78587 -58640 -71788 -73285 -42369 -33093 -38599 -40796 -50017 -101827 -93067 -88133
15724 -88133 -95425 -77801 -27194 -31583 1900 -36124 -120899 -90057 -90302 -58268 -122875 -82973
15712 -82973 -34777 -10835 -52831 -82374 -76967 -31725 -5385 23583 -21243 -63795 -79810 -77570
15700 -77570 -83883 -134958 -67500 -45844 -100964 -85090 -48517 -59881 -40069 -67439 -158806 -95931
15688 -95931 -133231 -150164 -115984 -72647 -44811 -13791 -13661 -55732 -91159 -60853 -117689 -147637
15676 -147637 -141711 -100314 -55414 -98701 -151769 -117688 -67185 -18246 -9521 26703 8210 -33715
15664 -33715 -88984 -72535 -102726 -114756 -86352 7546 41575 20659 -28917 -50326 -57643 -64328
15652 -64328 -78192 -93056 -51961 -18086 -18740 -5402 -10469 -6960 12078 -9856 -41854 16921
15640 16921 -46491 -67714 -69589 -52153 -81553 -20450 -20461 -6430 26782 -718 -52391 -60959 -79180
15627 -79180 -60032 -21753 2326 27018 26710 17114 -10814 -20898 -5705 -35758 -10675 -18523
15615 -18523 8179 33472 -35229 211 56112 60484 4651 -69421 -103550 -68587 -31619 -58151
15603 -58151 -129172 -106348 -42817 -73500 -53239 -42290 7328 41011 33328 39651 8487 42680
15591 42680 82250 76008 49522 69291 77185 40866 45227 86671 35795 53468 48946 -1888
15579 -1888 -52298 -95035 -47788 -2849 -19860 -49231 -67023 -57840 -22041 11996 66496 88366
15567 88366 71237 78672 74790 46663 56571 14376 -18738 27903 43401 41045 45925 6248 -32017
15554 -32017 15998 36654 29044 -1313 -59517 -55430 -68727 -61612 -81562 -43179 4787 -38508
15542 -38508 -49258 -19519 -11750 -19775 -8584 -52268 5086 58148 65376 64480 -25008 -40802 -68495
15529 -68495 -40678 2665 14813 63938 29515 29197 62001 44402 63106 23268 -1020 -31562
15517 -31562 -26985 16148 44593 9588 28559 79128 79905 81974 34129 10960 27315 6822
15505 6822 16863 104445 110049 96750 53506 -33061 -72023 -25108 -21303 1281 -17082 -62801
15493 -62801 -52764 -48232 9093 44748 -33359 -77678 -29685 -46820 -24236 23698 56252 37476
15481 37476 61699 21401 -5039 82937 118007 138878 170613 138524 117619 113896 108964 144260
15469 144260 222261 135571 44059 42848 87338 118832 176866 215696 181138 95778 62619 126097
15457 126097 166290 200810 210062 209835 200144 165396 112705 182482 258081 213724 155502 185984
15445 185984 208604 221904 170694 68667 64005 165116 269035 234998 166558 191150 221429
15434 221429 186370 150211 197280 242208 239974 200448 115432 116837 171174 213315 180673 108283
15422 108283 104298 88204 114493 117885 118141 102126 169565 161797 155203 182410 213470 160621 120764
15409 120764 84665 81455 116236 112425 109619 154397 182433 140799 130999 134302 135891 133418 152082
15396 152082 155235 162168 161669 106983 102124 86406 72982 75753 51794 62933 134116 128158 84022
15383 84022 43018 76617 80706 54285 90695 130386 117456 38173 47371 57442 91700 99051
15371 99051 31950 18224 57588 77726 111819 63703 47840 61250 109015 129837 58265 30293
15359 30293 42093 78416 113115 94815 84205 44388 15641 -21814 -6352 -21491 -395 -13117
15347 -13117 37250 36418 20863 1796 28763 -20907 -53773 -44397 -14932 -12102 -28723 -71774
15335 -71774 -83007 -19521 24219 88993 90956 94382 104984 53940 61545 79606 11326 57036
15323 57036 67127 37176 54433 58234 40301 17098 26241 31422 54805 58947 14738 74090
15311 74090 87758 -10317 -41565 -11102 37677 26744 19773 6122 12031 -3117 -26877 -85647
15299 -85647 -105211 -81187 -111346 -91588 -29575 47666 79251 88922 91664 107910 54666 84730
15287 84730 78471 77972 113439 108252 46322 6411 83533 185969 249710 198058 131867 114685
15275 114685 112928 91573 101630 167626 223572 175466 98801 42651 -27572 -48475 3056 10680
15263 10680 -32901 -42966 55166 50160 20819 58011 29437 84169 106916 88357 69295 66471
15251 66471 30116 14943 35765 36263 -40318 -23891 52765 59204 57585 57845 135606 167040 87667
15238 87667 16534 51132 97877 79220 78355 130477 101431 54140 44528 -17411 -7001 -8073
15226 -8073 109443 129897 119285 122638 51108 1778 25958 47316 36745 26871 29790 29106 60973
15213 60973 79712 112127 112076 52717 49002 47400 82784 79592 52605 140 -746 48967 172906
15200 172906 176426 142228 136663 128710 98004 54661 47196 3300 77344 102879 48231 14635
15188 14635 44743 25453 686 42240 86725 98779 103925 99275 71120 89491 115588 140522
15176 140522 126829 129349 159842 151480 143352 83865 42943 49895 85031 117189 88569 73400
15164 73400 109510 116795 119161 154717 175819 150315 73857 60660 94427 60415 17321 17468
15152 17468 62191 143770 190831 213163 211383 213549 206879 152611 148795 143204 134850 131740 152040
15139 152040 159863 94161 29010 67981 93941 59328 54101 63643 -6354 -9225 30594 39170
15127 39170 97411 140160 87553 57631 123281 151059 88109 43684 8131 67328 109724 112264
15115 112264 117383 60637 -3042 59216 75281 105732 107734 125287 143014 163448 152987 73276
15103 73276 -6092 4099 -9018 45836 125147 100792 27709 14279 115327 182809 184144 128620
15091 128620 84693 135926 150543 58172 12547 34836 35845 -7233 -11975 7494 -17760 -97995
15079 -97995 -98590 -68583 -45773 -46850 -31016 15069 19400 -18702 -35890 10175 -10748 1472
15067 1472 52161 87331 77526 49614 23145 29851 39115 -12626 -7628 -4267 40872 74602 -15042
15054 -15042 -20557 5332 -65412 -62336 -13374 12691 8365 69699 97981 53682 15335 13448
15042 13448 -7149 37356 28684 -35633 -82081 -33576 29692 43826 22677 17908 42918 34909
15030 34909 -5652 -69815 -51094 19305 58188 59233 20830 -17522 -6635 -5602 22204 -15858
15018 -15858 -29113 -12104 275 20907 5663 9137 13741 -65564 -94213 -106809 -134290 -71487
15006 -71487 32457 -12994 -38825 18334 53238 44720 112827 204106 338901 521477 939910
14995 939910 1735543 2245551 1845433 1231577 750074 479953 338528 197463 93200 50451
14985 50451 55249 17743 44830 52783 45464 70835 47053 52904 65014 90383 72323 28538
14973 28538 25731 -20126 -86491 -58149 15804 22645 -10126 25643 -1236 25455 46719 69672
14961 69672 34938 28344 9198 4064 21659 58959 70701 27068 -50684 -30771 44761 5571
14949 5571 -47665 -24813 21394 68100 -11363 -36087 -36303 -42575 -24596 -63933 -94548 -114931
14937 -114931 -169030 -112298 -27569 97461 88228 4533 -47560 -64677 -46726 -4535 4829 6644
14925 6644 -19572 22906 42464 -3296 -25284 -16851 -10576 -32312 -83364 -87696 -45415 10194
14913 10194 -17947 -52118 -47667 -54092 -52305 -6931 -50791 -81642 -70466 -74456 -77961 -64448 -41113
14900 -41113 28219 14573 26388 3059 -14204 -790 13936 5277 18744 13281 851 -43000
14888 -43000 -21797 -10685 19301 -33642 -28450 49010 139803 107969 -3990 -15374 -41507 -48263
14876 -48263 -98030 -121865 -49795 -1433 -22864 -64838 -75724 -81489 -99863 -56577 -45283 -16951
14864 -16951 -15545 11361 84739 68066 26671 -58900 -68434 -47485 -70858 -61130 -9996 37571
14852 37571 6489 -11390 -17052 -12326 -59548 -88591 -17201 41649 43140 -7355 -112357 -118425
14840 -118425 -126508 -79513 -37161 -74439 -109517 -103519 -91903 -87095 -52097 33982 16723 25829
14828 25829 12637 -4706 -30990 -34011 -8237 12437 8300 10182 37019 19890 -6969 -23753
14816 -23753 -38528 -7047 -4423 11587 31599 34541 -4687 5626 8707 -9964 -1265 53080
14804 53080 83845 92874 68042 23540 29593 -6436 15443 -64419 -131939 -131089 -112208 -47449
14792 -47449 -46277 -31485 -11337 -9459 -31341 -46515 -23141 -11144 -21948 -17445 29571 79774
14780 79774 93038 50603 36307 54149 53184 37119 35213 88335 65092 -8864 -11540 229
14768 229 -22280 -20637 -3790 40932 101966 127501 74437 48 -33879 -92123 -176317 -105549
14756 -105549 -4950 7133 4991 -6548 -21216 -25119 -116205 -140055 -74434 -7574 57613 16003
14744 16003 -1963 31963 -29192 -89771 -68649 -40401 -13087 -11031 -18527 -46107 -49046 -62340
14732 -62340 -72861 -1916 91814 73627 -42893 -119165 -160617 -99634 -76966 -61064 -125006
14721 -125006 -142799 -98107 -59644 -86713 -96935 -77914 -50368 -87283 -60503 -31034 -13972
14710 -13972 -37163 -45570 -13325 -19856 -78264 -61136 -15039 -22088 -43933 -44536 -30094 -77791 -43912
14697 -43912 -20598 -36328 -34906 -28762 2200 38146 -28790 -14887 -22953 -3495 -17099 4644
14685 4644 7938 -13243 -42863 -65956 -77015 -38515 -5531 820 56611 40973 -13535 10869
14673 10869 80371 84739 101736 51082 29066 55007 -634 -20492 -65938 -24347 -33161 -18722
14661 -18722 -25246 -33191 -48892 -47878 -116037 -116313 -86810 -18979 -56643 -120092 -95512 -93929 -53285
14648 -53285 -36823 8552 7902 -28407 -36110 10706 209 -9565 71712 26383 12072 -22094
14636 -22094 -93158 -85404 -36858 -43289 -64777 -107337 -73768 -10875 -17601 -60324 -10863 15680
14624 15680 -11848 -27996 15074 31286 103723 92988 11197 -40582 -50983 -30881 5672 82720
14612 82720 21654 19957 4223 3897 31242 52910 55415 67523 7540 -22745 -58748 -58719 -56853
14599 -56853 -57180 -82956 -71401 -85589 -18166 -14845 -81009 -78590 -69718 -65816 -43073 -23041 -38387
14586 -38387 -27464 36285 77541 38145 3325 34019 45382 32732 23761 -45085 -40220 -64388
14574 -64388 -67864 -65142 -37829 -44205 -43247 -66414 -29915 -5984 10690 2595 45751 66462 38127
14561 38127 96164 91345 16033 47726 131965 187521 229860 232016 236150 254804 252033 241763
14549 241763 252011 274392 259814 178574 84578 -25224 -5372 15347 21610 49727 37005
14538 37005 39763 82557 32385 -18387 -6196 32311 -14645 39101 87468 50509 31394 -9451
14526 -9451 -62631 14646 48868 49243 111311 81664 97120 128463 169773 139783 157067 142670
14514 142670 82815 29402 26637 16291 -40281 -79870 -39844 -26598 -18990 -43376 4334 18466
14502 18466 7587 -36186 -3238 11607 5001 12769 21256 -2160 -26850 -110761 -121027 -132838
14490 -132838 -63182 27714 -6645 -31513 22312 46414 56865 -8486 4933 -16437 8757
14479 8757 18721 11649 16231 23038 -28431 -64502 17653 45531 79147 43268 9087 3495 -5092
14466 -5092 48097 38069 1658 -18423 27238 45318 7025 -13705 -41785 -62122 -42559 -79207
14454 -79207 -145455 -130458 -48353 -74829 -67524 -55721 -14009 -33023 -20445 -19792 3333 -2303
14442 -2303 -10835 -30264 -71665 -84565 -108970 -97947 -45815 -32551 -69878 -72095 -77300 -56554
14430 -56554 -8814 19540 -23141 -31837 -28301 2828 8917 -6470 9978 -32451 -15974 -27926
14418 -27926 -73843 -77079 -59828 -75186 -38097 -94400 -135190 -97233 -95951 -56909 20819 40
14406 40 -24605 -7035 15146 52800 70447 38621 -18730 -44672 -103215 -50443 13125 12964 4830
14393 4830 4735 8772 50991 -6983 -33847 -11507 7812 -1403 -23647 -21358 -31629 -3969 14119
14380 14119 -25101 -59532 -41422 -14151 31181 30038 -14615 -47951 -55064 -13769 41214 44846
14368 44846 43074 27149 17195 16184 15074 -41018 -21102 51920 102018 109611 45261 -37342 -75869
14355 -75869 -50335 17448 -18860 -2630 1312 -17423 -17705 -29434 9111 3932 18051 -12801
14343 -12801 -6456 40856 19710 21523 8475 -50340 -128406 -123901 -140105 -106681 -69206 -49957
14331 -49957 -10574 -2058 7736 1926 11004 -29403 -25295 -42578 -5526 76893 150251 131470 117700
14318 117700 113594 62310 29285 30544 52050 59961 37642 -8582 -25700 -47229 -11531 17246
14306 17246 40021 30086 35943 75377 51655 -8089 7648 5278 -41747 -35028 -11750 28591
14294 28591 25812 70336 71427 11827 27135 66441 49580 36858 22694 2689 32219 58385
14282 58385 96779 92399 66022 22290 2195 -4481 -69254 -82676 -50112 -26701 69025 71367
14270 71367 63974 38180 5283 1582 -5239 -87104 -72159 5410 68873 91354 43760 8626
14258 8626 28596 68512 103596 66376 52268 72607 41932 -21058 -3181 20535 62766 59942
14246 59942 82894 81294 55627 26981 57423 57282 40171 55294 34712 12535 63200 73591
14234 73591 59064 56611 50410 77347 78054 68911 66252 43207 -5945 61080 80582 24318 -12862
14221 -12862 -72110 -48051 15129 23751 -16601 -36627 -46477 29302 38848 -26681 -17323 -4015
14209 -4015 1669 6572 10991 -42867 -28725 -60884 -65218 -4493 110573 104735 91980 43763 -32749
14196 -32749 -1497 -18319 -594 -27428 -55117 -80873 -115527 -102870 -37061 -39113 -95410 -66996
14184 -66996 -46581 -76842 -39857 39151 49048 111087 112758 26282 -66494 -75051 -45103 -37104
14172 -37104 29843 12063 -17628 -41870 -96004 -135488 -101250 -59325 -23027 3849 -4122 4028
14160 4028 -20955 -29004 -27766 43074 45024 31249 -5413 -86630 -88564 5026 22302 22871 34255
14147 34255 63568 53856 101070 110643 88496 99211 74615 10802 -7380 88793 90711 81927
14135 81927 66195 -18698 -10356 87690 87162 33521 -8371 -6531 -50587 -31702 71186 123856
14123 123856 80938 53683 76258 83071 45625 35243 20545 -10036 -16851 -41394 -12680 31258
14111 31258 47083 16213 -31051 -56298 -40185 -80094 -56642 -32611 30057 44476 -22572 -6998
14099 -6998 -813 5620 41994 31524 23584 6242 7013 23999 -3085 -33603 -3585 11360 23644
14086 23644 37750 57437 84406 125381 178247 287759 380323 493090 569801 669464 795728
14075 795728 976961 1038640 1011750 982614 924212 821621 662565 591498 518347 372767 288008
14064 288008 243629 194714 151164 141989 145032 79813 -14954 -34397 -13861 26690 28746 46836
14052 46836 5905 -31732 -30277 2778 6492 60872 144007 133289 94398 63390 37569 26090
14040 26090 57510 47348 73461 88956 123039 107417 43538 15110 -31252 -32054 21999 -12330
14028 -12330 -38564 5315 2069 -29225 46064 34109 13076 40044 54992 17360 12650 15860
14016 15860 -18766 -19726 6821 -32176 -53273 -3064 67996 58541 29615 -14168 -28084 41425
14004 41425 83494 70909 111015 116059 104939 105665 156572 140506 56300 59032 105296 63437
13992 63437 -22106 45797 66883 23909 54590 78860 87040 127520 119156 102106 122346 138497
13980 138497 107348 126231 183624 244436 286663 294444 267803 206073 170640 120358 144448 123495
13968 123495 116849 102863 90089 80398 148578 144342 113593 89299 77516 44779 9433 67709
13956 67709 88024 49698 23426 13166 -13391 20170 25573 -23428 -56729 -42691 -59568 -82801
13944 -82801 -26200 3205 41779 108808 63014 23655 -38198 -44005 -73944 -55724 -19666 1994
13932 1994 -10285 35185 88178 107035 127759 170591 171842 55861 21681 14937 32645 -18809
13920 -18809 2642 74778 110215 127851 194920 167258 52406 14369 27446 3827 -9708
13909 -9708 12565 21256 20531 42532 120014 125036 172888 176030 133913 164484 133945 70896 35751
13896 35751 50801 14496 -28535 -3733 21576 9521 70071 127363 101357 65572 132157 199395
13884 199395 248162 234604 178351 114116 98256 47753 14937 -54152 -58697 -111054 -54790 4660
13872 4660 -34767 -40874 -14831 24258 68914 95208 118739 86140 40093 -5551 9512 -18082
13860 -18082 -50377 -29598 2763 33715 25212 25292 41646 55022 70279 59419 5804 -13873
13848 -13873 59566 91631 80883 33008 -6356 40545 79185 58318 10659 7189 -18002 -3051
13836 -3051 6315 18053 18463 63627 70884 41945 6919 -59135 -44990 -79183 -73386 -13038 -29290
13823 -29290 13968 50948 11763 -1750 -50556 -21855 13949 297 4295 -9957 11629 -1622
13811 -1622 -70013 -27126 21225 106212 133369 140035 68413 32214 24129 13836 13368 -18984 -431
13798 -431 57917 60819 55057 75030 142052 168715 157973 74555 46631 115312 124755 135040 151085
13785 151085 159099 215125 297140 302619 256058 293934 292768 290266 304564 324633 277252 255805
13773 255805 228749 210702 141280 115829 89415 121601 97677 108546 64773 31906 11647
13762 11647 5413 13309 77239 55261 96947 77499 -7188 50194 99812 97560 118741 132743
13750 132743 136467 149465 191819 260475 326082 253796 305753 355239 386147 387495 394227 348275
13738 348275 255640 181196 149015 146062 117121 91944 99614 49992 13319 -38550 -23929 48259
13726 48259 46073 4274 -13316 -17915 -2768 -4992 46923 26812 -10061 -14977 4812 -27558
13714 -27558 -12220 75141 82225 99401 129120 75269 29973 21590 52580 88651 122594 115925
13702 115925 78579 81781 130396 157531 102702 93814 35311 10031 16461 18934 7291 39452
13690 39452 71777 74871 94767 43385 -25763 -75403 13556 118515 177745 190905 152226 115458
13678 115458 151290 173755 130982 117057 91542 60489 28759 8894 51 34568 40614 11451
13666 11451 12232 20026 -8141 -73143 -73669 -25566 -22279 -21366 -4177 20254 38814 12083 -21102
13653 -21102 -29710 -7478 539 -665 -2059 29481 29827 44277 44502 68517 94767 91850 70994
13640 70994 85917 93336 101593 164438 126239 71144 41951 26498 51498 36157 12877 -38427
13628 -38427 -38573 -71497 -48083 -49542 -68561 -46080 -2565 17651 40305 5859 25128 65285
13616 65285 90069 87371 34996 -51569 -78781 -85180 -58439 -4010 11423 1135 240 -11316
13604 -11316 -8985 -14131 -37770 -47586 23929 54156 42860 36290 47305 83932 75856 52682 38054
13591 38054 -1229 -3787 21847 -7464 -2796 2608 -47912 -47403 895 47278 -9585 -35783 -60210
13578 -60210 -47061 13336 -15246 -39387 -19704 -20152 12074 -6385 -46989 -43790 -44848 12562
13566 12562 45385 55120 -5354 -82455 -95137 -76221 -28734 -19315 -38593 -3999 17693 46503
13554 46503 58292 52705 31050 -3377 -13389 958 19496 39414 63230 114722 174561 126054
13542 126054 60870 85255 90831 114388 77296 92572 130647 86363 92949 116857 121857 92590
13530 92590 68701 124877 114583 112334 55218 46356 56481 87428 100450 111776 136627 68554
13518 68554 51992 94971 125653 63328 78136 91308 111920 88948 51398 83708 98726 39066
13506 39066 65811 66123 90761 101782 86377 53984 61610 37727 14532 -4298 17905 85287
13494 85287 129176 115482 84429 66037 45286 106607 175875 142201 112630 74844 93132 94126
13482 94126 82872 134895 127855 67428 34357 29720 -5660 -35990 9760 10275 -30302 -55652
13470 -55652 -28837 49529 81981 36485 32701 84273 75213 23265 -4679 35620 48229 26081
13458 26081 63335 59312 -11359 67450 133566 176677 136998 51155 16384 26993 54841 30910
13446 30910 44319 78557 107212 127651 116052 97611 96850 100662 114618 129669 120986 112152 98059
13433 98059 130114 101573 56293 58857 92752 59156 69157 120369 154524 107229 56880 41092
13421 41092 14776 -14353 15694 18420 -2143 6534 20026 39512 34094 28678 57945 109181
13409 109181 93038 108481 85951 28561 39370 63423 35248 56992 13785 -34285 -22971
13398 -22971 44807 61598 43311 4751 -19484 -27477 -16573 7796 34175 20918 -40071 -44115
13386 -44115 -48795 -17233 12129 61758 100880 99398 132760 122605 137279 125295 76173 73951
13374 73951 14875 21085 10799 3967 39125 70262 97429 73631 39947 57806 56116 55537 81469
13361 81469 79154 30116 55912 18044 28503 6039 -62502 -74526 -45345 -49461 -51887 -30802
13349 -30802 8760 39195 58503 77748 56441 56633 80052 81147 54434 4389 -2119 2921 -11908
13336 -11908 9608 16155 13897 -15941 -53418 45960 156640 126419 74346 72758 85153 41420
13324 41420 14743 36802 47496 10398 7562 1677 -14863 -42406 -29406 52407 67584 43008
13312 43008 37446 79773 35853 4064 -24876 -14727 -21178 19342 30849 -21307 -41389 -15982
13300 -15982 -36712 -137996 -72551 -73185 -62538 -29248 -62687 -32702 34440 91625 164301 152544
13288 152544 147948 112619 88244 84149 137284 179868 144762 111449 110981 119296 103436 89002
13276 89002 25418 51286 76755 81596 61203 100131 156713 187205 148924 87070 76921 54638
13264 54638 -812 -1040 1045 31189 33587 51264 97040 112938 39413 3368 -65006 -54219
13252 -54219 7822 85689 119225 126756 87426 23835 41792 81967 76932 64415 49045 16700
13240 16700 -15482 11700 16523 -69060 -63926 -57075 -106411 -71932 -14205 21131 94077 104898
13228 104898 77279 -31713 -87993 -34026 45028 43523 54267 71855 109006 148338 240984
13217 240984 304551 359243 495388 653195 796441 938099 1011407 1099975 1172123 1259353 1243089
13206 1243089 1151271 1059409 933355 764355 575899 419533 318274 283629 252024 256810
13196 256810 230520 145927 57090 -7401 14737 64356 36888 38193 47185 54659 3716 20199
13184 20199 -15287 -62254 -57880 20710 41996 -20467 -13635 36102 81221 64432 44448 24124
13172 24124 -21662 -18527 15626 15019 -7431 18076 15875 36223 14938 12756 48449 80829 76924
13159 76924 48966 48336 36303 -16590 13428 9560 -67839 -94399 -19132 46088 14594 -66013
13147 -66013 -69652 -75248 -47605 -16026 -9335 37743 32726 43592 37495 -20099 -7593 7152 12045
13134 12045 60226 83506 94721 139208 181899 100471 80494 88021 55172 43539 16821 -12165
13122 -12165 26147 1397 7252 76888 139240 112891 39798 44381 69060 39725 45769 23498
13110 23498 9196 11987 -11248 729 40606 32961 41627 54461 -4844 10414 35534 38676
13098 38676 10361 -2175 -8183 -15337 15438 68582 56271 32730 12642 27040 36378 36734 50066
13085 50066 94137 6537 -37893 -2304 15396 12145 11355 -24941 22211 66157 21014 19532
13073 19532 30150 68163 83414 71030 87172 71671 11683 9218 -38674 -77290 -44603 10270
13061 10270 36114 -753 30022 86039 79318 35681 -22926 36644 89513 140681 164247 142488
13049 142488 158702 143848 79585 39645 64298 100391 103550 130392 130185 124235 127153 43502
13037 43502 11637 71697 67871 56540 41865 95787 100432 74273 132299 131740 114695 63532
13025 63532 19815 92372 116851 89407 105398 70999 66396 99911 144717 122878 105140 102121
13013 102121 44951 43571 30327 1352 -1274 3752 22976 43618 20010 22959 49455 16545
13001 16545 -45281 -57138 -102040 -129553 -106722 -404 37586 62597 104639 128787 130254 85731
12989 85731 126902 134235 137471 125919 55853 48730 52392 96636 142396 147459 188931 176730 139690
12976 139690 67702 63615 74104 63474 71895 47706 25406 -11278 59584 122672 140771 65906
12964 65906 10112 -14339 35469 50009 103460 76210 130484 162504 160070 158512 46647 62628
12952 62628 62145 63168 63450 72237 96605 150388 161456 135980 104254 88700 36408 34318 41470
12939 41470 84507 160174 129308 72500 197941 265721 216726 91398 78680 87500 90076 39152
12927 39152 -9931 13104 122465 214218 208997 118810 89099 137760 188627 233921 224864 241786
12915 241786 265464 175382 154167 209060 233681 222622 267783 321224 361242 385202 346520
12904 346520 324255 363250 358329 344035 303213 300821 338236 301105 259750 250335 263997 267972
12892 267972 305026 313374 281678 253131 240919 231214 253819 270465 246124 218549 205876 195427
12880 195427 152935 201412 256742 238748 221019 213562 263913 226352 233014 236720 224662 212313
12868 212313 291750 317664 279332 331504 394167 397686 402448 446256 360898 344664 377973 368388
12856 368388 364026 397381 458263 501149 526436 536360 546437 612794 669386 751360 781550 801614
12844 801614 851889 844800 801187 782814 764980 760890 735277 715170 746076 769222 726097 697730
12832 697730 693872 731774 812482 899057 929750 967526 1049695 1121394 1170481 1255760 1310587 1363826
12820 1363826 1443574 1481808 1510671 1637722 1817264 1937704 2128588 2219566 2328544 2542894
12810 2542894 2722014 2972046 3335241 3721409 4240753 4915288 5717650 6666750 7729103
12801 7729103 8920230 10326112 11918923 13658355 15809843 18630881 22559762 28380974
12793 28380974 37711727 52315045 72677719 96150010 121282044 148527371 177583053
12786 177583053 203426315 220021049 227612102 227908543 220892971 203620945 177964139
12779 177964139 150279782 124015941 99314840 75789376 56252237 42154149 32667414
12772 32667414 26318048 21853007 18650506 16237461 14241081 12515740 10933472 9516791
12764 9516791 8318645 7307482 6374959 5583636 4972038 4454631 3986049 3583992 3317927
12755 3317927 3096315 2875285 2664453 2549121 2369771 2217958 2125847 2003508 1893523 1788900
12745 1788900 1665825 1625709 1657585 1631337 1519475 1419648 1339725 1303407 1301449 1294731 1200522
12734 1200522 1140620 1108265 1078669 1088645 1141623 1195262 1237347 1166138 1092677 1042140 999243
12723 999243 901042 862541 940111 1001104 1073149 1097246 1080189 1046630 1065745 1149694 1249882
12712 1249882 1312856 1319873 1358791 1414845 1482338 1524141 1585313 1642148 1710708 1650682 1536513
12701 1536513 1433594 1371461 1254270 1136737 1081580 948534 892310 901406 881288 844778 836011
12690 836011 803664 728643 622215 584971 626529 686421 619975 593479 603321 698663 654938
12679 654938 622489 579899 569170 552231 509277 474971 402476 370867 368538 374433 358169 355594
12667 355594 508212 593167 575574 545424 531858 569648 622112 610612 680420 794385 800062
12656 800062 803441 784274 780493 806113 884226 955824 1146740 1408932 1831254 2389865 2767237
12645 2767237 2671213 2245982 1838833 1514849 1349507 1266078 1181586 1144857 1270935 1399484
12635 1399484 1559685 1711673 1890952 2102307 2299351 2542451 2781832 3051983 3186811
12626 3186811 3324249 3334422 3215215 3063467 2909355 2662444 2367883 2105669 1896266 1774141
12616 1774141 1582716 1357770 1207475 1076593 888291 801838 759992 671366 659797 592686
12606 592686 514066 511682 537218 551005 560347 561847 537332 467032 436395 391657 370244 437722
12594 437722 445966 393041 377730 343563 343413 375606 301824 322313 341331 388826 439056 459983
12582 459983 475722 445503 424332 419344 455190 530099 477609 411965 379178 394240 274691
12571 274691 267563 286443 310466 344551 329832 226862 185059 160462 162745 187084 182569 221867
12559 221867 229583 233754 219007 319607 350299 318131 318655 385985 392156 410362 377256 339788
12547 339788 253288 252814 252764 280464 327892 332623 291397 229956 205484 228045 277690 320763 273524
12534 273524 220574 208314 181079 176276 221740 223093 307835 313211 287788 288337 294734 306864 294476
12521 294476 207247 172426 181635 255754 315661 312295 311374 322486 323593 453056 601857 691983
12509 691983 648743 530991 449451 329087 208176 184124 191456 188850 195279 222388 250078
12498 250078 254935 228995 171939 162039 158786 114499 101294 119528 71063 93881 187791 177427
12486 177427 142232 164783 175147 161386 165673 155056 144824 68417 51253 101211 114963 80517
12474 80517 63244 34100 58080 69348 80697 115989 123571 262285 466082 515480 410392
12463 410392 328674 247436 147201 145848 133009 83173 88077 144031 120216 78864 67404 87856
12451 87856 108853 155048 121765 37646 19090 28445 12173 9582 43232 67221 39767 682
12439 682 -8048 -12399 -56479 -87250 -10747 15012 97671 149632 209748 208259 167074 211454 284754
12426 284754 233841 205297 182298 135635 171995 246943 234474 190994 214452 233265 165090
12415 165090 95129 113397 115070 89674 154333 180284 111144 103543 129628 122825 117221 94554
12403 94554 109687 51541 19082 29700 81081 72240 91955 100240 87120 99581 82473 49006
12391 49006 52003 16582 26543 59524 54172 68040 40259 46940 46906 109691 87143 86117 107751
12378 107751 46069 8922 796 33656 77266 106944 68689 83101 122086 141102 84121 90195
12366 90195 121645 155337 165424 145110 203547 329330 519689 660451 715708 821841 962826
12355 962826 1096019 1188306 1253087 1222956 1189094 1114870 1014934 852390 693566 533489 405067
12344 405067 341708 300189 230289 245360 300447 282866 160868 161736 178293 120993 108339 42762
12332 42762 20919 28835 -11528 99858 45239 -18399 -1134 -5619 28965 41906 61181 31970
12320 31970 37226 84342 65774 61208 50368 -14051 -90632 -106231 -32852 5949 9326 -3152
12308 -3152 21516 102516 127190 160118 158649 78916 47457 21284 54300 83872 68973 34981
12296 34981 49215 44513 45097 49607 46854 53462 36072 6297 46374 93143 48416 41206 47420
12283 47420 64936 93749 120212 153410 112195 61886 45430 21847 626 43624 78253 83367
12271 83367 121271 113066 76418 104827 113068 74505 48418 28305 20847 10243 26644 43997
12259 43997 62436 39388 29148 -3337 -58475 -66307 -28354 -5777 -40959 -29371 -5308 2990
12247 2990 24565 22304 68219 112772 103815 13872 -15758 -3347 4775 -42623 -47439 -37201 -8097
12234 -8097 -14816 -16594 -25252 9312 58478 128634 119030 91680 11247 -56979 -71991 -47421 -53113
12221 -53113 -41188 -13096 -17626 -27237 -14276 5314 45341 54261 -6983 -57276 -63405 -16219
12209 -16219 42715 42077 48298 86614 84184 32085 33113 54386 -22153 -82066 -121315 -94115 -64055
12196 -64055 -80823 -55507 -37054 7148 68289 119908 53246 10412 -3404 -6187 30750 28943
12184 28943 27735 15570 24305 5760 7084 80237 84509 111096 149553 126194 115483 99165
12172 99165 -18580 17466 32584 25534 -43822 -82537 -113439 -54018 -27106 18903 -10533 -66077
12160 -66077 -41533 -57 33358 29641 16711 10850 68256 9638 20083 64611 44124 40329
12148 40329 3678 23993 31531 41950 37255 -20535 -46094 -2833 53117 105389 107462 87873
12136 87873 -1304 -37546 -123833 -99947 789 63650 82499 64920 66997 13229 -63802 -51685
12124 -51685 -61260 -28315 -20668 -99161 -127550 -95785 -66278 -49367 13935 82342 85011 39779
12112 39779 25340 48186 5598 -71356 -13210 -873 -43599 -53163 43533 95544 121118 1725
12100 1725 -71291 -37849 -3862 -16102 -17778 2323 -25089 -57773 -76381 -39283 -7393 -8715
12088 -8715 -17553 -77968 -117594 -73469 -35420 11302 47041 43992 38166 -29781 -69798 -54474
12076 -54474 13990 44826 63759 74309 94546 78994 85902 80264 75359 66900 6191 -31292
12064 -31292 5120 -40481 -34433 -24404 14081 22998 75290 101262 44256 50459 41623 42245 72872
12051 72872 80102 56717 86887 147975 186679 140617 119698 33516 14123 46517 74600 64136
12039 64136 24909 65414 73340 -2535 28257 196 -41732 -16420 10545 -52625 -52631 38354 128996
12026 128996 144660 86815 35532 20377 -214 22337 20183 -34403 -46161 -42845 -35762 -8532
12014 -8532 21043 72347 51208 52476 -5332 -37107 8581 30999 10702 -9071 -62850 -20917
12002 -20917 -29646 -20742 -17731 8501 -9647 -63839 -29063 -17758 -42070 -42089 -27061 -14270 -50765
11989 -50765 -31270 -51 -20415 -25857 -51727 -55820 -99197 -88149 -50325 10855 51060 58952
11977 58952 18874 25187 -12205 -64160 -92260 -104354 -91401 -12335 13363 -3601 20605 26929
11965 26929 32684 23820 -15670 20472 62827 67392 54607 42655 11513 19718 24882 -11553 -5667
11952 -5667 87050 150618 110032 73483 -2934 -54617 -51387 -69915 -80449 -58425 -27458 -59368
11940 -59368 -76049 -21896 1675 26635 35386 46508 61552 5838 -32481 -17968 -1656 10946
11928 10946 -57853 -68658 -34833 2253 13901 1913 37178 26525 13567 5201 8413 105473
11916 105473 166728 78509 -5725 20993 132314 123538 71953 29308 31754 20594 87640 88632
11904 88632 58936 68644 153373 143244 47744 -16207 -64802 -105106 -41344 31414 29534 23418
11892 23418 40809 14493 4691 5534 -56765 -106025 -103490 -38663 3453 -3343 18547 54197 25802
11879 25802 56876 60765 99182 88421 24032 5279 56850 63335 50879 -18166 1462 77489
11867 77489 31002 52657 45924 46311 19833 -37890 -43248 -9313 -35120 -98701 -59638 -42596
11855 -42596 -89611 -104856 -101037 -95558 -105797 -66020 -43363 -50746 -18129 57770 34554 59037
11843 59037 136010 127965 63700 40074 395 49357 57781 68668 26333 -34946 -20049 -21958
11831 -21958 -24494 30129 93320 81781 49328 37779 24682 14702 46192 33818 18141 52384
11819 52384 89368 57181 27699 39971 -903 -29364 -23003 -40844 -6340 -10683 9130 594
11807 594 2282 48039 -10003 -2632 -22567 -41740 -33458 -24358 -34379 -35308 30040 19116 -11398
11794 -11398 17310 19733 -31301 -27986 -27046 -48955 -18673 6170 -30285 -32196 8833 17208 -42148
11781 -42148 -69167 -9443 30472 3778 -7305 -27978 -60869 -104388 -101322 -116570 -136744 -110390
11769 -110390 -68423 -17212 -9002 -72213 -39863 -41678 404 16793 27731 -3565 37665 51316
11757 51316 73336 -5975 -23569 17510 33870 43961 2615 -41639 -3958 11951 -34961 -37930
11745 -37930 -56300 -80590 -112481 -114142 -105713 -79455 -122003 -154888 -74416 -33451 -97841 -140555
11733 -140555 -78847 -60740 -111780 -110349 -114312 -95530 -78351 -48099 -35295 -43083 -23906 -5451
11721 -5451 9521 -32112 -100331 -150900 -134637 -47583 -5287 -57548 -65916 -50977 -38878 -53910
11709 -53910 -24451 2329 -25904 -67695 -77551 -104563 -91012 -40935 76026 104121 79124 42516
11697 42516 -21084 -96076 -78578 2360 40682 55501 54953 44505 58070 72166 -35443 -82019
11685 -82019 -75882 -84208 -130891 -121578 -63511 -22571 4395 -32187 -46737 -33414 -44504 -42632
11673 -42632 -40497 -33302 -101251 -38378 -4205 4300 5183 59849 99503 78539 25451 -49271 -56657
11660 -56657 22796 106186 73893 13769 -9324 -14093 -6616 -33913 -77285 -25205 -37056 -20838
11648 -20838 7498 -12721 28210 -6856 900 49955 42853 -43249 -23745 -49114 -86073 -57769
11636 -57769 -73597 -80236 -52618 -33601 26920 55209 40736 50954 53728 7282 -52160 -6397
11624 -6397 25603 -10552 -9057 11643 -22563 -73358 -68417 -27156 -34848 -34538 -6867 -2999 -37714
11611 -37714 -27190 -24812 -11244 61012 21905 -32532 -57049 -35693 -35389 -67780 -64010 -105757
11599 -105757 -63604 28658 57061 47299 7881 -2180 31117 -6496 -12306 23365 50336 -7363
11587 -7363 12267 2701 -30028 -26567 -70110 -111574 -65743 -79349 -18768 -25188 -35032 -28948 -13410
11574 -13410 9557 11451 3010 25172 -34164 -122463 -133561 -60569 -7478 -37176 -113029 -151306
11562 -151306 -60175 -45329 -105386 -128037 -34294 -22859 -49549 11451 57964 28444 8450
11551 8450 1389 -33156 5206 -16907 -21920 2945 -10485 -47888 -48954 -52593 -83986 -74537 -74502
11538 -74502 -75241 -89874 -158704 -139373 -129498 -159736 -199545 -184848 -149349 -70506 -10632 -31330
11526 -31330 -87510 -29290 9035 -7532 48930 107736 79244 -35112 -6698 10765 -34197
11515 -34197 6184 82616 85561 46909 -31368 -35082 16137 40934 -5035 -52479 -99777 -77972
11503 -77972 -70578 -48930 -4397 1493 9365 45974 39480 27703 -26701 -61026 -143259 -142091 -14746
11490 -14746 -12133 -30766 40642 138439 115480 143159 127911 93126 74530 8345 12112 75929
11478 75929 75087 98331 58218 20066 48504 112596 91918 18201 -31179 -60863 -70270 -57570
11466 -57570 -53615 -48052 -10601 -25912 -24451 -36293 -86046 -68946 -17769 3422 -28492 -52482
11454 -52482 -43737 -43369 -984 -19875 -57931 -53186 -39524 -81910 -116597 -106287 -88178 -31448
11442 -31448 -26176 -18127 21192 39243 -887 -32152 -94487 -72687 -45236 14806 50989 29516
11430 29516 -40252 -109401 -81677 -23037 -4644 16495 34037 -10169 -12305 -55578 -29688 -19508
11418 -19508 -113 -31573 -9745 1320 -9332 22833 10999 -3508 -14774 -44566 -95150 -101224
11406 -101224 -58604 -21301 -22071 -88756 -132991 -185284 -138544 -75756 -17075 -29946 -60826 -99194
11394 -99194 -124330 -36767 -18686 -55347 -43940 -30441 -8711 -47169 -64759 -17186 9663 46495
11382 46495 17623 -458 -846 39574 34932 73765 72041 34957 57070 28072 9215 3589 11475
11369 11475 -38604 -17723 56806 70217 125819 121616 37258 50048 16755 -37474 -37101 20754
11357 20754 -821 9971 -4939 -30300 -31136 -25981 -26379 27702 46064 44343 14488 -33350 -8622
11344 -8622 40917 49522 30306 14986 9375 -56807 -67101 -48024 -42580 -28475 7122 15831 -1483
11331 -1483 -24590 -32596 -59659 -19758 1483 44276 23930 73458 101988 58090 45262 17641
11319 17641 -42937 -50301 -45950 -67629 -98371 -91293 -71353 -35395 -35639 6029 41425 52055 23315
11306 23315 -16947 16101 35966 26343 65174 83371 25739 -15738 -17460 9534 130512 136678
11294 136678 101585 156888 147278 171603 296802 484898 794877 1045883 1187998 1219762 1207897
11283 1207897 1039441 738687 464441 273769 181869 166544 107434 51308 -2299 -13099
11273 -13099 -8456 -11142 -38887 -29941 -9736 25590 73801 111526 88390 39547 18028 -11698
11261 -11698 -20205 -73055 -86115 -87595 -53413 -6837 28310 17020 48050 68103 -7810 -35178
11249 -35178 -28518 4549 75303 48376 21078 39038 51445 111979 242544 244101 130465 47466
11237 47466 49759 33113 -36473 -64625 -62352 12992 33553 49770 733 -53686 -102031 -87157
11225 -87157 -60181 -59242 -43860 -48335 -106883 -107448 -67526 -60848 -51742 -58469 -58463 -38738 -13354 -23351
11211 -23351 10591 25714 -12035 -8427 -43564 -44350 9908 -250 -64094 -68557 -5377 -33428
11199 -33428 -107900 -119619 -92929 -57181 -4210 -47218 -4801 -11781 -46580 -112780 -67132 3277
11187 3277 43997 75321 58917 -2784 6675 -15228 -52003 -77511 16362 121100 188026 265695
11175 265695 357666 509492 716110 875888 895446 929033 965729 863005 631492 428635
11165 428635 297301 186275 91424 18255 -21423 -54159 -57741 -81716 -55864 -37010 -80553
11154 -80553 -110179 -138067 -120800 -136863 -146679 -111702 -71818 44282 67246 42197 18349 -47354
11142 -47354 -120936 -142113 -125321 -89637 -126593 -141591 -143992 -152829 -104849 -427 15245 12628
11130 12628 21095 -39937 -43439 5684 -3375 -14882 6866 22166 55482 34930 -34611 -68161
11118 -68161 -66401 -44389 -17127 -18236 -23224 -21738 -35047 -39864 -39747 -20700 -20470 -4641 29695
11105 29695 14201 -26329 -3171 6147 43714 88280 53958 36 -23004 -24882 -72409 -93196
11093 -93196 -76229 -71162 -75771 -106034 -78259 -58974 -78760 -65152 -80794 -81473 -85938 -78723 -58219
11080 -58219 -35790 -27049 -51367 -85403 -81576 -42406 -58217 -49618 -33769 -8640 -53019 -68209
11068 -68209 -115676 -63949 -36784 -25947 2638 17765 -12344 -19348 -32470 -64079 -109986 -119575
11056 -119575 -98963 -48890 -13025 -48984 -3991 37436 25069 -25722 -24068 -8423 13438 58675
11044 58675 111510 133245 144392 63983 -60920 -94218 -27544 14667 -6916 -25355 1059
11033 1059 -52248 -119999 -82057 -66776 -99144 -43170 31002 12021 -35124 -82716 -77725 -118807
11021 -118807 -111274 -49979 41096 9992 -8519 -30002 -78123 -103906 -113727 -143964 -149509 -176293
11009 -176293 -138125 -137034 -149651 -124190 -122112 -100951 -93227 -88991 -90923 -56810 21734 10298
10997 10298 -13852 -57546 -33414 5169 58583 79576 81003 74430 32448 2384 -20727 -59495
10985 -59495 -43855 -10870 31959 30427 3768 5197 -46864 -119260 -101016 -49748 -65581 -108146
10973 -108146 -62762 -23894 -86907 -73180 14348 29287 43675 33023 -59298 -69380 -54325
10962 -54325 -6140 -1167 -59025 -59816 4662 964 -476 -22351 -88651 -77627 -51037 -32424 -9982
10949 -9982 28819 1668 -27400 7697 -46446 -22467 29774 17157 -13446 -29509 27115 62508
10937 62508 -15803 -63247 -58936 -19049 -15699 15256 45053 50851 -40540 -128633 -146099 -89917
10925 -89917 -66555 -86711 -98591 -50225 -30534 -72684 -55522 10689 40484 27745 48863 22679
10913 22679 -54455 -62413 -50900 -88593 -85430 -21195 3996 9901 1633 35063 55643 -17022
10901 -17022 -951 -41966 -27892 32562 13911 -58038 -29561 19191 10627 -43815 -9080 -38787
10889 -38787 -78526 -48321 -6537 34521 32136 984 -35494 -35008 -56123 -43030 6040 34111
10877 34111 21769 38631 41298 82750 132252 200958 289085 398753 636211 1040209 1341919
10866 1341919 1441621 1536606 1845773 2150734 2059510 1774491 1574639 1496649 1287037 903332
10856 903332 626099 399576 331490 172690 100932 95895 104817 97655 59240 24108 -6439
10845 -6439 29014 74661 60325 6391 -18168 32988 11576 5983 6349 63597 76478 -11719
10833 -11719 -37213 -55724 -29203 -49328 -95659 -78094 -82915 -70734 -67325 -63613 -44643 -109007
10821 -109007 -185156 -156864 -109438 -66536 -76708 -72582 -49639 -13238 44021 40106 685 -53755
10809 -53755 -114429 -103329 -68579 -72924 -73988 -24291 -46555 -64999 -66721 -86483 -72698 -35019
10797 -35019 -64946 -90608 -27731 -30193 -80344 -81517 -88479 -61056 -13763 24265 80604 15422
10785 15422 -102155 -159687 -132966 -82259 -46007 -60873 -77177 -56165 -37455 -99957 -67855
10774 -67855 -62413 -53430 -92743 -106863 -86545 -74455 -65775 -57039 -57733 -61895 -35173 -1718 34053
10761 34053 32767 -31486 -92334 -64343 -90210 -103807 -103184 -63334 -43718 -13036 -38403 -89697
10749 -89697 -29601 -9519 -19397 -27038 28010 40534 16485 -7886 39350 33506 4938 5343 21715
10736 21715 26558 17087 13362 11939 -13065 -42929 17706 41084 56444 27589 -41025 -25815
10724 -25815 -17196 -66113 -125138 -94744 5569 56892 26819 25404 25574 -12952 -6343 64415
10712 64415 114749 118207 85475 104446 134679 139249 168455 175511 165518 211880 191657 158518
10700 158518 99680 32788 60566 76430 35938 20854 43351 49389 7386 -16898 -12888 23807
10688 23807 23573 -516 2032 -4202 -19838 -37138 17360 54210 88944 32439 5600 11662 -7191
10675 -7191 -20765 20094 42932 48445 -22349 -86318 -111143 -26367 25547 66896 32293 18568
10663 18568 55981 53798 49531 86290 135731 95186 60516 45128 18491 36305 19254 56963
10651 56963 55683 -47932 -46222 20437 18637 40089 23086 22257 25376 78039 81002 4143 -34297
10638 -34297 -47551 -57994 -52598 -60660 -53022 -85571 -69176 -14670 48531 59365 -2038 12291
10626 12291 50595 77978 45983 11012 -74047 -120797 -180337 -166959 -122624 -96126 -88875 -72274
10614 -72274 11207 83094 58669 -26618 -82019 -9390 -11754 -16905 -52046 -111940 -134568 -153883
10602 -153883 -169898 -141081 -108411 -55227 -42763 -92394 -66097 -18644 74093 130931 83361
10591 83361 89172 127455 161314 219274 206524 261476 406326 553373 652614 717359 801675
10580 801675 856588 793065 669123 613198 510949 424414 335846 271189 209487 165392 168073
10569 168073 223949 251970 230159 171746 132447 127820 138305 228264 277494 225385 163468 150299
10557 150299 207318 211378 166241 102667 93296 57422 106512 155112 155798 128595 68251 47742
10545 47742 114691 114614 71428 95423 128598 170756 193286 237828 193716 189557 217890 235714
10533 235714 256948 311228 329324 354241 385703 360721 342467 353064 310574 277577 259931
10522 259931 272217 300256 255664 245624 306943 367981 384427 433945 477811 551391 691861
10511 691861 776261 789408 790667 829093 888514 915239 922273 954831 1036814 1109625 1178385 1289865
10499 1289865 1388706 1453026 1559218 1651226 1776411 1914142 2022156 2124660 2302532 2456483
10489 2456483 2653661 2877998 3354178 4024194 4692869 5285127 5864305 6719127 7771499
10480 7771499 8662219 9395043 10338668 11594764 13156105 14952744 17171519 19936240 23673295
10471 23673295 29220415 37631426 50930916 72616718 109175481 166555071 228476549
10464 228476549 258782525 277452475 325496212 390747670 404883249 357217852 309016737
10457 309016737 290031112 268308442 214942497 155745805 110739674 80879522 62323297
10450 62323297 50491863 42180378 36125593 31881915 28703426 25818504 23165775 20793953
10442 20793953 18576404 16729383 15288433 13941680 12410472 11048043 10057383 9288730
10434 9288730 8530196 7790441 7192769 6845121 6531430 6274184 6115949 5977235 5869938
10425 5869938 5730854 5513472 5305465 5136299 4953059 4666726 4331725 4078574 3912065
10416 3912065 3715732 3575182 3423065 3280428 3186566 3139966 3042268 3039142 3089044 3005360 2931482
10405 2931482 2996705 2996906 2905565 2802200 2694825 2605213 2546201 2419347 2307337 2186073 2140665
10394 2140665 2096220 1987133 1984692 2043175 2130198 2213792 2255241 2232582 2215656 2256983 2277620
10383 2277620 2278255 2191733 2130462 2093926 2059529 1960165 1813488 1689025 1609143 1533640 1544052
10372 1544052 1530999 1542588 1508634 1422175 1383428 1401982 1419615 1367838 1309935 1270807 1208636
10361 1208636 1199313 1225158 1211644 1224156 1199867 1240595 1239901 1142095 1075255 1060686 1054039 1031022
10349 1031022 988452 905978 871176 894751 879574 854339 842237 801416 785807 833930 895878
10338 895878 961663 1063666 1086105 1121101 1173303 1231775 1272798 1272073 1209255 1179167 1192607 1099903
10326 1099903 999520 958761 947956 915374 885040 902867 896523 934994 963844 942385 907437
10315 907437 938968 1017836 1021179 978402 954776 904565 847749 829204 847070 877314 903255 894865
10303 894865 807796 750108 809088 857473 895505 866928 813312 798781 824138 880148 889783 852119
10291 852119 849163 814732 769701 790912 828319 818778 756844 714670 698570 655426 598071 544307
10279 544307 494562 549045 558998 581784 630673 624911 705499 743025 774621 785184 761070 781559
10267 781559 857187 935037 924180 878796 827735 718872 573863 498190 455209 537449 496325
10256 496325 464069 492356 498972 463213 502973 494141 413267 420945 408371 461389 417268 417107
10244 417107 491278 526598 507001 450363 425457 480781 498364 503777 485273 438658 414841 368518
10232 368518 389661 396254 376358 323539 339895 367843 444013 435687 406170 412435 396950 366535
10220 366535 373408 385275 384303 407520 416014 389772 409453 410665 375024 368813 438148 457166 481112
10207 481112 490892 370557 345322 343367 338634 358275 337727 353709 394994 276350 229469 297442
10195 297442 301903 310700 289990 261334 261281 277288 279386 250094 288505 289117 281719 337093 337755 356632
10181 356632 343741 343469 360672 295482 251390 220400 190374 217811 208603 242096 225969 234496
10169 234496 290138 339590 337596 314950 305999 319319 335857 372445 311303 267626 293681 277294
10157 277294 266635 316141 303097 276912 297133 303101 322186 315043 304768 262730 241552 206550
10145 206550 219126 210745 197914 176390 186914 192146 248760 247358 233084 209006 206221 216048
10133 216048 269181 302938 302496 293462 290506 326335 325222 328439 305201 297990 254446 260755 283848
10120 283848 255922 292774 340083 261967 238511 235424 235368 210426 223838 248522 275010 324707
10108 324707 354864 365819 328665 268838 294483 298608 273813 229336 272122 246389 222599 198426
10096 198426 228621 284611 297759 263232 250242 251576 296572 399364 392654 384093 382546 343433
10084 343433 366904 320456 292397 302204 255226 307478 317318 209386 225034 278259 303600 358478
10072 358478 330765 312171 301608 363843 400663 418896 435448 453679 432470 463474 485175
10061 485175 540307 653297 845676 1240300 1536761 1631639 1763587 2091062 2417107 2411138
10051 2411138 2144309 1922830 1910120 1800146 1570066 1386056 1433066 1739624 1930072 1680134
10041 1680134 1316148 1016356 783993 680717 620774 543177 496256 461912 406817 346507
10031 346507 300933 285369 210874 208283 287139 355798 355691 302025 285975 300489 277462 277811
10019 277811 241746 252869 279466 264834 221313 203834 188742 207554 234824 299518 305954 285226
10007 285226 232303 228844 196656 174708 241957 273729 193436 203212 240838 239416 250637 219312
9995 219312 231118 287325 248508 230047 251579 245182 269523 237088 209087 260609 245898 270057
9983 270057 254178 192896 182254 193719 316651 315538 341543 336766 296757 304058 314887 284672
9971 284672 247507 272992 288763 302262 299013 262673 210498 206738 262567 296546 303740 289821
9959 289821 255199 230098 193229 243230 348841 440995 575246 673627 767909 716485 593675
9948 593675 559755 565349 614491 715781 768932 665550 526708 428856 323147 319310 325088
9937 325088 261992 247644 240600 273760 251686 231117 220100 192885 141274 123129 155979 231584
9925 231584 215853 170079 188774 219810 239260 204164 187294 220256 228588 193762 187258 182169
9913 182169 167890 131102 144155 193481 237378 252821 187078 134387 158679 163545 168294 170856
9901 170856 186812 222122 234170 237215 216967 190352 197280 232090 211886 209998 178995 222254
9889 222254 320242 309463 238465 231185 225977 206895 207698 260767 214650 207542 254978 232040 263661
9876 263661 296485 263773 211189 189018 161115 224185 264735 252306 238614 256775 201025 202728
9864 202728 236513 247221 307774 257902 287395 284751 231010 233128 242693 231482 161674 162189 210854
9851 210854 294697 300580 235048 220621 219827 240843 243204 233817 191186 136092 157292 200844 211440
9838 211440 217186 194004 178648 218313 270441 255852 275659 349232 395266 372222 350350 295929
9826 295929 279271 182131 168111 169235 170571 186350 145079 168571 205318 190753 155189 157433
9814 157433 184166 182439 197605 213681 239960 181659 195612 256387 301987 323867 334255 345648
9802 345648 277318 268725 296448 280554 243252 199503 207345 187188 196903 179309 215620 233596
9790 233596 258383 319568 263851 260527 233770 239153 253634 311717 341427 436281 488263 449695
9778 449695 456465 415095 416077 413755 363128 365889 385261 404261 426116 382958 325655 256944 251376
9765 251376 190339 212649 215230 218364 254237 243776 226868 231460 246702 262815 248953 274999
9753 274999 294427 279690 237703 224738 235655 255940 272557 237553 252126 262398 282642 302435
9741 302435 283805 300806 330913 293655 273992 232646 224062 215135 218872 242027 275842 313270
9729 313270 341955 351941 389997 358464 268557 214554 265731 305306 302441 329895 388902 467983
9717 467983 429677 424544 508664 691109 961133 1241411 1577816 1733825 1474814 1232616
9707 1232616 1207181 1249893 1174130 966233 799055 664912 582901 479446 393225 331429 377150
9696 377150 411686 421162 366665 371508 410298 359028 315030 308438 303160 380260 417931 436885
9684 436885 430389 450176 431800 406178 422302 431422 426500 452948 435303 447330 476467 478584
9672 478584 491348 473132 520328 591422 693349 839494 1072625 1543918 2214693 2782818
9662 2782818 2670455 2069128 1520740 1127715 944615 851578 800261 820656 948944 1275221
9652 1275221 1716532 2111405 2320906 2381555 2279883 2027265 1708198 1366681 1092096 863125
9642 863125 739794 680504 624734 650747 676508 638339 607186 571718 543781 491550 517424
9631 517424 466000 515496 542989 491205 494067 527005 523026 493512 496456 502967 479749 433548
9619 433548 456520 482692 486997 532352 470317 380253 373968 394363 395314 310030 331251 384729
9607 384729 448822 481418 481349 442754 430994 422541 446633 477873 504628 510713 530770 482503 521528
9594 521528 558712 529168 479502 469619 503869 487051 466359 493484 542421 531457 511723 527550
9582 527550 558400 536599 568116 599985 617618 615879 574178 520306 489339 543834 544962 546591
9570 546591 551489 562145 579178 560733 513712 508472 500925 553471 606773 625845 638506 650290
9558 650290 623927 590364 528569 517087 531460 587907 598096 587517 660248 658546 678517 696299
9546 696299 659829 617210 602792 654768 696608 680178 692243 664171 663498 672078 700070 695087
9534 695087 692662 691641 679762 682542 670500 666170 667586 676270 683776 692607 701551 682655 682621 723243
9520 723243 773851 765870 740120 727413 693838 696037 724204 789495 845510 835545 782343 725711
9508 725711 739348 816096 874360 875203 856217 835330 768470 690349 718779 779217 809737 780107
9496 780107 778597 870204 924636 953587 904944 864760 839690 905755 967450 958696 922901 905223
9484 905223 907222 925681 886771 877417 848135 837022 869154 885040 904366 971674 1013557 1078834
9472 1078834 1117541 1072181 1000525 970019 980832 1008993 1016143 991712 995168 959160 924377 974752
9460 974752 996079 989706 975350 1003822 1071358 1139899 1171987 1151191 1066690 1072513 1112650 1148995
9448 1148995 1202466 1225766 1211676 1185956 1194922 1220287 1222675 1190239 1195129 1239782 1320056 1338780
9436 1338780 1304685 1345576 1341414 1374786 1362027 1273042 1301334 1316911 1298621 1298957 1301438 1299141
9424 1299141 1310449 1404798 1363204 1363852 1384464 1415924 1477453 1570782 1579596 1616051 1606915 1660075
9412 1660075 1767402 1830246 1903905 2102874 2450811 2879888 3332668 3707981 3786403 3583794
9402 3583794 3266134 2940980 2631172 2398860 2230901 2142955 2131231 2109017 2143463 2203417
9392 2203417 2224824 2190084 2129954 2088177 2062869 2071245 2105698 2143579 2228969 2235120 2136443 2150804
9380 2150804 2230765 2287609 2330810 2363917 2403679 2419255 2452140 2449811 2475257 2476099 2509089 2580372
9368 2580372 2642394 2610012 2611092 2650513 2672966 2652049 2672662 2745399 2740771 2762891 2785117 2786822
9356 2786822 2764108 2785005 2892115 2989455 3072521 3048995 3042359 3088811 3127461 3119004 3191174 3264449
9344 3264449 3300222 3344842 3371106 3414385 3504609 3621246 3689257 3673174 3701596 3745860 3807551
9333 3807551 3824830 3880164 3982909 4052969 4065446 4103875 4211560 4308147 4317405 4384904 4485913
9322 4485913 4599062 4684282 4716948 4809488 4942838 5043519 5117177 5189768 5261113 5316915 5341842
9311 5341842 5399662 5505994 5597590 5734862 5845651 5935800 6031874 6157141 6264283 6319646
9301 6319646 6434709 6615614 6714453 6811006 6897944 7026520 7158863 7309965 7414295 7592956
9291 7592956 7780365 7895362 7997694 8172361 8405878 8573380 8733788 8877573 9026198 9156313
9281 9156313 9366833 9575210 9732983 9966090 10150654 10386589 10607950 10716097 10960771 11199241
9271 11199241 11483828 11777500 12060671 12320894 12494868 12666406 12955265 13259068 13558431
9262 13558431 13848719 14191672 14544465 14852492 15126549 15463354 15821761 16096960 16414953
9253 16414953 16830459 17193209 17559704 17901884 18212695 18593837 19000120 19423104 19763380
9244 19763380 20121258 20519325 20935022 21330890 21711318 22089449 22526148 22934280 23328161
9235 23328161 23758280 24128525 24486470 24911007 25312639 25721821 26085638 26410977 26705916
9226 26705916 27050214 27344104 27630334 27883995 28103906 28389411 28612568 28773990 28962054
9217 28962054 29094902 29180424 29294617 29305742 29353103 29396273 29415268 29410862 29347120 29170681 29049133
9206 29049133 28871646 28684938 28490898 28311751 28133870 27911047 27620219 27333962 27041396
9197 27041396 26744077 26417757 26082691 25733460 25432015 25091607 24662364 24320163 23974207
9188 23974207 23607015 23195635 22725759 22336602 21946260 21536072 21142004 20686885 20219536
9179 20219536 19872183 19593133 19217005 18830077 18482775 18138377 17794724 17419298 17073487
9170 17073487 16772774 16425138 16038779 15726187 15422987 15086730 14794630 14490919 14194993
9161 14194993 13944349 13687340 13382550 13086483 12770024 12476563 12268656 12057328 11801193
9152 11801193 11534603 11358296 11125433 10892805 10746302 10530810 10299165 10102221 9940987
9143 9940987 9716844 9497533 9286744 9061800 8915531 8819172 8664527 8439470 8275626 8167039
9133 8167039 8030917 7796518 7668556 7592529 7528608 7391250 7237057 7124319 7022786 6888822
9123 6888822 6724216 6544461 6406188 6325040 6247032 6157991 6032955 5940616 5894589 5832751 5761384
9112 5761384 5656067 5543542 5420945 5377349 5329471 5232473 5151888 5119712 5109580 5086822 4974425
9101 4974425 4850542 4685286 4578059 4538264 4473001 4470366 4397803 4300747 4301762 4267538 4189013
9090 4189013 4125134 4032434 4015050 3993290 3909298 3906514 3877848 3808934 3769368 3732061 3693773 3641430
9078 3641430 3589085 3522001 3430864 3391206 3280498 3266725 3285314 3254427 3210021 3127804 3008969
9067 3008969 2952428 2969585 3004259 2945152 2886039 2895424 2857453 2832849 2797106 2754085 2740724 2744619
9055 2744619 2605063 2591738 2615362 2630548 2661650 2662195 2548638 2427657 2377469 2359518 2343559
9044 2343559 2330857 2327916 2270183 2228792 2215604 2208942 2222951 2229039 2220502 2227864 2239177 2181288
9032 2181288 2182709 2191420 2101336 2048812 2041875 2042904 2004286 1974893 1984685 1984388 1991155 1965802 1887753
9019 1887753 1835928 1849158 1905944 1907003 1926113 1926456 1873817 1811471 1824935 1783860 1729730 1704038
9007 1704038 1686003 1691771 1670520 1579117 1516643 1515404 1549487 1621079 1650817 1635205 1661271 1627056
8995 1627056 1583554 1568205 1524463 1498681 1479586 1496277 1475772 1440365 1408147 1372087 1372256 1433134
8983 1433134 1424329 1419455 1430080 1355029 1314466 1314420 1305802 1291182 1305100 1329201 1351749 1299069 1259482
8970 1259482 1216631 1183393 1189096 1231179 1252144 1232721 1256460 1254409 1250732 1242715 1184635 1170092
8958 1170092 1207885 1191617 1208201 1250028 1282014 1319472 1291890 1182484 1137129 1119218 1158272
8947 1158272 1150322 1174233 1088216 1000583 1001362 1023185 1019545 977065 995869 1021574 1018540 1074015
8935 1074015 1132236 1155794 1110707 1054096 1045657 1032796 1009624 961838 957879 912199 877600 893388
8923 893388 876128 901902 882718 867305 819397 819578 846579 893389 968779 945382 917815 830674
8911 830674 841716 842354 813046 826422 813692 844500 825226 757333 712652 748817 764760 769910
8899 769910 821119 785658 713232 727177 702630 709135 750158 750491 705691 760494 750577 749472 785949
8886 785949 747601 734426 738452 754638 765864 783788 780373 779928 818593 788257 759382 802176
8874 802176 824159 808451 802765 782192 742834 698188 698944 688614 643889 618179 595793 673921
8862 673921 697844 716952 748728 715271 667774 625124 585026 554019 547935 507834 514293 523566
8850 523566 511568 507990 561807 648746 658966 677640 662691 590798 534575 495896 438327 469306
8838 469306 506751 579592 592616 603504 647218 669939 672367 661680 688446 636035 623048 627339
8826 627339 611753 630761 636267 612469 576003 587883 601489 552653 571765 587658 642928 601435
8814 601435 569594 560532 553120 526368 493599 478275 537421 543289 544114 605866 605331 566050 562600
8801 562600 593992 585497 580346 577895 570813 528297 472214 409206 396004 468524 519238 514288 442921
8788 442921 431303 434589 457045 460806 469040 502491 523944 554817 502639 478336 510115 566086
8776 566086 559524 551830 521823 492470 481978 448093 430717 481691 482867 517643 535210 499920
8764 499920 483100 492440 487978 475208 518644 463867 427440 465210 457612 417923 418384 446416 486909
8751 486909 493701 536505 492311 492794 526939 518712 475433 498443 466463 440138 466447 536741
8739 536741 580986 616521 560092 525863 549527 572722 549653 519966 497220 495819 488963 468352
8727 468352 471126 479284 465842 493450 517589 501551 470205 441078 433886 439440 507202 534940
8715 534940 533509 555526 612853 634858 554371 476904 501988 477944 469829 444113 421469 488214
8703 488214 514819 528614 575327 518461 497442 504358 541757 564289 608793 596657 524694 442649
8691 442649 432140 480509 513930 529142 548090 559842 564932 498736 488037 493246 495225 461660
8679 461660 461786 490439 433285 453210 462419 488813 464880 440479 459327 435429 407926 363026
8667 363026 357504 431160 422689 368842 407948 444947 462795 514382 510444 468839 461033 470809 517472
8654 517472 484927 490502 473943 466808 470561 464215 480650 445629 389799 450005 508707 551103
8642 551103 566743 578865 609894 624050 664965 667078 673511 709712 625508 578023 558400 504968
8630 504968 513378 526347 563349 548434 537865 583260 586357 573533 559328 542794 480560 470064
8618 470064 524848 577066 653421 708113 717398 807206 914241 1002307 926578 834743 809807 790357
8606 790357 791814 754052 751565 798362 875486 873668 883392 890708 957111 1027550 1094898 1178854 1254448
8593 1254448 1283866 1276221 1375877 1531692 1581287 1609712 1525789 1371852 1209211 1123592 1020842
8582 1020842 934535 912692 850283 743022 725551 653046 598641 572212 543101 606440 666851
8571 666851 666230 735246 858081 1044388 1291943 1319997 1089993 874009 724883 675456 573612
8560 573612 527396 530219 503042 508998 476226 454833 432185 386971 413966 434368 420008 436206
8548 436206 419898 452365 454942 480947 543351 538257 537012 506852 487143 461602 393028 351427
8536 351427 362207 336983 389182 430977 443749 417304 427774 482770 497694 441749 437259 602458
8524 602458 711781 750893 844224 776295 601439 543610 549091 519999 467590 415822 385122
8513 385122 363899 318865 302848 328171 370598 374455 326917 368838 437765 458139 433890 380521
8501 380521 311926 306312 380641 419141 386344 316511 282130 345833 368008 325157 287733 266004
8489 266004 251239 313339 335878 319811 339214 339397 322817 304450 344956 374407 332662 306072
8477 306072 326220 300705 273047 300135 253699 230001 212415 218547 262844 278333 272990 292805
8465 292805 268957 265645 269305 214291 241085 203655 175210 179509 232829 278135 295868 318851
8453 318851 330797 292271 209898 256461 308902 336342 313487 241261 282762 292294 309752 292113
8441 292113 263864 281548 280577 276590 242092 240907 266905 283010 276683 234474 275722 314307 322138
8428 322138 300254 289320 242091 208710 154741 154105 231607 280305 288518 267824 293570 261352
8416 261352 229974 281319 312797 301651 249621 205325 182388 212445 291757 314183 293027 237812
8404 237812 233384 208573 211348 247249 325703 255746 186013 209698 191136 141322 176678 191324
8392 191324 154342 177212 184147 208042 199186 218985 215839 176710 228730 279822 252814 208142
8380 208142 195248 236079 252455 223135 170155 186967 103632 82399 35786 52097 103658 88444
8368 88444 124690 208589 206447 177970 222982 236354 244425 183040 157891 135476 155212 178972
8356 178972 159710 126221 81028 106780 167186 200377 221635 176411 122326 139830 114557 154455
8344 154455 173145 177961 170463 147318 185124 232240 241076 178423 139484 116191 66922 59619
8332 59619 71091 142239 176110 159741 105246 127261 211151 231756 241457 197397 144484 117989
8320 117989 152173 168966 156415 158084 181468 173243 176870 92884 74159 89894 121017 123619
8308 123619 194532 173348 132632 122929 140771 181873 181890 97653 101968 92547 81659 80267 137681
8295 137681 125672 143359 177313 160437 115963 83497 87777 143461 154016 141798 173377 177626
8283 177626 155627 145913 124388 162575 174300 150200 145982 171955 174294 87100 87330 114791 147122
8270 147122 178817 153418 144122 130169 68365 68323 83514 141884 142323 104717 141013 159794 157729
8257 157729 159820 164588 181177 145068 160357 140681 196711 215337 177709 154729 143221 120389
8245 120389 60914 66004 64767 45420 66474 117666 179826 154468 181475 202998 179652 145356
8233 145356 107912 75186 85305 115713 149916 204156 235024 176300 49377 33904 119189
8222 119189 134397 137273 212012 205529 166473 104083 117675 122714 147578 180916 157267 156866 208811
8209 208811 223225 172729 192952 172608 144043 139918 150641 163056 146937 139868 98196 101584
8197 101584 161417 126716 59730 15149 9049 9017 -2374 -23614 -3982 85262 132855 121607
8185 121607 189572 233372 204913 226990 214701 146787 89696 86569 125667 122392 146359 162310
8173 162310 122049 119396 180383 190406 139378 83833 46394 41131 91153 178971 206491 211060
8161 211060 142708 116962 114743 123888 122532 185688 181692 160885 143971 109680 91247 69261
8149 69261 131231 145893 123877 107706 121561 128944 186584 228694 245804 291691 319162 259446
8137 259446 218853 176580 133219 124597 120669 90779 73069 50060 27228 -1773 62504 136569
8125 136569 100933 67996 116937 119453 94561 111666 116682 150627 143498 129585 118473 105520
8113 105520 98729 114697 118639 174196 216449 243730 245213 236063 209893 195752 186212 122353 178273
8100 178273 227135 170264 142511 194226 194084 212112 198399 209889 178020 139444 85238 64501
8088 64501 95301 112454 137786 165528 163077 204719 195234 150393 153382 162230 88953 92510 223005
8075 223005 233296 218666 243392 239010 214243 207961 212103 230582 251905 238534 204597 228910
8063 228910 275459 297134 276881 406109 469219 428720 462348 493678 477159 424801 418174 434218
8051 434218 387018 289418 214930 237290 213259 198552 230699 272081 235160 254053 329097 278887
8039 278887 262086 214690 164151 154518 181265 211936 249449 242246 193944 169909 208822 235252
8027 235252 247499 212639 211992 217003 245461 264494 323111 373463 421582 432454 436723 421010
8015 421010 450818 472329 496839 602375 698337 694655 638855 567643 531524 453723 407346 364415
8003 364415 341025 328383 361743 402161 420062 409372 347202 363108 411947 422020 411322 403216
7991 403216 353842 346459 341271 351068 345893 336664 316132 267867 230570 173844 182091 264067 328090
7978 328090 316313 288694 247288 225801 206275 247675 294883 325295 334142 324434 313568 310530
7966 310530 352943 372695 369129 389730 362819 395856 431144 404581 339279 346912 365958 367150
7954 367150 378054 357039 359087 360494 426337 436228 458660 403017 358436 393709 431788 418433
7942 418433 358278 346586 328977 349902 347541 292794 236951 204341 232894 275114 258318 250397
7930 250397 257172 275855 265802 269281 296258 299153 296654 349038 351483 349133 384560 398139 424586
7917 424586 400633 366213 293094 186843 188330 203091 189103 243728 276745 318454 272695 309207
7905 309207 267572 219227 172242 197475 280302 292360 284953 295540 289145 269689 246413 218894
7893 218894 150474 118625 122556 138858 169187 193775 197773 191712 239565 265889 231104 229284
7881 229284 246247 249187 201915 206110 226141 212483 233556 187456 124084 107299 99424 152680
7869 152680 209002 189852 199296 189939 214954 186400 210594 222318 156821 178406 233085 229891
7857 229891 221377 207354 154778 141728 134035 87026 74562 62676 74093 105774 73510 78684
7845 78684 81501 91839 110278 95742 118039 129668 62036 17738 7263 39824 95791 109058
7833 109058 82711 25780 36178 54248 79351 86101 94624 85559 74404 137502 213627 200009
7821 200009 191843 181869 155489 140103 66742 2781 -45457 4655 -27775 20787 124712 107951
7809 107951 80598 2543 -114 62988 74640 88122 100159 40848 79027 119197 95989 98399
7797 98399 50024 38213 64049 81194 137747 149288 105317 128627 116864 109860 99743 105786
7785 105786 140855 206238 203608 154526 42419 17074 -3037 -44688 14143 46313 97687 170875
7773 170875 164779 103819 72690 32640 32764 104880 100757 118175 93649 43224 53597 83429
7761 83429 117491 113397 78618 76265 60312 27516 37733 57496 89486 66314 12765 -22731
7749 -22731 -7312 13272 -21266 -41885 -7907 8663 64141 92894 84673 70128 28421 -37135
7737 -37135 -4272 63956 28652 60270 87075 105295 67111 63517 63360 51433 89470 82907 67673
7724 67673 127453 140239 174822 198536 101106 62630 99017 125056 115919 157585 148712 128726
7712 128726 86488 42969 -36545 -45804 20214 15096 767 14265 49745 66134 82020 107607
7700 107607 161334 119006 137685 127326 100514 88982 106355 68537 10876 -57153 -23614 22460
7688 22460 49155 49788 -30617 -79373 -37125 -11382 -6134 26024 18360 35200 60554 54309 47659
7675 47659 23421 11309 16436 -10539 24773 41782 20728 57274 63461 3457 -44546 -26923
7663 -26923 -18030 -2621 22017 -1492 -94754 -136832 -38028 46051 32230 -26641 -77691 -79312
7651 -79312 -59142 -38620 -20282 -4840 505 -1879 3095 1958 17001 17804 5191 934 -21842
7638 -21842 5001 39981 98153 78826 -12053 -33981 -6777 18848 25502 -12989 -6217 9639
7626 9639 -2231 25134 70702 47465 16864 3503 32471 -8885 -8961 46633 67956 110311 163000
7613 163000 108237 86595 87574 20209 16785 27930 72447 138152 177531 100785 19579 54667
7601 54667 65742 43761 35562 81404 15895 806 -24268 -72033 -126036 -132471 -146956 -139679
7589 -139679 -54416 -5475 13948 -18506 48895 66209 14186 3957 73960 102194 105667 110228
7577 110228 54721 35701 68461 82547 73301 69254 102688 99130 74831 32113 45690 98624
7565 98624 131666 104279 67827 8416 -82836 -77850 -50872 -34418 19713 40988 -6138 -23975
7553 -23975 2705 19046 6218 -3860 1713 -30322 -28296 -69172 -111178 -51531 8156 65079
7541 65079 28654 -8245 -16097 -80374 -66325 55 41633 28445 -14967 -63683 -30818 -10076
7529 -10076 -19690 -81623 -114382 -34072 -33928 -47966 -17851 -54685 -22494 2654 19399 -31312
7517 -31312 -12906 19499 43963 71000 77344 47121 46111 58730 59489 62926 82304 80595 101176
7504 101176 70675 36203 73941 48627 -17638 47175 118994 74584 59706 14110 -7582 -74546
7492 -74546 -140451 -91816 12002 13292 44615 66425 60732 83008 77622 75570 80111 63754 23923
7479 23923 -38382 -59502 12337 23415 46028 92351 73465 34444 -6964 -58856 -45682 -2434
7467 -2434 13995 -9384 -39911 10722 30453 -7898 -44015 -60258 -81073 -107874 -78556 -55890
7455 -55890 -54977 -81422 -85326 -104008 -75869 -6289 13971 40475 20858 -19516 -30638 -25299 -28653
7442 -28653 -57352 -6038 49698 47129 2275 -45652 -118429 -95154 -49669 971 -2092 52750
7430 52750 76118 47026 57063 58189 35210 -1328 6794 -45611 -40236 15502 29426 7002
7418 7002 -12887 -21261 -14299 26793 46256 39611 55354 2606 22122 32228 10153 1126 17481
7405 17481 12541 -51984 -35158 -4242 48413 32120 -5712 13887 44840 25810 23427 34177
7393 34177 27478 15290 83255 62869 46356 53584 66299 41429 42374 97330 89352 64889 45939
7380 45939 20171 -23920 -60299 -15391 50604 130068 84996 68722 55621 -10278 -92118 -104807
7368 -104807 -71930 11268 56965 42036 19221 40245 15195 10284 19204 6493 -5474 30996
7356 30996 18199 4453 -66512 -84216 -58922 50682 86196 117409 90280 21365 -47603 -1763
7344 -1763 74634 66455 69725 61524 13223 -38880 -43873 -52245 -61965 -74456 -30117 -15298 -12977
7331 -12977 -62907 -69124 -33494 -101823 -126515 -71750 -52692 -42459 21140 44351 -26257 -56433
7319 -56433 -91612 -45469 -22163 -76155 -66789 -23122 -25434 -12479 -16491 26488 22413 -17462 35749
7306 35749 21284 -19527 -19047 7073 49317 47402 97457 121059 99877 88965 99052 90957 52676
7293 52676 -47440 -106090 -51297 22216 26925 23609 15340 34341 43447 -14024 -111244 -81498
7281 -81498 -21573 34007 67171 23049 -27269 -55889 -27118 -3430 -18526 14713 28798 57006
7269 57006 12265 40254 38775 31878 28994 35499 19812 28121 11880 -31907 -9943 39931 5471
7256 5471 13245 60381 23026 79146 82247 30486 30179 -20653 -38456 -28084 -101049 -81754 -57925
7243 -57925 -19564 -63069 -66517 -49574 -38707 -39415 -72592 -20093 -20289 -49980 -35357 -11261 -19806
7230 -19806 -25271 12361 72993 126771 124195 70505 -17618 -21223 -9297 -23996 -5983 54719
7218 54719 110999 107481 85437 5429 -14631 -47538 -18055 -26746 -25829 -13687 -53322 -11644 8314
7205 8314 -13931 -19690 -26395 26140 -20651 3820 54543 30472 -460 -46183 -114814 -126648
7193 -126648 -71992 -42979 -9249 1699 -27186 -32630 -9547 -4753 -3334 3880 11558 -29670 -79756
7180 -79756 -92391 -60166 -3690 -14060 2329 8690 -8654 70175 99044 79475 57276 35690
7168 35690 65518 86653 81053 35429 -946 58012 105389 100322 81449 71829 28216 10690
7156 10690 39174 63402 56566 90333 82023 58216 16733 -44734 -91424 -44901 -46911 -77408
7144 -77408 -48109 -51497 -89165 -17919 30484 11338 3833 56652 59320 48244 11230 12867 8232
7131 8232 44208 82369 67008 96388 158118 148649 99294 39881 47621 16164 16458 21919 5185
7118 5185 -66180 -50919 -31489 -10916 -934 1918 22461 38446 16612 5009 28133 -17917
7106 -17917 -76343 -83693 -28737 -9794 -33240 -27915 -32236 -26740 -76292 -64023 -9368 8974 -33122
7093 -33122 -48934 19787 78534 16947 -47332 -71164 -20399 -2008 -20922 -38100 -11240 50054
7081 50054 52698 3248 52415 66407 22941 19048 8465 -5030 -69828 -51993 -49505 -57611 -24486
7068 -24486 21366 83137 112481 54941 -40577 -79486 -74525 -64908 -34549 7010 -22318 -8649
7056 -8649 37376 -42133 -124841 -121872 -91121 -89478 -38717 29599 47803 47224 35393 59856 57905
7043 57905 71498 42550 7823 23887 17795 41398 60109 49000 -9714 -61841 -9007 10252
7031 10252 48245 85031 68068 24002 41575 20807 -2897 -12929 15504 -11223 -3687 -34110
7019 -34110 19963 32877 -47671 -124718 -108838 -55227 -29371 29482 11748 -19648 32615 51189
7007 51189 17901 -57031 -32481 -20973 -25981 -17339 -24063 37330 39272 28312 50378 7622 -26153
6994 -26153 -37125 -16414 -49728 -46164 -21761 27300 94069 132832 143537 153827 111475 36181
6982 36181 -32356 -2627 4521 54912 62780 64802 48853 42698 13541 15014 46915 58881 67313
6969 67313 41565 19 -2064 46057 71814 31062 64385 104266 157280 159299 127993 137503
6957 137503 117773 101403 28669 27976 76542 76899 60138 48570 107475 80949 5798 30580
6945 30580 44621 11673 -31793 -28569 -52766 -28723 -29444 44242 11724 -6944 11780 17296 28908
6932 28908 3528 -26238 -22241 -30747 6039 19254 -21327 -36008 -66739 -62118 -56432 -53866 -15014
6919 -15014 57125 68989 19400 13437 -40252 -19405 3249 -25968 -59937 -10076 6159 36207
6907 36207 15967 -19670 -98138 -81969 -39559 -47020 -41343 -45150 -18934 5087 -18961 -48111
6895 -48111 -45257 -45370 -40573 2523 2742 13217 45161 83396 49360 53070 9652 5757 -2579 -38855
6881 -38855 -699 14684 53199 146637 193317 81158 -280 -7446 15966 65339 72710 10459
6869 10459 -7076 35887 43174 51189 -27058 -62066 -6951 12620 24561 63431 102966 61853
6857 61853 24912 19092 6605 -13937 -32870 15584 85243 41794 -41318 13902 76288 51846
6845 51846 57626 28294 -12067 3892 47983 35097 18852 -8326 -4967 6742 -33804 -66632
6833 -66632 -48114 13607 13612 11787 -1727 5874 9897 33495 53745 40800 34909 22796 10870
6820 10870 -57122 -31389 40407 78430 123090 174969 107221 47140 60393 74264 31856 50157
6808 50157 73126 32259 -35919 -40200 -77150 -104684 -55866 -5358 -2113 -19940 -520 -60815
6796 -60815 -138131 -127587 -8848 25343 -37275 -31377 7890 -51251 -73451 -86476 -106676 -72764
6784 -72764 -57686 -119535 -112631 -23834 40940 8121 -46008 -46154 -46601 -19059 9837 55782 74835
6771 74835 53064 86738 132003 108129 89403 82664 45730 15640 -30791 -49063 -34622 3649
6759 3649 18651 42740 34501 29899 -28265 -9283 33740 88245 70293 6380 -31586 -15275
6747 -15275 -14082 -26357 -49984 -57596 -22045 45328 52839 81373 104089 153174 144927 122539 69053
6734 69053 78707 129076 134676 174471 168996 140308 145313 133191 104471 127352 144176 172120 258057
6721 258057 467066 649577 915184 1265712 1486641 1634205 1562640 1276935 926020 620444
6711 620444 401682 190198 166675 126183 98084 113988 118810 101288 53593 48199 40391 55520
6699 55520 50699 43083 40497 68198 119466 164133 143692 133311 79805 22284 49608 73982
6687 73982 24671 11252 -10996 -13095 -26957 -44431 -73739 -62994 -39128 -2349 76618 119549
6675 119549 49687 -30870 -51628 -31617 23383 -20737 -106628 -101681 -133188 -110751 -94345 -94577
6663 -94577 -38061 59282 89881 96031 120974 55180 13518 63908 18436 7369 -43694 -124421
6651 -124421 -73392 -19097 -7063 -23103 -50520 -46008 -95435 -93368 -46871 -70428 -119927 -95781
6639 -95781 -78788 -49776 -35212 -23185 -6641 14769 -41105 -13751 -38014 -60289 -18812 -40612
6627 -40612 -79415 -89280 -63791 -70526 -68695 -24047 -54198 -71868 -30050 30295 64864 104761
6615 104761 118070 23703 -34924 3098 -50085 -124431 -108776 -116174 -92243 -39857 -59791 -50387
6603 -50387 -3557 -9460 12638 1618 -78001 -56450 -13560 13854 -20006 9493 33945 4357
6591 4357 -47935 -30737 -6495 -30252 -16169 30009 33646 7804 -9906 30141 9933 8934 35067
6578 35067 14481 -64444 -53041 -42070 -49424 -33198 -26125 -78506 -53514 -31448 16615 65210
6566 65210 29715 40485 48771 19954 -27616 6563 5278 2821 -63012 -102519 -37773 30850
6554 30850 55312 36835 52601 -8182 -53631 -23396 16965 19095 -9200 -47815 -26234 -20630
6542 -20630 -7404 -72835 -112606 -89054 -76705 -24573 -16399 5305 -23183 -25405 4919 57837
6530 57837 56590 58491 44918 16714 -26717 -34083 -23125 -25685 -6715 41382 53546 67704 101672
6517 101672 83836 36701 -6933 -70272 -93098 -45787 -35532 -65314 -43163 -38772 -19241 55457
6505 55457 49492 6390 -12191 -18240 -465 -14362 -79157 -85649 -19017 1723 -33157 -45737
6493 -45737 24704 69424 60413 27891 43245 27483 16776 20218 -56045 -19121 -2257 -29079
6481 -29079 -29998 -9775 54403 115854 91911 64667 22569 6100 50006 86832 101214 57738
6469 57738 -50118 -40129 -57545 -47732 -31927 -23430 -59041 -89822 -10982 44760 19989 15758
6457 15758 13789 24372 73944 47465 40475 15356 6558 54244 35288 -35218 -55420 -49712 -110163
6444 -110163 -106795 -69906 -42012 -27876 14385 46433 54301 33710 -5494 29394 51332 13464
6432 13464 -10026 -6767 51611 101239 54051 70703 71232 62421 46016 2109 36816 8995 -74706
6419 -74706 -88827 -97155 -69418 -96204 -117828 -109162 -90164 -39679 -29440 -31694 33972 49015
6407 49015 35476 -14383 -7837 30199 43737 -63611 -118269 -91637 -64281 -13150 58590 46286
6395 46286 25638 28720 15446 64605 68501 39480 96864 131934 103094 79360 73612 69754 35687
6382 35687 -31383 -53625 -54762 -72968 -44036 -29518 -33993 49834 53397 1944 43215 41842 7967
6369 7967 52339 85487 94338 527 -52592 -44189 -27246 -47284 -49522 -20320 -30838 -33955 -9948
6356 -9948 27380 7481 -97341 -136392 -100350 -72807 -28031 -67917 -63492 -30763 -62156 -33723
6344 -33723 -7625 75491 89219 11687 -54828 -26487 -7713 17420 53849 24223 4235 16744
6332 16744 21506 -50532 -120710 -151307 -118220 -76610 22353 50647 73364 53814 -9087 -11572
6320 -11572 -25399 -17508 13713 50760 80242 62455 47333 54805 35879 11392 2772 -20461
6308 -20461 -422 86703 125192 52326 -5748 -59444 -3733 10508 -16105 -29407 -22876 18749
6296 18749 -10 -35696 -32937 7558 7214 -9309 -12133 -2790 -10161 -32703 -6072 1636 11153
6283 11153 45169 52644 39187 19392 70871 62652 40769 -14907 -4902 -16040 -33415 -4177
6271 -4177 -26203 -19706 -44510 -68025 -70425 -42430 2949 11030 -10134 -53167 -19942 -40144 -26128
6258 -26128 22731 -9970 -15756 -27623 -46169 -35973 -36121 -92819 -158023 -194612 -163066 -102300
6246 -102300 -69811 1724 57446 88320 74639 78545 17477 -17466 -76979 -40779 20675 33155
6234 33155 15473 19524 68440 35575 54999 86207 23024 -62282 -84197 -29214 19772 6463
6222 6463 -24727 -49042 -33984 -32983 -13977 59634 65864 53409 39289 42548 41211 18368 -29303
6209 -29303 -78258 -47946 -64231 -56967 -38747 333 46908 19449 -18993 -57494 -28131 -57100
6197 -57100 -54486 -23074 -32314 -51222 -59120 -17367 -39556 -38716 4511 49056 18304 -39679 -83156
6184 -83156 -47093 17333 30823 82520 120799 125301 80505 48223 55120 45055 42075 78208
6172 78208 44965 2280 6641 -37381 25850 8508 -45677 -6844 35712 17306 16883 23843 51425
6159 51425 87101 147944 104137 28309 -7793 -11567 8815 -5363 -3889 -48867 -12043 -42615
6147 -42615 -77603 -50471 -77171 -60753 -35023 -4048 -32315 -25281 -50276 -80168 -74108 -66374
6135 -66374 -62681 -50114 -53617 -67320 -64075 -52526 -92557 -63389 -47517 -72456 -92005 -72959
6123 -72959 2995 -1214 -10258 -4609 45764 64891 76085 82629 56527 30726 8708 -19914 8600
6110 8600 27499 11288 -30635 -40600 31083 78643 100613 138958 106772 83738 45132 -16513
6098 -16513 -53239 -78288 -87928 -66846 -35326 -35303 -15646 -13111 12389 73272 142469 108565 82495
6085 82495 56296 14488 15063 62918 31902 44945 35632 37889 11776 -10021 27723 23753 2187
6072 2187 24700 17886 -36358 -73709 -68093 -10837 29251 -3359 11844 37799 78258 70428 61829
6059 61829 31387 37746 32489 33310 54759 25438 -11967 -25867 9964 55851 44753 18842 16832
6046 16832 36321 47955 -6506 -37504 -32278 -38860 -33363 -10598 8699 79532 70484 -1076 -57040
6033 -57040 -59043 -20120 -43232 -16939 1450 -22122 -73089 -141391 -124417 -82396 -26086 35299
6021 35299 28294 -26723 -34966 12535 28522 -25567 -113142 -28591 65328 61421 25498 -7804
6009 -7804 -12105 6467 7694 -13548 -38508 -13957 25926 28049 -46313 -87236 -26318 -32878 -45828
5996 -45828 -28055 20504 -8536 -21343 -73331 -103695 -43950 -16629 -27123 -9391 20701 31565
5984 31565 23918 -26180 -36666 -2960 -7586 39452 58983 42441 59358 45020 42127 39669 14317
5971 14317 -31592 -64515 -65974 -56633 -6342 369 40287 24457 -35524 -15502 22802 59352
5959 59352 47346 -28535 -73940 -65445 -50408 -63538 1522 82794 133736 67759 -11348 -39666
5947 -39666 -109590 -143261 -114407 -70575 -31502 -7070 -897 -99026 -86089 -41358 -20415 -25037
5935 -25037 23287 36472 60875 65479 41947 35131 39440 -42068 -56654 64367 94454 114957
5923 114957 123437 75439 20985 65842 80912 71804 14053 3970 25458 13649 -41529 -63146
5911 -63146 -69290 -83401 -60384 629 -5798 -64525 -101943 -80829 -68431 -79933 -70018 -39235
5899 -39235 -37137 15789 91259 117989 89022 16939 -55767 -12427 -48636 -103637 -121353 -75146
5887 -75146 -26977 6540 26388 47342 81465 101563 82398 62223 27051 36250 36186 -22220 -86774
5874 -86774 -38527 -13069 2234 -12712 -67095 -79884 -60980 -50601 -54474 -97991 -115311 -139602
5862 -139602 -101719 -20009 42821 -15796 -30668 -29289 -89405 -112741 -71024 -36627 11534 -7491
5850 -7491 -18523 10715 -5186 -30958 -5423 45150 67270 45362 24008 12162 9441 -27886
5838 -27886 -8141 10506 -4899 -39364 -46098 42099 107383 116575 77566 59572 12730 -3491
5826 -3491 -25349 18554 21295 -13082 -53074 3341 880 47913 12556 -45380 -51094 -38329 -51878
5813 -51878 -90806 -138621 -147311 -68641 14344 9432 -27424 -43866 14496 63149 76073 25879
5801 25879 -48935 -69447 -35591 3895 -55566 -66818 -40629 -27659 -44226 64510 134829 59834
5789 59834 11532 24334 1237 -31361 -77726 -92362 -99647 -132949 -201558 -200979 -135565 -114621
5777 -114621 -78287 -5780 14394 32218 -8920 -34426 -29536 -48162 -25660 -7187 19744 17334
5765 17334 20157 -39273 -68898 -77384 -58044 -65221 -30416 -12891 25258 61058 -5146 -24009
5753 -24009 -7358 -34173 -21140 -17946 19278 65834 4977 -1011 10215 -52777 -92965 -84690
5741 -84690 -24041 -77564 -109165 -53084 8387 6514 17043 42500 21199 27191 -6356 -53518
5729 -53518 -51869 46406 109336 68906 24152 57126 100986 93727 66666 89375 128417 147025
5717 147025 84751 52513 55363 11999 -3951 -34436 -78214 -108463 -80973 -72215 -32654 7081
5705 7081 -9614 -50864 -40898 -14094 -35213 -109033 -111103 -105644 -72824 -87660 -65461 -38046 -9466
5692 -9466 -11817 34337 59507 5715 -18330 8631 5811 -11101 1549 21998 41514 46767 72789
5679 72789 11516 3174 62802 66031 60401 56264 21995 -56571 -93562 -113530 -105509 -91847 -95693
5666 -95693 -35475 12940 13168 -25443 -61600 -48371 -74256 -39859 4585 6241 20436 -46169
5654 -46169 -31381 172 1379 7861 18791 44903 34074 59168 1267 -19171 -2030 23859
5642 23859 47342 30646 31900 24352 63281 78370 49332 78235 62662 -11820 -40809 -1906
5630 -1906 -11917 29339 54956 38391 5445 -20671 -48457 -37682 -3088 -20720 -43628 -58490
5618 -58490 -39541 50126 51270 24264 26494 35189 93299 39967 9646 47993 57849 8363 -12348
5605 -12348 -27906 -59687 -29636 -62784 -62442 -71775 -55824 -64245 -67958 -24541 30380 46874 44529
5592 44529 67606 61278 -113585 -167168 -83270 -5595 -35916 -3288 11699 86594 74595 60508
5580 60508 69811 155454 139189 129672 85114 4115 10777 70560 115361 73294 28242 37620 18603
5567 18603 58509 21950 -7126 -48292 -56588 -9490 55087 58794 67402 65497 41356 49193 55618
5554 55618 36651 5987 51367 -1500 26077 56829 16731 -8039 4409 71418 58292 17407
5542 17407 2409 19350 53757 71318 102610 79219 75573 60616 -1751 -21595 -40907 13213
5530 13213 36872 6792 -65462 -56626 -10799 43815 44402 481 -8107 -26299 -84714 -61749 -65356
5517 -65356 -36219 -32867 -27709 2827 -45066 -109735 -104947 -71994 -40688 -47848 -53013 -37491 -47573
5504 -47573 -6658 50231 46763 51424 56153 35571 60536 8825 -42490 -47289 29556 1174 -12857
5491 -12857 5325 49873 109099 98431 71675 -93 -26242 -32454 -38488 -77534 -52493 16402
5479 16402 -8667 -22700 33396 69956 40263 12767 -16456 -2862 946 8768 11440 46576
5467 46576 51580 80243 122649 86172 4070 25071 84123 72552 52363 41234 60732 52182
5455 52182 9599 -47928 696 -7454 -55651 -32160 -2403 -53917 -28242 5349 -52403 -63874
5443 -63874 -91272 -40953 9597 -21831 2182 -61030 -53785 -41121 -46031 -57254 -52380 -4841
5431 -4841 -31744 -74446 22865 52216 27737 -7379 -14946 28923 66569 39256 -36290 -23108
5419 -23108 -7101 -43521 -52497 2954 41091 100091 108387 21937 -30182 -23820 -11446 15457
5407 15457 -15435 -354 61825 41433 32271 35634 44252 71484 26652 28748 -8049 -38506 -63025
5394 -63025 -57269 -73371 -70605 -54605 5922 82622 68023 13973 21798 75145 38014 34070 -49045
5381 -49045 -44642 -10050 49523 53391 3103 23747 46680 78730 93643 69943 67959 77275 53410
5368 53410 33708 57905 21040 -57398 14172 33861 8729 -26218 -4656 28377 10365 26362
5356 26362 52781 20044 48029 49369 16148 30555 30402 -7013 -25708 -27843 -66530 -83421 -53346
5343 -53346 -76951 -116678 -66339 -105068 -149223 -83957 -41657 3233 61046 79615 73576 94379
5331 94379 74570 -25069 -77461 -80259 -61730 -91154 -60231 -47774 -55869 -42411 -45391 -13866
5319 -13866 53343 74456 96105 33894 -79094 -147283 -160483 -108025 -49313 -42514 16099 80419
5307 80419 113014 66886 -4312 -30723 -13896 4809 9599 18402 45404 55105 61423 97528 66752
5294 66752 25256 -15154 -41793 -12123 19729 35543 -20858 -37528 -8632 -17424 -96039 -131238
5282 -131238 -129476 -147915 -185744 -125020 -40316 -15497 -21280 13443 18539 108266 142322 130000
5270 130000 118053 36719 -4458 -37654 -48460 -61401 -75799 -72969 -40620 51192 38921 22064
5258 22064 4250 -19682 -84766 -113545 -160066 -77795 -27474 -39413 -45028 -47761 7789 36438
5246 36438 58249 61711 35517 -25718 -11623 16146 -10714 -11257 -25575 -39698 -23379 -69726
5234 -69726 -35663 14820 -14908 -63017 -12980 40438 -42797 -95557 -45297 -22275 -52156 -62012
5222 -62012 -43191 -16863 -49799 -40344 -39120 -70538 -95903 -92724 -66403 -53091 -77411 -82698 -66407
5209 -66407 -45142 -18330 -49167 -72184 -63248 -65726 6346 -3404 -43598 -60028 -42533 -32613 -661
5196 -661 10057 -48118 -60204 -66732 -91541 -92927 -96498 -106394 -69095 -1045 -9696 -7496 -37938
5183 -37938 -73088 -107989 -30514 -39692 -51226 28343 79073 55162 -9496 9791 -20698 12242
5171 12242 -3805 -64547 -89533 -60505 -41670 -69620 -60687 -79054 -34429 -1864 -23667 -1083
5159 -1083 11166 8651 58731 60965 32349 4401 -36362 -93718 -87414 -89347 -99176 -48457 -19109
5146 -19109 23102 52968 -12459 -44041 -41823 -55006 -59795 -15497 42621 36610 20141 27266 6441
5133 6441 -2250 -25688 -45210 -27779 -65902 -96524 -100173 -80269 2820 -1869 -21802 8544 -17059
5120 -17059 -17583 -37164 -41981 -18485 12451 -6182 -30779 -37247 -42351 -107596 -98376 -59445 -47530
5107 -47530 10179 52981 -20387 -15614 38044 16009 -20635 -38225 -78714 -69344 -87286 -22583
5095 -22583 -8592 -51990 -898 5552 -5227 -37649 7659 46830 59622 -16126 -72976 -12113
5083 -12113 17163 33934 53163 61119 34235 42794 49849 58031 56873 -478 -32943 -28603 -153
5070 -153 54732 77857 42478 26202 88560 158090 171878 171687 69424 3560 -37224 -64306
5058 -64306 -59331 -54960 -50776 -18197 -23338 -45429 -22835 -42072 -21357 -50490 -19417 -3415 16053
5045 16053 -727 -46115 -45816 -47844 -41936 20782 62102 71395 73402 15816 56944 69676 48942
5032 48942 13940 21614 47510 55215 56070 32401 25077 15695 -29306 -67974 -2740 44827 33220
5019 33220 13610 6401 9548 -42102 -83240 -58992 -16502 -959 658 -19797 -63763 -63374 -19468
5006 -19468 45287 66315 16299 -5330 -47071 -73881 -35023 -44501 -90024 -126536 -99999 -68901
4994 -68901 -24535 -30230 -52991 -13341 -27735 -87789 -75845 -32300 6516 32425 -22693 -11531
4982 -11531 -36265 4909 50796 21808 -37676 -71802 -96512 -53139 2260 25662 51920 22695
4970 22695 39159 36321 19135 -7289 -24591 -49180 -47527 58836 15897 -47756 -68571 -81019
4958 -81019 -91296 -85780 -12656 80025 90016 6530 -63659 -79327 -132521 -87168 -12334 -23793
4946 -23793 10459 40533 38899 41702 31553 68593 85784 37771 7533 23392 11017 -16670
4934 -16670 -622 21767 19040 -45007 -44675 -38169 -68754 -85758 -88375 -94558 -77112 -48678 -74667
4921 -74667 -137557 -114864 -99022 -91381 -111151 -47536 18236 -21159 -24893 -28720 -46534 12943
4909 12943 50024 30224 4922 37615 13986 39744 25008 -2307 -16621 -28317 -41349 -41462
4897 -41462 10112 75336 79356 64948 45225 20401 -13398 8258 -60172 -98315 -23392 -7870
4885 -7870 -72684 -137138 -159291 -105550 -83922 -45332 -15437 -9811 31386 7396 7632 -38096 -68876
4872 -68876 -44660 -54692 -85955 -61027 -51914 -51105 -24134 28007 68361 132380 129495 93322 41541
4859 41541 86158 191855 214087 196003 137068 71822 76519 79292 69761 55360 42888 96453
4847 96453 93904 63570 46295 9365 2870 35878 -17418 -97195 -131470 -100125 -19557 39442
4835 39442 -11276 -110845 -35177 -1466 -16476 -67617 -97037 -60317 -47738 -45430 -22465 -30772
4823 -30772 -37728 -58199 -45039 -3137 -52210 -45005 -15283 -15821 -4003 12993 17435 36826 45317
4810 45317 48915 -18491 -29563 -19943 -48144 -73169 -99289 -103752 -96101 -46864 -20534 -47080 -81903
4797 -81903 -53851 -42727 -26053 -16915 -46988 -54031 -72033 -93942 -56950 -22532 46744 52960
4785 52960 72676 29605 7468 20349 -1402 -17012 -21564 -46363 -47075 -26619 6991 564 -36223
4772 -36223 -41812 -49701 -76425 -72781 -60696 -62875 -91001 -102610 -53912 -41176 -88410 -50772 -22830
4759 -22830 8583 58843 85527 91373 24432 14907 14392 -29690 -71874 -29479 -3377 45409 6541
4746 6541 50529 84677 112512 973 -93144 -70670 -22891 -89584 -84314 -56716 -91145 -119439
4734 -119439 -106190 -47622 -8183 -30956 -9562 50629 37059 -12204 -35244 -21968 -37126 -88465
4722 -88465 -59595 -74714 -82729 -132726 -63155 -15166 -37326 -34945 -10031 -5995 -19712 -27637 -28935
4709 -28935 -33832 -82436 -79569 -6197 -28440 -69258 -103358 -95705 -30243 26073 45985 53743 12044
4696 12044 -29244 4839 20082 -16285 -31117 -71673 -80695 -27095 47310 -10987 -13901 38308
4684 38308 44194 -48808 -116776 -155806 -143095 -39875 15986 22921 119631 95734 67209 74977
4672 74977 77637 -12828 -57726 11736 59892 46704 16867 -27905 -71198 -55583 -48522 -34737
4660 -34737 -95510 -133935 -109006 -58970 -12502 26161 59833 25664 4664 5685 -1261 -31880
4648 -31880 -77707 -98348 -42046 10474 6745 28110 3961 36813 57328 -11914 -27060 2176
4636 2176 -5335 -26152 14065 20305 -29498 -57629 -12845 -2612 -20303 23543 57033 33623
4624 33623 26972 31059 11591 45948 108710 53616 32500 63157 78808 88068 55285 34920
4612 34920 -6430 -1352 -32317 8904 31635 40107 -10378 -30900 -45402 -82793 -89092 10027
4600 10027 40969 92601 88573 28746 58546 91048 48927 71764 67664 34024 19873 22801
4588 22801 96642 102208 88867 68694 6691 -55867 -19366 5006 13141 11420 -35363 -67521
4576 -67521 -98839 -98787 -66815 -80960 -13277 68734 -24189 -56060 -91281 -125223 -22749 71256
4564 71256 56923 38 -88101 -109228 -112097 -71383 -29181 -69436 -72724 6697 41537 36730
4552 36730 48948 25766 38449 23539 -20901 -10614 -10358 -43372 -70202 -80387 -109619 -77081
4540 -77081 -20181 11891 -27258 -131352 -110306 -35534 -51969 -57253 -34433 -38662 -14910 -63700
4528 -63700 -102148 -137572 -134349 -88298 -35594 25989 33798 56888 58389 18884 -15694 -68859
4516 -68859 -96684 -100289 -113303 -99661 -94081 -52652 -11248 -30036 -24104 28437 82977 9444
4504 9444 -10962 6904 15643 27143 50681 16397 -32665 -74779 -30744 -5058 7267 63716
4492 63716 76274 67134 81756 318 -70462 -72107 -31866 35512 121612 94965 3132 -3553
4480 -3553 34224 75794 88669 79766 68308 46748 60858 51749 71197 20508 -41703 -63932
4468 -63932 -39393 10952 27273 -8250 67021 50275 8844 7170 10956 53900 103803 79942
4456 79942 41820 55495 61994 32520 51012 -8686 -96764 -78604 -32818 -48065 -66668 -18714
4444 -18714 22605 43443 68426 79672 45574 59447 35921 17062 53758 33199 -24489 -3467
4432 -3467 30698 33613 40055 27595 -13369 -11644 20458 48958 73480 33069 9815 48638 -16976
4419 -16976 -84430 -65107 -47852 -25050 29322 1918 -40413 -82103 -103628 -95532 -56091 -48329
4407 -48329 -14270 22481 83195 84274 66941 1223 -46281 -29216 5724 -9989 26359 -14149
4395 -14149 16933 76840 72206 32836 -12499 -32942 -6309 5140 -11561 -37777 -27706 7402
4383 7402 19247 22171 45488 -5055 -26984 -11204 15863 -18299 -55027 -113803 -93982 -38077
4371 -38077 -29986 -64303 -16178 44548 59374 -13978 -39698 -27022 -58511 -47530 -97375 -128274
4359 -128274 -46943 13479 2504 -46853 -72020 -85447 -70649 -75275 -74221 -23766 -22339 -39961
4347 -39961 -63715 -100106 -49722 -17039 -14353 16101 1179 -5381 -8635 3311 -29874 -7765
4335 -7765 -67178 -72400 27408 27739 11715 41060 61347 54293 43929 49869 43882 20191 -296
4322 -296 -14032 -35093 -55311 -37963 -22256 35047 66 -62311 -71973 -30052 -44833 -31343
4310 -31343 60685 48715 30681 37866 25360 3608 -3188 -22780 -50161 -31058 -27964 -17987 24390
4297 24390 17942 23421 -8598 -57579 -45919 -38891 -71800 -54326 57 412 -26414 -14814 23183
4284 23183 30482 -4540 16332 1714 -49460 -66798 -29992 -10777 -393 48606 -7578 -33388
4272 -33388 -20248 58437 86239 40399 -16303 -25623 -34290 -13002 17299 59261 76327 46729
4260 46729 45165 31639 -4921 -48518 -34512 -10452 35256 51380 -10472 -15864 6433 17954
4248 17954 18682 44628 65653 58897 79127 26667 -12967 -30570 -42778 -29731 -76377 -79723 -115818
4235 -115818 -127615 -68679 982 -15217 -17847 28361 44385 7505 -66690 -90201 -98038 -92761
4223 -92761 -105118 -74148 -76359 -101853 -13488 45763 -9215 -75805 -49038 -60475 -45197 -47388
4211 -47388 -55323 -78003 -72367 -65962 -78263 -123413 -107921 -94146 -37101 -52363 -24138 -53284
4199 -53284 -57257 -5515 22212 715 -18580 3096 18658 26330 73034 90586 85134 75894 41904
4186 41904 11924 14501 -2228 -2646 1651 -52167 8436 -7341 -41903 -30006 -18239 7698 36237
4173 36237 67253 59589 54840 118764 67060 13659 -29670 -27182 -20533 -40512 -41589 -1643 -18407
4160 -18407 -17355 -3507 25946 46548 88075 120994 98477 80209 84617 75070 80931 54873 21517
4147 21517 -28271 -11447 -63371 -111768 -68172 -24153 -24563 -66376 -90070 -64092 -32920 12490
4135 12490 70721 91555 55867 38517 138003 103221 77285 27896 -16401 -374 -8948 -8847
4123 -8847 -9685 25317 41879 54834 59 2090 34122 59845 32347 -2919 597 -17453 9270
4110 9270 30055 -2538 -51221 -36749 -31249 -49119 5105 49679 88636 81278 41843 48977 -24486
4097 -24486 -68260 -51280 -12233 -30366 -28904 -36992 -43201 -43744 25031 112601 73367 44075 11690
4084 11690 10734 -66302 -113025 -82943 -63542 -36804 -1581 45398 -4648 -42983 -96009 -136554
4072 -136554 -141676 -133624 -92934 -55186 -28672 -18171 46913 50574 50211 85291 82268 18767 -54157
4059 -54157 -3314 56630 87841 85171 19565 -21102 -36744 2842 24467 17022 1300 -47763
4047 -47763 -53536 3021 44006 12524 -24136 -40134 -40382 -47611 -57577 -95069 -48320 13486 36246
4034 36246 -29414 -53141 -45176 -85854 -95285 -32101 21916 10283 290 8479 65523 124818 123510
4021 123510 44621 -25342 17606 54840 7147 6115 -2339 -16912 21549 39187 47373 72785
4009 72785 90158 29237 165 -18693 -56968 -59238 11986 70204 45352 -6887 -34132 2088
3997 2088 -2495 -16973 -16066 17526 -1455 -7892 18979 10321 -56216 -38663 439 37789 37936
3984 37936 2895 -37479 -32552 13654 47407 8789 5850 -2909 34239 19680 1902 1890 12555
3971 12555 -18063 -55847 -15500 50589 82476 123123 123000 101654 43531 -54178 -135109 -96619
3959 -96619 -17535 -2945 27762 28265 59787 69195 81173 95115 95815 81172 9495 -25390 -9394
3946 -9394 -21300 1715 53863 53675 3565 -17091 9235 -14189 24987 22917 14307 51195 63671
3933 63671 22578 23318 14362 2798 -5472 32415 21352 27643 -11777 -7321 40575 18268 -11328
3920 -11328 -5521 -18784 758 8458 -50155 -56904 -44427 -37317 13687 28909 5972 -64443 -113676
3907 -113676 -105227 -135951 -131988 -81923 -32838 -12489 24017 54367 61195 20757 -9712 32250
3895 32250 57469 30986 -1888 -4655 -61578 -102484 -65155 -21427 -32080 -23886 -9986 -51250
3883 -51250 -51155 -17330 6555 8469 -3455 29503 74394 22171 41591 48365 49907 48680 6831
3870 6831 -22364 -6567 1939 -28981 -35437 -21825 -31890 -51897 -105095 -118811 -64600 28546
3858 28546 70097 84422 51311 -29110 -56389 -50026 -17208 -3823 -8607 -25562 19144 21253
3846 21253 28446 -52356 -35691 -25502 -11061 -20170 -20546 -43885 -11338 50525 62119 71713 86804
3833 86804 32692 27334 7425 -35147 -57533 -49385 -46109 -73871 -67258 -102204 -7613 89024 91918
3820 91918 43858 20941 -1297 -25704 -41212 -46424 6148 -6799 8882 36669 35220 66815
3808 66815 -8556 -80965 -55883 -39440 35031 108568 131693 59496 3195 -15780 -4246 57646
3796 57646 74766 169303 127822 126188 124783 68871 -6595 -78161 -77586 -35617 -29294 -62066 12943
3783 12943 19332 22065 21381 13931 17637 120369 146141 79780 48777 86729 95646 42864 9732
3770 9732 5125 16400 12403 -5716 -39992 -29296 28646 31085 3987 -37855 -52517 -26447 -23461
3757 -23461 -34316 -61855 -72248 -36449 -1890 40500 43725 -12625 -61359 -42459 -23821 -35694
3745 -35694 -7762 61016 85756 87694 58589 71915 65201 51291 64348 43840 -4245 -9651
3733 -9651 -7793 -5345 -17256 24245 103180 44119 -32048 -39942 -45680 21150 74225 33961 -7210
3720 -7210 -2996 12946 45281 37127 -13283 -34594 11793 29832 49415 11504 26059 33600 84661
3707 84661 115078 100508 39061 16222 -50746 -120645 -84624 -17992 7784 58565 86442 58437
3695 58437 43886 71443 49597 34620 -26069 1677 26820 -12067 -35729 -62133 -77903 -67161
3683 -67161 -15836 -20178 -24645 -56003 -31298 -11055 27304 71770 38425 -1307 -39501 -34800
3671 -34800 -2377 7300 -38500 2355 9698 16055 49800 -7974 -52677 17508 41518 3309
3659 3309 -5118 -19069 -55534 -70921 -34953 18122 25615 -15707 -4646 -1749 -5910 7645 -33433
3646 -33433 -81085 -68538 -15115 14347 15523 382 -57775 -54580 -3869 -5117 14760 26324
3634 26324 21379 -2237 -15965 -48008 -63219 -86856 -114839 -119311 -87121 -44999 15655 51736
3622 51736 55458 48637 -11354 -51585 -4082 37750 25981 9147 16201 48638 2136 -13946
3610 -13946 -1548 -16441 15667 -4092 -23898 3166 -5933 -142 6784 3738 -28376 -27277 1755
3597 1755 -1754 -7000 -42367 -84982 -71435 -34857 39679 15144 -46616 -66847 -73264 -36907 428
3584 428 -8074 -29659 6111 1351 3945 53763 38944 33121 10413 -8270 6583 24285 22506
3571 22506 30843 18184 14003 33597 14783 30977 61958 58439 64442 90038 78475 30827 -34598
3558 -34598 -79557 -96557 -68552 21285 -23129 -55256 -44685 -51065 -52822 20419 48051 25182
3546 25182 -38156 -89496 -60489 23 35122 48551 54900 11765 -31138 -61204 -36131 -43013
3534 -43013 -50341 -57138 -50605 -28874 62498 120115 147621 86129 72238 56603 53851 63478 49347
3521 49347 78764 28506 21475 2019 -54690 -84251 -69915 12335 50058 6422 42580 86736
3509 86736 77672 63862 -5537 -51191 -56004 -103725 -105617 -56975 -54028 3456 63933 84484 36829
3496 36829 35921 22723 -6930 48149 62811 43377 79796 94241 48862 3957 -19884 -53561
3484 -53561 -29645 -65586 8689 63460 52892 -13912 -20585 37547 75957 58037 61405 40262
3472 40262 5455 -57883 -80208 -1340 78432 118891 79809 11587 13030 51980 86101 82610
3460 82610 27752 1926 21596 5064 -7736 -1212 -10929 -6459 910 -2172 4927 -13862 -26972
3447 -26972 -22226 -39195 -40346 -43377 -28706 -14208 9840 96914 36350 -28836 38076 5703
3435 5703 -51768 -91396 -145382 -110716 -7152 48655 -34291 -53883 -5908 45680 28879 16518
3423 16518 -2869 -35559 1012 2452 -58659 -44373 348 27499 46414 85446 77665 75418
3411 75418 68640 41320 16016 44868 110539 123458 64055 29014 -34360 -30551 1428 590 -34713
3398 -34713 -45711 -30243 -15982 -7547 -9033 -17473 -80047 -106431 -46316 14749 -4107 -33951
3386 -33951 -8977 -8663 -7864 -17044 -61921 -74050 -63672 -20137 12480 17174 62475 74570 24990
3373 24990 24056 47762 37091 4178 46512 32581 -2953 -7758 16912 -6930 -50540 -38375
3361 -38375 -63961 -120971 -82011 -12781 -4206 8943 -4811 -19568 11897 46004 12888 14228
3349 14228 11893 -4960 -21530 6482 52966 105006 89303 38700 -29534 -95446 -86943 -73785
3337 -73785 -72041 -45526 8254 15238 20625 29095 21394 -7170 -31890 -13367 -22899 -30436 52988
3324 52988 97047 25988 -65889 -45518 -2488 36146 34826 38267 87180 18140 11653 6189 -45488
3311 -45488 19250 20587 -57438 -99190 -32335 -2058 -26644 3134 -15599 781 -7174 15435
3299 15435 -1610 9623 11033 40372 32640 21312 23460 28705 17641 30342 23823 -22417 8727
3286 8727 12983 36058 23114 55429 -2786 -81802 -77237 -51017 -53775 -29787 -5035 68867 80702
3273 80702 98986 53495 5118 -21299 -9932 21835 -12628 -34389 -27646 -33504 -18283 1296
3261 1296 36140 41807 18274 -11750 38784 3266 -10858 24171 19320 14101 3036 21733 60238
3248 60238 7193 15964 71821 57083 60979 55912 24112 20654 37581 5102 -72938 -161822 -119413
3235 -119413 -66582 -15956 18567 73669 136383 70973 105350 176433 114813 38995 9139 -7376
3223 -7376 -37366 -51376 -84600 -39310 35494 64042 65340 25515 -10404 -18291 -23442 9873 9198
3210 9198 -30922 -5713 17058 -5447 -5332 -29954 -48461 20905 66452 52425 38398 28962 -11898
3197 -11898 -74365 -24400 33106 19744 -18256 19406 88448 90180 93264 51194 35360 15935
3185 15935 102788 147418 144008 138922 83664 20117 28647 43852 -1049 -19832 11488 4165 -45571
3172 -45571 28266 41482 26657 11946 -24333 -176 60450 45547 54953 65698 66024 49682
3160 49682 37192 -12132 -26328 -53360 -34153 -30716 -88016 -88667 -44102 -50400 -79689 -78780 -51798
3147 -51798 -2001 -10338 25977 53862 -14808 -14717 83090 136477 55915 43664 -2742 -26739 -15526
3134 -15526 -30953 -17188 -18985 -41697 -37979 -53039 -9699 37804 7712 -2783 10304 -6551
3122 -6551 22770 43725 32104 17065 -52154 -51741 -33589 9665 50344 97690 63762 73782
3110 73782 49138 3101 -39548 -29427 -29504 -9794 32726 32106 36061 5954 -44497 -78202 -50221
3097 -50221 -30098 -29911 -8861 10715 41808 105981 45208 31020 69317 32498 -45853 -73625
3085 -73625 -99412 -152240 -106974 -66097 -39162 -17456 -25346 -10032 30229 28248 -5376 38074
3073 38074 43821 -13215 -34060 -1070 28949 19532 32317 65789 67428 11294 -28194 2814
3061 2814 45008 40430 -8543 -31036 37854 45015 20419 25944 58557 57050 52069 95204 110351
3048 110351 79802 44483 38955 -34477 -76761 -34682 42261 73184 76834 51705 57485 85100
3036 85100 106017 70965 61023 -18933 -55248 -58491 -47828 -38185 -73270 -68509 -37770 38729 58609
3023 58609 16645 -10752 29880 25317 15723 -1602 27073 25246 -42928 -80506 -121289 -110247
3011 -110247 -116864 -138525 -52896 -58023 -35492 -50582 -68960 1225 13162 40370 78019 24384
2999 24384 -15396 -61456 -84673 -74187 -42500 -49084 -78682 30101 45301 54658 25021 33837
2987 33837 -6380 -2138 14149 -31697 -61145 -41388 -28091 -5529 -11619 16139 38268 24891
2975 24891 6135 -51033 -43248 -59045 -26878 -29299 -32028 -74964 -143451 -109299 17745 29193
2963 29193 33289 69352 86068 71302 51166 3993 -3222 -24048 313 41806 13069 19561
2951 19561 54795 77950 53662 15114 -40223 -91498 -56836 -7324 17967 -45308 -94118 -67228
2939 -67228 -68176 -34966 4397 81763 107102 143305 161858 93177 208 23780 36575 40552
2927 40552 10784 -61015 -98943 -99500 -71008 -16819 48691 103263 75078 13809 6275 -21071
2915 -21071 -2322 4698 65773 80384 69011 42876 78012 108262 98318 96922 23891 31455 -15598
2902 -15598 -38235 -63260 -53727 -62766 -60458 -40544 -37298 -940 -8263 -30042 -48245 6491 -1669
2889 -1669 -32935 -56947 -52793 -59693 -9790 -6847 18108 24477 3462 -47687 -72170 -50095 18283
2876 18283 40421 58331 64515 88299 77383 52221 -18963 -43797 32178 103707 86637 58183
2864 58183 75727 37641 -19007 -38893 -42611 24285 72716 43161 -9240 623 -30863 -56516
2852 -56516 -15711 7467 71032 114763 79124 -15134 -33598 6981 22660 7148 -40600 -84347
2840 -84347 -34057 16320 78553 104453 70190 -27991 -21136 13778 30714 7949 11075 4041
2828 4041 24572 -16257 -67588 -32927 16871 9004 14105 28833 3556 7441 13277 22369 41061
2815 41061 88695 108819 110895 164810 152115 52686 40578 35421 -21130 -33913 -32611 -71453
2803 -71453 -47617 -74282 -28567 17000 27241 23499 11842 83811 144867 175119 189610 141438
2791 141438 77769 25942 439 -70398 -95560 -79287 1199 78608 90258 -11710 -103344
2780 -103344 -123382 -103951 -68090 -63290 -10823 81782 103069 109639 83179 42518 20288 41012
2768 41012 31366 19187 18478 14764 7616 -14663 -38069 -11210 4878 -23617 -53357 -57798 -51618
2755 -51618 -17113 55717 52727 117363 153440 104628 49095 12455 -2266 -13286 30108 44484
2743 44484 31914 2510 28020 23256 -15091 -21129 -33817 -14952 21501 40516 24734 79954
2731 79954 78571 26546 -9188 -3090 8377 37006 73178 12560 -8838 -50704 -40898 8669
2719 8669 20361 68506 82050 74905 74778 32168 25897 35262 95217 114176 143371 76880 938
2706 938 -14288 -20706 -26943 -44410 -48585 -68454 -72153 -41640 -21394 -75674 -61221 -67045 -43231
2693 -43231 -53828 23869 53640 6129 -20258 -78878 -83018 -108657 -15897 22729 -13028 -19853
2681 -19853 5982 -48754 -72643 -18872 -9893 49878 98322 142693 173937 172895 166483 110293
2669 110293 76282 41716 -18433 4578 43883 31761 33658 50976 71581 14334 -41491 -95860
2657 -95860 -119382 -71330 -46013 -20092 431 -35137 -6050 4799 -42374 -39700 24121 20645
2645 20645 -37934 -79719 9756 42037 -1277 -9630 1244 22653 -9792 -42830 -35798 -59514
2633 -59514 -91636 -33530 72835 86754 13902 36567 72487 37454 54351 49344 25587 -71670
2621 -71670 -72601 -3723 -7670 13440 -10693 -37900 -29449 -65663 -11016 27541 19174 24417 56459
2608 56459 -20810 -94774 -91485 -61506 -63731 -46425 -71251 -83676 -69630 -10954 37960 63556
2596 63556 77777 4096 -16994 -46872 -6095 13139 -18715 4945 18203 3112 -5957 -38284
2584 -38284 -61743 -9815 33213 11061 5209 -450 -22762 4868 81981 84734 77152 104330 80044
2571 80044 7170 -39346 -35045 -24749 -42527 -55582 -16738 45693 114013 91388 60371 41810
2559 41810 17633 -3083 -17001 -48391 -48131 -42748 -51985 -73584 -38937 17828 99492 100635 10159
2546 10159 -11322 18123 50363 49766 44760 37553 -20766 -31926 8447 -3490 -17457 7262 -11864
2533 -11864 -41137 -28154 -37675 -53982 -51360 -56407 -27645 -8952 -20443 2884 -978 -10468 14076
2520 14076 -31913 -60176 -53685 -83709 -74884 -78419 -101108 -99476 -81289 -102901 -114787 -95492 -70628
2507 -70628 -63266 -75962 -81208 -49762 -55193 -48740 -17825 -10957 5578 22437 -1812 1721 -3869
2494 -3869 26684 -747 -1230 31527 36915 69068 63799 61323 51851 45771 2367 35034 57353
2481 57353 23606 -37309 -65037 -20211 11386 53135 71260 84370 64282 21309 -38727 -18598
2469 -18598 -28716 -12003 57831 68478 46562 7801 -27397 -46939 -37017 2616 7696 8322 15159
2456 15159 61238 55938 28804 -48064 -83148 26273 64774 81039 62106 27199 -45239 -69123
2444 -69123 -31659 -11712 -28707 -57568 -33768 -27439 -84811 -60865 -42279 -19534 -43156 -55627
2432 -55627 -38831 -37773 -25790 42699 31822 5423 51107 53686 38355 -42752 -78639 -65015
2420 -65015 16198 36439 -44861 -111262 -102498 -26099 38284 97441 94855 78137 30616 9274
2408 9274 68146 71327 -339 2781 12846 10823 -2048 -44289 -50054 -71926 -110129 -128285 -59764
2395 -59764 -43848 -31866 14018 27551 4603 -30866 -17298 -718 3499 -15692 -49562 -65663
2383 -65663 -38232 -32867 -7839 20393 633 -79060 -102511 -104106 -100453 -75050 -119075 -122910 -87906
2370 -87906 -46492 -70326 -54159 -31792 -37084 -19252 -8127 775 -60820 -76531 -51694 -23168
2358 -23168 -25416 -71241 -32365 8736 -43479 -43018 -63943 -83602 -64117 -133954 -146602 -19909
2346 -19909 32137 -30392 -39124 18914 46153 11388 -77235 -101816 -91233 -139965 -145766 -77534
2334 -77534 -33427 8523 34006 10380 -31116 -42153 -64723 -59058 -65467 -105094 -65213 -3042
2322 -3042 -55045 -18120 21144 54762 112148 108266 69811 73864 77428 39481 20899 14454 -38150
2309 -38150 -7369 -28829 -15806 -7666 -10657 -9800 23191 69602 48227 104541 141262 160628 138428
2296 138428 91052 10356 40588 87834 109477 118033 100002 90936 48268 -16764 -28620 -23102
2284 -23102 18659 28723 33518 -1506 -33612 -65059 -34257 -47628 -12507 36707 40391 1751
2272 1751 -9075 8267 30611 60194 96023 99432 108597 37628 -3568 21805 31344 57254 45076
2259 45076 64277 91066 89892 100504 41249 -46185 -50863 -36807 -46817 -48296 -9270 -18000 -39871
2246 -39871 -96321 -83095 -27670 19127 25252 12738 -2227 -20646 -23170 -38146 -15114 61532
2234 61532 79571 53216 -21040 20669 106346 105038 91875 97296 140351 133418 150643 123815
2222 123815 58970 -8021 -91729 -42708 -2921 20532 64717 70132 47288 -11749 -23359 10239
2210 10239 8262 -27994 -25799 7321 -4660 18241 11859 19573 43494 11631 -23386 -41973 -872
2197 -872 38448 51763 56598 31002 33874 54648 68751 33412 2731 -24921 -79019 -97808 -46436
2184 -46436 9667 -1226 -65948 -23591 29317 -4611 25891 38466 63371 11801 -68636 -10405
2172 -10405 36605 15308 25151 88697 44010 56317 73937 60906 42676 94806 141718 133487
2160 133487 81277 59169 33474 71015 58880 -31064 -69728 -68614 -36755 -25603 11872 58111
2148 58111 5780 -4913 -10077 -16646 22105 28468 55562 66237 87693 81505 73589 82466 104346
2135 104346 104973 48671 -8240 -26837 -25094 22954 44502 32645 48282 107611 101598 97872 38821
2122 38821 22227 82480 105455 130295 105763 77245 66173 14384 23379 44663 68528 63703
2110 63703 -1297 1802 18518 47772 64583 45884 -12605 -39884 -6328 -26506 -46160 -24087
2098 -24087 -24334 -3328 11835 54590 69601 60670 9855 29375 64469 101228 114197 102005
2086 102005 110568 97097 80286 58973 30950 17593 71929 101789 109824 101947 87638 40485
2074 40485 50229 118435 127761 82882 70793 102024 77399 38665 -11797 -90472 -103659 -86989
2062 -86989 -47922 -46154 -44630 -29445 -54643 -96355 -109723 -112807 -92768 -40645 45901 68534
2050 68534 -11088 45647 17875 -27930 -10143 -2632 50950 69294 50412 60870 31747 12210
2038 12210 -61528 -43009 31830 34184 -37465 -4434 -12796 -27510 -17586 42285 85797 47371
2026 47371 29143 110266 94930 84733 126026 106291 66055 81220 129154 51934 -28092 2804
2014 2804 3163 -33206 -16074 -20583 10527 -22783 -91973 -35161 -15546 -58057 -41844 -26441 -3636
2001 -3636 -26289 -19293 -53231 -46400 30168 -9839 -44014 44009 -43137 -90192 -71215 8200
1989 8200 47721 50698 38275 -13704 -20312 78404 69781 3708 -68954 -58639 -67860 -4451 58379
1976 58379 15280 6915 23589 3896 -7490 58052 69381 51629 47123 78263 81268 96607
1964 96607 51228 26176 21799 -7800 2 20794 -23067 -50402 28415 135324 100630 58463
1952 58463 45404 25700 37203 56243 69704 34019 -22398 -66716 -62888 -51207 -22684 24025
1940 24025 95798 106558 70296 22860 -28504 -23351 -2277 22559 49881 50825 7593 22779
1928 22779 11405 -9271 -55182 -38569 45851 63811 22080 36121 5894 -2886 625 19495
1916 19495 20783 35486 25997 -25272 11640 16323 38969 -9231 -40668 5874 40987 87945
1904 87945 83672 58297 44756 29574 1296 30677 8722 -5868 -57683 -59759 -42456 -2533
1892 -2533 33743 56999 31660 42615 56740 49550 35504 22213 11977 -36311 -83403 -83562 -3475
1879 -3475 120092 121092 100071 71247 75949 20254 -39784 -82475 -77230 -34292 -41454 -32644 18646
1866 18646 26007 -19125 -31503 -44663 -28613 -64935 -92951 -76288 -88476 -43526 3216 20924
1854 20924 8101 -12693 -51550 -43287 -84298 -2167 64885 35131 -7696 -19217 -1415 -4301
1842 -4301 -16925 -63488 -93180 -144468 -107684 -34699 -53144 -4199 41981 69988 33072 41445
1830 41445 77288 32261 30649 -417 -19836 -51773 -102252 -24426 63253 119254 72883 18580
1818 18580 -10193 -30146 -32319 -36662 -30260 -42782 -79829 -89256 -63336 -18372 4152 19746 14754
1805 14754 16923 -6134 -23275 -27477 -35346 -39559 -4883 38468 -1184 -40466 -86815 -71713 -2076
1792 -2076 9331 -37802 -63622 -30688 -36097 -99151 -104504 -56481 -11672 -7983 42267 80576 14023
1779 14023 -56209 -57065 -6310 -5881 -30708 -56791 -45359 -44497 -52660 -19970 -4101 -11585 -51257
1766 -51257 -47197 -33932 -23574 30853 37865 2171 -54410 -44404 -53185 -67436 -40868 -38242 -37896
1753 -37896 30024 4310 -36023 -34255 11560 47334 48509 13977 -7307 4427 22183 10325
1741 10325 8144 48864 30639 -3104 19606 57575 46129 52631 63676 62903 -39282 -44850 -24245
1728 -24245 -17057 -21098 -29823 -56849 -72662 -104141 -116568 -186814 -176223 -86721 -43555 -5852
1716 -5852 -8758 -29581 -78006 -112349 -49162 -18092 5968 73746 -9031 -4911 4650 9253 37311
1703 37311 61516 -2661 6638 62791 78304 105495 113169 92510 61750 45302 38593 -16068
1691 -16068 -42292 -68905 -54350 25679 39640 -7965 -52308 -85727 -63164 -60308 4011 654
1679 654 -16596 14200 -25817 -35349 15752 21151 -9729 41954 43815 -13814 -74466 -45427 -19799
1666 -19799 -66557 -45645 -8531 -1253 -31373 9600 -42505 -53574 2576 55806 101603 119865
1654 119865 73824 68770 99660 129535 133959 165523 110685 52631 -6390 -52041 -34125 -40530
1642 -40530 -71267 -31113 11423 -25347 -14136 25122 48723 28302 40691 42794 19482 -21262
1630 -21262 -28320 -69603 -35070 -8072 -67856 -98807 -97927 5724 40625 1503 2398 -7338 -31841
1617 -31841 10983 146 -23974 -12170 -60452 -137140 -97722 -65538 -14091 50105 74691 117842
1605 117842 159902 125832 92538 52666 22282 22811 -2950 -41122 -36035 -32426 -47509 -46612 29953
1592 29953 72470 69115 32733 5148 -4465 49540 61414 80498 105488 74654 62242 73051
1580 73051 79266 83644 48215 19575 -21070 -76093 -65951 -17491 -18598 4245 -2627 44856 82874
1567 82874 104016 68198 16749 -2616 9497 -10672 4471 -22546 -19197 -68628 -68521 -110626
1555 -110626 -96478 -63118 -38581 48737 103622 31155 -10434 -13565 -59847 -72462 -29070 -26839
1543 -26839 -43266 -408 55127 -24417 -16396 -16578 -56086 -58586 -24991 -7082 -25676 9491 37904
1530 37904 69306 28665 -12376 -40163 -7589 47466 62843 61411 123914 52037 -14759 49500
1518 49500 -1043 -11356 9370 48848 38213 12917 -52181 -27026 2451 29189 37709 -37841
1506 -37841 -52035 -26855 14302 49833 33672 -51603 -45321 -864 -41517 -61634 -10992 18901
1494 18901 -3020 -25883 -35872 -1995 16225 16178 17096 7244 -10426 23456 59057 70090 19690
1481 19690 -38652 -43740 -2823 -20302 -24493 8934 -32986 -40996 -79471 -69239 -63003 -60326 -10774
1468 -10774 -2835 -36115 -78738 -83181 -109662 -61126 -3645 958 5901 -29324 -41650 8650 71752
1455 71752 98580 80672 74104 73754 37830 -2057 -35994 1562 31637 5931 32083 67591
1443 67591 33757 35573 30892 1294 -31573 -63629 -42619 -58633 -77 43299 -2097 -29843
1431 -29843 -27771 -41263 5491 60070 26752 -56647 -56208 29587 2844 -23957 -53837 -80359
1419 -80359 -142709 -155407 -192957 -170970 -83853 -49853 -86882 -93425 -127166 -93191 -22528 -17064
1407 -17064 -13967 -12770 20449 73277 58008 44365 -1949 -22895 -31860 -65000 -69530 -9301 -13810
1394 -13810 -27148 26750 60421 21073 -7871 -19984 50913 102524 60661 14335 3238 49735
1382 49735 55404 -6929 -13079 21019 49026 79095 70915 48229 9416 4015 32034 26449 30002
1369 30002 41642 45545 -55501 -38713 -5514 -49399 -38740 -53561 -86288 -105950 -106826 -106005 -90333
1356 -90333 -111737 -82664 -39318 -67295 -111121 -92030 -38485 -46485 -62949 -15243 -30683 -12430
1344 -12430 28430 72425 81530 76009 -15757 -31704 -64569 -69961 -127724 -75298 -53434 -43512 -25375
1331 -25375 -49294 -39645 -38073 -55395 -70852 5897 -31471 -102909 -132865 -135821 -25546 84354
1319 84354 83704 59692 81610 93484 89002 81766 17495 -10860 40306 89365 43860 4029 -7407
1306 -7407 -42582 -26802 -74922 -22299 87320 127117 94895 46321 9956 -44490 -4656 22538
1294 22538 74276 71103 71302 81560 55972 26551 2487 -3248 -35754 -49981 -53762 -80162 -105709
1281 -105709 -52453 -25181 14210 -11593 -13474 -29050 -3708 40920 56454 40904 14849 11465
1269 11465 -7452 6941 -43388 -33200 21331 -62021 -72695 -54634 -26334 9710 24062 52953
1257 52953 42761 -1672 -59485 -31052 -27645 -8253 51366 54615 61871 -8574 15392 -11554
1245 -11554 1928 12731 49740 12769 21793 9136 -79451 -59862 -42220 -66890 -95381 -104594
1233 -104594 -70221 -4854 -4800 -27829 -21510 -75360 -95819 -36102 16270 23390 354 15781 1892
1220 1892 -51366 -52281 -4423 -7417 -17779 -15806 11072 -5772 -76720 -11873 8956 -37308 -9357
1207 -9357 6565 7880 -3044 -264 7677 -12631 33897 53138 50254 78614 44711 25707 47781
1194 47781 43195 64207 57029 -26016 12248 116272 158171 174412 145280 75058 19955 49978
1182 49978 51702 16005 4444 -59651 -69081 -34605 -16883 -14325 -70502 -121997 -108826 -94631
1170 -94631 -102197 -117552 -110483 -82117 -50186 -62025 15650 3025 3627 -16449 -21389 25776 14549
1157 14549 -6295 -10061 -9829 -33744 -88739 -117651 -38103 60494 99323 76444 60643 81110
1145 81110 85410 37830 -8396 -30944 1103 -34138 -68691 -50692 13422 20095 -39895 -74572
1133 -74572 -127262 -97990 -71119 -55409 -35915 -32057 -19765 21728 44226 59069 41083 14057
1121 14057 63157 51201 -17155 -48700 -36558 26486 50884 24354 41323 94028 133006 188099
1109 188099 146666 15092 -50660 10713 59730 71002 76430 38765 7877 -45902 -35310 21830
1097 21830 49779 85043 121636 118824 37330 25077 92226 53598 18073 67241 110951 50728
1085 50728 -9562 4797 20939 23070 -31725 -7690 -5653 -8215 -50845 -85640 -104657 -55018
1073 -55018 15733 69938 57089 22034 -47522 -57804 -28508 -2596 -62412 -108639 -80438 -20352
1061 -20352 24735 -44605 -32641 -74075 -125677 -139755 -126826 -60126 -38650 -3638 17308 17739
1049 17739 -72970 -91694 -113226 -54773 -12035 -35560 -42456 -44821 -49816 -78992 -46681 -44039 -8783
1036 -8783 45194 2951 26311 2308 -7769 -41304 -59308 -39977 -17863 78855 100397 85694
1024 85694 39983 17857 -27102 -25481 12629 81914 139532 108792 50433 31677 1782 6051
1012 6051 35722 57371 48980 67648 92530 115494 136265 143267 120965 41050 -57150 -42086
1000 -42086 2059 65022 60609 39663 65921 74699 -14424 -36646 -21595 -21456 -29428 -55321 -8323
987 -8323 -7094 13817 22299 4228 28135 39285 4201 -55834 -91808 -69539 -29167 43302 48440
974 48440 14621 31195 28450 -16866 -24772 3593 39901 10988 56967 12724 32367 6392
962 6392 9054 38011 3897 -20868 8836 -28104 -16454 -2149 -7945 1413 -7399 -80063 -41741
949 -41741 -25588 -59634 -65053 -35373 -69547 20598 47307 -1322 -21070 -22474 -12320 -6808 51376
936 51376 41068 5777 9799 -21517 2276 16280 60604 98309 44815 -1817 -33709 -12156
924 -12156 -10221 -10819 -43734 -98062 -114696 -93222 -42475 6637 25720 -60235 -117195 -173845 -138053
911 -138053 -10120 -30340 -79774 -60880 -50361 -93929 -99979 -43810 -108877 -158855 -84371 4556
899 4556 60596 78962 100949 84699 26419 8873 -33521 -55972 -65298 -61948 5503 62293 74933
886 74933 29871 1549 -24118 -58523 -16268 -91292 -88431 -72969 -83785 -80395 -93634 -105112
874 -105112 -65342 -45014 -43690 -20703 -34509 -97797 -139558 -113923 -57286 -19151 -18719 -33322
862 -33322 33646 65929 63327 -1894 -26742 21586 19230 28747 53643 61352 18920 30653 18566
849 18566 -3884 -31475 -18741 10625 26173 44666 68987 52242 60461 74654 67054 24290
837 24290 66691 102224 113679 111303 80315 99512 57977 57865 105739 136515 115105 17167 68
824 68 35115 113894 121504 133488 36462 44772 101632 53750 37056 56862 94284 104978 127993
811 127993 150359 127853 51390 31796 28744 45847 41295 83727 44294 9439 -2277 21449
799 21449 66992 109686 102942 96395 108511 101195 118919 97456 69639 74862 64266 24387 -33942
786 -33942 -49212 -55411 633 93543 129512 113978 82686 109704 147554 111152 98136 107996
774 107996 93508 35622 10872 8996 31708 13026 -28869 30187 57613 31086 -17254 -19781
762 -19781 6668 55246 28076 11968 -6556 -13265 44088 35619 -39985 -51271 51730 124987
750 124987 118810 134970 46777 46488 70635 63505 22294 7610 29758 94316 111758 65992 99665
737 99665 117963 90963 75187 63353 90785 46622 68320 131010 163887 174584 142520 116459
725 116459 65076 -14311 -22714 -45641 919 -8274 9120 -767 -4566 11419 18899 -6836 30825
712 30825 33510 26682 4258 22513 50561 105695 141417 54644 1252 -9927 38379 82489
700 82489 103276 171518 132477 40026 -55824 -12996 53979 57922 32601 52227 54049 96224
688 96224 87801 44845 70374 34371 -955 15813 33875 9581 82568 96320 74477 20160
676 20160 -11981 -4992 -63405 -31788 34306 59253 73395 101876 98034 20847 19827 52222 95486
663 95486 80446 44193 -5860 -44610 31610 119568 114178 95507 59268 63709 54086 57555 46863
650 46863 31055 -8524 -4524 -38223 -58077 -58087 -76098 -64137 -7599 41117 73711 58058 31456
637 31456 65640 99177 157876 187737 93594 77578 127584 126379 102859 133867 150082 182322
625 182322 200325 148622 74467 43971 66425 90783 68537 121229 114604 82457 144669 113868
613 113868 112742 94788 77172 126800 174970 194446 162478 98023 101032 132332 101315 55843
601 55843 95766 97362 64369 35837 76743 91678 43268 49564 74069 -19774 -66821 -37964
589 -37964 32403 20773 18621 3426 22213 5420 -25213 2027 8430 4759 15159 38998 9551
576 9551 40447 94099 97646 104472 98110 123673 99566 54331 63665 30290 -4125 1009 28468
563 28468 43729 80106 90043 114837 136890 176596 237982 243167 220805 152726 25693 18151
551 18151 26032 17046 45943 68301 67640 83245 130687 132386 62404 7322 35219 71098 47201
538 47201 60197 33674 -1820 5268 7376 29244 81638 131568 56101 -8124 11160 6753 4112
525 4112 22798 82466 42310 17624 -35021 -42128 59728 155645 118519 37457 -11313 14504
513 14504 42912 54784 79615 105449 25940 -10758 42903 63325 25284 44528 -16711 -22063
501 -22063 25899 78520 163596 182495 139932 105318 92381 110538 102656 71751 32335 4222
489 4222 59773 22068 27614 62575 39558 32850 32136 62330 146987 138362 61161 49149 99966
476 99966 91016 50427 64197 51287 74372 113565 90416 48927 47380 62813 139711 162492
464 162492 157436 152682 190404 210678 196785 170554 110807 76586 111835 105835 97286 83507 9054
451 9054 29950 21987 -15989 -46787 -19171 -6595 -4528 49543 43840 18573 66327 94932 45277
438 45277 17874 -1165 35299 39966 39709 1412 13743 24134 -14275 -46871 -91315 -22945 37539
425 37539 17983 -21212 28575 57333 109397 132558 121020 112831 77626 25475 64248 28400
413 28400 -8543 -35194 5933 -30926 -54961 -4360 41316 33081 12015 42952 84069 79002
401 79002 43952 58253 114420 110054 89269 65839 108942 115904 120777 35809 4364 20732 4421
388 4421 53762 27073 46358 42347 49175 54256 50852 55851 65507 50440 -27254 8031 44630
375 44630 41197 60565 35623 49649 87640 58465 46187 18869 40995 -12458 15888 75765
363 75765 112769 115979 145148 107528 85155 77036 33239 22768 -4313 -11457 4490 -2560 -63651
350 -63651 -25936 -21339 10225 50594 37933 16334 4471 -25986 -16621 34613 67576 70453 56586
337 56586 36452 27999 -14626 -8311 -39369 -41102 -16167 -1507 5168 19907 21174 36830 51374
324 51374 98796 170607 198555 165610 140270 107732 89313 49726 48186 6386 53404 137240
$$ [...]
##END NTUPLES=NMR SPECTRUM
##END=
