##TITLE=Analysis number 328768
Compound Code cc 62701
Book Reference 521/85
Project Code adrs
Chemist Name evam
##JCAMPDX= 6.0         $$ Bruker NMR JCAMP-DX V2.0
##DATA TYPE= NMR SPECTRUM
##DATA CLASS= NTUPLES
##ORIGIN= Bruker BioSpin GmbH
##OWNER= nmr
$$ XWIN-NMR		Version 3.5
$$ Mon Jul  2 14:22:56 2007 GMT Daylight Time (UT+1h)  MAYBRIDGE\nmr@NMR_250MHZ
##.OBSERVE FREQUENCY= 250.131544655141
##.OBSERVE NUCLEUS= ^1H
##.ACQUISITION MODE= SIMULTANEOUS (DQD)
##.ACQUISITION SCHEME= undefined
##.AVERAGES= 16
##.DIGITISER RES= 18
##SPECTROMETER/DATA SYSTEM= dpx250
##.PULSE SEQUENCE= zg30
##.SOLVENT NAME= DMSO
##.SHIFT REFERENCE= (INTERNAL, DMSO, 0, 16.522)
##AUDIT TRAIL= $$ (NUMBER, WHEN, WHO, WHERE, WHAT)
$$ ##TITLE= Audit trail, XWIN-NMR		Version 3.5
$$ ##JCAMPDX= 5.01
$$ ##ORIGIN= Bruker BioSpin GmbH
$$ ##OWNER= nmr
$$ C:\u/data/dgb/nmr/ADRS/170/pdata/1/auditp.txt
$$ ##AUDIT TRAIL=  $$ (NUMBER, WHEN, WHO, WHERE, WHAT)
(   1,<2007-07-02 14:22:16.77 +100>,<MAYBRIDGE\nmr>,<NMR_250MHZ>,
      <created by zg, POWCHK disabled, PULCHK disabled
       configuration hash MD5:
       76 6E 9A 78 1E 09 19 81 EC 84 63 8F B0 6A 59 2D
       data hash MD5: 64K
       D4 25 BB 5A D6 E5 A2 1A 39 A8 6B 0A 5A 65 66 12>)
(   2,<2007-07-02 14:22:39.76 +100>,<MAYBRIDGE\nmr>,<NMR_250MHZ>,
      <Start of raw data processing
       ef LB = 0.3 FT_mod = 6 PKNL = 1 SI = 32K 
       data hash MD5: 32K
       5E 95 BD A7 2D 42 E7 11 F3 E8 98 A2 02 C6 89 25>)
(   3,<2007-07-02 14:22:41.96 +100>,<MAYBRIDGE\nmr>,<NMR_250MHZ>,
      <apk 
       data hash MD5: 32K
       5B 4D 39 0C 0B A0 5F 99 77 FB 09 38 4A 7B 83 85>)
(   4,<2007-07-02 14:22:43.51 +100>,<MAYBRIDGE\nmr>,<NMR_250MHZ>,
      <abs ABSG = 5 
       data hash MD5: 32K
       7F E9 6B D4 B9 AD 10 02 06 5C 94 24 33 6B 62 B8>)
$$ ##END=
$$ 
$$ hash MD5
$$ C6 70 BF B9 B0 12 FB B9 33 1A 28 12 59 40 40 A7
##$RELAX= 
##$RELAX= 
##$RELAX= 
##$RELAX= 
##$RELAX= 
##$RELAX= 
##$RELAX= 
$$ Bruker specific parameters
$$ --------------------------
##$DU= <C:\u>
##$EXPNO= 170
##$NAME= <ADRS>
##$PROCNO= 1
##$TYPE= <nmr>
##$USER= <dgb>
##$AMP= (0..31)
100 100 100 100 100 100 100 100 100 100 100 100 100 100 100 100 100 100 
100 100 100 100 100 100 100 100 100 100 100 100 100 100 
##$AQSEQ= 0
##$AQ_mod= 3
##$AUNM= <au_zg>
##$AUTOPOS= <36 >
##$BF1= 250.13
##$BF2= 250.13
##$BF3= 250.13
##$BF4= 250.13
##$BF5= 500.13
##$BF6= 500.13
##$BF7= 500.13
##$BF8= 500.13
##$BYTORDA= 1
##$CFDGTYP= 0
##$CFRGTYP= 5
##$CHEMSTR= <none>
##$CNST= (0..31)
1 1 145 1 1 1 1 1 1 1 1 1 1 1 1 1 1 1 1 1 1 1 1 1 1 1 1 1 1 1 1 1 
##$CPDPRG= <>
##$CPDPRG1= <>
##$CPDPRG2= <>
##$CPDPRG3= <>
##$CPDPRG4= <mlev>
##$CPDPRG5= <mlev>
##$CPDPRG6= <mlev>
##$CPDPRG7= <mlev>
##$CPDPRG8= <mlev>
##$CPDPRGB= <>
##$CPDPRGT= <>
##$D= (0..31)
0 1 0 0 0 0 0 0 0 0.06 0 0 0 0 0 0 0.0002 0 0 0 0 0 0 0 0 0 0 0 0 0 0 
0 
##$DATE= 1183382535
##$DBL= (0..7)
120 120 120 120 120 120 120 120 
##$DBP= (0..7)
150 150 150 150 150 150 150 150 
##$DBP07= 0
##$DBPNAM0= <>
##$DBPNAM1= <>
$$ [...]
##$SUBNAM7= <"">
##$SUBNAM8= <"">
##$SUBNAM9= <"">
##$SW= 20.6930455092707
##$SWIBOX= (0..15)
0 0 3 0 0 0 0 0 0 0 0 0 0 0 0 0 
##$SW_h= 5175.983436853
##$TD= 65536
##$TD0= 1
##$TE= 296.16
##$TE2= 300
##$TE3= 300
##$TEG= 300
##$TL= (0..7)
0 120 120 120 120 120 120 120 
##$TP= (0..7)
150 150 150 150 150 150 150 150 
##$TP07= 0
##$TPNAME0= <>
##$TPNAME1= <>
##$TPNAME2= <>
##$TPNAME3= <>
##$TPNAME4= <>
##$TPNAME5= <>
##$TPNAME6= <>
##$TPNAME7= <>
##$TPOAL= (0..7)
0.5 0.5 0.5 0.5 0.5 0.5 0.5 0.5 
##$TPOFFS= (0..7)
0 0 0 0 0 0 0 0 
##$TUNHIN= 0
##$TUNHOUT= 0
##$TUNXOUT= 0
##$USERA1= <user>
##$USERA2= <user>
##$USERA3= <user>
##$USERA4= <user>
##$USERA5= <user>
##$V9= 5
##$VALIST= <valist>
##$VCLIST= <CCCCCCCCCCCCCCC>
##$VD= 0
##$VDLIST= <DDDDDDDDDDDDDDD>
##$VPLIST= <PPPPPPPPPPPPPPP>
##$VTLIST= <TTTTTTTTTTTTTTT>
##$WBST= 1024
##$WBSW= 4
##$XGAIN= (0..3)
0 0 0 0 
##$XL= 0
##$YL= 0
##$YMAX_a= 454960
##$YMIN_a= -307494
##$ZGOPTNS= <>
##$ZL1= 120
##$ZL2= 120
##$ZL3= 120
##$ZL4= 120
##$ABSF1= 16.522
##$ABSF2= -4.171173
##$ABSG= 5
##$ABSL= 3
##$ALPHA= 0
##$AQORDER= 0
##$ASSFAC= 0
##$ASSFACI= 0
##$ASSFACX= 0
##$ASSWID= 0
##$AUNMP= <proc_1d>
##$AZFE= 0.1
##$AZFW= 0.1
##$BCFW= 0
##$BC_mod= 0
##$BYTORDP= 0
##$COROFFS= 0
##$CY= 12.5
##$DATMOD= 1
##$DC= 0
##$DFILT= <>
##$DTYPP= 0
##$F1P= 14.0000005364418
##$F2P= -0.99999901652339
##$FCOR= 0.5
##$FTSIZE= 32768
##$FT_mod= 6
##$GAMMA= 0
##$GB= 0
##$INTBC= 1
##$INTSCL= 1
##$ISEN= 128
##$LB= 0.3
##$LEV0= 0
##$LPBIN= 0
##$MAXI= 10000
##$MC2= 0
##$MEAN= 0
##$ME_mod= 0
##$MI= 0
##$NCOEF= 0
##$NC_proc= -3
##$NLEV= 6
##$NOISF1= 0
##$NOISF2= 0
##$NSP= 0
##$NTH_PI= 0
##$NZP= 0
##$OFFSET= 16.522
##$PC= 1
##$PHC0= -63.2485
##$PHC1= 7.237264
##$PH_mod= 1
##$PKNL= yes
##$PPARMOD= 0
##$PSCAL= 4
##$PSIGN= 0
##$REVERSE= no
##$SF= 250.13
##$SI= 32768
##$SIGF1= 0
##$SIGF2= 0
##$SINO= 400
##$SIOLD= 32768
##$SREGLST= <1H.DMSO>
##$SSB= 0
##$STSI= 32768
##$STSR= 0
##$SW_p= 5175.98343685301
##$SYMM= 0
##$S_DEV= 0
##$TDeff= 65536
##$TDoff= 0
##$TI= <Analysis number 999999
Compound Code 99
Book Reference 9
Project Code 9>
##$TILT= no
##$TM1= 0
##$TM2= 0
##$TOPLEV= 0
##$USERP1= <user>
##$USERP2= <user>
##$USERP3= <user>
##$USERP4= <user>
##$USERP5= <user>
##$WDW= 1
##$XDIM= 32768
##$YMAX_p= 314725633
##$YMIN_p= -113576
$$ End of Bruker specific parameters
$$ ---------------------------------
##NTUPLES= NMR SPECTRUM
##VAR_NAME=  FREQUENCY,     SPECTRUM/REAL,   SPECTRUM/IMAG
##SYMBOL=    X,             R,               I
##VAR_TYPE=  INDEPENDENT,   DEPENDENT,       DEPENDENT
##VAR_FORM=  AFFN,          ASDF,            ASDF
##VAR_DIM=   32768,         32768,           32768
##UNITS=     HZ,            ARBITRARY UNITS, ARBITRARY UNITS
##FACTOR=    0.157963299565203, 1,           1
##FIRST=     4132.6476996994, 0,             0
##LAST=      -1043.33573715361, 0,           0
##MIN=       -1043.33573715361, -113576,     0
##MAX=       4132.6476996994, 314725633,     0
$$ Real data points
##PAGE= N=1
##DATA TABLE= (X++(R..R)), XYDATA
$$ [...]
16351A061j6718j6181j0057J7397O770J5802J2780m287j8287k1505R295K5318
16339A388J3372n872j5785o389j0156O876O961J7761Q700j4905J4476m1835q731
16326c4139J7853j147l075P900J9092p532j2689J289J2051R058m513j8679l965
16313a8496J1724j1555j6067Q613P063j0337J2059K8993R238j3924l77M537n367
16300F104j0228n622J407k6787j327J7836n129M44P676J89j9429L506m604m911
16286d0875J959J3307K5097K954j3598J8438K1177J720r104r326l2704j6456K4656
16273a2755J293K983j1748M809J5045j4970J0826p525M723k312J0765j6245K232
16260a2879r692n474R096l951J3471j2113j2398P170k980r186J5754m850j4131
$$ plain form
16351 1061 -15657 -31838 -41895 -24498 -17728 -1926 10854 6567 -11720 -33225 -23930 1388
16339 1388 14760 8888 -6897 -13286 -23442 -16566 -9605 8156 16856 1951 16427 -25408 -34139
16326 -34139 -16286 -17433 -20508 -12608 6484 -1048 -13737 -12448 -397 8661 4148 -14531 -18496
16313 -18496 -6772 -18327 -34394 -25781 -18718 -29055 -16996 11997 21235 7311 6934 11471 6104
16300 6104 -4124 -9746 -8339 -35126 -36453 -18617 -23746 -23302 -15626 -15437 -34866 -31360 -35964 -40875
16286 -40875 -38916 -25609 -512 2442 -11156 7282 28459 30179 21075 11749 -20955 -37411 -12755
16273 -12755 -11462 -8479 -20227 -15418 -373 -15343 -4517 -12042 -7319 -9631 1134 -15111 -12879
16260 -12879 -22571 -28045 -18949 -22900 -9429 -21542 -33940 -26770 -29750 -38936 -23182 -28032 -42163
16247d2163q394j707J4869k7176L4400M327l7933R704K5519K840R198J7955M065
16234E504j0688L744Q795k542q576j7420O869K0388J0973k5091k6716r128K4685
16221a9203p536j8231M367R251K3403k4049K741L0693p145J1666j2082q638k183
16208a6946m313R321K5487o452m7223K3017J9627M424K5171j864k1439k8465j6304
16195c5959j1754J3644L7670m707q154R054P439r344r365P786j0380j2203k176
16182b8449J9213N653n333R434j0102j1920J4871j016R712O294P164J8188k743
16169C0966j3592m85o355l934L3069j387m1856l2562L346K0146R222J4485k0263
16156i200m1517k8179J4622K8510R203j4338p800K3031J5712q588k7373k1376
$$ plain form
16247 -42163 -50557 -52264 -37395 -64571 -30171 -25844 -63777 -54073 -28554 -25714 -16516 1439 5504
16234 5504 -5184 -1440 7355 4813 -3763 -21183 -14314 6074 17047 -8044 -34760 -43888 -19203
16221 -19203 -26739 -44970 -40603 -31352 -7949 -31998 -29257 1436 -5709 5957 -6125 -14763 -16946
16208 -16946 -21259 -11938 13549 7097 -40126 -17109 2518 6942 32113 30249 8810 -19655 -35959
16195 -35959 -47713 -34069 3601 -1106 -9260 -206 7233 -2111 -11476 -3690 -14070 -26273 -28449
16182 -28449 -9236 -3583 -8916 518 -9584 -21504 -6633 -7649 2063 8357 15521 33709 30966
16169 30966 17374 16889 10534 6600 39669 38282 -3574 -36136 -32790 -12644 -3422 11063 -9200
16156 -9200 -50717 -78896 -64274 -35764 -26561 -40899 -48699 -25668 -9956 -18544 -45917 -67293
16144f7293M563L6167L8901J9220j2517j9167J8305k6813k1351j5639J6323K63
16132b9038k4282R558J1208J1315j3498P935L035j111J3102l6176k9096q475k209
16119h7732J7331L4332K9345k1167j5168R126Q108J2194K894K423k3955P523J8818
16106e928J161j6189M414j5460j0797l3997N186L4186K2448K5317K0939k8819
16094B461p885J0630L261j7343J566Q126J1189J6546k512m0302j4127l132R087
16081b2435k8016j4208J5174M0574J5131j2421j0950K659P307K4139j1795k0739
16069a5580j4757o264L567K529Q962J4411J918n742J4731j7036J567P570j3069
16056a7193p243J1496K5958o485p188j5331j111O786j4332m501K0227K3066l0901
$$ plain form
16144 -67293 -62730 -26563 12338 31558 19041 -126 18179 -8634 -29985 -45624 -29301 -29038
16132 -29038 -53320 -43762 -32554 -21239 -34737 -26802 -23767 -24878 -11776 -47952 -77048 -85523 -87732
16119 -87732 -70401 -36069 -6724 -27891 -43059 -33933 -25825 -13631 -10737 -8314 -32269 -24746 -5928
16106 -5928 -4767 -20956 -16542 -32002 -42799 -76796 -71610 -37424 -14976 10341 31280 2461
16094 2461 -5424 5206 8467 -8876 -7310 816 12005 28551 26039 -14263 -28390 -31522 -22435
16081 -22435 -50451 -64659 -49485 -8911 6220 -6201 -17151 -14492 -7185 16954 5159 -15580
16069 -15580 -30337 -36601 -33034 -30505 -21543 -7132 -5214 -10956 3775 -13261 -11694 -4124 -17193
16056 -17193 -24436 -12940 13018 6533 -655 -15986 -17097 -10311 -24643 -29144 -8917 14149 -16752
16043a6752j7929k4918Q273O563k9791m065L7846j620j2012j1382l84J5728J6876
16030c3567K5188j621l4510L07j5364K0000J9145j7961p035j2405j668o092Q26
16017f4757L0839J5544l867j8658j669N085j6231J6869M1123k360r029K5231j3285
16004D835O398l981l0004j9202L0295M0034m652l3780k4556R835R921R253K4705
15991A9101l567k5018j5113k3050K8550K5709q090j1755J11K0874j953k5806q335
15978b8342J4665J5701P98j0484J5762j017j7727j9180J77L3310m518J5401j3124
15965A422j5265r160J0143J3020M684J729j5864j4021J0956J2431N199L7354J004
15952D3632K971l2507l351k7795O16J0670K4092M984j7945j627J9347k602q721
$$ plain form
16043 -16752 -34681 -59599 -51326 -44763 -74554 -78619 -40773 -42393 -54405 -65787 -66171 -50443 -33567
16030 -33567 -8379 -10000 -44510 -44203 -59567 -39567 -20422 -38383 -45418 -57823 -59491 -65583 -64757
16017 -64757 -33918 -18374 -22241 -40899 -42568 -37483 -53714 -36845 4278 1918 -7111 18120 4835
16004 4835 11233 7252 -22752 -41954 -11659 28375 23723 -10057 -34613 -24778 -14857 -5604 19101
15991 19101 15534 -9484 -24597 -47647 -19097 6612 -1478 -13233 -13122 7752 5799 -20007 -28342
15978 -28342 -13677 2024 2822 -7662 8100 7083 -10644 -29824 -29647 3663 -855 14546 1422
15965 1422 -13843 -23003 -12860 160 4844 6573 -9291 -23312 -12356 75 5274 42628 43632
15952 43632 46603 14096 10745 -17050 -16434 -5764 18328 23312 5367 3740 23087 20485 11764
15939A1764J580k3420j1506J2426p935K1311J2823N564o238p094O150q135o092
15926A198j8928l9269Q639J0815l2999J6023M0147M2857j1397q869k6349k4524
15914d2656l865R477J5966K041L457N664M696K3992K8342J3941l515l7947k8244
15901h651k0155K4983L4165j4666k8950k563K8507N610q507r924j8397j1425N697
15888b4276J0264J4865n501K776L759j7731k3925o090J3345J2062K4046o475j5842
15875a8723O332j5432j9533J6280J2891k1379j0958J4135Q468J9728J3054K924
15863G787J3178m756j7221l1404q336o646K5595Q374j0077k093J2864k4790n442
15850d2967K288K071K4k1108L1703K5050q086m484J1053k372J4246J1027M075
$$ plain form
15939 11764 13344 -10076 -21582 -9156 -17091 4220 17043 22607 16369 9275 15425 7290 1198
15926 1198 -17730 -56999 -48360 -37545 -70544 -54521 -14374 28483 17086 8217 -18132 -42656
15914 -42656 -46521 -37044 -21078 -19037 -15580 -9916 -5220 18772 47114 61055 57540 19593 -8651
15901 -8651 -28806 -3823 30342 15676 -13274 -15837 12670 18280 9773 -151 -18548 -29973 -24276
15888 -24276 -14012 853 -4648 -1872 1887 -15844 -39769 -45859 -32514 -20452 3594 -2881 -18723
15875 -18723 -12391 -27823 -47356 -31076 -18185 -39564 -50522 -36387 -27919 -8191 4863 7787
15863 7787 20965 16209 -1012 -32416 -40752 -47398 -21803 -13429 -23506 -25599 -12735 -37525 -42967
15850 -42967 -40679 -38608 -38584 -59692 -27989 -2939 -11025 -15509 -4456 -6828 7418 18445 22520
15837B2520J3101j5935q376P848j8968K554r409m620J1703J0302q503j7955j2354
15824b8092K4302K7329j3677j955o296p21k4032j493K2947k7076n4956Q154N7979
15811a7587K6193R379J2166m299q372j5888j1723j2743J3043J6878J0035j4065
15799C017k3674K4203K6760m544J1955j2092l4555k9728j0816L079J2710J6660
15787a7025J2073j0226M30k4355J7719L1986l035j126j2390k1792n00K4593n618
15774i266j3540J8513m129j053L7005k526k8503l87j8314J2004K6966j6234N610
15761F146J6592j6721j652j0827k220j1398K5343p425j5969k600K8871J5593l2016
15748h283k3425j7636K3914K5896j7163K1672J0932j0469j0362j4278M246j342
$$ plain form
15837 22520 35621 19686 11310 19158 190 2744 -6665 -11285 418 10720 2217 -15738 -28092
15824 -28092 -3790 23539 9862 7907 1611 890 -23142 -24635 -1688 -28764 -83720 -75566 -17587
15811 -17587 8606 17985 30151 25852 17480 1592 -10131 -22874 -9831 7047 17082 3017
15799 3017 -20657 3546 30306 25762 37717 25625 -8930 -38658 -49474 -46395 -33685 -17025
15787 -17025 -4952 -15178 -14748 -39103 -21384 10602 7567 6441 -5949 -27741 -28241 -3648 -9266
15774 -9266 -22806 -4293 -8422 -9475 27530 25004 -3499 -3886 -22200 -10196 16770 536 6146
15761 6146 22738 6017 4365 -6462 -8682 -20080 5263 -2162 -18131 -20731 8140 23733 -8283
15748 -8283 -31708 -49344 -25430 466 -16697 4975 15907 5438 -4924 -19202 -14956 -16298
15736a6298l177J3520J6792l611n471j580l2319o41J8398j1348j9573k8586q509
15723h2403J8867J666L0676K231j4320R762K29J4889K2220n932J6801j0710P097
15710A1073P061j9406k2990M968M084p201j0894j2169n011l539J2114J4468j3106
15697d0548j2389k5394M385L5796j95q354j334J4583J7320J5442m526o509J0726
15684i97Q210O006j8669j1657r73n583L6343L263J0120n983r078K1140L233j0465
15670B4910o945j0018q290j3944J3019J1284o289l2021l269L1307N956J0997J95
15657A6892p771m2970k7938Q233J0509L440j3066K7985K2626j1438j9109M953
15645b7654L998j5618J1941L0152j2225K5828J6032p484l3726l526J578m228r635
$$ plain form
15736 -16298 -19475 -5955 10837 7226 1755 175 -32144 -32785 -14387 -25735 -45308 -73894 -82403
15723 -82403 -63536 -61870 -31194 -28963 -43283 -33521 -33292 -18403 3817 -2115 14686 3976 11073
15710 11073 18134 -1272 -24262 -19294 -15210 -22411 -33305 -45474 -50485 -54024 -41910 -27442 -40548
15697 -40548 -52937 -78331 -73946 -38150 -38345 -46699 -48033 -33450 -16130 -688 -5214 -11723 -997
15684 -997 7213 13219 -5450 -17107 -18080 -23663 12680 15943 26063 20080 11002 32142 35375 24910
15670 24910 17965 7947 -343 -14287 -1268 10016 3727 -28294 -31563 -256 5700 16697 16892
15657 16892 9121 -33849 -61787 -53554 -43045 -39605 -52671 -24686 -2060 -13498 -32607 -27654
15645 -27654 -23656 -39274 -27333 2819 -9406 16422 32454 24970 -8756 -12282 -10704 -14932 -24567
15632b4567K8958q018r344j2217J1843J0538j1744R295j1259k1536J5788J8051
15620d212k4265K58O137m18J0777K4815r583n204O117J8640k4727j6666j1437
15607b9768j7847J4185K6518M246R010m148j6426k641k3651j1578J8429p743j4889
15594e6303K2389m890j3737K1863M4806R048r654l2963J567J85N234j8656j363
15581c2474K4406L4178J3640m517k8137k1237K549j7910K2528r603j3014J9541
15569a0050K6813K453j2543k3544J27p220J885m038O89K9934K079l7479j178j3257
15555d5329j4241q803K3625J1499L801j1570j6194L439J1681J8921J8009o673
15543a1835j4645Q833J0913k0427l885K953Q173K8919Q601n628j1618R006J1132
$$ plain form
15632 -24567 4391 -3627 -12971 -25188 -13345 -2807 -14551 -5256 -16515 -38051 -22263 -4212
15620 -4212 -28477 -28219 -22082 -22500 -11723 13092 3509 -1695 4422 23062 -1665 -18331 -29768
15607 -29768 -47615 -33430 -6912 -2666 6344 2196 -14230 -16871 -40522 -52100 -33671 -41414 -56303
15594 -56303 -33914 -38804 -52541 -30678 14128 23176 13522 -19441 -17874 -17689 -12455 -31111 -32474
15581 -32474 -8068 26110 39750 35233 7096 -14141 -11592 -29502 -6974 -16577 -29591 -10050
15569 -10050 16763 19216 6673 -16871 -16744 -23964 -22079 -26117 -25428 4506 6585 -30894 -32072 -45329
15555 -45329 -59570 -68373 -44748 -33249 -29448 -41018 -57212 -53773 -42092 -23171 -5162 -11835
15543 -11835 -26480 -17647 -6734 -27161 -31046 -28093 -19920 8999 17600 11972 354 9360 20492
15530B0492Q164j2117R427j0787r7J0880j727k0714j0149j7410k3364K0969K1522
15517d911l5228j2500O517O324N679N130O082p933m016J8321n925q358p760L0
15503c8548j295J7587J7292j082j1051M265k2837k8566N839L8289K9766J166K1953
15490C2778k619J6747j1254k9952k0631N786Q720j2962k156K455J8088j2094J1211
15477D117K6867J3385m493k2017k3945K009J3943J5691j8124k3179k2366R36K4083
15464a3093J0596J2704K3444q350j2547J0189j118k3935k052K6718J7403j3335
15452B6624k4387k9534j587L950p442l1216l8046L6784N6767o434L0905J8537
15440C4921l3070j3395O32j5379P473O705j1744L6710j0525m0880l700J0253j1527
$$ plain form
15530 20492 28656 16539 25966 15179 15082 25962 24235 3521 -6628 -24038 -47402 -26433 -4911
15517 -4911 -40139 -52639 -46122 -39798 -34119 -28989 -22907 -30840 -34856 -16535 -22460 -30818 -38578 -38548
15503 -38548 -39843 -22256 -4964 -6046 -17097 -12832 -35669 -64235 -58396 -20107 9659 10825 32778
15490 32778 30159 46906 35652 5700 -14931 -9145 -425 -13387 -15543 -13088 5000 -7094 4117
15477 4117 30984 44369 39876 17859 -6086 -4077 9866 25557 7433 -15746 -38112 -37176 -13093
15464 -13093 -2497 10207 33651 25301 12754 22943 21825 -2110 -4162 22556 39959 26624
15452 26624 2237 -27297 -28884 -24934 -32376 -63592 -101638 -64854 -8087 -14521 16384 34921
15440 34921 1851 -11544 -10912 -26291 -18818 -12113 -23857 12853 2328 -38552 -42252 -31999 -43526
15427d3526k23k3485O737K3451M3196L150k933K031k1440l372m680J290J7907
15414a897K2185J9936n166l8984L357J2199J4097J3065j4655k5529N542o871J4770
15401A2049K5502J4873p282j5222k6203O252J2658k2281k2423j1846r407k288
15389d5618K1568L2927j8225J700L7K4422K324L579J3711J7757k2374Q778n983
15376C4603k3579J629J3795m398k696K3311K1192q068o838j8625j2411k8585J290
15363i380R75N274k2786J1590M0779J3175j0458j5893m148P519j0583L121J8282
15350B7467o814l2565j1646n35J1639L983l661o452Q707Q310M290m122j9655m82
15336b1536J7427j3225q951L968p455J0554O374j1275K3384L8148j923O11j1522
$$ plain form
15427 -43526 -43749 -67234 -60497 -37046 6150 9300 6367 8398 -13042 -16414 -21094 -19804 -1897
15414 -1897 20288 40224 35058 -3926 -569 11630 25727 38792 24137 -1392 4150 -2721 12049
15401 12049 37551 52424 45142 29920 3717 9969 22627 346 -22077 -33923 -43330 -45618
15389 -45618 -24050 8877 -9348 -7648 -7611 16811 19135 22714 36425 54182 31808 40586 34603
15376 34603 11024 12653 26448 22050 19354 42665 63857 55789 48951 30326 17915 -10670 -9380
15363 -9380 -8405 -3131 -25917 -14327 26452 39627 29169 13276 9128 16647 6064 9185 27467
15350 27467 20653 -11912 -23558 -24093 -12454 -8471 -12132 -18584 -9877 -1567 2723 -1399 -21054 -21536
15336 -21536 -4109 -17334 -26285 -22317 -29772 -19218 -12844 -24119 -735 37413 35490 36101 24579
15323B4579J76R261q367o838k2362k422J0017j339l9241k6006K6576L1853O707
15310B594j8931P116n466M360J2192l104q472m858M0273J5001K172K1119k669
15297F1327l1386j1111j4808j1956r220R007J7935j8099l016l846j112J8889l091
15284d87l3572j4817K5570L441N652K4852J5896j4908k2743l3312L3639L2781
15272B1992o574O552J5897j7695k2453Q474k2847j0301Q233J2106N254K27r969
15259a1104Q684K6850L325J4149j666j9110j4298k6642J7044K5581P98q926j6327
15246a642L1584M534l4661R334K9796J9560q603j4664j3336l6382l0634n530J2232
15233c8412L3667K0160j1741o196J4841l797n3375l1795N978K3000K4382N356
$$ plain form
15323 24579 24755 34016 25649 18811 -3551 -5973 4044 2705 -36536 -62542 -35966 -4113 2594
15310 2594 -16337 -9221 -14687 -10327 1865 -1239 -9711 -14569 25704 40705 42877 63996 61327
15297 61327 29941 18830 4022 -7934 -17154 -8147 9788 -8311 -11327 -15173 -16285 2604 -487
15284 -487 -34059 -48876 -23306 -19865 -14213 10639 26535 11627 -11116 -44428 -10789 21992
15272 21992 15418 21970 37867 20172 -2281 6193 -16654 -26955 -18722 -6616 -1362 -1135 -11104
15259 -11104 -2420 24430 27755 41904 40238 21128 6830 -19812 -2768 22813 23611 14685 -1642
15246 -1642 29942 34476 -185 9149 38945 58505 49902 35238 21902 -14480 -45114 -50644 -38412
15233 -38412 -4745 15415 3674 -2522 12319 8522 -44853 -76648 -70670 -47670 -23288 -17932
15221a7932J5932K7629P681K0429l4164n1587j2631q917m242J8130K8643L3430
15209B2401M489Q014L194j0688l8843j1162R739J5530O169k4802j5931K999O614
15196b2277K0619Q059Q376J1558j8800j8660j3210L2762K4589j1033j6718J33
15184E398k0313r935o192J1555J8023j647K522l156J0156k4278k0065N251K0941
15171a1740O5q719k518j3922l087L7610K5187l4748k5000j5236J9179K276K2881
15158g772k1939q954J3541J5282K4080N12J840j5349p926j0643l8715L5113j1569
15145c2499k178j658r621O863J0955j2631J566J4234J6914L818k0578k2426Q392
15132c8849J6218R027r829J4066K076n300j0867j6162J287M103p255K551K0889
$$ plain form
15221 -17932 -2000 25629 33310 53739 19575 -32012 -44643 -53560 -57802 -39672 -11029 22401
15209 22401 26890 34904 38098 27410 -11433 -22595 -12856 2674 8843 -15959 -31890 -28891 -22277
15196 -22277 -1658 6401 14777 26335 7535 -11125 -24335 8427 33016 21983 5265 5398
15184 5398 -14915 -24850 -31042 -19487 -1464 -3111 -589 -3745 6411 -17867 -37932 -32681 -11740
15171 -11740 -11675 -20394 -22912 -36834 -39921 -2311 22876 -11872 -36872 -52108 -32929 -30653 -7772
15158 -7772 -29711 -38665 -25124 -9842 14238 14750 16590 1241 -6685 -17328 -56043 -20930 -32499
15145 -32499 -34677 -36335 -45956 -39093 -28138 -40769 -39203 -24969 -8055 -4237 -24815 -47241 -38849
15132 -38849 -22631 -13604 -23433 -9367 -7291 -12591 -23458 -39620 -38333 -34230 -41485 -38934 -18045
15119a8045L4543L810k7371j2422K6629J0328j7174K1607k7295N084L1601O122
15107C7417m5389l3962p54J2657l0283j8858N5820M7279j2412r466J0367j485
15095A0931O554j5764O083j0081Q709L803K9321L4376j3355k2447k8681j5183
15083e734j9868o275j3264j3713p191m966j8294O650P704K1853K6299K2103n981
15070a0677K3202l5541O99L9393M8127m521m7057o463j28j040J1103l1439j6102
15057c0444k1612J2687K6869K431k4356J3398Q39J2765p378j1916J3727l540J1870
15044d660M0850N090m155j2349k2327K802J2862k588l0373K4229J9399p377N076
15031B6479l034l1035j3619N868L0118L7752K710k0344j7329k9004j2170k897
$$ plain form
15119 -18045 16498 20308 -7063 -19485 7144 17472 298 21905 -5390 -306 31295 37417
15107 37417 -7972 -41934 -42688 -30031 -60314 -79172 -23352 23927 11515 2049 12416 10931
15095 10931 17485 1721 7804 -2277 6432 10235 39556 73932 60577 38130 9449 -5734
15083 -5734 -25602 -31877 -45141 -58854 -66045 -71011 -89305 -82655 -74951 -53098 -26799 -4696 -10677
15070 -10677 12525 -23016 -22317 17076 65203 60682 13625 7162 7034 5994 17097 -14342 -30444
15057 -30444 -52056 -39369 -12500 -10069 -34425 -21027 -20188 -7423 -14801 -26717 -12990 -16530 -4660
15044 -4660 36190 41280 37125 24776 2449 5251 18113 15525 -14848 9381 28780 21403 26479
15031 26479 23445 -7590 -21209 -15341 14777 52529 55239 34895 17566 -11438 -23608 -26505
15019b6505j1022L899L4326L2280k8525l4119j1132K3641K740Q853J1500Q52j7085
15006a0297o205L482J69l4863k7269J1349L2017L0807j7581J6979L3988j3437
14994A9139j0794r17m0284m689k340j9459j4917r821J5458L0354K0655k2519O262
14981c3872M572J7634K2326J7285l133k109N278j2116K288j9236K2110J4948j2864
14968B3111k5679L018k1109n655J3304J2783K687q670q216j1544O926J2742P864
14955A562n222j5342o272K1785K5329p42k5283J121J0648k3053j5979L482l452
14942c1418o618P545M5486J234P274R961j9273k4001j8427l645l391J1412k0582
14929d4443k9035N459K8591L727J0536J9289l283n607m182l467j5124j6375M318
$$ plain form
15019 -26505 -37527 -33628 698 32978 4453 -29666 -40798 -17157 -14417 -5564 5936 6788 -10297
15006 -10297 -16502 -13020 -12851 -47714 -74983 -63634 -31617 -810 -18391 -1412 32576 19139
14994 19139 8345 7428 -32856 -37545 -39885 -59344 -74261 -84082 -68624 -38270 -17615 -40134 -33872
14981 -33872 -29300 -11666 10660 27945 24812 22703 27981 15865 18153 -1083 21027 35975 23111
14968 23111 -2568 450 -20659 -26314 -13010 -227 2460 -6210 -14426 -25970 -19044 -6302 1562
14955 1562 -3660 -19002 -25274 -3489 21840 21098 -4185 -3064 7584 -15469 -31448 -27966 -31418
14942 -31418 -38036 -30491 14995 16229 23503 33464 14191 -9810 -28237 -31882 -35273 -23861 -44443
14929 -44443 -73478 -68019 -39428 -35701 -25165 -5876 -9159 -14766 -18948 -22415 -37539 -53914 -49596
14916d9596p54J8943K9579r104j05K9278J6194q736j273J719j9145k6320J5388
14903c932m749K0763q770K836j5165k0227l252P677O962O303k357J4145j3314
14890a3080l6004k1149K9880K9081K2045j4016J069O579m006P479K292j3130J3878
14877A0918J0582R129j1232P865q30j4229j0184j9622P999k593q509K2929J9199
14864B1422j9231l6954j1610o384L083K1292j754L803N639K2596n672j9138J894
14851b1014r262M460R560P563j0100K2093j8254j0994n4L5423j6182q144L901
14838a1004l7201q905R524K2650M684q75K9544r759m2148j2523K3318J0982K4408
14825B695J7671j7525o579O090Q15k5642l604o759j4406K5693N384j2998j4051
$$ plain form
14916 -49596 -50350 -31407 -1828 -10932 -11037 18241 34435 25699 24426 26145 7000 -19320 -3932
14903 -3932 -8681 12082 3312 6148 -9017 -29244 -32496 -24819 -17857 -11554 -13911 234 -13080
14890 -13080 -49084 -70233 -40353 -11272 10773 -3243 -2174 4405 399 7878 10170 -2960 10918
14877 10918 21500 30629 19397 27262 26432 12203 2019 -17603 -9604 -12197 -20706 2223 21422
14864 21422 2191 -34763 -46373 -52757 -49674 -28382 -30136 -26333 -20694 1902 -3770 -22908 -21014
14851 -21014 -30276 -25816 -16256 -8693 -18793 3300 -14954 -25948 -26002 9421 -6761 -14905 -11004
14838 -11004 -48205 -57110 -47586 -24936 -20252 -21127 8417 -1342 -43490 -56013 -32695 -21713 2695
14825 2695 20366 2841 -3738 2352 3167 -22475 -26079 -32838 -47244 -21551 -16167 -29165 -43216
14812d3216K4616J7116K0226K1590l555k3908k3363k636n84K982j8097p482K800
14799c3511n062m798M432J2052J2222j0411k3096q832Q080J6283k308R66l294
14786c7277J1240K747n58K0089N946j6927l1840j802K4650J8597J105k0652k0647
14773d5329j8267K3619J7076J2960P00K0087K56k4983m05J9338j5766j8770r641
14760c9125K4409R620j3857l4712q303K7507P680q543J0844j1172K4350J7938
14748F636r505k0787R273N711J2011p984k8527J6266K9777L794j11o043k1732
14735a1221o634Q912k505j6300j4997K045L423m998K1222N168j6842J0919J7717
14722d091j400N585L527q349L926K4936J142m60P457k8105P514N606R298j3243
$$ plain form
14812 -43216 -18600 -1484 18742 40332 36777 12869 -10494 -13130 -13714 -10732 -28829 -36311 -33511
14799 -33511 -38573 -43371 -38939 -26887 -14665 -25076 -48172 -57004 -48924 -32641 -34949 -33983 -37277
14786 -37277 -26037 -23290 -23848 -3759 2187 -14740 -46580 -48382 -23732 -5135 -4030 -24682 -45329
14773 -45329 -63596 -39977 -22901 -9941 -9241 10846 11102 -13881 -14286 5052 -10714 -29484 -39125
14760 -39125 -14716 -5096 -18953 -53665 -61968 -34461 -26781 -35324 -24480 -35652 -11302 6636
14748 6636 -2869 -23656 -14383 -8672 3339 -4645 -33172 -16906 12871 16665 16554 10511 -11221
14735 -11221 -17855 -8943 -11448 -27748 -42745 -40700 -37277 -42275 -21053 -15885 -32727 -21808 -4091
14722 -4091 -5491 94 3621 -4728 -802 24134 25276 24816 32273 4168 11682 17288 26586 13343
14708A3343m0108J629K328M503R250K4722J3345l618l703K160n481p176P706n550
14694A3350j5998p878n950j766K2238L975j6126j1186l639L723j6639j9325K7699
14681b7522L4566K7286K403l6942n1525l2678K5861n637J3658R503J9674J7051
14669d302J0900M134r993l9359j2291J0704l030r205J3729J6481L411J5592m264
14656g493j1676r637k5702k0249J8916K3877k0159j7145O791J4617J5082m917
14644c7695m5K6906J9923k2051P598K4534J2645J2458L0291m045k5992k9882P223
14631B1868L80j2990k4j0923L297m07k3499j689J8975q016O450o158j9362k860
14617c4958K9669O961k7000j345K3194L2410j8211o771j180l025q253j9600l1471
$$ plain form
14708 13343 -26765 -25136 -22808 -18305 -9055 15667 29012 25394 21691 23851 18370 11194 18900 13350
14694 13350 -2648 -10526 -16476 -18242 3996 7971 -8155 -19341 -22980 -19257 -35896 -55221 -27522
14681 -27522 7044 34330 36733 -209 -51734 -84412 -58551 -64188 -50530 -41027 -21353 -4302
14669 -4302 6598 10732 739 -38620 -50911 -40207 -43237 -52442 -38713 -22232 -18821 -3229 -7493
14656 -7493 -19169 -28806 -54508 -74757 -55841 -31964 -52123 -69268 -62477 -47860 -32778 -37695
14644 -37695 -37740 -10834 9089 -12962 -5364 19170 31815 44273 74564 70519 44527 14645 21868
14631 21868 22248 9258 9234 -1689 1608 1201 -22298 -23987 -5012 -13028 -6578 -12736 -32098 -34958
14617 -34958 -5289 1672 -25328 -26673 -3479 28931 10720 3949 2769 -256 -8509 -28109 -59580
14604e9580K0349J708J8771J2655j1106p915J969j7346m731N603N120p566N802
14591c6267K9797P629j908j0293j6027K226L573k0686l0978K0296L9253k140o85
14578a6210l825j8207L8258j959K144J4524J1987K456k1934j8283J5814J5814
14566B0579P266l2955p39p166p992p893K1084K5977K3174k5377r525J563K1704
14553B9700p706o02q697j1948j1120m06K805R332n300k981o746j5611k44K0560
14539h964j5662k4242j8678l089L1903K5699P489j8343k9667J872M4139L4775
14527B7232J411m291j1359j0502J6848R318k4084j7126q499k6773J3161L4557
14515a07M872L587L6979R588n7398l1345J1035J222N080k45K4391m677J4524K6253
$$ plain form
14604 -59580 -39231 -37523 -18752 -6097 -17203 -25118 -23149 -40495 -45226 -39623 -34503 -42069 -36267
14591 -36267 -6470 1159 -749 -11042 -27069 -24843 -21270 -41956 -72934 -52638 -13385 -15525 -16210
14578 -16210 -20035 -38242 16 -1943 201 14725 26712 29168 7234 -11049 4765 20579
14566 20579 27845 -5110 -5849 -13015 -21007 -28900 -7816 18161 41335 15958 6433 7996 29700
14553 29700 21994 21392 12695 747 -10373 -10779 -7974 1358 -3942 -6923 -13669 -29280 -29524 -8964
14539 -8964 -24626 -48868 -67546 -70635 -38732 -13033 -5544 -23887 -53554 -51682 -7543 27232
14527 27232 28643 24352 12993 2491 19339 28657 4573 -12553 -21052 -47825 -34664 -107
14515 -107 4765 8352 45331 54919 -2479 -33824 -22789 -21567 -16487 -16732 7659 2982 17506 43759
14501D3759j4272k1321K660l080k3441o843R475p349p67Q481K2679J0434l050
14488A7365O545o416k5657o098k246M281M396J2811O362J051k1646J5029O949
14475A2726o524k155j5028J671K504K3745N916l0926j9607K444R171P908l0526
14462c8681k5144O671j6126n549k56P15J2917r620L3736Q544j0912J0407r698
14449d2996j3760J8636K3187L659j358m912J4823P002j623N1O232J4440j5599
14436G782J0289O3o929j3793j0721j1250N515l990N844j3930J2715J7087Q753
14423G435L685k4131o685N312L460k425j1986R233r685P526L281k2354K484p377
14409d2227q93J4029M0013j5120m8266p201J8369K3252J7687P775L049J0422j7970
$$ plain form
14501 43759 29487 8166 10826 7746 -15695 -22538 -13063 -20412 -21179 -12698 9981 20415 17365
14488 17365 23910 17494 -8163 -14261 -16507 -12226 -7830 4981 11343 12394 -9252 5777 12726
14475 12726 6202 4047 -10981 -9310 -6806 16939 22855 -8071 -27678 -25234 -16063 -8155 -38681
14462 -38681 -63825 -57154 -73280 -78829 -79085 -78370 -65453 -75073 -41337 -32793 -43705 -33298 -42996
14449 -42996 -56756 -38120 -14933 -11274 -12632 -17544 -2721 4281 2658 2709 8941 23381 7782
14436 7782 18071 18134 11205 -2588 -13309 -24559 -19044 -23034 -17190 -31120 -18405 -1318 7435
14423 7435 11120 -13011 -19696 -14384 -10924 -13349 -25335 -16102 -25787 -18261 -14980 -37334 -34850 -42227
14409 -42227 -43120 -29091 10922 -4198 -52464 -59665 -41296 -18044 -357 7418 10467 20889 2919
14396B919j1942p464j361O413J0670n654o646O755J2234k1792j5347j158J3644
14383a8729m180j6367Q538o611j1759K032J9350L2068J9305J2286K240j3877j0782
14370A3514M09J2264J2742J4028j8856L490J3284j1541j5803k3721j8909J8518
14358e81J536J3271N544j2520Q123k0961j0234K925j2870l894N27j6057J1413
14345c3778J9496j0080q887k238K3258M731l1588L110q75L460J7266j2630q673
14332c7428j4451J3348K2492J9443J5162J1272q374k315j1195l5984J1756k617
14320a8891r290j0452o875K8573J0752k2005K5096J1405k366k2304L750m192j6952
14307c3751N561K9365R377K248j1349j1520R017K7646K3506J8729l2136k0059
$$ plain form
14396 2919 -9023 -16487 -17848 -11435 -765 -6419 -13065 -6310 5924 -15868 -31215 -32373 -18729
14383 -18729 -22909 -39276 -30738 -37349 -49108 -47076 -27726 4342 23647 35933 38173 24296 13514
14370 13514 13923 26187 38929 52957 34101 37591 50875 39334 23531 -190 -19099 -581
14358 -581 955 14226 19770 7250 15373 -5588 -15822 -12897 -25767 -29661 -29134 -45191 -33778
14345 -33778 -14282 -24362 -33249 -35487 -12229 -7498 -39086 -35976 -36851 -33391 -16125 -28755 -37428
14332 -37428 -51879 -38531 -16039 3404 18566 29838 21464 19149 7954 -28030 -16274 -18891
14320 -18891 -28181 -38633 -45508 -16935 -6183 -28188 -3092 8313 5947 -16357 -12607 -16799 -33751
14307 -33751 -28190 1175 10552 12800 1451 -10069 -1052 26594 50100 68829 36693 16634
14295A6634j7696L331k196n112o629q152R016J3977j8271l984k55j1761l321L1993
14281b426L9568k50j0167j7878m6520l8661K0957J3262j8692R840J0719p753K040
14268d5961p628o744M9308K3526J7212K2415P951q280l7690j3249M655M261J312
14255A1088M93P705O280K605N716p735j7731l4010j0311J7175M7153j2530j3030
14242B868J110J9134j3574m7395k0679Q101J6033M085R196k391K666r373r499
14229c9718j915l4904K5719L3864J6065L69m06J9592J4921k1098K2683o14k0198
14216A4360l666j852Q986J4717j9156K35j4698R009j4145j6970J5942p696J2169
14203b765k6976j3283J007J9339p854K6943K2507Q442l8472j8214J6576j0063
$$ plain form
14295 16634 -1062 2269 73 -5039 -11668 -19820 -10804 3173 -15098 -19082 -19337 -31098 -34419 -2426
14281 -2426 37142 36892 26725 8847 -37673 -76334 -55377 -42115 -60807 -50967 -40248 -48001 -45961
14268 -45961 -53589 -60333 -11025 12501 29713 52128 60079 51799 14109 860 5515 9776 11088
14255 11088 11581 19286 25566 28171 33887 26152 8421 -25589 -35900 -18725 28428 15898 2868
14242 2868 3978 23112 9538 -37857 -58536 -50435 -34402 -30317 -21121 -23512 -20846 -30219 -39718
14229 -39718 -41633 -76537 -50818 -16954 -889 -520 -926 18666 33587 12489 35172 34558 14360
14216 14360 10694 8842 17828 32545 13389 13624 -1074 7935 -6210 -23180 -7238 -14934 -2765
14203 -2765 -29741 -43024 -42017 -22678 -30532 -3589 18918 27360 -11112 -29326 -12750 -22813
14191b2813j991J3582R969K0551M849k809k3203M776o618k0786j3511k7888l219
14178f9111M1840M42n619j1888J6448J5955n02Q959O540n687J8073N055k9974
14165i469k5091j5468J6860K0913l942J7466Q322j9176j6224j7559n480J1591
14153c7257K5264L294N668Q376k7588j7635M148j581J4997m23m486L3371J516
14140G664j8344j3981N437N827K8589R094k5212j7612K673n092l922K920J0949
14127a1010m006j4684J770P188O647J1480K5816q668j6826P67n439k301l6J6P603
14112a683P853k6869j327M734N257K0763J9646J4942L560k869j0042l553N059
14099C5471k026r212k9171j7401m589M315m424J4410J4469j5800K4393Q512o170
$$ plain form
14191 -22813 -24804 -11222 -1253 19298 24147 21338 -1865 2911 -3707 -24493 -38004 -65892 -69111
14178 -69111 -27271 -26829 -32448 -44336 -27888 -11933 -12435 -3476 3064 -2623 15450 20505 -9469
14165 -9469 -34560 -50028 -33168 -12255 -16197 1269 9591 -9585 -25809 -43368 -48848 -37257
14153 -37257 -11993 -8699 -3031 5345 -22243 -39878 -35730 -37311 -22314 -22737 -27223 6148 7664
14140 7664 -10680 -24661 -19224 -13397 15192 24286 -926 -18538 -15865 -20957 -24879 -21959 -11010
14127 -11010 -15016 -29700 -27930 -20742 -14095 -2615 23201 14533 -2293 -1526 -6965 -9266 -9302 -9286 -1683
14112 -1683 6170 -20699 -22026 -17292 -12035 8728 28374 43316 46876 44007 33965 30412 35471
14099 35471 33445 24233 -4938 -22339 -26928 -22613 -27037 -12627 1842 -13958 10435 18947 12777
14086A2777k7298j4359Q356l150o05k5161Q542K6462o542J0640K8683j8821j6800
14073a7276j6777p586J0556J7062J6331Q506P610o996p300q970P379j033p447
14060e941J4715l0346J330R605N289k4698J2171K204r52Q098L0928J0048l6619
14047d168k3859O708K0856J4518j5968j2313J1800Q55o360O356J0536n533J0208
14034A3636k2529K2349K2262k5197k4045l681r85N522l071J7423N172j4428M943
14021b629L770l059m788J42J3110N576j0711K5535q744Q206M21J0392k6331j7226
14007f336m437J1520Q446j9347m904l434m913J9291p794j3635k410K236J5969
13994i748O077j0606J2185O743l6936k0130O76J1312J1505K4504L2p860J7615
$$ plain form
14086 12777 -14521 -28880 -20524 -23674 -24279 -49440 -40898 -14436 -20978 -10338 18345 -476 -17276
14073 -17276 -34053 -41639 -31083 -14021 2310 10816 18426 11430 4130 -4840 2539 1506 -5941
14060 -5941 8774 -21572 -20242 -10637 -5348 -30046 -17875 -15671 -16623 -8525 22403 32451 -4168
14047 -4168 -28027 -21319 -463 14055 -1913 -14226 -2426 -1571 -7931 -1575 8961 3428 13636
14034 13636 -8893 13456 35718 10521 -13524 -17205 -18190 -12668 -15739 1684 6856 -7572 -2629
14021 -2629 1141 -1918 -6706 -6564 6546 12122 1411 26946 18202 26408 26829 37221 10890 -6336
14007 -6336 -10773 747 9193 -10154 -15058 -18492 -23405 -4114 -11908 -25543 -27953 -25717 -9748
13994 -9748 -3671 -14277 -2092 4651 -32285 -52415 -51739 -40427 -28922 -4418 -4386 -12246 5369
13981E369j349l654J9407N697k9548k0387P599J2189O639J0393j1847j298q187
13968h977J2340l180N660R740j1067j5973l5511J9573j497J170J2289k906m390
13955b2729J6209L0663J2917n053l4482k1147k3757J7112R833K1150p413N879
13943h18L1469l425p942m0526Q114M4401P92o843l7533n3182L535L7576K8778
13930D396J3338J9838P99o703j8439k941K2506o874j5436j1919q605P05J9907
13917A0572j0557l1052j559n544J3109K8983q742J5222P380n37J867J4640o707
13904B7075k2442J4705k4196l050J6899j8118p194J1977L6929N567o258j8952
13892A2942k6496J5194P786P15J8928j1896k7683j6874K0345J0043r219k8000
$$ plain form
13981 5369 4020 366 19773 25470 -4078 -24465 -16866 -4677 1962 12355 508 -790 -8977
13968 -8977 3363 183 5843 15583 4516 -11457 -46968 -27395 -28892 -27722 -15433 -18339 -22729
13955 -22729 -6520 24143 37060 32007 -2475 -23622 -47379 -30267 -20434 716 -6697 -818
13943 -818 30651 27226 19284 -21242 -13128 31273 32065 25222 -12311 -65493 -61958 -24382 4396
13930 4396 17734 37572 38371 31668 13229 10288 32794 25920 10484 -1435 -10040 -9335 10572
13917 10572 15 -31037 -32596 -38140 -25031 3952 -4790 10432 17812 17275 19142 33782 27075
13904 27075 4633 19338 -4858 -7908 8991 -9127 -16321 -4344 32585 38152 31894 12942
13892 12942 -13554 1640 9426 10141 29069 17173 -10510 -27384 -7039 3004 -6215 -34215
13880c4215j446J7452J6460k5582o722k084K1271L1115P031j3338j6744l0204
13868c7006k2055O270P423K0584J2484M52j5700k446J2518M92J5473J6077J5908
13855C0474Q083k178l3121k1319k0915r003J5589L6322J0415J8594k6498l1271
13843b4828J1309J511m269K2639j3613K542K1599n342O892J1204k2937j5884j5064
13830b4241M685K1799J7292p815l957j1367j1893O117k4404P661J5774J3461K7703
13817C0815P02J977O068n593J2123m5459l9888K7719K0827k6769o63K0009j329
13804E39k962j7376j3162J0199K8732K6314l8611k8950j4116J8278K1650M753
13792d712J1683L0408j4358k9279j6586p29L0604O111J0783J6854k081k2014l317
$$ plain form
13880 -34215 -35661 -18209 -1749 -27331 -34053 -36137 -14866 16249 23280 9942 -6802 -37006
13868 -37006 -59061 -52791 -45368 -24784 -12300 -11848 -27548 -29994 -17476 -16984 -1511 14566 30474
13855 30474 38557 36379 3258 -18061 -38976 -47979 -32390 3932 14347 32941 6443 -24828
13843 -24828 -13519 -12008 -16277 6362 -7251 -4709 16890 11548 18440 29644 6707 -9177 -24241
13830 -24241 -19556 2243 19535 11720 7763 -3604 -15497 -9380 -33784 -26123 -10349 3112 30815
13817 30815 31517 33494 39562 33969 46092 633 -39255 -11536 9291 -17478 -18141 1868 539
13804 539 -2423 -19799 -32961 -22762 5970 32284 -6327 -35277 -49393 -31115 -9465 -4712
13792 -4712 6971 37379 23021 -6258 -22844 -23573 7031 13142 23925 40779 38698 16684 13367
13779A3367M780N950j8385r847k2271k3951J1598L1380K6504K1547M089l1365
13767A3396q062j3627k9832L872J1286J0386P087o380k9288j6855O393J0486Q474
13754c2664k3381K1364J7009M631J848N815N830R775n675J592p068l8958o29J2371
13740b8140J1680L881J766J1622k344J5506J6795k0706k0886j6468j6309j5022
13728e8625j1579K8821J8044J3990J6978p366j6290l135k2521j9377Q066J4230
13716c8764j2899L903J9257k234j4712p73n716R563L0985J5554j2405N859k5966
13703b8348l2200K517L1219J9399k1864j6742l825J4213Q135L6404K3539j3319
13691A9128j9326k4447j4915k4432p87J3590K5684K2269K002p481K5265J3971
$$ plain form
13779 13367 18147 24097 5712 -4135 -26406 -50357 -38759 -7379 19125 40672 44761 13396
13767 13396 5334 -8293 -38125 -34253 -22967 -12581 -5494 -11874 -41162 -58017 -51624 -41138 -32664
13754 -32664 -56045 -34681 -17672 -13041 -11193 -5378 452 10227 4552 6144 -924 -39882 -40511 -28140
13740 -28140 -16460 -12579 -10813 809 -1535 13971 30766 10060 -10826 -27294 -43603 -58625
13728 -58625 -70204 -41383 -23339 -9349 7629 263 -16027 -19162 -41683 -61060 -52994 -38764
13716 -38764 -51663 -47760 -28503 -30737 -45449 -46222 -51938 -42375 -11390 4164 -8241 -2382 -28348
13703 -28348 -60548 -58031 -26812 -7413 -29277 -46019 -49844 -35631 -27496 8908 32447 19128
13691 19128 -198 -24645 -39560 -63992 -64779 -51189 -25505 -3236 -1234 -8715 16550 30521
13679C0521L15o908K209q232J9118K699k606Q649k754l4104L591L3684Q077J604
13665E5863r017k4262l0930Q589L659K162J1181j0359m265K034R299K2678j1029
13652B5603r037k2504J0708n950l7855M976L3289r103J0773q227K378J944K609
13639c96J5953L0154j4744q790l196m194q436K170J4338N183L679K5764L1332
13626H8817k0491l86l368r932l4803j5166K2649K4346Q146k5275m8023j9575K580
13613c0481J4258k1676L373J3533K6974O827K6272P843o372l666k5858j9227j9059
13600b7259j5767J6939K7153n309R604k747j675K040J2278j1633j4479K3078N274
13587A7497L916j6237j1042k127m212k158k4795N487r088K1245p730j4224J8414
$$ plain form
13679 30521 30836 23928 26137 17905 37023 39722 37116 45765 43011 8907 12498 46182 54259 55863
13665 55863 46846 22584 -8346 243 3902 6064 17245 6886 2621 4655 13954 36632 25603
13652 25603 16566 -5938 4770 -1180 -39035 -34059 -770 -9873 900 -7327 -4949 -3005 -396
13639 -396 15557 45711 30967 22177 18981 14787 6351 8521 22859 28042 31721 57485 88817
13626 88817 68326 67940 64572 54640 19837 4671 27320 51666 59812 34537 -13486 -33061 -30481
13613 -30481 -16223 -37899 -34526 -20993 5981 12808 39080 46923 40551 36885 11027 -8200 -27259
13600 -27259 -43026 -26087 1066 -4243 5361 2614 939 2979 15257 3624 -10855 12223 17497
13587 17497 21413 5176 -5866 -7993 -12205 -14363 -39158 -33671 -42759 -21514 -29244 -43468 -25054
13574b5054O76J3328O7l7040j8338K667K5237l426K1818J3365J0869N645k037
13561G777J3690J232O567n26j1006P434q576j2052P518J1678j4030l1777K2474
13548D03J2989j5623M169N846m43q23k2736j1438N585K1024J1394O379p670j5250
13534f194k494j5000J0103J8753n09p871J5331J5187J894J2165n093j8198M630
13521B2704j8586q214J4798P408J3661R034j7839R633q6j2535m670L507J1239
13508C0054j5974j6651j169k9524k1702J7195J3295J4101J9858K1490J3369L063
13496D7405J8864j1228l1747k9325r263k1622L3744K2280j245n567L606P360L253
13483B6515j4294J5227J6493J4337L9557J1492l2253q088o686k9660j5944q866
$$ plain form
13574 -25054 -24378 -11050 -10983 -48023 -66361 -63694 -38457 -41883 -20065 -6700 4169 9814 7777
13561 7777 21467 22699 29266 28740 17734 25168 16592 4540 12058 23736 9706 -22071 403
13548 403 13392 -2231 1938 7784 7341 6518 -16218 -27656 -22071 -1047 10347 16726 9056 -6194
13534 -6194 -8688 -23688 -13585 5168 4659 -3212 12119 27306 29200 41365 36272 18074 22704
13521 22704 4118 -4096 10702 18110 31771 40805 22966 32599 32513 19978 15308 18815 30054
13508 30054 14080 -2571 -3740 -33264 -54966 -37771 -24476 -10375 9483 30973 44342 47405
13496 47405 66269 55041 23294 -6031 -15294 -36916 -3172 19108 17863 12296 15902 23262 26515
13483 26515 12221 27448 43941 58278 97835 109327 77074 68986 62300 32640 16696 7830
13471G830J071J526N054K315p92q507m473o071p781o625N75j3102P044K4321K4662
13456B7047k046j5530j1717J7249J5578J09J430K693k747J792k4011p44L5059
13443D4162Q037k1735k1833l1760J9153O114N133J1371L3396L5992k220m6784
13431C9026m4357k6664j4116N860m881j1075P475J5901Q680P064R283L04J1336
13418C836Q392l928R128P687r78n124o831r956p576J3440j6075L50O708R113r64
13403G222O366k1568k9886k7024O544Q036J7314K4887J2961N705j0575j5850K955
13390a2913J3524J3776Q605m728k1880m3601J312J5012Q804k0648Q609L587K0466
13377a0075k554R071L5425j7123m2188K108k830m265M74M461Q93Q364k0433L592
$$ plain form
13471 7830 8901 10427 15481 17796 17004 8497 4024 -2047 -9828 -16453 -15878 -28980 -21936 2385 27047
13456 27047 25001 9471 -2246 15003 30581 30690 32120 34813 32066 33858 9847 9103 44162
13443 44162 52199 30464 8631 -23129 -3976 2138 7271 18642 52038 88030 85810 39026
13431 39026 -5331 -31995 -46111 -40251 -45132 -56207 -48732 -32831 -24151 -17087 -7804 -7500 3836
13418 3836 12228 8300 17428 25115 24137 19013 12182 2226 -5350 8090 -7985 -7635 -927 8186 7222
13403 7222 13588 -7980 -37866 -64890 -58346 -50310 -32996 -8109 4852 10557 -18 -15868 -12913
13390 -12913 611 14387 22992 18264 -3616 -47217 -45905 -30893 -22089 -42737 -34128 -30541 -10075
13377 -10075 -12629 -3558 31867 14744 -27444 -25336 -28166 -32431 -31957 -27496 -26603 -18239 -38672 -35080
13363c5080M707K7162Q454j968Q005K1453k9535k0614K2997J1183l697j8145J7085
13350A2007p11R386J3950j5816j5501k2839K1855J6259j0320m1934l202K3430
13338a3436J2862o198j0087k0987J347K0407L0743K239m410j457Q779r572k01
13325A0029K5424j6677r175P32O073N807P522O694j3460k1896m5898K6962L6817
13312A8954K8871M946l7806k0063l056N156K5068L571j1598l0164l65Q958J4845
13299G317m250J4531K6098O745l7639o276l61l9391r967M749K8398K0822J952
13286A2728o276o47L751j1785p542J7754j085j5674j0123J149M205J5142J7556
13273A9153J1356m749j2205Q584j856q198m521k2893k0862j156R954j425J2096
$$ plain form
13363 -35080 -30373 -3211 5243 3275 11280 32733 3198 -17416 5581 16764 13067 -5078 12007
13350 12007 11296 20682 34632 18816 3315 -19524 2331 18590 8270 -33664 -36866 -13436
13338 -13436 -574 -6772 -16859 -37846 -36499 -16092 14651 16890 12480 11023 19802 10230 10029
13325 10029 35453 18776 9601 10333 16406 22213 29735 36429 22969 1073 -44825 -17863 18954
13312 18954 47825 52771 14965 -5098 -8154 -2998 22070 25641 14043 -16121 -16486 -7528 7317
13299 7317 3067 17598 43696 50441 12802 6526 6165 -33226 -43193 -38444 -10046 10776 12728
13286 12728 6452 5805 9556 -2229 -9771 7983 6898 -8776 -18899 -17750 -13545 1597 19153
13273 19153 30509 25760 13555 22139 20283 12085 7564 -15329 -36191 -37347 -27393 -28818 -16722
13260a6722L6723j041k6942N229j8023k8225J0911L3615j6701l2884o015M881
13248e5194M2306R593j6147K7452r003j0188Q953K4405R844l8064O176J2058o350
13235E841k6715j1255j0087M6235Q091M073k196q95k5425o512J6807K358N132
13222E452n989j1828l371J2914R601J7587k1472m257j3010l9324J0316J7787K1421
13209d173L7194K0782o805R778n163l2821l2448j2623M941K5625k1300n353J4967
13196g399K90R146r026k3666m889J753L9338K1695n341O181p921K711Q540n770
13182B5642j5156k2683p931L0739K4130m61o942K458Q648O669j5847R845K5340
13169F4451k0221j1365N126j8189j0531J3662l8454j7147K8521J0773j5842j2755
$$ plain form
13260 -16722 20001 18960 -7982 -2753 -20776 -49001 -38090 -4475 -21176 -54060 -60075 -55194
13248 -55194 -12888 -3295 -19442 8010 -993 -11181 -2228 22177 32021 -6043 133 12191 5841
13235 5841 -20874 -32129 -42216 4019 12110 16183 13987 13092 -12333 -18845 -2038 320 5452
13222 5452 -537 -12365 -15736 -2822 6779 24366 2894 -1363 -14373 -53697 -43381 -25594 -4173
13209 -4173 33021 53803 46998 56776 51613 18792 -13656 -26279 -21338 4287 -17013 -22366 -7399
13196 -7399 -7109 2037 -6989 -30655 -35544 -33791 5547 27242 21901 28082 20161 22872 31412 25642
13182 25642 10486 -12197 -20128 10611 34741 34280 27338 29796 38444 45113 29266 39111 64451
13169 64451 44230 32865 37991 19802 9271 22933 -15521 -32668 -4147 6626 -9216 -21971
13157b1971r562K6123J8966K462M884m908j5048J2129J6793R974k144j3851o812
13144A7035k7767j5753M848J1947K815J1463K6766q960J1953Q326j0367l0554
13132A752J0993j0500J4487O881R037j7119l5894o216j0558r765J8049J0552K4033
13119E732j844k4496J2545O705n990j0394M518j6824K098J4985J8269O313J098
13106A2715j1371j391L7760r987j9095j1890P806j8797L092L2475J6125j2630
13094B4812j4366j2934n975K3416J8291n578J3840K7875o611J9064R832k2852
13082F8814k3546k8085j4486m807J9683j3160M962K2451J9361r543j9547l7217
13070a5120r165K7855O240j7815j5447N224n256K442P592J4289K5287O409J238
$$ plain form
13157 -21971 -31533 -5410 13556 16018 20902 15994 946 13075 29868 39842 37698 23847 17035
13144 17035 -10732 -26485 -21637 -9690 -6875 4588 31354 22394 34347 42673 32306 1752
13132 1752 12745 2245 16732 23613 32650 15531 -20363 -26579 -37137 -46902 -28853 -18301 5732
13119 5732 3888 -20608 -8063 -1358 -7348 -17742 -13224 -30048 -27950 -12965 5304 11617 12715
13106 12715 1344 -47 37713 27726 8631 -3259 4547 -14250 -11158 21317 37442 24812
13094 24812 10446 -2488 -8463 14953 33244 27666 41506 69381 62770 81834 91666 68814
13082 68814 45268 17183 2697 -2110 17573 4413 9375 31826 51187 41644 22097 -15120
13070 -15120 -24285 3570 9810 -8005 -23452 -18228 -23484 -21042 -13450 839 26126 32535 33773
13057C3773j9500j2173k450M041K6029K5425k0404l1544k2787O330L2424J8295
13045C7459J665K2183J1955l4943k4532k6588j9653L615L0412J901P03L348l897
13032C628j8242q222j8376J0359K6280O104l133l886J802M02j0849r151k602k500
13018b8386o888j823r72K1090L3130q524k2015k037K3218R428n776k3597J4746
13005A594r951K3402O750k2247R578L1403n452j2905q771J097j226O855j7497
12992B630k5968J4657P046k9720M233K1710K8589K3104j4668l3278k8294n152
12980c5111o641n042L6736K3485k4094j9088k5945J9441J8802J5393k253K591
12968a726J9117J0024k6222p757N81J580K3895J808O676j1735j9171j9989k5559
$$ plain form
13057 33773 14273 2100 -350 3691 29720 55145 34741 3197 -19590 -13260 19164 37459
13045 37459 39124 61307 73262 38319 13787 -12801 -32454 -28839 1573 3474 4177 7525 3628
13032 3628 -14614 -22836 -41212 -30853 -4573 1531 -1602 -5488 -3686 -3284 -14133 -23284 -25886 -28386
13018 -28386 -35274 -37097 -38069 -16979 16151 7627 -14388 -16425 6793 16221 10445 -13152 1594
13005 1594 -8357 15045 21795 -452 9126 40529 35077 22172 13401 14498 13272 20127 2630
12992 2630 -23338 -8681 -1635 -31355 -27122 -5412 23177 46281 31613 -1665 -29959 -35111
12980 -35111 -41752 -46794 -10058 13427 -10667 -29755 -55700 -36259 -17457 -2064 -4317 -1726
12968 -1726 17391 27415 1193 -6564 -5983 -4403 19492 21300 27976 16241 -2930 -22919 -48478
12955d8478N626L4858K9817L119l851L04j0220k6777J2212J1595j1073l534j5592
12942b1994L529k8558J0825J7368M787m883o66j0578K2410o069R741K6906L04
12929B3122j1068J8411j7927k3619j2685M055m573o714P488J6775L104J3236j2792
12916c187L171Q211K322j5530O300Q111j3120O507O078O329J200j8099k3198L728
12902b1177k1626R184P002J4268j811k3302M303R376l922k2659j2781m011K4417
12889d2739M4142P026j6350M982N269J4287n25Q738l504j1449O642q318m0846
12876c2645n672J9305J9484K024L874K387n557J1119J8329l000j3044q790j5864
12863h050K478j8250r240l965J2218k815j0670L162m419j482L064K1287J1919
$$ plain form
12955 -48478 -42852 -7994 21823 24942 21091 21395 11175 -15602 -3390 8205 -2868 -6402 -21994
12942 -21994 -18465 -47023 -36198 -18830 -14043 -18926 -19592 -30170 -7760 -13829 -4088 22818 23122
12929 23122 12054 30465 12538 -11081 -23766 -19711 -24284 -30998 -23510 -6735 -3631 9605 -3187
12916 -3187 -16 8195 10517 -5013 1287 9398 -3722 2785 8863 15192 16392 -1707 -24905 -21177
12902 -21177 -42803 -33619 -26617 -12349 -14160 -37462 -33159 -23783 -27705 -50364 -63145 -67156 -42739
12889 -42739 1403 8429 -7921 -2939 2330 16617 16092 24830 21326 9877 16519 8201 -32645
12876 -32645 -38317 -19012 472 2496 6370 8757 3200 14319 32648 29648 16604 7814 -8050
12863 -8050 -5572 -23822 -33062 -37027 -24809 -27624 -38294 -35132 -39551 -41033 -37969 -16682 -4763
12850d763j0820J2863J235k1524j5633o426J4392k775J9224N168p897j6529p154
12837d0639K2186K1190o469j1399J8006K6574r785n662P977p430k6274j4371J1648
12824a4448K0262R553l711j0588J2150j710J1164j0702l243J5366Q912l2421l1149
12811c0565j2939K4985K8507l672j9172k8836O833K934Q538J9529K5032R082q834
12798B1422j829J0863n160M033J819j3174j2J1613j7929l7233N389j924N011N033
12784a2078k0674j3792k241J0082M463l322P120n741J5121N09L999L3689J0381
12771B7516k4645R891L2825K3599L4197M150l7187m1561m935P208j504J6151j8839
12758B6866l2538l498Q824K0698J105r930K459K582J713J1367K5880k0820l1704
$$ plain form
12850 -4763 -15583 -2720 -1485 -23009 -38642 -45068 -30676 -33451 -14227 -9059 -16956 -33485 -40639
12837 -40639 -18453 2737 -3732 -15131 2875 29449 19664 14002 21979 14549 -11725 -26096 -14448
12824 -14448 5814 15367 11656 1068 13218 11508 22672 11970 8727 24093 33005 584 -30565
12811 -30565 -43504 -18519 9988 6316 -12856 -41692 -34859 -31925 -23387 -3858 21174 30256 21422
12798 21422 19593 30456 25296 29329 31148 17974 17962 29575 11646 -25587 -20198 -22122 -17111 -12078
12784 -12078 -32752 -46544 -48785 -38703 -34240 -37562 -30442 -36183 -21062 -20553 -16554 17135 27516
12771 27516 2871 12762 45587 69186 103383 107533 70346 28785 23850 31058 29554 45705 26866
12758 26866 -5672 -9170 -346 20352 21457 11527 13986 16568 18281 29648 55528 34708 3004
12745C004l7325L330j1023j2583L0432K1302K2806k363P62j0181l848k195j2414
12732a0296P967K6966o293k160J1109j601k917p995k3766k7850o516L4747J1410
12719B805O844J0691j7004r936L219J7872R409O513L111j9103j8618J186l157
12706f168m763M608M446j4585j6641Q079Q088L0482j0630r385j0852j648J6962
12693b007K1693K8165M180j2525j6067o821r785p754J5802J7981J367j7642L2729
12680D9316K4611l172r447j3232n931j3774l3978o461J7289K7396n884n322k5911
12667d500j9826J8701J2247k8365J4774N0762J7797J9832o879l743k4565k5960
12655B0275k4371k480P091J257R602r109p755J8113Q688r036q201J9426K6457
$$ plain form
12745 3004 -34321 -30991 -42014 -54597 -24165 -2863 19943 17580 18342 8161 4313 2118 -10296
12732 -10296 -2329 24637 18344 16184 27293 25692 22775 14780 -8986 -36836 -43352 -8605 2805
12719 2805 9649 20340 3336 -6600 -3381 14491 23900 30413 33524 14421 -4197 -3011 -6168
12706 -6168 -10931 -6323 -1877 -16462 -33103 -25024 -16936 13546 2916 -6469 -17321 -18969 -2007
12693 -2007 19686 47851 52031 39506 23439 16618 6833 -921 14881 32862 34229 16587 49316
12680 49316 73927 70755 61308 48076 42145 28371 -5607 -12068 5221 32617 26733 21411 -4500
12667 -4500 -24326 -5625 6622 -21743 -6969 43793 61590 81422 74543 70800 46235 20275
12655 20275 -4096 -6576 515 1772 11374 2265 -5490 12623 21311 12275 4074 23500 49957
12642D9957L983l2286k4450J9798K39k0918k761J5874r443R264M0294p940k0044
12629B1567p691K102q707l5313O499J6157j4372k015J4149O759l8326o885q128
12616e4204q101L2005J0717N222K0238k942k230J1199J1724R573Q338J4471l0773
12603B5237j5417J1664R025J3651j3147j1535j4931L284l346N993L436M774N98
12590A9286j6108m406K401K4396O599p691j5963k7768K2372K7223J9007k5600
12578B3748j7905m217r504k5793J0907K1194K6391J1152J6494J586l002r72l1862
12565A8217k5158K78k1581P57K3705K1518j4360n49Q451r184P778O193r802K01
12551F464K744r846j0622l291L3258K3353j1611j5627k9549l2383N565J1977M743
$$ plain form
12642 49957 53940 21654 -2796 17002 17241 -3677 -6438 9436 -7 9257 49551 41611 21567
12629 21567 13876 15978 7271 -28042 -21543 -5386 -19758 -21773 -7624 -865 -39191 -46076 -54204
12616 -54204 -62305 -30300 -19583 -14361 5877 2935 705 11904 23628 33201 41539 56010 25237
12603 25237 9820 21484 30509 44160 31013 19478 4547 7831 4485 10478 13914 18688 19286
12590 19286 3178 -1228 1173 25569 32168 24477 8514 -19254 3118 30341 49348 23748
12578 23748 5843 1626 -7878 -33671 -22764 -1570 24821 35973 52467 54053 51051 50079 18217
12565 18217 -6941 -6663 -28244 -27487 -3782 17736 3376 2827 11278 2094 9872 16065 6263 6464
12551 6464 9208 -638 -11260 -14551 18707 42060 30449 14822 -14727 -47110 -41545 -29568 -24825
12538b4825K5486L4053j1425l751K0258P560K564l498o718j4983k1371k92K2694
12525B5752K405l871J1156m192J3394j0307o214K78n383o435l813k6671j3078
12512b6979J9328J8055j3037J61J1534L0689j772r3j0231l0889O83L3854P921
12499C9224k2111m361l330N346q487L858K2604j402m5558Q079L4266R863R760
12486D7751l399k4892K385J944j4119j8450J3335L5313K2635o767l27p658k6306
12473B1445J854Q574j4827O501J9181J1056r011R689M258p698m352P825P749k3119
12459C9125j4157Lp449m093j8325L148M058L7280R961j2458L926O699j7355r20
12445B9443j0993L511J2132L178J6745K4750m077j0051K6114j935l0856k5659
$$ plain form
12538 -24825 661 34714 23289 19538 39796 47356 49920 46422 39704 24721 3350 3058 25752
12525 25752 28157 24286 35442 31250 44644 34337 28123 28401 23018 16583 12770 -13901 -26979
12512 -26979 -7651 10404 -2633 -2472 9062 39751 37979 37886 27655 -3234 -2551 31303 39224
12499 39224 17113 12752 9422 14768 6281 10139 32743 31341 -14217 -6138 28128 37991 47751
12486 47751 44352 19460 21845 23789 9670 -8780 4555 39868 62503 55736 55409 47751 21445
12473 21445 23299 31873 17046 23547 42728 53784 44773 54462 58720 51022 46670 54495 62244 39125
12459 39125 24968 24971 17522 13429 -4896 -1748 2310 39590 49551 37093 41019 47718 30363 29443
12445 29443 18450 21961 34093 37271 54016 78766 74689 64638 90752 88817 57961 32302
12433C2302l0962N879K5069J9755j329J7952K0037k7905j1431r207J4700r863
12421D4997R513M657k7041j2150R973P897l0865n14J6149j1414Q618J0364o796
12408B3388j3659J0759J1952K2260j327p401J0746j393j4537j1724j6146l1665
12396a8747p69R949Q615L5028J1160n273l0688j7433L6388N83j8480k128P884
12383A6089j9081j4957l667K005K1566J489j2297K8682L1035j1378k0883j3836
12371D767J2867J360K1665J4676R026k8513k7228k2458q525L4367l082l2650r076
12358c2804J1329J1300J7276j423J6059K2645K0959j14n504k8912k7931j3817
12346a0937l667Q061J4069L0559J8494O188L0044Q423j4648l9373m1155L615J1621
$$ plain form
12433 32302 1340 7219 32288 52043 50714 68666 88703 60798 49367 40160 54860 44997
12421 44997 54510 59167 32126 19976 29949 37846 6981 6467 22616 11202 19820 30184 23388
12408 23388 9729 20488 32440 54700 53373 45972 56718 55325 40788 29064 12918 -18747
12396 -18747 -19516 -9567 -952 34076 45236 39963 9275 -8158 28230 28813 10333 8205 16089
12383 16089 -2992 -17949 -21616 -19611 1955 3444 -8853 19829 50864 39486 18603 4767
12371 4767 17634 18994 40659 55335 64361 35848 8620 -13838 -22363 12004 8922 -23728 -32804
12358 -32804 -21475 -10175 7101 5678 21737 44382 65341 65227 59723 30811 2880 -10937
12346 -10937 -14604 -6543 7526 38085 56579 62767 92811 101234 86586 47213 6058 9673 21294
12333B1294p851J304k1822n769L8936P236k2767J2907q684J050P886J8871J9469
12320F2060j4039j6984R03J0358K3054K1479n270n830j3794m851M362Q65J245
12307F3558k977k1793l534n239J294K3118o162J3446Q553o518m918j2423J1133
12294E7538P708k3032o951J0864j995O046K161j1341j4525k966K1078J1727M745
12281F1057J697p558K0647j224j3866J5825L1840o76k2816l2106o035O493j8323
12268C4955J2121J8212O614n107j345p501J3581j083M53L444m410r980J5098j8108
12254E6944j9935K7339L2493R097J4060k3597p455k2960j9154J910J439J748j979
12241D9950l1933O460J5237j2664Q6L4855J973k0110K612l694n789o761K3940
$$ plain form
12333 21294 13443 14747 -7075 -12844 26092 33328 10561 23468 14784 15834 23720 42591 62060
12320 62060 48021 31037 31940 42298 65352 86831 81561 75731 61937 57086 61448 62313 63558
12307 63558 60581 38788 35254 30015 31309 54427 48265 61711 70264 63746 58828 46405 57538
12294 57538 65246 42214 35263 46127 44132 50178 52339 40998 26473 23507 44585 56312 61057
12281 61057 62754 55196 75843 74619 60753 76578 108418 107742 84926 52820 46785 53278 34955
12268 34955 47076 65288 71902 66795 65450 57949 71530 70447 70900 74344 69934 59954 75052 56944
12254 56944 37009 64348 96841 105938 119998 96401 88946 65986 46832 48742 50181 51929 49950
12241 49950 18017 24477 39714 27050 27136 61991 63964 43854 46466 42772 36983 30222 54162
12228E4162K1977j0686m2570k837L0138J7466n542J811L436K4558K5103J2720
12216A29736J7470l9069m8583Q279J3241j1901J2354K3355J0603J0256N667K747
12204A34155k5990j6041j9678k0862k392J7286J4230j9544o352N603J9660K5346
12192A05421J805J470J4692j2672p871K3704J6574l524J153j1457l5705P030m044
12179I6576j3258l286K1077R292R828k0265j5348L9871J1465J0119p923q687J5417
12166A44878r322j5550r821M602L8784J3803j4677P565Q681p248k035P10o937
12153A53433j6098J2675N131l886Q097J2602j926k4079K458M5715j70j2529o434
12140A74989j8708k53N516R27K941k1467J3369K285J9791L7492o828J5904J4743
$$ plain form
12228 54162 76139 65453 22883 20046 50184 67650 62108 63919 67355 91913 117016 129736
12216 129736 147206 108137 59554 67833 81074 69173 81527 104882 115485 125741 131408 134155
12204 134155 108165 92124 72446 51584 49192 66478 80708 61164 54812 60415 80075 105421
12192 105421 107226 108696 123388 110716 102845 126549 143123 139599 140752 129295 93590 100620 96576
12179 96576 83318 80032 101109 110401 120229 99964 84616 124487 135952 146071 138148 129461 144878
12166 144878 135556 120006 110185 114787 153571 167374 152697 160262 168943 161695 159660 160370 153433
12153 153433 137335 150010 155141 151255 159352 171954 170028 145949 148407 194122 193952 181423 174989
12140 174989 156281 156028 161544 162471 165412 143945 157314 159599 179390 216882 210054 225958 240701
12127B40701L104k3542O479L3495l852n528J6646P628j5205j1084k6739P281K622
12114B32006p642K1930k2749k367K0841J4879J243J7889K2678L906J5696j4038
12102C04272j9042k682N767J6870O230k110O455L566j3529J5900J849j915j1450
12089C10181K479J9475K848j3927J9779J4071Q57k9445l262m213K240n968M1186
12076C56301L7888N663P880J0269J1164L0703M731k9184k93R313J7733j964R042
12063D69246J1867j590L2264J4516j0743O581Q953J2445k1888r066M223J8926
12051E35734L5483P220K698J104o523n996n710j376J1515L1397K2493L7065K0840
12038F85944J1157k0038L1205K7681L1759P617o630l664R12N3156M2838K4591
$$ plain form
12127 240701 243805 220263 226742 260237 256385 250857 267503 275131 259926 248842 222103 229384 232006
12114 232006 224364 246294 223545 221178 242019 256898 258141 276030 298708 302614 318310 304272
12102 304272 285230 282548 288315 305185 311415 309305 315760 319326 305797 321697 323546 321631 310181
12089 310181 312660 332135 334983 321056 340835 354906 355763 326318 323056 318843 321083 315115 356301
12076 356301 394189 399852 407732 418001 429165 459868 464599 435415 435122 444435 462168 460204 469246
12063 469246 481113 479523 511787 526303 515560 522141 531094 543539 521651 512585 516808 535734
12051 535734 571217 578437 581135 582239 575716 569720 564010 562634 574149 605546 628039 665104 685944
12038 685944 697101 677063 708268 735949 767708 775325 768695 765031 765943 819099 861937 886528
12026H86528j8552J084L5000L8449L0484K7220j7059o756j530J9071P1481P6919
12014A142339M1590o177K2382K7649l454K0573M2708J9441M8284P3839M5720K0567
12002A495461K2514N3196J5887L6773M2468M1350N8541N5268O0149N0881M2681
11991A975169M1999L9315R0054N4855O4747R6074J01508Q7772P9738P8601J13714
11980B823546J00229J02816J20352J20119J55067J38874J10163J39303J39730
11971C950199J56425J82637J57140J83048K00773K05064K25756K41005K27336
11962E729383K44844K58045L13983L19432K91206L35891L60431L71260L75639
11953H600114M01981M08402M45130M49471M88086N16543M87278M85315N47981
$$ plain form
12026 886528 867976 869060 904060 942509 972993 1000213 983154 976398 974868 993939 1065420 1142339
12014 1142339 1183929 1177752 1200134 1227783 1224329 1244902 1287610 1307051 1355335 1429174 1474894 1495461
12002 1495461 1517975 1571171 1587058 1623831 1666299 1707649 1766190 1821458 1881607 1932488 1975169
11991 1975169 2017168 2056483 2146537 2201392 2266139 2362213 2463721 2551493 2631231 2709832 2823546
11980 2823546 2923775 3026591 3146943 3267062 3422129 3561003 3671166 3810469 3950199
11971 3950199 4106624 4289261 4446401 4629449 4830222 5035286 5261042 5502047 5729383
11962 5729383 5974227 6232272 6546255 6865687 7156893 7492784 7853215 8224475 8600114
11953 8600114 9002095 9410497 9855627 10305098 10793184 11309727 11797005 12282320 12830301
11944A2830301N47494M96012N06266M53775M54642M27435L82753L41457K96198
11935A6736333K36236J80012J01425j8218q8692j14119j74549k75679l36865l65915
11925A5879969l86874m38892m66537m85171n30594n10402n22007n07736n36227
11916A1495529n16434m73772m63334m29058m12190m12880m03156l47430l40062
11907G697213l61112l35455k77949k68991k83993k67776k39559k19984k02616
11898E239778k36458k28397k03632j98129j28530j41349j45291j38296j79517
11889C640179j70570j30492r7208j20430j20499j07096o7379p8420j29439r4085
11879B524561o6500p5475p4710p6710j05531n1461n1008l6597n6107n1949l5400
$$ plain form
11944 12830301 13377795 13873807 14380073 14833848 15288490 15715925 16098678 16440135 16736333
11935 16736333 16972569 17152581 17254006 17235788 17147096 17032977 16858428 16582749 16245884 15879969
11925 15879969 15493095 15054203 14587666 14102495 13571901 13061499 12539492 12031756 11495529
11916 11495529 10979095 10505323 10041989 9612931 9200741 8787861 8384705 8037275 7697213
11907 7697213 7336101 7000646 6722697 6453706 6169713 5901937 5662378 5442394 5239778
11898 5239778 5003320 4774923 4571291 4373162 4244632 4103283 3957992 3819696 3640179
11889 3640179 3469609 3339117 3241909 3121479 3000980 2893884 2826505 2748085 2618646 2524561
11879 2524561 2458061 2382586 2307876 2231166 2125635 2074174 2023166 1986569 1930462 1878513 1843113
11868A843113l4855l9297n7599n2441m1823k9083n8736k7779l0405n8062j5912
11857A397121k4986l2020l0605l3164l7793l2629l8947l4300l1404j6366j0398
11846A074509k2651m2305l1364L558j0744K91o348k1268j1977q970l2052l7657
11834H53022k3117m2789k2550p072k9718l6066M379N088j5641K222r762n052p393
11821F65551Q777r104j9331J6156k449n513k6293j5260l1542J0042O931j4439
11809E83526q132r618l8077q771j2272l2485J0765K6234K1226J0924k4807k4084
11797D94429k6685l120k50l86m2812j9764l3086O842O025R168J5645M916j9166
11784C91756k0501l082J3362j0331l070j3636L675l496k5244l6539m408j5069
$$ plain form
11868 1843113 1808258 1768961 1711362 1658921 1617098 1588015 1529279 1501500 1471095 1413033 1397121
11857 1397121 1372135 1340115 1309510 1276346 1238553 1205924 1166977 1132677 1101273 1084907 1074509
11846 1074509 1051858 1009553 978189 981747 971003 971294 964946 943678 931701 922731 890679 853022
11834 853022 829905 787116 764566 757494 727776 691710 696089 701177 685536 687758 677996 672944 665551
11821 665551 674328 665224 645893 662049 659600 654087 627794 612534 580992 591034 597965 583526
11809 583526 575394 565776 527699 518928 506656 474171 484936 511170 532396 543320 518513 494429
11797 494429 467744 464624 464374 463988 421176 401412 368326 375168 381193 390361 406006 410922 391756
11784 391756 371255 368173 381535 371204 368134 354498 358173 354677 329433 292894 288486 273417
11772B73417j1576J0423K1065M670j3407j1023J5331M645m129j8216O607q286
11760B69521l4182n7210L224N6640N109p040q315J926K0906p67j2142k5568m867
11747B07235J5630J5018j7547k9392j6794K3727k922k1042L78O229k6910N577
11735A59187L1989K9723j5255l4702k6130K0410O902J5084j2295k2871o87N104
11723A56459J0612J0621l284k7107j0661J5597O999l032J4754J3342o798r609
11711A67893K290l335J067K1173R674k6639k6190K3520m940l8300k7414j4663
11699H4136K708j0934j068P515K0836J9408K0444M19n53o877m347l622m347Q021
11685A31739j6765K7913j4733l2756N714L3966Q072j2783j0043j7392K1811P537
$$ plain form
11772 273417 261841 272264 293329 297999 284592 273569 288900 293545 289416 271200 277807 269521
11760 269521 235339 178129 181353 237993 243102 236062 227747 229673 250579 249812 237670 212102 207235
11747 207235 222865 237883 220336 190944 174150 197877 194955 173913 174291 180520 153610 159187
11735 159187 191176 220899 205644 170942 144812 165222 172124 187208 174913 152042 151355 156459
11723 156459 167071 177692 174408 147301 136640 152237 159236 156204 170958 184300 177502 167893
11711 167893 170183 166848 167915 189088 198762 172123 145933 169453 164513 126213 98799 84136
11699 84136 86844 75910 74842 82357 103193 122601 143045 143464 142911 136034 131687 128065 123718 131739
11685 131739 114974 142887 128154 95398 101112 135078 143150 130367 120324 102932 124743 132280
11673A32280M962r696j1006L316J5888n901j7399j6551j1744J8087J6289j0264
11661A08261m4099j2143M580r315J3573J9739J1893K8921K0846j0980m854k5068
11649A01354k3406J346L5514j6226k1520O207J1864K9001n770k7669j4070m88
11637G6137K5947J6292O036K0829n468j2339m087k1923J0902J6366l5892l13j4482
11624G8005j5267j2532j4659R955K2413J83J2340j3085k337l061n795J3585J2183
11611H1928K809q932r548N426J1858j7803j1186Q672J4712K1752O70J4804K1892
11598A37054l3341m7182j5693n77k2179j6275O873J9046j540k2533J9675K0323
11586D3651j3600J3171K0745k1999j4176J9453m60K1925N618j827j2505j292L06
$$ plain form
11673 132280 137242 127546 116540 119856 135744 129843 112444 95893 84149 102236 118525 108261
11661 108261 64162 52019 56599 47284 60857 80596 92489 121410 142256 131276 126422 101354
11649 101354 77948 79294 114808 98582 77062 83269 95133 124134 118364 90695 76625 76137
11637 76137 102084 118376 124412 145241 139773 127434 123347 101424 112326 128692 92800 92487 78005
11624 78005 62738 50206 35547 45502 67915 68098 80438 67353 65016 61955 56160 69745 81928
11611 81928 84737 75805 66257 71683 83541 65738 54552 63224 77936 99688 100358 115162 137054
11598 137054 103713 56531 40838 40261 18082 1807 8680 27726 26186 3653 23328 43651
11586 43651 30051 43222 63967 41968 27792 47245 46785 68710 74328 72501 59996 58704 59010
11573E9010p843j2294N92J1295K423j1700J1276m18k9961m0613j0555J3112N5743
11560D0067J2424j1916j2725j7329K1139K3396j5366k7023Q145K3474P2J3334
11548E7692k88j7310j4148k132Q567R579J1877j236k4871k661J5867j672j1812
11535B7452J7754l488l9975k2084n260o28J8924O0953j5552K308n762j4189Q021
11522B8474o518K9422J9041N977k6422k427k962j5615j250j359l77j2070J2545
11509B6459K3315j5503K813j703j306n227j1341o554J2472K1297L904K3062P644
11496G9332M533k5451j1163k0159l0233l5451O26j1462j004L8653J0665Q892q72
11483F906K585K9188L7651Q219j0923k7451j8105k7346O292l315k100J3647o962
$$ plain form
11573 59010 51167 38873 39465 50760 53183 41483 52759 52341 22380 -18233 -28788 -15676 40067
11560 40067 52491 40575 27850 10521 31660 55056 39690 12667 20812 44286 44358 57692
11548 57692 57404 40094 25946 23814 32381 41960 53837 52601 27730 25069 40936 39264 27452
11535 27452 45206 41718 1743 -20341 -25601 -26229 -7305 53648 38096 40404 34642 20453 28474
11522 28474 21956 51378 70419 76396 49974 47547 44585 28970 27720 26361 25984 13914 26459
11509 26459 49774 34271 37084 35381 34075 28848 17507 10953 23425 44722 48626 71688 79332
11496 79332 83865 58414 47251 27092 -3141 -38592 -37966 -49428 -50432 -11779 -1114 7778 6906
11483 6906 9491 38679 76330 84549 73626 46175 28070 724 7016 3701 1601 15248 8286
11470H286J312K1086J2871J556J3609P846K317m103k3048j6202m772j7777M2379
11457D5360K6011p148k4674j571m1363n122K1556O013M42K40J790K5148K347k2764
11443B6265N995J2027l3069L5447J2284k2574m191J1016J0237N778j7297O388
11431D8306r063j9218j5038Q718p051j9662k4473O170M6017L1064k7137j4303
11419D330P240J953L53m93L274j5360j2560J4020M448K1296j0675n246l97j6067
11405c884k4039P959L3198j6438k2521m436L9117R820k5305j0623K0240%k6245
11392b3157R225K0980K4605Q193j5198l212m955J2400r93j7952n760R49r259J3088
11378H954K8257K5510J7068l1715m5882j3926L237J5091j5924j887l323J4817
$$ plain form
11470 8286 9598 30684 43555 45111 58720 66566 68883 64780 41732 25530 20758 2981 45360
11457 45360 71371 64223 39549 37978 -3385 -8507 13049 19062 19504 19744 21534 46682 49029 26265
11443 26265 32260 44287 11218 46665 58949 36375 32184 43200 53437 59215 41918 48306
11431 48306 39243 20025 4987 13705 6654 -13008 -37481 -31311 14706 45770 18633 4330
11419 4330 11570 13523 13876 13383 16657 1297 -11263 2757 7205 28501 17826 12580 12183 -3884
11405 -3884 -27923 -19964 13234 -3204 -25725 -30161 8956 18776 -6529 -17152 3088 3088 -23157
11392 -23157 -13932 7048 31653 39846 24648 21436 16481 28881 27888 9936 4176 5125 -4134 8954
11378 8954 37211 62721 79789 48074 2192 -11734 -8497 6594 -9330 -11217 -14540 277
11366B77j639l675K7213J2281M119N318j0123P039K821p329K2753rl4413l0696
11352f063J2349k735j5614N691k3409Q97J9673m418K0239L7664J2789P058j7879
11339D6242j7142j8898j9127m061l877M421J9883O165L206k5998k5765j7967J7104
11326c5814O619J3971K0877L2934j8288R369j366J669J6364j8118j3746Q742K2477
11313D5690o415j209J5912P617j5985j7530k008J729j5576l965N719k679k3965
11300a2665K4344K1991o284o181o658K6041j798j8326J2958j5066p621j8897J6112
11287G950R484J2928l962o497J2627J5842L2815K175j3994L354k2031j6425J9353
11274E3619J1065p458k9589k5212L337J4349J0125Q412k9539n4J1073K3471J9224
$$ plain form
11366 277 -1362 -5037 22176 34457 38576 43894 33771 40810 43631 36302 59055 59046 24633 -6063
11352 -6063 6286 3551 -12063 -6372 -29781 -28884 -9211 -13629 6610 44274 57063 64121 46242
11339 46242 29100 10202 -8925 -12986 -16863 -12442 7441 13606 16812 -9186 -34951 -52918 -35814
11326 -35814 -29195 -15224 5653 38587 20299 29668 28302 29971 46335 28217 14471 23213 45690
11313 45690 39275 38066 53978 61595 45610 28080 26072 27801 12225 8260 13979 11300 -12665
11300 -12665 11679 33670 27386 21205 14547 40588 38790 20464 33422 18356 10735 -8162 7950
11287 7950 17434 30362 26400 19903 32530 48372 81187 83362 69368 72722 50691 34266 53619
11274 53619 64684 57226 27637 2425 5762 20111 30236 38648 9109 9055 20128 43599 62823
11261F2823o930k9143j0577j3965Q242L2572K0659K3090Q282k8072k4862j415
11249D0704P665k172J123m0250J297K3574J2619j2877L618j6031p787O35n326
11236F792R897K738l798Q103K881J1617K4215J2663o991r652j6717j0791M844
11223C5801o290j4476N442Q505n78j524J1950M643r347l180K8158K841k2560n039
11209C4346j7351P383Q0O539J249o488K529n987m801j2273K1770Q702O916k1484
11195B1130k1571m374K1805O34l7962J4792L2452J4151j4892k3669Q437l1824
11183b0891j8353K5823O0276L642k4501k9924j737M4247Q770r198k0995P570o428
11170A8301j2185o097J2750l907J0503J8765j2922k9245L47N392j0740K3728J1577
$$ plain form
11261 62823 55893 26750 16173 2208 10450 43022 63681 86771 95053 66981 42119 40704
11249 40704 48369 46197 47320 7070 8367 31941 44560 31683 35301 19270 11483 12118 6792
11236 6792 16689 19427 15629 23732 26613 38230 62445 75108 68117 58465 41748 30957 35801
11223 35801 29511 15035 20477 28982 28404 26880 38830 43473 34126 30946 59104 61945 39385 34346
11209 34346 16995 24378 24458 30997 32246 25758 28287 22300 17499 5226 26996 35698 42614 21130
11195 21130 -441 -4815 16990 17624 -20338 -5546 26906 41057 26165 2496 10933 -20891
11183 -20891 -39244 -13421 46855 50497 25996 -3928 -5665 38582 47352 38154 17159 24729 18301
11170 18301 6116 19 12769 8862 19365 38130 25208 -4037 -3690 1702 -9038 14690 26267
11157B6267j0568l2847l634K1722M3k4756J0717o862J3869k258J0261J2351J322
11144A5627k5119q134J8050M642J0942m009m185L734J3441j9828m31j7541J0231
11131b580K3294P146k271k1276K6806K0366l172r03K057l7428l9042m882J7214
11118a4671j829j5385J2994J6082K7133M208l245p276L573L332L867j8943j5112
11105e272m128n045L1051J1843k6027k7010k051j179J9242K9506J1795Q638l3644
11092G719k425J549k1863K56j0313l567Q877J8418j6554q319L4568r111k8982
11079b9747k0721J4738N728o950J36K2234K1751P098K899k2257j6996J1187N003
11066e897M044j4913j6506J3992R127l567o236p529j3176o935M7019K0833J204
$$ plain form
11157 26267 15699 -17148 -20782 940 983 -23773 -13056 -19918 -6049 -8307 1954 14305 15627
11144 15627 -9492 -17626 424 5066 16008 11999 7814 11548 24989 5161 4730 -12811 -2580
11131 -2580 20714 27860 25589 4313 31119 51485 48313 47410 49467 12039 -27003 -31885 -14671
11118 -14671 -16500 -31885 -18891 -2809 24324 28532 25287 18011 21584 24916 28783 9840 -5272
11105 -5272 -9400 -14445 16606 28449 2422 -24588 -26639 -27818 -8576 20930 32725 41363 7719
11092 7719 5294 6843 -15020 -14764 -25077 -28644 -19767 -1349 -17903 -26222 8346 -765 -29747
11079 -29747 -50468 -35730 -30002 -36952 -36816 -14582 7169 14267 17166 -5091 -22087 -10900 -5897
11066 -5897 -1853 -16766 -33272 -19280 -10153 -13720 -19956 -27485 -40661 -47596 -577 20256 21460
11053B1460j7193K1747K3492j8254k7094N311K8786J6489J4712J0867j5018J0153
11041G5458R333n086k295k325k8508J4760J5224J2583M0434K3751n405k2201j1183
11028A14540j156J4873O101k3854J3892J1001l173J0977L8121L4164k8612k5613
11016A61261j4230L674n163k6314j5750J0379N2632J3891j7897k3015m537q208
11004A26723j7963j3657L091J2350j3052k0512m866l2813n342J0065j4584j4712
10992A4728o954J5959J3597K2425J485l6665j8278J5935k226q810J1429O200j331
10979B7494R225j2881k8881m907M476R560l361j2430p825K080J9898j0290k0864
10966b8706J5484l293O641Q78J8568K1164k4241R100J0952M67o141r048j2252
$$ plain form
11053 21460 4267 26014 49506 31252 4158 9469 38255 54744 69456 80323 65305 75458
11041 75458 84791 79705 77410 75085 46577 61337 76561 89144 129578 153329 147924 125723 114540
11028 114540 113384 128257 134358 110504 124396 135397 132224 143201 181322 215486 186874 161261
11016 161261 147031 150705 145542 119228 103478 113857 166489 180380 162483 139468 134931 126723
11004 126723 108760 95103 98194 110544 97492 76980 72114 39301 33959 44024 29440 14728
10992 14728 7774 23733 37330 59755 61240 24575 6297 22232 20006 11196 22625 28825 27494
10979 27494 36719 23838 -5043 -9950 -5474 4086 725 -11705 -19530 -17450 2448 -7842 -28706
10966 -28706 -13222 -16515 -9874 -8996 9572 30736 6495 15595 26547 27014 20873 11825 -427
10953d27O933l181O721l711K3915j1296l944N966J0533N249k474j0595k8278K1365
10939A6776J9718m472o60j075L223J1577m027o556n0332k043M282L0272J0568
10926B7251k9654L804K8605L207q741p19k4712k2380K865K1198N950j832J16Q71
10912E829N940j2112n245J4358L240K1877r13m1282o406P002Q475L530l89L1443
10898C5347r7Q36r859J7098q877K062j7141L79N987L385j1r396j2135n801K976
10883D753K1202L2277K7570k6358l1700K7359K1932q02j7302K805o392k5678J6310
10870D5976Q279k9630j5124J902J4199R951J227j823k1460j6139L459p344j8310
10857b4837J1373K9915K2073K1683K2302L364l5283q898J6372j2818l365j3104
$$ plain form
10953 -427 6506 3325 10046 6335 30250 18954 15010 20976 31509 36758 34284 23689 -4589 16776
10939 16776 36494 32022 31362 30287 33510 45087 41060 34504 -15828 -17871 -13589 16683 27251
10926 27251 -2403 1401 30006 33213 24472 23753 -959 -23339 -20474 724 6674 4842 4958 5829
10912 5829 11769 -343 -5588 8770 12010 33887 32974 -8308 -14714 -7712 763 4293 3904 35347
10898 35347 35250 36086 26227 43325 34448 36510 19369 19748 25735 29120 29109 19713 7578 1777 4753
10883 4753 25955 58232 85802 59444 27744 55103 77035 76233 58931 61736 55344 29666 45976
10870 45976 54255 24625 9501 11403 25602 35553 36780 34957 13497 -2642 817 -6527 -24837
10857 -24837 -13464 16451 38524 60207 82509 85873 50590 41692 58064 45246 41881 28777
10845B8777J1736O336k0737P147R677J7869P886j0746m4708N471J3618K4366K7181
10832H3873j4842j5641r151p409J9416j6847k3620N806J7894J2049k1556M421
10820C4393M170n569K214J1482P824K461j1214r202l957k1668n390O373q605m457
10806a145O464k02J1341K5836K0337j4845k0683k270K0368K995r298j327J7063
10793E4634q571J1656m329o85K3972j0192j6672m832O460l852J2127M4767J7275
10780A21758j1189j0729J1546J5634M7047L9669J0471R00P7639J10709J37534
10769E50989J80957K13739J80363J01335Q0769J59294J73115j7017j61050j55033
10759A307461j14243j12702k04375k16961j46587p9516r5316o9638m8733l5132
$$ plain form
10845 28777 40513 46849 26112 33259 42936 60805 68691 57945 13237 18708 32326 56692 83873
10832 83873 69031 53390 44239 36830 56246 39399 15779 21585 39479 51528 29972 34393
10820 34393 38563 32994 35208 46690 54514 56975 45761 36559 32602 10934 5544 11917 3312 -1145
10806 -1145 5319 5117 16458 42294 62631 47786 27103 24833 45201 48196 38898 37571 54634
10793 54634 46063 57719 53390 52705 76677 66485 49813 44981 51441 47589 59716 104483 121758
10780 121758 110569 99840 111386 127020 174067 213736 224207 225107 302746 413455 550989
10769 550989 731946 945685 1126048 1227383 1308152 1467446 1640561 1623544 1462494 1307461
10759 1307461 1193218 1080516 876141 659180 512593 433077 337761 268123 219390 184258
10749A84258j4441M458p523j4358J0467k0978k1992j089J7342k7871j7700N271
10737I5844K7443M321j7550l0500Q845J8807k9820j0516K2529n870K0128o218
10725I7443k3387j5543p5q786J6121k4256j900K556J5234n882J143K6607j3032
10712F6243l206J3115J2311J5098J0814l7708k640J2866J1156R099l4808k3440
10700D8900n967j3820J3184J2429K0819K406O112j2510q435K9K893o241j6383
10687D3416j1794J0863J6287j2293j3477R638q275Q505J1635n288j6691J2649
10675D5175j174k75K5434K3285J0630R216M627k333J8121j6624M522R525j9312
10662A10817j2945J8544K9655J7274j304j4527J4079K1530R042o525P268j3626
$$ plain form
10749 184258 169817 174275 166752 152394 162861 141883 119891 118802 136144 108273 90573 95844
10737 95844 123287 127608 110058 79558 88403 107210 77390 66874 89403 83533 103661 97443
10725 97443 74056 58513 58438 49652 65773 41517 39617 42173 57407 51525 52668 79275 66243
10712 66243 63037 76152 88463 103561 114375 76667 74027 86893 98049 107148 72340 48900
10700 48900 42933 29113 42297 54726 75545 77951 84063 71553 63118 63147 66040 59799 43416
10687 43416 31622 42485 58772 46479 33002 42640 34365 42870 54505 49217 32526 45175
10675 45175 44001 43726 69160 92445 103075 112291 116918 114585 132706 116082 120604 130129 110817
10662 110817 97872 116416 146071 163345 162041 147514 161593 183123 192165 185640 192908 179282
10650A79282K660j2482K1875K1555L8087L1501J5072L700q277j80P057L1907O8364
10637D00121K784J0204N23N2892Q0639R4836Q4823O9495N0593Q7093R6401R7620
10625A128024J39789J72258J96456L07400M73049O19431Q46220J159193J531479
10616F573299J945491K150449J781029P93224l06871q26959p89897m09410J95713
10607A1106068R10066J787890K836087L917143M399333L352231O65909j999267
10599B6975460l084629k669554j563788l61075R04576K268273L773363N141257
10591C1383883N470458L503890o59696m378121n555818m702330l226773j813644
10583B0021849m95053P68300J968028K877246K929710J337293j536173l861751
$$ plain form
10650 179282 181942 169460 191335 212890 250977 282478 297550 301250 292973 292793 299850 331757 400121
10637 400121 402905 413109 413632 466524 547163 641999 726822 796317 846910 934003 1030404 1128024
10625 1128024 1267813 1440071 1636527 1943927 2416976 3036407 3882627 5041820 6573299
10616 6573299 8518790 10669239 12450268 13243492 12936621 12109662 11319765 10910355 11106068
10607 11106068 12016134 13804024 16640111 20557254 24956587 28308818 28974727 26975460
10599 26975460 23890831 21221277 19657489 19296414 20200990 22469263 26242626 31383883
10591 31383883 36854341 40358231 39698535 35320414 29764596 25062266 21835493 20021849
10583 20021849 19526796 20295096 22263124 25140370 28070080 29407373 27871200 24009449
10575B4009449m370448l581811k502319j500498p10011k1093M94031P57954O68468
10566A3243722p0892j132656j935255k105389j783496j361380r89009p20249n40649
10557B604747l82445l01065k43331j99919j49950j04570q5002r6373q5009o4878
10547H92205o7118n6325l8002m3093k3256k9204p041n736q807M8379J7722L630
10535F83354l5060k6202O141l4199n7740k8978j6121k1958n0283j3866o172J924
10523D00840K5210j3624j5625K823l4621j7527P485k3645j3387J5412q540o590
10511C18211j521n748J8128J054l2127m137K6125j3801j2926j9078j409J5321
10499B88092N2980J1401J3071Q069K9451O8491M3296M588J039Q264L4177K0231
$$ plain form
10575 24009449 19639001 16057190 13554871 12054373 11344362 11323269 11817300 12575254 13243722
10566 13243722 13172830 12040174 10104919 7999530 6216034 4854654 3865645 3145396 2604747
10557 2604747 2222302 1921237 1677906 1477987 1328037 1223467 1138465 1042092 957083 892205
10547 892205 825087 768762 730760 687667 664411 635207 628166 622430 613623 662002 679724 683354
10535 683354 648294 622092 628233 594034 536294 507316 491195 469237 418954 405088 398916 400840
10523 400840 426050 412426 396801 399624 365003 347476 354961 331316 317929 333341 324801 318211
10511 318211 316690 310942 329070 330124 297997 293860 319985 306184 293258 274180 272771 288092
10499 288092 341072 352473 365544 373613 403064 471555 514851 519439 520478 528742 562919 583150
10487E83150J2042l4770m7538k3327n3019n7716l9611m5071l5031j5476m584j8724
10475B20325Q548K2800J3918j2874k349l132Q949K9379j8672r725P693K5027k4615
10462B65272M519K3899J6993L8262L7620J9554J4502j380j3465k7838k4166k0659
10450C33113j8197N015K8702J0620R415l662k1160r901J981J9884J4797J8588
10438C89195J7749R53M666K0456L4227M6993L6507L3768k762m26L1238Q604J987
10425F23155O6768N7184L4331O4719L5752N4601O3097N4838L4137J8248J0391
10414A117221J0420K8218N0167M3094L1034M8364O5309R7050R3577R9893P7060
10403A761407O0148N9618O6492Q1501R1110O4131N0472P0122J24193J52460J70475
$$ plain form
10487 583150 595192 560422 512884 489557 436538 378822 339211 294140 259109 243633 239049 220325
10475 220325 228873 251673 265591 252717 250368 247236 256185 285564 266892 257167 264860 289887 265272
10462 265272 269791 293690 310683 348945 386565 406119 420621 419241 405776 377938 353772 333113
10450 333113 314916 319931 348633 359253 368668 365006 343846 333945 335926 355810 370607 389195
10438 389195 406944 407897 412563 433019 467246 514239 550746 584514 581752 581326 612564 621168 623155
10425 623155 689923 747107 781438 846157 881909 936510 999607 1054445 1088582 1106830 1117221
10414 1117221 1127641 1155859 1206026 1249120 1280154 1328518 1393827 1490877 1584454 1684347 1761407
10403 1761407 1821555 1881173 1947665 2029166 2120276 2184407 2234879 2305001 2429194 2581654 2752129
10392B752129K23924K47010K70158L53102M15804M95386N86771O62090O32714
10383F639088O52783Q47710J062072J039324R44969J127299J431217J749316K113673
10374A7607451K624819L379721M555370O387956R229845J3595374K0614504L0876572
10366A08871612M2143042M3736992K5146075J5582843L0780269L9290092R174708
10359C14725633l3718210l8231663j9623010j6927656l7450330m5118198l4599149
10352H9057417k2884406j5130291j0394605p375836n367742l995148l126213k464607
10344A8318569j931161j575309j442024j260972r96021q34013r36069r48838p73198
10335G620964n90557n79651o16365n43543m38383l85545l14333k70298k65071
$$ plain form
10392 2752129 2976053 3223063 3493221 3846323 4262127 4757513 5344284 6006374 6639088
10383 6639088 7291871 8139581 9201653 10240977 11185946 12313245 13744462 15493778 17607451
10374 17607451 20232270 23611991 28167361 34555317 43785162 57380536 77995040 108871612
10366 108871612 151014654 194751646 219897721 235480564 266260833 305550925 314725633
10359 314725633 281007423 242775760 223152750 206225094 168774764 123656566 89057417
10352 89057417 66173011 51042720 40648115 33272279 27904537 23909389 20783176 18318569
10344 18318569 16387408 14812099 13370075 12109103 11113082 10279069 9343000 8394162 7620964
10335 7620964 7030407 6450756 5834391 5290848 4852465 4466920 4152587 3882289 3617218
10326C617218k54426k28942j68663j62875j84512j30831r3300j00227r6582r1743
10316B105117j32813q8329o9275m7310n5049q5140n2037j6504o8359n0553m0479
10305A399269j9854j9394n2309o8832o1459m5740k5117l1188o468l1358L650k7216
10293A013984l8716k8700m378J1209k1423k8450l5600m3229J6856l68m176q816
10281H28193m6069k5159n113m0418l5857N474m405k9378l2084j2505j1289L1556
10269F22946j506l7191j6978O901P108j8881l0515k7828q438J2953J5625P495
10257E31691j821r370k5802L062M980q571j6149j8831J1301J6956j0465o05j6804
10244D59572P216J645J3549K8240K0055j1746K183K821K476J786k0417m2726k4056
$$ plain form
10326 3617218 3362792 3133850 2965187 2802312 2617800 2486969 2393669 2293442 2196860 2105117
10316 2105117 1972304 1883975 1814700 1767390 1712341 1627201 1575164 1558660 1490301 1439748 1399269
10305 1399269 1379415 1360021 1307712 1238880 1177421 1131681 1106564 1075376 1068908 1037550 1041200 1013984
10293 1013984 975268 946568 942190 953399 931976 903526 867926 824697 841553 841185 837009 828193
10281 828193 782124 756965 751852 711434 675577 681051 676646 647268 615184 602679 591390 622946
10269 622946 621440 584249 567271 574172 581280 562399 531884 504056 495618 508571 524196 531691
10257 531691 529870 520500 494698 497760 502740 494169 478020 459189 470490 487446 476981 476376 459572
10244 459572 466788 468433 481982 510222 530277 518531 520714 523535 526011 527797 507380 464654 440598
10231D40598l3448k2497m7181m2059o324J4561j4570q006j6469l1576m5086J5021
10219B02964K0691r883N441m614j955J9930M971q259J456k1825j5854j5795M4161
10206B21429J9662l6822l3180R665J4396k8744J936J6056n624L587k534n815J3600
10193A87612k0826r803L59o270n277J8322J2086J1004q299J33j1032r735p677
10180A50597J9984Q480K178L729N11k6065l7849j0464j3698J8783K2646P885Q295
10167A55012J7143J6300K0595J2053J2556K3258k432j7456N711q027m531J5621
10155B45803K5893M9994J1060l5601m5762l9673k0046k9846p357K1800K9659M5371
10143B51295K7014J6379k4889k4298j2237k6286p712j4201o697J713O177K8649
$$ plain form
10231 440598 407150 384653 337472 295413 289089 303650 289080 281074 264605 233029 187943 202964
10219 202964 223655 213772 219213 214599 212644 232574 237545 229286 230742 208917 193063 177268 221429
10206 221429 241091 204269 171089 180754 195150 166406 168342 184398 178774 182361 179827 174012 187612
10193 187612 166786 156983 157342 151072 145795 164117 176203 187207 178908 179041 168009 158274 150597
10180 150597 170581 179061 181239 184968 185479 159414 121565 111101 97403 116186 138832 146717 155012
10167 155012 172155 188455 209050 221103 233659 256917 254485 237029 242740 234713 230182 245803
10155 245803 271696 321690 332750 297149 251387 211714 191668 161822 154465 176265 205924 251295
10143 251295 278309 294688 269799 245501 233264 206978 199266 185065 178368 180081 186258 214907
10131B14907L2659O253j3927k2441k7866k2858N214j9624N290n198L902J0839
10119A67150j266P566J4613J5185m186j8449r654N586O766j7136j0915M525l93
10106A59392r794r78l0150p556j3127j4817n568j654K0203j9897R831N9449l705
10093A41629k8459J4442r632m4917p655K5435L6737o08k2849j4545J2830K4134
10081A26542J4575K1012j6192k8067J47l923J1955J2935k348j7809l322K591p814
10068A10282O912p253k8166q777j5267K1939L3195L109j9897N152R537O030L201
10055A19997j3180L339J262K827r35q006O849j7079m458N801K108N835P610j2570
10041I9400l3720J4763j335k6366K391q409J8065K1231J2934j0412j9523m66J7203
$$ plain form
10131 214907 247566 253819 239892 217451 189585 166727 171941 152317 157607 152409 156311 167150
10119 167150 165884 173450 188063 203248 199062 180613 170959 176545 183311 166175 155260 159785 159392
10106 159392 149598 148620 118470 110914 97787 82970 77402 75748 95951 76054 85885 145334 141629
10093 141629 113170 127612 117980 73063 65408 90843 127580 126972 104123 89578 102408 126542
10081 126542 141117 162129 145937 117870 118017 114094 126049 138984 136636 118827 115505 118096 110282
10068 110282 117194 109941 81775 72998 57731 79670 112865 115974 96077 101229 110766 116796 119997
10055 119997 106817 110156 111418 114245 113310 105304 112153 95074 90616 96417 98525 104360 111970 99400
10041 99400 65680 80443 79108 52742 55133 46724 64789 86020 98954 88542 69019 68553 85756
10028H5756K1909j472j7982o79n272m521P782k6964J2398j9492j1376k220K409
10015D0276Q411M0063J4011k7505k7993R50r056N224p371p040p117q852Q532p344
10001A5189M42Q41J6185J9898J0505J7846K067j2391j0751n703L3511r068m2238
9988C6333M461J4681K6540N660k9991J0261K2425M552l099k8859l5095Q082K5688
9975F1639p328k98Q832K0488M7321m448K131j1447L3843L0780J7725J4809L5402
9962B49449N7675N8892R2890J72541K17368K05873J12004J33446J66749J60594
9952A627481J5925j68831j62158j03304j08596k10207k11776j74163j21672j07447
9942B75252o5537n814J4352k2531j9441k105k2069p92q276k9015k2749N141j7401
$$ plain form
10028 85756 107665 106193 88211 87532 82260 77739 85521 58557 70955 51463 40087 37867 40276
10015 40276 48687 88750 102761 75256 47263 48213 39157 44381 37010 29970 22853 14001 22533 15189
10001 15189 15631 16472 32657 52555 63060 80906 82973 70582 59831 54128 87639 78571 36333
9988 36333 40794 55475 82015 87675 57684 67945 90370 94922 91823 62964 27869 35951 61639
9975 61639 54311 54013 62845 83333 130654 126206 128337 116890 150733 181513 199238 214047 249449
9962 249449 307124 366016 458906 631447 848815 1054688 1166692 1300138 1466887 1627481
9952 1627481 1643406 1474575 1312417 1209113 1100517 890310 678534 504371 382699 275252
9942 275252 209715 203901 218253 195722 176281 174176 152107 151315 143039 114024 91275 96416 79015
9929G9015k5314j9625K2598L581N86R642P962R877k843l5646j1958L780K3306
9916F4961l893j1829N044J4292j4169l2165l496l7086j9380L1765M0971K3023
9904E8038K626j9407j3539J4069K4585J4789k4029l1773j5205j7668j4235L1078
9892I329P64N14j066r231L102J068L760j975j2906R999M2265k5948j5306l627
9878G42L081J2222p500J7523K5883k330Q250J7306l3346j6039P947q364k3166
9865B209r382j914J4455K3231j595J469l5613M299J6229J9907m534N080L8341
9852G2182J449k190n591j0561J3313o417k6311J991K7509k1048j5744q363l334
9839A6885k797L803j2983R506J8964p335j7912l429K165O244J3070J2552r74O39
$$ plain form
9929 79015 53701 34076 56674 60255 60841 70483 78445 88322 85479 49833 37875 41655 64961
9916 64961 61068 49239 54283 68575 54406 22241 18745 -18341 -37721 -5956 35015 58038
9904 58038 60664 41257 27718 41787 66372 81161 57132 25359 10154 -7514 -21749 9329
9892 9329 10093 10607 9541 310 3412 4480 8240 6265 -6641 3358 45623 19675 4369 742
9878 742 3823 16045 8545 26068 51951 49621 57871 75177 41831 25792 33739 25375 2209
9865 2209 -7173 -9087 5368 28599 27004 28473 -7140 -2841 13388 33295 28761 33841 72182
9852 72182 73631 71441 65850 55289 68602 62185 35874 37865 65374 44326 28582 20219 16885
9839 16885 14088 17891 4908 14414 33378 26043 8131 4702 6867 13111 26181 38733 37759 38398
9825C8398N579J3542j678j3295j3099k362J4582K7326j1709j3451o481K772n60
9812C9564K2079L5534l4405k0296J0542R503Q1j0942k3772k8716N096Q068k860
9799I476J3743J0105J0101j8661Q005m137M533J6495J1221j6624k6356k6599p623
9786a6321J3404k828p71L822p644J118L522k421J6204K5511k909l130J9163j3103
9772C3617k8541q109K7581j2092k0912j133j5515k7706J7386L1788k3876l755
9760c1267J2501R989K6050M613M6j0584q257K0572L889J9849p88j7208j598k5741
9746B066l3912L122K0333J4133J7074M231Q87k880J9200K085k8338j0632p602
9733b33j6387R277P928o30k3995N916K7405J2315j2223P705L8768j7305l3794
$$ plain form
9825 38398 43977 57519 55841 42546 29447 27085 41667 68993 57284 43833 37352 40124 39564
9812 39564 61643 97177 62772 42476 53018 62521 62602 51660 27888 -828 4268 12336 9476
9799 9476 23219 33324 43425 24764 32769 28632 33165 49660 60881 44257 17901 -8698 -16321
9786 -16321 -2917 -5745 -6516 -2694 -10338 -9220 -5698 -8119 8085 33596 30687 27557 46720 33617
9772 33617 5076 -3033 24548 12456 -8456 -9589 -25104 -52810 -35424 -3636 -27512 -31267
9760 -31267 -18766 -8777 17273 21886 21932 11348 3091 23663 27552 47401 46613 29405 27807 2066
9746 2066 -31846 -28724 -8391 5742 22816 27047 27934 25054 44254 46339 18001 7369 -233
9733 -233 -16620 -7343 585 -45 -24040 -18124 9281 21596 9373 17078 55846 38541 4747
9720D747K3013J2559k1815k4742k481L136K2826l56L6899J6542j5048k2116l209
9707B9955k4087j7379N912K3722j4433j7389K103J996n986j4515q374L2900L5046
9694B9471K8710J8462k7345k3908j2705k6203J1256n929L5939P431R190k2420
9682B1949j8410n113R198M228k1486k9554R250R976q802O136K1542J611j6379
9669a5854J6666R600J6051m184l0202K591J7985J7359m323l024Q533j2097j3000
9656F101j607P506J2073q950j5055Q768L1963L4100R989l8737j3783k8265K889
9643F992J907O821q623k54P847K1800L5614M368j7283j7525m214k7003j3471R782
9629F758O246k8617K138L923P559l996K085J1654K851j0599R064J6581Q570j1518
$$ plain form
9720 4747 27760 40319 18504 -6238 -8719 -5583 17243 16887 53786 70328 55280 33164 29955
9707 29955 5868 -11511 -5599 18123 3690 -13699 -11596 -9600 -15586 -30101 -38475 -5575 29471
9694 29471 58181 76643 49298 25390 12685 -13518 -2262 -8191 27748 35179 44369 21949
9682 21949 3539 -1574 7624 11852 -9634 -39188 -29938 -19962 -28764 -22628 -1086 525 -15854
9669 -15854 812 10412 26463 22279 -7923 -5332 12653 30012 25689 22665 31198 19101 6101
9656 6101 4494 12000 24073 15123 68 8836 40799 74899 84888 46151 32368 4103 6992
9643 6992 8899 15720 7097 6843 14690 36490 72104 76472 59189 41664 37450 10447 -3024 6758
9629 6758 13004 -15613 -13475 -9552 -1993 -5989 -3904 7750 10601 2 9066 25647 34217 22699
9615B2699L544J5614K4348r486j6134q56l679j3267k4063j249J2873j4832J3910
9602I422Q69n65J4942j1250l7121J0453L183j7627K2851J3853l61j8486j2981
9589b2818J9436O774K2595R246J4777q174J014j5967P477O211q346j1705K0488
9576D1008j3574l238M718k1993l3528J2825P244J4824n502j343k72R179J2530
9563B2878O530k7293K3008K816k1466k8229J225K7845K3226P556j1733J1509j5872
9550B2000l212q97j1711j828J8691j486O783j6690k7212J0081J7377K12o291K3923
9536B9740J043P274k4774J2845j583j4336J1172L718j2483j4175M306P820J234
9523A1801j0900j4232J265K2977J1629Q552K1276k0473j3670j1169K167O416j8963
$$ plain form
9615 22699 26243 41857 66205 56719 40585 39729 36050 22783 -1280 -2529 10344 -4488 9422
9602 9422 10291 9726 24668 13418 -23703 -13250 -10067 -27694 -4843 9010 8649 -9837 -22818
9589 -22818 -3382 3392 25987 35233 50010 41836 42850 26883 34360 40571 32225 20520 41008
9576 41008 27434 24196 28914 6921 -26607 -13782 -6538 8286 2784 1441 1169 10348 22878
9563 22878 29408 2115 25123 27939 6473 -21756 -20531 7314 30540 38096 26363 37872 22000
9550 22000 18788 17891 6180 4352 23043 21557 28340 11650 -15562 -5481 11896 12108 5817 29740
9536 29740 30783 38057 13283 26128 24545 10209 21381 25099 12616 -1559 2747 10567 11801
9523 11801 901 -13331 -12066 10911 22540 31092 52368 31895 18225 7056 9223 15639 -3324
9510c324P562J0219J8663r613m596J0071J898k1717j4623j2777R695J0014l877
9497b405p968J0829J240p441K8520J6305k894l330n646k5651J0551j8692n766
9484a2348q978l356O247J0319l962Q968O770R539K1974O489k95k206p452j8346
9470A3363K9255m008k2524m873M356K566Q093J5253J2243N546o637k2684j3751
9457A6198J2649k4089k8051L737K0302M1K008l8556p141L1325J0166o993R320
9444I16J3718K2167r029j3058k5678j5810o627j1598l147O739L0711O442J777
9431b477J7750N169M98O835q761l5622k7079Q996Q651K3610K2746J384k626r142
9417I932R154j0939k3503j4076K5423j134R27K551k3109j7778o662m900J6098
$$ plain form
9510 -3324 4238 14457 33120 23507 18911 28982 30880 9163 -5460 -18237 -8542 1472 -2405
9497 -2405 -10373 456 1696 -5745 22775 39080 36186 32856 27210 1559 12110 -6582 -12348
9484 -12348 -21326 -24682 -18435 -8116 -12078 -3110 3660 13199 35173 41662 41367 39161 31709 13363
9470 13363 42618 38610 16086 11213 15569 18135 26228 41481 53724 59270 52633 29949 16198
9457 16198 28847 4758 -23293 -19556 746 787 2795 -35761 -42902 -11577 -1411 -8404 916
9444 916 14634 36801 27772 14714 -10964 -26774 -33401 -44999 -48146 -41407 -10696 -4254 -2477
9431 -2477 15273 20442 20940 27775 19014 -16608 -43687 -34691 -26040 -2430 20316 21700 19074 9932
9417 9932 19086 8147 -15356 -29432 -4009 -5143 -4216 -1665 -24774 -42552 -49214 -54114 -38016
9404c8016j3255N657K8641L1927J2035k1988k6888K361L3550j5682j1172L6247
9392B3417K9686P24l2153j2761K0496J7510l1105j878K5113M961K5522r453k9131
9379C0948l2940j2857j7094J1902j4357K2758L2762j485J464J0638J587l1957
9367A369n76K41j775M091M4874l491l0483k3754J2804O912J580l796p230N140
9353E906J3713J1351k2756j04O04K372j7316j8860k3718K5164J3091J154Q335
9340a064k0513r969Q445J0895L317K2985m438k0139j7136q97r784j4288K7280
9327b5306J5149q253k0563L285J019M274j5339J3437J5165o547K8720O255j5465
9314d169K6221l986p460n450J6698j1509j4756j8562k1406M480K7255K7654n774
$$ plain form
9404 -38016 -51271 -45614 -16973 14954 26989 5001 -21887 -19526 14024 -1658 -12830 23417
9392 23417 53103 53827 21674 8913 29409 46919 15814 13936 39049 44010 69532 60079 30948
9379 30948 -1992 -14849 -31943 -20041 -34398 -11640 21122 19637 21101 31739 33326 1369
9367 1369 793 1034 -741 3350 48224 44733 14250 -9504 3300 10212 11792 7996 766 5906
9353 5906 19619 30970 8214 8110 8714 11086 -6230 -25090 -48808 -23644 -10553 -9399 -1064
9340 -1064 -21577 -31546 -23101 -12206 -8889 14096 9658 -10481 -27617 -28514 -38298 -52586 -25306
9327 -25306 -10157 -18410 -38973 -35688 -34669 -30395 -45734 -32297 -17132 -23679 5041 11296 -4169
9314 -4169 22052 18066 10606 5156 21854 10345 -4411 -22973 -44379 -39899 -12644 15010 9236
9301I236J1544M911j561J8511j6776r987L90P56K004j3511K581q461k0590O823
9287a4130P403K8995K2204o203m798L5073j8374l1024k9656j8692J3677P705j9534
9274b7354o067j7697l639J0873J0319p853L659M506J7591Q081j563J2287M35j2666
9260i088k377k0827k81K2444K6549o306j264j3685J0868j1318j0676k443J8677
9247B73j7976j7586O602k1255L7124J5911R09J0001j0939K471J5708K468j9664
9234D047j6496o269K8892J2261k2850j3630L4805L310O56R478J6908j5487m456
9221C1169O451j1696l1925j3505n667k0783J0167N769J50R913J3995p224R2K311
9207a0783j7361J2890K4432k079q824j5205k7362Q933J0235j7480M910K0520N505
$$ plain form
9301 9236 20780 25691 24130 42641 25865 15878 16268 17024 19028 5517 8098 -363 -20953 -14130
9287 -14130 -6727 22268 44472 38269 33471 68544 50170 19146 -10510 -29202 -15525 -7820 -27354
9274 -27354 -33421 -51118 -54757 -43884 -33565 -41418 -37759 -33253 -15662 -7581 -9144 3143 3578 -9088
9260 -9088 -11465 -32292 -32573 -10129 16420 10114 8850 -4835 6033 -5285 -15961 -18404 273
9247 273 -17703 -35289 -28687 -49942 -12818 3093 4002 14003 3064 5535 21243 23711 4047
9234 4047 -12449 -18718 10174 22435 -415 -14045 20760 24070 24726 34204 51112 35625 31169
9221 31169 37620 25924 -6001 -19506 -25173 -45956 -35789 -30020 -29870 -19957 -5962 -13186 -13094 -10783
9207 -10783 -28144 -15254 9178 7099 -1725 -16930 -44292 -35359 -25124 -42604 -37694 -17174 -11669
9194a1669j1539J0634K7193Q631j1132j8209K0383K505j1051j8564k4553J485
9182c5886J3904k543L259j9236O681K599Q710K1540o790o128K0692j3063L341
9169b920l884M006J418j2667j4733K1266J125K6461k4236k0480l941K4448j617
9156e754j1828k056O804M938j1938q433J7570q21j8667k7313P043K0449k1850
9143e1856k85l39K043J5393k24K3236N989r47L284P839j7811J5021j1792R448
9129a001L1705j2487l0272L484P089L116l335J7944K1127J3621k2126l9149l6765
9116d7049P316R725J8898M165L102K2184K8900k2972k5563L574N38J7537J4308
9103C4663q908K0115l220k1118k5520o87j0896l4161J2607N8308J1141j7214l89
$$ plain form
9194 -11669 -23208 -12574 14619 23250 12118 -6091 14292 16797 5746 -12818 -37371 -35886
9182 -35886 -21982 -24525 -21266 -40502 -33821 -31222 -22512 -972 -7762 -13890 6802 -6261 -2920
9169 -2920 -6804 -2798 -1380 -14047 -28780 -7514 -6389 20072 -4164 -24644 -28585 -4137 -5754
9156 -5754 -17582 -19638 -12834 -7896 -19834 -28267 -10697 -11518 -30185 -57498 -50455 -30006 -51856
9143 -51856 -52141 -52480 -50437 -35044 -35268 -12032 -6043 -6990 -3706 4133 -13678 1343 -10449 -1001
9129 -1001 30704 18217 -12055 -8571 -1482 1634 -1701 16243 37370 50991 28865 -10284 -47049
9116 -47049 -39733 -30008 -11110 -6945 -3843 18341 47241 24269 -1294 2280 2818 20355 34663
9103 34663 25755 45870 42650 21532 -3988 -4675 -15571 -49732 -37125 21183 32324 15110 14721
9090A4721L110r752k2936J11K2900l902j527N962j2148j4721q734J2879L8758
9077B4721k034j5557n397J5795N463r714R679P541J284p752j2631Q388O420N880
9063C2086l263l63J0091k7610k3250K1843q169N954J1860Q489J1759j3362j5891
9050A0174K2886m481j6876L815o843N118j2659m115J4557K628J076P047N344j8359
9036I312j1040K3285k5625k0007j7413K0411K5175l09k7222q664j220M898L8578
9023A0159J1309j4504J9140J6001j5312j5841k719l2267k176K5831K5705k172
9011B3154k22j3343k2495L283l056K3792J8508k905j0104j6465k194P329k8762
8998b3480r230K3211K8943M272N588O906j7580j0051J309j4956M935J4657K650
$$ plain form
9090 14721 17831 8079 -14857 -14746 8154 4252 2725 8687 -3461 -18182 -26916 -14037 24721
9077 24721 22687 7130 1733 17528 22991 13277 22956 30497 31781 24029 11398 19786 26206 32086
9063 32086 28823 28460 38551 10941 -12309 9534 1365 7319 19179 27668 39427 26065 10174
9050 10174 33060 28579 11703 15518 8675 13793 1134 -2981 11576 14204 15280 22327 27671 9312
9036 9312 -1728 21557 -4068 -24075 -41488 -21077 4098 3789 -23433 -32097 -33317 -28419 10159
9023 10159 21468 6964 26104 42105 26793 10952 8233 -24034 -26210 -379 25326 23154
9011 23154 22932 9589 -12906 -9623 -12679 11113 29621 26716 16612 147 -2047 5282 -23480
8998 -23480 -32710 -9499 19444 23716 29304 36210 18630 8579 9888 -5068 -133 14524 17174
8985A7174J9741r5k3551P570j3096k653j3411k471J878J1538O146M700k0569n860
8971a2959M648L2015K7109j2995q139k056o682k862m62j5953j8652j5390k816
8958c5194J7436j8472J103j0329J595K5192K5144J3284j6175j1560j0583L373
8946a5186J230l059q599R944L1374J2616j1887j4600k1152j1610K6709o808j3119
8933b4147J5940M306j9991J6397N8264N15q802k416k4211m6125j8488J9596P605
8920b1557k7211N473J3526j610M1857L5593P277j5876k1135N382K6620k2019l5164
8907h844j6351j2355K7453J4437R759J0383K3438k9222j183K6720J8689k5671
8895C7253k1198R275J4803M345l2611j8014k5384O955K6478J0660m685j0449j3983
$$ plain form
8985 17174 36915 36820 13269 20839 7743 5090 -8321 -10792 -8914 2624 8770 13470 -7099 -12959
8971 -12959 -8311 23704 50813 37818 29679 27623 20941 18079 17617 1664 -16988 -32378 -35194
8958 -35194 -17758 -36230 -35127 -45456 -43861 -18669 6475 19759 3584 -7976 -18559 -15186
8946 -15186 -13956 -17015 -25614 -15670 15704 28320 16433 1833 -19319 -30929 -4220 -11028 -24147
8933 -24147 -8207 -3901 -23892 -7495 50769 51284 42482 40066 15855 -30270 -48758 -29162 -21557
8920 -21557 -48768 -43295 -29769 -31379 10478 46071 53348 37472 16337 21719 48339 26320 -8844
8907 -8844 -25195 -37550 -10097 4340 14099 24482 47920 18698 17515 44235 62924 37253
8895 37253 16055 25330 40133 44478 11867 -6147 -31531 -24576 1902 12562 7877 -2572 -16555
8882a6555J4011K192Q051J417K278j8357k2658J0604K3783k631M615M765Q080
8869A9595q131K8730K1928j2875k2283j0703J1753j5744l9387N140J5883m852
8857a0946k0017K781P322J2564K1140J7913j5403n066j6900K342k462R756J6881
8844A9905O431k1673l5452p568J2706N205N914K2721K899N777q594r500j6923
8831a8152J590N948P585K3277K1246K9356j1961k6518j1570J2487P910j838j1721
8818B7639j6493k4636J9755K7221M740J573Q361k6429k2291o188J9645J0082q032
8805A4947J129m224J7688l2609J295R355p202k3381R419L299O287L7448J6161
8792D9612P481m696K5084K1235k8472k0825k3414j3031j4032n292O398J9339l88
$$ plain form
8882 -16555 -2544 -352 7699 9116 11394 -6963 -29621 -19017 4766 2135 6750 11515 19595
8869 19595 11464 40194 62122 49247 26964 16261 28014 12270 -27117 -21977 -6094 -10946
8857 -10946 -30963 -28182 -20860 -8296 12844 30757 15354 10288 -6612 -4270 -6732 3024 19905
8844 19905 26336 4663 -30789 -38357 -25651 -20446 -14532 8189 11088 16865 8271 -1229 -18152
8831 -18152 -16562 -10614 -3029 20248 41494 70850 58889 32371 20801 33288 41198 39360 27639
8818 27639 11146 -13490 6265 33486 38226 39799 48160 21731 -560 -6748 12897 22979 14947
8805 14947 16076 11852 29540 -3069 -1774 7581 379 -23002 -13583 -10284 -3997 33451 49612
8792 49612 57093 52397 77481 98716 70244 49419 26005 12974 -1058 -6350 48 19387 18999
8779A8999N397j134m528j5425q725K3936J0739J5081j0897J1733K7848J4788l173
8766H4639o289N383p745L331k3595l9554n75J1334Q43J1447J0826J0701l0225
8753C0521n4979j1773K6675J2407K8077L1025J9589N807J8240k8738l2318k6532
8741A8001L1168O986j6447m197k2169r20j2058P261O323K423J4486j7827K7063
8728D0093N4331L1235K4597L7818J2429k9053l7355j3570j1146m2075l3465P753
8716D1592J0327o111J9409l209j1435j9650l059j1263P276J314K34K4658N690
8703E5773r348R444J9560K5765p173k5090l5343j8843j1776J1783J5030k8530
8691A252m078N520N12k183k3061j2578M637J3788L5048J8975J2669N261q262j0712
$$ plain form
8779 18999 24396 23262 18734 3309 -5416 18520 29259 44340 33443 45176 73024 87812 84639
8766 84639 78350 83733 75988 79319 55724 16170 15595 26929 27772 39219 50045 60746 30521
8753 30521 -24458 -36231 -9556 2851 30928 61953 81542 87349 105589 76851 44533 18001
8741 18001 49169 56155 39708 35511 13342 12422 364 7625 13948 16371 30857 13030 40093
8728 40093 94424 125659 150256 188074 200503 171450 134095 120525 109379 67304 33839 41592
8716 41592 51919 45808 65217 62008 50573 30923 27864 16601 23877 25191 25425 50083 55773
8703 55773 46425 55869 75429 101194 94021 68931 33588 14745 2969 14752 29782 1252
8691 1252 -2826 2694 3206 1023 -22038 -34616 -29979 -16191 18857 37832 50501 55762 47500 36788
8677C6788m399j6786L022j3712J7841O553j8218J520J2421m19j3647j5298J2754
8664H420o435K0551K4121L095r718j2294j5226k28L6571L278j4671J3236R444
8651F0144J8501J784L534k6587j8009O978J5888M441M39j2122J886j6859m614
8638C5404K6646J392o573j5984j148Q016o639j3099K7532P644K2421j4238j0857
8625F0517j4595N379m963P795L637N794R670j0307O277L1222K039l1353r332N61
8611F2341K1719K589J2803j289k5927P634r561r388N288K0446m630M500K4018
8598A10543L7955o573j1558R305j2698l7043o393J5398K2077O522Q504M414M666
8585A45119j3988j3115M492J8039K1230L7488L912J2556M989n956K6254K1756
$$ plain form
8677 36788 32389 15603 18625 4913 22754 29307 11089 12609 25030 24611 10964 -4334 8420
8664 8420 1985 22536 46657 49752 40034 27740 12514 12286 48857 52135 37464 50700 60144
8651 60144 78645 80429 83963 57376 39367 46345 62233 66674 67113 54991 56877 40018 35404
8638 35404 62050 63442 56869 40885 39737 47753 41114 28015 55547 63191 85612 71374 60517
8625 60517 45922 51301 46338 54133 57770 63564 73234 62927 69204 100426 102465 71112 61780 62341
8611 62341 84060 86649 99452 98163 72236 79870 70309 60921 66209 86655 82025 86525 110543
8598 110543 148498 141925 130367 139672 126974 89931 83538 98936 121013 127535 136039 140453 145119
8585 145119 131131 118016 122508 140547 161777 199265 203177 215733 220722 214766 241020 262776
8573B62776M5786K8381M0759K7464J7933J437M7900M2211L9545J0912J1380Q289
8561E84773l278k4910o2119o6192m8525j2057p0021m9401j0285j6930k0292q732
8549A92031O622q184n4165m3212l0076r60J7083l616j6573J1110J6888K0292J261
8536A08501Q764k450j0363j8311J5956N914j2430K465J1373j5276n3558k9756
8524A0829n397K6814J602L790J9439L1737j0863k6530j7834j442O600M587K8049
8511G1381m997R695J4852M106j7720r126l344J832J0948j6048j0541k8312j5873
8498F853o109M741R367m526J4191K3290j6863j6554J2100q530k2895P738L0563
8485C3366J2636r078N283K532j7919J2472L0538k17k6970j0300J4972m751j913
$$ plain form
8573 262776 308562 336943 377702 405166 423099 424536 472436 514647 554192 565104 576484 584773
8561 584773 581495 556585 494466 428274 379749 367692 297671 248270 237985 221055 200763 192031
8549 192031 198653 190469 136304 93092 63016 62056 79139 75523 58950 70060 86948 107240 108501
8536 108501 117265 114815 104452 86141 102097 108011 95581 98046 109419 94143 40585 10829
8524 10829 5432 32246 33848 37638 57077 88814 77951 51421 33587 32145 38745 43332 71381
8511 71381 66384 76079 90931 95037 77317 68191 64847 66679 77627 61579 51038 22726 6853
8498 6853 744 5485 14852 10326 24517 47807 30944 14390 26490 17960 -4935 2803 33366
8485 33366 46002 36924 42207 44739 26820 39292 69830 69613 42643 32343 47315 42564 40651
8472D0651K6632J3698L708Q223k0535l4486J5422P696p059j1158J8537p710k7713
8459B5906j0141n615J737r90J458J9536K8012L247m3487j0841J4476J4723k7365
8446A0656q434j4057K0223Q513r188Q146J6909k0846l1372j9460K0697J8453J4879
8433A5119J4826k891j391J668L826L595J5416J3380P844Q715j4613p700k0387
8420C7407l3453j6784J4318O047J6040q527j087k224N780R171k1477j2551j0833
8407a8173J3048P983j0592m573k2130J1695L2872K2402L537j3621P53J906J0200
8394C5307J317q166k0110R324j3577j044J5362k433R3J2531R0l5477M825P002
8380E044O798L383J3217Q586k0659N787K3238J7456k2465l4239L629j2962L3048
$$ plain form
8472 40651 67283 80981 84689 92912 72377 37891 53313 61009 53950 42792 61329 53619 25906
8459 25906 15765 10150 11887 10897 12355 31891 59903 63150 19663 8822 23298 38021 10656
8446 10656 2222 -11835 8388 16901 7713 15859 32768 11922 -19450 -38910 -18213 240 15119
8433 15119 29945 27054 25663 27331 31157 34752 50168 63548 71392 80107 65494 57794 37407
8420 37407 3954 -12830 1488 7535 23575 15048 13961 11737 17517 26688 5211 -7340 -18173
8407 -18173 -5125 2858 -7734 -12307 -34437 -22742 10130 32532 36069 22448 23201 25107 35307
8394 35307 36624 28458 8348 17672 4095 3051 18413 15980 16073 28604 28694 -6783 -1958 5044
8380 5044 11842 15225 28442 37028 16369 22156 45394 62850 40385 6146 9775 -3187 29861
8367B9861K0142k0839M24J5353l16l0319j5739M4692K4197q432k2543j1410P772
8354C2843M912m7591J4102J8991j3757k1751R11L603r535m3527j0424J6985J8390
8341c5848J1658j3959j4962K9367N2589N268k6169Q794k800o918J5229J3661J1686
8328D7596J839k0990j9372K996j0611J400L640n194r033j45K529j909n605j319
8314a4178J7481K7272J8134K6563k2641l5465j0872M068O925l781J5667J611j7963
8301A2821N830l1786Q088j8286L503J367J0034M722K7290L1845j7706l0178m1226
8288c3682l1518J762K0971L5367L2327j24q231l0524m757J9741J8837R696J8677
8275D8542n023n9431m9026M63M9941O420Q124L106l104l050r120N379r581j7700
$$ plain form
8367 29861 50003 29164 29588 44941 44625 14306 -1433 43259 67456 59024 36481 25071 32843
8354 32843 37755 -9836 4266 23257 9500 -12251 -11340 -7737 -17272 -60799 -71223 -54238 -35848
8341 -35848 -24190 -38149 -53111 -23744 28845 34113 7944 16738 13938 7020 22249 35910 47596
8328 47596 49435 28445 9073 12069 1458 2858 6498 1304 -7729 -7874 -5345 -7254 -12859 -14178
8314 -14178 3303 30575 48709 75272 52631 17166 6294 10362 17287 13506 29173 30784 12821
8301 12821 18651 -13135 -5047 -23333 -19830 -18463 -8429 -3707 23583 55428 37722 7544 -33682
8288 -33682 -65200 -63438 -42467 -7100 25227 25103 16872 -13652 -18409 1332 20169 29865 48542
8275 48542 43519 -15912 -64938 -64475 -14534 -8114 10 3116 12 -3038 -12158 -6779 -16360 -34060
8261c4060M088L874O236J2768K6180l709j7901L783K1709j3217j258j1773j9938
8248b3218K413o70K388L430J0704J6529O814l884m263j776L2517q276j0731J851
8234B3828Q612J571j1995J0013J3409J26L1282k119J327k0452j4580r036l3313
8221a327m434k240j2665J2215p59J5171P465j7099J2728J4101j0887L112J0898
8208B6279j3660j0338P570o351k0139j6877K7704J2647j1732P568J6427n766p222
8195F110j5970o167q595J6066J6136J9668j4908M135N628j9831P93J3880P366
8182B4311j4094J9113l518j5046L170O710j1600M640J0820m237o656k581m108
8169F924N094q949l35J2124m199J6810q658j766R348M733K5363l4889N442J1589
$$ plain form
8261 -34060 -29972 -26098 -19862 -7094 19086 15377 -2524 1259 22968 9751 8493 -3280 -23218
8248 -23218 -20805 -21475 -19087 -15657 -4953 11576 18390 14506 10243 8467 40984 32708 21977 23828
8234 23828 32440 34011 22016 32029 45438 45564 76846 74727 76054 55602 41022 31986 -1327
8221 -1327 -5761 -8001 -20666 -8451 -9210 5961 13426 -3673 9055 23156 12269 15381 26279
8208 26279 12619 2281 9851 3500 -16639 -33516 -5812 6835 -4897 2671 19098 13332 6110
8195 6110 -9860 -16027 -24622 -8556 7580 27248 12340 16475 22103 2272 3065 16945 24311
8182 24311 10217 29330 25812 10766 13936 20646 9046 13686 24506 20269 13613 11032 6924
8169 6924 12018 3069 2734 14858 10659 27469 18811 17045 26393 31126 56489 21600 27042 38631
8155C8631j0057j1693p966l221j7163m1281R527J4471L148k6279o037K0754L7736
8142E70M2274J0731j4236n763P216k6569q402j757R847j5843o36l6075R590K2976
8128f077K5901j611r54J8952q814k2619P927j1961p296N150j1179k0822j1553
8115d4956K980j2532j7413M811L2423q474J2100K8848J4076P004q854k4406q210
8102b2603J9659j8170J4043O634k7642K6977P616l459P952J1720L64J0138J5354
8089D8583M392k8139P221J1648K160R395M823Q048J125k6785k4547q195k777j7125
8075a0173m0008n329K9438L5766l426j4369Q565J5627j0680j4307n758J9077K6027
8062C0450k237j9921k2577J4950l007K280O649J0366j2424m757J7007n519j9044
$$ plain form
8155 38631 28574 16881 8915 5694 -11469 -52750 -43223 -28752 -25604 -51883 -57920 -37166 570
8142 570 42844 53575 39339 33576 40792 14223 5821 4064 13911 -1932 -2568 -38643 -29053 -6077
8128 -6077 19824 18213 17259 36211 27397 4778 12705 744 -6552 -1402 -12581 -33403 -44956
8115 -44956 -41976 -54508 -71921 -67110 -34687 -43161 -31061 -2213 11863 18867 10013 -14393 -22603
8102 -22603 -2944 -21114 -7071 -437 -28079 -1102 6514 3055 11007 22727 23091 33229 48583
8089 48583 52975 24836 32057 43705 45865 55260 60083 68131 69256 42471 17924 9729 6952 -10173
8075 -10173 -50181 -55510 -26072 9694 6268 -8101 464 16091 5411 -8896 -14654 4423 30450
8062 30450 28213 8292 -14285 665 -2342 -62 6587 16953 4529 -228 16779 11260 -7784
8049g784Q452j9315n556K386J0145Q48R536K7995J046O563J9224r279P329k8622
8035B2968m2619M086K4841j752q838J1812j670k3305j5386m695L203L3783K6831
8022B9259K2008J5223j7989l4942k9709J9265K2465J1948J6197p313k5676J343
8010B2079P705J6983J3931L550r77J8447j963l4671o778n236R896P813p817m1555
7996A407l7212O297p339K4569J9147K3090L444R049k5756j4531j0238J4038j3688
7983g723m997K8218L9219J981k6127Q518J9175Q400l101k3179j4314m413P510
7970B9167K9174K7724K372Q153k113K6192K9240J3702l1770p182j6933l2175k7121
7957D8430j0025O858J3797N089K1476m833k9982j0360j1345O077M827K3941P598
$$ plain form
8049 -7784 668 -18647 -24203 -21817 -11672 -10824 -1288 26707 27753 34316 53540 44261 51590 22968
8035 22968 -19651 -15565 9276 7524 -1314 10498 8828 -14477 -29863 -34558 -31355 2428 29259
8022 29259 51267 66490 48501 13559 -16150 3115 25580 37528 53725 46412 20736 22079
8010 22079 29784 46767 60698 64248 63271 81718 79755 45084 38306 33070 42966 50779 42962 1407
7996 1407 -35805 -29508 -36847 -12278 6869 29959 33403 42452 16696 2165 -8073 5965 -7723
7983 -7723 -12720 15498 54717 56698 30571 39089 58264 66664 63563 40384 26070 21657 29167
7970 29167 58341 86065 88437 96590 94477 120669 149909 163611 131841 124659 107726 75551 48430
7957 48430 38405 45263 59060 64149 85625 80792 50810 40450 29105 35182 40009 63950 71548
7944G1548m385j676K5047j101j7098j2241P141j6180J304J8241K0841P911k5346
7931G4006m940P818k7128p037j7381N362L6448O032J4445q419j8659L534M927
7918F9008L1135R001j1940q205j4391j2605M949m78r054k3659j5513j1636r597
7905b985M4867j5478j6945l206K0726m100j7312m210p743K1604J8255j8607K24
7892A5090j430J1382m662j1251L831K6881p199l7153Q45J3478P473J1425J344
7879C0054k3015j3159m101j1880o515J9984J1955j4003O746L0138K3620j0610
7867C9214m3813k3500J3201J1160j7400l673K6390J7634k583j5684k3788j6518
7855c9360J2793L1031L998J6461l964j6560q891J0160j838j7392J1028J0671j209
$$ plain form
7944 71548 67163 65487 90534 89433 72335 60094 67235 51055 52359 70600 91441 99352 74006
7931 74006 69066 76884 49756 42719 25338 30700 67148 73180 87625 79206 60547 64081 69008
7918 69008 100143 109144 97204 88999 74608 62003 66952 66474 57420 33761 18248 6612 -2985
7905 -2985 41882 26404 9459 6253 26979 22879 5567 1357 -6386 15218 33473 14866 15090
7892 15090 13660 25042 20380 9129 12960 39841 32642 -4511 -3666 9812 17285 28710 30054
7879 30054 7039 -6120 -10221 -22101 -28616 -8632 3323 -10680 -3934 26204 49824 39214
7867 39214 -4599 -28099 -14898 -3738 -21138 -24811 1579 19213 16630 946 -22842 -39360
7855 -39360 -26567 4464 8462 24923 20959 4399 -4492 5668 3830 -13562 -2534 8137 6928
7842F928o68j077J1372l089O229K1301J0218J925j1510l3993K6209J1122k4558
7829B0409P389k0290k5887k3669o726J3203J411J647K2728o49K442K231J5304
7816I543k5768J9977R707M864J1962J2740J789j1120j7551j8582j7637J7512Q671
7803F107L1051k254l6261j9689R810N373J1186J6372j1818p079M121J4560Q136
7790B9615J011j5349r441j4748r982k0145q412L2208L4503N295j5803j2230k8781
7777c2259M064n108K1012M9442J7153l8809m1852P698K5204j9906J2853J5397
7765A4889J5676M530j3488k305k0762J1020n033j3760m670q020J576J0905M269
7752e173O155p143n138Q898K0406l357m2207k564J8005N077o715p461K8592r095
$$ plain form
7842 6928 6260 5183 16555 13466 19695 40996 51214 53139 41629 7636 33845 44967 20409
7829 20409 27798 7508 -18379 -42048 -48774 -35571 -34160 -32513 -9785 -10434 -7992 -5761 9543
7816 9543 -16225 3752 13459 18323 30285 43025 44814 33694 16143 -2439 -20076 -2564 6107
7803 6107 37158 34904 -1357 -21046 -11236 -5863 5323 21695 9877 2798 6919 21479 29615
7790 29615 30626 15277 5836 -8912 -18894 -39039 -47451 -15243 19260 24555 8752 -3478 -32259
7777 -32259 -28195 -33303 -12291 37151 54304 15495 -26357 -18659 6545 -13361 -508 14889
7765 14889 30565 35095 21607 19302 -1460 9560 4527 -9233 -13903 -21923 -20347 -9442 -5173
7752 -5173 982 -6161 -11299 -2401 18005 14648 -27559 -30123 -12118 -7041 -13756 -21217 7375 -1720
7738a720p545k4870J2600L5474J2604k2212j9179j5465j2324J2975J6150M449
7726i063j5683j2226L4495L5578j2684k3568N461J8152J7990Q17k6919j9946l0926
7713c8522j3606k797j926J7152o621J5290j1090j0939J5445Q609j90J4581k9497
7700d4111k519J5620j239N02l520K3312K9359j2710j3765q59J8460K6028l3406
7687A152o2918J5757J8896K0361m0210m590L2693K2361K0173k0304k9085k1193
7675d6907K801J4483L239o527J3255J5625j2282k0569j0185j6406K0492J0643
7663c2338j4474K3666M5691J3399j0162n712K858N617o495k2136k9693j8755m046
7650e2580J6603j2313j7268O788N450R233Q174K6209R603J4381o127k1771L4295
$$ plain form
7738 -1720 -9265 -34135 -21535 13939 26543 4331 -14848 -30313 -42637 -29662 -13512 -9063
7726 -9063 -24746 -36972 -2477 33101 20417 -3151 2310 20462 38452 39269 12350 -7596 -38522
7713 -38522 -52128 -54925 -56851 -39699 -46320 -31030 -42120 -53059 -37614 -29005 -29195 -14614 -44111
7700 -44111 -46630 -31010 -32249 -31747 -35267 -11955 17404 4694 -9071 -9930 8530 34558 1152
7687 1152 -61766 -46009 -27113 -6752 -46962 -51552 -18859 3502 23675 3371 -25714 -46907
7675 -46907 -44106 -29623 -26384 -32911 -19656 -4031 -16313 -36882 -47067 -63473 -42981 -32338
7663 -32338 -46812 -23146 22545 35944 25782 20070 22928 28545 22050 -86 -29779 -48534 -52580
7650 -52580 -35977 -48290 -65558 -58770 -53320 -44087 -35913 -9704 -101 14280 8153 -13618 20677
7637B0677J5045k1611j3448O570L1331k8150k199R129j3066j0918j0186J1843
7625d983K02k804Q261M379p64O505J3246j5718K452K0637L818M317J299Q885J4008
7610F3740k4823N992J0072k8668k4496p21Q852k8448k510Q076l362n227q827l0339
7596f0689k620K4402L3492n14j3742k0237k510O443J7465L3678Q945J0979P46
7583C5838p854J0573L192m834k0285k5681n712l795j6387k531L2320o095k1379
7570c2630M2743L7663L914j0193m7467k7195j8783R226L5032J2827l796o113Q841
7557D069k5676l7266k7261L6876P641J2369L8122J5518j3817k1540K586q267r708
7544b6354J5097J6560q785M925j8052n958J0958P879j1430R811m904l722J8310
$$ plain form
7637 20677 35722 14111 663 7233 38564 10414 8215 17344 4278 -6640 -16826 -4983
7625 -4983 -4781 -7585 676 5055 4291 10796 24042 8324 10776 31413 35231 39548 40847 49732 63740
7610 63740 38917 44909 54981 26313 1817 1096 9948 -18500 -21010 -12934 -16296 -21523 -30350 -60689
7596 -60689 -63309 -38907 -5415 -5929 -19671 -39908 -42418 -35975 -18510 15168 24113 35092 35838
7583 35838 27984 38557 41749 36915 16630 -9051 -14763 -18558 -34945 -37476 -5156 -11251 -32630
7570 -32630 10113 47776 51690 41497 -5970 -33165 -51948 -42722 -7690 5137 1341 -4772 4069
7557 4069 -21607 -58873 -86134 -49258 -41617 -29248 8874 24392 10575 -10965 -8379 -16646 -26354
7544 -26354 -11257 5303 -3482 1443 -16609 -22567 -11609 -3730 -15160 -5349 -10253 -13975 4335
7531D335L7025P508n5073j5775Q423J0966J1707k3027k4177J0543K612n052K0671
7518i314K0741K2142l379k9781j9339J105M318Q201J6075L1310j2996j1934K134
7505A9283k5109j1728K6685J6258k2762l1055j5275j2458R880J8533J8346J3981
7493D579J8390J254j8465j6940K0215R530M334O048K2029k6500j4382n131L524
7480H485J4611J9371k4333k0487p397N360j7879l114o854M923K6844J6250O637
7467B2417K795J155J48l987j4486J2528Q376o000j0783l2687k1885o314J6548
7454c2175R526q436J4649k3903L989j709J1799K0282o124L9142J7032n813P669
7441D5928q912l388j2268l950j0146R121J3823j1662L667k9018q772O243J4909
$$ plain form
7531 4335 41360 48868 -6205 -21980 -13557 -2591 9116 -13911 -38088 -27545 -24933 -29985 -9314
7518 -9314 11427 33569 30190 409 -18930 -17825 -13507 -5306 10769 42079 29083 17149 19283
7505 19283 -5826 -17554 9131 25389 2627 -28428 -43703 -56161 -46281 -27748 -9402 4579
7493 4579 22969 24223 5758 -11182 9033 18563 22897 28945 50974 24474 10092 4961 8485
7480 8485 23096 42467 18134 -2353 -9750 -4390 -22269 -25383 -32237 -27314 -470 15780 22417
7467 22417 25212 26367 26515 22528 8042 20570 28946 22946 12163 -20524 -42409 -48723 -32175
7454 -32175 -22649 -31085 -16436 -40339 -36350 -38059 -26260 -5978 -12102 27040 44072 38259 45928
7441 45928 37016 33628 21360 17410 7264 16385 30208 18546 22213 -6805 -15577 -9334 5575
7428E575j1066K1017P099K3498N731o885r584j5935l781k9043J2542L3403O730
7415C9301k5042r258L773j6984k1899j5454J4144L6100J7019p744r662j3072J7575
7402H797m182j4549j2497k011r428L089j2671J4008J4151J0566m578j4068J0806
7389a2567J1973j0426P469j8930N227N352j7797r691P762r809L638J7681K5320
7376E202j5573j9452J7278Q498j039j4501J9401J6170j4435Q894l794l6094j3900
7363d3345J742R280K4162N158M389J3813j3782K00n248N643j3563n551N53J206
7349a5343P014p889j0807j283J3174L0086l142J6901O126j3122j7105m1707M374
7336c2723L8812r24q430K3497J0757j1302q980l3230J5198j5358k8096j4826j428
$$ plain form
7428 5575 -5491 15526 22625 46123 51854 44969 35385 19450 15669 -13374 -832 32571 39301
7415 39301 14259 5001 8774 -8210 -30109 -45563 -31419 4681 21700 13956 4294 -8778 8797
7402 8797 4615 -9934 -22431 -24442 -33870 -30781 -43452 -29444 -15293 -4727 -9305 -23373 -12567
7389 -12567 -594 -11020 -3551 -22481 -17254 -11902 -29699 -39390 -31628 -41437 -37799 -20118 5202
7376 5202 -10371 -29823 -12545 -4047 -5086 -19587 -186 15984 1549 10443 6649 -29445 -43345
7363 -43345 -41603 -32323 -8161 -3003 1386 15199 1417 1617 -3631 2012 -11551 -17102 -16549 -15343
7349 -15343 -8329 -16218 -27025 -28308 -15134 14952 11810 28711 34837 21715 4610 -37097 -32723
7336 -32723 6089 5165 -3265 20232 30989 19687 10707 -22523 -7325 -22683 -50779 -65605 -67033
7323f7033R683j88O293j7417j4531R435K6055J5634J0083m968l406J5475J7770
7310B885J6760j9710j6020J1280J0010J9710K605j6488l34j6876l3434j0946K9383
7297b1175K3345j0533J516K4931m185k1464j7789N116R652K138J4514K0958j9972
7284G052q851l870j4559K5104L0757K669j5106l063j2169q42j6075k8185O520
7271c0618j2469m492J6130K872j583J1408j5101k676K8216J0460j3913p018m0836
7258e9620j6808L3125K4956P746o95j8791K639J027K3224J1084O17L690q466o209
7244b481l8991l1877M081K9432L3749j0110j4587j3998k3555K1009P262j5716
7232e5782J5614L3389r00j3412O513j0739M228K2806J1765j2037K5080j3193l1031
$$ plain form
7323 -67033 -57350 -57538 -51245 -68662 -83193 -73758 -47703 -32069 -21986 -26954 -30360 -14885 2885
7310 2885 19645 -65 -16085 -4805 5205 24915 27520 11032 10698 -6178 -39612 -50558 -21175
7297 -21175 2170 -8363 -6847 18084 13899 -7565 -25354 -20238 -10586 -8448 6066 27024 7052
7284 7052 -1799 -5669 -20228 4876 35633 38302 23196 20133 7964 7122 -8953 -37138 -30618
7271 -30618 -43087 -47579 -31449 -28577 -30160 -18752 -33853 -36529 -8313 2147 -11766 -18784 -59620
7258 -59620 -76428 -43303 -18347 -10601 -11296 -30087 -27448 -26421 -3197 7887 8504 12194 3728 -2481
7244 -2481 -41472 -73349 -69268 -39836 -6087 -16197 -30784 -44782 -68337 -47328 -40066 -55782
7232 -55782 -40168 -6779 -7679 -21091 -14578 -25317 -21089 1717 13482 1445 26525 13332 -17699
7219a7699j4999J2631l661k183J6179J6444M763j2600N034r33k5818j7451J2853
7206b7440J662K2263l17K7207j4757n891N2j5133J3985L0j017j3521M177J6746
7192H046l769j7779j3608L3372L0091k3360k6853o039J9798M390k7276k0888j9600
7179f3475J0353J3041J3605P653N709l828j3524L2172K315O408q967k0263j6400
7166c5201J5155l405Q74K349L326R065P113J4333l2299n634J5996J9145j0000
7153H17j0178L984J4504k133l0297j2504j5901n930R094J8840L2269M48l9054
7140c6041n059Q449Q831J9663j2916J913j2473q567k314n812m207K5001J4142
7127i390l776J172J7814k9497m0075j154J14K1631K4170n923j1621K3158R848
$$ plain form
7219 -17699 -32698 -20067 -23728 -25911 -9732 6712 11475 -1125 3909 2976 -22842 -40293 -27440
7206 -27440 -25778 -3515 -3832 23375 8618 2727 2779 -12354 1631 1661 644 -12877 -8700 8046
7192 8046 4277 -13502 -27110 6262 36353 12993 -13860 -19899 -101 4289 -22987 -43875 -63475
7179 -63475 -53122 -40081 -26476 -18823 -13114 -16942 -30466 1706 4021 10429 1462 -18801 -35201
7166 -35201 -20046 -23451 -22577 -20228 -16902 -7837 -724 13609 -18690 -24324 -8328 10817 817
7153 817 -9361 -5377 9127 6994 -23303 -35807 -51708 -57638 -48544 -29704 2565 3013 -36041
7140 -36041 -41100 -32651 -23820 -4157 -17073 -15160 -27633 -36200 -38514 -44326 -48533 -23532 -9390
7127 -9390 -13166 -11994 5820 -23677 -63752 -64906 -64792 -43161 -18991 -24914 -36535 -13377 -3529
7114c529J1358o959Q221J1195N250r579k6983j3094r638j610K1034M86N626j6893
7100b5115p663J8077K4814R851j3220j3582m124o917o016N367J4000q06K398j3469
7086a6405R298P054R030j399N968l8430k7548m555K1783K1255r516M616k071n133
7072b6053Q842l508o024K5902K4746k8580l1900J151n001L246J6331J9863N306
7059D321K296K920p501J2209J0627l268j445J0149Q750k4378Q846n112j7475j110
7045a71L966p082N163j5086j1552L262K9424J2167q616l343r909M398N498n466
7031B653j084j8690J008K090n764j3423q812j5465K6536L8505Q751j0354n3267
7018d7316m642Q741J4593j6928K8039J3286j5384j7539j5863j1617J8510M947
$$ plain form
7114 -3529 7829 870 9091 20286 25536 15957 -11026 -24120 -33758 -35368 -14334 -13848 -8222 -25115
7100 -25115 -32778 -14701 10113 19964 6744 -6838 -10962 -17879 -23895 -18528 -4528 -5334 -2936 -16405
7086 -16405 -7107 -53 8977 7578 13546 -24884 -52432 -56987 -35204 -13949 -23465 -18849 -20920 -26053
7072 -26053 -17211 -20719 -26743 -841 23905 -4675 -36575 -35424 -40425 -37179 -20848 -985 4321
7059 4321 6617 9537 2036 14245 24872 21604 20159 30308 39058 14680 23526 18414 939 -171
7045 -171 3795 -3287 1876 -13210 -24762 -21500 7924 20091 11475 8132 -1777 2621 8119 2653
7031 2653 1569 -17121 -16113 -14023 -19787 -33210 -42022 -57487 -30951 7554 16305 5951 -47316
7018 -47316 -51958 -43217 -28624 -45552 -17513 -4227 -19611 -37150 -53013 -64630 -46120 -41173
7006d1173m657J7693L1527J1889N993p999l5309l9745l679J0205L6306j1959l8692
6993f9600L9991L3769l115J2394J4362J3077J0190j7143r186o069j6186k4386
6981b1902J4843J9516n512K2963K495j4091j5185j653R889l500R878k2153k3945
6968b8357O591r858R006J966L143O525L206N520j2702N836M950j1315n622j0248
6954c1359k2779j4826o591L380K6021J8328L5534J6883j0787r472l568J5920j2052
6941D632j1657K8714K4375n907k9623j3582o258O613J3584L324j8443k8489j7470
6928e0187J0928K7505K1150k4531k4233j629L1090M7903j9119j0783n004P151
6916A0241j8707P363J9648j9122n848j4494m3192M52J4085L596K2455j4927J766
$$ plain form
7006 -41173 -45830 -28137 3390 15279 21272 13273 -22036 -61781 -65460 -55255 -18949 -30908 -69600
6993 -69600 -29609 4160 1045 13439 27801 40878 51068 33925 24739 18670 2484 -21902
6981 -21902 -7059 12457 6945 29908 32403 18312 3127 1474 11363 7863 17741 -4412 -28357
6968 -28357 -21766 -31624 -22618 -20652 -17509 -10984 -7778 -2258 -14960 -9124 -4174 -15489 -21111 -31359
6954 -31359 -54138 -68964 -75555 -72175 -46154 -27826 7708 24591 13804 4332 764 16684 4632
6941 4632 -7025 21689 46064 40157 10534 -3048 -9306 -2693 10891 14215 -4228 -32717 -50187
6928 -50187 -39259 -11754 9396 -15135 -39368 -40997 -9907 37996 18877 8094 3090 10241
6916 10241 -8466 -1103 18545 -577 -6425 -20919 -64111 -63659 -49574 -45978 -23523 -38450 -36684
6903c6684q051j876r871Q780L9762J5166q109J1186K3808k0745k0527k86m169
6890a1616j232m000K0343J6412l339o330p078P13r166l2443K4414J6867j2743
6877i198j636L3132m04j3147k321N271l7988l4931m424L9774K229J4614J5479
6864F450j2727Q096j157m014K9045N981j2362J1558K0576l5418p553j5777j266
6851h568J5297l6141j4414L9905J1437k1517k1614Q68J0338J3007K6204j1406
6839C396M620N090J4421r419l0101j0761K261J2873j3722N953J3185O892o149
6826a461p45k999R246J0293m256q648k5317N882K8272L5289j4692j9669J874j1258
6812A811k0126N402J3403N314j8805r870J6948K1977j3643n0226l2137l3624K340
$$ plain form
6903 -36684 -44735 -46611 -56482 -47702 -7940 7226 -883 10303 34111 13366 -7161 -7447 -11616
6890 -11616 -12848 -16848 3495 19907 16568 10238 3160 3873 -5293 -37736 -13322 3545 -9198
6877 -9198 -10834 22298 21894 8747 6426 11697 -26291 -61222 -65646 -25872 -23643 -9029 6450
6864 6450 -6277 1819 662 -3352 25693 31674 19312 30870 51446 16028 8475 -7302 -8568
6851 -8568 6729 -29412 -43826 -3921 7516 -14001 -35615 -34747 -24409 -11402 14802 3396
6839 3396 8016 13106 27527 18108 -11993 -22754 -20493 -7620 -21342 -15389 -2204 4688 -1461
6826 -1461 -2206 -5205 4041 14334 10078 1430 -23887 -18005 10267 45556 30864 11195 13069 1811
6812 1811 -18315 -12913 490 5804 -13001 -22871 -5923 16054 2411 -47815 -79952 -113576 -111236
6799a11236M0071L6985L868j2661R053j2177j3879K1280J0429K953K3076j154
6787c392k4288J7765K001j6967m333J7970J5945j1106Q009j545K697L592j4742
6774h394j6105J9293O90q606k9j9596J2243k205l0539J9088J7541O819K2516J3409
6760B6125j0795l3430o12L8654N434k1081p344p183J5243J0530k477k0520j264
6747h720m356Q933o68o568J7126J3705j554J872j5648k8077j8517J1676J5987
6734a4809K5216J609j2127J7803N465K7478O927j8606j668L825k4975l993J9983
6721C2128k2759K381K4295J2456k0873p287J1463k2332j9225Q570J5158L907l051
6708A4831k3019k2600O389j823q545K7659M5027k3865l2539J6904K726K423j7083
$$ plain form
6799 -111236 -71165 -34180 -30312 -42973 -33920 -46097 -59976 -38696 -28267 -25314 -2238 -3392
6787 -3392 -27680 -9915 -7914 -24881 -29214 -11244 4701 -6405 1604 59 2756 6348 -8394
6774 -8394 -24499 -5206 -4516 -13122 -13151 -32747 -20504 -22709 -53248 -34160 -16619 -9800 12716 26125
6760 26125 15330 -18100 -18712 19942 25376 4295 -3049 -10232 5011 15541 13064 -7456 -8720
6747 -8720 -13076 -4143 -4811 -11379 5747 19452 17898 19770 4122 -23955 -42472 -30796 -14809
6734 -14809 10407 12016 -111 17692 23157 50635 57562 38956 37288 41113 16138 12145 32128
6721 32128 9369 11750 36045 48501 27628 20341 31804 9472 -9753 -1183 13975 17882 14831
6708 14831 -8188 -30788 -24399 -26222 -34767 -7108 37919 14054 -18485 -1581 1145 3568 -13515
6695a3515N046J2610L1597K3097k0582n618j1465J804k2861p783J6612j573M76
6682G845k113J0525M854p348Q509k552l962j670q390k090j5662k0548r446N050
6668c6998L4686J0377k6470l727J7152L6103K7651j8037l4607j7064K1958n747
6656E277J600o685J1590K2029P8j9545p874q478n147K4526K0039j2125k2106O303
6642I482j9439k535P461J3674L9892o322k3444m1175k8476m580J0760J9668l861
6629b8895J0125k223K194J0579q297k661J6281J2146k1137K1668J4344j5691P60
6616I193l462j5301j6158N39J5871N57k009J4932K3927J2069q714j2782j6612
6603B050L178o429O268J6212l026o621J1715j5251r614j1932P846M063l032l2485
$$ plain form
6695 -13515 -8469 4141 35738 58835 38253 32635 21170 22974 113 -7670 8942 7369 7845
6682 7845 5732 16257 21111 13763 22272 19720 15758 14088 5698 3608 -12054 -32602 -42048 -36998
6668 -36998 -2312 8065 -18405 -22132 -4980 31123 58774 40737 6130 -10934 11024 5277
6656 5277 6877 192 11782 33811 33889 14344 6470 -2008 -7155 17371 37410 25285 3179 9482
6642 9482 -9957 -12492 -5031 8643 48535 42213 18769 -22406 -50882 -55462 -44702 -25034 -28895
6629 -28895 -18770 -20993 -18799 -8220 -16517 -19178 -2897 9249 -11888 9780 24124 8433 9193
6616 9193 5731 -9570 -25728 -25189 -9318 -8761 -10770 4162 28089 40158 31444 18662 2050
6603 2050 5228 -1201 5067 21279 18253 11632 23347 8096 -1518 -13450 -5604 -1541 -4573 -37058
6589c7058j9351j7805K2611K2133K1974l084K58J5335J0312J0879P401K4948q423
6576E0130k9270j8270J0240k306j7018l5265j6835K612J2640O781j0970Q47K6362
6563b0322J3852j241n526k9270k7922m60M4100M4402l126r877n830j557k190J2848
6549G881K2580j7339j4932M935J6318k3035K0405J255q047N82l672r461o05K5422
6535B2287R954k7908j2790K032J1426N251j6435J3866p547k8429K1662K1346k6099
6522a1384j4820J3937O447j2860M455J9350K7378k2676j9802m142k688q002j8015
6509d2822p860L6897p367k1410J7534M010j3282j2981O222M004l358J3075K7204
6496a34k5371J0466K7965N660j6391k4720k2921j3771n976K0390L3498K8811m970
$$ plain form
6589 -37058 -56409 -74214 -51603 -29470 -7496 -10580 -10322 5013 15325 26204 33605 58553 50130
6576 50130 20860 2590 12830 10524 -6494 -41759 -58594 -55982 -43342 -36561 -47531 -46684 -20322
6563 -20322 -6470 -7711 -13237 -42507 -70429 -70889 -26789 17613 14487 4610 -1220 -2777 -4967 7881
6549 7881 30461 13122 -1810 3125 19443 -3592 16813 18068 10021 10603 6931 -2530 -3135 22287
6535 22287 32241 4333 -8457 -6425 5001 10252 -6183 7683 136 -28293 -6631 14715 -11384
6522 -11384 -26204 -12267 -5820 -18680 -14225 5125 32503 9827 -9975 -14117 -16805 -24807 -42822
6509 -42822 -50682 -13785 -21152 -42562 -25028 -21018 -34300 -47281 -41059 -37055 -40413 -27338 -134
6496 -134 -25505 -15039 12926 18586 2195 -22525 -45446 -59217 -65193 -44803 -11305 17506 12536
6483A2536R185j461L953q708j3487J34l9355k5543O697J180j7316J0869J1644
6470d9672j4616K2514M7212k1537n826L1525J2030k2086l0916j083J4348N337
6458a2770j0710j2176m070O702L077N708Q140N165j0661m921n418J2229N415L880
6444a0410K0652p227k6583O703l509k627J5250L3013j7398p621O72R014N027k943
6430A2013j4722m883l736j2755k4299J174r8Q978P1n792L7649j2840j5820J0690
6416b4370N313J5309M502J55j9246l1450L318J0665J8609L2877M303k2692p270
6403i977N442j0711Q901J8560k1147q999J3715n26m536J3177J1351M059j5563
6390C746K573Q657N561Q125l3752Q203K9017k4624m752J5640K0117l969m469j0954
$$ plain form
6483 12536 21721 20260 24213 15505 2018 2152 -37203 -62746 -56049 -54869 -72185 -61316 -49672
6470 -49672 -64288 -41774 5438 -16099 -21925 9600 21630 -456 -31372 -32455 -18107 -12770
6458 -12770 -23480 -35656 -39726 -33024 -29947 -24239 -16099 -10934 -21595 -26516 -31934 -19705 -14290 -10410
6444 -10410 10242 3015 -23568 -16865 -20374 -23001 -7751 25262 7864 243 915 9929 14956 12013
6430 12013 -2709 -7592 -11328 -24083 -48382 -47208 -47306 -38328 -38257 -44049 -6400 -19240 -35060 -24370
6416 -24370 -19057 -3748 754 909 -18337 -49787 -46469 -35804 -17195 15682 19985 -2707 -9977
6403 -9977 -4535 -15246 -6345 12215 -8932 -17931 -4216 -4742 -9278 3899 15250 19309 3746
6390 3746 6319 14976 20537 28662 -5090 3113 32130 7506 2754 18394 38511 34542 30073 19119
6376A9119L264m061N319l341J49q317j846N189J312m0335k0689J0959M3347M755
6362A4824p879k675j3335j0884j8309j787J430O482L0323P352k1153m328J5810
6349d129Q323J9913l1399k7969L894K5952K1355m793P504r38j4123J2113M825
6336B0528l2021j2118J0475j4220K155J694k0169J0645K3062n731j4071O43M766
6323b4362R028K0884l3690M668K1131r279j0077N85p846j1030P26k0201L1462
6310b8001J9605J6079K1269j7778l1422J263j4770P90L249J4008K7204L463j8043
6297c084k6386J24L0472p505K8254L2479K568k5033o9k6942j057M170M705j142
6283A1554j9979k0327N195O005J1216J8777p376k4942j0661K0133j0465k6921
$$ plain form
6376 19119 22383 18322 23641 20300 20449 12132 10286 15475 16787 -23548 -44237 -33278 10069 14824
6362 14824 6945 4270 -9065 -19949 -38258 -40045 -38615 -32133 -1810 5542 -15611 -19939 -4129
6349 -4129 4194 24107 -7292 -35261 -31367 -5415 15940 11147 18651 17713 3590 15703 20528
6336 20528 -11493 -23611 -13136 -27356 -25201 -23507 -43676 -33031 -9969 -15700 -29771 -29128 -24362
6323 -24362 -15334 5550 -28140 -23472 -2341 -11620 -21697 -21112 -28958 -39988 -39262 -59463 -28001
6310 -28001 -8396 7683 28952 11174 -20248 -18985 -33755 -32965 -29716 -15708 11496 14959 -3084
6297 -3084 -29470 -29346 1126 -6379 21875 54354 56922 31889 31820 4878 3821 7991 12696 11554
6283 11554 -8425 -28752 -23557 -17552 -6336 12441 5065 -19877 -30538 -10405 -20870 -47791
6271d7791M517L5741J6929O066J405k1830l575J581k7329N07R852J5718P218M50
6257e41R612q816L687J6630n710q051j9776k452K0772q021j5292j6959J1708J4358
6243h851J0028J7751n812l1186k5865M119n055J9576J0733r200N568l504r395
6230c1093J2208o270M025J0000Q504L028m361j188k2978K7961K9792l4734l3519
6217c8625L2223J963j0684N902J6933J5057n150l196k623J147j0015j0579j1389
6204a9036J2533K6709j1750n5484r572M0355L2197j5087R92P316j7341j5255n097
6191b8520P830J1801J5431j2818J9145N684j1703j445p786k1294l213J5528K3347
6178A1987k75j1191J1450m574l1940m715M0745J5913J339J030k030j6035k1576
$$ plain form
6271 -47791 -43274 -7533 9396 15462 16867 -4963 -8538 -6957 -34286 -33779 -23927 -8209 -991 -541
6257 -541 9071 255 3942 20572 14862 6811 -12965 -15417 5355 -2666 -17958 -34917 -23209 -8851
6243 -8851 1177 18928 13116 -18070 -43935 -39816 -44871 -25295 -14562 -23762 -18194 -21698 -31093
6230 -31093 -18885 -25155 -21130 -11130 -2626 402 -3959 -5147 -28125 -164 29628 -5106 -38625
6217 -38625 -6402 -4439 -15123 -9221 7712 22769 17619 14423 11800 12947 2932 -7647 -19036
6204 -19036 -6503 20206 8456 -47028 -56600 -16245 15952 865 1857 9173 -8168 -23423 -28520
6191 -28520 -20690 -8889 6542 -6276 12869 18553 6850 5405 -2381 -23675 -26888 -11360 11987
6178 11987 11712 521 11971 7397 -24543 -29258 11487 27400 28739 29769 27739 11704 -9872
6165i872K8060Q866q334m0522j6010p645R539J964L2884j538j7939P154K4196
6152A0803r092l2646j1605j1747r675J558J2802N157l006O180L305J7108K1962
6139A104K743q923R150n324j0938O336J2825Q330J2291J2131k6492m5138l2062
6126f3967j3347K546L7942L358J5026l0280j2764N977J5762o905J4175k477K174
6113c2780p586m772L6338P583q092m628r20q652j6647P006K5282N107J2515J8771
6099B8525J872Q526J3435J1234n476l5664k8266o405m126L1692J2114j576J9059
6086D4944M979o600n5541l7228L549M9894K5613q708K543p657J764K7688J5496
6073F0736k1397m4870k354J2420J1122J021j5563m0317p987P470J2006j663k0358
$$ plain form
6165 -9872 18188 27054 18720 -21802 -37812 -45457 -35918 -33954 -1070 -2608 -20547 -13393 10803
6152 10803 1711 -30935 -42540 -54287 -63962 -62404 -49602 -44445 -47451 -41271 -37966 -20858 1104
6139 1104 3847 -5076 4074 -1250 -12188 -5852 6973 15303 27594 39725 13233 -31905 -63967
6126 -63967 -77314 -74768 -36826 -33468 -18442 -48722 -61486 -55509 -39747 -46652 -32477 -34954 -32780
6113 -32780 -40366 -45138 -8800 -1217 -9309 -13937 -14857 -23509 -40156 -33150 -7868 -2761 9754 28525
6099 28525 30397 38923 52358 63592 58116 22452 -5814 -12219 -16345 15347 27461 25885 44944
6086 44944 49923 43323 -12218 -49446 -45897 3997 29610 20902 23445 15788 17552 45240 60736
6073 60736 39339 -5531 -7885 4535 15657 16678 1115 -39202 -47189 -39719 -27713 -29376 -49734
6060d9734R089m55m232Q964K2493j1131O268J5314o516p657r355l21J2399Q002
6046f872k0837k1660J4332J4816L370k4566P8J1909J1839M903K641Q74k285m084
6032a5542j2342l766n878J8869J1720l671N856j8898n928J8174k91j4231Q417
6019a7511J6667J0365J0890j2492r41p645Q198j366L989q328k586K0080j6461
6006B859O575J3266j0298P451J1562J3342j2455m1496N762P591n301m3633M317
5993d0458L5148j68j0679l0758n370J1380O313N242k235o373P815K507j2675J9725
5979b0586P849k920k675K128j8804j8710N664K4957K051O432L5114j0819j4025
5966d344j9644o101j1725j5397j5159K6982L1966K7064J1932l4509l016J7847
$$ plain form
6060 -49734 -40645 -41100 -45332 -36368 -13875 -25006 -18738 -3424 -9940 -17597 -26952 -27273 -14874 -6872
6046 -6872 -27709 -49369 -35037 -20221 -16851 -41417 -41339 -29430 -17591 -12688 -10047 -9173 -11458 -15542
6032 -15542 -27884 -31650 -37528 -18659 -6939 -10610 -4754 -23652 -29580 -11406 -11697 -25928 -17511
6019 -17511 -844 9521 20411 7919 6978 -667 7531 6165 10154 1826 -760 19320 2859
6006 2859 9434 22700 12402 19853 31415 44757 32302 -9194 -3432 4159 -1142 -44775 -40458
5993 -40458 -5310 -5478 -16157 -46915 -52285 -40905 -34592 -29350 -31585 -37958 -30143 -27636 -40311 -20586
5979 -20586 -12737 -15657 -18332 -16204 -35008 -53718 -48054 -23097 -21046 -14614 20500 9681 -4344
5966 -4344 -23988 -30089 -41814 -57211 -72370 -45388 -13422 13642 25574 -8935 -11951 5896
5954E896p680p880p348O414q930j707R51j4336K1841L630j6385L597q112N835
5940b4214O477j1536r540k4455j1161J8054K5814K0222K6126r013j663j7958l7540
5927e0387M298K0569J488P55J963O346L8532J4559k4281r636Q537j4579J435R580
5913I179k652l1358r605J5566L2550K9290r697k4765j1123j6122p789J2443n337
5900a9420Q42j8120p023N567N691K608J8374M490j4822j6474L609O787J5994K0605
5886H708k7495p973K525J835K5286j4310m2616M692Q512N021j2305r793j8383
5873g6296K1367L3060k313l798j3799L5378L818j8418M010j3683q822J6303L3486
5860A0293K3712o903k4896j9551J3111J7813J0012j9740k8913J0630J5548J6435
$$ plain form
5954 5896 -1784 -9664 -17012 -10598 -19528 -21235 -20284 -34620 -12779 -9149 -25534 -21937 -30049 -24214
5940 -24214 -17737 -29273 -38813 -63268 -74429 -56375 -30561 -10339 15787 6774 5111 -12847 -50387
5927 -50387 -46089 -25520 -24032 -23277 -21314 -14968 23564 38123 13842 4206 12743 -1836 -401 9179
5913 9179 6527 -24831 -34436 -18870 13680 42970 33273 8508 -2615 -18737 -26526 -14083 -19420
5900 -19420 -18578 -36698 -43721 -38154 -32463 -29855 -11481 -6991 -21813 -38287 -34678 -27891 -11897 8708
5886 8708 -18787 -26760 -24235 -22400 2886 -11424 -54040 -49348 -40836 -35815 -48120 -57913 -76296
5873 -76296 -54929 -21869 -24182 -27980 -41779 -6401 -2583 -21001 -16991 -30674 -39496 -23193 10293
5860 10293 34005 27102 2206 -17345 -4234 13579 23591 3851 -25062 -14432 1116 17551
5848A7551k4168k1264o568j6188j6772j062N827O851J6593K1198J4232R640r819
5835c949K7861K5614J606l0053j0899p003P057o44q45O963N340p29n311O635p975
5820A3668J2277K3238j3184k8896j0869J237k741j2858R714L3903j9459m8848
5808d2818r489N338M273O41J851k047L938L2280K0671m635j4539J7359o333k2376
5794a5886Q491J8566m040k6974J6177J9456m9400l3211J4020K1960J5614J0404
5782d823J5270O3n283K040r601m600Q541j8311q691K831N789K136j075j4153k328
5767c2195K473N215M256J3961r386k557j433Q074j4526k0238o445K5884K6274
5754f43k482q465J7875K1445J4639K0258r325j3066k5382m8535j3862J132R54
$$ plain form
5848 17551 -6617 -27881 -34449 -50637 -67409 -68471 -62644 -55793 -39200 -18002 -3770 5870 -3949
5835 -3949 23912 49526 51132 21079 10180 3177 10234 9590 8745 15708 21048 20319 15008 21643 13668
5820 13668 25945 49183 35999 7103 -3766 -2529 -5270 -18128 -8414 25489 6030 -42818
5808 -42818 -52307 -46969 -42696 -42055 -40204 -42251 -38313 -6033 14638 10003 -4536 12823 6490 -15886
5794 -15886 -7395 11171 7131 -19843 -3666 15790 -33610 -66821 -52801 -30841 -15227 -4823
5782 -4823 10447 10510 5227 7267 -2334 -6934 1607 -16704 -25395 -22564 -16775 -14639 -15714 -29867 -32195
5767 -32195 -29722 -24507 -20251 -6290 -15676 -18233 -19666 -11592 -26118 -46356 -52801 -26917 -643
5754 -643 -3125 -11590 6285 27730 42369 62627 53302 40236 14854 -33681 -47543 -46411 -45457
5741d5457O553K099j1712O938r891j4835J9236K183J1891K0859p807K1174L1539
5728C2770k6495p433O860M243q156N641j97K3128n689l8696L3187q642j8000n811
5714a3290O263o099k6962M574J9206L2051O925l8418k1668p594j5649J6667J9418
5701b4576R45j8507l509L0364k2615j3625P667K6884Q568k0671P257j4985n109
5688d1912M609J8383M3486K935p799o186p005o754J1187O070j9897q028m062l6187
5674e1160K4635L1185m429j3596l508J6873j4046p607j662p981n096j8546J667
5661e3271M3246J9650p038k3108o993K0192K7031M700n0762k6218J7143j337J0477
5648b6288J4698J9252M2305J0036k0641l0003J7864J8680M806l9083J0402K6114
$$ plain form
5741 -45457 -38904 -36805 -48517 -41579 -51470 -66305 -47069 -44886 -32995 -12136 -19943 1231 32770
5728 32770 6275 -1158 5702 9945 1789 7430 7233 30361 24672 -14024 19163 10521 -7479 -13290
5714 -13290 -7027 -13126 -40088 -35514 -16308 15743 22668 -15750 -37418 -45012 -60661 -43994 -24576
5701 -24576 -23631 -42138 -45647 -15283 -37898 -51523 -43856 -16972 -8404 -29075 -21818 -36803 -41912
5688 -41912 -37303 -18920 24566 27501 19702 13516 6511 -243 10944 17014 -2883 -10911 -14973 -51160
5674 -51160 -26525 4660 231 -13365 -16873 0 -14046 -21653 -23315 -31296 -36392 -54938 -53271
5661 -53271 -10025 9625 2587 -20521 -27514 -7322 19709 24409 -26353 -52571 -35428 -36765 -26288
5648 -26288 -11590 7662 49967 60003 39362 9359 27223 45903 50709 11626 22028 48142
5636D8142l724j4136q934j9695j7547r516j9392R346M7292J1402J9877l3285O459
5623A6289Q918j0615j7859K20J1526l130k1939N612J129j3584J1680J1980J2446
5610A2673q576k2070j1834P558j1037K6178j431K4633J8391O706j2529j3661J3827
5597B8828k4418j1274O844J6383L003q223j4696k949j9473k6709K05J3499J0291
5584b8689J6968J3307K1063O038K22J0201k4310j8704k4184J2423K5009%j9106
5571i762j2061M701k580j3788L392J3426N989m89j563n759O39k530N634j4873
5557b9624J2187o929p733J1673J4470j5550l685K014J0177K929q674k4604L939
5544c9410J9385L4699K5863j1826k1323j9051J0783Q221L788m535O727q234p389
$$ plain form
5636 48142 44418 30282 21348 1653 -15894 -25410 -44802 -35456 11836 23238 43115 9830 16289
5623 16289 25207 14592 -3267 -3047 8479 5349 -16590 -10978 -9849 -23433 -11753 227 12673
5610 12673 4097 -17973 -29807 -22249 -33286 -7108 -8539 16094 34485 41191 28662 15001 28828
5597 28828 4410 -6864 -20 16363 19366 11143 -3553 -6502 -25975 -52684 -52479 -38980 -28689
5584 -28689 -11721 1586 22649 28687 28909 39110 14800 -3904 -28088 -15665 9344 9344 -9762
5571 -9762 -21823 -17122 -19702 -33490 -30098 -16672 -10683 -11172 -12735 -18494 -17855 -20385 -14751 -29624
5557 -29624 -17437 -24366 -32099 -20426 -5956 -21506 -25191 -23177 -13000 -10071 -18745 -43349 -39410
5544 -39410 -20025 14674 40537 28711 7388 -11663 -880 7341 11129 6594 13321 5087 -2302
5531b302j1265j9801N883J3302J6k1652J6826M5296j9792M815l393J9048K2083
5518D9064j9782J66r651J1020O699j5368p776k6399l469J5878m841k9462N539
5505b8382M0551J0089k2323L65l81j4705n768K485p376j820J6260P927k0156J505
5491b1729J4136N915M785k6025k0577p45N356p349J194J2174K2553K5089M912
5478A9689N82j0759m73k0079j9374O339J5702K6374P495j6792l0586l1733R882
5465d3733L8013N84k6636k6729k1564K0081K9217J4672j4989L437K3291L0948
5453B6592K4629R71J383k8180j9568k545L991O103J272j4370k0068k0247J1205
5440b8832j6002O254m781O057m735L9897J0950O904j2232K953R408N618j8235
$$ plain form
5531 -2302 -13567 -33368 -27485 -14183 -14167 -35819 -18993 26303 6511 11326 7933 26981 49064
5518 49064 29282 29448 19797 30817 37516 22148 14372 -12027 -15496 382 -4459 -33921 -28382
5505 -28382 12169 22258 -65 300 -81 -14786 -20554 -18069 -25445 -27265 -11005 -3078 -23234 -21729
5491 -21729 -7593 -1678 3107 -22918 -43495 -44240 -38884 -46233 -45039 -32865 -10312 14777 19689
5478 19689 20271 9512 9039 -11040 -30414 -24075 -8373 18001 25496 8704 -21882 -53615 -43733
5465 -43733 -5720 -5136 -31772 -58501 -80065 -59984 -30767 -16095 -31084 -27647 -4356 26592
5453 26592 51221 52192 53575 25395 5827 3282 7273 13376 14648 278 -19790 -40037 -28832
5440 -28832 -44834 -38580 -43361 -37304 -42039 -2142 8808 15712 3480 6433 15841 21459 3224
5427C224l183j6508J374m80j7624M898o391N369M552M1720J0199j2946q32j5695
5413b323k2680P608J2834K0659K682k3537k5327L6045R426J256k0287J7845J0836
5400B5037K854l940k259N062J2992k2079R266j1636l18L715q045j3176p002n550
5386a5079j4730R64K9856J5377k6286l957j3046L3k3179k2080K8327J0729L1349
5373a722q280k6642J8595J0363l5831l000J4481L1088M172K3875n182l0503l239
5360a1825N085k993p412O53j3779J4699k079Q935m003k0040j2902r76L3358j3261
5346b6540j2215R566n326j0572n726k0306J0234J2400J2690K0757r408q684J3683
5333a9447J2296j0914q58J7068r415m261L9099N357n286j9581P177J4638l1797
$$ plain form
5427 3224 41 -16467 -15093 -15573 -33197 -28299 -34690 -29321 -24769 16951 27150 14204 13372 -2323
5413 -2323 -25003 -17395 -4561 16098 18780 -4757 -30084 5961 15387 16643 -3644 14201 25037
5400 25037 27891 23951 21692 26754 39746 17667 26933 15297 14979 18694 10649 -2527 -9529 -15079
5386 -15079 -29809 -28845 1011 16388 -9898 -13855 -26901 -26868 -50047 -72127 -43800 -33071 -1722
5373 -1722 -10002 -36644 -18049 -7686 -43517 -46517 -32036 -948 3224 27099 21917 -8586 -11825
5360 -11825 -6740 -9733 -17145 -16492 -30271 -15572 -17651 -8716 -12719 -32759 -45661 -46637 -13279 -26540
5346 -26540 -38755 -29189 -34515 -45087 -50813 -71119 -60885 -48485 -35795 -15038 -24446 -33130 -19447
5333 -19447 -7151 -18065 -18923 -1855 -11270 -15531 23568 28925 23639 4058 11235 25873 -5924
5320e924k2773K921N271Q2K0578o010M868K662k8717N499K1259K2706K264l7925
5306a3239j0337j0911k0508K943J2995m419p223J6341J4924K1607n587L415J6161
5293A6162m005k1799j6952j3595K499J1108j0709q539r899L980P046q767K713
5280e0757M2976K0315q893m196J2197j5341n536J6946n995L007l4798k8572J2475
5267d6172J2796K1051J6945l407Q450J5773r405J2383K932m8417n2285J3710m284
5254e9930j2708L1206L0996K3322K3912j9959M102K5995L774j5654j3274j00m987
5241A6695j2522j4077J9741J9470j708j5652j1456j9542j4334j16L4019L2877
5229C3395M096k8939l994l736o008k4226R61l6319j7886N5095J9669p613j0716
$$ plain form
5320 -5924 -28697 -25776 -20505 -20423 155 -5855 -987 1675 -27042 -21543 -284 22422 24686 -13239
5306 -13239 -23576 -34487 -54995 -52052 -39057 -43476 -50699 -34358 -19434 2173 -3414 1 16162
5293 16162 12157 -9642 -26594 -40189 -37690 -26582 -37291 -45830 -55729 -51749 -44703 -53470 -50757
5280 -50757 -7781 12534 3641 -555 11642 -3699 -9235 7711 1716 4723 -30075 -58647 -46172
5267 -46172 -33376 -12325 4620 1213 9663 25436 16031 28414 31346 -17071 -69356 -55646 -59930
5254 -59930 -72638 -41432 -10436 12886 36798 16839 20941 46936 50710 35056 21782 21682 16695
5241 16695 4173 -9904 9837 29307 27599 11947 491 -19051 -33385 -33501 518 33395
5229 33395 37491 8552 4558 822 -5186 -29412 -28451 -64770 -82656 -27561 -7892 -15505 -26221
5216b6221j2616k762j612P140J1881j231J1937R046J1728J4571P996p243J0695
5203C3309J0699l0135r882P374p835k5466K4442K1993q713k2047j5290q068J301
5190b8318j1434l474J6927K5927j5031l4714J0929J5038K2114R356J1568L43l0743
5177a1512j9793k8384R593J4520J3501J7034j1530n665K3781K6657k4850k8633
5165b5281J7192K036l8716l4504J7309K3911J0351q503M359Q779L1981o866j8628
5152a6580l298L474L03j3307m159j7046j3795J180L9781J7619r578k5320N390
5139c5336J1654M486K5961N536J93L1821m732k6014n403q158j4166j986k0371
5126c6515j6666q494M6895L0525l0497j3775k852J7333K094P735j3189r622j1706
$$ plain form
5216 -26221 -38837 -41599 -43211 -36071 -24190 -25421 -13484 -4438 7290 21861 29857 22614 33309
5203 33309 44008 13873 3991 11365 3530 -21936 2506 24499 15786 -6261 -21551 -29619 -28318
5190 -28318 -39752 -43226 -26299 -372 -15403 -50117 -39188 -24150 -2036 7320 18888 19231 -11512
5177 -11512 -31305 -59689 -50096 -35576 -22075 -5041 -16571 -22236 1545 28202 3352 -25281
5165 -25281 -8089 -6053 -44769 -79273 -61964 -38053 -27702 -36205 -31846 -23067 8914 2048 -16580
5152 -16580 -19878 -16404 -16101 -29408 -33567 -50613 -64408 -63228 -23447 -5828 -15406 -40726 -35336
5139 -35336 -23682 -19196 6765 12301 12494 44315 39583 13569 8166 8 -14158 -16144 -36515
5126 -36515 -53181 -61675 -14780 15745 -14752 -28527 -31379 -14046 -11952 -4217 -17406 -27028 -38734
5113c8734O694Q051K3863J9658L67j8424j1533l960K5476j4238k4727k5056L7783
5100a4780R100P866O704k6496j4014Q427M063J7494R094o419J958J0096j3777
5087f84K1566J7131J277j8211P31q228q413J4811o920l7682p119K4187K9363j1783
5073A0026m3875Q81J5530N437j9989j3017R383R947o635J076J1037O318J0357
5060c524l622J7917o427P92P534J1855j5029N762J2891n219O072j1309k3734j3935
5046a9976J7672j0363l1191J6382R464k2000R746J2803l021j5440j2548j1147
5034e9619J2429J6209N229J4518m003K6046o985j0732K29l260j0804j0957j1347
5021d3047K4338K8185q337k3778J4889J05N163K2454O442j9529k0009n684L08
$$ plain form
5113 -38734 -32040 -23989 -126 19532 19899 1475 -10058 -14018 11458 -2780 -27507 -52563 -14780
5100 -14780 -5680 2186 8890 -17606 -31620 -23193 -19130 -1636 7458 1039 2997 13093 -684
5087 -684 20882 38013 39290 21079 21810 13582 5169 19980 13060 -24622 -31741 -7554 21809 10026
5073 10026 -33849 -32968 -17438 -12001 -31990 -45007 -35624 -25677 -32312 -31236 -20199 -13881 -3524
5060 -3524 -7146 10771 4344 5136 12670 24525 9496 15258 28149 22930 29002 17693 -6041 -19976
5046 -19976 -2304 -12667 -43858 -27476 -18012 -40012 -30266 -17463 -20484 -35924 -48472 -59619
5034 -59619 -47190 -30981 -25752 -11234 -15237 10809 3824 -6908 -6679 -9939 -20743 -31700 -43047
5021 -43047 -18709 9476 1139 -22639 -7750 -7645 -2482 19972 26414 6885 -13124 -18808 -18500
5008a8500m849j919L2725J0223l257k426o306N176K4790o096j0390j2858j1517
4995e204O183N987l2247m6031J5398N254k6729j5029p22J4890L051Q10J9731J6850
4981c7808k40N521k1810Q142J0644Q997j3176l432N580m243O087O693M21J9426
4967i198J4763N514k2825k2277j8537n488l892k2753N198J1084L1742J3400J1837
4954a1432j1457m334M4519R69j7312Q08l5646j2923j3311M572J4148M502l278
4941d0175J195M54k2172P316L4508N699J6805L0584J1234k2728j3716n323k7862
4928b4181J756j3956j1956M3J2202l027P450P109J9924J6483j3966J1035J8473
4915B7389j7813q552L640r565K460J0221l4303L1468J1655M470Q725j570Q520
$$ plain form
5008 -18500 -23349 -25268 7457 17680 14423 11997 5691 10867 35657 29561 19171 6313 -5204
4995 -5204 979 6966 -25281 -71312 -55914 -50660 -77389 -92418 -93140 -78250 -75199 -74389 -54658 -37808
4981 -37808 -38048 -32527 -54337 -46195 -35551 -26554 -39730 -43162 -37582 -41825 -35738 -29045 -28624 -9198
4967 -9198 5565 11079 -11746 -34023 -52560 -58048 -61940 -84693 -79495 -68411 -36669 -23269 -11432
4954 -11432 -22889 -27223 17296 18265 953 1761 -33885 -46808 -60119 -55547 -41399 -36897 -40175
4941 -40175 -38980 -38526 -60698 -53382 -18874 -13175 3630 34214 45448 22720 9004 3681 -24181
4928 -24181 -22425 -36381 -48337 -48294 -36092 -39119 -31669 -24560 -4636 11847 -2119 8916 27389
4915 27389 9576 1024 4664 -4901 -2441 7780 -26523 4945 16600 21070 29795 28225 36745
4902C6745q10j4772r14k7142q428Q868j4016q091J7204L2771P847k7152k4138
4889b2028J3719J2358J8253j441J147o618p830j6553j9572k915o371J821j1958
4876d7988J7031J6466J7437Q770j1611k8102N484K0670l00L7531P912j5492j7199
4863A0609J2486P965j3959k827J0943k4883j3461J9706K4865l1428K207L52m0409
4850c7834J6126L6582l171j416j4288k8860J6128J6217l542J8706j9380j8181
4838b2913K4839K1411J0285j6504r673r838L1933k976j7257j2751J343N107O6
4825C072k9973N471j3134k6121J3808L2605K0847M669Q010k0884j065J1725j2711
4812c681P514J3786J0680J503l9098m191J5925k8214l7685K7273L0550J3438p546
$$ plain form
4902 36745 35935 21163 20249 -6893 -15321 -6453 -20469 -28560 -11356 21415 29262 2110 -22028
4889 -22028 -8309 4049 22302 20861 22008 15390 7560 -8993 -28565 -31480 -37851 -36030 -47988
4876 -47988 -30957 -14491 2946 11716 105 -27997 -22513 -1843 -2143 35388 43300 27808 10609
4863 10609 23095 31060 17101 14274 25217 334 -13127 6579 31444 16 2223 2575 -37834
4850 -37834 -21708 14874 11703 10287 -4001 -32861 -16733 -516 -4058 14648 -4732 -22913
4838 -22913 1926 23337 33622 17118 7445 -2393 29540 26564 9307 -3444 -2101 3006 3072
4825 3072 -26901 -21430 -34564 -60685 -46877 -14272 6575 11244 19254 -1630 -2695 9030 -3681
4812 -3681 3833 17619 28299 29802 -9296 -13487 2438 -25776 -63461 -36188 -5638 7800 254
4799B54r576K954Q966j4100J5835o243K48n949J8192K732j1787j6677j196L346
4785a3001k7240k0718n027J0407L0984O797j0379Q11j517K115k425L483J7331
4772h379K8118J0448l0614l1944Q947J7242L193k7873J6983j7375J9667J2261
4760F74J2665J3998j0654k1220k2014L902J2195L6984j0819n367J3055j4658k978
4747E763J0880k4602J4723K2427l750k9147M323j8418k7537j0204k428J6355O415
4734c5200P72J0205K0748Q040J009j3548k94q218P204J1180M224j9105j503j5103
4720b9589k1672j4021P44K3755K8473J8484k5786j834K5794J4298o715J8255j234
4707B8952L231r771Q453j2030l1919m307j5486J9803J3295K771k0416J2511Q830
$$ plain form
4799 254 -9322 -6368 2598 -11502 4333 -1910 -1662 -7611 10581 13313 1526 -15151 -16347 -13001
4785 -13001 -40241 -60959 -65986 -55579 -24595 -17798 -28177 -27366 -28883 -26768 -29193 -25710 -8379
4772 -8379 19739 30187 -427 -32371 -23424 -6182 -2989 -30862 -13879 -31254 -11587 674
4760 674 13339 27337 16683 -4537 -26551 -22649 -10454 26530 15711 10344 23399 8741 5763
4747 5763 16643 -7959 6764 29191 25441 -3706 617 -17801 -45338 -55542 -57970 -41615 -35200
4734 -35200 -34428 -24223 -3475 4565 5574 -7974 -8268 -16486 -9282 1898 6122 -12983 -14486 -29589
4720 -29589 -51261 -65282 -64538 -40783 -12310 6174 -19612 -21446 4348 18646 11931 30186 28952
4707 28952 32183 22412 30865 18835 -13084 -17391 -32877 -13074 221 2992 -17424 -4913 3917
4694C917M347o326j3699M8329J5438p144j2793r491k2472K2297J875j5484k1198
4681a2404j103O110J3759O855j4425M043m927r934J0009j1236m477n625j8874
4668d2229J0616J2144J0544q041J1592J4842j4574j1999l836j6102J5484m728
4656b6287J1804J8531k6374j5304J8330j0982P536K2918J1559J3128J9754J4795
4644E9408M625j678m2284M125j1787j2694R812J6123K538o509l0088J7338O896
4631A5825o479o563l168k1502j9013n040J8315O986o790K1800L4721J2476Q148
4618D9716j7657o79j3953r063K7218K1476j3561m336k5074k7759j051j2942J0687
4605a6978J447l642k6904j220q111M252J3630J9807L3515L718n59j1190N37J4535
$$ plain form
4694 3917 8264 1938 -11761 36568 52006 44862 32069 22578 106 22403 24278 8794 -12404
4681 -12404 -13507 -7397 6362 13217 -1208 2835 -2092 -12026 -2017 -13253 -17730 -23355 -42229
4668 -42229 -31613 -19469 -8925 -16966 -5374 9468 -5106 -17105 -20941 -37043 -21559 -26287
4656 -26287 -14483 4048 -22326 -37630 -19300 -30282 -22746 172 11731 24859 44613 59408
4644 59408 64033 62355 20071 24196 12409 -285 9527 25650 28188 21679 -8409 8929 15825
4631 15825 9346 2783 -385 -21887 -40900 -45940 -27625 -20639 -27429 -5629 29092 41568 49716
4618 49716 32059 31380 17427 8364 35582 57058 43497 39161 14087 -13672 -14723 -27665 -16978
4605 -16978 -15531 -19173 -46077 -47297 -55408 -51156 -37526 -17719 15796 19514 18955 7765 8302 22837
4591B2837K0754n0684J997J3967K1541O01l2493k690M425Q087J05l487p164J370
4577h34K8693L254p655k0513r946k6271j203J6006N702o931K940Q865N787M034
4563A928k0226n063P375J3837O709J4335O964k1382j6352j9295N971j05n058j0910
4549d1272J7877L3373J183q966k9473l8423L2791M8033J9445j6291j3045Q610
4537A3842r210k1376l691J1844O751m7458k215K4445J0677r370l0108k3602J6005
4524f3466K6184m282J978j1520M779L528K7577q752j5317M1523J0914j0888O088
4511H346K688K1379l1473j0662J2860K1237J546J032J252j5695j3211K5347L3558
4498E8204j2539l5218j3044l825J2558N525m257l2315J3595J4333j5995J8547
$$ plain form
4591 22837 43591 -7093 -5096 8871 30412 31013 -1480 -4170 255 8342 8447 4960 -2204 -834
4577 -834 27859 31113 23458 2945 -7001 -33272 -34475 -18469 -12767 -19698 -16758 -7893 -2106 1928
4563 1928 -18298 -23361 -15986 -2149 4560 18895 25859 4477 -11875 -31170 -25199 -25304 -30362 -41272
4549 -41272 -23395 9978 11161 2195 -27278 -65701 -32910 15123 34568 18277 5232 13842
4537 13842 4632 -16744 -20435 -8591 -1840 -49298 -51513 -27068 -16391 -25761 -55869 -79471 -63466
4524 -63466 -37282 -41564 -39586 -51106 -46327 -42799 -15222 -23974 -39291 2232 13146 2258 8346
4511 8346 11034 32413 940 -9722 3138 24375 25921 26953 28205 12510 -701 24646 58204
4498 58204 45665 10447 -2597 -6422 6136 11661 7404 -24911 -11316 3017 -12978 5569
4486E569J7558j7995k1036o924Q252L9848J2832L836j3159j9553J9229q755l7630
4473a7928q43K7628K7185N319k525K9437J2924k8982n8796k2636K571K2807K541
4460a298k622j7307J436J521o853K8386L2125o948m0047j5431Q418Q338k939l9159
4446e2380j571J4092p451J6590K185J319n818r983J7193n780n144r555j439P665
4432d0077J9979m05k5429K509O691k9774J2268K9709K4297J5372j8639j9269J0101
4419a2667j0323J5222K6072L225j6827j930j2419j3998o170j4242K3568L8518
4407A8029n207k2039k0104j6126N367Q677J5688L0907j9673k343J1656k850m179
4394b197J0313k7672o584K034R107k7187J2255K7195k2395K0465J7653j4911k324
$$ plain form
4486 5569 23127 5132 -15904 -22828 -14576 25272 38104 41940 28781 9228 28457 19702 -17928
4473 -17928 -18771 8857 36042 41361 38836 68273 81197 52215 -6581 -29217 -26646 -3839 -1298
4460 -1298 -3920 -21227 -19791 -18270 -25123 3263 35388 28440 -11607 -27038 -18620 -10282 -13221 -52380
4446 -52380 -53951 -39859 -47310 -30720 -28535 -27216 -33034 -43017 -25824 -31604 -36748 -46303 -47742 -40077
4432 -40077 -20098 -20503 -45932 -43423 -36732 -66506 -54238 -24529 -232 15140 -3499 -22768 -12667
4419 -12667 -22990 -7768 18304 21529 4702 2772 -9647 -23645 -29815 -44057 -20489 18029
4407 18029 12822 -9217 -29321 -45447 -40080 -31403 -15715 15192 -4481 -6824 4832 1982 -2197
4394 -2197 8116 -19556 -26140 -24106 -14999 -42186 -29931 -2736 -25131 -4666 12987 -1924 -4248
4381d248J4260K4283J1229j3062j048L034p172m0405K017J2363J5053n440J0151
4368B1015L478l2362j1959j3058J0166J6260O776J6822J0171k1096K478J4740
4356B3431j7305k8108p356K7961l74j5962J2088J6699k5862r074J5405J1204k80
4343B467K4624J8556Q833k246n209j5574k0408l3985M180o972P438L6185K5533
4330D3422p156l6231k1812N75n147J321j5326o203m501J3764K3092J2822J1983
4317A0603o309j2636p086j0069j3251k3620l432J8291J5148M878j3376n662J7846
4304b8675N838J3387J7411M257R547R233J9266o875k2396l561Q486l1222k5603
4291c0907M790J9884j5976Q030P974J8205l83K946m718o401j3223q162J147Q987
$$ plain form
4381 -4248 10012 34295 45524 32462 31414 34448 27276 -13129 -11112 1251 16304 10864 21015
4368 21015 24493 -7869 -19828 -32886 -22720 -6460 316 17138 27309 6213 8691 23431
4356 23431 6126 -21982 -29338 -1377 -1751 -17713 -5625 11074 -14788 -23862 -8457 2747 2467
4343 2467 27091 45647 54480 52234 47025 31451 11043 -22942 -18762 -25734 -18296 17889 43422
4330 43422 36266 35 -21777 -21202 -26349 -25028 -40354 -46557 -51058 -37294 -14202 -1380 10603
4317 10603 4294 -8342 -15428 -25497 -38748 -62368 -65800 -47509 -32361 -27483 -40859 -46521 -28675
4304 -28675 -22837 -9450 7961 12218 21765 30998 50264 43389 20993 17432 25918 -5304 -30907
4291 -30907 -26117 -6233 -22209 -14179 -6205 12000 11617 14563 9845 3444 -9779 -17941 -16794 -7807
4277g807J2917J476j627m197J312J089K742l4735j8191N892K9733J4117j4976
4264a2255j7430L4567K3017O71j5797k6009o979J1559K5027K183J0435P328l0695
4251E622J1898J3539l9165j1647l881L0451l893k4867K738Q848j694k7185L9M2340
4237C143M4167j5477j4877k3520Q380K1211j5928J860m127k3333q064k1437p592
4224e5594O053L2809K6707K4265K4087k6618k8006M511J5820J2122j9485k5397
4212h726j0034J5583J392n868j9048k6946J2703K6791L2312p852k2550R895L978
4199A630j3678Q099P412J9573K5270r023K4175O385k9433j2290P704j2099O85
4186B4410j9676j0055J3132J6967J0015j6842k7612N542J5354K0630Q445J571
$$ plain form
4277 -7807 5110 6586 4959 762 2074 3163 5905 -28830 -47021 -41129 -11396 2721 -12255
4264 -12255 -29685 4882 27899 28570 12773 -13236 -20215 -8656 16371 18554 28989 36317 5622
4251 5622 17520 31059 -8106 -19753 -23634 6817 2924 -21943 -19205 -10357 -12051 -39236 -39197 3143
4237 3143 47310 31833 16956 -6564 1816 23027 7099 8959 4832 -18501 -26565 -48002 -55594
4224 -55594 -49541 -16732 9975 34240 58327 31709 3703 8214 24034 36156 16671 -8726
4212 -8726 -18760 -3177 -1785 -7653 -26701 -53647 -40944 -14153 18159 10307 -12243 -2348 1630
4199 1630 -12048 -3949 3463 23036 48306 39283 63458 69843 40410 28120 35824 23725 24410
4186 24410 4734 -5321 7811 24778 34793 17951 -9661 -4119 11235 31865 40310 41881
4174D1881m614k1532j2267R227J6390k1181r729Q224j4940q800K2996r034J5723
4161A2344L386l540J1053k2579l6276r36J1838K8442j0596K30j7350O045K3751
$$ plain form
4174 41881 37267 15735 3468 12695 29085 7904 -1825 6399 -8541 -17341 5655 -3379 12344
4161 12344 15730 12190 23243 664 -35612 -36548 -24710 3732 -6864 -6634 -23984 -17939 5812
$$ [...]
##END NTUPLES=NMR SPECTRUM
##END=
