##TITLE=Analysis number 328925
Compound Code cc 62709
Book Reference 521/93
Project Code adrs
Chemist Name evam
##JCAMPDX= 6.0         $$ Bruker NMR JCAMP-DX V2.0
##DATA TYPE= NMR SPECTRUM
##DATA CLASS= NTUPLES
##ORIGIN= Bruker BioSpin GmbH
##OWNER= nmr
$$ XWIN-NMR		Version 3.5
$$ Tue Jul 17 09:30:08 2007 GMT Daylight Time (UT+1h)  MAYBRIDGE\nmr@NMR_250MHZ
##.OBSERVE FREQUENCY= 250.131544655141
##.OBSERVE NUCLEUS= ^1H
##.ACQUISITION MODE= SIMULTANEOUS (DQD)
##.ACQUISITION SCHEME= undefined
##.AVERAGES= 16
##.DIGITISER RES= 18
##SPECTROMETER/DATA SYSTEM= dpx250
##.PULSE SEQUENCE= zg30
##.SOLVENT NAME= CDCl3
##.SHIFT REFERENCE= (INTERNAL, CDCl3, 0, 16.4519)
##AUDIT TRAIL= $$ (NUMBER, WHEN, WHO, WHERE, WHAT)
$$ ##TITLE= Audit trail, XWIN-NMR		Version 3.5
$$ ##JCAMPDX= 5.01
$$ ##ORIGIN= Bruker BioSpin GmbH
$$ ##OWNER= nmr
$$ C:\u/data/dgb/nmr/ADRS/1080/pdata/1/auditp.txt
$$ ##AUDIT TRAIL=  $$ (NUMBER, WHEN, WHO, WHERE, WHAT)
(   1,<2007-07-17 09:29:41.64 +100>,<MAYBRIDGE\nmr>,<NMR_250MHZ>,
      <created by zg, POWCHK disabled, PULCHK disabled
       configuration hash MD5:
       76 6E 9A 78 1E 09 19 81 EC 84 63 8F B0 6A 59 2D
       data hash MD5: 64K
       CA 2F 30 44 83 49 41 5F FB 49 24 81 AB 1F 1B 15>)
(   2,<2007-07-17 09:29:57.67 +100>,<MAYBRIDGE\nmr>,<NMR_250MHZ>,
      <Start of raw data processing
       ef LB = 0.3 FT_mod = 6 PKNL = 1 SI = 32K 
       data hash MD5: 32K
       C9 78 6F C6 B4 73 EC 3C 2F 1D DF AF 85 96 77 59>)
(   3,<2007-07-17 09:30:01.45 +100>,<MAYBRIDGE\nmr>,<NMR_250MHZ>,
      <apk 
       data hash MD5: 32K
       9A 2E 2D 95 79 94 05 09 0C C6 A1 28 18 79 C2 38>)
(   4,<2007-07-17 09:30:02.14 +100>,<MAYBRIDGE\nmr>,<NMR_250MHZ>,
      <abs ABSG = 5 
       data hash MD5: 32K
       24 54 88 49 43 5E BA 13 AD 5B 6A 10 EE CE FC D2>)
$$ ##END=
$$ 
$$ hash MD5
$$ 7A 8C C0 97 99 48 BC 2B DD A2 E6 28 BE E4 5F A5
##$RELAX= 
##$RELAX= 
##$RELAX= 
##$RELAX= 
##$RELAX= 
##$RELAX= 
##$RELAX= 
$$ Bruker specific parameters
$$ --------------------------
##$DU= <C:\u>
##$EXPNO= 1080
##$NAME= <ADRS>
##$PROCNO= 1
##$TYPE= <nmr>
##$USER= <dgb>
##$AMP= (0..31)
100 100 100 100 100 100 100 100 100 100 100 100 100 100 100 100 100 100 
100 100 100 100 100 100 100 100 100 100 100 100 100 100 
##$AQSEQ= 0
##$AQ_mod= 3
##$AUNM= <au_zg>
##$AUTOPOS= <6 >
##$BF1= 250.13
##$BF2= 250.13
##$BF3= 250.13
##$BF4= 250.13
##$BF5= 500.13
##$BF6= 500.13
##$BF7= 500.13
##$BF8= 500.13
##$BYTORDA= 1
##$CFDGTYP= 0
##$CFRGTYP= 5
##$CHEMSTR= <none>
##$CNST= (0..31)
1 1 145 1 1 1 1 1 1 1 1 1 1 1 1 1 1 1 1 1 1 1 1 1 1 1 1 1 1 1 1 1 
##$CPDPRG= <>
##$CPDPRG1= <>
##$CPDPRG2= <>
##$CPDPRG3= <>
##$CPDPRG4= <mlev>
##$CPDPRG5= <mlev>
##$CPDPRG6= <mlev>
##$CPDPRG7= <mlev>
##$CPDPRG8= <mlev>
##$CPDPRGB= <>
##$CPDPRGT= <>
##$D= (0..31)
0 1 0 0 0 0 0 0 0 0.06 0 0 0 0 0 0 0.0002 0 0 0 0 0 0 0 0 0 0 0 0 0 0 
0 
##$DATE= 1184660980
##$DBL= (0..7)
120 120 120 120 120 120 120 120 
##$DBP= (0..7)
150 150 150 150 150 150 150 150 
##$DBP07= 0
##$DBPNAM0= <>
##$DBPNAM1= <>
$$ [...]
##$SUBNAM7= <"">
##$SUBNAM8= <"">
##$SUBNAM9= <"">
##$SW= 20.6930455092707
##$SWIBOX= (0..15)
0 0 3 0 0 0 0 0 0 0 0 0 0 0 0 0 
##$SW_h= 5175.983436853
##$TD= 65536
##$TD0= 1
##$TE= 296.16
##$TE2= 300
##$TE3= 300
##$TEG= 300
##$TL= (0..7)
0 120 120 120 120 120 120 120 
##$TP= (0..7)
150 150 150 150 150 150 150 150 
##$TP07= 0
##$TPNAME0= <>
##$TPNAME1= <>
##$TPNAME2= <>
##$TPNAME3= <>
##$TPNAME4= <>
##$TPNAME5= <>
##$TPNAME6= <>
##$TPNAME7= <>
##$TPOAL= (0..7)
0.5 0.5 0.5 0.5 0.5 0.5 0.5 0.5 
##$TPOFFS= (0..7)
0 0 0 0 0 0 0 0 
##$TUNHIN= 0
##$TUNHOUT= 0
##$TUNXOUT= 0
##$USERA1= <user>
##$USERA2= <user>
##$USERA3= <user>
##$USERA4= <user>
##$USERA5= <user>
##$V9= 5
##$VALIST= <valist>
##$VCLIST= <CCCCCCCCCCCCCCC>
##$VD= 0
##$VDLIST= <DDDDDDDDDDDDDDD>
##$VPLIST= <PPPPPPPPPPPPPPP>
##$VTLIST= <TTTTTTTTTTTTTTT>
##$WBST= 1024
##$WBSW= 4
##$XGAIN= (0..3)
0 0 0 0 
##$XL= 0
##$YL= 0
##$YMAX_a= 416343
##$YMIN_a= -363255
##$ZGOPTNS= <>
##$ZL1= 120
##$ZL2= 120
##$ZL3= 120
##$ZL4= 120
##$ABSF1= 16.45187
##$ABSF2= -4.241302
##$ABSG= 5
##$ABSL= 3
##$ALPHA= 0
##$AQORDER= 0
##$ASSFAC= 0
##$ASSFACI= 0
##$ASSFACX= 0
##$ASSWID= 0
##$AUNMP= <proc_1d>
##$AZFE= 0.1
##$AZFW= 0.1
##$BCFW= 0
##$BC_mod= 0
##$BYTORDP= 0
##$COROFFS= 0
##$CY= 12.5
##$DATMOD= 1
##$DC= 0
##$DFILT= <>
##$DTYPP= 0
##$F1P= 14.0000005364418
##$F2P= -0.99999901652339
##$FCOR= 0.5
##$FTSIZE= 32768
##$FT_mod= 6
##$GAMMA= 0
##$GB= 0
##$INTBC= 1
##$INTSCL= 1
##$ISEN= 128
##$LB= 0.3
##$LEV0= 0
##$LPBIN= 0
##$MAXI= 10000
##$MC2= 0
##$MEAN= 0
##$ME_mod= 0
##$MI= 0
##$NCOEF= 0
##$NC_proc= -4
##$NLEV= 6
##$NOISF1= 0
##$NOISF2= 0
##$NSP= 0
##$NTH_PI= 0
##$NZP= 0
##$OFFSET= 16.45187
##$PC= 1
##$PHC0= -50.49743
##$PHC1= 6.838956
##$PH_mod= 1
##$PKNL= yes
##$PPARMOD= 0
##$PSCAL= 4
##$PSIGN= 0
##$REVERSE= no
##$SF= 250.130017540836
##$SI= 32768
##$SIGF1= 0
##$SIGF2= 0
##$SINO= 400
##$SIOLD= 32768
##$SREGLST= <1H.CDCl3>
##$SSB= 0
##$STSI= 32768
##$STSR= 0
##$SW_p= 5175.98343685301
##$SYMM= 0
##$S_DEV= 0
##$TDeff= 65536
##$TDoff= 0
##$TI= <Analysis number 999999
Compound Code 99
Book Reference 9
Project Code 9>
##$TILT= no
##$TM1= 0
##$TM2= 0
##$TOPLEV= 0
##$USERP1= <user>
##$USERP2= <user>
##$USERP3= <user>
##$USERP4= <user>
##$USERP5= <user>
##$WDW= 1
##$XDIM= 32768
##$YMAX_p= 614563977
##$YMIN_p= -151296
$$ End of Bruker specific parameters
$$ ---------------------------------
##NTUPLES= NMR SPECTRUM
##VAR_NAME=  FREQUENCY,     SPECTRUM/REAL,   SPECTRUM/IMAG
##SYMBOL=    X,             R,               I
##VAR_TYPE=  INDEPENDENT,   DEPENDENT,       DEPENDENT
##VAR_FORM=  AFFN,          ASDF,            ASDF
##VAR_DIM=   32768,         32768,           32768
##UNITS=     HZ,            ARBITRARY UNITS, ARBITRARY UNITS
##FACTOR=    0.157963299565203, 1,           1
##FIRST=     4115.10652282485, 0,            0
##LAST=      -1060.87691402816, 0,           0
##MIN=       -1060.87691402816, -151296,     0
##MAX=       4115.10652282485, 614563977,    0
$$ Real data points
##PAGE= N=1
##DATA TABLE= (X++(R..R)), XYDATA
$$ [...]
$$ plain form
16205 -14199 -1554 -39026 -57780 -63353 -74308 -25748 26564 36915 -15504 -56463 -75043 -91576
16193 -91576 -97245 -78700 -111815 -89967 -93200 -64651 -40148 -40899 -9945 -1024 35253 16198 -8601
16180 -8601 -7721 -5649 -24084 -8615 15192 -7282 -17330 -31787 -44724 -44011 -68436 -67841 -61914
16167 -61914 -23504 -22402 -36241 -38867 -52693 -74216 -83612 -59547 -20199 -44665 -58353 -56656
16155 -56656 -25102 -12044 15441 24195 16630 -9901 -29483 -23496 29318 26062 19553 4745 -31141
16142 -31141 -13229 -17421 -8740 -28874 -7343 1349 -23439 -31033 -85438 -94955 -70323 -23278 12844
16129 12844 8625 48923 71321 48835 23408 14226 -3300 -32338 -37617 -5155 41745 23479
16117 23479 12654 -32980 -82663 -55139 -23644 -14793 18805 62816 55236 37958 19234 40201
$$ packed form
16205a4199J2645l7472j8754n573j0955M8560N2312J0351n2419m0959j8580j6533
16193i1576n669J8545l3115K1848l233K8549K4503p51L0954Q921L6277j9055k4799
16180h601Q80K072j8435J5469K3807k2474j0048j4457j2937P13k4425N95N927
16167f1914L8410J102j3839k626j3826k1523r396K4065L9348k4466j3688J697
16155e6656L1554J3058K7485Q754p565k6531j9582N987N2814l256o509j4808l5886
16142c1141J7912m192Q681k0134K1531Q692k4788p594n4405r517K4632M7045L6122
16129A2844m219M0298K2398k2486k5427r182j7526k9038n279L2462M6900j8266
16117B3479j0825m5634m9683K7524L1495Q851L3598M4011p580j7278j8724K0967
$$ plain form
16105 40201 69450 49527 -6753 -40272 -52649 -64845 -30053 -49816 -80645 -76170 -38970 13223
16093 13223 2773 -49653 -31333 4143 -3094 -28714 -52310 -77662 -114176 -116740 -67570 -20067
16081 -20067 -22060 -33799 -45851 -108906 -128494 -114640 -106327 -79974 -68150 -35895 -29630 -41634
16069 -41634 -497 11864 -15863 -29410 -25114 -37333 -29030 -24599 -8 -16076 -36113 -4297
16057 -4297 -41227 -55323 -76506 -86548 -86433 -47172 -72319 -70497 -62799 -100561 -103734 -100499 -99686
16044 -99686 -82381 -50177 -56703 -73997 -74036 -73600 -105927 -108405 -76729 -41407 -30379 -39984 -48699
16031 -48699 -42595 -19251 -6152 12825 24384 16979 -28751 -65573 -27663 -25092 -27194 -3240
16019 -3240 -18008 -26755 1267 11917 -37441 -36857 -9638 -4936 47 23835 51804 57557 25815
$$ packed form
16105D0201K9249j9923n6280l3519j2377j2196L4792j9763l0829M475L7200N2193
16093A3223j0450n2426J8320L5476p237k5620k3596k5352l6514k564M9170M7503
16081b0067j993j1739j2052o3055j9588J3854Q313K6353J1824L2255O265j2004
16069d1634M1137J2361k7727j3547M296j2219Q303M431K4591j6068k0037L1816
16057d297l6930j4096k1183j0042J15L9261k5147J822P698l7762l173L235Q13
16044i9686J7305L2204o526j7294l9M36l2327k478L1676L5322J1028r605q715
16031d8699O104K3344J3099J8977J1559p405m5730l6822L7910K571k102K3954
16019c240j4768q747K8022J0650m9358N84K7219M702M983K3788K7969N753l1742
$$ plain form
16006 25815 -36268 -86842 -79405 -37291 -37477 -40051 -25696 -19895 -15202 -3669 -8851 -37468 -44390
15993 -44390 -32671 -57985 -63731 -58034 -38860 -39487 -13288 -34768 -22160 -6367 -15301 -4497 221
15980 221 -46032 -60198 -57352 -43968 -38297 -61792 -54302 -8665 -13806 -40281 -65975 -82209 -79795
15967 -79795 -42401 -769 -36776 -81843 -79166 -48468 5369 34888 33167 48728 28211 -22517
15955 -22517 -73395 -72587 -48154 -49056 -34482 -35483 -41327 -21126 26075 22089 7149 -27781 -55828
15942 -55828 -46300 -15561 -43123 -47870 -10983 -11295 -3302 -12739 -43954 -29860 -22365 -22953 -14543 -44936
15928 -44936 -57476 -26719 -6302 15238 10533 28581 40745 4731 -38878 -64762 -805 39127
15916 39127 24541 7579 -17942 -41075 -86121 -71398 -56643 -43940 -7000 34187 25220 -14436
$$ packed form
16006B5815o2083n0574P437M2114j86k574J4355N801M693J1533n182k8617o922
15993d4390J1719k5314n746N697J9174o27K6199k1480J2608J5793q934J0804M718
15980B21m6253j4166K846J3384N671k3495P490M5637n141k6475k5694j6234K414
15967g9795L7394M1632l6007m5067K677L0698N3837K9519j721J5561k0517n0728
15955b2517n0878Q08K4433r02J4574j001n844K0201M7201l986j4940l4930k8047
15942e5828R528L0739k7562m747L6887l12P993r437l1215J4094P495n88Q410l0393
15928d4936j2540L0757K0417K1540m705J8048J2164l6014m3609k5884O3957L9932
15916C9127j4586j6962k5521k3133m5046J4723J4755J2703L6940M1187q967l9656
$$ plain form
15904 -14436 -10366 -3665 -21079 3327 2448 3063 12510 -37542 -48643 -2086 27051 -31544 -54704
15891 -54704 -32167 -2827 12992 -34970 -58727 -18752 -23072 -36802 -22666 -17891 -3711 19878
15879 19878 22855 9309 6014 -17581 206 21543 26840 24511 -18892 -54891 -58780 -29877 -26595
15866 -26595 -39920 -27562 2891 44586 40629 5166 -9120 -20478 -11061 -1624 -19280 7121
15854 7121 24816 -7030 5421 -4731 -33117 -86215 -90714 -50625 -22534 -28866 -7034 -6275 -14075
15841 -14075 -14587 10338 37722 61256 61204 35563 26493 28078 -35797 -39948 -11222 -34319 -26900
15828 -26900 -7860 14376 -3714 -46452 -30325 -6213 -13091 -23913 -16326 -15718 -26199 -36726
15816 -36726 -38424 -25308 -31375 -42889 -30628 -51906 -71011 -55997 -26299 7399 8023 -22791
$$ packed form
15904a4436M070O701j7414K4406q79O15R447n0052j1101M6557K9137n8595k3160
15891e4704K2537K9340J5819m7962k3757L9975m320j3730J4136M775J4180K3589
15879A9878K977j3546l295k3595J7787K1337N297k329m3403l5999l889K8903L282
15866b6595j3325J2358L0453M1695l957l5463j4286j1358R417R437j7656K6401
15854G121J7695l1846J2451j0152k8386n3098m499M0089K8091o332K1832P59p800
15841a4075n12K4925K7384K3534n2k5641r070J585o3875m151K8726k3097P419
15828b6900J9040K2236j8090m2738J6127K4112o878j0822P587O08j0481j0527
15816c6726j698J3116o067j1514J2261k1278j9105J5014K9698L3698O24l0814
$$ plain form
15804 -22791 -9990 -36658 -72999 -32926 -21995 -14536 -219 -18852 -34698 -30933 -23516 -60074
15792 -60074 -52383 -27758 -13699 17113 46195 29209 12883 -34708 -82004 -76070 -56536 -47663
15780 -47663 -28108 -23927 -35754 -83182 -56822 -18839 -29441 -42826 -46602 -44012 -47526 -35068
15768 -35068 -40652 -58251 -38841 -1642 -2662 -11134 -26980 -31428 -14054 -2435 -9183 -12421 -21275
15755 -21275 11344 54925 91526 79205 -20573 -36712 -14386 -691 15880 56128 21871 35432
15743 35432 33037 10626 -7085 -30366 -12509 -16785 -42065 -25282 -50 -729 923 9528 -17526
15730 -17526 -25661 -17609 -34595 -48325 -60127 -31027 10978 16117 -24813 -52303 -64191 -29111
15718 -29111 -18626 -12249 1507 26347 19855 -8926 -20568 -35924 14324 37919 24731 -5346
$$ packed form
15804b2791J2801k6668l6341M0073J0931P459J4317j8633j5846L765P417l6558
15792f0074P691K4625J4059L0812K9082j6986j6326m7591m7296N934J9534Q873
15780d7663J9555M181j1827m7428K6360L7983j0602j3385l776K590l514J2458
15768c5068n584j7599J9410L7199j020q472j5846m448J7374J1619o748l238q854
15755b1275L2619M3581L6601j2321r9778j6139K2326J3695J6571M0248l4257J3561
15743C5432k395k2411j7711k3281J7857m276k5280J6783K5232o79J652Q605k7054
15730a7526q135Q052j6986j3730j1802K9100M2005N139m0930k7490j1888L5080
15718b9111J0485O377J3756K4840o492k8781j1642j5356N0248K3595j3188l0077
$$ plain form
15706 -5346 -34032 -50810 -29989 27736 61626 56211 60665 58871 7718 -535 23670 37642 17464
15693 17464 -2918 -59416 -74778 -11013 -12264 -34219 -44982 -58507 -32370 -20958 4445 31552
15681 31552 65223 63207 22298 -11504 8264 42759 21040 13938 -17465 -10337 -2366 -7007 -1462
15668 -1462 4985 -17333 -12299 -1266 -14028 -14019 -28923 -40229 -41548 -3890 33910 66886 54479
15655 54479 53836 58907 49669 66995 50233 21695 -4699 -13572 4619 45190 50374 53927 73338
15642 73338 57735 9212 -3225 9196 -7417 7736 48235 80021 68995 22199 -37131 -60799
15630 -60799 -41023 -18650 -9980 5010 9459 18972 48838 51736 8450 17940 62484 79643 38077
15617 38077 47345 46836 40923 20303 566 -7376 -26507 11257 11614 -3367 -23067 -31268 -76325
$$ packed form
15706e346k8686j6778K0821N7725L3890n415M454j794n1153q253K4205J3972k0178
15693A7464k0382n6498j5362O3765j251k1955j0763j3525K6137J1412K5403K7107
15681C1552L3671k016m0909l3802J9768L4495k1719p102l1403P128P971m641N545
15668a462O447k2318N034J1033j2762Rj4904j1306j319L7658L7800L2976j2407
15655E4479o43N071r238J7326j6762k8538k6394q873J8191M0571N184L553J9411
15642G3338j5603m8523j2437J2421j6613J5153M0499L1786j1026m6796n9330k3668
15630f0799J9776K2373Q670J4990M449R513K9866K898m3286R490M4544J7159m1566
15617C8077R268n09n913k0620j9737p942j9131L7764L57j4981j9700q201m5057
$$ plain form
15604 -76325 -83382 -63433 -60069 -33690 1883 -1758 -20520 15525 10462 -22517 -32350 -41771 -13183
15591 -13183 -25533 -25726 -42873 -44072 -33835 707 47649 43487 20093 48765 50741 -1666 7543
15578 7543 14614 14288 24052 29925 36038 30432 -16296 -54316 -47856 -29018 -32352 -16494 -31258 -64488
15564 -64488 -54502 -59472 -61996 -44938 -63955 -38753 -38636 -22334 6144 -13304 -25362 -49897 -66411
15551 -66411 -2939 -29319 -43831 -12237 -12900 -2902 -25720 -24048 -2519 -19492 -21995 -18123 7631
15538 7631 34846 33033 -24687 -10203 -20222 -48921 -63133 -67150 -55319 -40894 -31616 -27491 -26978
15525 -26978 -31097 -22436 -7418 -4126 -4480 -32012 -24111 -54248 -92177 -60470 -55163 -34017 -7322
15512 -7322 24975 13235 -5488 -178 2212 9654 -7151 -32143 -37739 4831 -5392 -30836 -45537
$$ packed form
15604g6325p057J9949L364K6379L5573l641j8762L6045n063l2979r833r421K8588
15591a3183j2350j93j7147j199J0237L4542M6942m162k3394K8672J976n2407R209
15578G543P071l26R764N873O113n606m6728l8020O460J8838l334J5858j4764l3230
15564f4488R986m970k524J7058j9017K5202J17J6302K8478j9448j2058k4535j6514
15551f6411O3472k6380j4512L1594o63R998k2818J672K1529j6973k503L872K5754
15538G631K7215j813n7720J4484j0019k8699j4212m017J1831J4425R278M125N13
15525b6978m119Q661J5018L292l54k7532P901l0137l7929L1707N307K1146K6695
15512g322L2297j1740j8723N310K390P442j6805k4992n596M2570j0223k5444j4701
$$ plain form
15499 -45537 -46686 -27646 -27545 -3274 13931 1122 -3638 -15175 -11477 -35500 -51823 -74041 -34725
15486 -34725 9571 26812 -5562 -14979 -11613 -32113 -36132 -24223 -37524 -28286 -29085 -9651 586
15473 586 -2603 -13839 -52591 -49127 -13510 11770 -14306 -28722 -6578 -22122 -44903 -39579 -42175
15460 -42175 -25187 -49774 -12302 3209 -17649 -5829 7337 28484 19021 24570 54090 50695
15448 50695 27090 -37859 -54299 -59636 -65103 -68002 -71575 -77686 -39632 4269 -18342 -35586 145
15435 145 11843 29621 14082 -40379 -64599 -66986 -34884 5450 22452 -10359 -39501 -49176
15423 -49176 -40198 -29634 -57779 -21817 -16749 -14294 10399 10138 23938 13347 -37513 -51806 -63582
15410 -63582 -34328 -16795 -6705 -48783 -47153 -27069 -13717 -67865 -72762 -63111 -90872 -71552
$$ packed form
15499d5537j149J9040J01K4271J7205j2809m760j1537L698k4023j6323k2218L9316
15486c4725M4296J7241l2374r417L366k0500m019J1909j3301R238p99J9434J0237
15473E86l189j1236l8752L464L5617K5280k6076j4416K2144j5544k2781N324k596
15460d2175J6988k4587L7472J5511k0858J1820J3166K1147r463N549K9520l395
15448E0695k3605o4949j6440n337n467k899l573o111L8054M3901k2611j7244L5731
15435A45J1698J7778j5539n4461k4220k387L2102M0334J7002l2811k9142r675
15423d9176Q978J0564k8145L5962N068K455K4693k61J3800j0591n0860j4293j1776
15410f3582K9254J7533J0090m2078J630K0084J3352n4148m897R651k7761J9320
$$ plain form
15398 -71552 -73477 -43722 -27433 -37448 -25795 -31316 -44742 -57176 -52377 -43904 -62913 -38668
15386 -38668 -43857 -32003 -25015 -64024 -34172 -28633 -40867 -38610 -63272 -51120 -3991 4212 -31263
15373 -31263 -49526 -63170 -46630 -21327 -18624 -48191 -74459 -115793 -119276 -140112 -108594 -79996
15361 -79996 -39982 -43779 -48829 -30578 -10705 -15645 -64313 -58766 -41973 -73264 -75518 -85926 -100206
15348 -100206 -83947 -56082 -51465 -74729 -48164 -65461 -68956 -93863 -59623 -64794 -20320 -805
15336 -805 109 39052 66512 91426 87464 56439 71351 45982 26811 36595 36510 40594 33513 8858
15322 8858 -4108 17832 4271 29028 -7292 2353 6236 -21822 -8977 6974 20283 -10810
15310 -10810 4522 -7381 -41444 -47091 -48979 -42668 -51707 -47316 -75965 -74879 -61317 -67210 -46005
$$ packed form
15398g1552j925K9755J6289j0015J1653n521j3426j2434M799Q473j9009K4245
15386c8668n189J1854O988l9009K9852N539j2234K257k4662J2152M7129Q203l5475
15373c1263j8263j3644J6540K5303K703k9567k6268m1334l483k0836L1518K8598
15361g9996M0014l797n050J8251J9873m940m8668N547J6793l1291k254j0408j4280
15348a00206J6259K7865M617k3264K6565j7297l495k4907L4240n171M4474J9515
15336h05R14L8943K7460K4914l962l1025J4912k5369j9171R784q5M084p081k4655
15322H858j2966K1940j3561K4757l6320R645L883k8058J2845J5951J3309l1093
15310a0810J5332j1903l4063n647j888O311r039M391k8649J086J3562n893K1205
$$ plain form
15297 -46005 -20176 6174 8250 -8261 -16897 -3815 -20792 -25535 -32255 -50402 -54081 -22547 -3073
15284 -3073 -12157 -2878 -6290 20229 11715 30013 54749 54089 47673 50290 39232 -18033 -64760
15271 -64760 -86936 -90924 -38156 8500 34226 4848 -10494 -41488 -35902 -20243 -18115 -10584
15259 -10584 13819 23546 22865 -45006 -79009 -87746 -34935 -14686 -52386 -66574 -30536 -18975
15247 -18975 -51695 -48005 -14844 -33182 -33877 -7615 -26735 -21792 13555 35491 31977 26076 24102
15234 24102 32146 42859 34090 20510 1013 11413 31582 93919 132584 154448 168176 178283
15222 178283 128969 63127 74141 42748 32801 61093 83121 25408 31131 19857 -692 4569
15210 4569 2872 31768 66529 46078 40277 -17216 -41490 -44373 -51394 -33885 3613 21945 51390
$$ packed form
15297d6005K5829K6350K076j6511q636J3082j6977m743o720j8147l679L1534J9474
15284c073r084R279l412K6519q514J8298K4736o60o416K617j1058n7265m6727
15271f4760k2176l988N2768M6656K5726k9378j5342l0994N586J5659K128P531
15259a0584K4403R727o81o7871l4003q737N2811K0249l7700j4188L6038J1561
15247a8975l2720L690L3161j8338o95K6262j9120M943L5347K1936l514n901j974
15234B4102Q044J0713q769j3580j9497J0400K0169O2337L8665K1864J3728J0107
15222A78283m9314o5842J1014l1393r947K8292K2028n7713N723j1274k0549N261
15210D569j697K8896L4761k0451n801n7493k4274k883p021J7509L7498J8332K9445
$$ plain form
15197 51390 22259 -22606 -32400 -15418 32324 24345 2424 -11955 47782 65287 60029 85134
15185 85134 84868 110361 90481 90056 73218 32145 13947 6371 -5628 -13170 11834 34088 62339
15172 62339 28515 11029 5430 -18052 -18442 -18562 -41587 -47396 -13074 -11103 -18144 -20865 -14086 -17543
15158 -17543 -15207 -7815 -5057 11768 34213 -33600 -59270 -37398 -1411 19213 16480 4474
15146 4474 17337 15982 39340 35235 6662 5545 35267 21021 44389 61790 34334 36723 36373
15133 36373 21985 -1947 -22586 -40705 -7977 -27099 -44953 -13558 -1411 -6354 -52923 -110594
15121 -110594 -87367 -51242 -51569 -30145 11105 13765 24006 16898 20766 10268 13855 35770 42384
15108 42384 42379 1877 -36094 -39284 -51682 -49492 -204 25916 40588 49811 45356 18821 -21970
$$ packed form
15197E1390k9131m4865r794J6982M7742p979k1921j4379N9737J7505n258K5105
15185H5134k66K5493j9880m25j6838m1073j8198p576j1999p542K5004K2254K8251
15172F2339l3824j7486n599k3482l90j20k3025n809L4322J971p041k721O779l457
15158a7543K336P392K758J6825K2445o7813k5670K1872L5987K0624k733j2006
15146D474J2863j355K3358m105k8573j117K9722j4246K3368J7401k7456K389l50
15133C6373j4388k3932k0639j8119L2728j9122j7854L1395J2147m943m6569n7671
15121a10594K3227L6125l27K1424M1250K660J0241p108L868j0498L587K1915O614
15108D2384nm0502l7971l190j2398K190M9288K6120J4672R223m455k6535m0791
$$ plain form
15095 -21970 -40291 -23644 2309 14018 20599 24128 9164 -8776 961 4629 33196 18653
15083 18653 5064 6522 3518 -6650 515 7536 -38592 -47835 -53064 -43531 -21140 -21267 -29064 -37572
15069 -37572 -20812 -13236 -26022 -22114 -16148 -25561 -30915 -24263 -10984 20474 17643 -6731 -29323
15056 -29323 -36686 -58678 -39684 19553 12154 21823 24260 20941 -11445 -46948 -70732 -76722 -110225
15043 -110225 -116142 -72286 -55650 -47194 -61493 -31006 -3423 -11411 -39554 -39304 -976 14688
15031 14688 25257 38472 -15407 -61567 -61971 -6962 6038 -24526 -34283 -30181 -36608 -37922 -24361
15018 -24361 -30610 15547 34280 -2320 -21557 -26372 -17775 -26046 -62917 -76242 -47498 -6120
15006 -6120 -8578 -36412 -46921 -41555 -37786 -23377 -29431 -43699 -44674 -41656 -72706 -61150 -55554
$$ packed form
15095b1970j8321J6647K5953J1709O581L529j4964j7940R737L668K8567j4543
15083A8653j3589J458l004j0168P165P021m6128r243n229R533K2391j27p797q508
15069c7572J6760P576j2786L908N966r413n354O652J3279L1458k831k4374k2592
15056b9323p363k1992J8994N9237p399R669K437l319l2386l5503k3784n990l3503
15043a10225n917M3856J6636Q456j4299L0487K7583p988k8143K50L8328J5664
15031A4688J0569J3215n3879m6160m04N5009J3000l0564r757M102o427j314J3561
15018b4361o249M6157J8733l6600j9237m815Q597q271l6871j3325K8744M1378
15006f120k458k7834j0509N366L769J4409o054j4268r75L018l1050J1556N596
$$ plain form
14993 -55554 -55376 -45064 -24780 7394 -17271 -15530 -6537 -47430 -72381 -83352 -53982 -7046
14981 -7046 11642 21630 -8235 4798 27083 56590 51504 56279 48795 19417 10410 -31586 -64094
14968 -64094 -81495 -115738 -88802 -46441 -25072 -9885 -6226 -17942 -18154 -15936 -49337 -70933
14956 -70933 -55096 -61732 -62350 -24105 -23787 -28764 -2957 -12817 -13977 -16584 -23545 -6918 -21452 -57718
14942 -57718 -63619 -73591 -66830 -37401 -63362 -64480 -51356 -36818 -57154 -82979 -72771 -57019
14930 -57019 -42923 -28068 13915 35829 7426 -21048 -42360 -26218 -22769 -12144 -16317 17657
14918 17657 10827 -14713 -14964 5548 -11357 -54885 -38776 -33157 -11843 -4598 -21096 -44260 -50347
14905 -50347 -32302 23841 44165 13294 47732 97338 99150 62553 33958 16662 23542 64704
$$ packed form
14993e5554J78J0312K0284L2174k4665J741Q993m0893k4951j0971K9370M6936
14981g046J8688R988k9865J3033K2285K9507n086M775p484k9378r007m1996l2508
14968f4094j7401l4243K6936M2361K1369J5187L659j1716k12K218l3401k1596
14956g0933J5837o636o18L8245L18m977K5807r860j160k607o961J6627j4534l6266
14942e7718n901r972O761K9429k5961j118J3124J4538k0336k5825J0208J5752
14930e7019J4096J4855M1983K1914k8403k8474k1312J6142L449J0625m173L3974
14918A7657o830k5540k51K0512j6905m3528J6109N619K1314P245j6498k3164o087
14905e0347J8045N6143K0324l0871L4438M9606J812l6597k8595j7296O880M1162
$$ plain form
14893 64704 51316 30620 27780 35657 45252 70923 37261 13828 31144 33838 38601 48238 27168
14880 27168 -10360 -1571 24250 22265 26044 24140 52333 35880 -32330 -57350 -52951 -34273 14080
14867 14080 36209 32576 7482 11061 16658 50793 35913 14275 52901 32535 19414 23176
14855 23176 70110 97861 104786 53231 24697 42465 37929 -16110 -15745 59001 89099 57213
14843 57213 34913 42625 34064 9424 17245 2516 -6606 7621 35370 20203 -21656 -46868
14831 -46868 -21699 17171 32679 50713 15257 11839 6173 -19914 -28650 -17462 162 21235
14819 21235 55998 38311 25383 30368 64099 52641 55540 66303 72220 57204 73372 113851
14807 113851 86054 106951 111780 95286 76689 31751 6630 20485 55004 31085 3542 12539
$$ packed form
14893F4704j3388k0696k840P877R595K5671l3662k3433J7316K694M763R637k1070
14880B7168l7528Q789K5821j985L779j904K8193j6453o8210k5020M399J8678M8353
14867A4080K2129l633k5094L579N597L4135j4880k1638L8626k0366j3121L762
14855B3176M6934K7751O925n1555k8534J7768m536n4039L65P4746L0098l1886
14843E7213k2300P712q561k4640P821j4729r122J4227K7749j5167m1859k5212
14831d6868K5169L8870J5508J8034l5456l418n666k6087q736J1188J7624K1073
14819B1235L4763j7687j2928M985L3731j1458K899J0763N917j5016J6168M0479
14807A13851k7797K0897M829j6494j8597m4938k5121J3855L4519k3919k7543Q997
$$ plain form
14795 12539 4583 23908 -1471 2248 29843 32599 71574 56795 48195 58772 52073 48024 16961
14782 16961 4986 9520 34467 15449 10496 1843 -5370 1270 -14024 4516 10574 -10637 -20626
14769 -20626 -4132 4569 -6667 -25914 -12980 -21576 -35503 -29282 -33452 -4788 19084 5253
14757 5253 -43044 -70433 -38456 5535 15573 -19717 -22073 -27932 -27041 6958 4302 -24310 -23364
14744 -23364 -52476 -23002 6690 27366 47768 34649 58716 87289 85245 73626 67187 47397
14732 47397 16063 -7947 -2760 51497 36961 52751 54489 54867 25643 -11308 13933 35574
14720 35574 8995 10265 -4776 -1068 -23065 -31062 24265 54404 68566 35487 36688 42801 43727
14707 43727 33540 41276 53601 45981 68473 72349 95924 107481 90343 93072 155914 199752
$$ packed form
14795A2539p956J9325k5379L719K7595K756L8975j4779q600J0577o699m049l1063
14782A6961j1975M534K4947j9018m953q653p213O640j5294J8540O058k1211r989
14769b0626J6494Q701j1236j9247J2934q596j3927O221m170K8664K3872j3831
14757E253m8297k7389L1977M3991J0038l5290k356n859Q91L3999k656k8612R46
14744b3364k9112K9474K9692K0676K0402j3119K4067K8573k044j1619o439j9790
14732D7397l1334k4010N187N4257j4536J5790J738L78k9224l6951K5241K1641
14720C5574k6579J270j5041L708k1997p997N5327L0139J4162l3079J201O113R26
14707D3727j0187P736J2325p620K2492L876K3575J1557j7138K729O2842M3838
$$ plain form
14695 199752 236399 227019 205990 185681 172882 179301 140680 150010 178736 159870 142722 134364
14683 134364 128835 107451 112274 91369 62544 50574 44179 20524 25146 56860 74149 70738
14671 70738 94393 114178 122061 140429 126506 163012 249512 304901 335313 386229 412512 411299
14659 411299 396836 366800 341426 274474 233683 209506 208438 178826 120817 116932 137301 160129
14647 160129 178337 208044 217798 206266 236099 286214 370322 407063 419379 401314 365381 374194
14635 374194 328849 258797 212957 185799 152081 92147 27721 137 9541 28141 7957 -29
14623 -29 12707 4436 5511 25641 56967 52218 82214 81106 60030 39956 41081 63928 89334
14610 89334 68427 58392 37669 35723 31480 49271 52753 13200 17874 14799 21181 46146 56473
$$ packed form
14695A99752L6647r380k1029k0309j2799O419l8621R330K8726j8866j7148q358
14683A34364n529k1384M823k0905k8825j1970o395k3655M622L1714J7289l411
14671G0738K3655J9785P883J8368j3923L6506Q6500N5389L0412N0916K6283j213
14659D11299j4463l0036k5374o6952m0791k4177j068k9612n8009l885K0369K2828
14647A60129J8208K9707R754j1532K9833N0115Q4108L6741J2316j8065l5933Q813
14635C74194m5345p0052m5840k7158l3718n9934o4426k7584R404J8600k0184p986
14623b9J2736q271J075K0130L1326m749K9996j108k1076k0074J125K2847K5406
14610H9334k0907j0035k0723j946m243J7791L482l9553M674l075O382K4965J0327
$$ plain form
14597 56473 48388 59482 71095 32416 43969 53402 67340 66130 71867 103786 55935 18550
14585 18550 -481 -9704 -15609 -24602 19951 49754 79857 45873 28342 20856 33953 42117 41156
14572 41156 52456 58499 87964 121700 125539 106000 101548 96161 55808 40965 40301 69874 90750
14559 90750 107658 109815 120599 129021 156172 162365 115105 88500 107835 127697 101671 100749 155057
14546 155057 150877 148400 160987 184712 197478 222280 276093 324050 338466 371324 429081 520345
14534 520345 547556 614502 735870 884060 1060049 1250499 1502715 1746099 1981866 2212810
14524 2212810 2402277 2568256 2645120 2630265 2514430 2373426 2205758 2020035 1788303 1599056
14514 1599056 1424086 1214957 1103632 1006032 930766 938360 949640 986804 1065249 1110229 1152916
$$ packed form
14597E6473q085J1094J1613l8679J1553R433J3938j210N737L1919m7851l7385
14585A8550j9031r223n905q993M4553K9803L0103l3984j7531p486J3097Q164r61
14572D1156J1300O043K9465L3736L839j9539m452n387m0353j4843o64K9573K0876
14559I0750J6908K157J0784Q422K7151O193m7260k6605J9335J9862k6026r22N4308
14546A55057m180k477J2587K3725J2766K4802N3813M7957J4416L2858N7757R1264
14534E20345K7211O6946J21368J48190J75989J90450K52216K43384K35767K30944
14524B212810J89467J65979P6864j4855j15835j41004j67668j85723k31732j89247
14514A599056j74970k09129j11325r7600p5266P594J1280L7164P8445M4980M2687
$$ plain form
14503 1152916 1247706 1312968 1391412 1447224 1495535 1524488 1526765 1549266 1519881 1433887 1356646
14492 1356646 1310769 1203824 1080607 936685 869747 806248 764987 706624 634363 630657 596190
14481 596190 543963 499792 501463 467592 411721 429153 445117 453477 429295 409165 382822 378809
14469 378809 420991 475753 489430 494425 471948 483524 518081 530978 543366 585065 584639 568694
14457 568694 551838 537671 510948 475509 434217 433639 428164 380403 362207 386334 388997 383802
14445 383802 364792 314946 237407 205124 238832 250330 236405 184057 202449 225405 197718
14434 197718 163826 152122 150911 187362 170631 130519 115186 120268 105938 81515 81426 104900
14422 104900 90106 107361 106442 88089 71073 64720 40684 26480 59361 89752 109731 97919
$$ packed form
14503A152916R4790O5262P8444N5812M8311K8953K277K2501k9385q5994p7241
14492A356646m5877j06945j23217j43922o6938o3499m1261n8363p2261l706l4467
14481E96190n2227m4171J671l3871n5871J7432J5964Q360k4182k0130k6343m013
14469C78809M2182N4762J3677M995k2477J1576L4557J2897J2388M1699m26j5945
14457E68694j6856j4167k6723l5439m1292n78n475m7761j8196K4127K663n195
14445C83802j9010m9846p7539l2283L3708J1498j3925n2348J8392K2956k7687
14434A97718l3892j1704j211L6451j6731m0112j5333N082j4330k4423q9K3474
14422A04900j4794J7255r19j8353j7016o353k4036j4204L2881L0391J9979j1812
$$ plain form
14410 97919 60950 32365 47477 61241 51904 16777 -12518 -17793 731 15971 52999 42019
14398 42019 55608 84701 85600 58612 24598 47554 67944 63053 56366 70601 48598 17325
14386 17325 18352 45045 76627 50461 73142 78334 35853 35304 50336 72652 48510 40969 15239
14373 15239 630 -357 29832 75795 72254 52650 39447 45608 80396 72848 27835 -25889 -15692
14360 -15692 19191 -12525 -30077 -28843 -20615 -70019 -52708 -9192 -39280 -33980 -8966 16337
14348 16337 22094 17305 48286 65015 56438 63173 58065 63086 37244 19271 31974 37600 13944
14335 13944 4571 33826 66476 28121 27737 37899 50466 58323 83095 47692 39681 48472 71483
14322 71483 70911 101827 111846 97848 85559 119739 155895 165347 157143 155242 131741 122015 125476
$$ packed form
14410I7919l6969k8585J5112J3764r337l5127k9295n275J8524J5240L7028j0980
14398D2019J3589K9093Q99k6988l4014K2956K0390m891o687J4235k2003l1273
14386A7325J027K6693L1582k6166K2681N192m2481n49J5032K2316k4142p541k5730
14373A5239j4609r87L0189M5963l541j9604j3203O161L4788p548m5013n3724J0197
14360a5692L4883l1716j7552J234Q228m9404J7311M3516l0088N300K5014K5303
14348A6337N757m789L0981J6729q577O735n108N021k5842j7973J2703N626k3656
14335A3944r373K9255L2650l8355l84J0162J2567P857K4772l5403q011Q791K3011
14322G1483n72L0916J0019j3998j2289L4180L6156R452q204j901k3501r726L461
$$ plain form
14309 125476 96265 104539 160701 209741 235551 216560 228163 225796 181335 156920 145500 155680
14297 155680 146152 142763 133627 115490 98265 102747 77690 56923 52934 73471 72236 71241 52868
14284 52868 54823 74148 72402 38005 37451 73042 108414 130667 106444 67204 71876 76840 34178
14271 34178 28271 58734 101072 122242 125883 117591 83882 35933 40328 63956 43683 -5998
14259 -5998 -35169 -13217 17401 72875 67599 45404 87096 121464 109556 73519 83250 80954
14247 80954 60354 56736 79712 90675 134924 157487 144018 119921 83638 87795 60394 38247
14235 38247 31893 30585 38727 49644 79154 92329 108864 110006 71890 55737 60600 70199 99784
14222 99784 162291 207271 195109 176031 161723 152451 168039 161775 154782 151549 161615 154483 179645
$$ packed form
14309A25476k9211Q274N6162M9040K5810j8991J1603k367m4461k4415j1420J0180
14297A55680r528l389r136j8137j7225M482k5057k0767l989K0537j235r95j8373
14284E2868J955J9325j746l4397n54L5591L5372K2253k4223l9240M672M964m2662
14271C4178n907L0463M2338K1170L641q292l3709m7949M395K3628k0273m9681
14259e998k9171K1952L0618N5474n276k2195M1692L4368j1908l6037R731k296
14247H0954k0600l618K2976J0963M4249K2563j3469k4097l6283M157k7401k2147
14235C8247o354j308Q142J0917K9510J3175J6535J142l8116j6153M863R599K9585
14222I9784O2507M4980j2162j9078j4308r272J5588o264o993l233J0066p132K5162
$$ plain form
14209 179645 223372 263076 281356 263972 210982 213851 185653 170606 197203 213556 205366 179460
14197 179460 163227 174202 199392 204146 177084 165268 156892 181382 217329 218504 212932 233890
14185 233890 289932 374536 438999 485412 537527 576746 601041 640981 655878 665897 693355
14174 693355 710953 695094 719476 725463 722533 674153 664716 672360 630496 621036 594759 582048
14162 582048 602397 604244 635158 621815 597120 608056 592249 610902 623282 567440 584341 633524
14150 633524 688598 717748 679357 631044 654900 684673 680172 726432 748965 750755 764038 775259
14138 775259 796306 846257 859651 840391 840094 842860 905674 1016902 1068458 1093808 1116420 1191719
14126 1191719 1268727 1330183 1393038 1450468 1485187 1554299 1611952 1696788 1777478 1874235 1976353
$$ packed form
14209A79645M3727L9704J8280j7384n2990K869k8198j5047K6597J6353q190k5906
14197A79460j6233J0975K5190M754k7062j1816q376K4490L5947J175n572K0958
14185B33890N6042Q4604O4463M6413N2115L9219K4295L9940J4897J0019K7458
14174F93355J7598j5859K4382N987k930m8380r437P644m1864r460k6277j2711
14162E82048K0349J847L0914j3343k4695J0936j5807J8653J2380n5842J6901M9183
14150F33524N5074K9150l8391m8313K3856K9773m501M6260K2533J790J3283J1221
14138G75259K1047M9951J3394j9260k97K766O2814J11228N1556K5350K2612P5299
14126A191719P7008O1456O2855N7430L4719O9112N7653Q4836Q0690R6757J02118
$$ plain form
14115 1976353 2125559 2264811 2391335 2520215 2683864 2874387 3025817 3220061 3436716
14106 3436716 3604323 3692459 3836265 3989298 4056149 4108608 4153452 4230150 4322279 4402756 4457693
14095 4457693 4545207 4707511 4864618 5018704 5223299 5493940 5766607 6042350 6336682 6660776
14085 6660776 7043802 7501922 7988638 8519524 9096001 9754327 10518410 11388866 12318012
14076 12318012 13327057 14473920 15818703 17352637 19083924 21065613 23299442 25902738
14068 25902738 28923015 32385146 36334373 40963912 46436581 52847529 60381711 69328387
14060 69328387 79950772 92476008 106986194 123402649 141292616 159955962 178265290
14053 178265290 195032739 209082061 219247138 224638755 224720777 219440475 209388842 195496834
$$ packed form
14115A976353J49206J39252J26524J28880J63649J90523J51430J94244K16655
14106C436716J67607Q8136J43806J53033O6851N2459M4844P6698R2129Q0477N4937
14095D457693Q7514J62304J57107J54086K04595K70641K72667K75743K94332L24094
14085F660776L83026M58120M86716N30886N76477O58326P64083Q70456R29146
14076A2318012J009045J146863J344783J533934J731287J981689K233829K603296
14068B5902738L020277L462131L949227M629539N472669O410948P534182Q946676
14060F9328387J0622385J2525236J4510186J6416455J7889967J8663346J8309328
14053A78265290J6767449J4049322J0165077N391617Q2022n280302j0051633j3892008
$$ plain form
14045 195496834 178940818 160870707 142502216 124825046 108617731 94307725 81994775
14038 81994775 71499920 62695448 55290136 49062003 43735244 39206391 35321249 31905560
14030 31905560 28933551 26324335 24043115 22015603 20191674 18586192 17114422 15779375
14022 15779375 14583552 13508479 12550396 11657914 10872131 10115111 9437824 8819255 8265568
14013 8265568 7788415 7293817 6864439 6514709 6196490 5867351 5548871 5250328 5005498
14004 5005498 4765970 4516378 4315029 4131327 3911955 3718330 3586969 3471170 3349989
13995 3349989 3271991 3143686 3032215 2946261 2848762 2781253 2715065 2659291 2638081 2595130 2543264
13984 2543264 2499026 2455583 2465950 2544323 2583613 2587453 2630849 2653150 2658797 2641054 2561340 2450676
$$ packed form
14045A95496834j6556016j8070111j8368491j7677170j6207315j4310006j2312950
14038H1994775j0494855q804472p405312o228133n326759m528853l885142l415689
14030C1905560k972009k609216k281220k027512j823929j605482j471770j335047
14022A5779375j195823j075073r58083q92482p85783p57020o77287o18569n53687
14013H265568m77153m94598m29378l49730l18219l29139l18480k98543k44830
14004E005498k39528k49592k01349j83702k19372j93625j31361j15799j21181
13995C349989p7998j28305j11471q5954r7499o7509o6188n5774k1210m2951n1866
13984B543264m4238m3443J0367P8373L9290L840M3396K2301N647j7743p9714j10664
$$ plain form
13972 2450676 2351749 2250548 2122279 2002634 1882253 1751979 1630772 1544582 1496462 1466628
13962 1466628 1421097 1345953 1275826 1209009 1176755 1188977 1113009 1036773 967739 927290 907946
13951 907946 895090 861428 806440 774622 753000 726116 720768 726758 725126 704879 686304 654705
13939 654705 592658 579575 570337 547876 537593 514435 507337 504280 474458 458390 497414 500047
13927 500047 513549 548979 528635 516606 515544 517342 543414 530978 514542 489682 526731 532327
13915 532327 523818 541624 542154 517391 470506 473480 436687 409665 440610 454892 394174 372234
13903 372234 415770 397287 356863 334153 286649 262111 251291 251522 236093 256408 294351 305321
13891 305321 288655 265550 239690 255820 280745 290860 304588 335462 326369 302814 282843 290521
$$ packed form
13972B450676r8927j01201j28269j19645j20381j30274j21207q6190m8120k9834
13962A466628m5531p5144p0127o6817l2254J2222p5968p6236o9034m0449j9344
13951I07946j2856l3662n4988l1818k1622k6884n348N990j632k0247j8575l1599
13939F54705o2047j3083r238k2461j0283k3158p098l057k9822j6068L9024K633
13927E00047J3502L5430k0344j2029j062J798K6072j2436j6436k4860L7049N596
13915E32327q509J7806N30k4763m6885K974l6793k7022L0945J4282o0718k1940
13903C72234M3536j8483m0424k2710m7504k4538j0820K31j5429K0315L7943J0970
13891C05321j6666k3105k5860J6130K4925J0115J3728L0874r093k3555j9971P678
$$ plain form
13879 290521 289768 323027 342120 341852 345069 359890 380021 409569 402133 412996 468352 451941 452566
13866 452566 470647 439485 461052 512072 573609 653455 766945 862795 969690 1100371 1254139
13855 1254139 1381525 1511123 1600189 1674408 1697674 1694120 1693788 1623458 1549350 1471442 1336165
13844 1336165 1210531 1067728 924055 841327 787625 674085 614337 582510 542266 505217
13834 505217 451792 389904 348773 292311 276987 255790 260584 272571 268248 246186 193654 186406
13822 186406 126547 100340 152508 210820 209669 173734 183332 220548 204523 202077 197194 231016
13810 231016 173010 167766 189836 212416 219556 203670 215311 214079 199813 173851 172470 189201
13798 189201 195463 153947 130590 139587 145393 169424 195329 185146 189508 182957 196460 195389 178949
$$ packed form
13879B90521p53L3259J9093k68L217J4821K0131K9548p436J0863N5356j6411O25
13866D52566J8081l1162K1567N1020O1537P9846J13490R5850J06895J30681J53768
13855A254139J27386J29598Q9066P4219K3266l554l32p0330p4108p7908j35277
13844A336165j25634j42803j43673q2728n3702j13540n9748l1827m0244l7049
13834E05217n3425o1888m1131n6462j5324k1197M794J1987m323k2062n2532p248
13822A86406n9859k6207N2168N8312j151l5935R598L7216j6025k446m883L3822
13810B31016n8006n244K2070K2580P140j5886J1641j232j4266k5962j381J6731
13798A89201O262m1516k3357Q997N806K4031K5905j0183M362o551J3503j071j6440
$$ plain form
13785 178949 163953 159143 187075 205090 178625 155622 160515 136257 128568 69334 49034 46013
13773 46013 52755 32891 5058 22661 14178 15245 4777 13802 11678 29090 30130 31285 42131
13760 42131 49480 77564 116456 93839 71329 49681 24242 14949 20434 9351 5158 -3791 37524
13747 37524 51129 82835 54558 47168 67923 70792 42655 84011 87420 83600 66312 38731
13735 38731 64119 72077 64917 66090 92009 105169 104192 72635 69329 71636 77487 88784 134156
13722 134156 119523 100767 123553 115343 77195 63201 53357 45234 51164 70816 85876 94164
13710 94164 111219 102515 79021 59881 56946 96882 71510 59606 36972 30997 55578 32288
13698 32288 -3404 39455 73050 110182 89966 54208 33476 17639 14189 -18068 -50147 -30625
$$ packed form
13785A78949j4996m810K7932J8015k6465k3003M893k4258p689n9234k0300l021
13773D6013O742j9864k7833J7603q483J067j0468R025k124J7412J040J155J0846
13760D2131P349K8084L8892k2617k2510k1648k5439r293N485j1083m193q949M1315
13747C7524J3605L1706k8277p390K0755K869k8137M1356L409l820j7288k7581
13735C8731K5388P958p160J173K5919J3160r77l1557l306K307N851J1297M5372
13722A34156j4633j8756K2786q210l8148j3994r844q123N930J9652J5060Q288
13710I4164J7055q704k3494j9140k935L9936k5372j1904k2634n975K4581k3290
13698C2288l5692M2859L3595L7132k0216l5758k0732j5837l450l2257l2079J9522
$$ plain form
13686 -30625 12580 50256 53269 51645 39988 24406 19731 26615 22426 1937 9853 25368 15848
13673 15848 -17159 -56965 -67833 -23903 39938 16474 3188 10126 54221 61956 73207 85532
13661 85532 62045 31674 9850 17323 19262 14599 50613 101021 98761 104881 71207 11786 28614
13648 28614 46204 48644 36643 30498 2238 -14800 -38566 -35276 655 21574 66077 80769
13636 80769 73161 76320 80183 37862 16148 29901 46694 69931 42245 -1369 -9302 28812
13624 28812 62832 86160 121322 129385 128909 156847 184127 168375 159582 138977 92813 115350
13612 115350 177422 191955 194614 210206 249551 323528 406872 446251 531790 651515 721698
13601 721698 802334 892974 1003623 1099464 1157309 1191751 1187910 1163315 1179254 1152098 1042000
$$ packed form
13686c0625M3205L7676L013j624j1657j5582m675O884m189k0489P916J5515r520
13673A5848l3007l9806j0868M3930O3841k3464j3286O938M4095P735J1251J2325
13661H5532k3487l0371k1824P473J939m663L6014N0408k260O120l3674n9421J6828
13648B8614J7590K440j2001o145k8260j7038k3766L290L5931K0919M4503J4692
13636H0769p608L159L863m2321k1714J3753J6793K3237k7686m3614p933L8114
13624B8812L4020K3328L5162Q063m76K7938K7280j5752q793k0605m6164K2537
13612A15350O2072J4533K659J5592L9345P3977Q3344L9379Q5539J19725P0183
13601G21698Q0636R0640J10649R5841N7845L4442l841k4595J5939k7156j10098
$$ plain form
13590 1042000 939066 836267 739921 637992 560360 503112 466297 390358 326176 307726 284271
13579 284271 259089 220951 175391 176306 150916 163182 166223 170319 161650 119481 100459 98751 111263
13566 111263 65455 31290 53547 69740 62234 69581 35991 -22286 -11628 28698 58380 70488
13554 70488 66513 59696 84939 86609 61137 66090 56510 82367 57819 54259 52082 53008 64571
13541 64571 24091 23126 31955 36495 43134 58586 85832 116787 89315 40176 43653 43272 53676
13528 53676 63535 56721 24075 15585 38193 10810 -33458 -49584 -44199 -38716 -19795 33678 14411
13515 14411 23730 38355 21312 -12733 -6316 38479 46320 19829 21271 9817 12905 -13590 2298
13502 2298 4724 23266 8117 27156 47318 12706 -10901 -20332 -15848 -11504 -18373 24914 22322
$$ packed form
13590A042000j02934j02799r6346j01929p7632n7248l6815p5939o4182j8450k3455
13579B84271k5182l8138m5560R15k5390J2266L041M096q669m2169j9022j708J2512
13566A11263m5808l4165K2257J6193p506P347l3590n8277J0658M0326K9682J2108
13554G0488l975o817K5243J670k5472M953r580K5857k4548l560k177R26J1563
13541F4571m0480r65Q829M540O639J5452K7246L0955k7472m9139L477l81J0404
13528E3676R859o814l2646q490K2608k7383m4268j6126N385N483J8921N3473j9267
13515A4411R319J4625j7043l4045O417M4795P841k6491J442j1454L088k6495J5888
13502B298K426J8542j5149J9039K0162l4612k3607r431M484M344o869M3287k592
$$ plain form
13489 22322 9143 -5931 -11131 -11540 2976 -10421 -9197 -11098 7531 21344 15162 -23428 32150
13476 32150 46869 25199 9582 -3091 -5501 32551 52712 55726 48026 59952 72690 81576
13464 81576 54815 39892 42407 44547 39241 21766 9029 12780 35213 68355 70667 62705 19552
13451 19552 35277 58061 74046 69013 47409 56848 47120 9760 1106 29822 35592 34514 57023
13438 57023 5766 -10814 -17110 -36978 -63924 -37687 -16760 -13159 -45233 -62888 -12973 -1839
13426 -1839 27574 16806 7809 33058 38723 8087 44216 33976 10834 25601 31630 3250
13414 3250 -27432 -37274 -21050 -26893 -77484 -68443 -35437 -21471 29282 35145 33429 6059 -26525
13401 -26525 -73742 -106070 -63378 -23996 10236 32601 47002 56782 57228 83637 54469 34230
$$ packed form
13489B2322j3179j5074n200m09J4516j3397J224j901J8629J3813o182l8590N5578
13476C2150J4719k1670j5617j2673k410L8052K0161L014p700J1926J2738Q886
13464H1576k6761j4923K515K140n306j7475j2737L751K2433L3142K312p962m3153
13451A9552J5725K2784J5985n033k1604R439r728l7360q654K8716N770j078K2509
13438E7023n1257j6580o296j9868k6946K6237K0927L601l2074j7655M9915J1134
13426a839K9413j0768q997K5249N665l0636L6129j0240k3142J4767O029k8380
13414C250l0682r842J6224n843n0591R041L3006J3966N0753N863j716k7370l2584
13401b6525m7217l2328M2692L9382L4232K2365J4401R780M46K6409k9168k0239
$$ plain form
13389 34230 56010 52427 33133 15590 -16208 -47308 -67828 -51461 -43240 -24276 19511 15448
13377 15448 14976 34144 9382 15864 8932 8610 29675 77758 68488 45090 2434 28982 71400
13364 71400 54973 63632 77856 84749 79445 70043 65322 58266 28241 28417 41669 42936 60155
13351 60155 58099 82914 112538 151738 126330 91061 103629 79388 55999 50383 71403 95157
13339 95157 121372 138727 108220 66144 81896 110876 98631 53091 20757 27497 83270 151483
13327 151483 171335 170774 168549 148397 154663 143169 139615 161471 143053 155009 155443 207106 231218
13314 231218 264732 234623 210551 229671 259192 285367 253722 274790 272052 254143 274208 264230
13302 264230 251133 265912 294550 331500 350166 353179 342481 331319 291835 295185 307558 280169
$$ packed form
13389C4230K1780l583j9294j7543l1798l1100k0520J6367Q221J8964M3787m063
13377A5448m72J9168k4762O482o932l22K1065M8083r270k3398m2656K6548M2418
13364G1400j6427Q659J4224O893n304r402m721p056l0025J76J3252J267J7219
13351F0155k056K4815K9624L9200k5408l5269J2568k4241k3389n616K1020K3754
13339I5157K6215J7355l0507m2076J5752K8980j2245m5540l2334O740N5773O8213
13327A51483J9852n61k225k0152O266j1494l554K1856j8418J1956M34N1663K4112
13314B31218L3514l0109k4072J9120K9521K6175l1645K1068k738j7909K0065r978
13302B64230j3097J4779K8638L6950J8666L013j0698j1162l9484L350J2373k7389
$$ plain form
13290 280169 264916 276536 304295 303072 284661 259633 246502 215171 190326 207670 181212 179876
13278 179876 150139 136326 152645 133077 101478 133201 147476 97443 82086 117309 123851 126985
13266 126985 91293 52859 43120 55018 51385 37178 70595 89949 81444 31233 34814 67461
13254 67461 62045 71731 80816 81100 60106 15670 15954 43312 58902 56367 52446 54544 64577 73538
13240 73538 62508 50948 -12967 -6380 11202 -3274 12874 13601 26016 60250 15759 -3671
13228 -3671 27168 14702 16281 -12026 8694 301 -39284 -8810 8087 1839 -2237 -22162 -11090
13215 -11090 -6551 -13642 -61824 -42122 -36490 -26045 3220 9751 30912 38420 36279 55109 76484
13202 76484 80639 94305 85853 55714 49890 29965 7553 6268 39233 55367 46260 50683 58409
$$ packed form
13290B80169j5253J1620K7759j223j8411k5028j3131l1331k4845J7344k6458j336
13278A79876k9737j3813J6319j9568l1599L1723J4275n0033j5357L5223O542L134
13266A26985l5692l8434r739J1898l633j4207L3417J9354q505n0211L581L2647
13254F7461n416R686R085K84k0994m4436K84K7358J5590k535l921K098J0033Q961
13240G3538j1030j1560o3915O587J7582j4476J6148P27J2415L4234m4491j9430
13228c671L0839j2466J579k8307K0720q393l9585L0474J6897o248m076j9925J1072
13215a1090M539p091m8182J9702N632J0445K9265O531K1161P508k141J8830K1375
13202G6484M155J3666q452l0139n824j9925k2412j285L2965J6134r107M423P726
$$ plain form
13189 58409 112906 159602 146855 135805 133081 124629 80075 105260 116997 91911 40250 14054
13177 14054 -4709 381 22245 33524 3285 -11057 29767 47134 61470 66749 41522 37185
13165 37185 -3019 -6495 24661 39792 22077 30968 29844 9636 35724 40851 37115 29984 372
13152 372 34757 85045 131475 132338 107044 114807 191457 260508 348758 454129 553201 513141
13140 513141 407292 278553 197609 143469 84497 39307 89313 121491 99799 32151 17213
13129 17213 33209 21252 -25336 -33024 -48336 -46966 -29757 -13817 6352 -20968 -53878 -44533
13117 -44533 -16077 17653 52004 41773 37680 39784 44372 18214 15132 6416 -2296 -28860 -7968
13104 -7968 14658 52435 62093 87003 135492 258991 381234 468737 456499 359529 255733
$$ packed form
13189E8409N4497M6696j2747j1050k724q452m4554K5185J1737k5086n1661k6196
13177A4054j8763N090K1864J1279l0239j4342M0824J7367J4336N279k5227m337
13165C7185m0204l476L1156J5131j7715Q891j124k0208K6088N127l736p131k9612
13152C72L4385N0288M6430Q63k5294P763P6650O9051Q8250J05371R9072m0060
13140E13141j05849j28739q0944n4140n8972m5190N0006L2178k1692o7648j4938
13129A7213J5996j1957m6588p688j5312J370J7209J5940K0169k7320l2910R345
13117d4533K8456L3730L4351j0231m093K104M588k6158l082q716q712k6564K0892
13104g968K2626L7777R658K4910M8489J23499J22243Q7503j2238r6970j03796
$$ plain form
13093 255733 161369 124683 84659 26036 39667 62548 79391 69201 61460 72562 42119 20514
13081 20514 11264 -302 -25064 -28609 4463 8438 29023 25483 -12079 -15507 -22558 -23385 -4094
13068 -4094 38470 10992 -13453 -27706 -33269 4836 1225 -10570 774 19689 34175 63197
13056 63197 60051 3587 39211 83849 109852 107059 96184 54823 39969 32471 18158 34390
13044 34390 44742 18479 15134 41623 4460 -39318 -41910 -6785 7408 10377 20196 24078 11460
13031 11460 -26245 -62283 -60515 -36774 -19663 -22007 -25667 -23016 -30196 -7555 17939 -16928 -8927
13018 -8927 -5462 12067 22126 -12091 -4487 11534 -17953 614 18944 -4475 -25829 -65955
13006 -65955 -75619 -67167 -91826 -61391 -15748 -889 24666 34763 -27141 -41412 -34614 -36776
$$ packed form
13093B55733r4364l6686m0024n8623J3631K2881J6843j0190p741J1102l0443k1605
13081B0514r250j1566k4762l545L3072L975K0585l540l7562l428p051q27J9291
13068d094M2564k7478k4445j4253n563L8105l611j1795J1344J8915J4486K9022
13056F3197l146n6464L5624M4638K6003k793j0875m1361j4854p498j4313J6232
13044C4390J0352k6263l345K6489l7163m3778k592L5125J4193K969R819L882j2618
13031A1460l7705l6038J768K3741J7111k344l660K651p180K2641K5494l4867Q001
13018h927L465J7529J0059l4217P604J6021k9487J8567J8330k3419k1354m0126
13006f5955r664Q452k4659L0435M5643J4859K5555J0097o1904j4271O798k162
$$ plain form
12994 -36776 6957 2595 16031 47360 37291 18793 5712 11984 7072 -8684 -41426 -19389
12982 -19389 -21358 -31104 -33617 -30612 -19551 -44080 -71515 -69746 -48721 -55464 -19633 12485 5085
12969 5085 -11203 -38440 -28806 -40944 -36920 -27837 -8498 6199 2886 15028 -9657 -35577 -3922
12956 -3922 -11216 -56923 -47498 5272 21042 15109 64470 51308 18643 -857 -14919 -7147 7367
12943 7367 32789 31817 -1072 -37959 -78606 -92056 -66744 -38649 -50516 -30903 -17272 3648
12931 3648 23525 12023 -10069 -19485 7163 25334 8544 8426 -5889 -16916 17264 24198 6062
12918 6062 12163 6709 -17886 -8133 -10050 -29469 -35158 -14867 -7834 -22390 -27256 -33094 -25513 -33478
12904 -33478 -65656 -74502 -65191 -82501 -78018 -31477 -31168 -41931 -32135 -19672 3028 -498 -27804
$$ packed form
12994c6776M3733m362J3436L1329j0069j8498j3081O272m912j5756l2742K2037
12982a9389j969r746k513L005J1061k4529k7435J769K1025o743L5831L2118p400
12969E085j6288k7237R634j2138M024R083J9339J4697l313J2142k4685k5920L1655
12956c922p294m5707R425N2770J5770n933M9361j3162l2665j9500j4062P772J4514
12943G367K5422r72l2889l6887m0647j3450K5312K8095j1867J9613J3631K0920
12931C648J9877j1502k2092r416K6648J8171j6790j18j4315j1027L4180O934j8136
12918F062O101n454k4595R753j917j9419n689K0291P033j4556m866n838P581p965
12904c3478l2178q846R311j7310M483M6541L09j0763R796J2463K2700l526k7306
$$ plain form
12891 -27804 -7447 -15833 -29093 -34195 -4634 -12597 25958 44588 14463 -3845 -21938 -22740 -38886
12878 -38886 -42215 -55466 -31237 -19875 8244 8257 2687 -16613 -28263 -32423 -36249 -33321 -26498
12865 -26498 -11770 -5203 -44390 -47465 2162 22384 1917 -21245 -13248 27899 36247 27113 43745
12852 43745 4112 -5498 23834 57933 53855 49286 137896 191769 153082 105740 103506 130722
12840 130722 131375 100611 84660 80727 38846 6038 -8247 -11543 -31693 -15665 -86 4859
12828 4859 -17749 -52499 -35282 15604 34576 30589 4515 -20477 -2704 -24366 -59689 -53608
12816 -53608 -12204 37359 30984 18312 -7859 23528 39023 67716 67960 37528 44863 62088
12804 62088 25786 -27586 -8397 404 -16239 -4118 32131 35519 25299 39913 -1768 -27495
$$ packed form
12891b7804K0357q386j3260n102K9561p963L8555J8630l0125j8308j8093q02j6146
12878c8886l329j3251K4229J1362K8119J3n570j9300j1650m160l826K928O823
12865b6498J4728O567l9187l075M9627K0222k0467k3162P997M1147Q348r134J6632
12852D3745l9633r610K9332L4099m078m569Q8610N3873l8687m7342k234K7216
12840A30722O53l0764j5951l933m1881l2808j4285l296k0150J6028J5579M945
12828D859k2608l4750J7217N0886J8972l987k6074k4992J7773k1662l5323O081
12816e3608M1404M9563o375j2672k6171L1387J5495K8693K44l0432P335J7225
12804F2088l6302n3372J9189Q801j6643J2121L6249L388j0220J4614m1681k5727
$$ plain form
12792 -27495 -2797 12418 1944 13343 -5234 -6765 -34891 -57056 -24440 14085 -5220 -12606
12780 -12606 15962 49193 55930 58595 27960 9876 18732 27283 44291 19497 -379 -19177
12768 -19177 -29991 -11418 -9142 -17278 -27425 -53734 -70394 -68993 -38209 -14969 -8070 12948
12756 12948 -20030 27095 45951 29892 -12864 -23696 -31796 -28128 -21468 -25690 -30677 -14131 14812
12743 14812 12000 -2881 -28698 -53119 -71965 -59122 -29852 -33833 -2742 -33740 -71504 -64283
12731 -64283 -62585 -48823 -16258 -9894 -23150 -58187 -48094 -30940 5588 25610 -11163 -47272
12719 -47272 -38397 -29492 -38572 -33115 -41229 -30625 -38853 -45421 -37706 -33013 -225 9518 10016 27740
12705 27740 -7482 -30602 -11875 -15952 -65772 -68647 -26747 -10098 -25754 -27927 -40810 -11095
$$ packed form
12792b7495K4698J5215j0474J1399j8577j531k8126k2165L2616L8525j9305p386
12780a2606K8568L3231O737K665l0635j8084Q856Q551J7008k4794j9876j8798
12768a9177j0814J8573K276q136j0147k6309j6660J401L0784K3240O899K1018
12756A2948l2978M7125J8856j6059m2756j0832q100L668O660m222m987J6546K8943
12743A4812k812j4881k5817k4421j8846J2843K9270l981L1091l0998l7764P221
12731f4283J698J3762L2565O364j3256l5037J0093J7154L6528K0022l6773l6109
12719d7272Q875Q905r080N457q114J0604q228o568P715M693L2788R743M98J7724
12705B7740l5222k3120J8727m077m9820k875M1900J6649j5656k173j2883K9715
$$ plain form
12693 -11095 15353 69618 84111 69102 76845 69559 1883 -5336 21177 -3447 -20008 -59122
12681 -59122 -54669 -11060 11421 21484 23682 1464 9747 22061 20975 37881 18627 -13829
12669 -13829 2953 -7866 6204 23021 9451 17255 50635 46348 26095 24525 -14630 -55114
12657 -55114 -43537 -56322 -68284 -29052 -8623 21806 28968 42458 7019 -20805 -6783 -9568
12645 -9568 -23653 -899 13257 29859 46997 26626 -9536 -41755 -49557 -54920 -20847 -21395 11748
12632 11748 42506 40708 41212 45597 66637 50314 31233 9088 -16970 -1736 -11665 -32155 3126
12619 3126 37969 68114 68484 11963 -12585 -17835 -26810 -12175 -23948 -35949 -29037 -34344 -29844
12606 -29844 -20967 -15330 -37979 -33670 -25958 -19325 -18816 -5281 687 7304 32674 30256 10612 -8220
$$ packed form
12693a1095K6448N4265J4493j5009P743p286o7676p219K6513k4624j6561l9114
12681e9122M453M3609K2481J0063K198k2218Q283J2314j086J6906j9254l2456
12669a3829J6782j0819J4070J6817j3570P804L3380m287k0253j570l9155m0484
12657e5114J1577j2785j1962L9232K0429L0429P162J3490l5439k7824J4022k785
12645i568j4085K2754J4156J6602J7138k0371l6162l2219p802n363L4073n48L3143
12632A1748L0758j798N04M385K1040j6323j9081k2145k6058J5234r929k0490L5281
12619C126L4843L0145L70n6521k4548n250q975J4635j1773j2001O912n307M500
12606b9844Q877N637k2649M309P712O633N09J3535N968O617K5370k418j9644j8832
$$ plain form
12592 -8220 -1924 902 -6519 -32832 -37735 -45268 -39756 -70703 -69291 -33758 -10001 -47253 -13754
12579 -13754 18379 46912 9090 -10438 2580 9039 25286 54511 46303 25281 -3316 -5433
12567 -5433 -19417 22431 34074 27560 17614 30083 9225 -39195 -52303 -41278 -7915 -1291
12555 -1291 -4431 -53516 -71415 -43055 -20333 7725 -8433 -47375 -58722 -15992 16170 26200
12543 26200 -37179 -98387 -83034 -45366 -15985 1541 -23057 -40513 -45252 -69890 -83950 -95877
12531 -95877 -57494 -43383 -54434 -75689 -94395 -90911 -63695 -40437 -52706 -48637 -70180 -61855
12519 -61855 -27415 3080 37858 35819 12701 -6055 -8428 -21614 -15261 -12932 -19306 -17893 -47148
12506 -47148 -34787 -24770 -29495 2339 24573 -3121 -25688 -25524 -19561 -42365 -62614 -46296
$$ packed form
12592h220O296K826p421k6313m903p533N512l0947J412L5533K3757l7252L3499
12579a3754L2133K8533l7822j9528J3018O459J6247K9225q208k1022k8597k117
12567e433j3984M1848J1643o514r946J2469k0858m8420j3108J1025L3363O624
12555a291l140m9085j7899K8360K2722K8058j6158l8942j1347M2730L2162J0030
12543B6200o3379o1208J5353L7668K9381J7526k4598j7456m739k4638j4060j1927
12531i5877L8383J4111j1051k1255j8706L484K7216K3258j2269M069k1543Q325
12519f1855L4440L0495L4778k039k3118j8756k373j3186O353K329o374J413k9255
12506d7148J2361J0017m725L1834K2234k7694k2567J64N963k2804k0249J6318
$$ plain form
12494 -46296 -57021 -36340 -31322 -43453 -73882 -81327 -104305 -100822 -66733 -49859 -24293 -8998
12482 -8998 -14417 -15648 -25981 5286 9446 9537 36422 29262 -19346 -36885 -3733 -13211 -4421 21042
12468 21042 -1292 -34262 -21400 6218 22736 13206 -14523 -6722 7640 9403 24468 3172
12456 3172 -41601 -17543 -980 9759 8702 14072 22580 32146 15806 9421 4891 9700 12011
12443 12011 7123 12532 2823 -7298 -4175 54562 99802 76105 51072 10815 8827 -5875 7720
12430 7720 13500 46039 90727 93500 79215 56363 51152 90158 120304 162887 216098 279259
12418 279259 334527 346467 260256 174849 153105 108535 92904 66964 57283 47983 61051 60168
12406 60168 49608 22554 10118 23788 32846 18431 30132 42903 49711 44152 75130 58544
$$ packed form
12494d6296j0725K0681N018j2131l0429p445k2978L483L4089J6874K5566J5295
12482h998n419j231j0333L1267M160R1K6885p160m8608j7539L3152r478Q790K5463
12468B1042k2334l2970J2862K7618J6518r530k7729P801J4362J763J5065k1296
12456C172m4773K4058J6563J0739j057N370Q508R566j6340o385m530M809K311
12443A2011m888N409r709j0121L123N8737M5240k3697k5033m0257j988j4702J3595
12430G720N780L2539M4688K773j4285k2852n211L9006L0146M2583N3211O3161
12418B79259N5268J1940q6211q5407k1744m4570j5631k5940r681r300J3068q83
12406F0168j0560k7054j2436J3670R058j4415J1701J2771O808n559L0978j6586
$$ plain form
12394 58544 65084 63543 77039 67656 85112 48222 -16724 -1899 38506 61588 50724 47024
12382 47024 45918 57103 46732 6388 25247 46866 50756 28731 -43000 -76608 -40300 -24717
12370 -24717 -25618 5777 540 37058 83729 112658 138358 184881 272334 407343 551451 683789
12358 683789 672627 560276 393066 255791 178291 122003 55870 26133 36569 79282 79766
12347 79766 46662 58708 105067 120170 109355 58269 10340 9469 803 42323 38991 24951
12335 24951 23708 25308 44112 46354 45133 43603 12665 22990 67985 57734 69598 67846 15810
12322 15810 -1164 -5472 -18333 -9641 -2750 -13508 -8360 19181 31677 27127 -22261 -18586 -30038
12309 -30038 6404 8072 -17493 -17102 14881 25903 15978 14347 49816 70780 59919 53807 60604
$$ packed form
12394E8544O540j541J3496r383J7456l6890o4946J4825M0405K3082j0864l700
12382D7024j106J1185j0371m0344J8859K1619L890k2025p1731l3608L6308J5583
12370b4717r01L1395n237L6518M6671K8929K5700M6523Q7453J35009J44108J32338
12358F83789j1162j12351j67210j37275p7500n6288o6133k9737J0436M2713M84
12347G9766l3104J2046M6359J5103j0815n1086m7929q71q666M1520l332j4040
12335B4951j243J600J8804K242j221j530l0938J0325M4995j0251J1864j752n2036
12322A5810j6974m308j2861Q692O891j0758N148K7541J2496m550m9388L675j1452
12309c0038L6442J668k5565L91L1983J1022r925j631L5469K0964j0861o112O797
$$ plain form
12296 60604 78678 88468 58202 89443 27440 -9077 31535 32467 19264 43950 76043 43620
12284 43620 48283 35100 15049 19162 10760 22662 38022 65197 89030 44084 4940 -38684
12272 -38684 -34851 9805 53956 30699 28746 57343 71946 70151 39507 8016 7436 29951 36016
12259 36016 24006 38922 29366 31502 34757 36131 -7938 -4188 10369 7821 40056 53180 29886
12246 29886 14283 13929 10980 17823 16331 11623 46177 66497 37282 -11403 1864 37014 65208
12233 65208 9385 -41685 -23136 24589 70904 69018 75822 36418 20486 47772 58156 29972
12221 29972 29589 62613 45243 51171 77541 98451 108852 75231 66252 55008 44476 39250 59094
12208 59094 85788 88902 60096 23409 28590 58398 49297 4513 -7026 8295 15171 -536
$$ packed form
12296F0604J8074R790l0266L1241o2003l6517M0612R32j3203K4686L2093l2423
12284D3620M663j3183k0051M113q402J1902J5360K7175K3833m4946l9144m3624
12272c8684L833M4656M4151k3257j953K8597J4603j795l0644l1491n80K2515O065
12259C6016j2010J4916r556K136L255J374m4069L750J4557k548L2235J3124k3294
12246B9886j5603l54k949O843j492m708L4554K0320k9215m8685J3267L5150K8194
12233F5208n5823n1070J8549M7725M6315j886O804l9404j5932K7286J0384k8184
12221B9972l83L3024j7370N928K6370K0910J0401l3621q979j1244j0532n226J9844
12208E9094K6694L114k8806l6687N181K9808r101m4784j1539J5321O876j5707
$$ plain form
12196 -536 13126 33236 37782 52286 53914 78744 83030 49972 53211 55859 81314 48610 10491
12183 10491 -35129 -32690 -19287 15946 41839 22138 18004 11054 14882 42513 74592 53465
12171 53465 26994 9686 11965 8395 42526 36371 20209 35412 38656 23369 37720 77225
12159 77225 111244 103184 116424 106573 98040 94413 76148 70605 82483 74902 75050 74827 32587 16610
12145 16610 60497 92547 87876 86295 72214 70004 75515 103038 105539 63017 51522 95785 116177
12132 116177 71307 51773 21275 31269 66091 44440 21050 32886 69019 81937 60554 46849
12120 46849 52623 18141 -8874 30266 71446 95044 94217 71573 81467 77645 92684 129309 173459
12107 173459 172784 163610 155650 141925 174442 181171 198170 204441 234879 273367 270165 295141 375516
$$ packed form
12196e36J3662K0110M546J4504J628K4830M286l3058L239K648K5455l2704l8119
12183A0491m5620K439J3403L5233K5893j9701m134o950L828K7631L2079k1127
12171E3465k6471j7308K279l570L4131o155j6162J5203L244j5287J4351L9505
12159G7225L4019q060J3240r851q533l627j8265n543J1878p581J48k23m2240j5977
12145A6610M3887L2050m671j581j4081k210N511K7523K501m2522j1495M4263K0392
12132A16177m4870j9534l0498R994L4822k1651k3390J1836L6133J2918k1383j3705
12120D6849N774l4482k7015L9140M1180K3598q27k2644R894l822J5039L6625M4150
12107A73459o75r174p960j3725L2517O729J6999O271L0438L8488l202K4976Q0375
$$ plain form
12094 375516 469071 538135 541134 486868 423482 330449 274411 256497 224734 138844 86024 63448
12082 63448 59434 57407 84495 68487 49674 32607 32924 38773 74902 59738 51792 23953 9486
12069 9486 33074 56638 75095 36406 22291 36336 53193 15005 12428 -3015 -25335 -40787
12057 -40787 -41340 -32618 -15944 22761 43825 23282 -1153 18525 20673 24726 16019 27955 56230
12044 56230 73524 50917 46178 71943 60058 45747 29330 16873 20779 32556 11047 50456
12032 50456 100710 91026 66544 38448 -3898 -8897 -3141 18590 35689 55580 70597 59904
12020 59904 55242 60521 59251 64539 89219 69866 66455 40193 17657 33466 6962 -659 21628
12007 21628 40763 28406 7691 12411 39559 20798 -8885 -6448 -6641 -4723 -10734 -20956 12663
$$ packed form
12094C75516R3555O9064K999n4266o3386r3033n6038j7914l1763q5890n2820k2576
12082F3448m014k027K7088j6008j8813j7067L17N849L6129j5164p946k7839j4467
12069I486K3588K3564J8457l8689j4115J4045J6857l8188k577j5443k2320j5452
12057d0787n53Q722J6674L8705K1064k0543k4435J9678K148M053q707J1936K8275
12044E6230J7294k2607m739K5765j1885j4311j6417j2457L906J1777k1509L9409
12032E0456N0254r684k4482k8096m2346m999N756K1731J7099J9891J5017j0693
12020E9904m662N279j270N288K4680j9353l411k6262k2536J5809k6504p621K2287
12007B1628J9135j2357k0715M720K7148j8761k9683K437j93J918o011j0222L3619
$$ plain form
11994 12663 26851 46539 35329 -14671 -32541 10 17047 20973 35918 28622 13342 -174
11982 -174 26114 3514 -519 -6627 188 -59150 -71655 -18598 23054 34331 14665 -11018 19470
11969 19470 44580 28882 16100 -2347 -8854 -5403 19461 23334 -7296 -39130 -38018 -28805 -28795
11956 -28795 -38401 -38910 -28058 -38246 -70090 -34991 22032 37555 9036 27146 34473 32879 1734
11943 1734 -2138 6876 38320 32844 15201 -9252 17378 -9398 10754 68681 60781 19102 -19185
11930 -19185 -5261 18323 56117 36904 46331 51986 28453 11484 -267 28466 68227 87528
11918 87528 94120 123347 159533 167952 160172 181617 201615 236968 262644 274298 261756 226447
11906 226447 205902 210142 193165 195258 215584 247709 238848 224411 186837 145162 87436 71090
$$ packed form
11994A2663J4188J9688j1210n0000j7870L2551J7037L926J4945p296j5280j3516
11982a74K6288k2600m033o108O815n9338j2505N3057M1652J1277j9666k5683L0488
11969A9470K5110j5698j2782j8447o507L451K4864L873l0630l1834J112R213J0
11956b8795r606n09J0852j0188l1844L5099N7023J5523k8519J8110P327j594l1145
11943A734l872R014L1444n476j7643k4453K6630k6776K0152N7927p900m1679l8287
11930a9185J3924K3584L7794j9213R427N655k3533j6969j1751K8733L9761J9301
11918H7528O592K9227L6186Q419p780K1445J9998L5353K5676J1654j2542l5309
11906B26447k0545M240j6977K093K0326L2125q861j4437l7574m1675n7726j6346
$$ plain form
11894 71090 117592 114170 93151 106182 100495 93804 106793 131225 165790 242309 284966 299385
11882 299385 285479 282378 256647 217103 184934 159688 158626 178544 204277 221306 274751 277491
11870 277491 245727 229233 213611 180360 123811 76433 35427 23737 17131 15684 14735 11359
11858 11359 17146 24802 31824 30226 37041 -5028 -60982 -56588 -45684 -25517 -15888 -52908 -64617
11845 -64617 -62493 -41056 -28744 -48234 -25220 2830 -16642 2184 13568 -1840 22032 33249
11833 33249 -18236 -45200 -24173 2282 -15969 -19150 -30107 -29556 -50015 -36953 -5386 32732
11821 32732 50172 48056 40482 -23093 -56940 -70951 -80158 -54479 -36450 -16090 -28988 -30981
11809 -30981 -30571 -64574 -65666 -13046 21287 14333 1396 -31566 -43411 -20787 -11219 41756 42222
$$ packed form
11894G1090M6502l422k1019J3031n687o691J2989K4432L4565P6519M2657J4419
11882B99385j3906l101k5731l9544l2169k5246j062J9918K5733J7029N3445K740
11870B77491l1764j6494j5622l3251n6549m7378m1006j1690o606j447r49l376
11858A1359N787P656P022j598O815m2069n5954M394J0904K0167R629l7020j1709
11845f4617K124K1437J2312j9490K3014K8050j9472J8826J1384j5408K3872J1217
11833C3249n1485k6964K1027K6455j8251l181j0957N51k0459J3062L1567L8118
11821C2732J7440k116p574o3575l3847j4011r207K5679J8029K0360j2898j993
11809c0981M10l4003j092N2620L4333o954j2937l2962j1845K2624R568N2975M66
$$ plain form
11796 42222 36010 24734 19833 32079 50694 73358 83197 123481 115805 83215 59625 46465
11784 46465 28352 64479 102450 115201 169558 162499 142703 106146 98826 98953 74592 57421
11772 57421 47337 51507 45675 32703 36081 26831 31283 98314 92455 68979 57417 66497 53115
11759 53115 63122 78909 98914 80080 63268 38776 28271 29605 34073 44590 20907 -14606
11747 -14606 -7755 33864 69520 68398 48218 4293 20207 -3788 4129 -547 12270 21691 28134
11734 28134 44645 41510 18386 2762 2652 32542 25011 -7881 -24896 -51152 -55397 -45556 -11536
11721 -11536 8996 11402 23034 -3730 -46505 -66367 -38814 -47757 -59459 -873 14716 -5703
11709 -5703 8531 38351 30552 2473 -13003 4216 38058 21781 35615 49495 68620 72453
$$ packed form
11796D2222o212j1276m901J2246J8615K2664R839M0284p676l2590k3590j3160
11784D6465j8113L6127L7971J2751N4357p059j9796l6557p320J27k4361j7171
11772E7421j0084M170n832j2972L378r250M452O7031n859k3476j1562R080j3382
11759E3115J0007J5787K0005j8834j6812k4492j0505J334M468J0517k3683l5513
11747a4606O851M1619L5656j122k0180m3925J5914k3995P917m676J2817R421O443
11734B8134J6511l135k3124j5624j10K9890p531l2892j7015k6256m245R841L4020
11721a1536K0532K406J1632k6764m2775j9862K7553q943j1702N8586J5589k0419
11709e703J4234K9820p799k8079j5476J7219L3842j6277J3834J3880J9125L833
$$ plain form
11697 72453 36509 44259 44885 44724 91992 115180 126989 118592 93988 101295 86711 52699 23305
11684 23305 3879 -13476 -25123 -1035 26624 54826 56010 47161 16858 -779 -18214 9453
11672 9453 50879 42196 -3343 21910 28617 10139 2078 13642 22258 39018 51289 65725 114339
11659 114339 150960 168426 157396 139092 99425 127326 114219 107277 125516 111158 96476 101599
11647 101599 95155 77869 40106 47187 44905 79121 104638 94153 51522 24292 12497 5783
11635 5783 14797 53603 54068 40002 41541 36637 15015 46016 71061 91863 128589 164897 144839
11622 144839 62225 50349 62661 26412 15965 16380 -27420 -45764 -24354 -29695 -42229 -21162
11610 -21162 -14008 -5726 24754 20499 -4337 -25765 16937 13120 31225 54010 7522 -35143
$$ packed form
11697G2453l5944P750O26j61M7268K3188J1809q397k4604P307j4584l4012k9394
11684B3305j9426j7355j1647K4088K7659K8202J184q849l0303j7637j7435K7667
11672I453M1426q683m5539K5253O707j8478q061J1564Q616J6760J2271J4436M8614
11659A14339L6621J7466j1030j8304l9667K7901j3107o942J8239j4358j4682N123
11647A01599o444j7286l7763P081k282L4216K5517j0485m2631k7230j1795o714
11635E783R014L8806M65j4066J539m904k1622L1001K5045K0802L6726L6308k0058
11622A44839q2614j1876J2312l6249j0447M15m3800j8344K1410n341j2534K1067
11610b1162P154Q282L0480m255k4836k1428M2702l817J8105K2785m6488m2665
$$ plain form
11598 -35143 -29695 -43189 -90442 -99085 -66947 -46155 -28412 -4234 -2302 17410 15505 -26036
11586 -26036 -7786 2450 -22025 -40945 -22408 3822 -7036 -35899 -45359 3963 52006 47255
11574 47255 42224 27436 19150 25727 41377 56061 56703 66817 77902 83354 105199 94792 61756
11561 61756 32802 20383 49424 33118 15160 3234 10605 42942 42683 30390 24472 53060
11549 53060 68762 44916 66867 80799 28377 11446 37631 17984 4434 32275 54440 43891
11537 43891 1770 19387 23039 13633 14105 55180 33671 -17067 -31238 -22753 -32496 -30708 -44405
11524 -44405 -49116 -11123 22301 -4960 -43952 -43177 -53768 -51625 -46256 -53031 -15138 6771 -14407
11511 -14407 -11449 -166 20426 19267 524 24246 36814 -6427 -13437 11954 10679 15751 8240
$$ packed form
11598c5143N448j3494m7253q643L2138K0792J7743K4178J932J9712j905m1541
11586b6036J8250J0236k4475j8920J8537K6230j0858k8863r460M9322M8043m751
11574D7255n031j4788q286O577J5650J4684O42J0114J1085N452K1845j0407l3036
11561F1756k8954j2419K9041j6306j7958j1926P371L2337k59j2293n918K8588
11549E3060J5702k3846K1951J3932n2422j6931K6185j9647j3550K7841K2165j0549
11537D3891m2121J7617L652r406M72M1075k1509n0738j4171Q485r743J788j3697
11524d4405m711L7993L3424k7261l8992P75j0591K143N369o775L7893K1909k1178
11511a4407K958J1283K0592j159j8743K3722J2568m3241p010K5391j275N072p511
$$ plain form
11498 8240 32695 66656 62374 63432 57440 51582 72667 77405 73165 53349 44144 32876 -9306
11485 -9306 -43721 -38732 2685 26374 66395 105233 101238 111753 42687 -6301 -1618 5934 -3265
11472 -3265 -36637 -42013 5880 30815 37189 26550 36968 56134 105693 128570 139703 170281
11460 170281 178917 195852 205004 270794 332425 368715 381494 419802 493689 561849 615925 616950
11448 616950 627191 614224 565003 516679 500306 483159 482215 523170 550455 589132 632059 646305
11436 646305 666528 658386 687177 683916 626303 509068 398035 385113 417554 384930 335440
11425 335440 282840 266500 232289 210564 199005 171854 150502 173864 224509 294570 377256
11414 377256 455943 530491 594486 726680 861485 941222 1014784 1083491 1152368 1172961 1164902
$$ packed form
11498H240K4455L3961m282J058n992n858K1085M738m240j9816r205j1268m2182
11485i306l4415M989M1417K3689M0021L8838l995J0515o9066m8988M683P552r199
11472c265l3372n376M7893K4935O374j0639J0418J9166M9559K2877J1133L0578
11460A70281Q636J6935R152O5790O1631L6290J2779L8308P3887O8160N4076J025
11448F16950J0241j2967m9221m8324j6373j7147r44M0955K7285L8677M2927J4246
11436F46305K0223q142K8791l261n7613j17235j11033j2922L2441l2624m9490
11425C35440n2600j6340l4211k1725j1559k7151k1352K3362N0645P0061Q2686
11414C77256P8687P4548O3995J32194J34805P9737P3562O8707O8877K0593q059
$$ plain form
11403 1164902 1083010 1009488 926120 804481 714861 587880 469267 418801 353366 263316 261768
11392 261768 281137 310356 312181 253112 245733 283598 289899 242386 223482 178564 139035 95351
11380 95351 80057 116901 111586 76336 36855 41994 51592 43077 13190 -18297 24546 63611
11368 63611 40082 12917 29971 47760 51185 30310 15918 2212 523 42810 67676 71485
11356 71485 63272 100792 121071 101141 86064 63308 13406 2250 15002 45404 -973 -9487
11344 -9487 -1704 -6276 25000 54107 61427 75436 65622 72491 81768 77679 108276 125118 97510
11331 97510 112607 162729 155789 135809 99017 71279 88094 62256 47618 23617 46936 87739
11319 87739 75068 26606 8566 12923 18560 21986 -6983 -34367 3287 75319 99659 67853
$$ packed form
11403A164902q1892p3522q3368j21639q9620j26981j18613n0466o5435r0050j548
11392B61768J9369K9219J825n9069p379L7865O301m7513j8904m4918l9529m3684
11380I5351j5294L6844n315l5250l9481N139R598q515k9887l1487M2843L9065
11368F3611k3529k7165J7054J7789L425k0875j4392j3706j689M2287K4866L809
11356G1485q213L7520K0279j9930j5077k2756m9902j1156J2752L0402m6377q514
11344i487P783m572L1276K9107P320J4009r814O869R277m089L0597J6842k7608
11331I7510J5097N0122o940j9980l6792k7738J6815k5838j4638k4001K3319M0803
11319H7739j2671m8462j8040M357N637L426k8969k7384L7654P2032K4340l1806
$$ plain form
11307 67853 77722 113436 153401 176038 152745 122833 138552 179182 152139 89898 48643 65571
11295 65571 36755 -4295 -22344 -11800 10920 5226 32831 59108 46589 37620 -873 -8932
11283 -8932 -876 -11301 -4185 12347 17138 9816 10510 17235 15622 30584 29820 48654 92804 129231
11269 129231 152774 148113 115011 104328 98841 30270 -20223 -10918 -8218 -42662 -55724 -31687
11257 -31687 -33705 -34211 -5483 10256 1640 -23438 -29553 -15175 2513 35642 50521 50601 47921
11244 47921 67277 88737 111818 84767 100147 116504 103999 77562 43370 37578 17021 -11060
11232 -11060 -30948 -34432 -23032 2869 12403 47520 46883 52704 64381 32686 -4240 -34536 -5270
11219 -5270 2500 -1315 -4423 -18426 -24880 -32543 -38328 -51850 -36275 -58477 -71241 -36351 -36820
$$ packed form
11307F7853R869L5714L9965K2637k3293k9912J5719M0630k7043o2241m1255J6928
11295F5571k8816m1050j8049J0544K2720n694K7605K6277j2519q969l8493q059
11283h932Q056j0425P116J6532M791p322O94O725j613J4962p64J8834M4150L6427
11269A29231K3543m661l3102j0683n487o8571n0493R305K700l4444j3062K4037
11257c1687k018n06K8728J5739q616k5078o115J4378J7688L3129J4879Q0k680
11244D7921J9356K1460K3081k7051J5380J6357j2505k6437l4192n792k0557k8081
11232a1060j9888l484J1400K5901R534L5117o37N821J1677l1695l6926l0296K9266
11219e270P770l815l108j4003o454p663n785j3522J5575k2202j2764L4890m69
$$ plain form
11206 -36820 -34133 -31438 -11053 8698 -350 21334 -3721 -16487 -7534 -10676 609 -23971 -44802
11193 -44802 -60221 -55107 -17710 -6645 7813 17930 16349 -18427 -17861 -7225 12160 27928
11181 27928 64805 79945 64283 56921 47179 25848 3864 29865 40361 55475 57692 38422
11169 38422 88237 105656 87712 67320 49598 27655 47750 15463 3183 16622 36005 20353
11157 20353 10761 -8289 -18066 -8825 3997 16468 9390 42012 63002 83962 75869 44383 62467
11144 62467 47440 -6985 -39123 -42007 -35175 -56754 -70820 -94006 -114933 -57670 -12469 -12156
11132 -12156 -3488 9326 -2998 -6782 -25302 -45080 -46235 -18182 -2917 10572 29250 24852
11120 24852 37234 -3417 -8306 16043 -6040 -29604 -31756 -22149 -37361 -54142 -37795 -45206
$$ packed form
11206c6820K687K695K0385J9751r048K1684k5055j2766Q953l142J1285k4580k0831
11193d4802j5419N114L7397J1065J4458J0117j581l4776N66J0636J9385J5768
11181B7928L6877J5140j5662p362r742k1331k1984K6001J0496J5114K217j9270
11169C8422M9815J7419j7944k0392j7722k1943K0095l2287j2280J3439J9383j5652
11157B0353r592j9050r777R241J2822J2471p078L2622K0990K0960q093l1486J8084
11144F2467j5027n4425l2138k884O832k1579j4066k3186k0927N7263M5201L13
11132a2156Q668J2814j2324l784j8520j9778j155K8053J5265J3489J8678m398
11120B4852J2382m0651m889K4349k2083k3564k152R607j5212j6781J6347p411
$$ plain form
11108 -45206 -42220 -41293 -14608 13016 36106 25834 302 6353 38737 47902 31167 54465 42431
11095 42431 26962 -10095 3812 29813 37863 26339 -8121 -4700 28152 50858 13241 -6565
11083 -6565 -7677 11028 21588 11637 8907 22742 42827 25540 13860 47899 49925 43935 43413
11070 43413 27289 28869 5457 -13249 -31596 -15516 4252 -3893 1873 28526 13268 6235
11058 6235 -5468 54819 91587 43361 34915 74873 59385 63163 77796 31571 366 13829
11046 13829 -3111 -28612 -32466 -4758 8657 14727 54371 103148 109455 56618 18708 15979
11034 15979 -5018 5290 18599 19077 24564 20117 25855 58439 75193 49146 43405 36908 25023
11021 25023 46001 51611 73761 66014 47513 42055 37385 28617 21008 11771 21331 54832 28594
$$ packed form
11108d5206K986R27K6685K7624K3090j0272k5532O051L2384R165j6735K3298j2034
11095D2431j5469l7057J3907K6001Q050j1524l4460L421L2852K2706l7617j9806
11083f565j112J8705J0560r951k730J3835K0085j7287j1680L4039K026n990n22
11070D3413j6124J580k3412j8706j8347J6080J9768q145N766K6653j5258p033
11058F235j1703O0287L6768m8226q446L9958j5488L778J4633m6225l1205J3463
11046A3829j6940k5501l854K7708J3415O070L9644M8777O307n2837l7910k729
11034A5979k0997J0308J3309M78N487m447N738L2584J6754k6047n741o497j1885
11021B5023K0978N610K2150p747j8501n458m670q768p609r237R560L3501k6238
$$ plain form
11008 28594 34008 46257 63773 79140 73955 104056 99870 98572 88731 73394 103595 69667 60941
10995 60941 68273 81233 111080 114949 90754 94448 82511 76332 86921 63448 66189 67786 67014
10982 67014 58613 30334 19510 36323 31750 62080 69789 67520 106259 115529 87424 46894 67703
10969 67703 76838 86575 73724 51595 62165 71430 93925 96688 96550 104086 110485 116525 157883
10956 157883 126813 77691 52890 29302 31782 73464 96169 67432 37378 30647 40428 107875
10944 107875 95207 53598 50518 50598 12094 41222 78436 124600 122899 111856 124927 117491 104141
10931 104141 112429 139097 159591 85667 58524 79965 61706 107493 106561 99902 137127 153502
10919 153502 159829 180423 169388 145264 121233 94547 88166 95632 80497 86810 87262 85208 78255
$$ packed form
11008B8594N414J2249J7516J5367n185L0101m186j298r841j5337L0201l3928q726
10995F0941P332J2960K9847L869k4195L694j1937o179J0589k3473K741J597p72
10982F7014q401k8279j0824J6813m573L0330P709k269L8739R270k8105m0530K0809
10969F7703R135R737j2851k2129J0570R265K2495K763j38P536O399O040M1358
10956A57883l1070m9122k4801k3588K480M1682K2705k8737l0054o731R781O7447
10944A07875j2668m1609l080Q0l8504K9128L7214M6164j701j1043J3071p436j3350
10931A04141Q288K6668K0494p3924k7143K1441j8259M5787r32o659L7225J6375
10919A53502O327K0594j1035k4124k4031k6686o381P466j5135O313M52k054o953
$$ plain form
10906 78255 35359 17557 77710 107914 105453 88466 93335 112411 137797 148432 172771 158438
10894 158438 118026 118547 132581 132657 92838 63656 43608 37642 33170 39091 35206 62323 81247
10881 81247 87203 139640 177411 145438 115811 114879 86336 80159 124198 154070 152599 151310 103374
10868 103374 77482 108802 112627 106512 135544 142817 139461 175309 199836 204961 180823 169589
10856 169589 192963 215099 208664 202869 220723 232786 253331 289844 328651 363079 404263 459051
10844 459051 571872 714478 922781 1299729 1792634 2165543 2401186 2664692 3071967 3370091
10834 3370091 3217536 2868906 2560753 2378592 2063494 1599910 1190622 888922 678712
10825 678712 517890 434587 388725 352726 341220 292724 228448 236944 249522 211649 167344
$$ packed form
10906G8255m2896j7802O0153L0204k461j6987M869J9076K5386J0635K4339j4333
10894A58438m0412N21J4034P6l9819k9182k0048n966m472N921l885K7117J8924
10881H1247N956N2437L7771l1973k9627r32k8543o177M4039K9872j471j289m7936
10868A03374k5892L1320L825o115K9032P273l356L5848K4527N125k4138j1234
10856A69589K3374K2136o435n795J7854J2063K0545L6513L8807L4428M1184N4788
10844D59051J12821J42606K08303L76948M92905L72909K35643K63506M07275K98124
10834C370091j52555l48630l08153j82161l15098m63584m09288l01700k10210
10825F78712j60822q3303m5862l5999j1506m8496o4276Q496J2578l7873m4305
$$ plain form
10814 167344 172704 168924 140427 111162 88852 108634 152678 184741 198930 184012 128920 89470
10802 89470 76579 82523 110361 112066 111137 91521 90092 83637 84234 61474 33702 61974 68911
10789 68911 67818 11087 8055 40095 68340 72668 80405 75240 62761 89565 99271 97676 70899
10776 70899 46760 65689 77662 65712 58250 84650 110615 67617 72261 103636 113406 90986
10764 90986 28424 19507 14660 56142 104344 99385 117823 111236 76743 68351 45982 59362 70553
10751 70553 93344 118343 99820 77023 79144 81143 58743 67980 85747 78783 80895 87948 72787
10738 72787 50685 11142 3465 23210 50221 80974 79746 116493 126937 115581 185751 186027
10726 186027 163362 140408 91229 97750 112709 74576 38645 39624 14980 56682 70426 65618
$$ packed form
10814A67344N360l780k8497k9265k2310J9782M4044L2063J4189j4918n5092l9450
10802H9470j2891N944K7838J705r29j9616j429o455N97k2760k7772K8272O937
10789F8911j093n6731l032L2040K8245M328P737n165j2479K6804R706j595k6777
10776G0899k4139J8929J1973j1950p462K6400K5965m2998M644L1375R770k2420
10764I0986o2562q917m847M1482M8202m959J8438o587l4493q392k2369J3380J1191
10751G0553K2791K4999j8523k2797K121J999k2400R237J7767o964K112P053j5161
10738G2787k2102l9543p677J9745K7011L0753j228L6747J0444j1356P0170K76
10726A86027k2665k2954m9179O521J4959l8133l5931R79k4644M1702J3744m808
$$ plain form
10714 65618 76049 107667 87536 49873 72840 96850 75133 32121 29226 70437 100279 111045
10702 111045 154519 170432 151666 137448 162539 169640 176899 176030 188405 224833 229285 216339
10690 216339 235618 245675 288407 322376 315229 329789 330866 329389 348748 322274 306960 315717
10678 315717 271033 252596 259617 249270 237705 216613 213296 216828 208956 213277 233589 283878
10666 283878 294035 298594 314714 358983 437944 540514 711125 1003650 1491302 2122040 2587666
10655 2587666 2808253 3099631 3656840 4012369 3726474 3123664 2829051 2680999 2233663
10646 2233663 1603958 1064826 775289 596713 406932 269844 190767 172651 131261 100120
10636 100120 67019 79632 100401 113192 161946 172336 191355 176868 143117 151079 186024 201942
$$ packed form
10714F5618J0431L1618k0131l7663K2967K4010k1717m3012k895M1211K9842J0766
10702A11045M3474J5913j8766j4218K5091P101P259q69J2375L6428M452j2946
10690B16339J9279J0057M2732L3969p147J4560J077j477J9359k6474j5314Q757
10678C15717m4684j8437P021j0347j1565k1092l317L532p872M321K0312N0289
10666B83878J0157M559J6120M4269P8961J02570J70611K92525M87652O30738M65626
10655B587666K20587K91378N57209L55529k85895o02810k94613j48052m47336
10646B233663o29705n39132k89537j78576j89781j37088p9077j8116m1390l1141
10636A00120l3101J2613K0769J2791M8754J0390J9019j4487l3751P962L4945J5918
$$ plain form
10624 201942 209000 185238 130918 121935 144964 126492 101272 75018 39616 33007 57717 91029
10612 91029 104701 95804 149308 150688 163882 195723 226038 231464 212921 204839 205510 198337 192471
10599 192471 199429 221276 227387 267001 291849 237201 247487 288239 318263 313772 301882 315128
10587 315128 348773 342184 327456 316114 308320 245839 162912 143831 182214 162401 123270 124414
10575 124414 108057 114182 142245 147307 151748 183504 239183 339987 593954 841428 1025393
10564 1025393 1174354 1393699 1621911 1687160 1624089 1552159 1540358 1445015 1303291 1131310
10554 1131310 1029081 887199 751734 622091 578071 581307 568096 535157 522737 534071 568665
10543 568665 643218 659814 664919 674176 667576 676638 719013 678613 627220 606767 639482 682453
$$ packed form
10624B01942P058k3762n4320q983K3029j8472k5220k6254l5402o609K4710L3312
10612I1029J3672q897N3504J380J3194L1841L0315N426j8543q082O71p173n866
10599A92471O958K1847O111L9614K4848n4648J0286M0752L0024m491j1890J3246
10587C15128L3645o589j4728j1342p794o2481q2927j9081L8383j9813l9131J144
10575A24414j6357O125K8063N062M441L1756N5679J00804K53967K47474J83965
10564A025393J48961K19345K28212O5249o3071p1930j1801r5343j41724j71981
10554A131310j02229j41882j35465j29643m4020L236j3211l2939j2420J1334L4594
10543E68665P4553J6596N105R257o600R062M2375m0400n1393k0453L2715M2971
$$ plain form
10531 682453 688534 666427 655753 699832 765544 916867 1057927 1146230 1225378 1319288 1393724
10520 1393724 1366970 1294405 1266206 1261556 1173785 1074560 983097 958418 954491 931105 925937 982510
10508 982510 1021631 1062681 1045697 998966 966844 976596 1046481 1025880 967155 992636 995447 997126
10496 997126 981786 964275 973405 1004274 1019897 1060647 1170878 1291642 1389207 1488849 1602741
10485 1602741 1677138 1704633 1760751 1860099 1974956 2042210 2148883 2301109 2467807 2661786
10475 2661786 2850360 3068696 3280827 3512640 3760246 3974225 4205985 4461805 4760877
10466 4760877 5070048 5370073 5769401 6233155 6689315 7091664 7613354 8397693 9426051
10457 9426051 10534301 11593762 12866261 14722304 17156713 19461883 21449307 23569472
$$ packed form
10531F82453O081k2107j0674M4079O5712J51323J41060Q8303P9148R3910P4436
10520A393724k6754p2565k8199m650q7771r9225r1463k4679l927k3386n168N6573
10508I82510L9121M1050j6984m6731l2122R752O9885k0601n8725K5481K811J679
10496I97126j5340j7511R130L0869J5623M0750J10231J20764R7565R9642J13892
10485A602741P4397K7495N6118R9348J14857O7254J06673J52226J66698J93979
10475B661786J88574K18336K12131K31813K47606K13979K31760K55820K99072
10466D760877L09171L00025L99328M63754M56160M02349N21690P84339J028358
10457I426051J108250J059461J272499J856043K434409K305170J987424K120165
$$ plain form
10449 23569472 26407666 29736914 33103930 36674814 41184672 47854650 57752507 72284863
10441 72284863 94508688 130446239 188295118 274843755 364271970 412511695 443886897
10434 443886897 508000334 595034247 614563977 550952636 473372618 435910326 400193908
10427 400193908 326193035 236489936 164371583 118047780 89129003 70230060 57256184
10420 57256184 48020980 41275523 36032825 31704069 28239724 25360035 22832078 20744427
10412 20744427 19226394 17890527 16407123 15064403 14186011 13741372 13289670 12672414 11964127
10403 11964127 11543792 11513327 11247339 10501045 9560912 8832290 8201531 7371691 6495122
10394 6495122 5682681 5065641 4599270 4223754 3924803 3699474 3496476 3316526 3149460
$$ packed form
10449B3569472K838194L329248L367016L570884M509858O669978R897857J4532356
10441G2284863K2223825L5937551N7848879Q6548637Q9428215M8239725L1375202
10434D43886897O4113437Q7033913J9529730o3611341p7580018l7462292l5716418
10427D00193908p4000873q9703099p2118353m6323803k8918777j8898943j2973876
10420E7256184r235204o745457n242698m328756l464345k879689k527957k087651
10412B0744427j518033j335867j483404j342720q78392m44639m51702o17256p08287
10403A1964127m20335l0465k65988p46294r40133p28622o30759q29840q76569
10394F495122q12441o17040m66371l75516k98951k25329k02998j79950j67066
$$ plain form
10385 3149460 3002550 2814970 2669149 2564326 2501701 2479793 2431075 2367696 2330091 2278785
10375 2278785 2207948 2170418 2125060 2031888 1961065 1891594 1857837 1829717 1771201 1687401 1620522
10364 1620522 1571984 1524354 1480792 1420713 1341003 1337407 1380502 1408762 1433278 1465950 1489406
10353 1489406 1497403 1477539 1444494 1446527 1411737 1394158 1376745 1349206 1347076 1301898 1280846 1267038
10341 1267038 1237718 1167742 1139160 1153681 1172198 1148216 1085901 1038605 1017674 994303 924599
10330 924599 851285 865211 867782 824665 805675 827422 788212 754867 773477 802200 844643 870376
10318 870376 873977 874235 921653 944880 905688 884713 895605 887955 832604 787429 780301 829905
10306 829905 915211 917057 895512 913267 998465 1064906 1018272 1024488 1069740 1067095 1040947 1007988
$$ packed form
10385C149460j46910j87580j45821j04823o2625k1908m8718o3379l7605n1306
10375B278785p0837l7530m5358r3172p0823o9471l3757k8120n8516q3800o6879
10364A620522m8538m7630m3562o0079p9710l596M3095K8260K4516L2672K3456
10353A489406P997j9864l3045K033l4790j7579j7413k7539k130m5178k1052j3808
10341A267038k9320o9976k8582J4521J8517k3982o2315m7296k0931k3371o9704
10330I24599p3314J3926K571m3117j8990K1747l9210l3345J8610K8723M2443K5733
10318H70376L601K58M7418K3227l9192k0975J0892p650n5351m5175p128M9604
10306H29905Q5306J846k1545J7755Q5198O6441m6634O216M5252k645k6148l2959
$$ plain form
10294 1007988 925087 898581 896738 890009 879643 851962 786130 788907 826909 816850 769156 724167
10282 724167 700006 677588 722136 736937 730103 746210 759124 783471 796458 804500 792585 781934
10270 781934 773010 767663 782049 761630 765324 761581 751902 798755 807787 780192 742995 722857 716759
10257 716759 724034 728138 710744 739429 808194 875109 831702 794134 788043 810635 808033 781007
10245 781007 780166 817383 838028 833467 847237 844124 860480 902016 894407 873209 824897 799047
10233 799047 858477 920106 944024 997707 993529 956905 956733 982062 974422 997588 984093 959439
10221 959439 958085 953182 931484 937825 959537 968182 944869 927466 926006 955375 984996 1005408
10209 1005408 976325 982847 996273 1015483 1011609 1033255 1044055 1071623 1151485 1204346 1205563 1211490
$$ packed form
10294A007988q2901k6506j843o729j0366k7681o5832K777L8002j0059m7694m4989
10282G24167k4161k2418M4548J4801o834J6107J2914K4347J2987Q042j1915j0651
10270G81934q924n347J4386k0419L694l743r679M6853R032k7595l7197k0138o098
10257G16759P275M104j7394K8685O8765O6915m3407l7568o091K2592k602k7026
10245G81007q41L7217K0645m561J3770l113J6356M1536p609k1198m8312k5850
10233G99047N9430O1629K3918N3683m178l6624j72K5329p640K3166j3495k4654
10221I59439j354m903k1698O341K1712Q645k3313j7403j460K9369K9621K0412
10209A005408k9083O522J3426J9210l874K1646J0800K7568P9862N2861J217N927
$$ plain form
10197 1211490 1183180 1196750 1197493 1242546 1270300 1272473 1267154 1266659 1301056 1334871 1332329 1373323 1402930
10184 1402930 1428081 1439761 1459421 1472916 1519078 1563047 1562385 1599515 1669897 1723583 1776579 1842367
10172 1842367 1886771 1873958 1887573 1876281 1879102 1927312 1962291 1996842 2052617 2080954 2118653
10161 2118653 2111704 2132812 2197263 2255047 2281290 2331391 2410631 2495762 2554349 2600744 2667828
10150 2667828 2722113 2801760 2872569 2930001 2962823 2994323 3087019 3197373 3293496 3315795 3370578
10139 3370578 3495394 3589069 3645217 3737758 3841778 3957831 4094625 4261036 4393075 4553256
10129 4553256 4719586 4855431 5021128 5200960 5361645 5507672 5663749 5784437 5954653
10120 5954653 6139057 6344888 6565384 6778830 7011255 7285932 7539263 7750141 8023460
$$ packed form
10197A211490k8310J3570P43M5053K7754K173n319m95L4397L3815k542M0994K9607
10184A402930K5151J1680J9660J3495M6162M3969o62L7130P0382N3686N2996O5788
10172A842367M4404j2813J3615j1292K821M8210L4979L4551N5775K8337L7699
10161B118653o949K1108O4451N7784K6243N0101P9240Q5131N8587M6395O7084
10150B667828N4285P9647P0809N7432L2822L1500R2696J10354R6123K2299N4783
10139C370578J24816R3675N6148R2541J04020J16053J36794J66411J32039J60181
10129D553256J66330J35845J65697J79832J60685J46027J56077J20688J70216
10120E954653J84404K05831K20496K13446K32425K74677K53331K10878K73319
$$ plain form
10111 8023460 8330217 8602772 8926316 9239413 9576829 9959975 10337324 10702281 11071315
10102 11071315 11451846 11889389 12364987 12885068 13392223 13878399 14404630 14938980 15480973
10093 15480973 16090327 16726930 17344285 17991362 18663680 19342654 20029793 20784036 21489833
10084 21489833 22198783 22959221 23748552 24484905 25200167 25925368 26631100 27329557 27962968
10075 27962968 28573209 29091137 29572775 30049120 30484054 30839636 31107514 31301852 31463609
10066 31463609 31556304 31493374 31377322 31205955 30958217 30639132 30237950 29753495 29236192 28670035
10056 28670035 28043938 27366245 26710440 26000168 25292240 24593262 23859765 23168259 22459675
10047 22459675 21744552 21069458 20422958 19727482 19063730 18426150 17833880 17249847 16639834
$$ packed form
10111H023460L06757K72555L23544L13097L37416L83146L77349L64957L69034
10102A1071315L80531M37543M75598N20081N07155M86176N26231N34350N41993
10093A5480973O09354O36603O17355O47077O72318O78974O87139P54243P05797
10084B1489833P08950P60438P89331P36353P15262P25201P05732O98457O33411
10075B7962968O10241N17928M81638M76345M34934L55582K67878J94338J61757
10066C1463609R2695o2930j16052j71367k47738l19085m01182m84455n17303n66157
10056B8670035o26097o77693o55805p10272p07928o98978p33497o91506p08584
10047B2459675p15123o75094o46500o95476o63752o37580n92270n84033o10013
$$ plain form
10038 16639834 16081559 15602271 15133510 14686846 14276253 13946670 13643059 13497008 13516165
10029 13516165 13545902 13429861 13269302 13273121 13368422 13126472 12501066 11799924 11307244 10802104
10019 10802104 10138598 9387979 8755527 8281274 7912501 7550802 7224672 6947429 6758738
10010 6758738 6616502 6456045 6320449 6126310 5924004 5743572 5539146 5378158 5237145
10001 5237145 5097323 4958336 4846414 4764731 4661047 4563852 4453888 4329584 4276434 4216139
9991 4216139 4098977 3973678 3804574 3667055 3576874 3503880 3453701 3372888 3320390 3290860 3231135
9980 3231135 3186891 3110201 3044046 2992918 2917317 2866566 2828165 2791250 2743138 2702891 2654496
9969 2654496 2573301 2504981 2419766 2371038 2334555 2316761 2300210 2249684 2224546 2227893 2192921 2149561
$$ packed form
10038A6639834n58275m79288m68761m46664m10593l29583l03611j46051J9157
10029A3516165K9737j16041j60559L819R5301k41950o25406p01142m92680n05140
10019A0802104o63506p50619o32452m74253l68773l61699l26130k77243j88691
10010F758738j42236j60457j35596j94139k02306j80432k04426j60988j41013
10001E237145j39822j38987j11922q1683j03684r7195j09964j24304n3150o0295
9991D216139j17162j25299j69104j37519r0181p2994n0179q0813n2498k9530n9725
9980C231135m4244p6690o6155n1128p5601n0751l8401l6915m8112m0247m8395
9969B654496q1195o8320q5215m8728l6483j7794j6551n0526k5138L347l4972m3360
$$ plain form
9957 2149561 2089256 2060865 2040738 1999223 1941926 1886526 1854614 1820352 1801892 1776170 1757336
9946 1757336 1702341 1658521 1587883 1539842 1565276 1570941 1546972 1533419 1498209 1478698 1472461 1413164
9934 1413164 1394653 1382238 1367257 1347703 1335976 1310339 1335488 1305168 1259907 1258603 1269043 1272444
9922 1272444 1280740 1272297 1264302 1214966 1191663 1163011 1146462 1136942 1163475 1158894 1167849 1118367 1072184
9909 1072184 1102497 1086883 1071613 1088599 1073311 982627 956922 973521 996281 999992 968423 924747
9897 924747 934075 950296 958902 958424 978728 1024686 1004254 995835 965435 939010 908612 872170 864431
9884 864431 864670 864934 881914 918003 962997 919524 846145 804630 827233 887472 901727 900818 861359
9871 861359 863508 836677 843871 835771 825921 833539 808369 785945 761493 758595 768053 816743 785928
$$ packed form
9957B149561o0305k8391k0127m1515n7297n5400l1912l4262j8460k5722j8834
9946A757336n4995m3820p0638m8041K5434N665k3969j3553l5210j9511o237n9297
9934A413164j8511j2415j4981j9554j1727k5637K5149l0320m5261j304J0440L401
9922A272444Q296q443p995m9336k3303k8652j6549r520K6533m581Q955m9482m6183
9909A072184L0313j5614j5270J6986j5288r0684k5705J6599K2760L711l1569m3676
9897I24747R328J6221Q606m78K0304M5958k0432q419l0400k6425l0398l6442p739
9884H64431K39K64J6980L6089M4994m3473p3379m1515K2603O0239J4255r09l9459
9871H61359K149k6831P194q100r850P618k5170k2424k4452k898R458M8690l0815
$$ plain form
9858 785928 723919 714304 735669 721434 690104 699655 698800 729757 762746 750428 721874 743367
9846 743367 792597 806465 788207 798860 841253 868257 841495 817017 880180 969752 1126112
9835 1126112 1381452 1845345 2504139 3009851 2984879 2467978 1820107 1350879 1087506 948252
9825 948252 815296 715980 652870 636867 643860 668415 637431 650088 653269 662625 661012 642646
9813 642646 627903 594663 570746 575430 566410 580691 617068 618931 603062 596991 578176 536995
9801 536995 547445 597141 572046 553860 550866 522603 522013 516772 513214 514858 516926 494905 473958
9788 473958 497933 509406 518882 518014 481829 456087 465848 446041 419216 421195 439683 470868 524827
9775 524827 528955 493014 494859 493046 480301 497503 510344 513464 507310 502167 479169 452239 443263
$$ packed form
9858G85928o2009r615K1365j4235l1330R551q55L0957L2989j2318k8554K1493
9846G43367M9230J3868j8258J0653M2393K7004k6762k4478O3163Q9572J56360
9835A126112K55340M63893O58794N05712k4972n16901o47871m69228k63373j39254
9825I48252j32956r9316o3110j6003O993K4555l0984J2657L181R356j613j8366
9813F42646j4743l3240k3917M684r020J4281L6377J863j5869o071j8815m1181
9801E36995J0450M9696k5095j8186k994k8263n90n241l558J644K068k2021k0947
9788D73958K3975J1473R476q68l6185k5742R761j9807k6825J979J8488L1185N3959
9775E24827M128l5941J845j813j2745J7202J2841L120o154n143k2998k6930q976
$$ plain form
9762 443263 471149 521545 503119 478210 472268 489480 509067 499317 503408 481106 445993 436831
9750 436831 475153 493812 495679 492503 491547 466430 482657 497134 498760 489220 468003 460752 434511
9737 434511 421305 407776 403097 401004 412827 393278 359747 352813 386216 428181 399426 377240
9725 377240 414090 457467 469299 436030 410331 384149 379519 402009 437080 430301 445303 442643
9713 442643 446559 457391 498394 531323 523374 541452 532205 502750 463671 453678 474998 482539 435017
9700 435017 413530 417596 410005 400104 416118 420395 405426 420144 426489 448286 460500 439630 464937
9687 464937 451827 400868 391539 399240 415063 436683 462872 427989 439907 451228 452093 426790
9675 426790 388146 418735 435568 412601 413823 370900 346259 352520 411535 451381 486009 505228
$$ packed form
9762D43263K7886N0396j8426k4909n942J7212J9587r750M091k2302l5113r162
9750D36831L8322J8659J867l176r56k5117J6227J4477J626r540k1217p251k6241
9737D34511j3206j3529m679k093J1823j9549l3531o934L3403M1965k8755k2186
9725C77240L6850M3377J1832l3269k5699k6182m630K2490L5071o779J5002k660
9713D42643L916J0832M1003L2929p949J8078r247k9455l9079r993K1320P541m7522
9700D35017k1487M066p591r901J6014M277j4969J4718O345K1797J2214k0870K5307
9687D64937j3110n0959r329P701J5823K1620K6189l4883J1918J1321Q65k5303
9675D26790l8644L0589J6833k2967J222m2923k4641O261N9015L9846L4628J9219
$$ plain form
9663 505228 527132 541796 507551 484276 480978 473779 452445 431424 466476 504390 479689 471006
9651 471006 486241 473550 461799 504585 496236 457163 463218 467065 519969 524796 521054 513318 492047
9638 492047 467109 456780 468873 474533 457648 452225 458270 485658 482785 467354 481902 475906 488175
9625 488175 509729 517763 535565 498582 466959 452623 454934 454164 471954 475088 507040 502226 489967
9612 489967 486196 510390 568838 542764 503897 473094 477065 481712 511961 495740 477503 452030
9600 452030 491862 539618 559762 600515 663841 698928 683459 680214 705869 734648 721731 709287
9588 709287 634191 605740 599721 622948 643263 626220 626770 623644 612596 592028 616783 641526
9576 641526 640842 641485 629236 600497 589003 596627 565899 603379 641988 673661 669007 635515 628765
$$ packed form
9663E05228K1904J4664l4245k3275l298p199k1334k1021L5052L7914k4701q683
9651D71006J5235j2691j1751M2786q349l9073O055L847N2904M827l742p736k1271
9638D92047k4938j0329J2093N660j6885n423O045K7388k873j5431J4548n996J2269
9625D88175K1554Q034J7802l6983l1623j4336K311p70J7790L134L1952m814j2259
9612D89967l771K4194N8448k6074l8867l0803L971M647L0249j6221j8237k5473
9600D52030L9832M7756K0144M0753O3326L5087j5469l245K5655K8779j2917j2444
9588G09287p5096k8451o019K3227K0315j7043N50l126j1048k0568K4755K4743
9576F41526o84O43j2249k8739j1494P624l0728L7480L8609L1673m654l3492o750
$$ plain form
9563 628765 597312 583085 615649 619559 594495 611703 619833 620032 650474 687295 734730 703375
9551 703375 680082 700785 718829 730766 731851 751513 775972 777165 759812 760912 764114 758753 745058
9538 745058 748236 736709 729368 745265 811278 833508 834541 843041 826521 786481 760693 746525
9526 746525 756446 786032 819053 879223 916334 929979 932024 916889 891301 917044 945361 945288 954350
9513 954350 959676 971677 969404 956497 957012 968256 966418 982468 996613 1015070 984236 959991 967755
9500 967755 998305 1061014 1067764 1021170 1014184 1016104 1023905 1061440 1096657 1088130 1086310 1110668 1111237
9487 1111237 1109957 1135314 1156286 1194500 1221754 1221816 1230939 1244843 1263722 1229645 1231021 1245494 1266635
9474 1266635 1293454 1338610 1352697 1390112 1372724 1361079 1398015 1377192 1413146 1434835 1424029
$$ packed form
9563F28765l1453j4227L2564L910k5064J7208Q130J99L0442L6821M7435l1355
9551G03375k3293K0703J8044J1937J085J9662K4459J193j7353J100L202n361j3695
9538G45058L178j1527p341J5897O6013K2230J033Q500j6520m0040k5788j4168
9526G46525R921K9586L3021O0170L7111J3645K045j5135k5588K5743K8317p3R062
9513I54350N326J2001k273j2907N15J1244j838J6050J4145J8457l0834k4245P764
9500I67755L0550O2709O750m6594o986J920P801L7535L5217q527j820K4358N69
9487A111237j280K5357K0972L8214K7254O2R123J3904J8879l4077J376J4473K1141
9474A266635K6819M5156J4087L7415j7388j1645L6936k0823L5954K1689j0806
$$ plain form
9463 1424029 1417439 1413583 1422537 1452341 1496334 1529478 1548526 1518463 1491781 1519490 1563808 1606444
9451 1606444 1620661 1595476 1642562 1654953 1649233 1670814 1747973 1768384 1756140 1734780 1742242 1779800
9439 1779800 1769080 1736383 1758134 1812380 1855030 1845499 1825881 1833277 1863250 1845500 1835393 1805129
9427 1805129 1787158 1799569 1787800 1789395 1804235 1801010 1765725 1751036 1736552 1766096 1776394 1748509
9415 1748509 1755681 1756189 1763798 1768374 1782245 1768016 1739341 1726350 1686561 1653323 1649344 1650860 1667028
9402 1667028 1659314 1637784 1648033 1629978 1590558 1587378 1570438 1547683 1544432 1505904 1480019 1470937
9390 1470937 1418240 1399532 1383260 1378813 1371098 1378166 1369034 1361674 1341020 1327134 1304957 1233171
9378 1233171 1221218 1236974 1224300 1239793 1201875 1194980 1173184 1152637 1124970 1133625 1133512 1103717
$$ packed form
9463A424029o590l856Q954K9804M3993L3144J9048l0063k6682K7709M4318M2636
9451A606444J4217k5185M7086J2391n720K1581P7159K0411j2244k1360P462L7558
9439A779800j0720l2697K1751N4246M2650r531j9618P396K9973j7750j0107l0264
9427A805129j7971J2411j1769J595J4840l225l5285j4689j4484K9544J0298k7885
9415A748509P172N08P609M576J3871j4229k8675j2991l9789l3238l979J516J6168
9402A667028p714k1530J0249j8055l9420l180j6940k2755l251l8528k5885r082
9390A470937n2697j8708j6272m447p715P068r132p360k0654j3886k2177p1786
9378A233171j1953J5756j2674J5493l7918o895k1796k0547k7667Q655j13k9795
$$ plain form
9366 1103717 1096579 1109953 1100554 1066965 1050384 1018639 985547 968593 963909 944992 920991 911445
9354 911445 897591 868751 853968 847603 834998 831113 883183 869553 825749 828694 844161 817807
9342 817807 820969 810905 802402 790052 773717 760848 700847 650200 659129 632459 619976 592098
9330 592098 597988 595967 584287 573441 567933 559486 548909 550790 538151 562807 535993 518478 502105
9317 502105 496491 488468 499060 491576 475217 454457 454500 503648 512799 517476 489203 447604 435251
9304 435251 413947 392894 391113 378928 357347 390628 403420 448271 439973 396740 391264 385463
9292 385463 371906 354431 355982 362530 409889 428180 399272 391717 386205 356988 344643 337084 328404
9279 328404 323617 317035 325157 325352 297131 289570 305968 282061 246543 244598 264630 279018 260369
$$ packed form
9366A103717p138J3374r399l3589j6581l1745l3092j6954m684j8917k4001r546
9354I11445j3854k8840j4783o365j2605l885N2070j3630m3804K945J5467k6354
9342H17807L162j0064q503j2350j6335j2869o0001n0647Q929k6670j2483k7878
9330E92098N890k021j1680j0846n508q447j0577J881j2639K4656k6814j7515j6373
9317E02105n614q023J0592p484j6359k0760M3M9148R151M677k8273m1599j2353
9304D35251k1304k1053j781j2185k1581L3281J2792M4851q298m3233n476n801
9292C85463j3557j7475J551O548M7359J8291k8908p555n512k9217j2345p559q680
9279C28404m787o582Q122J95k8221p561J6398k3907l5518j945K0032J4388j8649
$$ plain form
9266 260369 218206 220804 222035 243660 256875 241140 223606 269547 261555 228799 239514 282286
9254 282286 287986 300430 317546 328754 361648 333348 280865 291877 267432 272487 272948 256920
9242 256920 261194 253921 241050 214308 182551 190688 191816 178570 177006 194542 221420 222775 228012
9229 228012 228034 240790 246646 226814 192990 169262 133692 132160 117903 130409 158307 153652 152414
9216 152414 157213 164956 173590 207895 219017 190136 144222 144241 148769 192090 201339 174605 173177
9203 173177 205232 197533 186612 185511 194360 184824 148554 148306 173081 195349 223393 207235 174024
9190 174024 146312 119015 146871 159511 135069 62034 67305 122301 165780 150400 147599 139161
9178 139161 125800 131734 146001 135534 108623 129114 116043 134273 120778 100026 85017 96519
$$ packed form
9266B60369m2163K598J231K1625J3215j5735j7534M5941p992l2756J0715M2772
9254B82286N700J2444J7116J1208L2894k8300n2483J1012k4445N055M61j6028
9242B56920M274p273j2871k6742l1757Q137J128j3246j564J7536K6878J355N237
9229B28012K2J2756N856j9832l3824k3728l5570j532j4257J2506K7898m655j238
9216A52414M799P743Q634L4305J1122k8881m5914J9M528M3321R249k6734j428
9203A73177L2055p699j0921j101Q849r536l6270k48K4775K2268K8044j6158l3211
9190A74024k7712k7297K7856J2640k4442p3035N271N4996M3479j5380k801q438
9178A39161j3361N934J4267j0467k6911K0491j3071J8230j3495k0752j5009J1502
$$ plain form
9166 96519 123931 127846 121404 117700 108571 67706 63222 76620 60643 74365 116768 123047 83413
9153 83413 85540 114987 164154 168226 148637 125524 111960 107340 134386 116574 70726 79296 92987
9140 92987 107509 144365 145222 105894 79805 88356 63357 74182 77963 83595 94969 89485 55752
9127 55752 41179 40250 53474 55441 56122 65878 100705 134217 132629 137802 118693 99396 87006
9114 87006 55315 52808 62583 61095 48985 46259 65560 85779 104400 88829 87616 107306 84386
9101 84386 89606 125009 129257 127076 135931 138975 112421 94133 93596 86641 77424 101745 113466 62611
9087 62611 24793 26319 47518 37722 70725 84105 102339 77669 42176 48162 89193 101265
9075 101265 71929 55648 51216 48415 52677 79804 119112 123320 78204 70971 86014 105687 101677
$$ packed form
9166I6519K7412L915o442l704r129m0865m484J3398j5977J3722M2403O279l9634
9153H3413K127K9447M9167M072j9589k3113j3564m620K7046j7812m5848Q570J3691
9140I2987J4522L6856Q57l9328k6089Q551k4999J0825L781N632J1374n484l3733
9127E5752j4573r29J3224J967O81R756L4827L3512j588N173j9109j9297j2390
9114H7006l1691k507R775j488j2110k726J9301K0219J8621j5571j213J9690k2920
9101H4386N220L5403M248k181Q855L044k6554j8288n37o955r217K4321J1721n0855
9087F2611l7818J526K1199r796L3003J3380J8234k4670l5493N986M1031J2072
9075A01265k9336j6281m432k801M262K7127L9308M208m5116p233J5043J9673m010
$$ plain form
9062 101677 78259 59926 53508 97872 79926 77524 99487 102215 41172 22288 18859 39417
9050 39417 72798 71298 61782 104213 111462 88098 43570 45295 49143 35849 34138 50804 60551
9037 60551 44565 41261 39843 54079 45042 707 26158 23689 10797 61369 85653 54968 32831
9024 32831 58877 62672 42526 45892 41502 73930 86001 106546 114012 134009 129752 145431 121474
9011 121474 75037 49554 19549 3639 21936 29009 11930 -11115 11701 51003 75619 68077
8999 68077 57909 39588 56017 94767 101873 125318 145600 114572 135125 153940 152164 134940
8987 134940 139197 122863 49554 5146 2460 41610 84685 114051 138943 163498 165694 146547
8975 146547 96590 59118 88946 152926 185299 177528 192736 149796 106757 113467 89555 72755
$$ packed form
9062A01677k3418j8333o418M4364j7946k402K1963K728o1043j8884l429K0558
9050C9417L3381j500r516M2431P249k3364m4528J725L848j3294j711J6666R747
9037F0551j5986l304j418J4236r037m4335K5451k469j2892N0572K4284l0685k2137
9024C2831K6046L795k0146L366m390L2428J2071K0545P466J9997m257J5679k3957
9011A21474m6437k5483l0005j5910J8297P073j7079k3045K2816L9302K4616p542
8999F8077j0168j8321J6429L8750P106K3445K0282l1028K0553J8815j776j7224
8987A34940M257j6334p3309m4408k686L9150M3075K9366K4892K4555K196j9147
8975A46547m9957l7472K9828O3980L2373p771J5208m2940m3039O710k3912j6800
$$ plain form
8963 72755 68036 66776 51553 55041 79515 94469 78933 33832 12332 66073 85693 41672
8951 41672 921 -43036 -71367 -33236 -3430 52053 74400 57570 24177 5441 -16558 -99
8939 -99 17868 58312 69513 26519 17955 31661 29979 24918 55178 101691 69777 29907 21673
8926 21673 -24968 -57919 -30958 5387 21598 36569 72125 83203 96156 88989 57980 17610
8914 17610 21028 70555 105657 94970 92340 73214 48744 33613 42421 42920 40441 79517 113836
8901 113836 102132 97797 78083 72897 65200 47696 92680 128089 87167 61904 39030 29996
8889 29996 40554 31627 45152 17959 -7371 18990 72175 83981 65991 104740 109734 99616
8877 99616 81371 74000 72142 94334 114758 110573 89111 42152 1319 -14596 -5699 26593 52088
$$ packed form
8963G2755m719j260j5223L488K4474J4954j5536m5101k1500N3741J9620m4021
8951D1672m0751m3957k8331L8131K9806N5483K2347j6830l3393j8736k1999J6459
8939i9J7967M0444J1201m2994q564J3706j682n061L0260M6513l1914l9870q234
8926B1673m6641l2951K6961L6345J6211J4971L5556J1078J2953p167l1009m0370
8914A7610L418M9527L5102j0687k630j9126k4470j5131Q808M99k479L9076L4319
8901A13836j1704m335j9714n186p697j7504M4984L5409m0922k5263k2874r034
8889B9996J0558q927J3525k7193k5330K6361N3185J1806j7990L8749M994j0118
8877I9616j8245p371j858K2192K0424m185k1462m6959m0833j5915Q897L2292K5495
$$ plain form
8864 52088 66363 29298 62775 122532 124211 119084 80922 93493 125340 133363 124933 96260 94119
8851 94119 94628 76164 90039 82960 87257 98608 88378 76563 80916 60496 50411 57671 66081
8838 66081 51720 50860 59738 54196 75040 54556 27535 10690 14684 -25578 -49624 6260 91859
8825 91859 114572 85125 46235 76406 98159 104567 90137 57592 33481 53566 87093 62777
8813 62777 88375 84346 52025 58679 19422 17891 35622 52356 28622 28575 21882 -2115 -7698
8800 -7698 27574 45404 71371 73570 71756 76524 19832 31511 33858 55668 74273 64047 46138
8787 46138 69891 108861 88664 60937 125500 135355 95261 67272 82185 61598 69501 64127
8775 64127 28491 30704 58167 60568 105228 135357 139541 99422 50592 52996 67369 32110 -2482
$$ packed form
8864E2088J4275l7065L3477N9757J679n127l8162J2571L1847Q023q430k8673k141
8851I4119N09j8464J3875p079M297J1351j0230j1815M353k0420j0085P260Q410
8838F6081j4361q60Q878n542K0844k0484k7021j6845L994m0262k4046N5884Q5599
8825I1859K2713k9447l8890L0171K1753O408j4430l2545k4111K0085L3527k4316
8813F2777K5598m029l2321O654l9257j531J7731J6734k3734m7o693k3997n583
8800g698L5272J7830K5967K199j814M768n6692J1679K347K1810J8605j0226j7909
8787D6138K3753L8970k0197k7727O4563R855m0094k7989J4913k0587P903n374
8775F4127l5636K213K7463K401M4660L0129M184m0119m8830K404J4373l5259l4592
$$ plain form
8762 -2482 28056 12641 16022 42144 53622 29489 -4061 -15825 6482 60913 104880 155336
8750 155336 181590 189713 164459 124122 111729 105025 103829 116044 97760 66768 53580 122896
8738 122896 138423 150185 124300 79409 98820 84669 114466 155424 173083 154829 140015 120227
8726 120227 71468 118659 142505 140503 133199 127564 150338 162312 155630 156168 107734 104394 115719
8713 115719 117354 163359 179424 188961 153055 159100 183175 198021 201116 201466 185830 172395 189110
8700 189110 209861 238775 206920 192968 222930 219334 192173 180854 190081 200609 186532 173140
8688 173140 194458 185268 180415 185438 191906 240863 234596 252800 237318 232426 205828 168764 204998
8675 204998 206233 184407 186817 243819 280900 263338 278763 252171 226424 228872 229050 239193 275795
$$ packed form
8762b482L0538j5415L381K6122J1478k4133l3550j1764K2307N4431M3967N0456
8750A55336K6254Q123k5254m0337j2393o704j196J2215j8284l0992j3188O9316
8738A22896J5527J1762k5885m4891J9411j4151K9797M0958J7659j8254j4814j9788
8726A20227m8759M7191K3846k002p304n635K2774J1974o682N38m8434l340J1325
8713A15719J635M6005J6065R537l5906O045K4075J4846L095L50j5636j3435J6715
8700A89110K0751K8914l1855j3952K9962l596k7161j1319R227J0528j4077j3392
8688A73140K1318r190m853N023O468M8957o267J8204j5482m892k6598l7064L6234
8675B04998J235k1826K410N7002L7081j7562J5425k6592k5747K448J78J0143L6602
$$ plain form
8662 275795 312020 314740 298629 309207 323873 326070 299470 299646 292390 284386 293142 289339 248114
8649 248114 255894 244378 254403 266448 320689 345657 328124 371202 389379 410265 407064 461496
8637 461496 595371 768449 977946 1000667 875257 687855 533130 461193 451806 402649 408493
8626 408493 411151 375756 369960 392917 394684 366335 338710 405367 465187 487660 465998 488255
8614 488255 532143 572594 579581 565734 594395 624147 613003 644686 686842 726780 748092 747581
8602 747581 790858 838301 893607 963709 1007371 1065694 1181412 1269020 1426868 1645844 1947395
8591 1947395 2350053 2874432 3156511 3081852 2852204 2606585 2404718 2208192 1942753 1641530
8581 1641530 1376179 1199190 1031977 893807 747110 648819 566101 541583 552311 496117
$$ packed form
8662B75795L6225K720j6111J0578J4666K197k6600J76p256q004Q756l803m1225
8649B48114P780j1516J0025J2045N4241K4968j7533M3078J8177K0886l201N4432
8637D61496J33875J73078K09497K2721j25410j87402j54725p1937r387m9157N844
8626D08493K658l5395n796K2957J767k8349k7625O6657N9820K2473k1662K2257
8614D88255M3888M0451O987j3847K8661K9752j1144L1683M2156L9938K1312n11
8602G47581M3277M7443N5306P0102M3662N8323J15718Q7608J57848K18976L01551
8591A947395M02658N24379K82079p4659k29648k45619k01867j96526k65439l01223
8581A641530k65351j76989j67213j38170j46697r8291q2718k4518J0728n6194
$$ plain form
8571 496117 458221 448974 417580 428711 457786 521676 524055 453139 388099 363320 333876 298581
8559 298581 311176 321488 323888 324644 326579 335946 291536 313852 342081 336615 354280 406081 495385
8546 495385 671585 888654 1003388 975334 829081 637293 514962 458545 372254 298425
8536 298425 246424 199823 180754 194712 202249 213868 179943 172945 198586 194761 198486 189817 151899
8523 151899 126613 136282 146306 142479 164614 216765 238785 218188 225952 234511 239169 238045 233013
8510 233013 259658 279908 214066 197071 202432 242946 326714 360234 381845 399687 440019 487093
8498 487093 563297 712342 873227 1086405 1201759 1135901 961533 747074 578968 452460
8488 452460 369610 316529 276062 250790 257362 261832 232002 184802 171039 173216 189670 199253
$$ packed form
8571D96117l7896r247l1394J1131K9075O3890K379p0916o5040k4779k9444l5295
8559B98581J2595J0312K400P56J935R367m4410K2316K8229n466J7665N1801Q9304
8546D95385J76200K17069J14734k8054j46253j91788j22331n6417q6291p3829
8536B98425n2001m6601j9069J3958P537J1619l3925o998K5641l825L725q669l7918
8523A51899k5286R669J0024l827K2135N2151K2020k0597P764Q559M658j124n032
8510B33013K6645K0250o5842j6995N361M0514Q3768L3520K1611J7842M0332M7074
8498D87093P6204J49045J60885K13178J15354o5858j74368k14459j68106j26508
8488D52460q2850n3081m0467k5272O572M470k9830m7200j3763K177J6454R583
$$ plain form
8476 199253 181954 175869 183850 186280 194553 157529 134729 114897 167688 188993 177239 165464
8464 165464 153468 143591 200713 226381 240838 265685 279423 320136 410325 516057 666349
8453 666349 865662 1108216 1230691 1182416 1082453 982522 863346 702378 557884 476304
8443 476304 411033 324093 292362 248002 216041 168690 143203 140725 153653 117502 102583 96359
8431 96359 99680 103175 97255 148142 139263 147694 135047 120587 85188 102473 123088 132070 110304
8418 110304 100576 106462 103947 117467 119177 85824 47012 71733 108256 157573 202744 287665
8406 287665 364763 388650 405165 366060 280580 188936 117765 103630 85361 87661 118977 112718
8394 112718 86714 66374 89973 129073 134791 132839 102426 110583 121101 142386 139057 177889
$$ packed form
8476A99253j7299o085P981K430Q273l7024k2800j9832N2791K1305j1754j1775
8464A65464j1996r877N7122K5668J4457K4847J3738M0713R0189J05732J50292
8453F66349J99313K42554J22475m8275r9963r9931j19176j60968j44494q1580
8443D76304o5271q6940l1731m4360l1961m7351k5487k478J2928l6151j4919o224
8431I6359L321L495n920N0887q879Q431j2647j4460l5399J7285K0615Q982k1766
8418A10304r728N886k515J3520J710l3353l8812K4721L6523M9317M5171Q4921
8406B87665P7098K3887J6515l9105q5480r1644p1171j4135j8269K300L1316o259
8394A12718k6004k0340K3599L9100N718j952l0413Q157J0518K1285l329L8832
$$ plain form
8382 177889 148462 127648 141986 105206 73093 92768 130075 145302 111567 112404 111905 95087
8370 95087 96408 77459 49415 34555 56624 64840 43300 67038 80841 84576 51137 30295
8358 30295 7756 -1385 8593 17990 49932 72465 72490 78954 88089 68853 65370 108355 127749 124374
8344 124374 108697 112531 124334 116791 102199 96587 81773 57134 21933 25215 17035 14589 26719
8331 26719 63853 83508 102212 90802 54891 37678 21286 48290 68989 128494 100412 98297
8319 98297 108159 88026 86418 111360 125425 94422 49763 57376 62380 69151 60905 21978 -7796
8306 -7796 17726 20667 37648 53235 51062 67935 88215 75827 40315 17559 21366 38380 59833
8293 59833 76658 100303 106796 56414 42354 52393 53655 45801 57867 64581 101424 93932 62447
$$ packed form
8382A77889k9427k0814J4338l6780l2113J9675L7307J5227l3735Q37m99j6818
8370I5087J321j8949k8044j4860K2069Q216k1540K3738J3803L735l3439k0842
8358C0295k2539r141R978R397L1942K2533K5O464R135j9236l483M2985J9394l375
8344A24374j5677L834J1803p543j4592n612j4814k4639l5201L282q180k446J2130
8331B6719L7134J9655J8704j1410l5911j7213j6392K7004K0699N9505k8082k115
8319I8297R862k0133j608K4942J4065l1003m4659P613N004O771q246l8927k9774
8306g796K5522K941J6981J5587k173J6873K0280j2388l5512k2756L807J7014K1453
8293E9833J6825K3645O493n0382j4060J0039J262p854J2066O714L6843p492l1485
$$ plain form
8280 62447 68294 83932 111982 114540 93087 106446 103808 90861 80544 38022 47798 56160 57330
8267 57330 56593 56321 80936 77301 66597 82031 51667 36991 56315 112316 124209 61564 43288
8254 43288 44152 46071 49587 89007 83929 51784 69682 65131 41817 3637 13052 49949 81139
8241 81139 103049 122275 86427 67235 37631 47114 52669 68130 32314 19668 53747 47521
8229 47521 64422 53243 37083 43177 64871 61443 31238 23794 27239 23759 45599 66106 60633
8216 60633 72976 44695 26581 5431 -22037 -6811 -13476 -17692 2590 39753 1557 2207 8557
8203 8557 -24564 -23148 15982 45089 59313 79705 87415 64343 73828 51705 41471 47969 60357
8190 60357 39369 22774 72299 64231 80115 61766 77092 68870 72282 79728 154446 202914 218753
$$ packed form
8280F2447N847J5638K8050K558k1453J3359k638j2947j0317m2522R776Q362J170
8267E7330p37k72K4615l635j0704J5434l0364j4676J9324N6001J1893o2645j8276
8254D3288Q64J919L516L9420n078l2145J7898m551k3314l8180R415L6897L1190
8241H1139K1910J9226l5848j9192k9604R483N555J5461l5816j2646L4079o226
8229D7521J6901j1179j6160O094K1694l428l0205p444L445l480K1840K0507n473
8216F0633J2343k8281j8114k1150k7468J5226o665m216K0282L7163l8196O50O350
8203H557l3121J416L9130K9107J4224K0392P710k3072R485k2123j0234O498J2388
8190F0357k0988j6595M9525q068J5884j8349J5326q222L412P446P4718M8468J5839
$$ plain form
8177 218753 241243 204921 172029 160605 158072 140383 129163 115525 108770 85417 73643 79310
8165 79310 80061 66107 75712 81013 59753 53752 49243 -7766 -37404 -40346 -35006 -44208 -32528 16358
8151 16358 18745 22304 59411 49555 49204 63691 80266 100975 101908 93819 101504 134872 166977 209917
8137 209917 209895 226052 210639 146500 103165 86371 95487 76404 32455 39065 21122 3063 22452
8124 22452 87863 87733 71125 61498 76913 68916 78208 79818 98704 110417 90781 96911 84562
8111 84562 62888 57069 45710 58942 95326 84922 54858 52958 35464 28309 53121 64827
8099 64827 98131 58801 1960 -11479 981 27159 46793 21252 -15407 -27120 21860 46309
8087 46309 47609 24653 4251 11950 16943 26486 64227 99657 90201 82461 52153 49130 81526
$$ packed form
8177B18753K2490l6322l2892j1424k533j7689j1220j3638o755k3353j1774N667
8165G9310P51j3954R605N301k1260o001m509n7009k9638k942N340r202J1680M8886
8151A6358K387L559L7107r856l51J4487J6575K0709R33q089P685L3368L2105M2940
8137B09917k2J6157j5413o4139m3335j6794R116j9083m3949O610j7943j8059J9389
8124B2452O5411j30j6608r627J5415p997R292J610J8886J1713j9636O130j2349
8111H4562k1674n819j1359J3232L6384j0404l0064j900j7494p155K4812J1706
8099F4827L3304l9330n6841j3439J2460K6178J9634k5541l6659j1713M8980K4449
8087D6309J300k2956k0402P699M993R543L7741L5430r456p740l0308l023L2396
$$ plain form
8074 81526 76795 67438 56337 28414 29945 25763 979 6090 13436 70500 103765 134609 131954
8061 131954 140512 124327 117848 146424 163620 163759 110678 105262 123059 133249 83467 71589 102815
8048 102815 110747 71010 87311 87903 68160 71610 79941 129211 160636 145006 128000 125264 174931
8035 174931 138946 94525 77198 127320 136292 160132 161202 158196 188195 195530 199928 183227 182086
8022 182086 179730 179363 217368 168214 152871 172176 170054 167054 160647 188466 207577 185032 140804
8009 140804 167019 210331 223070 215105 192537 199118 169308 158518 117282 87851 76284 99947
7997 99947 173569 227399 262714 314515 352925 345993 339716 317217 287684 263608 236755 234232
7985 234232 212389 174627 181449 204090 227708 228982 213042 210644 208179 188654 177691 178597 168268
$$ packed form
8074H1526m731r357j1101k7923J531m182k4784N111P346N7064L3265L0844k655
8061A31954Q558j6185o479K8576J7196J39n3081n416J7797J0190m9782j1878L1226
8048A02815P932l9737J6301N92j9743L450Q331M9270L1425j5630j7006k736M9667
8035A74931l5985m4421j7327N0122Q972K3840J070l006K9999P335M398j6701j141
8022A82086k356l67L8005m9154j5343J9305k122l000o407K7819J9111k2545m4228
8009A40804K6215M3312J2739p965k2568O581k9810j0790m1236k9431j1567K3663
7997I9947P3622N3830L5315N1801L8410o932o277k2499k9533k4076k6853k523
7985B34232k1843l7762O822K2641K3618J274j5940k398k465j9525j0963R06j0329
$$ plain form
7972 168268 163662 155501 125573 119577 146121 186711 204395 211615 192615 194270 184180 187096 176163
7959 176163 178380 213704 186739 196730 241775 246604 245760 267290 326601 303088 263175 232421 244130
7946 244130 228980 221785 261617 246660 184929 188020 180374 180076 136069 117694 134374 141682 105397
7933 105397 33231 7457 30261 65794 49272 57035 73911 74303 89522 82758 132695 131752 120652
7920 120652 122495 132225 131016 154691 143824 115977 90489 101626 145361 172204 193671 216009
7908 216009 206329 126526 109113 85978 59549 106332 171086 160466 115101 124901 100557 73139
7896 73139 72396 58717 85959 107636 137593 121345 91342 52996 48520 40188 33830 50789 31714
7883 31714 15348 33367 35442 66982 71621 58076 29054 45892 45952 48576 105344 116028 118033
$$ packed form
7972A68268m606q161k9928n996K6544M0590J7684P220j9000J655j0090K916j0933
7959A76163K217L5324k6965R991M5045M829q44K1530N9311k3513l9913l0754J1709
7946B44130j5150p195L9832j4957o1731L091p646k98m4007j8375J6680P308l6285
7933A05397p2166k5774K2804L5533j6522P763J6876L92J5219o764M9937r43j1100
7920A20652J843R730j209K3675j0867k7847k5488J1137M3735K6843K1467K2338
7908B16009r680p9803j7413k3135k6429M6783O4754j0620m5365R800k4344k7418
7896G3139p43j3679K7242K1677K9957j6248l0003l8346m476q332o358J6959j9075
7883C1714j6366J8019K075L1540M639j3545k9022J6838O0K624N6768J0684K005
$$ plain form
7870 118033 53550 46569 19832 41930 53283 28828 10512 -5816 37681 44664 -12666 -15845
7858 -15845 31886 41025 41318 41154 75123 60595 32520 37062 49886 4450 -11104 25377 22586
7845 22586 23157 42139 51394 53716 62202 52552 55140 50666 58198 78250 79788 99894 70313 11447
7831 11447 8768 56521 62268 49658 10296 12981 25976 38630 18840 29477 47671 56346 14641
7818 14641 -13586 -41427 -34871 -19474 5697 39343 41147 36034 -8937 -42488 -16311 -5058
7806 -5058 -23745 -19352 -13305 -17633 20926 37820 -8293 5320 35630 36938 24473 34137 16479
7793 16479 40058 23317 1980 29500 57384 23457 8986 45803 59261 39235 13522 5968
7781 5968 21296 18382 28057 25680 -2383 6408 -29495 -28921 9748 -7765 -40762 -53109 -68855
$$ packed form
7870A18033o4483o981k6737K2098J1353k4455j8316j6328M3497O983n7330l179
7858a5845M7731R139K93j64L3969j4528k8075M542J2824m5436j5554L6481k791
7845B2586N71J8982R255K322Q486r650K588m474P532K0052J538K0106k9581n8866
7831A1447k679M7753N747j2610l9362K685J2995J2654j9790J0637J8194Q675m1705
7818A4641k8227k7841O556J5397K5171L3646J804n113m4971l3551K6177J1253
7806e058j8687M393O047m328L8559J6894m6113J3613L0310J308j2465R664j7658
7793A6479K3579j6741k1337K7520K7884l3927j4471L6817J3458k0026k5713p554
7781E968J5328k914R675k377k8063Q791l5903N74L8669j7513l2997j2347j5746
$$ plain form
7768 -68855 -70276 -35891 -29741 -9249 11228 3989 -20025 -26829 -24965 -12211 5933 -35931 -59141
7755 -59141 -21995 -23966 -21949 -38619 -31954 -33062 4925 -8375 -17509 -31417 -27044 16635 42030
7742 42030 52802 53737 31422 36128 54539 71070 8739 -6908 11354 11692 -35109 -38294 -23483
7729 -23483 8062 21676 -9595 -17910 13214 23850 -14081 13974 65617 78117 67748 65778
7717 65778 39171 17047 13379 6769 -16361 -41207 -38058 8139 -17417 -30642 -48965 -24127
7705 -24127 -22085 12602 26116 4631 16724 -2440 12018 16483 664 -20776 -49183 -47052
7693 -47052 -66904 -84378 -47308 -40884 -49925 -39127 -48945 -61401 -58852 -40879 1665 27088 16709
7680 16709 -26251 6276 49179 35034 47726 13863 -7985 -7511 -25440 -530 -2546 -38741
$$ packed form
7768f8855j421L4385O150K0492K0477p239k4014o804J864J2754J8144m1864k3210
7755e9141L7146j971K017j6670O665j108L7987j3300r134j3908M373M3679K5395
7742D2030J0772R35k2315M706J8411J6531o2331j5647J8262L38m6801l185J4811
7729b3483L1545J3614l1271q315L1124J0636l7931K8055N1643J2500j0369j970
7717F5778k6607k2124l668o610k3130k4846L149M6197k5556j3225j8323K4838
7705b4127K042L4687J3514k1485J2093j9164J4458M465j5819k1440k8407K131
7693d7052j9852j7474L7070O424r041J0798r818j2456K549J7973M2544K5423j0379
7680A6709m2960L2527M2903j4145J2692l3863k1848M74j7929K4910k016l6195
$$ plain form
7668 -38741 -36336 -38368 -39466 -14580 -17218 -20606 -25086 -9569 -1115 -9186 -33929 -42122 -10398 7488
7654 7488 -10389 -35741 -31160 -42667 -9806 7430 13750 -31960 -90049 -85695 -46917 -4932 11027
7641 11027 14083 1989 11102 1763 9678 -8519 -34039 -47309 -69733 -95109 -77874 -61974 -41838
7628 -41838 -9036 3491 2657 -5356 -10290 -13510 -13080 -29073 -45206 -49084 -46728 -23948 4862 -24882
7614 -24882 268 18474 21157 9287 -17670 -35341 -46721 -25216 -34180 -42643 -41966 -29680 -25130
7601 -25130 -23062 -31164 -73494 -79723 -70782 -44393 15331 29415 24283 -1804 -16984 15955 33742
7588 33742 -13361 -33097 -53448 -24602 30706 11639 -23778 10723 20259 -29454 -26662 -38408
7576 -38408 -42037 -5005 -3496 -25475 -44659 -21408 -2637 9524 -6379 -23706 -20650 -3350
$$ packed form
7668c8741K405k032j098K4886k638l388m480J5517Q454q071k4743q193L1724J7886
7654G488j7877k5352M581j1507L2861J7236O320m5710n8089M354L8778M1985J5959
7641A1027L056j2094R113r339P915j8197k5520j3270k2424k5376J7235J5900K0136
7628d1838L2802J2527q34q013m934l220M30j5993j6133l878K356K2780K8810k9744
7614b4882K5150J8206K683j1870k6957j7671j1380K1505q964q463O77J2286M550
7601b5130K068q102m2330o229Q941K6389N9724J4084n132k6087j5180L2939J7787
7588C3742m7103j9736k0351K8846N5308j9067l5417L4501R536m9713K792j1746
7576c8408l629L7032J509k1979j9184K3251J8771J2161j5903j7327L056J7300
$$ plain form
7564 -3350 -555 -21673 -13982 -9691 -13429 -11030 5436 -10134 5169 -22193 -39454 -38529 -46915 -29790
7550 -29790 -39388 -15611 48744 25069 43319 47209 46168 -5125 -6365 -19762 -55943 -45130 -3478
7537 -3478 -12938 -12462 -5000 -33230 -78049 -92548 -65367 -18700 -23880 -2636 6986 -6249 18940
7524 18940 47925 17571 10070 -34417 -27738 -50479 -66354 -70310 -95535 -78019 -33718 -33313 -71855
7511 -71855 -46431 -36082 -27932 -57811 -56779 -24494 -19930 1786 14666 38038 54942 24645
7499 24645 3246 -11034 -10386 -15592 -56639 -70854 -89499 -81786 -49206 -26603 12819 23387 27138
7486 27138 7653 -6898 14492 14280 18435 -51511 -58616 -37118 25123 49928 32900 4023 -12326
7473 -12326 -9013 -4777 -5666 -6689 25126 49734 38289 33745 15184 34253 18634 -20059 -51848
$$ packed form
7564c350K795k1118P691M291l738K399J6466j5570J5303k7362j7261R25q386J7125
7550b9790r598K3777O4355k3675J8250L890j041n1293j240j3397l6181J0813M1652
7537c478r460M76P462k8230m4819j4499K7181M6667n180K1244R622j3235K5189
7524A8940K8985l0354p501m4487O679k2741j5875l956k5225J7516M4301M05l8542
7511g1855K5424J0349Q150k9879J032L2285M564K1716J2880K3372J6904l0297
7499B4645k1399j4280O48n206m1047j4215j8645P713L2580K2603L9422J0568L751
7486B7138j9485j4551K1390k12M155o9946p105K1498O2241K4805j7028k8877j6349
7473a2326L313M236q89j023L1815K4608j1445m544j8561J9069j5619l8693l1789
$$ plain form
7460 -51848 -49732 -52109 -66439 -53636 -39726 -68703 -75519 -30376 -26940 -34505 -37348 -27092 3831
7447 3831 38252 44051 -4872 -36105 -66259 -72595 -72827 -35421 -37050 -65932 -50523 -7145 26478
7434 26478 27417 5573 -16379 -5958 20160 28109 17861 -22399 -12078 -789 -30523 -49700
7422 -49700 -33855 -50973 -72379 -55919 -42917 -36729 -19454 -21273 13050 5637 -10581 14478
7410 14478 21950 32438 45798 51078 18319 -17688 -47266 5200 15999 16091 10101 49924 86150
7397 86150 33065 -25602 -21158 18395 -34 -46606 -66533 -62728 -41810 -28728 -18627 -45646
7385 -45646 -49793 -78448 -49406 -30580 -41486 -45376 -56919 -67770 -48077 -18321 -20679 28286
7373 28286 16364 26685 34174 -28651 -21721 -11349 -17004 -3549 -4652 -13543 -18284 -12808 -14908
$$ packed form
7460e1848K116k377j4330J2803J3910k8977o816M5143L436p565k843J0256L0923
7447C831L4421N799m8923l1233l0154o336k32L7406j629k8882J5409M3378L3623
7434B6478R39k1844k1952J0421K6118P949j0248m0260J0321J1289k9734j9177
7422d9700J5845j7118k1406J6460J3002O188J7275j819L4323p413j6218K5059
7410A4478P472J0488J3360N280l2759l6007k9578N2466J0799R2n990L9823L6226
7397H6150n3085n8667M444L9553j8429m6572j9927L805K0918J3082J0101k7019
7385d5646m147k8655K9042J8826j0906l890j1543j0851J9693K9756k358M8965
7373B8286j1922J0321P489o2825O930J0372n655J3455j103q891m741N476k100
$$ plain form
7360 -14908 5255 -33983 -32889 -5004 6224 26895 -1338 6353 22720 18361 -25781 -68178
7348 -68178 -87852 -81146 -39208 -6872 -5677 -26659 -30519 -33503 -39537 -62059 -48047 -21433 -42440
7335 -42440 -30963 -14591 -32011 -12244 -16766 -24290 -50079 -52614 -9288 23687 12265 -20733
7323 -20733 -50339 -25459 -6588 -40748 -32059 -59904 -68834 -30379 -7228 -29513 -24931 31952
7311 31952 41331 29972 38253 59077 70237 36247 29814 42106 33548 4242 -27795 -16289 -16960
7298 -16960 -38480 -31241 -9323 -6686 -27381 -37039 -71559 -71245 -83133 -66082 -21607 -14513 -8440
7285 -8440 3485 -7350 -19000 -20293 13697 30113 16250 7113 9222 11308 -9659 -26024 -13637
7272 -13637 -15004 -32831 -34530 -65036 -58191 -38457 -35209 -63086 -59574 -59527 -38961 -20441 -12345 -40130
$$ packed form
7360a4908K0163l9238J094K7885J1228K0671k8233P691J6367m359m4142m2397
7348f8178j9674O706M1938L2336J195k0982l860k984o034k2522J4012K6614k1007
7335d2440J1477J6372j7420J9767m522p524k5789k535M3326L2975j1422l2998
7323b0733k9606K4880J8871l4160Q689k7845q930L8455K3151k2285M582N6883
7311C1952R379j1359Q281K0824J1160l3990o433J2292q558k9306l2037J1506o71
7298a6960k1520P239K1918K637k0695r658l4520L14j1888J7051M4475P094O073
7285h440J1925j0835j1650j293L3990J6416j3863r137K109K086k0967j6365J2387
7272a3637j367j7827j699l0506O845J9734L248k7877L512M7K0566J8520Q096k7785
$$ plain form
7258 -40130 -2809 5403 -40500 -47513 -55771 -53124 -27841 12311 19099 -21094 -9409 3686 13154
7245 13154 9225 4459 3371 1754 -23659 -52078 -21731 -5772 -21158 -19731 5251 -5585 -1064
7232 -1064 26574 39825 54859 41064 55355 69418 46451 8100 -6554 16063 4315 -10932
7220 -10932 -20639 -23541 -28091 -38093 -19573 -21157 -51568 -59443 -26891 -1898 -23530 -29594 -7736
7207 -7736 3630 -9962 -26592 -12459 23868 41930 42861 52588 37513 10446 -40147 -37246 21527
7194 21527 -1057 -55343 -44211 -34363 -47162 -47959 -11856 -4657 9307 3191 -15958 -46728 -46088
7181 -46088 -26416 -13935 -23374 -40195 -45050 -20331 -31533 -16383 -15606 -24657 -41622 -22537 -28365
7168 -28365 -42668 -14084 -33063 -32220 -20065 -51939 -74888 -76071 -53486 -22665 -20002 3222 15523
$$ packed form
7258d0130L7321Q212m5903p013q258K647K5283M0152O788m0193J1685J3095R468
7245A3154l929m766j088j617k5413k8419L0347J5959j5386J427K4982j0836M521
7232a064K7638J3251J5034j3795J4291J4063k2967l8351j4654K2617j1748j5247
7220a0932r707k902m550j0002J8520j584l0411p875L2552K4993k1632o064K1858
7207g736J1366j3592j6630J4133L6327J8062R31R727j5075k7067n0593K901N8773
7194B1527k2584n4286J1132R848j2799p97L6103P199J3964o116j9149l0770O40
7181d6088J9672J2481r439j6821m855K4719j1202J5150P77r051j6965J9085n828
7168b8365j4303K8584j8979Q43J2155l1874k2949j183K2585L0821K663K3224J2301
$$ plain form
7155 15523 -10536 -22933 6213 32663 42548 -3249 -23985 -6913 9539 -9918 -55316 -57403
7143 -57403 -46776 -72429 -66485 -59202 -34664 11365 64224 91337 76441 49661 5294 -15659
7131 -15659 -3671 -14271 -29105 -33901 -30384 -32230 -16831 -11140 -22882 -24459 -32413 -25351 -22443
7118 -22443 -20558 -20571 -26111 -32617 -29768 -11491 256 -23531 -42761 -60285 -87798 -85059 -52092
7105 -52092 -5447 40280 11094 -6543 -30423 -77351 -70676 -29742 -26179 -14242 -11953 -32609
7093 -32609 -38708 -33571 -35909 -28060 32 -30981 -38355 -16339 -8261 -29244 -13401 -972 38696
7080 38696 40791 6515 -68715 -59543 -40025 -45337 -18940 2366 12578 -32919 -55991 -7824
7068 -7824 8522 -10896 20335 35548 20011 34895 21754 -45278 -69584 -29759 518 2180
$$ packed form
7155A5523k6059j2397K9146K6450R885m5797k0736J7072J6452j9457m5398k087
7143e7403J0627k5653N944P283K4538M6029N2859K7113j4896k6780m4367k0953
7131a5659J1988j0600j4834m796L517j846J5399N691j1742j577p954P062K908
7118b2443J885j3n540o506K849J8277J1747k3787j9230j7524k7513K739L2967
7105e2092M6645M5727k9186j7637k3880m6928O675M0934L563J1937K289k0656
7093c2609o099N137k338P849K8092l1013p374K2016Q078k0983J5843J2429L9668
7080C8696K095l4276p5230R172J9518n312K6397K1306J0212m5497k3072M8167
7068g824J6346j9418L1231J5213j5537J4884j3141o7032k4306L9825L0277J662
$$ plain form
7056 2180 -4744 -20240 -8499 -1775 4571 -6783 -5425 13947 16043 -22302 5628 18375 18006
7043 18006 27541 37870 67058 63156 20557 3876 30352 6285 5466 10190 1510 -3066 21086
7030 21086 6144 -33538 -29782 -34344 -49327 -46074 -37657 -5417 -12351 -27108 3238 -2378 -18612
7017 -18612 -36587 -14991 26753 36463 25946 -16227 9977 19801 -18797 -45902 -10636 4851
7005 4851 33999 46954 16531 14116 22929 -18321 -41432 -14355 -6404 -12235 -42799 -38190 -29421
6992 -29421 -30510 -37995 -73378 -67766 -58292 -16096 4872 9482 14957 -28941 927 7269 30254
6979 30254 32367 -10049 -58623 -59183 -66709 -59210 -42878 -45421 -64041 -46263 -30891 -50695 -66217
6966 -66217 -65662 -67493 -83635 -25311 21042 15909 12337 -10667 -6543 -5971 -34171 -46577 -13267
$$ packed form
7056B180o924j5496J1741O724O346j1354J358J9372K096l8345K7930J2747l69
7043A8006R535J0329K9188l902m2599j6681K6476k4067q19M724q680m576K4152
7030B1086j4942l9682L756m562j4983L253Q417L2240o934j4757L0346n616j6234
7017a8612j7975K1596M1744R710j0517m2173K6204R824l8598k7105L5266J5487
7005D851K9148J2955l0423k415Q813m1250k3111K7077P951n831l0564M609Q769
6992b9421j089p485l5383N612R474M2196K0968M610N475m3898K9868O342K2985
6979C0254K113m2416m8574n60p526P499J6332k543j8620J7778J5372j9804j5522
6966f6217N55j831j6142N8324M6353n133l572k3004M124N72k8200j2406L3310
$$ plain form
6953 -13267 -1082 -9838 -32285 -33539 -27274 -47109 -80426 -68769 -62963 -59145 -13256 13549 -31855
6940 -31855 7640 25877 13208 9277 -33004 -48536 -18352 -30458 -42490 -25109 3894 22230
6928 22230 -7672 -52183 -56657 -39217 -32469 -49991 -68715 -63188 -23323 -21033 -23839 -29044 -15967
6915 -15967 -3882 17563 51255 38989 25551 12712 5979 -2222 -8736 -11143 -11732 -4120 -4363 -44079
6901 -44079 -57453 -44070 -28071 6767 8483 8095 5975 16389 28362 32184 31446 1499 -22985
6888 -22985 -27691 -47093 -49437 -44518 -18571 -2424 -10360 -45935 -64523 -34154 -31766 -27776 8516
6875 8516 26682 52164 42443 46140 2150 -5900 18271 22492 -6413 -20034 -29799 3539 6982
6862 6982 -13263 26005 38224 17761 -21263 -41352 -39583 -24859 -1730 14512 23382 28174 115
$$ packed form
6953a3267J2185q756k2447j254O265j9835l3317J1657N806L818M5889K6805m5404
6940c1855L9495J8237j2669l931m2281j5532L0184j2106j2032J7381K9003J8336
6928B2230k9902m4511m474J7440O748j7522j8724N527L9865K290k806n205J3077
6915a5967J2085K1445L3692j2266j3438j2839o733q201o514k407n89P612k43l9716
6901d4079j3374J3383J5999L4838J716l88k120J0414J1973L822p38k9947k4484
6888b2985m706j9402k344M919K5947J6147p936l5575j8588L0369K388L990L6292
6875H516J8166K5482r721L697m3990q050K4171M221k8905j3621r765L3338L443
6862F982k0245L9268J2219k0463l9024k0089J769J4724K3129J6242Q870M792k8059
$$ plain form
6849 115 -49719 -57433 -21889 -1720 -18692 -30510 -51422 -56913 -47991 -51926 -66944 -67921 -28860
6836 -28860 -23934 -29653 -62888 -54183 -50200 -61342 -48944 -44212 -45976 -47510 -49103 -40690 -38643 -33803
6822 -33803 -9718 -27546 26507 66046 80384 54001 20706 -2376 6385 7832 -18368 -23813
6810 -23813 5240 1879 13948 36829 28101 5642 -37856 -17816 2305 45905 34420 -16708
6798 -16708 -28084 -18526 -16802 -5151 10015 38577 42491 -10846 -10018 -35548 -45448 -70186 -37645
6785 -37645 -42779 -66129 -18688 28439 30690 -13743 -50847 -35312 11521 427 -31685 -13959
6773 -13959 4937 21716 33905 11095 7844 -24570 -4991 7041 -29673 -45973 -59010 -41220
6761 -41220 -30172 -43350 -55709 -57010 -21784 -5137 17284 34984 37877 56286 62141 59554 36872
$$ packed form
6849A15m9834p714L5544K0169j6972j1818k0912n491Q922l935j5018r77L9061
6836b8860M926n719l3235Q705L983j1142J2398M732j764j534j593Q413K047M840
6822c3803K4085j7828N4053L9539J4338k6383l3295k3082Q761J447k6200n445
6810b3813K9053l361J2069K2881q728k2459m3498K0040K0121M3600j1485n1128
6798a6708j1376R558J724J1651J5166K8562L914n3337Q28k5530r900k4738L2541
6785c7645n134k3350M7441M7127K251m4433l7104J5535M6833j1094l2112J7726
6773a3959J8896J6779J2189k2810l251l2414J9579J2032l6714j6300j3037J7790
6761d1220J1048j3178j2359j301L5226J6647K2421J7700K893J8409N855k587k2682
$$ plain form
6748 36872 60971 29852 5496 14360 -10744 -15338 -8483 43238 67080 40248 2630 18202
6736 18202 14429 5926 51825 61318 70749 68546 61201 54862 27334 43646 85925 101329 125553
6723 125553 133325 189819 264887 329850 525728 797717 1071586 1170557 961231 663224 461110
6712 461110 318415 209870 151644 111531 68580 70262 60873 28634 -486 43184 61988 52172
6700 52172 65355 69218 59265 25100 -3203 2562 22818 31292 -14449 -23095 -5408 23794 30923
6687 30923 42680 21148 -7595 12619 4020 -16243 -23042 -19622 -19304 -8637 10269 35661 8314
6674 8314 -27963 -47750 -34376 -18161 -34616 -34256 -32710 -22869 -20772 -46472 -55569 -46808 -32729
6661 -32729 -17297 -13306 -31030 -39358 -12993 -41980 -71762 -49135 -66970 -103892 -80253 -51368
$$ packed form
6748C6872K4099l1119k4356Q864k5104m594O855N1721K3842k6832l7618J5572
6736A8202l773q503M5899R493R431k203p345o339k7528J6312M2279J5404K4224
6723A25553P772N6494P5068O4963J95878K71989K73869R8971k09326k98007k02114
6712D61110j42695j08545n8226m0113m2951J682r389l2239k9120M3670J8804r816
6700E2172J3183L863r953l4165k8303N765K0256Q474m5741q646J7687K9202P129
6687C0923J1757k1532k8743K0214q599k0263o799L420L18J0667J8906K5392k7347
6674H314l6277j9787J3374J6215j6455L60J546R841K097k5700r097Q761J4079
6661c2729J5432L991j7724q328K6365k8987k9782K2627j7835l6922K3639K8885
$$ plain form
6649 -51368 -55112 -37535 -18225 -22392 -19330 1388 15779 34604 30735 11030 11955 7550 -21069
6636 -21069 -21936 -30543 -14778 -17010 -8940 9076 -18730 -449 17098 31056 55165 45424 11623
6623 11623 30325 19942 11507 -16099 673 18018 14450 55497 89761 80284 7719 -430 22201
6610 22201 35471 48583 32407 883 -34605 -21074 -41177 -42809 -33614 -22112 -45089 -25589
6598 -25589 -7854 1188 -42891 -70403 -62799 -46749 -44776 -33386 -3817 48526 24760 -15756
6586 -15756 -15206 -12598 -8972 27124 19290 -16686 -53884 -43048 -26988 -56100 -57410 -24089 -31514
6573 -31514 -28713 35758 40938 1711 -22583 -31062 -34555 -14559 12984 -11577 -35749 -32595 -18234
6560 -18234 -12925 -10429 -23321 1679 43125 -4093 -57795 -54305 -39004 -23614 -19822 35268 31036
$$ packed form
6649e1368l744J7577J9310m167L062K0718J4391J8825l869j9705R25m405k8619
6636b1069q67q607J5765k232Q070J8016k7806J8281J7547J3958K4109r741l3801
6623A1623J8702j0383q435k7606J6772J7345l568M1047L4264r477p2565q149K2631
6610B2201J3270J3112j6176l1524l5488J3531k0103j632R195J1502k2977J9500
6598b5589J7735R042m4079k7512P604J6050J973J1390K9569N2343k3766m0516
6586a5756N50K608L626L6096p834l5976l7198J0836J6060k9112j310L3321p425
6573c1514K801O4471N180l9227k4294q479l493J9996K7543k4561k4172L154J4361
6560a8234N309K496j2892K5000M1446m7218n3702L490J5301J5390L792N5090m232
$$ plain form
6547 31036 -20113 -40420 -20677 -11413 33072 55070 57203 18986 20155 -8533 -27147 -32786 -40400
6534 -40400 -48501 -30598 -51436 -76166 -36745 9617 67154 97166 94541 72829 47211 14250
6522 14250 -6455 5883 -26636 -67726 -35828 -20134 -12946 15911 190 -50419 -41324 -30957
6510 -30957 22667 14544 -13702 -30014 -4416 5841 -23721 -46611 -64665 -34185 -20231 26012
6498 26012 78009 75824 61691 61858 79639 26821 -1062 -18817 -26594 11223 24447 -10273 -22074
6485 -22074 -8407 -26511 -27846 -2156 -8067 -34251 -32139 1736 38304 20311 -23765 -5768
6473 -5768 2390 -2741 4706 373 25808 40155 13464 -232 19016 60533 54607 -5565 -19973
6460 -19973 -17357 -59780 -51541 -22843 -18193 -55010 -12286 12668 32529 -1395 -38566 429
$$ packed form
6547C1036n1149k0307J9743R264M4485K1998K133l8217J169k8688j8614n639p614
6534d0400q101J7903k0838k4730L9421M6362N7537L0012k625k1712k5618l2961
6522A4250k0705J2338l2519m1090L1898J5694P188K8857j5721n0609R095J0367
6510c0957N3624q123k8246j6312K5598J0257k9562k2890j8054L0480J3954M6243
6498B6012N1997k185j4133J67J7781n2818k7883j7755p777L7817J3224l4720j1801
6485b2074J3667j8104j335K5690n911k6184K112L3875L6568j7993m4076J7997
6473e768Q158n131P447m333K5435J4347k6691j3696J9248M1517n926o0172j4408
6460a9973K616m2423Q239K8698M650l6817M2724K4954J9861l3924l7171L8995
$$ plain form
6448 429 6024 -3971 -5856 12818 4367 -20430 -10361 6434 -39575 -58557 -18513 -10952 -45571
6435 -45571 -64233 -97240 -105247 -86666 -79729 -61669 -84907 -67758 -67713 -36747 -2955 -53756 -58221
6422 -58221 -46835 -68899 -76809 -68991 -97150 -55330 -15690 -3958 -45932 -62223 -59572 -44978
6410 -44978 -42175 -3816 -1378 23104 15980 -28760 -20412 -24244 -22548 -17737 -26337 -47516 -37219
6397 -37219 -17894 -36128 -50305 -77876 -55656 -36259 -35202 -14119 -44378 -31449 -13664 -38774
6385 -38774 -48930 -55873 -64082 -74599 -66579 -33338 -839 -38752 -1764 24221 -13702 -27407
6373 -27407 -18563 -59840 -58452 -42943 -22492 19488 26017 40803 25541 47966 63340 31362
6361 31362 21516 8932 12082 30441 7468 -27298 -47616 -20960 3398 -24971 -14844 -19874
$$ packed form
6448D29N595r995j885J8674q451k4797J0069J6795m6009j8982M0044P561l4619
6435d5571j8662l3007q007J8581O937J8060k3238J7149M5L0966L3792n0801m465
6422e8221J1386k2064p910P818k8159M1820L9640J1732m1974j6291K651J4594
6410d4978K803L8359K438K4482p124m4740Q348l832J696M811q600k1179J0297
6397c7219J9325j8234j4177k7571K2220J9397J057K1083l0259J2929J7785k5110
6385c8774j0156o943q209j0517Q020L3241L2499l7913L6988K5985l7923j3705
6373b7407Q844m1277J388J5509K0451M1980O529J4786j5262K2425J5374l1978
6361C1362r846j2584L150J8359k2973l4766k0318K6656K4358k8369J0127n030
$$ plain form
6349 -19874 -38928 -51662 -47571 -45643 -36011 -7222 -40345 -90294 -63744 -53478 71 25629
6337 25629 -13971 -50576 -40631 -36158 -25801 -43880 -25874 8886 10709 524 -22764 4659
6325 4659 29225 50511 59306 75849 68181 32535 11189 -6905 3 29177 68736 77183 58867
6312 58867 29891 28797 43226 27892 15816 13352 5361 -31819 -72240 -35224 -17262 21383
6300 21383 -847 -26118 -37888 -52902 -40386 -49780 -62101 -45420 -32250 -19742 -23081 -25096
6288 -25096 -50827 -32254 13011 -1866 -20038 -6311 10794 -6860 -6201 10025 15512 37497
6276 37497 -25973 -50973 -31950 -31692 -4475 -1908 -6105 -42801 -60250 -18511 36680 24577 20251
6263 20251 14969 -1665 -1418 -9800 30713 20164 43915 62630 26385 -36909 -42164 134 37205
$$ packed form
6349a9874j9054j2734M091J928R632K8789l3123m9949K6550J0266N3549K5558
6337B5629l9600l6605R945M473J0357j8079J8006L4760J823j0185k3288K7423
6325D659K4566K1286Q795J6543p668l5646k1346j8094O908K9174L9559Q447j8316
6312E8867k8976j094J4429j5334j2076k464p991l7180m0421L7016J7962L8645
6300B1383k2230k5271j1770j5014J2516r394j2321J6681J3170J2508l339k015
6288b5096k5731J8573M5265j4877j8172J3727J7105j7654O59J6226N487K1985
6276C7497o3470k5000J9023K58K7217K567m197l6696j7449M1739N5191j2103m326
6263B0251n282j6634K47q382M0513j0549K3751J8715l6245o3294n255M2298L7071
$$ plain form
6250 37205 61510 20169 22434 68422 59038 48919 24114 11495 5517 -41590 -66876 -55693
6238 -55693 -47134 -19977 -5941 10969 3104 2758 29115 11098 34794 68020 57118 2124 -33634
6225 -33634 -14197 -24457 -29118 5075 431 -29569 -13468 -35071 -52512 -18622 -26409 -14422
6213 -14422 -8154 1198 10132 -21258 -23134 -15792 13587 -6872 -56653 -77870 -68394 -58560 -51509
6200 -51509 -65169 -54350 -45211 -6172 -13167 -2953 28522 22124 7671 357 11384 -11719 -38260
6187 -38260 -39219 -23984 -32943 2266 21845 20218 10532 -31904 -26797 6344 17747 -18077 -58708
6174 -58708 -56927 -12341 14118 37820 48736 -3318 -28753 -14546 -16450 -15245 9436 2069 -6128
6161 -6128 -35954 -56076 -59938 -70724 -50545 -31906 -3303 -27347 -26391 -26482 -22523 -43200 -40495 -2830
$$ packed form
6250C7205K4305m1341K265M5988r384j0119k4805j2619n978m7107k5286J1183
6238e5693Q559K7157J4036J6910p865l46K6357j8017K3696L3226j0902n4994l5758
6225c3634J9437j0260m661L4193m644l0000J6101k1603j7441L3890p787J1987
6213a4422O268R352Q934l1390j876P342K9379k0459m9781k1217R476R834P051
6200e1509j3660J0819R139L9039o995J0214L1475o398j4453p314J1027k3103k6541
6187c8260r59J5235q959L5209J9579j627r686m2436N107L3141J1403l5824m0631
6174e8708J781M4586K6459K3702J0916n2054k5435J4207j904J205K4681p367q197
6161f128k9826k0122l862j0786K0179J8639K8603k4044R56r1L959k0677K705L7665
$$ plain form
6147 -2830 37558 22840 -9961 -23661 -55800 -78689 -87169 -58444 -50372 -27527 -13070 -7732 -5602
6134 -5602 10502 -17890 -29764 -47780 -47329 -4512 26694 21748 8713 -13778 -45702 -42264 -44799
6121 -44799 -86786 -110369 -124145 -109141 -66741 -65383 -75501 -49272 -56128 -56688 -15440 -14753 -19294
6108 -19294 -12532 11141 18670 24186 34803 1862 -307 21925 24544 3727 6309 12449 12879 -18035
6094 -18035 -36652 -36285 -28853 -69242 -73666 -71316 -46839 -12892 15016 12199 -6738 -3948 -5245
6081 -5245 -1315 13604 3571 -22025 -16047 -43371 -81077 -61151 -35956 -7240 12734 -6124
6069 -6124 17648 53840 30177 -11397 -8335 -13868 -38635 -27793 -20708 15367 20726 17811 19769
6056 19769 47228 24940 19480 32434 77657 57360 6215 -48009 -80229 -98619 -72220 -31893
$$ packed form
6147b830M0388j4718l2801j3700l2139k2889q480K8725Q072K2845J4457N338K130
6134e602J6104k8392j1874j8016M51M2817L1206m946j3035k2491l1924L438k535
6121d4799m1987k3583j3776J5004M2400J358j0118K6229o856n60M1248O87m541
6108a9294O762K3673P529N516J0617l2941k169K2232K619k0817K582O140M30l0914
6094a8035j8617L67P432m0389m424K350K4477L3947K7908k817j8937K790j297
6081e245L930J4919j0033k5596N978k7324l7706J9926K5195K8716J9974j8858
6069f124K3772L6192k3663m1574L062n533k4767J0842P085L6075N359k915J958
6056A9769K7459k2288n460J2954M5223k0297n1145n4224l2220j8390K6399M0327
$$ plain form
6044 -31893 -34742 -76729 -67810 -9131 -19390 -57278 -46043 -53132 -101484 -122195 -62767 -21692
6032 -21692 -14312 -36898 -55979 -73901 -72298 -26924 22197 3975 -6023 13154 13054 -8801 -30434
6019 -30434 1301 33871 21756 -9699 -17500 -51172 -54858 -43596 -42845 -41762 -75169 -72988 -73879
6006 -73879 -71944 -61575 -26919 -1799 -25686 -39804 -34360 -29423 -37028 -6172 -12917 -26444 -6589
5993 -6589 3835 -51336 -89769 -85362 -54230 -31545 -27176 -34978 -23951 -19472 -3472 -9720 -29992
5980 -29992 -41790 -66561 -72568 -65244 -79281 -62218 -30658 16901 34001 22791 -15166 -38376
5968 -38376 -28025 -607 3466 -11128 -21081 -46259 -52989 -62581 -56369 -41399 -10943 19382 8760
5955 8760 -15429 -14299 4347 -23938 -22947 3988 1145 -1946 -4069 -8012 -7707 38343 45839 30963
$$ packed form
6044c1893k849m1987Q919N8679j0259l7888J1235p089m8352k0711N9428M1075
6032b1692P380k2586j9081j7922J603M5374M9121j8222r998J9177j00k1855k1633
6019c0434L1735L2570j2115l1455p801l3672l686J1262P51J083l3407K181q91
6006g3879J935J0369L4656K5120k3887j4118N444M937p605L0856o745j3527J9855
5993f589J0424n5171l8433M407L1132K2685M369p802J1027M479J6000o248k0272
5980b9992j1798k4771o007P324j4037J7063L1560M7559J7100j1210l7957k3210
5968c8376J0351K7418M073j4594r953k5178o730r592O212J4970L0456L0325j0622
5955H760k4189J130J8646k8285R91K6935k843l091k123l943L05M6050P496j4876
$$ plain form
5941 30963 -18450 -23391 -38253 -35502 -21352 -4663 -13038 -28176 -61947 -55961 -39153 -47063 -42903
5928 -42903 -36294 -64331 -71509 -40029 -29156 -29282 -6814 27474 38049 9543 -18941 -14507 -11147
5915 -11147 5228 20008 24956 39599 43984 61759 46050 34611 18065 -6160 2036 -4369 -64624
5902 -64624 -50983 -16751 33163 33427 31403 6128 -24928 -39185 -28305 -18661 -12470 6329 -19400
5889 -19400 -20586 -9337 -1725 -13157 -31962 3511 35133 46400 20839 -2304 -21303 -37369
5877 -37369 -12827 2239 -18280 -25275 5656 -13669 -37578 -33426 -56073 -66385 -60516 -77870
5865 -77870 -41407 13119 12667 23493 -3563 -13032 25796 68512 66679 59170 12686 -7148 -18359
5852 -18359 -33618 -52903 -66887 -38199 -27652 -32770 -23510 -6045 -3319 -16806 -11387 -3902 -97
$$ packed form
5941C0963m9413m941j4862K751J4150J6689q375j5138l3771N986J6808p910M160
5928d2903O609k8037p178L1480J0873j26K2468L4288J0575k8506k8484M434L360
5915a1147J6375J4780M948J4643M385J7775j5709j1439j6546k4225Q196o405o0255
5902f4624J3641L4232M9914K64k024k5275l1056j4257J0880R644O191J8799k5729
5889a9400j186J1249P612j1432j8805L5473L1622J1267k5561k3143j8999j6066
5877c7369K4542J5066k0519o995L0931j9325k3909M152k2647j0312N869j7354
5865g7870L6463N4526m52J0826k7056r469L8828M2716j833p509m6484j9834j1211
5852a8359j5259j9285j3984K8688J0547n118R260J7465K726j3487N419P485L805
$$ plain form
5839 -97 -57351 -97041 -105552 -69891 -55674 -39889 -19455 -22062 -34330 -12663 17408 33891 16932
5826 16932 -2497 -5837 2435 17617 22658 -19475 -48645 -53281 -56913 -50576 -41781 -8980 -12670
5813 -12670 -6552 -8389 -19556 -20899 -40486 -38767 -40052 -54140 -75202 -55631 -39045 -28567 7064
5800 7064 39100 -5622 -15710 -26939 -76798 -78511 -19270 9294 46665 13868 -26028 -66886
5788 -66886 -45281 934 -14145 1543 20129 10909 -26329 -32957 -55843 -52511 -69923 -66589 -51292
5775 -51292 -36233 -58953 -57715 -12327 -7961 -40842 -43274 -57444 -24114 -7741 -4720 -6874 28929
5762 28929 73270 54350 6195 -11286 -2167 -7702 -17716 -10380 22550 9346 32204 38336 19086
5749 19086 3921 1167 -741 -21815 -14846 -44976 -50501 -44162 10739 33107 12586 15019 -17564
$$ packed form
5839i7n7254l9690q511L5661J4217J5785K0434k607j2268K1667L0071J6483j6959
5826A6932j9429l340Q272J5182N041m2133k9170m636l632O337Q795L2801l690
5813a2670O118j837j1167j343j9587J719j285j4088k1062J9571J6586J0478L5631
5800G064L2036m4722j0088j1229m9859j713N9241K8564L7371l2797l9896m0858
5788f6886K1605M6215j5079J5688J8586r220l7238o628k2886L332j7412L334J5297
5775e1292J5059k2720J238M5388M366l2881k432j4170L3330J6373L021k154L5803
5762B8929M4341j8920m8155j7481R119n535j0014P336L2930j3204K2858O132j9250
5749A9086j5165k754j908k1074O969l0130n525O339N4901K2368k0521K433l2583
$$ plain form
5736 -17564 -26079 -4817 -26170 -25991 -18438 -31558 -53185 -36219 -36920 -73033 -89993 -39680 17347
5723 17347 10781 -31508 2940 23297 -4647 -4908 4917 13476 8260 8265 -15391 -25911 -35894 -57553
5709 -57553 -47935 -41345 -54558 -38757 -39284 -6506 20378 12584 10166 4820 42365 27237 248
5696 248 -11248 -39720 -24663 -19268 -21799 -26030 -18887 -15188 -22096 -3059 -7383 31721 43735 52694
5682 52694 26303 -6972 14877 25778 -6965 -65630 -62615 -48021 12734 14819 -7417 13541
5670 13541 3412 -34151 -25627 -19736 -39546 -44093 -32385 -16889 -4331 -12919 -39579 -11208 -10840
5657 -10840 6494 -16633 10925 46006 55766 16059 -21686 -44894 -41593 -42295 -53102 -20516 -27464
5644 -27464 -35288 -18088 10786 16174 21662 42616 31150 -16005 -45462 -35189 -10742 49672
$$ packed form
5736a7564q515K1262k1353J79P553j3120k1627J6966p01l6113j6960N0313N7027
5723A7347o566m2289L4448K0357k7944k61R825Q559n216Nk3656j0520r983k1659
5709e7553R618O590j3213J5801n27L2778K6884p794k418n346L7545j5128k6989
5696B48j1496k8472J5057N395k531m231P143L699o908J9037m324L9104J2014Q959
5682E2694k6391l3275K1849J0901l2743n8665L015J4594O0755K085k2236K0958
5670A3541j0129l7563Q524N891j9810m547J1708J5496J2558q588k6660K8371L68
5657a0840J7334k3127K7558L5081R760l9707l7745k3208L301p02j0807L2586o948
5644b7464p824J7200K8874N388N488K0954j1466m7155k9457J0273K4447O0414
$$ plain form
5632 49672 16298 -14441 -49564 -51361 -45893 -30072 -36908 -16056 22999 16043 -2724 3796 18571
5619 18571 67904 51257 1052 -14085 3739 12767 33809 -5365 13975 20300 20225 29278 42473
5606 42473 20919 26428 37393 20796 -5856 1722 1538 -1144 -13990 -59594 -81780 -74431 -13949
5593 -13949 18825 56387 99450 55684 11235 31944 47396 42992 -23305 -15662 -10688 3845
5581 3845 -7584 -20235 1354 27103 72198 89994 56317 36773 9753 -16249 4918 -9615
5569 -9615 10227 25606 47945 22211 -29733 -23503 -74776 -67477 -66000 -44884 -39069 -22878 -9585
5556 -9585 -9598 -18215 -33045 -17884 -1556 23346 58160 47309 7182 13751 -13282 -30551 -14750
5543 -14750 -11358 14669 18297 897 -13189 -32845 -7131 9215 -2289 -27069 -33859 -49174
$$ packed form
5632D9672l3374l0739l5123j797N468J5821o836K0852L9055o956j8767O520J4775
5619A8571M9333j6647n0205j5137J7824R028K1042l9174J9340O325p5R053J3195
5606D2473k1554N509J0965j6597k6652P578j84k682j2846m5604k2186P349O0482
5593a3949L2774L7562M3063m3766m4449K0709J5452m404o6297P643M974J4533
5581C845j1429j2651K1589K5749M5095J7796l3677j9544k7020k6002K1167j4533
5569i615J9842J5379K2339k5734n1944O230n1273P299J477K1116N815J6191J3293
5556i585j3q617j4830J5161J6328K4902L4814j0851m0127O569k7033j7269J5801
5543a4750L392K6027L628j7400j4086j9656K5714J6346j1504k4780o790j5315
$$ plain form
5531 -49174 -65911 -62237 -49174 -23370 7167 -6719 -39060 -46885 -35585 -1137 4736 -62383
5519 -62383 -102793 -67036 -41477 -71742 -90289 -90149 -116351 -123498 -119875 -106552 -79577 -32359 -26787
5506 -26787 -41745 -58891 -75643 -10374 56818 57280 28729 -8710 -44959 -51145 -71090 -50988
5494 -50988 -14602 17630 25220 14677 -15289 -27992 -20959 -51392 -46110 -11765 10546 -102
5482 -102 -19709 -34712 -24371 5199 267 11287 52225 42242 -398 -13965 15584 2401 -45086
5469 -45086 -52594 -6911 27354 53230 39559 -15278 -22416 -13808 -41040 -62944 -61690 -69130 -56412
5456 -56412 -35315 -18797 17105 35412 35752 27910 9618 11932 -19615 -42364 -41611 -34631 -42134
5443 -42134 -14590 1082 11783 -11758 -30710 -28801 -30536 -11703 -36777 -64132 -53226 -25438
$$ packed form
5531d9174j6737L674J3063K5804L0537j3886l2341p825J1300L4448N873o7119
5519f2383m0410L5757K5559l0265j8547J40k6202p147L623J3323K6975M7218N572
5506b6787j4958j7146j6752O5269O7192M62k8551l7439l6249o186j9945K0102
5494e0988L6386L2232P590j0543k9966j2703P033l0433N282L4345K2311j0648
5482a02j9607j5003J0341K9570m932J1020M0938r983m2640j3567K9549j3183m7487
5469d5086p508M5683L4265K5876j3671n4837p138Q608k7232k1904J254p440J2718
5456e6412K1097J6518L5902J8307L40p842j8292K314l1547k2749P53O980p503
5443d2134K7544J5672J0701k3541j8952J909j735J8833k5074k7355J0906K7788
$$ plain form
5431 -25438 -18993 -14795 -22979 -37054 -61351 -42595 -5293 16983 8725 -10898 -26278 -21835 -19505
5418 -19505 13413 -37011 -44756 -40572 -39029 -65979 -88546 -66016 -47873 -36846 -17234 -25505 -20161
5405 -20161 -28533 -17574 -15710 -17781 -25415 -40270 -43497 4774 -10756 -27699 -46551 -64089 -58977
5392 -58977 -30034 -8481 4914 2785 -9290 -10331 -31567 -58276 -28483 -13972 -2279 10049
5380 10049 14097 4075 10759 -53975 -65239 -90798 -66457 -42455 -52657 -96563 -83203 -40871
5368 -40871 -36042 -10987 9116 -7326 -31922 -42165 -43669 -36797 -61746 -52863 -45721 -61933 -64557
5355 -64557 -63288 -81796 -47233 -17038 -51050 -80042 -24996 -1877 -29682 -20253 -18329 -42097
5343 -42097 -53168 -26356 -18507 -36327 -51784 -27122 5381 37854 12271 -37200 -43406 -25120
$$ packed form
5431b5438O445M198q184j4075k4297J8756L7302K2276q258j9623j5380M443K330
5418a9505L2918n0424p745M184J543k6950k2567K2530J8143J1027J9612q271N344
5405b0161q372J0959J864k071p634j4855l227M8271j5530j6943j8852j7538N112
5392e8977K8943K1553J3395k129j2075j041k1236k6709K9793J4511J1693J2328
5380A0049M048j0022O684o4734j1264k5559K4341K4002j0202m3906J3360M2332
5368d0871M829K5055K0103j6442k4596j0243j504O872k4949Q883P142j6212k624
5355f4557J269j8508L4563L0195l4012k8992N5046K3119k7805R429J924k3768
5343d2097j1071K6812P849j7820j5457K4662L2503L2473k5583m9471o206J8286
$$ plain form
5331 -25120 -21868 -28601 -19557 13190 29072 -8950 -44789 -33958 -4893 4940 -6407 -36457 -64944
5318 -64944 -57901 -49043 -72685 -86413 -41416 -11961 -25972 -11948 -22113 -17076 -23854 -24293 -27339
5305 -27339 -26619 -32428 -28696 -31971 -14504 -8563 -12045 26617 34040 13521 -2862 1585 -19693 -28848
5291 -28848 -17177 -45434 -69682 -34511 -10679 4336 19757 26446 6442 -1503 -14916 -38493
5279 -38493 -29955 -13052 -11950 9419 37067 41276 28643 11347 36035 24239 -20035 -39976
5267 -39976 -40812 -24759 -61202 -51196 -15052 -29348 -25364 -13421 -19124 -34231 -48040 -31747 -56328
5254 -56328 -108162 -82920 -44737 -58592 -59763 -43914 -57356 -60967 -50287 -47985 -5435 -9349 -65505
5241 -65505 -98713 -67162 -28954 -12259 -25371 -17062 -23563 -9504 -4898 -34764 -22607 13634
$$ packed form
5331b5120L252o733R044L2747J5882l8022l5839J0831K9065R833j1347l0050k8487
5318f4944P043Q858k3642j3728M4997K9455j4011J4024j0165N037o778m39l046
5305b7339P20n809L732l275J7467N941l482L8662P423k0519j6383M447k1278r155
5291b8848J1671k8257k4248L5171K3832J5015J5421O689k0004p945j3413k3577
5279c8493Q538J6903J102K1369K7648M209j2633j7296K4688j1796m4274j9941
5267c9976q36J6053l6443J0006L6144j4296L984J1943n703j5107j3809J6293k4581
5254e6328n1834K5242L8183j3855j171J5849j3442l611J0680K302M2550l914n6156
5241f5505l3208L1551L8208J6695j3112Q309o501J4059M606k9866J2157L6241
$$ plain form
5229 13634 30233 16861 32063 22523 2573 -4738 -14283 442 12928 9282 2459 -30643 -45056
5216 -45056 -31804 -22144 4673 -14198 -14468 -4464 -15813 -19875 10214 29661 47508 46758 38261
5203 38261 -23963 -49415 -60865 -12359 13038 5040 -17456 -17958 -19633 -15539 -47330 -73061 -55517
5190 -55517 -67307 -61189 -75543 -80981 -102046 -68064 -45620 -49499 -11662 1698 -22664 -25397 -18022
5177 -18022 -16298 -4130 28972 86421 83099 56643 2485 13697 37448 37133 9495 5548 742
5164 742 2904 13158 5459 -18171 -52386 -36431 -41982 -24114 2864 4490 -7234 -41653 -48506
5151 -48506 -52002 -46162 -56608 -59818 -66108 -74396 -55934 -34907 -26562 -15159 -18936 -41878 -27371
5138 -27371 -72331 -71256 -15953 17464 32275 17781 18530 1701 -29211 -36067 -40590 -41170 -14892
$$ packed form
5229A3634J6599j3372J5202r540j9950p311r545J4725J2486l646o823l3102j4413
5216d5056J3252R660K6817j8871k70J0004j1349m062L0089J9447J7847p50q497
5203C8261o2224k5452j1450M8506K5397p998k2496n02j675M094l1791k5731J7544
5190e5517j1790O118j4354n438k1065L3982K2444l879L7837J3360k4362k733P375
5177a8022J724J2168L3102N7449l322k6456n4158J1212K3751l15k7638l947m806
5164G42K162J0254p699k3630l4215J5955n551J7868K6978J626j1724l4419o853
5151d8506l496N840j0446l210o290q288J8462K1027Q345J1403l777k2942J4507
5138b7371m4960J075N5303L3417J4811j4494P49j6829l0912o856m523n80K6278
$$ plain form
5125 -14892 5316 32250 26386 38368 26691 -26610 -62225 -54863 -526 26794 12534 19144
5113 19144 20924 7297 -29619 -52465 -37390 -16756 -10074 25684 30322 -11514 -8599 27727 -16067
5100 -16067 -38105 -35822 -24061 -5955 -23414 -27467 -32318 -14249 -9089 25215 202 -17734 -17746
5087 -17746 24379 40237 61398 50546 872 -33863 -28111 -6021 22988 17857 -9695 -21991
5075 -21991 -2345 -1009 3310 -3924 -24109 -25386 -23807 -19525 -23465 5506 27478 20299 38501
5062 38501 25368 -15774 -16602 -1517 7096 19490 5161 20830 -8935 -58688 -57087 -29195 -14053
5049 -14053 11375 17236 36122 24640 -38190 -29548 -36704 -43208 -28955 -23536 -17092 -45792 -49774
5036 -49774 -23832 -55265 -72774 -38317 -39447 -16553 -30992 -15911 -43013 -44080 -29182 11194
$$ packed form
5125a4892K0208K6934n864J1982j1677n3301l5615P362N4337K7320j4260O610
5113A9144J780j3627l6916k2846J5075K0634O682L5758M638m1836K915L6326m3794
5100a6067k2038K283J1761J8106j7459m053m851J8069N160L4304k5013j7936j2
5087a7746M2125J5858K1161j0852m9674l4735N752K2090K9009n131k7552j2296
5075b1991J9646J336M319p234k0185j277J579M282l940K8971K1972p179J8202
5062C8501j3133m1142q28J5085Q613J2394j4329J5669k9765m9753J601K7892J5142
5049a4053K5428N861J8886j1482o2830Q642p156o504J4253N419O444k8700l982
5036d9774K5942l1433j7509L4457j130K2894j4439J5081k7102j067J4898M0376
$$ plain form
5024 11194 17401 -10081 -18510 -7020 -24745 -61571 -35960 6974 5320 -17909 -6150 6388
5012 6388 -5036 -31407 18287 -6173 -38392 -46053 -11690 -21581 -22875 -16257 27577 44354 57733
4999 57733 61539 37194 13155 50806 36345 8866 329 -8076 4927 -3956 11426 -9630 -13533
4986 -13533 10722 6363 8837 -17398 -13514 -15304 -49110 -40253 731 -17458 -18402 14464 12044
4973 12044 7400 36219 1108 10466 -15464 -15122 33917 64163 49175 38911 3309 14659 6993
4960 6993 -14830 -7869 -18396 -18313 -10659 4517 -7008 15547 28370 25609 9621 31343 17961
4947 17961 4099 -11431 -8967 -32205 -82257 -65975 -44118 -33218 -12021 20171 -4807 -74821
4935 -74821 -95058 -47586 16335 3383 -3180 -14127 2834 -15861 -18247 26979 17821 -12242
$$ packed form
5024A1194O207k7482q429J1490j7725l6826K5611M2934j654k3229J1759J2538
5012F388j1424k6371M9694k4460l2219p661L4363r891j294O618M3834J6777J3379
4999E7733L806k4345k4039L7651j4461k7479q537q405J3003q883J5382k1056l903
4986a3533K4255m359K474k6235L884j790l3806Q857M0984j8189r44L2866k420
4973A2044m644K8819l5111R358k5930L42M9039L0246j4988j0264l5602J1350p666
4960F993k1823O961j0527Q3P654J5176j1525K2555J2823k761j5988K1722j3382
4947A7961j3862j5530K464k3238n0052J6282K1857J0900K1197L2192k4978p0014
4935g4821k0237M7472O3921j2952o563j0947J6961j8695k386M5226r158l0063
$$ plain form
4923 -12242 -16185 -1446 15778 22371 25682 44242 28486 15217 29398 17124 7000 34675
4911 34675 20657 25814 11825 12975 19578 33452 33998 489 -9827 -35489 -36238 -219 10799
4898 10799 4678 -19891 -18194 3485 14665 -11608 -44675 -48347 -48392 -50493 -30871 -25167 -53615
4885 -53615 -63333 -28354 -13904 5021 24117 6928 -5195 -10808 -37 16341 4751 -12283
4873 -12283 -9295 -3193 9017 29464 28249 4147 2780 25046 -14103 -78742 -118704 -81910 -46406
4860 -46406 -50047 -83085 -49964 -41775 -43749 -9573 -25593 -15562 -5185 28242 21144 15218 15
4847 15 34022 48792 32343 27138 -13222 -18854 34307 56865 66285 38458 24874 -18378 -38600
4834 -38600 -64875 -50477 -24327 18990 16817 1543 -24089 -42550 -35781 -24324 -22232 12175
$$ packed form
4923a2242l943J4739J7224O593L311J8560j5756j3269J4181j2274j0124K7675
4911C4675j4018N157j3989J150O603J3874N46l3509j0316k5662p49L6019J1018
4898A0799o121k4569J697K1679J1180k6273l3067l672m5k101J9622N704k8448
4885e3615r718L4979J4450J8925J9096j7189j2123n613J0771J6378j1590j7034
4873a2283K988O102J2210K0447j215k4102j367K2266l9149o4639l9962L6794L5504
4860d6406l641l3038L3121Q189j974L4176j6020J0031J0377L3427p098n926j5203
4847A5L4007J4770j6449n205m0360n632N3161K2558R420k7827j3584m3252k0222
4834c8600k6275J4398K6150M3317k173j5274k5632j8461O769J1457K092L4407
$$ plain form
4822 12175 23871 31039 33407 52033 47451 38056 30910 45139 12389 -3115 6338 -35260 -57969
4809 -57969 -63443 -105224 -65962 -55790 -28398 -17506 -8118 10735 22454 6240 -40293 -68276
4797 -68276 -32718 -45667 -67326 -65192 -60210 -63239 -72353 -75025 -90265 -126730 -99372 -34091 -3742
4784 -3742 8115 38291 51493 17930 10311 2069 -20558 -292 -23937 -24229 -32354 -36929 -28884
4771 -28884 -41923 -56940 -50501 -62910 -23866 -34728 -21291 -3135 -9443 28926 48189 37947
4759 37947 -8946 6012 42117 50109 35220 15224 23802 2712 6867 31785 30672 28175 64747
4746 64747 55755 39040 24207 9488 -30185 -46143 -25728 13764 4008 -8809 -8623 -14737 -9118
4733 -9118 -7860 -17493 4389 -9931 972 19894 21491 29151 24182 2809 -16663 4301 29523
$$ packed form
4822A2175J1696P168K368J8626m582r395p146J4229l2750j5504R453m1598k2709
4809e7969n474m1781L9262J0172K7392J0892R388J8853J1719j6214m6533k7983
4797f8276L5558j2949k1659K134M982l029r114k672j5240l6465K7358O5281L0349
4784c742J1857L0176J3202l3563p619q242k2627K0266k3645k92q125m575Q045
4771b8884j3039j5017O439j2409L9044j0862J3437J8156o308L8369J9263j0242
4759C7947m6893J4958L6105P992j4889j9996Q578k1090M155K4918j113k497L6572
4746F4747q992j6715j4833j4719l9673j5958K0415L9492r756j2817J86o114N619
4733i118J258r633K1882j4320J0903J8922J597P660m969k1373j9472K0964K5222
$$ plain form
4720 29523 33977 55217 26344 -3110 -250 22208 16891 3288 -2831 5897 -14921 -40763 -55733
4707 -55733 -22872 -18607 -34287 -28609 -27084 -41339 -74238 -66038 -70039 -26621 9020 13947 12978
4694 12978 3337 40657 70740 56289 41807 -12123 -53796 -63342 -34269 9254 14559 6712 20587
4681 20587 37010 48598 20534 25452 51779 41781 7217 -27443 -8397 -8609 -25661 -5827 -16918
4668 -16918 667 36570 33028 6457 -11506 -46735 -65161 -28646 6337 2722 -14988 -4332
4656 -4332 32797 56505 37025 -9961 -8783 -26232 -71985 -51533 -3666 63883 55861 47887 54630
4643 54630 63082 59029 54505 22230 7383 17014 27166 34880 53016 43220 24062 31055 -4908
4630 -4908 -58719 -52391 -56627 -71324 -47160 -37011 -41133 6762 -12330 -30055 -35488 8364 57646
$$ packed form
4720B9523M454K1240k8873k9454K860K2458n317j3603o119Q728k0818k5842j4970
4707e5733L2861M265j5680N678J525j4255l2899Q200m001M3418L5641M927r69
4694A2978r641L7320L0083j4451j4482n3930m1673r546K9073M3523N305p847J3875
4681B0587J6423J1588k8064M918K6327r998l4564l4660J9046k12j7052J9834j1091
4668a6918J7585L5903l542k6571j7963l5229j8426L6515L4983l615j7710J0656
4656d332L7129K3708j9480m6986J178j7449m5753K0452M7867O7549q022p974O743
4643E4630Q452m053m524l2275j4847R631J0152P714J8136r796j9158O993l5963
4630d908n3811O328m236j4697K4164J0149m122M7895j9092j7725n433M3852M9282
$$ plain form
4617 57646 41741 7633 -5207 -12508 -35967 -37270 -51932 -34925 20502 32886 12645 -12366
4605 -12366 -63863 -92859 -63222 -51575 -47581 -34812 -4073 985 -10575 -35394 -53326 -72969
4593 -72969 -25541 20733 -7354 -24975 -47140 -39277 35508 39162 -17882 -29889 -54626 -63467
4581 -63467 -37490 -21285 -6032 20558 -15225 -40063 -29264 -11037 9883 -2818 -22620 5963
4569 5963 17807 -422 -5756 -35940 -41916 -42915 -44982 -25565 -15250 23640 21629 -4437 31659
4556 31659 43967 38780 25797 -17673 9147 11274 -2286 -25791 -79393 -93013 -40890 -4874
$$ packed form
4617E7646j5905l4108j2840p301k3459j303j4662J7007N5427J2384k0241k5011
4605a2366n1497k8996K9637J1647L994J2769L0739N058j1560k4819j7932j9643
4593g2969M7428M6274k8087j7621k2165P863P4785L654n7044j2007k4737q841
4581f3467K5977J6205J5253K6590l5783k4838J0799J8227K0920j2701j9802K8583
4569E963J1844j8229n334l0184n976r99k067J9417J0315L8890k011k6066L6096
4556C1659J2308n187j2983m3470K6820K127j3560k3505n3602j3620N2123L6016
$$ [...]
##END NTUPLES=NMR SPECTRUM
##END=
