##TITLE=Analysis number 329223
Compound Code cc 62901
Book Reference 423/182/1
Project Code adrs
Chemist Name bruced
##JCAMPDX= 6.0         $$ Bruker NMR JCAMP-DX V2.0
##DATA TYPE= NMR SPECTRUM
##DATA CLASS= NTUPLES
##ORIGIN= Bruker BioSpin GmbH
##OWNER= nmr
$$ XWIN-NMR		Version 3.5
$$ Mon Aug 13 11:33:41 2007 GMT Daylight Time (UT+1h)  MAYBRIDGE\nmr@NMR_250MHZ
##.OBSERVE FREQUENCY= 250.131544655141
##.OBSERVE NUCLEUS= ^1H
##.ACQUISITION MODE= SIMULTANEOUS (DQD)
##.ACQUISITION SCHEME= undefined
##.AVERAGES= 16
##.DIGITISER RES= 18
##SPECTROMETER/DATA SYSTEM= dpx250
##.PULSE SEQUENCE= zg30
##.SOLVENT NAME= DMSO
##.SHIFT REFERENCE= (INTERNAL, DMSO, 0, 16.522)
##AUDIT TRAIL= $$ (NUMBER, WHEN, WHO, WHERE, WHAT)
$$ ##TITLE= Audit trail, XWIN-NMR		Version 3.5
$$ ##JCAMPDX= 5.01
$$ ##ORIGIN= Bruker BioSpin GmbH
$$ ##OWNER= nmr
$$ C:\u/data/dgb/nmr/ADRS/500/pdata/1/auditp.txt
$$ ##AUDIT TRAIL=  $$ (NUMBER, WHEN, WHO, WHERE, WHAT)
(   1,<2007-08-13 11:33:15.32 +100>,<MAYBRIDGE\nmr>,<NMR_250MHZ>,
      <created by zg, POWCHK disabled, PULCHK disabled
       configuration hash MD5:
       76 6E 9A 78 1E 09 19 81 EC 84 63 8F B0 6A 59 2D
       data hash MD5: 64K
       97 14 E0 D4 13 1E 40 0D BB 43 A4 CA F6 4D 9D 54>)
(   2,<2007-08-13 11:33:29.18 +100>,<MAYBRIDGE\nmr>,<NMR_250MHZ>,
      <Start of raw data processing
       ef LB = 0.3 FT_mod = 6 PKNL = 1 SI = 32K 
       data hash MD5: 32K
       70 4B 23 CD E4 9B D5 70 45 B3 AB EB 37 90 2D F6>)
(   3,<2007-08-13 11:33:31.22 +100>,<MAYBRIDGE\nmr>,<NMR_250MHZ>,
      <apk 
       data hash MD5: 32K
       A2 E6 36 05 FD EC 52 93 10 6E D1 C4 79 1A D0 66>)
(   4,<2007-08-13 11:33:32.23 +100>,<MAYBRIDGE\nmr>,<NMR_250MHZ>,
      <abs ABSG = 5 
       data hash MD5: 32K
       F7 3F 0D 28 DF 31 5E D7 66 CE F6 B7 FE 48 4A 16>)
$$ ##END=
$$ 
$$ hash MD5
$$ F1 80 F4 01 D0 44 75 CE 82 10 B3 5C 3B F4 E9 2F
##$RELAX= 
##$RELAX= 
##$RELAX= 
##$RELAX= 
##$RELAX= 
##$RELAX= 
##$RELAX= 
$$ Bruker specific parameters
$$ --------------------------
##$DU= <C:\u>
##$EXPNO= 500
##$NAME= <ADRS>
##$PROCNO= 1
##$TYPE= <nmr>
##$USER= <dgb>
##$AMP= (0..31)
100 100 100 100 100 100 100 100 100 100 100 100 100 100 100 100 100 100 
100 100 100 100 100 100 100 100 100 100 100 100 100 100 
##$AQSEQ= 0
##$AQ_mod= 3
##$AUNM= <au_zg>
##$AUTOPOS= <16 >
##$BF1= 250.13
##$BF2= 250.13
##$BF3= 250.13
##$BF4= 250.13
##$BF5= 500.13
##$BF6= 500.13
##$BF7= 500.13
##$BF8= 500.13
##$BYTORDA= 1
##$CFDGTYP= 0
##$CFRGTYP= 5
##$CHEMSTR= <none>
##$CNST= (0..31)
1 1 145 1 1 1 1 1 1 1 1 1 1 1 1 1 1 1 1 1 1 1 1 1 1 1 1 1 1 1 1 1 
##$CPDPRG= <>
##$CPDPRG1= <>
##$CPDPRG2= <>
##$CPDPRG3= <>
##$CPDPRG4= <mlev>
##$CPDPRG5= <mlev>
##$CPDPRG6= <mlev>
##$CPDPRG7= <mlev>
##$CPDPRG8= <mlev>
##$CPDPRGB= <>
##$CPDPRGT= <>
##$D= (0..31)
0 1 0 0 0 0 0 0 0 0.06 0 0 0 0 0 0 0.0002 0 0 0 0 0 0 0 0 0 0 0 0 0 0 
0 
##$DATE= 1187001194
##$DBL= (0..7)
120 120 120 120 120 120 120 120 
##$DBP= (0..7)
150 150 150 150 150 150 150 150 
##$DBP07= 0
##$DBPNAM0= <>
##$DBPNAM1= <>
$$ [...]
##$SUBNAM7= <"">
##$SUBNAM8= <"">
##$SUBNAM9= <"">
##$SW= 20.6930455092707
##$SWIBOX= (0..15)
0 0 3 0 0 0 0 0 0 0 0 0 0 0 0 0 
##$SW_h= 5175.983436853
##$TD= 65536
##$TD0= 1
##$TE= 296.16
##$TE2= 300
##$TE3= 300
##$TEG= 300
##$TL= (0..7)
0 120 120 120 120 120 120 120 
##$TP= (0..7)
150 150 150 150 150 150 150 150 
##$TP07= 0
##$TPNAME0= <>
##$TPNAME1= <>
##$TPNAME2= <>
##$TPNAME3= <>
##$TPNAME4= <>
##$TPNAME5= <>
##$TPNAME6= <>
##$TPNAME7= <>
##$TPOAL= (0..7)
0.5 0.5 0.5 0.5 0.5 0.5 0.5 0.5 
##$TPOFFS= (0..7)
0 0 0 0 0 0 0 0 
##$TUNHIN= 0
##$TUNHOUT= 0
##$TUNXOUT= 0
##$USERA1= <user>
##$USERA2= <user>
##$USERA3= <user>
##$USERA4= <user>
##$USERA5= <user>
##$V9= 5
##$VALIST= <valist>
##$VCLIST= <CCCCCCCCCCCCCCC>
##$VD= 0
##$VDLIST= <DDDDDDDDDDDDDDD>
##$VPLIST= <PPPPPPPPPPPPPPP>
##$VTLIST= <TTTTTTTTTTTTTTT>
##$WBST= 1024
##$WBSW= 4
##$XGAIN= (0..3)
0 0 0 0 
##$XL= 0
##$YL= 0
##$YMAX_a= 204525
##$YMIN_a= -177913
##$ZGOPTNS= <>
##$ZL1= 120
##$ZL2= 120
##$ZL3= 120
##$ZL4= 120
##$ABSF1= 16.522
##$ABSF2= -4.171173
##$ABSG= 5
##$ABSL= 3
##$ALPHA= 0
##$AQORDER= 0
##$ASSFAC= 0
##$ASSFACI= 0
##$ASSFACX= 0
##$ASSWID= 0
##$AUNMP= <proc_1d>
##$AZFE= 0.1
##$AZFW= 0.1
##$BCFW= 0
##$BC_mod= 0
##$BYTORDP= 0
##$COROFFS= 0
##$CY= 12.5
##$DATMOD= 1
##$DC= 0
##$DFILT= <>
##$DTYPP= 0
##$F1P= 14.0000005364418
##$F2P= -0.99999901652339
##$FCOR= 0.5
##$FTSIZE= 32768
##$FT_mod= 6
##$GAMMA= 0
##$GB= 0
##$INTBC= 1
##$INTSCL= 1
##$ISEN= 128
##$LB= 0.3
##$LEV0= 0
##$LPBIN= 0
##$MAXI= 10000
##$MC2= 0
##$MEAN= 0
##$ME_mod= 0
##$MI= 0
##$NCOEF= 0
##$NC_proc= -3
##$NLEV= 6
##$NOISF1= 0
##$NOISF2= 0
##$NSP= 0
##$NTH_PI= 0
##$NZP= 0
##$OFFSET= 16.522
##$PC= 1
##$PHC0= -49.89363
##$PHC1= 6.83798
##$PH_mod= 1
##$PKNL= yes
##$PPARMOD= 0
##$PSCAL= 4
##$PSIGN= 0
##$REVERSE= no
##$SF= 250.13
##$SI= 32768
##$SIGF1= 0
##$SIGF2= 0
##$SINO= 400
##$SIOLD= 32768
##$SREGLST= <1H.DMSO>
##$SSB= 0
##$STSI= 32768
##$STSR= 0
##$SW_p= 5175.98343685301
##$SYMM= 0
##$S_DEV= 0
##$TDeff= 65536
##$TDoff= 0
##$TI= <Analysis number 999999
Compound Code 99
Book Reference 9
Project Code 9>
##$TILT= no
##$TM1= 0
##$TM2= 0
##$TOPLEV= 0
##$USERP1= <user>
##$USERP2= <user>
##$USERP3= <user>
##$USERP4= <user>
##$USERP5= <user>
##$WDW= 1
##$XDIM= 32768
##$YMAX_p= 361172532
##$YMIN_p= -305204
$$ End of Bruker specific parameters
$$ ---------------------------------
##NTUPLES= NMR SPECTRUM
##VAR_NAME=  FREQUENCY,     SPECTRUM/REAL,   SPECTRUM/IMAG
##SYMBOL=    X,             R,               I
##VAR_TYPE=  INDEPENDENT,   DEPENDENT,       DEPENDENT
##VAR_FORM=  AFFN,          ASDF,            ASDF
##VAR_DIM=   32768,         32768,           32768
##UNITS=     HZ,            ARBITRARY UNITS, ARBITRARY UNITS
##FACTOR=    0.157963299565203, 1,           1
##FIRST=     4132.6476996994, 0,             0
##LAST=      -1043.33573715361, 0,           0
##MIN=       -1043.33573715361, -305204,     0
##MAX=       4132.6476996994, 361172532,     0
$$ Real data points
##PAGE= N=1
##DATA TABLE= (X++(R..R)), XYDATA
$$ [...]
##PAGE= N=2
##DATA TABLE= (X++(I..I)), XYDATA
25119G0417j5950J7297L6677j59o1052k8383l1470Q7887N9074j842K0147j1668
25107A40975K8786J3265P827n7729l238K9006k0918L755k1162o2309p536M4972
25095I5694K2542R279p945m1792J3603K9882j5494l8157n4104J1273M1145J6517
25083H2443J4952L1283N684n4714j1450O4466N2931n2204n6575K109k8815K7367
25071G7477q361J654K8052K4246J3112N471K0153M2345j82j7605k781m5413n805
25058A32363J7157K1855k9322l5468k0368n5753m1247N2038N7746J8728l563r1231
25046B2935m6016K6542P8367O0464l6075k7742J8066K7664k8723o4571p666J8811
25034D2056O8576L7513L962J7490l0055j1348K5698l5162K6119j3282k592L019
$$ y = [70417, 54467, 71764, 108441, 108282, 47230, 18847, -12623, 75264, 134338, 132496, 152643, 140975, 169761, 183026, 190853, 133124, 129886, 158892, 137974, 141729, 120567, 58258, 50722, 95694, 118236, 127515, 119570, 77778, 91381, 121263, 105769, 67612, 13508, 24781, 65926, 82443, 97395, 128678, 134362, 79648, 68198, 132664, 185595, 133391, 76816, 78925, 50110, 77477, 69116, 70770, 98822, 123068, 136180, 141651, 161804, 204149, 203967, 186362, 183581, 138168, 132363, 149520, 171375, 142053, 106585, 86217, 30464, -10783, 41255, 99001, 117729, 114166, 22935, -23081, 3461, 81828, 142292, 106217, 78475, 96541, 124205, 95482, 30911, 23245, 42056, 110632, 148145, 152107, 169597, 139542, 128194, 153892, 118730, 144849, 131567, 128975, 131994]
25022A31994l3747k5005L1739J3872M0224M76j6177n5199J1638Q814J798L6745
25010A47172J6192k9158K2418M4011l6559l5007J9172l2417k6871k0583J0526
24999G8896M3400J0431l458J9092j5270N71j0757q819l3032n759k7437o0091o525
24986a8758R0288K3925L4272L9569Q04k9246l9554m0503j601l6157J5175M9489
24974H7703l1032L547O8140M1471m681j4462n5583l758M4096j5651N1427J6616
24962A87833o5898r5158L853O3609M7921l1018K7233K2006k0392l2955J4530K915
24950A24479m9964m2355L1451P5142M4030K9806j0575n2071j8466Q419j7152O961
24938A29705k6503k4899O8805J7014n5919M370L5103L6547j0762n7643l0700j1415
$$ y = [131994, 98247, 73242, 104981, 118853, 159077, 159553, 143376, 88177, 99815, 108629, 110427, 147172, 163364, 134206, 156624, 200635, 164076, 129069, 148241, 115824, 88953, 68370, 78896, 122296, 132727, 129269, 148361, 133091, 133662, 122905, 114086, 81054, 75295, 47858, -12233, -18758, 71530, 95455, 129727, 169296, 170100, 140854, 101300, 60797, 59196, 23039, 38214, 87703, 56671, 60218, 128358, 169829, 165148, 150686, 95103, 91345, 135441, 119790, 171217, 187833, 121935, 26777, 30630, 94239, 142160, 111142, 138375, 160381, 139989, 107034, 121564, 124479, 74515, 32160, 63611, 138753, 182783, 212589, 202014, 149943, 131477, 139896, 122744, 129705, 103202, 78303, 147108, 164122, 108203, 112573, 147676, 184223, 173461, 115818, 85118, 73703]
24926G3703N2133P4588k3151q9501m1937j1468m791N3192n055j3158P286o231
24914F5610L9943J4945K7800j1574m5339r284m9193m807L5809L1307P614M4294
24902A47125M325l0472L105O90J4108j0983k0112m5434K3233m715k0216K7218
24890H7872K8568K2463n0715l9661L4796P7195N9605j5985j00276k1656J4454
24879I6660L7091O374K3080k1938k1114n566j8534J1335K79j9110p725L4987J0565
24866A26384l6327l981l9173n752J6636O1021p859L6324Q6552l7091n4136M3956
24854A86554J9485m075j7573m33k7230R064l522J729l0057j1720L2054L5568l3796
24841A56048j8510Pj8868j1061M0365L1089Q768J5020k6041l2120k9485m140M461
$$ y = [73703, 125836, 200424, 177273, 87772, 45835, 34367, 29576, 82768, 77713, 64555, 71841, 65610, 105553, 120498, 148298, 136724, 91385, 82101, 32908, 28101, 63910, 95217, 102831, 147125, 151450, 120978, 124083, 124773, 138881, 127898, 107786, 62352, 85585, 80870, 60654, 87872, 116440, 138903, 88188, 48527, 83323, 160518, 220123, 204138, 103862, 82206, 96660, 133751, 140125, 163205, 141267, 120153, 114587, 96053, 107388, 107667, 88557, 80832, 115819, 126384, 90057, 86076, 46903, 41151, 57787, 118808, 110949, 147273, 233825, 196734, 142598, 186554, 206039, 201964, 184391, 183958, 156728, 165792, 162270, 163999, 133942, 122222, 154276, 189844, 156048, 137538, 137545, 118677, 107616, 147981, 179070, 187838, 202858, 176817, 144697, 115212, 111072, 115533]
24828A15533k1238L1208j0129q341m811k6905j9400J1476k278J985P949L395O5022
24815A43466K6809k3790l7226l283L4761N0454k5633m0481m9280l7372J4044M7772
24803A00241J3560q359O32J6921N461K9943J9050m8217l6039k2489J6143K6020
24791A12867k00N3166k1195l0062k339k4571n190M509m7953R041M7754K9302k2209
24778A02920p517K5164j089K4820k5009n3956j4033R419K9869q490K7576M0377
24766A50051j3976m8901q279J4430o4K0008Q246L1729l0419J2872J2965r708J2772
24753A51726j0902k2927J9273J2513k5007k1679K5732N6928j4714k5652J2656
24742A57947n4854K732N1083J9096m3970k3377j5900J3459J8006n679N345J8578
$$ y = [115533, 94295, 125503, 115374, 107033, 102222, 75317, 55917, 67393, 65115, 67100, 75049, 78444, 143466, 170275, 146485, 109259, 105976, 140737, 191191, 165558, 125077, 75797, 38425, 52469, 100241, 113801, 105442, 106074, 122995, 128456, 158399, 177449, 129232, 93193, 70704, 86847, 112867, 112667, 165833, 144638, 114576, 112237, 87666, 82476, 86985, 39032, 48073, 95827, 125129, 102920, 95403, 120567, 119478, 144298, 119289, 65333, 51300, 60719, 90588, 82098, 109674, 150051, 136075, 87174, 78895, 93325, 93261, 113269, 121515, 153244, 122825, 135697, 148662, 138954, 151726, 140824, 117897, 137170, 149683, 124676, 102997, 128729, 185657, 170943, 145291, 157947, 103093, 105825, 156908, 176004, 132034, 108657, 92757, 106216, 124222, 118543, 123888, 142466]
24730A42466k403J0265o972J1165j0062j5145J7477M145l2072k3978L2746k2317
24718A05315j5111L4829L6649l5483l4977L1016k1022k5823J267M5088L2184K0065
24706A73997m0923n9688j4158L4496o722L3895j2349j4318K1617N261M8303n6860
24694A12551j7175K9463J48N049l9125j5239J3234M0897k2042J6588j029M6178
24682A69498K6184O657j7537k9832k33q789M991K2167l3830Q226n817K4549K3231
24669A89465j2302n7045k3963K2422k0932M8171Q159k3475P608p042l6085O416
24657A01397k2452J1827M4272j7858k1138j735j9716J7201P7254L1932m395k2138
24645A74451l4051O2938m1196m7006K0781K3696K8539k6625K0773l5797j8143
$$ y = [142466, 140063, 150328, 143356, 154521, 144459, 129314, 146791, 150936, 118864, 94886, 127632, 105315, 90204, 125033, 161682, 126199, 91222, 122238, 101216, 75393, 76660, 121748, 153932, 173997, 133074, 73386, 59228, 93724, 87002, 120897, 108548, 94230, 115847, 121108, 169411, 112551, 95376, 124839, 124987, 130036, 90911, 75672, 88906, 129803, 107761, 124349, 123320, 169498, 195682, 202339, 184802, 154970, 154737, 145948, 150939, 173106, 139276, 147502, 141685, 166234, 189465, 177163, 120118, 96155, 118577, 97645, 145816, 153975, 130500, 138108, 131066, 94981, 101397, 78945, 90772, 135044, 117186, 96048, 94313, 74597, 91798, 169052, 200984, 196589, 174451, 140400, 203338, 162142, 115136, 135917, 159613, 188152, 161527, 182300, 146503, 128360]
24634A28360k9619j1017L0344R7070K7845l7443l5211p945J6914n860l7998m7502
24622H7938K9521n191k7445K3595K9406J0687N072L9831J6479J538l9267n5945
24610A16219J142P523L3094j5032Q945k3496J5448l2254o2734K4022M6113L0663
24598A49653Q47j3137J2381j9271o5485m0577M1447j3679K421K1809k3017K3558
24586G6950M7287K2243K5165J6009o2719j9416k809J0626L3578J4137J9599k5339
24574A55311L2722L9855j4175k2084k3071k5567R988j1299N31k993p478k3529
24562A08211N0982K6189k6553k9702J1098j9180M89P1606j5163k7964j4700n6679
24550G8634l7104J4352J0391Q712L4660J8016K9918K0449j7533l6641l7979l9349
$$ y = [128360, 98741, 87724, 118068, 215138, 242983, 205540, 170329, 162384, 179298, 173438, 135440, 87938, 117459, 112268, 84823, 108418, 137824, 148511, 153583, 193414, 209893, 211431, 172164, 116219, 117361, 124884, 157978, 142946, 151891, 128395, 143843, 111589, 48855, 72877, 118990, 149653, 150500, 137363, 149744, 130473, 64988, 24411, 65858, 52179, 54600, 76409, 53392, 76950, 124237, 146480, 171645, 187654, 124935, 105519, 102710, 113336, 146914, 161051, 180650, 155311, 188033, 227888, 213713, 191629, 168558, 142991, 152979, 141680, 142211, 139218, 131740, 108211, 159193, 185382, 158829, 129127, 140225, 121045, 121534, 193140, 177977, 150013, 135313, 78634, 41530, 55882, 66273, 74985, 109645, 127661, 157579, 178028, 160495, 123854, 85875, 46526]
24538D6526K856M1382L172K9769J9067l510k9555K3278M3624j1993N059J3598
24526A83273m902l2238q266n773O0662O657k6066k5672n4639P45L4855k4927N460
24513A09169M1538M1222r149n5078l1926l5477M5694K3547j007L2119R840j7362
24501A53130M1282N2674k1728k6137J0475k004L5403J4659j7227j401j9684n2013
24489A67429J0811l44m9943M7225K7334k9577J6265n199o981L166K125k7743Q221
24476A62789k2913K5461M260j0677k5689K2307J3626R599J9914k5556l3012k8091
24464A12018L600M5777N443j5603j1764N718J2957N2458J1320p823n8504l0399
24452A25198J0408J6637L6244Q298K6585m821k4145l2611l234n38j7054J2859
$$ y = [46526, 49382, 90764, 93936, 123705, 142772, 139262, 109707, 132985, 176609, 164616, 169675, 183273, 178371, 146133, 137867, 132094, 192756, 199413, 173347, 147675, 93036, 93781, 128636, 103709, 109169, 150707, 191929, 182780, 127702, 95776, 60299, 105993, 129540, 128533, 160652, 170492, 153130, 194412, 247086, 225358, 199221, 209696, 207692, 243095, 257754, 240527, 239126, 219442, 167429, 178240, 177896, 127953, 175178, 202512, 172935, 189200, 184001, 177020, 180186, 182311, 154568, 162789, 139876, 165337, 169597, 158920, 133231, 155538, 169164, 178763, 198677, 173121, 140109, 112018, 115618, 161395, 166838, 151235, 139471, 145189, 158146, 210604, 221924, 214101, 155597, 125198, 135606, 152243, 188487, 196785, 223370, 218549, 194404, 161793, 158559, 158021, 140967, 153826]
24440A53826q683l8314J1682K8375k803k0393L451N077K4762j0010o818j4232
24428A25920M3517L4914L2855m4948l3129J1482j4252k5368K7656L0974m6314
24417A43307j0320Q945O871j40j4193J2094M75k9757P269O1101N472n5218L2502
24404A68408l8714n4472l5993j1338M8217N5294j2586J205q1303k0059O2631N1347
24392A32637p621k59l5972Q707J5175L6342J9923M9958m691j0802L9089R483j4157
24379B37812L5267q967l8646K8160m3832j2288j0157j9138J173J4711q037K1895
24367A97953k3003l023K2520J1785j0245K9898J5127k6126m633m627l3445J2120
24355A84301k2670N1894J8444j6473J8324J8820j7331j6662m4200l6597p588K4537
$$ y = [153826, 145143, 106829, 118511, 146886, 144083, 123690, 127141, 132218, 156980, 146970, 140152, 125920, 169437, 204351, 237206, 192258, 159129, 170611, 156359, 130991, 158647, 189621, 143307, 132987, 141932, 148803, 148663, 134470, 146564, 147039, 117282, 124551, 185652, 191124, 135906, 168408, 129694, 75222, 39229, 27891, 76108, 131402, 118816, 120021, 38718, 18659, 81290, 132637, 125016, 124757, 88785, 97492, 112667, 149009, 168932, 218890, 214199, 203397, 242486, 251969, 237812, 273079, 264112, 225466, 253626, 209794, 197506, 187349, 168211, 169384, 184095, 176058, 197953, 174950, 171927, 194447, 206232, 195987, 225885, 241012, 214886, 210253, 205626, 172181, 184301, 161631, 213525, 231969, 215496, 233820, 252640, 235309, 218647, 174447, 137850, 130262, 154799]
24343A54799K246j9984k2429K3060J04418k3818l5040m778N2997K0257L592p1506
24331A83814l1975q811K2071j5048k1803M0876l5967m1524N7355N3435j8717k9663
24319A54043n605j8393k8725P980M8412J4454P511m7780r187L1238o147J3521
24307A61322K412K79l5531j9515j4602J0956K4665L251J2843M9860q1941m3947
24295G0052N6481L7769N662J9913L0193M801o531p4159l2008k031N8970L543n4433
24282A18222L3731Q9030M6249k3934l0817K7300k3474J816j7111n5303Q207L5615
24270B09531M238J8247l3583l1554R697l5093j9230L3730K5783m281p1461l5825
24258G0199K495M9049L249j2802K0782k7382j236k0451m926j4240O0762K3526
$$ y = [154799, 157045, 137061, 114632, 137692, 242110, 218292, 183252, 178474, 231471, 251728, 255320, 183814, 151839, 143028, 165099, 150051, 128248, 169124, 133157, 91633, 148988, 202423, 183706, 154043, 148438, 130045, 101320, 109300, 157712, 172166, 179677, 131897, 122710, 153948, 147801, 161322, 163734, 164013, 128482, 108967, 94365, 105321, 129986, 133237, 146080, 195940, 113999, 70052, 126533, 164302, 169964, 189877, 220070, 224871, 218340, 144181, 112173, 110142, 169112, 172655, 118222, 151953, 240983, 287232, 263298, 232481, 259781, 236307, 238123, 221012, 165709, 173916, 209531, 213769, 232016, 198433, 166879, 176576, 141483, 122253, 155983, 181766, 177485, 106024, 70199, 72694, 121743, 124992, 112190, 132972, 105590, 104354, 83903, 78977, 64737, 125499, 149025]
24246A49025q4787k0627M7752K3665K1653J8619L8808K2071n1318J3653O3234
24235B41748k6027k9703m1931R315l520j2397j1377l2559j3292M6541J3905k3047
24223A17656k5138J0037K9156L2450K1589j0176J4822K1143k6168K4773m4277
24212A65867L3744M5211j8216J9676m7272o0595m754j1602k7306J2415M712N0315
24200A62195N3432p274q538K5329r134j8492n342M0672P286k1055K2296j7384
24188B23991k3949l9539k2504L7542Q559j0499K934N3436J6512p8154l4418k040
24176A31871K4616q3659n1851L8739P8533j0637n0361J1686R5177L0555k1172
24165A93497l2768j5243m50J2763j2067P036J1683k2836l8164r786l013O6473
$$ y = [149025, 64238, 43611, 91363, 115028, 136681, 155300, 194108, 216179, 164861, 178514, 241748, 215721, 186018, 144087, 153402, 149882, 137485, 126108, 93549, 80257, 126798, 140703, 117656, 92518, 102555, 131711, 164161, 185750, 175574, 190396, 211539, 185371, 210144, 165867, 199611, 244822, 226606, 246282, 199010, 138415, 133661, 122059, 94753, 107168, 111880, 162195, 215627, 208353, 199815, 225144, 216010, 197518, 192176, 232848, 240134, 219079, 241375, 223991, 200042, 160503, 137999, 175541, 184100, 173601, 176535, 229971, 246483, 168329, 133911, 131871, 156487, 72828, 20977, 59716, 138249, 127612, 77251, 88937, 184114, 214669, 193497, 160729, 145486, 145036, 157799, 145732, 152768, 164451, 141615, 103451, 93665, 90652, 157125]
24153A57125J8226m6169J8944L0686m3076k3965K1547M3684m2238l8903K3320
24142A19181L7522J2993M3340l0980k4600j9865j7165k1016l419J2880L4269R124
24130A52264p101K5338L5550J1275l2560J8043M1356l3093o420L3675O074j8038
24118B26363K5398K4924m6983l2984R375O6160K9641l4833p310o729M21l5050
24106B18393k0455k4498O2800J6630K995l658j0247J6457m6826M254k0736l4931
24094A60178M9207J5718o0342K1953L0176J9052L309k5333k1001J573m4733j9535
24082A30222M8265p638R613n860j7903k1562K8328K0781k8876n31J2978K7775
24070A95592j8534l9333M8003K1216l5580l7967m013K1179L3823m8330l0190j2269
$$ y = [157125, 175351, 129182, 148126, 178812, 135736, 111771, 133318, 177002, 134764, 95861, 119181, 156703, 169696, 213036, 182056, 157456, 137591, 120426, 99410, 95991, 108871, 143140, 152264, 145163, 170501, 206051, 217326, 184766, 202809, 244165, 211072, 204652, 238327, 244401, 226363, 251761, 276685, 229702, 196718, 206093, 272253, 301894, 267061, 259751, 253022, 253443, 218393, 197938, 173440, 236240, 252870, 255865, 252207, 241960, 258417, 211591, 215845, 195109, 160178, 209385, 225103, 164761, 186714, 216890, 235942, 239251, 213918, 192917, 194490, 149757, 130222, 178487, 170849, 180462, 174602, 156699, 135137, 163465, 184246, 155370, 154839, 167817, 195592, 177058, 137725, 185728, 206944, 171364, 133397, 129384, 150563, 184386, 136056, 105866, 93597]
24058I3597J1560J7152j8076O1328P5399l4466Q33K7864l3761o0209N1585L4258
24046B27064K602k8088J9753J8059p504O25m8624m4573J0185P85R955N4593J7648
24033B32480j6522o161m616J1963j3784m9225O524m2963L0645Q1197N321j5491
24021B19368k4396m4722J2060L921m073N8244J8263o7998j4401J8351m776j7689
24009A52152k7950J8692k6202n4J8042L05K8198m9291l3988N3993k2177j314J0208
23996A20614M5672n461j5039J6031J8295L5479k0664K8173J3635j2450m2909m1445
23984A39931P1252P046k4925J0082k0612J8389Q4151P686n3662J687M5238l4909
23972B51354j9341J8403j2282p4821k2992K8226O5927L9204J6291J1129j3977
$$ y = [93597, 105157, 122309, 104233, 165561, 240960, 206494, 207327, 235191, 201430, 141221, 192806, 227064, 229666, 201578, 221331, 239390, 231886, 232511, 183887, 139314, 149499, 150284, 160239, 214832, 232480, 215958, 209797, 205181, 217144, 203360, 154135, 160659, 117696, 148341, 229538, 234859, 219368, 194972, 150250, 162310, 166231, 162158, 220402, 238665, 170667, 156266, 174617, 169841, 152152, 124202, 142894, 116692, 116638, 134680, 134985, 163183, 113892, 79904, 133897, 111720, 110406, 120614, 166286, 160825, 145786, 161817, 180112, 215591, 194927, 223100, 236735, 224285, 181376, 139931, 211183, 218229, 193304, 203386, 182774, 201163, 285314, 293000, 239338, 241025, 286263, 251354, 232013, 250416, 238134, 163313, 140321, 168547, 234474, 273678, 289969, 301098, 287121]
23961B87121Q831M463j1703j06140l171j4299l9657K799K5153J3725q814p452
23949A50856l7912J2330L7842j2359K3224M3727R705k447N0580k8223o5135k5402
23937A56786J994L436Q401k3552j4921L0049K0783k070L0474M817n3744m8078
23925A14375l3297P1705M2375j5166K490k3006J74J7811o41J1380J297m4990l6050
23912A08457J5950J0275k3915j0385M2751J7624K4038k7187o105Q5000K3724m3379
23900B16848l7859J5947M4662K3522J0149K1137K2268l3847l7911m248k8690k7392
23888A84586J0082K962k8820r170l8011r932O802K4541L4308P583L6325M0943
23876B62199M1754o611m7937m5374L0519L4604J4674k1188p576j195k083J6618
$$ y = [287121, 295952, 300415, 288712, 182572, 179401, 165102, 125445, 128244, 153397, 167122, 158308, 150856, 112944, 125274, 163116, 150757, 173981, 217708, 227413, 224966, 275546, 247323, 182188, 156786, 158780, 162216, 170617, 147065, 132144, 162193, 182976, 180906, 211380, 216197, 162453, 114375, 81078, 152783, 195158, 179992, 182482, 159476, 159650, 177461, 176820, 188200, 189497, 144507, 108457, 124407, 134682, 110767, 100382, 143133, 160757, 184795, 157608, 151503, 236503, 260227, 216848, 178989, 194936, 239598, 263120, 273269, 294406, 316674, 282827, 244916, 240668, 211978, 184586, 194668, 197630, 168810, 159640, 121629, 111697, 118499, 143040, 177348, 184931, 221256, 262199, 303953, 297342, 249405, 204031, 234550, 269154, 283828, 262640, 255064, 253869, 251786, 268404]
23864B68404P236o4627R667j973J6347J6359j180j3105l7110l0368M5756o733
23852B08673k4446m0603K6989N0562m1884m9298K4015O5140m4712j9835l6402
23841A18199N9510K3922J9104j0097j5032l3499l8369j7244j748J4333L3741J4449
23829A67269K9049N3355k9492o4209N751L9485O011K8405L037J7890R096m4536
23817B21111n3175J4111K8077k6387p979j0912K2212M2867J521m1536J8655M8287
23805B56852J4650R984j2042n470J9155L356k9741l0707k0276r77K3259J3593
23793B41636O930j1403j2235q998j5847j3909l1041L1101J1754o039k7483l2394
23781A32072K2220j0761j2475J6503M1203K342k9178j8722K0357m007m464K1220
$$ y = [268404, 275640, 211013, 220680, 218707, 235054, 251413, 250233, 237128, 200018, 169650, 215406, 208673, 184227, 143624, 170613, 221175, 179291, 129993, 154008, 219148, 174436, 154601, 118199, 177709, 201631, 220735, 210638, 195606, 162107, 123738, 106494, 104746, 119079, 152820, 167269, 196318, 249673, 220181, 155972, 161723, 201208, 207219, 235624, 238661, 256551, 265647, 221111, 167936, 182047, 210124, 183737, 175758, 164846, 187058, 229925, 231446, 189910, 208565, 256852, 271502, 281486, 269444, 263974, 283129, 286485, 256744, 226037, 205761, 204784, 228043, 241636, 248566, 237163, 224928, 215930, 200083, 186174, 155133, 186234, 197988, 191949, 164466, 132072, 154292, 143531, 131056, 147559, 188762, 191104, 161926, 143204, 163561, 159554, 155090, 176310]
23769A76310M540L2402M400J4861j4575J1357K3863J3671m7228k1417j2893J8761
23757B04052P283J7979k7824P030M3056M1097n5195m0955J1618L5914M0060L2533
23745C16648J2825l5754m0786l3750K1289k4567l0372k2143n596n637K9997L284
23733A85438j951K8540K8267N1426j3633k393l7245l6199K5443j5715m473o2p1807
23720A35636p434o756K561j148J7723m372L291J3195k8053j3201O5189P3334k8011
23707B21954n8330m2728J0131J9953l895M2219L4391j0465N1887q314L2666m9946
23695B39523n0793Q359K5717n785k4214J8578K5784k5774J834m0059m0903J3177
23683A45444Q0688K1817j7644p809m790q953L7777o96N188J3748M248r267k1096
$$ y = [176310, 180850, 213252, 217652, 232513, 217938, 229295, 253158, 266829, 219601, 198184, 185291, 204052, 211335, 229314, 201490, 208520, 251576, 292673, 237478, 196523, 208141, 244055, 284115, 316648, 329473, 293719, 252933, 219183, 240472, 215905, 185533, 163390, 157794, 152157, 182154, 185438, 183487, 212027, 240294, 291720, 278087, 275694, 238449, 202250, 227693, 211978, 207505, 207443, 135636, 128202, 121446, 124007, 122859, 140582, 136210, 139501, 152696, 124643, 111442, 176631, 249965, 221954, 163624, 120896, 131027, 150980, 147085, 189304, 223695, 213230, 265117, 256803, 289469, 239523, 188730, 197089, 222806, 217021, 192807, 211385, 237169, 211395, 213229, 173170, 132267, 145444, 226132, 247949, 230305, 222496, 217706, 208753, 246530, 245834, 251022, 264770, 269018, 259751, 238655]
23670B38655j1824P174m3543k8784J1334K0988r02K3667M2145J9474o463m2142
23658B29779K6909N7242n4383m9334M114k185j570J9508L2014J0509k0850n6702
23646A95051l5375N7631J7258M892K2995q030n2248p0621L0051M8777l5524L3126
23634B07983N763P994J3633K4205o4310l4243R057K8830J720m3620K496M491L2484
23621A96483L4990K9370k8242n7020l8142J8980L0692n3316K3524M0659R155k761
23609B04372j1976k2898n94K3217k0648m3235J7349J0669l070L4820J8844l745
23597B03105K454N0594m2007l4138O737j0591M5313M7715j6758n5197J0520j1114
23585A96633L4080P1972k1644j6408p1707K9773J9956k3055j7416L9433L8091
$$ y = [238655, 226831, 234005, 190462, 161678, 173012, 194000, 193098, 216765, 258910, 278384, 271921, 229779, 256688, 313930, 259547, 210213, 214327, 212142, 210572, 230080, 262094, 272603, 251753, 195051, 159676, 217307, 234565, 239457, 262452, 254422, 202174, 131553, 161604, 210381, 174857, 207983, 213746, 221740, 235373, 259578, 195268, 161025, 170082, 198912, 200632, 157012, 159508, 163999, 196483, 231473, 260843, 232601, 175581, 137439, 156419, 187111, 133795, 157319, 197978, 207133, 204372, 192396, 169498, 168904, 192121, 171473, 128238, 145587, 156256, 153186, 188006, 206850, 203105, 205559, 256153, 214146, 180008, 186745, 176154, 221467, 269182, 252424, 197227, 207747, 196633, 230713, 302685, 281041, 264633, 192926, 222699, 242655, 219600, 202184, 241617, 279708]
23574B79708N318J2368k7371l1882l7504p716J6682n098O1081M1165M917q18j3831
23561B97019l8250m037k7759J4143L2697J1275p104J2507j0339Q62j8806j7661
23549B44547k6576k3385M5635L7591k3906n7285J1723j227J3893J3320j0467M249
23537B28112L0199K0851m3131l8464o199J7555l4371o953N3966Q65k111N7753
23525B78072L1539L7309r89m674J6117l0193m4628k3845k2817p890K9366K9137
23513B86504j2646M0254K640k5813k3704o455J679l041O537j3695m6799n7921
23501A47540n709K3668n885l9162L7356K5721j1539L601K0089M6641k1849j0776
23489B09696K8958j9400j3106q941L6881k624J6193K130n007l361N316j4597M1428
$$ y = [279708, 285026, 297394, 270023, 238141, 200637, 192921, 209603, 204505, 265586, 306751, 311668, 310850, 297019, 258769, 254732, 226973, 241116, 273813, 285088, 277984, 290491, 280152, 281014, 262208, 244547, 217971, 194586, 240221, 277812, 253906, 196621, 208344, 207117, 221010, 234330, 223863, 228112, 258311, 279162, 236031, 197567, 191368, 208923, 174552, 167599, 221565, 222430, 220319, 278072, 309611, 346920, 345931, 341257, 357374, 327181, 282553, 258708, 235891, 228001, 257367, 286504, 273858, 314112, 316752, 290939, 267235, 260780, 262459, 259418, 265955, 252260, 205461, 147540, 141831, 165499, 159614, 120452, 157808, 183529, 171990, 175591, 195680, 242321, 220472, 209696, 238654, 219254, 206148, 197207, 234088, 231464, 247657, 249787, 244780, 241419, 246735, 232138, 273566]
23476B73566l194J7103K7458J1424l0278j8914j5106K2434J0220M9088r367k9290
23464C05144l0029m5369m3230N4351J3627k3256P643L7550r710P913m3542p6588
23452A54504j7616J8234L3593k891l068m2072K1492M2382N945M1871J6591n056
23440B63909J325k1814j9547K9288K2154j7626P446j5020J3601l1108k0048M9510
23428B62070M3696m5067k1011M15q1214k1734l5274L5573L9435L1296J6760l950
23416B20995j8968K7312j3181m4312K9064J7353N45J1847K6708J0229J2604n0369
23404B29827o8593M8399J05840L7348l6585k8040k7311k6867j2969O764r032j6495
23392B02286N764k6806j1876r084j4739L4983M7628k4293j6112l6064J1506M5475
$$ y = [273566, 270372, 287475, 314933, 326357, 296079, 277165, 262059, 284493, 294713, 343801, 334434, 305144, 275115, 229746, 186516, 240867, 254494, 231238, 238881, 276431, 266721, 274634, 231092, 154504, 136888, 155122, 188715, 185824, 182756, 140684, 162176, 204558, 210503, 252374, 268965, 263909, 265234, 243420, 223873, 253161, 275315, 257689, 265135, 250115, 263716, 232608, 212560, 262070, 305766, 260699, 239688, 240103, 158889, 137155, 101881, 137454, 176889, 208185, 224945, 220995, 202027, 229339, 216158, 171846, 200910, 218263, 218808, 230655, 257363, 267592, 280196, 229827, 161234, 209633, 315473, 352821, 316236, 288196, 260885, 234018, 221049, 227813, 218781, 202286, 208050, 181244, 169368, 160284, 145545, 180528, 228156, 203863, 187751, 151687, 163193, 208668]
23380B08668J7291j9803M40L9862J7694J5567l644j3153k6982k6572j0759l1491
23368A67118k2151L0969l497n9976l0679N4106J04858K8398l8116L7304L1221
23357B99555l4275l522K6535N125J9476J825J0697j7307n0930j2986P4524J0057
23345C28774k3284J3675j891n3816o3600k7308J6146k690L4693l607j2493M7314
23333B51913J2246m1501O13l8660j5209K2151M935L3017l3908m9560L1306P1046
23321B48389M4796k9304l6379K506J2081N0234k951n6299k0456J4022N5196k2367
23309B59468j3235L2427J3468L6201m443q313l6272r1803J101L9587R690K3835
23297B61711K4166L0688N2239j9139o8419q9522l7494M1884N6615N8131O28l3942
$$ y = [208668, 225959, 206156, 206596, 246458, 264152, 279719, 276075, 262922, 235940, 209368, 198609, 167118, 144967, 175936, 172439, 112463, 81784, 135890, 240748, 269146, 231030, 268334, 299555, 265280, 261758, 288293, 293418, 312894, 314719, 325416, 308109, 257179, 244193, 318717, 328774, 305490, 319165, 317274, 263458, 199858, 172550, 188696, 186006, 220699, 217092, 204599, 251913, 264159, 222658, 223271, 184611, 169402, 191553, 196488, 229505, 195597, 146037, 177343, 248389, 293185, 263881, 227502, 230008, 242089, 292323, 289372, 233073, 212617, 226639, 281835, 259468, 246233, 278660, 292128, 328329, 323886, 315573, 279301, 187498, 188599, 228186, 237876, 261711, 285877, 316565, 368804, 349665, 281246, 191724, 154230, 196114, 252729, 310860, 311488, 277546]
23285B77546l5750J0763M549j2731N6616L5466J8970k5067j6593l1354l4286m710
23273B43419j5661J7696j420J8660j0763j8487K9918K696K6568J4422q038k2365
23261B76645l6590j6714M210k6704N153J3362j1142l7818j7862L8241Q988J5926
23249B15695J1938J8852J810j4664l5941K203M0988P1446L2423j4052j0709l3096
23237B86893K6119N200k1156m6283p486j892O5921P1429r438l4709m4161K1011
23225C11448J0638l0915j1476L102k7569J9204K3505l1817j3679K2823n576M028
23213B73716J1243p821L7459R056q597j1799K706k1307k6388R097L7271K5986
23201C30622k3998l180k3715j8049m9428j0570M1273k9189m3088K1324L7870J8050
$$ y = [277546, 241796, 252559, 257108, 244377, 300993, 336459, 355429, 330362, 313769, 282415, 248129, 243419, 227758, 245454, 244034, 262694, 251931, 233444, 263362, 266058, 292626, 307048, 299010, 276645, 240055, 223341, 227551, 200847, 206000, 219362, 208220, 170402, 152540, 190781, 199769, 215695, 227633, 246485, 248295, 233631, 197690, 199893, 240881, 312327, 344750, 330698, 319989, 286893, 313012, 318212, 297056, 250773, 243287, 241395, 307316, 378745, 369307, 334598, 290437, 311448, 322086, 291171, 279695, 282797, 255228, 274432, 297937, 266120, 252441, 275264, 269688, 273716, 284959, 277138, 314597, 323653, 315056, 303257, 305963, 284656, 258268, 267365, 304636, 330622, 306624, 303444, 279729, 261680, 212252, 201682, 242955, 213766, 170678, 192002, 229872, 247922]
23189B47922m8229l8383K175J9102M5655K5409k6859k1128K773L9380M5679k5775
23177B67721l238l279k3430k3592K846Q855M1252L0031r531k4519K2722L3813
23165C19651N739o5745M406Q043o0608J5548l5410K9877K4715m2011J2333J8026
23153B34564k5003m480J7354n9510j7524O6183j2850N968j6231k3360L7654K0775
23141B23540K1679k9264J2499J2680l783J446k8388K4639r641M8463l2216n5767
23129A85887K5467K1537O5564M1091l9382p337N7533k4531k9313j7849j2465n171
23117B61031k0472N483P3932K7371J745k5835j5023J9195q051j9302k3464L9027
23105C15637r039q3168j7496L1299J3837R521L0463m0628L2971j0110N046K0998
$$ y = [247922, 199693, 161310, 163485, 182587, 228242, 253651, 226792, 205664, 208437, 247817, 293496, 267721, 264483, 261204, 237774, 214182, 217028, 225883, 267135, 297166, 287635, 263116, 285838, 319651, 325390, 259645, 264051, 272094, 211486, 227034, 191624, 221501, 246216, 204205, 216538, 234564, 209561, 205081, 222435, 162925, 145401, 211584, 198734, 204702, 188471, 165111, 202765, 223540, 245219, 215955, 228454, 241134, 237351, 238797, 210409, 235048, 225407, 273870, 241654, 185887, 211354, 232891, 298455, 339546, 300164, 292827, 350360, 325829, 296516, 278667, 266202, 261031, 240559, 246042, 319974, 347345, 349090, 323255, 308232, 327427, 319376, 300074, 276610, 315637, 306598, 223430, 205934, 237233, 251070, 260591, 291054, 250426, 283397, 273287, 278333, 299331]
23093B99331K5094l5581k2133m4395k6829L0984k3015p265M7202M3910r944L616
23081B80975M769j7718k8024m3029o3627J9271N4020M5324K6603K2805m197N8867
23069C56039k2982j252L469j3991j4166m3008J1582M1255j3438M0750L5222M2019
23057D21499l2524n3233r7338o0982L4227N9307J4957P936N0865n696o4810N933
23045B80141K6643k784j7434J7509k0333k3607n399M209l032q936M9710N427j4838
23032B87276k491j1467J8487k0980k7436M5092M0953k6818k1666l3415J7078k1865
23020B42748j1781j911K9308r641j0268M3368K3608J8975j3857m1768l6325q256
23008B24200L755J474o979P820L1422K3844J99L6475K1599j4529o9461J6751M3427
$$ y = [299331, 324425, 288844, 266711, 222316, 195487, 226471, 203456, 196191, 243393, 287303, 277359, 280975, 285744, 268026, 240002, 196973, 133346, 152617, 206637, 251961, 278564, 301369, 297172, 356039, 333057, 331805, 335274, 321283, 307117, 264109, 275691, 316946, 303508, 344258, 379480, 421499, 388975, 335742, 238404, 177422, 211649, 270956, 285913, 293849, 344714, 339018, 274208, 280141, 306784, 304000, 286566, 304075, 283742, 260135, 254736, 258945, 255913, 246977, 296687, 302114, 287276, 284785, 273318, 291805, 270825, 243389, 288481, 329434, 302616, 280950, 247535, 264613, 242748, 230967, 229056, 258364, 248723, 238455, 281823, 305431, 324406, 310549, 268781, 232456, 224200, 227955, 229429, 222450, 230270, 261692, 285536, 285735, 322210, 343809, 329280, 259819, 276570, 319997]
22995C19997r828m5362o0872l047O6780N0012L8590J5471j2460k0977k9577K4362
22983C33089j8700m0172Q745l1209m5374q028K6448M5279j410L8359k6095p0208
22971B10724R329j279M1302J3336N779J7147L7147j4744j6421l6j3275J2451L4244
22958C35704J2144k5278j9122q462J4438J2433K7437N7249q555o0995k9786k3197
22946B84010l2809K1001N7670J3273p091j7647L5790O1378j7058m4298l0461r262
22934C14496k8517L3088M2253J9864l7269l8628j472k3108J1402K7859n9155j7911
22922B42902N1864K7526m776J980J4154l6318l7657J9808Q752J0446K0932L9888
22910C59501p7368k5671J7910k3847R922N7264j6557l6597k0470J5022L1662J1108
$$ y = [319997, 310169, 264807, 203935, 200888, 267668, 317680, 356270, 371741, 359281, 338304, 308727, 333089, 314389, 274217, 282962, 251753, 206379, 198351, 224799, 270078, 268668, 307027, 280932, 210724, 220053, 218774, 260076, 273412, 279191, 296338, 333485, 318741, 302320, 302284, 289009, 301460, 335704, 347848, 322570, 303448, 294986, 309424, 321857, 349294, 406543, 397988, 336993, 307207, 284010, 251201, 272202, 329872, 343145, 336054, 318407, 354197, 415575, 398517, 354219, 323758, 314496, 285979, 319067, 361320, 381184, 343915, 305287, 303815, 280707, 292109, 319968, 260813, 242902, 294766, 322292, 317516, 319496, 333650, 297332, 259675, 279483, 288235, 298681, 319613, 359501, 282133, 256462, 274372, 250525, 260447, 317711, 301154, 264557, 244087, 259109, 290771, 301879]
22898C01879N512l3690m4123k5931N5796M3731j4492k0223k9848l1356k0375K2079
22886B08959O1067K1501J874J5378p149O629J8558L1563L2351K6754q078k0692
22874C88715j3028j0556k3466m323L0327N224j8889m1154k6009J0501l0414n2615
22862B14313O119J0907k1794j0599j4251k05K1863M5268N0056J5041J6303m8194
22850B84827o1807k2957J4436J1831N747J3160J9793L845J0728K1578m0967M9985
22838C10199j5607k7814k2751M0211J6904l799k9662p551M2856j0111N03j6769
22826B76609l1928M1607K8359n046n5125K7541j0059k0243k192k173M3248q527
22814B82071j8507J063l2841O986M1139L938j5022M5790J8643n0514k7163L2724
$$ y = [301879, 307391, 273701, 229578, 203647, 259443, 303174, 288682, 268459, 238611, 207255, 186880, 208959, 270026, 291527, 293401, 308779, 301630, 308259, 326817, 358380, 390731, 417485, 409407, 388715, 375687, 365131, 341665, 337342, 367669, 372893, 354004, 312850, 286841, 297342, 266928, 214313, 220432, 231339, 209545, 198946, 184695, 184490, 206353, 251621, 301677, 316718, 333021, 284827, 223020, 200063, 214499, 226330, 232077, 245237, 265030, 268875, 279603, 301181, 260214, 310199, 294592, 266778, 244027, 284238, 301142, 297343, 267681, 260130, 302986, 292875, 293378, 276609, 244681, 286288, 314647, 309601, 254476, 282017, 271958, 251715, 249523, 247350, 290598, 282071, 263564, 264627, 231786, 238772, 279911, 283849, 268827, 314617, 333260, 282746, 255583, 288307]
22802B88307N2874j5787m594L7635j8873l3146M501j1595J4523q281k813M0138
22790C42889p646p4389k4305L0031q529k4788J7941Q861P0779j4094o9169l9982
22778B07599K4527L7152J6806k3880j3338q361P035L6493k0251l0666M8295J4924
22766B96335j9431k4838L869P240J4731J8063J1448p827l296Q984n9712j5973
22754B29593M9449k363N6081l0346k8292N456J3175j9140l0491K9264K6130L015
22742C01531J7930n434J7040o162m5513m2163O42O0509N2216L2425k2825l056
22730C57140K1697k2520m5282l1792J1684K1631m5765l0214m989K4899P7327K1361
22718C55177l4928m442l6861J49N3185M1026K0183k9615k5439N436k3218j4969
$$ y = [288307, 341181, 325394, 320800, 358435, 339562, 306416, 310917, 299322, 313845, 305564, 302751, 342889, 335243, 260854, 236549, 266580, 258051, 233263, 251204, 260065, 330844, 316750, 247581, 207599, 232126, 269278, 286084, 262204, 248866, 240505, 247540, 284033, 263782, 233116, 281411, 296335, 276904, 252066, 255935, 263175, 277906, 295969, 307417, 299590, 296294, 305278, 245566, 229593, 279042, 276679, 332760, 302414, 274122, 279578, 292753, 273613, 243122, 272386, 298516, 301531, 319461, 314027, 331067, 324905, 279392, 237229, 237871, 298380, 350596, 383021, 360196, 357140, 378837, 356317, 311035, 279243, 290927, 312558, 266793, 236579, 231590, 256489, 333816, 355177, 320249, 315807, 278946, 279095, 332280, 373306, 393489, 363874, 338435, 343871, 320653, 305684]
22706C05684l8151l036M3313m0461J9551N887M993j086l1579M807N8650K6035
22694C54607m2358n712K1682K7795J3299k6618k7179k1285n540q488m3916L5008
22682B71295J1313o958L7799J6787j6870L1763N148k6577l1350L1179J5416Q1
22670C39026m8549n178m708J30j8635l5450n324P0297M6184j8979q390n4994L2919
22657B88349M8143K2366Q673K822l9677j0124K6873J499l4304j0202j6216J2879
22645C01081L2779k102R700K7042L3334L9783Q971n0471l4944J0138m8764j8031
22633C08516m6419m1529L6584M8486k2352K5829r661j3973m9790M0980Q6736M1975
22621D05382J0610m8093k6224m5557m2156L4503J5586j5117k0410k6056N952L8801
$$ y = [305684, 267533, 264497, 307810, 267349, 286900, 292787, 297780, 296694, 265115, 269922, 328572, 354607, 312249, 306537, 328219, 356014, 369313, 342695, 315516, 294231, 288691, 280203, 236287, 271295, 282608, 275650, 313449, 330236, 313366, 345129, 350277, 323700, 292350, 323529, 338945, 339026, 290477, 285299, 280591, 280721, 262086, 226636, 221312, 291609, 337793, 318814, 310424, 255430, 288349, 336492, 358858, 367531, 370353, 330676, 320552, 347425, 348924, 314620, 304418, 288202, 301081, 333860, 331758, 341458, 368500, 401834, 441617, 450588, 400117, 365173, 375311, 326547, 308516, 262097, 220568, 257152, 305638, 283286, 309115, 299454, 285481, 235691, 276671, 363407, 405382, 415992, 367899, 341675, 296118, 253962, 288465, 304051, 288934, 268524, 242468, 248420, 287221]
22609B87221O0461q81n3323n806J1946J5163l0295m7163l4927M0287J7473k3831
22597B36325j1278O3721P7229p3496n0445J4726K5062L3660k0735N5005J3998
22586C63772j218o474J6598L267l9078J9260L6006j5287k7778R385j9429L11L118
22573C42453k2929j3683P458k6947O981j0150m9718j352Q1038O2467l2827k9773
22561C13018L2621M2199M8192M8337k7695p1949p952p6133k3464O0350o180o4975
22549B66369j1312J6835O0944L432L2418L0627j6639o500j3573l0896j3981p138
22537C10586k9199M5608L3160L8741O508l8729m0591n7213j121N3653J8066J7408
22525C56877J7292l5838m1630j0911L6210L5612J8590m6870m0786j0617j2298
$$ y = [287221, 347682, 346801, 293478, 287672, 299618, 314781, 284486, 237323, 202396, 242683, 260156, 236325, 225047, 288768, 365997, 292501, 242056, 256782, 281844, 315504, 294769, 349774, 363772, 362554, 356080, 372678, 375945, 336867, 356127, 392133, 376846, 349068, 358453, 339024, 339335, 342453, 319524, 305841, 313299, 286352, 293333, 283183, 233465, 232113, 313151, 375618, 342791, 313018, 345639, 387838, 436030, 484367, 456672, 384723, 376771, 300638, 277174, 337524, 331344, 266369, 255057, 271892, 332836, 336268, 368686, 399313, 382674, 376174, 362601, 331705, 317724, 310586, 281387, 326995, 360155, 398896, 405404, 366675, 326084, 268871, 267750, 321403, 339469, 356877, 374169, 338331, 296701, 285790, 322000, 357612, 376202, 329332, 288546, 277929, 265631]
22514B65631K7779J5892l3431M2442P1607J1016J8749k7510j9084j1542k545O1789
22502D20793o045m3308o8805m0366L0557R0938n459l4193l7226K0890L7595K586
22490C67957k2059k3733q689P146J6662r381O9538J6482o0811n900k0596j7953
22478C08663m0072l3315m387M9476N5832P2898K1734j5957r11l8091J1143l0790
22466C56223k5601L3370J6144j8056J789j2585J6074K4627q979l3430j4510m0624
22454B94442l6013l376J9079K3117R333K6643K4294J4002L2366m3699j8822l566
22442C37800K5574n65P069L6085J8423N931J1027o7985n7942J3252M0758M4626
22430D14053j4305k3232j5737j022K3886o7069k9526N7760J2433k4830l2021l3935
$$ y = [265631, 293410, 309302, 275871, 318313, 389920, 400936, 419685, 392175, 373091, 361549, 359004, 420793, 414748, 371440, 302635, 262269, 292826, 383764, 378305, 344112, 306886, 327776, 365371, 367957, 345898, 322165, 313476, 320622, 337284, 327903, 397441, 413923, 353112, 347212, 326616, 308663, 268591, 235276, 230889, 280365, 336197, 409095, 430829, 414872, 413961, 375870, 387013, 356223, 330622, 363992, 380136, 362080, 363869, 351284, 367358, 391985, 383006, 349576, 335066, 294442, 258429, 255053, 274132, 297249, 306582, 333225, 357519, 371521, 403887, 360188, 341366, 337800, 363374, 362809, 369878, 405963, 424386, 430317, 441344, 373359, 315417, 328669, 369427, 414053, 399748, 376516, 360779, 359757, 383643, 316574, 287048, 344808, 357241, 332411, 300390, 266455]
22418B66455K5321N4727K4225j3854J0638K2268K417j5366m5389l0519L0032k4227
22406C06728k4807k4222L9074N924k3647j571j9750M388K7811L1673K1832j4603
22394C28830J3835J5367k9652m9266l2770l0648j0741P885K7571K3102Q5666N0715
22382C99894m516j5244K180R11L3858K683n2635l3403l497K2664K9771l7568J4680
22369C59778Q411k2292l5588n131J0259l021k2595K1544K4281L4796L3707j1700
22357C92449K1183j806l6739p6917m826O6361L0205O463j4227k8397n3016k5259
22345B75474J6416N3019K7836j4088L098m3182o5503J2905Q006J7445l467j0770
22333B77189L3739J5780j8907l1178j3427Q3637R26j0895O9458O329k3315k6901
$$ y = [266455, 291776, 346503, 370728, 356874, 367512, 389780, 392197, 376831, 331442, 300923, 330955, 306728, 281921, 257699, 296773, 302697, 279050, 277479, 257729, 262117, 289928, 321601, 343433, 328830, 342665, 358032, 328380, 279114, 246344, 215696, 204955, 212840, 240411, 263513, 349179, 399894, 395378, 380134, 382314, 383225, 417083, 419766, 367131, 333728, 330231, 352895, 382666, 345098, 359778, 368189, 345897, 310309, 305178, 315437, 312416, 289821, 311365, 335646, 370442, 404149, 392449, 413632, 411826, 375087, 298170, 293344, 359705, 389910, 396373, 382146, 353749, 300733, 275474, 291890, 344909, 372745, 358657, 361755, 318573, 253070, 265975, 273981, 291426, 287959, 277189, 310928, 326708, 307801, 276623, 263196, 346833, 347759, 336864, 406322, 412651, 389336, 362435]
22321C62435q913j3973m5722J9712P4863J9178K649j140k4546j9823l650o8351
22309B92719l8288Q031K2439K7346J5077J2294K6424P130j5811R692m4706j4831
22297C07516J9856K9763K2374K0857n4937K686L1394k6051k8498J8993O49r027
22285C35575L4536J3476q781o07m270m461j2434M497N9935J134k1528l6109K0284
22272C81247J5266p36l4761K5022q822m2548O497L382P589J719J4962J4842L762
22259C87421j197l3034n9174O1119N7153j0077p5266L7446o115l2068p169p627
22247C11412m714R354j2172q253K7012K1959L6639M5807J565n061m2983K4427
22235D04992L7041k0648p4549m7223L1741O4191q819l1371l4633l4888O0597N3138
$$ y = [362435, 353522, 339549, 293827, 313539, 388402, 407580, 410229, 409089, 384543, 364720, 361070, 292719, 254431, 262462, 284901, 312247, 327324, 339618, 366042, 373172, 357361, 367053, 322347, 307516, 327372, 357135, 379509, 400366, 345429, 348115, 379509, 353458, 324960, 343953, 344602, 335575, 370111, 383587, 374806, 374199, 369929, 365468, 353034, 357531, 417466, 418600, 397072, 360963, 381247, 396513, 395777, 361016, 386038, 377216, 334668, 341165, 344547, 352136, 353855, 368817, 383659, 387421, 386224, 353190, 294016, 355135, 412288, 402211, 326945, 364391, 358276, 326208, 319039, 311412, 306698, 316052, 303880, 295627, 322639, 344598, 381237, 427044, 428609, 423548, 380565, 404992, 442033, 421385, 346836, 299613, 331354, 395545, 386726, 355355, 320722, 285834, 346431, 399569]
22223C99569j8990j9407l9578O0226J3210j657K9449j4534k1896L4577p83m0958
22211C79228N1906J4615m7014k1371l2823J1527k5155o35K0689j4088l4031k6270
22199B76578J6644M1376K9393M6207n5610k6085L7411j4822J1794K1009m174j5208
22187C64513J2699k944J1453L9008p034k6174R011p7710k7950J429J4553N1648
22175C62502M7574L9494n1897k0478j0782n3922l2429O5889N3242p110J6902l6965
22163C72020L622L5156k3885n982K1328l8832J7378j4246l4359K3342J1075K1257
22151C87874o9228o743j4014K0881K5186J2656k1054J7127O1685j7902j7736M010
22139C82742J4617l2525J4897o796n7357j9896Q946m0535K8358j787J3796L1713
$$ y = [399569, 380579, 361172, 321594, 381820, 395030, 393373, 422822, 408288, 386392, 420969, 420186, 379228, 431134, 445749, 398735, 377364, 344541, 356068, 330913, 330278, 350967, 336879, 302848, 276578, 293222, 334598, 363991, 410198, 354588, 328503, 365914, 351092, 362886, 383895, 379721, 364513, 377212, 374268, 385721, 424729, 417695, 391521, 400532, 322822, 294872, 296301, 310854, 362502, 410076, 449570, 397673, 377195, 366413, 312491, 280062, 345951, 399193, 392083, 408985, 372020, 375642, 410798, 386913, 380931, 402259, 363427, 380805, 366559, 332200, 355542, 366617, 387874, 318646, 311903, 297889, 318770, 343956, 356612, 335558, 352685, 414370, 396468, 378732, 382742, 397359, 364834, 379731, 372935, 315578, 295682, 304628, 264093, 292451, 290664, 304460, 336173]
22127C36173j4732k1257N9589L4652O5791K7751k6710K142j4732k8461K166K6127
22115D48499k827N8835j3379k8785J2989r217k6836p817p7402k4386P297M0298
22103C77269k4721l5753j0705K3869P7602J5879o0894j1568j3802K1756J0933
22092C69865j4686K5698K604j388N0399k4676o4142l2760n7421M2441J03767j0886
22080C88815k7977p586K4442N2914J0454j0531o8333K7346L627q713l438K704
22068C83724O0864M481k7594k0616k5570k1183M3816J5824l009p489j2923n1466
22056C38859K336j031j1731P303j3845k2715J4679M3209m319k8465Q711L841M2940
22043C79772K1147l3578k9626J8986j5567L6488N106k0855K7403M9989L8606j0470
$$ y = [336173, 321441, 300184, 359773, 394425, 460216, 487967, 461257, 463399, 448667, 420206, 422372, 448499, 445672, 504507, 491128, 462343, 475332, 466115, 439279, 431462, 354060, 329674, 336971, 377269, 352548, 316795, 306090, 329959, 407561, 423440, 362546, 350978, 337176, 358932, 369865, 355179, 380877, 383481, 382093, 432492, 407816, 343674, 310914, 253493, 295934, 399701, 388815, 360838, 353252, 377694, 430608, 441062, 430531, 362198, 389544, 393171, 384458, 381020, 383724, 444588, 449069, 421475, 400859, 375289, 354106, 397922, 413746, 410737, 403248, 390325, 338859, 341195, 340164, 328433, 335736, 321891, 299176, 313855, 357064, 352745, 324280, 332991, 336832, 379772, 400919, 367341, 337715, 356701, 341134, 377622, 382728, 361873, 389276, 439265, 477871, 467401]
22031D67401j3093J4577p894r859p292r580k460j0837j8429K964N9823M5834k8684
22018D82471n0252j7093J0852j3524m1839m618o0890j3401j9457O6614L7668k7421
22006C49110j5193J1794K8932M988M7717L7058J0774r613p998o689j2769l7439
21994D00672l8054k2784L4972K0790L227j8820j1397K362L1604P6847j8579l4422
21982D26418m52k1924j7141j201K4626k5204j727K2808j1149l8527J6671n1314
21970C21884k6150P152K3289N457L1117K2529J4535q0717J150N9366n080J9977
21958C94509l5666k5589q308k6462L2771M1548O3494J0525n6779l0900K4318j2920
21946C70541k8701J6262L1681L2849L829k5048j0296J8458L0596k1206j3706p77
$$ y = [467401, 454308, 468885, 460991, 451132, 443840, 434260, 431800, 420963, 402534, 405498, 465321, 511155, 482471, 432219, 415126, 425978, 412454, 370615, 365997, 305107, 291706, 272249, 338863, 376531, 349110, 333917, 345711, 374643, 379631, 427348, 464406, 475180, 465567, 457569, 450880, 438111, 400672, 362618, 339834, 374806, 395596, 398823, 380003, 368606, 370968, 402572, 479419, 460840, 426418, 425966, 404042, 386901, 385700, 410326, 385122, 383395, 406203, 395054, 356527, 373198, 321884, 295734, 302886, 326175, 331632, 362749, 385278, 399813, 319096, 320246, 379612, 374532, 394509, 358843, 333254, 324946, 298484, 331255, 372803, 436297, 446822, 390043, 359143, 383461, 370541, 341840, 358102, 389783, 422632, 426461, 401413, 391117, 409575, 440171, 418965, 405259, 404482]
21934D04482n235n377j0619l8310J3192L9632M5359L9165k9143k2761o557j2032
21922D11796O15k0457K3092O4785J4996k6863m9506k3711j0331J9950L25n2105
21910C52586o456M24K189L2504J650K2930j9907L5538K0123R171K4522j2025j0407
21897D52842J4585J1422K1970r253l7653j0434j7862j8981j2465L3700j7302K5743
21885D36312R959k5565j0609r102l4961n372K9721Q904k776m202l1713k7022k9809
21872C03765j4317K2683J4733M3529O3314M2509o734J4298l15m8108m7865q4561
21860C02931k2765L7058K6428M2056J4749j7843O0605K8732J1148l5116J6614
21849D64597m418k4850j6576p387K2442K5122J9025n543k8927k4976J5J3905M1509
$$ y = [404482, 399247, 393870, 383251, 344941, 358133, 397765, 443124, 482289, 453146, 430385, 423828, 411796, 412411, 391954, 415046, 479831, 494827, 467964, 418458, 394747, 384416, 404366, 404691, 352586, 346130, 346554, 348743, 381247, 382897, 405827, 385920, 421458, 441581, 450752, 475274, 463249, 452842, 467427, 478849, 500819, 491566, 453913, 443479, 425617, 406636, 394171, 427871, 410569, 436312, 446271, 420706, 410097, 400995, 366034, 360662, 390383, 399287, 396511, 392309, 360596, 333574, 303765, 289448, 312131, 326864, 370393, 433707, 476216, 469482, 483780, 483465, 435357, 387492, 302931, 280166, 317224, 343652, 385708, 400457, 382614, 443219, 471951, 483099, 447983, 464597, 460179, 435329, 418753, 411366, 433808, 458930, 477955, 472412, 443485, 418509, 418524, 432429, 473938]
21836D73938l820L8633m513J0319L2375L481l2919n2615m2780K2718j2711m9214
21824C82892N2545R2459j2918k7144o0592q622J6459j4548J4179j1120j5696L2521
21812D40415M9205L981j8802k3880l6751n4007M498J4375M4949J1565q434J0802
21800D37916j7616j3811J8782J9696p684N6837o116n4848J1959J1688L158l7771
21788D22190N749Q046K7697K5890j6144K2708J5M812o764Q022n5157k3125J8409
21775D42348O2863Q259k9355l0140o1266J1201L5417J254n3J7633N055j6221j7245
21762D29750J5328k7660k3173J0902k3925k3823l9252K862N9149L3808J4691l4312
21750C94345j3676Q196K9575K3434J9749k3841n5832k4585L0733M6906o86k1432
$$ y = [473938, 470118, 508751, 504238, 514557, 546932, 550413, 517494, 464879, 422099, 444817, 432106, 382892, 435437, 527896, 514978, 487834, 427242, 418620, 435079, 420531, 434710, 423590, 407894, 440415, 489620, 493601, 474799, 450919, 414168, 360161, 364659, 379034, 423983, 435548, 427114, 437916, 420300, 406489, 425271, 444967, 437283, 494120, 488004, 433156, 445115, 456803, 459961, 422190, 427939, 435985, 463682, 489572, 473428, 496136, 496151, 500963, 494199, 502221, 447064, 423939, 442348, 505211, 513470, 484115, 453975, 392709, 403910, 439327, 440581, 440528, 458161, 463216, 446995, 429750, 445078, 417418, 394245, 405147, 381222, 357399, 318147, 321009, 380158, 413966, 428657, 394345, 380669, 388865, 418440, 441874, 461623, 437782, 381950, 357365, 388098, 435004, 434318, 412886]
21738D12886J5180l4951k6903j0337m3549j2950O2929M2837M521k455O736m219
21726D09725k7255L5193K280J4295K2505M8136M219k0012j9511k4530M33N209
21714D50687J9769M5204j6850k6156R323m2299j7386L7390J5142j3246j01573
21703C60005J87J7134L5680L0647K976M5617K8150L0175K553m0924p8430k3906
21691D09864R1405L1019m6279l5188l7325m7654K571J1189J9458l6478J0544K1049
21679C94175L4803N130k2227K1165J0228l173l8043l0887M7707M5205m575j8621
21667D40887j1119k6214J678O2917j7749r0294K5295O1278L7399k4755P359M1159
21655E07841J0593j3337k5357n690K3476J6381o6829Q96P0935r078q2962L824
$$ y = [412886, 428066, 393115, 366212, 355875, 312326, 299376, 362305, 405142, 409663, 407208, 413944, 409725, 382470, 417663, 419943, 434238, 456743, 504879, 509098, 489086, 469575, 445045, 445478, 450687, 470456, 515660, 498810, 472654, 481977, 439678, 422292, 459682, 474824, 461578, 360005, 360192, 377326, 413006, 443653, 446629, 492246, 520396, 550571, 553124, 512200, 433770, 409864, 501269, 532288, 486009, 450821, 413496, 365842, 368413, 379602, 399060, 362582, 373126, 394175, 428978, 434108, 411881, 433046, 443274, 440101, 402058, 371171, 418878, 464083, 459508, 440887, 429768, 403554, 405232, 468149, 450400, 360106, 385401, 446679, 484078, 459323, 466682, 507841, 518434, 505097, 479740, 474050, 497526, 513907, 447078, 447974, 518909, 509831, 426869, 430693]
21643D30693L4543K4977J302L2697J6299m7078m5678L8269J2580m3425o591J9865
21631D68453K4271K3123J6844k1585M745l665K5045o391j2960k8615n6724k8508
21619D04033Q5279K0313k2331K2171j244k9650K0739K7838k3713R429j9094l2002
21607D61768m8370K2152j0472K2346M9032j2069l480L4152M493j7093J3190j9478
21595D96171l1732k0365o987k7000J4135R7219J4273k3525k8912L5716l7251j8644
21583D63098Q481k692k4769n5126J0807N8472M3922j6530J2847k1197K0022q832
21571D88503J1080r24k0013j9988r155N3474k3835p5324k879l3308o629M6563
21559D07565L9630o882L286k45K7603N8899M3799m4718m5192o2010m060J9110
$$ y = [430693, 465236, 490213, 491515, 524212, 540511, 493433, 447755, 486024, 498604, 455179, 448588, 468453, 492724, 515847, 532691, 511106, 515851, 512186, 537231, 530840, 517880, 489265, 432541, 404033, 489312, 509625, 487294, 509465, 508221, 478571, 499310, 527148, 503435, 512864, 493770, 461768, 413398, 435550, 425078, 447424, 496456, 484387, 480907, 515059, 519552, 502459, 515649, 496171, 464439, 444074, 437087, 410087, 424222, 521441, 535714, 512189, 483277, 518993, 481742, 463098, 471579, 468887, 444118, 388992, 399799, 458271, 502193, 485663, 498510, 477313, 497335, 488503, 499583, 498659, 478646, 458658, 449503, 502977, 479142, 403818, 400939, 367631, 361002, 407565, 447195, 440313, 443599, 443354, 470957, 529856, 573655, 528937, 483745, 421735, 417675, 436785]
21547D36785K5425N6881M2400m5183l471k0093j2148r042k7477M724O059L2505
21535D87365P6080j2271m3111j458J4242j3162k8166K409o587J7389L4188n2020
21523D74898n4534K9337R6278j7735o1869j6972j1158L9383N3296k0460J5419
21512E25883o863o162L2184m7655j1093L2961r611j9892L390l5263k4752M5781
21500D78908M9496J287j8299K9522L8342n5020j0769K7439j6003j5806q24o9k7374
21487D80830l2209K4862L7500N4698K5169m2010j6147j3915P275K2366p254m41
21475E40724K9869j8717k0033j5226k830m0051o4039P705O1873o501l481K5872
21463D95165Q3927l92o2075l3423K5436m3094R237N3951O1773m222n7079m1642
$$ y = [436785, 462210, 519091, 561491, 516308, 512837, 492744, 480596, 471554, 444077, 448801, 454860, 487365, 563445, 551174, 508063, 506605, 520847, 507685, 479519, 481928, 475341, 492730, 526918, 474898, 420364, 449701, 545979, 528244, 466375, 449403, 438245, 477628, 530924, 510464, 525883, 519020, 512858, 545042, 497387, 486294, 519255, 509644, 489752, 493142, 457879, 433127, 478908, 528404, 529691, 511392, 540914, 579256, 524236, 513467, 540906, 524903, 509097, 508273, 508204, 480830, 448621, 473483, 510983, 565681, 590850, 548840, 532693, 518778, 526053, 548419, 541165, 540724, 570593, 551876, 531843, 516617, 513787, 473736, 409697, 417402, 479275, 472774, 469293, 495165, 579092, 578700, 516625, 483202, 508638, 465544, 474781, 528732, 590505, 586283, 529204, 487562]
21451D87562m2154O1160K9706k0330P5663J9095l3532m4232l8500m0223J4311
21440D68526l1059M404N4582O3554K2822l4589o7742l3994N6949n0747Q970M6167
21428E07843j2214L3023J6133m6041K1658l462K8037K1357J992l9595j8151M0
21416E10620J9326L817m3197l3116k9974l510K777K0513K0108J8353M2979M4488
21404E73184j1795l5977K284N4423O7290n0714j1618K4743r375n5893n8542o864
21392D81146j7201j6183l4482k4937j0792k6263m3656k9204P4594N0263n5535
21381C47750M3584M5495N3798j9490J4637K1066K587M7344l4777j5708N0070K090
21369E58446l4928j2675n267l9319L4009K6370j0683m0106K8668J186K0069J0860
$$ y = [487562, 445408, 506568, 536274, 515944, 591607, 610702, 577170, 532938, 494438, 454215, 468526, 437467, 441871, 496453, 560007, 582829, 548240, 480498, 446504, 503453, 452706, 461676, 507843, 495629, 528652, 544785, 498744, 520402, 516940, 544977, 566334, 568326, 528731, 510580, 510620, 529946, 533763, 490566, 457450, 427476, 423966, 426743, 447256, 467364, 485717, 528696, 573184, 561389, 525412, 527696, 582119, 649409, 598695, 587077, 611820, 602445, 546552, 488010, 481146, 463945, 447762, 413280, 388343, 377551, 351288, 307632, 278428, 353022, 403285, 347750, 391334, 436829, 490627, 471137, 485774, 506840, 509427, 556771, 521994, 506286, 556356, 558446, 523518, 510843, 505576, 466257, 500266, 526636, 515953, 475847, 504515, 505701, 525770, 536630]
21357E36630P0525J3904n7177k0082J885n5713p082K5606l9077p500k6664l5203
21345D00052k1565L314K5592R0748n532n1342J1320L8002r816l7510L3429l2972
21333D43720n4442j5550R3219N4974M387L3977P920N143R397o4068K557j0240
21321E10994l8098o4285p753P0128J09645M2782j704k0394m6025n4494k7365O6067
21309E39498M8406L0680n808m2861j3120l4083O45j1160n1317J4125K0013L3712
21297E28730k6083L007O8133O829J675Q266j1033q811j6361k4521R617M245J843
21284E45536R910M9681l6509l8587l1635j9133J1186j207o206m085L3279J8554
21272E30784J2395M8662J6381p1162l532l0224N3596O7333j1219K3599K7318o1642
$$ y = [536630, 607155, 621059, 563882, 543800, 545685, 489972, 482890, 508496, 469419, 461919, 435255, 400052, 378487, 381801, 407393, 498141, 492609, 441267, 452587, 490589, 480773, 443263, 476692, 443720, 389278, 373728, 466947, 521921, 526308, 560285, 568205, 573348, 582745, 518677, 521234, 510994, 472896, 408611, 400858, 470986, 580631, 623413, 621709, 601315, 555290, 500796, 473431, 539498, 587904, 618584, 612776, 569915, 556795, 522712, 523357, 512197, 460880, 475005, 495018, 528730, 502647, 505654, 573787, 580616, 582291, 590557, 579524, 570713, 554352, 529831, 539448, 543693, 545536, 555446, 605127, 568618, 530031, 498396, 479263, 490449, 489242, 483036, 478951, 512230, 530784, 543179, 591841, 608222, 537060, 533528, 503304, 556900, 624233, 613014, 636613, 663931, 602289]
21260F02289k7862j4287j3609J3838l1939q730K9540j4979j3531j5786j5441n9061
21248D30442q939N7314K265k501K4618J863M5829k1438J7791M4076M286n2690
21236E42916j58J3212O265P4994K2700m6889l5794J5094r432p2238j8741K0067
21224E11996M0881K459l4529K064l594o5389N0336K0803K7730q962o8842j8885
21212D56068O3516L0340m378K8644k0748m688J9062K6413j3979j7239q413k1346
21200E33252n4379K3421J3760k8011o447J2927K0738L3588J4740M2261l92j5914
21188E89544L006p682q592J3277j4403o471M7410m1481K9155K4676m5490m1795
21176E41154k0462k6935P597M8634L1256L089P681K4454m361l6689L0438j9630
$$ y = [602289, 574427, 560140, 546531, 560369, 528430, 519700, 549240, 534261, 520730, 504944, 489503, 430442, 421503, 478817, 481082, 478581, 503199, 505062, 550891, 529453, 547244, 591320, 595606, 542916, 542758, 555970, 562235, 637229, 659929, 613040, 577246, 592340, 582908, 510670, 491929, 511996, 552877, 555336, 520807, 522871, 519277, 453888, 504224, 525027, 552757, 543795, 474953, 456068, 519584, 549924, 545546, 574190, 553442, 548754, 567816, 594229, 580250, 563011, 554598, 533252, 478873, 502294, 516054, 488043, 481596, 494523, 515261, 548849, 563589, 605850, 605458, 589544, 592550, 584868, 576276, 589553, 575150, 568679, 616089, 574608, 603763, 628439, 582949, 541154, 520692, 493757, 501354, 549988, 581244, 584333, 592014, 616468, 612107, 575418, 605856, 586226]
21164E86226j7935l224m668M7566J8164k2940K612K5945K7943J0776j6446j7053
21152F36966P864m32M923K9636O136j8702j323n247l2692k2004J6323J1156M686
21139F37290J3500m992J0994q333o0961J0430K5550k0010K6693O7920p7273K8361
21127F49169Q853l2121K1508K618k1636P120j5771k4497l1212N447O0818Q949
21115F39245K3982L51k594J7300l8449K7712K9660J9052j8506m3080l8233j4205
21103F02235K2015r8J1035k286l106Q218L7268J8474m1369m8529L365m5201j6810
21090E45211M1892l3464l6509J8828R1307O1356l077L1657k1069k6714m0938N652
21078F34132R082n939j0767j2207p799K3605J9890K4282p849j7151o6779j9245
$$ y = [586226, 568291, 565067, 560399, 607965, 626129, 603189, 605801, 631746, 659689, 670465, 654019, 636966, 644830, 644398, 649321, 678957, 685093, 666391, 665068, 659821, 627129, 605125, 621448, 632604, 637290, 650790, 645798, 656792, 648459, 587498, 597928, 623478, 603468, 630161, 698081, 620808, 649169, 658022, 625901, 647409, 650027, 628391, 635511, 619740, 595243, 564031, 569478, 630296, 639245, 663227, 663578, 660984, 678284, 639835, 667547, 697207, 716259, 697753, 654673, 616440, 602235, 624250, 624152, 635187, 632901, 629795, 638013, 675281, 693755, 652386, 603857, 607222, 562021, 545211, 587103, 553639, 517130, 535958, 627265, 688621, 685544, 717201, 696132, 669418, 628480, 634132, 643214, 637275, 626508, 614301, 606502, 630107, 649997, 674279, 666430, 649279, 582500, 563255]
21066E63255K8625K7420j7495k8356P100K1453l025j329L1859M0105k3998j9714
21054F25900k2720k3391P423j3870J7157J6068o222m1398K1734K8134P0371k0670
21042F58516J2788k4033J6863l1167k4423L4779K9479q70o018o570p779p6103
21030E75462K50K4335j7735J2966K1127L5910l3367N237K2258o520m758O3458
21018F98623l9601n2318m0422o0041j2781M0127N702K7905N7541L315j5094k268
21006F10688M667k3051Q67J5975M4160j2053L090P1937O4017K3487o9045k0193
20994G14546k3223K80k5411k1272J1087k9699M5626O4961k038l3569j4396K038
20982F88930N6160J877l0504l3900j033J96m9034j8388M01o566m674k1740m0388
$$ y = [563255, 591880, 619300, 601805, 573449, 580549, 602002, 598977, 597648, 629507, 669612, 645614, 625900, 603180, 579789, 587212, 573342, 590499, 606567, 600345, 558947, 580681, 608815, 679186, 658516, 671304, 647271, 664134, 632967, 608544, 643323, 672802, 671932, 665914, 659344, 651565, 575462, 575712, 600047, 582312, 595278, 616405, 652315, 618948, 624185, 646443, 639923, 635165, 698623, 659022, 606704, 566282, 506241, 493460, 533587, 539289, 567194, 624735, 628050, 612956, 610688, 615355, 592304, 593171, 609146, 653306, 641253, 644343, 716280, 780297, 803784, 734739, 714546, 691323, 691603, 666192, 644920, 656007, 626308, 671934, 736895, 734857, 701288, 686892, 688930, 745090, 746967, 716463, 682563, 681530, 681726, 632692, 614304, 614705, 608139, 603465, 581725, 541337]
20969E41337M4296J27146J4169j7515q948L913m2055n2832L3368Q533M4844J9821
20957G16077k1294k9806J6674P767l62J4731k833j3333m1288k9790k627J9338
20945F33254M9124N1644R399j4218r092m2205q0253p314N2459Q597J4651j0916
20933F55130j3219N0830n70l3565J697k5954k7075L5264L6401k9484L9680N783
20921F94918o094J3082q391J4107j6029J0781N0546O0423l2126o5918l7763k0714
20909F56822M0103J563j711K529p404n290N115o107r344j7107j5601J1210J0084
20896F64862J2797N2272J0791k1475J436k5880m1452L9155J2234N2914O253k3734
20884G40173L3583J7524r016p6013o1196J5711M8879J873o680J6455O196J6267
$$ y = [541337, 585633, 712779, 726948, 709433, 700485, 704398, 662343, 609511, 642879, 651412, 696256, 716077, 694783, 664977, 681651, 689418, 689056, 703787, 700954, 687621, 646333, 616543, 613916, 633254, 682378, 734022, 743421, 729203, 720111, 677906, 597653, 590339, 642798, 651395, 666046, 655130, 641911, 692741, 692171, 658606, 660303, 634349, 607274, 642538, 678939, 649455, 689135, 694918, 688824, 701906, 693515, 707622, 691593, 702374, 752920, 813343, 781217, 715299, 677536, 656822, 696925, 698488, 696777, 699306, 691902, 686612, 691727, 685620, 676276, 659169, 643568, 654778, 664862, 677659, 729931, 740722, 719247, 720683, 694803, 653351, 692506, 704740, 757654, 763907, 740173, 773756, 791280, 782264, 706251, 645055, 660766, 709645, 711518, 704838, 721293, 727489, 743756]
20872G43756K4172o806p9482p7898O9649K8375M1111M7065O202k9800o19j5771
20860G49954R279J7039k1444k0020J5239L459Q843l1857n755j5199j9212P4432
20848G64758M4792m2601m4479n312K1484j1468j0347L1150o453j2824Q134j900
20836G34934j4523K4445k116K483p883k0729J8338o360O1082L0073m4101j3136
20824G62507L6228K5247L498l942j1912L66J3655j6812K653k4117J745N6884J7240
20811H63240l0112l5070k0466J0722k0895m0907m8244N0880N2597k2273n531J6986
20799G70927L5033m0898l43K0203k3007N834r27m3087j6643P661Qj9447O5794
20786G61108q898J4554j8128J8895J646n808P004k4432l061q929M784N0997Q972
$$ y = [743756, 767928, 761122, 681640, 603742, 673391, 701766, 742877, 789942, 796144, 766344, 765725, 749954, 759233, 776272, 754828, 734808, 750047, 753506, 762349, 730492, 724737, 709538, 690326, 764758, 809550, 766949, 722470, 717158, 738642, 727174, 716827, 747977, 741524, 728700, 736834, 734934, 720411, 744856, 742740, 745223, 737340, 716611, 734949, 728589, 789671, 819744, 775643, 762507, 798735, 823982, 827480, 823538, 811626, 811992, 825647, 808835, 811488, 787371, 789116, 846000, 863240, 833128, 798058, 777592, 788314, 767419, 726512, 678268, 729148, 781745, 759472, 753941, 770927, 805960, 765062, 764719, 784922, 761915, 767749, 766822, 723735, 707092, 714753, 714761, 695314, 761108, 752210, 766764, 748636, 767531, 769177, 763369, 770373, 745941, 742880, 733951, 738735, 789732, 798704]
20773G98704j8638N834Q318J9700k1941j3037J4146J9983m907J6959q829n0728
20761G65564k2761n206N4291R545k7312m6422l5358K9388Q5644K8803O95k2689
20749H14182m5828k073N1307Rk2381Q826Q219j2116j5321K2982K2046L5419k0066
20736H45205k8298n2599l512J7093j2390O5962j6423O437J1673j6363k6556l6288
20724G53941m1053J6158o196l0365J5167J7241J7085M2106L2928O355k6974n2948
20712G43445J6417P6828M1941m9033m6804k8809M0293N3838l5565j0745k05O107
20700H07708N3648L0337m2776l2982Q555K232l2895J6312P5791K8784p1246j3189
20688H30279J6879j7225K202j6274j729J0345k8135L1965L451r960J4398O450
$$ y = [798704, 780066, 785900, 794218, 813918, 791977, 778940, 793086, 813069, 808162, 825121, 816292, 765564, 742803, 737597, 791888, 801433, 774121, 727699, 692341, 721729, 807373, 836176, 836871, 814182, 768354, 766281, 817588, 817597, 795216, 804042, 812261, 800145, 784824, 807806, 829852, 865271, 845205, 816907, 764308, 760796, 777889, 765499, 831461, 815038, 821475, 833148, 816785, 790229, 753941, 712888, 729046, 722850, 692485, 707652, 724893, 741978, 784084, 817012, 823367, 796393, 743445, 759862, 836690, 878631, 829598, 782794, 753985, 794278, 848116, 812551, 801806, 801601, 807708, 861356, 891693, 848917, 815935, 824490, 826722, 793827, 810139, 885930, 914714, 843468, 830279, 847158, 829933, 832135, 815861, 814132, 824477, 796342, 828307, 831758, 821798, 836196, 842646]
20676H42646k2183m1078J5592L7827n208J6812N6163k0311n5699K312l8390j8577
20664G69906M9911L0975o698J6430L5978M6105l8265j5203r785J5125j0456J1046
20652H95069Q096m4919k0465K038m5221M670P5143K085O877k6332j4550L8499
20640H80990K8258j6542l4369L1390q658o0623J0679K7793M595J6008l4257j2110
20628H33154M531K2704k3631j6150j9513K0220J618N6620K2770l231m3182k4269
20616H31641N9697O4170J2197p0385n411L3382k1307q720j7696j323J0642K3913
20604I10800k2868o4324j627L5593L3945M728J9419L0085p835j7340j7792j5573
20592H87211o299K280J5311j0637l8741J8531J9391K720k0533L9005K498J1590
$$ y = [842646, 820463, 779385, 794977, 832804, 827596, 844408, 900571, 880260, 824561, 826873, 788483, 769906, 819817, 850792, 844094, 860524, 896502, 942607, 904342, 889139, 879354, 894479, 884023, 895069, 903165, 858246, 837781, 839819, 794598, 799268, 874411, 876496, 883373, 857041, 842491, 880990, 909248, 892706, 858337, 889727, 881069, 820446, 831125, 858918, 863513, 879521, 845264, 833154, 837685, 860389, 836758, 820608, 801095, 821315, 822933, 879553, 902323, 899092, 855910, 831641, 891338, 955508, 967705, 897320, 891909, 925291, 903984, 895264, 877568, 876245, 886887, 910800, 887932, 823608, 821981, 857574, 891519, 896247, 915666, 945751, 937916, 920576, 902784, 887211, 880912, 883192, 898503, 887866, 849125, 867656, 887047, 889767, 869234, 908239, 910737, 922327]
20580I22327L8059p208j0154K907K5308j4889j4314N9712j1861l6437P657r66
20568I60141P966O071n1078l657n577L23J7874n3044k2368j3234J4602K4220j6320
20555H65919K910m627L2067N5471M9808J2707r203k4750R512L3580K820n1638
20543I74576o011K2413m203p7623o570J1872m9205J4222K6729M0071L0961J2447
20531I89679K6485j4016m3751o5182J3033M0244L7722J9843p309q042k0416n85
20519I67705r974k0050J2064J5790k4605J6322L2565K0348N937l0361L9376J7548
20507A042665K9438l6367l4486K3173N048n019J4521n7019j7279l3220M037J4151
20495I49643J8271K4217K7988K1660j7662l5422l3002L6251J3460K4273M0154
$$ y = [922327, 960386, 953178, 943024, 945931, 971239, 956350, 942036, 1001748, 989887, 953450, 961107, 960141, 968107, 974178, 923100, 919443, 913866, 914189, 932063, 879019, 856651, 843417, 858019, 882239, 865919, 868829, 864202, 896269, 951740, 1001548, 1014255, 1005052, 980302, 989814, 1023394, 1026214, 974576, 968565, 990978, 986775, 909152, 902582, 914454, 865249, 879471, 906200, 946271, 977232, 989679, 1016164, 1002148, 958397, 893215, 906248, 946492, 984214, 1004057, 996748, 988706, 968290, 967705, 957731, 937681, 949745, 965535, 940930, 957252, 989817, 1010165, 1016102, 985741, 1025117, 1042665, 1072103, 1035736, 1001250, 1024423, 1029471, 1024452, 1038973, 981954, 964675, 931455, 935492, 949643, 967914, 992131, 1020119, 1041779, 1024117, 988695, 955693, 991944, 1005404, 1029677, 1069831]
20484A069831j0440j5446l3516k4874k3876O6173M3910N6094K9373l9868o9104
20473A048257m7521N2783O9675k2608m0490j4884j2614n301L8243K3155m6518
20462A042177L149j0146j6199J6403j6007m503M7865j64m2423k3468l0618J4641
20450I80707L2435j6374j204M4462J05520N5863q3863k2419P457k6347K302K542
20438A081081M1322K3548l3900m0251m0236K2454K442J1303K0375L9879J8497
20427A146514K3692k1267m7773K1608m530k6818L3090l771m379l7692j9662L9593
20415A098605m1132J0853l751N3362K9482k9752q384n257K4995n12k705P197K6869
20402A159870O072l4737l5328m1750J1655K1778J142j6450k7138N0887N8269P5792
$$ y = [1069831, 1059391, 1043945, 1010429, 985555, 961679, 1027852, 1071762, 1127856, 1157229, 1117361, 1048257, 1000736, 1053519, 1123194, 1100586, 1060096, 1045212, 1032598, 1027297, 1065540, 1088695, 1042177, 1045326, 1035180, 1018981, 1035384, 1019377, 1014874, 1062739, 1062575, 1020152, 996684, 966066, 980707, 1013142, 996768, 995564, 1040026, 1145546, 1201409, 1117546, 1095127, 1102584, 1076237, 1078539, 1081081, 1122403, 1145951, 1112051, 1071800, 1031564, 1054018, 1056460, 1067763, 1088138, 1128017, 1146514, 1170206, 1148939, 1101166, 1122774, 1118244, 1091426, 1124516, 1120745, 1116366, 1078674, 1059012, 1098605, 1057473, 1068326, 1064575, 1117937, 1147419, 1117667, 1109283, 1104026, 1129021, 1128509, 1125804, 1133001, 1159870, 1165942, 1131205, 1095877, 1054127, 1065782, 1087560, 1088702, 1072252, 1045114, 1096001, 1154270, 1230062]
20390A230062k0980k2847J901l5302l3K804k6453n5741L0812j1349p056M4907
20378A130725K0492k4702J6486N7898J1497m841K8736k666j0467M5078l1520l3309
20366A203407m4622p978L1214M1357n5769K464m256J0296J5949J6887n392K2248
20354A225805K8584k1028k462O4624O5664j6031p555k5078K9732K830J5450n3266
20342A307269K029k4213n2949J1560J3905l8340M2614L1646L0433K1138J329l4988
20330A311433r345l6799m0551J1969K6047m3439P151M8857n552k1203k698P3665
20318A319535K9966J6816J3927J0333N7836K949o1096J8144Q693M221J5793J8907
20306A456024L3927O167j7347m0738p324J5204L7942K9577J5294K934j3884N134
$$ y = [1230062, 1209082, 1186235, 1188136, 1152834, 1152801, 1155605, 1129152, 1073411, 1104223, 1092874, 1085818, 1130725, 1151217, 1126515, 1143001, 1200899, 1212396, 1207555, 1236291, 1233625, 1223158, 1268236, 1236716, 1203407, 1158785, 1150807, 1182021, 1223378, 1167609, 1170073, 1165817, 1176113, 1192062, 1208949, 1203557, 1225805, 1254389, 1233361, 1230899, 1295523, 1361187, 1345156, 1337601, 1312523, 1342255, 1345085, 1360535, 1307269, 1309298, 1285085, 1232136, 1243696, 1257601, 1219261, 1261875, 1293521, 1323954, 1345092, 1346421, 1311433, 1302088, 1265289, 1224738, 1236707, 1262754, 1219315, 1226466, 1275323, 1269771, 1248568, 1245870, 1319535, 1349501, 1366317, 1380244, 1390577, 1448413, 1451362, 1390266, 1408410, 1417103, 1421324, 1437117, 1456024, 1489951, 1496118, 1478771, 1438033, 1430709, 1445913, 1483855, 1513432, 1528726, 1531660, 1517776, 1522910]
20294A522910J8922J1070K8023Q581M9398Q2573N5372K7355P8288O4368J32353
20283B079213J31190o0806l13350o78075o19992j78236O0570J40973N4781N2357
20273F68625M3602K9896O4904M8922M9714Q4713M4801J2000J3583P5320K5732
20262A161812k733n4550k1177j1408R435P180K7111k0855K2548M4148J2793l7472
20250A136832O5828R654L4779L4237Q3392l2905p3747j9617Q637k233J7120L7305
20238A299282N2332l3534k5503j3288J9424J9819k273P491j0646k9718K1604N5213
20226A360203N6112j9067J796R354j805J2031p200l7989n9594j5652O3526M5468
20214A407183p323O080j1421R337M038p286l228k1741J3656O0j1469L0281j6618
$$ y = [1522910, 1541832, 1552902, 1580925, 1589506, 1638904, 1721477, 1776849, 1804204, 1882492, 1946860, 2079213, 2210403, 2149597, 1836247, 1158172, 538180, 359944, 420514, 561487, 616268, 668625, 712227, 742123, 807027, 855949, 905663, 990376, 1035177, 1047177, 1060760, 1136080, 1161812, 1159079, 1104529, 1083352, 1071944, 1081379, 1088559, 1115670, 1094815, 1117363, 1161511, 1174304, 1136832, 1202660, 1212314, 1247093, 1281330, 1364722, 1331817, 1258070, 1238453, 1247090, 1244857, 1261977, 1299282, 1351614, 1318080, 1292577, 1279289, 1298713, 1318532, 1316259, 1323750, 1313104, 1283386, 1304990, 1360203, 1416315, 1397248, 1399044, 1408398, 1406593, 1418624, 1411424, 1373435, 1313841, 1298189, 1361715, 1407183, 1399860, 1405940, 1394519, 1403856, 1407894, 1400608, 1397380, 1375639, 1389295, 1389355, 1377886, 1408167, 1391549]
20201A391549J7591k0341l7858Q524K7431M9882P034N0367L3421n3966j5731L474
20189A461377K3219l3730q9512R525P4320N808L8849k9745Q085m199j70M1024
20177A504851N6410k9184N087r625l3688l8355r2K2010Q666K484K0103l1891r101
20164A467675m7983l9274M1341M8599M9149J3732J8933l0428k8592l7406j0599
20153A445147L9811O574p71M6594K7042L3142o106L2420K8727N331j4983q693
20141A634235m9346j4172P3271M509l7679k1100j4417K0774O761j3277M674o7188
20129A527045o2046M2911O0778N0639l1561J92P5517N0160P66l5719k9621j3216
20117A635845N9921j1856j8386K2299L1076o588K9162J9662J9815k0838o4091
$$ y = [1391549, 1409140, 1388799, 1350941, 1359465, 1386896, 1436778, 1443812, 1494179, 1527600, 1473634, 1457903, 1461377, 1484596, 1450866, 1361354, 1370879, 1445199, 1451007, 1489856, 1460111, 1468196, 1463997, 1463827, 1504851, 1561261, 1532077, 1537164, 1527539, 1493851, 1455496, 1455404, 1477414, 1486080, 1488564, 1508667, 1476776, 1467675, 1419692, 1380418, 1421759, 1470358, 1519507, 1533239, 1552172, 1521744, 1493152, 1455746, 1445147, 1484958, 1491532, 1490761, 1537355, 1564397, 1597539, 1591433, 1623853, 1652580, 1657911, 1642928, 1634235, 1584889, 1570717, 1643988, 1648497, 1610818, 1589718, 1575301, 1596075, 1602836, 1589559, 1594233, 1527045, 1464999, 1507910, 1568688, 1619327, 1587766, 1587958, 1663475, 1713635, 1714401, 1678682, 1649061, 1635845, 1695766, 1683910, 1665524, 1687823, 1718899, 1712311, 1741473, 1761135, 1780950, 1760112, 1696021]
20106A696021m1273k8890p62j1825L8890K2673K2174L5025J7753N535k29n680
20094A749412J6370M2352O231M2135j7703k0575j4763j7746m270M7108p72q957
20082A818822Q056j1690J9721M851L6054L0272k1418k9484K4802j2023n0836J3458
20070A830585Q0091m431j6472M0199n6784j0336j1563k4131K3848L3429K2834
20059A907269r44M6636K4167J4914J1607j5939j5449j4257o452L8478M3317j235
20047B032112j8723r190J9175M7459r500n387M0488J3165k0j1044j3237K1242
20035B106540L300k7496K6063L3285K85m0253j1934K998o243J5241J9552j9542
20023B101796j0045J0763O742j2021k4608K5610M5436k8980m354K9004O5166j5416
$$ y = [1696021, 1654748, 1625858, 1625096, 1613271, 1652161, 1674834, 1697008, 1732033, 1749786, 1755321, 1755092, 1749412, 1765782, 1808134, 1814365, 1856500, 1838797, 1818222, 1803459, 1785713, 1781443, 1828551, 1827779, 1818822, 1826878, 1815188, 1834909, 1839760, 1875814, 1906086, 1884668, 1855184, 1879986, 1867963, 1817127, 1830585, 1910676, 1906245, 1889773, 1929972, 1873188, 1862852, 1851289, 1827158, 1851006, 1884435, 1907269, 1906325, 1952961, 1977128, 1992042, 2003649, 1987710, 1972261, 1958004, 1951552, 1990030, 2033347, 2032112, 2013389, 2004199, 2023374, 2070833, 2061333, 2055946, 2096434, 2109599, 2109579, 2098535, 2085298, 2106540, 2109840, 2082344, 2108407, 2141692, 2141977, 2101724, 2089790, 2092788, 2086545, 2101786, 2121338, 2101796, 2091751, 2102514, 2109256, 2097235, 2072627, 2098237, 2143673, 2114693, 2110339, 2139343, 2204509, 2189093]
20011B189093K1132m476k6455J1329K5658N7701P1086M0044l22L1700J665j05747
19999B312408r4947j7710K3748L7140l7107p0248n971M9592M9606L7299L7464
19988B321274m768n0773K908L0751M0647j6752k2808l666P637M8509L307m0531
19976B315735N6643L1953R952L4469K8120K401j8982l7699J7902j1293K135J0478
19964B441814K1738M9071k572J0609J4134K9459M2264J8049j670j8286p0122l3261
19952B501227N5534K9964k3740M1221J545K207Q009K8093r811l1635L4550M2794
19940B679958J6748J5205L6928J4065M6027L2198k139m3961K0350K5993k110l3945
19928B805317Q401J760K8304R8309N1468J8245k3980k0793o5194R921P7228j6111
$$ y = [2189093, 2210225, 2205749, 2179294, 2190623, 2216281, 2273982, 2345068, 2385112, 2384790, 2416490, 2418155, 2312408, 2217461, 2199751, 2223499, 2260639, 2223532, 2153284, 2147313, 2196905, 2246511, 2283810, 2321274, 2316506, 2265733, 2268641, 2299392, 2340039, 2323287, 2300479, 2296813, 2304450, 2352959, 2356266, 2315735, 2372378, 2404331, 2414283, 2448752, 2476872, 2479273, 2460291, 2422592, 2440494, 2429201, 2431336, 2441814, 2463552, 2512623, 2510051, 2520660, 2534794, 2564253, 2606517, 2624566, 2622896, 2604610, 2534488, 2501227, 2556761, 2586725, 2562985, 2604206, 2605751, 2607958, 2615967, 2644060, 2634249, 2602614, 2637164, 2679958, 2696706, 2711911, 2748839, 2762904, 2808931, 2841129, 2838990, 2795029, 2815379, 2841372, 2839262, 2805317, 2813718, 2815478, 2843782, 2942091, 2993559, 3011804, 2987824, 2967031, 2901837, 2911758, 2988986, 2972875]
19916B972875k2166J6994m6044j8869J0063l904K4106p755K2484O2617K3156O495
19904C040052L321j0825O0355N8732j329k6186J9445J3947k3560M3661L3317L7248
19892C248178N5102L559k6694j1551M3284M9876J998m5760L143O1521J6643j0877
19880C388422N771j0349J0302M5578k178j1337M1816Q0802N0571k8111k933M8567
19868C616921n420m5786J9124P5120L2899L3704M4878j6838L3601O9867K0454
19857C878524J6158L8323l2733o296L0136K4663J7302O33M3283O9401Q828L938
19845D092160M8157L2398J8667m4376j9760L8818Q4749J0415N408j0793N6699
19834D312542K4135L4577k1535j5311J4752O8311P8011L2538j358q189O2164P5299
$$ y = [2972875, 2950709, 2967703, 2921659, 2902790, 2912853, 2908949, 2933055, 2925300, 2947784, 3010401, 3033557, 3040052, 3043373, 3032548, 3092903, 3151635, 3150306, 3124120, 3143565, 3157512, 3133952, 3177613, 3210930, 3248178, 3303280, 3306839, 3280145, 3268594, 3311878, 3361754, 3363752, 3317992, 3321135, 3382656, 3399299, 3388422, 3394193, 3383844, 3394146, 3439724, 3437546, 3426209, 3468025, 3548827, 3599398, 3571287, 3568354, 3616921, 3611501, 3565715, 3584839, 3659959, 3692858, 3726562, 3771440, 3754602, 3788203, 3858070, 3878524, 3894682, 3933005, 3900272, 3893976, 3924112, 3948775, 3966077, 3966710, 4009993, 4079394, 4088222, 4092160, 4140317, 4172715, 4191382, 4147006, 4127246, 4166064, 4250813, 4261228, 4266636, 4255843, 4312542, 4336677, 4371254, 4349719, 4334408, 4349160, 4417471, 4495482, 4528020, 4526662, 4518473, 4580637, 4655936]
19822D655936O5481o462j576L5920J6614k0531O47n938Q7055R9770L011L4735
19810D964662N9104L7660N3273N3042Q2142J28646P2567N2714R4428J8467j03449
19799E513256j29974p5291j41411J3558J52086L1411j50951k7965L07602K13588
19789E705909J23564O8083L6322M1680J5715o379N8487J13140K4094L4546J10922
19778F326083N1471K8282P3814R6861O1997J9093R4861J29188P7432P0723J6952
19767G046757N9458Q9739N9072P9906P5380J49849J30394R0028J13269R0003K4354
19756H008209Q9259J23528J13342J26552J25049Q1067O6882Q6571N7067J20664
19746H998190J59664J13791J58211J90427K09163J83322K33901J82283K26367
$$ y = [4655936, 4721417, 4714955, 4713379, 4749299, 4765913, 4745382, 4746029, 4740091, 4827146, 4926916, 4929927, 4964662, 5023766, 5061426, 5114699, 5167741, 5249883, 5378529, 5451096, 5503810, 5598238, 5616705, 5513256, 5383282, 5307991, 5166580, 5180138, 5332224, 5363635, 5212684, 5184719, 5492321, 5705909, 5829473, 5897556, 5933878, 5975558, 5991273, 5984894, 6043381, 6156521, 6180615, 6215161, 6326083, 6377554, 6405836, 6479650, 6576511, 6638508, 6657601, 6752462, 6881650, 6959082, 7029805, 7046757, 7106215, 7195954, 7255026, 7334932, 7410312, 7560161, 7690555, 7780583, 7893852, 7983855, 8008209, 8097468, 8220996, 8334338, 8460890, 8585939, 8667006, 8733888, 8820459, 8877526, 8998190, 9157854, 9271645, 9429856, 9620283, 9829446, 10012768, 10246669, 10428952, 10655319]
19737A0655319K47926K67491K68130J18684m32102p55699k30407K21655K89049
19728A0650046L26551L34478K66827K26320K93517L16480K63001J98548L03460
19719A3179228L08877L44417L30424L40119K83617L18439M39281N19713M90442
19710A6554557M93019N46971N33256K40767l39434k52043L74778P46089N98783
19701A9496743L20208N11669P83296Q30548Q70819Q59511Q60917R48121J044293
19692B6526125J146202J216735J283937J401147J589330J791457K005540K180005
19684C9140478K471587K724115L050664L506557M200644M960342N925107P099848
19676G3079342Q619344J0641620J3519296J7145226K1757587K5668109J8334254
$$ y = [10655319, 10903245, 11170736, 11438866, 11557550, 11125448, 10369749, 10139342, 10360997, 10650046, 10976597, 11311075, 11577902, 11804222, 12097739, 12414219, 12677220, 12875768, 13179228, 13488105, 13832522, 14162946, 14503065, 14786682, 15105121, 15544402, 16064115, 16554557, 17047576, 17594547, 18127803, 18368570, 18029136, 17777093, 18151871, 18897960, 19496743, 19816951, 20328620, 21111916, 21942464, 22813283, 23672794, 24533711, 25481832, 26526125, 27672327, 28889062, 30172999, 31574146, 33163476, 34954933, 36960473, 39140478, 41612065, 44336180, 47386844, 50893401, 55094045, 60054387, 65979494, 73079342, 81698686, 92340306, 105859602, 123004828, 144762415, 170430524, 188764778]
19669A88764778k7942299j41703044j54843327m3312066J6327551K4041366J9664921
19662a19002120J5066821J2178976J0037902Q216170O751375N628280M766686
19655e6355910M116699L691374L184283K822598K576063K215187J933840J818664
19647c3997202J675144J512914J430131J300487J155228J088048R97822J014333
19639b3823095J017258Q96880Q22992P96616P40028P16129O42208L22649L24800
19630a7543535O21665N79855K7832n36587r4683L88251M93583M26126L90013M63709
19620a4783771M20942L26020K92143K45378J60639K04357K57865L03521K63888
19611a2309018L24070L43742L35895L10683L16813L56571L50244K11574o6804
$$ y = [188764778, 160822479, 19119435, -135723892, -179035958, -162708407, -138667041, -119002120, -103935299, -91756323, -81718421, -73502251, -66750876, -61122596, -56355910, -52239211, -48547837, -45363554, -42540956, -39964893, -37749706, -35815866, -33997202, -32322058, -30809144, -29379013, -28078526, -26923298, -25835250, -24837428, -23823095, -22805837, -21908957, -21085965, -20289349, -19549321, -18833192, -18190984, -17868335, -17543535, -16921870, -16342015, -16314183, -16850770, -16945453, -16557202, -16063619, -15637493, -15247480, -14783771, -14362829, -14036809, -13744666, -13499288, -13338649, -13134292, -12876427, -12572906, -12309018, -11984948, -11641206, -11305311, -10994628, -10677815, -10321244, -9971000, -9759426, -9826230]
19602i826230o55050o10760k9314K94653L06540K60581J98607J58329J79569K05305
19592i517770J42804J20094J00533Q7784J89025J46848R8567J59780J46582Q7606
19582h238147R9684J32758R8685O6822N0832J14766J02029N2405Q5633J17002
19572g317531Q7540N8932O4091R7540J05528P3069Q555L3655J03166Q8415M5420
19561f551620K9748J01167N2505M1677O8334O2618N2745Q1162Q9987J40575P4803
19550e756299M4950O2929J24232M9364p8746k23179k30583N6295K14588R6338
19540e640111j398j3747J13104J85448J32734J26136M3971m3951j3424O3045K9857
19529e018336N0703N1740Q3169K0279J3879M442P3403P5523J7236j3469J8201
$$ y = [-9826230, -10481280, -11092040, -11121354, -10826701, -10520161, -10259580, -10060973, -9902644, -9723075, -9517770, -9374966, -9254872, -9154339, -9066555, -8877530, -8730682, -8632115, -8472335, -8325753, -8238147, -8138463, -8005705, -7907020, -7840198, -7789366, -7674600, -7572571, -7520166, -7434533, -7317531, -7229991, -7171059, -7106968, -7009428, -6903900, -6830831, -6822276, -6788621, -6685455, -6597040, -6551620, -6521872, -6420705, -6368200, -6326523, -6258189, -6195571, -6142826, -6061664, -5971677, -5831102, -5756299, -5711349, -5648420, -5524188, -5474824, -5553570, -5776749, -6007332, -5951037, -5736449, -5640111, -5641509, -5655256, -5542152, -5356704, -5223970, -5097834, -5053863, -5097814, -5111238, -5048193, -5018336, -4967633, -4915893, -4832724, -4812445, -4798566, -4794124, -4720721, -4645198, -4627962, -4641431, -4623230]
19518d623230R0590J0826k1256L7994J36142R4162k3307K0931M8060Q297J9450
19507d201341Q827K1812Q661K9006J164m6066N6387Q3955J2820k5639M9627K1118
19495c979669M9669l474M2153M1258R342K8063O6243N7476J9504j9169O112L0620
19483c651872K4086J1587n065M4858J6712L5454J5672L3294k1942r719j8001N6252
19471c468684q18Q484Q2666l024l0714J1246N0094O5432K1543L2255K4298k0783
19459c228005j7486j5111M5054O5288K7203O2426M7210N811N725M2291k3452K7797
19447b955249K2615l5763k0240k275L8032N6265L7621K3559j2783l2173L6372
19436b844019J9701L3717m7160r757r586L292O3772J9965J9070J7880O5791l2355
$$ y = [-4623230, -4532640, -4521814, -4543070, -4505076, -4368934, -4274772, -4298079, -4277148, -4229088, -4220791, -4201341, -4192514, -4170702, -4162041, -4133035, -4131871, -4177937, -4121550, -4037595, -4024775, -4050414, -4000787, -3979669, -3930000, -3933474, -3891321, -3850063, -3840721, -3812658, -3746415, -3688939, -3669435, -3688604, -3682492, -3651872, -3627786, -3616199, -3621264, -3576406, -3559694, -3524240, -3508568, -3475274, -3497216, -3506935, -3524936, -3468684, -3469502, -3461018, -3378352, -3381376, -3412090, -3400844, -3350750, -3285318, -3263775, -3231520, -3207222, -3228005, -3245491, -3260602, -3215548, -3150260, -3123057, -3060631, -3013421, -3007610, -3001885, -2959594, -2983046, -2955249, -2932634, -2968397, -2988637, -2990912, -2952880, -2896615, -2858994, -2835435, -2848218, -2880391, -2844019, -2824318, -2790601, -2837761, -2847518, -2857104, -2853812, -2790040, -2770075, -2751005, -2733125, -2667334, -2699689]
19424b699689m5519j9171Q6602K3405q1426l4278O1618M9736L4839J1787J0116
19413b601980P714j993M751p280L8932L1948J3972n3387k5947M6796J9504K7222
19401b499748L8591k1168Q191L2393L6620P691J4936p305j5025j0356M47K824
19389b411909n841k492N0249K5844K7426J799l8521k2822M3195L7194r52k3433
19377b320263O7329O3357k6169q458O800n3097N3816Q2943p059J3338J9034n8079
19365b166508j4941O7054N8427j1995k5224J7866J0091l437j4374K1581j6443
19354b077903j5934Q831K4887L9099m7810o5304N100J8163L9242N455l1749J66
19342b097757O3081P1924K5487o206n4152j5850j3862p189o114M0871L3897K7156
$$ y = [-2699689, -2745208, -2764379, -2677777, -2654372, -2735798, -2770076, -2708458, -2658722, -2623883, -2612096, -2601980, -2594266, -2596259, -2591508, -2598788, -2559856, -2527908, -2513936, -2567323, -2593270, -2546474, -2526970, -2499748, -2461157, -2482325, -2474134, -2441741, -2405121, -2397430, -2382494, -2389799, -2404824, -2415180, -2414733, -2411909, -2417750, -2420242, -2369993, -2344149, -2316723, -2314924, -2353445, -2376267, -2333072, -2295878, -2296830, -2320263, -2252934, -2189577, -2215746, -2224204, -2217404, -2270501, -2216685, -2133742, -2140801, -2127463, -2108429, -2166508, -2181449, -2114395, -2055968, -2067963, -2093187, -2075321, -2065230, -2068667, -2083041, -2061460, -2077903, -2093837, -2085006, -2060119, -2021020, -2068830, -2134134, -2129034, -2110871, -2071629, -2066174, -2097923, -2097757, -2034676, -1962752, -1937265, -1943471, -1997623, -2013473, -2027335, -2034524, -2040638, -1999767, -1965870, -1938714]
19330a938714O089k0631j4725K2396K4541M8147P613L718K3873k288j0848j1650
19318a862479K0233n0650L3862k3724K595K7246M5534K6066K4391o669k6740R458
19306a780877j4009n6090N0163J0992k4699N0190M4442L5836L0286J3835o02J5369
19294a625164K4137J3944k0292k3818m4496R265L7730L6939K7028l1775k8228
19283a624730l9758k4664O065K1582K5731M9761l1724k3819j7246o694r134N5395
19271a619235N0647J1111K0157k5115n6957N908o237O439L6055K457m188L6305
19259a542653L4539L2735J2436n1833o682K580Q166k3481m7141l1318L6559N9530
19247a516563L0102K9820J224m3743j0660L5778K7266k539k1498k2330k6168k5044
$$ y = [-1938714, -1932625, -1953256, -1967981, -1945585, -1921044, -1872897, -1865284, -1861566, -1837693, -1839981, -1850829, -1862479, -1842246, -1892896, -1859034, -1882758, -1880163, -1852917, -1807383, -1781317, -1756926, -1763595, -1790335, -1780877, -1794886, -1850976, -1800813, -1789821, -1814520, -1764330, -1719888, -1684052, -1653766, -1639931, -1640533, -1625164, -1601027, -1587083, -1607375, -1631193, -1675689, -1666424, -1628694, -1591755, -1564727, -1596502, -1624730, -1664488, -1689152, -1683087, -1661505, -1635774, -1586013, -1617737, -1641556, -1658802, -1665496, -1674630, -1619235, -1568588, -1557477, -1537320, -1562435, -1619392, -1613484, -1619721, -1613282, -1577227, -1574770, -1578958, -1542653, -1508114, -1475379, -1462943, -1514776, -1521458, -1518878, -1510712, -1534193, -1581334, -1612652, -1576093, -1516563, -1486461, -1456641, -1455417, -1499160, -1509820, -1474042, -1446776, -1449315, -1470813, -1493143, -1519311, -1544355]
19235a544355L0470L7450o0196M3934M5389j0147k589P5232M4422L0617L4094
19224a275679L7024R657k8921l7232m3160P167Q378J9472k2991m694J4635l1126
19212a347470j9552R626j2722L6349r52K7989J287l7681J8002N0593K5993k6784
19200a275322J1377O327k3244k2936p5L1204K5495J1885j4494J3806o258L5643
19188a206592K2349L2541k1732k0009l9061j9558o402Q732M0502j2019l3373j3792
19176a268414L5984O6300k4586j9623k8199l8669N6752M8686J2394r328k7410
19165a196113n2115j123P5257R5095k6291j14002K432K1376J2752J0304L541P8298
19153a090589K5552m8387k8452L3627j5345N6120P873o1053j4304J0888j1894
$$ y = [-1544355, -1513885, -1476435, -1536631, -1492697, -1447308, -1457455, -1460044, -1384812, -1340390, -1309773, -1275679, -1238655, -1228998, -1257919, -1295151, -1338311, -1331144, -1322766, -1303294, -1326285, -1330979, -1316344, -1347470, -1367022, -1357396, -1370118, -1333769, -1334721, -1306732, -1305445, -1343126, -1325124, -1274531, -1248538, -1275322, -1263945, -1257618, -1280862, -1303798, -1303873, -1272669, -1247174, -1235289, -1249783, -1235977, -1242235, -1206592, -1184243, -1151702, -1173434, -1193443, -1232504, -1252062, -1258464, -1249732, -1209230, -1221249, -1254622, -1268414, -1232430, -1166130, -1190716, -1210339, -1238538, -1277207, -1220455, -1171769, -1159375, -1168703, -1196113, -1248228, -1249351, -1174094, -1078999, -1105290, -1219292, -1216860, -1195484, -1182732, -1172428, -1168887, -1090589, -1065037, -1113424, -1141876, -1108249, -1123594, -1067474, -1059601, -1120654, -1134958, -1124070, -1135964]
19142a135964k1589r826K0310L2138J9837m7656k1476L9972L5738L7360m108l2042
19130a087306J674N1835N3562j5792q497j2280l0745l162m5469O0195K3539l5438
19118a047884l679K5040J1723K4266K8552k8902J383o214p007l9466J3937k0025
19106a048276Q465j820K70m132L0753M1579j0633l5180J3408K7533K1268M2115
19094i14650Q6583J2562m3705k4919m7171l174k3069O8625K2001r29o9577J1390
19082i26033L0236k0397l119K0812J0250J9791N4363J625r415R593l2000O3256
19070g81038N1549l4368j3069L177L7284Q005r409M3340O7130K2167K224r202
19058f12210J493M8451N5680j1825O5485J59419J24359Q1869k3591k62395o80690
$$ y = [-1135964, -1157553, -1167379, -1147069, -1114931, -1095094, -1142750, -1164226, -1124254, -1088516, -1051156, -1055264, -1087306, -1085632, -1033797, -980235, -996027, -1004524, -1016804, -1047549, -1050711, -1096180, -1035985, -1012446, -1047884, -1051563, -1026523, -1014800, -990534, -961982, -990884, -989501, -995715, -1002722, -1042188, -1028251, -1048276, -1039811, -1041631, -1041361, -1045493, -1014740, -973161, -983794, -1018974, -1005566, -978033, -956765, -914650, -828067, -815505, -859210, -884129, -931300, -934474, -957543, -888918, -866917, -867846, -937423, -926033, -895797, -916194, -919313, -898501, -888251, -868460, -814097, -812472, -821887, -812294, -844294, -781038, -729489, -763857, -776926, -773749, -736465, -728460, -737869, -694529, -627399, -605232, -603008, -612210, -610717, -562266, -506586, -518411, -452926, -293507, -169148, -87279, -110870, -373265, -1053955]
19047a053955n76123j72156O6261Q8811J03738M4326R6463N4594J4133j1037O3842
19036a281103P1659L1810K2883j9066N313J8677K3149O004k7734J6400K8873K4445
19024a078690j0133M6662L7622J8784k0119k1896o4200L7844O0082m1620j8823
19013a054487K4500J1968N1653J3693L595L2280L2545j9990q1254m1917P6218
19002i51196M1289J8808n5035l1293o2321L1664M958K5919J5673N867M6338P9296
18990h30033j6712j4247p9678m4686L8722J3061M5057l0052j7459K5911L7579
18979h72537J4168n2689q417L9854L505j7995K5867R691J2620q935K1909n5385
18967h88344L5419K7604N5864N2954j8218q2415M4730P9931j5995k6656J7267
$$ y = [-1053955, -1630078, -1802234, -1735973, -1647162, -1543424, -1499098, -1402635, -1348041, -1333908, -1344945, -1281103, -1209444, -1177634, -1154751, -1173817, -1168504, -1149827, -1126678, -1120674, -1148408, -1132008, -1103135, -1078690, -1088823, -1042161, -1004539, -985755, -1005874, -1027770, -1091970, -1054126, -994044, -1035664, -1054487, -1029987, -1018019, -966366, -952673, -949078, -916798, -884253, -904243, -985497, -1027414, -951196, -909907, -891099, -946134, -977427, -1039748, -1008084, -1003126, -977207, -961534, -955667, -909329, -830033, -846745, -860992, -940670, -985356, -946634, -933573, -888516, -918568, -936027, -910116, -872537, -858369, -911058, -919475, -879621, -876116, -894111, -868244, -858553, -845933, -854868, -832959, -888344, -852925, -825321, -769457, -716503, -734721, -817136, -772406, -692475, -708470, -735126, -717859]
18956g17859J1555n1263n7939M047j2214L6970j1908J1328L0403O1129K5898J4757
18944f55096J9208M72J9938M1256j6782j52367j29902N633p246n5248M9424J04530
18932g76180l5490l1234J4452L3514m73k8464M4329Q8685j2766Q910M3841L1020
18920f19856r533K208L7277j2299k24876k14001k2007Q9025P9019K3280j5810
18909h87573l9689L927J893J6486J7487m403K9475K5764L3074n415p386L7322
18897g79038N1824J7666o5816q1885O246k907O840L5529K9768R033N922j237l5873
18884h03928M102J6112N3232k8344m2047J7919L0876N113J2976M4504K7555m5821
18872g07751m107L853M6487j8593q454p668J6908j5668J3535p663j2233J1925
$$ y = [-717859, -706304, -757567, -815506, -811459, -823673, -786703, -798611, -787283, -756880, -695751, -669853, -655096, -635888, -635416, -615478, -574222, -591004, -743371, -873273, -867640, -874886, -930134, -880710, -776180, -811670, -842904, -828452, -794938, -795411, -823875, -779546, -690861, -703627, -694717, -650876, -619856, -629389, -627181, -589904, -602203, -827079, -1041080, -1063087, -974062, -895043, -871763, -887573, -927262, -923335, -921442, -904956, -887469, -891872, -862397, -836633, -803559, -808974, -816360, -779038, -727214, -709548, -775364, -857249, -851003, -853910, -847070, -811541, -781773, -772740, -766818, -768055, -803928, -799826, -783714, -730482, -758826, -800873, -782954, -752078, -746965, -733989, -689485, -661930, -707751, -711858, -708005, -661518, -680111, -688565, -696233, -679325, -694993, -681458, -689121, -701354, -689429]
18860f89429M2112K3943l0010l0985j7265O1706M4047O410m738j5255r027o181
18848f24672Q038J0209l3836m5044J09330L5185R827J386J2355k5791l7205r8565
18836f78783j38027k8267J5575M4608K7383O771j0607K7968l944M1167N7452j6740
18824f55444p9969K3268l688K1766r324K9005K560K488j6048o6302p2552j8459
18812h42699m1714k0011R951L9645M4546K0981K2760J3892l851N4147N9965K6357
18800f16031k2507J8096R914j639k3486k3075j1690l7416p4879J9130L1884j8169
18788g49868l7888M8170M0230O314M9293M8077k8058m0997k915J9969l4338m649
18776f86660K0056m2442n2489P026K3386O1193J6328n2354j1861J8386N1898M0060
$$ y = [-689429, -647317, -623374, -653384, -684369, -701634, -639928, -595881, -589471, -594209, -609464, -618491, -624672, -616634, -606425, -640261, -685305, -575975, -540790, -530963, -529577, -517222, -543013, -580218, -678783, -816810, -845077, -829502, -784894, -757511, -750740, -761347, -733379, -737323, -696156, -638704, -655444, -735413, -712145, -715833, -694067, -703391, -674386, -671826, -669338, -685386, -751688, -824240, -842699, -884413, -904424, -894473, -854828, -810282, -789301, -766541, -752649, -756500, -702353, -642388, -616031, -638538, -620442, -610528, -612167, -635653, -658728, -670418, -707834, -782713, -763583, -731699, -749868, -787756, -739586, -699356, -693042, -643749, -595672, -623730, -664727, -667642, -647673, -682011, -686660, -666604, -709046, -761535, -754509, -731123, -669930, -653602, -705956, -717817, -699431, -647533, -607473]
18764f07473j3687p5491L5844K9598k0303J3750L4639O148N032K2785l2409k4290
18752f25857K2754m1341j6619J7156L2617J7320j7437j5739l3145O8741M0515
18741e51035m6579O2333K2422l6040o683l6029k6340l2339L5518M2016k1731J4482
18729e80005J0610L5696l5899o4347k2417J3362N9265J5875n5973l8599P7574
18718e84858J4908j6299J3005O5348J6471m9095o5226n2912R004M5454K7826K3904
18706e52470k3908k4103L0179L5156N735j184J7059L7380j6799k3951j5411L8951
18694d93366P551l0939m8327k676J4793k7129j8609k1860l561J7668K7232K3211
18682e56012J1504J984j6397J9650N2017l8034j1177j0132K9682M765L512K7472
$$ y = [-607473, -621160, -696651, -660807, -631209, -651512, -637762, -603123, -596975, -591943, -569158, -601567, -625857, -603103, -644444, -661063, -643907, -611290, -593970, -611407, -627146, -660291, -591550, -551035, -597614, -535281, -512859, -548899, -555582, -591611, -617951, -650290, -614772, -572756, -594487, -580005, -569395, -533699, -569598, -633945, -656362, -643000, -583735, -567860, -623833, -662432, -584858, -569950, -586249, -573244, -507896, -491425, -540520, -605746, -658658, -649654, -604200, -576374, -552470, -576378, -600481, -570302, -535146, -529411, -530595, -513536, -476156, -492955, -516906, -532317, -493366, -485815, -516754, -565081, -567757, -552964, -580093, -598702, -620562, -624123, -606455, -579223, -556012, -544508, -542524, -558921, -539271, -487254, -525288, -536465, -546597, -516915, -512150, -508638, -481166]
18670d81166l6875L60j9881k2527m1849L9259K9767m4226j4505K3441k199K2695
18658e47706J5610R884L4615j9402l2100j3616K9781J9949m246k9156k2597M0268
18646e18716M5150J9477K1156J1235k7173L103l3939O882n908l4385l0900l6506
18634e80524J3772P3203r316j3505m5401j6677O180r829M969N0138L9265J3702
18622d74023j0622K2361j1578l1816J3715K566j1229K2360M1003J9564r641r401
18610d36741j3085J099k6648j618K3691R183j4507p846K0123O131N102j8325j3049
18597d66490k2506j879o0424K1430R932k1347l3075J9176Q8426J2964j0367J737
18585d62423k914k6939n225M1601K3148Q144J4066K9007P997J7081k2516o1470
$$ y = [-481166, -518041, -517681, -537562, -560089, -601938, -562679, -532912, -577138, -591643, -568202, -570401, -547706, -532096, -522212, -487597, -506999, -539099, -552715, -522934, -502985, -507231, -536387, -558984, -518716, -473566, -454089, -432933, -421698, -448871, -445768, -479707, -472825, -478733, -513118, -544018, -580524, -566752, -493549, -502865, -516370, -561771, -578448, -572268, -582097, -577128, -526990, -487725, -474023, -484645, -462284, -473862, -505678, -491963, -489397, -500626, -478266, -437263, -417699, -427340, -436741, -449826, -448727, -475375, -476993, -453302, -444119, -458626, -466472, -446349, -440218, -435116, -453441, -466490, -488996, -490875, -551299, -529869, -519937, -541284, -574359, -555183, -466757, -453793, -464160, -462423, -465337, -492276, -497501, -455900, -432752, -424608, -410542, -381535, -373538, -356457, -378973, -440443]
18573d40443l5041l1661n2434J3994p197q061L0797k4039M5713P6858L601p78
18561d28691J4115l0517l1919o8162J94N2363J4330K220m369l1964L2625K8430
18549d51345J6640j6871l3706J294P422l95k4297O678O547k4214O290M8437r117
18536d66637k3662M1422K9514l5425m7631n996J7623L0111K3605R059q286P245
18524d29058N8064k2871k8654n4632K3042M1223Q103n07k0921k8143L947P944
18512d42463J3145l837m4904J6178Q7104P8625m2604p3699l6637K3023j9151R697
18500d35523j4063Q052K9401M0357K5603r515j6243k9713J5668J0575l965j1142
18488c90508p0814o4275M4040N8597N047k9924J066J5255p788Q047M356O124Q037
$$ y = [-440443, -475484, -507145, -559579, -545585, -552782, -560843, -530046, -554085, -508372, -431514, -427913, -428691, -414576, -445093, -477012, -545174, -544980, -492617, -478287, -476067, -480436, -512400, -479775, -451345, -434705, -451576, -485282, -483988, -476566, -476961, -501258, -494580, -488033, -512247, -505957, -457520, -466637, -490299, -448877, -419363, -454788, -502419, -508415, -490792, -460681, -437076, -428017, -436303, -429058, -370994, -393865, -422519, -477151, -454109, -412886, -404783, -405290, -426211, -454354, -450407, -442463, -429318, -433155, -478059, -461881, -374777, -296152, -338756, -412455, -449092, -426069, -445220, -435523, -449586, -441534, -412133, -371776, -346173, -355688, -371931, -401644, -385976, -375401, -379366, -390508, -461322, -525597, -481557, -422960, -417913, -447837, -446771, -431516, -439304, -431257, -426901, -420777, -412740]
18475d12740J1427L43j9353n399j9142K7630J6185K8651J5946k2485J1282L4202
18463c33453J5582m7442m8739j3779K5296q128K1414K9386J6206k2306m9935j2264
18451d28162n629k9499L2470L5718j2493J0947M7493J2714j824j141R813K614
18439c26979J2536n3710j6421o647k6419p987l0862O3560M7771j3697n4421l6618
18427d49894K5700K2567K2559J7612l5583J9368K1068K1420K1525J627k9528n9262
18415d00821r308M9945L0230k5003J961m4315j2664K2832J4539j3466J7819N3158
18403c15093L1567o295j7350n3749j3512K2872L4503l3008M503J6595m8285m2723
18391d19975J0648J1613J0522k5399j4022M791K4161J9166l7867K2114k2277P6626
$$ y = [-412740, -401313, -400970, -420323, -425722, -444864, -417234, -401049, -372398, -356452, -378937, -367655, -333453, -317871, -365313, -414052, -427831, -402535, -410663, -389249, -359863, -343657, -365963, -415898, -428162, -433791, -463290, -430820, -395102, -407595, -396648, -349155, -336441, -338265, -339406, -329593, -326979, -314443, -368153, -384574, -391221, -417640, -425627, -456489, -392929, -345158, -358855, -413276, -449894, -424194, -401627, -379068, -361456, -397039, -377671, -356603, -335183, -313658, -312031, -341559, -400821, -410129, -360184, -329954, -354957, -352996, -397311, -409975, -387143, -372604, -386070, -368251, -315093, -283526, -289821, -307171, -360920, -374432, -351560, -317057, -350065, -345562, -328967, -377252, -419975, -409327, -397714, -387192, -412591, -426613, -421822, -397661, -378495, -416362, -394248, -416525, -339899]
18379c39899K759n5899l1879l0362K9348K3535K8231l7311l7056j3909K1144L0786
18367d10512J1413o31j5105J4034L1185N0960O285j5860j7471j8664J0189j7117
18355c71294l9157l4778J8526O3532L0003j9186L533j3266J163j0241J9536P439
18343c44190j7069k0411M0579M3465p260J5329l1485n8021K8791M1625N706K1841
18331b81100j2530K1662J8172Q289m2696m6982j4987L0421m117L2488k0052P327
18319c04105r51m2720Q5565L3925m2163k1426O2389M76l114j0429j6304K9582
18307b29275n2932m4627J4559j2058m3029m3477M3195l123n9984M243M7032K3604
18295c55872k1458p6629L8419N7099K4225L8958J0253j4212J6961q943l5545p358
$$ y = [-339899, -337140, -393039, -424918, -455280, -425932, -402397, -374166, -411477, -448533, -462442, -441298, -410512, -399099, -399730, -414835, -400801, -369616, -318656, -312371, -328231, -345702, -364366, -354177, -371294, -410451, -445229, -426703, -363171, -333168, -352354, -348821, -362087, -360924, -371165, -351629, -344190, -361259, -381670, -341091, -297626, -304886, -289557, -321042, -379063, -350272, -308647, -302941, -281100, -293630, -271968, -253796, -245507, -288203, -335185, -350172, -319751, -323868, -291380, -311432, -304105, -305056, -347776, -262211, -228286, -270449, -291875, -229486, -229010, -232124, -242553, -258857, -229275, -282207, -326834, -312275, -324333, -367362, -410839, -367644, -370767, -430751, -426508, -379476, -355872, -377330, -453959, -415540, -358441, -334216, -295258, -285005, -299217, -282256, -291199, -326744, -334102]
18283c34102J3545M089N1955k1542p7143r212J9593J0383N6617J7092q0950K1351
18271c28324K7101O094L2638k3110j6312j918q676m154j6430L1391J5270j0021
18259b96451m242j944l9324L2941N4730j8889m0968k3514l1106m817J1608k2783
18247c84759k7031L2053J0204J3716M1M5594M0652M8363M423n6446r859K8437
18235b54612K60k0279M758L6773l9009j8314j135K558l8683l589J2721m8516o1022
18222d28089L6073O8808M8956J5564q872o427J0391M3142j8850o5399o6224K8324
18210c42603M8635L0244K8114j6762k3607O4749l815K8399j5367J0479m0604j7519
18198b49657J7616L3607j0000k2667k7565L0970N3670j4430n7267L786k1612j0699
$$ y = [-334102, -320557, -316468, -264513, -286055, -363198, -372410, -352817, -342434, -285817, -268725, -349675, -328324, -301223, -295129, -262491, -285601, -301913, -303831, -312507, -316661, -333091, -301700, -286430, -296451, -300693, -302637, -341961, -309020, -254290, -273179, -314147, -337661, -368767, -373584, -361976, -384759, -411790, -379737, -369533, -355817, -355776, -310182, -269530, -221167, -216744, -273190, -283049, -254612, -254352, -274631, -269873, -233100, -272109, -290423, -291558, -289000, -327683, -331272, -318551, -367067, -428089, -392016, -323208, -274252, -258688, -267560, -273987, -263596, -220454, -239304, -304703, -370927, -342603, -293968, -263724, -235610, -252372, -275979, -211230, -215045, -186646, -202013, -191534, -232138, -249657, -232041, -198434, -208434, -231101, -258666, -227696, -174026, -188456, -245723, -241937, -263549, -274248]
18186b74248Q514k4826l609k4898m0746j624Q363J6496N2880k0018k4821j9938
18174c48475L39K4049m496L8885j4343k3016N006m788j7526q053R786O0684L8691
18161b43257N7506j6991m0049l175p268k4384j6180L4124M9233l1695L3463l5546
18149b44219n6489m5909J988K2255J4108k7629m984L5449o635K475O4483J1281
18137b33826l1722l7383j175J9773j5611o359N1538J7141l0331r677J6817k3100
18125b83915J4990J8397M5563K4040k0581j9490n6565K6348L9237m4272l444o694
18113b66386m0987k0355M5007J2390M256j4767J7772J5883J0111j9203j9936m961
18101b81176L3849l534M1598M014k1092q912o1959P84P2658K0694k8048K3044
$$ y = [-274248, -265734, -290560, -294169, -319067, -359813, -361437, -353074, -336578, -283698, -303716, -328537, -348475, -348136, -324087, -328583, -289698, -304041, -327057, -322051, -326839, -344365, -352418, -342632, -281948, -243257, -185751, -202742, -242791, -245966, -253234, -277618, -293798, -259674, -210441, -242136, -208673, -244219, -300708, -346617, -344629, -322374, -308266, -335895, -340879, -305430, -312065, -309590, -245107, -233826, -265548, -302931, -304106, -284333, -299944, -306303, -254765, -237624, -267955, -277632, -260815, -283915, -268925, -250528, -204965, -180925, -201506, -220996, -277561, -251213, -211976, -256248, -259692, -266386, -307373, -327728, -282721, -270331, -266075, -280842, -263070, -247187, -237076, -256279, -276215, -281176, -247327, -250861, -209263, -205249, -226341, -235253, -297212, -296428, -223770, -203076, -231124, -208080]
18089b08080M6143j5296l0850j8352L0527J0148N2114n7896p5475j8618n36N0306
18077b35865N0989J1733p1550j04508L8425Q1880K6909q1705k4586N5799M4708
18066b07771K3192n5661m5835p674K7531J7198K6128L5021J5638n0373O068L409
18054b13129N90m3796k1883J5049k1770j3065N262J8207L8017J9791k3217j6691
18042b56635L423k97k7974K2510N1946M735k982K2484K234n51l2574m5817N659
18029b53839J419l5310N4007j0280m0180l597K8169O245K4610J5771J660j5585
18017b26910j8827l9605K2968l999l2589K2085O6551J6053l3730q160J4318j0086
18005b31931L121J8148J7687l957k6534k2181K0380l7051j2201N2960P4j0236
$$ y = [-208080, -161937, -177233, -208083, -226435, -195908, -185760, -133646, -191542, -267017, -285635, -286171, -235865, -184876, -173143, -244693, -349201, -310776, -228896, -201987, -283692, -308278, -252479, -207771, -184579, -240240, -286075, -293749, -266218, -249020, -222892, -187871, -172233, -222606, -216538, -213129, -212539, -256335, -278218, -263169, -284939, -298004, -292742, -274535, -236518, -216727, -239944, -256635, -253212, -253509, -281483, -258973, -207027, -202292, -205274, -182790, -180556, -181107, -213681, -259498, -253839, -252420, -287730, -233723, -244003, -284183, -287780, -259611, -253366, -228756, -212985, -211325, -226910, -245737, -285342, -262374, -266373, -298962, -276877, -210326, -194273, -228003, -236163, -221845, -231931, -228810, -210662, -192975, -196932, -223466, -245647, -225267, -262318, -274519, -221559, -221485, -231721]
17993b31721j3744J8421j2262j7637M1521l451j2449n3667k0951O0330N5600L6908
17981a53102l5773l6460j1534M6374o280n1371J259K828M539J3151K8161P476
17969a90732K1547j7022l6502Q672Q6963m0538n6007R12j5745M5855J6765k3029
17957a98861L1949l9287n2327M2224p764l081M6622l8975L5507L3682L4700j1785
17945a27396m5018k0401l8380K2847p873l3038M3863M6041j6393l106N593m6374
17933b19635j5354N3098j1756k8758k156K451j3699o0594J4524J8497L3106K8513
17921b01763r753P733J3466j2045K2973O878N646O742k4024n4423j1359N6603
17909a93326O6168o4524q739j738J2673N26J1259N1420j3150o1870l348L9409
$$ y = [-231721, -245465, -227044, -239306, -256943, -215422, -218873, -231322, -284989, -305940, -245610, -190010, -153102, -188875, -225335, -236869, -190495, -196775, -248146, -246887, -244059, -239520, -226369, -198208, -190732, -169185, -186207, -222709, -214037, -127074, -167612, -223619, -222707, -238452, -192597, -175832, -198861, -166912, -206199, -258526, -216302, -224066, -227147, -180525, -219500, -183993, -150311, -115611, -127396, -172414, -192815, -231195, -208348, -216221, -249259, -205396, -159355, -175748, -178854, -173261, -219635, -234989, -181891, -193647, -222405, -224561, -222110, -235809, -296403, -281879, -263382, -230276, -201763, -211516, -203783, -190317, -202362, -179389, -172511, -166865, -160123, -184147, -238570, -249929, -193326, -127158, -191682, -200421, -202159, -189486, -188960, -177701, -126281, -139431, -201301, -204649, -165240]
17897a65240l6048p980L6753M3117o5984m2649L2961K9635J6934l7279k1463p5152
17885b92395K7343P9409L4910o0879k9060P6262R26j529M875Q332j9650m7508
17873b18964N579j1387m4750m9806K5331k468M5707N6694j65L445Q655k489k7595
17860b12213L1080j3583k3815j0725J6935K5931L3454q156m5124l5816J7206N5814
17848a69012M4791R544l1352R897r464m7356k1190N1224O3866R400m3215J6462
17836a16405k750l7777m4488m5163K1671J5755k600q850J8769M846K4638o376
17824a78730M124l210M410L9054m3592q5573P749M6986M3139k0599m3543k9196
17812b58981M0079O0149N5456r856j3122J4609k6056K1263l986j1609r207J2114
$$ y = [-165240, -201288, -209268, -172515, -129398, -195382, -238031, -205070, -175435, -158501, -195780, -217243, -292395, -265052, -185643, -150733, -211612, -240672, -164410, -163484, -165013, -160138, -151806, -171456, -218964, -213385, -224772, -269522, -319328, -293997, -296465, -250758, -194064, -194229, -190784, -182129, -184618, -212213, -181133, -194716, -218531, -229256, -212321, -186390, -152936, -161092, -206216, -242032, -224826, -169012, -124221, -114677, -146029, -136132, -145596, -192952, -214142, -162918, -99052, -89652, -132867, -116405, -119155, -156932, -201420, -246583, -224912, -209157, -211757, -220607, -201838, -196992, -172354, -178730, -174606, -177816, -173406, -134352, -177944, -263517, -255768, -208782, -165643, -186242, -229785, -258981, -218902, -158753, -103297, -113153, -126275, -111666, -137722, -116459, -120445, -132054, -141261, -129147]
17800a29147O117k8331m8171j287M6638J4875K7510J1701k8507j3351m2979o0968
17788b45900J6362L907n7447M7217J04821J5290K658m2120J8066j9115n7055J238
17776b12078j3381l9704M5528L0585L5490J4679l9061l6297m497M6955K4252M196
17764a43333P602p08j5534k6559n4333j8509N9022M2461j3474n1257k3975L5789
17752b02808K3380j3451J6474L705l6480K3874R043L8269k0802k9949J9735O9121
17740i9889m5544j9320k1077j1293K0220M4824m003J6793m0920J0268M4797L1882
17728g3262l7367o0376L494j7999J4568k3060j2102j881k2688K4695J3809m079
17716a96248j0968J2495k0582N1957K9593o847K3703q010l7457m6987k8047N4418
$$ y = [-129147, -123030, -151361, -199532, -200819, -154181, -139306, -111796, -100095, -128602, -141953, -184932, -245900, -229538, -225631, -283078, -235861, -131040, -115750, -113092, -155212, -137146, -156261, -213316, -212078, -225459, -265163, -219635, -189050, -153560, -138881, -177942, -214239, -218736, -171781, -147529, -143333, -135731, -136439, -151973, -178532, -232865, -251374, -192352, -149891, -163365, -214622, -238597, -202808, -179428, -192879, -176405, -172700, -209180, -185306, -176263, -137994, -158796, -188745, -169010, -99889, -145433, -164753, -185830, -197123, -176903, -132079, -136082, -119289, -160209, -149941, -105144, -73262, -110629, -171005, -167511, -185510, -170942, -194002, -206104, -207985, -230673, -205978, -192169, -196248, -207216, -194721, -215303, -163346, -133753, -140600, -116897, -124907, -162364, -209351, -237398, -182980]
17704a82980K8097k1165K0760q689j2361J2926K5456J1616m1073m842J6268J7711
17692a38276k4296J3338M9947m7816M9098L811l096J8466J5934l5288j04146K039
17680b00285L2597K2302L7377j2571o90k6799K577L448m3568k6456L5020M0398
17668a36650r372L0297o64j0592K1797M6404j4722j5939l071J3277J0898j4832
17656h3169L2768m6807r169K9452N426k5927j3408m3288o969j0007M1282O2026
17644f7790j0167m6771J1191J871K3308M5408J5826J6690q2268p1448n563K3152
17632a46561k963J5841M9579K808m4438j7379J0170R998m7175J3937M0910K9075
17620h6198m2820m2687K5988k9845k6715j1569l918M7235K0068l3211L0599K8166
$$ y = [-182980, -154883, -176048, -155288, -163977, -176338, -163412, -137956, -126340, -167413, -172255, -155987, -138276, -162572, -149234, -99287, -147103, -98005, -94194, -97290, -78824, -62890, -98178, -202324, -200285, -167688, -145386, -108009, -120580, -121270, -148069, -145492, -142044, -185612, -212068, -177048, -136650, -146022, -115725, -116389, -126981, -105184, -58780, -73502, -89441, -92512, -79235, -68337, -83169, -50401, -97208, -106377, -76925, -71499, -97426, -110834, -154122, -161091, -171098, -129816, -67790, -77957, -124728, -113537, -111666, -88358, -42950, -27124, -10434, -92702, -164150, -169713, -146561, -149524, -133683, -84104, -81296, -125734, -143113, -132943, -122945, -170120, -156183, -115273, -86198, -129018, -171705, -145717, -175562, -202277, -213846, -217764, -170529, -150461, -183672, -153073, -124907]
17608a24907o338j3850K1718Q70K66j7917l0461R307L0688K2024k1625p278k395
17595a39898m496m2791l0637N06J0898N1901M9951L7029k178L5186K7782j8294
17583b5041l7397m7988m0465L3556N603J2305K3251R757k6383k9750j0103l1846
17571a64501m966k9668j2386K2753j3445K6744M0723O2264L376m7008M5887k5380
17559i5607l5167L6745M8411p486j5627K5365j5797l1319o2710k4895l1505K4165
17547a85427R4920L2624K9713l1296m6037k8252j476J7019j582K2853m939m4660
17535a46540j9921m368K0593k1363K5627J5998k5455j9593K4989K043L2909J1017
17523a04064m2793j9520J9859O7338l960j103O663m4962m4363J0924J6951K2436
$$ y = [-124907, -131245, -145095, -123377, -122507, -122241, -140158, -170619, -161312, -130624, -108600, -130225, -137503, -139898, -144394, -187185, -217822, -217316, -206418, -154517, -104566, -67537, -69715, -34529, -6747, -25041, -62438, -110426, -150891, -117335, -111732, -99427, -76176, -66419, -92802, -122552, -132655, -164501, -169467, -199135, -211521, -188768, -202213, -175469, -134746, -72482, -69106, -116114, -70227, -95607, -130774, -94029, -45618, -53104, -68731, -43366, -59163, -90482, -153192, -178087, -209592, -185427, -90507, -57883, -28170, -59466, -105503, -133755, -135231, -118212, -119794, -96941, -101880, -146540, -166461, -170829, -150236, -171599, -145972, -129974, -155429, -175022, -150033, -147990, -115081, -104064, -146857, -166377, -146518, -79180, -83140, -84243, -77580, -122542, -166905, -155981, -139030, -116594]
17511a16594J5797L8004K0826q091k4333j3194m3706K976N3086L1025M170n4510
17499i4544l1470n773N4119M7089N5447j8211o1342m9332o0710k634n1823Q550
17487b10634O9887j9158l8269J3373K8217L1778J2022L2159R121p659j865N738
17475g5290L497L7562K5273k5811j9971j7817n8756k2812P7561J8085q8809j1432
17463a58720J7901K7320n4318M24J4419J1210M1238j8080l2070j2913M082P0784
17451h8723M9769l8183o0741J1552k9856J6415N2562L1019j0307k0931J5705l08
17439g2027k3931J4467J6009N2562k9092K4000k8989k7732n274l7818o863M1721
17427h2967N925j2288k6948k0657K1644N9206m6001M3576L2785j0432k3676P37
$$ y = [-116594, -100797, -62793, -41967, -50058, -74391, -87585, -131291, -128315, -75229, -44204, -40034, -94544, -126014, -131787, -77668, -30579, 24868, 6657, -54685, -104017, -164727, -167361, -219184, -210634, -140747, -159905, -198174, -184801, -156584, -124806, -112784, -80625, -71504, -79163, -81028, -75290, -71793, -34231, -8958, -34769, -54740, -72557, -131313, -154125, -76564, -58479, -147288, -158720, -140819, -113499, -167817, -167393, -152974, -141764, -100526, -118606, -150676, -163589, -159507, -88723, -38954, -77137, -137878, -126326, -156182, -139767, -87205, -56186, -66493, -87424, -71719, -72027, -95958, -81491, -65482, -12920, -42012, -18012, -47001, -74733, -80007, -117825, -124688, -82967, -77042, -89330, -116278, -136935, -115291, -56085, -102086, -58510, -25725, -36157, -59833, -59096]
17415e9096k7712l4255K3073L0959R052K3463j7384o027K6498j8514l0104N190
17403g4857L0852n106K242L1262M8531J4525n8357j180n3406k4619M5454O260
17391c8399r295k4473j1282Q5300n4157o4475M7623N4903m3434K4926k1054K6769
17379b7048r50j8365k4257J8715l7988o5317J4493M5289K5532j4079K5896L4733
17367b3346L475m1729o2457J547N2922q998K364J5103k3740K101j591N7174m974
17354c2149O413j3108n0502k1419K3762p285N2095p190l5533R575K0409L9921
17342a5011k2826k291J2561j6094k8816N0033K7545n2412N154J5985l9012m688
17330f9872L0006Q847m4447O27k4754L0776K0363l5644m2407P1003N1815M9454
$$ y = [-59096, -86808, -121063, -97990, -67031, -57979, -34516, -51900, -57927, -31429, -49943, -80047, -74857, -44005, -49111, -46869, -15607, 32924, 47449, -10908, -12088, -65494, -90113, -44659, -38399, -47694, -72167, -83449, 1851, -52306, -116781, -69158, -14255, -57689, -32763, -53817, -27048, -27998, -46363, -70620, -51905, -89893, -155210, -140717, -95428, -69896, -83975, -58079, -23346, -19871, -61600, -124057, -122510, -69588, -78586, -76222, -61119, -84859, -82758, -84349, -27175, -32149, -25736, -38844, -89346, -110765, -87003, -94288, -42193, -49383, -84916, -75341, -54932, -15011, -37837, -40128, -27567, -43661, -72477, -22444, 5101, -47311, -42157, -26172, -65184, -69872, -39866, -31019, -75466, -74839, -99593, -68817, -48454, -84098, -126505, -55502, -3687, 45767]
17318D5767j1710q4734l6026P991O640l8615J0193M0058L7290k8421o5277k5439
17306a42283J4422M9049j6874L2948L2808o701J8275K0724Q289j9404L149n812
17294a1410l031o3120o1225p161n136O5547J3944k5174k7118K6285P8463J6105
17282c031K487o417J1845J1881m421m7034o9114o7336k6271L8481j5038j1971
17270a85939J5319N7243M5390O078J390K5647j8963k5693K9306q125K8757l304
17258c2894k6030M8599j3029J5510J3718O259j2440l1953J958K8490k7189k6440
17246e5441J9642L334l7042k9497j0153j1670N2188N3473M7051n409n6807m0884
17234g1215M2836o690r22j3011k4583M10J6455L5153L5499k0257P778j1010q619
$$ y = [45767, 34057, -50677, -86703, -78712, -72072, -110687, -100494, -60436, -23146, -51567, -116844, -142283, -127861, -78812, -95686, -62738, -29930, -36631, -18356, 2368, 10657, -8747, -5598, -11410, -14441, -77561, -138786, -145947, -151083, -85536, -71592, -96766, -123884, -97599, -19136, -3031, -544, -6961, 4884, 16765, 12344, -34690, -103804, -171140, -197411, -158930, -173968, -185939, -170620, -113377, -67987, -61909, -60519, -34872, -53835, -79528, -50222, -58347, -29590, -32894, -58924, -10325, -23354, -7844, 5874, 12133, -307, -32260, -30302, -1812, -29001, -55441, -35799, -32465, -69507, -99004, -109157, -120827, -68639, -15166, 31885, 26476, -30331, -71215, -28379, -35069, -35991, -49002, -73585, -73175, -56720, -21567, 13932, -6325, 1453, -9557, -18176]
17221a8176N5214K6595k1814m7033p0188j0576J1799L9238J9359m9145P214M639
17209e2874Q136k9864J5570k1369k6851N5932M8965o133l730L3412L1048m2878
17197I364q9082L4053K6368K3745m4542j2863j4284j6217J7872N5787J3912J3577
17185A7690L7517q826m3942p7743j6510J5563K3713K0039l9149j5449N0802r405
17173d5700L534M4913k1806n3531k5343q352N2839O1995J5553l9127l7704q502
17161f1231J9752j3334J5240K3675M645j6535j8883K7089M5343l1700j3748j9491
17149c9178l9413K6923N1202J228O331k2611N2036P3518L92K1312l3448n9763
17137C8529n5600k5981k9980l547P628L8520p05j059k6358k4142J4959M3697M4589
$$ y = [-18176, 37038, 63633, 41819, -5214, -75402, -85978, -74179, -34941, -15582, -64727, -57513, -52874, -44738, -74602, -59032, -80401, -107252, -51320, -2355, -8488, -12218, 21194, 52242, 9364, -79718, -45665, -19297, 4448, -40094, -52957, -67241, -83458, -65586, -9799, 4113, 17690, 55207, 46381, 2439, -75304, -91814, -76251, -52538, -32499, -71648, -87097, -36295, -45700, -42166, 2747, -19059, -72590, -97933, -106285, -53446, 8549, 24102, -15025, -52729, -61231, -41479, -54813, -39573, -15898, -11253, -27788, -46671, -19582, 25761, -5939, -19687, -39178, -78591, -51668, -466, 762, 7093, -15518, 36518, 110036, 110428, 131740, 98292, 38529, -17071, -43052, -73032, -76579, -68951, -30431, -31136, -32195, -58553, -82695, -67736, -24039, 20550]
17124B0550J2070j924o0065m0733n9595N218P9296J9566j8976N533Q342J9470
17112a1248K201k1023j547j8178m268o098M2401K7017l9101R39O11N7477M1065
17099G0248J5559j7231n7001m8606J1566K1148r59j0736l2068m4171M7314k2452
17087f7389J0649j9920p2171K5410J7094j7306J6543k0256P154M5367N6152N8187
17075C9514J208m1472k2043l5011j1830N889N8663K2949j7772l4405M389j0317
17063d0238k1558o4502M4833M3638k8326k1128K5612L3312L397k8008j925L981
17051e0912K3429K7792p443J2447J1341q508l5672k2759J2108R127N8260l0236
17039a026j4304Q452K9493n460k4505K9872N878k6333r371K6454R362n2352J6678
$$ y = [20550, 32620, 30696, -29369, -70102, -129697, -124479, -45183, -25617, -44593, -39060, -30718, -11248, -9047, -30070, -31617, -49795, -54063, -60161, -17760, 9257, -29844, -28905, -28294, 29183, 70248, 85807, 68576, 11575, -37031, -25465, -4317, -5276, -16012, -48080, -92251, -44937, -67389, -56740, -76660, -148831, -123421, -106327, -123633, -107090, -127346, -120192, -74825, -18673, 39514, 40722, -750, -22793, -57804, -69634, -63745, -5082, 17867, 95, -34310, -29921, -40238, -61796, -126298, -81465, -37827, -66153, -87281, -61669, -28357, -24960, -52968, -54893, -50912, -27483, 309, -7134, 5313, 16654, 8146, -27526, -50285, -38177, -29050, 29210, -1026, -15330, -6878, 22615, 17155, -7350, 22522, 28400, 2067, -7304, 19150, 28512, -23840, -7162]
17026g162j610r893j8499m515j5929Q149M9901Q778m8841m01L4714L6188p470
17013B3410M4010J0112r087m0422K835k1319Q300J7716m1967k8016L922o3782
17001i4288q071J2308O3241J7184K367m4975J1268K6290J2467N9372M2483p2275
16989B7371j9468k6571j0996K5852m5376j6495J3538O8537k3704n3686K1897M8566
16977I465J2717r3186l5034P2745N8547j1532r880k4794M486N133k0713J6091
16965a5955m1302j2120M101M7633N7041K9356O15q501n5091L000L8426K3643k9445
16952D1401m1525j8599k7038K1739M2920R208l2554o610l469m1014l0432k3426
16940a09399M1794M7206L1401k7170J071J2201j518n8403L2724K6964J1795K6523
$$ y = [-7162, -8772, -18665, -37164, -41679, -57608, -49459, 442, 9220, -39621, -40022, -5308, 30880, 23410, 67420, 77532, 68445, 28023, 30858, 9539, 17839, 35555, -6412, -34428, -30506, -94288, -102359, -90051, -26810, -9626, -7259, -52234, -40966, -14676, -2209, 57163, 99646, 27371, 7903, -18668, -29664, -3812, -49188, -65683, -52145, 16392, -7312, -60998, -39101, 9465, 22182, -71004, -106038, -33293, 25254, 13722, 3842, -20952, -16466, -11333, -32046, -15955, -57257, -69377, -65276, -17643, 39398, 68754, 69369, 60868, 5777, 8777, 47203, 70846, 41401, -124, -18723, -45761, -24022, 18898, 28106, -4448, -11058, -14527, -55541, -85973, -109399, -67605, -20399, 11002, -16168, -15097, -2896, -4414, -62817, -30093, -3129, 8666, 35189]
16928C5189m3901L168K2650R378l7712L083m3715p063J5801K9355l9062j200J6777
16915c7252M1414N874K4536P448j1980J4880M7701r423k660j552l2278m8615m8589
16902e0496O328j2480J2005J7662L2869L1145q880l9620J7756J9207j3706l4720
16890b2930P4890j9709n1410J3698L5624k9488l2761J4542L329K9674K5112q120
16878C2451M3899J5443j5221q1957k4149j3553J9369j2877O25M5506K4398j7159
16866A6775k8688k382K2915K1271M3661j261k6142j5396j7734P408l8332l3051
16854e0956J2139p573L9872j2153J14L6228O411j5714j7960l7332l0777l8999
16842a16700N1412L3224L7571J2743J521k3089n0997k1916l9688K3629O7668M9751
$$ y = [35189, -8712, -5544, 17106, 26484, -11228, -8145, -51860, -58923, -43122, -13767, -52829, -54029, -37252, 4162, 10036, 34572, 42020, 30040, 44920, 92621, 83198, 80538, 78986, 46708, -1907, -50496, -44168, -56648, -44643, -26981, 5888, 37033, 28153, -11467, 6289, 25496, 11790, -22930, 51960, 32251, -19159, -5461, 30163, 675, -32086, -17544, -14215, 15459, 40571, 32451, 76350, 91793, 76572, -5385, -29534, -43087, -23718, -36595, -35970, 9536, 33934, 16775, -11913, -14295, 8620, 29891, 73552, 72291, 46149, 30753, 13019, 20427, -17905, -50956, -38817, -46390, -6518, -18671, -18557, 17671, 24082, 8368, -9592, -46924, -77701, -116700, -65288, -32064, 5507, 18250, 19771, -3318, -54315, -76231, -115919, -92290, -24622, 25129]
16830B5129r995l4793j049N9182K6594J95J3072j3764o2386l2252L7165N7394
16818F4492L8626l4718o3056Q740K3585K2423P100n2155k8131k4412m4196j1717
16806i3419L8153K0937k3004J4556J8288K3656K8579j8718m1325L0917J3691K1760
16794C4071n498j9335J1504K1892J355j6516q386m1674l6686N078J158p13N8392
16781D642L4789l492K427k3899J8250j0757j5093J8620j2335M5748J5846r042
16769F5704m1717l3474J3022L5225l6016o7327l1313L1032L7892J4655J2839m2146
16757d1624J0002k2111J3915J9264L0496J3110j1471j1042k2433K8695K0453k8209
16745i55K9521r536J7418j2831k1188M8194K9943n964m8158J1236N3592M1495
$$ y = [25129, 15134, -19659, -20708, 38474, 65068, 65263, 78335, 64571, 2185, -30067, 7098, 64492, 103118, 68400, 5344, 14084, 37669, 60092, 67192, 15037, -13094, -37506, -81702, -93419, -55266, -34329, -57333, -42777, -24489, -833, 27746, 9028, -32297, -1380, 12311, 34071, 28573, 9238, 20742, 42634, 43989, 27473, 19087, -22587, -59273, -54195, -53037, -53750, 4642, 39431, 35939, 38366, 14467, 32717, 21960, 6867, 25487, 13152, 58900, 74746, 65704, 23987, -9487, 3535, 38760, 2744, -64583, -95896, -64864, -26972, -12317, 522, -41624, -31622, -53733, -39818, -20554, 9942, 23052, 11581, 539, -21894, 6801, 27254, -955, 28566, 19030, 36448, 23617, 2429, 50623, 80566, 74602, 26444, 37680, 91272, 132767]
16733A32767o2935n5360N0722K810L5439M6566J787n4560p7308k2721K6709k3526
16721C90N9969L4532k4937k7829o479K9792N6099K9361Q703n172K3223j1569n4763
16708A11320n7010k3506k1717k0830R937N0043l054m605l7444K9916j7624l9811
16696b4385M1133M3744j965l7509K9109j9904m8410K1065l370J2360K4895q182
16684B8581N730k7176k7142m805J06629K4153q182j6993r812l5946l7946o401
16672i310o283L5808M027q8k178l852l631N790k7147j5681m188K2303O9427o885
16658E8112o5582m805L0788K4117l4081k2484Q871O019J385J690p5583N876p767
16645g3444L9681P402Q273N4142M056l3994L8147J0168j351M1063M3898j0055
$$ y = [132767, 69832, 14472, 65194, 68004, 103443, 150009, 151796, 97236, 19928, -2793, 23916, 390, 60359, 94891, 69954, 42125, 35646, 65438, 121537, 150898, 159601, 154429, 177652, 166083, 111320, 54310, 30804, 9087, -11743, -1806, 48237, 45183, 40578, 3134, 33050, 15426, -24385, 16748, 60492, 58527, 21018, 50127, 30223, -18187, 2878, -492, 11868, 36763, 28581, 34311, 7135, -20007, -24812, 81817, 105970, 97788, 80795, 70983, 35037, -2909, -9310, -15593, 20215, 24242, 24154, 21976, 18124, 14493, 20283, -6864, -22545, -26733, -4430, 64997, 58112, -7470, -12275, 18513, 42630, 8549, -13935, -5064, 955, 2340, 4030, -71553, -65677, -73444, -33763, -26361, -18088, 36054, 40110, 6116, 44263, 54431, 53080, 94143, 138041, 127986]
16633A27986o6762j7660L0662J412O656N976j3404m6982n3575r281m6807J1816
16621f9963N7947N8527K555O254K294J0017k576l6036j1632M4233N2121m5776
16609F7965j00027n111L1316M3846l7500O117L7223n592m278L9675j9553k0294
16597C3787j1140k0425k4021N9828N1848m3977J0433K6367L237l0410j0407M1262
16585H6382K1787P189k7473J9235n5159n9092J130N8879L6368j0269J0875K8540
16573A18392k9658l1616K6963l070L1290n8144l0074L8715L576L886k300K7479
16561I5439m7832o0162J7281N5713K784n2597R328M4968N218j068J032n53L9012
16548A08563k873n1522j3833J8939J3923J1927P463J4578m108M7877j8028p0032
$$ y = [127986, 61224, 43564, 74226, 75638, 82294, 88270, 74866, 27884, -25691, -34972, -81779, -69963, -12016, 46511, 49066, 55320, 57614, 67631, 65055, 29019, 17387, 61620, 113741, 67965, -32062, -37173, -5857, 37989, 489, 6606, 43829, 38237, 33959, 73634, 54081, 33787, 22647, 2222, -21799, 38029, 89877, 45900, 56333, 82700, 85937, 55527, 45120, 86382, 108169, 115358, 87885, 107120, 51961, -7131, -6001, 52878, 89246, 78977, 89852, 118392, 88734, 57118, 84081, 81011, 112301, 54157, 24083, 62798, 66374, 70260, 67960, 95439, 47607, -12555, 4726, 60439, 63223, 10626, 19954, 64922, 70140, 69072, 70104, 69551, 108563, 105690, 54168, 40335, 59274, 73197, 85124, 92587, 107165, 103057, 150934, 132906, 62874]
16536F2874L4657k0736m1070R895L3514K3870k4246m252L534Q893M6765l2604
16524A01094n7554n6293k6089O7044M2145k2081q0195m026J0890K4188K417K4207
16512B5747K8098k1244j7955J690O1869J6754n9477j2997J3828l737j5205j4701
16500B670L5795k3349p145j3686K9792q945M435J2344Q535j5255j4437o314K2084
16487B6524K6135M2669J3166n9790m0261M7540O436j1230j9960P499m24j2307
16475B5997o0975j6103K3248L9154j071J6453K2690p364q153k5170l7274J264
16463b7304K202M0852J4770L0984j3001p6483N154K7891J8563J8725k7545J1421
16451B6229j3343k8206j3373K4487K1637l9938J5960R3527J9854m2624j1522k9848
$$ y = [62874, 97531, 76795, 35725, 45620, 79134, 103004, 78758, 74506, 78040, 86933, 133698, 101094, 43540, -12753, -38842, 28202, 70347, 48266, -31929, -35955, -25065, -877, 1540, 25747, 53845, 32601, 14646, 16336, 78205, 94959, 35482, 22485, 36313, 32576, 17371, 2670, 38465, 15116, 7971, -5715, 24077, 15132, 19567, 31911, 40446, 25191, 10754, 4440, 26524, 52659, 95328, 108494, 48704, 8443, 55983, 62419, 51189, 31229, 38728, 38304, 25997, -34978, -51081, -27833, 11321, 10250, 26703, 49393, 42029, 33876, 8706, -28568, -27304, -25102, 15750, 30520, 61504, 48503, -27980, -22826, 5065, 23628, 42353, 14808, 26229, 12886, -15320, -28693, -4206, 17431, -22507, -6547, 86980, 106834, 64210, 52688, 22840]
16439B2840M829j5973K4788L8075j1909m0861m2129L5257q14L1070r506M099K8742
16426F8508M02l3858j5499q561j7414p013K9415J782k5713j292J0029R426J7578
16413B7790O6986K3192L4986j514l9897m2849K0422l747n0191L6528K0743m6055
16401D6394M813O107r081J7990k7024l6557j978L4642R27K2807l00m3195K9975
16388D5520K8968Q606J2135r935P862l7280m5300N5755Q8558k7231m1650l5474
16376E0534o17M0712M155j2012k4831l9729R805j2528L2859J4669l3206m3884
16364a4073R70L3648k893K2517j912l6803J6378L2639L157k699J9308J4080o845
16351G7472P836K7027k5117j199q489o074k5068P988j8478L1078k3129M3l7535
$$ y = [22840, 27669, 11696, 36484, 74559, 62650, 21789, -20340, 14917, 14103, 45173, 35667, 39766, 68508, 68910, 35052, 19553, 10992, -6422, -13435, 15980, 17762, -7951, -9243, 786, 10212, 27790, 94776, 117968, 152954, 151440, 111543, 68694, 89116, 85369, 35178, 71706, 92449, 46394, 51207, 57314, 48233, 66223, 39199, 2642, 664, 35306, 36233, 59040, 58740, 15545, 45520, 74488, 83094, 95229, 85294, 93156, 55876, 10576, 66331, 154889, 127658, 86008, 50534, 49917, 90629, 94784, 82772, 57941, 18212, 28017, 15489, 48348, 63017, 29811, -14073, -13103, 20545, 17652, 40169, 38257, 1454, 17832, 50471, 53628, 50929, 70237, 84317, 77472, 85308, 112335, 87218, 86019, 77530, 71456, 46388, 54376, 35898, 66976, 43847, 43890, 6355]
16338F355j8955k9517o026N0775Q432p70K1848M1883j4511l7833p107P7528L8650
16325A30752j5441m0805m6476J4003K2413j2443j3327k7130j1343M8837O0795
16314A09835k456r264M3205m7146k6204k830R226K1974j9033o667l1648m4643
16302e651O5132J6283m6689k8141m4736K8826O4710L0527k4619O490m229j2745
16290D5158P457k0529j1515O9037J7504l4510L139K1312J5480m0393n3909k2091
16278c860R078L2030k5690N9518j3876L498p616j811J5079k4981J781j1326j8558
16265A3266P658L4490Q7049K9963m9359l0116j2564J1755j8202q298n311P212
16253F7543n376K6818K508l4942j2950O49m994L048k801L4402L479P84j0861M3720
$$ y = [6355, -12600, -42117, -48143, 2632, 11064, 10294, 32142, 74025, 59514, 21681, 14574, 92102, 130752, 115311, 74506, 28030, 42033, 64446, 52003, 38676, 11546, 203, 49040, 109835, 107379, 98115, 141320, 94174, 67970, 65140, 74366, 96340, 77307, 70640, 38992, -5651, 59481, 75764, 29075, 934, -43802, -14976, 49734, 80261, 55642, 62132, 57903, 45158, 52615, 32086, 20571, 89608, 107112, 72602, 75741, 97053, 112533, 72140, 18231, -3860, 5218, 37248, 11558, 71076, 57200, 60698, 53082, 51271, 66350, 41369, 43150, 31824, 13266, 20924, 55414, 142463, 172426, 123067, 92951, 80387, 92142, 73940, 65642, 60331, 67543, 62167, 88985, 91493, 56551, 43601, 44250, 39256, 42304, 39503, 73905, 77384, 78168, 67307, 111027]
16239A11027N0414j0741j4686m0665M6677K9596k9358n7344o6148Q093J1820L6113
16227G4798N055J5263o685m0752K1941M2788k1046M569j8581l9490J3189Q2556
16215A33605J5188l2829m460j2105l052J5345k1389j0476r794j3260M6554M6964
16203A50291k7665J2588k4039m7960l3445m1304L615N269O0243K1695k3164K691
16191E8815N0445O413j9403j9582j0676J1640M0916J9527o4970j6851M2696k2046
16179G6924n0603m9261K2938L7792L5355N0683J6420J9772o227l8783J3699j6917
16167A11792n4058J8105K077K7271M0516L405k6610N631k1827j5669M5235M820
16155A40688m1946q001j9091L8051M1794K5685Q871n3663j3445k8646k6966P61
$$ y = [111027, 161441, 150700, 136014, 95349, 142026, 171622, 142264, 84920, 18772, 26865, 38685, 74798, 79853, 95116, 88431, 47679, 69620, 112408, 91362, 95931, 77350, 37860, 51049, 133605, 148793, 115964, 111504, 99399, 96347, 111692, 90303, 79827, 70033, 56773, 103327, 150291, 122626, 135214, 111175, 63215, 29770, -11534, -7919, -2650, 57593, 79288, 56124, 58815, 109260, 115673, 96270, 76688, 66012, 77652, 118568, 138095, 73125, 56274, 98970, 76924, 26321, -22940, -2, 37790, 73145, 123828, 140248, 160020, 153793, 115010, 128709, 111792, 57734, 75839, 77916, 105187, 145703, 149108, 122498, 128129, 106302, 90633, 135868, 140688, 98742, 90741, 71650, 109701, 151495, 177180, 186051, 132388, 118943, 90297, 63331, 64092]
16143F4092P4491M4373l1603L762n3447j8904J3903k4335J6101R067N404k1617
16131H1287L357K949J2890k4250k4829K8039J3542l5389o999J6124L8682M3451
16119A48854N4819l7572m1018j4527K4821K4553n8271j7866M8750N3033j4046
16108A71530k0334K0207j9065j2889n398k521j7624k047j5676j8502J7210l14
16096I4577o0930p503J6006j6138m978M7834J6853M911l6961k4668O064M6333
16084H1400R6851O0373j4024M85m4278n0878k5029K5099J4099k0268M603k9685
16072I8748J7900k6916Q92K5207M5073m3753n3355K6992k9171O931n284j8158
16060D5106k1839O0065N1147k7930j080L3513l6456j6340j6074J4459P4685j0253
$$ y = [64092, 138583, 182956, 151353, 155115, 101668, 82764, 96667, 72332, 88433, 97500, 102904, 81287, 84644, 87593, 100483, 76233, 51404, 79443, 92985, 57596, 50597, 66721, 105403, 148854, 203673, 166101, 125083, 110556, 135377, 159930, 101659, 83793, 132543, 185576, 171530, 151196, 171403, 152338, 139449, 134051, 131530, 113906, 111859, 96183, 77681, 94891, 94577, 33647, 26144, 42150, 26012, 21034, 68868, 85721, 90632, 53671, 29003, 35067, 81400, 178251, 238624, 224600, 225085, 180807, 129929, 104900, 129999, 144098, 123830, 128433, 98748, 116648, 89732, 90624, 115831, 160904, 117151, 63796, 90788, 61617, 68548, 63264, 45106, 23267, 83332, 134479, 106549, 105469, 138982, 102526, 86186, 70112, 84571, 159256, 149003]
16048A49003r664l9238K922M207L4221K9983k2025j3500n706J5421J7240k2822
16036A40042k3809l0897k1677j7237M1277l981j9454k4566L5461J1648P897o6508
16024B8196j9111L7479J7550o102q0K4845N978K8159j1393m046J5662k6758L7215
16011A27594K7613M2653o25m7754J1896j5656l0343P436L3834j1908j3829j0857
15999A20054k5417M1113N0900K5961p919k2412m1658m0133l3188N1268L8167Q522
15987A65258P174j7941L002l7299j5396K7821q950L6842O007n2572j7205M4967
15975A41708k559m0129K1927P1331k2154m41l6837l9582o6856P421K3489M0810
15963I8128K0272J2454j482k9831j3745N6631m2225l5250J0489K3667J8823k2061
$$ y = [149003, 139339, 100101, 103023, 107230, 141451, 171434, 149409, 135909, 130203, 145624, 162864, 140042, 116233, 85336, 63659, 46422, 87699, 83718, 64264, 39698, 75159, 86807, 94704, 28196, 9085, 46564, 64114, 58012, 57932, 82777, 88755, 116914, 105521, 101475, 117137, 90379, 127594, 155207, 197860, 197235, 149481, 161377, 145721, 115378, 122814, 156648, 144740, 130911, 120054, 94637, 135750, 186650, 212611, 204692, 182280, 140622, 100489, 67301, 118569, 156736, 165258, 172432, 154491, 157493, 120194, 104798, 132619, 123669, 160511, 166518, 113946, 96741, 141708, 139149, 99020, 120947, 192278, 170124, 169683, 132846, 93264, 26408, 33829, 57318, 98128, 118400, 130854, 129372, 99541, 85796, 142427, 100202, 64952, 75441, 99108, 117931, 95870]
15951I5870J325M1323J3757J3748n2345n250J8434j1264J2175k500J5941l061
15939A38153k0518k2030R238l0233l4024K5092M4687m328L757k5562O385K8844
15927A19461l3750J6938L7857L192l23m8169l8773K655K6547n559J8220N7900
15915A56196R26P790L3686j3067o2189m309K0069J9037N194l022k0520K4229R809
15902A73829m6184Q434j0252n1763m4505j4859n291O721Q6464N8256J7686l6614
15890A41922j9131j8383k1121j3737o926j5421R028N4592k0464j7965J1771M5737
15878A29902q029n3032N3050m132k4735l3689J6311L3752M121l895k7193r467
15866G2964j4825M8521L1073L2539l4581l2936M4883J0195k819J0691o017j6644
$$ y = [95870, 97195, 138518, 152275, 166023, 113678, 108428, 126862, 115598, 127773, 125273, 141214, 138153, 117635, 95605, 104843, 74610, 40586, 65678, 110365, 106037, 109794, 84232, 90617, 119461, 85711, 102649, 140506, 143698, 143375, 95206, 56433, 59088, 85635, 80076, 98296, 156196, 157122, 164912, 198598, 185531, 123342, 119033, 139102, 158139, 163333, 160311, 139791, 164020, 173829, 127645, 136079, 125827, 74064, 29559, 14700, 9409, 16130, 102594, 160850, 178536, 141922, 122791, 104408, 83287, 69550, 62624, 47203, 56231, 110823, 90359, 72394, 84165, 129902, 121873, 68841, 121891, 117759, 93024, 59335, 75646, 109398, 113519, 109624, 82431, 72964, 58139, 106660, 137733, 170272, 135691, 102755, 147638, 157833, 155014, 165705, 159688, 143044]
15854A43044J178k9636L0202K3289l3191J8680L6142m6512M61k4453m2211K9521
15842A06514L6239m198Q833J7673q901o1420k1767l423J2549O1441K4960j4739
15830A53761J8427J6287m8549m8675L9060O2284j4900J868j5743J366j3495Q306
15818A59997O243R680j6008K8525K6025k9640k5297L863L5842m718m7471n1523
15806I5518L2071P2016J0769k7616k1415k05j1k3394J8891P292m1113j1403j1496
15793I9904m2219M2612K6414M2221k2608n2424L0069J9827K8929J5751j0339n8326
15781A19811K4118P1748m2947k6320j8524k3961k2988M17N3761K7884k2440J481
15769A42040l2827O229j0946k3153M1360L8842J1812l2464J2963p1709n1353M5790
$$ y = [143044, 144222, 114586, 144788, 168077, 134886, 153566, 189708, 143196, 143657, 119204, 76993, 106514, 142753, 138555, 147388, 165061, 156160, 94740, 72973, 69550, 82099, 143540, 168500, 153761, 172188, 188475, 139926, 91251, 130311, 192595, 177695, 179563, 163820, 165186, 151691, 159997, 166240, 175920, 159912, 188437, 214462, 184822, 159525, 163388, 199230, 194512, 147041, 95518, 127589, 199605, 210374, 182758, 161343, 161138, 161127, 137733, 156624, 163916, 122803, 111400, 99904, 57685, 100297, 126711, 168932, 146324, 93900, 123969, 143796, 172725, 188476, 178137, 119811, 143929, 215677, 172730, 146410, 127886, 103925, 80937, 81354, 135115, 162999, 140559, 142040, 109213, 115442, 104496, 81343, 122703, 161545, 173357, 140893, 153856, 82147, 30794, 76584]
15757G6584M6507r219m8395k1367r39K0043j3673K9050R308M3328m5167j0281
15745G5779P222L7439K3773m430l6905N5573J6643m333M4291n921m4567j4578
15733A49986K0500j6112L9520R081j1712k2521l5250j7223K5842J8130o6994K4114
15721A17361N1032K3435m404o917K2749l43p2542k559K1144j3314n9446N9589
15709A35785L0726J6051N0741K1873q512o1049J2377K4351m7605k4509o002k6535
15697A17692j0402Q4289K5219m1120r966J0801J564j9177l5983K0038K9501k0856
15685A51600m6322j8175j282L4335K7579O1433r403l8798p192k1020M3027M5194
15673B20976p562q376m1742k2823J1454j2784k978M0366k254K4031L8738n3557
$$ y = [76584, 123091, 113872, 65477, 44110, 43171, 63214, 49541, 78591, 87899, 131227, 86060, 75779, 83001, 120440, 144213, 139783, 102878, 158451, 175094, 170761, 215052, 209131, 164564, 149986, 170486, 154374, 193894, 202975, 191263, 168742, 133492, 116269, 142111, 160241, 93247, 117361, 168393, 191828, 187424, 180507, 203256, 202913, 130371, 127812, 148956, 135642, 76196, 135785, 166511, 182562, 233303, 255176, 246664, 185615, 197992, 222343, 174738, 150229, 144227, 117692, 107290, 191579, 216798, 175678, 165712, 176513, 178077, 158900, 122917, 142955, 172456, 151600, 105278, 87103, 85821, 120156, 147735, 209168, 199765, 160967, 153775, 132755, 175782, 220976, 213414, 205038, 163296, 140473, 151927, 139143, 136165, 176531, 174277, 198308, 237046, 183489]
15661A83489o9356p890K9125J0295q6866R153K7797k7307K7010J7466k5838J2297
15649I9375k6263R96N276J3936M3373L1247P656K1845l6613l5017n3195J4071
15637H6687J6120K8922J1934J1815K157N1062l1714j4797K970j6224l9877J7296
15625A26351J9863k7894K6014n905k0403m9200K116k0809m3701j032M960L1981
15613D2341L3884L601M1549k275L7537M5140l1263l6534M812m505l5132J9825
15601A18980K1662n661P135K7334o9472K6191P5209j0859o7105k484K5343O036
15589A52309K5861K0713l1104p2022m4943L2601M0045J2555M403M7613Q849j0622
15577A86258L8354m813j4111o1542M57J8645p604k457j3882K4349L5461L1199
$$ y = [183489, 114133, 106243, 135368, 145663, 58797, 67950, 95747, 68440, 95450, 112916, 87078, 99375, 73112, 74108, 79384, 93320, 136693, 167940, 175596, 197441, 160828, 125811, 72616, 86687, 102807, 131729, 143663, 155478, 157635, 208697, 176983, 162186, 165156, 148932, 109055, 126351, 146214, 118320, 144334, 138429, 118026, 68826, 70942, 50133, 6432, 5400, 10360, 42341, 76225, 79826, 121375, 119100, 156637, 201777, 170514, 133980, 138792, 134287, 99155, 118980, 140642, 134981, 142116, 169450, 99978, 126169, 201378, 190519, 123414, 120930, 146273, 152309, 178170, 198883, 167779, 95757, 50814, 83415, 123460, 136015, 140418, 188031, 196880, 186258, 224612, 219799, 205688, 144146, 144603, 163248, 155644, 153187, 139305, 163654, 199115, 230314]
15565B30314m507l9157l7578k3637K3656R688K1579J2125K5020L037P533l8616
15553A89457m9285L5888n501j0079P023l1245K1111K1701M2574k9258m240j4927
15541A73219j8373j6139j0764N7316M5906k2503m2640K4901J8156K7881O02r76
15529B36586l985l5354o4701m796J4683L3295Q237m789r439k704J5487L6305J0425
15516B29250J2170n5092n4029M7224J7479L122l581J7978l9608N132J4893N4801
15504B49739k016m6429J0930j4673K44J7610N972k6668l4952K505L4452N6097
15492B52811N2544j2463j8032O08j9109k0072l5158l4892R658K2506M4273J5062
15480B57736o8457l1192m5772K8735P5254M8992l5383k9124j2993N2093N2133
$$ y = [230314, 225807, 186650, 149072, 125435, 149091, 158779, 180358, 192483, 217503, 220540, 228073, 189457, 140172, 176060, 170559, 160480, 167503, 136258, 157369, 179070, 221644, 192386, 188146, 173219, 154846, 138707, 127943, 185259, 231165, 208662, 166022, 190923, 209079, 236960, 237562, 236586, 232601, 197247, 132546, 127750, 142433, 175728, 183965, 179176, 169737, 167033, 182520, 218825, 229250, 241420, 186328, 132299, 179523, 197002, 200124, 196543, 214521, 174913, 180045, 194938, 249739, 247723, 201294, 212224, 197551, 197795, 215405, 221377, 194709, 159757, 162262, 196714, 252811, 305355, 292892, 274860, 275468, 256359, 236287, 201129, 166237, 175895, 198401, 242674, 257736, 189279, 158087, 112315, 141050, 216304, 265296, 229913, 200789, 187796, 239889, 292022]
15469B92022N56n3967n6100l2313J0696N1063k7085k7940M7310M2845j1787n6187
15457A79113q840J5648R384l42Q60j4303J7407P024Q553n531j1228j4710p629
15444A75406j8171M4061l2677j5726K2924l1019j4336J529O3696M2422R595m006
15432B43698l9168n4636J6833O4903K4611P362J2842k8213k0249o2038J1202P583
15420A84730L167l7592q2664l949K5712j77M8531N5649K6153J0982m2986K5042
15408B12598J6028L5332p2829j8818j2085o345M700n259j5558N4877K8026k34
15396B20433K1064n636j7130m2529m2536l0529L6262K2052k2456m3089q573O4671
15384A52004Q281n7920m0642L1224Q628J8311q16J1098N8977P1276n1529n0181
$$ y = [292022, 292578, 238611, 182511, 150198, 160894, 211957, 184872, 156932, 204242, 247087, 235300, 179113, 170273, 185921, 195305, 194963, 195823, 181520, 198927, 205951, 214504, 208973, 197745, 183035, 175406, 157235, 201296, 168619, 152893, 175817, 144798, 130462, 131991, 195687, 238109, 247704, 243698, 204530, 149894, 166727, 231630, 256241, 263603, 276445, 248232, 227983, 165945, 177147, 184730, 187897, 150305, 67641, 63692, 89404, 89227, 137758, 193407, 219560, 230542, 187556, 212598, 228626, 263958, 191129, 172311, 160226, 153881, 158581, 153322, 137764, 192641, 220667, 220433, 241497, 235861, 218731, 176202, 133666, 103137, 139399, 161451, 138995, 95906, 87333, 152004, 160285, 102365, 61723, 92947, 101575, 119886, 119070, 130168, 189145, 260421, 208892, 158711]
15372A58711k311L560R948L9699k1701J762k5772J0218M3173J0960m5824P846
15360A90269l2577l5298k5543M1336L3198k893j493k6632o686j7566L0667N2034
15348A98816m1305j6722l2378j5750R4020R900j7158K6178N0869J8771l2960k3636
15336B18645l439L20K3110N533j8119K046J5337k6499j7121J2051J4593l0414
15324A96043j5728K1284r322n038L7588J9464O2732L0975m4666N566n727j9119
15312B74052l2826J0578j4824k5614K6837M1372l8339j6525J224k6847k6142L3237
15300B06183J3222l8582K4093J7450j3843k5736n0523L073l498J2049J6123P077
15288A67088R554L0486l9097j6768R617K8751L805p620M515k2313l1015P281O6439
$$ y = [158711, 156400, 159960, 169908, 209607, 187906, 189668, 163896, 174114, 217287, 228247, 182423, 190269, 157692, 122394, 96851, 138187, 171385, 168492, 166999, 140367, 133681, 116115, 146782, 198816, 157511, 140789, 108411, 92661, 186681, 196581, 179423, 205601, 256470, 275241, 242281, 218645, 215206, 215526, 238636, 244169, 226050, 228096, 243433, 216934, 199813, 211864, 226457, 196043, 180315, 201599, 192277, 187239, 224827, 244291, 307023, 337998, 293332, 298898, 293171, 274052, 241226, 251804, 236980, 211366, 238203, 279575, 241236, 224711, 225935, 199088, 172946, 206183, 219405, 180823, 204916, 222366, 208523, 182787, 132264, 135337, 131839, 143888, 160011, 167088, 176642, 207128, 168031, 151263, 160880, 189631, 193436, 185816, 190331, 168018, 137003, 144284, 210723]
15275B10723k9887k946K831J7562L2100M3440n5887j2653L3352n758k923l2953
15263A97001j0983k2245O938j6115O2026K8206K4881k2284K0584J1437j3726o497
15251B59223l767J0173j2253j1602j1168K1848j6620J3274M0363k0209j2670K4488
15239B81080j0558m8518q3453R16R4465L8781p619r7688k6576L0733K2141p611
15227A86093r119N0489k2226J1136J4172M809l2868n2264r227R647L1719O4245
15215B46606K2888Q336k4542j8111o891m1855P530N7177j5354r485k6968m738
15203A94593k5582K6206M9875n45k7880k5128K5344j2803j1475K1121j2374k569
15191A98783j2731P869J8589j2082k0471M949L1369n946n4515K508M4548K9654
$$ y = [210723, 180836, 177890, 180721, 198283, 230383, 273823, 217936, 205283, 238635, 232877, 229954, 197001, 186018, 163773, 170711, 154596, 216622, 244828, 269709, 247425, 268009, 279446, 265720, 259223, 255456, 265629, 253376, 241774, 230606, 252454, 235834, 249108, 289471, 269262, 256592, 281080, 270522, 222004, 138551, 139467, 233932, 272713, 265094, 167406, 140830, 171563, 193704, 186093, 176974, 227463, 205237, 216373, 230545, 235354, 202486, 150222, 140995, 150642, 182361, 246606, 269494, 277830, 253288, 235177, 228286, 186431, 193961, 251138, 235784, 226299, 199331, 194593, 169011, 195217, 245092, 244547, 216667, 191539, 216883, 204080, 192605, 213726, 201352, 198783, 186052, 193921, 212510, 200428, 179957, 184906, 216275, 210329, 155814, 158322, 202870, 232524]
15179B32524j8539o8M7321m4901l2565M8733o39r972M0770Q610l0893J3358k3908
15166B29831K1601l2896j297k6567J9563K7375K7526j7987m1371O087K3045O2674
15154B97584k0401l1324k0981n7480l120K8604M3523N5018m0367m6870k4442K8167
15142B07911k9525N9237l9677n4561J0486P3367O6202l4185j1063N2344l3149
15131B67387M0414o5921q2062k709L8755M8854N524k7198M970J7530j327k2253
15119B21964l2911l0215J5610j6805j252J8519L3865K2931k5134k287L3220l619
15107B33886J2147J6014o218l0390j5307j5359k2711K0059K8345J4780l2265m1784
15095A61197O6610K1468J7205j1980N2023j0396J0365l4405k7775J1625k9697
$$ y = [232524, 213985, 213917, 261238, 216337, 183772, 232505, 231866, 221894, 262664, 271274, 240381, 253739, 229831, 251432, 218536, 217239, 190672, 210235, 237610, 265136, 247149, 205778, 211865, 234910, 297584, 277183, 245859, 224878, 167398, 164278, 192882, 236405, 291423, 251056, 204186, 179744, 207911, 178386, 237623, 197946, 143385, 153871, 227238, 293440, 259255, 248192, 300536, 267387, 307801, 241880, 159818, 157109, 195864, 244718, 250242, 223044, 228014, 245544, 244217, 221964, 189053, 158838, 174448, 157643, 156391, 174910, 208775, 231706, 206572, 204285, 237505, 233886, 246033, 262047, 255829, 225439, 210132, 194773, 172062, 192121, 220466, 235246, 202981, 161197, 227807, 249275, 266480, 254500, 306523, 296127, 306492, 272087, 244312, 255937, 226240]
15084B26240k599n571k0566K5318o440L154L913n4105K1141O9852l0828j8215
15072B11294K3738k1927K0898J5689j43m9757l7015L2256K5929j0991M921N282
15060B20174l8447j35L5899L9707j8585J4794K2647K4197o080m0725k3919k9787
15048A99740K2117L2561l6652l156L4447l720M1775L0066p6819j0308K0960J2569
15036B63580J3634k3521M386J4123p594j9370j8035j029K5875K9029k5478m9541
15024B06059m3107J8255L2091M365j1120k1697j6782k2000K3341K2669L7066K4961
15012B54101o580q908J36J5742K1910k5787n6576j8629N9450R110J978m2573r4201
14999A09173l7897K6789M0823M3233j1929k0657N8934J9724j2792J1395J4608
$$ y = [226240, 223641, 218070, 197504, 222822, 216382, 219536, 223449, 169344, 190485, 260337, 229509, 211294, 235032, 213105, 234003, 249692, 249549, 199792, 162777, 195033, 220962, 209971, 214892, 220174, 181727, 181592, 217491, 257198, 238613, 253407, 276054, 300251, 294171, 253446, 229527, 199740, 221857, 254418, 217766, 214610, 249057, 245337, 287112, 317178, 240359, 230051, 251011, 263580, 277214, 253693, 258079, 272202, 264608, 245238, 227203, 226174, 252049, 281078, 255600, 206059, 162952, 181207, 213298, 217663, 206543, 184846, 168064, 146064, 169405, 192074, 229140, 254101, 247521, 238613, 238749, 254491, 276401, 250614, 194038, 175409, 234859, 243969, 245947, 203374, 109173, 71276, 98065, 138888, 182121, 170192, 149535, 208469, 228193, 215401, 226796, 241404]
14988B41404L2190m4137l3777K9118l3677N4437P658R1R4110M456n1945l9649
14976B60279j5083j5777l1093l7057M0466P7493j3101l6157k8122L8570R778L2222
14964B82418L827n4805Q050j8327L2816J8020n3243j441n575L3510L5570L7816
14952C18636j8831l8786K8511k2425j6129j2380M1942J744J3262l9701k9543K9889
14940B56189O263M658L8568o995m0766m4953N934N0244N0261l1428o7528k3513
14928A96934J044Q7521J0139m5405r2973M3615J7294j4788l1448m3567J0477M0938
14916A79781O9117Q659m7738q710O55L84J3373J8324M740m795j5669R036j6154
14903B11003J5275m6196l7772P799M7363N2533J6144L530l3812k7942r433L360
$$ y = [241404, 273594, 229457, 195680, 224798, 191121, 245558, 253216, 253307, 347417, 351873, 299928, 260279, 245196, 229419, 198326, 161269, 201735, 279228, 266127, 229970, 201848, 240418, 250196, 282418, 286245, 231440, 239490, 221163, 253979, 271999, 218756, 217315, 211740, 245250, 280820, 318636, 299805, 261019, 289530, 267105, 250976, 238596, 280538, 282282, 295544, 255843, 226300, 256189, 262452, 267110, 305678, 298683, 257917, 212964, 218898, 269142, 319403, 287975, 220447, 196934, 197978, 285499, 295638, 250233, 157260, 200875, 218169, 203381, 171933, 128366, 138843, 179781, 248898, 257557, 209819, 201109, 201764, 202148, 215521, 233845, 238585, 233790, 218121, 227157, 211003, 226278, 180082, 142310, 150109, 197472, 250005, 266149, 269679, 235867, 207925, 198492, 201852]
14891B01852Q283R507n831j4644j0640R873k954M4995Q538l8615n5233L4510N1136
14878B40777N8124M996N143n0156n9738j4673m831J2816l3097K0724M1752J5566
14866B37403K6369K7214k3705j07386k9255Q450N6045K8245J1059J9722L1194
14855B85355j5152m5631l8755O2536k2664m0153k8829L1824P2205K8663k2382
14844B67017n0705m605p200K3527k7162J1186j275K3737K99n9088P369L4713j850
14831B15963n271p199m065J0971J8922k6114R451Q54M1057l0589k1742L8537K2410
14818B63185m1166l586Q3314j2233j1253O847J3036k4490K5893j2211l6010K0464
14806B71790J9531K5372k6787j9692j12M0981L6246o938o296j8439k5569l9353
$$ y = [201852, 210135, 219642, 213811, 199167, 188527, 198400, 195446, 240441, 248979, 210364, 155131, 189641, 240777, 298901, 303897, 309040, 258884, 199146, 184473, 179642, 192458, 159361, 180085, 221837, 237403, 263772, 290986, 267281, 159895, 130640, 139090, 195135, 223380, 234439, 254161, 285355, 270203, 224572, 185817, 248353, 225689, 185536, 156707, 188531, 260736, 289399, 267017, 216312, 211707, 204507, 228034, 200872, 212058, 210783, 234520, 234819, 175731, 183100, 217813, 215963, 210692, 203493, 199428, 210399, 229321, 203207, 212658, 213512, 254569, 223980, 202238, 240775, 263185, 222019, 218433, 301747, 289514, 278261, 285108, 298144, 273654, 299547, 287336, 251326, 271790, 291321, 316693, 289906, 270214, 270102, 311083, 347329, 340391, 334095, 315656, 290087, 250734]
14794B50734m3491Q952O9430J0774o0945L6588J9769K347n0120o0903L6431R966
14782B29532r049n0186K4491j8104J8488P759O7870N2377K321L069j7548n944
14770C05076l3797l4026K1973J4758M3336m0251J4948L4113l9616k2199k307K3388
14758B85396K5444k164k7218L376m4625k3709m747M4238J1164j5253O3865O440
14746C22207m0887j8201K05k5032P33j3467j8069L0305N814L5383K2678k3195
14734B78474k1756l5717L5916O5160n242m8423m2220p3369m0538M5284N4493N0738
14722B62800L128m505N51J0623R425k2088k4945j5209j4341K7912j3605R184m869
14709B24061k9502o061J7168J4673J076L3242J8553o12k1884m2991L7691N6129
$$ y = [250734, 207243, 216195, 285625, 296399, 235454, 272042, 291811, 294158, 244038, 183135, 219566, 229532, 220483, 170297, 194788, 176684, 195172, 202931, 270801, 323178, 325499, 328568, 311020, 305076, 271279, 237253, 259226, 273984, 317320, 277069, 292017, 326130, 286514, 264315, 262008, 285396, 310840, 308676, 281458, 284834, 240209, 216500, 211753, 255991, 267155, 251902, 315767, 322207, 281320, 263119, 263324, 238292, 239025, 225558, 207489, 237794, 243608, 278991, 301669, 278474, 256718, 221001, 256917, 322077, 316835, 268412, 226192, 152823, 112285, 157569, 212062, 262800, 265928, 261423, 261974, 272597, 282022, 259934, 234989, 219780, 205439, 233351, 219746, 228930, 224061, 194559, 188498, 205666, 220339, 221415, 254657, 273210, 272598, 250714, 207723, 245414, 301543]
14697C01543k6307L672Q716o734N758N8544K6359j7854l9508k1584m8713N803
14685B49695K1349m6438M1205Q51K1060P2374L5426O858K1095J9718m8580p7522
14673C17091K738K6602l9274m0370K6867o4645j26J8250K2372J6878J8274K7485
14661C32142l4014k9080L8901k5708n5489M5071n71M89k1090L8137p200j2998
14649B68590M6098K4099j269M0835K638n8210j1006L8028j3697l7180R543K2558
14637C31027K5076l5359l2185j8094L3042j3185k1007O402l59K0369k7098j082
14625B67547P236K0710O202K4712l3814k2011J0006j1508J6810J3521j6949M4255
14613C26717M5662K1696J613p6451k3762M841L4277P360k7204j6937R644p85m2128
$$ y = [301543, 275236, 278908, 287624, 280890, 286648, 345192, 371551, 353697, 314189, 292605, 243892, 249695, 271044, 224606, 265811, 266662, 287722, 360096, 395522, 402380, 423475, 443193, 394613, 317091, 319829, 346431, 307157, 266787, 293654, 229009, 228883, 247133, 269505, 286383, 304657, 332142, 298128, 269048, 307949, 282241, 226752, 271823, 271252, 271741, 250651, 288788, 281588, 268590, 314688, 338787, 337518, 378353, 380991, 322781, 311775, 349803, 336106, 298926, 308469, 331027, 356103, 320744, 288559, 270465, 303507, 290322, 269315, 275717, 275358, 295727, 268629, 267547, 274783, 295493, 301695, 326407, 292593, 270582, 280588, 269080, 285890, 299411, 282462, 326717, 372379, 394075, 395688, 319237, 295475, 300316, 334593, 341953, 314749, 297812, 307456, 306671, 264543]
14600B64543P599P3126l5306n5432K646j2128l9485N3771K5216p761j6248m727
14588B55814K3930J0330M3348j2011n8136j1270O766j4040J2116l1257j1337k7113
14576A87140j7336R363K0345j3524J9711m470P5261O8288K4035l1458j1306K903
14564C28952k0424K1130m452m8612J5844Q171j1039p285l8500K107m6098J0916
14552B10710O8559K3230L3183K4291j7590m7902P742M6893j234k6473q636N9301
14540C72074L5494k6670n2633L365o277K19k1069k579m8099o091k273J7857R867
14527B73185n0727K6416K8530J494J368k611N2753J5515k907n2819l3385j6276
14515B40536k3070Q4770J9996O6295M6851J9565p5941n1574K657r096o773m1593
$$ y = [264543, 272142, 345268, 309962, 254530, 257176, 245048, 205563, 259334, 284550, 276789, 260541, 255814, 279744, 290074, 333422, 321411, 263275, 252005, 258771, 244731, 256847, 225590, 214253, 187140, 169804, 179167, 199512, 185988, 205699, 201229, 276490, 344778, 368813, 337355, 326049, 328952, 308528, 329658, 325206, 276594, 292438, 300609, 289570, 282285, 243785, 245892, 199794, 210710, 279269, 302499, 335682, 359973, 342383, 294481, 302223, 349116, 347882, 321409, 312773, 372074, 407568, 380898, 328265, 331630, 325353, 325572, 304503, 301924, 253825, 247734, 245461, 263318, 273185, 222458, 248874, 277404, 278898, 280266, 277655, 330408, 345923, 343016, 290197, 256812, 240536, 217466, 302236, 322232, 388527, 435378, 454943, 379002, 327428, 330085, 320989, 314216, 272623]
14503B72623J0991L4636K0943L6757L4388k1235p0339n669L1874l4501m9463j2514
14491B48491M8252P513L3376m8958k2741j5721K9545J8801q372j5650O331K7925
14479C08792j9211j5453M7532p082q347k5245k0883J0406j6763P288L0184K8113
14467C19331M5154j0353l3882j0506K5176K293J9459J7794m9799o122o478J8061
14455C30128J9544M4092L7626j3500k6052l6668m7741J8421J4840P138j1467L2913
14443C69274j1240l1126J6123P686k5625k4950M4321O98q7475l1796N1972M2296
14431C20158K8173J8820l5378M364J9031k4181m7261M2142O5648j081l8248p2041
14419B80146J4516J0430q085Q0186L0520j5892k4354q957J570J8269L0139n0335
$$ y = [272623, 283614, 318250, 339193, 375950, 410338, 389103, 318764, 313095, 344969, 310468, 261005, 248491, 296743, 304256, 337632, 288674, 265933, 250212, 279757, 298558, 290186, 274536, 280867, 308792, 289581, 274128, 321660, 314578, 306231, 280986, 260103, 270509, 253746, 261034, 291218, 319331, 364485, 354132, 320250, 309744, 334920, 337213, 356672, 374466, 324667, 318545, 312067, 330128, 349672, 393764, 431390, 417890, 391838, 355170, 307429, 325850, 340690, 347828, 336361, 369274, 358034, 326908, 343031, 350717, 325092, 300142, 344463, 345161, 257686, 225890, 277862, 320158, 348331, 367151, 331773, 336137, 355168, 330987, 283726, 325868, 391516, 390435, 352187, 280146, 294662, 305092, 297007, 377193, 407713, 391821, 367467, 358510, 360080, 378349, 408488, 358153]
14407C58153p8511j2131P480M490J4638M0933J574J4051J5072J7843M1532o4348
14395C60776m0729j1153J9803K2433M5564N16j7862m5058K4531j5583j1313K8417
14383C60342j5723m718j7635J8460l4276j4356J2220Q528j2720K4763k8444K7287
14371C23728K2296l5757j7878j0597l7226m4424L9731M640P3100L3063L7226k175
14359C85727m6993m6543l6976q247K519K6879J5583L3788R299k8656J4392L1627
14347C52399K1467K8105l1306k1028r42j1821l2627o7802m1699M1220L8313M5935
14335C20214L945K0985m1656m0631L3952Q151o5495j3986K9320M3841M2286j755
14323C39171n535n7956q88R333L2626J8615n3760j3785R89N6656N3998L4876J6810
$$ y = [358153, 279642, 267511, 274991, 279481, 294119, 335052, 336626, 350677, 365749, 383592, 425124, 360776, 320047, 308894, 328697, 351130, 396694, 397210, 379348, 334290, 358821, 343238, 331925, 360342, 344619, 339901, 322266, 340726, 306450, 292094, 304314, 312842, 300122, 324885, 296441, 323728, 346024, 310267, 292389, 281792, 244566, 200142, 239873, 244513, 317613, 350676, 387902, 385727, 338734, 292191, 255215, 246968, 249487, 276366, 291949, 325737, 335036, 306380, 320772, 352399, 373866, 401971, 370665, 349637, 348695, 336874, 304247, 236445, 194746, 235966, 274279, 320214, 324159, 345144, 303488, 262857, 296809, 304960, 239465, 225479, 254799, 298640, 340926, 339171, 333636, 275680, 274792, 284125, 316751, 335366, 281606, 267821, 268810, 325466, 379464, 414340, 431150]
14310D31150j2975l5384R619r334J7153J6156k6889l4425l3519J3116M3699l0034
14298C48333K2096M3550j5269l7380J9400M7781m2748K3053K8939L0408l3679
14287D34484n1752l4537J1152k2011j9873k1638m173M4907P9199j7243k5755K7059
14275C99819j0760l9520j6395M5478P4769k315q1124j7678K591M867M068Q675
14263C72475J6719k4368j8795J0494M527l1097l61J0549l224k9813m3734J7064
14251B80436K5113O3136L5573m8960l3478K4315M0281k4037k2584l148K806q527
14239C30926O126J2042J5678j7397Q307n068J0445k0381k9139P609N5100O0832
14227D35080R101k5296l1011L6545q621o5196n8186l577K1387k7352K3548l080
$$ y = [431150, 418175, 382791, 392410, 383076, 400229, 416385, 389496, 355071, 321552, 334668, 378367, 348333, 370429, 413979, 398710, 361330, 380730, 428511, 385763, 408816, 437755, 468163, 434484, 382732, 348195, 359347, 337336, 317463, 295825, 291652, 336559, 415758, 398515, 372760, 399819, 389059, 349539, 333144, 378622, 453391, 451076, 369952, 352274, 354865, 359732, 363800, 372475, 389194, 364826, 346031, 356525, 361052, 329955, 329594, 340143, 336919, 307106, 263372, 280436, 305549, 368685, 404258, 355298, 321820, 346135, 386416, 362379, 339795, 336647, 339453, 330926, 337052, 349094, 364772, 347375, 355682, 350614, 361059, 340678, 311539, 319148, 374248, 435080, 444181, 418885, 387874, 424419, 415798, 350602, 292416, 288839, 310226, 282874, 306422, 303342]
14215C03342N589R486K6043J2564j4627j6147l7278k8245J9867L8101j8008o860
$$ y = [303342, 308931, 318417, 344460, 357024, 342397, 326250, 288972, 260727, 280594, 318695, 300687, 293827]
$$ [...]
##END NTUPLES=NMR SPECTRUM
##END=
