##TITLE=Analysis number 318079
Compound Code cc 48414
Book Reference 454/124
Project Code adrs
Chemist Name stevep
##JCAMPDX= 6.0         $$ Bruker NMR JCAMP-DX V2.0
##DATA TYPE= NMR SPECTRUM
##DATA CLASS= NTUPLES
##ORIGIN= Bruker BioSpin GmbH
##OWNER= nmr
$$ XWIN-NMR		Version 3.5
$$ Wed Mar 15 09:30:24 2006 GMT Standard Time (UT+0h)  MAYBRIDGE\nmr@NMR_250MHZ
##.OBSERVE FREQUENCY= 250.131544655141
##.OBSERVE NUCLEUS= ^1H
##.ACQUISITION MODE= SIMULTANEOUS (DQD)
##.ACQUISITION SCHEME= undefined
##.AVERAGES= 16
##.DIGITISER RES= 18
##SPECTROMETER/DATA SYSTEM= dpx250
##.PULSE SEQUENCE= zg30
##.SOLVENT NAME= CDCl3
##.SHIFT REFERENCE= (INTERNAL, CDCl3, 0, 16.522)
##AUDIT TRAIL= $$ (NUMBER, WHEN, WHO, WHERE, WHAT)
$$ ##TITLE= Audit trail, XWIN-NMR		Version 3.5
$$ ##JCAMPDX= 5.01
$$ ##ORIGIN= Bruker BioSpin GmbH
$$ ##OWNER= nmr
$$ C:\u/data/dgb/nmr/ADRS/670/pdata/1/auditp.txt
$$ ##AUDIT TRAIL=  $$ (NUMBER, WHEN, WHO, WHERE, WHAT)
(   1,<2006-03-15 09:29:53.05 +000>,<MAYBRIDGE\nmr>,<NMR_250MHZ>,
      <created by zg, POWCHK disabled, PULCHK disabled
       configuration hash MD5:
       84 BC 41 DB A1 6E 1D 46 DA 25 12 A5 C1 ED C5 3A
       data hash MD5: 64K
       81 5F 18 F5 D8 6C 98 55 39 62 C7 25 9C 3F 5B E9>)
(   2,<2006-03-15 09:30:06.34 +000>,<MAYBRIDGE\nmr>,<NMR_250MHZ>,
      <Start of raw data processing
       ef LB = 0.3 FT_mod = 6 PKNL = 1 SI = 32K 
       data hash MD5: 32K
       C6 94 AB B6 6C 54 B6 ED 34 56 64 12 83 C6 DB 3F>)
(   3,<2006-03-15 09:30:08.05 +000>,<MAYBRIDGE\nmr>,<NMR_250MHZ>,
      <apk 
       data hash MD5: 32K
       74 6A 71 F4 EA 7D 50 75 0C DD 5E 60 D5 AF 2E A2>)
(   4,<2006-03-15 09:30:09.06 +000>,<MAYBRIDGE\nmr>,<NMR_250MHZ>,
      <abs ABSG = 5 
       data hash MD5: 32K
       FA B3 61 2B CC A8 57 61 5F 18 8C ED 60 16 99 D0>)
$$ ##END=
$$ 
$$ hash MD5
$$ 32 36 D8 D6 9A 3E 86 29 FC 3B FE 35 42 3D 8D 3A
##$RELAX= 
##$RELAX= 
##$RELAX= 
##$RELAX= 
##$RELAX= 
##$RELAX= 
##$RELAX= 
$$ Bruker specific parameters
$$ --------------------------
##$DU= <C:\u>
##$EXPNO= 670
##$NAME= <ADRS>
##$PROCNO= 1
##$TYPE= <nmr>
##$USER= <dgb>
##$AMP= (0..31)
100 100 100 100 100 100 100 100 100 100 100 100 100 100 100 100 100 100 
100 100 100 100 100 100 100 100 100 100 100 100 100 100 
##$AQSEQ= 0
##$AQ_mod= 3
##$AUNM= <au_zg>
##$AUTOPOS= <3 >
##$BF1= 250.13
##$BF2= 250.13
##$BF3= 250.13
##$BF4= 250.13
##$BF5= 500.13
##$BF6= 500.13
##$BF7= 500.13
##$BF8= 500.13
##$BYTORDA= 1
##$CFDGTYP= 0
##$CFRGTYP= 5
##$CHEMSTR= <none>
##$CNST= (0..31)
1 1 145 1 1 1 1 1 1 1 1 1 1 1 1 1 1 1 1 1 1 1 1 1 1 1 1 1 1 1 1 1 
##$CPDPRG= <>
##$CPDPRG1= <>
##$CPDPRG2= <>
##$CPDPRG3= <>
##$CPDPRG4= <mlev>
##$CPDPRG5= <mlev>
##$CPDPRG6= <mlev>
##$CPDPRG7= <mlev>
##$CPDPRG8= <mlev>
##$CPDPRGB= <>
##$CPDPRGT= <>
##$D= (0..31)
0 1 0 0 0 0 0 0 0 0.06 0 0 0 0 0 0 0.0002 0 0 0 0 0 0 0 0 0 0 0 0 0 0 
0 
##$DATE= 1142414991
##$DBL= (0..7)
120 120 120 120 120 120 120 120 
##$DBP= (0..7)
150 150 150 150 150 150 150 150 
##$DBP07= 0
##$DBPNAM0= <>
##$DBPNAM1= <>
$$ [...]
##$SUBNAM7= <"">
##$SUBNAM8= <"">
##$SUBNAM9= <"">
##$SW= 20.6930455092707
##$SWIBOX= (0..15)
0 0 3 0 0 0 0 0 0 0 0 0 0 0 0 0 
##$SW_h= 5175.983436853
##$TD= 65536
##$TD0= 1
##$TE= 293.16
##$TE2= 300
##$TE3= 300
##$TEG= 300
##$TL= (0..7)
0 120 120 120 120 120 120 120 
##$TP= (0..7)
150 150 150 150 150 150 150 150 
##$TP07= 0
##$TPNAME0= <>
##$TPNAME1= <>
##$TPNAME2= <>
##$TPNAME3= <>
##$TPNAME4= <>
##$TPNAME5= <>
##$TPNAME6= <>
##$TPNAME7= <>
##$TPOAL= (0..7)
0.5 0.5 0.5 0.5 0.5 0.5 0.5 0.5 
##$TPOFFS= (0..7)
0 0 0 0 0 0 0 0 
##$TUNHIN= 0
##$TUNHOUT= 0
##$TUNXOUT= 0
##$USERA1= <user>
##$USERA2= <user>
##$USERA3= <user>
##$USERA4= <user>
##$USERA5= <user>
##$V9= 5
##$VALIST= <valist>
##$VCLIST= <CCCCCCCCCCCCCCC>
##$VD= 0
##$VDLIST= <DDDDDDDDDDDDDDD>
##$VPLIST= <PPPPPPPPPPPPPPP>
##$VTLIST= <TTTTTTTTTTTTTTT>
##$WBST= 1024
##$WBSW= 4
##$XGAIN= (0..3)
0 0 0 0 
##$XL= 0
##$YL= 0
##$YMAX_a= 183584
##$YMIN_a= -283687
##$ZGOPTNS= <>
##$ZL1= 120
##$ZL2= 120
##$ZL3= 120
##$ZL4= 120
##$ABSF1= 16.522
##$ABSF2= -4.171173
##$ABSG= 5
##$ABSL= 3
##$ALPHA= 0
##$AQORDER= 0
##$ASSFAC= 0
##$ASSFACI= 0
##$ASSFACX= 0
##$ASSWID= 0
##$AUNMP= <proc_1d>
##$AZFE= 0.1
##$AZFW= 0.1
##$BCFW= 0
##$BC_mod= 0
##$BYTORDP= 0
##$COROFFS= 0
##$CY= 12.5
##$DATMOD= 1
##$DC= 0
##$DFILT= <>
##$DTYPP= 0
##$F1P= 14.0000005364418
##$F2P= -0.99999901652339
##$FCOR= 0.5
##$FTSIZE= 32768
##$FT_mod= 6
##$GAMMA= 0
##$GB= 0
##$INTBC= 1
##$INTSCL= 1
##$ISEN= 128
##$LB= 0.3
##$LEV0= 0
##$LPBIN= 0
##$MAXI= 10000
##$MC2= 0
##$MEAN= 0
##$ME_mod= 0
##$MI= 0
##$NCOEF= 0
##$NC_proc= -5
##$NLEV= 6
##$NOISF1= 0
##$NOISF2= 0
##$NSP= 0
##$NTH_PI= 0
##$NZP= 0
##$OFFSET= 16.522
##$PC= 1
##$PHC0= 173.937
##$PHC1= 13.93509
##$PH_mod= 1
##$PKNL= yes
##$PPARMOD= 0
##$PSCAL= 4
##$PSIGN= 0
##$REVERSE= no
##$SF= 250.13
##$SI= 32768
##$SIGF1= 0
##$SIGF2= 0
##$SINO= 400
##$SIOLD= 32768
##$SREGLST= <1H.CDCl3>
##$SSB= 0
##$STSI= 32768
##$STSR= 0
##$SW_p= 5175.98343685301
##$SYMM= 0
##$S_DEV= 0
##$TDeff= 65536
##$TDoff= 0
##$TI= <Analysis number 999999
Compound Code 99
Book Reference 9
Project Code 9>
##$TILT= no
##$TM1= 0
##$TM2= 0
##$TOPLEV= 0
##$USERP1= <user>
##$USERP2= <user>
##$USERP3= <user>
##$USERP4= <user>
##$USERP5= <user>
##$WDW= 1
##$XDIM= 32768
##$YMAX_p= 475901206
##$YMIN_p= -1164038
$$ End of Bruker specific parameters
$$ ---------------------------------
##NTUPLES= NMR SPECTRUM
##VAR_NAME=  FREQUENCY,     SPECTRUM/REAL,   SPECTRUM/IMAG
##SYMBOL=    X,             R,               I
##VAR_TYPE=  INDEPENDENT,   DEPENDENT,       DEPENDENT
##VAR_FORM=  AFFN,          ASDF,            ASDF
##VAR_DIM=   32768,         32768,           32768
##UNITS=     HZ,            ARBITRARY UNITS, ARBITRARY UNITS
##FACTOR=    0.157963299565203, 1,           1
##FIRST=     4132.6476996994, 0,             0
##LAST=      -1043.33573715361, 0,           0
##MIN=       -1043.33573715361, -1164038,    0
##MAX=       4132.6476996994, 475901206,     0
$$ Real data points
##PAGE= N=1
##DATA TABLE= (X++(R..R)), XYDATA
$$ [...]
23292b02581J23814q79p0234K74045J18800k92858j8727J5381N0026k2421j74473
$$ -202581 -78767 -79646 -149880 124165 242965 -49893 -68620 -53239 -3213 -25634 -200107
23281b00107J11014p7203k67282Q8407J40702L21710K89870l2392k55729k44582
$$ -200107 -89093 -166296 -433578 -345171 -204469 117241 407111 374719 118990 -125592
23271a25592J28935p9670N2634l2832j81405J51675J95921K69349J1295k18664
$$ -125592 3343 -76327 -23693 -56525 -237930 -86255 109666 379015 390310 171646
23261A71646k16335j33745K76481P4600K1222K69021J83137m4078r0650l20202
$$ 171646 -44689 -178434 98047 172647 193869 462890 646027 601949 511299 191097
23251A91097j0315J33893M7718j04451l03327k04332K9345j9648J49623k29128
$$ 191097 180782 314675 362393 257942 -45385 -249717 -220372 -240020 -90397 -319525
23241c19525l42600J9153J97306M4651J50648L8681j35386J75558L3611J9593
$$ -319525 -662125 -642972 -445666 -401015 -250367 -211686 -347072 -171514 -137903 -118310
23231a18310n383o3840N3740j88511j58431J33993J00729K56499K96699j38874
$$ -118310 -123693 -187533 -133793 -322304 -480735 -346742 -246013 10486 307185 168311
23221A68311j55867j02611k95432j94203L05350j13174J50138J0768J3169j14123
$$ 168311 12444 -90167 -385599 -579802 -274452 -387626 -237488 -226720 -213551 -327674
23211c27674R163N9021K7528r3547p4945J69735M77386K531k15099k29529J2857
$$ -327674 -318511 -259490 -231962 -325509 -400454 -230719 246667 249198 34099 -195430 -182573
23200a82573K16888N263j98937k05501m380R2633J29735j1868J15623r0544l96758
$$ -182573 34315 39578 -159359 -364860 -369240 -276607 -146872 -158740 -43117 -133661 -530419
23189e30419o3539L48460Q0760J54285j25543J39759o4646j16081K01820J3470
$$ -530419 -593958 -245498 -164738 -10453 -135996 3763 -60883 -176964 24856 38326
23179C8326j39237p6280Q2896J12170J29344Q108k59073k70613j3450j89625k0753
$$ 38326 -100911 -177191 -94295 17875 147219 155327 -103746 -374359 -387809 -577434 -598187
23168e98187K62591K99110Q6536M2645l67561j96381n7694r2357K90519J0267
$$ -598187 -335596 -36486 50050 92695 -274866 -471247 -528941 -621298 -330779 -320512
23158c20512M0472M1826K62965K33514j34808j60033Q0895J46129P7780m2343
$$ -320512 -280040 -238214 24751 258265 123457 -36576 44319 190448 268228 225885
23148B25885L0119K68217l5168l17469k76806j05772R6247J20349J0684m3581
$$ 225885 256004 524221 489053 171584 -105222 -210994 -114747 5602 16286 -27295
23138b7295J96672J4032l16291j20220l4971J02005O3787P5246J23840J47512
$$ -27295 169377 183409 -132882 -253102 -288073 -186068 -122281 -47035 76805 224317
23128B24317n9507p4074j03364j90904r9280j28670R2706J65453J57045K09859
$$ 224317 164810 90736 -12628 -203532 -302812 -431482 -338776 -173323 -16278 193581
23118A93581j80240j35825M2486L89691r9792J09887j17666j66938J46201J899
$$ 193581 13341 -122484 -79998 309693 209901 319788 202122 35184 181385 183284
23108A83284M2342J16441N2960j70342M7937K17909Q8977j94196m12788l65864
$$ 183284 225626 342067 395027 224685 272622 490531 579508 385312 -27476 -393340
23098c93340R1602J47473N1819O0962R4238j83706L0267J542L44225r2603l48127
$$ -393340 -301738 -154265 -102446 -41484 52754 -130952 -100685 -99143 245082 152479 -195648
23087a95648n3336J37559j22960j88865l1243K2255K30279q182j08733j58615
$$ -195648 -248984 -111425 -234385 -423250 -454493 -432238 -201959 -210141 -318874 -477489
23077d77489n8192l11566L1182K87417R1657M6144j15142J98324P4327n5773M1269
$$ -477489 -535681 -847247 -816065 -528648 -436991 -390847 -505989 -307665 -233338 -289111 -247842
23066b47842o3131J3723J1881j07130O3051r8870J20900K68764j38539k47965
$$ -247842 -310973 -297250 -285369 -392499 -329448 -428318 -307418 -38654 -177193 -425158
23056d25158J34692K73328R5300j31732J69147O4419k64168n5177r5196j31541
$$ -425158 -290466 -17138 78162 -53570 115577 179996 -84172 -139349 -234545 -366086
23046c66086J707L44119r9056k44109J93164J77054j25392p3295j13134J4591
$$ -366086 -364379 -20260 -119316 -363425 -170261 6793 -118599 -191894 -305028 -290437
23036b90437J76888L39216r3232J32515K22460N2441j77097j01490l32587p8016
$$ -290437 -113549 225667 132435 264950 487410 539851 362754 261264 -71323 -149339
23026a49339o3975J9966j03444j07916J02284k44617k07936r2647K76600J16223
$$ -149339 -213314 -193348 -296792 -404708 -302424 -547041 -754977 -847624 -571024 -454801
23016d54801J42958J80622q0825J85945j90542J88068M4510j08890p7839J62477
$$ -454801 -311843 -131221 -212046 -26101 -216643 -28575 15935 -92955 -170794 -8317
23006h317o9956k08481K81885K81258J23842m6360Q1817K07430k0061l85524N3749
$$ -8317 -78273 -286754 -4869 276389 400231 353871 435688 643118 623057 237533 291282
22995B91282N5333o9819j18907o0663k8358j22793j4227J65560o733L0970L339
$$ 291282 346615 276796 157889 97226 68868 -53925 -68152 97408 90675 121645 124984
22984A24984k45615j17786K34188K46699J47597K53743M2639l27443k32750k59217
$$ 124984 -120631 -238417 -4229 242470 390067 643810 686449 359006 126256 -132961
22974a32961k60810l1209J14698K96116K88516k08073N9197J15818J31249l53475
$$ -132961 -393771 -424980 -310282 -14166 274350 66277 125474 241292 372541 19066
22964A9066j47012R4910J18507l26305K05291j03473n2624K8183J64322P2559
$$ 19066 -127946 -33036 85471 -240834 -35543 -139016 -191640 -163457 865 73424
22954G3424m4350O907J26314l9351p8164j25041N9076k10675Q3026P8654k4920
$$ 73424 29074 35981 162295 122944 44780 -80261 -21185 -231860 -148834 -70180 -95100
22943i5100k22306n2412R1560p1784J70596J42046j12499p5446P7219K05625l2668
$$ -95100 -317406 -369818 -278258 -350042 -179446 -37400 -149899 -225345 -148126 57499 24831
22932B4831m1896M49669R9092n5629o1532L0924N7416j59300j43554p7367J00091
$$ 24831 -17065 432604 531696 476067 414535 445459 502875 343575 200021 122654 222745
22921B22745l16400j76992K2712J0509j3571N1363J83626l6388J29615K0780k7364
$$ 222745 -93655 -270647 -247935 -237426 -250997 -199634 -16008 -52396 77219 97999 70635
22910G0635j87104m65430m071J18144J93028L05460J17102J6492k7102j20564
$$ 70635 -116469 -581899 -585970 -467826 -274798 30662 147764 164256 137154 16590
22900A6590L6172k3820j46419j45522k00887o0040K42838J08643L7399k92800
$$ 16590 52762 28942 -117477 -262999 -463886 -523926 -281088 -172445 -135046 -427846
22890d27846r9586J77669J57834K69934K0467j3880n8451K0261N8539k9432m9804
$$ -427846 -527432 -349763 -191929 78005 98472 84592 26141 46402 104941 75509 25705
22879B5705k76261J22364J31131O6260j79698k92228L21464q1065k44826J91350
$$ 25705 -250556 -128192 2939 69199 -110499 -402727 -81263 -162328 -407154 -215804
22869b15804L84223k0658Q1710N8908n5415Q6891J49343J51288K3625l3919p4568
$$ -215804 168419 147761 229471 288379 232964 319855 469198 620486 644111 610192 535624
22858E35624j50377o31760r7733k01365k3462M7425O5848J51098o2889j44666
$$ 535624 385247 -246513 -344246 -545611 -569073 -521648 -455800 -304702 -367591 -512257
22848e12257K53757L91386K6679j14382J1816p5835j5902k764J41530j41653k29260
$$ -512257 -258500 132886 159565 45183 56999 -18836 -34738 -37502 104028 -37625 -266885
22837b66885r9013K72871J3738k02299n7233Q7035J83269J6700k78061j21477
$$ -266885 -365898 -93027 -79289 -281588 -338821 -251786 -68517 -51817 -329878 -451355
22827d51355q2503R1939J48840P8338p5954P2718j65233J23268j59045m39944
$$ -451355 -533858 -441919 -293079 -214741 -290695 -217977 -383210 -259942 -418987 -858931
22817h58931K5102J84794L35897J60327q737M4833J10910m2223j46691o2751J75168
$$ -858931 -833829 -649035 -313138 -152811 -161548 -116715 -5805 -48028 -194719 -257470 -82302
22806h2302K21169L03142r8764p6768j93319o9951k42151Q2844J34258J3413k44264
$$ -82302 138867 442009 343245 266477 73158 3207 -238944 -156100 -21842 -8429 -252693
22795b52693J66001R5925L5595P8147L8101j29398Q9646j17567j44973o2422J07700
$$ -252693 -86692 9233 44828 122975 161076 31678 121324 3757 -141216 -203638 -95938
22784i5938J36918j46023n8090j50875m2882K89720n5916l3122k04551m47207
$$ -95938 40980 -105043 -163133 -314008 -356890 -67170 -123086 -156208 -360759 -807966
22774h07966n0627R9403L54268M60311L0593j9377k4929j51155Q7002K5395K5752
$$ -807966 -858593 -759190 -404922 55389 85982 66605 41676 -109479 -22477 2918 28670
22763B8670j97729k42948l79807M20412P9561K49851K11712k12803k59974M9547
$$ 28670 -169059 -412007 -791814 -371402 -291841 -41990 169722 -43081 -303055 -253508
22753b53508J20374k0948J58211K88458J9666n2077l3971p6804J44766l6264l8765
$$ -253508 -133134 -154082 4129 292587 312253 260176 226205 149401 294167 257903 219138
22742B19138j28758M9594P4030j80049l16591n46417r5481P3553L02357J30913
$$ 219138 90380 139974 214004 33955 -282636 -829053 -924534 -850981 -548624 -417711
22732d17711L28424O8419l14662J55376K48731J36703k99142l36287j25768P7369
$$ -417711 -89287 -20868 -335530 -180154 68577 205280 -93862 -430149 -555917 -478548
22722d78548L29559K52754k68053k62189L3108K82631J85338K40727Q1293k15217
$$ -478548 -148989 103765 -164288 -426477 -393369 -110738 74600 315327 396620 181403
22712A81403k76763j74483P208O3762Q50O1517Q461J22471J66064j938p5449j5520
$$ 181403 -95360 -269843 -262635 -198873 -198023 -136506 -128045 -5574 160490 158552 83103 67583
22700F7583K25388k93423l25093J69415J30192j60258L8805J15582R5526L3471
$$ 67583 292971 -452 -325545 -156130 -25938 -186196 -147391 -31809 63717 97188
22690I7188j94106J78146K58113l2577k85336k49582k35359J2196J74085n7828
$$ 97188 -96918 81228 339341 306764 21428 -228154 -463513 -451317 -277232 -335060
22680c35060n8181K00045M5881J26464o2137P6825J39947j21131q78l6622m6528
$$ -335060 -393241 -193196 -147315 -20851 -82988 -6163 133784 12653 11775 -24847 -71375
22669g1375J48200L03233l227q1092j74365j77175p4599J12506J18431j0967O2560
$$ -71375 76825 380058 376831 295739 121374 -55801 -130400 -17894 100537 89570 152130
22658A52130M51248k54262R2861j30589j99075j4265k82293k39678J6304J42415
$$ 152130 603378 349116 441977 311388 112313 98048 -184245 -423923 -407619 -265204
22648b65204R8662N1909j23710j20973M1925K18448J51354J73542j25650l68418
$$ -265204 -166542 -114633 -238343 -359316 -317391 -98943 52411 225953 100303 -268115
22638b68115J10087r6305k25352j4814L09208J41808k41451j00885R8263M03134
$$ -268115 -158028 -254333 -479685 -494499 -185291 -43483 -284934 -385819 -287556 115578
22628A15578Q1371j71135l52889j65351J71512R4376L20011J86555J00402l1996
$$ 115578 196949 25814 -327075 -492426 -320914 -226538 93473 280028 380430 348434
22618C48434p176j35077o7575L6031l8209j27599l05812p6180J90859R5598p1775
$$ 348434 341258 206181 138606 174637 136428 8829 -296983 -373163 -182304 -86706 -158481
22607a58481J1181M26626j29593k29601l14104j0817K16316P5975l6105j17197
$$ -158481 -147300 279326 149733 -79868 -393972 -404789 -188473 -112498 -148603 -265800
22597b65800j87686J56165j29112j97357R4065K97042K33235l1465J41389j73667
$$ -265800 -453486 -297321 -426433 -623790 -529725 -232683 552 -30913 110476 -63191
22587f3191R1771J91504M7940j66295j77063k76398M2706q1670M11996J56287
$$ -63191 28580 220084 268024 101729 -75334 -351732 -309026 -390696 21300 177587
22577A77587J61539K4367n4245j08108p4229J7570L0090P5589j33290j39161j84832
$$ 177587 339126 363493 309248 201140 126911 144481 174571 250160 116870 -22291 -207123
22566b07123j40830J22589J45594L29739Q0437k16268L1473L3839k27366j47964
$$ -207123 -347953 -225364 -79770 249969 330406 114138 145611 179450 -47916 -195880
22556a95880j45307J47895J79094J98238J27669k17254J87417K48015j34645m20634
$$ -195880 -341187 -193292 -14198 184040 311709 94455 281872 529887 395242 -25392
22546b5392l25569J90538l3121L1451J35798P5355n22q691J85934M01537k2863
$$ -25392 -350961 -160423 -193544 -162093 -26295 49060 48538 39847 225781 627318 604455
22535F04455j47353j93935N5960J51367l51696l28025J3450J82043k21829m27796
$$ 604455 457102 263167 319127 470494 118798 -209227 -195777 -13734 -235563 -663359
22525f63359j64197L04021K03746J84114r1541n0955%J68204M3506k82607L17993
$$ -663359 -827556 -523535 -319789 -135675 -227216 -278171 -278171 -109967 -66461 -349068 -31075
22514c1075J35792j35734P8773p6279J32112K42670r0710K34413M2449l59385
$$ -31075 104717 -31017 47756 -28523 103589 346259 255549 489962 532411 173026
22504A73026j51147o3693J01956j62668j30293L88005K49401j72294k12322k64993
$$ 173026 21879 -41814 60142 -102526 -232819 155186 404587 232293 19971 -245022
22494b45022N4740l8755J52288J99877N5154l14006k02288J18353R7898J53939
$$ -245022 -190282 -229037 -76749 123128 178282 -135724 -338012 -219659 -121761 32178
22484C2178n1851j04364L1642p906J87512K5961j08373k48832J04781J42706K2992
$$ 32178 -19673 -124037 -92395 -100301 87211 113172 4799 -244033 -139252 3454 26446
22473B6446k1354k3373k71716j68541J7350n9389m4411Q0735k7198K19921M38644
$$ 26446 5092 -18281 -289997 -458538 -441188 -500577 -544988 -464253 -491451 -271530 167114
22462A67114P8792r3903j98086j67735N1912j03180j21404O7855O7062K16675
$$ 167114 245906 152003 -46083 -213818 -161906 -265086 -386490 -318635 -251573 -34898
22452c4898q1181J6846M24627J08243R8316j12202j73111M3236l39205m1249J37692
$$ -34898 -116079 -99233 325394 433637 531953 419751 246640 289876 -49329 -90578 47114
22441D7114J81845P0807K10581p1722l6597m6335k25216j09074K422j06949j02837
$$ 47114 228959 299766 510347 438625 402028 355693 130477 21403 23825 -83124 -185961
22430a85961k8988j8725q8017K055O1409J46686p2769j27571N2926R9120P4609
$$ -185961 -214949 -233674 -321691 -319636 -258227 -111541 -184310 -311881 -258955 -159835 -85226
22419h5226J16251q6563K06866J25564q8085j21871j04856Q0351j2818j01353
$$ -85226 31025 -55538 151328 276892 188807 66936 -37920 42431 29613 -71740
22409g1740k34607K448K40184K43313J46351L185l59700k63171J29916J85557
$$ -71740 -306347 -303899 -63715 179598 325949 329134 -30566 -293737 -163821 21736
22399B1736k66158r3805J28718K11518J77079j34378Q1251J85272J50480j81841
$$ 21736 -244422 -338227 -209509 2009 179088 44710 125961 311233 461713 279872
22389B79872l45807J09305l5964j1008J26718k1962R3208j30897o7558J28684
$$ 279872 -65935 43370 7406 -3602 123116 101154 194362 63465 -4093 124591
22379A24591j3581j93942J37372j51636L3181L1110n0112p779J46551k6217M0916
$$ 124591 111010 -82932 54440 -97196 -64015 -32905 -83017 -90796 55755 29538 70454
22368G0454J19149o7999N1624m9814J04501q9577l1576P8941K80740m96758o9260
$$ 70454 189603 121604 173228 123414 227915 138338 106762 185703 466443 -30315 -99575
22357i9575N46952L25657J29480k68845k24021j9211o9332j80829k70427p8289
$$ -99575 447377 773034 902514 633669 409648 390437 321105 140276 -130151 -208440
22347b08440j61087R8247J94492j21081p8092K53555M20696K69532K8467j31067
$$ -208440 -369527 -271280 -76788 -197869 -275961 -22406 398290 667822 696289 565222
22337E65222m36064l6170R9774j83454J94511j14548l15646J13467j4022j11542
$$ 565222 129158 92988 192762 9308 203819 89271 -226375 -112908 -126930 -238472
22327b38472J95523J42465J36094Q7987k1166n1761j65754l3360j61104O928L67302
$$ -238472 -42949 99516 235610 323597 302431 250670 84916 51556 -109548 -102620 264682
22316B64682n3952J46852k52512j15199q8859q9230J31592m3591m33825p8351
$$ 264682 210730 357582 105070 -10129 -98988 -188218 -56626 -100217 -534042 -612393
22306f12393K36186K59176J38580J24385p2351k44533l94929p0457R2535J85749
$$ -612393 -376207 -117031 21549 145934 73583 -170950 -565879 -636336 -543801 -358052
22296c58052o9604J6732n4971L1007l3626j16547n3058L17673K90554L7815K9812
$$ -358052 -427656 -410924 -465895 -434888 -468514 -585061 -638119 -320446 -29892 7923 37735
22285C7735K19384q8350k73622k62464J58611J47313j04418O7300P4919K6522
$$ 37735 257119 168769 -104853 -367317 -208706 -61393 -165811 -98511 -23592 2930
22275B930O1106l01030Q4949K42494K07256K08856N2457k24292l22075m42476
$$ 2930 64036 -236994 -152045 90449 297705 506561 559018 334726 12651 -429825
22265d29825J01386J61838j76990J7883L22916k5595k64k43165m0126p9353J04477
$$ -429825 -328439 -166601 -343591 -325708 -2792 -28387 -28651 -271816 -311942 -391295 -286818
22254b86818K05334q8788o4196N3654L97733L50080j12035r3865p1035k53333
$$ -286818 -81484 -170272 -234468 -180814 216919 566999 454964 361099 290064 36731
22244C6731k31399j03288l6498j00204J4319L33876M54418J0481l59981j40825
$$ 36731 -194668 -297956 -334454 -434658 -420339 -86463 367955 378436 18455 -122370
22234a22370J09286J3477j21079j48958m8250J11777L83428L53148k69458j75200
$$ -122370 -13084 393 -120686 -269644 -317894 -206117 177311 530459 261001 85801
22224H5801N876j7791J44611o5990l07233J32712p3957k10884J89254L2811j70631
$$ 85801 91677 73886 218497 152507 -154726 -22014 -95971 -306855 -117601 -84790 -255421
22213b55421q8207K53772L83429l0895m81598l0362J04458J45798n2983J12801
$$ -255421 -343628 -89856 293573 262678 -218920 -249282 -144824 974 -52009 60792
22203F0792K2573o5441J22509Q1355j23268j71028l00564K79210p1035l73721
$$ 60792 83365 17924 140433 221788 98520 -72508 -373072 -93862 -164897 -538618
22193e38618m1727M06096N7267J71978J83286K55730k45857j70867j29504O0404
$$ -538618 -580345 -174249 -116982 54996 238282 494012 248155 77288 -52216 8188
22183H188K59413J60615J16628l24676J58286J03474M7422L2739k38185j70713
$$ 8188 267601 428216 544844 220168 378454 481928 529350 562089 323904 153191
22173A53191o2399j69119J08497R2007j88457J22937L26324J67261o0813p3808
$$ 153191 90792 -78327 30170 122177 -66280 56657 382981 550242 489429 415621
22163D15621j12525k20266l39035J50982J05368J9255J59597J22221k26772k87851
$$ 415621 303096 82830 -256205 -105223 145 19400 178997 301218 74446 -213405
22153b13405p3401N9300K31494K1907j49950j94160K62980L22759J4508k15387
$$ -213405 -286806 -227506 3988 25895 -124055 -318215 -55235 267524 282032 66645
22143F6645L4137P913m4237l483j46443J16140K40621J4928l70179l84011k01846
$$ 66645 100782 108695 64458 60975 -85468 30672 271293 286221 -83958 -467969 -669815
22132f69815K02574N3675J89488L59890N7493j20117j27680m27936o701K09449
$$ -669815 -467241 -413566 -224078 135812 193305 73188 -54492 -482428 -489129 -279680
22122b79680P5563L28889p3228k41088k15144J19829K12443l07525L2323J44072
$$ -279680 -204117 124772 51544 -189544 -404688 -284859 -72416 -379941 -347618 -203546
22112b03546O7276R1104K16319P0785q6542J3400R1089N9615r5510J37478K2784
$$ -203546 -136270 -45166 171153 241938 155396 168796 259885 319500 223990 361468 384252
22101C84252l26579j34164k40370j08563L25260j36110l37759q5395K00749L06266
$$ 384252 57673 -76491 -316861 -425424 -100164 -236274 -574033 -659428 -458679 -152413
22091a52413J42471L42929j4281m01489k5307K34059m5497o2362j64303j04400
$$ -152413 -9942 332987 318706 -82783 -108090 125969 80472 18110 -146193 -250593
22081b50593j84457K79908O8423o3649M25330N5687l07618j25407q8666j54510
$$ -250593 -435050 -155142 -86719 -150368 274962 330649 23031 -102376 -191042 -345552
22071c45552L08454L95680M1728k43167m4859m8126k40325j27766r934K27489
$$ -345552 -37098 358582 400310 157143 112284 64158 -176167 -303933 -313867 -86378
22061h6378M22868k8209j33249Q1142p6217j75755K1316K44153n0882o5662r6000
$$ -86378 336490 308281 175032 256174 179957 4202 25518 269671 218789 153127 57127
22050E7127O6772R2567k7863j0528l70222k9638L49816l29646m06223Q0179j3458
$$ 57127 123899 216466 188603 178075 -192147 -221785 128031 -201615 -607838 -527659 -541117
22039e41117J87904q4213K98764L59120k3368j78837J58351M8693P1603j11187
$$ -541117 -353213 -437426 -138662 220458 197090 18253 176604 225297 296900 185713
22029A85713k10722J07155K51471j2390m0478k36467r6267K65018j989J3249p7212
$$ 185713 -25009 82146 333617 321227 280749 44282 -51985 213033 211044 224293 147081
22018A47081j12149j66458J03863r6189j80154m8649J78540n1866j45627J55636
$$ 147081 34932 -131526 -27663 -123852 -304006 -352655 -174115 -225981 -371608 -215972
22008b15972K57927j55023r3117J03811J14380L85824P8947l05288k28557K5419
$$ -215972 41955 -113068 -206185 -102374 12006 397830 476777 171489 -57068 -31649
21998c1649J07661j60299K1939j20137J6589L55108L15843m0478j72513j19107
$$ -31649 76012 -84287 -62348 -182485 -165896 189212 505055 464577 292064 172957
21988A72957j30228R7377J60357L9184J3475j23682n7334O2993K92077J88100
$$ 172957 42729 140106 300463 339647 353122 229440 172106 235099 527176 715276
21978G15276p9136k67163R4053j52722q2514j74884k19278J1255L80915M6327
$$ 715276 636140 368977 463030 310308 227794 52910 -166368 -155113 225802 272129
21968B72129k06445r7355J26297l3149j05564j04812J63528K17130l13984l13223
$$ 272129 65684 -31671 94626 61477 -44087 -148899 14629 231759 -82225 -395448
21958c95448k00157K43776k10Q7047n5741k14313p1452K2325Q1075L73478K66320
$$ -395448 -595605 -351829 -352039 -264992 -320733 -535046 -606498 -584173 -503098 -129620 136700
21947A36700j38208k13571k57311j83011n1754J24558J4034L60546J30638l06092
$$ 136700 -1508 -215079 -472390 -655401 -707155 -582597 -568563 -208017 -77379 -383471
21937c83471k58959L51841K90309J5400o2399p7752o4739m9375k04109o5056J41927
$$ -383471 -642430 -290589 -280 15120 -47279 -125031 -189770 -239145 -443254 -508310 -366383
21926c66383J05067J92405O2248r4892K6904n0237p8243J34538k837K41305J16225
$$ -366383 -261316 -68911 -6663 -101555 -74651 -124888 -203131 -68593 -71430 169875 286100
21915B86100K11842o5164n8767j18434j4239J34134k24797r1178J56695j11468
$$ 286100 497942 432778 374011 255577 241338 375472 150675 59497 216192 104724
21905A04724j57434J61759J43265j03064p6574q7013K15916K45348m9558J0748
$$ 104724 -52710 109049 252314 149250 72676 -14337 201579 446927 397369 408117
21895D08117j14584k63889m4513l01324n7631k4766R6302K06734N525m3966J41369
$$ 408117 293533 29644 -14869 -316193 -373824 -398590 -302288 -95554 -90029 -133995 7374
21884G374j34279J00835q7187P7025k62623j20875j49842K49269J72621j56321
$$ 7374 -126905 -26070 -113257 -36232 -298855 -419730 -569572 -320303 -147682 -304003
21874c04003Q4593m5999k59583J81299K67745j28842k23806J24418M59681O2981
$$ -304003 -219410 -265409 -524992 -343693 -75948 -204790 -428596 -304178 155503 218484
21864B18484K32326j47622n0371Q934M3565K0890j10567j10187N4819j43491J39249
$$ 218484 450810 303188 252817 261751 305316 326206 215639 105452 160271 16780 156029
21853A56029K28792K28171k04013k57744J32980l35182j58089J28233k2564q0203
$$ 156029 384821 612992 408979 151235 284215 -50967 -209056 -80823 -103387 -183590
21843a83590r0486j89424J93081K22875O852R8353J79756r3038m17623N0873M25830
$$ -183590 -274076 -463500 -270419 -47544 -40692 57661 237417 144379 -273244 -222371 203459
21832B03459j49857l41752M1722o3855P0391R3939J7780q666P3190q1963j3798
$$ 203459 53602 -288150 -246428 -310283 -239892 -145953 -128173 -136839 -63649 -145612 -159410
21821a59410J68044J49009J17652j43657m069K60125l8216k82679k49619O6348
$$ -159410 8634 157643 275295 131638 127569 387694 349478 66799 -182820 -116472
21811a16472Q2974O9310N7289j47252n5203l05733j4610J37229K17123K1185j89977
$$ -116472 -33498 35812 93101 -54151 -109354 -415087 -429697 -292468 -75345 -54160 -244137
21800b44137n0058j28507l65812m8824K96133J07600J79602M8908J21129J38939
$$ -244137 -294195 -422702 -788514 -837338 -541205 -433605 -254003 -205095 -83966 54973
21790E4973n0419K15917J72409k05279k03537N5878N1071K5247j38365l1726J21380
$$ 54973 4554 220471 392880 187601 -15936 39942 91013 116260 -22105 -53831 67549
21779F7549K01701L13994r4066k27066N1983j3406j0233k42380k69420L4119p7375
$$ 67549 269250 583244 489178 262112 314095 300689 290456 48076 -221344 -187225 -264600
21768b64600o6958N864J77505j92832O8009j37165M7693K4939J17021M1460K86227
$$ -264600 -331558 -325694 -148189 -341021 -273012 -410177 -362484 -337545 -220524 -179064 107163
21757A07163L67365n2886r183j96451j14251K81251j48424l57532J76537J07451
$$ 107163 474528 421642 412459 216008 101757 383008 234584 -122948 53589 161040
21747A61040J01993l052l02813l73330l7160J45184N0574k34180J5388J19494
$$ 161040 263033 259981 -42832 -416162 -453322 -308138 -257564 -491744 -476356 -356862
21737c56862Q4280j34994K53908K47152J03891J57598k07527j48230M3308Q8964
$$ -356862 -272582 -407576 -153668 93484 197375 354973 147446 -784 42524 131488
21727A31488N8106k51583j80745j13290J02276L54533j12732m0181K49204Q5085
$$ 131488 189594 -61989 -242734 -356024 -253748 100785 -11947 -52128 197076 282161
21717B82161q9634j91427k28108J14709K77635Q5847k34787M591p9923j91628
$$ 282161 192527 1100 -227008 -112299 165336 251183 16396 20987 -58936 -250564
21707b50564l107q3665N7268K62934J46121K23470J17037j20395l83751k23905
$$ -250564 -253671 -337336 -280068 -17134 128987 352457 469494 349099 -34652 -258557
21697b58557K22182J38413k44085k1538P5567k53100K63823r3022J36374J29657
$$ -258557 -36375 102038 -142047 -163585 -88018 -341118 -77295 -170317 -33943 95714
21687I5714o3342L5001j82229o7701P0313N661l4656J18715L00311J24108Q5725
$$ 95714 32372 67373 -114856 -182557 -112244 -106583 -141239 -22524 277787 401895 487620
21676D87620q2832k70750j84990N789N3136R7197l52678o4642k96416k12559L14911
$$ 487620 404788 134038 -50952 -45163 7973 105170 -247508 -312150 -608566 -821125 -506214
21665e06214M80848p0249k10343J27490M15843j01860l60168r8134L65158J74835
$$ -506214 -25366 -95615 -305958 -178468 237375 135515 -224653 -322787 42371 217206
21655B17206K34588j95178k21617j82289J08239j3760J74395Q1702L1147j804
$$ 217206 451794 256616 34999 -147290 -39051 -52811 121584 203286 234433 232629
21645B32629J94759Q5970l56304j04165k06272j381J51746K94651j50410k24987
$$ 232629 427388 513358 157054 52889 -153383 -154764 -3018 291633 141223 -83764
21635h3764J65830l15415r8647N3236K39175j88936k33667K42208m4543O2367
$$ -83764 82066 -233349 -331996 -278760 -39585 -228521 -462188 -219980 -264523 -202156
21625b02156K43979K50369j1557k48849m5815Q1916M3724O6940N6286j34062l32706
$$ -202156 41823 292192 280635 31786 -14029 67887 111611 178551 234837 100775 -231931
21614b31931l23893K09588L03578P4007k25134J37867J44146k16374r39j48922
$$ -231931 -555824 -346236 -42658 31349 -193785 -55918 88228 -128146 -129085 -278007
21604b78007l96631q0759J21827K68801O5141L8161j68305J37035R7723J00924
$$ -278007 -674638 -755397 -633570 -364769 -299628 -261467 -429772 -292737 -195014 -94090
21594i4090M54115k57806p8083Q2529Q617J51886k39474j92164J83686J33097
$$ -94090 360025 102219 24136 106665 115282 267168 27694 -164470 19216 152313
21584A52313j45476j13826J45627j32318j10338K46601J45684K6891k18734K10272
$$ 152313 6837 -106989 38638 -93680 -204018 42583 188267 215158 -3576 206696
21574B06696l1132J96338J33776j48633k30688K3072K78319k69413j70847r4064
$$ 206696 175564 371902 505678 357045 126357 149429 427748 158335 -12512 -106576
21564a06576L5292j41129o9631K275O1501L28950j80792k1487q5231j81205K43870
$$ -106576 -71284 -212413 -282044 -279769 -218268 110682 -70110 -91597 -176828 -358033 -114163
21553a14163K90233j26793o3453n4067Q4909o937j21179p8513l7096j82267J96406
$$ -114163 176070 49277 -14176 -68243 16666 9729 -111450 -189963 -227059 -409326 -212920
21542b12920J05619J03923j49443o3979L77809j22221L7339p7959k71229L17730
$$ -212920 -107301 -3378 -152821 -216800 161009 38788 76127 -1832 -273061 44669
21532D4669L10812q7805l01321J30794K13926o6240J19920m15070n34789K01651
$$ 44669 355481 267676 -33645 97149 311075 244835 364755 -50315 -585104 -383453
21522c83453R3425j1918R5349J09648j4453j31105k22791R1829J56129J62416
$$ -383453 -290028 -301946 -206597 -96949 -111402 -242507 -465298 -373469 -217340 -54924
21512e4924O6792L617J01610l8575P268k4181J47588j58102j81411J28772K748
$$ -54924 11868 15485 117095 78520 85788 61607 209195 51093 -130318 -1546 1202
21501A202j09252r6406J92110p8580J32197j1701r8414R2170J70895J19907M4100
$$ 1202 -108050 -204456 -12346 -90926 41271 29570 -68844 23326 194221 314128 358228
21490C58228j9414q4686L1933k4393j69008j32759L3040K13034J93686n5774k37367
$$ 358228 338814 254128 286061 261668 92660 -40099 -7059 205975 399661 343887 106520
21479A06520r888j05107o3448j28172k64907q0556J8598J58728K6007m2554j21252
$$ 106520 96632 -8475 -71923 -200095 -465002 -545558 -526960 -368232 -342225 -384779 -506031
21468e06031P5657O3988K03198J84905p8297J02077R5433M7462P4312j39184j12171
$$ -506031 -430374 -366386 -163188 21717 -56580 45497 140930 188392 262704 123520 11349
21457A1349m424J70295p8103k83023j72002K565q5555j98580J72796J33672R4622
$$ 11349 6925 177220 99117 -183906 -355908 -353343 -438898 -637478 -464682 -331010 -236388
21446b36388J88187p988j37801j78308n9921O6924k44929Q0494q4558R9230J19115
$$ -236388 -48201 -56189 -193990 -372298 -432219 -365295 -610224 -529730 -614288 -515058 -395943
21435c95943N36356J09946l73J42825k08111j30609m6350K17507J67151k69034
$$ -395943 140413 250359 249986 392811 184700 54091 7741 225248 392399 123365
21425A23365j20119J89655J50174j40142J61803J58752J06149m934k57325j82080
$$ 123365 3246 192901 343075 202933 364736 523488 629637 624703 367378 185298
21415A85298j70844m8203O8313J36230j3443l20101l39220O2211K00758K75553
$$ 185298 14454 -33749 34564 170794 157351 -162750 -501970 -439759 -239001 36552
21405C6552p6676O946j90359n2287j99026J12523J35413R0619J72430P3274J72845
$$ 36552 -40124 -33178 -223537 -275824 -474850 -362327 -226914 -136295 36135 109409 282254
21394B82254l1187L5594J91384p5122L4965K8086j24693j12790m96184l70659
$$ 282254 251067 286661 478045 402923 437888 465974 341281 228491 -267693 -638352
21384f38352m6253J95892o6229K52691O4395k55695N2813j23780K04000P9603
$$ -638352 -684605 -488713 -554942 -302251 -237856 -493551 -440738 -564518 -360518 -280915
21374b80915J37219K9668n3357j71610R7771Q4496k88017j18170J13920J14317
$$ -280915 -143696 -114028 -167385 -338995 -241224 -156728 -444745 -562915 -448995 -334678
21364c34678J86934j18971j9552J86009O0276n6779J59354j8127K33857q9321
$$ -334678 -147744 -266715 -286267 -100258 -39982 -96761 62593 44466 278323 189002
21354A89002k50413l48613p1230K74207L2053k9054J65330K16487Q898k7208r7161
$$ 189002 -61411 -410024 -481254 -207047 -174994 -204048 -38718 177769 186667 159459 62298
21343F2298j61154J60414J05275o2969l320j10870J86919J68351L7811m395l8930
$$ 62298 -98856 61558 166833 103864 100544 -10326 176593 344944 382755 378360 339430
21332C39430l9567p8658k89765k13781P6746l7664j27954o5650L87993M74635
$$ 339430 299863 221205 -68560 -282341 -205595 -243259 -371213 -436863 -48870 425765
21322D25765P1548J15957P7436k90563j26298J28808J36922K5239J1616q9404
$$ 425765 497313 613270 690706 400143 273845 402653 539575 564814 576430 487026
21312D87026j40281p4368j01758L5269l6566j52883j30092j55389J1899J07242
$$ 487026 346745 272377 170619 205888 169322 16439 -113653 -269042 -257143 -149901
21302a49901j6926j18842J3965r1303L17253M2621q1762K75963K9394J91492J02792
$$ -149901 -166827 -285669 -271704 -363007 -45754 -3133 -84895 191068 220462 411954 514746
21291E14746o1292k8134n2237K1425k61760j6219o1590j17145j62821j25653J69694
$$ 514746 453454 425320 373083 394508 132748 116529 54939 -62206 -225027 -350680 -180986
21280a80986K5662J50085r8533j56188J32778j7418p2562M7753r036N7187J47253
$$ -180986 -155324 -5239 -103772 -259960 -127182 -144600 -217162 -169409 -178445 -121258 25995
21269B5995M1829j38168K1440M94228J74855l4138j3018j67838j01348K494q8194
$$ 25995 67824 -70344 -48904 445324 620179 586041 573023 405185 303837 306331 218137
21258B18137m8278K1660K23154j47033k63063k6902l4022o8319K56824J11281
$$ 218137 169859 191519 414673 267640 4577 -22325 -56347 -124666 132158 243439
21248B43439k48684J48122j20277j88355O8594p1214J29699J82190j98018l99431
$$ 243439 -5245 142877 22600 -165755 -97161 -168375 -38676 143514 -54504 -453935
21238d53935k98062Q3274K08586l0353k82914J21009K59731J23302J28421r9320
$$ -453935 -751997 -668723 -460137 -490490 -773404 -652395 -392664 -269362 -140941 -240261
21228b40261J16272M0106r8137j05432M00692R9351J648j24668k57040l55374
$$ -240261 -123989 -83883 -182020 -287452 113240 212591 214239 89571 -167469 -522843
21218e22843O05J62694K5064j52305J97701K76986J73308j20230k87901j00187
$$ -522843 -522238 -359544 -334480 -486785 -289084 -12098 161210 40980 -246921 -347108
21208c47108q328L101J07517j9480j63873K87160K11830k04289j01242j29633
$$ -347108 -355436 -352335 -244818 -264298 -428171 -141011 70819 -133470 -234712 -364345
21198c64345j984P5709K73861K702k58418j82223k19085k8127J01371j65312j555
$$ -364345 -366329 -290620 -16759 -14057 -272475 -454698 -673783 -701910 -600539 -765851 -767406
21187g67406K43783M20405J18330j46240p7329L3239k1179R4772J75323J29855
$$ -767406 -523623 -103218 15112 -131128 -208457 -175218 -196397 -101625 73698 203553
21177B03553l04199k81001k12857L08472K50151K00167J63527n3477m43864N2420
$$ 203553 -100646 -381647 -594504 -286032 -35881 164286 327813 274336 -169528 -117108
21167a17108j4238K84514p9549M280J86077j10966j20499J5625L4761j30577O6338
$$ -117108 -131346 153168 73619 77899 263976 153010 32511 48136 82897 -47680 18658
21156A8658L01219j02957j68931j73329r5095L28034K01147r5419m5502k73880
$$ 18658 319877 216920 47989 -125340 -220435 107599 308746 213327 167825 -106055
21146a06055j26122O3417K44195J1684j77420m0294J21708R0951l8581o4636o9853
$$ -106055 -232177 -168760 75435 87119 -90301 -130595 -8887 82064 43483 -21153 -91006
21135i1006r2599K96534j52799m9890J58351j22979J19816M02103K56133r2933
$$ -91006 -183605 112929 -39870 -89760 68591 -54388 65428 467531 723664 630731
21125F30731r2246o2705J28919n2533l85817m95276k12250K07817J48751K46611
$$ 630731 538485 475780 604699 552166 166349 -328927 -541177 -333360 -184609 62002
21115F2002J39687k95290j05747K13564R891k4279N8310j32473j26955K35794
$$ 62002 201689 -93601 -199348 14216 24107 -172 58138 -74335 -201290 34504
21105C4504p5211k8023j92618j50583L7398j11544L07464J22029q3338q6808Q9835
$$ 34504 -40707 -68730 -261348 -411931 -374533 -486077 -178613 -56584 -139922 -226730 -136895
21094a36895K90785J23564k1395j00774L6322p9580O9882M7126k96912m03208
$$ -136895 153890 277454 256059 155285 191607 112027 181909 229035 -67877 -471085
21084d71085l4402N66473J45461k72546k1219j31516R4909J72559k3250j09141
$$ -471085 -505487 60986 206447 -66099 -87318 -218834 -123925 48634 25384 -83757
21074h3757J51641Q4555n9097p455n6101j48264j68829K23782K41375J20813o1425
$$ -83757 67884 152439 93342 85887 29786 -118478 -287307 -63525 177850 298663 237238
21063B37238o9870j17593R8446J73497J18824l86630l56571J2328J1303J08005
$$ 237238 167368 49775 148221 321718 440542 53912 -302659 -290331 -279028 -171023
21053a71023J76727J14339r9160n2486R5833K63385l4613p8873k86714p2297L8629
$$ -171023 5704 120043 20883 -31603 64230 327615 293002 214129 -72585 -144882 -106253
21042a06253j26987Q0135L9279L0933O8461P372J79821k27858k37993K73962K49432
$$ -106253 -233240 -153105 -113826 -82893 -14432 -7060 172761 -55097 -293090 -19128 230304
21031B30304j40749J19665k6328j39022l50590j45438p7897J45764j27470J29045
$$ 230304 89555 209220 182892 43870 -306720 -452158 -530055 -384291 -511761 -382716
21021c82716K5135J45869M1332J90546L43573j32533j71226j44882p5593k88815
$$ -382716 -357581 -211712 -170380 20166 363739 231206 59980 -84902 -160495 -449310
21011d49310o847M00848J15201m42051m80393J4351R1246O1866L15996L97949
$$ -449310 -456157 -55309 59892 -382159 -862552 -848201 -756955 -695089 -379093 18856
21001A8856P1281j42873n3541J83801J43810J85523p5913l10895j32722q3513
$$ 18856 90137 -52736 -106277 77524 221334 406857 330944 20049 -112673 -196186
20991a96186N503J69338j7564P6698j09560q6601j52531j79545O566Q5893K09269
$$ -196186 -190683 -21345 -38909 37789 -71771 -158372 -310903 -490448 -483882 -397989 -188720
20980a88720J08710j02545J1492J28545l7971j22476j15153K22657j18008q7978
$$ -188720 -80010 -182555 -171063 -42518 -80489 -202965 -318118 -95461 -213469 -301447
20970c01447M5097Q6619j09626O2003k45854j52448k7332M59169J68455q460l51692
$$ -301447 -256350 -169731 -279357 -217354 -463208 -615656 -642988 -183819 -15364 -23824 -375516
20959c75516j56862q9241J56094K10334k55574J60462Q5493Q0666j5707q0631
$$ -375516 -532378 -621619 -465525 -255191 -510765 -350303 -264810 -184144 -199851 -280482
20949b80482m2611k4170O3113k87003j49325K97813L45973L05428j39424j97442
$$ -280482 -323093 -347263 -284150 -571153 -720478 -422665 -76692 228736 89312 -108130
20939a08130K9766k26607j45236K90354K61564p7003N4228J03297k46574j38012
$$ -108130 -78364 -304971 -450207 -159853 101711 24708 78936 182233 -64341 -202353
20929b02353N6206J89499J25426l5161j99521j22806j7053K9951J61653K42540
$$ -202353 -146147 43352 168778 133617 -65904 -188710 -205763 -175812 -14159 228381
20919B28381K00748j01679j55063j02675K52004J88655k58996j51930l02564r6814
$$ 228381 429129 327450 172387 69712 321716 510371 251375 99445 -203119 -299933
20909b99933K44660J82466j41970L4290N1488J40634j09302m388O4465J56612
$$ -299933 -55273 127193 -14777 19513 71001 211635 102333 97945 162410 319022
20899C19022j67408l60419o7894P9091L46203J88615j06487j6269K7652j85301
$$ 319022 151614 -208805 -276699 -197608 148595 337210 230723 214454 242106 56805
20889E6805J5815J00087L0528k26982Q6509p0402K16256j40449k46245p4154M4708
$$ 56805 72620 172707 203235 -23747 62762 -7640 208616 68167 -178078 -252232 -207524
20878b07524J53479K53385o6200K8670J60983K1662L6603j84878P468J87429k30486
$$ -207524 -54045 199340 133140 161810 322793 344455 381058 196180 203648 391077 160591
20867A60591j41564J27209L12948L2051l04524k61219K35640p9437j66919J21047
$$ 160591 19027 146236 459184 491235 186711 -74508 161132 81695 -85224 35823
20857C5823m393j05213J85744K96551j59388k28459o1924L6033o1635K23137J30561
$$ 35823 31430 -73783 111961 408512 249124 20665 -41259 -5226 -66861 156276 286837
20846B86837j27183k15288l8448j0717J5337J62343j02193l68643M1337J27266
$$ 286837 159654 -55634 -94082 -104799 -89462 72881 -29312 -397955 -356618 -229352
20836b29352J84746Q9475j96992j55452J2050L8662j23396L9752K06375L02770
$$ -229352 -44606 44869 -152123 -307575 -295525 -256863 -380259 -340507 -134132 168638
20826A68638j1316j508P7895O5364j55774j48559k81067j50943q1879J5479n9674
$$ 168638 157322 155814 233709 299073 143299 -5260 -286327 -437270 -519149 -503670 -563344
20815e63344J64453L98137J43122j8452R526n9906l928k37026k1878j5377K59910
$$ -563344 -398891 -754 142368 123916 133442 73536 69608 -167418 -189296 -204673 55237
20804E5237j09428k80462k68613J48612M9428M9865m9909k05321l5605M05194
$$ 55237 -54191 -334653 -603266 -454654 -405226 -355361 -405270 -610591 -646196 -241002
20794b41002K56180M5429k1692j26862j12374l50219k3606L09369K54531o1171
$$ -241002 15178 60607 38915 -87947 -200321 -550540 -574146 -264777 -10246 -71417
20784g1417J6925J68272L8681j95097M9815p3068q6592n7687K10689J00436j5717
$$ -71417 -54492 113780 152461 -42636 7179 -65889 -152481 -210168 521 100957 85240
20773H5240J82867J30214j65706k89281j53663J78791L28388r101l82147K24425
$$ 85240 268107 398321 232615 -56666 -210329 -31538 296850 287749 -94398 130027
20763A30027r0303M9768k98322K2294J92148K599J41796J79903O3648q9011k7050
$$ 130027 39724 89492 -208830 -186536 5612 8211 150007 329910 393558 304547 277497
20752B77497K06866r3588k70895k04597J00986J00274Q3071o171M8634j01348
$$ 277497 484363 390775 119880 -84717 16269 116543 199614 193443 242077 140729
20742A40729r3395O5265K49524q7895k76380j36923O5816K12400j8526O1231K5370
$$ 140729 47334 112599 362123 274228 -2152 -139075 -73259 139141 120615 181846 207216
20731B07216p9429j45025j01952j03111K94311j00349k5700J97626L1973M2634
$$ 207216 127787 -17238 -119190 -222301 72010 -28339 -54039 143587 175560 218194
20721B18194k54649j36228j17446R625J36042N5857P847r4037l5971J67778r1518
$$ 218194 -36455 -172683 -290129 -280504 -144462 -88605 -80758 -174795 -210766 -42988 -134506
20710a34506P8505J11062J44286q2383k19811j94404L50171K10626l49164m041
$$ -134506 -56001 55061 199347 116964 -102847 -297251 52920 263546 -85618 -89659
20700h9659J67309l7836k59940j84870o5695j1429J29340Q4356K6117J60185O0185
$$ -89659 77650 39814 -220126 -404996 -470691 -482120 -352780 -268424 -242307 -82122 -21937
20689b1937p5893J4338K6691l0702j09624k41201k03539j70720K20756K01959
$$ -21937 -97830 -83492 -56801 -87503 -197127 -438328 -641867 -812587 -591831 -389872
20679c89872J13877l2520l4075k15851p5515J44252J96146R3019K74343l4275
$$ -389872 -275995 -308515 -342590 -558441 -633956 -489704 -293558 -200539 73804 39529
20669C9529K7498L3172J40396l73037Q7201R7070j43401k25622L37766K00335
$$ 39529 67027 100199 240595 -132442 -45241 51829 -91572 -317194 20572 220907
20659B20907q8646k32831K02864m6818m0361o754J31079M3936j97391j1814j20056
$$ 220907 132261 -100570 102294 55476 15115 8361 139440 183376 -14015 -25829 -145885
20648a45885J09611Q0233J26788q9590J19213K93p9897n8960p9453R4855J09050
$$ -145885 -36274 43959 170747 81157 200370 200663 120766 61806 -17647 77208 186258
20637A86258J50400j77142j77970j56821p2034l6648J10543O9529M4323k7438
$$ 186258 336658 159516 -18454 -175275 -247309 -283957 -173414 -103885 -59562 -87000
20627h7000m3744K12970N7888j05481R715j3157r112J80766P09k07178j8121K43571
$$ -87000 -130744 82226 140114 34633 44348 31191 22079 202845 203554 -3624 -21745 221826
20615B21826k42460q5510K62079K4598j92025m0091K39271j42654j11438J37732
$$ 221826 -20634 -106144 155935 180533 -11492 -51583 187688 45034 -66404 71328
20605G1328P0907l35264k5935J73065J21575l9077L9409J51283q5160L1914K00449
$$ 71328 142235 -193029 -218964 -45899 75676 36599 76008 227291 142131 174045 374494
20594C74494m691j92578n1224p6822p0939M1347r1034k70295j17818p1271J69065
$$ 374494 369803 177225 126001 49179 -21760 19587 -71447 -341742 -459560 -530831 -361766
20583c61766k4564J09139K7758l0073L2300J4158k1459n4923K60740K69495m02514
$$ -361766 -386330 -277191 -249433 -279506 -247206 -233048 -254507 -309430 -48690 220805 -181709
20572a81709L6067Q819Q889l5918k19613j39887j18704J04686L10374p2108J02376
$$ -181709 -145642 -136823 -127934 -163852 -383465 -523352 -642056 -537370 -226996 -299104 -196728
20561a96728m4750N1182p637j97930L155m64193J11110O32778J52686j74276N3811
$$ -196728 -241478 -190296 -197933 -395863 -392708 -856901 -745791 -113013 39673 -134603 -80792
20550h0792L37698J4105k45853j80625J80406K04217j36746p4825o0782N5830
$$ -80792 256906 271011 25158 -155467 24939 229156 92410 17585 -43197 12633
20540A2633N8710k9438K5770J73709k9014j33652r0513p9383o9938k1403K38639
$$ 12633 71343 41905 67675 241384 212370 78718 -11795 -91178 -161116 -182519 56120
20529E6120M78692k819l4440l25900l87147j70567J92871O4235R0632P4595k06160
$$ 56120 534812 531993 497553 171653 -215494 -386061 -193190 -128955 -38323 36272 -169888
20518a69888O0631K88736j19159j1510K6266j37918J35476j7457J89719r044q1752
$$ -169888 -109257 179479 60320 48810 75076 -62842 72634 55177 244896 235852 154100
20507A54100k20193j3462L44437K76524N8337K1757K7645n9952j72611l85157
$$ 154100 -66093 -79555 264882 541406 599743 621500 649145 589193 416582 31425
20497C1425k39198J08624J77415o354M4171P4254J73467k10490j24887J7671j44534
$$ 31425 -207773 -99149 78266 71912 116083 190337 363804 153314 28427 46098 -98436
20486i8436l4039J40811L7960j7053r0690N0511J80007O5885M9405j50746j85985
$$ -98436 -132475 8336 46296 29243 -61447 -10936 169071 234956 284361 133615 -52370
20475e2370k00188N7904K23047P3959k83022K17419N37741n7532k07805k53984
$$ -52370 -252558 -194654 28393 102352 -180670 36749 574490 516958 309153 55169
20465E5169K3334P7657j72471r9998K62635J00189k86174l38180J10528O5975
$$ 55169 78503 156160 -16311 -116309 146326 246515 -39659 -377839 -267311 -201336
20455b01336J55098N2599j32775M3199L59010R8100j29478j0926r105J5375O0833
$$ -201336 -46238 6361 -126414 -83215 275795 373895 244417 233491 224386 239761 300594
20444C00594K9332p4813q3278j69354p4256J90268K3808q2310P7849l18988l83601
$$ 300594 329926 255113 171835 2481 -71775 118493 142301 59991 137840 -181148 -564749
20433e64749J23453M16103q797o9301k59667j41562l6166K38132K44983M069j97978
$$ -564749 -441296 -25193 -33990 -103291 -362958 -504520 -540686 -302554 -57571 -53502 -251480
20422b51480j01755p7226J64125J31871J94719K34215k2936o4259K10275K17030
$$ -251480 -353235 -430461 -266336 -134465 60254 294469 271533 207274 417549 634579
20412F34579j77111l52549k94795K86809J83038K1597q4608j53226p7718P055
$$ 634579 457468 104919 -189876 96933 279971 301568 216960 63734 -13984 -6929
20402f929J73598r488j58048j23198J85812j39167m1444L52516J0727j23134m5665
$$ -6929 166669 157181 -867 -124065 61747 -77420 -118864 233652 244379 121245 75580
20391G5580N1065K88032j00430j22453J34176N4542k53584J22502M0124M1602
$$ 75580 126645 414677 314247 191794 325970 380512 126928 249430 289554 331156
20381C31156j13410l16808J95082K35221j14951j76387k73611p5365O8868O7715
$$ 331156 217746 -99062 96020 331241 216290 39903 -233708 -309073 -240205 -172490
20371a72490J95025K49343l26503l2365q213K87588Q6942j4699M3353J43231N5353
$$ -172490 22535 271878 -54625 -86990 -95203 192385 279327 264628 307981 451212 506565
20360E06565l30753j3379J00301k98327j22952j2301J33969J4220M1123J48002
$$ 506565 175812 162433 262734 -35593 -158545 -170846 -36877 -22657 18466 166468
20350A66468m2257k37512l8399M9461N6208O2036J58475J1397Q0965l8104k39634
$$ 166468 124211 -113301 -151700 -102239 -46031 16005 174480 185877 266842 228738 -10896
20339a0896k44256K04345K76080Q469j89059j96486l31605q5882J03745m2654
$$ -10896 -255152 -50807 225273 233742 44683 -151803 -483408 -569290 -465545 -508199
20329e08199l1984j21322M21801L13690M5777l31282J05949J91228j28465K02989
$$ -508199 -540183 -661505 -239704 73986 119763 -211519 -105570 85658 -42807 160182
20319A60182J83287Q896J0175j70075q2888j03275j91525K03473O5726j31110
$$ 160182 343469 352365 362540 192465 109577 6302 -185223 18250 83976 -47134
20309d7134J66374q7128M4715K41478j4298l25445L7088J8112k04115J23816L15157
$$ -47134 119240 32112 76827 318305 304007 -21438 15650 33762 -170353 -46537 268620
20298B68620M1457k5417L4355k00128q3038K20638J38058l84621k26843Q332O4954
$$ 268620 310077 284660 319015 118887 35849 256487 394545 9924 -216919 -208587 -143633
20287a43633m0223R5327J8125J65610J52788K78192n56602m24023K48155K22951
$$ -143633 -183856 -88529 -70404 95206 247994 526186 -30416 -454439 -206284 16667
20277A6667j3893n1457m053Q422L80916q825k81260o2068J27080n066j79922j18984
$$ 16667 2774 -48683 -52736 -44314 336602 327777 46517 -15551 111529 106463 -73459 -192443
20265a92443j41802P6810J88425K4667j10429k74410J11452j5035k60J50345J63224
$$ -192443 -334245 -257435 -69010 -44343 -154772 -429182 -317730 -332765 -333025 -182680 -19456
20254a9456K38002k82084n5197J74010j82359P2272j53938k21072O2033K68418
$$ -19456 218546 -63538 -118735 55275 -127084 -54812 -208750 -429822 -367789 -99371
20244i9371l5187J37544K67943J12572M5509p1763k46070p979J52029j73394J46286
$$ -99371 -134558 2986 270929 383501 429010 357247 111177 103198 255227 81833 228119
20233B28119L9728O4944o6156J04308O8512j12198j85009K9525j42938j24000
$$ 228119 267847 332791 266635 370943 439455 327257 142248 171773 28835 -95165
20223i5165P3159L21320O2560m22390l47688j34852K46337J02532R5673L3926
$$ -95165 -22006 299314 361874 -60516 -408204 -543056 -296719 -194187 -98514 -64588
20213f4588k80137l9359O2424j8161N3738j02794M7405J59289P1282l9769J36859
$$ -64588 -344725 -384084 -321660 -339821 -286083 -388877 -341472 -182183 -110901 -150670 -13811
20202a3811k34730j95098J6857n2958K62402J1086m3477j82080k4391J752O2615
$$ -13811 -248541 -443639 -426782 -479740 -217338 -206252 -249729 -431809 -456200 -454448 -391833
20191c91833K57441m6801L0164K09093j01571k43117P0033L18682K57751P1966
$$ -391833 -134392 -181193 -151029 58064 -43507 -286624 -216591 102091 359842 431808
20181D31808p2832l3576M5537J11647k51469J13659K56736J09931N0484J04016
$$ 431808 358976 325400 370937 482584 231115 344774 601510 711441 761925 865941
20171H65941k16888k89001K1545J5975J37656j8511K04422r0858k88265K42554
$$ 865941 649053 360052 381597 397572 535228 516717 721139 630281 342016 584570
20161E84570J82083j02200j16065k20676j2619N9229K77790J00875J07842k61374
$$ 584570 766653 664453 548388 327712 315093 374322 652112 752987 860829 599455
20151E99455m49788k92898n0874J68518P4064N2865M0002n9538J14480L8861k12333
$$ 599455 149667 -143231 -194105 -25587 48477 101342 141344 81806 196286 235147 22814
20140B2814l24880J13353N590p5297L6439J72061K53512J57677J89245k88835
$$ 22814 -302066 -188713 -183123 -258420 -221981 -49920 203592 361269 550514 261679
20130B61679p4085P4981j54109j5385M4476p6118J56843N9675j2951k4857k20538
$$ 261679 187594 262575 108466 93081 137557 61439 218282 277957 265006 240149 19611
20119A9611m07831k7822N48977K93506j40698r4236r8715n343L0807J49393M1317
$$ 19611 -388220 -416042 132935 426441 285743 191507 92792 87449 118256 267649 308966
20108C08966l0659n2704J7332l0179r4581P4853m9216k82933q5678j24045J887
$$ 308966 278307 225603 242935 212756 118175 193028 143812 -139121 -224799 -348844 -346957
20097c46957l4887L11211M3778j15957l4848O508l1177J299J59123j44153l95211
$$ -346957 -381844 -70633 -26855 -142812 -177660 -171152 -202329 -201030 -41907 -186060 -581271
20086e81271K9K86661L67636l3467k86056p2279l5805k772L25936l1983Q8808
$$ -581271 -581242 -294581 73055 39588 -246468 -318747 -354552 -357324 -31388 -63371 25437
20075B5437j89885J15438K83669l3365j71789L16972j140j06743j91997m19865
$$ 25437 -164448 -49010 234659 201294 29505 346477 345337 238594 46597 -373268
20065c73268j64455J41350L06536j13589R0828M17580O0683l79154l64881k5063
$$ -373268 -537723 -396373 -89837 -203426 -112598 304982 365665 -13489 -378370 -403433
20055d03433M0104j20363R8692J33005K96568j08738o00455j07700K22176J92216
$$ -403433 -363329 -483692 -385000 -251995 44573 -64165 -664620 -772320 -550144 -357928
20045c57928j6467O9450Q4407M55769K09520k51406j39975k05294j01787J13155
$$ -357928 -374395 -304945 -220538 235231 444751 193345 53370 -151924 -253711 -140556
20035a40556J37238J02472P6802J6843j30641j58826j21645J92933j8487J18353
$$ -140556 -3318 99154 175956 192799 62158 -96668 -218313 -25380 -43867 74486
20025G4486K1230Q2468j37950k70286K5510K62085J72675J0525j58302k5643m6661
$$ 74486 95716 178184 40234 -230052 -204542 57543 230218 240743 82441 56798 10137
20014A0137j72261n3201M29194K18355k88393o1323p2387j56573R1179J64888
$$ 10137 -162124 -215325 213869 432224 143831 82508 10121 -146452 -55273 109615
20004A09615m4749R484j60071J67605J52004m4015k31868q2889j86974k2192N6137
$$ 109615 64866 74350 -85721 81884 233888 189873 -41995 -124884 -311858 -334050 -277913
19993b77913J63388O5731q9262j99557K96460K86544p2715l02239k34351L30546
$$ -277913 -114525 -48794 -138056 -337613 -41153 245391 172676 -129563 -363914 -33368
19983c3368L4339R7865N1139m04506j30878N4398j19236k44491J33535J90921
$$ -33368 971 98836 149975 -254531 -385409 -331011 -450247 -694738 -561203 -370282
19973c70282Q9930M3959Q4437K06308O8825p6625j11069P0228m5705k01223j64661
$$ -370282 -280352 -236393 -151956 54352 123177 46552 -64517 5711 -39994 -241217 -405878
19962d05878k32168n2349J06716K65652K59816K28893M1961p3684j61079q8625
$$ -405878 -638046 -690395 -583679 -318027 -58211 170682 212643 138959 -22120 -110745
19952a10745r2370j06236J09192L85252J99132j69696l14883J53166K64984M105
$$ -110745 -203115 -309351 -200159 185093 384225 214529 -100354 52812 317796 321901
19942C21901j9233m1468M929J74497J17269p3400o323M0852l05444J68017Q7966
$$ 321901 302668 261200 266129 440626 557895 484495 478172 519024 213580 381597 469563
19931D69563K55608L53602j39467j68749P6106k9340p7172j14921j24171r8719
$$ 469563 725171 1078773 939306 770557 846663 817323 740151 625230 501059 402340
19921D02340k15865j18907j1219L13796j83292j44906J88828n4987j70947N8681
$$ 402340 186475 67568 56349 370145 186853 41947 230775 175788 4841 63522
19911F3522K57007J50009k42916L6466Q1969k83905j56775o4681l4349J71679
$$ 63522 320529 470538 227622 264088 346057 62152 -94623 -159304 -193653 -21974
19901b1974J74516n4252j18070l58816j17694J07873K97590K45801J14947j72846
$$ -21974 152542 98290 -19780 -378596 -496290 -388417 -90827 154974 269921 97075
19891I7075n2587Q1546j99687k69079R114L24224L07865m3122k09707K2049P2641
$$ 97075 44488 126034 -73653 -342732 -333618 -9394 298471 255349 45642 67691 140332
19880A40332J63830M3633J12578L7816M7987j62052K18618L09524k32165k38193
$$ 140332 304162 347795 460373 498189 546176 384124 602742 912266 680101 441908
19870D41908k02472j40636L1750J01537L62941r0263P2241q9395j31711R5983
$$ 441908 239436 98800 130550 232087 595028 504765 577006 487611 355900 451883
19860D51883k83226j20960j90698m8736j17163m594N0542j56780J84498J25104
$$ 451883 168657 47697 -143001 -191737 -308900 -313494 -262952 -419732 -235234 -110130
19850a10130J57015n3705M8783Q5689L01405O586l33285m23951M6221L86210L1737
$$ -110130 46885 -6820 41963 127652 429057 435643 102358 -321593 -275372 110838 142575
19839A42575J05304J13189l56343k46507N71292j31036m30821p1502j77685k25850
$$ 142575 247879 361068 4725 -241782 329510 198474 -232347 -303849 -481534 -707384
19829g07384l7729J94182L42413K94393J50858J96048k3799m1528r532l43123
$$ -707384 -745113 -550931 -208518 85875 236733 432781 408982 367454 357922 14799
19819A4799j07816N9198n9349J8641J1372J0735o3827K86334K0633J48551N2453
$$ 14799 -93017 -33819 -93168 -74527 -63155 -52420 -116247 170087 190720 339271 391724
19808C91724K21050j94522l96419j09098j69168P743J51714K24361K00656l17745
$$ 391724 612774 418252 21833 -87265 -256433 -248690 -96976 127385 328041 10296
19798A0296o1524m7035L31233r2846r8846J37098j26688m6728K07907J07800l21781
$$ 10296 -51228 -98263 232970 140124 41278 178376 51688 4960 212867 320667 -1114
19787a114l54209j85389K86559l09R2954n987J96781K78176K48576k23322k53338
$$ -1114 -355323 -540712 -254153 -254462 -161508 -167495 29286 307462 556038 332716 79378
19776G9378j65354j06965k31462L4314M24052J6082j62453k7894J64258J66187
$$ 79378 -85976 -192941 -424403 -390089 33963 50045 -112408 -140302 23956 190143
19766A90143k6311O9284k32414Q6954K87073J36444k78513J3245K467p2535j24448
$$ 190143 163832 233116 702 87656 374729 511173 232660 245905 248372 175837 51389
19755E1389k5532J00070n82208Q8593K744n7489K03457K21752n6900j68306J0971
$$ 51389 25857 125927 -456281 -367688 -364944 -422433 -218976 2776 -54124 -222430 -211459
19744b11459O0463k21673j22706J69569K78257L00851m5698j75825q7675j25681
$$ -211459 -150996 -372669 -495375 -325806 -47549 253302 207604 31779 -55896 -181577
19734a81577L1598K45764K73514J03511j11873l8728l16434k82531n966M6611
$$ -181577 -149979 95785 369299 472810 360937 322209 5775 -276756 -282722 -236111
19724b36111L60587n0669j12554L37714n0314k48088J23657J21639j62607L6978
$$ -236111 124476 73807 -38747 298967 248653 565 124222 245861 83254 120232
19714A20232K51970K418j25329k3016j05096J23913M9055k68563J7354l2724j57068
$$ 120232 372202 374620 249291 226275 121179 245092 294147 25584 42938 10214 -146854
19703a46854M2139Q2822K63760M09826K76257j95252K6894m5768l9790n3733J11366
$$ -146854 -104715 -21893 241867 651693 927950 732698 759592 713824 674034 620301 731667
19692G31667k92028j24244j40217J17815j31064l47032J81063J20275r0679j1256
$$ 731667 439639 315395 175178 292993 161929 -185103 -4040 116235 25556 14300
19682A4300P4091P7160Q2512J5158k83790j21780l6496K29561o1019P7479J23636
$$ 14300 88391 165551 248063 263221 -20569 -142349 -178845 50716 -10303 67176 190812
19671A90812R9026O5093k48545j43829l67152j9672J99843J08737J64430M43743
$$ 190812 289838 354931 106386 -37443 -404595 -424267 -224424 -115687 48743 492486
19661D92486M31153j84891l3176O5013J36010o8793j43400l32599M6918r0499
$$ 492486 923639 738748 705572 770585 906595 837802 694402 361803 408721 318222
19651C18222R8768K01907j69532j85664K7088J13259r7062j6724K88372j37754
$$ 318222 416990 618897 449365 263701 290789 404048 306986 290262 578634 440880
19641D40880m9694J54820r2057k59623l57674J88488K40527j11022K19394J52936
$$ 440880 391186 546006 453949 194326 -163348 25140 265667 154645 374039 526975
19631E26975l44486l81992J35736J06811J16630K03422k92378K9771K17560m4868
$$ 526975 182489 -199503 -63767 43044 159674 363096 70718 100489 318049 273181
19621B73181Q2906j58446R2721M0369K7371K63155J30306l49276k19985k16632
$$ 273181 356087 197641 290362 330731 358102 621257 751563 402287 182302 -34330
19611c4330R7475m722j40116P1684J02365J1894j63325n51301R1900L49572J0813
$$ -34330 63145 58423 -81693 -10009 92356 104250 -59075 -610376 -518476 -168904 -158091
19600a58091K7744J9748J97042J40811m8787J50098j75796m49821J17953K68110
$$ -158091 -130347 -110599 86443 227254 178467 328565 152769 -297052 -179099 89011
19590H9011k11772k02212J25981Q1523K035J27701k2145j80347k76747J26440
$$ 89011 -122761 -324973 -198992 -117469 -115434 12267 -9878 -190225 -466972 -340532
19580c40532M5494n5509R3625K04410J75171J48683l4521j69867M3508r4664j60936
$$ -340532 -295038 -350547 -256922 -52512 122659 271342 236821 66954 110462 15798 -145138
19569a45138n9519j21503L21986J62983o0962k53580N4776m4754J9942M6081J25822
$$ -145138 -204657 -326160 -4174 158809 97847 -155733 -100957 -145711 -125769 -79688 46134
19558D6134Q9664j50387J91413Q3096L57002q2651m59021J03196L61552J93179
$$ 46134 135798 -14589 176824 259920 616922 534271 75250 178446 539998 733177
19548G33177m37382J71752L09991l28777j74218q5230M5821N5213j30681n5902
$$ 733177 295795 467547 777538 448761 274543 189313 235134 290347 159666 103764
19538A03764J0644q8946J37681M6330R6049M5026k40653Q3157K29315J01495k47598
$$ 103764 114408 25462 163143 209473 305522 350548 109895 193052 422367 523862 276264
19527B76264j19000k62228J06438J10228j06954K34955L38917l7368j37674J98943
$$ 276264 157264 -104964 1474 111702 4748 239703 578620 541252 403578 602521
19517F02521J15571k29762N4264J17135j41680L4069K2014l22309j49722P0205
$$ 602521 718092 488330 542594 659729 518049 552118 574132 251823 102101 172306
19507A72306P6461J04195R4706N1816p244p6045m92347k02310K78387M8685m33017
$$ 172306 248767 352962 447668 499484 492240 416195 -76152 -278462 -75 48610 -384407
19496c84407N1798K69728L27222m92303n9891M5393R3723P3474k493J03068j12910
$$ -384407 -332609 -62881 264341 -227962 -287853 -242460 -148737 -75263 -77756 25312 -87598
19485h7598J58832J09824K4107K1819j13072K46464l5656j18565K91752J01720
$$ -87598 71234 181058 205165 226984 113912 360376 324720 206155 497907 599627
19475E99627m41718P0779L8158Q4844N4016n7250l3962J8336j32709p3801L3451
$$ 599627 157909 228688 266846 351690 405706 348456 314494 332830 200121 126320 159771
19464A59771j10508k04310Q6366j6516r5389K38656K15824n4637k16582J46090
$$ 159771 49263 -155047 -68681 -85197 -180586 58070 273894 219257 2675 148765
19454A48765j64792k07721n0536j45523k8275N2068M2420n8952Q6160J44470N36000
$$ 148765 -16027 -223748 -274284 -419807 -448082 -396014 -353594 -412546 -326386 -181916 354084
19443C54084K50112k50932k54737p6171k22070j15153m2288n9621J66916n2293
$$ 354084 604196 353264 98527 22356 -199714 -314867 -357155 -416776 -249860 -302153
19433c02153l1554J16890K74385J77821j04805J14382P0518l63544k4003M9172
$$ -302153 -333707 -216817 57568 235389 130584 244966 315484 -48060 -72063 -22891
19423b2891P1889j86872j31370n6624R2549j76599L4568K7610O8072J73753J43512
$$ -22891 48998 -137874 -269244 -325868 -233319 -409918 -375350 -347740 -279668 -105915 37597
19412C7597K9452K3718J35748L2544k39894j12331j45719j14524k02163K24950
$$ 37597 67049 90767 226515 259059 19165 -93166 -238885 -353409 -555572 -330622
19402c30622K31574R9878M1999J28804J07278q388j01218k1488j47970l5646N272
$$ -330622 -99048 830 42829 171633 278911 270523 169305 147817 -153 -35799 -30527
19391c0527K65138n217p0730Q2438l86462L3513K52135j52921l53627J46411L24491
$$ -30527 234611 229394 158664 241102 -145360 -111847 140288 -12633 -366260 -219849 104642
19380A04642K17040J3252j8484N0573o5148p6919m730j03041j21595K20476M58662
$$ 104642 321682 334934 316450 367023 301875 224956 220226 117185 -4410 216066 674728
19369F74728l65109o60441j23865J30137M6228K46828J13028l6642j21178o6189
$$ 674728 309619 -350822 -474687 -344550 -298322 -51494 61534 24892 -96286 -162475
19359a62475K22574n6683Q0272P6270j65141k75506J15532L33821k8430L1691
$$ -162475 60099 3416 83688 159958 -5183 -280689 -165157 168664 140234 171925
19349A71925p6624K20726j53547m31527j01406M12696L09707j12655j24750O958
$$ 171925 95301 316027 162480 -269047 -370453 42243 351950 239295 114545 121503
19339A21503r0430K20672J8072j43028l26108K36680J0736j57983k7052K8252
$$ 121503 31073 251745 269817 126789 -199319 37361 48097 -109886 -136938 -108686
19329a08686j95398m0123J60473o5034j00858K6333j2323L20191j88499r069L33224
$$ -108686 -304084 -344207 -183734 -248768 -349626 -323293 -335616 -15425 -203924 -212993 120231
19318A20231k69063J66390M46269K5760p6744N1339l12387j5921L17267j63484
$$ 120231 -148832 17558 463827 489587 412843 464182 151795 135874 453141 289657
19308B89657l41971j45490n9870j0173N3181K58692N1725j4256Q506M4803l0844
$$ 289657 -52314 -197804 -257674 -267847 -214666 44026 95751 81495 90001 134804 103960
19297A03960O0193l56369K42711j4560k99136o1071k779K9616j2757j42259j5124
$$ 103960 164153 -192216 50495 35935 -263201 -324272 -327051 -297435 -310192 -452451 -467575
19286d67575L61998L2632N5418J11824P9020N8026j49213k23012J01727K78557
$$ -467575 -105577 -72945 -17527 94297 173317 231343 82130 -140882 -39155 239402
19276B39402p0114p4325j91306j63656r8034q761K16576l4432K03733L00083l07929
$$ 239402 169288 94963 -96343 -259999 -358033 -366794 -150218 -184650 19083 319166 11237
19265A1237k85764j11587K34928l4588J84406K94024J83301r2818K12932J9611
$$ 11237 -274527 -386114 -151186 -185774 -1368 292656 475957 383139 596071 615682
19255F15682l08528j00400K81818J88727l542j15804k60443l89982l4707P5565
$$ 615682 307154 206754 488572 677299 673757 557953 297510 -92472 -127179 -51614
19245e1614N5789O831R3082j73319J82062J84956J32434j47427K0795j25692j14098
$$ -51614 4175 11006 104088 -69231 112831 297787 430221 282794 303589 177897 63799
19234F3799j71514J23450R0949K297j05415J07230k83782m8870R4889J70730K07846
$$ 63799 -107715 15735 106684 108981 3566 110796 -172986 -221856 -126967 43763 251609
19223B51609j52015k37303q4812J7525L72122P1085K19863p0968k84822j33863
$$ 251609 99594 -137709 -222521 -204996 167126 238211 458074 387106 102284 -31579
19213c1579K40683K11486r7145k23966k80028q3526Q1860p1733Q1493K01899l14506
$$ -31579 209104 420590 323445 99479 -180549 -264075 -182215 -253948 -172455 29444 -285062
19202b85062m2163K04663J35226J7377r1905K21759o3355P4988L66292K22404
$$ -285062 -327225 -122562 12664 30041 -61864 159895 96540 171528 537820 760224
19192G60224j95197j3942j55230O3275m4425k02047k94575N9640r4759j89609
$$ 760224 565027 551085 395855 459130 414705 212658 -81917 -22277 -117036 -306645
19182c06645K08557M48787K86715o4946k66040j94172Q5924m9011k82900J42729
$$ -306645 -98088 350699 637414 572468 306428 112256 198180 149169 -133731 8998
19172H998L8864J3746K0847j8735K9765K61866o3809p0628J42124J24545N4134
$$ 8998 47862 61608 82455 63720 93485 355351 291542 220914 363038 487583 541717
19161E41717j43022L4996k6580l14497J66656L82936j10060j7848k20775l57534
$$ 541717 398695 433691 407111 92614 259270 642206 532146 514298 293523 -64011
19151f4011m21098J65425M05332q8290j42719j14359M1789l15226l11290K04247
$$ -64011 -485109 -319684 85648 -2642 -145361 -259720 -217931 -533157 -844447 -640200
19141f40200K64547K39880l0011j49413N760j31779P1666k125J87845K45898J24669
$$ -640200 -375653 -135773 -165784 -315197 -309437 -441216 -369550 -371675 -183830 62068 186737
19130A86737m4640l19721K62867o81M8304j6204J62142K01347K7376n8413j70540
$$ 186737 142097 -177624 85243 84562 132866 116662 278804 480151 507527 449114 278574
19119B78574K4197n16058j54180L68121K19820l20306N8951k5009J4404J23977
$$ 278574 302771 -213287 -367467 654 220474 -99832 -40881 -65890 -51486 72491
19109G2491j4161k03140j10896R5437p9018k75250j14351Q2406L53493R3692k871
$$ 72491 58330 -144810 -255706 -160269 -239287 -514537 -628888 -546482 -192989 -99297 -102168
19098a02168K08586K12132j08434k24325j26657j30789p2054J85283J91521j20795
$$ -102168 106418 318550 210116 -14209 -140866 -271655 -343709 -158426 33095 -87700
19088h7700r7728P518R6237o8582K630j15642M0393j55694J24062K27142n5833
$$ -87700 -185428 -177910 -81673 -150255 -147625 -263267 -222874 -378568 -254506 -27364 -83197
19077h3197j93112j62374J41580j8223N1378J28602J58854L30847J30249J28241
$$ -83197 -276309 -438683 -297103 -315326 -263948 -135346 23508 354355 484604 612845
19067F12845L9696k71210k78269k69094K3205M9788K88220M03149k73765J303
$$ 612845 652541 381331 103062 -166032 -142827 -93039 195181 598330 324565 325868
19057C25868k5534J07132l584k07252j07972J54145J7089k37581j41062j5587
$$ 325868 300334 407466 403882 196630 88658 242803 259892 22311 -118751 -134338
19047a34338L05202J75485q7428l05839j24893L22133R3862O4106M6802K53696
$$ -134338 170864 346349 258921 -46918 -171811 150322 244184 308290 355092 608788
19037F08788k06738m16961Q2946L23693l36400j15712O7247k63967l0811N0018
$$ 608788 402050 -14911 68035 391728 55328 -60384 6863 -257104 -287915 -237897
19027b37897L65896J548j7638k33651k1373k4940N1556j26594J53379J58083j7111
$$ -237897 127999 129547 111909 -121742 -143115 -168055 -116499 -243093 -89714 68369 51258
19016E1258Q5430P5574p993r0006J93850j01046L70197J24269l44527j55800J36271
$$ 51258 136688 212262 204269 114263 308113 207067 577264 701533 357006 201206 337477
19005C37477K5441j55122l54747J36610L17594K21400l4145k90168L3303n9952
$$ 337477 362918 207796 -146951 -10341 307253 528653 494508 204340 237643 177691
18995A77691L04L3752K79816K44506M6555j8042j50479J39743O1245j93256r581
$$ 177691 177995 211747 491563 736069 782624 764582 614103 753846 815091 621835 612254
18984F12254j64153j92837m7509J41724K18579k12748M9060j78312P6176j37565
$$ 612254 448101 255264 207755 349479 568058 355310 404370 226058 302234 164669
18974A64669l14721J34420K09827J72823j17969k26373k39019J85453K73450P0042
$$ 164669 -150052 -15632 194195 367018 249049 22676 -216343 -30890 242560 312602
18964C12602J7965K1029j20567K3676n2105n62J38529o6598J83724J48235J2138
$$ 312602 330567 351596 231029 254705 202600 202038 340567 273969 457693 605928 618066
18953F18066n0200l55721p5949M4356K9061K67410K89876o0326q4639O756R9216
$$ 618066 567866 212145 136196 180552 209613 477023 766899 706573 621934 628690 727906
18942G27906k3543k40628J65416K77277J37353m55363j16194P4280k82907J50101
$$ 727906 704363 463735 629151 906428 1043781 588418 472224 546504 263597 413698
18932D13698K5403l13857j62662J22517L31733L20046R4419L33309m3706m04690
$$ 413698 439101 125244 -37418 85099 416832 736878 831297 1164606 1120900 716210
18922G16210l78481O3251J00439j44882j37140j02928K04438m9984N4635M63418
$$ 716210 337729 400980 501419 356537 219397 116469 320907 270923 325558 788976
18912G88976L08517k87758q7726j3049k86979K7138l3255j66761j26054k29941
$$ 788976 1097493 809735 722009 708960 421981 449119 415864 249103 123049 -106892
18902a06892J81067M05164j14612l18311q499r5879l06599q4982K37699J45385
$$ -106892 74175 479339 364727 46416 37917 -57962 -364561 -449543 -211844 -66459
18892f6459n7478L30288M2496o1791M1382J86826K41204j49671M1590j30809k01724
$$ -66459 -123937 206351 248847 187056 228438 415264 656468 506797 548387 417578 215854
18881B15854p8691J40806K01684L20238r3282r3307j58382j14312Q0566J11573
$$ 215854 137163 277969 479653 799891 706609 613302 454920 340608 421174 532747
18871E32747m1245K48733j05096r2079l914J65345j89735O06J58938K13189J34442
$$ 532747 491502 740235 635139 543060 539146 704491 514756 515362 674300 887489 1021931
18860A021931k15797j85211M4870r5362R5575K4550M3957j58569k30188j58382
$$ 1021931 806134 620923 665793 570431 666006 690556 734513 575944 345756 187374
18850A87374K03554L71285L66586k554p9443n16361m43064k65838m6520l603K26086
$$ 187374 390928 762213 1128799 1126245 1046802 530441 87377 -178461 -224981 -228584 -2498
18839b498k5980J66257J29785j28204k65523R1202M42674J07844N4691R4197J95137
$$ -2498 -28478 137779 267564 139360 -126163 -34961 407713 515557 570248 664445 859582
18828H59582K68218K9970k16197n23176j93351j45765j21021K59597p0539J27632
$$ 859582 1127800 1157770 941573 418397 225046 79281 -41740 217857 147318 274950
18818B74950J18435K6742j21171R0820l17391n45182O0583K06701K8371J87698
$$ 274950 393385 420127 298956 389776 72385 -472797 -412214 -205513 -177142 10556
18808A0556j4186j48709K91141J86902R8920N5178j723j98114K60200K55464J19916
$$ 10556 -3630 -152339 138802 325704 424624 479802 478079 279965 540165 795629 915545
18797I15545j22168l53543j52188J15851M29692K33988J70770J37785k13337l69326
$$ 915545 793377 439834 287646 403497 833189 1067177 1237947 1375732 1162395 793069
18787G93069l29847j63563m23147Q5942L08481K56080Q8727r3251j32900o6914
$$ 793069 463222 299659 -123488 -37546 270935 527015 615742 522491 389591 322677
18777C22677n3799q3065K78915L1667J40563J1830L5964N56631P06349J009902
$$ 322677 268878 185813 464728 496395 636958 648788 684752 1241383 1947732 2957634
18767B957634P82121P1301r00625q68289p16823K4597J51408L03256j05315m81022
$$ 2957634 3739755 3811056 2910431 2042142 1325319 1349916 1501324 1804580 1699265 1218243
18757A218243n10274j30348R8683j33136R5204N1699Q5221J0310j13236k0892
$$ 1218243 707969 577621 676304 543168 638372 690071 775292 785602 672366 651474
18747F51474l4740n745Q5666k11555l80322k07638M59329J62168P7380K587l48397
$$ 651474 616734 610989 696655 485100 104778 -102860 356469 518637 596017 598604 250207
18736B50207R2631j41475M9995J84540l2331J08759n2413m7926J80378J25480
$$ 250207 342838 201363 251358 435898 403567 512326 459913 411987 592365 717845
18726G17845l20655p9126K3686J38828N1044k30114P7963K55472j84914k87721
$$ 717845 397190 318064 341750 480578 531622 301508 379471 634943 450029 162308
18716A62308j8111O81M7460K66362K946k17969N6585M18396P5900j78685j21990
$$ 162308 144197 144878 192338 458700 461646 243677 300262 718658 794558 615873 493883
18705D93883j53386K7175J79116J20797J9611j75674J22785N2816k37127j06510
$$ 493883 340497 367672 546788 667585 687196 511522 634307 687123 449996 343486
18695C43486N8687J51072j69686j5025Q2422o8323k02545J5527M98210L61013
$$ 343486 402173 553245 383559 368534 450956 382633 180088 195615 693825 1054838
18685A054838k29300j76087Q9689J06573J77125o6584m11342n0691Q1911l55588
$$ 1054838 825538 649451 739140 845713 1022838 956254 544912 494221 576132 220544
18675B20544O2357K48032K42383N8863J13337J96536j14002N8295j1515n3876
$$ 220544 282901 530933 773316 832179 945516 1142052 1028050 1086345 1074830 1020954
18665A020954O5926o4957l9298k68883j65706j11558m192k11846p5527J06734
$$ 1020954 1086880 1021923 982625 713742 548036 436478 432286 220440 144913 251647
18655B51647j78490M25685L21939O6946o4149j61710j4384j81678j71767j54406
$$ 251647 73157 498842 820781 887727 823578 661868 647484 465806 294039 139633
18645A39633m6138K18495j91303k22789K8197N24390M17021j72092K6434J38514
$$ 139633 93495 311990 120687 -102102 -73905 450485 867506 695414 721848 860362
18635H60362n1750Q7386K48606J65265K32635J7765K2114o1392m6333L11784K25975
$$ 860362 808612 895998 1144604 1309869 1542504 1560269 1582383 1520991 1474658 1786442 2012417
18624B012417L60107K37766o46133m43335R6306j36280J59049K01906O09725O07440
$$ 2012417 2372524 2610290 1964157 1520822 1617128 1480848 1639897 1841803 2451528 3058968
18614C058968J72784j58587l58105l91044k82488l16759j04457r7271L0289m4002
$$ 3058968 3231752 3073165 2715060 2324016 2041528 1724769 1620312 1523041 1553330 1509328
18604A509328j54130J68162M11104L0581l85379m58300K55199Q7755j23686j63805
$$ 1509328 1355198 1523360 1934464 1965045 1579666 1121366 1376565 1464320 1340634 1176829
18594A176829P8793L99593J12092j04596j41662m73058k59798J29862J45366K84045
$$ 1176829 1255622 1655215 1767307 1662711 1521049 1047991 788193 918055 1063421 1347466
18584A347466L13092K77814N06040K20032L19784M5921K27040j072l13863k5196
$$ 1347466 1660558 1938372 2444412 2664444 2984228 3030149 3257189 3256117 2942254 2917058
18574B917058K36531L28215P04684J44268m85392m56493k48097r352k1114L16254
$$ 2917058 3153589 3481804 4186488 4330756 3845364 3388871 3140774 3131422 3110308 3426562
18564C426562M13172K12202m12748o97901n77588m86470k04514l14835j69917
$$ 3426562 3839734 4051936 3639188 2941287 2363699 1877229 1672715 1357880 1187963
18555A187963m9705k47269p4843j37625K4470L79298J90707r1266L8497J30689
$$ 1187963 1138258 890989 816146 678521 702991 1082289 1272996 1181730 1220227 1350916
18545A350916K15657K73822Q144k606k01745l86064j53826j86792m8224r6285
$$ 1350916 1566573 1840395 1848539 1845933 1644188 1258124 1104298 917506 869282 772997
18535G72997j68862P6352K6961M14121j63507k9388K73966P1670j43351j1472
$$ 772997 604135 680487 707448 1121569 958062 928674 1202640 1274310 1130959 1119487
18525A119487O2470j18089J9541k25698l93302j98680p8283J65081N02134j17266
$$ 1119487 1181957 1063868 1083409 857711 464409 265729 187446 352527 854661 737395
18515G37395l3839j01660K41860j59504M7826l6875O3219k38389k31722Q9016
$$ 737395 703556 601896 843756 684252 732078 695203 758422 520033 288311 377327
18505C77327J94431P7852j17341K71387J23891j89021j65722L5713N20912N46755
$$ 377327 571758 649610 532269 803656 927547 738526 572804 608517 1129429 1676184
18495A676184Q3092j45186K47836P4698j85069l09394k20298M8840n7234k9116
$$ 1676184 1759276 1614090 1861926 1936624 1751555 1442161 1221863 1270703 1213469 1184353
18485A184353n8991J68222j1144n41478l84229m3497J16668K86443J27107J21970
$$ 1184353 1125362 1293584 1282440 740962 356733 313236 429904 716347 843454 965424
18475I65424M5857J69947j33913k87644k0035n1669L78621J50831P7788k4505
$$ 965424 1011281 1181228 1047315 759671 739636 687967 1066588 1217419 1295207 1270702
18465A270702K2769L57830Q7704j90459j48819l0976L2761o1209J06590j05437
$$ 1270702 1293471 1651301 1739005 1548546 1399727 1368751 1401512 1340303 1446893 1341456
18455A341456k85062J42988R0201J15312j74861j88224J52741J88551q2129j0020
$$ 1341456 1056394 1199382 1289583 1404895 1230034 1041810 1194551 1383102 1300973 1290953
18445A290953P9944J91007J42022J90400K24659j90976q5213j62265j34267N3402
$$ 1290953 1370897 1561904 1703926 1894326 2118985 1928009 1842796 1680531 1546264 1599666
18435A599666j29632J02705M33303K30449Q8684j43758o17245l81194J85306J44499
$$ 1599666 1470034 1572739 2006042 2236491 2325175 2181417 1564172 1182978 1368284 1512783
18425A512783K20554L80507J9068j08222m7097J71371J09257k05639K26551O1396
$$ 1512783 1733337 2113844 2132912 2024690 1977593 2148964 2258221 2052582 2279133 2340529
18415B340529K4006K95623J6602k27751j61402l43225J28082M67146P20525J63553
$$ 2340529 2364535 2660158 2676760 2449009 2287607 1944382 2072464 2539610 3260135 3423688
18405C423688k99705m11761m77867j41007k0232J06813m3841L1720J38377K13789
$$ 3423688 3123983 2712222 2234355 2093348 2073116 2179929 2136088 2167808 2306185 2519974
18395B519974L73205J54280k45639J88990K27823M18265R483k12206J49770J15946
$$ 2519974 2893179 3047459 2801820 2990810 3218633 3636898 3646381 3434175 3583945 3699891
18385C699891L89123J90735J67593j41619J18556P41434N88397j25120q6459L88637
$$ 3699891 4089014 4279749 4447342 4305723 4424279 5165713 5754110 5628990 5542531 5931168
18375E931168N97497Q03063J170369R81106J240615J471317K168772K997115N036127
$$ 5931168 6528665 7331728 8502097 9483203 10723818 12195135 14363907 17361022 22397149
18366B2397149Q933071J5590228K2728485J8842160J724324j3734538j8546615
$$ 22397149 31330220 46920448 69648933 88491093 90215417 76480879 57934264
18359E7934264j3901120o745716j096109L886777J0071441J8261732K5795025
$$ 57934264 44033144 37287428 36191319 40078096 50149537 68411269 94206294
18352I4206294K1305909M861061p115623m654619J1352306K0789843M811004j7869816
$$ 94206294 115512203 120373264 113257641 108603022 119955328 140745171 145556175 127686359
18344A27686359l0254596k6517239j5055030o203493O46836Q920133K0412909
$$ 127686359 97431763 70914524 55859494 49656001 50302837 59222970 79635879
18337G9635879L4751908L7696212J1957605k0337167l8131141l5233725k2831910
$$ 79635879 114387787 152083999 164041604 143704437 105573296 70339571 47507661
18330D7507661j2923768p039007m638557k991180k228806j679048j209587j103926
$$ 47507661 34583893 27544886 22906329 19915149 17686343 16007295 14797708 13693782
18322A3693782j002686p36252n98894J10566P37977J202427J548851J052052m06649
$$ 13693782 12691096 11954844 11355950 11466516 12204493 13406920 14955771 16007823 15601174
18313A5601174j354612j537436j001814o27330L5142R46903K069843L209468N544993
$$ 15601174 14246562 12709126 11707312 11079982 11115124 12062027 14131870 17341338 22886331
18304B2886331N933689R99666l637657n569195m300543k047882j541001j149432
$$ 22886331 28820020 29819686 26182029 20612834 16312291 14264409 12723408 11573976
18296A1573976j027097o53760p2650M22845O84832Q90506P47175Q40803O43182
$$ 11573976 10546879 9893119 9820469 10243314 10928146 11818652 12565827 13406630 14049812
18287A4049812N74503R3624L14990J062157J720353K524703L018308L705084N361878
$$ 14049812 14624315 14717939 15032929 16095086 17815439 20340142 23358450 27063534 32425412
18278C2425412P775707J0810140J6138067K7622383M8687651P4784897O8545997
$$ 32425412 40201119 51011259 67149326 94771709 143459360 218244257 286790254
18271B86790254J7744027k2383694k5778565R468194L3824969J393668m2330008
$$ 286790254 304534281 282150587 256372022 265840216 299665185 301058853 258728845
18264B58728845o3382232n2540323k8782563j0168939M133458K1513788M9012175
$$ 258728845 195346613 142806290 114023727 103854788 107988246 129502034 178514209
18257A78514209R1332250J11101365L5455674n4521164j03161329r2208806n6012437
$$ 178514209 269846459 380947824 416403498 361882334 258721005 166512199 110499762
18250A10499762l1827737j8839206j1342275p291540m733994l782954l605150
$$ 110499762 78672025 59832819 48490544 41199004 36465010 32682056 29076906
18243B9076906l411913k582810j779145j369036l59854N00250J307022K915733
$$ 29076906 25664993 23082183 21303038 19934002 19574148 20074398 21381420 24297153
18235B4297153L040302L49112k419451m234773l927081k648732j703464j162243
$$ 24297153 27337455 27686567 25267116 21032343 17105262 14456530 12753066 11590823
18227A1590823q17964n6129N08849N18078k69815j218729j169190q40300l38270
$$ 11590823 10772859 10716730 11225579 11743657 11473842 10255113 9085923 8245623 7907353
18218G907353n32724k58635l97599n62074m62712m67228p18767k01054j52673
$$ 7907353 7374629 7115994 6718395 6156321 5693609 5226381 4507614 4306560 4153887
18209D153887k69640p9385l2105k03588o35606l71455O207j82241r591o1276J59315
$$ 4153887 3884247 3804862 3772757 3569169 2933563 2562108 2568315 2386074 2376483 2315207 2474522
18198B474522L47873L93724j62188j56427M7470J6250k75203k99019J24170K03622
$$ 2474522 2822395 3216119 3053931 2897504 2944974 2961224 2686021 2387002 2511172 2714794
18188B714794l35271k58110J22879j5422j73148k29345j46141n1984J81481K57547
$$ 2714794 2379523 2121413 2244292 2228870 2055722 1826377 1680236 1628252 1809733 2067280
18178B067280J4296q23j87749l08687J41847o4126J50575m6489J09484J34968
$$ 2067280 2081576 2080753 1893004 1584317 1726164 1662038 1812613 1766124 1875608 2010576
18168B010576j6406l7906K12280k00109k53161j80785l67346P7088J0709J71021
$$ 2010576 1994170 1956264 2168544 1968435 1715274 1534489 1167143 1244231 1254940 1425961
18158A425961J50645q5280P3451K26071Q118M3393k01852j44514K00104Q9458
$$ 1425961 1576606 1491326 1564777 1790848 1798966 1842359 1640507 1495993 1696097 1785555
18148A785555k0404N7113L50146J03613K72905K05653k11642M05587J99045Q7859
$$ 1785555 1765151 1822264 2172410 2276023 2548928 2754581 2542939 2948526 3147571 3235430
18138C235430N1383K6915K56129J59288K64774K65565R774J50512M04619K67216
$$ 3235430 3286813 3313728 3569857 3729145 3993919 4259484 4269258 4419770 4824389 5091605
18128E091605L94024O59433P67552Q78554J044833J231004J131101J439664K243373
$$ 5091605 5485629 6145062 6912614 7791168 8836001 10067005 11198106 12637770 14881143
18119A4881143L158735L563079M755005O499504R235619J3708616K3058907M1726817
$$ 14881143 18039878 21602957 26357962 32857466 42093085 55801701 78860608 120587425
18111A20587425P8606034J32731717J30362599J3613431q8336155j30894222j00034419
$$ 120587425 199193459 331925176 462287775 475901206 387565051 256670829 156636410
18104A56636410n5984705l0755717j8243633j1276364p522638n360655l936795
$$ 156636410 100651705 69895988 51652355 40375991 32853353 27492698 23555903
18097B3555903l265891k996046j914261j440969r18768j481681j370338r57469
$$ 23555903 20290012 17293966 15379705 13938736 13019968 11538287 10167949 9210480
18089I210480l67235o12892q69286l76633j28133n36605n42367o373k28650k54268
$$ 9210480 8843245 8230353 7361067 6984434 6856301 6319696 5777329 5770956 5542306 5288038
18079E288038j20205k05056j44325J82228L35148M59690M29001N33459L62232
$$ 5288038 5167833 4962777 4818452 5000680 5335828 5795518 6224519 6757978 7120210
18070G120210J71646M9847j70172l2774j68552j90419k94966Q2524L40478P9549
$$ 7120210 7291856 7341703 7171531 7138757 6970205 6779786 6484820 6567344 6907822 6987371
18060F987371j17763k94835n7354O6655P93313J198341J608783K357914L932039
$$ 6987371 6869608 6574773 6517419 6584074 7377387 8575728 10184511 12542425 16474464
18051A6474464O174988J0187817J4518624J3152105P620982L322254l201162r575027
$$ 16474464 22649452 32837269 47355893 60507998 68128980 71451234 68250072 58675045
18043E8675045j3438807j2865289r235592o073660l981782k843846j717074j206392
$$ 58675045 45236238 32370949 23135357 17061697 13079915 10236069 8518995 7312603
18035G312603q55447l76029n75767l12627j04328j62440R008J20789J86368O60344
$$ 7312603 6457156 6081127 5505360 5192733 5088405 4925965 4934973 5055762 5242130 5902474
18025E902474N76729N22397P96084Q97947Q45668L99663J32209j32536n64495
$$ 5902474 6479203 7001600 7797684 8695631 9541299 9940962 10073171 9940635 9376140
18016I376140n21718n22770K181L26185J76126N08974O55807J102806J493392
$$ 9376140 8854422 8331652 8333833 8660018 8836144 9345118 10000925 11103731 12597123
18007A2597123J997464K624948L643995O096124R665579J6156271K4874715L1090260
$$ 12597123 14594587 17219535 20863530 26959654 36625233 52781504 77656219 108746479
17999A08746479K9394750K1083889Q226319o289482k0482418k9610656k9834924
$$ 108746479 138141229 159225118 167451437 161161955 140679537 111068881 81233957
17992H1233957k4034896j6155076j0135847o682208m860669l204351k506175k087348
$$ 81233957 57199061 41043985 30908138 24225930 19365261 16160910 13654735 11567387
17984A1567387j585063j072221p16224o44815m45070m223K1322R5673J36180J4859
$$ 11567387 9982324 8910103 8193879 7549064 7103994 7099771 7121093 7216766 7352946 7367805
17974G367805K52198N02538P24209M8959l42433q7791l97690o56584n50493k42753
$$ 7367805 7620003 8122541 8846750 8895709 8553276 8465485 8067795 7411211 6860718 6617965
17964F617965j84028R1561M28938L64549K39332M08910Q90339J251149J949104
$$ 6617965 6433937 6525498 6954436 7318985 7558317 7967227 8857566 10108715 12057819
17955A2057819L287249N193713Q214349J3600042K0124254K2343840J5594886
$$ 12057819 15345068 20538781 28753130 42353172 62477426 84821266 100416152
17948A00416152P700272k79806j1094502j9330029k1534422j7194371j1056685
$$ 100416152 108116424 107836618 96742116 77412087 55877665 38683294 27626609
17941B7626609p125277m762103l428395k801975j644911q78506p44990p05888
$$ 27626609 20501332 15739229 12310834 9508859 7863948 6985442 6240452 5534564
17933E534564m10590l50700m62547m52953k17511m30432l78560j74153O2413m7793
$$ 5534564 5123974 4773274 4310727 3857774 3640263 3209831 2831271 2657118 2719531 2671738
17923B671738j20164J94634j03168r9257j5482k44392k0376j85874m14886l42199
$$ 2671738 2551574 2746208 2643040 2543783 2528301 2283909 2263533 2077659 1662773 1320574
17913A320574J42106L48613k27078l57511j78802j05064j5162J64981o8892k27909
$$ 1320574 1462680 1811293 1584215 1226704 1047902 942838 927676 1092657 1023765 795856
17903G95856J46121R7574K43064k98152j02699J35662p3347j55473j66128j75977
$$ 795856 941977 1039551 1282615 984463 881764 1017426 944079 788606 622478 446501
17893D46501k2303K98309J75523k35262k99537k94744j08643k9562K97774J24821
$$ 446501 424198 722507 898030 662768 363231 68487 -40156 -69718 228056 352877
17883C52877l7258Q1830j24299k02528j52713J93604J97196J9230l57627j9949
$$ 352877 315619 397449 273150 70622 -82091 111513 308709 327939 -29688 -49637
17873d9637L18745K4040m6977L53626J64945j38960k85369k90224M9195J34277
$$ -49637 269108 293148 246171 599797 764742 625782 340413 50189 99384 233661
17863B33661K90577J38690k19381j8104K67846k51681k11789K93716r052l1568
$$ 233661 524238 662928 443547 425443 693289 441608 229819 523535 514483 482915
17853D82915J82031M5769O6616R7709j44771n7851k64843r0401J91308J55110
$$ 482915 664946 710715 777331 875040 730269 672418 407575 317174 508482 663592
17843F63592J1301P4339m61470k54249Q0019J37540n2125N5861J15831p1424M8956
$$ 663592 674893 749232 287762 33513 113532 251072 198947 254808 370639 299215 348171
17832C48171j8558q1417L1101r2870R233j37071M4769J65499k12289L24947O45229
$$ 348171 329613 248196 279297 186427 195660 58589 103358 268857 56568 381515 1026744
17821A026744K39375K1872j73917l05546k18249M2378P6429J53996J00829m8726
$$ 1026744 1266119 1287991 1114074 808528 590279 632657 709086 863082 963911 915185
17811I15185p3661j09196j20479Q1113k9377k9958J77835Q0883K99291l2242k39155
$$ 915185 841524 732328 611849 692962 663585 633627 811462 892345 1191636 1159394 920239
17800I20239J0913J97973Q1806l38860j90483j9405O5379O1148k07913J5850J09717
$$ 920239 931152 1129125 1210931 872071 681588 662183 727562 788710 580797 596647 706364
17789G06364L94449K22892O5254k52992n93988k74758K8652L89495K87593J74941
$$ 706364 1100813 1323705 1388959 1135967 541979 267221 295873 685368 972961 1147902
17779A147902J04431L53661M43814o5022l8803j28698k23801k27237k6566L67043
$$ 1147902 1252333 1605994 2049808 1984786 1945983 1817285 1593484 1366247 1339681 1706724
17769A706724K83740K29879N32642K90311k93665k36389r3994N63236L35948j86730
$$ 1706724 1990464 2220343 2752985 3043296 2749631 2513242 2419248 2982484 3318432 3131702
17759C131702P2174P6521J30826L45857K22629M21176K35202L59372J53411K80366
$$ 3131702 3203876 3280397 3411223 3757080 3979709 4400885 4636087 4995459 5148870 5429236
17749E429236K83541N75156J063634Q33842J268641J769578K302936L960655O502516
$$ 5429236 5712777 6287933 7351567 8185409 9454050 11223628 13526564 17487219 23989735
17740B3989735J0279816J5567770J5060424N480213m129413p604828k157455P462507
$$ 23989735 34269551 49837321 64897745 70377958 66248545 58643717 56486262 63948769
17732F3948769J4615750J1617337L118609n4217L224667J487833o884939j2843855
$$ 63948769 78564519 90181856 93300465 93246248 96470915 97958748 91073809 78229954
17724G8229954j0845065j592560Q674357J0086527l01867j2574304j8137044j5360111
$$ 78229954 67384889 65792329 74466686 84553213 84251346 71677042 53539998 38179887
17716C8179887r483073n646569l668492k832002k078721j247995o45134p22487
$$ 38179887 28696814 23050245 19381753 16549751 14471030 13223035 12577901 11855414
17708A1855414n98824k49817l3797j91793m11538o19845m97000k69099j91791
$$ 11855414 11256590 11006773 10972976 10781183 10369645 9749800 9252800 8983701 8791910
17699H791910l39116k10077O30177J035395J401489K376985L640550N706448R331686
$$ 8791910 8452794 8242717 8872894 9908289 11309778 13686763 17327313 23033761 32365447
17690C2365447J1833395P152253r97746n639600m282814J612948Q366860R815610
$$ 32365447 44198842 51351095 50353349 44713749 40430935 42043883 50410743 60226353
17682F0226353N037508J744157L187451M600687j790792q877998j0812513n383230
$$ 60226353 65263861 67008018 70195469 74796156 73005364 64127366 53314853 47931623
17674D7931623K814629Q427429M471739n204411j1933829j2731891r199652n576840
$$ 47931623 50746252 59173681 63645420 58441009 46507180 33775289 24575637 18998797
17666A8998797l358502k259521j329384n67090p95836q86174o07904j39797m51921
$$ 18998797 15640295 13380774 12051390 11484300 10688464 9802290 9194386 9054589 8602668
17657H602668n24863n23549k65720j05069k84815k07774o17604m97017m27418
$$ 8602668 8077805 7554256 7288536 7183467 6898652 6690878 6073274 5576257 5148839
17648E148839p01045n10250j25128m85115l16294K1666j51098M4732j82705m02883
$$ 5148839 4447794 3937544 3812416 3327301 3011007 3032673 2881575 2926307 2743602 2340719
17638B340719M2837M6881J52049j83992j75649q3731J22898J65857K16667o0723
$$ 2340719 2383556 2430437 2582486 2398494 2222845 2139114 2262012 2427869 2644536 2583813
17628B583813o6347R9269K47672Q5362l6229J2313K96691K02396m1369K0028k22350
$$ 2583813 2517466 2616735 2864407 2949769 2913540 2925853 3222544 3424940 3383571 3403599 3181249
17617C181249k35322K51438O20874N67427L64196L91468O68925M91526J27684
$$ 3181249 2945927 3197365 3818239 4385666 4749862 5141330 5810255 6301781 6429465
17608F429465K7523J09452M98349Q19669J123100J193297Q76463Q88944J369063
$$ 6429465 6456988 6566440 7064789 7884458 9007558 10200855 11077318 11966262 13335325
17599A3335325K393585L784297N829446J0024860J5822625K0027351J6746930
$$ 13335325 15728910 19513207 25342653 35367513 51190138 71217489 87964419
17592H7964419J0659970M976176l666153j1633893j5263215j1822781l718676
$$ 87964419 98624389 103600565 99934412 88300519 73037304 61214523 57495847
17585E7495847M736271J3044852J6853077J4488822J4038287J4604870J1252906
$$ 57495847 62232118 75276970 92130047 106618869 120657156 135262026 146514932
17578A46514932J948289o054934q395176j3228053j8568349j9869244j5148359
$$ 146514932 148463221 142408287 134013111 120785058 102216709 82347465 67199106
17571F7199106o414817K572945J1023181J2978758P409012K181200m176414j1850654
$$ 67199106 60784289 63357234 74380415 87359173 94768185 96949385 92772971 80922317
17563H0922317j6235439j6038956j2509617q325885n002572l437410k473618k337710
$$ 80922317 64686878 48647922 36138305 27812420 22809848 19372438 16898820 14561110
17555A4561110j679092j534985j450636j188972n97117k65868m34736l45083l67962
$$ 14561110 12882018 11347033 9896397 8707425 8110308 7844440 7409704 7064621 6696659
17546F696659q1287m6613n38816o84473p07385l84630j42321k10952k53466m13075
$$ 6696659 6615372 6568759 6029943 5345470 4638085 4253455 4111134 3900182 3646716 3233641
17536C233641k72366m2134Q5011k45769n7293j09070j04366J46354k5424K83653
$$ 3233641 2961275 2919141 3004152 2758383 2701090 2592020 2487654 2634008 2608584 2892237
17526B892237M31031K05895P3114J21919K32649l97348k90221k79813n23690j58378
$$ 2892237 3323268 3529163 3602277 3724196 3956845 3559497 3269276 2989463 2465773 2307395
17516B307395J75840M48653O08912M75518J94009O6105Q8237j38110o6843m95176
$$ 2307395 2483235 2931888 3540800 4016318 4210327 4276432 4364669 4226559 4159716 3664540
17506C664540o00820p12919j63441k19796j99229M66350O08708L06506J56321
$$ 3664540 3063720 2350801 2187360 1967564 1768335 2234685 2843393 3149899 3306220
17497C306220j20002n48478n09556m10342k11731l6737L63410K13827J98010k66628
$$ 3306220 3186218 2637740 2128184 1717842 1506111 1469374 1832784 2046611 2244621 1977993
17487A977993l57547o30842r4468Q2279k78079k22013l0693J56622n4045j79008
$$ 1977993 1620446 989604 895136 977415 699336 477323 446630 603252 549207 370199
17477C70199J18155j17233j3302p0996j75043j57454o9356Q9400j17398o6750
$$ 370199 488354 371121 357819 286823 111780 -45674 -115030 -25630 -143028 -209778
17467b09778Q0903K89309K6737j93028P1458k7313o6985m5196J47474O4442K86704
$$ -209778 -128875 160434 187171 -5857 65601 38288 -28697 -73893 73581 138023 424727
17456D24727J02760j3244l3486k07460k3235j4673k77861P5889M97866M38936
$$ 424727 527487 514243 480757 273297 250062 235389 -42472 33417 531283 970219
17446I70219j4974N2920P02239J133840J68128m09723m47992r20172n04229k22188
$$ 970219 955245 1008165 1710404 2844244 3012372 2602649 2154657 1234485 730256 508068
17436E08068l62617j30445J05714j47803J93034J93990q4361J59071o8678k29827
$$ 508068 145451 15006 120720 -27083 165951 359941 275580 434651 365973 136146
17426A36146q8979k9731J4693J32373J02825J9908J10266j2685k5835P8162J23906
$$ 136146 47167 17436 32129 164502 267327 287235 397501 384816 358981 437143 561049
17415E61049j2967P6285k21476J491k9244j84326k05300L36772R5171m31187j92921
$$ 561049 548082 624367 402891 404382 375138 190812 -14488 322284 417455 -13732 -206653
17404b06653o6191k27258K66865L0388j69925j97703L16469M30511l75918k08329
$$ -206653 -272844 -500102 -233237 -202849 -372774 -570477 -254008 176503 -199415 -407744
17394d07744j2812Q2293L79085L1751L4034j06190J20184J74243M8259j86848
$$ -407744 -420556 -338263 40822 72573 106607 417 120601 294844 343103 156255
17384A56255l65503l3370M7453r0464K413r3914Q3952L54107J88893m7488O4311
$$ 156255 -209248 -242618 -195165 -285629 -283216 -377130 -293178 60929 249822 202334 266645
17373B66645Q5337j99865k93799j32828K21722M9015m0683k31988k61529K63496
$$ 266645 351982 152117 -141682 -274510 -52788 -3773 -44456 -276444 -537973 -274477
17363b74477L75403m8936k34621q8869K12959J77227J59737p5415j25955J48354
$$ -274477 100926 51990 -182631 -271500 -58541 118686 278423 203008 77053 225407
17353B25407J21304o7584L0210J677l26451k5633k6675J69460J76055l86769j63793
$$ 225407 346711 279127 309337 311014 -15437 -41070 -67745 101715 277770 -108999 -272792
17342b72792j0399J03810j6176M76725K04464r5564j20765K35557p2183j33426
$$ -272792 -283191 -179381 -195557 281168 485632 390068 269303 504860 432677 299251
17332B99251k26337J91366J74113j37421J69180J8406l6363J36707J8078J14234
$$ 299251 72914 264280 438393 300972 470152 488558 452195 588902 606980 721214
17322G21214k758l64083m8100J88816j51959k58429j95670j42578J26796M8105
$$ 721214 718456 354373 306273 495089 343130 84701 -110969 -253547 -126751 -78646
17312g8646o7762Q6945j86961k10148R0889L74711L50479L4661k44241r5791j6301
$$ -78646 -146408 -59463 -246424 -456572 -365683 9028 359507 394168 149927 54136 37835
17301C7835m9469J10271J73918r0684k81506j27079j81497K91214J85313N5344
$$ 37835 -11634 98637 272555 181871 -99635 -226714 -408211 -116997 68316 123660
17291A23660K04403j38800J0466j78647r916n840j36234Q3240K95968O2008l771
$$ 123660 328063 189263 199729 21082 11166 5326 -130908 -47668 248300 310308 306537
17280C06537j68066j35904L0222K88593r5810m81729J31668K99096M7396K838
$$ 306537 138471 2567 32789 321382 225572 -256157 -124489 174607 222003 224841
17270B24841J16459p9312j99136l80644k55373J14165N68274J73123j88598P4315
$$ 224841 341300 261988 62852 -317792 -573165 -459000 109274 282397 93799 168114
17260A68114J05517j64606j31107Q3050P4086j28974L41473J14965j40810l09160
$$ 168114 273631 109025 -22082 60968 135054 6080 347553 462518 321708 12548
17250A2548o3376R6450K51514J5899L6600k6583O8947K4036k11659n923L1165
$$ 12548 -50828 45622 297136 313035 349635 323052 391999 416035 204376 198453 229618
17239B29618k30838K32531K58057N02276P4449N0905j29399k69595K66912J34887
$$ 229618 -1220 231311 489368 991644 1066093 1116998 987599 718004 984916 1119803
17229A119803P8259J34280J62353J55222j13195j69029r1447k58311J99969L07832
$$ 1119803 1198062 1332342 1494695 1649917 1536722 1367693 1276246 1017935 1217904 1525736
17219A525736K75692Q4329k89867l30979j96273O496M23937K44691j35839j33984
$$ 1525736 1801428 1885757 1595890 1264911 1068638 1075134 1499071 1743762 1607923 1473939
17209A473939j15596K18837L43096L32304L80490J03589l51282l62719Q615K64052
$$ 1473939 1358343 1577180 1920276 2252580 2633070 2736659 2385377 2022658 2031273 2295325
17199B295325J86185k18050j87928l30007r8628j8206L70811J74923K9196K34680
$$ 2295325 2481510 2263460 2075532 1745525 1646897 1628691 1999502 2174425 2203621 2438301
17189B438301j5515j03877p2815J82295O55228M85364j49906l70314l36700k23734
$$ 2438301 2422786 2318909 2246094 2428389 3083617 3568981 3419075 3048761 2712061 2488327
17179B488327Q2948K73409K26651P5020j06656O9226j18583K11543K66512M31435
$$ 2488327 2571275 2844684 3071335 3146355 3039699 3108925 2990342 3201885 3468397 3899832
17169C899832J32619R8538l78379R3003O88524P74607N82686J298673J380254
$$ 3899832 4032451 4130989 3752610 3845613 4534137 5308744 5891430 7190103 8570357
17160H570357J206494J933534L781680O092145R489807J3980259J6031051Q728347
$$ 8570357 9776851 11710385 15492065 21584210 31074017 45054276 61085327 69813674
17152F9813674k108065q015060n459356J693590Q832613Q330327j077529r809618
$$ 69813674 67705609 59690549 54231193 55924783 64757396 73087723 72010194 62200576
17144F2200576j2373862q603289k386290M053692J0048578J2493451N527225m052897
$$ 62200576 49826714 41223425 38837135 42890827 52939405 65432856 70960081 66907184
17136F6907184q573037n978742J623418P762873N835579l251538j1141259j3825347
$$ 66907184 58334147 52355405 53978823 61741696 67577275 64325737 53184478 39359131
17128C9359131j1248619p178444m529536l013685j953823r21485q81808o65677
$$ 39359131 28110512 20932068 16402532 13388847 11435024 10513539 9631731 8966054
17120H966054m66472n38165l24516j47228j1903M09963L63954J1375L97573N03367
$$ 8966054 8499582 7961417 7636901 7489673 7477770 7887733 8251687 8263062 8660635 9164002
17110I164002J041593K219793L200934M716819P933142J2352159J4232998Q106739
$$ 9164002 10205595 12425388 15626322 20343141 28276283 40628442 54861440 62968179
17102F2968179j814013p177122n619541J170112P782371P304693m31847q556183
$$ 62968179 61154166 53977044 48357503 49527615 57309986 64614679 64182832 55626649
17094E5626649j1252349p600009k329503L396901Q974212J1506359N369773l493344
$$ 55626649 44374300 36774291 34444788 37841689 46815901 58322260 63692033 60198689
17086F0198689q167085o031971R79297O951557N671720k650043r818653j2166565
$$ 60198689 52031604 45999633 46978930 53930487 59602207 56952164 47133511 34966946
17078C4966946r885097o422921m114165k705077k149636j706799j215751r08186
$$ 34966946 25081849 18658928 14544763 11839686 9690050 7983251 6767500 5859314
17070E859314p83386o67599l82936k02883k19717J308r3377k76450j88358j5853
$$ 5859314 5075928 4408329 4025393 3822510 3602793 3604101 3510724 3234274 3045916 3030063
17060C030063k53023m58744P633j86510l96309k72953n66780l0832p1678r4848
$$ 3030063 2777040 2318296 2325929 2139419 1743110 1470157 903377 872545 800867 706019
17050G06019p5176J10623L3308o1394j42128j9384R5676K71863N1991j96106k00651
$$ 706019 630843 741466 774774 713380 571252 551868 647544 919407 971398 775292 574641
17039E74641r4746J77524l0236o8949j6578j01134j14992j56510l60017Q0755
$$ 574641 479895 657419 627183 558234 541656 440522 325530 169020 -190997 -110242
17029a10242Q0521J4565K05789O6737K548l1700m8497j52319j04337j71081J43233
$$ -110242 -29721 -15156 190633 257370 259918 228218 179721 27402 -76935 -248016 -104783
17018a04783J55398k5502J46182J2945J19031O1689M7123j74241k06996J81148
$$ -104783 50615 25113 171295 184240 303271 364960 412083 237842 30846 211994
17008B11994N9697q9438j25420K2033J03857j97736j73593J65595j16652J1658
$$ 211994 271691 182253 56833 78866 182723 -15013 -188606 -23011 -139663 -128005
16998a28005J89277N4933J8761j00446k62301O0794J49029L24793L13211m874
$$ -128005 61272 116205 134966 34520 -227781 -166987 -17958 306835 620046 615172
16988F15172k83216l28268K9859K38374j80774j87014J549K41294j8336n0636
$$ 615172 331956 3688 33547 271921 91147 -95867 -94318 146976 128640 78004
16978G8004j29196j55247J33430J81722J65839j31841M7691K14906p9144Q9966
$$ 78004 -51192 -206439 -73009 108713 274552 142711 190402 405308 326164 416130
16968D16130o2404l75470k32405P0625K489K15644J14340o132N974j29692j2080
$$ 416130 353726 -21744 -254149 -183524 -181035 34609 148949 142817 148791 19099 7019
16957G019J96763j53814K4191Q2503j06463k89225N0711J99059K9429J18477l21002
$$ 7019 203782 49968 74159 156662 50199 -239026 -188315 10744 40173 158650 -162352
16946a62352l37261j2093J46176K53224J85898R2222P9641Q9725R9846P5205j98299
$$ -162352 -499613 -511706 -365530 -112306 73592 165814 245455 335180 435026 510231 311932
16935C11932k61274o7733j95996J50318N6972p5633R859L63862k83162k17535
$$ 311932 50658 -17075 -213071 -62753 -5781 -81414 -71555 292307 9145 -208390
16925b08390j4616J19596K04170k3933K2453J34941J22830j22583j59732j61569
$$ -208390 -223006 -103410 100760 76827 99280 234221 357051 234468 74736 -86833
16915h6833R7603L2938l6410M2656j36870K31946j31213p5058j34661M3268K06176
$$ -86833 10770 43708 7298 49954 -86916 145030 13817 -61241 -195902 -152634 53542
16904E3542m8379o7343J61000n9645o6788n2948r9110j18253k5580L22332K45798
$$ 53542 5163 -62180 98820 39175 -27613 -80561 -179671 -297924 -323504 -1172 244626
16893B44626l36838K14272J59611k71326j05310j64119R7218r6642k38662J70496
$$ 244626 -92212 122060 281671 10345 -94965 -259084 -161866 -258508 -497170 -326674
16883c26674j95515j54676K33607K11341L32059r0258J16240r2800j46350K46431
$$ -326674 -522189 -676865 -443258 -231917 100142 9884 126124 33324 -113026 133405
16873A33405j23781p2726j56655J47625j9298l38635k15471M70418K03813K19080
$$ 133405 9624 -63102 -219757 -72132 -91430 -430065 -645536 -175118 28695 247775
16863B47775K33578j78199n8413R7106K7440M0809j01248n9501j74476M0237J1227
$$ 247775 481353 303154 244741 341847 369287 410096 308848 249347 74871 115108 126335
16852A26335O6978r522K5384J63636j19232j71057k4272k16374q8619j8072J26622
$$ 126335 193313 183791 209175 372811 253579 82522 58250 -158124 -246743 -264815 -138193
16841a38193Q6979j04576k51150r349J78498N4936r9180j34927k17352K36948
$$ -138193 -51214 -155790 -406940 -416289 -237791 -182855 -282035 -416962 -634314 -397366
16831c97366R5113J88663j10617j54650L02826J91058k22732k20005j37506p9248
$$ -397366 -302253 -113590 -224207 -378857 -76031 115027 -107705 -327710 -465216 -544464
16821e44464K54417J84595Q9032K1312R5681j61066l42772j82519J14143J0024
$$ -544464 -290047 -105452 -16420 4892 100573 -60493 -403265 -585784 -471641 -461617
16811d61617k7308L28652r2290k21455K29424K76283k32514M2373L33362j70685
$$ -461617 -488925 -160273 -252563 -474018 -244594 31689 -200825 -158452 174910 4225
16801D225k89766r4322L82343l4594j77989K0315n7151J13197k3855q9797j12048
$$ 4225 -285541 -379863 2480 -32114 -210103 -189788 -246939 -133742 -157597 -247394 -359442
16790c59442K24396j49453p0277P8839j62743n2476O1767J7145Q5949o174j23314
$$ -359442 -135046 -284499 -354776 -275937 -438680 -491156 -429389 -412244 -326295 -332469 -455783
16779d55783o7919K14550K33022K06651q6820J06532J29431q0395Q3819k04226
$$ -455783 -523702 -309152 -76130 130521 43701 150233 279664 199269 283088 78862
16769G8862l92220N0983l1515p6382K8002N4184O53509L30076j86798l78095k86439
$$ 78862 -313358 -262375 -293890 -370272 -342270 -288086 365423 695499 508701 130606 -155833
16758a55833j70242k48824J94116j27211L03513K70188J38950j61672k5558J34697
$$ -155833 -326075 -574899 -380783 -507994 -204481 65707 204657 42985 17427 152124
16748A52124K28118M1948j2656K9910k05991n4713j9144J32194P7522k54166j26305
$$ 152124 380242 422190 409534 439444 233453 178740 159596 291790 369312 115146 -11159
16737a1159l7148k99913p7483J48561J31359L6412J68654r2638j53747J64512
$$ -11159 -48307 -348220 -425703 -277142 -145783 -109371 59283 -33355 -187102 -22590
16727b2590J67134k39430m5467r6443m6056N3507l74452J62005J77598K05323
$$ -22590 144544 -94886 -140353 -236796 -282852 -229345 -603797 -441792 -264194 -58871
16717e8871l847o3062j93252J22347L73032L38253k57727m64226J19595J06335
$$ -58871 -62718 -125780 -319032 -196685 176347 514600 256873 -207353 -87758 18577
16707A8577n2934j56250p8635L66190J54905P2312q7171m00843j62429m503K56570
$$ 18577 -34357 -190607 -269242 96948 251853 324165 236994 -163849 -326278 -330781 -74211
16696g4211j47182l65714j06791m116M3911K73201N1628k0077j59938m1271j22482
$$ -74211 -221393 -587107 -693898 -698014 -654103 -380902 -329274 -349351 -509289 -550560 -673042
16685f73042L55900L63153o0198M2583K14787j77154k66938j5461K49461Q4938
$$ -673042 -317142 46011 -14187 28396 243183 66029 -200909 -216370 33091 118029
16675A18029j97675k58103k10748p725L48796J92574k96071k99184J58418M39306
$$ 118029 -79646 -337749 -548497 -556222 -207426 -14852 -310923 -610107 -451689 -12383
16665a2383o3389L5657J26464Q6814k61216l06225K08412J74841r5962J4327K55230
$$ -12383 -75772 -40115 86349 173163 -88053 -394278 -185866 -11025 -106987 -92660 162570
16654A62570J67804J30568j4379J693j60809k21637K07168J94827j19771l45025
$$ 162570 330374 460942 446563 448256 287447 65810 272978 467805 348034 3009
16644C009l03565M4196P0029j64457J50002L80959J62596O1023r0835j27935L76130
$$ 3009 -300556 -256360 -186331 -350788 -200786 180173 342769 403792 312957 185022 561152
16633E61152j1836J04425Q1071p9266j30580l71923j24821R869R309j32090j4479
$$ 561152 549316 653741 734812 655546 524966 153043 28222 38091 47400 -84690 -99169
16622i9169k74445k14360J18551K34873j17759J19314J46242j06690n560L1467
$$ -99169 -373614 -587974 -469423 -234550 -352309 -232995 -86753 -193443 -199003 -167536
16612a67536m09755j91916J0635J35562K8716K66903N38128J83799l12372M5764
$$ -167536 -577291 -769207 -758572 -623010 -594294 -327391 210737 394536 82164 127928
16602A27928J77035N721r1702L64750R9234l27550k98690o3415J39763m1033k33373
$$ 127928 304963 310684 218982 583732 682966 355416 56726 -6689 133074 92041 -141332
16591a41332l01083K45135L27571K53661j29598k05143k3197r6923M4823J89782
$$ -141332 -442415 -197280 130291 383952 254354 49211 26014 -70909 -26086 163696
16581A63696K4981k7137L7047l12183p7687R4114K50318J38346j77474M8248k30730
$$ 163696 188677 161540 198587 -113596 -191283 -97169 153149 291495 114021 162269 -68461
16570f8461k14779R9707o617j39008n3410J87351J05203J00307l23823m7511M1163
$$ -68461 -283240 -183533 -190150 -329158 -382568 -195217 -90014 10293 -313530 -361041 -319878
16559c19878K01909N7646o3696M532O7857l15020n9733j09895M8499J1354R8606
$$ -319878 -117969 -60323 -124019 -119487 -51630 -366650 -426383 -536278 -487779 -476425 -377819
16548c77819J71613k1980n2805q3191Q1304K76478L0883J31995J79602k90782
$$ -377819 -206206 -228186 -280991 -364182 -282878 -6400 24483 156478 336080 45298
16538D5298k78899p6665Q9737k13454r4300K02034L4568J75218J03852P5760l6194
$$ 45298 -233601 -310266 -220529 -433983 -528283 -326249 -291681 -116463 -12611 63149 26955
16527B6955K7447j37827J76140M17167K56058j46925l58640l28139m4937J03534
$$ 26955 54402 -83425 92715 509882 765940 619015 260375 -67764 -112701 -9167
16517i167j47684l21691k85197J03723L334n4512J33092K08737K74450J5456k06487
$$ -9167 -156851 -478542 -763739 -660016 -656682 -711194 -578102 -369365 -94915 -79459 -285946
16506b85946j39557K0552N9076K74914J7253m90638j41185M09553J53040N5248
$$ -285946 -425503 -404951 -345875 -70961 -53708 -544346 -685531 -275978 -122938 -67690
16496f7690J09163j50366m3068J42078K07276j71307j74207k22497J08483j13571
$$ -67690 41473 -108893 -151961 -9883 197393 26086 -148121 -370618 -262135 -375706
16486c75706J99151M48171J40249j38411j52578j03736J89793j3910m4412j62213
$$ -375706 -176555 271616 411865 273454 120876 17140 206933 193023 148611 -13602
16476a3602l4886J87952K16340p9227j61623l6658j59099k27611J08385R5265
$$ -13602 -48488 139464 355804 276577 114954 78296 -80803 -308414 -200029 -104764
16466a04764p6714J00724L31756J80721k71328l53996J09465J02443K84948j63926
$$ -104764 -181478 -80754 251002 431723 160395 -193601 -84136 18307 303255 139329
16456A39329k20314l29810P9709J60213j18927R6268J71760M1073l622l7688J4440
$$ 139329 -80985 -410795 -331086 -170873 -289800 -193532 -21772 19301 15679 -22009 -7569
16445g569J76607o4397K00010K62987j16008m32131J09671Q0927q9210N4168l55141
$$ -7569 169038 104641 304651 567638 451630 19499 129170 210097 120887 175055 -180086
16434a80086l13067K5111J19590K0237J35121M48538p1082k42860m6451j61000
$$ -180086 -493153 -468042 -348452 -328215 -193094 255444 184362 -58498 -104949 -265949
16424b65949o6635R2627o7110q0027K25254K30454J24198J3570k89934J44103
$$ -265949 -332584 -239957 -307067 -387094 -161840 68614 192812 206382 -83552 60551
16414F0551o838j57855M2234L4676K67233O3972l35263k00370J66207P6011j28914
$$ 60551 53713 -104142 -61908 -27232 240001 303973 -31290 -231660 -65453 10558 -118356
16403a18356L9710r2646N245L99204J72815j49366J06638m01484m55157j0809
$$ -118356 -78646 -171292 -166047 233157 405972 256606 363244 -38240 -493397 -504206
16393e04206J44520L86869K8125l47959K12291K40566M7622J38710O3991r2777
$$ -504206 -359686 27183 55308 -292651 -80360 160206 207828 346538 410529 317752
16383C17752j81722l0623k8559r211J41786r8074M9626J6675k12836K39826l06014
$$ 317752 136030 105407 76848 67637 209423 111349 160975 177650 -35186 204640 -101374
16372a01374j43665J11260k4052J1402J44585R8585J48275N9839k3081j37262
$$ -101374 -245039 -133779 -157831 -146429 -1844 96741 245016 304855 281774 144512
16362A44512m04350j03864K03811j8020P4813j8192k42636j86506j95354N74960
$$ 144512 -259838 -363702 -159891 -177911 -103098 -121290 -363926 -550432 -745786 -170826
16352a70826M12040k3209L8790k47644k01007o7104J25335J99321l8332j37955
$$ -170826 241214 218005 256795 9151 -191856 -258960 -133625 65696 27364 -110591
16342a10591k94465j13075K32164K61211j5292M9660J01064J43107L4633l14068
$$ -110591 -405056 -518131 -285967 -24756 -40048 9612 110676 253783 288416 -25652
16332b5652l72908j32271L83983L94397M8943j64152Q1456K5236j22590j43913
$$ -25652 -398560 -530831 -146848 247549 296492 132340 213796 239032 116442 -27471
16322b7471j67931J2245p2149j0767J14838K43117P196p0040j93058K4360J55278
$$ -27471 -195402 -183157 -255306 -266073 -151235 91882 99078 29038 -164020 -139660 15618
16311A5618l1424l15606R1014J77798p5520j19124n0442J33384K6953l7698r7716
$$ 15618 -15806 -331412 -240398 -62600 -138120 -257244 -307686 -174302 -147349 -185047 -282763
16300b82763L5924L44363J77959q4271R9195M75658K8258k45801k31401p5806
$$ -282763 -246839 97524 275483 191212 290407 766065 794323 548522 317121 241315
16290B41315K6109j76896m1880J8778J09108k49300k83727q7762q8985K23841
$$ 241315 267424 90528 48648 67426 176534 -72766 -356493 -444255 -533240 -309399
16280c09399K41501J3899J11737r5040p8311Q9769J48652j3755k66399m5020o4978
$$ -309399 -67898 -53999 57738 -37302 -115613 -25844 122808 109053 -157346 -202366 -267344
16269b67344M8890J69744P8867J57157k0176j7671j15635k37450k4419k89599
$$ -267344 -218454 -48710 30157 187314 167138 149467 33832 -203618 -228037 -517636
16259e17636l66248J68767J94543L01759J5548j35914L6668R990K19199K7267
$$ -517636 -883884 -715117 -520574 -218815 -203267 -339181 -302513 -292523 -73324 -46057
16249d6057N8923q7199j70194l0483M61980k02276l92585P3199J8779J09391J20622
$$ -46057 12866 -74333 -244527 -275010 186970 -15306 -407891 -334692 -315913 -206522 -85900
16238h5900M7788r8586J75943k79893j84933R1072j81671K4428K30152j41518
$$ -85900 -38112 -136698 39245 -240648 -425581 -334509 -516180 -491752 -261600 -403118
16228d03118j4533R1718M2235J07499L16944J13382P2509k65167j63336J58745
$$ -403118 -417651 -325933 -283698 -176199 140745 254127 326636 61469 -101867 56878
16218E6878L45263J12750j90658l72354j43752J53225R9041J18855m11664l327
$$ 56878 402141 514891 324233 -48121 -191873 -38648 60393 179248 -232416 -235743
16208b35743J28873k75734k18453J98806j70065J57623J43389K48887k35187J68935
$$ -235743 -106870 -382604 -601057 -402251 -572316 -414693 -271304 -22417 -257604 -88669
16198h8669J55669O4568j02127k6867K11348n9341k95679k08121K46204N14585
$$ -88669 67000 131568 29441 2574 213922 154581 -141098 -349219 -103015 411570
16188D11570m5975J1567j16844j47806l13327J2890j0785j08294r7635j26845
$$ 411570 365595 377162 260318 112512 -200815 -187925 -198710 -307004 -404639 -531484
16178e31484J43391J54506N9014M2857j39415j56465j78238L5773M28700J29499
$$ -531484 -388093 -233587 -174573 -131716 -271131 -427596 -605834 -570061 -141361 -11862
16168a1862O3041l10359r4162J35580J31983L9112M9826j05090l1381L16490L85634
$$ -11862 51179 -259180 -353342 -217762 -85779 -46667 3159 -101931 -133312 183178 568812
16157E68812j29524l54412j38932m521Q0895l25399o861M4803K43563M8802J60109
$$ 568812 439288 84876 -54056 -58577 22318 -303081 -309942 -265139 -21576 27226 187335
16146A87335l817j96552M7529n3790j68935K30532N0266L1810j72804j56177L00588
$$ 187335 183518 -13034 34495 -19295 -188230 42302 92568 124378 -48426 -204603 95985
16135I5985K58310k04001J41012k7147l28591K3454R4113J85245J01135j93151
$$ 95985 354295 150294 291306 264159 -64432 -40978 53135 238380 339515 146364
16125A46364L9460l08236j95129P9641r1680N9537j2296j13838o4536n8675R5901
$$ 146364 185824 -122412 -317541 -237900 -329580 -270043 -282339 -396177 -460713 -519388 -423487
16114d23487L58077J11651J7353J95925K05490k3084k63072k5215r607o3971m00129
$$ -423487 -65410 46241 63594 259519 465009 441925 178853 153638 144031 80060 -320069
16103c20069J33250l07208m34367J69226L94637L34420q963r7598K06710J14766
$$ -320069 -186819 -494027 -928394 -759168 -364531 -30111 -39074 -136672 70038 184804
16093A84804o8741k91310j79396r1397M30368K5637k30873l56118q9805J7595
$$ 184804 116063 -175247 -354643 -446040 -15672 9965 -220908 -577026 -666831 -649236
16083f49236k72474N5206M58965J01247j07232J193q3008l0311L23227J99231
$$ -649236 -921710 -866504 -407539 -306292 -413524 -412331 -495339 -525650 -202423 -3192
16073c192j91821j63230O0684K54396K52352L9340J38165j0100l6153J81044n7788
$$ -3192 -195013 -358243 -297559 -43163 209189 248529 386694 376594 340441 521485 463697
16062D63697k41208k02729J10149k11953p2610J79290m788K44853J13572l14957
$$ 463697 222489 19760 129909 -82044 -154654 24636 19848 264701 378273 63316
16052F3316k58482j20734K50718P0840j48643M30814J63207j56549k67782n2951
$$ 63316 -195166 -315900 -65182 5658 -142985 287829 451036 294487 26705 -26246
16042b6246j52523j21773J20731j01993m225m2129Q2563J67805N5703L3250P5525
$$ -26246 -178769 -300542 -179811 -281804 -286029 -328158 -245595 -77790 -22087 11163 86688
16031H6688M8028j13830k43855l5160L5619J10091m9268j18730K30703K38961
$$ 86688 134716 20886 -222969 -258129 -222510 -112419 -161687 -280417 -49714 189247
16021A89247j51842j78657r1729K55298l9060J64732j2540R0017l4763J03515
$$ 189247 37405 -141252 -232981 22317 -16743 147989 135449 225466 190703 294218
16011B94218k1886K55783J00982L2730j04341P8453l53093j82446J30551l18301
$$ 294218 272332 528115 629097 661827 557486 635939 282846 100400 230951 -87350
16001h7350l51722O33j9182M6808J03736m3941K21259M5440K29850J19070k55857
$$ -87350 -439072 -438439 -457621 -410813 -307077 -351018 -129759 -84319 145531 264601 8744
15990H744j52394m29461M6333M28703K65612j66410j21849K34480L35163J33462
$$ 8744 -143650 -573111 -526778 -98075 167537 1127 -120722 113758 448921 582383
15980E82383j57725k46847k28241j53601j15960l9806N8506K39598k7831k64101
$$ 582383 424658 177811 -50430 -204031 -319991 -359797 -301291 -61693 -89524 -353625
15970c53625M8680J07230L8618j01351N4538J61709m0428J91721M15746q0131
$$ -353625 -304945 -197715 -159097 -260448 -205910 -44201 -84629 107092 522838 442707
15960D42707l21669k51907j46412m417r5627j45949j51709J88814L85919J07774
$$ 442707 121038 -130869 -277281 -281698 -377325 -523274 -674983 -486169 -100250 7524
15950G524m9223n8595J34127J39066J12271l14902k0127k9042j56268j33634M270
$$ 7524 -41699 -100294 33833 172899 285170 -29732 -49859 -78901 -235169 -368803 -364533
15939c64533K9374o1971R7527J89280j93631j42830L32071j35818K43925o1610
$$ -364533 -335159 -397130 -299603 -110323 -303954 -446784 -114713 -250531 -6606 -68216
15929f8216m1193J84237j39244J35230J96936p9202l8959L7916O0102L00013j89397
$$ -68216 -109409 74828 -64416 70814 267750 188548 149589 187505 247607 547620 358223
15918C58223J92175J99875m15426K296j67495k37485o5420k45838K63438n601
$$ 358223 550398 750273 334847 337143 169648 -67837 -133257 -379095 -115657 -121258
15908a21258p4003K08943r8649l09370J10272N13900J4245l6119k49223k59212
$$ -121258 -195261 13682 -84967 -394337 -284065 229835 244080 207961 -41262 -300474
15898c00474K51098J87049k26390j6241j97365J67886J34504R861J13367m7879
$$ -300474 -49376 137673 -88717 -104958 -302323 -134437 67 9928 123295 75416
15888G5416l7448P2232k9088k93041k446Q5783k73577J06334K84308J39427j52836
$$ 75416 37968 110200 81112 -211929 -214375 -128592 -402169 -295835 -11527 127900 -24936
15877b4936k4929K8544j46961J53786M96534j56397n8067K3544n9600l007m46611
$$ -24936 -49865 -21321 -168282 -14496 482038 325641 267574 291118 231518 228511 -218100
15866b18100j49691K09530K8675k44405J89891J65956J77374J4233k21457j14978
$$ -218100 -367791 -158261 -129586 -373991 -184100 -18144 159230 173463 -47994 -162972
15856a62972P7822q498J784m2652n8115Q7161L90119p317m43115j02443O9588
$$ -162972 -85150 -93648 -91864 -134516 -192631 -105470 284649 277332 -165783 -268226 -198638
15845a98638J23903J91023k46301j90637O8143L9082j12301k46947K14537L59439
$$ -198638 -74735 116288 -130013 -320650 -252507 -213425 -325726 -572673 -358136 1303
15835A303J76782j45151j47643n2634p4869J64504J74413J01694J11778N9309
$$ 1303 178085 32934 -114709 -167343 -242212 -77708 96705 198399 310177 369486
15825C69486p1118k14674o74315J43060M77654N0968L9069R9512j07688q4444
$$ 369486 298368 83694 -590621 -447561 30093 81061 120130 219642 111954 27510
15815B7510N7153k3676O5833J5216j79808J78520j05182J61934J10636K18642
$$ 27510 84663 60987 126820 142036 -37772 140748 35566 197500 308136 526778
15805E26778J2745J7674j41596l44523j80012K31329K63336O1763k68643k09069
$$ 526778 539523 557197 415601 71078 -108934 122395 385731 447494 178851 -30218
15795c0218M69464l9663k54135R940L8425k1037k37344Q8657N9506M4732J06107
$$ -30218 439246 399583 145448 155388 193813 172776 -64568 24089 83595 128327 234434
15784B34434p1591J15334K629k51180k64193k24545K37239J10923J78731R8411
$$ 234434 162843 278177 280806 29626 -234567 -459112 -221873 -110950 67781 166192
15774A66192o8862O9552K17616j50706j79745J4938R9422R0228N8448o7446k02776
$$ 166192 97330 166882 384498 233792 54047 68985 168407 258635 317083 249637 46861
15763D6861J04196P6981j14691j07800j06062j6981J25592J32441K27111k79377
$$ 46861 151057 228038 113347 5547 -100515 -117496 8096 140537 367648 88271
15753H8271l74020j4155M4415L6552P8085J98808M1709K37928k05133K9240n5236
$$ 88271 -285749 -299904 -255489 -218937 -140852 57956 99665 337593 132460 161700 106464
15742A06464m3120j36132k01606k03766k55565J23390L38400R5007K29114L1132
$$ 106464 63344 -72788 -274394 -478160 -733725 -610335 -271935 -176928 52186 83318
15732H3318k0754q0359J62721k36097k27189K53874J2769l37133J40764J22657
$$ 83318 62564 -17795 144926 -91171 -318360 -64486 -51717 -388850 -248086 -125429
15722a25429M6985P8373m8514m6473L11228P7303l39093m3858J41898Q8968J0160
$$ -125429 -78444 -71 -48585 -95058 216170 293473 -45620 -89478 52420 141388 151548
15711A51548P0068n97l03045j61535m0507K3255L21309O5580j51743k22950J0250
$$ 151548 221616 221019 -82026 -243561 -284068 -260813 60496 126076 -25667 -248617 -238367
15700b38367L45288o2039k41703j6993J78171r0279j46917M5739K28943n7448
$$ -238367 106921 44882 -196821 -213814 -35643 -125922 -272839 -227100 1843 -55605
15690e5605O4449r8220k792R8879j0180J13340n9753J35647p9777Q6348j0908
$$ -55605 8844 -89376 -92168 6711 -3469 109871 50118 185765 105988 192336 181428
15679A81428j99773N8855J32072j89193l8457J29146P4175o8283q4705q762j00855
$$ 181428 -18345 40510 172582 -16611 -55068 74078 148253 79970 -4735 -13497 -114352
15668a14352N5784K81467j56961n66n8640j42758j37107o1282k2726O8011r8738
$$ -114352 -58568 222899 65938 65372 6732 -136026 -273133 -334415 -357141 -289130 -387868
15657c87868M1426o9442J14292n2866L79339N65106L7702m32340k33922k31108
$$ -387868 -346442 -415884 -301592 -354458 24881 589987 627689 195349 -38573 -269681
15647b69681k23257j3986K7376L11229K36993j63712J07817m1148k72717k20550
$$ -269681 -492938 -506924 -479548 -168319 68674 -95038 12779 -28369 -301086 -521636
15637e21636j66486r7026l03269J28692N05279m5961j26282K52466J70318K07202
$$ -521636 -688122 -785148 -1088417 -959725 -454446 -500407 -626689 -374223 -203905 3297
15627C297n7457k06582L5020R4928p3418J34708O2063j30237j32717r2829J50571
$$ 3297 -54160 -260742 -225722 -130794 -204212 -69504 -7441 -137678 -270395 -363224 -212653
15616b12653M7076k65665k69586K92364K19184O5637J49316J06384j67663j81836
$$ -212653 -165577 -431242 -700828 -408464 -189280 -123643 25673 132057 -35606 -217442
15606b17442J0153j00030J66381Q3160n16M54889M4396n6816R3688k20937j14556
$$ -217442 -207289 -307319 -140938 -57778 -58294 396595 440991 384175 477863 256926 142370
15595A42370J7990J16798k85076k63643j83464k44161J06916J82483L0296J30814
$$ 142370 160360 277158 -7918 -271561 -455025 -699186 -592270 -409787 -379491 -248677
15585b48677K14395J65461P1779m9015r6025j56826J90337j04290j57632j01360
$$ -248677 -34282 131179 202958 153943 57918 -98908 91429 -12861 -170493 -271853
15575b71853m4216N669J00719J24977o5722j10535J6959j94983K71474L84198
$$ -271853 -316069 -310400 -209681 -84704 -150426 -260961 -244002 -438985 -167511 216687
15565B16687n3060k72170p2131J29864J53827l05528j59794k70261K22491j0265
$$ 216687 163627 -108543 -180674 -50810 103017 -202511 -362305 -632566 -410075 -420340
15555d20340M102P3584L46410K14252Q174J34115Q7517j05040k04644K63860k47106
$$ -420340 -416238 -342654 3756 218008 226182 360297 447814 342774 138130 401990 154884
15544A54884k20695m1128j7223j17677J1753k58592K37518J89666j3231P8177
$$ 154884 -65811 -106939 -124162 -241839 -230086 -488678 -251160 -61494 -74725 3452
15534C452l7169J44224j35594k56075M3239J90648O1413l07214j79059q6695n3911
$$ 3452 -33717 110507 -25087 -281162 -237923 -47275 14138 -293076 -472135 -558830 -612741
15523f12741J99850K12764K81368J39464J40850J91601l80356k01338J43880j11510
$$ -612741 -412891 -200127 81241 220705 361555 553156 172800 -28538 115342 3832
15513C832r1505O2386L3324J82336j36047j99747r2011j83531J9851l79988k3644
$$ 3832 -87673 -25287 8037 190373 54326 -145421 -237432 -420963 -401112 -781100 -804744
15502h04744L11301M38677J23959r3849k47388J24367q7653J40566o5362J4213
$$ -804744 -493443 -54766 69193 -24656 -272044 -147677 -235330 -94764 -160126 -145913
15492a45913J64735l6171m4649j9095J0291P7205r5036j41798j92893J10450R3604
$$ -145913 18822 -17349 -61998 -81093 -70802 6403 -88633 -230431 -423324 -312874 -219270
15481b19270K17531R7950q2594N2715j33819o2290j87159j44545j27480K06544
$$ -219270 -1739 96211 13617 66332 -67487 -129777 -316936 -461481 -588961 -382417
15471c82417P3670j9715k58478J27474m2885l5613K15016K68462K6588o684M3536
$$ -382417 -308747 -328462 -586940 -459466 -502351 -537964 -322948 -54486 -27898 -34582 8954
15460H954Q940l08287J9644k04688O9850N75146k41839k93171J57379J26242j08141
$$ 8954 17894 -290393 -270749 -475437 -405587 169559 -72280 -365451 -208072 -81830 -189971
15449a89971j25586J69231L72438L3842M5376k8940q8864K5482J3855k85051n0626
$$ -189971 -315557 -146326 226112 259954 305330 276390 187526 213008 226863 -58188 -108814
15438a08814O4790J40588Q1430l5153k5446k46265j2442o8232r6237m8644l19686
$$ -108814 -44024 96564 177994 142841 117395 -128870 -141312 -209544 -305781 -354425 -674111
15427f74111J86883L66067K35368j43527k54622K19223Q7566j80578J82245R4782
$$ -674111 -487228 -121161 114207 -29320 -283942 -64719 22847 -157731 24514 119296
15417A19296m24420m04367J29070N54344M7637j02252k47349k8929L7723L636
$$ 119296 -305124 -709491 -580421 -26077 21560 -80692 -328041 -356970 -319247 -315611
15407c15611J11962K71314K90280J16944j99567j68901k24291n5312P3733j3169
$$ -315611 -203649 67665 357945 474889 275322 106421 -117870 -173182 -99449 -112618
15397a12618j74597N7887J30722L62328M4990q1290L4399m5203p9152l58050p5230
$$ -112618 -287215 -229328 -98606 263722 308712 227422 261821 216618 137466 -220584 -295814
15386b95814K8559L33537K88099j89150m23825L6235J30030k3202K9871N8432
$$ -295814 -267255 66282 354381 165231 -258594 -222359 -92329 -115531 -85660 -27228
15376b7228j42354p6610p4861j52521q2636K40772J08528N5996J65792j79674
$$ -27228 -169582 -246192 -321053 -473574 -556210 -315438 -206910 -150914 14878 -164796
15366a64796q4564k10462J72357R1932o273q8201r1041K12076L68524j2164k30018
$$ -164796 -249360 -459822 -287465 -195533 -201806 -290007 -381048 -168972 199552 187388 -42630
15355d2630r5707j68551j15795J27896J59238k17658l1254L83084o5805n7688
$$ -42630 -138337 -306888 -422683 -294787 -135549 -353207 -384461 -1377 -67182 -124870
15345a24870j32567M0318P676k8955L7774j17714K1683L50133J9722m7870K33385
$$ -124870 -257437 -217119 -209443 -238398 -200624 -318338 -296655 53478 73200 25330 258715
15334B58715J96607k47782k7048k32794k02557K51621K54810O1307R7464l1939
$$ 258715 455322 207540 180492 -52302 -254859 -3238 251572 312879 410343 378404
15324C78404j65244k04932j29542J76315L45756J03149m91209R9467L56529l4729
$$ 378404 213160 8228 -121314 55001 400757 503906 12697 112164 468693 433964
15314D33964l87562j47273J29975P535K0576k92798Q1627N4975k87358j61455
$$ 433964 46402 -100871 29104 36639 57215 -235583 -153956 -98981 -386339 -547794
15304e47794L5867K51335K31225O6202r0933l05405j36292r0243p2329J33296
$$ -547794 -511927 -260592 -29367 36835 -54098 -359503 -495795 -586038 -658367 -525071
15294e25071M87338L03946k8613k74262j20987j68673J44930L64231L583j66743
$$ -525071 -37733 266213 237600 -36662 -157649 -326322 -181392 182839 186422 19679
15284A9679K15478p6556k17210K56081j96117l21010R5479Q8622J3574k3495J04627
$$ 19679 235157 158601 -58609 197472 1355 -319655 -224176 -135554 -121980 -145475 -40848
15273d0848K42757j4939p5962K22143k2467Q9496j40182L9053Q6862p1308n4314
$$ -40848 201909 186970 111008 333151 310684 400180 259998 299051 385913 314605 260291
15262B60291m9584J5033o2914R5694m50196r3822R4257J87184j31794O4218r963
$$ 260291 210707 225740 162826 258520 -191676 -285498 -191241 -4057 -135851 -71633 -81596
15251h1596j11072J46070r016Q1454K85162J41873j14575k35950m411K14920k7946
$$ -81596 -192668 -46598 -55614 25840 311002 452875 338300 102350 97939 312859 284913
15240B84913k17145p8718j18832K12023n4983j07250j83802l5757J11758l3574
$$ 284913 67768 -10950 -129782 82241 27258 -79992 -263794 -299551 -187793 -221367
15230b21367k3549N6640P3456j55088M00755J56257p876k08706o448l0780o7580
$$ -221367 -244916 -188276 -114820 -269908 130847 287104 279228 70522 64074 33294 -34286
15219c4286q8720j19023M02228K72704j25371j16524J45264j60409k85678j31394
$$ -34286 -123006 -242029 160199 432903 307532 191008 336272 175863 -109815 -241209
15209b41209N5332m8235J5735J99222K63824n3697L21655M5838p3176l09681j4265
$$ -241209 -185877 -234112 -218377 -19155 244669 190972 512627 558465 485289 175608 161343
15198A61343k19244j1307r771k85210n6506O8738n0268K88667J17053k70631M1310
$$ 161343 -57901 -69208 -78979 -364189 -420695 -351957 -402225 -113558 3495 -267136 -225826
15187b25826J53912Q7785K56891J29750k13866l6605m5134J20278L40392j03785
$$ -225826 -71914 15871 272762 402512 188646 152041 106907 227185 567577 463792
15177D63792k18254j76933O6593P6846l04821m0678j06151j52749J82333M69343
$$ 463792 245538 68605 135198 212044 -92777 -133455 -239606 -392355 -210022 259321
15167B59321J20173k13569k66693j47177J10277j7977J68961j7960l35283l3089
$$ 259321 379494 165925 -100768 -247945 -137668 -155645 13316 -4644 -339927 -373016
15157c73016J83322p7280J51426K4634j2840Q5925j81502k60673K31662J82069
$$ -373016 -189694 -266974 -115548 -90914 -103754 -17829 -199331 -460004 -228342 -46273
15147d6273K49401p5379j96216l1342p4546l5653j71039K0483k8570K68213J54011
$$ -46273 203128 127749 -68467 -99809 -174355 -210008 -381047 -360564 -389134 -120921 33090
15136C3090j82697j21022j22359N6325K22024L12016Q20m46223M2655J11172j02016
$$ 33090 -149607 -270629 -392988 -336663 -114639 197377 198197 -248026 -205371 -94199 -196215
15125a96215K12435J55926r1412o1533p9823k43907M1484J92536L2894j87839
$$ -196215 16220 172146 80734 19201 -60622 -304529 -263045 -70509 -37615 -225454
15115b25454m5162P2043o2147J73693M0253J44020N9883P278Q9293l11857j29762
$$ -225454 -270616 -198573 -260720 -87027 -46774 97246 157129 164407 253700 -58157 -187919
15104a87919K92969k0037j42265J24331Q8325M475O2336K64029o463k51947j41318
$$ -187919 105050 85013 -57252 67079 155404 159879 222215 486244 479781 227834 86516
15093H6516J13717k22374l23957n173K97990L70628j08339l69607k72858M88696
$$ 86516 200233 -22141 -346098 -351271 -53281 317347 209008 -160599 -433457 55239
15083E5239L00538k73507M2029j00404k39685L4045K10377M6886N5770j68977
$$ 55239 355777 82270 124299 23895 -215790 -181745 28632 75518 131288 -37689
15073c7689k6422J17450M8880l77956J0562K85952j2508m0957o6994j23814K69961
$$ -37689 -64111 53339 102219 -275737 -265175 20777 8269 -32688 -99682 -223496 46465
15062D6465J48689R9941n3924N7437Q5534K15353k46845k39464J23969k04705
$$ 46465 195154 295095 241171 298608 384142 599495 352650 113186 237155 32450
15052C2450j65858M7363K18895J92748j05426l35251r2234J8073O9340p9885j67754
$$ 32450 -133408 -86045 132850 325598 220172 -115079 -207313 -189240 -119900 -199785 -367539
15041c67539L3953K32485J64882O5795j424k10111j58117P3023k52294L6146J59873
$$ -367539 -333586 -101101 63781 129576 128152 -81959 -240076 -167053 -419347 -383201 -223328
15030b23328P1049j35143J69315J58160m3652m9287K73123R6764o7713j75720
$$ -223328 -152279 -287422 -118107 40053 -3599 -52886 220237 317001 249288 73568
15020G3568n1263K2782J6518J7837m9097j0402R7696J09579J7048J5204N1575
$$ 73568 22305 45087 61605 79442 30345 19943 117639 227218 244266 259470 311045
15009C11045l4642R9714J42296l00695P1919Q7976k25328m35836j63991J44601
$$ 311045 276403 376117 518413 217718 289637 377613 152285 -283551 -447542 -302941
14999c02941L9322J1834L50370L41648j26578j22178J3791J81998J65199j57224
$$ -302941 -263619 -251785 98585 440233 313655 191477 205268 387266 552465 395241
14989C95241l40740j83382J92438j59965K9367O0286k69894M1055J56528L662
$$ 395241 54501 -128881 63557 -96408 -67041 -6755 -276649 -235594 -79066 -75404
14979g5404l9027L4684J17319K73649n0754k72520j83227N6804n9052q8632j20914
$$ -75404 -114431 -79747 37572 311221 260467 -12053 -195280 -138476 -197528 -286160 -407074
14968d07074J55253K15173J81404K45034k78857J44018p4247Q3318N0896L3376
$$ -407074 -251821 -36648 144756 389790 110933 254951 180704 264022 314918 348294
14958C48294J24404k62589k17396l5774J87681N1313o2677j96613k6868K09300
$$ 348294 472698 210109 -7287 -43061 144620 195933 133256 -63357 -90225 119075
14948A19075j20490j97201r6515K09103o6580j51813J04258J70826J49142j92631
$$ 119075 -1415 -198616 -295131 -86028 -152608 -304421 -200163 -29337 119805 -72826
14938g2826p6180J78499P6557J57575k10778k93150L8929J5517p1844j05364Q9096
$$ -72826 -149006 29493 106050 263625 52847 -240303 -201374 -185857 -257701 -363065 -273969
14927b73969J52388J82394r3952k68655k65190m7407M00L00726L45433m309j21355
$$ -273969 -121581 60813 -33139 -301794 -566984 -614391 -613991 -313265 32168 27859 -93496
14916i3496J28124J01397M27263m0669j73715q3282q7347k55086N7143K31550
$$ -93496 34628 136025 563288 522619 348904 265622 178275 -76811 -19668 211882
14906B11882K46275j810j52585j37809n5717q6419l74499k94632J14605J92304
$$ 211882 458157 456347 303762 165953 110236 23817 -350682 -645314 -530709 -338405
14896c38405J51922K3738L17150J25027l86447k0182K33221k922o2216j3109j76605
$$ -338405 -186483 -162745 154405 279432 -107015 -127197 106024 103102 40886 27777 -148828
14885a48828k8723L96942k7972J44494R0749k11239l289J091M8432k80013J9685
$$ -148828 -177551 219391 191419 335913 426662 215423 212134 213225 261657 -18356 1329
14874A329L26506J17269j27977j49892k51742p7223J06155j22107k22056k2296
$$ 1329 327835 445104 317127 167235 -84507 -161730 -55575 -177682 -399738 -422034
14864d22034k6506J67773l2633O7517J90339R6014k23470k0102j8591k6323k8964
$$ -422034 -448540 -280767 -313400 -245883 -55544 40470 -183000 -203102 -221693 -248016 -276980
14853b76980O4944P180n921m0839J63518K78502o2752q6593j04188r729Q0615
$$ -276980 -212036 -204856 -210777 -251616 -88098 190404 127652 41059 -63129 -72858 7757
14842G757J63951P2282l1815k8125P4580K04347M0735j11491j09616j77327k67867
$$ 7757 171708 243990 212175 184050 258630 462977 503712 392221 282605 105278 -162589
14831a62589m1978R2208k9873J56184J59226j36884N785k2725P8583M254J87332
$$ -162589 -204567 -112359 -142232 13952 173178 36294 42079 19354 97937 102191 289523
14820B89523o011m7359p7078j43749J87124J79016J44932k25616j88946n8243
$$ 289523 283512 236153 159075 15326 202450 381466 526398 300782 111836 53593
14810E3593k3521l9495j7321j29988J37418J11192l0516j72951N5636J89991j3963
$$ 53593 30072 -9423 -26744 -156732 -19314 91878 61362 -111589 -55953 134038 120075
14799A20075k93005J8011J60292J22556l7519J04354Q4105j62851j67622p68q6588
$$ 120075 -172930 -154919 5373 127929 90410 194764 278869 116018 -51604 -52372 -138960
14788a38960J2042q5182n5966L21032r6647q237K78303M2725j39603j27339Q7553
$$ -138960 -126918 -212100 -268066 52966 -43681 -51918 226385 269110 129507 2168 89721
14777H9721J7247J46902M1858j91007r6014J66202K0590R1817j77187q3900P5965
$$ 89721 106968 253870 295728 104721 8707 174909 195499 287316 110129 26229 102194
14766A02194l7336j32146J549P4832q2371N0753J7304j47603j89253J92812K50285
$$ 102194 64858 -67288 -65739 9093 -73278 -22525 -5221 -152824 -342077 -149265 101020
14755A01020J54485j4039N3182J44001j15476m0222k65743L2016j4547J48491
$$ 101020 255505 241466 294648 438649 323173 282951 17208 49224 34677 183168
14745A83168o3301J6715l70508J5522O6004K07014K2052j18858J94068l1649l7680
$$ 183168 119867 136582 -233926 -218404 -152400 54614 76666 -42192 151876 120227 82547
14734H2547N7025o2762j57061O2838P2563L29441K5024j67233k0536j92212N3108
$$ 82547 139572 76810 -80251 -17413 55150 384591 409615 242382 221846 29634 82742
14723H2742j41069J3824k4896k07941J72110J63250J89203j96804K09384l01512
$$ 82742 -58327 -44503 -69399 -277340 -105230 58020 247223 50419 259803 -41709
14713d1709j2316J85715K25235J42400k4483k73605K17502m3768j08318q7050
$$ -41709 -54025 131690 356925 499325 474842 201237 418739 374971 266653 179603
14703A79603k51297j63289j23130j2855j9113Q4131l7010K88071K69094p4934
$$ 179603 -71694 -234983 -358113 -370968 -390081 -305950 -342960 -54889 214205 139271
14693A39271l46567m7469K79259K5703j25403J23056o9423j38921o8711N3936
$$ 139271 -207296 -254765 24494 50197 -75206 47850 -21573 -160494 -229205 -175269
14683a75269K46020P6748j0939N793m3132k05688J61676n51j86512Q362K866J78046
$$ -175269 70751 147499 136560 142353 99221 -106467 55209 54658 -131854 -123492 -120626 57420
14671E7420J14012J7290j02565l2172j15539j01340R1055J06146j8371J36337
$$ 57420 171432 188722 86157 53985 -61554 -162894 -71839 34307 15936 152273
14661A52273K1483k28609j30155J46167K77984L33395j45260m6624k11261k95220
$$ 152273 173756 -54853 -185008 -38841 239143 572538 427278 380654 169393 -125827
14651a25827j02769J72202L13480m4492L5480r2347K6947j77380j10037K7068
$$ -125827 -228596 -56394 257086 212594 248074 155727 182674 5294 -104743 -77675
14641g7675J82521q038k6170J6581m8545K27485j06164j03208k24356k02820J31065
$$ -77675 104846 96808 70638 87219 38674 266159 159995 56787 -167569 -370389 -239324
14630b39324L57825k84868j2609K12840L15211j48455j5169J65665J22798k02709
$$ -239324 118501 -166367 -178976 33864 349075 200620 185451 351116 473914 271205
14620B71205j10666o1023P180j55184q0421r4454L53274K02515l45062k15338
$$ 271205 160539 99516 106696 -48488 -128909 -223363 129911 332426 -12636 -227974
14610b27974J9603Q3986p2943k5703J92947j18885J7123J93310J26489m1452K3044
$$ -227974 -208371 -124385 -197328 -223031 -30084 -148969 -131846 61464 187953 146501 169545
14599A69545r8282j72926p9874J89836o1429p8831k19675n699L22590J89539M0686
$$ 169545 71263 -101663 -181537 8299 -53130 -131961 -351636 -357335 -34745 154794 195480
14588A95480j60463K0659k5513j46655J16299l10571q069J93972J30065l4828
$$ 195480 35017 55676 30163 -116492 -193 -310764 -318833 -124861 5204 -29624
14578b9624o8683j59242J44936k0831j21530J30686J08331j84116k09393K32061
$$ -29624 -98307 -257549 -112613 -133444 -254974 -124288 -15957 -200073 -409466 -177405
14568a77405K00335o6042j42205k48633J13124P6123K3726J60501Q7213p1861
$$ -177405 22930 -43112 -185317 -433950 -320826 -244703 -220977 -60476 26737 -45124
14558d5124k90481K68856M1722J3464O2803n4864q872k77673l27065P4389K26193
$$ -45124 -335605 -66749 -25027 -11563 51240 -3624 -12496 -290169 -617234 -542845 -316652
14547c16652J65548J98093k8419j19541K12426M15517j8374r9250j81836k66059
$$ -316652 -151104 46989 18570 -100971 111455 526972 508598 409348 227512 -38547
14537c8547k19350p1j87857L7712J47127n586K0592K63532m2510j42021J18687
$$ -38547 -257897 -257968 -445825 -408113 -260986 -266572 -245980 17552 -24958 -166979 -48292
14526d8292J88162J98363k28022r0428K0031J4560L8740k50300k3661M2257n3433
$$ -48292 139870 338233 110211 19783 39814 54374 93114 -157186 -180847 -138590 -192023
14515a92023J69730J46763j44023p8296j1504k75269k05103K47843R8010N1408
$$ -192023 -22293 124470 -19553 -97849 -109353 -384622 -589725 -341882 -243872 -192464
14505a92464l11027j41595O7339K07774Q475J71977n6341j9730j67133J53076
$$ -192464 -503491 -645086 -577747 -369973 -361498 -189521 -245862 -265592 -432725 -279649
14495b79649L81633j30891j46713m2539m0932j69233K44473J93680j27326j85249
$$ -279649 101984 -28907 -175620 -218159 -259091 -428324 -183851 9829 -117497 -302746
14485c02746K25674K42984K32257j81039j28231O3782l8677o3417m5572L2295
$$ -302746 -77072 165912 398169 217130 88899 152681 114004 50587 5015 37310
14475C7310k86740k67136K44506R9459j9732N12774j04918j97728j6699j46095
$$ 37310 -249430 -516566 -272060 -172601 -192333 320441 215523 17795 1096 -144999
14465a44999j05072Q0863M6385N793K08362n4173n8233L78363N8436J23658k09702
$$ -144999 -250071 -169208 -122823 -117030 91332 37159 -21074 357289 415725 539383 329681
14454C29681m94398j21470K04751P1863j00322p1087k00727k44129J52841J3840
$$ 329681 -164717 -286187 -81436 -9573 -109895 -180982 -381709 -625838 -472997 -459157
14444d59157K99264K74991l2597l276j49030k54592J54999J21920l7645k0385
$$ -459157 -159893 115098 82501 79225 -69805 -324397 -169398 -47478 -85123 -105508
14434a05508j42980J6798r7791L3792k04981p5125L7676m9084p4678M3163L02790
$$ -105508 -248488 -231690 -329481 -295689 -500670 -575795 -538119 -587203 -661881 -618718 -315928
14423c15928K05606k43302J61522r3858K1348J52228M2263J24979J38308P8780
$$ -315928 -110322 -353624 -192102 -285960 -264612 -112384 -70121 54858 193166 271946
14413B71946P1328K67057j61236o9894j00644l71145n153K57423j26818k08474
$$ 271946 343274 610331 449095 379201 278557 -92588 -97741 159682 32864 -175610
14403a75610o5415o878J99780K24325L8911m3851j6435j76610k10984o2047N0415
$$ -175610 -241025 -247903 -48123 176202 215113 171262 154827 -21783 -232767 -294814 -244399
14392b44399l54282j08210K35188j2791j53959K75995L87522J40963J24241J6973
$$ -244399 -598681 -706891 -471703 -484494 -638453 -362458 25064 166027 290268 307241
14382C07241q2032m36265j11130M20453K21968J10914q6077k94901k10748j19092
$$ 307241 225209 -211056 -322186 98267 320235 431149 345072 50171 -160577 -279669
14372b79669J83042K67059R0571p198p0921J5809j00250l63958j08589J23497
$$ -279669 -96627 170432 261003 253805 182884 198693 98443 -265515 -374104 -250607
14362b50607P8931J71062K00079P4907l97986M3127K86071q3055R448k703J73054
$$ -250607 -171676 -614 199465 274372 -123614 -80487 205584 122529 131977 129274 302328
14351C02328J74061j54319K8730k58358k75282J70436J09935j87282L8991K20388
$$ 302328 476389 322070 350800 92442 -182840 -12404 97531 -89751 -50760 169628
14341A69628L5751M9632J01611R9164r9216N0451k82135L2054N4840J45746j29183
$$ 169628 205379 255011 356622 455786 356570 407021 124886 156940 211780 357526 228343
14330B28343j08860J04630P6728m9802j69395p0120k8414N2915r1970j90989j47623
$$ 228343 119483 224113 300841 251039 81644 11524 -16890 36025 -55945 -246934 -394557
14319c94557K8944K12226J88455O6615p0169k61292N0956L85027n6016J16783
$$ -394557 -365613 -153387 35068 101683 31514 -229778 -178822 206205 150189 266972
14309B66972m1383j26730q2085O00J0633k9411k73616r9220M28163Q6979P4106
$$ 266972 225589 98859 16774 17374 28007 -1404 -275020 -374240 53923 140902 215008
14298B15008n14277j33940K14448K71425j337k33988l7569L11751j98368N5106
$$ 215008 -299269 -433209 -218761 52664 51327 -182661 -220230 91521 -106847 -51741
14288e1741J92432k30615j47723J47590m1950R9278J72735J84361J50851k66180
$$ -51741 140691 -89924 -237647 -90057 -132007 -32729 140006 324367 475218 209038
14278B09038j29459P3166j64813k27304K0944K5854j96630j35790O2253p5116
$$ 209038 79579 152745 -12068 -239372 -218428 -192574 -389204 -524994 -462741 -537857
14268e37857J34409K79411k17893p4135p705K7089J88381L1465J03190n021j02000
$$ -537857 -403448 -124037 -341930 -416065 -423770 -396681 -208300 -176835 -73645 -78666 -180666
14257a80666l7878j30032J02036K11507j84914n7033m4614N9731p0390J73641
$$ -180666 -218544 -348576 -246540 -35033 -219947 -276980 -321594 -261863 -332253 -158612
14247a58612K2158K31157Q8116r1983K01562L0122Q576j14437l90949j40600k8751
$$ -158612 -136454 94703 182819 90836 292398 322520 331096 216659 -174290 -314890 -343641
14236c43641r6228K58380J55476k13402j36510j62883J15343K54213L6687j65001
$$ -343641 -439869 -181489 -26013 -239415 -375925 -538808 -423465 -169252 -132565 -297566
14226b97566l3415J42160L0277J50966J59917j67076o5865l1370q109J8386n5777
$$ -297566 -330981 -188821 -158544 -7578 152339 -14737 -80602 -111972 -120081 -101695 -157472
14215a57472J6109r0458O9353j8706M1111j81994j94123L7049J34774K40983J87264
$$ -157472 -141363 -231821 -162468 -181174 -140063 -322057 -516180 -479131 -344357 -103374 83890
14204H3890j83248j16816L30847l4381j04865j4924k76077j81685J36267J20735
$$ 83890 -99358 -216174 114673 80292 -24573 -39497 -315574 -497259 -360992 -240257
14194b40257J63978K29725J19399l75792j91037o9875N4968K14626k8028j4232
$$ -240257 -76279 153446 272845 -102947 -293984 -363859 -308891 -94265 -122293 -136525
14184a36525m4532r6732L41854N9079j53772k8001k1868p0277p1890O7280O5542
$$ -136525 -181057 -277789 64065 123144 -30628 -58629 -80497 -150774 -222664 -155384 -89842
14173h9842p8612j4925L15117K06883m449k62854j07012j38542j3239K57787k17834
$$ -89842 -168454 -183379 131738 338621 334172 71318 -35694 -174236 -187475 70312 -147522
14162a47522j76211J17573J24278r6439l1511J37904j79247k21280l9095J73924
$$ -147522 -323733 -206160 -81882 -178321 -209832 -71928 -251175 -472455 -511550 -337626
14152c37626K86439k45949J24879K93374k3662J34708J31557j41184j02895k85821
$$ -337626 -51187 -297136 -172257 121117 97455 232163 363720 222536 119641 -166180
14142a66180J5801K02567K20299J40227n1849k17373k60730L0883j09454K8072
$$ -166180 -150379 52188 272487 412714 360865 143492 -117238 -86355 -195809 -167737
14132a67737M6910J6932M7996J1330k15548M5966N1031j44154l0177J25438j41791
$$ -167737 -120827 -103895 -55899 -44569 -260117 -214151 -163120 -307274 -337451 -212013 -353804
14121c53804j07003J02575L12386p013k26322R9038L63131N994o3186j02128k51716
$$ -353804 -460807 -358232 -45846 -52859 -279181 -180143 182988 188982 125796 23668 -228048
14110b28048K43249K75599K5222l44281j28286J23010p8485j34106n2304J81455
$$ -228048 15201 290800 316022 -28259 -156545 -33535 -112020 -246126 -298430 -116975
14100a16975K55221n48468k86130Q8971K80148P6570M0316K04379M2821k6853
$$ -116975 138246 -410222 -696352 -607381 -327233 -250663 -210347 -5968 36853 10000
14090A0000m7390k27134r1098K27301J30474K2716R4918R4606J94858M7914m53828
$$ 10000 -37390 -264524 -355622 -128321 2153 24869 119787 214393 409251 457165 3337
14079C337k54813k7054P4060l2102n396J16716P6573o1403J60853j86379J31941
$$ 3337 -251476 -278530 -204470 -236572 -241968 -125252 -48679 -110082 50771 -135608 -3667
14068c667J33754q7008k68250N999J11769K14293l5416j54562j44494j21209k55214
$$ -3667 130087 43079 -225171 -219172 -107403 106890 71474 -83088 -227582 -348791 -604005
14057f04005J83747J93307j17466k51305K71476K3860K86566K65532l92161k58010
$$ -604005 -420258 -226951 -344417 -595722 -324246 -300386 -13820 251712 -140449 -398459
14047c98459j5889K05398j7350o4323J30251J2041O8994r1977P0651m0728J13365
$$ -398459 -414348 -208950 -226300 -290623 -160372 -148331 -79337 -171314 -100663 -141391 -28026
14036b8026j15035k09995r9488m4453k1353J69659K55069L52053J62863n10905
$$ -28026 -143061 -353056 -452544 -496997 -518350 -348691 -93622 258431 421294 -89611
14026h9611j27602L4904J7383L0528r682k0242r252j15863J91340o9810J43431
$$ -89611 -217213 -182309 -164926 -134398 -144080 -164322 -173574 -289437 -98097 -167907 -24476
14015b4476J3408o2840J42372O6660K56822J58896m2857k16605k77456J33542
$$ -24476 -11068 -73908 68464 135124 391946 550842 507985 291380 13924 147466
14005A47466n5733J4765j60835p4022J49600M148j79840P5431J54125n9294j42325
$$ 147466 91733 106498 -54337 -128359 21241 25389 -154451 -79020 75105 15811 -126514
13994a26514j60721J3845M8010J06120q4741n5014J59111M4082l60910n4612K42185
$$ -126514 -287235 -273390 -225380 -119260 -204001 -259015 -99904 -55822 -416732 -471344 -229159
13983b29159J20048k18373l53923o5245J88283J21720K24483R1258J0722j65725
$$ -229159 -109111 -327484 -681407 -746652 -558369 -436649 -212166 -120908 -110186 -275911
13973b75911J75964L81015O466m1246l66832j14135M71902K06146j64899l84465
$$ -275911 -99947 281068 287534 246288 -120544 -234679 237223 443369 278470 -105995
13963a05995j29863P0173J47161k01689j14806P438j09112M16009p8796l4353
$$ -105995 -235858 -165685 -18524 -220213 -335019 -327581 -436693 -20684 -99480 -133833
13953a33833k33403K5043J70787K21299P3457k4073j29658n2414r6973k3734J35445
$$ -133833 -367236 -342193 -171406 49893 123350 99277 -30381 -82795 -179768 -203502 -68057
13942f8057J94156q6922r6264J58630Q2686j8971o3821N5154j03527r6759m1545
$$ -68057 126099 39177 -57087 101543 184229 165258 101437 156591 53064 -43695 -85240
13931h5240K01080K80288K4911m28407k24984P0075j3579r1728J88263r7054m4954
$$ -85240 115840 396128 421039 -7368 -232352 -162277 -175856 -267584 -79321 -176375 -221329
13920b21329J13478L5275p4817J68447J82398m9274j45557j01527M411l9049j58177
$$ -221329 -107851 -72576 -147393 21054 203452 154178 8621 -92906 -88495 -127544 -285721
13909b85721L34738j24956k02484J82758J3986k61521j62338m6754J65201J76508
$$ -285721 49017 -75939 -278423 -95665 -81679 -343200 -505538 -552292 -387091 -210583
13899b10583n3213Q6669J5014R5218K92881Q9382k934Q788m09159j14305j55156
$$ -210583 -263796 -177127 -162113 -66895 225986 315368 312434 321222 -87937 -202242 -357398
13888c57398l7244L41434K05751n6101J13464P1404N134l36583o2374K934j34982
$$ -357398 -394642 -53208 152543 96442 209906 281310 286444 -50139 -112513 -109579 -244561
13877b44561N7398k1128n1545K4248n9402p0895K16569N7466j78906R7375Q7107
$$ -244561 -187163 -208291 -259836 -235588 -294990 -365885 -149316 -91850 -270756 -173381 -86274
13866h6274r6818J45281J20140k8837l16558n87164l13808K02610J63027N28741
$$ -86274 -183092 -37811 82329 53492 -263066 -850230 -1164038 -961428 -798401 -269660
13856b69660K89742k9010J61326K18376J09581m1569j79181j46343j02635O6365
$$ -269660 20082 -8928 152398 370774 480355 438786 259605 113262 10627 76992
13846G6992J92821j07722r8380R1816r1664k13918j00816K8401J18484j7062L9047
$$ 76992 269813 162091 63711 155527 63863 -150055 -250871 -222470 -103986 -121048 -82001
13835h2001K87639N243R9260L142k61136J3189K09252q3891O9802j71528k3664
$$ -82001 205638 210881 310141 313283 52147 65336 274588 190697 260499 88971 65307
13824F5307P9554k22105r7355J36251M3784j04669j68948M8773J08364J87997
$$ 65307 144861 -77244 -174599 -38348 5436 -99233 -268181 -219408 -111044 76953
13814G6953l9354J49722k2006j09837Q4275L8764j8100k08216J58163J55707J24305
$$ 76953 37599 187321 165315 55478 139753 178517 160417 -47799 110364 266071 390376
13803C90376j448j25444k98651J67966k1947N038o9946k33582r7188K52036K2946
$$ 390376 388928 263484 -35167 132799 110852 115890 45944 -187638 -284826 -32790 -9844
13792i844j63481l50052m6419M13521K18658q9609O8415M5012l5710k0395j03866
$$ -9844 -173325 -523377 -569796 -156275 62383 -27226 41189 86201 50491 30096 -73770
13781g3770J22246p2714j54084J45864j32311Q488k05307O9030J65560O7897q2147
$$ -73770 48476 -24238 -178322 -32458 -164769 -156281 -361588 -292558 -126998 -59101 -141248
13770a41248k17682O5528L32841r4830o3999J76369J89753k53874k08269k03467
$$ -141248 -358930 -293402 39439 -55391 -119390 56979 246732 -7142 -215411 -418878
13760d18878k49638J57580L16858R2754K96715p4115P4909K07277j05626n02246
$$ -418878 -668516 -510936 -194078 -101324 195391 121276 196185 403462 297836 -204410
13750b04410m6318L84232J27124K4916J53878K08698j53650j65126q124j21613
$$ -204410 -250728 133504 260628 285544 439422 648120 494470 329344 321220 199607
13740A99607k92290m1877j0637q2301K59599j58236q7994K08543L1627O226J6877
$$ 199607 -92683 -134560 -145197 -227498 32101 -126135 -214129 -5586 26041 32267 49144
13729D9144j50984m0128r0273j7801J4188j19503K57595J12099l90856j78993
$$ 49144 -101840 -141968 -232241 -250042 -235854 -355357 -97762 14337 -376519 -555512
13719e55512O5677J01994k7562q1054L00357n8421q1867k21220j350J12039M9755
$$ -555512 -489835 -387841 -415403 -496457 -196100 -254521 -336388 -557608 -558958 -446919 -397164
13708c97164k04251K81388K41278O7797R9173P1845j96996j75420P1301J7074
$$ -397164 -601415 -320027 -78749 -10952 88221 160066 -36930 -212350 -141049 -123975
13698a23975J90379J09630L358j75243j85100l6561m0604R5135K48333J3690J06406
$$ -123975 66404 176034 179392 4149 -180951 -217512 -258116 -162981 85352 99042 205448
13687B05448m3060J34186r5658j68537j94706j33180L47366K76321j84568j19592
$$ 205448 162388 296574 200916 32379 -162327 -295507 51859 328180 143612 24020
13677B4020J80949m4598P59r0795J44425J03683l77796k47264Q8096K52365J53336
$$ 24020 204969 160371 161130 70335 214760 318443 -59353 -306617 -218521 33844 187180
13666A87180J950J34483k17226k02270L88621J67780k24189l81016k54936J1572
$$ 187180 189130 323613 106387 -95883 292738 460518 236329 -144687 -399623 -388051
13656c88051J23933L9708o2194J3920J28273L10230P8932j11794k20022k8117
$$ -388051 -264118 -224410 -286604 -272684 -144411 165819 244751 132957 -87065 -115182
13646a15182L31847J3094j31689J27358J53944o9912l04645j41089J74676J7201
$$ -115182 216665 229759 98070 225428 379372 309460 4815 -136274 38402 55603
13636E5603l69129j58328K46231J01486p7232K34097j57923R3458K96088j39143
$$ 55603 -313526 -471854 -225623 -124137 -201369 32728 -125195 -31737 264351 125208
13626A25208P7963l85127j13502J04061k1570J00015K06547l7777j70384k79022
$$ 125208 203171 -181956 -295458 -191397 -212967 -112952 93595 55818 -114566 -393588
13616c93588j00690Q1387K57638K7541J79187N5787n5453j21204J08010p2040
$$ -393588 -494278 -412891 -155253 -127712 51475 107262 51809 -69395 38615 -33425
13606c3425j58554j40200L49568K12751K835L60199K20821k40494r0897K501j18068
$$ -33425 -191979 -332179 17389 230140 232975 593174 813995 573501 482604 485105 367037
13595C67037k96924j5266K7323p898J4085j45365k88664K1823J1591P421J73450
$$ 367037 70113 54847 82170 74272 88357 -57008 -345672 -323849 -312258 -304837 -131387
13584a31387L28688j38253l87828L61988K17316L993P4171M4944R6159m8317j00518
$$ -131387 197301 59048 -328780 33208 250524 254517 328688 373632 469791 421474 320956
13573C20956J18221q2054k95018j70620j55719J41489L2159l061j39968J83757
$$ 320956 439177 357123 62105 -108515 -264234 -122745 -90586 -93647 -233615 -49858
13563d9858K40444L6198j67417n3242N9444J18961q8781Q2924l2676k64891Q7533
$$ -49858 190586 226784 59367 6125 65569 184530 95749 178673 145997 -118894 -31361
13552c1361L59215P2687J54305k71653k10661R8732p0870m488k2591j91393j86883
$$ -31361 327854 400541 554846 283193 72532 171264 100394 95906 73315 -118078 -304961
13541c04961K28584P9240K8780Q9746O7741o1189k86934l22615L052J32334K44348
$$ -304961 -76377 2863 31643 121389 189130 127941 -158993 -481608 -478556 -346222 -101874
13530a01874K18506k06185j59987K47057O9355p8266q3985m24581n6876K58489
$$ -101874 116632 -89553 -249540 -2483 66872 -11394 -95379 -519960 -576836 -318347
13520c18347K5184k1707O5584O718j75086P7787K29352q3793k4041K72156J64027
$$ -318347 -293163 -314870 -249286 -242568 -417654 -339867 -110515 -194308 -218349 53807 217834
13509B17834j00142q6150J10198K09599j85648l89435l30994J42006O49864l7976
$$ 217834 117692 31542 141740 351339 165691 -223744 -554738 -412732 237132 199156
13499A99156k36243l34401J58910K42462j350j39567k95103P2537L07339R3745
$$ 199156 -37087 -371488 -212578 29884 28534 -111033 -406136 -333599 -26260 67485
13489F7485k62125j16724K98934J94963Q5150j96117r4432O1149J72277K763k50405
$$ 67485 -194640 -311364 -12430 182533 267683 71566 -22866 38283 210560 213323 -37082
13478c7082k35023j6886J73009j6029k1784K32115R4494k05137l8293j03655j85522
$$ -37082 -272105 -288991 -115982 -132011 -153795 78320 172814 -32323 -70616 -174271 -359793
13467c59793J147K53475r126j2763j6899J63575N9324Q6793m9102p6643J13597
$$ -359793 -358646 -105171 -114297 -127060 -143959 19616 78940 165733 116631 39988 153585
13456A53585l0888l66012j99682K48101K25867j29826o8544P3407N711K21952
$$ 153585 122697 -243315 -442997 -194896 30971 -98855 -167399 -93992 -88281 133671
13446A33671P801K89885J62811j3605k54611k77853m8036l6316k6642K99372l258
$$ 133671 141472 431357 594168 580563 325952 48099 63 -36253 -62895 236477 233219
13435B33219o70m6818j08016j83314j86579k06285k3974N3860K87826K43539j56415
$$ 233219 232549 185731 77715 -105599 -292178 -498463 -522437 -468577 -180751 62788 -93627
13424i3627k58060j39428K37592J42610J63750O9625l88345P1251j5062P7757
$$ -93627 -351687 -491115 -253523 -110913 52837 122462 -265883 -194632 -209694 -131937
13414a31937P2753J9205J87587p6624j04082O9378q2632j90733j70754Q5139L18009
$$ -131937 -59184 -39979 147608 70984 -33098 36280 -46352 -237085 -407839 -322700 -4691
13403d691m0109j3115j30845m888J67416J06601P5813j31025l6219L6645j2692
$$ -4691 -44800 -57915 -188760 -193648 -26232 80369 156182 25157 -11062 25583 12891
13392A2891J00480J97687J65341q3479l32407j3320r1876q8766J60284N5434n7580
$$ 12891 113371 311058 476399 392920 60513 47193 -44683 -133449 26835 82269 24689
13381B4689J25834j07923o9948Q6405J64403N7630k20180j16861k28331l8314
$$ 24689 150523 42600 -27348 59057 223460 281090 60910 -55951 -284282 -322596
13371c22596K03155J45718J26185P7219q3903j45614m6871j02193Q816K89795
$$ -322596 -119441 26277 152462 229681 145778 164 -46707 -148900 -140084 149711
13361A49711K10454Q2392q3057j35063j77692j14331J43777J04714R8319j11158
$$ 149711 360165 442557 359500 224437 46745 -67586 76191 180905 279224 168066
13351A68066j3618j479k08171n3457l2330J03648j4333k67313k2230j1378J55148
$$ 168066 154448 152969 -55202 -108659 -140989 -37341 -51674 -318987 -341217 -352595 -197447
13340a97447j5963Q170R7640J16891L9461J08716l61691k41922K3145L40387J06950
$$ -197447 -213410 -205240 -107600 9291 48752 157468 -204223 -446145 -423000 -82613 24337
13329B4337J10763j38124j51028r8663K10965K96721M6748j06717l52591K1435
$$ 24337 135100 -3024 -154052 -252715 -41750 254971 301719 195002 -157589 -136154
$$ [...]
##END NTUPLES=NMR SPECTRUM
##END=
