##TITLE=Analysis number 318716
Compound Code cc 48446
Book Reference 454/152
Project Code adrs
Chemist Name stevep
##JCAMPDX= 6.0         $$ Bruker NMR JCAMP-DX V2.0
##DATA TYPE= NMR SPECTRUM
##DATA CLASS= NTUPLES
##ORIGIN= Bruker BioSpin GmbH
##OWNER= nmr
$$ XWIN-NMR		Version 3.5
$$ Tue Apr 11 09:55:35 2006 GMT Daylight Time (UT+1h)  MAYBRIDGE\nmr@NMR_250MHZ
##.OBSERVE FREQUENCY= 250.131544655141
##.OBSERVE NUCLEUS= ^1H
##.ACQUISITION MODE= SIMULTANEOUS (DQD)
##.ACQUISITION SCHEME= undefined
##.AVERAGES= 16
##.DIGITISER RES= 18
##SPECTROMETER/DATA SYSTEM= dpx250
##.PULSE SEQUENCE= zg30
##.SOLVENT NAME= CDCl3
##.SHIFT REFERENCE= (INTERNAL, CDCl3, 0, 16.522)
##AUDIT TRAIL= $$ (NUMBER, WHEN, WHO, WHERE, WHAT)
$$ ##TITLE= Audit trail, XWIN-NMR		Version 3.5
$$ ##JCAMPDX= 5.01
$$ ##ORIGIN= Bruker BioSpin GmbH
$$ ##OWNER= nmr
$$ C:\u/data/dgb/nmr/ADRS/2530/pdata/1/auditp.txt
$$ ##AUDIT TRAIL=  $$ (NUMBER, WHEN, WHO, WHERE, WHAT)
(   1,<2006-04-11 09:55:14.73 +100>,<MAYBRIDGE\nmr>,<NMR_250MHZ>,
      <created by zg, POWCHK disabled, PULCHK disabled
       configuration hash MD5:
       84 BC 41 DB A1 6E 1D 46 DA 25 12 A5 C1 ED C5 3A
       data hash MD5: 64K
       D4 89 5B 61 2B F8 34 5A D5 17 86 6D B1 09 D6 0D>)
(   2,<2006-04-11 09:55:26.74 +100>,<MAYBRIDGE\nmr>,<NMR_250MHZ>,
      <Start of raw data processing
       ef LB = 0.3 FT_mod = 6 PKNL = 1 SI = 32K 
       data hash MD5: 32K
       5A CD C5 C3 E3 F6 F6 A0 55 23 06 19 16 F7 C0 03>)
(   3,<2006-04-11 09:55:28.37 +100>,<MAYBRIDGE\nmr>,<NMR_250MHZ>,
      <apk 
       data hash MD5: 32K
       9D EF 17 DA 5A 9B C3 A3 B2 E6 FA BD 07 3B CD 29>)
(   4,<2006-04-11 09:55:29.15 +100>,<MAYBRIDGE\nmr>,<NMR_250MHZ>,
      <abs ABSG = 5 
       data hash MD5: 32K
       3D 04 59 BD 67 C6 23 CB DA A1 1F AC 62 E5 03 EB>)
$$ ##END=
$$ 
$$ hash MD5
$$ CB E5 8E 64 76 C9 06 E1 51 00 F4 80 F6 55 B2 0D
##$RELAX= 
##$RELAX= 
##$RELAX= 
##$RELAX= 
##$RELAX= 
##$RELAX= 
##$RELAX= 
$$ Bruker specific parameters
$$ --------------------------
##$DU= <C:\u>
##$EXPNO= 2530
##$NAME= <ADRS>
##$PROCNO= 1
##$TYPE= <nmr>
##$USER= <dgb>
##$AMP= (0..31)
100 100 100 100 100 100 100 100 100 100 100 100 100 100 100 100 100 100 
100 100 100 100 100 100 100 100 100 100 100 100 100 100 
##$AQSEQ= 0
##$AQ_mod= 3
##$AUNM= <au_zg>
##$AUTOPOS= <19 >
##$BF1= 250.13
##$BF2= 250.13
##$BF3= 250.13
##$BF4= 250.13
##$BF5= 500.13
##$BF6= 500.13
##$BF7= 500.13
##$BF8= 500.13
##$BYTORDA= 1
##$CFDGTYP= 0
##$CFRGTYP= 5
##$CHEMSTR= <none>
##$CNST= (0..31)
1 1 145 1 1 1 1 1 1 1 1 1 1 1 1 1 1 1 1 1 1 1 1 1 1 1 1 1 1 1 1 1 
##$CPDPRG= <>
##$CPDPRG1= <>
##$CPDPRG2= <>
##$CPDPRG3= <>
##$CPDPRG4= <mlev>
##$CPDPRG5= <mlev>
##$CPDPRG6= <mlev>
##$CPDPRG7= <mlev>
##$CPDPRG8= <mlev>
##$CPDPRGB= <>
##$CPDPRGT= <>
##$D= (0..31)
0 1 0 0 0 0 0 0 0 0.06 0 0 0 0 0 0 0.0002 0 0 0 0 0 0 0 0 0 0 0 0 0 0 
0 
##$DATE= 1144745713
##$DBL= (0..7)
120 120 120 120 120 120 120 120 
##$DBP= (0..7)
150 150 150 150 150 150 150 150 
##$DBP07= 0
##$DBPNAM0= <>
##$DBPNAM1= <>
$$ [...]
##$SUBNAM7= <"">
##$SUBNAM8= <"">
##$SUBNAM9= <"">
##$SW= 20.6930455092707
##$SWIBOX= (0..15)
0 0 3 0 0 0 0 0 0 0 0 0 0 0 0 0 
##$SW_h= 5175.983436853
##$TD= 65536
##$TD0= 1
##$TE= 294.16
##$TE2= 300
##$TE3= 300
##$TEG= 300
##$TL= (0..7)
0 120 120 120 120 120 120 120 
##$TP= (0..7)
150 150 150 150 150 150 150 150 
##$TP07= 0
##$TPNAME0= <>
##$TPNAME1= <>
##$TPNAME2= <>
##$TPNAME3= <>
##$TPNAME4= <>
##$TPNAME5= <>
##$TPNAME6= <>
##$TPNAME7= <>
##$TPOAL= (0..7)
0.5 0.5 0.5 0.5 0.5 0.5 0.5 0.5 
##$TPOFFS= (0..7)
0 0 0 0 0 0 0 0 
##$TUNHIN= 0
##$TUNHOUT= 0
##$TUNXOUT= 0
##$USERA1= <user>
##$USERA2= <user>
##$USERA3= <user>
##$USERA4= <user>
##$USERA5= <user>
##$V9= 5
##$VALIST= <valist>
##$VCLIST= <CCCCCCCCCCCCCCC>
##$VD= 0
##$VDLIST= <DDDDDDDDDDDDDDD>
##$VPLIST= <PPPPPPPPPPPPPPP>
##$VTLIST= <TTTTTTTTTTTTTTT>
##$WBST= 1024
##$WBSW= 4
##$XGAIN= (0..3)
0 0 0 0 
##$XL= 0
##$YL= 0
##$YMAX_a= 441199
##$YMIN_a= -558069
##$ZGOPTNS= <>
##$ZL1= 120
##$ZL2= 120
##$ZL3= 120
##$ZL4= 120
##$ABSF1= 16.522
##$ABSF2= -4.171173
##$ABSG= 5
##$ABSL= 3
##$ALPHA= 0
##$AQORDER= 0
##$ASSFAC= 0
##$ASSFACI= 0
##$ASSFACX= 0
##$ASSWID= 0
##$AUNMP= <proc_1d>
##$AZFE= 0.1
##$AZFW= 0.1
##$BCFW= 0
##$BC_mod= 0
##$BYTORDP= 0
##$COROFFS= 0
##$CY= 12.5
##$DATMOD= 1
##$DC= 0
##$DFILT= <>
##$DTYPP= 0
##$F1P= 14.0000005364418
##$F2P= -0.99999901652339
##$FCOR= 0.5
##$FTSIZE= 32768
##$FT_mod= 6
##$GAMMA= 0
##$GB= 0
##$INTBC= 1
##$INTSCL= 1
##$ISEN= 128
##$LB= 0.3
##$LEV0= 0
##$LPBIN= 0
##$MAXI= 10000
##$MC2= 0
##$MEAN= 0
##$ME_mod= 0
##$MI= 0
##$NCOEF= 0
##$NC_proc= -3
##$NLEV= 6
##$NOISF1= 0
##$NOISF2= 0
##$NSP= 0
##$NTH_PI= 0
##$NZP= 0
##$OFFSET= 16.522
##$PC= 1
##$PHC0= 171.3616
##$PHC1= 6.650484
##$PH_mod= 1
##$PKNL= yes
##$PPARMOD= 0
##$PSCAL= 4
##$PSIGN= 0
##$REVERSE= no
##$SF= 250.13
##$SI= 32768
##$SIGF1= 0
##$SIGF2= 0
##$SINO= 400
##$SIOLD= 32768
##$SREGLST= <1H.CDCl3>
##$SSB= 0
##$STSI= 32768
##$STSR= 0
##$SW_p= 5175.98343685301
##$SYMM= 0
##$S_DEV= 0
##$TDeff= 65536
##$TDoff= 0
##$TI= <Analysis number 999999
Compound Code 99
Book Reference 9
Project Code 9>
##$TILT= no
##$TM1= 0
##$TM2= 0
##$TOPLEV= 0
##$USERP1= <user>
##$USERP2= <user>
##$USERP3= <user>
##$USERP4= <user>
##$USERP5= <user>
##$WDW= 1
##$XDIM= 32768
##$YMAX_p= 374330115
##$YMIN_p= -89142
$$ End of Bruker specific parameters
$$ ---------------------------------
##NTUPLES= NMR SPECTRUM
##VAR_NAME=  FREQUENCY,     SPECTRUM/REAL,   SPECTRUM/IMAG
##SYMBOL=    X,             R,               I
##VAR_TYPE=  INDEPENDENT,   DEPENDENT,       DEPENDENT
##VAR_FORM=  AFFN,          ASDF,            ASDF
##VAR_DIM=   32768,         32768,           32768
##UNITS=     HZ,            ARBITRARY UNITS, ARBITRARY UNITS
##FACTOR=    0.157963299565203, 1,           1
##FIRST=     4132.6476996994, 0,             0
##LAST=      -1043.33573715361, 0,           0
##MIN=       -1043.33573715361, -89142,      0
##MAX=       4132.6476996994, 374330115,     0
$$ Real data points
##PAGE= N=1
##DATA TABLE= (X++(R..R)), XYDATA
$$ [...]
$$ plain form
16594 5780 -15731 -21501 -6544 -1756 -762 -27889 -45668 -30945 -37081 -38480 -32884 -20524 -36219
16581 -36219 -33435 -23807 -31737 -36512 -5867 12317 14402 3316 -34765 -87697 -76277 -46238 -34329
16568 -34329 -28956 -14445 -17847 -30211 -19897 4038 18739 25492 32861 27702 21682 7107 -20945
16555 -20945 -23845 -23893 -28498 -9402 4507 28533 16307 -22871 -14615 10897 15230 9460 25417
16542 25417 23774 -2551 -28932 -40195 -23654 -6835 -1217 -5727 -3038 -1395 -17933 -22685 -22643
16529 -22643 -38421 -62078 -69703 -26555 -12368 -29264 -9029 -9343 5601 38981 43252 22063
16517 22063 -2507 -14781 -29983 -17494 14082 38639 32388 18339 4691 -11899 -9000 -2308
16505 -2308 8230 13543 27823 24645 23666 23678 -9866 -16377 -4831 -3719 15809 16605 13050 26467
$$ packed form
16594E780k1511n770J4957M788R94k7127j7779J4723o136j399N596J2360j5695
16581c6219K784R628p930m775L0645J8184K085j1086l8081n2932J1420L0039J1909
16568c4329N373J4511l402j2364J0314K3935J4701O753P369n159o020j4575k8052
16555b0945k900m8m605J9096J3909K4026j2226l9178Q256K5512M333n770J5957
16542B5417j643k6325k6381j1263J6541J6819N618m510K689J643j6538m752M2
16529b2643j5778k3657p625M3148J4187j6896K0235l14J4944L3380M271k1189
16517B2063k4570j2274j5202J2489L1576K4557o251j4049j3648j6590K899O692
16505b308J0538N313J4280l178r79J2l3544o511J1546J112J9528P96l555J3417
$$ plain form
16491 26467 22597 15204 25474 26269 5014 2365 4205 5221 9294 -28417 -19719 -33908 -53215
16478 -53215 -45447 -50344 -36352 -25737 -28235 -35181 -7542 1261 -18114 -19327 -26135 -36296 -63219
16465 -63219 -38593 -31336 -28909 39 12466 -632 -3541 -20477 -24005 -29539 -37322 -41576 -35783
16452 -35783 -48994 -52979 -54976 -36928 -23711 -20781 -16084 -15524 -4169 10373 11510 -1717 18182
16439 18182 16437 24256 29595 32853 32535 24786 13509 427 27840 32268 22073 10213 -5829
16426 -5829 -34552 -7907 36564 30528 6119 3290 19179 22008 4744 -21940 -9252 -8931 -16287
16413 -16287 -26268 -50116 -42283 -46615 -47720 -41234 -38200 -10832 -15182 -19451 -18243 -18630 5762 2811
16399 2811 22643 31932 10631 7477 19387 16323 15946 25666 42501 41810 18631 24264 14130 9080
$$ packed form
16491B6467l870p393J0270P95k1255k649J840J016M073l7711Q698j4189j9307
16478e3215P768m897J3992J0615k498o946K7639Q803j9375j213o808j0161k6923
16465f3219K4626P257K427K8948J2427j3098k909j6936l528n534p783m254N793
16452c5783j3211l985j997J8048J3217K930M697N60J1355J4542J137j3227J9899
16439A8182j745P819N339L258l18p749j1277j3082K7413M428j0195j1860j6042
16426e829k8723K6645M4471o036k4409k829J5889K829j7264k6684J2688L21p356
16413a6287r981k3848P833m332j105O486L034K7368m350m269J208l87K4392k951
16399B811J9832R289k1301l154J1910l064l77R720J6835o91k3179N633j0134n050
$$ plain form
16385 9080 5654 8503 2574 24928 26075 20051 17978 14400 15361 13971 10382 15339 40929 27361
16371 27361 -820 -239 32424 26369 20782 8159 2683 -1676 -5026 -17386 -10945 -21625 -21512 -13319
16357 -13319 -2897 6923 31319 41941 22655 293 8048 31786 30443 17381 -13688 -2273
16345 -2273 1887 -12281 -8767 -7186 9667 14284 5629 -6401 1810 -6087 911 -1629 -989 21471
16331 21471 38088 31855 -692 -24184 -32870 -41350 -42061 -38877 -11576 17733 4453 -15575 -5783
16318 -5783 4566 -480 10035 -2393 -15615 -13189 -15242 -44696 -36450 -13994 -11582 17686 27249
16305 27249 41645 34590 42878 36841 29095 42855 25575 15488 -1245 -3837 3668 -621 6361
16292 6361 1683 6051 22150 13664 6859 -2353 -2594 -15190 -37154 -10443 13171 5544 -23893
$$ packed form
16385I080l426K849n929K2354J147o024k073l578R61j390l589M957K5590j3568
16371B7361k8181N81L2663o055n587j2623n476m359l350j2360O441j0680J13Q193
16357a3319J0422R820K4396J0622j9286k2362P755K3738j343j3062l1069J1415
16345b273M160j4168L514J581J6853M617q655j2030Q211p897O998k540O40K2460
16331B1471J6617o233l2547k3492q686q480p11L184K7301K9309j3280k0028R792
16318e783J0349n046J0515j2428j3222K426k053k9454Q246K2456K412K9268R563
16305B7249J4396p055Q288o037p746J3760j7280j0087j6733k592P505m289O982
16292F361m678M368J6099q486o805r212k41j2596k1964K6711K3614p627k9437
$$ plain form
16279 -23893 -25898 -20377 -2930 17975 17052 -4591 -5864 13795 6659 4283 35383 35000 46344
16266 46344 41954 38486 37946 51619 41389 10376 -9097 -22533 -5533 -12103 -4840 -4067 371
16253 371 -14518 -10132 4930 -6414 -1076 9309 3588 -1519 -15123 6190 -4075 -28281 -26024
16240 -26024 -16246 -22575 -11450 -5551 -5835 -27294 -35423 -26761 -35713 -10147 -7538 -1519 -26030 -18733
16226 -18733 -11438 1515 -982 819 -14514 -8792 -12485 -18749 8712 12082 2305 11902 10405 4783
16212 4783 2013 4052 -14619 -12336 -5120 -9402 -8428 -19094 -26250 -23097 -29636 -20587 15162 41380
16198 41380 39094 11927 -8726 -17464 -17446 -24874 -23306 -21725 -16248 -3356 -4861 3767 1250 -13896
16184 -13896 -11754 -20502 -6420 -24993 -30791 -35524 -26358 -35461 -25104 -12764 7974 1254 -24398
$$ packed form
16279b3893k005N521J7447K0905r23k1643j273J9659p136k376L1100l83J1344
16266D6344m390l468n40J3673j0230l1013j9473j3436J7000o570P263P73M438
16253C71j4889M386J5062j1344N338J0385n721n107j3604K1313j0265k4206K257
16240b6024R778o329J1125N899k84k1459q129Q662q952K5566K609O019k4511P297
16226a8733P295J2953k497J801j5333N722l693o264K7461L370r777R597j497n622
16212D783k770K039j8671K283P216m282R74j0666p156L153o539R049L5749K6218
16198D1380k286k7167k0653q738J8p428J568J581N477J2892j505Q628k517j5146
16184a3896K142q748J4082j8573n798m733R166r103J0357J2340K0738o720k5652
$$ plain form
16171 -24398 -33476 -13801 -6681 -36692 -49169 -28250 -7719 -3537 5794 -1852 -20272 -34475 -20802
16158 -20802 -27318 -12898 28667 45873 19104 -14313 -18043 -19366 -26885 -4476 -1975 1076 11903
16145 11903 18086 2105 -18589 -14854 -26473 -28629 -36214 -40033 -35259 -14288 -6740 -2246 -5575
16132 -5575 -12331 -14108 -2391 -5859 6472 -2738 -9504 -16536 -2680 -6962 -11592 -25015 -8507
16119 -8507 14236 -3664 -6692 -22383 -21691 -38010 -20749 -17565 -18908 -25281 -18724 -12956 -14630 -13285
16105 -13285 -9472 -3306 -27770 -33607 -14325 -9228 -31973 -27828 -15602 -3165 -10317 -14888 -34448
16092 -34448 -39039 -46125 -23410 11193 12529 7918 10901 18824 12532 -9031 -30084 -50639 -36000
16079 -36000 -6824 -2887 2450 -137 3718 9300 13014 -5875 8001 9901 14991 11860 -27317
$$ packed form
16171b4398r078J9675P120l0011j2477K0919K0531M182R331p646j8420j4203J3673
16158b0802o516J4420M1565J7206k6769l3417l730j323p519K2409K501L051J0827
16145A1903O183j5981k0694L735j1619k156p585l819M774K0971P548M494l329
16132e575o756j777J1717l468J2331r210o766p032J3856m282m630j3423J6508
16119h507K2743j7900l028j5691O92j6319J7261L184j343o373O557N768j674J345
16105a3285L813O166k4464n837J9282N097k2745M145J2226J2437p152m571j9560
16092c4448m591p086K2715L4603J336m611K983P923o292k1563k1053k0555J4639
16079c6000K9176L937N337k587L855N582L714j8889J3876J900N090l131l9177
$$ plain form
16066 -27317 -38785 -29395 -15529 -20449 -15316 -620 10287 107 19297 10200 15656 18771 4005
16053 4005 -7161 2339 -25140 -42713 -30021 -27403 -20508 -4159 18988 15224 32871 23651 24972
16040 24972 37806 43951 30592 21249 14310 2401 -15095 -8117 -1618 410 -9909 -12820 -18397
16027 -18397 -42247 -47926 -22515 -8247 14825 -3411 -31007 -41826 -19458 -7046 -12058 -2250
16015 -2250 -3785 9405 -3815 -26495 -16199 -17247 -21018 -34038 -30879 -21132 5712 14963 -22194
16002 -22194 -22616 -32039 -46592 -64488 -47226 -8107 22052 30738 21861 30710 31331 27433 21803 27468
15988 27468 41300 69791 55104 11431 -5343 -8055 -10765 -26066 -37283 -38401 -35818 -44970 -60528
15975 -60528 -50298 -556 18591 14018 -14475 -8052 -25004 -23277 -797 6465 -15906 -24936 -21580
$$ packed form
16066b7317j1468R390J3866m920N133J4696J0907j0180J9190r097N456L115j4766
16053D005j1166R500k7479j7573J2692K618O895J6349K3147l764J7647r220J321
16040B4972J2834O145j3359r343o939j1909j7496O978O499K028j0319k911n577
16027a8397k3850n679K5411J4268K3072j8236k7596j0819K2368J2412n012R808
16015b250j535J3190j3220k2680J0296j048l771j3020L159R747K6844R251l7157
16002b2194m22r423j4553j7896J7262L9119L0159Q686q877Q849O21l898n630N665
15988B7468J3832K8491j4687m3673j6774k712k710j5301j1217j118K583r152j5558
15975f0528J0230M9742J9147m573k8493O423j6952J727K2480P262k2371r030L356
$$ plain form
15962 -21580 -22425 -29907 -36755 -35000 -31258 -10601 6308 12025 10866 -14564 -28000 -25596 -3105
15949 -3105 13319 -24419 -48794 -68608 -64233 -28448 -18783 -11583 5141 23858 33634 30216 35773
15936 35773 25638 19660 -2088 -13300 -29882 -40065 -27036 -29076 -29248 -11328 -163 17512
15924 17512 28137 32757 9545 -4290 11415 12050 18525 8989 -8165 -9050 2048 7545 3985
15911 3985 20184 11759 2669 4635 6398 26547 52586 57481 33828 15319 4577 21026 20004
15898 20004 -31700 -42875 -33160 -9003 3939 25908 -6127 -7884 36360 45140 29253 4770
15886 4770 -20450 -1660 35 -7723 -31504 -34073 -6386 29845 15533 -24505 -35906 -18667
15874 -18667 -12095 -17284 -20515 -29734 -18878 -4563 -1777 606 -31909 -49354 -37762 -8156 -4722
$$ packed form
15962b1580q45p482o848J755L742K0657J6909N717j159k5430j3436K404K2491
15949c105J6424l7738k4375j9814M375L5785R665P200J6724J8717R776l418N557
15936C5773j0135n978k1748j1212j6582j0183J3029k040j72J7920J1165J7675
15924A7512J0625M620k3212j3835J5705O35O475r536j7154q85J1098N497l560
15911C985J6199q425r090J966J763K0149K6039M895k3653j8509j0742J6449j022
15898B0004n1704j1175R715K4157J2942K1969l2035j757M4244Q780j5887k4483
15886D770k5220J8790J695p758k3781k569K7687L6231j4312m0038j1401J7239
15874a8667O572n189l231r219J0856J4315K786K383l2515j7445J1592K9606L434
$$ plain form
15861 -4722 87 2305 -3281 -191 -21199 -18284 10059 43093 27899 14982 -1733 5010 5582
15848 5582 12525 9468 13026 21027 -12182 -18528 -12020 -1272 -3170 -12490 -9437 -12608 -16343 -8398
15834 -8398 -3845 -10714 -25205 -11282 -2707 10957 35309 17384 -1140 -7497 -16212 -9279 -21153
15821 -21153 -24206 -25095 -23229 -17842 -9573 -2571 -12854 -6784 -2427 -19435 -21247 630 26174 1342
15807 1342 -16083 353 3610 -5192 -1450 6100 -24566 -40489 -20064 617 32176 29227 24783
15794 24783 28924 27986 20437 7491 -3235 5986 23011 37282 25766 21041 13094 -1129 -1400
15781 -1400 -4115 -4768 745 -8669 12479 49671 49701 35027 14773 19972 26003 -9521 -24102 -10940
15767 -10940 -4110 9240 14522 17348 -9506 -15481 -32400 -37265 -18895 -28101 -23075 -7934 3203
$$ packed form
15861d722M809K218n586L090k1008K915K8343L3034j5194j2917j6715O743N72
15848E582O943l057L558Q001l3209o346O508J0748j898r320L053l171l735P945
15834h398M553o869j4491J3923Q575J3664K4352j7925j8524o357q715O933j1874
15821b1153l053q89J866N387Q269P002j0283O070M357j7008j812K1877K5544k4832
15807A342j7425J6436L257q802L742P550l0666j5923K0425K0681L1559k949m444
15794B4783M141r38p549j2946j0726R221J7025J4271j1516m725p947j4223k71
15781a400k715o53N513r414K1148L7192L0j4674k0254N199O031l5524j4581J3162
15767a0940O830J3350N282K826k6854n975j6919m865J8370r206N026J5141J1137
$$ plain form
15754 3203 -15085 -15837 -3885 -14229 -7755 -14314 -16879 -10787 -29510 -26091 -19361 -17210 -35929 -20041
15740 -20041 -12470 -19986 -18946 605 -18975 -27803 -6003 9281 -251 -11744 -7053 3952 29342
15727 29342 10 -4243 8935 16672 -36621 -67263 -59013 -29752 -10687 -30711 -31397 -23064 -22416
15714 -22416 -30182 -8956 631 -13296 -3316 -11964 -497 -10270 -34328 -53810 -49552 -49471 -43066 -28813
15700 -28813 -29585 -28357 -27530 -25139 -20472 -22731 -33917 -31999 -14872 -35692 -34562 -30515 -25219 -34485
15686 -34485 -12997 -1357 -10527 -9988 2326 16675 12236 -3424 -1946 4475 4772 -13728 992
15673 992 4491 -21649 -27318 4121 -4352 11799 2248 -4708 -15918 -20903 -27206 -17083 -21607 -16644
15659 -16644 -12385 -14616 -32653 -48450 -61886 -40576 -10415 7630 24248 37154 22895 24817
$$ packed form
15754C203j8288p52J1952j0344O474o559k565O092j8723L419O730K151j8719J5888
15740b0041P571p516J040J9551j9580q828K1800J5284r532j1493M691J1005K5390
15727B9342k9332m253J3178P737n3293l0642Q250K9261J9065k0024o86Q333O48
15714b2416p766K1226R587j3927R980q648J1467r773k4058j9482M258Q1O405J4253
15700b8813p72J228Q27K391M667k259j1186J918J7127k0820J130M047N296r266
15686c4485K1488J1640r170N39J2314J4349m439j5660J478O421K97j8500J4720
15673I92L499k6140n669L1439q473J6151r551o956j1210m985o303J0123m524M963
15659a6644M259k231j8037j5797j3436K1310L0161J8045J6618J2906j4259J922
$$ plain form
15647 24817 8085 12738 27890 20891 -3061 -10016 -17295 -14535 -24211 -48059 -35247 -23976 -30487
15634 -30487 -32135 -16805 -10581 -706 -7208 -6478 -10043 -21145 -35486 -36903 -31940 -28820 3301 28886
15620 28886 40455 28983 7257 3705 -30486 -43736 -32881 -31470 -15323 -13195 -3484 4337 -28078
15607 -28078 -35904 -20811 -2891 -15797 -12993 937 10264 7796 -13514 -38848 -35501 -8465 17043
15594 17043 -8561 -17697 -15490 1286 14121 8341 -12109 -12496 -9787 -24665 -12516 10710 26035
15581 26035 34247 42841 21095 12784 10971 17769 6643 -4097 -30081 -24206 -29635 -39212 -27929
15568 -27929 -58212 -67024 -50140 -899 27905 13341 -6984 10170 3117 2465 16016 18815 -8305
15555 -8305 -17816 -46149 -60271 -39671 -19266 -9867 546 -1854 27318 45756 15852 -18336
$$ packed form
15647B4817j6732M653J5152o999k3952o955p279K760r676k3848J2812J1271o511
15634c0487j648J5330O224R875o502P30l565j1102j4341j417M963L120L2121K5585
15620B8886J1569j1472k1726l552l4191j3250J0855J411J6147K128R711P821l2415
15607b8078p826J5093J7920j2906K804J3930R327k468k1310k5334L347K7036K5508
15594A7043k5604r136K207J6776J2835n780k0450l87K709j4878J2149K3226J5325
15581B6035Q212Q594k1746q311j813O798j1126j0740k5984N875n429r577J1283
15568b7929l0283q812J6884M9241K8804j4564k0325J7154p053o52J3551K799k7120
15555h305r511k8333j4122K0600K0405R399J0413k400K9172J8438k9904l4188
$$ plain form
15543 -18336 -21591 -18719 -18061 1926 3044 -5285 5297 11442 -2679 -42658 -47251 -38500 -37571 -7351
15529 -7351 -8137 9687 30799 21036 -3742 -2603 -6372 -39420 -39803 8981 40155 15480 15305 25837
15515 25837 10730 -21349 -24499 -26438 -32110 -27378 -37883 -47069 -30727 -22395 -19962 -1913 19336
15502 19336 5550 -8638 -23306 -51010 -48544 -47024 -44529 -9926 26881 19799 26762 22903 29570
15489 29570 19214 16736 36097 45040 15795 10511 6880 -3361 -20409 -2062 -811 -8022 4137
15476 4137 10715 24349 36731 22723 15605 5675 20029 26420 -15235 -36160 -24616 9279 7716
15463 7716 -5645 -17030 -18976 -9584 -15814 -23020 -19424 13326 42471 29456 13531 9158 -4074
15450 -4074 10843 23549 23204 5871 5157 26143 35339 5126 3410 13900 -16638 -38391 -25705
$$ packed form
15543a8336l255K872O58J9987J118q329J0582O145j4121l9979m593Q751R29L0220
15529g351p86J7824K1112r763k4778J139l769l3048l83M8784L1174k4675j75J0532
15515B5837j5107l2079l150j939n672M732j0505r186J6342Q332K433J8049K1249
15502A9336j3786j4188j4668k7704K466J520K495L4603L6807p082O963l859O667
15489B9570j0356k478J9361Q943k9245n284l631j0241j7048J8347J251p211J2159
15476D137O578J3634J2382j4008p118r930J4354O391m1655k0925J1544L3895j563
15463G716j3361j1385j946R392o230p206L596L2750K9145j3015j5925m373j3232
15450d074J4917J2706l45j7333p14K0986R196l0213j716J0490l0538k1753J2686
$$ plain form
15437 -25705 1334 16954 23119 14383 17906 47333 45192 8004 -21363 -919 21157 31293
15425 31293 20792 17606 -16602 -47219 -8449 38364 52089 38579 29060 954 -13639 -18562
15413 -18562 -24877 -34704 -27273 5779 27310 22238 -9224 -3807 6292 1614 19071 26987 3454
15400 3454 -9489 -13001 7055 18971 2118 -905 -13715 -20984 -14019 -7726 15051 29075 42899
15387 42899 38159 10113 5373 7503 453 16673 25146 26303 27804 12428 12298 22151 27865 19306
15373 19306 23092 19667 5812 7557 9986 6037 1420 4427 17084 30985 16890 13247 13627 7055
15359 7055 -10805 -12628 1530 29159 9745 -7970 -8806 -26162 -58400 -72161 -54963 -30010
15347 -30010 -1048 -15811 -56323 -35106 -1339 7970 -3650 4315 6850 12946 26493 36986
$$ packed form
15437b5705K7039J5620O165q736L523K9427k141l7188k9367K0444K2076J0136
15425C1293j0501l186l4208l0617L8770M6813J3725j3510r519k8106j4593m923
15413a8562o315r827P431L3052K1531n072l1462N417J0099m678J7457P916k3533
15400C454j2943l512K0056J1916j6853l023j2810p269O965O293K2777J4024J3824
15387D2899m740k8046m740K130p050J6220Q473J157J501j5376j30R853N714q559
15373A9306L786l425j3855J745K429l949m617L007J2657J3901j4095l643L80o572
15359G055j7860j823J4158K7629j9414j7715q36j7356l2238j3761J7198K4953
15347c0010K8962j4763m0512K1217L3767R309j1620P965K535O096J3547J0493
$$ plain form
15335 36986 7932 -4159 -10502 -19917 -3498 15937 12614 -6872 -9791 3430 6614 21282 14543
15322 14543 6044 -12232 -6064 3703 22450 16447 1493 -13394 -578 -15159 -2457 804 19449
15309 19449 5148 636 343 -2322 -34320 -36418 -11122 -9449 -15988 6694 -3858 -49277 -64662
15296 -64662 -50708 -63073 -69652 -60830 -47551 -21688 -23645 -32292 -4574 13261 765 -5411 -26656
15283 -26656 -19522 -9945 -19509 -36129 -39590 -18510 -16660 9881 11551 -25507 -24507 19420 32653
15270 32653 26850 17389 -6279 -18341 -17745 -38349 -50427 -24952 -20977 -22276 -6403 -9604 -14665
15257 -14665 -19159 -10091 -5726 -11975 -9416 -15629 14651 9789 -23226 -11865 -28535 -38471 -23086
15244 -23086 9672 826 3748 16314 -6972 -19854 -15041 -8234 -6259 -10732 -23652 -34723 -48703
$$ packed form
15335C6986k9054j2091o343r415J6419J9435l323j9486k919J3221L184J4668o739
15322A4543q499j8276O168R767J8747o003j4954j4887J2816j4581J2702L261J8645
15309A9449j4301m512k93k665l1998k098K5296J673o539K2682j0552m5419j5385
15296f4662J3954j2365o579Q822J3279K5863j957q647K7718J7835j2496o176k1245
15283b6656P134R577r564j6620l461K1080J850K6541J670l7058J000M3927J3233
15270C2653n803r461k3668j2062N96k0604j2078K5475L975j299J5873l201n061
15257a4665m494R068M365o249K559o213L0280m862l3015J1361j6670r936J5385
15244b3086L2758q846K922J2566k3286j2882M813O807J975m473j2920j1071j3980
$$ plain form
15231 -48703 -27463 -22251 -21146 -20372 -3756 -9151 800 -21467 -13118 -44054 -58245 -57392 -51438 -40915
15217 -40915 -14881 -18632 -11118 9100 15566 17240 -6891 1114 29393 33255 27706 18466 -8309
15204 -8309 -29728 -23807 -12995 5454 21671 2094 -2378 3981 -1553 10368 17578 -2842 -43033
15191 -43033 -43096 -7533 -18436 -14961 -13464 -20598 -23325 -27823 -46520 -50249 -40470 -22016 -8212 -28804
15177 -28804 -25119 -13203 -6329 -25188 -42860 -38777 -20349 -8892 5831 30718 59867 49026
15165 49026 20932 31804 29320 -1230 7296 24289 30058 27082 21423 9888 1117 15486 23879
15152 23879 15556 -3241 -10694 10011 1079 -6636 -9073 -20859 1945 27439 28515 8253 2199
15139 2199 -2167 -21787 -2240 8051 -21199 -22869 -18433 -5333 -1955 4907 -926 1853 4138
$$ packed form
15231d8703K1240N212J105P74J6616n395R951k2267Q349l0936j4191Q53N954J0523
15217d0915K6034l751P514K0218O466J674k4131Q005K8279L862n549r240k6775
15204h309k1419N921J0812J8449J6217j9577m472O359n534J1921P210k0420m0191
15191d3033o3L5563j0903L475J497p134k727m498j8697l729R779J8454J3804k0592
15177b8804L685J1916O874j8859j7672M083J8428J1457J4723K4887K9149j0841
15165D9026k8094J0872k484l0550Q526J6993N769k976n659j1535q771J4369Q393
15152B3879q323j8797p453K0705q932p715k437j1786K2804K5494J076k0262o054
15139B199m366j9620J9547J0291k9250j670M436J3100L378O862n833K779K285
$$ plain form
15126 4138 -14207 -43908 -35309 1000 16365 18683 41043 40023 34972 22706 17217 19740 30878
15113 30878 32679 32883 18538 4948 -8097 -9332 15097 25195 23451 18415 27745 25289 17670
15100 17670 17263 26240 13440 28817 32544 33771 36911 47734 16706 -2772 -17798 -530 23852
15087 23852 37193 9134 -32750 -49985 -40167 -23770 -4848 -18796 -36185 -40016 -29493 -32746
15075 -32746 -47956 -25971 -19648 -11010 -24919 17479 18559 -7533 686 -11808 -13274 -3046 -3209
15062 -3209 -19047 14560 32067 7201 6818 8732 7343 3585 11645 12611 -2712 -9585 -16164 -31374
15048 -31374 -35940 -20998 -5955 -15382 -2424 14872 27183 7605 13118 -3767 -9554 -7604 -22500
15035 -22500 -19661 -13879 -20682 -33202 -42607 -34651 -34256 -22651 -29645 -48497 -30270 -5460 -814
$$ packed form
15126D138j8345k9701Q599L6309J5365K318K2360j020n051j2266n489K523J1138
15113C0878J801K04j4345j3590j3045j235K4429J0098j744n036R330k456p619
15100A7670m07Q977j2800J5377L727J227L140J0823l1028j9478j5026J7268K4382
15087B3852J3341k8059m1884j7235R818J6397J8922j3948j7389l831J0523l253
15075c2746j5210K1985O323Q638j3909M2398J080k6092Q219j2494j466J0228j63
15062c209j5838L3607J7507k4866l83J914j389l758Q060R66j5323o873o579j5210
15048c1374m566J4942J5043r427J2958J7296J2311j9578N513j6885n787J950j4896
15035b2500K839N782o803j2520r405P956L95J1605o994j8852J8227K4810M646
$$ plain form
15022 -814 -7601 -9801 -17246 -14379 -7222 2355 -6189 -17237 4327 22809 7812 1681 -15014 -21546
15008 -21546 -24130 -36350 -33407 -9864 8004 5810 -8143 -5041 -3426 -21978 104 19526 -10768
14995 -10768 -10531 8166 -13071 -18721 -5997 -19691 -36907 -16731 -16178 -20425 -34628 -26129 -31601
14982 -31601 -18142 -4247 -15276 -14872 -3094 26324 48387 43088 32178 -19936 -42337 -14669
14970 -14669 1958 11181 -8939 -17046 -1636 -14052 -33644 -31512 -40765 -56567 -46185 730
14958 730 4110 -10411 -32169 -46250 -48456 -31081 -26437 -25160 -33273 -38546 -40370 -17489 -18718 -35254
14944 -35254 -26796 -40260 -28614 2110 -6539 -10996 -2074 -8099 -15296 663 -534 -23185 -25888
14931 -25888 -4390 28262 5681 10825 19999 4127 -11503 7090 20673 11350 43084 13843
$$ packed form
15022h14o787k200p445K867P157R577q544j1048K1564J8482j4997o131j6695o532
15008b1546k584j2220K943K3543J7868k194j3953L102J615j8552K2082J9422l0294
14995a0768K37J8697k1237n650J2724j3694j7216K0176N53m247j4203Q499n472
14982c1601J3459J3895j1029M04J1778K9418K2063n299j0910n2114k2401K7668
14970a4669J6627R223k0120q107J5410j2416j9592K132r253j5802J0382M6915
14958G30L380j4521k1758j4081k206J7375M644J277q113n273j824K2881j229j6536
14944c5254Q458j3464J1646L0724q649m457Q922o025p197J5959j197k2651k703
14931b5888K1498L2652k2581N144R174j5872j5630J8593J3583r323L1734k9241
$$ plain form
14919 13843 -8983 12252 7966 9741 2365 -18798 -19765 -10057 -27266 -50742 -59969 -47092 -49376
14906 -49376 -35376 -5681 -4722 -9936 -1019 1686 -5113 -7883 15735 7625 -5240 -26250 -31589
14893 -31589 -45922 -46592 -39348 -23481 -7151 -2831 -12294 -10691 -15338 -8926 -22793 -31253 -23778 -12226
14879 -12226 -4655 12180 8796 15800 24701 36934 36233 8904 -1252 -9437 -17905 -4513 13952
14866 13952 8764 -6775 -10888 -6311 -17742 -24267 -39470 -23513 8534 27853 38423 17099
14854 17099 -8479 -29529 -37989 -49917 -45093 -39558 -33005 -22597 -31670 -17492 -6525 -18489 -14063
14841 -14063 -12607 10380 140 -39455 -56925 -37629 -28095 -27145 -40563 -22510 -836 5212 3737
14828 3737 28752 8091 8121 16042 7373 -997 -20958 -32375 -27621 -27094 -35543 -44118 -20314 1526
$$ packed form
14919A3843k2826K1235m286J775p376k1163r67R708j7209k3476r227J2877k284
14906d9376J4000K9695R59n214Q917K705o799k770K3618q110j2865k1010n339
14893c1589j4333o70P244J5867J6330M320r463J603m647O412j3867q460P475J1552
14879a2226P571J6835l384P004Q901J2233p01k7329j0156q185q468J3392J8465
14866A3952n188j5539m113M577j1431o525j5203J5957L2047J9319J0570k1324
14854A7099k5578k1050q460j1928M824N535O553J0408r073J4178J0967j1964M426
14841a4063J456K2987j0240l9595j7470J9296R534R50j3418J8053K1674O048j475
14828C737K5015k0661L0P921q669q370j9961j1417M754N27q449q575K3804K1840
$$ plain form
14814 1526 19015 24651 5462 -143 12829 7581 -17776 -27084 -30755 -46754 -29636 -21326 -14082
14801 -14082 -24778 -32381 -28080 -17529 5785 -854 -14042 -22121 -2165 -18963 -30716 -47864
14789 -47864 -34181 -5326 -10786 -19773 -1433 -171 -4915 -11187 -10371 13026 34487 41080 10427
14776 10427 -25839 -789 10638 11791 -9100 6786 30550 20799 22958 20094 -4461 -29165
14764 -29165 -9804 21850 16976 12351 5735 -11324 -10403 -10127 -2554 -7205 481 17429 -3023 311
14750 311 -1162 1384 -1857 16263 27137 44507 67993 53346 33417 26674 9438 -1651 2048
14737 2048 -14846 -7666 6194 -16935 -35940 -37641 -41038 -50578 -47009 -36603 -8202 3233 34181
14724 34181 30898 7799 -5579 1021 5851 17229 23288 26641 39678 32133 -4361 -35826 -15732
$$ packed form
14814A526J7489N636j9189n605J2972n248k5357r308l671j5999J7118Q310P244
14801a4082j0696p603M301J0551K3314o639j3188q079J9956j6798j1753j7148
14789d7864J3683K8855n460q987J8340J262m744o272Q16K3397K1461O593l0653
14776A0427l6266K5050J1427J153k0891J5886K3764r751K159k864k4555k4704
14764b9165J9361L1654m874m625o616j7059R21K76P573m651P686J6948k0452L334
14750C11j473K546l241J8120J0874J7370K3486j4647j9929o743j7236j1089L699
14737B048j6894P180J3860k3129j9005j701l397r540L569J0406K8401J1435L0948
14724C4181l283k3099j3378O600M830J1378O059L353J3037p545l6494l1465K0094
$$ plain form
14711 -15732 9390 23233 15993 15504 16040 8918 17866 39172 52468 59970 62622 38316 39507 34739
14697 34739 11729 -5951 -14214 -10426 -6959 4333 1653 -2176 -12481 -18297 -19882 -19240 -6190
14684 -6190 3496 16053 -149 -24910 -45778 -37136 -11965 -12595 -21680 -19129 4721 5541 26577
14671 26577 47686 62468 47630 12433 5670 2060 -14166 -44913 -27853 -12621 8062 11605
14659 11605 9628 16221 4690 18263 14719 6735 5801 -11808 -27505 -18845 13654 50943 17044
14646 17044 558 -748 14954 31814 40119 33471 20669 12203 -5297 3590 15814 -12413 -17255
14633 -17255 -30734 -13898 25922 22083 200 8419 30980 21053 13253 3389 -1587 -17460 -23997
14620 -23997 -31516 -24019 -3288 -5556 -6795 29292 9875 6993 9678 -17417 -20422 -19469 -27659 -21079
$$ packed form
14711a5732K5122J3843p240m89N36p122Q948K1306J3296P502K652k4306J191m768
14697C4739k3010j7680q263L788L467J1292k680l829j0305n816j585O42J3050
14684f190R686J2557j6202k4761k0868Q642K5171o30r085K551K3850Q20K1036
14671B6577K1109J4782j4838l5197o763l610j6226l0747J7060J5232K0683L543
14659A1605j977O593j1531J3573l544p984r34j7609j5697Q660L2499L7289l3899
14646A7044j6486j306J5702J6860Q305o648j2802q466j7500Q887J2224k8227m842
14633a7255j3479J6836L9820l839k1883Q219K2561r927p800r864m976j5873o537
14620b3997p519P497K0731k268j239L6087j9417k882K685k7095l005R53q190O580
$$ plain form
14606 -21079 -27407 -8782 16773 2613 -4128 3483 28551 19212 -33286 -51181 -56108 -36571 -7163
14593 -7163 1343 -4802 -5017 -2179 -12774 -33175 -12961 28704 37983 15583 5782 -2873 -1128 11146
14579 11146 23336 15940 1505 24469 35223 1275 -22063 -31372 -20780 -3396 -3972 18020
14567 18020 47640 44609 49962 21013 -22973 -6653 -13992 -28255 -18589 3313 13995 12540 1132
14554 1132 -13303 -6635 2684 3032 -6844 -27149 -23653 -810 -4868 -31703 -35933 -40983 -24709 -32624
14540 -32624 -65846 -37177 -31715 -29001 -23984 842 24859 8515 8622 20001 13528 3290 3231
14527 3231 19894 34828 39398 6574 -2759 10327 35658 47937 38593 21897 27631 24057 38280
14514 38280 47161 23284 18544 13749 -14392 -6915 18094 24965 19702 9842 16713 29223 35371
$$ packed form
14606b1079o328J8625K5555j4160o741P611K5068r339n2498j7895m927J9537K9408
14593g163Q506o145k15K838j0595k0401K0214M1665R279k2400r801q655J745J2274
14579A1146J2190p396j4435K2964J0754l3948k3338r309J0592J7384n76K1992
14567A8020K9620l031N353k8949m3986J6320p339j4263R666K1902J0682j455j1408
14554A132j4435O668R319L48r876k0305L496K2843m058k6835m230n050J6274p915
14540c2624l3222K8669N462K714N017K4826K4017j6344J07J1379o473j0238n9
14527C231J6663J4934M570l2824r333J3086K5331J2279r344j6696N734l574J4223
14514C8280Q881k3877m740m795k8141P477K5009O871n263r860O871J2510O148
$$ plain form
14501 35371 35214 17596 6287 -9678 -22538 -24454 -20564 -27816 -4523 43569 51354 41879 3211
14488 3211 20116 20671 -2213 286 -1438 13649 19263 27254 33378 20404 10929 -9890 -16627 -35002
14474 -35002 -29008 -17840 -32619 -46433 -33202 -19448 -4240 -14025 -14756 -28752 -25968 -43723 -52144
14461 -52144 -72688 -66858 -52276 -36048 -11511 -87 -14306 -30304 -28668 -40880 -33954 -7721
14449 -7721 -9700 -15832 5986 7304 13506 -7172 -14843 25196 4066 -10300 -6854 13326 11138
14436 11138 3163 -771 -16567 -23387 -18049 -32980 -37785 -12534 -13882 -12278 -8684 2533 8958
14423 8958 10911 17116 -80 -6827 -20376 -17726 -26334 -14194 22672 28334 28823 34569 19351 6018
14409 6018 25093 59967 68160 63403 20040 11642 27228 18281 -1641 -19011 -14259 -6082 -6660
$$ packed form
14501C5371j57j7618j1309j5965j2860j916L890p252K3293M8092P785r475l8668
14488C211J6905N55k2884K499j724J5087N614P991O124j2974r475k0819o737j8375
14474c5002N994J1168j4779j3814J3231J3754J5208r785p31j3996K784j7755q421
14461e2144k0544N830J4582J6228K4537J1424j4219j5998J636j2212O926K6233
14449g721j979o132K1818J318O202k0678p671M0039k1130j4366L446K0180k188
14436A1138p975l934j5796o820N338j4931m805K5251j348J604L594J1217O425
14423H958J953O205j7196o747j3549K650q608J2140L6866N662M89N746j5218j3333
14409F018J9075L4874Q193m757m3363q398J5586q947j9922j7370M752Q177n78
$$ plain form
14396 -6660 -13676 -12398 2518 -10411 -21867 -24048 795 40146 32169 11647 7358 27194 18013
14383 18013 26833 37240 24181 -18993 -20804 -15617 -10768 -8218 174 9327 12091 -2650 344
14370 344 7819 22221 12363 -14203 -3333 -8974 -15068 -22072 -26541 -30277 -13033 -1870 -13174
14357 -13174 -21447 -14274 -23307 -28514 8240 28691 28330 51299 61514 29157 3546 556 15882
14344 15882 -4128 -18132 -18399 -6299 -36985 -20343 8682 12035 24801 25879 33847 41253 48894
14331 48894 27616 11959 29508 11725 8326 -2787 -19165 -3425 -16792 -21078 -13551 -8127
14319 -8127 8818 -163 -9632 -3042 -5946 -32877 -26575 -13455 -7962 -17647 -46635 -15281 3634
14306 3634 -3955 -8734 1397 1389 4210 -3236 11913 -1120 -12064 -27238 -19090 -9963 -12086 -4307
$$ packed form
14396f660p016J278J4916j2929j1456k181K4843L9351p977k0522m289J9836r181
14383A8013Q820J0407j3059m3174j811N187M849K550Q392R153K764j4741K994
14370C44P475J4402r858k6566J0870n641o094p004m469l736J7244J1163j1304
14357a3174q273P173r033n207L6754K0451l61K2969J0215l2357k5611k990J5326
14344A5882k0010j4004k67J2100l0686J6642K9025L353J2766J078P968P406P641
14331D8894k1278j5657J7549j7783l399j1113j6378J5740j3367m286P527N424
14319h127J6945q981r469O590k904k6931O302J3120N493r685k8988L1354J8915
14306C634p589m779J0131qK821p446J5149j3033j0944j5174Q148R127k123P779
$$ plain form
14292 -4307 -26474 -42545 -40320 -32998 -24192 -17420 8698 8263 -1692 9160 26764 32464 39159 31203
14278 31203 22708 32997 17519 2780 -4979 -4808 3094 4191 -11841 -10067 13723 -2055 5885
14265 5885 18056 22274 1623 -8538 -5884 12491 -16829 -21038 20987 29415 22588 27406 7141
14252 7141 3394 24367 2659 -15500 -9269 -8191 -22764 -13146 -13388 -12289 -5112 -2348 15707 22593
14238 22593 46738 31516 35488 25133 354 11804 8775 24534 20729 -5373 -18396 -28538
14226 -28538 -3831 11211 -4431 -26017 -36800 -15118 -26513 -44607 -39422 -42524 -42918 -23445
14214 -23445 -10985 -9310 7118 -5599 11493 5177 -30519 -21754 -19957 -20010 -27126 -24281 -6559
14201 -6559 -20368 3749 11128 1279 -12699 -5245 -17088 -10791 88 -10983 12604 16299 -13596
$$ packed form
14292d307k2167j6071K225P322Q806O772K6118m35r955J0852J7604N700O695p956
14278C1203q495J0289j5478j4739p759J71P902J097j6032J774K3790j5778P940
14265E885J2171M218k0651j0161K654J8375k9320m209M2025Q428o827M818k0265
14252G141l747K0973k1708j8159O231J078j4573R618k42J099P177K764J8055O886
14238B2593K4145j5222L972j0355k4779J1450l029J5759l805k6102j3023j0142
14226b8538K4707J5042j5642k1586j0783K1682j1395j8094N185l102l94J9473
14214b3445J2460J675J6428j2717J7092o316l5696Q765J797n3p116K845J7722
14201f559j3809K4117P379r849j3978P454j1843O297J0879j1071K3587L695k9895
$$ plain form
14188 -13596 -27690 -18268 8266 25117 18420 13579 -4366 -4840 8152 7413 5698 -9797 -26123
14175 -26123 -37854 -24044 -17900 -33927 -23082 -1118 27227 18059 7363 -13994 -23090 -21405
14163 -21405 -10240 -18829 -24717 -10301 3800 -480 -5732 -1084 5688 16269 21259 -4972 -17467
14150 -17467 -10680 -4467 4345 23681 26223 1193 -15446 -12429 -1608 23587 5266 12242 26231
14137 26231 12439 -9356 -19770 -27994 -48613 -43053 -23112 -33924 -36742 -21710 -20756 1378 -2458
14124 -2458 16058 37136 18387 -1931 2484 3038 2851 14554 50322 43321 15337 1018 23014
14111 23014 15499 18643 -2164 -5303 -136 -6021 -7665 -15340 -25785 5067 36512 46496 30186
14098 30186 11501 2188 -14526 -23209 -2666 -1924 -1213 9437 16456 -2466 -19645 -22423 -35747
$$ packed form
14188a3596j4094R422K6534J6851o697m841j7945m74J2992p39j715j5495j6326
14175b6123j1731J3810O144j6027J0845K1964K8345r168j0696k1357r096J685
14163b1405J1165q589n888J4416J4101m280n252M648O772J0581M990k6231j2495
14150a7467O787O213Q812J9336K542k5030j6639L017J0821K5195j8321O976J3989
14137B6231j3792k1795j0414q224k0619N560J9941j0812k818J5032R54K2134l836
14124b458J8516K1078j8749k0318M415N54j87J1703L5768p001k7984j4319K1996
14111B3014p515L144k0807l139N167n885j644p675j0445L0852L1445R984j6310
14098C0186j8685r313j6714q683K0543P42P11J0650P019j8922j7179k778j3324
$$ plain form
14085 -35747 -32002 -6116 1021 -3367 -16049 -24206 -11098 -1392 4496 -3907 -3138 -11997 -9233 -5149
14071 -5149 3354 12538 -5524 -18209 -17112 -1777 2622 9852 15736 -4491 4413 25405 29561
14058 29561 3004 1249 1355 9602 13444 -4050 -5529 -44099 -49252 -45151 -39875 -25806 1538
14045 1538 4234 4833 -9057 -16447 -12883 -25584 -63409 -58139 -46594 -54738 -60859 -68482 -54657 -48625
14031 -48625 -47987 -38297 -26710 -45651 -43714 -43420 -29397 -3256 10619 7490 15278 -15092 -47306
14018 -47306 -47367 -31807 -15361 -3399 9737 -1760 -11258 7030 12184 12945 24596 13669 -6209
14005 -6209 -10378 -12 -2368 -846 -11359 1697 6533 9649 6333 6665 -16254 3467 17197
13992 17197 31303 16298 12779 10915 10188 27036 33581 39643 24751 8316 -1677 -198 -13452
$$ packed form
14085c5747L745K5886P137m388j2682q157J3108R706N888q403P69q859K764M084
14071e149Q503R184j8062j2685J097J5335M399P230N884k0227Q904K0992M156
14058B9561k6557j755J06Q247L842j7494j479l8570n153M101N276J4069K7344
14045A538K696N99j3890p390L564j2701l7825N270J1545q144o121p623J3825O032
14031d8625O38R690J1587j8941J937K94J4023K6141J3875l129P788l0370l2214
14018d7306o1J5560J6446J1962J3136j1497r498J8288N154P61J1651j0927j9878
14005f209m169J0366k356J522j0513J3056M836L116l316L32k2919J9721J3730
13992A7197J4106j5005l519j864p27J6848O545O062j4892j6435r993J479j3254
$$ plain form
13979 -13452 1406 -1113 -9274 -26564 -33473 -28631 -48398 -36774 -65087 -61466 -55752 -38896 -10513
13966 -10513 -7903 -11530 -4778 25349 23882 18234 16088 17509 32122 20725 -14779 -29924 -28382
13953 -28382 -21859 -18136 -217 9250 3298 3341 -8404 -17834 -38963 -34298 -37675 -19131 2940 33558
13939 33558 54980 49702 40131 20544 -20564 -18343 -17555 -18120 -17274 -1510 15745 14190 -2339 5918
13925 5918 14511 -11621 -13302 -17380 -12236 -10821 -646 10288 21025 30761 18615 9735 10743
13912 10743 -2610 -21536 3514 -11832 -11155 -4663 -22396 -24888 -13937 -7829 -1608 -9304 283
13899 283 -12377 -33557 -36096 -17550 2795 -22405 -44888 -33501 -19633 -9198 -18046 -31348
13887 -31348 -62418 -50799 -29794 -2812 14431 -5822 -19284 -23392 -12484 -2124 339 -7506
$$ packed form
13979a3452J4858k519q161j7290o909M842j9767J1624k8313L621N714J6856K8383
13966a0513K610l627O752L0127j467n648k146J421J4613j1397l5504j5145J542
13953b8382O523L723J7919R467n952M3j1745r430k1129M665l377J8544K2071L0618
13939C3558K1422n278r571j9587m1108K221P88n65Q46J5764J7255j555j6529Q257
13925E918Q593k6132j681m078N144J415J0175J0934J0737R736j2146q880J008
13912A0743j3353j8926K5050j5346O77O492j7733k492J0951O108O221p696R587
13899B83j2660k1180k539J8546K0345k5200k2483J1387J3868J0435q848j3302
13887c1348l1070J1619K1005K6982J7243k0253j3462m108J0908J0360K463p845
$$ plain form
13875 -7506 -27306 -29822 -18306 -20033 -11768 -3427 13236 12375 5343 1972 -6510 -7884 -4687 -5700
13861 -5700 -27910 -25105 -24120 -36994 -35852 -22405 -27500 -18061 -16281 -11534 -2427 6439 35161 58957
13847 58957 64896 46338 72417 60334 46472 32791 16399 -6480 -38883 -38093 -31818 -29305 -25967
13834 -25967 -6736 7689 -21942 -43144 -6790 26269 27005 15418 20284 46279 35011 21954
13822 21954 21435 28902 43112 50730 40621 22446 19966 8665 -11776 -15755 -436 3876 -13667
13809 -13667 -13145 -7714 18630 10837 21519 28451 25514 9525 14227 23259 36864 23165 27812
13796 27812 4430 1781 3561 -4691 12212 26729 38657 24840 17619 -1820 -13469 -31173
13784 -31173 4435 22723 -5403 -35244 -22721 -17469 -24794 -33879 -30516 6698 17052 10988 -13710
$$ packed form
13875g506j9800k516J1516j727Q265Q341J6663q61p032l371q482j374L197j013
13861e700k2210K805R85j2874J142J3447n095R439J780M747R107Q866K8722K3796
13847E8957N939j8558K6079j2083j3862j3681j6392k2879l2403P90O275K513L338
13834b5967J9231J4425k9631k1202L6354L3059P36j1587M866K5995j1268j3057
13822B1954n19P467J4210P618j0109j8175k480j1301k0441l979J5319M312j7543
13809a3667N22N431K6344p793J0682O932k937j5989M702R032J3605j3699M647
13796B7812k3382k649J780q252J6903J4517J1928j3817p221j9439j1649j7704
13784c1173L5608J8288k8126k9841J2523N252p325r085L363L7214J0354o064k4698
$$ plain form
13771 -13710 -9679 28330 24691 7394 10797 10976 -5451 -8829 20298 23961 -3466 -11657 -4047
13758 -4047 -346 3714 -8609 -24234 -24791 -22835 -19699 12812 7653 7165 -16246 -11343 22637 21677
13744 21677 20807 25989 21590 -2060 19940 7248 1852 655 8121 24337 2411 2910 11346 24526
13730 24526 44667 24464 -13010 -33548 -41449 -39844 -35166 -6858 28134 23362 -4153 -14469
13718 -14469 -22180 -12375 -1224 -5589 11663 -3515 -13865 -231 -5075 -28374 -38824 -40535 -46411
13705 -46411 -29414 -7041 3234 26887 34307 38456 3623 -14341 -24748 -34452 -16576 -18982
13693 -18982 -32646 54 35077 44813 49400 30937 23422 13869 10283 37309 35890 473 -42976
13680 -42976 -36467 -20908 -8220 -12768 617 15850 10031 16311 6882 -5186 10353 -538 -20808
$$ packed form
13771a3710M031L8009l639j7297L403J79j6427l378K9127L663k7427q191P610
13758d047L701M060j2323j5625n57J956L136L2511n159m88k3411M903L3980r60
13744B1677q70N182m399k3650K2000j2692n396j197P466J6216k1926M99Q436J3180
13730B4526K0141k0203l7474k0538p901J605M678K8308L4992m772k7515j0316
13718a4469p711R805J1151m365J7252j5178j0350J3634m844k3299j0450j711n876
13705d6411J6997K2373J0275K3653P420M149l4833j7964j0407r704J7876k406
13693a8982j3664L2700L5023R736M587j8463p515r553l586K7026j419l5417m3449
13680d2976O509J5559J2688m548J3385J5233n819O280r429j2068J5539j0891k0270
$$ plain form
13667 -20808 -10173 -6723 23580 32701 38362 24947 14331 8654 21039 30626 33396 36247 26393
13654 26393 39059 43530 54715 47845 28836 29417 10242 4158 4094 -531 -14483 -15826 -19908 -31050
13640 -31050 -14117 -17106 -2455 22356 6261 -12465 -29516 -32622 -187 10840 4417 -13641
13628 -13641 -13468 -563 -9876 -31089 -29376 -12910 -14614 -28369 -32549 -52009 -70926 -52451 -25170
13615 -25170 -8523 -5904 -19705 -12648 -25062 -50345 -42021 -43369 -27341 -5403 -6843 -35339 -46353
13602 -46353 -33442 -23161 -1177 9730 7161 11460 2430 -2327 -6388 -15891 -10433 2057 44947
13589 44947 46189 37191 38034 12699 -3736 2086 26877 46325 41519 -3056 -2251 6931 -10127
13576 -10127 1266 7584 21255 22125 21665 13911 -28055 -55338 -47922 -26245 -20211 -17086 -15287 -25550
$$ packed form
13667b0808J0635L450L0303R121N661j3415j0616n677J2385R587K770K851r854
13654B6393J2666M471J1185o870j9009N81j9175o084o4m625j3952j343m082j1142
13640c1050J6933k989J4651K4811j6095j8726j7051l106L2435J1027o423j8058
13628a3641J73J2905r313k1213J713J6466j704j3755m180j9460j8917J8475K7281
13615b5170J6647K619j3801P057j2414k5283Q324j348J6028K1938j440k8496j1014
13602d6353J2911J0281K1984J0907k569M299r030m757m061r503N458J2490M2890
13589D4947J242q998Q43k5335j6435N822K4791J9448m806m4575Q05R182j7058
13576a0127J1393O318J3671Q70m60p754m1966k7283P416K1677O034L125J799j0263
$$ plain form
13562 -25550 -23460 -36117 -39877 -11990 -5676 -3157 13070 10713 7392 26420 14119 17560 32151
13549 32151 19263 5430 -6381 -21066 8962 13343 -1537 -2006 11770 19094 4192 6151 11026
13536 11026 7098 -17186 -13118 -15811 -6515 2269 -13014 -24303 -10552 -5302 -6597 -8135 -27508
13523 -27508 -25341 -12584 -14608 4346 23580 25377 27993 24979 29378 6503 -5699 -22650 -17576
13510 -17576 -14823 568 21155 32002 24627 -5801 4880 4667 22526 17442 3808 10371 2989
13497 2989 15194 20638 14754 19692 18722 22653 8577 11973 3723 10731 933 -9883 -8305 -23326
13483 -23326 -7292 2752 -4750 23757 38500 47313 53429 22614 7859 20495 24109 9323
13471 9323 3554 -10456 -78 -20901 -39326 -85176 -87243 -56622 -20753 10917 6712 -2735 -14445
$$ packed form
13562b5550K090j2657l760K7887O314K519J6227k357l321J9028j2301L441J4591
13549C2151j2888j3833j1811j4685L0028M381j4880m69J3776P324j4902J959M875
13536A1026l928k4284M068k693R296Q784j5283j1289J3751N250j295j538j9373
13523b7508K167J2757k024J8954J9234J797K616l014M399k2875j2202j6951N074
13510a7576K753J5391K0587J0847p375l0428J0681k13J7859n084j3634O563p382
13497B989J2205N444n884M938r70L931j4076L396q250P008r798j0816J578j5021
13483b3326J6034J0044p502K8507J4743Q813O116l0815j4755J2636L614j4786
13471I323n769j4010J0378k0823j8425m5850k067L0621L5869L1670m205r447j1710
$$ plain form
13458 -14445 -8918 -2658 6991 13029 7400 20871 20251 -2575 7120 20359 30749 15507 10404
13445 10404 7556 -4832 -19549 -24037 5298 2378 9817 4893 -4693 8240 -58 -9212 -9033 -16490
13431 -16490 -18913 17723 24318 16904 18883 24864 17386 2051 25313 32919 394 -55451 -72952
13418 -72952 -30030 -7360 -15885 -16021 -9340 -7271 -920 3224 42855 48137 19968 -1591 -17129
13405 -17129 -1949 9340 11964 968 14241 27151 29672 10519 -2613 6375 5270 16767
13393 16767 29325 15546 10622 4338 29537 43766 25081 19132 22129 -512 -2652 1913 3963
13380 3963 -1015 -16 -15466 6476 36599 29763 -4960 -15682 3313 25302 29984 20728 718
13367 718 -17430 -18824 -32074 -34965 -24912 -13650 -10123 -29792 -39713 -23765 -9784 -14220 -26463
$$ packed form
13458a4445N527O260R649O038n629J3471o20k2826R695J3239J0390j5242n103
13445A0404k848j2388j4717m488K9335k920P439m924r586J2933q298r154J79p457
13431a6490k423L6636O595p414J979N981p478j5335K3262P606l2525n5845j7501
13418g2952M2922K2670q525j36O681K069O351M144L9631N282k8169k1559j5538
13405a7129J5180J1289K624j0996J3273J2910K521j9153j3132Q988j105J1497
13393A6767J2558j3779m924o284K5199J4229j8685n949K997k2641k140M565K050
13380C963m978R99j5450K1942L0123o836l4723j0722J8995K1989M682r256k0010
13367G18j8148j394j3250k891J0053J1262L527j9669r921J5948J3981m436j2243
$$ plain form
13354 -26463 -24290 -37561 -41414 -18688 -18053 -33540 -31909 -33212 -12970 -18370 -37444 -37754 -17033
13341 -17033 -14493 -44930 -45066 -31312 -14766 20375 -721 -16156 -11228 -20930 -11373 4541 7557
13328 7557 -4936 -6552 -5315 8759 9815 10085 49844 58347 21648 15285 9943 -15160 2775
13315 2775 -4950 -3148 -2727 23365 20785 32375 34136 10315 17127 24554 31733 6941 7229 -19690
13301 -19690 -30642 -22852 -27792 -5063 317 -5735 -9873 -7694 15849 12732 6644 18611 28771
13288 28771 39350 52125 46967 34579 23237 -249 1812 1602 3602 15753 34451 21822 12466
13275 12466 5312 -10834 1663 5918 -770 -14266 22611 42751 34898 41749 16957 7445 11869
13262 11869 -4704 -2163 12809 23540 17551 31562 24316 7970 -6249 -7569 -23252 -23599 -11221
$$ packed form
13354b6463K173j3271l853K2726O35j5487J631j303K0242n400j9074l10K0721
13341a7033K540l0437j36J3754J6546L5141k1096j5435M928r702R557J5914L016
13328G557j2493j616J237J4074J056K70L9759Q503l6699o363n342k5103J7935
13315B775p725J802M21K6092k580J1590J761k3821O812P427P179k4792K88k6919
13301a9690j0952P790m940K2729N380o052m138K179K3543l117o088J1967J0160
13288B8771J0579J2775n158j2388j1342k3486K061k10K000J2151J8698j2629r356
13275A2466p154j6146J2497M255o688j3496L6877K0140p853O851k4792r512M424
13262A1869j6573K541J4972J0731n989J4011p246j6346j4219j320j5683l47J2378
$$ plain form
13249 -11221 -30522 -51809 -36219 -40729 -11931 8877 2234 -30900 -46747 -43879 -30566 -27760
13237 -27760 -11429 -17322 -19090 -29274 -34000 -36294 -28061 -13175 -6015 12405 33186 11750 -6943
13224 -6943 20809 33348 8571 2150 -9180 -2193 18417 27022 33081 16874 20436 46896 56996
13211 56996 53178 40526 46213 54831 42527 9552 8906 14634 19643 34951 22789 2856 -2086
13198 -2086 26872 45241 42417 47854 45591 37851 44559 56645 65825 50654 34306 27637 35996
13185 35996 32929 29154 23427 12058 -2595 -9812 -10029 460 -502 -3402 8034 -2576 -11413 -3423
13171 -3423 8121 22888 66462 132309 156707 166855 179862 148108 95879 61312 21058 28924
13159 28924 60434 71561 67739 37850 6466 1303 -3151 -2663 -14573 -5381 12096 16688 13942
$$ packed form
13249a1221j9301k1287J5590m510K8798K0808o643l3134j5847K868J3313K806
13237b7760J6331n893j768j0184m726k294Q233J4886P160J8420K0781k1436j8693
13224f943K7752J2539k4777o421j1330O987K0610Q605O059j6207L562K6460J0100
13211E6996l818j2652N687Q618j2304l2975o46N728N009J5308j2162j9933m942
13198b086K8958J8369k824N437k263p740O708J2086R180j5171j6348o669Q359
13185C5996l067l775n727j1369j4653p217k17J0489r62k900J1436j0610q837P990
13171c423J1544J4767M3574O5847K4398J0148J3007l1754n2229l4567m0254P866
13159B8924L1510J1127l822k9889l1384n163m454M88j1910R192J7477M592k746
$$ plain form
13146 13942 18439 27120 31826 23933 19325 30080 21141 31633 50212 59012 35100 34746 30948 16998
13132 16998 -5901 -16468 13209 13850 7699 19800 30757 23024 47012 70697 105519 128179
13120 128179 129058 89458 66532 30777 18042 27021 45504 65584 56877 35870 19623 1506
13108 1506 -8304 10262 35735 24565 14651 21283 32085 31586 29889 49513 31347 6824 10845
13095 10845 9880 34955 52660 60266 60559 53922 58317 80132 60970 49156 42795 49837 42076 29032
13081 29032 13150 20361 38534 41113 36768 47890 55303 74038 87849 84770 84907 85113 78962 72838
13067 72838 64233 54818 80362 99851 91077 103202 112780 110449 102370 113548 141593 165527 212948
13054 212948 267995 319355 419575 526146 608125 648624 710598 750917 788704 769550 695665
$$ packed form
13146A3942M497Q681M706p893m608J0755q939J0492J8579Q800k3912l54l798j3950
13132A6998k2899j0567K9677O41o151J2101J0957p733K3988K3685L4822K2660
13120A28179Q79l9600k2926l5755j2735Q979J8483K0080q707k1007j6247j8117
13108A506r810J8566K5473j1170r914O632J0802m99j697J9624j8166k4523M021
13095A0845r65K5075J7705P606K93o637M395K1815j9162j1814o361P042p761j3044
13081B9032j5882P211J8173K579m345J1122P413J8735J3811l079J37K06o151o124
13067G2838q605r415K5544J9489q774J2125R578k331q079J1178K8045K3934M7421
13054B12948N5047N1360J00220J06571Q1979M0499O1974M0319L7787j9154p3885
$$ plain form
13043 695665 611432 520486 441562 378264 332024 273025 221509 202613 182620 153620 130580
13032 130580 100219 89127 137739 152325 151004 138154 124727 104270 95285 79251 67511 54379
13020 54379 53060 49352 66837 76546 79446 85813 97045 124761 129840 110938 102394 106634 95952
13007 95952 70432 47605 50773 44456 49442 57275 50170 37799 27289 40358 63081 78434 54112
12994 54112 19797 19863 31402 50969 53364 47369 51897 50688 27567 19134 28455 7155 3205 19806
12980 19806 9490 15636 30308 42466 38272 39387 41997 45937 35733 26314 12352 15581 44795
12967 44795 46915 43033 42484 30731 13058 20664 15084 37686 34263 27731 31866 41368 50668 59529
12953 59529 52047 48056 44157 59631 56453 17382 -16632 -27476 -18059 -13180 16469 30917 27709
$$ packed form
13043F95665q4233r0946p8924o3298m6240n8999n1516j8896j9993k9000k3040
13032A30580l0361j1092M8612J4586j321j2850j3427k0457q985j6034j1740j3132
13020E4379j319l708J7485R709K900O367J1232K7716N079j8902q544M240j0682
13007I5952k5520k2827L168o317M986P833p105j2371j0510J3069K2723J5353k4322
12994E4112l4315O6J1539J9567K395n995M528j209k3121q433R321k1300l950J6601
12980A9806j0316O146J4672J2158m194J115K610L940j0204r419j3962L229K9214
12967D4795K120l882n49j1753j7673P606n580K2602l423o532M135R502R300Q861
12953E9529p482l991l899J5474l178l9071l4014j0844R417M879K9649J4448l208
$$ plain form
12940 27709 35387 16571 13831 29557 33796 24619 12448 3161 -184 12577 16863 19098 25394
12927 25394 23374 27998 38940 50268 31689 24415 21737 26880 35962 43233 46098 43193 23013
12914 23013 35609 49565 70205 56116 44685 35528 24242 35797 51672 42348 37008 26640
12902 26640 5798 513 43017 70408 58556 26171 63786 82795 66483 50735 35195 25823
12890 25823 27440 25113 46451 87078 91730 86526 76843 87047 86111 84409 85357 60813 58059 66731
12876 66731 68138 63232 53040 67280 67687 48746 43496 35740 37341 28736 56621 78787 56725
12863 56725 58914 60765 52462 46929 56341 64730 43040 37274 48465 62721 78579 73275 67780
12850 67780 68749 70233 54110 58458 55808 48895 47203 42427 42446 44374 31413 14270 -10650 -33654
$$ packed form
12940B7709P678j8816k740J5726M239r177j2171r287l345J2761M286K235O296
12927B5394k020M624J0942J1328j8579p274k678N143R082P271K865k905k0180
12914B3013J2596J3956K0640j4089j1431r157j1286J1555J5875r324n340j0368
12902B6640k0842n285M2504K7391j1852l2385L7615J9009j6312j5748j5540r372
12890B5823J617k327K1338M0627M652n204r683J0204r36j702R48k4544k754Q672
12876F6731J407m906j0192J4240M07j8941n250p756J601q605K7885K2166k2062
12863E6725K189J851q303n533R412Q389k1690n766J1191J4256J5858n304n495
12850F7780R69J484j6123M348k650o913j692m776J9J928j2961j7143k4920k3004
$$ plain form
12836 -33654 -39161 -47163 -48804 -25243 859 -1567 -17153 -44726 -52994 -54869 -35814 -36596 -47311
12823 -47311 -26765 -1812 5431 -7976 -23141 -25273 -25850 -17569 -41658 -76159 -53326 -168 13965
12810 13965 -3644 -15213 -20431 -2387 10193 50508 55433 54398 62674 71878 89550 113353 108786
12797 108786 91645 79555 85836 81592 80435 83116 105561 130391 114695 87177 81900 56344
12785 56344 71034 93109 70219 35320 33543 39552 2408 -23546 -17430 -1244 32457 55212
12773 55212 72416 45105 31451 38623 59267 83062 114048 128829 109654 121150 188514 245328
12761 245328 293714 353944 380730 415836 474056 543176 617115 667124 710273 760736 773494
12750 773494 762499 757403 769333 759107 755609 717373 684522 664905 628538 585852 534341 518259
$$ packed form
12836c3654n507q002j641K3561K6102k426j5586k7573q268j875J9055p82j0715
12823d7311K0546K4953P243j3407j5165k132n77Q281k4089l4501K2833N3158J4133
12810A3965j7609j1569n218J8044J2580M0315M925j035Q276R204J7672K3803m567
12797A08786j7141j2090O281m244j157K681K2445K4830j5696k7518n277k5556
12785E6344J4690K2075k2890l4899j777O009l7144k5954O116J6186L3701K2755
12773E5212J7204k7311j3654P172K0644K3795L0986J4781j9175J1496O7364N6814
12761B45328M8386O0230K6786L5106N8220O9120P3939N0009M3149N0463J2758
12750G73494j0995n096J1930j0226l498l8236l2851j9617l6367m2686n1511j6082
$$ plain form
12738 518259 503482 471866 444816 456288 483337 482280 476684 492447 503076 507822 508129 496402
12726 496402 479080 469913 485049 524658 528508 532356 512643 476856 460120 471632 479251 487294
12714 487294 494525 499608 473516 476929 455492 451881 431968 440258 421518 409456 383235 397887
12702 397887 407690 406280 417740 447517 482393 505745 486185 469172 472860 478883 532762 573443
12690 573443 604796 622540 663572 689673 718376 740228 775296 830566 874828 917079 970101
12679 970101 1014656 1109215 1247326 1469401 1792301 2217825 2734470 3304971 3873223 4416697
12669 4416697 4878033 5202278 5345931 5268014 5043572 4712581 4294275 3873552 3494396 3169823
12659 3169823 2941699 2837223 2776376 2800393 2853785 2942280 3064156 3199052 3377714 3636330
$$ packed form
12738E18259j4777l1616k7050J1472K7049j057n596J5763J0629M746L07j1727
12726D96402j7322r167J5136L9609L850L848j9713l5787j6736J1512P619Q043
12714D87294P231N083k6092L413k1437l611j9913Q290j8740j2062k6221J4652
12702C97887R803j410J1460K9777L4876K3352j9560j7013L688O023N3879M0681
12690E73443L1353J7744M1032K6101K8703K1852L5068N5270M4262M2251N3022
12679I70101M4555R4559J38111K22075L22900M25524N16645N70501N68252N43474
12669D416697M61336L24245J43653p7917k24442l30991m18306m20723l79156l24573
12659C169823k28124j04476o0847K4017N3392Q8495J21876J34896J78662K58616
$$ plain form
12649 3636330 3985150 4419739 4991894 5660902 6397664 7233289 8175109 9215368 10339509
12640 10339509 11665182 13372899 15695411 19098422 24219416 31846075 42682716 56793578
12632 56793578 73377831 91300262 109398118 125847473 138217678 144921847 145604055
12625 145604055 140265936 129417684 114737303 98708630 83007703 68506965 56206643
12618 56206643 46900981 40368252 35862857 32674506 30246088 28283619 26596076 24991144
12610 24991144 23435435 21965704 20584337 19292385 18103801 17027689 16101132 15299435
12602 15299435 14624758 14078396 13579811 13144143 12755866 12387925 12041892 11705843 11370003
12593 11370003 11046570 10746279 10462279 10138752 9813393 9524420 9255606 8987201 8713742
$$ packed form
12649C636330L48820M34589N72155O69008P36762Q35625R41820J040259J124141
12640A0339509J325673J707717K322512L403011N120994P626659J0836641J4110862
12632E6793578J6584253J7922431J8097856J6449355J2370205O704169O82208
12625A45604055n338119j0848252j4680381j6028673j5700927j4500738j2300322
12618E6206643r305662o532729m505395l188351k428418j962469j687543j604932
12610B4991144j555709j469731j381367j291952j188584j076112r26557q01697
12602A5299435o74677n46362m98585m35668l88277l67941l46033l36049l35840
12593A1370003l23433l00291k84000l23527l25359k88973k68814k68405k73459
$$ plain form
12584 8713742 8456220 8215749 8012379 7818138 7644663 7493017 7309266 7131189 6959050
12575 6959050 6788848 6667441 6537751 6377912 6246838 6098285 5951981 5809970 5652199
12566 5652199 5530132 5406383 5284034 5150709 5017562 4941127 4867509 4772081 4682406 4581321
12556 4581321 4495348 4413243 4348036 4279642 4216334 4136643 4047880 3963928 3917616 3838345 3784650
12545 3784650 3734387 3658447 3587279 3522498 3466687 3400848 3334523 3263549 3202360 3136301 3072391
12534 3072391 3017682 2967648 2902493 2822898 2742148 2680078 2637976 2613057 2573055 2502013 2444935
12523 2444935 2382083 2321380 2291695 2262031 2229082 2226835 2205134 2136136 2102073 2068277 2017831
12512 2017831 1987130 2021495 2024477 2023264 2016063 2036581 2046732 2081052 2105312 2115989 2113641 2123450
$$ packed form
12584H713742k57522k40471k03370j94241j73475j51646j83751j78077j72139
12575F959050j70202j21407j29690j59839j31074j48553j46304j42011j57771
12566E652199j22067j23749j22349j33325j33147p6435p3618r5428q9675j01085
12556D581321q5973q2105o5207o8394o3308p9691q8763q3952m6312p9271n3695
12545C784650n0263p5940p1168o4781n5811o5839o6325p0974o1189o6059o3910
12534C072391n4709n0034o5155p9595q0750o2070m2102k4919m0002p1042n7078
12523B444935o2852o0703k9685k9664l2949k247k1701o8998l4063l3796n0446
12512B017831l0701L4365K982j213p201K0518J0151L4320K4260J0677k348R809
$$ plain form
12500 2123450 2133455 2102600 2079834 2059381 2011517 1992988 1970395 1933415 1880875 1842361 1821604
12489 1821604 1786101 1767764 1719526 1663624 1618196 1572366 1565681 1540169 1529724 1486309 1458448
12478 1458448 1434520 1426788 1397496 1344107 1342412 1320410 1309503 1297247 1274046 1258250 1241257 1216802
12466 1216802 1192951 1164531 1140953 1059919 1031271 1043201 1013880 965246 945773 947592 925947
12455 925947 940809 933135 914432 870916 851200 870100 865365 855194 842853 847031 847264 849110 842724
12442 842724 843366 811625 803536 818391 819073 821509 784119 737003 718795 706282 714717 699712 705209
12429 705209 711170 713457 737195 722762 691883 672691 643468 615042 621434 606250 577809 556205
12417 556205 540128 512860 491302 475983 464700 487674 502970 508371 499776 509945 487258 453342
$$ packed form
12500B123450J0005l0855k2766k0453m7864j8529k2593l6980n2540l8514k0757
12489A821604l5503j8337m8238n5902m5428m5830o685k5512j0445m3415k7861
12478A458448k3928p732k9292n3389j695k2002j0907j2256k3201j5796j6993k4455
12466A216802k3851k8420k3578q1034k8648J1930k9321m8634j9473J819k1645
12455I25947J4862p674j8703m3516j9716J8900m735j0171j2341M178K33J846o386
12442H42724O42l1741q089J4855O82K436l7390m7116j8208j2513Q435j5005N497
12429G05209N961K287K3738j4433l0879j9192k9223k8426O392j5184k8441k1604
12417E56205j6077k7268k1558j5319j1283K2974J5296N401q595J0169k2687l3916
$$ plain form
12405 453342 455221 449167 441550 428319 388235 385148 384068 395142 407931 401575 413958 399679 393376
12392 393376 411983 421234 418364 396679 399063 399235 390731 382764 370715 368070 357135 357338 355226 355257
12378 355257 379306 360290 352791 330646 309445 309146 313990 277209 283857 294200 288604 262456 255327
12365 255327 263690 249409 232363 256568 263700 265476 237597 207298 204671 198105 197862 207904 207977
12352 207977 210650 209853 196964 182116 191928 193482 187296 187466 212682 219856 188937 167516 166791 176028
12338 176028 191110 188211 205712 185247 146296 149077 149434 159050 157863 137003 165642 175446 170164
12325 170164 152162 161525 170351 172966 149960 143477 150677 147348 157322 149625 124761 128764 127061
12312 127061 127547 138985 114416 104448 83755 77733 87585 106838 133300 118738 108945 136525 141776
$$ packed form
12405D53342J879o054p617j3231m0084l087j080J1074J2789o356J2383j4279o303
12392C93376J8607R251k870k1685K384J72q504p967j2049k645j0935K03k112L1
12378C55257K4049j9016p499k2145k1201k99M844l6781O648J0343n596k6148p129
12365B55327Q363j4281j7046K4205P132J776k7879l0299k627o566k43J0042P3
12352B07977K673p97j2889j4848R812J554o186J70K5216P174l0919k1421p25R237
12338A76028J5082k899J7501k0465l8951K781L57R616j187k0860K8639R804n282
12325A70164j8002R363Q826K615k3006o483P200l329R974p697k4864M003j703
12312A27061M86J1438k4569r968k0693o022R852J9253K6462j4562r793K7580N251
$$ plain form
12299 141776 148231 129381 136996 127465 140528 151232 150361 149787 160718 159747 156873 162762 173552 161701
12285 161701 139482 132936 108954 108010 110206 107403 100413 95128 108379 111099 118919 105479 94853
12272 94853 96127 115820 122292 129011 150083 153893 170374 137073 119425 107639 74258 70969 76438
12259 76438 90932 69068 68900 85598 93038 128605 133355 112214 103876 103690 91335 95832 135408
12246 135408 179841 188716 166170 138882 117753 123471 130031 132875 92262 57797 59143 82597
12234 82597 100030 105226 122552 131249 126437 119789 113431 103756 117238 121303 122922 137017 137465 125430
12220 125430 134389 135185 119556 103328 111190 131771 136624 120159 141590 150023 173456 220823 300457
12207 300457 379186 460242 512379 594857 710526 790779 836144 854811 847464 793197 714971
$$ packed form
12299A41776O455j8850P615r531J3063J0704q71n74J0931r71k874N889J0790j1851
12285A61701k2219o546k3982r44K196k803o990n285J3251K720P820j3440j0626
12272I4853J274J9693O472O719K1072L810J6481l3301j7648j1786l3381l289N469
12259G6438J4494k1864j68J6698P440L5567M750k1141q338j86j2355M497L9576
12246A35408M4433Q875k2546k7288k1129N718O560K844m0613l4465J346K3454
12234H2597J7433N196J7326Q697m812o648o358r675J3482M065J619J4095M48j2035
12220A25430Q959P96j5629j6228P862K0581M853j6465K1431Q433K3433M7367P9634
12207C00457P8729Q1056N2137Q2478J15669Q0253M5365J8667p347n4267p8226
$$ plain form
12196 714971 610564 516239 430881 335834 281002 251925 248201 219707 214481 212490 210424 179933
12184 179933 144309 136104 158886 168579 168514 164203 172181 148279 103930 92873 95411 96538 95777 95376
12170 95376 89315 70811 87674 83405 70776 48006 60071 85979 90568 86750 82328 78675 71719
12157 71719 60965 55650 87770 108110 105878 80048 75114 66039 55356 62849 72392 87031 99866
12144 99866 86230 87295 103515 94687 81232 85896 103919 96424 86316 62382 48218 28827
12132 28827 17092 14038 43128 49068 35953 49309 43961 39966 51666 72989 51228 18616
12120 18616 19933 32256 55190 55594 30197 41122 68686 74644 61393 69211 71287 46395 9100
12107 9100 39082 77354 80148 70802 58589 48607 97329 113785 117175 117144 130460 126206 138198
$$ packed form
12196G14971j04407r4325q5358r5047n4832k9077l724k8494n226j991k066l0491
12184A79933l5624q205K2782R693o5m311P978k3902m4349j1057K538J127p61m01
12170I5376o061j8504J6863m269j2629k2770J2065K5908M589l818m422l653o956
12157G1719j0754n315L2120K0340k232k5830m934r075j0683P493R543J4639J2835
12144I9866j3636J065J6220q828j3455M664J8023p495j0108k3934j4164j9391
12132B8827j1735l054K9090N940j3115J3356n348l995J1700K1323k1761l2612
12120A8616J317J2323K2934M04k5397J0925K7564N958j3251P818K076k4892l7295
12107I100K9982L8272K794r346j2213r982M8722J6456L390l1J3316m254J1992
$$ plain form
12094 138198 151327 133748 112963 107325 87956 55408 57032 71033 57919 42371 40860 27464
12082 27464 34072 20654 -6964 -1635 482 8638 22979 51956 42035 29071 39084 34828 21476
12069 21476 7614 -1306 -5205 16111 27173 26529 22966 -3986 9183 -869 -2956 494 4731
12056 4731 16760 3429 -8046 3639 18112 -13194 -32561 -1889 20214 14275 -42 2303
12044 2303 16802 21119 14580 17048 27330 20298 7398 -886 12480 920 13128 17863 1692
12031 1692 4860 28646 38204 3391 293 16330 7562 11031 15454 -13153 -10495 32402 51491
12018 51491 46549 33741 24609 52349 58583 47166 33927 30178 15455 20764 43931 41750 38889
12005 38889 22532 13421 17251 20753 3980 2486 8393 25263 24370 52467 42776 28392 28793 23661
$$ packed form
12094A38198J3129j7579k0785n638j9369l2548J624J4001j3114j5548j511j3396
12082B7464O608j3418k7618N329K117Q156J4341K8977r921j2964J0013m256j3352
12069B1476j3862q920l899K1316J1062o44l563k6952J3169j0052k087L450M237
12056D731J2029j3331j1475J1685J4473l1306j9367L0672K2103n939j4317K345
12044B303J4499M317o539K468J0282p032j2900q284J3366j1560J2208M735j6171
12031A692L168K3786R558l4813l098J6037q768L469M423k8607K658M2897J9089
12018E1491m942j2808r132K7740O234j1417j3239l749j4723N309K3167k181k861
12005C8889j6357r111L830L502j6773j494N907J6870q93K8097r691j4384M01n132
$$ plain form
11991 23661 3943 -126 -4268 5933 45985 51006 38331 26203 15167 2334 10085 12835 22770
11978 22770 22546 37776 49326 52640 44452 10407 7983 8038 2836 9083 20943 34395 15870 -14502
11964 -14502 -1565 -5045 -29676 -14544 22896 25096 40611 23951 26862 32302 21694 16094 40619
11951 40619 29402 -2152 -16083 -442 -2848 6890 10757 2626 -7781 4827 6148 -5746 -4209
11938 -4209 -7380 9488 -5725 8039 25383 32853 30710 10561 7909 28007 45206 56891 56006
11925 56006 43329 21639 22567 34839 12288 -4762 -743 15169 10048 24187 29678 30321 33310
11912 33310 4069 -6579 -26171 -10111 4663 10761 9848 20888 26545 8954 21818 30823 17565
11899 17565 -6087 -23026 -27966 -4118 6204 3213 -6533 -29044 -24856 -3946 -12631 -31338 -14178
$$ packed form
11991B3661j9718m069m142J0201M0052N021j2675j2128j1036j2833P751K750R935
11978B2770k24J5230J1550L314q188l4045k424N5n202O247J1860J3452j8525l0372
11964a4502J2937l480k4631J5132L7440K200J5515j6660K911N440j0608n600K4525
11951D0619j1217l1554j3931J5641k406R738L867q131j0407J2608J321j1894J537
11938d209l171J6868j5213J3764J7344P470k143k0149k652K0098J7199J1685q85
11925E6006j2677k1690R28J2272k2551j7050M019J5912n121J4139N491O43K989
11912C3310k9241j0648j9592J6060J4774O098r13J1040N657j7591J2864R005j3258
11899A7565k3652j6939m940K3848J0322k991r746k2511M188K0910q685j8707J7160
$$ plain form
11886 -14178 -12036 -19616 141 6932 -4004 -17811 -22072 -27431 -12047 8585 32960 38309 21469
11873 21469 7021 -6420 -23474 -18819 -15405 8064 27359 16341 5695 -676 30830 27953
11861 27953 2195 10062 18155 11640 16676 15918 7416 12187 -7740 -14279 -5074 17722 7104 5994
11847 5994 8968 10917 14264 38098 38967 17440 -7668 -18087 -2691 18654 44171 46498 35782
11834 35782 31637 16375 -5712 254 19471 32231 428 -14136 -17738 -10899 -13340 -38038 -22320
11821 -22320 -9993 -14096 -15018 -8816 5205 27487 33602 32567 25502 28357 29332 13969 -5577 1610
11807 1610 12370 2943 1351 -22270 -21458 644 -7000 -9510 -12114 -10711 6281 19649 14023 -1749
11793 -1749 -13238 -37443 -51192 -45897 -35893 -30211 -29817 -7407 8109 31940 39834 4850 -22425
$$ packed form
11886a4178K142p580J9757O791j0936j3807m261n359J5384K0632K4375N349j6840
11873B1469j4448j3441j7054M655L414K3469J9295j1018j0646o371L1506k877
11861B7953k5758P867Q093o515N036p58q502M771j9927o539R205K2796j0618j110
11847E994K974J949L347K3834Q69k1527k5108j0419J5396K1345K5517K327j0716
11834C5782m145j5262k2087N966J9217J2760l1803j4564l602O839k441k4698J5718
11821b2320J2327m103r22O202J4021K2282O115j035p065K855R75j5363j9546P187
11807A610J0760r427j592k3621Q12K2102p644k510k604J403J6992J3368n626j5772
11793a749j1489k4205j3749N295J0004N682L94K2410J5516K3831P894l4984k7275
$$ plain form
11780 -22425 -11273 658 -9490 -23009 -26795 3306 824 -36526 -33005 -29357 -24982 -33913 -37241
11767 -37241 -39300 -8943 6187 -5287 -23367 -4067 15796 24501 34215 23559 29642 25063 981
11754 981 -352 16251 1414 12990 793 -32549 -37888 -28453 2715 -8848 -10431 -19718 -21199
11741 -21199 3009 5216 -12177 -29348 -13322 -1049 -8948 -9038 11160 23212 21736 37259 38698
11728 38698 14773 -11418 -24571 -31212 -15853 8615 -958 9449 -13533 -43959 -48764 -51795
11716 -51795 -40419 -31246 -22267 8808 13942 25167 17855 1881 -18016 -28380 -29152 -15586 -15411
11703 -15411 -2757 -3177 12298 -16676 -25021 -19808 -10293 -10413 -4313 -12392 -24276 -27470 -18098 8581
11689 8581 26381 18515 -21813 -16004 -12724 -34587 -60729 -38817 -14647 14412 8898 -13280 -5514
$$ packed form
11780b2425J1152J1931j0148j3519l786L0101k482l7350L521L648M375q931l328
11767c7241k059L0357J5130j1474j8080J9300J9863Q705R714j0656O083m579k4082
11754I81j333J6603j4837J1576j2197l3342n339R435L1168j1563j583r287j481
11741b1199K4208K207j7393j7171J6026J2273p899r0K0198J2052j476J5523J439
11728C8698k3925k6191j3153o641J5359K4468r573J0407k2982l0426m805l031
11716e1795J1376R173Q979L1075N134J1225p312j5974j9897j0364p72J3566J75
11703a5411J2654m20J5475k8974q345N213R515j20O100q079j1884l194R372K6679
11689H581J7800p866m0328N809L280k1863k6142K1912K4170K9059n514k2178P766
$$ plain form
11676 -5514 -40159 -40268 -10476 797 5834 6610 -11350 -10663 -12575 -28645 -46619 -11041 9991
11663 9991 11960 -116 4770 -3920 -7803 -20176 -26087 -27772 -35363 -49958 -51282 -62714 -62782 -40484
11649 -40484 -48266 -28669 -7217 -1707 -9836 -25828 -7325 2707 -901 -21411 2947 11128 14061
11636 14061 19170 3023 -3524 -18484 -35002 -17998 22442 33103 36257 18097 636 -5581
11624 -5581 -2468 -6904 -5309 4717 25221 17870 11907 -1726 -7833 -5336 -12360 -7580 -8429 -21071
11610 -21071 -37253 -20448 -16137 3690 15502 -2868 3213 1341 769 16364 -11996 -8009 -16632
11597 -16632 -15501 -7434 -8563 -22389 -25839 -26662 -29743 -22520 -9712 1405 -2421 -18456 -17146 7060
11583 7060 8243 -8486 -15297 -4972 6899 7051 -3680 14238 23553 8527 827 -9692 -17601
$$ packed form
11676e514l4645j09K9792J1273N037P76j7960O87j912j6070j7974L5578K1032
11663I991J969j2076M886q690l883j2373n911j685p591j4595j324j1432o8K2298
11649d0484p782J9597K1452N510q129j5992J8503J0032l608k0510K4358Q181K933
11636A4061N109j6147o547j4960j6518J7004M0440J0661L154j8160j7461o217
11624e581L113m436J595J0026K0504p351n963j3633o107K497p024M780q49j2642
11610b1071j6182J6805M311J9827J1812j8370O081j872n72J5595k8360L987q623
11597a6632J131Q067j129j3826l450q23l081P223J2808J1117l826j6035J310K4206
11583G060J183j6729o811J0325J1871J52j0731J7918R315j5026p700j0519p909
$$ plain form
11570 -17601 -35447 -50383 -44155 -23489 -40084 -35403 -16410 -40019 -66336 -72354 -65000 -47100
11558 -47100 -20493 -5712 -1802 -27813 -16304 -23439 -41339 -42620 -24771 -11520 -19055 -3799
11546 -3799 4095 3714 19787 21636 11672 -871 -5219 -20704 -40991 -70540 -62154 -29459 -13930
11533 -13930 11141 15742 30363 49435 22277 6230 -3806 18243 22378 -4029 -5422 22194
11521 22194 24325 -2750 -14357 -1964 -5548 9585 23790 15392 11095 -7646 -12454 -1501 3320
11508 3320 -804 822 -26312 -22899 -2283 5190 2217 -6757 -21046 -7604 -4147 -16769 -7718
11495 -7718 28443 17558 10304 6661 -11995 -12249 -12978 -19670 15221 33099 23512 7935 18786
11482 18786 -404 470 -10191 -2411 -15730 -14338 -10898 -5357 -13954 -18717 7913 10503 -6172
$$ packed form
11570a7601j7846j4936O228K0666j6595M681J8993k3609k6317o018P354J7900
11558d7100K6607J4781L910k6011J1509p135j7900j281J7849J3251p535J5256
11546c799P894l81J6073J849r964j2543m348j5485k0287k9549Q386L2695J5529
11533a3930K5071M601J4621J9072k7158j6047j0036K2049M135k6407j393K7616
11521B2194K131k7075j1607J2393l584J5133J4205q398m297j8741m808J0953M821
11508C320m124J626k7134L413K0616P473k973q974j4289J3442L457j2622R051
11495g718L6161j0885p254l643j8656k54p29o692L4891J7878r587j5577J0851
11482A8786j9190Q74j0661P780j3319J392L440N541q597m763K6630K590j6675
$$ plain form
11469 -6172 -31814 -19552 -20092 3203 -5132 10959 32811 15219 -7315 11575 21607 7034
11457 7034 -11425 -5976 -6529 -1727 2113 22465 34277 19726 9171 -2169 -5400 -7964 -10449
11444 -10449 -22620 -17257 -3671 -9135 -15978 -15858 -2258 5104 24275 31885 38276 30353 23282 29001
11430 29001 14448 1787 2304 -22020 -5196 24115 19779 2420 -12490 -37017 -37499 -17464 18949
11417 18949 35539 36087 -9352 -47164 -47892 -64589 -49366 -16341 2887 15438 11836 -11612 -19853
11404 -19853 -16650 -425 -2926 -15726 -26445 -40524 -47888 -36336 -44880 -27785 4366 14120 19536
11391 19536 11550 11988 12248 8262 17458 40560 42840 6253 -14293 8045 11462 -12050 -20441 -1268
11377 -1268 2602 4725 -13204 -37582 -37467 -31591 -32562 -32115 -37507 -19877 -15832 -41401 -58648 -35616
$$ packed form
11469f172k5642J2262n40K3295q335J6091K1852j7592k2534J8890J0032j4573
11457G034j8459N449n53M802L840K0352J1812j4551j0555j1340l231k564k485
11444a0449j2171N363J3586n464o843J20J3600P362J9171P610O391p923p071N719
11430B9001j4553j2661N17k4324J6824K9311m336j7359j4910k4527m82K0035L6413
11417A8949J6590N48m5439l7812p28j6697J5223L3025J9228J2551l602k3448q241
11404a9853L203J6225k501j2800j0719j4079p364J1552q544J7095L2151R754N416
11391A9536p986M38K60l986R196K3102K280l6587k0546K2338L417k3512q391J9173
11377a268L870K123j7929k4378J15N876r71M47n392J7630M045k5569j7247K3032
$$ plain form
11363 -35616 -25527 -16720 -21877 -18081 16247 7116 -3720 -18021 -21909 -16689 -27042 -28690 9108
11350 9108 19242 14275 8968 5830 7098 28508 37189 16365 18548 43488 35985 30864 40353 25987
11336 25987 10823 -7653 29471 45163 34177 18644 10306 6667 1634 -2342 -8291 -15049 -11342
11323 -11342 17478 14832 37542 21042 -14423 -14958 -20138 -32515 -28400 -14278 -11142 -23054 -6338
11310 -6338 -20540 4689 28715 23514 10717 15678 5112 -31582 -39102 -23811 -22170 -26048 -14544
11297 -14544 -4089 1671 -10033 -36213 -42081 -42841 -42544 -34178 -18628 -349 19072 9503 -317
11284 -317 14519 -1867 -14594 -35631 -53874 -48110 -33993 -20390 1455 15901 35961 18151
11272 18151 -6920 -8143 17885 26682 17594 7272 5382 9563 44885 35959 31166 25814 -20923
$$ packed form
11363c5616J0089Q807n157L796L4328r131j0836j4301l888N220j0353j648L7798
11350I108J0134m967n307l138J268K1410Q681k0824K183K4940p503n121R489j4366
11336B5987j5164j8476L7124J5692j0986j5533q338l639n033l976n949o758L707
11323a1342K8820k646K2710j6500l5465n35n180j2377M115J4122L136j1912J6716
11310f338j4202K5229K4026n201j2797M961j0566l6694p520J5291J641l878J1504
11297a4544J0455N760j1704k6180n868p60K97Q366J5550J8279J9421r569r820
11284c17J4836j6386j2727k1037j8243N764J4117J3603K1845J4446K0060j7810
11272A8151k5071j223K6028Q797r088j0322j890M181L5322q926m793n352m6737
$$ plain form
11259 -20923 -9271 11397 -6031 -31773 -24211 -21821 -5050 29715 44546 49202 37018 6219
11247 6219 -5243 -4693 5290 11598 33988 57273 35837 13273 8247 -882 5650 14529 2405
11234 2405 9843 11877 45180 47900 53916 49616 39391 27613 40314 33991 -8975 -7492 -17750
11221 -17750 -19936 -6452 -3855 -7198 1297 14320 21104 33133 44771 65875 40205 19501 1912
11208 1912 8189 -3370 8110 23801 27159 13145 144 23389 47071 31625 37074 12695
11196 12695 -25950 -17855 -5177 3273 23421 61140 65297 55037 33247 5864 3747 12048 19143
11183 19143 9371 16607 32013 34253 38360 40013 31590 -3249 -21440 -32506 -27839 -3921 15650
11170 15650 10802 30053 37793 51825 37500 10810 26699 13763 5728 15609 19595 37537 37899
$$ packed form
11259b0923J1652K0668j7428k5742P562K390J6771L4765J4831M656j2184l0799
11247F219j1462N50R983O308K2390K3285k1436k2564n026r129O532Q879j2124
11234B405P438K034L3303K720O016m300j0225j1778J2701o323m2966J483j0258
11221a7750k186J3484K597l343Q495J3023O784J2029J1638K1104k5670k0704j7589
11208A912O277j1559J1480J5691L358j4014j3001K3245K3682j5446N449k4379
11196A2695l8645Q095J2678Q450K0148L7719M157j0260k1790k7383k117Q301P095
11183A9143r772P236J5406K240M107J653q423l4839j8191j1066M667K3918J9571
11170A5650m848J9251P740J4032j4325k6690J5889j2936q035R881L986J7942L62
$$ plain form
11157 37899 25221 25662 45855 52261 47242 28801 17866 23063 27867 28022 23916 20863 -11163 -7898
11143 -7898 -5517 -22547 -23791 -15381 5799 4851 -2812 -466 -12139 -38679 -50982 -50500 -23063 -3320
11129 -3320 -13381 -15991 -15212 -29013 -13983 -3703 -23685 -33108 -33937 -34183 -25558 1797 35353 26903
11115 26903 28182 20967 -7164 -27565 -45734 -11029 29532 16374 6442 13552 15098 25462 23575
11102 23575 9250 4947 -7148 10113 -7996 -9232 3847 -2658 -4099 -50766 -38216 -15137
11090 -15137 6870 19497 18971 29279 21869 21968 16112 20930 15938 32566 55278 86657 66152
11077 66152 55610 57061 82642 123511 100471 54286 27910 6579 12237 21009 20870 20502 -4365
11064 -4365 -21956 -12423 5238 42560 85738 111507 90206 76412 57810 63402 63112 68204 66441
$$ packed form
11157C7899j2678M41K0193O406n019j8441j0935N197M804J55m106l053l2026L265
11143g898K381j7030j244Q410K1180r48p663K346j1673k6540j2303M82K7437J9743
11129c320j0061k610P79j3801J5030J0280j9982r423q29k46Q625K7355L3556q450
11115B6903J279p215k8131k0401j8169L4705M0561j3158r932P110J546J0364j887
11102B3575j4325m303j2095J7261j8109j236J3079o505j441m6667J2550K3079
11090a5137K2007J2627n26J0308p410R9n856M818m992J6628K2712L1379k0505
11077F6152j0542J451K5581M0869k3040m6185k6376k1331N658Q772j39l68k4867
11064d365j7591R533J7661L7322M3178K5769k1301j3794j8602N592k90N092j763
$$ plain form
11051 66441 57585 31341 3201 -4731 -13205 7025 14201 10745 8465 7494 2290 -20469 -31365
11038 -31365 -9372 19103 30568 25714 37508 50052 52053 46306 38443 83789 117458 122131 97526
11025 97526 70321 32885 46579 90342 118367 136355 122330 88903 86817 81245 68216 51020
11013 51020 44944 50029 72351 75627 74860 42817 35542 46323 66258 45606 71414 57021 36370
11000 36370 36324 9867 14983 26507 68641 78385 54395 39669 42969 59588 105652 118052 103510
10987 103510 122415 155938 158301 183140 199328 221989 236424 284068 400704 583333 847807
10976 847807 1232264 1674202 1946484 1836470 1462281 1095144 812078 632854 503392 398678
10966 398678 317992 254794 252678 274882 274881 239184 199527 171803 176009 192149 178613 164409 155639
$$ packed form
11051F6441q856k6244k8140p932q474K0230P176l456k280r71n204k2759j0896
11038c1365K1993K8475J1465m854J1794J2544K001n747p863M5346L3669M673k4605
11025I7526k7205l7436J3694M3763K8025J7988j4025l3427k086n572j3029j7196
11013E1020o076N085K2322L276p67l2043p275J0781J9935k0652K5808j4393k0651
11000C6370m6k6457N116J1524M2134R744k3990j4726L300J6619M6064J2400j4542
10987A03510J8905L3523K363K4839J6188K2661J4435M7644J16636J82629K64474
10976H47807L84457M41938K72282j10014l74189l67137k83066j79224j29462j04714
10966C98678q0686o3198k116K2204jl5697l9657k7724M206J6140j3536j4204q770
$$ plain form
10953 155639 138937 153769 156959 156697 154041 146909 136367 115454 91668 84030 117264 132412 121536
10940 121536 88594 87668 82533 96807 103439 106034 104612 90794 93612 115358 106269 99138 103535
10927 103535 92700 31343 35980 43981 60466 59659 48961 45536 42277 42291 42109 77398 65206 43690
10913 43690 45585 38636 16089 26190 58363 39800 14666 12187 20285 13032 27289 58730 76715
10900 76715 76733 104195 96691 68701 60292 36349 33240 64700 79888 77423 81355 92493 97621
10887 97621 109168 97558 75181 62081 84775 86298 86391 108433 109620 120816 124957 111017 94058
10874 94058 91905 88972 104442 97335 68733 45954 35653 55116 54087 34961 17206 -1062
10862 -1062 -9443 17266 18612 19142 2422 -23536 -15428 -8823 13022 29076 71766 106515 67778
$$ packed form
10953A55639j6702J4832L190k62k656p132j0542k0913k3786p638L3234J5148j0876
10940A21536l2942r26n135J4274O632K595j422j3818K818K1746r089p131M397
10927A03535j0835o1357M637Q001J6485q07j0698l425l259J4j82L5289j2192k1516
10913D3690J895o949k2547J0101L2173j8563k5134k479Q098p253J4257L1441J7985
10900G6715J8K7462p504k7990q409k3943l109L1460J5188k465L932J1138N128
10887I7621J1547j1610k2377j3100K2694J523R3K2042J187J1196M141j3940j6959
10874I4058k153k933J5470p107k8602k2779j0301J9463j029j9126j7755j8268
10862a062q381K6709J346N30j6720k5958Q108O605K1845J6054M2690L4749l8737
$$ plain form
10849 67778 53021 59021 64685 48845 36404 37113 47161 41965 32918 29247 42054 54328 53054
10836 53054 40421 11117 16531 33182 38901 31376 26246 38240 43705 58726 54014 68839 56151
10823 56151 68706 81618 91779 100767 84160 99597 100499 104888 114055 119219 117181 91408 113106
10810 113106 126077 124912 115454 147420 165960 144799 142307 151169 141348 120870 97023 87042 105444
10797 105444 102068 77128 85173 72866 72763 79343 71071 63119 58683 74142 74544 48425 43191 53805
10783 53805 51130 52098 57702 36217 34517 49633 34681 38215 84294 89675 63279 51060 56008
10770 56008 60157 61408 62173 70610 66398 31785 11953 12754 4561 -12423 -27309 -6501 -22607
10757 -22607 -32748 -9757 -28750 -47185 -51604 -65181 -72448 -84902 -61060 -32831 -26385 -17776
$$ packed form
10849F7778j4757O000N664j5840j2441P09J0048n196r047l671J2807J2274j274
10836E3054j2633k9304N414J6651N719p525n130J1994N465J5021m712J4825j2688
10823E6151J2555J2912J0161Q988j6607J5437R02M389R167N164k038k5773K1698
10810A13106J2971j165r458L1966J8540k1161k492Q862r821k0478k3847r981J8402
10797A05444l376k4940Q045j2307j03O580q272p952m436J5459M02k6119n234J0614
10783E3805k675R68N604k1485j700J5116j4952L534M6079N381k6396j2219M948
10770E6008M149J251P65Q437m212l4613j9832Q01q193j6984j4886K0808j6106
10757b2607j0141K2991j8993j8435m419j3577p267j2454K3842K8229O446Q609
$$ plain form
10745 -17776 -22293 -12737 -6837 3956 15017 -4941 15687 18885 -2318 2702 14488 19682 6267
10732 6267 29 11974 21119 32054 42532 46103 56154 62692 53727 69322 94806 74065 58645
10719 58645 45102 33610 23444 23116 2541 -5978 4056 7329 10245 5495 23204 39430 18935
10706 18935 6858 -450 11447 18399 4102 24603 22660 29605 37974 29401 33153 66626 82764
10693 82764 126975 204201 239602 271353 345288 447636 597566 769158 898585 1016436 1072009
10682 1072009 1085131 1105559 1157239 1198210 1201876 1224242 1259692 1264570 1201282 1112084 1033689 975685
10670 975685 894686 829067 792456 773838 756769 730354 726765 714862 705396 710213 703053 716144
10658 716144 744400 762850 752847 742463 737463 740365 750815 773069 777417 750524 764535 768673
$$ packed form
10745a7776m517R556N900J0793J1061j9958K0628L198k1203N020J1786N194j3415
10732F267o238J1945R145J0935J0478L571J0051O538q965J5595K5484k0741j5420
10719E8645j3543j1492j0166l28k0575q519J0034L273K916m750J7709J6226k0495
10706A8935j2077p308J1897O952j4297K0501j943O945Q369q573L752L3473J6138
10693H2764M4211P7226L5401L1751P3935J02348J49930J71592J29427J17851N5573
10682A072009J3122K0428N1680M0971L666K2366L5450M878o3288q9198p8395n8004
10670I75685q0999o5619l6611j8618j7069k6415l589j1903r466M817p160J3091
10658G16144K8256J8450j0003j0384n000K902J0450K2254M348k6893J4011M138
$$ plain form
10646 768673 744837 714588 676511 667219 690913 693406 686244 663548 638905 620609 593307 590708
10634 590708 596703 593979 563247 540397 556699 580877 585863 618064 627546 637458 649876 650157 665106
10621 665106 680012 706632 766219 809346 848712 841628 828891 847825 868236 877179 874049 898530
10609 898530 935915 965585 996070 991674 1004604 1043915 1082829 1128644 1172347 1211188 1216338 1227152
10597 1227152 1276095 1360088 1440882 1545142 1610580 1672309 1744561 1830138 1942057 2045642 2188703
10586 2188703 2405545 2589482 2785314 2987252 3218526 3510955 3801263 4145151 4542684
10577 4542684 5036465 5668313 6478090 7463514 8476607 9274704 9931457 10847679 12331572
10568 12331572 14657748 18160600 23083722 29386726 36317699 42734789 50360138 63489467
$$ packed form
10646G68673k3836l0249l8077r292K3694K493p162k2696k4643j8296k7302k599
10634E90708N995k724l0732k2850J6302K4178M986L2201R482R912J2418K81J4949
10621F65106J4906K6620N9587M3127L9366p084j2737J8934K0411Q943l130K4481
10609H98530L7385K9670L0485m396J2930L9311L8914M5815M3703L8841N150J0814
10597A227152M8943Q3993Q0794J04260O5438O1729P2252Q5577J11919J03585J43061
10586B188703K16842J83937J95832K01938K31274K92429K90308L43888L97533
10577D542684M93781O31848Q09777R85424J013093P98097O56753R16222J483893
10568A2331572K326176L502852M923122O303004O930973O417090P625349J3129329
$$ plain form
10560 63489467 87080132 127379863 189500586 270212282 348639691 374330115 316416602
10553 316416602 231360312 165747514 122893539 95686365 78252729 66816137 59046668
10546 59046668 53327048 48699692 44656304 41066132 38032164 35606882 33707217 32182147
10538 32182147 30863574 29429967 27731840 26049779 24621484 23439693 22458951 21638024
10530 21638024 20898968 20271058 19708630 19178045 18659299 18199873 17802893 17387522 16942374
10521 16942374 16489642 16002010 15452529 14911820 14435977 14001458 13610384 13239223 12855494
10512 12855494 12507367 12187624 11907868 11647875 11396669 11187309 10978933 10767408 10509459
10503 10509459 10243545 10015872 9804016 9612871 9395501 9192342 8949793 8711468 8465553
$$ packed form
10560F3489467K3590665M0299731O2120723Q0711696P8427409K5690424n7913513
10553C16416602q5056290o5612798m2853975k7207174j7433636j1436592p769469
10546E9046668n719620m627356m043388l590172l033968k425282j899665j525070
10538C2182147j318573j433607j698127j682061j428295j181791r80742q20927
10530B1638024p39056o27910n62428n30585n18746m59426l96980m15371m45148
10521A6942374m52732m87632n49481n40709m75843m34519l91074l71161l83729
10512A2855494l48127l19743k79756k59993k51206k09360k08376k11525k57949
10503A0509459k65914k27673k11856j91145k17370k03159k42549k38325k45915
$$ plain form
10494 8465553 8253708 8068599 7886370 7703281 7552988 7428891 7294524 7142824 6983574
10485 6983574 6866816 6749932 6628094 6514681 6402166 6278004 6201969 6082912 5938856 5845352
10475 5845352 5771924 5664163 5544161 5426066 5289334 5181859 5113940 5017632 4935952 4859517
10465 4859517 4774963 4664364 4543074 4441141 4344642 4262924 4195255 4106351 4008753 3911090 3818933
10454 3818933 3733259 3669603 3645653 3609222 3546653 3467152 3405989 3339867 3251270 3192786 3164549
10443 3164549 3143778 3089299 3038670 2971996 2973222 2978439 2978046 3011704 3109041 3200526 3243224 3287241
10431 3287241 3326373 3306557 3261346 3185118 3149715 3164611 3204641 3243429 3195522 3081254 2914490
10420 2914490 2795071 2741415 2686182 2616640 2565230 2534292 2485061 2444569 2421533 2412828 2377544
$$ packed form
10494H465553k11845j85109j82229j83089j50293j24097j34367j51700j59250
10485F983574j16758j16884j21838j13413j12515j24162p6035j19057j44056r3504
10475E845352p3428j07761j20002j18095j36732j07475o7919r6308q1680p6435
10465D859517q4554j10599j21290j01933r6499q1718o7669q8904r7598r7663r2157
10454C818933q5674o3656k3950l6431o2569p9501o1163o6122q8597n8484k8237
10443C164549k0771n4479n0629o6674J226N217l93L3658R7337R1485M2698M4017
10431C287241L9132j9816m5211p6228l5403J4896M0030L8788m7907j14268j66764
10420B914490j19419n3656n5233o9542n1410l0938m9231m0492k3036q705l5284
$$ plain form
10409 2377544 2330657 2280107 2213623 2173054 2145498 2130060 2095384 2051058 2041922 2030755 1999127
10398 1999127 1961082 1898138 1818600 1780218 1742829 1704519 1644164 1594453 1536201 1486331 1476142
10387 1476142 1454958 1443335 1436813 1419797 1385907 1358109 1330757 1327587 1328511 1308691 1270027 1239493
10375 1239493 1241998 1239040 1223015 1219431 1215346 1190458 1181487 1208815 1224522 1225594 1213015 1178666
10363 1178666 1135978 1107505 1112233 1096410 1086698 1096202 1056045 1046214 1047314 1056241 1047321 1026479 996285
10350 996285 977357 969245 961554 922650 880026 834277 797186 779046 776875 788906 782929 761734
10338 761734 743335 734640 722980 704968 704000 721303 723689 709656 675978 658992 628900 603678
10326 603678 602513 612091 607044 590494 589100 591016 585277 580338 593028 617519 614709 595316 603263
$$ packed form
10409B377544m6887n0550o6484m0569k7556j5438l4676m4326r136j1167l1628
10398A999127l8045o2944p9538l8382l7389l8310o0355m9711n8252m9870j0189
10387A476142k1184j1623o522j7016l3890k7798k7352l170R24j9820l8664l0534
10375A239493K505k958j6025l584m085k4888q971K7328J5707J072j2579l4349
10363A178666m2688k8473M728j5823r712R504m0157r831J100Q927q920k0842l0194
10350I96285j8928q112p691l8904m2624m5749l7091j8140k171J2031n977k1195
10338G61734j8399q695j1660j8012r68J7303K386j4033l3678j6986l0092k5222
10326F03678j165R578n047j6550j394J916n739m939J2690K4491k810j9393P947
$$ plain form
10313 603263 604948 569199 555455 551972 538932 515211 476265 452650 444426 425816 416379 407243
10301 407243 427606 425605 440863 452685 471947 464019 432009 436182 423625 414671 416009 421534 407117
10288 407117 379461 362537 378024 370471 352524 356732 372252 354392 337974 346175 361043 347036
10276 347036 335700 342765 353008 335169 294379 262641 266921 279621 291748 310702 316013 311974
10264 311974 317482 336237 332819 300631 277809 278848 287847 283383 292311 284844 290993 278532 255302
10251 255302 255737 257468 253582 241338 206768 162969 167124 193833 210522 216299 231161 226156 182363
10238 182363 164893 168182 163361 144312 142942 130508 127728 150921 190084 199490 201222 189536 190284
10225 190284 198590 193628 198288 193499 198627 176679 171746 181083 194548 203449 219107 222378 236194
$$ packed form
10313F03263J685l5749j3744l483j3040k3721l8946k3615q224j8610r437r136
10301D07243K0363k001J5258J1822J9262p928l2010M173j2557q954J338N525j4417
10288D07117k7656j6924J5487p553j7947M208J5520j7860j6418Q201J4868j4007
10276C47036j1336P065J0243j7839m0790l1738M280J2700J2127J8954N311m039
10264C11974N508J8755l418l2188k2822J039Q999m464Q928p467O149j2461k3230
10251B55302M35J731l886j2244l4570m3799M155K6709J6689N777J4862n005m3793
10238A82363j7470L289m821j9049j370j2434k780K3193L9163R406J732j1686P48
10225A90284Q306m962M660m789N128k1948m933R337J3465Q901J5658L271J3816
$$ plain form
10212 236194 283296 355748 457035 596963 735955 797076 767848 684652 549642 449164
10202 449164 393018 354171 339402 321962 312968 293413 293969 290660 303042 306175 290994 272036
10190 272036 250277 236802 225396 195778 188967 171372 170419 170935 189032 203400 193908 193703 195975
10177 195975 210908 193932 179932 166146 155988 127251 123540 138096 154703 132865 112562 109426
10165 109426 117960 140646 138642 162887 168476 176081 160706 153742 140907 159245 166456 156007 134518
10152 134518 123337 100417 115109 132189 129652 137201 143319 168122 199778 189851 204055 242582
10140 242582 298311 352834 392923 444428 535417 666904 875632 1212461 1626614 1967635
10130 1967635 2005166 1699148 1275256 948083 745663 610984 502631 432801 370263 330976
$$ packed form
10212B36194M7102P2452J01287J39928J38992O1121k9228q3196j35010j00478
10202D49164n6146l8847j4769j7440q994j9555N56l309J2382L133j5181j8958
10190B72036k1759j3475j1406k9618o811j7595r53N16J8097J4368r492k05K272
10177A95975J4933j6976j4000j3786j0158k8737l711J4556J6607k1838k0303l136
10165A09426Q534K2686k004K4245N589P605j5375o964j2835J8338P211j0449k1489
10152A34518j1181k2920J4692J7080k537P549O118K4803L1656r927J4204L8527
10140B42582N5729N4523M0089N1505R0989J31487K08728L36829M14153L41021
10130A967635L7531l06018m23892l27173k02420j34679j08353o9830o2538l9287
$$ plain form
10120 330976 306257 292583 299992 286619 271646 282396 259652 262036 266989 233495 195448 177034
10108 177034 159005 158210 176066 171939 171582 195862 188575 159808 133159 127065 138062 150137 141463
10095 141463 133631 120067 125876 121398 112909 117670 131541 148563 150997 145679 162758 175975 147499
10082 147499 114330 110245 117004 99809 101226 84928 96085 91092 91283 96803 103386 95913 98055
10069 98055 92663 102415 114819 121477 123123 117903 126871 114903 83157 74487 66979 63152 78762
10056 78762 78365 49274 58928 69513 85579 77262 71912 75122 75809 71345 79447 89744 85487 95280
10042 95280 96942 92684 95667 103690 91999 96042 90136 96050 80741 74025 82746 95379 96523 116780
10028 116780 104450 68221 53728 40159 59314 90315 78654 70745 101378 97717 65566 40185
$$ packed form
10120C30976k4719j3674P409j3373j4973J0750k2744K384M953l3494l8047j8414
10108A77034j8029p95J7856m127l57K4280p287k8767k6649o094J0997J2075q674
10095A41463p832j3564N809m478q489M761J3871J7022K434n318J7079J3217k8476
10082A47499l3169m085O759j7195J417j6298J1157m993J91N520O583p473K142
10069I8055n392R752J2404O658J646n220Q968j1968l1746q670p508l827J5610
10056G8762l97k9091R654J0585J6066q317n350L210O87m464Q102J0297m257R793
10042I5280J662m258K983Q023j1691M043n906N914j5309o716Q721J2633J144K0257
10028A16780j2330l6229j4493j3569J9155L1001j1661p909L0633l661l2151k5381
$$ plain form
10016 40185 48933 59750 64707 63646 67810 67190 68494 53509 59348 53234 63190 106441 132905 126425
10002 126425 106332 90887 88141 78709 91302 79978 60213 43420 53584 68194 64865 41351
9990 41351 22186 9376 21529 50362 68768 54403 51503 65541 79569 64245 73792 80526
9978 80526 55495 17350 22486 30977 39587 74348 92344 93418 89855 77011 72859 69361 61354
9965 61354 53171 74476 77575 51606 37392 30659 23853 23707 27188 21614 27893 47070 43818 36490
9951 36490 26018 7872 30018 35503 34149 19423 36088 71105 76204 51742 60503 60845 75726
9938 75726 82854 66519 58355 68369 81665 68476 58041 50011 41340 21397 32392 31963 27609
9925 27609 -7024 -17971 -32143 -6480 20666 25209 31674 11930 -6748 10001 29082 23393
$$ packed form
10016D0185Q748J0817M957j061M164o20J304j4985N839o114R956M3251K6464o480
10002A26425k0093j5445k746r432J2593j1324j9765j6793J0164J4610l329k3514
9990D1351j9165j2810J2153K8833J8406j4365k900J4038J4028j5324R547O734
9978H0526k5031l8145N136Q491Q610L4761J7996J074l563j2844m152l498q007
9965F1354q183K1305L099k5969j4214o733o806j46L481n574O279J9177l252p328
9951C6490j0472j8146K2146N485j354j4726J6665L5017N099k4462Q761L42J4881
9938G5726P128j6335q164J0014J3296j3189j0435q030q671j9943J0995m29m354
9925B7609l4633j0947j4172K5663K7146M543O465j9744j8678J6749J9081n689
$$ plain form
9913 23393 890 8295 33272 65793 79184 54236 47474 70723 67533 56818 58141 40450 24567
9900 24567 63009 77920 86430 77774 44991 26694 26518 7114 16475 20280 2264 -12744 -25189
9887 -25189 -11015 6022 27890 48426 64065 72239 61376 44895 43620 40971 29061 14289
9875 14289 -14378 -22748 9083 16193 13860 24124 14913 26085 38984 70504 96635 94061 114283
9862 114283 118238 138832 233081 387205 561117 707662 750993 625792 437540 290300 218638
9851 218638 151551 135960 114240 109781 123003 125530 130001 119802 104305 94063 88244 87048 78222
9838 78222 70400 71352 64454 87003 95130 70904 66344 60256 70895 95198 70026 66115 40194
9825 40194 20381 20209 19687 42426 57802 55657 69303 63329 30030 -1170 21022 24357 24959 45498
$$ packed form
9913B3393k2503P405K4977L2521J3391k4948o762K3249l190j0715J323j7691j5883
9900B4567L8442J4911Q510q656l2783j8297j76j9404R361L805j8016j5008j2445
9887b5189J4174J7037K1868K0536J5639Q174j0863j6481j275k649j1910j4772
9875A4289k8667q370L1831P110k333J0264r211J1172J2899L1520K6131k574K0222
9862A14283L955K0594R4249J54124J73912J46545M3331j25201j88252j47240p1662
9851B18638o7087j5591k1720m459J3222K527M471j0199j5497j0242n819j196q826
9838G8222p822R52o898K2549Q127k4226m560o088J0639K4303k5172l911k5921
9825D0194j9813j72n22K2739J5376k145J3646n974l3299l1200K2192L335O02K0539
$$ plain form
9811 45498 57458 57800 36246 13286 22745 34804 71356 63829 53940 44022 60861 62175 31677
9798 31677 47202 61430 61526 23870 10854 16199 29257 35655 45064 64145 77997 42977 32618
9785 32618 40666 37461 51117 65183 63684 47947 26436 6259 23150 52280 49907 32107 38227
9772 38227 5289 11089 17965 12491 12832 15252 -212 14749 32483 30340 33117 32525 35101 16550
9758 16550 23817 11968 20130 19262 9639 6291 274 7080 29307 32636 29300 12445 24508 30608
9744 30608 36904 43645 54864 76765 89587 112293 142784 168120 163730 133452 136233 119110 114081
9731 114081 119319 110817 108980 94660 64218 60056 48570 44499 48748 54412 30475 29935 29802 43339
9717 43339 35893 26202 25480 31910 33675 37743 57849 66319 41276 30750 15665 -3662 16151
$$ packed form
9811D5498J1960L42k1554k2960R459J2059L6552p527r889r918J6839J314l0498
9798C1677J5525J4228R6l7656j3016N345J3058O398R409J9081J3852l5020j0359
9785C2618Q048l205J3656J4066j499j5737k1511k0177J6891K9130k373j7800O120
9772C8227l2938N800O876n474L41K420j5464J4961J7734k143K777n92K576j8551
9758A6550P267j1849Q162q68r623l348o017O806K2227L329l336j6855J2063O100
9744C0608O296O741J1219K1901J2822K2706L0491K5336m390l0278K781j7123n029
9731A14081N238q502j837j4320l0442m162j1486m071M249N664k3937n40j33J3537
9717D3339p446r691p22O430J765M068K0106Q470k5043j0526j5085j9327J9813
$$ plain form
9704 16151 38775 5808 -5026 982 8531 -985 17686 40249 50490 10120 -19609 -24723 -7380
9691 -7380 22121 19906 6149 10667 33954 48066 32869 15934 21302 27863 27678 37489 9762
9678 9762 -13288 -21910 -19535 -13683 426 24674 29894 24558 14391 12389 2868 -16383 -18603 13487
9664 13487 12569 1809 -2922 21546 62051 54756 24467 2472 -22082 -16937 372 -5411 15875
9651 15875 24631 11254 21709 19305 21160 9266 22860 18124 26337 50103 35208 10914 741
9638 741 7995 36370 47813 52593 48961 29572 20680 34770 30649 48546 29802 3933 -273
9625 -273 5244 6816 -15551 -19544 -27919 -34213 -29170 -26189 -26527 -28082 -12355 2589 1975 4983 8110
9610 8110 28666 10521 -4066 -10106 -6653 4670 2212 -15817 -17868 17062 47473 55644 45882
$$ packed form
9704A6151K2624l2967j0834O008P549r516J8671K2563J0241m0370k9729n114J7343
9691g380K9501k215j3757M518K3287J4112j5197j6935N368O561j85R811k7727
9678I762k3050q622K375N852J4109K4248N220n336j0167k002r521j9251k220L2090
9664A3487r18j0760m731K4468M0505p295l0289k1995k4554N145J7309n783K1286
9651A5875Q756j3377J0455k404J855j1894J3594m736Q213K3766j4895k4294j0173
9638G41P254K8375J1443M780l632j9389q892J4090m121J7897j8744k5869m206
9625b73N517J572k2367l993q375o294N043K981l38j555J5727J4944o14L008L127
9610H110K0556j8145j4587o040L453J1323k458j8029k051L4930L0411Q171r762
$$ plain form
9597 45882 26758 24874 38593 40103 54756 57627 35331 -7318 -16186 -3825 6769 2624 778
9584 778 29915 21544 21806 34797 45634 49494 27095 3578 -29836 -43001 -46107 -16026 -10908
9571 -10908 6053 30826 33808 21332 23293 31693 24751 41668 39356 29149 32466 33895 26808
9558 26808 23154 28137 30467 38819 45899 45563 14772 -9036 11024 18078 -3751 897 24668 49679
9544 49679 67158 53137 19633 616 -12579 14510 33830 39434 19025 2804 8061 9474
9532 9474 -3615 -4671 5515 9227 11957 -11084 -12866 10031 54806 63098 52085 61998 58842
9519 58842 67223 62282 32867 23748 26829 9180 7486 207 2885 5637 22852 19083 24579 11268
9505 11268 11691 36021 54284 46276 26824 11616 20572 19109 10207 5360 -16085 -9208 23129
$$ packed form
9597D5882j9124j884J3719J510J4653K871k2296m2649q868J2361J0594m145j846
9584G78K9137q371K62J2991J0837L860k2399k3517l3414j3165l106L0081N118
9571a0908J6961K4773K982j2476J961Q400o942J6917k312j0207L317J429p087
9558B6808l654M983K330Q352P080l36l0791k3808K0060P054k1829M648K3771K5011
9544D9679J7479j4021l3504j9017j3195K7089J9320N604k0409j6221N257J413
9532I474j3089j056J0186L712K730k3041j782K2897M4775Q292j1013R913l156
9519E8842Q381m941k9415r119L081j7649j694p279K678K752J7215l769N496j3311
9505A1268M23K4330J8263q008j9452j5208Q956j463q902m847k1445O877L2337
$$ plain form
9492 23129 21983 -3457 -20955 -46687 -36027 -13596 1559 6384 23683 29863 43440 36791 44065
9479 44065 43461 28887 15503 -721 -3496 25333 19254 13518 27524 37872 23057 24229 25712
9466 25712 14069 23405 35076 30745 28355 15183 27675 39699 20107 15705 24025 30624 13110
9453 13110 -35301 -59677 -43738 -12092 2157 -9311 -12384 -11620 27409 22718 16136 25151 21518
9440 21518 33405 54776 76692 62633 46829 31581 48150 69605 74556 57071 30219 15792
9428 15792 7654 11708 15354 6200 5522 1925 8615 28858 26749 5051 16091 31813 29352 23095
9414 23095 13357 20462 46752 22907 21685 9083 1347 -14563 -14743 18555 21275 17130 16673 36411
9400 36411 33004 8689 -1503 14835 23043 50666 57298 65691 81064 90633 84110 52605 2684
$$ packed form
9492B3129j146k5440j7498k5732J0660K2431J5155M825J7299O180J3577o649P274
9479D4065o04j4574j3384j6224k775K8829o079n736J4006J0348j4815J172J483
9466B5712j1643R336J1671m331k390j3172J2492J2024j9592m402Q320O599j7514
9453A3110m8411k4376J5939L1646J4249j1468l073P64L9029m691o582R015l633
9440B1518J1887K1371K1916j4059j5804j5248J6569K1455M951j7485k6852j4427
9428A5792q138M054L646r154o78l597O690K0243k109k1698J1040J5722k461o257
9414B3095r738P105K6290k3845j222j2602p736j5910j80L3298K720m145m57J9738
9400C6411l407k4315j0192J6338Q208K7623O632Q393J5373R569o523l1505m9921
$$ plain form
9387 2684 967 42192 56099 67122 68584 70654 68217 39504 28554 36003 42838 62470 60310
9374 60310 39972 56773 77878 84254 77181 65242 79252 62558 36925 36479 14621 15101 42621
9361 42621 60029 57574 86099 78830 66268 64670 63264 35844 32962 53709 50628 55717 51564
9348 51564 31709 49844 53293 61545 68352 59444 51451 68632 54316 44508 17580 -4470 -9542
9335 -9542 -880 19091 68840 72534 61956 51679 43073 51829 48249 19861 24866 27425 4042
9322 4042 -31245 -55254 -32093 -16615 -2052 16477 45107 60284 45673 33218 14145 13946
9310 13946 7063 16535 4159 12965 10035 14538 23863 24152 -4278 9717 37076 65409 74427 77075
9296 77075 48662 41634 43224 47593 38351 52196 57317 46148 71979 54658 39183 39179 30349 33645
$$ packed form
9387B684j717M1225J3907J1023J462K070k437k8713j0950P449O835J9632k160
9374F0310k0338J6801K1105O376p073j1939J4010j6694k5633m46k1858M80K7520
9361D2621J7408k455K8525p269j2562j598j406k7420k882K0747l081N089m153
9348E1564j9855J8135L449Q252O807q908p993J7181j4316r808k6928k2050n072
9335i542Q662J9971M9749L694j0578j0277q606Q756l580k8388N005K559k3383
9322D042l5287k4009K3161J5478J4563J8529K8630J5177j4611j2455j9073j99
9310A3946o883R472j2376Q806k930M503R325K89k8430J3995K7359K8333R018K648
9296G7075k8413p028J590M369r242J3845N121j1169K5831j7321j5475mq830L296
$$ plain form
9282 33645 52223 60332 55233 38222 5160 4221 -2610 28625 34795 33888 53993 57252 48993 46515
9268 46515 35959 20567 16886 13238 22758 26623 25317 19334 18647 29751 18016 27306 37365 19811
9254 19811 7385 10358 27353 17227 11148 25056 26634 12764 22509 32626 48477 89512 93057
9241 93057 78148 51656 44454 54143 62954 54541 39980 45847 51376 55183 57093 60821 73715 69946
9227 69946 75493 92092 81151 73155 82657 84483 66168 48338 38542 36250 22555 20368 6725
9214 6725 28563 51879 38224 49312 41736 51652 64958 55665 57355 70119 34329 17162 13196
9201 13196 19470 50536 38315 36286 52287 49985 75457 94776 105020 117556 103966 78378
9189 78378 77569 82220 96203 112929 106937 84771 89185 80489 55763 65941 61698 67289 82568
$$ packed form
9282C3645J8578Q109n099j7011l3062r39o831L1235O170r07K0105L259q259k478
9268D6515j0556j5392l681l648R520L865j306n983o87J1104j1735R290J0059j7554
9254A9811j2426K973J6995j0126o079J3908J578j3870R745J0117J5851M1035L545
9241I3057j4909k6492p202R689Q811q413j4561N867N529L807J910L728J2894l769
9227F9946N547J6599j0941p996R502J826j8315j7830r796k292j3695k187j3643
9214F725K1838K3316j3655J1088p576R916J3306r293J690J2764l5790j7167l966
9201A3196O274L1066j2221k029J6001k302K5472J9319J0244J2536j3590k5588
9189G8378q09M651J3983J6726n992k2166M414q696k4726J0178m243N591J5279
$$ plain form
9176 82568 63857 62999 68910 67395 73023 68465 79816 61226 60065 51771 33736 34509 32641 37361
9162 37361 44614 27358 19231 47789 53199 50211 66324 46091 43257 46034 50216 43569 43336 54275
9148 54275 41315 48119 60015 50173 59416 68962 54300 46043 44909 50247 33901 20511 53983
9135 53983 64899 71403 81048 66666 59849 57468 63212 60644 64619 67662 73144 89796 68398 29742
9121 29742 28422 41402 43210 23753 35805 69499 98303 102693 81061 67164 32551 62919
9109 62919 104889 110846 80066 37543 23642 42333 64226 78927 61675 22346 7366 9373
9097 9373 35763 44330 61390 74669 101390 90427 70282 66672 77202 79469 77206 84763 81127
9084 81127 89880 90923 84184 94437 107608 120151 113780 87105 72959 53263 47690 57690 66844
$$ packed form
9176H2568j8711q58N911j515N628m558J1351j8590j161q294j8035P73j868M720
9162C7361P253j7256q127K8558N410k988J6113k0233k834K777M182o647k33J0939
9148E4275j2960O804J1896r842R243R546j4662q257j134N338j6346j3390L3472
9135E3983J0916O504R645j4382o817k381N744k568L975L043N482J6652k1398l8656
9121B9742j320J2980J808j9457J2052L3694K8804M390k1632j3897l4613L0368
9109F2919M1970N957l0780m2523j3901J8691K1893J4701j7252l9329j4980K007
9097I373K6390Q567J7060J3279K6721j0963k0145l610J0530K267k263P557l636
9084H1127Q753J043o739J0253J3171J2543o371k6675j4146j9696n573J0000R154
$$ plain form
9071 66844 86927 104222 112724 125938 117868 114115 90115 80213 75339 66068 68743 77255 95413
9058 95413 86976 80158 60041 51754 71522 78566 91047 110683 118716 125576 101800 84414 77051
9045 77051 88429 116495 134961 128716 94064 87784 106852 99344 106330 122545 139691 143926 139896
9032 139896 125844 130276 126034 134668 161285 161846 140816 109812 104622 132882 119570 106174 101717
9019 101717 94523 101240 112166 133903 146861 149601 180520 160913 129419 125986 105690 93019
9007 93019 110996 114157 117740 109320 81797 82327 111327 99690 112311 143167 152917 131019 124075
8994 124075 131172 120708 128091 133338 122364 117408 119385 124197 148895 158706 155034 157185 170346
8981 170346 181032 163946 170068 186745 174126 161226 146043 150556 155549 159251 146970 139813 132857
$$ packed form
9071F6844K0083J7295Q502J3214q070l753k4000r902m874r271K675Q512J8158
9058I5413q437o818k0117q287J9768P044J2481J9636Q033O860k3776j7386p363
9045G7051J1378K8066J8466o245l4652o280J9068p508O986J6215J7146M235m030
9032A39896j4052M432m242Q634K6617N61k1030l1004n190K8260j3312j3396m457
9019A01717p194O717J0926K1737J2958K740L0919j9607l1494l433k0296j2671
9007I3019J7977L161L583q420k7523N30K9000j1637J2621L0856R750k1898o944
8994A24075P097j0464P383N247j0974m956J977M812K4698R811l672K151J3161
8981A70346J0686j7086O122J6677j2619j2900j5183M513M993L702j2281p157o956
$$ plain form
8968 132857 153349 132981 127496 130901 140457 128925 117870 112686 125344 144008 122098 122652 119013
8955 119013 144829 168467 182946 200234 223865 231848 230100 186222 168844 171307 160635 170197
8943 170197 176394 177014 183525 182904 183698 213217 242258 216683 198372 185769 184249 152331 161428 200474
8929 200474 206832 176184 158035 170640 202107 191529 191533 197045 205587 211232 226586 243650 243209 232981
8915 232981 223182 244781 251159 244262 248661 231593 221462 249988 253416 246825 232066 236833 260148
8902 260148 260998 266396 284434 295078 285206 271401 259489 236949 241749 251595 250437 253576 269995
8889 269995 264211 279321 274900 254042 257239 268000 268725 267062 274089 293722 303685 309997 300163 277124
8875 277124 265350 277215 319988 334482 341491 342454 332336 329848 278288 279058 303816 305390 324331
$$ packed form
8968A32857K0492k0368n485L405R556j1532j1055n184J2658J8664k1910N54l639
8955A19013K5816K3638J4479J7288K3631P983j748m3878j7378K463j0672R562
8943A70197O197O20O511o21P94K9519K9041k5575j8311j2603j520l1918R097L9046
8929B00474O358l0648j8149J2605L1467j0578MN512Q542N645J5354J7064m41j0228
8915B32981r799K1599O378o897M399j7068j0131K8526L428o591j4759M767K3315
8902B60148Q50N398J8038J0644r872j3805j1912k2540M800R846j158L139J6419
8889B69995n784J5110m421k0858L197J0761P25j663P027J9633R963O312r834k3039
8875B77124j1774J1865M2773J4494P009R63j0118k488n1560P70K4758J574J8941
$$ plain form
8862 324331 357522 371715 376653 375822 371691 370983 385803 399690 362801 347540 340999 334996 363385
8849 363385 393911 404370 417810 444315 454945 424036 402630 425435 444565 467092 477394 484205
8837 484205 477218 459614 454373 441290 416713 413858 441060 486402 518047 527449 530258 520618 495987
8824 495987 491830 512595 538427 575737 593806 582716 572925 591249 612159 623339 607521 600290
8812 600290 623688 654064 654540 643372 632502 643468 652437 673234 710499 744106 757435 764446
8800 764446 771446 783126 792012 802332 825772 857301 877075 876615 896445 907905 920308 969602
8788 969602 1012202 1023395 1007175 985665 986584 1006494 1031985 1056556 1051534 1056747 1048456 1058692 1071289
8775 1071289 1085981 1125565 1179940 1180149 1175645 1189625 1227540 1259145 1262515 1256562 1268956 1313219
$$ packed form
8862C24331L3191J4193M938q31m131p08J4820J3887l6889j5261o541o003K8389
8849C63385L0526J0459J3440K6505J0630l0909k1406K2805J9130K2527J0302O811
8837D84205o987j7604n241j3083k4577k855K7202M5342L1645R402K809r640k4631
8824D95987m157K0765K5832L7310J8069j1090r791J8324K0910J1180j5818p231
8812F00290K3398L0376M76j1168j0870J0966Q969K0797L7265L3607J3329P011
8800G64446P000J1680Q886J0320K3440L1529J9774m60J9830J1460J2403M9294
8788I69602M2600J1193j6220k1510R19J9910K5491K4571n022N213q291J0236J2597
8775A071289J4692L9584N4375K09m504J3980L7915L1605L370n953J2394M4263
$$ plain form
8763 1313219 1353973 1407939 1439323 1451008 1456655 1457762 1470591 1481520 1529948 1565185 1575868 1621531
8751 1621531 1654799 1686643 1711801 1757217 1799082 1832869 1871461 1906036 1970652 2002246 2014087
8740 2014087 2070006 2131180 2183453 2235484 2287641 2324337 2366738 2431386 2509047 2554153 2621299
8729 2621299 2710540 2815291 2887640 2975727 3056183 3133411 3221588 3316484 3399848 3498742 3628340
8718 3628340 3734249 3823395 3936571 4075198 4231176 4356743 4498781 4648569 4806863 4987029
8708 4987029 5164686 5345234 5533338 5727863 5949834 6145424 6370688 6625487 6878721 7144449
8698 7144449 7412596 7691271 7990831 8278830 8580408 8908683 9284060 9656482 10030254 10401334
8688 10401334 10786712 11160890 11532835 11916203 12337300 12755653 13157978 13537283 13918913
$$ packed form
8763A313219M0754N3966L1384J1685N647J107J2829J0929M8428L5237J0683M5663
8751A621531L3268L1844K5158M5416M1865L3787L8592L4575O4616L1594J1841
8740B014087N5919O1174N2273N2031N2157L6696M2401O4648P7661M5106O7146
8729B621299Q9241J04751P2349Q8087Q0456P7228Q8177R4896Q3364R8894J29598
8718C628340J05909Q9146J13176J38627J55978J25567J42038J49788J58294J80166
8708D987029J77657J80548J88104J94525K21971J95590K25264K54799K53234K65728
8698G144449K68147K78675K99560K87999L01578L28275L75377L72422L73772L71080
8688A0401334L85378L74178L71945L83368M21097M18353M02325L79305L81630
$$ plain form
8679 13918913 14288141 14663072 15015358 15307916 15589523 15830799 16057399 16252908 16404571
8670 16404571 16502678 16539716 16550325 16532608 16488229 16396189 16264476 16069548 15899776 15706782
8660 15706782 15468194 15217802 14983564 14704114 14421948 14111446 13772251 13413493 13044545
8651 13044545 12717483 12427938 12125747 11780490 11479024 11199201 10931088 10669944 10386217
8642 10386217 10128773 9846194 9570726 9331553 9101939 8880160 8669859 8474031 8263865
8633 8263865 8074932 7860006 7647184 7457173 7287622 7119507 6975758 6823685 6660516 6517773
8623 6517773 6394470 6257605 6110732 5965339 5833717 5701204 5615613 5531230 5430874 5372221
8613 5372221 5335680 5352338 5363277 5280946 5091595 4908041 4761386 4657943 4558200 4445029
$$ packed form
8679A3918913L69228L74931L52286K92558K81607K41276K26600J95509J51663
8670A6404571R8107L7038J0609j7717m4379r2040j31713j94928j69772j92994
8660A5706782k38588k50392k34238k79450k82166l10502l39195l58758l68948
8651A3044545l27062k89545l02191l45257l01466k79823k68113k61144k83727
8642A0386217k57444k82579k75468k39173k29614k21779k10301j95828k10166
8633H263865j88933k14926k12822j90011j69551j68115j43749j52073j63169j42743
8623F517773j23303j36865j46873j45393j31622j32513q5591q4383j00356n8653
8613E372221l6541J6658J0939q2331j89351j83554j46655j03443r9743j13171
$$ plain form
8603 4445029 4332548 4219997 4123166 4056449 3998729 3928862 3828308 3744986 3673366 3611191 3552751
8592 3552751 3484323 3406581 3359471 3319262 3267260 3199860 3153485 3112706 3047257 2974099 2899614
8581 2899614 2862614 2804716 2786139 2769590 2735782 2678660 2615886 2575507 2528322 2480325 2453018
8570 2453018 2431977 2415473 2406567 2407376 2442663 2461230 2403097 2333438 2247723 2183864 2126977 2103969
8558 2103969 2083113 2055108 2021239 1986012 1957217 1937521 1930377 1899366 1882457 1870779 1832582 1789796
8546 1789796 1766119 1726107 1689681 1674560 1662565 1665022 1675272 1663743 1624310 1596556 1576619 1558670
8534 1558670 1530028 1518523 1491102 1457390 1454900 1449724 1424833 1397016 1384051 1348545 1299463 1283692
8522 1283692 1305247 1298319 1288094 1253726 1213230 1198012 1205150 1202243 1179193 1148364 1129668 1126718
$$ packed form
8603D445029j12481j12551r6831o6717n7720o9867j00554q3322p1620o2175n8440
8592C552751o8428p7742m7110m0209n2002o7400m6375m0779o5449p3158p4485
8581B899614l7000n7898j8577j6549l3808n7122o2774m0379m7185m7997k7307
8570B453018k1041j6504q906Q09L5287J8567n8133o9659q5715o3859n6887k3008
8558B103969k0856k8005l3869l5227k8795j9696p144l1011j6909j1678l8197m2786
8546A789796k3677m0012l6426j5121j1995K457J0250j1529l9433k7754j9937j7949
8534A558670k8642j1505k7421l3712k490n176k4891k7817j2965l5506m9082j5771
8522A283692K1555o928j0225l4368m0496j5218P138k907k3050l0829j8696k950
$$ plain form
8510 1126718 1146430 1124009 1092876 1049763 1023764 1003210 1012066 1032537 1038175 1015580 1013463 1006407
8498 1006407 981128 970671 959065 921458 909200 917130 911207 879967 838609 837595 835993 854796
8486 854796 866267 847698 834473 832002 829246 834290 810479 770302 770558 777803 762612 745347 749183
8473 749183 735331 696970 677100 655330 671577 674716 677798 689452 691329 682655 654525 633949
8461 633949 612733 600211 595496 576019 580791 577033 566646 556069 568285 578329 575288 592358
8449 592358 578984 555109 566655 581122 598850 586190 557177 551695 524787 523248 507871 503373
8437 503373 515685 501103 480552 470323 480554 492989 483875 462524 461157 445675 438941 434238
8425 434238 435840 427564 427861 414755 400293 409710 422369 423641 415216 389584 388684 395838 414793 426844
$$ packed form
8510A126718J9712k2421l1133m3113k5999k0554Q856K0471N638k2595k117p056
8498A006407k5279j0457j1606l7607j2258P930n923l1240m1358j014j602J8803
8486H54796J1471j8569j3225k471k756N044k3811m0177K56P245j5191j7265L836
8473G49183j3852l8361j9870k1770J6247L139L082J1654J877q674k8130k0576
8461F33949k1216j2522m715j9477M772l758j0387j0577J2216J0044l041J7070
8449E92358j3374k3875J1546J4467J7728j2660k9013n482k6908j539j5377m498
8437E03373J2312j4582k0551j0229J0231J2435r114k1351j367j5482o734m703
8425D34238J602q276K97j3106j4462R417J2659J272q425k5632r00P154J8955J2051
$$ plain form
8411 426844 414091 411951 400897 366095 348574 347808 350026 344809 315805 308284 334810 319020 303588
8398 303588 296063 295851 288149 291417 292754 313501 334355 327151 342655 344634 321744 278866 261278
8385 261278 259211 277177 291009 298915 327080 354979 361829 346433 326914 319813 306173 306748 302622
8372 302622 284242 281333 285295 275611 266699 251184 250543 240764 233460 246011 258877 260556 266787 267716
8358 267716 263004 240232 209238 221203 222020 196767 196701 187207 200256 247102 253876 234513 206876
8345 206876 204930 217361 236738 233531 217027 205237 199001 208859 218195 204896 209455 195717 194831
8332 194831 194015 193793 198102 215872 206485 174604 180300 194097 183918 172327 166859 170694 170905 202941
8318 202941 200131 174129 190711 185727 159543 165289 187887 203132 195676 163151 149034 148983 158607
$$ packed form
8411D26844j2753k140j1054l4802j7521p66K218n217k9004p521K6526j5790j5432
8398C03588p525k12p702L268J337K0747K0854p204J5504J979k2890m2878j7588
8385B61278k067J7966J3832P906K8165K7899O850j5396j9519p101j3640N75m126
8372C02622j8380k909L962r684q912j5515o41r779p304J2551J2866J679O231R29
8358B67716m712k2772l0994J1965Q17k5253o6r494J3049M6846O774j9363k7637
8345B06876j946J2431J9377l207j6504j1790o236R858R336j3299M559j3738q86
8332A94831q16k22M309J7770r387l1881N696J3797j0179j1591n468L835K11L2036
8318B02941k810k6002J6582m984k6184N746K2598J5245p456l2525j4117n1R624
$$ plain form
8305 158607 189086 170907 156616 160356 164761 149409 128551 129383 140641 159873 170364 175145 144710
8292 144710 131704 128446 128473 109341 120297 132095 155511 144503 141825 141921 134521 142073 110027 73420
8278 73420 75396 95239 86296 91406 100601 100562 90075 103791 106045 107180 107138 128485 162439 173612
8264 173612 157824 134606 124026 127732 114402 90969 83880 82359 77340 86381 83723 74954 83756
8251 83756 84775 95150 117482 115661 123468 108365 91464 97734 102920 112633 129898 120107 106580
8238 106580 102867 96234 97448 127659 147010 119937 75261 60194 73683 92350 110006 91807
8226 91807 80886 67348 62061 82267 104376 105802 111659 102164 79729 104346 101456 130895 118668
8213 118668 105260 80874 66397 80276 102287 110733 131331 116082 117398 110214 94105 65901
$$ packed form
8305A58607L0479j8179j4291L740M405j5352k0858Q32J1258J9232J0491M781l0435
8292A44710j3006l258K7j9132J0956J1798K3416j1008k678R6p400P552l2046l6607
8278G3420J976J9843q943N110R195l9j0487J3716K254J135m2K1347L3954J1173
8264A73612j5788k3218j0580L706j3330k3433p089j521n019R041k658q769Q802
8251H3756J019J0375K2332j821P807j5103j6901O270N186R713J7265r791j3527
8238A06580l713o633J214L0211J9351k7073m4676j5067J3489J8667J7656j8199
8226I1807j0921j3538n287K0206K2109J426N857r495k2435K4617k890K9439j2227
8213A18668j3408k4386j4477J3879K2011Q446K0598j5249J316p184j6109k8204
$$ plain form
8201 65901 89407 99359 99848 96325 82020 90766 100370 97389 111200 110815 91261 77734 74031 56292
8187 56292 74122 113005 113388 65964 60347 67708 79943 88867 113266 104586 102995 100872 87192
8174 87192 91374 95685 92417 83863 78219 68091 88204 96178 105939 110812 109901 100324 98810 89967
8160 89967 64930 57148 40900 40160 71723 84521 76777 75678 96639 117941 105721 96923 86077
8147 86077 76385 55077 67009 73883 71437 52541 46516 32556 49454 77422 101009 94043 74145
8134 74145 61296 59195 73685 109635 107388 99336 97375 96701 75997 66502 53728 63449 74453
8121 74453 77733 94035 89171 67961 51335 52316 77003 64002 40170 38969 65966 54698 33341
8108 33341 33297 36868 37959 40841 69105 40767 28317 37766 66243 59500 38552 39853 37956 31701
$$ packed form
8201F5901K3506R952M89l523j4305Q746R604k981J3811l85j9554j3527l703j7739
8187E6292J7830L8883L83m7424n617P361J2235Q924K4399q680j591k123j3680
8174H7192M182M311l268q554n644j0128K0113P974R761M873r11r577j514q843
8160H9967k5037p782j6248p40L1563J2798p744j099K0961K1302j2220q798j0846
8147H6077r692k1308J1932O874k446j8896o025j3960J6898K7968K3587o966j9898
8134G4145j2849k101J4490L5950k247q052j961o74k0704r495j2774R721J1004
8121G4453L280J6302m864k1210j6626R81K4687j3001k3832j201K6997j1268k1357
8108C3341m4L571J091K882K8264k8338j2450R449K8477o743k0948J301j897o255
$$ plain form
8094 31701 46145 44282 57653 86339 80640 50527 46992 56004 44434 23331 18858 28343 26962
8081 26962 49858 53694 57277 74040 87087 65305 51083 76599 79521 58643 45953 28131
8069 28131 27412 50026 38615 75419 75697 62896 66248 61369 65856 57199 37563 49620 74297
8056 74297 66427 54349 69839 101967 69792 52478 39431 48164 58508 53429 50523 17257 3460
8043 3460 26995 19961 24027 46993 48545 18748 35317 45490 51993 47900 28489 -15523 -23108
8030 -23108 -16965 11125 31502 23236 21051 32914 32800 33467 20941 39311 31165 -9140 -1426 8837
8016 8837 4933 20642 46342 54843 70392 48288 37173 35155 42464 57926 72570 82065 83232
8003 83232 66166 43965 51383 48650 55269 55065 56009 48091 58995 79742 58410 48713 74870 69284
$$ packed form
8094C1701J4444j863J3371K8686n699l0113l535R012j1570k1103m473R485j381
8081B6962K2896L836L583J6763J3047k1782j4222K5516K922k0878j2690j7822
8069B8131p19K2614j1411L6804K78j2801L352m879M487q657j9636J2057K4677
8056G4297p870j2078J5490L2128l2175j7314j3047Q733J0344n079k906l3266j3797
8043C460K3535p034M066K2966J552k9797J6569J0173O503m093j9411m4012p585
8030b3108O143K8090K0377q266k185J1863j14O67j2526J8370q146m0305P714J0263
8016H837l904J5709K5700Q501J5549k2104j1115k018P309J5462J4644R495J167
8003H3232j7066k2201P418k733O619k04R44p918J0904K0747k1332r697K6157n586
$$ plain form
7989 69284 44498 55637 50085 51467 82607 82425 71225 78244 104332 117954 98385 70305 55502
7976 55502 71073 65657 70759 54065 49320 63042 82267 91131 75415 42827 41442 15293 17822
7963 17822 45050 39138 46377 58268 57581 54985 52720 40241 42301 41387 41853 26406 41397 52928
7949 52928 53069 61962 71738 62503 64051 79616 59945 72965 69778 51507 55897 43433 54817
7936 54817 64327 67598 76423 93471 99215 80933 65912 37729 45057 42055 55441 83767 97785
7923 97785 79332 49886 46453 63539 72882 58097 57431 54513 43210 28618 34740 56083 53169
7910 53169 52896 40329 43743 50326 58623 58721 68504 68081 59932 66451 79339 62453 53102 54970 56922
7895 56922 67183 31331 26731 62668 62779 58236 58877 63929 71302 68511 82276 83413 76900 59227
$$ packed form
7989F9284k4786J1139n552J382L1140j82j1200P019K6088J3622j9569k8080j4803
7976E5502J5571n416N102j6694m745J3722J9225Q864j5716l2588j385k6149K529
7963A7822K7228n912P239J1891o87k596k265j2479K060r14M66j5447J4991J1531
7949E2928J41Q893R776r235J548J5565j9671J3020l187j8271M390j2464J1384
7936E4817R510L271Q825J7048N744j8282j5021k8183P328l002J3386K8326J4018
7923I7785j8453k9446l433J7086R343j4785o66k918j1303j4592O122K1343k914
7910E3169k73j2567L414O583Q297R8R783m23q149O519J2888j6886r351J868J952
7895E6922J0261l5852m600L5937J11m543O41N052P373k791J3765J137o513j7673
$$ plain form
7881 59227 23680 14903 29095 23280 -3967 -5425 1001 8894 -6329 -2609 18530 27916 29707
7868 29707 43904 56079 52457 26796 11020 3449 236 2232 35040 25569 18025 7316 6584
7855 6584 42428 60587 67173 56774 52405 64144 48609 41780 56242 58836 59707 39758 41970
7842 41970 47446 62162 76909 73840 65483 67299 21652 7589 -954 -5192 -890 8782 17562 11678
7828 11678 11570 37341 36539 41345 48060 21057 -2945 -5438 -1125 12932 33028 27383 26291 49199
7814 49199 28565 14150 34412 57226 60747 56338 52807 36504 36222 52515 48838 38436 40308
7801 40308 32292 18561 32446 40530 35154 18744 10593 22890 40211 28331 22047 21243 10783
7788 10783 28209 45973 29238 -3637 -995 -4341 3000 -5457 -14594 -12205 -23012 -37200 -24274
$$ packed form
7881E9227l5547q777J4192n815k7247j458O426P893j5223L720K1139R386J791
7868B9707J4197J2175l622k5661j5776p571l213J996L2808r471p544j0709p32
7855F584L5844J8159O586j0399m369J1739j5535o829J4462K594Q71j9949K212
7842D1970N476J4716J4747l069q357J816m5647j4063q543m238M302R672Q780n884
7828A1678j08K5771q02M806O715k7003k4002k493M313J4057K0096n645j092K2908
7814D9199k0634j4415K0262K2814L521m409l531j6303k82J6293l677j0402J872
7801D0308q016j3731J3885Q084n376j6410q151J2297J7321j1880o284q04j0460
7788A0783J7426J7764j6735l2875K642l346P341q457r137K389j0807j4188J2926
$$ plain form
7775 -24274 -22069 -11224 14919 40711 21916 29537 19077 8828 11451 7492 -19204 -23998 -5934
7762 -5934 -313 -6846 7179 11496 23306 31291 38665 11056 -3890 18169 20245 23015 35235
7749 35235 35219 6995 -1992 -3616 -3923 -28044 -4515 1023 3692 19881 -1183 -17825 -16681 13703
7735 13703 36537 22543 6674 -8835 -20984 -8609 -17234 -15204 -2025 -1104 -12115 -6929 5389
7722 5389 1752 -193 -2945 8179 12336 13579 14462 16179 23692 31477 48386 58441 42137 29715
7708 29715 26435 28466 41538 25003 -18 13091 21498 -175 2534 -9395 1647 23530 41256
7695 41256 26243 25241 28098 -68 -7157 18475 41944 36875 39538 24377 20549 13538 20029
7682 20029 14500 2465 2851 -13874 -3527 16880 13656 104 -5658 19170 40538 2409 -12301
$$ packed form
7775b4274K205J0845K6143K5792j8795P621j0460j0249K623l959k6696m794J8064
7762e934N621o533J4025M317J1810P985P374k7609j4946K2059K076K770J2220
7749C5235j6k8224q987j624l07k4121K3529N538K669J6189k1064j6642J144L0384
7735A3703K2834j3994j5869j5509j2149J2375q625K030J3179R21j1011N186J2318
7722E389l637j945k752J1124M157J243Q83J717P513P785J6909J0055j6304j2422
7708B9715l280K031J3072j6535k5021J3109Q407k1673K709j1929J1042K1883J7726
7695D1256j5013j002K857k8166p089K5632K3469n069K663j5161l828p011O491
7682B0029n529j2035L86j6725J0347K0407l224j3552n762K4828K1368l8129j4710
$$ plain form
7669 -12301 2928 35261 52594 7682 -9842 -2007 -1949 8826 -9207 -12996 -5093 2327 10175
7656 10175 31931 71205 58459 45920 55753 50516 41260 17295 -8111 -2447 4460 16998 26121
7643 26121 13865 4288 13857 30454 58210 68088 48796 30528 -1712 -12095 11233 32223
7631 32223 36844 31688 5839 -4733 -9485 7749 11193 2247 -10206 -12977 -24600 -15924 -22454
7618 -22454 -9059 27762 52388 38538 20555 25912 10612 -5091 -322 -2986 -1467 -4261 4720
7605 4720 -63 -26770 -39823 -34568 -60256 -49719 -27473 -18768 -9614 -2750 14124 15374 20497
7592 20497 24530 7108 20106 36973 28869 37628 31757 12595 -27462 -25207 -29456 -41398 -29262
7579 -29262 -17004 1177 28590 30794 20859 24567 6296 -14586 -37384 -34978 -29851 -18971 2149
$$ packed form
7669a2301J5229L2333J7333m4912j7524P835N8J0775j8033l789P903P420P848
7656A0175K1756L9274j2746j2539R833n237r256k3965k5406N664O907J2538R123
7643B6121j2256r577R569J6597K7756R878j9292j8268l2240j0383K3328K0990
7631C2223M621n156k5849j0572m752J7234L444q946j2453k771j1623Q676o530
7618b2454J3395L6821K4626j3850j7983N357j5300j5703M769k664J519k794Q981
7605D720m783k6707j3053N255k5688J0537K2246Q705R154O864J6874J250N123
7592B0497M033j7422J2998J6867q104Q759n871j9162m0057K255m249j1942J2136
7579b9262J2258J8181K7413K204r935L708j8271k0882k2798K406N127J0880K1120
$$ plain form
7566 2149 37282 67555 34502 13520 13113 6750 -6702 -1359 -23889 -39391 -23769 -23111 -19249
7553 -19249 -25612 -16557 -2516 -14196 -17674 -934 22740 34642 31915 16593 11649 2688 22307
7540 22307 40265 49994 44824 30755 10404 -4502 4830 8560 2350 -1879 -17715 2041 41659
7527 41659 43575 38987 7666 -18713 -20458 9184 1694 -14912 -23849 -24143 -9576 2467 8922
7514 8922 -7500 -20077 -31869 -40603 -35528 -20229 -18583 -10228 -5049 -4019 -15653 -27814 -36502
7501 -36502 -37699 -14714 3454 -4900 -20939 -19702 -15089 -2500 7149 15340 17929 19815 1701
7488 1701 9524 17453 23158 48268 36354 15386 3528 446 21033 35047 47815 45795 45410
7475 45410 35670 18463 -2798 -9386 5427 14072 -17260 -24882 -13663 -31204 -29875 -32664 -33247
$$ packed form
7566B149L5133L0273l3053k0982m07o363j3452N343k2530j5502J5622O58L862
7553a9249o363R055J4041j1680l478J6740K3674J1902k727j5322m944q961J9619
7540B2307J7958R729n170j4069k0351j4906R332L730o210m229j5836J9756L9618
7527D1659J916m588l1321k6379j745K9642p490j6606q937k94J4567J2043O455
7514H922j6422j2577j1792q734N075J5299J646Q355N179J030j1634j2161q688
7501c6502j197K2985J8168q354j6039J237M613J2589R649Q191K589J886j8114
7488A701P823P929N705K5110j1914k0968j1858l082K0587J4014J2768k020l85
7475D5410r740j7207k1261o588J4813Q645l1332p622J1219j7541J329k789n83
$$ plain form
7462 -33247 -15823 33052 67039 37837 24652 19660 -3198 -25796 -36476 -27366 -13651 -6317
7450 -6317 8 -21068 -17051 -12884 2415 1276 -33401 -46014 -18705 -36776 -39750 -25263 843
7437 843 3795 -6554 -1882 7101 3376 720 -3030 -31248 -27634 -19312 1858 20394 14699 90
7423 90 -9214 3927 4707 14391 26075 15136 3195 -3221 -8739 -9627 -5287 4867 6041 -12439
7409 -12439 -12122 -21431 -15026 -24231 -18345 9457 15116 -7825 -23681 -35877 -36400 -8735 -21292 -13173
7395 -13173 5328 22820 36194 24987 15789 13700 22951 40646 35038 18782 16505 14517 4665
7382 4665 -5121 -15197 3523 15551 11369 -9972 -4534 68 -591 5703 4368 -14514 2267 29530
7368 29530 27145 32738 41487 12723 10618 -15648 -18409 -16848 -12197 -6042 -11797 -16727 -24616 -37039
$$ packed form
7462c3247J7424M8875L3987k9202j3185m992k2858k2598j0680R110J3715P334
7450f317O325k1076M017M167J5299j139l4677j2613K7309j8071k974J4487K6106
7437H43K952j0349M672Q983l725k656l750k8218L614Q322K1170J8536n695j4609
7423I0r304J3141P80R684J1684j0939j1941o416n518q88M340J0154J174j8480
7409a2439L17r309O405r205N886K7802N659k2941j5856j2196n23K7665j2557Q119
7395a3173J8501J7492J3374j1207r198k089R251J7695n608j6256k277j988r852
7382D665r786j0076J8720J2028m182k1341N438M602o59O294j335j8882J6781K7263
7368B9530k385N593Q749k8764k105k6266k761J561M651O155n755m930p889j2423
$$ plain form
7354 -37039 -22013 -20451 -18744 -30026 -16983 11404 11674 577 -8821 -14285 6556 11326 7140
7341 7140 11016 9649 12148 -13210 -26470 1148 44829 71623 54283 43288 32785 43451 36168
7328 36168 23854 18000 14783 16181 16857 17419 19025 30683 34888 33976 34837 20374 2324 1210 5669
7313 5669 2807 -16689 -19683 -28782 -14294 -9552 -15533 -19364 -35027 -26132 -24555 -2910 2137 -13678
7299 -13678 -1004 -3649 -21708 -37881 -35705 -30697 -21654 -10206 448 -1099 -15178 -33471 -24833
7286 -24833 -10615 -16477 -13578 2769 -3 8402 -8304 -35835 -4725 16743 37765 32946 3946
7273 3946 7095 27679 11298 -28074 -25018 -28561 -10304 -3659 2687 -7330 -31096 -16190 -17435
7260 -17435 -3938 -8471 -25155 -9327 25297 32596 15532 21566 32967 32534 24794 32358 45879
$$ packed form
7354c7039J5026J562J707j1282J3043K8387K70j1097r398n464K0841M770m186
7341G140L876j367K499k5358j3260K7618M3681K6794j7340j0995j0503J0666p283
7328C6168j2314n854l217J398O76N62J606J1658M205r12Q61j4463j8050j114M459
7313E669k862j9496k994r099J4488M742n981l831j5663Q895J577K1645N047j5815
7299a3678J2674k645j8059j6173K176N008R043J1448J0654j547j4079j8293Q638
7286b4833J4218n862K899J6347k772Q405j6706k7531L1110K1468K1022m819k9000
7273C946L149K0584j6381l9372L056l543J8257O645O346j0017k3766J4906j245
7260a7435J3497m533j6684J5828L4624P299j7064O034J1401m33p740P564J3521
$$ plain form
7247 45879 24048 451 36054 35143 12919 -11654 -40193 -40730 -39620 -45529 -32519 -19624 -3177
7234 -3177 -17564 -42299 -17351 -6750 6366 5680 -9836 -9015 44774 69015 94218 80710 41523
7221 41523 14150 -20141 -21846 -11580 4317 10470 7563 30363 17267 2272 -4837 -8096 3556
7208 3556 -2392 -19090 -55544 -41177 -21298 -28379 -15764 -6301 6280 3098 -1948 -10064 -9353 3758
7194 3758 -27328 -27812 -2750 -7857 -6283 9258 -11478 -17432 -13205 2445 15635 -8184 -40511
7181 -40511 -27878 18221 37611 25918 24947 9263 -3371 -36291 -45388 -42387 -34449 -25422 -5246
7168 -5246 -5459 -28697 -30826 -6687 27627 54432 38625 22235 17382 9873 7512 8589 -2550
7155 -2550 3800 15999 15129 -8497 -43168 -47170 -21882 -7926 -7369 -8935 -5488 -870 14048 31187
$$ packed form
7247D5879k1831k3597L5603r11k2224k4573k8539n37J110n909J3010J2895J6447
7234c177j4387k4735K4948J0601J3116o86j5516Q21N3789K4241K5203j3508l9187
7221D1523k7373l4291j705J0266J5897O153k907K2800j3096j4995p109l259J1652
7208C556n948j6698l6454J4367J9879p081J2615R463J2581l182n046q116P11J3111
7194C758l1086m84K5062n107J574J5541k0736n954M227J5650J3190k3819l2327
7181d0511J2633M6099J9390j1693r71j5684j2634l2920r097L001P938R027K0176
7168e246k13k3238k129K4139L4314K6805j5807j6390m853p509k361J077j1139
7155b550O350J2199q70k3626l4671m002K5288J3956N57j566L447M618J4918J7139
$$ plain form
7141 31187 21562 32991 27939 105 19332 41618 19713 -11830 10015 45628 28297 22674
7129 22674 55354 64614 40455 25382 32911 28314 -354 -10034 -37953 -48993 -31488 -1677 -21885
7116 -21885 -40759 -13381 7440 16592 6530 2613 -3722 7606 14358 10949 3767 15776 4832
7103 4832 11269 23214 3176 -11149 195 17350 14912 -24080 -36311 -11725 -4732 -10022 -16534
7090 -16534 -13721 -7817 -2693 10320 5346 2245 1558 10978 21675 4962 -5447 -4322 4371 -4445
7076 -4445 -16104 -16530 -9157 -22590 -4951 7105 14213 7427 3086 10489 21755 44108 53763 39087
7062 39087 36244 32752 26107 4480 12211 22048 23222 2908 3085 3110 -5887 -28680 -25884 -27383 -11941
7047 -11941 -7571 -31831 -11924 8616 5769 -5710 -8540 11279 8334 -14080 -4277 19495 29675
$$ packed form
7141C1187r625J1429n052k7834J9227K2286k1905l1543K1845L5613j7331n623
7129B2674L2680R260k4159j5073P529m597k8668r680k7919j1040J7505K9811k0208
7116b1885j8874K7378K0821R152j0062l917o335J1328O752l409p182J2009j0944
7103D832O437J1945k0038j4325J1344J7155k438l8992j2231K4586O993n290o512
7090a6534K813N904N124J3013m974l101o87R420J0697j6713j0409J125Q693q816
7076d445j1659m26P373j3433J7639J2056P108o786m341P403J1266K2353R655j4676
7062C9087k843l492o645k1627P731R837J174k0314J77K5q997k2793K796j499J5442
7047a1941M370k4260J9907K0540k847j1479k830J9819k945k2414R803K3772J0180
$$ plain form
7034 29675 24955 27637 34969 58282 47499 11562 3436 -4468 14083 18316 8224 8144 16490 38815
7020 38815 36568 62062 44468 39222 34616 28897 8199 -15564 -39620 -36837 -45642 -27494 6679
7007 6679 11059 23559 30546 22216 24382 29493 -1487 -28283 -20170 -23209 -27473 -32926 -31922 1223
6993 1223 18691 14109 21565 12007 -1332 -22170 -23488 -21341 -24449 -32577 -54131 -48035 -5131 699
6979 699 16915 15251 19249 35455 42008 17734 15517 12098 -6469 -4658 -14413 -133 11518 1711
6965 1711 -5538 -20594 -1772 13199 17334 24540 19471 34021 39896 30211 3025 -6874 -11954 -17940
6951 -17940 -4315 5202 -1376 -5231 -19498 -24438 -8771 22424 1394 -12323 -346 991 -8779
6938 -8779 -12212 -7788 -8581 -19778 -15141 -12995 -16990 11790 29753 21340 23679 18709 7693 -8784
$$ packed form
7034B9675m720K682P332K3313j0783l5937q126p904J8551M233j0092q0Q346K2325
7020C8815k247K5494j7594n246m606n719k0698k3763k4056K783q805J8148L4173
7007F679M380J2500O987q330K166N111l0980k6796Q113l039m264n453J004L3145
6993A223J7468m582P456r558j3339k0838j318K147l108q128k1554O096M2904N830
6979F99J6216j664L998J6206O553k4274k217l419j8567J811r755J4280J1651r807
6965A711p249j5056J8822J4971M135P206n069J4550N875r685k7186r899n080n986
6951a7940J3625R517o578l855j4267m940J5667L1195k1030j3717J1977J337r770
6938h779l433M424p93j1197M637K146l995K8780J7963q413K339m970j1016j6477
$$ plain form
6924 -8784 -28379 -33559 -29423 -8580 9556 12801 24229 33927 1799 -1251 18114 51720 54695
6911 54695 37676 23948 11283 30263 -15505 -20429 -24754 141 16338 13023 110 -25078
6899 -25078 -32630 -20856 -39766 -41544 -23948 -4270 -15820 -32339 -40599 -22687 -15403 -6076 -12424
6886 -12424 -14403 2498 -5030 -12061 -12009 6928 32879 44210 45205 21492 20283 9521 1809 15557
6872 15557 26876 42414 24455 32835 31213 20453 6625 -10603 -4873 -20943 -7868 9948
6860 9948 14411 -7819 -20856 -2304 25501 45816 58037 56924 47494 21372 28103 2801 -25845
6847 -25845 -19312 -21999 -16425 6104 25200 13497 -8218 -8997 -24839 -16726 18939 12270 -19813
6834 -19813 -47161 -32400 -19102 -14453 -31656 -23871 -18983 -2817 -708 -20107 -27900 -27955 -18389 -22667
$$ packed form
6924h784j9595n180M136K0843J8136L245J1428R698l2128l050J9365L3606K975
6911E4695j7019j3728j2665J8980m5768m924m325K4895J6197l315j2913k5188
6899b5078p552J1774j8910j778J7596J9678j1550j6519q260J7912P284R327o348
6886a2424j979J6901p528p031N2J8937K5951J1331R95k3713j209j0762p712J3748
6872A5557J1319J5538j7959Q380j622j0760j3828j7228N730j6070J3075J7816
6860I948M463k2230j3037J8552K7805K0315J2221j113r430k6122O731k5302k8646
6847b5845O533k687N574K2529J9096j1703k1715p79j5842Q113L5665o669l2083
6834a9813k7348J4761J3298M649j7203P785M888J6166K109j9399p793n5R566m278
$$ plain form
6820 -22667 -24888 -7916 -5484 -10776 122 -4609 10797 20702 -1323 -5348 414 762 -4534 -14962
6806 -14962 -26643 8205 30372 23504 19003 3336 12022 12173 -100 -935 -7389 7506 37679
6793 37679 16067 9632 16151 11750 7804 6979 -2645 -27750 -33406 -37063 -53789 -50540 -23835 -11790
6779 -11790 -12797 -14483 -20797 -26217 -11707 -30637 -34601 -9345 10788 360 -16490 -37636 -24281
6766 -24281 -4754 18361 17007 3728 -4495 -8841 -5405 -20125 -18567 -15189 -1589 -7003 13111
6753 13111 16959 28097 32088 24343 6439 -11085 -22329 -49679 -43596 -51288 -36826 -12201 16347
6740 16347 26426 40990 32778 24569 15277 24700 28837 33014 12990 28207 44413 49636 33448
6727 33448 23164 9863 -551 -4666 7267 31331 15581 -963 -9956 -2445 18724 15080 29237
$$ packed form
6820b2667k221J6972K432n292J0898m731J5406R905k2025m025N762L48n296j0428
6806a4962j1681L4848K2167o868m501j5667Q686J51j2273q35o454J4895L0173
6793C7679k1612o435O519m401l946q25r624k5105n656l657j6726L249K6705J2045
6779a1790j007j686o314n420J4510j8930l964K5256K0133j0428j6850k1146J3355
6766b4281J9527K3115j354j3279q223m346L436j4720J558L378J3600n414K0114
6753A3111L848J1138L991p745j7904j7524j1244k7350O083p692J4462K4625K8548
6740A6347J0079J4564q212q209r292R423M137M177k0024J5217J6206N223j6188
6727C3448j0284j3301j0414m115J1933K4064j5750j6544q993P511K1169l644J4157
$$ plain form
6714 29237 28595 36096 25472 61986 58266 25630 9288 1067 -30469 -41280 -17560 -19174 -32952
6701 -32952 -22304 -25229 -36842 -31526 -50605 -59866 -35858 -9935 6610 12120 -15552 -10720 2733
6688 2733 21646 21166 -7928 -12322 -158 -17819 -37320 -50407 -46977 -29742 -25753 -854 -5652
6675 -5652 -5965 5563 3742 16935 16054 2977 -4328 -2987 -1614 7633 -8974 -22473 -20689 -15960
6661 -15960 -21812 -19630 -3597 -14442 -26906 -7266 28583 32323 33933 31264 23030 8604 2142
6648 2142 -877 -27173 -38835 -39311 -23009 -10780 -2279 10201 20981 18473 17423 5901 4336
6635 4336 9987 3515 446 -939 -5930 4926 14603 17967 40194 37841 386 -3300 11220 16914
6621 16914 34280 12315 -6589 -38965 -11561 8024 -170 -24674 -37229 -22149 -17739 -14223
$$ packed form
6714B9237o42P501j0624L6514l720l2636j6342q221l1536j0811K3720j614j3778
6701c2952J0648k925j1613N316j9079r261K4008K5923J6545N510k7672M832J3453
6688B733J8913m80k9094m394J2164j7661j9501j3087L430J7235L989K4899m798
6675e652l13J1528j821J3193q81j3077p305J341J373R247j6607j3499J784M729
6661a5960n852K182J6033j0845j2464J9640L5849L740J610k669q234j4426o462
6648B142l019k6296j1662m76J6302J2229Q501J2480J0780k508j050j1522j565
6635D336N651o472l069j385m991J0856R677L364K2227k353l7455l686J4520N694
6621A6914J7366k1965j8904l2376K7404J9585q194k4504j2555J5080M410L516
$$ plain form
6609 -14223 -38978 -32930 -28196 -24912 -38552 -36406 -29897 -2809 -9699 -5474 -17893 -41313 -41646 -37873
6595 -37873 -27365 -14550 10718 -3053 7254 23686 -3061 -25503 -36818 -40613 -52928 -18481
6583 -18481 -15263 -2398 6413 15371 10886 -17242 -22928 -3963 4179 19293 11465 6548 3975 -13086
6569 -13086 -15321 -12930 -15037 -4177 24992 15602 20103 29013 35203 29973 28241 11433 14122 2548
6555 2548 -5354 -3044 -7189 -4227 9560 13687 23159 34075 28783 18582 10171 -15451 -33513 -18765
6541 -18765 -9301 -5590 -23047 -29333 -22238 -2758 -11987 -46722 -46106 -44764 -26750 -38476 -27083
6528 -27083 -14731 -29811 -20704 -21271 -17558 9175 8879 21706 40016 26461 8961 23673 11267
6515 11267 11494 2083 -10791 2481 4377 -31452 -15381 9309 13936 12262 -3228 -11485 11410
$$ packed form
6609a4223k4755O048M734L284j3640K146O509K7088o890M225j2419k3420l33L773
6595c7873J0508J2815K5268j3771J0307J6432k6747k2442j1315l795j2315L4447
6583a8481L218J2865Q811Q958m485k8128n686J8965Q142J5114p828m917k573j7061
6569a3086k235K391k107J0860K9169r390M501Q910O190n230j732j6808K689j1574
6555B548p902K310m145K962J3787M127R472J0916n292j0201q411k5622j8062J4748
6541a8765R464L711j7457o286P095J9480r229l4735O16J342J8014j1726J1393
6528b7083J2352j5080R107n67L713K6733k96J2827J8310j3555j7500J4712j2406
6515A1267K27r411j2874J3272J896l5829J6071K4690M627j674j5490q257K2895
$$ plain form
6502 11410 -6475 -28057 -33706 -40481 -17844 -10373 -11810 -17046 -743 -14027 1157 10413 -6635
6489 -6635 -41048 -41558 -27910 -10668 -24107 -26557 -17628 -3608 343 12527 36769 9014 -28785
6476 -28785 -24990 -9077 -37214 -67025 -46693 -8018 3596 13618 4503 10091 14273 6518 14881
6463 14881 20733 4396 8152 967 1055 -3010 -2706 -8743 -8828 -1559 10908 -275 -22040 -37503 -26386
6448 -26386 -36521 -70943 -67497 -34641 -30711 -3027 22466 -6637 -9571 -14219 -26281 -24039 -1664
6435 -1664 -6748 -17400 -33700 -27338 -13163 10999 8858 8456 1306 -11200 -8951 8285 17765 -4525
6421 -4525 -38219 -41500 -37301 -19384 -16325 -22414 -7822 2005 -31972 -40234 -28019 -35344 -32116 -23234
6407 -23234 -20915 5969 5740 -14711 -15274 7938 18760 28306 7779 -16295 707 5385 16453
$$ packed form
6502A1410j7885k1582n649o775K2637P471j437n236J6303j3284J5184R256j7048
6489f635l4413n10J3648J7242j3439k450Q929J4020L951J2184K4242k7755l7799
6476b8785L795J5913k8137k9811K0332L8675J1614J0022r115N588M182p755Q363
6463A4881N852j6337L756p185Q8m065L04o037q5P269J2467j1183k1765j5463J1117
6448b6386j0135l4422L446L2856L930K7684K5493k9103k934m648j2062K242K2375
6435a664n084j0652j6300O362J4175K4162k141m02p150j2506K249J7236R480k2290
6421d525l3694l281M199J7917L059o089J4592R827l3977q262J2215p325L228Q882
6407b3234K319K6884k29k0451n63K3212J0822R546k0527k4074J7002M678J1068
$$ plain form
6394 16453 -4502 -5789 -19431 -25925 -22871 -22013 -29787 -22147 17416 38265 36096 50401 37154
6381 37154 -16471 -39427 -24315 -4788 -9067 -8386 -17959 -9174 -4474 10429 11796 -9561 -3607
6368 -3607 20117 29939 12202 -10138 -13754 -33144 -46494 -42089 -47724 -51401 -37756 -14437 -3158
6355 -3158 -13891 -2949 11800 -6351 -20093 -21160 -1813 -2871 9181 25660 29318 49609 48964
6342 48964 44046 13266 -10965 -4270 928 -32389 -39200 -8493 -17997 -14671 11841 31886 11978
6329 11978 1118 -2104 -8404 -23276 -18458 -32998 -47666 -16718 -12911 -36588 -29009 -12639 -12674
6316 -12674 8115 29180 31633 40499 33252 15749 -2410 5342 28406 14501 -15427 -59733 -45757
6303 -45757 -6397 -2596 -21059 -9273 4646 23436 30252 5463 -27626 -25158 -1147 -16692
$$ packed form
6394A6453k0955j287j3642o494L054Q58p774P640L9563K0849k169J4305j3247
6381C7154n3625k2956J5112J9527m279O81r573Q785M700J4903J367k1357N954
6368c607K3724R822j7737k2340l616j9390j3350M405n635l677J3645K3319J1279
6355c158j0733J0942J4749j8151j3742j067J9347j058J2052J6479L658K0291o45
6342D8964m918l0780k4231O695N198l3317o811L0707r504L326K6512K0045j9908
6329A1978j0860l222o300j4872M818j4540j4668L0948L807k3677P579J6370l5
6316a2674K0789K1065K453Q866p247j7503j8159P752K3064j3905k9928m4306J3976
6303d5757L9360L801j8463J1786J3919J8790O816k4789l3089K468K4011j5545
$$ plain form
6291 -16692 -19385 -25066 -34401 -4661 -5585 -7707 10918 40090 25960 4669 3218 -21704 -25906
6278 -25906 -30162 -12806 3363 10504 4438 12837 -15149 -45800 -35764 -44451 -31440 -24128 -18117
6265 -18117 -6025 24535 42732 55857 29001 2342 6293 -11612 -15434 -47066 -64147 -42515
6253 -42515 -14355 -58257 -56797 -30739 -26262 -9444 -9695 17218 14687 -12447 -9212 21954 51290
6240 51290 22161 -217 4853 8852 12850 6803 5160 11783 -16727 -37038 -18365 -21856 -9561
6227 -9561 15338 22007 33356 39445 27336 -10364 -16299 -1120 12149 8091 -4770 -19625 -17286
6214 -17286 -16168 -4753 23756 28059 25103 28987 39714 33547 11055 1436 7510 34404 21744
6201 21744 -4805 8988 27779 24257 5109 -19275 -30281 -33931 -35546 -10351 28710 6327
$$ packed form
6291a6692k693n681r335K9740r24k122J8625K9172j4130k1291j451k4922m202
6278b5906m256J7356J6169P141o066Q399k7986l0651J0036q687J3011P312O011
6265a8117J2092L0560J8197J3125k6856k6659L951j7905l822l1632j7081K1632
6253d2515K8160m3902J460K6058M477J6818k51K6913k531k7134L235L1166K9336
6240E1290k9129k2378N070L999L998o047j643O623k8510k0311J8673l491J2295
6227i561K4899O669J1349O089j2109l7700n935J5179J3269m058j2861j4855K339
6214a7286J118J1415K8509M303k956L884J0727o167k2492r619O074K6894j2660
6201B1744k6549J3793J8791l522j9148k4384j1006l650j615K5195L9061k2383
$$ plain form
6189 6327 6912 -22049 -21083 -23550 -29188 -22277 -7682 -12842 -3993 -7585 335 10262 17799 6423 -24168
6174 -24168 -27105 -32112 -31915 -33293 -18273 -8160 11409 6449 5705 2705 4592 14603 20849 25546
6160 25546 40913 53658 68570 35435 -1026 2527 21201 -4203 -22750 -15724 -9424 -1088 16494
6147 16494 18573 22433 27593 18061 10205 -3706 -10977 11443 18615 -152 17408 19412 23962 27478
6133 27478 45539 28292 14728 8315 -7338 -18007 -6626 -1492 1769 7490 1786 -28832 -55062
6120 -55062 -43367 -13628 -12847 -9331 -15909 -24466 -24581 -30999 -22715 -24959 -23840 -11672 6376 18914
6106 18914 28267 50871 34604 13314 1816 11724 -1136 -14946 -15695 -29160 818 29481 33972
6093 33972 27067 20231 12404 -17059 -30863 -6472 -10578 -22858 -25841 -32395 -27852 -21736 -7699
$$ packed form
6189F327N85k8961R66k467n638O911J4595n160Q849l592P920R927P537j1376l0591
6174b4168k937n007J97j378J5020J0113J9569m960p44l000J887J0011O246M697
6160B5546J5367J2745J4912l3135l6461L553J8674k5404j8547P026O300Q336J7582
6147A6494K079L860N160r532p856j3911p271K2420P172j8767J7560K004M550L516
6133B7478J8061j7247j3564o413j5653j0669J1381N134L261N721n704l0618k6230
6120e5062J1695K9739P81L516o578q557j15o418Q284k244J119J2168J8048J2538
6106A8914R353K2604j6267k1290j1498R908j2860j3810p49j3465K9978K8663M491
6093C3972o905o836p827k9463j3804K4391m106j2280k983o554M543O116J4037
$$ plain form
6080 -7699 -1121 -16581 -16304 -22828 -36954 -26367 -27484 -43562 -43303 -49061 -27501 -15846 1967 7170
6066 7170 -11291 -16940 -20778 -24976 -6237 12189 20259 14130 6691 8066 8123 9801 -13801 -6081
6052 -6081 12658 17829 11892 8806 -5417 -2684 -2199 1606 -10775 2494 8057 -4042 -19840 -15514
6038 -15514 -17744 -25034 -24262 -12053 19491 18896 18172 1216 -10003 -4208 -28959 -70412 -70740 -64754
6024 -64754 -12852 15034 12764 17495 9481 -7864 -25113 -18742 3904 1408 7322 -27583 -31637
6011 -31637 -25416 -13074 -26619 -35071 -50717 -65538 -53433 -46877 5501 11409 -11186 -18881 -37362
5998 -37362 -21925 -37124 -58023 -70213 -50212 -21070 -15759 -18263 -21040 -19836 -17279 -29872 -31415
5985 -31415 -33219 -26809 -34802 -48551 -55062 -35421 -29826 -27762 -14766 818 -9043 -40742 -50956
$$ packed form
6080g699O578j5460K77o524j4126J0587j117j6078K59n758K1560J1655J7813N203
6066G170j8461n649l838m198J8739J8426Q070o129p439J375N7J678k3602P720
6052f081J8739N171n937l086j4223K733M85L805j2381J3269N563j2099j5798M326
6038a5514k230p290P72J2209L1544n95p24j6956j1219N795k4751m1453l28N986
6024f4754N1902K7886k270M731q014j7345j7249O371K2646k496N914l4905m054
6011c1637O221J2342j3545q452j5646j4821J2105O556N2378N908k2595p695j8481
5998c7362J5437j5199k0899j2190K0001K9142N311k504k777J204K557j2593j543
5985c1415j804O410p993j3749o511J9641N595K064J2996J5584r861l1699j0214
$$ plain form
5972 -50956 -50045 -38543 -35413 -12324 -6885 2537 2532 -5683 -11742 -30042 -31540 -40214 -37872 -23273 -11747
5957 -11747 -16035 -18544 -6970 2961 -17556 -29141 -7940 3042 3093 4707 -2401 -14048 -13537 5271
5943 5271 -4907 -3157 -803 6285 11753 17678 30380 15898 1317 8204 17813 30791 5475
5930 5475 6341 25894 30268 -14211 -36613 -24657 13809 8023 -9490 -23690 -10892 12285 13818
5917 13818 -15227 -50685 -46724 -29849 -11116 -5024 -9437 -16908 -7784 -19359 -27288 -16513 -17822
5904 -17822 1074 19446 2805 -7486 -3442 2249 -4604 -3074 8619 9681 -17568 -30743 -53129
5891 -53129 -46893 -38143 -43059 -45168 -34713 -53666 -37957 -1561 -5123 90 8514 6564 -20435
5878 -20435 -33730 -19754 -14414 -9134 20902 39484 49517 54824 9368 -208 3793 4813 12237
$$ packed form
5972e0956R11J1502L130K3089N439R422nq215o059j8300j498q674K342J4599J1526
5957a1747m288k509J1574R931k0517j1585K1201J0982N1J614p108j1647N11J8808
5943E271j0178J750K354P088N468N925J2702j4482j4581O887R609J2978k5316
5930E475Q66J9553M374m4479k2402J1956L8466n786j7513j4200J2798K3177J533
5917A3818k9045l5458L961J6875J8733O092m413p471R124j1575p929J0775j309
5904a7822J8896J8372j6641j0291M044N691o853J530J1693J062k7249j3175k2386
5891e3129O236Q750m916k109J0455j8953J5709L6396l562N213Q424j950k6999
5878b0435j3295J3976N340N280L0036J8582J0033N307m5456r576M001J020P424
$$ plain form
5865 12237 15071 14435 450 -16459 -16984 -41292 -36008 -16504 -36028 -30464 -10869 16748 8253
5852 8253 -11364 -20482 -33042 -48318 -38661 -24440 -15571 17 2458 -3377 122 13695 5917
5839 5917 -26174 -16539 446 11008 -2666 -10698 -25495 -28708 -34039 -18712 1601 -2129 9314
5826 9314 5829 -18166 -17231 -6314 -28081 -34367 -20775 -14642 -27078 -4387 11165 15850 22669
5813 22669 10244 -2233 3662 3746 3781 5523 3933 13853 -7420 -6632 19730 4843 8074 14954 -11027
5798 -11027 -15708 -19336 -33678 -50234 -47577 -56953 -78856 -63717 -38912 -33812 -13990 -1525 -19496
5785 -19496 -28127 -21288 -6960 -10552 -3946 -1550 3751 -7184 -8410 3417 2229 -11832 -6620 1344
5771 1344 -9988 -12424 -23881 -23643 -34953 -4357 -8599 -25812 -32181 -35501 -21888 -13522 6234
$$ packed form
5865A2237K834o36j3985j6909n25k4308N284J9504j9524N564J9595K7617q495
5852H253j9617r118j2560j5276R657J4221Q869J5588K441n835L499J3573p778
5839E917l2091R635J6985J0562j3674q032j4797l213n331J5327K0313l730J1443
5826I314l485k3995R35J0917k1767o286J3592O133j2436K2691J5552M685O819
5813B2669j2425j2477N895Q4L5J742j590R920k1273P88K6362j4887L231O880k5981
5798a1027m681l628j4342j6556K657r376k1903J5139K4805N100J9822J2465j7971
5785a9496q631O839J4328l592O606K396N301j0935j226J1827j188j4061N212P964
5771A344j1332k436j1457K38j1310L0596m242j7213o369l320J3613Q366J9756
$$ plain form
5758 6234 13417 20449 1315 7981 12255 4474 -6964 -19652 -39603 -42003 -24420 -5909 8408
5745 8408 16374 14894 22287 14806 12258 13346 14088 21000 19441 8961 -16831 -21924 -17067 -2892
5731 -2892 9950 -50 17062 22761 -4504 -13446 -8811 1460 -12021 -20447 -12787 -13045 -2133
5718 -2133 4974 16905 -3474 -11397 -12124 -4948 -15557 5362 6049 -15904 -7134 3950 1920 3202
5704 3202 9299 -15896 -42413 -45180 -25799 -6011 8587 8833 34663 16146 -24136 -17680 -3206
5691 -3206 1581 28215 47781 52364 38970 -13808 -37041 -17545 -11383 -28043 -32109 -42486 -42917
5678 -42917 -51148 -53586 -55690 -52796 -29804 -12508 1781 -17630 7043 36561 24302 -549 -27422
5665 -27422 -27445 -30400 -42253 -30430 -15930 -2248 -1641 -19393 -19543 -4862 2076 -2075 -13984 -21568
$$ packed form
5758F234P183P032j9134O666M274p781j1438j2688j9951k400J7583J8511J4317
5745H408P966j480P393p481k548J088P42O912j559j0480k5792n093M857J4175
5731b892J2842j0000J7112N699k7265q942M635J0271j3481q426P660k58J0912
5718b133P107J1931k0379p923p27P176j0609K0919O87k1953Q770J1084k030J282
5704C202O097k5195k6517k767J9381J9788J4598K46K5830j8517m0282O456J4474
5691c206M787K6634J9566M583j3394n2778k3233J9496O162j6660m066j0377m31
5678d2917q231k438k104K894K2992J7296J4289j9411K4673K9518j2259k4851k6873
5665b7422k3k955j1853J1823J4500J3682O07j7752j50J4681O938m151j1909p584
$$ plain form
5651 -21568 -560 -3678 12695 10137 -19848 5108 3637 -279 -28347 -31596 -14245 584 13432
5638 13432 13423 21228 46453 37577 31984 14452 -5773 -9366 18194 5727 1079 8349 12681 22247
5624 22247 -8298 -35801 -35365 -21895 -19790 2314 -561 -7799 -5818 18049 18544 11244 15076 17485
5610 17485 -8322 -3375 19988 31845 37786 19862 24257 -4777 -18018 -25373 -37411 -18928 -6596
5597 -6596 8033 -12885 -29271 -42732 -30833 -21191 -34974 -42172 -22977 14073 14601 15583 -12055
5584 -12055 -11556 -19083 -31474 -24457 -13328 -18721 -17245 -5955 13284 -4528 -30621 417 6043
5571 6043 -25204 -27485 -25175 -15780 77 -9530 7338 18186 17306 4698 -9268 -15010 -22372 -35760
5557 -35760 -30826 -19334 7243 25826 12354 22359 15186 6503 4022 3798 -2547 -12549 -13104 -5259
$$ packed form
5651b1568K1008l118J6373k558k9985K4956j471l916k8068l249J7351J4829J2848
5638A3432rP805K5225q876n593j7532k0225l593K7560j2467m648P270M332R566
5624B2247l0545k7503M36J3470K105K2104k875p238J981K3867M95p300L832K409
5610A7485k5807M947K3363J1857N941j7924M395k9034j3241p355j2038J8483J2332
5597f596J4629k0918j6386j3461J1899R642j3783p198J9195L7050N28R82k7638
5584a2055M99p527j2391P017J1129n393J476J1290J9239j7812k6093L1038N626
5571F043l1247k281K310R395J5857r607J6868J0848q80j2608j3966n742p362j3388
5557c5760M934J1492K6577J8583j3472J0005p173q683k481k24o345j0002n55P845
$$ plain form
5543 -5259 -11735 -29304 -25150 -14245 -3558 -17194 -8634 -21093 -45272 -41719 -24111 -13693 7814
5530 7814 19128 32230 33982 25451 22632 -455 -18065 -22174 -31072 -40522 -35522 -29423 -30608 -30533
5516 -30533 -3257 734 23156 6769 -4371 18986 23229 24565 -2099 -17772 1479 10709 -1813
5503 -1813 -15605 -14164 14132 -1391 -18336 -20791 -27196 -16137 5499 9298 -9829 -25981 -16696
5490 -16696 32886 18672 -21108 -36506 -35952 -27801 -5561 5114 13174 -26 -15737 -29813 -41589
5477 -41589 -28591 -10958 15433 11398 9949 24807 12690 3899 11582 21974 35514 33062 21510
5464 21510 20620 11549 6690 -13024 -20937 -12062 -561 -9954 -11287 -11658 -9065 5811 18181 6914
5450 6914 -311 -29195 -57902 -49857 -20183 -11769 15245 16710 -16222 -20890 -28551 -16590 -23225
$$ packed form
5543e259o476j7569M154J0905J0687j3636Q560j2459k4179L553J7608J0418K1507
5530G814J1314J3102J752q531k819k3087j7610m109q898r450N000O099j185P5
5516c0533K7276L991K2422j6387j1140K3357M243J336k6664j5673J9251R230j2522
5503a813j3792J441K8296j5523j6945k455o405J1059K1636L799j9127j6152R285
5490a6696M9582j4214l9780j5398N54Q151K2240J0675Q060j3200j5711j4076j1776
5477d1589J2998J7633K6391m035j449J4858j2117q791P683J0392J3540k452j1552
5464B1510q90r071m859j9714p913Q875J1501r393j333l71K593J4876J2370j1267
5450F914p225k8884k8707Q045K9674Q414K7014J465l2932m668p661J1961o635
$$ plain form
5437 -23225 -9008 -12583 -24617 -46300 -36673 -21339 -25471 -18800 -12137 -18063 -7532 -25053 -21924
5424 -21924 -2924 26264 34294 26981 11761 1673 2016 -747 16549 26398 16600 549 -2435
5411 -2435 -6541 14745 11659 -16642 -34460 -19189 -34244 -27121 -24440 -38677 -32820 -11725 17498
5398 17498 -9052 -23250 -28674 -27998 17742 47602 39053 8333 -27152 -14820 1537 25998 39248
5385 39248 47824 37532 19538 564 -6790 -7932 -3507 21604 23597 7809 19030 -4434 -30283
5372 -30283 -34412 -29511 -6112 7516 -3927 -31974 -44807 -40125 -51638 -23105 -2223 -7099 -18295
5359 -18295 -8705 -4314 -5847 -13933 -13832 17601 12500 -3507 9695 -7157 -21819 -9501 15609
5346 15609 7972 145 -12597 -19356 -16711 -23472 -10294 7335 -5221 6018 11934 24207 16441
$$ packed form
5437b3225J4217l575j2034k1683R627J5334m132O671O663n926J0531j7521L129
5424b1924J9000K9188Q030p313j5220j0088L43k763J7296R849r798j6051k984
5411b435m106K1286l086k8301j7818J5271j5055P123K681j4237N857K1095K9223
5398A7498k6550j4198n424O76M5740K9860q549l0720l5485J2332J6357K4461J3250
5385C9248Q576j0292j7994j8974p354j142M425K5111J993j5788J1221k3464k5849
5372c0283m129M901K3399J3628j1443k8047j2833M682j1513K8533K0882m876j1196
5359a8295R590M391j533q086J01L1433n101j6007J3202j6852j4662J2318K5110
5346A5609p637p827j2742o759K645o761J3178J7629j2556J1239N916J2273p766
$$ plain form
5333 16441 13618 -3073 -20362 -20274 -31740 -21866 -4744 -12549 -34845 -25007 5300 -4491 -9628 2413
5319 2413 13202 11990 -9122 -21786 -24819 -21910 9177 5196 -4732 3956 14585 24853 10933
5306 10933 12097 4106 1522 2336 7556 6992 836 5806 8345 -17717 -32318 -53758 -54247 -26124
5292 -26124 -25883 -50944 -51828 -33673 -13431 3203 75 -11264 -7696 -19454 -27123 2776 6239
5279 6239 -18093 8613 28560 23553 9670 4422 -11036 -31703 -32795 -40402 -39856 -65331 -40305
5266 -40305 -9762 4605 5713 17193 23587 8426 8546 -2931 -17713 -15019 20751 10560 13103
5253 13103 42896 52951 15466 -11286 -34649 -12783 7257 4243 -12288 -21544 -23632 -42065
5241 -42065 -41056 -31791 -17819 -9551 -30500 -32571 -66742 -73511 -54574 -34560 -43324 -55866 -41288
$$ packed form
5333A6441k823j6691j7289Q8j1466R874J7122p805k2296R838L0307r791n137J2041
5319B413J0789j212k1112j2664l033K909L1087l981r928Q688J0629J0268j3920
5306A0933J164p991k584Q14N220n64o156M970K539k6062j4601k1440m89K8123
5292b6124K41k5061q84J8155K0242J6634l128j1339L568j1758p669K9899L463
5279F239k4332K6706J9947n007j3883n248j5458k0667j092p607N46k5475K5026
5266d0305L0543J4367J108J1480O394j5161J20j1477j4782K694L5770j0191K543
5253A3103K9793J0055l7485k6752k3363K1866K0040l014j6531r256k088j8433
5241d2065J009R265J3972Q268k0949k071l4171o769J8937K0014q764j2542J4578
$$ plain form
5228 -41288 -20021 -30406 -8192 12316 31611 21133 16042 24160 29014 14600 -5837 -14235 -13770
5215 -13770 -33557 -51123 -37751 -22118 -2201 -2047 -26316 -12452 -7452 -17957 10625 27391
5203 27391 31120 24610 16072 11626 9485 22093 29855 11693 -6059 -19116 -18227 -15138 -5791 13177
5189 13177 45857 56868 56058 44991 23495 -7277 -24536 -24179 -24988 -31010 -25314 1342 -14792
5176 -14792 -22234 -16840 -34695 -33295 -17282 -10201 -24277 -44312 -35350 -37829 -30204 -342 11618
5163 11618 -1585 14747 6862 -10267 -25205 -35698 -19624 -10394 -31083 -1887 25032 -8143
5151 -8143 -46113 -68511 -69479 -66898 -32794 -12177 24256 9797 -25378 -31371 -55774 -45552 -40491
5138 -40491 -24952 -6238 -1248 -28202 -37242 -42596 -46555 -22595 619 -366 20677 43684 32179
$$ packed form
5228d1288K1267j0385K2214K0508J9295j0478n091Q118M854j4414k0437q398M65
5215a3770j9787j7566J3372J5633J9917J54k4269J3864N000j0505K8582J6766
5203B7391L729o510q538m446k141J2608P762j8162j7752j3057Q89L089R347J8968
5189A3177L2680J1011q10j1067k1496l0772j7259L57q09o022N696K6656j6134
5176a4792p442N394j7855J400J6013P081j4076k0035Q962k479P625K9862J1960
5163A1618j3203J6332p885j7129j4938j0493J6074R230k0689K9196K6919l3175
5151h143l7970k2398r68K581L4104K0617L6433j4459l5175n993k4403J0222N061
5138d0491J5539J8714M990k6954r040n354l959K3960K3214r85K1043K3007j1505
$$ plain form
5125 32179 21867 -6120 -28271 -45055 -36617 -25360 13803 20587 -6339 -20511 -8681 28730
5113 28730 26163 16662 1631 -22973 -45925 -28280 -29490 -16887 10103 -11099 -8227 -5679 4574
5100 4574 2467 7192 1963 -4709 -8033 -35133 -29728 -469 -16998 -12599 8628 10597 3957 8558
5086 8558 18453 33241 35024 27566 13656 22265 -244 -7438 -10924 -16090 -8272 5297 -7406 -17954
5072 -17954 -15912 17565 47806 47917 28118 12567 25533 31079 12116 -1122 -5862 -9787 -22089
5059 -22089 -14006 -10772 -12913 -11905 -24401 -41983 -57524 -52403 -43270 -18568 -11293 -24017 -34729
5046 -34729 -13251 7193 2855 18598 16656 -12897 -21490 -9161 -7204 -23941 -31264 -13237 -2127
5033 -2127 -6231 -14860 -3809 -5677 -7954 -10983 -20255 -14989 -18139 -32224 -20137 17866 7052 -17505
$$ packed form
5125C2179j0312k7987k2151j6784Q438J1257L9163O784k6926j4172J1830L7411
5113B8730k567r501j5031k4604k2952J7645j210J2603K6990k1202K872K548J0253
5100D574k107M725n229o672l324k7100N405K9259j6529M399K1227J969o640M601
5086H558R895J4788J783p458j3910Q609k2509p194l486n166P818J3569j2703j0548
5072a7954K042L3477L0241J11j9799j5551J2966N546j8963j3238m740l925j2302
5059b2089Q083L234k141J008j2496j7582j5541N121R133K4702P275j2724j0712
5046c4729K1478K0444m338J5743j942k9553q593J2329J957j6737p323J8027J1110
5033b127m104q629J1051j868k277l029r272N266l150j4085J2087L8003j0814k4557
$$ plain form
5019 -17505 -20766 -26975 -9451 -8274 -9626 -4000 -22558 -43328 -68160 -70706 -50032 -29938 -29819
5006 -29819 -37102 -22090 -4045 -7877 27029 32733 13492 -8885 -22567 -37977 -40064 -30391 -36569
4993 -36569 -17134 16244 9449 -21573 -43474 -46660 -42144 -23774 -30867 -28617 -11227 -11562 -29362
4980 -29362 -24290 -34209 -43598 -42303 -12649 9146 27712 37536 20821 10209 -7247 -18607 -5266
4967 -5266 -28361 -14009 -8724 -9229 -19981 -20546 -19293 -21197 -24521 -48331 -35642 -17273 -36211 -41392
4953 -41392 -39947 -24377 -16007 -18277 -13226 -24265 -43570 -33474 -32889 -47337 -62004 -50702 -28986
4940 -28986 -25673 -38011 -39356 -14662 2054 53 8611 -3844 -27462 -34915 -31154 -32377 -21693
4927 -21693 -9081 -3483 3283 21188 -767 4387 23290 21846 17512 20337 21740 34729 29704
$$ packed form
5019a7505l261o209J7524J177j352N626j8558k0770k4832k546K0674K0094J19
5006b9819p283J5012J8045l832L4906N704j9241k2377j3682j5410k087R673o178
4993c6569J9435L3378o795l1022k1901l186M516J8370p093K250J7390l35j7800
4980b9362N072r919r389J295K9654K1795J8566R824j6715j0612j7456j1360J3341
4967e266k3095J4352N285n05j0752n65J253j904l324k3810J2689J8369j8938n181
4953d1392J445J5570Q370k270N051j1039j9305J0096N85j4448j4667J1302K1716
4940b8986L313j2338j345K4694J6716k001Q558j2455k3618p453L761j223J0684
4927b1693J2612N598O766J7905k1955N154J8903j444m334K825J403J2989n025
$$ plain form
4914 29704 30585 25363 22196 26015 14029 8424 10770 2388 5179 4152 7211 30921 40054 -1452
4900 -1452 -31699 -42861 -23328 -38552 -33232 -54777 -68656 -55995 -46353 -28693 -4634 13326
4888 13326 -1169 -19031 -21190 -1252 7488 -8986 -12410 -14323 -18126 -6740 -125 -1629 -7017
4875 -7017 -2150 -17719 -10760 8541 -14714 -32592 -36567 -42478 -21209 37424 26546 19359 15955
4862 15955 31714 24410 17471 18574 20717 2559 626 2591 8903 25506 19937 24782 18266 24851
4848 24851 50011 41317 23738 43169 52583 39354 31858 31640 9425 -13378 -27606 -24350 -9669
4835 -9669 1306 9950 7088 6477 23111 38568 19269 14791 5172 -7851 -15841 10518 30995
4822 30995 5028 -1408 12523 20354 33815 13753 -15672 6966 39017 60217 31466 465
$$ packed form
4914B9704Q81n222l167L819j1986n605K346q382K791j027L059K3710R133m1506
4900a452l0247j1162J9533j5224N320k1545j3879J2661R642J7660K4059J7960
4888A3326j4495j7862k159J9938Q740j6474l424j913l803J1386O615j504n388
4875g017M867j5569O959J9301k3255j7878l975n911K1269N8633j0878p187l404
4862A5955J5759p304o939J103K143j8158j933J965O312J6603n569M845o516O585
4848B4851K5160q694j7579J9431R414j3229p496k18k2215k2803j4228L256J4681
4835i669J0975Q644k862o11J6634J5457j9299m478r619j3023p990K6359K0477
4822C0995k5967o436J3931P831J3461k0062k9425K2638L2051K1200k8751l1001
$$ plain form
4810 465 3306 15677 45463 43996 16776 -8218 -8509 -5235 -426 -6331 -10295 660 1739 8076
4796 8076 13187 5396 14386 1186 -8565 -14203 5356 13244 5601 -1623 18867 22741 -23006 -55307
4782 -55307 -34262 9924 34929 14222 3877 -4619 -709 1616 -24419 -45229 -39848 -31648 -35139
4769 -35139 -35190 -47900 -49482 -50704 -46143 -34479 -14977 1004 20795 16723 -13356 -41989 -57443
4756 -57443 -43558 -43545 -47670 -34271 -9944 433 11861 -9712 -21229 -30833 -13211 1098 4786
4743 4786 20865 42065 36058 27830 4789 3284 11334 16728 25032 523 -2885 -7282 -10248 -578
4729 -578 -63 8262 6600 10562 -2827 -11402 12034 21455 31133 44383 26075 8337 -13495 -27855
4715 -27855 -7791 -8420 -16907 1923 21181 26295 23640 18321 -6393 -6436 -13286 -2295 4005 -1557
$$ packed form
4810D65K841J2371K9786j467k7220k4994k91L274M809n905l964J0955J079O337
4796H076N111p791Q990j3200r751n638J9559P888p643p224K0490L874m5747l2301
4782e5307K1045M4186K5005k0707j0345q496L910K325k6035k0810N381Q200l491
4769c5139n1j2710j582j222M561J1664J9502J5981J9791m072l0079k8633j5454
4756e7443J3885J3m125J3399K4327J0377J1428k1573j1517r604J7622J4309L688
4743D786J6079K1200o007q228k3041j505Q050N394Q304k4509l408m397k966R670
4729e78N15Q325j662L962j3389q575K3436R421R678J3250j8308j7738k1832j4360
4715b7855K0064o29q487J8830J9258N114k655n319k4714m3o850J0991O300n562
$$ plain form
4701 -1557 -25693 -11415 10380 14556 14077 24136 27363 19537 20738 21566 38419 31039 23153 26558
4687 26558 29108 24759 11656 -9746 1759 10735 14216 11548 13947 -4075 -20293 -44176 -52023
4674 -52023 -35421 -4636 17752 25151 -21630 -12515 -13880 -8253 -13175 -22219 -46590 -53691 -55257
4661 -55257 -60576 -66188 -61998 -49237 -34790 -9556 -25625 -14202 -900 -16053 -22435 -8754 4295
4648 4295 4935 14345 20477 13056 -8332 -9536 -12749 -16334 -20338 693 20318 7619 -811 -23307
4634 -23307 -38146 -31941 -39442 -62916 -41540 -17769 -19344 -24843 7657 20248 28569 8805 -4728
4621 -4728 -21911 -37872 -36392 -25041 -10893 -10810 -13314 -3183 -16590 -38981 -7252 -11413 -29016
4608 -29016 -51372 -31959 5433 30205 12788 -11564 2683 16462 36586 11097 -3877 17991
$$ packed form
4701a557k4136J4278K1795M176m79J0059L227p826J201Q28J6853p380p886L405
4687B6558K550m349j3103k1402J1505Q976L481k668K399j8022j6218k3883p847
4674e2023J6602L0785K2388P399m6781R115j365N627m922r044k4371p101j566
4661e5257n319n612M190J2761J4447K5234j6069J1423J3302j5153o382J3681J3049
4648D295O40R410O132p421k1388j204l213l585m004K1031J9625j2699q430k2496
4634b3307j4839O205p501k3474K1376K3771j575n499L2500J2591Q321j9764j3533
4621d728j7183j5961J480J1351J4148Q3k504J0131j3407k2391L1729m161j7603
4608b9016k2356J9413L7392K4772j7417k4352J4247J3779K0124k5489j4974K1868
$$ plain form
4596 17991 24119 11066 4014 -21674 -24458 -22323 -15562 -24086 -7911 5203 -14553 -34437 -55471
4583 -55471 -62646 -36200 -2269 -17519 -20560 -26681 -22715 -26777 -41461 -61687 -56598 -29607 -14925
4570 -14925 -11394 -2167 17793 -11067 -25141 -14896 -28356 -27175 -30426 -33621 -34359 -32385 -27988 -21963
4556 -21963 -818 19449 13960 15650 14882 25806 25842 35537 28924 8644 19944 17430 -18342 -24480
4542 -24480 -38911 -14561 -965 2772 -5038 -16906 -21897 -26880 -10746 10284 1231 -29832 -41107
4529 -41107 -29561 -19172 3664 15064 15694 51643 35812 11473 -1287 -7518 6596 5026 -19654
4516 -19654 -8009 6789 6347 -3961 -178 -27211 -11972 1817 8233 11893 -16897 -9905 1948
4503 1948 -7766 -6062 5038 -9181 -14981 -11157 -17726 -5561 -13878 -11208 -80 10496 854 -5459
$$ packed form
4596A7991O128j3053p052k5688k784K135O761q524J6175J3114j9756j9884k1034
4583e5471p175K6446L3931j5250l041o121L966m062j4684k0226N089K6991J4682
4570a4925L531R227J9960k8860j4074J0245j3460J181l251l195p38J974M397O025
4556b1963K1145K0267n489J690p68J0924L6R695o613k0280J1300k514l5772o138
4542b4480j4431K4350J3596L737p810j1868m991m983J6134K1030r053l1063j1275
4529d1107J1546J0389K2836J1400O30L5949j5831k4339j2760o231J4114j570k4680
4516a9654J1645J4798m42j0308L783k7033J5239J3789O416L660k8790O992J1853
4503A948r714J704J1100j4219n800L824o569J2165q317K670J1128J0576r642o313
$$ plain form
4489 -5459 -7378 -31048 -44881 -21332 21497 29868 11153 19533 14611 8033 8346 -2519 -17376
4476 -17376 -19192 -20470 -23767 -7568 -5974 845 15017 6699 4636 -30319 -24882 13837 14698 2690
4462 2690 -13679 -16007 -10986 -3286 -14130 -17886 -34644 -28581 1598 -12137 -22417 -10101 -30789
$$ packed form
4489e459j919k3670j3833K3549M2829Q371j8715Q380m922o578L13j0865j4857
4476a7376j816j278l297J6199J594O819J4172q318k063l4955N437L8719Q61j2008
4462B690j6369k328N021P700j0844l756j6758O063L0179j3735j0280J2316k0688
$$ [...]
##END NTUPLES=NMR SPECTRUM
##END=
